{
  "@xmlns": "http://schemas.assemblee-nationale.fr/referentiel",
  "uid": "AMANR5L15PO420120B1681P0D1N1213",
  "identifiant": {
    "legislature": "15",
    "numero": "1213",
    "numRect": "0",
    "saisine": {
      "refTexteLegislatif": "PRJLANR5L15B1681",
      "numeroPartiePLF": "0",
      "organeExamen": "PO420120",
      "mentionSecondeDeliberation": "0"
    }
  },
  "numeroLong": "AS1213",
  "etapeTexte": "1ère lecture (1ère assemblée saisie)",
  "triAmendement": "eoaaaaaaaaaaaaaaaaaaaaaaaaaaaaaaaaaaaaaaaaaaaaaaaaeif",
  "cardinaliteAmdtMultiples": "1",
  "amendementParent": {
    "@xmlns:xsi": "http://www.w3.org/2001/XMLSchema-instance",
    "@xsi:nil": "true"
  },
  "etat": "Discuté",
  "signataires": {
    "auteur": {
      "typeAuteur": "Depute",
      "acteurRef": "PA720422",
      "organeRef": {
        "@xmlns:xsi": "http://www.w3.org/2001/XMLSchema-instance",
        "@xsi:nil": "true"
      },
      "groupePolitiqueRef": "PO730958"
    },
    "cosignataires": {
      "acteurRef": [
        "PA720430",
        "PA2150",
        "PA721202",
        "PA722142",
        "PA721210",
        "PA721960",
        "PA719676",
        "PA720846",
        "PA721226",
        "PA719578",
        "PA720422",
        "PA720286",
        "PA718860",
        "PA588884",
        "PA718868",
        "PA720892",
        "PA721062"
      ]
    },
    "texteAffichable": "M.&#160;Quatennens,  Mme&#160;Autain, M.&#160;Bernalicis, M.&#160;Coquerel, M.&#160;Corbi&#232;re, M.&#160;Lachaud, M.&#160;Larive, M.&#160;M&#233;lenchon, Mme&#160;Obono, Mme&#160;Panot, M.&#160;Prud&apos;homme, M.&#160;Ratenon, Mme&#160;Ressiguier, Mme&#160;Rubin, M.&#160;Ruffin, Mme&#160;Taurine et Mme&#160;Fiat"
  },
  "pointeurFragmentTexte": {
    "missionVisee": {
      "@xmlns:xsi": "http://www.w3.org/2001/XMLSchema-instance",
      "@xsi:nil": "true"
    },
    "division": {
      "titre": "Article 13",
      "articleDesignationCourte": "ART. 13",
      "type": "ARTICLE",
      "avant_A_Apres": "A",
      "divisionRattachee": "ARTICLE 13",
      "articleAdditionnel": {
        "@xmlns:xsi": "http://www.w3.org/2001/XMLSchema-instance",
        "@xsi:nil": "true"
      },
      "chapitreAdditionnel": {
        "@xmlns:xsi": "http://www.w3.org/2001/XMLSchema-instance",
        "@xsi:nil": "true"
      },
      "urlDivisionTexteVise": "/15/textes/1681.asp#D_Article_13"
    },
    "alinea": {
      "avant_A_Apres": "Apres",
      "numero": "9",
      "alineaDesignation": {
        "@xmlns:xsi": "http://www.w3.org/2001/XMLSchema-instance",
        "@xsi:nil": "true"
      }
    }
  },
  "corps": {
    "dispositif": "<p style=\"text-align: justify;\">Apr&#232;s l&#8217;alin&#233;a&#160;9, ins&#233;rer l&#8217;alin&#233;a suivant&#160;:</p><p style=\"text-align: justify;\">&#171;&#160;Les activit&#233;s de t&#233;l&#233;soin sont toujours conditionn&#233;es &#224; la r&#233;alisation pr&#233;alable, en pr&#233;sence du patient, d&#8217;un premier soin par un auxiliaire m&#233;dical de la m&#234;me profession que celle du professionnel assurant le t&#233;l&#233;soin.&#160;&#187;</p>",
    "exposeSommaire": "<p style=\"text-align: justify;\">Le pr&#233;sent amendement entend s&#233;curiser le patient susceptible d&#8217;avoir recours au t&#233;l&#233;soin en le conditionnant &#224; la r&#233;alisation pr&#233;alable, en pr&#233;sence dun patient, d&#8217;un premier soin par un auxiliaire m&#233;dical de la m&#234;me profession que celle du professionnel assurant le t&#233;l&#233;soin. En effet, pour la qualit&#233; des soins et pour un bon diagnostic, nous ne pouvons faire l&#8217;impasse d&#8217;une telle pr&#233;sence. Par ailleurs l&#8217;article&#160;13 du pr&#233;sent projet de loi conditionne le financement du t&#233;l&#233;soin par l&#8217;assurance maladie &#224; la r&#233;alisation du premier soin en pr&#233;sence du patient, avant une prise en charge soignante &#224; distance. Nous ne voudrions pas que certains patients soient incit&#233;s &#224; r&#233;aliser leur premier soin &#224; distance par certains praticiens sans &#234;tre mis au courant des modalit&#233;s de remboursement. Les cons&#233;quences pourraient &#234;tre particuli&#232;rement n&#233;fastes puisque ni cette premi&#232;re consultation &#224; distance, ni les suivantes ne seraient alors rembours&#233;es.</p>",
    "annexeExposeSommaire": {
      "@xmlns:xsi": "http://www.w3.org/2001/XMLSchema-instance",
      "@xsi:nil": "true"
    },
    "cartoucheDelaiDepotDepasse": {
      "@xmlns:xsi": "http://www.w3.org/2001/XMLSchema-instance",
      "@xsi:nil": "true"
    }
  },
  "representations": {
    "representation": {
      "nom": "PDF",
      "typeMime": {
        "type": "application",
        "subType": "PDF"
      },
      "statutRepresentation": {
        "verbatim": "true",
        "canonique": "true",
        "officielle": "true",
        "transcription": "false",
        "enregistrement": "false"
      },
      "repSource": {
        "@xmlns:xsi": "http://www.w3.org/2001/XMLSchema-instance",
        "@xsi:nil": "true"
      },
      "offset": {
        "@xmlns:xsi": "http://www.w3.org/2001/XMLSchema-instance",
        "@xsi:nil": "true"
      },
      "contenu": {
        "documentURI": "/15/amendements/1681/CION-SOC/AS1213.pdf"
      },
      "dateDispoRepresentation": {
        "@xmlns:xsi": "http://www.w3.org/2001/XMLSchema-instance",
        "@xsi:nil": "true"
      }
    }
  },
  "seanceDiscussion": {
    "@xmlns:xsi": "http://www.w3.org/2001/XMLSchema-instance",
    "@xsi:nil": "true"
  },
  "sort": {
    "dateSaisie": "2019-03-14T12:00:07.000+01:00",
    "sortEnSeance": "Retiré"
  },
  "dateDepot": "2019-03-08T01:00:00.000+01:00",
  "dateDistribution": "2019-03-12T01:00:00.000+01:00",
  "article99": "0",
  "loiReference": {
    "codeLoi": {
      "@xmlns:xsi": "http://www.w3.org/2001/XMLSchema-instance",
      "@xsi:nil": "true"
    },
    "divisionCodeLoi": {
      "@xmlns:xsi": "http://www.w3.org/2001/XMLSchema-instance",
      "@xsi:nil": "true"
    }
  }
}