{
  "@xmlns": "http://schemas.assemblee-nationale.fr/referentiel",
  "uid": "AMANR5L15SEA717460BTC0174P0D1N150",
  "identifiant": {
    "legislature": "15",
    "numero": "150",
    "numRect": "0",
    "saisine": {
      "refTexteLegislatif": "PRJLANR5L15BTC0174",
      "numeroPartiePLF": "0",
      "organeExamen": "PO717460",
      "mentionSecondeDeliberation": "0"
    }
  },
  "numeroLong": "150",
  "etapeTexte": "1ère lecture (1ère assemblée saisie)",
  "triAmendement": "hs",
  "cardinaliteAmdtMultiples": "1",
  "amendementParent": {
    "@xmlns:xsi": "http://www.w3.org/2001/XMLSchema-instance",
    "@xsi:nil": "true"
  },
  "etat": "Discuté",
  "signataires": {
    "auteur": {
      "typeAuteur": "Depute",
      "acteurRef": "PA720892",
      "organeRef": {
        "@xmlns:xsi": "http://www.w3.org/2001/XMLSchema-instance",
        "@xsi:nil": "true"
      },
      "groupePolitiqueRef": "PO730958"
    },
    "cosignataires": {
      "acteurRef": [
        "PA721202",
        "PA720430",
        "PA720846",
        "PA2150",
        "PA588884",
        "PA720422",
        "PA719676",
        "PA721062",
        "PA721210",
        "PA720892",
        "PA722142",
        "PA718860",
        "PA718868",
        "PA721226",
        "PA721960",
        "PA720286",
        "PA719578"
      ]
    },
    "texteAffichable": "Mme&#160;Panot,  Mme&#160;Autain, Mme&#160;Taurine, M.&#160;Ruffin, M.&#160;Bernalicis, M.&#160;M&#233;lenchon, Mme&#160;Obono, M.&#160;Prud&apos;homme, M.&#160;Quatennens, M.&#160;Ratenon, Mme&#160;Ressiguier, Mme&#160;Rubin, M.&#160;Coquerel, M.&#160;Corbi&#232;re, Mme&#160;Fiat, M.&#160;Lachaud et M.&#160;Larive"
  },
  "pointeurFragmentTexte": {
    "missionVisee": {
      "@xmlns:xsi": "http://www.w3.org/2001/XMLSchema-instance",
      "@xsi:nil": "true"
    },
    "division": {
      "titre": "Article PREMIER",
      "articleDesignationCourte": "ART. PREMIER",
      "type": "ARTICLE",
      "avant_A_Apres": "A",
      "divisionRattachee": "ARTICLE PREMIER",
      "articleAdditionnel": {
        "@xmlns:xsi": "http://www.w3.org/2001/XMLSchema-instance",
        "@xsi:nil": "true"
      },
      "chapitreAdditionnel": {
        "@xmlns:xsi": "http://www.w3.org/2001/XMLSchema-instance",
        "@xsi:nil": "true"
      },
      "urlDivisionTexteVise": "/15/textes/0174.asp#D_Article_1er"
    },
    "alinea": {
      "avant_A_Apres": "Apres",
      "numero": "11",
      "alineaDesignation": {
        "@xmlns:xsi": "http://www.w3.org/2001/XMLSchema-instance",
        "@xsi:nil": "true"
      }
    }
  },
  "corps": {
    "dispositif": "<p style=\"text-align: justify;\">Apr&#232;s l&#8217;alin&#233;a&#160;11, ins&#233;rer l&#8217;alin&#233;a suivant&#160;:</p><p style=\"text-align: justify;\">&#171;&#160;De m&#234;me, l&#8217;exploration et l&#8217;exploitation des mines d&#8217;hydrocarbures liquides ou gazeux par des forages traversant une nappe d&#8217;eau potable souterraine fossile ou captive sont interdites sur le territoire national ou dans les territoires relevant de la juridiction de la R&#233;publique Fran&#231;aise.&#160;&#187;</p>",
    "exposeSommaire": "<p style=\"text-align: justify;\">Nous consid&#233;rons que ces activit&#233;s d&#8217;exploration et d&#8217;extraction des hydrocarbures sont &#233;galement causes potentielle de pollutions des nappes d&#8217;eau potable souterraines et partageons les inqui&#233;tudes des associations et collectifs citoyens engag&#233;s de longue date sur ces questions. Le pr&#233;sent amendement vis<span  data-cid=\"2\" data-userid=\"2404\" data-username=\"Manon Dervin\" data-time=\"1506696838539\">e</span> &#224; renforcer la l&#233;gislation existante dans ce domaine.</p>",
    "annexeExposeSommaire": {
      "@xmlns:xsi": "http://www.w3.org/2001/XMLSchema-instance",
      "@xsi:nil": "true"
    }
  },
  "representations": {
    "representation": {
      "nom": "PDF",
      "typeMime": {
        "type": "application",
        "subType": "PDF"
      },
      "statutRepresentation": {
        "verbatim": "true",
        "canonique": "true",
        "officielle": "true",
        "transcription": "false",
        "enregistrement": "false"
      },
      "repSource": {
        "@xmlns:xsi": "http://www.w3.org/2001/XMLSchema-instance",
        "@xsi:nil": "true"
      },
      "offset": {
        "@xmlns:xsi": "http://www.w3.org/2001/XMLSchema-instance",
        "@xsi:nil": "true"
      },
      "contenu": {
        "documentURI": "/15/amendements/0174/AN/150.pdf"
      },
      "dateDispoRepresentation": {
        "@xmlns:xsi": "http://www.w3.org/2001/XMLSchema-instance",
        "@xsi:nil": "true"
      }
    }
  },
  "seanceDiscussion": "RUANR5L15S2018IDS20679",
  "sort": {
    "dateSaisie": "2017-10-04T17:16:43.000+02:00",
    "sortEnSeance": "Rejeté"
  },
  "dateDepot": "2017-09-29T02:00:00.000+02:00",
  "dateDistribution": "2017-10-02T02:00:00.000+02:00",
  "article99": "0",
  "loiReference": {
    "codeLoi": {
      "@xmlns:xsi": "http://www.w3.org/2001/XMLSchema-instance",
      "@xsi:nil": "true"
    },
    "divisionCodeLoi": {
      "@xmlns:xsi": "http://www.w3.org/2001/XMLSchema-instance",
      "@xsi:nil": "true"
    }
  }
}