{
  "@xmlns": "http://schemas.assemblee-nationale.fr/referentiel",
  "uid": "AMANR5L15SEA717460B1297P0D1N1159",
  "identifiant": {
    "legislature": "15",
    "numero": "1159",
    "numRect": "0",
    "saisine": {
      "refTexteLegislatif": "PRJLANR5L15B1297",
      "numeroPartiePLF": "0",
      "organeExamen": "PO717460",
      "mentionSecondeDeliberation": "0"
    }
  },
  "numeroLong": "1159",
  "etapeTexte": "1ère lecture (1ère assemblée saisie)",
  "triAmendement": "epaaaaaaaaaaaaaaaaaaaaaaaaaaaaaaaaaaaaaaaaaaaaaaaaaopo",
  "cardinaliteAmdtMultiples": "1",
  "amendementParent": {
    "@xmlns:xsi": "http://www.w3.org/2001/XMLSchema-instance",
    "@xsi:nil": "true"
  },
  "etat": "Discuté",
  "signataires": {
    "auteur": {
      "typeAuteur": "Depute",
      "acteurRef": "PA267585",
      "organeRef": {
        "@xmlns:xsi": "http://www.w3.org/2001/XMLSchema-instance",
        "@xsi:nil": "true"
      },
      "groupePolitiqueRef": "PO744425"
    },
    "cosignataires": {
      "acteurRef": [
        "PA695100",
        "PA722030",
        "PA642868",
        "PA332228",
        "PA267330",
        "PA266788",
        "PA720696",
        "PA268019",
        "PA721486",
        "PA1960",
        "PA267355",
        "PA267766",
        "PA267241",
        "PA702052",
        "PA267585",
        "PA267780",
        "PA642935",
        "PA712014",
        "PA721110",
        "PA719806",
        "PA720230"
      ]
    },
    "texteAffichable": "M.&#160;Vercamer,  Mme&#160;Auconie, M.&#160;Becht, M.&#160;Benoit, M.&#160;Bournazel, M.&#160;Guy&#160;Bricout, M.&#160;Christophe, M.&#160;Demilly, Mme&#160;Descamps, Mme&#160;Firmin Le Bodo, M.&#160;Meyer&#160;Habib, M.&#160;Herth, M.&#160;Lagarde, M.&#160;Ledoux, M.&#160;Leroy, Mme&#160;Magnier, M.&#160;Morel-&#192;-L&apos;Huissier, M.&#160;Naegelen, Mme&#160;Sage, Mme&#160;Sanquer et M.&#160;Zumkeller"
  },
  "pointeurFragmentTexte": {
    "missionVisee": {
      "@xmlns:xsi": "http://www.w3.org/2001/XMLSchema-instance",
      "@xsi:nil": "true"
    },
    "division": {
      "titre": "Article 29",
      "articleDesignationCourte": "APRÈS ART. 29",
      "type": "ARTICLE",
      "avant_A_Apres": "Après",
      "divisionRattachee": "APRÈS L'ARTICLE 29, insérer l'article suivant:",
      "articleAdditionnel": "1",
      "chapitreAdditionnel": {
        "@xmlns:xsi": "http://www.w3.org/2001/XMLSchema-instance",
        "@xsi:nil": "true"
      },
      "urlDivisionTexteVise": "/15/textes/1297.asp#D_Article_29"
    },
    "alinea": {
      "@xmlns:xsi": "http://www.w3.org/2001/XMLSchema-instance",
      "@xsi:nil": "true"
    }
  },
  "corps": {
    "dispositif": "<p style=\"text-align: justify;\">&#192; la derni&#232;re phrase du dernier alin&#233;a de l'article L.&#160;1435-10 du code de la sant&#233; publique, apr&#232;s le mots&#160;: &#171;&#160;notamment&#160;&#187; sont ins&#233;r&#233;s les mots&#160;: &#171;&#160;une &#233;valuation nationale de la r&#233;partition des cr&#233;dits et de leur impact sur les situations sanitaires r&#233;gionales&#160;&#187;.</p>",
    "exposeSommaire": "<p style=\"text-align: justify;\">Par respect du principe de transparence, il est demand&#233; aux ARS de justifier de l&#8217;utilisation des financements publics devant le Parlement et les citoyens.</p><p style=\"text-align: justify;\">Cet amendement vise donc &#224; inclure dans le bilan annuel de suivi de l&#8217;utilisation des dotations affect&#233;es au fond d&#8217;intervention r&#233;gional, une &#233;valuation nationale de l&#8217;impact de la r&#233;partition des financements sur la situation sanitaire, en tenant compte de l&#8217;effet produit sur les besoins recens&#233;s dans les territoires.</p>",
    "annexeExposeSommaire": {
      "@xmlns:xsi": "http://www.w3.org/2001/XMLSchema-instance",
      "@xsi:nil": "true"
    }
  },
  "representations": {
    "representation": {
      "nom": "PDF",
      "typeMime": {
        "type": "application",
        "subType": "PDF"
      },
      "statutRepresentation": {
        "verbatim": "true",
        "canonique": "true",
        "officielle": "true",
        "transcription": "false",
        "enregistrement": "false"
      },
      "repSource": {
        "@xmlns:xsi": "http://www.w3.org/2001/XMLSchema-instance",
        "@xsi:nil": "true"
      },
      "offset": {
        "@xmlns:xsi": "http://www.w3.org/2001/XMLSchema-instance",
        "@xsi:nil": "true"
      },
      "contenu": {
        "documentURI": "/15/amendements/1297/AN/1159.pdf"
      },
      "dateDispoRepresentation": {
        "@xmlns:xsi": "http://www.w3.org/2001/XMLSchema-instance",
        "@xsi:nil": "true"
      }
    }
  },
  "seanceDiscussion": "RUANR5L15S2019IDS21294",
  "sort": {
    "dateSaisie": "2018-10-26T15:40:47.000+02:00",
    "sortEnSeance": "Rejeté"
  },
  "dateDepot": "2018-10-19T02:00:00.000+02:00",
  "dateDistribution": "2018-10-22T02:00:00.000+02:00",
  "article99": "0",
  "loiReference": {
    "codeLoi": "c santé publique",
    "divisionCodeLoi": "L1435-10"
  }
}