{
  "@xmlns": "http://schemas.assemblee-nationale.fr/referentiel",
  "uid": "AMANR5L15PO59051B0675P0D1N28",
  "identifiant": {
    "legislature": "15",
    "numero": "28",
    "numRect": "0",
    "saisine": {
      "refTexteLegislatif": "PIONANR5L15B0675",
      "numeroPartiePLF": "0",
      "organeExamen": "PO59051",
      "mentionSecondeDeliberation": "0"
    }
  },
  "numeroLong": "CL28",
  "etapeTexte": "1ère lecture (1ère assemblée saisie)",
  "triAmendement": "i",
  "cardinaliteAmdtMultiples": "1",
  "amendementParent": {
    "@xmlns:xsi": "http://www.w3.org/2001/XMLSchema-instance",
    "@xsi:nil": "true"
  },
  "etat": "A discuter",
  "signataires": {
    "auteur": {
      "typeAuteur": "Depute",
      "acteurRef": "PA721094",
      "organeRef": {
        "@xmlns:xsi": "http://www.w3.org/2001/XMLSchema-instance",
        "@xsi:nil": "true"
      },
      "groupePolitiqueRef": "PO744425"
    },
    "cosignataires": {
      "acteurRef": [
        "PA610775",
        "PA721094"
      ]
    },
    "texteAffichable": "M.&#160;Dunoyer et M.&#160;Gom&#232;s"
  },
  "pointeurFragmentTexte": {
    "missionVisee": {
      "@xmlns:xsi": "http://www.w3.org/2001/XMLSchema-instance",
      "@xsi:nil": "true"
    },
    "division": {
      "titre": "Article 2",
      "articleDesignationCourte": "ART. 2",
      "type": "ARTICLE",
      "avant_A_Apres": "A",
      "divisionRattachee": "ARTICLE 2",
      "articleAdditionnel": {
        "@xmlns:xsi": "http://www.w3.org/2001/XMLSchema-instance",
        "@xsi:nil": "true"
      },
      "chapitreAdditionnel": {
        "@xmlns:xsi": "http://www.w3.org/2001/XMLSchema-instance",
        "@xsi:nil": "true"
      },
      "urlDivisionTexteVise": "/15/textes/0675.asp#D_Article_2"
    },
    "alinea": {
      "avant_A_Apres": "A",
      "numero": "1",
      "alineaDesignation": "Alinéa 1"
    }
  },
  "corps": {
    "dispositif": "<p style=\"text-align: justify;\">Substituer &#224; l&#8217;alin&#233;a&#160;1 les quatre alin&#233;as suivants&#160;:</p><p style=\"text-align: justify;\">&#171;&#160;Le livre&#160;IX du code de commerce est ainsi modifi&#233;&#160;:</p><p style=\"text-align: justify;\">&#171;&#160;1&#176;&#160;Apr&#232;s deuxi&#232;me alin&#233;a de l&#8217;article L.&#160;930&#8209;1, il est ins&#233;r&#233; un alin&#233;a ainsi r&#233;dig&#233;&#160;:</p><p style=\"text-align: justify;\">&#171;&#160;&#171;&#160;L&#8217;article L.&#160;151&#8209;6 est applicable dans la r&#233;daction r&#233;sultant de la loi n&#176;&#160;&#160;&#160;&#160;&#160; du&#160;&#160;&#160;&#160;&#160;&#160; portant transposition de la directive du Parlement&#160;europ&#233;en et du Conseil sur la protection des savoir-faire et des informations commerciales non divulgu&#233;es contre l&#8217;obtention, l&#8217;utilisation et la divulgation illicites.&#160;&#187;</p><p style=\"text-align: justify;\">&#171;&#160;2&#176;&#160;Apr&#232;s le quatri&#232;me alin&#233;a de l&#8217;article L.&#160;950&#8209;1, il est ins&#233;r&#233; un alin&#233;a ainsi r&#233;dig&#233;&#160;:&#160;&#187;</p>",
    "exposeSommaire": "<p style=\"text-align: justify;\">La section 4 de l&#8217;article 1 de la pr&#233;sente proposition de loi pr&#233;voit des cas de d&#233;rogation &#224; la protection du secret des affaires. Ces d&#233;rogations sont n&#233;cessaires pour, notamment, garantir le respect des droits fondamentaux&#160;: droit &#224; la libert&#233; d&#8217;expression et de communication, protection de l&#8217;int&#233;r&#234;t public g&#233;n&#233;ral, libert&#233; de la presse ou encore protection d&#8217;un int&#233;r&#234;t l&#233;gitime reconnu par le droit de l&#8217;Union ou le droit national (ordre public, s&#233;curit&#233; publique, sant&#233; publique&#8230;).</p><p style=\"text-align: justify;\">La proposition de loi ne pr&#233;voit pas express&#233;ment une application de cette disposition &#224; la Nouvelle-Cal&#233;donie. L&#8217;absence de d&#233;rogations pourrait constituer une menace aux droits fondamentaux, que sont notamment la libert&#233; de la presse.</p><p style=\"text-align: justify;\">Il est donc propos&#233;, par cet amendement, d&#8217;ins&#233;rer &#224; l&#8217;article L. 930-1 du code de commerce, qui concerne les dispositions applicables en Nouvelle-Cal&#233;donie, le nouvel article L. 151-6 relatif aux d&#233;rogations &#224; la protection du secret des affaires.</p><p>&#160;</p>",
    "annexeExposeSommaire": {
      "@xmlns:xsi": "http://www.w3.org/2001/XMLSchema-instance",
      "@xsi:nil": "true"
    }
  },
  "representations": {
    "representation": {
      "nom": "PDF",
      "typeMime": {
        "type": "application",
        "subType": "PDF"
      },
      "statutRepresentation": {
        "verbatim": "true",
        "canonique": "true",
        "officielle": "true",
        "transcription": "false",
        "enregistrement": "false"
      },
      "repSource": {
        "@xmlns:xsi": "http://www.w3.org/2001/XMLSchema-instance",
        "@xsi:nil": "true"
      },
      "offset": {
        "@xmlns:xsi": "http://www.w3.org/2001/XMLSchema-instance",
        "@xsi:nil": "true"
      },
      "contenu": {
        "documentURI": "/15/amendements/0675/CION_LOIS/CL28.pdf"
      },
      "dateDispoRepresentation": {
        "@xmlns:xsi": "http://www.w3.org/2001/XMLSchema-instance",
        "@xsi:nil": "true"
      }
    }
  },
  "seanceDiscussion": {
    "@xmlns:xsi": "http://www.w3.org/2001/XMLSchema-instance",
    "@xsi:nil": "true"
  },
  "sort": {
    "@xmlns:xsi": "http://www.w3.org/2001/XMLSchema-instance",
    "@xsi:nil": "true"
  },
  "dateDepot": "2018-03-16T01:00:00.000+01:00",
  "dateDistribution": "2018-03-19T01:00:00.000+01:00",
  "article99": "0",
  "loiReference": {
    "codeLoi": {
      "@xmlns:xsi": "http://www.w3.org/2001/XMLSchema-instance",
      "@xsi:nil": "true"
    },
    "divisionCodeLoi": {
      "@xmlns:xsi": "http://www.w3.org/2001/XMLSchema-instance",
      "@xsi:nil": "true"
    }
  }
}