{
  "@xmlns": "http://schemas.assemblee-nationale.fr/referentiel",
  "uid": "AMANR5L15SEA717460BTC1396P0D1N779",
  "identifiant": {
    "legislature": "15",
    "numero": "779",
    "numRect": "0",
    "saisine": {
      "refTexteLegislatif": "PRJLANR5L15BTC1396",
      "numeroPartiePLF": "0",
      "organeExamen": "PO717460",
      "mentionSecondeDeliberation": "0"
    }
  },
  "numeroLong": "779",
  "etapeTexte": "1ère lecture (2ème assemblée saisie)",
  "triAmendement": "lfaaaaaaaaaaaaaaaaaaaaaaaaaaaaaaaaaaaaaaaaaaaaaaaaej",
  "cardinaliteAmdtMultiples": "1",
  "amendementParent": {
    "@xmlns:xsi": "http://www.w3.org/2001/XMLSchema-instance",
    "@xsi:nil": "true"
  },
  "etat": "Retiré",
  "signataires": {
    "auteur": {
      "typeAuteur": "Depute",
      "acteurRef": "PA719570",
      "organeRef": {
        "@xmlns:xsi": "http://www.w3.org/2001/XMLSchema-instance",
        "@xsi:nil": "true"
      },
      "groupePolitiqueRef": "PO730964"
    },
    "cosignataires": {
      "acteurRef": [
        "PA719570",
        "PA719186"
      ]
    },
    "texteAffichable": "Mme&#160;Fabre et Mme&#160;Khattabi"
  },
  "pointeurFragmentTexte": {
    "missionVisee": {
      "@xmlns:xsi": "http://www.w3.org/2001/XMLSchema-instance",
      "@xsi:nil": "true"
    },
    "division": {
      "titre": "Article 51 ter",
      "articleDesignationCourte": "APRÈS ART. 51 TER",
      "type": "ARTICLE",
      "avant_A_Apres": "Après",
      "divisionRattachee": "APRÈS L'ARTICLE 51 TER, insérer l'article suivant:",
      "articleAdditionnel": "1",
      "chapitreAdditionnel": {
        "@xmlns:xsi": "http://www.w3.org/2001/XMLSchema-instance",
        "@xsi:nil": "true"
      },
      "urlDivisionTexteVise": "/15/textes/1396.asp#D_Articles_51_bis_et_51_ter"
    },
    "alinea": {
      "@xmlns:xsi": "http://www.w3.org/2001/XMLSchema-instance",
      "@xsi:nil": "true"
    }
  },
  "corps": {
    "dispositif": "<p style=\"text-align: justify;\">Titre V <i>ter</i> Conditions de r&#233;insertion des d&#233;tenus&#160;&#187;.</p><p style=\"text-align: justify;\">Article</p><p style=\"text-align: justify;\">L&#8217;article&#160;28 de la loi n&#176; 2009&#8209;1436 du 24 novembre 2009 p&#233;nitentiaire est compl&#233;t&#233; par un alin&#233;a ainsi r&#233;dig&#233;&#160;:</p><p style=\"text-align: justify;\">&#171;&#160;Lorsqu&#8217;il s&#8217;agit de formations, les activit&#233;s sont par d&#233;faut organis&#233;es de fa&#231;on mixte. Tout refus doit &#234;tre motiv&#233; par le directeur d&#8217;&#233;tablissement.&#160;&#187;</p>",
    "exposeSommaire": "<p style=\"text-align: justify;\">Cet amendement a pour objectif de poser le principe de la mixit&#233; des formations en prison. Lorsqu&#8217;il s&#8217;agit de formations, il doit &#234;tre d&#233;rog&#233; au principe de non- mixit&#233;, les refus devant &#234;tre motiv&#233;s par la direction de l&#8217;&#233;tablissement. Dans ce cas, il faudrait au minimum que les femmes puissent utiliser les locaux et les &#233;quipements de formation &#224; certains horaires qui leur seraient r&#233;serv&#233;s.</p><p style=\"text-align: justify;\">Les femmes sont extr&#234;mement minoritaires en d&#233;tention. Elles ne repr&#233;sentent que 3,5&#160;% de la population carc&#233;rale au 1<sup>er</sup> janvier 2018. Mais elles sont jeunes -une sur quatre a moins de 25 ans et une sur deux moins de 30 ans, peu qualifi&#233;.e.s, alors qu&#8217;une formation professionnelle serait essentielle &#224; leur r&#233;insertion, d&#8217;autant plus qu&#8217;elles sont tr&#232;s souvent isol&#233;es.</p><p style=\"text-align: justify;\">Le rapport de Catherine Smadja-Froguel, intitul&#233; &#171;&#160;Faire d&#8217;un syst&#232;me r&#233;nov&#233; de formation professionnelle un outil majeur d&#8217;&#233;galit&#233; au travail entre les femmes et les hommes&#160;&#187;&#160;pr&#233;sente ces difficult&#233;s que rencontrent les femmes d&#233;tenues en raison de possibilit&#233;s moindres en quantit&#233; et en diversit&#233;. Ce constat n&#8217;est d&#8217;ailleurs pas limit&#233; aux petits &#233;tablissements. Par exemple, au Centre de D&#233;tention de Bapaume o&#249; sont incarc&#233;r&#233;.e.s cent femmes et cinq cents hommes, une seule formation est propos&#233;e aux femmes, une &#171;&#160;entreprise p&#233;dagogique virtuelle&#160;&#187; alors qu&#8217;il y en a quatre pour les hommes&#160;: peinture, t&#233;l&#233;-conseil, cuisine et bureautique auxquelles ces derni&#232;res pourraient tout &#224; fait aspirer. La non-mixit&#233; oblige &#233;galement &#224; organiser, avec des horaires d&#233;cal&#233;s, donc avec un co&#251;t sup&#233;rieur, des activit&#233;s comme la formation au permis de conduire pour que les femmes comme les hommes puissent en b&#233;n&#233;ficier. S&#8217;y ajoute le fait que les formations propos&#233;es aux femmes restent trop souvent fond&#233;es sur des st&#233;r&#233;otypes. Le Centre de d&#233;tention de Rennes propose ainsi des formations, certes ax&#233;es sur la r&#233;insertion, mais qui se r&#233;sument, en plus des ateliers p&#233;dagogiques, &#224; une formation d&#8217;agents de restauration, une autre d&#8217;agents de propret&#233; et une troisi&#232;me de bureautique.</p><p style=\"text-align: justify;\">L&#8217;article&#160;28 de la loi p&#233;nitentiaire dispose que &#171;&#160;sous r&#233;serve du maintien du bon ordre et de la s&#233;curit&#233; des &#233;tablissements, et &#224; titre d&#233;rogatoire, des activit&#233;s peuvent &#234;tre organis&#233;es de fa&#231;on mixte.&#160;&#187; De fait, les d&#233;rogations sont extr&#234;mement rares&#160;; pourtant lorsqu&#8217;elles existent, cela fonctionne, comme &#224; la maison d&#8217;arr&#234;t de Nantes. Le manque de personnel pour organiser les transferts entre des b&#226;timents diff&#233;rents est souvent la raison invoqu&#233;e, et sans doute r&#233;elle. Mais cela ne peut expliquer la difficult&#233; d&#8217;acc&#232;s &#224; des formations en ligne ou &#224; des manuels scolaires et universitaires.</p><p style=\"text-align: justify;\">Le renversement du principe de non-mixit&#233; se doit d&#8217;&#234;tre d&#8217;ordre l&#233;gislatif, en raison d&#8217;une part, de l&#8217;importance qu&#8217;il rev&#234;t dans l&#8217;accompagnement, la formation et la r&#233;insertion des femmes incarc&#233;r&#233;es et d&#8217;autre part afin de garantir une application rapide et effective.</p>",
    "annexeExposeSommaire": {
      "@xmlns:xsi": "http://www.w3.org/2001/XMLSchema-instance",
      "@xsi:nil": "true"
    },
    "cartoucheDelaiDepotDepasse": {
      "@xmlns:xsi": "http://www.w3.org/2001/XMLSchema-instance",
      "@xsi:nil": "true"
    }
  },
  "representations": {
    "representation": {
      "nom": "PDF",
      "typeMime": {
        "type": "application",
        "subType": "PDF"
      },
      "statutRepresentation": {
        "verbatim": "true",
        "canonique": "true",
        "officielle": "true",
        "transcription": "false",
        "enregistrement": "false"
      },
      "repSource": {
        "@xmlns:xsi": "http://www.w3.org/2001/XMLSchema-instance",
        "@xsi:nil": "true"
      },
      "offset": {
        "@xmlns:xsi": "http://www.w3.org/2001/XMLSchema-instance",
        "@xsi:nil": "true"
      },
      "contenu": {
        "documentURI": "/15/amendements/1396/AN/779.pdf"
      },
      "dateDispoRepresentation": {
        "@xmlns:xsi": "http://www.w3.org/2001/XMLSchema-instance",
        "@xsi:nil": "true"
      }
    }
  },
  "seanceDiscussion": {
    "@xmlns:xsi": "http://www.w3.org/2001/XMLSchema-instance",
    "@xsi:nil": "true"
  },
  "sort": {
    "@xmlns:xsi": "http://www.w3.org/2001/XMLSchema-instance",
    "@xsi:nil": "true"
  },
  "dateDepot": "2018-11-15T01:00:00.000+01:00",
  "dateDistribution": "2018-11-23T01:00:00.000+01:00",
  "article99": "0",
  "loiReference": {
    "codeLoi": "loi 2009-1436",
    "divisionCodeLoi": "28"
  }
}