{
  "@xmlns": "http://schemas.assemblee-nationale.fr/referentiel",
  "uid": "AMANR5L15SEA717460BTC0106P0D1N581",
  "identifiant": {
    "legislature": "15",
    "numero": "581",
    "numRect": "0",
    "saisine": {
      "refTexteLegislatif": "PRJLANR5L15BTC0106",
      "numeroPartiePLF": "0",
      "organeExamen": "PO717460",
      "mentionSecondeDeliberation": "0"
    }
  },
  "numeroLong": "581",
  "etapeTexte": "1ère lecture (2ème assemblée saisie)",
  "triAmendement": "z",
  "cardinaliteAmdtMultiples": "1",
  "amendementParent": {
    "@xmlns:xsi": "http://www.w3.org/2001/XMLSchema-instance",
    "@xsi:nil": "true"
  },
  "etat": "Discuté",
  "signataires": {
    "auteur": {
      "typeAuteur": "Depute",
      "acteurRef": "PA721142",
      "organeRef": {
        "@xmlns:xsi": "http://www.w3.org/2001/XMLSchema-instance",
        "@xsi:nil": "true"
      },
      "groupePolitiqueRef": "PO730964"
    },
    "cosignataires": {
      "acteurRef": [
        "PA606171",
        "PA721142",
        "PA720908"
      ]
    },
    "texteAffichable": "Mme&#160;Forteza,  Mme&#160;Moutchou, M.&#160;Ferrand et les membres du groupe La R&#233;publique en Marche"
  },
  "pointeurFragmentTexte": {
    "missionVisee": {
      "@xmlns:xsi": "http://www.w3.org/2001/XMLSchema-instance",
      "@xsi:nil": "true"
    },
    "division": {
      "titre": "Article 2 quater",
      "articleDesignationCourte": "ART. 2 QUATER",
      "type": "ARTICLE",
      "avant_A_Apres": "A",
      "divisionRattachee": "ARTICLE 2 QUATER",
      "articleAdditionnel": {
        "@xmlns:xsi": "http://www.w3.org/2001/XMLSchema-instance",
        "@xsi:nil": "true"
      },
      "chapitreAdditionnel": {
        "@xmlns:xsi": "http://www.w3.org/2001/XMLSchema-instance",
        "@xsi:nil": "true"
      },
      "urlDivisionTexteVise": "/15/textes/0106.asp#D_Article_2_quater"
    },
    "alinea": {
      "avant_A_Apres": "Apres",
      "numero": "4",
      "alineaDesignation": {
        "@xmlns:xsi": "http://www.w3.org/2001/XMLSchema-instance",
        "@xsi:nil": "true"
      }
    }
  },
  "corps": {
    "dispositif": "<p style=\"text-align: justify;\">Apr&#232;s l&#8217;alin&#233;a&#160;4, ins&#233;rer l&#8217;alin&#233;a suivant&#160;:</p><p style=\"text-align: justify;\">&#171;&#160;<i>c</i>) &#192; la m&#234;me phrase, le mot&#160;: &#171;&#160;soixante&#160;&#187; est remplac&#233; par le mot&#160;: &#171;&#160;trente&#160;&#187;.</p>",
    "exposeSommaire": "<p style=\"text-align: justify;\">Cet amendement vise &#224; renforcer l&#8217;ind&#233;pendance et l&#8217;efficacit&#233; de la&#160;Haute Autorit&#233; pour la transparence de la vie publique.&#160;Il&#160;unifie les&#160;d&#233;lais de&#160;transmission d&#8217;information en les clarifiant tel que pr&#233;vu &#224; l&#8217;article 6 de loi&#160;d&#8217;octobre 2013.&#160;Il porte ainsi &#224; 30 jours (au lieu de 60) les d&#233;lais dans lesquels les informations demand&#233;es par la Haute Autorit&#233; lui sont transmises afin de permettre un examen plus rapide des d&#233;clarations de patrimoine et d&#8217;int&#233;r&#234;ts ce qui unifie les&#160;d&#233;lais de&#160;transmission pr&#233;vu au pr&#233;sent article.&#160;Il permet &#233;galement &#224; toutes les administrations publiques de rendre la Haute Autorit&#233; destinataire de&#160;signalement utile sans se limiter aux&#160;juridictions judiciaires et financi&#232;res qui ont d&#8217;ailleurs d&#233;j&#224; pr&#233;vues des modalit&#233;s propres de transmission de signalement (d&#233;p&#234;ches et&#160;instruction du Procureur G&#233;n&#233;ral).</p>",
    "annexeExposeSommaire": {
      "@xmlns:xsi": "http://www.w3.org/2001/XMLSchema-instance",
      "@xsi:nil": "true"
    }
  },
  "representations": {
    "representation": {
      "nom": "PDF",
      "typeMime": {
        "type": "application",
        "subType": "PDF"
      },
      "statutRepresentation": {
        "verbatim": "true",
        "canonique": "true",
        "officielle": "true",
        "transcription": "false",
        "enregistrement": "false"
      },
      "repSource": {
        "@xmlns:xsi": "http://www.w3.org/2001/XMLSchema-instance",
        "@xsi:nil": "true"
      },
      "offset": {
        "@xmlns:xsi": "http://www.w3.org/2001/XMLSchema-instance",
        "@xsi:nil": "true"
      },
      "contenu": {
        "documentURI": "/15/amendements/0106/AN/581.pdf"
      },
      "dateDispoRepresentation": {
        "@xmlns:xsi": "http://www.w3.org/2001/XMLSchema-instance",
        "@xsi:nil": "true"
      }
    }
  },
  "seanceDiscussion": "RUANR5L15S2017IDS20630",
  "sort": {
    "dateSaisie": "2017-07-26T21:49:24.000+02:00",
    "sortEnSeance": "Adopté"
  },
  "dateDepot": "2017-07-21T02:00:00.000+02:00",
  "dateDistribution": "2017-07-22T02:00:00.000+02:00",
  "article99": "0",
  "loiReference": {
    "codeLoi": {
      "@xmlns:xsi": "http://www.w3.org/2001/XMLSchema-instance",
      "@xsi:nil": "true"
    },
    "divisionCodeLoi": {
      "@xmlns:xsi": "http://www.w3.org/2001/XMLSchema-instance",
      "@xsi:nil": "true"
    }
  }
}