{
  "@xmlns": "http://schemas.assemblee-nationale.fr/referentiel",
  "uid": "AMANR5L15PO59046B0659P0D1N226",
  "identifiant": {
    "legislature": "15",
    "numero": "226",
    "numRect": "0",
    "saisine": {
      "refTexteLegislatif": "PRJLANR5L15B0659",
      "numeroPartiePLF": "0",
      "organeExamen": "PO59046",
      "mentionSecondeDeliberation": "0"
    }
  },
  "numeroLong": "DN226",
  "etapeTexte": "1ère lecture (1ère assemblée saisie)",
  "triAmendement": "d",
  "cardinaliteAmdtMultiples": "1",
  "amendementParent": {
    "@xmlns:xsi": "http://www.w3.org/2001/XMLSchema-instance",
    "@xsi:nil": "true"
  },
  "etat": "Discuté",
  "signataires": {
    "auteur": {
      "typeAuteur": "Depute",
      "acteurRef": "PA720846",
      "organeRef": {
        "@xmlns:xsi": "http://www.w3.org/2001/XMLSchema-instance",
        "@xsi:nil": "true"
      },
      "groupePolitiqueRef": "PO730958"
    },
    "cosignataires": {
      "acteurRef": [
        "PA720430",
        "PA721210",
        "PA720846",
        "PA2150",
        "PA721202",
        "PA721062",
        "PA721960",
        "PA722142",
        "PA720286",
        "PA720422",
        "PA588884",
        "PA721226",
        "PA720892",
        "PA718868",
        "PA718860",
        "PA719676",
        "PA719578"
      ]
    },
    "texteAffichable": "M.&#160;Lachaud,  Mme&#160;Autain, M.&#160;Bernalicis, M.&#160;Coquerel, M.&#160;Corbi&#232;re, Mme&#160;Fiat, M.&#160;Larive, M.&#160;M&#233;lenchon, Mme&#160;Obono, Mme&#160;Panot, M.&#160;Prud&apos;homme, M.&#160;Quatennens, M.&#160;Ratenon, Mme&#160;Ressiguier, Mme&#160;Rubin, M.&#160;Ruffin et Mme&#160;Taurine"
  },
  "pointeurFragmentTexte": {
    "missionVisee": {
      "@xmlns:xsi": "http://www.w3.org/2001/XMLSchema-instance",
      "@xsi:nil": "true"
    },
    "division": {
      "titre": "Article 23",
      "articleDesignationCourte": "ART. 23",
      "type": "ARTICLE",
      "avant_A_Apres": "A",
      "divisionRattachee": "ARTICLE 23",
      "articleAdditionnel": {
        "@xmlns:xsi": "http://www.w3.org/2001/XMLSchema-instance",
        "@xsi:nil": "true"
      },
      "chapitreAdditionnel": {
        "@xmlns:xsi": "http://www.w3.org/2001/XMLSchema-instance",
        "@xsi:nil": "true"
      },
      "urlDivisionTexteVise": "/15/textes/0659.asp#D_Article_23"
    },
    "alinea": {
      "@xmlns:xsi": "http://www.w3.org/2001/XMLSchema-instance",
      "@xsi:nil": "true"
    }
  },
  "corps": {
    "dispositif": "<p>Supprimer cet article.</p>",
    "exposeSommaire": "<p style=\"text-align: justify;\">Cette disposition vise &#224; alimenter le fichier BIOPEX, mis en &#339;uvre par la Direction du renseignement militaire (DRM), qui &#339;uvre, selon l&#8217;expos&#233; des motifs, &#224; renforcer la s&#233;curit&#233; des forces arm&#233;es sur les th&#233;&#226;tres ext&#233;rieurs, &#224; am&#233;liorer la lutte contre les menaces et &#224; aider la prise de d&#233;cision.</p><p style=\"text-align: justify;\">Cependant, le fait que ce fichier ne soit soumis qu&#8217;&#224; tr&#232;s peu de contr&#244;le nous inqui&#232;te.</p><p style=\"text-align: justify;\">En mai 2017, un d&#233;cret publi&#233; au Journal Officiel indiquait que la Commission nationale de l&#8217;informatique et des libert&#233;s (CNIL) ne pouvait pas avoir le moindre droit de regard sur 8 bases de donn&#233;es g&#233;r&#233;es par les services de renseignement, au nom de la s&#251;ret&#233; et de la raison d&#8217;Etat.</p><p style=\"text-align: justify;\">Depuis, la liste des bases de donn&#233;es sur lesquelles la CNIL n&#8217;a plus aucun pouvoir de contr&#244;le n&#8217;a cess&#233; de s&#8217;allonger, notamment apr&#232;s la publication du d&#233;cret n&#176;2017-1231 du 4 aout 2017 qui y ajoute BIOPEX.</p><p style=\"text-align: justify;\">Cet article modifie l&#8217;article L.2381-1 du Code de la D&#233;fense afin de permettre aux forces arm&#233;es en th&#233;&#226;tre ext&#233;rieur d&#8217;effectuer des pr&#233;l&#232;vements biologiques, non plus seulement sur des personnes &#171;&#160;d&#233;c&#233;d&#233;es lors d&#8217;actions de combat&#160;&#187; ou &#171;&#160;captur&#233;es par les forces arm&#233;es&#160;&#187; afin d&#8217;&#233;tablir leur identit&#233; &#171;&#160;lorsqu&#8217;elle est inconnue ou incertaine&#160;&#187;, mais &#233;galement sur &#171;&#160;des personnes dont il existe des raisons pr&#233;cises et s&#233;rieuses de penser qu&#8217;elles pr&#233;sentent une menace pour la s&#233;curit&#233; des forces ou des populations civiles.&#160;&#187;</p><p style=\"text-align: justify;\">La formulation bien trop impr&#233;cise de cette disposition laisse une place pro&#233;minente &#224; l&#8217;interpr&#233;tation et ne permet aucun contr&#244;le objectif. Comment d&#233;terminer ce que sont &#171;&#160;des&#160;raisons pr&#233;cises et s&#233;rieuses&#160;&#187;&#160;?! Selon quels crit&#232;res&#160;d&#233;finit-on qu&#8217;une personne repr&#233;sente une menace&#160;?!</p><p style=\"text-align: justify;\">Nous craignons que cette disposition laisse la porte ouverte &#224; toutes les d&#233;rives&#160;!</p><p style=\"text-align: justify;\">En effet, accepterait-on qu&#8217;en France un repr&#233;sentant des forces de l&#8217;ordre puisse <span class=\"del cts-1\"  data-cid=\"2\" data-userid=\"1761\" data-username=\"Cl&#233;mence Guett&#233;\" data-time=\"1520610890155\">d&#8217;</span>effectuer des pr&#233;l&#232;vements biologiques sur&#160;des&#160;personnes &#171;&#160;dont il existe des raisons pr&#233;cises et s&#233;rieuses de penser qu&#8217;elles pr&#233;sentent une menace pour la s&#233;curit&#233; des forces&#160;ou des populations civiles&#160;&#187;&#160;?!</p><p style=\"text-align: justify;\">&#160;</p><p style=\"text-align: justify;\">&#160;</p>",
    "annexeExposeSommaire": {
      "@xmlns:xsi": "http://www.w3.org/2001/XMLSchema-instance",
      "@xsi:nil": "true"
    }
  },
  "representations": {
    "representation": {
      "nom": "PDF",
      "typeMime": {
        "type": "application",
        "subType": "PDF"
      },
      "statutRepresentation": {
        "verbatim": "true",
        "canonique": "true",
        "officielle": "true",
        "transcription": "false",
        "enregistrement": "false"
      },
      "repSource": {
        "@xmlns:xsi": "http://www.w3.org/2001/XMLSchema-instance",
        "@xsi:nil": "true"
      },
      "offset": {
        "@xmlns:xsi": "http://www.w3.org/2001/XMLSchema-instance",
        "@xsi:nil": "true"
      },
      "contenu": {
        "documentURI": "/15/amendements/0659/CION_DEF/DN226.pdf"
      },
      "dateDispoRepresentation": {
        "@xmlns:xsi": "http://www.w3.org/2001/XMLSchema-instance",
        "@xsi:nil": "true"
      }
    }
  },
  "seanceDiscussion": {
    "@xmlns:xsi": "http://www.w3.org/2001/XMLSchema-instance",
    "@xsi:nil": "true"
  },
  "sort": {
    "dateSaisie": "2018-03-14T13:37:37.000+01:00",
    "sortEnSeance": "Rejeté"
  },
  "dateDepot": "2018-03-09T01:00:00.000+01:00",
  "dateDistribution": "2018-03-12T01:00:00.000+01:00",
  "article99": "0",
  "loiReference": {
    "codeLoi": {
      "@xmlns:xsi": "http://www.w3.org/2001/XMLSchema-instance",
      "@xsi:nil": "true"
    },
    "divisionCodeLoi": {
      "@xmlns:xsi": "http://www.w3.org/2001/XMLSchema-instance",
      "@xsi:nil": "true"
    }
  }
}