{
  "@xmlns": "http://schemas.assemblee-nationale.fr/referentiel",
  "uid": "AMANR5L15PO419610B0627P0D1N2116",
  "identifiant": {
    "legislature": "15",
    "numero": "2116",
    "numRect": "0",
    "saisine": {
      "refTexteLegislatif": "PRJLANR5L15B0627",
      "numeroPartiePLF": "0",
      "organeExamen": "PO419610",
      "mentionSecondeDeliberation": "0"
    }
  },
  "numeroLong": "CE2116",
  "etapeTexte": "1ère lecture (1ère assemblée saisie)",
  "triAmendement": "acdhp",
  "cardinaliteAmdtMultiples": "1",
  "amendementParent": "AMANR5L15PO419610B0627P0D1N171",
  "etat": "Discuté",
  "signataires": {
    "auteur": {
      "typeAuteur": "Depute",
      "acteurRef": "PA719194",
      "organeRef": {
        "@xmlns:xsi": "http://www.w3.org/2001/XMLSchema-instance",
        "@xsi:nil": "true"
      },
      "groupePolitiqueRef": "PO730964"
    },
    "cosignataires": {
      "acteurRef": "PA719194"
    },
    "texteAffichable": "Mme&#160;Yolaine&#160;de Courson"
  },
  "pointeurFragmentTexte": {
    "missionVisee": {
      "@xmlns:xsi": "http://www.w3.org/2001/XMLSchema-instance",
      "@xsi:nil": "true"
    },
    "division": {
      "titre": "Article 11",
      "articleDesignationCourte": "ART. 11",
      "type": "ARTICLE",
      "avant_A_Apres": "A",
      "divisionRattachee": "ARTICLE 11",
      "articleAdditionnel": {
        "@xmlns:xsi": "http://www.w3.org/2001/XMLSchema-instance",
        "@xsi:nil": "true"
      },
      "chapitreAdditionnel": {
        "@xmlns:xsi": "http://www.w3.org/2001/XMLSchema-instance",
        "@xsi:nil": "true"
      },
      "urlDivisionTexteVise": "/15/textes/0627.asp#D_Article_11"
    },
    "alinea": {
      "avant_A_Apres": "A",
      "numero": "2",
      "alineaDesignation": "Alinéa 2"
    }
  },
  "corps": {
    "dispositif": "<p style=\"text-align: justify;\">&#192;&#160;l&#8217;alin&#233;a&#160;5, apr&#232;s le mot&#160;:</p><p style=\"text-align: justify;\">&#171;&#160;vie&#160;&#187;,</p><p style=\"text-align: justify;\">ins&#233;rer les mots&#160;:</p><p style=\"text-align: justify;\">&#171;&#160;&#233;largi aux pratiques agricoles&#160;&#187;.</p>",
    "exposeSommaire": "<p>Le pr&#233;sent amendement pr&#233;voit l&#8217;utilisation de l'analyse du cycle de vie des produits alimentaires dans les contrats d'approvisionnement de la restauration collective.</p><p>La participation &#224; l'empreinte environnementale d'un produit alimentaire est fortement impact&#233;e par les pratiques agricoles employ&#233;es pour sa production, davantage que par l'&#233;tape de transformation agroalimentaire ou par le transport des aliments.</p><p>En effet, on estime que l'agriculture p&#232;se &#224; hauteur de 17,8% des &#233;missions de gaz &#224; effet de serre (dont 9,8% li&#233; &#224; l'emploi d'engrais et 8% &#224; l'&#233;levage). Or, des pratiques vertueuses de r&#233;duction des &#233;missions de GES voire de stockage peuvent &#234;tre mises en place.</p><p>Ainsi, l'analyse du cycle de vie utilis&#233;e dans le cadre de l'approvisionnement doit prendre en compte, dans son p&#233;rim&#232;tre, la phase amont de production agricole.</p><p>Cette mesure pr&#233;vue par ce sous-amendement permettra de rendre plus comp&#233;titives les pratiques agricoles vertueuses ainsi que les nombreuses initiatives mises en place dans les territoires dans le cadre du d&#233;veloppement de l'agro&#233;cologie, et de leur permettre un acc&#232;s privil&#233;gi&#233; aux d&#233;bouch&#233;s de la restauration collective.</p>",
    "annexeExposeSommaire": {
      "@xmlns:xsi": "http://www.w3.org/2001/XMLSchema-instance",
      "@xsi:nil": "true"
    }
  },
  "representations": {
    "representation": {
      "nom": "PDF",
      "typeMime": {
        "type": "application",
        "subType": "PDF"
      },
      "statutRepresentation": {
        "verbatim": "true",
        "canonique": "true",
        "officielle": "true",
        "transcription": "false",
        "enregistrement": "false"
      },
      "repSource": {
        "@xmlns:xsi": "http://www.w3.org/2001/XMLSchema-instance",
        "@xsi:nil": "true"
      },
      "offset": {
        "@xmlns:xsi": "http://www.w3.org/2001/XMLSchema-instance",
        "@xsi:nil": "true"
      },
      "contenu": {
        "documentURI": "/15/amendements/0627/CION-ECO/CE2116.pdf"
      },
      "dateDispoRepresentation": {
        "@xmlns:xsi": "http://www.w3.org/2001/XMLSchema-instance",
        "@xsi:nil": "true"
      }
    }
  },
  "seanceDiscussion": {
    "@xmlns:xsi": "http://www.w3.org/2001/XMLSchema-instance",
    "@xsi:nil": "true"
  },
  "sort": {
    "dateSaisie": "2018-04-19T11:26:07.000+02:00",
    "sortEnSeance": "Tombé"
  },
  "dateDepot": "2018-04-18T02:00:00.000+02:00",
  "dateDistribution": "2018-04-18T02:00:00.000+02:00",
  "article99": "0",
  "loiReference": {
    "codeLoi": {
      "@xmlns:xsi": "http://www.w3.org/2001/XMLSchema-instance",
      "@xsi:nil": "true"
    },
    "divisionCodeLoi": {
      "@xmlns:xsi": "http://www.w3.org/2001/XMLSchema-instance",
      "@xsi:nil": "true"
    }
  }
}