{
  "@xmlns": "http://schemas.assemblee-nationale.fr/referentiel",
  "uid": "AMANR5L15SEA717460B1255P1D1N954",
  "identifiant": {
    "legislature": "15",
    "numero": "954",
    "numRect": "0",
    "saisine": {
      "refTexteLegislatif": "PRJLANR5L15B1255",
      "numeroPartiePLF": "1",
      "organeExamen": "PO717460",
      "mentionSecondeDeliberation": "0"
    }
  },
  "numeroLong": "I-954",
  "etapeTexte": "1ère lecture (1ère assemblée saisie)",
  "triAmendement": "bkaaaaaaaaaaaaaaaaaaaaaaaaaaaaaaaaaaaaaaaaaaaaaaaanw",
  "cardinaliteAmdtMultiples": "1",
  "amendementParent": {
    "@xmlns:xsi": "http://www.w3.org/2001/XMLSchema-instance",
    "@xsi:nil": "true"
  },
  "etat": "Discuté",
  "signataires": {
    "auteur": {
      "typeAuteur": "Depute",
      "acteurRef": "PA720684",
      "organeRef": {
        "@xmlns:xsi": "http://www.w3.org/2001/XMLSchema-instance",
        "@xsi:nil": "true"
      },
      "groupePolitiqueRef": "PO730934"
    },
    "cosignataires": {
      "acteurRef": [
        "PA643089",
        "PA720684"
      ]
    },
    "texteAffichable": "M.&#160;Pierre-Henri&#160;Dumont et M.&#160;Thi&#233;riot"
  },
  "pointeurFragmentTexte": {
    "missionVisee": {
      "@xmlns:xsi": "http://www.w3.org/2001/XMLSchema-instance",
      "@xsi:nil": "true"
    },
    "division": {
      "titre": "Article 8",
      "articleDesignationCourte": "ART. 8",
      "type": "ARTICLE",
      "avant_A_Apres": "A",
      "divisionRattachee": "ARTICLE 8",
      "articleAdditionnel": {
        "@xmlns:xsi": "http://www.w3.org/2001/XMLSchema-instance",
        "@xsi:nil": "true"
      },
      "chapitreAdditionnel": {
        "@xmlns:xsi": "http://www.w3.org/2001/XMLSchema-instance",
        "@xsi:nil": "true"
      },
      "urlDivisionTexteVise": "/15/textes/1255A.asp#D_Article_8"
    },
    "alinea": {
      "@xmlns:xsi": "http://www.w3.org/2001/XMLSchema-instance",
      "@xsi:nil": "true"
    }
  },
  "corps": {
    "dispositif": "<p>Supprimer cet article.</p>",
    "exposeSommaire": "<p style=\"text-align: justify;\">Cet article pr&#233;voit un renforcement de la composante de la taxe g&#233;n&#233;rale sur les activit&#233;s polluantes (TGAP) relative aux d&#233;chets.</p><p style=\"text-align: justify;\">Si le texte a la vertu de pr&#233;tendre concourir &#224; la valorisation des op&#233;rations de recyclage par l&#8217;acquittement de la taxe, il ne r&#232;gle en rien la probl&#233;matique du traitement des d&#233;chets.</p><p style=\"text-align: justify;\">Cette hausse de la TGAP envoie un mauvais signal &#233;tant donn&#233; son caract&#232;re particuli&#232;rement contreproductif pour nos collectivit&#233;s.</p><p style=\"text-align: justify;\">En effet, les collectivit&#233;s en charge du service public de gestion des d&#233;chets vont devoir s&#8217;acquitter d&#8217;une taxe sur la part des d&#233;chets r&#233;siduels qu&#8217;elles doivent envoyer en traitement.</p><p style=\"text-align: justify;\">Il est temps de supprimer l&#8217;adage du pollueur payeur et de proposer des solutions alternatives, des mesures d&#8217;incitation visant &#224; r&#233;duire la production de d&#233;chets r&#233;siduels.</p>",
    "annexeExposeSommaire": {
      "@xmlns:xsi": "http://www.w3.org/2001/XMLSchema-instance",
      "@xsi:nil": "true"
    }
  },
  "representations": {
    "representation": {
      "nom": "PDF",
      "typeMime": {
        "type": "application",
        "subType": "PDF"
      },
      "statutRepresentation": {
        "verbatim": "true",
        "canonique": "true",
        "officielle": "true",
        "transcription": "false",
        "enregistrement": "false"
      },
      "repSource": {
        "@xmlns:xsi": "http://www.w3.org/2001/XMLSchema-instance",
        "@xsi:nil": "true"
      },
      "offset": {
        "@xmlns:xsi": "http://www.w3.org/2001/XMLSchema-instance",
        "@xsi:nil": "true"
      },
      "contenu": {
        "documentURI": "/15/amendements/1255A/AN/954.pdf"
      },
      "dateDispoRepresentation": {
        "@xmlns:xsi": "http://www.w3.org/2001/XMLSchema-instance",
        "@xsi:nil": "true"
      }
    }
  },
  "seanceDiscussion": "RUANR5L15S2019IDS21279",
  "sort": {
    "dateSaisie": "2018-10-18T21:55:06.000+02:00",
    "sortEnSeance": "Non soutenu"
  },
  "dateDepot": "2018-10-10T02:00:00.000+02:00",
  "dateDistribution": "2018-10-14T02:00:00.000+02:00",
  "article99": "0",
  "loiReference": {
    "codeLoi": {
      "@xmlns:xsi": "http://www.w3.org/2001/XMLSchema-instance",
      "@xsi:nil": "true"
    },
    "divisionCodeLoi": {
      "@xmlns:xsi": "http://www.w3.org/2001/XMLSchema-instance",
      "@xsi:nil": "true"
    }
  }
}