{
  "@xmlns": "http://schemas.assemblee-nationale.fr/referentiel",
  "uid": "AMANR5L15SEA717460BTC1767P0D1N419",
  "identifiant": {
    "legislature": "15",
    "numero": "419",
    "numRect": "0",
    "saisine": {
      "refTexteLegislatif": "PRJLANR5L15BTC1767",
      "numeroPartiePLF": "0",
      "organeExamen": "PO717460",
      "mentionSecondeDeliberation": "0"
    }
  },
  "numeroLong": "419",
  "etapeTexte": "1ère lecture (1ère assemblée saisie)",
  "triAmendement": "asaaaaaaaaaaaaaaaaaaaaaaaaaaaaaaaaaaaaaaaaaaaaaaaabhhzi",
  "cardinaliteAmdtMultiples": "1",
  "amendementParent": {
    "@xmlns:xsi": "http://www.w3.org/2001/XMLSchema-instance",
    "@xsi:nil": "true"
  },
  "etat": "Discuté",
  "signataires": {
    "auteur": {
      "typeAuteur": "Depute",
      "acteurRef": "PA719318",
      "organeRef": {
        "@xmlns:xsi": "http://www.w3.org/2001/XMLSchema-instance",
        "@xsi:nil": "true"
      },
      "groupePolitiqueRef": "PO730934"
    },
    "cosignataires": {
      "acteurRef": [
        "PA266793",
        "PA721054",
        "PA267318",
        "PA330909",
        "PA609245",
        "PA719318",
        "PA720684",
        "PA608016",
        "PA606712",
        "PA267204",
        "PA267260",
        "PA718780",
        "PA267735",
        "PA721968",
        "PA340853",
        "PA718784",
        "PA719272",
        "PA267901",
        "PA712015"
      ]
    },
    "texteAffichable": "Mme&#160;Anthoine,  M.&#160;Sermier, M.&#160;Bony, M.&#160;Leclerc, Mme&#160;Meunier, Mme&#160;Louwagie, M.&#160;Lurton, M.&#160;de Ganay, M.&#160;Pauget, Mme&#160;Poletti, M.&#160;Lorion, M.&#160;Pierre-Henri&#160;Dumont, M.&#160;Descoeur, M.&#160;Dive, Mme&#160;Trastour-Isnart, M.&#160;Vialay, M.&#160;Kamardine, Mme&#160;Lacroute et M.&#160;Grelier"
  },
  "pointeurFragmentTexte": {
    "missionVisee": {
      "@xmlns:xsi": "http://www.w3.org/2001/XMLSchema-instance",
      "@xsi:nil": "true"
    },
    "division": {
      "titre": "Article 5",
      "articleDesignationCourte": "ART. 5",
      "type": "ARTICLE",
      "avant_A_Apres": "A",
      "divisionRattachee": "ARTICLE 5",
      "articleAdditionnel": {
        "@xmlns:xsi": "http://www.w3.org/2001/XMLSchema-instance",
        "@xsi:nil": "true"
      },
      "chapitreAdditionnel": {
        "@xmlns:xsi": "http://www.w3.org/2001/XMLSchema-instance",
        "@xsi:nil": "true"
      },
      "urlDivisionTexteVise": "/15/textes/1767.asp#D_Article_5"
    },
    "alinea": {
      "avant_A_Apres": "Apres",
      "numero": "10",
      "alineaDesignation": {
        "@xmlns:xsi": "http://www.w3.org/2001/XMLSchema-instance",
        "@xsi:nil": "true"
      }
    }
  },
  "corps": {
    "dispositif": "<p style=\"text-align: justify;\">Apr&#232;s l&#8217;alin&#233;a&#160;10, ins&#233;rer l&#8217;alin&#233;a suivant&#160;:</p><p style=\"text-align: justify;\">&#171;&#160;Le recours au statut de m&#233;decin adjoint est ouvert aux &#233;tablissements de sant&#233; publics et priv&#233;s.&#160;&#187;</p>",
    "exposeSommaire": "<p style=\"text-align: justify;\">La cr&#233;ation du statut de m&#233;decin adjoint est l&#8217;une des r&#233;ponses apport&#233;es par le texte de loi aux difficult&#233;s d&#8217;acc&#232;s aux soins dans de nombreux territoires.</p><p style=\"text-align: justify;\">Afin de r&#233;pondre pleinement &#224; cet enjeu majeur, l&#8217;ensemble des acteurs du syst&#232;me de sant&#233;, de tous statuts, doivent &#234;tre en capacit&#233; de se mobiliser, en b&#233;n&#233;ficiant des m&#234;mes dispositifs propos&#233;s au b&#233;n&#233;fice des zones sous-dot&#233;es.</p><p style=\"text-align: justify;\">C&#8217;est pour cela qu&#8217;il est propos&#233; d&#8217;ouvrir ce statut de m&#233;decin adjoint au secteur priv&#233; comme au secteur public.</p>",
    "annexeExposeSommaire": {
      "@xmlns:xsi": "http://www.w3.org/2001/XMLSchema-instance",
      "@xsi:nil": "true"
    },
    "cartoucheDelaiDepotDepasse": {
      "@xmlns:xsi": "http://www.w3.org/2001/XMLSchema-instance",
      "@xsi:nil": "true"
    }
  },
  "representations": {
    "representation": {
      "nom": "PDF",
      "typeMime": {
        "type": "application",
        "subType": "PDF"
      },
      "statutRepresentation": {
        "verbatim": "true",
        "canonique": "true",
        "officielle": "true",
        "transcription": "false",
        "enregistrement": "false"
      },
      "repSource": {
        "@xmlns:xsi": "http://www.w3.org/2001/XMLSchema-instance",
        "@xsi:nil": "true"
      },
      "offset": {
        "@xmlns:xsi": "http://www.w3.org/2001/XMLSchema-instance",
        "@xsi:nil": "true"
      },
      "contenu": {
        "documentURI": "/15/amendements/1767/AN/419.pdf"
      },
      "dateDispoRepresentation": {
        "@xmlns:xsi": "http://www.w3.org/2001/XMLSchema-instance",
        "@xsi:nil": "true"
      }
    }
  },
  "seanceDiscussion": "RUANR5L15S2019IDS21561",
  "sort": {
    "dateSaisie": "2019-03-20T19:38:14.000+01:00",
    "sortEnSeance": "Rejeté"
  },
  "dateDepot": "2019-03-15T01:00:00.000+01:00",
  "dateDistribution": "2019-03-18T01:00:00.000+01:00",
  "article99": "0",
  "loiReference": {
    "codeLoi": {
      "@xmlns:xsi": "http://www.w3.org/2001/XMLSchema-instance",
      "@xsi:nil": "true"
    },
    "divisionCodeLoi": {
      "@xmlns:xsi": "http://www.w3.org/2001/XMLSchema-instance",
      "@xsi:nil": "true"
    }
  }
}