{
  "@xmlns": "http://schemas.assemblee-nationale.fr/referentiel",
  "uid": "AMANR5L15PO419865B2274P0D1N1341",
  "identifiant": {
    "legislature": "15",
    "numero": "1341",
    "numRect": "0",
    "saisine": {
      "refTexteLegislatif": "PRJLANR5L15B2274",
      "numeroPartiePLF": "0",
      "organeExamen": "PO419865",
      "mentionSecondeDeliberation": "0"
    }
  },
  "numeroLong": "CD1341",
  "etapeTexte": "1ère lecture (2ème assemblée saisie)",
  "triAmendement": "baoaaaaaaaaaaaaaaaaaaaaaaaaaaaaaaaaaaaaaaaaaaaaaaaas",
  "cardinaliteAmdtMultiples": "1",
  "amendementParent": {
    "@xmlns:xsi": "http://www.w3.org/2001/XMLSchema-instance",
    "@xsi:nil": "true"
  },
  "etat": "En traitement",
  "signataires": {
    "auteur": {
      "typeAuteur": "Depute",
      "acteurRef": "PA720334",
      "organeRef": {
        "@xmlns:xsi": "http://www.w3.org/2001/XMLSchema-instance",
        "@xsi:nil": "true"
      },
      "groupePolitiqueRef": "PO730970"
    },
    "cosignataires": {
      "acteurRef": [
        "PA719504",
        "PA721182",
        "PA721924",
        "PA721234",
        "PA720746",
        "PA721530",
        "PA717151",
        "PA719640",
        "PA720598",
        "PA720924",
        "PA719044",
        "PA721836",
        "PA720764",
        "PA719488",
        "PA720720",
        "PA720772",
        "PA720178",
        "PA722374",
        "PA722284",
        "PA719266",
        "PA720326",
        "PA721418",
        "PA1276",
        "PA720728",
        "PA721984",
        "PA720334",
        "PA719918",
        "PA721608",
        "PA719874",
        "PA720976",
        "PA722162",
        "PA721996",
        "PA720092",
        "PA720704",
        "PA721976",
        "PA720652",
        "PA721734",
        "PA719210",
        "PA720968",
        "PA721742",
        "PA719558",
        "PA718978",
        "PA719942",
        "PA720002",
        "PA720256",
        "PA720162"
      ]
    },
    "texteAffichable": "M.&#160;Pahun,  M.&#160;Mathiasin, Mme&#160;Essayan, Mme&#160;Lasserre, M.&#160;Loiseau, Mme&#160;Luquet, M.&#160;Millienne, M.&#160;Balanant, Mme&#160;Bannier, M.&#160;Barrot, M.&#160;Baudu, Mme&#160;Benin, M.&#160;Berta, M.&#160;Bolo, M.&#160;Bourlanges, M.&#160;Bru, M.&#160;Cubertafon, Mme&#160;de Sarnez, Mme&#160;de Vaucouleurs, Mme&#160;Deprez-Audebert, M.&#160;Duverg&#233;, Mme&#160;El Ha&#239;ry, Mme&#160;Elimas, M.&#160;Fanget, Mme&#160;Florennes, M.&#160;Fuchs, M.&#160;Garcia, M.&#160;Hammouche, M.&#160;Isaac-Sibille, Mme&#160;Jacquier-Laforge, M.&#160;Joncour, M.&#160;Lagleize, M.&#160;Lain&#233;, M.&#160;Laqhila, M.&#160;Latombe, M.&#160;Mattei, Mme&#160;Mette, M.&#160;Michel-Kleisbauer, M.&#160;Mignola, M.&#160;Fr&#233;d&#233;ric&#160;Petit, Mme&#160;Maud&#160;Petit, Mme&#160;Poueyto, M.&#160;Ramos, M.&#160;Turquois, Mme&#160;Vichnievsky et M.&#160;Waserman"
  },
  "pointeurFragmentTexte": {
    "missionVisee": {
      "@xmlns:xsi": "http://www.w3.org/2001/XMLSchema-instance",
      "@xsi:nil": "true"
    },
    "division": {
      "titre": "Article 4 bis A",
      "articleDesignationCourte": "APRÈS ART. 4 BIS A",
      "type": "ARTICLE",
      "avant_A_Apres": "Après",
      "divisionRattachee": "APRÈS L'ARTICLE 4 BIS A, insérer l'article suivant:",
      "articleAdditionnel": "1",
      "chapitreAdditionnel": {
        "@xmlns:xsi": "http://www.w3.org/2001/XMLSchema-instance",
        "@xsi:nil": "true"
      },
      "urlDivisionTexteVise": "/15/textes/2274.asp#D_Article_4_bis_A"
    },
    "alinea": {
      "@xmlns:xsi": "http://www.w3.org/2001/XMLSchema-instance",
      "@xsi:nil": "true"
    }
  },
  "corps": {
    "dispositif": "<p style=\"text-align: justify;\">Au premier alin&#233;a de l&#8217;article L.&#160;217&#8209;7 du code de la consommation, le mot&#160;: &#171;&#160;vingt-quatre&#160;&#187; est remplac&#233; par le mot&#160;: &#171;&#160;trente-six&#160;&#187;.</p>",
    "exposeSommaire": "<p style=\"text-align: justify;\">Le pr&#233;sent amendement vise &#224; &#233;tendre la charge de la preuve favorable au client pour les biens neufs. Il l&#8217;&#233;tend &#224; 36 mois au lieu de 24 mois. Une telle mesure est de nature &#224; inciter les fabricants, importateurs ou vendeurs &#224; renforcer la qualit&#233; et la durabilit&#233; de leurs produits.</p>",
    "annexeExposeSommaire": {
      "@xmlns:xsi": "http://www.w3.org/2001/XMLSchema-instance",
      "@xsi:nil": "true"
    },
    "cartoucheDelaiDepotDepasse": "Sous réserve de son traitement par les services de l'Assemblée nationale et de sa recevabilité",
    "avantAppel": {
      "@xmlns:xsi": "http://www.w3.org/2001/XMLSchema-instance",
      "@xsi:nil": "true"
    }
  },
  "representations": {
    "representation": {
      "nom": "PDF",
      "typeMime": {
        "type": "application",
        "subType": "PDF"
      },
      "statutRepresentation": {
        "verbatim": "true",
        "canonique": "true",
        "officielle": "true",
        "transcription": "false",
        "enregistrement": "false"
      },
      "repSource": {
        "@xmlns:xsi": "http://www.w3.org/2001/XMLSchema-instance",
        "@xsi:nil": "true"
      },
      "offset": {
        "@xmlns:xsi": "http://www.w3.org/2001/XMLSchema-instance",
        "@xsi:nil": "true"
      },
      "contenu": {
        "documentURI": "/15/amendements/2274/CION-DVP/CD1341.pdf"
      },
      "dateDispoRepresentation": {
        "@xmlns:xsi": "http://www.w3.org/2001/XMLSchema-instance",
        "@xsi:nil": "true"
      }
    }
  },
  "seanceDiscussion": {
    "@xmlns:xsi": "http://www.w3.org/2001/XMLSchema-instance",
    "@xsi:nil": "true"
  },
  "sort": {
    "@xmlns:xsi": "http://www.w3.org/2001/XMLSchema-instance",
    "@xsi:nil": "true"
  },
  "dateDepot": "2019-11-20T01:00:00.000+01:00",
  "dateDistribution": "2019-11-20T01:00:00.000+01:00",
  "article99": "0",
  "loiReference": {
    "codeLoi": "c consommation",
    "divisionCodeLoi": "L217-7"
  }
}