{
  "@xmlns": "http://schemas.assemblee-nationale.fr/referentiel",
  "uid": "AMANR5L15SEA717460BTC1237P0D1N21",
  "identifiant": {
    "legislature": "15",
    "numero": "21",
    "numRect": "0",
    "saisine": {
      "refTexteLegislatif": "PRJLANR5L15BTC1237",
      "numeroPartiePLF": "0",
      "organeExamen": "PO717460",
      "mentionSecondeDeliberation": "0"
    }
  },
  "numeroLong": "21",
  "etapeTexte": "1ère lecture (1ère assemblée saisie)",
  "triAmendement": "aakaaaaaaaaaaaaaaaaaaaaaaaaaaaaaaaaaaaaaaaaaaaaaaacab",
  "cardinaliteAmdtMultiples": "1",
  "amendementParent": {
    "@xmlns:xsi": "http://www.w3.org/2001/XMLSchema-instance",
    "@xsi:nil": "true"
  },
  "etat": "Discuté",
  "signataires": {
    "auteur": {
      "typeAuteur": "Depute",
      "acteurRef": "PA334149",
      "organeRef": {
        "@xmlns:xsi": "http://www.w3.org/2001/XMLSchema-instance",
        "@xsi:nil": "true"
      },
      "groupePolitiqueRef": "PO730934"
    },
    "cosignataires": {
      "acteurRef": [
        "PA713448",
        "PA1327",
        "PA605991",
        "PA266793",
        "PA606712",
        "PA330909",
        "PA718884",
        "PA609245",
        "PA346218",
        "PA642847",
        "PA266776",
        "PA332523",
        "PA267204",
        "PA267378",
        "PA2792",
        "PA340853",
        "PA346054",
        "PA721816",
        "PA336316",
        "PA608416",
        "PA608016",
        "PA718838",
        "PA721506",
        "PA334149",
        "PA720684"
      ]
    },
    "texteAffichable": "M.&#160;Fasquelle,  Mme&#160;Bazin-Malgras, M.&#160;Bony, M.&#160;Boucard, M.&#160;Bouchet, Mme&#160;Brenier, M.&#160;Brun, Mme&#160;Dalloz, M.&#160;Pierre-Henri&#160;Dumont, Mme&#160;Genevard, M.&#160;Hetzel, Mme&#160;Kuster, Mme&#160;Lacroute, M.&#160;Leclerc, Mme&#160;Levy, Mme&#160;Louwagie, M.&#160;Lurton, M.&#160;Emmanuel&#160;Maquet, M.&#160;Masson, M.&#160;Reiss, M.&#160;Sermier, M.&#160;Descoeur, M.&#160;Forissier, M.&#160;Taugourdeau et M.&#160;Bazin"
  },
  "pointeurFragmentTexte": {
    "missionVisee": {
      "@xmlns:xsi": "http://www.w3.org/2001/XMLSchema-instance",
      "@xsi:nil": "true"
    },
    "division": {
      "titre": "Article PREMIER",
      "articleDesignationCourte": "ART. PREMIER",
      "type": "ARTICLE",
      "avant_A_Apres": "A",
      "divisionRattachee": "ARTICLE PREMIER",
      "articleAdditionnel": {
        "@xmlns:xsi": "http://www.w3.org/2001/XMLSchema-instance",
        "@xsi:nil": "true"
      },
      "chapitreAdditionnel": {
        "@xmlns:xsi": "http://www.w3.org/2001/XMLSchema-instance",
        "@xsi:nil": "true"
      },
      "urlDivisionTexteVise": "/15/textes/1237.asp#D_Article_1er"
    },
    "alinea": {
      "@xmlns:xsi": "http://www.w3.org/2001/XMLSchema-instance",
      "@xsi:nil": "true"
    }
  },
  "corps": {
    "dispositif": "<p>Supprimer cet article.</p>",
    "exposeSommaire": "<p style=\"text-align: justify;\">L&#8217;article premier rend obligatoires les d&#233;clarations des entreprises par voie &#233;lectronique, s&#8217;agissant de leur cr&#233;ation, de l&#8217;&#233;volution et de la cessation de leur activit&#233;.</p><p style=\"text-align: justify;\">Actuellement, ces formalit&#233;s sont accomplies aupr&#232;s des centres de formalit&#233;s des entreprises (CFE), qui jouent le r&#244;le de guichets uniques. Chaque d&#233;clarant dispose d&#8217;un CFE de r&#233;f&#233;rence en fonction de l&#8217;activit&#233; exerc&#233;e, de la forme juridique de l&#8217;&#233;tablissement exploit&#233; et du lieu de l&#8217;activit&#233;. Il existe sept r&#233;seaux de CFE g&#233;r&#233;s respectivement par les chambres de commerce et d&#8217;industrie (CCI), les chambres de m&#233;tiers et de l&#8217;artisanat (CMA), les chambres d&#8217;agriculture, les greffes des tribunaux de commerce ou des tribunaux de grande instance, les URSSAF, les services des imp&#244;ts des entreprises et la Chambre nationale de la batellerie artisanale. Ces centres physiques permettent un accompagnement effectif des cr&#233;ateurs d&#8217;entreprises. Supprimer ces centres en les substituants par une proc&#233;dure enti&#232;rement d&#233;mat&#233;rialiser est donc un risque de perte d&#8217;accompagnement inacceptable.</p>",
    "annexeExposeSommaire": {
      "@xmlns:xsi": "http://www.w3.org/2001/XMLSchema-instance",
      "@xsi:nil": "true"
    }
  },
  "representations": {
    "representation": {
      "nom": "PDF",
      "typeMime": {
        "type": "application",
        "subType": "PDF"
      },
      "statutRepresentation": {
        "verbatim": "true",
        "canonique": "true",
        "officielle": "true",
        "transcription": "false",
        "enregistrement": "false"
      },
      "repSource": {
        "@xmlns:xsi": "http://www.w3.org/2001/XMLSchema-instance",
        "@xsi:nil": "true"
      },
      "offset": {
        "@xmlns:xsi": "http://www.w3.org/2001/XMLSchema-instance",
        "@xsi:nil": "true"
      },
      "contenu": {
        "documentURI": "/15/amendements/1237/AN/21.pdf"
      },
      "dateDispoRepresentation": {
        "@xmlns:xsi": "http://www.w3.org/2001/XMLSchema-instance",
        "@xsi:nil": "true"
      }
    }
  },
  "seanceDiscussion": "RUANR5L15S2018IDS21247",
  "sort": {
    "dateSaisie": "2018-09-25T23:19:19.000+02:00",
    "sortEnSeance": "Rejeté"
  },
  "dateDepot": "2018-09-19T02:00:00.000+02:00",
  "dateDistribution": "2018-09-22T02:00:00.000+02:00",
  "article99": "0",
  "loiReference": {
    "codeLoi": {
      "@xmlns:xsi": "http://www.w3.org/2001/XMLSchema-instance",
      "@xsi:nil": "true"
    },
    "divisionCodeLoi": {
      "@xmlns:xsi": "http://www.w3.org/2001/XMLSchema-instance",
      "@xsi:nil": "true"
    }
  }
}