{
  "@xmlns": "http://schemas.assemblee-nationale.fr/referentiel",
  "uid": "AMANR5L15PO419865B1831P0D1N2649",
  "identifiant": {
    "legislature": "15",
    "numero": "2649",
    "numRect": "0",
    "saisine": {
      "refTexteLegislatif": "PRJLANR5L15B1831",
      "numeroPartiePLF": "0",
      "organeExamen": "PO419865",
      "mentionSecondeDeliberation": "0"
    }
  },
  "numeroLong": "CD2649",
  "etapeTexte": "1ère lecture (2ème assemblée saisie)",
  "triAmendement": "jaiaaaaaaaaaaaaaaaaaaaaaaaaaaaaaaaaaaaaaaaaaaaaaaag",
  "cardinaliteAmdtMultiples": "1",
  "amendementParent": {
    "@xmlns:xsi": "http://www.w3.org/2001/XMLSchema-instance",
    "@xsi:nil": "true"
  },
  "etat": "Discuté",
  "signataires": {
    "auteur": {
      "typeAuteur": "Depute",
      "acteurRef": "PA721530",
      "organeRef": {
        "@xmlns:xsi": "http://www.w3.org/2001/XMLSchema-instance",
        "@xsi:nil": "true"
      },
      "groupePolitiqueRef": "PO730970"
    },
    "cosignataires": {
      "acteurRef": [
        "PA719640",
        "PA720652",
        "PA720334",
        "PA720764",
        "PA721992",
        "PA721530"
      ]
    },
    "texteAffichable": "Mme&#160;Luquet,  M.&#160;Duverg&#233;, Mme&#160;Mette, Mme&#160;Lasserre-David, M.&#160;Pahun et Mme&#160;Gallerneau"
  },
  "pointeurFragmentTexte": {
    "missionVisee": {
      "@xmlns:xsi": "http://www.w3.org/2001/XMLSchema-instance",
      "@xsi:nil": "true"
    },
    "division": {
      "titre": "Article 32 bis",
      "articleDesignationCourte": "APRÈS ART. 32 BIS",
      "type": "ARTICLE",
      "avant_A_Apres": "Après",
      "divisionRattachee": "APRÈS L'ARTICLE 32 BIS, insérer l'article suivant:",
      "articleAdditionnel": "1",
      "chapitreAdditionnel": {
        "@xmlns:xsi": "http://www.w3.org/2001/XMLSchema-instance",
        "@xsi:nil": "true"
      },
      "urlDivisionTexteVise": "/15/textes/1831.asp#D_Article_32_bis"
    },
    "alinea": {
      "@xmlns:xsi": "http://www.w3.org/2001/XMLSchema-instance",
      "@xsi:nil": "true"
    }
  },
  "corps": {
    "dispositif": "<p style=\"text-align: justify;\">Apr&#232;s le premier alin&#233;a de l&#8217;article L.&#160;2241&#8209;10 du code des transports, il est ins&#233;r&#233; un alin&#233;a ainsi r&#233;dig&#233;&#160;:</p><p style=\"text-align: justify;\">&#171;&#160;La violation des dispositions du pr&#233;sent article est punie d&#8217;une amende de quatri&#232;me classe pr&#233;vue par le d&#233;cret n&#176;&#160;2016&#8209;541 du 3 mai 2016 relatif &#224; la s&#251;ret&#233; et aux r&#232;gles de conduite dans les transports ferroviaires ou guid&#233;s et certains autres transports publics&#160;&#187;.</p>",
    "exposeSommaire": "<p style=\"text-align: justify;\">La loi n&#176; 2016&#8209;339 du 22 mars 2016 fait obligation aux passagers de transports terrestres d&#8217;&#234;tre en mesure de justifier de leur identit&#233; lorsqu&#8217;ils ne disposent pas d&#8217;un titre transport valable. Cette mesure s&#8217;inscrit dans la volont&#233; de fiabiliser les identit&#233;s et adresses des fraudeurs.</p><p style=\"text-align: justify;\">Or, si obligation est faite de d&#233;tenir un titre d&#8217;identit&#233;, la loi ne pr&#233;voit aucune sanction pour les contrevenants qui ne respecteraient pas cette obligation.</p><p style=\"text-align: justify;\">Face &#224; la difficult&#233; d&#8217;identifier avec certitude les personnes contrevenantes qui d&#233;clarent bien trop souvent de fausses identit&#233;s ou adresses, il convient, par cet amendement, de pr&#233;voir une amende de 4e classe pour les fraudeurs qui ne seraient pas en possession d&#8217;un titre d&#8217;identit&#233; comme les oblige la loi.</p>",
    "annexeExposeSommaire": {
      "@xmlns:xsi": "http://www.w3.org/2001/XMLSchema-instance",
      "@xsi:nil": "true"
    },
    "cartoucheDelaiDepotDepasse": {
      "@xmlns:xsi": "http://www.w3.org/2001/XMLSchema-instance",
      "@xsi:nil": "true"
    }
  },
  "representations": {
    "representation": {
      "nom": "PDF",
      "typeMime": {
        "type": "application",
        "subType": "PDF"
      },
      "statutRepresentation": {
        "verbatim": "true",
        "canonique": "true",
        "officielle": "true",
        "transcription": "false",
        "enregistrement": "false"
      },
      "repSource": {
        "@xmlns:xsi": "http://www.w3.org/2001/XMLSchema-instance",
        "@xsi:nil": "true"
      },
      "offset": {
        "@xmlns:xsi": "http://www.w3.org/2001/XMLSchema-instance",
        "@xsi:nil": "true"
      },
      "contenu": {
        "documentURI": "/15/amendements/1831/CION-DVP/CD2649.pdf"
      },
      "dateDispoRepresentation": {
        "@xmlns:xsi": "http://www.w3.org/2001/XMLSchema-instance",
        "@xsi:nil": "true"
      }
    }
  },
  "seanceDiscussion": {
    "@xmlns:xsi": "http://www.w3.org/2001/XMLSchema-instance",
    "@xsi:nil": "true"
  },
  "sort": {
    "dateSaisie": "2019-05-22T16:47:58.000+02:00",
    "sortEnSeance": "Retiré"
  },
  "dateDepot": "2019-05-09T02:00:00.000+02:00",
  "dateDistribution": "2019-05-19T02:00:00.000+02:00",
  "article99": "0",
  "loiReference": {
    "codeLoi": "transports",
    "divisionCodeLoi": "L2241-10"
  }
}