{
  "@xmlns": "http://schemas.assemblee-nationale.fr/referentiel",
  "uid": "AMANR5L15SEA717460B0235P2D1N1641",
  "identifiant": {
    "legislature": "15",
    "numero": "1641",
    "numRect": "0",
    "saisine": {
      "refTexteLegislatif": "PRJLANR5L15B0235",
      "numeroPartiePLF": "2",
      "organeExamen": "PO717460",
      "mentionSecondeDeliberation": "0"
    }
  },
  "numeroLong": "II-1641",
  "etapeTexte": "1ère lecture (1ère assemblée saisie)",
  "triAmendement": "t",
  "cardinaliteAmdtMultiples": "1",
  "amendementParent": {
    "@xmlns:xsi": "http://www.w3.org/2001/XMLSchema-instance",
    "@xsi:nil": "true"
  },
  "etat": "Irrecevable",
  "signataires": {
    "auteur": {
      "typeAuteur": "Depute",
      "acteurRef": "PA606712",
      "organeRef": {
        "@xmlns:xsi": "http://www.w3.org/2001/XMLSchema-instance",
        "@xsi:nil": "true"
      },
      "groupePolitiqueRef": "PO730934"
    },
    "cosignataires": {
      "acteurRef": [
        "PA267429",
        "PA642847",
        "PA2492",
        "PA718780",
        "PA721968",
        "PA608016",
        "PA718884",
        "PA330684",
        "PA1874",
        "PA345722",
        "PA606712",
        "PA718850",
        "PA719318"
      ]
    },
    "texteAffichable": "M.&#160;Lurton,  M.&#160;Cordier, M.&#160;Cinieri, Mme&#160;Bazin-Malgras, Mme&#160;Val&#233;rie&#160;Boyer, Mme&#160;Anthoine, Mme&#160;Louwagie, M.&#160;Vialay, M.&#160;Le Fur, Mme&#160;Trastour-Isnart, M.&#160;Quentin, Mme&#160;Le Grip et M.&#160;Bazin"
  },
  "pointeurFragmentTexte": {
    "missionVisee": {
      "@xmlns:xsi": "http://www.w3.org/2001/XMLSchema-instance",
      "@xsi:nil": "true"
    },
    "division": {
      "titre": "Article 38",
      "articleDesignationCourte": "APRÈS ART. 38",
      "type": "ARTICLE",
      "avant_A_Apres": "Après",
      "divisionRattachee": "APRÈS L'ARTICLE 38, insérer l'article suivant:",
      "articleAdditionnel": "1",
      "chapitreAdditionnel": {
        "@xmlns:xsi": "http://www.w3.org/2001/XMLSchema-instance",
        "@xsi:nil": "true"
      },
      "urlDivisionTexteVise": "/15/textes/0235C.asp#D_Article_38"
    },
    "alinea": {
      "@xmlns:xsi": "http://www.w3.org/2001/XMLSchema-instance",
      "@xsi:nil": "true"
    }
  },
  "corps": {
    "dispositif": "<p style=\"text-align: justify;\">I.&#160;&#8211;&#160;Le IX de l&#8217;article&#160;19 de la loi n&#176;&#160;2014&#8209;40 du 20 janvier 2014 garantissant l&#8217;avenir et la justice du syst&#232;me de retraites est compl&#233;t&#233; par une phrase ainsi r&#233;dig&#233;e&#160;: &#171;&#160;Ces dispositions ne s&#8217;appliquent que pour les marins de 45&#160;ans et plus, non officiers, dont l&#8217;employabilit&#233; est difficile apr&#232;s une carri&#232;re maritime tant du point de vue de l&#8217;&#226;ge que des qualifications.&#160;&#187;</p><p style=\"text-align: justify;\">II.&#160;&#8211;&#160;La perte de recettes r&#233;sultant pour l&#8217;&#201;tat du I est compens&#233;e, &#224; due concurrence, par la cr&#233;ation d&#8217;une taxe additionnelle aux droits pr&#233;vus aux articles 575 et 575 A du code g&#233;n&#233;ral des imp&#244;ts.</p>",
    "exposeSommaire": "<p style=\"text-align: justify;\">A ce jour, les personnes qui b&#233;n&#233;ficient d&#8217;une pension vieillesse du r&#233;gime social des marins et qui reprennent une activit&#233; relevant d&#8217;un autre r&#233;gime de retraite continuent de valider des droits &#224; la retraite dans le r&#233;gime dans lequel ils ont repris une autre activit&#233; professionnelle.</p><p style=\"text-align: justify;\">Or, l&#8217;Article&#160;19&#160;&#8211;&#160;Alin&#233;a&#160;9 de la loi 2014 garantissant l&#8217;avenir et la justice du syst&#232;me de retraite pr&#233;cise que &#171;&#160;Un d&#233;cret en Conseil d&#8217;&#201;tat fixe, en tant que de besoin, les modalit&#233;s particuli&#232;res d&#8217;application du pr&#233;sent article pour les assur&#233;s relevant du r&#233;gime mentionn&#233; &#224; l&#8217;article L.&#160;5551&#8209;1 du code des transports, notamment en fonction du type de pensions mentionn&#233;es &#224; l&#8217;article L.&#160;5552&#8209;1 du m&#234;me code. Le II du pr&#233;sent article entre en vigueur, pour les assur&#233;s relevant du r&#233;gime mentionn&#233; &#224; l&#8217;article L.&#160;5551&#8209;1 du code des transports, &#224; compter du 1<sup>er</sup> janvier 2018.&#160;&#187;</p><p style=\"text-align: justify;\">En l&#8217;absence de ce d&#233;cret sp&#233;cifique, cet article entrera en vigueur unilat&#233;ralement le 1<sup>er</sup> janvier 2018.</p><p style=\"text-align: justify;\">Ainsi, tout b&#233;n&#233;ficiaire d&#8217;une pension de retraite servie par l&#8217;ENIM &#224; partir du 1<sup>er</sup> janvier 2018, en tant que premi&#232;re pension de base, et qui poursuit ou reprend une activit&#233; est concern&#233; par le principe de cotisations non g&#233;n&#233;ratrices de droits nouveaux &#224; la retraite.&#160;</p><p style=\"text-align: justify;\">Toutes les pensions de retraites sont en effet concern&#233;es et, pour les personnes devenues inaptes d&#233;finitives &#224; la profession de marins et qui exercent une activit&#233; professionnelle &#224; terre, cette nouvelle activit&#233; professionnelle entrainera le versement de cotisations aupr&#232;s d&#8217;un autre r&#233;gime de retraite que celui des marins mais elles ne g&#233;n&#232;reront pas de droits nouveaux &#224; la retraite dans ce r&#233;gime si les personnes demandent &#224; b&#233;n&#233;ficier de la pension anticip&#233;e de l&#8217;assurance vieillesse des marins, la PRA.</p><p style=\"text-align: justify;\">Lors de la Commission &#233;largie charg&#233;e de l&#8217;examen des cr&#233;dits de la Mission R&#233;gimes sociaux et de retraite et du compte sp&#233;cial pensions le jeudi 2 novembre 2017, l&#8217;auteur de l&#8217;amendement a interrog&#233; le Ministre de l&#8217;Action et des Comptes Publics sur cette situation. En r&#233;ponse, le Ministre a propos&#233; l&#8217;organisation d&#8217;une r&#233;union de travail le mercredi 08 novembre 2017 au Minist&#232;re du Budget. Lors de cette r&#233;union, il est apparu qu&#8217;une circulaire minist&#233;rielle modifiant la circulaire DSS/3A/2014/347 du 29 d&#233;cembre 2014 relative aux nouvelles r&#232;gles applicables en mati&#232;re de cumul d&#8217;une activit&#233; r&#233;mun&#233;r&#233;e et d&#8217;une pension de vieillesse r&#233;glait la situation des pensionn&#233;s du r&#233;gime des Marins b&#233;n&#233;ficiant de retraite anticip&#233;e (PRA), liquid&#233;e pour inaptitude &#224; la navigation, une exception &#224; ce principe est introduite. Pour ces b&#233;n&#233;ficiaires, en cas de cumul d&#8217;une activit&#233; r&#233;mun&#233;r&#233;e (hors champ de la navigation) et de leur PRA, l&#8217;ouverture de nouveaux droits &#224; la retraite est autoris&#233;e.</p><p style=\"text-align: justify;\">L&#8217;auteur de l&#8217;amendement remercie le Ministre de cette avanc&#233;e qui r&#232;gle la situation des marins b&#233;n&#233;ficiant d&#8217;une PRA mais pas celle des autres marins relevant du r&#233;gime de l&#8217;ENIM.</p><p style=\"text-align: justify;\">Pour autant, la Direction de la s&#233;curit&#233; Sociale ne prend pas en compte l&#8217;&#233;tat du march&#233; de l&#8217;emploi des marins, notamment celui des personnels d&#8217;ex&#233;cution, non officiers, remplac&#233;s par des marins &#233;trangers &#224; des conditions d&#233;fiant toute concurrence. Elle oublie &#233;galement de prendre en compte les modifications prochaines de l&#8217;indemnisation des ch&#244;meurs de plus de 50 ans.</p><p style=\"text-align: justify;\">Un marin en fin de droit sera, de ce fait, pris entre deux solutions&#160;: Vivre dans la pauvret&#233; (au RSA) ou demander le paiement de sa pension au risque de terminer sa vie avec cette seule pension puisqu&#8217;il n&#8217;ouvrira plus de nouveaux droits &#224; une pension de retraite bien qu&#8217;il soit obligatoire de cotiser.</p><p style=\"text-align: justify;\">C&#8217;est la raison pour laquelle, l&#8217;objet de cet amendement est de proposer que ces dispositions ne s&#8217;appliquent que pour les marins de 45 ans et plus, non officiers, dont l&#8217;employabilit&#233; est difficile apr&#232;s une carri&#232;re maritime tant du point de vue de l&#8217;&#226;ge que des qualifications.</p>",
    "annexeExposeSommaire": {
      "@xmlns:xsi": "http://www.w3.org/2001/XMLSchema-instance",
      "@xsi:nil": "true"
    }
  },
  "representations": {
    "representation": {
      "nom": "PDF",
      "typeMime": {
        "type": "application",
        "subType": "PDF"
      },
      "statutRepresentation": {
        "verbatim": "true",
        "canonique": "true",
        "officielle": "true",
        "transcription": "false",
        "enregistrement": "false"
      },
      "repSource": {
        "@xmlns:xsi": "http://www.w3.org/2001/XMLSchema-instance",
        "@xsi:nil": "true"
      },
      "offset": {
        "@xmlns:xsi": "http://www.w3.org/2001/XMLSchema-instance",
        "@xsi:nil": "true"
      },
      "contenu": {
        "documentURI": "/15/amendements/0235C/AN/1641.pdf"
      },
      "dateDispoRepresentation": {
        "@xmlns:xsi": "http://www.w3.org/2001/XMLSchema-instance",
        "@xsi:nil": "true"
      }
    }
  },
  "seanceDiscussion": {
    "@xmlns:xsi": "http://www.w3.org/2001/XMLSchema-instance",
    "@xsi:nil": "true"
  },
  "sort": {
    "@xmlns:xsi": "http://www.w3.org/2001/XMLSchema-instance",
    "@xsi:nil": "true"
  },
  "dateDepot": "2017-11-13T01:00:00.000+01:00",
  "dateDistribution": {
    "@xmlns:xsi": "http://www.w3.org/2001/XMLSchema-instance",
    "@xsi:nil": "true"
  },
  "article99": "0",
  "loiReference": {
    "codeLoi": "loi 2014-40",
    "divisionCodeLoi": "19"
  }
}