{
  "@xmlns": "http://schemas.assemblee-nationale.fr/referentiel",
  "uid": "AMANR5L15PO419610B2272P2D1N67",
  "identifiant": {
    "legislature": "15",
    "numero": "67",
    "numRect": "0",
    "saisine": {
      "refTexteLegislatif": "PRJLANR5L15B2272",
      "numeroPartiePLF": "2",
      "organeExamen": "PO419610",
      "mentionSecondeDeliberation": "0"
    }
  },
  "numeroLong": "II-CE67",
  "etapeTexte": "1ère lecture (1ère assemblée saisie)",
  "triAmendement": "ablaaaaaaaaaaaaaaaaaaaaaaaaaaaaaaaaaaaaaaaaaaaaaaazz",
  "cardinaliteAmdtMultiples": "1",
  "amendementParent": {
    "@xmlns:xsi": "http://www.w3.org/2001/XMLSchema-instance",
    "@xsi:nil": "true"
  },
  "etat": "Discuté",
  "signataires": {
    "auteur": {
      "typeAuteur": "Depute",
      "acteurRef": "PA719504",
      "organeRef": {
        "@xmlns:xsi": "http://www.w3.org/2001/XMLSchema-instance",
        "@xsi:nil": "true"
      },
      "groupePolitiqueRef": "PO730970"
    },
    "cosignataires": {
      "acteurRef": [
        "PA720092",
        "PA722162",
        "PA720598",
        "PA720976",
        "PA720162",
        "PA719504"
      ]
    },
    "texteAffichable": "M.&#160;Lagleize,  M.&#160;Bolo, Mme&#160;Deprez-Audebert, M.&#160;Mathiasin, M.&#160;Ramos et M.&#160;Turquois"
  },
  "pointeurFragmentTexte": {
    "missionVisee": {
      "idMissionAN": "804",
      "libelleMission": "Cohésion des territoires",
      "codeMissionPLF": "B",
      "libelleMissionPLF": "Répartition, par mission et programme, des crédits du budget général"
    },
    "division": {
      "titre": "ÉTAT B",
      "articleDesignationCourte": "ART. 38",
      "type": "ANNEXE",
      "avant_A_Apres": "A",
      "divisionRattachee": "ARTICLE 38",
      "articleAdditionnel": {
        "@xmlns:xsi": "http://www.w3.org/2001/XMLSchema-instance",
        "@xsi:nil": "true"
      },
      "chapitreAdditionnel": {
        "@xmlns:xsi": "http://www.w3.org/2001/XMLSchema-instance",
        "@xsi:nil": "true"
      },
      "urlDivisionTexteVise": "/15/textes/2272C.asp#D_ETAT_B"
    },
    "alinea": {
      "@xmlns:xsi": "http://www.w3.org/2001/XMLSchema-instance",
      "@xsi:nil": "true"
    }
  },
  "corps": {
    "exposeSommaire": "<p style=\"text-align: justify;\">Cet amendement r&#233;sulte de la mission ayant pour objet la ma&#238;trise du co&#251;t du foncier dans les op&#233;rations de construction lanc&#233;e par le Premier ministre le 04 avril 2019. Cette mission a notamment pour objet d&#8217;examiner les pr&#233;rogatives mises &#224; la disposition des collectivit&#233;s locales pour mettre en &#339;uvre leur strat&#233;gie d&#8217;intervention fonci&#232;re et de proposer toute mesure de nature op&#233;rationnelle, l&#233;gislative ou r&#233;glementaire qui permettrait aux collectivit&#233;s locales de ma&#238;triser les prix des terrains et de lutter contre la sp&#233;culation fonci&#232;re.</p><p style=\"text-align: justify;\">Parmi les propositions qui seront remises au Gouvernement, figure la cr&#233;ation des Observatoires du foncier &#224; titre obligatoire dans chaque zone tendue et &#224; titre optionnel en zones d&#233;tendues. Ces observatoires du foncier auront pour objectif principal de permettre plus de transparence dans l&#8217;ensemble du march&#233; foncier sur leur territoire de comp&#233;tence, en&#160;:</p><p style=\"text-align: justify;\">&#183; &#201;tudiant les &#233;volutions en mati&#232;re de foncier sur leurs territoires de comp&#233;tence en pr&#233;sentant notamment l&#8217;&#233;volution des prix des logements, du foncier et des charges fonci&#232;res.</p><p style=\"text-align: justify;\">&#183; Pr&#233;sentant un &#233;tat des lieux des surfaces potentiellement r&#233;alisables par sur&#233;l&#233;vation des immeubles.</p><p style=\"text-align: justify;\">&#183; Recensant les friches urbaines et publiant, le cas &#233;ch&#233;ant, un rapport pr&#233;cis de pollution des sites.</p><p style=\"text-align: justify;\">&#183; Proposant aux autorit&#233;s comp&#233;tentes pour d&#233;livrer le permis de construire un prix de vente maximum des logements sociaux, interm&#233;diaires et en accession sociale, neufs &#224; construire sur une zone g&#233;ographiquement d&#233;limit&#233;e, conjointement avec la collectivit&#233; concern&#233;e ou son groupement.</p><p style=\"text-align: justify;\">&#183; D&#233;terminant les p&#233;rim&#232;tres territoriaux susceptibles en termes d&#8217;urbanisme et de march&#233; du logement de donner lieu &#224; un portage public ou semi-public du foncier &#224; travers des Offices fonciers libres ou solidaires.</p><p style=\"text-align: justify;\">Cet amendement a donc pour objet de pr&#233;voir des financements pour promouvoir la cr&#233;ation de ces Observatoires du foncier d&#232;s 2020, par exemple en lan&#231;ant un appel &#224; manifestation d&#8217;int&#233;r&#234;t aupr&#232;s des collectivit&#233;s locales et principales parties prenantes du secteur (&#233;tablissements publics foncier, agences d&#8217;urbanisme, etc.) pour qu&#8217;elles se constituent en Observatoires du foncier avec des modes de gouvernance adapt&#233;s &#224; leurs territoires.</p><p style=\"text-align: justify;\">Par ailleurs, ces financements permettront &#233;galement de participer &#224; la cr&#233;ation d&#8217;un r&#233;seau national des Observatoires du foncier, qui concilierait l&#8217;id&#233;e d&#8217;une observation effectu&#233;e &#224; l&#8217;&#233;chelle locale avec un partage des bonnes pratiques, d&#8217;ing&#233;nierie et de ressources au niveau national. Ce r&#233;seau national des Observatoires du foncier ne serait pas une structure formelle, mais un r&#233;seau d&#8217;acteurs flexible et agile se r&#233;unissant r&#233;guli&#232;rement et permettant d&#8217;&#233;changer sur les pratiques locales afin de capitaliser sur les exp&#233;riences r&#233;ussies dans l&#8217;objectif de les dupliquer.</p><p style=\"text-align: justify;\">Le pr&#233;sent amendement proc&#232;de au mouvement de cr&#233;dits suivant&#160;:</p><p style=\"text-align: justify;\">-ouverture d&#8217;un million d&#8217;euros en autorisations d&#8217;engagement et en cr&#233;dits de paiement sur l&#8217;action n&#176;&#160;7 &#171;&#160;Urbanisme et am&#233;nagement&#160;&#187; du programme 135 Urbanisme, Territoires et am&#233;lioration de l&#8217;habitat&#160;;</p><p style=\"text-align: justify;\">-annulation d&#8217;un million d&#8217;euros en autorisations d&#8217;engagement et en cr&#233;dits de paiement sur l&#8217;action n&#176;&#160;4 &#171;&#160;programme exceptionnel d&#8217;investissements en faveur de la Corse&#160;&#187; du programme 162 Interventions territoriales de l&#8217;&#201;tat.</p>",
    "annexeExposeSommaire": {
      "@xmlns:xsi": "http://www.w3.org/2001/XMLSchema-instance",
      "@xsi:nil": "true"
    },
    "cartoucheDelaiDepotDepasse": "Sous réserve de son traitement par les services de l'Assemblée nationale et de sa recevabilité",
    "avantAppel": {
      "@xmlns:xsi": "http://www.w3.org/2001/XMLSchema-instance",
      "@xsi:nil": "true"
    },
    "dispositifAmdtCredit": {
      "listeProgrammes": {
        "programme": [
          {
            "libelle": "Hébergement, parcours vers le logement et insertion des personnes vulnérables",
            "id": "72592",
            "AE": {
              "montantPositif": "0",
              "montantNegatif": "0"
            },
            "CP": {
              "montantPositif": "0",
              "montantNegatif": "0"
            },
            "action": "modification",
            "lignesCredits": null
          },
          {
            "libelle": "Aide à l'accès au logement",
            "id": "72593",
            "AE": {
              "montantPositif": "0",
              "montantNegatif": "0"
            },
            "CP": {
              "montantPositif": "0",
              "montantNegatif": "0"
            },
            "action": "modification",
            "lignesCredits": null
          },
          {
            "libelle": "Urbanisme, territoires et amélioration de l'habitat",
            "id": "72594",
            "AE": {
              "montantPositif": "1000000",
              "montantNegatif": "0"
            },
            "CP": {
              "montantPositif": "1000000",
              "montantNegatif": "0"
            },
            "action": "modification",
            "lignesCredits": null
          },
          {
            "libelle": "Impulsion et coordination de la politique d'aménagement du territoire",
            "id": "72595",
            "AE": {
              "montantPositif": "0",
              "montantNegatif": "0"
            },
            "CP": {
              "montantPositif": "0",
              "montantNegatif": "0"
            },
            "action": "modification",
            "lignesCredits": null
          },
          {
            "libelle": "Interventions territoriales de l'État",
            "id": "72596",
            "AE": {
              "montantPositif": "0",
              "montantNegatif": "1000000"
            },
            "CP": {
              "montantPositif": "0",
              "montantNegatif": "1000000"
            },
            "action": "modification",
            "lignesCredits": null
          },
          {
            "libelle": "Politique de la ville",
            "id": "72597",
            "AE": {
              "montantPositif": "0",
              "montantNegatif": "0"
            },
            "CP": {
              "montantPositif": "0",
              "montantNegatif": "0"
            },
            "action": "modification",
            "lignesCredits": null
          }
        ]
      },
      "totalAE": {
        "montantPositif": "1000000",
        "montantNegatif": "1000000",
        "solde": "0"
      },
      "totalCP": {
        "montantPositif": "1000000",
        "montantNegatif": "1000000",
        "solde": "0"
      }
    }
  },
  "representations": {
    "representation": {
      "nom": "PDF",
      "typeMime": {
        "type": "application",
        "subType": "PDF"
      },
      "statutRepresentation": {
        "verbatim": "true",
        "canonique": "true",
        "officielle": "true",
        "transcription": "false",
        "enregistrement": "false"
      },
      "repSource": {
        "@xmlns:xsi": "http://www.w3.org/2001/XMLSchema-instance",
        "@xsi:nil": "true"
      },
      "offset": {
        "@xmlns:xsi": "http://www.w3.org/2001/XMLSchema-instance",
        "@xsi:nil": "true"
      },
      "contenu": {
        "documentURI": "/15/amendements/2272C/CION-ECO/CE67.pdf"
      },
      "dateDispoRepresentation": {
        "@xmlns:xsi": "http://www.w3.org/2001/XMLSchema-instance",
        "@xsi:nil": "true"
      }
    }
  },
  "seanceDiscussion": {
    "@xmlns:xsi": "http://www.w3.org/2001/XMLSchema-instance",
    "@xsi:nil": "true"
  },
  "sort": {
    "dateSaisie": "2019-10-23T17:00:21.000+02:00",
    "sortEnSeance": "Adopté"
  },
  "dateDepot": "2019-10-18T02:00:00.000+02:00",
  "dateDistribution": "2019-10-23T02:00:00.000+02:00",
  "article99": "0",
  "loiReference": {
    "codeLoi": {
      "@xmlns:xsi": "http://www.w3.org/2001/XMLSchema-instance",
      "@xsi:nil": "true"
    },
    "divisionCodeLoi": {
      "@xmlns:xsi": "http://www.w3.org/2001/XMLSchema-instance",
      "@xsi:nil": "true"
    }
  }
}