{
  "@xmlns": "http://schemas.assemblee-nationale.fr/referentiel",
  "uid": "AMANR5L15PO59048B1255P2D1N109",
  "identifiant": {
    "legislature": "15",
    "numero": "109",
    "numRect": "0",
    "saisine": {
      "refTexteLegislatif": "PRJLANR5L15B1255",
      "numeroPartiePLF": "2",
      "organeExamen": "PO59048",
      "mentionSecondeDeliberation": "0"
    }
  },
  "numeroLong": "II-CF109",
  "etapeTexte": "1ère lecture (1ère assemblée saisie)",
  "triAmendement": "jjaaaaaaaaaaaaaaaaaaaaaaaaaaaaaaaaaaaaaaaaaaaaaaaacs",
  "cardinaliteAmdtMultiples": "1",
  "amendementParent": {
    "@xmlns:xsi": "http://www.w3.org/2001/XMLSchema-instance",
    "@xsi:nil": "true"
  },
  "etat": "Irrecevable",
  "signataires": {
    "auteur": {
      "typeAuteur": "Depute",
      "acteurRef": "PA332523",
      "organeRef": {
        "@xmlns:xsi": "http://www.w3.org/2001/XMLSchema-instance",
        "@xsi:nil": "true"
      },
      "groupePolitiqueRef": "PO730934"
    },
    "cosignataires": {
      "acteurRef": [
        "PA334654",
        "PA718884",
        "PA330909",
        "PA721474",
        "PA607090",
        "PA608016",
        "PA267260",
        "PA719318",
        "PA266776",
        "PA721054",
        "PA332523",
        "PA267204",
        "PA340853",
        "PA608416",
        "PA605036"
      ]
    },
    "texteAffichable": "Mme&#160;Dalloz,  M.&#160;Abad, M.&#160;Jean-Pierre&#160;Vigier, M.&#160;Straumann, M.&#160;Hetzel, M.&#160;Sermier, M.&#160;Leclerc, M.&#160;Lorion, Mme&#160;Anthoine, Mme&#160;Bazin-Malgras, M.&#160;Reiss, M.&#160;Viry, M.&#160;Descoeur, Mme&#160;Poletti et Mme&#160;Louwagie"
  },
  "pointeurFragmentTexte": {
    "missionVisee": {
      "@xmlns:xsi": "http://www.w3.org/2001/XMLSchema-instance",
      "@xsi:nil": "true"
    },
    "division": {
      "titre": "Article 56",
      "articleDesignationCourte": "ART. 56",
      "type": "ARTICLE",
      "avant_A_Apres": "A",
      "divisionRattachee": "ARTICLE 56",
      "articleAdditionnel": {
        "@xmlns:xsi": "http://www.w3.org/2001/XMLSchema-instance",
        "@xsi:nil": "true"
      },
      "chapitreAdditionnel": {
        "@xmlns:xsi": "http://www.w3.org/2001/XMLSchema-instance",
        "@xsi:nil": "true"
      },
      "urlDivisionTexteVise": "/15/textes/1255C.asp#D_Article_56"
    },
    "alinea": {
      "avant_A_Apres": "A",
      "numero": "10",
      "alineaDesignation": "Alinéa 10"
    }
  },
  "corps": {
    "dispositif": "<p>L&#8217;alin&#233;a 10 de l&#8217;article 56 du projet de loi de finances pour 2019 est replac&#233; comme suit :</p><p>&#171; 2. a) Toutefois, dans les deux cas mentionn&#233;s au 1, lorsque la valeur des installations techniques, mat&#233;riels et outillages pr&#233;sents dans les b&#226;timents ou sur les terrains et destin&#233;s &#224; l&#8217;activit&#233; ne d&#233;passe pas un montant fix&#233; par d&#233;cret, ces b&#226;timents et terrains ne rev&#234;tent pas un caract&#232;re industriel. Ce d&#233;cret fixe un seuil plancher, selon la nature de l&#8217;activit&#233;, en de&#231;&#224; duquel plus aucun local ne serait qualifi&#233; de local industriel.&#160;&#187;</p>",
    "exposeSommaire": "<p>S&#8217;appuyant sur le flou de la notion d&#8217;immobilisation industrielle, l&#8217;administration fiscale a multipli&#233; ces derni&#232;res ann&#233;es les requalifications en immobilisation industrielle d&#8217;entrep&#244;ts ou de b&#226;timents de stockage de produits agricoles ou manufactur&#233;s mais aussi des entreprises artisanales d&#8217;imprimerie ou des menuiseries et ce quelques soient leurs tailles.</p><p>Il en r&#233;sulte des hausses de taxes fonci&#232;res pouvant d&#233;passer les 200%.</p><p>Cette situation impose une clarification l&#233;gislative permettant d&#8217;encadrer l&#8217;action des corps de contr&#244;le et de d&#233;finir avec pr&#233;cision, et de fa&#231;on certaine, le r&#233;gime fiscal de l&#8217;article 1499 du CGI.</p><p>A d&#233;faut de d&#233;finition pr&#233;cise de la notion d&#8217;immobilisation industrielle, l&#8217;article 56 du projet de loi de finances pour 2019 propose de clarifier la notion de local industriel par un seuil plancher en de&#231;&#224; duquel aucun local ne pourrait plus &#234;tre qualifi&#233; de local industriel. Exprim&#233; en valeur des moyens techniques par local, ce seuil fix&#233; &#224; un montant de l&#8217;ordre de 300 000 &#8364; est inappropri&#233; et ne permettra pas d&#8217;apporter une r&#233;ponse aux inqui&#233;tudes exprim&#233;es par les entreprises et ainsi de les s&#233;curiser.</p><p>En effet, selon les secteurs d&#8217;activit&#233;, le caract&#232;re capitalistique de l&#8217;activit&#233; n&#8217;est pas le m&#234;me. Une entreprise peut avoir une faible taille tout en ayant un montant d&#8217;&#233;quipements tr&#232;s &#233;lev&#233;.</p><p>Avec ce seuil, les locaux utilis&#233;s par de petites entreprises de transformation ou de prestations de service, tels que, par exemple, les locaux d'un menuisier, d'un garagiste ou d'un entrep&#244;t, pourraient encore &#234;tre susceptibles d&#8217;&#234;tre consid&#233;r&#233;s comme des locaux industriels.</p><p>C&#8217;est pourquoi, il est propos&#233; par cet amendement de renvoyer &#224; un d&#233;cret le montant plancher en de&#231;&#224; duquel plus aucun local ne serait qualifi&#233; de local industriel. Ce seuil prendrait en compte la nature de l&#8217;activit&#233; et la typologie de l&#8217;entreprise.</p><p>&#160;</p>",
    "annexeExposeSommaire": {
      "@xmlns:xsi": "http://www.w3.org/2001/XMLSchema-instance",
      "@xsi:nil": "true"
    }
  },
  "representations": {
    "representation": {
      "nom": "PDF",
      "typeMime": {
        "type": "application",
        "subType": "PDF"
      },
      "statutRepresentation": {
        "verbatim": "true",
        "canonique": "true",
        "officielle": "true",
        "transcription": "false",
        "enregistrement": "false"
      },
      "repSource": {
        "@xmlns:xsi": "http://www.w3.org/2001/XMLSchema-instance",
        "@xsi:nil": "true"
      },
      "offset": {
        "@xmlns:xsi": "http://www.w3.org/2001/XMLSchema-instance",
        "@xsi:nil": "true"
      },
      "contenu": {
        "documentURI": "/15/amendements/1255C/CION_FIN/CF109.pdf"
      },
      "dateDispoRepresentation": {
        "@xmlns:xsi": "http://www.w3.org/2001/XMLSchema-instance",
        "@xsi:nil": "true"
      }
    }
  },
  "seanceDiscussion": {
    "@xmlns:xsi": "http://www.w3.org/2001/XMLSchema-instance",
    "@xsi:nil": "true"
  },
  "sort": {
    "@xmlns:xsi": "http://www.w3.org/2001/XMLSchema-instance",
    "@xsi:nil": "true"
  },
  "dateDepot": "2018-10-17T02:00:00.000+02:00",
  "dateDistribution": {
    "@xmlns:xsi": "http://www.w3.org/2001/XMLSchema-instance",
    "@xsi:nil": "true"
  },
  "article99": "0",
  "loiReference": {
    "codeLoi": {
      "@xmlns:xsi": "http://www.w3.org/2001/XMLSchema-instance",
      "@xsi:nil": "true"
    },
    "divisionCodeLoi": {
      "@xmlns:xsi": "http://www.w3.org/2001/XMLSchema-instance",
      "@xsi:nil": "true"
    }
  }
}