{
  "@xmlns": "http://schemas.assemblee-nationale.fr/referentiel",
  "uid": "AMANR5L15PO419610B2336P0D1N9",
  "identifiant": {
    "legislature": "15",
    "numero": "9",
    "numRect": "0",
    "saisine": {
      "refTexteLegislatif": "PIONANR5L15B2336",
      "numeroPartiePLF": "0",
      "organeExamen": "PO419610",
      "mentionSecondeDeliberation": "0"
    }
  },
  "numeroLong": "CE9",
  "etapeTexte": "1ère lecture (1ère assemblée saisie)",
  "triAmendement": "laaaaaaaaaaaaaaaaaaaaaaaaaaaaaaaaaaaaaaaaaaaaaaaaaab",
  "cardinaliteAmdtMultiples": "1",
  "amendementParent": {
    "@xmlns:xsi": "http://www.w3.org/2001/XMLSchema-instance",
    "@xsi:nil": "true"
  },
  "etat": "Discuté",
  "signataires": {
    "auteur": {
      "typeAuteur": "Depute",
      "acteurRef": "PA719146",
      "organeRef": {
        "@xmlns:xsi": "http://www.w3.org/2001/XMLSchema-instance",
        "@xsi:nil": "true"
      },
      "groupePolitiqueRef": "PO759900"
    },
    "cosignataires": {
      "acteurRef": [
        "PA405480",
        "PA719138",
        "PA605694",
        "PA719146",
        "PA719286",
        "PA336175"
      ]
    },
    "texteAffichable": "M.&#160;Acquaviva,  M.&#160;Castellani, M.&#160;Colombani, M.&#160;Falorni, Mme&#160;Pinel et M.&#160;Pupponi"
  },
  "pointeurFragmentTexte": {
    "missionVisee": {
      "@xmlns:xsi": "http://www.w3.org/2001/XMLSchema-instance",
      "@xsi:nil": "true"
    },
    "division": {
      "titre": "Article 7",
      "articleDesignationCourte": "APRÈS ART. 7",
      "type": "ARTICLE",
      "avant_A_Apres": "Après",
      "divisionRattachee": "APRÈS L'ARTICLE 7, insérer l'article suivant:",
      "articleAdditionnel": "1",
      "chapitreAdditionnel": {
        "@xmlns:xsi": "http://www.w3.org/2001/XMLSchema-instance",
        "@xsi:nil": "true"
      },
      "urlDivisionTexteVise": "/15/textes/2336.asp#D_Article_7"
    },
    "alinea": {
      "@xmlns:xsi": "http://www.w3.org/2001/XMLSchema-instance",
      "@xsi:nil": "true"
    }
  },
  "corps": {
    "dispositif": "<p>Apr&#232;s l&#8217;article L.&#160;4424&#8209;9 du code g&#233;n&#233;ral des collectivit&#233;s territoriales, il est ins&#233;r&#233; un nouvel article ainsi r&#233;dig&#233;&#160;:</p><p style=\"text-align: justify;\">&#171;&#160;<i>Art.&#160;L.&#160;4424&#8209;9&#8209;1</i>.&#8211; Le plan d&#8217;am&#233;nagement et de d&#233;veloppement durable de Corse d&#233;finit des crit&#232;res visant &#224; cr&#233;er des zones communales d&#8217;&#233;quilibre territorial et social dans lesquelles l&#8217;accession sociale &#224; la propri&#233;t&#233;, la construction de logements sociaux et les activit&#233;s industrielles, commerciales et lib&#233;rales, hors location saisonni&#232;re non professionnelle et grande distribution, sont exclusives.</p><p style=\"text-align: justify;\">&#171;&#160;Les plans locaux d&#8217;urbanisme et les sch&#233;mas de coh&#233;rence territoriale identifient et d&#233;limitent ces zones ou parties de zones d&#233;finies au premier alin&#233;a et les int&#232;grent obligatoirement.&#160;&#187;</p>",
    "exposeSommaire": "<p style=\"text-align: justify;\">Afin de favoriser la mixit&#233; sociale, de stimuler l&#8217;activit&#233; &#233;conomique et de r&#233;sorber le d&#233;s&#233;quilibre social grandissant entre r&#233;sidents permanents et vacanciers d&#251; &#224; la trop forte proportion de r&#233;sidences secondaires dans certains centres-villes, centre-bourgs, hameaux ou quartiers des communes de Corse, il convient de permettre aux plan locaux d&#8217;urbanisme, en lien avec le plan d&#8217;am&#233;nagement et de d&#233;veloppement durable de Corse (PADDUC) de d&#233;finir des zones dans lesquelles la construction de logements &#224; des fins de r&#233;sidences secondaires n&#8217;est pas permise.</p><p style=\"text-align: justify;\">Pour rappel, la proportion de r&#233;sidences secondaires en Corse s&#8217;&#233;l&#232;ve &#224; 37&#160;% contre 8,9&#160;% en France m&#233;tropolitaine. Certaines villes du littoral corse comme Portivechju (Porto-Vecchio) affiche un taux de r&#233;sidences secondaires de l&#8217;ordre de 56,4&#160;%.</p><p style=\"text-align: justify;\">Compte tenu de la forte attractivit&#233; touristique de l&#8217;&#238;le, la Corse connait un accroissement marqu&#233; de la sp&#233;culation fonci&#232;re et immobili&#232;re aboutissant &#224; une probl&#233;matique d&#8217;acc&#232;s au foncier et au logement, corr&#233;l&#233;e &#224; une paup&#233;risation d&#8217;une part importante des insulaires (1 Corse sur 5 vit sous le seuil de pauvret&#233;&#160;; le revenu annuel m&#233;dian en Corse est de 18&#160;965&#160;&#8364; alors qu&#8217;il est de 20&#160;369&#160;&#8364; en France m&#233;tropolitaine).</p><p style=\"text-align: justify;\">Entre 2006 et 2019, selon les chiffres de l&#8217;Observatoire des march&#233;s fonciers et immobiliers (OMFI), cr&#233;&#233; en juillet 2017 par la Collectivit&#233; de Corse, le co&#251;t du logement a augment&#233; 2 fois plus vite sur l&#8217;&#238;le que sur le continent (+ 68&#160;% dans l&#8217;&#238;le contre + 36&#160;% sur le continent). Le co&#251;t du foncier a augment&#233; quant &#224; lui 4 fois plus vite sur l&#8217;&#238;le que sur le continent (+ 138&#160;% contre + 64&#160;%). A noter &#233;galement le faible taux de logement social en Corse qui ne s&#8217;&#233;l&#232;ve qu&#8217;&#224; 10&#160;% contre une moyenne hexagonale de 17&#160;%.</p><p style=\"text-align: justify;\">Ce sont les raisons pour lesquelles, cet amendement propose de proc&#233;der &#224; un r&#233;&#233;quilibrage territorial et social de la Corse par la cr&#233;ation de zones d&#8217;&#233;quilibre &#224; l&#8217;int&#233;rieur des communes par le biais du PADDUC et des PLU qui privil&#233;gieraient les r&#233;sidences principales, la construction de logements sociaux et les activit&#233;s &#233;conomiques.</p><p style=\"text-align: justify;\">&#160;</p>",
    "annexeExposeSommaire": {
      "@xmlns:xsi": "http://www.w3.org/2001/XMLSchema-instance",
      "@xsi:nil": "true"
    },
    "cartoucheDelaiDepotDepasse": {
      "@xmlns:xsi": "http://www.w3.org/2001/XMLSchema-instance",
      "@xsi:nil": "true"
    },
    "avantAppel": {
      "@xmlns:xsi": "http://www.w3.org/2001/XMLSchema-instance",
      "@xsi:nil": "true"
    }
  },
  "representations": {
    "representation": {
      "nom": "PDF",
      "typeMime": {
        "type": "application",
        "subType": "PDF"
      },
      "statutRepresentation": {
        "verbatim": "true",
        "canonique": "true",
        "officielle": "true",
        "transcription": "false",
        "enregistrement": "false"
      },
      "repSource": {
        "@xmlns:xsi": "http://www.w3.org/2001/XMLSchema-instance",
        "@xsi:nil": "true"
      },
      "offset": {
        "@xmlns:xsi": "http://www.w3.org/2001/XMLSchema-instance",
        "@xsi:nil": "true"
      },
      "contenu": {
        "documentURI": "/15/amendements/2336/CION-ECO/CE9.pdf"
      },
      "dateDispoRepresentation": {
        "@xmlns:xsi": "http://www.w3.org/2001/XMLSchema-instance",
        "@xsi:nil": "true"
      }
    }
  },
  "seanceDiscussion": {
    "@xmlns:xsi": "http://www.w3.org/2001/XMLSchema-instance",
    "@xsi:nil": "true"
  },
  "sort": {
    "dateSaisie": "2019-11-20T17:29:17.000+01:00",
    "sortEnSeance": "Rejeté"
  },
  "dateDepot": "2019-11-15T01:00:00.000+01:00",
  "dateDistribution": "2019-11-19T01:00:00.000+01:00",
  "article99": "0",
  "loiReference": {
    "codeLoi": "CGCT",
    "divisionCodeLoi": "L4424-9-1"
  }
}