{
  "@xmlns": "http://schemas.assemblee-nationale.fr/referentiel",
  "uid": "AMANR5L15PO59048B2272P2D1N386",
  "identifiant": {
    "legislature": "15",
    "numero": "386",
    "numRect": "0",
    "saisine": {
      "refTexteLegislatif": "PRJLANR5L15B2272",
      "numeroPartiePLF": "2",
      "organeExamen": "PO59048",
      "mentionSecondeDeliberation": "0"
    }
  },
  "numeroLong": "II-CF386",
  "etapeTexte": "1ère lecture (1ère assemblée saisie)",
  "triAmendement": "ajfaaaaaaaaaaaaaaaaaaaaaaaaaaaaaaaaaaaaaaaaaaaaaaajdi",
  "cardinaliteAmdtMultiples": "1",
  "amendementParent": {
    "@xmlns:xsi": "http://www.w3.org/2001/XMLSchema-instance",
    "@xsi:nil": "true"
  },
  "etat": "Discuté",
  "signataires": {
    "auteur": {
      "typeAuteur": "Depute",
      "acteurRef": "PA720892",
      "organeRef": {
        "@xmlns:xsi": "http://www.w3.org/2001/XMLSchema-instance",
        "@xsi:nil": "true"
      },
      "groupePolitiqueRef": "PO730958"
    },
    "cosignataires": {
      "acteurRef": [
        "PA718860",
        "PA720892",
        "PA2150",
        "PA720286",
        "PA721960",
        "PA721210",
        "PA720846",
        "PA720422",
        "PA719676",
        "PA722142",
        "PA720430",
        "PA721202",
        "PA588884",
        "PA721226",
        "PA719578",
        "PA721062",
        "PA718868"
      ]
    },
    "texteAffichable": "Mme&#160;Panot,  Mme&#160;Autain, M.&#160;Bernalicis, M.&#160;Coquerel, rapporteur M.&#160;Corbi&#232;re, Mme&#160;Fiat, M.&#160;Lachaud, M.&#160;Larive, M.&#160;M&#233;lenchon, Mme&#160;Obono, M.&#160;Prud&apos;homme, M.&#160;Quatennens, M.&#160;Ratenon, Mme&#160;Ressiguier, Mme&#160;Rubin, M.&#160;Ruffin et Mme&#160;Taurine"
  },
  "pointeurFragmentTexte": {
    "missionVisee": {
      "idMissionAN": "810",
      "libelleMission": "Écologie, développement et mobilité durables",
      "codeMissionPLF": "B",
      "libelleMissionPLF": "Répartition, par mission et programme, des crédits du budget général"
    },
    "division": {
      "titre": "Article 76",
      "articleDesignationCourte": "APRÈS ART. 76",
      "type": "ARTICLE",
      "avant_A_Apres": "Après",
      "divisionRattachee": "APRÈS L'ARTICLE 76, insérer l'article suivant:",
      "articleAdditionnel": "1",
      "chapitreAdditionnel": {
        "@xmlns:xsi": "http://www.w3.org/2001/XMLSchema-instance",
        "@xsi:nil": "true"
      },
      "urlDivisionTexteVise": "/15/textes/2272C.asp#D_Article_76"
    },
    "alinea": {
      "@xmlns:xsi": "http://www.w3.org/2001/XMLSchema-instance",
      "@xsi:nil": "true"
    }
  },
  "corps": {
    "dispositif": "<p style=\"text-align: justify;\">Dans un d&#233;lai de six mois &#224; compter de la promulgation de la pr&#233;sente loi, le Gouvernement remet au Parlement un rapport portant sur les cons&#233;quences des baisses d&#8217;effectifs du minist&#232;re de l&#8217;&#233;cologie et de ses op&#233;rateurs.</p><p style=\"text-align: justify;\">Ce rapport &#233;value notamment les cons&#233;quences en termes de d&#233;perdition de transmission des comp&#233;tences et des savoirs-faire au d&#233;triment d&#8217;une v&#233;ritable transition &#233;cologique au service de l&#8217;int&#233;r&#234;t g&#233;n&#233;ral.</p>",
    "exposeSommaire": "<p style=\"text-align: justify;\">Un rapport doit &#234;tre remis par le Gouvernement au Parlement &#224; compter de 2021, et dressera une &#233;valuation du budget au regard des objectifs de la France en mati&#232;re d&#8217;environnement et de biodiversit&#233;. Nous pensons que ce rapport doit int&#233;grer les cons&#233;quences des coupes budg&#233;taires et de r&#233;duction des effectifs au d&#233;triment d&#8217;un r&#233;el pilotage de la transition &#233;cologique. Tel est l&#8217;objet de cet amendement.<br /><br /> En effet, aujourd&#8217;hui, l&#8217;&#201;tat n&#8217;a plus les outils de son ambition. Le d&#233;mant&#232;lement de l&#8217;&#201;tat est en marche. L&#8217;action du Gouvernement en mati&#232;re de politiques de d&#233;veloppement durable se r&#233;duit, les moyens manquent tant en qualit&#233; qu&#8217;en quantit&#233;. Une politique de coupes budg&#233;taires drastiques et de r&#233;duction des effectifs de la fonction publique est actuellement conduite.<br /><br /> C&#8217;est toute l&#8217;expertise de l&#8217;&#201;tat qui est &#224; terme menac&#233;e par cette situation. Alors qu&#8217;une n&#233;cessaire planification de la transition &#233;cologique requiert du personnel public hautement qualifi&#233; et que seul l&#8217;&#201;tat et ses op&#233;rateurs sont en mesure d&#8217;assumer le r&#244;le de bureau d&#8217;&#233;tude et d&#8217;expertise, entre 2009 et 2018, les effectifs du minist&#232;re de la transition &#233;cologique et solidaire ont fondu de 27 000 ETP. 7248 ETP ont &#233;t&#233; supprim&#233;s entre 2017 et 2019, soit 12,2&#160;% des effectifs. Et le Gouvernement annonce une r&#233;duction de presque 5000 ETP suppl&#233;mentaire d&#8217;ici 2022.<br /><br /> A titre d&#8217;exemple, prenons la situation du CEREMA. En 2018, 103 ETP en moins. En 2019, 101 ETP en moins et baisse de 5 millions de dotation pour charges de service public, soit une baisse de 2,25&#160;% de son budget. Pour 2020, le Gouvernement annonce &#224; nouveau une baisse 5 millions pour charges de service public en PLF2020 et la suppression de 101 ETP&#160;! Une r&#233;duction drastique compens&#233;e par la hausse de 50 emplois hors plafond, dont 37 contrats &#224; dur&#233;e d&#233;termin&#233;e. Cette contractualisation contribue &#233;galement &#224; la fuite de savoirs et de comp&#233;tences, autant qu&#8217;elle pr&#233;carise les travailleurs.<br /><br /> Cela nous para&#238;t tr&#232;s inqui&#233;tant, &#224; l&#8217;heure o&#249; les actions de protection de milieux comme de nouvel am&#233;nagement du territoire conform&#233;ment aux exigences de transition &#233;cologique m&#233;riteraient d&#8217;&#234;tre intensifi&#233;es.</p>",
    "annexeExposeSommaire": {
      "@xmlns:xsi": "http://www.w3.org/2001/XMLSchema-instance",
      "@xsi:nil": "true"
    },
    "cartoucheDelaiDepotDepasse": {
      "@xmlns:xsi": "http://www.w3.org/2001/XMLSchema-instance",
      "@xsi:nil": "true"
    },
    "avantAppel": {
      "@xmlns:xsi": "http://www.w3.org/2001/XMLSchema-instance",
      "@xsi:nil": "true"
    }
  },
  "representations": {
    "representation": {
      "nom": "PDF",
      "typeMime": {
        "type": "application",
        "subType": "PDF"
      },
      "statutRepresentation": {
        "verbatim": "true",
        "canonique": "true",
        "officielle": "true",
        "transcription": "false",
        "enregistrement": "false"
      },
      "repSource": {
        "@xmlns:xsi": "http://www.w3.org/2001/XMLSchema-instance",
        "@xsi:nil": "true"
      },
      "offset": {
        "@xmlns:xsi": "http://www.w3.org/2001/XMLSchema-instance",
        "@xsi:nil": "true"
      },
      "contenu": {
        "documentURI": "/15/amendements/2272C/CION_FIN/CF386.pdf"
      },
      "dateDispoRepresentation": {
        "@xmlns:xsi": "http://www.w3.org/2001/XMLSchema-instance",
        "@xsi:nil": "true"
      }
    }
  },
  "seanceDiscussion": {
    "@xmlns:xsi": "http://www.w3.org/2001/XMLSchema-instance",
    "@xsi:nil": "true"
  },
  "sort": {
    "dateSaisie": "2019-10-24T18:17:06.000+02:00",
    "sortEnSeance": "Rejeté"
  },
  "dateDepot": "2019-10-18T02:00:00.000+02:00",
  "dateDistribution": "2019-10-24T02:00:00.000+02:00",
  "article99": "0",
  "loiReference": {
    "codeLoi": "zz rapport",
    "divisionCodeLoi": {
      "@xmlns:xsi": "http://www.w3.org/2001/XMLSchema-instance",
      "@xsi:nil": "true"
    }
  }
}