{
  "@xmlns": "http://schemas.assemblee-nationale.fr/referentiel",
  "uid": "AMANR5L15PO59051B1106P0D1N26",
  "identifiant": {
    "legislature": "15",
    "numero": "26",
    "numRect": "0",
    "saisine": {
      "refTexteLegislatif": "PRJLANR5L15B1106",
      "numeroPartiePLF": "0",
      "organeExamen": "PO59051",
      "mentionSecondeDeliberation": "0"
    }
  },
  "numeroLong": "CL26",
  "etapeTexte": "Nouvelle Lecture",
  "triAmendement": "o",
  "cardinaliteAmdtMultiples": "1",
  "amendementParent": {
    "@xmlns:xsi": "http://www.w3.org/2001/XMLSchema-instance",
    "@xsi:nil": "true"
  },
  "etat": "Discuté",
  "signataires": {
    "auteur": {
      "typeAuteur": "Depute",
      "acteurRef": "PA721960",
      "organeRef": {
        "@xmlns:xsi": "http://www.w3.org/2001/XMLSchema-instance",
        "@xsi:nil": "true"
      },
      "groupePolitiqueRef": "PO730958"
    },
    "cosignataires": {
      "acteurRef": [
        "PA720846",
        "PA720892",
        "PA721226",
        "PA722142",
        "PA720430",
        "PA718860",
        "PA721062",
        "PA720286",
        "PA719578",
        "PA721210",
        "PA588884",
        "PA719676",
        "PA721202",
        "PA721960",
        "PA2150",
        "PA720422",
        "PA718868"
      ]
    },
    "texteAffichable": "Mme&#160;Obono,  Mme&#160;Autain, M.&#160;Bernalicis, M.&#160;Coquerel, M.&#160;Corbi&#232;re, Mme&#160;Fiat, M.&#160;Lachaud, M.&#160;Larive, M.&#160;M&#233;lenchon, Mme&#160;Panot, M.&#160;Prud&apos;homme, M.&#160;Quatennens, M.&#160;Ratenon, Mme&#160;Ressiguier, Mme&#160;Rubin, M.&#160;Ruffin et Mme&#160;Taurine"
  },
  "pointeurFragmentTexte": {
    "missionVisee": {
      "@xmlns:xsi": "http://www.w3.org/2001/XMLSchema-instance",
      "@xsi:nil": "true"
    },
    "division": {
      "titre": "Article 33 ter",
      "articleDesignationCourte": "ART. 33 TER",
      "type": "ARTICLE",
      "avant_A_Apres": "A",
      "divisionRattachee": "ARTICLE 33 TER",
      "articleAdditionnel": {
        "@xmlns:xsi": "http://www.w3.org/2001/XMLSchema-instance",
        "@xsi:nil": "true"
      },
      "chapitreAdditionnel": {
        "@xmlns:xsi": "http://www.w3.org/2001/XMLSchema-instance",
        "@xsi:nil": "true"
      },
      "urlDivisionTexteVise": "/15/textes/1106.asp#D_Article_33_ter"
    },
    "alinea": {
      "avant_A_Apres": "Apres",
      "numero": "5",
      "alineaDesignation": {
        "@xmlns:xsi": "http://www.w3.org/2001/XMLSchema-instance",
        "@xsi:nil": "true"
      }
    }
  },
  "corps": {
    "dispositif": "<p style=\"text-align: justify;\">Compl&#233;ter cet article par les cinq alin&#233;as suivants&#160;:</p><p style=\"text-align: justify;\">&#171;&#160;Apr&#232;s l&#8217;article L.&#160;313&#8209;14 du code de l&#8217;entr&#233;e et du s&#233;jour des &#233;trangers et du droit d&#8217;asile, il est ins&#233;r&#233; l&#8217;article L.&#160;313&#8209;14&#8209;1 ainsi r&#233;dig&#233;&#160;:</p><p style=\"text-align: justify;\">&#171;&#160;&#171;&#160;<i>Art.&#160;L.&#160;313&#8209;14&#8209;1</i>. &#8211; Une carte de s&#233;jour pluriannuelle est d&#233;livr&#233;e de plein droit&#160;:</p><p style=\"text-align: justify;\">&#171;&#160;&#171;&#160;1&#176; &#192; l&#8217;&#233;tranger r&#233;sidant habituellement en France et titulaire d&#8217;un contrat &#224; dur&#233;e ind&#233;termin&#233;e, auquel cas la carte de s&#233;jour pluriannuelle porte la mention &#171;&#160;salari&#233;&#160;&#187;, ou d&#8217;un contrat &#224; dur&#233;e d&#233;termin&#233;e, auquel cas la carte de s&#233;jour pluriannuelle porte la mention &#171;&#160;travailleur temporaire&#160;&#187;&#160;;</p><p style=\"text-align: justify;\">&#171;&#160;&#171;&#160;2&#176; &#192; l&#8217;&#233;tranger qui justifie par tout moyen &#234;tre inscrit dans un &#233;tablissement d&#8217;enseignement sup&#233;rieur fran&#231;ais sur le territoire fran&#231;ais, ou avoir &#233;t&#233; inscrit depuis plus de six mois dans l&#8217;un d&#8217;eux&#160;;</p><p style=\"text-align: justify;\">&#171;&#160;&#171;&#160;3&#176; &#192; l&#8217;&#233;tranger qui est p&#232;re ou m&#232;re d&#8217;un enfant scolaris&#233; dans un &#233;tablissement scolaire fran&#231;ais &#224; la condition qu&#8217;il exerce m&#234;me partiellement l&#8217;autorit&#233; parentale au sens de la section 3 du chapitre I<sup>er</sup> du titre IX du livre Ier du code civil &#224; l&#8217;&#233;gard de cet enfant ou qu&#8217;il subvienne effectivement &#224; ses besoins. Lorsque la qualit&#233; de p&#232;re ou de m&#232;re d&#8217;un enfant scolaris&#233; dans un &#233;tablissement scolaire fran&#231;ais r&#233;sulte d&#8217;une reconnaissance de l&#8217;enfant post&#233;rieure &#224; la naissance, la carte de s&#233;jour pluriannuelle n&#8217;est d&#233;livr&#233;e &#224; l&#8217;&#233;tranger que s&#8217;il subvient &#224; ses besoins depuis sa naissance ou depuis au moins un an.&#160;&#187;&#160;&#187;</p>",
    "exposeSommaire": "<p style=\"line-height: 1.2; margin: 0pt 11pt 0pt 4pt; text-align: justify;\">Cet amendement s&#8217;inscrit dans la continuit&#233; de l&#8217;esprit de la circulaire dite &#171; Valls &#187; de 2012 pr&#233;sent&#233;e comme une circulaire de r&#233;gularisation.</p><p style=\"line-height: 1.2; margin: 0pt 11pt 0pt 4pt; text-align: justify;\">&#160;</p><p style=\"line-height: 1.2; margin: 0pt 11pt 0pt 4pt; text-align: justify;\">Plus de 200 000 selon la police, environ 400 000 selon les associations &#8211; soit moins de 1 % de la population fran&#231;aise &#8211; le nombre de travailleurs sans-papiers pr&#233;sents sur le territoire est par d&#233;finition difficile &#224; &#233;valuer. Dans un rapport sur &#171; le recrutement des travailleurs immigr&#233;s en France &#187;, l&#8217;OCDE (Organisation pour la coop&#233;ration et le d&#233;veloppement &#233;conomique) &#233;value &#224; quelques milliers le nombre de sans-papiers r&#233;gularis&#233;s chaque ann&#233;e &#171; pour motif &#233;conomique &#187; (5.000 en 2015, 6.400 en 2016). Par cons&#233;quent, plusieurs centaines de milliers de personnes travaillent dans l&#8217;ins&#233;curit&#233; la plus totale, alors m&#234;me que ceux-ci payent leurs cotisations sociales et leurs imp&#244;ts locaux. Ces personnes doivent sortir du r&#233;gime de la peur en se voyant octroyer un titre de s&#233;jour sur pr&#233;sentation d&#8217;un contrat de travail, afin qu&#8217;ils puissent faire valoir leurs droits lorsque ceux-ci sont ni&#233;s.</p><p style=\"line-height: 1.2; margin: 0pt 11pt 0pt 4pt; text-align: justify;\">&#160;</p><p style=\"line-height: 1.2; margin: 0pt 11pt 0pt 4pt; text-align: justify;\">Les employeurs participeront &#224; la r&#233;gularisation de leurs employ&#233;s sans-papiers en les accompagnant dans leurs d&#233;marches administratives. Bien qu&#8217;il nous paraisse peu probable que des employeurs entravent volontairement l&#8217;acc&#232;s &#224; un statut juridique reconnu &#224; leurs salari&#233;s, nous pr&#233;conisons des peines d&#8217;amende et de prison pour les employeurs r&#233;calcitrants.</p>",
    "annexeExposeSommaire": {
      "@xmlns:xsi": "http://www.w3.org/2001/XMLSchema-instance",
      "@xsi:nil": "true"
    }
  },
  "representations": {
    "representation": {
      "nom": "PDF",
      "typeMime": {
        "type": "application",
        "subType": "PDF"
      },
      "statutRepresentation": {
        "verbatim": "true",
        "canonique": "true",
        "officielle": "true",
        "transcription": "false",
        "enregistrement": "false"
      },
      "repSource": {
        "@xmlns:xsi": "http://www.w3.org/2001/XMLSchema-instance",
        "@xsi:nil": "true"
      },
      "offset": {
        "@xmlns:xsi": "http://www.w3.org/2001/XMLSchema-instance",
        "@xsi:nil": "true"
      },
      "contenu": {
        "documentURI": "/15/amendements/1106/CION_LOIS/CL26.pdf"
      },
      "dateDispoRepresentation": {
        "@xmlns:xsi": "http://www.w3.org/2001/XMLSchema-instance",
        "@xsi:nil": "true"
      }
    }
  },
  "seanceDiscussion": {
    "@xmlns:xsi": "http://www.w3.org/2001/XMLSchema-instance",
    "@xsi:nil": "true"
  },
  "sort": {
    "dateSaisie": "2018-07-18T12:13:46.000+02:00",
    "sortEnSeance": "Tombé"
  },
  "dateDepot": "2018-07-05T02:00:00.000+02:00",
  "dateDistribution": "2018-07-10T02:00:00.000+02:00",
  "article99": "0",
  "loiReference": {
    "codeLoi": {
      "@xmlns:xsi": "http://www.w3.org/2001/XMLSchema-instance",
      "@xsi:nil": "true"
    },
    "divisionCodeLoi": {
      "@xmlns:xsi": "http://www.w3.org/2001/XMLSchema-instance",
      "@xsi:nil": "true"
    }
  }
}