{
  "@xmlns": "http://schemas.assemblee-nationale.fr/referentiel",
  "uid": "AMANR5L15SEA717460BTC1974P0D1N108",
  "identifiant": {
    "legislature": "15",
    "numero": "108",
    "numRect": "0",
    "saisine": {
      "refTexteLegislatif": "PRJLANR5L15BTC1974",
      "numeroPartiePLF": "0",
      "organeExamen": "PO717460",
      "mentionSecondeDeliberation": "0"
    }
  },
  "numeroLong": "108",
  "etapeTexte": "1ère lecture (2ème assemblée saisie)",
  "triAmendement": "jmaaaaaaaaaaaaaaaaaaaaaaaaaaaaaaaaaaaaaaaaaaaaaaaabl",
  "cardinaliteAmdtMultiples": "1",
  "amendementParent": {
    "@xmlns:xsi": "http://www.w3.org/2001/XMLSchema-instance",
    "@xsi:nil": "true"
  },
  "etat": "Discuté",
  "signataires": {
    "auteur": {
      "typeAuteur": "Depute",
      "acteurRef": "PA721968",
      "organeRef": {
        "@xmlns:xsi": "http://www.w3.org/2001/XMLSchema-instance",
        "@xsi:nil": "true"
      },
      "groupePolitiqueRef": "PO730934"
    },
    "cosignataires": {
      "acteurRef": [
        "PA267204",
        "PA346218",
        "PA719318",
        "PA721678",
        "PA721474",
        "PA721816",
        "PA608016",
        "PA340853",
        "PA718884",
        "PA267260",
        "PA267429",
        "PA722390",
        "PA721054",
        "PA720630",
        "PA605036",
        "PA721968",
        "PA643089",
        "PA2377",
        "PA334654",
        "PA720210",
        "PA643134",
        "PA718780",
        "PA2086",
        "PA606712",
        "PA718784"
      ]
    },
    "texteAffichable": "M.&#160;Vialay,  M.&#160;Thi&#233;riot, Mme&#160;Bazin-Malgras, Mme&#160;Anthoine, M.&#160;Leclerc, M.&#160;Marlin, M.&#160;Lurton, M.&#160;Cinieri, M.&#160;Straumann, M.&#160;Sermier, M.&#160;Masson, Mme&#160;Trastour-Isnart, Mme&#160;Corneloup, Mme&#160;Louwagie, Mme&#160;Poletti, M.&#160;Reda, M.&#160;Lorion, M.&#160;Abad, M.&#160;Minot, M.&#160;Viry, M.&#160;Boucard, Mme&#160;Beauvais, M.&#160;Pauget, M.&#160;Perrut et Mme&#160;Valentin"
  },
  "pointeurFragmentTexte": {
    "missionVisee": {
      "@xmlns:xsi": "http://www.w3.org/2001/XMLSchema-instance",
      "@xsi:nil": "true"
    },
    "division": {
      "titre": "Article 33",
      "articleDesignationCourte": "APRÈS ART. 33",
      "type": "ARTICLE",
      "avant_A_Apres": "Après",
      "divisionRattachee": "APRÈS L'ARTICLE 33, insérer l'article suivant:",
      "articleAdditionnel": "1",
      "chapitreAdditionnel": {
        "@xmlns:xsi": "http://www.w3.org/2001/XMLSchema-instance",
        "@xsi:nil": "true"
      },
      "urlDivisionTexteVise": "/15/textes/1974.asp#D_Article_33"
    },
    "alinea": {
      "@xmlns:xsi": "http://www.w3.org/2001/XMLSchema-instance",
      "@xsi:nil": "true"
    }
  },
  "corps": {
    "dispositif": "<p style=\"text-align: justify;\">Le premier alin&#233;a de l&#8217;article L.&#160;114&#8209;2 du code de la s&#233;curit&#233; int&#233;rieure est compl&#233;t&#233; par une phrase ainsi r&#233;dig&#233;e&#160;:</p><p style=\"text-align: justify;\">&#171;&#160;Les emplois pouvant faire l&#8217;objet d&#8217;enqu&#234;te concernent les salari&#233;s, les personnels mis &#224; disposition et les personnels du ou des sous-traitants intervenant au sein des entreprises pr&#233;cit&#233;es.&#160;&#187;</p>",
    "exposeSommaire": "<p style=\"text-align: justify;\">L&#8217;article L114&#8209;2 du code de la s&#233;curit&#233; int&#233;rieure&#160;liste les fonctions sensibles pour lesquelles le salari&#233; pressenti d&#8217;une entreprise de transport publics de personnes ou de transport de marchandises dangereuses pressenti peut faire l&#8217;objet d&#8217;une enqu&#234;te administrative afin de v&#233;rifier si la personne concern&#233;e est compatible avec la s&#251;ret&#233; des personnes et des biens.</p><p style=\"text-align: justify;\">Cet amendement vise &#224; &#233;largir cette liste, notamment aux int&#233;rimaires, afin d&#8217;assurer une meilleure s&#233;curisation des transports.</p>",
    "annexeExposeSommaire": {
      "@xmlns:xsi": "http://www.w3.org/2001/XMLSchema-instance",
      "@xsi:nil": "true"
    },
    "cartoucheDelaiDepotDepasse": {
      "@xmlns:xsi": "http://www.w3.org/2001/XMLSchema-instance",
      "@xsi:nil": "true"
    }
  },
  "representations": {
    "representation": {
      "nom": "PDF",
      "typeMime": {
        "type": "application",
        "subType": "PDF"
      },
      "statutRepresentation": {
        "verbatim": "true",
        "canonique": "true",
        "officielle": "true",
        "transcription": "false",
        "enregistrement": "false"
      },
      "repSource": {
        "@xmlns:xsi": "http://www.w3.org/2001/XMLSchema-instance",
        "@xsi:nil": "true"
      },
      "offset": {
        "@xmlns:xsi": "http://www.w3.org/2001/XMLSchema-instance",
        "@xsi:nil": "true"
      },
      "contenu": {
        "documentURI": "/15/amendements/1974/AN/108.pdf"
      },
      "dateDispoRepresentation": {
        "@xmlns:xsi": "http://www.w3.org/2001/XMLSchema-instance",
        "@xsi:nil": "true"
      }
    }
  },
  "seanceDiscussion": "RUANR5L15S2019IDS21702",
  "sort": {
    "dateSaisie": "2019-06-14T16:40:12.000+02:00",
    "sortEnSeance": "Rejeté"
  },
  "dateDepot": "2019-05-25T02:00:00.000+02:00",
  "dateDistribution": "2019-06-05T02:00:00.000+02:00",
  "article99": "0",
  "loiReference": {
    "codeLoi": "c sécurité intérieure",
    "divisionCodeLoi": "L114-2"
  }
}