{
  "@xmlns": "http://schemas.assemblee-nationale.fr/referentiel",
  "uid": "AMANR5L15PO419865B2135P0D1N800",
  "identifiant": {
    "legislature": "15",
    "numero": "800",
    "numRect": "0",
    "saisine": {
      "refTexteLegislatif": "PRJLANR5L15B2135",
      "numeroPartiePLF": "0",
      "organeExamen": "PO419865",
      "mentionSecondeDeliberation": "0"
    }
  },
  "numeroLong": "CD800",
  "etapeTexte": "Nouvelle Lecture",
  "triAmendement": "goaaiaaaaaaaaaaaaaaaaaaaaaaaaaaaaaaaaaaaaaaaaaaaaazzzoi",
  "cardinaliteAmdtMultiples": "1",
  "amendementParent": {
    "@xmlns:xsi": "http://www.w3.org/2001/XMLSchema-instance",
    "@xsi:nil": "true"
  },
  "etat": "Discuté",
  "signataires": {
    "auteur": {
      "typeAuteur": "Depute",
      "acteurRef": "PA609245",
      "organeRef": {
        "@xmlns:xsi": "http://www.w3.org/2001/XMLSchema-instance",
        "@xsi:nil": "true"
      },
      "groupePolitiqueRef": "PO730934"
    },
    "cosignataires": {
      "acteurRef": [
        "PA718884",
        "PA712015",
        "PA340853",
        "PA267429",
        "PA720210",
        "PA267378",
        "PA721968",
        "PA330909",
        "PA609245",
        "PA606712",
        "PA722390",
        "PA642847",
        "PA267735",
        "PA266793",
        "PA605036",
        "PA2155",
        "PA721678",
        "PA607090",
        "PA2377",
        "PA1012",
        "PA709315",
        "PA608016",
        "PA267204",
        "PA719318",
        "PA334654"
      ]
    },
    "texteAffichable": "Mme&#160;Lacroute,  M.&#160;Sermier, M.&#160;Lurton, Mme&#160;Beauvais, M.&#160;Straumann, M.&#160;Menuel, M.&#160;Reda, M.&#160;Cinieri, Mme&#160;Levy, M.&#160;Dive, M.&#160;de la Verpilli&#232;re, M.&#160;Vialay, Mme&#160;Bazin-Malgras, M.&#160;Abad, Mme&#160;Louwagie, Mme&#160;Corneloup, Mme&#160;Anthoine, M.&#160;de Ganay, M.&#160;Viala, M.&#160;Jean-Pierre&#160;Vigier, M.&#160;Bony, M.&#160;Leclerc, M.&#160;Bazin, M.&#160;Perrut et M.&#160;Descoeur"
  },
  "pointeurFragmentTexte": {
    "missionVisee": {
      "@xmlns:xsi": "http://www.w3.org/2001/XMLSchema-instance",
      "@xsi:nil": "true"
    },
    "division": {
      "titre": "RAPPORT ANNEXÉ",
      "articleDesignationCourte": "ART. 1ER A",
      "type": "ANNEXE",
      "avant_A_Apres": "A",
      "divisionRattachee": "ARTICLE 1ER A",
      "articleAdditionnel": {
        "@xmlns:xsi": "http://www.w3.org/2001/XMLSchema-instance",
        "@xsi:nil": "true"
      },
      "chapitreAdditionnel": {
        "@xmlns:xsi": "http://www.w3.org/2001/XMLSchema-instance",
        "@xsi:nil": "true"
      },
      "urlDivisionTexteVise": "/15/textes/2135.asp#D_RAPPORT_ANNEXE"
    },
    "alinea": {
      "avant_A_Apres": "Apres",
      "numero": "12",
      "alineaDesignation": {
        "@xmlns:xsi": "http://www.w3.org/2001/XMLSchema-instance",
        "@xsi:nil": "true"
      }
    }
  },
  "corps": {
    "dispositif": "<p style=\"text-align: justify;\">Apr&#232;s l&#8217;alin&#233;a&#160;12, ins&#233;rer l&#8217;alin&#233;a suivant&#160;:</p><p style=\"text-align: justify;\">&#171;&#160;Elle suppose une affectation &#224; l&#8217;AFITF d&#8217;une part de recettes de la taxe int&#233;rieure de consommation sur les produits &#233;nerg&#233;tiques d&#8217;un montant annuel minimum de 1,7 milliards d&#8217;euros.&#160;&#187;</p>",
    "exposeSommaire": "<p style=\"text-align: justify;\">Le budget initial de l&#8217;Agence de financement des infrastructures de transport de France (AFITF) pour 2019 est de 2 478 067 000&#160;euros, soit environ 2 milliards et demi d&#8217;euros, soit &#224; peine plus que le montant de 2,4 milliards d&#8217;euros correspondant au sc&#233;nario 1 du rapport dit &#171;&#160;Duron&#160;&#187; du Conseil d&#8217;orientation des infrastructures (COI). Pour rappel, le rapport indique que dans ce premier sc&#233;nario, &#171;&#160;Les priorit&#233;s indispensables de restauration du patrimoine ne sont que partiellement satisfaites. Ce sc&#233;nario offre peu de marges de manoeuvre pour r&#233;pondre aux enjeux de d&#233;congestion des noeuds ferroviaires. Il conduit &#224; poursuivre, au moins pour cinq &#224; dix ans, la pause d&#233;cid&#233;e pour les grands projets. Ce faisant, en repoussant ces d&#233;penses, il rend irr&#233;aliste une avanc&#233;e substantielle de ces grands projets dans les vingt prochaines ann&#233;es et repousse autour de 2050 l&#8217;ambition de les avoir achev&#233;s.&#160;&#187;</p><p style=\"text-align: justify;\">Le Gouvernement a indiqu&#233; avoir retenu le sc&#233;nario 2 du rapport Duron. Avec un montant de 3 milliards de d&#233;penses par an, le sc&#233;nario 2 &#171;&#160;privil&#233;gie la mise en oeuvre des priorit&#233;s de restauration et de modernisation du patrimoine et d&#8217;am&#233;lioration des mobilit&#233;s du quotidien pendant une dizaine d&#8217;ann&#233;es &#224; un niveau d&#8217;ambition &#233;lev&#233; qui s&#8217;inscrit en rupture des pratiques ant&#233;rieures. Il permet d&#8217;avancer les premi&#232;res phases des grands projets. Ces premi&#232;res phases sont tr&#232;s utiles en elles-m&#234;mes par exemple en r&#233;duisant la saturation des principaux noeuds ferroviaires au b&#233;n&#233;fice de tous les usagers. Il pr&#233;voit ensuite que tous ces projets soient poursuivis de fa&#231;on progressive.&#160;&#187;</p><p style=\"text-align: justify;\">Entre le budget actuel de l&#8217;AFIFT de 2,5 milliards et le budget vis&#233; de 3 milliards, il manque 500 millions d&#8217;euros.</p><p style=\"text-align: justify;\">Il convient donc de pr&#233;voir dans la programmation annex&#233;e une affectation suppl&#233;mentaire de 500 millions d&#8217;euros au budget de l&#8217;AFIFT afin de r&#233;pondre &#224; l&#8217;objectif chiffr&#233; par le sc&#233;nario 2 choisi par le Gouvernement et n&#233;cessaire au financement des mesures adopt&#233;es par le pr&#233;sent projet de loi.</p><p style=\"text-align: justify;\">Le pr&#233;sent amendement pr&#233;voit ainsi que la prochaine loi de finances devra comporter une affectation suppl&#233;mentaire des recettes de la taxe int&#233;rieure de consommation sur les produits &#233;nerg&#233;tiques (TICPE) &#224; hauteur de 500 millions d&#8217;euros, soit 1,7 milliard d&#8217;euros par rapport aux 1,2 milliards de TICPE actuellement affect&#233;s.</p>",
    "annexeExposeSommaire": {
      "@xmlns:xsi": "http://www.w3.org/2001/XMLSchema-instance",
      "@xsi:nil": "true"
    },
    "cartoucheDelaiDepotDepasse": {
      "@xmlns:xsi": "http://www.w3.org/2001/XMLSchema-instance",
      "@xsi:nil": "true"
    },
    "avantAppel": {
      "@xmlns:xsi": "http://www.w3.org/2001/XMLSchema-instance",
      "@xsi:nil": "true"
    }
  },
  "representations": {
    "representation": {
      "nom": "PDF",
      "typeMime": {
        "type": "application",
        "subType": "PDF"
      },
      "statutRepresentation": {
        "verbatim": "true",
        "canonique": "true",
        "officielle": "true",
        "transcription": "false",
        "enregistrement": "false"
      },
      "repSource": {
        "@xmlns:xsi": "http://www.w3.org/2001/XMLSchema-instance",
        "@xsi:nil": "true"
      },
      "offset": {
        "@xmlns:xsi": "http://www.w3.org/2001/XMLSchema-instance",
        "@xsi:nil": "true"
      },
      "contenu": {
        "documentURI": "/15/amendements/2135/CION-DVP/CD800.pdf"
      },
      "dateDispoRepresentation": {
        "@xmlns:xsi": "http://www.w3.org/2001/XMLSchema-instance",
        "@xsi:nil": "true"
      }
    }
  },
  "seanceDiscussion": {
    "@xmlns:xsi": "http://www.w3.org/2001/XMLSchema-instance",
    "@xsi:nil": "true"
  },
  "sort": {
    "dateSaisie": "2019-09-03T22:02:02.000+02:00",
    "sortEnSeance": "Rejeté"
  },
  "dateDepot": "2019-08-29T02:00:00.000+02:00",
  "dateDistribution": "2019-08-31T02:00:00.000+02:00",
  "article99": "0",
  "loiReference": {
    "codeLoi": {
      "@xmlns:xsi": "http://www.w3.org/2001/XMLSchema-instance",
      "@xsi:nil": "true"
    },
    "divisionCodeLoi": {
      "@xmlns:xsi": "http://www.w3.org/2001/XMLSchema-instance",
      "@xsi:nil": "true"
    }
  }
}