{
  "@xmlns": "http://schemas.assemblee-nationale.fr/referentiel",
  "uid": "AMANR5L15SEA717460BTC0971P0D1N1265",
  "identifiant": {
    "legislature": "15",
    "numero": "1265",
    "numRect": "1",
    "saisine": {
      "refTexteLegislatif": "PRJLANR5L15BTC0971",
      "numeroPartiePLF": "0",
      "organeExamen": "PO717460",
      "mentionSecondeDeliberation": "0"
    }
  },
  "numeroLong": "1265 (Rect)",
  "etapeTexte": "1ère lecture (1ère assemblée saisie)",
  "triAmendement": "bbks",
  "cardinaliteAmdtMultiples": "1",
  "amendementParent": {
    "@xmlns:xsi": "http://www.w3.org/2001/XMLSchema-instance",
    "@xsi:nil": "true"
  },
  "etat": "Discuté",
  "signataires": {
    "auteur": {
      "typeAuteur": "Depute",
      "acteurRef": "PA609245",
      "organeRef": {
        "@xmlns:xsi": "http://www.w3.org/2001/XMLSchema-instance",
        "@xsi:nil": "true"
      },
      "groupePolitiqueRef": "PO730934"
    },
    "cosignataires": {
      "acteurRef": [
        "PA2492",
        "PA330909",
        "PA267901",
        "PA720210",
        "PA330684",
        "PA719272",
        "PA609245",
        "PA266793",
        "PA718838",
        "PA345722",
        "PA1874",
        "PA718780"
      ]
    },
    "texteAffichable": "Mme&#160;Lacroute,  M.&#160;Kamardine, Mme&#160;Meunier, M.&#160;Brun, M.&#160;Le Fur, Mme&#160;Val&#233;rie&#160;Boyer, Mme&#160;Beauvais, M.&#160;Bony, M.&#160;Descoeur, Mme&#160;Le Grip, M.&#160;Quentin et Mme&#160;Trastour-Isnart"
  },
  "pointeurFragmentTexte": {
    "missionVisee": {
      "@xmlns:xsi": "http://www.w3.org/2001/XMLSchema-instance",
      "@xsi:nil": "true"
    },
    "division": {
      "titre": "Article 33",
      "articleDesignationCourte": "APRÈS ART. 33",
      "type": "ARTICLE",
      "avant_A_Apres": "Après",
      "divisionRattachee": "APRÈS L'ARTICLE 33, insérer l'article suivant:",
      "articleAdditionnel": "1",
      "chapitreAdditionnel": {
        "@xmlns:xsi": "http://www.w3.org/2001/XMLSchema-instance",
        "@xsi:nil": "true"
      },
      "urlDivisionTexteVise": "/15/textes/0971.asp#D_Article_33"
    },
    "alinea": {
      "@xmlns:xsi": "http://www.w3.org/2001/XMLSchema-instance",
      "@xsi:nil": "true"
    }
  },
  "corps": {
    "dispositif": "<p style=\"text-align: justify;\">Au cinqui&#232;me alin&#233;a du I de l&#8217;article L.&#160;442&#8209;3 du code de la construction et de l&#8217;habitation, les mots&#160;: &#171; ou la prise en compte du d&#233;veloppement durable&#160;&#187; sont remplac&#233;s par les mots&#160;: &#171;&#160;, la prise en compte du d&#233;veloppement durable ou les nouveaux services &#224; caract&#232;re social d&#8217;int&#233;r&#234;t direct pour les locataires.&#160;&#187;</p>",
    "exposeSommaire": "<p style=\"text-align: justify;\">La liste des charges r&#233;cup&#233;rables est fix&#233;e pour les logements des organismes par le d&#233;cret n&#176;82&#8209;955 du 9 novembre 1982.</p><p style=\"text-align: justify;\">L&#8217;article L.&#160;442&#8209;3 du code de la construction et de l&#8217;habitation pr&#233;voit qu&#8217;il peut y &#234;tre d&#233;rog&#233; par accords collectifs locaux portant sur l&#8217;am&#233;lioration de la s&#233;curit&#233; ou la prise en compte du d&#233;veloppement durable. Cette d&#233;rogation limitative ne permet pas l&#8217;inclusion dans les charges r&#233;cup&#233;rables des services &#224; la personne &#224; caract&#232;re social d&#8217;int&#233;r&#234;t direct pour les locataires alors qu&#8217;il est clairement demand&#233; par les locataires aux organismes d&#8217;am&#233;liorer les services fournis et de r&#233;pondre &#224; de nouveaux besoins.</p><p style=\"text-align: justify;\">L&#8217;objet de la proposition ci-dessus est donc d&#8217;&#233;largir la possibilit&#233; de d&#233;roger &#224; la liste limitative des charges r&#233;cup&#233;rables fix&#233;e de mani&#232;re r&#233;glementaire, par accords collectifs locaux portant sur des services &#224; la personne &#224; caract&#232;re social d&#8217;int&#233;r&#234;t direct pour les locataires.</p>",
    "annexeExposeSommaire": {
      "@xmlns:xsi": "http://www.w3.org/2001/XMLSchema-instance",
      "@xsi:nil": "true"
    }
  },
  "representations": {
    "representation": {
      "nom": "PDF",
      "typeMime": {
        "type": "application",
        "subType": "PDF"
      },
      "statutRepresentation": {
        "verbatim": "true",
        "canonique": "true",
        "officielle": "true",
        "transcription": "false",
        "enregistrement": "false"
      },
      "repSource": {
        "@xmlns:xsi": "http://www.w3.org/2001/XMLSchema-instance",
        "@xsi:nil": "true"
      },
      "offset": {
        "@xmlns:xsi": "http://www.w3.org/2001/XMLSchema-instance",
        "@xsi:nil": "true"
      },
      "contenu": {
        "documentURI": "/15/amendements/0971/AN/1265.pdf"
      },
      "dateDispoRepresentation": {
        "@xmlns:xsi": "http://www.w3.org/2001/XMLSchema-instance",
        "@xsi:nil": "true"
      }
    }
  },
  "seanceDiscussion": "RUANR5L15S2018IDS21128",
  "sort": {
    "dateSaisie": "2018-06-03T21:35:36.000+02:00",
    "sortEnSeance": "Rejeté"
  },
  "dateDepot": "2018-05-25T02:00:00.000+02:00",
  "dateDistribution": "2018-05-30T02:00:00.000+02:00",
  "article99": "0",
  "loiReference": {
    "codeLoi": {
      "@xmlns:xsi": "http://www.w3.org/2001/XMLSchema-instance",
      "@xsi:nil": "true"
    },
    "divisionCodeLoi": {
      "@xmlns:xsi": "http://www.w3.org/2001/XMLSchema-instance",
      "@xsi:nil": "true"
    }
  }
}