{
  "@xmlns": "http://schemas.assemblee-nationale.fr/referentiel",
  "uid": "AMANR5L15SEA717460B1255P2D1N1869",
  "identifiant": {
    "legislature": "15",
    "numero": "1869",
    "numRect": "0",
    "saisine": {
      "refTexteLegislatif": "PRJLANR5L15B1255",
      "numeroPartiePLF": "2",
      "organeExamen": "PO717460",
      "mentionSecondeDeliberation": "0"
    }
  },
  "numeroLong": "II-1869",
  "etapeTexte": "1ère lecture (1ère assemblée saisie)",
  "triAmendement": "bcfaaaaaaaaaaaaaaaaaaaaaaaaaaaaaaaaaaaaaaaaaaaaaaazi",
  "cardinaliteAmdtMultiples": "1",
  "amendementParent": {
    "@xmlns:xsi": "http://www.w3.org/2001/XMLSchema-instance",
    "@xsi:nil": "true"
  },
  "etat": "Discuté",
  "signataires": {
    "auteur": {
      "typeAuteur": "Depute",
      "acteurRef": "PA609590",
      "organeRef": {
        "@xmlns:xsi": "http://www.w3.org/2001/XMLSchema-instance",
        "@xsi:nil": "true"
      },
      "groupePolitiqueRef": "PO758835"
    },
    "cosignataires": {
      "acteurRef": [
        "PA608695",
        "PA267233",
        "PA1008",
        "PA342415",
        "PA608011",
        "PA337483",
        "PA508",
        "PA1592",
        "PA607553",
        "PA605069",
        "PA608741",
        "PA429893",
        "PA609332",
        "PA608172",
        "PA610681",
        "PA1198",
        "PA333818",
        "PA609590",
        "PA720988",
        "PA642764",
        "PA333285",
        "PA340357",
        "PA719930",
        "PA335532",
        "PA332614",
        "PA643145",
        "PA1809",
        "PA335054",
        "PA340343"
      ]
    },
    "texteAffichable": "Mme&#160;Rabault,  Mme&#160;Pau-Langevin, M.&#160;Juanico, Mme&#160;Manin, Mme&#160;Tolmont, Mme&#160;Victory, M.&#160;Aviragnet, Mme&#160;Bareigts, Mme&#160;Battistel, Mme&#160;Bi&#233;mouret, M.&#160;Bouillon, M.&#160;Jean-Louis&#160;Bricout, M.&#160;Carvounas, M.&#160;Alain&#160;David, Mme&#160;Laurence&#160;Dumont, M.&#160;Faure, M.&#160;Garot, M.&#160;David&#160;Habib, M.&#160;Hutin, Mme&#160;Karamanli, M.&#160;J&#233;r&#244;me&#160;Lambert, M.&#160;Letchimy, Mme&#160;Pires Beaune, M.&#160;Potier, M.&#160;Pueyo, M.&#160;Saulignac, Mme&#160;Untermaier, Mme&#160;Vainqueur-Christophe et M.&#160;Vallaud"
  },
  "pointeurFragmentTexte": {
    "missionVisee": {
      "idMissionAN": "413",
      "libelleMission": "Recherche et enseignement supérieur",
      "codeMissionPLF": "B",
      "libelleMissionPLF": "Répartition, par mission et programme, des crédits du budget général"
    },
    "division": {
      "titre": "Article 78",
      "articleDesignationCourte": "APRÈS ART. 78",
      "type": "ARTICLE",
      "avant_A_Apres": "Après",
      "divisionRattachee": "APRÈS L'ARTICLE 78, insérer l'article suivant:",
      "articleAdditionnel": "1",
      "chapitreAdditionnel": {
        "@xmlns:xsi": "http://www.w3.org/2001/XMLSchema-instance",
        "@xsi:nil": "true"
      },
      "urlDivisionTexteVise": "/15/textes/1255C.asp#D_Article_78"
    },
    "alinea": {
      "@xmlns:xsi": "http://www.w3.org/2001/XMLSchema-instance",
      "@xsi:nil": "true"
    }
  },
  "corps": {
    "dispositif": "<p style=\"text-align: justify;\">Dans un d&#233;lai de six mois &#224; compter de la promulgation de la pr&#233;sente loi, le Gouvernement remet au Parlement un rapport sur les conditions d&#8217;attribution de l&#8217;aide au m&#233;rite pour les &#233;tudiants boursiers ayant obtenu une mention &#171;&#160;tr&#232;s bien&#160;&#187; au baccalaur&#233;at fran&#231;ais. Ce rapport pr&#233;cise notamment&#160;:</p><p style=\"text-align: justify;\">- Le nombre d&#8217;aides au m&#233;rite attribu&#233;es par acad&#233;mie&#160;en 2018&#8209;2019&#160;;</p><p style=\"text-align: justify;\">- Le nombre d&#8217;&#233;tudiants &#233;ligibles &#224; cette aide au m&#233;rite mais n&#8217;ayant pu l&#8217;obtenir parce que le quota de leur acad&#233;mie est d&#233;pass&#233;&#160;;</p><p style=\"text-align: justify;\">- Le co&#251;t actuel des aides au m&#233;rite&#160;;</p><p style=\"text-align: justify;\">- Le co&#251;t d&#8217;attribution de l&#8217;aide au m&#233;rite &#224; tous les &#233;tudiants qui y sont &#233;ligibles.</p>",
    "exposeSommaire": "<p style=\"text-align: justify;\">Cet amendement port&#233; par le groupe Socialistes et apparent&#233;s vise &#224; apporter des &#233;volutions aux conditions d&#8217;attribution de l&#8217;aide au m&#233;rite.</p><p style=\"text-align: justify;\">Actuellement, les conditions d&#8217;attribution de l&#8217;aide au m&#233;rite sont les suivantes&#160;:</p><p style=\"text-align: justify;\">- avoir obtenu une mention tr&#232;s bien au baccalaur&#233;at&#160;;</p><p style=\"text-align: justify;\">- percevoir une bourse sur crit&#232;res sociaux&#160;;</p><p style=\"text-align: justify;\">- entrer dans le quota d&#8217;attribution par acad&#233;mie.</p><p style=\"text-align: justify;\">Ce troisi&#232;me crit&#232;re appara&#238;t comme injuste, puisqu&#8217;il contingente le nombre d&#8217;aides au m&#233;rite. Autrement dit, quel que soit le nombre de lyc&#233;ens ayant eu mention tr&#232;s bien au baccalaur&#233;at et pouvant pr&#233;tendre &#224; l&#8217;aide au m&#233;rite du fait de la perception d&#8217;une bourse sur crit&#232;res sociaux, il y a un nombre fixe de bourses attribu&#233;es.</p><p style=\"text-align: justify;\">Une difficult&#233; suppl&#233;mentaire se greffe sur cette attribution, li&#233;e au fait que le nombre de bourses au m&#233;rite est attribu&#233; par acad&#233;mie&#160;: ainsi, les acad&#233;mies comptant plus d&#8217;&#233;tudiants &#233;ligibles &#224; l&#8217;aide au m&#233;rite que les autres sont d&#233;favoris&#233;es.</p><p style=\"text-align: justify;\">En d&#8217;autres termes, il peut y avoir des diff&#233;rences d&#8217;attribution entre deux lyc&#233;ens ayant eu mention tr&#232;s bien, avec la m&#234;me situation sociale mais ne d&#233;pendant pas de la m&#234;me acad&#233;mie.</p><p style=\"text-align: justify;\">Cet amendement propose donc au Gouvernement de remettre un rapport au Parlement afin de proc&#233;der &#224; une &#233;valuation du dispositif d&#8217;attribution des aides au m&#233;rite, afin d&#8217;envisager des &#233;volutions.</p>",
    "annexeExposeSommaire": {
      "@xmlns:xsi": "http://www.w3.org/2001/XMLSchema-instance",
      "@xsi:nil": "true"
    }
  },
  "representations": {
    "representation": {
      "nom": "PDF",
      "typeMime": {
        "type": "application",
        "subType": "PDF"
      },
      "statutRepresentation": {
        "verbatim": "true",
        "canonique": "true",
        "officielle": "true",
        "transcription": "false",
        "enregistrement": "false"
      },
      "repSource": {
        "@xmlns:xsi": "http://www.w3.org/2001/XMLSchema-instance",
        "@xsi:nil": "true"
      },
      "offset": {
        "@xmlns:xsi": "http://www.w3.org/2001/XMLSchema-instance",
        "@xsi:nil": "true"
      },
      "contenu": {
        "documentURI": "/15/amendements/1255C/AN/1869.pdf"
      },
      "dateDispoRepresentation": {
        "@xmlns:xsi": "http://www.w3.org/2001/XMLSchema-instance",
        "@xsi:nil": "true"
      }
    }
  },
  "seanceDiscussion": "RUANR5L15S2019IDS21338",
  "sort": {
    "dateSaisie": "2018-11-14T06:10:10.000+01:00",
    "sortEnSeance": "Rejeté"
  },
  "dateDepot": "2018-11-09T01:00:00.000+01:00",
  "dateDistribution": "2018-11-12T01:00:00.000+01:00",
  "article99": "0",
  "loiReference": {
    "codeLoi": {
      "@xmlns:xsi": "http://www.w3.org/2001/XMLSchema-instance",
      "@xsi:nil": "true"
    },
    "divisionCodeLoi": {
      "@xmlns:xsi": "http://www.w3.org/2001/XMLSchema-instance",
      "@xsi:nil": "true"
    }
  }
}