{
  "@xmlns": "http://schemas.assemblee-nationale.fr/referentiel",
  "uid": "AMANR5L15SEA717460BTC1761P0D1N1304",
  "identifiant": {
    "legislature": "15",
    "numero": "1304",
    "numRect": "0",
    "saisine": {
      "refTexteLegislatif": "PRJLANR5L15BTC1761",
      "numeroPartiePLF": "0",
      "organeExamen": "PO717460",
      "mentionSecondeDeliberation": "0"
    }
  },
  "numeroLong": "1304",
  "etapeTexte": "Nouvelle Lecture",
  "triAmendement": "kqaaaaaaaaaaaaaaaaaaaaaaaaaaaaaaaaaaaaaaaaaaaaaaaau",
  "cardinaliteAmdtMultiples": "1",
  "amendementParent": {
    "@xmlns:xsi": "http://www.w3.org/2001/XMLSchema-instance",
    "@xsi:nil": "true"
  },
  "etat": "Discuté",
  "signataires": {
    "auteur": {
      "typeAuteur": "Rapporteur",
      "acteurRef": "PA719684",
      "organeRef": "PO757134",
      "groupePolitiqueRef": "PO730964"
    },
    "cosignataires": {
      "acteurRef": "PA719684"
    },
    "texteAffichable": "Mme&#160;Dubost, rapporteure au nom de la commission sp&#233;ciale charg&#233;e d&apos;examiner le projet de loi relatif &#224; la croissance et la transformation des entreprises"
  },
  "pointeurFragmentTexte": {
    "missionVisee": {
      "@xmlns:xsi": "http://www.w3.org/2001/XMLSchema-instance",
      "@xsi:nil": "true"
    },
    "division": {
      "titre": "Article 57 bis C",
      "articleDesignationCourte": "ART. 57 BIS C",
      "type": "ARTICLE",
      "avant_A_Apres": "A",
      "divisionRattachee": "ARTICLE 57 BIS C",
      "articleAdditionnel": {
        "@xmlns:xsi": "http://www.w3.org/2001/XMLSchema-instance",
        "@xsi:nil": "true"
      },
      "chapitreAdditionnel": {
        "@xmlns:xsi": "http://www.w3.org/2001/XMLSchema-instance",
        "@xsi:nil": "true"
      },
      "urlDivisionTexteVise": "/15/textes/1761.asp#D_Article_57_bis_C"
    },
    "alinea": {
      "@xmlns:xsi": "http://www.w3.org/2001/XMLSchema-instance",
      "@xsi:nil": "true"
    }
  },
  "corps": {
    "dispositif": "<p>Compl&#233;ter cet article par un alin&#233;a ainsi r&#233;dig&#233;&#160;:</p><p style=\"text-align: justify;\">&#171;&#160;II.&#160;&#8211;&#160;Au plus tard trois ans apr&#232;s la publication de la pr&#233;sente loi, le Gouvernement remet au Parlement un rapport &#233;valuant les effets &#233;conomiques de la r&#233;duction du plafond de salaire pris en compte dans le calcul de la r&#233;partition de la participation et l&#8217;opportunit&#233; d&#8217;une nouvelle r&#233;duction de ce plafond &#224; deux fois le montant du plafond mentionn&#233; au premier alin&#233;a de l&#8217;article L.&#160;241&#8209;3 du code de la s&#233;curit&#233; sociale.&#160;&#187;</p>",
    "exposeSommaire": "<p style=\"text-align: justify;\">Cet amendement cr&#233;e une clause de revoyure dans trois ans qui permettra d'&#233;valuer les effets &#233;conomiques de la baisse du plafond de salaire pris en compte pour partager la participation, comme l'importance de son effet redistributif sur le pouvoir d'achat des salari&#233;s faiblement r&#233;mun&#233;r&#233;s. La clause de revoyure envisagera &#233;galement l'opportunit&#233; de descendre ce plafond &#224; deux fois le montant du PASS.</p>",
    "annexeExposeSommaire": {
      "@xmlns:xsi": "http://www.w3.org/2001/XMLSchema-instance",
      "@xsi:nil": "true"
    },
    "cartoucheDelaiDepotDepasse": "Sous réserve de son traitement par les services de l'Assemblée nationale et de sa recevabilité"
  },
  "representations": {
    "representation": {
      "nom": "PDF",
      "typeMime": {
        "type": "application",
        "subType": "PDF"
      },
      "statutRepresentation": {
        "verbatim": "true",
        "canonique": "true",
        "officielle": "true",
        "transcription": "false",
        "enregistrement": "false"
      },
      "repSource": {
        "@xmlns:xsi": "http://www.w3.org/2001/XMLSchema-instance",
        "@xsi:nil": "true"
      },
      "offset": {
        "@xmlns:xsi": "http://www.w3.org/2001/XMLSchema-instance",
        "@xsi:nil": "true"
      },
      "contenu": {
        "documentURI": "/15/amendements/1761/AN/1304.pdf"
      },
      "dateDispoRepresentation": {
        "@xmlns:xsi": "http://www.w3.org/2001/XMLSchema-instance",
        "@xsi:nil": "true"
      }
    }
  },
  "seanceDiscussion": "RUANR5L15S2019IDS21553",
  "sort": {
    "dateSaisie": "2019-03-16T02:12:28.000+01:00",
    "sortEnSeance": "Adopté"
  },
  "dateDepot": "2019-03-13T01:00:00.000+01:00",
  "dateDistribution": "2019-03-13T01:00:00.000+01:00",
  "article99": "1",
  "loiReference": {
    "codeLoi": {
      "@xmlns:xsi": "http://www.w3.org/2001/XMLSchema-instance",
      "@xsi:nil": "true"
    },
    "divisionCodeLoi": {
      "@xmlns:xsi": "http://www.w3.org/2001/XMLSchema-instance",
      "@xsi:nil": "true"
    }
  }
}