{
  "@xmlns": "http://schemas.assemblee-nationale.fr/referentiel",
  "uid": "AMANR5L15PO420120B0714P0D1N53",
  "identifiant": {
    "legislature": "15",
    "numero": "53",
    "numRect": "0",
    "saisine": {
      "refTexteLegislatif": "PRJLANR5L15B0714",
      "numeroPartiePLF": "0",
      "organeExamen": "PO420120",
      "mentionSecondeDeliberation": "0"
    }
  },
  "numeroLong": "AS53",
  "etapeTexte": "1ère lecture (1ère assemblée saisie)",
  "triAmendement": "f",
  "cardinaliteAmdtMultiples": "1",
  "amendementParent": {
    "@xmlns:xsi": "http://www.w3.org/2001/XMLSchema-instance",
    "@xsi:nil": "true"
  },
  "etat": "Discuté",
  "signataires": {
    "auteur": {
      "typeAuteur": "Depute",
      "acteurRef": "PA722268",
      "organeRef": {
        "@xmlns:xsi": "http://www.w3.org/2001/XMLSchema-instance",
        "@xsi:nil": "true"
      },
      "groupePolitiqueRef": "PO730964"
    },
    "cosignataires": {
      "acteurRef": [
        "PA722126",
        "PA718706",
        "PA719570",
        "PA720512",
        "PA718744",
        "PA606171",
        "PA718810",
        "PA719980",
        "PA719756",
        "PA719512",
        "PA720170",
        "PA720932",
        "PA722062",
        "PA719186",
        "PA720046",
        "PA719842",
        "PA721336",
        "PA720480",
        "PA718694",
        "PA720500",
        "PA720738",
        "PA718910",
        "PA722268",
        "PA720074",
        "PA717379",
        "PA719540",
        "PA722022",
        "PA722086",
        "PA720952",
        "PA719072",
        "PA331835",
        "PA722102",
        "PA334768",
        "PA720362",
        "PA642788",
        "PA719350"
      ]
    },
    "texteAffichable": "Mme&#160;Wonner,  M.&#160;Pietraszewski, M.&#160;Tach&#233;, Mme&#160;Bagarry, M.&#160;Belhaddad, M.&#160;Borowczyk, Mme&#160;Brocard, M.&#160;Chiche, Mme&#160;Cloarec, M.&#160;Da Silva, M.&#160;Marc&#160;Delatte, Mme&#160;Dufeu Schubert, Mme&#160;Fabre, Mme&#160;Fontaine-Domeizel, Mme&#160;Grandjean, Mme&#160;Granjus, Mme&#160;Iborra, Mme&#160;Janvier, Mme&#160;Khattabi, M.&#160;Laabid, Mme&#160;Lecocq, M.&#160;Maillard, M.&#160;Mesnier, M.&#160;Michels, Mme&#160;Val&#233;rie&#160;Petit, Mme&#160;Pitollat, Mme&#160;Mireille&#160;Robert, Mme&#160;Romeiro Dias, Mme&#160;Tamarelle-Verhaeghe, M.&#160;Taquet, M.&#160;Touraine, Mme&#160;Toutut-Picard, M.&#160;V&#233;ran, Mme&#160;Vidal, Mme&#160;Vignon et M.&#160;Ferrand"
  },
  "pointeurFragmentTexte": {
    "missionVisee": {
      "@xmlns:xsi": "http://www.w3.org/2001/XMLSchema-instance",
      "@xsi:nil": "true"
    },
    "division": {
      "titre": "Article 27",
      "articleDesignationCourte": "ART. 27",
      "type": "ARTICLE",
      "avant_A_Apres": "A",
      "divisionRattachee": "ARTICLE 27",
      "articleAdditionnel": {
        "@xmlns:xsi": "http://www.w3.org/2001/XMLSchema-instance",
        "@xsi:nil": "true"
      },
      "chapitreAdditionnel": {
        "@xmlns:xsi": "http://www.w3.org/2001/XMLSchema-instance",
        "@xsi:nil": "true"
      },
      "urlDivisionTexteVise": "/15/textes/0714.asp#D_Article_27"
    },
    "alinea": {
      "avant_A_Apres": "A",
      "numero": "1",
      "alineaDesignation": "Alinéa 1"
    }
  },
  "corps": {
    "dispositif": "<p style=\"text-align: justify;\">&#192; l&#8217;alin&#233;a&#160;1, substituer aux mots&#160;:</p><p style=\"text-align: justify;\">&#171;&#160;vingt-quatre&#160;&#187;, </p><p style=\"text-align: justify;\">le mot&#160;:</p><p style=\"text-align: justify;\">&#171;&#160;douze&#160;&#187;.</p>",
    "exposeSommaire": "<p style=\"text-align: justify;\">L&#8217;ordonnance habilitant le Gouvernement &#224; agir en faveur de la cr&#233;ation d&#8217;un titre de s&#233;jour unique pour tous les salari&#233;s et de la simplification du r&#233;gime des autorisations de travail doit se faire dans un d&#233;lai plus raccourci, le travail &#233;tant un des facteurs d&#8217;int&#233;gration.</p>",
    "annexeExposeSommaire": {
      "@xmlns:xsi": "http://www.w3.org/2001/XMLSchema-instance",
      "@xsi:nil": "true"
    }
  },
  "representations": {
    "representation": {
      "nom": "PDF",
      "typeMime": {
        "type": "application",
        "subType": "PDF"
      },
      "statutRepresentation": {
        "verbatim": "true",
        "canonique": "true",
        "officielle": "true",
        "transcription": "false",
        "enregistrement": "false"
      },
      "repSource": {
        "@xmlns:xsi": "http://www.w3.org/2001/XMLSchema-instance",
        "@xsi:nil": "true"
      },
      "offset": {
        "@xmlns:xsi": "http://www.w3.org/2001/XMLSchema-instance",
        "@xsi:nil": "true"
      },
      "contenu": {
        "documentURI": "/15/amendements/0714/CION-SOC/AS53.pdf"
      },
      "dateDispoRepresentation": {
        "@xmlns:xsi": "http://www.w3.org/2001/XMLSchema-instance",
        "@xsi:nil": "true"
      }
    }
  },
  "seanceDiscussion": {
    "@xmlns:xsi": "http://www.w3.org/2001/XMLSchema-instance",
    "@xsi:nil": "true"
  },
  "sort": {
    "dateSaisie": "2018-03-27T19:01:31.000+02:00",
    "sortEnSeance": "Retiré"
  },
  "dateDepot": "2018-03-23T01:00:00.000+01:00",
  "dateDistribution": "2018-03-23T01:00:00.000+01:00",
  "article99": "0",
  "loiReference": {
    "codeLoi": {
      "@xmlns:xsi": "http://www.w3.org/2001/XMLSchema-instance",
      "@xsi:nil": "true"
    },
    "divisionCodeLoi": {
      "@xmlns:xsi": "http://www.w3.org/2001/XMLSchema-instance",
      "@xsi:nil": "true"
    }
  }
}