{
  "@xmlns": "http://schemas.assemblee-nationale.fr/referentiel",
  "uid": "AMANR5L15SEA717460BTC0902P0D1N224",
  "identifiant": {
    "legislature": "15",
    "numero": "224",
    "numRect": "0",
    "saisine": {
      "refTexteLegislatif": "PRJLANR5L15BTC0902",
      "numeroPartiePLF": "0",
      "organeExamen": "PO717460",
      "mentionSecondeDeliberation": "0"
    }
  },
  "numeroLong": "224",
  "etapeTexte": "1ère lecture (1ère assemblée saisie)",
  "triAmendement": "bdni",
  "cardinaliteAmdtMultiples": "1",
  "amendementParent": {
    "@xmlns:xsi": "http://www.w3.org/2001/XMLSchema-instance",
    "@xsi:nil": "true"
  },
  "etat": "Discuté",
  "signataires": {
    "auteur": {
      "typeAuteur": "Depute",
      "acteurRef": "PA605694",
      "organeRef": {
        "@xmlns:xsi": "http://www.w3.org/2001/XMLSchema-instance",
        "@xsi:nil": "true"
      },
      "groupePolitiqueRef": "PO723569"
    },
    "cosignataires": {
      "acteurRef": "PA605694"
    },
    "texteAffichable": "M.&#160;Falorni"
  },
  "pointeurFragmentTexte": {
    "missionVisee": {
      "@xmlns:xsi": "http://www.w3.org/2001/XMLSchema-instance",
      "@xsi:nil": "true"
    },
    "division": {
      "titre": "Article 13",
      "articleDesignationCourte": "APRÈS ART. 13",
      "type": "ARTICLE",
      "avant_A_Apres": "Après",
      "divisionRattachee": "APRÈS L'ARTICLE 13, insérer l'article suivant:",
      "articleAdditionnel": "1",
      "chapitreAdditionnel": {
        "@xmlns:xsi": "http://www.w3.org/2001/XMLSchema-instance",
        "@xsi:nil": "true"
      },
      "urlDivisionTexteVise": "/15/textes/0902.asp#D_Article_13"
    },
    "alinea": {
      "@xmlns:xsi": "http://www.w3.org/2001/XMLSchema-instance",
      "@xsi:nil": "true"
    }
  },
  "corps": {
    "dispositif": "<p style=\"text-align: justify;\">La section 4 du chapitre IV du titre I<sup>er</sup> du livre II du code rural et de la p&#234;che maritime est compl&#233;t&#233;e par un article L.&#160;214&#8209;13 ainsi r&#233;tabli&#160;:</p><p style=\"text-align: justify;\">&#171;&#160;<i>Art.&#160;L.&#160;214&#8209;13</i>.&#160;I.&#160;&#8211;&#160;Pour les transports d&#8217;animaux se d&#233;roulant enti&#232;rement sur le territoire fran&#231;ais, la dur&#233;e maximale du voyage des animaux domestiques est fix&#233;e &#224; huit heures pour les esp&#232;ces bovine, ovine, caprine, porcine et les &#233;quid&#233;s domestiques et &#224; quatre heures pour les volailles, les oiseaux domestiques et les lapins domestiques.</p><p style=\"text-align: justify;\">&#171;&#160;Par d&#233;rogation, une autorisation pr&#233;alable peut &#234;tre d&#233;livr&#233;e pour un voyage d&#8217;une dur&#233;e sup&#233;rieure, dans une limite maximale de douze heures de transport, par un v&#233;t&#233;rinaire qui atteste de la capacit&#233; des animaux &#224; r&#233;aliser ce voyage sans risque d&#8217;&#234;tre bless&#233;s ou de subir des souffrances inutiles.</p><p style=\"text-align: justify;\">&#171;&#160;Un d&#233;cret en Conseil d&#8217;&#201;tat d&#233;termine les modalit&#233;s d&#8217;application du pr&#233;sent article.&#160;&#187;</p>",
    "exposeSommaire": "<p style=\"text-align: justify;\">Le r&#232;glement 1/2005 du Conseil du 22 d&#233;cembre 2004 relatif &#224; la protection des animaux pendant le transport et les op&#233;rations annexes r&#233;glemente le transport des animaux vivants entre les pays de &#8217;Union&#160;Europ&#233;enne et d&#233;finit les modalit&#233;s de contr&#244;les op&#233;r&#233;s &#224; l&#8217;entr&#233;e ou &#224; la sortie de l&#8217;Union&#160;Europ&#233;enne.</p><p style=\"text-align: justify;\">Ce r&#232;glement ne fixe aucune limitation de dur&#233;e maximale de transport mais uniquement des limites de temps de route successifs&#160;: 29 heures pour les bovins, ovins et caprins, 24 heures pour les chevaux et pour les porcs, 19 heures pour les animaux non secr&#233;s. Au-del&#224;, les animaux doivent &#234;tre d&#233;charg&#233;s, aliment&#233;s, abreuv&#233;s et b&#233;n&#233;ficier d&#8217;un temps de repos de 24 heures avant de reprendre la route.</p><p style=\"text-align: justify;\">Chaque &#201;tat membre de l&#8217;UE est soumis &#224; l&#8217;application de ce r&#232;glement, cependant, l&#8217;article&#160;1 du r&#232;glement pr&#233;voit qu&#8217;il &#171;&#160;ne fait pas d&#8217;obstacle &#224; d&#8217;&#233;ventuelles mesures nationales plus contraignantes visant &#224; am&#233;liorer le bien-&#234;tre des animaux au cours des transports se d&#233;roulant enti&#232;rement sur le territoire d&#8217;un &#201;tat membre ou pour les transports maritimes au d&#233;part du territoire d&#8217;un &#201;tat membre.</p><p style=\"text-align: justify;\">Depuis plusieurs ann&#233;es, les ONG de protection des animaux d&#233;noncent r&#233;guli&#232;rement, appuy&#233;es d&#8217;enqu&#234;tes d&#233;taill&#233;es, des conditions de transport non compatibles avec le protection minimale des animaux. Parmi les probl&#232;mes les plus importants, les dur&#233;es de transports sont r&#233;guli&#232;rement d&#233;nonc&#233;es comme ne permettant pas d&#8217;assurer une protection minimale suffisante des animaux.</p><p style=\"text-align: justify;\">Source de stress, de blessures, douleurs et souffrances, les dur&#233;es de transport peuvent atteindre des distances de plus de 3000 kilom&#232;tres et plusieurs jours de transports. Selon un rapport de l&#8217;Autorit&#233;&#160;europ&#233;enne de s&#233;curit&#233; des aliments (EFSA) en 2004, apr&#232;s quelques heures, le bien-&#234;tre des animaux est s&#233;v&#232;rement d&#233;t&#233;rior&#233;. En 2012, le Parlement&#160;europ&#233;en s&#8217;&#233;tait d&#8217;ores et d&#233;j&#224; prononc&#233; pour demander une limitation &#224; huit heures de la dur&#233;e de transport des animaux destin&#233;s &#224; l&#8217;abattage, appuy&#233; par une initiative citoyenne sign&#233;e par plus d&#8217;un million de citoyens&#160;europ&#233;ens. La F&#233;d&#233;ration des V&#233;t&#233;rinaires d&#8217;Europe soulignait en septembre 2016 &#171;&#160;les graves d&#233;ficiences subsistant lors de l&#8217;exportation des bovins (&#8230;) conduisant &#224; la souffrance, l&#8217;&#233;puisement et parfois m&#234;me la mort des animaux&#160;&#187;, appelant &#224; &#171;&#160;d&#233;courager autant que possible les transports longues distances&#160;&#187;, &#224; &#171;&#160;remplacer le transport d&#8217;animaux vivants par le transport des carcasses&#160;&#187; et d&#233;clarant en conclusion que &#171;&#160;les animaux devaient &#234;tre &#233;lev&#233;s aussi pr&#232;s que possible des lieux o&#249; ils sont n&#233;s et abattus aussi pr&#232;s que possible de leur lieu de production&#160;&#187;.</p><p style=\"text-align: justify;\">Par ailleurs, un certain nombre d&#8217;&#201;tats membres demandent aujourd&#8217;hui une r&#233;vision du r&#232;glement 1/2005 notamment sur les dur&#233;es de transport. C&#8217;est ainsi le cas de la Su&#232;de appuy&#233;e par l&#8217;Allemagne, le Danemark, la Belgique, l&#8217;Autriche, et les Pays-Bas, qui a port&#233; cette demande lors du Conseil&#160;europ&#233;en du 15 novembre 2016 en affirmant que&#160;:&#160;&#187;afin d&#8217;am&#233;liorer le bien-&#234;tre animal, il est crucial de r&#233;examiner les dispositions notamment sur les temps de parcours.&#160;&#187;</p><p style=\"text-align: justify;\">Cet amendement vis &#224; encadrer les temps de transport des animaux sur le territoire fran&#231;ais.</p>",
    "annexeExposeSommaire": {
      "@xmlns:xsi": "http://www.w3.org/2001/XMLSchema-instance",
      "@xsi:nil": "true"
    }
  },
  "representations": {
    "representation": {
      "nom": "PDF",
      "typeMime": {
        "type": "application",
        "subType": "PDF"
      },
      "statutRepresentation": {
        "verbatim": "true",
        "canonique": "true",
        "officielle": "true",
        "transcription": "false",
        "enregistrement": "false"
      },
      "repSource": {
        "@xmlns:xsi": "http://www.w3.org/2001/XMLSchema-instance",
        "@xsi:nil": "true"
      },
      "offset": {
        "@xmlns:xsi": "http://www.w3.org/2001/XMLSchema-instance",
        "@xsi:nil": "true"
      },
      "contenu": {
        "documentURI": "/15/amendements/0902/AN/224.pdf"
      },
      "dateDispoRepresentation": {
        "@xmlns:xsi": "http://www.w3.org/2001/XMLSchema-instance",
        "@xsi:nil": "true"
      }
    }
  },
  "seanceDiscussion": "RUANR5L15S2018IDS21112",
  "sort": {
    "dateSaisie": "2018-05-27T22:41:31.000+02:00",
    "sortEnSeance": "Rejeté"
  },
  "dateDepot": "2018-05-02T02:00:00.000+02:00",
  "dateDistribution": "2018-05-22T02:00:00.000+02:00",
  "article99": "0",
  "loiReference": {
    "codeLoi": "c rural et pêche maritime",
    "divisionCodeLoi": "L214-13"
  }
}