{
  "@xmlns": "http://schemas.assemblee-nationale.fr/referentiel",
  "uid": "AMANR5L15PO419610B0627P0D1N1253",
  "identifiant": {
    "legislature": "15",
    "numero": "1253",
    "numRect": "0",
    "saisine": {
      "refTexteLegislatif": "PRJLANR5L15B0627",
      "numeroPartiePLF": "0",
      "organeExamen": "PO419610",
      "mentionSecondeDeliberation": "0"
    }
  },
  "numeroLong": "CE1253",
  "etapeTexte": "1ère lecture (1ère assemblée saisie)",
  "triAmendement": "aazrzrzzzrqy",
  "cardinaliteAmdtMultiples": "1",
  "amendementParent": {
    "@xmlns:xsi": "http://www.w3.org/2001/XMLSchema-instance",
    "@xsi:nil": "true"
  },
  "etat": "Discuté",
  "signataires": {
    "auteur": {
      "typeAuteur": "Depute",
      "acteurRef": "PA335999",
      "organeRef": {
        "@xmlns:xsi": "http://www.w3.org/2001/XMLSchema-instance",
        "@xsi:nil": "true"
      },
      "groupePolitiqueRef": "PO730946"
    },
    "cosignataires": {
      "acteurRef": "PA335999"
    },
    "texteAffichable": "Mme&#160;Batho"
  },
  "pointeurFragmentTexte": {
    "missionVisee": {
      "@xmlns:xsi": "http://www.w3.org/2001/XMLSchema-instance",
      "@xsi:nil": "true"
    },
    "division": {
      "titre": "Article 14",
      "articleDesignationCourte": "APRÈS ART. 14",
      "type": "ARTICLE",
      "avant_A_Apres": "Après",
      "divisionRattachee": "APRÈS L'ARTICLE 14, insérer l'article suivant:",
      "articleAdditionnel": "1",
      "chapitreAdditionnel": {
        "@xmlns:xsi": "http://www.w3.org/2001/XMLSchema-instance",
        "@xsi:nil": "true"
      },
      "urlDivisionTexteVise": "/15/textes/0627.asp#D_Article_14"
    },
    "alinea": {
      "@xmlns:xsi": "http://www.w3.org/2001/XMLSchema-instance",
      "@xsi:nil": "true"
    }
  },
  "corps": {
    "dispositif": "<p style=\"text-align: justify;\">Apr&#232;s l&#8217;article L. 253-8-2 du code rural et de la p&#234;che maritime, est ins&#233;r&#233; un article L.253-8-3 ainsi r&#233;dig&#233;&#160;:</p><p style=\"text-align: justify;\">\"Article L. 253-8-3 : Les donn&#233;es relatives &#224; l&#8217;utilisation des produits phytopharmaceutiques mentionn&#233;s &#224; l&#8217;article L. 253-1 par les exploitants mentionn&#233;s &#224; l&#8217;article L. 257-1, et enregistr&#233;es dans le registre pr&#233;vu &#224; l&#8217;article L. 257-3, sont mises &#224; la disposition du public dans un format ouvert, ais&#233;ment r&#233;utilisable et exploitable par un syst&#232;me de traitement automatis&#233;, sous une forme garantissant leur caract&#232;re anonyme.\"</p>",
    "exposeSommaire": "<p style=\"text-align: justify;\">L&#8217;article 7 de la Charte de l&#8217;Environnement pr&#233;voit que &#171;&#160;<i>Toute personne a le droit, dans les conditions et les limites d&#233;finies par la loi, d'acc&#233;der aux informations relatives &#224; l'environnement d&#233;tenues par les autorit&#233;s publiques</i>&#160;&#187;.</p><p style=\"text-align: justify;\">De plus, une d&#233;cision de la Cour Europ&#233;enne de Justice du 23 novembre 2016 concernant l&#8217;acc&#232;s du public &#224; l&#8217;information en mati&#232;re d&#8217;environnement a pr&#233;cis&#233; que la notion &#171;&#160;<i>d&#8217;&#233;missions dans l&#8217;environnement</i>&#160;&#187;, au sens de l&#8217;article 4 de la Directive 2003/4/CE du 28 janvier 2003 concernant l'acc&#232;s du public &#224; l'information en mati&#232;re d'environnement, inclut notamment le rejet dans l&#8217;environnement de produits phytopharmaceutiques. Ainsi, cette directive qui pr&#233;voit que &#171;&#160;<i>les &#201;tats membres ne peuvent (&#8230;) pr&#233;voir qu'une demande soit rejet&#233;e lorsque elle concerne des informations relatives &#224; des &#233;missions dans l'environnement</i>&#160;&#187; s&#8217;applique bien aux informations relatives l&#8217;utilisation de produits phytopharmaceutiques.</p><p style=\"text-align: justify;\">Les donn&#233;es de ventes de pesticides par d&#233;partement sont actuellement les seules disponibles. De ce fait les scientifiques et les citoyens n&#8217;ont pas acc&#232;s aux donn&#233;es relatives &#224; l&#8217;utilisation effective de ces produits qui sont d&#233;tenues par l&#8217;administration.</p><p style=\"text-align: justify;\">Le pr&#233;sent amendement propose d&#8217;appliquer &#224; ces donn&#233;es la m&#234;me transparence que celle pr&#233;vue par la loi pour la R&#233;publique num&#233;rique pour de tr&#232;s nombreuses donn&#233;es publiques.</p>",
    "annexeExposeSommaire": {
      "@xmlns:xsi": "http://www.w3.org/2001/XMLSchema-instance",
      "@xsi:nil": "true"
    }
  },
  "representations": {
    "representation": {
      "nom": "PDF",
      "typeMime": {
        "type": "application",
        "subType": "PDF"
      },
      "statutRepresentation": {
        "verbatim": "true",
        "canonique": "true",
        "officielle": "true",
        "transcription": "false",
        "enregistrement": "false"
      },
      "repSource": {
        "@xmlns:xsi": "http://www.w3.org/2001/XMLSchema-instance",
        "@xsi:nil": "true"
      },
      "offset": {
        "@xmlns:xsi": "http://www.w3.org/2001/XMLSchema-instance",
        "@xsi:nil": "true"
      },
      "contenu": {
        "documentURI": "/15/amendements/0627/CION-ECO/CE1253.pdf"
      },
      "dateDispoRepresentation": {
        "@xmlns:xsi": "http://www.w3.org/2001/XMLSchema-instance",
        "@xsi:nil": "true"
      }
    }
  },
  "seanceDiscussion": {
    "@xmlns:xsi": "http://www.w3.org/2001/XMLSchema-instance",
    "@xsi:nil": "true"
  },
  "sort": {
    "dateSaisie": "2018-04-20T15:52:06.000+02:00",
    "sortEnSeance": "Rejeté"
  },
  "dateDepot": "2018-04-13T02:00:00.000+02:00",
  "dateDistribution": "2018-04-17T02:00:00.000+02:00",
  "article99": "0",
  "loiReference": {
    "codeLoi": "rural et pêche maritime",
    "divisionCodeLoi": "L253-8-3"
  }
}