{
  "@xmlns": "http://schemas.assemblee-nationale.fr/referentiel",
  "uid": "AMANR5L15PO419604B0799P0D1N120",
  "identifiant": {
    "legislature": "15",
    "numero": "120",
    "numRect": "0",
    "saisine": {
      "refTexteLegislatif": "PIONANR5L15B0799",
      "numeroPartiePLF": "0",
      "organeExamen": "PO419604",
      "mentionSecondeDeliberation": "0"
    }
  },
  "numeroLong": "AC120",
  "etapeTexte": "1ère lecture (1ère assemblée saisie)",
  "triAmendement": "ajzu",
  "cardinaliteAmdtMultiples": "1",
  "amendementParent": {
    "@xmlns:xsi": "http://www.w3.org/2001/XMLSchema-instance",
    "@xsi:nil": "true"
  },
  "etat": "Discuté",
  "signataires": {
    "auteur": {
      "typeAuteur": "Depute",
      "acteurRef": "PA721210",
      "organeRef": {
        "@xmlns:xsi": "http://www.w3.org/2001/XMLSchema-instance",
        "@xsi:nil": "true"
      },
      "groupePolitiqueRef": "PO730958"
    },
    "cosignataires": {
      "acteurRef": [
        "PA720892",
        "PA2150",
        "PA722142",
        "PA588884",
        "PA721202",
        "PA718868",
        "PA720286",
        "PA719676",
        "PA721062",
        "PA720846",
        "PA718860",
        "PA721960",
        "PA719578",
        "PA720430",
        "PA721226",
        "PA720422",
        "PA721210"
      ]
    },
    "texteAffichable": "M.&#160;Corbi&#232;re,  Mme&#160;Autain, M.&#160;Bernalicis, M.&#160;Coquerel, Mme&#160;Fiat, M.&#160;Lachaud, M.&#160;Larive, M.&#160;M&#233;lenchon, Mme&#160;Obono, Mme&#160;Panot, M.&#160;Prud&apos;homme, M.&#160;Quatennens, M.&#160;Ratenon, Mme&#160;Ressiguier, Mme&#160;Rubin, M.&#160;Ruffin et Mme&#160;Taurine"
  },
  "pointeurFragmentTexte": {
    "missionVisee": {
      "@xmlns:xsi": "http://www.w3.org/2001/XMLSchema-instance",
      "@xsi:nil": "true"
    },
    "division": {
      "titre": "Article 9",
      "articleDesignationCourte": "APRÈS ART. 9",
      "type": "ARTICLE",
      "avant_A_Apres": "Après",
      "divisionRattachee": "APRÈS L'ARTICLE 9, insérer la division et l'intitulé suivants:",
      "articleAdditionnel": {
        "@xmlns:xsi": "http://www.w3.org/2001/XMLSchema-instance",
        "@xsi:nil": "true"
      },
      "chapitreAdditionnel": "1",
      "urlDivisionTexteVise": "/15/textes/0799.asp#D_Article_9"
    },
    "alinea": {
      "@xmlns:xsi": "http://www.w3.org/2001/XMLSchema-instance",
      "@xsi:nil": "true"
    }
  },
  "corps": {
    "dispositif": "<p style=\"text-align: justify;\">Titre III <i>bis</i></p><p style=\"text-align: justify;\">De nouveaux droits pour les journalistes afin de lutter efficacement contre les fausses informations</p><p style=\"text-align: justify;\">Article XX</p><p style=\"text-align: justify;\">I.&#160;&#8211;&#160;Apr&#232;s l&#8217;article&#160;6 de la loi du 29 juillet 1881 sur la libert&#233; de la presse, il est ins&#233;r&#233; un article&#160;6 <i>bis</i> ainsi r&#233;dig&#233;&#160;:</p><p style=\"text-align: justify;\">&#171;&#160;<i>Art.&#160;6</i> bis.&#160;&#8211;&#160;I.&#160;&#8211;&#160;Toute entit&#233; juridique employant des journalistes professionnels au sens de l&#8217;article L.&#160;7111&#8209;3 du code du travail, produisant ou diffusant de l&#8217;information peut, &#224; l&#8217;initiative d&#8217;un seul journaliste, constituer un conseil de r&#233;daction.</p><p style=\"text-align: justify;\">&#171;&#160;Dans l&#8217;hypoth&#232;se o&#249; l&#8217;entit&#233; juridique comporte plusieurs titres, il peut &#234;tre constitu&#233; un conseil de r&#233;daction par titre.</p><p style=\"text-align: justify;\">&#171;&#160;Le conseil de r&#233;daction est compos&#233; de tous les journalistes professionnels qui contribuent &#224; la production de contenus journalistiques pour celui-ci, quel que soit le support et la technique utilis&#233;s.</p><p style=\"text-align: justify;\">&#171;&#160;Le conseil de r&#233;daction est dot&#233; de la personnalit&#233; juridique.</p><p style=\"text-align: justify;\">&#171;&#160;Le conseil de r&#233;daction &#233;labore un r&#232;glement int&#233;rieur qui d&#233;termine le nombre de ses repr&#233;sentants, leur fonction, la dur&#233;e de leur mandat et leurs pr&#233;rogatives.</p><p style=\"text-align: justify;\">&#171;&#160;II.&#160;&#8211;&#160;Le conseil de r&#233;daction&#160;:</p><p style=\"text-align: justify;\">&#171;&#160;1&#176;&#160;S&#8217;assure au quotidien que tous les journalistes de l&#8217;entreprise de presse concern&#233;e peuvent exercer leur travail en toute ind&#233;pendance des pouvoirs publics, des pouvoirs &#233;conomiques, notamment ceux qui constituent l&#8217;actionnariat du m&#233;dia auquel ils contribuent&#160;;</p><p style=\"text-align: justify;\">&#171;&#160;2&#176;&#160;S&#8217;assure que les journalistes qui en sont membres sont &#224; l&#8217;abri des pressions ou tentatives de pressions au but d&#8217;alt&#233;rer la pratique ind&#233;pendante de leur mission d&#8217;informer&#160;;</p><p style=\"text-align: justify;\">&#171;&#160;3&#176;&#160;S&#8217;assure que les journalistes qui en sont membres ne se trouvent pas en situation de conflit d&#8217;int&#233;r&#234;t&#160;;</p><p style=\"text-align: justify;\">&#171;&#160;4&#176;&#160;Est consult&#233; sur la d&#233;signation, la d&#233;mission du directeur et de ses adjoints, lorsqu&#8217;elle advient du fait du propri&#233;taire du titre&#160;;</p><p style=\"text-align: justify;\">&#171;&#160;5&#176;&#160;Formule des avis pr&#233;alables sur l&#8217;&#233;laboration et la modification de l&#8217;organisation de la r&#233;daction&#160;;</p><p style=\"text-align: justify;\">&#171;&#160;6&#176;&#160;Assure, de mani&#232;re ind&#233;pendante de l&#8217;actionnaire et de la r&#233;gie commerciale, la ligne &#233;ditoriale du m&#233;dia qui a &#233;t&#233; d&#233;finie au pr&#233;alable avec les cadres de direction repr&#233;sentant des actionnaires&#160;;</p><p style=\"text-align: justify;\">&#171;&#160;7&#176;&#160;Se prononce sur la conformit&#233; des &#233;crits ou des images publicitaires avec l&#8217;orientation &#233;ditoriale du titre&#160;;</p><p style=\"text-align: justify;\">&#171;&#160;8&#176;&#160;Re&#231;oit annuellement des informations sur le montant des aides &#224; la presse touch&#233;es par l&#8217;entit&#233; juridique mentionn&#233;e au I et s&#8217;assure de leur utilisation au b&#233;n&#233;fice de la qualit&#233; de l&#8217;information et du pluralisme&#160;;</p><p style=\"text-align: justify;\">&#171;&#160;Le conseil de r&#233;daction est &#233;galement inform&#233; et consult&#233;&#160;:</p><p style=\"text-align: justify;\">&#171;&#160;1&#176;&#160;Lors de mouvements capitalistiques importants repr&#233;sentant plus de 5&#160;% du capital de l&#8217;entit&#233; juridique mentionn&#233;e au I&#160;;</p><p style=\"text-align: justify;\">&#171;&#160;2&#176;&#160;Avant le d&#233;p&#244;t au greffe d&#8217;une demande d&#8217;ouverture d&#8217;une proc&#233;dure de redressement judiciaire ou de liquidation judiciaire&#160;;</p><p style=\"text-align: justify;\">&#171;&#160;3&#176;&#160;Lors d&#8217;une proc&#233;dure de sauvegarde, lors d&#8217;une proc&#233;dure de redressement judiciaire et lors d&#8217;une proc&#233;dure de liquidation judiciaire.</p><p style=\"text-align: justify;\">&#171;&#160;Lorsque le conseil de r&#233;daction a connaissance de faits de nature &#224; affecter de mani&#232;re pr&#233;occupante la situation &#233;conomique de l&#8217;entit&#233; juridique mentionn&#233;e au I, il peut demander que lui soit fournies des pi&#232;ces comptables ainsi que des explications, sans pour autant se substituer aux pr&#233;rogatives des autres instances repr&#233;sentatives existantes au sein de l&#8217;entit&#233; juridique.</p><p style=\"text-align: justify;\">&#171;&#160;Les conditions d&#8217;exercice de ce droit &#224; information seront fix&#233;es par d&#233;cret.</p><p style=\"text-align: justify;\">&#171;&#160;Le conseil de r&#233;daction ne se substitue pas &#224; la direction de la r&#233;daction.</p><p style=\"text-align: justify;\">&#171;&#160;En cas de disparition de l&#8217;entit&#233; juridique mentionn&#233;e au I, le Conseil de r&#233;daction conserve sa personnalit&#233; juridique pendant douze mois.</p><p style=\"text-align: justify;\">&#171;&#160;III.&#160;&#8211;&#160;Le conseil de r&#233;daction peut ester en justice pour assurer la d&#233;fense et le bon d&#233;roulement de toutes ses missions mentionn&#233;es &#224; l&#8217;article&#160;2 de la pr&#233;sente loi.&#160;&#187;</p><p style=\"text-align: justify;\">II.&#160;&#8211;&#160;L&#8217;article L.&#160;2328&#8209;1 du code du travail est compl&#233;t&#233; par une phrase ainsi r&#233;dig&#233;e&#160;: &#171;&#160;Le fait d&#8217;entraver la constitution ou le fonctionnement r&#233;gulier d&#8217;un conseil de r&#233;daction est puni des m&#234;mes peines, assorties d&#8217;une suspension partielle ou totale des aides publiques directes et indirectes dont b&#233;n&#233;ficie l&#8217;entit&#233; ainsi que l&#8217;obligation pour celle-ci de publier les sanctions judiciaires dont elle pourrait faire l&#8217;objet au titre de ses manquements.&#160;&#187;</p>",
    "exposeSommaire": "<p style=\"text-align: justify;\">Par cet amendement, nous proposons de renforcer les protections statutaires des journalistes &#224; travers la reconnaissance juridique des conseil de r&#233;daction, ce afin de garantir l&#8217;&#233;laboration d&#8217;une information de qualit&#233; seule &#224; m&#234;me de lutter contre les fausses informations.</p><p style=\"text-align: justify;\"><br />A cet effet, nous nous inscrivons dans une lign&#233;e transpartisane, puisque ces dispositions sont tir&#233;es des propositions de loi de la s&#233;natrice UDI Mme Nathalie Goulet d&#233;pos&#233;e en 2014 sur ce sujet (https&#160;://www.senat.fr/leg/ppl13&#8209;813.html) , ainsi que de celle propos&#233;e en 2010 par le d&#233;put&#233; PS M. Patrick Bloche (http&#160;://www.assemblee-nationale.fr/13/propositions/pion2255.asp), elles-m&#234;me inspir&#233;es directement des travaux du Syndicat national des journalistes (SNJ).</p><p style=\"text-align: justify;\"><br />En effet, conf&#233;rer un statut juridique aux r&#233;dactions (consacrer la reconnaissance juridique de l&#8217;&#233;quipe r&#233;dactionnelle) permet de prot&#233;ger les journalistes de pressions qu&#8217;ils pourraient subir en leur donnant la possibilit&#233; de r&#233;agir sur le terrain du droit. L&#8217;existence m&#234;me d&#8217;un statut protecteur deviendra ipso facto un frein &#224; d&#8217;&#233;ventuelles tentatives de pression.</p>",
    "annexeExposeSommaire": {
      "@xmlns:xsi": "http://www.w3.org/2001/XMLSchema-instance",
      "@xsi:nil": "true"
    }
  },
  "representations": {
    "representation": {
      "nom": "PDF",
      "typeMime": {
        "type": "application",
        "subType": "PDF"
      },
      "statutRepresentation": {
        "verbatim": "true",
        "canonique": "true",
        "officielle": "true",
        "transcription": "false",
        "enregistrement": "false"
      },
      "repSource": {
        "@xmlns:xsi": "http://www.w3.org/2001/XMLSchema-instance",
        "@xsi:nil": "true"
      },
      "offset": {
        "@xmlns:xsi": "http://www.w3.org/2001/XMLSchema-instance",
        "@xsi:nil": "true"
      },
      "contenu": {
        "documentURI": "/15/amendements/0799/CION-CEDU/AC120.pdf"
      },
      "dateDispoRepresentation": {
        "@xmlns:xsi": "http://www.w3.org/2001/XMLSchema-instance",
        "@xsi:nil": "true"
      }
    }
  },
  "seanceDiscussion": {
    "@xmlns:xsi": "http://www.w3.org/2001/XMLSchema-instance",
    "@xsi:nil": "true"
  },
  "sort": {
    "dateSaisie": "2018-05-30T12:01:53.000+02:00",
    "sortEnSeance": "Rejeté"
  },
  "dateDepot": "2018-05-25T02:00:00.000+02:00",
  "dateDistribution": "2018-05-29T02:00:00.000+02:00",
  "article99": "0",
  "loiReference": {
    "codeLoi": "z1881",
    "divisionCodeLoi": "6 bis"
  }
}