{
  "@xmlns": "http://schemas.assemblee-nationale.fr/referentiel",
  "uid": "AMANR5L15SEA717460BTC1019P0D1N1494",
  "identifiant": {
    "legislature": "15",
    "numero": "1494",
    "numRect": "0",
    "saisine": {
      "refTexteLegislatif": "PRJLANR5L15BTC1019",
      "numeroPartiePLF": "0",
      "organeExamen": "PO717460",
      "mentionSecondeDeliberation": "0"
    }
  },
  "numeroLong": "1494",
  "etapeTexte": "1ère lecture (1ère assemblée saisie)",
  "triAmendement": "gb",
  "cardinaliteAmdtMultiples": "1",
  "amendementParent": {
    "@xmlns:xsi": "http://www.w3.org/2001/XMLSchema-instance",
    "@xsi:nil": "true"
  },
  "etat": "Discuté",
  "signataires": {
    "auteur": {
      "typeAuteur": "Depute",
      "acteurRef": "PA856",
      "organeRef": {
        "@xmlns:xsi": "http://www.w3.org/2001/XMLSchema-instance",
        "@xsi:nil": "true"
      },
      "groupePolitiqueRef": "PO730934"
    },
    "cosignataires": {
      "acteurRef": [
        "PA721474",
        "PA856"
      ]
    },
    "texteAffichable": "M.&#160;Cherpion et M.&#160;Viry"
  },
  "pointeurFragmentTexte": {
    "missionVisee": {
      "@xmlns:xsi": "http://www.w3.org/2001/XMLSchema-instance",
      "@xsi:nil": "true"
    },
    "division": {
      "titre": "Article 14",
      "articleDesignationCourte": "ART. 14",
      "type": "ARTICLE",
      "avant_A_Apres": "A",
      "divisionRattachee": "ARTICLE 14",
      "articleAdditionnel": {
        "@xmlns:xsi": "http://www.w3.org/2001/XMLSchema-instance",
        "@xsi:nil": "true"
      },
      "chapitreAdditionnel": {
        "@xmlns:xsi": "http://www.w3.org/2001/XMLSchema-instance",
        "@xsi:nil": "true"
      },
      "urlDivisionTexteVise": "/15/textes/1019.asp#D_Article_14"
    },
    "alinea": {
      "avant_A_Apres": "Apres",
      "numero": "15",
      "alineaDesignation": {
        "@xmlns:xsi": "http://www.w3.org/2001/XMLSchema-instance",
        "@xsi:nil": "true"
      }
    }
  },
  "corps": {
    "dispositif": "<p style=\"text-align: justify;\">Apr&#232;s l&#8217;alin&#233;a&#160;15, ins&#233;rer les deux alin&#233;as suivants&#160;:</p><p style=\"text-align: justify;\">&#171;&#160;Les branches professionnelles int&#233;ress&#233;es, ou les op&#233;rateurs de comp&#233;tences auxquels elles adh&#232;rent lorsque ceux-ci ont &#233;t&#233; express&#233;ment d&#233;sign&#233;s, peuvent adresser aux commissions professionnelles consultatives tout avis pr&#233;alable relatif &#224; l&#8217;examen d&#8217;un dipl&#244;me ou d&#8217;un titre &#224; finalit&#233; professionnelle&#160;correspondant aux m&#233;tiers exerc&#233;s au sein des entreprises de leur champ de comp&#233;tence.</p><p style=\"text-align: justify;\">&#171;&#160;Les modalit&#233;s de transmission de cet avis pr&#233;alable sont pr&#233;cis&#233;es par d&#233;cret.&#160;&#187;</p>",
    "exposeSommaire": "<p style=\"text-align: justify;\">L&#8217;article&#160;14 du projet de loi attribue aux Commissions professionnelles consultatives (CPC) minist&#233;rielles la mission d&#8217;examiner les projets de cr&#233;ation, de r&#233;vision ou de suppression de dipl&#244;mes et titres &#224; finalit&#233; professionnelle et de leurs r&#233;f&#233;rentiels, &#224; l&#8217;exception des dipl&#244;mes de l&#8217;enseignement sup&#233;rieur.</p><p style=\"text-align: justify;\">Il est important que l&#8217;&#233;criture des r&#233;f&#233;rentiels d&#8217;activit&#233; des certifications soit faite en articulation &#233;troite avec les branches, de mani&#232;re &#224; s&#8217;assurer qu&#8217;elles r&#233;pondent aux besoins des entreprises, conform&#233;ment &#224; l&#8217;engagement initial du gouvernement.</p><p style=\"text-align: justify;\">A cette fin, le pr&#233;sent amendement permet aux branches professionnelles ou &#224; l&#8217;op&#233;rateur de comp&#233;tences lorsqu&#8217;elles l&#8217;ont d&#233;sign&#233;, d&#8217;adresser aux CPC des avis pr&#233;alables relatifs &#224; l&#8217;examen d&#8217;un titre ou un dipl&#244;me correspondant &#224; un m&#233;tier exerc&#233; au sein des entreprises qu&#8217;elles recouvrent.</p>",
    "annexeExposeSommaire": {
      "@xmlns:xsi": "http://www.w3.org/2001/XMLSchema-instance",
      "@xsi:nil": "true"
    }
  },
  "representations": {
    "representation": {
      "nom": "PDF",
      "typeMime": {
        "type": "application",
        "subType": "PDF"
      },
      "statutRepresentation": {
        "verbatim": "true",
        "canonique": "true",
        "officielle": "true",
        "transcription": "false",
        "enregistrement": "false"
      },
      "repSource": {
        "@xmlns:xsi": "http://www.w3.org/2001/XMLSchema-instance",
        "@xsi:nil": "true"
      },
      "offset": {
        "@xmlns:xsi": "http://www.w3.org/2001/XMLSchema-instance",
        "@xsi:nil": "true"
      },
      "contenu": {
        "documentURI": "/15/amendements/1019/AN/1494.pdf"
      },
      "dateDispoRepresentation": {
        "@xmlns:xsi": "http://www.w3.org/2001/XMLSchema-instance",
        "@xsi:nil": "true"
      }
    }
  },
  "seanceDiscussion": "RUANR5L15S2018IDS21104",
  "sort": {
    "dateSaisie": "2018-06-15T11:12:00.000+02:00",
    "sortEnSeance": "Rejeté"
  },
  "dateDepot": "2018-06-07T02:00:00.000+02:00",
  "dateDistribution": "2018-06-11T02:00:00.000+02:00",
  "article99": "0",
  "loiReference": {
    "codeLoi": {
      "@xmlns:xsi": "http://www.w3.org/2001/XMLSchema-instance",
      "@xsi:nil": "true"
    },
    "divisionCodeLoi": {
      "@xmlns:xsi": "http://www.w3.org/2001/XMLSchema-instance",
      "@xsi:nil": "true"
    }
  }
}