{
  "@xmlns": "http://schemas.assemblee-nationale.fr/referentiel",
  "uid": "AMANR5L15PO420120B1297P0D1N600",
  "identifiant": {
    "legislature": "15",
    "numero": "600",
    "numRect": "0",
    "saisine": {
      "refTexteLegislatif": "PRJLANR5L15B1297",
      "numeroPartiePLF": "0",
      "organeExamen": "PO420120",
      "mentionSecondeDeliberation": "0"
    }
  },
  "numeroLong": "AS600",
  "etapeTexte": "1ère lecture (1ère assemblée saisie)",
  "triAmendement": "bdaaaaaaaaaaaaaaaaaaaaaaaaaaaaaaaaaaaaaaaaaaaaaaaavo",
  "cardinaliteAmdtMultiples": "1",
  "amendementParent": {
    "@xmlns:xsi": "http://www.w3.org/2001/XMLSchema-instance",
    "@xsi:nil": "true"
  },
  "etat": "Discuté",
  "signataires": {
    "auteur": {
      "typeAuteur": "Depute",
      "acteurRef": "PA721434",
      "organeRef": {
        "@xmlns:xsi": "http://www.w3.org/2001/XMLSchema-instance",
        "@xsi:nil": "true"
      },
      "groupePolitiqueRef": "PO730964"
    },
    "cosignataires": {
      "acteurRef": [
        "PA720622",
        "PA721458",
        "PA718710",
        "PA721844",
        "PA721426",
        "PA718768",
        "PA718728",
        "PA721398",
        "PA718682",
        "PA721434",
        "PA720030",
        "PA722000",
        "PA720202",
        "PA719024"
      ]
    },
    "texteAffichable": "Mme&#160;Lardet,  Mme&#160;Degois, Mme&#160;Piron, Mme&#160;Pascale&#160;Boyer, Mme&#160;Riotton, M.&#160;Trompille, Mme&#160;Bureau-Bonnard, M.&#160;Roseren, Mme&#160;Vanceunebrock-Mialon, Mme&#160;Krimi, M.&#160;Freschi, M.&#160;Blanchet, Mme&#160;Valetta Ardisson et M.&#160;Buchou"
  },
  "pointeurFragmentTexte": {
    "missionVisee": {
      "@xmlns:xsi": "http://www.w3.org/2001/XMLSchema-instance",
      "@xsi:nil": "true"
    },
    "division": {
      "titre": "Article 10",
      "articleDesignationCourte": "APRÈS ART. 10",
      "type": "ARTICLE",
      "avant_A_Apres": "Après",
      "divisionRattachee": "APRÈS L'ARTICLE 10, insérer l'article suivant:",
      "articleAdditionnel": "1",
      "chapitreAdditionnel": {
        "@xmlns:xsi": "http://www.w3.org/2001/XMLSchema-instance",
        "@xsi:nil": "true"
      },
      "urlDivisionTexteVise": "/15/textes/1297.asp#D_Article_10"
    },
    "alinea": {
      "@xmlns:xsi": "http://www.w3.org/2001/XMLSchema-instance",
      "@xsi:nil": "true"
    }
  },
  "corps": {
    "dispositif": "<p style=\"text-align: justify;\">I.&#160;&#8211;&#160;L&#8217;article L.&#160;642&#8209;3 du code de la s&#233;curit&#233; sociale est compl&#233;t&#233; par un alin&#233;a ainsi r&#233;dig&#233;&#160;:</p><p style=\"text-align: justify;\">&#171;&#160;Sont exon&#233;r&#233;s du paiement des cotisations mentionn&#233;es &#224; l&#8217;article L.&#160;642&#8209;1 les professionnels lib&#233;raux pluriactifs dont les revenus d&#8217;activit&#233; sont inf&#233;rieurs &#224; un seuil d&#233;fini par d&#233;cret.&#160;&#187;</p><p style=\"text-align: justify;\">II.&#160;&#8211;&#160;La perte de recettes pour les organismes de s&#233;curit&#233; sociale est compens&#233;e &#224; due concurrence par la majoration des droits mentionn&#233;s aux articles 575 et 575 A du code g&#233;n&#233;ral des imp&#244;ts.</p>",
    "exposeSommaire": "<p style=\"text-align: justify;\">Cet amendement a pour objectif de prot&#233;ger les professionnels lib&#233;raux pluriactifs de l&#8217;accroissement de charges inutiles que constitue la cotisation obligatoire &#224; la CIPAV, quel que soit le b&#233;n&#233;fice d&#233;gag&#233; et alors m&#234;me que l&#8217;activit&#233; secondaire exerc&#233;e est temporaire, voir saisonni&#232;re.</p><p style=\"text-align: justify;\">In fine un professionnel lib&#233;ral qui r&#233;aliserait tr&#232;s peu de b&#233;n&#233;fices se verrait exon&#233;r&#233; du paiement des cotisations &#224; la CIPAV.</p><p style=\"text-align: justify;\">&#160;En effet, depuis l&#8217;entr&#233;e en vigueur de la loi de financement de la s&#233;curit&#233; sociale de 2016, ces professionnels, et particuli&#232;rement ceux exer&#231;ant une activit&#233; saisonni&#232;re, ont subi une augmentation tr&#232;s significative de leur cotisation d&#8217;assurance vieillesse alors m&#234;me que nombre d&#8217;entre eux ne d&#233;gagent que peu de b&#233;n&#233;fice sur leur activit&#233; temporaire.</p><p style=\"text-align: justify;\">A titre d&#8217;exemple, on peut citer le secteur du tourisme de montagne particuli&#232;rement touch&#233; par cette mesure, et plus sp&#233;cifiquement les moniteurs de ski. En effet, ceux-ci doivent obligatoirement &#234;tre affili&#233;s &#224; la Caisse interprofessionnelles de pr&#233;voyance et d&#8217;assurance vieillesse (CIPAV), qu&#8217;ils exercent cette activit&#233; &#224; plein temps ou juste quelques mois dans l&#8217;ann&#233;e. Pour les moniteurs de ski qui n&#8217;exercent cette activit&#233; qu&#8217;&#224; titre saisonnier, cette cotisation repr&#233;sente un co&#251;t non n&#233;gligeable, alors m&#234;me qu&#8217;ils cotisent d&#233;j&#224; par ailleurs &#224; un autre r&#233;gime de retraite, dans le cadre de leur activit&#233; professionnelle principale. De fait, le co&#251;t de cette double affiliation n&#8217;est pas sans cons&#233;quence sur le vivier de moniteurs de ski potentiellement int&#233;ress&#233;s, certains n&#8217;ayant pas les moyens financiers de supporter cette d&#233;pense et pr&#233;f&#233;rant d&#232;s lors se restreindre &#224; leur activit&#233; professionnelle principale et ne pas exercer leur monitorat. Pourtant, le renfort de ces moniteurs de ski saisonniers est indispensable, d&#8217;une part pour absorber les flux touristiques certains mois de l&#8217;ann&#233;e, et d&#8217;autre part pour la souplesse d&#8217;emploi temporaire qu&#8217;ils offrent, utiles quand la demande baisse puisqu&#8217;ils peuvent reprendre leur activit&#233; principale.</p>",
    "annexeExposeSommaire": {
      "@xmlns:xsi": "http://www.w3.org/2001/XMLSchema-instance",
      "@xsi:nil": "true"
    }
  },
  "representations": {
    "representation": {
      "nom": "PDF",
      "typeMime": {
        "type": "application",
        "subType": "PDF"
      },
      "statutRepresentation": {
        "verbatim": "true",
        "canonique": "true",
        "officielle": "true",
        "transcription": "false",
        "enregistrement": "false"
      },
      "repSource": {
        "@xmlns:xsi": "http://www.w3.org/2001/XMLSchema-instance",
        "@xsi:nil": "true"
      },
      "offset": {
        "@xmlns:xsi": "http://www.w3.org/2001/XMLSchema-instance",
        "@xsi:nil": "true"
      },
      "contenu": {
        "documentURI": "/15/amendements/1297/CION-SOC/AS600.pdf"
      },
      "dateDispoRepresentation": {
        "@xmlns:xsi": "http://www.w3.org/2001/XMLSchema-instance",
        "@xsi:nil": "true"
      }
    }
  },
  "seanceDiscussion": {
    "@xmlns:xsi": "http://www.w3.org/2001/XMLSchema-instance",
    "@xsi:nil": "true"
  },
  "sort": {
    "dateSaisie": "2018-10-16T19:11:27.000+02:00",
    "sortEnSeance": "Rejeté"
  },
  "dateDepot": "2018-10-12T02:00:00.000+02:00",
  "dateDistribution": "2018-10-15T02:00:00.000+02:00",
  "article99": "0",
  "loiReference": {
    "codeLoi": "sécurité sociale",
    "divisionCodeLoi": "L642-3"
  }
}