{
  "@xmlns": "http://schemas.assemblee-nationale.fr/referentiel",
  "uid": "AMANR5L15SEA717460BTC0971P0D1N1049",
  "identifiant": {
    "legislature": "15",
    "numero": "1049",
    "numRect": "0",
    "saisine": {
      "refTexteLegislatif": "PRJLANR5L15BTC0971",
      "numeroPartiePLF": "0",
      "organeExamen": "PO717460",
      "mentionSecondeDeliberation": "0"
    }
  },
  "numeroLong": "1049",
  "etapeTexte": "1ère lecture (1ère assemblée saisie)",
  "triAmendement": "di",
  "cardinaliteAmdtMultiples": "1",
  "amendementParent": {
    "@xmlns:xsi": "http://www.w3.org/2001/XMLSchema-instance",
    "@xsi:nil": "true"
  },
  "etat": "Discuté",
  "signataires": {
    "auteur": {
      "typeAuteur": "Depute",
      "acteurRef": "PA720210",
      "organeRef": {
        "@xmlns:xsi": "http://www.w3.org/2001/XMLSchema-instance",
        "@xsi:nil": "true"
      },
      "groupePolitiqueRef": "PO730934"
    },
    "cosignataires": {
      "acteurRef": [
        "PA712015",
        "PA721816",
        "PA643134",
        "PA267200",
        "PA608016",
        "PA748954",
        "PA267735",
        "PA643103",
        "PA609726",
        "PA721968",
        "PA720210",
        "PA608416",
        "PA2377"
      ]
    },
    "texteAffichable": "Mme&#160;Beauvais,  M.&#160;Savignat, M.&#160;Boucard, Mme&#160;Louwagie, M.&#160;Huyghe, M.&#160;de Ganay, M.&#160;Dive, M.&#160;Ferrara, Mme&#160;Valentin, M.&#160;Hetzel, M.&#160;Perrut, M.&#160;Aubert et M.&#160;Vialay"
  },
  "pointeurFragmentTexte": {
    "missionVisee": {
      "@xmlns:xsi": "http://www.w3.org/2001/XMLSchema-instance",
      "@xsi:nil": "true"
    },
    "division": {
      "titre": "Article 18 A",
      "articleDesignationCourte": "APRÈS ART. 18 A",
      "type": "ARTICLE",
      "avant_A_Apres": "Après",
      "divisionRattachee": "APRÈS L'ARTICLE 18 A, insérer l'article suivant:",
      "articleAdditionnel": "1",
      "chapitreAdditionnel": {
        "@xmlns:xsi": "http://www.w3.org/2001/XMLSchema-instance",
        "@xsi:nil": "true"
      },
      "urlDivisionTexteVise": "/15/textes/0971.asp#D_Article_18_A"
    },
    "alinea": {
      "@xmlns:xsi": "http://www.w3.org/2001/XMLSchema-instance",
      "@xsi:nil": "true"
    }
  },
  "corps": {
    "dispositif": "<p style=\"text-align: justify;\">L&#8217;article L.&#160;111&#8209;2 du code de la construction et de l&#8217;habitation est compl&#233;t&#233; par un alin&#233;a ainsi r&#233;dig&#233;&#160;:</p><p style=\"text-align: justify;\">&#171;&#160;Pour la construction neuve, la r&#233;novation ou la r&#233;habilitation de logements collectifs ou de groupements d&#8217;habitations de plus de deux logements, l&#8217;architecte charg&#233; d&#8217;&#233;tablir le projet architectural mentionn&#233; &#224; l&#8217;alin&#233;a pr&#233;c&#233;dent assure le suivi de la r&#233;alisation des travaux, et le cas &#233;ch&#233;ant, leur direction&#160;&#187;.</p>",
    "exposeSommaire": "<p style=\"text-align: justify;\">Afin de garantir aux usagers, mais aussi aux ma&#238;tres d&#8217;ouvrages, bailleurs sociaux ou promoteurs priv&#233;s, la qualit&#233; des logements et la conformit&#233; de leur r&#233;alisation, que ce soit dans le cadre d&#8217;une construction neuve ou d&#8217;une r&#233;novation, il est n&#233;cessaire de renforcer le suivi des travaux par la pr&#233;sence de l&#8217;architecte, auteur du projet architectural, tout au long du processus de construction.</p><p style=\"text-align: justify;\">La pr&#233;sence de l&#8217;architecte concepteur, tout au long de la r&#233;alisation des travaux, est garante de la qualit&#233; architecturale et technique de la construction, de la ma&#238;trise des &#233;volutions &#233;ventuelles du projet, de la coh&#233;rence des travaux avec le permis de construire jusqu&#8217;&#224; la d&#233;livrance de la d&#233;claration d&#8217;ach&#232;vement et de conformit&#233; des travaux (DACT).</p>",
    "annexeExposeSommaire": {
      "@xmlns:xsi": "http://www.w3.org/2001/XMLSchema-instance",
      "@xsi:nil": "true"
    }
  },
  "representations": {
    "representation": {
      "nom": "PDF",
      "typeMime": {
        "type": "application",
        "subType": "PDF"
      },
      "statutRepresentation": {
        "verbatim": "true",
        "canonique": "true",
        "officielle": "true",
        "transcription": "false",
        "enregistrement": "false"
      },
      "repSource": {
        "@xmlns:xsi": "http://www.w3.org/2001/XMLSchema-instance",
        "@xsi:nil": "true"
      },
      "offset": {
        "@xmlns:xsi": "http://www.w3.org/2001/XMLSchema-instance",
        "@xsi:nil": "true"
      },
      "contenu": {
        "documentURI": "/15/amendements/0971/AN/1049.pdf"
      },
      "dateDispoRepresentation": {
        "@xmlns:xsi": "http://www.w3.org/2001/XMLSchema-instance",
        "@xsi:nil": "true"
      }
    }
  },
  "seanceDiscussion": "RUANR5L15S2018IDS21082",
  "sort": {
    "dateSaisie": "2018-06-01T18:25:22.000+02:00",
    "sortEnSeance": "Non soutenu"
  },
  "dateDepot": "2018-05-25T02:00:00.000+02:00",
  "dateDistribution": "2018-05-31T02:00:00.000+02:00",
  "article99": "0",
  "loiReference": {
    "codeLoi": "c construction et habitation",
    "divisionCodeLoi": "L111-2"
  }
}