{
  "@xmlns": "http://schemas.assemblee-nationale.fr/referentiel",
  "uid": "AMANR5L15SEA717460BTC1019P0D1N951",
  "identifiant": {
    "legislature": "15",
    "numero": "951",
    "numRect": "0",
    "saisine": {
      "refTexteLegislatif": "PRJLANR5L15BTC1019",
      "numeroPartiePLF": "0",
      "organeExamen": "PO717460",
      "mentionSecondeDeliberation": "0"
    }
  },
  "numeroLong": "951",
  "etapeTexte": "1ère lecture (1ère assemblée saisie)",
  "triAmendement": "i",
  "cardinaliteAmdtMultiples": "1",
  "amendementParent": {
    "@xmlns:xsi": "http://www.w3.org/2001/XMLSchema-instance",
    "@xsi:nil": "true"
  },
  "etat": "Discuté",
  "signataires": {
    "auteur": {
      "typeAuteur": "Depute",
      "acteurRef": "PA718926",
      "organeRef": {
        "@xmlns:xsi": "http://www.w3.org/2001/XMLSchema-instance",
        "@xsi:nil": "true"
      },
      "groupePolitiqueRef": "PO730940"
    },
    "cosignataires": {
      "acteurRef": [
        "PA610667",
        "PA267306",
        "PA718720",
        "PA718926",
        "PA720546",
        "PA722202",
        "PA722110",
        "PA721012",
        "PA689",
        "PA441",
        "PA335612",
        "PA610654",
        "PA721118",
        "PA720692",
        "PA721270",
        "PA721896"
      ]
    },
    "texteAffichable": "M.&#160;Dharr&#233;ville,  Mme&#160;Bello, M.&#160;Brotherson, M.&#160;Bruneel, Mme&#160;Buffet, M.&#160;Chassaigne, M.&#160;Dufr&#232;gne, Mme&#160;Faucillon, M.&#160;Jumel, Mme&#160;K&#233;clard-Mond&#233;sir, M.&#160;Lecoq, M.&#160;Nilor, M.&#160;Peu, M.&#160;Fabien&#160;Roussel, M.&#160;Serville et M.&#160;Wulfranc"
  },
  "pointeurFragmentTexte": {
    "missionVisee": {
      "@xmlns:xsi": "http://www.w3.org/2001/XMLSchema-instance",
      "@xsi:nil": "true"
    },
    "division": {
      "titre": "Article 7",
      "articleDesignationCourte": "ART. 7",
      "type": "ARTICLE",
      "avant_A_Apres": "A",
      "divisionRattachee": "ARTICLE 7",
      "articleAdditionnel": {
        "@xmlns:xsi": "http://www.w3.org/2001/XMLSchema-instance",
        "@xsi:nil": "true"
      },
      "chapitreAdditionnel": {
        "@xmlns:xsi": "http://www.w3.org/2001/XMLSchema-instance",
        "@xsi:nil": "true"
      },
      "urlDivisionTexteVise": "/15/textes/1019.asp#D_Article_7"
    },
    "alinea": {
      "avant_A_Apres": {
        "@xmlns:xsi": "http://www.w3.org/2001/XMLSchema-instance",
        "@xsi:nil": "true"
      },
      "numero": "4",
      "alineaDesignation": {
        "@xmlns:xsi": "http://www.w3.org/2001/XMLSchema-instance",
        "@xsi:nil": "true"
      }
    }
  },
  "corps": {
    "dispositif": "<p style=\"text-align: justify;\">Supprimer les alin&#233;as 4 et 5.</p>",
    "exposeSommaire": "<p style=\"text-align: justify;\">L&#8217;article&#160;7 marque un renversement sans pr&#233;c&#233;dent dans les objectifs de l&#8217;apprentissage.</p><p style=\"text-align: justify;\">Il pr&#233;voit que l&#8217;apprentissage &#171;&#160;contribue &#224; l&#8217;insertion professionnelle&#160;&#187;. Nous ne pouvons souscrire &#224; cette logique qui vise &#224; affaiblir la dimension &#233;ducative de l&#8217;apprentissage au profit d&#8217;une vision ad&#233;quationniste au service des besoins de main d&#8217;&#339;uvre imm&#233;diats des entreprises.</p><p style=\"text-align: justify;\">C&#8217;est seulement en garantissant un socle large de connaissances et de comp&#233;tences &#224; travers l&#8217;enseignement de savoirs th&#233;oriques que nous pourrons assurer les conditions d&#8217;une formation tout au long de la vie.</p><p style=\"text-align: justify;\">C&#8217;est pourquoi nous demandons la suppression de cette disposition.</p>",
    "annexeExposeSommaire": {
      "@xmlns:xsi": "http://www.w3.org/2001/XMLSchema-instance",
      "@xsi:nil": "true"
    }
  },
  "representations": {
    "representation": {
      "nom": "PDF",
      "typeMime": {
        "type": "application",
        "subType": "PDF"
      },
      "statutRepresentation": {
        "verbatim": "true",
        "canonique": "true",
        "officielle": "true",
        "transcription": "false",
        "enregistrement": "false"
      },
      "repSource": {
        "@xmlns:xsi": "http://www.w3.org/2001/XMLSchema-instance",
        "@xsi:nil": "true"
      },
      "offset": {
        "@xmlns:xsi": "http://www.w3.org/2001/XMLSchema-instance",
        "@xsi:nil": "true"
      },
      "contenu": {
        "documentURI": "/15/amendements/1019/AN/951.pdf"
      },
      "dateDispoRepresentation": {
        "@xmlns:xsi": "http://www.w3.org/2001/XMLSchema-instance",
        "@xsi:nil": "true"
      }
    }
  },
  "seanceDiscussion": "RUANR5L15S2018IDS21102",
  "sort": {
    "dateSaisie": "2018-06-14T15:54:26.000+02:00",
    "sortEnSeance": "Rejeté"
  },
  "dateDepot": "2018-06-07T02:00:00.000+02:00",
  "dateDistribution": "2018-06-11T02:00:00.000+02:00",
  "article99": "0",
  "loiReference": {
    "codeLoi": {
      "@xmlns:xsi": "http://www.w3.org/2001/XMLSchema-instance",
      "@xsi:nil": "true"
    },
    "divisionCodeLoi": {
      "@xmlns:xsi": "http://www.w3.org/2001/XMLSchema-instance",
      "@xsi:nil": "true"
    }
  }
}