{
  "@xmlns": "http://schemas.assemblee-nationale.fr/referentiel",
  "uid": "AMANR5L15PO419865B1831P0D1N1731",
  "identifiant": {
    "legislature": "15",
    "numero": "1731",
    "numRect": "0",
    "saisine": {
      "refTexteLegislatif": "PRJLANR5L15B1831",
      "numeroPartiePLF": "0",
      "organeExamen": "PO419865",
      "mentionSecondeDeliberation": "0"
    }
  },
  "numeroLong": "CD1731",
  "etapeTexte": "1ère lecture (2ème assemblée saisie)",
  "triAmendement": "afaaaaaaaaaaaaaaaaaaaaaaaaaaaaaaaaaaaaaaaaaaaaaaaanz",
  "cardinaliteAmdtMultiples": "1",
  "amendementParent": {
    "@xmlns:xsi": "http://www.w3.org/2001/XMLSchema-instance",
    "@xsi:nil": "true"
  },
  "etat": "Discuté",
  "signataires": {
    "auteur": {
      "typeAuteur": "Depute",
      "acteurRef": "PA720764",
      "organeRef": {
        "@xmlns:xsi": "http://www.w3.org/2001/XMLSchema-instance",
        "@xsi:nil": "true"
      },
      "groupePolitiqueRef": "PO730970"
    },
    "cosignataires": {
      "acteurRef": [
        "PA720334",
        "PA720764",
        "PA719918"
      ]
    },
    "texteAffichable": "Mme&#160;Lasserre-David,  M.&#160;Pahun et M.&#160;Lain&#233;"
  },
  "pointeurFragmentTexte": {
    "missionVisee": {
      "@xmlns:xsi": "http://www.w3.org/2001/XMLSchema-instance",
      "@xsi:nil": "true"
    },
    "division": {
      "titre": "Article PREMIER",
      "articleDesignationCourte": "APRÈS ART. PREMIER",
      "type": "ARTICLE",
      "avant_A_Apres": "Après",
      "divisionRattachee": "APRÈS L'ARTICLE PREMIER, insérer l'article suivant:",
      "articleAdditionnel": "1",
      "chapitreAdditionnel": {
        "@xmlns:xsi": "http://www.w3.org/2001/XMLSchema-instance",
        "@xsi:nil": "true"
      },
      "urlDivisionTexteVise": "/15/textes/1831.asp#D_Article_1er"
    },
    "alinea": {
      "@xmlns:xsi": "http://www.w3.org/2001/XMLSchema-instance",
      "@xsi:nil": "true"
    }
  },
  "corps": {
    "dispositif": "<p style=\"text-align: justify;\">L&#8217;article L.&#160;3111&#8209;12 du code des transports est compl&#233;t&#233; par quatre alin&#233;as ainsi r&#233;dig&#233;s&#160;:</p><p style=\"text-align: justify;\">&#171;&#160;Afin de favoriser le d&#233;veloppement de l&#8217;offre de transport sur tous les territoires, y compris dans les zones peu denses, l&#8217;autorit&#233; organisatrice de la mobilit&#233; peut d&#233;cider d&#8217;organiser les services mentionn&#233;s au premier alin&#233;a du pr&#233;sent article en coop&#233;ration avec les associations mentionn&#233;es au m&#234;me article. Ces associations peuvent recourir, pour l&#8217;ex&#233;cution de certaines prestations, a&#768; des entreprises de transport public.</p><p style=\"text-align: justify;\">&#171;&#160;L&#8217;ex&#233;cution des services est assur&#233;e dans le cadre de deux conventions, l&#8217;une entre l&#8217;autorit&#233; organisatrice et l&#8217;association, et l&#8217;autre entre l&#8217;association et l&#8217;entreprise de transport public. Ces deux conventions fixent la consistance et les conditions de fonctionnement des services. Elles d&#233;terminent &#233;galement les missions et les responsabilit&#233;s de chacune des parties.</p><p style=\"text-align: justify;\">&#171;&#160;Dans ce cadre, seule l&#8217;association est comp&#233;tente pour exploiter le service de transport scolaire ou a&#768; la demande.</p><p style=\"text-align: justify;\">&#171;&#160;L&#8217;entreprise de transport public peut se voir confier des prestations de conseil et d&#8217;assistance technique par l&#8217;association. Elle peut, le cas &#233;ch&#233;ant, favoriser le d&#233;veloppement du service en mettant a&#768; disposition de l&#8217;association des moyens mat&#233;riels n&#233;cessitant un savoir-faire sp&#233;cifique ou r&#233;aliser des prestations dont le cou&#770;t ne saurait &#234;tre raisonnablement et int&#233;gralement pris en charge par une association a&#768; but non lucratif.&#160;&#187;</p>",
    "exposeSommaire": "<p>Cet amendement vise &#224; proposer un nouvel outil &#224; disposition des AOM afin de contribuer au d&#233;senclavement de certains territoires et &#224; couvrir les d&#233;serts de mobilit&#233; avec des solutions peu on&#233;reuses, adapt&#233;es au contexte local, p&#233;rennes et s&#8217;adressant &#224; tous. En cela, cette mesure correspond &#224; l&#8217;objectif g&#233;n&#233;ral de la loi d&#8217;orientation des mobilit&#233;s, de r&#233;duire les fractures territoriales et de relever le d&#233;fi du manque de solutions de mobilit&#233;.</p><p style=\"text-align: justify;\">Elle permet &#233;galement de proposer des solutions alternatives &#224; l&#8217;usage individuel de la voiture en favorisant une mobilit&#233; plus inclusive, solidaire et permettant de d&#233;passer le ph&#233;nom&#232;ne d&#8217;assignation &#224; r&#233;sidence qui peu exister aujourd&#8217;hui sur ces territoires.</p><p style=\"text-align: justify;\">Cette solution existe aux Pays Bas depuis les ann&#233;es 1970 avec la mise en place les bus de quartier. Ce syst&#232;me de navettes vise &#224; stimuler le transport public dans les zones rurales. Aujourd&#8217;hui ce sont 1&#160;200 conducteurs b&#233;n&#233;voles qui conduisent pr&#232;s de 150 bus de quartier pour 220&#160;000 voyages par an sur des zones qui ne sont pas couvertes par des lignes r&#233;guli&#232;res de transport public.</p><p style=\"text-align: justify;\">Diff&#233;rents acteurs sont impliqu&#233;s dans la mise en &#339;uvre, dont les op&#233;rateurs de transport public qui fournissent les v&#233;hicules et s&#8217;occupent de leur maintenance. Ces navettes sont ensuite conduites par des b&#233;n&#233;voles organis&#233;s en association.</p><p style=\"text-align: justify;\">En France, gr&#226;ce &#224; cette mesure, les autorit&#233;s organisatrices pourraient recourir &#224; des initiatives solidaires afin d&#8217;organiser un service de transport scolaire ou &#224; la demande assur&#233; par des b&#233;n&#233;voles, organis&#233;s en association, et b&#233;n&#233;ficier de l&#8217;accompagnement d&#8217;un op&#233;rateur de transport public (maintenance, assistance technique, etc.).</p>",
    "annexeExposeSommaire": {
      "@xmlns:xsi": "http://www.w3.org/2001/XMLSchema-instance",
      "@xsi:nil": "true"
    },
    "cartoucheDelaiDepotDepasse": {
      "@xmlns:xsi": "http://www.w3.org/2001/XMLSchema-instance",
      "@xsi:nil": "true"
    }
  },
  "representations": {
    "representation": {
      "nom": "PDF",
      "typeMime": {
        "type": "application",
        "subType": "PDF"
      },
      "statutRepresentation": {
        "verbatim": "true",
        "canonique": "true",
        "officielle": "true",
        "transcription": "false",
        "enregistrement": "false"
      },
      "repSource": {
        "@xmlns:xsi": "http://www.w3.org/2001/XMLSchema-instance",
        "@xsi:nil": "true"
      },
      "offset": {
        "@xmlns:xsi": "http://www.w3.org/2001/XMLSchema-instance",
        "@xsi:nil": "true"
      },
      "contenu": {
        "documentURI": "/15/amendements/1831/CION-DVP/CD1731.pdf"
      },
      "dateDispoRepresentation": {
        "@xmlns:xsi": "http://www.w3.org/2001/XMLSchema-instance",
        "@xsi:nil": "true"
      }
    }
  },
  "seanceDiscussion": {
    "@xmlns:xsi": "http://www.w3.org/2001/XMLSchema-instance",
    "@xsi:nil": "true"
  },
  "sort": {
    "dateSaisie": "2019-05-16T11:05:38.000+02:00",
    "sortEnSeance": "Retiré"
  },
  "dateDepot": "2019-05-09T02:00:00.000+02:00",
  "dateDistribution": "2019-05-14T02:00:00.000+02:00",
  "article99": "0",
  "loiReference": {
    "codeLoi": "transports",
    "divisionCodeLoi": "L3111-12"
  }
}