{
  "@xmlns": "http://schemas.assemblee-nationale.fr/referentiel",
  "uid": "AMANR5L15SEA717460BTC1772P0D1N29",
  "identifiant": {
    "legislature": "15",
    "numero": "29",
    "numRect": "0",
    "saisine": {
      "refTexteLegislatif": "PIONANR5L15BTC1772",
      "numeroPartiePLF": "0",
      "organeExamen": "PO717460",
      "mentionSecondeDeliberation": "0"
    }
  },
  "numeroLong": "29",
  "etapeTexte": "1ère lecture (1ère assemblée saisie)",
  "triAmendement": "daaaaaaaaaaaaaaaaaaaaaaaaaaaaaaaaaaaaaaaaaaaaaaaaajs",
  "cardinaliteAmdtMultiples": "1",
  "amendementParent": {
    "@xmlns:xsi": "http://www.w3.org/2001/XMLSchema-instance",
    "@xsi:nil": "true"
  },
  "etat": "Discuté",
  "signataires": {
    "auteur": {
      "typeAuteur": "Depute",
      "acteurRef": "PA718926",
      "organeRef": {
        "@xmlns:xsi": "http://www.w3.org/2001/XMLSchema-instance",
        "@xsi:nil": "true"
      },
      "groupePolitiqueRef": "PO730940"
    },
    "cosignataires": {
      "acteurRef": [
        "PA722110",
        "PA720546",
        "PA718720",
        "PA721012",
        "PA267306",
        "PA610667",
        "PA441",
        "PA721270",
        "PA721118",
        "PA721896",
        "PA610654",
        "PA722202",
        "PA335612",
        "PA718926",
        "PA720692",
        "PA689"
      ]
    },
    "texteAffichable": "M.&#160;Dharr&#233;ville,  Mme&#160;Bello, M.&#160;Brotherson, M.&#160;Bruneel, Mme&#160;Buffet, M.&#160;Chassaigne, M.&#160;Dufr&#232;gne, Mme&#160;Faucillon, M.&#160;Jumel, Mme&#160;K&#233;clard-Mond&#233;sir, M.&#160;Lecoq, M.&#160;Nilor, M.&#160;Peu, M.&#160;Fabien&#160;Roussel, M.&#160;Serville et M.&#160;Wulfranc"
  },
  "pointeurFragmentTexte": {
    "missionVisee": {
      "@xmlns:xsi": "http://www.w3.org/2001/XMLSchema-instance",
      "@xsi:nil": "true"
    },
    "division": {
      "titre": "Article 2",
      "articleDesignationCourte": "ART. 2",
      "type": "ARTICLE",
      "avant_A_Apres": "A",
      "divisionRattachee": "ARTICLE 2",
      "articleAdditionnel": {
        "@xmlns:xsi": "http://www.w3.org/2001/XMLSchema-instance",
        "@xsi:nil": "true"
      },
      "chapitreAdditionnel": {
        "@xmlns:xsi": "http://www.w3.org/2001/XMLSchema-instance",
        "@xsi:nil": "true"
      },
      "urlDivisionTexteVise": "/15/textes/1772.asp#D_Article_2"
    },
    "alinea": {
      "@xmlns:xsi": "http://www.w3.org/2001/XMLSchema-instance",
      "@xsi:nil": "true"
    }
  },
  "corps": {
    "dispositif": "<p style=\"text-align: justify;\">Supprimer cet article.</p>",
    "exposeSommaire": "<p style=\"text-align: justify;\">L&#8217;article&#160;2 pr&#233;voit d&#8217;ouvrir la possibilit&#233; de r&#233;silier sans frais et &#224; tout moment apr&#232;s la premi&#232;re ann&#233;e de souscription les contrats de compl&#233;mentaire sant&#233; offerts par les instituts de pr&#233;voyance.</p><p style=\"text-align: justify;\">Cette proposition de loi part d&#8217;un mauvais constat. Si les prix des compl&#233;mentaires sant&#233; augmentent depuis plusieurs ann&#233;es, c&#8217;est d&#8217;abord en raison d&#8217;un transfert de charges progressif de la s&#233;curit&#233; sociale et de l&#8217;&#201;tat vers les organismes compl&#233;mentaires sant&#233;.</p><p style=\"text-align: justify;\">Outre une remise en cause de la logique solidarit&#233; entre assur&#233;s propre au secteur mutualiste, la volont&#233; de lib&#233;raliser le secteur des compl&#233;mentaires sant&#233; risque d&#8217;accroitre la concurrence sur la qualit&#233; des couvertures sant&#233; sans effets notables sur les prix. A l&#8217;inverse la promotion des logiques de nomadisme chez les assur&#233;s risque avant tout de profiter aux assur&#233;s consid&#233;r&#233;s comme solvables et &#224; &#171;&#160;faible risque&#160;&#187; au d&#233;triment des assur&#233;s plus pr&#233;caires et plus &#226;g&#233;s.</p><p style=\"text-align: justify;\">Pour ces diff&#233;rentes raisons, nous demandons la suppression de cet article.</p>",
    "annexeExposeSommaire": {
      "@xmlns:xsi": "http://www.w3.org/2001/XMLSchema-instance",
      "@xsi:nil": "true"
    },
    "cartoucheDelaiDepotDepasse": {
      "@xmlns:xsi": "http://www.w3.org/2001/XMLSchema-instance",
      "@xsi:nil": "true"
    }
  },
  "representations": {
    "representation": {
      "nom": "PDF",
      "typeMime": {
        "type": "application",
        "subType": "PDF"
      },
      "statutRepresentation": {
        "verbatim": "true",
        "canonique": "true",
        "officielle": "true",
        "transcription": "false",
        "enregistrement": "false"
      },
      "repSource": {
        "@xmlns:xsi": "http://www.w3.org/2001/XMLSchema-instance",
        "@xsi:nil": "true"
      },
      "offset": {
        "@xmlns:xsi": "http://www.w3.org/2001/XMLSchema-instance",
        "@xsi:nil": "true"
      },
      "contenu": {
        "documentURI": "/15/amendements/1772/AN/29.pdf"
      },
      "dateDispoRepresentation": {
        "@xmlns:xsi": "http://www.w3.org/2001/XMLSchema-instance",
        "@xsi:nil": "true"
      }
    }
  },
  "seanceDiscussion": {
    "@xmlns:xsi": "http://www.w3.org/2001/XMLSchema-instance",
    "@xsi:nil": "true"
  },
  "sort": {
    "dateSaisie": "2019-03-27T19:32:39.000+01:00",
    "sortEnSeance": "Rejeté"
  },
  "dateDepot": "2019-03-22T01:00:00.000+01:00",
  "dateDistribution": "2019-03-26T01:00:00.000+01:00",
  "article99": "0",
  "loiReference": {
    "codeLoi": {
      "@xmlns:xsi": "http://www.w3.org/2001/XMLSchema-instance",
      "@xsi:nil": "true"
    },
    "divisionCodeLoi": {
      "@xmlns:xsi": "http://www.w3.org/2001/XMLSchema-instance",
      "@xsi:nil": "true"
    }
  }
}