{
  "@xmlns": "http://schemas.assemblee-nationale.fr/referentiel",
  "uid": "AMANR5L15PO419604B0391P0D1N51",
  "identifiant": {
    "legislature": "15",
    "numero": "51",
    "numRect": "0",
    "saisine": {
      "refTexteLegislatif": "PRJLANR5L15B0391",
      "numeroPartiePLF": "0",
      "organeExamen": "PO419604",
      "mentionSecondeDeliberation": "0"
    }
  },
  "numeroLong": "AC51",
  "etapeTexte": "1ère lecture (1ère assemblée saisie)",
  "triAmendement": "dnoo",
  "cardinaliteAmdtMultiples": "1",
  "amendementParent": {
    "@xmlns:xsi": "http://www.w3.org/2001/XMLSchema-instance",
    "@xsi:nil": "true"
  },
  "etat": "Discuté",
  "signataires": {
    "auteur": {
      "typeAuteur": "Depute",
      "acteurRef": "PA719146",
      "organeRef": {
        "@xmlns:xsi": "http://www.w3.org/2001/XMLSchema-instance",
        "@xsi:nil": "true"
      },
      "groupePolitiqueRef": "PO723569"
    },
    "cosignataires": {
      "acteurRef": [
        "PA719138",
        "PA719146",
        "PA719286"
      ]
    },
    "texteAffichable": "M.&#160;Acquaviva,  M.&#160;Castellani et M.&#160;Colombani"
  },
  "pointeurFragmentTexte": {
    "missionVisee": {
      "@xmlns:xsi": "http://www.w3.org/2001/XMLSchema-instance",
      "@xsi:nil": "true"
    },
    "division": {
      "titre": "Article PREMIER",
      "articleDesignationCourte": "ART. PREMIER",
      "type": "ARTICLE",
      "avant_A_Apres": "A",
      "divisionRattachee": "ARTICLE PREMIER",
      "articleAdditionnel": {
        "@xmlns:xsi": "http://www.w3.org/2001/XMLSchema-instance",
        "@xsi:nil": "true"
      },
      "chapitreAdditionnel": {
        "@xmlns:xsi": "http://www.w3.org/2001/XMLSchema-instance",
        "@xsi:nil": "true"
      },
      "urlDivisionTexteVise": "/15/textes/0391.asp#D_Article_1er"
    },
    "alinea": {
      "avant_A_Apres": "A",
      "numero": "5",
      "alineaDesignation": "Alinéa 5"
    }
  },
  "corps": {
    "dispositif": "<p style=\"text-align: justify;\">R&#233;diger ainsi la derni&#232;re phrase de l&#8217;alin&#233;a&#160;5&#160;:</p><p style=\"text-align: justify;\">&#171;&#160;Lorsque l&#8217;effectif des candidats exc&#232;de les capacit&#233;s d&#8217;accueil d&#8217;une formation arr&#234;t&#233;es &#233;tablissement par &#233;tablissement selon les modalit&#233;s pr&#233;vues au II, elle peut, compte tenu d&#8217;une part des caract&#233;ristiques de la formation et d&#8217;autre part, de l&#8217;appr&#233;ciation port&#233;e sur l&#8217;acquis de la formation ant&#233;rieure du candidat ainsi que ses comp&#233;tences, &#234;tre subordonn&#233;e &#224; l&#8217;acceptation, par ce dernier, du b&#233;n&#233;fice des dispositifs d&#8217;accompagnement p&#233;dagogique ou du parcours de formation personnalis&#233; propos&#233;s par l&#8217;&#233;tablissement pour favoriser sa r&#233;ussite.&#160;&#187;</p>",
    "exposeSommaire": "<p style=\"text-align: justify;\">La s&#233;lection g&#233;n&#233;ralis&#233;e &#224; l&#8217;entr&#233;e en premier cycle pour toutes les formations, que le texte ne nomme pas clairement, porte atteinte &#224; l&#8217;&#233;galit&#233; des chances.</p><p style=\"text-align: justify;\">C&#8217;est pourquoi, cet amendement r&#233;tabli, d&#8217;une part, le principe g&#233;n&#233;ral d&#8217;inscription libre dans l&#8217;enseignement sup&#233;rieur, il r&#233;int&#232;gre, d&#8217;autre part, le crit&#232;re de lieu d&#8217;habitation pour l&#8217;affectation prioritaire dans un &#233;tablissement. La suppression de ce crit&#232;re pourra conduire &#224; &#233;vincer, pour des raisons de capacit&#233;s d&#8217;accueil, des &#233;tudiants de l&#8217;acad&#233;mie qui r&#233;pondent aux attendus mais qui ne pourront pas faire leurs &#233;tudes ailleurs que sur un territoire proche, simplement pour des raisons financi&#232;res.</p><p style=\"text-align: justify;\">Toutefois, on ne peut nier l&#8217;existence r&#233;elle de fili&#232;res en tension dans certaines universit&#233;s sp&#233;cifiquement dans lesquelles une s&#233;lection par l&#8217;&#233;chec s&#8217;op&#232;re in fine pour de nombreux &#233;tudiants mal orient&#233;s. C&#8217;est la raison pour laquelle cet amendement propose de limiter l&#8217;acceptation pr&#233;alable aux seules fili&#232;res sous tension appr&#233;ci&#233;es universit&#233; par universit&#233; par les pr&#233;sidents d&#8217;&#233;tablissements et l&#8217;autorit&#233; acad&#233;mique.</p>",
    "annexeExposeSommaire": {
      "@xmlns:xsi": "http://www.w3.org/2001/XMLSchema-instance",
      "@xsi:nil": "true"
    }
  },
  "representations": {
    "representation": {
      "nom": "PDF",
      "typeMime": {
        "type": "application",
        "subType": "PDF"
      },
      "statutRepresentation": {
        "verbatim": "true",
        "canonique": "true",
        "officielle": "true",
        "transcription": "false",
        "enregistrement": "false"
      },
      "repSource": {
        "@xmlns:xsi": "http://www.w3.org/2001/XMLSchema-instance",
        "@xsi:nil": "true"
      },
      "offset": {
        "@xmlns:xsi": "http://www.w3.org/2001/XMLSchema-instance",
        "@xsi:nil": "true"
      },
      "contenu": {
        "documentURI": "/15/amendements/0391/CION-CEDU/AC51.pdf"
      },
      "dateDispoRepresentation": {
        "@xmlns:xsi": "http://www.w3.org/2001/XMLSchema-instance",
        "@xsi:nil": "true"
      }
    }
  },
  "seanceDiscussion": {
    "@xmlns:xsi": "http://www.w3.org/2001/XMLSchema-instance",
    "@xsi:nil": "true"
  },
  "sort": {
    "dateSaisie": "2017-12-05T18:37:32.000+01:00",
    "sortEnSeance": "Tombé"
  },
  "dateDepot": "2017-12-01T01:00:00.000+01:00",
  "dateDistribution": "2017-12-04T01:00:00.000+01:00",
  "article99": "0",
  "loiReference": {
    "codeLoi": {
      "@xmlns:xsi": "http://www.w3.org/2001/XMLSchema-instance",
      "@xsi:nil": "true"
    },
    "divisionCodeLoi": {
      "@xmlns:xsi": "http://www.w3.org/2001/XMLSchema-instance",
      "@xsi:nil": "true"
    }
  }
}