{
  "@xmlns": "http://schemas.assemblee-nationale.fr/referentiel",
  "uid": "AMANR5L15SEA717460B0384P0D1N124",
  "identifiant": {
    "legislature": "15",
    "numero": "124",
    "numRect": "0",
    "saisine": {
      "refTexteLegislatif": "PRJLANR5L15B0384",
      "numeroPartiePLF": "0",
      "organeExamen": "PO717460",
      "mentionSecondeDeliberation": "0"
    }
  },
  "numeroLong": "124",
  "etapeTexte": "1ère lecture (1ère assemblée saisie)",
  "triAmendement": "bbe",
  "cardinaliteAmdtMultiples": "1",
  "amendementParent": {
    "@xmlns:xsi": "http://www.w3.org/2001/XMLSchema-instance",
    "@xsi:nil": "true"
  },
  "etat": "Discuté",
  "signataires": {
    "auteur": {
      "typeAuteur": "Depute",
      "acteurRef": "PA642847",
      "organeRef": {
        "@xmlns:xsi": "http://www.w3.org/2001/XMLSchema-instance",
        "@xsi:nil": "true"
      },
      "groupePolitiqueRef": "PO730934"
    },
    "cosignataires": {
      "acteurRef": "PA642847"
    },
    "texteAffichable": "M.&#160;Bazin"
  },
  "pointeurFragmentTexte": {
    "missionVisee": {
      "@xmlns:xsi": "http://www.w3.org/2001/XMLSchema-instance",
      "@xsi:nil": "true"
    },
    "division": {
      "titre": "Article 13",
      "articleDesignationCourte": "ART. 13",
      "type": "ARTICLE",
      "avant_A_Apres": "A",
      "divisionRattachee": "ARTICLE 13",
      "articleAdditionnel": {
        "@xmlns:xsi": "http://www.w3.org/2001/XMLSchema-instance",
        "@xsi:nil": "true"
      },
      "chapitreAdditionnel": {
        "@xmlns:xsi": "http://www.w3.org/2001/XMLSchema-instance",
        "@xsi:nil": "true"
      },
      "urlDivisionTexteVise": "/15/textes/0384.asp#D_Article_13"
    },
    "alinea": {
      "avant_A_Apres": "Apres",
      "numero": "23",
      "alineaDesignation": {
        "@xmlns:xsi": "http://www.w3.org/2001/XMLSchema-instance",
        "@xsi:nil": "true"
      }
    }
  },
  "corps": {
    "dispositif": "<p style=\"text-align: justify;\">I.&#160;&#8211;&#160;Apr&#232;s l&#8217;alin&#233;a&#160;24, ins&#233;rer l&#8217;alin&#233;a suivant&#160;:</p><p style=\"text-align: justify;\">&#171;&#160;II bis.&#160;&#8211;&#160;Peuvent &#233;galement &#234;tre class&#233;es dans un bassin urbain &#224; dynamiser les communes satisfaisant aux conditions pr&#233;vues aux 2&#176; et 3&#176; du II sur le territoire duquel est localis&#233;e ou a &#233;t&#233; localis&#233;e une mine d&#8217;exploitation d&#8217;un g&#238;te contenant de la houille ou du lignite au sens du&#160;1&#176; de l&#8217;article L.&#160;111&#8209;1 du code minier.&#160;&#187;</p><p style=\"text-align: justify;\">II.&#160;&#8211;&#160;Compl&#233;ter cet article par les deux alin&#233;as suivants&#160;:</p><p style=\"text-align: justify;\">&#171;&#160;VI.&#160;&#8211;&#160;La perte de recettes pour l&#8217;&#201;tat est compens&#233;e &#224; due concurrence par la cr&#233;ation d&#8217;une taxe additionnelle aux droits mentionn&#233;s aux articles 575 et 575 A du code g&#233;n&#233;ral des imp&#244;ts.</p><p style=\"text-align: justify;\">&#171;&#160;VII.&#160;&#8211;&#160;La perte de recettes pour les collectivit&#233;s territoriales est compens&#233;e &#224; due concurrence par la majoration de la dotation globale de fonctionnement et, corr&#233;lativement pour l&#8217;&#201;tat, par la cr&#233;ation d&#8217;une taxe additionnelle aux droits mentionn&#233;s aux articles 575 et 575 A du code g&#233;n&#233;ral des imp&#244;ts&#160;&#187;.&#160;&#187;</p><p>&#160;</p><p style=\"text-align: justify;\">&#160;</p>",
    "exposeSommaire": "<p style=\"text-align: justify;\">Selon l&#8217;expos&#233; des motifs de cet article, seules les communes du bassin minier du Nord et du Pas-de-Calais seraient concern&#233;es par le dispositif d&#8217;exon&#233;ration fiscale mis en place pour les entreprises qui se cr&#233;ent dans les bassins urbains &#224; dynamiser.</p><p style=\"text-align: justify;\">M&#234;me si cela r&#233;pond &#224; un engagement du chef du gouvernement, r&#233;server ces dispositions &#224; une seule r&#233;gion parait inad&#233;quat et inopportun.</p><p style=\"text-align: justify;\">D&#8217;autres communes, dans d&#8217;autres d&#233;partements, comme la Meurthe-et-Moselle, connaissent les m&#234;mes probl&#233;matiques.</p><p style=\"text-align: justify;\">Cet amendement vise &#224; compl&#233;ter les dispositions de l&#8217;article&#160;13 de fa&#231;on &#224; ce que les autres bassins miniers puissent en b&#233;n&#233;ficier.</p>",
    "annexeExposeSommaire": {
      "@xmlns:xsi": "http://www.w3.org/2001/XMLSchema-instance",
      "@xsi:nil": "true"
    }
  },
  "representations": {
    "representation": {
      "nom": "PDF",
      "typeMime": {
        "type": "application",
        "subType": "PDF"
      },
      "statutRepresentation": {
        "verbatim": "true",
        "canonique": "true",
        "officielle": "true",
        "transcription": "false",
        "enregistrement": "false"
      },
      "repSource": {
        "@xmlns:xsi": "http://www.w3.org/2001/XMLSchema-instance",
        "@xsi:nil": "true"
      },
      "offset": {
        "@xmlns:xsi": "http://www.w3.org/2001/XMLSchema-instance",
        "@xsi:nil": "true"
      },
      "contenu": {
        "documentURI": "/15/amendements/0384/AN/124.pdf"
      },
      "dateDispoRepresentation": {
        "@xmlns:xsi": "http://www.w3.org/2001/XMLSchema-instance",
        "@xsi:nil": "true"
      }
    }
  },
  "seanceDiscussion": "RUANR5L15S2018IDS20817",
  "sort": {
    "dateSaisie": "2017-12-06T16:47:49.000+01:00",
    "sortEnSeance": "Rejeté"
  },
  "dateDepot": "2017-11-29T01:00:00.000+01:00",
  "dateDistribution": "2017-12-01T01:00:00.000+01:00",
  "article99": "0",
  "loiReference": {
    "codeLoi": {
      "@xmlns:xsi": "http://www.w3.org/2001/XMLSchema-instance",
      "@xsi:nil": "true"
    },
    "divisionCodeLoi": {
      "@xmlns:xsi": "http://www.w3.org/2001/XMLSchema-instance",
      "@xsi:nil": "true"
    }
  }
}