{
  "@xmlns": "http://schemas.assemblee-nationale.fr/referentiel",
  "uid": "AMANR5L15PO59051B0911P0D1N1187",
  "identifiant": {
    "legislature": "15",
    "numero": "1187",
    "numRect": "0",
    "saisine": {
      "refTexteLegislatif": "PRJLANR5L15B0911",
      "numeroPartiePLF": "0",
      "organeExamen": "PO59051",
      "mentionSecondeDeliberation": "0"
    }
  },
  "numeroLong": "CL1187",
  "etapeTexte": "1ère lecture (1ère assemblée saisie)",
  "triAmendement": "db",
  "cardinaliteAmdtMultiples": "1",
  "amendementParent": {
    "@xmlns:xsi": "http://www.w3.org/2001/XMLSchema-instance",
    "@xsi:nil": "true"
  },
  "etat": "Discuté",
  "signataires": {
    "auteur": {
      "typeAuteur": "Depute",
      "acteurRef": "PA2952",
      "organeRef": {
        "@xmlns:xsi": "http://www.w3.org/2001/XMLSchema-instance",
        "@xsi:nil": "true"
      },
      "groupePolitiqueRef": "PO744425"
    },
    "cosignataires": {
      "acteurRef": [
        "PA721486",
        "PA331567",
        "PA267330",
        "PA267780",
        "PA332228",
        "PA2952",
        "PA720230",
        "PA267766",
        "PA702052",
        "PA712014"
      ]
    },
    "texteAffichable": "M.&#160;Warsmann,  M.&#160;Benoit, M.&#160;Guy&#160;Bricout, Mme&#160;de La Raudi&#232;re, Mme&#160;Firmin Le Bodo, M.&#160;Ledoux, Mme&#160;Magnier, M.&#160;Naegelen, Mme&#160;Sage et M.&#160;Zumkeller"
  },
  "pointeurFragmentTexte": {
    "missionVisee": {
      "@xmlns:xsi": "http://www.w3.org/2001/XMLSchema-instance",
      "@xsi:nil": "true"
    },
    "division": {
      "titre": "Article 9",
      "articleDesignationCourte": "APRÈS ART. 9",
      "type": "ARTICLE",
      "avant_A_Apres": "Après",
      "divisionRattachee": "APRÈS L'ARTICLE 9, insérer l'article suivant:",
      "articleAdditionnel": "1",
      "chapitreAdditionnel": {
        "@xmlns:xsi": "http://www.w3.org/2001/XMLSchema-instance",
        "@xsi:nil": "true"
      },
      "urlDivisionTexteVise": "/15/textes/0911.asp#D_Article_9"
    },
    "alinea": {
      "@xmlns:xsi": "http://www.w3.org/2001/XMLSchema-instance",
      "@xsi:nil": "true"
    }
  },
  "corps": {
    "dispositif": "<p style=\"text-align: justify;\">La Constitution est ainsi modifi&#233;e&#160;:</p><p style=\"text-align: justify;\">1&#176;&#160;Le titre&#160;VI devient le titre&#160;XIV&#160;;</p><p style=\"text-align: justify;\">2&#176;&#160;Les titres&#160;VII &#224;&#160;XI&#160;<i>bis</i> deviennent les titres&#160;VI &#224;&#160;XI&#160;;</p><p style=\"text-align: justify;\">3&#176;&#160;Le titre&#160;XIV devient le titre&#160;XI&#160;;</p><p style=\"text-align: justify;\">4&#176;&#160;Le titre&#160;XVI devient le titre&#160;XVII.</p>",
    "exposeSommaire": "<p>Cet amendement a pour objet de regrouper, dans des titres successifs, les trois titres de la Constitution relatifs au droit international et aux relations internationales de la France (&#171;&#160;Des trait&#233;s et accords internationaux&#160;&#187;, &#171;&#160;De la francophonie et des accords internationaux&#160;&#187;, et &#171;&#160;De l&#8217;Union europ&#233;enne&#160;&#187;).</p><p>Une telle modification, justifi&#233;e par un souci de coh&#233;rence et d&#8217;accessibilit&#233; du texte constitutionnel, implique &#233;galement de revoir l&#8217;ordre de ces titres. Si celui sur les trait&#233;s et accords internationaux peut &#234;tre maintenu en premi&#232;re position, dans la mesure o&#249; il pr&#233;cise notamment la place du droit international dans la hi&#233;rarchie des normes en droit interne, l&#8217;&#233;tat actuel de la construction europ&#233;enne, qui &#233;tait encore balbutiante en 1958, suppose de placer le titre sur l&#8217;Union europ&#233;enne en deuxi&#232;me position.</p><p>Le regroupement propos&#233; devrait logiquement &#234;tre accompagn&#233; d&#8217;un d&#233;calage des actuels titres VII &#224; XI Bis, d&#8217;une part, et XVI, d&#8217;autre part.</p>",
    "annexeExposeSommaire": {
      "@xmlns:xsi": "http://www.w3.org/2001/XMLSchema-instance",
      "@xsi:nil": "true"
    }
  },
  "representations": {
    "representation": {
      "nom": "PDF",
      "typeMime": {
        "type": "application",
        "subType": "PDF"
      },
      "statutRepresentation": {
        "verbatim": "true",
        "canonique": "true",
        "officielle": "true",
        "transcription": "false",
        "enregistrement": "false"
      },
      "repSource": {
        "@xmlns:xsi": "http://www.w3.org/2001/XMLSchema-instance",
        "@xsi:nil": "true"
      },
      "offset": {
        "@xmlns:xsi": "http://www.w3.org/2001/XMLSchema-instance",
        "@xsi:nil": "true"
      },
      "contenu": {
        "documentURI": "/15/amendements/0911/CION_LOIS/CL1187.pdf"
      },
      "dateDispoRepresentation": {
        "@xmlns:xsi": "http://www.w3.org/2001/XMLSchema-instance",
        "@xsi:nil": "true"
      }
    }
  },
  "seanceDiscussion": {
    "@xmlns:xsi": "http://www.w3.org/2001/XMLSchema-instance",
    "@xsi:nil": "true"
  },
  "sort": {
    "dateSaisie": "2018-06-29T18:31:38.000+02:00",
    "sortEnSeance": "Non soutenu"
  },
  "dateDepot": "2018-06-22T02:00:00.000+02:00",
  "dateDistribution": "2018-06-29T02:00:00.000+02:00",
  "article99": "0",
  "loiReference": {
    "codeLoi": "52",
    "divisionCodeLoi": "0"
  }
}