{
  "@xmlns": "http://schemas.assemblee-nationale.fr/referentiel",
  "uid": "AMANR5L15PO59051B1491P0D1N87",
  "identifiant": {
    "legislature": "15",
    "numero": "87",
    "numRect": "0",
    "saisine": {
      "refTexteLegislatif": "PIONANR5L15B1491",
      "numeroPartiePLF": "0",
      "organeExamen": "PO59051",
      "mentionSecondeDeliberation": "0"
    }
  },
  "numeroLong": "CL87",
  "etapeTexte": "1ère lecture (2ème assemblée saisie)",
  "triAmendement": "gaaaaaaaaaaaaaaaaaaaaaaaaaaaaaaaaaaaaaaaaaaaaaaaaaq",
  "cardinaliteAmdtMultiples": "1",
  "amendementParent": "AMANR5L15PO59051B1491P0D1N15",
  "etat": "Discuté",
  "signataires": {
    "auteur": {
      "typeAuteur": "Depute",
      "acteurRef": "PA266808",
      "organeRef": {
        "@xmlns:xsi": "http://www.w3.org/2001/XMLSchema-instance",
        "@xsi:nil": "true"
      },
      "groupePolitiqueRef": "PO730934"
    },
    "cosignataires": {
      "acteurRef": "PA266808"
    },
    "texteAffichable": "M.&#160;Rolland"
  },
  "pointeurFragmentTexte": {
    "missionVisee": {
      "@xmlns:xsi": "http://www.w3.org/2001/XMLSchema-instance",
      "@xsi:nil": "true"
    },
    "division": {
      "titre": "Article 5",
      "articleDesignationCourte": "APRÈS ART. 5",
      "type": "ARTICLE",
      "avant_A_Apres": "Après",
      "divisionRattachee": "APRÈS L'ARTICLE 5, insérer l'article suivant:",
      "articleAdditionnel": "1",
      "chapitreAdditionnel": {
        "@xmlns:xsi": "http://www.w3.org/2001/XMLSchema-instance",
        "@xsi:nil": "true"
      },
      "urlDivisionTexteVise": "/15/textes/1491.asp#D_Article_5"
    },
    "alinea": {
      "@xmlns:xsi": "http://www.w3.org/2001/XMLSchema-instance",
      "@xsi:nil": "true"
    }
  },
  "corps": {
    "dispositif": "<p style=\"text-align: justify;\">&#192; la premi&#232;re phrase de l&#8217;alin&#233;a&#160;2, apr&#232;s la premi&#232;re occurrence du mot&#160;:</p><p style=\"text-align: justify;\">&#171;&#160;communes&#160;&#187;,</p><p style=\"text-align: justify;\">ins&#233;rer le mot&#160;:</p><p style=\"text-align: justify;\">&#171;&#160;d&#233;l&#233;gu&#233;es&#160;&#187;.</p>",
    "exposeSommaire": "<p>Les communes auxquelles s'applique cet amendement sont les communes d&#233;l&#233;gu&#233;es de moins de 500 habitants. Il s'agit d'un amendement de pr&#233;cision permettant d'assurer la bonne application de ce texte.</p><p>Dans les territoires ruraux, les communes d&#233;l&#233;gu&#233;es de moins de 500 habitants sont nombreuses et peinent parfois &#224; trouver un maire. Cet amendement permettra qu'un m&#234;me maire repr&#233;sente jusqu'&#224; 3 de ces petites communes d&#233;l&#233;gu&#233;es.</p>",
    "annexeExposeSommaire": {
      "@xmlns:xsi": "http://www.w3.org/2001/XMLSchema-instance",
      "@xsi:nil": "true"
    },
    "cartoucheDelaiDepotDepasse": {
      "@xmlns:xsi": "http://www.w3.org/2001/XMLSchema-instance",
      "@xsi:nil": "true"
    }
  },
  "representations": {
    "representation": {
      "nom": "PDF",
      "typeMime": {
        "type": "application",
        "subType": "PDF"
      },
      "statutRepresentation": {
        "verbatim": "true",
        "canonique": "true",
        "officielle": "true",
        "transcription": "false",
        "enregistrement": "false"
      },
      "repSource": {
        "@xmlns:xsi": "http://www.w3.org/2001/XMLSchema-instance",
        "@xsi:nil": "true"
      },
      "offset": {
        "@xmlns:xsi": "http://www.w3.org/2001/XMLSchema-instance",
        "@xsi:nil": "true"
      },
      "contenu": {
        "documentURI": "/15/amendements/1491/CION_LOIS/CL87.pdf"
      },
      "dateDispoRepresentation": {
        "@xmlns:xsi": "http://www.w3.org/2001/XMLSchema-instance",
        "@xsi:nil": "true"
      }
    }
  },
  "seanceDiscussion": {
    "@xmlns:xsi": "http://www.w3.org/2001/XMLSchema-instance",
    "@xsi:nil": "true"
  },
  "sort": {
    "dateSaisie": "2019-07-03T11:35:18.000+02:00",
    "sortEnSeance": "Non soutenu"
  },
  "dateDepot": "2019-07-02T02:00:00.000+02:00",
  "dateDistribution": "2019-07-02T02:00:00.000+02:00",
  "article99": "0",
  "loiReference": {
    "codeLoi": {
      "@xmlns:xsi": "http://www.w3.org/2001/XMLSchema-instance",
      "@xsi:nil": "true"
    },
    "divisionCodeLoi": {
      "@xmlns:xsi": "http://www.w3.org/2001/XMLSchema-instance",
      "@xsi:nil": "true"
    }
  }
}