{
  "@xmlns": "http://schemas.assemblee-nationale.fr/referentiel",
  "uid": "AMANR5L15SEA717460BTC1974P0D1N1388",
  "identifiant": {
    "legislature": "15",
    "numero": "1388",
    "numRect": "0",
    "saisine": {
      "refTexteLegislatif": "PRJLANR5L15BTC1974",
      "numeroPartiePLF": "0",
      "organeExamen": "PO717460",
      "mentionSecondeDeliberation": "0"
    }
  },
  "numeroLong": "1388",
  "etapeTexte": "1ère lecture (2ème assemblée saisie)",
  "triAmendement": "hiaaaiaaaaaaaaaaaaaaaaaaaaaaaaaaaaaaaaaaaaaaaaaaaazzznzzzv",
  "cardinaliteAmdtMultiples": "1",
  "amendementParent": {
    "@xmlns:xsi": "http://www.w3.org/2001/XMLSchema-instance",
    "@xsi:nil": "true"
  },
  "etat": "Discuté",
  "signataires": {
    "auteur": {
      "typeAuteur": "Depute",
      "acteurRef": "PA720278",
      "organeRef": {
        "@xmlns:xsi": "http://www.w3.org/2001/XMLSchema-instance",
        "@xsi:nil": "true"
      },
      "groupePolitiqueRef": "PO723569"
    },
    "cosignataires": {
      "acteurRef": [
        "PA335999",
        "PA720278",
        "PA719464"
      ]
    },
    "texteAffichable": "M.&#160;Orphelin,  Mme&#160;Batho et M.&#160;Nadot"
  },
  "pointeurFragmentTexte": {
    "missionVisee": {
      "@xmlns:xsi": "http://www.w3.org/2001/XMLSchema-instance",
      "@xsi:nil": "true"
    },
    "division": {
      "titre": "Article 1er A",
      "articleDesignationCourte": "ART. 1ER A",
      "type": "ARTICLE",
      "avant_A_Apres": "A",
      "divisionRattachee": "ARTICLE 1ER A",
      "articleAdditionnel": {
        "@xmlns:xsi": "http://www.w3.org/2001/XMLSchema-instance",
        "@xsi:nil": "true"
      },
      "chapitreAdditionnel": {
        "@xmlns:xsi": "http://www.w3.org/2001/XMLSchema-instance",
        "@xsi:nil": "true"
      },
      "urlDivisionTexteVise": "/15/textes/1974.asp#D_Article_1er_A"
    },
    "alinea": {
      "avant_A_Apres": {
        "@xmlns:xsi": "http://www.w3.org/2001/XMLSchema-instance",
        "@xsi:nil": "true"
      },
      "numero": "5",
      "alineaDesignation": {
        "@xmlns:xsi": "http://www.w3.org/2001/XMLSchema-instance",
        "@xsi:nil": "true"
      }
    }
  },
  "corps": {
    "dispositif": "<p style=\"text-align: justify;\">Apr&#232;s le mot&#160;:</p><p style=\"text-align: justify;\">&#171;&#160;individuel&#160;&#187;,</p><p style=\"text-align: justify;\">r&#233;diger ainsi la fin de l&#8217;alin&#233;a&#160;5&#160;:</p><p style=\"text-align: justify;\">&#171;&#160;, en facilitant les d&#233;placements multimodaux et en accompagnant le changement de pratiques par une d&#233;marche de formation, d&#8217;information et de sensibilisation&#160;&#187;.</p>",
    "exposeSommaire": "<p style=\"text-align: justify;\">A la suite des discussions en commission, cet amendement avait &#233;t&#233; retir&#233; en commission pour s&#8217;assurer qu&#8217;il ne faisait pas doublon avec ce qui &#233;tait pr&#233;vu aux articles 4 et 6. Apr&#232;s v&#233;rification, il introduit bien un &#233;l&#233;ment suppl&#233;mentaire est n&#233;cessaire. En cons&#233;quence cet amendement est red&#233;pos&#233; pour la s&#233;ance.</p><p style=\"text-align: justify;\">Cet amendement ajoute l&#8217;accompagnement au changement des pratiques de mobilit&#233; aux objectifs de la programmation financi&#232;re des investissements de transport. La politique de mobilit&#233; doit accompagner le changement de pratiques en vue d&#8217;une d&#233;marche inclusive et vertueuse. Cet objectif n&#8217;est pour l&#8217;instant pas pr&#233;vu ni dans le droit existant, ni dans ce projet de loi.</p><p style=\"text-align: justify;\">Cet amendement a &#233;t&#233; propos&#233; par Wimoov.</p>",
    "annexeExposeSommaire": {
      "@xmlns:xsi": "http://www.w3.org/2001/XMLSchema-instance",
      "@xsi:nil": "true"
    },
    "cartoucheDelaiDepotDepasse": {
      "@xmlns:xsi": "http://www.w3.org/2001/XMLSchema-instance",
      "@xsi:nil": "true"
    }
  },
  "representations": {
    "representation": {
      "nom": "PDF",
      "typeMime": {
        "type": "application",
        "subType": "PDF"
      },
      "statutRepresentation": {
        "verbatim": "true",
        "canonique": "true",
        "officielle": "true",
        "transcription": "false",
        "enregistrement": "false"
      },
      "repSource": {
        "@xmlns:xsi": "http://www.w3.org/2001/XMLSchema-instance",
        "@xsi:nil": "true"
      },
      "offset": {
        "@xmlns:xsi": "http://www.w3.org/2001/XMLSchema-instance",
        "@xsi:nil": "true"
      },
      "contenu": {
        "documentURI": "/15/amendements/1974/AN/1388.pdf"
      },
      "dateDispoRepresentation": {
        "@xmlns:xsi": "http://www.w3.org/2001/XMLSchema-instance",
        "@xsi:nil": "true"
      }
    }
  },
  "seanceDiscussion": "RUANR5L15S2019IDS21699",
  "sort": {
    "dateSaisie": "2019-06-13T15:00:31.000+02:00",
    "sortEnSeance": "Non soutenu"
  },
  "dateDepot": "2019-05-29T02:00:00.000+02:00",
  "dateDistribution": "2019-06-07T02:00:00.000+02:00",
  "article99": "0",
  "loiReference": {
    "codeLoi": {
      "@xmlns:xsi": "http://www.w3.org/2001/XMLSchema-instance",
      "@xsi:nil": "true"
    },
    "divisionCodeLoi": {
      "@xmlns:xsi": "http://www.w3.org/2001/XMLSchema-instance",
      "@xsi:nil": "true"
    }
  }
}