{
  "@xmlns": "http://schemas.assemblee-nationale.fr/referentiel",
  "uid": "AMANR5L15SEA717460B0150P0D1N36",
  "identifiant": {
    "legislature": "15",
    "numero": "36",
    "numRect": "0",
    "saisine": {
      "refTexteLegislatif": "PIONANR5L15B0150",
      "numeroPartiePLF": "0",
      "organeExamen": "PO717460",
      "mentionSecondeDeliberation": "0"
    }
  },
  "numeroLong": "36",
  "etapeTexte": "1ère lecture (1ère assemblée saisie)",
  "triAmendement": "k",
  "cardinaliteAmdtMultiples": "1",
  "amendementParent": {
    "@xmlns:xsi": "http://www.w3.org/2001/XMLSchema-instance",
    "@xsi:nil": "true"
  },
  "etat": "Discuté",
  "signataires": {
    "auteur": {
      "typeAuteur": "Depute",
      "acteurRef": "PA709315",
      "organeRef": {
        "@xmlns:xsi": "http://www.w3.org/2001/XMLSchema-instance",
        "@xsi:nil": "true"
      },
      "groupePolitiqueRef": "PO730934"
    },
    "cosignataires": {
      "acteurRef": "PA709315"
    },
    "texteAffichable": "M.&#160;Viala"
  },
  "pointeurFragmentTexte": {
    "missionVisee": {
      "@xmlns:xsi": "http://www.w3.org/2001/XMLSchema-instance",
      "@xsi:nil": "true"
    },
    "division": {
      "titre": "Article 9",
      "articleDesignationCourte": "ART. 9",
      "type": "ARTICLE",
      "avant_A_Apres": "A",
      "divisionRattachee": "ARTICLE 9",
      "articleAdditionnel": {
        "@xmlns:xsi": "http://www.w3.org/2001/XMLSchema-instance",
        "@xsi:nil": "true"
      },
      "chapitreAdditionnel": {
        "@xmlns:xsi": "http://www.w3.org/2001/XMLSchema-instance",
        "@xsi:nil": "true"
      },
      "urlDivisionTexteVise": "/15/textes/0150.asp#D_Article_9"
    },
    "alinea": {
      "avant_A_Apres": {
        "@xmlns:xsi": "http://www.w3.org/2001/XMLSchema-instance",
        "@xsi:nil": "true"
      },
      "numero": "2",
      "alineaDesignation": {
        "@xmlns:xsi": "http://www.w3.org/2001/XMLSchema-instance",
        "@xsi:nil": "true"
      }
    }
  },
  "corps": {
    "dispositif": "<p style=\"text-align: justify;\">Apr&#232;s le mot&#160;:</p><p style=\"text-align: justify;\">&#171;&#160;manifestement&#160;&#187;,</p><p style=\"text-align: justify;\">r&#233;diger ainsi la fin de l&#8217;alin&#233;a&#160;2&#160;:</p><p style=\"text-align: justify;\">&#171;&#160;inf&#233;rieurs au co&#251;t de l&#8217;achat et de la transformation du produit consid&#233;r&#233;, et ne permettant pas de r&#233;mun&#233;rer sur des bases d&#233;centes le travail de cet interm&#233;diaire.&#160;&#187;</p>",
    "exposeSommaire": "<p style=\"text-align: justify;\">Cet amendement a pour objet de pr&#233;ciser que constitue un abus de d&#233;pendance &#233;conomique le fait de r&#233;mun&#233;rer un interm&#233;diaire &#224; un prix inf&#233;rieur aux co&#251;ts qu&#8217;a repr&#233;sent&#233; pour lui l&#8217;achat et la transformation du produit consid&#233;r&#233;, ce qui aurait pour cons&#233;quence de l&#8217;emp&#234;cher de couvrir ses charges et de vivre d&#233;cemment.</p>",
    "annexeExposeSommaire": {
      "@xmlns:xsi": "http://www.w3.org/2001/XMLSchema-instance",
      "@xsi:nil": "true"
    }
  },
  "representations": {
    "representation": {
      "nom": "PDF",
      "typeMime": {
        "type": "application",
        "subType": "PDF"
      },
      "statutRepresentation": {
        "verbatim": "true",
        "canonique": "true",
        "officielle": "true",
        "transcription": "false",
        "enregistrement": "false"
      },
      "repSource": {
        "@xmlns:xsi": "http://www.w3.org/2001/XMLSchema-instance",
        "@xsi:nil": "true"
      },
      "offset": {
        "@xmlns:xsi": "http://www.w3.org/2001/XMLSchema-instance",
        "@xsi:nil": "true"
      },
      "contenu": {
        "documentURI": "/15/amendements/0150/AN/36.pdf"
      },
      "dateDispoRepresentation": {
        "@xmlns:xsi": "http://www.w3.org/2001/XMLSchema-instance",
        "@xsi:nil": "true"
      }
    }
  },
  "seanceDiscussion": "RUANR5L15S2018IDS20688",
  "sort": {
    "dateSaisie": "2017-10-12T12:26:18.000+02:00",
    "sortEnSeance": "Tombé"
  },
  "dateDepot": "2017-10-06T02:00:00.000+02:00",
  "dateDistribution": "2017-10-11T02:00:00.000+02:00",
  "article99": "0",
  "loiReference": {
    "codeLoi": {
      "@xmlns:xsi": "http://www.w3.org/2001/XMLSchema-instance",
      "@xsi:nil": "true"
    },
    "divisionCodeLoi": {
      "@xmlns:xsi": "http://www.w3.org/2001/XMLSchema-instance",
      "@xsi:nil": "true"
    }
  }
}