{
  "@xmlns": "http://schemas.assemblee-nationale.fr/referentiel",
  "uid": "AMANR5L15PO420120B1681P0D1N1528",
  "identifiant": {
    "legislature": "15",
    "numero": "1528",
    "numRect": "0",
    "saisine": {
      "refTexteLegislatif": "PRJLANR5L15B1681",
      "numeroPartiePLF": "0",
      "organeExamen": "PO420120",
      "mentionSecondeDeliberation": "0"
    }
  },
  "numeroLong": "AS1528",
  "etapeTexte": "1ère lecture (1ère assemblée saisie)",
  "triAmendement": "daaaaaaaaaaaaaaaaaaaaaaaaaaaaaaaaaaaaaaaaaaaaaaaaadxvpzi",
  "cardinaliteAmdtMultiples": "1",
  "amendementParent": {
    "@xmlns:xsi": "http://www.w3.org/2001/XMLSchema-instance",
    "@xsi:nil": "true"
  },
  "etat": "Discuté",
  "signataires": {
    "auteur": {
      "typeAuteur": "Depute",
      "acteurRef": "PA267780",
      "organeRef": {
        "@xmlns:xsi": "http://www.w3.org/2001/XMLSchema-instance",
        "@xsi:nil": "true"
      },
      "groupePolitiqueRef": "PO744425"
    },
    "cosignataires": {
      "acteurRef": [
        "PA642868",
        "PA267780"
      ]
    },
    "texteAffichable": "Mme&#160;Firmin Le Bodo et M.&#160;Christophe"
  },
  "pointeurFragmentTexte": {
    "missionVisee": {
      "@xmlns:xsi": "http://www.w3.org/2001/XMLSchema-instance",
      "@xsi:nil": "true"
    },
    "division": {
      "titre": "Article 10",
      "articleDesignationCourte": "ART. 10",
      "type": "ARTICLE",
      "avant_A_Apres": "A",
      "divisionRattachee": "ARTICLE 10",
      "articleAdditionnel": {
        "@xmlns:xsi": "http://www.w3.org/2001/XMLSchema-instance",
        "@xsi:nil": "true"
      },
      "chapitreAdditionnel": {
        "@xmlns:xsi": "http://www.w3.org/2001/XMLSchema-instance",
        "@xsi:nil": "true"
      },
      "urlDivisionTexteVise": "/15/textes/1681.asp#D_Article_10"
    },
    "alinea": {
      "avant_A_Apres": "Apres",
      "numero": "6",
      "alineaDesignation": {
        "@xmlns:xsi": "http://www.w3.org/2001/XMLSchema-instance",
        "@xsi:nil": "true"
      }
    }
  },
  "corps": {
    "dispositif": "<p style=\"text-align: justify;\">Apr&#232;s l&#8217;alin&#233;a&#160;6, ins&#233;rer l&#8217;alin&#233;a suivant&#160;:</p><p style=\"text-align: justify;\">&#171;&#160;2&#176; <i>bis</i> (nouveau) Le b du 5&#176; du II du m&#234;me article L.&#160;6132&#8209;2 est compl&#233;t&#233; par deux phrases ainsi r&#233;dig&#233;es&#160;: &#171;&#160;Le directeur de l&#8217;&#233;tablissement support est le pr&#233;sident du comit&#233; strat&#233;gique du groupement hospitalier de territoire. Le pr&#233;sident de la commission m&#233;dicale de groupement en est le vice-pr&#233;sident.&#160;&#187;&#160;;</p>",
    "exposeSommaire": "<p>Afin de renforcer la coh&#233;rence de la strat&#233;gie &#233;labor&#233;e au sein du GHT, nous proposons d&#8217;inscrire au niveau l&#233;gislatif&#160;:</p><p style=\"text-align: justify;\">-&#160; D&#8217;une part la repr&#233;sentation des commissions m&#233;dicales d&#8217;&#233;tablissement (CME) des &#233;tablissements du GHT dans la commission m&#233;dicale de groupement, les membres de la CMG devant &#234;tre issus des CME des &#233;tablissements membres,</p><p style=\"text-align: justify;\">-&#160; ainsi que la pr&#233;sidence du comit&#233; strat&#233;gique par le directeur de l&#8217;&#233;tablissement support et sa vice-pr&#233;sidence par le pr&#233;sident de la Commission m&#233;dicale de groupement.</p><p style=\"text-align: justify;\">Nous proposons enfin d&#8217;inscrire au niveau l&#233;gislatif la r&#233;vision des comp&#233;tences de la CME en miroir de la CMG en pr&#233;cisant qu&#8217;elle &#171;&#160;contribue &#224; l&#8217;&#233;laboration et &#224; la mise en &#339;uvre de la strat&#233;gie d&#8217;&#233;tablissement et du projet m&#233;dical, en coh&#233;rence avec le projet m&#233;dical partag&#233;&#160;&#187;, et ce afin de renforcer la coh&#233;rence sur l&#8217;ensemble du groupement.</p>",
    "annexeExposeSommaire": {
      "@xmlns:xsi": "http://www.w3.org/2001/XMLSchema-instance",
      "@xsi:nil": "true"
    },
    "cartoucheDelaiDepotDepasse": {
      "@xmlns:xsi": "http://www.w3.org/2001/XMLSchema-instance",
      "@xsi:nil": "true"
    }
  },
  "representations": {
    "representation": {
      "nom": "PDF",
      "typeMime": {
        "type": "application",
        "subType": "PDF"
      },
      "statutRepresentation": {
        "verbatim": "true",
        "canonique": "true",
        "officielle": "true",
        "transcription": "false",
        "enregistrement": "false"
      },
      "repSource": {
        "@xmlns:xsi": "http://www.w3.org/2001/XMLSchema-instance",
        "@xsi:nil": "true"
      },
      "offset": {
        "@xmlns:xsi": "http://www.w3.org/2001/XMLSchema-instance",
        "@xsi:nil": "true"
      },
      "contenu": {
        "documentURI": "/15/amendements/1681/CION-SOC/AS1528.pdf"
      },
      "dateDispoRepresentation": {
        "@xmlns:xsi": "http://www.w3.org/2001/XMLSchema-instance",
        "@xsi:nil": "true"
      }
    }
  },
  "seanceDiscussion": {
    "@xmlns:xsi": "http://www.w3.org/2001/XMLSchema-instance",
    "@xsi:nil": "true"
  },
  "sort": {
    "dateSaisie": "2019-03-13T22:44:45.000+01:00",
    "sortEnSeance": "Adopté"
  },
  "dateDepot": "2019-03-10T01:00:00.000+01:00",
  "dateDistribution": "2019-03-13T01:00:00.000+01:00",
  "article99": "0",
  "loiReference": {
    "codeLoi": {
      "@xmlns:xsi": "http://www.w3.org/2001/XMLSchema-instance",
      "@xsi:nil": "true"
    },
    "divisionCodeLoi": {
      "@xmlns:xsi": "http://www.w3.org/2001/XMLSchema-instance",
      "@xsi:nil": "true"
    }
  }
}