{
  "@xmlns": "http://schemas.assemblee-nationale.fr/referentiel",
  "uid": "AMANR5L15SEA717460BTC0857P0D1N1003",
  "identifiant": {
    "legislature": "15",
    "numero": "1003",
    "numRect": "0",
    "saisine": {
      "refTexteLegislatif": "PRJLANR5L15BTC0857",
      "numeroPartiePLF": "0",
      "organeExamen": "PO717460",
      "mentionSecondeDeliberation": "0"
    }
  },
  "numeroLong": "1003",
  "etapeTexte": "1ère lecture (1ère assemblée saisie)",
  "triAmendement": "ahao",
  "cardinaliteAmdtMultiples": "1",
  "amendementParent": {
    "@xmlns:xsi": "http://www.w3.org/2001/XMLSchema-instance",
    "@xsi:nil": "true"
  },
  "etat": "Discuté",
  "signataires": {
    "auteur": {
      "typeAuteur": "Depute",
      "acteurRef": "PA720846",
      "organeRef": {
        "@xmlns:xsi": "http://www.w3.org/2001/XMLSchema-instance",
        "@xsi:nil": "true"
      },
      "groupePolitiqueRef": "PO730958"
    },
    "cosignataires": {
      "acteurRef": [
        "PA718868",
        "PA720286",
        "PA720892",
        "PA721226",
        "PA719676",
        "PA588884",
        "PA720846",
        "PA721062",
        "PA720430",
        "PA722142",
        "PA721210",
        "PA721202",
        "PA721960",
        "PA718860",
        "PA2150",
        "PA720422",
        "PA719578"
      ]
    },
    "texteAffichable": "M.&#160;Lachaud,  Mme&#160;Autain, M.&#160;Bernalicis, M.&#160;Coquerel, M.&#160;Corbi&#232;re, Mme&#160;Fiat, M.&#160;Larive, M.&#160;M&#233;lenchon, Mme&#160;Obono, Mme&#160;Panot, M.&#160;Prud&apos;homme, M.&#160;Quatennens, M.&#160;Ratenon, Mme&#160;Ressiguier, Mme&#160;Rubin, M.&#160;Ruffin et Mme&#160;Taurine"
  },
  "pointeurFragmentTexte": {
    "missionVisee": {
      "@xmlns:xsi": "http://www.w3.org/2001/XMLSchema-instance",
      "@xsi:nil": "true"
    },
    "division": {
      "titre": "Article 33 bis",
      "articleDesignationCourte": "APRÈS ART. 33 BIS",
      "type": "ARTICLE",
      "avant_A_Apres": "Après",
      "divisionRattachee": "APRÈS L'ARTICLE 33 BIS, insérer l'article suivant:",
      "articleAdditionnel": "1",
      "chapitreAdditionnel": {
        "@xmlns:xsi": "http://www.w3.org/2001/XMLSchema-instance",
        "@xsi:nil": "true"
      },
      "urlDivisionTexteVise": "/15/textes/0857.asp#D_Article_33_bis"
    },
    "alinea": {
      "@xmlns:xsi": "http://www.w3.org/2001/XMLSchema-instance",
      "@xsi:nil": "true"
    }
  },
  "corps": {
    "dispositif": "<p style=\"padding: 0cm; text-align: justify;\">Au d&#233;but de la section 1 du chapitre I<sup>er</sup> du titre I<sup>er</sup> du livre III du code de l&#8217;entr&#233;e et du s&#233;jour des &#233;trangers et du droit d&#8217;asile, il est ins&#233;r&#233; un article L.&#160;311&#8209;1&#160;A ainsi r&#233;dig&#233;&#160;: </p><p style=\"text-align: justify;\">&#171;&#160;<i>Art</i>.&#160;<i>L.&#160;311&#8209;1&#160;A</i>.&#160;&#8211;&#160;&#192; titre exp&#233;rimental, pour une dur&#233;e de trois ans, dans les d&#233;partements volontaires, le pr&#233;fet peut r&#233;allouer les effectifs de l&#8217;&#201;tat dans son d&#233;partement, afin d&#8217;assurer un accueil suffisant et digne des administr&#233;s pour leurs d&#233;marches relatives &#224; leur droit au s&#233;jour en France pr&#233;vues par le livre&#160;III du pr&#233;sent code.&#160;&#187;</p>",
    "exposeSommaire": "<p style=\"text-align: justify;\">Par cet amendement, nous souhaitons rappeler aux pr&#233;fectures qu&#8217;elles ne peuvent impun&#233;ment d&#233;grader la qualit&#233; du service public pour les d&#233;marches effectu&#233;es par les personnes relatives &#224; leur droit au s&#233;jour.</p><p style=\"text-align: justify;\">En effet, les personnes qui effectuent des d&#233;marches aupr&#232;s des pr&#233;fectures en France relatives &#224; leur droit au s&#233;jour (demande d&#8217;informations, demandes relatives aux titre de s&#233;jour ou au renouvellement) sont encore trop souvent de fait des administr&#233;.e.s de seconde zone dans beaucoup de d&#233;partements fran&#231;ais.</p><p style=\"text-align: justify;\">Nombreux sont les constats effarants&#160;: files d&#8217;attente qui d&#233;marrent d&#232;s les premi&#232;res heures du jour, voire la nuit pr&#233;c&#233;dente (document trouv&#233; sur Internet&#160;: enregistr&#233;e en f&#233;vrier 2017&#160;: https&#160;://www.youtube.com/watch&#160;?v=gXek1KV8WRE), un accueil t&#233;l&#233;phonique peu adapt&#233; &#224; ces publics (document trouv&#233; sur Internet&#160;: https&#160;://www.youtube.com/watch&#160;?v=ND_12kyriag), un accueil au guichet peu avenant et sans aucune bienveillance vis &#224; vis de la personne dans ces d&#233;marches, les r&#233;c&#233;piss&#233;s de demande renouvel&#233;s sans cesse et sans prise de d&#233;cision, etc. Les cons&#233;quences sont particuli&#232;rement graves pour les administr&#233;.e.s&#160;: peur de se retrouver dans une zone grise (celle de l&#8217;absence de r&#233;c&#233;piss&#233; ou de titre de s&#233;jour), de perdre son emploi (qui peut &#234;tre conditionn&#233; au renouvellement du titre), d&#233;lais qui impactent directement la vie priv&#233;e et familiale, la scolarisation des enfants, les perspectives d&#8217;avenir, etc...</p><p style=\"text-align: justify;\">Le travail des militants et militantes associatifs a permis de recenser et de d&#233;noncer sp&#233;cifiquement nombre de ces graves atteintes aux droits des administr&#233;.e.s (non exhaustif&#160;: https&#160;://www.lacimade.org/accueil-des-etrangers-en-prefecture-un-service-public-au-rabais/, https&#160;://www.lacimade.org/wp-content/uploads/2016/03/La_Cimade_A_Guichet_Fermes_16032016.pdf, http&#160;://cfda.rezo.net/Accueil/EDL&#160;%202013/EDL_CFDARapportwebversionfinale.pdf, http&#160;://ldh-midi-pyrenees.org/2017/03/telechargez-le-rapport-de-lobservatoire-de-laccueil-des-etranger-e-s-a-la-prefecture-de-toulouse-les-principes-republicains-bafoues-par-la-prefecture-de-toulouse-une-maltraitance-instit/, &#8230;). A les lire on comprend mieux l&#8217;utilisation de &#8220;maltraitance institutionnalis&#233;e&#8221; utilis&#233;e &#224; de nombreuses reprises dans ces &#233;crits.</p><p style=\"text-align: justify;\">M&#234;me les parlementaires (https&#160;://www.gisti.org/IMG/pdf/rapport_2013_fekl.pdf, https&#160;://www.senat.fr/notice-rapport/2016/r16&#8209;353-notice.html) et les inspections de l&#8217;&#201;tat (https&#160;://www.immigration.interieur.gouv.fr/Info-ressources/Documentation/Rapports-publics/Rapport-IGA-L-accueil-des-ressortissants-etrangers-par-les-prefectures-et-les-sous-prefectures) s&#8217;en sont &#233;mues et ont d&#233;nonc&#233; ces conditions d&#8217;accueil et de traitement d&#233;grad&#233;es et en voie de d&#233;gradation constante.</p><p style=\"text-align: justify;\">Par cet amendement, nous proposons donc aux pr&#233;fectures volontaires d&#8217;assumer de mettre en oeuvre un accueil et un traitement des dossiers suffisant et digne pour les personnes effectuant des d&#233;marches relatives &#224; leur droit au s&#233;jour.</p><p style=\"text-align: justify;\">Le choix de red&#233;ployer des ETPT des p&#244;les &#171;&#160;3 E&#160;&#187; des DIRECCTE a pour but de ne pas empi&#233;ter sur les comp&#233;tences &#171;&#160;Inspection du travail / respect du droit du travail&#160;&#187; et &#171;&#160;Concurrence et consommation&#160;&#187; des entreprises de ces m&#234;mes DIRECCTE, sachant que les p&#244;les &#171;&#160;3 E&#160;&#187; sont souvent surdot&#233;s par rapport aux autres services de l&#8217;&#201;tat qui ont &#233;t&#233; particuli&#232;rement affect&#233;s par la RGPP et la MAP qui en a suivi.</p><p style=\"text-align: justify;\">NB&#160;: afin de ne pas se m&#233;prendre sur la volont&#233; des auteurs et autrices de cet amendement, il n&#8217;est propos&#233; ici qu&#8217;une &#8220;exp&#233;rimentation&#8221; car en l&#8217;&#233;tat des institutions de la V&#232;me R&#233;publique et les pouvoirs limit&#233;s du Parlement, les parlementaires ne peuvent cr&#233;er de nouvelle d&#233;pense publique (article&#160;40 de la Constitution, et pour le d&#233;tail explicatif&#160;: http&#160;://www2.assemblee-nationale.fr/decouvrir-l-assemblee/role-et-pouvoirs-de-l-assemblee-nationale/les-fonctions-de-l-assemblee-nationale/les-fonctions-legislatives/la-recevabilite-financiere-des-initiatives-parlementaires-au-regard-de-l-article-40-de-la-constitution-et-des-dispositions-organiques-relatives-aux-lois-de-finances-et-aux-lois-de-financement-de-la-securite-sociale.</p>",
    "annexeExposeSommaire": {
      "@xmlns:xsi": "http://www.w3.org/2001/XMLSchema-instance",
      "@xsi:nil": "true"
    }
  },
  "representations": {
    "representation": {
      "nom": "PDF",
      "typeMime": {
        "type": "application",
        "subType": "PDF"
      },
      "statutRepresentation": {
        "verbatim": "true",
        "canonique": "true",
        "officielle": "true",
        "transcription": "false",
        "enregistrement": "false"
      },
      "repSource": {
        "@xmlns:xsi": "http://www.w3.org/2001/XMLSchema-instance",
        "@xsi:nil": "true"
      },
      "offset": {
        "@xmlns:xsi": "http://www.w3.org/2001/XMLSchema-instance",
        "@xsi:nil": "true"
      },
      "contenu": {
        "documentURI": "/15/amendements/0857/AN/1003.pdf"
      },
      "dateDispoRepresentation": {
        "@xmlns:xsi": "http://www.w3.org/2001/XMLSchema-instance",
        "@xsi:nil": "true"
      }
    }
  },
  "seanceDiscussion": "RUANR5L15S2018IDS21078",
  "sort": {
    "dateSaisie": "2018-04-22T19:05:15.000+02:00",
    "sortEnSeance": "Rejeté"
  },
  "dateDepot": "2018-04-12T02:00:00.000+02:00",
  "dateDistribution": "2018-04-16T02:00:00.000+02:00",
  "article99": "0",
  "loiReference": {
    "codeLoi": "c entrée et séjour étrangers",
    "divisionCodeLoi": "L311-1"
  }
}