{
  "@xmlns": "http://schemas.assemblee-nationale.fr/referentiel",
  "uid": "AMANR5L15SEA717460B1255P1D1N2066",
  "identifiant": {
    "legislature": "15",
    "numero": "2066",
    "numRect": "0",
    "saisine": {
      "refTexteLegislatif": "PRJLANR5L15B1255",
      "numeroPartiePLF": "1",
      "organeExamen": "PO717460",
      "mentionSecondeDeliberation": "0"
    }
  },
  "numeroLong": "I-2066",
  "etapeTexte": "1ère lecture (1ère assemblée saisie)",
  "triAmendement": "bgaaaaaaaaaaaaaaaaaaaaaaaaaaaaaaaaaaaaaaaaaaaaaaaabdpkkjzi",
  "cardinaliteAmdtMultiples": "1",
  "amendementParent": {
    "@xmlns:xsi": "http://www.w3.org/2001/XMLSchema-instance",
    "@xsi:nil": "true"
  },
  "etat": "Discuté",
  "signataires": {
    "auteur": {
      "typeAuteur": "Depute",
      "acteurRef": "PA719472",
      "organeRef": {
        "@xmlns:xsi": "http://www.w3.org/2001/XMLSchema-instance",
        "@xsi:nil": "true"
      },
      "groupePolitiqueRef": "PO730964"
    },
    "cosignataires": {
      "acteurRef": [
        "PA719472",
        "PA719060"
      ]
    },
    "texteAffichable": "M.&#160;Cazeneuve et M.&#160;Jerretie"
  },
  "pointeurFragmentTexte": {
    "missionVisee": {
      "@xmlns:xsi": "http://www.w3.org/2001/XMLSchema-instance",
      "@xsi:nil": "true"
    },
    "division": {
      "titre": "Article 7",
      "articleDesignationCourte": "ART. 7",
      "type": "ARTICLE",
      "avant_A_Apres": "A",
      "divisionRattachee": "ARTICLE 7",
      "articleAdditionnel": {
        "@xmlns:xsi": "http://www.w3.org/2001/XMLSchema-instance",
        "@xsi:nil": "true"
      },
      "chapitreAdditionnel": {
        "@xmlns:xsi": "http://www.w3.org/2001/XMLSchema-instance",
        "@xsi:nil": "true"
      },
      "urlDivisionTexteVise": "/15/textes/1255A.asp#D_Article_7"
    },
    "alinea": {
      "avant_A_Apres": {
        "@xmlns:xsi": "http://www.w3.org/2001/XMLSchema-instance",
        "@xsi:nil": "true"
      },
      "numero": "10",
      "alineaDesignation": {
        "@xmlns:xsi": "http://www.w3.org/2001/XMLSchema-instance",
        "@xsi:nil": "true"
      }
    }
  },
  "corps": {
    "dispositif": "<p style=\"text-align: justify;\">I.&#160;&#8211;&#160;Substituer &#224; l&#8217;alin&#233;a&#160;10 les trois alin&#233;as suivants&#160;:</p><p style=\"text-align: justify;\">&#171;&#160;IV.&#160;&#8211;&#160;Les d&#233;gr&#232;vements individuels de la taxe faisant suite &#224; une r&#233;clamation pr&#233;sent&#233;e dans les conditions pr&#233;vues au livre des proc&#233;dures fiscales, lorsqu&#8217;ils sont cons&#233;cutifs &#224; la constatation, par une d&#233;cision de justice pass&#233;e en force de chose jug&#233;e, de l&#8217;ill&#233;galit&#233; des d&#233;lib&#233;rations prises par la commune ou l&#8217;&#233;tablissement public de coop&#233;ration intercommunale, fond&#233;e sur la circonstance que le produit de la taxe et, par voie de cons&#233;quence, son taux, sont disproportionn&#233;s par rapport au montant des d&#233;penses mentionn&#233;es au premier alin&#233;a du I de l&#8217;article&#160;1520 et non couvertes par des recettes ordinaires non fiscales, tel qu&#8217;il peut &#234;tre estim&#233; &#224; la date du vote de la d&#233;lib&#233;ration fixant ce taux, est &#224; la charge de cette commune ou de cet &#233;tablissement public de coop&#233;ration intercommunale. Il s&#8217;impute sur les attributions mentionn&#233;es aux articles L.&#160;2332&#8209;2, L.&#160;3662&#8209;2 et L.&#160;5219&#8209;8&#8209;1 du code g&#233;n&#233;ral des collectivit&#233;s territoriales. La part des d&#233;gr&#232;vements correspondant aux frais de gestion de la taxe demeurent &#224; la charge du Tr&#233;sor.</p><p style=\"text-align: justify;\">&#171;&#160;V.&#160;&#8211;&#160;Les montants de d&#233;gr&#232;vements prononc&#233;s dans les cas pr&#233;vus au IV ne peuvent exc&#233;der une proportion de la taxe &#233;gale au rapport entre le produit de la taxe d&#8217;enl&#232;vement des ordures m&#233;nag&#232;res per&#231;ue par la commune ou l&#8217;&#233;tablissement public de coop&#233;ration intercommunale exc&#233;dant les d&#233;penses mentionn&#233;es au premier alin&#233;a du I de l&#8217;article&#160;1520 et le produit de la taxe d&#8217;enl&#232;vement des ordures m&#233;nag&#232;res estim&#233; &#224; la date du vote de la d&#233;lib&#233;ration fixant le taux en litige.</p><p style=\"text-align: justify;\">&#171;&#160;L&#8217;administration fiscale communique aux collectivit&#233;s territoriales concern&#233;es, dans un d&#233;lai d&#8217;un mois &#224; compter de la date de notification du d&#233;gr&#232;vement prononc&#233; en application du IV, le montant de la taxe d&#233;grev&#233;e, le montant initial de l&#8217;imposition contest&#233;e, ainsi que la r&#233;f&#233;rence du jugement &#224; l&#8217;origine de la d&#233;cision de d&#233;gr&#232;vement.&#160;&#187;</p><p style=\"text-align: justify;\">II.&#160;&#8211;&#160;En cons&#233;quence, apr&#232;s l&#8217;alin&#233;a&#160;16, ins&#233;rer l&#8217;alin&#233;a suivant&#160;:</p><p style=\"text-align: justify;\">&#171;&#160;A <i>bis</i> Les services de l&#8217;&#201;tat transmettent aux collectivit&#233;s territoriales ayant institu&#233; la taxe d&#8217;enl&#232;vement des ordures m&#233;nag&#232;res, avant le 28 f&#233;vrier 2019, les informations relatives aux cotisations de taxe d&#8217;enl&#232;vement des ordures m&#233;nag&#232;res qui ont fait l&#8217;objet de recours contentieux pour la taxe d&#8217;enl&#232;vement des ordures m&#233;nag&#232;res &#233;tablie au titre de 2016.&#160;&#187;</p>",
    "exposeSommaire": "<p style=\"text-align: justify;\">Cet amendement pr&#233;cise les conditions de mise &#224; la charge des d&#233;gr&#232;vements de TEOM aux collectivit&#233;s pr&#233;vues &#224; l&#8217;article&#160;7 de pr&#233;sent projet de loi.</p><p style=\"text-align: justify;\">L&#8217;article&#160;7 du projet de loi de finances pour 2019 pr&#233;voit de mettre &#224; la charge des collectivit&#233;s les d&#233;gr&#232;vements prononc&#233;s pour la TEOM &#224; l&#8217;occasion de r&#233;clamations portant sur le taux de la taxe tout en n&#8217;offrant absolument pas les garanties n&#233;cessaires aux collectivit&#233;s territoriales pour couvrir les risques contentieux ainsi mis &#224; leur charge.</p><p style=\"text-align: justify;\">Ne pas traiter ces questions, tout en mettant &#224; la charge des collectivit&#233;s, moins dimensionn&#233;es que l&#8217;&#201;tat pour y faire face, les d&#233;gr&#232;vements suite &#224; des contentieux sur le taux de la TEOM, entra&#238;nerait ainsi un risque consid&#233;rable pour l&#8217;&#233;quilibre des budgets locaux &#224; compter de 2019.</p><p style=\"text-align: justify;\">Pour cette raison, la question des conditions de mise &#224; la charge des d&#233;gr&#232;vements aux collectivit&#233;s m&#233;rite &#233;galement d&#8217;&#234;tre clarifi&#233;e.</p><p style=\"text-align: justify;\">Premi&#232;rement, si l&#8217;&#201;tat n&#8217;a jamais prononc&#233; de d&#233;gr&#232;vement d&#8217;office sur les litiges en question aux contribuables n&#8217;ayant pas formalis&#233; de recours contentieux, il convient de s&#8217;assurer que des d&#233;gr&#232;vements d&#8217;office ou sur simple r&#233;clamation ne puissent pas &#234;tre prononc&#233;s sans recours possible de la collectivit&#233; lorsque les contentieux sont mis &#224; sa charge. Les collectivit&#233;s devraient &#233;galement pouvoir contr&#244;ler, surtout dans un contexte d&#8217;exp&#233;rimentation de la certification des comptes, les d&#233;gr&#232;vements mis &#224; leur charge en rendant possible un contr&#244;le de coh&#233;rence entre la moindre recette constat&#233;e dans les douzi&#232;mes de fiscalit&#233; et les d&#233;cisions du juge de l&#8217;imp&#244;t.</p><p style=\"text-align: justify;\">Enfin, le pr&#233;sent amendement limite les d&#233;gr&#232;vements prononc&#233;s, &#224; compter des impositions de TEOM &#233;tablies au titre de 2019, &#224; la seule part de TEOM que le juge de l&#8217;imp&#244;t aura estim&#233;e comme &#233;tant exc&#233;dentaire, offrant ainsi une base l&#233;gale au maintien partiel de l&#8217;imposition.</p>",
    "annexeExposeSommaire": {
      "@xmlns:xsi": "http://www.w3.org/2001/XMLSchema-instance",
      "@xsi:nil": "true"
    }
  },
  "representations": {
    "representation": {
      "nom": "PDF",
      "typeMime": {
        "type": "application",
        "subType": "PDF"
      },
      "statutRepresentation": {
        "verbatim": "true",
        "canonique": "true",
        "officielle": "true",
        "transcription": "false",
        "enregistrement": "false"
      },
      "repSource": {
        "@xmlns:xsi": "http://www.w3.org/2001/XMLSchema-instance",
        "@xsi:nil": "true"
      },
      "offset": {
        "@xmlns:xsi": "http://www.w3.org/2001/XMLSchema-instance",
        "@xsi:nil": "true"
      },
      "contenu": {
        "documentURI": "/15/amendements/1255A/AN/2066.pdf"
      },
      "dateDispoRepresentation": {
        "@xmlns:xsi": "http://www.w3.org/2001/XMLSchema-instance",
        "@xsi:nil": "true"
      }
    }
  },
  "seanceDiscussion": "RUANR5L15S2019IDS21279",
  "sort": {
    "dateSaisie": "2018-10-18T19:39:52.000+02:00",
    "sortEnSeance": "Retiré"
  },
  "dateDepot": "2018-10-11T02:00:00.000+02:00",
  "dateDistribution": "2018-10-14T02:00:00.000+02:00",
  "article99": "0",
  "loiReference": {
    "codeLoi": {
      "@xmlns:xsi": "http://www.w3.org/2001/XMLSchema-instance",
      "@xsi:nil": "true"
    },
    "divisionCodeLoi": {
      "@xmlns:xsi": "http://www.w3.org/2001/XMLSchema-instance",
      "@xsi:nil": "true"
    }
  }
}