{
  "@xmlns": "http://schemas.assemblee-nationale.fr/referentiel",
  "uid": "AMANR5L15SEA717460B2272P2D1N1751",
  "identifiant": {
    "legislature": "15",
    "numero": "1751",
    "numRect": "0",
    "saisine": {
      "refTexteLegislatif": "PRJLANR5L15B2272",
      "numeroPartiePLF": "2",
      "organeExamen": "PO717460",
      "mentionSecondeDeliberation": "0"
    }
  },
  "numeroLong": "II-1751",
  "etapeTexte": "1ère lecture (1ère assemblée saisie)",
  "triAmendement": "beeaaaaaaaaaaaaaaaaaaaaaaaaaaaaaaaaaaaaaaaaaaaaaaazzxi",
  "cardinaliteAmdtMultiples": "1",
  "amendementParent": {
    "@xmlns:xsi": "http://www.w3.org/2001/XMLSchema-instance",
    "@xsi:nil": "true"
  },
  "etat": "Discuté",
  "signataires": {
    "auteur": {
      "typeAuteur": "Depute",
      "acteurRef": "PA721062",
      "organeRef": {
        "@xmlns:xsi": "http://www.w3.org/2001/XMLSchema-instance",
        "@xsi:nil": "true"
      },
      "groupePolitiqueRef": "PO730958"
    },
    "cosignataires": {
      "acteurRef": [
        "PA588884",
        "PA719578",
        "PA721226",
        "PA721062",
        "PA720422",
        "PA721210",
        "PA718868",
        "PA721960",
        "PA720430",
        "PA722142",
        "PA719676",
        "PA721202",
        "PA720286",
        "PA720846",
        "PA720892",
        "PA2150",
        "PA718860"
      ]
    },
    "texteAffichable": "M.&#160;Ratenon,  Mme&#160;Autain, M.&#160;Bernalicis, M.&#160;Coquerel, M.&#160;Corbi&#232;re, Mme&#160;Fiat, M.&#160;Lachaud, M.&#160;Larive, M.&#160;M&#233;lenchon, Mme&#160;Obono, Mme&#160;Panot, M.&#160;Prud&apos;homme, M.&#160;Quatennens, Mme&#160;Ressiguier, Mme&#160;Rubin, M.&#160;Ruffin et Mme&#160;Taurine"
  },
  "pointeurFragmentTexte": {
    "missionVisee": {
      "idMissionAN": "827",
      "libelleMission": "Solidarité, insertion et égalité des chances",
      "codeMissionPLF": "B",
      "libelleMissionPLF": "Répartition, par mission et programme, des crédits du budget général"
    },
    "division": {
      "titre": "ÉTAT B",
      "articleDesignationCourte": "ART. 38",
      "type": "ANNEXE",
      "avant_A_Apres": "A",
      "divisionRattachee": "ARTICLE 38",
      "articleAdditionnel": {
        "@xmlns:xsi": "http://www.w3.org/2001/XMLSchema-instance",
        "@xsi:nil": "true"
      },
      "chapitreAdditionnel": {
        "@xmlns:xsi": "http://www.w3.org/2001/XMLSchema-instance",
        "@xsi:nil": "true"
      },
      "urlDivisionTexteVise": "/15/textes/2272C.asp#D_ETAT_B"
    },
    "alinea": {
      "@xmlns:xsi": "http://www.w3.org/2001/XMLSchema-instance",
      "@xsi:nil": "true"
    }
  },
  "corps": {
    "exposeSommaire": "<p style=\"text-align: justify;\">143 000 enfants vivent dans un foyer o&#249; une femme a d&#233;clar&#233; &#234;tre victimes de violences commises par son conjoint ou ex-conjoint et 42&#160;% de ces enfants ont moins de 6 ans, soit 60 000 tr&#232;s jeunes enfants.<br />Dans 68 &#224; 80&#160;% des cas, l&#8217;enfant est pr&#233;sent lorsque la m&#232;re est violent&#233;e.</p><p style=\"text-align: justify;\">En 2018, 21 enfants sont morts dans le cadre des violences conjugales et 82 sont rest&#233;s orphelins. La situation des enfants victimes de violences ou connaissant des situations de violences au sein de leurs foyer est extr&#234;mement pr&#233;occupante et constitue encore aujourd&#8217;hui un angle mort de la politique sociale du Gouvernement. <br />Or, si le grenelle des violences conjugales a effleur&#233; la question en souhaitant aligner le statut des enfants t&#233;moins de violences dites &#171;&#160;intrafamiliales&#160;&#187;, afin de les faire b&#233;n&#233;ficier du r&#233;gime des enfants victimes de violences, cela nous semble insuffisant. Il est n&#233;cessaire qu&#8217;un accompagnement d&#233;di&#233; soit mis en place, que le stress post-traumatique que vit la majorit&#233; de ces enfants soit trait&#233;e, afin que les impacts de ces violences sur leur sant&#233; psychologique, intellectuelle et &#233;motionnelle soient r&#233;duits au maximum.</p><p style=\"text-align: justify;\">&#192; des fins de recevabilit&#233; financi&#232;re, amendement pr&#233;voit le transfert de 1 000 000 d&#8217;euros de l&#8217;action n&#176;&#160;11 vers un nouveau programme intitul&#233; &#171;&#160;protection des enfants dans des situations de violence intraconjugale&#160;&#187;.</p>",
    "annexeExposeSommaire": {
      "@xmlns:xsi": "http://www.w3.org/2001/XMLSchema-instance",
      "@xsi:nil": "true"
    },
    "cartoucheDelaiDepotDepasse": {
      "@xmlns:xsi": "http://www.w3.org/2001/XMLSchema-instance",
      "@xsi:nil": "true"
    },
    "avantAppel": {
      "@xmlns:xsi": "http://www.w3.org/2001/XMLSchema-instance",
      "@xsi:nil": "true"
    },
    "dispositifAmdtCredit": {
      "listeProgrammes": {
        "programme": [
          {
            "libelle": "Inclusion sociale et protection des personnes",
            "id": "101164",
            "AE": {
              "montantPositif": "0",
              "montantNegatif": "1000000"
            },
            "CP": {
              "montantPositif": "0",
              "montantNegatif": "1000000"
            },
            "action": "modification",
            "lignesCredits": null
          },
          {
            "libelle": "Handicap et dépendance",
            "id": "101165",
            "AE": {
              "montantPositif": "0",
              "montantNegatif": "0"
            },
            "CP": {
              "montantPositif": "0",
              "montantNegatif": "0"
            },
            "action": "modification",
            "lignesCredits": null
          },
          {
            "libelle": "Égalité entre les femmes et les hommes",
            "id": "101166",
            "AE": {
              "montantPositif": "0",
              "montantNegatif": "0"
            },
            "CP": {
              "montantPositif": "0",
              "montantNegatif": "0"
            },
            "action": "modification",
            "lignesCredits": null
          },
          {
            "libelle": "Conduite et soutien des politiques sanitaires, sociales, du sport, de la jeunesse et de la vie associative",
            "id": "101167",
            "AE": {
              "montantPositif": "0",
              "montantNegatif": "0"
            },
            "CP": {
              "montantPositif": "0",
              "montantNegatif": "0"
            },
            "action": "modification",
            "lignesCredits": null
          },
          {
            "libelle": "Protection des enfants dans des situations de violence intraconjugale",
            "id": "101168",
            "AE": {
              "montantPositif": "1000000",
              "montantNegatif": "0"
            },
            "CP": {
              "montantPositif": "1000000",
              "montantNegatif": "0"
            },
            "action": "creation",
            "lignesCredits": null
          }
        ]
      },
      "totalAE": {
        "montantPositif": "1000000",
        "montantNegatif": "1000000",
        "solde": "0"
      },
      "totalCP": {
        "montantPositif": "1000000",
        "montantNegatif": "1000000",
        "solde": "0"
      }
    }
  },
  "representations": {
    "representation": {
      "nom": "PDF",
      "typeMime": {
        "type": "application",
        "subType": "PDF"
      },
      "statutRepresentation": {
        "verbatim": "true",
        "canonique": "true",
        "officielle": "true",
        "transcription": "false",
        "enregistrement": "false"
      },
      "repSource": {
        "@xmlns:xsi": "http://www.w3.org/2001/XMLSchema-instance",
        "@xsi:nil": "true"
      },
      "offset": {
        "@xmlns:xsi": "http://www.w3.org/2001/XMLSchema-instance",
        "@xsi:nil": "true"
      },
      "contenu": {
        "documentURI": "/15/amendements/2272C/AN/1751.pdf"
      },
      "dateDispoRepresentation": {
        "@xmlns:xsi": "http://www.w3.org/2001/XMLSchema-instance",
        "@xsi:nil": "true"
      }
    }
  },
  "seanceDiscussion": "RUANR5L15S2020IDS21908",
  "sort": {
    "dateSaisie": "2019-11-07T18:33:53.000+01:00",
    "sortEnSeance": "Rejeté"
  },
  "dateDepot": "2019-11-04T01:00:00.000+01:00",
  "dateDistribution": "2019-11-05T01:00:00.000+01:00",
  "article99": "0",
  "loiReference": {
    "codeLoi": {
      "@xmlns:xsi": "http://www.w3.org/2001/XMLSchema-instance",
      "@xsi:nil": "true"
    },
    "divisionCodeLoi": {
      "@xmlns:xsi": "http://www.w3.org/2001/XMLSchema-instance",
      "@xsi:nil": "true"
    }
  }
}