{
  "@xmlns": "http://schemas.assemblee-nationale.fr/referentiel",
  "uid": "AMANR5L15SEA717460BTC1629P0D1N223",
  "identifiant": {
    "legislature": "15",
    "numero": "223",
    "numRect": "0",
    "saisine": {
      "refTexteLegislatif": "PRJLANR5L15BTC1629",
      "numeroPartiePLF": "0",
      "organeExamen": "PO717460",
      "mentionSecondeDeliberation": "0"
    }
  },
  "numeroLong": "223",
  "etapeTexte": "1ère lecture (1ère assemblée saisie)",
  "triAmendement": "adaaaaaaaaaaaaaaaaaaaaaaaaaaaaaaaaaaaaaaaaaaaaaaaaabbfxboc",
  "cardinaliteAmdtMultiples": "1",
  "amendementParent": {
    "@xmlns:xsi": "http://www.w3.org/2001/XMLSchema-instance",
    "@xsi:nil": "true"
  },
  "etat": "Discuté",
  "signataires": {
    "auteur": {
      "typeAuteur": "Depute",
      "acteurRef": "PA1874",
      "organeRef": {
        "@xmlns:xsi": "http://www.w3.org/2001/XMLSchema-instance",
        "@xsi:nil": "true"
      },
      "groupePolitiqueRef": "PO730934"
    },
    "cosignataires": {
      "acteurRef": [
        "PA718884",
        "PA721968",
        "PA334654",
        "PA718838",
        "PA1874",
        "PA267204",
        "PA332523",
        "PA267429",
        "PA267735",
        "PA719318",
        "PA336316",
        "PA608016",
        "PA2492",
        "PA267901",
        "PA330008",
        "PA608416",
        "PA330909",
        "PA642847",
        "PA643134",
        "PA718850",
        "PA346218",
        "PA267794",
        "PA266793",
        "PA605036",
        "PA330684",
        "PA609726",
        "PA606712",
        "PA720684",
        "PA709315"
      ]
    },
    "texteAffichable": "M.&#160;Le Fur,  M.&#160;Abad, Mme&#160;Anthoine, M.&#160;Aubert, M.&#160;Bazin, Mme&#160;Bazin-Malgras, M.&#160;Bony, M.&#160;Bouchet, Mme&#160;Val&#233;rie&#160;Boyer, M.&#160;Breton, M.&#160;Brun, M.&#160;Cinieri, M.&#160;Cordier, Mme&#160;Dalloz, M.&#160;Descoeur, M.&#160;Pierre-Henri&#160;Dumont, M.&#160;de Ganay, M.&#160;Hetzel, M.&#160;Kamardine, Mme&#160;Louwagie, M.&#160;Lurton, M.&#160;Masson, M.&#160;Quentin, M.&#160;Sermier, M.&#160;Straumann, Mme&#160;Tabarot, Mme&#160;Valentin, M.&#160;Viala et M.&#160;Vialay"
  },
  "pointeurFragmentTexte": {
    "missionVisee": {
      "@xmlns:xsi": "http://www.w3.org/2001/XMLSchema-instance",
      "@xsi:nil": "true"
    },
    "division": {
      "titre": "Article PREMIER",
      "articleDesignationCourte": "APRÈS ART. PREMIER",
      "type": "ARTICLE",
      "avant_A_Apres": "Après",
      "divisionRattachee": "APRÈS L'ARTICLE PREMIER, insérer l'article suivant:",
      "articleAdditionnel": "1",
      "chapitreAdditionnel": {
        "@xmlns:xsi": "http://www.w3.org/2001/XMLSchema-instance",
        "@xsi:nil": "true"
      },
      "urlDivisionTexteVise": "/15/textes/1629.asp#D_Article_1er"
    },
    "alinea": {
      "@xmlns:xsi": "http://www.w3.org/2001/XMLSchema-instance",
      "@xsi:nil": "true"
    }
  },
  "corps": {
    "dispositif": "<p style=\"text-align: justify;\">Apr&#232;s le 4&#176; de l&#8217;article L.&#160;131&#8209;2 du code de l&#8217;&#233;ducation, il est ins&#233;r&#233; un 5&#176; ainsi r&#233;dig&#233;&#160;:</p><p style=\"text-align: justify;\">&#171;&#160;5&#176;&#160;Proposer aux enseignants des ressources p&#233;dagogiques pour leur enseignement, des contenus et services destin&#233;s &#224; leur formation initiale et continue et des outils de suivi de leurs &#233;l&#232;ves et de communication avec les familles.&#160;&#187;</p>",
    "exposeSommaire": "<p style=\"text-align: justify;\">L&#8217;article L.&#160;131&#8209;2 du code de l&#8217;&#233;ducation issu de la loi met en place un service public de l&#8217;enseignement num&#233;rique et de l&#8217;enseignement &#224; distance.</p><p style=\"text-align: justify;\">Ce service public de l&#8217;enseignement num&#233;rique prolonge l&#8217;offre des enseignements qui sont dispens&#233;s dans l&#8217;&#233;tablissement et de faciliter la mise en &#339;uvre d&#8217;une aide personnalis&#233;e aux &#233;l&#232;ves. Il met aussi &#224; disposition des enseignants des ressources p&#233;dagogiques, des outils de suivi de leurs &#233;l&#232;ves et de communication avec leur famille, ainsi que des contenus et services destin&#233;s &#224; leur formation initiale et continue et permet d&#8217;assurer l&#8217;instruction des enfants qui ne peuvent &#234;tre scolaris&#233;s en &#233;tablissement.</p><p style=\"text-align: justify;\">Le pr&#233;sent amendement vise &#224; compl&#233;ter cet article afin de donner leur place aux &#233;l&#232;ves &#224; besoins &#233;ducatif particuliers en am&#233;liorant l&#8217;aide personnalis&#233;e dans le cadre du service public de l&#8217;enseignement &#224; distance et de l&#8217;enseignement num&#233;rique.</p>",
    "annexeExposeSommaire": {
      "@xmlns:xsi": "http://www.w3.org/2001/XMLSchema-instance",
      "@xsi:nil": "true"
    },
    "cartoucheDelaiDepotDepasse": {
      "@xmlns:xsi": "http://www.w3.org/2001/XMLSchema-instance",
      "@xsi:nil": "true"
    }
  },
  "representations": {
    "representation": {
      "nom": "PDF",
      "typeMime": {
        "type": "application",
        "subType": "PDF"
      },
      "statutRepresentation": {
        "verbatim": "true",
        "canonique": "true",
        "officielle": "true",
        "transcription": "false",
        "enregistrement": "false"
      },
      "repSource": {
        "@xmlns:xsi": "http://www.w3.org/2001/XMLSchema-instance",
        "@xsi:nil": "true"
      },
      "offset": {
        "@xmlns:xsi": "http://www.w3.org/2001/XMLSchema-instance",
        "@xsi:nil": "true"
      },
      "contenu": {
        "documentURI": "/15/amendements/1629/AN/223.pdf"
      },
      "dateDispoRepresentation": {
        "@xmlns:xsi": "http://www.w3.org/2001/XMLSchema-instance",
        "@xsi:nil": "true"
      }
    }
  },
  "seanceDiscussion": "RUANR5L15S2019IDS21500",
  "sort": {
    "dateSaisie": "2019-02-12T22:39:36.000+01:00",
    "sortEnSeance": "Rejeté"
  },
  "dateDepot": "2019-02-05T01:00:00.000+01:00",
  "dateDistribution": "2019-02-11T01:00:00.000+01:00",
  "article99": "0",
  "loiReference": {
    "codeLoi": "c éducation",
    "divisionCodeLoi": "L131-2"
  }
}