{
  "@xmlns": "http://schemas.assemblee-nationale.fr/referentiel",
  "uid": "AMANR5L15SEA717460BTC0106P0D1N626",
  "identifiant": {
    "legislature": "15",
    "numero": "626",
    "numRect": "0",
    "saisine": {
      "refTexteLegislatif": "PRJLANR5L15BTC0106",
      "numeroPartiePLF": "0",
      "organeExamen": "PO717460",
      "mentionSecondeDeliberation": "0"
    }
  },
  "numeroLong": "626",
  "etapeTexte": "1ère lecture (2ème assemblée saisie)",
  "triAmendement": "hm",
  "cardinaliteAmdtMultiples": "1",
  "amendementParent": {
    "@xmlns:xsi": "http://www.w3.org/2001/XMLSchema-instance",
    "@xsi:nil": "true"
  },
  "etat": "Discuté",
  "signataires": {
    "auteur": {
      "typeAuteur": "Depute",
      "acteurRef": "PA266797",
      "organeRef": {
        "@xmlns:xsi": "http://www.w3.org/2001/XMLSchema-instance",
        "@xsi:nil": "true"
      },
      "groupePolitiqueRef": "PO730934"
    },
    "cosignataires": {
      "acteurRef": "PA266797"
    },
    "texteAffichable": "M.&#160;Gosselin"
  },
  "pointeurFragmentTexte": {
    "missionVisee": {
      "@xmlns:xsi": "http://www.w3.org/2001/XMLSchema-instance",
      "@xsi:nil": "true"
    },
    "division": {
      "titre": "Article 15",
      "articleDesignationCourte": "APRÈS ART. 15",
      "type": "ARTICLE",
      "avant_A_Apres": "Après",
      "divisionRattachee": "APRÈS L'ARTICLE 15, insérer la division et l'intitulé suivants:",
      "articleAdditionnel": {
        "@xmlns:xsi": "http://www.w3.org/2001/XMLSchema-instance",
        "@xsi:nil": "true"
      },
      "chapitreAdditionnel": "1",
      "urlDivisionTexteVise": "/15/textes/0106.asp#D_Article_15"
    },
    "alinea": {
      "@xmlns:xsi": "http://www.w3.org/2001/XMLSchema-instance",
      "@xsi:nil": "true"
    }
  },
  "corps": {
    "dispositif": "<p style=\"text-align: justify;\">Titre VII&#160;: Disposition relative &#224; la proc&#233;dure parlementaire.</p><p style=\"text-align: justify;\">Dans un d&#233;lai de six mois &#224; compter de la promulgation de la pr&#233;sente loi, le Gouvernement remet au Parlement un rapport sur la possibilit&#233; de g&#233;n&#233;raliser la consultation publique en ligne sur internet de tous les projets de loi et propositions de loi examin&#233;s par le Parlement.</p><p style=\"text-align: justify;\">Le rapport d&#233;taille l&#8217;opportunit&#233; et le co&#251;t d&#8217;une telle mesure et formule plusieurs propositions pour assurer son efficacit&#233;.</p>",
    "exposeSommaire": "<p style=\"text-align: justify;\">Cet amendement reprend la proposition de loi organique g&#233;n&#233;ralisant la consultation publique en ligne, par internet, sur les textes de loi avant leur examen par le Parlement, d&#233;pos&#233;e en avril 2016 par le d&#233;put&#233; Patrice Martin Lalande dont j'&#233;tais cosignataire.</p><p style=\"text-align: justify;\">Le projet de loi pour une R&#233;publique num&#233;rique a ouvert la voie &#224; cette m&#233;thode par une consultation citoyenne de 3 semaines qui avait vu 21000 visites et 8500 contributions d&#233;pos&#233;es.</p><p style=\"text-align: justify;\">Le num&#233;rique doit &#234;tre au service de nos concitoyens et de la d&#233;mocratie.</p><p>Une consultation g&#233;n&#233;ralis&#233;e permettrait :<br /> Une meilleure &#171; co-construction &#187; citoyenne, une meilleure appropriation du processus l&#233;gislatif et une plus grande transparence de l'&#233;laboration de la norme l&#233;gislative. Sans aucun doute, internet, dans ce cadre peut &#234;tre le meilleur pour renforcer la confiance de nos concitoyens dans l'action publique, ce qui est l'objet de la pr&#233;sente loi organique.</p>",
    "annexeExposeSommaire": {
      "@xmlns:xsi": "http://www.w3.org/2001/XMLSchema-instance",
      "@xsi:nil": "true"
    }
  },
  "representations": {
    "representation": {
      "nom": "PDF",
      "typeMime": {
        "type": "application",
        "subType": "PDF"
      },
      "statutRepresentation": {
        "verbatim": "true",
        "canonique": "true",
        "officielle": "true",
        "transcription": "false",
        "enregistrement": "false"
      },
      "repSource": {
        "@xmlns:xsi": "http://www.w3.org/2001/XMLSchema-instance",
        "@xsi:nil": "true"
      },
      "offset": {
        "@xmlns:xsi": "http://www.w3.org/2001/XMLSchema-instance",
        "@xsi:nil": "true"
      },
      "contenu": {
        "documentURI": "/15/amendements/0106/AN/626.pdf"
      },
      "dateDispoRepresentation": {
        "@xmlns:xsi": "http://www.w3.org/2001/XMLSchema-instance",
        "@xsi:nil": "true"
      }
    }
  },
  "seanceDiscussion": "RUANR5L15S2017IDS20661",
  "sort": {
    "dateSaisie": "2017-07-28T13:19:29.000+02:00",
    "sortEnSeance": "Rejeté"
  },
  "dateDepot": "2017-07-24T02:00:00.000+02:00",
  "dateDistribution": "2017-07-24T02:00:00.000+02:00",
  "article99": "0",
  "loiReference": {
    "codeLoi": {
      "@xmlns:xsi": "http://www.w3.org/2001/XMLSchema-instance",
      "@xsi:nil": "true"
    },
    "divisionCodeLoi": {
      "@xmlns:xsi": "http://www.w3.org/2001/XMLSchema-instance",
      "@xsi:nil": "true"
    }
  }
}