{
  "@xmlns": "http://schemas.assemblee-nationale.fr/referentiel",
  "uid": "AMANR5L15SEA717460B1255P2D1N1851",
  "identifiant": {
    "legislature": "15",
    "numero": "1851",
    "numRect": "0",
    "saisine": {
      "refTexteLegislatif": "PRJLANR5L15B1255",
      "numeroPartiePLF": "2",
      "organeExamen": "PO717460",
      "mentionSecondeDeliberation": "0"
    }
  },
  "numeroLong": "II-1851",
  "etapeTexte": "1ère lecture (1ère assemblée saisie)",
  "triAmendement": "ieaaaaaaaaaaaaaaaaaaaaaaaaaaaaaaaaaaaaaaaaaaaaaaaackfo",
  "cardinaliteAmdtMultiples": "1",
  "amendementParent": {
    "@xmlns:xsi": "http://www.w3.org/2001/XMLSchema-instance",
    "@xsi:nil": "true"
  },
  "etat": "Irrecevable",
  "signataires": {
    "auteur": {
      "typeAuteur": "Depute",
      "acteurRef": "PA720996",
      "organeRef": {
        "@xmlns:xsi": "http://www.w3.org/2001/XMLSchema-instance",
        "@xsi:nil": "true"
      },
      "groupePolitiqueRef": "PO759900"
    },
    "cosignataires": {
      "acteurRef": "PA720996"
    },
    "texteAffichable": "M.&#160;El Guerrab"
  },
  "pointeurFragmentTexte": {
    "missionVisee": {
      "@xmlns:xsi": "http://www.w3.org/2001/XMLSchema-instance",
      "@xsi:nil": "true"
    },
    "division": {
      "titre": "Article 63",
      "articleDesignationCourte": "APRÈS ART. 63",
      "type": "ARTICLE",
      "avant_A_Apres": "Après",
      "divisionRattachee": "APRÈS L'ARTICLE 63, insérer l'article suivant:",
      "articleAdditionnel": "1",
      "chapitreAdditionnel": {
        "@xmlns:xsi": "http://www.w3.org/2001/XMLSchema-instance",
        "@xsi:nil": "true"
      },
      "urlDivisionTexteVise": "/15/textes/1255C.asp#D_Article_63"
    },
    "alinea": {
      "@xmlns:xsi": "http://www.w3.org/2001/XMLSchema-instance",
      "@xsi:nil": "true"
    }
  },
  "corps": {
    "dispositif": "<p style=\"text-align: justify;\">Apr&#232;s le III de l&#8217;article&#160;13 de la loi n&#176; 2018&#8209;32 du 22 janvier 2018 de programmation des finances publiques pour les ann&#233;es 2018 &#224; 2022, il est ins&#233;r&#233; un III <i>bis</i> ainsi r&#233;dig&#233;&#160;:</p><p style=\"text-align: justify;\">&#171;&#160;III <i>bis</i>&#160;&#8211;&#160;L&#8217;objectif national d&#8217;&#233;volution des d&#233;penses r&#233;elles de fonctionnement mentionn&#233; au III est augment&#233; chaque ann&#233;e de la quote-part de l&#8217;&#233;volution nette des d&#233;penses de fonctionnement des collectivit&#233;s territoriales et de leurs groupements &#224; fiscalit&#233; propre r&#233;sultant des nouvelles normes produites par l&#8217;&#201;tat telles que calcul&#233;es par la Cour des comptes dans son rapport annuel portant sur la situation financi&#232;re et la gestion des collectivit&#233;s territoriales et de leurs &#233;tablissements publics.&#160;&#187;</p>",
    "exposeSommaire": "<p style=\"text-align: justify;\">Certaines mesures produites par l&#8217;&#201;tat, ind&#233;pendamment des d&#233;cisions prises par les collectivit&#233;s territoriales, ont un impact sur l&#8217;&#233;volution de leurs d&#233;penses.</p><p style=\"text-align: justify;\">Dans sa d&#233;cision[1] rendue sur la loi de programmation des finances publiques pour les ann&#233;es 2018 &#224; 2022, le Conseil constitutionnel a invit&#233; le Gouvernement &#224; prendre en compte &#171;&#160;les cons&#233;quences des &#233;volutions normatives&#160;&#187; pour l&#8217;appr&#233;ciation de l&#8217;&#233;volution des d&#233;penses r&#233;elles de fonctionnement (DRF), &#224; l&#8217;occasion de la signature d&#8217;avenants pr&#233;vus au II de l&#8217;article&#160;29 de la loi de programmation des finances publiques 2018&#8209;2022.</p><p style=\"text-align: justify;\">Les collectivit&#233;s territoriales demandent donc que l&#8217;impact financier des &#233;volutions normatives soit pris en compte dans le calcul de l&#8217;&#233;volution des DRF.</p><p style=\"text-align: justify;\">Par ailleurs, l&#8217;impact financier du co&#251;t net des nouvelles normes produites par l&#8217;&#201;tat sur les DRF des collectivit&#233;s territoriales est &#233;valu&#233; chaque ann&#233;e la Cour des comptes, dans son rapport portant sur la situation financi&#232;re et la gestion des collectivit&#233;s territoriales et de leurs &#233;tablissements publics. Ainsi en 2017, le cout des nouvelles normes impactant les DRF a &#233;t&#233; de 1 339 M&#8364; ce qui repr&#233;sente un accroissement de + 0,7&#160;% du total des DRF de l&#8217;ensemble des collectivit&#233;s territoriales.</p><p style=\"text-align: justify;\">Le pr&#233;sent amendement vise ainsi &#224; accroitre le plafond de l&#8217;&#233;volution des DRF (1,2&#160;%) pr&#233;vu dans la loi de programmation, &#224; due concurrence de l&#8217;impact financier des &#233;volutions normatives r&#233;sultant des d&#233;cisions unilat&#233;rales de l&#8217;&#201;tat tel que calcul&#233;, chaque ann&#233;e, par la Cour des comptes.</p><p style=\"text-align: justify;\">Cet amendement r&#233;sulte d&#8217;une recommandation de la part de La France urbaine, l&#8217;association qui regroupe les &#233;lus des m&#233;tropoles, grandes intercommunalit&#233;s et villes fran&#231;aises.</p><p style=\"text-align: justify;\">[1] Consid&#233;rant n&#176;14 de la d&#233;cision n&#176; 2017&#8209;760 DC du 18 janvier 2018.</p>",
    "annexeExposeSommaire": {
      "@xmlns:xsi": "http://www.w3.org/2001/XMLSchema-instance",
      "@xsi:nil": "true"
    }
  },
  "representations": {
    "representation": {
      "nom": "PDF",
      "typeMime": {
        "type": "application",
        "subType": "PDF"
      },
      "statutRepresentation": {
        "verbatim": "true",
        "canonique": "true",
        "officielle": "true",
        "transcription": "false",
        "enregistrement": "false"
      },
      "repSource": {
        "@xmlns:xsi": "http://www.w3.org/2001/XMLSchema-instance",
        "@xsi:nil": "true"
      },
      "offset": {
        "@xmlns:xsi": "http://www.w3.org/2001/XMLSchema-instance",
        "@xsi:nil": "true"
      },
      "contenu": {
        "documentURI": "/15/amendements/1255C/AN/1851.pdf"
      },
      "dateDispoRepresentation": {
        "@xmlns:xsi": "http://www.w3.org/2001/XMLSchema-instance",
        "@xsi:nil": "true"
      }
    }
  },
  "seanceDiscussion": {
    "@xmlns:xsi": "http://www.w3.org/2001/XMLSchema-instance",
    "@xsi:nil": "true"
  },
  "sort": {
    "@xmlns:xsi": "http://www.w3.org/2001/XMLSchema-instance",
    "@xsi:nil": "true"
  },
  "dateDepot": "2018-11-09T01:00:00.000+01:00",
  "dateDistribution": {
    "@xmlns:xsi": "http://www.w3.org/2001/XMLSchema-instance",
    "@xsi:nil": "true"
  },
  "article99": "0",
  "loiReference": {
    "codeLoi": "loi 2018-32",
    "divisionCodeLoi": "13"
  }
}