{
  "@xmlns": "http://schemas.assemblee-nationale.fr/referentiel",
  "uid": "AMANR5L15PO59051B1503P0D1N366",
  "identifiant": {
    "legislature": "15",
    "numero": "366",
    "numRect": "0",
    "saisine": {
      "refTexteLegislatif": "PRJLANR5L15B1503",
      "numeroPartiePLF": "0",
      "organeExamen": "PO59051",
      "mentionSecondeDeliberation": "0"
    }
  },
  "numeroLong": "CL366",
  "etapeTexte": "Nouvelle Lecture",
  "triAmendement": "lpaaaaaaaaaaaaaaaaaaaaaaaaaaaaaaaaaaaaaaaaaaaaaaaaiws",
  "cardinaliteAmdtMultiples": "1",
  "amendementParent": {
    "@xmlns:xsi": "http://www.w3.org/2001/XMLSchema-instance",
    "@xsi:nil": "true"
  },
  "etat": "Discuté",
  "signataires": {
    "auteur": {
      "typeAuteur": "Depute",
      "acteurRef": "PA267330",
      "organeRef": {
        "@xmlns:xsi": "http://www.w3.org/2001/XMLSchema-instance",
        "@xsi:nil": "true"
      },
      "groupePolitiqueRef": "PO744425"
    },
    "cosignataires": {
      "acteurRef": [
        "PA267355",
        "PA266788",
        "PA721486",
        "PA695100",
        "PA721110",
        "PA267766",
        "PA332228",
        "PA642935",
        "PA719806",
        "PA267585",
        "PA1960",
        "PA721094",
        "PA331567",
        "PA702052",
        "PA642868",
        "PA268019",
        "PA267330",
        "PA720230",
        "PA267780",
        "PA267241",
        "PA721194",
        "PA610775"
      ]
    },
    "texteAffichable": "M.&#160;Zumkeller,  M.&#160;Morel-&#192;-L&apos;Huissier, M.&#160;Lagarde, M.&#160;Becht, Mme&#160;Auconie, M.&#160;Benoit, M.&#160;Guy&#160;Bricout, M.&#160;Christophe, Mme&#160;de La Raudi&#232;re, M.&#160;Demilly, Mme&#160;Fr&#233;d&#233;rique&#160;Dumas, M.&#160;Dunoyer, Mme&#160;Firmin Le Bodo, M.&#160;Gom&#232;s, M.&#160;Meyer&#160;Habib, M.&#160;Herth, M.&#160;Leroy, Mme&#160;Magnier, M.&#160;Naegelen, Mme&#160;Sage, Mme&#160;Sanquer et M.&#160;Vercamer"
  },
  "pointeurFragmentTexte": {
    "missionVisee": {
      "@xmlns:xsi": "http://www.w3.org/2001/XMLSchema-instance",
      "@xsi:nil": "true"
    },
    "division": {
      "titre": "Article 53",
      "articleDesignationCourte": "ART. 53",
      "type": "ARTICLE",
      "avant_A_Apres": "A",
      "divisionRattachee": "ARTICLE 53",
      "articleAdditionnel": {
        "@xmlns:xsi": "http://www.w3.org/2001/XMLSchema-instance",
        "@xsi:nil": "true"
      },
      "chapitreAdditionnel": {
        "@xmlns:xsi": "http://www.w3.org/2001/XMLSchema-instance",
        "@xsi:nil": "true"
      },
      "urlDivisionTexteVise": "/15/textes/1503.asp#D_Article_53"
    },
    "alinea": {
      "avant_A_Apres": {
        "@xmlns:xsi": "http://www.w3.org/2001/XMLSchema-instance",
        "@xsi:nil": "true"
      },
      "numero": "15",
      "alineaDesignation": {
        "@xmlns:xsi": "http://www.w3.org/2001/XMLSchema-instance",
        "@xsi:nil": "true"
      }
    }
  },
  "corps": {
    "dispositif": "<p style=\"text-align: justify;\">R&#233;tablir l&#8217;alin&#233;a&#160;15 dans la r&#233;daction suivante&#160;:</p><p style=\"text-align: justify;\">&#171;&#160;5&#176;&#160;<i>bis</i>&#160;Au chapitre IV du titre II du livre I<sup>er</sup>, il est ajout&#233; un article L.&#160;124&#8209;1 ainsi r&#233;dig&#233;&#160;:</p><p style=\"text-align: justify;\">&#171;&#160;&#171;&#160;<i>Art.&#160;L.&#160;124&#8209;1</i>.&#160;&#8211;&#160;Tout projet de cr&#233;ation ou de suppression et tout projet de modification du si&#232;ge ou du ressort d&#8217;un tribunal de premi&#232;re instance ou d&#8217;une chambre d&#233;tach&#233;e donnent lieu &#224; une &#233;valuation, au vu des observations pr&#233;sent&#233;es par le premier pr&#233;sident de la cour d&#8217;appel et le procureur g&#233;n&#233;ral pr&#232;s cette cour ainsi que par le conseil d&#233;partemental, dont il est rendu compte dans un rapport public.</p><p style=\"text-align: justify;\">&#171;&#160;&#171;&#160;La m&#234;me proc&#233;dure est applicable aux tribunaux pour enfants ainsi qu&#8217;aux juridictions mentionn&#233;es &#224; l&#8217;article L.&#160;261&#8209;1.</p><p style=\"text-align: justify;\">&#171;&#160;&#171;&#160;Un d&#233;cret en Conseil d&#8217;&#201;tat fixe les modalit&#233;s d&#8217;application du pr&#233;sent article, notamment les crit&#232;res sur la base desquels la cr&#233;ation ou la suppression ou la modification du si&#232;ge ou du ressort d&#8217;une juridiction ou d&#8217;une chambre d&#233;tach&#233;e doit &#234;tre justifi&#233;e.&#160;&#187;&#160;;&#160;&#187;.</p>",
    "exposeSommaire": "<p>Cet amendement vise &#224; r&#233;tablir une disposition introduite par le S&#233;nat pour instaurer une proc&#233;dure encadrant toute &#233;volution de la carte judiciaire, notamment pour les tribunaux judiciaires et les chambres de proximit&#233;.</p><p>En effet, cet amendement pr&#233;voit que les projet de cr&#233;ation, de suppression ou de modification d&#8217;un si&#232;ge ou d&#8217;un ressort donnent lieu &#224; une &#233;valuation par le premier pr&#233;sident de la cour d&#8217;appel, le procureur g&#233;n&#233;ral et le conseil d&#233;partemental, et &#224; la publication d&#8217;un rapport.</p><p>Ainsi, ces garanties seraient le gage de l&#8217;&#233;valuation et de la concertation n&#233;cessaires &#224; l&#8217;&#233;volution du maillage territorial des juridictions, laquelle rel&#232;ve du pouvoir r&#233;glementaire.</p><p>&#160;</p>",
    "annexeExposeSommaire": {
      "@xmlns:xsi": "http://www.w3.org/2001/XMLSchema-instance",
      "@xsi:nil": "true"
    },
    "cartoucheDelaiDepotDepasse": {
      "@xmlns:xsi": "http://www.w3.org/2001/XMLSchema-instance",
      "@xsi:nil": "true"
    }
  },
  "representations": {
    "representation": {
      "nom": "PDF",
      "typeMime": {
        "type": "application",
        "subType": "PDF"
      },
      "statutRepresentation": {
        "verbatim": "true",
        "canonique": "true",
        "officielle": "true",
        "transcription": "false",
        "enregistrement": "false"
      },
      "repSource": {
        "@xmlns:xsi": "http://www.w3.org/2001/XMLSchema-instance",
        "@xsi:nil": "true"
      },
      "offset": {
        "@xmlns:xsi": "http://www.w3.org/2001/XMLSchema-instance",
        "@xsi:nil": "true"
      },
      "contenu": {
        "documentURI": "/15/amendements/1503/CION_LOIS/CL366.pdf"
      },
      "dateDispoRepresentation": {
        "@xmlns:xsi": "http://www.w3.org/2001/XMLSchema-instance",
        "@xsi:nil": "true"
      }
    }
  },
  "seanceDiscussion": {
    "@xmlns:xsi": "http://www.w3.org/2001/XMLSchema-instance",
    "@xsi:nil": "true"
  },
  "sort": {
    "dateSaisie": "2018-12-19T23:19:03.000+01:00",
    "sortEnSeance": "Non soutenu"
  },
  "dateDepot": "2018-12-17T01:00:00.000+01:00",
  "dateDistribution": "2018-12-18T01:00:00.000+01:00",
  "article99": "0",
  "loiReference": {
    "codeLoi": "id",
    "divisionCodeLoi": {
      "@xmlns:xsi": "http://www.w3.org/2001/XMLSchema-instance",
      "@xsi:nil": "true"
    }
  }
}