{
  "@xmlns": "http://schemas.assemblee-nationale.fr/referentiel",
  "uid": "AMANR5L15PO419865B0011P0D1N3",
  "identifiant": {
    "legislature": "15",
    "numero": "3",
    "numRect": "0",
    "saisine": {
      "refTexteLegislatif": "PRJLANR5L15B0011",
      "numeroPartiePLF": "0",
      "organeExamen": "PO419865",
      "mentionSecondeDeliberation": "0"
    }
  },
  "numeroLong": "CD3",
  "etapeTexte": "1ère lecture (1ère assemblée saisie)",
  "triAmendement": "j",
  "cardinaliteAmdtMultiples": "1",
  "amendementParent": {
    "@xmlns:xsi": "http://www.w3.org/2001/XMLSchema-instance",
    "@xsi:nil": "true"
  },
  "etat": "Discuté",
  "signataires": {
    "auteur": {
      "typeAuteur": "Depute",
      "acteurRef": "PA267204",
      "organeRef": {
        "@xmlns:xsi": "http://www.w3.org/2001/XMLSchema-instance",
        "@xsi:nil": "true"
      },
      "groupePolitiqueRef": "PO730934"
    },
    "cosignataires": {
      "acteurRef": [
        "PA718838",
        "PA721046",
        "PA267204",
        "PA267527",
        "PA720210"
      ]
    },
    "texteAffichable": "M.&#160;Sermier,  Mme&#160;Beauvais, M.&#160;Saddier, Mme&#160;Bassire et M.&#160;Brun"
  },
  "pointeurFragmentTexte": {
    "missionVisee": {
      "@xmlns:xsi": "http://www.w3.org/2001/XMLSchema-instance",
      "@xsi:nil": "true"
    },
    "division": {
      "titre": "Article unique",
      "articleDesignationCourte": "APRÈS ART. UNIQUE",
      "type": "ARTICLE",
      "avant_A_Apres": "Après",
      "divisionRattachee": "APRÈS L'ARTICLE UNIQUE, insérer l'article suivant:",
      "articleAdditionnel": "1",
      "chapitreAdditionnel": "0",
      "urlDivisionTexteVise": "/15/textes/0011.asp#D_Article_unique"
    },
    "alinea": {
      "@xmlns:xsi": "http://www.w3.org/2001/XMLSchema-instance",
      "@xsi:nil": "true"
    }
  },
  "corps": {
    "dispositif": "<p style=\"text-align: justify;\">Apr&#232;s le mot &#171;&#160;autorisation&#160;&#187;, la fin du troisi&#232;me alin&#233;a du I de l&#8217;article&#160;122&#8209;1&#8209;1 du code de l&#8217;environnement est ainsi r&#233;dig&#233;&#160;: &#171;&#160;fait l&#8217;objet d&#8217;une information du demandeur mentionnant les motifs principaux &#233;tant &#224; l&#8217;origine du refus&#160;&#187;.</p>",
    "exposeSommaire": "<p style=\"text-align: justify;\">La notion de &#171; d&#233;cisions expresses et motiv&#233;es introduirait dans le texte du code de l&#8217;environnement une notion de d&#233;cision faisant grief et comme telle ouvrirait clairement d&#232;s ce stade une facult&#233; de contentieux pour la ou les demandeurs non retenus contre la d&#233;cision ainsi notifi&#233;e. Cette facult&#233;, qui s&#8217;ouvrirait alors que le public b&#233;n&#233;ficie de la mise &#224; disposition de l&#8217;information sur le choix du candidat retenu et alors que celui-ci est engag&#233; dans l&#8217;instruction de sa demande en tant que candidat retenu, est source d&#8217;ins&#233;curit&#233; juridique pour celui-ci et peut &#224; ce stade de la proc&#233;dure remettre en cause le pouvoir de choix op&#233;r&#233; par l&#8217;Etat. Il importe donc d&#8217;&#233;viter toute fragilisation du processus, qui n&#8217;irait pas dans le sens de la simplification.</p><p style=\"text-align: justify;\">&#160;</p>",
    "annexeExposeSommaire": {
      "@xmlns:xsi": "http://www.w3.org/2001/XMLSchema-instance",
      "@xsi:nil": "true"
    }
  },
  "representations": {
    "representation": {
      "nom": "PDF",
      "typeMime": {
        "type": "application",
        "subType": "PDF"
      },
      "statutRepresentation": {
        "verbatim": "true",
        "canonique": "true",
        "officielle": "true",
        "transcription": "false",
        "enregistrement": "false"
      },
      "repSource": {
        "@xmlns:xsi": "http://www.w3.org/2001/XMLSchema-instance",
        "@xsi:nil": "true"
      },
      "offset": {
        "@xmlns:xsi": "http://www.w3.org/2001/XMLSchema-instance",
        "@xsi:nil": "true"
      },
      "contenu": {
        "documentURI": "/15/amendements/0011/CION-DVP/CD3.pdf"
      },
      "dateDispoRepresentation": {
        "@xmlns:xsi": "http://www.w3.org/2001/XMLSchema-instance",
        "@xsi:nil": "true"
      }
    }
  },
  "seanceDiscussion": {
    "@xmlns:xsi": "http://www.w3.org/2001/XMLSchema-instance",
    "@xsi:nil": "true"
  },
  "sort": {
    "dateSaisie": "2017-07-11T16:45:51.000+02:00",
    "sortEnSeance": "Rejeté"
  },
  "dateDepot": "2017-07-07T02:00:00.000+02:00",
  "dateDistribution": "2017-07-07T02:00:00.000+02:00",
  "article99": "0",
  "loiReference": {
    "codeLoi": "environnement",
    "divisionCodeLoi": "122-1-1"
  }
}