{
  "@xmlns": "http://schemas.assemblee-nationale.fr/referentiel",
  "uid": "AMANR5L15SEA717460B1255P2D1N115",
  "identifiant": {
    "legislature": "15",
    "numero": "115",
    "numRect": "0",
    "saisine": {
      "refTexteLegislatif": "PRJLANR5L15B1255",
      "numeroPartiePLF": "2",
      "organeExamen": "PO717460",
      "mentionSecondeDeliberation": "0"
    }
  },
  "numeroLong": "II-115",
  "etapeTexte": "1ère lecture (1ère assemblée saisie)",
  "triAmendement": "ejaaaaaaaaaaaaaaaaaaaaaaaaaaaaaaaaaaaaaaaaaaaaaaaaji",
  "cardinaliteAmdtMultiples": "1",
  "amendementParent": {
    "@xmlns:xsi": "http://www.w3.org/2001/XMLSchema-instance",
    "@xsi:nil": "true"
  },
  "etat": "Irrecevable",
  "signataires": {
    "auteur": {
      "typeAuteur": "Depute",
      "acteurRef": "PA330909",
      "organeRef": {
        "@xmlns:xsi": "http://www.w3.org/2001/XMLSchema-instance",
        "@xsi:nil": "true"
      },
      "groupePolitiqueRef": "PO730934"
    },
    "cosignataires": {
      "acteurRef": [
        "PA721474",
        "PA346218",
        "PA266808",
        "PA721968",
        "PA719318",
        "PA330909",
        "PA267527",
        "PA266793",
        "PA718884",
        "PA334654",
        "PA266776",
        "PA709315",
        "PA267204",
        "PA334843",
        "PA1630",
        "PA332523",
        "PA607090",
        "PA605036",
        "PA718838",
        "PA609726",
        "PA340853"
      ]
    },
    "texteAffichable": "M.&#160;Descoeur,  M.&#160;Viry, M.&#160;Aubert, M.&#160;Brun, M.&#160;Straumann, M.&#160;Masson, M.&#160;Sermier, M.&#160;Jean-Pierre&#160;Vigier, M.&#160;Abad, M.&#160;Verch&#232;re, M.&#160;Bony, Mme&#160;Bazin-Malgras, Mme&#160;Anthoine, M.&#160;Leclerc, M.&#160;Vialay, M.&#160;Rolland, M.&#160;Herbillon, M.&#160;Viala, M.&#160;Reiss, Mme&#160;Dalloz et M.&#160;Saddier"
  },
  "pointeurFragmentTexte": {
    "missionVisee": {
      "@xmlns:xsi": "http://www.w3.org/2001/XMLSchema-instance",
      "@xsi:nil": "true"
    },
    "division": {
      "titre": "Article 53",
      "articleDesignationCourte": "APRÈS ART. 53",
      "type": "ARTICLE",
      "avant_A_Apres": "Après",
      "divisionRattachee": "APRÈS L'ARTICLE 53, insérer l'article suivant:",
      "articleAdditionnel": "1",
      "chapitreAdditionnel": {
        "@xmlns:xsi": "http://www.w3.org/2001/XMLSchema-instance",
        "@xsi:nil": "true"
      },
      "urlDivisionTexteVise": "/15/textes/1255C.asp#D_Article_53"
    },
    "alinea": {
      "@xmlns:xsi": "http://www.w3.org/2001/XMLSchema-instance",
      "@xsi:nil": "true"
    }
  },
  "corps": {
    "dispositif": "<p style=\"text-align: justify;\">L&#8217;article&#160;1647&#8209;00 <i>bis</i> du code g&#233;n&#233;ral des imp&#244;ts est ainsi r&#233;dig&#233;&#160;:</p><p style=\"text-align: justify;\">&#171;&#160;<i>Art.&#160;1647&#8209;00&#160;</i>bis.&#160;&#8211;&#160;I. Pour les jeunes agriculteurs install&#233;s &#224; compter du 1<sup>er</sup> janvier 2019 et b&#233;n&#233;ficiaires des aides &#224; l&#8217;installation des jeunes agriculteurs pr&#233;vues a l&#8217;article D. 343&#8209;3 du code rural et de la p&#234;che maritime, il est accord&#233; un d&#233;gr&#232;vement &#233;gal &#224; 100&#160;% de la taxe fonci&#232;re sur les propri&#233;t&#233;s non b&#226;ties aff&#233;rente aux parcelles qu&#8217;ils exploitent pendant les cinq ann&#233;es suivant celle de leur installation.</p><p style=\"text-align: justify;\">&#171;&#160;Lorsque les jeunes agriculteurs sont associ&#233;s ou deviennent associ&#233;s d&#8217;une soci&#233;t&#233; civile au cours des cinq ann&#233;es suivant celle de leur installation, le d&#233;gr&#232;vement s&#8217;applique aux parcelles qu&#8217;ils apportent &#224; la soci&#233;t&#233; ou mettent &#224; sa disposition.</p><p style=\"text-align: justify;\">&#171;&#160;Ce d&#233;gr&#232;vement est accord&#233; pour une p&#233;riode ne pouvant exc&#233;der cinq ans &#224; compter de l&#8217;ann&#233;e suivant celle de l&#8217;installation de l&#8217;exploitant.</p><p style=\"text-align: justify;\">&#171;&#160;II.&#160;&#8211;&#160;Pour b&#233;n&#233;ficier de ce d&#233;gr&#232;vement, l&#8217;exploitant doit transmettre, avant le 31 janvier de l&#8217;ann&#233;e suivant celle de son installation, son relev&#233; parcellaire d&#8217;exploitation. Pour les quatre ann&#233;es suivantes et en cas de modifications apport&#233;es &#224; la consistance parcellaire de l&#8217;exploitation, l&#8217;exploitant transmet avant le 31 janvier de chaque ann&#233;e, son relev&#233; parcellaire d&#8217;exploitation modifi&#233;. Lorsque ce relev&#233; parcellaire d&#8217;exploitation est transmis hors d&#233;lai, le d&#233;gr&#232;vement est accord&#233; pour la dur&#233;e restant &#224; courir apr&#232;s le 31 d&#233;cembre de l&#8217;ann&#233;e de souscription.</p><p style=\"text-align: justify;\">&#171;&#160;Le montant du d&#233;gr&#232;vement b&#233;n&#233;ficie au fermier dans les conditions pr&#233;vues aux articles L.&#160;411&#8209;24 et L.&#160;417&#8209;8 du code rural et de la p&#234;che maritime.&#160;&#187;</p>",
    "exposeSommaire": "<p style=\"text-align: justify;\">Cet amendement a pour finalit&#233; d&#8217;accorder, aux jeunes install&#233;s b&#233;n&#233;ficiaires des aides &#224; l&#8217;installation, un d&#233;gr&#232;vement total de taxe fonci&#232;re sur les propri&#233;t&#233;s non b&#226;ties. Il s&#8217;agit l&#224; d&#8217;une mesure n&#233;cessaire pour favoriser le d&#233;veloppement de l&#8217;installation aid&#233;e.</p><p style=\"text-align: justify;\">A ce jour l&#8217;&#201;tat prend en charge seulement 50&#160;% de ce d&#233;gr&#232;vement et il est laiss&#233; aux collectivit&#233;s territoriales et &#224; leurs groupements la possibilit&#233; de prendre en charge, ou non, les 50&#160;% restant. Peu de collectivit&#233;s accordent ce d&#233;gr&#232;vement suppl&#233;mentaire car la taxe fonci&#232;re sur les propri&#233;t&#233;s non b&#226;ties repr&#233;sente pour bon nombre de communes rurales une source de financement importante. Ainsi, afin de ne plus laisser ce d&#233;gr&#232;vement &#224; la discr&#233;tion des collectivit&#233;s territoriales il est propos&#233; que l&#8217;&#201;tat prenne en charge l&#8217;int&#233;gralit&#233; de ce d&#233;gr&#232;vement.</p>",
    "annexeExposeSommaire": {
      "@xmlns:xsi": "http://www.w3.org/2001/XMLSchema-instance",
      "@xsi:nil": "true"
    }
  },
  "representations": {
    "representation": {
      "nom": "PDF",
      "typeMime": {
        "type": "application",
        "subType": "PDF"
      },
      "statutRepresentation": {
        "verbatim": "true",
        "canonique": "true",
        "officielle": "true",
        "transcription": "false",
        "enregistrement": "false"
      },
      "repSource": {
        "@xmlns:xsi": "http://www.w3.org/2001/XMLSchema-instance",
        "@xsi:nil": "true"
      },
      "offset": {
        "@xmlns:xsi": "http://www.w3.org/2001/XMLSchema-instance",
        "@xsi:nil": "true"
      },
      "contenu": {
        "documentURI": "/15/amendements/1255C/AN/115.pdf"
      },
      "dateDispoRepresentation": {
        "@xmlns:xsi": "http://www.w3.org/2001/XMLSchema-instance",
        "@xsi:nil": "true"
      }
    }
  },
  "seanceDiscussion": {
    "@xmlns:xsi": "http://www.w3.org/2001/XMLSchema-instance",
    "@xsi:nil": "true"
  },
  "sort": {
    "@xmlns:xsi": "http://www.w3.org/2001/XMLSchema-instance",
    "@xsi:nil": "true"
  },
  "dateDepot": "2018-10-24T02:00:00.000+02:00",
  "dateDistribution": {
    "@xmlns:xsi": "http://www.w3.org/2001/XMLSchema-instance",
    "@xsi:nil": "true"
  },
  "article99": "0",
  "loiReference": {
    "codeLoi": "CGI",
    "divisionCodeLoi": "1647-00 bis"
  }
}