{
  "@xmlns": "http://schemas.assemblee-nationale.fr/referentiel",
  "uid": "AMANR5L15SEA717460BTC1974P0D1N1421",
  "identifiant": {
    "legislature": "15",
    "numero": "1421",
    "numRect": "0",
    "saisine": {
      "refTexteLegislatif": "PRJLANR5L15BTC1974",
      "numeroPartiePLF": "0",
      "organeExamen": "PO717460",
      "mentionSecondeDeliberation": "0"
    }
  },
  "numeroLong": "1421",
  "etapeTexte": "1ère lecture (2ème assemblée saisie)",
  "triAmendement": "taaaaaaaaaaaaaaaaaaaaaaaaaaaaaaaaaaaaaaaaaaaaaaaaaow",
  "cardinaliteAmdtMultiples": "1",
  "amendementParent": {
    "@xmlns:xsi": "http://www.w3.org/2001/XMLSchema-instance",
    "@xsi:nil": "true"
  },
  "etat": "Discuté",
  "signataires": {
    "auteur": {
      "typeAuteur": "Depute",
      "acteurRef": "PA720278",
      "organeRef": {
        "@xmlns:xsi": "http://www.w3.org/2001/XMLSchema-instance",
        "@xsi:nil": "true"
      },
      "groupePolitiqueRef": "PO723569"
    },
    "cosignataires": {
      "acteurRef": [
        "PA720278",
        "PA719396",
        "PA720334",
        "PA722336",
        "PA722268",
        "PA719558",
        "PA719266",
        "PA643175",
        "PA722178",
        "PA721110",
        "PA719448",
        "PA720996",
        "PA607619",
        "PA335999",
        "PA702052",
        "PA720500",
        "PA719338",
        "PA332614",
        "PA719464",
        "PA722126",
        "PA610681",
        "PA722260",
        "PA718728",
        "PA607553",
        "PA720054",
        "PA718894"
      ]
    },
    "texteAffichable": "M.&#160;Orphelin,  Mme&#160;Bareigts, Mme&#160;Chapelier, M.&#160;Chiche, M.&#160;Dombreval, Mme&#160;Dupont, M.&#160;Haury, M.&#160;Maire, M.&#160;Molac, M.&#160;Pahun, Mme&#160;Sage, Mme&#160;Vanceunebrock-Mialon, M.&#160;Villani, M.&#160;El Guerrab, M.&#160;Juanico, M.&#160;Larsonneur, M.&#160;Thi&#233;baut, Mme&#160;Wonner, Mme&#160;Sanquer, M.&#160;Balanant, M.&#160;Cubertafon, Mme&#160;Melchior, M.&#160;Potier, Mme&#160;Val&#233;rie&#160;Petit, Mme&#160;Batho et M.&#160;Nadot"
  },
  "pointeurFragmentTexte": {
    "missionVisee": {
      "@xmlns:xsi": "http://www.w3.org/2001/XMLSchema-instance",
      "@xsi:nil": "true"
    },
    "division": {
      "titre": "Article 52",
      "articleDesignationCourte": "APRÈS ART. 52",
      "type": "ARTICLE",
      "avant_A_Apres": "Après",
      "divisionRattachee": "APRÈS L'ARTICLE 52, insérer l'article suivant:",
      "articleAdditionnel": "1",
      "chapitreAdditionnel": {
        "@xmlns:xsi": "http://www.w3.org/2001/XMLSchema-instance",
        "@xsi:nil": "true"
      },
      "urlDivisionTexteVise": "/15/textes/1974.asp#D_Article_52"
    },
    "alinea": {
      "@xmlns:xsi": "http://www.w3.org/2001/XMLSchema-instance",
      "@xsi:nil": "true"
    }
  },
  "corps": {
    "dispositif": "<p style=\"text-align: justify;\">Dans les trois mois suivant la promulgation de la pr&#233;sente loi, le Gouvernement remet au Parlement un rapport relatif &#224; la refonte de l&#8217;ensemble des dispositifs de soutien &#224; la conversion des v&#233;hicules vers des v&#233;hicules moins &#233;metteurs, permettant d&#8217;identifier les dispositifs les plus efficaces pour r&#233;duire les &#233;missions de dioxyde de carbonne et de polluants atmosph&#233;riques. Le rapport traite notamment de la prime &#224; la conversion et du bonus-malus.</p>",
    "exposeSommaire": "<p style=\"text-align: justify;\">Cet amendement vise &#224; engager une r&#233;flexion en vue de la remise &#224; plat de l&#8217;ensemble des dispositifs de soutien &#224; la conversion des v&#233;hicules polluants. Elle est plus que n&#233;cessaire&#160;: aujourd&#8217;hui les &#233;missions de CO2 moyennes par v&#233;hicules repartent &#224; la hausse et annulent les efforts r&#233;alis&#233;s ces derni&#232;res ann&#233;es.</p><p style=\"text-align: justify;\">Le rapport permettra d&#8217;ajuster les dispositifs existants afin d&#8217;assurer leur pleine efficacit&#233; au service de l&#8217;objectif de diminution des &#233;missions de gaz &#224; effet de serre et de polluants atmosph&#233;riques, en vue notamment du projet de loi de finances pour 2020.</p><p style=\"text-align: justify;\">Le rapport devra notamment examiner le moyen de traiter de mani&#232;re plus vertueuse le cas des v&#233;hicules dits &#171;&#160;SUV&#160;&#187;.</p>",
    "annexeExposeSommaire": {
      "@xmlns:xsi": "http://www.w3.org/2001/XMLSchema-instance",
      "@xsi:nil": "true"
    },
    "cartoucheDelaiDepotDepasse": {
      "@xmlns:xsi": "http://www.w3.org/2001/XMLSchema-instance",
      "@xsi:nil": "true"
    }
  },
  "representations": {
    "representation": {
      "nom": "PDF",
      "typeMime": {
        "type": "application",
        "subType": "PDF"
      },
      "statutRepresentation": {
        "verbatim": "true",
        "canonique": "true",
        "officielle": "true",
        "transcription": "false",
        "enregistrement": "false"
      },
      "repSource": {
        "@xmlns:xsi": "http://www.w3.org/2001/XMLSchema-instance",
        "@xsi:nil": "true"
      },
      "offset": {
        "@xmlns:xsi": "http://www.w3.org/2001/XMLSchema-instance",
        "@xsi:nil": "true"
      },
      "contenu": {
        "documentURI": "/15/amendements/1974/AN/1421.pdf"
      },
      "dateDispoRepresentation": {
        "@xmlns:xsi": "http://www.w3.org/2001/XMLSchema-instance",
        "@xsi:nil": "true"
      }
    }
  },
  "seanceDiscussion": "RUANR5L15S2019IDS21702",
  "sort": {
    "dateSaisie": "2019-06-15T01:10:31.000+02:00",
    "sortEnSeance": "Non soutenu"
  },
  "dateDepot": "2019-05-29T02:00:00.000+02:00",
  "dateDistribution": "2019-06-12T02:00:00.000+02:00",
  "article99": "0",
  "loiReference": {
    "codeLoi": {
      "@xmlns:xsi": "http://www.w3.org/2001/XMLSchema-instance",
      "@xsi:nil": "true"
    },
    "divisionCodeLoi": {
      "@xmlns:xsi": "http://www.w3.org/2001/XMLSchema-instance",
      "@xsi:nil": "true"
    }
  }
}