{
  "@xmlns": "http://schemas.assemblee-nationale.fr/referentiel",
  "uid": "AMANR5L15SEA717460B1408P0D1N236",
  "identifiant": {
    "legislature": "15",
    "numero": "236",
    "numRect": "0",
    "saisine": {
      "refTexteLegislatif": "PRJLANR5L15B1408",
      "numeroPartiePLF": "0",
      "organeExamen": "PO717460",
      "mentionSecondeDeliberation": "0"
    }
  },
  "numeroLong": "236",
  "etapeTexte": "Nouvelle Lecture",
  "triAmendement": "bmaaaaaaaaaaaaaaaaaaaaaaaaaaaaaaaaaaaaaaaaaaaaaaaajde",
  "cardinaliteAmdtMultiples": "1",
  "amendementParent": {
    "@xmlns:xsi": "http://www.w3.org/2001/XMLSchema-instance",
    "@xsi:nil": "true"
  },
  "etat": "Discuté",
  "signataires": {
    "auteur": {
      "typeAuteur": "Depute",
      "acteurRef": "PA267289",
      "organeRef": {
        "@xmlns:xsi": "http://www.w3.org/2001/XMLSchema-instance",
        "@xsi:nil": "true"
      },
      "groupePolitiqueRef": "PO730934"
    },
    "cosignataires": {
      "acteurRef": [
        "PA608416",
        "PA267289"
      ]
    },
    "texteAffichable": "M.&#160;Door et M.&#160;Hetzel"
  },
  "pointeurFragmentTexte": {
    "missionVisee": {
      "@xmlns:xsi": "http://www.w3.org/2001/XMLSchema-instance",
      "@xsi:nil": "true"
    },
    "division": {
      "titre": "Article 12",
      "articleDesignationCourte": "ART. 12",
      "type": "ARTICLE",
      "avant_A_Apres": "A",
      "divisionRattachee": "ARTICLE 12",
      "articleAdditionnel": {
        "@xmlns:xsi": "http://www.w3.org/2001/XMLSchema-instance",
        "@xsi:nil": "true"
      },
      "chapitreAdditionnel": {
        "@xmlns:xsi": "http://www.w3.org/2001/XMLSchema-instance",
        "@xsi:nil": "true"
      },
      "urlDivisionTexteVise": "/15/textes/1408.asp#D_Article_12"
    },
    "alinea": {
      "avant_A_Apres": {
        "@xmlns:xsi": "http://www.w3.org/2001/XMLSchema-instance",
        "@xsi:nil": "true"
      },
      "numero": "5",
      "alineaDesignation": {
        "@xmlns:xsi": "http://www.w3.org/2001/XMLSchema-instance",
        "@xsi:nil": "true"
      }
    }
  },
  "corps": {
    "dispositif": "<p style=\"text-align: justify;\">Apr&#232;s la r&#233;f&#233;rence&#160;:</p><p style=\"text-align: justify;\">&#171;&#160;I&#160;&#187;,</p><p style=\"text-align: justify;\">r&#233;diger ainsi la fin de l&#8217;alin&#233;a&#160;5&#160;:</p><p style=\"text-align: justify;\">&#171;&#160;de l&#8217;article L.&#160;862&#8209;4. Par d&#233;rogation, les garanties assurant le versement d&#8217;indemnit&#233;s compl&#233;mentaires aux indemnit&#233;s journali&#232;res mentionn&#233;es &#224; l&#8217;article L.&#160;321&#8209;1 sont exon&#233;r&#233;es.&#160;&#187;</p>",
    "exposeSommaire": "<p style=\"text-align: justify;\">Cet amendement vise &#224; pr&#233;ciser l&#8217;assiette de la taxe dite &#171;&#160;patient&#232;le&#160;&#187; et &#233;viter que l&#8217;actuelle r&#233;daction entraine m&#233;caniquement une majoration cons&#233;quente de la fiscalit&#233; sur la sant&#233;. Une telle majoration viendrait in&#233;luctablement peser sur le pouvoir d&#8217;achat des fran&#231;ais, ce qui est d&#8217;une part, &#233;videmment inopportun et d&#8217;autre part, ne parait pas refl&#233;ter l&#8217;intention gouvernementale.</p><p style=\"text-align: justify;\">Pour rappel&#160;: le forfait patient&#232;le m&#233;decin est vers&#233; aux m&#233;decins traitants, il est calcul&#233; annuellement sur la base de la patient&#232;le selon diff&#233;rents crit&#232;res. Les organismes compl&#233;mentaires d&#8217;assurance maladie (OCAM) en financent une partie depuis plusieurs ann&#233;es. Ce financement n&#8217;est pas remis en cause.</p><p style=\"text-align: justify;\">Le gouvernement a souhait&#233; codifier cette taxe pour en p&#233;renniser l&#8217;existence jusqu&#8217;en 2021. L&#8217;objet l&#8217;article&#160;12 consiste initialement &#224; transformer sa nature et non &#224; augmenter son assiette.</p><p style=\"text-align: justify;\">Toutefois, la codification a &#233;t&#233; ainsi r&#233;dig&#233;e que m&#233;caniquement elle vient consid&#233;rablement en &#233;largir l&#8217;assiette passant des seuls contrats couvrant les frais de sant&#233; aux contrats de pr&#233;voyance couvrant les indemnit&#233;s journali&#232;res.</p><p style=\"text-align: justify;\">Conscient de cet &#233;largissement, le gouvernement a, &#224; l&#8217;occasion d&#8217;un amendement de correction adopt&#233; par le S&#233;nat, op&#233;r&#233; une premi&#232;re modification mais qui reste imparfaite.</p><p style=\"text-align: justify;\">En effet, seule une partie des contrats de pr&#233;voyance a &#233;t&#233; exclue du champ (celle des contrats souscrits par les entreprises au profit des salari&#233;s), laissant de mani&#232;re incompr&#233;hensible dans le champ de la taxe les autres contrats de m&#234;me nature souscrits par les professionnels ou les individus &#224; titre ind&#233;pendant.</p><p style=\"text-align: justify;\">Le point n&#8217;est pas neutre car il bouleverse le niveau de taxation et va surench&#233;rir tous les contrats d&#8217;assurance couvrant la pr&#233;voyance quel que soit l&#8217;organisme assureur.&#160;</p><p style=\"text-align: justify;\">Il s&#8217;agit d&#8217;autre part d&#8217;un amendement r&#233;dactionnel&#160;: la r&#233;f&#233;rence textuelle de la petite loi &#224; l&#8217;article II bis est inexacte, il renvoie au 5&#176; de l&#8217;article L321&#8209;1 du code de la s&#233;curit&#233; sociale, abrog&#233; depuis le 1<sup>er</sup> janvier 2016. Il est donc important de modifier cette r&#233;f&#233;rence.</p>",
    "annexeExposeSommaire": {
      "@xmlns:xsi": "http://www.w3.org/2001/XMLSchema-instance",
      "@xsi:nil": "true"
    },
    "cartoucheDelaiDepotDepasse": {
      "@xmlns:xsi": "http://www.w3.org/2001/XMLSchema-instance",
      "@xsi:nil": "true"
    }
  },
  "representations": {
    "representation": {
      "nom": "PDF",
      "typeMime": {
        "type": "application",
        "subType": "PDF"
      },
      "statutRepresentation": {
        "verbatim": "true",
        "canonique": "true",
        "officielle": "true",
        "transcription": "false",
        "enregistrement": "false"
      },
      "repSource": {
        "@xmlns:xsi": "http://www.w3.org/2001/XMLSchema-instance",
        "@xsi:nil": "true"
      },
      "offset": {
        "@xmlns:xsi": "http://www.w3.org/2001/XMLSchema-instance",
        "@xsi:nil": "true"
      },
      "contenu": {
        "documentURI": "/15/amendements/1408/AN/236.pdf"
      },
      "dateDispoRepresentation": {
        "@xmlns:xsi": "http://www.w3.org/2001/XMLSchema-instance",
        "@xsi:nil": "true"
      }
    }
  },
  "seanceDiscussion": "RUANR5L15S2019IDS21383",
  "sort": {
    "dateSaisie": "2018-11-27T22:42:43.000+01:00",
    "sortEnSeance": "Rejeté"
  },
  "dateDepot": "2018-11-22T01:00:00.000+01:00",
  "dateDistribution": "2018-11-23T01:00:00.000+01:00",
  "article99": "0",
  "loiReference": {
    "codeLoi": {
      "@xmlns:xsi": "http://www.w3.org/2001/XMLSchema-instance",
      "@xsi:nil": "true"
    },
    "divisionCodeLoi": {
      "@xmlns:xsi": "http://www.w3.org/2001/XMLSchema-instance",
      "@xsi:nil": "true"
    }
  }
}