{
  "@xmlns": "http://schemas.assemblee-nationale.fr/referentiel",
  "uid": "AMANR5L15PO59048B1255P1D1N220",
  "identifiant": {
    "legislature": "15",
    "numero": "220",
    "numRect": "0",
    "saisine": {
      "refTexteLegislatif": "PRJLANR5L15B1255",
      "numeroPartiePLF": "1",
      "organeExamen": "PO59048",
      "mentionSecondeDeliberation": "0"
    }
  },
  "numeroLong": "I-CF220",
  "etapeTexte": "1ère lecture (1ère assemblée saisie)",
  "triAmendement": "efaaaaaaaaaaaaaaaaaaaaaaaaaaaaaaaaaaaaaaaaaaaaaaaahx",
  "cardinaliteAmdtMultiples": "1",
  "amendementParent": {
    "@xmlns:xsi": "http://www.w3.org/2001/XMLSchema-instance",
    "@xsi:nil": "true"
  },
  "etat": "Irrecevable",
  "signataires": {
    "auteur": {
      "typeAuteur": "Depute",
      "acteurRef": "PA332523",
      "organeRef": {
        "@xmlns:xsi": "http://www.w3.org/2001/XMLSchema-instance",
        "@xsi:nil": "true"
      },
      "groupePolitiqueRef": "PO730934"
    },
    "cosignataires": {
      "acteurRef": [
        "PA607090",
        "PA340853",
        "PA608826",
        "PA267204",
        "PA266793",
        "PA712015",
        "PA267378",
        "PA334654",
        "PA267429",
        "PA330909",
        "PA718838",
        "PA267260",
        "PA721678",
        "PA267735",
        "PA346218",
        "PA721968",
        "PA1874",
        "PA346054",
        "PA605036",
        "PA608416",
        "PA606712",
        "PA709315",
        "PA267901",
        "PA2377",
        "PA719318",
        "PA718884",
        "PA332523"
      ]
    },
    "texteAffichable": "Mme&#160;Dalloz,  M.&#160;Straumann, M.&#160;Sermier, Mme&#160;Levy, M.&#160;Dive, M.&#160;Kamardine, M.&#160;Masson, M.&#160;Leclerc, M.&#160;de Ganay, M.&#160;Bony, Mme&#160;Anthoine, Mme&#160;Bazin-Malgras, M.&#160;Jean-Pierre&#160;Vigier, M.&#160;Abad, M.&#160;Hetzel, M.&#160;Lurton, M.&#160;Perrut, Mme&#160;Duby-Muller, M.&#160;Cinieri, M.&#160;Reda, M.&#160;Brun, M.&#160;Le Fur, M.&#160;Descoeur, Mme&#160;Poletti, M.&#160;Vialay, M.&#160;Viala et M.&#160;Emmanuel&#160;Maquet"
  },
  "pointeurFragmentTexte": {
    "missionVisee": {
      "@xmlns:xsi": "http://www.w3.org/2001/XMLSchema-instance",
      "@xsi:nil": "true"
    },
    "division": {
      "titre": "Article 18",
      "articleDesignationCourte": "APRÈS ART. 18",
      "type": "ARTICLE",
      "avant_A_Apres": "Après",
      "divisionRattachee": "APRÈS L'ARTICLE 18, insérer l'article suivant:",
      "articleAdditionnel": "1",
      "chapitreAdditionnel": {
        "@xmlns:xsi": "http://www.w3.org/2001/XMLSchema-instance",
        "@xsi:nil": "true"
      },
      "urlDivisionTexteVise": "/15/textes/1255A.asp#D_Article_18"
    },
    "alinea": {
      "@xmlns:xsi": "http://www.w3.org/2001/XMLSchema-instance",
      "@xsi:nil": "true"
    }
  },
  "corps": {
    "dispositif": "<p>I. A l'article 244 quater L du code g&#233;n&#233;ral des imp&#244;ts, il est ins&#233;r&#233; un paragraphe III bis ainsi r&#233;dig&#233;:</p><p>&#171; III bis. Les exploitants agricoles qui obtiennent l&#8217;une des certifications environnementales vis&#233;es &#224; l&#8217;article L 611-6 du code rural et de la p&#234;che maritime b&#233;n&#233;ficient, lors de leur 1&#232;re ann&#233;e de certification, pour les certifications obtenues entre 2019 et 2021, d&#8217;un cr&#233;dit d&#8217;imp&#244;t &#233;gal &#224; 1750 &#8364;. &#187;</p><p>II. Au paragraphe IV du m&#234;me article, les mots : &#171; du cr&#233;dit d'imp&#244;t mentionn&#233; au I &#187; sont remplac&#233;s par les mots : &#171; des cr&#233;dits d'imp&#244;t mentionn&#233;s au I et au III bis &#187;.</p><p>III. La perte de recettes pour l&#8217;&#201;tat est compens&#233;e &#224; due concurrence par la cr&#233;ation d&#8217;une taxe additionnelle aux droits vis&#233;s aux articles 575 et 575 A du code g&#233;n&#233;ral des imp&#244;ts.</p>",
    "exposeSommaire": "<p>Un dispositif incitatif simple permettrait d&#8217;acc&#233;l&#233;rer l&#8217;engagement des viticulteurs dans la viticulture durable.</p><p>Cette d&#233;marche est aujourd&#8217;hui frein&#233;e par le fait qu&#8217;elle implique de nouveaux investissements, une hausse des co&#251;ts de production, une baisse de la production et des contraintes administratives suppl&#233;mentaires. Le co&#251;t de la certification par un organisme agr&#233;&#233;, ind&#233;pendant de la taille de l&#8217;entreprise, est particuli&#232;rement lourd pour les petites exploitations.</p><p>Afin de compenser ces handicaps et d&#8217;accompagner les exploitants dans leur d&#233;marche en faveur de l&#8217;environnement et de la biodiversit&#233;, il est propos&#233; d'att&#233;nuer le co&#251;t administratif de la certification environnementale en octroyant aux exploitants un cr&#233;dit d'imp&#244;t &#233;gal &#224; 50 % du cr&#233;dit d&#8217;imp&#244;t &#171; agriculture biologique &#187; soit 1750 &#8364;, lors de la 1&#232;re ann&#233;e de certification.</p><p>Ce cr&#233;dit d'imp&#244;t b&#233;n&#233;ficierait &#224; toutes les certifications environnementales de niveau 2 et 3 vis&#233;es aux articles D 617-3 et D 617-4 du code rural, dans le but d'inciter le plus grand nombre d'exploitants &#224; s'engager dans ces d&#233;marches.</p>",
    "annexeExposeSommaire": {
      "@xmlns:xsi": "http://www.w3.org/2001/XMLSchema-instance",
      "@xsi:nil": "true"
    }
  },
  "representations": {
    "representation": {
      "nom": "PDF",
      "typeMime": {
        "type": "application",
        "subType": "PDF"
      },
      "statutRepresentation": {
        "verbatim": "true",
        "canonique": "true",
        "officielle": "true",
        "transcription": "false",
        "enregistrement": "false"
      },
      "repSource": {
        "@xmlns:xsi": "http://www.w3.org/2001/XMLSchema-instance",
        "@xsi:nil": "true"
      },
      "offset": {
        "@xmlns:xsi": "http://www.w3.org/2001/XMLSchema-instance",
        "@xsi:nil": "true"
      },
      "contenu": {
        "documentURI": "/15/amendements/1255A/CION_FIN/CF220.pdf"
      },
      "dateDispoRepresentation": {
        "@xmlns:xsi": "http://www.w3.org/2001/XMLSchema-instance",
        "@xsi:nil": "true"
      }
    }
  },
  "seanceDiscussion": {
    "@xmlns:xsi": "http://www.w3.org/2001/XMLSchema-instance",
    "@xsi:nil": "true"
  },
  "sort": {
    "@xmlns:xsi": "http://www.w3.org/2001/XMLSchema-instance",
    "@xsi:nil": "true"
  },
  "dateDepot": "2018-10-03T02:00:00.000+02:00",
  "dateDistribution": {
    "@xmlns:xsi": "http://www.w3.org/2001/XMLSchema-instance",
    "@xsi:nil": "true"
  },
  "article99": "0",
  "loiReference": {
    "codeLoi": "impôts",
    "divisionCodeLoi": "244 quater L"
  }
}