{
  "@xmlns": "http://schemas.assemblee-nationale.fr/referentiel",
  "uid": "AMANR5L15PO419865B1831P0D1N1318",
  "identifiant": {
    "legislature": "15",
    "numero": "1318",
    "numRect": "0",
    "saisine": {
      "refTexteLegislatif": "PRJLANR5L15B1831",
      "numeroPartiePLF": "0",
      "organeExamen": "PO419865",
      "mentionSecondeDeliberation": "0"
    }
  },
  "numeroLong": "CD1318",
  "etapeTexte": "1ère lecture (2ème assemblée saisie)",
  "triAmendement": "cfaaaaaaaaaaaaaaaaaaaaaaaaaaaaaaaaaaaaaaaaaaaaaaaaji",
  "cardinaliteAmdtMultiples": "1",
  "amendementParent": {
    "@xmlns:xsi": "http://www.w3.org/2001/XMLSchema-instance",
    "@xsi:nil": "true"
  },
  "etat": "Discuté",
  "signataires": {
    "auteur": {
      "typeAuteur": "Depute",
      "acteurRef": "PA333421",
      "organeRef": {
        "@xmlns:xsi": "http://www.w3.org/2001/XMLSchema-instance",
        "@xsi:nil": "true"
      },
      "groupePolitiqueRef": "PO759900"
    },
    "cosignataires": {
      "acteurRef": [
        "PA605694",
        "PA607619",
        "PA719138",
        "PA333421",
        "PA605518",
        "PA331582",
        "PA720996",
        "PA405480",
        "PA719286",
        "PA719146"
      ]
    },
    "texteAffichable": "M.&#160;Pancher,  M.&#160;Acquaviva, M.&#160;Castellani, M.&#160;Colombani, M.&#160;El Guerrab, M.&#160;Falorni, M.&#160;Fran&#231;ois-Michel&#160;Lambert, M.&#160;Molac, M.&#160;Pupponi et M.&#160;Philippe&#160;Vigier"
  },
  "pointeurFragmentTexte": {
    "missionVisee": {
      "@xmlns:xsi": "http://www.w3.org/2001/XMLSchema-instance",
      "@xsi:nil": "true"
    },
    "division": {
      "titre": "Article 16",
      "articleDesignationCourte": "APRÈS ART. 16",
      "type": "ARTICLE",
      "avant_A_Apres": "Après",
      "divisionRattachee": "APRÈS L'ARTICLE 16, insérer l'article suivant:",
      "articleAdditionnel": "1",
      "chapitreAdditionnel": {
        "@xmlns:xsi": "http://www.w3.org/2001/XMLSchema-instance",
        "@xsi:nil": "true"
      },
      "urlDivisionTexteVise": "/15/textes/1831.asp#D_Article_16"
    },
    "alinea": {
      "@xmlns:xsi": "http://www.w3.org/2001/XMLSchema-instance",
      "@xsi:nil": "true"
    }
  },
  "corps": {
    "dispositif": "<p style=\"text-align: justify;\">Dans le d&#233;lai d&#8217;un an apr&#232;s l&#8217;entr&#233;e en vigueur de la pr&#233;sente loi, le Gouvernement remet au Parlement un rapport pr&#233;sentant le bilan du recueil syst&#233;matique des photographies de plaques d&#8217;immatriculation des v&#233;hicules circulant sur l&#8217;ensemble des voies r&#233;serv&#233;es sur le territoire national au regard du respect du droit &#224; la vie priv&#233;e des individus concern&#233;s, les conclusions &#224; en tirer et, le cas &#233;ch&#233;ant, les mesures correctrices &#224; y apporter.</p>",
    "exposeSommaire": "<p style=\"text-align: justify;\">Dans son avis sur le projet de loi d&#8217;orientation sur les mobilit&#233;s, rendu le 15 novembre 2018, le Conseil d&#8217;&#201;tat reconna&#238;t que &#171;&#160;le recueil syst&#233;matique des photographies de plaques d&#8217;immatriculation des v&#233;hicules circulant sur l&#8217;ensemble des voies r&#233;serv&#233;es sur le territoire national, et par cons&#233;quent, de leurs conducteurs et passagers, susceptibles ainsi d&#8217;&#234;tre identifi&#233;s, est de nature &#224; permettre la saisie sur une grande &#233;chelle de donn&#233;es personnelles, relatives au d&#233;placement des individus concern&#233;s&#160;&#187; (paragraphe 47, p. 587) et, partant, de porter &#171;&#160;atteinte au respect du droit &#224; la vie priv&#233;e&#160;&#187; (paragraphe 48, p. 587).</p><p style=\"text-align: justify;\">Il convient donc de s&#8217;assurer que ces craintes l&#233;gitimes seront lev&#233;es.</p><p style=\"text-align: justify;\">Tel est le sens de cet amendement.</p>",
    "annexeExposeSommaire": {
      "@xmlns:xsi": "http://www.w3.org/2001/XMLSchema-instance",
      "@xsi:nil": "true"
    },
    "cartoucheDelaiDepotDepasse": {
      "@xmlns:xsi": "http://www.w3.org/2001/XMLSchema-instance",
      "@xsi:nil": "true"
    }
  },
  "representations": {
    "representation": {
      "nom": "PDF",
      "typeMime": {
        "type": "application",
        "subType": "PDF"
      },
      "statutRepresentation": {
        "verbatim": "true",
        "canonique": "true",
        "officielle": "true",
        "transcription": "false",
        "enregistrement": "false"
      },
      "repSource": {
        "@xmlns:xsi": "http://www.w3.org/2001/XMLSchema-instance",
        "@xsi:nil": "true"
      },
      "offset": {
        "@xmlns:xsi": "http://www.w3.org/2001/XMLSchema-instance",
        "@xsi:nil": "true"
      },
      "contenu": {
        "documentURI": "/15/amendements/1831/CION-DVP/CD1318.pdf"
      },
      "dateDispoRepresentation": {
        "@xmlns:xsi": "http://www.w3.org/2001/XMLSchema-instance",
        "@xsi:nil": "true"
      }
    }
  },
  "seanceDiscussion": {
    "@xmlns:xsi": "http://www.w3.org/2001/XMLSchema-instance",
    "@xsi:nil": "true"
  },
  "sort": {
    "dateSaisie": "2019-05-17T09:57:21.000+02:00",
    "sortEnSeance": "Retiré"
  },
  "dateDepot": "2019-05-08T02:00:00.000+02:00",
  "dateDistribution": "2019-05-15T02:00:00.000+02:00",
  "article99": "0",
  "loiReference": {
    "codeLoi": "xxrapport photo",
    "divisionCodeLoi": {
      "@xmlns:xsi": "http://www.w3.org/2001/XMLSchema-instance",
      "@xsi:nil": "true"
    }
  }
}