{
  "@xmlns": "http://schemas.assemblee-nationale.fr/referentiel",
  "uid": "AMANR5L15SEA717460BTC1761P0D1N607",
  "identifiant": {
    "legislature": "15",
    "numero": "607",
    "numRect": "0",
    "saisine": {
      "refTexteLegislatif": "PRJLANR5L15BTC1761",
      "numeroPartiePLF": "0",
      "organeExamen": "PO717460",
      "mentionSecondeDeliberation": "0"
    }
  },
  "numeroLong": "607",
  "etapeTexte": "Nouvelle Lecture",
  "triAmendement": "doiaaaaaaaaaaaaaaaaaaaaaaaaaaaaaaaaaaaaaaaaaaaaaaali",
  "cardinaliteAmdtMultiples": "1",
  "amendementParent": {
    "@xmlns:xsi": "http://www.w3.org/2001/XMLSchema-instance",
    "@xsi:nil": "true"
  },
  "etat": "Discuté",
  "signataires": {
    "auteur": {
      "typeAuteur": "Depute",
      "acteurRef": "PA334149",
      "organeRef": {
        "@xmlns:xsi": "http://www.w3.org/2001/XMLSchema-instance",
        "@xsi:nil": "true"
      },
      "groupePolitiqueRef": "PO730934"
    },
    "cosignataires": {
      "acteurRef": [
        "PA608416",
        "PA2796",
        "PA267440",
        "PA721286",
        "PA334654",
        "PA1874",
        "PA606098",
        "PA709315",
        "PA342935",
        "PA1498",
        "PA267901",
        "PA267378",
        "PA606712",
        "PA746",
        "PA998",
        "PA267200",
        "PA2377",
        "PA720386",
        "PA1029",
        "PA1695",
        "PA334149",
        "PA267289",
        "PA330240",
        "PA1630",
        "PA722390",
        "PA856",
        "PA720100",
        "PA608016",
        "PA330788",
        "PA267735",
        "PA345722",
        "PA719318",
        "PA2155",
        "PA346054",
        "PA267318",
        "PA266808",
        "PA721070",
        "PA720644",
        "PA718780",
        "PA720684",
        "PA267527",
        "PA720586",
        "PA721474",
        "PA346218",
        "PA266776",
        "PA330684",
        "PA718884",
        "PA267785",
        "PA334843",
        "PA767",
        "PA609726",
        "PA332523",
        "PA608826",
        "PA721410",
        "PA712015",
        "PA721678",
        "PA720210",
        "PA223837",
        "PA721314",
        "PA720630",
        "PA266774",
        "PA642847",
        "PA721046",
        "PA1012",
        "PA721816",
        "PA721126",
        "PA748954",
        "PA267260",
        "PA266793",
        "PA609245",
        "PA607090",
        "PA267204",
        "PA923",
        "PA605991",
        "PA719946",
        "PA721054",
        "PA721968",
        "PA759192",
        "PA2086",
        "PA713448",
        "PA605036",
        "PA643134",
        "PA1327",
        "PA267794",
        "PA718850",
        "PA719272",
        "PA721506",
        "PA643103",
        "PA336316",
        "PA266797",
        "PA718838",
        "PA721636",
        "PA718784",
        "PA267450",
        "PA643089",
        "PA2492",
        "PA340853",
        "PA2529",
        "PA267324",
        "PA330008",
        "PA267429"
      ]
    },
    "texteAffichable": "M.&#160;Fasquelle,  M.&#160;Jacob, M.&#160;Abad, Mme&#160;Anthoine, M.&#160;Aubert, Mme&#160;Bassire, M.&#160;Bazin, Mme&#160;Bazin-Malgras, Mme&#160;Beauvais, Mme&#160;Bonnivard, M.&#160;Bony, M.&#160;Boucard, M.&#160;Bouchet, Mme&#160;Val&#233;rie&#160;Boyer, Mme&#160;Brenier, M.&#160;Breton, M.&#160;Brochand, M.&#160;Brun, M.&#160;Carrez, M.&#160;Cattin, M.&#160;Cherpion, M.&#160;Cinieri, M.&#160;Ciotti, M.&#160;Cordier, Mme&#160;Corneloup, M.&#160;Cornut-Gentille, Mme&#160;Dalloz, M.&#160;Dassault, M.&#160;de Ganay, M.&#160;de la Verpilli&#232;re, M.&#160;Deflesselles, M.&#160;R&#233;mi&#160;Delatte, M.&#160;Di Filippo, M.&#160;Diard, M.&#160;Dive, M.&#160;Door, Mme&#160;Marianne&#160;Dubois, Mme&#160;Duby-Muller, M.&#160;Pierre-Henri&#160;Dumont, M.&#160;Ferrara, M.&#160;Forissier, M.&#160;Furst, M.&#160;Gaultier, Mme&#160;Genevard, M.&#160;Goasguen, M.&#160;Gosselin, M.&#160;Grelier, Mme&#160;Guion-Firmin, M.&#160;Herbillon, M.&#160;Hetzel, M.&#160;Huyghe, M.&#160;Kamardine, Mme&#160;Kuster, Mme&#160;Lacroute, M.&#160;Larriv&#233;, M.&#160;Le Fur, Mme&#160;Le Grip, M.&#160;Leclerc, Mme&#160;Levy, M.&#160;Lorion, Mme&#160;Louwagie, M.&#160;Lurton, M.&#160;Emmanuel&#160;Maquet, M.&#160;Marleix, M.&#160;Marlin, M.&#160;Masson, M.&#160;Menuel, Mme&#160;Meunier, M.&#160;Minot, M.&#160;Nury, M.&#160;Parigi, M.&#160;Pauget, M.&#160;Peltier, M.&#160;Perrut, Mme&#160;Poletti, M.&#160;Poudroux, M.&#160;Pradi&#233;, M.&#160;Quentin, M.&#160;Ramadier, Mme&#160;Ramassamy, M.&#160;Reda, M.&#160;Reiss, M.&#160;Reitzer, M.&#160;Reyn&#232;s, M.&#160;Rolland, M.&#160;Saddier, M.&#160;Savignat, M.&#160;Schellenberger, M.&#160;Sermier, M.&#160;Straumann, Mme&#160;Tabarot, M.&#160;Teissier, M.&#160;Thi&#233;riot, Mme&#160;Trastour-Isnart, Mme&#160;Valentin, M.&#160;Vatin, M.&#160;Verch&#232;re, M.&#160;Viala, M.&#160;Vialay, M.&#160;Jean-Pierre&#160;Vigier et M.&#160;Viry"
  },
  "pointeurFragmentTexte": {
    "missionVisee": {
      "@xmlns:xsi": "http://www.w3.org/2001/XMLSchema-instance",
      "@xsi:nil": "true"
    },
    "division": {
      "titre": "Article 26",
      "articleDesignationCourte": "ART. 26",
      "type": "ARTICLE",
      "avant_A_Apres": "A",
      "divisionRattachee": "ARTICLE 26",
      "articleAdditionnel": {
        "@xmlns:xsi": "http://www.w3.org/2001/XMLSchema-instance",
        "@xsi:nil": "true"
      },
      "chapitreAdditionnel": {
        "@xmlns:xsi": "http://www.w3.org/2001/XMLSchema-instance",
        "@xsi:nil": "true"
      },
      "urlDivisionTexteVise": "/15/textes/1761.asp#D_Article_26"
    },
    "alinea": {
      "@xmlns:xsi": "http://www.w3.org/2001/XMLSchema-instance",
      "@xsi:nil": "true"
    }
  },
  "corps": {
    "dispositif": "<p>Supprimer cet article.</p>",
    "exposeSommaire": "<p style=\"text-align: justify;\">L&#8217;article&#160;26 a pour objet la cr&#233;ation d&#8217;un r&#233;gime fran&#231;ais des offres de jetons (Initial Coin Offering, ICO), forme de lev&#233;e de fonds via un dispositif d&#8217;enregistrement partag&#233; (blockchain) et l&#8217;&#233;mission de jetons (&#171;&#160;coins&#160;&#187;) num&#233;riques.</p><p style=\"text-align: justify;\">Il s&#8217;agit donc de cr&#233;er des nouveaux produits financiers bas&#233;s sur les cryptomonnaies et destin&#233;s &#224; financer les entreprises par les march&#233;s financiers. En d&#8217;autres termes, une sorte de bitcoin venant financer les entreprises en lieu et place des &#171;&#160;traditionnels&#160;&#187; titres.</p><p style=\"text-align: justify;\">Dans l&#8217;attente de r&#232;gles&#160;europ&#233;ennes et internationales relatives aux cryptomonnaies, le texte propose de permettre &#224; l&#8217;AMF de d&#233;livrer un visa aux acteurs qui souhaiteraient &#233;mettre des jetons destin&#233;s notamment au march&#233; fran&#231;ais pour le financement d&#8217;un projet ou d&#8217;une activit&#233;, sous r&#233;serve qu&#8217;ils respectent certaines r&#232;gles de nature &#224; &#233;viter des abus manifestes et &#224; informer et prot&#233;ger l&#8217;investisseur.</p><p style=\"text-align: justify;\">Alors que la Russie ou la Chine ont interdit l&#8217;utilisation de ce type de produits, que la SEC (Securities and Exchange Commission) aux USA a mis en place une r&#233;gulation particuli&#232;rement contraignante qui a fait fortement diminuer la volatilit&#233; des &#171;&#160;coins&#160;&#187; &#233;chang&#233;s sur le march&#233; am&#233;ricain, la France sera le seul pays&#160;europ&#233;en &#224; reconna&#238;tre de tels produits sans toutefois offrir un champ normatif suffisamment fort.</p><p style=\"text-align: justify;\">Le risque syst&#233;mique inh&#233;rent &#224; ce type de produits est important. M&#234;me avalis&#233; par l&#8217;Autorit&#233; des march&#233;s financiers, de tels produits pourraient &#234;tre plus risqu&#233;s que les CDO et CDS qui ont men&#233; &#224; une crise &#233;conomique mondiale en 2008 et &#224; la chute de nombreux acteurs &#233;conomiques majeurs dans le monde, ainsi qu&#8217;&#224; la d&#233;stabilisation de l&#8217;euro et de nombreux pays.</p><p style=\"text-align: justify;\">De m&#234;me, il faut s&#8217;interroger sur les investisseurs qui placeront leur fonds dans ce type de produits alors que la part de risque sera manifestement plus importante qu&#8217;avec un titre traditionnel, d&#8217;autant plus lorsque l&#8217;on s&#8217;aper&#231;oit que l&#8217;engouement pour les cryptomonnaies extr&#234;mement risqu&#233; se retrouve dans toutes les cat&#233;gories de population qui ne tiennent pas compte des risques.</p><p style=\"text-align: justify;\">A ceci s&#8217;ajoute la question de savoir qui assurera le bon &#233;change des jetons entre les d&#233;tenteurs&#160;: quelle place de march&#233; et autorit&#233; de r&#233;gulation veillera au bon d&#233;roulement des op&#233;rations&#160;? En outre, on peut s&#8217;interroger sur l&#8217;utilisation de ces produits &#224; des fins de blanchiment d&#8217;argent.</p><p style=\"text-align: justify;\">C&#8217;est la raison pour laquelle il convient de supprimer cet article et de faire le n&#233;cessaire au niveau&#160;europ&#233;en dans le cadre des travaux men&#233;s par la Commission et le Parlement&#160;europ&#233;ens.</p>",
    "annexeExposeSommaire": {
      "@xmlns:xsi": "http://www.w3.org/2001/XMLSchema-instance",
      "@xsi:nil": "true"
    },
    "cartoucheDelaiDepotDepasse": {
      "@xmlns:xsi": "http://www.w3.org/2001/XMLSchema-instance",
      "@xsi:nil": "true"
    }
  },
  "representations": {
    "representation": {
      "nom": "PDF",
      "typeMime": {
        "type": "application",
        "subType": "PDF"
      },
      "statutRepresentation": {
        "verbatim": "true",
        "canonique": "true",
        "officielle": "true",
        "transcription": "false",
        "enregistrement": "false"
      },
      "repSource": {
        "@xmlns:xsi": "http://www.w3.org/2001/XMLSchema-instance",
        "@xsi:nil": "true"
      },
      "offset": {
        "@xmlns:xsi": "http://www.w3.org/2001/XMLSchema-instance",
        "@xsi:nil": "true"
      },
      "contenu": {
        "documentURI": "/15/amendements/1761/AN/607.pdf"
      },
      "dateDispoRepresentation": {
        "@xmlns:xsi": "http://www.w3.org/2001/XMLSchema-instance",
        "@xsi:nil": "true"
      }
    }
  },
  "seanceDiscussion": "RUANR5L15S2019IDS21553",
  "sort": {
    "dateSaisie": "2019-03-15T23:04:58.000+01:00",
    "sortEnSeance": "Rejeté"
  },
  "dateDepot": "2019-03-11T01:00:00.000+01:00",
  "dateDistribution": "2019-03-12T01:00:00.000+01:00",
  "article99": "0",
  "loiReference": {
    "codeLoi": {
      "@xmlns:xsi": "http://www.w3.org/2001/XMLSchema-instance",
      "@xsi:nil": "true"
    },
    "divisionCodeLoi": {
      "@xmlns:xsi": "http://www.w3.org/2001/XMLSchema-instance",
      "@xsi:nil": "true"
    }
  }
}