{
  "@xmlns": "http://schemas.assemblee-nationale.fr/referentiel",
  "uid": "AMANR5L15SEA717460B1649P0D1N31",
  "identifiant": {
    "legislature": "15",
    "numero": "31",
    "numRect": "0",
    "saisine": {
      "refTexteLegislatif": "PIONANR5L15B1649",
      "numeroPartiePLF": "0",
      "organeExamen": "PO717460",
      "mentionSecondeDeliberation": "0"
    }
  },
  "numeroLong": "31",
  "etapeTexte": "1ère lecture (1ère assemblée saisie)",
  "triAmendement": "bkaaaaaaaaaaaaaaaaaaaaaaaaaaaaaaaaaaaaaaaaaaaaaaaai",
  "cardinaliteAmdtMultiples": "1",
  "amendementParent": {
    "@xmlns:xsi": "http://www.w3.org/2001/XMLSchema-instance",
    "@xsi:nil": "true"
  },
  "etat": "A discuter",
  "signataires": {
    "auteur": {
      "typeAuteur": "Depute",
      "acteurRef": "PA267450",
      "organeRef": {
        "@xmlns:xsi": "http://www.w3.org/2001/XMLSchema-instance",
        "@xsi:nil": "true"
      },
      "groupePolitiqueRef": "PO730934"
    },
    "cosignataires": {
      "acteurRef": [
        "PA712015",
        "PA330240",
        "PA718838",
        "PA998",
        "PA643134",
        "PA718780",
        "PA2492",
        "PA336316",
        "PA267735",
        "PA720630",
        "PA721474",
        "PA267429",
        "PA267204",
        "PA606712",
        "PA643103",
        "PA856",
        "PA346218",
        "PA718784",
        "PA330909",
        "PA721046",
        "PA267527",
        "PA330008",
        "PA722390",
        "PA267901",
        "PA334843",
        "PA266793",
        "PA266774",
        "PA1327",
        "PA721968",
        "PA340853",
        "PA266776",
        "PA2377",
        "PA719272",
        "PA267260",
        "PA2155",
        "PA1012",
        "PA608016",
        "PA267450",
        "PA721314",
        "PA266797",
        "PA334149",
        "PA642847",
        "PA718884",
        "PA2086",
        "PA1874",
        "PA605036",
        "PA719318"
      ]
    },
    "texteAffichable": "M.&#160;R&#233;mi&#160;Delatte,  M.&#160;Abad, Mme&#160;Anthoine, Mme&#160;Bassire, M.&#160;Bazin, Mme&#160;Bazin-Malgras, M.&#160;Bony, M.&#160;Bouchet, M.&#160;Breton, M.&#160;Brun, M.&#160;Cherpion, M.&#160;Cinieri, M.&#160;Ciotti, Mme&#160;Corneloup, M.&#160;Dassault, M.&#160;de Ganay, M.&#160;de la Verpilli&#232;re, M.&#160;Descoeur, M.&#160;Dive, M.&#160;Fasquelle, M.&#160;Ferrara, M.&#160;Forissier, M.&#160;Furst, M.&#160;Gosselin, M.&#160;Kamardine, M.&#160;Le Fur, M.&#160;Leclerc, Mme&#160;Louwagie, M.&#160;Lurton, M.&#160;Marlin, M.&#160;Masson, M.&#160;Menuel, Mme&#160;Meunier, M.&#160;Minot, M.&#160;Pauget, M.&#160;Perrut, Mme&#160;Poletti, M.&#160;Quentin, M.&#160;Reiss, M.&#160;Saddier, M.&#160;Schellenberger, M.&#160;Sermier, Mme&#160;Trastour-Isnart, Mme&#160;Valentin, M.&#160;Verch&#232;re, M.&#160;Vialay et M.&#160;Viry"
  },
  "pointeurFragmentTexte": {
    "missionVisee": {
      "@xmlns:xsi": "http://www.w3.org/2001/XMLSchema-instance",
      "@xsi:nil": "true"
    },
    "division": {
      "titre": "Article 3",
      "articleDesignationCourte": "APRÈS ART. 3",
      "type": "ARTICLE",
      "avant_A_Apres": "Après",
      "divisionRattachee": "APRÈS L'ARTICLE 3, insérer l'article suivant:",
      "articleAdditionnel": "1",
      "chapitreAdditionnel": {
        "@xmlns:xsi": "http://www.w3.org/2001/XMLSchema-instance",
        "@xsi:nil": "true"
      },
      "urlDivisionTexteVise": "/15/textes/1649.asp#D_Article_3"
    },
    "alinea": {
      "@xmlns:xsi": "http://www.w3.org/2001/XMLSchema-instance",
      "@xsi:nil": "true"
    }
  },
  "corps": {
    "dispositif": "<p style=\"text-align: justify;\">L&#8217;article L.&#160;1424&#8209;37 du code g&#233;n&#233;ral des collectivit&#233;s territoriales est compl&#233;t&#233; par un alin&#233;a ainsi r&#233;dig&#233;&#160;:</p><p style=\"text-align: justify;\">&#171;&#160;&#192; condition de souscrire un engagement de sapeur-pompier volontaire, les personnes volontaires effectuant un contrat de service civique r&#233;gi par le titre&#160;I<sup>er</sup>&#160;<i>bis</i> du livre&#160;I<sup>er</sup> du code du service national peuvent b&#233;n&#233;ficier de tout ou partie de la formation initiale mentionn&#233;e au premier alin&#233;a du pr&#233;sent article.&#160;&#187;</p>",
    "exposeSommaire": "<p style=\"text-align: justify;\">Le manque de Sapeurs-Pompiers Volontaires est aujourd&#8217;hui patent et compromet, &#224; terme, notre syst&#232;me de secours qui repose&#160;pour beaucoup sur le Volontariat.</p><p style=\"text-align: justify;\">Aussi, si la formation initiale est indispensable, ses contraintes en mati&#232;re de disponibilit&#233; peuvent parfois &#234;tre source de d&#233;couragement pour le candidat.</p><p style=\"text-align: justify;\">C&#8217;est pourquoi le pr&#233;sent amendement pr&#233;voit qu&#8217;un volontaire en Service civique aupr&#232;s d&#8217;un Centre d&#8217;Incendie et de Secours peut recevoir, simultan&#233;ment, la formation initiale permettant d&#8217;int&#233;grer le corps des Sapeurs-Pompiers Volontaires.</p>",
    "annexeExposeSommaire": {
      "@xmlns:xsi": "http://www.w3.org/2001/XMLSchema-instance",
      "@xsi:nil": "true"
    },
    "cartoucheDelaiDepotDepasse": {
      "@xmlns:xsi": "http://www.w3.org/2001/XMLSchema-instance",
      "@xsi:nil": "true"
    }
  },
  "representations": {
    "representation": {
      "nom": "PDF",
      "typeMime": {
        "type": "application",
        "subType": "PDF"
      },
      "statutRepresentation": {
        "verbatim": "true",
        "canonique": "true",
        "officielle": "true",
        "transcription": "false",
        "enregistrement": "false"
      },
      "repSource": {
        "@xmlns:xsi": "http://www.w3.org/2001/XMLSchema-instance",
        "@xsi:nil": "true"
      },
      "offset": {
        "@xmlns:xsi": "http://www.w3.org/2001/XMLSchema-instance",
        "@xsi:nil": "true"
      },
      "contenu": {
        "documentURI": "/15/amendements/1649/AN/31.pdf"
      },
      "dateDispoRepresentation": {
        "@xmlns:xsi": "http://www.w3.org/2001/XMLSchema-instance",
        "@xsi:nil": "true"
      }
    }
  },
  "seanceDiscussion": {
    "@xmlns:xsi": "http://www.w3.org/2001/XMLSchema-instance",
    "@xsi:nil": "true"
  },
  "sort": {
    "@xmlns:xsi": "http://www.w3.org/2001/XMLSchema-instance",
    "@xsi:nil": "true"
  },
  "dateDepot": "2019-03-31T01:00:00.000+01:00",
  "dateDistribution": "2019-04-02T02:00:00.000+02:00",
  "article99": "0",
  "loiReference": {
    "codeLoi": "CGCT",
    "divisionCodeLoi": "L1424-37"
  }
}