{
  "@xmlns": "http://schemas.assemblee-nationale.fr/referentiel",
  "uid": "AMANR5L15SEA717460B0911P0D1N441",
  "identifiant": {
    "legislature": "15",
    "numero": "441",
    "numRect": "0",
    "saisine": {
      "refTexteLegislatif": "PRJLANR5L15B0911",
      "numeroPartiePLF": "0",
      "organeExamen": "PO717460",
      "mentionSecondeDeliberation": "0"
    }
  },
  "numeroLong": "441",
  "etapeTexte": "1ère lecture (1ère assemblée saisie)",
  "triAmendement": "aqzzi",
  "cardinaliteAmdtMultiples": "1",
  "amendementParent": {
    "@xmlns:xsi": "http://www.w3.org/2001/XMLSchema-instance",
    "@xsi:nil": "true"
  },
  "etat": "A discuter",
  "signataires": {
    "auteur": {
      "typeAuteur": "Depute",
      "acteurRef": "PA721314",
      "organeRef": {
        "@xmlns:xsi": "http://www.w3.org/2001/XMLSchema-instance",
        "@xsi:nil": "true"
      },
      "groupePolitiqueRef": "PO730934"
    },
    "cosignataires": {
      "acteurRef": [
        "PA334654",
        "PA608016",
        "PA1874",
        "PA267429",
        "PA608416",
        "PA721314",
        "PA721506",
        "PA721636",
        "PA266774",
        "PA266776",
        "PA721054"
      ]
    },
    "texteAffichable": "M.&#160;Schellenberger,  M.&#160;Cinieri, M.&#160;Furst, M.&#160;Hetzel, Mme&#160;Kuster, M.&#160;Le Fur, M.&#160;Lorion, Mme&#160;Louwagie, M.&#160;Parigi, M.&#160;Reiss et M.&#160;Straumann"
  },
  "pointeurFragmentTexte": {
    "missionVisee": {
      "@xmlns:xsi": "http://www.w3.org/2001/XMLSchema-instance",
      "@xsi:nil": "true"
    },
    "division": {
      "titre": "Article 16",
      "articleDesignationCourte": "APRÈS ART. 16",
      "type": "ARTICLE",
      "avant_A_Apres": "Après",
      "divisionRattachee": "APRÈS L'ARTICLE 16, insérer l'article suivant:",
      "articleAdditionnel": "1",
      "chapitreAdditionnel": {
        "@xmlns:xsi": "http://www.w3.org/2001/XMLSchema-instance",
        "@xsi:nil": "true"
      },
      "urlDivisionTexteVise": "/15/textes/0911.asp#D_Article_16"
    },
    "alinea": {
      "@xmlns:xsi": "http://www.w3.org/2001/XMLSchema-instance",
      "@xsi:nil": "true"
    }
  },
  "corps": {
    "dispositif": "<p style=\"text-align: justify;\">Apr&#232;s l&#8217;article&#160;72&#8209;4 de la Constitution, il est ins&#233;r&#233; un article&#160;72-6 ainsi r&#233;dig&#233;&#160;:</p><p style=\"text-align: justify;\">&#171;&#160;<i>Art. 72-6.</i>&#160;&#8211;&#160;L&#8217;Alsace est une collectivit&#233; &#224; statut particulier au sens du premier alin&#233;a de l&#8217;article&#160;72.</p><p style=\"text-align: justify;\">&#171;&#160;Les lois et r&#232;glements peuvent comporter des r&#232;gles adapt&#233;es aux sp&#233;cificit&#233;s li&#233;es &#224; ses caract&#233;ristiques historiques, g&#233;ographiques, &#233;conomiques ou sociales.</p><p style=\"text-align: justify;\">&#171;&#160;Sauf lorsque sont en cause les conditions essentielles d&#8217;exercice d&#8217;une libert&#233; publique ou d&#8217;un droit constitutionnellement garanti, ces adaptations peuvent &#234;tre d&#233;cid&#233;es par la collectivit&#233; d&#8217;Alsace dans les mati&#232;res o&#249; s&#8217;exercent ses comp&#233;tences et si elle y a &#233;t&#233; habilit&#233;e, selon le cas, par la loi ou le r&#232;glement. Ces adaptations sont d&#233;cid&#233;es dans les conditions pr&#233;vues par la loi organique.&#160;&#187;</p>",
    "exposeSommaire": "<p style=\"text-align: justify;\">L&#8217;article&#160;16 du pr&#233;sent projet de loi constitutionnelle inscrit la Corse dans la Constitution, dans le respect du principe d&#8217;indivisibilit&#233; de la R&#233;publique.</p><p style=\"text-align: justify;\">Il est propos&#233; d&#8217;&#233;galement reconna&#238;tre l&#8217;Alsace, dans les m&#234;mes conditions, comme collectivit&#233; &#224; statut particulier au sens du premier alin&#233;a de l&#8217;article&#160;72.</p><p style=\"text-align: justify;\">Une telle mesure permettrait ainsi une reconnaissance constitutionnelle des sp&#233;cificit&#233;s de l&#8217;Alsace, r&#233;gion frontali&#232;re, profond&#233;ment inscrite en&#160;Europe, &#224; l&#8217;histoire et &#224; la culture singuli&#232;res, qui justifient pleinement l&#8217;exercice de comp&#233;tences propres &#224; l&#8217;&#233;chelle r&#233;gionale.</p><p style=\"text-align: justify;\">La r&#233;forme territoriale de 2015 et le red&#233;coupage hasardeux des r&#233;gions op&#233;r&#233; &#224; cette occasion par le Gouvernement continuent de susciter de vives pr&#233;occupations quant &#224; l&#8217;avenir de l&#8217;Alsace qui a perdu &#224; cette occasion toute existence institutionnelle.</p><p style=\"text-align: justify;\">Les engagements pris par le Pr&#233;sident de la R&#233;publique &#224; l&#8217;&#233;gard de la Corse ne peuvent rester sourds &#224; l&#8217;expression des Alsaciens, qui aspirent &#224; ce que leur r&#233;gion retrouve une incarnation. La pr&#233;sente r&#233;forme constitutionnelle nous offre l&#8217;occasion de r&#233;parer l&#8217;erreur historique commise en 2015.</p>",
    "annexeExposeSommaire": {
      "@xmlns:xsi": "http://www.w3.org/2001/XMLSchema-instance",
      "@xsi:nil": "true"
    }
  },
  "representations": {
    "representation": {
      "nom": "PDF",
      "typeMime": {
        "type": "application",
        "subType": "PDF"
      },
      "statutRepresentation": {
        "verbatim": "true",
        "canonique": "true",
        "officielle": "true",
        "transcription": "false",
        "enregistrement": "false"
      },
      "repSource": {
        "@xmlns:xsi": "http://www.w3.org/2001/XMLSchema-instance",
        "@xsi:nil": "true"
      },
      "offset": {
        "@xmlns:xsi": "http://www.w3.org/2001/XMLSchema-instance",
        "@xsi:nil": "true"
      },
      "contenu": {
        "documentURI": "/15/amendements/0911/AN/441.pdf"
      },
      "dateDispoRepresentation": {
        "@xmlns:xsi": "http://www.w3.org/2001/XMLSchema-instance",
        "@xsi:nil": "true"
      }
    }
  },
  "seanceDiscussion": {
    "@xmlns:xsi": "http://www.w3.org/2001/XMLSchema-instance",
    "@xsi:nil": "true"
  },
  "sort": {
    "@xmlns:xsi": "http://www.w3.org/2001/XMLSchema-instance",
    "@xsi:nil": "true"
  },
  "dateDepot": "2018-07-04T02:00:00.000+02:00",
  "dateDistribution": "2018-07-12T02:00:00.000+02:00",
  "article99": "0",
  "loiReference": {
    "codeLoi": "Constitution",
    "divisionCodeLoi": "72-4"
  }
}