{
  "@xmlns": "http://schemas.assemblee-nationale.fr/referentiel",
  "uid": "AMANR5L15PO420120B0269P0D1N8",
  "identifiant": {
    "legislature": "15",
    "numero": "8",
    "numRect": "0",
    "saisine": {
      "refTexteLegislatif": "PRJLANR5L15B0269",
      "numeroPartiePLF": "0",
      "organeExamen": "PO420120",
      "mentionSecondeDeliberation": "0"
    }
  },
  "numeroLong": "AS8",
  "etapeTexte": "1ère lecture (1ère assemblée saisie)",
  "triAmendement": "l",
  "cardinaliteAmdtMultiples": "1",
  "amendementParent": {
    "@xmlns:xsi": "http://www.w3.org/2001/XMLSchema-instance",
    "@xsi:nil": "true"
  },
  "etat": "Irrecevable",
  "signataires": {
    "auteur": {
      "typeAuteur": "Depute",
      "acteurRef": "PA267260",
      "organeRef": {
        "@xmlns:xsi": "http://www.w3.org/2001/XMLSchema-instance",
        "@xsi:nil": "true"
      },
      "groupePolitiqueRef": "PO730934"
    },
    "cosignataires": {
      "acteurRef": [
        "PA336316",
        "PA330684",
        "PA266797",
        "PA267318",
        "PA721314",
        "PA267450",
        "PA718850",
        "PA605991",
        "PA606712",
        "PA608416",
        "PA346218",
        "PA719318",
        "PA1874",
        "PA267735",
        "PA856",
        "PA718838",
        "PA643134",
        "PA267429",
        "PA718780",
        "PA608016",
        "PA718884",
        "PA266776",
        "PA2377",
        "PA609245",
        "PA267289",
        "PA342935",
        "PA719946",
        "PA721968",
        "PA267260",
        "PA266793",
        "PA2492",
        "PA767",
        "PA720386",
        "PA332523",
        "PA642847",
        "PA605036",
        "PA608826",
        "PA720586",
        "PA334654"
      ]
    },
    "texteAffichable": "Mme&#160;Poletti,  Mme&#160;Louwagie, M.&#160;Bony, M.&#160;de Ganay, Mme&#160;Valentin, M.&#160;Bazin, Mme&#160;Duby-Muller, M.&#160;Quentin, M.&#160;Masson, M.&#160;Le Fur, M.&#160;Brun, Mme&#160;Bazin-Malgras, M.&#160;Perrut, M.&#160;Vatin, M.&#160;Hetzel, M.&#160;Straumann, Mme&#160;Anthoine, M.&#160;Abad, M.&#160;Cattin, Mme&#160;Genevard, Mme&#160;Marianne&#160;Dubois, Mme&#160;Val&#233;rie&#160;Boyer, M.&#160;Cherpion, M.&#160;Vialay, M.&#160;Reiss, M.&#160;Bouchet, M.&#160;Cordier, M.&#160;Cinieri, Mme&#160;Lacroute, Mme&#160;Trastour-Isnart, M.&#160;Di Filippo, M.&#160;Schellenberger, M.&#160;Grelier, M.&#160;R&#233;mi&#160;Delatte, Mme&#160;Dalloz, M.&#160;Door, M.&#160;Lurton, M.&#160;Peltier et M.&#160;Gosselin"
  },
  "pointeurFragmentTexte": {
    "missionVisee": {
      "@xmlns:xsi": "http://www.w3.org/2001/XMLSchema-instance",
      "@xsi:nil": "true"
    },
    "division": {
      "titre": "Article 9",
      "articleDesignationCourte": "APRÈS ART. 9",
      "type": "ARTICLE",
      "avant_A_Apres": "Après",
      "divisionRattachee": "APRÈS L'ARTICLE 9, insérer l'article suivant:",
      "articleAdditionnel": "1",
      "chapitreAdditionnel": {
        "@xmlns:xsi": "http://www.w3.org/2001/XMLSchema-instance",
        "@xsi:nil": "true"
      },
      "urlDivisionTexteVise": "/15/textes/0269.asp#D_Article_9"
    },
    "alinea": {
      "@xmlns:xsi": "http://www.w3.org/2001/XMLSchema-instance",
      "@xsi:nil": "true"
    }
  },
  "corps": {
    "dispositif": "<p style=\"text-align: justify;\">Le Gouvernement remet au Parlement, au plus tard six mois apr&#232;s la promulgation de la pr&#233;sente loi, un rapport sur la possibilit&#233; de mettre en place un arbitrage gouvernemental pour l&#8217;inclusion dans le zonage dit &#171;&#160;ZRR&#160;&#187; (zones de revitalisation rurale) pour les communes et &#233;tablissements publics de coop&#233;ration intercommunale &#224; fiscalit&#233; propre se situant dans la fourchette basse ou haute de maximum 1&#160;% autour des deux crit&#232;res pr&#233;d&#233;finis pour la qualification des ZRR.</p>",
    "exposeSommaire": "<p style=\"text-align: justify;\">L&#8217;article&#160;45 de la loi n&#176; 2015&#8209;1786 du 29 d&#233;cembre 2015 de finances rectificative pour 2015 a modifi&#233; la d&#233;finition du zonage de revitalisation rurale, en retenant une entr&#233;e intercommunale bas&#233;e sur deux crit&#232;res cumulatifs&#160;: la densit&#233; d&#233;mographique de l&#8217;EPCI et la richesse des habitants. Pour &#234;tre class&#233; en ZRR au 1<sup>er</sup> juillet 2017, l&#8217;EPCI doit avoir &#224; la fois une densit&#233; de population inf&#233;rieure ou &#233;gale &#224; 63 hab/km2 et un revenu fiscal par unit&#233; de consommation m&#233;dian inf&#233;rieur ou &#233;gal &#224; 19 111&#160;&#8364;. Ces deux crit&#232;res sont bas&#233;s sur les chiffres &#233;tablis par l&#8217;Institut national de la statistique et des &#233;tudes &#233;conomiques &#224; partir des donn&#233;es disponibles au 1<sup>er</sup> janvier de l&#8217;ann&#233;e de classement.</p><p style=\"text-align: justify;\">La r&#233;forme du zonage est en vigueur depuis le 1er juillet 2017.</p><p style=\"text-align: justify;\">Pour rappel, le dispositif des zones de revitalisation rurale (ZRR) a &#233;t&#233; cr&#233;&#233; dans l&#8217;objectif de compenser les difficult&#233;s particuli&#232;res que rencontrent certains espaces ruraux en mati&#232;re d&#8217;attractivit&#233; d&#233;mographique et &#233;conomique. Ce classement ouvre droit &#224; un ensemble d&#8217;avantages, dont des exon&#233;rations fiscales et sociales accord&#233;es aux entreprises qui s&#8217;installent ou d&#233;veloppent leur activit&#233;.</p><p style=\"text-align: justify;\">Aujourd&#8217;hui, les cons&#233;quences de cette r&#233;forme pour les territoires se pr&#233;cisent, et les &#233;lus locaux connaissent sur le territoire des situations dramatiques, avec des communes exclues soudainement du dispositif. C&#8217;est par exemple le cas dans les Ardennes, dans le Pays Reth&#233;lois, en raison d&#8217;un effet de seuil qui p&#233;nalise le territoire pour quelques&#160;euros&#160;: le revenu m&#233;dian pris en consid&#233;ration est sup&#233;rieur de seulement 0,05&#160;% au seuil limite fix&#233; par la r&#233;forme des ZRR. Cette exclusion soudaine du dispositif entraine m&#233;caniquement une r&#233;duction des d&#233;penses fiscales fl&#233;ch&#233;es vers l&#8217;am&#233;nagement du territoire, et donc porte atteinte &#224; la facult&#233; des collectivit&#233;s concern&#233;es &#224; maintenir leur attractivit&#233; &#233;conomique. Cette fin brutale du dispositif cr&#233;e un manque &#224; gagner consid&#233;rable.</p><p style=\"text-align: justify;\">Cette d&#233;cision impos&#233;e est injuste et tr&#232;s pr&#233;judiciable pour nos territoires, quand certains s&#8217;en retrouvent exclus &#224; cause d&#8217;un &#233;cart minime avec les nouveaux crit&#232;res&#160;: cela d&#233;courage l&#8217;investissement dans nos campagnes&#160;; emp&#234;che le d&#233;veloppement &#233;conomique des communes et centres-bourgs&#160;; et vient mettre un coup d&#8217;arr&#234;t aux ambitions de d&#233;veloppement rural, en p&#233;riph&#233;rie des grandes villes.</p><p style=\"text-align: justify;\">Cette nouvelle application du dispositif ZRR vient aggraver la crise de la ruralit&#233; sans pr&#233;c&#233;dent que connait d&#233;j&#224; la France depuis plusieurs ann&#233;es&#160;: alors que 21&#160;millions de Fran&#231;ais vivent sur nos territoires ruraux, soit 80&#160;% de notre territoire, ils sont pourtant souvent laiss&#233;s &#224; l&#8217;abandon, manquent d&#8217;aides et de soutiens. Le sentiment d&#8217;exasp&#233;ration exprim&#233; par les maires ruraux, les acteurs socio-&#233;conomiques et toute la population est &#224; son paroxysme, avec les baisses de dotations impos&#233;es depuis quatre&#160;ans, l&#8217;augmentation des charges, l&#8217;affaiblissement des aides &#233;conomiques, le poids croissant de normes, et le manque &#224; gagner de la suppression de la taxe d&#8217;habitation &#224; venir.</p><p style=\"text-align: justify;\">Aussi, cet amendement vise &#224; ce que le Gouvernement remette au Parlement un rapport sur la possibilit&#233; de mettre en place un arbitrage gouvernemental pour d&#233;cider de l&#8217;inclusion ou de l&#8217;exclusion dans le zonage ZRR des communes et &#233;tablissements publics de coop&#233;ration intercommunale &#224; fiscalit&#233; propre se situant dans la fourchette basse ou haute de maximum 1&#160;% autour des deux crit&#232;res pr&#233;d&#233;finis pour la qualification de ces zones. Cet amendement vise &#224; trouver une solution pour &#233;viter des effets de seuils p&#233;nalisants pour nos territoires, qui ne peuvent pas tous b&#233;n&#233;ficier de compensations.</p>",
    "annexeExposeSommaire": {
      "@xmlns:xsi": "http://www.w3.org/2001/XMLSchema-instance",
      "@xsi:nil": "true"
    }
  },
  "representations": {
    "representation": {
      "nom": "PDF",
      "typeMime": {
        "type": "application",
        "subType": "PDF"
      },
      "statutRepresentation": {
        "verbatim": "true",
        "canonique": "true",
        "officielle": "true",
        "transcription": "false",
        "enregistrement": "false"
      },
      "repSource": {
        "@xmlns:xsi": "http://www.w3.org/2001/XMLSchema-instance",
        "@xsi:nil": "true"
      },
      "offset": {
        "@xmlns:xsi": "http://www.w3.org/2001/XMLSchema-instance",
        "@xsi:nil": "true"
      },
      "contenu": {
        "documentURI": "/15/amendements/0269/CION-SOC/AS8.pdf"
      },
      "dateDispoRepresentation": {
        "@xmlns:xsi": "http://www.w3.org/2001/XMLSchema-instance",
        "@xsi:nil": "true"
      }
    }
  },
  "seanceDiscussion": {
    "@xmlns:xsi": "http://www.w3.org/2001/XMLSchema-instance",
    "@xsi:nil": "true"
  },
  "sort": {
    "@xmlns:xsi": "http://www.w3.org/2001/XMLSchema-instance",
    "@xsi:nil": "true"
  },
  "dateDepot": "2017-10-12T02:00:00.000+02:00",
  "dateDistribution": {
    "@xmlns:xsi": "http://www.w3.org/2001/XMLSchema-instance",
    "@xsi:nil": "true"
  },
  "article99": "0",
  "loiReference": {
    "codeLoi": "zzz",
    "divisionCodeLoi": {
      "@xmlns:xsi": "http://www.w3.org/2001/XMLSchema-instance",
      "@xsi:nil": "true"
    }
  }
}