{
  "@xmlns": "http://schemas.assemblee-nationale.fr/referentiel",
  "uid": "AMANR5L15SEA717460BTC2243P0D1N194",
  "identifiant": {
    "legislature": "15",
    "numero": "194",
    "numRect": "1",
    "saisine": {
      "refTexteLegislatif": "PRJLANR5L15BTC2243",
      "numeroPartiePLF": "0",
      "organeExamen": "PO717460",
      "mentionSecondeDeliberation": "0"
    }
  },
  "numeroLong": "194 (Rect)",
  "etapeTexte": "1ère lecture (1ère assemblée saisie)",
  "triAmendement": "awaaaaaaaaaaaaaaaaaaaaaaaaaaaaaaaaaaaaaaaaaaaaaaaaadvi",
  "cardinaliteAmdtMultiples": "1",
  "amendementParent": {
    "@xmlns:xsi": "http://www.w3.org/2001/XMLSchema-instance",
    "@xsi:nil": "true"
  },
  "etat": "Discuté",
  "signataires": {
    "auteur": {
      "typeAuteur": "Depute",
      "acteurRef": "PA605991",
      "organeRef": {
        "@xmlns:xsi": "http://www.w3.org/2001/XMLSchema-instance",
        "@xsi:nil": "true"
      },
      "groupePolitiqueRef": "PO730934"
    },
    "cosignataires": {
      "acteurRef": [
        "PA709315",
        "PA2492",
        "PA719318",
        "PA608416",
        "PA267204",
        "PA1012",
        "PA722390",
        "PA266776",
        "PA332523",
        "PA330684",
        "PA605991",
        "PA345722",
        "PA642847",
        "PA1874",
        "PA767",
        "PA721286",
        "PA334654",
        "PA267429",
        "PA606712",
        "PA267289"
      ]
    },
    "texteAffichable": "Mme&#160;Genevard,  M.&#160;Straumann, Mme&#160;Corneloup, M.&#160;Bazin, M.&#160;Cattin, Mme&#160;Anthoine, M.&#160;Reiss, M.&#160;de la Verpilli&#232;re, M.&#160;Ramadier, M.&#160;Hetzel, M.&#160;Cinieri, M.&#160;Viala, Mme&#160;Le Grip, Mme&#160;Val&#233;rie&#160;Boyer, M.&#160;Quentin, M.&#160;Door, M.&#160;Sermier, Mme&#160;Dalloz, M.&#160;Le Fur et M.&#160;Lurton"
  },
  "pointeurFragmentTexte": {
    "missionVisee": {
      "@xmlns:xsi": "http://www.w3.org/2001/XMLSchema-instance",
      "@xsi:nil": "true"
    },
    "division": {
      "titre": "Article 4",
      "articleDesignationCourte": "APRÈS ART. 4",
      "type": "ARTICLE",
      "avant_A_Apres": "Après",
      "divisionRattachee": "APRÈS L'ARTICLE 4, insérer l'article suivant:",
      "articleAdditionnel": "1",
      "chapitreAdditionnel": {
        "@xmlns:xsi": "http://www.w3.org/2001/XMLSchema-instance",
        "@xsi:nil": "true"
      },
      "urlDivisionTexteVise": "/15/textes/2243.asp#D_Article_4"
    },
    "alinea": {
      "@xmlns:xsi": "http://www.w3.org/2001/XMLSchema-instance",
      "@xsi:nil": "true"
    }
  },
  "corps": {
    "dispositif": "<p style=\"text-align: justify;\">La derni&#232;re phrase du sixi&#232;me alin&#233;a de l&#8217;article&#160;16&#8209;11 du code civil est ainsi r&#233;dig&#233;e&#160;: &#171;&#160;Sauf opposition de la personne manifest&#233;e de son vivant par tout moyen, l&#8217;identification par empreintes g&#233;n&#233;tiques peut &#234;tre r&#233;alis&#233;e apr&#232;s sa mort.&#160;&#187;</p>",
    "exposeSommaire": "<p style=\"text-align: justify;\">Depuis la loi du 6 ao&#251;t 2004, le d&#233;c&#232;s d&#8217;un homme fait obstacle &#224; la r&#233;alisation d&#8217;une identification post mortem aux fins d&#8217;&#233;tablissement du lien de filiation &#224; l&#8217;&#233;gard de l&#8217;enfant pr&#233;tendant &#234;tre le fruit de ses &#339;uvres. Cette disposition est la cons&#233;quence de l&#8217;affaire &#171;&#160;Montand&#160;&#187;[1]. Cependant le projet de loi d&#233;pos&#233; en premi&#232;re lecture &#224; l&#8217;assembl&#233;e nationale pr&#233;voyait de permettre l&#8217;identification g&#233;n&#233;tique post mortem d&#232;s lors que le d&#233;funt ne l&#8217;avait pas express&#233;ment refus&#233;e de son vivant[2]. Ces dispositions semblent toutefois contraires &#224; la jurisprudence de la Cour europ&#233;enne des droits de l&#8217;homme qui consid&#232;re que le droit &#224; la connaissance des origines est prot&#233;g&#233; au titre de l&#8217;article&#160;8 de la Convention et que l&#8217;interdiction de l&#8217;expertise g&#233;n&#233;tique post mortem viole ces dispositions[3]. Le pr&#233;sent amendement vise donc &#224; r&#233;&#233;quilibrer les int&#233;r&#234;ts de chacun des protagonistes en renversant la r&#232;gle. Le d&#233;funt sera pr&#233;sum&#233; avoir consenti &#224; l&#8217;expertise post mortem sauf opposition de sa part. Il s&#8217;agit du m&#234;me m&#233;canisme qu&#8217;en mati&#232;re de pr&#233;l&#232;vements d&#8217;organes.</p><p style=\"text-align: justify;\">Cet amendement vise &#224; rendre possible l&#8217;identification g&#233;n&#233;tique post mortem dans le cadre d&#8217;une action relative &#224; la filiation pour r&#233;tablir la conformit&#233; du droit fran&#231;ais &#224; la jurisprudence de la Cour europ&#233;enne des droits de l&#8217;homme.</p><p style=\"text-align: justify;\"><br />[1] Paris, 6&#160;nov. 1997, D.&#160;1998, jurisp., p.&#160;106, note B.&#160;Beignier&#160;; P.&#160;Catala, &#171;&#160;La jeune fille et le mort&#160;&#187;, Dr.&#160;famille 1997, chron. 12.<br />[2] Doc.&#160;AN&#160;2000&#8209;2001, n&#176;&#160;3166, art.&#160;3.<br />[3] CEDH, 13&#160;juillet 2006, J&#228;ggi c/Suisse, no&#160;58757/00&#160;; CEDH, 15&#160;mai 2006, no&#160;1338/03, Succession de K.-F. Mortensen c/Danemark&#160;; CEDH, 16&#160;juin 2011, n&#176;&#160;19535/08, Pascaud c/&#160;France.</p>",
    "annexeExposeSommaire": {
      "@xmlns:xsi": "http://www.w3.org/2001/XMLSchema-instance",
      "@xsi:nil": "true"
    },
    "cartoucheDelaiDepotDepasse": {
      "@xmlns:xsi": "http://www.w3.org/2001/XMLSchema-instance",
      "@xsi:nil": "true"
    },
    "avantAppel": {
      "@xmlns:xsi": "http://www.w3.org/2001/XMLSchema-instance",
      "@xsi:nil": "true"
    }
  },
  "representations": {
    "representation": {
      "nom": "PDF",
      "typeMime": {
        "type": "application",
        "subType": "PDF"
      },
      "statutRepresentation": {
        "verbatim": "true",
        "canonique": "true",
        "officielle": "true",
        "transcription": "false",
        "enregistrement": "false"
      },
      "repSource": {
        "@xmlns:xsi": "http://www.w3.org/2001/XMLSchema-instance",
        "@xsi:nil": "true"
      },
      "offset": {
        "@xmlns:xsi": "http://www.w3.org/2001/XMLSchema-instance",
        "@xsi:nil": "true"
      },
      "contenu": {
        "documentURI": "/15/amendements/2243/AN/194.pdf"
      },
      "dateDispoRepresentation": {
        "@xmlns:xsi": "http://www.w3.org/2001/XMLSchema-instance",
        "@xsi:nil": "true"
      }
    }
  },
  "seanceDiscussion": "RUANR5L15S2020IDS21846",
  "sort": {
    "dateSaisie": "2019-10-03T21:35:28.000+02:00",
    "sortEnSeance": "Rejeté"
  },
  "dateDepot": "2019-09-16T02:00:00.000+02:00",
  "dateDistribution": "2019-09-27T02:00:00.000+02:00",
  "article99": "0",
  "loiReference": {
    "codeLoi": "c civil",
    "divisionCodeLoi": "16-11"
  }
}