{
  "@xmlns": "http://schemas.assemblee-nationale.fr/referentiel",
  "uid": "AMANR5L15SEA717460BTC1237P0D1N94",
  "identifiant": {
    "legislature": "15",
    "numero": "94",
    "numRect": "0",
    "saisine": {
      "refTexteLegislatif": "PRJLANR5L15BTC1237",
      "numeroPartiePLF": "0",
      "organeExamen": "PO717460",
      "mentionSecondeDeliberation": "0"
    }
  },
  "numeroLong": "94",
  "etapeTexte": "1ère lecture (1ère assemblée saisie)",
  "triAmendement": "amaaaaaaaaaaaaaaaaaaaaaaaaaaaaaaaaaaaaaaaaaaaaaaaaafkki",
  "cardinaliteAmdtMultiples": "1",
  "amendementParent": {
    "@xmlns:xsi": "http://www.w3.org/2001/XMLSchema-instance",
    "@xsi:nil": "true"
  },
  "etat": "Discuté",
  "signataires": {
    "auteur": {
      "typeAuteur": "Depute",
      "acteurRef": "PA332523",
      "organeRef": {
        "@xmlns:xsi": "http://www.w3.org/2001/XMLSchema-instance",
        "@xsi:nil": "true"
      },
      "groupePolitiqueRef": "PO730934"
    },
    "cosignataires": {
      "acteurRef": [
        "PA608016",
        "PA609245",
        "PA719318",
        "PA266793",
        "PA346054",
        "PA267378",
        "PA2492",
        "PA332523",
        "PA346218",
        "PA609726",
        "PA718884",
        "PA643134",
        "PA720684",
        "PA334654"
      ]
    },
    "texteAffichable": "Mme&#160;Dalloz,  M.&#160;Quentin, M.&#160;Pierre-Henri&#160;Dumont, M.&#160;Straumann, M.&#160;Bony, Mme&#160;Levy, Mme&#160;Anthoine, Mme&#160;Bazin-Malgras, M.&#160;Masson, M.&#160;Aubert, Mme&#160;Louwagie, M.&#160;Emmanuel&#160;Maquet, Mme&#160;Valentin et Mme&#160;Lacroute"
  },
  "pointeurFragmentTexte": {
    "missionVisee": {
      "@xmlns:xsi": "http://www.w3.org/2001/XMLSchema-instance",
      "@xsi:nil": "true"
    },
    "division": {
      "titre": "Article 9",
      "articleDesignationCourte": "APRÈS ART. 9",
      "type": "ARTICLE",
      "avant_A_Apres": "Après",
      "divisionRattachee": "APRÈS L'ARTICLE 9, insérer l'article suivant:",
      "articleAdditionnel": "1",
      "chapitreAdditionnel": {
        "@xmlns:xsi": "http://www.w3.org/2001/XMLSchema-instance",
        "@xsi:nil": "true"
      },
      "urlDivisionTexteVise": "/15/textes/1237.asp#D_Article_9"
    },
    "alinea": {
      "@xmlns:xsi": "http://www.w3.org/2001/XMLSchema-instance",
      "@xsi:nil": "true"
    }
  },
  "corps": {
    "dispositif": "<p style=\"text-align: justify;\">Le code de commerce est ainsi modifi&#233;&#160;:</p><p style=\"text-align: justify;\">1&#176; Les articles L.&#160;241&#8209;9, L.&#160;244&#8209;4, L.&#160;246&#8209;2 et le 2&#176; de l&#8217;article L.&#160;654&#8209;1 sont compl&#233;t&#233;s par une phrase ainsi r&#233;dig&#233;e&#160;:</p><p style=\"text-align: justify;\">&#171;&#160;Cette condition est pr&#233;sum&#233;e remplie vis-&#224;-vis de la ou des soci&#233;t&#233;s contr&#244;lantes au sens de l&#8217;article L.&#160;233&#8209;3 ainsi que de leurs mandataires sociaux et b&#233;n&#233;ficiaires effectifs, au sens de la loi n&#176;&#160;2016&#8209;1691 relative &#224; la transparence, &#224; la lutte contre la corruption et &#224; la modernisation de la vie &#233;conomique, lorsqu&#8217;aucun commissaire aux comptes n&#8217;a &#233;t&#233; en fonction dans la soci&#233;t&#233; contr&#244;l&#233;e pendant les vingt-quatre mois pr&#233;c&#233;dant l&#8217;infraction.&#160;&#187;</p><p style=\"text-align: justify;\">2&#176; L&#8217;article L.&#160;651&#8209;1 est compl&#233;t&#233; par une phrase ainsi r&#233;dig&#233;e&#160;:</p><p style=\"text-align: justify;\">&#171;&#160;Elles s&#8217;appliquent &#233;galement &#224; la ou aux soci&#233;t&#233;s contr&#244;lantes de ces personnes au sens de l&#8217;article L.&#160;233&#8209;3 ainsi qu&#8217;&#224; leurs mandataires sociaux et b&#233;n&#233;ficiaires effectifs, lorsqu&#8217;aucun commissaire aux comptes n&#8217;a &#233;t&#233; en fonction dans la soci&#233;t&#233; contr&#244;l&#233;e pendant les vingt-quatre mois pr&#233;c&#233;dant l&#8217;ouverture de la proc&#233;dure collective.&#160;&#187;</p><p style=\"text-align: justify;\">3&#176; L&#8217;article L.&#160;651&#8209;2 est compl&#233;t&#233; par un alin&#233;a ainsi r&#233;dig&#233;&#160;:</p><p style=\"text-align: justify;\">&#171;&#160;Lorsque la liquidation judiciaire d&#8217;une personne morale dans laquelle aucun commissaire aux comptes n&#8217;&#233;tait en fonction pendant les vingt-quatre mois pr&#233;c&#233;dents fait appara&#238;tre une insuffisance d&#8217;actif, le tribunal peut d&#233;cider que le montant de cette insuffisance d&#8217;actif est support&#233;, en tout ou en partie, par tous les dirigeants de droit ou de fait, ou par certains d&#8217;entre eux. En cas de pluralit&#233; de dirigeants, le tribunal peut, par d&#233;cision motiv&#233;e, les d&#233;clarer solidairement responsables.&#160;&#187;</p>",
    "exposeSommaire": "<p style=\"text-align: justify;\">Il s&#8217;av&#232;re n&#233;cessaire de renforcer la responsabilit&#233; des soci&#233;t&#233;s-m&#232;res de groupes de soci&#233;t&#233;s, ainsi que de leurs dirigeants et b&#233;n&#233;ficiaires effectifs, vis-&#224;-vis des faits dommageables commis dans les filiales, ou en termes de continuit&#233; d&#8217;exploitation desdites filiales, de fa&#231;on &#224; assurer les salari&#233;s et fournisseurs de la p&#233;rennit&#233; de leurs relations.</p><p style=\"text-align: justify;\">Cette responsabilisation se substitue &#224; la responsabilit&#233; civile et p&#233;nale du commissaire aux comptes dans les Groupes qui souhaiteraient se dispenser de faire auditer les comptes de filiales en dessous des seuils.</p><p style=\"text-align: justify;\">Tel est l&#8217;objet du pr&#233;sent amendement.</p>",
    "annexeExposeSommaire": {
      "@xmlns:xsi": "http://www.w3.org/2001/XMLSchema-instance",
      "@xsi:nil": "true"
    }
  },
  "representations": {
    "representation": {
      "nom": "PDF",
      "typeMime": {
        "type": "application",
        "subType": "PDF"
      },
      "statutRepresentation": {
        "verbatim": "true",
        "canonique": "true",
        "officielle": "true",
        "transcription": "false",
        "enregistrement": "false"
      },
      "repSource": {
        "@xmlns:xsi": "http://www.w3.org/2001/XMLSchema-instance",
        "@xsi:nil": "true"
      },
      "offset": {
        "@xmlns:xsi": "http://www.w3.org/2001/XMLSchema-instance",
        "@xsi:nil": "true"
      },
      "contenu": {
        "documentURI": "/15/amendements/1237/AN/94.pdf"
      },
      "dateDispoRepresentation": {
        "@xmlns:xsi": "http://www.w3.org/2001/XMLSchema-instance",
        "@xsi:nil": "true"
      }
    }
  },
  "seanceDiscussion": "RUANR5L15S2018IDS21251",
  "sort": {
    "dateSaisie": "2018-09-27T17:59:40.000+02:00",
    "sortEnSeance": "Non soutenu"
  },
  "dateDepot": "2018-09-19T02:00:00.000+02:00",
  "dateDistribution": "2018-09-24T02:00:00.000+02:00",
  "article99": "0",
  "loiReference": {
    "codeLoi": "c commerce",
    "divisionCodeLoi": "L241-9"
  }
}