{
  "@xmlns": "http://schemas.assemblee-nationale.fr/referentiel",
  "uid": "AMANR5L15SEA717460B0911P0D1N2201",
  "identifiant": {
    "legislature": "15",
    "numero": "2201",
    "numRect": "0",
    "saisine": {
      "refTexteLegislatif": "PRJLANR5L15B0911",
      "numeroPartiePLF": "0",
      "organeExamen": "PO717460",
      "mentionSecondeDeliberation": "0"
    }
  },
  "numeroLong": "2201",
  "etapeTexte": "1ère lecture (1ère assemblée saisie)",
  "triAmendement": "abzzhzzvzvzdzzzzi",
  "cardinaliteAmdtMultiples": "1",
  "amendementParent": {
    "@xmlns:xsi": "http://www.w3.org/2001/XMLSchema-instance",
    "@xsi:nil": "true"
  },
  "etat": "Discuté",
  "signataires": {
    "auteur": {
      "typeAuteur": "Depute",
      "acteurRef": "PA721062",
      "organeRef": {
        "@xmlns:xsi": "http://www.w3.org/2001/XMLSchema-instance",
        "@xsi:nil": "true"
      },
      "groupePolitiqueRef": "PO730958"
    },
    "cosignataires": {
      "acteurRef": [
        "PA721226",
        "PA2150",
        "PA719676",
        "PA718868",
        "PA720892",
        "PA722142",
        "PA721062",
        "PA721210",
        "PA720422",
        "PA720846",
        "PA588884",
        "PA720430",
        "PA718860",
        "PA721202",
        "PA721960",
        "PA720286",
        "PA719578"
      ]
    },
    "texteAffichable": "M.&#160;Ratenon,  Mme&#160;Autain, M.&#160;Bernalicis, M.&#160;Coquerel, M.&#160;Corbi&#232;re, Mme&#160;Fiat, M.&#160;Lachaud, M.&#160;Larive, M.&#160;M&#233;lenchon, Mme&#160;Obono, Mme&#160;Panot, M.&#160;Prud&apos;homme, M.&#160;Quatennens, Mme&#160;Ressiguier, Mme&#160;Rubin, M.&#160;Ruffin et Mme&#160;Taurine"
  },
  "pointeurFragmentTexte": {
    "missionVisee": {
      "@xmlns:xsi": "http://www.w3.org/2001/XMLSchema-instance",
      "@xsi:nil": "true"
    },
    "division": {
      "titre": "Article PREMIER",
      "articleDesignationCourte": "AVANT ART. PREMIER",
      "type": "ARTICLE",
      "avant_A_Apres": "Avant",
      "divisionRattachee": "AVANT L'ARTICLE PREMIER, insérer l'article suivant:",
      "articleAdditionnel": "1",
      "chapitreAdditionnel": {
        "@xmlns:xsi": "http://www.w3.org/2001/XMLSchema-instance",
        "@xsi:nil": "true"
      },
      "urlDivisionTexteVise": "/15/textes/0911.asp#D_Article_1er"
    },
    "alinea": {
      "@xmlns:xsi": "http://www.w3.org/2001/XMLSchema-instance",
      "@xsi:nil": "true"
    }
  },
  "corps": {
    "dispositif": "<p style=\"text-align: justify;\">&#192; la deuxi&#232;me phrase du premier alin&#233;a de l&#8217;article&#160;1<sup>er</sup> de la Constitution, apr&#232;s la deuxi&#232;me occurrence du mot&#160;: &#171;&#160;de&#160;&#187; est ins&#233;r&#233; le mot&#160;: &#171;&#160;pr&#233;tendue&#160;&#187;.</p>",
    "exposeSommaire": "<p style=\"text-align: justify;\">Il est important de rappeler symboliquement et intellectuellement, par tous les moyens possibles, qu&#8217;il n&#8217;existe pas de races biologiques entre les &#234;tres humains. Cet engagement qui prend au cours de cette mandature celle de la suppression de la notion de race de la Constitution doit cependant ne pas aboutir &#224; une perte de garantie constitutionnelle.</p><p style=\"text-align: justify;\">Or l&#8217;entr&#233;e dans le paysage constitutionnel fran&#231;ais de la notion de race,&#160;au sortir de la seconde guerre mondiale, marque l&#8217;engagement r&#233;publicain &#224; lutter contre les id&#233;ologies et les politiques racialistes et racistes. L&#8217;entr&#233;e de cette notion dans la Constitution en 1958 est de nouveau une distanciation des th&#232;ses proposant de s&#233;parer les humains en diff&#233;rentes races biologiques afin de justifier une certaine organisation de l&#8217;espace politique et public.&#160;</p><p style=\"text-align: justify;\">C&#8217;est sur cet article&#160;1, et sur cet article&#160;1 uniquement qu&#8217;est garanti au niveau la protection contre les discriminations raciales, discrimination interdite assurant, si celle-ci est av&#233;r&#233;e, une inconstitutionnalit&#233; automatique de la Constitution.</p><p style=\"text-align: justify;\">L&#8217;alin&#233;a&#160;1 du Pr&#233;ambule du 27 Octobre 1946&#160;ne garantit en aucun cas un principe d&#8217;&#233;galit&#233; mais fonde, dans la jurisprudence du Conseil Constitutionnel, le principe de dignit&#233; humaine qui sanctionne les traitements inhumains et d&#233;gradants.</p><p style=\"text-align: justify;\">Le rapport du 24 avril 2013 n&#176;989 du d&#233;put&#233; Alfred Marie-Jeanne consid&#232;re d&#8217;ailleurs que le maintien de la notion de race dans le Pr&#233;ambule de 1946 ne pose aucun probl&#232;me puisqu&#8217;il ne serait maintenue que comme &#8220;vestige historique&#8221;. Il n&#8217;y attache aucune valeur normative.</p><p style=\"text-align: justify;\">Il ne s&#8217;agit pas du m&#234;me type de protection constitutionnelle. Du point de vue symbolique, s&#8217;il y a une indignit&#233; &#224; traiter de mani&#232;re diff&#233;rente des &#234;tres humains du fait de la croyance- avou&#233;e ou inavou&#233;e, explicite ou implicite- &#224; une hi&#233;rarchie entre les races, c&#8217;est pour la seule et unique raison que&#160;cette hi&#233;rarchie est condamnable en soi et que nous savons que tout &#234;tre humain en vaut un autre. L&#8217;indignit&#233; d&#233;coule de l&#8217;&#233;galit&#233; entre les &#234;tres humains, non l&#8217;inverse.</p><p style=\"text-align: justify;\">Du point de vue juridique, uniquement rattacher au principe de dignit&#233; de la personne humaine, le Conseil Constitutionnel ne serait amen&#233; &#224; contr&#244;ler que la question du type de traitement que cette discrimination engendre et non &#224; examiner uniquement s&#8217;il y a traitement discriminant.</p><p style=\"text-align: justify;\">Lorsque le Conseil Constitutionnel contr&#244;le aujourd&#8217;hui une disposition l&#233;gislative au regard du principe de l&#8217;&#233;galit&#233; entre les hommes et les femmes, il utilise d&#8217;ailleurs comme norme de r&#233;f&#233;rence non pas l&#8217;alin&#233;a&#160;1 du Pr&#233;ambule de 1946 mais l&#8217;alin&#233;a&#160;3 du Pr&#233;ambule de 1946 proclamant l&#8217;&#233;galit&#233; Femme-Homme en conjonction avec l&#8217;article&#160;1 de la D&#233;claration des droits de l&#8217;Homme et du Citoyen.</p><p style=\"text-align: justify;\">Ainsi supprimer la notion de race de la Constitution sans rien lui substituer c&#8217;est rabaisser la garantie constitutionnelle effective en mati&#232;re de discrimination raciale.</p><p style=\"text-align: justify;\">Afin de ne pas, pour symboliquement marquer notre antiracisme, abaisser les moyens juridique de la lutte contre le racisme, nous proposons par cet amendement de reprendre la formulation adopt&#233;e par le Code P&#233;nal fran&#231;ais.</p><p style=\"text-align: justify;\">Cette nomination marque avec pr&#233;cision et sans ambigu&#239;t&#233; l&#8217;aspect erron&#233; des th&#233;ories racialistes, tout en maintenant une protection contre les discriminations qui sont le r&#233;sultat de cette histoire douloureuse et violente.</p>",
    "annexeExposeSommaire": {
      "@xmlns:xsi": "http://www.w3.org/2001/XMLSchema-instance",
      "@xsi:nil": "true"
    }
  },
  "representations": {
    "representation": {
      "nom": "PDF",
      "typeMime": {
        "type": "application",
        "subType": "PDF"
      },
      "statutRepresentation": {
        "verbatim": "true",
        "canonique": "true",
        "officielle": "true",
        "transcription": "false",
        "enregistrement": "false"
      },
      "repSource": {
        "@xmlns:xsi": "http://www.w3.org/2001/XMLSchema-instance",
        "@xsi:nil": "true"
      },
      "offset": {
        "@xmlns:xsi": "http://www.w3.org/2001/XMLSchema-instance",
        "@xsi:nil": "true"
      },
      "contenu": {
        "documentURI": "/15/amendements/0911/AN/2201.pdf"
      },
      "dateDispoRepresentation": {
        "@xmlns:xsi": "http://www.w3.org/2001/XMLSchema-instance",
        "@xsi:nil": "true"
      }
    }
  },
  "seanceDiscussion": "RUANR5L15S2018IDS21163",
  "sort": {
    "dateSaisie": "2018-07-12T18:14:37.000+02:00",
    "sortEnSeance": "Tombé"
  },
  "dateDepot": "2018-07-06T02:00:00.000+02:00",
  "dateDistribution": "2018-07-08T02:00:00.000+02:00",
  "article99": "0",
  "loiReference": {
    "codeLoi": "Constitution",
    "divisionCodeLoi": "1"
  }
}