{
  "@xmlns": "http://schemas.assemblee-nationale.fr/referentiel",
  "uid": "AMANR5L15PO419865B0370P0D1N17",
  "identifiant": {
    "legislature": "15",
    "numero": "17",
    "numRect": "0",
    "saisine": {
      "refTexteLegislatif": "PRJLANR5L15B0370",
      "numeroPartiePLF": "0",
      "organeExamen": "PO419865",
      "mentionSecondeDeliberation": "0"
    }
  },
  "numeroLong": "CD17",
  "etapeTexte": "Nouvelle Lecture",
  "triAmendement": "zdq",
  "cardinaliteAmdtMultiples": "1",
  "amendementParent": {
    "@xmlns:xsi": "http://www.w3.org/2001/XMLSchema-instance",
    "@xsi:nil": "true"
  },
  "etat": "Discuté",
  "signataires": {
    "auteur": {
      "typeAuteur": "Depute",
      "acteurRef": "PA335999",
      "organeRef": {
        "@xmlns:xsi": "http://www.w3.org/2001/XMLSchema-instance",
        "@xsi:nil": "true"
      },
      "groupePolitiqueRef": "PO730946"
    },
    "cosignataires": {
      "acteurRef": [
        "PA588886",
        "PA340343",
        "PA267233",
        "PA335999",
        "PA333285"
      ]
    },
    "texteAffichable": "Mme&#160;Batho,  M.&#160;Bouillon, M.&#160;Saulignac, M.&#160;Garot et M.&#160;Le Foll"
  },
  "pointeurFragmentTexte": {
    "missionVisee": {
      "@xmlns:xsi": "http://www.w3.org/2001/XMLSchema-instance",
      "@xsi:nil": "true"
    },
    "division": {
      "titre": "Article PREMIER",
      "articleDesignationCourte": "ART. PREMIER",
      "type": "ARTICLE",
      "avant_A_Apres": "A",
      "divisionRattachee": "ARTICLE PREMIER",
      "articleAdditionnel": {
        "@xmlns:xsi": "http://www.w3.org/2001/XMLSchema-instance",
        "@xsi:nil": "true"
      },
      "chapitreAdditionnel": {
        "@xmlns:xsi": "http://www.w3.org/2001/XMLSchema-instance",
        "@xsi:nil": "true"
      },
      "urlDivisionTexteVise": "/15/textes/0370.asp#D_Article_1er"
    },
    "alinea": {
      "avant_A_Apres": {
        "@xmlns:xsi": "http://www.w3.org/2001/XMLSchema-instance",
        "@xsi:nil": "true"
      },
      "numero": "22",
      "alineaDesignation": {
        "@xmlns:xsi": "http://www.w3.org/2001/XMLSchema-instance",
        "@xsi:nil": "true"
      }
    }
  },
  "corps": {
    "dispositif": "<p style=\"text-align: justify;\">Substituer &#224; l&#8217;alin&#233;a&#160;22 les deux alin&#233;as suivants&#160;:</p><p style=\"text-align: justify;\">&#171;&#160;<i>Art.&#160;L.&#160;111&#8209;8&#8209;1</i>.&#160;&#8211;&#160;Si la protection de l&#8217;environnement, de la s&#233;curit&#233; et de la sant&#233; publiques ou d&#8217;autres usages existants ou planifi&#233;s du sol ou du sous-sol le justifient, un cahier des charges pr&#233;cise les prescriptions particuli&#232;res qui s&#8217;imposent au titulaire du titre minier.</p><p style=\"text-align: justify;\">&#171;&#160;Le cahier des charges est &#233;tabli par l&#8217;autorit&#233; administrative comp&#233;tente pour d&#233;livrer un titre minier d&#8217;exploration ou d&#8217;exploitation d&#8217;hydrocarbures, ou accorder son extension ou sa prolongation. Il tient compte du r&#233;sultat de l&#8217;instruction administrative de la demande de titre minier, de son extension ou de sa prolongation et, dans le cas o&#249; cette demande a n&#233;cessit&#233; la mise en &#339;uvre d&#8217;une proc&#233;dure de participation du public, l&#8217;autorit&#233; administrative peut compl&#233;ter le cahier des charges pour prendre en compte les r&#233;sultats de la proc&#233;dure de participation du public. Le cahier des charges est port&#233; &#224; la connaissance du demandeur.&#160;&#187;</p>",
    "exposeSommaire": "<p style=\"text-align: justify;\">Il convient de r&#233;tablir la disposition adopt&#233;e par l&#8217;Assembl&#233;e nationale, &#224; l&#8217;initiative du Rapporteur, qui reprenait une disposition de la proposition de loi de Jean-Paul Chanteguet concernant le cahier des charges permettant des prescriptions particuli&#232;res relatives &#224; l&#8217;environnement, &#224; la s&#233;curit&#233; ou &#224; la sant&#233;.</p>",
    "annexeExposeSommaire": {
      "@xmlns:xsi": "http://www.w3.org/2001/XMLSchema-instance",
      "@xsi:nil": "true"
    }
  },
  "representations": {
    "representation": {
      "nom": "PDF",
      "typeMime": {
        "type": "application",
        "subType": "PDF"
      },
      "statutRepresentation": {
        "verbatim": "true",
        "canonique": "true",
        "officielle": "true",
        "transcription": "false",
        "enregistrement": "false"
      },
      "repSource": {
        "@xmlns:xsi": "http://www.w3.org/2001/XMLSchema-instance",
        "@xsi:nil": "true"
      },
      "offset": {
        "@xmlns:xsi": "http://www.w3.org/2001/XMLSchema-instance",
        "@xsi:nil": "true"
      },
      "contenu": {
        "documentURI": "/15/amendements/0370/CION-DVP/CD17.pdf"
      },
      "dateDispoRepresentation": {
        "@xmlns:xsi": "http://www.w3.org/2001/XMLSchema-instance",
        "@xsi:nil": "true"
      }
    }
  },
  "seanceDiscussion": {
    "@xmlns:xsi": "http://www.w3.org/2001/XMLSchema-instance",
    "@xsi:nil": "true"
  },
  "sort": {
    "dateSaisie": "2017-11-22T17:40:54.000+01:00",
    "sortEnSeance": "Adopté"
  },
  "dateDepot": "2017-11-21T01:00:00.000+01:00",
  "dateDistribution": "2017-11-22T01:00:00.000+01:00",
  "article99": "0",
  "loiReference": {
    "codeLoi": {
      "@xmlns:xsi": "http://www.w3.org/2001/XMLSchema-instance",
      "@xsi:nil": "true"
    },
    "divisionCodeLoi": {
      "@xmlns:xsi": "http://www.w3.org/2001/XMLSchema-instance",
      "@xsi:nil": "true"
    }
  }
}