{
  "@xmlns": "http://schemas.assemblee-nationale.fr/referentiel",
  "uid": "AMANR5L15SEA717460BTC1173P0D1N134",
  "identifiant": {
    "legislature": "15",
    "numero": "134",
    "numRect": "0",
    "saisine": {
      "refTexteLegislatif": "PRJLANR5L15BTC1173",
      "numeroPartiePLF": "0",
      "organeExamen": "PO717460",
      "mentionSecondeDeliberation": "0"
    }
  },
  "numeroLong": "134",
  "etapeTexte": "Nouvelle Lecture",
  "triAmendement": "dpl",
  "cardinaliteAmdtMultiples": "1",
  "amendementParent": {
    "@xmlns:xsi": "http://www.w3.org/2001/XMLSchema-instance",
    "@xsi:nil": "true"
  },
  "etat": "Discuté",
  "signataires": {
    "auteur": {
      "typeAuteur": "Depute",
      "acteurRef": "PA721202",
      "organeRef": {
        "@xmlns:xsi": "http://www.w3.org/2001/XMLSchema-instance",
        "@xsi:nil": "true"
      },
      "groupePolitiqueRef": "PO730958"
    },
    "cosignataires": {
      "acteurRef": [
        "PA720286",
        "PA719578",
        "PA721202",
        "PA719676",
        "PA718868",
        "PA588884",
        "PA722142",
        "PA721062",
        "PA720430",
        "PA2150",
        "PA718860",
        "PA721960",
        "PA720892",
        "PA720422",
        "PA720846",
        "PA721210",
        "PA721226"
      ]
    },
    "texteAffichable": "M.&#160;Coquerel,  Mme&#160;Autain, M.&#160;Bernalicis, M.&#160;Corbi&#232;re, Mme&#160;Fiat, M.&#160;Lachaud, M.&#160;Larive, M.&#160;M&#233;lenchon, Mme&#160;Obono, Mme&#160;Panot, M.&#160;Prud&apos;homme, M.&#160;Quatennens, M.&#160;Ratenon, Mme&#160;Ressiguier, Mme&#160;Rubin, M.&#160;Ruffin et Mme&#160;Taurine"
  },
  "pointeurFragmentTexte": {
    "missionVisee": {
      "@xmlns:xsi": "http://www.w3.org/2001/XMLSchema-instance",
      "@xsi:nil": "true"
    },
    "division": {
      "titre": "Article 6",
      "articleDesignationCourte": "ART. 6",
      "type": "ARTICLE",
      "avant_A_Apres": "A",
      "divisionRattachee": "ARTICLE 6",
      "articleAdditionnel": {
        "@xmlns:xsi": "http://www.w3.org/2001/XMLSchema-instance",
        "@xsi:nil": "true"
      },
      "chapitreAdditionnel": {
        "@xmlns:xsi": "http://www.w3.org/2001/XMLSchema-instance",
        "@xsi:nil": "true"
      },
      "urlDivisionTexteVise": "/15/textes/1173.asp#D_Article_6"
    },
    "alinea": {
      "avant_A_Apres": {
        "@xmlns:xsi": "http://www.w3.org/2001/XMLSchema-instance",
        "@xsi:nil": "true"
      },
      "numero": "12",
      "alineaDesignation": {
        "@xmlns:xsi": "http://www.w3.org/2001/XMLSchema-instance",
        "@xsi:nil": "true"
      }
    }
  },
  "corps": {
    "dispositif": "<p style=\"text-align: justify;\">Supprimer l&#8217;alin&#233;a&#160;12.</p>",
    "exposeSommaire": "<p style=\"text-align: justify;\">Par cet amendement, nous proposons d&#8217;&#233;viter que le Gouvernement marque un recul majeur en ce qui concerne les droits proc&#233;duraux des demandeurs d&#8217;asile devant la Cour nationale du droit d&#8217;asile (CNDA). Nous ne pouvons accepter qu&#8217;un demandeur d&#8217;asile puisse faire l&#8217;objet d&#8217;une &#171;&#160;t&#233;l&#233;-audience&#160;&#187; sans son consentement&#160;!</p><p style=\"text-align: justify;\">En effet, le but de l&#8217;alin&#233;a en cause est de supprimer cette phrase de l&#8217;article de L.&#160;733&#8209;1 du CESEDA&#160;: &#171;&#160;Le requ&#233;rant qui, s&#233;journant en France m&#233;tropolitaine, refuse d&#8217;&#234;tre entendu par un moyen de communication audiovisuelle est convoqu&#233;, &#224; sa demande, dans les locaux de la cour.&#160;&#187;. Ainsi, le Gouvernement souhaite syst&#233;matiser le recours &#224; des &#171;&#160;t&#233;l&#233;-audiences&#160;&#187; pour &#233;viter de devoir convoquer physiquement et mat&#233;riellement les demandeurs d&#8217;asile en bonne et due forme dans la salle d&#8217;audience d&#8217;une juridiction. Emmanuel MACRON et G&#233;rard COLLOMB veulent inventer le &#171;&#160;t&#233;l&#233;-asile&#160;&#187;. Kafka avait donc raison&#160;: d&#233;sormais un demandeur d&#8217;asile pourra &#234;tre dans une salle (son interpr&#232;te et son &#233;ventuel avocat de l&#8217;autre c&#244;t&#233; de l&#8217;&#233;cran aupr&#232;s de la CNDA par exemple) seul face &#224;&#8230; un &#233;cran.</p><p style=\"text-align: justify;\">Concr&#232;tement, voici les conditions dans lesquelles la justice fran&#231;aise sera rendue&#160;: le demandeur d&#8217;asile qui sollicite une protection internationale contre des pers&#233;cutions pourra se retrouver seule dans une pi&#232;ce isol&#233;e face &#224; un &#233;cran. D&#233;sormais il ne pourra plus s&#8217;opposer &#224; ce format &#171;&#160;Skype&#160;&#187; de la justice. Et si jamais son avocat qui est pr&#233;sent &#224; ses c&#244;t&#233;s souhaite transmettre des documents &#224; la formation de jugement&#160;? (ils sont actuellement directement enregistr&#233;s par le greffe et examin&#233;s)&#160;?</p><p style=\"text-align: justify;\">Il s&#8217;agit l&#224; d&#8217;une question de droits fondamentaux, celle du droit &#224; un proc&#232;s &#233;quitable (article&#160;6&#8209;1 de la Convention&#160;europ&#233;enne de sauvegarde des droits de l&#8217;homme et des libert&#233;s fondamentales), et constitutionnelles d&#8217;un proc&#232;s juste et &#233;quitable.</p>",
    "annexeExposeSommaire": {
      "@xmlns:xsi": "http://www.w3.org/2001/XMLSchema-instance",
      "@xsi:nil": "true"
    }
  },
  "representations": {
    "representation": {
      "nom": "PDF",
      "typeMime": {
        "type": "application",
        "subType": "PDF"
      },
      "statutRepresentation": {
        "verbatim": "true",
        "canonique": "true",
        "officielle": "true",
        "transcription": "false",
        "enregistrement": "false"
      },
      "repSource": {
        "@xmlns:xsi": "http://www.w3.org/2001/XMLSchema-instance",
        "@xsi:nil": "true"
      },
      "offset": {
        "@xmlns:xsi": "http://www.w3.org/2001/XMLSchema-instance",
        "@xsi:nil": "true"
      },
      "contenu": {
        "documentURI": "/15/amendements/1173/AN/134.pdf"
      },
      "dateDispoRepresentation": {
        "@xmlns:xsi": "http://www.w3.org/2001/XMLSchema-instance",
        "@xsi:nil": "true"
      }
    }
  },
  "seanceDiscussion": "RUANR5L15S2018IDS21203",
  "sort": {
    "dateSaisie": "2018-07-26T10:38:17.000+02:00",
    "sortEnSeance": "Rejeté"
  },
  "dateDepot": "2018-07-20T02:00:00.000+02:00",
  "dateDistribution": "2018-07-23T02:00:00.000+02:00",
  "article99": "0",
  "loiReference": {
    "codeLoi": {
      "@xmlns:xsi": "http://www.w3.org/2001/XMLSchema-instance",
      "@xsi:nil": "true"
    },
    "divisionCodeLoi": {
      "@xmlns:xsi": "http://www.w3.org/2001/XMLSchema-instance",
      "@xsi:nil": "true"
    }
  }
}