{
  "@xmlns": "http://schemas.assemblee-nationale.fr/referentiel",
  "uid": "AMANR5L15SEA717460BTC1177P0D1N366",
  "identifiant": {
    "legislature": "15",
    "numero": "366",
    "numRect": "0",
    "saisine": {
      "refTexteLegislatif": "PRJLANR5L15BTC1177",
      "numeroPartiePLF": "0",
      "organeExamen": "PO717460",
      "mentionSecondeDeliberation": "0"
    }
  },
  "numeroLong": "366",
  "etapeTexte": "Nouvelle Lecture",
  "triAmendement": "v",
  "cardinaliteAmdtMultiples": "1",
  "amendementParent": {
    "@xmlns:xsi": "http://www.w3.org/2001/XMLSchema-instance",
    "@xsi:nil": "true"
  },
  "etat": "Discuté",
  "signataires": {
    "auteur": {
      "typeAuteur": "Depute",
      "acteurRef": "PA719146",
      "organeRef": {
        "@xmlns:xsi": "http://www.w3.org/2001/XMLSchema-instance",
        "@xsi:nil": "true"
      },
      "groupePolitiqueRef": "PO723569"
    },
    "cosignataires": {
      "acteurRef": [
        "PA719286",
        "PA719138",
        "PA719146"
      ]
    },
    "texteAffichable": "M.&#160;Acquaviva,  M.&#160;Castellani et M.&#160;Colombani"
  },
  "pointeurFragmentTexte": {
    "missionVisee": {
      "@xmlns:xsi": "http://www.w3.org/2001/XMLSchema-instance",
      "@xsi:nil": "true"
    },
    "division": {
      "titre": "Article 11",
      "articleDesignationCourte": "ART. 11",
      "type": "ARTICLE",
      "avant_A_Apres": "A",
      "divisionRattachee": "ARTICLE 11",
      "articleAdditionnel": {
        "@xmlns:xsi": "http://www.w3.org/2001/XMLSchema-instance",
        "@xsi:nil": "true"
      },
      "chapitreAdditionnel": {
        "@xmlns:xsi": "http://www.w3.org/2001/XMLSchema-instance",
        "@xsi:nil": "true"
      },
      "urlDivisionTexteVise": "/15/textes/1177.asp#D_Article_11"
    },
    "alinea": {
      "avant_A_Apres": "Apres",
      "numero": "118",
      "alineaDesignation": {
        "@xmlns:xsi": "http://www.w3.org/2001/XMLSchema-instance",
        "@xsi:nil": "true"
      }
    }
  },
  "corps": {
    "dispositif": "<p>Compl&#233;ter cet article par l&#8217;alin&#233;a suivant&#160;:</p><p>&#171;&#160;XII.&#160;&#8211;&#160;Le pr&#233;sent article ne s&#8217;applique pas en Corse.&#160;&#187;</p>",
    "exposeSommaire": "<p style=\"text-align: justify;\">La remise en cause du pilotage des CFA par les r&#233;gions aura des cons&#233;quences n&#233;fastes en Corse tout particuli&#232;rement.</p><p style=\"text-align: justify;\">La Corse dispose d&#8217;une &#233;conomie faiblement industrialis&#233;e et peu diversifi&#233;e (tourisme et administration)&#160;; ainsi, les branches professionnelles ne couvrent pas un spectre suffisamment large pour leur permettre une projection et une r&#233;flexion compl&#232;tes.</p><p style=\"text-align: justify;\">Par ailleurs, la Collectivit&#233; de Corse travaille actuellement &#224; associer &#233;troitement le tissu entrepreneurial insulaire (majorit&#233; de TPE-PME) dans le cadre de l&#8217;&#233;laboration d&#8217;une politique globale de formation et d&#8217;&#233;ducation que lui conf&#232;re le statut de 2002.</p><p style=\"text-align: justify;\">C&#8217;est pourquoi, en Corse, plus qu&#8217;ailleurs, l&#8217;apprentissage doit pouvoir continuer &#224; b&#233;n&#233;ficier d&#8217;une programmation politique et d&#8217;une vision sur le long terme.</p>",
    "annexeExposeSommaire": {
      "@xmlns:xsi": "http://www.w3.org/2001/XMLSchema-instance",
      "@xsi:nil": "true"
    }
  },
  "representations": {
    "representation": {
      "nom": "PDF",
      "typeMime": {
        "type": "application",
        "subType": "PDF"
      },
      "statutRepresentation": {
        "verbatim": "true",
        "canonique": "true",
        "officielle": "true",
        "transcription": "false",
        "enregistrement": "false"
      },
      "repSource": {
        "@xmlns:xsi": "http://www.w3.org/2001/XMLSchema-instance",
        "@xsi:nil": "true"
      },
      "offset": {
        "@xmlns:xsi": "http://www.w3.org/2001/XMLSchema-instance",
        "@xsi:nil": "true"
      },
      "contenu": {
        "documentURI": "/15/amendements/1177/AN/366.pdf"
      },
      "dateDispoRepresentation": {
        "@xmlns:xsi": "http://www.w3.org/2001/XMLSchema-instance",
        "@xsi:nil": "true"
      }
    }
  },
  "seanceDiscussion": "RUANR5L15S2018IDS21199",
  "sort": {
    "dateSaisie": "2018-07-24T19:54:34.000+02:00",
    "sortEnSeance": "Rejeté"
  },
  "dateDepot": "2018-07-20T02:00:00.000+02:00",
  "dateDistribution": "2018-07-21T02:00:00.000+02:00",
  "article99": "0",
  "loiReference": {
    "codeLoi": {
      "@xmlns:xsi": "http://www.w3.org/2001/XMLSchema-instance",
      "@xsi:nil": "true"
    },
    "divisionCodeLoi": {
      "@xmlns:xsi": "http://www.w3.org/2001/XMLSchema-instance",
      "@xsi:nil": "true"
    }
  }
}