{
  "@xmlns": "http://schemas.assemblee-nationale.fr/referentiel",
  "uid": "AMANR5L15SEA717460BTC1629P0D1N297",
  "identifiant": {
    "legislature": "15",
    "numero": "297",
    "numRect": "0",
    "saisine": {
      "refTexteLegislatif": "PRJLANR5L15BTC1629",
      "numeroPartiePLF": "0",
      "organeExamen": "PO717460",
      "mentionSecondeDeliberation": "0"
    }
  },
  "numeroLong": "297",
  "etapeTexte": "1ère lecture (1ère assemblée saisie)",
  "triAmendement": "bdaaaaaaaaaaaaaaaaaaaaaaaaaaaaaaaaaaaaaaaaaaaaaaaabdu",
  "cardinaliteAmdtMultiples": "1",
  "amendementParent": {
    "@xmlns:xsi": "http://www.w3.org/2001/XMLSchema-instance",
    "@xsi:nil": "true"
  },
  "etat": "Discuté",
  "signataires": {
    "auteur": {
      "typeAuteur": "Depute",
      "acteurRef": "PA266776",
      "organeRef": {
        "@xmlns:xsi": "http://www.w3.org/2001/XMLSchema-instance",
        "@xsi:nil": "true"
      },
      "groupePolitiqueRef": "PO730934"
    },
    "cosignataires": {
      "acteurRef": [
        "PA721816",
        "PA720386",
        "PA719318",
        "PA923",
        "PA720100",
        "PA342935",
        "PA267440",
        "PA2796",
        "PA266797",
        "PA267318",
        "PA721070",
        "PA1874",
        "PA267794",
        "PA267450",
        "PA267324",
        "PA340853",
        "PA720684",
        "PA720630",
        "PA1498",
        "PA2792",
        "PA1029",
        "PA2086",
        "PA746",
        "PA713448",
        "PA330788",
        "PA267901",
        "PA346054",
        "PA2960",
        "PA719946",
        "PA345722",
        "PA2155",
        "PA720586",
        "PA608826",
        "PA721126",
        "PA720644",
        "PA334149",
        "PA718850",
        "PA223837",
        "PA998",
        "PA718780",
        "PA721474",
        "PA643089",
        "PA718884",
        "PA1695",
        "PA267429",
        "PA721410",
        "PA606098",
        "PA267200",
        "PA720210",
        "PA267527",
        "PA767",
        "PA2492",
        "PA2529",
        "PA721678",
        "PA722390",
        "PA267735",
        "PA759192",
        "PA330909",
        "PA748954",
        "PA607090",
        "PA609245",
        "PA605036",
        "PA718784",
        "PA266776"
      ]
    },
    "texteAffichable": "M.&#160;Reiss,  M.&#160;Jacob, M.&#160;Abad, Mme&#160;Anthoine, Mme&#160;Bazin-Malgras, Mme&#160;Beauvais, Mme&#160;Bonnivard, M.&#160;Boucard, Mme&#160;Brenier, M.&#160;Brochand, M.&#160;Carrez, M.&#160;Cattin, M.&#160;Cinieri, M.&#160;Cordier, Mme&#160;Corneloup, M.&#160;Cornut-Gentille, M.&#160;Dassault, M.&#160;de Ganay, M.&#160;Deflesselles, M.&#160;R&#233;mi&#160;Delatte, M.&#160;Descoeur, M.&#160;Di Filippo, M.&#160;Diard, Mme&#160;Marianne&#160;Dubois, Mme&#160;Duby-Muller, M.&#160;Pierre-Henri&#160;Dumont, M.&#160;Fasquelle, M.&#160;Gaultier, M.&#160;Goasguen, M.&#160;Gosselin, M.&#160;Grelier, Mme&#160;Guion-Firmin, M.&#160;Huyghe, M.&#160;Kamardine, Mme&#160;Lacroute, M.&#160;Le Fur, Mme&#160;Le Grip, M.&#160;Leclerc, M.&#160;Emmanuel&#160;Maquet, M.&#160;Marleix, M.&#160;Marlin, M.&#160;Menuel, M.&#160;Minot, M.&#160;Nury, M.&#160;Pauget, M.&#160;Peltier, M.&#160;Poudroux, M.&#160;Pradi&#233;, M.&#160;Quentin, Mme&#160;Ramassamy, M.&#160;Reda, M.&#160;Reitzer, M.&#160;Reyn&#232;s, M.&#160;Saddier, M.&#160;Savignat, Mme&#160;Tabarot, M.&#160;Taugourdeau, M.&#160;Teissier, M.&#160;Thi&#233;riot, Mme&#160;Trastour-Isnart, M.&#160;Vatin, M.&#160;Jean-Pierre&#160;Vigier, M.&#160;Viry et M.&#160;Woerth"
  },
  "pointeurFragmentTexte": {
    "missionVisee": {
      "@xmlns:xsi": "http://www.w3.org/2001/XMLSchema-instance",
      "@xsi:nil": "true"
    },
    "division": {
      "titre": "Article 5",
      "articleDesignationCourte": "ART. 5",
      "type": "ARTICLE",
      "avant_A_Apres": "A",
      "divisionRattachee": "ARTICLE 5",
      "articleAdditionnel": {
        "@xmlns:xsi": "http://www.w3.org/2001/XMLSchema-instance",
        "@xsi:nil": "true"
      },
      "chapitreAdditionnel": {
        "@xmlns:xsi": "http://www.w3.org/2001/XMLSchema-instance",
        "@xsi:nil": "true"
      },
      "urlDivisionTexteVise": "/15/textes/1629.asp#D_Article_5"
    },
    "alinea": {
      "@xmlns:xsi": "http://www.w3.org/2001/XMLSchema-instance",
      "@xsi:nil": "true"
    }
  },
  "corps": {
    "dispositif": "<p style=\"text-align: justify;\">Supprimer cet article.</p>",
    "exposeSommaire": "<p style=\"text-align: justify;\">Cet amendement du Groupe les R&#233;publicains vise &#224; assurer un juste contr&#244;le de l&#8217;instruction dispens&#233;e par les familles.</p><p style=\"text-align: justify;\">Si cet article pr&#233;voit un d&#233;cret en Conseil d&#8217;&#201;tat afin de pouvoir garder une certaine proportionnalit&#233; des sanctions, il pose tout m&#234;me un probl&#232;me de principe.</p><p style=\"text-align: justify;\">Le code de l&#8217;&#233;ducation dispose dans son article L.&#160;122&#8209;1&#8209;1 que le socle commun que doit pouvoir acqu&#233;rir chaque &#233;l&#232;ve comprend, entre autres&#160;:</p><p style=\"text-align: justify;\">- la ma&#238;trise de la langue fran&#231;aise</p><p style=\"text-align: justify;\">- la ma&#238;trise des principaux &#233;l&#233;ments de math&#233;matiques</p><p style=\"text-align: justify;\">- une culture humaniste et scientifique permettant le libre exercice de la citoyennet&#233;</p><p style=\"text-align: justify;\">- la pratique d&#8217;au moins une langue vivante &#233;trang&#232;re</p><p style=\"text-align: justify;\">- la ma&#238;trise des techniques usuelles de l&#8217;information et de la communication.</p><p style=\"text-align: justify;\">Pr&#233;voir que des inspecteurs de l&#8217;&#233;ducation nationale pourront dor&#233;navant aller v&#233;rifier si des familles dispensent &#224; des enfants de 3 ans une instruction leur permettant d&#8217;acqu&#233;rir ce socle parait disproportionn&#233;. En effet, la p&#233;dagogie appliqu&#233;e envers un enfant de 3 ans est bas&#233;e sur un apprentissage ludique lui permettant d&#8217;ouvrir sa curiosit&#233;, de s&#8217;ouvrir petit &#224; petit aux autres et de s&#8217;&#233;veiller &#224; la p&#233;dagogie qu&#8217;il va rencontrer en primaire pour lui inculquer des savoirs.</p><p style=\"text-align: justify;\">Par ailleurs, on peut consid&#233;rer que les parents ont droit &#224; la libert&#233; dans l&#8217;instruction de leurs enfants &#224; cet &#226;ge-l&#224; sans avoir n&#233;cessairement &#224; proc&#233;der &#224; des d&#233;clarations pr&#233;alables.</p><p style=\"text-align: justify;\">Si le groupe les R&#233;publicains reconnait l&#8217;importance d&#8217;une l&#233;gislation permettant de d&#233;manteler les &#233;coles de fait et notamment celles &#224; tendance salafiste, cette possibilit&#233; ne doit pas se faire au d&#233;triment de la libert&#233; des familles dans le cadre particulier de l&#8217;enseignement en bas &#226;ge.</p>",
    "annexeExposeSommaire": {
      "@xmlns:xsi": "http://www.w3.org/2001/XMLSchema-instance",
      "@xsi:nil": "true"
    },
    "cartoucheDelaiDepotDepasse": {
      "@xmlns:xsi": "http://www.w3.org/2001/XMLSchema-instance",
      "@xsi:nil": "true"
    }
  },
  "representations": {
    "representation": {
      "nom": "PDF",
      "typeMime": {
        "type": "application",
        "subType": "PDF"
      },
      "statutRepresentation": {
        "verbatim": "true",
        "canonique": "true",
        "officielle": "true",
        "transcription": "false",
        "enregistrement": "false"
      },
      "repSource": {
        "@xmlns:xsi": "http://www.w3.org/2001/XMLSchema-instance",
        "@xsi:nil": "true"
      },
      "offset": {
        "@xmlns:xsi": "http://www.w3.org/2001/XMLSchema-instance",
        "@xsi:nil": "true"
      },
      "contenu": {
        "documentURI": "/15/amendements/1629/AN/297.pdf"
      },
      "dateDispoRepresentation": {
        "@xmlns:xsi": "http://www.w3.org/2001/XMLSchema-instance",
        "@xsi:nil": "true"
      }
    }
  },
  "seanceDiscussion": "RUANR5L15S2019IDS21504",
  "sort": {
    "dateSaisie": "2019-02-14T17:04:48.000+01:00",
    "sortEnSeance": "Rejeté"
  },
  "dateDepot": "2019-02-06T01:00:00.000+01:00",
  "dateDistribution": "2019-02-11T01:00:00.000+01:00",
  "article99": "0",
  "loiReference": {
    "codeLoi": {
      "@xmlns:xsi": "http://www.w3.org/2001/XMLSchema-instance",
      "@xsi:nil": "true"
    },
    "divisionCodeLoi": {
      "@xmlns:xsi": "http://www.w3.org/2001/XMLSchema-instance",
      "@xsi:nil": "true"
    }
  }
}