{
  "@xmlns": "http://schemas.assemblee-nationale.fr/referentiel",
  "uid": "AMANR5L15SEA717460BTC0857P0D1N504",
  "identifiant": {
    "legislature": "15",
    "numero": "504",
    "numRect": "0",
    "saisine": {
      "refTexteLegislatif": "PRJLANR5L15BTC0857",
      "numeroPartiePLF": "0",
      "organeExamen": "PO717460",
      "mentionSecondeDeliberation": "0"
    }
  },
  "numeroLong": "504",
  "etapeTexte": "1ère lecture (1ère assemblée saisie)",
  "triAmendement": "ahbzy",
  "cardinaliteAmdtMultiples": "1",
  "amendementParent": {
    "@xmlns:xsi": "http://www.w3.org/2001/XMLSchema-instance",
    "@xsi:nil": "true"
  },
  "etat": "Discuté",
  "signataires": {
    "auteur": {
      "typeAuteur": "Depute",
      "acteurRef": "PA330240",
      "organeRef": {
        "@xmlns:xsi": "http://www.w3.org/2001/XMLSchema-instance",
        "@xsi:nil": "true"
      },
      "groupePolitiqueRef": "PO730934"
    },
    "cosignataires": {
      "acteurRef": [
        "PA267260",
        "PA345722",
        "PA1029",
        "PA2960",
        "PA608016",
        "PA334654",
        "PA336316",
        "PA606712",
        "PA2377",
        "PA1327",
        "PA722390",
        "PA266776",
        "PA2086",
        "PA2492",
        "PA266808",
        "PA720644",
        "PA721506",
        "PA330788",
        "PA643134",
        "PA223837",
        "PA330240",
        "PA267794",
        "PA267527",
        "PA721046",
        "PA718838",
        "PA1874",
        "PA2155",
        "PA609245",
        "PA721636",
        "PA608416",
        "PA342935",
        "PA721314",
        "PA721816",
        "PA605036",
        "PA266793",
        "PA267378",
        "PA643103",
        "PA267324",
        "PA721126",
        "PA267289",
        "PA718784",
        "PA609726",
        "PA721968",
        "PA332523",
        "PA340853",
        "PA267440",
        "PA2796",
        "PA923",
        "PA608826",
        "PA718850",
        "PA998",
        "PA642847",
        "PA267200",
        "PA330684",
        "PA721474",
        "PA330008",
        "PA1012",
        "PA719946",
        "PA856",
        "PA330909",
        "PA721054",
        "PA267785",
        "PA720386",
        "PA2529",
        "PA720684",
        "PA767",
        "PA721678",
        "PA719272",
        "PA720210",
        "PA1630",
        "PA346054",
        "PA267204",
        "PA266797",
        "PA346218",
        "PA2792",
        "PA334149",
        "PA267735",
        "PA267901",
        "PA721286",
        "PA267429",
        "PA746",
        "PA709315",
        "PA721070",
        "PA607090",
        "PA718780",
        "PA721410",
        "PA1695",
        "PA720586",
        "PA267318",
        "PA713448",
        "PA712015",
        "PA334843",
        "PA1498",
        "PA605991",
        "PA718884",
        "PA748954",
        "PA719318",
        "PA266774",
        "PA720630",
        "PA720100",
        "PA606098"
      ]
    },
    "texteAffichable": "M.&#160;Ciotti,  M.&#160;Jacob, M.&#160;Abad, Mme&#160;Anthoine, M.&#160;Aubert, Mme&#160;Bassire, M.&#160;Bazin, Mme&#160;Bazin-Malgras, Mme&#160;Beauvais, Mme&#160;Bonnivard, M.&#160;Bony, M.&#160;Boucard, M.&#160;Bouchet, Mme&#160;Val&#233;rie&#160;Boyer, Mme&#160;Brenier, M.&#160;Breton, M.&#160;Brochand, M.&#160;Brun, M.&#160;Carrez, M.&#160;Cattin, M.&#160;Cherpion, M.&#160;Cinieri, M.&#160;Cordier, Mme&#160;Corneloup, M.&#160;Cornut-Gentille, Mme&#160;Dalloz, M.&#160;Dassault, M.&#160;de Ganay, M.&#160;de la Verpilli&#232;re, M.&#160;Deflesselles, M.&#160;Descoeur, M.&#160;Di Filippo, M.&#160;Diard, M.&#160;Dive, M.&#160;Door, Mme&#160;Marianne&#160;Dubois, Mme&#160;Duby-Muller, M.&#160;Pierre-Henri&#160;Dumont, M.&#160;Fasquelle, M.&#160;Ferrara, M.&#160;Forissier, M.&#160;Furst, M.&#160;Gaultier, Mme&#160;Genevard, M.&#160;Goasguen, M.&#160;Gosselin, M.&#160;Grelier, Mme&#160;Guion-Firmin, M.&#160;Herbillon, M.&#160;Hetzel, M.&#160;Huyghe, M.&#160;Kamardine, Mme&#160;Kuster, Mme&#160;Lacroute, M.&#160;Larriv&#233;, M.&#160;Le Fur, Mme&#160;Le Grip, M.&#160;Leclerc, Mme&#160;Levy, M.&#160;Lorion, Mme&#160;Louwagie, M.&#160;Lurton, M.&#160;Emmanuel&#160;Maquet, M.&#160;Marleix, M.&#160;Marlin, M.&#160;Masson, M.&#160;Menuel, Mme&#160;Meunier, M.&#160;Minot, M.&#160;Nury, M.&#160;Parigi, M.&#160;Pauget, M.&#160;Peltier, M.&#160;Perrut, Mme&#160;Poletti, M.&#160;Pradi&#233;, M.&#160;Quentin, M.&#160;Ramadier, Mme&#160;Ramassamy, M.&#160;Reda, M.&#160;Reiss, M.&#160;Reitzer, M.&#160;Reyn&#232;s, M.&#160;Rolland, M.&#160;Saddier, M.&#160;Savignat, M.&#160;Schellenberger, M.&#160;Sermier, M.&#160;Straumann, Mme&#160;Tabarot, M.&#160;Taugourdeau, M.&#160;Teissier, Mme&#160;Trastour-Isnart, Mme&#160;Valentin, M.&#160;Vatin, M.&#160;Verch&#232;re, M.&#160;Viala, M.&#160;Vialay, M.&#160;Jean-Pierre&#160;Vigier, M.&#160;Viry et M.&#160;Woerth"
  },
  "pointeurFragmentTexte": {
    "missionVisee": {
      "@xmlns:xsi": "http://www.w3.org/2001/XMLSchema-instance",
      "@xsi:nil": "true"
    },
    "division": {
      "titre": "Article 33 bis",
      "articleDesignationCourte": "APRÈS ART. 33 BIS",
      "type": "ARTICLE",
      "avant_A_Apres": "Après",
      "divisionRattachee": "APRÈS L'ARTICLE 33 BIS, insérer l'article suivant:",
      "articleAdditionnel": "1",
      "chapitreAdditionnel": {
        "@xmlns:xsi": "http://www.w3.org/2001/XMLSchema-instance",
        "@xsi:nil": "true"
      },
      "urlDivisionTexteVise": "/15/textes/0857.asp#D_Article_33_bis"
    },
    "alinea": {
      "@xmlns:xsi": "http://www.w3.org/2001/XMLSchema-instance",
      "@xsi:nil": "true"
    }
  },
  "corps": {
    "dispositif": "<p style=\"text-align: justify;\">Apr&#232;s le premier alin&#233;a de l&#8217;article L.&#160;313&#8209;14 du code de l&#8217;entr&#233;e et du s&#233;jour des &#233;trangers et du droit d&#8217;asile, il est ins&#233;r&#233; un alin&#233;a ainsi r&#233;dig&#233;&#160;:</p><p style=\"text-align: justify;\">&#171;&#160;Une r&#233;sidence depuis au moins cinq ans sur le territoire fran&#231;ais ne saurait justifier une admission au s&#233;jour pour les &#233;trangers en situation irr&#233;guli&#232;re.&#160;&#187;</p>",
    "exposeSommaire": "<p style=\"text-align: justify;\">Le pr&#233;sent amendement propose de supprimer la circulaire Valls de 2012 pr&#233;cisant les conditions d&#8217;admission au s&#233;jour des &#233;trangers en situation irr&#233;guli&#232;re.</p><p style=\"text-align: justify;\">Les &#171;&#160;r&#233;gularisations&#160;&#187; d&#8217;&#233;trangers en situations irr&#233;guli&#232;re ont connu, du fait de l&#8217;application de cette circulaire, une hausse substantielle&#160;: selon le rapport d&#8217;information sur l&#8217;application de la loi n&#176;2016&#8209;274 du 7 mars 2016 relative au droit des &#233;trangers en France, elles sont pass&#233;es de 23&#160;294 en 2012 &#224; 30&#160;089 en 2017 soit 30&#160;% de plus en 5 ans. Ce sont donc au total 181&#160;210 ressortissants &#233;trangers s&#233;journant ill&#233;galement en France qui ont &#233;t&#233; r&#233;gularis&#233;s au cours de la p&#233;riode 2012&#8209;2017.</p><p style=\"text-align: justify;\">Or, l&#8217;acquisition de la nationalit&#233; doit venir couronner un processus d&#8217;int&#233;gration et d&#8217;assimilation. Elle ne doit pas &#234;tre un&#160;droit automatique.</p>",
    "annexeExposeSommaire": {
      "@xmlns:xsi": "http://www.w3.org/2001/XMLSchema-instance",
      "@xsi:nil": "true"
    }
  },
  "representations": {
    "representation": {
      "nom": "PDF",
      "typeMime": {
        "type": "application",
        "subType": "PDF"
      },
      "statutRepresentation": {
        "verbatim": "true",
        "canonique": "true",
        "officielle": "true",
        "transcription": "false",
        "enregistrement": "false"
      },
      "repSource": {
        "@xmlns:xsi": "http://www.w3.org/2001/XMLSchema-instance",
        "@xsi:nil": "true"
      },
      "offset": {
        "@xmlns:xsi": "http://www.w3.org/2001/XMLSchema-instance",
        "@xsi:nil": "true"
      },
      "contenu": {
        "documentURI": "/15/amendements/0857/AN/504.pdf"
      },
      "dateDispoRepresentation": {
        "@xmlns:xsi": "http://www.w3.org/2001/XMLSchema-instance",
        "@xsi:nil": "true"
      }
    }
  },
  "seanceDiscussion": "RUANR5L15S2018IDS21078",
  "sort": {
    "dateSaisie": "2018-04-22T19:46:35.000+02:00",
    "sortEnSeance": "Rejeté"
  },
  "dateDepot": "2018-04-12T02:00:00.000+02:00",
  "dateDistribution": "2018-04-16T02:00:00.000+02:00",
  "article99": "0",
  "loiReference": {
    "codeLoi": "c entrée et séjour étrangers",
    "divisionCodeLoi": "L313-14"
  }
}