{
  "@xmlns": "http://schemas.assemblee-nationale.fr/referentiel",
  "uid": "AMANR5L15PO419610B0627P0D1N1776",
  "identifiant": {
    "legislature": "15",
    "numero": "1776",
    "numRect": "0",
    "saisine": {
      "refTexteLegislatif": "PRJLANR5L15B0627",
      "numeroPartiePLF": "0",
      "organeExamen": "PO419610",
      "mentionSecondeDeliberation": "0"
    }
  },
  "numeroLong": "CE1776",
  "etapeTexte": "1ère lecture (1ère assemblée saisie)",
  "triAmendement": "cwve",
  "cardinaliteAmdtMultiples": "1",
  "amendementParent": {
    "@xmlns:xsi": "http://www.w3.org/2001/XMLSchema-instance",
    "@xsi:nil": "true"
  },
  "etat": "Discuté",
  "signataires": {
    "auteur": {
      "typeAuteur": "Depute",
      "acteurRef": "PA333285",
      "organeRef": {
        "@xmlns:xsi": "http://www.w3.org/2001/XMLSchema-instance",
        "@xsi:nil": "true"
      },
      "groupePolitiqueRef": "PO730946"
    },
    "cosignataires": {
      "acteurRef": [
        "PA643145",
        "PA333285",
        "PA267233",
        "PA333818",
        "PA337483",
        "PA642764",
        "PA1592",
        "PA608011",
        "PA609590",
        "PA608172",
        "PA340343",
        "PA342415",
        "PA609332",
        "PA719930",
        "PA605069",
        "PA610681",
        "PA429893",
        "PA335999",
        "PA335532",
        "PA607553",
        "PA1198",
        "PA588886",
        "PA405480",
        "PA720988",
        "PA332614",
        "PA1809",
        "PA1008",
        "PA508",
        "PA340357",
        "PA335054",
        "PA608695"
      ]
    },
    "texteAffichable": "M.&#160;Garot,  M.&#160;Potier, M.&#160;Aviragnet, Mme&#160;Bareigts, Mme&#160;Batho, Mme&#160;Battistel, Mme&#160;Bi&#233;mouret, M.&#160;Bouillon, M.&#160;Jean-Louis&#160;Bricout, M.&#160;Carvounas, M.&#160;Alain&#160;David, Mme&#160;Laurence&#160;Dumont, M.&#160;Faure, M.&#160;David&#160;Habib, M.&#160;Hutin, M.&#160;Juanico, Mme&#160;Karamanli, M.&#160;J&#233;r&#244;me&#160;Lambert, M.&#160;Le Foll, M.&#160;Letchimy, Mme&#160;Manin, Mme&#160;Pau-Langevin, Mme&#160;Pires Beaune, M.&#160;Pueyo, M.&#160;Pupponi, Mme&#160;Rabault, M.&#160;Saulignac, Mme&#160;Untermaier, Mme&#160;Vainqueur-Christophe, M.&#160;Vallaud et Mme&#160;Victory"
  },
  "pointeurFragmentTexte": {
    "missionVisee": {
      "@xmlns:xsi": "http://www.w3.org/2001/XMLSchema-instance",
      "@xsi:nil": "true"
    },
    "division": {
      "titre": "Article 11",
      "articleDesignationCourte": "ART. 11",
      "type": "ARTICLE",
      "avant_A_Apres": "A",
      "divisionRattachee": "ARTICLE 11",
      "articleAdditionnel": {
        "@xmlns:xsi": "http://www.w3.org/2001/XMLSchema-instance",
        "@xsi:nil": "true"
      },
      "chapitreAdditionnel": {
        "@xmlns:xsi": "http://www.w3.org/2001/XMLSchema-instance",
        "@xsi:nil": "true"
      },
      "urlDivisionTexteVise": "/15/textes/0627.asp#D_Article_11"
    },
    "alinea": {
      "avant_A_Apres": {
        "@xmlns:xsi": "http://www.w3.org/2001/XMLSchema-instance",
        "@xsi:nil": "true"
      },
      "numero": "2",
      "alineaDesignation": {
        "@xmlns:xsi": "http://www.w3.org/2001/XMLSchema-instance",
        "@xsi:nil": "true"
      }
    }
  },
  "corps": {
    "dispositif": "<p style=\"text-align: justify;\">Apr&#232;s le mot&#160;:</p><p style=\"text-align: justify;\">&#171;&#160;part&#160;&#187;,</p><p style=\"text-align: justify;\">r&#233;diger ainsi la fin de l&#8217;alin&#233;a&#160;2&#160;:</p><p style=\"text-align: justify;\">&#171;&#160;de 50&#160;% de produits b&#233;n&#233;ficiant de signes ou mentions pr&#233;vus par l&#8217;article L.&#160;640&#8209;2 du code rural et de la p&#234;che maritime, ou du commerce &#233;quitable tel que d&#233;fini dans l&#8217;article&#160;94 de la loi n&#176; 2014&#8209;856 du&#160;31&#160;juillet&#160;2014 relative &#224; l&#8217;&#233;conomie sociale et solidaire, ou en circuit courts ou satisfaisant de mani&#232;re &#233;quivalente aux exigences d&#233;finies par ces signes, tout en &#233;tant certifi&#233; par un organisme tiers. Elles incluent &#233;galement une part de 30&#160;% de produits issus de l&#8217;agriculture biologique ou de surfaces agricoles en conversion, au sens de l&#8217;article&#160;17 du r&#232;glement (CE) n&#176; 834/2007 du Conseil du 28 juin 2007 relatif &#224; la production biologique et &#224; l&#8217;&#233;tiquetage des produits biologiques.&#160;&#187;</p>",
    "exposeSommaire": "<p style=\"text-align: justify;\">La restauration collective est l&#8217;un des leviers de la transition &#233;cologique et alimentaire. Aujourd&#8217;hui, pour lutter contre l&#8217;injustice alimentaire, pour favoriser une alimentation de qualit&#233; et pour soutenir l&#8217;&#233;conomie locale, il faut changer le contenu de l&#8217;assiette propos&#233;e dans la restauration collective.</p><p style=\"text-align: justify;\">Des objectifs ambitieux et r&#233;alistes doivent donc &#234;tre fix&#233;s.</p><p style=\"text-align: justify;\">C&#8217;est l&#8217;objet de cet amendement qui &#233;tablit des nouvelles r&#232;gles applicables &#224; la restauration collective &#224; l&#8217;horizon 2022. Parmi ces r&#232;gles, l&#8217;obligation de proposer dans la composition des repas servis dans les restaurants collectifs, une part de 50&#160;% de produits b&#233;n&#233;ficiant de signes de qualit&#233;, ou issus du commerce &#233;quitable, dont 30&#160;% de produits issus de l&#8217;agriculture biologique ou de surfaces agricoles en conversion.</p>",
    "annexeExposeSommaire": {
      "@xmlns:xsi": "http://www.w3.org/2001/XMLSchema-instance",
      "@xsi:nil": "true"
    }
  },
  "representations": {
    "representation": {
      "nom": "PDF",
      "typeMime": {
        "type": "application",
        "subType": "PDF"
      },
      "statutRepresentation": {
        "verbatim": "true",
        "canonique": "true",
        "officielle": "true",
        "transcription": "false",
        "enregistrement": "false"
      },
      "repSource": {
        "@xmlns:xsi": "http://www.w3.org/2001/XMLSchema-instance",
        "@xsi:nil": "true"
      },
      "offset": {
        "@xmlns:xsi": "http://www.w3.org/2001/XMLSchema-instance",
        "@xsi:nil": "true"
      },
      "contenu": {
        "documentURI": "/15/amendements/0627/CION-ECO/CE1776.pdf"
      },
      "dateDispoRepresentation": {
        "@xmlns:xsi": "http://www.w3.org/2001/XMLSchema-instance",
        "@xsi:nil": "true"
      }
    }
  },
  "seanceDiscussion": {
    "@xmlns:xsi": "http://www.w3.org/2001/XMLSchema-instance",
    "@xsi:nil": "true"
  },
  "sort": {
    "dateSaisie": "2018-04-19T11:26:47.000+02:00",
    "sortEnSeance": "Tombé"
  },
  "dateDepot": "2018-04-13T02:00:00.000+02:00",
  "dateDistribution": "2018-04-17T02:00:00.000+02:00",
  "article99": "0",
  "loiReference": {
    "codeLoi": {
      "@xmlns:xsi": "http://www.w3.org/2001/XMLSchema-instance",
      "@xsi:nil": "true"
    },
    "divisionCodeLoi": {
      "@xmlns:xsi": "http://www.w3.org/2001/XMLSchema-instance",
      "@xsi:nil": "true"
    }
  }
}