{
  "@xmlns": "http://schemas.assemblee-nationale.fr/referentiel",
  "uid": "AMANR5L15PO419610B0627P0D1N1657",
  "identifiant": {
    "legislature": "15",
    "numero": "1657",
    "numRect": "0",
    "saisine": {
      "refTexteLegislatif": "PRJLANR5L15B0627",
      "numeroPartiePLF": "0",
      "organeExamen": "PO419610",
      "mentionSecondeDeliberation": "0"
    }
  },
  "numeroLong": "CE1657",
  "etapeTexte": "1ère lecture (1ère assemblée saisie)",
  "triAmendement": "aaazznvyzzzwzzwi",
  "cardinaliteAmdtMultiples": "1",
  "amendementParent": {
    "@xmlns:xsi": "http://www.w3.org/2001/XMLSchema-instance",
    "@xsi:nil": "true"
  },
  "etat": "Discuté",
  "signataires": {
    "auteur": {
      "typeAuteur": "Depute",
      "acteurRef": "PA718930",
      "organeRef": {
        "@xmlns:xsi": "http://www.w3.org/2001/XMLSchema-instance",
        "@xsi:nil": "true"
      },
      "groupePolitiqueRef": "PO730964"
    },
    "cosignataires": {
      "acteurRef": "PA718930"
    },
    "texteAffichable": "Mme&#160;Petel"
  },
  "pointeurFragmentTexte": {
    "missionVisee": {
      "@xmlns:xsi": "http://www.w3.org/2001/XMLSchema-instance",
      "@xsi:nil": "true"
    },
    "division": {
      "titre": "Article 11",
      "articleDesignationCourte": "APRÈS ART. 11",
      "type": "ARTICLE",
      "avant_A_Apres": "Après",
      "divisionRattachee": "APRÈS L'ARTICLE 11, insérer l'article suivant:",
      "articleAdditionnel": "1",
      "chapitreAdditionnel": {
        "@xmlns:xsi": "http://www.w3.org/2001/XMLSchema-instance",
        "@xsi:nil": "true"
      },
      "urlDivisionTexteVise": "/15/textes/0627.asp#D_Article_11"
    },
    "alinea": {
      "@xmlns:xsi": "http://www.w3.org/2001/XMLSchema-instance",
      "@xsi:nil": "true"
    }
  },
  "corps": {
    "dispositif": "<p style=\"text-align: justify;\">Le Chapitre II du livre IV du Titre I<sup>er</sup> du code de la consommation est compl&#233;t&#233; par un article L.&#160;412- 7 ainsi r&#233;dig&#233;&#160;:</p><p style=\"text-align: justify;\">&#171;&#160;<i>Art.&#160;L.&#160;412&#8209;7</i>.&#160;&#8211;&#160;Sans pr&#233;judice des dispositions sp&#233;cifiques relatives &#224; l&#8217;&#233;tiquetage des denr&#233;es alimentaires, l&#8217;indication du mode d&#8217;&#233;levage est rendue obligatoire pour tous les produits issus de l&#8217;&#233;levage, et pour tous les produits issus de l&#8217;&#233;levage utilis&#233;s en tant qu&#8217;ingr&#233;dient dans les produits transform&#233;s, &#224; titre exp&#233;rimental pour une dur&#233;e de deux ans &#224; compter de l&#8217;entr&#233;e en vigueur de la pr&#233;sente disposition.</p><p style=\"text-align: justify;\">&#171;&#160;Les modalit&#233;s d&#8217;application de l&#8217;indication du mode d&#8217;&#233;levage mentionn&#233;e au premier alin&#233;a sont fix&#233;es par d&#233;cret en Conseil d&#8217;&#201;tat et conform&#233;ment &#224; la proc&#233;dure d&#233;finie &#224; l&#8217;article&#160;45 du r&#232;glement (UE) n&#176;&#160;1169/2011 du Parlement&#160;europ&#233;en et du Conseil du 25 octobre 2011 concernant l&#8217;information des consommateurs sur les denr&#233;es alimentaires, modifiant les r&#232;glements (CE) n&#176; 1924/2006 et (CE) n&#176; 1925/2006 du Parlement&#160;europ&#233;en et du Conseil et abrogeant la directive 87/250/ CEE de la Commission, la directive 90/496/ CEE du Conseil, la directive 1999/10/ CE de la Commission, la directive 2000/13/ CE du Parlement&#160;europ&#233;en et du Conseil, les directives 2002/67/ CE et 2008/5/ CE de la Commission et le r&#232;glement (CE) n&#176;&#160;608/2004 de la Commission.&#160;&#187;</p>",
    "exposeSommaire": "<p style=\"text-align: justify;\">L&#8217;objectif du pr&#233;sent amendement est de mettre en place une exp&#233;rimentation pour deux ans d&#8217;un &#233;tiquetage obligatoire de l&#8217;ensemble des produits issus de l&#8217;&#233;levage (carn&#233;s, laitiers et ovoproduits) afin d&#8217;informer le consommateur sur les modes d&#8217;&#233;levage</p><p style=\"text-align: justify;\">Les consommateurs accordent de plus en plus d&#8217;importance, au moment d&#8217;effectuer leurs achats, aux conditions d&#8217;&#233;levage. Cette tendance a &#233;t&#233; renforc&#233;e par les multiples crises sanitaires qui ont touch&#233; le secteur ces derni&#232;res ann&#233;es.</p><p style=\"text-align: justify;\">H&#233;las, il existe une v&#233;ritable confusion, parfois entretenue de mani&#232;re volontaire, sur le march&#233; des produits issus de l&#8217;&#233;levage. Ainsi, plusieurs &#233;tudes montrent que le consommateur est susceptible de mal interpr&#233;ter les informations dont il dispose sur l&#8217;emballage. Entre les images et les termes utilis&#233;s pour donner l&#8217;impression de &#171;&#160;ruralit&#233;&#160;&#187;, il est souvent difficile de faire la diff&#233;rence entre les produits mis sur le march&#233;. Il en est de m&#234;me pour le d&#233;veloppement de &#171;&#160;labels&#160;&#187; non r&#232;glement&#233;s, comme le &#171;&#160;sans antibiotique&#160;&#187; ou encore les labels &#171;&#160;bien-&#234;tre animal.&#160;&#187; En r&#233;sulte une perte de confiance des consommateurs qui se d&#233;tournent des productions fran&#231;aises, dans leur ensemble.</p><p style=\"text-align: justify;\">La r&#233;ponse qui a &#233;t&#233; donn&#233;e jusqu&#8217;&#224; pr&#233;sent est celle de l&#8217;&#233;tiquetage d&#8217;origine g&#233;ographique&#160;: obligatoire depuis plusieurs ann&#233;es pour les viandes fraiches, l&#8217;&#233;tiquetage de l&#8217;origine du lait et des viandes est &#233;galement obligatoire, &#224; titre exp&#233;rimental, pour toutes les denr&#233;es alimentaires contenant un pourcentage d&#233;termin&#233; de ces produits depuis le 1<sup>er</sup> janvier 2017. Mais force est de constater que ce dispositif, s&#8217;il est n&#233;cessaire pour encourager les fili&#232;res de proximit&#233; et doit &#234;tre p&#233;rennis&#233;, ne permet pas de mettre un terme &#224; la confusion ressentie par les consommateurs sur ces productions.</p><p style=\"text-align: justify;\">En effet, il ne permet pas de satisfaire la demande des consommateurs qui aspirent &#224; &#234;tre inform&#233; sur la fa&#231;on dont ont &#233;t&#233; &#233;lev&#233;s les animaux pour les produits issus de l&#8217;&#233;levage. Selon une &#233;tude r&#233;alis&#233;e par les instituts techniques de l&#8217;&#233;levage en France en 2016, dans le cadre du projet Casdar ACCEPT, les fran&#231;ais sont &#224; 96&#160;% favorables &#224; un &#233;tiquetage similaire &#224; celui des &#339;ufs pour la viande et les produits laitier.</p><p style=\"text-align: justify;\">Le levier de l&#8217;&#233;tiquetage est un outil fondamental pour permettre au consommateur d&#8217;orienter ses achats vers les produits plus respectueux du bien-&#234;tre animal. Il s&#8217;agit donc d&#8217;un levier incitatif, progressif, et compatible avec le fonctionnement du march&#233;.</p><p style=\"text-align: justify;\">Tout comme cela a &#233;t&#233; mis en place pour l&#8217;&#233;tiquetage de l&#8217;origine g&#233;ographique des produits laitiers et des produits transform&#233;s contenant de la viande, il est possible pour le l&#233;gislateur de mettre en place une exp&#233;rimentation d&#8217;un &#233;tiquetage non pr&#233;vu au niveau&#160;europ&#233;en, sous r&#233;serve d&#8217;acceptation par la Commission&#160;europ&#233;enne. C&#8217;est l&#8217;objet de cet amendement qui vise &#224; mettre en place une exp&#233;rimentation pour deux ans d&#8217;un &#233;tiquetage obligatoire de l&#8217;ensemble des produits issus de l&#8217;&#233;levage (carn&#233;s, laitiers et ovoproduits) afin d&#8217;informer le consommateur sur les modes d&#8217;&#233;levage, avant de pouvoir &#233;ventuellement envisager sa p&#233;rennisation dans le cadre du droit&#160;europ&#233;en.</p>",
    "annexeExposeSommaire": {
      "@xmlns:xsi": "http://www.w3.org/2001/XMLSchema-instance",
      "@xsi:nil": "true"
    }
  },
  "representations": {
    "representation": {
      "nom": "PDF",
      "typeMime": {
        "type": "application",
        "subType": "PDF"
      },
      "statutRepresentation": {
        "verbatim": "true",
        "canonique": "true",
        "officielle": "true",
        "transcription": "false",
        "enregistrement": "false"
      },
      "repSource": {
        "@xmlns:xsi": "http://www.w3.org/2001/XMLSchema-instance",
        "@xsi:nil": "true"
      },
      "offset": {
        "@xmlns:xsi": "http://www.w3.org/2001/XMLSchema-instance",
        "@xsi:nil": "true"
      },
      "contenu": {
        "documentURI": "/15/amendements/0627/CION-ECO/CE1657.pdf"
      },
      "dateDispoRepresentation": {
        "@xmlns:xsi": "http://www.w3.org/2001/XMLSchema-instance",
        "@xsi:nil": "true"
      }
    }
  },
  "seanceDiscussion": {
    "@xmlns:xsi": "http://www.w3.org/2001/XMLSchema-instance",
    "@xsi:nil": "true"
  },
  "sort": {
    "dateSaisie": "2018-04-19T16:34:31.000+02:00",
    "sortEnSeance": "Rejeté"
  },
  "dateDepot": "2018-04-13T02:00:00.000+02:00",
  "dateDistribution": "2018-04-17T02:00:00.000+02:00",
  "article99": "0",
  "loiReference": {
    "codeLoi": "consommation",
    "divisionCodeLoi": "L412-7"
  }
}