{
  "@xmlns": "http://schemas.assemblee-nationale.fr/referentiel",
  "uid": "AMANR5L15SEA717460BTC1212P0D1N170",
  "identifiant": {
    "legislature": "15",
    "numero": "170",
    "numRect": "0",
    "saisine": {
      "refTexteLegislatif": "PRJLANR5L15BTC1212",
      "numeroPartiePLF": "0",
      "organeExamen": "PO717460",
      "mentionSecondeDeliberation": "0"
    }
  },
  "numeroLong": "170",
  "etapeTexte": "1ère lecture (2ème assemblée saisie)",
  "triAmendement": "biaaaaaaaaaaaaaaaaaaaaaaaaaaaaaaaaaaaaaaaaaaaaaaaah",
  "cardinaliteAmdtMultiples": "1",
  "amendementParent": {
    "@xmlns:xsi": "http://www.w3.org/2001/XMLSchema-instance",
    "@xsi:nil": "true"
  },
  "etat": "Discuté",
  "signataires": {
    "auteur": {
      "typeAuteur": "Depute",
      "acteurRef": "PA1838",
      "organeRef": {
        "@xmlns:xsi": "http://www.w3.org/2001/XMLSchema-instance",
        "@xsi:nil": "true"
      },
      "groupePolitiqueRef": "PO723569"
    },
    "cosignataires": {
      "acteurRef": "PA1838"
    },
    "texteAffichable": "M.&#160;Lassalle"
  },
  "pointeurFragmentTexte": {
    "missionVisee": {
      "@xmlns:xsi": "http://www.w3.org/2001/XMLSchema-instance",
      "@xsi:nil": "true"
    },
    "division": {
      "titre": "Article 3",
      "articleDesignationCourte": "ART. 3",
      "type": "ARTICLE",
      "avant_A_Apres": "A",
      "divisionRattachee": "ARTICLE 3",
      "articleAdditionnel": {
        "@xmlns:xsi": "http://www.w3.org/2001/XMLSchema-instance",
        "@xsi:nil": "true"
      },
      "chapitreAdditionnel": {
        "@xmlns:xsi": "http://www.w3.org/2001/XMLSchema-instance",
        "@xsi:nil": "true"
      },
      "urlDivisionTexteVise": "/15/textes/1212.asp#D_Article_3"
    },
    "alinea": {
      "avant_A_Apres": {
        "@xmlns:xsi": "http://www.w3.org/2001/XMLSchema-instance",
        "@xsi:nil": "true"
      },
      "numero": "9",
      "alineaDesignation": {
        "@xmlns:xsi": "http://www.w3.org/2001/XMLSchema-instance",
        "@xsi:nil": "true"
      }
    }
  },
  "corps": {
    "dispositif": "<p>Supprimer l'alin&#233;a 9.</p>",
    "exposeSommaire": "<p style=\"text-align: justify;\">Cet amendement supprime l&#8217;article L.&#160;135 ZK qui &#233;tend le droit d&#8217;acc&#232;s aux fichiers nominatifs d&#233;tenus par l&#8217;administration fiscale (fichier des comptes bancaires, fichiers des assurances-vie, informations relatives aux mutations immobili&#232;res&#8230;) &#224; certains agents de contr&#244;le de l&#8217;inspection du travail, des URSSAF et des caisses de s&#233;curit&#233; sociale et de mutualit&#233; sociale agricole dans le cadre de leurs missions de lutte contre la fraude. En effet, cette disposition conduirait &#224; la diffusion large et incontr&#244;l&#233;e, et au recoupement massif, d&#8217;informations nominatives sensibles couvertes par le secret fiscal, de nature &#224; porter une atteinte disproportionn&#233;e au principe de protection de la vie priv&#233;e. Aucune justification pertinente ne vient d&#233;montrer la n&#233;cessit&#233; d&#8217;une ing&#233;rence de ce niveau, &#233;tant observ&#233; que les agents concern&#233;s b&#233;n&#233;ficient d&#233;j&#224; d&#8217;un acc&#232;s nominatif sur demande, qui permet de concilier d&#8217;une mani&#232;re satisfaisante efficacit&#233; de l&#8217;enqu&#234;te et protection d&#8217;informations nominatives sensibles couvertes par le secret fiscal. Le Conseil d&#8217;&#201;tat a rappel&#233; que l&#8217;&#233;tude d&#8217;impact dans son &#233;tat actuel ne justifie pas suffisamment ce dispositif d&#8217;acc&#232;s direct aux informations contenues dans les fichiers de l&#8217;administration fiscale.</p>",
    "annexeExposeSommaire": {
      "@xmlns:xsi": "http://www.w3.org/2001/XMLSchema-instance",
      "@xsi:nil": "true"
    }
  },
  "representations": {
    "representation": {
      "nom": "PDF",
      "typeMime": {
        "type": "application",
        "subType": "PDF"
      },
      "statutRepresentation": {
        "verbatim": "true",
        "canonique": "true",
        "officielle": "true",
        "transcription": "false",
        "enregistrement": "false"
      },
      "repSource": {
        "@xmlns:xsi": "http://www.w3.org/2001/XMLSchema-instance",
        "@xsi:nil": "true"
      },
      "offset": {
        "@xmlns:xsi": "http://www.w3.org/2001/XMLSchema-instance",
        "@xsi:nil": "true"
      },
      "contenu": {
        "documentURI": "/15/amendements/1212/AN/170.pdf"
      },
      "dateDispoRepresentation": {
        "@xmlns:xsi": "http://www.w3.org/2001/XMLSchema-instance",
        "@xsi:nil": "true"
      }
    }
  },
  "seanceDiscussion": "RUANR5L15S2018IDS21238",
  "sort": {
    "dateSaisie": "2018-09-17T19:52:15.000+02:00",
    "sortEnSeance": "Non soutenu"
  },
  "dateDepot": "2018-09-13T02:00:00.000+02:00",
  "dateDistribution": "2018-09-14T02:00:00.000+02:00",
  "article99": "0",
  "loiReference": {
    "codeLoi": {
      "@xmlns:xsi": "http://www.w3.org/2001/XMLSchema-instance",
      "@xsi:nil": "true"
    },
    "divisionCodeLoi": {
      "@xmlns:xsi": "http://www.w3.org/2001/XMLSchema-instance",
      "@xsi:nil": "true"
    }
  }
}