{
  "@xmlns": "http://schemas.assemblee-nationale.fr/referentiel",
  "uid": "AMANR5L15SEA717460BTC1629P0D1N582",
  "identifiant": {
    "legislature": "15",
    "numero": "582",
    "numRect": "0",
    "saisine": {
      "refTexteLegislatif": "PRJLANR5L15BTC1629",
      "numeroPartiePLF": "0",
      "organeExamen": "PO717460",
      "mentionSecondeDeliberation": "1"
    }
  },
  "numeroLong": "582",
  "etapeTexte": "1ère lecture (1ère assemblée saisie)",
  "triAmendement": "ebaaaaaaaaaaaaaaaaaaaaaaaaaaaaaaaaaaaaaaaaaaaaaaaaabo",
  "cardinaliteAmdtMultiples": "1",
  "amendementParent": {
    "@xmlns:xsi": "http://www.w3.org/2001/XMLSchema-instance",
    "@xsi:nil": "true"
  },
  "etat": "Discuté",
  "signataires": {
    "auteur": {
      "typeAuteur": "Depute",
      "acteurRef": "PA721960",
      "organeRef": {
        "@xmlns:xsi": "http://www.w3.org/2001/XMLSchema-instance",
        "@xsi:nil": "true"
      },
      "groupePolitiqueRef": "PO730958"
    },
    "cosignataires": {
      "acteurRef": [
        "PA721210",
        "PA588884",
        "PA718868",
        "PA720422",
        "PA720892",
        "PA720430",
        "PA721202",
        "PA718860",
        "PA721960",
        "PA719676",
        "PA720846",
        "PA720286",
        "PA721062",
        "PA722142",
        "PA721226",
        "PA2150",
        "PA719578"
      ]
    },
    "texteAffichable": "Mme&#160;Obono,  Mme&#160;Autain, M.&#160;Bernalicis, M.&#160;Coquerel, M.&#160;Corbi&#232;re, Mme&#160;Fiat, M.&#160;Lachaud, M.&#160;Larive, M.&#160;M&#233;lenchon, Mme&#160;Panot, M.&#160;Prud&apos;homme, M.&#160;Quatennens, M.&#160;Ratenon, Mme&#160;Ressiguier, Mme&#160;Rubin, M.&#160;Ruffin et Mme&#160;Taurine"
  },
  "pointeurFragmentTexte": {
    "missionVisee": {
      "@xmlns:xsi": "http://www.w3.org/2001/XMLSchema-instance",
      "@xsi:nil": "true"
    },
    "division": {
      "titre": "Article 8",
      "articleDesignationCourte": "APRÈS ART. 8",
      "type": "ARTICLE",
      "avant_A_Apres": "Après",
      "divisionRattachee": "APRÈS L'ARTICLE 8, insérer la division et l'intitulé suivants:",
      "articleAdditionnel": {
        "@xmlns:xsi": "http://www.w3.org/2001/XMLSchema-instance",
        "@xsi:nil": "true"
      },
      "chapitreAdditionnel": "1",
      "urlDivisionTexteVise": "/15/textes/1629.asp#D_Article_8"
    },
    "alinea": {
      "@xmlns:xsi": "http://www.w3.org/2001/XMLSchema-instance",
      "@xsi:nil": "true"
    }
  },
  "corps": {
    "dispositif": "<p style=\"text-align: justify;\">&#171;&#160;Chapitre II <i>bis</i></p><p style=\"text-align: justify;\">&#171;&#160;Renouveler la confiance dans l&#8217;&#233;cole en assurant le bien-&#234;tre des &#233;l&#232;ves</p><p style=\"text-align: justify;\">&#171;&#160;Art XX</p><p style=\"text-align: justify;\">&#171;&#160;I.&#160;&#8211;&#160;&#192; titre exp&#233;rimental, pour une dur&#233;e de trois ans, le Gouvernement peut, dans des acad&#233;mies qu&#8217;il identifie comme &#233;tant pertinentes au regard des difficult&#233;s cumul&#233;es qu&#8217;elles rencontrent, d&#233;cider que le nombre total des &#233;l&#232;ves scolaris&#233;s au sein d&#8217;une classe des &#233;coles pr&#233;&#233;l&#233;mentaires et &#233;l&#233;mentaires des &#233;tablissements d&#8217;enseignement public, des lyc&#233;es professionnels et des lyc&#233;es d&#8217;enseignement technologique ne peut &#234;tre sup&#233;rieur &#224; vingt, et que le nombre total des &#233;l&#232;ves scolaris&#233;s au sein d&#8217;une classe des lyc&#233;es d&#8217;enseignement g&#233;n&#233;ral ne peut &#234;tre sup&#233;rieur &#224; vingt-cinq.</p><p style=\"text-align: justify;\">&#171;&#160;Le nombre minimal d&#8217;enseignants par classe des &#233;coles pr&#233;&#233;l&#233;mentaires et &#233;l&#233;mentaires, peut &#234;tre &#233;tabli &#224; deux.</p><p style=\"text-align: justify;\">&#171;&#160;II.&#160;&#8211;&#160;Un rapport d&#8217;&#233;valuation peut &#234;tre r&#233;alis&#233; au terme de l&#8217;exp&#233;rimentation et faire l&#8217;objet d&#8217;une transmission au Parlement par le Gouvernement.&#160;&#187;</p>",
    "exposeSommaire": "<p>&#171;&#160;Le nombre d&#8217;enfants par classe ne cesse d&#8217;augmenter. Or nous savons par de nombreuses &#233;tudes que le nombre d&#8217;enfants par classe est &#233;troitement corr&#233;l&#233; &#224; l&#8217;&#233;chec scolaire. Les classes surcharg&#233;es emp&#234;chent aux enseignant&#183;e&#183;s de s&#8217;assurer que l&#8217;ensemble des &#233;l&#232;ves suivent le cours. Elles nuisent &#224; la concentration. Les violences scolaires n&#8217;en sont que plus vives.</p><p style=\"text-align: justify;\">Pourtant, l&#8217;&#233;cole publique devrait &#234;tre un lieu ouvert o&#249; chacun et chacune cultive le bonheur d&#8217;apprendre. Le pr&#233;sent amendement propose donc la mise en place d&#8217;une exp&#233;rimentation limitant le nombre d&#8217;enfants par classe &#224; 20 dans les &#233;coles pr&#233;&#233;l&#233;mentaires et &#233;l&#233;mentaires, dans les &#233;tablissements d&#8217;enseignement publics et dans les lyc&#233;es professionnels et les lyc&#233;es d&#8217;enseignement technologique. Cette limite est port&#233;e &#224; 25 pour les lyc&#233;es d&#8217;enseignement g&#233;n&#233;ral. Le nombre d&#8217;enseignants par classe dans les &#233;coles maternelles et &#233;l&#233;mentaires pourra quant &#224; lui &#234;tre fix&#233; &#224; deux a minima.</p><p style=\"text-align: justify;\">Pierre Bourdieu a su d&#233;montrer en quoi l&#8217;&#233;cole privil&#233;gie une culture dite l&#233;gitime, qui reproduit les hi&#233;rarchies sociales. Cours particuliers le soir, aide au devoir, d&#233;penses scolaires importantes, loisirs culturels, aide &#224; l&#8217;orientation&#8230; les classes sociales ais&#233;es d&#233;tiennent souvent davantage de leviers pour faire en sorte que leurs enfants r&#233;ussissent &#224; l&#8217;&#233;cole. Par cons&#233;quent, les &#233;l&#232;ves d&#8217;origine sociale d&#233;favoris&#233;e ont plus de probabilit&#233; d&#8217;&#234;tre en &#233;chec scolaire que les autres &#233;l&#232;ves et les in&#233;galit&#233;s ne cessent de se creuser. La reproduction des in&#233;galit&#233;s sociales nourrit les st&#233;r&#233;otypes associ&#233;s &#224; l&#8217;origine familiale des &#233;l&#232;ves ce qui aggravent encore les difficult&#233;s scolaires. C&#8217;est pourquoi nous proposons que cette exp&#233;rimentation ait lieu dans un premier temps dans les d&#233;partements qui connaissent le plus de difficult&#233;s sociales comme en Seine-Saint-Denis par exemple.</p>",
    "annexeExposeSommaire": {
      "@xmlns:xsi": "http://www.w3.org/2001/XMLSchema-instance",
      "@xsi:nil": "true"
    },
    "cartoucheDelaiDepotDepasse": {
      "@xmlns:xsi": "http://www.w3.org/2001/XMLSchema-instance",
      "@xsi:nil": "true"
    }
  },
  "representations": {
    "representation": {
      "nom": "PDF",
      "typeMime": {
        "type": "application",
        "subType": "PDF"
      },
      "statutRepresentation": {
        "verbatim": "true",
        "canonique": "true",
        "officielle": "true",
        "transcription": "false",
        "enregistrement": "false"
      },
      "repSource": {
        "@xmlns:xsi": "http://www.w3.org/2001/XMLSchema-instance",
        "@xsi:nil": "true"
      },
      "offset": {
        "@xmlns:xsi": "http://www.w3.org/2001/XMLSchema-instance",
        "@xsi:nil": "true"
      },
      "contenu": {
        "documentURI": "/15/amendements/1629/AN/582.pdf"
      },
      "dateDispoRepresentation": {
        "@xmlns:xsi": "http://www.w3.org/2001/XMLSchema-instance",
        "@xsi:nil": "true"
      }
    }
  },
  "seanceDiscussion": "RUANR5L15S2019IDS21507",
  "sort": {
    "dateSaisie": "2019-02-15T16:59:46.000+01:00",
    "sortEnSeance": "Rejeté"
  },
  "dateDepot": "2019-02-07T01:00:00.000+01:00",
  "dateDistribution": "2019-02-11T01:00:00.000+01:00",
  "article99": "0",
  "loiReference": {
    "codeLoi": {
      "@xmlns:xsi": "http://www.w3.org/2001/XMLSchema-instance",
      "@xsi:nil": "true"
    },
    "divisionCodeLoi": {
      "@xmlns:xsi": "http://www.w3.org/2001/XMLSchema-instance",
      "@xsi:nil": "true"
    }
  }
}