{
  "@xmlns": "http://schemas.assemblee-nationale.fr/referentiel",
  "uid": "AMANR5L15SEA717460B0499P0D1N28",
  "identifiant": {
    "legislature": "15",
    "numero": "28",
    "numRect": "0",
    "saisine": {
      "refTexteLegislatif": "PRJLANR5L15B0499",
      "numeroPartiePLF": "0",
      "organeExamen": "PO717460",
      "mentionSecondeDeliberation": "1"
    }
  },
  "numeroLong": "28",
  "etapeTexte": "Nouvelle Lecture",
  "triAmendement": "bb",
  "cardinaliteAmdtMultiples": "1",
  "amendementParent": {
    "@xmlns:xsi": "http://www.w3.org/2001/XMLSchema-instance",
    "@xsi:nil": "true"
  },
  "etat": "Discuté",
  "signataires": {
    "auteur": {
      "typeAuteur": "Depute",
      "acteurRef": "PA609245",
      "organeRef": {
        "@xmlns:xsi": "http://www.w3.org/2001/XMLSchema-instance",
        "@xsi:nil": "true"
      },
      "groupePolitiqueRef": "PO730934"
    },
    "cosignataires": {
      "acteurRef": "PA609245"
    },
    "texteAffichable": "Mme&#160;Lacroute"
  },
  "pointeurFragmentTexte": {
    "missionVisee": {
      "@xmlns:xsi": "http://www.w3.org/2001/XMLSchema-instance",
      "@xsi:nil": "true"
    },
    "division": {
      "titre": "Article 17",
      "articleDesignationCourte": "ART. 17",
      "type": "ARTICLE",
      "avant_A_Apres": "A",
      "divisionRattachee": "ARTICLE 17",
      "articleAdditionnel": {
        "@xmlns:xsi": "http://www.w3.org/2001/XMLSchema-instance",
        "@xsi:nil": "true"
      },
      "chapitreAdditionnel": {
        "@xmlns:xsi": "http://www.w3.org/2001/XMLSchema-instance",
        "@xsi:nil": "true"
      },
      "urlDivisionTexteVise": "/15/textes/0499.asp#D_Article_17"
    },
    "alinea": {
      "avant_A_Apres": {
        "@xmlns:xsi": "http://www.w3.org/2001/XMLSchema-instance",
        "@xsi:nil": "true"
      },
      "numero": "34",
      "alineaDesignation": {
        "@xmlns:xsi": "http://www.w3.org/2001/XMLSchema-instance",
        "@xsi:nil": "true"
      }
    }
  },
  "corps": {
    "dispositif": "<p style=\"text-align: justify;\">I.&#160;&#8211;&#160;&#192; l&#8217;alin&#233;a&#160;34, apr&#232;s le mot&#160;:</p><p style=\"text-align: justify;\">&#171;&#160;d&#233;termination&#160;,</p><p style=\"text-align: justify;\">ins&#233;rer les mots&#160;:</p><p style=\"text-align: justify;\">&#171;&#160;des param&#232;tres d&#8217;&#233;valuation&#160;&#187;.</p><p style=\"text-align: justify;\">II.&#160;&#8211;&#160;En cons&#233;quence, substituer aux alin&#233;as 53 &#224; 55 l&#8217;alin&#233;a suivant&#160;:</p><p style=\"text-align: justify;\">&#171;&#160;11&#176; &#192; la premi&#232;re phrase du dernier alin&#233;a de l&#8217;article&#160;1505, le mot&#160;: &#171;&#160;&#224;&#160;&#187; est remplac&#233; par les mots&#160;: &#171;&#160;au I de&#160;&#187;.</p>",
    "exposeSommaire": "<p style=\"text-align: justify;\">Cet amendement vise &#224; r&#233;introduire les avis des commissions communales et intercommunales des imp&#244;ts directs (CCID et CIID), ainsi qu&#8217;&#224; expliciter le r&#244;le de l&#8217;administration fiscale dans la proc&#233;dure d&#8217;&#233;valuation des bases des locaux professionnels.</p><p style=\"text-align: justify;\">En effet, la proc&#233;dure d&#8217;&#233;valuation des locaux professionnels, telle que codifi&#233;e par l&#8217;article&#160;17 du PLFR 2 pour 2017, pr&#233;voit que les valeurs locatives des locaux professionnels soient fix&#233;es automatiquement &#224; partir des d&#233;clarations des professionnels (modification physique du local ou changement d&#8217;utilisation par exemple) et des param&#232;tres d&#8217;&#233;valuation. Dans la proc&#233;dure r&#233;vis&#233;e il n&#8217;est plus question ni de l&#8217;appr&#233;ciation des services fiscaux qui re&#231;oivent les d&#233;clarations des propri&#233;taires, ni de l&#8217;avis des commissions communales et intercommunales des imp&#244;ts directs sur les modifications des locaux &#224; travers les listes 41.</p><p style=\"text-align: justify;\">Ce changement d&#8217;approche dans la proc&#233;dure d&#8217;&#233;valuation pose des difficult&#233;s. La r&#233;vision des valeurs locatives entr&#233;e en vigueur au 1<sup>er</sup> janvier 2017 montre que d&#8217;importantes anomalies ont &#233;t&#233; incorpor&#233;es dans les bases fiscales, anomalies qu&#8217;un contr&#244;le de coh&#233;rence de la part des services fiscaux aurait permis d&#8217;&#233;viter (surfaces d&#233;clar&#233;es manifestement disproportionn&#233;es, erreur du d&#233;clarant dans le choix de la cat&#233;gorie de local par exemple). Ces anomalies, dans certains cas, donneront lieu &#224; des rectifications et pourront repr&#233;senter des pertes de produit fiscal pour les collectivit&#233;s. Il est donc important de r&#233;affirmer le r&#244;le de l&#8217;administration qui re&#231;oit les d&#233;clarations et incorpore les modifications des locaux dans les bases fiscales.</p><p style=\"text-align: justify;\">La mise &#224; l&#8217;&#233;cart des CCID et CIID dans les proc&#233;dures d&#8217;&#233;valuation des locaux professionnels repr&#233;sente une perte importante pour les collectivit&#233;s &#224; plusieurs titres.</p><p style=\"text-align: justify;\">D&#8217;abord, &#224; l&#8217;heure o&#249; de nombreux territoires constatent une d&#233;gradation de la base cadastrale et l&#8217;absence d&#8217;exhaustivit&#233; des valeurs locatives impos&#233;es, on ne peut se passer de la participation des CCID et CIID, dont les commissaires poss&#232;dent une bonne connaissance du terrain et ma&#238;trisent les autorisations d&#8217;urbanismes d&#233;livr&#233;es par la collectivit&#233;.</p><p style=\"text-align: justify;\">Ensuite, la participation des CCID et CIID permettrait de fiabiliser juridiquement les bases des locaux professionnels avant leur int&#233;gration au cadastre. Les param&#232;tres d&#8217;&#233;valuation des locaux sont d&#233;finis bri&#232;vement dans la notice annex&#233;e au formulaire de d&#233;claration mais des incertitudes persistent sur le choix des cat&#233;gories ou la r&#233;partition des surfaces principales et secondaires des locaux. Gr&#226;ce &#224; leur connaissance du tissu &#233;conomique les commissaires peuvent &#233;mettre un avis sur les cat&#233;gories de locaux choisies par les d&#233;clarants, ou la ventilation des surfaces d&#233;clar&#233;es, param&#232;tres qui ont un impact sur le niveau des bases impos&#233;es. Les commissaires peuvent &#233;galement signaler &#224; l&#8217;administration fiscale d&#8217;&#233;ventuelles d&#233;marches d&#8217;optimisation des d&#233;clarants visant &#224; supprimer les m&#233;canismes att&#233;nuateurs sur des valeurs locatives en baisse.</p><p style=\"text-align: justify;\">Enfin, les travaux des CCID et CIID permettent aux collectivit&#233;s de mieux pr&#233;voir les recettes de la collectivit&#233; et de participer &#224; la fiabilisation des bases avant leur int&#233;gration &#224; la base cadastrale et aux r&#244;les des imp&#244;ts directs locaux.</p><p style=\"text-align: justify;\">Le r&#244;le des CCID et CIID doit donc &#234;tre r&#233;int&#233;gr&#233; dans la proc&#233;dure d&#8217;&#233;valuation des locaux professionnels en syst&#232;me r&#233;vis&#233;, et ce ind&#233;pendamment de la consultation des commissions pour la mise &#224; jour des param&#232;tres d&#8217;&#233;valuation.</p>",
    "annexeExposeSommaire": {
      "@xmlns:xsi": "http://www.w3.org/2001/XMLSchema-instance",
      "@xsi:nil": "true"
    }
  },
  "representations": {
    "representation": {
      "nom": "PDF",
      "typeMime": {
        "type": "application",
        "subType": "PDF"
      },
      "statutRepresentation": {
        "verbatim": "true",
        "canonique": "true",
        "officielle": "true",
        "transcription": "false",
        "enregistrement": "false"
      },
      "repSource": {
        "@xmlns:xsi": "http://www.w3.org/2001/XMLSchema-instance",
        "@xsi:nil": "true"
      },
      "offset": {
        "@xmlns:xsi": "http://www.w3.org/2001/XMLSchema-instance",
        "@xsi:nil": "true"
      },
      "contenu": {
        "documentURI": "/15/amendements/0499/AN/28.pdf"
      },
      "dateDispoRepresentation": {
        "@xmlns:xsi": "http://www.w3.org/2001/XMLSchema-instance",
        "@xsi:nil": "true"
      }
    }
  },
  "seanceDiscussion": "RUANR5L15S2018IDS20849",
  "sort": {
    "dateSaisie": "2017-12-20T00:17:06.000+01:00",
    "sortEnSeance": "Rejeté"
  },
  "dateDepot": "2017-12-18T01:00:00.000+01:00",
  "dateDistribution": "2017-12-18T01:00:00.000+01:00",
  "article99": "0",
  "loiReference": {
    "codeLoi": {
      "@xmlns:xsi": "http://www.w3.org/2001/XMLSchema-instance",
      "@xsi:nil": "true"
    },
    "divisionCodeLoi": {
      "@xmlns:xsi": "http://www.w3.org/2001/XMLSchema-instance",
      "@xsi:nil": "true"
    }
  }
}