{
  "@xmlns": "http://schemas.assemblee-nationale.fr/referentiel",
  "uid": "AMANR5L15PO59048B0235P2D1N292",
  "identifiant": {
    "legislature": "15",
    "numero": "292",
    "numRect": "0",
    "saisine": {
      "refTexteLegislatif": "PRJLANR5L15B0235",
      "numeroPartiePLF": "2",
      "organeExamen": "PO59048",
      "mentionSecondeDeliberation": "0"
    }
  },
  "numeroLong": "II-CF292",
  "etapeTexte": "1ère lecture (1ère assemblée saisie)",
  "triAmendement": "abzzykki",
  "cardinaliteAmdtMultiples": "1",
  "amendementParent": {
    "@xmlns:xsi": "http://www.w3.org/2001/XMLSchema-instance",
    "@xsi:nil": "true"
  },
  "etat": "Discuté",
  "signataires": {
    "auteur": {
      "typeAuteur": "Depute",
      "acteurRef": "PA720230",
      "organeRef": {
        "@xmlns:xsi": "http://www.w3.org/2001/XMLSchema-instance",
        "@xsi:nil": "true"
      },
      "groupePolitiqueRef": "PO730952"
    },
    "cosignataires": {
      "acteurRef": [
        "PA267330",
        "PA721094",
        "PA642935",
        "PA693008",
        "PA720230",
        "PA331567",
        "PA267780",
        "PA1960",
        "PA268019",
        "PA267766",
        "PA942",
        "PA333421",
        "PA267585",
        "PA719806",
        "PA266788",
        "PA702052",
        "PA642868",
        "PA712014",
        "PA332228"
      ]
    },
    "texteAffichable": "Mme&#160;Magnier,  M.&#160;Charles&#160;de Courson, M.&#160;Vercamer, M.&#160;Leroy, Mme&#160;Firmin Le Bodo, Mme&#160;Sage, Mme&#160;Auconie, M.&#160;Ledoux, M.&#160;Morel-&#192;-L&apos;Huissier, M.&#160;Zumkeller, Mme&#160;de La Raudi&#232;re, M.&#160;Benoit, M.&#160;Lagarde, M.&#160;Becht, M.&#160;Christophe, M.&#160;Dunoyer, M.&#160;Polutele, M.&#160;Pancher et M.&#160;Guy&#160;Bricout"
  },
  "pointeurFragmentTexte": {
    "missionVisee": {
      "@xmlns:xsi": "http://www.w3.org/2001/XMLSchema-instance",
      "@xsi:nil": "true"
    },
    "division": {
      "titre": "Article 45",
      "articleDesignationCourte": "APRÈS ART. 45",
      "type": "ARTICLE",
      "avant_A_Apres": "Après",
      "divisionRattachee": "APRÈS L'ARTICLE 45, insérer l'article suivant:",
      "articleAdditionnel": "1",
      "chapitreAdditionnel": {
        "@xmlns:xsi": "http://www.w3.org/2001/XMLSchema-instance",
        "@xsi:nil": "true"
      },
      "urlDivisionTexteVise": "/15/textes/0235C.asp#D_Article_45"
    },
    "alinea": {
      "@xmlns:xsi": "http://www.w3.org/2001/XMLSchema-instance",
      "@xsi:nil": "true"
    }
  },
  "corps": {
    "dispositif": "<p>I.&#160;&#8211;&#160;Le code g&#233;n&#233;ral des imp&#244;ts est ainsi modifi&#233;&#160;:</p><p>1&#176;&#160;Apr&#232;s le premier alin&#233;a de l&#8217;article&#160;1499, il est ins&#233;r&#233; un alin&#233;a ainsi r&#233;dig&#233;&#160;:</p><p>&#171; Est regard&#233; comme constituant une immobilisation industrielle au sens du pr&#233;sent article tout terrain, ouvrage ou b&#226;timent affect&#233; &#224; une activit&#233; de fabrication ou de transformation m&#233;canique de produits ou mati&#232;res, ainsi que ceux dans lesquels sont rendues des prestations de service &#224; la condition que le r&#244;le de l&#8217;outillage et de la force m&#233;canique y soit pr&#233;pond&#233;rant. La pr&#233;pond&#233;rance est r&#233;put&#233;e satisfaite lorsque le prix de revient d&#8217;origine des mat&#233;riels et outillages, n&#233;cessaires &#224; l&#8217;exploitation du site, repr&#233;sente au moins 50% d&#8217;un total constitu&#233; de ces m&#234;mes immobilisations et du prix de revient des immobilisations fonci&#232;res inscrites au bilan du propri&#233;taire de l&#8217;immeuble ou de l&#8217;exploitant s&#8217;il est diff&#233;rent.</p><p>En cas de changement d&#8217;occupant, le nouvel exploitant ou le propri&#233;taire, s&#8217;il est diff&#233;rent, adresse au cadastre dont d&#233;pend l&#8217;immeuble une d&#233;claration sur papier libre donnant les r&#233;sultats du ratio pr&#233;cit&#233; pour justifier le maintien de l&#8217;&#233;valuation comptable. Dans le cas contraire, cette d&#233;claration devra &#234;tre accompagn&#233;e d&#8217;une d&#233;claration 6660 REV pour qu&#8217;une nouvelle &#233;valuation en m&#233;thode comparative soit d&#233;termin&#233;e. &#187;</p><p>II. La perte de recettes pour les collectivit&#233;s territoriales est compens&#233;e &#224; due concurrence par la majoration de la dotation globale de fonctionnement et, corr&#233;lativement pour l&#8217;&#201;tat, par la cr&#233;ation d&#8217;une taxe additionnelle aux droits mentionn&#233;s aux articles 575 et 575 A du code g&#233;n&#233;ral des imp&#244;ts.</p><p>III.&#160;&#8211;&#160;Les dispositions du I entrent en vigueur au 1er janvier 2018.</p><p>&#160;</p>",
    "exposeSommaire": "<p>&#160;</p><p>Lors des discussions budg&#233;taires de fin d&#8217;ann&#233;e derni&#232;re, l&#8217;attention du Parlement et du gouvernement avait &#233;t&#233; appel&#233;e sur les difficult&#233;s r&#233;sultant de l&#8217;impr&#233;cision de l&#8217;article&#160;1499 du code g&#233;n&#233;ral des imp&#244;ts qui d&#233;finit le r&#233;gime applicable aux immobilisations industrielles en mati&#232;re de taxes fonci&#232;res.</p><p>Faute de d&#233;finition l&#233;gale de la notion d&#8217;immobilisation industrielle, l&#8217;administration fiscale en fait une interpr&#233;tation extensible, et al&#233;atoire. S&#8217;appuyant sur le flou de cette notion, elle multiplie les requalifications en immobilisation industrielle d&#8217;entrep&#244;ts ou de b&#226;timents de stockage de produits agricoles ou manufactur&#233;s, au seul motif qu&#8217;y sont utilis&#233;s chariots &#233;l&#233;vateurs, monte-charges et autres outils destin&#233;s &#224; faciliter le travail des salari&#233;s et en limiter la p&#233;nibilit&#233;, alors m&#234;me qu&#8217;aucune transformation n&#8217;est apport&#233;e aux marchandises.</p><p>Toutes les entreprises sont aujourd&#8217;hui soumises &#224; cette incertitude, quelle qu&#8217;en soit la taille, jusque et y compris les entreprises artisanales. Cette situation impose une clarification l&#233;gislative permettant d&#8217;encadrer l&#8217;action des corps de contr&#244;le et de d&#233;finir avec pr&#233;cision, et de fa&#231;on certaine, le r&#233;gime fiscal de l&#8217;article 1499 CGI.&#160;</p><p>Les cons&#233;quences de l&#8217;absence de clart&#233; sur les crit&#232;res de qualification, ou de requalification, s&#8217;av&#232;rent, en effet, particuli&#232;rement lourdes. D&#8217;une part, la requalification en immobilisation industrielle entraine une augmentation de taxes fonci&#232;res pouvant d&#233;passer les 300%. D&#8217;autre part, alors m&#234;me que le redevable est objectivement de bonne foi, elle s&#8217;accompagne de r&#233;gularisations r&#233;troactives pouvant courir sur plusieurs ann&#233;es. Enfin, elle place les entreprises concern&#233;es devant l&#8217;obligation de provisionner ce risque, pour le cas o&#249;.</p><p>Le pr&#233;sent amendement vise donc, en apportant une d&#233;finition claire de la notion d&#8217;immobilisation industrielle, &#224; lever une incertitude qui p&#232;se lourdement sur l&#8217;attractivit&#233; du site France.</p>",
    "annexeExposeSommaire": {
      "@xmlns:xsi": "http://www.w3.org/2001/XMLSchema-instance",
      "@xsi:nil": "true"
    }
  },
  "representations": {
    "representation": {
      "nom": "PDF",
      "typeMime": {
        "type": "application",
        "subType": "PDF"
      },
      "statutRepresentation": {
        "verbatim": "true",
        "canonique": "true",
        "officielle": "true",
        "transcription": "false",
        "enregistrement": "false"
      },
      "repSource": {
        "@xmlns:xsi": "http://www.w3.org/2001/XMLSchema-instance",
        "@xsi:nil": "true"
      },
      "offset": {
        "@xmlns:xsi": "http://www.w3.org/2001/XMLSchema-instance",
        "@xsi:nil": "true"
      },
      "contenu": {
        "documentURI": "/15/amendements/0235C/CION_TOUTE/CF292.pdf"
      },
      "dateDispoRepresentation": {
        "@xmlns:xsi": "http://www.w3.org/2001/XMLSchema-instance",
        "@xsi:nil": "true"
      }
    }
  },
  "seanceDiscussion": {
    "@xmlns:xsi": "http://www.w3.org/2001/XMLSchema-instance",
    "@xsi:nil": "true"
  },
  "sort": {
    "dateSaisie": {
      "@xmlns:xsi": "http://www.w3.org/2001/XMLSchema-instance",
      "@xsi:nil": "true"
    },
    "sortEnSeance": "Retiré"
  },
  "dateDepot": "2017-10-31T01:00:00.000+01:00",
  "dateDistribution": "2017-11-09T01:00:00.000+01:00",
  "article99": "0",
  "loiReference": {
    "codeLoi": "impôts",
    "divisionCodeLoi": "1499"
  }
}