{
  "@xmlns": "http://schemas.assemblee-nationale.fr/referentiel",
  "uid": "AMANR5L15SEA717460B2272P1D1N1634",
  "identifiant": {
    "legislature": "15",
    "numero": "1634",
    "numRect": "0",
    "saisine": {
      "refTexteLegislatif": "PRJLANR5L15B2272",
      "numeroPartiePLF": "1",
      "organeExamen": "PO717460",
      "mentionSecondeDeliberation": "0"
    }
  },
  "numeroLong": "I-1634",
  "etapeTexte": "1ère lecture (1ère assemblée saisie)",
  "triAmendement": "baaaaaaaaaaaaaaaaaaaaaaaaaaaaaaaaaaaaaaaaaaaaaaaaaagozzukkkkzzzzzi",
  "cardinaliteAmdtMultiples": "1",
  "amendementParent": {
    "@xmlns:xsi": "http://www.w3.org/2001/XMLSchema-instance",
    "@xsi:nil": "true"
  },
  "etat": "Discuté",
  "signataires": {
    "auteur": {
      "typeAuteur": "Depute",
      "acteurRef": "PA720692",
      "organeRef": {
        "@xmlns:xsi": "http://www.w3.org/2001/XMLSchema-instance",
        "@xsi:nil": "true"
      },
      "groupePolitiqueRef": "PO730940"
    },
    "cosignataires": {
      "acteurRef": [
        "PA721270",
        "PA610654",
        "PA721118",
        "PA718926",
        "PA722110",
        "PA722202",
        "PA718720",
        "PA441",
        "PA721896",
        "PA721012",
        "PA720546",
        "PA689",
        "PA267306",
        "PA335612",
        "PA610667",
        "PA720692"
      ]
    },
    "texteAffichable": "M.&#160;Fabien&#160;Roussel,  M.&#160;Dufr&#232;gne, Mme&#160;Bello, M.&#160;Brotherson, M.&#160;Bruneel, Mme&#160;Buffet, M.&#160;Chassaigne, M.&#160;Dharr&#233;ville, Mme&#160;Faucillon, M.&#160;Jumel, Mme&#160;K&#233;clard-Mond&#233;sir, M.&#160;Lecoq, M.&#160;Nilor, M.&#160;Peu, M.&#160;Serville et M.&#160;Wulfranc"
  },
  "pointeurFragmentTexte": {
    "missionVisee": {
      "@xmlns:xsi": "http://www.w3.org/2001/XMLSchema-instance",
      "@xsi:nil": "true"
    },
    "division": {
      "titre": "Article 4",
      "articleDesignationCourte": "ART. 4",
      "type": "ARTICLE",
      "avant_A_Apres": "A",
      "divisionRattachee": "ARTICLE 4",
      "articleAdditionnel": {
        "@xmlns:xsi": "http://www.w3.org/2001/XMLSchema-instance",
        "@xsi:nil": "true"
      },
      "chapitreAdditionnel": {
        "@xmlns:xsi": "http://www.w3.org/2001/XMLSchema-instance",
        "@xsi:nil": "true"
      },
      "urlDivisionTexteVise": "/15/textes/2272A.asp#D_Article_4"
    },
    "alinea": {
      "avant_A_Apres": {
        "@xmlns:xsi": "http://www.w3.org/2001/XMLSchema-instance",
        "@xsi:nil": "true"
      },
      "numero": "7",
      "alineaDesignation": {
        "@xmlns:xsi": "http://www.w3.org/2001/XMLSchema-instance",
        "@xsi:nil": "true"
      }
    }
  },
  "corps": {
    "dispositif": "<p style=\"text-align: justify;\">I.&#160;&#8211;&#160;R&#233;diger ainsi l&#8217;alin&#233;a&#160;7&#160;:</p><p style=\"text-align: justify;\">&#171;&#160;<i>ii)</i>&#160;Apr&#232;s la premi&#232;re occurrence du mot&#160;: &#171;&#160;&#233;nergie&#160;&#187;, la fin du 1&#176;&#160;est supprim&#233;e&#160;;&#160;&#187;</p><p style=\"text-align: justify;\">II.&#160;&#8211;&#160;En cons&#233;quence, compl&#233;ter le tableau de l&#8217;alin&#233;a&#160;47 par les deux lignes suivantes&#160;:</p><p style=\"text-align: justify;\">&#171;&#160;</p><table style=\"border-collapse: collapse; height: 30px; width: 670.067px;\"><tbody><tr><td style=\"white-space: normal; border: 1px solid #000000; width: 265px;\">Chaudi&#232;res &#224; tr&#232;s haute performance &#233;nerg&#233;tique, &#224; l&#8217;exception de celles utilisant le fioul comme source d&#8217;&#233;nergie</td><td style=\"white-space: normal; border: 1px solid #000000; width: 188px;\">600&#160;&#8364;</td></tr></tbody></table><p style=\"text-align: justify;\">&#160;&#187;</p><p style=\"text-align: justify;\">III.&#160;&#8211;&#160;En cons&#233;quence, compl&#233;ter le tableau de l&#8217;alin&#233;a&#160;51 par les deux lignes suivantes&#160;:</p><p style=\"text-align: justify;\">&#171;&#160;</p><table style=\"border-collapse: collapse; height: 40px; width: 679.733px;\"><tbody><tr><td style=\"white-space: normal; border: 1px solid #000000; width: 276px;\">Chaudi&#232;res &#224; tr&#232;s haute performance &#233;nerg&#233;tique, &#224; l&#8217;exception de celles utilisant le fioul comme source d&#8217;&#233;nergie</td><td style=\"white-space: normal; border: 1px solid #000000; width: 187px;\">600&#160;&#8364;</td></tr></tbody></table><p style=\"text-align: justify;\">&#160;&#187;</p><p style=\"text-align: justify;\">IV.&#160;&#8211;&#160;Compl&#233;ter cet article par les trois alin&#233;as suivants&#160;:</p><p>&#171;&#160;IV.&#160;&#8211;&#160;Le I est restreint au cr&#233;dit d&#8217;imp&#244;t pr&#233;vu &#224; l&#8217;article&#160;200 quater du code g&#233;n&#233;ral des imp&#244;ts, sans incidence sur la d&#233;finition de la prime mentionn&#233;e au II de l&#8217;article&#160;4 de la pr&#233;sente loi de finances de 2020.</p><p>&#171;&#160;V.&#160;&#8211;&#160;Le I n&#8217;est applicable qu&#8217;aux sommes venant en d&#233;duction de l&#8217;imp&#244;t d&#251;.</p><p>&#171;&#160;VI.&#160;&#8211;&#160;La perte de recettes r&#233;sultant pour l&#8217;&#201;tat du I est compens&#233;e &#224; due concurrence par la cr&#233;ation d&#8217;une taxe additionnelle aux droits mentionn&#233;s aux articles 575 et 575 A du code g&#233;n&#233;ral des imp&#244;ts.&#160;&#187;</p>",
    "exposeSommaire": "<p style=\"text-align: justify;\">Le pr&#233;sent projet de loi retire le b&#233;n&#233;fice du CITE aux m&#233;nages interm&#233;diaires pour ce qui concerne notamment les chaudi&#232;res gaz &#224; tr&#232;s haute performance &#233;nerg&#233;tique (THPE). Or, en l&#8217;&#233;tat actuel des solutions techniques, le remplacement des anciennes chaudi&#232;res gaz et fioul par les seuls &#233;quipements EnR (&#233;quipements fonctionnant aux &#233;nergies renouvelables) n&#8217;est pas envisageable dans l&#8217;imm&#233;diat pour des raisons techniques et financi&#232;res. Une suppression brutale du CITE sur les chaudi&#232;res gaz &#224; tr&#232;s haute performance &#233;nerg&#233;tique n&#8217;est pas opportune. Pour les m&#233;nages qui souhaitent remplacer leurs &#233;quipements obsol&#232;tes, les chaudi&#232;res gaz THPE constituent en effet un moyen transitoire qu&#8217;il convient de continuer &#224; soutenir, notamment dans les r&#233;gions les plus froides. C&#8217;est le sens du pr&#233;sent amendement.</p>",
    "annexeExposeSommaire": {
      "@xmlns:xsi": "http://www.w3.org/2001/XMLSchema-instance",
      "@xsi:nil": "true"
    },
    "cartoucheDelaiDepotDepasse": {
      "@xmlns:xsi": "http://www.w3.org/2001/XMLSchema-instance",
      "@xsi:nil": "true"
    },
    "avantAppel": {
      "@xmlns:xsi": "http://www.w3.org/2001/XMLSchema-instance",
      "@xsi:nil": "true"
    }
  },
  "representations": {
    "representation": {
      "nom": "PDF",
      "typeMime": {
        "type": "application",
        "subType": "PDF"
      },
      "statutRepresentation": {
        "verbatim": "true",
        "canonique": "true",
        "officielle": "true",
        "transcription": "false",
        "enregistrement": "false"
      },
      "repSource": {
        "@xmlns:xsi": "http://www.w3.org/2001/XMLSchema-instance",
        "@xsi:nil": "true"
      },
      "offset": {
        "@xmlns:xsi": "http://www.w3.org/2001/XMLSchema-instance",
        "@xsi:nil": "true"
      },
      "contenu": {
        "documentURI": "/15/amendements/2272A/AN/1634.pdf"
      },
      "dateDispoRepresentation": {
        "@xmlns:xsi": "http://www.w3.org/2001/XMLSchema-instance",
        "@xsi:nil": "true"
      }
    }
  },
  "seanceDiscussion": "RUANR5L15S2020IDS21867",
  "sort": {
    "dateSaisie": "2019-10-17T18:48:52.000+02:00",
    "sortEnSeance": "Rejeté"
  },
  "dateDepot": "2019-10-10T02:00:00.000+02:00",
  "dateDistribution": "2019-10-16T02:00:00.000+02:00",
  "article99": "0",
  "loiReference": {
    "codeLoi": {
      "@xmlns:xsi": "http://www.w3.org/2001/XMLSchema-instance",
      "@xsi:nil": "true"
    },
    "divisionCodeLoi": {
      "@xmlns:xsi": "http://www.w3.org/2001/XMLSchema-instance",
      "@xsi:nil": "true"
    }
  }
}