{
  "@xmlns": "http://schemas.assemblee-nationale.fr/referentiel",
  "uid": "AMANR5L15SEA717460BTC1396P0D1N80",
  "identifiant": {
    "legislature": "15",
    "numero": "80",
    "numRect": "0",
    "saisine": {
      "refTexteLegislatif": "PRJLANR5L15BTC1396",
      "numeroPartiePLF": "0",
      "organeExamen": "PO717460",
      "mentionSecondeDeliberation": "0"
    }
  },
  "numeroLong": "80",
  "etapeTexte": "1ère lecture (2ème assemblée saisie)",
  "triAmendement": "bdcaaaaaaaaaaaaaaaaaaaaaaaaaaaaaaaaaaaaaaaaaaaaaaaax",
  "cardinaliteAmdtMultiples": "1",
  "amendementParent": {
    "@xmlns:xsi": "http://www.w3.org/2001/XMLSchema-instance",
    "@xsi:nil": "true"
  },
  "etat": "Irrecevable",
  "signataires": {
    "auteur": {
      "typeAuteur": "Depute",
      "acteurRef": "PA721474",
      "organeRef": {
        "@xmlns:xsi": "http://www.w3.org/2001/XMLSchema-instance",
        "@xsi:nil": "true"
      },
      "groupePolitiqueRef": "PO730934"
    },
    "cosignataires": {
      "acteurRef": [
        "PA719318",
        "PA266793",
        "PA334654",
        "PA330909",
        "PA718850",
        "PA721474",
        "PA267378",
        "PA2086",
        "PA718884",
        "PA856",
        "PA721070",
        "PA267289",
        "PA267260",
        "PA2155",
        "PA721678",
        "PA267429",
        "PA605991",
        "PA346218",
        "PA608416",
        "PA642847",
        "PA721506",
        "PA608016",
        "PA721636",
        "PA267527",
        "PA709315",
        "PA267324"
      ]
    },
    "texteAffichable": "M.&#160;Viry,  Mme&#160;Anthoine, M.&#160;Bazin, Mme&#160;Bazin-Malgras, M.&#160;Bony, M.&#160;Cherpion, M.&#160;Cinieri, M.&#160;Cordier, M.&#160;Descoeur, M.&#160;Door, M.&#160;Gaultier, Mme&#160;Genevard, M.&#160;Hetzel, Mme&#160;Kuster, Mme&#160;Levy, Mme&#160;Louwagie, M.&#160;Marlin, M.&#160;Masson, M.&#160;Menuel, M.&#160;Parigi, Mme&#160;Poletti, Mme&#160;Ramassamy, M.&#160;Reda, M.&#160;Saddier, M.&#160;Straumann et M.&#160;Viala"
  },
  "pointeurFragmentTexte": {
    "missionVisee": {
      "@xmlns:xsi": "http://www.w3.org/2001/XMLSchema-instance",
      "@xsi:nil": "true"
    },
    "division": {
      "titre": "Article 12 ter",
      "articleDesignationCourte": "APRÈS ART. 12 TER",
      "type": "ARTICLE",
      "avant_A_Apres": "Après",
      "divisionRattachee": "APRÈS L'ARTICLE 12 TER, insérer l'article suivant:",
      "articleAdditionnel": "1",
      "chapitreAdditionnel": {
        "@xmlns:xsi": "http://www.w3.org/2001/XMLSchema-instance",
        "@xsi:nil": "true"
      },
      "urlDivisionTexteVise": "/15/textes/1396.asp#D_Article_12_ter"
    },
    "alinea": {
      "@xmlns:xsi": "http://www.w3.org/2001/XMLSchema-instance",
      "@xsi:nil": "true"
    }
  },
  "corps": {
    "dispositif": "<p style=\"text-align: justify;\">L&#8217;article&#160;515&#8209;9 du code civil est compl&#233;t&#233; par un alin&#233;a&#160;ainsi r&#233;dig&#233; :</p><p style=\"text-align: justify;\">&#171;&#160;Le terme de violences d&#233;signe tous les actes de violence physique, sexuelle, psychologique ou &#233;conomique, y compris la menace de se livrer &#224; de tels actes, la contrainte ou la privation arbitraire de libert&#233;.&#160;&#187;</p>",
    "exposeSommaire": "<p style=\"text-align: justify;\">Cet amendement recommand&#233; par la d&#233;l&#233;gation aux droits des femmes et &#224; l&#8217;&#233;galit&#233; des chances entre les hommes et les femmes a &#233;t&#233; rejet&#233; en Commission des Lois mais apporte une incontestable avanc&#233;e, attendue concr&#232;tement de nombreuses femmes.</p><p style=\"text-align: justify;\">En 2016, 123 femmes ont &#233;t&#233; tu&#233;es par leur partenaire ou ex-partenaire. Selon les donn&#233;es du secr&#233;tariat d&#8217;&#201;tat en charge de l&#8217;&#233;galit&#233; entre les femmes et les hommes, 225 000 femmes sont victimes de violences physiques et/ou sexuelles commises par leur partenaire ou ex-partenaire. Concernant les violences sexuelles, 84 000 femmes majeures seraient chaque ann&#233;e victimes de viols ou de tentatives de viol. Dans 91&#160;% des cas, ces agressions ont &#233;t&#233; perp&#233;tr&#233;es par une personne connue de la victime. Dans 45&#160;% des cas, c&#8217;est le conjoint ou l&#8217;ex-conjoint qui est l&#8217;auteur des faits. Ces chiffres ne tiennent pas compte des nombreux cas non d&#233;clar&#233;s de violences&#160;; ils sont une estimation minimale du nombre de cas de violences au sein du couple. Les violences au sein du couple sont encore une r&#233;alit&#233; massive dans notre pays et cet amendement, issu de la recommandation n&#176; 7 du rapport de la D&#233;l&#233;gation aux droits des femmes et &#224; l&#8217;&#233;galit&#233; des chances entre les hommes et les femmes, vise &#224; inscrire dans le code civil une d&#233;finition claire des violences au sein du couple en s&#8217;inspirant de celle donn&#233;e par la Convention d&#8217;Istanbul. Cela faciliterait le travail des magistrats, notamment des juges aux affaires familiales, qui doivent imp&#233;rativement tenir compte de ce type de violences dans leurs d&#233;cisions</p>",
    "annexeExposeSommaire": {
      "@xmlns:xsi": "http://www.w3.org/2001/XMLSchema-instance",
      "@xsi:nil": "true"
    },
    "cartoucheDelaiDepotDepasse": {
      "@xmlns:xsi": "http://www.w3.org/2001/XMLSchema-instance",
      "@xsi:nil": "true"
    }
  },
  "representations": {
    "representation": {
      "nom": "PDF",
      "typeMime": {
        "type": "application",
        "subType": "PDF"
      },
      "statutRepresentation": {
        "verbatim": "true",
        "canonique": "true",
        "officielle": "true",
        "transcription": "false",
        "enregistrement": "false"
      },
      "repSource": {
        "@xmlns:xsi": "http://www.w3.org/2001/XMLSchema-instance",
        "@xsi:nil": "true"
      },
      "offset": {
        "@xmlns:xsi": "http://www.w3.org/2001/XMLSchema-instance",
        "@xsi:nil": "true"
      },
      "contenu": {
        "documentURI": "/15/amendements/1396/AN/80.pdf"
      },
      "dateDispoRepresentation": {
        "@xmlns:xsi": "http://www.w3.org/2001/XMLSchema-instance",
        "@xsi:nil": "true"
      }
    }
  },
  "seanceDiscussion": {
    "@xmlns:xsi": "http://www.w3.org/2001/XMLSchema-instance",
    "@xsi:nil": "true"
  },
  "sort": {
    "@xmlns:xsi": "http://www.w3.org/2001/XMLSchema-instance",
    "@xsi:nil": "true"
  },
  "dateDepot": "2018-11-14T01:00:00.000+01:00",
  "dateDistribution": "2018-11-19T01:00:00.000+01:00",
  "article99": "0",
  "loiReference": {
    "codeLoi": "c civil",
    "divisionCodeLoi": "515-9"
  }
}