{
  "@xmlns": "http://schemas.assemblee-nationale.fr/referentiel",
  "uid": "AMANR5L15SEA717460B1371P0D1N119",
  "identifiant": {
    "legislature": "15",
    "numero": "119",
    "numRect": "0",
    "saisine": {
      "refTexteLegislatif": "PRJLANR5L15B1371",
      "numeroPartiePLF": "0",
      "organeExamen": "PO717460",
      "mentionSecondeDeliberation": "0"
    }
  },
  "numeroLong": "119",
  "etapeTexte": "1ère lecture (1ère assemblée saisie)",
  "triAmendement": "jiaaaaaaaaaaaaaaaaaaaaaaaaaaaaaaaaaaaaaaaaaaaaaaaajoaeacnzzzw",
  "cardinaliteAmdtMultiples": "1",
  "amendementParent": {
    "@xmlns:xsi": "http://www.w3.org/2001/XMLSchema-instance",
    "@xsi:nil": "true"
  },
  "etat": "Discuté",
  "signataires": {
    "auteur": {
      "typeAuteur": "Depute",
      "acteurRef": "PA1874",
      "organeRef": {
        "@xmlns:xsi": "http://www.w3.org/2001/XMLSchema-instance",
        "@xsi:nil": "true"
      },
      "groupePolitiqueRef": "PO730934"
    },
    "cosignataires": {
      "acteurRef": [
        "PA721410",
        "PA267429",
        "PA721636",
        "PA2529",
        "PA718884",
        "PA608016",
        "PA1874",
        "PA2492",
        "PA721968",
        "PA605036",
        "PA609726",
        "PA721474",
        "PA720210",
        "PA720684",
        "PA267735",
        "PA718780",
        "PA346218",
        "PA267450",
        "PA719318",
        "PA2377",
        "PA334654",
        "PA2086",
        "PA718850",
        "PA608416",
        "PA267527",
        "PA718838",
        "PA642847",
        "PA606712",
        "PA330909",
        "PA607090",
        "PA609245"
      ]
    },
    "texteAffichable": "M.&#160;Le Fur,  M.&#160;Abad, Mme&#160;Anthoine, M.&#160;Aubert, M.&#160;Bazin, Mme&#160;Bazin-Malgras, Mme&#160;Beauvais, Mme&#160;Bonnivard, M.&#160;Brun, M.&#160;Cinieri, M.&#160;Cordier, M.&#160;R&#233;mi&#160;Delatte, M.&#160;Descoeur, M.&#160;Pierre-Henri&#160;Dumont, M.&#160;de Ganay, M.&#160;Hetzel, Mme&#160;Lacroute, Mme&#160;Louwagie, M.&#160;Lurton, M.&#160;Marlin, M.&#160;Masson, M.&#160;Parigi, M.&#160;Perrut, M.&#160;Quentin, M.&#160;Reitzer, M.&#160;Saddier, M.&#160;Straumann, Mme&#160;Trastour-Isnart, M.&#160;Vialay, M.&#160;Jean-Pierre&#160;Vigier et M.&#160;Viry"
  },
  "pointeurFragmentTexte": {
    "missionVisee": {
      "@xmlns:xsi": "http://www.w3.org/2001/XMLSchema-instance",
      "@xsi:nil": "true"
    },
    "division": {
      "titre": "Article 8",
      "articleDesignationCourte": "APRÈS ART. 8",
      "type": "ARTICLE",
      "avant_A_Apres": "Après",
      "divisionRattachee": "APRÈS L'ARTICLE 8, insérer l'article suivant:",
      "articleAdditionnel": "1",
      "chapitreAdditionnel": {
        "@xmlns:xsi": "http://www.w3.org/2001/XMLSchema-instance",
        "@xsi:nil": "true"
      },
      "urlDivisionTexteVise": "/15/textes/1371.asp#D_Article_8"
    },
    "alinea": {
      "@xmlns:xsi": "http://www.w3.org/2001/XMLSchema-instance",
      "@xsi:nil": "true"
    }
  },
  "corps": {
    "dispositif": "<p style=\"text-align: justify;\">I.&#160;&#8211;&#160;Au premier alin&#233;a de l&#8217;article&#160;1665 <i>bis</i> du code g&#233;n&#233;ral des imp&#244;ts, la r&#233;f&#233;rence&#160;: &#171;&#160;aux articles 199 <i>sexdecies</i>&#160;&#187; est remplac&#233;e par les mots&#160;: &#171;&#160;&#224; l&#8217;article&#160;199 <i>quater</i> C, aux <i>b</i> &#224; <i>e</i> du 2 de l&#8217;article&#160;199 <i>undecies</i> A, ainsi qu&#8217;aux articles 199 <i>quindecies</i>, 199 <i>sexdecies</i>, 199 <i>sexvicies</i>, 199 <i>septvicies</i>, 199 <i>novovicies</i>, 200, 200 <i>decies</i> A&#160;&#187;.</p><p style=\"text-align: justify;\">II.&#160;&#8211;&#160;Le pr&#233;sent article entre en vigueur le 1<sup>er</sup> janvier 2019.</p><p style=\"text-align: justify;\">&#160;</p>",
    "exposeSommaire": "<p style=\"text-align: justify;\">Le pr&#233;sent amendement pr&#233;voit d&#8217;int&#233;grer dans le calcul de l&#8217;avance pr&#233;vue &#224; l&#8217;article&#160;1665&#160;<i>bis</i> du code g&#233;n&#233;ral des imp&#244;ts un certain nombre de r&#233;ductions d&#8217;imp&#244;ts dont b&#233;n&#233;ficient les particuliers afin de prendre en compte les effets de tr&#233;sorerie infra-annuels pouvant r&#233;sulter de la mise en &#339;uvre du pr&#233;l&#232;vement &#224; la source.</p><p style=\"text-align: justify;\">Les r&#233;ductions et cr&#233;dits d&#8217;imp&#244;ts concern&#233;s sont&#160;:</p><p style=\"text-align: justify;\">- Les r&#233;ductions d&#8217;imp&#244;ts en faveur des investissements locatifs (Censi-Bouvard, Duflot, Pinel et outre-mer)</p><p style=\"text-align: justify;\">- La r&#233;duction d&#8217;imp&#244;t au titre des d&#233;pense d&#8217;h&#233;bergement en EHPAD</p><p style=\"text-align: justify;\">- La r&#233;duction d&#8217;imp&#244;t au titre des dons effectu&#233;s par les particuliers</p><p style=\"text-align: justify;\">- Le cr&#233;dit d&#8217;imp&#244;ts au titre des cotisations syndicales</p><p style=\"text-align: justify;\">- La r&#233;duction d&#8217;imp&#244;t au titre des cotisations vers&#233;es aux associations syndicales charg&#233;es du d&#233;frichement forestier</p>",
    "annexeExposeSommaire": {
      "@xmlns:xsi": "http://www.w3.org/2001/XMLSchema-instance",
      "@xsi:nil": "true"
    }
  },
  "representations": {
    "representation": {
      "nom": "PDF",
      "typeMime": {
        "type": "application",
        "subType": "PDF"
      },
      "statutRepresentation": {
        "verbatim": "true",
        "canonique": "true",
        "officielle": "true",
        "transcription": "false",
        "enregistrement": "false"
      },
      "repSource": {
        "@xmlns:xsi": "http://www.w3.org/2001/XMLSchema-instance",
        "@xsi:nil": "true"
      },
      "offset": {
        "@xmlns:xsi": "http://www.w3.org/2001/XMLSchema-instance",
        "@xsi:nil": "true"
      },
      "contenu": {
        "documentURI": "/15/amendements/1371/AN/119.pdf"
      },
      "dateDispoRepresentation": {
        "@xmlns:xsi": "http://www.w3.org/2001/XMLSchema-instance",
        "@xsi:nil": "true"
      }
    }
  },
  "seanceDiscussion": "RUANR5L15S2019IDS21366",
  "sort": {
    "dateSaisie": "2018-11-13T02:21:55.000+01:00",
    "sortEnSeance": "Rejeté"
  },
  "dateDepot": "2018-11-09T01:00:00.000+01:00",
  "dateDistribution": "2018-11-12T01:00:00.000+01:00",
  "article99": "0",
  "loiReference": {
    "codeLoi": "CGI",
    "divisionCodeLoi": "1665 bis"
  }
}