{
  "@xmlns": "http://schemas.assemblee-nationale.fr/referentiel",
  "uid": "AMANR5L15PO419865B0155P0D1N151",
  "identifiant": {
    "legislature": "15",
    "numero": "151",
    "numRect": "0",
    "saisine": {
      "refTexteLegislatif": "PRJLANR5L15B0155",
      "numeroPartiePLF": "0",
      "organeExamen": "PO419865",
      "mentionSecondeDeliberation": "0"
    }
  },
  "numeroLong": "CD151",
  "etapeTexte": "1ère lecture (1ère assemblée saisie)",
  "triAmendement": "yetxs",
  "cardinaliteAmdtMultiples": "1",
  "amendementParent": {
    "@xmlns:xsi": "http://www.w3.org/2001/XMLSchema-instance",
    "@xsi:nil": "true"
  },
  "etat": "Discuté",
  "signataires": {
    "auteur": {
      "typeAuteur": "Depute",
      "acteurRef": "PA719740",
      "organeRef": {
        "@xmlns:xsi": "http://www.w3.org/2001/XMLSchema-instance",
        "@xsi:nil": "true"
      },
      "groupePolitiqueRef": "PO730964"
    },
    "cosignataires": {
      "acteurRef": "PA719740"
    },
    "texteAffichable": "M.&#160;Colas-Roy, rapporteur"
  },
  "pointeurFragmentTexte": {
    "missionVisee": {
      "@xmlns:xsi": "http://www.w3.org/2001/XMLSchema-instance",
      "@xsi:nil": "true"
    },
    "division": {
      "titre": "Article PREMIER",
      "articleDesignationCourte": "ART. PREMIER",
      "type": "ARTICLE",
      "avant_A_Apres": "A",
      "divisionRattachee": "ARTICLE PREMIER",
      "articleAdditionnel": {
        "@xmlns:xsi": "http://www.w3.org/2001/XMLSchema-instance",
        "@xsi:nil": "true"
      },
      "chapitreAdditionnel": {
        "@xmlns:xsi": "http://www.w3.org/2001/XMLSchema-instance",
        "@xsi:nil": "true"
      },
      "urlDivisionTexteVise": "/15/textes/0155.asp#D_Article_1er"
    },
    "alinea": {
      "avant_A_Apres": "Apres",
      "numero": "16",
      "alineaDesignation": {
        "@xmlns:xsi": "http://www.w3.org/2001/XMLSchema-instance",
        "@xsi:nil": "true"
      }
    }
  },
  "corps": {
    "dispositif": "<p style=\"text-align: justify;\">Apr&#232;s l&#8217;alin&#233;a&#160;16, ins&#233;rer les quatre alin&#233;as suivants&#160;:</p><p style=\"text-align: justify;\">&#171;&#160;3&#176;&#160;Apr&#232;s l&#8217;article L.&#160;142&#8209;7 du code minier, il est ins&#233;r&#233; un article L.&#160;142&#8209;7&#8209;1 ainsi r&#233;dig&#233;&#160;:</p><p style=\"text-align: justify;\">&#171;&#160;<i>Art.&#160;L.&#160;142&#8209;7&#8209;1</i>.&#160;&#8211;&#160;Le demandeur de la prolongation de la dur&#233;e d&#8217;une concession doit fournir &#224; l&#8217;administration, lorsqu&#8217;il d&#233;pose sa demande, une mise &#224; jour des donn&#233;es relatives &#224; ses capacit&#233;s financi&#232;res et techniques.</p><p style=\"text-align: justify;\">&#171;&#160;La v&#233;rification des capacit&#233;s financi&#232;res et techniques du demandeur par les autorit&#233;s administratives comp&#233;tentes est un pr&#233;alable &#224; l&#8217;instruction de la demande de prolongation.</p><p style=\"text-align: justify;\">&#171;&#160;Si le demandeur n&#8217;est pas en mesure de justifier de capacit&#233;s financi&#232;res et techniques suffisantes, son dossier n&#8217;est pas instruit.&#160;&#187;</p>",
    "exposeSommaire": "<p style=\"text-align: justify;\">Cet amendement vise &#224; renforcer le contr&#244;le des capacit&#233;s techniques et financi&#232;res dont la personne qui demande la prolongation d&#8217;une concession doit disposer et &#224; s&#8217;assurer du fait qu&#8217;elles doivent &#234;tre mises &#224; jour. En effet, si un op&#233;rateur ne dispose pas des capacit&#233;s techniques et financi&#232;res suffisantes, il est fort &#224; craindre qu&#8217;il ne puisse exercer son activit&#233; dans des conditions de s&#233;curit&#233; optimales et avec un impact environnemental r&#233;duit.</p>",
    "annexeExposeSommaire": {
      "@xmlns:xsi": "http://www.w3.org/2001/XMLSchema-instance",
      "@xsi:nil": "true"
    }
  },
  "representations": {
    "representation": {
      "nom": "PDF",
      "typeMime": {
        "type": "application",
        "subType": "PDF"
      },
      "statutRepresentation": {
        "verbatim": "true",
        "canonique": "true",
        "officielle": "true",
        "transcription": "false",
        "enregistrement": "false"
      },
      "repSource": {
        "@xmlns:xsi": "http://www.w3.org/2001/XMLSchema-instance",
        "@xsi:nil": "true"
      },
      "offset": {
        "@xmlns:xsi": "http://www.w3.org/2001/XMLSchema-instance",
        "@xsi:nil": "true"
      },
      "contenu": {
        "documentURI": "/15/amendements/0155/CION-DVP/CD151.pdf"
      },
      "dateDispoRepresentation": {
        "@xmlns:xsi": "http://www.w3.org/2001/XMLSchema-instance",
        "@xsi:nil": "true"
      }
    }
  },
  "seanceDiscussion": {
    "@xmlns:xsi": "http://www.w3.org/2001/XMLSchema-instance",
    "@xsi:nil": "true"
  },
  "sort": {
    "dateSaisie": "2017-09-26T22:41:30.000+02:00",
    "sortEnSeance": "Retiré"
  },
  "dateDepot": "2017-09-22T02:00:00.000+02:00",
  "dateDistribution": "2017-09-25T02:00:00.000+02:00",
  "article99": "0",
  "loiReference": {
    "codeLoi": {
      "@xmlns:xsi": "http://www.w3.org/2001/XMLSchema-instance",
      "@xsi:nil": "true"
    },
    "divisionCodeLoi": {
      "@xmlns:xsi": "http://www.w3.org/2001/XMLSchema-instance",
      "@xsi:nil": "true"
    }
  }
}