{
  "@xmlns": "http://schemas.assemblee-nationale.fr/referentiel",
  "uid": "AMANR5L15SEA717460B0384P0D1N24",
  "identifiant": {
    "legislature": "15",
    "numero": "24",
    "numRect": "0",
    "saisine": {
      "refTexteLegislatif": "PRJLANR5L15B0384",
      "numeroPartiePLF": "0",
      "organeExamen": "PO717460",
      "mentionSecondeDeliberation": "0"
    }
  },
  "numeroLong": "24",
  "etapeTexte": "1ère lecture (1ère assemblée saisie)",
  "triAmendement": "zzzoi",
  "cardinaliteAmdtMultiples": "1",
  "amendementParent": {
    "@xmlns:xsi": "http://www.w3.org/2001/XMLSchema-instance",
    "@xsi:nil": "true"
  },
  "etat": "Discuté",
  "signataires": {
    "auteur": {
      "typeAuteur": "Depute",
      "acteurRef": "PA1874",
      "organeRef": {
        "@xmlns:xsi": "http://www.w3.org/2001/XMLSchema-instance",
        "@xsi:nil": "true"
      },
      "groupePolitiqueRef": "PO730934"
    },
    "cosignataires": {
      "acteurRef": [
        "PA266774",
        "PA334654",
        "PA267204",
        "PA2492",
        "PA609726",
        "PA722390",
        "PA608826",
        "PA607090",
        "PA346218",
        "PA1874",
        "PA719318",
        "PA330684",
        "PA332523",
        "PA330909",
        "PA267429",
        "PA720684",
        "PA608016",
        "PA608416",
        "PA720386",
        "PA1012",
        "PA330008",
        "PA721968",
        "PA718850",
        "PA642847"
      ]
    },
    "texteAffichable": "M.&#160;Le Fur,  Mme&#160;Anthoine, M.&#160;Aubert, M.&#160;Bazin, Mme&#160;Val&#233;rie&#160;Boyer, M.&#160;Breton, M.&#160;Cinieri, M.&#160;Cordier, Mme&#160;Corneloup, Mme&#160;Dalloz, M.&#160;Descoeur, Mme&#160;Duby-Muller, M.&#160;Pierre-Henri&#160;Dumont, M.&#160;Di Filippo, M.&#160;Furst, M.&#160;Hetzel, M.&#160;de la Verpilli&#232;re, Mme&#160;Louwagie, M.&#160;Masson, M.&#160;Quentin, M.&#160;Sermier, M.&#160;Straumann, M.&#160;Vialay et M.&#160;Jean-Pierre&#160;Vigier"
  },
  "pointeurFragmentTexte": {
    "missionVisee": {
      "@xmlns:xsi": "http://www.w3.org/2001/XMLSchema-instance",
      "@xsi:nil": "true"
    },
    "division": {
      "titre": "Article 9",
      "articleDesignationCourte": "ART. 9",
      "type": "ARTICLE",
      "avant_A_Apres": "A",
      "divisionRattachee": "ARTICLE 9",
      "articleAdditionnel": {
        "@xmlns:xsi": "http://www.w3.org/2001/XMLSchema-instance",
        "@xsi:nil": "true"
      },
      "chapitreAdditionnel": {
        "@xmlns:xsi": "http://www.w3.org/2001/XMLSchema-instance",
        "@xsi:nil": "true"
      },
      "urlDivisionTexteVise": "/15/textes/0384.asp#D_Article_9"
    },
    "alinea": {
      "avant_A_Apres": "A",
      "numero": "13",
      "alineaDesignation": "Alinéa 13"
    }
  },
  "corps": {
    "dispositif": "<p style=\"text-align: justify;\">I.&#160;&#8211;&#160;Substituer aux alin&#233;as&#160;13 &#224; 23 l&#8217;alin&#233;a suivant&#160;:</p><p style=\"text-align: justify;\">&#171;&#160;G.&#160;&#8211;&#160;L&#8217;article&#160;1729 G est abrog&#233;.&#160;&#187;</p><p style=\"text-align: justify;\">II.&#160;&#8211;&#160;En cons&#233;quence, apr&#232;s l&#8217;alin&#233;a&#160;24, ins&#233;rer les deux alin&#233;as suivants&#160;:</p><p style=\"text-align: justify;\">&#171;&#160;I <i>bis</i>.&#160;&#8211;&#160;Le <i>b</i> du 2 de l&#8217;article&#160;1730 du code g&#233;n&#233;ral des imp&#244;ts, dans sa r&#233;daction issue de l&#8217;article&#160;20 de la loi n&#176; 2016&#8209;1978 de finances rectificative pour 2016, est ainsi r&#233;dig&#233;&#160;:</p><p style=\"text-align: justify;\">&#171;&#160;<i>b)</i> Aux sommes dues au titre de l&#8217;acompte pr&#233;vu au 2&#176; du 2 de l&#8217;article&#160;204&#160;A ou du compl&#233;ment de retenue &#224; la source pr&#233;vu au&#160;3 de l&#8217;article&#160;204&#160;H, dans leur r&#233;daction issue de la loi n&#176;&#160;2016&#8209;1917 du 29&#160;d&#233;cembre 2016 de finances pour 2017.&#160;&#187;</p><p style=\"text-align: justify;\">III.&#160;&#8211;&#160;Compl&#233;ter cet article par l&#8217;alin&#233;a suivant&#160;:</p><p style=\"text-align: justify;\">&#171;&#160;V.&#160;&#8211;&#160;La perte de recettes pour l&#8217;&#201;tat est compens&#233;e &#224; due concurrence par la cr&#233;ation d&#8217;une taxe additionnelle aux droits mentionn&#233;s aux articles 575 et 575 A du code g&#233;n&#233;ral des imp&#244;ts.&#160;&#187;</p>",
    "exposeSommaire": "<p style=\"text-align: justify;\">Le pr&#233;sent amendement vise &#224; supprimer l&#8217;augmentation de p&#233;nalit&#233;s (pouvant aller jusque 50&#160;%), ainsi que la majoration en cas de modulation &#224; la baisse, la sanction applicable &#233;tant celle de droit commun de 10&#160;%.</p>",
    "annexeExposeSommaire": {
      "@xmlns:xsi": "http://www.w3.org/2001/XMLSchema-instance",
      "@xsi:nil": "true"
    }
  },
  "representations": {
    "representation": {
      "nom": "PDF",
      "typeMime": {
        "type": "application",
        "subType": "PDF"
      },
      "statutRepresentation": {
        "verbatim": "true",
        "canonique": "true",
        "officielle": "true",
        "transcription": "false",
        "enregistrement": "false"
      },
      "repSource": {
        "@xmlns:xsi": "http://www.w3.org/2001/XMLSchema-instance",
        "@xsi:nil": "true"
      },
      "offset": {
        "@xmlns:xsi": "http://www.w3.org/2001/XMLSchema-instance",
        "@xsi:nil": "true"
      },
      "contenu": {
        "documentURI": "/15/amendements/0384/AN/24.pdf"
      },
      "dateDispoRepresentation": {
        "@xmlns:xsi": "http://www.w3.org/2001/XMLSchema-instance",
        "@xsi:nil": "true"
      }
    }
  },
  "seanceDiscussion": "RUANR5L15S2018IDS20815",
  "sort": {
    "dateSaisie": "2017-12-05T17:28:06.000+01:00",
    "sortEnSeance": "Rejeté"
  },
  "dateDepot": "2017-11-24T01:00:00.000+01:00",
  "dateDistribution": "2017-12-01T01:00:00.000+01:00",
  "article99": "0",
  "loiReference": {
    "codeLoi": {
      "@xmlns:xsi": "http://www.w3.org/2001/XMLSchema-instance",
      "@xsi:nil": "true"
    },
    "divisionCodeLoi": {
      "@xmlns:xsi": "http://www.w3.org/2001/XMLSchema-instance",
      "@xsi:nil": "true"
    }
  }
}