{
  "@xmlns": "http://schemas.assemblee-nationale.fr/referentiel",
  "uid": "AMANR5L15SEA717460B2272P2D1N713",
  "identifiant": {
    "legislature": "15",
    "numero": "713",
    "numRect": "0",
    "saisine": {
      "refTexteLegislatif": "PRJLANR5L15B2272",
      "numeroPartiePLF": "2",
      "organeExamen": "PO717460",
      "mentionSecondeDeliberation": "0"
    }
  },
  "numeroLong": "II-713",
  "etapeTexte": "1ère lecture (1ère assemblée saisie)",
  "triAmendement": "ablaaaaaaaaaaaaaaaaaaaaaaaaaaaaaaaaaaaaaaaaaaaaaaakl",
  "cardinaliteAmdtMultiples": "1",
  "amendementParent": {
    "@xmlns:xsi": "http://www.w3.org/2001/XMLSchema-instance",
    "@xsi:nil": "true"
  },
  "etat": "Discuté",
  "signataires": {
    "auteur": {
      "typeAuteur": "Depute",
      "acteurRef": "PA335532",
      "organeRef": {
        "@xmlns:xsi": "http://www.w3.org/2001/XMLSchema-instance",
        "@xsi:nil": "true"
      },
      "groupePolitiqueRef": "PO758835"
    },
    "cosignataires": {
      "acteurRef": [
        "PA643145",
        "PA608695",
        "PA608011",
        "PA342415",
        "PA337483",
        "PA608172",
        "PA267233",
        "PA508",
        "PA609332",
        "PA642764",
        "PA340357",
        "PA1592",
        "PA1198",
        "PA332614",
        "PA333285",
        "PA1809",
        "PA607553",
        "PA1008",
        "PA610681",
        "PA335532",
        "PA429893",
        "PA720988",
        "PA333818",
        "PA719930",
        "PA608741",
        "PA609590",
        "PA335054",
        "PA605069",
        "PA340343"
      ]
    },
    "texteAffichable": "Mme&#160;Pau-Langevin,  Mme&#160;Untermaier, M.&#160;Aviragnet, Mme&#160;Bareigts, Mme&#160;Battistel, Mme&#160;Bi&#233;mouret, M.&#160;Bouillon, M.&#160;Jean-Louis&#160;Bricout, M.&#160;Carvounas, M.&#160;Alain&#160;David, Mme&#160;Laurence&#160;Dumont, M.&#160;Faure, M.&#160;Garot, M.&#160;David&#160;Habib, M.&#160;Hutin, M.&#160;Juanico, Mme&#160;Karamanli, M.&#160;J&#233;r&#244;me&#160;Lambert, M.&#160;Letchimy, Mme&#160;Manin, Mme&#160;Pires Beaune, M.&#160;Potier, M.&#160;Pueyo, Mme&#160;Rabault, M.&#160;Saulignac, Mme&#160;Tolmont, Mme&#160;Vainqueur-Christophe, M.&#160;Vallaud, Mme&#160;Victory et les membres du groupe Socialistes et apparent&#233;s"
  },
  "pointeurFragmentTexte": {
    "missionVisee": {
      "idMissionAN": "817",
      "libelleMission": "Justice",
      "codeMissionPLF": "B",
      "libelleMissionPLF": "Répartition, par mission et programme, des crédits du budget général"
    },
    "division": {
      "titre": "ÉTAT B",
      "articleDesignationCourte": "ART. 38",
      "type": "ANNEXE",
      "avant_A_Apres": "A",
      "divisionRattachee": "ARTICLE 38",
      "articleAdditionnel": {
        "@xmlns:xsi": "http://www.w3.org/2001/XMLSchema-instance",
        "@xsi:nil": "true"
      },
      "chapitreAdditionnel": {
        "@xmlns:xsi": "http://www.w3.org/2001/XMLSchema-instance",
        "@xsi:nil": "true"
      },
      "urlDivisionTexteVise": "/15/textes/2272C.asp#D_ETAT_B"
    },
    "alinea": {
      "@xmlns:xsi": "http://www.w3.org/2001/XMLSchema-instance",
      "@xsi:nil": "true"
    }
  },
  "corps": {
    "exposeSommaire": "<p style=\"text-align: justify;\">Cet amendement du groupe socialiste reprend une proposition du Conseil national des barreaux et vise maintenir&#160; le niveau des cr&#233;dits d&#233;di&#233;s &#224; l&#8217;aide juridictionnelle pour garantir l&#8217;acc&#232;s au droit.</p><p style=\"text-align: justify;\">Les ressources extrabudg&#233;taires de l&#8217;aide juridique (REBAJ) d&#8217;un montant total de 83M&#8364; &#233;taient affect&#233;es au Conseil national des barreaux, afin d&#8217;&#234;tre r&#233;partis entre les avocats intervenant &#224; l&#8217;aide juridictionnelle. Pour 2020, ces REBAJ seront affect&#233;s au budget de l&#8217;&#201;tat, mais seuls 60,6M&#8364; seront affect&#233;s &#224; l&#8217;aide juridictionnelle (action 01 du programme 101). En effet, les documents budg&#233;taires pr&#233;cisent les deux &#233;l&#233;ments justifiant que l&#8217;int&#233;gralit&#233; des REBAJ, soit 83M&#8364;, ne sont pas int&#233;gralement affect&#233;es au financement de l&#8217;aide juridictionnelle. D&#8217;une part, une diminution de 13,4M&#8364; prend en compte une &#171;&#160;hausse moins importante que pr&#233;vu de la d&#233;pense tendancielle d&#8217;aide juridictionnelle, qui a pu &#234;tre identifi&#233;e gr&#226;ce &#224; une r&#233;vision des pr&#233;visions fond&#233;e sur les cr&#233;dits r&#233;ellement consomm&#233;s en 2019&#160;&#187; et d&#8217;autre part une ressource exceptionnelle de 9M&#8364; qui correspond &#224; un reliquat du produit de la contribution pour l&#8217;aide juridique (le timbre de 35&#160;&#8364; supprim&#233; depuis le 1<sup>er</sup> janvier 2014).</p><p style=\"text-align: justify;\">En vue d&#8217;assurer un niveau de cr&#233;dits en 2020 &#233;quivalent &#224; celui de 2019 pour financer l&#8217;aide juridictionnelle, il convient de transf&#233;rer &#224; l&#8217;action 01 du programme 101 &#171;&#160;aide juridictionnelle&#160;&#187; un montant de 22,4M&#8364; correspondant au solde des REBAJ, afin que l&#8217;int&#233;gralit&#233; des 83M&#8364; de ces REBAJ soient bien affect&#233;e au financement de l&#8217;aide juridictionnelle.</p><p style=\"text-align: justify;\">Le pr&#233;sent amendement vise &#224; transf&#233;rer 22,4 millions d&#8217;euros de cr&#233;dits de l&#8217;action n&#176;&#160;4 &#171;&#160;gestion de l&#8217;administration centrale&#160;&#187;, &#224; l&#8217;action n&#176;&#160;1 &#171;&#160;aide juridictionnelle&#160;&#187; du programme 101 &#171;&#160;acc&#232;s au droit et &#224; la justice&#160;&#187;.</p>",
    "annexeExposeSommaire": {
      "@xmlns:xsi": "http://www.w3.org/2001/XMLSchema-instance",
      "@xsi:nil": "true"
    },
    "cartoucheDelaiDepotDepasse": {
      "@xmlns:xsi": "http://www.w3.org/2001/XMLSchema-instance",
      "@xsi:nil": "true"
    },
    "avantAppel": {
      "@xmlns:xsi": "http://www.w3.org/2001/XMLSchema-instance",
      "@xsi:nil": "true"
    },
    "dispositifAmdtCredit": {
      "listeProgrammes": {
        "programme": [
          {
            "libelle": "Justice judiciaire",
            "id": "86323",
            "AE": {
              "montantPositif": "0",
              "montantNegatif": "0"
            },
            "CP": {
              "montantPositif": "0",
              "montantNegatif": "0"
            },
            "action": "modification",
            "lignesCredits": null
          },
          {
            "libelle": "Administration pénitentiaire",
            "id": "86324",
            "AE": {
              "montantPositif": "0",
              "montantNegatif": "0"
            },
            "CP": {
              "montantPositif": "0",
              "montantNegatif": "0"
            },
            "action": "modification",
            "lignesCredits": null
          },
          {
            "libelle": "Protection judiciaire de la jeunesse",
            "id": "86325",
            "AE": {
              "montantPositif": "0",
              "montantNegatif": "0"
            },
            "CP": {
              "montantPositif": "0",
              "montantNegatif": "0"
            },
            "action": "modification",
            "lignesCredits": null
          },
          {
            "libelle": "Accès au droit et à la justice",
            "id": "86326",
            "AE": {
              "montantPositif": "22400000",
              "montantNegatif": "0"
            },
            "CP": {
              "montantPositif": "22400000",
              "montantNegatif": "0"
            },
            "action": "modification",
            "lignesCredits": null
          },
          {
            "libelle": "Conduite et pilotage de la politique de la justice",
            "id": "86327",
            "AE": {
              "montantPositif": "0",
              "montantNegatif": "22400000"
            },
            "CP": {
              "montantPositif": "0",
              "montantNegatif": "22400000"
            },
            "action": "modification",
            "lignesCredits": null
          },
          {
            "libelle": "Conseil supérieur de la magistrature",
            "id": "86328",
            "AE": {
              "montantPositif": "0",
              "montantNegatif": "0"
            },
            "CP": {
              "montantPositif": "0",
              "montantNegatif": "0"
            },
            "action": "modification",
            "lignesCredits": null
          }
        ]
      },
      "totalAE": {
        "montantPositif": "22400000",
        "montantNegatif": "22400000",
        "solde": "0"
      },
      "totalCP": {
        "montantPositif": "22400000",
        "montantNegatif": "22400000",
        "solde": "0"
      }
    }
  },
  "representations": {
    "representation": {
      "nom": "PDF",
      "typeMime": {
        "type": "application",
        "subType": "PDF"
      },
      "statutRepresentation": {
        "verbatim": "true",
        "canonique": "true",
        "officielle": "true",
        "transcription": "false",
        "enregistrement": "false"
      },
      "repSource": {
        "@xmlns:xsi": "http://www.w3.org/2001/XMLSchema-instance",
        "@xsi:nil": "true"
      },
      "offset": {
        "@xmlns:xsi": "http://www.w3.org/2001/XMLSchema-instance",
        "@xsi:nil": "true"
      },
      "contenu": {
        "documentURI": "/15/amendements/2272C/AN/713.pdf"
      },
      "dateDispoRepresentation": {
        "@xmlns:xsi": "http://www.w3.org/2001/XMLSchema-instance",
        "@xsi:nil": "true"
      }
    }
  },
  "seanceDiscussion": "RUANR5L15S2020IDS21894",
  "sort": {
    "dateSaisie": "2019-10-29T23:19:20.000+01:00",
    "sortEnSeance": "Rejeté"
  },
  "dateDepot": "2019-10-25T02:00:00.000+02:00",
  "dateDistribution": "2019-10-28T01:00:00.000+01:00",
  "article99": "0",
  "loiReference": {
    "codeLoi": {
      "@xmlns:xsi": "http://www.w3.org/2001/XMLSchema-instance",
      "@xsi:nil": "true"
    },
    "divisionCodeLoi": {
      "@xmlns:xsi": "http://www.w3.org/2001/XMLSchema-instance",
      "@xsi:nil": "true"
    }
  }
}