{
  "@xmlns": "http://schemas.assemblee-nationale.fr/referentiel",
  "uid": "AMANR5L15SEA717460B1255P1D1N1722",
  "identifiant": {
    "legislature": "15",
    "numero": "1722",
    "numRect": "0",
    "saisine": {
      "refTexteLegislatif": "PRJLANR5L15B1255",
      "numeroPartiePLF": "1",
      "organeExamen": "PO717460",
      "mentionSecondeDeliberation": "0"
    }
  },
  "numeroLong": "I-1722",
  "etapeTexte": "1ère lecture (1ère assemblée saisie)",
  "triAmendement": "giaaaaaaaaaaaaaaaaaaaaaaaaaaaaaaaaaaaaaaaaaaaaaaaadivs",
  "cardinaliteAmdtMultiples": "1",
  "amendementParent": {
    "@xmlns:xsi": "http://www.w3.org/2001/XMLSchema-instance",
    "@xsi:nil": "true"
  },
  "etat": "Discuté",
  "signataires": {
    "auteur": {
      "typeAuteur": "Depute",
      "acteurRef": "PA720278",
      "organeRef": {
        "@xmlns:xsi": "http://www.w3.org/2001/XMLSchema-instance",
        "@xsi:nil": "true"
      },
      "groupePolitiqueRef": "PO730964"
    },
    "cosignataires": {
      "acteurRef": [
        "PA720806",
        "PA607619",
        "PA719412",
        "PA718710",
        "PA609520",
        "PA718944",
        "PA720278",
        "PA721024",
        "PA722118",
        "PA720414",
        "PA722366",
        "PA722398",
        "PA720242",
        "PA719092",
        "PA720170",
        "PA722260",
        "PA643175",
        "PA722062",
        "PA718802",
        "PA719632",
        "PA719258",
        "PA719464",
        "PA720900",
        "PA720568",
        "PA719890",
        "PA721514",
        "PA720500",
        "PA722312",
        "PA721142",
        "PA720014",
        "PA721844",
        "PA719814",
        "PA720854"
      ]
    },
    "texteAffichable": "M.&#160;Orphelin,  Mme&#160;Forteza, Mme&#160;Abba, Mme&#160;Bessot Ballot, Mme&#160;Brulebois, Mme&#160;Pascale&#160;Boyer, Mme&#160;Colboc, M.&#160;Delpon, Mme&#160;Dupont, M.&#160;Fugit, Mme&#160;Le Feur, Mme&#160;Gayte, Mme&#160;Genetet, Mme&#160;Grandjean, Mme&#160;Granjus, Mme&#160;Kerbarh, M.&#160;Molac, M.&#160;Nadot, Mme&#160;Panonacle, M.&#160;Perea, M.&#160;Perrot, Mme&#160;Val&#233;rie&#160;Petit, Mme&#160;Piron, Mme&#160;Pompili, Mme&#160;Racon-Bouzon, M.&#160;Rebeyrotte, Mme&#160;Rilhac, Mme&#160;Sylla, M.&#160;Test&#233;, Mme&#160;Tiegna, Mme&#160;Thill, Mme&#160;Tuffnell et M.&#160;Villani"
  },
  "pointeurFragmentTexte": {
    "missionVisee": {
      "@xmlns:xsi": "http://www.w3.org/2001/XMLSchema-instance",
      "@xsi:nil": "true"
    },
    "division": {
      "titre": "Article 22",
      "articleDesignationCourte": "APRÈS ART. 22",
      "type": "ARTICLE",
      "avant_A_Apres": "Après",
      "divisionRattachee": "APRÈS L'ARTICLE 22, insérer l'article suivant:",
      "articleAdditionnel": "1",
      "chapitreAdditionnel": {
        "@xmlns:xsi": "http://www.w3.org/2001/XMLSchema-instance",
        "@xsi:nil": "true"
      },
      "urlDivisionTexteVise": "/15/textes/1255A.asp#D_Article_22"
    },
    "alinea": {
      "@xmlns:xsi": "http://www.w3.org/2001/XMLSchema-instance",
      "@xsi:nil": "true"
    }
  },
  "corps": {
    "dispositif": "<p style=\"text-align: justify;\">I.&#160;&#8211;&#160;Apr&#232;s le&#160;<i>f&#160;</i>du 2&#176; du A de l&#8217;article&#160;278&#8209;0 bis du code g&#233;n&#233;ral des imp&#244;ts, il est ins&#233;r&#233; un&#160;<i>g</i>&#160;ainsi r&#233;dig&#233;&#160;:</p><p style=\"text-align: justify;\">&#171;&#160;<i>g)</i>&#160;les produits &#233;lectriques et &#233;lectroniques reconditionn&#233;s&#160;;&#160;&#187;.</p><p style=\"text-align: justify;\">II. &#8211; La perte de recettes pour l&#8217;&#201;tat est compens&#233;e &#224; due concurrence par la cr&#233;ation d&#8217;une taxe additionnelle aux droits mentionn&#233;s aux articles 575 et 575 A du code g&#233;n&#233;ral des imp&#244;ts.</p>",
    "exposeSommaire": "<p style=\"text-align: justify;\">Le pr&#233;sent amendement vise &#224; mettre en place un taux r&#233;duit de TVA de 5,5&#160;% pour les produits &#233;lectroniques reconstruits et reconditionn&#233;s, afin d&#8217;accompagner les entreprises de reconstruction et de reconditionnement de produits &#233;lectroniques high-tech.</p><p style=\"text-align: justify;\">Il s&#8217;inscrit dans la continuit&#233; de la Feuille de route pour l&#8217;&#233;conomie circulaire (FREC) pr&#233;sent&#233;e par le Minist&#232;re de la transition &#233;nerg&#233;tique en avril dernier, qui met en avant plusieurs objectifs clefs pour mieux consommer, et o&#249; figure parmi les mesures propos&#233;es le renforcement de l&#8217;offre des acteurs du r&#233;emploi, de la r&#233;paration et de l&#8217;&#233;conomie de la fonctionnalit&#233;.</p><p style=\"text-align: justify;\">Les produits reconditionn&#233;s sont aujourd&#8217;hui soumis &#224; un taux de TVA normal (20&#160;%), ce qui limite leur attractivit&#233;, alors m&#234;me qu&#8217;ils offrent une deuxi&#232;me vie &#224; des produits qui seraient devenus des d&#233;chets. Pour rappel, l&#8217;article&#160;278&#8209;0 bis du code g&#233;n&#233;ral des imp&#244;ts liste les biens soumis &#224; une TVA &#224; un taux r&#233;duit (5,5&#160;%).</p><p style=\"text-align: justify;\">Une telle mesure d&#8217;incitation fiscale a d&#233;j&#224; &#233;t&#233; mise en place en&#160;Europe, la Su&#232;de, les Pays-Bas et la Belgique ont d&#233;j&#224; mis en place une TVA r&#233;duite pour certains produits issus de la r&#233;paration (chaussures, textile et v&#233;los), comme l&#8217;autorise la r&#233;glementation&#160;europ&#233;enne. La Belgique permet &#233;galement une TVA r&#233;duite sur les produits issus de l&#8217;&#233;conomie sociale et solidaire.</p><p style=\"text-align: justify;\">En parall&#232;le, il est important de noter que la Commission&#160;Europ&#233;enne a lanc&#233; une proposition de r&#233;forme de la Directive 2006/112/CE portant sur le r&#233;gime de TVA, dont le contenu des amendements sera mis au d&#233;bat au Parlement&#160;europ&#233;en d&#233;but octobre. Ceux-ci pr&#233;voient notamment de supprimer la liste limitative des produits et services &#233;ligibles &#224; un taux r&#233;duit de TVA et d&#8217;inviter les &#201;tats membres &#224; envisager un soutien aux activit&#233;s &#233;conomiques dont l&#8217;objet est de favoriser une &#233;conomie plus durable et inclusive sous la forme d&#8217;une r&#233;duction de TVA.</p><p style=\"text-align: justify;\">Aussi le pr&#233;sent amendement, en coh&#233;rence avec les objectifs fran&#231;ais et&#160;europ&#233;en pour le secteur de l&#8217;&#233;conomie circulaire, inciterait les consommateurs &#224; recourir &#224; des produits plus responsables issus de l&#8217;&#233;conomie circulaire et respectueux de l&#8217;environnement.</p><p style=\"text-align: justify;\">Le pr&#233;sent amendement a &#233;t&#233; inspir&#233; par des associations de d&#233;fense de l&#8217;environnement et par une entreprise travaillant sur le reconditionnement.</p>",
    "annexeExposeSommaire": {
      "@xmlns:xsi": "http://www.w3.org/2001/XMLSchema-instance",
      "@xsi:nil": "true"
    }
  },
  "representations": {
    "representation": {
      "nom": "PDF",
      "typeMime": {
        "type": "application",
        "subType": "PDF"
      },
      "statutRepresentation": {
        "verbatim": "true",
        "canonique": "true",
        "officielle": "true",
        "transcription": "false",
        "enregistrement": "false"
      },
      "repSource": {
        "@xmlns:xsi": "http://www.w3.org/2001/XMLSchema-instance",
        "@xsi:nil": "true"
      },
      "offset": {
        "@xmlns:xsi": "http://www.w3.org/2001/XMLSchema-instance",
        "@xsi:nil": "true"
      },
      "contenu": {
        "documentURI": "/15/amendements/1255A/AN/1722.pdf"
      },
      "dateDispoRepresentation": {
        "@xmlns:xsi": "http://www.w3.org/2001/XMLSchema-instance",
        "@xsi:nil": "true"
      }
    }
  },
  "seanceDiscussion": "RUANR5L15S2019IDS21283",
  "sort": {
    "dateSaisie": "2018-10-20T01:46:32.000+02:00",
    "sortEnSeance": "Rejeté"
  },
  "dateDepot": "2018-10-11T02:00:00.000+02:00",
  "dateDistribution": "2018-10-16T02:00:00.000+02:00",
  "article99": "0",
  "loiReference": {
    "codeLoi": "CGI",
    "divisionCodeLoi": "278-0 bis"
  }
}