{
  "@xmlns": "http://schemas.assemblee-nationale.fr/referentiel",
  "uid": "AMANR5L15PO419604B1481P0D1N527",
  "identifiant": {
    "legislature": "15",
    "numero": "527",
    "numRect": "0",
    "saisine": {
      "refTexteLegislatif": "PRJLANR5L15B1481",
      "numeroPartiePLF": "0",
      "organeExamen": "PO419604",
      "mentionSecondeDeliberation": "0"
    }
  },
  "numeroLong": "AC527",
  "etapeTexte": "1ère lecture (1ère assemblée saisie)",
  "triAmendement": "bkaaaaaaaaaaaaaaaaaaaaaaaaaaaaaaaaaaaaaaaaaaaaaaaavw",
  "cardinaliteAmdtMultiples": "1",
  "amendementParent": {
    "@xmlns:xsi": "http://www.w3.org/2001/XMLSchema-instance",
    "@xsi:nil": "true"
  },
  "etat": "Discuté",
  "signataires": {
    "auteur": {
      "typeAuteur": "Depute",
      "acteurRef": "PA720030",
      "organeRef": {
        "@xmlns:xsi": "http://www.w3.org/2001/XMLSchema-instance",
        "@xsi:nil": "true"
      },
      "groupePolitiqueRef": "PO730964"
    },
    "cosignataires": {
      "acteurRef": [
        "PA720446",
        "PA720030",
        "PA719728",
        "PA720754",
        "PA721750",
        "PA760658",
        "PA721466",
        "PA719456",
        "PA722252",
        "PA721888",
        "PA719814",
        "PA721784",
        "PA720568",
        "PA721218",
        "PA718794",
        "PA721656",
        "PA719118",
        "PA719162",
        "PA718944",
        "PA722194",
        "PA719032",
        "PA720190",
        "PA721352",
        "PA721328",
        "PA719230",
        "PA719108",
        "PA720900",
        "PA606639",
        "PA724827",
        "PA720124",
        "PA722046",
        "PA720854",
        "PA722062",
        "PA721844",
        "PA722070",
        "PA720576",
        "PA702054",
        "PA718902"
      ]
    },
    "texteAffichable": "M.&#160;Freschi,  Mme&#160;Calvez, Mme&#160;Racon-Bouzon, M.&#160;Test&#233;, Mme&#160;Brugnera, Mme&#160;Ali, Mme&#160;Amadou, Mme&#160;Berg&#233;, M.&#160;Bois, M.&#160;Bouyx, Mme&#160;Cazarian, Mme&#160;Charri&#232;re, M.&#160;Chouat, M.&#160;Claireaux, Mme&#160;Colboc, M.&#160;Cormier-Bouligeon, Mme&#160;Jacqueline&#160;Dubois, M.&#160;G&#233;rard, Mme&#160;Gomez-Bassac, Mme&#160;Granjus, M.&#160;Henriet, Mme&#160;H&#233;rin, M.&#160;Kerlogot, M.&#160;Le Bohec, Mme&#160;Liso, Mme&#160;M&#246;rch, Mme&#160;Muschotti, Mme&#160;Piron, Mme&#160;Provendier, M.&#160;Raphan, Mme&#160;Rilhac, Mme&#160;Rixain, M.&#160;C&#233;dric&#160;Roussel, M.&#160;Sorre, M.&#160;Studer, Mme&#160;Thill, M.&#160;Vignal, M.&#160;Le Gendre et les membres du groupe La R&#233;publique en Marche"
  },
  "pointeurFragmentTexte": {
    "missionVisee": {
      "@xmlns:xsi": "http://www.w3.org/2001/XMLSchema-instance",
      "@xsi:nil": "true"
    },
    "division": {
      "titre": "Article 6",
      "articleDesignationCourte": "ART. 6",
      "type": "ARTICLE",
      "avant_A_Apres": "A",
      "divisionRattachee": "ARTICLE 6",
      "articleAdditionnel": {
        "@xmlns:xsi": "http://www.w3.org/2001/XMLSchema-instance",
        "@xsi:nil": "true"
      },
      "chapitreAdditionnel": {
        "@xmlns:xsi": "http://www.w3.org/2001/XMLSchema-instance",
        "@xsi:nil": "true"
      },
      "urlDivisionTexteVise": "/15/textes/1481.asp#D_Article_6"
    },
    "alinea": {
      "avant_A_Apres": {
        "@xmlns:xsi": "http://www.w3.org/2001/XMLSchema-instance",
        "@xsi:nil": "true"
      },
      "numero": "28",
      "alineaDesignation": {
        "@xmlns:xsi": "http://www.w3.org/2001/XMLSchema-instance",
        "@xsi:nil": "true"
      }
    }
  },
  "corps": {
    "dispositif": "<p style=\"text-align: justify;\">Compl&#233;ter l&#8217;alin&#233;a&#160;28 par la phrase suivante&#160;:</p><p style=\"text-align: justify;\">&#171;&#160;Elle veille &#224; la mixit&#233; sociale des publics scolaris&#233;s au sein de l&#8217;&#233;tablissement public local d&#8217;enseignement international.&#160;&#187;</p>",
    "exposeSommaire": "<p style=\"text-align: justify;\">Cet amendement vise &#224; favoriser une mixit&#233; sociale au sein des &#233;tablissements publics locaux d'enseignement international (EPLEI), en inscrivant que l'autorit&#233; comp&#233;tente de l'Etat en mati&#232;re d'&#233;ducation veille &#224; la mixit&#233; sociale des publics scolaris&#233;s au sein de l'EPLEI. Rendre accessibles ces EPLEI aux enfants qui en sont socialement &#233;loign&#233;s est l&#8217;un des principes de l&#8217;Ecole de la R&#233;publique. Parvenir &#224; une r&#233;elle &#233;galit&#233; des chances passe &#233;galement par un meilleur apprentissage des langues d&#232;s le plus jeune &#226;ge.</p><p style=\"text-align: justify;\">L&#8217;&#233;galit&#233; des chances et la mixit&#233; sociale sont des enjeux fondamentaux pour l'&#201;ducation nationale. L&#8217;engagement du Pr&#233;sident de la R&#233;publique et du Minist&#232;re de l&#8217;Education nationale et de la Jeunesse est de traiter &#224; la racine les in&#233;galit&#233;s. Cette volont&#233; doit se traduire par l&#8217;ouverture au plus grand nombre d&#8217;un acc&#232;s &#224; un parcours d&#8217;excellence, v&#233;ritable levier d&#8217;action pour plus de diversit&#233;.</p>",
    "annexeExposeSommaire": {
      "@xmlns:xsi": "http://www.w3.org/2001/XMLSchema-instance",
      "@xsi:nil": "true"
    },
    "cartoucheDelaiDepotDepasse": {
      "@xmlns:xsi": "http://www.w3.org/2001/XMLSchema-instance",
      "@xsi:nil": "true"
    }
  },
  "representations": {
    "representation": {
      "nom": "PDF",
      "typeMime": {
        "type": "application",
        "subType": "PDF"
      },
      "statutRepresentation": {
        "verbatim": "true",
        "canonique": "true",
        "officielle": "true",
        "transcription": "false",
        "enregistrement": "false"
      },
      "repSource": {
        "@xmlns:xsi": "http://www.w3.org/2001/XMLSchema-instance",
        "@xsi:nil": "true"
      },
      "offset": {
        "@xmlns:xsi": "http://www.w3.org/2001/XMLSchema-instance",
        "@xsi:nil": "true"
      },
      "contenu": {
        "documentURI": "/15/amendements/1481/CION-CEDU/AC527.pdf"
      },
      "dateDispoRepresentation": {
        "@xmlns:xsi": "http://www.w3.org/2001/XMLSchema-instance",
        "@xsi:nil": "true"
      }
    }
  },
  "seanceDiscussion": {
    "@xmlns:xsi": "http://www.w3.org/2001/XMLSchema-instance",
    "@xsi:nil": "true"
  },
  "sort": {
    "dateSaisie": "2019-01-30T17:04:02.000+01:00",
    "sortEnSeance": "Retiré"
  },
  "dateDepot": "2019-01-25T01:00:00.000+01:00",
  "dateDistribution": "2019-01-28T01:00:00.000+01:00",
  "article99": "0",
  "loiReference": {
    "codeLoi": "3",
    "divisionCodeLoi": {
      "@xmlns:xsi": "http://www.w3.org/2001/XMLSchema-instance",
      "@xsi:nil": "true"
    }
  }
}