{
  "@xmlns": "http://schemas.assemblee-nationale.fr/referentiel",
  "uid": "AMANR5L15SEA717460B1490P0D1N575",
  "identifiant": {
    "legislature": "15",
    "numero": "575",
    "numRect": "0",
    "saisine": {
      "refTexteLegislatif": "PRJLANR5L15B1490",
      "numeroPartiePLF": "0",
      "organeExamen": "PO717460",
      "mentionSecondeDeliberation": "0"
    }
  },
  "numeroLong": "575",
  "etapeTexte": "Nouvelle Lecture",
  "triAmendement": "ebaaaaaaaaaaaaaaaaaaaaaaaaaaaaaaaaaaaaaaaaaaaaaaaaqbrwz",
  "cardinaliteAmdtMultiples": "1",
  "amendementParent": {
    "@xmlns:xsi": "http://www.w3.org/2001/XMLSchema-instance",
    "@xsi:nil": "true"
  },
  "etat": "Discuté",
  "signataires": {
    "auteur": {
      "typeAuteur": "Depute",
      "acteurRef": "PA721202",
      "organeRef": {
        "@xmlns:xsi": "http://www.w3.org/2001/XMLSchema-instance",
        "@xsi:nil": "true"
      },
      "groupePolitiqueRef": "PO730958"
    },
    "cosignataires": {
      "acteurRef": [
        "PA588884",
        "PA721202",
        "PA721210",
        "PA722142",
        "PA721062",
        "PA2150",
        "PA720892",
        "PA720422",
        "PA718860",
        "PA719676",
        "PA720846",
        "PA720430",
        "PA721960",
        "PA721226",
        "PA718868",
        "PA720286",
        "PA719578"
      ]
    },
    "texteAffichable": "M.&#160;Coquerel,  Mme&#160;Autain, M.&#160;Bernalicis, M.&#160;Corbi&#232;re, Mme&#160;Fiat, M.&#160;Lachaud, M.&#160;Larive, M.&#160;M&#233;lenchon, Mme&#160;Obono, Mme&#160;Panot, M.&#160;Prud&apos;homme, M.&#160;Quatennens, M.&#160;Ratenon, Mme&#160;Ressiguier, Mme&#160;Rubin, M.&#160;Ruffin et Mme&#160;Taurine"
  },
  "pointeurFragmentTexte": {
    "missionVisee": {
      "idMissionAN": "708",
      "libelleMission": "Écologie, développement et mobilité durables",
      "codeMissionPLF": "B",
      "libelleMissionPLF": "Répartition, par mission et programme, des crédits du budget général"
    },
    "division": {
      "titre": "ÉTAT B",
      "articleDesignationCourte": "ART. 39",
      "type": "ANNEXE",
      "avant_A_Apres": "A",
      "divisionRattachee": "ARTICLE 39",
      "articleAdditionnel": {
        "@xmlns:xsi": "http://www.w3.org/2001/XMLSchema-instance",
        "@xsi:nil": "true"
      },
      "chapitreAdditionnel": {
        "@xmlns:xsi": "http://www.w3.org/2001/XMLSchema-instance",
        "@xsi:nil": "true"
      },
      "urlDivisionTexteVise": "/15/textes/1490.asp#D_Etat_B"
    },
    "alinea": {
      "@xmlns:xsi": "http://www.w3.org/2001/XMLSchema-instance",
      "@xsi:nil": "true"
    }
  },
  "corps": {
    "exposeSommaire": "<p style=\"text-align: justify;\">Le pr&#233;sent amendement a pour objet de r&#233;tablir les cr&#233;dits de la mission &#171;&#160;&#201;cologie&#160;&#187; rejet&#233;s par le S&#233;nat tout en annulant plusieurs baisses de cr&#233;dits par rapport &#224; la loi de finances initiale pour 2018 et par rapport au projet de loi de finances initial pour 2019.</p><p style=\"text-align: justify;\">&#192; la fin de sa premi&#232;re lecture du PLF pour 2019, l&#8217;Assembl&#233;e nationale a adopt&#233; en seconde d&#233;lib&#233;ration l&#8217;amendement n&#176; II-3 du Gouvernement. Cet amendement proc&#233;dait notamment &#224; de nombreuses minorations de cr&#233;dits dans le p&#233;rim&#232;tre de la mission au seul motif de &#171;&#160;tenir compte des votes intervenus dans le cadre de l&#8217;examen du projet de loi de finances pour 2019&#160;&#187;, c&#8217;est-&#224;-dire de compenser les d&#233;penses vot&#233;es dans toutes sortes de domaines. &#192; titre d&#8217;exemple, les cr&#233;dits programme 113 &#171;&#160;Paysage, eau et biodiversit&#233;&#160;&#187; se trouvent ainsi diminu&#233;s de 1,8&#160;%, ceux du programme 181 &#171;&#160;Pr&#233;vention des risques&#160;&#187; de 1,8&#160;% et ceux du nouveau programme &#171;&#160;&#201;conomie sociale et solidaire&#160;&#187; de 2,7&#160;%.</p><p style=\"text-align: justify;\">Il est ici propos&#233; d&#8217;annuler ces baisses qui ne sont &#233;tay&#233;es par aucun argument valable.</p><p style=\"text-align: justify;\">Par ailleurs, le pr&#233;sent amendement tend &#224; compenser diff&#233;rentes diminutions de cr&#233;dits ou pertes de recettes par rapport &#224; la loi de finances initiale pour 2018.</p><p style=\"text-align: justify;\">En raison de la baisse des redevances cyn&#233;g&#233;tiques d&#233;cid&#233;e par le Pr&#233;sident de la R&#233;publique &#224; la fin du mois d&#8217;ao&#251;t 2018 et concr&#233;tis&#233;e &#224; l&#8217;article&#160;75 du pr&#233;sent projet de loi de finances, l&#8217;Office national de la chasse et de la faune sauvage (ONCFS) subira en 2019 une perte de de recettes de 21&#160;millions d&#8217;euros de taxe affect&#233;e. Il est donc propos&#233; d&#8217;inscrire 21&#160;millions d&#8217;euros de subvention pour charges de service public &#224; destination de cet organisme (programme 113 &#171;&#160;Paysage, eau et biodiversit&#233;&#160;&#187;).</p><p style=\"text-align: justify;\">Les cr&#233;dits de l&#8217;Agence de l&#8217;environnement et de la ma&#238;trise de l&#8217;&#233;nergie (ADEME) baissent de 6&#160;millions d&#8217;euros par rapport &#224; la LFI pour 2018. Il est propos&#233; d&#8217;annuler cette baisse (programme 181 &#171;&#160;Pr&#233;vention des risques&#160;&#187;).</p><p style=\"text-align: justify;\">Les cr&#233;dits de l&#8217;Institution national de l&#8217;information g&#233;ographique et foresti&#232;re (IGN) et ceux du Centre d&#8217;&#233;tudes et d&#8217;expertise sur les risques, l&#8217;environnement, la mobilit&#233; et l&#8217;am&#233;nagement (CEREMA) sont respectivement diminu&#233;s de 1,26 et 4,63 millions d&#8217;euros par rapport &#224; la LFI pour 2018. Il est &#233;galement propos&#233; d&#8217;annuler cette baisse (programme 159 &#171;&#160;Expertise, information g&#233;ographique et m&#233;t&#233;orologie&#160;&#187;).</p><p style=\"text-align: justify;\">Enfin, cet amendement vise &#224; augmenter les cr&#233;dits de M&#233;t&#233;o France (programme 159 &#171;&#160;Expertise, information g&#233;ographique et m&#233;t&#233;orologie&#160;&#187;) de 15 millions d&#8217;euros, dont 5 millions pour le r&#233;tablissement de la subvention pour charges de service public &#224; son niveau de 2018 et 10 millions en dotation en fonds propres pour le renouvellement du supercalculateur.</p><p style=\"text-align: justify;\">Il convient de rappeler que ce renouvellement vise &#224; offrir une capacit&#233; de calcul multipli&#233;e au moins par cinq et que le budget pr&#233;visionnel de ce march&#233; est de 144 millions d&#8217;euros sur la p&#233;riode 2019 2025. L&#8217;appel d&#8217;offres a &#233;t&#233; lanc&#233; au printemps. Il appara&#238;t &#233;vident que les 5 millions d&#8217;euros de dotation du PLF pour 2019 sont largement insuffisant pour amorcer le projet. Soit celui-ci prendra du retard, soit il sera r&#233;duit en cours de route, alors que nous avons plus que jamais besoin d&#8217;outils puissants de mesure et de pr&#233;vision des ph&#233;nom&#232;nes climatiques.</p>",
    "annexeExposeSommaire": {
      "@xmlns:xsi": "http://www.w3.org/2001/XMLSchema-instance",
      "@xsi:nil": "true"
    },
    "cartoucheDelaiDepotDepasse": {
      "@xmlns:xsi": "http://www.w3.org/2001/XMLSchema-instance",
      "@xsi:nil": "true"
    },
    "dispositifAmdtCredit": {
      "listeProgrammes": {
        "programme": [
          {
            "libelle": "Infrastructures et services de transports",
            "id": "56195",
            "AE": {
              "montantPositif": "3385191634",
              "montantNegatif": "0"
            },
            "CP": {
              "montantPositif": "3213229845",
              "montantNegatif": "0"
            },
            "action": "modification",
            "lignesCredits": null
          },
          {
            "libelle": "Affaires maritimes",
            "id": "56196",
            "AE": {
              "montantPositif": "163055254",
              "montantNegatif": "0"
            },
            "CP": {
              "montantPositif": "157335254",
              "montantNegatif": "0"
            },
            "action": "modification",
            "lignesCredits": null
          },
          {
            "libelle": "Paysages, eau et biodiversité",
            "id": "56197",
            "AE": {
              "montantPositif": "188007907",
              "montantNegatif": "0"
            },
            "CP": {
              "montantPositif": "183807906",
              "montantNegatif": "0"
            },
            "action": "modification",
            "lignesCredits": null
          },
          {
            "libelle": "Expertise, information géographique et météorologie",
            "id": "56198",
            "AE": {
              "montantPositif": "515843227",
              "montantNegatif": "0"
            },
            "CP": {
              "montantPositif": "515843227",
              "montantNegatif": "0"
            },
            "action": "modification",
            "lignesCredits": null
          },
          {
            "libelle": "Prévention des risques",
            "id": "56199",
            "AE": {
              "montantPositif": "847068615",
              "montantNegatif": "0"
            },
            "CP": {
              "montantPositif": "841542183",
              "montantNegatif": "0"
            },
            "action": "modification",
            "lignesCredits": {
              "ligneCredit": {
                "id": "2109",
                "libelle": "Dont titre 2",
                "AE": {
                  "montantPositif": "46446540",
                  "montantNegatif": "0"
                },
                "CP": {
                  "montantPositif": "46446540",
                  "montantNegatif": "0"
                }
              }
            }
          },
          {
            "libelle": "Énergie, climat et après-mines",
            "id": "56200",
            "AE": {
              "montantPositif": "401179057",
              "montantNegatif": "0"
            },
            "CP": {
              "montantPositif": "401179057",
              "montantNegatif": "0"
            },
            "action": "modification",
            "lignesCredits": null
          },
          {
            "libelle": "Service public de l'énergie",
            "id": "56201",
            "AE": {
              "montantPositif": "3182503669",
              "montantNegatif": "0"
            },
            "CP": {
              "montantPositif": "3219360538",
              "montantNegatif": "0"
            },
            "action": "modification",
            "lignesCredits": null
          },
          {
            "libelle": "Conduite et pilotage des politiques de l'écologie, du développement et de la mobilité durables",
            "id": "56202",
            "AE": {
              "montantPositif": "2963435117",
              "montantNegatif": "0"
            },
            "CP": {
              "montantPositif": "3000937263",
              "montantNegatif": "0"
            },
            "action": "modification",
            "lignesCredits": {
              "ligneCredit": {
                "id": "2110",
                "libelle": "Dont titre 2",
                "AE": {
                  "montantPositif": "2766032479",
                  "montantNegatif": "0"
                },
                "CP": {
                  "montantPositif": "2766032479",
                  "montantNegatif": "0"
                }
              }
            }
          },
          {
            "libelle": "Économie sociale et solidaire",
            "id": "56203",
            "AE": {
              "montantPositif": "18909841",
              "montantNegatif": "0"
            },
            "CP": {
              "montantPositif": "18909841",
              "montantNegatif": "0"
            },
            "action": "modification",
            "lignesCredits": null
          }
        ]
      },
      "totalAE": {
        "montantPositif": "11665194321",
        "montantNegatif": "0",
        "solde": "11665194321"
      },
      "totalCP": {
        "montantPositif": "11552145114",
        "montantNegatif": "0",
        "solde": "11552145114"
      }
    }
  },
  "representations": {
    "representation": {
      "nom": "PDF",
      "typeMime": {
        "type": "application",
        "subType": "PDF"
      },
      "statutRepresentation": {
        "verbatim": "true",
        "canonique": "true",
        "officielle": "true",
        "transcription": "false",
        "enregistrement": "false"
      },
      "repSource": {
        "@xmlns:xsi": "http://www.w3.org/2001/XMLSchema-instance",
        "@xsi:nil": "true"
      },
      "offset": {
        "@xmlns:xsi": "http://www.w3.org/2001/XMLSchema-instance",
        "@xsi:nil": "true"
      },
      "contenu": {
        "documentURI": "/15/amendements/1490/AN/575.pdf"
      },
      "dateDispoRepresentation": {
        "@xmlns:xsi": "http://www.w3.org/2001/XMLSchema-instance",
        "@xsi:nil": "true"
      }
    }
  },
  "seanceDiscussion": "RUANR5L15S2019IDS21433",
  "sort": {
    "dateSaisie": "2018-12-19T01:49:27.000+01:00",
    "sortEnSeance": "Rejeté"
  },
  "dateDepot": "2018-12-14T01:00:00.000+01:00",
  "dateDistribution": "2018-12-18T01:00:00.000+01:00",
  "article99": "0",
  "loiReference": {
    "codeLoi": {
      "@xmlns:xsi": "http://www.w3.org/2001/XMLSchema-instance",
      "@xsi:nil": "true"
    },
    "divisionCodeLoi": {
      "@xmlns:xsi": "http://www.w3.org/2001/XMLSchema-instance",
      "@xsi:nil": "true"
    }
  }
}