{
  "@xmlns": "http://schemas.assemblee-nationale.fr/referentiel",
  "uid": "AMANR5L15SEA717460BTC1150P0D1N72",
  "identifiant": {
    "legislature": "15",
    "numero": "72",
    "numRect": "0",
    "saisine": {
      "refTexteLegislatif": "PIONANR5L15BTC1150",
      "numeroPartiePLF": "0",
      "organeExamen": "PO717460",
      "mentionSecondeDeliberation": "0"
    }
  },
  "numeroLong": "72",
  "etapeTexte": "1ère lecture (1ère assemblée saisie)",
  "triAmendement": "caaaaaaaaaaaaaaaaaaaaaaaaaaaaaaaaaaaaaaaaaaaaaaaaad",
  "cardinaliteAmdtMultiples": "1",
  "amendementParent": {
    "@xmlns:xsi": "http://www.w3.org/2001/XMLSchema-instance",
    "@xsi:nil": "true"
  },
  "etat": "Discuté",
  "signataires": {
    "auteur": {
      "typeAuteur": "Depute",
      "acteurRef": "PA508",
      "organeRef": {
        "@xmlns:xsi": "http://www.w3.org/2001/XMLSchema-instance",
        "@xsi:nil": "true"
      },
      "groupePolitiqueRef": "PO758835"
    },
    "cosignataires": {
      "acteurRef": [
        "PA605069",
        "PA1592",
        "PA1198",
        "PA332614",
        "PA340343",
        "PA267233",
        "PA429893",
        "PA1809",
        "PA333818",
        "PA340357",
        "PA609590",
        "PA608695",
        "PA333285",
        "PA608011",
        "PA642764",
        "PA342415",
        "PA720988",
        "PA335054",
        "PA608741",
        "PA643145",
        "PA508",
        "PA719930",
        "PA335532",
        "PA337483",
        "PA608172",
        "PA1008",
        "PA610681",
        "PA607553",
        "PA609332"
      ]
    },
    "texteAffichable": "Mme&#160;Bi&#233;mouret,  M.&#160;Aviragnet, Mme&#160;Bareigts, M.&#160;Vallaud, Mme&#160;Battistel, M.&#160;Bouillon, M.&#160;Jean-Louis&#160;Bricout, M.&#160;Carvounas, M.&#160;Alain&#160;David, Mme&#160;Laurence&#160;Dumont, M.&#160;Faure, M.&#160;Garot, M.&#160;David&#160;Habib, M.&#160;Hutin, M.&#160;Juanico, Mme&#160;Karamanli, M.&#160;J&#233;r&#244;me&#160;Lambert, M.&#160;Letchimy, Mme&#160;Manin, Mme&#160;Pau-Langevin, Mme&#160;Pires Beaune, M.&#160;Potier, M.&#160;Pueyo, Mme&#160;Rabault, M.&#160;Saulignac, Mme&#160;Tolmont, Mme&#160;Untermaier, Mme&#160;Vainqueur-Christophe, Mme&#160;Victory et les membres du groupe Socialistes et apparent&#233;s"
  },
  "pointeurFragmentTexte": {
    "missionVisee": {
      "@xmlns:xsi": "http://www.w3.org/2001/XMLSchema-instance",
      "@xsi:nil": "true"
    },
    "division": {
      "titre": "Article 4",
      "articleDesignationCourte": "ART. 4",
      "type": "ARTICLE",
      "avant_A_Apres": "A",
      "divisionRattachee": "ARTICLE 4",
      "articleAdditionnel": {
        "@xmlns:xsi": "http://www.w3.org/2001/XMLSchema-instance",
        "@xsi:nil": "true"
      },
      "chapitreAdditionnel": {
        "@xmlns:xsi": "http://www.w3.org/2001/XMLSchema-instance",
        "@xsi:nil": "true"
      },
      "urlDivisionTexteVise": "/15/textes/1150.asp#D_Article_4"
    },
    "alinea": {
      "avant_A_Apres": {
        "@xmlns:xsi": "http://www.w3.org/2001/XMLSchema-instance",
        "@xsi:nil": "true"
      },
      "numero": "3",
      "alineaDesignation": {
        "@xmlns:xsi": "http://www.w3.org/2001/XMLSchema-instance",
        "@xsi:nil": "true"
      }
    }
  },
  "corps": {
    "dispositif": "<p style=\"text-align: justify;\">R&#233;diger ainsi le d&#233;but de la premi&#232;re phrase de l&#8217;alin&#233;a&#160;3 :</p><p style=\"text-align: justify;\">&#171;&#160;<i>Art. L. 223-1-3.</i> &#8211; Lorsque le pr&#233;sident du conseil d&#233;partemental, les titulaires de l&#8217;autorit&#233; parentale et, le cas &#233;ch&#233;ant, la personne d&#233;sign&#233;e en tant que tiers digne de confiance ne s&#8217;y opposent pas, le...<i> (le reste sans changement)</i> &#187;.</p>",
    "exposeSommaire": "<p style=\"text-align: justify;\">Par cet amendement, il est propos&#233; de soumettre la possibilit&#233; pour le jeune de d&#233;signer une personne de confiance pour l&#8217;accompagner dans ses d&#233;marches, &#224; l&#8217;autorisation du pr&#233;sident du conseil d&#233;partemental, aux titulaires de l&#8217;autorit&#233; parentale et, le cas &#233;ch&#233;ant, &#224; la personne d&#233;sign&#233;e en tant que tiers digne de confiance lorsque celle-ci n&#8217;est pas la m&#234;me personne.</p><p style=\"text-align: justify;\">Cet amendement vise &#224; &#233;viter des situations malheureuses o&#249; le jeune se laisserait influencer par un proche malveillant pour prendre des d&#233;cisions relatives &#224; sa prise d&#8217;autonomie.</p>",
    "annexeExposeSommaire": {
      "@xmlns:xsi": "http://www.w3.org/2001/XMLSchema-instance",
      "@xsi:nil": "true"
    },
    "cartoucheDelaiDepotDepasse": "Sous réserve de son traitement par les services de l'Assemblée nationale et de sa recevabilité"
  },
  "representations": {
    "representation": {
      "nom": "PDF",
      "typeMime": {
        "type": "application",
        "subType": "PDF"
      },
      "statutRepresentation": {
        "verbatim": "true",
        "canonique": "true",
        "officielle": "true",
        "transcription": "false",
        "enregistrement": "false"
      },
      "repSource": {
        "@xmlns:xsi": "http://www.w3.org/2001/XMLSchema-instance",
        "@xsi:nil": "true"
      },
      "offset": {
        "@xmlns:xsi": "http://www.w3.org/2001/XMLSchema-instance",
        "@xsi:nil": "true"
      },
      "contenu": {
        "documentURI": "/15/amendements/1150/AN/72.pdf"
      },
      "dateDispoRepresentation": {
        "@xmlns:xsi": "http://www.w3.org/2001/XMLSchema-instance",
        "@xsi:nil": "true"
      }
    }
  },
  "seanceDiscussion": {
    "@xmlns:xsi": "http://www.w3.org/2001/XMLSchema-instance",
    "@xsi:nil": "true"
  },
  "sort": {
    "dateSaisie": "2019-05-07T19:07:07.000+02:00",
    "sortEnSeance": "Non soutenu"
  },
  "dateDepot": "2019-05-02T02:00:00.000+02:00",
  "dateDistribution": "2019-05-07T02:00:00.000+02:00",
  "article99": "0",
  "loiReference": {
    "codeLoi": null,
    "divisionCodeLoi": {
      "@xmlns:xsi": "http://www.w3.org/2001/XMLSchema-instance",
      "@xsi:nil": "true"
    }
  }
}