{
  "@xmlns": "http://schemas.assemblee-nationale.fr/referentiel",
  "uid": "AMANR5L15PO419865B1255P1D1N130",
  "identifiant": {
    "legislature": "15",
    "numero": "130",
    "numRect": "0",
    "saisine": {
      "refTexteLegislatif": "PRJLANR5L15B1255",
      "numeroPartiePLF": "1",
      "organeExamen": "PO419865",
      "mentionSecondeDeliberation": "0"
    }
  },
  "numeroLong": "I-CD130",
  "etapeTexte": "1ère lecture (1ère assemblée saisie)",
  "triAmendement": "biaaaaaaaaaaaaaaaaaaaaaaaaaaaaaaaaaaaaaaaaaaaaaaaafw",
  "cardinaliteAmdtMultiples": "1",
  "amendementParent": {
    "@xmlns:xsi": "http://www.w3.org/2001/XMLSchema-instance",
    "@xsi:nil": "true"
  },
  "etat": "Irrecevable",
  "signataires": {
    "auteur": {
      "typeAuteur": "Depute",
      "acteurRef": "PA722236",
      "organeRef": {
        "@xmlns:xsi": "http://www.w3.org/2001/XMLSchema-instance",
        "@xsi:nil": "true"
      },
      "groupePolitiqueRef": "PO730964"
    },
    "cosignataires": {
      "acteurRef": [
        "PA718710",
        "PA719624",
        "PA718962",
        "PA719890",
        "PA720806",
        "PA719412",
        "PA720038",
        "PA720944",
        "PA719080",
        "PA721426",
        "PA720310",
        "PA721860",
        "PA721514",
        "PA719740",
        "PA720538",
        "PA718894",
        "PA605518",
        "PA720054",
        "PA722228",
        "PA722336",
        "PA719632",
        "PA722000",
        "PA720242",
        "PA719194",
        "PA722366",
        "PA720414",
        "PA718802",
        "PA719882",
        "PA609520",
        "PA722236",
        "PA720278",
        "PA719972",
        "PA605084",
        "PA721876",
        "PA721372",
        "PA719922",
        "PA719092",
        "PA719718"
      ]
    },
    "texteAffichable": "M.&#160;Djebbari,  M.&#160;Perea, Mme&#160;Abba, M.&#160;Arend, Mme&#160;Pascale&#160;Boyer, Mme&#160;Brulebois, rapporteure M.&#160;Buchou, M.&#160;Causse, M.&#160;Cesarini, M.&#160;Colas-Roy, Mme&#160;Couillard, Mme&#160;Yolaine&#160;de Courson, Mme&#160;De Temmerman, rapporteure M.&#160;Dombreval, M.&#160;Fugit, Mme&#160;Gayte, M.&#160;Haury, rapporteur Mme&#160;Josso, Mme&#160;Kerbarh, M.&#160;Krabal, M.&#160;Fran&#231;ois-Michel&#160;Lambert, Mme&#160;Le Feur, M.&#160;Leclabart, Mme&#160;Maillart-M&#233;haignerie, Mme&#160;Marsaud, Mme&#160;Meynier-Millefert, M.&#160;Morenas, M.&#160;Orphelin, Mme&#160;Panonacle, Mme&#160;Park, rapporteure M.&#160;Perrot, M.&#160;Pichereau, rapporteur Mme&#160;Pompili, Mme&#160;Riotton, Mme&#160;Sarles, M.&#160;Thi&#233;baut, Mme&#160;Tuffnell et M.&#160;Zulesi"
  },
  "pointeurFragmentTexte": {
    "missionVisee": {
      "@xmlns:xsi": "http://www.w3.org/2001/XMLSchema-instance",
      "@xsi:nil": "true"
    },
    "division": {
      "titre": "Article 7",
      "articleDesignationCourte": "APRÈS ART. 7",
      "type": "ARTICLE",
      "avant_A_Apres": "Après",
      "divisionRattachee": "APRÈS L'ARTICLE 7, insérer l'article suivant:",
      "articleAdditionnel": "1",
      "chapitreAdditionnel": {
        "@xmlns:xsi": "http://www.w3.org/2001/XMLSchema-instance",
        "@xsi:nil": "true"
      },
      "urlDivisionTexteVise": "/15/textes/1255A.asp#D_Article_7"
    },
    "alinea": {
      "@xmlns:xsi": "http://www.w3.org/2001/XMLSchema-instance",
      "@xsi:nil": "true"
    }
  },
  "corps": {
    "dispositif": "<p style=\"text-align: justify;\">L&#8217;article L&#160;541&#8209;10&#8209;2 du code de l&#8217;environnement est ainsi modifi&#233;&#160;:</p><p style=\"text-align: justify;\">1&#176;&#160;Au premier alin&#233;a, les mots&#160;: &#171;&#160;&#224; la pr&#233;vention et&#160;&#187; sont remplac&#233;s par les mots&#160;: &#171;&#160;en premier lieu &#224; la pr&#233;vention et &#224; d&#233;faut&#160;&#187;&#160;;</p><p style=\"text-align: justify;\">2&#176;&#160;Au d&#233;but du troisi&#232;me alin&#233;a, sont ajout&#233;s les mots&#160;: &#171;&#160;La r&#233;paration des &#233;quipements et&#160;&#187;, et les mots&#160;: &#171;&#160;est assur&#233;&#160;&#187; sont remplac&#233;s par les mots&#160;: &#171;&#160;sont assur&#233;s&#160;&#187;&#160;;</p><p style=\"text-align: justify;\">3&#176;&#160;Le quatri&#232;me alin&#233;a est ainsi modifi&#233;&#160;:</p><p style=\"text-align: justify;\"><i>a)</i> Au d&#233;but de l&#8217;alin&#233;a, l&#8217;ann&#233;e&#160;: &#171;&#160;2020&#160;&#187; est remplac&#233;e par l&#8217;ann&#233;e&#160;: &#171;&#160;2025&#160;&#187;&#160;;</p><p style=\"text-align: justify;\"><i>b)</i> Apr&#232;s les mots&#160;: &#171;&#160;support&#233; pour&#160;&#187;, sont ins&#233;r&#233;s les mots&#160;: &#171;&#160;la r&#233;paration des &#233;quipements et&#160;&#187;&#160;;</p><p style=\"text-align: justify;\">4&#176;&#160;Apr&#232;s le cinqui&#232;me alin&#233;a est ins&#233;r&#233; un alin&#233;a ainsi r&#233;dig&#233;&#160;:</p><p style=\"text-align: justify;\">&#171;&#160;&#192; ce co&#251;t est ajout&#233;e une contribution en fonction du caract&#232;re r&#233;parable ou non de l&#8217;&#233;quipement, de la r&#233;paration effective propos&#233;e ou non par le producteur ou le distributeur, et de la dur&#233;e de la garantie propos&#233;e. Cette contribution est modul&#233;e de 0 &#224; 100&#160;% de mani&#232;re &#224; inciter producteurs et consommateurs &#224; se tourner vers des produits r&#233;parables et &#224; longue dur&#233;e de vie. Elle est ajout&#233;e au co&#251;t unitaire mentionn&#233; &#224; l&#8217;alin&#233;a pr&#233;c&#233;dent. Le co&#251;t global est pr&#233;sent&#233; de mani&#232;re &#224; mettre en &#233;vidence pour le consommateur la modulation du prix en fonction de la durabilit&#233; du produit et de la hi&#233;rarchie de gestion des d&#233;chets.&#160;&#187;</p>",
    "exposeSommaire": "<p style=\"text-align: justify;\">Cet amendement vise &#224; envoyer un signal prix afin d&#8217;inciter &#224; la conception, &#224; la production et &#224; la consommation d&#8217;&#233;quipements &#233;lectriques et &#233;lectroniques r&#233;parables et durables.&#160;</p><p style=\"text-align: justify;\">L&#8217;objet de cet amendement est de cr&#233;er un environnement qui incite &#224; proposer des objets r&#233;parables et &#224; la dur&#233;e de vie la plus longue possible ainsi qu&#8217;&#224; offrir un service de r&#233;paration au consommateur.</p><p style=\"text-align: justify;\">L&#8217;&#233;co-contribution qui existe actuellement pour les &#233;quipements &#233;lectriques et &#233;lectroniques, dans le cadre de la responsabilit&#233; &#233;largie du producteur cr&#233;&#233;e pour cette fili&#232;re, pr&#233;sente plusieurs d&#233;fauts&#160;: elle est tr&#232;s peu visible pour le consommateur du fait de son montant tr&#232;s faible et elle ne varie pas en fonction de la durabilit&#233; et de la r&#233;parabilit&#233; du produit.</p><p style=\"text-align: justify;\">Il est donc propos&#233; de cr&#233;er une contribution en fonction du caract&#232;re r&#233;parable ou non de l&#8217;objet concern&#233;, de la proposition par la marque d&#8217;un service de r&#233;paration effective, et de la dur&#233;e de garantie propos&#233;e.</p>",
    "annexeExposeSommaire": {
      "@xmlns:xsi": "http://www.w3.org/2001/XMLSchema-instance",
      "@xsi:nil": "true"
    }
  },
  "representations": {
    "representation": {
      "nom": "PDF",
      "typeMime": {
        "type": "application",
        "subType": "PDF"
      },
      "statutRepresentation": {
        "verbatim": "true",
        "canonique": "true",
        "officielle": "true",
        "transcription": "false",
        "enregistrement": "false"
      },
      "repSource": {
        "@xmlns:xsi": "http://www.w3.org/2001/XMLSchema-instance",
        "@xsi:nil": "true"
      },
      "offset": {
        "@xmlns:xsi": "http://www.w3.org/2001/XMLSchema-instance",
        "@xsi:nil": "true"
      },
      "contenu": {
        "documentURI": "/15/amendements/1255A/CION-DVP/CD130.pdf"
      },
      "dateDispoRepresentation": {
        "@xmlns:xsi": "http://www.w3.org/2001/XMLSchema-instance",
        "@xsi:nil": "true"
      }
    }
  },
  "seanceDiscussion": {
    "@xmlns:xsi": "http://www.w3.org/2001/XMLSchema-instance",
    "@xsi:nil": "true"
  },
  "sort": {
    "@xmlns:xsi": "http://www.w3.org/2001/XMLSchema-instance",
    "@xsi:nil": "true"
  },
  "dateDepot": "2018-09-29T02:00:00.000+02:00",
  "dateDistribution": {
    "@xmlns:xsi": "http://www.w3.org/2001/XMLSchema-instance",
    "@xsi:nil": "true"
  },
  "article99": "0",
  "loiReference": {
    "codeLoi": "environnement",
    "divisionCodeLoi": "L541-10-2"
  }
}