{
  "@xmlns": "http://schemas.assemblee-nationale.fr/referentiel",
  "uid": "AMANR5L15SEA717460BTC1974P0D1N954",
  "identifiant": {
    "legislature": "15",
    "numero": "954",
    "numRect": "0",
    "saisine": {
      "refTexteLegislatif": "PRJLANR5L15BTC1974",
      "numeroPartiePLF": "0",
      "organeExamen": "PO717460",
      "mentionSecondeDeliberation": "0"
    }
  },
  "numeroLong": "954",
  "etapeTexte": "1ère lecture (2ème assemblée saisie)",
  "triAmendement": "etaaaaaaaaaaaaaaaaaaaaaaaaaaaaaaaaaaaaaaaaaaaaaaaawl",
  "cardinaliteAmdtMultiples": "1",
  "amendementParent": {
    "@xmlns:xsi": "http://www.w3.org/2001/XMLSchema-instance",
    "@xsi:nil": "true"
  },
  "etat": "Discuté",
  "signataires": {
    "auteur": {
      "typeAuteur": "Depute",
      "acteurRef": "PA720790",
      "organeRef": {
        "@xmlns:xsi": "http://www.w3.org/2001/XMLSchema-instance",
        "@xsi:nil": "true"
      },
      "groupePolitiqueRef": "PO730964"
    },
    "cosignataires": {
      "acteurRef": "PA720790"
    },
    "texteAffichable": "M.&#160;Grau"
  },
  "pointeurFragmentTexte": {
    "missionVisee": {
      "@xmlns:xsi": "http://www.w3.org/2001/XMLSchema-instance",
      "@xsi:nil": "true"
    },
    "division": {
      "titre": "Article 27",
      "articleDesignationCourte": "APRÈS ART. 27",
      "type": "ARTICLE",
      "avant_A_Apres": "Après",
      "divisionRattachee": "APRÈS L'ARTICLE 27, insérer l'article suivant:",
      "articleAdditionnel": "1",
      "chapitreAdditionnel": {
        "@xmlns:xsi": "http://www.w3.org/2001/XMLSchema-instance",
        "@xsi:nil": "true"
      },
      "urlDivisionTexteVise": "/15/textes/1974.asp#D_Article_27"
    },
    "alinea": {
      "@xmlns:xsi": "http://www.w3.org/2001/XMLSchema-instance",
      "@xsi:nil": "true"
    }
  },
  "corps": {
    "dispositif": "<p>Tout vendeur d&#8217;un v&#233;hicule &#233;ligible &#224; un certificat qualit&#233; de l&#8217;air doit afficher distinctement le num&#233;ro de certificat qualit&#233; de l&#8217;air associ&#233; au v&#233;hicule, le cas &#233;ch&#233;ant, &#224; c&#244;t&#233; de l&#8217;information d&#233;taillant le bonus/malus &#233;cologique.</p>",
    "exposeSommaire": "<p style=\"text-align: justify;\">La transition &#233;nerg&#233;tique oriente les choix des consommateurs vers des solutions con&#231;ues comme respectueuses de l&#8217;environnement. Dans cette optique, tout choix suppose un discernement &#233;clair&#233; par une information aussi compl&#232;te que possible. L&#8217;aide &#224; la d&#233;cision est essentielle, particuli&#232;rement lors de l&#8217;achat d&#8217;un v&#233;hicule, objet complexe et on&#233;reux. En effet, l&#8217;effort financier du conducteur ne saurait porter sur un mod&#232;le de v&#233;hicule qui ne lui permettrait pas de circuler partout.</p><p style=\"text-align: justify;\">Or, en ce qui concerne la dimension &#233;cologique, les ventes de v&#233;hicules sont encadr&#233;es par des normes paradoxales&#160;: les renseignements qui concernent l&#8217;environnement permettent essentiellement au consommateur de d&#233;terminer si l&#8217;achat du v&#233;hicule qu&#8217;il envisage donne lieu &#224; un bonus ou &#224; un malus financier. Ce dernier est &#233;tabli uniquement en fonction des &#233;missions de CO2 du v&#233;hicule mais n&#8217;informe pas sur sa cat&#233;gorie Crit&#8217;Air, pourtant essentielle pour respecter les restrictions de circulation en vigueur dans les Zones &#224; faibles &#233;missions (ZFE).</p><p style=\"text-align: justify;\">Cependant, une fois l&#8217;achat effectu&#233;, la question financi&#232;re li&#233;e au malus dispara&#238;t au profit de la question des restrictions de circulation instaur&#233;es dans le cadre du syst&#232;me Crit&#8217;Air&#160;: le v&#233;hicule concern&#233; est-il autoris&#233; &#224; entrer dans les &#171;&#160;zones &#224; faibles &#233;missions&#160;&#187; (ZFE) des villes qui utilisent les vignettes Crit&#8217;Air (nom usuel des &#171;&#160;Certificats Qualit&#233; de l&#8217;air&#160;&#187;)&#160;? Ces vignettes sont attribu&#233;es selon la date de premi&#232;re immatriculation du v&#233;hicule et selon la norme Euro &#224; laquelle correspond sa motorisation. Or les normes Euro sont fond&#233;es sur&#160;:<br />- les oxydes d&#8217;azote (NOx) <br />- le monoxyde de carbone (CO)<br />- les hydrocarbures (HC)<br />- les hydrocarbures non m&#233;thaniques (HCNM)<br />- les particules (PM)<br />- les particules (PN)<br />Certains v&#233;hicules bien class&#233;s selon Crit&#8217;Air sont pourtant tr&#232;s mal class&#233;s en ce qui concerne le malus &#233;cologique. &#192; l&#8217;inverse, certains v&#233;hicules dont les &#233;missions de CO2 sont plus faibles, sont mal class&#233;s en ce qui concerne les vignettes Crit&#8217;Air.</p><p style=\"text-align: justify;\">Force est de constater que l&#8217;attribution des vignettes Crit&#8217;Air ne prend actuellement pas en compte tous les polluants nocifs pour la sant&#233; humaine ou pour la plan&#232;te. L&#8217;achat d&#8217;un v&#233;hicule suppose donc une r&#233;flexion pouss&#233;e sur son mode de propulsion. Cependant, lorsqu&#8217;un conducteur ach&#232;te un v&#233;hicule, il ne dispose pas d&#8217;informations qui lui permettraient d&#8217;estimer imm&#233;diatement les futures capacit&#233;s de circulation de ce m&#234;me v&#233;hicule dans une Zone &#224; faibles &#233;missions.</p><p style=\"text-align: justify;\">Dans un souci de transparence, de clart&#233; et d&#8217;acc&#232;s &#224; l&#8217;information, il est donc justifi&#233; que le vendeur d&#8217;un v&#233;hicule soit d&#233;sormais oblig&#233; d&#8217;afficher distinctement le num&#233;ro de Certificat Qualit&#233; de l&#8217;air associ&#233; au v&#233;hicule (fond&#233; notamment sur le niveau d&#8217;&#233;mission de particules fines), &#224; c&#244;t&#233; de l&#8217;information d&#233;taillant le bonus/malus &#233;cologique (fond&#233; sur le niveau d&#8217;&#233;mission de CO2).</p><p style=\"text-align: justify;\">Cette proposition am&#233;liorera grandement l&#8217;information du consommateur lors de l&#8217;achat d&#8217;un bien tr&#232;s co&#251;teux. Elle aura aussi l&#8217;avantage de mieux faire conna&#238;tre le dispositif Crit&#8217;Air dont la diffusion progressive suppose de la p&#233;dagogie afin que ses enjeux et modalit&#233;s soient clairement identifi&#233;s par tous les conducteurs.</p><p style=\"text-align: justify;\">Tel est le sens de cet amendement.</p><p style=\"text-align: justify;\">&#160;</p>",
    "annexeExposeSommaire": {
      "@xmlns:xsi": "http://www.w3.org/2001/XMLSchema-instance",
      "@xsi:nil": "true"
    },
    "cartoucheDelaiDepotDepasse": {
      "@xmlns:xsi": "http://www.w3.org/2001/XMLSchema-instance",
      "@xsi:nil": "true"
    }
  },
  "representations": {
    "representation": {
      "nom": "PDF",
      "typeMime": {
        "type": "application",
        "subType": "PDF"
      },
      "statutRepresentation": {
        "verbatim": "true",
        "canonique": "true",
        "officielle": "true",
        "transcription": "false",
        "enregistrement": "false"
      },
      "repSource": {
        "@xmlns:xsi": "http://www.w3.org/2001/XMLSchema-instance",
        "@xsi:nil": "true"
      },
      "offset": {
        "@xmlns:xsi": "http://www.w3.org/2001/XMLSchema-instance",
        "@xsi:nil": "true"
      },
      "contenu": {
        "documentURI": "/15/amendements/1974/AN/954.pdf"
      },
      "dateDispoRepresentation": {
        "@xmlns:xsi": "http://www.w3.org/2001/XMLSchema-instance",
        "@xsi:nil": "true"
      }
    }
  },
  "seanceDiscussion": "RUANR5L15S2019IDS21697",
  "sort": {
    "dateSaisie": "2019-06-12T23:19:22.000+02:00",
    "sortEnSeance": "Non soutenu"
  },
  "dateDepot": "2019-05-28T02:00:00.000+02:00",
  "dateDistribution": "2019-06-04T02:00:00.000+02:00",
  "article99": "0",
  "loiReference": {
    "codeLoi": {
      "@xmlns:xsi": "http://www.w3.org/2001/XMLSchema-instance",
      "@xsi:nil": "true"
    },
    "divisionCodeLoi": {
      "@xmlns:xsi": "http://www.w3.org/2001/XMLSchema-instance",
      "@xsi:nil": "true"
    }
  }
}