{
  "@xmlns": "http://schemas.assemblee-nationale.fr/referentiel",
  "uid": "AMANR5L15SEA717460BTC1019P0D1N1712",
  "identifiant": {
    "legislature": "15",
    "numero": "1712",
    "numRect": "0",
    "saisine": {
      "refTexteLegislatif": "PRJLANR5L15BTC1019",
      "numeroPartiePLF": "0",
      "organeExamen": "PO717460",
      "mentionSecondeDeliberation": "0"
    }
  },
  "numeroLong": "1712",
  "etapeTexte": "1ère lecture (1ère assemblée saisie)",
  "triAmendement": "bjrhq",
  "cardinaliteAmdtMultiples": "1",
  "amendementParent": {
    "@xmlns:xsi": "http://www.w3.org/2001/XMLSchema-instance",
    "@xsi:nil": "true"
  },
  "etat": "Discuté",
  "signataires": {
    "auteur": {
      "typeAuteur": "Depute",
      "acteurRef": "PA722252",
      "organeRef": {
        "@xmlns:xsi": "http://www.w3.org/2001/XMLSchema-instance",
        "@xsi:nil": "true"
      },
      "groupePolitiqueRef": "PO730964"
    },
    "cosignataires": {
      "acteurRef": [
        "PA719652",
        "PA721296",
        "PA720622",
        "PA720046",
        "PA721888",
        "PA720916",
        "PA718710",
        "PA721792",
        "PA721844",
        "PA722022",
        "PA722118",
        "PA719330",
        "PA722070",
        "PA720154",
        "PA719728",
        "PA606639",
        "PA721328",
        "PA607155",
        "PA720568",
        "PA721352",
        "PA722252",
        "PA719464",
        "PA719440",
        "PA719790",
        "PA719980",
        "PA720190",
        "PA720030",
        "PA720806",
        "PA718962"
      ]
    },
    "texteAffichable": "Mme&#160;Rixain,  Mme&#160;Lazaar, M.&#160;Gouffier-Cha, Mme&#160;Brugnera, M.&#160;Nadot, Mme&#160;Pascale&#160;Boyer, M.&#160;Sorre, Mme&#160;Cazarian, Mme&#160;Dufeu Schubert, M.&#160;Vignal, Mme&#160;Guerel, M.&#160;Raphan, M.&#160;Zulesi, Mme&#160;Sylla, M.&#160;Borowczyk, M.&#160;Chalumeau, M.&#160;Henriet, Mme&#160;Gayte, Mme&#160;Dubr&#233;-Chirat, M.&#160;Le Bohec, Mme&#160;Piron, M.&#160;Freschi, M.&#160;Cellier, Mme&#160;Bureau-Bonnard, Mme&#160;Hammerer, Mme&#160;Romeiro Dias, M.&#160;Gouttefarde, M.&#160;Daniel et Mme&#160;Thill"
  },
  "pointeurFragmentTexte": {
    "missionVisee": {
      "@xmlns:xsi": "http://www.w3.org/2001/XMLSchema-instance",
      "@xsi:nil": "true"
    },
    "division": {
      "titre": "Article 8",
      "articleDesignationCourte": "ART. 8",
      "type": "ARTICLE",
      "avant_A_Apres": "A",
      "divisionRattachee": "ARTICLE 8",
      "articleAdditionnel": {
        "@xmlns:xsi": "http://www.w3.org/2001/XMLSchema-instance",
        "@xsi:nil": "true"
      },
      "chapitreAdditionnel": {
        "@xmlns:xsi": "http://www.w3.org/2001/XMLSchema-instance",
        "@xsi:nil": "true"
      },
      "urlDivisionTexteVise": "/15/textes/1019.asp#D_Article_8"
    },
    "alinea": {
      "avant_A_Apres": "A",
      "numero": "44",
      "alineaDesignation": "Alinéa 44"
    }
  },
  "corps": {
    "dispositif": "<p style=\"text-align: justify;\">Apr&#232;s le mot&#160;:</p><p style=\"text-align: justify;\">&#171;&#160;majeur&#160;&#187;,</p><p style=\"text-align: justify;\">r&#233;diger ainsi la fin de la premi&#232;re phrase de l&#8217;alin&#233;a&#160;44&#160;:</p><p style=\"text-align: justify;\">&#171;&#160;, offrir toutes garanties de moralit&#233;&#160;et ne pas avoir &#233;t&#233; condamn&#233; pour des faits de violences commis sur mineur.&#160;&#187;</p>",
    "exposeSommaire": "<p style=\"text-align: justify;\">Il semble n&#233;cessaire de pr&#233;ciser ce que sont les &#171;&#160;garanties de moralit&#233;&#160;&#187; attendues. Le ma&#238;tre d&#8217;apprentissage ayant un rapport hi&#233;rarchique et personnel avec l&#8217;apprenti, il convient d&#8217;apporter des garanties s&#233;rieuses au mineur afin de pr&#233;server un public fragile.</p>",
    "annexeExposeSommaire": {
      "@xmlns:xsi": "http://www.w3.org/2001/XMLSchema-instance",
      "@xsi:nil": "true"
    }
  },
  "representations": {
    "representation": {
      "nom": "PDF",
      "typeMime": {
        "type": "application",
        "subType": "PDF"
      },
      "statutRepresentation": {
        "verbatim": "true",
        "canonique": "true",
        "officielle": "true",
        "transcription": "false",
        "enregistrement": "false"
      },
      "repSource": {
        "@xmlns:xsi": "http://www.w3.org/2001/XMLSchema-instance",
        "@xsi:nil": "true"
      },
      "offset": {
        "@xmlns:xsi": "http://www.w3.org/2001/XMLSchema-instance",
        "@xsi:nil": "true"
      },
      "contenu": {
        "documentURI": "/15/amendements/1019/AN/1712.pdf"
      },
      "dateDispoRepresentation": {
        "@xmlns:xsi": "http://www.w3.org/2001/XMLSchema-instance",
        "@xsi:nil": "true"
      }
    }
  },
  "seanceDiscussion": "RUANR5L15S2018IDS21102",
  "sort": {
    "dateSaisie": "2018-06-14T17:56:59.000+02:00",
    "sortEnSeance": "Rejeté"
  },
  "dateDepot": "2018-06-07T02:00:00.000+02:00",
  "dateDistribution": "2018-06-11T02:00:00.000+02:00",
  "article99": "0",
  "loiReference": {
    "codeLoi": {
      "@xmlns:xsi": "http://www.w3.org/2001/XMLSchema-instance",
      "@xsi:nil": "true"
    },
    "divisionCodeLoi": {
      "@xmlns:xsi": "http://www.w3.org/2001/XMLSchema-instance",
      "@xsi:nil": "true"
    }
  }
}