{
  "@xmlns": "http://schemas.assemblee-nationale.fr/referentiel",
  "uid": "AMANR5L15SEA717460B0499P0D1N27",
  "identifiant": {
    "legislature": "15",
    "numero": "27",
    "numRect": "0",
    "saisine": {
      "refTexteLegislatif": "PRJLANR5L15B0499",
      "numeroPartiePLF": "0",
      "organeExamen": "PO717460",
      "mentionSecondeDeliberation": "1"
    }
  },
  "numeroLong": "27",
  "etapeTexte": "Nouvelle Lecture",
  "triAmendement": "bac",
  "cardinaliteAmdtMultiples": "1",
  "amendementParent": {
    "@xmlns:xsi": "http://www.w3.org/2001/XMLSchema-instance",
    "@xsi:nil": "true"
  },
  "etat": "Discuté",
  "signataires": {
    "auteur": {
      "typeAuteur": "Depute",
      "acteurRef": "PA609245",
      "organeRef": {
        "@xmlns:xsi": "http://www.w3.org/2001/XMLSchema-instance",
        "@xsi:nil": "true"
      },
      "groupePolitiqueRef": "PO730934"
    },
    "cosignataires": {
      "acteurRef": "PA609245"
    },
    "texteAffichable": "Mme&#160;Lacroute"
  },
  "pointeurFragmentTexte": {
    "missionVisee": {
      "@xmlns:xsi": "http://www.w3.org/2001/XMLSchema-instance",
      "@xsi:nil": "true"
    },
    "division": {
      "titre": "Article 17",
      "articleDesignationCourte": "ART. 17",
      "type": "ARTICLE",
      "avant_A_Apres": "A",
      "divisionRattachee": "ARTICLE 17",
      "articleAdditionnel": {
        "@xmlns:xsi": "http://www.w3.org/2001/XMLSchema-instance",
        "@xsi:nil": "true"
      },
      "chapitreAdditionnel": {
        "@xmlns:xsi": "http://www.w3.org/2001/XMLSchema-instance",
        "@xsi:nil": "true"
      },
      "urlDivisionTexteVise": "/15/textes/0499.asp#D_Article_17"
    },
    "alinea": {
      "avant_A_Apres": {
        "@xmlns:xsi": "http://www.w3.org/2001/XMLSchema-instance",
        "@xsi:nil": "true"
      },
      "numero": "10",
      "alineaDesignation": {
        "@xmlns:xsi": "http://www.w3.org/2001/XMLSchema-instance",
        "@xsi:nil": "true"
      }
    }
  },
  "corps": {
    "dispositif": "<p style=\"text-align: justify;\">&#192; la derni&#232;re phrase de l&#8217;alin&#233;a&#160;10, apr&#232;s le mot&#160;:</p><p style=\"text-align: justify;\">&#171;&#160;locaux&#160;&#187;</p><p style=\"text-align: justify;\">ins&#233;rer les mots&#160;:</p><p style=\"text-align: justify;\">&#171;&#160;, ainsi que les conditions de rattachement individuel des propri&#233;t&#233;s ou fractions de propri&#233;t&#233;s mentionn&#233;es au I &#224; ces cat&#233;gories,&#160;&#187;</p>",
    "exposeSommaire": "<p style=\"text-align: justify;\">La r&#233;vision des valeurs locatives pour les locaux professionnels est entr&#233;e en vigueur cette ann&#233;e. Son esprit de simplification et de s&#233;curisation juridique des bases d&#8217;imposition, tant pour les collectivit&#233;s que pour les contribuables, m&#233;riterait de pr&#233;ciser les r&#232;gles de prises en compte des surfaces pond&#233;r&#233;es ainsi que les conditions de rattachement d&#8217;un local &#224; une cat&#233;gorie tarifaire.</p><p style=\"text-align: justify;\">En effet, la r&#233;vision des valeurs locatives a &#233;t&#233; faite dans l&#8217;id&#233;e de mettre fin &#224; une d&#233;finition jurisprudentielle des bases li&#233;e au flou qui encadrait les &#233;valuations dans le syst&#232;me non r&#233;vis&#233;. Or, la r&#233;vision des valeurs locatives entr&#233;e en vigueur cette ann&#233;e risque bien de ne pas tenir cette promesse en omettant de d&#233;finir pr&#233;cis&#233;ment les conditions individuelles de rattachement d&#8217;un local &#224; une cat&#233;gorie tarifaire et les r&#232;gles de r&#233;partition entre surfaces principales et surfaces secondaires, qui ne sont actuellement d&#233;finies que dans les notices annex&#233;es aux d&#233;clarations, avec une port&#233;e juridique nulle.</p><p style=\"text-align: justify;\">Le d&#233;cret pris en application du V de l&#8217;article&#160;34 ne mentionne en effet qu&#8217;une condition de &#171;&#160;valeur d&#8217;utilisation r&#233;duite par rapport &#224; l&#8217;affectation principale du local&#160;&#187;, impr&#233;cision qui ouvre la voie &#224; de nombreux contentieux &#224; traiter par les services d&#8217;assiette de la DGFIP, et dont les issues incertaines fragiliseraient les recettes des collectivit&#233;s territoriales, ainsi que celles de l&#8217;&#201;tat qui prend &#224; sa charge les d&#233;gr&#232;vements contentieux tant que les valeurs locatives recalcul&#233;es ne sont pas int&#233;gr&#233;es dans les impositions per&#231;ues par les collectivit&#233;s.</p><p style=\"text-align: justify;\">Par exemple, pour les bureaux, les surfaces d&#8217;utilisation r&#233;duites doivent comprendre les locaux d&#8217;archivage situ&#233;s en sous-sol, ainsi que les armoires &#233;lectriques ou les espaces de connectique. Certains contribuables pourraient &#234;tre tent&#233;s de d&#233;clencher des proc&#233;dures contentieuses afin de diminuer le montant de leurs imp&#244;ts fonciers en incorporant des surfaces principales (comme les couloirs ou les sanitaires par exemple) en surfaces secondaires (qui sont minor&#233;es de 50&#160;%, voire 80&#160;% pour les surfaces ext&#233;rieures).</p><p style=\"text-align: justify;\">Par ailleurs, ces impr&#233;cisions sont source d&#8217;in&#233;galit&#233;s entre contribuables dans la mesure o&#249; certains seront impos&#233;s selon des d&#233;clarations remplies dans le respect des notices annex&#233;es, tandis que d&#8217;autres, mieux avertis, seront impos&#233;s sur la base de d&#233;clarations remplies &#224; partir de leur propre interpr&#233;tation de ce qui constitue une surface ayant &#171;&#160;une valeur d&#8217;utilisation r&#233;duite&#160;&#187;.</p><p style=\"text-align: justify;\">Cet amendement vise donc &#224; ce que les d&#233;crets pr&#233;cisant la classification des locaux et la pond&#233;ration des surfaces soient compl&#233;t&#233;s par la mention des conditions, d&#233;crites de fa&#231;on pr&#233;cise, de rattachement d&#8217;un local &#224; une cat&#233;gorie et de l&#8217;&#233;ligibilit&#233; ou non par type de surface et par cat&#233;gorie de local, &#224; une pond&#233;ration.</p><p style=\"text-align: justify;\">Il est utile de pr&#233;ciser que, une fois cet amendement adopt&#233;, l&#8217;&#201;tat devra mettre &#224; jour les d&#233;crets avant l&#8217;&#233;tablissement des impositions dues au titre de 2018, &#224; des fins de s&#233;curisation des bases d&#8217;imposition dues au titre de cette ann&#233;e.</p>",
    "annexeExposeSommaire": {
      "@xmlns:xsi": "http://www.w3.org/2001/XMLSchema-instance",
      "@xsi:nil": "true"
    }
  },
  "representations": {
    "representation": {
      "nom": "PDF",
      "typeMime": {
        "type": "application",
        "subType": "PDF"
      },
      "statutRepresentation": {
        "verbatim": "true",
        "canonique": "true",
        "officielle": "true",
        "transcription": "false",
        "enregistrement": "false"
      },
      "repSource": {
        "@xmlns:xsi": "http://www.w3.org/2001/XMLSchema-instance",
        "@xsi:nil": "true"
      },
      "offset": {
        "@xmlns:xsi": "http://www.w3.org/2001/XMLSchema-instance",
        "@xsi:nil": "true"
      },
      "contenu": {
        "documentURI": "/15/amendements/0499/AN/27.pdf"
      },
      "dateDispoRepresentation": {
        "@xmlns:xsi": "http://www.w3.org/2001/XMLSchema-instance",
        "@xsi:nil": "true"
      }
    }
  },
  "seanceDiscussion": "RUANR5L15S2018IDS20849",
  "sort": {
    "dateSaisie": "2017-12-20T00:14:26.000+01:00",
    "sortEnSeance": "Rejeté"
  },
  "dateDepot": "2017-12-18T01:00:00.000+01:00",
  "dateDistribution": "2017-12-18T01:00:00.000+01:00",
  "article99": "0",
  "loiReference": {
    "codeLoi": {
      "@xmlns:xsi": "http://www.w3.org/2001/XMLSchema-instance",
      "@xsi:nil": "true"
    },
    "divisionCodeLoi": {
      "@xmlns:xsi": "http://www.w3.org/2001/XMLSchema-instance",
      "@xsi:nil": "true"
    }
  }
}