{
  "@xmlns": "http://schemas.assemblee-nationale.fr/referentiel",
  "uid": "AMANR5L15SEA717460BTC0106P0D1N435",
  "identifiant": {
    "legislature": "15",
    "numero": "435",
    "numRect": "0",
    "saisine": {
      "refTexteLegislatif": "PRJLANR5L15BTC0106",
      "numeroPartiePLF": "0",
      "organeExamen": "PO717460",
      "mentionSecondeDeliberation": "0"
    }
  },
  "numeroLong": "435",
  "etapeTexte": "1ère lecture (2ème assemblée saisie)",
  "triAmendement": "izqy",
  "cardinaliteAmdtMultiples": "1",
  "amendementParent": {
    "@xmlns:xsi": "http://www.w3.org/2001/XMLSchema-instance",
    "@xsi:nil": "true"
  },
  "etat": "Discuté",
  "signataires": {
    "auteur": {
      "typeAuteur": "Depute",
      "acteurRef": "PA609332",
      "organeRef": {
        "@xmlns:xsi": "http://www.w3.org/2001/XMLSchema-instance",
        "@xsi:nil": "true"
      },
      "groupePolitiqueRef": "PO730946"
    },
    "cosignataires": {
      "acteurRef": [
        "PA405480",
        "PA333285",
        "PA643145",
        "PA1198",
        "PA1008",
        "PA609332",
        "PA1592",
        "PA720988"
      ]
    },
    "texteAffichable": "M.&#160;Faure,  M.&#160;Alain&#160;David, Mme&#160;Laurence&#160;Dumont, M.&#160;Garot, M.&#160;David&#160;Habib, Mme&#160;Manin, M.&#160;Pupponi et Mme&#160;Vainqueur-Christophe"
  },
  "pointeurFragmentTexte": {
    "missionVisee": {
      "@xmlns:xsi": "http://www.w3.org/2001/XMLSchema-instance",
      "@xsi:nil": "true"
    },
    "division": {
      "titre": "Article PREMIER",
      "articleDesignationCourte": "ART. PREMIER",
      "type": "ARTICLE",
      "avant_A_Apres": "A",
      "divisionRattachee": "ARTICLE PREMIER",
      "articleAdditionnel": {
        "@xmlns:xsi": "http://www.w3.org/2001/XMLSchema-instance",
        "@xsi:nil": "true"
      },
      "chapitreAdditionnel": {
        "@xmlns:xsi": "http://www.w3.org/2001/XMLSchema-instance",
        "@xsi:nil": "true"
      },
      "urlDivisionTexteVise": "/15/textes/0106.asp#D_Article_1er"
    },
    "alinea": {
      "avant_A_Apres": "Apres",
      "numero": "9",
      "alineaDesignation": {
        "@xmlns:xsi": "http://www.w3.org/2001/XMLSchema-instance",
        "@xsi:nil": "true"
      }
    }
  },
  "corps": {
    "dispositif": "<p style=\"text-align: justify;\">Apr&#232;s l&#8217;alin&#233;a&#160;9, ins&#233;rer l&#8217;alin&#233;a suivant&#160;:</p><p style=\"text-align: justify;\">&#171;&#160;6&#176;&#160;<i>bis</i>&#160;Les crimes et d&#233;lits pr&#233;vus aux cinqui&#232;me, septi&#232;me et huiti&#232;me alin&#233;as de l&#8217;article&#160;24, &#224; l&#8217;article&#160;24&#160;<i>bis</i>, aux deuxi&#232;me et troisi&#232;me alin&#233;as de l&#8217;article&#160;32 et aux troisi&#232;me et quatri&#232;me alin&#233;as de l&#8217;article&#160;33 de la loi du 29 juillet 1881 sur la libert&#233; de la presse&#160;&#187;.</p>",
    "exposeSommaire": "<p style=\"text-align: justify;\">L&#8217;article&#160;1<sup>er</sup> du projet de loi r&#233;tablissant la confiance dans l&#8217;action publique avait pour objet d&#8217;&#233;tendre le champ d&#8217;application de la peine compl&#233;mentaire obligatoire d&#8217;in&#233;ligibilit&#233;.</p><p style=\"text-align: justify;\">En commission des lois de l&#8217;Assembl&#233;e nationale, un amendement de r&#233;&#233;criture g&#233;n&#233;rale de l&#8217;article a &#233;t&#233; adopt&#233;. Il reprend le dispositif contenu dans la proposition de loi visant &#224; instaurer une obligation de casier judiciaire vierge pour les candidats &#224; une &#233;lection locale port&#233;e par le groupe socialiste sous la pr&#233;c&#233;dente l&#233;gislature. Cette proposition de loi avait &#233;t&#233; adopt&#233;e &#224; l&#8217;unanimit&#233; des groupes sur les bancs de l&#8217;Assembl&#233;e nationale le 1er f&#233;vrier 2017.</p><p style=\"text-align: justify;\">L&#8217;article&#160;1er vise donc d&#233;sormais &#224; ajouter une condition d&#8217;in&#233;ligibilit&#233; pour les &#233;lections l&#233;gislatives&#160;: pour se porter candidat, le bulletin n&#176;2 (B2) du casier judiciaire devra &#234;tre exempt de condamnation incompatible avec l&#8217;exercice du mandat.</p><p style=\"text-align: justify;\">Les infractions consid&#233;r&#233;es comme incompatibles sont les infractions criminelles et un certain nombre de d&#233;lits d&#8217;ordre sexuel, ainsi que les manquements au devoir de probit&#233; et les fraudes &#233;lectorales et fiscales, faux et usage de faux en &#233;criture publique.</p><p style=\"text-align: justify;\">Cet amendement vise &#224; incorporer dans la liste des infractions consid&#233;r&#233;es comme incompatibles les injures publiques &#224; caract&#232;re racial ou homophobe, la diffamation publique &#224; caract&#232;re racial ou homophobe, la provocation publique &#224; la discrimination, &#224; la haine ou &#224; la violence &#224; caract&#232;re racial ou homophobe, l&#8217;apologie de crimes contre l&#8217;humanit&#233; et la contestation de crimes contre l&#8217;humanit&#233;.</p><p style=\"text-align: justify;\">Cet amendement a son corolaire au sein du projet de loi organique.</p><p style=\"text-align: justify;\">&#160;</p>",
    "annexeExposeSommaire": {
      "@xmlns:xsi": "http://www.w3.org/2001/XMLSchema-instance",
      "@xsi:nil": "true"
    }
  },
  "representations": {
    "representation": {
      "nom": "PDF",
      "typeMime": {
        "type": "application",
        "subType": "PDF"
      },
      "statutRepresentation": {
        "verbatim": "true",
        "canonique": "true",
        "officielle": "true",
        "transcription": "false",
        "enregistrement": "false"
      },
      "repSource": {
        "@xmlns:xsi": "http://www.w3.org/2001/XMLSchema-instance",
        "@xsi:nil": "true"
      },
      "offset": {
        "@xmlns:xsi": "http://www.w3.org/2001/XMLSchema-instance",
        "@xsi:nil": "true"
      },
      "contenu": {
        "documentURI": "/15/amendements/0106/AN/435.pdf"
      },
      "dateDispoRepresentation": {
        "@xmlns:xsi": "http://www.w3.org/2001/XMLSchema-instance",
        "@xsi:nil": "true"
      }
    }
  },
  "seanceDiscussion": "RUANR5L15S2017IDS20626",
  "sort": {
    "dateSaisie": "2017-07-25T01:17:58.000+02:00",
    "sortEnSeance": "Tombé"
  },
  "dateDepot": "2017-07-21T02:00:00.000+02:00",
  "dateDistribution": "2017-07-22T02:00:00.000+02:00",
  "article99": "0",
  "loiReference": {
    "codeLoi": {
      "@xmlns:xsi": "http://www.w3.org/2001/XMLSchema-instance",
      "@xsi:nil": "true"
    },
    "divisionCodeLoi": {
      "@xmlns:xsi": "http://www.w3.org/2001/XMLSchema-instance",
      "@xsi:nil": "true"
    }
  }
}