{
  "@xmlns": "http://schemas.assemblee-nationale.fr/referentiel",
  "uid": "AMANR5L15SEA717460B1490P0D1N757",
  "identifiant": {
    "legislature": "15",
    "numero": "757",
    "numRect": "0",
    "saisine": {
      "refTexteLegislatif": "PRJLANR5L15B1490",
      "numeroPartiePLF": "0",
      "organeExamen": "PO717460",
      "mentionSecondeDeliberation": "0"
    }
  },
  "numeroLong": "757",
  "etapeTexte": "Nouvelle Lecture",
  "triAmendement": "atiaaaaaaaaaaaaaaaaaaaaaaaaaaaaaaaaaaaaaaaaaaaaaaaf",
  "cardinaliteAmdtMultiples": "1",
  "amendementParent": {
    "@xmlns:xsi": "http://www.w3.org/2001/XMLSchema-instance",
    "@xsi:nil": "true"
  },
  "etat": "Discuté",
  "signataires": {
    "auteur": {
      "typeAuteur": "Depute",
      "acteurRef": "PA721054",
      "organeRef": {
        "@xmlns:xsi": "http://www.w3.org/2001/XMLSchema-instance",
        "@xsi:nil": "true"
      },
      "groupePolitiqueRef": "PO730934"
    },
    "cosignataires": {
      "acteurRef": "PA721054"
    },
    "texteAffichable": "M.&#160;Lorion"
  },
  "pointeurFragmentTexte": {
    "missionVisee": {
      "@xmlns:xsi": "http://www.w3.org/2001/XMLSchema-instance",
      "@xsi:nil": "true"
    },
    "division": {
      "titre": "Article 11",
      "articleDesignationCourte": "ART. 11",
      "type": "ARTICLE",
      "avant_A_Apres": "A",
      "divisionRattachee": "ARTICLE 11",
      "articleAdditionnel": {
        "@xmlns:xsi": "http://www.w3.org/2001/XMLSchema-instance",
        "@xsi:nil": "true"
      },
      "chapitreAdditionnel": {
        "@xmlns:xsi": "http://www.w3.org/2001/XMLSchema-instance",
        "@xsi:nil": "true"
      },
      "urlDivisionTexteVise": "/15/textes/1490.asp#D_Article_11"
    },
    "alinea": {
      "avant_A_Apres": {
        "@xmlns:xsi": "http://www.w3.org/2001/XMLSchema-instance",
        "@xsi:nil": "true"
      },
      "numero": "26",
      "alineaDesignation": {
        "@xmlns:xsi": "http://www.w3.org/2001/XMLSchema-instance",
        "@xsi:nil": "true"
      }
    }
  },
  "corps": {
    "dispositif": "<p style=\"text-align: justify;\">I.&#160;&#8211;&#160;&#192; la fin de l&#8217;alin&#233;a&#160;26, substituer &#224;&#160;la date&#160;:&#160;</p><p style=\"text-align: justify;\">&#171;&#160;24 septembre 2018&#160;&#187;&#160;</p><p style=\"text-align: justify;\">la date&#160;:</p><p style=\"text-align: justify;\">&#171;&#160;31 d&#233;cembre 2018&#160;&#187;.</p><p style=\"text-align: justify;\">II.&#160;&#8211;&#160;En cons&#233;quence, proc&#233;der &#224; la m&#234;me substitution &#224; la fin de l&#8217;alin&#233;a&#160;27.</p><p style=\"text-align: justify;\">&#160;</p>",
    "exposeSommaire": "<p style=\"text-align: justify;\">L&#8217;article&#160;11 pr&#233;voit la suppression des dispositifs de d&#233;fiscalisation codifi&#233;s aux articles&#160;199&#160;<i>undecies</i>&#160;C et 217&#160;<i>undecies</i> du CGI relatifs &#224; l&#8217;acquisition de logements sociaux dans les d&#233;partements d&#8217;outre-mer, le gouvernement estimant que ces dispositifs seraient devenus inefficients compte tenu de la mont&#233;e en puissance du m&#233;canismes de cr&#233;dit d&#8217;imp&#244;t pr&#233;vu par l&#8217;article&#160;244&#160;<i>quater</i>&#160;X du m&#234;me code.</p><p style=\"text-align: justify;\">Pour l&#8217;entr&#233;e en vigueur de cette suppression, le marqueur a &#233;t&#233; fix&#233; au 24&#160;septembre 2018, date de pr&#233;sentation du PLF au conseil des Ministres. Toutes les demandes d&#8217;agr&#233;ments d&#233;pos&#233;es apr&#232;s cette date pour b&#233;n&#233;ficier de la d&#233;fiscalisation devenant inop&#233;rantes.&#160;</p><p style=\"text-align: justify;\">Comme l&#8217;a rappel&#233; Gilles Carrez, au-del&#224; la question de la remise en cause la remise en cause de la d&#233;fiscalisation du logement social dans les DOM, c&#8217;est la question de la brutalit&#233; de cette d&#233;cision qui interpelle. Non seulement un dispositif fiscal qui a fait toutes les preuves de son efficacit&#233; au cours de sa courte existence est aujourd&#8217;hui supprim&#233; d&#8217;un trait de plume avec de surcro&#238;t une date d&#8217;arr&#234;t du dispositif ant&#233;rieure aux d&#233;bats parlementaires.</p><p style=\"text-align: justify;\">Les date r&#233;troactives d&#8217;application des mesures fiscales ne sont jamais souhaitables pour leur acceptation par nos concitoyens.</p><p style=\"text-align: justify;\">Dans ces conditions, afin de tenir compte &#224; la fois des discussions qui ont entour&#233; l&#8217;examen de ce texte au Parlement et le travail effectu&#233; par certains organismes de logements sociaux pour pr&#233;parer leur dossier de financement de logements sociaux en d&#233;fiscalisation, il en reste peu mais il en reste, le pr&#233;sent amendement propose de d&#233;caler la date du dispositif transitoire au 31 d&#233;cembre 2018.</p>",
    "annexeExposeSommaire": {
      "@xmlns:xsi": "http://www.w3.org/2001/XMLSchema-instance",
      "@xsi:nil": "true"
    },
    "cartoucheDelaiDepotDepasse": {
      "@xmlns:xsi": "http://www.w3.org/2001/XMLSchema-instance",
      "@xsi:nil": "true"
    }
  },
  "representations": {
    "representation": {
      "nom": "PDF",
      "typeMime": {
        "type": "application",
        "subType": "PDF"
      },
      "statutRepresentation": {
        "verbatim": "true",
        "canonique": "true",
        "officielle": "true",
        "transcription": "false",
        "enregistrement": "false"
      },
      "repSource": {
        "@xmlns:xsi": "http://www.w3.org/2001/XMLSchema-instance",
        "@xsi:nil": "true"
      },
      "offset": {
        "@xmlns:xsi": "http://www.w3.org/2001/XMLSchema-instance",
        "@xsi:nil": "true"
      },
      "contenu": {
        "documentURI": "/15/amendements/1490/AN/757.pdf"
      },
      "dateDispoRepresentation": {
        "@xmlns:xsi": "http://www.w3.org/2001/XMLSchema-instance",
        "@xsi:nil": "true"
      }
    }
  },
  "seanceDiscussion": "RUANR5L15S2019IDS21433",
  "sort": {
    "dateSaisie": "2018-12-18T22:10:51.000+01:00",
    "sortEnSeance": "Tombé"
  },
  "dateDepot": "2018-12-14T01:00:00.000+01:00",
  "dateDistribution": "2018-12-17T01:00:00.000+01:00",
  "article99": "0",
  "loiReference": {
    "codeLoi": {
      "@xmlns:xsi": "http://www.w3.org/2001/XMLSchema-instance",
      "@xsi:nil": "true"
    },
    "divisionCodeLoi": {
      "@xmlns:xsi": "http://www.w3.org/2001/XMLSchema-instance",
      "@xsi:nil": "true"
    }
  }
}