{
  "@xmlns": "http://schemas.assemblee-nationale.fr/referentiel",
  "uid": "AMANR5L15PO419610B0627P0D1N696",
  "identifiant": {
    "legislature": "15",
    "numero": "696",
    "numRect": "0",
    "saisine": {
      "refTexteLegislatif": "PRJLANR5L15B0627",
      "numeroPartiePLF": "0",
      "organeExamen": "PO419610",
      "mentionSecondeDeliberation": "0"
    }
  },
  "numeroLong": "CE696",
  "etapeTexte": "1ère lecture (1ère assemblée saisie)",
  "triAmendement": "avfzzhu",
  "cardinaliteAmdtMultiples": "1",
  "amendementParent": {
    "@xmlns:xsi": "http://www.w3.org/2001/XMLSchema-instance",
    "@xsi:nil": "true"
  },
  "etat": "Discuté",
  "signataires": {
    "auteur": {
      "typeAuteur": "Depute",
      "acteurRef": "PA608016",
      "organeRef": {
        "@xmlns:xsi": "http://www.w3.org/2001/XMLSchema-instance",
        "@xsi:nil": "true"
      },
      "groupePolitiqueRef": "PO730934"
    },
    "cosignataires": {
      "acteurRef": [
        "PA609245",
        "PA332523",
        "PA605991",
        "PA266797",
        "PA267204",
        "PA606712",
        "PA334654",
        "PA267785",
        "PA330909",
        "PA643103",
        "PA608016"
      ]
    },
    "texteAffichable": "Mme&#160;Louwagie,  M.&#160;Larriv&#233;, M.&#160;Sermier, M.&#160;Straumann, M.&#160;Ferrara, M.&#160;Descoeur, Mme&#160;Lacroute, Mme&#160;Genevard, Mme&#160;Dalloz, M.&#160;Gosselin et M.&#160;Lurton"
  },
  "pointeurFragmentTexte": {
    "missionVisee": {
      "@xmlns:xsi": "http://www.w3.org/2001/XMLSchema-instance",
      "@xsi:nil": "true"
    },
    "division": {
      "titre": "Article PREMIER",
      "articleDesignationCourte": "ART. PREMIER",
      "type": "ARTICLE",
      "avant_A_Apres": "A",
      "divisionRattachee": "ARTICLE PREMIER",
      "articleAdditionnel": {
        "@xmlns:xsi": "http://www.w3.org/2001/XMLSchema-instance",
        "@xsi:nil": "true"
      },
      "chapitreAdditionnel": {
        "@xmlns:xsi": "http://www.w3.org/2001/XMLSchema-instance",
        "@xsi:nil": "true"
      },
      "urlDivisionTexteVise": "/15/textes/0627.asp#D_Article_1er"
    },
    "alinea": {
      "avant_A_Apres": {
        "@xmlns:xsi": "http://www.w3.org/2001/XMLSchema-instance",
        "@xsi:nil": "true"
      },
      "numero": "6",
      "alineaDesignation": {
        "@xmlns:xsi": "http://www.w3.org/2001/XMLSchema-instance",
        "@xsi:nil": "true"
      }
    }
  },
  "corps": {
    "dispositif": "<p style=\"text-align: justify;\">Compl&#233;ter l&#8217;alin&#233;a&#160;6 par les deux phrases suivantes&#160;:</p><p style=\"text-align: justify;\">&#171;&#160;La proposition de contrat ou d&#8217;accord-cadre &#233;crit est le socle unique de la n&#233;gociation au sens de l&#8217;article L.&#160;441&#8209;6 du code de commerce. Tout refus de la proposition de contrat ou d&#8217;accord-cadre &#233;crit par le premier acheteur ainsi que toute r&#233;serve sur un ou plusieurs &#233;l&#233;ments de cette proposition doivent &#234;tre motiv&#233;s et transmis &#224; l&#8217;auteur de la proposition.&#160;&#187;</p>",
    "exposeSommaire": "<p style=\"text-align: justify;\">Cet amendement pr&#233;voit de renvoyer au code de commerce, en indiquant que la proposition d&#8217;accord-cadre &#233;crit &#233;mise par l&#8217;OP constitue le socle unique de la n&#233;gociation. Ainsi l&#8217;objectif est de faire le parall&#232;le avec les Conditions G&#233;n&#233;rales de Vente que tout fournisseur doit proposer &#224; son acheteur et qui sont le point de d&#233;part de la n&#233;gociation, en opposition aux conditions d&#8217;achat du client. L&#8217;int&#233;r&#234;t est de faire le lien avec les sanctions pr&#233;vues &#224; l&#8217;article L.&#160;442&#8209;6 du code de commerce.</p>",
    "annexeExposeSommaire": {
      "@xmlns:xsi": "http://www.w3.org/2001/XMLSchema-instance",
      "@xsi:nil": "true"
    }
  },
  "representations": {
    "representation": {
      "nom": "PDF",
      "typeMime": {
        "type": "application",
        "subType": "PDF"
      },
      "statutRepresentation": {
        "verbatim": "true",
        "canonique": "true",
        "officielle": "true",
        "transcription": "false",
        "enregistrement": "false"
      },
      "repSource": {
        "@xmlns:xsi": "http://www.w3.org/2001/XMLSchema-instance",
        "@xsi:nil": "true"
      },
      "offset": {
        "@xmlns:xsi": "http://www.w3.org/2001/XMLSchema-instance",
        "@xsi:nil": "true"
      },
      "contenu": {
        "documentURI": "/15/amendements/0627/CION-ECO/CE696.pdf"
      },
      "dateDispoRepresentation": {
        "@xmlns:xsi": "http://www.w3.org/2001/XMLSchema-instance",
        "@xsi:nil": "true"
      }
    }
  },
  "seanceDiscussion": {
    "@xmlns:xsi": "http://www.w3.org/2001/XMLSchema-instance",
    "@xsi:nil": "true"
  },
  "sort": {
    "dateSaisie": "2018-04-17T18:04:55.000+02:00",
    "sortEnSeance": "Non soutenu"
  },
  "dateDepot": "2018-04-10T02:00:00.000+02:00",
  "dateDistribution": "2018-04-16T02:00:00.000+02:00",
  "article99": "0",
  "loiReference": {
    "codeLoi": {
      "@xmlns:xsi": "http://www.w3.org/2001/XMLSchema-instance",
      "@xsi:nil": "true"
    },
    "divisionCodeLoi": {
      "@xmlns:xsi": "http://www.w3.org/2001/XMLSchema-instance",
      "@xsi:nil": "true"
    }
  }
}