{
  "@xmlns": "http://schemas.assemblee-nationale.fr/referentiel",
  "uid": "AMANR5L15SEA717460BTC2206P0D1N183",
  "identifiant": {
    "legislature": "15",
    "numero": "183",
    "numRect": "0",
    "saisine": {
      "refTexteLegislatif": "PRJLANR5L15BTC2206",
      "numeroPartiePLF": "0",
      "organeExamen": "PO717460",
      "mentionSecondeDeliberation": "0"
    }
  },
  "numeroLong": "183",
  "etapeTexte": "Nouvelle Lecture",
  "triAmendement": "bdcaaaaaaaaaaaaaaaaaaaaaaaaaaaaaaaaaaaaaaaaaaaaaaal",
  "cardinaliteAmdtMultiples": "1",
  "amendementParent": {
    "@xmlns:xsi": "http://www.w3.org/2001/XMLSchema-instance",
    "@xsi:nil": "true"
  },
  "etat": "Discuté",
  "signataires": {
    "auteur": {
      "typeAuteur": "Depute",
      "acteurRef": "PA721816",
      "organeRef": {
        "@xmlns:xsi": "http://www.w3.org/2001/XMLSchema-instance",
        "@xsi:nil": "true"
      },
      "groupePolitiqueRef": "PO730934"
    },
    "cosignataires": {
      "acteurRef": [
        "PA721816",
        "PA718780",
        "PA267204",
        "PA721506",
        "PA2377",
        "PA605036",
        "PA718884",
        "PA720630",
        "PA1327",
        "PA606712",
        "PA266776",
        "PA722390",
        "PA267429",
        "PA608416",
        "PA718850",
        "PA1012",
        "PA340853",
        "PA330909",
        "PA266797",
        "PA721636",
        "PA346218",
        "PA721314",
        "PA709315",
        "PA719318",
        "PA266793",
        "PA721968",
        "PA721286"
      ]
    },
    "texteAffichable": "M.&#160;Boucard,  M.&#160;Leclerc, M.&#160;Sermier, M.&#160;Parigi, M.&#160;Ramadier, Mme&#160;Bazin-Malgras, Mme&#160;Anthoine, Mme&#160;Kuster, M.&#160;Gosselin, M.&#160;Lurton, Mme&#160;Trastour-Isnart, M.&#160;Abad, M.&#160;Masson, M.&#160;Descoeur, Mme&#160;Corneloup, M.&#160;Cinieri, M.&#160;Minot, M.&#160;Hetzel, M.&#160;de la Verpilli&#232;re, M.&#160;Vialay, M.&#160;Cordier, M.&#160;Schellenberger, M.&#160;Viala, M.&#160;Bony, M.&#160;Perrut, M.&#160;Forissier et M.&#160;Reiss"
  },
  "pointeurFragmentTexte": {
    "missionVisee": {
      "@xmlns:xsi": "http://www.w3.org/2001/XMLSchema-instance",
      "@xsi:nil": "true"
    },
    "division": {
      "titre": "Article 12",
      "articleDesignationCourte": "ART. 12",
      "type": "ARTICLE",
      "avant_A_Apres": "A",
      "divisionRattachee": "ARTICLE 12",
      "articleAdditionnel": {
        "@xmlns:xsi": "http://www.w3.org/2001/XMLSchema-instance",
        "@xsi:nil": "true"
      },
      "chapitreAdditionnel": {
        "@xmlns:xsi": "http://www.w3.org/2001/XMLSchema-instance",
        "@xsi:nil": "true"
      },
      "urlDivisionTexteVise": "/15/textes/2206.asp#D_Article_12"
    },
    "alinea": {
      "@xmlns:xsi": "http://www.w3.org/2001/XMLSchema-instance",
      "@xsi:nil": "true"
    }
  },
  "corps": {
    "dispositif": "<p style=\"text-align: justify;\">Supprimer cet article.</p>",
    "exposeSommaire": "<p style=\"text-align: justify;\">S&#8217;agissant d&#8217;un sujet aussi fondamental que les v&#233;hicules autonomes, les adaptations l&#233;gislatives doivent &#234;tre prises par le Parlement et non pas par voie d&#8217;ordonnance.</p>",
    "annexeExposeSommaire": {
      "@xmlns:xsi": "http://www.w3.org/2001/XMLSchema-instance",
      "@xsi:nil": "true"
    },
    "cartoucheDelaiDepotDepasse": {
      "@xmlns:xsi": "http://www.w3.org/2001/XMLSchema-instance",
      "@xsi:nil": "true"
    },
    "avantAppel": {
      "@xmlns:xsi": "http://www.w3.org/2001/XMLSchema-instance",
      "@xsi:nil": "true"
    }
  },
  "representations": {
    "representation": {
      "nom": "PDF",
      "typeMime": {
        "type": "application",
        "subType": "PDF"
      },
      "statutRepresentation": {
        "verbatim": "true",
        "canonique": "true",
        "officielle": "true",
        "transcription": "false",
        "enregistrement": "false"
      },
      "repSource": {
        "@xmlns:xsi": "http://www.w3.org/2001/XMLSchema-instance",
        "@xsi:nil": "true"
      },
      "offset": {
        "@xmlns:xsi": "http://www.w3.org/2001/XMLSchema-instance",
        "@xsi:nil": "true"
      },
      "contenu": {
        "documentURI": "/15/amendements/2206/AN/183.pdf"
      },
      "dateDispoRepresentation": {
        "@xmlns:xsi": "http://www.w3.org/2001/XMLSchema-instance",
        "@xsi:nil": "true"
      }
    }
  },
  "seanceDiscussion": "RUANR5L15S2019IDS21803",
  "sort": {
    "dateSaisie": "2019-09-11T17:52:22.000+02:00",
    "sortEnSeance": "Rejeté"
  },
  "dateDepot": "2019-09-05T02:00:00.000+02:00",
  "dateDistribution": "2019-09-09T02:00:00.000+02:00",
  "article99": "0",
  "loiReference": {
    "codeLoi": {
      "@xmlns:xsi": "http://www.w3.org/2001/XMLSchema-instance",
      "@xsi:nil": "true"
    },
    "divisionCodeLoi": {
      "@xmlns:xsi": "http://www.w3.org/2001/XMLSchema-instance",
      "@xsi:nil": "true"
    }
  }
}