{
  "@xmlns": "http://schemas.assemblee-nationale.fr/referentiel",
  "uid": "AMANR5L15SEA717460BTC1767P0D1N551",
  "identifiant": {
    "legislature": "15",
    "numero": "551",
    "numRect": "0",
    "saisine": {
      "refTexteLegislatif": "PRJLANR5L15BTC1767",
      "numeroPartiePLF": "0",
      "organeExamen": "PO717460",
      "mentionSecondeDeliberation": "0"
    }
  },
  "numeroLong": "551",
  "etapeTexte": "1ère lecture (1ère assemblée saisie)",
  "triAmendement": "aboaaaaaaaaaaaaaaaaaaaaaaaaaaaaaaaaaaaaaaaaaaaaaaacdmzvzdzz",
  "cardinaliteAmdtMultiples": "1",
  "amendementParent": {
    "@xmlns:xsi": "http://www.w3.org/2001/XMLSchema-instance",
    "@xsi:nil": "true"
  },
  "etat": "Discuté",
  "signataires": {
    "auteur": {
      "typeAuteur": "Depute",
      "acteurRef": "PA267780",
      "organeRef": {
        "@xmlns:xsi": "http://www.w3.org/2001/XMLSchema-instance",
        "@xsi:nil": "true"
      },
      "groupePolitiqueRef": "PO744425"
    },
    "cosignataires": {
      "acteurRef": [
        "PA267585",
        "PA720696",
        "PA2952",
        "PA712014",
        "PA267780",
        "PA721486",
        "PA642868",
        "PA695100",
        "PA267330",
        "PA267355",
        "PA721632",
        "PA719806"
      ]
    },
    "texteAffichable": "Mme&#160;Firmin Le Bodo,  Mme&#160;Auconie, M.&#160;Christophe, Mme&#160;Descamps, M.&#160;Meyer&#160;Habib, M.&#160;Herth, M.&#160;Ledoux, Mme&#160;Lemoine, M.&#160;Naegelen, M.&#160;Vercamer, M.&#160;Warsmann et M.&#160;Zumkeller"
  },
  "pointeurFragmentTexte": {
    "missionVisee": {
      "@xmlns:xsi": "http://www.w3.org/2001/XMLSchema-instance",
      "@xsi:nil": "true"
    },
    "division": {
      "titre": "Article PREMIER",
      "articleDesignationCourte": "ART. PREMIER",
      "type": "ARTICLE",
      "avant_A_Apres": "A",
      "divisionRattachee": "ARTICLE PREMIER",
      "articleAdditionnel": {
        "@xmlns:xsi": "http://www.w3.org/2001/XMLSchema-instance",
        "@xsi:nil": "true"
      },
      "chapitreAdditionnel": {
        "@xmlns:xsi": "http://www.w3.org/2001/XMLSchema-instance",
        "@xsi:nil": "true"
      },
      "urlDivisionTexteVise": "/15/textes/1767.asp#D_Article_1er"
    },
    "alinea": {
      "avant_A_Apres": {
        "@xmlns:xsi": "http://www.w3.org/2001/XMLSchema-instance",
        "@xsi:nil": "true"
      },
      "numero": "3",
      "alineaDesignation": {
        "@xmlns:xsi": "http://www.w3.org/2001/XMLSchema-instance",
        "@xsi:nil": "true"
      }
    }
  },
  "corps": {
    "dispositif": "<p>Compl&#233;ter la troisi&#232;me phrase de l&#8217;alin&#233;a&#160;3 par les mots&#160;:</p><p style=\"text-align: justify;\">&#171;&#160;apr&#232;s consultation des unions r&#233;gionales de professionnels de sant&#233;&#160;concern&#233;es&#160;&#187;.</p>",
    "exposeSommaire": "<p>Il est pr&#233;vu que les capacit&#233;s d&#8217;accueil des formations en deuxi&#232;me et troisi&#232;me ann&#233;e de premier cycle soient d&#233;termin&#233;es annuellement par les universit&#233;s. Pour d&#233;terminer ces capacit&#233;s d&#8217;accueil, chaque universit&#233; doit prendre en compte les objectifs pluriannuels d&#8217;admission en premi&#232;re ann&#233;e du deuxi&#232;me cycle de ces formations. Ces objectifs pluriannuels, qui tiennent compte des capacit&#233;s de formation et des besoins de sant&#233; du territoire, seront arr&#234;t&#233;s par l&#8217;universit&#233; apr&#232;s avis conforme de l&#8217;agence r&#233;gionale de sant&#233; (ARS) ou des ARS concern&#233;es. L&#8217;objet de cet amendement est de pr&#233;voir en amont de l&#8217;avis de l&#8217;ARS, une consultation des URPS qui ont tout leur r&#244;le &#224; jouer dans la d&#233;finition de ces objectifs, ceci d&#8217;autant que les m&#233;decins lib&#233;raux, quelle que soit leur sp&#233;cialit&#233;, participent &#224; la formation par leur engagement dans la prise en charge de stagiaires dans les cabinets de ville, et les URPS peuvent appr&#233;cier les besoins en professionnels.</p>",
    "annexeExposeSommaire": {
      "@xmlns:xsi": "http://www.w3.org/2001/XMLSchema-instance",
      "@xsi:nil": "true"
    },
    "cartoucheDelaiDepotDepasse": {
      "@xmlns:xsi": "http://www.w3.org/2001/XMLSchema-instance",
      "@xsi:nil": "true"
    }
  },
  "representations": {
    "representation": {
      "nom": "PDF",
      "typeMime": {
        "type": "application",
        "subType": "PDF"
      },
      "statutRepresentation": {
        "verbatim": "true",
        "canonique": "true",
        "officielle": "true",
        "transcription": "false",
        "enregistrement": "false"
      },
      "repSource": {
        "@xmlns:xsi": "http://www.w3.org/2001/XMLSchema-instance",
        "@xsi:nil": "true"
      },
      "offset": {
        "@xmlns:xsi": "http://www.w3.org/2001/XMLSchema-instance",
        "@xsi:nil": "true"
      },
      "contenu": {
        "documentURI": "/15/amendements/1767/AN/551.pdf"
      },
      "dateDispoRepresentation": {
        "@xmlns:xsi": "http://www.w3.org/2001/XMLSchema-instance",
        "@xsi:nil": "true"
      }
    }
  },
  "seanceDiscussion": "RUANR5L15S2019IDS21558",
  "sort": {
    "dateSaisie": "2019-03-18T23:40:18.000+01:00",
    "sortEnSeance": "Rejeté"
  },
  "dateDepot": "2019-03-15T01:00:00.000+01:00",
  "dateDistribution": "2019-03-18T01:00:00.000+01:00",
  "article99": "0",
  "loiReference": {
    "codeLoi": {
      "@xmlns:xsi": "http://www.w3.org/2001/XMLSchema-instance",
      "@xsi:nil": "true"
    },
    "divisionCodeLoi": {
      "@xmlns:xsi": "http://www.w3.org/2001/XMLSchema-instance",
      "@xsi:nil": "true"
    }
  }
}