{
  "@xmlns": "http://schemas.assemblee-nationale.fr/referentiel",
  "uid": "AMANR5L15SEA717460BTC1918P0D1N132",
  "identifiant": {
    "legislature": "15",
    "numero": "132",
    "numRect": "0",
    "saisine": {
      "refTexteLegislatif": "PRJLANR5L15BTC1918",
      "numeroPartiePLF": "0",
      "organeExamen": "PO717460",
      "mentionSecondeDeliberation": "0"
    }
  },
  "numeroLong": "132",
  "etapeTexte": "1ère lecture (1ère assemblée saisie)",
  "triAmendement": "oiaaaaaaaaaaaaaaaaaaaaaaaaaaaaaaaaaaaaaaaaaaaaaaaanzz",
  "cardinaliteAmdtMultiples": "1",
  "amendementParent": {
    "@xmlns:xsi": "http://www.w3.org/2001/XMLSchema-instance",
    "@xsi:nil": "true"
  },
  "etat": "Discuté",
  "signataires": {
    "auteur": {
      "typeAuteur": "Depute",
      "acteurRef": "PA720696",
      "organeRef": {
        "@xmlns:xsi": "http://www.w3.org/2001/XMLSchema-instance",
        "@xsi:nil": "true"
      },
      "groupePolitiqueRef": "PO744425"
    },
    "cosignataires": {
      "acteurRef": [
        "PA267585",
        "PA712014",
        "PA268019",
        "PA721486",
        "PA720696",
        "PA267330",
        "PA266788",
        "PA702052",
        "PA719806",
        "PA342601",
        "PA332228",
        "PA267355",
        "PA267780",
        "PA721110"
      ]
    },
    "texteAffichable": "Mme&#160;Descamps,  Mme&#160;Auconie, M.&#160;Benoit, M.&#160;Brindeau, Mme&#160;Firmin Le Bodo, M.&#160;Herth, M.&#160;Lagarde, M.&#160;Ledoux, M.&#160;Morel-&#192;-L&apos;Huissier, M.&#160;Naegelen, Mme&#160;Sage, Mme&#160;Sanquer, M.&#160;Vercamer et M.&#160;Zumkeller"
  },
  "pointeurFragmentTexte": {
    "missionVisee": {
      "@xmlns:xsi": "http://www.w3.org/2001/XMLSchema-instance",
      "@xsi:nil": "true"
    },
    "division": {
      "titre": "Article 8",
      "articleDesignationCourte": "ART. 8",
      "type": "ARTICLE",
      "avant_A_Apres": "A",
      "divisionRattachee": "ARTICLE 8",
      "articleAdditionnel": {
        "@xmlns:xsi": "http://www.w3.org/2001/XMLSchema-instance",
        "@xsi:nil": "true"
      },
      "chapitreAdditionnel": {
        "@xmlns:xsi": "http://www.w3.org/2001/XMLSchema-instance",
        "@xsi:nil": "true"
      },
      "urlDivisionTexteVise": "/15/textes/1918.asp#D_Article_8"
    },
    "alinea": {
      "avant_A_Apres": "A",
      "numero": "1",
      "alineaDesignation": "Alinéa 1"
    }
  },
  "corps": {
    "dispositif": "<p>&#192; la seconde phrase de l&#8217;alin&#233;a&#160;1, apr&#232;s la seconde occurrence du mot&#160;:</p><p>&#171;&#160;Paris&#160;&#187;,</p><p>ins&#233;rer les mots&#160;:</p><p>&#171;&#160;ainsi que la Fondation du Patrimoine, la Fondation de France, la Fondation Notre-Dame et le Centre des Monuments nationaux.&#160;&#187;</p>",
    "exposeSommaire": "<p>Le pr&#233;sent amendement vise &#224; int&#233;grer les 4 structures que sont la Fondation du Patrimoine, la Fondation de la France, la Fondation Notre-Dame et le Centre des Monuments nationaux au sein de l&#8217;administration de l&#8217;&#233;tablissement public cr&#233;&#233; au profit de la reconstruction de la cath&#233;drale Notre-Dame de Paris. Ces structures ne doivent pas uniquement entretenir un lien financier ou de conseil. Il s&#8217;agit d&#8217;inscrire et de rappeler dans la pr&#233;sente loi leur mission de protection du patrimoine&#160;; ces structures sont &#224; m&#234;me de pouvoir conseiller l&#8217;&#233;tablissement public et apporter une expertise au sein de son administration.</p>",
    "annexeExposeSommaire": {
      "@xmlns:xsi": "http://www.w3.org/2001/XMLSchema-instance",
      "@xsi:nil": "true"
    },
    "cartoucheDelaiDepotDepasse": {
      "@xmlns:xsi": "http://www.w3.org/2001/XMLSchema-instance",
      "@xsi:nil": "true"
    }
  },
  "representations": {
    "representation": {
      "nom": "PDF",
      "typeMime": {
        "type": "application",
        "subType": "PDF"
      },
      "statutRepresentation": {
        "verbatim": "true",
        "canonique": "true",
        "officielle": "true",
        "transcription": "false",
        "enregistrement": "false"
      },
      "repSource": {
        "@xmlns:xsi": "http://www.w3.org/2001/XMLSchema-instance",
        "@xsi:nil": "true"
      },
      "offset": {
        "@xmlns:xsi": "http://www.w3.org/2001/XMLSchema-instance",
        "@xsi:nil": "true"
      },
      "contenu": {
        "documentURI": "/15/amendements/1918/AN/132.pdf"
      },
      "dateDispoRepresentation": {
        "@xmlns:xsi": "http://www.w3.org/2001/XMLSchema-instance",
        "@xsi:nil": "true"
      }
    }
  },
  "seanceDiscussion": {
    "@xmlns:xsi": "http://www.w3.org/2001/XMLSchema-instance",
    "@xsi:nil": "true"
  },
  "sort": {
    "dateSaisie": "2019-05-10T23:05:01.000+02:00",
    "sortEnSeance": "Rejeté"
  },
  "dateDepot": "2019-05-06T02:00:00.000+02:00",
  "dateDistribution": "2019-05-10T02:00:00.000+02:00",
  "article99": "0",
  "loiReference": {
    "codeLoi": {
      "@xmlns:xsi": "http://www.w3.org/2001/XMLSchema-instance",
      "@xsi:nil": "true"
    },
    "divisionCodeLoi": {
      "@xmlns:xsi": "http://www.w3.org/2001/XMLSchema-instance",
      "@xsi:nil": "true"
    }
  }
}