{
  "@xmlns": "http://schemas.assemblee-nationale.fr/referentiel",
  "uid": "AMANR5L15SEA717460BTC1924P0D1N796",
  "identifiant": {
    "legislature": "15",
    "numero": "796",
    "numRect": "0",
    "saisine": {
      "refTexteLegislatif": "PRJLANR5L15BTC1924",
      "numeroPartiePLF": "0",
      "organeExamen": "PO717460",
      "mentionSecondeDeliberation": "0"
    }
  },
  "numeroLong": "796",
  "etapeTexte": "1ère lecture (1ère assemblée saisie)",
  "triAmendement": "isaaaaaaaaaaaaaaaaaaaaaaaaaaaaaaaaaaaaaaaaaaaaaaaacbi",
  "cardinaliteAmdtMultiples": "1",
  "amendementParent": {
    "@xmlns:xsi": "http://www.w3.org/2001/XMLSchema-instance",
    "@xsi:nil": "true"
  },
  "etat": "Discuté",
  "signataires": {
    "auteur": {
      "typeAuteur": "Depute",
      "acteurRef": "PA719890",
      "organeRef": {
        "@xmlns:xsi": "http://www.w3.org/2001/XMLSchema-instance",
        "@xsi:nil": "true"
      },
      "groupePolitiqueRef": "PO730964"
    },
    "cosignataires": {
      "acteurRef": [
        "PA722000",
        "PA720622",
        "PA722312",
        "PA719570",
        "PA722336",
        "PA719960",
        "PA721726",
        "PA719154",
        "PA722134",
        "PA721262",
        "PA719100",
        "PA719448",
        "PA721384",
        "PA606639",
        "PA721946",
        "PA719890",
        "PA718794",
        "PA721434",
        "PA718710",
        "PA719388",
        "PA722300",
        "PA720814",
        "PA718802",
        "PA722398",
        "PA721398",
        "PA722320",
        "PA721514",
        "PA720268"
      ]
    },
    "texteAffichable": "Mme&#160;Brulebois,  M.&#160;Ardouin, Mme&#160;Bessot Ballot, Mme&#160;Pascale&#160;Boyer, M.&#160;Buchou, Mme&#160;Bureau-Bonnard, M.&#160;Cazenove, Mme&#160;Chapelier, M.&#160;Damaisin, Mme&#160;Degois, Mme&#160;Fabre, Mme&#160;Faure-Muntian, M.&#160;Fi&#233;vet, Mme&#160;Fontenel-Personne, Mme&#160;H&#233;rin, Mme&#160;Kerbarh, Mme&#160;Khedher, Mme&#160;Lardet, Mme&#160;Le Meur, M.&#160;Lejeune, M.&#160;Marilossian, M.&#160;Martin, Mme&#160;Mauborgne, M.&#160;Perea, M.&#160;Rebeyrotte, M.&#160;Thi&#233;baut, M.&#160;Vignal et M.&#160;Vuilletet"
  },
  "pointeurFragmentTexte": {
    "missionVisee": {
      "@xmlns:xsi": "http://www.w3.org/2001/XMLSchema-instance",
      "@xsi:nil": "true"
    },
    "division": {
      "titre": "Article 22",
      "articleDesignationCourte": "APRÈS ART. 22",
      "type": "ARTICLE",
      "avant_A_Apres": "Après",
      "divisionRattachee": "APRÈS L'ARTICLE 22, insérer l'article suivant:",
      "articleAdditionnel": "1",
      "chapitreAdditionnel": {
        "@xmlns:xsi": "http://www.w3.org/2001/XMLSchema-instance",
        "@xsi:nil": "true"
      },
      "urlDivisionTexteVise": "/15/textes/1924.asp#D_Article_22"
    },
    "alinea": {
      "@xmlns:xsi": "http://www.w3.org/2001/XMLSchema-instance",
      "@xsi:nil": "true"
    }
  },
  "corps": {
    "dispositif": "<p>L&#8217;&#201;tat met en place une exp&#233;rimentation, dans un d&#233;lai de six mois &#224; compter de la promulgation de la pr&#233;sente loi, dans les collectivit&#233;s territoriales volontaires, r&#233;gion, d&#233;partement, &#233;tablissement public de coop&#233;ration intercommunale ou commune, visant &#224; cr&#233;er une structure de pilotage permanente de l&#8217;apprentissage qui regroupe les &#233;lus locaux, un repr&#233;sentant de l&#8217;&#233;ducation nationale et les organismes gestionnaires des centres de formation des apprentis.</p><p style=\"text-align: justify;\">La mission confi&#233;e &#224; cette structure est de mobiliser les r&#233;seaux des centres de formation des apprentis priv&#233;s et publics de mani&#232;re compl&#233;mentaire et non concurrente afin d&#8217;assurer le meilleur appariement entre les offres d&#8217;apprentissage dans la fonction publique, les demandes des jeunes et les places en centres de formation des apprentis.</p><p style=\"text-align: justify;\">Les modalit&#233;s d&#8217;application de cette exp&#233;rimentation sont d&#233;finies par d&#233;cret.</p>",
    "exposeSommaire": "<p>Les administrations publiques peuvent recourir &#224; l&#8217;apprentissage depuis la loi n&#176; 92&#8209;675 du 17 juillet 1992. D&#8217;une dur&#233;e comprise entre un et trois ans, l&#8217;apprentissage participe &#224; la formation des jeunes &#226;g&#233;s de 16 &#224; 25 ans tout en renfor&#231;ant leur employabilit&#233;. Pour les administrations, il pr&#233;sente de nombreux avantages&#160;: leur fournir un vivier d&#8217;agents dans le cadre d&#8217;une gestion pr&#233;visionnelle des ressources humaines&#160;; leur permettre de valoriser l&#8217;action publique en g&#233;n&#233;ral et le savoir-faire des ma&#238;tres d&#8217;apprentissage en particulier&#160;; contribuer &#224; la formation des jeunes et &#224; la lutte contre le ch&#244;mage.</p><p style=\"text-align: justify;\">Cependant, comme en t&#233;moigne les rapports de l&#8217;IGAS, du S&#233;nat ou du Conseil sup&#233;rieur de la fonction publique territoriale, l&#8217;apprentissage demeure encore faible dans la fonction publique et en de&#231;&#224; des objectifs fix&#233;s par les gouvernements successifs.</p><p style=\"text-align: justify;\">C&#8217;est pourquoi cet amendement propose d&#8217;exp&#233;rimenter au niveau des collectivit&#233;s territoriales pertinentes des structures de pilotage de l&#8217;apprentissage dans la fonction publique, qui garantiront le meilleur appariement entre les offres d&#8217;apprentissage, les demandes des jeunes, et les places en CFA. Ces structures constitueront ainsi un levier efficace pour d&#233;velopper l&#8217;apprentissage dans la fonction publique.</p>",
    "annexeExposeSommaire": {
      "@xmlns:xsi": "http://www.w3.org/2001/XMLSchema-instance",
      "@xsi:nil": "true"
    },
    "cartoucheDelaiDepotDepasse": {
      "@xmlns:xsi": "http://www.w3.org/2001/XMLSchema-instance",
      "@xsi:nil": "true"
    }
  },
  "representations": {
    "representation": {
      "nom": "PDF",
      "typeMime": {
        "type": "application",
        "subType": "PDF"
      },
      "statutRepresentation": {
        "verbatim": "true",
        "canonique": "true",
        "officielle": "true",
        "transcription": "false",
        "enregistrement": "false"
      },
      "repSource": {
        "@xmlns:xsi": "http://www.w3.org/2001/XMLSchema-instance",
        "@xsi:nil": "true"
      },
      "offset": {
        "@xmlns:xsi": "http://www.w3.org/2001/XMLSchema-instance",
        "@xsi:nil": "true"
      },
      "contenu": {
        "documentURI": "/15/amendements/1924/AN/796.pdf"
      },
      "dateDispoRepresentation": {
        "@xmlns:xsi": "http://www.w3.org/2001/XMLSchema-instance",
        "@xsi:nil": "true"
      }
    }
  },
  "seanceDiscussion": {
    "@xmlns:xsi": "http://www.w3.org/2001/XMLSchema-instance",
    "@xsi:nil": "true"
  },
  "sort": {
    "dateSaisie": "2019-05-20T19:42:49.000+02:00",
    "sortEnSeance": "Retiré"
  },
  "dateDepot": "2019-05-09T02:00:00.000+02:00",
  "dateDistribution": "2019-05-15T02:00:00.000+02:00",
  "article99": "0",
  "loiReference": {
    "codeLoi": {
      "@xmlns:xsi": "http://www.w3.org/2001/XMLSchema-instance",
      "@xsi:nil": "true"
    },
    "divisionCodeLoi": {
      "@xmlns:xsi": "http://www.w3.org/2001/XMLSchema-instance",
      "@xsi:nil": "true"
    }
  }
}