{
  "@xmlns": "http://schemas.assemblee-nationale.fr/referentiel",
  "uid": "AMANR5L15PO59051B1785P0D1N186",
  "identifiant": {
    "legislature": "15",
    "numero": "186",
    "numRect": "0",
    "saisine": {
      "refTexteLegislatif": "PIONANR5L15B1785",
      "numeroPartiePLF": "0",
      "organeExamen": "PO59051",
      "mentionSecondeDeliberation": "0"
    }
  },
  "numeroLong": "CL186",
  "etapeTexte": "1ère lecture (1ère assemblée saisie)",
  "triAmendement": "iaaaaaaaaaaaaaaaaaaaaaaaaaaaaaaaaaaaaaaaaaaaaaaaaabo",
  "cardinaliteAmdtMultiples": "1",
  "amendementParent": {
    "@xmlns:xsi": "http://www.w3.org/2001/XMLSchema-instance",
    "@xsi:nil": "true"
  },
  "etat": "Retiré",
  "signataires": {
    "auteur": {
      "typeAuteur": "Depute",
      "acteurRef": "PA718868",
      "organeRef": {
        "@xmlns:xsi": "http://www.w3.org/2001/XMLSchema-instance",
        "@xsi:nil": "true"
      },
      "groupePolitiqueRef": "PO730958"
    },
    "cosignataires": {
      "acteurRef": [
        "PA721960",
        "PA720430",
        "PA2150",
        "PA720892",
        "PA718860",
        "PA588884",
        "PA721202",
        "PA722142",
        "PA719676",
        "PA720286",
        "PA720846",
        "PA721210",
        "PA721226",
        "PA718868",
        "PA721062",
        "PA719578",
        "PA720422"
      ]
    },
    "texteAffichable": "M.&#160;Larive,  Mme&#160;Autain, M.&#160;Bernalicis, M.&#160;Coquerel, M.&#160;Corbi&#232;re, Mme&#160;Fiat, M.&#160;Lachaud, M.&#160;M&#233;lenchon, Mme&#160;Obono, Mme&#160;Panot, M.&#160;Prud&apos;homme, M.&#160;Quatennens, M.&#160;Ratenon, Mme&#160;Ressiguier, Mme&#160;Rubin, M.&#160;Ruffin et Mme&#160;Taurine"
  },
  "pointeurFragmentTexte": {
    "missionVisee": {
      "@xmlns:xsi": "http://www.w3.org/2001/XMLSchema-instance",
      "@xsi:nil": "true"
    },
    "division": {
      "titre": "Article 5",
      "articleDesignationCourte": "ART. 5",
      "type": "ARTICLE",
      "avant_A_Apres": "A",
      "divisionRattachee": "ARTICLE 5",
      "articleAdditionnel": {
        "@xmlns:xsi": "http://www.w3.org/2001/XMLSchema-instance",
        "@xsi:nil": "true"
      },
      "chapitreAdditionnel": {
        "@xmlns:xsi": "http://www.w3.org/2001/XMLSchema-instance",
        "@xsi:nil": "true"
      },
      "urlDivisionTexteVise": "/15/textes/1785.asp#D_Article_5"
    },
    "alinea": {
      "@xmlns:xsi": "http://www.w3.org/2001/XMLSchema-instance",
      "@xsi:nil": "true"
    }
  },
  "corps": {
    "dispositif": "<p style=\"text-align: justify;\">Supprimer cet article.</p>",
    "exposeSommaire": "<p style=\"text-align: justify;\">Par cet amendement, nous souhaitons r&#233;affirmer le fait qu'internet doit &#234;tre un espace de libert&#233;, sur lequel les obligations de lev&#233;es d'anonymat doivent &#234;tre strictement encadr&#233;es. Ce n'est pas le cas ici, cet article 5 contraignant les op&#233;rateurs de plateformes &#224; disposer d&#8217;un repr&#233;sentant l&#233;gal en France aupr&#232;s duquel effectuer des lev&#233;es d'anonymat des personnes utilisatrices des r&#233;seaux de fa&#231;on plus ais&#233;e. <br />Nous ne sommes en effet pas convaincu&#183;e&#183;s que la r&#233;ponse p&#233;nale soit syst&#233;matiquement la plus appropri&#233;e et la plus efficace dans la lutte contre la cyberhaine et les cyberagressions, et pensons que des mesures d'&#233;ducation et de pr&#233;vention seront plus &#224; m&#234;me de venir &#224; bout de ce fl&#233;au.</p><p>En outre, par une d&#233;cision du 21 d&#233;cembre 2016 -T&#233;l&#233; 2, (http://curia.europa.eu/juris/liste.jsf?num=C-203/15&amp;amp;language=fr) la Cour de justice de l'Union europ&#233;enne a sanctionn&#233; une injonction faite &#224; Tele2 Sverige de proc&#233;der &#224; la conservation des donn&#233;es relatives au trafic et des donn&#233;es de localisation de ses abonn&#233;&#183;e&#183;s et utilisateur&#183;rice&#183;s inscrit&#183;e&#183;s. Des conditions de stricte proportionnalit&#233; et de stricte n&#233;cessit&#233; sont exig&#233;es par la Cour, et elles ne semblent ici pas remplies. Au moindre contentieux, cette l&#233;gislation aurait de grand srisques d'&#234;tre d&#233;clar&#233;e inconventionnelle par la Cour. Pour ces deux raisons, nous proposons par cet amendement de supprimer cet article.</p>",
    "annexeExposeSommaire": {
      "@xmlns:xsi": "http://www.w3.org/2001/XMLSchema-instance",
      "@xsi:nil": "true"
    },
    "cartoucheDelaiDepotDepasse": {
      "@xmlns:xsi": "http://www.w3.org/2001/XMLSchema-instance",
      "@xsi:nil": "true"
    }
  },
  "representations": {
    "representation": {
      "nom": "PDF",
      "typeMime": {
        "type": "application",
        "subType": "PDF"
      },
      "statutRepresentation": {
        "verbatim": "true",
        "canonique": "true",
        "officielle": "true",
        "transcription": "false",
        "enregistrement": "false"
      },
      "repSource": {
        "@xmlns:xsi": "http://www.w3.org/2001/XMLSchema-instance",
        "@xsi:nil": "true"
      },
      "offset": {
        "@xmlns:xsi": "http://www.w3.org/2001/XMLSchema-instance",
        "@xsi:nil": "true"
      },
      "contenu": {
        "documentURI": "/15/amendements/1785/CION_LOIS/CL186.pdf"
      },
      "dateDispoRepresentation": {
        "@xmlns:xsi": "http://www.w3.org/2001/XMLSchema-instance",
        "@xsi:nil": "true"
      }
    }
  },
  "seanceDiscussion": {
    "@xmlns:xsi": "http://www.w3.org/2001/XMLSchema-instance",
    "@xsi:nil": "true"
  },
  "sort": {
    "@xmlns:xsi": "http://www.w3.org/2001/XMLSchema-instance",
    "@xsi:nil": "true"
  },
  "dateDepot": "2019-06-14T02:00:00.000+02:00",
  "dateDistribution": "2019-06-19T02:00:00.000+02:00",
  "article99": "0",
  "loiReference": {
    "codeLoi": {
      "@xmlns:xsi": "http://www.w3.org/2001/XMLSchema-instance",
      "@xsi:nil": "true"
    },
    "divisionCodeLoi": {
      "@xmlns:xsi": "http://www.w3.org/2001/XMLSchema-instance",
      "@xsi:nil": "true"
    }
  }
}