{
  "@xmlns": "http://schemas.assemblee-nationale.fr/referentiel",
  "uid": "AMANR5L15PO757134B1673P0D1N286",
  "identifiant": {
    "legislature": "15",
    "numero": "286",
    "numRect": "0",
    "saisine": {
      "refTexteLegislatif": "PRJLANR5L15B1673",
      "numeroPartiePLF": "0",
      "organeExamen": "PO757134",
      "mentionSecondeDeliberation": "0"
    }
  },
  "numeroLong": "286",
  "etapeTexte": "Nouvelle Lecture",
  "triAmendement": "neaaaaaaaaaaaaaaaaaaaaaaaaaaaaaaaaaaaaaaaaaaaaaaaai",
  "cardinaliteAmdtMultiples": "1",
  "amendementParent": {
    "@xmlns:xsi": "http://www.w3.org/2001/XMLSchema-instance",
    "@xsi:nil": "true"
  },
  "etat": "Irrecevable",
  "signataires": {
    "auteur": {
      "typeAuteur": "Depute",
      "acteurRef": "PA721410",
      "organeRef": {
        "@xmlns:xsi": "http://www.w3.org/2001/XMLSchema-instance",
        "@xsi:nil": "true"
      },
      "groupePolitiqueRef": "PO730934"
    },
    "cosignataires": {
      "acteurRef": [
        "PA721410",
        "PA718850",
        "PA330909",
        "PA608416",
        "PA346218",
        "PA721816",
        "PA267429",
        "PA267527",
        "PA340853",
        "PA266793",
        "PA1874",
        "PA608016",
        "PA605036",
        "PA334654",
        "PA267735",
        "PA767",
        "PA718838"
      ]
    },
    "texteAffichable": "Mme&#160;Bonnivard,  M.&#160;Cordier, M.&#160;Cinieri, M.&#160;Hetzel, M.&#160;Saddier, M.&#160;de Ganay, Mme&#160;Louwagie, M.&#160;Bony, M.&#160;Leclerc, M.&#160;Brun, M.&#160;Descoeur, M.&#160;Straumann, M.&#160;Cattin, M.&#160;Boucard, M.&#160;Abad, M.&#160;Masson et M.&#160;Le Fur"
  },
  "pointeurFragmentTexte": {
    "missionVisee": {
      "@xmlns:xsi": "http://www.w3.org/2001/XMLSchema-instance",
      "@xsi:nil": "true"
    },
    "division": {
      "titre": "Article 61 ter",
      "articleDesignationCourte": "ART. 61 TER",
      "type": "ARTICLE",
      "avant_A_Apres": "A",
      "divisionRattachee": "ARTICLE 61 TER",
      "articleAdditionnel": {
        "@xmlns:xsi": "http://www.w3.org/2001/XMLSchema-instance",
        "@xsi:nil": "true"
      },
      "chapitreAdditionnel": {
        "@xmlns:xsi": "http://www.w3.org/2001/XMLSchema-instance",
        "@xsi:nil": "true"
      },
      "urlDivisionTexteVise": "/15/textes/1673.asp#D_Article_61_ter"
    },
    "alinea": {
      "@xmlns:xsi": "http://www.w3.org/2001/XMLSchema-instance",
      "@xsi:nil": "true"
    }
  },
  "corps": {
    "dispositif": "<p style=\"text-align: justify;\">L&#8217;alin&#233;a 1 de l&#8217;article L3142-16 du code du travail est ainsi compl&#233;t&#233; :</p><p style=\"text-align: justify;\">&#171; Le salari&#233; ayant au moins un an d'anciennet&#233; dans l'entreprise a droit &#224; un cong&#233; de proche aidant lorsque l'une des personnes suivantes pr&#233;sente un handicap au titre des articles L.5213-1 &#224; L.5213-3 du code du travail ou une affection inscrite dans la liste des affections de longue dur&#233;e (dite ALD 30) de l&#8217;Assurance Maladie ou une perte d'autonomie d'une particuli&#232;re gravit&#233;: &#187;</p>",
    "exposeSommaire": "<p style=\"text-align: justify;\">Cet amendement vise &#224; rendre explicite l'&#233;ligibilit&#233; des proches-aidants de personnes atteintes par une maladie chronique inscrite sur la liste des affections de longue dur&#233;e (ALD 30) de l'Assurance maladie au cong&#233; de proche-aidant.</p><p style=\"text-align: justify;\">La France compte 11 millions de proches-aidants, soit pr&#232;s d'un Fran&#231;ais sur 6.</p><p style=\"text-align: justify;\">Cette disposition envoie un signal de soutien et de reconnaissance aux proches-aidants de personnes atteintes de maladies chronique, afin de faciliter le d&#233;clenchement de leur cong&#233;.</p><p style=\"text-align: justify;\">Tel est l'objet de cet amendement.</p>",
    "annexeExposeSommaire": {
      "@xmlns:xsi": "http://www.w3.org/2001/XMLSchema-instance",
      "@xsi:nil": "true"
    },
    "cartoucheDelaiDepotDepasse": {
      "@xmlns:xsi": "http://www.w3.org/2001/XMLSchema-instance",
      "@xsi:nil": "true"
    }
  },
  "representations": {
    "representation": {
      "nom": "PDF",
      "typeMime": {
        "type": "application",
        "subType": "PDF"
      },
      "statutRepresentation": {
        "verbatim": "true",
        "canonique": "true",
        "officielle": "true",
        "transcription": "false",
        "enregistrement": "false"
      },
      "repSource": {
        "@xmlns:xsi": "http://www.w3.org/2001/XMLSchema-instance",
        "@xsi:nil": "true"
      },
      "offset": {
        "@xmlns:xsi": "http://www.w3.org/2001/XMLSchema-instance",
        "@xsi:nil": "true"
      },
      "contenu": {
        "documentURI": "/15/amendements/1673/CSPACTE/286.pdf"
      },
      "dateDispoRepresentation": {
        "@xmlns:xsi": "http://www.w3.org/2001/XMLSchema-instance",
        "@xsi:nil": "true"
      }
    }
  },
  "seanceDiscussion": {
    "@xmlns:xsi": "http://www.w3.org/2001/XMLSchema-instance",
    "@xsi:nil": "true"
  },
  "sort": {
    "@xmlns:xsi": "http://www.w3.org/2001/XMLSchema-instance",
    "@xsi:nil": "true"
  },
  "dateDepot": "2019-02-28T01:00:00.000+01:00",
  "dateDistribution": "2019-03-01T01:00:00.000+01:00",
  "article99": "0",
  "loiReference": {
    "codeLoi": {
      "@xmlns:xsi": "http://www.w3.org/2001/XMLSchema-instance",
      "@xsi:nil": "true"
    },
    "divisionCodeLoi": {
      "@xmlns:xsi": "http://www.w3.org/2001/XMLSchema-instance",
      "@xsi:nil": "true"
    }
  }
}