{
  "@xmlns": "http://schemas.assemblee-nationale.fr/referentiel",
  "uid": "AMANR5L15SEA717460B0235P2D1N1522",
  "identifiant": {
    "legislature": "15",
    "numero": "1522",
    "numRect": "0",
    "saisine": {
      "refTexteLegislatif": "PRJLANR5L15B0235",
      "numeroPartiePLF": "2",
      "organeExamen": "PO717460",
      "mentionSecondeDeliberation": "0"
    }
  },
  "numeroLong": "II-1522",
  "etapeTexte": "1ère lecture (1ère assemblée saisie)",
  "triAmendement": "azrhzzyw",
  "cardinaliteAmdtMultiples": "1",
  "amendementParent": {
    "@xmlns:xsi": "http://www.w3.org/2001/XMLSchema-instance",
    "@xsi:nil": "true"
  },
  "etat": "Discuté",
  "signataires": {
    "auteur": {
      "typeAuteur": "Depute",
      "acteurRef": "PA719138",
      "organeRef": {
        "@xmlns:xsi": "http://www.w3.org/2001/XMLSchema-instance",
        "@xsi:nil": "true"
      },
      "groupePolitiqueRef": "PO723569"
    },
    "cosignataires": {
      "acteurRef": [
        "PA719146",
        "PA719138",
        "PA719286"
      ]
    },
    "texteAffichable": "M.&#160;Castellani,  M.&#160;Acquaviva et M.&#160;Colombani"
  },
  "pointeurFragmentTexte": {
    "missionVisee": {
      "@xmlns:xsi": "http://www.w3.org/2001/XMLSchema-instance",
      "@xsi:nil": "true"
    },
    "division": {
      "titre": "Article 39",
      "articleDesignationCourte": "APRÈS ART. 39",
      "type": "ARTICLE",
      "avant_A_Apres": "Après",
      "divisionRattachee": "APRÈS L'ARTICLE 39, insérer l'article suivant:",
      "articleAdditionnel": "1",
      "chapitreAdditionnel": {
        "@xmlns:xsi": "http://www.w3.org/2001/XMLSchema-instance",
        "@xsi:nil": "true"
      },
      "urlDivisionTexteVise": "/15/textes/0235C.asp#D_Article_39"
    },
    "alinea": {
      "@xmlns:xsi": "http://www.w3.org/2001/XMLSchema-instance",
      "@xsi:nil": "true"
    }
  },
  "corps": {
    "dispositif": "<p style=\"text-align: justify;\">I.&#160;&#8211;&#160;Au premier alin&#233;a du VI <i>ter</i> de l&#8217;article&#160;199 <i>terdecies</i>-0 A du code g&#233;n&#233;ral des imp&#244;ts, le taux&#160;: &#171;&#160;38&#160;%&#160;&#187; est remplac&#233; par le taux&#160;: &#171;&#160;45&#160;%&#160;&#187;.</p><p style=\"text-align: justify;\">II.&#160;&#8211;&#160; Le I entre en vigueur au 1<sup>er</sup> janvier 2019.</p><p style=\"text-align: justify;\">III.&#160;&#8211;&#160;La perte de recettes pour l&#8217;&#201;tat est compens&#233;e &#224; due concurrence par la cr&#233;ation d&#8217;une taxe additionnelle aux droits mentionn&#233;s aux articles 575 et 575 A du code g&#233;n&#233;ral des imp&#244;ts.</p>",
    "exposeSommaire": "<p style=\"text-align: justify;\">Cr&#233;&#233;s par la loi du 1<sup>er</sup> ao&#251;t 2003 pour l&#8217;initiative &#233;conomique, les Fonds d&#8217;Investissement de Proximit&#233; (FIP) sont des v&#233;hicules qui doivent investir 70&#160;% de leurs actifs pour renforcer les fonds propres ou quasi fonds propres de PME non cot&#233;es, &#224; tous les stades de leurs d&#233;veloppements (amor&#231;age, capital innovation, capital d&#233;veloppement et transmission).</p><p style=\"text-align: justify;\">En 2007, le l&#233;gislateur constatant qu&#8217;aucun des FIP lev&#233;s depuis quatre ans n&#8217;avait choisi d&#8217;investir en Corse, a cr&#233;&#233; le FIP Corse.</p><p style=\"text-align: justify;\">Ce v&#233;hicule devait, gr&#226;ce &#224; un dispositif fiscal plus avantageux que sur le reste du territoire fran&#231;ais (50&#160;% de d&#233;duction fiscale pour les FIP corses contre 25&#160;% pour les FIP continentaux), orienter l&#8217;&#233;pargne des fran&#231;ais et permettre enfin aux PME Corses de financer leur d&#233;veloppement dans des conditions analogues &#224; celles issues des r&#233;gions &#171;&#160;continentales&#160;&#187;.</p><p style=\"text-align: justify;\">La suppression de l&#8217;ISF va lib&#233;rer une part d&#8217;&#233;pargne qu&#8217;il conviendra de rediriger vers le financement des PME fran&#231;aises, &#224; travers un rel&#232;vement du taux de la r&#233;duction d&#8217;imp&#244;ts au titre des fonds d&#8217;investissements de proximit&#233; (FIP).</p><p style=\"text-align: justify;\">Ce rel&#232;vement doit notamment s&#8217;appliquer au taux d&#233;rogatoire appliqu&#233; jusqu&#8217;ici &#224; la Corse, r&#233;gion insulaire, faisant par ailleurs parti des plus pauvres.</p><p style=\"text-align: justify;\">Le diff&#233;rentiel de d&#233;ductibilit&#233; des FIP en faveur de la Corse r&#233;mun&#232;re ce que l&#8217;on appelle le risque li&#233; aux &#233;conomies insulaires (risque clairement identifi&#233; sur la place financi&#232;re) et que le FIP Corse ne peut investir que dans des PME Corses (Les FIP continentaux peuvent quant &#224; eux intervenir dans des PME issues de 4 r&#233;gions limitrophes).</p><p style=\"text-align: justify;\">Cette mesure est n&#233;cessaire afin de pr&#233;server le tissu &#233;conomique fragile d&#8217;une r&#233;gion en rattrapage o&#249; les TPE-PME sont confront&#233;es &#224; des contraintes structurelles li&#233;es &#224; l&#8217;insularit&#233; et au retards de d&#233;veloppement accumul&#233;s depuis des d&#233;cennies.</p>",
    "annexeExposeSommaire": {
      "@xmlns:xsi": "http://www.w3.org/2001/XMLSchema-instance",
      "@xsi:nil": "true"
    }
  },
  "representations": {
    "representation": {
      "nom": "PDF",
      "typeMime": {
        "type": "application",
        "subType": "PDF"
      },
      "statutRepresentation": {
        "verbatim": "true",
        "canonique": "true",
        "officielle": "true",
        "transcription": "false",
        "enregistrement": "false"
      },
      "repSource": {
        "@xmlns:xsi": "http://www.w3.org/2001/XMLSchema-instance",
        "@xsi:nil": "true"
      },
      "offset": {
        "@xmlns:xsi": "http://www.w3.org/2001/XMLSchema-instance",
        "@xsi:nil": "true"
      },
      "contenu": {
        "documentURI": "/15/amendements/0235C/AN/1522.pdf"
      },
      "dateDispoRepresentation": {
        "@xmlns:xsi": "http://www.w3.org/2001/XMLSchema-instance",
        "@xsi:nil": "true"
      }
    }
  },
  "seanceDiscussion": "RUANR5L15S2018IDS20766",
  "sort": {
    "dateSaisie": "2017-11-17T19:37:24.000+01:00",
    "sortEnSeance": "Rejeté"
  },
  "dateDepot": "2017-11-10T01:00:00.000+01:00",
  "dateDistribution": "2017-11-15T01:00:00.000+01:00",
  "article99": "0",
  "loiReference": {
    "codeLoi": "CGI",
    "divisionCodeLoi": "199 terdecies 0 A"
  }
}