{
  "@xmlns": "http://schemas.assemblee-nationale.fr/referentiel",
  "uid": "AMANR5L15SEA717460BTC2062P0D1N96",
  "identifiant": {
    "legislature": "15",
    "numero": "96",
    "numRect": "0",
    "saisine": {
      "refTexteLegislatif": "PIONANR5L15BTC2062",
      "numeroPartiePLF": "0",
      "organeExamen": "PO717460",
      "mentionSecondeDeliberation": "0"
    }
  },
  "numeroLong": "96",
  "etapeTexte": "1ère lecture (1ère assemblée saisie)",
  "triAmendement": "ecaaaaaaaaaaaaaaaaaaaaaaaaaaaaaaaaaaaaaaaaaaaaaaaafi",
  "cardinaliteAmdtMultiples": "1",
  "amendementParent": {
    "@xmlns:xsi": "http://www.w3.org/2001/XMLSchema-instance",
    "@xsi:nil": "true"
  },
  "etat": "Discuté",
  "signataires": {
    "auteur": {
      "typeAuteur": "Depute",
      "acteurRef": "PA2150",
      "organeRef": {
        "@xmlns:xsi": "http://www.w3.org/2001/XMLSchema-instance",
        "@xsi:nil": "true"
      },
      "groupePolitiqueRef": "PO730958"
    },
    "cosignataires": {
      "acteurRef": [
        "PA588884",
        "PA721960",
        "PA2150",
        "PA719578",
        "PA721202",
        "PA720846",
        "PA720286",
        "PA720892",
        "PA721226",
        "PA722142",
        "PA720430",
        "PA718868",
        "PA718860",
        "PA721210",
        "PA720422",
        "PA721062",
        "PA719676"
      ]
    },
    "texteAffichable": "M.&#160;M&#233;lenchon,  Mme&#160;Autain, M.&#160;Bernalicis, M.&#160;Coquerel, M.&#160;Corbi&#232;re, Mme&#160;Fiat, M.&#160;Lachaud, M.&#160;Larive, Mme&#160;Obono, Mme&#160;Panot, M.&#160;Prud&apos;homme, M.&#160;Quatennens, M.&#160;Ratenon, Mme&#160;Ressiguier, Mme&#160;Rubin, M.&#160;Ruffin et Mme&#160;Taurine"
  },
  "pointeurFragmentTexte": {
    "missionVisee": {
      "@xmlns:xsi": "http://www.w3.org/2001/XMLSchema-instance",
      "@xsi:nil": "true"
    },
    "division": {
      "titre": "Article 4",
      "articleDesignationCourte": "ART. 4",
      "type": "ARTICLE",
      "avant_A_Apres": "A",
      "divisionRattachee": "ARTICLE 4",
      "articleAdditionnel": {
        "@xmlns:xsi": "http://www.w3.org/2001/XMLSchema-instance",
        "@xsi:nil": "true"
      },
      "chapitreAdditionnel": {
        "@xmlns:xsi": "http://www.w3.org/2001/XMLSchema-instance",
        "@xsi:nil": "true"
      },
      "urlDivisionTexteVise": "/15/textes/2062.asp#D_Article_4"
    },
    "alinea": {
      "avant_A_Apres": {
        "@xmlns:xsi": "http://www.w3.org/2001/XMLSchema-instance",
        "@xsi:nil": "true"
      },
      "numero": "6",
      "alineaDesignation": {
        "@xmlns:xsi": "http://www.w3.org/2001/XMLSchema-instance",
        "@xsi:nil": "true"
      }
    }
  },
  "corps": {
    "dispositif": "<p>I.&#160;&#8211;&#160;&#192; l&#8217;alin&#233;a&#160;6, substituer aux mots&#160;:</p><p>&#171;&#160;le Conseil sup&#233;rieur de l&#8217;audiovisuel&#160;&#187;</p><p style=\"text-align: justify;\">les mots&#160;:</p><p style=\"text-align: justify;\">&#171;&#160;l&#8217;autorit&#233; judiciaire&#160;&#187;.</p><p style=\"text-align: justify;\">II.&#160;&#8211;&#160;En cons&#233;quence, supprimer les alin&#233;as&#160;7 &#224; 13.</p>",
    "exposeSommaire": "<p>Par cet amendement, nous souhaitons manifester notre refus de confier &#224; une autorit&#233; administrative des pouvoirs quasi-judiciaires, qui ne permettent pas d&#8217;assurer aux parties un respect des principes fondamentaux du proc&#232;s.</p><p style=\"text-align: justify;\">Le CSA se voit confier, de plus en plus de pouvoirs, et notamment depuis la loi relative &#224; la lutte contre la manipulation de l&#8217;information, des comp&#233;tences contraignantes sur les plateformes, sans que le mode de nomination de ses membres ne soit revu. Cet organe reste tr&#232;s proche du pouvoir politique alors m&#234;me que ses comp&#233;tences sont accrues, ce qui nous semble une anormalit&#233; d&#233;mocratique importante&#160;: les nominations politiques au sein du CSA en font une instance qui n&#8217;est pas consid&#233;r&#233;e comme impartiale au sens de la convention europ&#233;enne des droits humains, qui consid&#232;re qu&#8217;il y a 2 fa&#231;ons d&#8217;appr&#233;hender l&#8217;impartialit&#233; d&#8217;une instance, d&#8217;un point de vue subjectif et d&#8217;un point de vue objectif&#160;: &#171;&#160;si l&#8217;impartialit&#233; se d&#233;finit d&#8217;ordinaire par l&#8217;absence de pr&#233;jug&#233; ou de parti pris, elle peut, notamment sous l&#8217;angle de l&#8217;art 6&#167;1 de la Convention, s&#8217;appr&#233;cier de diverses mani&#232;res. On peut distinguer entre une d&#233;marche subjective, essayant de d&#233;terminer ce que tel juge pensait en son for int&#233;rieur en telle circonstance, et une d&#233;marche objective amenant &#224; rechercher s&#8217;il offrait des garanties suffisantes pour exclure &#224; cet &#233;gard tout doute l&#233;gitime&#160;&#187; (Piersack c France du 1<sup>er</sup> octobre 1982)</p><p style=\"text-align: justify;\">Dans un souci de rigueur et de s&#233;paration des pouvoirs, nous tenons &#224; ce que les comp&#233;tences quasi-juridictionnelles du CSA soient transf&#233;r&#233;es au pouvoir judiciaire, d&#8217;autant que le CSA ne semble pas tout &#224; fait volontaire pour faire usage des pouvoirs de sanction qui lui sont attribu&#233;s.</p>",
    "annexeExposeSommaire": {
      "@xmlns:xsi": "http://www.w3.org/2001/XMLSchema-instance",
      "@xsi:nil": "true"
    },
    "cartoucheDelaiDepotDepasse": {
      "@xmlns:xsi": "http://www.w3.org/2001/XMLSchema-instance",
      "@xsi:nil": "true"
    }
  },
  "representations": {
    "representation": {
      "nom": "PDF",
      "typeMime": {
        "type": "application",
        "subType": "PDF"
      },
      "statutRepresentation": {
        "verbatim": "true",
        "canonique": "true",
        "officielle": "true",
        "transcription": "false",
        "enregistrement": "false"
      },
      "repSource": {
        "@xmlns:xsi": "http://www.w3.org/2001/XMLSchema-instance",
        "@xsi:nil": "true"
      },
      "offset": {
        "@xmlns:xsi": "http://www.w3.org/2001/XMLSchema-instance",
        "@xsi:nil": "true"
      },
      "contenu": {
        "documentURI": "/15/amendements/2062/AN/96.pdf"
      },
      "dateDispoRepresentation": {
        "@xmlns:xsi": "http://www.w3.org/2001/XMLSchema-instance",
        "@xsi:nil": "true"
      }
    }
  },
  "seanceDiscussion": "RUANR5L15S2019IDS21751",
  "sort": {
    "dateSaisie": "2019-07-04T19:26:33.000+02:00",
    "sortEnSeance": "Non soutenu"
  },
  "dateDepot": "2019-06-27T02:00:00.000+02:00",
  "dateDistribution": "2019-07-03T02:00:00.000+02:00",
  "article99": "0",
  "loiReference": {
    "codeLoi": {
      "@xmlns:xsi": "http://www.w3.org/2001/XMLSchema-instance",
      "@xsi:nil": "true"
    },
    "divisionCodeLoi": {
      "@xmlns:xsi": "http://www.w3.org/2001/XMLSchema-instance",
      "@xsi:nil": "true"
    }
  }
}