{
  "@xmlns": "http://schemas.assemblee-nationale.fr/referentiel",
  "uid": "AMANR5L15PO420120B1255P2D1N38",
  "identifiant": {
    "legislature": "15",
    "numero": "38",
    "numRect": "0",
    "saisine": {
      "refTexteLegislatif": "PRJLANR5L15B1255",
      "numeroPartiePLF": "2",
      "organeExamen": "PO420120",
      "mentionSecondeDeliberation": "0"
    }
  },
  "numeroLong": "II-AS38",
  "etapeTexte": "1ère lecture (1ère assemblée saisie)",
  "triAmendement": "adeaaaaaaaaaaaaaaaaaaaaaaaaaaaaaaaaaaaaaaaaaaaaaaabzu",
  "cardinaliteAmdtMultiples": "1",
  "amendementParent": {
    "@xmlns:xsi": "http://www.w3.org/2001/XMLSchema-instance",
    "@xsi:nil": "true"
  },
  "etat": "Discuté",
  "signataires": {
    "auteur": {
      "typeAuteur": "Depute",
      "acteurRef": "PA718926",
      "organeRef": {
        "@xmlns:xsi": "http://www.w3.org/2001/XMLSchema-instance",
        "@xsi:nil": "true"
      },
      "groupePolitiqueRef": "PO730940"
    },
    "cosignataires": {
      "acteurRef": [
        "PA720546",
        "PA722202",
        "PA441",
        "PA720692",
        "PA721270",
        "PA335612",
        "PA721118",
        "PA718720",
        "PA610654",
        "PA718926",
        "PA721012",
        "PA689",
        "PA267306",
        "PA610667",
        "PA721896",
        "PA722110"
      ]
    },
    "texteAffichable": "M.&#160;Dharr&#233;ville,  Mme&#160;Bello, M.&#160;Brotherson, M.&#160;Bruneel, Mme&#160;Buffet, M.&#160;Chassaigne, M.&#160;Dufr&#232;gne, Mme&#160;Faucillon, M.&#160;Jumel, Mme&#160;K&#233;clard-Mond&#233;sir, M.&#160;Lecoq, M.&#160;Nilor, M.&#160;Peu, M.&#160;Fabien&#160;Roussel, M.&#160;Serville et M.&#160;Wulfranc"
  },
  "pointeurFragmentTexte": {
    "missionVisee": {
      "idMissionAN": "421",
      "libelleMission": "Travail et emploi",
      "codeMissionPLF": "B",
      "libelleMissionPLF": "Répartition, par mission et programme, des crédits du budget général"
    },
    "division": {
      "titre": "ÉTAT B",
      "articleDesignationCourte": "ART. 39",
      "type": "ANNEXE",
      "avant_A_Apres": "A",
      "divisionRattachee": "ARTICLE 39",
      "articleAdditionnel": {
        "@xmlns:xsi": "http://www.w3.org/2001/XMLSchema-instance",
        "@xsi:nil": "true"
      },
      "chapitreAdditionnel": {
        "@xmlns:xsi": "http://www.w3.org/2001/XMLSchema-instance",
        "@xsi:nil": "true"
      },
      "urlDivisionTexteVise": "/15/textes/1255C.asp#D_ETAT_B"
    },
    "alinea": {
      "@xmlns:xsi": "http://www.w3.org/2001/XMLSchema-instance",
      "@xsi:nil": "true"
    }
  },
  "corps": {
    "exposeSommaire": "<p style=\"text-align: justify;\">Le PLF 2019 pr&#233;voit de diminuer d&#8217;environ 100 millions d&#8217;euros la subvention pour charges de service public attribu&#233;e &#224; P&#244;le emploi qui passerait de 1469 &#224; 1372 millions d&#8217;euros. Elle se traduira par la suppression de 800 postes au sein de l&#8217;op&#233;rateur.</p><p style=\"text-align: justify;\">D&#233;j&#224; l&#8217;ann&#233;e pr&#233;c&#233;dente, P&#244;le Emploi avait vu ses dotations baiss&#233;es, rendant impossible la reconduction des emplois aid&#233;s qui travaillent au sein de l&#8217;op&#233;rateur.</p><p style=\"text-align: justify;\">Dans un contexte o&#249; le taux de ch&#244;mage reste &#224; niveau &#233;lev&#233; comme le r&#233;v&#232;le le dernier bilan trimestriel, une telle mesure budg&#233;taire va fragiliser les missions d&#8217;accompagnement des demandeurs d&#8217;emploi. Nous y sommes fermement oppos&#233;s.&#160;</p><p style=\"text-align: justify;\">C&#8217;est pourquoi cet amendement vise &#224; r&#233;tablir le niveau de la subvention &#224; P&#244;le emploi en pr&#233;levant pour cela les moyens correspondants sur les cr&#233;dits destin&#233;s &#224; financer le plan d&#8217;investissement des comp&#233;tences dans le cadre de l&#8217;action n&#176;4 &#171;&#160;Plan d&#8217;investissement des comp&#233;tences&#160;&#187; du programme 103 &#171;&#160;Accompagnement des mutations &#233;conomiques et d&#233;veloppement de l&#8217;emploi&#160;&#187;, pour reverser 100 millions d&#8217;euros sur l&#8217;action n&#176;1 &#171;&#160;Am&#233;lioration de l&#8217;efficacit&#233; du service public de l&#8217;emploi&#160;&#187; du programme 102 &#171;&#160;Acc&#232;s et retour &#224; l&#8217;emploi&#160;&#187;.</p>",
    "annexeExposeSommaire": {
      "@xmlns:xsi": "http://www.w3.org/2001/XMLSchema-instance",
      "@xsi:nil": "true"
    },
    "dispositifAmdtCredit": {
      "listeProgrammes": {
        "programme": [
          {
            "libelle": "Accès et retour à l'emploi",
            "id": "30937",
            "AE": {
              "montantPositif": "100000000",
              "montantNegatif": "0"
            },
            "CP": {
              "montantPositif": "100000000",
              "montantNegatif": "0"
            },
            "action": "modification",
            "lignesCredits": null
          },
          {
            "libelle": "Accompagnement des mutations économiques et développement de l'emploi",
            "id": "30938",
            "AE": {
              "montantPositif": "0",
              "montantNegatif": "100000000"
            },
            "CP": {
              "montantPositif": "0",
              "montantNegatif": "100000000"
            },
            "action": "modification",
            "lignesCredits": null
          },
          {
            "libelle": "Amélioration de la qualité de l'emploi et des relations du travail",
            "id": "30939",
            "AE": {
              "montantPositif": "0",
              "montantNegatif": "0"
            },
            "CP": {
              "montantPositif": "0",
              "montantNegatif": "0"
            },
            "action": "modification",
            "lignesCredits": null
          },
          {
            "libelle": "Conception, gestion et évaluation des politiques de l'emploi et du travail",
            "id": "30940",
            "AE": {
              "montantPositif": "0",
              "montantNegatif": "0"
            },
            "CP": {
              "montantPositif": "0",
              "montantNegatif": "0"
            },
            "action": "modification",
            "lignesCredits": null
          }
        ]
      },
      "totalAE": {
        "montantPositif": "100000000",
        "montantNegatif": "100000000",
        "solde": "0"
      },
      "totalCP": {
        "montantPositif": "100000000",
        "montantNegatif": "100000000",
        "solde": "0"
      }
    }
  },
  "representations": {
    "representation": {
      "nom": "PDF",
      "typeMime": {
        "type": "application",
        "subType": "PDF"
      },
      "statutRepresentation": {
        "verbatim": "true",
        "canonique": "true",
        "officielle": "true",
        "transcription": "false",
        "enregistrement": "false"
      },
      "repSource": {
        "@xmlns:xsi": "http://www.w3.org/2001/XMLSchema-instance",
        "@xsi:nil": "true"
      },
      "offset": {
        "@xmlns:xsi": "http://www.w3.org/2001/XMLSchema-instance",
        "@xsi:nil": "true"
      },
      "contenu": {
        "documentURI": "/15/amendements/1255C/CION-SOC/AS38.pdf"
      },
      "dateDispoRepresentation": {
        "@xmlns:xsi": "http://www.w3.org/2001/XMLSchema-instance",
        "@xsi:nil": "true"
      }
    }
  },
  "seanceDiscussion": {
    "@xmlns:xsi": "http://www.w3.org/2001/XMLSchema-instance",
    "@xsi:nil": "true"
  },
  "sort": {
    "dateSaisie": "2018-10-30T20:10:45.000+01:00",
    "sortEnSeance": "Non soutenu"
  },
  "dateDepot": "2018-10-26T02:00:00.000+02:00",
  "dateDistribution": "2018-10-29T01:00:00.000+01:00",
  "article99": "0",
  "loiReference": {
    "codeLoi": {
      "@xmlns:xsi": "http://www.w3.org/2001/XMLSchema-instance",
      "@xsi:nil": "true"
    },
    "divisionCodeLoi": {
      "@xmlns:xsi": "http://www.w3.org/2001/XMLSchema-instance",
      "@xsi:nil": "true"
    }
  }
}