{
  "@xmlns": "http://schemas.assemblee-nationale.fr/referentiel",
  "uid": "AMANR5L15SEA717460BTC0902P0D1N1999",
  "identifiant": {
    "legislature": "15",
    "numero": "1999",
    "numRect": "0",
    "saisine": {
      "refTexteLegislatif": "PRJLANR5L15BTC0902",
      "numeroPartiePLF": "0",
      "organeExamen": "PO717460",
      "mentionSecondeDeliberation": "0"
    }
  },
  "numeroLong": "1999",
  "etapeTexte": "1ère lecture (1ère assemblée saisie)",
  "triAmendement": "aqzzxzzzzzzzzw",
  "cardinaliteAmdtMultiples": "1",
  "amendementParent": {
    "@xmlns:xsi": "http://www.w3.org/2001/XMLSchema-instance",
    "@xsi:nil": "true"
  },
  "etat": "Discuté",
  "signataires": {
    "auteur": {
      "typeAuteur": "Depute",
      "acteurRef": "PA719578",
      "organeRef": {
        "@xmlns:xsi": "http://www.w3.org/2001/XMLSchema-instance",
        "@xsi:nil": "true"
      },
      "groupePolitiqueRef": "PO730958"
    },
    "cosignataires": {
      "acteurRef": [
        "PA719578",
        "PA721226",
        "PA720430",
        "PA719676",
        "PA721960",
        "PA721210",
        "PA718868",
        "PA722142",
        "PA718860",
        "PA720286",
        "PA721062",
        "PA721202",
        "PA720422",
        "PA720892",
        "PA588884",
        "PA720846",
        "PA2150"
      ]
    },
    "texteAffichable": "M.&#160;Prud&apos;homme,  Mme&#160;Autain, M.&#160;Bernalicis, M.&#160;Coquerel, M.&#160;Corbi&#232;re, Mme&#160;Fiat, M.&#160;Lachaud, M.&#160;Larive, M.&#160;M&#233;lenchon, Mme&#160;Obono, Mme&#160;Panot, M.&#160;Quatennens, M.&#160;Ratenon, Mme&#160;Ressiguier, Mme&#160;Rubin, M.&#160;Ruffin et Mme&#160;Taurine"
  },
  "pointeurFragmentTexte": {
    "missionVisee": {
      "@xmlns:xsi": "http://www.w3.org/2001/XMLSchema-instance",
      "@xsi:nil": "true"
    },
    "division": {
      "titre": "Article PREMIER",
      "articleDesignationCourte": "ART. PREMIER",
      "type": "ARTICLE",
      "avant_A_Apres": "A",
      "divisionRattachee": "ARTICLE PREMIER",
      "articleAdditionnel": {
        "@xmlns:xsi": "http://www.w3.org/2001/XMLSchema-instance",
        "@xsi:nil": "true"
      },
      "chapitreAdditionnel": {
        "@xmlns:xsi": "http://www.w3.org/2001/XMLSchema-instance",
        "@xsi:nil": "true"
      },
      "urlDivisionTexteVise": "/15/textes/0902.asp#D_Article_1er"
    },
    "alinea": {
      "avant_A_Apres": "A",
      "numero": "15",
      "alineaDesignation": "Alinéa 15"
    }
  },
  "corps": {
    "dispositif": "<p style=\"text-align: justify;\">Apr&#232;s l&#8217;alin&#233;a&#160;15, ins&#233;rer l&#8217;alin&#233;a suivant&#160;:</p><p style=\"text-align: justify;\">&#171;&#160;La prise en compte de ces indicateurs vise &#224; garantir un revenu d&#233;cent au producteur&#160;&#187;.</p>",
    "exposeSommaire": "<p style=\"text-align: justify;\">Par cet amendement nous souhaitons pr&#233;ciser l&#8217;objectif de ces indicateurs. Au-del&#224; du flou sur les indicateurs &#224; prendre en compte et ce qu&#8217;ils mesurent, la notion de &#8220;prise en compte&#8221; est elle aussi floue. Il nous para&#238;t donc important de pr&#233;ciser que la prise en compte de ces indicateurs vise &#224; garantir un revenu d&#233;cent aux paysans, ce qui implique un prix de vente sup&#233;rieur aux co&#251;ts de production auxquels s&#8217;ajoutent la r&#233;mun&#233;ration du producteur. La situation d&#8217;un grand nombre de paysans est dramatique aujourd&#8217;hui. Les chiffre des la Mutuelle Sociale Agricole sont connus mais il n&#8217;est pas inutile de les rappeler&#160;: la moiti&#233; des paysans gagnent moins de 350&#160;&#8364; par mois, alors que leur mission est essentielle au pays et qu&#8217;ils ne m&#233;nagent pas leur peine. Ce projet de loi doit leur garantir un revenu d&#233;cent.</p>",
    "annexeExposeSommaire": {
      "@xmlns:xsi": "http://www.w3.org/2001/XMLSchema-instance",
      "@xsi:nil": "true"
    }
  },
  "representations": {
    "representation": {
      "nom": "PDF",
      "typeMime": {
        "type": "application",
        "subType": "PDF"
      },
      "statutRepresentation": {
        "verbatim": "true",
        "canonique": "true",
        "officielle": "true",
        "transcription": "false",
        "enregistrement": "false"
      },
      "repSource": {
        "@xmlns:xsi": "http://www.w3.org/2001/XMLSchema-instance",
        "@xsi:nil": "true"
      },
      "offset": {
        "@xmlns:xsi": "http://www.w3.org/2001/XMLSchema-instance",
        "@xsi:nil": "true"
      },
      "contenu": {
        "documentURI": "/15/amendements/0902/AN/1999.pdf"
      },
      "dateDispoRepresentation": {
        "@xmlns:xsi": "http://www.w3.org/2001/XMLSchema-instance",
        "@xsi:nil": "true"
      }
    }
  },
  "seanceDiscussion": "RUANR5L15S2018IDS21050",
  "sort": {
    "dateSaisie": "2018-05-23T22:28:12.000+02:00",
    "sortEnSeance": "Rejeté"
  },
  "dateDepot": "2018-05-17T02:00:00.000+02:00",
  "dateDistribution": "2018-05-18T02:00:00.000+02:00",
  "article99": "0",
  "loiReference": {
    "codeLoi": {
      "@xmlns:xsi": "http://www.w3.org/2001/XMLSchema-instance",
      "@xsi:nil": "true"
    },
    "divisionCodeLoi": {
      "@xmlns:xsi": "http://www.w3.org/2001/XMLSchema-instance",
      "@xsi:nil": "true"
    }
  }
}