{
  "@xmlns": "http://schemas.assemblee-nationale.fr/referentiel",
  "uid": "AMANR5L15SEA717460BTC2401P0D1N817",
  "identifiant": {
    "legislature": "15",
    "numero": "817",
    "numRect": "0",
    "saisine": {
      "refTexteLegislatif": "PRJLANR5L15BTC2401",
      "numeroPartiePLF": "0",
      "organeExamen": "PO717460",
      "mentionSecondeDeliberation": "0"
    }
  },
  "numeroLong": "817",
  "etapeTexte": "1ère lecture (2ème assemblée saisie)",
  "triAmendement": "alaaaaaaaaaaaaaaaaaaaaaaaaaaaaaaaaaaaaaaaaaaaaaaaacb",
  "cardinaliteAmdtMultiples": "1",
  "amendementParent": {
    "@xmlns:xsi": "http://www.w3.org/2001/XMLSchema-instance",
    "@xsi:nil": "true"
  },
  "etat": "Discuté",
  "signataires": {
    "auteur": {
      "typeAuteur": "Depute",
      "acteurRef": "PA722046",
      "organeRef": {
        "@xmlns:xsi": "http://www.w3.org/2001/XMLSchema-instance",
        "@xsi:nil": "true"
      },
      "groupePolitiqueRef": "PO730964"
    },
    "cosignataires": {
      "acteurRef": [
        "PA721776",
        "PA720170",
        "PA722046",
        "PA721336",
        "PA720538",
        "PA719512",
        "PA721434",
        "PA719364",
        "PA720622",
        "PA718876",
        "PA718962",
        "PA720854"
      ]
    },
    "texteAffichable": "Mme&#160;Berg&#233;,  M.&#160;Baich&#232;re, M.&#160;Test&#233;, M.&#160;Zulesi, Mme&#160;Vignon, Mme&#160;Brocard, Mme&#160;Bureau-Bonnard, M.&#160;Besson-Moreau, Mme&#160;Lardet, Mme&#160;Grandjean, Mme&#160;O&apos;Petit et Mme&#160;De Temmerman"
  },
  "pointeurFragmentTexte": {
    "missionVisee": {
      "@xmlns:xsi": "http://www.w3.org/2001/XMLSchema-instance",
      "@xsi:nil": "true"
    },
    "division": {
      "titre": "Article 4",
      "articleDesignationCourte": "APRÈS ART. 4",
      "type": "ARTICLE",
      "avant_A_Apres": "Après",
      "divisionRattachee": "APRÈS L'ARTICLE 4, insérer l'article suivant:",
      "articleAdditionnel": "1",
      "chapitreAdditionnel": {
        "@xmlns:xsi": "http://www.w3.org/2001/XMLSchema-instance",
        "@xsi:nil": "true"
      },
      "urlDivisionTexteVise": "/15/textes/2401.asp#D_Article_4"
    },
    "alinea": {
      "@xmlns:xsi": "http://www.w3.org/2001/XMLSchema-instance",
      "@xsi:nil": "true"
    }
  },
  "corps": {
    "dispositif": "<p style=\"text-align: justify;\">Au deuxi&#232;me alin&#233;a de l&#8217;article L.&#160;5211&#8209;8 du code g&#233;n&#233;ral des collectivit&#233;s territoriales, le mot&#160;: &#171;&#160;quatri&#232;me&#160;&#187; est remplac&#233; par le mot&#160;: &#171;&#160;sixi&#232;me&#160;&#187;.</p>",
    "exposeSommaire": "<p style=\"text-align: justify;\">Cet amendement vise &#224; donner plus de temps aux nouveaux &#233;lus des EPCI pour pr&#233;parer leur repr&#233;sentation et leurs projets intercommunaux ou communautaires au sein de l&#8217;EPCI auquel ils appartiennent.</p><p style=\"text-align: justify;\">Cette disposition permet de renforcer les projets de territoire et donc leur l&#233;gitimit&#233; aupr&#232;s de nos concitoyens.</p>",
    "annexeExposeSommaire": {
      "@xmlns:xsi": "http://www.w3.org/2001/XMLSchema-instance",
      "@xsi:nil": "true"
    },
    "cartoucheDelaiDepotDepasse": {
      "@xmlns:xsi": "http://www.w3.org/2001/XMLSchema-instance",
      "@xsi:nil": "true"
    },
    "avantAppel": {
      "@xmlns:xsi": "http://www.w3.org/2001/XMLSchema-instance",
      "@xsi:nil": "true"
    }
  },
  "representations": {
    "representation": {
      "nom": "PDF",
      "typeMime": {
        "type": "application",
        "subType": "PDF"
      },
      "statutRepresentation": {
        "verbatim": "true",
        "canonique": "true",
        "officielle": "true",
        "transcription": "false",
        "enregistrement": "false"
      },
      "repSource": {
        "@xmlns:xsi": "http://www.w3.org/2001/XMLSchema-instance",
        "@xsi:nil": "true"
      },
      "offset": {
        "@xmlns:xsi": "http://www.w3.org/2001/XMLSchema-instance",
        "@xsi:nil": "true"
      },
      "contenu": {
        "documentURI": "/15/amendements/2401/AN/817.pdf"
      },
      "dateDispoRepresentation": {
        "@xmlns:xsi": "http://www.w3.org/2001/XMLSchema-instance",
        "@xsi:nil": "true"
      }
    }
  },
  "seanceDiscussion": "RUANR5L15S2020IDS21949",
  "sort": {
    "dateSaisie": "2019-11-19T21:52:42.000+01:00",
    "sortEnSeance": "Retiré"
  },
  "dateDepot": "2019-11-14T01:00:00.000+01:00",
  "dateDistribution": "2019-11-17T01:00:00.000+01:00",
  "article99": "0",
  "loiReference": {
    "codeLoi": "CGCT",
    "divisionCodeLoi": "L5211-8"
  }
}