{
  "@xmlns": "http://schemas.assemblee-nationale.fr/referentiel",
  "uid": "AMANR5L15PO59048B2272P1D1N1274",
  "identifiant": {
    "legislature": "15",
    "numero": "1274",
    "numRect": "0",
    "saisine": {
      "refTexteLegislatif": "PRJLANR5L15B2272",
      "numeroPartiePLF": "1",
      "organeExamen": "PO59048",
      "mentionSecondeDeliberation": "0"
    }
  },
  "numeroLong": "I-CF1274",
  "etapeTexte": "1ère lecture (1ère assemblée saisie)",
  "triAmendement": "duaaaaaaaaaaaaaaaaaaaaaaaaaaaaaaaaaaaaaaaaaaaaaaaagogo",
  "cardinaliteAmdtMultiples": "1",
  "amendementParent": {
    "@xmlns:xsi": "http://www.w3.org/2001/XMLSchema-instance",
    "@xsi:nil": "true"
  },
  "etat": "Discuté",
  "signataires": {
    "auteur": {
      "typeAuteur": "Depute",
      "acteurRef": "PA720590",
      "organeRef": {
        "@xmlns:xsi": "http://www.w3.org/2001/XMLSchema-instance",
        "@xsi:nil": "true"
      },
      "groupePolitiqueRef": "PO730964"
    },
    "cosignataires": {
      "acteurRef": "PA720590"
    },
    "texteAffichable": "M.&#160;Potterie"
  },
  "pointeurFragmentTexte": {
    "missionVisee": {
      "@xmlns:xsi": "http://www.w3.org/2001/XMLSchema-instance",
      "@xsi:nil": "true"
    },
    "division": {
      "titre": "Article 16",
      "articleDesignationCourte": "APRÈS ART. 16",
      "type": "ARTICLE",
      "avant_A_Apres": "Après",
      "divisionRattachee": "APRÈS L'ARTICLE 16, insérer l'article suivant:",
      "articleAdditionnel": "1",
      "chapitreAdditionnel": {
        "@xmlns:xsi": "http://www.w3.org/2001/XMLSchema-instance",
        "@xsi:nil": "true"
      },
      "urlDivisionTexteVise": "/15/textes/2272A.asp#D_Article_16"
    },
    "alinea": {
      "@xmlns:xsi": "http://www.w3.org/2001/XMLSchema-instance",
      "@xsi:nil": "true"
    }
  },
  "corps": {
    "dispositif": "<p style=\"text-align: justify;\">Le titre II de la premi&#232;re partie du livre premier du code g&#233;n&#233;ral des imp&#244;ts est compl&#233;t&#233; par un chapitre VI <i>bis</i> ainsi r&#233;dig&#233;&#160;:</p><p style=\"text-align: justify;\">&#171;&#160;Chapitre VI <i>bis</i>&#160;: Taxe d&#8217;&#233;co-responsabilisation</p><p style=\"text-align: justify;\">&#171;&#160;<i>Article&#160;302 </i><i>bis</i><i> G.&#160;&#8211;&#160;</i>I.&#160;&#8211;&#160;Il est institu&#233; une taxe sur la livraison de biens &#224; destination de toute personne physique ou morale non assujettie &#224; la taxe sur la valeur ajout&#233;e et command&#233;e par voie &#233;lectronique.&#160;</p><p style=\"text-align: justify;\">&#171;&#160;La taxe est due par le consommateur qui r&#233;alise la transaction par voie &#233;lectronique, lorsque celle-ci donne lieu &#224; une livraison entre les mains du consommateur.</p><p style=\"text-align: justify;\">&#171;&#160;Ces dispositions s&#8217;appliquent aux livraisons dans les communes de plus de 20&#160;000 habitants identifi&#233;es par l&#8217;Institut national de la statistique et des &#233;tudes &#233;conomiques.</p><p style=\"text-align: justify;\">&#160;Sont exon&#233;r&#233;s de la taxe les consommateurs qui font le choix d&#8217;une livraison dans un &#233;tablissement de l&#8217;entreprise aupr&#232;s de laquelle la commande a &#233;t&#233; effectu&#233;e, en points relais ou en bureaux de Poste.</p><p style=\"text-align: justify;\">&#171;&#160;Le tarif de la taxe est fix&#233;, par transaction effectu&#233;e, hors taxes et hors frais de livraison, conform&#233;ment aux dispositions ci-dessous&#160;:</p><table style=\"border-collapse: collapse; width: 471px;\"><tbody><tr><td style=\"white-space: normal; border: 1px solid #000000; width: 354px; text-align: center;\">Montant de la transaction</td><td style=\"white-space: normal; border: 1px solid #000000; width: 134px; text-align: center;\">Tarif applicable</td></tr><tr><td style=\"white-space: normal; border: 1px solid #000000; width: 354px;\">N'exc&#233;dant pas 100&#160;&#8364;</td><td style=\"white-space: normal; border: 1px solid #000000; width: 134px;\">1&#160;&#8364;</td></tr><tr><td style=\"white-space: normal; border: 1px solid #000000; width: 354px;\">Entre 101&#160;&#8364; et 1 000&#160;&#8364;</td><td style=\"white-space: normal; border: 1px solid #000000; width: 134px;\">2&#160;&#8364;</td></tr><tr><td style=\"white-space: normal; border: 1px solid #000000; width: 354px;\">Sup&#233;rieure &#224; 1 000&#160;&#8364;</td><td style=\"white-space: normal; border: 1px solid #000000; width: 134px;\">5&#160;&#8364;</td></tr></tbody></table><p style=\"text-align: justify;\">&#171;&#160;La taxe est collect&#233;e par le commer&#231;ant &#233;lectronique et revers&#233;e au tr&#233;sor public.</p><p style=\"text-align: justify;\">&#171;&#160;Les modalit&#233;s de d&#233;claration du produit collect&#233;, le contr&#244;le, le recouvrement, le contentieux, les garanties et sanctions relatifs &#224; la taxe seront pr&#233;cis&#233;es par d&#233;cret.</p><p style=\"text-align: justify;\">&#171;&#160;II.&#160;&#8211;&#160;Les dispositions du I sont applicables &#224; compter du 1<sup>er</sup> janvier 2020.&#160;&#187;</p>",
    "exposeSommaire": "<p style=\"text-align: justify;\">Le pr&#233;sent amendement vise &#224; r&#233;tablir une &#233;quit&#233; fiscale et territoriale entre tous les acteurs du commerce par une incitation &#233;cologique et comportementale.</p><p>&#160;</p><p>La pression fiscale qui p&#232;se sur l&#8217;ensemble du commerce physique (jusqu&#8217;&#224; 90 taxes dont plus d&#8217;1/3 li&#233; &#224; la fiscalit&#233; fonci&#232;re) et parall&#232;lement les exemptions dont b&#233;n&#233;ficient les g&#233;ants du num&#233;rique constituent des &#233;l&#233;ments cons&#233;quents de distorsion de concurrence. Pour rappel, le produit de la fiscalit&#233; du commerce physique s&#8217;&#233;l&#232;ve &#224; 47 milliards d&#8217;euros alors m&#234;me que la contribution fiscale des GAFA ne repr&#233;sente que 67 millions d&#8217;euros. A titre informatif, la part du e-commerce est de 9%. Sur ces 9%, Amazon d&#233;tient 20% du march&#233;. Ainsi, &#224; lui seul, Amazon devrait contribuer fiscalement &#224; hauteur d&#8217;environ 800 millions d&#8217;euros.</p><p>&#160;</p><p>Ces taxes locales, pay&#233;es par les acteurs du commerce fran&#231;ais, participent &#224; l&#8217;am&#233;nagement du territoire auquel ne contribue pas la plupart des g&#233;ants du num&#233;rique, et notamment les &#171;&#160;pure players&#160;&#187; qui par leur activit&#233; utilise l&#8217;espace public.</p><p>&#160;</p><p>Ainsi, ce dispositif incitatif pr&#233;voit que les transactions donnant lieu &#224; la livraison physique de biens en un lieu autre qu&#8217;un point de retrait ou un magasin soient assujetties &#224; une &#233;co-contribution forfaitaire en fonction d&#8217;un bar&#232;me li&#233; au montant de la commande.</p><p>&#160;</p><p>Par l&#8217;exon&#233;ration pr&#233;vue en cas de retrait dans un magasin ou un point relais, l&#8217;amendement vise &#224; responsabiliser le consommateur en l&#8217;incitant &#224; venir retirer son colis dans un point physique et &#233;viter ainsi une livraison parfois superflue. En effet, le e-commerce se r&#233;v&#232;le 7% plus &#233;nergivore que le commerce physique ce qui s&#8217;explique notamment par un taux de retour cinq fois plus &#233;lev&#233;.</p><p>&#160;</p><p>Afin de ne pas cr&#233;er de disparit&#233;s envers les territoires ruraux ne disposant pas de points de retrait, l&#8217;amendement ne concerne que les habitants des communes de plus de 20&#160;000 habitants, communes qui disposent d&#8217;un maillage de points de relais suffisants (en moyenne 5 par ville) pour permettre au consommateur d&#8217;avoir le choix entre une &#233;co-participation ou une exon&#233;ration par retrait.</p><p>&#160;</p><p>Cette fiscalit&#233; tend &#224; r&#233;tablir l&#8217;&#233;galit&#233; devant les charges publiques entre les commerces s&#233;dentaires et de vente &#224; distance. De plus, il vise &#224; inciter les consommateurs &#224; faire &#233;voluer leurs comportements en int&#233;grant davantage les consid&#233;rations environnementales induites par la livraison (retour de colis, livraison nocturnes, externalit&#233;s n&#233;gatives sur l&#8217;am&#233;nagement du territoire et l&#8217;utilisation de l&#8217;espace public, etc.).</p><p>&#160;</p>",
    "annexeExposeSommaire": {
      "@xmlns:xsi": "http://www.w3.org/2001/XMLSchema-instance",
      "@xsi:nil": "true"
    },
    "cartoucheDelaiDepotDepasse": {
      "@xmlns:xsi": "http://www.w3.org/2001/XMLSchema-instance",
      "@xsi:nil": "true"
    },
    "avantAppel": {
      "@xmlns:xsi": "http://www.w3.org/2001/XMLSchema-instance",
      "@xsi:nil": "true"
    }
  },
  "representations": {
    "representation": {
      "nom": "PDF",
      "typeMime": {
        "type": "application",
        "subType": "PDF"
      },
      "statutRepresentation": {
        "verbatim": "true",
        "canonique": "true",
        "officielle": "true",
        "transcription": "false",
        "enregistrement": "false"
      },
      "repSource": {
        "@xmlns:xsi": "http://www.w3.org/2001/XMLSchema-instance",
        "@xsi:nil": "true"
      },
      "offset": {
        "@xmlns:xsi": "http://www.w3.org/2001/XMLSchema-instance",
        "@xsi:nil": "true"
      },
      "contenu": {
        "documentURI": "/15/amendements/2272A/CION_FIN/CF1274.pdf"
      },
      "dateDispoRepresentation": {
        "@xmlns:xsi": "http://www.w3.org/2001/XMLSchema-instance",
        "@xsi:nil": "true"
      }
    }
  },
  "seanceDiscussion": {
    "@xmlns:xsi": "http://www.w3.org/2001/XMLSchema-instance",
    "@xsi:nil": "true"
  },
  "sort": {
    "dateSaisie": "2019-10-10T11:15:35.000+02:00",
    "sortEnSeance": "Rejeté"
  },
  "dateDepot": "2019-10-04T02:00:00.000+02:00",
  "dateDistribution": "2019-10-09T02:00:00.000+02:00",
  "article99": "0",
  "loiReference": {
    "codeLoi": "CGI",
    "divisionCodeLoi": "302 bis G"
  }
}