{
  "@xmlns": "http://schemas.assemblee-nationale.fr/referentiel",
  "uid": "AMANR5L15PO59051B1503P0D1N396",
  "identifiant": {
    "legislature": "15",
    "numero": "396",
    "numRect": "0",
    "saisine": {
      "refTexteLegislatif": "PRJLANR5L15B1503",
      "numeroPartiePLF": "0",
      "organeExamen": "PO59051",
      "mentionSecondeDeliberation": "0"
    }
  },
  "numeroLong": "CL396",
  "etapeTexte": "Nouvelle Lecture",
  "triAmendement": "bkaaaaaaaaaaaaaaaaaaaaaaaaaaaaaaaaaaaaaaaaaaaaaaaae",
  "cardinaliteAmdtMultiples": "1",
  "amendementParent": {
    "@xmlns:xsi": "http://www.w3.org/2001/XMLSchema-instance",
    "@xsi:nil": "true"
  },
  "etat": "Discuté",
  "signataires": {
    "auteur": {
      "typeAuteur": "Depute",
      "acteurRef": "PA267042",
      "organeRef": {
        "@xmlns:xsi": "http://www.w3.org/2001/XMLSchema-instance",
        "@xsi:nil": "true"
      },
      "groupePolitiqueRef": "PO759900"
    },
    "cosignataires": {
      "acteurRef": [
        "PA607619",
        "PA336439",
        "PA719146",
        "PA267042"
      ]
    },
    "texteAffichable": "M.&#160;Favennec Becot,  M.&#160;Acquaviva, M.&#160;Cl&#233;ment et M.&#160;Molac"
  },
  "pointeurFragmentTexte": {
    "missionVisee": {
      "@xmlns:xsi": "http://www.w3.org/2001/XMLSchema-instance",
      "@xsi:nil": "true"
    },
    "division": {
      "titre": "Article 19",
      "articleDesignationCourte": "ART. 19",
      "type": "ARTICLE",
      "avant_A_Apres": "A",
      "divisionRattachee": "ARTICLE 19",
      "articleAdditionnel": {
        "@xmlns:xsi": "http://www.w3.org/2001/XMLSchema-instance",
        "@xsi:nil": "true"
      },
      "chapitreAdditionnel": {
        "@xmlns:xsi": "http://www.w3.org/2001/XMLSchema-instance",
        "@xsi:nil": "true"
      },
      "urlDivisionTexteVise": "/15/textes/1503.asp#D_Article_19"
    },
    "alinea": {
      "avant_A_Apres": "Apres",
      "numero": "16",
      "alineaDesignation": {
        "@xmlns:xsi": "http://www.w3.org/2001/XMLSchema-instance",
        "@xsi:nil": "true"
      }
    }
  },
  "corps": {
    "dispositif": "<p style=\"text-align: justify;\">Apr&#232;s l&#8217;alin&#233;a&#160;16, ins&#233;rer l&#8217;alin&#233;a suivant&#160;:</p><p style=\"text-align: justify;\">&#171;&#160;1&#176;&#160;<i>bis</i>&#160;Avant le dernier alin&#233;a du m&#234;me article L.&#160;111&#8209;13, il est ins&#233;r&#233; un alin&#233;a ainsi r&#233;dig&#233;&#160;:</p><p style=\"text-align: justify;\">&#171;&#160;&#171;&#160;Les algorithmes utilis&#233;s dans le cadre de la r&#233;utilisation des d&#233;cisions de justice, mises &#224; la disposition du public &#224; titre gratuit et sous forme &#233;lectronique, r&#233;pondent &#224; une obligation de transparence.&#160;&#187;&#160;;&#160;&#187;.</p>",
    "exposeSommaire": "<p>Comme l'a indiqu&#233; le rapport Cadiet sur l'Open Data des d&#233;cisions de justice, remis &#224; madame la garde des Sceaux en janvier 2018, il est essentiel de r&#233;guler l'utilisation, par des outils de traitements algorithmiques, des d&#233;cisions de justice, mises &#224; la disposition du public &#224; titre gratuit et sous forme &#233;lectronique, afin de permettre la restitution d'informations les plus objectives possibles et de qualit&#233;. A cette fin, l'&#233;diction d'une obligation de transparence des algorithmes permettra l'analyse du fonctionnement des outils concern&#233;s et l'identification des &#233;ventuelles faiblesses par les autorit&#233;s comp&#233;tentes. Un m&#233;canisme de contr&#244;le op&#233;r&#233; par la puissance publique devra &#234;tre mis en place, en parall&#232;le d'un m&#233;canisme de certification de qualit&#233; assur&#233; par un organisme ind&#233;pendant, &#224; l'instar des normes ISO.</p>",
    "annexeExposeSommaire": {
      "@xmlns:xsi": "http://www.w3.org/2001/XMLSchema-instance",
      "@xsi:nil": "true"
    },
    "cartoucheDelaiDepotDepasse": {
      "@xmlns:xsi": "http://www.w3.org/2001/XMLSchema-instance",
      "@xsi:nil": "true"
    }
  },
  "representations": {
    "representation": {
      "nom": "PDF",
      "typeMime": {
        "type": "application",
        "subType": "PDF"
      },
      "statutRepresentation": {
        "verbatim": "true",
        "canonique": "true",
        "officielle": "true",
        "transcription": "false",
        "enregistrement": "false"
      },
      "repSource": {
        "@xmlns:xsi": "http://www.w3.org/2001/XMLSchema-instance",
        "@xsi:nil": "true"
      },
      "offset": {
        "@xmlns:xsi": "http://www.w3.org/2001/XMLSchema-instance",
        "@xsi:nil": "true"
      },
      "contenu": {
        "documentURI": "/15/amendements/1503/CION_LOIS/CL396.pdf"
      },
      "dateDispoRepresentation": {
        "@xmlns:xsi": "http://www.w3.org/2001/XMLSchema-instance",
        "@xsi:nil": "true"
      }
    }
  },
  "seanceDiscussion": {
    "@xmlns:xsi": "http://www.w3.org/2001/XMLSchema-instance",
    "@xsi:nil": "true"
  },
  "sort": {
    "dateSaisie": "2018-12-19T17:10:54.000+01:00",
    "sortEnSeance": "Rejeté"
  },
  "dateDepot": "2018-12-17T01:00:00.000+01:00",
  "dateDistribution": "2018-12-18T01:00:00.000+01:00",
  "article99": "0",
  "loiReference": {
    "codeLoi": {
      "@xmlns:xsi": "http://www.w3.org/2001/XMLSchema-instance",
      "@xsi:nil": "true"
    },
    "divisionCodeLoi": {
      "@xmlns:xsi": "http://www.w3.org/2001/XMLSchema-instance",
      "@xsi:nil": "true"
    }
  }
}