{
  "@xmlns": "http://schemas.assemblee-nationale.fr/referentiel",
  "uid": "AMANR5L15SEA717460BTC2401P0D1N922",
  "identifiant": {
    "legislature": "15",
    "numero": "922",
    "numRect": "1",
    "saisine": {
      "refTexteLegislatif": "PRJLANR5L15BTC2401",
      "numeroPartiePLF": "0",
      "organeExamen": "PO717460",
      "mentionSecondeDeliberation": "0"
    }
  },
  "numeroLong": "922 (Rect)",
  "etapeTexte": "1ère lecture (2ème assemblée saisie)",
  "triAmendement": "bbiaaaaaaaaaaaaaaaaaaaaaaaaaaaaaaaaaaaaaaaaaaaaaaaal",
  "cardinaliteAmdtMultiples": "1",
  "amendementParent": {
    "@xmlns:xsi": "http://www.w3.org/2001/XMLSchema-instance",
    "@xsi:nil": "true"
  },
  "etat": "Retiré",
  "signataires": {
    "auteur": {
      "typeAuteur": "Depute",
      "acteurRef": "PA721398",
      "organeRef": {
        "@xmlns:xsi": "http://www.w3.org/2001/XMLSchema-instance",
        "@xsi:nil": "true"
      },
      "groupePolitiqueRef": "PO730964"
    },
    "cosignataires": {
      "acteurRef": [
        "PA718794",
        "PA719364",
        "PA721522",
        "PA719456",
        "PA718768",
        "PA702054",
        "PA721398"
      ]
    },
    "texteAffichable": "Mme&#160;Degois,  Mme&#160;O&apos;Petit, Mme&#160;M&#246;rch, M.&#160;Claireaux, Mme&#160;H&#233;rin, M.&#160;Batut et Mme&#160;Valetta Ardisson"
  },
  "pointeurFragmentTexte": {
    "missionVisee": {
      "@xmlns:xsi": "http://www.w3.org/2001/XMLSchema-instance",
      "@xsi:nil": "true"
    },
    "division": {
      "titre": "Article 6",
      "articleDesignationCourte": "ART. 6",
      "type": "ARTICLE",
      "avant_A_Apres": "A",
      "divisionRattachee": "ARTICLE 6",
      "articleAdditionnel": {
        "@xmlns:xsi": "http://www.w3.org/2001/XMLSchema-instance",
        "@xsi:nil": "true"
      },
      "chapitreAdditionnel": {
        "@xmlns:xsi": "http://www.w3.org/2001/XMLSchema-instance",
        "@xsi:nil": "true"
      },
      "urlDivisionTexteVise": "/15/textes/2401.asp#D_Article_6"
    },
    "alinea": {
      "@xmlns:xsi": "http://www.w3.org/2001/XMLSchema-instance",
      "@xsi:nil": "true"
    }
  },
  "corps": {
    "dispositif": "<p style=\"text-align: justify;\">R&#233;diger ainsi cet article&#160;:</p><p style=\"text-align: justify;\">&#171;&#160;I.&#160;&#8211;&#160;Le code g&#233;n&#233;ral des collectivit&#233;s territoriales est ainsi modifi&#233;&#160;:</p><p style=\"text-align: justify;\">&#171;&#160;1&#176;&#160;Le I de l&#8217;article L.&#160;4424&#8209;32 est compl&#233;t&#233; par un alin&#233;a ainsi r&#233;dig&#233;&#160;:</p><p style=\"text-align: justify;\">&#171;&#160;Les communes class&#233;es stations de tourisme conservent la d&#233;nomination&#160;&#171;&#160;communes touristiques&#160;&#187;&#160;pendant toute la dur&#233;e de leur classement.&#160;&#187;&#160;;</p><p style=\"text-align: justify;\">&#171;&#160;2&#176;&#160;Apr&#232;s le mot&#160;: &#171;&#160;communautaire&#160;&#187;, la fin du 2&#176;&#160;du I de l&#8217;article L.&#160;5214&#8209;16 est supprim&#233;e&#160;;</p><p style=\"text-align: justify;\">&#171;&#160;3&#176;&#160;Apr&#232;s le mot&#160;: &#171;&#160;communautaire&#160;&#187;, la fin du 1&#176;&#160;de l&#8217;article L.&#160;5216&#8209;5 est supprim&#233;e&#160;;</p><p style=\"text-align: justify;\">&#171;&#160;II.&#160;&#8211;&#160;La section 1 du chapitre 4 du titre III du livre I<sup>er</sup>&#160;du code du tourisme est ainsi modifi&#233;e&#160;:</p><p style=\"text-align: justify;\">&#171;&#160;1&#176;&#160;Au d&#233;but de l&#8217;article L.&#160;134&#8209;1, les mots&#160;: &#171;&#160;la communaut&#233; de communes, la communaut&#233; d&#8217;agglom&#233;ration&#160;&#187; sont supprim&#233;s&#160;;</p><p style=\"text-align: justify;\">&#171;&#160;2&#176;&#160;L&#8217;article L.&#160;134&#8209;2 est abrog&#233;.&#160;&#187;</p>",
    "exposeSommaire": "<p style=\"text-align: justify;\">Cet amendement vise &#224; permettre aux communes, si elles le souhaitent, de se voir attribuer la comp&#233;tence&#160; &#171;&#160;promotion du tourisme, dont la cr&#233;ation d&#8217;offices du tourisme&#160;&#187;, qui avait &#233;t&#233; transf&#233;r&#233;e aux communaut&#233;s de communes et communaut&#233;s d&#8217;agglom&#233;rations par la loi n&#176;&#160;2015&#8209;991 du 7 ao&#251;t 2015 portant nouvelle organisation territoriale de la R&#233;publique.</p><p style=\"text-align: justify;\">Le projet de loi pr&#233;voit, dans son article&#160;6, la possibilit&#233; de d&#233;roger &#224; ce transfert de comp&#233;tences pour toutes les communes &#233;rig&#233;es en stations class&#233;es de tourisme. Cette d&#233;marche r&#233;pond aux attentes des &#233;lus locaux. Toutefois, elle a &#233;galement pour cons&#233;quence d&#8217;exclure du dispositif des communes, par nature touristiques, mais ne r&#233;pondant pas aux crit&#232;res de classement en station de tourisme pr&#233;vus par les article&#160;133&#8209;11 et 133&#8209;12 du Code de tourisme. En effet, parmi les crit&#232;res requis pour ce classement se trouve notamment la capacit&#233; &#224; disposer d&#8217;un certain nombre d&#8217;h&#233;bergements destin&#233;s &#224; une population non permanente. R&#233;pondre &#224; cette exigence n&#8217;est pas toujours possible pour des territoires situ&#233;s dans des espaces ruraux ou de montagne dont l&#8217;attractivit&#233; &#233;conomique repose, malgr&#233; tout, sur l&#8217;activit&#233; touristique. C&#8217;est pourquoi il est propos&#233; par cet amendement d&#8217;offrir aux communes la possibilit&#233; de se voir r&#233;attribuer la comp&#233;tence de promotion du tourisme.</p>",
    "annexeExposeSommaire": {
      "@xmlns:xsi": "http://www.w3.org/2001/XMLSchema-instance",
      "@xsi:nil": "true"
    },
    "cartoucheDelaiDepotDepasse": {
      "@xmlns:xsi": "http://www.w3.org/2001/XMLSchema-instance",
      "@xsi:nil": "true"
    },
    "avantAppel": {
      "@xmlns:xsi": "http://www.w3.org/2001/XMLSchema-instance",
      "@xsi:nil": "true"
    }
  },
  "representations": {
    "representation": {
      "nom": "PDF",
      "typeMime": {
        "type": "application",
        "subType": "PDF"
      },
      "statutRepresentation": {
        "verbatim": "true",
        "canonique": "true",
        "officielle": "true",
        "transcription": "false",
        "enregistrement": "false"
      },
      "repSource": {
        "@xmlns:xsi": "http://www.w3.org/2001/XMLSchema-instance",
        "@xsi:nil": "true"
      },
      "offset": {
        "@xmlns:xsi": "http://www.w3.org/2001/XMLSchema-instance",
        "@xsi:nil": "true"
      },
      "contenu": {
        "documentURI": "/15/amendements/2401/AN/922.pdf"
      },
      "dateDispoRepresentation": {
        "@xmlns:xsi": "http://www.w3.org/2001/XMLSchema-instance",
        "@xsi:nil": "true"
      }
    }
  },
  "seanceDiscussion": {
    "@xmlns:xsi": "http://www.w3.org/2001/XMLSchema-instance",
    "@xsi:nil": "true"
  },
  "sort": {
    "@xmlns:xsi": "http://www.w3.org/2001/XMLSchema-instance",
    "@xsi:nil": "true"
  },
  "dateDepot": "2019-11-14T01:00:00.000+01:00",
  "dateDistribution": "2019-11-20T01:00:00.000+01:00",
  "article99": "0",
  "loiReference": {
    "codeLoi": {
      "@xmlns:xsi": "http://www.w3.org/2001/XMLSchema-instance",
      "@xsi:nil": "true"
    },
    "divisionCodeLoi": {
      "@xmlns:xsi": "http://www.w3.org/2001/XMLSchema-instance",
      "@xsi:nil": "true"
    }
  }
}