{
  "@xmlns": "http://schemas.assemblee-nationale.fr/referentiel",
  "uid": "AMANR5L15PO419610B0627P0D1N2043",
  "identifiant": {
    "legislature": "15",
    "numero": "2043",
    "numRect": "0",
    "saisine": {
      "refTexteLegislatif": "PRJLANR5L15B0627",
      "numeroPartiePLF": "0",
      "organeExamen": "PO419610",
      "mentionSecondeDeliberation": "0"
    }
  },
  "numeroLong": "CE2043",
  "etapeTexte": "1ère lecture (1ère assemblée saisie)",
  "triAmendement": "aaazznvyzzzwzzzzvxwzzwzvzzzzwwti",
  "cardinaliteAmdtMultiples": "1",
  "amendementParent": {
    "@xmlns:xsi": "http://www.w3.org/2001/XMLSchema-instance",
    "@xsi:nil": "true"
  },
  "etat": "Discuté",
  "signataires": {
    "auteur": {
      "typeAuteur": "Depute",
      "acteurRef": "PA719242",
      "organeRef": {
        "@xmlns:xsi": "http://www.w3.org/2001/XMLSchema-instance",
        "@xsi:nil": "true"
      },
      "groupePolitiqueRef": "PO730964"
    },
    "cosignataires": {
      "acteurRef": "PA719242"
    },
    "texteAffichable": "M.&#160;Moreau, rapporteur"
  },
  "pointeurFragmentTexte": {
    "missionVisee": {
      "@xmlns:xsi": "http://www.w3.org/2001/XMLSchema-instance",
      "@xsi:nil": "true"
    },
    "division": {
      "titre": "Article 11",
      "articleDesignationCourte": "APRÈS ART. 11",
      "type": "ARTICLE",
      "avant_A_Apres": "Après",
      "divisionRattachee": "APRÈS L'ARTICLE 11, insérer l'article suivant:",
      "articleAdditionnel": "1",
      "chapitreAdditionnel": {
        "@xmlns:xsi": "http://www.w3.org/2001/XMLSchema-instance",
        "@xsi:nil": "true"
      },
      "urlDivisionTexteVise": "/15/textes/0627.asp#D_Article_11"
    },
    "alinea": {
      "@xmlns:xsi": "http://www.w3.org/2001/XMLSchema-instance",
      "@xsi:nil": "true"
    }
  },
  "corps": {
    "dispositif": "<p style=\"text-align: justify;\">Le code rural et de la p&#234;che maritime est ainsi modifi&#233;&#160;:</p><p style=\"text-align: justify;\">1&#176;&#160;Le 2&#176; de l&#8217;article L.&#160;640&#8209;2 est compl&#233;t&#233; par un alin&#233;a ainsi r&#233;dig&#233;&#160;:</p><p style=\"text-align: justify;\">&#171;&#160;&#8211;&#160;la mention &#8220;issu d&#8217;une production &#224; haute valeur nutritionnelle&#8221;&#160;;&#160;&#187;</p><p style=\"text-align: justify;\">2&#176; La sous-section 2 de la section 2 du chapitre I<sup>er</sup> du titre IV du livre VI est compl&#233;t&#233;e par un article L.&#160;641&#8209;19&#8209;2 ainsi r&#233;dig&#233;&#160;:</p><p style=\"text-align: justify;\">&#171;&#160;<i>Art.&#160;L.&#160;641&#8209;19&#8209;2</i>.&#160;&#8211;&#160;Sans pr&#233;judice des dispositions du r&#232;glement (CE) n&#176; 1924/2006 du Parlement&#160;europ&#233;en et du Conseil du 20 d&#233;cembre 2006 concernant les all&#233;gations nutritionnelles et de sant&#233; portant sur les denr&#233;es alimentaires, la mention &#171;&#160;issu d&#8217;une production &#224; haute valeur nutritionnelle&#160;&#187; est accessible aux produits destin&#233;s &#224; la consommation humaine issus de modes de production agricole qui garantissent la diversit&#233; et la qualit&#233; nutritionnelle &#233;lev&#233;e de leurs intrants alimentaires, dans des conditions fix&#233;es par d&#233;cret.&#160;&#187;</p>",
    "exposeSommaire": "<p style=\"text-align: justify;\">Les exploitations agricoles qui s&#8217;inscrivent dans une d&#233;marche durable de diversification de la nourriture animale, qui r&#233;habilitent certaines cultures comme le lin, la luzerne ou le sainfoin, ont un impact positif sur l&#8217;environnement, sur la sant&#233; des animaux et sur la qualit&#233; des produits vendus aux consommateurs. En effet, cette diversification de la nourriture consomm&#233;e par les animaux lui permet de gagner en densit&#233; nutritionnelle (vitamines, min&#233;raux), et l&#8217;utilisation de soja ou de compl&#233;ments alimentaires, pour compenser le recours excessif au ma&#239;s ou au bl&#233;, devient moins pertinente.</p><p style=\"text-align: justify;\">En reconnaissant une nouvelle mention valorisante mettant en avant les exploitations qui s&#8217;engagent dans la qualit&#233; nutritionnelle des intrants alimentaires pour les animaux d&#8217;&#233;levage, et permettent la mont&#233;e en gamme de leur production, cet amendement encourage le d&#233;veloppement d&#8217;un cercle vertueux b&#233;n&#233;fique &#224; tous.</p>",
    "annexeExposeSommaire": {
      "@xmlns:xsi": "http://www.w3.org/2001/XMLSchema-instance",
      "@xsi:nil": "true"
    }
  },
  "representations": {
    "representation": {
      "nom": "PDF",
      "typeMime": {
        "type": "application",
        "subType": "PDF"
      },
      "statutRepresentation": {
        "verbatim": "true",
        "canonique": "true",
        "officielle": "true",
        "transcription": "false",
        "enregistrement": "false"
      },
      "repSource": {
        "@xmlns:xsi": "http://www.w3.org/2001/XMLSchema-instance",
        "@xsi:nil": "true"
      },
      "offset": {
        "@xmlns:xsi": "http://www.w3.org/2001/XMLSchema-instance",
        "@xsi:nil": "true"
      },
      "contenu": {
        "documentURI": "/15/amendements/0627/CION-ECO/CE2043.pdf"
      },
      "dateDispoRepresentation": {
        "@xmlns:xsi": "http://www.w3.org/2001/XMLSchema-instance",
        "@xsi:nil": "true"
      }
    }
  },
  "seanceDiscussion": {
    "@xmlns:xsi": "http://www.w3.org/2001/XMLSchema-instance",
    "@xsi:nil": "true"
  },
  "sort": {
    "dateSaisie": "2018-04-19T18:31:16.000+02:00",
    "sortEnSeance": "Adopté"
  },
  "dateDepot": "2018-04-13T02:00:00.000+02:00",
  "dateDistribution": "2018-04-17T02:00:00.000+02:00",
  "article99": "0",
  "loiReference": {
    "codeLoi": "rural et pêche maritime",
    "divisionCodeLoi": "L640-2"
  }
}