{
  "@xmlns": "http://schemas.assemblee-nationale.fr/referentiel",
  "uid": "AMANR5L15PO59048B2272P1D1N886",
  "identifiant": {
    "legislature": "15",
    "numero": "886",
    "numRect": "0",
    "saisine": {
      "refTexteLegislatif": "PRJLANR5L15B2272",
      "numeroPartiePLF": "1",
      "organeExamen": "PO59048",
      "mentionSecondeDeliberation": "0"
    }
  },
  "numeroLong": "I-CF886",
  "etapeTexte": "1ère lecture (1ère assemblée saisie)",
  "triAmendement": "bmaaaaaaaaaaaaaaaaaaaaaaaaaaaaaaaaaaaaaaaaaaaaaaaaeeueko",
  "cardinaliteAmdtMultiples": "1",
  "amendementParent": {
    "@xmlns:xsi": "http://www.w3.org/2001/XMLSchema-instance",
    "@xsi:nil": "true"
  },
  "etat": "Retiré",
  "signataires": {
    "auteur": {
      "typeAuteur": "Depute",
      "acteurRef": "PA721600",
      "organeRef": {
        "@xmlns:xsi": "http://www.w3.org/2001/XMLSchema-instance",
        "@xsi:nil": "true"
      },
      "groupePolitiqueRef": "PO730964"
    },
    "cosignataires": {
      "acteurRef": [
        "PA720538",
        "PA720054",
        "PA721600",
        "PA722366",
        "PA720944"
      ]
    },
    "texteAffichable": "Mme&#160;Rossi,  Mme&#160;De Temmerman, M.&#160;Fugit, Mme&#160;Park et M.&#160;Haury"
  },
  "pointeurFragmentTexte": {
    "missionVisee": {
      "@xmlns:xsi": "http://www.w3.org/2001/XMLSchema-instance",
      "@xsi:nil": "true"
    },
    "division": {
      "titre": "Article 8",
      "articleDesignationCourte": "APRÈS ART. 8",
      "type": "ARTICLE",
      "avant_A_Apres": "Après",
      "divisionRattachee": "APRÈS L'ARTICLE 8, insérer l'article suivant:",
      "articleAdditionnel": "1",
      "chapitreAdditionnel": {
        "@xmlns:xsi": "http://www.w3.org/2001/XMLSchema-instance",
        "@xsi:nil": "true"
      },
      "urlDivisionTexteVise": "/15/textes/2272A.asp#D_Article_8"
    },
    "alinea": {
      "@xmlns:xsi": "http://www.w3.org/2001/XMLSchema-instance",
      "@xsi:nil": "true"
    }
  },
  "corps": {
    "dispositif": "<p style=\"text-align: justify;\">I&#160;&#8211;&#160;Le A de l&#8217;article&#160;278&#8209;0 <i>bis</i> du code ge&#769;ne&#769;ral des impo&#770;ts est comple&#769;te&#769;&#769; par un 4&#176;&#160;ainsi re&#769;dige&#769;&#160;:&#160;</p><p style=\"text-align: justify;\">&#171;&#160;4&#176;&#160;Les prestations relatives a&#768; la re&#769;paration et au re&#769;emploi des biens meubles&#160;&#187;.</p><p style=\"text-align: justify;\">II.&#160;&#8211;&#160;Le&#160;I du pr&#233;sent article est applicable sous re&#769;serve de la transposition de la directive 2018/0005 du conseil du 18 janvier 2018 modifiant la directive 2006/112/CE en ce qui concerne les taux de taxe sur la valeur ajoute&#769;e.</p><p style=\"text-align: justify;\">III.&#160;&#8211;&#160;La perte de recettes pour l&#8217;&#201;tat r&#233;sultant du m&#234;me&#160;I est compens&#233;e a&#768; due concurrence par la majoration du taux de la taxe pr&#233;vue &#224; l&#8217;article&#160;299 du m&#234;me code.</p>",
    "exposeSommaire": "<p style=\"text-align: justify;\">Cet amendement vise a&#768; appliquer, sous re&#769;serve de la modification de la directive TVA actuellement en discussion au niveau europe&#769;en, une TVA re&#769;duite a&#768; 5,5&#160;% sur les prestations de re&#769;paration, de re&#769;emploi de biens meubles, notamment les e&#769;quipements e&#769;lectriques et e&#769;lectroniques (D3E). Ceci, en raison de la dimension durable de ces activite&#769;s et de leur apport en faveur d&#8217;un mode de consommation plus durable et d&#8217;une e&#769;conomie circulaire que nous appelons de nos v&#339;ux.</p><p style=\"text-align: justify;\">A&#768; l&#8217;aune de l&#8217;examen prochain par l&#8217;Assemble&#769;e nationale du projet de loi relatif a&#768; la lutte contre le gaspillage et pour une e&#769;conomie circulaire, cet amendement s&#8217;inscrit dans la philosophie ge&#769;ne&#769;rale de cette loi qui vise entre autres a&#768; favoriser la re&#769;paration, le re&#769;emploi et la lutte contre le gaspillage et l&#8217;obsolescence programme&#769;e.</p><p style=\"text-align: justify;\">Cet amendement est finance&#769; par la hausse de la taxe sur certains services fournis par les grandes entreprises du secteur nume&#769;rique, notamment les services d&#8217;interme&#769;diation nume&#769;rique permettant de revendre des biens sur internet.</p>",
    "annexeExposeSommaire": {
      "@xmlns:xsi": "http://www.w3.org/2001/XMLSchema-instance",
      "@xsi:nil": "true"
    },
    "cartoucheDelaiDepotDepasse": {
      "@xmlns:xsi": "http://www.w3.org/2001/XMLSchema-instance",
      "@xsi:nil": "true"
    },
    "avantAppel": {
      "@xmlns:xsi": "http://www.w3.org/2001/XMLSchema-instance",
      "@xsi:nil": "true"
    }
  },
  "representations": {
    "representation": {
      "nom": "PDF",
      "typeMime": {
        "type": "application",
        "subType": "PDF"
      },
      "statutRepresentation": {
        "verbatim": "true",
        "canonique": "true",
        "officielle": "true",
        "transcription": "false",
        "enregistrement": "false"
      },
      "repSource": {
        "@xmlns:xsi": "http://www.w3.org/2001/XMLSchema-instance",
        "@xsi:nil": "true"
      },
      "offset": {
        "@xmlns:xsi": "http://www.w3.org/2001/XMLSchema-instance",
        "@xsi:nil": "true"
      },
      "contenu": {
        "documentURI": "/15/amendements/2272A/CION_FIN/CF886.pdf"
      },
      "dateDispoRepresentation": {
        "@xmlns:xsi": "http://www.w3.org/2001/XMLSchema-instance",
        "@xsi:nil": "true"
      }
    }
  },
  "seanceDiscussion": {
    "@xmlns:xsi": "http://www.w3.org/2001/XMLSchema-instance",
    "@xsi:nil": "true"
  },
  "sort": {
    "@xmlns:xsi": "http://www.w3.org/2001/XMLSchema-instance",
    "@xsi:nil": "true"
  },
  "dateDepot": "2019-10-04T02:00:00.000+02:00",
  "dateDistribution": "2019-10-06T02:00:00.000+02:00",
  "article99": "0",
  "loiReference": {
    "codeLoi": "CGI",
    "divisionCodeLoi": "278-0 bis A 4"
  }
}