{
  "@xmlns": "http://schemas.assemblee-nationale.fr/referentiel",
  "uid": "AMANR5L15PO420120B1297P0D1N389",
  "identifiant": {
    "legislature": "15",
    "numero": "389",
    "numRect": "0",
    "saisine": {
      "refTexteLegislatif": "PRJLANR5L15B1297",
      "numeroPartiePLF": "0",
      "organeExamen": "PO420120",
      "mentionSecondeDeliberation": "0"
    }
  },
  "numeroLong": "AS389",
  "etapeTexte": "1ère lecture (1ère assemblée saisie)",
  "triAmendement": "epaaaaaaaaaaaaaaaaaaaaaaaaaaaaaaaaaaaaaaaaaaaaaaaafavi",
  "cardinaliteAmdtMultiples": "1",
  "amendementParent": {
    "@xmlns:xsi": "http://www.w3.org/2001/XMLSchema-instance",
    "@xsi:nil": "true"
  },
  "etat": "Discuté",
  "signataires": {
    "auteur": {
      "typeAuteur": "Depute",
      "acteurRef": "PA608292",
      "organeRef": {
        "@xmlns:xsi": "http://www.w3.org/2001/XMLSchema-instance",
        "@xsi:nil": "true"
      },
      "groupePolitiqueRef": "PO723569"
    },
    "cosignataires": {
      "acteurRef": "PA608292"
    },
    "texteAffichable": "Mme&#160;Dubi&#233;"
  },
  "pointeurFragmentTexte": {
    "missionVisee": {
      "@xmlns:xsi": "http://www.w3.org/2001/XMLSchema-instance",
      "@xsi:nil": "true"
    },
    "division": {
      "titre": "Article 29",
      "articleDesignationCourte": "APRÈS ART. 29",
      "type": "ARTICLE",
      "avant_A_Apres": "Après",
      "divisionRattachee": "APRÈS L'ARTICLE 29, insérer l'article suivant:",
      "articleAdditionnel": "1",
      "chapitreAdditionnel": {
        "@xmlns:xsi": "http://www.w3.org/2001/XMLSchema-instance",
        "@xsi:nil": "true"
      },
      "urlDivisionTexteVise": "/15/textes/1297.asp#D_Article_29"
    },
    "alinea": {
      "@xmlns:xsi": "http://www.w3.org/2001/XMLSchema-instance",
      "@xsi:nil": "true"
    }
  },
  "corps": {
    "dispositif": "<p style=\"text-align: justify;\">&#192; la deuxi&#232;me phrase du premier alin&#233;a de l&#8217;article L.&#160;162&#8209;22&#8209;13 du code de la s&#233;curit&#233; sociale, les mots&#160;: &#171;&#160;ou locales&#160;&#187; sont remplac&#233;s par les mots&#160;: &#171;&#160;, locales ou europ&#233;ennes&#160;&#187;.</p>",
    "exposeSommaire": "<p style=\"text-align: justify;\">Le 9 f&#233;vrier 2016 a &#233;t&#233; publi&#233; au Journal officiel de l&#8217;Union&#160;europ&#233;enne le R&#232;glement d&#233;l&#233;gu&#233; (UE) 2016/161 du 2 octobre 2015 compl&#233;tant la directive 2001/83/CE du Parlement&#160;europ&#233;en et du Conseil en fixant les modalit&#233;s des dispositifs de s&#233;curit&#233; figurant sur l&#8217;emballage des m&#233;dicaments &#224; usage humain. Ce texte pr&#233;voit lui-m&#234;me son entr&#233;e en vigueur sur l&#8217;ensemble du territoire de l&#8217;Union le 9 f&#233;vrier 2019.</p><p style=\"text-align: justify;\">Le 8 f&#233;vrier 2018 le minist&#232;re des Solidarit&#233;s et de la Sant&#233; a pris une note d&#8217;information n&#176; DGS/PP2/DGOS/PF2/2018/27 &#171;&#160;visant &#224; rappeler aux pharmacies d&#8217;officine et aux &#233;tablissements de sant&#233; leurs obligations pr&#233;vues par le r&#232;glement d&#233;l&#233;gu&#233; (UE) 2016/161&#160;&#187;. Cette note d&#8217;information &#233;nonce ainsi que &#171;&#160;la mise en &#339;uvre du r&#232;glement d&#233;l&#233;gu&#233; n&#233;cessite des adaptations techniques et informatiques, voire organisationnelles qu&#8217;il est n&#233;cessaire d&#8217;anticiper d&#232;s maintenant pour sa mise en application effective &#224; partir du 9 f&#233;vrier 2019 (&#8230;) La v&#233;rification des dispositifs de s&#233;curit&#233; constituera une op&#233;ration nouvelle pour les pharmaciens d&#8217;officine et de PUI. Elle impose que les pharmacies d&#8217;officine et les &#233;tablissements de sant&#233; soient &#233;quip&#233;s d&#8217;un syst&#232;me permettant de v&#233;rifier l&#8217;identifiant unique de chaque bo&#238;te de m&#233;dicaments&#160;&#187;.</p><p style=\"text-align: justify;\">Aussi, la mise en &#339;uvre du R&#232;glement d&#233;l&#233;gu&#233; (UE) 2016/161 du 2 octobre 2015 va n&#233;cessiter des r&#233;organisations d&#8217;ampleur dans la plupart des &#233;tablissements concern&#233;s, g&#233;n&#233;rant un surco&#251;t important.</p><p style=\"text-align: justify;\">C&#8217;est pourquoi il importe que ce surco&#251;t soit en tout ou partie compens&#233; par une dotation financi&#232;re adapt&#233;e au titre des aides &#224; la contractualisation.</p><p style=\"text-align: justify;\">Toutefois, l&#8217;article L.&#160;162&#8209;22&#8209;13 du code de la s&#233;curit&#233; sociale e mentionnant pas express&#233;ment la mise en &#339;uvre des politiques&#160;europ&#233;ennes en mati&#232;re sanitaire comme pouvant donner lieu &#224; compensation au titre des missions d&#8217;int&#233;r&#234;t g&#233;n&#233;ral et d&#8217;aide &#224; la contractualisation des &#233;tablissements de sant&#233;, cette proposition d&#8217;amendement vise &#224; &#233;largir en ce sens la port&#233;e de ce texte.</p>",
    "annexeExposeSommaire": {
      "@xmlns:xsi": "http://www.w3.org/2001/XMLSchema-instance",
      "@xsi:nil": "true"
    }
  },
  "representations": {
    "representation": {
      "nom": "PDF",
      "typeMime": {
        "type": "application",
        "subType": "PDF"
      },
      "statutRepresentation": {
        "verbatim": "true",
        "canonique": "true",
        "officielle": "true",
        "transcription": "false",
        "enregistrement": "false"
      },
      "repSource": {
        "@xmlns:xsi": "http://www.w3.org/2001/XMLSchema-instance",
        "@xsi:nil": "true"
      },
      "offset": {
        "@xmlns:xsi": "http://www.w3.org/2001/XMLSchema-instance",
        "@xsi:nil": "true"
      },
      "contenu": {
        "documentURI": "/15/amendements/1297/CION-SOC/AS389.pdf"
      },
      "dateDispoRepresentation": {
        "@xmlns:xsi": "http://www.w3.org/2001/XMLSchema-instance",
        "@xsi:nil": "true"
      }
    }
  },
  "seanceDiscussion": {
    "@xmlns:xsi": "http://www.w3.org/2001/XMLSchema-instance",
    "@xsi:nil": "true"
  },
  "sort": {
    "dateSaisie": "2018-10-17T10:47:37.000+02:00",
    "sortEnSeance": "Adopté"
  },
  "dateDepot": "2018-10-12T02:00:00.000+02:00",
  "dateDistribution": "2018-10-15T02:00:00.000+02:00",
  "article99": "0",
  "loiReference": {
    "codeLoi": "sécurité sociale",
    "divisionCodeLoi": "L162-22-13"
  }
}