{
  "@xmlns": "http://schemas.assemblee-nationale.fr/referentiel",
  "uid": "AMANR5L15SEA717460B0235P1D1N267",
  "identifiant": {
    "legislature": "15",
    "numero": "267",
    "numRect": "0",
    "saisine": {
      "refTexteLegislatif": "PRJLANR5L15B0235",
      "numeroPartiePLF": "1",
      "organeExamen": "PO717460",
      "mentionSecondeDeliberation": "0"
    }
  },
  "numeroLong": "I-267",
  "etapeTexte": "1ère lecture (1ère assemblée saisie)",
  "triAmendement": "yu",
  "cardinaliteAmdtMultiples": "1",
  "amendementParent": {
    "@xmlns:xsi": "http://www.w3.org/2001/XMLSchema-instance",
    "@xsi:nil": "true"
  },
  "etat": "Discuté",
  "signataires": {
    "auteur": {
      "typeAuteur": "Depute",
      "acteurRef": "PA333421",
      "organeRef": {
        "@xmlns:xsi": "http://www.w3.org/2001/XMLSchema-instance",
        "@xsi:nil": "true"
      },
      "groupePolitiqueRef": "PO730952"
    },
    "cosignataires": {
      "acteurRef": [
        "PA722030",
        "PA695100",
        "PA642935",
        "PA642868",
        "PA267241",
        "PA719806",
        "PA720230",
        "PA333421",
        "PA267330",
        "PA266788"
      ]
    },
    "texteAffichable": "M.&#160;Pancher,  Mme&#160;Auconie, M.&#160;Morel-&#192;-L&apos;Huissier, M.&#160;Becht, M.&#160;Zumkeller, Mme&#160;Magnier, M.&#160;Christophe, M.&#160;Demilly, M.&#160;Meyer&#160;Habib et M.&#160;Bournazel"
  },
  "pointeurFragmentTexte": {
    "missionVisee": {
      "@xmlns:xsi": "http://www.w3.org/2001/XMLSchema-instance",
      "@xsi:nil": "true"
    },
    "division": {
      "titre": "Article 9",
      "articleDesignationCourte": "ART. 9",
      "type": "ARTICLE",
      "avant_A_Apres": "A",
      "divisionRattachee": "ARTICLE 9",
      "articleAdditionnel": {
        "@xmlns:xsi": "http://www.w3.org/2001/XMLSchema-instance",
        "@xsi:nil": "true"
      },
      "chapitreAdditionnel": {
        "@xmlns:xsi": "http://www.w3.org/2001/XMLSchema-instance",
        "@xsi:nil": "true"
      },
      "urlDivisionTexteVise": "/15/textes/0235A.asp#D_Article_9"
    },
    "alinea": {
      "avant_A_Apres": {
        "@xmlns:xsi": "http://www.w3.org/2001/XMLSchema-instance",
        "@xsi:nil": "true"
      },
      "numero": "3",
      "alineaDesignation": {
        "@xmlns:xsi": "http://www.w3.org/2001/XMLSchema-instance",
        "@xsi:nil": "true"
      }
    }
  },
  "corps": {
    "dispositif": "<p style=\"text-align: justify;\">R&#233;diger ainsi les cinq derni&#232;res colonnes de la soixante-quatri&#232;me ligne du tableau de l&#8217;alin&#233;a&#160;3&#160;:</p><table style=\"border-collapse: collapse; height: 46px;\" width=\"367\"><tbody><tr><td style=\"white-space: normal; border: 1px solid #000000; width: 70.2px;\">5,80</td><td style=\"white-space: normal; border: 1px solid #000000; width: 70.2px;\">5,80</td><td style=\"white-space: normal; border: 1px solid #000000; width: 70.2px;\">5,80</td><td style=\"white-space: normal; border: 1px solid #000000; width: 70.2px;\">5,80</td><td style=\"white-space: normal; border: 1px solid #000000; width: 70.2px;\">5,80</td></tr></tbody></table>",
    "exposeSommaire": "<p style=\"text-align: justify;\">Cet amendement vise &#224; geler le taux du TICPE associ&#233;e au Gaz Naturel V&#233;hicule (GNV) afin de conserver une fiscalit&#233; comp&#233;titive pour ce dernier.</p>",
    "annexeExposeSommaire": {
      "@xmlns:xsi": "http://www.w3.org/2001/XMLSchema-instance",
      "@xsi:nil": "true"
    }
  },
  "representations": {
    "representation": {
      "nom": "PDF",
      "typeMime": {
        "type": "application",
        "subType": "PDF"
      },
      "statutRepresentation": {
        "verbatim": "true",
        "canonique": "true",
        "officielle": "true",
        "transcription": "false",
        "enregistrement": "false"
      },
      "repSource": {
        "@xmlns:xsi": "http://www.w3.org/2001/XMLSchema-instance",
        "@xsi:nil": "true"
      },
      "offset": {
        "@xmlns:xsi": "http://www.w3.org/2001/XMLSchema-instance",
        "@xsi:nil": "true"
      },
      "contenu": {
        "documentURI": "/15/amendements/0235A/AN/267.pdf"
      },
      "dateDispoRepresentation": {
        "@xmlns:xsi": "http://www.w3.org/2001/XMLSchema-instance",
        "@xsi:nil": "true"
      }
    }
  },
  "seanceDiscussion": "RUANR5L15S2018IDS20769",
  "sort": {
    "dateSaisie": "2017-10-21T18:40:08.000+02:00",
    "sortEnSeance": "Adopté"
  },
  "dateDepot": "2017-10-11T02:00:00.000+02:00",
  "dateDistribution": "2017-10-16T02:00:00.000+02:00",
  "article99": "0",
  "loiReference": {
    "codeLoi": null,
    "divisionCodeLoi": null
  }
}