{
  "@xmlns": "http://schemas.assemblee-nationale.fr/referentiel",
  "uid": "AMANR5L15SEA717460B1490P0D1N108",
  "identifiant": {
    "legislature": "15",
    "numero": "108",
    "numRect": "0",
    "saisine": {
      "refTexteLegislatif": "PRJLANR5L15B1490",
      "numeroPartiePLF": "0",
      "organeExamen": "PO717460",
      "mentionSecondeDeliberation": "0"
    }
  },
  "numeroLong": "108",
  "etapeTexte": "Nouvelle Lecture",
  "triAmendement": "aagaaacaaaaaaaaaaaaaaaaaaaaaaaaaaaaaaaaaaaaaaaaaaazzzzzzzzzzzzo",
  "cardinaliteAmdtMultiples": "1",
  "amendementParent": {
    "@xmlns:xsi": "http://www.w3.org/2001/XMLSchema-instance",
    "@xsi:nil": "true"
  },
  "etat": "Discuté",
  "signataires": {
    "auteur": {
      "typeAuteur": "Depute",
      "acteurRef": "PA718838",
      "organeRef": {
        "@xmlns:xsi": "http://www.w3.org/2001/XMLSchema-instance",
        "@xsi:nil": "true"
      },
      "groupePolitiqueRef": "PO730934"
    },
    "cosignataires": {
      "acteurRef": "PA718838"
    },
    "texteAffichable": "M.&#160;Brun"
  },
  "pointeurFragmentTexte": {
    "missionVisee": {
      "@xmlns:xsi": "http://www.w3.org/2001/XMLSchema-instance",
      "@xsi:nil": "true"
    },
    "division": {
      "titre": "Article 19",
      "articleDesignationCourte": "ART. 19",
      "type": "ARTICLE",
      "avant_A_Apres": "A",
      "divisionRattachee": "ARTICLE 19",
      "articleAdditionnel": {
        "@xmlns:xsi": "http://www.w3.org/2001/XMLSchema-instance",
        "@xsi:nil": "true"
      },
      "chapitreAdditionnel": {
        "@xmlns:xsi": "http://www.w3.org/2001/XMLSchema-instance",
        "@xsi:nil": "true"
      },
      "urlDivisionTexteVise": "/15/textes/1490.asp#D_Article_19"
    },
    "alinea": {
      "avant_A_Apres": "Apres",
      "numero": "23",
      "alineaDesignation": {
        "@xmlns:xsi": "http://www.w3.org/2001/XMLSchema-instance",
        "@xsi:nil": "true"
      }
    }
  },
  "corps": {
    "dispositif": "<p style=\"text-align: justify;\">I.&#160;&#8211;&#160;Apr&#232;s l'alin&#233;a&#160;23, ins&#233;rer l'alin&#233;a suivant&#160;:</p><p style=\"text-align: justify;\">&#171;&#160;1&#176;&#160;<i>bis</i> &#192; la premi&#232;re phrase du troisi&#232;me alin&#233;a de l&#8217;article&#160;265&#160;A&#160;<i>bis</i> du code des douanes,&#160; la date &#171;&#160;30 novembre&#160;&#187;, est remplac&#233; par la date&#160;:&#160;&#171;&#160;31 d&#233;cembre&#160;&#187;.</p><p style=\"text-align: justify;\">II.&#160;&#8211;&#160;Compl&#233;ter cet article par l'alin&#233;a suivant&#160;:</p><p style=\"text-align: justify;\">&#171;&#160;XIII.&#160;&#8211;&#160;La perte de recettes pour les collectivit&#233;s territoriales r&#233;sultant de la pr&#233;sente proposition de loi compens&#233;e &#224; due concurrence par la cr&#233;ation d&#8217;une taxe additionnelle aux droits vis&#233;s aux articles 575 et 575 A du code g&#233;n&#233;ral des imp&#244;ts.</p>",
    "exposeSommaire": "<p style=\"text-align: justify;\">A la suite des manifestations du mois de d&#233;cembres dites des &#171;&#160;gilets jaunes&#160;&#187;, le Pr&#233;sident de la R&#233;publique a annonc&#233; le jeudi 6 d&#233;cembre dernier que les augmentations de taxe sur les carburants pr&#233;vues pour le 1<sup>er</sup> janvier 2019 ne seraient plus suspendues pendant six mois comme le gouvernement l&#8217;avait indiqu&#233; dans l&#8217;h&#233;micycle le mardi 4 d&#233;cembre, mais annul&#233;es pour l&#8217;ann&#233;e 2019.</p><p style=\"text-align: justify;\">A la suite de cette annonce, certaines r&#233;gions envisagent de baisser d&#232;s que possible la part de fiscalit&#233; r&#233;gionale sur les carburant&#160;&#8211;&#160;TICPE part &#171;&#160;Grenelle&#160;&#187; - sur laquelle les Conseils r&#233;gionaux ont un pouvoir de d&#233;cision.</p><p style=\"text-align: justify;\">Toutefois, dans sa r&#233;daction actuelle, l&#8217;article&#160;265 A bis du code des douanes ne permet aux conseils r&#233;gionaux de modifier le taux de la part r&#233;gionale de la TICPE qu&#8217;au moyens de d&#233;lib&#233;rations vot&#233;es avant le 30 novembre de l&#8217;ann&#233;e qui pr&#233;c&#232;de l&#8217;entr&#233;e en vigueur du tarif modifi&#233;.</p><p style=\"text-align: justify;\">La premi&#232;re phrase de l&#8217;alin&#233;a&#160;3 de cet article dispose en effet que &#171;&#160;Les d&#233;lib&#233;rations des conseils r&#233;gionaux et de l&#8217;assembl&#233;e de Corse ne peuvent intervenir qu&#8217;une fois par an et au plus tard le 30 novembre de l&#8217;ann&#233;e qui pr&#233;c&#232;de l&#8217;entr&#233;e en vigueur du tarif modifi&#233;&#160;&#187;.</p><p style=\"text-align: justify;\">&#160;</p><p style=\"text-align: justify;\">Il en r&#233;sulte que l&#8217;annonce faite par le Pr&#233;sident de la R&#233;publique de geler la fiscalit&#233; sur les carburants &#233;tant intervenue le 6 d&#233;cembre, les Conseils r&#233;gionaux ne peuvent en l&#8217;&#233;tat actuel du droit accompagner cette mesure.</p><p style=\"text-align: justify;\">&#160;</p><p style=\"text-align: justify;\">C&#8217;est pourquoi, le pr&#233;sent amendement vise &#224; permettre l&#8217;ajustement de la part r&#233;gionale de la TICPE jusqu&#8217;au 31 d&#233;cembre de l&#8217;ann&#233;e pr&#233;c&#233;dant l&#8217;entr&#233;e en vigueur du tarif modifi&#233;.</p>",
    "annexeExposeSommaire": {
      "@xmlns:xsi": "http://www.w3.org/2001/XMLSchema-instance",
      "@xsi:nil": "true"
    },
    "cartoucheDelaiDepotDepasse": {
      "@xmlns:xsi": "http://www.w3.org/2001/XMLSchema-instance",
      "@xsi:nil": "true"
    }
  },
  "representations": {
    "representation": {
      "nom": "PDF",
      "typeMime": {
        "type": "application",
        "subType": "PDF"
      },
      "statutRepresentation": {
        "verbatim": "true",
        "canonique": "true",
        "officielle": "true",
        "transcription": "false",
        "enregistrement": "false"
      },
      "repSource": {
        "@xmlns:xsi": "http://www.w3.org/2001/XMLSchema-instance",
        "@xsi:nil": "true"
      },
      "offset": {
        "@xmlns:xsi": "http://www.w3.org/2001/XMLSchema-instance",
        "@xsi:nil": "true"
      },
      "contenu": {
        "documentURI": "/15/amendements/1490/AN/108.pdf"
      },
      "dateDispoRepresentation": {
        "@xmlns:xsi": "http://www.w3.org/2001/XMLSchema-instance",
        "@xsi:nil": "true"
      }
    }
  },
  "seanceDiscussion": "RUANR5L15S2019IDS21432",
  "sort": {
    "dateSaisie": "2018-12-18T17:24:25.000+01:00",
    "sortEnSeance": "Tombé"
  },
  "dateDepot": "2018-12-13T01:00:00.000+01:00",
  "dateDistribution": "2018-12-17T01:00:00.000+01:00",
  "article99": "0",
  "loiReference": {
    "codeLoi": {
      "@xmlns:xsi": "http://www.w3.org/2001/XMLSchema-instance",
      "@xsi:nil": "true"
    },
    "divisionCodeLoi": {
      "@xmlns:xsi": "http://www.w3.org/2001/XMLSchema-instance",
      "@xsi:nil": "true"
    }
  }
}