{
  "@xmlns": "http://schemas.assemblee-nationale.fr/referentiel",
  "uid": "AMANR5L15SEA717460BTC0971P0D1N1584",
  "identifiant": {
    "legislature": "15",
    "numero": "1584",
    "numRect": "0",
    "saisine": {
      "refTexteLegislatif": "PRJLANR5L15BTC0971",
      "numeroPartiePLF": "0",
      "organeExamen": "PO717460",
      "mentionSecondeDeliberation": "0"
    }
  },
  "numeroLong": "1584",
  "etapeTexte": "1ère lecture (1ère assemblée saisie)",
  "triAmendement": "gdkk",
  "cardinaliteAmdtMultiples": "1",
  "amendementParent": {
    "@xmlns:xsi": "http://www.w3.org/2001/XMLSchema-instance",
    "@xsi:nil": "true"
  },
  "etat": "Discuté",
  "signataires": {
    "auteur": {
      "typeAuteur": "Depute",
      "acteurRef": "PA720870",
      "organeRef": {
        "@xmlns:xsi": "http://www.w3.org/2001/XMLSchema-instance",
        "@xsi:nil": "true"
      },
      "groupePolitiqueRef": "PO730964"
    },
    "cosignataires": {
      "acteurRef": [
        "PA718902",
        "PA721600",
        "PA719540",
        "PA721946",
        "PA722228",
        "PA720900",
        "PA720870",
        "PA720622",
        "PA721784",
        "PA721844",
        "PA719420",
        "PA718876",
        "PA720268",
        "PA719326",
        "PA721644",
        "PA720552",
        "PA721860"
      ]
    },
    "texteAffichable": "M.&#160;Mbaye,  Mme&#160;Piron, M.&#160;C&#233;dric&#160;Roussel, Mme&#160;Bureau-Bonnard, Mme&#160;Rilhac, M.&#160;Marilossian, Mme&#160;Toutut-Picard, M.&#160;Kokouendo, M.&#160;Cesarini, M.&#160;Damaisin, Mme&#160;Rossi, Mme&#160;Gipson, M.&#160;Leclabart, Mme&#160;Rauch, M.&#160;Besson-Moreau, M.&#160;Sommer et Mme&#160;Gomez-Bassac"
  },
  "pointeurFragmentTexte": {
    "missionVisee": {
      "@xmlns:xsi": "http://www.w3.org/2001/XMLSchema-instance",
      "@xsi:nil": "true"
    },
    "division": {
      "titre": "Article 55",
      "articleDesignationCourte": "ART. 55",
      "type": "ARTICLE",
      "avant_A_Apres": "A",
      "divisionRattachee": "ARTICLE 55",
      "articleAdditionnel": {
        "@xmlns:xsi": "http://www.w3.org/2001/XMLSchema-instance",
        "@xsi:nil": "true"
      },
      "chapitreAdditionnel": {
        "@xmlns:xsi": "http://www.w3.org/2001/XMLSchema-instance",
        "@xsi:nil": "true"
      },
      "urlDivisionTexteVise": "/15/textes/0971.asp#D_Article_55"
    },
    "alinea": {
      "avant_A_Apres": "A",
      "numero": "12",
      "alineaDesignation": "Alinéa 12"
    }
  },
  "corps": {
    "dispositif": "<p>&#192; la premi&#232;re phrase de l&#8217;alin&#233;a&#160;12, apr&#232;s le mot&#160;:</p><p>&#171;&#160;b&#226;timents&#160;&#187;,</p><p>ins&#233;rer les mots&#160;:</p><p>&#171;&#160;ou des parties de b&#226;timents&#160;&#187;.</p>",
    "exposeSommaire": "<p style=\"text-align: justify;\">Amendement de coh&#233;rence r&#233;dactionnelle avec l&#8217;ensemble de l&#8217;article (alin&#233;as 2, 3 et 11) pour viser &#171;&#160;les propri&#233;taires de b&#226;timents ou parties de b&#226;timents&#160;&#187; dans l&#8217;obligation de transmission des consommations d&#8217;&#233;nergie.</p>",
    "annexeExposeSommaire": {
      "@xmlns:xsi": "http://www.w3.org/2001/XMLSchema-instance",
      "@xsi:nil": "true"
    }
  },
  "representations": {
    "representation": {
      "nom": "PDF",
      "typeMime": {
        "type": "application",
        "subType": "PDF"
      },
      "statutRepresentation": {
        "verbatim": "true",
        "canonique": "true",
        "officielle": "true",
        "transcription": "false",
        "enregistrement": "false"
      },
      "repSource": {
        "@xmlns:xsi": "http://www.w3.org/2001/XMLSchema-instance",
        "@xsi:nil": "true"
      },
      "offset": {
        "@xmlns:xsi": "http://www.w3.org/2001/XMLSchema-instance",
        "@xsi:nil": "true"
      },
      "contenu": {
        "documentURI": "/15/amendements/0971/AN/1584.pdf"
      },
      "dateDispoRepresentation": {
        "@xmlns:xsi": "http://www.w3.org/2001/XMLSchema-instance",
        "@xsi:nil": "true"
      }
    }
  },
  "seanceDiscussion": "RUANR5L15S2018IDS21138",
  "sort": {
    "dateSaisie": "2018-06-08T18:57:04.000+02:00",
    "sortEnSeance": "Adopté"
  },
  "dateDepot": "2018-05-25T02:00:00.000+02:00",
  "dateDistribution": "2018-06-01T02:00:00.000+02:00",
  "article99": "0",
  "loiReference": {
    "codeLoi": {
      "@xmlns:xsi": "http://www.w3.org/2001/XMLSchema-instance",
      "@xsi:nil": "true"
    },
    "divisionCodeLoi": {
      "@xmlns:xsi": "http://www.w3.org/2001/XMLSchema-instance",
      "@xsi:nil": "true"
    }
  }
}