{
  "@xmlns": "http://schemas.assemblee-nationale.fr/referentiel",
  "uid": "AMANR5L15PO59048B0235P2D1N172",
  "identifiant": {
    "legislature": "15",
    "numero": "172",
    "numRect": "0",
    "saisine": {
      "refTexteLegislatif": "PRJLANR5L15B0235",
      "numeroPartiePLF": "2",
      "organeExamen": "PO59048",
      "mentionSecondeDeliberation": "0"
    }
  },
  "numeroLong": "II-CF172",
  "etapeTexte": "1ère lecture (1ère assemblée saisie)",
  "triAmendement": "abw",
  "cardinaliteAmdtMultiples": "1",
  "amendementParent": {
    "@xmlns:xsi": "http://www.w3.org/2001/XMLSchema-instance",
    "@xsi:nil": "true"
  },
  "etat": "Discuté",
  "signataires": {
    "auteur": {
      "typeAuteur": "Depute",
      "acteurRef": "PA267527",
      "organeRef": {
        "@xmlns:xsi": "http://www.w3.org/2001/XMLSchema-instance",
        "@xsi:nil": "true"
      },
      "groupePolitiqueRef": "PO730934"
    },
    "cosignataires": {
      "acteurRef": [
        "PA608826",
        "PA718838",
        "PA720210",
        "PA267527"
      ]
    },
    "texteAffichable": "M.&#160;Saddier,  Mme&#160;Duby-Muller, Mme&#160;Beauvais et M.&#160;Brun"
  },
  "pointeurFragmentTexte": {
    "missionVisee": {
      "@xmlns:xsi": "http://www.w3.org/2001/XMLSchema-instance",
      "@xsi:nil": "true"
    },
    "division": {
      "titre": "Article 45",
      "articleDesignationCourte": "APRÈS ART. 45",
      "type": "ARTICLE",
      "avant_A_Apres": "Après",
      "divisionRattachee": "APRÈS L'ARTICLE 45, insérer l'article suivant:",
      "articleAdditionnel": "1",
      "chapitreAdditionnel": {
        "@xmlns:xsi": "http://www.w3.org/2001/XMLSchema-instance",
        "@xsi:nil": "true"
      },
      "urlDivisionTexteVise": "/15/textes/0235C.asp#D_Article_45"
    },
    "alinea": {
      "@xmlns:xsi": "http://www.w3.org/2001/XMLSchema-instance",
      "@xsi:nil": "true"
    }
  },
  "corps": {
    "dispositif": "<p style=\"text-align: justify;\">I.&#160;&#8211;&#160;L&#8217;article&#160;1382 du code g&#233;n&#233;ral des imp&#244;ts est compl&#233;t&#233; par un 15&#176; ainsi r&#233;dig&#233;&#160;:</p><p style=\"text-align: justify;\">&#171;&#160;15&#176; Les parties d&#8217;une installation hydro&#233;lectrique destin&#233;es &#224; la pr&#233;servation de la biodiversit&#233; et de la continuit&#233; &#233;cologique.&#160;&#187;</p><p style=\"text-align: justify;\">II.&#160;&#8211;&#160;La perte de recettes pour les collectivit&#233;s territoriales est compens&#233;e par la majoration &#224; due concurrence de la dotation globale de fonctionnement, et corr&#233;lativement pour l&#8217;&#201;tat par la hausse de la composante carbone int&#233;gr&#233;e aux tarifs des taxes int&#233;rieures sur la consommation des produits &#233;nerg&#233;tiques inscrites au tableau B du 1 de l&#8217;article&#160;265 du code des douanes.</p>",
    "exposeSommaire": "<p style=\"text-align: justify;\">Les producteurs d&#8217;&#233;nergie hydro&#233;lectrique sont soumis aux imp&#244;ts de droit commun ainsi qu&#8217;&#224; des taxes sp&#233;cifiques. La fiscalit&#233; locale&#160;(taxe fonci&#232;re, contribution &#233;conomique territoriale, IFER, redevances&#8230;) repr&#233;sente aujourd&#8217;hui pr&#232;s du tiers du prix de vente de l&#8217;&#233;lectricit&#233; sur le march&#233;, prix qui est la seule source de revenu pour pr&#232;s de 90&#160;% de l&#8217;hydro&#233;lectricit&#233; produite. Cette pression fiscale est non seulement un frein aux investissements mais met m&#234;me en p&#233;ril la couverture des co&#251;ts des installations existantes.</p><p style=\"text-align: justify;\">Les dispositifs visant &#224; la pr&#233;servation de l&#8217;environnement (les passes &#224; poissons par exemple) sont une charge lourde pour les producteurs, &#224; leur construction, pour leur entretien et en raison de la fiscalit&#233; fonci&#232;re qu&#8217;elles g&#233;n&#232;rent, alors m&#234;me qu&#8217;elles n&#8217;ont aucune rentabilit&#233; &#233;conomique.</p><p style=\"text-align: justify;\">En effet, l&#8217;investissement consenti, majoritairement relatif &#224; du g&#233;nie civil, est assujetti &#224; la taxe fonci&#232;re, dont l&#8217;importance peut aller jusqu&#8217;&#224; mettre en p&#233;ril la rentabilit&#233; d&#8217;une installation existante, ou &#224; remettre en cause la faisabilit&#233; d&#8217;un projet de nouvelle installation.</p><p style=\"text-align: justify;\">Ainsi, ces installations qui ne concourent pas &#224; la production d&#8217;&#233;lectricit&#233; g&#233;n&#232;rent pour le producteur, outre le co&#251;t initial qui demeure &#224; sa charge, une perte nette sur l&#8217;ensemble de ses revenus sur toute la dur&#233;e d&#8217;exploitation de la centrale. Les producteurs qui installent de tels am&#233;nagements sont par cons&#233;quent financi&#232;rement doublement p&#233;nalis&#233;s.</p><p style=\"text-align: justify;\">Il est propos&#233; que les parties d&#8217;une installation &#224; vis&#233;e environnementale soient exon&#233;r&#233;es de taxe fonci&#232;re sur les propri&#233;t&#233;s b&#226;ties, de fa&#231;on &#224; faciliter la r&#233;alisation de ces ouvrages qui ont pour but de pr&#233;server la continuit&#233; &#233;cologique et la biodiversit&#233; des cours d&#8217;eau, sans p&#233;naliser la viabilit&#233; &#233;conomique d&#8217;une installation existante ou d&#8217;une nouvelle installation. Aujourd&#8217;hui, le produit de cette taxe fonci&#232;re sur les am&#233;nagements de continuit&#233; &#233;cologique des installations assujetties peut &#234;tre estim&#233; &#224; 3,6 M&#8364;/an.</p><p style=\"text-align: justify;\">Cette exon&#233;ration est d&#8217;ailleurs dans la droite ligne de la r&#233;duction fiscale que pr&#233;voit l&#8217;article&#160;1518 A du CGI pour les installations destin&#233;es &#224; la lutte contre la pollution des eaux et de l&#8217;atmosph&#232;re.</p>",
    "annexeExposeSommaire": {
      "@xmlns:xsi": "http://www.w3.org/2001/XMLSchema-instance",
      "@xsi:nil": "true"
    }
  },
  "representations": {
    "representation": {
      "nom": "PDF",
      "typeMime": {
        "type": "application",
        "subType": "PDF"
      },
      "statutRepresentation": {
        "verbatim": "true",
        "canonique": "true",
        "officielle": "true",
        "transcription": "false",
        "enregistrement": "false"
      },
      "repSource": {
        "@xmlns:xsi": "http://www.w3.org/2001/XMLSchema-instance",
        "@xsi:nil": "true"
      },
      "offset": {
        "@xmlns:xsi": "http://www.w3.org/2001/XMLSchema-instance",
        "@xsi:nil": "true"
      },
      "contenu": {
        "documentURI": "/15/amendements/0235C/CION_TOUTE/CF172.pdf"
      },
      "dateDispoRepresentation": {
        "@xmlns:xsi": "http://www.w3.org/2001/XMLSchema-instance",
        "@xsi:nil": "true"
      }
    }
  },
  "seanceDiscussion": {
    "@xmlns:xsi": "http://www.w3.org/2001/XMLSchema-instance",
    "@xsi:nil": "true"
  },
  "sort": {
    "dateSaisie": {
      "@xmlns:xsi": "http://www.w3.org/2001/XMLSchema-instance",
      "@xsi:nil": "true"
    },
    "sortEnSeance": "Non soutenu"
  },
  "dateDepot": "2017-10-24T02:00:00.000+02:00",
  "dateDistribution": "2017-11-09T01:00:00.000+01:00",
  "article99": "0",
  "loiReference": {
    "codeLoi": "impôts",
    "divisionCodeLoi": "1382"
  }
}