{
  "@xmlns": "http://schemas.assemblee-nationale.fr/referentiel",
  "uid": "AMANR5L15PO420120B0004P0D1N29",
  "identifiant": {
    "legislature": "15",
    "numero": "29",
    "numRect": "0",
    "saisine": {
      "refTexteLegislatif": "PRJLANR5L15B0004",
      "numeroPartiePLF": "0",
      "organeExamen": "PO420120",
      "mentionSecondeDeliberation": "0"
    }
  },
  "numeroLong": "AS29",
  "etapeTexte": "1ère lecture (1ère assemblée saisie)",
  "triAmendement": "baam",
  "cardinaliteAmdtMultiples": "1",
  "amendementParent": {
    "@xmlns:xsi": "http://www.w3.org/2001/XMLSchema-instance",
    "@xsi:nil": "true"
  },
  "etat": "Discuté",
  "signataires": {
    "auteur": {
      "typeAuteur": "Depute",
      "acteurRef": "PA267585",
      "organeRef": {
        "@xmlns:xsi": "http://www.w3.org/2001/XMLSchema-instance",
        "@xsi:nil": "true"
      },
      "groupePolitiqueRef": "PO730952"
    },
    "cosignataires": {
      "acteurRef": "PA267585"
    },
    "texteAffichable": "M.&#160;Vercamer"
  },
  "pointeurFragmentTexte": {
    "missionVisee": {
      "@xmlns:xsi": "http://www.w3.org/2001/XMLSchema-instance",
      "@xsi:nil": "true"
    },
    "division": {
      "titre": "Article PREMIER",
      "articleDesignationCourte": "ART. PREMIER",
      "type": "ARTICLE",
      "avant_A_Apres": "A",
      "divisionRattachee": "ARTICLE PREMIER",
      "articleAdditionnel": {
        "@xmlns:xsi": "http://www.w3.org/2001/XMLSchema-instance",
        "@xsi:nil": "true"
      },
      "chapitreAdditionnel": {
        "@xmlns:xsi": "http://www.w3.org/2001/XMLSchema-instance",
        "@xsi:nil": "true"
      },
      "urlDivisionTexteVise": "/15/textes/0004.asp#D_Article_1er"
    },
    "alinea": {
      "avant_A_Apres": {
        "@xmlns:xsi": "http://www.w3.org/2001/XMLSchema-instance",
        "@xsi:nil": "true"
      },
      "numero": "2",
      "alineaDesignation": {
        "@xmlns:xsi": "http://www.w3.org/2001/XMLSchema-instance",
        "@xsi:nil": "true"
      }
    }
  },
  "corps": {
    "dispositif": "<p style=\"text-align: justify;\">&#192; l&#8217;alin&#233;a&#160;2, apr&#232;s le mot&#160;:</p><p style=\"text-align: justify;\">&#171;&#160;professionnelle&#160;&#187;,</p><p style=\"text-align: justify;\">ins&#233;rer les mots&#160;:</p><p style=\"text-align: justify;\">&#171;&#160;tout en garantissant l&#8217;exercice d&#8217;une concurrence loyale et non fauss&#233;e entre entreprises&#160;&#187;.</p>",
    "exposeSommaire": "<p style=\"text-align: justify;\">S&#8217;il est n&#233;cessaire de mieux prendre en compte l&#8217;accord d&#8217;entreprise, de sorte &#224; ce que la r&#232;gle de droit du travail soit davantage adapt&#233;e aux sp&#233;cificit&#233;s de la relation de travail au sein de chaque entreprise, cet imp&#233;ratif ne peut avoir pour cons&#233;quence d&#8217;instaurer, entre entreprises d&#8217;un m&#234;me secteur d&#8217;activit&#233;, des situations de concurrence d&#233;loyale pr&#233;judiciables aux soci&#233;t&#233;s concern&#233;es et &#224; leurs salari&#233;s. C&#8217;est la raison pour laquelle il est n&#233;cessaire de mentionner que la place centrale reconnue &#224; l&#8217;accord d&#8217;entreprises doit garantir, en m&#234;me temps, les conditions d&#8217;exercice d&#8217;une concurrence loyale et non fauss&#233;e entre les acteurs &#233;conomiques d&#8217;un m&#234;me secteur d&#8217;activit&#233;. Ce faisant, il s&#8217;agit aussi de rappeler le r&#244;le r&#233;gulateur de l&#8217;accord de branche.</p>",
    "annexeExposeSommaire": {
      "@xmlns:xsi": "http://www.w3.org/2001/XMLSchema-instance",
      "@xsi:nil": "true"
    }
  },
  "representations": {
    "representation": {
      "nom": "PDF",
      "typeMime": {
        "type": "application",
        "subType": "PDF"
      },
      "statutRepresentation": {
        "verbatim": "true",
        "canonique": "true",
        "officielle": "true",
        "transcription": "false",
        "enregistrement": "false"
      },
      "repSource": {
        "@xmlns:xsi": "http://www.w3.org/2001/XMLSchema-instance",
        "@xsi:nil": "true"
      },
      "offset": {
        "@xmlns:xsi": "http://www.w3.org/2001/XMLSchema-instance",
        "@xsi:nil": "true"
      },
      "contenu": {
        "documentURI": "/15/amendements/0004/CION-SOC/AS29.pdf"
      },
      "dateDispoRepresentation": {
        "@xmlns:xsi": "http://www.w3.org/2001/XMLSchema-instance",
        "@xsi:nil": "true"
      }
    }
  },
  "seanceDiscussion": {
    "@xmlns:xsi": "http://www.w3.org/2001/XMLSchema-instance",
    "@xsi:nil": "true"
  },
  "sort": {
    "dateSaisie": "2017-07-05T16:46:05.000+02:00",
    "sortEnSeance": "Rejeté"
  },
  "dateDepot": "2017-07-03T02:00:00.000+02:00",
  "dateDistribution": "2017-07-04T02:00:00.000+02:00",
  "article99": "0",
  "loiReference": {
    "codeLoi": "3",
    "divisionCodeLoi": {
      "@xmlns:xsi": "http://www.w3.org/2001/XMLSchema-instance",
      "@xsi:nil": "true"
    }
  }
}