{
  "@xmlns": "http://schemas.assemblee-nationale.fr/referentiel",
  "uid": "AMANR5L15SEA717460B0269P0D1N350",
  "identifiant": {
    "legislature": "15",
    "numero": "350",
    "numRect": "0",
    "saisine": {
      "refTexteLegislatif": "PRJLANR5L15B0269",
      "numeroPartiePLF": "0",
      "organeExamen": "PO717460",
      "mentionSecondeDeliberation": "0"
    }
  },
  "numeroLong": "350",
  "etapeTexte": "1ère lecture (1ère assemblée saisie)",
  "triAmendement": "q",
  "cardinaliteAmdtMultiples": "1",
  "amendementParent": {
    "@xmlns:xsi": "http://www.w3.org/2001/XMLSchema-instance",
    "@xsi:nil": "true"
  },
  "etat": "Irrecevable",
  "signataires": {
    "auteur": {
      "typeAuteur": "Depute",
      "acteurRef": "PA608416",
      "organeRef": {
        "@xmlns:xsi": "http://www.w3.org/2001/XMLSchema-instance",
        "@xsi:nil": "true"
      },
      "groupePolitiqueRef": "PO730934"
    },
    "cosignataires": {
      "acteurRef": [
        "PA267735",
        "PA608016",
        "PA719946",
        "PA642847",
        "PA608416",
        "PA721636",
        "PA267429",
        "PA712015",
        "PA334654",
        "PA718884",
        "PA718838",
        "PA718850",
        "PA605036",
        "PA709315"
      ]
    },
    "texteAffichable": "M.&#160;Hetzel,  Mme&#160;Louwagie, M.&#160;Cinieri, M.&#160;Cordier, M.&#160;Straumann, M.&#160;Brun, M.&#160;de Ganay, Mme&#160;Bazin-Malgras, M.&#160;Abad, M.&#160;Parigi, M.&#160;Bazin, M.&#160;Viala, M.&#160;Peltier et M.&#160;Dive"
  },
  "pointeurFragmentTexte": {
    "missionVisee": {
      "@xmlns:xsi": "http://www.w3.org/2001/XMLSchema-instance",
      "@xsi:nil": "true"
    },
    "division": {
      "titre": "Article 34",
      "articleDesignationCourte": "APRÈS ART. 34",
      "type": "ARTICLE",
      "avant_A_Apres": "Après",
      "divisionRattachee": "APRÈS L'ARTICLE 34, insérer l'article suivant:",
      "articleAdditionnel": "1",
      "chapitreAdditionnel": {
        "@xmlns:xsi": "http://www.w3.org/2001/XMLSchema-instance",
        "@xsi:nil": "true"
      },
      "urlDivisionTexteVise": "/15/textes/0269.asp#D_Article_34"
    },
    "alinea": {
      "@xmlns:xsi": "http://www.w3.org/2001/XMLSchema-instance",
      "@xsi:nil": "true"
    }
  },
  "corps": {
    "dispositif": "<p style=\"text-align: justify;\">Le Gouvernement remet au Parlement, avant le 31 d&#233;cembre 2018, un rapport sur l&#8217;application, dans le cadre de la Strat&#233;gie nationale de sant&#233;, du concept des &#171;&#160;1&#160;000 premiers jours&#160;&#187; tel qu&#8217;il est d&#233;fini par l&#8217;Organisation mondiale de la Sant&#233;.</p>",
    "exposeSommaire": "<p style=\"text-align: justify;\">Les politiques de pr&#233;vention ne prennent pas suffisamment en consid&#233;ration l&#8217;enfant d&#232;s sa naissance. Un v&#233;ritable parcours de sant&#233;, de pr&#233;vention et d&#8217;&#233;ducation th&#233;rapeutique peut &#234;tre cr&#233;&#233; autour du concept des &#171;&#160;1 000 premiers jours&#160;&#187;.</p><p style=\"text-align: justify;\">L&#8217;expression &#171;&#160;1 000 premiers jours&#160;&#187; d&#233;signe la p&#233;riode qui va de la conception aux deux ans de l&#8217;enfant et les actions de pr&#233;vention et d&#8217;&#233;ducation th&#233;rapeutique qui s&#8217;y rattachent.</p><p style=\"text-align: justify;\">Ce concept a &#233;t&#233; mis en avant par l&#8217;OMS il y a quelques ann&#233;es, afin de ralentir l&#8217;augmentation des maladies chroniques, parmi lesquelles les maladies cardiovasculaires, l&#8217;ob&#233;sit&#233; et le diab&#232;te qui constituent des enjeux majeurs de sant&#233; publique.</p><p style=\"text-align: justify;\">Selon l&#8217;OMS, l&#8217;alimentation, le mode de vie et l&#8217;environnement des premi&#232;res ann&#233;es de l&#8217;enfant constituent des facteurs de risque ou de r&#233;sistance &#224; d&#233;velopper plus tard ces maladies. La d&#233;nomination de ce concept correspond aux &#171;&#160;origines d&#233;veloppementales de la sant&#233; et des maladies&#160;&#187; (DOHaD). Ce principe, ainsi que les m&#233;canismes &#233;pig&#233;n&#233;tiques sous-jacents, montre qu&#8217;il est aujourd&#8217;hui possible de corriger les chiffres des maladies chroniques et d&#8217;envisager une pr&#233;vention efficace.</p><p style=\"text-align: justify;\">Les actions, orient&#233;es &#224; moyen et long terme, doivent notamment porter sur&#160;une information et une &#233;ducation de la population g&#233;n&#233;rale, avec les moyens modernes de communication, et l&#8217;application de cette connaissance et de cette approche au sein des structures de sant&#233; consacr&#233;es &#224; la grossesse et la naissance, incluant un programme de formation sp&#233;cifique des professionnels.</p><p style=\"text-align: justify;\">Les grandes organisations internationales se saisissent de ce concept autour des &#171;&#160;1 000 jours&#160;&#187;.&#160;L&#8217;OMS a publi&#233; en 2014 un rapport intitul&#233; &#171;&#160;Plan d&#8217;application exhaustif concernant la nutrition chez la m&#232;re, le nourrisson et le jeune enfant&#160;&#187;. L&#8217;UNICEF dans son rapport &#171;&#160;Am&#233;liorer la nutrition de l&#8217;enfant, un objectif imp&#233;ratif et r&#233;alisable pour le progr&#232;s mondial&#160;&#187;, publi&#233; en 2013, affirme &#233;galement l&#8217;importance de ce concept.</p><p style=\"text-align: justify;\">Les acteurs de sant&#233;, dont les &#233;tablissements de sant&#233;, sont pleinement concern&#233;s par ces actions de pr&#233;vention qui peuvent &#234;tre incorpor&#233;es au parcours de l&#8217;enfant mais aussi de sa famille. C&#8217;est pour cela qu&#8217;il est demand&#233; un rapport sur le sujet.</p>",
    "annexeExposeSommaire": {
      "@xmlns:xsi": "http://www.w3.org/2001/XMLSchema-instance",
      "@xsi:nil": "true"
    }
  },
  "representations": {
    "representation": {
      "nom": "PDF",
      "typeMime": {
        "type": "application",
        "subType": "PDF"
      },
      "statutRepresentation": {
        "verbatim": "true",
        "canonique": "true",
        "officielle": "true",
        "transcription": "false",
        "enregistrement": "false"
      },
      "repSource": {
        "@xmlns:xsi": "http://www.w3.org/2001/XMLSchema-instance",
        "@xsi:nil": "true"
      },
      "offset": {
        "@xmlns:xsi": "http://www.w3.org/2001/XMLSchema-instance",
        "@xsi:nil": "true"
      },
      "contenu": {
        "documentURI": "/15/amendements/0269/AN/350.pdf"
      },
      "dateDispoRepresentation": {
        "@xmlns:xsi": "http://www.w3.org/2001/XMLSchema-instance",
        "@xsi:nil": "true"
      }
    }
  },
  "seanceDiscussion": {
    "@xmlns:xsi": "http://www.w3.org/2001/XMLSchema-instance",
    "@xsi:nil": "true"
  },
  "sort": {
    "@xmlns:xsi": "http://www.w3.org/2001/XMLSchema-instance",
    "@xsi:nil": "true"
  },
  "dateDepot": "2017-10-19T02:00:00.000+02:00",
  "dateDistribution": {
    "@xmlns:xsi": "http://www.w3.org/2001/XMLSchema-instance",
    "@xsi:nil": "true"
  },
  "article99": "0",
  "loiReference": {
    "codeLoi": {
      "@xmlns:xsi": "http://www.w3.org/2001/XMLSchema-instance",
      "@xsi:nil": "true"
    },
    "divisionCodeLoi": {
      "@xmlns:xsi": "http://www.w3.org/2001/XMLSchema-instance",
      "@xsi:nil": "true"
    }
  }
}