{
  "@xmlns": "http://schemas.assemblee-nationale.fr/referentiel",
  "uid": "AMANR5L15SEA717460BTC1761P0D1N498",
  "identifiant": {
    "legislature": "15",
    "numero": "498",
    "numRect": "0",
    "saisine": {
      "refTexteLegislatif": "PRJLANR5L15BTC1761",
      "numeroPartiePLF": "0",
      "organeExamen": "PO717460",
      "mentionSecondeDeliberation": "0"
    }
  },
  "numeroLong": "498",
  "etapeTexte": "Nouvelle Lecture",
  "triAmendement": "aaeaaaaaaaaaaaaaaaaaaaaaaaaaaaaaaaaaaaaaaaaaaaaaaaslk",
  "cardinaliteAmdtMultiples": "1",
  "amendementParent": {
    "@xmlns:xsi": "http://www.w3.org/2001/XMLSchema-instance",
    "@xsi:nil": "true"
  },
  "etat": "Discuté",
  "signataires": {
    "auteur": {
      "typeAuteur": "Depute",
      "acteurRef": "PA709315",
      "organeRef": {
        "@xmlns:xsi": "http://www.w3.org/2001/XMLSchema-instance",
        "@xsi:nil": "true"
      },
      "groupePolitiqueRef": "PO730934"
    },
    "cosignataires": {
      "acteurRef": [
        "PA721506",
        "PA267735",
        "PA267429",
        "PA709315",
        "PA720644",
        "PA346218",
        "PA718780",
        "PA718784",
        "PA643103",
        "PA334149",
        "PA718850",
        "PA606712",
        "PA718838",
        "PA330909",
        "PA720684",
        "PA721410",
        "PA267527",
        "PA1874",
        "PA718884",
        "PA719318"
      ]
    },
    "texteAffichable": "M.&#160;Viala,  M.&#160;Cordier, M.&#160;Cinieri, Mme&#160;Kuster, M.&#160;Masson, M.&#160;Nury, Mme&#160;Bazin-Malgras, Mme&#160;Anthoine, M.&#160;Pauget, Mme&#160;Bonnivard, M.&#160;Pierre-Henri&#160;Dumont, Mme&#160;Trastour-Isnart, M.&#160;Brun, M.&#160;Le Fur, M.&#160;Lurton, M.&#160;Descoeur, M.&#160;Saddier, M.&#160;Ferrara, M.&#160;Fasquelle et M.&#160;de Ganay"
  },
  "pointeurFragmentTexte": {
    "missionVisee": {
      "@xmlns:xsi": "http://www.w3.org/2001/XMLSchema-instance",
      "@xsi:nil": "true"
    },
    "division": {
      "titre": "Article PREMIER",
      "articleDesignationCourte": "ART. PREMIER",
      "type": "ARTICLE",
      "avant_A_Apres": "A",
      "divisionRattachee": "ARTICLE PREMIER",
      "articleAdditionnel": {
        "@xmlns:xsi": "http://www.w3.org/2001/XMLSchema-instance",
        "@xsi:nil": "true"
      },
      "chapitreAdditionnel": {
        "@xmlns:xsi": "http://www.w3.org/2001/XMLSchema-instance",
        "@xsi:nil": "true"
      },
      "urlDivisionTexteVise": "/15/textes/1761.asp#D_Article_1er"
    },
    "alinea": {
      "avant_A_Apres": {
        "@xmlns:xsi": "http://www.w3.org/2001/XMLSchema-instance",
        "@xsi:nil": "true"
      },
      "numero": "19",
      "alineaDesignation": {
        "@xmlns:xsi": "http://www.w3.org/2001/XMLSchema-instance",
        "@xsi:nil": "true"
      }
    }
  },
  "corps": {
    "dispositif": "<p style=\"text-align: justify;\">I.&#160;&#8211;&#160;&#192; la premi&#232;re phrase de l&#8217;alin&#233;a&#160;19, supprimer les mots&#160;:</p><p style=\"text-align: justify;\">&#171;&#160;d&#8217;&#206;le-de-France&#160;&#187;.</p><p style=\"text-align: justify;\">II.&#160;&#8211;&#160;En cons&#233;quence, proc&#233;der &#224; la m&#234;me suppression &#224; la deuxi&#232;me phrase du m&#234;me alin&#233;a.</p>",
    "exposeSommaire": "<p style=\"text-align: justify;\">Si l&#8217;on veut assurer une diffusion &#233;quitable d&#8217;une meilleure dynamique &#233;conomique sur tout le territoire national, il n&#8217;y a aucune raison de traiter diff&#233;remment les chambres de commerce et d&#8217;industrie des diff&#233;rents territoires. Partout en France, elles doivent pouvoir assurer avec efficacit&#233; leurs missions d&#8217;appui, d&#8217;accompagnement et de conseil aupr&#232;s des personnes physiques et morales exer&#231;ant des activit&#233;s se trouvant dans leurs champs de comp&#233;tence et doivent donc pouvoir disposer des &#233;l&#233;ments les concernant.</p>",
    "annexeExposeSommaire": {
      "@xmlns:xsi": "http://www.w3.org/2001/XMLSchema-instance",
      "@xsi:nil": "true"
    },
    "cartoucheDelaiDepotDepasse": {
      "@xmlns:xsi": "http://www.w3.org/2001/XMLSchema-instance",
      "@xsi:nil": "true"
    }
  },
  "representations": {
    "representation": {
      "nom": "PDF",
      "typeMime": {
        "type": "application",
        "subType": "PDF"
      },
      "statutRepresentation": {
        "verbatim": "true",
        "canonique": "true",
        "officielle": "true",
        "transcription": "false",
        "enregistrement": "false"
      },
      "repSource": {
        "@xmlns:xsi": "http://www.w3.org/2001/XMLSchema-instance",
        "@xsi:nil": "true"
      },
      "offset": {
        "@xmlns:xsi": "http://www.w3.org/2001/XMLSchema-instance",
        "@xsi:nil": "true"
      },
      "contenu": {
        "documentURI": "/15/amendements/1761/AN/498.pdf"
      },
      "dateDispoRepresentation": {
        "@xmlns:xsi": "http://www.w3.org/2001/XMLSchema-instance",
        "@xsi:nil": "true"
      }
    }
  },
  "seanceDiscussion": "RUANR5L15S2019IDS21546",
  "sort": {
    "dateSaisie": "2019-03-14T00:21:45.000+01:00",
    "sortEnSeance": "Rejeté"
  },
  "dateDepot": "2019-03-11T01:00:00.000+01:00",
  "dateDistribution": "2019-03-12T01:00:00.000+01:00",
  "article99": "0",
  "loiReference": {
    "codeLoi": {
      "@xmlns:xsi": "http://www.w3.org/2001/XMLSchema-instance",
      "@xsi:nil": "true"
    },
    "divisionCodeLoi": {
      "@xmlns:xsi": "http://www.w3.org/2001/XMLSchema-instance",
      "@xsi:nil": "true"
    }
  }
}