{
  "@xmlns": "http://schemas.assemblee-nationale.fr/referentiel",
  "uid": "AMANR5L15SEA717460B0911P0D1N2216",
  "identifiant": {
    "legislature": "15",
    "numero": "2216",
    "numRect": "0",
    "saisine": {
      "refTexteLegislatif": "PRJLANR5L15B0911",
      "numeroPartiePLF": "0",
      "organeExamen": "PO717460",
      "mentionSecondeDeliberation": "0"
    }
  },
  "numeroLong": "2216",
  "etapeTexte": "1ère lecture (1ère assemblée saisie)",
  "triAmendement": "abzzhzzvs",
  "cardinaliteAmdtMultiples": "1",
  "amendementParent": {
    "@xmlns:xsi": "http://www.w3.org/2001/XMLSchema-instance",
    "@xsi:nil": "true"
  },
  "etat": "Discuté",
  "signataires": {
    "auteur": {
      "typeAuteur": "Depute",
      "acteurRef": "PA721202",
      "organeRef": {
        "@xmlns:xsi": "http://www.w3.org/2001/XMLSchema-instance",
        "@xsi:nil": "true"
      },
      "groupePolitiqueRef": "PO730958"
    },
    "cosignataires": {
      "acteurRef": [
        "PA2150",
        "PA721062",
        "PA718860",
        "PA721210",
        "PA721202",
        "PA720422",
        "PA720286",
        "PA720892",
        "PA718868",
        "PA721226",
        "PA719676",
        "PA588884",
        "PA722142",
        "PA720430",
        "PA720846",
        "PA719578",
        "PA721960"
      ]
    },
    "texteAffichable": "M.&#160;Coquerel,  Mme&#160;Autain, M.&#160;Bernalicis, M.&#160;Corbi&#232;re, Mme&#160;Fiat, M.&#160;Lachaud, M.&#160;Larive, M.&#160;M&#233;lenchon, Mme&#160;Obono, Mme&#160;Panot, M.&#160;Prud&apos;homme, M.&#160;Quatennens, M.&#160;Ratenon, Mme&#160;Ressiguier, Mme&#160;Rubin, M.&#160;Ruffin et Mme&#160;Taurine"
  },
  "pointeurFragmentTexte": {
    "missionVisee": {
      "@xmlns:xsi": "http://www.w3.org/2001/XMLSchema-instance",
      "@xsi:nil": "true"
    },
    "division": {
      "titre": "Article PREMIER",
      "articleDesignationCourte": "AVANT ART. PREMIER",
      "type": "ARTICLE",
      "avant_A_Apres": "Avant",
      "divisionRattachee": "AVANT L'ARTICLE PREMIER, insérer l'article suivant:",
      "articleAdditionnel": "1",
      "chapitreAdditionnel": {
        "@xmlns:xsi": "http://www.w3.org/2001/XMLSchema-instance",
        "@xsi:nil": "true"
      },
      "urlDivisionTexteVise": "/15/textes/0911.asp#D_Article_1er"
    },
    "alinea": {
      "@xmlns:xsi": "http://www.w3.org/2001/XMLSchema-instance",
      "@xsi:nil": "true"
    }
  },
  "corps": {
    "dispositif": "<p style=\"text-align: justify;\">Apr&#232;s la premi&#232;re phrase du premier alin&#233;a de l&#8217;article&#160;1<sup>er</sup> de la Constitution, est ins&#233;r&#233;e une phrase ainsi r&#233;dig&#233;e&#160;:&#160;&#171;&#160;Elle garantit, dans le cadre de la d&#233;mocratie sociale, la s&#233;curit&#233; sociale pour tous.&#160;&#187;</p>",
    "exposeSommaire": "<p style=\"line-height: 1.2; text-align: justify;\">Par cet amendement, nous proposons de consacrer la S&#233;curit&#233; sociale ainsi que la d&#233;mocratie sociale qui l&#8217;a historiquement fond&#233;e et la d&#233;termine.</p><p style=\"line-height: 1.2; text-align: justify;\">Depuis quelques d&#233;cennies la S&#233;curit&#233; sociale, ce joyau dont nous avons h&#233;rit&#233; de l&#8217;apr&#232;s-guerre, est mise &#224; rude &#233;preuve. Arrach&#233;e au fil des ans des organisations syndicales pour &#234;tre inf&#233;od&#233;e &#224; l'Etat, d&#233;natur&#233;e progressivement par le glissement des cotisations sociales vers l'imp&#244;t, nombreux sont les lib&#233;raux qui esp&#232;rent lui donner un coup fatal.</p><p style=\"line-height: 1.2; text-align: justify;\">Lors du dernier PLFSS 2017, 4,2 milliards d&#8217;euros ont &#233;t&#233; amput&#233;s de la S&#233;curit&#233; sociale.</p><p style=\"line-height: 1.2; text-align: justify;\">Dernier coup de semonce en date, l'amendement d'Olivier V&#233;ran qui entendait supprimer de la Constitution toute r&#233;f&#233;rence &#224; la &#171; S&#233;curit&#233; sociale &#187; pour lui pr&#233;f&#233;rer l'expression floue de &#171; protection sociale &#187;, amendement finalement retir&#233;.</p><p style=\"line-height: 1.2; text-align: justify;\">Nous ne souhaitons pas diluer la S&#233;curit&#233; sociale dans un ensemble de syst&#232;me incluant organismes mutualistes et priv&#233;s. Pas plus que nous ne souhaitons passer d'une philosophie selon laquelle &#171; chacun cotise selon ses moyens et re&#231;oit selon ses besoins &#187; &#224; la logique aust&#233;ritaire et plus in&#233;galitaire de la &#171; protection sociale &#187;. A la veille d'une r&#233;forme des pensions et des retraites, il convient de r&#233;affirmer notre attachement &#224; la S&#233;curit&#233; sociale.</p><p style=\"line-height: 1.2; text-align: justify;\">Notre amendement vise &#224; consacrer dans la Constitution d&#232;s son premier paragraphe la place fondamentale qu'occupe la S&#233;curit&#233; sociale dans notre R&#233;publique. Il s'adresse &#224; tous les parlementaires qui souhaitent marteler haut et fort l'attachement des fran&#231;ais &#224; la S&#233;curit&#233; sociale, sa philosophie et son fonctionnement originels.</p>",
    "annexeExposeSommaire": {
      "@xmlns:xsi": "http://www.w3.org/2001/XMLSchema-instance",
      "@xsi:nil": "true"
    }
  },
  "representations": {
    "representation": {
      "nom": "PDF",
      "typeMime": {
        "type": "application",
        "subType": "PDF"
      },
      "statutRepresentation": {
        "verbatim": "true",
        "canonique": "true",
        "officielle": "true",
        "transcription": "false",
        "enregistrement": "false"
      },
      "repSource": {
        "@xmlns:xsi": "http://www.w3.org/2001/XMLSchema-instance",
        "@xsi:nil": "true"
      },
      "offset": {
        "@xmlns:xsi": "http://www.w3.org/2001/XMLSchema-instance",
        "@xsi:nil": "true"
      },
      "contenu": {
        "documentURI": "/15/amendements/0911/AN/2216.pdf"
      },
      "dateDispoRepresentation": {
        "@xmlns:xsi": "http://www.w3.org/2001/XMLSchema-instance",
        "@xsi:nil": "true"
      }
    }
  },
  "seanceDiscussion": "RUANR5L15S2018IDS21163",
  "sort": {
    "dateSaisie": "2018-07-12T15:36:52.000+02:00",
    "sortEnSeance": "Rejeté"
  },
  "dateDepot": "2018-07-06T02:00:00.000+02:00",
  "dateDistribution": "2018-07-08T02:00:00.000+02:00",
  "article99": "0",
  "loiReference": {
    "codeLoi": "Constitution",
    "divisionCodeLoi": "1"
  }
}