{
  "@xmlns": "http://schemas.assemblee-nationale.fr/referentiel",
  "uid": "AMANR5L15SEA717460BTC1974P0D1N2681",
  "identifiant": {
    "legislature": "15",
    "numero": "2681",
    "numRect": "0",
    "saisine": {
      "refTexteLegislatif": "PRJLANR5L15BTC1974",
      "numeroPartiePLF": "0",
      "organeExamen": "PO717460",
      "mentionSecondeDeliberation": "0"
    }
  },
  "numeroLong": "2681",
  "etapeTexte": "1ère lecture (2ème assemblée saisie)",
  "triAmendement": "bbkaaaaaaaaaaaaaaaaaaaaaaaaaaaaaaaaaaaaaaaaaaaaaaapke",
  "cardinaliteAmdtMultiples": "1",
  "amendementParent": {
    "@xmlns:xsi": "http://www.w3.org/2001/XMLSchema-instance",
    "@xsi:nil": "true"
  },
  "etat": "Discuté",
  "signataires": {
    "auteur": {
      "typeAuteur": "Depute",
      "acteurRef": "PA722236",
      "organeRef": {
        "@xmlns:xsi": "http://www.w3.org/2001/XMLSchema-instance",
        "@xsi:nil": "true"
      },
      "groupePolitiqueRef": "PO730964"
    },
    "cosignataires": {
      "acteurRef": "PA722236"
    },
    "texteAffichable": "M.&#160;Djebbari"
  },
  "pointeurFragmentTexte": {
    "missionVisee": {
      "@xmlns:xsi": "http://www.w3.org/2001/XMLSchema-instance",
      "@xsi:nil": "true"
    },
    "division": {
      "titre": "Article 11",
      "articleDesignationCourte": "ART. 11",
      "type": "ARTICLE",
      "avant_A_Apres": "A",
      "divisionRattachee": "ARTICLE 11",
      "articleAdditionnel": {
        "@xmlns:xsi": "http://www.w3.org/2001/XMLSchema-instance",
        "@xsi:nil": "true"
      },
      "chapitreAdditionnel": {
        "@xmlns:xsi": "http://www.w3.org/2001/XMLSchema-instance",
        "@xsi:nil": "true"
      },
      "urlDivisionTexteVise": "/15/textes/1974.asp#D_Article_11"
    },
    "alinea": {
      "avant_A_Apres": {
        "@xmlns:xsi": "http://www.w3.org/2001/XMLSchema-instance",
        "@xsi:nil": "true"
      },
      "numero": "11",
      "alineaDesignation": {
        "@xmlns:xsi": "http://www.w3.org/2001/XMLSchema-instance",
        "@xsi:nil": "true"
      }
    }
  },
  "corps": {
    "dispositif": "<p>&#192; l&#8217;alin&#233;a&#160;11, apr&#232;s le mot&#160;:</p><p style=\"text-align: justify;\">&#171;&#160;organise&#160;&#187;,</p><p style=\"text-align: justify;\">ins&#233;rer le mot&#160;:</p><p style=\"text-align: justify;\">&#171;&#160;,&#160;encadre&#160;&#187;.</p>",
    "exposeSommaire": "<p>Cet amendement vise &#224; clarifier la nature des services de mobilit&#233; et de stationnement qui pourront demain &#234;tre d&#233;livr&#233;s par un fournisseur de service num&#233;rique multimodal. La modification apport&#233;e permet d&#8217;ajouter clairement l&#8217;ensemble des services qui font aujourd&#8217;hui l&#8217;objet d&#8217;une convention d&#8217;occupation du domaine public et qui sont encadr&#233;s par les autorit&#233;s organisatrices de la mobilit&#233; ou les collectivit&#233;s territoriales. Les services num&#233;riques multimodaux doivent pouvoir d&#233;livrer l&#8217;ensemble des services en free-floating, d&#8217;auto-partage ou encore de v&#233;los en libre-service. D&#8217;autre part, cet amendement vise &#233;galement &#224; inclure les services ferroviaires r&#233;gionaux (TER). Cette inclusion est un pr&#233;requis indispensable &#224; la r&#233;ussite de l&#8217;ouverture &#224; la concurrence du march&#233; ferroviaire r&#233;gional et &#224; l&#8217;accroissement de la fr&#233;quentation de ce mode responsable d&#8217;un point de vue environnemental. &#160;</p><p style=\"text-align: justify;\">Cet amendement vise donc &#224; une clarification r&#233;dactionnelle et &#224; une mise en coh&#233;rence du texte&#160;: l&#8217;ouverture des canaux de vente doit concerner l&#8217;ensemble des acteurs d&#232;s lors qu&#8217;ils organisent ou exploitent des services de mobilit&#233; sur le territoire que couvre le fournisseur du service num&#233;rique multimodal.</p>",
    "annexeExposeSommaire": {
      "@xmlns:xsi": "http://www.w3.org/2001/XMLSchema-instance",
      "@xsi:nil": "true"
    },
    "cartoucheDelaiDepotDepasse": {
      "@xmlns:xsi": "http://www.w3.org/2001/XMLSchema-instance",
      "@xsi:nil": "true"
    }
  },
  "representations": {
    "representation": {
      "nom": "PDF",
      "typeMime": {
        "type": "application",
        "subType": "PDF"
      },
      "statutRepresentation": {
        "verbatim": "true",
        "canonique": "true",
        "officielle": "true",
        "transcription": "false",
        "enregistrement": "false"
      },
      "repSource": {
        "@xmlns:xsi": "http://www.w3.org/2001/XMLSchema-instance",
        "@xsi:nil": "true"
      },
      "offset": {
        "@xmlns:xsi": "http://www.w3.org/2001/XMLSchema-instance",
        "@xsi:nil": "true"
      },
      "contenu": {
        "documentURI": "/15/amendements/1974/AN/2681.pdf"
      },
      "dateDispoRepresentation": {
        "@xmlns:xsi": "http://www.w3.org/2001/XMLSchema-instance",
        "@xsi:nil": "true"
      }
    }
  },
  "seanceDiscussion": "RUANR5L15S2019IDS21680",
  "sort": {
    "dateSaisie": "2019-06-06T16:04:41.000+02:00",
    "sortEnSeance": "Retiré"
  },
  "dateDepot": "2019-05-29T02:00:00.000+02:00",
  "dateDistribution": "2019-06-03T02:00:00.000+02:00",
  "article99": "0",
  "loiReference": {
    "codeLoi": {
      "@xmlns:xsi": "http://www.w3.org/2001/XMLSchema-instance",
      "@xsi:nil": "true"
    },
    "divisionCodeLoi": {
      "@xmlns:xsi": "http://www.w3.org/2001/XMLSchema-instance",
      "@xsi:nil": "true"
    }
  }
}