{
  "@xmlns": "http://schemas.assemblee-nationale.fr/referentiel",
  "uid": "AMANR5L15SEA717460BTC1974P0D1N1701",
  "identifiant": {
    "legislature": "15",
    "numero": "1701",
    "numRect": "0",
    "saisine": {
      "refTexteLegislatif": "PRJLANR5L15BTC1974",
      "numeroPartiePLF": "0",
      "organeExamen": "PO717460",
      "mentionSecondeDeliberation": "0"
    }
  },
  "numeroLong": "1701",
  "etapeTexte": "1ère lecture (2ème assemblée saisie)",
  "triAmendement": "hiaaaoaaaaaaaaaaaaaaaaaaaaaaaaaaaaaaaaaaaaaaaaaaaahzzvy",
  "cardinaliteAmdtMultiples": "1",
  "amendementParent": {
    "@xmlns:xsi": "http://www.w3.org/2001/XMLSchema-instance",
    "@xsi:nil": "true"
  },
  "etat": "Discuté",
  "signataires": {
    "auteur": {
      "typeAuteur": "Depute",
      "acteurRef": "PA722390",
      "organeRef": {
        "@xmlns:xsi": "http://www.w3.org/2001/XMLSchema-instance",
        "@xsi:nil": "true"
      },
      "groupePolitiqueRef": "PO730934"
    },
    "cosignataires": {
      "acteurRef": [
        "PA722390",
        "PA718784",
        "PA266808",
        "PA643134",
        "PA712015"
      ]
    },
    "texteAffichable": "Mme&#160;Corneloup,  M.&#160;Pauget, M.&#160;Dive, Mme&#160;Valentin et M.&#160;Rolland"
  },
  "pointeurFragmentTexte": {
    "missionVisee": {
      "@xmlns:xsi": "http://www.w3.org/2001/XMLSchema-instance",
      "@xsi:nil": "true"
    },
    "division": {
      "titre": "RAPPORT ANNEXÉ",
      "articleDesignationCourte": "ART. 1ER A",
      "type": "ANNEXE",
      "avant_A_Apres": "A",
      "divisionRattachee": "ARTICLE 1ER A",
      "articleAdditionnel": {
        "@xmlns:xsi": "http://www.w3.org/2001/XMLSchema-instance",
        "@xsi:nil": "true"
      },
      "chapitreAdditionnel": {
        "@xmlns:xsi": "http://www.w3.org/2001/XMLSchema-instance",
        "@xsi:nil": "true"
      },
      "urlDivisionTexteVise": "/15/textes/1974.asp#D_RAPPORT_ANNEXE"
    },
    "alinea": {
      "avant_A_Apres": "A",
      "numero": "5",
      "alineaDesignation": "Alinéa 5"
    }
  },
  "corps": {
    "dispositif": "<p style=\"text-align: justify;\">&#192; la deuxi&#232;me phrase de l&#8217;alin&#233;a&#160;5, substituer au taux&#160;:</p><p style=\"text-align: justify;\">&#171;&#160;40&#160;%&#160;&#187;</p><p style=\"text-align: justify;\">les mots&#160;:</p><p style=\"text-align: justify;\">&#171;&#160;60&#160;% minimum&#160;&#187;.</p>",
    "exposeSommaire": "<p style=\"text-align: justify;\">Un consensus s&#8217;&#233;tait d&#233;gag&#233; au sein du COI autour du sc&#233;nario 2. Sur la p&#233;riode 2019&#160;&#8211;&#160;2023, entre le scenario 2 (15 milliards d&#8217;euros) et la trajectoire financi&#232;re retenue jusqu&#8217;&#224; pr&#233;sent (13,7 milliards d&#8217;euros), la diff&#233;rence s&#8217;&#233;l&#232;ve &#224; 1,3 milliards d&#8217;euros sur le budget de l&#8217;AFITF pour la p&#233;riode 2019&#160;&#8211;&#160;2023. En tenant compte du sc&#233;nario 3 (17,8 milliards d&#8217;euros), la diff&#233;rence avec la trajectoire actuelle est de 4,1 milliards d&#8217;euros sur l&#8217;ensemble du quinquennat.</p><p style=\"text-align: justify;\">La crise des &#171;&#160;gilets jaunes&#160;&#187; donne un &#233;clairage nouveau &#224; ce projet de loi, d&#233;sormais pr&#233;sent&#233; comme un &#233;l&#233;ment de r&#233;ponse.&#160; Il convient donc de privil&#233;gier le sc&#233;nario le plus ambitieux pour r&#233;pondre rapidement &#224; l&#8217;ensemble des besoins identifi&#233;s dans les territoires.</p><p style=\"text-align: justify;\">En retenant le sc&#233;nario 3, a minima le sc&#233;nario 2, le pourcentage d&#8217;augmentation de l&#8217;enveloppe consacr&#233;e au financement des infrastructures de transports est de 60&#160;% minimum par rapport au pr&#233;c&#233;dent quinquennat.</p>",
    "annexeExposeSommaire": {
      "@xmlns:xsi": "http://www.w3.org/2001/XMLSchema-instance",
      "@xsi:nil": "true"
    },
    "cartoucheDelaiDepotDepasse": {
      "@xmlns:xsi": "http://www.w3.org/2001/XMLSchema-instance",
      "@xsi:nil": "true"
    }
  },
  "representations": {
    "representation": {
      "nom": "PDF",
      "typeMime": {
        "type": "application",
        "subType": "PDF"
      },
      "statutRepresentation": {
        "verbatim": "true",
        "canonique": "true",
        "officielle": "true",
        "transcription": "false",
        "enregistrement": "false"
      },
      "repSource": {
        "@xmlns:xsi": "http://www.w3.org/2001/XMLSchema-instance",
        "@xsi:nil": "true"
      },
      "offset": {
        "@xmlns:xsi": "http://www.w3.org/2001/XMLSchema-instance",
        "@xsi:nil": "true"
      },
      "contenu": {
        "documentURI": "/15/amendements/1974/AN/1701.pdf"
      },
      "dateDispoRepresentation": {
        "@xmlns:xsi": "http://www.w3.org/2001/XMLSchema-instance",
        "@xsi:nil": "true"
      }
    }
  },
  "seanceDiscussion": "RUANR5L15S2019IDS21699",
  "sort": {
    "dateSaisie": "2019-06-13T16:29:39.000+02:00",
    "sortEnSeance": "Non soutenu"
  },
  "dateDepot": "2019-05-29T02:00:00.000+02:00",
  "dateDistribution": "2019-06-05T02:00:00.000+02:00",
  "article99": "0",
  "loiReference": {
    "codeLoi": {
      "@xmlns:xsi": "http://www.w3.org/2001/XMLSchema-instance",
      "@xsi:nil": "true"
    },
    "divisionCodeLoi": {
      "@xmlns:xsi": "http://www.w3.org/2001/XMLSchema-instance",
      "@xsi:nil": "true"
    }
  }
}