{
  "@xmlns": "http://schemas.assemblee-nationale.fr/referentiel",
  "uid": "AMANR5L15SEA717460B1297P0D1N1145",
  "identifiant": {
    "legislature": "15",
    "numero": "1145",
    "numRect": "0",
    "saisine": {
      "refTexteLegislatif": "PRJLANR5L15B1297",
      "numeroPartiePLF": "0",
      "organeExamen": "PO717460",
      "mentionSecondeDeliberation": "0"
    }
  },
  "numeroLong": "1145",
  "etapeTexte": "1ère lecture (1ère assemblée saisie)",
  "triAmendement": "jjaaaaaaaaaaaaaaaaaaaaaaaaaaaaaaaaaaaaaaaaaaaaaaaay",
  "cardinaliteAmdtMultiples": "1",
  "amendementParent": {
    "@xmlns:xsi": "http://www.w3.org/2001/XMLSchema-instance",
    "@xsi:nil": "true"
  },
  "etat": "Irrecevable",
  "signataires": {
    "auteur": {
      "typeAuteur": "Depute",
      "acteurRef": "PA609590",
      "organeRef": {
        "@xmlns:xsi": "http://www.w3.org/2001/XMLSchema-instance",
        "@xsi:nil": "true"
      },
      "groupePolitiqueRef": "PO758835"
    },
    "cosignataires": {
      "acteurRef": [
        "PA337483",
        "PA1008",
        "PA607553",
        "PA608172",
        "PA719930",
        "PA720988",
        "PA335532",
        "PA429893",
        "PA1809",
        "PA342415",
        "PA609590",
        "PA608741",
        "PA333818",
        "PA643145",
        "PA605069",
        "PA1592",
        "PA642764",
        "PA608011",
        "PA340343",
        "PA609332",
        "PA333285",
        "PA610681",
        "PA332614",
        "PA340357",
        "PA267233",
        "PA335054",
        "PA1198",
        "PA608695",
        "PA508"
      ]
    },
    "texteAffichable": "Mme&#160;Rabault,  M.&#160;Aviragnet, Mme&#160;Bareigts, Mme&#160;Bi&#233;mouret, Mme&#160;Vainqueur-Christophe, M.&#160;Vallaud, Mme&#160;Battistel, M.&#160;Bouillon, M.&#160;Jean-Louis&#160;Bricout, M.&#160;Carvounas, M.&#160;Alain&#160;David, Mme&#160;Laurence&#160;Dumont, M.&#160;Faure, M.&#160;Garot, M.&#160;David&#160;Habib, M.&#160;Hutin, M.&#160;Juanico, Mme&#160;Karamanli, M.&#160;J&#233;r&#244;me&#160;Lambert, M.&#160;Letchimy, Mme&#160;Manin, Mme&#160;Pau-Langevin, Mme&#160;Pires Beaune, M.&#160;Potier, M.&#160;Pueyo, M.&#160;Saulignac, Mme&#160;Tolmont, Mme&#160;Untermaier et Mme&#160;Victory"
  },
  "pointeurFragmentTexte": {
    "missionVisee": {
      "@xmlns:xsi": "http://www.w3.org/2001/XMLSchema-instance",
      "@xsi:nil": "true"
    },
    "division": {
      "titre": "Article 41",
      "articleDesignationCourte": "APRÈS ART. 41",
      "type": "ARTICLE",
      "avant_A_Apres": "Après",
      "divisionRattachee": "APRÈS L'ARTICLE 41, insérer l'article suivant:",
      "articleAdditionnel": "1",
      "chapitreAdditionnel": {
        "@xmlns:xsi": "http://www.w3.org/2001/XMLSchema-instance",
        "@xsi:nil": "true"
      },
      "urlDivisionTexteVise": "/15/textes/1297.asp#D_Article_41"
    },
    "alinea": {
      "@xmlns:xsi": "http://www.w3.org/2001/XMLSchema-instance",
      "@xsi:nil": "true"
    }
  },
  "corps": {
    "dispositif": "<p style=\"text-align: justify;\">Dans un d&#233;lai de six mois &#224; compter de la promulgation de la pr&#233;sente loi, le Gouvernement remet au Parlement un rapport sur l&#8217;&#233;volution du p&#233;rim&#232;tre des aides techniques prises en compte au titre de la prestation de compensation de handicap.</p>",
    "exposeSommaire": "<p style=\"text-align: justify;\">Cet amendement vise &#224; engager un d&#233;bat sur la n&#233;cessit&#233; de faire &#233;voluer le p&#233;rim&#232;tre des aides techniques prises en charge par la prestation de compensation du handicap (PCH).</p><p style=\"text-align: justify;\">En effet, certaines personnes ayant de r&#233;els besoins ne rentrent pas dans le p&#233;rim&#232;tre d&#233;fini par l&#8217;arr&#234;t&#233; du 28 d&#233;cembre 2005 fixant les tarifs des &#233;l&#233;ments de la prestation de compensation et ne sont donc pas &#233;ligibles au remboursement de leur mat&#233;riel technique au titre de la PCH.</p><p style=\"text-align: justify;\">C&#8217;est par exemple le cas des proth&#232;ses auditives osth&#233;o-int&#233;gr&#233;es, qui contrairement aux proth&#232;ses auditives externes, ne sont pas &#233;ligibles &#224; un remboursement au titre de la PCH.</p><p style=\"text-align: justify;\">Les proth&#232;ses auditives ost&#233;o-int&#233;gr&#233;es sont des proth&#232;ses qui permettent de lutter contre la surdit&#233; de transmission et non de perception. Pour cela elles sont directement ancr&#233;es sur le cr&#226;ne car au lieu de transmettre les sons par voie a&#233;rienne comme les appareils traditionnels, ce syst&#232;me transmet les sons par l&#8217;interm&#233;diaire de l&#8217;implant &#224; l&#8217;os temporal puis par voie osseuse &#224; l&#8217;oreille interne.</p><p style=\"text-align: justify;\">Elles sont par exemple utilis&#233;es dans le cas de maladies rares comme le syndrome de Franceschetti (une quinzaine d&#8217;enfants naissent chaque ann&#233;e victimes de ce syndrome en France) qui se traduit notamment par l&#8217;absence de conduit auditif. Seul ce syst&#232;me plac&#233; sur un implant plac&#233; dans l&#8217;os derri&#232;re l&#8217;oreille est envisageable pour ce type de malformation. Ces proth&#232;ses sont donc indispensables pour le patient.</p><p style=\"text-align: justify;\">Ces mat&#233;riels tr&#232;s sp&#233;cifiques ont cependant un co&#251;t &#233;lev&#233;, qui d&#233;passe bien souvent le montant du remboursement forfaitaire pris en charge par la s&#233;curit&#233; sociale, et peuvent conduire &#224; un reste &#224; charge &#233;lev&#233; pour les personnes en situation de handicap si le mat&#233;riel en question est exclu de la liste des aides techniques prises en charge au titre de la PCH.</p><p style=\"text-align: justify;\">Le pr&#233;sent amendement propose donc au Gouvernement de remettre un rapport pour poser les bases d&#8217;une r&#233;flexion sur ce sujet.</p>",
    "annexeExposeSommaire": {
      "@xmlns:xsi": "http://www.w3.org/2001/XMLSchema-instance",
      "@xsi:nil": "true"
    }
  },
  "representations": {
    "representation": {
      "nom": "PDF",
      "typeMime": {
        "type": "application",
        "subType": "PDF"
      },
      "statutRepresentation": {
        "verbatim": "true",
        "canonique": "true",
        "officielle": "true",
        "transcription": "false",
        "enregistrement": "false"
      },
      "repSource": {
        "@xmlns:xsi": "http://www.w3.org/2001/XMLSchema-instance",
        "@xsi:nil": "true"
      },
      "offset": {
        "@xmlns:xsi": "http://www.w3.org/2001/XMLSchema-instance",
        "@xsi:nil": "true"
      },
      "contenu": {
        "documentURI": "/15/amendements/1297/AN/1145.pdf"
      },
      "dateDispoRepresentation": {
        "@xmlns:xsi": "http://www.w3.org/2001/XMLSchema-instance",
        "@xsi:nil": "true"
      }
    }
  },
  "seanceDiscussion": {
    "@xmlns:xsi": "http://www.w3.org/2001/XMLSchema-instance",
    "@xsi:nil": "true"
  },
  "sort": {
    "@xmlns:xsi": "http://www.w3.org/2001/XMLSchema-instance",
    "@xsi:nil": "true"
  },
  "dateDepot": "2018-10-19T02:00:00.000+02:00",
  "dateDistribution": {
    "@xmlns:xsi": "http://www.w3.org/2001/XMLSchema-instance",
    "@xsi:nil": "true"
  },
  "article99": "0",
  "loiReference": {
    "codeLoi": {
      "@xmlns:xsi": "http://www.w3.org/2001/XMLSchema-instance",
      "@xsi:nil": "true"
    },
    "divisionCodeLoi": {
      "@xmlns:xsi": "http://www.w3.org/2001/XMLSchema-instance",
      "@xsi:nil": "true"
    }
  }
}