{
  "@xmlns": "http://schemas.assemblee-nationale.fr/referentiel",
  "uid": "AMANR5L15SEA717460BTC1974P0D1N3419",
  "identifiant": {
    "legislature": "15",
    "numero": "3419",
    "numRect": "0",
    "saisine": {
      "refTexteLegislatif": "PRJLANR5L15BTC1974",
      "numeroPartiePLF": "0",
      "organeExamen": "PO717460",
      "mentionSecondeDeliberation": "0"
    }
  },
  "numeroLong": "3419",
  "etapeTexte": "1ère lecture (2ème assemblée saisie)",
  "triAmendement": "baoaaaaaaaaaaaaaaaaaaaaaaaaaaaaaaaaaaaaaaaaaaaaaaabvw",
  "cardinaliteAmdtMultiples": "1",
  "amendementParent": {
    "@xmlns:xsi": "http://www.w3.org/2001/XMLSchema-instance",
    "@xsi:nil": "true"
  },
  "etat": "Discuté",
  "signataires": {
    "auteur": {
      "typeAuteur": "Depute",
      "acteurRef": "PA267204",
      "organeRef": {
        "@xmlns:xsi": "http://www.w3.org/2001/XMLSchema-instance",
        "@xsi:nil": "true"
      },
      "groupePolitiqueRef": "PO730934"
    },
    "cosignataires": {
      "acteurRef": [
        "PA642847",
        "PA330909",
        "PA719272",
        "PA267429",
        "PA709315",
        "PA608416",
        "PA609245",
        "PA606712",
        "PA267527",
        "PA721286",
        "PA721410",
        "PA332523",
        "PA1012",
        "PA608016",
        "PA718784",
        "PA340853",
        "PA267735",
        "PA719318",
        "PA720210",
        "PA267204",
        "PA334654"
      ]
    },
    "texteAffichable": "M.&#160;Sermier,  Mme&#160;Lacroute, M.&#160;Cinieri, Mme&#160;Bonnivard, Mme&#160;Louwagie, M.&#160;Bazin, Mme&#160;Anthoine, Mme&#160;Dalloz, M.&#160;Saddier, M.&#160;Viala, M.&#160;Straumann, M.&#160;Pauget, M.&#160;Ramadier, M.&#160;Hetzel, M.&#160;de la Verpilli&#232;re, M.&#160;Leclerc, Mme&#160;Beauvais, M.&#160;Lurton, M.&#160;de Ganay, Mme&#160;Meunier et M.&#160;Descoeur"
  },
  "pointeurFragmentTexte": {
    "missionVisee": {
      "@xmlns:xsi": "http://www.w3.org/2001/XMLSchema-instance",
      "@xsi:nil": "true"
    },
    "division": {
      "titre": "Article 9",
      "articleDesignationCourte": "ART. 9",
      "type": "ARTICLE",
      "avant_A_Apres": "A",
      "divisionRattachee": "ARTICLE 9",
      "articleAdditionnel": {
        "@xmlns:xsi": "http://www.w3.org/2001/XMLSchema-instance",
        "@xsi:nil": "true"
      },
      "chapitreAdditionnel": {
        "@xmlns:xsi": "http://www.w3.org/2001/XMLSchema-instance",
        "@xsi:nil": "true"
      },
      "urlDivisionTexteVise": "/15/textes/1974.asp#D_Article_9"
    },
    "alinea": {
      "avant_A_Apres": "Apres",
      "numero": "16",
      "alineaDesignation": {
        "@xmlns:xsi": "http://www.w3.org/2001/XMLSchema-instance",
        "@xsi:nil": "true"
      }
    }
  },
  "corps": {
    "dispositif": "<p style=\"text-align: justify;\">Apr&#232;s l&#8217;alin&#233;a&#160;16, ins&#233;rer l&#8217;alin&#233;a suivant&#160;:</p><p style=\"text-align: justify;\">&#171;&#160;Avant de fournir les donn&#233;es agr&#233;g&#233;es de circulation et de d&#233;placement &#224; un utilisateur, les m&#233;tropoles et les r&#233;gions s&#8217;assurent que leur traitement ne vise pas &#224; restreindre la concurrence ou &#224; offrir &#224; l&#8217;utilisateur une position dominante.&#160;&#187;</p>",
    "exposeSommaire": "<p style=\"text-align: justify;\">L&#8217;article&#160;9 du projet de loi d&#8217;orientation des mobilit&#233;s int&#232;gre en droit fran&#231;ais les dispositions du r&#232;glement d&#233;l&#233;gu&#233; (UE) 2017/1926 de la Commission du 31 mai 2017 compl&#233;tant la directive 2010/40/UE du Parlement europ&#233;en et du Conseil en ce qui concerne la mise &#224; disposition, dans l&#8217;ensemble de l&#8217;Union, de services d&#8217;informations sur les d&#233;placements multimodaux.</p><p style=\"text-align: justify;\">Ce r&#232;glement fixe les modalit&#233;s de centralisation des donn&#233;es de mobilit&#233;, afin de mieux appr&#233;hender les usages et besoins sur chaque territoire, mais &#233;galement am&#233;liorer l&#8217;information de l&#8217;usager afin de lui offrir plusieurs solutions de mobilit&#233; et favoriser ainsi la multimodalit&#233;. Il pr&#233;voit &#233;galement une mise &#224; disposition de ces donn&#233;es pour utilisation et traitement par des op&#233;rateurs tiers, le cas &#233;ch&#233;ant par le biais d&#8217;un accord de licence.</p><p style=\"text-align: justify;\">S&#8217;il convient de favoriser l&#8217;innovation en permettant l&#8217;&#233;tude de ces donn&#233;es, il est &#233;galement essentiel de&#160;s&#8217;assurer que l&#8217;acc&#232;s aux donn&#233;es agr&#233;g&#233;es ne permette pas &#224; un op&#233;rateur de construire une situation dominante sur le march&#233;.</p><p style=\"text-align: justify;\">Compte tenu des ambitions de g&#233;ants du num&#233;rique sur les enjeux de mobilit&#233;s, acteurs le plus souvent non europ&#233;ens, il est essentiel de donner l&#8217;opportunit&#233; aux R&#233;gions et m&#233;tropoles de refuser l&#8217;acc&#232;s &#224; un acteur qui viserait &#224; consolider sa position dominante ou qui disposerait de moyens techniques et financiers de traitement lui offrant demain une position concurrentielle dominante.</p>",
    "annexeExposeSommaire": {
      "@xmlns:xsi": "http://www.w3.org/2001/XMLSchema-instance",
      "@xsi:nil": "true"
    },
    "cartoucheDelaiDepotDepasse": {
      "@xmlns:xsi": "http://www.w3.org/2001/XMLSchema-instance",
      "@xsi:nil": "true"
    }
  },
  "representations": {
    "representation": {
      "nom": "PDF",
      "typeMime": {
        "type": "application",
        "subType": "PDF"
      },
      "statutRepresentation": {
        "verbatim": "true",
        "canonique": "true",
        "officielle": "true",
        "transcription": "false",
        "enregistrement": "false"
      },
      "repSource": {
        "@xmlns:xsi": "http://www.w3.org/2001/XMLSchema-instance",
        "@xsi:nil": "true"
      },
      "offset": {
        "@xmlns:xsi": "http://www.w3.org/2001/XMLSchema-instance",
        "@xsi:nil": "true"
      },
      "contenu": {
        "documentURI": "/15/amendements/1974/AN/3419.pdf"
      },
      "dateDispoRepresentation": {
        "@xmlns:xsi": "http://www.w3.org/2001/XMLSchema-instance",
        "@xsi:nil": "true"
      }
    }
  },
  "seanceDiscussion": "RUANR5L15S2019IDS21679",
  "sort": {
    "dateSaisie": "2019-06-06T12:58:16.000+02:00",
    "sortEnSeance": "Rejeté"
  },
  "dateDepot": "2019-05-29T02:00:00.000+02:00",
  "dateDistribution": "2019-06-03T02:00:00.000+02:00",
  "article99": "0",
  "loiReference": {
    "codeLoi": {
      "@xmlns:xsi": "http://www.w3.org/2001/XMLSchema-instance",
      "@xsi:nil": "true"
    },
    "divisionCodeLoi": {
      "@xmlns:xsi": "http://www.w3.org/2001/XMLSchema-instance",
      "@xsi:nil": "true"
    }
  }
}