{
  "@xmlns": "http://schemas.assemblee-nationale.fr/referentiel",
  "uid": "AMANR5L15SEA717460BTC0765P0D1N18",
  "identifiant": {
    "legislature": "15",
    "numero": "18",
    "numRect": "0",
    "saisine": {
      "refTexteLegislatif": "PRJLANR5L15BTC0765",
      "numeroPartiePLF": "0",
      "organeExamen": "PO717460",
      "mentionSecondeDeliberation": "0"
    }
  },
  "numeroLong": "18",
  "etapeTexte": "1ère lecture (1ère assemblée saisie)",
  "triAmendement": "zzzzzzzzzzzzzzzzzzzzzzzzzzzzzzzzzzzzzzzzzi",
  "cardinaliteAmdtMultiples": "1",
  "amendementParent": {
    "@xmlns:xsi": "http://www.w3.org/2001/XMLSchema-instance",
    "@xsi:nil": "true"
  },
  "etat": "Discuté",
  "signataires": {
    "auteur": {
      "typeAuteur": "Depute",
      "acteurRef": "PA721210",
      "organeRef": {
        "@xmlns:xsi": "http://www.w3.org/2001/XMLSchema-instance",
        "@xsi:nil": "true"
      },
      "groupePolitiqueRef": "PO730958"
    },
    "cosignataires": {
      "acteurRef": [
        "PA721210",
        "PA721226",
        "PA720892",
        "PA718860",
        "PA721960",
        "PA721202",
        "PA718868",
        "PA721062",
        "PA720846",
        "PA720422",
        "PA719676",
        "PA722142",
        "PA720286",
        "PA2150",
        "PA588884",
        "PA720430",
        "PA719578"
      ]
    },
    "texteAffichable": "M.&#160;Corbi&#232;re,  Mme&#160;Autain, M.&#160;Bernalicis, M.&#160;Coquerel, Mme&#160;Fiat, M.&#160;Lachaud, M.&#160;Larive, M.&#160;M&#233;lenchon, Mme&#160;Obono, Mme&#160;Panot, M.&#160;Prud&apos;homme, M.&#160;Quatennens, M.&#160;Ratenon, Mme&#160;Ressiguier, Mme&#160;Rubin, M.&#160;Ruffin et Mme&#160;Taurine"
  },
  "pointeurFragmentTexte": {
    "missionVisee": {
      "@xmlns:xsi": "http://www.w3.org/2001/XMLSchema-instance",
      "@xsi:nil": "true"
    },
    "division": {
      "titre": "RAPPORT ANNEXÉ",
      "articleDesignationCourte": "ART. 2",
      "type": "ANNEXE",
      "avant_A_Apres": "A",
      "divisionRattachee": "ARTICLE 2",
      "articleAdditionnel": {
        "@xmlns:xsi": "http://www.w3.org/2001/XMLSchema-instance",
        "@xsi:nil": "true"
      },
      "chapitreAdditionnel": {
        "@xmlns:xsi": "http://www.w3.org/2001/XMLSchema-instance",
        "@xsi:nil": "true"
      },
      "urlDivisionTexteVise": "/15/textes/0765.asp#D_RAPPORT_ANNEXE"
    },
    "alinea": {
      "avant_A_Apres": "A",
      "numero": "254",
      "alineaDesignation": "Alinéa 254"
    }
  },
  "corps": {
    "dispositif": "<p>R&#233;diger ainsi la seconde phrase de l&#8217;alin&#233;a&#160;254&#160;:</p><p>&#171;&#160;Si une r&#233;forme des retraites est adopt&#233;e par le Parlement, elle prend en compte ces sp&#233;cificit&#233;s.&#160;&#187;</p>",
    "exposeSommaire": "<p style=\"text-align: justify;\">Le gouvernement pr&#233;voit d&#8217;engager prochainement une &#233;ni&#232;me r&#233;forme du syst&#232;me des retraites. Il y a fort &#224; parier que comme toutes celles engag&#233;es ces derni&#232;res ann&#233;es, celle-ci imposera une nouvelle r&#233;gression sociale que le groupe de la France insoumise ne pourra pas accepter. En tout &#233;tat de cause, il ne saurait &#234;tre question de consid&#233;rer comme adopt&#233; par avance un texte dont le contenu n&#8217;a pas &#233;t&#233; rendu public. Cet amendement vise donc &#224; remplacer une formulation assez malhonn&#234;te en ce qu&#8217;elle prend pour un fait accompli l&#8217;adoption d&#8217;un texte que le Parlement devrait en toute rigueur pouvoir repousser.</p>",
    "annexeExposeSommaire": {
      "@xmlns:xsi": "http://www.w3.org/2001/XMLSchema-instance",
      "@xsi:nil": "true"
    }
  },
  "representations": {
    "representation": {
      "nom": "PDF",
      "typeMime": {
        "type": "application",
        "subType": "PDF"
      },
      "statutRepresentation": {
        "verbatim": "true",
        "canonique": "true",
        "officielle": "true",
        "transcription": "false",
        "enregistrement": "false"
      },
      "repSource": {
        "@xmlns:xsi": "http://www.w3.org/2001/XMLSchema-instance",
        "@xsi:nil": "true"
      },
      "offset": {
        "@xmlns:xsi": "http://www.w3.org/2001/XMLSchema-instance",
        "@xsi:nil": "true"
      },
      "contenu": {
        "documentURI": "/15/amendements/0765/AN/18.pdf"
      },
      "dateDispoRepresentation": {
        "@xmlns:xsi": "http://www.w3.org/2001/XMLSchema-instance",
        "@xsi:nil": "true"
      }
    }
  },
  "seanceDiscussion": "RUANR5L15S2018IDS20954",
  "sort": {
    "dateSaisie": "2018-03-21T23:12:54.000+01:00",
    "sortEnSeance": "Rejeté"
  },
  "dateDepot": "2018-03-15T01:00:00.000+01:00",
  "dateDistribution": "2018-03-19T01:00:00.000+01:00",
  "article99": "0",
  "loiReference": {
    "codeLoi": {
      "@xmlns:xsi": "http://www.w3.org/2001/XMLSchema-instance",
      "@xsi:nil": "true"
    },
    "divisionCodeLoi": {
      "@xmlns:xsi": "http://www.w3.org/2001/XMLSchema-instance",
      "@xsi:nil": "true"
    }
  }
}