{
  "@xmlns": "http://schemas.assemblee-nationale.fr/referentiel",
  "uid": "AMANR5L15PO59051B0714P0D1N471",
  "identifiant": {
    "legislature": "15",
    "numero": "471",
    "numRect": "0",
    "saisine": {
      "refTexteLegislatif": "PRJLANR5L15B0714",
      "numeroPartiePLF": "0",
      "organeExamen": "PO59051",
      "mentionSecondeDeliberation": "0"
    }
  },
  "numeroLong": "CL471",
  "etapeTexte": "1ère lecture (1ère assemblée saisie)",
  "triAmendement": "dl",
  "cardinaliteAmdtMultiples": "1",
  "amendementParent": {
    "@xmlns:xsi": "http://www.w3.org/2001/XMLSchema-instance",
    "@xsi:nil": "true"
  },
  "etat": "Discuté",
  "signataires": {
    "auteur": {
      "typeAuteur": "Depute",
      "acteurRef": "PA721836",
      "organeRef": {
        "@xmlns:xsi": "http://www.w3.org/2001/XMLSchema-instance",
        "@xsi:nil": "true"
      },
      "groupePolitiqueRef": "PO730970"
    },
    "cosignataires": {
      "acteurRef": [
        "PA720772",
        "PA719874",
        "PA720704",
        "PA718978",
        "PA720326",
        "PA721984",
        "PA721742",
        "PA721836"
      ]
    },
    "texteAffichable": "M.&#160;Barrot,  M.&#160;Bru, Mme&#160;Florennes, Mme&#160;Jacquier-Laforge, M.&#160;Latombe, Mme&#160;Vichnievsky, M.&#160;Hammouche et M.&#160;Laqhila"
  },
  "pointeurFragmentTexte": {
    "missionVisee": {
      "@xmlns:xsi": "http://www.w3.org/2001/XMLSchema-instance",
      "@xsi:nil": "true"
    },
    "division": {
      "titre": "Article 41",
      "articleDesignationCourte": "APRÈS ART. 41",
      "type": "ARTICLE",
      "avant_A_Apres": "Après",
      "divisionRattachee": "APRÈS L'ARTICLE 41, insérer l'article suivant:",
      "articleAdditionnel": "1",
      "chapitreAdditionnel": {
        "@xmlns:xsi": "http://www.w3.org/2001/XMLSchema-instance",
        "@xsi:nil": "true"
      },
      "urlDivisionTexteVise": "/15/textes/0714.asp#D_Article_41"
    },
    "alinea": {
      "@xmlns:xsi": "http://www.w3.org/2001/XMLSchema-instance",
      "@xsi:nil": "true"
    }
  },
  "corps": {
    "dispositif": "<p style=\"text-align: justify;\">&#171;&#160;Au plus tard au moment du d&#233;p&#244;t du projet de loi de ratification devant le Parlement, le Gouvernement rend compte au Parlement des conditions dans lesquelles les personnes int&#233;ress&#233;es ont &#233;t&#233; associ&#233;es &#224; l&#8217;&#233;laboration des ordonnances pr&#233;vues aux articles 27 et 39.&#160;&#187;</p>",
    "exposeSommaire": "<p>Cet amendement pr&#233;voit une consultation des principales personnes concern&#233;es par la mise en &#339;uvre des ordonnances pr&#233;vues aux articles 27 et 39 afin d&#8217;am&#233;liorer l&#8217;information de la Repr&#233;sentation nationale sur les possibles cons&#233;quences pratiques du texte qui leur sera soumis.<br /> <br />Ainsi, cet amendement est directement inspir&#233; du projet de loi pour un &#201;tat au service d&#8217;une soci&#233;t&#233; de confiance (ESSOC) qui a introduit cette nouvelle mani&#232;re de proc&#233;der &#224; l&#8217;article 41. Comme le pr&#233;cisait le rapport de premi&#232;re lecture sur ce projet de loi, le Conseil de la r&#233;forme sera naturellement tr&#232;s attentif &#224; la mise en &#339;uvre concr&#232;te du pr&#233;sent article.<br /> <br />La mise en &#339;uvre de cette consultation et surtout l&#8217;obligation pour le Gouvernement d&#8217;en rendre compte au Parlement seraient particuli&#232;rement pertinentes concernant ce projet de loi, au regard de la grande complexit&#233; des modifications qui seront op&#233;r&#233;es, qu&#8217;il s&#8217;agisse du r&#233;gime des autorisations de travail des &#233;trangers dont l&#8217;&#233;volution est susceptible d&#8217;emporter des cons&#233;quences &#233;conomiques et sociales fortes, ou de la mise en &#339;uvre du CESEDA dans des territoires d&#8217;outre-mer, o&#249; l&#8217;application du droit de l&#8217;immigration est n&#233;cessairement non seulement tr&#232;s sp&#233;cifique, mais aussi tr&#232;s sensible.<br />&#8195;</p>",
    "annexeExposeSommaire": {
      "@xmlns:xsi": "http://www.w3.org/2001/XMLSchema-instance",
      "@xsi:nil": "true"
    }
  },
  "representations": {
    "representation": {
      "nom": "PDF",
      "typeMime": {
        "type": "application",
        "subType": "PDF"
      },
      "statutRepresentation": {
        "verbatim": "true",
        "canonique": "true",
        "officielle": "true",
        "transcription": "false",
        "enregistrement": "false"
      },
      "repSource": {
        "@xmlns:xsi": "http://www.w3.org/2001/XMLSchema-instance",
        "@xsi:nil": "true"
      },
      "offset": {
        "@xmlns:xsi": "http://www.w3.org/2001/XMLSchema-instance",
        "@xsi:nil": "true"
      },
      "contenu": {
        "documentURI": "/15/amendements/0714/CION_LOIS/CL471.pdf"
      },
      "dateDispoRepresentation": {
        "@xmlns:xsi": "http://www.w3.org/2001/XMLSchema-instance",
        "@xsi:nil": "true"
      }
    }
  },
  "seanceDiscussion": {
    "@xmlns:xsi": "http://www.w3.org/2001/XMLSchema-instance",
    "@xsi:nil": "true"
  },
  "sort": {
    "dateSaisie": "2018-04-06T20:49:04.000+02:00",
    "sortEnSeance": "Retiré"
  },
  "dateDepot": "2018-03-30T02:00:00.000+02:00",
  "dateDistribution": "2018-04-02T02:00:00.000+02:00",
  "article99": "0",
  "loiReference": {
    "codeLoi": "zzz id",
    "divisionCodeLoi": {
      "@xmlns:xsi": "http://www.w3.org/2001/XMLSchema-instance",
      "@xsi:nil": "true"
    }
  }
}