{
  "@xmlns": "http://schemas.assemblee-nationale.fr/referentiel",
  "uid": "AMANR5L15PO59048B0485P0D1N295",
  "identifiant": {
    "legislature": "15",
    "numero": "295",
    "numRect": "0",
    "saisine": {
      "refTexteLegislatif": "PRJLANR5L15B0485",
      "numeroPartiePLF": "0",
      "organeExamen": "PO59048",
      "mentionSecondeDeliberation": "0"
    }
  },
  "numeroLong": "CF295",
  "etapeTexte": "Nouvelle Lecture",
  "triAmendement": "b",
  "cardinaliteAmdtMultiples": "1",
  "amendementParent": {
    "@xmlns:xsi": "http://www.w3.org/2001/XMLSchema-instance",
    "@xsi:nil": "true"
  },
  "etat": "Discuté",
  "signataires": {
    "auteur": {
      "typeAuteur": "Depute",
      "acteurRef": "PA721202",
      "organeRef": {
        "@xmlns:xsi": "http://www.w3.org/2001/XMLSchema-instance",
        "@xsi:nil": "true"
      },
      "groupePolitiqueRef": "PO730958"
    },
    "cosignataires": {
      "acteurRef": [
        "PA2150",
        "PA719676",
        "PA721960",
        "PA721202",
        "PA718860",
        "PA719578",
        "PA720422",
        "PA588884",
        "PA721226",
        "PA721062",
        "PA720430",
        "PA722142",
        "PA720286",
        "PA720892",
        "PA721210",
        "PA720846",
        "PA718868"
      ]
    },
    "texteAffichable": "M.&#160;Coquerel,  Mme&#160;Autain, M.&#160;Bernalicis, M.&#160;Corbi&#232;re, Mme&#160;Fiat, M.&#160;Lachaud, M.&#160;Larive, M.&#160;M&#233;lenchon, Mme&#160;Obono, Mme&#160;Panot, M.&#160;Prud&apos;homme, M.&#160;Quatennens, M.&#160;Ratenon, Mme&#160;Ressiguier, Mme&#160;Rubin, M.&#160;Ruffin et Mme&#160;Taurine"
  },
  "pointeurFragmentTexte": {
    "missionVisee": {
      "@xmlns:xsi": "http://www.w3.org/2001/XMLSchema-instance",
      "@xsi:nil": "true"
    },
    "division": {
      "titre": "ÉTAT B",
      "articleDesignationCourte": "ART. 29",
      "type": "ANNEXE",
      "avant_A_Apres": "A",
      "divisionRattachee": "ARTICLE 29",
      "articleAdditionnel": {
        "@xmlns:xsi": "http://www.w3.org/2001/XMLSchema-instance",
        "@xsi:nil": "true"
      },
      "chapitreAdditionnel": {
        "@xmlns:xsi": "http://www.w3.org/2001/XMLSchema-instance",
        "@xsi:nil": "true"
      },
      "urlDivisionTexteVise": "/15/textes/0485.asp#D_ETAT_B"
    },
    "alinea": {
      "@xmlns:xsi": "http://www.w3.org/2001/XMLSchema-instance",
      "@xsi:nil": "true"
    }
  },
  "corps": {
    "dispositif": "<p>Mission &#171; Action ext&#233;rieure de l'&#201;tat &#187;</p><p>I. Modifier ainsi les autorisations d'engagement :</p><table style=\"width: 450.0pt; border-collapse: collapse;\" width=\"600\"><tbody><tr><td style=\"padding: 0cm 0cm 0cm 0cm;\"><p style=\"page-break-after: avoid;\">&#160;</p></td><td style=\"padding: 0cm 0cm 0cm 0cm;\"><p style=\"page-break-after: avoid;\">&#160;</p></td><td style=\"padding: 0cm 0cm 0cm 0cm;\"><p style=\"page-break-after: avoid;\">(en euros)</p></td></tr><tr style=\"height: 37.5pt;\"><td style=\"width: 50.0%; border: solid windowtext 1.0pt; padding: 0cm 0cm 0cm 0cm; height: 37.5pt;\" width=\"50%\"><p style=\"text-align: center; page-break-after: avoid;\">Programmes</p></td><td style=\"width: 25.0%; border: solid windowtext 1.0pt; border-left: none; padding: 0cm 0cm 0cm 0cm; height: 37.5pt;\" width=\"25%\"><p style=\"text-align: center; page-break-after: avoid;\">+</p></td><td style=\"width: 25.0%; border: solid windowtext 1.0pt; border-left: none; padding: 0cm 0cm 0cm 0cm; height: 37.5pt;\" width=\"25%\"><p style=\"text-align: center; page-break-after: avoid;\">-</p></td></tr><tr><td style=\"width: 50.0%; border-top: none; border-left: solid windowtext 1.0pt; border-bottom: none; border-right: solid windowtext 1.0pt; padding: 0cm 2.25pt 0cm 2.25pt;\" width=\"50%\"><p style=\"page-break-after: avoid;\">Action de la France en Europe et dans le monde</p></td><td style=\"width: 25.0%; border: none; border-right: solid windowtext 1.0pt; padding: 0cm 2.25pt 0cm 0cm;\" width=\"25%\"><p style=\"page-break-after: avoid;\">13&#160;400&#160;000</p></td><td style=\"width: 25.0%; border: none; border-right: solid windowtext 1.0pt; padding: 0cm 2.25pt 0cm 0cm;\" width=\"25%\"><p style=\"page-break-after: avoid;\">0</p></td></tr><tr><td style=\"width: 50.0%; border-top: none; border-left: solid windowtext 1.0pt; border-bottom: none; border-right: solid windowtext 1.0pt; padding: 0cm 2.25pt 0cm 2.25pt;\" width=\"50%\"><p style=\"page-break-after: avoid;\">Diplomatie culturelle et d'influence</p></td><td style=\"width: 25.0%; border: none; border-right: solid windowtext 1.0pt; padding: 0cm 2.25pt 0cm 0cm;\" width=\"25%\"><p style=\"page-break-after: avoid;\">0</p></td><td style=\"width: 25.0%; border: none; border-right: solid windowtext 1.0pt; padding: 0cm 2.25pt 0cm 0cm;\" width=\"25%\"><p style=\"page-break-after: avoid;\">0</p></td></tr><tr><td style=\"width: 50.0%; border-top: none; border-left: solid windowtext 1.0pt; border-bottom: none; border-right: solid windowtext 1.0pt; padding: 0cm 2.25pt 0cm 2.25pt;\" width=\"50%\"><p style=\"page-break-after: avoid;\">Fran&#231;ais &#224; l'&#233;tranger et affaires consulaires</p></td><td style=\"width: 25.0%; border: none; border-right: solid windowtext 1.0pt; padding: 0cm 2.25pt 0cm 0cm;\" width=\"25%\"><p style=\"page-break-after: avoid;\">0</p></td><td style=\"width: 25.0%; border: none; border-right: solid windowtext 1.0pt; padding: 0cm 2.25pt 0cm 0cm;\" width=\"25%\"><p style=\"page-break-after: avoid;\">0</p></td></tr><tr><td style=\"width: 50.0%; border-top: none; border-left: solid windowtext 1.0pt; border-bottom: none; border-right: solid windowtext 1.0pt; padding: 0cm 2.25pt 0cm 2.25pt;\" width=\"50%\"><p style=\"page-break-after: avoid;\">Pr&#233;sidence fran&#231;aise du G7<span> (ligne supprim&#233;e)</span></p></td><td style=\"width: 25.0%; border: none; border-right: solid windowtext 1.0pt; padding: 0cm 2.25pt 0cm 0cm;\" width=\"25%\"><p style=\"page-break-after: avoid;\">0</p></td><td style=\"width: 25.0%; border: none; border-right: solid windowtext 1.0pt; padding: 0cm 2.25pt 0cm 0cm;\" width=\"25%\"><p style=\"page-break-after: avoid;\">13&#160;400&#160;000</p></td></tr><tr style=\"height: 37.5pt;\"><td style=\"width: 50.0%; border: solid windowtext 1.0pt; padding: 0cm 0cm 0cm 0cm; height: 37.5pt;\" width=\"50%\"><p style=\"text-align: center; page-break-after: avoid;\">TOTAUX</p></td><td style=\"width: 25.0%; border: solid windowtext 1.0pt; border-left: none; padding: 0cm 0cm 0cm 0cm; height: 37.5pt;\" width=\"25%\"><p style=\"text-align: right; page-break-after: avoid;\">13&#160;400&#160;000</p></td><td style=\"width: 25.0%; border: solid windowtext 1.0pt; border-left: none; padding: 0cm 0cm 0cm 0cm; height: 37.5pt;\" width=\"25%\"><p style=\"text-align: right; page-break-after: avoid;\">13&#160;400&#160;000</p></td></tr><tr style=\"height: 37.5pt;\"><td style=\"width: 50.0%; border: solid windowtext 1.0pt; border-top: none; padding: 0cm 0cm 0cm 0cm; height: 37.5pt;\" width=\"50%\"><p style=\"text-align: center;\">SOLDE</p></td><td style=\"width: 50.0%; border-top: none; border-left: none; border-bottom: solid windowtext 1.0pt; border-right: solid windowtext 1.0pt; padding: 0cm 0cm 0cm 0cm; height: 37.5pt;\" colspan=\"2\" width=\"50%\"><p style=\"text-align: center;\">0</p></td></tr></tbody></table><p style=\"page-break-after: avoid;\">II. Modifier ainsi les cr&#233;dits de paiement :</p><table style=\"width: 450.0pt; border-collapse: collapse;\" width=\"600\"><tbody><tr><td style=\"padding: 0cm 0cm 0cm 0cm;\"><p style=\"page-break-after: avoid;\">&#160;</p></td><td style=\"padding: 0cm 0cm 0cm 0cm;\"><p style=\"page-break-after: avoid;\">&#160;</p></td><td style=\"padding: 0cm 0cm 0cm 0cm;\"><p style=\"page-break-after: avoid;\">(en euros)</p></td></tr><tr style=\"height: 37.5pt;\"><td style=\"width: 50.0%; border: solid windowtext 1.0pt; padding: 0cm 0cm 0cm 0cm; height: 37.5pt;\" width=\"50%\"><p style=\"text-align: center; page-break-after: avoid;\">Programmes</p></td><td style=\"width: 25.0%; border: solid windowtext 1.0pt; border-left: none; padding: 0cm 0cm 0cm 0cm; height: 37.5pt;\" width=\"25%\"><p style=\"text-align: center; page-break-after: avoid;\">+</p></td><td style=\"width: 25.0%; border: solid windowtext 1.0pt; border-left: none; padding: 0cm 0cm 0cm 0cm; height: 37.5pt;\" width=\"25%\"><p style=\"text-align: center; page-break-after: avoid;\">-</p></td></tr><tr><td style=\"width: 50.0%; border-top: none; border-left: solid windowtext 1.0pt; border-bottom: none; border-right: solid windowtext 1.0pt; padding: 0cm 2.25pt 0cm 2.25pt;\" width=\"50%\"><p style=\"page-break-after: avoid;\">Action de la France en Europe et dans le monde</p></td><td style=\"width: 25.0%; border: none; border-right: solid windowtext 1.0pt; padding: 0cm 2.25pt 0cm 0cm;\" width=\"25%\"><p style=\"page-break-after: avoid;\">12&#160;000&#160;000</p></td><td style=\"width: 25.0%; border: none; border-right: solid windowtext 1.0pt; padding: 0cm 2.25pt 0cm 0cm;\" width=\"25%\"><p style=\"page-break-after: avoid;\">0</p></td></tr><tr><td style=\"width: 50.0%; border-top: none; border-left: solid windowtext 1.0pt; border-bottom: none; border-right: solid windowtext 1.0pt; padding: 0cm 2.25pt 0cm 2.25pt;\" width=\"50%\"><p style=\"page-break-after: avoid;\">Diplomatie culturelle et d'influence</p></td><td style=\"width: 25.0%; border: none; border-right: solid windowtext 1.0pt; padding: 0cm 2.25pt 0cm 0cm;\" width=\"25%\"><p style=\"page-break-after: avoid;\">0</p></td><td style=\"width: 25.0%; border: none; border-right: solid windowtext 1.0pt; padding: 0cm 2.25pt 0cm 0cm;\" width=\"25%\"><p style=\"page-break-after: avoid;\">0</p></td></tr><tr><td style=\"width: 50.0%; border-top: none; border-left: solid windowtext 1.0pt; border-bottom: none; border-right: solid windowtext 1.0pt; padding: 0cm 2.25pt 0cm 2.25pt;\" width=\"50%\"><p style=\"page-break-after: avoid;\">Fran&#231;ais &#224; l'&#233;tranger et affaires consulaires</p></td><td style=\"width: 25.0%; border: none; border-right: solid windowtext 1.0pt; padding: 0cm 2.25pt 0cm 0cm;\" width=\"25%\"><p style=\"page-break-after: avoid;\">0</p></td><td style=\"width: 25.0%; border: none; border-right: solid windowtext 1.0pt; padding: 0cm 2.25pt 0cm 0cm;\" width=\"25%\"><p style=\"page-break-after: avoid;\">0</p></td></tr><tr><td style=\"width: 50.0%; border-top: none; border-left: solid windowtext 1.0pt; border-bottom: none; border-right: solid windowtext 1.0pt; padding: 0cm 2.25pt 0cm 2.25pt;\" width=\"50%\"><p style=\"page-break-after: avoid;\">Pr&#233;sidence fran&#231;aise du G7<span> (ligne supprim&#233;e)</span></p></td><td style=\"width: 25.0%; border: none; border-right: solid windowtext 1.0pt; padding: 0cm 2.25pt 0cm 0cm;\" width=\"25%\"><p style=\"page-break-after: avoid;\">0</p></td><td style=\"width: 25.0%; border: none; border-right: solid windowtext 1.0pt; padding: 0cm 2.25pt 0cm 0cm;\" width=\"25%\"><p style=\"page-break-after: avoid;\">12&#160;000&#160;000</p></td></tr><tr style=\"height: 37.5pt;\"><td style=\"width: 50.0%; border: solid windowtext 1.0pt; padding: 0cm 0cm 0cm 0cm; height: 37.5pt;\" width=\"50%\"><p style=\"text-align: center; page-break-after: avoid;\">TOTAUX</p></td><td style=\"width: 25.0%; border: solid windowtext 1.0pt; border-left: none; padding: 0cm 0cm 0cm 0cm; height: 37.5pt;\" width=\"25%\"><p style=\"text-align: right; page-break-after: avoid;\">12&#160;000&#160;000</p></td><td style=\"width: 25.0%; border: solid windowtext 1.0pt; border-left: none; padding: 0cm 0cm 0cm 0cm; height: 37.5pt;\" width=\"25%\"><p style=\"text-align: right; page-break-after: avoid;\">12&#160;000&#160;000</p></td></tr><tr style=\"height: 37.5pt;\"><td style=\"width: 50.0%; border: solid windowtext 1.0pt; border-top: none; padding: 0cm 0cm 0cm 0cm; height: 37.5pt;\" width=\"50%\"><p style=\"text-align: center;\">SOLDE</p></td><td style=\"width: 50.0%; border-top: none; border-left: none; border-bottom: solid windowtext 1.0pt; border-right: solid windowtext 1.0pt; padding: 0cm 0cm 0cm 0cm; height: 37.5pt;\" colspan=\"2\" width=\"50%\"><p style=\"text-align: center;\">0</p></td></tr></tbody></table><p>&#160;</p>",
    "exposeSommaire": "<p style=\"text-align: justify;\">Par cet amendement nous souhaitons transf&#233;rer le budget du programme 347 &#171;&#160;Pr&#233;sidence fran&#231;aise du G7&#160;&#187; au profit de l&#8217;ONU (programme 105, action 4). Le budget du programme 347 s&#8217;&#233;l&#232;ve &#224; 36,4 millions d&#8217;euros dont 12 millions d&#8217;euros au titre de l&#8217;ann&#233;e 2018.</p><p style=\"text-align: justify;\">&#192; rebours de l&#8217;enfermement dans la diplomatie de clubs oligarchiques, symbolis&#233; notamment par le poids du G7, la France doit peser pour le retour en force de l&#8217;ONU. Il nous faut &#339;uvrer &#224; la d&#233;mocratisation et au renforcement de l&#8217;ONU en remettant en cause les ar&#232;nes parall&#232;les de d&#233;cision, notamment le G7.</p><p style=\"text-align: justify;\">Quelles que soient ses imperfections, l&#8217;ONU est la seule organisation universelle reconnaissant l&#8217;&#233;galit&#233; entre les &#201;tats et entre les peuples (article&#160;2 de la Charte des Nations Unies). Elle est donc la seule instance l&#233;gitime &#224; &#339;uvrer &#224; la s&#233;curit&#233; collective et &#224; produire un droit global. Il nous faut ainsi donner une place centrale &#224; l&#8217;ONU dans notre politique internationale.</p>",
    "annexeExposeSommaire": {
      "@xmlns:xsi": "http://www.w3.org/2001/XMLSchema-instance",
      "@xsi:nil": "true"
    }
  },
  "representations": {
    "representation": {
      "nom": "PDF",
      "typeMime": {
        "type": "application",
        "subType": "PDF"
      },
      "statutRepresentation": {
        "verbatim": "true",
        "canonique": "true",
        "officielle": "true",
        "transcription": "false",
        "enregistrement": "false"
      },
      "repSource": {
        "@xmlns:xsi": "http://www.w3.org/2001/XMLSchema-instance",
        "@xsi:nil": "true"
      },
      "offset": {
        "@xmlns:xsi": "http://www.w3.org/2001/XMLSchema-instance",
        "@xsi:nil": "true"
      },
      "contenu": {
        "documentURI": "/15/amendements/0485/CION_FIN/CF295.pdf"
      },
      "dateDispoRepresentation": {
        "@xmlns:xsi": "http://www.w3.org/2001/XMLSchema-instance",
        "@xsi:nil": "true"
      }
    }
  },
  "seanceDiscussion": {
    "@xmlns:xsi": "http://www.w3.org/2001/XMLSchema-instance",
    "@xsi:nil": "true"
  },
  "sort": {
    "dateSaisie": "2017-12-14T10:45:26.000+01:00",
    "sortEnSeance": "Rejeté"
  },
  "dateDepot": "2017-12-13T01:00:00.000+01:00",
  "dateDistribution": "2017-12-14T01:00:00.000+01:00",
  "article99": "0",
  "loiReference": {
    "codeLoi": "Action extérieure de l'État",
    "divisionCodeLoi": {
      "@xmlns:xsi": "http://www.w3.org/2001/XMLSchema-instance",
      "@xsi:nil": "true"
    }
  }
}