{
  "@xmlns": "http://schemas.assemblee-nationale.fr/referentiel",
  "uid": "AMANR5L15PO59048B2272P2D1N633",
  "identifiant": {
    "legislature": "15",
    "numero": "633",
    "numRect": "0",
    "saisine": {
      "refTexteLegislatif": "PRJLANR5L15B2272",
      "numeroPartiePLF": "2",
      "organeExamen": "PO59048",
      "mentionSecondeDeliberation": "0"
    }
  },
  "numeroLong": "II-CF633",
  "etapeTexte": "1ère lecture (1ère assemblée saisie)",
  "triAmendement": "koaaaaaaaaaaaaaaaaaaaaaaaaaaaaaaaaaaaaaaaaaaaaaaaam",
  "cardinaliteAmdtMultiples": "1",
  "amendementParent": {
    "@xmlns:xsi": "http://www.w3.org/2001/XMLSchema-instance",
    "@xsi:nil": "true"
  },
  "etat": "Discuté",
  "signataires": {
    "auteur": {
      "typeAuteur": "Depute",
      "acteurRef": "PA405480",
      "organeRef": {
        "@xmlns:xsi": "http://www.w3.org/2001/XMLSchema-instance",
        "@xsi:nil": "true"
      },
      "groupePolitiqueRef": "PO759900"
    },
    "cosignataires": {
      "acteurRef": [
        "PA331582",
        "PA405480",
        "PA719138"
      ]
    },
    "texteAffichable": "M.&#160;Pupponi,  M.&#160;Castellani et M.&#160;Philippe&#160;Vigier"
  },
  "pointeurFragmentTexte": {
    "missionVisee": {
      "@xmlns:xsi": "http://www.w3.org/2001/XMLSchema-instance",
      "@xsi:nil": "true"
    },
    "division": {
      "titre": "Article 67",
      "articleDesignationCourte": "ART. 67",
      "type": "ARTICLE",
      "avant_A_Apres": "A",
      "divisionRattachee": "ARTICLE 67",
      "articleAdditionnel": {
        "@xmlns:xsi": "http://www.w3.org/2001/XMLSchema-instance",
        "@xsi:nil": "true"
      },
      "chapitreAdditionnel": {
        "@xmlns:xsi": "http://www.w3.org/2001/XMLSchema-instance",
        "@xsi:nil": "true"
      },
      "urlDivisionTexteVise": "/15/textes/2272C.asp#D_Article_67"
    },
    "alinea": {
      "avant_A_Apres": {
        "@xmlns:xsi": "http://www.w3.org/2001/XMLSchema-instance",
        "@xsi:nil": "true"
      },
      "numero": "2",
      "alineaDesignation": {
        "@xmlns:xsi": "http://www.w3.org/2001/XMLSchema-instance",
        "@xsi:nil": "true"
      }
    }
  },
  "corps": {
    "dispositif": "<p>Supprimer l'alin&#233;a 2.</p>",
    "exposeSommaire": "<p style=\"text-align: justify;\">La RLS a permis &#224; l&#8217;&#201;tat de r&#233;aliser des &#233;conomies importantes dans les d&#233;penses d&#8217;APL, qui sont compens&#233;es par les bailleurs sociaux et n&#8217;ont ainsi pas d&#8217;impact sur les locataires du parc social.</p><p style=\"text-align: justify;\">Outre cette mesure, de nombreuses &#233;conomies ont &#233;t&#233; mises en &#339;uvre depuis octobre 2017 (baisse de cinq&#160;euros, non-revalorisation en 2018, revalorisation limit&#233;e &#224; 0,3&#160;% en 2019). La loi de finances pour 2019 dispose &#233;galement d&#8217;un changement dans la prise en compte des ressources pour le calcul des APL, avec une &#233;conomie &#224; la cl&#233; de 1,3 milliards d&#8217;euros pour les finances publiques en 2020.</p><p style=\"text-align: justify;\">Ces mesures d&#8217;&#233;conomie p&#232;sent sur les taux d&#8217;effort des m&#233;nages modestes, qu&#8217;ils soient dans le parc social ou dans le parc priv&#233;. Il est donc propos&#233; de ne pas r&#233;duire davantage les aides de ces m&#233;nages et d&#8217;appliquer l&#8217;article L.&#160;823&#8209;4 du CCH qui pr&#233;voit une indexation &#224; l&#8217;IRL des param&#232;tres du bar&#232;me au 1<sup>er</sup> octobre 2020.</p><p style=\"text-align: justify;\">Pour rappel, y compris la mesure RLS, l&#8217;&#233;conomie cumul&#233;e de l&#8217;&#201;tat depuis 2017 sur le budget des aides personnelles au logement est sup&#233;rieure &#224; 7 milliards d&#8217;euros.</p>",
    "annexeExposeSommaire": {
      "@xmlns:xsi": "http://www.w3.org/2001/XMLSchema-instance",
      "@xsi:nil": "true"
    },
    "cartoucheDelaiDepotDepasse": {
      "@xmlns:xsi": "http://www.w3.org/2001/XMLSchema-instance",
      "@xsi:nil": "true"
    },
    "avantAppel": {
      "@xmlns:xsi": "http://www.w3.org/2001/XMLSchema-instance",
      "@xsi:nil": "true"
    }
  },
  "representations": {
    "representation": {
      "nom": "PDF",
      "typeMime": {
        "type": "application",
        "subType": "PDF"
      },
      "statutRepresentation": {
        "verbatim": "true",
        "canonique": "true",
        "officielle": "true",
        "transcription": "false",
        "enregistrement": "false"
      },
      "repSource": {
        "@xmlns:xsi": "http://www.w3.org/2001/XMLSchema-instance",
        "@xsi:nil": "true"
      },
      "offset": {
        "@xmlns:xsi": "http://www.w3.org/2001/XMLSchema-instance",
        "@xsi:nil": "true"
      },
      "contenu": {
        "documentURI": "/15/amendements/2272C/CION_FIN/CF633.pdf"
      },
      "dateDispoRepresentation": {
        "@xmlns:xsi": "http://www.w3.org/2001/XMLSchema-instance",
        "@xsi:nil": "true"
      }
    }
  },
  "seanceDiscussion": {
    "@xmlns:xsi": "http://www.w3.org/2001/XMLSchema-instance",
    "@xsi:nil": "true"
  },
  "sort": {
    "dateSaisie": "2019-11-07T09:40:24.000+01:00",
    "sortEnSeance": "Non soutenu"
  },
  "dateDepot": "2019-10-18T02:00:00.000+02:00",
  "dateDistribution": "2019-11-06T01:00:00.000+01:00",
  "article99": "0",
  "loiReference": {
    "codeLoi": {
      "@xmlns:xsi": "http://www.w3.org/2001/XMLSchema-instance",
      "@xsi:nil": "true"
    },
    "divisionCodeLoi": {
      "@xmlns:xsi": "http://www.w3.org/2001/XMLSchema-instance",
      "@xsi:nil": "true"
    }
  }
}