{
  "@xmlns": "http://schemas.assemblee-nationale.fr/referentiel",
  "uid": "AMANR5L15SEA717460BTC0106P0D1N453",
  "identifiant": {
    "legislature": "15",
    "numero": "453",
    "numRect": "0",
    "saisine": {
      "refTexteLegislatif": "PRJLANR5L15BTC0106",
      "numeroPartiePLF": "0",
      "organeExamen": "PO717460",
      "mentionSecondeDeliberation": "0"
    }
  },
  "numeroLong": "453",
  "etapeTexte": "1ère lecture (2ème assemblée saisie)",
  "triAmendement": "azzzzs",
  "cardinaliteAmdtMultiples": "1",
  "amendementParent": {
    "@xmlns:xsi": "http://www.w3.org/2001/XMLSchema-instance",
    "@xsi:nil": "true"
  },
  "etat": "Discuté",
  "signataires": {
    "auteur": {
      "typeAuteur": "Depute",
      "acteurRef": "PA266797",
      "organeRef": {
        "@xmlns:xsi": "http://www.w3.org/2001/XMLSchema-instance",
        "@xsi:nil": "true"
      },
      "groupePolitiqueRef": "PO730934"
    },
    "cosignataires": {
      "acteurRef": "PA266797"
    },
    "texteAffichable": "M.&#160;Gosselin"
  },
  "pointeurFragmentTexte": {
    "missionVisee": {
      "@xmlns:xsi": "http://www.w3.org/2001/XMLSchema-instance",
      "@xsi:nil": "true"
    },
    "division": {
      "titre": "Article 3 bis",
      "articleDesignationCourte": "ART. 3 BIS",
      "type": "ARTICLE",
      "avant_A_Apres": "A",
      "divisionRattachee": "ARTICLE 3 BIS",
      "articleAdditionnel": {
        "@xmlns:xsi": "http://www.w3.org/2001/XMLSchema-instance",
        "@xsi:nil": "true"
      },
      "chapitreAdditionnel": {
        "@xmlns:xsi": "http://www.w3.org/2001/XMLSchema-instance",
        "@xsi:nil": "true"
      },
      "urlDivisionTexteVise": "/15/textes/0106.asp#D_Article_3_bis"
    },
    "alinea": {
      "avant_A_Apres": {
        "@xmlns:xsi": "http://www.w3.org/2001/XMLSchema-instance",
        "@xsi:nil": "true"
      },
      "numero": "3",
      "alineaDesignation": {
        "@xmlns:xsi": "http://www.w3.org/2001/XMLSchema-instance",
        "@xsi:nil": "true"
      }
    }
  },
  "corps": {
    "dispositif": "<p style=\"text-align: justify;\">Substituer &#224; l'alin&#233;a 6 les quatre alin&#233;as suivants :</p><p>&#171;&#160;III.&#160;&#8211; Chaque assembl&#233;e parlementaire s&#8217;assure de la mise en &#339;uvre d&#8217;un dialogue social, conforme au code du travail, entre les repr&#233;sentants parlementaires employeurs et les repr&#233;sentants des collaborateurs parlementaires.</p><p style=\"text-align: justify; line-height: 115%;\">&#171;&#160;Le dialogue social porte sur les conditions d&#8217;emploi des collaborateurs parlementaires et des collaborateurs de groupe parlementaire, les grilles de salaire, les conditions de recrutement, les obligations d&#233;ontologiques, le temps de travail et la s&#233;curit&#233; et la sant&#233; au travail.</p><p style=\"text-align: justify; line-height: 115%;\">&#171;&#160;Il d&#233;termine la n&#233;gociation d&#8217;accords collectifs.</p><p style=\"text-align: justify; line-height: 115%;\">&#171;&#160;Ces derniers sont rendus publics sur le site internet de chaque assembl&#233;e.&#160;&#187;</p>",
    "exposeSommaire": "<p style=\"text-align: justify;\">Les collaboratrices et collaborateurs parlementaires et de groupe parlementaire sont des salari&#233;s de droit priv&#233;. &#192; ce titre, il convient d&#8217;organiser les conditions du dialogue social entre les repr&#233;sentants des parlementaires employeurs et leurs repr&#233;sentants. Ce dialogue social doit permettre de compl&#233;ter l&#8217;encadrement de cette profession, lui donner plus de transparence aux yeux de l&#8217;opinion publique et de d&#233;finir un code de d&#233;ontologie. Cela permettra d&#8217;&#233;viter des conflits d&#8217;int&#233;r&#234;ts&#160;&#8211;&#160;par exemple dans le cas d&#8217;un temps partiel de collaborateur qui exerce un autre temps partiel pour le compte de lobbies&#160;&#8211;&#160;et de circonscrire le risque d&#8217;emplois fictifs.</p>",
    "annexeExposeSommaire": {
      "@xmlns:xsi": "http://www.w3.org/2001/XMLSchema-instance",
      "@xsi:nil": "true"
    }
  },
  "representations": {
    "representation": {
      "nom": "PDF",
      "typeMime": {
        "type": "application",
        "subType": "PDF"
      },
      "statutRepresentation": {
        "verbatim": "true",
        "canonique": "true",
        "officielle": "true",
        "transcription": "false",
        "enregistrement": "false"
      },
      "repSource": {
        "@xmlns:xsi": "http://www.w3.org/2001/XMLSchema-instance",
        "@xsi:nil": "true"
      },
      "offset": {
        "@xmlns:xsi": "http://www.w3.org/2001/XMLSchema-instance",
        "@xsi:nil": "true"
      },
      "contenu": {
        "documentURI": "/15/amendements/0106/AN/453.pdf"
      },
      "dateDispoRepresentation": {
        "@xmlns:xsi": "http://www.w3.org/2001/XMLSchema-instance",
        "@xsi:nil": "true"
      }
    }
  },
  "seanceDiscussion": "RUANR5L15S2017IDS20630",
  "sort": {
    "dateSaisie": "2017-07-27T00:24:29.000+02:00",
    "sortEnSeance": "Rejeté"
  },
  "dateDepot": "2017-07-21T02:00:00.000+02:00",
  "dateDistribution": "2017-07-24T02:00:00.000+02:00",
  "article99": "0",
  "loiReference": {
    "codeLoi": {
      "@xmlns:xsi": "http://www.w3.org/2001/XMLSchema-instance",
      "@xsi:nil": "true"
    },
    "divisionCodeLoi": {
      "@xmlns:xsi": "http://www.w3.org/2001/XMLSchema-instance",
      "@xsi:nil": "true"
    }
  }
}