{
  "@xmlns": "http://schemas.assemblee-nationale.fr/referentiel",
  "uid": "AMANR5L15SEA717460B2296P0D1N108",
  "identifiant": {
    "legislature": "15",
    "numero": "108",
    "numRect": "0",
    "saisine": {
      "refTexteLegislatif": "PRJLANR5L15B2296",
      "numeroPartiePLF": "0",
      "organeExamen": "PO717460",
      "mentionSecondeDeliberation": "1"
    }
  },
  "numeroLong": "108",
  "etapeTexte": "1ère lecture (1ère assemblée saisie)",
  "triAmendement": "ksaaaaaaaaaaaaaaaaaaaaaaaaaaaaaaaaaaaaaaaaaaaaaaaabbh",
  "cardinaliteAmdtMultiples": "1",
  "amendementParent": {
    "@xmlns:xsi": "http://www.w3.org/2001/XMLSchema-instance",
    "@xsi:nil": "true"
  },
  "etat": "Discuté",
  "signataires": {
    "auteur": {
      "typeAuteur": "Depute",
      "acteurRef": "PA718884",
      "organeRef": {
        "@xmlns:xsi": "http://www.w3.org/2001/XMLSchema-instance",
        "@xsi:nil": "true"
      },
      "groupePolitiqueRef": "PO730934"
    },
    "cosignataires": {
      "acteurRef": [
        "PA606098",
        "PA718884"
      ]
    },
    "texteAffichable": "Mme&#160;Bazin-Malgras et M.&#160;Marleix"
  },
  "pointeurFragmentTexte": {
    "missionVisee": {
      "@xmlns:xsi": "http://www.w3.org/2001/XMLSchema-instance",
      "@xsi:nil": "true"
    },
    "division": {
      "titre": "Article 52",
      "articleDesignationCourte": "ART. 52",
      "type": "ARTICLE",
      "avant_A_Apres": "A",
      "divisionRattachee": "ARTICLE 52",
      "articleAdditionnel": {
        "@xmlns:xsi": "http://www.w3.org/2001/XMLSchema-instance",
        "@xsi:nil": "true"
      },
      "chapitreAdditionnel": {
        "@xmlns:xsi": "http://www.w3.org/2001/XMLSchema-instance",
        "@xsi:nil": "true"
      },
      "urlDivisionTexteVise": "/15/textes/2296.asp#D_Article_52"
    },
    "alinea": {
      "avant_A_Apres": "Apres",
      "numero": "5",
      "alineaDesignation": {
        "@xmlns:xsi": "http://www.w3.org/2001/XMLSchema-instance",
        "@xsi:nil": "true"
      }
    }
  },
  "corps": {
    "dispositif": "<p>Apr&#232;s l&#8217;alin&#233;a&#160;5, ins&#233;rer l&#8217;alin&#233;a suivant&#160;:</p><p style=\"text-align: justify;\">&#171;&#160;1&#176;&#160;<i>bis</i> Les prestations mentionn&#233;es &#224; l&#8217;article L.&#160;511&#8209;1 du m&#234;me code&#160;;&#160;&#187;.</p><p style=\"text-align: justify;\">&#160;</p>",
    "exposeSommaire": "<p>En 2020, l&#8217;article&#160;52 conduit &#224; ce que 100 millions d&#8217;euros suppl&#233;mentaires vont &#234;tre retir&#233;s aux familles via une nouvelle sous-indexation des prestations familiales. Le quasi-gel des prestations familiales sur 2 ans devrait ainsi conduire &#224; une &#233;conomie de 400 millions d&#8217;euros aux d&#233;pens des familles.</p><p style=\"text-align: justify;\">La sous-indexation a plusieurs effets&#160;:</p><p style=\"text-align: justify;\">-&#160;Les familles les plus modestes ne sont pas &#233;pargn&#233;es dans un contexte o&#249; l&#8217;ensemble des prestations familiales (prime de naissance, allocations familiales, ARS, compl&#233;ment familial&#8230;) sont sous condition de ressources&#160;;</p><p style=\"text-align: justify;\">-&#160;Vient s&#8217;ajouter pour ces familles la d&#233;sindexation des APL pr&#233;vue par le PLF 2020, alors que les charges de logement sont le premier poste de d&#233;penses des familles&#160;;</p><p style=\"text-align: justify;\">-&#160;Ce sont les familles de 3 enfants et plus qui sont les plus touch&#233;es&#160;;</p><p style=\"text-align: justify;\">-&#160;Les familles monoparentales&#160;&#8211;&#160;pourtant cit&#233;es comme prioritaires dans le PLFSS 2020, subissent aussi de plein fouet ce quasi-gel de prestations familiales.</p><p style=\"text-align: justify;\">Pour l&#8217;ensemble de ces raisons, &#224; l&#8217;image de ce qui est envisag&#233; pour les retraites inf&#233;rieures &#224; 2&#160;000&#160;&#8364;, le pr&#233;sent amendement a pour objet de revaloriser, pour 2020, le montant de toutes les prestations familiales selon l&#8217;inflation et non pas de0,3&#160;%.</p>",
    "annexeExposeSommaire": {
      "@xmlns:xsi": "http://www.w3.org/2001/XMLSchema-instance",
      "@xsi:nil": "true"
    },
    "cartoucheDelaiDepotDepasse": {
      "@xmlns:xsi": "http://www.w3.org/2001/XMLSchema-instance",
      "@xsi:nil": "true"
    },
    "avantAppel": {
      "@xmlns:xsi": "http://www.w3.org/2001/XMLSchema-instance",
      "@xsi:nil": "true"
    }
  },
  "representations": {
    "representation": {
      "nom": "PDF",
      "typeMime": {
        "type": "application",
        "subType": "PDF"
      },
      "statutRepresentation": {
        "verbatim": "true",
        "canonique": "true",
        "officielle": "true",
        "transcription": "false",
        "enregistrement": "false"
      },
      "repSource": {
        "@xmlns:xsi": "http://www.w3.org/2001/XMLSchema-instance",
        "@xsi:nil": "true"
      },
      "offset": {
        "@xmlns:xsi": "http://www.w3.org/2001/XMLSchema-instance",
        "@xsi:nil": "true"
      },
      "contenu": {
        "documentURI": "/15/amendements/2296/AN/108.pdf"
      },
      "dateDispoRepresentation": {
        "@xmlns:xsi": "http://www.w3.org/2001/XMLSchema-instance",
        "@xsi:nil": "true"
      }
    }
  },
  "seanceDiscussion": "RUANR5L15S2020IDS21881",
  "sort": {
    "dateSaisie": "2019-10-25T19:59:57.000+02:00",
    "sortEnSeance": "Non soutenu"
  },
  "dateDepot": "2019-10-15T02:00:00.000+02:00",
  "dateDistribution": "2019-10-23T02:00:00.000+02:00",
  "article99": "0",
  "loiReference": {
    "codeLoi": {
      "@xmlns:xsi": "http://www.w3.org/2001/XMLSchema-instance",
      "@xsi:nil": "true"
    },
    "divisionCodeLoi": {
      "@xmlns:xsi": "http://www.w3.org/2001/XMLSchema-instance",
      "@xsi:nil": "true"
    }
  }
}