{
  "@xmlns": "http://schemas.assemblee-nationale.fr/referentiel",
  "uid": "AMANR5L15SEA717460BTC0902P0D1N198",
  "identifiant": {
    "legislature": "15",
    "numero": "198",
    "numRect": "0",
    "saisine": {
      "refTexteLegislatif": "PRJLANR5L15BTC0902",
      "numeroPartiePLF": "0",
      "organeExamen": "PO717460",
      "mentionSecondeDeliberation": "0"
    }
  },
  "numeroLong": "198",
  "etapeTexte": "1ère lecture (1ère assemblée saisie)",
  "triAmendement": "bvozzzzo",
  "cardinaliteAmdtMultiples": "1",
  "amendementParent": {
    "@xmlns:xsi": "http://www.w3.org/2001/XMLSchema-instance",
    "@xsi:nil": "true"
  },
  "etat": "Discuté",
  "signataires": {
    "auteur": {
      "typeAuteur": "Depute",
      "acteurRef": "PA267429",
      "organeRef": {
        "@xmlns:xsi": "http://www.w3.org/2001/XMLSchema-instance",
        "@xsi:nil": "true"
      },
      "groupePolitiqueRef": "PO730934"
    },
    "cosignataires": {
      "acteurRef": [
        "PA267200",
        "PA718884",
        "PA607090",
        "PA267289",
        "PA267735",
        "PA605036",
        "PA718850",
        "PA267260",
        "PA267429",
        "PA1874",
        "PA720210",
        "PA642847",
        "PA721968",
        "PA719318",
        "PA721046",
        "PA266793",
        "PA608016",
        "PA330909",
        "PA718838",
        "PA609245",
        "PA340853",
        "PA334654",
        "PA608416"
      ]
    },
    "texteAffichable": "M.&#160;Cinieri,  M.&#160;Abad, M.&#160;Brun, M.&#160;Cordier, Mme&#160;Louwagie, Mme&#160;Poletti, Mme&#160;Anthoine, M.&#160;Bazin, Mme&#160;Bazin-Malgras, M.&#160;Jean-Pierre&#160;Vigier, M.&#160;Le Fur, M.&#160;Leclerc, M.&#160;Bony, M.&#160;de Ganay, M.&#160;Hetzel, M.&#160;Huyghe, Mme&#160;Lacroute, M.&#160;Descoeur, M.&#160;Door, Mme&#160;Bassire, Mme&#160;Beauvais, M.&#160;Straumann et M.&#160;Vialay"
  },
  "pointeurFragmentTexte": {
    "missionVisee": {
      "@xmlns:xsi": "http://www.w3.org/2001/XMLSchema-instance",
      "@xsi:nil": "true"
    },
    "division": {
      "titre": "Article 11",
      "articleDesignationCourte": "ART. 11",
      "type": "ARTICLE",
      "avant_A_Apres": "A",
      "divisionRattachee": "ARTICLE 11",
      "articleAdditionnel": {
        "@xmlns:xsi": "http://www.w3.org/2001/XMLSchema-instance",
        "@xsi:nil": "true"
      },
      "chapitreAdditionnel": {
        "@xmlns:xsi": "http://www.w3.org/2001/XMLSchema-instance",
        "@xsi:nil": "true"
      },
      "urlDivisionTexteVise": "/15/textes/0902.asp#D_Article_11"
    },
    "alinea": {
      "avant_A_Apres": {
        "@xmlns:xsi": "http://www.w3.org/2001/XMLSchema-instance",
        "@xsi:nil": "true"
      },
      "numero": "5",
      "alineaDesignation": {
        "@xmlns:xsi": "http://www.w3.org/2001/XMLSchema-instance",
        "@xsi:nil": "true"
      }
    }
  },
  "corps": {
    "dispositif": "<p style=\"text-align: justify;\">&#192;&#160;l&#8217;alin&#233;a&#160;5, substituer &#224; la premi&#232;re occurrence du mot&#160;:</p><p style=\"text-align: justify;\">&#171;&#160;&#224;&#160;&#187;</p><p style=\"text-align: justify;\">les mots&#160;:</p><p style=\"text-align: justify;\">&#171;&#160;aux&#160;1&#176; et&#160;2&#176; de&#160;&#187;.</p>",
    "exposeSommaire": "<p style=\"text-align: justify;\">Amendement de pr&#233;cision.</p><p style=\"text-align: justify;\">L&#8217;objectif annonc&#233; par le Pr&#233;sident de la R&#233;publique depuis le d&#233;but des &#201;tats g&#233;n&#233;raux de l&#8217;alimentation est de favoriser les produits locaux, biologiques et sous-signes officiels de qualit&#233; en restauration collective publique et territoriale.</p><p style=\"text-align: justify;\">Or, l&#8217;article L.&#160;640&#8209;2 du code rural auquel il est fait r&#233;f&#233;rence pour d&#233;signer les signes de qualit&#233; est tr&#232;s large, et pr&#233;voit notamment au&#160;3&#176;&#160;:&#171;&#160;La d&#233;marche de certification des produits&#160;&#187;, qui ne correspond pas &#224; un signe officiel de qualit&#233;. C&#8217;est pourquoi elle doit &#234;tre exclue du dispositif pr&#233;vu &#224; l&#8217;article&#160;11. C&#8217;est le&#160;1&#176; de cet article du code rural qui d&#233;signe les signes officiels d&#8217;identification de la qualit&#233; et de l&#8217;origine, tandis que le&#160;2&#176; d&#233;signe des mentions valorisantes.</p><p style=\"text-align: justify;\">En effet, les discussions sur l&#8217;int&#233;gration de produits locaux/BIO/SIQO en restauration collective n&#8217;ont toujours port&#233; que sur des produits locaux ou biologiques ou sous signes officiels de qualit&#233; (Label Rouge, IGP, AOC), et pas sur d&#8217;autres mentions comme la d&#233;marche de certification des produits. Il est donc &#233;tonnant qu&#8217;elle n&#8217;ait pas &#233;t&#233; exclue du projet.</p><p style=\"text-align: justify;\">D&#8217;ailleurs, si les produits sous &#171;&#160;d&#233;marche de certification des produits&#160;&#187; &#233;taient concern&#233;s par l&#8217;objectif, &#233;tant donn&#233; leur moindre co&#251;t de revient, alors ils remplaceraient compl&#233;tement en restauration les produits locaux/BIO/SIQO, et cette loi n&#8217;aurait alors aucun effet positif.</p>",
    "annexeExposeSommaire": {
      "@xmlns:xsi": "http://www.w3.org/2001/XMLSchema-instance",
      "@xsi:nil": "true"
    }
  },
  "representations": {
    "representation": {
      "nom": "PDF",
      "typeMime": {
        "type": "application",
        "subType": "PDF"
      },
      "statutRepresentation": {
        "verbatim": "true",
        "canonique": "true",
        "officielle": "true",
        "transcription": "false",
        "enregistrement": "false"
      },
      "repSource": {
        "@xmlns:xsi": "http://www.w3.org/2001/XMLSchema-instance",
        "@xsi:nil": "true"
      },
      "offset": {
        "@xmlns:xsi": "http://www.w3.org/2001/XMLSchema-instance",
        "@xsi:nil": "true"
      },
      "contenu": {
        "documentURI": "/15/amendements/0902/AN/198.pdf"
      },
      "dateDispoRepresentation": {
        "@xmlns:xsi": "http://www.w3.org/2001/XMLSchema-instance",
        "@xsi:nil": "true"
      }
    }
  },
  "seanceDiscussion": "RUANR5L15S2018IDS21056",
  "sort": {
    "dateSaisie": "2018-05-26T00:04:14.000+02:00",
    "sortEnSeance": "Rejeté"
  },
  "dateDepot": "2018-04-30T02:00:00.000+02:00",
  "dateDistribution": "2018-05-22T02:00:00.000+02:00",
  "article99": "0",
  "loiReference": {
    "codeLoi": {
      "@xmlns:xsi": "http://www.w3.org/2001/XMLSchema-instance",
      "@xsi:nil": "true"
    },
    "divisionCodeLoi": {
      "@xmlns:xsi": "http://www.w3.org/2001/XMLSchema-instance",
      "@xsi:nil": "true"
    }
  }
}