{
  "@xmlns": "http://schemas.assemblee-nationale.fr/referentiel",
  "uid": "AMANR5L15SEA717460BTC0971P0D1N2982",
  "identifiant": {
    "legislature": "15",
    "numero": "2982",
    "numRect": "0",
    "saisine": {
      "refTexteLegislatif": "PRJLANR5L15BTC0971",
      "numeroPartiePLF": "0",
      "organeExamen": "PO717460",
      "mentionSecondeDeliberation": "0"
    }
  },
  "numeroLong": "2982",
  "etapeTexte": "1ère lecture (1ère assemblée saisie)",
  "triAmendement": "bb",
  "cardinaliteAmdtMultiples": "1",
  "amendementParent": {
    "@xmlns:xsi": "http://www.w3.org/2001/XMLSchema-instance",
    "@xsi:nil": "true"
  },
  "etat": "Discuté",
  "signataires": {
    "auteur": {
      "typeAuteur": "Depute",
      "acteurRef": "PA719718",
      "organeRef": {
        "@xmlns:xsi": "http://www.w3.org/2001/XMLSchema-instance",
        "@xsi:nil": "true"
      },
      "groupePolitiqueRef": "PO730964"
    },
    "cosignataires": {
      "acteurRef": [
        "PA721600",
        "PA719728",
        "PA720414",
        "PA606639",
        "PA719718",
        "PA718710",
        "PA720538",
        "PA721876",
        "PA720190",
        "PA719790",
        "PA719756",
        "PA718810",
        "PA721844",
        "PA719850"
      ]
    },
    "texteAffichable": "Mme&#160;Maillart-M&#233;haignerie,  Mme&#160;Motin, M.&#160;Sorre, Mme&#160;Mireille&#160;Robert, M.&#160;Le Bohec, M.&#160;Morenas, Mme&#160;Rossi, Mme&#160;Piron, Mme&#160;Cloarec, M.&#160;Vignal, Mme&#160;Pascale&#160;Boyer, Mme&#160;De Temmerman, M.&#160;Perrot et M.&#160;Chalumeau"
  },
  "pointeurFragmentTexte": {
    "missionVisee": {
      "@xmlns:xsi": "http://www.w3.org/2001/XMLSchema-instance",
      "@xsi:nil": "true"
    },
    "division": {
      "titre": "Article 59",
      "articleDesignationCourte": "ART. 59",
      "type": "ARTICLE",
      "avant_A_Apres": "A",
      "divisionRattachee": "ARTICLE 59",
      "articleAdditionnel": {
        "@xmlns:xsi": "http://www.w3.org/2001/XMLSchema-instance",
        "@xsi:nil": "true"
      },
      "chapitreAdditionnel": {
        "@xmlns:xsi": "http://www.w3.org/2001/XMLSchema-instance",
        "@xsi:nil": "true"
      },
      "urlDivisionTexteVise": "/15/textes/0971.asp#D_Article_59"
    },
    "alinea": {
      "avant_A_Apres": "Apres",
      "numero": "2",
      "alineaDesignation": {
        "@xmlns:xsi": "http://www.w3.org/2001/XMLSchema-instance",
        "@xsi:nil": "true"
      }
    }
  },
  "corps": {
    "dispositif": "<p>Apr&#232;s l&#8217;alin&#233;a&#160;2, ins&#233;rer l&#8217;alin&#233;a suivant&#160;:</p><p>&#171;&#160;1&#176;&#160;<i>bis</i>&#160;Au&#160;V de l&#8217;article L.&#160;615&#8209;1, les mots&#160;: &#171;&#160;ne&#160;&#187; et &#171;&#160;pas&#160;&#187; sont supprim&#233;s&#160;;&#160;&#187;</p>",
    "exposeSommaire": "<p style=\"text-align: justify;\">L&#8217;article&#160;59 du projet de loi a pour objectif d&#8217;assurer un meilleur traitement des copropri&#233;t&#233;s d&#233;grad&#233;s. Parmi les outils pr&#233;vus &#224; cet effet figure le plan de sauvegarde pr&#233;vu &#224; l&#8217;article L.&#160;615&#8209;1 du Code de la construction et de l&#8217;habitation.</p><p style=\"text-align: justify;\">Cet article mentionne toutefois explicitement que les plans de sauvegarde ne trouvent pas &#224; s&#8217;appliquer &#171;&#160;aux immeubles appartenant en totalit&#233; aux organismes d&#8217;habitations &#224; loyer mod&#233;r&#233;&#160;&#187;. Cette exception est regrettable, dans la mesure o&#249; il n&#8217;est pas rare que des immeubles du parc social se d&#233;gradent sans qu&#8217;ils ne re&#231;oivent l&#8217;entretien n&#233;cessaire. Ces situations nuisent avant tout aux habitants des logements sociaux, qui n&#8217;ont alors pas acc&#232;s au cadre de vie, &#224; la salubrit&#233; et &#224; la s&#233;curit&#233; qu&#8217;ils sont en droit d&#8217;attendre de leurs bailleurs.</p><p style=\"text-align: justify;\">C&#8217;est pourquoi le pr&#233;sent amendement propose non seulement de supprimer cette exception au profit des bailleurs sociaux, mais &#233;galement d&#8217;inclure de mani&#232;re explicite ces derniers dans le p&#233;rim&#232;tre des plans de sauvegarde.</p>",
    "annexeExposeSommaire": {
      "@xmlns:xsi": "http://www.w3.org/2001/XMLSchema-instance",
      "@xsi:nil": "true"
    }
  },
  "representations": {
    "representation": {
      "nom": "PDF",
      "typeMime": {
        "type": "application",
        "subType": "PDF"
      },
      "statutRepresentation": {
        "verbatim": "true",
        "canonique": "true",
        "officielle": "true",
        "transcription": "false",
        "enregistrement": "false"
      },
      "repSource": {
        "@xmlns:xsi": "http://www.w3.org/2001/XMLSchema-instance",
        "@xsi:nil": "true"
      },
      "offset": {
        "@xmlns:xsi": "http://www.w3.org/2001/XMLSchema-instance",
        "@xsi:nil": "true"
      },
      "contenu": {
        "documentURI": "/15/amendements/0971/AN/2982.pdf"
      },
      "dateDispoRepresentation": {
        "@xmlns:xsi": "http://www.w3.org/2001/XMLSchema-instance",
        "@xsi:nil": "true"
      }
    }
  },
  "seanceDiscussion": "RUANR5L15S2018IDS21139",
  "sort": {
    "dateSaisie": "2018-06-09T00:37:38.000+02:00",
    "sortEnSeance": "Rejeté"
  },
  "dateDepot": "2018-05-26T02:00:00.000+02:00",
  "dateDistribution": "2018-06-01T02:00:00.000+02:00",
  "article99": "0",
  "loiReference": {
    "codeLoi": {
      "@xmlns:xsi": "http://www.w3.org/2001/XMLSchema-instance",
      "@xsi:nil": "true"
    },
    "divisionCodeLoi": {
      "@xmlns:xsi": "http://www.w3.org/2001/XMLSchema-instance",
      "@xsi:nil": "true"
    }
  }
}