{
  "@xmlns": "http://schemas.assemblee-nationale.fr/referentiel",
  "uid": "AMANR5L15SEA717460B1255P2D1N1484",
  "identifiant": {
    "legislature": "15",
    "numero": "1484",
    "numRect": "0",
    "saisine": {
      "refTexteLegislatif": "PRJLANR5L15B1255",
      "numeroPartiePLF": "2",
      "organeExamen": "PO717460",
      "mentionSecondeDeliberation": "0"
    }
  },
  "numeroLong": "II-1484",
  "etapeTexte": "1ère lecture (1ère assemblée saisie)",
  "triAmendement": "euaaaaaaaaaaaaaaaaaaaaaaaaaaaaaaaaaaaaaaaaaaaaaaaacjd",
  "cardinaliteAmdtMultiples": "1",
  "amendementParent": {
    "@xmlns:xsi": "http://www.w3.org/2001/XMLSchema-instance",
    "@xsi:nil": "true"
  },
  "etat": "Discuté",
  "signataires": {
    "auteur": {
      "typeAuteur": "Depute",
      "acteurRef": "PA642847",
      "organeRef": {
        "@xmlns:xsi": "http://www.w3.org/2001/XMLSchema-instance",
        "@xsi:nil": "true"
      },
      "groupePolitiqueRef": "PO730934"
    },
    "cosignataires": {
      "acteurRef": "PA642847"
    },
    "texteAffichable": "M.&#160;Bazin"
  },
  "pointeurFragmentTexte": {
    "missionVisee": {
      "@xmlns:xsi": "http://www.w3.org/2001/XMLSchema-instance",
      "@xsi:nil": "true"
    },
    "division": {
      "titre": "Article 55",
      "articleDesignationCourte": "APRÈS ART. 55",
      "type": "ARTICLE",
      "avant_A_Apres": "Après",
      "divisionRattachee": "APRÈS L'ARTICLE 55, insérer l'article suivant:",
      "articleAdditionnel": "1",
      "chapitreAdditionnel": {
        "@xmlns:xsi": "http://www.w3.org/2001/XMLSchema-instance",
        "@xsi:nil": "true"
      },
      "urlDivisionTexteVise": "/15/textes/1255C.asp#D_Article_55"
    },
    "alinea": {
      "@xmlns:xsi": "http://www.w3.org/2001/XMLSchema-instance",
      "@xsi:nil": "true"
    }
  },
  "corps": {
    "dispositif": "<p>I.&#160;&#8211;&#160;L&#8217;article&#160;210 E du code g&#233;n&#233;ral des imp&#244;ts est ainsi modifi&#233;&#160;:</p><p>A.&#160;&#8211;&#160;Le IV est ainsi modifi&#233;&#160;:</p><p>1&#176; Au premier alin&#233;a, le mot&#160;: &#171;&#160;septi&#232;me&#160;&#187; est remplac&#233; par le mot&#160;: &#171;&#160;neuvi&#232;me&#160;&#187;&#160;;</p><p>2&#176; Il est compl&#233;t&#233; par un alin&#233;a ainsi r&#233;dig&#233;&#160;:</p><p style=\"text-align: justify;\">&#171;&#160;En cas de fusion, l&#8217;engagement souscrit par l&#8216;organisme absorb&#233; n&#8217;est pas rompu lorsque l&#8217;organisme absorbant s&#8217;engage, dans l&#8217;acte de fusion, &#224; se substituer &#224; l&#8217;organisme absorb&#233; pour le respect de l&#8217;engagement dans le d&#233;lai restant &#224; courir.&#160;&#187;&#160;;</p><p style=\"text-align: justify;\">2&#176;&#160;Le V est compl&#233;t&#233; par un alin&#233;a ainsi r&#233;dig&#233;&#160;:</p><p style=\"text-align: justify;\">&#171;&#160;Le IV s&#8217;applique &#233;galement aux cessions r&#233;alis&#233;es entre le 1<sup>er</sup> janvier 2020 et le 31 d&#233;cembre 2022&#160;&#187;.</p><p style=\"text-align: justify;\">II.&#160;&#8211;&#160;La perte de recettes pour l&#8217;&#201;tat est compens&#233;e &#224; due concurrence par la cr&#233;ation d&#8217;une taxe additionnelle aux droits mentionn&#233;s aux articles 575 et 575 A du code g&#233;n&#233;ral des imp&#244;ts.</p>",
    "exposeSommaire": "<p style=\"text-align: justify;\">Afin d&#8217;inciter les entreprises &#224; vendre des biens immobiliers en vue de favoriser la cr&#233;ation de logement, la loi de finances pour 2018 a instaur&#233; un taux r&#233;duit d&#8217;imp&#244;t sur les soci&#233;t&#233;s (IS) de 19&#160;% sur les plus-values r&#233;alis&#233;es jusqu&#8217;au 31 d&#233;cembre 2022 sous condition d&#8217;un engagement de construction ou de transformation des biens vendus en logements dans un d&#233;lai de quatre ans.</p><p style=\"text-align: justify;\">Le pr&#233;sent amendement propose de compl&#233;ter ce dispositif en pr&#233;voyant l&#8217;application du taux de 19&#160;% sur les plus-values immobili&#232;res r&#233;alis&#233;es par les organismes Hlm &#224; l&#8217;occasion de ventes de locaux commerciaux, sous condition de r&#233;investissement, dans un d&#233;lai de 4 ans, dans la construction, l&#8217;acquisition, la r&#233;habilitation ou la r&#233;novation de logements locatifs sociaux</p><p style=\"text-align: justify;\">Ce r&#233;gime de taxation r&#233;duite sur les plus-values des organismes HLM a d&#233;j&#224; exist&#233; entre 2006 et 2010. Il parait opportun de le remettre en place aujourd&#8217;hui, jusqu&#8217;en 2022, sachant que la loi Elan comprend plusieurs mesures incitant les organismes Hlm &#224; se regrouper et se restructurer&#160;&#8211;&#160;ce qui va se traduire notamment par des cessions de patrimoine. Dans ce cadre, il parait utile de r&#233;orienter les plus-values g&#233;n&#233;r&#233;es par les cessions de locaux commerciaux sur la construction de logements locatifs sociaux.</p><p style=\"text-align: justify;\">(la r&#233;f&#233;rence au neuvi&#232;me alin&#233;a de l&#8217;article L 411&#8209;2 du CCH renvoie &#224; l&#8217;article L 411&#8209;2 dans sa version post loi Elan)</p>",
    "annexeExposeSommaire": {
      "@xmlns:xsi": "http://www.w3.org/2001/XMLSchema-instance",
      "@xsi:nil": "true"
    },
    "cartoucheDelaiDepotDepasse": {
      "@xmlns:xsi": "http://www.w3.org/2001/XMLSchema-instance",
      "@xsi:nil": "true"
    }
  },
  "representations": {
    "representation": {
      "nom": "PDF",
      "typeMime": {
        "type": "application",
        "subType": "PDF"
      },
      "statutRepresentation": {
        "verbatim": "true",
        "canonique": "true",
        "officielle": "true",
        "transcription": "false",
        "enregistrement": "false"
      },
      "repSource": {
        "@xmlns:xsi": "http://www.w3.org/2001/XMLSchema-instance",
        "@xsi:nil": "true"
      },
      "offset": {
        "@xmlns:xsi": "http://www.w3.org/2001/XMLSchema-instance",
        "@xsi:nil": "true"
      },
      "contenu": {
        "documentURI": "/15/amendements/1255C/AN/1484.pdf"
      },
      "dateDispoRepresentation": {
        "@xmlns:xsi": "http://www.w3.org/2001/XMLSchema-instance",
        "@xsi:nil": "true"
      }
    }
  },
  "seanceDiscussion": "RUANR5L15S2019IDS21343",
  "sort": {
    "dateSaisie": "2018-11-15T22:13:47.000+01:00",
    "sortEnSeance": "Non soutenu"
  },
  "dateDepot": "2018-11-06T01:00:00.000+01:00",
  "dateDistribution": "2018-11-14T01:00:00.000+01:00",
  "article99": "0",
  "loiReference": {
    "codeLoi": "CGI",
    "divisionCodeLoi": "210 E"
  }
}