{
  "@xmlns": "http://schemas.assemblee-nationale.fr/referentiel",
  "uid": "AMANR5L15SEA717460B1490P0D1N365",
  "identifiant": {
    "legislature": "15",
    "numero": "365",
    "numRect": "0",
    "saisine": {
      "refTexteLegislatif": "PRJLANR5L15B1490",
      "numeroPartiePLF": "0",
      "organeExamen": "PO717460",
      "mentionSecondeDeliberation": "0"
    }
  },
  "numeroLong": "365",
  "etapeTexte": "Nouvelle Lecture",
  "triAmendement": "ebaaaaaaaaaaaaaaaaaaaaaaaaaaaaaaaaaaaaaaaaaaaaaaaaqrn",
  "cardinaliteAmdtMultiples": "1",
  "amendementParent": {
    "@xmlns:xsi": "http://www.w3.org/2001/XMLSchema-instance",
    "@xsi:nil": "true"
  },
  "etat": "Discuté",
  "signataires": {
    "auteur": {
      "typeAuteur": "Depute",
      "acteurRef": "PA719930",
      "organeRef": {
        "@xmlns:xsi": "http://www.w3.org/2001/XMLSchema-instance",
        "@xsi:nil": "true"
      },
      "groupePolitiqueRef": "PO758835"
    },
    "cosignataires": {
      "acteurRef": [
        "PA340357",
        "PA1198",
        "PA609332",
        "PA610681",
        "PA335532",
        "PA608172",
        "PA332614",
        "PA608011",
        "PA605069",
        "PA720988",
        "PA609590",
        "PA608695",
        "PA607553",
        "PA643145",
        "PA335054",
        "PA1008",
        "PA429893",
        "PA333285",
        "PA608741",
        "PA1592",
        "PA642764",
        "PA337483",
        "PA340343",
        "PA1809",
        "PA333818",
        "PA508",
        "PA719930",
        "PA342415",
        "PA267233"
      ]
    },
    "texteAffichable": "M.&#160;Vallaud,  M.&#160;Aviragnet, Mme&#160;Bareigts, Mme&#160;Bi&#233;mouret, Mme&#160;Battistel, M.&#160;Bouillon, M.&#160;Jean-Louis&#160;Bricout, M.&#160;Carvounas, M.&#160;Alain&#160;David, Mme&#160;Laurence&#160;Dumont, M.&#160;Faure, M.&#160;Garot, M.&#160;David&#160;Habib, M.&#160;Hutin, M.&#160;Juanico, Mme&#160;Karamanli, M.&#160;J&#233;r&#244;me&#160;Lambert, M.&#160;Letchimy, Mme&#160;Manin, Mme&#160;Pau-Langevin, Mme&#160;Pires Beaune, M.&#160;Potier, M.&#160;Pueyo, Mme&#160;Rabault, M.&#160;Saulignac, Mme&#160;Tolmont, Mme&#160;Untermaier, Mme&#160;Vainqueur-Christophe et Mme&#160;Victory"
  },
  "pointeurFragmentTexte": {
    "missionVisee": {
      "idMissionAN": "727",
      "libelleMission": "Travail et emploi",
      "codeMissionPLF": "B",
      "libelleMissionPLF": "Répartition, par mission et programme, des crédits du budget général"
    },
    "division": {
      "titre": "ÉTAT B",
      "articleDesignationCourte": "ART. 39",
      "type": "ANNEXE",
      "avant_A_Apres": "A",
      "divisionRattachee": "ARTICLE 39",
      "articleAdditionnel": {
        "@xmlns:xsi": "http://www.w3.org/2001/XMLSchema-instance",
        "@xsi:nil": "true"
      },
      "chapitreAdditionnel": {
        "@xmlns:xsi": "http://www.w3.org/2001/XMLSchema-instance",
        "@xsi:nil": "true"
      },
      "urlDivisionTexteVise": "/15/textes/1490.asp#D_Etat_B"
    },
    "alinea": {
      "@xmlns:xsi": "http://www.w3.org/2001/XMLSchema-instance",
      "@xsi:nil": "true"
    }
  },
  "corps": {
    "exposeSommaire": "<p style=\"text-align: justify;\">Les derniers&#160;chiffres du ch&#244;mage montrent qu&#8217;il y a&#160;22 000 demandeurs d&#8217;emploi en plus, toutes cat&#233;gories confondues, depuis un an&#160;; 16&#160;000 demandeurs d&#8217;emploi en contrats pr&#233;caires en plus en un an et&#160;3 100 entr&#233;es en formation en moins en 2018 par rapport &#224; 2017.</p><p style=\"text-align: justify;\">Sur le front de l&#8217;emploi, ces chiffres montrent que vous avez baiss&#233; la garde.&#160;En baissant drastiquement et id&#233;ologiquement le nombre de contrats aid&#233;s, vous avez fragilis&#233; des secteurs entiers. Dans le monde associatif,&#160;12 500 employeurs associatifs ont disparu et 2&#160;% des clubs sportifs vont dispara&#238;tre en 2018. Le gel des contrats aid&#233;s repr&#233;sentent 1,3 milliard d&#8217;euros d&#8217;impact budg&#233;taire pour les associations. Dans les Ehpad, les contrats aid&#233;s qui &#233;taient financ&#233;s &#224; 80 ou 90&#160;% par l&#8217;&#201;tat ne le sont plus qu&#8217;&#224; hauteur de 40&#160;% avec les PEC et les &#233;tablissements doivent donc trouver des ressources internes pour les financer. Dans les centres sociaux, ce sont 313 activit&#233;s &#171;&#160;petite enfance&#160;&#187; d&#233;stabilis&#233;es et 344 activit&#233;s &#171;&#160;jeunesse&#160;&#187;qui se sont arr&#234;t&#233;es. La liste est longue et nous ne connaissons pas un jour en circonscription sans que des personnes viennent nous faire part des effets terribles de votre politique sur nos territoires.&#160;</p><p style=\"text-align: justify;\">Vous me r&#233;pondrez que vous avez supprim&#233; des contrats qui, selon vous, ne fonctionnaient pas pour leur pr&#233;f&#233;rer un contrat d&#8217;un nouveau genre&#160;: le parcours emploi comp&#233;tence. Pourtant le d&#233;collage de ce nouveau dispositif est tr&#232;s faible&#160;: sur une enveloppe fix&#233;e &#224; 200 000 contrats en loi de finances initiale l&#8217;ann&#233;e derni&#232;re, 20&#160;% &#233;tait consomm&#233;e en mai dernier contre 40&#160;% pour les anciens contrats aid&#233;s. Cela s&#8217;explique par le faible taux de prise en charge par l&#8217;&#201;tat, 40&#160;% en moyenne contre 75&#160;% auparavant&#160;; par l&#8217;&#8217;instauration d&#8217;une obligation de formation qui n&#8217;est pas financ&#233;e et par des publics exclus du dispositif, je pense aux jeunes sans exp&#233;rience et aux s&#233;niors &#224; qui les contrats aid&#233;s permettaient de terminer utilement une vie professionnelle.&#160;</p><p style=\"text-align: justify;\">Mais si j&#8217;en crois la lecture de vos documents budg&#233;taires, vous partagez cette analyse Madame la Ministre puisque vous pr&#233;voyez non pas 200 000 parcours emploi comp&#233;tences pour l&#8217;ann&#233;e prochaine, comme cela avait &#233;t&#233; annonc&#233; dans la loi de finances 2018, mais seulement 100 000 nouveaux pour 2019.</p><p style=\"text-align: justify;\">Pour que le gouvernement puisse tenir ces engagements,&#160;le groupe Socialistes et apparent&#233;s propose la cr&#233;ation de 100 000 contrats aid&#233;s suppl&#233;mentaires et ce conform&#233;ment aux annonces faites dans le cadre de notre contrat budget.&#160;</p><p style=\"text-align: justify;\">Pour des raisons constitutionnelles li&#233;es &#224; l&#8217;application de l&#8217;article&#160;40 de la Constitution, nous proposons d&#8217;abonder &#224; hauteur de 380,89M&#8364; en AE et 189,58 M&#8364; en CP&#160;les cr&#233;dits de l&#8217;action n&#176;2 &#171;&#160;Am&#233;lioration des dispositifs en faveur de l&#8217;emploi des personnes les plus &#233;loign&#233;es du march&#233; du travail&#160;&#187; du programme 102 &#171;&#160;Acc&#232;s et retour &#224; l&#8217;emploi en r&#233;duisant d&#8217;autant les cr&#233;dits de l&#8217;action 4&#160;&#187;Plan d&#8217;investissement des comp&#233;tences&#171;&#160;du programme 103&#160;&#187;Accompagnement des mutations &#233;conomiques et d&#233;veloppement de l&#8217;emploi&#171;&#160;.&#160;</p>",
    "annexeExposeSommaire": {
      "@xmlns:xsi": "http://www.w3.org/2001/XMLSchema-instance",
      "@xsi:nil": "true"
    },
    "cartoucheDelaiDepotDepasse": {
      "@xmlns:xsi": "http://www.w3.org/2001/XMLSchema-instance",
      "@xsi:nil": "true"
    },
    "dispositifAmdtCredit": {
      "listeProgrammes": {
        "programme": [
          {
            "libelle": "Accès et retour à l'emploi",
            "id": "55303",
            "AE": {
              "montantPositif": "380890000",
              "montantNegatif": "0"
            },
            "CP": {
              "montantPositif": "189580000",
              "montantNegatif": "0"
            },
            "action": "modification",
            "lignesCredits": null
          },
          {
            "libelle": "Accompagnement des mutations économiques et développement de l'emploi",
            "id": "55304",
            "AE": {
              "montantPositif": "0",
              "montantNegatif": "380890000"
            },
            "CP": {
              "montantPositif": "0",
              "montantNegatif": "189580000"
            },
            "action": "modification",
            "lignesCredits": null
          },
          {
            "libelle": "Amélioration de la qualité de l'emploi et des relations du travail",
            "id": "55305",
            "AE": {
              "montantPositif": "0",
              "montantNegatif": "0"
            },
            "CP": {
              "montantPositif": "0",
              "montantNegatif": "0"
            },
            "action": "modification",
            "lignesCredits": null
          },
          {
            "libelle": "Conception, gestion et évaluation des politiques de l'emploi et du travail",
            "id": "55306",
            "AE": {
              "montantPositif": "0",
              "montantNegatif": "0"
            },
            "CP": {
              "montantPositif": "0",
              "montantNegatif": "0"
            },
            "action": "modification",
            "lignesCredits": null
          },
          {
            "libelle": "Maisons de l'emploi",
            "id": "55307",
            "AE": {
              "montantPositif": "0",
              "montantNegatif": "0"
            },
            "CP": {
              "montantPositif": "0",
              "montantNegatif": "0"
            },
            "action": "modification",
            "lignesCredits": null
          }
        ]
      },
      "totalAE": {
        "montantPositif": "380890000",
        "montantNegatif": "380890000",
        "solde": "0"
      },
      "totalCP": {
        "montantPositif": "189580000",
        "montantNegatif": "189580000",
        "solde": "0"
      }
    }
  },
  "representations": {
    "representation": {
      "nom": "PDF",
      "typeMime": {
        "type": "application",
        "subType": "PDF"
      },
      "statutRepresentation": {
        "verbatim": "true",
        "canonique": "true",
        "officielle": "true",
        "transcription": "false",
        "enregistrement": "false"
      },
      "repSource": {
        "@xmlns:xsi": "http://www.w3.org/2001/XMLSchema-instance",
        "@xsi:nil": "true"
      },
      "offset": {
        "@xmlns:xsi": "http://www.w3.org/2001/XMLSchema-instance",
        "@xsi:nil": "true"
      },
      "contenu": {
        "documentURI": "/15/amendements/1490/AN/365.pdf"
      },
      "dateDispoRepresentation": {
        "@xmlns:xsi": "http://www.w3.org/2001/XMLSchema-instance",
        "@xsi:nil": "true"
      }
    }
  },
  "seanceDiscussion": "RUANR5L15S2019IDS21433",
  "sort": {
    "dateSaisie": "2018-12-19T02:46:26.000+01:00",
    "sortEnSeance": "Rejeté"
  },
  "dateDepot": "2018-12-14T01:00:00.000+01:00",
  "dateDistribution": "2018-12-19T01:00:00.000+01:00",
  "article99": "0",
  "loiReference": {
    "codeLoi": {
      "@xmlns:xsi": "http://www.w3.org/2001/XMLSchema-instance",
      "@xsi:nil": "true"
    },
    "divisionCodeLoi": {
      "@xmlns:xsi": "http://www.w3.org/2001/XMLSchema-instance",
      "@xsi:nil": "true"
    }
  }
}