{
  "@xmlns": "http://schemas.assemblee-nationale.fr/referentiel",
  "uid": "AMANR5L15SEA717460BTC1924P0D1N428",
  "identifiant": {
    "legislature": "15",
    "numero": "428",
    "numRect": "0",
    "saisine": {
      "refTexteLegislatif": "PRJLANR5L15BTC1924",
      "numeroPartiePLF": "0",
      "organeExamen": "PO717460",
      "mentionSecondeDeliberation": "0"
    }
  },
  "numeroLong": "428",
  "etapeTexte": "1ère lecture (1ère assemblée saisie)",
  "triAmendement": "ebaaaaaaaaaaaaaaaaaaaaaaaaaaaaaaaaaaaaaaaaaaaaaaaabkai",
  "cardinaliteAmdtMultiples": "1",
  "amendementParent": {
    "@xmlns:xsi": "http://www.w3.org/2001/XMLSchema-instance",
    "@xsi:nil": "true"
  },
  "etat": "Discuté",
  "signataires": {
    "auteur": {
      "typeAuteur": "Depute",
      "acteurRef": "PA718850",
      "organeRef": {
        "@xmlns:xsi": "http://www.w3.org/2001/XMLSchema-instance",
        "@xsi:nil": "true"
      },
      "groupePolitiqueRef": "PO730934"
    },
    "cosignataires": {
      "acteurRef": [
        "PA608016",
        "PA643089",
        "PA718838",
        "PA340853",
        "PA643103",
        "PA266793",
        "PA334654",
        "PA721678",
        "PA267429",
        "PA267289",
        "PA1874",
        "PA718884",
        "PA346218",
        "PA643134",
        "PA719318",
        "PA267204",
        "PA718850",
        "PA606712",
        "PA998"
      ]
    },
    "texteAffichable": "M.&#160;Cordier,  M.&#160;Cinieri, M.&#160;Leclerc, M.&#160;Bony, M.&#160;Lurton, M.&#160;Masson, Mme&#160;Bazin-Malgras, Mme&#160;Anthoine, M.&#160;Thi&#233;riot, M.&#160;Dassault, M.&#160;Door, M.&#160;Straumann, Mme&#160;Valentin, M.&#160;Sermier, M.&#160;Le Fur, M.&#160;Brun, Mme&#160;Louwagie, M.&#160;Reda et M.&#160;Ferrara"
  },
  "pointeurFragmentTexte": {
    "missionVisee": {
      "@xmlns:xsi": "http://www.w3.org/2001/XMLSchema-instance",
      "@xsi:nil": "true"
    },
    "division": {
      "titre": "Article 16",
      "articleDesignationCourte": "ART. 16",
      "type": "ARTICLE",
      "avant_A_Apres": "A",
      "divisionRattachee": "ARTICLE 16",
      "articleAdditionnel": {
        "@xmlns:xsi": "http://www.w3.org/2001/XMLSchema-instance",
        "@xsi:nil": "true"
      },
      "chapitreAdditionnel": {
        "@xmlns:xsi": "http://www.w3.org/2001/XMLSchema-instance",
        "@xsi:nil": "true"
      },
      "urlDivisionTexteVise": "/15/textes/1924.asp#D_Article_16"
    },
    "alinea": {
      "avant_A_Apres": {
        "@xmlns:xsi": "http://www.w3.org/2001/XMLSchema-instance",
        "@xsi:nil": "true"
      },
      "numero": "3",
      "alineaDesignation": {
        "@xmlns:xsi": "http://www.w3.org/2001/XMLSchema-instance",
        "@xsi:nil": "true"
      }
    }
  },
  "corps": {
    "dispositif": "<p style=\"text-align: justify;\">Supprimer les alin&#233;as 3 &#224; 5.</p>",
    "exposeSommaire": "<p style=\"text-align: justify;\">Pr&#233;alablement &#224; la nomination dans des emplois dont le niveau de responsabilit&#233; ou la nature des fonctions le justifie, les agents concern&#233;s doivent effectuer une d&#233;claration d&#8217;int&#233;r&#234;ts &#171;&#160;exhaustive, exacte et sinc&#232;re&#160;&#187;.</p><p style=\"text-align: justify;\">L&#8217;article&#160;16 supprime la transmission de la d&#233;claration d&#8217;int&#233;r&#234;ts &#224; l&#8217;autorit&#233; investie du pouvoir de nomination.<br />L&#8217;objet de l&#8217;amendement vise &#224; supprimer cette disposition. En effet, l&#8217;autorit&#233; territoriale doit pouvoir &#234;tre en mesure d&#8217;appr&#233;cier l&#8217;existence d&#8217;un &#233;ventuel conflit d&#8217;int&#233;r&#234;ts.</p>",
    "annexeExposeSommaire": {
      "@xmlns:xsi": "http://www.w3.org/2001/XMLSchema-instance",
      "@xsi:nil": "true"
    },
    "cartoucheDelaiDepotDepasse": {
      "@xmlns:xsi": "http://www.w3.org/2001/XMLSchema-instance",
      "@xsi:nil": "true"
    }
  },
  "representations": {
    "representation": {
      "nom": "PDF",
      "typeMime": {
        "type": "application",
        "subType": "PDF"
      },
      "statutRepresentation": {
        "verbatim": "true",
        "canonique": "true",
        "officielle": "true",
        "transcription": "false",
        "enregistrement": "false"
      },
      "repSource": {
        "@xmlns:xsi": "http://www.w3.org/2001/XMLSchema-instance",
        "@xsi:nil": "true"
      },
      "offset": {
        "@xmlns:xsi": "http://www.w3.org/2001/XMLSchema-instance",
        "@xsi:nil": "true"
      },
      "contenu": {
        "documentURI": "/15/amendements/1924/AN/428.pdf"
      },
      "dateDispoRepresentation": {
        "@xmlns:xsi": "http://www.w3.org/2001/XMLSchema-instance",
        "@xsi:nil": "true"
      }
    }
  },
  "seanceDiscussion": {
    "@xmlns:xsi": "http://www.w3.org/2001/XMLSchema-instance",
    "@xsi:nil": "true"
  },
  "sort": {
    "dateSaisie": "2019-05-17T15:06:39.000+02:00",
    "sortEnSeance": "Non soutenu"
  },
  "dateDepot": "2019-05-09T02:00:00.000+02:00",
  "dateDistribution": "2019-05-13T02:00:00.000+02:00",
  "article99": "0",
  "loiReference": {
    "codeLoi": {
      "@xmlns:xsi": "http://www.w3.org/2001/XMLSchema-instance",
      "@xsi:nil": "true"
    },
    "divisionCodeLoi": {
      "@xmlns:xsi": "http://www.w3.org/2001/XMLSchema-instance",
      "@xsi:nil": "true"
    }
  }
}