{
  "@xmlns": "http://schemas.assemblee-nationale.fr/referentiel",
  "uid": "AMANR5L15PO419604B1978P0D1N9",
  "identifiant": {
    "legislature": "15",
    "numero": "9",
    "numRect": "0",
    "saisine": {
      "refTexteLegislatif": "PRJLANR5L15B1978",
      "numeroPartiePLF": "0",
      "organeExamen": "PO419604",
      "mentionSecondeDeliberation": "0"
    }
  },
  "numeroLong": "AC9",
  "etapeTexte": "1ère lecture (2ème assemblée saisie)",
  "triAmendement": "aoaaaaaaaaaaaaaaaaaaaaaaaaaaaaaaaaaaaaaaaaaaaaaaaaev",
  "cardinaliteAmdtMultiples": "1",
  "amendementParent": {
    "@xmlns:xsi": "http://www.w3.org/2001/XMLSchema-instance",
    "@xsi:nil": "true"
  },
  "etat": "Discuté",
  "signataires": {
    "auteur": {
      "typeAuteur": "Depute",
      "acteurRef": "PA719272",
      "organeRef": {
        "@xmlns:xsi": "http://www.w3.org/2001/XMLSchema-instance",
        "@xsi:nil": "true"
      },
      "groupePolitiqueRef": "PO730934"
    },
    "cosignataires": {
      "acteurRef": [
        "PA720630",
        "PA718884",
        "PA719272",
        "PA719318"
      ]
    },
    "texteAffichable": "Mme&#160;Meunier,  Mme&#160;Anthoine, Mme&#160;Bazin-Malgras et M.&#160;Minot"
  },
  "pointeurFragmentTexte": {
    "missionVisee": {
      "@xmlns:xsi": "http://www.w3.org/2001/XMLSchema-instance",
      "@xsi:nil": "true"
    },
    "division": {
      "titre": "Article PREMIER",
      "articleDesignationCourte": "ART. PREMIER",
      "type": "ARTICLE",
      "avant_A_Apres": "A",
      "divisionRattachee": "ARTICLE PREMIER",
      "articleAdditionnel": {
        "@xmlns:xsi": "http://www.w3.org/2001/XMLSchema-instance",
        "@xsi:nil": "true"
      },
      "chapitreAdditionnel": {
        "@xmlns:xsi": "http://www.w3.org/2001/XMLSchema-instance",
        "@xsi:nil": "true"
      },
      "urlDivisionTexteVise": "/15/textes/1978.asp#D_Article_1er"
    },
    "alinea": {
      "avant_A_Apres": {
        "@xmlns:xsi": "http://www.w3.org/2001/XMLSchema-instance",
        "@xsi:nil": "true"
      },
      "numero": "16",
      "alineaDesignation": {
        "@xmlns:xsi": "http://www.w3.org/2001/XMLSchema-instance",
        "@xsi:nil": "true"
      }
    }
  },
  "corps": {
    "dispositif": "<p>I.&#160;&#8211;&#160;&#192; la premi&#232;re phrase de l&#8217;alin&#233;a&#160;16, substituer aux mots&#160;:</p><p style=\"text-align: justify;\">&#171;&#160;b&#233;n&#233;ficiant des tarifs de presse pr&#233;vus &#224; l&#8217;article L.&#160;4 du code des postes et des communications &#233;lectroniques&#160;&#187;</p><p style=\"text-align: justify;\">les mots&#160;:</p><p style=\"text-align: justify;\">&#171;&#160;tels que d&#233;finis &#224; l&#8217;article&#160;2&#160;&#187;.</p><p style=\"text-align: justify;\">II.&#160;&#8211;&#160;En cons&#233;quence, substituer aux mots&#160;:</p><p style=\"text-align: justify;\">&#171;&#160;des diffuseurs de presse et&#160;&#187;</p><p style=\"text-align: justify;\">les mots&#160;:</p><p style=\"text-align: justify;\">&#171;&#160;des agents de la vente et les soci&#233;t&#233;s coop&#233;ratives de groupage,&#160;&#187;.</p><p style=\"text-align: justify;\">III.&#160;&#8211;&#160;En cons&#233;quence, &#224; la deuxi&#232;me phrase du m&#234;me alin&#233;a, apr&#232;s le mot&#160;:</p><p style=\"text-align: justify;\">&#171;&#160;accord&#160;&#187;,</p><p style=\"text-align: justify;\">ins&#233;rer les mots&#160;:</p><p style=\"text-align: justify;\">&#160;&#171;&#160;bas&#233; sur le palmar&#232;s des ventes&#160;&#187;.</p><p style=\"text-align: justify;\">IV.&#160;&#8211;&#160;Supprimer l&#8217;alin&#233;a&#160;17.</p>",
    "exposeSommaire": "<p>Au pr&#233;alable, il convient de noter que la r&#233;f&#233;rence &#224; l&#8217;article L.&#160;4 du code des postes et des communications &#233;lectroniques est erron&#233;e. En l&#8217;esp&#232;ce, il conviendrait de se r&#233;f&#233;rer &#224; l&#8217;article D 18 du m&#234;me code.</p><p style=\"text-align: justify;\">Dans les faits, il s&#8217;agit de cr&#233;er des conditions de discrimination entre les titres b&#233;n&#233;ficiant du label &#171;&#160;CPPAP&#160;&#187; et ceux qui n&#8217;en b&#233;n&#233;ficient pas.&#160;</p><p style=\"text-align: justify;\">Cette distinction est en contradiction avec la d&#233;finition des journaux et publications p&#233;riodiques de l&#8217;article&#160;1<sup>er</sup> de la loi n&#176; 86&#8209;897 du 1<sup>er</sup> ao&#251;t 1986 portant r&#233;forme du r&#233;gime juridique de la presse.</p><p style=\"text-align: justify;\">L&#8217;objectif affich&#233; du Gouvernement est de permettre aux marchands de journaux de choisir les titres qu&#8217;ils accepteraient dans cette cat&#233;gorie (non CPPAP). En donnant le choix aux marchands, le texte actuel consacre une option liberticide et discriminatoire portant atteinte &#224; la libert&#233; de la presse.&#160;</p><p style=\"text-align: justify;\">Nous proposons que, comme actuellement, de ne pas faire de distinction entre les cat&#233;gories de presse autres qu&#8217;IPG, ce qui entra&#238;ne la suppression de l&#8217;alin&#233;a&#160;17.</p><p style=\"text-align: justify;\">L&#8217;assortiment bas&#233; sur le palmar&#232;s de vente des titres est un outil efficace et non discriminatoire qui permet d&#8217;atteindre cet objectif.</p><p style=\"text-align: justify;\">Dans ces conditions, il est primordial d&#8217;int&#233;grer les soci&#233;t&#233;s coop&#233;ratives de groupage dans les intervenants aux accords interprofessionnels. Les coop&#233;ratives sont les seuls organes vraiment repr&#233;sentatifs des &#233;diteurs.</p>",
    "annexeExposeSommaire": {
      "@xmlns:xsi": "http://www.w3.org/2001/XMLSchema-instance",
      "@xsi:nil": "true"
    },
    "cartoucheDelaiDepotDepasse": {
      "@xmlns:xsi": "http://www.w3.org/2001/XMLSchema-instance",
      "@xsi:nil": "true"
    }
  },
  "representations": {
    "representation": {
      "nom": "PDF",
      "typeMime": {
        "type": "application",
        "subType": "PDF"
      },
      "statutRepresentation": {
        "verbatim": "true",
        "canonique": "true",
        "officielle": "true",
        "transcription": "false",
        "enregistrement": "false"
      },
      "repSource": {
        "@xmlns:xsi": "http://www.w3.org/2001/XMLSchema-instance",
        "@xsi:nil": "true"
      },
      "offset": {
        "@xmlns:xsi": "http://www.w3.org/2001/XMLSchema-instance",
        "@xsi:nil": "true"
      },
      "contenu": {
        "documentURI": "/15/amendements/1978/CION-CEDU/AC9.pdf"
      },
      "dateDispoRepresentation": {
        "@xmlns:xsi": "http://www.w3.org/2001/XMLSchema-instance",
        "@xsi:nil": "true"
      }
    }
  },
  "seanceDiscussion": {
    "@xmlns:xsi": "http://www.w3.org/2001/XMLSchema-instance",
    "@xsi:nil": "true"
  },
  "sort": {
    "dateSaisie": "2019-07-15T16:47:02.000+02:00",
    "sortEnSeance": "Rejeté"
  },
  "dateDepot": "2019-07-10T02:00:00.000+02:00",
  "dateDistribution": "2019-07-12T02:00:00.000+02:00",
  "article99": "0",
  "loiReference": {
    "codeLoi": {
      "@xmlns:xsi": "http://www.w3.org/2001/XMLSchema-instance",
      "@xsi:nil": "true"
    },
    "divisionCodeLoi": {
      "@xmlns:xsi": "http://www.w3.org/2001/XMLSchema-instance",
      "@xsi:nil": "true"
    }
  }
}