{
  "@xmlns": "http://schemas.assemblee-nationale.fr/referentiel",
  "uid": "AMANR5L15PO59051B0714P0D1N873",
  "identifiant": {
    "legislature": "15",
    "numero": "873",
    "numRect": "0",
    "saisine": {
      "refTexteLegislatif": "PRJLANR5L15B0714",
      "numeroPartiePLF": "0",
      "organeExamen": "PO59051",
      "mentionSecondeDeliberation": "0"
    }
  },
  "numeroLong": "CL873",
  "etapeTexte": "1ère lecture (1ère assemblée saisie)",
  "triAmendement": "boe",
  "cardinaliteAmdtMultiples": "1",
  "amendementParent": {
    "@xmlns:xsi": "http://www.w3.org/2001/XMLSchema-instance",
    "@xsi:nil": "true"
  },
  "etat": "Discuté",
  "signataires": {
    "auteur": {
      "typeAuteur": "Depute",
      "acteurRef": "PA268019",
      "organeRef": {
        "@xmlns:xsi": "http://www.w3.org/2001/XMLSchema-instance",
        "@xsi:nil": "true"
      },
      "groupePolitiqueRef": "PO744425"
    },
    "cosignataires": {
      "acteurRef": [
        "PA266788",
        "PA267330",
        "PA268019",
        "PA702052",
        "PA721094"
      ]
    },
    "texteAffichable": "M.&#160;Lagarde,  M.&#160;Zumkeller, M.&#160;Dunoyer, M.&#160;Morel-&#192;-L&apos;Huissier et Mme&#160;Sage"
  },
  "pointeurFragmentTexte": {
    "missionVisee": {
      "@xmlns:xsi": "http://www.w3.org/2001/XMLSchema-instance",
      "@xsi:nil": "true"
    },
    "division": {
      "titre": "Article 33",
      "articleDesignationCourte": "APRÈS ART. 33",
      "type": "ARTICLE",
      "avant_A_Apres": "Après",
      "divisionRattachee": "APRÈS L'ARTICLE 33, insérer l'article suivant:",
      "articleAdditionnel": "1",
      "chapitreAdditionnel": {
        "@xmlns:xsi": "http://www.w3.org/2001/XMLSchema-instance",
        "@xsi:nil": "true"
      },
      "urlDivisionTexteVise": "/15/textes/0714.asp#D_Article_33"
    },
    "alinea": {
      "@xmlns:xsi": "http://www.w3.org/2001/XMLSchema-instance",
      "@xsi:nil": "true"
    }
  },
  "corps": {
    "dispositif": "<p style=\"text-align: justify;\">Le paragraphe&#160;5 de la section&#160;1 du chapitre&#160;III du titre&#160;I<sup>er</sup>&#160;<i>bis</i> du livre&#160;I<sup>er</sup> du code civil est compl&#233;t&#233; par un article&#160;21&#8209;25&#8209;2 ainsi r&#233;dig&#233;&#160;:</p><p style=\"text-align: justify;\">&#171;&#160;<i>Art.&#160;21&#8209;25&#8209;2</i>.&#160;&#8211;&#160;Lorsqu&#8217;au terme du d&#233;lai vis&#233; au deuxi&#232;me alin&#233;a de l&#8217;article&#160;21&#8209;25&#8209;1 aucune d&#233;cision de l&#8217;autorit&#233; administrative ne lui a &#233;t&#233; notifi&#233;e, l&#8217;&#233;tranger qui r&#233;side habituellement en France depuis dix ann&#233;es au moins peut saisir le juge administratif afin que ce dernier v&#233;rifie que l&#8217;&#233;tranger remplit l&#8217;ensemble des conditions qui lui permettent d&#8217;acqu&#233;rir la nationalit&#233; fran&#231;aise. Si l&#8217;&#233;tranger remplit ces conditions, le juge administratif lui accorde donc la nationalit&#233; fran&#231;aise.&#160;&#187;</p>",
    "exposeSommaire": "<p>Dans certains d&#233;partements, les demandes de naturalisation font l'objet d'une attente excessivement longue.</p><p>Afin d'inciter les autorit&#233;s publiques &#224; prendre les dispositions n&#233;cessaires pour acc&#233;l&#233;rer cette proc&#233;dure, il est pr&#233;vu qu'au-del&#224;&#160;des 12 mois pr&#233;vus au deuxi&#232;me alin&#233;a de l'article 21-25-1 du code civil, si aucune d&#233;cision de l'autorit&#233; administrative n'est intervenue, l'&#233;tranger qui r&#233;side habituellement en France depuis dix ans peut saisir le juge administratif afin que ce dernier v&#233;rifie que l'&#233;tranger remplit l'ensemble des conditions qui lui permettent d'acqu&#233;rir la nationalit&#233; fran&#231;aise. Si l'&#233;tranger remplit ces conditions, le juge administratif lui accorde donc la nationalit&#233; fran&#231;aise.</p>",
    "annexeExposeSommaire": {
      "@xmlns:xsi": "http://www.w3.org/2001/XMLSchema-instance",
      "@xsi:nil": "true"
    }
  },
  "representations": {
    "representation": {
      "nom": "PDF",
      "typeMime": {
        "type": "application",
        "subType": "PDF"
      },
      "statutRepresentation": {
        "verbatim": "true",
        "canonique": "true",
        "officielle": "true",
        "transcription": "false",
        "enregistrement": "false"
      },
      "repSource": {
        "@xmlns:xsi": "http://www.w3.org/2001/XMLSchema-instance",
        "@xsi:nil": "true"
      },
      "offset": {
        "@xmlns:xsi": "http://www.w3.org/2001/XMLSchema-instance",
        "@xsi:nil": "true"
      },
      "contenu": {
        "documentURI": "/15/amendements/0714/CION_LOIS/CL873.pdf"
      },
      "dateDispoRepresentation": {
        "@xmlns:xsi": "http://www.w3.org/2001/XMLSchema-instance",
        "@xsi:nil": "true"
      }
    }
  },
  "seanceDiscussion": {
    "@xmlns:xsi": "http://www.w3.org/2001/XMLSchema-instance",
    "@xsi:nil": "true"
  },
  "sort": {
    "dateSaisie": "2018-04-06T20:06:34.000+02:00",
    "sortEnSeance": "Non soutenu"
  },
  "dateDepot": "2018-03-30T02:00:00.000+02:00",
  "dateDistribution": "2018-04-03T02:00:00.000+02:00",
  "article99": "0",
  "loiReference": {
    "codeLoi": "civil",
    "divisionCodeLoi": "21-25-2"
  }
}