{
  "@xmlns": "http://schemas.assemblee-nationale.fr/referentiel",
  "uid": "AMANR5L15SEA717460BTC0990P0D1N73",
  "identifiant": {
    "legislature": "15",
    "numero": "73",
    "numRect": "0",
    "saisine": {
      "refTexteLegislatif": "PIONANR5L15BTC0990",
      "numeroPartiePLF": "0",
      "organeExamen": "PO717460",
      "mentionSecondeDeliberation": "0"
    }
  },
  "numeroLong": "73",
  "etapeTexte": "1ère lecture (1ère assemblée saisie)",
  "triAmendement": "he",
  "cardinaliteAmdtMultiples": "1",
  "amendementParent": {
    "@xmlns:xsi": "http://www.w3.org/2001/XMLSchema-instance",
    "@xsi:nil": "true"
  },
  "etat": "Discuté",
  "signataires": {
    "auteur": {
      "typeAuteur": "Depute",
      "acteurRef": "PA720754",
      "organeRef": {
        "@xmlns:xsi": "http://www.w3.org/2001/XMLSchema-instance",
        "@xsi:nil": "true"
      },
      "groupePolitiqueRef": "PO730964"
    },
    "cosignataires": {
      "acteurRef": "PA720754"
    },
    "texteAffichable": "M.&#160;Studer"
  },
  "pointeurFragmentTexte": {
    "missionVisee": {
      "@xmlns:xsi": "http://www.w3.org/2001/XMLSchema-instance",
      "@xsi:nil": "true"
    },
    "division": {
      "titre": "Article 9 bis",
      "articleDesignationCourte": "APRÈS ART. 9 BIS",
      "type": "ARTICLE",
      "avant_A_Apres": "Après",
      "divisionRattachee": "APRÈS L'ARTICLE 9 BIS, insérer l'article suivant:",
      "articleAdditionnel": "1",
      "chapitreAdditionnel": {
        "@xmlns:xsi": "http://www.w3.org/2001/XMLSchema-instance",
        "@xsi:nil": "true"
      },
      "urlDivisionTexteVise": "/15/textes/0990.asp#D_Article_9_bis"
    },
    "alinea": {
      "@xmlns:xsi": "http://www.w3.org/2001/XMLSchema-instance",
      "@xsi:nil": "true"
    }
  },
  "corps": {
    "dispositif": "<p style=\"text-align: justify;\">L&#8217;article&#160;6 <i>quater</i> de l&#8217;ordonnance n&#176; 58&#8209;1100 du 17 novembre 1958 relative au fonctionnement des assembl&#233;es parlementaires est ainsi r&#233;tabli&#160;:</p><p style=\"text-align: justify;\">&#171;&#160;<i>Art.&#160;6</i> quater.&#160;&#8211;&#160;I.&#160;&#8211;&#160;Il est constitu&#233; une d&#233;l&#233;gation parlementaire charg&#233;e du suivi de l&#8217;activit&#233; des op&#233;rateurs de plateformes en ligne d&#233;finis &#224; l&#8217;article L.&#160;111&#8209;7 du code de la consommation, commune &#224; l&#8217;Assembl&#233;e nationale et au S&#233;nat.</p><p style=\"text-align: justify;\">&#171;&#160;II.&#160;&#8211;&#160;La d&#233;l&#233;gation parlementaire charg&#233;e du suivi de l&#8217;activit&#233; des op&#233;rateurs de plateformes en ligne est compos&#233;e de quatre d&#233;put&#233;s et de quatre s&#233;nateurs. Les pr&#233;sidents des commissions permanentes de l&#8217;Assembl&#233;e nationale et du S&#233;nat charg&#233;es respectivement des affaires culturelles et de la protection des donn&#233;es personnelles en sont membres de droit. La fonction de pr&#233;sident de la d&#233;l&#233;gation est assur&#233;e alternativement, pour un an, par un d&#233;put&#233; et un s&#233;nateur, membres de droit.</p><p style=\"text-align: justify;\">&#171;&#160;Les autres membres de la d&#233;l&#233;gation sont d&#233;sign&#233;s par le pr&#233;sident de chaque assembl&#233;e de mani&#232;re &#224; assurer une repr&#233;sentation pluraliste. Les deux d&#233;put&#233;s qui ne sont pas membres de droit sont d&#233;sign&#233;s au d&#233;but de chaque l&#233;gislature et pour la dur&#233;e de celle-ci. Les deux s&#233;nateurs sont d&#233;sign&#233;s apr&#232;s chaque renouvellement partiel du S&#233;nat.</p><p style=\"text-align: justify;\">&#171;&#160;Les membres de la d&#233;l&#233;gation sont astreints au respect du secret des affaires d&#233;fini &#224; l&#8217;article&#160;L.&#160;151&#8209;1 du code de commerce pour les faits, actes ou informations dont ils ont pu avoir connaissance en ces qualit&#233;s.</p><p style=\"text-align: justify;\">&#171;&#160;III.&#160;&#8211;&#160;Les op&#233;rateurs vis&#233;s au I du pr&#233;sent article transmettent &#224; la d&#233;l&#233;gation toutes les informations utiles &#224; l&#8217;accomplissement de sa mission.</p><p style=\"text-align: justify;\">&#171;&#160;La d&#233;l&#233;gation peut proc&#233;der &#224; toutes les auditions qu&#8217;elle juge utiles. Les personnes entendues par la d&#233;l&#233;gation sont d&#233;li&#233;es du secret professionnel, r&#233;serve faite des sujets &#224; caract&#232;re secret concernant la d&#233;fense nationale et la s&#233;curit&#233; int&#233;rieure ou ext&#233;rieure de l&#8217;&#201;tat et du respect du secret de l&#8217;instruction et du secret m&#233;dical.</p><p style=\"text-align: justify;\">&#171;&#160;La d&#233;l&#233;gation peut saisir pour avis la Commission nationale de l&#8217;informatique et des libert&#233;s, l&#8217;Autorit&#233; de la concurrence, le Conseil sup&#233;rieur de l&#8217;audiovisuel et la Haute Autorit&#233; pour la diffusion des &#339;uvres et la protection des droits sur internet.</p><p style=\"text-align: justify;\">&#171;&#160;Le pr&#233;sident de la d&#233;l&#233;gation, lorsqu&#8217;il acquiert en cette qualit&#233; la connaissance d&#8217;une infraction commise par un op&#233;rateur de plateforme, peut saisir le parquet pr&#232;s la juridiction comp&#233;tente en vue de d&#233;clencher l&#8217;action publique.</p><p style=\"text-align: justify;\">&#171;&#160;IV.&#160;&#8211;&#160;Chaque ann&#233;e, la d&#233;l&#233;gation &#233;tablit un rapport public dressant le bilan de son activit&#233;, qui ne peut faire &#233;tat d&#8217;aucune information ni d&#8217;aucun &#233;l&#233;ment d&#8217;appr&#233;ciation prot&#233;g&#233;s par le secret des affaires.</p><p style=\"text-align: justify;\">&#171;&#160;Dans le cadre de ses travaux, la d&#233;l&#233;gation peut adresser des recommandations et des observations aux op&#233;rateurs de plateforme en ligne. Elle les transmet au pr&#233;sident de chaque assembl&#233;e.</p><p style=\"text-align: justify;\">&#171;&#160;V.&#160;&#8211;&#160;Le fait de faire obstacle, de quelque fa&#231;on que ce soit, &#224; l&#8217;exercice des pouvoirs mentionn&#233;s aux alin&#233;as pr&#233;c&#233;dents est puni d&#8217;un an d&#8217;emprisonnement et de 15 000&#160;euros d&#8217;amende.</p><p style=\"text-align: justify;\">&#171;&#160;VI.&#160;&#8211;&#160;La d&#233;l&#233;gation &#233;tablit son r&#232;glement int&#233;rieur. Celui-ci est soumis &#224; l&#8217;approbation du bureau de chaque assembl&#233;e.</p><p style=\"text-align: justify;\">&#171;&#160;Les d&#233;penses aff&#233;rentes au fonctionnement de la d&#233;l&#233;gation sont financ&#233;es et ex&#233;cut&#233;es comme d&#233;penses des assembl&#233;es parlementaires dans les conditions fix&#233;es &#224; l&#8217;article&#160;7.&#160;&#187;</p>",
    "exposeSommaire": "<p style=\"text-align: justify;\">Le pr&#233;sent amendement a pour objet de mettre en place une d&#233;l&#233;gation parlementaire, commune &#224; l&#8217;Assembl&#233;e nationale et au S&#233;nat, charg&#233;e du suivi de l&#8217;activit&#233; des op&#233;rateurs de plateforme en ligne. En effet, ces derniers ont, pour certains, acquis un pouvoir consid&#233;rable et leur utilisation des donn&#233;es personnelles comme la fa&#231;on dont ils sont amen&#233;s &#224; g&#233;rer les contenus d&#233;pos&#233;s par leurs utilisateurs soul&#232;vent aujourd&#8217;hui de nombreuses questions, qui justifient que le Parlement dispose d&#8217;un organe particulier pour en traiter, dans le respect du secret des affaires.</p>",
    "annexeExposeSommaire": {
      "@xmlns:xsi": "http://www.w3.org/2001/XMLSchema-instance",
      "@xsi:nil": "true"
    }
  },
  "representations": {
    "representation": {
      "nom": "PDF",
      "typeMime": {
        "type": "application",
        "subType": "PDF"
      },
      "statutRepresentation": {
        "verbatim": "true",
        "canonique": "true",
        "officielle": "true",
        "transcription": "false",
        "enregistrement": "false"
      },
      "repSource": {
        "@xmlns:xsi": "http://www.w3.org/2001/XMLSchema-instance",
        "@xsi:nil": "true"
      },
      "offset": {
        "@xmlns:xsi": "http://www.w3.org/2001/XMLSchema-instance",
        "@xsi:nil": "true"
      },
      "contenu": {
        "documentURI": "/15/amendements/0990/AN/73.pdf"
      },
      "dateDispoRepresentation": {
        "@xmlns:xsi": "http://www.w3.org/2001/XMLSchema-instance",
        "@xsi:nil": "true"
      }
    }
  },
  "seanceDiscussion": "RUANR5L15S2018IDS21152",
  "sort": {
    "dateSaisie": "2018-07-03T22:45:31.000+02:00",
    "sortEnSeance": "Retiré"
  },
  "dateDepot": "2018-06-04T02:00:00.000+02:00",
  "dateDistribution": "2018-06-06T02:00:00.000+02:00",
  "article99": "0",
  "loiReference": {
    "codeLoi": "ordonnance 58-1100",
    "divisionCodeLoi": "6 quater"
  }
}