{
  "@xmlns": "http://schemas.assemblee-nationale.fr/referentiel",
  "uid": "AMANR5L15SEA717460BTC2243P0D1N1700",
  "identifiant": {
    "legislature": "15",
    "numero": "1700",
    "numRect": "0",
    "saisine": {
      "refTexteLegislatif": "PRJLANR5L15BTC2243",
      "numeroPartiePLF": "0",
      "organeExamen": "PO717460",
      "mentionSecondeDeliberation": "0"
    }
  },
  "numeroLong": "1700",
  "etapeTexte": "1ère lecture (1ère assemblée saisie)",
  "triAmendement": "auaaaaaaaaaaaaaaaaaaaaaaaaaaaaaaaaaaaaaaaaaaaaaaaaanzi",
  "cardinaliteAmdtMultiples": "1",
  "amendementParent": {
    "@xmlns:xsi": "http://www.w3.org/2001/XMLSchema-instance",
    "@xsi:nil": "true"
  },
  "etat": "Discuté",
  "signataires": {
    "auteur": {
      "typeAuteur": "Depute",
      "acteurRef": "PA330684",
      "organeRef": {
        "@xmlns:xsi": "http://www.w3.org/2001/XMLSchema-instance",
        "@xsi:nil": "true"
      },
      "groupePolitiqueRef": "PO730934"
    },
    "cosignataires": {
      "acteurRef": "PA330684"
    },
    "texteAffichable": "Mme&#160;Val&#233;rie&#160;Boyer"
  },
  "pointeurFragmentTexte": {
    "missionVisee": {
      "@xmlns:xsi": "http://www.w3.org/2001/XMLSchema-instance",
      "@xsi:nil": "true"
    },
    "division": {
      "titre": "Article 4",
      "articleDesignationCourte": "ART. 4",
      "type": "ARTICLE",
      "avant_A_Apres": "A",
      "divisionRattachee": "ARTICLE 4",
      "articleAdditionnel": {
        "@xmlns:xsi": "http://www.w3.org/2001/XMLSchema-instance",
        "@xsi:nil": "true"
      },
      "chapitreAdditionnel": {
        "@xmlns:xsi": "http://www.w3.org/2001/XMLSchema-instance",
        "@xsi:nil": "true"
      },
      "urlDivisionTexteVise": "/15/textes/2243.asp#D_Article_4"
    },
    "alinea": {
      "@xmlns:xsi": "http://www.w3.org/2001/XMLSchema-instance",
      "@xsi:nil": "true"
    }
  },
  "corps": {
    "dispositif": "<p style=\"text-align: justify;\">Supprimer cet article.</p>",
    "exposeSommaire": "<p style=\"text-align: justify;\">Depuis les premi&#232;res lois de bio&#233;thique, en 1994, le droit fran&#231;ais con&#231;oit l&#8217;assistance m&#233;dicale &#224; la procr&#233;ation comme une r&#233;ponse m&#233;dicale &#224; un probl&#232;me du m&#234;me ordre. Cette conception, constitutive du mod&#232;le fran&#231;ais en mati&#232;re de bio&#233;thique, permet d&#8217;offrir &#224; l&#8217;enfant con&#231;u par le recours &#224; ces techniques une filiation cr&#233;dible. Cette filiation est fond&#233;e sur un mod&#232;le g&#233;n&#233;alogique&#160;: chaque individu est issu de deux autres individus d&#8217;une g&#233;n&#233;ration ascendante et de sexe diff&#233;rent qui l&#8217;auraient en principe conjointement engendr&#233;, ses p&#232;re et m&#232;re. Ce mod&#232;le est sous-tendu par l&#8217;id&#233;e que la filiation est un fait de nature et qu&#8217;elle est exclusive, chaque enfant n&#8217;ayant qu&#8217;un seul p&#232;re et qu&#8217;une seule m&#232;re.</p><p style=\"text-align: justify;\">Or, en pr&#233;voyant de dissocier radicalement les fondements biologique et juridique de la filiation d&#8217;origine, par la cr&#233;ation d&#8217;une double filiation maternelle, le nouveau mod&#232;le aura pour cons&#233;quence un changement de paradigme du droit fran&#231;ais puisque deux mod&#232;les coexisteront&#160;: un mod&#232;le bas&#233; sur la vraisemblance biologique et un bas&#233; sur la volont&#233;.</p><p style=\"text-align: justify;\">Une m&#232;re n&#8217;est plus celle qui donne la vie, mais celle qui passe commande. La m&#232;re devient consommatrice. Ainsi, l&#8217;&#233;tablissement de la filiation maternelle repose sur le principe selon lequel la m&#232;re est celle qui accouche de l&#8217;enfant (mater semper certa est), principe qui figure aux articles 325 et 332 du code civil.</p><p style=\"text-align: justify;\">Faire na&#238;tre d&#233;lib&#233;r&#233;ment un enfant sans p&#232;re, c&#8217;est nier que le p&#232;re sert &#224; quelque chose.</p>",
    "annexeExposeSommaire": {
      "@xmlns:xsi": "http://www.w3.org/2001/XMLSchema-instance",
      "@xsi:nil": "true"
    },
    "cartoucheDelaiDepotDepasse": {
      "@xmlns:xsi": "http://www.w3.org/2001/XMLSchema-instance",
      "@xsi:nil": "true"
    },
    "avantAppel": {
      "@xmlns:xsi": "http://www.w3.org/2001/XMLSchema-instance",
      "@xsi:nil": "true"
    }
  },
  "representations": {
    "representation": {
      "nom": "PDF",
      "typeMime": {
        "type": "application",
        "subType": "PDF"
      },
      "statutRepresentation": {
        "verbatim": "true",
        "canonique": "true",
        "officielle": "true",
        "transcription": "false",
        "enregistrement": "false"
      },
      "repSource": {
        "@xmlns:xsi": "http://www.w3.org/2001/XMLSchema-instance",
        "@xsi:nil": "true"
      },
      "offset": {
        "@xmlns:xsi": "http://www.w3.org/2001/XMLSchema-instance",
        "@xsi:nil": "true"
      },
      "contenu": {
        "documentURI": "/15/amendements/2243/AN/1700.pdf"
      },
      "dateDispoRepresentation": {
        "@xmlns:xsi": "http://www.w3.org/2001/XMLSchema-instance",
        "@xsi:nil": "true"
      }
    }
  },
  "seanceDiscussion": "RUANR5L15S2020IDS21843",
  "sort": {
    "dateSaisie": "2019-10-02T22:42:19.000+02:00",
    "sortEnSeance": "Non soutenu"
  },
  "dateDepot": "2019-09-19T02:00:00.000+02:00",
  "dateDistribution": "2019-09-24T02:00:00.000+02:00",
  "article99": "0",
  "loiReference": {
    "codeLoi": {
      "@xmlns:xsi": "http://www.w3.org/2001/XMLSchema-instance",
      "@xsi:nil": "true"
    },
    "divisionCodeLoi": {
      "@xmlns:xsi": "http://www.w3.org/2001/XMLSchema-instance",
      "@xsi:nil": "true"
    }
  }
}