{
  "@xmlns": "http://schemas.assemblee-nationale.fr/referentiel",
  "uid": "AMANR5L15SEA717460BTC0105P0D1N199",
  "identifiant": {
    "legislature": "15",
    "numero": "199",
    "numRect": "0",
    "saisine": {
      "refTexteLegislatif": "PRJLANR5L15BTC0105",
      "numeroPartiePLF": "0",
      "organeExamen": "PO717460",
      "mentionSecondeDeliberation": "0"
    }
  },
  "numeroLong": "199",
  "etapeTexte": "1ère lecture (2ème assemblée saisie)",
  "triAmendement": "ab",
  "cardinaliteAmdtMultiples": "1",
  "amendementParent": {
    "@xmlns:xsi": "http://www.w3.org/2001/XMLSchema-instance",
    "@xsi:nil": "true"
  },
  "etat": "Discuté",
  "signataires": {
    "auteur": {
      "typeAuteur": "Depute",
      "acteurRef": "PA267330",
      "organeRef": {
        "@xmlns:xsi": "http://www.w3.org/2001/XMLSchema-instance",
        "@xsi:nil": "true"
      },
      "groupePolitiqueRef": "PO730952"
    },
    "cosignataires": {
      "acteurRef": [
        "PA721486",
        "PA722030",
        "PA331567",
        "PA346876",
        "PA335758",
        "PA720696",
        "PA2952",
        "PA642868",
        "PA695100",
        "PA267330",
        "PA267801",
        "PA720230",
        "PA942",
        "PA267355",
        "PA267241",
        "PA267585",
        "PA721110",
        "PA268019",
        "PA719806",
        "PA642935",
        "PA332228",
        "PA267042",
        "PA267780"
      ]
    },
    "texteAffichable": "M.&#160;Zumkeller,  Mme&#160;Auconie, M.&#160;Becht, M.&#160;Benoit, M.&#160;Bournazel, M.&#160;Christophe, M.&#160;Charles&#160;de Courson, Mme&#160;de La Raudi&#232;re, M.&#160;Demilly, Mme&#160;Descamps, M.&#160;Favennec Becot, Mme&#160;Firmin Le Bodo, M.&#160;Meyer&#160;Habib, M.&#160;Herth, M.&#160;J&#233;go, M.&#160;Lagarde, Mme&#160;Magnier, M.&#160;Naegelen, M.&#160;Riester, Mme&#160;Sanquer, M.&#160;Sol&#232;re, M.&#160;Vercamer et M.&#160;Warsmann"
  },
  "pointeurFragmentTexte": {
    "missionVisee": {
      "@xmlns:xsi": "http://www.w3.org/2001/XMLSchema-instance",
      "@xsi:nil": "true"
    },
    "division": {
      "titre": "Article 9",
      "articleDesignationCourte": "APRÈS ART. 9",
      "type": "ARTICLE",
      "avant_A_Apres": "Après",
      "divisionRattachee": "APRÈS L'ARTICLE 9, insérer l'article suivant:",
      "articleAdditionnel": "1",
      "chapitreAdditionnel": {
        "@xmlns:xsi": "http://www.w3.org/2001/XMLSchema-instance",
        "@xsi:nil": "true"
      },
      "urlDivisionTexteVise": "/15/textes/0105.asp#D_Article_9"
    },
    "alinea": {
      "@xmlns:xsi": "http://www.w3.org/2001/XMLSchema-instance",
      "@xsi:nil": "true"
    }
  },
  "corps": {
    "dispositif": "<p style=\"text-align: justify;\">Il est mis fin &#224; la pratique de la &#171;&#160;r&#233;serve pr&#233;sidentielle&#160;&#187;, consistant en la mise &#224; disposition de cr&#233;dits au sein de dotations mentionn&#233;es au&#160;1&#176; de l&#8217;article&#160;5 de la loi organique n&#176;&#160;2001&#8209;692 du 1<sup>er&#160;</sup>ao&#251;t 2001 relative aux lois de finances, utilis&#233;s par le pr&#233;sident de la R&#233;publique pour le financement des projets d&#8217;organismes ou associations qu&#8217;elle d&#233;cide seule de soutenir.</p>",
    "exposeSommaire": "<p style=\"text-align: justify;\">Le pr&#233;sent projet de loi vise &#224; supprimer la pratique de la r&#233;serve parlementaire. Il serait par cons&#233;quent incompr&#233;hensible et incoh&#233;rent que la pratique de la r&#233;serve pr&#233;sidentielle subsiste. Aussi, cet amendement vise &#224; la supprimer.</p>",
    "annexeExposeSommaire": {
      "@xmlns:xsi": "http://www.w3.org/2001/XMLSchema-instance",
      "@xsi:nil": "true"
    }
  },
  "representations": {
    "representation": {
      "nom": "PDF",
      "typeMime": {
        "type": "application",
        "subType": "PDF"
      },
      "statutRepresentation": {
        "verbatim": "true",
        "canonique": "true",
        "officielle": "true",
        "transcription": "false",
        "enregistrement": "false"
      },
      "repSource": {
        "@xmlns:xsi": "http://www.w3.org/2001/XMLSchema-instance",
        "@xsi:nil": "true"
      },
      "offset": {
        "@xmlns:xsi": "http://www.w3.org/2001/XMLSchema-instance",
        "@xsi:nil": "true"
      },
      "contenu": {
        "documentURI": "/15/amendements/0105/AN/199.pdf"
      },
      "dateDispoRepresentation": {
        "@xmlns:xsi": "http://www.w3.org/2001/XMLSchema-instance",
        "@xsi:nil": "true"
      }
    }
  },
  "seanceDiscussion": "RUANR5L15S2017IDS20663",
  "sort": {
    "dateSaisie": "2017-07-28T21:59:36.000+02:00",
    "sortEnSeance": "Retiré"
  },
  "dateDepot": "2017-07-21T02:00:00.000+02:00",
  "dateDistribution": "2017-07-25T02:00:00.000+02:00",
  "article99": "0",
  "loiReference": {
    "codeLoi": {
      "@xmlns:xsi": "http://www.w3.org/2001/XMLSchema-instance",
      "@xsi:nil": "true"
    },
    "divisionCodeLoi": {
      "@xmlns:xsi": "http://www.w3.org/2001/XMLSchema-instance",
      "@xsi:nil": "true"
    }
  }
}