{
  "@xmlns": "http://schemas.assemblee-nationale.fr/referentiel",
  "uid": "AMANR5L15PO419604B1481P0D1N289",
  "identifiant": {
    "legislature": "15",
    "numero": "289",
    "numRect": "0",
    "saisine": {
      "refTexteLegislatif": "PRJLANR5L15B1481",
      "numeroPartiePLF": "0",
      "organeExamen": "PO419604",
      "mentionSecondeDeliberation": "0"
    }
  },
  "numeroLong": "AC289",
  "etapeTexte": "1ère lecture (1ère assemblée saisie)",
  "triAmendement": "coaaaaaaaaaaaaaaaaaaaaaaaaaaaaaaaaaaaaaaaaaaaaaaaaqh",
  "cardinaliteAmdtMultiples": "1",
  "amendementParent": {
    "@xmlns:xsi": "http://www.w3.org/2001/XMLSchema-instance",
    "@xsi:nil": "true"
  },
  "etat": "Discuté",
  "signataires": {
    "auteur": {
      "typeAuteur": "Depute",
      "acteurRef": "PA721210",
      "organeRef": {
        "@xmlns:xsi": "http://www.w3.org/2001/XMLSchema-instance",
        "@xsi:nil": "true"
      },
      "groupePolitiqueRef": "PO730958"
    },
    "cosignataires": {
      "acteurRef": [
        "PA719578",
        "PA720846",
        "PA720892",
        "PA588884",
        "PA721960",
        "PA721062",
        "PA720430",
        "PA718868",
        "PA719676",
        "PA721210",
        "PA720422",
        "PA721202",
        "PA718860",
        "PA721226",
        "PA722142",
        "PA2150",
        "PA720286"
      ]
    },
    "texteAffichable": "M.&#160;Corbi&#232;re,  Mme&#160;Autain, M.&#160;Bernalicis, M.&#160;Coquerel, Mme&#160;Fiat, M.&#160;Lachaud, M.&#160;Larive, M.&#160;M&#233;lenchon, Mme&#160;Obono, Mme&#160;Panot, M.&#160;Prud&apos;homme, M.&#160;Quatennens, M.&#160;Ratenon, Mme&#160;Ressiguier, Mme&#160;Rubin, M.&#160;Ruffin et Mme&#160;Taurine"
  },
  "pointeurFragmentTexte": {
    "missionVisee": {
      "@xmlns:xsi": "http://www.w3.org/2001/XMLSchema-instance",
      "@xsi:nil": "true"
    },
    "division": {
      "titre": "Article 9",
      "articleDesignationCourte": "ART. 9",
      "type": "ARTICLE",
      "avant_A_Apres": "A",
      "divisionRattachee": "ARTICLE 9",
      "articleAdditionnel": {
        "@xmlns:xsi": "http://www.w3.org/2001/XMLSchema-instance",
        "@xsi:nil": "true"
      },
      "chapitreAdditionnel": {
        "@xmlns:xsi": "http://www.w3.org/2001/XMLSchema-instance",
        "@xsi:nil": "true"
      },
      "urlDivisionTexteVise": "/15/textes/1481.asp#D_Article_9"
    },
    "alinea": {
      "avant_A_Apres": "A",
      "numero": "16",
      "alineaDesignation": "Alinéa 16"
    }
  },
  "corps": {
    "dispositif": "<p style=\"text-align: justify;\">Compl&#233;ter l&#8217;alin&#233;a&#160;16 par les mots&#160;: </p><p style=\"text-align: justify;\">&#171;&#160;et, apr&#232;s le mot&#160;: &#171;&#160;pr&#233;sident,&#160;&#187;, la fin de la deuxi&#232;me phrase est ainsi r&#233;dig&#233;e&#160;: &#171;&#160;dix personnalit&#233;s qualifi&#233;es nomm&#233;es par le ministre charg&#233; de l&#8217;&#233;ducation nationale, et un &#233;lu lyc&#233;en au Conseil sup&#233;rieur de l&#8217;&#201;ducation.&#160;&#187;</p>",
    "exposeSommaire": "<p style=\"text-align: justify;\">Cet amendement vise &#224; int&#233;grer un.e &#233;lu.e lyce&#233;n.ne au sein du conseil sup&#233;rieur des programmes (CSP) seul organe consultatif comp&#233;tent en mati&#232;re de normes scolaires d&#8217;enseignement.<br />Il s&#8217;inscrit pleinement dans la volont&#233; politique exprim&#233;e par la charte des programmes et la cr&#233;ation du CSP en 2013. L&#8217;ensemble des attributions de ce conseil qui vise &#224; cr&#233;er des liens logiques entre les enseignements, &#224; accroitre la lisibilit&#233; des programmes, am&#233;liorer l&#8217;orientation des jeunes en am&#233;liorant l&#8217;information, &#233;valuer la qualit&#233; et l&#8217;efficacit&#233; des enseignements mais aussi concilier les outils num&#233;rique avec les p&#233;dagogies &#233;ducatives constituent des enjeux &#233;loquents pour les lyc&#233;en.ne.s qui sont au c&#339;ur de ces m&#233;canismes et les connaissent mieux que quiconque.<br />La r&#233;forme publi&#233;e le 23 janvier dernier montre une fois de plus le manque cruel de concertation entre les parties-prenantes de la communaut&#233; &#233;ducative. Nous d&#233;plorons le travail tr&#232;s solitaire de l&#8217;&#233;ducation nationale sur ce sujet. Les sp&#233;cialistes, chercheurs et professeurs s&#8217;en plaignent constamment mais vous avez l&#8217;air d&#8217;en ignorer la teneur. <br />Cet amendement a pour ambition d&#8217;en finir avec ces r&#233;formes &#224; t&#226;tons, court-termistes, servant uniquement de chiffon &#233;lectoraux, en int&#233;grant les apprenant.e.s au sein du conseil dans un souci &#233;vident de retour d&#8217;exp&#233;rience. C&#8217;est un premier pas vers la coll&#233;gialit&#233; et la d&#233;mocratie de l&#8217;institution scolaire et surtout vers une v&#233;ritable co-construction, essence d&#8217;une &#171;&#160;&#233;cole de la confiance&#160;&#187;.</p>",
    "annexeExposeSommaire": {
      "@xmlns:xsi": "http://www.w3.org/2001/XMLSchema-instance",
      "@xsi:nil": "true"
    },
    "cartoucheDelaiDepotDepasse": {
      "@xmlns:xsi": "http://www.w3.org/2001/XMLSchema-instance",
      "@xsi:nil": "true"
    }
  },
  "representations": {
    "representation": {
      "nom": "PDF",
      "typeMime": {
        "type": "application",
        "subType": "PDF"
      },
      "statutRepresentation": {
        "verbatim": "true",
        "canonique": "true",
        "officielle": "true",
        "transcription": "false",
        "enregistrement": "false"
      },
      "repSource": {
        "@xmlns:xsi": "http://www.w3.org/2001/XMLSchema-instance",
        "@xsi:nil": "true"
      },
      "offset": {
        "@xmlns:xsi": "http://www.w3.org/2001/XMLSchema-instance",
        "@xsi:nil": "true"
      },
      "contenu": {
        "documentURI": "/15/amendements/1481/CION-CEDU/AC289.pdf"
      },
      "dateDispoRepresentation": {
        "@xmlns:xsi": "http://www.w3.org/2001/XMLSchema-instance",
        "@xsi:nil": "true"
      }
    }
  },
  "seanceDiscussion": {
    "@xmlns:xsi": "http://www.w3.org/2001/XMLSchema-instance",
    "@xsi:nil": "true"
  },
  "sort": {
    "dateSaisie": "2019-01-30T22:28:30.000+01:00",
    "sortEnSeance": "Rejeté"
  },
  "dateDepot": "2019-01-25T01:00:00.000+01:00",
  "dateDistribution": "2019-01-29T01:00:00.000+01:00",
  "article99": "0",
  "loiReference": {
    "codeLoi": "2",
    "divisionCodeLoi": {
      "@xmlns:xsi": "http://www.w3.org/2001/XMLSchema-instance",
      "@xsi:nil": "true"
    }
  }
}