{
  "@xmlns": "http://schemas.assemblee-nationale.fr/referentiel",
  "uid": "AMANR5L15PO419604B1481P0D1N556",
  "identifiant": {
    "legislature": "15",
    "numero": "556",
    "numRect": "0",
    "saisine": {
      "refTexteLegislatif": "PRJLANR5L15B1481",
      "numeroPartiePLF": "0",
      "organeExamen": "PO419604",
      "mentionSecondeDeliberation": "0"
    }
  },
  "numeroLong": "AC556",
  "etapeTexte": "1ère lecture (1ère assemblée saisie)",
  "triAmendement": "akaaaaaaaaaaaaaaaaaaaaaaaaaaaaaaaaaaaaaaaaaaaaaaaacv",
  "cardinaliteAmdtMultiples": "1",
  "amendementParent": {
    "@xmlns:xsi": "http://www.w3.org/2001/XMLSchema-instance",
    "@xsi:nil": "true"
  },
  "etat": "Discuté",
  "signataires": {
    "auteur": {
      "typeAuteur": "Depute",
      "acteurRef": "PA719350",
      "organeRef": {
        "@xmlns:xsi": "http://www.w3.org/2001/XMLSchema-instance",
        "@xsi:nil": "true"
      },
      "groupePolitiqueRef": "PO730964"
    },
    "cosignataires": {
      "acteurRef": "PA719350"
    },
    "texteAffichable": "Mme&#160;Tamarelle-Verhaeghe"
  },
  "pointeurFragmentTexte": {
    "missionVisee": {
      "@xmlns:xsi": "http://www.w3.org/2001/XMLSchema-instance",
      "@xsi:nil": "true"
    },
    "division": {
      "titre": "Article 2",
      "articleDesignationCourte": "ART. 2",
      "type": "ARTICLE",
      "avant_A_Apres": "A",
      "divisionRattachee": "ARTICLE 2",
      "articleAdditionnel": {
        "@xmlns:xsi": "http://www.w3.org/2001/XMLSchema-instance",
        "@xsi:nil": "true"
      },
      "chapitreAdditionnel": {
        "@xmlns:xsi": "http://www.w3.org/2001/XMLSchema-instance",
        "@xsi:nil": "true"
      },
      "urlDivisionTexteVise": "/15/textes/1481.asp#D_Article_2"
    },
    "alinea": {
      "avant_A_Apres": {
        "@xmlns:xsi": "http://www.w3.org/2001/XMLSchema-instance",
        "@xsi:nil": "true"
      },
      "numero": "2",
      "alineaDesignation": {
        "@xmlns:xsi": "http://www.w3.org/2001/XMLSchema-instance",
        "@xsi:nil": "true"
      }
    }
  },
  "corps": {
    "dispositif": "<p style=\"text-align: justify;\">&#192; l&#8217;alin&#233;a&#160;2, apr&#232;s le mot&#160;:</p><p style=\"text-align: justify;\">&#171;&#160;enfant&#160;&#187;,</p><p style=\"text-align: justify;\">ins&#233;rer les mots&#160;:</p><p style=\"text-align: justify;\">&#171;&#160;, fran&#231;ais ou &#233;tranger,&#160;&#187;.</p>",
    "exposeSommaire": "<p style=\"text-align: justify;\">Le pr&#233;sent amendement vise &#224; conserver la r&#233;f&#233;rence aux enfants fran&#231;ais et &#233;trangers dans l&#8217;article L.&#160;131&#8209;1 du code de l&#8217;&#233;ducation relatif &#224; l&#8217;instruction obligatoire.</p><p style=\"text-align: justify;\">En effet, il para&#238;t important de continuer &#224; consacrer l&#8217;&#233;gal acc&#232;s &#224; l&#8217;&#233;ducation et &#224; l&#8217;instruction des enfants &#233;trangers comme des droits fondamentaux, garantis tant par le droit international que par le droit interne. A titre d&#8217;exemple, la convention&#160;europ&#233;enne des droits de l&#8217;homme (CEDH) dispose que &#171;&#160;nul ne peut se voir refuser le droit &#224; l&#8217;instruction&#160;&#187; et que sont prohib&#233;es &#171;&#160;les diff&#233;rences de traitements fond&#233;es notamment sur l&#8217;origine nationale&#160;&#187; (article&#160;14).</p><p style=\"text-align: justify;\">Saisi &#224; de nombreuses reprises &#224; ce sujet, le D&#233;fenseur des droits note que &#171;&#160;si tous les enfants sans exception doivent pouvoir acc&#233;der au syst&#232;me &#233;ducatif d&#232;s leur plus jeune &#226;ge, bien souvent, ce droit est ignor&#233; ou, ce qui est plus grave, contest&#233; par ceux-l&#224; m&#234;mes qui sont charg&#233;s d&#8217;appliquer la loi&#160;&#187; (Les droits fondamentaux des &#233;trangers en France, mai 2016, URL&#160;: https&#160;://www.defenseurdesdroits.fr/sites/default/files/atoms/files/736160170_ddd_rapport_droits_etrangers.pdf ).&#160;Il s&#8217;agit donc par le pr&#233;sent amendement de garantir l&#8217;instruction obligatoire pour les enfants fran&#231;ais et &#233;trangers.</p>",
    "annexeExposeSommaire": {
      "@xmlns:xsi": "http://www.w3.org/2001/XMLSchema-instance",
      "@xsi:nil": "true"
    },
    "cartoucheDelaiDepotDepasse": {
      "@xmlns:xsi": "http://www.w3.org/2001/XMLSchema-instance",
      "@xsi:nil": "true"
    }
  },
  "representations": {
    "representation": {
      "nom": "PDF",
      "typeMime": {
        "type": "application",
        "subType": "PDF"
      },
      "statutRepresentation": {
        "verbatim": "true",
        "canonique": "true",
        "officielle": "true",
        "transcription": "false",
        "enregistrement": "false"
      },
      "repSource": {
        "@xmlns:xsi": "http://www.w3.org/2001/XMLSchema-instance",
        "@xsi:nil": "true"
      },
      "offset": {
        "@xmlns:xsi": "http://www.w3.org/2001/XMLSchema-instance",
        "@xsi:nil": "true"
      },
      "contenu": {
        "documentURI": "/15/amendements/1481/CION-CEDU/AC556.pdf"
      },
      "dateDispoRepresentation": {
        "@xmlns:xsi": "http://www.w3.org/2001/XMLSchema-instance",
        "@xsi:nil": "true"
      }
    }
  },
  "seanceDiscussion": {
    "@xmlns:xsi": "http://www.w3.org/2001/XMLSchema-instance",
    "@xsi:nil": "true"
  },
  "sort": {
    "dateSaisie": "2019-01-30T00:14:01.000+01:00",
    "sortEnSeance": "Tombé"
  },
  "dateDepot": "2019-01-25T01:00:00.000+01:00",
  "dateDistribution": "2019-01-28T01:00:00.000+01:00",
  "article99": "0",
  "loiReference": {
    "codeLoi": {
      "@xmlns:xsi": "http://www.w3.org/2001/XMLSchema-instance",
      "@xsi:nil": "true"
    },
    "divisionCodeLoi": {
      "@xmlns:xsi": "http://www.w3.org/2001/XMLSchema-instance",
      "@xsi:nil": "true"
    }
  }
}