{
  "@xmlns": "http://schemas.assemblee-nationale.fr/referentiel",
  "uid": "AMANR5L15SEA717460B2272P2D1N1215",
  "identifiant": {
    "legislature": "15",
    "numero": "1215",
    "numRect": "0",
    "saisine": {
      "refTexteLegislatif": "PRJLANR5L15B2272",
      "numeroPartiePLF": "2",
      "organeExamen": "PO717460",
      "mentionSecondeDeliberation": "0"
    }
  },
  "numeroLong": "II-1215",
  "etapeTexte": "1ère lecture (1ère assemblée saisie)",
  "triAmendement": "bcoaaaaaaaaaaaaaaaaaaaaaaaaaaaaaaaaaaaaaaaaaaaaaaazv",
  "cardinaliteAmdtMultiples": "1",
  "amendementParent": {
    "@xmlns:xsi": "http://www.w3.org/2001/XMLSchema-instance",
    "@xsi:nil": "true"
  },
  "etat": "Discuté",
  "signataires": {
    "auteur": {
      "typeAuteur": "Depute",
      "acteurRef": "PA721070",
      "organeRef": {
        "@xmlns:xsi": "http://www.w3.org/2001/XMLSchema-instance",
        "@xsi:nil": "true"
      },
      "groupePolitiqueRef": "PO730934"
    },
    "cosignataires": {
      "acteurRef": [
        "PA709315",
        "PA605036",
        "PA346218",
        "PA719318",
        "PA267901",
        "PA721070",
        "PA718838",
        "PA608016",
        "PA718884",
        "PA332523"
      ]
    },
    "texteAffichable": "Mme&#160;Ramassamy,  Mme&#160;Anthoine, Mme&#160;Bazin-Malgras, M.&#160;Masson, M.&#160;Kamardine, Mme&#160;Louwagie, M.&#160;Abad, M.&#160;Viala, M.&#160;Brun et Mme&#160;Dalloz"
  },
  "pointeurFragmentTexte": {
    "missionVisee": {
      "idMissionAN": "819",
      "libelleMission": "Outre-mer",
      "codeMissionPLF": "B",
      "libelleMissionPLF": "Répartition, par mission et programme, des crédits du budget général"
    },
    "division": {
      "titre": "ÉTAT B",
      "articleDesignationCourte": "ART. 38",
      "type": "ANNEXE",
      "avant_A_Apres": "A",
      "divisionRattachee": "ARTICLE 38",
      "articleAdditionnel": {
        "@xmlns:xsi": "http://www.w3.org/2001/XMLSchema-instance",
        "@xsi:nil": "true"
      },
      "chapitreAdditionnel": {
        "@xmlns:xsi": "http://www.w3.org/2001/XMLSchema-instance",
        "@xsi:nil": "true"
      },
      "urlDivisionTexteVise": "/15/textes/2272C.asp#D_ETAT_B"
    },
    "alinea": {
      "@xmlns:xsi": "http://www.w3.org/2001/XMLSchema-instance",
      "@xsi:nil": "true"
    }
  },
  "corps": {
    "exposeSommaire": "<p>Le pr&#233;sent amendement vise &#224; augmenter les cr&#233;dits consacr&#233;s par aux Observatoires des prix, des marges et des revenus (OPMR) en&#160;:</p><p>-&#160; augmentant le montant des cr&#233;dits de l&#8217;action 2 Am&#233;nagement du territoire du programme 123 Conditions de vie outre-mer de 100 000&#160;euros en autorisations d&#8217;engagement et en cr&#233;dits de paiement&#160;;</p><p>-&#160; diminuant &#224; due concurrence le montant des cr&#233;dits de la nouvelle action 4 Financement de l&#8217;&#233;conomie du programme 138 Emploi outre-mer en autorisations d&#8217;engagement et en cr&#233;dits de paiement.</p><p>La vie ch&#232;re est l&#8217;une des premi&#232;res pr&#233;occupations de nos compatriotes ultramarins. D&#232;s lors, les OPMR doivent &#234;tre soutenus dans leurs missions.</p><p>Le pr&#233;sent amendement prend en partie acte des engagements pris par le Gouvernement &#224; La R&#233;union &#224; la suite de la crise des &#171;&#160;Gilets jaunes&#160;&#187; en mati&#232;re de transparence des prix et propose ainsi d&#8217;augmenter le budget des OPMR.</p><p>&#160;</p>",
    "annexeExposeSommaire": {
      "@xmlns:xsi": "http://www.w3.org/2001/XMLSchema-instance",
      "@xsi:nil": "true"
    },
    "cartoucheDelaiDepotDepasse": {
      "@xmlns:xsi": "http://www.w3.org/2001/XMLSchema-instance",
      "@xsi:nil": "true"
    },
    "avantAppel": {
      "@xmlns:xsi": "http://www.w3.org/2001/XMLSchema-instance",
      "@xsi:nil": "true"
    },
    "dispositifAmdtCredit": {
      "listeProgrammes": {
        "programme": [
          {
            "libelle": "Emploi outre-mer",
            "id": "96306",
            "AE": {
              "montantPositif": "0",
              "montantNegatif": "100000"
            },
            "CP": {
              "montantPositif": "0",
              "montantNegatif": "100000"
            },
            "action": "modification",
            "lignesCredits": null
          },
          {
            "libelle": "Conditions de vie outre-mer",
            "id": "96307",
            "AE": {
              "montantPositif": "100000",
              "montantNegatif": "0"
            },
            "CP": {
              "montantPositif": "100000",
              "montantNegatif": "0"
            },
            "action": "modification",
            "lignesCredits": null
          }
        ]
      },
      "totalAE": {
        "montantPositif": "100000",
        "montantNegatif": "100000",
        "solde": "0"
      },
      "totalCP": {
        "montantPositif": "100000",
        "montantNegatif": "100000",
        "solde": "0"
      }
    }
  },
  "representations": {
    "representation": {
      "nom": "PDF",
      "typeMime": {
        "type": "application",
        "subType": "PDF"
      },
      "statutRepresentation": {
        "verbatim": "true",
        "canonique": "true",
        "officielle": "true",
        "transcription": "false",
        "enregistrement": "false"
      },
      "repSource": {
        "@xmlns:xsi": "http://www.w3.org/2001/XMLSchema-instance",
        "@xsi:nil": "true"
      },
      "offset": {
        "@xmlns:xsi": "http://www.w3.org/2001/XMLSchema-instance",
        "@xsi:nil": "true"
      },
      "contenu": {
        "documentURI": "/15/amendements/2272C/AN/1215.pdf"
      },
      "dateDispoRepresentation": {
        "@xmlns:xsi": "http://www.w3.org/2001/XMLSchema-instance",
        "@xsi:nil": "true"
      }
    }
  },
  "seanceDiscussion": "RUANR5L15S2020IDS21904",
  "sort": {
    "dateSaisie": "2019-11-06T22:22:34.000+01:00",
    "sortEnSeance": "Rejeté"
  },
  "dateDepot": "2019-10-30T01:00:00.000+01:00",
  "dateDistribution": "2019-11-04T01:00:00.000+01:00",
  "article99": "0",
  "loiReference": {
    "codeLoi": {
      "@xmlns:xsi": "http://www.w3.org/2001/XMLSchema-instance",
      "@xsi:nil": "true"
    },
    "divisionCodeLoi": {
      "@xmlns:xsi": "http://www.w3.org/2001/XMLSchema-instance",
      "@xsi:nil": "true"
    }
  }
}