{
  "@xmlns": "http://schemas.assemblee-nationale.fr/referentiel",
  "uid": "AMANR5L15PO419610B0627P0D1N499",
  "identifiant": {
    "legislature": "15",
    "numero": "499",
    "numRect": "0",
    "saisine": {
      "refTexteLegislatif": "PRJLANR5L15B0627",
      "numeroPartiePLF": "0",
      "organeExamen": "PO419610",
      "mentionSecondeDeliberation": "0"
    }
  },
  "numeroLong": "CE499",
  "etapeTexte": "1ère lecture (1ère assemblée saisie)",
  "triAmendement": "blrenc",
  "cardinaliteAmdtMultiples": "1",
  "amendementParent": {
    "@xmlns:xsi": "http://www.w3.org/2001/XMLSchema-instance",
    "@xsi:nil": "true"
  },
  "etat": "Discuté",
  "signataires": {
    "auteur": {
      "typeAuteur": "Depute",
      "acteurRef": "PA642847",
      "organeRef": {
        "@xmlns:xsi": "http://www.w3.org/2001/XMLSchema-instance",
        "@xsi:nil": "true"
      },
      "groupePolitiqueRef": "PO730934"
    },
    "cosignataires": {
      "acteurRef": [
        "PA267204",
        "PA719318",
        "PA718838",
        "PA330684",
        "PA267260",
        "PA605036",
        "PA609726",
        "PA266797",
        "PA720210",
        "PA609245",
        "PA267735",
        "PA267318",
        "PA346218",
        "PA748954",
        "PA606712",
        "PA720386",
        "PA720630",
        "PA721054",
        "PA334654",
        "PA608416",
        "PA718884",
        "PA642847",
        "PA643103"
      ]
    },
    "texteAffichable": "M.&#160;Bazin,  M.&#160;Abad, Mme&#160;Anthoine, M.&#160;Aubert, Mme&#160;Bazin-Malgras, Mme&#160;Beauvais, Mme&#160;Val&#233;rie&#160;Boyer, M.&#160;Brun, M.&#160;de Ganay, M.&#160;Di Filippo, M.&#160;Ferrara, M.&#160;Grelier, M.&#160;Hetzel, Mme&#160;Lacroute, M.&#160;Lorion, M.&#160;Lurton, M.&#160;Masson, M.&#160;Minot, Mme&#160;Poletti, M.&#160;Savignat, M.&#160;Sermier, M.&#160;Straumann et M.&#160;Gosselin"
  },
  "pointeurFragmentTexte": {
    "missionVisee": {
      "@xmlns:xsi": "http://www.w3.org/2001/XMLSchema-instance",
      "@xsi:nil": "true"
    },
    "division": {
      "titre": "Article PREMIER",
      "articleDesignationCourte": "ART. PREMIER",
      "type": "ARTICLE",
      "avant_A_Apres": "A",
      "divisionRattachee": "ARTICLE PREMIER",
      "articleAdditionnel": {
        "@xmlns:xsi": "http://www.w3.org/2001/XMLSchema-instance",
        "@xsi:nil": "true"
      },
      "chapitreAdditionnel": {
        "@xmlns:xsi": "http://www.w3.org/2001/XMLSchema-instance",
        "@xsi:nil": "true"
      },
      "urlDivisionTexteVise": "/15/textes/0627.asp#D_Article_1er"
    },
    "alinea": {
      "avant_A_Apres": {
        "@xmlns:xsi": "http://www.w3.org/2001/XMLSchema-instance",
        "@xsi:nil": "true"
      },
      "numero": "15",
      "alineaDesignation": {
        "@xmlns:xsi": "http://www.w3.org/2001/XMLSchema-instance",
        "@xsi:nil": "true"
      }
    }
  },
  "corps": {
    "dispositif": "<p>I.&#160;-&#160;Au d&#233;but de l&#8217;alin&#233;a 15, substituer aux mots&#160;:</p><p style=\"text-align: justify;\">&#171;&#160;Les crit&#232;res et modalit&#233;s de d&#233;termination du prix mentionn&#233;s&#160;&#187;</p><p style=\"text-align: justify;\">les mots&#160;:</p><p style=\"text-align: justify;\">&#171;&#160;Le prix d&#233;terminable mentionn&#233;&#160;&#187;.</p><p style=\"text-align: justify;\">II.&#160;-&#160;Au m&#234;me alin&#233;a, apr&#232;s les deux premi&#232;res occurrences du mot&#160;:</p><p style=\"text-align: justify;\">&#171;&#160;indicateurs&#160;&#187;,</p><p style=\"text-align: justify;\">ins&#233;rer les mots&#160;:</p><p style=\"text-align: justify;\">&#171;&#160;publics disponibles&#160;&#187;.</p><p style=\"text-align: justify;\">III.&#160;-&#160;Supprimer la seconde phrase.</p>",
    "exposeSommaire": "<p style=\"text-align: justify;\">L&#8217;objectif de cet amendement est de beaucoup mieux encadrer le choix des indicateurs utilis&#233;s pour la r&#233;f&#233;rence aux co&#251;ts de production, ces indicateurs doivent &#234;tre publics et indiscutables. L&#8217;Observatoire de la formation des prix et des marges n&#8217;est plus mentionn&#233; comme organisme source des indices. Celui-ci constituerait pourtant, avec les moyens adapt&#233;s, le meilleur garant de la justesse des indicateurs &#224; prendre en compte.</p><p style=\"text-align: justify;\">De plus, il est important que les indicateurs soient publics afin qu&#8217;un acheteur n&#8217;impose pas un indicateur qu&#8217;il a construit lui-m&#234;me aux producteurs. La r&#233;daction doit &#234;tre plus ferme et pr&#233;cise en ce sens.</p>",
    "annexeExposeSommaire": {
      "@xmlns:xsi": "http://www.w3.org/2001/XMLSchema-instance",
      "@xsi:nil": "true"
    }
  },
  "representations": {
    "representation": {
      "nom": "PDF",
      "typeMime": {
        "type": "application",
        "subType": "PDF"
      },
      "statutRepresentation": {
        "verbatim": "true",
        "canonique": "true",
        "officielle": "true",
        "transcription": "false",
        "enregistrement": "false"
      },
      "repSource": {
        "@xmlns:xsi": "http://www.w3.org/2001/XMLSchema-instance",
        "@xsi:nil": "true"
      },
      "offset": {
        "@xmlns:xsi": "http://www.w3.org/2001/XMLSchema-instance",
        "@xsi:nil": "true"
      },
      "contenu": {
        "documentURI": "/15/amendements/0627/CION-ECO/CE499.pdf"
      },
      "dateDispoRepresentation": {
        "@xmlns:xsi": "http://www.w3.org/2001/XMLSchema-instance",
        "@xsi:nil": "true"
      }
    }
  },
  "seanceDiscussion": {
    "@xmlns:xsi": "http://www.w3.org/2001/XMLSchema-instance",
    "@xsi:nil": "true"
  },
  "sort": {
    "dateSaisie": "2018-04-17T18:50:34.000+02:00",
    "sortEnSeance": "Rejeté"
  },
  "dateDepot": "2018-04-08T02:00:00.000+02:00",
  "dateDistribution": "2018-04-16T02:00:00.000+02:00",
  "article99": "0",
  "loiReference": {
    "codeLoi": {
      "@xmlns:xsi": "http://www.w3.org/2001/XMLSchema-instance",
      "@xsi:nil": "true"
    },
    "divisionCodeLoi": {
      "@xmlns:xsi": "http://www.w3.org/2001/XMLSchema-instance",
      "@xsi:nil": "true"
    }
  }
}