{
  "@xmlns": "http://schemas.assemblee-nationale.fr/referentiel",
  "uid": "AMANR5L15SEA717460B0269P0D1N269",
  "identifiant": {
    "legislature": "15",
    "numero": "269",
    "numRect": "0",
    "saisine": {
      "refTexteLegislatif": "PRJLANR5L15B0269",
      "numeroPartiePLF": "0",
      "organeExamen": "PO717460",
      "mentionSecondeDeliberation": "0"
    }
  },
  "numeroLong": "269",
  "etapeTexte": "1ère lecture (1ère assemblée saisie)",
  "triAmendement": "ap",
  "cardinaliteAmdtMultiples": "1",
  "amendementParent": {
    "@xmlns:xsi": "http://www.w3.org/2001/XMLSchema-instance",
    "@xsi:nil": "true"
  },
  "etat": "Irrecevable",
  "signataires": {
    "auteur": {
      "typeAuteur": "Depute",
      "acteurRef": "PA330684",
      "organeRef": {
        "@xmlns:xsi": "http://www.w3.org/2001/XMLSchema-instance",
        "@xsi:nil": "true"
      },
      "groupePolitiqueRef": "PO730934"
    },
    "cosignataires": {
      "acteurRef": "PA330684"
    },
    "texteAffichable": "Mme&#160;Val&#233;rie&#160;Boyer"
  },
  "pointeurFragmentTexte": {
    "missionVisee": {
      "@xmlns:xsi": "http://www.w3.org/2001/XMLSchema-instance",
      "@xsi:nil": "true"
    },
    "division": {
      "titre": "Article 48",
      "articleDesignationCourte": "APRÈS ART. 48",
      "type": "ARTICLE",
      "avant_A_Apres": "Après",
      "divisionRattachee": "APRÈS L'ARTICLE 48, insérer l'article suivant:",
      "articleAdditionnel": "1",
      "chapitreAdditionnel": {
        "@xmlns:xsi": "http://www.w3.org/2001/XMLSchema-instance",
        "@xsi:nil": "true"
      },
      "urlDivisionTexteVise": "/15/textes/0269.asp#D_Article_48"
    },
    "alinea": {
      "@xmlns:xsi": "http://www.w3.org/2001/XMLSchema-instance",
      "@xsi:nil": "true"
    }
  },
  "corps": {
    "dispositif": "<p style=\"text-align: justify;\">L&#8217;article L.&#160;162&#8209;26&#8209;1 du code de la s&#233;curit&#233; sociale est ainsi modifi&#233;&#160;:</p><p style=\"text-align: justify;\">1&#176; Le mot&#160;: &#171;&#160;m&#233;decins&#160;&#187; est remplac&#233; par les mots&#160;: &#171;&#160;professionnels m&#233;dicaux ou des professionnels param&#233;dicaux&#160;&#187;&#160;;</p><p style=\"text-align: justify;\">2&#176; Le mot&#160;: &#171;&#160;praticiens&#160;&#187; est remplac&#233; par les mots&#160;: &#171;&#160;professionnels m&#233;dicaux ou des professionnels param&#233;dicaux&#160;&#187;.</p>",
    "exposeSommaire": "<p style=\"text-align: justify;\">Dans le cadre de la promotion des parcours de soins des patients et de la fluidit&#233; des fili&#232;res, le 2&#176; de l&#8217;article&#160;41 de la Loi de financement de la s&#233;curit&#233; sociale (LFSS) pour 2014 est venu modifier la r&#233;daction de l&#8217;article L.&#160;162&#8209;26&#8209;1 du Code de la s&#233;curit&#233; sociale afin d&#8217;autoriser les &#233;tablissements priv&#233;s de soins de suite et de r&#233;adaptation (SSR) relevant du d) de l&#8217;article L.&#160;162&#8209;22&#8209;6 du m&#234;me code, &#224; facturer les Actes et Consultations Externes (ACE) de leurs m&#233;decins salari&#233;s.</p><p style=\"text-align: justify;\">En 2017, l&#8217;article&#160;82 de la Loi de financement de la s&#233;curit&#233; sociale (LFSS) a autoris&#233; les &#233;tablissements de soins de suite et de r&#233;adaptation (SSR) relevant des a, b et c) de l&#8217;article L.&#160;162&#8209;22&#8209;6 (&#233;tablissements publics et assimil&#233;s) du Code de la s&#233;curit&#233; sociale &#224; facturer les ACE pour l&#8217;ensemble de leur personnel, m&#233;dical et param&#233;dical.</p><p style=\"text-align: justify;\">Cet amendement a pour objet, dans l&#8217;int&#233;r&#234;t des patients et dans un souci d&#8217;&#233;quit&#233; entre les acteurs de permettre aux &#233;tablissements de sant&#233; priv&#233;s, relevant du d) de l&#8217;article L.&#160;162&#8209;22&#8209;6 du m&#234;me Code, de facturer les ACE r&#233;alis&#233;s par leurs professionnels param&#233;dicaux salari&#233;s.</p>",
    "annexeExposeSommaire": {
      "@xmlns:xsi": "http://www.w3.org/2001/XMLSchema-instance",
      "@xsi:nil": "true"
    }
  },
  "representations": {
    "representation": {
      "nom": "PDF",
      "typeMime": {
        "type": "application",
        "subType": "PDF"
      },
      "statutRepresentation": {
        "verbatim": "true",
        "canonique": "true",
        "officielle": "true",
        "transcription": "false",
        "enregistrement": "false"
      },
      "repSource": {
        "@xmlns:xsi": "http://www.w3.org/2001/XMLSchema-instance",
        "@xsi:nil": "true"
      },
      "offset": {
        "@xmlns:xsi": "http://www.w3.org/2001/XMLSchema-instance",
        "@xsi:nil": "true"
      },
      "contenu": {
        "documentURI": "/15/amendements/0269/AN/269.pdf"
      },
      "dateDispoRepresentation": {
        "@xmlns:xsi": "http://www.w3.org/2001/XMLSchema-instance",
        "@xsi:nil": "true"
      }
    }
  },
  "seanceDiscussion": {
    "@xmlns:xsi": "http://www.w3.org/2001/XMLSchema-instance",
    "@xsi:nil": "true"
  },
  "sort": {
    "@xmlns:xsi": "http://www.w3.org/2001/XMLSchema-instance",
    "@xsi:nil": "true"
  },
  "dateDepot": "2017-10-19T02:00:00.000+02:00",
  "dateDistribution": {
    "@xmlns:xsi": "http://www.w3.org/2001/XMLSchema-instance",
    "@xsi:nil": "true"
  },
  "article99": "0",
  "loiReference": {
    "codeLoi": "c sécurité sociale",
    "divisionCodeLoi": "L162-26-1"
  }
}