{
  "@xmlns": "http://schemas.assemblee-nationale.fr/referentiel",
  "uid": "AMANR5L15PO419865B1831P0D1N2564",
  "identifiant": {
    "legislature": "15",
    "numero": "2564",
    "numRect": "0",
    "saisine": {
      "refTexteLegislatif": "PRJLANR5L15B1831",
      "numeroPartiePLF": "0",
      "organeExamen": "PO419865",
      "mentionSecondeDeliberation": "0"
    }
  },
  "numeroLong": "CD2564",
  "etapeTexte": "1ère lecture (2ème assemblée saisie)",
  "triAmendement": "gcaaaaaaaaaaaaaaaaaaaaaaaaaaaaaaaaaaaaaaaaaaaaaaaaey",
  "cardinaliteAmdtMultiples": "1",
  "amendementParent": {
    "@xmlns:xsi": "http://www.w3.org/2001/XMLSchema-instance",
    "@xsi:nil": "true"
  },
  "etat": "Discuté",
  "signataires": {
    "auteur": {
      "typeAuteur": "Depute",
      "acteurRef": "PA717379",
      "organeRef": {
        "@xmlns:xsi": "http://www.w3.org/2001/XMLSchema-instance",
        "@xsi:nil": "true"
      },
      "groupePolitiqueRef": "PO730964"
    },
    "cosignataires": {
      "acteurRef": [
        "PA717379",
        "PA718876",
        "PA720932",
        "PA719372"
      ]
    },
    "texteAffichable": "M.&#160;Maillard,  M.&#160;Kasbarian, M.&#160;Besson-Moreau et M.&#160;Da Silva"
  },
  "pointeurFragmentTexte": {
    "missionVisee": {
      "@xmlns:xsi": "http://www.w3.org/2001/XMLSchema-instance",
      "@xsi:nil": "true"
    },
    "division": {
      "titre": "Article 26",
      "articleDesignationCourte": "ART. 26",
      "type": "ARTICLE",
      "avant_A_Apres": "A",
      "divisionRattachee": "ARTICLE 26",
      "articleAdditionnel": {
        "@xmlns:xsi": "http://www.w3.org/2001/XMLSchema-instance",
        "@xsi:nil": "true"
      },
      "chapitreAdditionnel": {
        "@xmlns:xsi": "http://www.w3.org/2001/XMLSchema-instance",
        "@xsi:nil": "true"
      },
      "urlDivisionTexteVise": "/15/textes/1831.asp#D_Article_26"
    },
    "alinea": {
      "avant_A_Apres": {
        "@xmlns:xsi": "http://www.w3.org/2001/XMLSchema-instance",
        "@xsi:nil": "true"
      },
      "numero": "3",
      "alineaDesignation": {
        "@xmlns:xsi": "http://www.w3.org/2001/XMLSchema-instance",
        "@xsi:nil": "true"
      }
    }
  },
  "corps": {
    "dispositif": "<p>I. &#8211; Apr&#232;s le mot&#160;:</p><p style=\"text-align: justify;\">&#171;&#160;covoiturage&#160;&#187;,</p><p style=\"text-align: justify;\">r&#233;diger ainsi la fin de l&#8217;alin&#233;a&#160;3&#160;:</p><p style=\"text-align: justify;\">&#171;&#160;au travers de l&#8217;&#233;valuation du trajet sur la base d&#8217;un bar&#232;me kilom&#233;trique dont les modalit&#233;s sont fix&#233;es par d&#233;cret.&#160;&#187;</p><p style=\"text-align: justify;\">II. &#8211; La perte de recettes pour l&#8217;&#201;tat est compens&#233;e &#224; due concurrence par la cr&#233;ation d&#8217;une taxe additionnelle aux droits mentionn&#233;s aux articles 575 et 575 A du code g&#233;n&#233;ral des imp&#244;ts.</p><p style=\"text-align: justify;\">III. &#8211; La perte de recettes pour les organismes de s&#233;curit&#233; sociale est compens&#233;e &#224; due concurrence par la majoration des droits mentionn&#233;s aux articles 575 et 575 A du code g&#233;n&#233;ral des imp&#244;ts.</p>",
    "exposeSommaire": "<p>Le pr&#233;sent amendement vise &#224; permettre l&#8217;instauration d&#8217;un bar&#232;me kilom&#233;trique pour le remboursement des trajets quotidiens entre le domicile et le lieu de travail.</p><p>Actuellement, lorsque le salari&#233; doit utiliser son v&#233;hicule personnel pour son trajet domicile-travail, l&#8217;employeur a la possibilit&#233; de lui rembourser des frais de carburants, exon&#233;r&#233;s de charges sociales et d&#8217;imp&#244;t sur le revenu, dans la limite de 200 euros par an.</p><p>En appliquant un bar&#232;me kilom&#233;trique &#8211; jusque-l&#224; limit&#233; aux frais de d&#233;placement &#8211; aux trajets quotidiens domicile-travail, l&#8217;employeur, dans la mesure o&#249; il le pourrait et le voudrait, rembourserait les trajets domicile-travail directement &#224; ses employ&#233;s.</p><p>Une telle mesure, en augmentant la prise en charge par l&#8217;employeur des frais de transport de ses employ&#233;s, permet de revaloriser le travail, l&#8217;effort de ceux qui se l&#232;vent, jour apr&#232;s jour, pour contribuer &#224; l&#8217;&#233;conomie et r&#233;aliser le souhait de vivre mieux.</p><p>On ne doit plus payer pour aller travailler, c&#8217;est ce que cet amendement entend r&#233;aliser. En conservant &#233;galement la possibilit&#233; de faire prendre en charge le covoiturage, cet amendement visera aussi &#224; encourager un comportement vertueux en mati&#232;re d&#8217;&#233;cologie.</p>",
    "annexeExposeSommaire": {
      "@xmlns:xsi": "http://www.w3.org/2001/XMLSchema-instance",
      "@xsi:nil": "true"
    },
    "cartoucheDelaiDepotDepasse": {
      "@xmlns:xsi": "http://www.w3.org/2001/XMLSchema-instance",
      "@xsi:nil": "true"
    }
  },
  "representations": {
    "representation": {
      "nom": "PDF",
      "typeMime": {
        "type": "application",
        "subType": "PDF"
      },
      "statutRepresentation": {
        "verbatim": "true",
        "canonique": "true",
        "officielle": "true",
        "transcription": "false",
        "enregistrement": "false"
      },
      "repSource": {
        "@xmlns:xsi": "http://www.w3.org/2001/XMLSchema-instance",
        "@xsi:nil": "true"
      },
      "offset": {
        "@xmlns:xsi": "http://www.w3.org/2001/XMLSchema-instance",
        "@xsi:nil": "true"
      },
      "contenu": {
        "documentURI": "/15/amendements/1831/CION-DVP/CD2564.pdf"
      },
      "dateDispoRepresentation": {
        "@xmlns:xsi": "http://www.w3.org/2001/XMLSchema-instance",
        "@xsi:nil": "true"
      }
    }
  },
  "seanceDiscussion": {
    "@xmlns:xsi": "http://www.w3.org/2001/XMLSchema-instance",
    "@xsi:nil": "true"
  },
  "sort": {
    "dateSaisie": "2019-05-18T00:47:25.000+02:00",
    "sortEnSeance": "Retiré"
  },
  "dateDepot": "2019-05-09T02:00:00.000+02:00",
  "dateDistribution": "2019-05-16T02:00:00.000+02:00",
  "article99": "0",
  "loiReference": {
    "codeLoi": {
      "@xmlns:xsi": "http://www.w3.org/2001/XMLSchema-instance",
      "@xsi:nil": "true"
    },
    "divisionCodeLoi": {
      "@xmlns:xsi": "http://www.w3.org/2001/XMLSchema-instance",
      "@xsi:nil": "true"
    }
  }
}