{
  "@xmlns": "http://schemas.assemblee-nationale.fr/referentiel",
  "uid": "AMANR5L15PO420120B1297P0D1N175",
  "identifiant": {
    "legislature": "15",
    "numero": "175",
    "numRect": "0",
    "saisine": {
      "refTexteLegislatif": "PRJLANR5L15B1297",
      "numeroPartiePLF": "0",
      "organeExamen": "PO420120",
      "mentionSecondeDeliberation": "0"
    }
  },
  "numeroLong": "AS175",
  "etapeTexte": "1ère lecture (1ère assemblée saisie)",
  "triAmendement": "epaaaaaaaaaaaaaaaaaaaaaaaaaaaaaaaaaaaaaaaaaaaaaaaafaaf",
  "cardinaliteAmdtMultiples": "1",
  "amendementParent": {
    "@xmlns:xsi": "http://www.w3.org/2001/XMLSchema-instance",
    "@xsi:nil": "true"
  },
  "etat": "Irrecevable",
  "signataires": {
    "auteur": {
      "typeAuteur": "Depute",
      "acteurRef": "PA721474",
      "organeRef": {
        "@xmlns:xsi": "http://www.w3.org/2001/XMLSchema-instance",
        "@xsi:nil": "true"
      },
      "groupePolitiqueRef": "PO730934"
    },
    "cosignataires": {
      "acteurRef": [
        "PA721286",
        "PA267378",
        "PA856",
        "PA267318",
        "PA721474",
        "PA267289"
      ]
    },
    "texteAffichable": "M.&#160;Viry,  M.&#160;Cherpion, M.&#160;Door, Mme&#160;Levy, M.&#160;Grelier et M.&#160;Ramadier"
  },
  "pointeurFragmentTexte": {
    "missionVisee": {
      "@xmlns:xsi": "http://www.w3.org/2001/XMLSchema-instance",
      "@xsi:nil": "true"
    },
    "division": {
      "titre": "Article 29",
      "articleDesignationCourte": "APRÈS ART. 29",
      "type": "ARTICLE",
      "avant_A_Apres": "Après",
      "divisionRattachee": "APRÈS L'ARTICLE 29, insérer l'article suivant:",
      "articleAdditionnel": "1",
      "chapitreAdditionnel": {
        "@xmlns:xsi": "http://www.w3.org/2001/XMLSchema-instance",
        "@xsi:nil": "true"
      },
      "urlDivisionTexteVise": "/15/textes/1297.asp#D_Article_29"
    },
    "alinea": {
      "@xmlns:xsi": "http://www.w3.org/2001/XMLSchema-instance",
      "@xsi:nil": "true"
    }
  },
  "corps": {
    "dispositif": "<p style=\"text-align: justify;\">Apr&#232;s la premi&#232;re phrase de l&#8217;article L.&#160;162&#8209;21&#8209;2 du code de la s&#233;curit&#233; sociale, est ins&#233;r&#233;e une phrase ainsi r&#233;dig&#233;e&#160;: &#171;&#160;La publication ou la notification annuelles de ces tarifs et dotations aux &#233;tablissements de sant&#233; fait appara&#238;tre la part repr&#233;sent&#233;e dans leur montant par le financement des transports susmentionn&#233;s, &#233;ventuellement affect&#233;e d&#8217;un coefficient g&#233;ographique afin de tenir compte de la situation territoriale de chaque &#233;tablissement.&#160;&#187;</p>",
    "exposeSommaire": "<p>L&#8217;article 80 de la loi n&#176; 2016-1827 du 23 d&#233;cembre 2016 de financement de la s&#233;curit&#233; sociale pour 2017 a introduit un nouvel article L. 162-21-2 dans le Code de la s&#233;curit&#233; sociale qui, selon l&#8217;&#233;tude d&#8217;impact du projet de loi de financement de la s&#233;curit&#233; sociale pour 2018, &#171; a pos&#233; le principe selon lequel tous les transports inter-&#233;tablissements devraient &#234;tre pris en charge par les &#233;tablissements de sant&#233; (&#8230;), et ce en lieu et place d&#8217;une facturation directe &#224; l&#8217;assurance maladie &#187;.</p><p>&#160;</p><p>Cette r&#233;forme radicale du financement des transports inter-&#233;tablissements, qui entre en vigueur le 1er octobre 2018, n&#8217;a pas &#233;t&#233; suffisamment anticip&#233;e en amont et cr&#233;e des in&#233;galit&#233;s importantes entre les &#233;tablissements concern&#233;s. En effet, que l&#8217;&#233;tablissement se trouve dans un territoire fortement dot&#233; en infrastructures hospitali&#232;res (de sorte que les trajets interhospitaliers seront courts) ou moins bien dot&#233;, le co&#251;t repr&#233;sent&#233; par cette r&#233;forme sera tr&#232;s diff&#233;rent.</p><p>Par ailleurs, le co&#251;t pr&#233;cis de cette r&#233;forme pour chaque &#233;tablissement demeure encore aujourd&#8217;hui inconnu. Car, selon leur r&#233;gime financier, leurs tarifs de prestation ou leur dotation</p><p>annuelle ne comportent pas le montant repr&#233;sent&#233; par les transports inter-&#233;tablissements qu&#8217;ils sont cens&#233; assum&#233;s d&#233;sormais.</p><p>C&#8217;est pourquoi la pr&#233;sente proposition d&#8217;amendement tend &#224; pr&#233;voir, d&#8217;une part, que ce montant figure express&#233;ment dans les arr&#234;t&#233;s relatifs aux dotations et tarifs de tous les &#233;tablissements de sant&#233; et, d&#8217;autre part, qu&#8217;un coefficient g&#233;ographique soit cr&#233;&#233; afin de tenir compte de l&#8217;implantation territoriale des &#233;tablissements de sant&#233; les plus isol&#233;s. Ce coefficient, dont le r&#233;gime et les modalit&#233;s de fixation seraient renvoy&#233;s au pouvoir r&#233;glementaire, compenserait ainsi partiellement cette in&#233;galit&#233; territoriale.</p>",
    "annexeExposeSommaire": {
      "@xmlns:xsi": "http://www.w3.org/2001/XMLSchema-instance",
      "@xsi:nil": "true"
    }
  },
  "representations": {
    "representation": {
      "nom": "PDF",
      "typeMime": {
        "type": "application",
        "subType": "PDF"
      },
      "statutRepresentation": {
        "verbatim": "true",
        "canonique": "true",
        "officielle": "true",
        "transcription": "false",
        "enregistrement": "false"
      },
      "repSource": {
        "@xmlns:xsi": "http://www.w3.org/2001/XMLSchema-instance",
        "@xsi:nil": "true"
      },
      "offset": {
        "@xmlns:xsi": "http://www.w3.org/2001/XMLSchema-instance",
        "@xsi:nil": "true"
      },
      "contenu": {
        "documentURI": "/15/amendements/1297/CION-SOC/AS175.pdf"
      },
      "dateDispoRepresentation": {
        "@xmlns:xsi": "http://www.w3.org/2001/XMLSchema-instance",
        "@xsi:nil": "true"
      }
    }
  },
  "seanceDiscussion": {
    "@xmlns:xsi": "http://www.w3.org/2001/XMLSchema-instance",
    "@xsi:nil": "true"
  },
  "sort": {
    "@xmlns:xsi": "http://www.w3.org/2001/XMLSchema-instance",
    "@xsi:nil": "true"
  },
  "dateDepot": "2018-10-12T02:00:00.000+02:00",
  "dateDistribution": {
    "@xmlns:xsi": "http://www.w3.org/2001/XMLSchema-instance",
    "@xsi:nil": "true"
  },
  "article99": "0",
  "loiReference": {
    "codeLoi": "sécurité sociale",
    "divisionCodeLoi": "L162-21-2"
  }
}