{
  "@xmlns": "http://schemas.assemblee-nationale.fr/referentiel",
  "uid": "AMANR5L15PO59048B0384P0D1N227",
  "identifiant": {
    "legislature": "15",
    "numero": "227",
    "numRect": "0",
    "saisine": {
      "refTexteLegislatif": "PRJLANR5L15B0384",
      "numeroPartiePLF": "0",
      "organeExamen": "PO59048",
      "mentionSecondeDeliberation": "0"
    }
  },
  "numeroLong": "CF227",
  "etapeTexte": "1ère lecture (1ère assemblée saisie)",
  "triAmendement": "i",
  "cardinaliteAmdtMultiples": "1",
  "amendementParent": {
    "@xmlns:xsi": "http://www.w3.org/2001/XMLSchema-instance",
    "@xsi:nil": "true"
  },
  "etat": "Irrecevable",
  "signataires": {
    "auteur": {
      "typeAuteur": "Depute",
      "acteurRef": "PA942",
      "organeRef": {
        "@xmlns:xsi": "http://www.w3.org/2001/XMLSchema-instance",
        "@xsi:nil": "true"
      },
      "groupePolitiqueRef": "PO730952"
    },
    "cosignataires": {
      "acteurRef": [
        "PA721094",
        "PA722030",
        "PA610775",
        "PA332228",
        "PA942",
        "PA267780",
        "PA721110",
        "PA1960",
        "PA267585",
        "PA266788",
        "PA642935",
        "PA720696",
        "PA719806",
        "PA712014",
        "PA267766",
        "PA721486"
      ]
    },
    "texteAffichable": "M.&#160;Charles&#160;de Courson,  M.&#160;Ledoux, Mme&#160;Auconie, M.&#160;Becht, M.&#160;Benoit, M.&#160;Bournazel, M.&#160;Guy&#160;Bricout, Mme&#160;Descamps, M.&#160;Dunoyer, M.&#160;Vercamer, Mme&#160;Sanquer, M.&#160;Naegelen, M.&#160;Morel-&#192;-L&apos;Huissier, M.&#160;Leroy, M.&#160;Gom&#232;s et Mme&#160;Firmin Le Bodo"
  },
  "pointeurFragmentTexte": {
    "missionVisee": {
      "@xmlns:xsi": "http://www.w3.org/2001/XMLSchema-instance",
      "@xsi:nil": "true"
    },
    "division": {
      "titre": "Article 18",
      "articleDesignationCourte": "APRÈS ART. 18",
      "type": "ARTICLE",
      "avant_A_Apres": "Après",
      "divisionRattachee": "APRÈS L'ARTICLE 18, insérer l'article suivant:",
      "articleAdditionnel": "1",
      "chapitreAdditionnel": {
        "@xmlns:xsi": "http://www.w3.org/2001/XMLSchema-instance",
        "@xsi:nil": "true"
      },
      "urlDivisionTexteVise": "/15/textes/0384.asp#D_Article_18"
    },
    "alinea": {
      "@xmlns:xsi": "http://www.w3.org/2001/XMLSchema-instance",
      "@xsi:nil": "true"
    }
  },
  "corps": {
    "dispositif": "<p style=\"text-align: justify;\">I.&#160;&#8211;&#160;Le code g&#233;n&#233;ral des collectivit&#233;s territoriales est ainsi modifi&#233;&#160;:</p><p style=\"text-align: justify;\">1&#176;&#160;&#192; l&#8217;avant-dernier alin&#233;a de l&#8217;article L.&#160;2333&#8209;54, le taux&#160;: &#171;&#160;83,5&#160;%&#160;&#187; est remplac&#233;, par deux fois, par le taux&#160;: &#171;&#160;82&#160;%&#160;&#187;&#160;;</p><p style=\"text-align: justify;\">2&#176;&#160;Le dernier alin&#233;a de l&#8217;article L.&#160;2333&#8209;56 du code g&#233;n&#233;ral des collectivit&#233;s territoriales est ainsi r&#233;dig&#233;&#160;: &#171;&#160;Le taux du pr&#233;l&#232;vement progressif applicable &#224; chacune des parts ainsi d&#233;termin&#233;es est fix&#233; par d&#233;cret, dans les limites minimale et maximale de 6&#160;% et de 83,5&#160;%, pour le produit brut des jeux mentionn&#233;s aux 1&#176;, 2&#176; et 3&#176; de&#160;l&#8217;article L.&#160;2333&#8209;55&#8209;1 et de&#160;4,5&#160;% et de 82&#160;%, pour le produit brut des jeux mentionn&#233;s aux 4&#176; et 5&#176; de&#160;l&#8217;article L.&#160;2333&#8209;55&#8209;1.&#160;&#187;</p><p style=\"text-align: justify;\">II.&#160;&#8211;&#160;La perte de recettes pour l&#8217;&#201;tat est compens&#233;e &#224; due concurrence par une majoration des pr&#233;l&#232;vements appliqu&#233;s sur le produit brut des jeux exploit&#233;s dans les clubs de Jeux &#224; Paris ouverts en application de l&#8217;article&#160;34 V de la loi n&#176;&#160;2017&#8209;257 du 28 f&#233;vrier 2017.</p>",
    "exposeSommaire": "<p style=\"line-height: normal; text-align: justify;\">Le projet de loi de financement de la s&#233;curit&#233; Sociale 2018 pr&#233;voit une augmentation de la CSG de 1.7 point sur les jeux de casino, d&#233;finis au III de l&#8217;article L.&#160;136&#8209;7&#8209;1 du code de la s&#233;curit&#233; sociale. Le taux de 9.5&#160;% applicable &#224; une fraction (68&#160;%) du produit des jeux automatiques, dits &#171;&#160;machines &#224; sous&#160;&#187; est port&#233; &#224; 11,2&#160;%.</p><p style=\"line-height: normal; text-align: justify;\">Il est rappel&#233; qu&#8217;&#224; ce jour les casinos sont les seules personnes morales de droit priv&#233; assujetties &#224; la CSG.</p><p style=\"line-height: normal; text-align: justify;\">Cette augmentation de taux les p&#233;nalise encore davantage.</p><p style=\"line-height: normal; text-align: justify;\">Cet amendement propose de compenser en partie cette augmentation en modifiant les limites minimale et maximale du bar&#232;me du pr&#233;l&#232;vement progressif applicable aux jeux concern&#233;s par cette hausse du taux de CSG.</p><p style=\"line-height: normal; text-align: justify;\">La Cour des comptes et les parlementaires l&#8217;ont r&#233;cemment d&#233;montr&#233; dans leurs tous derniers rapports, les casinos sortent difficilement d&#8217;une longue p&#233;riode de crise qui les a fortement &#233;branl&#233;s.</p><p style=\"line-height: normal; text-align: justify;\">Les casinos sont n&#233;cessaires &#224; plus d&#8217;un titre&#160;:&#160;</p><ul style=\"text-align: justify;\"><li style=\"text-align: justify; line-height: normal;\">Les casinos permettent premi&#232;rement d&#8217;organiser le jeu, en assurant aux joueurs &#224; l&#8217;&#201;tat et aux collectivit&#233;s&#160; leur sinc&#233;rit&#233; et leur r&#233;gularit&#233;, dans des lieux contr&#244;l&#233;s par les pouvoirs de police, o&#249; les mineurs et les personnes fragiles ne sont pas admis.&#160;&#160; <br /> L&#8217;affaiblissement des casinos favoriserait le d&#233;veloppement des tripots clandestins et leurs pratiques mafieuses, o&#249; ni les r&#232;gles, ni les personnes&#160;ne sont respect&#233;es ; pour s&#8217;en convaincre, il suffit de voir la prolif&#233;ration de maisons de jeux clandestins entrain&#233;e par la fermeture successive des cercles &#224; Paris, et qui a oblig&#233; le gouvernement &#224; r&#233;agir, dans l&#8217;urgence, en proposant une nouvelle formule d&#8217;organisation du jeu &#224; Paris&#160;: &#171;&#160;les Clubs&#160;&#187;.</li></ul><p style=\"text-align: justify;\">&#160;</p><ul style=\"text-align: justify;\"><li style=\"text-align: justify; line-height: normal;\">Deuxi&#232;mement, les casinos g&#233;n&#232;rent encore 15&#160;000 emplois directs et 35&#160;000 emplois induits.&#160;&#160;&#160;&#160;&#160; <br /> Ceux-ci doivent &#234;tre p&#233;rennis&#233;s, particuli&#232;rement parce que la plupart sont propos&#233;s dans des secteurs g&#233;ographiques souvent d&#233;pourvus d&#8217;activit&#233;s &#233;conomiques.</li></ul><p style=\"text-align: justify;\">&#160;</p><ul style=\"text-align: justify;\"><li style=\"text-align: justify; line-height: normal;\">Troisi&#232;mement, les casinos, depuis 1806 (D&#233;cret imp&#233;rial de Saint Cloud), ont permis l&#8217;incomparable d&#233;veloppement &#233;conomique des stations baln&#233;aires et thermales fran&#231;aises&#160;; ce sont les casinos qui ont fait les stations et pas l&#8217;inverse, contribuant ainsi &#224; faire de la France la premi&#232;re destination touristique au monde. &#160;&#160;&#160;&#160;&#160;&#160;&#160;&#160; <br /> Au-del&#224;, ils jouent un r&#244;le particulier et pr&#233;pond&#233;rant dans les stations, dont ils sont g&#233;n&#233;ralement la principale ressource fiscale, mais &#233;galement des acteurs socio-&#233;conomiques qui participent activement &#224; la vie culturelle et artistique (premiers organisateurs de spectacles vivants en France), au maintien d&#8217;h&#244;telleries de qualit&#233; et enfin au soutien notable de la vie associative locale.&#160;&#160;</li></ul><p style=\"line-height: normal; text-align: justify;\">C&#8217;est pourquoi la hausse du taux de la contribution sociale doit &#234;tre compens&#233;e par une adaptation de son assiette de pr&#233;l&#232;vement sur le produit brut des jeux.</p>",
    "annexeExposeSommaire": {
      "@xmlns:xsi": "http://www.w3.org/2001/XMLSchema-instance",
      "@xsi:nil": "true"
    }
  },
  "representations": {
    "representation": {
      "nom": "PDF",
      "typeMime": {
        "type": "application",
        "subType": "PDF"
      },
      "statutRepresentation": {
        "verbatim": "true",
        "canonique": "true",
        "officielle": "true",
        "transcription": "false",
        "enregistrement": "false"
      },
      "repSource": {
        "@xmlns:xsi": "http://www.w3.org/2001/XMLSchema-instance",
        "@xsi:nil": "true"
      },
      "offset": {
        "@xmlns:xsi": "http://www.w3.org/2001/XMLSchema-instance",
        "@xsi:nil": "true"
      },
      "contenu": {
        "documentURI": "/15/amendements/0384/CION_FIN/CF227.pdf"
      },
      "dateDispoRepresentation": {
        "@xmlns:xsi": "http://www.w3.org/2001/XMLSchema-instance",
        "@xsi:nil": "true"
      }
    }
  },
  "seanceDiscussion": {
    "@xmlns:xsi": "http://www.w3.org/2001/XMLSchema-instance",
    "@xsi:nil": "true"
  },
  "sort": {
    "@xmlns:xsi": "http://www.w3.org/2001/XMLSchema-instance",
    "@xsi:nil": "true"
  },
  "dateDepot": "2017-11-24T01:00:00.000+01:00",
  "dateDistribution": {
    "@xmlns:xsi": "http://www.w3.org/2001/XMLSchema-instance",
    "@xsi:nil": "true"
  },
  "article99": "0",
  "loiReference": {
    "codeLoi": "général des collectivités territoriales",
    "divisionCodeLoi": "L 2333-54"
  }
}