{
  "@xmlns": "http://schemas.assemblee-nationale.fr/referentiel",
  "uid": "AMANR5L15PO59048B0235P1D1N564",
  "identifiant": {
    "legislature": "15",
    "numero": "564",
    "numRect": "0",
    "saisine": {
      "refTexteLegislatif": "PRJLANR5L15B0235",
      "numeroPartiePLF": "1",
      "organeExamen": "PO59048",
      "mentionSecondeDeliberation": "0"
    }
  },
  "numeroLong": "I-CF564",
  "etapeTexte": "1ère lecture (1ère assemblée saisie)",
  "triAmendement": "as",
  "cardinaliteAmdtMultiples": "1",
  "amendementParent": {
    "@xmlns:xsi": "http://www.w3.org/2001/XMLSchema-instance",
    "@xsi:nil": "true"
  },
  "etat": "Irrecevable",
  "signataires": {
    "auteur": {
      "typeAuteur": "Depute",
      "acteurRef": "PA721670",
      "organeRef": {
        "@xmlns:xsi": "http://www.w3.org/2001/XMLSchema-instance",
        "@xsi:nil": "true"
      },
      "groupePolitiqueRef": "PO730964"
    },
    "cosignataires": {
      "acteurRef": [
        "PA643175",
        "PA720492",
        "PA721568",
        "PA642695",
        "PA722244",
        "PA720520",
        "PA719006",
        "PA718736",
        "PA719060",
        "PA719850",
        "PA720022",
        "PA606171",
        "PA721542",
        "PA607595",
        "PA720560",
        "PA722054",
        "PA719778",
        "PA720960",
        "PA720402",
        "PA718954",
        "PA720790",
        "PA720298",
        "PA721466",
        "PA721498",
        "PA605963",
        "PA719250",
        "PA719472",
        "PA721458",
        "PA721764",
        "PA722078",
        "PA720268",
        "PA719710",
        "PA721670",
        "PA719592",
        "PA720878",
        "PA719480",
        "PA721150",
        "PA719798",
        "PA720214"
      ]
    },
    "texteAffichable": "Mme&#160;de Montchalin,  M.&#160;Bothorel, M.&#160;Alauzet, M.&#160;Ahamada, Mme&#160;Cariou, Mme&#160;Cattelot, M.&#160;Cazeneuve, M.&#160;Chassaing, M.&#160;Damaisin, Mme&#160;Dominique&#160;David, Mme&#160;Dupont, M.&#160;Gaillard, Mme&#160;Goulet, M.&#160;Grau, Mme&#160;Gregoire, M.&#160;Guerini, Mme&#160;Hai, M.&#160;Holroyd, M.&#160;Jerretie, M.&#160;Jolivet, Mme&#160;Kuric, M.&#160;Labaronne, M.&#160;Lauzzana, M.&#160;Le Gendre, M.&#160;Le Vigoureux, Mme&#160;Magne, Mme&#160;Motin, Mme&#160;Osson, M.&#160;Paluszkiewicz, M.&#160;Pellois, M.&#160;Person, Mme&#160;Peyrol, M.&#160;Roseren, M.&#160;Saint-Martin, M.&#160;Savatier, M.&#160;Serva, M.&#160;Simian, Mme&#160;Verdier-Jouclas, M.&#160;Ferrand et les membres du groupe La R&#233;publique en Marche"
  },
  "pointeurFragmentTexte": {
    "missionVisee": {
      "@xmlns:xsi": "http://www.w3.org/2001/XMLSchema-instance",
      "@xsi:nil": "true"
    },
    "division": {
      "titre": "Article 27",
      "articleDesignationCourte": "APRÈS ART. 27",
      "type": "ARTICLE",
      "avant_A_Apres": "Après",
      "divisionRattachee": "APRÈS L'ARTICLE 27, insérer l'article suivant:",
      "articleAdditionnel": "1",
      "chapitreAdditionnel": {
        "@xmlns:xsi": "http://www.w3.org/2001/XMLSchema-instance",
        "@xsi:nil": "true"
      },
      "urlDivisionTexteVise": "/15/textes/0235A.asp#D_Article_27"
    },
    "alinea": {
      "@xmlns:xsi": "http://www.w3.org/2001/XMLSchema-instance",
      "@xsi:nil": "true"
    }
  },
  "corps": {
    "dispositif": "<p>&#160;</p><p>I.- A l&#8217;article 1382 du code g&#233;n&#233;ral des imp&#244;ts, il est ajout&#233; un 15&#176; ainsi r&#233;dig&#233;&#160;:&#160;</p><p>15&#176; les parties d&#8217;une installation hydro&#233;lectrique destin&#233;es &#224; la pr&#233;servation de la biodiversit&#233; et de la continuit&#233; &#233;cologique.&#160;&#187;</p><p>II.- La perte de recettes pour les collectivit&#233;s territoriales est compens&#233;e par la majoration &#224; due concurrence de la dotation globale de fonctionnement, et corr&#233;lativement pour l&#8217;Etat par la hausse de la composante carbone int&#233;gr&#233;e aux tarifs des taxes int&#233;rieures sur la consommation des produits &#233;nerg&#233;tiques inscrites au tableau B du 1 de l&#8217;article 256 du code des douanes.</p>",
    "exposeSommaire": "<p style=\"text-align: justify;\">Le pr&#233;sent amendement vise &#224; exon&#233;rer de la taxe fonci&#232;re les parties d&#8217;une installation hydro&#233;lectrique destin&#233;es &#224; la pr&#233;servation de l&#8217;environnement.</p><p style=\"text-align: justify;\">Les dispositifs visant &#224; la pr&#233;servation de l&#8217;environnement peuvent constituer une charge pour les producteurs,&#160;quant &#224; leur&#160;construction et leur entretien. Or elles ont un co&#251;ts en termes de fiscalit&#233; fonci&#232;re, alors m&#234;me qu&#8217;elles n&#8217;ont aucune rentabilit&#233; &#233;conomique. L&#8217;investissement consenti est en effet assujetti &#224; la taxe fonci&#232;re, dont l&#8217;importance peut aller jusqu&#8217;&#224; mettre en p&#233;ril la rentabilit&#233; d&#8217;une installation existante ou &#224; remettre en cause la faisabilit&#233; d&#8217;un projet de nouvelle installation.</p><p style=\"text-align: justify;\">Il est propos&#233; que les parties d&#8217;une installation &#224; vis&#233;e environnementale soient exon&#233;r&#233;es de taxe fonci&#232;re sur les propri&#233;t&#233;s b&#226;ties, de fa&#231;on &#224; faciliter la r&#233;alisation de ces ouvrages qui ont pour but de pr&#233;server la continuit&#233; &#233;cologique et la biodiversit&#233;, sans p&#233;naliser la viabilit&#233; &#233;conomique d&#8217;une installation existante ou d&#8217;une nouvelle installation. Cette exon&#233;ration est d&#8217;ailleurs dans la droite ligne de la r&#233;duction fiscale que pr&#233;voit l&#8217;article 1518 A du CGI pour les installations destin&#233;es &#224; la lutte contre la pollution des eaux et de l&#8217;atmosph&#232;re.</p><p style=\"text-align: justify;\">De plus, cet amendement permet de d&#233;placer une partie de la fiscalit&#233; touchant les &#233;nergies renouvelables vers la contribution climat-&#233;nergie, fiscalit&#233; &#233;cologique dont la trajectoire haussi&#232;re est d&#8217;ores et d&#233;j&#224; pr&#233;vue par la loi.</p>",
    "annexeExposeSommaire": {
      "@xmlns:xsi": "http://www.w3.org/2001/XMLSchema-instance",
      "@xsi:nil": "true"
    }
  },
  "representations": {
    "representation": {
      "nom": "PDF",
      "typeMime": {
        "type": "application",
        "subType": "PDF"
      },
      "statutRepresentation": {
        "verbatim": "true",
        "canonique": "true",
        "officielle": "true",
        "transcription": "false",
        "enregistrement": "false"
      },
      "repSource": {
        "@xmlns:xsi": "http://www.w3.org/2001/XMLSchema-instance",
        "@xsi:nil": "true"
      },
      "offset": {
        "@xmlns:xsi": "http://www.w3.org/2001/XMLSchema-instance",
        "@xsi:nil": "true"
      },
      "contenu": {
        "documentURI": "/15/amendements/0235A/CION_FIN/CF564.pdf"
      },
      "dateDispoRepresentation": {
        "@xmlns:xsi": "http://www.w3.org/2001/XMLSchema-instance",
        "@xsi:nil": "true"
      }
    }
  },
  "seanceDiscussion": {
    "@xmlns:xsi": "http://www.w3.org/2001/XMLSchema-instance",
    "@xsi:nil": "true"
  },
  "sort": {
    "@xmlns:xsi": "http://www.w3.org/2001/XMLSchema-instance",
    "@xsi:nil": "true"
  },
  "dateDepot": "2017-10-07T02:00:00.000+02:00",
  "dateDistribution": {
    "@xmlns:xsi": "http://www.w3.org/2001/XMLSchema-instance",
    "@xsi:nil": "true"
  },
  "article99": "0",
  "loiReference": {
    "codeLoi": "impôts",
    "divisionCodeLoi": "1382"
  }
}