{
  "@xmlns": "http://schemas.assemblee-nationale.fr/referentiel",
  "uid": "AMANR5L15PO420120B1681P0D1N1062",
  "identifiant": {
    "legislature": "15",
    "numero": "1062",
    "numRect": "0",
    "saisine": {
      "refTexteLegislatif": "PRJLANR5L15B1681",
      "numeroPartiePLF": "0",
      "organeExamen": "PO420120",
      "mentionSecondeDeliberation": "0"
    }
  },
  "numeroLong": "AS1062",
  "etapeTexte": "1ère lecture (1ère assemblée saisie)",
  "triAmendement": "eeaaaaaaaaaaaaaaaaaaaaaaaaaaaaaaaaaaaaaaaaaaaaaaaad",
  "cardinaliteAmdtMultiples": "1",
  "amendementParent": {
    "@xmlns:xsi": "http://www.w3.org/2001/XMLSchema-instance",
    "@xsi:nil": "true"
  },
  "etat": "Discuté",
  "signataires": {
    "auteur": {
      "typeAuteur": "Depute",
      "acteurRef": "PA267585",
      "organeRef": {
        "@xmlns:xsi": "http://www.w3.org/2001/XMLSchema-instance",
        "@xsi:nil": "true"
      },
      "groupePolitiqueRef": "PO744425"
    },
    "cosignataires": {
      "acteurRef": [
        "PA342601",
        "PA331567",
        "PA720230",
        "PA642868",
        "PA719806",
        "PA267585",
        "PA712014",
        "PA267241",
        "PA721110",
        "PA267780",
        "PA695100",
        "PA268019",
        "PA702052",
        "PA267330",
        "PA720696"
      ]
    },
    "texteAffichable": "M.&#160;Vercamer,  Mme&#160;Auconie, M.&#160;Brindeau, M.&#160;Christophe, Mme&#160;de La Raudi&#232;re, M.&#160;Demilly, Mme&#160;Descamps, Mme&#160;Firmin Le Bodo, M.&#160;Meyer&#160;Habib, M.&#160;Lagarde, M.&#160;Ledoux, Mme&#160;Magnier, Mme&#160;Sage, Mme&#160;Sanquer et M.&#160;Zumkeller"
  },
  "pointeurFragmentTexte": {
    "missionVisee": {
      "@xmlns:xsi": "http://www.w3.org/2001/XMLSchema-instance",
      "@xsi:nil": "true"
    },
    "division": {
      "titre": "Article 12",
      "articleDesignationCourte": "APRÈS ART. 12",
      "type": "ARTICLE",
      "avant_A_Apres": "Après",
      "divisionRattachee": "APRÈS L'ARTICLE 12, insérer l'article suivant:",
      "articleAdditionnel": "1",
      "chapitreAdditionnel": {
        "@xmlns:xsi": "http://www.w3.org/2001/XMLSchema-instance",
        "@xsi:nil": "true"
      },
      "urlDivisionTexteVise": "/15/textes/1681.asp#D_Article_12"
    },
    "alinea": {
      "@xmlns:xsi": "http://www.w3.org/2001/XMLSchema-instance",
      "@xsi:nil": "true"
    }
  },
  "corps": {
    "dispositif": "<p>&#192; la deuxi&#232;me phrase du deuxi&#232;me alin&#233;a de l&#8217;article L.&#160;1111&#8209;23 du code de la sant&#233; publique, apr&#232;s le mot&#160;: &#171;&#160;int&#233;rieur&#160;&#187;, sont ins&#233;r&#233;s les mots&#160;: &#171;&#160;reportent les dispositifs m&#233;dicaux implantables dans le dossier pharmaceutique et ils&#160;&#187;.</p>",
    "exposeSommaire": "<p>Les articles&#160;R.&#160;5212&#8209;36 &#224; R.&#160;5212&#8209;42 du code de la sant&#233; publique (CSP) imposent aux &#233;tablissements des r&#232;gles de tra&#231;abilit&#233; sanitaire relatives &#224; l&#8217;enregistrement, la conservation et la transmission des donn&#233;es de tra&#231;abilit&#233; pour certains dispositifs m&#233;dicaux (DM), dont la liste est fix&#233;e par arr&#234;t&#233;. Il s&#8217;agit essentiellement des dispositifs m&#233;dicaux implantables (DMI), &#224; l&#8217;exception des ligatures, sutures et dispositifs d&#8217;ost&#233;osynth&#232;se.</p><p style=\"text-align: justify;\">Ces exigences de tra&#231;abilit&#233; sanitaire s&#8217;appliquent d&#8217;autant plus aux DMI que leur caract&#232;re implantable engage un profil de risque particulier pour la s&#233;curit&#233; des patients.</p><p style=\"text-align: justify;\">Toutefois, une instruction de la&#160;DGOS du 15&#160;juin&#160;2015 a montr&#233; que moins de 50&#160;% des implants &#233;taient r&#233;ellement trac&#233;s jusqu&#8217;au patient.</p><p style=\"text-align: justify;\">Avec cet amendement il s&#8217;agit d&#8217;inclure les dispositifs m&#233;dicaux implantables dans le dossier pharmaceutique des pharmacies &#224; usage int&#233;rieur afin d&#8217;am&#233;liorer la tra&#231;abilit&#233; de ces produits.</p>",
    "annexeExposeSommaire": {
      "@xmlns:xsi": "http://www.w3.org/2001/XMLSchema-instance",
      "@xsi:nil": "true"
    },
    "cartoucheDelaiDepotDepasse": {
      "@xmlns:xsi": "http://www.w3.org/2001/XMLSchema-instance",
      "@xsi:nil": "true"
    }
  },
  "representations": {
    "representation": {
      "nom": "PDF",
      "typeMime": {
        "type": "application",
        "subType": "PDF"
      },
      "statutRepresentation": {
        "verbatim": "true",
        "canonique": "true",
        "officielle": "true",
        "transcription": "false",
        "enregistrement": "false"
      },
      "repSource": {
        "@xmlns:xsi": "http://www.w3.org/2001/XMLSchema-instance",
        "@xsi:nil": "true"
      },
      "offset": {
        "@xmlns:xsi": "http://www.w3.org/2001/XMLSchema-instance",
        "@xsi:nil": "true"
      },
      "contenu": {
        "documentURI": "/15/amendements/1681/CION-SOC/AS1062.pdf"
      },
      "dateDispoRepresentation": {
        "@xmlns:xsi": "http://www.w3.org/2001/XMLSchema-instance",
        "@xsi:nil": "true"
      }
    }
  },
  "seanceDiscussion": {
    "@xmlns:xsi": "http://www.w3.org/2001/XMLSchema-instance",
    "@xsi:nil": "true"
  },
  "sort": {
    "dateSaisie": "2019-03-14T11:25:12.000+01:00",
    "sortEnSeance": "Tombé"
  },
  "dateDepot": "2019-03-08T01:00:00.000+01:00",
  "dateDistribution": "2019-03-12T01:00:00.000+01:00",
  "article99": "0",
  "loiReference": {
    "codeLoi": "santé publique",
    "divisionCodeLoi": "L1111-23"
  }
}