{
  "@xmlns": "http://schemas.assemblee-nationale.fr/referentiel",
  "uid": "AMANR5L15PO59048B2272P1D1N1198",
  "identifiant": {
    "legislature": "15",
    "numero": "1198",
    "numRect": "0",
    "saisine": {
      "refTexteLegislatif": "PRJLANR5L15B2272",
      "numeroPartiePLF": "1",
      "organeExamen": "PO59048",
      "mentionSecondeDeliberation": "0"
    }
  },
  "numeroLong": "I-CF1198",
  "etapeTexte": "1ère lecture (1ère assemblée saisie)",
  "triAmendement": "dsaaaaaaaaaaaaaaaaaaaaaaaaaaaaaaaaaaaaaaaaaaaaaaaamcyi",
  "cardinaliteAmdtMultiples": "1",
  "amendementParent": {
    "@xmlns:xsi": "http://www.w3.org/2001/XMLSchema-instance",
    "@xsi:nil": "true"
  },
  "etat": "Discuté",
  "signataires": {
    "auteur": {
      "typeAuteur": "Depute",
      "acteurRef": "PA608172",
      "organeRef": {
        "@xmlns:xsi": "http://www.w3.org/2001/XMLSchema-instance",
        "@xsi:nil": "true"
      },
      "groupePolitiqueRef": "PO758835"
    },
    "cosignataires": {
      "acteurRef": [
        "PA720988",
        "PA335532",
        "PA609590",
        "PA608172",
        "PA333285",
        "PA335054",
        "PA610681",
        "PA642764",
        "PA608011",
        "PA1008",
        "PA340343",
        "PA608741",
        "PA333818",
        "PA1809",
        "PA609332",
        "PA267233",
        "PA719930",
        "PA608695",
        "PA332614",
        "PA342415",
        "PA1592",
        "PA643145",
        "PA429893",
        "PA607553",
        "PA340357",
        "PA508",
        "PA1198",
        "PA605069",
        "PA337483"
      ]
    },
    "texteAffichable": "Mme&#160;Pires Beaune,  M.&#160;Jean-Louis&#160;Bricout, M.&#160;David&#160;Habib, Mme&#160;Rabault, M.&#160;Aviragnet, Mme&#160;Bareigts, Mme&#160;Battistel, Mme&#160;Bi&#233;mouret, M.&#160;Bouillon, M.&#160;Carvounas, M.&#160;Alain&#160;David, Mme&#160;Laurence&#160;Dumont, M.&#160;Faure, M.&#160;Garot, M.&#160;Hutin, M.&#160;Juanico, Mme&#160;Karamanli, M.&#160;J&#233;r&#244;me&#160;Lambert, M.&#160;Letchimy, Mme&#160;Manin, Mme&#160;Pau-Langevin, M.&#160;Potier, M.&#160;Pueyo, M.&#160;Saulignac, Mme&#160;Tolmont, Mme&#160;Untermaier, Mme&#160;Vainqueur-Christophe, M.&#160;Vallaud, Mme&#160;Victory et les membres du groupe Socialistes et apparent&#233;s"
  },
  "pointeurFragmentTexte": {
    "missionVisee": {
      "@xmlns:xsi": "http://www.w3.org/2001/XMLSchema-instance",
      "@xsi:nil": "true"
    },
    "division": {
      "titre": "Article 16",
      "articleDesignationCourte": "ART. 16",
      "type": "ARTICLE",
      "avant_A_Apres": "A",
      "divisionRattachee": "ARTICLE 16",
      "articleAdditionnel": {
        "@xmlns:xsi": "http://www.w3.org/2001/XMLSchema-instance",
        "@xsi:nil": "true"
      },
      "chapitreAdditionnel": {
        "@xmlns:xsi": "http://www.w3.org/2001/XMLSchema-instance",
        "@xsi:nil": "true"
      },
      "urlDivisionTexteVise": "/15/textes/2272A.asp#D_Article_16"
    },
    "alinea": {
      "avant_A_Apres": "Apres",
      "numero": "99",
      "alineaDesignation": {
        "@xmlns:xsi": "http://www.w3.org/2001/XMLSchema-instance",
        "@xsi:nil": "true"
      }
    }
  },
  "corps": {
    "dispositif": "<p style=\"text-align: justify;\">I.&#160;-&#160;Apr&#232;s l&#8217;alin&#233;a&#160;99, ins&#233;rer l&#8217;alin&#233;a suivant&#160;:</p><p style=\"text-align: justify;\">&#171;&#160;IV <i>bis</i>.&#160;-&#160;Les achats de carburants susvis&#233; et grev&#233;s de TVA des collectivit&#233;s territoriales et de leurs &#233;tablissements publics r&#233;alis&#233;s pour leurs engins non routiers inscrits &#224; l&#8217;actif immobilis&#233; sont &#233;ligibles au fonds de compensation pour la TVA.&#160;&#187;</p><p style=\"text-align: justify;\">II.&#160;-&#160;La perte de recettes pour l&#8217;&#201;tat est compens&#233;e, &#224; due concurrence, par la majoration du taux du 1&#176;&#160;du B du 1 de l&#8217;article&#160;200 A du code g&#233;n&#233;ral des imp&#244;ts.</p>",
    "exposeSommaire": "<p style=\"text-align: justify;\">Cet amendement du groupe Socialistes et apparent&#233;s propose d&#8217;&#233;tendre le dispositif de suramortissement aux collectivit&#233;s territoriales en r&#233;gie directe.</p><p style=\"text-align: justify;\">Pour rappel, l&#8217;article&#160;5 dispose que les entreprises de travaux publics, celles produisant des substances min&#233;rales solides, les exploitants a&#233;roportuaires ainsi que les exploitants de remont&#233;es m&#233;caniques et de domaines skiables soumis &#224; l&#8217;imp&#244;t sur les soci&#233;t&#233;s ou &#224; l&#8217;imp&#244;t sur le revenu selon un r&#233;gime r&#233;el peuvent d&#233;duire de leur r&#233;sultat imposable une somme &#233;gale &#224; 40&#160;% de la valeur d&#8217;origine, hors frais financiers, des engins non routiers inscrits &#224; l&#8217;actif immobilis&#233; fonctionnant exclusivement au gaz naturel, &#224; l&#8217;&#233;nergie &#233;lectrique ou &#224; l&#8217;hydrog&#232;ne qui rel&#232;vent de l&#8217;une des cat&#233;gories suivantes&#160;:</p><ol style=\"text-align: justify;\"><li>Mat&#233;riels et outillages utilis&#233;s pour des op&#233;rations industrielles ;</li><li>Mat&#233;riels de manutention ;</li><li>Moteurs install&#233;s dans les mat&#233;riels mentionn&#233;s aux 1&#176;&#160;et 2&#176;&#160;.</li></ol><p style=\"text-align: justify;\">Ce dispositif sera donc accessible aux entreprises en d&#233;l&#233;gation de service public.</p><p style=\"text-align: justify;\">L&#8217;objectif de l&#8217;amendement est donc d&#8217;appliquer ce dispositif pour les m&#234;mes v&#233;hicules ayant le m&#234;me objet mais utilis&#233;s pour le fonctionnement d&#8217;un service public local en r&#233;gie directe.</p>",
    "annexeExposeSommaire": {
      "@xmlns:xsi": "http://www.w3.org/2001/XMLSchema-instance",
      "@xsi:nil": "true"
    },
    "cartoucheDelaiDepotDepasse": {
      "@xmlns:xsi": "http://www.w3.org/2001/XMLSchema-instance",
      "@xsi:nil": "true"
    },
    "avantAppel": {
      "@xmlns:xsi": "http://www.w3.org/2001/XMLSchema-instance",
      "@xsi:nil": "true"
    }
  },
  "representations": {
    "representation": {
      "nom": "PDF",
      "typeMime": {
        "type": "application",
        "subType": "PDF"
      },
      "statutRepresentation": {
        "verbatim": "true",
        "canonique": "true",
        "officielle": "true",
        "transcription": "false",
        "enregistrement": "false"
      },
      "repSource": {
        "@xmlns:xsi": "http://www.w3.org/2001/XMLSchema-instance",
        "@xsi:nil": "true"
      },
      "offset": {
        "@xmlns:xsi": "http://www.w3.org/2001/XMLSchema-instance",
        "@xsi:nil": "true"
      },
      "contenu": {
        "documentURI": "/15/amendements/2272A/CION_FIN/CF1198.pdf"
      },
      "dateDispoRepresentation": {
        "@xmlns:xsi": "http://www.w3.org/2001/XMLSchema-instance",
        "@xsi:nil": "true"
      }
    }
  },
  "seanceDiscussion": {
    "@xmlns:xsi": "http://www.w3.org/2001/XMLSchema-instance",
    "@xsi:nil": "true"
  },
  "sort": {
    "dateSaisie": "2019-10-10T10:25:42.000+02:00",
    "sortEnSeance": "Rejeté"
  },
  "dateDepot": "2019-10-04T02:00:00.000+02:00",
  "dateDistribution": "2019-10-09T02:00:00.000+02:00",
  "article99": "0",
  "loiReference": {
    "codeLoi": "ID 590 sauf gage",
    "divisionCodeLoi": {
      "@xmlns:xsi": "http://www.w3.org/2001/XMLSchema-instance",
      "@xsi:nil": "true"
    }
  }
}