{
  "@xmlns": "http://schemas.assemblee-nationale.fr/referentiel",
  "uid": "AMANR5L15PO420120B1297P0D1N630",
  "identifiant": {
    "legislature": "15",
    "numero": "630",
    "numRect": "0",
    "saisine": {
      "refTexteLegislatif": "PRJLANR5L15B1297",
      "numeroPartiePLF": "0",
      "organeExamen": "PO420120",
      "mentionSecondeDeliberation": "0"
    }
  },
  "numeroLong": "AS630",
  "etapeTexte": "1ère lecture (1ère assemblée saisie)",
  "triAmendement": "jaaaaaaaaaaaaaaaaaaaaaaaaaaaaaaaaaaaaaaaaaaaaaaaaaz",
  "cardinaliteAmdtMultiples": "1",
  "amendementParent": {
    "@xmlns:xsi": "http://www.w3.org/2001/XMLSchema-instance",
    "@xsi:nil": "true"
  },
  "etat": "Irrecevable",
  "signataires": {
    "auteur": {
      "typeAuteur": "Depute",
      "acteurRef": "PA722390",
      "organeRef": {
        "@xmlns:xsi": "http://www.w3.org/2001/XMLSchema-instance",
        "@xsi:nil": "true"
      },
      "groupePolitiqueRef": "PO730934"
    },
    "cosignataires": {
      "acteurRef": [
        "PA718780",
        "PA267318",
        "PA267378",
        "PA334654",
        "PA267289",
        "PA722390",
        "PA266793",
        "PA767"
      ]
    },
    "texteAffichable": "Mme&#160;Corneloup,  M.&#160;Cattin, M.&#160;Door, M.&#160;Grelier, Mme&#160;Levy, M.&#160;Straumann, Mme&#160;Trastour-Isnart et M.&#160;Bony"
  },
  "pointeurFragmentTexte": {
    "missionVisee": {
      "@xmlns:xsi": "http://www.w3.org/2001/XMLSchema-instance",
      "@xsi:nil": "true"
    },
    "division": {
      "titre": "Article 39",
      "articleDesignationCourte": "ART. 39",
      "type": "ARTICLE",
      "avant_A_Apres": "A",
      "divisionRattachee": "ARTICLE 39",
      "articleAdditionnel": {
        "@xmlns:xsi": "http://www.w3.org/2001/XMLSchema-instance",
        "@xsi:nil": "true"
      },
      "chapitreAdditionnel": {
        "@xmlns:xsi": "http://www.w3.org/2001/XMLSchema-instance",
        "@xsi:nil": "true"
      },
      "urlDivisionTexteVise": "/15/textes/1297.asp#D_Article_39"
    },
    "alinea": {
      "@xmlns:xsi": "http://www.w3.org/2001/XMLSchema-instance",
      "@xsi:nil": "true"
    }
  },
  "corps": {
    "dispositif": "<p>Apr&#232;s l'alin&#233;a 5, ins&#233;rer un paragraphe ainsi r&#233;dig&#233;&#160;:</p><p>&#160;</p><p>&#171;- L&#8217;article L. 6212-2 du code de la sant&#233; publique est ainsi compl&#233;t&#233;&#160;:</p><p>&#160;</p><p>&#171;&#160;Un laboratoire de biologie m&#233;dicale peut &#233;galement r&#233;aliser les vaccinations figurant sur la liste fix&#233;e par arr&#234;t&#233; du ministre charg&#233; de la sant&#233; pris apr&#232;s avis de la Haute autorit&#233; de sant&#233;.&#160;&#187;</p><p>&#160;</p><p>&#160;</p><p>&#160;</p>",
    "exposeSommaire": "<p>L&#8217;article 39 pr&#233;voit la g&#233;n&#233;ralisation du dispositif de la vaccination contre la grippe par les pharmaciens d&#8217;officine.</p><p>Les 4716 laboratoires d&#8217;analyses de biologie m&#233;dicale repr&#233;sentent un point d&#8217;acc&#232;s de plus &#224; la vaccination pour les fran&#231;ais et pourraient ainsi contribuer &#224; augmenter la couverture vaccinale. Les biologistes qui y exercent sont par ailleurs d&#233;j&#224; form&#233;s &#224; piquer les patients.</p><p>Cet amendement vise donc &#224; leur permettre de r&#233;aliser les vaccinations, ce qui serait en coh&#233;rence avec le Plan Priorit&#233; Pr&#233;vention et les annonces du Premier ministre lors du Comit&#233; interminist&#233;riel de la sant&#233; du 26 mars dernier.</p><p>&#160;</p>",
    "annexeExposeSommaire": {
      "@xmlns:xsi": "http://www.w3.org/2001/XMLSchema-instance",
      "@xsi:nil": "true"
    }
  },
  "representations": {
    "representation": {
      "nom": "PDF",
      "typeMime": {
        "type": "application",
        "subType": "PDF"
      },
      "statutRepresentation": {
        "verbatim": "true",
        "canonique": "true",
        "officielle": "true",
        "transcription": "false",
        "enregistrement": "false"
      },
      "repSource": {
        "@xmlns:xsi": "http://www.w3.org/2001/XMLSchema-instance",
        "@xsi:nil": "true"
      },
      "offset": {
        "@xmlns:xsi": "http://www.w3.org/2001/XMLSchema-instance",
        "@xsi:nil": "true"
      },
      "contenu": {
        "documentURI": "/15/amendements/1297/CION-SOC/AS630.pdf"
      },
      "dateDispoRepresentation": {
        "@xmlns:xsi": "http://www.w3.org/2001/XMLSchema-instance",
        "@xsi:nil": "true"
      }
    }
  },
  "seanceDiscussion": {
    "@xmlns:xsi": "http://www.w3.org/2001/XMLSchema-instance",
    "@xsi:nil": "true"
  },
  "sort": {
    "@xmlns:xsi": "http://www.w3.org/2001/XMLSchema-instance",
    "@xsi:nil": "true"
  },
  "dateDepot": "2018-10-12T02:00:00.000+02:00",
  "dateDistribution": {
    "@xmlns:xsi": "http://www.w3.org/2001/XMLSchema-instance",
    "@xsi:nil": "true"
  },
  "article99": "0",
  "loiReference": {
    "codeLoi": {
      "@xmlns:xsi": "http://www.w3.org/2001/XMLSchema-instance",
      "@xsi:nil": "true"
    },
    "divisionCodeLoi": {
      "@xmlns:xsi": "http://www.w3.org/2001/XMLSchema-instance",
      "@xsi:nil": "true"
    }
  }
}