{
  "@xmlns": "http://schemas.assemblee-nationale.fr/referentiel",
  "uid": "AMANR5L15SEA717460BTC0971P0D1N1442",
  "identifiant": {
    "legislature": "15",
    "numero": "1442",
    "numRect": "0",
    "saisine": {
      "refTexteLegislatif": "PRJLANR5L15BTC0971",
      "numeroPartiePLF": "0",
      "organeExamen": "PO717460",
      "mentionSecondeDeliberation": "0"
    }
  },
  "numeroLong": "1442",
  "etapeTexte": "1ère lecture (1ère assemblée saisie)",
  "triAmendement": "eokkz",
  "cardinaliteAmdtMultiples": "1",
  "amendementParent": {
    "@xmlns:xsi": "http://www.w3.org/2001/XMLSchema-instance",
    "@xsi:nil": "true"
  },
  "etat": "Discuté",
  "signataires": {
    "auteur": {
      "typeAuteur": "Depute",
      "acteurRef": "PA713448",
      "organeRef": {
        "@xmlns:xsi": "http://www.w3.org/2001/XMLSchema-instance",
        "@xsi:nil": "true"
      },
      "groupePolitiqueRef": "PO730934"
    },
    "cosignataires": {
      "acteurRef": "PA713448"
    },
    "texteAffichable": "Mme&#160;Brenier"
  },
  "pointeurFragmentTexte": {
    "missionVisee": {
      "@xmlns:xsi": "http://www.w3.org/2001/XMLSchema-instance",
      "@xsi:nil": "true"
    },
    "division": {
      "titre": "Article 28",
      "articleDesignationCourte": "ART. 28",
      "type": "ARTICLE",
      "avant_A_Apres": "A",
      "divisionRattachee": "ARTICLE 28",
      "articleAdditionnel": {
        "@xmlns:xsi": "http://www.w3.org/2001/XMLSchema-instance",
        "@xsi:nil": "true"
      },
      "chapitreAdditionnel": {
        "@xmlns:xsi": "http://www.w3.org/2001/XMLSchema-instance",
        "@xsi:nil": "true"
      },
      "urlDivisionTexteVise": "/15/textes/0971.asp#D_Article_28"
    },
    "alinea": {
      "avant_A_Apres": "A",
      "numero": "112",
      "alineaDesignation": "Alinéa 112"
    }
  },
  "corps": {
    "dispositif": "<p style=\"text-align: justify;\">Supprimer les alin&#233;as&#160;112 &#224;&#160;114.</p>",
    "exposeSommaire": "<p style=\"text-align: justify;\">Autoriser les bailleurs sociaux &#224; d&#233;roger au Titre II de la loi MOP relatif &#224; la ma&#238;trise d&#8217;oeuvre revient &#224; les dispenser de faire appel &#224; une &#233;quipe de ma&#238;trise d&#8217;oeuvre charg&#233;e de la r&#233;alisation d&#8217;une mission permettant &#224; la ma&#238;trise d&#8217;ouvrage de s&#8217;assurer de la qualit&#233; de l&#8217;ouvrage et du respect de son programme.</p><p style=\"text-align: justify;\">C&#8217;est m&#233;connaitre pourquoi la loi MOP a &#233;t&#233; cr&#233;&#233;e, et &#224; quoi elle sert 1</p><p style=\"text-align: justify;\">Pourquoi la loi MOP a &#233;t&#233; cr&#233;&#233;e&#160;?</p><p style=\"text-align: justify;\">Avant 1985, le d&#233;sir d&#8217;aller toujours plus vite et soi-disant moins cher a engendr&#233; des processus de plus en plus contestables.</p><p style=\"text-align: justify;\">Outre les malversations rendues possibles entre les acteurs (lors des appels d&#8217;offres, la conclusion de march&#233;s avant d&#233;finition compl&#232;te des prestations dues par les entreprises a permis de fausser d&#8217;innombrables mises en concurrence et engendr&#233; une forte corruption).</p><p style=\"text-align: justify;\">Les &#171;&#160;proc&#233;d&#233;s&#160;&#187; ont pris le pouvoir sans aucunement prendre en consid&#233;ration la qualit&#233; des cons-tructions. Tout d&#8217;abord r&#233;serv&#233;es aux logements, ces pratiques ont &#233;t&#233; ensuite &#233;tendues aux autres ouvrages (h&#244;pitaux, &#233;tablissements scolaires, . ..). Les cons&#233;quences de la politique des mod&#232;les ont &#233;t&#233; humainement d&#233;sastreuses, comme par exemple les coll&#232;ges type Pailleron</p><p style=\"text-align: justify;\">L&#8217;int&#233;r&#234;t de la MOP pour les ma&#238;tres d&#8217;ouvrage.</p><p style=\"text-align: justify;\">Le principe majeur de la loi MOP est qu&#8217;il faut confier la ma&#238;trise d&#8217;oeuvre &#224; une &#233;quipe unique qui sera responsable de la coh&#233;rence d&#8217;un projet, et, in fine, de la r&#233;ussite de l&#8217;op&#233;ration, du d&#233;but &#224; la fin de celle-ci.</p><p style=\"text-align: justify;\">Le l&#233;gislateur de l&#8217;&#233;poque avait bien compris l&#8217;int&#233;r&#234;t d&#8217;une ma&#238;trise d&#8217;oeuvre ind&#233;pendante des entreprises, d&#233;fendant et prot&#233;geant les ma&#238;tres d&#8217;ouvrage publics, faisant respecter l&#8217;ex&#233;cution et la qualit&#233; des prestations demand&#233;es, et les d&#233;lais bien souvent impos&#233;s<br />Supprimer le titre 2, c&#8217;est emp&#234;cher les ma&#238;tres d&#8217;ouvrage de b&#233;n&#233;ficier d&#8217;une &#233;quipe de ma&#238;trise d&#8217;oeuvre pluridisciplinaire et ind&#233;pendante, travaillant ensemble du premier coup de crayon &#224; la li-vraison des ouvrages. A l&#8217;heure du BIM, o&#249; le travail collaboratif est indispensable, c&#8217;est une disposi-tion incompr&#233;hensible.</p>",
    "annexeExposeSommaire": {
      "@xmlns:xsi": "http://www.w3.org/2001/XMLSchema-instance",
      "@xsi:nil": "true"
    }
  },
  "representations": {
    "representation": {
      "nom": "PDF",
      "typeMime": {
        "type": "application",
        "subType": "PDF"
      },
      "statutRepresentation": {
        "verbatim": "true",
        "canonique": "true",
        "officielle": "true",
        "transcription": "false",
        "enregistrement": "false"
      },
      "repSource": {
        "@xmlns:xsi": "http://www.w3.org/2001/XMLSchema-instance",
        "@xsi:nil": "true"
      },
      "offset": {
        "@xmlns:xsi": "http://www.w3.org/2001/XMLSchema-instance",
        "@xsi:nil": "true"
      },
      "contenu": {
        "documentURI": "/15/amendements/0971/AN/1442.pdf"
      },
      "dateDispoRepresentation": {
        "@xmlns:xsi": "http://www.w3.org/2001/XMLSchema-instance",
        "@xsi:nil": "true"
      }
    }
  },
  "seanceDiscussion": "RUANR5L15S2018IDS21115",
  "sort": {
    "dateSaisie": "2018-06-02T22:14:06.000+02:00",
    "sortEnSeance": "Non soutenu"
  },
  "dateDepot": "2018-05-25T02:00:00.000+02:00",
  "dateDistribution": "2018-05-30T02:00:00.000+02:00",
  "article99": "0",
  "loiReference": {
    "codeLoi": {
      "@xmlns:xsi": "http://www.w3.org/2001/XMLSchema-instance",
      "@xsi:nil": "true"
    },
    "divisionCodeLoi": {
      "@xmlns:xsi": "http://www.w3.org/2001/XMLSchema-instance",
      "@xsi:nil": "true"
    }
  }
}