{
  "@xmlns": "http://schemas.assemblee-nationale.fr/referentiel",
  "uid": "AMANR5L15SEA717460BTC2401P0D1N1284",
  "identifiant": {
    "legislature": "15",
    "numero": "1284",
    "numRect": "0",
    "saisine": {
      "refTexteLegislatif": "PRJLANR5L15BTC2401",
      "numeroPartiePLF": "0",
      "organeExamen": "PO717460",
      "mentionSecondeDeliberation": "0"
    }
  },
  "numeroLong": "1284",
  "etapeTexte": "1ère lecture (2ème assemblée saisie)",
  "triAmendement": "ocaaaaaaaaaaaaaaaaaaaaaaaaaaaaaaaaaaaaaaaaaaaaaaaabe",
  "cardinaliteAmdtMultiples": "1",
  "amendementParent": {
    "@xmlns:xsi": "http://www.w3.org/2001/XMLSchema-instance",
    "@xsi:nil": "true"
  },
  "etat": "Discuté",
  "signataires": {
    "auteur": {
      "typeAuteur": "Depute",
      "acteurRef": "PA720598",
      "organeRef": {
        "@xmlns:xsi": "http://www.w3.org/2001/XMLSchema-instance",
        "@xsi:nil": "true"
      },
      "groupePolitiqueRef": "PO730970"
    },
    "cosignataires": {
      "acteurRef": [
        "PA719266",
        "PA721976",
        "PA719640",
        "PA720968",
        "PA721418",
        "PA719210",
        "PA720652",
        "PA721742",
        "PA719874",
        "PA720162",
        "PA719044",
        "PA720704",
        "PA720746",
        "PA720002",
        "PA722284",
        "PA720092",
        "PA720720",
        "PA720598",
        "PA719942",
        "PA720976",
        "PA720772",
        "PA721734",
        "PA721530",
        "PA719918",
        "PA721984",
        "PA720334",
        "PA719488",
        "PA720924",
        "PA717151",
        "PA721182",
        "PA722162",
        "PA721234",
        "PA720764",
        "PA722374",
        "PA720178",
        "PA721608",
        "PA720256",
        "PA719558",
        "PA720728",
        "PA718978",
        "PA721836",
        "PA719504",
        "PA720326",
        "PA1276",
        "PA721996",
        "PA721924"
      ]
    },
    "texteAffichable": "Mme&#160;Deprez-Audebert,  M.&#160;Bru, M.&#160;Baudu, M.&#160;Balanant, Mme&#160;Florennes, Mme&#160;Jacquier-Laforge, M.&#160;Latombe, Mme&#160;Vichnievsky, Mme&#160;Bannier, M.&#160;Barrot, Mme&#160;Benin, M.&#160;Berta, M.&#160;Bolo, M.&#160;Bourlanges, M.&#160;Cubertafon, Mme&#160;de Sarnez, Mme&#160;de Vaucouleurs, M.&#160;Duverg&#233;, Mme&#160;El Ha&#239;ry, Mme&#160;Elimas, Mme&#160;Essayan, M.&#160;Fanget, M.&#160;Fuchs, M.&#160;Garcia, M.&#160;Hammouche, M.&#160;Isaac-Sibille, M.&#160;Joncour, M.&#160;Lagleize, M.&#160;Lain&#233;, M.&#160;Laqhila, Mme&#160;Lasserre, M.&#160;Loiseau, Mme&#160;Luquet, M.&#160;Mathiasin, M.&#160;Mattei, Mme&#160;Mette, M.&#160;Michel-Kleisbauer, M.&#160;Mignola, M.&#160;Millienne, M.&#160;Pahun, M.&#160;Fr&#233;d&#233;ric&#160;Petit, Mme&#160;Maud&#160;Petit, Mme&#160;Poueyto, M.&#160;Ramos, M.&#160;Turquois et M.&#160;Waserman"
  },
  "pointeurFragmentTexte": {
    "missionVisee": {
      "@xmlns:xsi": "http://www.w3.org/2001/XMLSchema-instance",
      "@xsi:nil": "true"
    },
    "division": {
      "titre": "Article 28 ter",
      "articleDesignationCourte": "ART. 28 TER",
      "type": "ARTICLE",
      "avant_A_Apres": "A",
      "divisionRattachee": "ARTICLE 28 TER",
      "articleAdditionnel": {
        "@xmlns:xsi": "http://www.w3.org/2001/XMLSchema-instance",
        "@xsi:nil": "true"
      },
      "chapitreAdditionnel": {
        "@xmlns:xsi": "http://www.w3.org/2001/XMLSchema-instance",
        "@xsi:nil": "true"
      },
      "urlDivisionTexteVise": "/15/textes/2401.asp#D_Article_28_ter"
    },
    "alinea": {
      "@xmlns:xsi": "http://www.w3.org/2001/XMLSchema-instance",
      "@xsi:nil": "true"
    }
  },
  "corps": {
    "dispositif": "<p style=\"text-align: justify;\">R&#233;diger ainsi cet article&#160;:</p><p style=\"text-align: justify;\">&#171;&#160;Apr&#232;s l&#8217;article L.&#160;5211&#8209;12 du code g&#233;n&#233;ral des collectivit&#233;s territoriales, il est ins&#233;r&#233; un article L.&#160;5211&#8209;12&#8209;2 ainsi r&#233;dig&#233;&#160;:</p><p style=\"text-align: justify;\">&#171;&#160;<i>Art.&#160;L.&#160;5211&#8209;12&#8209;2</i>.&#160;&#8211;&#160;Dans des conditions fix&#233;es par leur r&#232;glement int&#233;rieur, le montant des indemnit&#233;s que l&#8217;organe d&#233;lib&#233;rant des &#233;tablissements publics de coop&#233;ration intercommunale de 100&#160;000 habitants et plus alloue aux membres de son bureau est modul&#233; en fonction de leur participation effective aux s&#233;ances pl&#233;ni&#232;res et aux r&#233;unions des commissions dont ils sont membres. Le montant des indemnit&#233;s allou&#233;es aux membres de l&#8217;organe d&#233;lib&#233;rant des &#233;tablissements publics de coop&#233;ration intercommunale de 100&#160;000 habitants et plus peut &#233;galement &#234;tre modul&#233; en fonction de la participation effective aux s&#233;ances pl&#233;ni&#232;res et aux r&#233;unions des commissions dont ils sont membres. La r&#233;duction &#233;ventuelle de ce montant ne peut d&#233;passer, pour chacun des membres, la moiti&#233; de l&#8217;indemnit&#233; pouvant lui &#234;tre allou&#233;e.&#160;&#187;</p>",
    "exposeSommaire": "<p style=\"text-align: justify;\">Le S&#233;nat a introduit une disposition visant &#224; permettre aux EPCI regroupant plus de 100 000 habitants de moduler l&#8217;indemnit&#233;s des membres en fonction de leur participation effectives aux s&#233;ances pl&#233;ni&#232;res et aux r&#233;unions de commissions. Il s&#8217;agit d&#8217;un dispositif inspir&#233; de ce qui existe pour les conseils d&#233;partementaux et r&#233;gionaux (pour lesquels la modulation de l&#8217;indemnit&#233; en fonction de la participation est obligatoire).&#160;</p><p style=\"text-align: justify;\">La r&#233;&#233;criture de cet article&#160;28 <i>ter</i> en commission des lois ne satisfait pas &#224; l&#8217;objectif port&#233; par le S&#233;nat, puisqu&#8217;il rend applicable la disposition de l&#8217;article&#160;28 <i>bis</i> du PJL (modulation possible des indemnit&#233;s des conseillers municipaux dans les villes de plus de 50&#160;000 habitants en fonction de la participation effective aux r&#233;unions) au&#160; sein des conseils des communaut&#233;s de communes.</p><p style=\"text-align: justify;\">La disposition du S&#233;nat s&#8217;appliquait quant &#224; elle &#224; l&#8217;ensemble des EPCI &#224; fiscalit&#233; propre. Cet amendement reprend le dispositif adopt&#233; par le S&#233;nat, tout en y ajoutant un dispositif interm&#233;diaire&#160;: la modulation de l&#8217;indemnit&#233; serait d&#233;sormais obligatoire pour les membres du Bureau de l&#8217;EPCI, et resterait une possibilit&#233; pour les autres conseillers communautaires.&#160;</p>",
    "annexeExposeSommaire": {
      "@xmlns:xsi": "http://www.w3.org/2001/XMLSchema-instance",
      "@xsi:nil": "true"
    },
    "cartoucheDelaiDepotDepasse": {
      "@xmlns:xsi": "http://www.w3.org/2001/XMLSchema-instance",
      "@xsi:nil": "true"
    },
    "avantAppel": {
      "@xmlns:xsi": "http://www.w3.org/2001/XMLSchema-instance",
      "@xsi:nil": "true"
    }
  },
  "representations": {
    "representation": {
      "nom": "PDF",
      "typeMime": {
        "type": "application",
        "subType": "PDF"
      },
      "statutRepresentation": {
        "verbatim": "true",
        "canonique": "true",
        "officielle": "true",
        "transcription": "false",
        "enregistrement": "false"
      },
      "repSource": {
        "@xmlns:xsi": "http://www.w3.org/2001/XMLSchema-instance",
        "@xsi:nil": "true"
      },
      "offset": {
        "@xmlns:xsi": "http://www.w3.org/2001/XMLSchema-instance",
        "@xsi:nil": "true"
      },
      "contenu": {
        "documentURI": "/15/amendements/2401/AN/1284.pdf"
      },
      "dateDispoRepresentation": {
        "@xmlns:xsi": "http://www.w3.org/2001/XMLSchema-instance",
        "@xsi:nil": "true"
      }
    }
  },
  "seanceDiscussion": "RUANR5L15S2020IDS21954",
  "sort": {
    "dateSaisie": "2019-11-21T23:41:55.000+01:00",
    "sortEnSeance": "Retiré"
  },
  "dateDepot": "2019-11-14T01:00:00.000+01:00",
  "dateDistribution": "2019-11-20T01:00:00.000+01:00",
  "article99": "0",
  "loiReference": {
    "codeLoi": {
      "@xmlns:xsi": "http://www.w3.org/2001/XMLSchema-instance",
      "@xsi:nil": "true"
    },
    "divisionCodeLoi": {
      "@xmlns:xsi": "http://www.w3.org/2001/XMLSchema-instance",
      "@xsi:nil": "true"
    }
  }
}