{
  "@xmlns": "http://schemas.assemblee-nationale.fr/referentiel",
  "uid": "AMANR5L15SEA717460B2272P1D1N2573",
  "identifiant": {
    "legislature": "15",
    "numero": "2573",
    "numRect": "0",
    "saisine": {
      "refTexteLegislatif": "PRJLANR5L15B2272",
      "numeroPartiePLF": "1",
      "organeExamen": "PO717460",
      "mentionSecondeDeliberation": "0"
    }
  },
  "numeroLong": "I-2573",
  "etapeTexte": "1ère lecture (1ère assemblée saisie)",
  "triAmendement": "baaaaaaaaaaaaaaaaaaaaaaaaaaaaaaaaaaaaaaaaaaaaaaaaaajeenzx",
  "cardinaliteAmdtMultiples": "1",
  "amendementParent": {
    "@xmlns:xsi": "http://www.w3.org/2001/XMLSchema-instance",
    "@xsi:nil": "true"
  },
  "etat": "Discuté",
  "signataires": {
    "auteur": {
      "typeAuteur": "Depute",
      "acteurRef": "PA334654",
      "organeRef": {
        "@xmlns:xsi": "http://www.w3.org/2001/XMLSchema-instance",
        "@xsi:nil": "true"
      },
      "groupePolitiqueRef": "PO730934"
    },
    "cosignataires": {
      "acteurRef": [
        "PA767",
        "PA334654"
      ]
    },
    "texteAffichable": "M.&#160;Straumann et M.&#160;Cattin"
  },
  "pointeurFragmentTexte": {
    "missionVisee": {
      "@xmlns:xsi": "http://www.w3.org/2001/XMLSchema-instance",
      "@xsi:nil": "true"
    },
    "division": {
      "titre": "Article 4",
      "articleDesignationCourte": "ART. 4",
      "type": "ARTICLE",
      "avant_A_Apres": "A",
      "divisionRattachee": "ARTICLE 4",
      "articleAdditionnel": {
        "@xmlns:xsi": "http://www.w3.org/2001/XMLSchema-instance",
        "@xsi:nil": "true"
      },
      "chapitreAdditionnel": {
        "@xmlns:xsi": "http://www.w3.org/2001/XMLSchema-instance",
        "@xsi:nil": "true"
      },
      "urlDivisionTexteVise": "/15/textes/2272A.asp#D_Article_4"
    },
    "alinea": {
      "avant_A_Apres": "Apres",
      "numero": "30",
      "alineaDesignation": {
        "@xmlns:xsi": "http://www.w3.org/2001/XMLSchema-instance",
        "@xsi:nil": "true"
      }
    }
  },
  "corps": {
    "dispositif": "<p style=\"text-align: justify;\">I.&#160;&#8211;&#160;Apr&#232;s l&#8217;alin&#233;a&#160;30, ins&#233;rer l&#8217;alin&#233;a suivant&#160;:</p><p style=\"text-align: justify;\">&#171;&#160;<i>o)</i> Aux d&#233;penses pay&#233;es entre le 1<sup>er</sup> janvier 2020 et le 31 d&#233;cembre 2020 au titre d&#8217;une r&#233;novation globale permettant le passage d&#8217;un diagnostic de performance &#233;nerg&#233;tique de niveau F ou G &#224;, au moins, un diagnostic de performance &#233;nerg&#233;tique de niveau C ou D.&#160;&#187;</p><p style=\"text-align: justify;\">II.&#160;&#8211;&#160;En cons&#233;quence, &#224; la fin de l&#8217;alin&#233;a&#160;44, substituer &#224; la r&#233;f&#233;rence&#160;:</p><p style=\"text-align: justify;\">&#171;&#160;au <i>i</i> du 1&#160;&#187;</p><p style=\"text-align: justify;\">les r&#233;f&#233;rences&#160;:</p><p style=\"text-align: justify;\">&#171;&#160;aux 3&#176;&#160;du <i>b</i>, 1&#176;&#160;et 3&#176;&#160;des <i>c</i>, <i>d</i>, <i>i</i>, <i>j</i>, <i>m</i> et <i>o</i> du 1&#160;&#187;.</p><p style=\"text-align: justify;\">III.&#160;&#8211;&#160;En cons&#233;quence, substituer &#224; la seconde colonne du tableau de l&#8217;alin&#233;a&#160;47 les deux colonnes suivantes&#160;:</p><p style=\"text-align: justify;\">&#171;&#160;</p><table style=\"width: 653px; border-collapse: collapse;\" border=\"2\" cellpadding=\"0.75pt\"><tbody><tr><td style=\"width: 194.45px; border-width:1pt 1pt 1pt 0pt; border-style: solid solid solid none; border-color: black black black currentcolor; -moz-border-top-colors: none; -moz-border-right-colors: none; -moz-border-bottom-colors: none; -moz-border-left-colors: none; padding: 0.75pt;\"><p style=\"text-align: center;\">Montant (5&#176;&#160;&#224; 8&#176;&#160;d&#233;ciles)</p></td><td style=\"width: 195px; border-width:1pt 1pt 1pt 0pt; border-style: solid solid solid none; border-color: black black black currentcolor; -moz-border-top-colors: none; -moz-border-right-colors: none; -moz-border-bottom-colors: none; -moz-border-left-colors: none; padding: 0.75pt;\"><p style=\"text-align: center;\">Montant (9&#176;&#160;et 10&#176;&#160;d&#233;ciles)</p></td></tr><tr><td style=\"width: 194.45px; border-width:0pt 1pt 1pt 0pt; border-style: none solid solid none; border-color: currentcolor black black currentcolor; padding: 0.75pt;\"><p>40&#160;&#8364;&#160;/&#160;&#233;quipement</p></td><td style=\"width: 195px; border-width:0pt 1pt 1pt 0pt; border-style: none solid solid none; border-color: currentcolor black black currentcolor; padding: 0.75pt;\"><p>&#160;</p></td></tr><tr><td style=\"width: 194.45px; border-width:0pt 1pt 1pt 0pt; border-style: none solid solid none; border-color: currentcolor black black currentcolor; padding: 0.75pt;\"><p>15&#160;&#8364;&#160;/&#160;m&#178; pour l&#8217;isolation des murs en fa&#231;ade ou pignon par l&#8217;int&#233;rieur, des rampants de toiture et plafonds de combles am&#233;nag&#233;s ou am&#233;nageables</p><p>et&#160;50&#160;&#8364;&#160;/&#160;m&#178; pour l&#8217;isolation des murs en fa&#231;ade ou pignon par l&#8217;ext&#233;rieur, des toitures-terrasses</p></td><td style=\"width: 195px; border-width:0pt 1pt 1pt 0pt; border-style: none solid solid none; border-color: currentcolor black black currentcolor; padding: 0.75pt;\"><p>15&#160;&#8364;&#160;/&#160;m&#178; pour l&#8217;isolation des murs en fa&#231;ade ou pignon par l&#8217;int&#233;rieur, des rampants de toiture et plafonds de combles am&#233;nag&#233;s ou am&#233;nageables</p><p>et&#160;25&#160;&#8364;&#160;/&#160;m&#178; pour l&#8217;isolation des murs en fa&#231;ade ou pignon par l&#8217;ext&#233;rieur, des toitures-terrasses</p></td></tr><tr><td style=\"width: 194.45px; border-width:0pt 1pt 1pt 0pt; border-style: none solid solid none; border-color: currentcolor black black currentcolor; padding: 0.75pt;\"><p>4&#160;000&#160;&#8364; pour les chaudi&#232;res &#224; alimentation automatique fonctionnant au bois ou autres biomasse</p><p>3&#160;000&#160;&#8364; pour les syst&#232;mes solaires combin&#233;s</p><p>3&#160;000&#160;&#8364; pour les chaudi&#232;res &#224; alimentation manuelle fonctionnant au bois ou autres biomasses</p><p>1&#160;500&#160;&#8364; pour les po&#234;les &#224; granul&#233;s et cuisini&#232;res &#224; granul&#233;s</p><p>&#160;2&#160;000&#160;&#8364; pour les chauffe-eau solaires individuels</p><p>1&#160;000&#160;&#8364; pour les po&#234;les &#224; b&#251;ches et cuisini&#232;res &#224; b&#251;ches</p><p>600&#160;&#8364; pour les foyers ferm&#233;s et inserts &#224; b&#251;ches ou granul&#233;s</p><p>1&#160;000&#160;&#8364; pour les &#233;quipements de chauffage ou de production d&#8217;eau chaude fonctionnant avec des capteurs solaires hybrides thermiques et &#233;lectriques &#224; circulation de liquide</p></td><td style=\"width: 195px; border-width:0pt 1pt 1pt 0pt; border-style: none solid solid none; border-color: currentcolor black black currentcolor; padding: 0.75pt;\"><p>2&#160;000&#160;&#8364; pour les chaudi&#232;res &#224; alimentation automatique fonctionnant au bois ou autres biomasse</p><p>1 500&#160;&#8364; pour les syst&#232;mes solaires combin&#233;s</p><p>1 500&#160;&#8364; pour les chaudi&#232;res &#224; alimentation manuelle fonctionnant au bois ou autres biomasses</p><p>750&#160;&#8364; pour les po&#234;les &#224; granul&#233;s et cuisini&#232;res &#224; granul&#233;s</p><p>1 000&#160;&#8364; pour les chauffe-eau solaires individuels</p><p>500&#160;&#8364; pour les po&#234;les &#224; b&#251;ches et cuisini&#232;res &#224; b&#251;ches</p><p>300&#160;&#8364; pour les foyers ferm&#233;s et inserts &#224; b&#251;ches ou granul&#233;s</p><p>500&#160;&#8364; pour les &#233;quipements de chauffage ou de production d&#8217;eau chaude fonctionnant avec des capteurs solaires hybrides thermiques et &#233;lectriques &#224; circulation de liquide</p></td></tr><tr><td style=\"width: 194.45px; border-width:0pt 1pt 1pt 0pt; border-style: none solid solid none; border-color: currentcolor black black currentcolor; padding: 0.75pt;\"><p>4&#160;000&#160;&#8364; pour les pompes &#224; chaleur g&#233;othermiques</p><p>2&#160;000&#160;&#8364; pour les pompes &#224; chaleur air/eau</p><p>400&#160;&#8364; pour les pompes &#224; chaleur d&#233;di&#233;es &#224; la production d&#8217;eau chaude sanitaire</p></td><td style=\"width: 195px; border-width:0pt 1pt 1pt 0pt; border-style: none solid solid none; border-color: currentcolor black black currentcolor; padding: 0.75pt;\"><p>2&#160;000&#160;&#8364; pour les pompes &#224; chaleur g&#233;othermiques</p><p>1&#160;000&#160;&#8364; pour les pompes &#224; chaleur air/eau</p><p>200&#160;&#8364; pour les pompes &#224; chaleur d&#233;di&#233;es &#224; la production d&#8217;eau chaude sanitaire</p></td></tr><tr><td style=\"width: 194.45px; border-width:0pt 1pt 1pt 0pt; border-style: none solid solid none; border-color: currentcolor black black currentcolor; padding: 0.75pt;\"><p>400&#160;&#8364;</p></td><td style=\"width: 195px; border-width:0pt 1pt 1pt 0pt; border-style: none solid solid none; border-color: currentcolor black black currentcolor; padding: 0.75pt;\"><p>200&#160;&#8364;</p></td></tr><tr><td style=\"width: 194.45px; border-width:0pt 1pt 1pt 0pt; border-style: none solid solid none; border-color: currentcolor black black currentcolor; padding: 0.75pt;\"><p>300&#160;&#8364;</p></td><td style=\"width: 195px; border-width:0pt 1pt 1pt 0pt; border-style: none solid solid none; border-color: currentcolor black black currentcolor; padding: 0.75pt;\"><p>300&#160;&#8364;</p></td></tr><tr><td style=\"width: 194.45px; border-width:0pt 1pt 1pt 0pt; border-style: none solid solid none; border-color: currentcolor black black currentcolor; padding: 0.75pt;\"><p>15&#160;&#8364; / m&#178;</p></td><td style=\"width: 195px; border-width:0pt 1pt 1pt 0pt; border-style: none solid solid none; border-color: currentcolor black black currentcolor; padding: 0.75pt;\"><p>15&#160;&#8364; / m&#178;</p></td></tr><tr><td style=\"width: 194.45px; border-width:0pt 1pt 1pt 0pt; border-style: none solid solid none; border-color: currentcolor black black currentcolor; padding: 0.75pt;\"><p>300&#160;&#8364;</p></td><td style=\"width: 195px; border-width:0pt 1pt 1pt 0pt; border-style: none solid solid none; border-color: currentcolor black black currentcolor; padding: 0.75pt;\"><p>&#160;</p></td></tr><tr><td style=\"width: 194.45px; border-width:0pt 1pt 1pt 0pt; border-style: none solid solid none; border-color: currentcolor black black currentcolor; padding: 0.75pt;\"><p>400&#160;&#8364;</p></td><td style=\"width: 195px; border-width:0pt 1pt 1pt 0pt; border-style: none solid solid none; border-color: currentcolor black black currentcolor; padding: 0.75pt;\"><p>200&#160;&#8364;</p></td></tr><tr><td style=\"width: 194.45px; border-width:0pt 1pt 1pt 0pt; border-style: none solid solid none; border-color: currentcolor black black currentcolor; padding: 0.75pt;\"><p>2000&#160;&#8364;</p></td><td style=\"width: 195px; border-width:0pt 1pt 1pt 0pt; border-style: none solid solid none; border-color: currentcolor black black currentcolor; padding: 0.75pt;\"><p>&#160;</p></td></tr></tbody></table><p style=\"text-align: justify;\">&#160;&#187;.</p><p style=\"text-align: justify;\"><b></b>IV.&#160;&#8211;&#160;En cons&#233;quence, compl&#233;ter le m&#234;me tableau par la ligne suivante&#160;:</p><table style=\"width: 653px; border-collapse: collapse;\" border=\"2\" cellpadding=\"0.75pt\"><tbody><tr><td style=\"width: 250.55px; border-width:0pt 1pt 1pt; border-style: none solid solid; border-color: currentcolor black black; -moz-border-top-colors: none; -moz-border-right-colors: none; -moz-border-bottom-colors: none; -moz-border-left-colors: none; padding: 0.75pt;\"><p>R&#233;novation globale permettant le passage d&#8217;un DPE F ou G &#224; un DPE C ou D mentionn&#233;e au <i>o</i> du 1</p></td><td style=\"width: 194.45px; border-width:0pt 1pt 1pt 0pt; border-style: none solid solid none; border-color: currentcolor black black currentcolor; padding: 0.75pt;\"><p>100&#160;&#8364;&#160;/ m&#178; au titre de l&#8217;article R 112&#8209;2 du CCH</p></td><td style=\"width: 195px; border-width:0pt 1pt 1pt 0pt; border-style: none solid solid none; border-color: currentcolor black black currentcolor; padding: 0.75pt;\"><p>50&#160;&#8364; / m&#178; au titre de l&#8217;article R 112&#8209;2 du CCH</p></td></tr></tbody></table><p style=\"text-align: justify;\">V.&#160;&#8211;&#160;En cons&#233;quence, substituer &#224; la seconde colonne du tableau de l&#8217;alin&#233;a&#160;51&#160;:</p><p style=\"text-align: justify;\">&#171;&#160;</p><table style=\"width: 653px; border-collapse: collapse;\"><tbody><tr><td style=\"width: 203.133px; border-width:1pt 1pt 1pt 0pt; border-style: solid solid solid none; border-color: black black black currentcolor; -moz-border-top-colors: none; -moz-border-right-colors: none; -moz-border-bottom-colors: none; -moz-border-left-colors: none; padding: 0.75pt;\"><p>Montant (5&#176;&#160;&#224; 8&#176;&#160;d&#233;ciles)</p></td><td style=\"width: 195px; border-width:1pt 1pt 1pt 0pt; border-style: solid solid solid none; border-color: black black black currentcolor; -moz-border-top-colors: none; -moz-border-right-colors: none; -moz-border-bottom-colors: none; -moz-border-left-colors: none; padding: 0.75pt;\"><p>Montant (9&#176;&#160;et 10&#176;&#160;d&#233;ciles)</p></td></tr><tr><td style=\"width: 203.133px; border-width:0pt 1pt 1pt 0pt; border-style: none solid solid none; border-color: currentcolor black black currentcolor; padding: 0.75pt;\"><p>15*q&#160;&#8364;&#160;/&#160;m&#178; pour l&#8217;isolation des murs en fa&#231;ade ou pignon par l&#8217;int&#233;rieur, des rampants de toiture et plafonds de combles am&#233;nag&#233;s ou am&#233;nageables</p><p>et&#160;50*q&#160;&#8364;&#160;/&#160;m&#178; pour l&#8217;isolation des murs en fa&#231;ade ou pignon par l&#8217;ext&#233;rieur, des toitures-terrasses</p></td><td style=\"width: 195px; border-width:0pt 1pt 1pt 0pt; border-style: none solid solid none; border-color: currentcolor black black currentcolor; padding: 0.75pt;\"><p>15*q&#160;&#8364;&#160;/&#160;m&#178; pour l&#8217;isolation des murs en fa&#231;ade ou pignon par l&#8217;int&#233;rieur, des rampants de toiture et plafonds de combles am&#233;nag&#233;s ou am&#233;nageables</p><p>et&#160;25*q&#160;&#8364;&#160;/&#160;m&#178; pour l&#8217;isolation des murs en fa&#231;ade ou pignon par l&#8217;ext&#233;rieur, des toitures-terrasses</p></td></tr><tr><td style=\"width: 203.133px; border-width:0pt 1pt 1pt 0pt; border-style: none solid solid none; border-color: currentcolor black black currentcolor; padding: 0.75pt;\"><p>1&#160;000&#160;&#8364; par logement pour les chaudi&#232;res fonctionnant au bois ou autres biomasses</p><p>350&#160;&#8364; par logement pour les &#233;quipements de fourniture d&#8217;eau chaude sanitaire seule fonctionnant &#224; l&#8217;&#233;nergie solaire thermique</p></td><td style=\"width: 195px; border-width:0pt 1pt 1pt 0pt; border-style: none solid solid none; border-color: currentcolor black black currentcolor; padding: 0.75pt;\"><p>500&#160;&#8364; par logement pour les chaudi&#232;res fonctionnant au bois ou autres biomasses</p><p>175&#160;&#8364; par logement pour les &#233;quipements de fourniture d&#8217;eau chaude sanitaire seule fonctionnant &#224; l&#8217;&#233;nergie solaire thermique</p></td></tr><tr><td style=\"width: 203.133px; border-width:0pt 1pt 1pt 0pt; border-style: none solid solid none; border-color: currentcolor black black currentcolor; padding: 0.75pt;\"><p>1&#160;000&#160;&#8364; par logement pour les pompes &#224; chaleur g&#233;othermiques</p><p>et les pompes &#224; chaleur air/eau</p><p>150&#160;&#8364; par logement pour les pompes &#224; chaleur d&#233;di&#233;es &#224; la production d&#8217;eau chaude sanitaire</p></td><td style=\"width: 195px; border-width:0pt 1pt 1pt 0pt; border-style: none solid solid none; border-color: currentcolor black black currentcolor; padding: 0.75pt;\"><p>500&#160;&#8364; par logement pour les pompes &#224; chaleur g&#233;othermiques</p><p>et les pompes &#224; chaleur air/eau</p><p>75&#160;&#8364; par logement pour les pompes &#224; chaleur d&#233;di&#233;es &#224; la production d&#8217;eau chaude sanitaire</p></td></tr><tr><td style=\"width: 203.133px; border-width:0pt 1pt 1pt 0pt; border-style: none solid solid none; border-color: currentcolor black black currentcolor; padding: 0.75pt;\"><p>150&#160;&#8364; par logement</p></td><td style=\"width: 195px; border-width:0pt 1pt 1pt 0pt; border-style: none solid solid none; border-color: currentcolor black black currentcolor; padding: 0.75pt;\"><p>75&#160;&#8364; par logement</p></td></tr><tr><td style=\"width: 203.133px; border-width:0pt 1pt 1pt 0pt; border-style: none solid solid none; border-color: currentcolor black black currentcolor; padding: 0.75pt;\"><p>300&#160;&#8364;</p></td><td style=\"width: 195px; border-width:0pt 1pt 1pt 0pt; border-style: none solid solid none; border-color: currentcolor black black currentcolor; padding: 0.75pt;\"><p>300&#160;&#8364;</p></td></tr><tr><td style=\"width: 203.133px; border-width:0pt 1pt 1pt 0pt; border-style: none solid solid none; border-color: currentcolor black black currentcolor; padding: 0.75pt;\"><p>15*q &#8364; / m&#178;</p></td><td style=\"width: 195px; border-width:0pt 1pt 1pt 0pt; border-style: none solid solid none; border-color: currentcolor black black currentcolor; padding: 0.75pt;\"><p>15*q &#8364; / m&#178;</p></td></tr><tr><td style=\"width: 203.133px; border-width:0pt 1pt 1pt 0pt; border-style: none solid solid none; border-color: currentcolor black black currentcolor; padding: 0.75pt;\"><p>150&#160;&#8364; par logement</p></td><td style=\"width: 195px; border-width:0pt 1pt 1pt 0pt; border-style: none solid solid none; border-color: currentcolor black black currentcolor; padding: 0.75pt;\"><p>&#160;</p></td></tr><tr><td style=\"width: 203.133px; border-width:0pt 1pt 1pt 0pt; border-style: none solid solid none; border-color: currentcolor black black currentcolor; padding: 0.75pt;\"><p>150&#160;&#8364; par logement</p></td><td style=\"width: 195px; border-width:0pt 1pt 1pt 0pt; border-style: none solid solid none; border-color: currentcolor black black currentcolor; padding: 0.75pt;\"><p>75&#160;&#8364; par logement</p></td></tr></tbody></table><p style=\"text-align: justify;\">&#160;&#187;.</p><p style=\"text-align: justify;\">VI.&#160;&#8211;&#160;En cons&#233;quence, compl&#233;ter le m&#234;me tableau par la ligne suivante&#160;:</p><table style=\"width: 653px; border-collapse: collapse;\" border=\"2\" cellpadding=\"0.75pt\"><tbody><tr><td style=\"width: 242.867px; border-width:0pt 1pt 1pt; border-style: none solid solid; border-color: currentcolor black black; -moz-border-top-colors: none; -moz-border-right-colors: none; -moz-border-bottom-colors: none; -moz-border-left-colors: none; padding: 0.75pt;\"><p>&#201;quipements de ventilation m&#233;canique contr&#244;l&#233;e &#224; double flux mentionn&#233;s au&#160;n du&#160;1</p></td><td style=\"width: 203.133px; border-width:0pt 1pt 1pt 0pt; border-style: none solid solid none; border-color: currentcolor black black currentcolor; padding: 0.75pt;\"><p>1000&#160;&#8364; par logement</p></td><td style=\"width: 195px; border-width:0pt 1pt 1pt 0pt; border-style: none solid solid none; border-color: currentcolor black black currentcolor; padding: 0.75pt;\"><p>&#160;</p></td></tr></tbody></table><p style=\"text-align: justify;\">VII. &#8211; Compl&#233;ter cet article par les trois alin&#233;as suivants&#160;:</p><p style=\"text-align: justify;\">&#171;&#160;IV.&#160;&#8211;&#160;Le I est restreint au cr&#233;dit d&#8217;imp&#244;t pr&#233;vu &#224; l&#8217;article&#160;200 <i>quater</i> du code g&#233;n&#233;ral des imp&#244;ts, sans incidence sur la d&#233;finition de la prime mentionn&#233;e au II de l&#8217;article&#160;4 de la loi n&#176;&#160;... du... de finances pour 2020.</p><p style=\"text-align: justify;\">&#171;&#160;V.&#160;&#8211;&#160;Le I n&#8217;est applicable qu&#8217;aux sommes venant en d&#233;duction de l&#8217;imp&#244;t d&#251;.</p><p style=\"text-align: justify;\">&#171;&#160;VI.&#160;&#8211;&#160;La perte de recettes r&#233;sultant pour l&#8217;&#201;tat du I est compens&#233;e &#224; due concurrence par la cr&#233;ation d&#8217;une taxe additionnelle aux droits mentionn&#233;s aux articles 575 et 575 A du code g&#233;n&#233;ral des imp&#244;ts.&#160;&#187;</p>",
    "exposeSommaire": "<p style=\"text-align: justify;\">Le projet de loi de finances pour 2020 pr&#233;voit d&#8217;exclure du CITE les 9&#176;&#160;et 10&#176;&#160;d&#233;ciles qui repr&#233;sentent les m&#233;nages les plus &#171;&#160;ais&#233;s&#160;&#187;. Cela aura pour cons&#233;quence imm&#233;diate qu&#8217;une personne seule disposant d&#8217;un revenu fiscal de r&#233;f&#233;rence de 27&#160;706&#160;euros n&#8217;aura plus droit au CITE.</p><p style=\"text-align: justify;\">De m&#234;me, un couple avec deux enfants disposant d&#8217;un revenu fiscal de r&#233;f&#233;rence de 56 438&#160;euros n&#8217;aura plus droit au CITE.</p><p style=\"text-align: justify;\">Si l&#8217;on peut comprendre que le Gouvernement, au travers d&#8217;une mesure sociale, soutienne l&#233;gitimement les m&#233;nages modestes et tr&#232;s modestes, pour autant en termes de massification des travaux et sur un plan environnemental, exclure les 9&#176;&#160;et 10&#176;&#160;d&#233;ciles, qui r&#233;alisent actuellement pr&#232;s de 50&#160;% des travaux relevant du CITE, marque une incoh&#233;rence et conduira &#224; une baisse du nombre de r&#233;novations &#233;nerg&#233;tiques des logements.</p><p style=\"text-align: justify;\">Le Gouvernement a en effet pour ambition de r&#233;nover pr&#232;s de 500&#160;000 logements par an et a arr&#234;t&#233; une ligne tr&#232;s claire dans le cadre de la Strat&#233;gie Nationale Bas Carbone.</p><p style=\"text-align: justify;\">Dans cet objectif, il est &#233;vident que les m&#233;nages modestes et tr&#232;s modestes ainsi que les m&#233;nages &#224; revenus interm&#233;diaires ne pourront pas, &#224; eux seuls, relever ce d&#233;fi.</p><p style=\"text-align: justify;\">Il est donc indispensable, pour respecter les objectifs environnementaux du Gouvernement, d&#8217;orienter les m&#233;nages et particuli&#232;rement ceux disposant de revenus correspondant aux 9&#176;&#160;et 10&#176;&#160;d&#233;ciles, vers les gestes les plus vertueux en termes d&#8217;efficacit&#233; &#233;nerg&#233;tique des logements.</p><p style=\"text-align: justify;\">Ces m&#233;nages doivent &#234;tre, eux aussi, incit&#233;s &#224; r&#233;aliser des travaux r&#233;pondant aux imp&#233;ratifs de lutte contre les gaz &#224; effet de serre.</p><p style=\"text-align: justify;\">&#192; d&#233;faut, il est &#224; craindre que ces m&#233;nages choisissent des &#233;quipements moins performants ou ne s&#8217;engagent pas &#224; r&#233;aliser des travaux d&#8217;am&#233;lioration d&#8217;efficacit&#233; &#233;nerg&#233;tique de leur logement.</p><p style=\"text-align: justify;\">Aussi, il convient de rendre &#233;ligibles pour ces m&#233;nages, les travaux les plus performants et les plus lourds, &#224; savoir&#160;:&#160; travaux d&#8217;isolation (isolation thermique par l&#8217;ext&#233;rieur, toiture-terrasse, isolation thermique des murs en fa&#231;ade ou en pignon) et/ou les &#233;quipements fonctionnant avec une source d&#8217;&#233;nergie renouvelable (EnR) les plus performants.</p><p style=\"text-align: justify;\">De plus, il convient de soutenir pour l&#8217;ensemble des m&#233;nages les frais de d&#233;pose de cuve &#224; fioul.</p><p style=\"text-align: justify;\">Il est propos&#233; pour ces d&#233;penses un forfait d&#233;gressif, qui s&#8217;inscrit dans la logique des bar&#232;mes arr&#234;t&#233;s pour les d&#233;ciles 1 &#224; 8 pr&#233;vus dans le projet de r&#233;forme du CITE.</p><p style=\"text-align: justify;\">Enfin, pour les m&#233;nages aux revenus interm&#233;diaires (d&#233;ciles 5 &#224; 8) et les plus ais&#233;s (d&#233;ciles 9 et 10) souhaitant proc&#233;der en une seule fois, &#224; une r&#233;novation globale de leur logement, il est propos&#233; une aide d&#232;s lors que les travaux permettent un saut de classe &#233;nerg&#233;tique du diagnostic de performance &#233;nerg&#233;tique (DPE) de niveau F ou G pour atteindre un niveau de DPE C ou D.</p><p style=\"text-align: justify;\">&#160;</p><p style=\"text-align: justify;\">* Les travaux mentionn&#233;s dans cet amendement &#224; l&#8217;alin&#233;a&#160;44 sont les suivants&#160;:</p><p style=\"text-align: justify;\">&#160;Isolation des parois opaques (3&#176;&#160;du b)</p><p style=\"text-align: justify;\">ENR et PAC (1&#176;&#160;et 3&#176;&#160;du c)</p><p style=\"text-align: justify;\">Raccordement &#224; un r&#233;seau de chaleur ou de froid aliment&#233; par ENR ou cog&#233;n&#233;ration (d du 1)</p><p style=\"text-align: justify;\">Syst&#232;mes de charges de v&#233;hicules &#233;lectriques (i du 1)</p><p style=\"text-align: justify;\">&#201;quipements ou mat&#233;riaux de protection des parois vitr&#233;es ou opaques contre les rayonnements solaires (j du 1)</p><p style=\"text-align: justify;\">D&#233;pose de cuve &#224; fioul (m du 1) ainsi que la r&#233;novation globale permettant d&#8217;atteindre un DPE C ou D (o du 1)</p>",
    "annexeExposeSommaire": {
      "@xmlns:xsi": "http://www.w3.org/2001/XMLSchema-instance",
      "@xsi:nil": "true"
    },
    "cartoucheDelaiDepotDepasse": {
      "@xmlns:xsi": "http://www.w3.org/2001/XMLSchema-instance",
      "@xsi:nil": "true"
    },
    "avantAppel": {
      "@xmlns:xsi": "http://www.w3.org/2001/XMLSchema-instance",
      "@xsi:nil": "true"
    }
  },
  "representations": {
    "representation": {
      "nom": "PDF",
      "typeMime": {
        "type": "application",
        "subType": "PDF"
      },
      "statutRepresentation": {
        "verbatim": "true",
        "canonique": "true",
        "officielle": "true",
        "transcription": "false",
        "enregistrement": "false"
      },
      "repSource": {
        "@xmlns:xsi": "http://www.w3.org/2001/XMLSchema-instance",
        "@xsi:nil": "true"
      },
      "offset": {
        "@xmlns:xsi": "http://www.w3.org/2001/XMLSchema-instance",
        "@xsi:nil": "true"
      },
      "contenu": {
        "documentURI": "/15/amendements/2272A/AN/2573.pdf"
      },
      "dateDispoRepresentation": {
        "@xmlns:xsi": "http://www.w3.org/2001/XMLSchema-instance",
        "@xsi:nil": "true"
      }
    }
  },
  "seanceDiscussion": "RUANR5L15S2020IDS21867",
  "sort": {
    "dateSaisie": "2019-10-17T19:11:36.000+02:00",
    "sortEnSeance": "Non soutenu"
  },
  "dateDepot": "2019-10-10T02:00:00.000+02:00",
  "dateDistribution": "2019-10-17T02:00:00.000+02:00",
  "article99": "0",
  "loiReference": {
    "codeLoi": {
      "@xmlns:xsi": "http://www.w3.org/2001/XMLSchema-instance",
      "@xsi:nil": "true"
    },
    "divisionCodeLoi": {
      "@xmlns:xsi": "http://www.w3.org/2001/XMLSchema-instance",
      "@xsi:nil": "true"
    }
  }
}