{
  "@xmlns": "http://schemas.assemblee-nationale.fr/referentiel",
  "uid": "AMANR5L15PO59048B2272P1D1N316",
  "identifiant": {
    "legislature": "15",
    "numero": "316",
    "numRect": "0",
    "saisine": {
      "refTexteLegislatif": "PRJLANR5L15B2272",
      "numeroPartiePLF": "1",
      "organeExamen": "PO59048",
      "mentionSecondeDeliberation": "0"
    }
  },
  "numeroLong": "I-CF316",
  "etapeTexte": "1ère lecture (1ère assemblée saisie)",
  "triAmendement": "duaaaaaaaaaaaaaaaaaaaaaaaaaaaaaaaaaaaaaaaaaaaaaaaagji",
  "cardinaliteAmdtMultiples": "1",
  "amendementParent": {
    "@xmlns:xsi": "http://www.w3.org/2001/XMLSchema-instance",
    "@xsi:nil": "true"
  },
  "etat": "Discuté",
  "signataires": {
    "auteur": {
      "typeAuteur": "Depute",
      "acteurRef": "PA942",
      "organeRef": {
        "@xmlns:xsi": "http://www.w3.org/2001/XMLSchema-instance",
        "@xsi:nil": "true"
      },
      "groupePolitiqueRef": "PO759900"
    },
    "cosignataires": {
      "acteurRef": [
        "PA405480",
        "PA942",
        "PA607619"
      ]
    },
    "texteAffichable": "M.&#160;Charles&#160;de Courson,  M.&#160;Molac et M.&#160;Pupponi"
  },
  "pointeurFragmentTexte": {
    "missionVisee": {
      "@xmlns:xsi": "http://www.w3.org/2001/XMLSchema-instance",
      "@xsi:nil": "true"
    },
    "division": {
      "titre": "Article 16",
      "articleDesignationCourte": "APRÈS ART. 16",
      "type": "ARTICLE",
      "avant_A_Apres": "Après",
      "divisionRattachee": "APRÈS L'ARTICLE 16, insérer l'article suivant:",
      "articleAdditionnel": "1",
      "chapitreAdditionnel": {
        "@xmlns:xsi": "http://www.w3.org/2001/XMLSchema-instance",
        "@xsi:nil": "true"
      },
      "urlDivisionTexteVise": "/15/textes/2272A.asp#D_Article_16"
    },
    "alinea": {
      "@xmlns:xsi": "http://www.w3.org/2001/XMLSchema-instance",
      "@xsi:nil": "true"
    }
  },
  "corps": {
    "dispositif": "<p style=\"text-align: justify;\">I.&#160;-&#160;L&#8217;article&#160;39 <i>decies</i> A du code g&#233;n&#233;ral des imp&#244;ts est ainsi modifi&#233;&#160;:</p><p style=\"text-align: justify;\">1&#176;&#160;Le 1 du I est compl&#233;t&#233; par un alin&#233;a ainsi r&#233;dig&#233;&#160;:</p><p style=\"text-align: justify;\">&#171;&#160;<i>d)</i> Le carburant B100 constitu&#233; &#224; 100&#160;% d&#8217;esters m&#233;thyliques d&#8217;acides gras et dont la motorisation est con&#231;ue en vue de cet usage exclusif.&#160;&#187;</p><p style=\"text-align: justify;\">2&#176;&#160;Au 2 du I, apr&#232;s les mots&#160;: &#171;&#160;les &#233;nergies mentionn&#233;es aux <i>c</i> et <i>d</i> dudit 1&#160;&#187; sont ins&#233;r&#233;s les mots&#160;: &#171;&#160;ainsi que le carburant B100&#160;&#187;.</p><p style=\"text-align: justify;\">3&#176;&#160;Au III, apr&#232;s les mots&#160;: &#171;&#160;les &#233;nergies mentionn&#233;es aux <i>c</i> et <i>d</i> du m&#234;me 1&#160;&#187; sont ins&#233;r&#233;s les mots&#160;: &#171;&#160;ainsi que le carburant B100&#160;&#187;.</p><p style=\"text-align: justify;\">II.&#160;-La perte de recettes pour l&#8217;&#201;tat est compens&#233;e &#224; due concurrence par la cr&#233;ation d&#8217;une taxe additionnelle aux droits pr&#233;vus aux articles 575 et 575 A du code g&#233;n&#233;ral des imp&#244;ts.</p>",
    "exposeSommaire": "<p>Cet amendement propose d&#8217;&#233;tendre l&#8217;application du dispositif de suramortissement aux v&#233;hicules qui utilisent exclusivement du B100 issu de colza fran&#231;ais. Il garantit juridiquement cet usage exclusif. Il permet en outre la reconnaissance du B100 en tant qu&#8217;&#233;nergie 100% renouvelable.</p><p>&#160;</p><p>Ce dispositif ne concernera que les nouveaux v&#233;hicules dont les moteurs auront &#233;t&#233; con&#231;us et homologu&#233;s pour un usage exclusif du B100. La preuve technique de cet usage exclusif sera apport&#233;e par les constructeurs, ce qui sera de nature &#224; offrir les garanties n&#233;cessaires.</p><p>&#160;</p><p>En encourageant le d&#233;veloppement du B100, l&#8217;amendement contribue non seulement &#224; la r&#233;alisation des objectifs de l'Accord de Paris sur le climat mais r&#233;pond aussi &#224; l&#8217;ambition affich&#233;e d&#8217;une souverainet&#233; prot&#233;inique de la France dans un contexte o&#249; celle-ci est fortement d&#233;pendante des prot&#233;ines import&#233;es.</p><p>En effet, le d&#233;veloppement du B100 contribue directement &#224; l&#8217;ind&#233;pendance en prot&#233;ines de la France en permettant la production de tourteaux de colza non-OGM. Ainsi, la production d&#8217;un litre de B100 cog&#233;n&#232;re 1,6kg de tourteaux de prot&#233;ines de colza non-OGM, ce qui permet d&#8217;&#233;viter des importations de tourteaux de soja OGM, notamment en provenance du Br&#233;sil.</p><p>L&#8217;amendement contribue &#233;galement &#224; la strat&#233;gie nationale de lutte contre la d&#233;forestation en valorisant une &#233;nergie renouvelable qui n&#8217;est pas issue de produits forestiers ou agricoles non durables.</p><p>En outre, le d&#233;veloppement du B100 participe pleinement &#224; la transition &#233;cologique et &#233;nerg&#233;tique, et repr&#233;sente ainsi une alternative cr&#233;dible et imm&#233;diate au gazole.</p><p>Enfin, l&#8217;amendement contribue &#224; instaurer une fiscalit&#233; lisible, coh&#233;rente et non-discriminatoire puisqu&#8217;il permettra d&#8217;instaurer une &#233;galit&#233; de traitement entre toutes les fili&#232;res durables. En effet, le carburant ED95 (95% d&#8217;&#233;thanol), le gaz naturel et le biom&#233;thane carburant, ainsi que l'hydrog&#232;ne sont d&#233;j&#224; &#233;ligibles &#224; ce dispositif.</p><p>&#160;</p>",
    "annexeExposeSommaire": {
      "@xmlns:xsi": "http://www.w3.org/2001/XMLSchema-instance",
      "@xsi:nil": "true"
    },
    "cartoucheDelaiDepotDepasse": {
      "@xmlns:xsi": "http://www.w3.org/2001/XMLSchema-instance",
      "@xsi:nil": "true"
    },
    "avantAppel": {
      "@xmlns:xsi": "http://www.w3.org/2001/XMLSchema-instance",
      "@xsi:nil": "true"
    }
  },
  "representations": {
    "representation": {
      "nom": "PDF",
      "typeMime": {
        "type": "application",
        "subType": "PDF"
      },
      "statutRepresentation": {
        "verbatim": "true",
        "canonique": "true",
        "officielle": "true",
        "transcription": "false",
        "enregistrement": "false"
      },
      "repSource": {
        "@xmlns:xsi": "http://www.w3.org/2001/XMLSchema-instance",
        "@xsi:nil": "true"
      },
      "offset": {
        "@xmlns:xsi": "http://www.w3.org/2001/XMLSchema-instance",
        "@xsi:nil": "true"
      },
      "contenu": {
        "documentURI": "/15/amendements/2272A/CION_FIN/CF316.pdf"
      },
      "dateDispoRepresentation": {
        "@xmlns:xsi": "http://www.w3.org/2001/XMLSchema-instance",
        "@xsi:nil": "true"
      }
    }
  },
  "seanceDiscussion": {
    "@xmlns:xsi": "http://www.w3.org/2001/XMLSchema-instance",
    "@xsi:nil": "true"
  },
  "sort": {
    "dateSaisie": "2019-10-10T10:43:57.000+02:00",
    "sortEnSeance": "Rejeté"
  },
  "dateDepot": "2019-10-03T02:00:00.000+02:00",
  "dateDistribution": "2019-10-09T02:00:00.000+02:00",
  "article99": "0",
  "loiReference": {
    "codeLoi": "CGI",
    "divisionCodeLoi": "39 decies A"
  }
}