{
  "@xmlns": "http://schemas.assemblee-nationale.fr/referentiel",
  "uid": "AMANR5L15PO420120B0269P0D1N288",
  "identifiant": {
    "legislature": "15",
    "numero": "288",
    "numRect": "0",
    "saisine": {
      "refTexteLegislatif": "PRJLANR5L15B0269",
      "numeroPartiePLF": "0",
      "organeExamen": "PO420120",
      "mentionSecondeDeliberation": "0"
    }
  },
  "numeroLong": "AS288",
  "etapeTexte": "1ère lecture (1ère assemblée saisie)",
  "triAmendement": "ao",
  "cardinaliteAmdtMultiples": "1",
  "amendementParent": {
    "@xmlns:xsi": "http://www.w3.org/2001/XMLSchema-instance",
    "@xsi:nil": "true"
  },
  "etat": "Discuté",
  "signataires": {
    "auteur": {
      "typeAuteur": "Depute",
      "acteurRef": "PA720422",
      "organeRef": {
        "@xmlns:xsi": "http://www.w3.org/2001/XMLSchema-instance",
        "@xsi:nil": "true"
      },
      "groupePolitiqueRef": "PO730958"
    },
    "cosignataires": {
      "acteurRef": [
        "PA719676",
        "PA720846",
        "PA721960",
        "PA721202",
        "PA718868",
        "PA721210",
        "PA2150",
        "PA721062",
        "PA720286",
        "PA720430",
        "PA720422",
        "PA719578",
        "PA588884",
        "PA721226",
        "PA720892",
        "PA718860",
        "PA722142"
      ]
    },
    "texteAffichable": "M.&#160;Quatennens,  M.&#160;Corbi&#232;re, Mme&#160;Taurine, Mme&#160;Autain, M.&#160;Prud&apos;homme, M.&#160;Ruffin, Mme&#160;Rubin, Mme&#160;Ressiguier, M.&#160;Ratenon, Mme&#160;Fiat, Mme&#160;Panot, M.&#160;Bernalicis, Mme&#160;Obono, M.&#160;Larive, M.&#160;Coquerel, M.&#160;Lachaud et M.&#160;M&#233;lenchon"
  },
  "pointeurFragmentTexte": {
    "missionVisee": {
      "@xmlns:xsi": "http://www.w3.org/2001/XMLSchema-instance",
      "@xsi:nil": "true"
    },
    "division": {
      "titre": "Article 14",
      "articleDesignationCourte": "ART. 14",
      "type": "ARTICLE",
      "avant_A_Apres": "A",
      "divisionRattachee": "ARTICLE 14",
      "articleAdditionnel": {
        "@xmlns:xsi": "http://www.w3.org/2001/XMLSchema-instance",
        "@xsi:nil": "true"
      },
      "chapitreAdditionnel": {
        "@xmlns:xsi": "http://www.w3.org/2001/XMLSchema-instance",
        "@xsi:nil": "true"
      },
      "urlDivisionTexteVise": "/15/textes/0269.asp#D_Article_14"
    },
    "alinea": {
      "avant_A_Apres": {
        "@xmlns:xsi": "http://www.w3.org/2001/XMLSchema-instance",
        "@xsi:nil": "true"
      },
      "numero": "9",
      "alineaDesignation": {
        "@xmlns:xsi": "http://www.w3.org/2001/XMLSchema-instance",
        "@xsi:nil": "true"
      }
    }
  },
  "corps": {
    "dispositif": "<p style=\"text-align: justify;\">&#192; l&#8217;alin&#233;a&#160;9, substituer aux mots&#160;:</p><p style=\"text-align: justify;\">&#171;&#160;, respectivement, &#224; 0&#160;%&#160;et &#224;&#160;3&#160;%.&#160;&#187;</p><p style=\"text-align: justify;\">les mots&#160;:</p><p style=\"text-align: justify;\">&#171;&#160;&#224; 0&#160;%.&#160;&#187;<br /><br /></p>",
    "exposeSommaire": "<p style=\"text-align: justify;\">Les grands laboratoires pharmaceutiques profitent de leur situation de quasi-monopole sur les march&#233;s pour se comporter en v&#233;ritables pr&#233;dateurs.<br />Ancien dirigeant d&#8217;un grand groupe pharmaceutique, Robert Dahan &#233;crivait dans une tribune en novembre 2015&#160;: &#171;&#160;Le prix d&#8217;un m&#233;dicament innovant, c&#8217;est simplement celui que le march&#233; accepte de payer et dans le cas de l&#8217;innovation, m&#233;dicamenteuse ou non, le prix est celui que le march&#233; am&#233;ricain accepte de payer.&#160;&#187;</p>",
    "annexeExposeSommaire": {
      "@xmlns:xsi": "http://www.w3.org/2001/XMLSchema-instance",
      "@xsi:nil": "true"
    }
  },
  "representations": {
    "representation": {
      "nom": "PDF",
      "typeMime": {
        "type": "application",
        "subType": "PDF"
      },
      "statutRepresentation": {
        "verbatim": "true",
        "canonique": "true",
        "officielle": "true",
        "transcription": "false",
        "enregistrement": "false"
      },
      "repSource": {
        "@xmlns:xsi": "http://www.w3.org/2001/XMLSchema-instance",
        "@xsi:nil": "true"
      },
      "offset": {
        "@xmlns:xsi": "http://www.w3.org/2001/XMLSchema-instance",
        "@xsi:nil": "true"
      },
      "contenu": {
        "documentURI": "/15/amendements/0269/CION-SOC/AS288.pdf"
      },
      "dateDispoRepresentation": {
        "@xmlns:xsi": "http://www.w3.org/2001/XMLSchema-instance",
        "@xsi:nil": "true"
      }
    }
  },
  "seanceDiscussion": {
    "@xmlns:xsi": "http://www.w3.org/2001/XMLSchema-instance",
    "@xsi:nil": "true"
  },
  "sort": {
    "dateSaisie": "2017-10-17T23:43:15.000+02:00",
    "sortEnSeance": "Rejeté"
  },
  "dateDepot": "2017-10-13T02:00:00.000+02:00",
  "dateDistribution": "2017-10-16T02:00:00.000+02:00",
  "article99": "0",
  "loiReference": {
    "codeLoi": {
      "@xmlns:xsi": "http://www.w3.org/2001/XMLSchema-instance",
      "@xsi:nil": "true"
    },
    "divisionCodeLoi": {
      "@xmlns:xsi": "http://www.w3.org/2001/XMLSchema-instance",
      "@xsi:nil": "true"
    }
  }
}