{
  "@xmlns": "http://schemas.assemblee-nationale.fr/referentiel",
  "uid": "AMANR5L15PO59051B0778P0D1N180",
  "identifiant": {
    "legislature": "15",
    "numero": "180",
    "numRect": "0",
    "saisine": {
      "refTexteLegislatif": "PRJLANR5L15B0778",
      "numeroPartiePLF": "0",
      "organeExamen": "PO59051",
      "mentionSecondeDeliberation": "0"
    }
  },
  "numeroLong": "CL180",
  "etapeTexte": "1ère lecture (1ère assemblée saisie)",
  "triAmendement": "dxn",
  "cardinaliteAmdtMultiples": "1",
  "amendementParent": {
    "@xmlns:xsi": "http://www.w3.org/2001/XMLSchema-instance",
    "@xsi:nil": "true"
  },
  "etat": "Discuté",
  "signataires": {
    "auteur": {
      "typeAuteur": "Depute",
      "acteurRef": "PA721530",
      "organeRef": {
        "@xmlns:xsi": "http://www.w3.org/2001/XMLSchema-instance",
        "@xsi:nil": "true"
      },
      "groupePolitiqueRef": "PO730970"
    },
    "cosignataires": {
      "acteurRef": [
        "PA721984",
        "PA719874",
        "PA719558",
        "PA720772",
        "PA721992",
        "PA721530",
        "PA720764",
        "PA720704",
        "PA720924",
        "PA720720"
      ]
    },
    "texteAffichable": "Mme&#160;Luquet,  Mme&#160;Elimas, M.&#160;Balanant, M.&#160;Bru, Mme&#160;Jacquier-Laforge, M.&#160;Latombe, Mme&#160;Vichnievsky, Mme&#160;Poueyto, Mme&#160;Gallerneau et Mme&#160;Lasserre-David"
  },
  "pointeurFragmentTexte": {
    "missionVisee": {
      "@xmlns:xsi": "http://www.w3.org/2001/XMLSchema-instance",
      "@xsi:nil": "true"
    },
    "division": {
      "titre": "Article 2",
      "articleDesignationCourte": "ART. 2",
      "type": "ARTICLE",
      "avant_A_Apres": "A",
      "divisionRattachee": "ARTICLE 2",
      "articleAdditionnel": {
        "@xmlns:xsi": "http://www.w3.org/2001/XMLSchema-instance",
        "@xsi:nil": "true"
      },
      "chapitreAdditionnel": {
        "@xmlns:xsi": "http://www.w3.org/2001/XMLSchema-instance",
        "@xsi:nil": "true"
      },
      "urlDivisionTexteVise": "/15/textes/0778.asp#D_Article_2"
    },
    "alinea": {
      "avant_A_Apres": "Apres",
      "numero": "2",
      "alineaDesignation": {
        "@xmlns:xsi": "http://www.w3.org/2001/XMLSchema-instance",
        "@xsi:nil": "true"
      }
    }
  },
  "corps": {
    "dispositif": "<p style=\"text-align: justify;\">Apr&#232;s l&#8217;alin&#233;a&#160;2, ins&#233;rer les deux alin&#233;as suivants&#160;:</p><p style=\"text-align: justify;\">&#171;&#160;I&#160;<i>bis</i>.&#160;&#8211;&#160;L&#8217;article&#160;222&#8209;28 du m&#234;me code est compl&#233;t&#233; par un&#160;10&#176; ainsi r&#233;dig&#233;&#160;:</p><p style=\"text-align: justify;\">&#171;&#160;&#171;&#160;10&#176;&#160;Lorsqu&#8217;elle est commise dans un v&#233;hicule affect&#233; au transport collectif de voyageurs ou dans un lieu destin&#233; &#224; l&#8217;acc&#232;s &#224; un moyen de transport collectif de voyageurs.&#160;&#187;&#160;&#187;</p>",
    "exposeSommaire": "<p>Si l&#8217;accent est souvent mis sur les violences commises dans l&#8217;espace priv&#233; domestique, il n&#8217;en reste pas moins que les atteintes sexuelles perp&#233;tr&#233;es dans la rue, les transports en commun ou es autres lieux publics sont &#233;galement importantes et graves, et n&#233;cessite une attention et une lutte toute aussi d&#233;termin&#233;e.</p><p>En 2015, un rapport du Haut Conseil &#224; l'Egalit&#233; entre les femmes et les hommes d&#233;clarait que 100% des utilisatrices des transports en commun ont &#233;t&#233; victimes au moins une fois dans leur vie de harc&#232;lement sexiste ou d'agression sexuelle. Pr&#232;s d'une personne sur deux se d&#233;clare ne pas toujours s'y sentir en s&#233;curit&#233;.</p><p>Ce sentiment d&#8217;ins&#233;curit&#233; dans les transports en commun est amplifi&#233; par la situation de promiscuit&#233; inh&#233;rente &#224; ce mode d&#233;placement, particuli&#232;rement en p&#233;riode de forte affluence, dont les agresseurs, notamment ceux que l&#8217;on appelle les frotteurs, profitent pour passer &#224; l&#8217;acte.</p><p>Or, l'article 222-28 du code p&#233;nal, &#233;non&#231;ant les circonstances aggravantes de l'agression sexuelle autre que le viol, ne d&#233;signe pas express&#233;ment les transports collectifs de voyageurs.</p><p>Face &#224; ces agressions quotidiennes qui se multiplient dans les transports en commun, il est imp&#233;ratif de renforcer les sanctions en faisant de l'agression sexuelle dans un v&#233;hicule affect&#233; au transport collectif de voyageurs ou dans un lieu destin&#233; &#224; l'acc&#232;s &#224; un moyen de transport collectif de voyageurs, une circonstance aggravante. Cela porterait la sanction &#224; sept ans d'emprisonnement et 100 000 euros d'amende.</p><p>C'est l'objet de cet amendement.</p>",
    "annexeExposeSommaire": {
      "@xmlns:xsi": "http://www.w3.org/2001/XMLSchema-instance",
      "@xsi:nil": "true"
    }
  },
  "representations": {
    "representation": {
      "nom": "PDF",
      "typeMime": {
        "type": "application",
        "subType": "PDF"
      },
      "statutRepresentation": {
        "verbatim": "true",
        "canonique": "true",
        "officielle": "true",
        "transcription": "false",
        "enregistrement": "false"
      },
      "repSource": {
        "@xmlns:xsi": "http://www.w3.org/2001/XMLSchema-instance",
        "@xsi:nil": "true"
      },
      "offset": {
        "@xmlns:xsi": "http://www.w3.org/2001/XMLSchema-instance",
        "@xsi:nil": "true"
      },
      "contenu": {
        "documentURI": "/15/amendements/0778/CION_LOIS/CL180.pdf"
      },
      "dateDispoRepresentation": {
        "@xmlns:xsi": "http://www.w3.org/2001/XMLSchema-instance",
        "@xsi:nil": "true"
      }
    }
  },
  "seanceDiscussion": {
    "@xmlns:xsi": "http://www.w3.org/2001/XMLSchema-instance",
    "@xsi:nil": "true"
  },
  "sort": {
    "dateSaisie": "2018-05-09T19:50:02.000+02:00",
    "sortEnSeance": "Adopté"
  },
  "dateDepot": "2018-05-04T02:00:00.000+02:00",
  "dateDistribution": "2018-05-07T02:00:00.000+02:00",
  "article99": "0",
  "loiReference": {
    "codeLoi": "2.65",
    "divisionCodeLoi": "222-28"
  }
}