{
  "@xmlns": "http://schemas.assemblee-nationale.fr/referentiel",
  "uid": "AMANR5L15PO59048B1255P1D1N882",
  "identifiant": {
    "legislature": "15",
    "numero": "882",
    "numRect": "0",
    "saisine": {
      "refTexteLegislatif": "PRJLANR5L15B1255",
      "numeroPartiePLF": "1",
      "organeExamen": "PO59048",
      "mentionSecondeDeliberation": "0"
    }
  },
  "numeroLong": "I-CF882",
  "etapeTexte": "1ère lecture (1ère assemblée saisie)",
  "triAmendement": "kaaaaaaaaaaaaaaaaaaaaaaaaaaaaaaaaaaaaaaaaaaaaaaaaawm",
  "cardinaliteAmdtMultiples": "1",
  "amendementParent": {
    "@xmlns:xsi": "http://www.w3.org/2001/XMLSchema-instance",
    "@xsi:nil": "true"
  },
  "etat": "Discuté",
  "signataires": {
    "auteur": {
      "typeAuteur": "Depute",
      "acteurRef": "PA721458",
      "organeRef": {
        "@xmlns:xsi": "http://www.w3.org/2001/XMLSchema-instance",
        "@xsi:nil": "true"
      },
      "groupePolitiqueRef": "PO730964"
    },
    "cosignataires": {
      "acteurRef": [
        "PA719194",
        "PA722292",
        "PA606639",
        "PA721458",
        "PA720402",
        "PA721434",
        "PA719700"
      ]
    },
    "texteAffichable": "M.&#160;Roseren,  Mme&#160;Yolaine&#160;de Courson, M.&#160;Hupp&#233;, Mme&#160;Lardet, M.&#160;Paluszkiewicz, M.&#160;Rudigoz et M.&#160;Vignal"
  },
  "pointeurFragmentTexte": {
    "missionVisee": {
      "@xmlns:xsi": "http://www.w3.org/2001/XMLSchema-instance",
      "@xsi:nil": "true"
    },
    "division": {
      "titre": "Article 29",
      "articleDesignationCourte": "ART. 29",
      "type": "ARTICLE",
      "avant_A_Apres": "A",
      "divisionRattachee": "ARTICLE 29",
      "articleAdditionnel": {
        "@xmlns:xsi": "http://www.w3.org/2001/XMLSchema-instance",
        "@xsi:nil": "true"
      },
      "chapitreAdditionnel": {
        "@xmlns:xsi": "http://www.w3.org/2001/XMLSchema-instance",
        "@xsi:nil": "true"
      },
      "urlDivisionTexteVise": "/15/textes/1255A.asp#D_Article_29"
    },
    "alinea": {
      "avant_A_Apres": {
        "@xmlns:xsi": "http://www.w3.org/2001/XMLSchema-instance",
        "@xsi:nil": "true"
      },
      "numero": "48",
      "alineaDesignation": {
        "@xmlns:xsi": "http://www.w3.org/2001/XMLSchema-instance",
        "@xsi:nil": "true"
      }
    }
  },
  "corps": {
    "dispositif": "<p style=\"text-align: justify;\">Supprimer l&#8217;alin&#233;a&#160;48.</p>",
    "exposeSommaire": "<p>L&#8217;article 29 du projet de loi de finances pour 2019 vise notamment &#224; diminuer les plafonds de la taxe affect&#233;e Comit&#233; professionnel de d&#233;veloppement de l'horlogerie, de la bijouterie, de la joaillerie, de l'orf&#232;vrerie et des arts de la table (Franc&#233;clat).</p><p>Il n&#8217;est pas remis en cause le fait que les CTI (Centres techniques industriels) et CPDE (Comit&#233;s Professionnels de D&#233;veloppement &#201;conomique) doivent participer &#224; la maitrise des pr&#233;l&#232;vements obligatoires. Cependant, la baisse envisag&#233;e &#224; hauteur de 10 millions d&#8217;euros risque de porter pr&#233;judice &#224; leur capacit&#233; d'initiative et de soutien au d&#233;veloppement industriel, sans impact significatif sur le budget de l'Etat ou sur le niveau des pr&#233;l&#232;vements obligatoires.</p><p>En outre, le rapport de Madame Clotilde&#160;Valter, remis en octobre&#160;2014, sur l&#8217;avenir des CTI et des CPDE, a r&#233;affirm&#233; le r&#244;le des centres en tant &#171;&#160;qu&#8217;outils de la politique industrielle, permettant notamment un acc&#232;s de proximit&#233; &#224; des comp&#233;tences et mat&#233;riels techniques sp&#233;cialis&#233;s indispensables &#224; l&#8217;am&#233;lioration de la production et &#224; la mise au point de nouveaux produits.&#160;&#187;&#160;La Cour des Comptes dans un rapport de synth&#232;se en date de 2017 portant sur l&#8217;activit&#233; des CTI de 2010 &#224; 2015 a &#233;galement soulign&#233; la qualit&#233; de leur gestion et la pertinence de leur mod&#232;le.</p><p>Enfin, une mission du CNI lanc&#233;e le 20 septembre par le Premier ministre, Edouard Philippe, concernant les &#171;&#160;centres d&#8217;acc&#233;l&#233;ration&#160;&#187; est en cours. Elle doit notamment &#233;valuer l&#8217;action des CTI-CPDE et proposer des &#233;volutions potentielles de leur mod&#232;le. Il semblerait plus judicieux, avant de p&#233;naliser les CTI-CPDE, d&#8217;attendre les r&#233;sultats de cette mission qui devraient &#234;tre pr&#233;sent&#233;s d&#232;s le mois de f&#233;vrier 2019.</p><p>&#160;</p><p>Il semble d&#232;s lors contreproductif d'abaisser les plafonds des CTI et CPDE en limitant les moyens leur permettant de remplir leur mission de service public au service de l'innovation et du d&#233;veloppement international des entreprises et plus particuli&#232;rement des PME et ETI. <br /> Cet amendement propose donc de supprimer la baisse des plafonds envisag&#233;e afin de les maintenir au niveau actuel pour cette ann&#233;e.</p>",
    "annexeExposeSommaire": {
      "@xmlns:xsi": "http://www.w3.org/2001/XMLSchema-instance",
      "@xsi:nil": "true"
    }
  },
  "representations": {
    "representation": {
      "nom": "PDF",
      "typeMime": {
        "type": "application",
        "subType": "PDF"
      },
      "statutRepresentation": {
        "verbatim": "true",
        "canonique": "true",
        "officielle": "true",
        "transcription": "false",
        "enregistrement": "false"
      },
      "repSource": {
        "@xmlns:xsi": "http://www.w3.org/2001/XMLSchema-instance",
        "@xsi:nil": "true"
      },
      "offset": {
        "@xmlns:xsi": "http://www.w3.org/2001/XMLSchema-instance",
        "@xsi:nil": "true"
      },
      "contenu": {
        "documentURI": "/15/amendements/1255A/CION_FIN/CF882.pdf"
      },
      "dateDispoRepresentation": {
        "@xmlns:xsi": "http://www.w3.org/2001/XMLSchema-instance",
        "@xsi:nil": "true"
      }
    }
  },
  "seanceDiscussion": {
    "@xmlns:xsi": "http://www.w3.org/2001/XMLSchema-instance",
    "@xsi:nil": "true"
  },
  "sort": {
    "dateSaisie": "2018-10-11T12:49:02.000+02:00",
    "sortEnSeance": "Retiré"
  },
  "dateDepot": "2018-10-05T02:00:00.000+02:00",
  "dateDistribution": "2018-10-09T02:00:00.000+02:00",
  "article99": "0",
  "loiReference": {
    "codeLoi": {
      "@xmlns:xsi": "http://www.w3.org/2001/XMLSchema-instance",
      "@xsi:nil": "true"
    },
    "divisionCodeLoi": {
      "@xmlns:xsi": "http://www.w3.org/2001/XMLSchema-instance",
      "@xsi:nil": "true"
    }
  }
}