{
  "@xmlns": "http://schemas.assemblee-nationale.fr/referentiel",
  "uid": "AMANR5L15SEA717460B0235P1D1N673",
  "identifiant": {
    "legislature": "15",
    "numero": "673",
    "numRect": "0",
    "saisine": {
      "refTexteLegislatif": "PRJLANR5L15B0235",
      "numeroPartiePLF": "1",
      "organeExamen": "PO717460",
      "mentionSecondeDeliberation": "0"
    }
  },
  "numeroLong": "I-673",
  "etapeTexte": "1ère lecture (1ère assemblée saisie)",
  "triAmendement": "hgdzzzs",
  "cardinaliteAmdtMultiples": "1",
  "amendementParent": {
    "@xmlns:xsi": "http://www.w3.org/2001/XMLSchema-instance",
    "@xsi:nil": "true"
  },
  "etat": "Discuté",
  "signataires": {
    "auteur": {
      "typeAuteur": "Depute",
      "acteurRef": "PA608292",
      "organeRef": {
        "@xmlns:xsi": "http://www.w3.org/2001/XMLSchema-instance",
        "@xsi:nil": "true"
      },
      "groupePolitiqueRef": "PO723569"
    },
    "cosignataires": {
      "acteurRef": [
        "PA336175",
        "PA608292"
      ]
    },
    "texteAffichable": "Mme&#160;Dubi&#233; et Mme&#160;Pinel"
  },
  "pointeurFragmentTexte": {
    "missionVisee": {
      "@xmlns:xsi": "http://www.w3.org/2001/XMLSchema-instance",
      "@xsi:nil": "true"
    },
    "division": {
      "titre": "Article 19",
      "articleDesignationCourte": "ART. 19",
      "type": "ARTICLE",
      "avant_A_Apres": "A",
      "divisionRattachee": "ARTICLE 19",
      "articleAdditionnel": {
        "@xmlns:xsi": "http://www.w3.org/2001/XMLSchema-instance",
        "@xsi:nil": "true"
      },
      "chapitreAdditionnel": {
        "@xmlns:xsi": "http://www.w3.org/2001/XMLSchema-instance",
        "@xsi:nil": "true"
      },
      "urlDivisionTexteVise": "/15/textes/0235A.asp#D_Article_19"
    },
    "alinea": {
      "avant_A_Apres": {
        "@xmlns:xsi": "http://www.w3.org/2001/XMLSchema-instance",
        "@xsi:nil": "true"
      },
      "numero": "16",
      "alineaDesignation": {
        "@xmlns:xsi": "http://www.w3.org/2001/XMLSchema-instance",
        "@xsi:nil": "true"
      }
    }
  },
  "corps": {
    "dispositif": "<p style=\"text-align: justify;\">Supprimer l&#8217;alin&#233;a&#160;16.</p><p style=\"text-align: justify;\">&#160;</p>",
    "exposeSommaire": "<p style=\"text-align: justify;\">Depuis 2012, les Chambres de commerce et d&#8217;industrie ont &#233;t&#233; mises &#224; contribution pour redresser les finances publiques.</p><p style=\"text-align: justify;\">Le PLF 2018 n&#8217;&#233;chappe malheureusement pas &#224; cette r&#232;gle et pr&#233;voit de diminuer de 150 millions d&#8217;euros le plafond d&#8217;affectation de la taxe additionnelle &#224; la cotisation sur la valeur ajout&#233;e des entreprises au r&#233;seau des CCI, soit une baisse de 40&#160;%.</p><p style=\"text-align: justify;\">Les CCI, et notamment les CCI territoriales, jouent un r&#244;le particuli&#232;rement important en mati&#232;re d&#8217;expertise et de soutien aux entreprises locales. &#201;tant souvent les seules &#224; proposer des formations sp&#233;cifiques en faveur du territoire, elles sont &#224; ce titre fortement sollicit&#233;es par les collectivit&#233;s locales et les services de l&#8217;&#201;tat. Compte tenu de ces &#233;l&#233;ments, il nous semble indispensable de laisser &#224; ces organismes les moyens de faire le travail qui leur a &#233;t&#233; confi&#233;.</p><p style=\"text-align: justify;\">Pour ce faire, l&#8217;amendement propose de ne pas diminuer une ann&#233;e encore les ressources propres des chambres de commerce et d&#8217;industrie.</p>",
    "annexeExposeSommaire": {
      "@xmlns:xsi": "http://www.w3.org/2001/XMLSchema-instance",
      "@xsi:nil": "true"
    }
  },
  "representations": {
    "representation": {
      "nom": "PDF",
      "typeMime": {
        "type": "application",
        "subType": "PDF"
      },
      "statutRepresentation": {
        "verbatim": "true",
        "canonique": "true",
        "officielle": "true",
        "transcription": "false",
        "enregistrement": "false"
      },
      "repSource": {
        "@xmlns:xsi": "http://www.w3.org/2001/XMLSchema-instance",
        "@xsi:nil": "true"
      },
      "offset": {
        "@xmlns:xsi": "http://www.w3.org/2001/XMLSchema-instance",
        "@xsi:nil": "true"
      },
      "contenu": {
        "documentURI": "/15/amendements/0235A/AN/673.pdf"
      },
      "dateDispoRepresentation": {
        "@xmlns:xsi": "http://www.w3.org/2001/XMLSchema-instance",
        "@xsi:nil": "true"
      }
    }
  },
  "seanceDiscussion": "RUANR5L15S2018IDS20770",
  "sort": {
    "dateSaisie": "2017-10-22T00:23:40.000+02:00",
    "sortEnSeance": "Non soutenu"
  },
  "dateDepot": "2017-10-13T02:00:00.000+02:00",
  "dateDistribution": "2017-10-17T02:00:00.000+02:00",
  "article99": "0",
  "loiReference": {
    "codeLoi": {
      "@xmlns:xsi": "http://www.w3.org/2001/XMLSchema-instance",
      "@xsi:nil": "true"
    },
    "divisionCodeLoi": {
      "@xmlns:xsi": "http://www.w3.org/2001/XMLSchema-instance",
      "@xsi:nil": "true"
    }
  }
}