{
  "@xmlns": "http://schemas.assemblee-nationale.fr/referentiel",
  "uid": "AMANR5L15PO420120B2296P0D1N747",
  "identifiant": {
    "legislature": "15",
    "numero": "747",
    "numRect": "0",
    "saisine": {
      "refTexteLegislatif": "PRJLANR5L15B2296",
      "numeroPartiePLF": "0",
      "organeExamen": "PO420120",
      "mentionSecondeDeliberation": "0"
    }
  },
  "numeroLong": "AS747",
  "etapeTexte": "1ère lecture (1ère assemblée saisie)",
  "triAmendement": "diaaaaaaaaaaaaaaaaaaaaaaaaaaaaaaaaaaaaaaaaaaaaaaaazp",
  "cardinaliteAmdtMultiples": "1",
  "amendementParent": {
    "@xmlns:xsi": "http://www.w3.org/2001/XMLSchema-instance",
    "@xsi:nil": "true"
  },
  "etat": "Discuté",
  "signataires": {
    "auteur": {
      "typeAuteur": "Depute",
      "acteurRef": "PA722268",
      "organeRef": {
        "@xmlns:xsi": "http://www.w3.org/2001/XMLSchema-instance",
        "@xsi:nil": "true"
      },
      "groupePolitiqueRef": "PO730964"
    },
    "cosignataires": {
      "acteurRef": [
        "PA719456",
        "PA722320",
        "PA722300",
        "PA643175",
        "PA718744",
        "PA609520",
        "PA718810",
        "PA721860",
        "PA719464",
        "PA720278",
        "PA722268",
        "PA720170"
      ]
    },
    "texteAffichable": "Mme&#160;Wonner,  M.&#160;Nadot, M.&#160;Orphelin, Mme&#160;Grandjean, M.&#160;Cesarini, Mme&#160;Bagarry, Mme&#160;Dupont, Mme&#160;Pompili, Mme&#160;Khedher, M.&#160;Lejeune, Mme&#160;M&#246;rch et Mme&#160;Robert"
  },
  "pointeurFragmentTexte": {
    "missionVisee": {
      "@xmlns:xsi": "http://www.w3.org/2001/XMLSchema-instance",
      "@xsi:nil": "true"
    },
    "division": {
      "titre": "Article 25",
      "articleDesignationCourte": "ART. 25",
      "type": "ARTICLE",
      "avant_A_Apres": "A",
      "divisionRattachee": "ARTICLE 25",
      "articleAdditionnel": {
        "@xmlns:xsi": "http://www.w3.org/2001/XMLSchema-instance",
        "@xsi:nil": "true"
      },
      "chapitreAdditionnel": {
        "@xmlns:xsi": "http://www.w3.org/2001/XMLSchema-instance",
        "@xsi:nil": "true"
      },
      "urlDivisionTexteVise": "/15/textes/2296.asp#D_Article_25"
    },
    "alinea": {
      "avant_A_Apres": "A",
      "numero": "57",
      "alineaDesignation": "Alinéa 57"
    }
  },
  "corps": {
    "dispositif": "<p style=\"text-align: justify;\">R&#233;diger ainsi le d&#233;but de l&#8217;alin&#233;a&#160;57&#160;: </p><p style=\"text-align: justify;\">&#171;&#160;1&#176;&#160;De mani&#232;re motiv&#233;e, pour la <i>(le reste sans changement)</i>&#160;&#187;.</p>",
    "exposeSommaire": "<p style=\"text-align: justify;\">La mission d&#8217;information sur l&#8217;organisation territoriale de la sant&#233; mentale (septembre 2019) a d&#233;montr&#233; la n&#233;cessit&#233; pour les pouvoirs publics de faire confiance aux acteurs qui &#339;uvrent au quotidien dans le champ de la sant&#233; mentale.</p><p style=\"text-align: justify;\">S&#8217;il semble essentiel que le pouvoir r&#232;glementaire pr&#233;cise les modalit&#233;s qui conduiront &#224; l&#8217;expression d&#8217;un avis des organisations consult&#233;es quant &#224; l&#8217;&#233;tablissement de la dotation r&#233;sultant de la dotation populationnelle, cet amendement vise &#224; ce que la transparence la plus totale soit garantie lorsque l&#8217;autorit&#233; administrative d&#233;terminera son montant.</p><p style=\"text-align: justify;\">Pour cette raison, cet amendement vise &#224; ce que l&#8217;acte &#233;tablissant le montant de cette dotation soit motiv&#233;, c&#8217;est-&#224;-dire expliqu&#233; et rendu public.</p>",
    "annexeExposeSommaire": {
      "@xmlns:xsi": "http://www.w3.org/2001/XMLSchema-instance",
      "@xsi:nil": "true"
    },
    "cartoucheDelaiDepotDepasse": {
      "@xmlns:xsi": "http://www.w3.org/2001/XMLSchema-instance",
      "@xsi:nil": "true"
    },
    "avantAppel": {
      "@xmlns:xsi": "http://www.w3.org/2001/XMLSchema-instance",
      "@xsi:nil": "true"
    }
  },
  "representations": {
    "representation": {
      "nom": "PDF",
      "typeMime": {
        "type": "application",
        "subType": "PDF"
      },
      "statutRepresentation": {
        "verbatim": "true",
        "canonique": "true",
        "officielle": "true",
        "transcription": "false",
        "enregistrement": "false"
      },
      "repSource": {
        "@xmlns:xsi": "http://www.w3.org/2001/XMLSchema-instance",
        "@xsi:nil": "true"
      },
      "offset": {
        "@xmlns:xsi": "http://www.w3.org/2001/XMLSchema-instance",
        "@xsi:nil": "true"
      },
      "contenu": {
        "documentURI": "/15/amendements/2296/CION-SOC/AS747.pdf"
      },
      "dateDispoRepresentation": {
        "@xmlns:xsi": "http://www.w3.org/2001/XMLSchema-instance",
        "@xsi:nil": "true"
      }
    }
  },
  "seanceDiscussion": {
    "@xmlns:xsi": "http://www.w3.org/2001/XMLSchema-instance",
    "@xsi:nil": "true"
  },
  "sort": {
    "dateSaisie": "2019-10-16T10:49:53.000+02:00",
    "sortEnSeance": "Retiré"
  },
  "dateDepot": "2019-10-11T02:00:00.000+02:00",
  "dateDistribution": "2019-10-15T02:00:00.000+02:00",
  "article99": "0",
  "loiReference": {
    "codeLoi": "1a1",
    "divisionCodeLoi": {
      "@xmlns:xsi": "http://www.w3.org/2001/XMLSchema-instance",
      "@xsi:nil": "true"
    }
  }
}