{
  "@xmlns": "http://schemas.assemblee-nationale.fr/referentiel",
  "uid": "AMANR5L15PO757134B1088P0D1N247",
  "identifiant": {
    "legislature": "15",
    "numero": "247",
    "numRect": "0",
    "saisine": {
      "refTexteLegislatif": "PRJLANR5L15B1088",
      "numeroPartiePLF": "0",
      "organeExamen": "PO757134",
      "mentionSecondeDeliberation": "0"
    }
  },
  "numeroLong": "247",
  "etapeTexte": "1ère lecture (1ère assemblée saisie)",
  "triAmendement": "dfaaaaaaaaaaaaaaaaaaaaaaaaaaaaaaaaaaaaaaaaaaaaaaaahy",
  "cardinaliteAmdtMultiples": "1",
  "amendementParent": {
    "@xmlns:xsi": "http://www.w3.org/2001/XMLSchema-instance",
    "@xsi:nil": "true"
  },
  "etat": "Discuté",
  "signataires": {
    "auteur": {
      "typeAuteur": "Depute",
      "acteurRef": "PA721270",
      "organeRef": {
        "@xmlns:xsi": "http://www.w3.org/2001/XMLSchema-instance",
        "@xsi:nil": "true"
      },
      "groupePolitiqueRef": "PO730940"
    },
    "cosignataires": {
      "acteurRef": [
        "PA610667",
        "PA689",
        "PA722110",
        "PA720546",
        "PA718720",
        "PA335612",
        "PA721270",
        "PA721118",
        "PA267306",
        "PA721896",
        "PA610654",
        "PA718926",
        "PA720692",
        "PA721012",
        "PA722202",
        "PA441"
      ]
    },
    "texteAffichable": "M.&#160;Peu,  M.&#160;Dharr&#233;ville, M.&#160;Jumel, Mme&#160;Bello, M.&#160;Brotherson, M.&#160;Bruneel, Mme&#160;Buffet, M.&#160;Chassaigne, M.&#160;Dufr&#232;gne, Mme&#160;Faucillon, Mme&#160;K&#233;clard-Mond&#233;sir, M.&#160;Lecoq, M.&#160;Nilor, M.&#160;Fabien&#160;Roussel, M.&#160;Serville et M.&#160;Wulfranc"
  },
  "pointeurFragmentTexte": {
    "missionVisee": {
      "@xmlns:xsi": "http://www.w3.org/2001/XMLSchema-instance",
      "@xsi:nil": "true"
    },
    "division": {
      "titre": "Article 30",
      "articleDesignationCourte": "ART. 30",
      "type": "ARTICLE",
      "avant_A_Apres": "A",
      "divisionRattachee": "ARTICLE 30",
      "articleAdditionnel": {
        "@xmlns:xsi": "http://www.w3.org/2001/XMLSchema-instance",
        "@xsi:nil": "true"
      },
      "chapitreAdditionnel": {
        "@xmlns:xsi": "http://www.w3.org/2001/XMLSchema-instance",
        "@xsi:nil": "true"
      },
      "urlDivisionTexteVise": "/15/textes/1088.asp#D_Article_30"
    },
    "alinea": {
      "avant_A_Apres": {
        "@xmlns:xsi": "http://www.w3.org/2001/XMLSchema-instance",
        "@xsi:nil": "true"
      },
      "numero": "12",
      "alineaDesignation": {
        "@xmlns:xsi": "http://www.w3.org/2001/XMLSchema-instance",
        "@xsi:nil": "true"
      }
    }
  },
  "corps": {
    "dispositif": "<p>A l&#8217;alin&#233;a&#160;12, substituer au mot&#160;: &#171;&#160;quatre&#160;&#187; le mot&#160;: &#171;&#160;deux&#160;&#187;.</p>",
    "exposeSommaire": "<p style=\"text-align: justify;\">Le gouvernement entend revenir sur la composition de la Commission de surveillance de la Caisse des d&#233;p&#244;ts et consignations (CDC) dans le respect du &#171;&#160;r&#244;le sp&#233;cifique confi&#233; par la loi au Parlement s&#8217;agissant de la surveillance de l&#8217;&#233;tablissement.&#160;</p><p style=\"text-align: justify;\">La Commission de surveillance de la CDC,&#160;dont la composition est pr&#233;cis&#233;e par l&#8217;article L.&#160;518&#8209;4 du code mon&#233;taire et financier que l&#8217;article&#160;30 du projet de loi vient modifier, a en effet &#233;t&#233; pens&#233;e pour incarner pr&#233;cis&#233;ment l&#8217;autorit&#233; du Parlement sur l&#8217;institution.&#160;</p><p style=\"text-align: justify;\">Or, les d&#233;put&#233;s communistes constatent que cette nouvelle composition vient au contraire affaiblir le contr&#244;le du Parlement, en portant &#224; 5 (contre 1 aujourd&#8217;hui) le nombre de repr&#233;sentants de l&#8217;ex&#233;cutif nomm&#233;s &#224; la discr&#233;tion du ministre en charge de l&#8217;&#233;conomie.&#160;</p><p style=\"text-align: justify;\">Cet amendement vise ainsi &#224; revenir&#160;sur&#160;ce point,&#160;en&#160;divisant par deux le nombre de personnalit&#233;s qualifi&#233;es nomm&#233;es par le ministre en charge de l&#8217;&#233;conomie, de mani&#232;re &#224; rationaliser la pr&#233;sence de l&#8217;ex&#233;cutif au sein de cette instance.</p>",
    "annexeExposeSommaire": {
      "@xmlns:xsi": "http://www.w3.org/2001/XMLSchema-instance",
      "@xsi:nil": "true"
    }
  },
  "representations": {
    "representation": {
      "nom": "PDF",
      "typeMime": {
        "type": "application",
        "subType": "PDF"
      },
      "statutRepresentation": {
        "verbatim": "true",
        "canonique": "true",
        "officielle": "true",
        "transcription": "false",
        "enregistrement": "false"
      },
      "repSource": {
        "@xmlns:xsi": "http://www.w3.org/2001/XMLSchema-instance",
        "@xsi:nil": "true"
      },
      "offset": {
        "@xmlns:xsi": "http://www.w3.org/2001/XMLSchema-instance",
        "@xsi:nil": "true"
      },
      "contenu": {
        "documentURI": "/15/amendements/1088/CSPACTE/247.pdf"
      },
      "dateDispoRepresentation": {
        "@xmlns:xsi": "http://www.w3.org/2001/XMLSchema-instance",
        "@xsi:nil": "true"
      }
    }
  },
  "seanceDiscussion": {
    "@xmlns:xsi": "http://www.w3.org/2001/XMLSchema-instance",
    "@xsi:nil": "true"
  },
  "sort": {
    "dateSaisie": "2018-09-13T12:02:11.000+02:00",
    "sortEnSeance": "Rejeté"
  },
  "dateDepot": "2018-08-02T02:00:00.000+02:00",
  "dateDistribution": "2018-09-11T02:00:00.000+02:00",
  "article99": "0",
  "loiReference": {
    "codeLoi": {
      "@xmlns:xsi": "http://www.w3.org/2001/XMLSchema-instance",
      "@xsi:nil": "true"
    },
    "divisionCodeLoi": {
      "@xmlns:xsi": "http://www.w3.org/2001/XMLSchema-instance",
      "@xsi:nil": "true"
    }
  }
}