{
  "@xmlns": "http://schemas.assemblee-nationale.fr/referentiel",
  "uid": "AMANR5L15PO59048B0235P1D1N149",
  "identifiant": {
    "legislature": "15",
    "numero": "149",
    "numRect": "0",
    "saisine": {
      "refTexteLegislatif": "PRJLANR5L15B0235",
      "numeroPartiePLF": "1",
      "organeExamen": "PO59048",
      "mentionSecondeDeliberation": "0"
    }
  },
  "numeroLong": "I-CF149",
  "etapeTexte": "1ère lecture (1ère assemblée saisie)",
  "triAmendement": "odzzzx",
  "cardinaliteAmdtMultiples": "1",
  "amendementParent": {
    "@xmlns:xsi": "http://www.w3.org/2001/XMLSchema-instance",
    "@xsi:nil": "true"
  },
  "etat": "Discuté",
  "signataires": {
    "auteur": {
      "typeAuteur": "Depute",
      "acteurRef": "PA609245",
      "organeRef": {
        "@xmlns:xsi": "http://www.w3.org/2001/XMLSchema-instance",
        "@xsi:nil": "true"
      },
      "groupePolitiqueRef": "PO730934"
    },
    "cosignataires": {
      "acteurRef": "PA609245"
    },
    "texteAffichable": "Mme&#160;Lacroute"
  },
  "pointeurFragmentTexte": {
    "missionVisee": {
      "@xmlns:xsi": "http://www.w3.org/2001/XMLSchema-instance",
      "@xsi:nil": "true"
    },
    "division": {
      "titre": "Article 19",
      "articleDesignationCourte": "ART. 19",
      "type": "ARTICLE",
      "avant_A_Apres": "A",
      "divisionRattachee": "ARTICLE 19",
      "articleAdditionnel": {
        "@xmlns:xsi": "http://www.w3.org/2001/XMLSchema-instance",
        "@xsi:nil": "true"
      },
      "chapitreAdditionnel": {
        "@xmlns:xsi": "http://www.w3.org/2001/XMLSchema-instance",
        "@xsi:nil": "true"
      },
      "urlDivisionTexteVise": "/15/textes/0235A.asp#D_Article_19"
    },
    "alinea": {
      "avant_A_Apres": {
        "@xmlns:xsi": "http://www.w3.org/2001/XMLSchema-instance",
        "@xsi:nil": "true"
      },
      "numero": "16",
      "alineaDesignation": {
        "@xmlns:xsi": "http://www.w3.org/2001/XMLSchema-instance",
        "@xsi:nil": "true"
      }
    }
  },
  "corps": {
    "dispositif": "<p style=\"text-align: justify;\">&#192; la fin de l&#8217;alin&#233;a&#160;16, substituer au montant&#160;: &#171;&#160;226 117&#160;&#187; le montant&#160;: &#171;&#160;346&#160;117&#160;&#187;.</p>",
    "exposeSommaire": "<p style=\"text-align: justify;\">Le r&#233;seau des chambres de commerce et d&#8217;industrie est l&#8217;un des outils les plus performants pour mener la transformation de l&#8217;&#233;conomie fran&#231;aise. Gr&#226;ce &#224; son maillage territorial de proximit&#233; qu&#8217;il a su conserver malgr&#233; une forte rationalisation de la carte consulaire ces 10 derni&#232;res ann&#233;es (r&#233;duction de 50 &#233;tablissements consulaires depuis 2005), le r&#233;seau est le garant d&#8217;une action publique efficace sur tous les territoires.<br />Aujourd&#8217;hui, le r&#233;seau des CCI est fortement engag&#233; dans les grands chantiers de l&#8217;&#201;tat&#160;: internationalisation et digitalisation des entreprises, simplification, d&#233;veloppement de l&#8217;apprentissage, revitalisation du commerce de centre-ville, transformation environnementale.</p><p style=\"text-align: justify;\">Toute son action s&#8217;inscrit dans une exigence de performance&#160;:<br />=&amp;gt; taux de p&#233;rennit&#233; &#224; 3 ans des entreprises accompagn&#233;es par les CCI proche de 80&#160;%,<br />=&amp;gt; taux d&#8217;insertion dans l&#8217;emploi des apprentis et des &#233;tudiants form&#233;s par les CCI sup&#233;rieur &#224; 70&#160;%,<br />=&amp;gt; taux de d&#233;veloppement des actions commerciales &#224; l&#8217;export pour les entreprises accompagn&#233;es par les CCI sup&#233;rieur &#224; 70&#160;%.</p><p style=\"text-align: justify;\">Or, en incoh&#233;rence avec ces &#233;l&#233;ments, le projet de loi de Finances pour 2018 pr&#233;voit une baisse de 150 millions d&#8217;euros des ressources fiscales affect&#233;es au r&#233;seau des CCI, soit une baisse de 17&#160;%. Apr&#232;s la baisse de 35&#160;% des ressources subie lors du pr&#233;c&#233;dent quinquennat, cette disposition conduirait &#224; casser la dynamique en faveur du d&#233;veloppement des entreprises et des territoires et &#224; d&#233;stabiliser profond&#233;ment un r&#233;seau en pleine mutation (digitalisation de ses services).</p><p style=\"text-align: justify;\">Une baisse aussi brutale (150 millions d&#8217;euros sur une seule ann&#233;e) aurait par ailleurs des effets directs sur l&#8217;emploi dans les CCI, sup&#233;rieurs &#224; la r&#233;duction envisag&#233;e en 2018 par le Gouvernement pour la fonction publique d&#8217;&#201;tat.<br />Concernant des missions aussi essentielles que l&#8217;appui aux entreprises, l&#8217;apprentissage et la formation, il para&#238;t indispensable de privil&#233;gier une logique de r&#233;sultats et donc de maintenir des ressources suffisantes aux acteurs les plus performants.</p><p style=\"text-align: justify;\">Par cons&#233;quent, cet amendement propose de lisser la baisse des ressources affect&#233;es aux CCI sur 5 ans, en commen&#231;ant par une diminution de 30 millions d&#8217;euros du plafond de taxe pour frais de chambres (TACVAE).</p>",
    "annexeExposeSommaire": {
      "@xmlns:xsi": "http://www.w3.org/2001/XMLSchema-instance",
      "@xsi:nil": "true"
    }
  },
  "representations": {
    "representation": {
      "nom": "PDF",
      "typeMime": {
        "type": "application",
        "subType": "PDF"
      },
      "statutRepresentation": {
        "verbatim": "true",
        "canonique": "true",
        "officielle": "true",
        "transcription": "false",
        "enregistrement": "false"
      },
      "repSource": {
        "@xmlns:xsi": "http://www.w3.org/2001/XMLSchema-instance",
        "@xsi:nil": "true"
      },
      "offset": {
        "@xmlns:xsi": "http://www.w3.org/2001/XMLSchema-instance",
        "@xsi:nil": "true"
      },
      "contenu": {
        "documentURI": "/15/amendements/0235A/CION_FIN/CF149.pdf"
      },
      "dateDispoRepresentation": {
        "@xmlns:xsi": "http://www.w3.org/2001/XMLSchema-instance",
        "@xsi:nil": "true"
      }
    }
  },
  "seanceDiscussion": {
    "@xmlns:xsi": "http://www.w3.org/2001/XMLSchema-instance",
    "@xsi:nil": "true"
  },
  "sort": {
    "dateSaisie": "2017-10-12T13:00:18.000+02:00",
    "sortEnSeance": "Non soutenu"
  },
  "dateDepot": "2017-10-06T02:00:00.000+02:00",
  "dateDistribution": "2017-10-11T02:00:00.000+02:00",
  "article99": "0",
  "loiReference": {
    "codeLoi": {
      "@xmlns:xsi": "http://www.w3.org/2001/XMLSchema-instance",
      "@xsi:nil": "true"
    },
    "divisionCodeLoi": {
      "@xmlns:xsi": "http://www.w3.org/2001/XMLSchema-instance",
      "@xsi:nil": "true"
    }
  }
}