{
  "@xmlns": "http://schemas.assemblee-nationale.fr/referentiel",
  "uid": "AMANR5L15PO757134B1088P0D1N952",
  "identifiant": {
    "legislature": "15",
    "numero": "952",
    "numRect": "0",
    "saisine": {
      "refTexteLegislatif": "PRJLANR5L15B1088",
      "numeroPartiePLF": "0",
      "organeExamen": "PO757134",
      "mentionSecondeDeliberation": "0"
    }
  },
  "numeroLong": "952",
  "etapeTexte": "1ère lecture (1ère assemblée saisie)",
  "triAmendement": "csaaaaaaaaaaaaaaaaaaaaaaaaaaaaaaaaaaaaaaaaaaaaaaaaaazykks",
  "cardinaliteAmdtMultiples": "1",
  "amendementParent": {
    "@xmlns:xsi": "http://www.w3.org/2001/XMLSchema-instance",
    "@xsi:nil": "true"
  },
  "etat": "Irrecevable",
  "signataires": {
    "auteur": {
      "typeAuteur": "Depute",
      "acteurRef": "PA1327",
      "organeRef": {
        "@xmlns:xsi": "http://www.w3.org/2001/XMLSchema-instance",
        "@xsi:nil": "true"
      },
      "groupePolitiqueRef": "PO730934"
    },
    "cosignataires": {
      "acteurRef": "PA1327"
    },
    "texteAffichable": "M.&#160;Forissier"
  },
  "pointeurFragmentTexte": {
    "missionVisee": {
      "@xmlns:xsi": "http://www.w3.org/2001/XMLSchema-instance",
      "@xsi:nil": "true"
    },
    "division": {
      "titre": "Article 27",
      "articleDesignationCourte": "ART. 27",
      "type": "ARTICLE",
      "avant_A_Apres": "A",
      "divisionRattachee": "ARTICLE 27",
      "articleAdditionnel": {
        "@xmlns:xsi": "http://www.w3.org/2001/XMLSchema-instance",
        "@xsi:nil": "true"
      },
      "chapitreAdditionnel": {
        "@xmlns:xsi": "http://www.w3.org/2001/XMLSchema-instance",
        "@xsi:nil": "true"
      },
      "urlDivisionTexteVise": "/15/textes/1088.asp#D_Article_27"
    },
    "alinea": {
      "avant_A_Apres": "Avant",
      "numero": "1",
      "alineaDesignation": "Avant l'alinéa 1"
    }
  },
  "corps": {
    "dispositif": "<p>I.&#160;&#8211;&#160;Avant l&#8217;alin&#233;a&#160;1, ins&#233;rer l&#8217;alin&#233;a suivant&#160;:</p><p>&#171;&#160;I.<i>&#160;&#8211;</i>&#160;Apr&#232;s le mot&#160;:&#160;&#171;&#160;de&#160;&#187;, la fin du quatri&#232;me alin&#233;a de l&#8217;article L.&#160;221&#8209;32&#8209;1 du code mon&#233;taire et financier est ainsi r&#233;dig&#233;e&#160;:&#160;&#171;&#160;500&#160;000&#160;euros. Ce plafond est r&#233;duit des sommes vers&#233;es sur un plan d&#8217;&#233;pargne en actions en application de l&#8217;article L.&#160;221&#8209;30.&#160;&#187;</p><p>II.&#160;&#8211;&#160;En cons&#233;quence, au d&#233;but de l&#8217;alin&#233;a&#160;1, ins&#233;rer la mention&#160;:&#160;&#171;&#160;II.&#160;&#8211;&#160;&#187;.</p>",
    "exposeSommaire": "<p style=\"text-align: justify;\">Le pr&#233;sent amendement vise &#224; d&#233;velopper le financement des entreprises via le PEA-PME.</p><p style=\"text-align: justify;\">Le PEA permet d'acqu&#233;rir un portefeuille d'actions d'entreprises europ&#233;ennes tout en b&#233;n&#233;ficiant d'une exon&#233;ration d'imp&#244;t sur le revenu au bout de huit ans. Le plafond des versements est actuellement de&#160;150 000&#160;euros.</p><p style=\"text-align: justify;\">Le PEA-PME a, quant &#224; lui, &#233;t&#233; mis en place en 2014 pour soutenir le financement en fonds propres des PME et des ETI et offrir &#224; tous les fran&#231;ais un outil d'investisseur, qui leur permette de s'impliquer dans la vie &#233;conomique et financi&#232;re des entreprises.&#160; Il fonctionne comme le PEA mais avec un plafond de versements de 75&#160;000 euros.</p><p style=\"text-align: justify;\">Les r&#233;sultats sont malheureusement d&#233;cevants, le PEA-PME n&#8217;ayant pas suscit&#233; l&#8217;engouement des &#233;pargnants. Alors que l&#8217;objectif affich&#233; &#233;tait de collecter un &#224; deux milliards d&#8217;euros d&#232;s la premi&#232;re ann&#233;e, c&#8217;est au deuxi&#232;me trimestre 2017 que les encours peinent &#224; d&#233;passer un milliard d&#8217;euros.</p><p style=\"text-align: justify;\">Plusieurs freins &#224; l&#8217;attrait du PEA-PME pourraient &#234;tre lev&#233;s pour d&#233;velopper cet outil de financement direct dans les entreprises.</p><p style=\"text-align: justify;\">Ainsi, le montant maximal des versements en num&#233;raire devrait &#234;tre significativement r&#233;&#233;valu&#233; pour rendre le PEA-PME plus attractif et r&#233;pondre mieux aux besoins de financement des entreprises. Le montant propos&#233; s&#8217;inscrit en coh&#233;rence avec le dispositif anglais, l&#8217;Enterprise Investment Scheme.</p>",
    "annexeExposeSommaire": {
      "@xmlns:xsi": "http://www.w3.org/2001/XMLSchema-instance",
      "@xsi:nil": "true"
    }
  },
  "representations": {
    "representation": {
      "nom": "PDF",
      "typeMime": {
        "type": "application",
        "subType": "PDF"
      },
      "statutRepresentation": {
        "verbatim": "true",
        "canonique": "true",
        "officielle": "true",
        "transcription": "false",
        "enregistrement": "false"
      },
      "repSource": {
        "@xmlns:xsi": "http://www.w3.org/2001/XMLSchema-instance",
        "@xsi:nil": "true"
      },
      "offset": {
        "@xmlns:xsi": "http://www.w3.org/2001/XMLSchema-instance",
        "@xsi:nil": "true"
      },
      "contenu": {
        "documentURI": "/15/amendements/1088/CSPACTE/952.pdf"
      },
      "dateDispoRepresentation": {
        "@xmlns:xsi": "http://www.w3.org/2001/XMLSchema-instance",
        "@xsi:nil": "true"
      }
    }
  },
  "seanceDiscussion": {
    "@xmlns:xsi": "http://www.w3.org/2001/XMLSchema-instance",
    "@xsi:nil": "true"
  },
  "sort": {
    "@xmlns:xsi": "http://www.w3.org/2001/XMLSchema-instance",
    "@xsi:nil": "true"
  },
  "dateDepot": "2018-08-31T02:00:00.000+02:00",
  "dateDistribution": {
    "@xmlns:xsi": "http://www.w3.org/2001/XMLSchema-instance",
    "@xsi:nil": "true"
  },
  "article99": "0",
  "loiReference": {
    "codeLoi": "monétaire et financier",
    "divisionCodeLoi": "L221-32-1"
  }
}