{
  "@xmlns": "http://schemas.assemblee-nationale.fr/referentiel",
  "uid": "AMANR5L15SEA717460B2272P2D1N1613",
  "identifiant": {
    "legislature": "15",
    "numero": "1613",
    "numRect": "0",
    "saisine": {
      "refTexteLegislatif": "PRJLANR5L15B2272",
      "numeroPartiePLF": "2",
      "organeExamen": "PO717460",
      "mentionSecondeDeliberation": "0"
    }
  },
  "numeroLong": "II-1613",
  "etapeTexte": "1ère lecture (1ère assemblée saisie)",
  "triAmendement": "bdlaaaaaaaaaaaaaaaaaaaaaaaaaaaaaaaaaaaaaaaaaaaaaaaahk",
  "cardinaliteAmdtMultiples": "1",
  "amendementParent": {
    "@xmlns:xsi": "http://www.w3.org/2001/XMLSchema-instance",
    "@xsi:nil": "true"
  },
  "etat": "Discuté",
  "signataires": {
    "auteur": {
      "typeAuteur": "Depute",
      "acteurRef": "PA720422",
      "organeRef": {
        "@xmlns:xsi": "http://www.w3.org/2001/XMLSchema-instance",
        "@xsi:nil": "true"
      },
      "groupePolitiqueRef": "PO730958"
    },
    "cosignataires": {
      "acteurRef": [
        "PA721202",
        "PA722142",
        "PA720422",
        "PA720286",
        "PA720430",
        "PA721210",
        "PA720846",
        "PA588884",
        "PA721062",
        "PA718868",
        "PA720892",
        "PA718860",
        "PA721226",
        "PA2150",
        "PA719578",
        "PA719676",
        "PA721960"
      ]
    },
    "texteAffichable": "M.&#160;Quatennens,  Mme&#160;Autain, M.&#160;Bernalicis, M.&#160;Coquerel, M.&#160;Corbi&#232;re, Mme&#160;Fiat, M.&#160;Lachaud, M.&#160;Larive, M.&#160;M&#233;lenchon, Mme&#160;Obono, Mme&#160;Panot, M.&#160;Prud&apos;homme, M.&#160;Ratenon, Mme&#160;Ressiguier, Mme&#160;Rubin, M.&#160;Ruffin et Mme&#160;Taurine"
  },
  "pointeurFragmentTexte": {
    "missionVisee": {
      "idMissionAN": "825",
      "libelleMission": "Santé",
      "codeMissionPLF": "B",
      "libelleMissionPLF": "Répartition, par mission et programme, des crédits du budget général"
    },
    "division": {
      "titre": "ÉTAT B",
      "articleDesignationCourte": "ART. 38",
      "type": "ANNEXE",
      "avant_A_Apres": "A",
      "divisionRattachee": "ARTICLE 38",
      "articleAdditionnel": {
        "@xmlns:xsi": "http://www.w3.org/2001/XMLSchema-instance",
        "@xsi:nil": "true"
      },
      "chapitreAdditionnel": {
        "@xmlns:xsi": "http://www.w3.org/2001/XMLSchema-instance",
        "@xsi:nil": "true"
      },
      "urlDivisionTexteVise": "/15/textes/2272C.asp#D_ETAT_B"
    },
    "alinea": {
      "@xmlns:xsi": "http://www.w3.org/2001/XMLSchema-instance",
      "@xsi:nil": "true"
    }
  },
  "corps": {
    "exposeSommaire": "<p>L&#8217;aide m&#233;dicale d&#8217;&#201;tat a fait l&#8217;objet d&#8217;une instrumentalisation importante de la part du Gouvernement et des m&#233;dias. Comme le souligne la rapportrice sp&#233;ciale dans son rapport &#171;&#160;la stabilisation de la d&#233;pense propos&#233;e cette ann&#233;e intervient dans un contexte de contestation du dispositif dans son co&#251;t et dans son principe m&#234;me&#160;&#187;. La discussion l&#8217;an dernier du projet de loi sur l&#8217;asile et l&#8217;immigration avait d&#233;j&#224; &#233;t&#233; l&#8217;occasion d&#8217;entendre &#224; ce sujet des amendements visant &#224; la suppression de la prestation et &#224; son remplacement par une aide restreinte aux seules urgences. Depuis plusieurs ann&#233;es, on ne compte plus les questions parlementaires, orales ou &#233;crites, les propositions de loi, tant &#224; l&#8217;Assembl&#233;e nationale qu&#8217;au s&#233;nat, d&#233;pos&#233;es dans le m&#234;me but, visant &#224; r&#233;duire le panier de soins ou &#224; instaurer un ticket mod&#233;rateur. Pour ne pas parler des multiples prises de position sans fondement qui ne contribuent qu&#8217;&#224; hyst&#233;riser dangereusement le d&#233;bat public.<br /> C&#8217;est dans ce contexte que le pr&#233;sident de la R&#233;publique, apr&#232;s avoir clairement indiqu&#233; en 2017 qu&#8217;il ne remettrait pas en cause l&#8217;AME, en a derni&#232;rement demand&#233; une &#233;valuation et &#233;voqu&#233; &#171;&#160;une refonte de cette prestation&#160;&#187;. Or, le panier des prestations ouvertes avec l&#8217;AME est extr&#234;mement restreint. Il conviendrait m&#234;me d&#8217;en red&#233;finir les contours &#224; la hausse.</p><p style=\"text-align: justify;\">Pour ces raisons, et en cons&#233;quence des r&#232;gles de recevabilit&#233; financi&#232;res, cet amendement transf&#232;re 10 000 000&#160;&#8364; de l&#8217;action 11 (pilotage de sant&#233; publique) du programme 204 vers l&#8217;action 02 (&#171;&#160;aide m&#233;dicale d&#8217;&#201;tat&#160;&#187;) du programme 183 intitul&#233; Protection maladie.</p>",
    "annexeExposeSommaire": {
      "@xmlns:xsi": "http://www.w3.org/2001/XMLSchema-instance",
      "@xsi:nil": "true"
    },
    "cartoucheDelaiDepotDepasse": {
      "@xmlns:xsi": "http://www.w3.org/2001/XMLSchema-instance",
      "@xsi:nil": "true"
    },
    "avantAppel": {
      "@xmlns:xsi": "http://www.w3.org/2001/XMLSchema-instance",
      "@xsi:nil": "true"
    },
    "dispositifAmdtCredit": {
      "listeProgrammes": {
        "programme": [
          {
            "libelle": "Prévention, sécurité sanitaire et offre de soins",
            "id": "102790",
            "AE": {
              "montantPositif": "0",
              "montantNegatif": "10000000"
            },
            "CP": {
              "montantPositif": "0",
              "montantNegatif": "10000000"
            },
            "action": "modification",
            "lignesCredits": null
          },
          {
            "libelle": "Protection maladie",
            "id": "102791",
            "AE": {
              "montantPositif": "10000000",
              "montantNegatif": "0"
            },
            "CP": {
              "montantPositif": "10000000",
              "montantNegatif": "0"
            },
            "action": "modification",
            "lignesCredits": null
          }
        ]
      },
      "totalAE": {
        "montantPositif": "10000000",
        "montantNegatif": "10000000",
        "solde": "0"
      },
      "totalCP": {
        "montantPositif": "10000000",
        "montantNegatif": "10000000",
        "solde": "0"
      }
    }
  },
  "representations": {
    "representation": {
      "nom": "PDF",
      "typeMime": {
        "type": "application",
        "subType": "PDF"
      },
      "statutRepresentation": {
        "verbatim": "true",
        "canonique": "true",
        "officielle": "true",
        "transcription": "false",
        "enregistrement": "false"
      },
      "repSource": {
        "@xmlns:xsi": "http://www.w3.org/2001/XMLSchema-instance",
        "@xsi:nil": "true"
      },
      "offset": {
        "@xmlns:xsi": "http://www.w3.org/2001/XMLSchema-instance",
        "@xsi:nil": "true"
      },
      "contenu": {
        "documentURI": "/15/amendements/2272C/AN/1613.pdf"
      },
      "dateDispoRepresentation": {
        "@xmlns:xsi": "http://www.w3.org/2001/XMLSchema-instance",
        "@xsi:nil": "true"
      }
    }
  },
  "seanceDiscussion": "RUANR5L15S2020IDS21907",
  "sort": {
    "dateSaisie": "2019-11-07T11:59:44.000+01:00",
    "sortEnSeance": "Rejeté"
  },
  "dateDepot": "2019-11-02T01:00:00.000+01:00",
  "dateDistribution": "2019-11-06T01:00:00.000+01:00",
  "article99": "0",
  "loiReference": {
    "codeLoi": {
      "@xmlns:xsi": "http://www.w3.org/2001/XMLSchema-instance",
      "@xsi:nil": "true"
    },
    "divisionCodeLoi": {
      "@xmlns:xsi": "http://www.w3.org/2001/XMLSchema-instance",
      "@xsi:nil": "true"
    }
  }
}