{
  "@xmlns": "http://schemas.assemblee-nationale.fr/referentiel",
  "uid": "AMANR5L15PO59048B0235P2D1N266",
  "identifiant": {
    "legislature": "15",
    "numero": "266",
    "numRect": "0",
    "saisine": {
      "refTexteLegislatif": "PRJLANR5L15B0235",
      "numeroPartiePLF": "2",
      "organeExamen": "PO59048",
      "mentionSecondeDeliberation": "0"
    }
  },
  "numeroLong": "II-CF266",
  "etapeTexte": "1ère lecture (1ère assemblée saisie)",
  "triAmendement": "aeo",
  "cardinaliteAmdtMultiples": "1",
  "amendementParent": {
    "@xmlns:xsi": "http://www.w3.org/2001/XMLSchema-instance",
    "@xsi:nil": "true"
  },
  "etat": "Discuté",
  "signataires": {
    "auteur": {
      "typeAuteur": "Depute",
      "acteurRef": "PA605518",
      "organeRef": {
        "@xmlns:xsi": "http://www.w3.org/2001/XMLSchema-instance",
        "@xsi:nil": "true"
      },
      "groupePolitiqueRef": "PO730964"
    },
    "cosignataires": {
      "acteurRef": "PA605518"
    },
    "texteAffichable": "M.&#160;Fran&#231;ois-Michel&#160;Lambert"
  },
  "pointeurFragmentTexte": {
    "missionVisee": {
      "@xmlns:xsi": "http://www.w3.org/2001/XMLSchema-instance",
      "@xsi:nil": "true"
    },
    "division": {
      "titre": "Article 47",
      "articleDesignationCourte": "APRÈS ART. 47",
      "type": "ARTICLE",
      "avant_A_Apres": "Après",
      "divisionRattachee": "APRÈS L'ARTICLE 47, insérer l'article suivant:",
      "articleAdditionnel": "1",
      "chapitreAdditionnel": {
        "@xmlns:xsi": "http://www.w3.org/2001/XMLSchema-instance",
        "@xsi:nil": "true"
      },
      "urlDivisionTexteVise": "/15/textes/0235C.asp#D_Article_47"
    },
    "alinea": {
      "@xmlns:xsi": "http://www.w3.org/2001/XMLSchema-instance",
      "@xsi:nil": "true"
    }
  },
  "corps": {
    "dispositif": "<p style=\"text-align: justify;\">I.- A l&#8217;article 995 du Code g&#233;n&#233;ral des imp&#244;ts, ajouter un 19&#176; ainsi r&#233;dig&#233;&#160;:</p><p style=\"text-align: justify;\">&#171;&#160;19&#176; Les contrats d'assurances sur les installations d'&#233;nergies marines renouvelables, au sens de l'article L. 111-6 du code des assurances.&#160;&#187;</p><p style=\"text-align: justify;\">II.- La perte de recettes pour les organismes de s&#233;curit&#233; sociale est compens&#233;e &#224; due concurrence par la hausse de la composante carbone int&#233;gr&#233;e aux tarifs des taxes int&#233;rieures sur la consommation des produits &#233;nerg&#233;tiques inscrites au tableau B du 1 de l&#8217;article 265 du code des douanes.&#160;</p>",
    "exposeSommaire": "<p>Le pr&#233;sent amendement vise &#224; mettre en coh&#233;rence la fiscalit&#233; relative aux conventions d&#8217;assurance avec l&#8217;&#233;volution introduite par la loi n&#176; 2016-816 du&#160;20 juin 2016&#160;pour l'&#233;conomie bleue.</p><p>Celle-ci, en son article 84, aligne les installations d'&#233;nergies marines renouvelables sur le r&#233;gime assurantiel des v&#233;hicules maritimes afin de prendre en compte leurs caract&#233;ristiques communes. En effet, comme l&#8217;indique le Rapport du d&#233;put&#233; Leroy sur la proposition de loi&#160;pour l&#8217;&#233;conomie bleue[1], &#171;&#160;le rapprochement avec le r&#233;gime applicable aux corps de v&#233;hicules maritimes a du sens du fait de l&#8217;environnement marin et tout particuli&#232;rement pour les engins flottants (&#233;oliennes et hydroliennes flottantes)&#160;&#187;.</p><p>&#160;________________</p><p>[1] Rapport n&#176;3178 du 28 octobre 2015 fait au nom de la commission du d&#233;veloppement durable et de l&#8217;am&#233;nagement du territoire&#160;sur la proposition de loi&#160;pour l&#8217;&#233;conomie bleue (n&#176;&#160;2964) par le d&#233;put&#233; Leroy</p><p>Il convient de clarifier le r&#233;gime fiscal applicable aux installations d'&#233;nergies marines renouvelables en coh&#233;rence avec la volont&#233; du l&#233;gislateur de rattacher le r&#233;gime des installations d'&#233;nergies marines renouvelables &#224; la branche des assurances maritimes.</p><p>En cons&#233;quence, cet amendement propose donc d&#8217;&#233;tendre l&#8217;exon&#233;ration de taxe sur les conventions d&#8217;assurance dont b&#233;n&#233;ficient les v&#233;hicules maritimes aux installations d&#8217;&#233;nergies marines renouvelables.</p><p>Une telle extension devrait &#233;galement contribuer &#224; favoriser une baisse des co&#251;ts de la fili&#232;re souhait&#233;e par le Gouvernement et donc l&#8217;atteinte des objectifs de d&#233;veloppement ambitieux issus de la programmation pluriannuelle de l&#8217;&#233;nergie.</p><p><br />[1] Rapport n&#176;3178 du 28 octobre 2015 fait au nom de la commission du d&#233;veloppement durable et de l&#8217;am&#233;nagement du territoire&#160;sur la proposition de loi&#160;pour l&#8217;&#233;conomie bleue (n&#176;&#160;2964) par le d&#233;put&#233; Leroy</p>",
    "annexeExposeSommaire": {
      "@xmlns:xsi": "http://www.w3.org/2001/XMLSchema-instance",
      "@xsi:nil": "true"
    }
  },
  "representations": {
    "representation": {
      "nom": "PDF",
      "typeMime": {
        "type": "application",
        "subType": "PDF"
      },
      "statutRepresentation": {
        "verbatim": "true",
        "canonique": "true",
        "officielle": "true",
        "transcription": "false",
        "enregistrement": "false"
      },
      "repSource": {
        "@xmlns:xsi": "http://www.w3.org/2001/XMLSchema-instance",
        "@xsi:nil": "true"
      },
      "offset": {
        "@xmlns:xsi": "http://www.w3.org/2001/XMLSchema-instance",
        "@xsi:nil": "true"
      },
      "contenu": {
        "documentURI": "/15/amendements/0235C/CION_TOUTE/CF266.pdf"
      },
      "dateDispoRepresentation": {
        "@xmlns:xsi": "http://www.w3.org/2001/XMLSchema-instance",
        "@xsi:nil": "true"
      }
    }
  },
  "seanceDiscussion": {
    "@xmlns:xsi": "http://www.w3.org/2001/XMLSchema-instance",
    "@xsi:nil": "true"
  },
  "sort": {
    "dateSaisie": "2017-11-09T19:29:44.000+01:00",
    "sortEnSeance": "Non soutenu"
  },
  "dateDepot": "2017-10-16T02:00:00.000+02:00",
  "dateDistribution": "2017-11-09T01:00:00.000+01:00",
  "article99": "0",
  "loiReference": {
    "codeLoi": "impôts",
    "divisionCodeLoi": "995"
  }
}