{
  "@xmlns": "http://schemas.assemblee-nationale.fr/referentiel",
  "uid": "AMANR5L15PO420120B2416P0D1N37",
  "identifiant": {
    "legislature": "15",
    "numero": "37",
    "numRect": "0",
    "saisine": {
      "refTexteLegislatif": "PRJLANR5L15B2416",
      "numeroPartiePLF": "0",
      "organeExamen": "PO420120",
      "mentionSecondeDeliberation": "0"
    }
  },
  "numeroLong": "AS37",
  "etapeTexte": "Nouvelle Lecture",
  "triAmendement": "oaiaaaaaaaaaaaaaaaaaaaaaaaaaaaaaaaaaaaaaaaaaaaaaaaao",
  "cardinaliteAmdtMultiples": "1",
  "amendementParent": {
    "@xmlns:xsi": "http://www.w3.org/2001/XMLSchema-instance",
    "@xsi:nil": "true"
  },
  "etat": "Discuté",
  "signataires": {
    "auteur": {
      "typeAuteur": "Depute",
      "acteurRef": "PA642764",
      "organeRef": {
        "@xmlns:xsi": "http://www.w3.org/2001/XMLSchema-instance",
        "@xsi:nil": "true"
      },
      "groupePolitiqueRef": "PO758835"
    },
    "cosignataires": {
      "acteurRef": [
        "PA608172",
        "PA342415",
        "PA335054",
        "PA610681",
        "PA608741",
        "PA609332",
        "PA1198",
        "PA1008",
        "PA643145",
        "PA605069",
        "PA340357",
        "PA720988",
        "PA337483",
        "PA267233",
        "PA429893",
        "PA719930",
        "PA1592",
        "PA608695",
        "PA335532",
        "PA340343",
        "PA608011",
        "PA332614",
        "PA607553",
        "PA508",
        "PA1809",
        "PA609590",
        "PA333285",
        "PA333818",
        "PA642764"
      ]
    },
    "texteAffichable": "M.&#160;Aviragnet,  Mme&#160;Bareigts, Mme&#160;Bi&#233;mouret, Mme&#160;Vainqueur-Christophe, M.&#160;Vallaud, Mme&#160;Rabault, Mme&#160;Battistel, M.&#160;Bouillon, M.&#160;Jean-Louis&#160;Bricout, M.&#160;Carvounas, M.&#160;Alain&#160;David, Mme&#160;Laurence&#160;Dumont, M.&#160;Faure, M.&#160;Garot, M.&#160;David&#160;Habib, M.&#160;Hutin, M.&#160;Juanico, Mme&#160;Karamanli, M.&#160;J&#233;r&#244;me&#160;Lambert, M.&#160;Letchimy, Mme&#160;Manin, Mme&#160;Pau-Langevin, Mme&#160;Pires Beaune, M.&#160;Potier, M.&#160;Pueyo, M.&#160;Saulignac, Mme&#160;Tolmont, Mme&#160;Untermaier et Mme&#160;Victory"
  },
  "pointeurFragmentTexte": {
    "missionVisee": {
      "@xmlns:xsi": "http://www.w3.org/2001/XMLSchema-instance",
      "@xsi:nil": "true"
    },
    "division": {
      "titre": "Article 52",
      "articleDesignationCourte": "ART. 52",
      "type": "ARTICLE",
      "avant_A_Apres": "A",
      "divisionRattachee": "ARTICLE 52",
      "articleAdditionnel": {
        "@xmlns:xsi": "http://www.w3.org/2001/XMLSchema-instance",
        "@xsi:nil": "true"
      },
      "chapitreAdditionnel": {
        "@xmlns:xsi": "http://www.w3.org/2001/XMLSchema-instance",
        "@xsi:nil": "true"
      },
      "urlDivisionTexteVise": "/15/textes/2416.asp#D_Article_52"
    },
    "alinea": {
      "avant_A_Apres": {
        "@xmlns:xsi": "http://www.w3.org/2001/XMLSchema-instance",
        "@xsi:nil": "true"
      },
      "numero": "1",
      "alineaDesignation": {
        "@xmlns:xsi": "http://www.w3.org/2001/XMLSchema-instance",
        "@xsi:nil": "true"
      }
    }
  },
  "corps": {
    "dispositif": "<p>Supprimer les alin&#233;as 1 &#224; 10.</p>",
    "exposeSommaire": "<p>Le groupe socialistes et apparent&#233;s s&#8217;oppose &#224; la sous-indexation des pensions de retraites et des prestations sociales.</p><p style=\"text-align: justify;\">Aussi nous d&#233;posons cet amendement de suppression des alin&#233;as1 &#224; 10 car le Gouvernement, avec cet article pr&#233;voit de faire une &#233;conomie de 800 millions d&#8217;euros. Soit 600 millions d&#8217;euros en moins pour les retrait&#233;s et 200 millions d&#8217;euros de moins pour les prestations familiales et allocations familiales.</p><p style=\"text-align: justify;\">Cette coupe budg&#233;taire est inadmissible alors que l&#8217;INSEE vient de publier un &#233;tude (https&#160;://www.insee.fr/fr/statistiques/4231288) d&#233;montrant que l&#8217;indice de Gini, qui mesure les in&#233;galit&#233;s, n&#8217;avait pas &#233;t&#233; aussi haut en France depuis les ann&#233;es 1970. Cette m&#234;me &#233;tude de l&#8217;INSEE d&#233;montre que le taux de pauvret&#233; passerait de 14,1&#160;% &#224; 14,7&#160;% de la population. Un taux que la France n&#8217;avait plus connu depuis des ann&#233;es. Cela repr&#233;senterait 400.000 personnes de plus en situation de pauvret&#233; mon&#233;taire en 2018 par rapport &#224; 2017.</p><p style=\"text-align: justify;\">Les premi&#232;res mesures socio-fiscales du quinquennat d&#8217;Emmanuel Macron ont aggrav&#233; la pauvret&#233; et les in&#233;galit&#233;s. Les coups de rabot appliqu&#233;s aux allocations familiales, aux aides au logement, aux retraites ont nuit grandement &#224; la lutte contre la pauvret&#233; et les in&#233;galit&#233;s. Avec 2 milliards mobilis&#233;s par an, la strat&#233;gie de lutte contre la pauvret&#233; n&#8217;est pas &#224; la hauteur des enjeux sociaux, c&#8217;est deux fois moins que les cadeaux fiscaux aux plus riches.</p><p style=\"text-align: justify;\">Cette mesure de sous-indexation des retraites et des prestations sociales contribue pleinement &#224; augmenter les in&#233;galit&#233;s et le taux de pauvret&#233;.</p><p style=\"text-align: justify;\">C&#8217;est la raison pour laquelle nous proposons sa suppression.</p>",
    "annexeExposeSommaire": {
      "@xmlns:xsi": "http://www.w3.org/2001/XMLSchema-instance",
      "@xsi:nil": "true"
    },
    "cartoucheDelaiDepotDepasse": {
      "@xmlns:xsi": "http://www.w3.org/2001/XMLSchema-instance",
      "@xsi:nil": "true"
    },
    "avantAppel": {
      "@xmlns:xsi": "http://www.w3.org/2001/XMLSchema-instance",
      "@xsi:nil": "true"
    }
  },
  "representations": {
    "representation": {
      "nom": "PDF",
      "typeMime": {
        "type": "application",
        "subType": "PDF"
      },
      "statutRepresentation": {
        "verbatim": "true",
        "canonique": "true",
        "officielle": "true",
        "transcription": "false",
        "enregistrement": "false"
      },
      "repSource": {
        "@xmlns:xsi": "http://www.w3.org/2001/XMLSchema-instance",
        "@xsi:nil": "true"
      },
      "offset": {
        "@xmlns:xsi": "http://www.w3.org/2001/XMLSchema-instance",
        "@xsi:nil": "true"
      },
      "contenu": {
        "documentURI": "/15/amendements/2416/CION-SOC/AS37.pdf"
      },
      "dateDispoRepresentation": {
        "@xmlns:xsi": "http://www.w3.org/2001/XMLSchema-instance",
        "@xsi:nil": "true"
      }
    }
  },
  "seanceDiscussion": {
    "@xmlns:xsi": "http://www.w3.org/2001/XMLSchema-instance",
    "@xsi:nil": "true"
  },
  "sort": {
    "dateSaisie": "2019-11-20T23:51:08.000+01:00",
    "sortEnSeance": "Rejeté"
  },
  "dateDepot": "2019-11-19T01:00:00.000+01:00",
  "dateDistribution": "2019-11-20T01:00:00.000+01:00",
  "article99": "0",
  "loiReference": {
    "codeLoi": "1",
    "divisionCodeLoi": {
      "@xmlns:xsi": "http://www.w3.org/2001/XMLSchema-instance",
      "@xsi:nil": "true"
    }
  }
}