{
  "@xmlns": "http://schemas.assemblee-nationale.fr/referentiel",
  "uid": "AMANR5L15PO59051B0778P0D1N244",
  "identifiant": {
    "legislature": "15",
    "numero": "244",
    "numRect": "0",
    "saisine": {
      "refTexteLegislatif": "PRJLANR5L15B0778",
      "numeroPartiePLF": "0",
      "organeExamen": "PO59051",
      "mentionSecondeDeliberation": "0"
    }
  },
  "numeroLong": "CL244",
  "etapeTexte": "1ère lecture (1ère assemblée saisie)",
  "triAmendement": "dxs",
  "cardinaliteAmdtMultiples": "1",
  "amendementParent": {
    "@xmlns:xsi": "http://www.w3.org/2001/XMLSchema-instance",
    "@xsi:nil": "true"
  },
  "etat": "Discuté",
  "signataires": {
    "auteur": {
      "typeAuteur": "Depute",
      "acteurRef": "PA720108",
      "organeRef": {
        "@xmlns:xsi": "http://www.w3.org/2001/XMLSchema-instance",
        "@xsi:nil": "true"
      },
      "groupePolitiqueRef": "PO730964"
    },
    "cosignataires": {
      "acteurRef": [
        "PA721876",
        "PA721384",
        "PA721246",
        "PA719822",
        "PA720414",
        "PA718876",
        "PA721194",
        "PA719528",
        "PA721844",
        "PA719496",
        "PA722312",
        "PA720576",
        "PA719830",
        "PA722118",
        "PA720108",
        "PA720854",
        "PA718768",
        "PA719108",
        "PA722244",
        "PA719858",
        "PA607155",
        "PA718810",
        "PA721946",
        "PA719170",
        "PA720046"
      ]
    },
    "texteAffichable": "Mme&#160;Oppelt,  Mme&#160;Fontenel-Personne, Mme&#160;Dufeu Schubert, M.&#160;Test&#233;, M.&#160;Besson-Moreau, Mme&#160;Bessot Ballot, M.&#160;Marilossian, M.&#160;Cabar&#233;, M.&#160;Bois, Mme&#160;Fr&#233;d&#233;rique&#160;Dumas, Mme&#160;Gaillot, M.&#160;G&#233;rard, Mme&#160;Mireille&#160;Robert, M.&#160;Perrot, Mme&#160;Sylla, Mme&#160;Piron, Mme&#160;Magne, M.&#160;D&#233;moulin, Mme&#160;Thillaye, M.&#160;Daniel, M.&#160;Portarrieu, M.&#160;Morenas, Mme&#160;Charvier, Mme&#160;Limon et Mme&#160;Valetta Ardisson"
  },
  "pointeurFragmentTexte": {
    "missionVisee": {
      "@xmlns:xsi": "http://www.w3.org/2001/XMLSchema-instance",
      "@xsi:nil": "true"
    },
    "division": {
      "titre": "Article 2",
      "articleDesignationCourte": "ART. 2",
      "type": "ARTICLE",
      "avant_A_Apres": "A",
      "divisionRattachee": "ARTICLE 2",
      "articleAdditionnel": {
        "@xmlns:xsi": "http://www.w3.org/2001/XMLSchema-instance",
        "@xsi:nil": "true"
      },
      "chapitreAdditionnel": {
        "@xmlns:xsi": "http://www.w3.org/2001/XMLSchema-instance",
        "@xsi:nil": "true"
      },
      "urlDivisionTexteVise": "/15/textes/0778.asp#D_Article_2"
    },
    "alinea": {
      "avant_A_Apres": "Apres",
      "numero": "2",
      "alineaDesignation": {
        "@xmlns:xsi": "http://www.w3.org/2001/XMLSchema-instance",
        "@xsi:nil": "true"
      }
    }
  },
  "corps": {
    "dispositif": "<p>Apr&#232;s l&#8217;alin&#233;a&#160;2, ins&#233;rer les deux alin&#233;as suivants&#160;:</p><p>&#171;&#160;I&#160;<i>ter</i>.&#160;&#8211;&#160;L&#8217;article&#160;222&#8209;29&#8209;1 du code p&#233;nal est compl&#233;t&#233; par un alin&#233;a ainsi r&#233;dig&#233;&#160;:</p><p>&#171;&#160;&#171;&#160;Les agressions sexuelles autres que le viol sont punies de dix ans d&#8217;emprisonnement et de&#160;150&#160;000&#160;&#8364; d&#8217;amende lorsqu&#8217;elles rev&#234;tent un caract&#232;re incestueux selon les conditions &#233;tablies par l&#8217;article&#160;222&#8209;31&#8209;1 du m&#234;me code.&#160;&#187;&#160;&#187;</p>",
    "exposeSommaire": "<p>L&#8217;actuel code p&#233;nale &#233;tablit une surqualification d&#8217;inceste qui s&#8217;associe au viol et autres agressions sexuelles sans pour autant modifier les peines. Le but du pr&#233;sent amendement est d&#8217;ins&#233;rer l&#8217;inceste dans le Code p&#233;nal en tant que circonstance aggravante des agressions sexuelles pr&#233;existantes, dont le viol. En effet aujourd&#8217;hui, la circonstance aggravante que constitue l&#8217;agression commise par &#171;&#160;un ascendant ou par toute autre personne ayant sur la victime une autorit&#233; de droit ou de fait&#160;&#187; n&#8217;est pas applicable pour de nombreuses violences intra-familiales (pour tous les membres de la famille n&#8217;&#233;tant pas ascendant ou n&#8217;ayant pas une autorit&#233; de droit ou de fait comme les fr&#232;res et s&#339;urs, oncles et tantes, neveux et ni&#232;ces, cousins et cousines&#8230;).</p><p>&#160;</p><p>Cet amendement vise donc &#224; renforcer les outils juridiques de la lutte contre les violences sexuelles infra-familiales. L&#8217;association du caract&#232;re incestueux en tant que circonstance aggravante de l&#8217;infraction caract&#233;ris&#233;e de viol ou d&#8217;agression sexuelle permet ainsi de pouvoir &#233;galement aggraver les peines pour certaines violences intra-familiales jusqu&#8217;alors exclues.</p>",
    "annexeExposeSommaire": {
      "@xmlns:xsi": "http://www.w3.org/2001/XMLSchema-instance",
      "@xsi:nil": "true"
    }
  },
  "representations": {
    "representation": {
      "nom": "PDF",
      "typeMime": {
        "type": "application",
        "subType": "PDF"
      },
      "statutRepresentation": {
        "verbatim": "true",
        "canonique": "true",
        "officielle": "true",
        "transcription": "false",
        "enregistrement": "false"
      },
      "repSource": {
        "@xmlns:xsi": "http://www.w3.org/2001/XMLSchema-instance",
        "@xsi:nil": "true"
      },
      "offset": {
        "@xmlns:xsi": "http://www.w3.org/2001/XMLSchema-instance",
        "@xsi:nil": "true"
      },
      "contenu": {
        "documentURI": "/15/amendements/0778/CION_LOIS/CL244.pdf"
      },
      "dateDispoRepresentation": {
        "@xmlns:xsi": "http://www.w3.org/2001/XMLSchema-instance",
        "@xsi:nil": "true"
      }
    }
  },
  "seanceDiscussion": {
    "@xmlns:xsi": "http://www.w3.org/2001/XMLSchema-instance",
    "@xsi:nil": "true"
  },
  "sort": {
    "dateSaisie": "2018-05-09T19:51:07.000+02:00",
    "sortEnSeance": "Non soutenu"
  },
  "dateDepot": "2018-05-07T02:00:00.000+02:00",
  "dateDistribution": "2018-05-07T02:00:00.000+02:00",
  "article99": "0",
  "loiReference": {
    "codeLoi": "2.7",
    "divisionCodeLoi": "222-29-1"
  }
}