{
  "@xmlns": "http://schemas.assemblee-nationale.fr/referentiel",
  "uid": "AMANR5L15SEA717460BTC0902P0D1N1980",
  "identifiant": {
    "legislature": "15",
    "numero": "1980",
    "numRect": "0",
    "saisine": {
      "refTexteLegislatif": "PRJLANR5L15BTC0902",
      "numeroPartiePLF": "0",
      "organeExamen": "PO717460",
      "mentionSecondeDeliberation": "0"
    }
  },
  "numeroLong": "1980",
  "etapeTexte": "1ère lecture (1ère assemblée saisie)",
  "triAmendement": "amlyzzzz",
  "cardinaliteAmdtMultiples": "1",
  "amendementParent": {
    "@xmlns:xsi": "http://www.w3.org/2001/XMLSchema-instance",
    "@xsi:nil": "true"
  },
  "etat": "Discuté",
  "signataires": {
    "auteur": {
      "typeAuteur": "Depute",
      "acteurRef": "PA332228",
      "organeRef": {
        "@xmlns:xsi": "http://www.w3.org/2001/XMLSchema-instance",
        "@xsi:nil": "true"
      },
      "groupePolitiqueRef": "PO744425"
    },
    "cosignataires": {
      "acteurRef": [
        "PA267330",
        "PA421348",
        "PA267780",
        "PA268019",
        "PA266788",
        "PA721110",
        "PA332228",
        "PA721486",
        "PA335758",
        "PA331567",
        "PA942",
        "PA333421",
        "PA267355",
        "PA267241",
        "PA642868",
        "PA720696"
      ]
    },
    "texteAffichable": "M.&#160;Benoit,  M.&#160;Christophe, M.&#160;Charles&#160;de Courson, Mme&#160;de La Raudi&#232;re, M.&#160;Demilly, Mme&#160;Descamps, Mme&#160;Firmin Le Bodo, M.&#160;Herth, M.&#160;Lagarde, M.&#160;Morel-&#192;-L&apos;Huissier, M.&#160;Naegelen, M.&#160;Pancher, M.&#160;Riester, Mme&#160;Sanquer, M.&#160;Villiers et M.&#160;Zumkeller"
  },
  "pointeurFragmentTexte": {
    "missionVisee": {
      "@xmlns:xsi": "http://www.w3.org/2001/XMLSchema-instance",
      "@xsi:nil": "true"
    },
    "division": {
      "titre": "Article 15",
      "articleDesignationCourte": "ART. 15",
      "type": "ARTICLE",
      "avant_A_Apres": "A",
      "divisionRattachee": "ARTICLE 15",
      "articleAdditionnel": {
        "@xmlns:xsi": "http://www.w3.org/2001/XMLSchema-instance",
        "@xsi:nil": "true"
      },
      "chapitreAdditionnel": {
        "@xmlns:xsi": "http://www.w3.org/2001/XMLSchema-instance",
        "@xsi:nil": "true"
      },
      "urlDivisionTexteVise": "/15/textes/0902.asp#D_Article_15"
    },
    "alinea": {
      "avant_A_Apres": "A",
      "numero": "3",
      "alineaDesignation": "Alinéa 3"
    }
  },
  "corps": {
    "dispositif": "<p>&#192; l'alin&#233;a 3, substituer aux mots&#160;:</p><p>&#171;&#160;capitalistique des structures&#160;&#187;</p><p>les mots&#160;:</p><p>&#171;&#160;de la facturation, par l&#8217;&#233;tablissement de factures distinctes&#160;&#187;.</p>",
    "exposeSommaire": "<p style=\"text-align: justify;\">La s&#233;paration dite de la vente et du conseil relativement aux produits phytopharmaceutiques ne doit pas aller jusqu&#8217;&#224; l&#8217;impasse d&#8217;une s&#233;paration capitalistique des structures, mais en premier lieu porter sur une s&#233;paration de la facturation, par l&#8217;&#233;tablissement de factures distinctes.</p><p style=\"text-align: justify;\">A l&#8217;heure o&#249; les plateformes de vente en ligne proposant des produits phytopharmaceutiques explosent,&#160;cet article cr&#233;erait un appel d&#8217;air &#224; ces ventes dans des circuits d&#233;tourn&#233;s, ce qui irait compl&#232;tement &#224; l&#8217;encontre de l&#8217;objectif vis&#233; par cet article&#160;: &#233;viter les conflits d&#8217;int&#233;r&#234;ts entre conseillers et vendeurs pour permettre au final une r&#233;duction de l&#8217;utilisation de ces produits.</p><p style=\"text-align: justify;\">De plus, la s&#233;paration capitalistique des activit&#233;s de vente et de conseil inciterait les structures &#224; cr&#233;er deux filiales diff&#233;rentes engendrant tr&#232;s probablement une augmentation des co&#251;ts pour les agriculteurs, qui se d&#233;tourneraient du conseil pour n&#8217;acheter que des produits phyto.</p><p style=\"text-align: justify;\">C&#8217;est pourquoi cet amendement propose une s&#233;paration de la facturation des activit&#233;s de conseil et de vente, tout en gardant une s&#233;paration des personnes r&#233;alisant ces activit&#233;s. Cette disposition permet &#224; la fois&#160;:</p><p style=\"text-align: justify;\">- d&#8217;&#233;viter les conflits d&#8217;int&#233;r&#234;ts car conseiller et vendeur ne seront pas les m&#234;mes personnes,</p><p style=\"text-align: justify;\">- faire en sorte que les agriculteurs ne se d&#233;tournent pas du conseil,</p><p style=\"text-align: justify;\">- d&#8217;assurer plus de transparence aupr&#232;s du producteur.</p>",
    "annexeExposeSommaire": {
      "@xmlns:xsi": "http://www.w3.org/2001/XMLSchema-instance",
      "@xsi:nil": "true"
    }
  },
  "representations": {
    "representation": {
      "nom": "PDF",
      "typeMime": {
        "type": "application",
        "subType": "PDF"
      },
      "statutRepresentation": {
        "verbatim": "true",
        "canonique": "true",
        "officielle": "true",
        "transcription": "false",
        "enregistrement": "false"
      },
      "repSource": {
        "@xmlns:xsi": "http://www.w3.org/2001/XMLSchema-instance",
        "@xsi:nil": "true"
      },
      "offset": {
        "@xmlns:xsi": "http://www.w3.org/2001/XMLSchema-instance",
        "@xsi:nil": "true"
      },
      "contenu": {
        "documentURI": "/15/amendements/0902/AN/1980.pdf"
      },
      "dateDispoRepresentation": {
        "@xmlns:xsi": "http://www.w3.org/2001/XMLSchema-instance",
        "@xsi:nil": "true"
      }
    }
  },
  "seanceDiscussion": "RUANR5L15S2018IDS21060",
  "sort": {
    "dateSaisie": "2018-05-29T22:12:09.000+02:00",
    "sortEnSeance": "Rejeté"
  },
  "dateDepot": "2018-05-17T02:00:00.000+02:00",
  "dateDistribution": "2018-05-23T02:00:00.000+02:00",
  "article99": "0",
  "loiReference": {
    "codeLoi": {
      "@xmlns:xsi": "http://www.w3.org/2001/XMLSchema-instance",
      "@xsi:nil": "true"
    },
    "divisionCodeLoi": {
      "@xmlns:xsi": "http://www.w3.org/2001/XMLSchema-instance",
      "@xsi:nil": "true"
    }
  }
}