{
  "@xmlns": "http://schemas.assemblee-nationale.fr/referentiel",
  "uid": "AMANR5L15PO59048B0235P2D1N272",
  "identifiant": {
    "legislature": "15",
    "numero": "272",
    "numRect": "0",
    "saisine": {
      "refTexteLegislatif": "PRJLANR5L15B0235",
      "numeroPartiePLF": "2",
      "organeExamen": "PO59048",
      "mentionSecondeDeliberation": "0"
    }
  },
  "numeroLong": "II-CF272",
  "etapeTexte": "1ère lecture (1ère assemblée saisie)",
  "triAmendement": "e",
  "cardinaliteAmdtMultiples": "1",
  "amendementParent": {
    "@xmlns:xsi": "http://www.w3.org/2001/XMLSchema-instance",
    "@xsi:nil": "true"
  },
  "etat": "Irrecevable",
  "signataires": {
    "auteur": {
      "typeAuteur": "Depute",
      "acteurRef": "PA605518",
      "organeRef": {
        "@xmlns:xsi": "http://www.w3.org/2001/XMLSchema-instance",
        "@xsi:nil": "true"
      },
      "groupePolitiqueRef": "PO730964"
    },
    "cosignataires": {
      "acteurRef": "PA605518"
    },
    "texteAffichable": "M.&#160;Fran&#231;ois-Michel&#160;Lambert"
  },
  "pointeurFragmentTexte": {
    "missionVisee": {
      "@xmlns:xsi": "http://www.w3.org/2001/XMLSchema-instance",
      "@xsi:nil": "true"
    },
    "division": {
      "titre": "SECONDE PARTIE : MOYENS DES POLITIQUES PUBLIQUES ET DISPOSITIONS SPÉCIALES",
      "articleDesignationCourte": "AVANT ART. 29",
      "type": "CHAPITRE",
      "avant_A_Apres": "A",
      "divisionRattachee": "AVANT  L'ARTICLE 29",
      "articleAdditionnel": {
        "@xmlns:xsi": "http://www.w3.org/2001/XMLSchema-instance",
        "@xsi:nil": "true"
      },
      "chapitreAdditionnel": {
        "@xmlns:xsi": "http://www.w3.org/2001/XMLSchema-instance",
        "@xsi:nil": "true"
      },
      "urlDivisionTexteVise": "/15/textes/0235C.asp#D_SECONDE_PARTIE__MOYENS_DES_POLITIQUES_"
    },
    "alinea": {
      "@xmlns:xsi": "http://www.w3.org/2001/XMLSchema-instance",
      "@xsi:nil": "true"
    }
  },
  "corps": {
    "dispositif": "<p style=\"text-align: justify;\">I.&#160;-&#160;Au 1&#176; du c du 1 de l&#8217;article&#160;200 <i>quater</i> du code g&#233;n&#233;ral des imp&#244;ts, avant les mots&#160;:</p><p style=\"text-align: justify;\">&#171;&#160;d&#8217;&#233;quipements&#160;&#187;,</p><p style=\"text-align: justify;\">sont ins&#233;r&#233;s les mots&#160;:</p><p style=\"text-align: justify;\">&#171;&#160;Et de la pose&#160;&#187;.</p><p style=\"text-align: justify;\">II.&#160;-&#160;Le I n&#8217;est applicable qu&#8217;aux sommes venant en d&#233;duction de l&#8217;imp&#244;t d&#251;.</p><p style=\"text-align: justify;\">III.&#160;-&#160;La perte de recettes pour l&#8217;&#201;tat est compens&#233;e &#224; due concurrence par la hausse de la composante carbone int&#233;gr&#233;e aux tarifs des taxes int&#233;rieures sur la consommation des produits &#233;nerg&#233;tiques inscrites au tableau B du 1 de l&#8217;article&#160;265 du code des douanes.</p>",
    "exposeSommaire": "<p style=\"text-align: justify;\">Depuis plusieurs ann&#233;es, les installations de chauffe-eaux solaires pour les maisons individuelles sont en berne, tr&#232;s largement en de&#231;&#224; des objectifs de la PPE Ces objectifs de d&#233;veloppement de la chaleur renouvelable d&#233;coulant de la loi de Transition &#233;nerg&#233;tique pour la croissance verte sont ambitieux. Cependant, force est de constater qu&#8217;au rythme actuel de d&#233;veloppement, ces derniers ne seront pas atteints, loin s&#8217;en faut. A &#233;ch&#233;ance 2018, les estimations montrent que seuls 10&#160;% de l&#8217;objectif de d&#233;ploiement de chaleur solaire seraient atteints.</p><p style=\"text-align: justify;\">Il est donc n&#233;cessaire de donner un coup d&#8217;acc&#233;l&#233;rateur &#224; ces productions renouvelables, et pour ce faire d&#8217;envoyer des signaux aux consommateurs. Le CITE est en cela un outil pr&#233;cieux d&#8217;orientation des comportements et des choix d&#8217;investissement.</p><p style=\"text-align: justify;\">La chaleur solaire est un vecteur performant de chaleur renouvelable pour le chauffage et l&#8217;eau chaude sanitaire. Elle b&#233;n&#233;ficie actuellement d&#8217;un soutien au travers du CITE pour l&#8217;&#233;quipement, dans la limite d&#8217;un plafond r&#232;glementaire. Ces technologies demandent une main d&#8217;&#339;uvre importante, locale, et donc g&#233;n&#232;rent des emplois non d&#233;localisables. Cependant, la part de main d&#8217;&#339;uvre repr&#233;sentant 25 &#224; 30&#160;% de la facture finale du consommateur, ne b&#233;n&#233;ficiant pas du cr&#233;dit d&#8217;imp&#244;t, ces solutions ont tendance &#224; &#234;tre d&#233;laiss&#233;es au profit de solutions demandant une technicit&#233; et une intensit&#233; en emploi moindre et ne permettant pas l&#8217;atteinte des objectifs de la PPE.</p><p style=\"text-align: justify;\">Il est donc propos&#233; ici de permettre que la pose de ces &#233;quipements puisse entrer dans le p&#233;rim&#232;tre du cr&#233;dit d&#8217;imp&#244;t, comme cela se fait pour l&#8217;isolation ou le forage de puits g&#233;othermique. Cette inclusion de la main d&#8217;&#339;uvre restera encadr&#233;e par le plafond r&#232;glementaire qui s&#8217;applique &#224; ces technologies.</p>",
    "annexeExposeSommaire": {
      "@xmlns:xsi": "http://www.w3.org/2001/XMLSchema-instance",
      "@xsi:nil": "true"
    }
  },
  "representations": {
    "representation": {
      "nom": "PDF",
      "typeMime": {
        "type": "application",
        "subType": "PDF"
      },
      "statutRepresentation": {
        "verbatim": "true",
        "canonique": "true",
        "officielle": "true",
        "transcription": "false",
        "enregistrement": "false"
      },
      "repSource": {
        "@xmlns:xsi": "http://www.w3.org/2001/XMLSchema-instance",
        "@xsi:nil": "true"
      },
      "offset": {
        "@xmlns:xsi": "http://www.w3.org/2001/XMLSchema-instance",
        "@xsi:nil": "true"
      },
      "contenu": {
        "documentURI": "/15/amendements/0235C/CION_TOUTE/CF272.pdf"
      },
      "dateDispoRepresentation": {
        "@xmlns:xsi": "http://www.w3.org/2001/XMLSchema-instance",
        "@xsi:nil": "true"
      }
    }
  },
  "seanceDiscussion": {
    "@xmlns:xsi": "http://www.w3.org/2001/XMLSchema-instance",
    "@xsi:nil": "true"
  },
  "sort": {
    "@xmlns:xsi": "http://www.w3.org/2001/XMLSchema-instance",
    "@xsi:nil": "true"
  },
  "dateDepot": "2017-10-16T02:00:00.000+02:00",
  "dateDistribution": {
    "@xmlns:xsi": "http://www.w3.org/2001/XMLSchema-instance",
    "@xsi:nil": "true"
  },
  "article99": "0",
  "loiReference": {
    "codeLoi": "impôts",
    "divisionCodeLoi": "200 quater"
  }
}