{
  "@xmlns": "http://schemas.assemblee-nationale.fr/referentiel",
  "uid": "AMANR5L15SEA717460BTC0971P0D1N76",
  "identifiant": {
    "legislature": "15",
    "numero": "76",
    "numRect": "0",
    "saisine": {
      "refTexteLegislatif": "PRJLANR5L15BTC0971",
      "numeroPartiePLF": "0",
      "organeExamen": "PO717460",
      "mentionSecondeDeliberation": "0"
    }
  },
  "numeroLong": "76",
  "etapeTexte": "1ère lecture (1ère assemblée saisie)",
  "triAmendement": "sc",
  "cardinaliteAmdtMultiples": "1",
  "amendementParent": {
    "@xmlns:xsi": "http://www.w3.org/2001/XMLSchema-instance",
    "@xsi:nil": "true"
  },
  "etat": "Discuté",
  "signataires": {
    "auteur": {
      "typeAuteur": "Depute",
      "acteurRef": "PA721384",
      "organeRef": {
        "@xmlns:xsi": "http://www.w3.org/2001/XMLSchema-instance",
        "@xsi:nil": "true"
      },
      "groupePolitiqueRef": "PO730964"
    },
    "cosignataires": {
      "acteurRef": [
        "PA721876",
        "PA719032",
        "PA722292",
        "PA721522",
        "PA720414",
        "PA719258",
        "PA719024",
        "PA719100",
        "PA720014",
        "PA719162",
        "PA721384",
        "PA720806",
        "PA720814",
        "PA719294",
        "PA720538"
      ]
    },
    "texteAffichable": "Mme&#160;Fontenel-Personne,  Mme&#160;Tiegna, M.&#160;Cazenove, M.&#160;Batut, M.&#160;Blanchet, Mme&#160;De Temmerman, M.&#160;Morenas, M.&#160;Bouyx, M.&#160;Perrot, M.&#160;Rudigoz, Mme&#160;Jacqueline&#160;Dubois, M.&#160;Ardouin, M.&#160;Delpon, Mme&#160;Gayte et Mme&#160;Clapot"
  },
  "pointeurFragmentTexte": {
    "missionVisee": {
      "@xmlns:xsi": "http://www.w3.org/2001/XMLSchema-instance",
      "@xsi:nil": "true"
    },
    "division": {
      "titre": "Article 51",
      "articleDesignationCourte": "ART. 51",
      "type": "ARTICLE",
      "avant_A_Apres": "A",
      "divisionRattachee": "ARTICLE 51",
      "articleAdditionnel": {
        "@xmlns:xsi": "http://www.w3.org/2001/XMLSchema-instance",
        "@xsi:nil": "true"
      },
      "chapitreAdditionnel": {
        "@xmlns:xsi": "http://www.w3.org/2001/XMLSchema-instance",
        "@xsi:nil": "true"
      },
      "urlDivisionTexteVise": "/15/textes/0971.asp#D_Article_51"
    },
    "alinea": {
      "avant_A_Apres": "A",
      "numero": "13",
      "alineaDesignation": "Alinéa 13"
    }
  },
  "corps": {
    "dispositif": "<p style=\"text-align: justify;\">&#192; l&#8217;alin&#233;a&#160;13, apr&#232;s le mot&#160;:</p><p style=\"text-align: justify;\">&#171;&#160;ann&#233;e&#160;&#187;,</p><p style=\"text-align: justify;\">ins&#233;rer le mot&#160;:</p><p style=\"text-align: justify;\">&#171;&#160;civile&#160;&#187;.</p>",
    "exposeSommaire": "<p style=\"text-align: justify;\">L&#8217;article&#160;51 pr&#233;voit que toute personne peut offrir &#224; la location un meubl&#233; de tourisme, d&#233;clar&#233; comme sa r&#233;sidence principale, &#224; une client&#232;le de passage qui n&#8217;y &#233;lit pas domicile dans la limite de 120 jours au cours d&#8217;une m&#234;me ann&#233;e.</p><p style=\"text-align: justify;\">Cet amendement vise &#224; pr&#233;ciser que ces 120 jours sont d&#233;compt&#233;s sur une ann&#233;e civile afin d&#8217;&#233;viter toute confusion.</p>",
    "annexeExposeSommaire": {
      "@xmlns:xsi": "http://www.w3.org/2001/XMLSchema-instance",
      "@xsi:nil": "true"
    }
  },
  "representations": {
    "representation": {
      "nom": "PDF",
      "typeMime": {
        "type": "application",
        "subType": "PDF"
      },
      "statutRepresentation": {
        "verbatim": "true",
        "canonique": "true",
        "officielle": "true",
        "transcription": "false",
        "enregistrement": "false"
      },
      "repSource": {
        "@xmlns:xsi": "http://www.w3.org/2001/XMLSchema-instance",
        "@xsi:nil": "true"
      },
      "offset": {
        "@xmlns:xsi": "http://www.w3.org/2001/XMLSchema-instance",
        "@xsi:nil": "true"
      },
      "contenu": {
        "documentURI": "/15/amendements/0971/AN/76.pdf"
      },
      "dateDispoRepresentation": {
        "@xmlns:xsi": "http://www.w3.org/2001/XMLSchema-instance",
        "@xsi:nil": "true"
      }
    }
  },
  "seanceDiscussion": "RUANR5L15S2018IDS21137",
  "sort": {
    "dateSaisie": "2018-06-08T11:56:35.000+02:00",
    "sortEnSeance": "Adopté"
  },
  "dateDepot": "2018-05-23T02:00:00.000+02:00",
  "dateDistribution": "2018-05-31T02:00:00.000+02:00",
  "article99": "0",
  "loiReference": {
    "codeLoi": {
      "@xmlns:xsi": "http://www.w3.org/2001/XMLSchema-instance",
      "@xsi:nil": "true"
    },
    "divisionCodeLoi": {
      "@xmlns:xsi": "http://www.w3.org/2001/XMLSchema-instance",
      "@xsi:nil": "true"
    }
  }
}