{
  "@xmlns": "http://schemas.assemblee-nationale.fr/referentiel",
  "uid": "AMANR5L15PO757134B1088P0D1N1035",
  "identifiant": {
    "legislature": "15",
    "numero": "1035",
    "numRect": "0",
    "saisine": {
      "refTexteLegislatif": "PRJLANR5L15B1088",
      "numeroPartiePLF": "0",
      "organeExamen": "PO757134",
      "mentionSecondeDeliberation": "0"
    }
  },
  "numeroLong": "1035",
  "etapeTexte": "1ère lecture (1ère assemblée saisie)",
  "triAmendement": "apaaaaaaaaaaaaaaaaaaaaaaaaaaaaaaaaaaaaaaaaaaaaaaaabfdaazbe",
  "cardinaliteAmdtMultiples": "1",
  "amendementParent": {
    "@xmlns:xsi": "http://www.w3.org/2001/XMLSchema-instance",
    "@xsi:nil": "true"
  },
  "etat": "Discuté",
  "signataires": {
    "auteur": {
      "typeAuteur": "Depute",
      "acteurRef": "PA266808",
      "organeRef": {
        "@xmlns:xsi": "http://www.w3.org/2001/XMLSchema-instance",
        "@xsi:nil": "true"
      },
      "groupePolitiqueRef": "PO730934"
    },
    "cosignataires": {
      "acteurRef": [
        "PA767",
        "PA266808",
        "PA856",
        "PA267735",
        "PA2155",
        "PA721474",
        "PA334843",
        "PA719272",
        "PA266793",
        "PA718780",
        "PA722390",
        "PA718784",
        "PA720644"
      ]
    },
    "texteAffichable": "M.&#160;Rolland,  M.&#160;Nury, M.&#160;Cattin, Mme&#160;Meunier, M.&#160;Bony, M.&#160;de Ganay, M.&#160;Verch&#232;re, M.&#160;Viry, M.&#160;Cherpion, M.&#160;Menuel, M.&#160;Pauget, Mme&#160;Trastour-Isnart et Mme&#160;Corneloup"
  },
  "pointeurFragmentTexte": {
    "missionVisee": {
      "@xmlns:xsi": "http://www.w3.org/2001/XMLSchema-instance",
      "@xsi:nil": "true"
    },
    "division": {
      "titre": "Article 9",
      "articleDesignationCourte": "ART. 9",
      "type": "ARTICLE",
      "avant_A_Apres": "A",
      "divisionRattachee": "ARTICLE 9",
      "articleAdditionnel": {
        "@xmlns:xsi": "http://www.w3.org/2001/XMLSchema-instance",
        "@xsi:nil": "true"
      },
      "chapitreAdditionnel": {
        "@xmlns:xsi": "http://www.w3.org/2001/XMLSchema-instance",
        "@xsi:nil": "true"
      },
      "urlDivisionTexteVise": "/15/textes/1088.asp#D_Article_9"
    },
    "alinea": {
      "avant_A_Apres": "Apres",
      "numero": "30",
      "alineaDesignation": {
        "@xmlns:xsi": "http://www.w3.org/2001/XMLSchema-instance",
        "@xsi:nil": "true"
      }
    }
  },
  "corps": {
    "dispositif": "<p style=\"text-align: justify;\">I.&#160;&#8211;&#160;Apr&#232;s l&#8217;alin&#233;a&#160;30, ins&#233;rer les neuf alin&#233;as suivants&#160;:</p><p style=\"text-align: justify;\">&#171;&#160;17&#176; <i>bis</i> Apr&#232;s le chapitre III du titre II du livre VIII du pr&#233;sent code, est ins&#233;r&#233; un chapitre III <i>bis</i> ainsi r&#233;dig&#233;&#160;:</p><p style=\"text-align: justify;\">&#171;&#160;Chapitre III <i>bis&#160;:</i> De l&#8217;exercice de l&#8217;audit l&#233;gal Petite Entreprise</p><p style=\"text-align: justify;\">&#171;&#160;<i>Art. L.&#160;823&#8209;23</i>.&#160;&#8211; La mission d&#8217;audit l&#233;gal Petite Entreprise consiste pour le professionnel &#224; &#233;mettre une opinion sur la r&#233;gularit&#233; et la sinc&#233;rit&#233; des comptes annuels. Les diligences mises en &#339;uvre par le professionnel permettent l&#8217;&#233;tablissement d&#8217;un rapport d&#8217;opinion.</p><p style=\"text-align: justify;\">&#171;&#160;&#192; la demande de l&#8217;entit&#233;, le professionnel peut effectuer des analyses sp&#233;cifiques portant sur la performance, la gouvernance et la p&#233;rennit&#233; de l&#8217;entreprise. Les diligences mises en &#339;uvre par le professionnel permettent l&#8217;&#233;tablissement d&#8217;un rapport sur les points de vigilance en mati&#232;re de risques remis aux organes de direction et de gouvernance de l&#8217;entit&#233;.</p><p style=\"text-align: justify;\">&#171;&#160;Le professionnel peut &#234;tre amen&#233; &#224; d&#233;livrer des garanties sp&#233;cifiques sous forme d&#8217;attestations requ&#233;rant ou non des diligences particuli&#232;res.</p><p style=\"text-align: justify;\">&#171;&#160;<i>Article L.&#160;823&#8209;24</i>. &#8211; La mission d&#8217;audit l&#233;gal Petite Entreprise est exerc&#233;e, dans les conditions d&#233;finies par une norme d&#8217;exercice professionnel homologu&#233;e par arr&#234;t&#233; du garde des sceaux, ministre de la justice, par un commissaire aux comptes, nomm&#233; par l&#8217;assembl&#233;e g&#233;n&#233;rale ordinaire des associ&#233;s ou actionnaires, pour une dur&#233;e de 3 exercices &#224; compter de l&#8217;exercice de nomination. Les dispositions des articles L.&#160;822&#8209;11&#8209;1 et suivants du pr&#233;sent code sont applicables &#224; l&#8217;exercice de cette mission.</p><p style=\"text-align: justify;\">&#171;&#160;<i>Article L.&#160;823&#8209;25</i>. &#8211; Les soci&#233;t&#233;s commerciales qui sont des Petites Entreprises au sens de l&#8217;article L.&#160;123&#8209;16 et qui n&#8217;ont pas l&#8217;obligation de faire certifier leurs comptes peuvent confier une mission de contr&#244;le l&#233;gal ou d&#8217;audit l&#233;gal Petite Entreprise &#224; un commissaire aux comptes.</p><p style=\"text-align: justify;\">&#171;&#160;Dans ces soci&#233;t&#233;s, la d&#233;signation d&#8217;un commissaire aux comptes, aux fins de l&#8217;exercice d&#8217;une mission d&#8217;audit l&#233;gal Petite Entreprise peut &#234;tre demand&#233;e par un ou plusieurs associ&#233;s ou actionnaires repr&#233;sentant au moins le dixi&#232;me du capital ou des droits de vote. A d&#233;faut, elle peut &#234;tre demand&#233;e en justice par un ou plusieurs associ&#233;s ou actionnaires repr&#233;sentant au moins le dixi&#232;me du capital ou des droits de vote.&#160;&#187;</p><p style=\"text-align: justify;\">&#171;&#160;17&#176; <i>ter</i> Au second alin&#233;a de l&#8217;Article L.&#160;823&#8209;10, avant les mots&#160;: &#171;&#160;Ils v&#233;rifient&#160;&#187;, sont ins&#233;r&#233;s les mots&#160;: &#171;&#160;Dans les entit&#233;s soumises au contr&#244;le l&#233;gal au sens du chapitre III du titre II du livre VIII du pr&#233;sent code&#160;&#187;.&#160;&#187;</p>",
    "exposeSommaire": "<p style=\"text-align: justify;\">Le pr&#233;sent amendement vise &#224; cr&#233;er une nouvelle mission d&#8217;audit Petite Entreprise, audit adapt&#233; (all&#233;g&#233;) &#224; la taille de notre tissu &#233;conomique nationale, qui permet de r&#233;pondre &#224; la volont&#233; gouvernementale de simplifier la vie des entreprises et de r&#233;duire le co&#251;t de nos missions tout en gardant le m&#234;me niveau de certification qu&#8217;actuellement.</p><p style=\"text-align: justify;\">L&#8217;audit adapt&#233; Petite entreprise repose sur une analyse des risques, une prise de connaissance du syst&#232;me de contr&#244;le interne, une revue analytique des &#233;tats financiers et des travaux de contr&#244;le des comptes cibl&#233;s sur les principales zones de risque . Il porte sur une dur&#233;e de 3 exercices, renouvelable, contre 6 exercices pour le contr&#244;le l&#233;gal.</p><p style=\"text-align: justify;\">&#160;Les diligences supprim&#233;es, sauf demandes sp&#233;cifiques de l&#8217;entit&#233; ou des associ&#233;s, sont notamment&#160;:</p><p style=\"text-align: justify;\">- Dans la norme d&#8217;exercice professionnel&#160;: Circularisations et autres diligences superf&#233;tatoires</p><p style=\"text-align: justify;\">- Dans le Code de commerce&#160;: V&#233;rifications sp&#233;cifiques sauf respect de l&#8217;&#233;galit&#233; des associ&#233;s et Conventions r&#233;glement&#233;es</p><p style=\"text-align: justify;\">&#160;Le pr&#233;sent amendement propose les modifications n&#233;cessaires &#224; la partie l&#233;gislative du Code de Commerce. Une norme d&#8217;exercice professionnelle devra &#234;tre d&#233;finie pour l&#8217;Audit l&#233;gal Petite entreprise.</p><p style=\"text-align: justify;\">&#160;Les diligences adapt&#233;es ou simplifi&#233;es dans la nouvelle norme portent notamment sur&#160;:</p><p style=\"text-align: justify;\">- Lettre de mission et plan de mission</p><p style=\"text-align: justify;\">- Evaluation du contr&#244;le interne</p><p style=\"text-align: justify;\">- Participation aux inventaires physiques</p><p style=\"text-align: justify;\">&#160;L&#8217;ensemble des diligences ainsi men&#233;es permet l&#8217;expression d&#8217;une assurance positive.</p><p style=\"text-align: justify;\">&#160;Ces diligences peuvent &#234;tre compl&#233;t&#233;es de mani&#232;re optionnelle d&#8217;un diagnostic contractuel de croissance permettant d&#8217;auditer les processus de croissance de l&#8217;entreprise&#160;:</p><p style=\"text-align: justify;\">- Crit&#232;res relatifs &#224; la performance sectorielle de l&#8217;entit&#233;</p><p style=\"text-align: justify;\">- Engagements RSE</p><p style=\"text-align: justify;\">- Enjeux de gouvernance et de valorisation de l&#8217;entreprise</p>",
    "annexeExposeSommaire": {
      "@xmlns:xsi": "http://www.w3.org/2001/XMLSchema-instance",
      "@xsi:nil": "true"
    }
  },
  "representations": {
    "representation": {
      "nom": "PDF",
      "typeMime": {
        "type": "application",
        "subType": "PDF"
      },
      "statutRepresentation": {
        "verbatim": "true",
        "canonique": "true",
        "officielle": "true",
        "transcription": "false",
        "enregistrement": "false"
      },
      "repSource": {
        "@xmlns:xsi": "http://www.w3.org/2001/XMLSchema-instance",
        "@xsi:nil": "true"
      },
      "offset": {
        "@xmlns:xsi": "http://www.w3.org/2001/XMLSchema-instance",
        "@xsi:nil": "true"
      },
      "contenu": {
        "documentURI": "/15/amendements/1088/CSPACTE/1035.pdf"
      },
      "dateDispoRepresentation": {
        "@xmlns:xsi": "http://www.w3.org/2001/XMLSchema-instance",
        "@xsi:nil": "true"
      }
    }
  },
  "seanceDiscussion": {
    "@xmlns:xsi": "http://www.w3.org/2001/XMLSchema-instance",
    "@xsi:nil": "true"
  },
  "sort": {
    "dateSaisie": "2018-09-07T12:57:43.000+02:00",
    "sortEnSeance": "Non soutenu"
  },
  "dateDepot": "2018-09-02T02:00:00.000+02:00",
  "dateDistribution": "2018-09-06T02:00:00.000+02:00",
  "article99": "0",
  "loiReference": {
    "codeLoi": {
      "@xmlns:xsi": "http://www.w3.org/2001/XMLSchema-instance",
      "@xsi:nil": "true"
    },
    "divisionCodeLoi": "L823-23"
  }
}