{
  "@xmlns": "http://schemas.assemblee-nationale.fr/referentiel",
  "uid": "AMANR5L15SEA717460BTC1237P0D1N2385",
  "identifiant": {
    "legislature": "15",
    "numero": "2385",
    "numRect": "0",
    "saisine": {
      "refTexteLegislatif": "PRJLANR5L15BTC1237",
      "numeroPartiePLF": "0",
      "organeExamen": "PO717460",
      "mentionSecondeDeliberation": "1"
    }
  },
  "numeroLong": "2385",
  "etapeTexte": "1ère lecture (1ère assemblée saisie)",
  "triAmendement": "oeiaaaaaaaaaaaaaaaaaaaaaaaaaaaaaaaaaaaaaaaaaaaaaaazzs",
  "cardinaliteAmdtMultiples": "1",
  "amendementParent": {
    "@xmlns:xsi": "http://www.w3.org/2001/XMLSchema-instance",
    "@xsi:nil": "true"
  },
  "etat": "Discuté",
  "signataires": {
    "auteur": {
      "typeAuteur": "Depute",
      "acteurRef": "PA605963",
      "organeRef": {
        "@xmlns:xsi": "http://www.w3.org/2001/XMLSchema-instance",
        "@xsi:nil": "true"
      },
      "groupePolitiqueRef": "PO730964"
    },
    "cosignataires": {
      "acteurRef": [
        "PA721792",
        "PA605963",
        "PA609520",
        "PA720552",
        "PA607619",
        "PA720146",
        "PA720242"
      ]
    },
    "texteAffichable": "M.&#160;Alauzet,  Mme&#160;Pompili, M.&#160;Molac, Mme&#160;Abba, Mme&#160;Guerel, M.&#160;Mass&#233;glia et Mme&#160;Rauch"
  },
  "pointeurFragmentTexte": {
    "missionVisee": {
      "@xmlns:xsi": "http://www.w3.org/2001/XMLSchema-instance",
      "@xsi:nil": "true"
    },
    "division": {
      "titre": "Article 62",
      "articleDesignationCourte": "APRÈS ART. 62",
      "type": "ARTICLE",
      "avant_A_Apres": "Après",
      "divisionRattachee": "APRÈS L'ARTICLE 62, insérer l'article suivant:",
      "articleAdditionnel": "1",
      "chapitreAdditionnel": {
        "@xmlns:xsi": "http://www.w3.org/2001/XMLSchema-instance",
        "@xsi:nil": "true"
      },
      "urlDivisionTexteVise": "/15/textes/1237.asp#D_Article_62"
    },
    "alinea": {
      "@xmlns:xsi": "http://www.w3.org/2001/XMLSchema-instance",
      "@xsi:nil": "true"
    }
  },
  "corps": {
    "dispositif": "<p style=\"text-align: justify;\">Toute soci&#233;t&#233; disposant du comit&#233; d&#233;fini &#224; l&#8217;article L.&#160;823&#8209;19 du code du commerce qui, &#224; la cl&#244;ture de l&#8217;exercice, dispose d&#8217;un chiffre d&#8217;affaires hors taxes ou d&#8217;un total de l&#8217;actif brut figurant au bilan sup&#233;rieur ou &#233;gal &#224;&#160;400&#160;millions d&#8217;euros,&#160;ou qui b&#233;n&#233;ficie de l&#8217;agr&#233;ment pr&#233;vu au premier alin&#233;a du II de l'article 209 du code g&#233;n&#233;ral des imp&#244;ts, soumet une fois par an &#224; l&#8217;approbation dudit comit&#233; un descriptif d&#233;taill&#233; de sa politique fiscale et de ses cons&#233;quences sur les charges fiscales dont elle s&#8217;acquitte.</p>",
    "exposeSommaire": "<p style=\"text-align: justify;\">Cet amendement vise&#160;&#224; informer le comit&#233; d&#8217;audit de l&#8217;entreprise de la politique fiscale de l&#8217;entreprise, et des cons&#233;quences qui en d&#233;coulent sur les charges fiscales et financi&#232;res. Le comit&#233; d&#8217;audit&#160;peut ensuite approuver ou non cette politique fiscale.&#160;Cette mesure contribue &#224; l&#8217;objectif g&#233;n&#233;ral de transparence fiscale&#160;poursuivi par la France,&#160;notamment avec BEPS. En introduisant cette mesure au niveau national la France montrerait encore un peu plus son engagement dans la lutte contre la fraude fiscale&#160;et les montages abusifs.</p><p style=\"text-align: justify;\">Le comit&#233; d&#8217;audit remplit trois missions principales&#160;: l&#8217;examen des comptes annuels, l&#8217;aide &#224; la&#160;d&#233;signation d&#8217;un commissaire aux comptes ind&#233;pendant et objectif et le dialogue avec les instances de contr&#244;le. Il manipule donc d&#233;j&#224; de nombreuses donn&#233;es financi&#232;res sensibles et b&#233;n&#233;ficie d&#8217;une expertise en la mati&#232;re. De plus, le comit&#233; est restreint et limite les risques de diffusion des informations concern&#233;es aux concurrents.</p>",
    "annexeExposeSommaire": {
      "@xmlns:xsi": "http://www.w3.org/2001/XMLSchema-instance",
      "@xsi:nil": "true"
    }
  },
  "representations": {
    "representation": {
      "nom": "PDF",
      "typeMime": {
        "type": "application",
        "subType": "PDF"
      },
      "statutRepresentation": {
        "verbatim": "true",
        "canonique": "true",
        "officielle": "true",
        "transcription": "false",
        "enregistrement": "false"
      },
      "repSource": {
        "@xmlns:xsi": "http://www.w3.org/2001/XMLSchema-instance",
        "@xsi:nil": "true"
      },
      "offset": {
        "@xmlns:xsi": "http://www.w3.org/2001/XMLSchema-instance",
        "@xsi:nil": "true"
      },
      "contenu": {
        "documentURI": "/15/amendements/1237/AN/2385.pdf"
      },
      "dateDispoRepresentation": {
        "@xmlns:xsi": "http://www.w3.org/2001/XMLSchema-instance",
        "@xsi:nil": "true"
      }
    }
  },
  "seanceDiscussion": "RUANR5L15S2019IDS21349",
  "sort": {
    "dateSaisie": "2018-10-05T12:56:00.000+02:00",
    "sortEnSeance": "Non soutenu"
  },
  "dateDepot": "2018-09-21T02:00:00.000+02:00",
  "dateDistribution": "2018-09-26T02:00:00.000+02:00",
  "article99": "0",
  "loiReference": {
    "codeLoi": {
      "@xmlns:xsi": "http://www.w3.org/2001/XMLSchema-instance",
      "@xsi:nil": "true"
    },
    "divisionCodeLoi": {
      "@xmlns:xsi": "http://www.w3.org/2001/XMLSchema-instance",
      "@xsi:nil": "true"
    }
  }
}