{
  "@xmlns": "http://schemas.assemblee-nationale.fr/referentiel",
  "uid": "AMANR5L15SEA717460B2296P0D1N1930",
  "identifiant": {
    "legislature": "15",
    "numero": "1930",
    "numRect": "0",
    "saisine": {
      "refTexteLegislatif": "PRJLANR5L15B2296",
      "numeroPartiePLF": "0",
      "organeExamen": "PO717460",
      "mentionSecondeDeliberation": "1"
    }
  },
  "numeroLong": "1930",
  "etapeTexte": "1ère lecture (1ère assemblée saisie)",
  "triAmendement": "euaaaaaaaaaaaaaaaaaaaaaaaaaaaaaaaaaaaaaaaaaaaaaaaafnzzx",
  "cardinaliteAmdtMultiples": "1",
  "amendementParent": {
    "@xmlns:xsi": "http://www.w3.org/2001/XMLSchema-instance",
    "@xsi:nil": "true"
  },
  "etat": "Discuté",
  "signataires": {
    "auteur": {
      "typeAuteur": "Depute",
      "acteurRef": "PA719890",
      "organeRef": {
        "@xmlns:xsi": "http://www.w3.org/2001/XMLSchema-instance",
        "@xsi:nil": "true"
      },
      "groupePolitiqueRef": "PO730964"
    },
    "cosignataires": {
      "acteurRef": "PA719890"
    },
    "texteAffichable": "Mme&#160;Brulebois"
  },
  "pointeurFragmentTexte": {
    "missionVisee": {
      "@xmlns:xsi": "http://www.w3.org/2001/XMLSchema-instance",
      "@xsi:nil": "true"
    },
    "division": {
      "titre": "Article 32",
      "articleDesignationCourte": "APRÈS ART. 32",
      "type": "ARTICLE",
      "avant_A_Apres": "Après",
      "divisionRattachee": "APRÈS L'ARTICLE 32, insérer l'article suivant:",
      "articleAdditionnel": "1",
      "chapitreAdditionnel": {
        "@xmlns:xsi": "http://www.w3.org/2001/XMLSchema-instance",
        "@xsi:nil": "true"
      },
      "urlDivisionTexteVise": "/15/textes/2296.asp#D_Article_32"
    },
    "alinea": {
      "@xmlns:xsi": "http://www.w3.org/2001/XMLSchema-instance",
      "@xsi:nil": "true"
    }
  },
  "corps": {
    "dispositif": "<p>L&#8217;article L.&#160;861&#8209;5 du code de la s&#233;curit&#233; sociale est compl&#233;t&#233; par un alin&#233;a ainsi r&#233;dig&#233;&#160;:</p><p style=\"text-align: justify;\">&#171;&#160;Le droit au renouvellement de la protection compl&#233;mentaire est examin&#233; automatiquement pour les personnes b&#233;n&#233;ficiaires de l&#8217;allocation adulte handicap&#233; et de l&#8217;allocation suppl&#233;mentaire d&#8217;invalidit&#233;.&#160;&#187;</p>",
    "exposeSommaire": "<p>Le rapport Charges et Produits de l&#8217;Assurance maladie a mis en avant la situation de pr&#233;carit&#233; des b&#233;n&#233;ficiaires de l&#8217;AAH, et notamment le taux &#233;lev&#233; d&#8217;absence de couverture compl&#233;mentaire sant&#233;, alors qu&#8217;un droit potentiel &#224; l&#8217;actuelle ACS existe pour certains d&#8217;entre eux. Les b&#233;n&#233;ficiaires de l&#8217;ASI sont &#233;galement concern&#233;s. Si le b&#233;n&#233;fice de l&#8217;AAH, notamment, n&#8217;implique pas un droit automatique &#224; la Compl&#233;mentaire Sant&#233; Solidaire, au regard des modalit&#233;s de cumuls AAH/ressources, il est toutefois possible de faire une &#233;tude des droits automatique avec les ressources d&#233;clar&#233;es lors de l&#8217;&#233;tude des droits AAH ou ASI, en sollicitant &#233;ventuellement les informations compl&#233;mentaires n&#233;cessaires aupr&#232;s des b&#233;n&#233;ficiaires. Cette mesure permettrait de faciliter le maintien de la couverture compl&#233;mentaire pour des personnes susceptibles d&#8217;avoir des besoins de sant&#233; importants.</p>",
    "annexeExposeSommaire": {
      "@xmlns:xsi": "http://www.w3.org/2001/XMLSchema-instance",
      "@xsi:nil": "true"
    },
    "cartoucheDelaiDepotDepasse": {
      "@xmlns:xsi": "http://www.w3.org/2001/XMLSchema-instance",
      "@xsi:nil": "true"
    },
    "avantAppel": {
      "@xmlns:xsi": "http://www.w3.org/2001/XMLSchema-instance",
      "@xsi:nil": "true"
    }
  },
  "representations": {
    "representation": {
      "nom": "PDF",
      "typeMime": {
        "type": "application",
        "subType": "PDF"
      },
      "statutRepresentation": {
        "verbatim": "true",
        "canonique": "true",
        "officielle": "true",
        "transcription": "false",
        "enregistrement": "false"
      },
      "repSource": {
        "@xmlns:xsi": "http://www.w3.org/2001/XMLSchema-instance",
        "@xsi:nil": "true"
      },
      "offset": {
        "@xmlns:xsi": "http://www.w3.org/2001/XMLSchema-instance",
        "@xsi:nil": "true"
      },
      "contenu": {
        "documentURI": "/15/amendements/2296/AN/1930.pdf"
      },
      "dateDispoRepresentation": {
        "@xmlns:xsi": "http://www.w3.org/2001/XMLSchema-instance",
        "@xsi:nil": "true"
      }
    }
  },
  "seanceDiscussion": "RUANR5L15S2020IDS21880",
  "sort": {
    "dateSaisie": "2019-10-25T09:52:53.000+02:00",
    "sortEnSeance": "Non soutenu"
  },
  "dateDepot": "2019-10-18T02:00:00.000+02:00",
  "dateDistribution": "2019-10-22T02:00:00.000+02:00",
  "article99": "0",
  "loiReference": {
    "codeLoi": "c sécurité sociale",
    "divisionCodeLoi": "L861-5"
  }
}