{
  "@xmlns": "http://schemas.assemblee-nationale.fr/referentiel",
  "uid": "AMANR5L15PO419865B1908P0D1N156",
  "identifiant": {
    "legislature": "15",
    "numero": "156",
    "numRect": "0",
    "saisine": {
      "refTexteLegislatif": "PRJLANR5L15B1908",
      "numeroPartiePLF": "0",
      "organeExamen": "PO419865",
      "mentionSecondeDeliberation": "0"
    }
  },
  "numeroLong": "CD156",
  "etapeTexte": "1ère lecture (1ère assemblée saisie)",
  "triAmendement": "caaaaaaaaaaaaaaaaaaaaaaaaaaaaaaaaaaaaaaaaaaaaaaaaaabbjzk",
  "cardinaliteAmdtMultiples": "1",
  "amendementParent": {
    "@xmlns:xsi": "http://www.w3.org/2001/XMLSchema-instance",
    "@xsi:nil": "true"
  },
  "etat": "Discuté",
  "signataires": {
    "auteur": {
      "typeAuteur": "Depute",
      "acteurRef": "PA719972",
      "organeRef": {
        "@xmlns:xsi": "http://www.w3.org/2001/XMLSchema-instance",
        "@xsi:nil": "true"
      },
      "groupePolitiqueRef": "PO730964"
    },
    "cosignataires": {
      "acteurRef": "PA719972"
    },
    "texteAffichable": "Mme&#160;Sarles, rapporteure"
  },
  "pointeurFragmentTexte": {
    "missionVisee": {
      "@xmlns:xsi": "http://www.w3.org/2001/XMLSchema-instance",
      "@xsi:nil": "true"
    },
    "division": {
      "titre": "Article 3",
      "articleDesignationCourte": "APRÈS ART. 3",
      "type": "ARTICLE",
      "avant_A_Apres": "Après",
      "divisionRattachee": "APRÈS L'ARTICLE 3, insérer l'article suivant:",
      "articleAdditionnel": "1",
      "chapitreAdditionnel": {
        "@xmlns:xsi": "http://www.w3.org/2001/XMLSchema-instance",
        "@xsi:nil": "true"
      },
      "urlDivisionTexteVise": "/15/textes/1908.asp#D_Article_3"
    },
    "alinea": {
      "@xmlns:xsi": "http://www.w3.org/2001/XMLSchema-instance",
      "@xsi:nil": "true"
    }
  },
  "corps": {
    "dispositif": "<p style=\"text-align: justify;\">Au 9&#176; du II de l&#8217;article L.&#160;121&#8209;46 du code de l&#8217;&#233;nergie, apr&#232;s la premi&#232;re occurrence du mot&#160;: &#171;&#160;territoire&#160;&#187;, sont ins&#233;r&#233;s les mots&#160;: &#171;&#160;, &#224; condition que celle-ci ne concurrence pas le d&#233;veloppement de la chaleur renouvelable&#160;&#187;.</p>",
    "exposeSommaire": "<p style=\"text-align: justify;\">Dans le cadre de&#160;leur contrat avec l&#8217;&#201;tat, les gestionnaires de r&#233;seau de distribution de gaz&#160;sont incit&#233;s &#224; am&#233;liorer la desserte en gaz naturel du territoire,&#160;en concertation avec le repr&#233;sentant des collectivit&#233;s territoriales ou leurs &#233;tablissements publics de coop&#233;ration, et donc &#224; raccorder de nouveaux utilisateurs.</p><p style=\"text-align: justify;\">Lors du lancement d&#8217;un projet de r&#233;seau de chaleur, les collectivit&#233;s territoriales sont amen&#233;es &#224; indiquer le p&#233;rim&#232;tre de ce r&#233;seau, dans les documents publi&#233;s dans le cadre des proc&#233;dures, donc les principaux futurs abonn&#233;s. L&#8217;exp&#233;rience conduit &#224; constater que ces futurs abonn&#233;s des r&#233;seaux de chaleur re&#231;oivent souvent des offres avantageuses d&#8217;installation d&#8217;un chauffage au gaz, en lieu et place du raccordement&#160;au r&#233;seau de chaleur.</p><p style=\"text-align: justify;\">Ces d&#233;marches&#160;peuvent perturber l&#8217;&#233;quilibre &#233;conomique du futur r&#233;seau de chaleur. Or, les r&#233;seaux de chaleur utilisant plus de 50&#160;% d&#8217;&#233;nergies renouvelables et sont soutenus financi&#232;rement par l&#8217;&#201;tat, via le Fonds Chaleur pilot&#233; par l&#8217;ADEME. Le niveau des aides financi&#232;res est lui-m&#234;me calcul&#233; en fonction d&#8217;un &#233;quilibre &#233;conomique anticip&#233;, fond&#233; sur les futurs abonn&#233;s ayant annonc&#233; leur intention de se raccorder au r&#233;seau.&#160;De plus, cette situation est en totale contradiction avec les objectifs nationaux de r&#233;duction de la consommation d&#8217;&#233;nergies fossiles et de d&#233;veloppement de la chaleur renouvelable (38&#160;% de chaleur renouvelable dans la production de chaleur pour 2030).</p><p style=\"text-align: justify;\">Cet amendement vise donc &#224; ne plus inciter financi&#232;rement les gestionnaires de r&#233;seau de gaz &#224; d&#233;marcher commercialement les futurs abonn&#233;s potentiels de r&#233;seaux de chaleur eux-m&#234;mes soutenus financi&#232;rement par l&#8217;&#201;tat.</p>",
    "annexeExposeSommaire": {
      "@xmlns:xsi": "http://www.w3.org/2001/XMLSchema-instance",
      "@xsi:nil": "true"
    },
    "cartoucheDelaiDepotDepasse": {
      "@xmlns:xsi": "http://www.w3.org/2001/XMLSchema-instance",
      "@xsi:nil": "true"
    }
  },
  "representations": {
    "representation": {
      "nom": "PDF",
      "typeMime": {
        "type": "application",
        "subType": "PDF"
      },
      "statutRepresentation": {
        "verbatim": "true",
        "canonique": "true",
        "officielle": "true",
        "transcription": "false",
        "enregistrement": "false"
      },
      "repSource": {
        "@xmlns:xsi": "http://www.w3.org/2001/XMLSchema-instance",
        "@xsi:nil": "true"
      },
      "offset": {
        "@xmlns:xsi": "http://www.w3.org/2001/XMLSchema-instance",
        "@xsi:nil": "true"
      },
      "contenu": {
        "documentURI": "/15/amendements/1908/CION-DVP/CD156.pdf"
      },
      "dateDispoRepresentation": {
        "@xmlns:xsi": "http://www.w3.org/2001/XMLSchema-instance",
        "@xsi:nil": "true"
      }
    }
  },
  "seanceDiscussion": {
    "@xmlns:xsi": "http://www.w3.org/2001/XMLSchema-instance",
    "@xsi:nil": "true"
  },
  "sort": {
    "dateSaisie": "2019-06-12T12:07:05.000+02:00",
    "sortEnSeance": "Adopté"
  },
  "dateDepot": "2019-06-04T02:00:00.000+02:00",
  "dateDistribution": "2019-06-04T02:00:00.000+02:00",
  "article99": "0",
  "loiReference": {
    "codeLoi": "énergie",
    "divisionCodeLoi": "L121-46"
  }
}