{
  "@xmlns": "http://schemas.assemblee-nationale.fr/referentiel",
  "uid": "AMANR5L15SEA717460BTC1452P0D1N8",
  "identifiant": {
    "legislature": "15",
    "numero": "8",
    "numRect": "0",
    "saisine": {
      "refTexteLegislatif": "PIONANR5L15BTC1452",
      "numeroPartiePLF": "0",
      "organeExamen": "PO717460",
      "mentionSecondeDeliberation": "0"
    }
  },
  "numeroLong": "8",
  "etapeTexte": "deuxième lecture",
  "triAmendement": "maaaaaaaaaaaaaaaaaaaaaaaaaaaaaaaaaaaaaaaaaaaaaaaaai",
  "cardinaliteAmdtMultiples": "1",
  "amendementParent": {
    "@xmlns:xsi": "http://www.w3.org/2001/XMLSchema-instance",
    "@xsi:nil": "true"
  },
  "etat": "Irrecevable",
  "signataires": {
    "auteur": {
      "typeAuteur": "Depute",
      "acteurRef": "PA610654",
      "organeRef": {
        "@xmlns:xsi": "http://www.w3.org/2001/XMLSchema-instance",
        "@xsi:nil": "true"
      },
      "groupePolitiqueRef": "PO730940"
    },
    "cosignataires": {
      "acteurRef": [
        "PA610667",
        "PA441",
        "PA721012",
        "PA721118",
        "PA610654"
      ]
    },
    "texteAffichable": "M.&#160;Nilor,  Mme&#160;Bello, M.&#160;Brotherson, Mme&#160;K&#233;clard-Mond&#233;sir et M.&#160;Serville"
  },
  "pointeurFragmentTexte": {
    "missionVisee": {
      "@xmlns:xsi": "http://www.w3.org/2001/XMLSchema-instance",
      "@xsi:nil": "true"
    },
    "division": {
      "titre": "Article 6",
      "articleDesignationCourte": "APRÈS ART. 6",
      "type": "ARTICLE",
      "avant_A_Apres": "Après",
      "divisionRattachee": "APRÈS L'ARTICLE 6, insérer l'article suivant:",
      "articleAdditionnel": "1",
      "chapitreAdditionnel": {
        "@xmlns:xsi": "http://www.w3.org/2001/XMLSchema-instance",
        "@xsi:nil": "true"
      },
      "urlDivisionTexteVise": "/15/textes/1452.asp#D_Article_6"
    },
    "alinea": {
      "@xmlns:xsi": "http://www.w3.org/2001/XMLSchema-instance",
      "@xsi:nil": "true"
    }
  },
  "corps": {
    "dispositif": "<p style=\"text-align: justify;\">Dans les six mois &#224; compter de la promulgation de la pr&#233;sente loi, il est mis en place, dans chaque collectivit&#233; r&#233;gie par l&#8217;article&#160;73 de la Constitution mentionn&#233;e dans la pr&#233;sente loi, un observatoire de&#160;la disponibilit&#233; fonci&#232;re et immobili&#232;re dont la composition et les missions sont d&#233;finies par d&#233;cret.</p>",
    "exposeSommaire": "<p>Le probl&#232;me de l&#8217;indivision, notamment en outremer, touche de nombreuses familles.</p><p style=\"text-align: justify;\">Son acuit&#233;, sa complexit&#233; et sa permanence constituent des entraves &#224; toute politique de logement et de d&#233;veloppement &#233;conomique et social.</p><p>Cette proposition de loi a pour objet d&#8217;adapter le r&#233;gime existant et de faciliter la sortie de l&#8217;indivision successorale.&#160;</p><p>Il s&#8217;agit d&#8217;un texte &#224; vis&#233;e exp&#233;rimentale, n&#233;cessitant une &#233;valuation des mesures et de leur adaptation dans le contexte des outremers durant la dur&#233;e de l&#8217;exp&#233;rimentation.</p><p>Il appara&#238;t plus que jamais n&#233;cessaire de mettre en place un observatoire permettant&#160;de recueillir et d&#8217;analyser&#160;des donn&#233;es fiables sur&#160;:</p><p>- les successions ouvertes</p><p>- les dossiers en cours de traitement</p><p>- les dossiers trait&#233;s pendant la p&#233;riode exp&#233;rimentale</p><p>- les causes de blocage &#224; l'origine du maintien en indivision</p><p>- les cas de litiges ayant entra&#238;n&#233; la saisine du Tribunal</p><p>- la r&#233;alit&#233; de l&#8217;abandon manifeste</p><p>- le foncier disponible pour le logement, les activit&#233;s &#233;conomiques...</p><p>Ces donn&#233;es objectives nous permettront au terme de ces dix ans d&#8217;exp&#233;rimentation de mieux appr&#233;cier l&#8217;opportunit&#233; de proroger ou am&#233;liorer le dispositif tel qu&#8217;exprim&#233; dans le pr&#233;ambule du texte initial.</p><p>Tel est l&#8217;objet de cet amendement.</p>",
    "annexeExposeSommaire": {
      "@xmlns:xsi": "http://www.w3.org/2001/XMLSchema-instance",
      "@xsi:nil": "true"
    },
    "cartoucheDelaiDepotDepasse": {
      "@xmlns:xsi": "http://www.w3.org/2001/XMLSchema-instance",
      "@xsi:nil": "true"
    }
  },
  "representations": {
    "representation": {
      "nom": "PDF",
      "typeMime": {
        "type": "application",
        "subType": "PDF"
      },
      "statutRepresentation": {
        "verbatim": "true",
        "canonique": "true",
        "officielle": "true",
        "transcription": "false",
        "enregistrement": "false"
      },
      "repSource": {
        "@xmlns:xsi": "http://www.w3.org/2001/XMLSchema-instance",
        "@xsi:nil": "true"
      },
      "offset": {
        "@xmlns:xsi": "http://www.w3.org/2001/XMLSchema-instance",
        "@xsi:nil": "true"
      },
      "contenu": {
        "documentURI": "/15/amendements/1452/AN/8.pdf"
      },
      "dateDispoRepresentation": {
        "@xmlns:xsi": "http://www.w3.org/2001/XMLSchema-instance",
        "@xsi:nil": "true"
      }
    }
  },
  "seanceDiscussion": {
    "@xmlns:xsi": "http://www.w3.org/2001/XMLSchema-instance",
    "@xsi:nil": "true"
  },
  "sort": {
    "@xmlns:xsi": "http://www.w3.org/2001/XMLSchema-instance",
    "@xsi:nil": "true"
  },
  "dateDepot": "2018-12-01T01:00:00.000+01:00",
  "dateDistribution": "2018-12-05T01:00:00.000+01:00",
  "article99": "0",
  "loiReference": {
    "codeLoi": {
      "@xmlns:xsi": "http://www.w3.org/2001/XMLSchema-instance",
      "@xsi:nil": "true"
    },
    "divisionCodeLoi": {
      "@xmlns:xsi": "http://www.w3.org/2001/XMLSchema-instance",
      "@xsi:nil": "true"
    }
  }
}