{
  "@xmlns": "http://schemas.assemblee-nationale.fr/referentiel",
  "uid": "AMANR5L15SEA717460B1255P1D1N1162",
  "identifiant": {
    "legislature": "15",
    "numero": "1162",
    "numRect": "0",
    "saisine": {
      "refTexteLegislatif": "PRJLANR5L15B1255",
      "numeroPartiePLF": "1",
      "organeExamen": "PO717460",
      "mentionSecondeDeliberation": "0"
    }
  },
  "numeroLong": "I-1162",
  "etapeTexte": "1ère lecture (1ère assemblée saisie)",
  "triAmendement": "blaaaaaaaaaaaaaaaaaaaaaaaaaaaaaaaaaaaaaaaaaaaaaaaalrxu",
  "cardinaliteAmdtMultiples": "1",
  "amendementParent": {
    "@xmlns:xsi": "http://www.w3.org/2001/XMLSchema-instance",
    "@xsi:nil": "true"
  },
  "etat": "Discuté",
  "signataires": {
    "auteur": {
      "typeAuteur": "Depute",
      "acteurRef": "PA719138",
      "organeRef": {
        "@xmlns:xsi": "http://www.w3.org/2001/XMLSchema-instance",
        "@xsi:nil": "true"
      },
      "groupePolitiqueRef": "PO759900"
    },
    "cosignataires": {
      "acteurRef": "PA719138"
    },
    "texteAffichable": "M.&#160;Castellani"
  },
  "pointeurFragmentTexte": {
    "missionVisee": {
      "@xmlns:xsi": "http://www.w3.org/2001/XMLSchema-instance",
      "@xsi:nil": "true"
    },
    "division": {
      "titre": "Article 8",
      "articleDesignationCourte": "APRÈS ART. 8",
      "type": "ARTICLE",
      "avant_A_Apres": "Après",
      "divisionRattachee": "APRÈS L'ARTICLE 8, insérer l'article suivant:",
      "articleAdditionnel": "1",
      "chapitreAdditionnel": {
        "@xmlns:xsi": "http://www.w3.org/2001/XMLSchema-instance",
        "@xsi:nil": "true"
      },
      "urlDivisionTexteVise": "/15/textes/1255A.asp#D_Article_8"
    },
    "alinea": {
      "@xmlns:xsi": "http://www.w3.org/2001/XMLSchema-instance",
      "@xsi:nil": "true"
    }
  },
  "corps": {
    "dispositif": "<p style=\"text-align: justify;\">Le huiti&#232;me alin&#233;a du III de l&#8217;article 266 <i>quindecies</i> du code des douanes est compl&#233;t&#233; par une phrase ainsi r&#233;dig&#233;e : &#171; Sont&#160;exclus de cette liste l&#8217;huile de palme et le soja. &#187;.</p>",
    "exposeSommaire": "<p style=\"text-align: justify;\">L&#8217;exploitation des palmiers &#224; huile est une cause majeure de d&#233;forestation dans les pays du Sud avec des corr&#233;lations extr&#234;mement n&#233;gatives sur les &#233;cosyst&#232;mes et le<br />r&#233;chauffement climatique.</p><p style=\"text-align: justify;\">Il convient donc de limiter les incitations &#224; l&#8217;importation de ces mati&#232;res premi&#232;res agricoles qui aboutissent &#224; subventionner indirectement la destruction d&#8217;&#233;cosyst&#232;mes<br />entiers en excluant l&#8217;huile de palme et le soja des bio-carburants.</p><p style=\"text-align: justify;\">Le soja, massivement produit en Am&#233;rique du Sud, est &#233;galement mentionn&#233; afin de ne pas cr&#233;er de discrimination avec l&#8217;huile de palme produite en Indon&#233;sie et en Malaisie.</p>",
    "annexeExposeSommaire": {
      "@xmlns:xsi": "http://www.w3.org/2001/XMLSchema-instance",
      "@xsi:nil": "true"
    }
  },
  "representations": {
    "representation": {
      "nom": "PDF",
      "typeMime": {
        "type": "application",
        "subType": "PDF"
      },
      "statutRepresentation": {
        "verbatim": "true",
        "canonique": "true",
        "officielle": "true",
        "transcription": "false",
        "enregistrement": "false"
      },
      "repSource": {
        "@xmlns:xsi": "http://www.w3.org/2001/XMLSchema-instance",
        "@xsi:nil": "true"
      },
      "offset": {
        "@xmlns:xsi": "http://www.w3.org/2001/XMLSchema-instance",
        "@xsi:nil": "true"
      },
      "contenu": {
        "documentURI": "/15/amendements/1255A/AN/1162.pdf"
      },
      "dateDispoRepresentation": {
        "@xmlns:xsi": "http://www.w3.org/2001/XMLSchema-instance",
        "@xsi:nil": "true"
      }
    }
  },
  "seanceDiscussion": "RUANR5L15S2019IDS21279",
  "sort": {
    "dateSaisie": "2018-10-19T00:02:37.000+02:00",
    "sortEnSeance": "Rejeté"
  },
  "dateDepot": "2018-10-11T02:00:00.000+02:00",
  "dateDistribution": "2018-10-15T02:00:00.000+02:00",
  "article99": "0",
  "loiReference": {
    "codeLoi": "c douanes",
    "divisionCodeLoi": "266 quindecies"
  }
}