{
  "@xmlns": "http://schemas.assemblee-nationale.fr/referentiel",
  "uid": "AMANR5L15SEA717460BTC1955P0D1N680",
  "identifiant": {
    "legislature": "15",
    "numero": "680",
    "numRect": "0",
    "saisine": {
      "refTexteLegislatif": "PNREANR5L15BTC1955",
      "numeroPartiePLF": "0",
      "organeExamen": "PO717460",
      "mentionSecondeDeliberation": "1"
    }
  },
  "numeroLong": "680",
  "etapeTexte": "Lecture unique",
  "triAmendement": "lcaaaaaaaaaaaaaaaaaaaaaaaaaaaaaaaaaaaaaaaaaaaaaaaai",
  "cardinaliteAmdtMultiples": "1",
  "amendementParent": {
    "@xmlns:xsi": "http://www.w3.org/2001/XMLSchema-instance",
    "@xsi:nil": "true"
  },
  "etat": "Discuté",
  "signataires": {
    "auteur": {
      "typeAuteur": "Depute",
      "acteurRef": "PA721932",
      "organeRef": {
        "@xmlns:xsi": "http://www.w3.org/2001/XMLSchema-instance",
        "@xsi:nil": "true"
      },
      "groupePolitiqueRef": "PO723569"
    },
    "cosignataires": {
      "acteurRef": [
        "PA719608",
        "PA721932"
      ]
    },
    "texteAffichable": "Mme&#160;Lorho et Mme&#160;M&#233;nard"
  },
  "pointeurFragmentTexte": {
    "missionVisee": {
      "@xmlns:xsi": "http://www.w3.org/2001/XMLSchema-instance",
      "@xsi:nil": "true"
    },
    "division": {
      "titre": "Article 30 ter",
      "articleDesignationCourte": "APRÈS ART. 30 TER",
      "type": "ARTICLE",
      "avant_A_Apres": "Après",
      "divisionRattachee": "APRÈS L'ARTICLE 30 TER, insérer l'article suivant:",
      "articleAdditionnel": "1",
      "chapitreAdditionnel": {
        "@xmlns:xsi": "http://www.w3.org/2001/XMLSchema-instance",
        "@xsi:nil": "true"
      },
      "urlDivisionTexteVise": "/15/textes/1955.asp#D_Article_30_ter"
    },
    "alinea": {
      "@xmlns:xsi": "http://www.w3.org/2001/XMLSchema-instance",
      "@xsi:nil": "true"
    }
  },
  "corps": {
    "dispositif": "<p style=\"text-align: justify;\">&#192; la fin du quatri&#232;me alin&#233;a de l&#8217;article&#160;122 du R&#232;glement sont ins&#233;r&#233;s les mots&#160;: &#171;&#160;ainsi qu&#8217;&#224; un d&#233;put&#233; n&#8217;appartenant &#224; aucun groupe&#160;&#187;.</p>",
    "exposeSommaire": "<p style=\"text-align: justify;\">Encore une fois les d&#233;put&#233;s non-inscrits sont les grands oubli&#233;s de l&#8217;Assembl&#233;e nationale. Il en va de la cr&#233;dibilit&#233; de nos institutions qu&#8217;ils puissent pourtant s&#8217;exprimer au moins autant que leurs coll&#232;gues. S&#8217;il est tout &#224; fait normal que les groupes politiques b&#233;n&#233;ficient d&#8217;une visibilit&#233; proportionnelle &#224; leur importance dans l&#8217;h&#233;micycle, il n&#8217;est pas pour autant normal que les d&#233;put&#233;s non-inscrits soient, eux, invisibles.</p>",
    "annexeExposeSommaire": {
      "@xmlns:xsi": "http://www.w3.org/2001/XMLSchema-instance",
      "@xsi:nil": "true"
    },
    "cartoucheDelaiDepotDepasse": {
      "@xmlns:xsi": "http://www.w3.org/2001/XMLSchema-instance",
      "@xsi:nil": "true"
    }
  },
  "representations": {
    "representation": {
      "nom": "PDF",
      "typeMime": {
        "type": "application",
        "subType": "PDF"
      },
      "statutRepresentation": {
        "verbatim": "true",
        "canonique": "true",
        "officielle": "true",
        "transcription": "false",
        "enregistrement": "false"
      },
      "repSource": {
        "@xmlns:xsi": "http://www.w3.org/2001/XMLSchema-instance",
        "@xsi:nil": "true"
      },
      "offset": {
        "@xmlns:xsi": "http://www.w3.org/2001/XMLSchema-instance",
        "@xsi:nil": "true"
      },
      "contenu": {
        "documentURI": "/15/amendements/1955/AN/680.pdf"
      },
      "dateDispoRepresentation": {
        "@xmlns:xsi": "http://www.w3.org/2001/XMLSchema-instance",
        "@xsi:nil": "true"
      }
    }
  },
  "seanceDiscussion": "RUANR5L15S2019IDS21670",
  "sort": {
    "dateSaisie": "2019-05-29T18:47:11.000+02:00",
    "sortEnSeance": "Non soutenu"
  },
  "dateDepot": "2019-05-24T02:00:00.000+02:00",
  "dateDistribution": "2019-05-27T02:00:00.000+02:00",
  "article99": "0",
  "loiReference": {
    "codeLoi": {
      "@xmlns:xsi": "http://www.w3.org/2001/XMLSchema-instance",
      "@xsi:nil": "true"
    },
    "divisionCodeLoi": "122"
  }
}