{
  "@xmlns": "http://schemas.assemblee-nationale.fr/referentiel",
  "uid": "AMANR5L15SEA717460B0235P1D1N1253",
  "identifiant": {
    "legislature": "15",
    "numero": "1253",
    "numRect": "0",
    "saisine": {
      "refTexteLegislatif": "PRJLANR5L15B0235",
      "numeroPartiePLF": "1",
      "organeExamen": "PO717460",
      "mentionSecondeDeliberation": "0"
    }
  },
  "numeroLong": "I-1253",
  "etapeTexte": "1ère lecture (1ère assemblée saisie)",
  "triAmendement": "zzzzzzzzzzzzzzzzzzzzzzzzzzy",
  "cardinaliteAmdtMultiples": "1",
  "amendementParent": {
    "@xmlns:xsi": "http://www.w3.org/2001/XMLSchema-instance",
    "@xsi:nil": "true"
  },
  "etat": "Discuté",
  "signataires": {
    "auteur": {
      "typeAuteur": "Depute",
      "acteurRef": "PA721486",
      "organeRef": {
        "@xmlns:xsi": "http://www.w3.org/2001/XMLSchema-instance",
        "@xsi:nil": "true"
      },
      "groupePolitiqueRef": "PO730952"
    },
    "cosignataires": {
      "acteurRef": [
        "PA712014",
        "PA610775",
        "PA642935",
        "PA1960",
        "PA331582",
        "PA721110",
        "PA713448",
        "PA267042",
        "PA267585",
        "PA266788",
        "PA333421",
        "PA642868",
        "PA267766",
        "PA268019",
        "PA335758",
        "PA720696",
        "PA719806",
        "PA267241",
        "PA721094",
        "PA267780",
        "PA695100",
        "PA332228",
        "PA267330",
        "PA942",
        "PA267355",
        "PA722030",
        "PA721486",
        "PA720230"
      ]
    },
    "texteAffichable": "M.&#160;Naegelen,  Mme&#160;Auconie, M.&#160;Becht, M.&#160;Benoit, M.&#160;Bournazel, Mme&#160;Brenier, M.&#160;Guy&#160;Bricout, M.&#160;Christophe, M.&#160;Charles&#160;de Courson, M.&#160;Demilly, Mme&#160;Descamps, M.&#160;Dunoyer, M.&#160;Favennec Becot, Mme&#160;Firmin Le Bodo, M.&#160;Gom&#232;s, M.&#160;Meyer&#160;Habib, M.&#160;Herth, M.&#160;Lagarde, M.&#160;Ledoux, M.&#160;Leroy, Mme&#160;Magnier, M.&#160;Morel-&#192;-L&apos;Huissier, M.&#160;Pancher, M.&#160;Riester, Mme&#160;Sanquer, M.&#160;Vercamer, M.&#160;Philippe&#160;Vigier et M.&#160;Zumkeller"
  },
  "pointeurFragmentTexte": {
    "missionVisee": {
      "@xmlns:xsi": "http://www.w3.org/2001/XMLSchema-instance",
      "@xsi:nil": "true"
    },
    "division": {
      "titre": "Article 11",
      "articleDesignationCourte": "ART. 11",
      "type": "ARTICLE",
      "avant_A_Apres": "A",
      "divisionRattachee": "ARTICLE 11",
      "articleAdditionnel": {
        "@xmlns:xsi": "http://www.w3.org/2001/XMLSchema-instance",
        "@xsi:nil": "true"
      },
      "chapitreAdditionnel": {
        "@xmlns:xsi": "http://www.w3.org/2001/XMLSchema-instance",
        "@xsi:nil": "true"
      },
      "urlDivisionTexteVise": "/15/textes/0235A.asp#D_Article_11"
    },
    "alinea": {
      "avant_A_Apres": {
        "@xmlns:xsi": "http://www.w3.org/2001/XMLSchema-instance",
        "@xsi:nil": "true"
      },
      "numero": "150",
      "alineaDesignation": {
        "@xmlns:xsi": "http://www.w3.org/2001/XMLSchema-instance",
        "@xsi:nil": "true"
      }
    }
  },
  "corps": {
    "dispositif": "<p style=\"text-align: justify;\">I.&#160;&#8211;&#160;Supprimer les alin&#233;as 150 &#224; 152.</p><p style=\"text-align: justify;\">II.&#160;&#8211;&#160;En cons&#233;quence, supprimer les alin&#233;as 275 et 276.</p><p style=\"text-align: justify;\">III.&#160;&#8211;&#160;En cons&#233;quence, supprimer l&#8217;alin&#233;a&#160;297.</p><p style=\"text-align: justify;\">&#160;</p>",
    "exposeSommaire": "<p style=\"text-align: justify;\">Le pr&#233;sent amendement vise &#224; exon&#233;rer de PFU les PEL et CEL, en pr&#233;servant la fiscalit&#233; actuellement applicable &#224; ces PEL et CEL.</p><p style=\"text-align: justify;\">Une fiscalit&#233; des PEL aggrav&#233;e p&#233;naliserait encore des millions de Fran&#231;ais alors qu&#8217;ils vont d&#233;j&#224; subir un gel du taux actuel du Livret A, r&#233;mun&#233;r&#233; &#224; 0,75&#160;% quand l&#8217;inflation est &#224; plus de 1&#160;%&#160;!</p><p style=\"text-align: justify;\">Le PEL est l&#8217;un des placements privil&#233;gi&#233;s des Fran&#231;ais. Fin 2016, 16 millions de personnes d&#233;tenaient un PEL.</p><p style=\"text-align: justify;\">Avec cet amendement, les PEL de moins de 12 ans continueraient d&#8217;&#234;tre exon&#233;r&#233;s de toute nouvelle taxation, tout comme les nouveaux PEL. Cet amendement permet donc d&#8217;&#233;viter toute nouvelle taxation d&#233;savantageuse pour les &#233;pargnants les plus modestes qui sont tr&#232;s attach&#233;s au PEL.</p>",
    "annexeExposeSommaire": {
      "@xmlns:xsi": "http://www.w3.org/2001/XMLSchema-instance",
      "@xsi:nil": "true"
    }
  },
  "representations": {
    "representation": {
      "nom": "PDF",
      "typeMime": {
        "type": "application",
        "subType": "PDF"
      },
      "statutRepresentation": {
        "verbatim": "true",
        "canonique": "true",
        "officielle": "true",
        "transcription": "false",
        "enregistrement": "false"
      },
      "repSource": {
        "@xmlns:xsi": "http://www.w3.org/2001/XMLSchema-instance",
        "@xsi:nil": "true"
      },
      "offset": {
        "@xmlns:xsi": "http://www.w3.org/2001/XMLSchema-instance",
        "@xsi:nil": "true"
      },
      "contenu": {
        "documentURI": "/15/amendements/0235A/AN/1253.pdf"
      },
      "dateDispoRepresentation": {
        "@xmlns:xsi": "http://www.w3.org/2001/XMLSchema-instance",
        "@xsi:nil": "true"
      }
    }
  },
  "seanceDiscussion": "RUANR5L15S2018IDS20697",
  "sort": {
    "dateSaisie": "2017-10-20T00:05:49.000+02:00",
    "sortEnSeance": "Rejeté"
  },
  "dateDepot": "2017-10-13T02:00:00.000+02:00",
  "dateDistribution": "2017-10-16T02:00:00.000+02:00",
  "article99": "0",
  "loiReference": {
    "codeLoi": {
      "@xmlns:xsi": "http://www.w3.org/2001/XMLSchema-instance",
      "@xsi:nil": "true"
    },
    "divisionCodeLoi": {
      "@xmlns:xsi": "http://www.w3.org/2001/XMLSchema-instance",
      "@xsi:nil": "true"
    }
  }
}