{
  "@xmlns": "http://schemas.assemblee-nationale.fr/referentiel",
  "uid": "AMANR5L15SEA717460BTC0902P0D1N2022",
  "identifiant": {
    "legislature": "15",
    "numero": "2022",
    "numRect": "0",
    "saisine": {
      "refTexteLegislatif": "PRJLANR5L15BTC0902",
      "numeroPartiePLF": "0",
      "organeExamen": "PO717460",
      "mentionSecondeDeliberation": "0"
    }
  },
  "numeroLong": "2022",
  "etapeTexte": "1ère lecture (1ère assemblée saisie)",
  "triAmendement": "bsahyx",
  "cardinaliteAmdtMultiples": "1",
  "amendementParent": {
    "@xmlns:xsi": "http://www.w3.org/2001/XMLSchema-instance",
    "@xsi:nil": "true"
  },
  "etat": "Discuté",
  "signataires": {
    "auteur": {
      "typeAuteur": "Depute",
      "acteurRef": "PA722142",
      "organeRef": {
        "@xmlns:xsi": "http://www.w3.org/2001/XMLSchema-instance",
        "@xsi:nil": "true"
      },
      "groupePolitiqueRef": "PO730958"
    },
    "cosignataires": {
      "acteurRef": [
        "PA721960",
        "PA721226",
        "PA588884",
        "PA721210",
        "PA720422",
        "PA721062",
        "PA720430",
        "PA718860",
        "PA720892",
        "PA721202",
        "PA719578",
        "PA722142",
        "PA718868",
        "PA719676",
        "PA2150",
        "PA720846",
        "PA720286"
      ]
    },
    "texteAffichable": "M.&#160;Ruffin,  Mme&#160;Autain, M.&#160;Bernalicis, M.&#160;Coquerel, M.&#160;Corbi&#232;re, Mme&#160;Fiat, M.&#160;Lachaud, M.&#160;Larive, M.&#160;M&#233;lenchon, Mme&#160;Obono, Mme&#160;Panot, M.&#160;Prud&apos;homme, M.&#160;Quatennens, M.&#160;Ratenon, Mme&#160;Ressiguier, Mme&#160;Rubin et Mme&#160;Taurine"
  },
  "pointeurFragmentTexte": {
    "missionVisee": {
      "@xmlns:xsi": "http://www.w3.org/2001/XMLSchema-instance",
      "@xsi:nil": "true"
    },
    "division": {
      "titre": "Article 11",
      "articleDesignationCourte": "ART. 11",
      "type": "ARTICLE",
      "avant_A_Apres": "A",
      "divisionRattachee": "ARTICLE 11",
      "articleAdditionnel": {
        "@xmlns:xsi": "http://www.w3.org/2001/XMLSchema-instance",
        "@xsi:nil": "true"
      },
      "chapitreAdditionnel": {
        "@xmlns:xsi": "http://www.w3.org/2001/XMLSchema-instance",
        "@xsi:nil": "true"
      },
      "urlDivisionTexteVise": "/15/textes/0902.asp#D_Article_11"
    },
    "alinea": {
      "avant_A_Apres": "A",
      "numero": "3",
      "alineaDesignation": "Alinéa 3"
    }
  },
  "corps": {
    "dispositif": "<p style=\"text-align: justify;\">Compl&#233;ter l&#8217;alin&#233;a&#160;3 par les mots&#160;:</p><p style=\"text-align: justify;\">&#171;&#160;, provenant notamment d&#8217;approvisionnements en circuits courts et respectant la saisonnalit&#233; des produits&#160;&#187;.</p>",
    "exposeSommaire": "<p style=\"text-align: justify;\">Le caract&#232;re local d&#8217;un produit permet de r&#233;duire la d&#233;pense d&#8217;&#233;nergie n&#233;cessaire li&#233;e &#224; son acheminement, et aussi sur l&#8217;&#233;conomie du pays car il permet de maintenir et de cr&#233;er des emplois agricoles. Favoriser l&#8217;utilisation de produits de saisons r&#233;pond aux m&#234;mes exigences environnementales en &#233;vitant des produits import&#233;s d&#8217;autres r&#233;gions du monde ou pouss&#233;s sous nos latitudes sous serres chauff&#233;es tr&#232;s &#233;nergivores. Cela permet aussi de former les &#233;l&#232;ves d&#233;jeunant &#224; la cantine chaque midi &#224; faire le lien entre les saisons et l&#8217;alimentation.</p>",
    "annexeExposeSommaire": {
      "@xmlns:xsi": "http://www.w3.org/2001/XMLSchema-instance",
      "@xsi:nil": "true"
    }
  },
  "representations": {
    "representation": {
      "nom": "PDF",
      "typeMime": {
        "type": "application",
        "subType": "PDF"
      },
      "statutRepresentation": {
        "verbatim": "true",
        "canonique": "true",
        "officielle": "true",
        "transcription": "false",
        "enregistrement": "false"
      },
      "repSource": {
        "@xmlns:xsi": "http://www.w3.org/2001/XMLSchema-instance",
        "@xsi:nil": "true"
      },
      "offset": {
        "@xmlns:xsi": "http://www.w3.org/2001/XMLSchema-instance",
        "@xsi:nil": "true"
      },
      "contenu": {
        "documentURI": "/15/amendements/0902/AN/2022.pdf"
      },
      "dateDispoRepresentation": {
        "@xmlns:xsi": "http://www.w3.org/2001/XMLSchema-instance",
        "@xsi:nil": "true"
      }
    }
  },
  "seanceDiscussion": "RUANR5L15S2018IDS21056",
  "sort": {
    "dateSaisie": "2018-05-25T23:43:39.000+02:00",
    "sortEnSeance": "Rejeté"
  },
  "dateDepot": "2018-05-17T02:00:00.000+02:00",
  "dateDistribution": "2018-05-22T02:00:00.000+02:00",
  "article99": "0",
  "loiReference": {
    "codeLoi": {
      "@xmlns:xsi": "http://www.w3.org/2001/XMLSchema-instance",
      "@xsi:nil": "true"
    },
    "divisionCodeLoi": {
      "@xmlns:xsi": "http://www.w3.org/2001/XMLSchema-instance",
      "@xsi:nil": "true"
    }
  }
}