{
  "@xmlns": "http://schemas.assemblee-nationale.fr/referentiel",
  "uid": "AMANR5L15PO420120B2296P0D1N121",
  "identifiant": {
    "legislature": "15",
    "numero": "121",
    "numRect": "0",
    "saisine": {
      "refTexteLegislatif": "PRJLANR5L15B2296",
      "numeroPartiePLF": "0",
      "organeExamen": "PO420120",
      "mentionSecondeDeliberation": "0"
    }
  },
  "numeroLong": "AS121",
  "etapeTexte": "1ère lecture (1ère assemblée saisie)",
  "triAmendement": "ebaaaaaaaaaaaaaaaaaaaaaaaaaaaaaaaaaaaaaaaaaaaaaaaagaao",
  "cardinaliteAmdtMultiples": "1",
  "amendementParent": {
    "@xmlns:xsi": "http://www.w3.org/2001/XMLSchema-instance",
    "@xsi:nil": "true"
  },
  "etat": "Discuté",
  "signataires": {
    "auteur": {
      "typeAuteur": "Depute",
      "acteurRef": "PA718926",
      "organeRef": {
        "@xmlns:xsi": "http://www.w3.org/2001/XMLSchema-instance",
        "@xsi:nil": "true"
      },
      "groupePolitiqueRef": "PO730940"
    },
    "cosignataires": {
      "acteurRef": [
        "PA610667",
        "PA335612",
        "PA721012",
        "PA720546",
        "PA720692",
        "PA721896",
        "PA721118",
        "PA689",
        "PA718720",
        "PA441",
        "PA610654",
        "PA722202",
        "PA722110",
        "PA718926",
        "PA721270",
        "PA267306"
      ]
    },
    "texteAffichable": "M.&#160;Dharr&#233;ville,  M.&#160;Nilor, M.&#160;Bruneel, Mme&#160;Bello, M.&#160;Brotherson, Mme&#160;Buffet, M.&#160;Chassaigne, M.&#160;Dufr&#232;gne, Mme&#160;Faucillon, M.&#160;Jumel, Mme&#160;K&#233;clard-Mond&#233;sir, M.&#160;Lecoq, M.&#160;Peu, M.&#160;Fabien&#160;Roussel, M.&#160;Serville et M.&#160;Wulfranc"
  },
  "pointeurFragmentTexte": {
    "missionVisee": {
      "@xmlns:xsi": "http://www.w3.org/2001/XMLSchema-instance",
      "@xsi:nil": "true"
    },
    "division": {
      "titre": "Article 28",
      "articleDesignationCourte": "APRÈS ART. 28",
      "type": "ARTICLE",
      "avant_A_Apres": "Après",
      "divisionRattachee": "APRÈS L'ARTICLE 28, insérer l'article suivant:",
      "articleAdditionnel": "1",
      "chapitreAdditionnel": {
        "@xmlns:xsi": "http://www.w3.org/2001/XMLSchema-instance",
        "@xsi:nil": "true"
      },
      "urlDivisionTexteVise": "/15/textes/2296.asp#D_Article_28"
    },
    "alinea": {
      "@xmlns:xsi": "http://www.w3.org/2001/XMLSchema-instance",
      "@xsi:nil": "true"
    }
  },
  "corps": {
    "dispositif": "<p style=\"text-align: justify;\">L&#8217;article L.&#160;162&#8209;16&#8209;4 du code de la s&#233;curit&#233; sociale est ainsi modifi&#233;&#160;:</p><p style=\"text-align: justify;\">1&#176;&#160;Apr&#232;s le II, il est ins&#233;r&#233; un II <i>bis</i> ainsi r&#233;dig&#233;&#160;:</p><p style=\"text-align: justify;\">&#171;&#160;II <i>bis</i>.&#160;&#8211;&#160;Le prix de vente doit &#234;tre r&#233;vis&#233; &#224; un niveau inf&#233;rieur ou baiss&#233;, par convention ou, &#224; d&#233;faut, par d&#233;cision du Comit&#233; &#233;conomique des produits de sant&#233;&#160;:</p><p style=\"text-align: justify;\">&#171;&#160;1&#176;&#160;En cas d&#8217;extension d&#8217;indication th&#233;rapeutique ayant un effet sur le nombre de patients ou le volume des ventes&#160;;</p><p style=\"text-align: justify;\">&#171;&#160;2&#176;&#160;Au plus tard au bout de trois ans. Toutefois, le d&#233;cret pr&#233;vu au III peut porter ce d&#233;lai jusqu&#8217;&#224; cinq ans pour les m&#233;dicaments r&#233;pondant &#224; des conditions sp&#233;cifiques fix&#233;es au regard des crit&#232;res mentionn&#233;s &#224; la seconde phrase du premier alin&#233;a du I.&#160;&#187;&#160;;</p><p style=\"text-align: justify;\">2&#176;&#160;Le III est compl&#233;t&#233; par les mots&#160;: &#171;&#160;et le nombre de patients ou volume des ventes donnant lieu &#224; une r&#233;vision de prix&#160;&#187;.</p>",
    "exposeSommaire": "<p style=\"text-align: justify;\">Dans son rapport de septembre 2017 sur la s&#233;curit&#233; sociale, la Cour des comptes recommande de renforcer le dispositif de r&#233;vision des prix en France.</p><p style=\"text-align: justify;\">En effet, si les crit&#232;res de r&#233;vision des prix des m&#233;dicaments sont d&#233;finis par la loi depuis la LFSS 2017, il n&#8217;existe pas d&#8217;obligation de r&#233;vision des prix. La Cour des comptes recommande de les &#233;tablir dans trois cas&#160;: &#224; l&#8217;issue des cinq ann&#233;es de garantie de prix&#160;europ&#233;en pour les m&#233;dicaments les plus innovants&#160;; au bout de trois ans pour les autres m&#233;dicaments&#160;; et en cas d&#8217;extension d&#8217;indications th&#233;rapeutiques d&#8217;un m&#233;dicament.</p><p style=\"text-align: justify;\">Cet amendement vise donc &#224; d&#233;terminer l&#233;galement les conditions du d&#233;clenchement de la r&#233;vision des prix dans ces trois cas.</p>",
    "annexeExposeSommaire": {
      "@xmlns:xsi": "http://www.w3.org/2001/XMLSchema-instance",
      "@xsi:nil": "true"
    },
    "cartoucheDelaiDepotDepasse": {
      "@xmlns:xsi": "http://www.w3.org/2001/XMLSchema-instance",
      "@xsi:nil": "true"
    },
    "avantAppel": {
      "@xmlns:xsi": "http://www.w3.org/2001/XMLSchema-instance",
      "@xsi:nil": "true"
    }
  },
  "representations": {
    "representation": {
      "nom": "PDF",
      "typeMime": {
        "type": "application",
        "subType": "PDF"
      },
      "statutRepresentation": {
        "verbatim": "true",
        "canonique": "true",
        "officielle": "true",
        "transcription": "false",
        "enregistrement": "false"
      },
      "repSource": {
        "@xmlns:xsi": "http://www.w3.org/2001/XMLSchema-instance",
        "@xsi:nil": "true"
      },
      "offset": {
        "@xmlns:xsi": "http://www.w3.org/2001/XMLSchema-instance",
        "@xsi:nil": "true"
      },
      "contenu": {
        "documentURI": "/15/amendements/2296/CION-SOC/AS121.pdf"
      },
      "dateDispoRepresentation": {
        "@xmlns:xsi": "http://www.w3.org/2001/XMLSchema-instance",
        "@xsi:nil": "true"
      }
    }
  },
  "seanceDiscussion": {
    "@xmlns:xsi": "http://www.w3.org/2001/XMLSchema-instance",
    "@xsi:nil": "true"
  },
  "sort": {
    "dateSaisie": "2019-10-16T15:09:34.000+02:00",
    "sortEnSeance": "Retiré"
  },
  "dateDepot": "2019-10-10T02:00:00.000+02:00",
  "dateDistribution": "2019-10-15T02:00:00.000+02:00",
  "article99": "0",
  "loiReference": {
    "codeLoi": "c sécurité sociale",
    "divisionCodeLoi": "L162-16-4"
  }
}