{
  "@xmlns": "http://schemas.assemblee-nationale.fr/referentiel",
  "uid": "AMANR5L15PO59046B0659P0D1N272",
  "identifiant": {
    "legislature": "15",
    "numero": "272",
    "numRect": "0",
    "saisine": {
      "refTexteLegislatif": "PRJLANR5L15B0659",
      "numeroPartiePLF": "0",
      "organeExamen": "PO59046",
      "mentionSecondeDeliberation": "0"
    }
  },
  "numeroLong": "DN272",
  "etapeTexte": "1ère lecture (1ère assemblée saisie)",
  "triAmendement": "jjho",
  "cardinaliteAmdtMultiples": "1",
  "amendementParent": {
    "@xmlns:xsi": "http://www.w3.org/2001/XMLSchema-instance",
    "@xsi:nil": "true"
  },
  "etat": "Discuté",
  "signataires": {
    "auteur": {
      "typeAuteur": "Depute",
      "acteurRef": "PA718780",
      "organeRef": {
        "@xmlns:xsi": "http://www.w3.org/2001/XMLSchema-instance",
        "@xsi:nil": "true"
      },
      "groupePolitiqueRef": "PO730934"
    },
    "cosignataires": {
      "acteurRef": [
        "PA718780",
        "PA342935"
      ]
    },
    "texteAffichable": "Mme&#160;Trastour-Isnart et Mme&#160;Marianne&#160;Dubois"
  },
  "pointeurFragmentTexte": {
    "missionVisee": {
      "@xmlns:xsi": "http://www.w3.org/2001/XMLSchema-instance",
      "@xsi:nil": "true"
    },
    "division": {
      "titre": "Article 18",
      "articleDesignationCourte": "ART. 18",
      "type": "ARTICLE",
      "avant_A_Apres": "A",
      "divisionRattachee": "ARTICLE 18",
      "articleAdditionnel": {
        "@xmlns:xsi": "http://www.w3.org/2001/XMLSchema-instance",
        "@xsi:nil": "true"
      },
      "chapitreAdditionnel": {
        "@xmlns:xsi": "http://www.w3.org/2001/XMLSchema-instance",
        "@xsi:nil": "true"
      },
      "urlDivisionTexteVise": "/15/textes/0659.asp#D_Article_18"
    },
    "alinea": {
      "avant_A_Apres": "A",
      "numero": "5",
      "alineaDesignation": "Alinéa 5"
    }
  },
  "corps": {
    "dispositif": "<p>A l&#8217;alin&#233;a 5, remplacer &#171;3500&#160;&#187; par &#171;&#160;6000&#160;&#187;.&#160;</p>",
    "exposeSommaire": "<p>L&#8217;article 18 restreint le seuil de la taille des communes o&#249; les militaires ont la possibilit&#233; d&#8217;accepter un mandat de conseiller municipal. Cet amendement vise &#224; augmenter ce seuil pour passer &#224; un seuil correspondant &#224; 95,0% des communes et non &#224; 91.3%. Ce seuil ne portera pas atteinte &#224; l&#8217;obligation de loyaut&#233;, au principe de neutralit&#233; et aux obligations de service du militaire.</p><p>Par ailleurs, la loi n&#176;2010-1563 sur la r&#233;forme des collectivit&#233;s territoriales valid&#233;e par la loi n&#176;2015-292 du 16 mars 2015 a pour objectif de favoriser le regroupement de communes. Ainsi en deux ans, 517 nouvelles communes ont &#233;t&#233; cr&#233;&#233;es (317 au 1er janvier 2016, 200 au 1er janvier 2017). Par cons&#233;quent, le nombre de communes de 3500 habitants est vou&#233; &#224; d&#233;cro&#238;tre, ce qui limitera la possibilit&#233; aux militaires de se pr&#233;senter aux &#233;lections municipales. Ce rehaussement de seuil pr&#233;vu par le pr&#233;sent amendement vise &#224; anticiper les cons&#233;quences de cette diminution.</p>",
    "annexeExposeSommaire": {
      "@xmlns:xsi": "http://www.w3.org/2001/XMLSchema-instance",
      "@xsi:nil": "true"
    }
  },
  "representations": {
    "representation": {
      "nom": "PDF",
      "typeMime": {
        "type": "application",
        "subType": "PDF"
      },
      "statutRepresentation": {
        "verbatim": "true",
        "canonique": "true",
        "officielle": "true",
        "transcription": "false",
        "enregistrement": "false"
      },
      "repSource": {
        "@xmlns:xsi": "http://www.w3.org/2001/XMLSchema-instance",
        "@xsi:nil": "true"
      },
      "offset": {
        "@xmlns:xsi": "http://www.w3.org/2001/XMLSchema-instance",
        "@xsi:nil": "true"
      },
      "contenu": {
        "documentURI": "/15/amendements/0659/CION_DEF/DN272.pdf"
      },
      "dateDispoRepresentation": {
        "@xmlns:xsi": "http://www.w3.org/2001/XMLSchema-instance",
        "@xsi:nil": "true"
      }
    }
  },
  "seanceDiscussion": {
    "@xmlns:xsi": "http://www.w3.org/2001/XMLSchema-instance",
    "@xsi:nil": "true"
  },
  "sort": {
    "dateSaisie": "2018-03-14T12:45:16.000+01:00",
    "sortEnSeance": "Retiré"
  },
  "dateDepot": "2018-03-09T01:00:00.000+01:00",
  "dateDistribution": "2018-03-12T01:00:00.000+01:00",
  "article99": "0",
  "loiReference": {
    "codeLoi": {
      "@xmlns:xsi": "http://www.w3.org/2001/XMLSchema-instance",
      "@xsi:nil": "true"
    },
    "divisionCodeLoi": {
      "@xmlns:xsi": "http://www.w3.org/2001/XMLSchema-instance",
      "@xsi:nil": "true"
    }
  }
}