{
  "@xmlns": "http://schemas.assemblee-nationale.fr/referentiel",
  "uid": "AMANR5L15PO59051B1802P0D1N868",
  "identifiant": {
    "legislature": "15",
    "numero": "868",
    "numRect": "0",
    "saisine": {
      "refTexteLegislatif": "PRJLANR5L15B1802",
      "numeroPartiePLF": "0",
      "organeExamen": "PO59051",
      "mentionSecondeDeliberation": "0"
    }
  },
  "numeroLong": "CL868",
  "etapeTexte": "1ère lecture (1ère assemblée saisie)",
  "triAmendement": "efaaaaaaaaaaaaaaaaaaaaaaaaaaaaaaaaaaaaaaaaaaaaaaaago",
  "cardinaliteAmdtMultiples": "1",
  "amendementParent": {
    "@xmlns:xsi": "http://www.w3.org/2001/XMLSchema-instance",
    "@xsi:nil": "true"
  },
  "etat": "Discuté",
  "signataires": {
    "auteur": {
      "typeAuteur": "Depute",
      "acteurRef": "PA335054",
      "organeRef": {
        "@xmlns:xsi": "http://www.w3.org/2001/XMLSchema-instance",
        "@xsi:nil": "true"
      },
      "groupePolitiqueRef": "PO758835"
    },
    "cosignataires": {
      "acteurRef": [
        "PA607553",
        "PA1198",
        "PA608695",
        "PA332614",
        "PA1008",
        "PA340357",
        "PA267233",
        "PA333285",
        "PA337483",
        "PA340343",
        "PA335054",
        "PA342415",
        "PA720988",
        "PA608172",
        "PA333818",
        "PA610681",
        "PA508",
        "PA609590",
        "PA1592",
        "PA335532",
        "PA608011",
        "PA642764",
        "PA1809",
        "PA608741",
        "PA643145",
        "PA429893",
        "PA719930",
        "PA609332",
        "PA605069"
      ]
    },
    "texteAffichable": "Mme&#160;Karamanli,  M.&#160;Vallaud, Mme&#160;Untermaier, Mme&#160;Pau-Langevin, M.&#160;Saulignac, Mme&#160;Pires Beaune, Mme&#160;Rabault, M.&#160;Aviragnet, Mme&#160;Bareigts, Mme&#160;Battistel, Mme&#160;Bi&#233;mouret, M.&#160;Bouillon, M.&#160;Jean-Louis&#160;Bricout, M.&#160;Carvounas, M.&#160;Alain&#160;David, Mme&#160;Laurence&#160;Dumont, M.&#160;Faure, M.&#160;Garot, M.&#160;David&#160;Habib, M.&#160;Hutin, M.&#160;Juanico, M.&#160;J&#233;r&#244;me&#160;Lambert, M.&#160;Letchimy, Mme&#160;Manin, M.&#160;Potier, M.&#160;Pueyo, Mme&#160;Tolmont, Mme&#160;Vainqueur-Christophe et Mme&#160;Victory"
  },
  "pointeurFragmentTexte": {
    "missionVisee": {
      "@xmlns:xsi": "http://www.w3.org/2001/XMLSchema-instance",
      "@xsi:nil": "true"
    },
    "division": {
      "titre": "Article 18",
      "articleDesignationCourte": "ART. 18",
      "type": "ARTICLE",
      "avant_A_Apres": "A",
      "divisionRattachee": "ARTICLE 18",
      "articleAdditionnel": {
        "@xmlns:xsi": "http://www.w3.org/2001/XMLSchema-instance",
        "@xsi:nil": "true"
      },
      "chapitreAdditionnel": {
        "@xmlns:xsi": "http://www.w3.org/2001/XMLSchema-instance",
        "@xsi:nil": "true"
      },
      "urlDivisionTexteVise": "/15/textes/1802.asp#D_Article_18"
    },
    "alinea": {
      "avant_A_Apres": {
        "@xmlns:xsi": "http://www.w3.org/2001/XMLSchema-instance",
        "@xsi:nil": "true"
      },
      "numero": "2",
      "alineaDesignation": {
        "@xmlns:xsi": "http://www.w3.org/2001/XMLSchema-instance",
        "@xsi:nil": "true"
      }
    }
  },
  "corps": {
    "dispositif": "<p style=\"text-align: justify;\">&#192; la fin de l&#8217;alin&#233;a&#160;2, substituer aux mots&#160;:</p><p style=\"text-align: justify;\">&#171;&#160;&#224; l&#8217;&#233;ch&#233;ance du d&#233;lai pr&#233;vu au&#160;I du pr&#233;sent article&#160;&#187;,</p><p style=\"text-align: justify;\">la date&#160;:</p><p style=\"text-align: justify;\">&#171;&#160;le&#160;1<sup>er</sup>&#160;janvier&#160;2024&#160;&#187;.</p>",
    "exposeSommaire": "<p style=\"text-align: justify;\">Cet amendement du groupe Socialistes et apparent&#233;s allonge de six mois le d&#233;lai laiss&#233; aux collectivit&#233;s apr&#232;s les renouvellements g&#233;n&#233;raux de leurs assembl&#233;es pour d&#233;finir de nouvelles r&#232;gles relatives au temps de travail. Ce d&#233;lai passe donc de douze &#224; dix-huit mois. Par ailleurs, il diff&#232;re l&#8217;application de ces nouvelles r&#232;gles, dans tous les cas, au 1er janvier qui suivra leur adoption.</p><p>Pour rappel, l&#8217;article&#160;18 a pour objet d&#8217;harmoniser la dur&#233;e du travail dans la fonction publique territoriale, en supprimant les r&#233;gimes d&#233;rogatoires existants &#224; la dur&#233;e l&#233;gale du travail, fix&#233;e &#224; 1 607 heures par an.</p><p>Le projet pr&#233;voit que chaque cat&#233;gorie de collectivit&#233; et chaque groupement concern&#233;s disposeront d&#8217;un d&#233;lai d&#8217;un an &#224; compter du renouvellement g&#233;n&#233;ral de leurs assembl&#233;es d&#233;lib&#233;rantes pour d&#233;finir les nouvelles r&#232;gles relatives au temps de travail de leurs agents qui, sauf r&#233;gimes particuliers li&#233;s &#224; des suj&#233;tions sp&#233;cifiques, ne pourra donc plus &#234;tre inf&#233;rieur &#224; 1&#160;607&#160;heures par an.</p><p>Compte tenu du calendrier des &#233;lections locales &#224; venir, l&#8217;harmonisation du temps de travail des agents de la FPT devrait donc &#234;tre effective, au plus tard, en mars 2021 pour le bloc communal, en mars 2022 pour les d&#233;partements et en d&#233;cembre 2022 pour les r&#233;gions. Sur cette derni&#232;re date, l'&#233;tude d'impact &#233;voque &#233;tonnamment le mois de \"<i>mars</i>\" 2022 pour les &#233;lections r&#233;gionales. Est-ce un scoop ou une coquille, nul ne le sait encore.</p><p>Ce d&#233;lai d&#8217;un an est trop court pour permettre aux nouvelles &#233;quipes &#233;lues de n&#233;gocier dans de bonnes conditions de nouveaux accords en mati&#232;re de temps de travail. De plus, les nouveaux r&#233;gimes de temps de travail, qui seront susceptibles d&#8217;avoir des impacts budg&#233;taires et comptables, ne peuvent pas entrer en application &#224; n&#8217;importe quelle date dans l&#8217;ann&#233;e.</p><p>Avec cet amendement, les collectivit&#233;s qui auront la volont&#233; et seront en capacit&#233; d&#8217;adopter rapidement de nouvelles r&#232;gles pourront les faire entrer en vigueur d&#232;s le 1er janvier suivant les &#233;lections (par exemple, d&#232;s le 1er janvier 2021 pour les communes qui auront d&#233;fini ces r&#232;gles avant cette date). Mais les collectivit&#233;s qui auront besoin de plus de temps pour d&#233;finir ces nouvelles r&#232;gles pourront b&#233;n&#233;ficier d&#8217;un d&#233;lai plus r&#233;aliste, sans pour autant repousser excessivement la mise en &#339;uvre effective de la g&#233;n&#233;ralisation des 1607 heures (pour les communes, par exemple, les 1607 heures seront mises en place au plus tard le 1er janvier 2022). Pour les r&#233;gions (dans lesquelles, en tout &#233;tat de cause, le temps de travail est d&#233;j&#224; majoritairement fix&#233; &#224; 1607 heures), la mise en &#339;uvre de ce d&#233;lai aboutira &#224; une mise en place pour les derni&#232;res r&#233;gions concern&#233;es, au plus tard le 1er janvier 2024.</p>",
    "annexeExposeSommaire": {
      "@xmlns:xsi": "http://www.w3.org/2001/XMLSchema-instance",
      "@xsi:nil": "true"
    },
    "cartoucheDelaiDepotDepasse": {
      "@xmlns:xsi": "http://www.w3.org/2001/XMLSchema-instance",
      "@xsi:nil": "true"
    }
  },
  "representations": {
    "representation": {
      "nom": "PDF",
      "typeMime": {
        "type": "application",
        "subType": "PDF"
      },
      "statutRepresentation": {
        "verbatim": "true",
        "canonique": "true",
        "officielle": "true",
        "transcription": "false",
        "enregistrement": "false"
      },
      "repSource": {
        "@xmlns:xsi": "http://www.w3.org/2001/XMLSchema-instance",
        "@xsi:nil": "true"
      },
      "offset": {
        "@xmlns:xsi": "http://www.w3.org/2001/XMLSchema-instance",
        "@xsi:nil": "true"
      },
      "contenu": {
        "documentURI": "/15/amendements/1802/CION_LOIS/CL868.pdf"
      },
      "dateDispoRepresentation": {
        "@xmlns:xsi": "http://www.w3.org/2001/XMLSchema-instance",
        "@xsi:nil": "true"
      }
    }
  },
  "seanceDiscussion": {
    "@xmlns:xsi": "http://www.w3.org/2001/XMLSchema-instance",
    "@xsi:nil": "true"
  },
  "sort": {
    "dateSaisie": "2019-05-03T12:13:55.000+02:00",
    "sortEnSeance": "Tombé"
  },
  "dateDepot": "2019-04-30T02:00:00.000+02:00",
  "dateDistribution": "2019-05-01T02:00:00.000+02:00",
  "article99": "0",
  "loiReference": {
    "codeLoi": "id",
    "divisionCodeLoi": {
      "@xmlns:xsi": "http://www.w3.org/2001/XMLSchema-instance",
      "@xsi:nil": "true"
    }
  }
}