{
  "@xmlns": "http://schemas.assemblee-nationale.fr/referentiel",
  "uid": "AMANR5L15PO766718B2187P0D1N1819",
  "identifiant": {
    "legislature": "15",
    "numero": "1819",
    "numRect": "0",
    "saisine": {
      "refTexteLegislatif": "PRJLANR5L15B2187",
      "numeroPartiePLF": "0",
      "organeExamen": "PO766718",
      "mentionSecondeDeliberation": "0"
    }
  },
  "numeroLong": "1819",
  "etapeTexte": "1ère lecture (1ère assemblée saisie)",
  "triAmendement": "acaaaaaaaaaaaaaaaaaaaaaaaaaaaaaaaaaaaaaaaaaaaaaaaahjahzxzh",
  "cardinaliteAmdtMultiples": "1",
  "amendementParent": {
    "@xmlns:xsi": "http://www.w3.org/2001/XMLSchema-instance",
    "@xsi:nil": "true"
  },
  "etat": "Discuté",
  "signataires": {
    "auteur": {
      "typeAuteur": "Depute",
      "acteurRef": "PA336175",
      "organeRef": {
        "@xmlns:xsi": "http://www.w3.org/2001/XMLSchema-instance",
        "@xsi:nil": "true"
      },
      "groupePolitiqueRef": "PO759900"
    },
    "cosignataires": {
      "acteurRef": [
        "PA607619",
        "PA267042",
        "PA336175",
        "PA755549",
        "PA331582",
        "PA405480",
        "PA608292",
        "PA605694"
      ]
    },
    "texteAffichable": "Mme&#160;Pinel,  M.&#160;Philippe&#160;Vigier, M.&#160;Brial, Mme&#160;Dubi&#233;, M.&#160;Falorni, M.&#160;Favennec Becot, M.&#160;Molac et M.&#160;Pupponi"
  },
  "pointeurFragmentTexte": {
    "missionVisee": {
      "@xmlns:xsi": "http://www.w3.org/2001/XMLSchema-instance",
      "@xsi:nil": "true"
    },
    "division": {
      "titre": "Article PREMIER",
      "articleDesignationCourte": "ART. PREMIER",
      "type": "ARTICLE",
      "avant_A_Apres": "A",
      "divisionRattachee": "ARTICLE PREMIER",
      "articleAdditionnel": {
        "@xmlns:xsi": "http://www.w3.org/2001/XMLSchema-instance",
        "@xsi:nil": "true"
      },
      "chapitreAdditionnel": {
        "@xmlns:xsi": "http://www.w3.org/2001/XMLSchema-instance",
        "@xsi:nil": "true"
      },
      "urlDivisionTexteVise": "/15/textes/2187.asp#D_Article_1er"
    },
    "alinea": {
      "avant_A_Apres": "Apres",
      "numero": "3",
      "alineaDesignation": {
        "@xmlns:xsi": "http://www.w3.org/2001/XMLSchema-instance",
        "@xsi:nil": "true"
      }
    }
  },
  "corps": {
    "dispositif": "<p style=\"text-align: justify;\">Apr&#232;s l&#8217;alin&#233;a&#160;3, ins&#233;rer l&#8217;alin&#233;a suivant&#160;:</p><p style=\"text-align: justify;\">&#171;&#160;L&#8217;assistance m&#233;dicale &#224; la procr&#233;ation a pour objet de rem&#233;dier &#224; l&#8217;infertilit&#233; biologiquement ou m&#233;dicalement constat&#233;e. Elle peut aussi avoir pour objet d&#8217;&#233;viter la transmission &#224; l&#8217;enfant ou &#224; l&#8217;un des membres du couple d&#8217;une maladie d&#8217;une particuli&#232;re gravit&#233;.&#160;&#187;</p>",
    "exposeSommaire": "<p style=\"text-align: justify;\">S&#8217;il faut saluer l&#8217;avanc&#233;e offerte dans le projet de loi en termes d&#8217;&#233;galit&#233; d&#8217;acc&#232;s aux techniques m&#233;dicales de procr&#233;ation pour toutes les femmes, la suppression du crit&#232;re d&#8217;infertilit&#233; ne nous semble pas satisfaisante.&#160;</p><p style=\"text-align: justify;\">Le pr&#233;sent amendement propose donc de repr&#233;ciser, au sein du code de sant&#233; publique la d&#233;finition de l&#8217;objet de l&#8217;AMP. En effet, l&#8217;ouverture de la PMA ne remet pas en cause l&#8217;acc&#232;s &#224; la PMA pour toutes celles et ceux qui ont un probl&#232;me de fertilit&#233;. L&#8217;amendement propose d&#8217;&#233;largir la formulation en vigueur relative &#224; la &#171;&#160;pathologie diagnostiqu&#233;e&#160;&#187; pour inclure les nouveaux b&#233;n&#233;ficiaires vis&#233;s par le pr&#233;sent projet de loi.</p><p style=\"text-align: justify;\">Le crit&#232;re d&#8217;infertilit&#233; est d&#8217;autant plus important que celle-ci peut toucher toutes les personnes, qu&#8217;importe leur orientation sexuelle.&#160;L&#8217;infertilit&#233; m&#233;dicale, doit pouvoir cohabiter avec l&#8217;infertilit&#233; sociale, les deux pouvant parfois se croiser.&#160;</p><p style=\"text-align: justify;\">En cas de suppression totale du crit&#232;re d&#8217;infertilit&#233;, il y a &#233;galement la crainte, &#224; terme, d&#8217;un d&#233;remboursement de tous types d&#180;AMP.</p><p style=\"text-align: justify;\"><br /> &#160;</p>",
    "annexeExposeSommaire": {
      "@xmlns:xsi": "http://www.w3.org/2001/XMLSchema-instance",
      "@xsi:nil": "true"
    },
    "cartoucheDelaiDepotDepasse": {
      "@xmlns:xsi": "http://www.w3.org/2001/XMLSchema-instance",
      "@xsi:nil": "true"
    },
    "avantAppel": {
      "@xmlns:xsi": "http://www.w3.org/2001/XMLSchema-instance",
      "@xsi:nil": "true"
    }
  },
  "representations": {
    "representation": {
      "nom": "PDF",
      "typeMime": {
        "type": "application",
        "subType": "PDF"
      },
      "statutRepresentation": {
        "verbatim": "true",
        "canonique": "true",
        "officielle": "true",
        "transcription": "false",
        "enregistrement": "false"
      },
      "repSource": {
        "@xmlns:xsi": "http://www.w3.org/2001/XMLSchema-instance",
        "@xsi:nil": "true"
      },
      "offset": {
        "@xmlns:xsi": "http://www.w3.org/2001/XMLSchema-instance",
        "@xsi:nil": "true"
      },
      "contenu": {
        "documentURI": "/15/amendements/2187/CSBIOETH/1819.pdf"
      },
      "dateDispoRepresentation": {
        "@xmlns:xsi": "http://www.w3.org/2001/XMLSchema-instance",
        "@xsi:nil": "true"
      }
    }
  },
  "seanceDiscussion": {
    "@xmlns:xsi": "http://www.w3.org/2001/XMLSchema-instance",
    "@xsi:nil": "true"
  },
  "sort": {
    "dateSaisie": "2019-09-10T23:18:53.000+02:00",
    "sortEnSeance": "Rejeté"
  },
  "dateDepot": "2019-09-05T02:00:00.000+02:00",
  "dateDistribution": "2019-09-10T02:00:00.000+02:00",
  "article99": "0",
  "loiReference": {
    "codeLoi": {
      "@xmlns:xsi": "http://www.w3.org/2001/XMLSchema-instance",
      "@xsi:nil": "true"
    },
    "divisionCodeLoi": {
      "@xmlns:xsi": "http://www.w3.org/2001/XMLSchema-instance",
      "@xsi:nil": "true"
    }
  }
}