{
  "@xmlns": "http://schemas.assemblee-nationale.fr/referentiel",
  "uid": "AMANR5L15PO59048B2272P1D1N947",
  "identifiant": {
    "legislature": "15",
    "numero": "947",
    "numRect": "0",
    "saisine": {
      "refTexteLegislatif": "PRJLANR5L15B2272",
      "numeroPartiePLF": "1",
      "organeExamen": "PO59048",
      "mentionSecondeDeliberation": "0"
    }
  },
  "numeroLong": "I-CF947",
  "etapeTexte": "1ère lecture (1ère assemblée saisie)",
  "triAmendement": "daaaaaaaaaaaaaaaaaaaaaaaaaaaaaaaaaaaaaaaaaaaaaaaaaacas",
  "cardinaliteAmdtMultiples": "1",
  "amendementParent": {
    "@xmlns:xsi": "http://www.w3.org/2001/XMLSchema-instance",
    "@xsi:nil": "true"
  },
  "etat": "Discuté",
  "signataires": {
    "auteur": {
      "typeAuteur": "Depute",
      "acteurRef": "PA332523",
      "organeRef": {
        "@xmlns:xsi": "http://www.w3.org/2001/XMLSchema-instance",
        "@xsi:nil": "true"
      },
      "groupePolitiqueRef": "PO730934"
    },
    "cosignataires": {
      "acteurRef": [
        "PA609726",
        "PA608416",
        "PA332523",
        "PA605036"
      ]
    },
    "texteAffichable": "Mme&#160;Dalloz,  M.&#160;Abad, M.&#160;Aubert et M.&#160;Hetzel"
  },
  "pointeurFragmentTexte": {
    "missionVisee": {
      "@xmlns:xsi": "http://www.w3.org/2001/XMLSchema-instance",
      "@xsi:nil": "true"
    },
    "division": {
      "titre": "Article 13",
      "articleDesignationCourte": "APRÈS ART. 13",
      "type": "ARTICLE",
      "avant_A_Apres": "Après",
      "divisionRattachee": "APRÈS L'ARTICLE 13, insérer l'article suivant:",
      "articleAdditionnel": "1",
      "chapitreAdditionnel": {
        "@xmlns:xsi": "http://www.w3.org/2001/XMLSchema-instance",
        "@xsi:nil": "true"
      },
      "urlDivisionTexteVise": "/15/textes/2272A.asp#D_Article_13"
    },
    "alinea": {
      "@xmlns:xsi": "http://www.w3.org/2001/XMLSchema-instance",
      "@xsi:nil": "true"
    }
  },
  "corps": {
    "dispositif": "<p style=\"text-align: justify;\">I.&#160;&#8211;&#160;Apr&#232;s l&#8217;article&#160;38 du code g&#233;n&#233;ral des imp&#244;ts, il est ins&#233;r&#233; un article&#160;38&#8209;0 <i>bis</i> ainsi r&#233;dig&#233;&#160;:</p><p style=\"text-align: justify;\">&#171;&#160;<i>Art.&#160;38&#8209;0 </i>bis.&#160;&#8211;&#160;Par d&#233;rogation &#224; l&#8217;article&#160;38, les entreprises individuelles soumises &#224; l&#8217;imp&#244;t sur le revenu ont la possibilit&#233; d&#8217;affecter &#224; un compte d&#8217;attente constitu&#233; au sein d&#8217;un &#233;tablissement bancaire disposant de toutes les accr&#233;ditations n&#233;cessaires, la part des b&#233;n&#233;fices r&#233;alis&#233;s, non distribu&#233;s et r&#233;investis sous forme de r&#233;serve dans l&#8217;entreprise individuelle, dans la limite de 40&#160;% du r&#233;sultat fiscal de l&#8217;exercice.</p><p style=\"text-align: justify;\">&#171;&#160;Les sommes affect&#233;es &#224; ce compte d&#8217;attente ne sont soumises ni aux pr&#233;l&#232;vements sociaux, ni &#224; l&#8217;imp&#244;t sur le revenu des personnes physiques.</p><p style=\"text-align: justify;\">&#171;&#160;Cette suspension de taxe prend fin lorsque l&#8217;exploitant d&#233;cide de pr&#233;lever les sommes.&#160;&#187;</p><p style=\"text-align: justify;\">II.&#160;&#8211;&#160;La perte de recettes pour l&#8217;&#201;tat est compens&#233;e &#224; due concurrence par la cr&#233;ation d&#8217;une taxe additionnelle aux droits mentionn&#233;s aux articles 575 et 575 A du code g&#233;n&#233;ral des imp&#244;ts.</p>",
    "exposeSommaire": "<p style=\"text-align: justify;\">Il convient de rappeler que la grande majorit&#233; des chefs d&#8217;entreprise de proximit&#233; sont assujettis &#224; l&#8217;imp&#244;t sur le revenu.</p><p style=\"text-align: justify;\">La baisse de l&#8217;imp&#244;t sur les soci&#233;t&#233;s n&#8217;aura aucun impact favorable pour ces entreprises.</p><p style=\"text-align: justify;\">Dans ce contexte, cet amendement vise &#224; rem&#233;dier &#224; un d&#233;s&#233;quilibre patent dans la charge fiscale portant sur les petites entreprises.</p><p style=\"text-align: justify;\">En effet, les b&#233;n&#233;fices des entreprises de proximit&#233; soumises &#224; l&#8217;imp&#244;t sur le revenu sont impos&#233;s en totalit&#233;, que ces b&#233;n&#233;fices soient utilis&#233;s pour r&#233;mun&#233;rer le chef d&#8217;entreprise ou qu&#8217;ils soient r&#233;investis pour accroitre les fonds propres.</p><p style=\"text-align: justify;\">&#192; b&#233;n&#233;fice &#233;gal, le chef d&#8217;une entreprise individuelle&#160;&#8211;&#160;EI doit acquitter les charges sociales et l&#8217;imp&#244;t sur le revenu sur l&#8217;int&#233;gralit&#233; du b&#233;n&#233;fice qu&#8217;il r&#233;alise&#160;&#8211;&#160;les g&#233;rants majoritaires, qui juridiquement sont des travailleurs ind&#233;pendants, sont aujourd&#8217;hui les seuls &#224; pouvoir d&#233;terminer l&#8217;assiette de leurs cotisations -, alors que le dirigeant d&#8217;EURL, de SARL ou de SAS, impos&#233; &#224; l&#8217;imp&#244;t sur les soci&#233;t&#233;s, ne subit ces pr&#233;l&#232;vements que sur sa r&#233;mun&#233;ration.</p><p style=\"text-align: justify;\">Les in&#233;galit&#233;s de traitement qui en r&#233;sultent doivent &#234;tre prises en compte et r&#233;duites autant que possible.</p><p style=\"text-align: justify;\">C&#8217;est l&#8217;objet de cet amendement qui propose un m&#233;canisme de suspension de taxation d&#8217;une partie des b&#233;n&#233;fices laiss&#233;s dans l&#8217;entreprise individuelle, via un compte d&#8217;attente.</p><p style=\"text-align: justify;\">L&#8217;entrepreneur aurait ainsi la possibilit&#233; de provisionner ce compte, temporairement exempt de pr&#233;l&#232;vements sociaux et d&#8217;imp&#244;t sur le revenu, &#224; hauteur de 40&#160;% maximum du r&#233;sultat fiscal de l&#8217;exercice.</p>",
    "annexeExposeSommaire": {
      "@xmlns:xsi": "http://www.w3.org/2001/XMLSchema-instance",
      "@xsi:nil": "true"
    },
    "cartoucheDelaiDepotDepasse": {
      "@xmlns:xsi": "http://www.w3.org/2001/XMLSchema-instance",
      "@xsi:nil": "true"
    },
    "avantAppel": {
      "@xmlns:xsi": "http://www.w3.org/2001/XMLSchema-instance",
      "@xsi:nil": "true"
    }
  },
  "representations": {
    "representation": {
      "nom": "PDF",
      "typeMime": {
        "type": "application",
        "subType": "PDF"
      },
      "statutRepresentation": {
        "verbatim": "true",
        "canonique": "true",
        "officielle": "true",
        "transcription": "false",
        "enregistrement": "false"
      },
      "repSource": {
        "@xmlns:xsi": "http://www.w3.org/2001/XMLSchema-instance",
        "@xsi:nil": "true"
      },
      "offset": {
        "@xmlns:xsi": "http://www.w3.org/2001/XMLSchema-instance",
        "@xsi:nil": "true"
      },
      "contenu": {
        "documentURI": "/15/amendements/2272A/CION_FIN/CF947.pdf"
      },
      "dateDispoRepresentation": {
        "@xmlns:xsi": "http://www.w3.org/2001/XMLSchema-instance",
        "@xsi:nil": "true"
      }
    }
  },
  "seanceDiscussion": {
    "@xmlns:xsi": "http://www.w3.org/2001/XMLSchema-instance",
    "@xsi:nil": "true"
  },
  "sort": {
    "dateSaisie": "2019-10-09T22:17:39.000+02:00",
    "sortEnSeance": "Rejeté"
  },
  "dateDepot": "2019-10-04T02:00:00.000+02:00",
  "dateDistribution": "2019-10-08T02:00:00.000+02:00",
  "article99": "0",
  "loiReference": {
    "codeLoi": "CGI",
    "divisionCodeLoi": "38"
  }
}