{
  "@xmlns": "http://schemas.assemblee-nationale.fr/referentiel",
  "uid": "AMANR5L15PO59048B1516P0D1N5",
  "identifiant": {
    "legislature": "15",
    "numero": "5",
    "numRect": "0",
    "saisine": {
      "refTexteLegislatif": "PRJLANR5L15B1516",
      "numeroPartiePLF": "0",
      "organeExamen": "PO59048",
      "mentionSecondeDeliberation": "0"
    }
  },
  "numeroLong": "CF5",
  "etapeTexte": "1ère lecture (1ère assemblée saisie)",
  "triAmendement": "daaaaaaaaaaaaaaaaaaaaaaaaaaaaaaaaaaaaaaaaaaaaaaaaak",
  "cardinaliteAmdtMultiples": "1",
  "amendementParent": {
    "@xmlns:xsi": "http://www.w3.org/2001/XMLSchema-instance",
    "@xsi:nil": "true"
  },
  "etat": "Discuté",
  "signataires": {
    "auteur": {
      "typeAuteur": "Depute",
      "acteurRef": "PA712015",
      "organeRef": {
        "@xmlns:xsi": "http://www.w3.org/2001/XMLSchema-instance",
        "@xsi:nil": "true"
      },
      "groupePolitiqueRef": "PO730934"
    },
    "cosignataires": {
      "acteurRef": [
        "PA609245",
        "PA721506",
        "PA266793",
        "PA340853",
        "PA712015",
        "PA721046",
        "PA718850",
        "PA709315",
        "PA267429",
        "PA332523"
      ]
    },
    "texteAffichable": "M.&#160;Dive,  M.&#160;Viala, Mme&#160;Dalloz, M.&#160;Cordier, M.&#160;Cinieri, M.&#160;Bony, Mme&#160;Kuster, Mme&#160;Bassire, M.&#160;Leclerc et Mme&#160;Lacroute"
  },
  "pointeurFragmentTexte": {
    "missionVisee": {
      "@xmlns:xsi": "http://www.w3.org/2001/XMLSchema-instance",
      "@xsi:nil": "true"
    },
    "division": {
      "titre": "Article 2",
      "articleDesignationCourte": "ART. 2",
      "type": "ARTICLE",
      "avant_A_Apres": "A",
      "divisionRattachee": "ARTICLE 2",
      "articleAdditionnel": {
        "@xmlns:xsi": "http://www.w3.org/2001/XMLSchema-instance",
        "@xsi:nil": "true"
      },
      "chapitreAdditionnel": {
        "@xmlns:xsi": "http://www.w3.org/2001/XMLSchema-instance",
        "@xsi:nil": "true"
      },
      "urlDivisionTexteVise": "/15/textes/1516.asp#D_Article_2"
    },
    "alinea": {
      "avant_A_Apres": "Apres",
      "numero": "3",
      "alineaDesignation": {
        "@xmlns:xsi": "http://www.w3.org/2001/XMLSchema-instance",
        "@xsi:nil": "true"
      }
    }
  },
  "corps": {
    "dispositif": "<p style=\"text-align: justify;\">I.&#160;&#8211;&#160;Apr&#232;s les mots&#160;:</p><p style=\"text-align: justify;\">&#171;&#160;fix&#233;es par cet article&#160;&#187;</p><p style=\"text-align: justify;\">supprimer la fin de l&#8217;alin&#233;a&#160;3.</p><p style=\"text-align: justify;\">II.&#160;&#8211;&#160;Apr&#232;s l&#8217;alin&#233;a&#160;5, ins&#233;rer les alin&#233;as suivants&#160;:</p><p style=\"text-align: justify;\">&#171;&#160;II.&#160;&#8211;&#160;Les dispositions du I sont applicables&#160;:</p><p style=\"text-align: justify;\">&#171;&#160;&#8211;&#160;dans la limite du contingent annuel d&#8217;heures suppl&#233;mentaires d&#233;fini &#224; l&#8217;article&#160;3121&#8209;30 du code du travail et pr&#233;vu par une convention ou un accord collectif d&#8217;entreprise ou d&#8217;&#233;tablissement ou, &#224; d&#233;faut, par une convention ou un accord de branche&#160;;</p><p style=\"text-align: justify;\">&#171;&#160;&#8211;&#160;dans la limite de la dur&#233;e maximale des heures compl&#233;mentaires pouvant &#234;tre accomplies, mentionn&#233;e &#224; l&#8217;article L.&#160;3123&#8209;20 du m&#234;me code.</p><p style=\"text-align: justify;\">&#171;&#160;&#192; d&#233;faut d&#8217;accord, ou si les salari&#233;s ne sont pas concern&#233;s par des dispositions conventionnelles, la limite annuelle est fix&#233;e par d&#233;cret.&#160;&#187;</p><p style=\"text-align: justify;\">III.&#160;&#8211;&#160;Compl&#233;ter cet article par les deux alin&#233;as suivants&#160;:</p><p style=\"text-align: justify;\">&#171;&#160;II.&#160;&#8211;&#160;La perte de recettes pour l&#8217;&#201;tat est compens&#233;e &#224; due concurrence par la cr&#233;ation d&#8217;une taxe additionnelle aux droits mentionn&#233;s aux articles 575 et 575 A du code g&#233;n&#233;ral des imp&#244;ts.</p><p style=\"text-align: justify;\">&#171;&#160;III.&#160;&#8211;&#160;La perte de recettes pour les organismes de s&#233;curit&#233; sociale est compens&#233;e &#224; due concurrence par la majoration des droits mentionn&#233;s aux articles 575 et 575 A du code g&#233;n&#233;ral des imp&#244;ts.&#160;&#187;.</p>",
    "exposeSommaire": "<p style=\"text-align: justify;\">Afin de conforter le dialogue social et ne pas faire de la d&#233;fiscalisation des heures suppl&#233;mentaires un frein &#224; l&#8217;embauche, cet amendement pr&#233;voit de plafonner le volume d&#8217;heures suppl&#233;mentaires &#233;ligibles au dispositif d&#8217;exon&#233;rations, par des dispositions conventionnelles et &#224; d&#233;faut, r&#233;glementaires.</p>",
    "annexeExposeSommaire": {
      "@xmlns:xsi": "http://www.w3.org/2001/XMLSchema-instance",
      "@xsi:nil": "true"
    },
    "cartoucheDelaiDepotDepasse": {
      "@xmlns:xsi": "http://www.w3.org/2001/XMLSchema-instance",
      "@xsi:nil": "true"
    }
  },
  "representations": {
    "representation": {
      "nom": "PDF",
      "typeMime": {
        "type": "application",
        "subType": "PDF"
      },
      "statutRepresentation": {
        "verbatim": "true",
        "canonique": "true",
        "officielle": "true",
        "transcription": "false",
        "enregistrement": "false"
      },
      "repSource": {
        "@xmlns:xsi": "http://www.w3.org/2001/XMLSchema-instance",
        "@xsi:nil": "true"
      },
      "offset": {
        "@xmlns:xsi": "http://www.w3.org/2001/XMLSchema-instance",
        "@xsi:nil": "true"
      },
      "contenu": {
        "documentURI": "/15/amendements/1516/CION_FIN/CF5.pdf"
      },
      "dateDispoRepresentation": {
        "@xmlns:xsi": "http://www.w3.org/2001/XMLSchema-instance",
        "@xsi:nil": "true"
      }
    }
  },
  "seanceDiscussion": {
    "@xmlns:xsi": "http://www.w3.org/2001/XMLSchema-instance",
    "@xsi:nil": "true"
  },
  "sort": {
    "dateSaisie": "2018-12-19T18:14:12.000+01:00",
    "sortEnSeance": "Rejeté"
  },
  "dateDepot": "2018-12-19T01:00:00.000+01:00",
  "dateDistribution": "2018-12-19T01:00:00.000+01:00",
  "article99": "0",
  "loiReference": {
    "codeLoi": {
      "@xmlns:xsi": "http://www.w3.org/2001/XMLSchema-instance",
      "@xsi:nil": "true"
    },
    "divisionCodeLoi": {
      "@xmlns:xsi": "http://www.w3.org/2001/XMLSchema-instance",
      "@xsi:nil": "true"
    }
  }
}