{
  "@xmlns": "http://schemas.assemblee-nationale.fr/referentiel",
  "uid": "AMANR5L15SEA717460B1255P1D1N1061",
  "identifiant": {
    "legislature": "15",
    "numero": "1061",
    "numRect": "0",
    "saisine": {
      "refTexteLegislatif": "PRJLANR5L15B1255",
      "numeroPartiePLF": "1",
      "organeExamen": "PO717460",
      "mentionSecondeDeliberation": "0"
    }
  },
  "numeroLong": "I-1061",
  "etapeTexte": "1ère lecture (1ère assemblée saisie)",
  "triAmendement": "bgaaaaaaaaaaaaaaaaaaaaaaaaaaaaaaaaaaaaaaaaaaaaaaaabwo",
  "cardinaliteAmdtMultiples": "1",
  "amendementParent": {
    "@xmlns:xsi": "http://www.w3.org/2001/XMLSchema-instance",
    "@xsi:nil": "true"
  },
  "etat": "Discuté",
  "signataires": {
    "auteur": {
      "typeAuteur": "Depute",
      "acteurRef": "PA340853",
      "organeRef": {
        "@xmlns:xsi": "http://www.w3.org/2001/XMLSchema-instance",
        "@xsi:nil": "true"
      },
      "groupePolitiqueRef": "PO730934"
    },
    "cosignataires": {
      "acteurRef": [
        "PA719318",
        "PA606712",
        "PA720684",
        "PA266793",
        "PA605036",
        "PA718884",
        "PA718784",
        "PA709315",
        "PA340853",
        "PA330909",
        "PA721678",
        "PA608416",
        "PA609245",
        "PA643134"
      ]
    },
    "texteAffichable": "M.&#160;Leclerc,  Mme&#160;Anthoine, Mme&#160;Bazin-Malgras, M.&#160;Bony, M.&#160;Pierre-Henri&#160;Dumont, M.&#160;Hetzel, Mme&#160;Lacroute, M.&#160;Viala, M.&#160;Abad, M.&#160;Pauget, M.&#160;Lurton, Mme&#160;Valentin, M.&#160;Descoeur et M.&#160;Reda"
  },
  "pointeurFragmentTexte": {
    "missionVisee": {
      "@xmlns:xsi": "http://www.w3.org/2001/XMLSchema-instance",
      "@xsi:nil": "true"
    },
    "division": {
      "titre": "Article 7",
      "articleDesignationCourte": "ART. 7",
      "type": "ARTICLE",
      "avant_A_Apres": "A",
      "divisionRattachee": "ARTICLE 7",
      "articleAdditionnel": {
        "@xmlns:xsi": "http://www.w3.org/2001/XMLSchema-instance",
        "@xsi:nil": "true"
      },
      "chapitreAdditionnel": {
        "@xmlns:xsi": "http://www.w3.org/2001/XMLSchema-instance",
        "@xsi:nil": "true"
      },
      "urlDivisionTexteVise": "/15/textes/1255A.asp#D_Article_7"
    },
    "alinea": {
      "avant_A_Apres": {
        "@xmlns:xsi": "http://www.w3.org/2001/XMLSchema-instance",
        "@xsi:nil": "true"
      },
      "numero": "13",
      "alineaDesignation": {
        "@xmlns:xsi": "http://www.w3.org/2001/XMLSchema-instance",
        "@xsi:nil": "true"
      }
    }
  },
  "corps": {
    "dispositif": "<p style=\"text-align: justify;\">I.&#160;&#8211;&#160;Substituer aux alin&#233;as 13 &#224; 15 les deux alin&#233;as suivants&#160;:</p><p style=\"text-align: justify;\">&#171;&#160;1&#176;&#160;Au premier alin&#233;a du 1 du B du I, le taux&#160;: &#171;&#160;3.6&#160;%&#160;&#187; est remplac&#233; par le taux&#160;: &#171;&#160;1.8&#160;%&#160;&#187;&#160;;</p><p style=\"text-align: justify;\">&#171;&#160;2&#176;&#160;&#192; la fin de la seconde phrase du II, le taux&#160;: &#171;&#160;4,4&#160;%&#160;&#187; est remplac&#233; par le taux&#160;: &#171;&#160;2.2&#160;%&#160;&#187;.</p><p style=\"text-align: justify;\">II.&#160;&#8211;&#160;Compl&#233;ter cet article par l&#8217;alin&#233;a suivant&#160;:</p><p style=\"text-align: justify;\">&#171;&#160;III.&#160;&#8211; La perte de recettes pour l&#8217;&#201;tat est compens&#233;e, &#224; due concurrence, par la cr&#233;ation d&#8217;une taxe additionnelle aux droits sur les tabacs mentionn&#233;e aux articles 575 et 575&#160;A du code g&#233;n&#233;ral des imp&#244;ts.&#160;&#187;</p>",
    "exposeSommaire": "<p style=\"text-align: justify;\">Actuellement, la tr&#233;sorerie g&#233;n&#233;rale pr&#233;l&#232;ve 8&#160;% de frais de gestion et de recouvrement pour le pr&#233;l&#232;vement de la Taxe d&#8217;Enl&#232;vement des Ordures M&#233;nag&#232;res (TEOM). Ils se d&#233;composent d&#8217;une part, des frais de d&#233;gr&#232;vement et de non-valeurs (4,4&#160;%) et, d&#8217;autre part, des frais d&#8217;assiette et de recouvrement (3,6&#160;%), soit 8&#160;% du produit total.</p><p style=\"text-align: justify;\">En r&#233;alit&#233;, les frais de gestion sont sur&#233;valu&#233;s. Or, il est difficilement acceptable que l&#8217;&#201;tat laisse se p&#233;renniser des pr&#233;l&#232;vements d&#233;tach&#233;s des fondements r&#233;els que sont les d&#233;penses qu&#8217;ils sont cens&#233;s compenser.</p><p style=\"text-align: justify;\">Le projet de loi de finances pour 2019 propose de r&#233;duire &#224; 3&#160;% les frais d&#8217;assiette, de recouvrement et de d&#233;gr&#232;vement &#224; la charge du contribuable mais uniquement au titre des 3 premi&#232;res ann&#233;es lorsqu&#8217;il est mis en &#339;uvre une TEOM incitative.</p><p style=\"text-align: justify;\">&#160;</p><p style=\"text-align: justify;\">Cette mesure s&#8217;av&#232;re insuffisante. C&#8217;est pourquoi, il est demand&#233; de les diminuer afin que les frais de gestion correspondent aux d&#233;penses de gestion que supportent r&#233;ellement l&#8217;&#201;tat.</p>",
    "annexeExposeSommaire": {
      "@xmlns:xsi": "http://www.w3.org/2001/XMLSchema-instance",
      "@xsi:nil": "true"
    }
  },
  "representations": {
    "representation": {
      "nom": "PDF",
      "typeMime": {
        "type": "application",
        "subType": "PDF"
      },
      "statutRepresentation": {
        "verbatim": "true",
        "canonique": "true",
        "officielle": "true",
        "transcription": "false",
        "enregistrement": "false"
      },
      "repSource": {
        "@xmlns:xsi": "http://www.w3.org/2001/XMLSchema-instance",
        "@xsi:nil": "true"
      },
      "offset": {
        "@xmlns:xsi": "http://www.w3.org/2001/XMLSchema-instance",
        "@xsi:nil": "true"
      },
      "contenu": {
        "documentURI": "/15/amendements/1255A/AN/1061.pdf"
      },
      "dateDispoRepresentation": {
        "@xmlns:xsi": "http://www.w3.org/2001/XMLSchema-instance",
        "@xsi:nil": "true"
      }
    }
  },
  "seanceDiscussion": "RUANR5L15S2019IDS21279",
  "sort": {
    "dateSaisie": "2018-10-18T19:42:25.000+02:00",
    "sortEnSeance": "Rejeté"
  },
  "dateDepot": "2018-10-11T02:00:00.000+02:00",
  "dateDistribution": "2018-10-14T02:00:00.000+02:00",
  "article99": "0",
  "loiReference": {
    "codeLoi": {
      "@xmlns:xsi": "http://www.w3.org/2001/XMLSchema-instance",
      "@xsi:nil": "true"
    },
    "divisionCodeLoi": {
      "@xmlns:xsi": "http://www.w3.org/2001/XMLSchema-instance",
      "@xsi:nil": "true"
    }
  }
}