{
  "@xmlns": "http://schemas.assemblee-nationale.fr/referentiel",
  "uid": "AMANR5L15PO59051B1933P0D1N62",
  "identifiant": {
    "legislature": "15",
    "numero": "62",
    "numRect": "0",
    "saisine": {
      "refTexteLegislatif": "PIONANR5L15B1933",
      "numeroPartiePLF": "0",
      "organeExamen": "PO59051",
      "mentionSecondeDeliberation": "0"
    }
  },
  "numeroLong": "CL62",
  "etapeTexte": "1ère lecture (1ère assemblée saisie)",
  "triAmendement": "kaaaaaaaaaaaaaaaaaaaaaaaaaaaaaaaaaaaaaaaaaaaaaaaaaad",
  "cardinaliteAmdtMultiples": "1",
  "amendementParent": {
    "@xmlns:xsi": "http://www.w3.org/2001/XMLSchema-instance",
    "@xsi:nil": "true"
  },
  "etat": "Discuté",
  "signataires": {
    "auteur": {
      "typeAuteur": "Depute",
      "acteurRef": "PA330240",
      "organeRef": {
        "@xmlns:xsi": "http://www.w3.org/2001/XMLSchema-instance",
        "@xsi:nil": "true"
      },
      "groupePolitiqueRef": "PO730934"
    },
    "cosignataires": {
      "acteurRef": "PA330240"
    },
    "texteAffichable": "M.&#160;Ciotti, rapporteur"
  },
  "pointeurFragmentTexte": {
    "missionVisee": {
      "@xmlns:xsi": "http://www.w3.org/2001/XMLSchema-instance",
      "@xsi:nil": "true"
    },
    "division": {
      "titre": "Article 8",
      "articleDesignationCourte": "APRÈS ART. 8",
      "type": "ARTICLE",
      "avant_A_Apres": "Après",
      "divisionRattachee": "APRÈS L'ARTICLE 8, insérer l'article suivant:",
      "articleAdditionnel": "1",
      "chapitreAdditionnel": {
        "@xmlns:xsi": "http://www.w3.org/2001/XMLSchema-instance",
        "@xsi:nil": "true"
      },
      "urlDivisionTexteVise": "/15/textes/1933.asp#D_Article_8"
    },
    "alinea": {
      "@xmlns:xsi": "http://www.w3.org/2001/XMLSchema-instance",
      "@xsi:nil": "true"
    }
  },
  "corps": {
    "dispositif": "<p style=\"text-align: justify;\">Le&#160;I de l&#8217;article&#160;15&#8209;4 du code de proc&#233;dure p&#233;nale est ainsi modifi&#233;&#160;:</p><p style=\"text-align: justify;\">1&#176;&#160;Apr&#232;s le mot&#160;: &#171;&#160;proc&#233;dures&#160;&#187;, la fin du troisi&#232;me alin&#233;a est ainsi r&#233;dig&#233;e&#160;: &#171;&#160;portant sur un crime ou un d&#233;lit.&#160;&#187;&#160;;</p><p style=\"text-align: justify;\">2&#176;&#160;Les&#160;1&#176; et&#160;2&#176; sont abrog&#233;s.</p>",
    "exposeSommaire": "<p>La loi du 28 f&#233;vrier 2017 relative &#224; la s&#233;curit&#233; publique a &#233;largi les conditions dans lesquelles les agents intervenant dans le cadre d&#8217;une proc&#233;dure judiciaire peuvent prot&#233;ger leur identit&#233; et faire mention, en lieu et place de leurs nom et pr&#233;nom, d&#8217;un num&#233;ro d&#8217;immatriculation, de leur qualit&#233; et de leur service ou unit&#233; d&#8217;affectation. Initialement r&#233;serv&#233;e aux agents affect&#233;s dans les services de police judiciaire sp&#233;cialement charg&#233;s de la lutte contre le terrorisme (article&#160;706&#8209;24 du code de proc&#233;dure p&#233;nale), cette facult&#233; a &#233;t&#233; &#233;tendue aux proc&#233;dures portant sur un crime ou un d&#233;lit puni d&#8217;au moins trois ans d&#8217;emprisonnement ainsi qu&#8217;&#224; celles portant sur un d&#233;lit puni de moins de trois ans d&#8217;emprisonnement &#171;&#160;<i>lorsqu&#8217;en raison de circonstances particuli&#232;res dans la commission des faits ou de la personnalit&#233; des personnes mises en cause, la r&#233;v&#233;lation de l&#8217;identit&#233; de l&#8217;agent est susceptible de mettre en danger sa vie ou son int&#233;grit&#233; physique ou celles de ses proches</i>&#160;&#187; (article&#160;15&#8209;4 du m&#234;me code).</p><p style=\"text-align: justify;\">La loi du 23 mars 2019 de programmation et de r&#233;forme pour la justice a modifi&#233; &#224; la marge ce r&#233;gime en permettant la protection de l&#8217;identit&#233; des agents de police et de gendarmerie non seulement dans les actes de proc&#233;dure qu&#8217;ils &#233;tablissent mais aussi sur ceux dans desquels ils interviennent. Elle a &#233;galement autoris&#233; officiers et agents de police judiciaire &#224; s&#8217;identifier, dans les proc&#232;s-verbaux de d&#233;p&#244;ts de plaintes, par leur num&#233;ro d&#8217;immatriculation administrative.</p><p style=\"text-align: justify;\">Le pr&#233;sent amendement vise &#224; aller plus loin afin de renforcer la protection que nous devons garantir aux agents de la gendarmerie et de la police nationales en &#233;tendant cette facult&#233; &#224; toutes les proc&#233;dures portant sur un crime ou un d&#233;lit, quelle que soit la peine d&#8217;emprisonnement encourue et sans consid&#233;ration des circonstances particuli&#232;res de la proc&#233;dure en cause. En effet, ces circonstances ne sont pas toujours ais&#233;es &#224; &#233;tablir et il existe une porosit&#233; croissante entre les proc&#233;dures p&#233;nales justifiant la protection de l&#8217;identit&#233; de ces agents, la d&#233;linquance la plus dangereuse s'inscrivant dans un continuum de faits r&#233;pr&#233;hensibles susceptible d'&#233;voluer rapidement.</p><p style=\"text-align: justify;\">L&#8217;&#233;largissement propos&#233;e de ce dispositif demeurerait conforme aux exigences constitutionnelles et conventionnelles applicables en mati&#232;re de respect des droits de la d&#233;fense et de droit &#224; un proc&#232;s &#233;quitable&#160;:</p><p style=\"text-align: justify;\">- sa mise en &#339;uvre demeurerait condition&#233;e &#224; la d&#233;livrance pr&#233;alable d'une autorisation nominative fond&#233;e sur la nature des missions exerc&#233;es par l&#8217;agent, comme l&#8217;exige la CEDH, en &#233;tant r&#233;serv&#233; au cas o&#249; la r&#233;v&#233;lation de l&#8217;identit&#233; de l&#8217;agent est &#171;&#160;<i>susceptible, compte tenu des conditions d&#8217;exercice de sa mission ou de la nature des faits qu&#8217;il est habituellement amen&#233; &#224; constater, de mettre en danger sa vie ou son int&#233;grit&#233; physique ou celle de ses proches</i>&#160;&#187;&#160;;</p><p style=\"text-align: justify;\">- ce dispositif ne serait pas applicable lorsque l&#8217;agent b&#233;n&#233;ficiant d&#8217;une autorisation serait entendu en audition libre ou en garde &#224; vue &#224; raison d&#8217;un acte commis dans l&#8217;exercice de ses fonctions ou ferait l&#8217;objet d&#8217;une proc&#233;dure p&#233;nale&#160;;</p><p style=\"text-align: justify;\">- les juridictions d&#8217;instruction et de jugement auraient toujours acc&#232;s aux nom et pr&#233;nom de l&#8217;agent et pourraient, sous certaines conditions, donner acc&#232;s &#224; ces informations &#224; une partie qui le demande.</p><p style=\"text-align: justify;\">Votre rapporteur rappelle qu'il n&#8217;est pas ici question de permettre l&#8217;anonymat des forces de police et de gendarmerie dans leurs actes d&#8217;enqu&#234;te ni d&#8217;emp&#234;cher que les enqu&#234;teurs soient identifi&#233;s ou identifiables. Au contraire, leur identification, &#224; travers d&#8217;autres &#233;l&#233;ments que leurs nom et pr&#233;nom, est conserv&#233;e et leur identification nominative demeure possible sur d&#233;cision judiciaire.</p><p style=\"text-align: justify;\">Un dispositif aussi large existe d&#8217;ailleurs dans d&#8217;autres pays, comme l&#8217;Espagne.</p>",
    "annexeExposeSommaire": {
      "@xmlns:xsi": "http://www.w3.org/2001/XMLSchema-instance",
      "@xsi:nil": "true"
    },
    "cartoucheDelaiDepotDepasse": {
      "@xmlns:xsi": "http://www.w3.org/2001/XMLSchema-instance",
      "@xsi:nil": "true"
    }
  },
  "representations": {
    "representation": {
      "nom": "PDF",
      "typeMime": {
        "type": "application",
        "subType": "PDF"
      },
      "statutRepresentation": {
        "verbatim": "true",
        "canonique": "true",
        "officielle": "true",
        "transcription": "false",
        "enregistrement": "false"
      },
      "repSource": {
        "@xmlns:xsi": "http://www.w3.org/2001/XMLSchema-instance",
        "@xsi:nil": "true"
      },
      "offset": {
        "@xmlns:xsi": "http://www.w3.org/2001/XMLSchema-instance",
        "@xsi:nil": "true"
      },
      "contenu": {
        "documentURI": "/15/amendements/1933/CION_LOIS/CL62.pdf"
      },
      "dateDispoRepresentation": {
        "@xmlns:xsi": "http://www.w3.org/2001/XMLSchema-instance",
        "@xsi:nil": "true"
      }
    }
  },
  "seanceDiscussion": {
    "@xmlns:xsi": "http://www.w3.org/2001/XMLSchema-instance",
    "@xsi:nil": "true"
  },
  "sort": {
    "dateSaisie": "2019-06-12T11:09:53.000+02:00",
    "sortEnSeance": "Rejeté"
  },
  "dateDepot": "2019-06-11T02:00:00.000+02:00",
  "dateDistribution": "2019-06-11T02:00:00.000+02:00",
  "article99": "0",
  "loiReference": {
    "codeLoi": "procédure pénale",
    "divisionCodeLoi": "15-4"
  }
}