{
  "@xmlns": "http://schemas.assemblee-nationale.fr/referentiel",
  "uid": "AMANR5L15SEA717460B0235P2D1N1782",
  "identifiant": {
    "legislature": "15",
    "numero": "1782",
    "numRect": "0",
    "saisine": {
      "refTexteLegislatif": "PRJLANR5L15B0235",
      "numeroPartiePLF": "2",
      "organeExamen": "PO717460",
      "mentionSecondeDeliberation": "0"
    }
  },
  "numeroLong": "II-1782",
  "etapeTexte": "1ère lecture (1ère assemblée saisie)",
  "triAmendement": "azrhzzzynu",
  "cardinaliteAmdtMultiples": "1",
  "amendementParent": {
    "@xmlns:xsi": "http://www.w3.org/2001/XMLSchema-instance",
    "@xsi:nil": "true"
  },
  "etat": "Retiré",
  "signataires": {
    "auteur": {
      "typeAuteur": "Depute",
      "acteurRef": "PA336175",
      "organeRef": {
        "@xmlns:xsi": "http://www.w3.org/2001/XMLSchema-instance",
        "@xsi:nil": "true"
      },
      "groupePolitiqueRef": "PO723569"
    },
    "cosignataires": {
      "acteurRef": [
        "PA336175",
        "PA608292",
        "PA605694"
      ]
    },
    "texteAffichable": "Mme&#160;Pinel,  Mme&#160;Dubi&#233; et M.&#160;Falorni"
  },
  "pointeurFragmentTexte": {
    "missionVisee": {
      "@xmlns:xsi": "http://www.w3.org/2001/XMLSchema-instance",
      "@xsi:nil": "true"
    },
    "division": {
      "titre": "Article 39",
      "articleDesignationCourte": "APRÈS ART. 39",
      "type": "ARTICLE",
      "avant_A_Apres": "Après",
      "divisionRattachee": "APRÈS L'ARTICLE 39, insérer l'article suivant:",
      "articleAdditionnel": "1",
      "chapitreAdditionnel": {
        "@xmlns:xsi": "http://www.w3.org/2001/XMLSchema-instance",
        "@xsi:nil": "true"
      },
      "urlDivisionTexteVise": "/15/textes/0235C.asp#D_Article_39"
    },
    "alinea": {
      "@xmlns:xsi": "http://www.w3.org/2001/XMLSchema-instance",
      "@xsi:nil": "true"
    }
  },
  "corps": {
    "dispositif": "<p style=\"text-align: justify;\">I.&#160;&#8211;&#160;Au I de l&#8217;article&#160;199 sexvicies du code g&#233;n&#233;ral des imp&#244;ts, l&#8217;ann&#233;e&#160;: &#171;&#160;2017&#160;&#187; est remplac&#233;e par l&#8217;ann&#233;e&#160;: &#171;&#160;2021&#160;&#187;.</p><p style=\"text-align: justify;\">II.&#160;&#8211;&#160;La perte de recettes pour l&#8217;&#201;tat est compens&#233;e &#224; due concurrence par la cr&#233;ation d&#8217;une taxe additionnelle aux droits mentionn&#233;s aux articles 575 et 575 A du code g&#233;n&#233;ral des imp&#244;ts.</p>",
    "exposeSommaire": "<p style=\"text-align: justify;\">En miroir du dispositif &#171;&#160;Pinel&#160;&#187; pour la location nue existe le dispositif &#171;&#160;Censi-Bouvard&#160;&#187; pour la location meubl&#233;e en r&#233;sidences-services&#160;d&#8217;int&#233;r&#234;t g&#233;n&#233;ral destin&#233;es aux &#233;tudiants ou aux seniors autonomes.</p><p style=\"text-align: justify;\">Le taux de la r&#233;duction d&#8217;imp&#244;t &#171;&#160;Pinel&#160;&#187; est de 18&#160;% pour un engagement de location de 9 ans, celui de la r&#233;duction d&#8217;imp&#244;t &#171;&#160;Censi-Bouvard&#160;&#187; est de 11&#160;% seulement pour un m&#234;me engagement de location de 9 ans.</p><p style=\"text-align: justify;\">Le pr&#233;sent amendement a pour objet de prolonger de 4 ans, jusqu&#8217;au 31 d&#233;cembre 2021, le dispositif &#171;&#160;Censi-Bouvard&#160;&#187;, &#224; l&#8217;image du dispositif &#171;&#160;Pinel&#160;&#187; lui-aussi prolong&#233; jusqu&#8217;au 31 d&#233;cembre 2021.</p><p style=\"text-align: justify;\">Une prolongation de 4 ans est n&#233;cessaire pour donner aux d&#233;veloppeurs de projets de r&#233;sidences pour &#233;tudiants ou pour seniors la visibilit&#233; suffisante au bon d&#233;roulement des projets (temps d&#8217;&#233;tude et de montage du projet de r&#233;sidence-services, d&#233;lais administratifs de d&#233;livrance du permis de construire et de purge des recours de tiers, s&#233;lection et contractualisation avec le gestionnaire sp&#233;cialis&#233; dans l&#8217;exploitation de r&#233;sidences pour &#233;tudiants ou pour seniors, temps de commercialisation des logements de la r&#233;sidence-services aupr&#232;s des investisseurs priv&#233;s, signature notari&#233;e de leur acquisition par les investisseurs).</p><p style=\"text-align: justify;\">Le dispositif &#171;&#160;Censi-Bouvard&#160;&#187; permet de construire 5&#160;000 habitations principales pour seniors autonomes ou pour &#233;tudiants chaque ann&#233;e&#160;: les contribuables b&#233;n&#233;ficiaires, souvent des primo-investisseurs en logement, sont issus de la France des classes moyennes.&#160;</p><p style=\"text-align: justify;\">Il est une alternative &#233;quitable au r&#233;gime fiscal de droit commun de la location meubl&#233;e professionnelle et non professionnelle (LMP/LMNP) qui favorise les contribuables aux taux marginaux d&#8217;imposition les plus &#233;lev&#233;s (5&#160;000 logements construits &#233;galement par an en r&#233;sidences-services &#233;tudiants/seniors gr&#226;ce au r&#233;gime LMP/LMNP).&#160;</p><p style=\"text-align: justify;\">Les besoins de construction de logements restent &#233;lev&#233;s pour les &#233;tudiants (engagement du Pr&#233;sident de la R&#233;publique de construire 80&#160;000 logements &#233;tudiants/jeunes actifs sur le quinquennat) et les personnes &#226;g&#233;es (6 millions de personnes de 75 ans et plus aujourd&#8217;hui, 8 millions dans 10 ans, &#224; mettre en regard de la disponibilit&#233; d&#8217;&#224;-peine 60&#160;000 appartements aujourd&#8217;hui dans 500&#160;r&#233;sidences-services pour seniors).</p><p style=\"text-align: justify;\">Le maintien en l&#8217;&#233;tat du dispositif Censi-Bouvard jusqu&#8217;&#224; fin 2021 contribuera &#224; couvrir ces besoins et participera au soutien de l&#8217;emploi dans les secteurs du b&#226;timent et des services (20 emplois &#224; temps plein cr&#233;&#233;s au sein de chaque r&#233;sidence-services seniors).</p>",
    "annexeExposeSommaire": {
      "@xmlns:xsi": "http://www.w3.org/2001/XMLSchema-instance",
      "@xsi:nil": "true"
    }
  },
  "representations": {
    "representation": {
      "nom": "PDF",
      "typeMime": {
        "type": "application",
        "subType": "PDF"
      },
      "statutRepresentation": {
        "verbatim": "true",
        "canonique": "true",
        "officielle": "true",
        "transcription": "false",
        "enregistrement": "false"
      },
      "repSource": {
        "@xmlns:xsi": "http://www.w3.org/2001/XMLSchema-instance",
        "@xsi:nil": "true"
      },
      "offset": {
        "@xmlns:xsi": "http://www.w3.org/2001/XMLSchema-instance",
        "@xsi:nil": "true"
      },
      "contenu": {
        "documentURI": "/15/amendements/0235C/AN/1782.pdf"
      },
      "dateDispoRepresentation": {
        "@xmlns:xsi": "http://www.w3.org/2001/XMLSchema-instance",
        "@xsi:nil": "true"
      }
    }
  },
  "seanceDiscussion": {
    "@xmlns:xsi": "http://www.w3.org/2001/XMLSchema-instance",
    "@xsi:nil": "true"
  },
  "sort": {
    "@xmlns:xsi": "http://www.w3.org/2001/XMLSchema-instance",
    "@xsi:nil": "true"
  },
  "dateDepot": "2017-11-13T01:00:00.000+01:00",
  "dateDistribution": "2017-11-15T01:00:00.000+01:00",
  "article99": "0",
  "loiReference": {
    "codeLoi": "CGI",
    "divisionCodeLoi": "199 sexvicies"
  }
}