{
  "@xmlns": "http://schemas.assemblee-nationale.fr/referentiel",
  "uid": "AMANR5L15PO420120B0904P0D1N461",
  "identifiant": {
    "legislature": "15",
    "numero": "461",
    "numRect": "0",
    "saisine": {
      "refTexteLegislatif": "PRJLANR5L15B0904",
      "numeroPartiePLF": "0",
      "organeExamen": "PO420120",
      "mentionSecondeDeliberation": "0"
    }
  },
  "numeroLong": "AS461",
  "etapeTexte": "1ère lecture (1ère assemblée saisie)",
  "triAmendement": "aaaq",
  "cardinaliteAmdtMultiples": "1",
  "amendementParent": {
    "@xmlns:xsi": "http://www.w3.org/2001/XMLSchema-instance",
    "@xsi:nil": "true"
  },
  "etat": "Retiré",
  "signataires": {
    "auteur": {
      "typeAuteur": "Depute",
      "acteurRef": "PA720968",
      "organeRef": {
        "@xmlns:xsi": "http://www.w3.org/2001/XMLSchema-instance",
        "@xsi:nil": "true"
      },
      "groupePolitiqueRef": "PO730970"
    },
    "cosignataires": {
      "acteurRef": [
        "PA720976",
        "PA720968"
      ]
    },
    "texteAffichable": "Mme&#160;Benin et M.&#160;Mathiasin"
  },
  "pointeurFragmentTexte": {
    "missionVisee": {
      "@xmlns:xsi": "http://www.w3.org/2001/XMLSchema-instance",
      "@xsi:nil": "true"
    },
    "division": {
      "titre": "Article 13",
      "articleDesignationCourte": "ART. 13",
      "type": "ARTICLE",
      "avant_A_Apres": "A",
      "divisionRattachee": "ARTICLE 13",
      "articleAdditionnel": {
        "@xmlns:xsi": "http://www.w3.org/2001/XMLSchema-instance",
        "@xsi:nil": "true"
      },
      "chapitreAdditionnel": {
        "@xmlns:xsi": "http://www.w3.org/2001/XMLSchema-instance",
        "@xsi:nil": "true"
      },
      "urlDivisionTexteVise": "/15/textes/0904.asp#D_Article_13"
    },
    "alinea": {
      "avant_A_Apres": "Apres",
      "numero": "1",
      "alineaDesignation": {
        "@xmlns:xsi": "http://www.w3.org/2001/XMLSchema-instance",
        "@xsi:nil": "true"
      }
    }
  },
  "corps": {
    "dispositif": "<p style=\"text-align: justify;\">Apr&#232;s l&#8217;alin&#233;a&#160;1, ins&#233;rer les quatre alin&#233;as suivants&#160;:</p><p style=\"text-align: justify;\">&#171;&#160;1&#176;&#160;A&#160;<i>(nouveau)</i>&#160;L&#8217;article L.&#160;6325&#8209;1 est compl&#233;t&#233; par un 5&#176;&#160;ainsi r&#233;dig&#233;&#160;:</p><p style=\"text-align: justify;\">&#171;&#160;5&#176;&#160;Aux salari&#233;s titulaires d&#8217;un contrat de travail &#224; dur&#233;e ind&#233;termin&#233;e ayant une anciennet&#233; de moins de sept ans dans l&#8217;entreprise &#224; la date de d&#233;but du contrat de professionnalisation sous r&#233;serve d&#8217;un accord entre le salari&#233; et l&#8217;employeur pour conclure entre eux ledit contrat.</p><p style=\"text-align: justify;\">&#171;&#160;Le contrat de travail est alors suspendu durant une dur&#233;e &#233;gale &#224; la dur&#233;e de l&#8217;action de professionnalisation. Cette suspension est sans effet &#224; l&#8217;&#233;gard des droits que le salari&#233; tient de son anciennet&#233; dans l&#8217;entreprise. Un accord collectif de branche ou d&#8217;entreprise peut pr&#233;voir que le contrat de travail est maintenu.</p><p style=\"text-align: justify;\">&#171;&#160;Par d&#233;rogation aux articles L.&#160;6325&#8209;8 et L.&#160;6325&#8209;9, le salari&#233; b&#233;n&#233;ficiaire du contrat de professionnalisation a droit &#224; une r&#233;mun&#233;ration au moins &#233;gale &#224; celle qu&#8217;il aurait per&#231;ue s&#8217;il &#233;tait rest&#233; en contrat de travail &#224; dur&#233;e ind&#233;termin&#233;e.&#160;&#187;&#160;&#187;</p>",
    "exposeSommaire": "<p style=\"text-align: justify;\">Dans de nombreux secteurs, notamment ceux de l&#8217;accueil et l&#8217;encadrement de jeunes publics ou l&#8217;accompagnement social, les professions sont r&#233;glement&#233;es. Leur exercice est conditionn&#233; par l&#8217;obtention d&#8217;une certification accessible uniquement en emploi (pas d&#8217;offre de formation initiale) et en alternance. La professionnalisation des salari&#233;s dans l&#8217;emploi correspond aussi aux pratiques de ces structures qui peinent &#224; recruter les personnes qualifi&#233;es n&#233;cessaires &#224; leur activit&#233;.</p><p style=\"text-align: justify;\">D&#8217;autres secteurs ont structur&#233; leur politique de qualification des salari&#233;s autour de certifications sp&#233;cifiques, faute de dipl&#244;mes/titres adapt&#233;s dans l&#8217;offre de formation initiale.</p><p style=\"text-align: justify;\">L&#224; encore l&#8217;acquisition de ces certifications, parfois longues, ne peut se faire que dans l&#8217;emploi, selon des modalit&#233;s d&#8217;alternance.</p><p style=\"text-align: justify;\">Dans les deux cas, les secteurs concern&#233;s recrutent en contrat &#224; dur&#233;e ind&#233;termin&#233;e&#160;; ce afin de fid&#233;liser les salari&#233;s dans le secteur et de stabiliser l&#8217;emploi. Les entreprises de ces secteurs sont volontaristes car l&#8217;accompagnement des salari&#233;s dans l&#8217;obtention de certifications correspond &#224; des r&#233;els besoins de comp&#233;tences n&#8217;existant pas sur le march&#233; de l&#8217;emploi et ne pouvant s&#8217;acqu&#233;rir par la formation initiale.</p><p style=\"text-align: justify;\">En application de la Loi, aucun des dispositifs de formation ne permettra de prendre en charge ce besoin de d&#233;veloppement des comp&#233;tences dans l&#8217;emploi.</p><p style=\"text-align: justify;\">Il est donc propos&#233;, &#224; l&#8217;instar de la disposition &#233;quivalente existant sur le contrat d&#8217;apprentissage, d&#8217;ouvrir la possibilit&#233; pour un employeur et un salari&#233; consentants, d&#8217;acc&#233;der au contrat de professionnalisation dans le cadre d&#8217;une suspension d&#8217;un contrat &#224; dur&#233;e ind&#233;termin&#233;e.</p><p style=\"text-align: justify;\">Les modalit&#233;s d&#8217;encadrement et de mise en &#339;uvre seraient les suivantes&#160;:<br />- Suspension du contrat par accord entre les parties, un accord de branche ou d&#8217;entreprise pouvant en disposer autrement&#160;;<br />- Dur&#233;e de suspension du contrat &#233;gale &#224; la dur&#233;e de formation n&#233;cessaire &#224; l&#8217;obtention de la qualification professionnelle recherch&#233;e&#160;;<br />- R&#233;mun&#233;ration&#160;: le salari&#233; conserve la r&#233;mun&#233;ration qu&#8217;il recevait avant de conclure le contrat de professionnalisation&#160;;<br />- Public &#233;ligible&#160;: tout salari&#233; ayant une anciennet&#233; de moins de sept ans ayant besoin d&#8217;une certification pour s&#233;curiser son emploi et/ou renforcer son employabilit&#233;&#160;;<br />- Formation &#233;ligible&#160;: toute formation &#233;ligible au contrat de professionnalisation de droit commun.</p>",
    "annexeExposeSommaire": {
      "@xmlns:xsi": "http://www.w3.org/2001/XMLSchema-instance",
      "@xsi:nil": "true"
    }
  },
  "representations": {
    "representation": {
      "nom": "PDF",
      "typeMime": {
        "type": "application",
        "subType": "PDF"
      },
      "statutRepresentation": {
        "verbatim": "true",
        "canonique": "true",
        "officielle": "true",
        "transcription": "false",
        "enregistrement": "false"
      },
      "repSource": {
        "@xmlns:xsi": "http://www.w3.org/2001/XMLSchema-instance",
        "@xsi:nil": "true"
      },
      "offset": {
        "@xmlns:xsi": "http://www.w3.org/2001/XMLSchema-instance",
        "@xsi:nil": "true"
      },
      "contenu": {
        "documentURI": "/15/amendements/0904/CION-SOC/AS461.pdf"
      },
      "dateDispoRepresentation": {
        "@xmlns:xsi": "http://www.w3.org/2001/XMLSchema-instance",
        "@xsi:nil": "true"
      }
    }
  },
  "seanceDiscussion": {
    "@xmlns:xsi": "http://www.w3.org/2001/XMLSchema-instance",
    "@xsi:nil": "true"
  },
  "sort": {
    "@xmlns:xsi": "http://www.w3.org/2001/XMLSchema-instance",
    "@xsi:nil": "true"
  },
  "dateDepot": "2018-05-25T02:00:00.000+02:00",
  "dateDistribution": "2018-05-29T02:00:00.000+02:00",
  "article99": "0",
  "loiReference": {
    "codeLoi": null,
    "divisionCodeLoi": null
  }
}