{
  "@xmlns": "http://schemas.assemblee-nationale.fr/referentiel",
  "uid": "AMANR5L15SEA717460BTC1629P0D1N357",
  "identifiant": {
    "legislature": "15",
    "numero": "357",
    "numRect": "0",
    "saisine": {
      "refTexteLegislatif": "PRJLANR5L15BTC1629",
      "numeroPartiePLF": "0",
      "organeExamen": "PO717460",
      "mentionSecondeDeliberation": "1"
    }
  },
  "numeroLong": "357",
  "etapeTexte": "1ère lecture (1ère assemblée saisie)",
  "triAmendement": "ooaaaaaaaaaaaaaaaaaaaaaaaaaaaaaaaaaaaaaaaaaaaaaaaaaaazrhzzzw",
  "cardinaliteAmdtMultiples": "1",
  "amendementParent": {
    "@xmlns:xsi": "http://www.w3.org/2001/XMLSchema-instance",
    "@xsi:nil": "true"
  },
  "etat": "Discuté",
  "signataires": {
    "auteur": {
      "typeAuteur": "Depute",
      "acteurRef": "PA720286",
      "organeRef": {
        "@xmlns:xsi": "http://www.w3.org/2001/XMLSchema-instance",
        "@xsi:nil": "true"
      },
      "groupePolitiqueRef": "PO730958"
    },
    "cosignataires": {
      "acteurRef": [
        "PA722142",
        "PA720286",
        "PA719578",
        "PA720430",
        "PA721210",
        "PA2150",
        "PA720846",
        "PA718868",
        "PA719676",
        "PA721202",
        "PA721226",
        "PA721062",
        "PA720422",
        "PA588884",
        "PA718860",
        "PA720892",
        "PA721960"
      ]
    },
    "texteAffichable": "Mme&#160;Fiat,  Mme&#160;Autain, M.&#160;Bernalicis, M.&#160;Coquerel, M.&#160;Corbi&#232;re, M.&#160;Lachaud, M.&#160;Larive, M.&#160;M&#233;lenchon, Mme&#160;Obono, Mme&#160;Panot, M.&#160;Prud&apos;homme, M.&#160;Quatennens, M.&#160;Ratenon, Mme&#160;Ressiguier, Mme&#160;Rubin, M.&#160;Ruffin et Mme&#160;Taurine"
  },
  "pointeurFragmentTexte": {
    "missionVisee": {
      "@xmlns:xsi": "http://www.w3.org/2001/XMLSchema-instance",
      "@xsi:nil": "true"
    },
    "division": {
      "titre": "Article 24",
      "articleDesignationCourte": "APRÈS ART. 24",
      "type": "ARTICLE",
      "avant_A_Apres": "Après",
      "divisionRattachee": "APRÈS L'ARTICLE 24, insérer l'article suivant:",
      "articleAdditionnel": "1",
      "chapitreAdditionnel": {
        "@xmlns:xsi": "http://www.w3.org/2001/XMLSchema-instance",
        "@xsi:nil": "true"
      },
      "urlDivisionTexteVise": "/15/textes/1629.asp#D_Article_24"
    },
    "alinea": {
      "@xmlns:xsi": "http://www.w3.org/2001/XMLSchema-instance",
      "@xsi:nil": "true"
    }
  },
  "corps": {
    "dispositif": "<p style=\"text-align: justify;\">Dans un d&#233;lai de deux mois &#224; compter de la promulgation de la pr&#233;sente loi, le gouvernement remet au Parlement un rapport consacr&#233; &#224; une &#233;tude de l&#8217;accessibilit&#233; des &#233;tablissements scolaires pour les &#233;l&#232;ves, les parents et les personnels en situation de handicap. Ce rapport peut envisager les r&#233;novations essentielles &#224; mettre en &#339;uvre dans un plan d&#8217;urgence de r&#233;novation pour l&#8217;accessibilit&#233;.</p>",
    "exposeSommaire": "<p style=\"text-align: justify;\">Par cet amendement, les d&#233;put&#233;&#183;e&#183;s de la France insoumise demandent au gouvernement la r&#233;daction d&#8217;un rapport relatif &#224; la r&#233;novation du parc des &#233;coles&#160;&#8211;&#160;afin de les rendre toutes accessibles aux parents, aux enfants et aux personnels en situation de handicap.</p><p style=\"text-align: justify;\">Pour instaurer un r&#233;el lien de confiance entre les &#233;l&#232;ves, les personnels, les parents et l&#8217;&#233;ducation nationale, il faut s&#8217;assurer que personne n&#8217;est laiss&#233; au bord du chemin. Il est essentiel que les &#233;coles existantes qui ne permettent pas &#224; toutes les personnes un acc&#232;s normal soient identifi&#233;es, et qu&#8217;un plan de r&#233;novation massif des &#233;coles non accessibles puisse &#234;tre mis en &#339;uvre.</p><p style=\"text-align: justify;\">Nous consid&#233;rons en effet que&#160;&#8211;&#160;contrairement &#224; ce qu&#8217;a par exemple pr&#233;vu la loi ORE&#160;&#8211;&#160;ce n&#8217;est pas aux &#233;l&#232;ves de s&#8217;adapter &#224; un monde essentiellement pr&#233;vu pour les personnes dites &#171;&#160;valides&#160;&#187;, mais bien aux personnes valides de s&#8217;assurer que le monde qu&#8217;elles ont construit pour elles n&#8217;exclut personne. Il faut donc inverser notre fa&#231;on de penser, pour pouvoir mettre en place de fa&#231;on proactive, un monde adapt&#233; pour chacun et chacune.</p><p style=\"text-align: justify;\">La premi&#232;re &#233;tape de cette d&#233;marche de r&#233;novation des &#233;coles consiste &#224; disposer des donn&#233;es essentielles sur le b&#226;ti, puis &#224; la planification contraignante d&#8217;un grand plan de r&#233;novation.</p>",
    "annexeExposeSommaire": {
      "@xmlns:xsi": "http://www.w3.org/2001/XMLSchema-instance",
      "@xsi:nil": "true"
    },
    "cartoucheDelaiDepotDepasse": {
      "@xmlns:xsi": "http://www.w3.org/2001/XMLSchema-instance",
      "@xsi:nil": "true"
    }
  },
  "representations": {
    "representation": {
      "nom": "PDF",
      "typeMime": {
        "type": "application",
        "subType": "PDF"
      },
      "statutRepresentation": {
        "verbatim": "true",
        "canonique": "true",
        "officielle": "true",
        "transcription": "false",
        "enregistrement": "false"
      },
      "repSource": {
        "@xmlns:xsi": "http://www.w3.org/2001/XMLSchema-instance",
        "@xsi:nil": "true"
      },
      "offset": {
        "@xmlns:xsi": "http://www.w3.org/2001/XMLSchema-instance",
        "@xsi:nil": "true"
      },
      "contenu": {
        "documentURI": "/15/amendements/1629/AN/357.pdf"
      },
      "dateDispoRepresentation": {
        "@xmlns:xsi": "http://www.w3.org/2001/XMLSchema-instance",
        "@xsi:nil": "true"
      }
    }
  },
  "seanceDiscussion": "RUANR5L15S2019IDS21508",
  "sort": {
    "dateSaisie": "2019-02-16T00:14:53.000+01:00",
    "sortEnSeance": "Rejeté"
  },
  "dateDepot": "2019-02-06T01:00:00.000+01:00",
  "dateDistribution": "2019-02-12T01:00:00.000+01:00",
  "article99": "0",
  "loiReference": {
    "codeLoi": {
      "@xmlns:xsi": "http://www.w3.org/2001/XMLSchema-instance",
      "@xsi:nil": "true"
    },
    "divisionCodeLoi": {
      "@xmlns:xsi": "http://www.w3.org/2001/XMLSchema-instance",
      "@xsi:nil": "true"
    }
  }
}