{
  "@xmlns": "http://schemas.assemblee-nationale.fr/referentiel",
  "uid": "AMANR5L15SEA717460B0269P0D1N412",
  "identifiant": {
    "legislature": "15",
    "numero": "412",
    "numRect": "0",
    "saisine": {
      "refTexteLegislatif": "PRJLANR5L15B0269",
      "numeroPartiePLF": "0",
      "organeExamen": "PO717460",
      "mentionSecondeDeliberation": "0"
    }
  },
  "numeroLong": "412",
  "etapeTexte": "1ère lecture (1ère assemblée saisie)",
  "triAmendement": "axo",
  "cardinaliteAmdtMultiples": "1",
  "amendementParent": {
    "@xmlns:xsi": "http://www.w3.org/2001/XMLSchema-instance",
    "@xsi:nil": "true"
  },
  "etat": "Discuté",
  "signataires": {
    "auteur": {
      "typeAuteur": "Depute",
      "acteurRef": "PA709315",
      "organeRef": {
        "@xmlns:xsi": "http://www.w3.org/2001/XMLSchema-instance",
        "@xsi:nil": "true"
      },
      "groupePolitiqueRef": "PO730934"
    },
    "cosignataires": {
      "acteurRef": [
        "PA718884",
        "PA718838",
        "PA718850",
        "PA721314",
        "PA267378",
        "PA330684",
        "PA605036",
        "PA642847",
        "PA720684",
        "PA643134",
        "PA267735",
        "PA709315",
        "PA1874",
        "PA606098",
        "PA607090",
        "PA719318",
        "PA608016",
        "PA267429",
        "PA998",
        "PA266797"
      ]
    },
    "texteAffichable": "M.&#160;Viala,  Mme&#160;Louwagie, Mme&#160;Levy, M.&#160;Brun, M.&#160;Gosselin, M.&#160;Cordier, M.&#160;Cinieri, M.&#160;Abad, Mme&#160;Anthoine, M.&#160;Le Fur, Mme&#160;Bazin-Malgras, Mme&#160;Valentin, M.&#160;Marleix, M.&#160;Pierre-Henri&#160;Dumont, M.&#160;de Ganay, M.&#160;Dassault, M.&#160;Bazin, M.&#160;Schellenberger, Mme&#160;Val&#233;rie&#160;Boyer et M.&#160;Jean-Pierre&#160;Vigier"
  },
  "pointeurFragmentTexte": {
    "missionVisee": {
      "@xmlns:xsi": "http://www.w3.org/2001/XMLSchema-instance",
      "@xsi:nil": "true"
    },
    "division": {
      "titre": "Article 13",
      "articleDesignationCourte": "ART. 13",
      "type": "ARTICLE",
      "avant_A_Apres": "A",
      "divisionRattachee": "ARTICLE 13",
      "articleAdditionnel": {
        "@xmlns:xsi": "http://www.w3.org/2001/XMLSchema-instance",
        "@xsi:nil": "true"
      },
      "chapitreAdditionnel": {
        "@xmlns:xsi": "http://www.w3.org/2001/XMLSchema-instance",
        "@xsi:nil": "true"
      },
      "urlDivisionTexteVise": "/15/textes/0269.asp#D_Article_13"
    },
    "alinea": {
      "@xmlns:xsi": "http://www.w3.org/2001/XMLSchema-instance",
      "@xsi:nil": "true"
    }
  },
  "corps": {
    "dispositif": "<p style=\"text-align: justify;\">I.&#160;&#8211;&#160;R&#233;diger ainsi la premi&#232;re colonne du tableau de l&#8217;alin&#233;a&#160;10&#160;:</p><p style=\"text-align: justify;\">&#171;</p><table style=\"border-collapse: collapse; height: 258px;\" width=\"478\"><tbody><tr style=\"height: 39px;\"><td style=\"white-space: normal; border: 1px solid #000000; width: 474px; height: 39px;\"><b>&#160;Ann&#233;e de premi&#232;re mise en circulation du v&#233;hicule</b></td></tr><tr style=\"height: 39px;\"><td style=\"white-space: normal; border: 1px solid #000000; width: 474px; height: 39px;\">Jusqu'au 31 d&#233;cembre 1996</td></tr><tr style=\"height: 39px;\"><td style=\"white-space: normal; border: 1px solid #000000; width: 474px; height: 39px;\">De 1997 &#224; 2000</td></tr><tr style=\"height: 39px;\"><td style=\"white-space: normal; border: 1px solid #000000; width: 474px; height: 39px;\">De 2001 &#224; 2005</td></tr><tr style=\"height: 39px;\"><td style=\"white-space: normal; border: 1px solid #000000; width: 474px; height: 39px;\">De 2006 &#224; 2010</td></tr><tr style=\"height: 27.5px;\"><td style=\"white-space: normal; border: 1px solid #000000; width: 474px; height: 27.5px;\">A compter de 2011</td></tr></tbody></table><p style=\"text-align: right;\">&#160;&#187;.</p><p style=\"text-align: justify;\">II.&#160;&#8211;&#160;Compl&#233;ter cet article par l'alin&#233;a suivant&#160;:</p><p style=\"text-align: justify;\">&#160;</p><p style=\"text-align: justify;\">&#171;&#160;V.&#160;&#8211;&#160;La perte de recettes pour les organismes de s&#233;curit&#233; sociale est compens&#233;e &#224; due concurrence par la majoration des droits mentionn&#233;s aux articles 575 et 575 A du code g&#233;n&#233;ral des imp&#244;ts.&#160;&#187;</p>",
    "exposeSommaire": "<p style=\"text-align: justify;\">Le gouvernement prend &#224; travers ce PLF des mesures extr&#234;mement pr&#233;cipit&#233;es en mati&#232;re de fiscalisation des carburants, sous couvert de pr&#233;occupation environnementale et de mise en &#339;uvre de la transition &#233;nerg&#233;tique.</p><p style=\"text-align: justify;\">La hausse brutale de la taxation du gasoil est la mesure phare. Elle rev&#234;t plusieurs aspects extr&#234;mement n&#233;gatifs&#160;:</p><p style=\"text-align: justify;\">- En p&#233;nalisant fortement les foyers aux faibles revenus qui ont investi dans un v&#233;hicule gazole en vue de faire des &#233;conomies. Il faut leur laisser le temps de se pr&#233;parer &#224; la transition &#233;nerg&#233;tique, en douceur, par le maintien de la taxation de 2017.</p><p style=\"text-align: justify;\">- En impactant le plus lourdement ceux de nos concitoyens qui roulent le plus et qui ont fait le choix de v&#233;hicules adapt&#233;s &#224; leurs besoins.</p><p style=\"text-align: justify;\">- En niant compl&#232;tement les diff&#233;rences profondes de mode de vie et de mobilit&#233; qui distinguent les zones urbaines des territoires ruraux o&#249; les distances &#224; parcourir sont infiniment plus longues, les d&#233;placements n&#233;cessairement plus on&#233;reux, et l&#8217;offre en mati&#232;re de transport en commun souvent tr&#232;s limit&#233;e compte tenu des diversit&#233;s de mouvements, rendant ainsi la voiture individuelle indispensable.</p><p style=\"text-align: justify;\">- En condamnant &#224; tr&#232;s br&#232;ve &#233;ch&#233;ance de nombreux fleurons de l&#8217;industrie automobile fran&#231;aise, qui se sont sp&#233;cialis&#233;s dans l&#8217;innovation technologique autour des moteurs diesel, et subissent d&#233;j&#224; les contrecoups d&#8217;annonces m&#233;diatiques mal ma&#238;tris&#233;es.</p><p style=\"text-align: justify;\">- En passant sous silence&#160;&#8211;&#160;de mani&#232;re tr&#232;s mensong&#232;re&#160;&#8211;&#160;les &#233;normes progr&#232;s r&#233;alis&#233;s par les constructeurs pour rendre les v&#233;hicules diesel respectueux de l&#8217;environnement.</p>",
    "annexeExposeSommaire": {
      "@xmlns:xsi": "http://www.w3.org/2001/XMLSchema-instance",
      "@xsi:nil": "true"
    }
  },
  "representations": {
    "representation": {
      "nom": "PDF",
      "typeMime": {
        "type": "application",
        "subType": "PDF"
      },
      "statutRepresentation": {
        "verbatim": "true",
        "canonique": "true",
        "officielle": "true",
        "transcription": "false",
        "enregistrement": "false"
      },
      "repSource": {
        "@xmlns:xsi": "http://www.w3.org/2001/XMLSchema-instance",
        "@xsi:nil": "true"
      },
      "offset": {
        "@xmlns:xsi": "http://www.w3.org/2001/XMLSchema-instance",
        "@xsi:nil": "true"
      },
      "contenu": {
        "documentURI": "/15/amendements/0269/AN/412.pdf"
      },
      "dateDispoRepresentation": {
        "@xmlns:xsi": "http://www.w3.org/2001/XMLSchema-instance",
        "@xsi:nil": "true"
      }
    }
  },
  "seanceDiscussion": "RUANR5L15S2018IDS20712",
  "sort": {
    "dateSaisie": "2017-10-27T00:21:37.000+02:00",
    "sortEnSeance": "Rejeté"
  },
  "dateDepot": "2017-10-20T02:00:00.000+02:00",
  "dateDistribution": "2017-10-23T02:00:00.000+02:00",
  "article99": "0",
  "loiReference": {
    "codeLoi": {
      "@xmlns:xsi": "http://www.w3.org/2001/XMLSchema-instance",
      "@xsi:nil": "true"
    },
    "divisionCodeLoi": {
      "@xmlns:xsi": "http://www.w3.org/2001/XMLSchema-instance",
      "@xsi:nil": "true"
    }
  }
}