{
  "@xmlns": "http://schemas.assemblee-nationale.fr/referentiel",
  "uid": "AMANR5L15SEA717460BTC1974P0D1N3359",
  "identifiant": {
    "legislature": "15",
    "numero": "3359",
    "numRect": "0",
    "saisine": {
      "refTexteLegislatif": "PRJLANR5L15BTC1974",
      "numeroPartiePLF": "0",
      "organeExamen": "PO717460",
      "mentionSecondeDeliberation": "0"
    }
  },
  "numeroLong": "3359",
  "etapeTexte": "1ère lecture (2ème assemblée saisie)",
  "triAmendement": "odiaaaaaaaaaaaaaaaaaaaaaaaaaaaaaaaaaaaaaaaaaaaaaaao",
  "cardinaliteAmdtMultiples": "1",
  "amendementParent": {
    "@xmlns:xsi": "http://www.w3.org/2001/XMLSchema-instance",
    "@xsi:nil": "true"
  },
  "etat": "Discuté",
  "signataires": {
    "auteur": {
      "typeAuteur": "Depute",
      "acteurRef": "PA609245",
      "organeRef": {
        "@xmlns:xsi": "http://www.w3.org/2001/XMLSchema-instance",
        "@xsi:nil": "true"
      },
      "groupePolitiqueRef": "PO730934"
    },
    "cosignataires": {
      "acteurRef": [
        "PA643134",
        "PA1012",
        "PA267289",
        "PA709315",
        "PA267204",
        "PA720210",
        "PA267735",
        "PA607090",
        "PA718884",
        "PA643089",
        "PA721678",
        "PA2155",
        "PA340853",
        "PA267527",
        "PA609245",
        "PA719318",
        "PA332523"
      ]
    },
    "texteAffichable": "Mme&#160;Lacroute,  M.&#160;Sermier, Mme&#160;Bazin-Malgras, Mme&#160;Anthoine, M.&#160;Thi&#233;riot, M.&#160;de Ganay, M.&#160;Saddier, M.&#160;Viala, M.&#160;de la Verpilli&#232;re, M.&#160;Jean-Pierre&#160;Vigier, Mme&#160;Beauvais, Mme&#160;Dalloz, M.&#160;Reda, Mme&#160;Valentin, M.&#160;Menuel, M.&#160;Leclerc et M.&#160;Door"
  },
  "pointeurFragmentTexte": {
    "missionVisee": {
      "@xmlns:xsi": "http://www.w3.org/2001/XMLSchema-instance",
      "@xsi:nil": "true"
    },
    "division": {
      "titre": "Article 39",
      "articleDesignationCourte": "ART. 39",
      "type": "ARTICLE",
      "avant_A_Apres": "A",
      "divisionRattachee": "ARTICLE 39",
      "articleAdditionnel": {
        "@xmlns:xsi": "http://www.w3.org/2001/XMLSchema-instance",
        "@xsi:nil": "true"
      },
      "chapitreAdditionnel": {
        "@xmlns:xsi": "http://www.w3.org/2001/XMLSchema-instance",
        "@xsi:nil": "true"
      },
      "urlDivisionTexteVise": "/15/textes/1974.asp#D_Article_39"
    },
    "alinea": {
      "avant_A_Apres": {
        "@xmlns:xsi": "http://www.w3.org/2001/XMLSchema-instance",
        "@xsi:nil": "true"
      },
      "numero": "48",
      "alineaDesignation": {
        "@xmlns:xsi": "http://www.w3.org/2001/XMLSchema-instance",
        "@xsi:nil": "true"
      }
    }
  },
  "corps": {
    "dispositif": "<p style=\"text-align: justify;\">Compl&#233;ter l'alin&#233;a 48 par la phrase suivante&#160;:</p><p style=\"text-align: justify;\">&#171;&#160;Ces dispositions tiennent compte &#233;galement d&#8217;une unicit&#233; des r&#232;gles d&#8217;organisation du travail applicables aux conducteurs affect&#233;s &#224; un m&#234;me lieu d&#8217;activit&#233;.&#160;&#187;</p>",
    "exposeSommaire": "<p style=\"text-align: justify;\">Le cadre social pr&#233;vu pour prendre en compte les sp&#233;cificit&#233;s objectives des conditions d&#8217;exploitation des lignes situ&#233;es en zone dense ne doit pas affecter l&#8217;unicit&#233; de l&#8217;organisation du travail au sein d&#8217;un m&#234;me lieu d&#8217;activit&#233;. Il serait en effet source de conflits qu&#8217;un centre d&#8217;exploitation bus donne lieu &#224; des r&#232;gles d&#8217;organisation diff&#233;rentes pour les conducteurs y &#233;tant affect&#233;s, au motif que ce site accueille des lignes de profils vari&#233;s. Une telle complexit&#233; serait par ailleurs difficilement op&#233;rante alors m&#234;me que les conducteurs sont g&#233;n&#233;ralement affect&#233;s &#224; diff&#233;rents services selon les semaines ou les p&#233;riodes de l&#8217;ann&#233;e.</p><p style=\"text-align: justify;\">L&#8217;amendement corrige ainsi les risques du texte initial.</p>",
    "annexeExposeSommaire": {
      "@xmlns:xsi": "http://www.w3.org/2001/XMLSchema-instance",
      "@xsi:nil": "true"
    },
    "cartoucheDelaiDepotDepasse": {
      "@xmlns:xsi": "http://www.w3.org/2001/XMLSchema-instance",
      "@xsi:nil": "true"
    }
  },
  "representations": {
    "representation": {
      "nom": "PDF",
      "typeMime": {
        "type": "application",
        "subType": "PDF"
      },
      "statutRepresentation": {
        "verbatim": "true",
        "canonique": "true",
        "officielle": "true",
        "transcription": "false",
        "enregistrement": "false"
      },
      "repSource": {
        "@xmlns:xsi": "http://www.w3.org/2001/XMLSchema-instance",
        "@xsi:nil": "true"
      },
      "offset": {
        "@xmlns:xsi": "http://www.w3.org/2001/XMLSchema-instance",
        "@xsi:nil": "true"
      },
      "contenu": {
        "documentURI": "/15/amendements/1974/AN/3359.pdf"
      },
      "dateDispoRepresentation": {
        "@xmlns:xsi": "http://www.w3.org/2001/XMLSchema-instance",
        "@xsi:nil": "true"
      }
    }
  },
  "seanceDiscussion": "RUANR5L15S2019IDS21702",
  "sort": {
    "dateSaisie": "2019-06-14T22:52:39.000+02:00",
    "sortEnSeance": "Rejeté"
  },
  "dateDepot": "2019-05-29T02:00:00.000+02:00",
  "dateDistribution": "2019-06-07T02:00:00.000+02:00",
  "article99": "0",
  "loiReference": {
    "codeLoi": {
      "@xmlns:xsi": "http://www.w3.org/2001/XMLSchema-instance",
      "@xsi:nil": "true"
    },
    "divisionCodeLoi": {
      "@xmlns:xsi": "http://www.w3.org/2001/XMLSchema-instance",
      "@xsi:nil": "true"
    }
  }
}