{
  "@xmlns": "http://schemas.assemblee-nationale.fr/referentiel",
  "uid": "AMANR5L15SEA717460B2272P2D1N2947",
  "identifiant": {
    "legislature": "15",
    "numero": "2947",
    "numRect": "0",
    "saisine": {
      "refTexteLegislatif": "PRJLANR5L15B2272",
      "numeroPartiePLF": "2",
      "organeExamen": "PO717460",
      "mentionSecondeDeliberation": "0"
    }
  },
  "numeroLong": "II-2947",
  "etapeTexte": "1ère lecture (1ère assemblée saisie)",
  "triAmendement": "ecaacaaaaaaaaaaaaaaaaaaaaaaaaaaaaaaaaaaaaaaaaaaaaazw",
  "cardinaliteAmdtMultiples": "1",
  "amendementParent": {
    "@xmlns:xsi": "http://www.w3.org/2001/XMLSchema-instance",
    "@xsi:nil": "true"
  },
  "etat": "Discuté",
  "signataires": {
    "auteur": {
      "typeAuteur": "Depute",
      "acteurRef": "PA721750",
      "organeRef": {
        "@xmlns:xsi": "http://www.w3.org/2001/XMLSchema-instance",
        "@xsi:nil": "true"
      },
      "groupePolitiqueRef": "PO730964"
    },
    "cosignataires": {
      "acteurRef": [
        "PA720268",
        "PA721784",
        "PA720190",
        "PA720900",
        "PA719600",
        "PA702054",
        "PA721296",
        "PA720854",
        "PA718794",
        "PA720342",
        "PA721844",
        "PA719632",
        "PA721674",
        "PA719814",
        "PA722252",
        "PA722090",
        "PA719728",
        "PA722244",
        "PA722022",
        "PA721750",
        "PA718944"
      ]
    },
    "texteAffichable": "Mme&#160;Calvez,  Mme&#160;Rixain, Mme&#160;Atger, M.&#160;Claireaux, Mme&#160;Colboc, M.&#160;Damaisin, Mme&#160;Gomez-Bassac, M.&#160;Gouffier-Cha, Mme&#160;H&#233;rin, M.&#160;Le Bohec, Mme&#160;Le Peih, Mme&#160;Magne, Mme&#160;Panonacle, Mme&#160;P&#233;telle, Mme&#160;Piron, M.&#160;Poulliat, Mme&#160;Racon-Bouzon, Mme&#160;Rilhac, Mme&#160;Romeiro Dias, M.&#160;Sorre et M.&#160;Test&#233;"
  },
  "pointeurFragmentTexte": {
    "missionVisee": {
      "@xmlns:xsi": "http://www.w3.org/2001/XMLSchema-instance",
      "@xsi:nil": "true"
    },
    "division": {
      "titre": "Article 62",
      "articleDesignationCourte": "APRÈS ART. 62",
      "type": "ARTICLE",
      "avant_A_Apres": "Après",
      "divisionRattachee": "APRÈS L'ARTICLE 62, insérer l'article suivant:",
      "articleAdditionnel": "1",
      "chapitreAdditionnel": {
        "@xmlns:xsi": "http://www.w3.org/2001/XMLSchema-instance",
        "@xsi:nil": "true"
      },
      "urlDivisionTexteVise": "/15/textes/2272C.asp#D_Article_62"
    },
    "alinea": {
      "@xmlns:xsi": "http://www.w3.org/2001/XMLSchema-instance",
      "@xsi:nil": "true"
    }
  },
  "corps": {
    "dispositif": "<p style=\"text-align: justify;\">I.&#160;&#8211;&#160;Apr&#232;s le <i>e</i> du 1 du III de l&#8217;article&#160;220 <i>quaterdecies</i>, il est ins&#233;r&#233; un alin&#233;a ainsi r&#233;dig&#233;&#160;: </p><p style=\"text-align: justify;\">&#171;&#160;Les d&#233;penses mentionn&#233;es au c du pr&#233;sent III n&#8217;entrent pas dans la base de calcul du cr&#233;dit d&#8217;imp&#244;t lorsque la proportion des personnes de l&#8217;un des deux sexes faisant l&#8217;objet de ces d&#233;penses est inf&#233;rieure &#224; 35&#160;%.&#160;&#187;.</p><p style=\"text-align: justify;\">II.&#160;&#8211;&#160;Les dispositions du I s&#8217;appliquent aux cr&#233;dits d&#8217;imp&#244;t calcul&#233;s au titre des exercices ouverts &#224; compter du 1<sup>er</sup>janvier 2020.</p><p style=\"text-align: justify;\">III.&#160;&#8211;&#160;Le I entre en vigueur &#224; une date, fix&#233;e par d&#233;cret, qui ne peut &#234;tre post&#233;rieure de plus de six mois &#224; la date de r&#233;ception par le Gouvernement de la r&#233;ponse de la Commission europ&#233;enne permettant de consid&#233;rer le dispositif l&#233;gislatif lui ayant &#233;t&#233; notifi&#233; comme conforme au droit de l&#8217;Union europ&#233;enne en mati&#232;re d&#8217;aides d&#8217;&#201;tat.&#160;</p>",
    "exposeSommaire": "<p style=\"text-align: justify;\">Cet amendement vise &#224; introduire un crit&#232;re de genre dans le cr&#233;dit d&#8217;imp&#244;t cin&#233;ma international afin d&#8217;impulser une plus grande mixit&#233; dans cette fili&#232;re.</p><p style=\"text-align: justify;\">La place des femmes dans les industries culturelles, et en particulier dans la cr&#233;ation d&#8217;&#339;uvres audiovisuelles ou cin&#233;matographiques, accuse encore un retard notable par rapport &#224; leur proportion au sein de la population mais &#233;galement &#224; leurs effectifs en mati&#232;re de consommation de tels biens. Si des progr&#232;s ont certes &#233;t&#233; r&#233;alis&#233;s, au cours des derni&#232;res ann&#233;es, notamment sous l&#8217;impulsion du CNC, l&#8217;&#233;volution est trop mesur&#233;e pour peser r&#233;ellement sur l&#8217;image des femmes que ces &#339;uvres v&#233;hiculent et donc sur le regard que porte la soci&#233;t&#233;, dans son ensemble, sur le sexe f&#233;minin.</p><p style=\"text-align: justify;\">Aussi, cet amendement introduit un crit&#232;re de genre qui conditionne l&#8217;&#233;ligibilit&#233; au cr&#233;dit d&#8217;imp&#244;t d&#8217;un des types de d&#233;pense, &#224; savoir les salaires vers&#233;s aux personnels de la r&#233;alisation et de la production. En effet, il appara&#238;t que la proportion de femmes dans les m&#233;tiers de la r&#233;alisation et de la production est trop faible. A titre illustratif, en 2017, seuls 27&#160;% des films de long m&#233;trage ont &#233;t&#233; r&#233;alis&#233;s ou co-r&#233;alis&#233;s par des femmes (CNC, La place des femmes dans l&#8217;industrie cin&#233;matographique et audiovisuelle, mars 2019).</p><p style=\"text-align: justify;\">Cet amendement vise donc &#224; faire du cr&#233;dit d&#8217;imp&#244;t un outil efficace afin d&#8217;encourager les acteurs &#233;conomiques de ces secteurs &#224; r&#233;&#233;quilibrer leurs &#233;quipes pour offrir aux femmes des perspectives d&#8217;emplois et de carri&#232;re plus &#233;quitables.&#160;</p><p style=\"text-align: justify;\">Le choix d&#8217;instaurer un crit&#232;re de mixit&#233; &#8211; et non de parit&#233; &#8211; illustre bien cette volont&#233; de faire du cr&#233;dit d&#8217;imp&#244;t un dispositif incitatif, ainsi qu&#8217;en t&#233;moigne d&#8217;ailleurs la proportion minimum de personnes de l&#8217;un des deux sexes qui a &#233;t&#233; retenue&#160;: 35&#160;%. Ce taux, r&#233;aliste, a &#233;t&#233; d&#233;termin&#233; en fonction des seules donn&#233;es qui ont pu nous &#234;tre communiqu&#233;es, notamment par la FEMIS qui forme &#224; ces m&#233;tiers. Cette proportion pourrait toutefois &#234;tre modifi&#233;e par un sous-amendement si des donn&#233;es compl&#233;mentaires &#233;taient communiqu&#233;es.</p>",
    "annexeExposeSommaire": {
      "@xmlns:xsi": "http://www.w3.org/2001/XMLSchema-instance",
      "@xsi:nil": "true"
    },
    "cartoucheDelaiDepotDepasse": {
      "@xmlns:xsi": "http://www.w3.org/2001/XMLSchema-instance",
      "@xsi:nil": "true"
    },
    "avantAppel": {
      "@xmlns:xsi": "http://www.w3.org/2001/XMLSchema-instance",
      "@xsi:nil": "true"
    }
  },
  "representations": {
    "representation": {
      "nom": "PDF",
      "typeMime": {
        "type": "application",
        "subType": "PDF"
      },
      "statutRepresentation": {
        "verbatim": "true",
        "canonique": "true",
        "officielle": "true",
        "transcription": "false",
        "enregistrement": "false"
      },
      "repSource": {
        "@xmlns:xsi": "http://www.w3.org/2001/XMLSchema-instance",
        "@xsi:nil": "true"
      },
      "offset": {
        "@xmlns:xsi": "http://www.w3.org/2001/XMLSchema-instance",
        "@xsi:nil": "true"
      },
      "contenu": {
        "documentURI": "/15/amendements/2272C/AN/2947.pdf"
      },
      "dateDispoRepresentation": {
        "@xmlns:xsi": "http://www.w3.org/2001/XMLSchema-instance",
        "@xsi:nil": "true"
      }
    }
  },
  "seanceDiscussion": "RUANR5L15S2020IDS21922",
  "sort": {
    "dateSaisie": "2019-11-14T15:36:08.000+01:00",
    "sortEnSeance": "Retiré"
  },
  "dateDepot": "2019-11-09T01:00:00.000+01:00",
  "dateDistribution": "2019-11-13T01:00:00.000+01:00",
  "article99": "0",
  "loiReference": {
    "codeLoi": "CGI",
    "divisionCodeLoi": "220 quaterdicies"
  }
}