{
  "@xmlns": "http://schemas.assemblee-nationale.fr/referentiel",
  "uid": "AMANR5L15PO420120B2296P0D1N1021",
  "identifiant": {
    "legislature": "15",
    "numero": "1021",
    "numRect": "0",
    "saisine": {
      "refTexteLegislatif": "PRJLANR5L15B2296",
      "numeroPartiePLF": "0",
      "organeExamen": "PO420120",
      "mentionSecondeDeliberation": "0"
    }
  },
  "numeroLong": "AS1021",
  "etapeTexte": "1ère lecture (1ère assemblée saisie)",
  "triAmendement": "liaaaaaaaaaaaaaaaaaaaaaaaaaaaaaaaaaaaaaaaaaaaaaaaac",
  "cardinaliteAmdtMultiples": "1",
  "amendementParent": {
    "@xmlns:xsi": "http://www.w3.org/2001/XMLSchema-instance",
    "@xsi:nil": "true"
  },
  "etat": "Discuté",
  "signataires": {
    "auteur": {
      "typeAuteur": "Depute",
      "acteurRef": "PA642788",
      "organeRef": {
        "@xmlns:xsi": "http://www.w3.org/2001/XMLSchema-instance",
        "@xsi:nil": "true"
      },
      "groupePolitiqueRef": "PO730964"
    },
    "cosignataires": {
      "acteurRef": "PA642788"
    },
    "texteAffichable": "M.&#160;V&#233;ran, rapporteur g&#233;n&#233;ral"
  },
  "pointeurFragmentTexte": {
    "missionVisee": {
      "@xmlns:xsi": "http://www.w3.org/2001/XMLSchema-instance",
      "@xsi:nil": "true"
    },
    "division": {
      "titre": "Article 54",
      "articleDesignationCourte": "ART. 54",
      "type": "ARTICLE",
      "avant_A_Apres": "A",
      "divisionRattachee": "ARTICLE 54",
      "articleAdditionnel": {
        "@xmlns:xsi": "http://www.w3.org/2001/XMLSchema-instance",
        "@xsi:nil": "true"
      },
      "chapitreAdditionnel": {
        "@xmlns:xsi": "http://www.w3.org/2001/XMLSchema-instance",
        "@xsi:nil": "true"
      },
      "urlDivisionTexteVise": "/15/textes/2296.asp#D_Article_54"
    },
    "alinea": {
      "avant_A_Apres": {
        "@xmlns:xsi": "http://www.w3.org/2001/XMLSchema-instance",
        "@xsi:nil": "true"
      },
      "numero": "2",
      "alineaDesignation": {
        "@xmlns:xsi": "http://www.w3.org/2001/XMLSchema-instance",
        "@xsi:nil": "true"
      }
    }
  },
  "corps": {
    "dispositif": "<p style=\"text-align: justify;\">I.&#160;&#8211;&#160;Substituer &#224; l&#8217;alin&#233;a&#160;2 les quatre alin&#233;as suivants&#160;:</p><p style=\"text-align: justify;\">&#171;&#160;1&#176;&#160;L&#8217;article L.&#160;242&#8209;5 est ainsi modifi&#233;&#160;:</p><p style=\"text-align: justify;\">&#171;&#160;<i>a)</i> Apr&#232;s le premier alin&#233;a, il est ins&#233;r&#233; un alin&#233;a ainsi r&#233;dig&#233;&#160;:</p><p style=\"text-align: justify;\">&#171;&#160;Le II de l&#8217;article L.&#160;130&#8209;1 n&#8217;est pas applicable &#224; la d&#233;termination du taux de cotisation mentionn&#233; au pr&#233;sent article.&#160;&#187;</p><p style=\"text-align: justify;\">&#171;&#160;<i>b)</i> Apr&#232;s le troisi&#232;me alin&#233;a, devenu le quatri&#232;me, sont ins&#233;r&#233;s trois alin&#233;as ainsi r&#233;dig&#233;s&#160;:&#160;&#187;.</p><p style=\"text-align: justify;\">II.&#160;&#8211;&#160;En cons&#233;quence, apr&#232;s l&#8217;alin&#233;a&#160;11, ins&#233;rer les deux alin&#233;as suivants&#160;:</p><p style=\"text-align: justify;\">&#171;&#160;I <i>bis</i>&#160;&#8211;&#160;Apr&#232;s le premier alin&#233;a de l&#8217;article L.&#160;751&#8209;13 du code rural et de la p&#234;che maritime, il est ins&#233;r&#233; un deuxi&#232;me alin&#233;a ainsi r&#233;dig&#233;&#160;:</p><p style=\"text-align: justify;\">&#171;&#160;Le II de l&#8217;article L.&#160;130&#8209;1 du code de la s&#233;curit&#233; sociale n&#8217;est pas applicable &#224; la d&#233;termination du montant de la cotisation mentionn&#233;e au pr&#233;sent article.&#160;&#187;.</p><p style=\"text-align: justify;\">III.&#160;&#8211;&#160;En cons&#233;quence, &#224; l&#8217;alin&#233;a&#160;12, substituer aux r&#233;f&#233;rences&#160;:</p><p style=\"text-align: justify;\">&#171;&#160;2&#176;&#160;et 3&#176;&#160;du I&#160;&#187;</p><p style=\"text-align: justify;\">les r&#233;f&#233;rences&#160;:</p><p style=\"text-align: justify;\">&#171;&#160;<i>a)</i> du 1&#176;&#160;, 2&#176;&#160;et 3&#176;&#160;du I&#160;et I <i>bis</i>&#160;&#187;.</p><p style=\"text-align: justify;\">IV.&#160;&#8211;&#160;En cons&#233;quence, &#224; l&#8217;alin&#233;a&#160;14, substituer aux r&#233;f&#233;rences&#160;:</p><p style=\"text-align: justify;\">&#171;&#160;1&#176;&#160;du I&#160;&#187;</p><p style=\"text-align: justify;\">les r&#233;f&#233;rences&#160;:</p><p style=\"text-align: justify;\">&#171;&#160;<i>b)</i> du 1&#176;&#160;du I&#160;&#187;.</p><p style=\"text-align: justify;\">V.&#160;&#8211;&#160;Les pertes de recettes pour les organismes de s&#233;curit&#233; sociale sont compens&#233;es &#224; due concurrence par la majoration des droits mentionn&#233;s aux articles&#160;575 et 575&#160;A du code g&#233;n&#233;ral des imp&#244;ts.</p>",
    "exposeSommaire": "<p>La loi PACTE a pos&#233; le principe selon lequel le franchissement &#224; la hausse d&#8217;un seuil d&#8217;effectif n&#8217;est pris en compte que lorsqu&#8217;il a &#233;t&#233; atteint ou d&#233;pass&#233; pendant cinq ann&#233;es cons&#233;cutives. Ainsi, &#224; compter du 1er janvier 2020, seules les entreprises ayant durablement d&#233;pass&#233; un seuil d&#8217;effectif seront assujetties &#224; de nouvelles obligations ou contraintes. Cette mesure de gel vise &#224; prot&#233;ger les entreprises dont les effectifs fluctuent, fluidifier la croissance des autres et lever les freins &#224; l&#8217;embauche afin de cr&#233;er un environnement juridique plus simple et plus favorable &#224; la croissance des entreprises.</p><p>Or, la formule usuelle de calcul du taux des cotisations accidents du travail et maladies professionnelles (AT-MP) est d&#233;j&#224; con&#231;ue pour minimiser les effets de seuils et lisser l&#8217;impact de la hausse des effectifs, en prenant en compte une individualisation progressive du taux. Cette individualisation conduit &#224; une augmentation (ou une baisse) lin&#233;aire de la part individualis&#233;e du taux qui neutralise tout effet de seuil li&#233; aux &#233;volutions de l&#8217;effectif.</p><p>La mesure de gel &#224; la hausse des effectifs pr&#233;vue dans PACTE a ainsi pour effets contre-productifs de cr&#233;er, pour les entreprises en croissance, un effet de seuil &#224; l&#8217;issue de la p&#233;riode d&#8217;observation de cinq ans et de d&#233;connecter pendant cette p&#233;riode le taux de cotisation de l&#8217;incitation &#224; la pr&#233;vention. Les entreprises ayant une sinistralit&#233; plus faible que celle de leur cat&#233;gorie de risque ne pourront pas b&#233;n&#233;ficier avant cinq ans d&#8217;une r&#233;duction de leur taux de cotisation, et inversement les entreprises ayant une sinistralit&#233; plus forte ne verraient pas leur taux augmenter pendant cette p&#233;riode.</p><p>Le pr&#233;sent amendement propose donc de confirmer la r&#232;gle sp&#233;cifique applicable &#224; la tarification des AT-MP relevant tant du r&#233;gime g&#233;n&#233;ral de la s&#233;curit&#233; sociale que du r&#233;gime agricole, les modalit&#233;s respectives de calcul de leurs taux de cotisations reposant d&#233;j&#224; sur une logique voulue par la loi PACTE de prise en compte progressive du risque individuel.</p>",
    "annexeExposeSommaire": {
      "@xmlns:xsi": "http://www.w3.org/2001/XMLSchema-instance",
      "@xsi:nil": "true"
    },
    "cartoucheDelaiDepotDepasse": {
      "@xmlns:xsi": "http://www.w3.org/2001/XMLSchema-instance",
      "@xsi:nil": "true"
    },
    "avantAppel": {
      "@xmlns:xsi": "http://www.w3.org/2001/XMLSchema-instance",
      "@xsi:nil": "true"
    }
  },
  "representations": {
    "representation": {
      "nom": "PDF",
      "typeMime": {
        "type": "application",
        "subType": "PDF"
      },
      "statutRepresentation": {
        "verbatim": "true",
        "canonique": "true",
        "officielle": "true",
        "transcription": "false",
        "enregistrement": "false"
      },
      "repSource": {
        "@xmlns:xsi": "http://www.w3.org/2001/XMLSchema-instance",
        "@xsi:nil": "true"
      },
      "offset": {
        "@xmlns:xsi": "http://www.w3.org/2001/XMLSchema-instance",
        "@xsi:nil": "true"
      },
      "contenu": {
        "documentURI": "/15/amendements/2296/CION-SOC/AS1021.pdf"
      },
      "dateDispoRepresentation": {
        "@xmlns:xsi": "http://www.w3.org/2001/XMLSchema-instance",
        "@xsi:nil": "true"
      }
    }
  },
  "seanceDiscussion": {
    "@xmlns:xsi": "http://www.w3.org/2001/XMLSchema-instance",
    "@xsi:nil": "true"
  },
  "sort": {
    "dateSaisie": "2019-10-16T20:30:17.000+02:00",
    "sortEnSeance": "Adopté"
  },
  "dateDepot": "2019-10-14T02:00:00.000+02:00",
  "dateDistribution": "2019-10-15T02:00:00.000+02:00",
  "article99": "0",
  "loiReference": {
    "codeLoi": {
      "@xmlns:xsi": "http://www.w3.org/2001/XMLSchema-instance",
      "@xsi:nil": "true"
    },
    "divisionCodeLoi": {
      "@xmlns:xsi": "http://www.w3.org/2001/XMLSchema-instance",
      "@xsi:nil": "true"
    }
  }
}