{
  "@xmlns": "http://schemas.assemblee-nationale.fr/referentiel",
  "uid": "AMANR5L15PO419610B0627P0D1N7",
  "identifiant": {
    "legislature": "15",
    "numero": "7",
    "numRect": "0",
    "saisine": {
      "refTexteLegislatif": "PRJLANR5L15B0627",
      "numeroPartiePLF": "0",
      "organeExamen": "PO419610",
      "mentionSecondeDeliberation": "0"
    }
  },
  "numeroLong": "CE7",
  "etapeTexte": "1ère lecture (1ère assemblée saisie)",
  "triAmendement": "acwxvdi",
  "cardinaliteAmdtMultiples": "1",
  "amendementParent": {
    "@xmlns:xsi": "http://www.w3.org/2001/XMLSchema-instance",
    "@xsi:nil": "true"
  },
  "etat": "Discuté",
  "signataires": {
    "auteur": {
      "typeAuteur": "Depute",
      "acteurRef": "PA267450",
      "organeRef": {
        "@xmlns:xsi": "http://www.w3.org/2001/XMLSchema-instance",
        "@xsi:nil": "true"
      },
      "groupePolitiqueRef": "PO730934"
    },
    "cosignataires": {
      "acteurRef": [
        "PA856",
        "PA718884",
        "PA346218",
        "PA1874",
        "PA1327",
        "PA2155",
        "PA767",
        "PA267450",
        "PA267204",
        "PA718784",
        "PA334654",
        "PA606712"
      ]
    },
    "texteAffichable": "M.&#160;R&#233;mi&#160;Delatte,  Mme&#160;Bazin-Malgras, M.&#160;Cattin, M.&#160;Cherpion, M.&#160;Forissier, M.&#160;Le Fur, M.&#160;Lurton, M.&#160;Masson, M.&#160;Menuel, M.&#160;Pauget, M.&#160;Sermier et M.&#160;Straumann"
  },
  "pointeurFragmentTexte": {
    "missionVisee": {
      "@xmlns:xsi": "http://www.w3.org/2001/XMLSchema-instance",
      "@xsi:nil": "true"
    },
    "division": {
      "titre": "Article 15",
      "articleDesignationCourte": "ART. 15",
      "type": "ARTICLE",
      "avant_A_Apres": "A",
      "divisionRattachee": "ARTICLE 15",
      "articleAdditionnel": {
        "@xmlns:xsi": "http://www.w3.org/2001/XMLSchema-instance",
        "@xsi:nil": "true"
      },
      "chapitreAdditionnel": {
        "@xmlns:xsi": "http://www.w3.org/2001/XMLSchema-instance",
        "@xsi:nil": "true"
      },
      "urlDivisionTexteVise": "/15/textes/0627.asp#D_Article_15"
    },
    "alinea": {
      "avant_A_Apres": "A",
      "numero": "2",
      "alineaDesignation": "Alinéa 2"
    }
  },
  "corps": {
    "dispositif": "<p style=\"text-align: justify;\">Apr&#232;s la premi&#232;re occurrence du mot&#160;:</p><p style=\"text-align: justify;\">&#171;&#160;conseil&#160;&#187;,</p><p style=\"text-align: justify;\">r&#233;diger ainsi la fin de l&#8217;alin&#233;a&#160;2&#160;:</p><p style=\"text-align: justify;\">&#171;&#160;annuel individualis&#233; et modifier le r&#233;gime applicable aux activit&#233;s de conseil et de vente de ces produits, notamment en imposant une s&#233;paration capitalistique des structures exer&#231;ant les activit&#233;s de vente et de conseil annuel individualis&#233;&#160;;&#160;&#187;.</p>",
    "exposeSommaire": "<p style=\"text-align: justify;\">Amendement de repli.<br />Cet alin&#233;a pr&#233;voit la s&#233;paration des activit&#233;s de conseil et de vente dans le secteur des produits phytosanitaires, tout en conservant le syst&#232;me des Certificats d&#8217;&#201;conomie de Produits Phytopharmaceutiques (CEPP).<br />La relation de travail entre agriculteurs et fournisseurs est bas&#233;e sur la confiance qui s&#8217;inscrit &#224; la fois dans une approche globale de l&#8217;exploitation, dans ses dimensions &#233;conomique, financi&#232;re et technique, mais aussi individuelle pour l&#8217;exploitant aux plans culturel et social. C&#8217;est d&#8217;ailleurs cette personnalisation du conseil qui permet la rationalisation des usages, seul moyen de garantir l&#8217;efficacit&#233; du dispositif des CEPP.<br />Aussi, cet amendement pr&#233;voit la s&#233;paration des activit&#233;s de vente et celles du seul conseil annuel individualis&#233; dont l&#8217;&#233;tude d&#8217;impact du pr&#233;sent projet de loi rappelle qu&#8217;il doit &#234;tre d&#233;livr&#233; par un organisme ind&#233;pendant.</p>",
    "annexeExposeSommaire": {
      "@xmlns:xsi": "http://www.w3.org/2001/XMLSchema-instance",
      "@xsi:nil": "true"
    }
  },
  "representations": {
    "representation": {
      "nom": "PDF",
      "typeMime": {
        "type": "application",
        "subType": "PDF"
      },
      "statutRepresentation": {
        "verbatim": "true",
        "canonique": "true",
        "officielle": "true",
        "transcription": "false",
        "enregistrement": "false"
      },
      "repSource": {
        "@xmlns:xsi": "http://www.w3.org/2001/XMLSchema-instance",
        "@xsi:nil": "true"
      },
      "offset": {
        "@xmlns:xsi": "http://www.w3.org/2001/XMLSchema-instance",
        "@xsi:nil": "true"
      },
      "contenu": {
        "documentURI": "/15/amendements/0627/CION-ECO/CE7.pdf"
      },
      "dateDispoRepresentation": {
        "@xmlns:xsi": "http://www.w3.org/2001/XMLSchema-instance",
        "@xsi:nil": "true"
      }
    }
  },
  "seanceDiscussion": {
    "@xmlns:xsi": "http://www.w3.org/2001/XMLSchema-instance",
    "@xsi:nil": "true"
  },
  "sort": {
    "dateSaisie": "2018-04-20T17:12:12.000+02:00",
    "sortEnSeance": "Non soutenu"
  },
  "dateDepot": "2018-03-20T01:00:00.000+01:00",
  "dateDistribution": "2018-04-17T02:00:00.000+02:00",
  "article99": "0",
  "loiReference": {
    "codeLoi": {
      "@xmlns:xsi": "http://www.w3.org/2001/XMLSchema-instance",
      "@xsi:nil": "true"
    },
    "divisionCodeLoi": {
      "@xmlns:xsi": "http://www.w3.org/2001/XMLSchema-instance",
      "@xsi:nil": "true"
    }
  }
}