{
  "@xmlns": "http://schemas.assemblee-nationale.fr/referentiel",
  "uid": "AMANR5L15SEA717460B0269P0D1N1083",
  "identifiant": {
    "legislature": "15",
    "numero": "1083",
    "numRect": "0",
    "saisine": {
      "refTexteLegislatif": "PRJLANR5L15B0269",
      "numeroPartiePLF": "0",
      "organeExamen": "PO717460",
      "mentionSecondeDeliberation": "0"
    }
  },
  "numeroLong": "1083",
  "etapeTexte": "1ère lecture (1ère assemblée saisie)",
  "triAmendement": "n",
  "cardinaliteAmdtMultiples": "1",
  "amendementParent": {
    "@xmlns:xsi": "http://www.w3.org/2001/XMLSchema-instance",
    "@xsi:nil": "true"
  },
  "etat": "Discuté",
  "signataires": {
    "auteur": {
      "typeAuteur": "Depute",
      "acteurRef": "PA610681",
      "organeRef": {
        "@xmlns:xsi": "http://www.w3.org/2001/XMLSchema-instance",
        "@xsi:nil": "true"
      },
      "groupePolitiqueRef": "PO730946"
    },
    "cosignataires": {
      "acteurRef": [
        "PA642764",
        "PA720988",
        "PA719930",
        "PA1592",
        "PA610681",
        "PA333818",
        "PA332614",
        "PA267233",
        "PA588886",
        "PA1008",
        "PA1198",
        "PA607553",
        "PA608172",
        "PA337483",
        "PA508",
        "PA643145"
      ]
    },
    "texteAffichable": "Mme&#160;Bareigts,  M.&#160;Aviragnet, Mme&#160;Bi&#233;mouret, M.&#160;Bouillon, M.&#160;Alain&#160;David, Mme&#160;Laurence&#160;Dumont, M.&#160;David&#160;Habib, M.&#160;Hutin, M.&#160;Juanico, M.&#160;Le Foll, M.&#160;Letchimy, Mme&#160;Manin, Mme&#160;Pires Beaune, M.&#160;Potier, Mme&#160;Vainqueur-Christophe et M.&#160;Vallaud"
  },
  "pointeurFragmentTexte": {
    "missionVisee": {
      "@xmlns:xsi": "http://www.w3.org/2001/XMLSchema-instance",
      "@xsi:nil": "true"
    },
    "division": {
      "titre": "Article 39",
      "articleDesignationCourte": "ART. 39",
      "type": "ARTICLE",
      "avant_A_Apres": "A",
      "divisionRattachee": "ARTICLE 39",
      "articleAdditionnel": {
        "@xmlns:xsi": "http://www.w3.org/2001/XMLSchema-instance",
        "@xsi:nil": "true"
      },
      "chapitreAdditionnel": {
        "@xmlns:xsi": "http://www.w3.org/2001/XMLSchema-instance",
        "@xsi:nil": "true"
      },
      "urlDivisionTexteVise": "/15/textes/0269.asp#D_Article_39"
    },
    "alinea": {
      "avant_A_Apres": {
        "@xmlns:xsi": "http://www.w3.org/2001/XMLSchema-instance",
        "@xsi:nil": "true"
      },
      "numero": "3",
      "alineaDesignation": {
        "@xmlns:xsi": "http://www.w3.org/2001/XMLSchema-instance",
        "@xsi:nil": "true"
      }
    }
  },
  "corps": {
    "dispositif": "<p style=\"text-align: justify;\">&#192; l&#8217;alin&#233;a&#160;3, apr&#232;s le mot&#160;:</p><p style=\"text-align: justify;\">&#171;&#160;applique&#160;&#187;,</p><p style=\"text-align: justify;\">ins&#233;rer les mots&#160;:</p><p style=\"text-align: justify;\">&#171;&#160;le&#160;1<sup>er</sup> janvier 2020&#160;&#187;.</p>",
    "exposeSommaire": "<p style=\"text-align: justify;\">Le contrat d&#8217;am&#233;lioration de qualit&#233; et de l&#8217;efficience des soins (CAQES), pr&#233;vu par l&#8217;article&#160;81 de la LFSS pour 2016, est un contrat qui lie l&#8217;Agence R&#233;gionale de Sant&#233;, l&#8217;organisme local d&#8217;assurance-maladie et les &#233;tablissements de sant&#233;. Il entrera en vigueur le 1<sup>er</sup> janvier 2018.</p><p style=\"text-align: justify;\">L&#8217;article pr&#233;voit de cr&#233;er une mesure d&#8217;int&#233;ressement sur ce dispositif que les &#233;tablissements n&#8217;ont pas encore mis en &#339;uvre. Il est n&#233;cessaire dans un premier temps d&#8217;observer la mise en place de ce CAQES et l&#8217;appropriation de cet outil par les &#233;tablissements de sant&#233; avant d&#8217;envisager toutes mesures d&#8217;int&#233;ressement. L&#8217;introduction de cette mesure d&#8217;int&#233;ressement para&#238;t pr&#233;matur&#233;e et il convient de la d&#233;caler au 1<sup>er</sup> janvier 2020.</p><p style=\"text-align: justify;\">Tel est l&#8217;objet du pr&#233;sent amendement.</p>",
    "annexeExposeSommaire": {
      "@xmlns:xsi": "http://www.w3.org/2001/XMLSchema-instance",
      "@xsi:nil": "true"
    }
  },
  "representations": {
    "representation": {
      "nom": "PDF",
      "typeMime": {
        "type": "application",
        "subType": "PDF"
      },
      "statutRepresentation": {
        "verbatim": "true",
        "canonique": "true",
        "officielle": "true",
        "transcription": "false",
        "enregistrement": "false"
      },
      "repSource": {
        "@xmlns:xsi": "http://www.w3.org/2001/XMLSchema-instance",
        "@xsi:nil": "true"
      },
      "offset": {
        "@xmlns:xsi": "http://www.w3.org/2001/XMLSchema-instance",
        "@xsi:nil": "true"
      },
      "contenu": {
        "documentURI": "/15/amendements/0269/AN/1083.pdf"
      },
      "dateDispoRepresentation": {
        "@xmlns:xsi": "http://www.w3.org/2001/XMLSchema-instance",
        "@xsi:nil": "true"
      }
    }
  },
  "seanceDiscussion": "RUANR5L15S2018IDS20714",
  "sort": {
    "dateSaisie": "2017-10-27T23:18:33.000+02:00",
    "sortEnSeance": "Tombé"
  },
  "dateDepot": "2017-10-20T02:00:00.000+02:00",
  "dateDistribution": "2017-10-23T02:00:00.000+02:00",
  "article99": "0",
  "loiReference": {
    "codeLoi": {
      "@xmlns:xsi": "http://www.w3.org/2001/XMLSchema-instance",
      "@xsi:nil": "true"
    },
    "divisionCodeLoi": {
      "@xmlns:xsi": "http://www.w3.org/2001/XMLSchema-instance",
      "@xsi:nil": "true"
    }
  }
}