{
  "@xmlns": "http://schemas.assemblee-nationale.fr/referentiel",
  "uid": "AMANR5L15SEA717460B2272P2D1N1426",
  "identifiant": {
    "legislature": "15",
    "numero": "1426",
    "numRect": "0",
    "saisine": {
      "refTexteLegislatif": "PRJLANR5L15B2272",
      "numeroPartiePLF": "2",
      "organeExamen": "PO717460",
      "mentionSecondeDeliberation": "0"
    }
  },
  "numeroLong": "II-1426",
  "etapeTexte": "1ère lecture (1ère assemblée saisie)",
  "triAmendement": "bdlaaaaaaaaaaaaaaaaaaaaaaaaaaaaaaaaaaaaaaaaaaaaaaaahu",
  "cardinaliteAmdtMultiples": "1",
  "amendementParent": {
    "@xmlns:xsi": "http://www.w3.org/2001/XMLSchema-instance",
    "@xsi:nil": "true"
  },
  "etat": "Discuté",
  "signataires": {
    "auteur": {
      "typeAuteur": "Depute",
      "acteurRef": "PA719608",
      "organeRef": {
        "@xmlns:xsi": "http://www.w3.org/2001/XMLSchema-instance",
        "@xsi:nil": "true"
      },
      "groupePolitiqueRef": "PO723569"
    },
    "cosignataires": {
      "acteurRef": "PA719608"
    },
    "texteAffichable": "Mme&#160;M&#233;nard"
  },
  "pointeurFragmentTexte": {
    "missionVisee": {
      "idMissionAN": "825",
      "libelleMission": "Santé",
      "codeMissionPLF": "B",
      "libelleMissionPLF": "Répartition, par mission et programme, des crédits du budget général"
    },
    "division": {
      "titre": "ÉTAT B",
      "articleDesignationCourte": "ART. 38",
      "type": "ANNEXE",
      "avant_A_Apres": "A",
      "divisionRattachee": "ARTICLE 38",
      "articleAdditionnel": {
        "@xmlns:xsi": "http://www.w3.org/2001/XMLSchema-instance",
        "@xsi:nil": "true"
      },
      "chapitreAdditionnel": {
        "@xmlns:xsi": "http://www.w3.org/2001/XMLSchema-instance",
        "@xsi:nil": "true"
      },
      "urlDivisionTexteVise": "/15/textes/2272C.asp#D_ETAT_B"
    },
    "alinea": {
      "@xmlns:xsi": "http://www.w3.org/2001/XMLSchema-instance",
      "@xsi:nil": "true"
    }
  },
  "corps": {
    "exposeSommaire": "<p style=\"text-align: justify;\">Transf&#233;rer 155 000 000 de l&#8217;action 02 &#171;&#160;Aide m&#233;dicale d&#8217;&#201;tat&#160;&#187; du programme 183 &#171;&#160;Protection maladie&#160;&#187; vers l&#8217;action 14 &#171;&#160;Pr&#233;vention des maladies chroniques et qualit&#233; de vie des malades&#160;&#187; du programme 204 &#171;&#160;Pr&#233;vention, s&#233;curit&#233; sanitaire et offre de soins&#160;&#187;.</p><p style=\"text-align: justify;\">Selon l&#8217;Insee, &#171;&#160;au 1<sup>er</sup> janvier 2019, la France compte 66,993 millions d&#8217;habitants. La population fran&#231;aise continue de vieillir. Les personnes &#226;g&#233;es d&#8217;au moins 65 ans repr&#233;sentent 20&#160;% de la population, contre 19,7&#160;% un an auparavant et 19,3&#160;% deux ans auparavant. Leur part a progress&#233; de 4,3 points en vingt ans. La hausse est de 2,4 points sur la m&#234;me p&#233;riode pour les habitants &#226;g&#233;s de 75 ans ou plus, qui repr&#233;sentent pr&#232;s d&#8217;un habitant sur dix au 1<sup>er</sup> janvier 2019. En revanche, la proportion des jeunes &#226;g&#233;s de moins de 20 ans a recul&#233; de 1,8 point depuis 2000 pour s&#8217;&#233;tablir &#224; 24,1&#160;%. Les habitants &#226;g&#233;s de 20 &#224; 59 ans repr&#233;sentent, quant &#224; eux, la moiti&#233; de la population, soit une baisse de 4,0 points en vingt ans.&#160;&#187;</p><p style=\"text-align: justify;\">Face &#224; ce constat, il est de la responsabilit&#233; de l&#8217;&#201;tat d&#8217;augmenter significativement cette action qui a pour but de d&#8217;am&#233;liorer les dispositifs de pr&#233;vention des maladies chroniques et la qualit&#233; de vie des malades et de leurs porches (maladies neurod&#233;g&#233;n&#233;ratives, maladies li&#233;es au vieillissement, cancers etc..)</p>",
    "annexeExposeSommaire": {
      "@xmlns:xsi": "http://www.w3.org/2001/XMLSchema-instance",
      "@xsi:nil": "true"
    },
    "cartoucheDelaiDepotDepasse": {
      "@xmlns:xsi": "http://www.w3.org/2001/XMLSchema-instance",
      "@xsi:nil": "true"
    },
    "avantAppel": {
      "@xmlns:xsi": "http://www.w3.org/2001/XMLSchema-instance",
      "@xsi:nil": "true"
    },
    "dispositifAmdtCredit": {
      "listeProgrammes": {
        "programme": [
          {
            "libelle": "Prévention, sécurité sanitaire et offre de soins",
            "id": "101405",
            "AE": {
              "montantPositif": "155000000",
              "montantNegatif": "0"
            },
            "CP": {
              "montantPositif": "155000000",
              "montantNegatif": "0"
            },
            "action": "modification",
            "lignesCredits": null
          },
          {
            "libelle": "Protection maladie",
            "id": "101406",
            "AE": {
              "montantPositif": "0",
              "montantNegatif": "155000000"
            },
            "CP": {
              "montantPositif": "0",
              "montantNegatif": "155000000"
            },
            "action": "modification",
            "lignesCredits": null
          }
        ]
      },
      "totalAE": {
        "montantPositif": "155000000",
        "montantNegatif": "155000000",
        "solde": "0"
      },
      "totalCP": {
        "montantPositif": "155000000",
        "montantNegatif": "155000000",
        "solde": "0"
      }
    }
  },
  "representations": {
    "representation": {
      "nom": "PDF",
      "typeMime": {
        "type": "application",
        "subType": "PDF"
      },
      "statutRepresentation": {
        "verbatim": "true",
        "canonique": "true",
        "officielle": "true",
        "transcription": "false",
        "enregistrement": "false"
      },
      "repSource": {
        "@xmlns:xsi": "http://www.w3.org/2001/XMLSchema-instance",
        "@xsi:nil": "true"
      },
      "offset": {
        "@xmlns:xsi": "http://www.w3.org/2001/XMLSchema-instance",
        "@xsi:nil": "true"
      },
      "contenu": {
        "documentURI": "/15/amendements/2272C/AN/1426.pdf"
      },
      "dateDispoRepresentation": {
        "@xmlns:xsi": "http://www.w3.org/2001/XMLSchema-instance",
        "@xsi:nil": "true"
      }
    }
  },
  "seanceDiscussion": "RUANR5L15S2020IDS21907",
  "sort": {
    "dateSaisie": "2019-11-07T12:13:35.000+01:00",
    "sortEnSeance": "Rejeté"
  },
  "dateDepot": "2019-10-31T01:00:00.000+01:00",
  "dateDistribution": "2019-11-05T01:00:00.000+01:00",
  "article99": "0",
  "loiReference": {
    "codeLoi": {
      "@xmlns:xsi": "http://www.w3.org/2001/XMLSchema-instance",
      "@xsi:nil": "true"
    },
    "divisionCodeLoi": {
      "@xmlns:xsi": "http://www.w3.org/2001/XMLSchema-instance",
      "@xsi:nil": "true"
    }
  }
}