{
  "@xmlns": "http://schemas.assemblee-nationale.fr/referentiel",
  "uid": "AMANR5L15PO757134B1673P0D1N654",
  "identifiant": {
    "legislature": "15",
    "numero": "654",
    "numRect": "0",
    "saisine": {
      "refTexteLegislatif": "PRJLANR5L15B1673",
      "numeroPartiePLF": "0",
      "organeExamen": "PO757134",
      "mentionSecondeDeliberation": "0"
    }
  },
  "numeroLong": "654",
  "etapeTexte": "Nouvelle Lecture",
  "triAmendement": "apiaaaaaaaaaaaaaaaaaaaaaaaaaaaaaaaaaaaaaaaaaaaaaaax",
  "cardinaliteAmdtMultiples": "1",
  "amendementParent": {
    "@xmlns:xsi": "http://www.w3.org/2001/XMLSchema-instance",
    "@xsi:nil": "true"
  },
  "etat": "Irrecevable",
  "signataires": {
    "auteur": {
      "typeAuteur": "Depute",
      "acteurRef": "PA719668",
      "organeRef": {
        "@xmlns:xsi": "http://www.w3.org/2001/XMLSchema-instance",
        "@xsi:nil": "true"
      },
      "groupePolitiqueRef": "PO730964"
    },
    "cosignataires": {
      "acteurRef": "PA719668"
    },
    "texteAffichable": "Mme&#160;Mirall&#232;s"
  },
  "pointeurFragmentTexte": {
    "missionVisee": {
      "@xmlns:xsi": "http://www.w3.org/2001/XMLSchema-instance",
      "@xsi:nil": "true"
    },
    "division": {
      "titre": "Article 9",
      "articleDesignationCourte": "APRÈS ART. 9",
      "type": "ARTICLE",
      "avant_A_Apres": "Après",
      "divisionRattachee": "APRÈS L'ARTICLE 9, insérer l'article suivant:",
      "articleAdditionnel": "1",
      "chapitreAdditionnel": {
        "@xmlns:xsi": "http://www.w3.org/2001/XMLSchema-instance",
        "@xsi:nil": "true"
      },
      "urlDivisionTexteVise": "/15/textes/1673.asp#D_Article_9"
    },
    "alinea": {
      "@xmlns:xsi": "http://www.w3.org/2001/XMLSchema-instance",
      "@xsi:nil": "true"
    }
  },
  "corps": {
    "dispositif": "<p>Au 4&#176; du I de l&#8217;article L.&#160;821&#8209;2 du code de commerce, le paragraphe si apr&#232;s&#160;: &#171;&#160;Quatre personnes qualifi&#233;es en mati&#232;re &#233;conomique et financi&#232;re ; la premi&#232;re est choisie pour ses comp&#233;tences dans les domaines des offres au public et des soci&#233;t&#233;s dont les titres sont admis aux n&#233;gociations sur un march&#233; r&#233;glement&#233;, la deuxi&#232;me pour ses comp&#233;tences dans le domaine de la banque ou de l'assurance, la troisi&#232;me pour ses comp&#233;tences dans le domaine des petites et moyennes entreprises, des personnes morales de droit priv&#233; ayant une activit&#233; &#233;conomique ou des associations, la quatri&#232;me pour ses comp&#233;tences en mati&#232;re de comptabilit&#233; nationale et internationale&#160;&#187;&#160; est remplac&#233; par la r&#233;daction suivante&#160;:</p><p>&#160;&#171;&#160;deux personnes qualifi&#233;s en mati&#232;re &#233;conomique et financi&#232;re ; la premi&#232;re est choisie pour ses comp&#233;tences dans les domaines des offres au public et des soci&#233;t&#233;s dont les titres sont admis aux n&#233;gociations sur un march&#233; r&#233;glement&#233; ainsi que dans le domaine de la banque ou de l&#8217;assurance, la deuxi&#232;me dans ses comp&#233;tences dans le domaine des petites et moyennes entreprises, des personnes morales de droit priv&#233; ayant une activit&#233; &#233;conomique ou des associations ainsi que pour ses comp&#233;tences en mati&#232;re de comptabilit&#233; nationale et internationale&#160;&#187;.</p>",
    "exposeSommaire": "<p style=\"text-align: justify;\">Le pr&#233;sent amendement est une cons&#233;quence de l&#8217;amendement 651 et a vocation &#224; maintenir &#224; un effectif constant le nombre de membre du coll&#232;ge du H3C.</p>",
    "annexeExposeSommaire": {
      "@xmlns:xsi": "http://www.w3.org/2001/XMLSchema-instance",
      "@xsi:nil": "true"
    },
    "cartoucheDelaiDepotDepasse": {
      "@xmlns:xsi": "http://www.w3.org/2001/XMLSchema-instance",
      "@xsi:nil": "true"
    }
  },
  "representations": {
    "representation": {
      "nom": "PDF",
      "typeMime": {
        "type": "application",
        "subType": "PDF"
      },
      "statutRepresentation": {
        "verbatim": "true",
        "canonique": "true",
        "officielle": "true",
        "transcription": "false",
        "enregistrement": "false"
      },
      "repSource": {
        "@xmlns:xsi": "http://www.w3.org/2001/XMLSchema-instance",
        "@xsi:nil": "true"
      },
      "offset": {
        "@xmlns:xsi": "http://www.w3.org/2001/XMLSchema-instance",
        "@xsi:nil": "true"
      },
      "contenu": {
        "documentURI": "/15/amendements/1673/CSPACTE/654.pdf"
      },
      "dateDispoRepresentation": {
        "@xmlns:xsi": "http://www.w3.org/2001/XMLSchema-instance",
        "@xsi:nil": "true"
      }
    }
  },
  "seanceDiscussion": {
    "@xmlns:xsi": "http://www.w3.org/2001/XMLSchema-instance",
    "@xsi:nil": "true"
  },
  "sort": {
    "@xmlns:xsi": "http://www.w3.org/2001/XMLSchema-instance",
    "@xsi:nil": "true"
  },
  "dateDepot": "2019-03-01T01:00:00.000+01:00",
  "dateDistribution": "2019-03-01T01:00:00.000+01:00",
  "article99": "0",
  "loiReference": {
    "codeLoi": {
      "@xmlns:xsi": "http://www.w3.org/2001/XMLSchema-instance",
      "@xsi:nil": "true"
    },
    "divisionCodeLoi": {
      "@xmlns:xsi": "http://www.w3.org/2001/XMLSchema-instance",
      "@xsi:nil": "true"
    }
  }
}