{
  "@xmlns": "http://schemas.assemblee-nationale.fr/referentiel",
  "uid": "AMANR5L15PO766718B2187P0D1N1625",
  "identifiant": {
    "legislature": "15",
    "numero": "1625",
    "numRect": "0",
    "saisine": {
      "refTexteLegislatif": "PRJLANR5L15B2187",
      "numeroPartiePLF": "0",
      "organeExamen": "PO766718",
      "mentionSecondeDeliberation": "0"
    }
  },
  "numeroLong": "1625",
  "etapeTexte": "1ère lecture (1ère assemblée saisie)",
  "triAmendement": "lcaaaaaaaaaaaaaaaaaaaaaaaaaaaaaaaaaaaaaaaaaaaaaaaad",
  "cardinaliteAmdtMultiples": "1",
  "amendementParent": {
    "@xmlns:xsi": "http://www.w3.org/2001/XMLSchema-instance",
    "@xsi:nil": "true"
  },
  "etat": "Discuté",
  "signataires": {
    "auteur": {
      "typeAuteur": "Depute",
      "acteurRef": "PA719488",
      "organeRef": {
        "@xmlns:xsi": "http://www.w3.org/2001/XMLSchema-instance",
        "@xsi:nil": "true"
      },
      "groupePolitiqueRef": "PO730970"
    },
    "cosignataires": {
      "acteurRef": [
        "PA720746",
        "PA721234",
        "PA720002",
        "PA720598",
        "PA719044",
        "PA720334",
        "PA719942",
        "PA720976",
        "PA720764",
        "PA721924",
        "PA719266",
        "PA720924",
        "PA722162",
        "PA719918",
        "PA722284",
        "PA722374",
        "PA720968",
        "PA721182",
        "PA717151",
        "PA720728",
        "PA721742",
        "PA720652",
        "PA719504",
        "PA720162",
        "PA718978",
        "PA719210",
        "PA719640",
        "PA721418",
        "PA1276",
        "PA721734",
        "PA720092",
        "PA720256",
        "PA719488",
        "PA719558",
        "PA720326",
        "PA721976",
        "PA721530",
        "PA721984",
        "PA721608",
        "PA720178",
        "PA719874",
        "PA720772",
        "PA721836",
        "PA720720"
      ]
    },
    "texteAffichable": "M.&#160;Berta, rapporteur,  Mme&#160;de Vaucouleurs, Mme&#160;Elimas, M.&#160;Fuchs, M.&#160;Hammouche, M.&#160;Isaac-Sibille, M.&#160;Balanant, Mme&#160;Bannier, M.&#160;Barrot, M.&#160;Baudu, Mme&#160;Benin, M.&#160;Bolo, M.&#160;Bourlanges, M.&#160;Bru, M.&#160;Cubertafon, Mme&#160;de Sarnez, Mme&#160;Deprez-Audebert, M.&#160;Duverg&#233;, Mme&#160;El Ha&#239;ry, Mme&#160;Essayan, M.&#160;Fanget, Mme&#160;Florennes, M.&#160;Garcia, Mme&#160;Jacquier-Laforge, M.&#160;Joncour, M.&#160;Lagleize, M.&#160;Lain&#233;, M.&#160;Laqhila, Mme&#160;Lasserre-David, M.&#160;Latombe, Mme&#160;Luquet, M.&#160;Mathiasin, M.&#160;Mattei, Mme&#160;Mette, M.&#160;Michel-Kleisbauer, M.&#160;Mignola, M.&#160;Millienne, M.&#160;Pahun, M.&#160;Fr&#233;d&#233;ric&#160;Petit, Mme&#160;Maud&#160;Petit, Mme&#160;Poueyto, M.&#160;Ramos, M.&#160;Turquois et M.&#160;Waserman"
  },
  "pointeurFragmentTexte": {
    "missionVisee": {
      "@xmlns:xsi": "http://www.w3.org/2001/XMLSchema-instance",
      "@xsi:nil": "true"
    },
    "division": {
      "titre": "Article 29",
      "articleDesignationCourte": "ART. 29",
      "type": "ARTICLE",
      "avant_A_Apres": "A",
      "divisionRattachee": "ARTICLE 29",
      "articleAdditionnel": {
        "@xmlns:xsi": "http://www.w3.org/2001/XMLSchema-instance",
        "@xsi:nil": "true"
      },
      "chapitreAdditionnel": {
        "@xmlns:xsi": "http://www.w3.org/2001/XMLSchema-instance",
        "@xsi:nil": "true"
      },
      "urlDivisionTexteVise": "/15/textes/2187.asp#D_Article_29"
    },
    "alinea": {
      "avant_A_Apres": "Apres",
      "numero": "6",
      "alineaDesignation": {
        "@xmlns:xsi": "http://www.w3.org/2001/XMLSchema-instance",
        "@xsi:nil": "true"
      }
    }
  },
  "corps": {
    "dispositif": "<p style=\"text-align: justify;\">Apr&#232;s l&#8217;alin&#233;a&#160;6, ins&#233;rer&#160;l&#8217;alin&#233;a suivant&#160;:</p><p style=\"text-align: justify;\">&#171;&#160;Entre deux projets de r&#233;forme mentionn&#233;s au I. le comit&#233;, en lien avec les commissions parlementaires comp&#233;tentes et l&#8217;Office parlementaire d&#8217;&#233;valuation des choix scientifiques et technologiques, est charg&#233; d&#8217;assurer un suivi d&#8217;&#233;valuation et de r&#233;vision continu des&#160;progr&#232;s scientifiques et de leurs enjeux &#233;thiques afin, le cas &#233;ch&#233;ant, de proposer chaque ann&#233;e des &#233;volutions pour adapter la l&#233;gislation aux avanc&#233;es du monde scientifique.&#160;&#187;</p>",
    "exposeSommaire": "<p style=\"text-align: justify;\">Cet amendement vise &#224; assurer le suivi r&#233;gulier des sujets scientifiques en lien avec les projets de loi de bio&#233;thique de mani&#232;re &#224; en permettre l'&#233;valuation et l'actualisation au regard des avanc&#233;es de la science et des d&#233;couvertes qui pourraient se produire entre deux projets de r&#233;forme.&#160;</p><p style=\"text-align: justify;\">A l'inverse des sujets soci&#233;taux soulev&#233;s par les lois de bio&#233;thique, et qui n&#233;cessitent un temps long de maturation et de r&#233;flexion, ce suivi appara&#238;t indispensable si l'on consid&#232;re les progr&#232;s scientifiques de ces derni&#232;res ann&#233;es et qui n&#233;cessitent une adaptation plus rapide de notre l&#233;gislation pour permettre &#224; notre recherche et nos laboratoires de rester &#224; l'avant-garde mondiale en ce domaine.&#160;</p><p style=\"text-align: justify;\">Dans ce contexte, les commissions parlementaires comp&#233;tentes ainsi que l'OPECST, en lien avec le CCNE, apparaissent toutes d&#233;sign&#233;es pour jouer ce r&#244;le.&#160;</p>",
    "annexeExposeSommaire": {
      "@xmlns:xsi": "http://www.w3.org/2001/XMLSchema-instance",
      "@xsi:nil": "true"
    },
    "cartoucheDelaiDepotDepasse": {
      "@xmlns:xsi": "http://www.w3.org/2001/XMLSchema-instance",
      "@xsi:nil": "true"
    },
    "avantAppel": {
      "@xmlns:xsi": "http://www.w3.org/2001/XMLSchema-instance",
      "@xsi:nil": "true"
    }
  },
  "representations": {
    "representation": {
      "nom": "PDF",
      "typeMime": {
        "type": "application",
        "subType": "PDF"
      },
      "statutRepresentation": {
        "verbatim": "true",
        "canonique": "true",
        "officielle": "true",
        "transcription": "false",
        "enregistrement": "false"
      },
      "repSource": {
        "@xmlns:xsi": "http://www.w3.org/2001/XMLSchema-instance",
        "@xsi:nil": "true"
      },
      "offset": {
        "@xmlns:xsi": "http://www.w3.org/2001/XMLSchema-instance",
        "@xsi:nil": "true"
      },
      "contenu": {
        "documentURI": "/15/amendements/2187/CSBIOETH/1625.pdf"
      },
      "dateDispoRepresentation": {
        "@xmlns:xsi": "http://www.w3.org/2001/XMLSchema-instance",
        "@xsi:nil": "true"
      }
    }
  },
  "seanceDiscussion": {
    "@xmlns:xsi": "http://www.w3.org/2001/XMLSchema-instance",
    "@xsi:nil": "true"
  },
  "sort": {
    "dateSaisie": "2019-09-14T01:10:10.000+02:00",
    "sortEnSeance": "Rejeté"
  },
  "dateDepot": "2019-09-05T02:00:00.000+02:00",
  "dateDistribution": "2019-09-11T02:00:00.000+02:00",
  "article99": "0",
  "loiReference": {
    "codeLoi": {
      "@xmlns:xsi": "http://www.w3.org/2001/XMLSchema-instance",
      "@xsi:nil": "true"
    },
    "divisionCodeLoi": {
      "@xmlns:xsi": "http://www.w3.org/2001/XMLSchema-instance",
      "@xsi:nil": "true"
    }
  }
}