{
  "@xmlns": "http://schemas.assemblee-nationale.fr/referentiel",
  "uid": "AMANR5L15SEA717460B1255P2D1N1541",
  "identifiant": {
    "legislature": "15",
    "numero": "1541",
    "numRect": "0",
    "saisine": {
      "refTexteLegislatif": "PRJLANR5L15B1255",
      "numeroPartiePLF": "2",
      "organeExamen": "PO717460",
      "mentionSecondeDeliberation": "0"
    }
  },
  "numeroLong": "II-1541",
  "etapeTexte": "1ère lecture (1ère assemblée saisie)",
  "triAmendement": "baapaaaaaaaaaaaaaaaaaaaaaaaaaaaaaaaaaaaaaaaaaaaaaai",
  "cardinaliteAmdtMultiples": "1",
  "amendementParent": {
    "@xmlns:xsi": "http://www.w3.org/2001/XMLSchema-instance",
    "@xsi:nil": "true"
  },
  "etat": "Discuté",
  "signataires": {
    "auteur": {
      "typeAuteur": "Gouvernement",
      "acteurRef": {
        "@xmlns:xsi": "http://www.w3.org/2001/XMLSchema-instance",
        "@xsi:nil": "true"
      },
      "organeRef": {
        "@xmlns:xsi": "http://www.w3.org/2001/XMLSchema-instance",
        "@xsi:nil": "true"
      },
      "groupePolitiqueRef": {
        "@xmlns:xsi": "http://www.w3.org/2001/XMLSchema-instance",
        "@xsi:nil": "true"
      }
    },
    "cosignataires": {
      "@xmlns:xsi": "http://www.w3.org/2001/XMLSchema-instance",
      "@xsi:nil": "true"
    },
    "texteAffichable": "le Gouvernement"
  },
  "pointeurFragmentTexte": {
    "missionVisee": {
      "idMissionAN": "419",
      "libelleMission": "Solidarité, insertion et égalité des chances",
      "codeMissionPLF": "B",
      "libelleMissionPLF": "Répartition, par mission et programme, des crédits du budget général"
    },
    "division": {
      "titre": "Article 82",
      "articleDesignationCourte": "ART. 82",
      "type": "ARTICLE",
      "avant_A_Apres": "A",
      "divisionRattachee": "ARTICLE 82",
      "articleAdditionnel": {
        "@xmlns:xsi": "http://www.w3.org/2001/XMLSchema-instance",
        "@xsi:nil": "true"
      },
      "chapitreAdditionnel": {
        "@xmlns:xsi": "http://www.w3.org/2001/XMLSchema-instance",
        "@xsi:nil": "true"
      },
      "urlDivisionTexteVise": "/15/textes/1255C.asp#D_Article_82"
    },
    "alinea": {
      "avant_A_Apres": {
        "@xmlns:xsi": "http://www.w3.org/2001/XMLSchema-instance",
        "@xsi:nil": "true"
      },
      "numero": "7",
      "alineaDesignation": {
        "@xmlns:xsi": "http://www.w3.org/2001/XMLSchema-instance",
        "@xsi:nil": "true"
      }
    }
  },
  "corps": {
    "dispositif": "<p style=\"text-align: justify;\">&#192; la fin de l&#8217;alin&#233;a&#160;7, substituer &#224; la date&#160;:</p><p style=\"text-align: justify;\">&#171;&#160;1<sup>er</sup> ao&#251;t 2019&#160;&#187;</p><p style=\"text-align: justify;\">la date&#160;:</p><p style=\"text-align: justify;\">&#171;&#160;1<sup>er</sup> avril 2019&#160;&#187;.</p>",
    "exposeSommaire": "<p style=\"text-align: justify;\">Afin de soutenir le pouvoir d&#8217;achat des travailleurs modestes, l&#8217;article&#160;82 du projet de loi de finances pour 2019 permet la cr&#233;ation d&#8217;une seconde bonification individuelle int&#233;gr&#233;e au calcul de la prime d&#8217;activit&#233;.</p><p style=\"text-align: justify;\">L&#8217;amendement permet d&#8217;avancer la date de cr&#233;ation du second bonus &#224; avril 2019. La mise en &#339;uvre effective du second bonus impliquera ensuite l&#8217;adoption d&#8217;un d&#233;cret d&#8217;application. Le montant maximum du second bonus s&#8217;&#233;l&#232;vera &#224; 30&#160;euros au 1<sup>er</sup>&#160;avril 2019 puis sera, chaque ann&#233;e, revaloris&#233; jusqu&#8217;&#224; atteindre 70&#160;euros en 2021.</p><p style=\"text-align: justify;\">La cr&#233;ation de la seconde bonification vient s&#8217;ajouter &#224; la revalorisation du montant forfaitaire de la prime d&#8217;activit&#233;, &#224; hauteur de 20&#160;euros au 1er ao&#251;t 2018. Ces mesures s&#8217;inscrivent dans le cadre du plan de revalorisation de la prime d&#8217;activit&#233; et offriront un gain de pouvoir d&#8217;achat pouvant atteindre 80&#160;euros pour les travailleurs r&#233;mun&#233;r&#233;s &#224; hauteur de 1&#160;SMIC.</p>",
    "annexeExposeSommaire": {
      "@xmlns:xsi": "http://www.w3.org/2001/XMLSchema-instance",
      "@xsi:nil": "true"
    }
  },
  "representations": {
    "representation": {
      "nom": "PDF",
      "typeMime": {
        "type": "application",
        "subType": "PDF"
      },
      "statutRepresentation": {
        "verbatim": "true",
        "canonique": "true",
        "officielle": "true",
        "transcription": "false",
        "enregistrement": "false"
      },
      "repSource": {
        "@xmlns:xsi": "http://www.w3.org/2001/XMLSchema-instance",
        "@xsi:nil": "true"
      },
      "offset": {
        "@xmlns:xsi": "http://www.w3.org/2001/XMLSchema-instance",
        "@xsi:nil": "true"
      },
      "contenu": {
        "documentURI": "/15/amendements/1255C/AN/1541.pdf"
      },
      "dateDispoRepresentation": {
        "@xmlns:xsi": "http://www.w3.org/2001/XMLSchema-instance",
        "@xsi:nil": "true"
      }
    }
  },
  "seanceDiscussion": "RUANR5L15S2019IDS21332",
  "sort": {
    "dateSaisie": "2018-11-08T16:50:18.000+01:00",
    "sortEnSeance": "Adopté"
  },
  "dateDepot": "2018-11-07T01:00:00.000+01:00",
  "dateDistribution": "2018-11-07T01:00:00.000+01:00",
  "article99": "1",
  "loiReference": {
    "codeLoi": {
      "@xmlns:xsi": "http://www.w3.org/2001/XMLSchema-instance",
      "@xsi:nil": "true"
    },
    "divisionCodeLoi": {
      "@xmlns:xsi": "http://www.w3.org/2001/XMLSchema-instance",
      "@xsi:nil": "true"
    }
  }
}