{
  "@xmlns": "http://schemas.assemblee-nationale.fr/referentiel",
  "uid": "AMANR5L15SEA717460BTC1767P0D1N1586",
  "identifiant": {
    "legislature": "15",
    "numero": "1586",
    "numRect": "0",
    "saisine": {
      "refTexteLegislatif": "PRJLANR5L15BTC1767",
      "numeroPartiePLF": "0",
      "organeExamen": "PO717460",
      "mentionSecondeDeliberation": "0"
    }
  },
  "numeroLong": "1586",
  "etapeTexte": "1ère lecture (1ère assemblée saisie)",
  "triAmendement": "kaaaaaaaaaaaaaaaaaaaaaaaaaaaaaaaaaaaaaaaaaaaaaaaaabi",
  "cardinaliteAmdtMultiples": "1",
  "amendementParent": {
    "@xmlns:xsi": "http://www.w3.org/2001/XMLSchema-instance",
    "@xsi:nil": "true"
  },
  "etat": "Discuté",
  "signataires": {
    "auteur": {
      "typeAuteur": "Depute",
      "acteurRef": "PA608741",
      "organeRef": {
        "@xmlns:xsi": "http://www.w3.org/2001/XMLSchema-instance",
        "@xsi:nil": "true"
      },
      "groupePolitiqueRef": "PO758835"
    },
    "cosignataires": {
      "acteurRef": [
        "PA642764",
        "PA340357",
        "PA333285",
        "PA1198",
        "PA429893",
        "PA1592",
        "PA1008",
        "PA608741",
        "PA332614",
        "PA508",
        "PA342415",
        "PA608695",
        "PA719930",
        "PA608172",
        "PA643145",
        "PA335054",
        "PA610681",
        "PA335532"
      ]
    },
    "texteAffichable": "Mme&#160;Tolmont,  Mme&#160;Vainqueur-Christophe, Mme&#160;Battistel, Mme&#160;Bi&#233;mouret, Mme&#160;Laurence&#160;Dumont, Mme&#160;Pau-Langevin, Mme&#160;Pires Beaune, Mme&#160;Karamanli, Mme&#160;Bareigts, Mme&#160;Victory, Mme&#160;Untermaier, M.&#160;Aviragnet, M.&#160;Carvounas, M.&#160;Alain&#160;David, M.&#160;David&#160;Habib, M.&#160;Vallaud, M.&#160;Juanico et M.&#160;Garot"
  },
  "pointeurFragmentTexte": {
    "missionVisee": {
      "@xmlns:xsi": "http://www.w3.org/2001/XMLSchema-instance",
      "@xsi:nil": "true"
    },
    "division": {
      "titre": "Article 17",
      "articleDesignationCourte": "APRÈS ART. 17",
      "type": "ARTICLE",
      "avant_A_Apres": "Après",
      "divisionRattachee": "APRÈS L'ARTICLE 17, insérer l'article suivant:",
      "articleAdditionnel": "1",
      "chapitreAdditionnel": {
        "@xmlns:xsi": "http://www.w3.org/2001/XMLSchema-instance",
        "@xsi:nil": "true"
      },
      "urlDivisionTexteVise": "/15/textes/1767.asp#D_Article_17"
    },
    "alinea": {
      "@xmlns:xsi": "http://www.w3.org/2001/XMLSchema-instance",
      "@xsi:nil": "true"
    }
  },
  "corps": {
    "dispositif": "<p style=\"text-align: justify;\">L&#8217;article&#160;L.&#160;2212&#8209;8 du code de la sant&#233; publique est ainsi modifi&#233;&#160;:</p><p style=\"text-align: justify;\">&#171;&#160;1&#176; Les deux&#160;premiers alin&#233;as sont supprim&#233;s&#160;;</p><p style=\"text-align: justify;\">&#171;&#160;2&#176; Le troisi&#232;me alin&#233;a est compl&#233;t&#233; par deux&#160;phrases ainsi r&#233;dig&#233;es&#160;: &#171;&#160;L&#8217;int&#233;ress&#233;e doit &#234;tre inform&#233;e sans d&#233;lai dudit refus. L&#8217;&#233;tablissement priv&#233; doit lui communiquer imm&#233;diatement le nom de praticiens ou de sages-femmes susceptibles de r&#233;aliser cette intervention selon les modalit&#233;s pr&#233;vues &#224; l&#8217;article&#160;L.&#160;2212&#8209;2.&#160;&#187;</p>",
    "exposeSommaire": "<p style=\"text-align: justify;\">Cet amendement vise &#224; abroger la clause de conscience sp&#233;cifique &#224; l&#8217;IVG.</p><p style=\"text-align: justify;\">En France, l&#8217;interruption volontaire de grossesse (IVG) est l&#233;gale depuis 43&#160;ans. Pour autant, les professionnels de sant&#233; (m&#233;decin, sage-femme, infirmier, auxiliaire m&#233;dical) ne sont jamais tenus de pratiquer cet acte comme le souligne sp&#233;cifiquement l&#8217;article L.&#160;2212&#8209;8 du code de la sant&#233; publique.</p><p style=\"text-align: justify;\">Disposer du droit d&#8217;interrompre volontairement une grossesse signifie &#233;galement pouvoir le faire en toute s&#233;curit&#233;&#160;: il s&#8217;agit non seulement d&#8217;un fondement de la libert&#233; des femmes, mais de surcro&#238;t de permettre la protection de leur vie et de leur int&#233;grit&#233; physique.</p><p style=\"text-align: justify;\">La loi n&#176;&#160;75&#8209;17 du 17 janvier 1975 relative &#224; l&#8217;interruption volontaire de la grossesse a &#233;t&#233; un compromis entre la ministre Simone VEIL d&#233;termin&#233;e &#224; garantir &#224; toutes les femmes l&#8217;acc&#232;s &#224; l&#8217;IVG et une majorit&#233; parlementaire souvent hostile &#224; la l&#233;galisation de l&#8217;avortement. Les concessions ont &#233;t&#233; nombreuses&#160;: d&#233;lai de r&#233;flexion, exigence d&#8217;une situation de d&#233;tresse, autorisation des parents pour les mineures, d&#233;lai limit&#233; &#224; dix semaines et clause de conscience sp&#233;cifique.</p><p style=\"text-align: justify;\">Depuis la l&#233;galisation, malgr&#233; de nombreuses attaques, plus ou moins concert&#233;es, contre la libert&#233; des femmes &#224; disposer de leur corps, et avec le soutien des fran&#231;ais(es) ces dispositions, qui avaient pour seule fonction de compliquer l&#8217;acc&#232;s &#224; l&#8217;IVG, ont &#233;t&#233; abrog&#233;es ou r&#233;form&#233;es. Le droit &#224; l&#8217;IVG a &#233;t&#233; confort&#233;.</p><p style=\"text-align: justify;\">Seule la clause de conscience sp&#233;cifique a perdur&#233;.</p><p style=\"text-align: justify;\">Depuis la loi Veil, les adversaires de l&#8217;IVG n&#8217;ont jamais d&#233;sarm&#233;, jamais renonc&#233;&#160;; et le droit &#224; l&#8217;IVG gratuite, accessible et libre continue de s&#8217;exercer sur une ligne de cr&#234;te. Faute d&#8217;obtenir, comme ils le revendiquent, l&#8217;interdiction de l&#8217;IVG, ils &#339;uvrent, d&#8217;une part, &#224; culpabiliser et dissuader les femmes et, d&#8217;autre part, &#224; organiser et soutenir, dans les services de sant&#233;, les r&#233;fractaires &#224; l&#8217;IVG. Leur but est explicite&#160;: rendre ineffectif le droit &#224; l&#8217;avortement.</p><p style=\"text-align: justify;\">Les propos r&#233;cents du Syndicat national des gyn&#233;cologues obst&#233;triciens de France (SYNGOF) incitant &#224; ne plus pratiquer d&#8217;IVG pour faire pression sur le Gouvernement lors de n&#233;gociations conventionnelles n&#8217;est pas une position anodine. Il s&#8217;agit d&#8217;un acte politique contre le droit des femmes, d&#8217;une menace constante faite aux femmes et &#224; la libre disposition du corps humain.</p><p style=\"text-align: justify;\">La clause de conscience est aujourd&#8217;hui le symbole d&#8217;un pouvoir m&#233;dical qui s&#8217;arroge le droit de contester la loi et continue de se mobiliser pour contr&#244;ler le corps des femmes. Elle est une menace constante et insidieuse qui p&#232;se sur la r&#233;alit&#233; tangible du droit &#224; l&#8217;IVG pour toutes les femmes.</p><p style=\"text-align: justify;\">Le code de la d&#233;ontologie m&#233;dicale pr&#233;voit dans son article&#160;47 relatif &#224; la continuit&#233; des soins (article R.&#160;4127&#8209;47 du code de la sant&#233; publique) le droit de tous les professionnels de sant&#233; de refuser, pour des raisons personnelles, de pratiquer des actes m&#233;dicaux.</p><p style=\"text-align: justify;\">Le pr&#233;sent amendement vise donc &#224; abroger la clause de conscience sp&#233;cifique &#224; l&#8217;IVG pr&#233;vue aux deux premiers alin&#233;as de l&#8217;article&#160;L.&#160;2212&#8209;8 du code de la sant&#233; publique.</p>",
    "annexeExposeSommaire": {
      "@xmlns:xsi": "http://www.w3.org/2001/XMLSchema-instance",
      "@xsi:nil": "true"
    },
    "cartoucheDelaiDepotDepasse": {
      "@xmlns:xsi": "http://www.w3.org/2001/XMLSchema-instance",
      "@xsi:nil": "true"
    }
  },
  "representations": {
    "representation": {
      "nom": "PDF",
      "typeMime": {
        "type": "application",
        "subType": "PDF"
      },
      "statutRepresentation": {
        "verbatim": "true",
        "canonique": "true",
        "officielle": "true",
        "transcription": "false",
        "enregistrement": "false"
      },
      "repSource": {
        "@xmlns:xsi": "http://www.w3.org/2001/XMLSchema-instance",
        "@xsi:nil": "true"
      },
      "offset": {
        "@xmlns:xsi": "http://www.w3.org/2001/XMLSchema-instance",
        "@xsi:nil": "true"
      },
      "contenu": {
        "documentURI": "/15/amendements/1767/AN/1586.pdf"
      },
      "dateDispoRepresentation": {
        "@xmlns:xsi": "http://www.w3.org/2001/XMLSchema-instance",
        "@xsi:nil": "true"
      }
    }
  },
  "seanceDiscussion": "RUANR5L15S2019IDS21567",
  "sort": {
    "dateSaisie": "2019-03-22T23:34:01.000+01:00",
    "sortEnSeance": "Rejeté"
  },
  "dateDepot": "2019-03-15T01:00:00.000+01:00",
  "dateDistribution": "2019-03-19T01:00:00.000+01:00",
  "article99": "0",
  "loiReference": {
    "codeLoi": "c santé publique",
    "divisionCodeLoi": "L2212-8"
  }
}