{
  "@xmlns": "http://schemas.assemblee-nationale.fr/referentiel",
  "uid": "AMANR5L15SEA717460B0477P0D1N23",
  "identifiant": {
    "legislature": "15",
    "numero": "23",
    "numRect": "0",
    "saisine": {
      "refTexteLegislatif": "PIONANR5L15B0477",
      "numeroPartiePLF": "0",
      "organeExamen": "PO717460",
      "mentionSecondeDeliberation": "0"
    }
  },
  "numeroLong": "23",
  "etapeTexte": "1ère lecture (1ère assemblée saisie)",
  "triAmendement": "m",
  "cardinaliteAmdtMultiples": "1",
  "amendementParent": {
    "@xmlns:xsi": "http://www.w3.org/2001/XMLSchema-instance",
    "@xsi:nil": "true"
  },
  "etat": "A discuter",
  "signataires": {
    "auteur": {
      "typeAuteur": "Depute",
      "acteurRef": "PA722374",
      "organeRef": {
        "@xmlns:xsi": "http://www.w3.org/2001/XMLSchema-instance",
        "@xsi:nil": "true"
      },
      "groupePolitiqueRef": "PO730970"
    },
    "cosignataires": {
      "acteurRef": [
        "PA721992",
        "PA722374",
        "PA720924",
        "PA720968",
        "PA720326",
        "PA721924"
      ]
    },
    "texteAffichable": "M.&#160;Isaac-Sibille,  M.&#160;Hammouche, Mme&#160;Benin, Mme&#160;Elimas, Mme&#160;Gallerneau et Mme&#160;de Vaucouleurs"
  },
  "pointeurFragmentTexte": {
    "missionVisee": {
      "@xmlns:xsi": "http://www.w3.org/2001/XMLSchema-instance",
      "@xsi:nil": "true"
    },
    "division": {
      "titre": "Article 3",
      "articleDesignationCourte": "ART. 3",
      "type": "ARTICLE",
      "avant_A_Apres": "A",
      "divisionRattachee": "ARTICLE 3",
      "articleAdditionnel": {
        "@xmlns:xsi": "http://www.w3.org/2001/XMLSchema-instance",
        "@xsi:nil": "true"
      },
      "chapitreAdditionnel": {
        "@xmlns:xsi": "http://www.w3.org/2001/XMLSchema-instance",
        "@xsi:nil": "true"
      },
      "urlDivisionTexteVise": "/15/textes/0477.asp#D_Article_3"
    },
    "alinea": {
      "@xmlns:xsi": "http://www.w3.org/2001/XMLSchema-instance",
      "@xsi:nil": "true"
    }
  },
  "corps": {
    "dispositif": "<p>Supprimer cet article.</p>",
    "exposeSommaire": "<p style=\"text-align: justify;\">L&#8217;article&#160;3 vise &#224; garantir la mise en &#339;uvre, par l&#8217;&#201;tat, du tiers payant, dans les centres&#160;de sant&#233;. Il est pr&#233;sent&#233; comme un levier majeur pour faire &#233;voluer l&#8217;offre de sant&#233;.</p><p style=\"text-align: justify;\">Or, actuellement, outre que ceux qui en besoin en b&#233;n&#233;ficient d&#233;j&#224;, le tiers-payant ne fait que rajouter du temps administratif aux m&#233;decins, au d&#233;triment du temps m&#233;dical.</p><p style=\"text-align: justify;\">Pour lutter contre la d&#233;sertification m&#233;dicale, il faut, au contraire, all&#233;ger la charge administrative pour augmenter le temps m&#233;dical et rendre plus attractive l&#8217;activit&#233; lib&#233;rale.</p><p style=\"text-align: justify;\">En outre, fin 2017, un rapport de&#160;l&#8217;Inspection G&#233;n&#233;rale des Affaires Sociales (IGAS) a jug&#233; &#171;&#160;irr&#233;aliste&#160;&#187; et pr&#233;matur&#233;e la mise en place du tiers-payant g&#233;n&#233;ralis&#233; d&#232;s le 1<sup>er</sup> d&#233;cembre 2017 comme cela &#233;tait initialement pr&#233;vu par&#160;la&#160;loi de modernisation de notre syst&#232;me de sant&#233; du 26 janvier 2016. Dans le cadre du projet de loi de financement de la s&#233;curit&#233; sociale pour 2018, une mesure a &#233;t&#233; donc adopt&#233;e afin de&#160;lever cette obligation.</p><p style=\"text-align: justify;\">Cet article est donc, l&#224; encore, contreproductif par rapport au but poursuivi. C&#8217;est pourquoi nous proposons sa suppression.</p>",
    "annexeExposeSommaire": {
      "@xmlns:xsi": "http://www.w3.org/2001/XMLSchema-instance",
      "@xsi:nil": "true"
    }
  },
  "representations": {
    "representation": {
      "nom": "PDF",
      "typeMime": {
        "type": "application",
        "subType": "PDF"
      },
      "statutRepresentation": {
        "verbatim": "true",
        "canonique": "true",
        "officielle": "true",
        "transcription": "false",
        "enregistrement": "false"
      },
      "repSource": {
        "@xmlns:xsi": "http://www.w3.org/2001/XMLSchema-instance",
        "@xsi:nil": "true"
      },
      "offset": {
        "@xmlns:xsi": "http://www.w3.org/2001/XMLSchema-instance",
        "@xsi:nil": "true"
      },
      "contenu": {
        "documentURI": "/15/amendements/0477/AN/23.pdf"
      },
      "dateDispoRepresentation": {
        "@xmlns:xsi": "http://www.w3.org/2001/XMLSchema-instance",
        "@xsi:nil": "true"
      }
    }
  },
  "seanceDiscussion": {
    "@xmlns:xsi": "http://www.w3.org/2001/XMLSchema-instance",
    "@xsi:nil": "true"
  },
  "sort": {
    "@xmlns:xsi": "http://www.w3.org/2001/XMLSchema-instance",
    "@xsi:nil": "true"
  },
  "dateDepot": "2018-01-15T01:00:00.000+01:00",
  "dateDistribution": "2018-01-16T01:00:00.000+01:00",
  "article99": "0",
  "loiReference": {
    "codeLoi": {
      "@xmlns:xsi": "http://www.w3.org/2001/XMLSchema-instance",
      "@xsi:nil": "true"
    },
    "divisionCodeLoi": {
      "@xmlns:xsi": "http://www.w3.org/2001/XMLSchema-instance",
      "@xsi:nil": "true"
    }
  }
}