{
  "@xmlns": "http://schemas.assemblee-nationale.fr/referentiel",
  "uid": "AMANR5L15PO59051B1491P0D1N64",
  "identifiant": {
    "legislature": "15",
    "numero": "64",
    "numRect": "0",
    "saisine": {
      "refTexteLegislatif": "PIONANR5L15B1491",
      "numeroPartiePLF": "0",
      "organeExamen": "PO59051",
      "mentionSecondeDeliberation": "0"
    }
  },
  "numeroLong": "CL64",
  "etapeTexte": "1ère lecture (2ème assemblée saisie)",
  "triAmendement": "aiaaaaaaaaaaaaaaaaaaaaaaaaaaaaaaaaaaaaaaaaaaaaaaaaanu",
  "cardinaliteAmdtMultiples": "1",
  "amendementParent": {
    "@xmlns:xsi": "http://www.w3.org/2001/XMLSchema-instance",
    "@xsi:nil": "true"
  },
  "etat": "Discuté",
  "signataires": {
    "auteur": {
      "typeAuteur": "Depute",
      "acteurRef": "PA719874",
      "organeRef": {
        "@xmlns:xsi": "http://www.w3.org/2001/XMLSchema-instance",
        "@xsi:nil": "true"
      },
      "groupePolitiqueRef": "PO730970"
    },
    "cosignataires": {
      "acteurRef": [
        "PA719874",
        "PA720772",
        "PA721984",
        "PA719558",
        "PA720704",
        "PA721742"
      ]
    },
    "texteAffichable": "Mme&#160;Jacquier-Laforge,  M.&#160;Balanant, M.&#160;Bru, Mme&#160;Florennes, M.&#160;Latombe et Mme&#160;Vichnievsky"
  },
  "pointeurFragmentTexte": {
    "missionVisee": {
      "@xmlns:xsi": "http://www.w3.org/2001/XMLSchema-instance",
      "@xsi:nil": "true"
    },
    "division": {
      "titre": "Article PREMIER",
      "articleDesignationCourte": "ART. PREMIER",
      "type": "ARTICLE",
      "avant_A_Apres": "A",
      "divisionRattachee": "ARTICLE PREMIER",
      "articleAdditionnel": {
        "@xmlns:xsi": "http://www.w3.org/2001/XMLSchema-instance",
        "@xsi:nil": "true"
      },
      "chapitreAdditionnel": {
        "@xmlns:xsi": "http://www.w3.org/2001/XMLSchema-instance",
        "@xsi:nil": "true"
      },
      "urlDivisionTexteVise": "/15/textes/1491.asp#D_Article_1er"
    },
    "alinea": {
      "avant_A_Apres": {
        "@xmlns:xsi": "http://www.w3.org/2001/XMLSchema-instance",
        "@xsi:nil": "true"
      },
      "numero": "1",
      "alineaDesignation": {
        "@xmlns:xsi": "http://www.w3.org/2001/XMLSchema-instance",
        "@xsi:nil": "true"
      }
    }
  },
  "corps": {
    "dispositif": "<p style=\"text-align: justify;\">Compl&#233;ter l&#8217;alin&#233;a&#160;1 par les deux phrases suivantes&#160;:</p><p style=\"text-align: justify;\">&#171;&#160;Ce nombre ne peut d&#233;passer&#160;69. Lorsqu&#8217;il est sup&#233;rieur &#224; ce nombre, il est fix&#233; &#224;&#160;69.&#160;&#187;</p>",
    "exposeSommaire": "<p style=\"text-align: justify;\">La 2e p&#233;riode transitoire doit permettre aux communes nouvelles qui regroupent le plus grand nombre de communes \"historiques\" de conna&#238;tre une baisse mesur&#233;e de l'effectif de leur conseil municipal. Il s'agit ainsi d'assurer une meilleure repr&#233;sentation de la commune sur l'ensemble de son territoire et permettre aux &#233;lus de maintenir des liens plus &#233;troits avec les habitants.</p><p>Pour autant, afin d'&#233;viter un effectif pl&#233;thorique pouvant aller jusqu'&#224; 83 &#233;lus, cet amendement propose de retenir le nombre&#160;de 69 conseillers municipaux comme limite maximale, cette limite &#233;tant celle actuellement en vigueur&#160;selon les r&#232;gles de droit commun pr&#233;vues &#224; l'article L. 2121-2 du CGCT.</p>",
    "annexeExposeSommaire": {
      "@xmlns:xsi": "http://www.w3.org/2001/XMLSchema-instance",
      "@xsi:nil": "true"
    },
    "cartoucheDelaiDepotDepasse": {
      "@xmlns:xsi": "http://www.w3.org/2001/XMLSchema-instance",
      "@xsi:nil": "true"
    }
  },
  "representations": {
    "representation": {
      "nom": "PDF",
      "typeMime": {
        "type": "application",
        "subType": "PDF"
      },
      "statutRepresentation": {
        "verbatim": "true",
        "canonique": "true",
        "officielle": "true",
        "transcription": "false",
        "enregistrement": "false"
      },
      "repSource": {
        "@xmlns:xsi": "http://www.w3.org/2001/XMLSchema-instance",
        "@xsi:nil": "true"
      },
      "offset": {
        "@xmlns:xsi": "http://www.w3.org/2001/XMLSchema-instance",
        "@xsi:nil": "true"
      },
      "contenu": {
        "documentURI": "/15/amendements/1491/CION_LOIS/CL64.pdf"
      },
      "dateDispoRepresentation": {
        "@xmlns:xsi": "http://www.w3.org/2001/XMLSchema-instance",
        "@xsi:nil": "true"
      }
    }
  },
  "seanceDiscussion": {
    "@xmlns:xsi": "http://www.w3.org/2001/XMLSchema-instance",
    "@xsi:nil": "true"
  },
  "sort": {
    "dateSaisie": "2019-07-03T10:44:42.000+02:00",
    "sortEnSeance": "Tombé"
  },
  "dateDepot": "2019-06-28T02:00:00.000+02:00",
  "dateDistribution": "2019-07-01T02:00:00.000+02:00",
  "article99": "0",
  "loiReference": {
    "codeLoi": "2.18",
    "divisionCodeLoi": "dc"
  }
}