{
  "@xmlns": "http://schemas.assemblee-nationale.fr/referentiel",
  "uid": "AMANR5L15SEA717460BTC0765P0D1N19",
  "identifiant": {
    "legislature": "15",
    "numero": "19",
    "numRect": "1",
    "saisine": {
      "refTexteLegislatif": "PRJLANR5L15BTC0765",
      "numeroPartiePLF": "0",
      "organeExamen": "PO717460",
      "mentionSecondeDeliberation": "0"
    }
  },
  "numeroLong": "19 (Rect)",
  "etapeTexte": "1ère lecture (1ère assemblée saisie)",
  "triAmendement": "zzzzzzzzzzzzzzzzzzzzzzzzzzzzzzzzzzzzzzzzzzzzzzzzzzzzi",
  "cardinaliteAmdtMultiples": "1",
  "amendementParent": {
    "@xmlns:xsi": "http://www.w3.org/2001/XMLSchema-instance",
    "@xsi:nil": "true"
  },
  "etat": "Discuté",
  "signataires": {
    "auteur": {
      "typeAuteur": "Depute",
      "acteurRef": "PA720846",
      "organeRef": {
        "@xmlns:xsi": "http://www.w3.org/2001/XMLSchema-instance",
        "@xsi:nil": "true"
      },
      "groupePolitiqueRef": "PO730958"
    },
    "cosignataires": {
      "acteurRef": [
        "PA721062",
        "PA720430",
        "PA720422",
        "PA2150",
        "PA721960",
        "PA718860",
        "PA722142",
        "PA720892",
        "PA719676",
        "PA721210",
        "PA718868",
        "PA721226",
        "PA588884",
        "PA719578",
        "PA721202",
        "PA720846",
        "PA720286"
      ]
    },
    "texteAffichable": "M.&#160;Lachaud,  Mme&#160;Autain, M.&#160;Bernalicis, M.&#160;Coquerel, M.&#160;Corbi&#232;re, Mme&#160;Fiat, M.&#160;Larive, M.&#160;M&#233;lenchon, Mme&#160;Obono, Mme&#160;Panot, M.&#160;Prud&apos;homme, M.&#160;Quatennens, M.&#160;Ratenon, Mme&#160;Ressiguier, Mme&#160;Rubin, M.&#160;Ruffin et Mme&#160;Taurine"
  },
  "pointeurFragmentTexte": {
    "missionVisee": {
      "@xmlns:xsi": "http://www.w3.org/2001/XMLSchema-instance",
      "@xsi:nil": "true"
    },
    "division": {
      "titre": "RAPPORT ANNEXÉ",
      "articleDesignationCourte": "ART. 2",
      "type": "ANNEXE",
      "avant_A_Apres": "A",
      "divisionRattachee": "ARTICLE 2",
      "articleAdditionnel": {
        "@xmlns:xsi": "http://www.w3.org/2001/XMLSchema-instance",
        "@xsi:nil": "true"
      },
      "chapitreAdditionnel": {
        "@xmlns:xsi": "http://www.w3.org/2001/XMLSchema-instance",
        "@xsi:nil": "true"
      },
      "urlDivisionTexteVise": "/15/textes/0765.asp#D_RAPPORT_ANNEXE"
    },
    "alinea": {
      "avant_A_Apres": "A",
      "numero": "282",
      "alineaDesignation": "Alinéa 282"
    }
  },
  "corps": {
    "dispositif": "<p style=\"text-align: justify;\">Compl&#233;ter la troisi&#232;me phrase de l&#8217;alin&#233;a&#160;282 par les mots&#160;:</p><p style=\"text-align: justify;\">&#171;&#160;sous r&#233;serve qu&#8217;un agent humain ou plusieurs demeurent en situation de contr&#244;le.&#160;&#187;</p>",
    "exposeSommaire": "<p style=\"text-align: justify;\">Les avanc&#233;es techniques en mati&#232;re d&#8217;automatisation posent pour les arm&#233;es des questions &#233;thiques d&#233;licates.</p><p style=\"text-align: justify;\">Alors que le pr&#233;sent rapport souligne justement les risques que repr&#233;sente le nivellement technologique&#160;; il manifeste, paradoxalement, une confiance exag&#233;r&#233;e dans la capacit&#233; des technologies de pointe de faire atteindre &#224; la France et &#224; ses armes leurs objectifs.</p><p style=\"text-align: justify;\">Afin de se pr&#233;munir de toute d&#233;rive, le pr&#233;sent amendement vise &#224; placer effectivement les dispositifs les plus r&#233;cents sous contr&#244;le humain.</p>",
    "annexeExposeSommaire": {
      "@xmlns:xsi": "http://www.w3.org/2001/XMLSchema-instance",
      "@xsi:nil": "true"
    }
  },
  "representations": {
    "representation": {
      "nom": "PDF",
      "typeMime": {
        "type": "application",
        "subType": "PDF"
      },
      "statutRepresentation": {
        "verbatim": "true",
        "canonique": "true",
        "officielle": "true",
        "transcription": "false",
        "enregistrement": "false"
      },
      "repSource": {
        "@xmlns:xsi": "http://www.w3.org/2001/XMLSchema-instance",
        "@xsi:nil": "true"
      },
      "offset": {
        "@xmlns:xsi": "http://www.w3.org/2001/XMLSchema-instance",
        "@xsi:nil": "true"
      },
      "contenu": {
        "documentURI": "/15/amendements/0765/AN/19.pdf"
      },
      "dateDispoRepresentation": {
        "@xmlns:xsi": "http://www.w3.org/2001/XMLSchema-instance",
        "@xsi:nil": "true"
      }
    }
  },
  "seanceDiscussion": "RUANR5L15S2018IDS20954",
  "sort": {
    "dateSaisie": "2018-03-22T00:46:54.000+01:00",
    "sortEnSeance": "Adopté"
  },
  "dateDepot": "2018-03-15T01:00:00.000+01:00",
  "dateDistribution": "2018-03-19T01:00:00.000+01:00",
  "article99": "0",
  "loiReference": {
    "codeLoi": {
      "@xmlns:xsi": "http://www.w3.org/2001/XMLSchema-instance",
      "@xsi:nil": "true"
    },
    "divisionCodeLoi": {
      "@xmlns:xsi": "http://www.w3.org/2001/XMLSchema-instance",
      "@xsi:nil": "true"
    }
  }
}