{
  "@xmlns": "http://schemas.assemblee-nationale.fr/referentiel",
  "uid": "AMANR5L15SEA717460BTC2206P0D1N78",
  "identifiant": {
    "legislature": "15",
    "numero": "78",
    "numRect": "0",
    "saisine": {
      "refTexteLegislatif": "PRJLANR5L15BTC2206",
      "numeroPartiePLF": "0",
      "organeExamen": "PO717460",
      "mentionSecondeDeliberation": "0"
    }
  },
  "numeroLong": "78",
  "etapeTexte": "Nouvelle Lecture",
  "triAmendement": "heaaiaaaaaaaaaaaaaaaaaaaaaaaaaaaaaaaaaaaaaaaaaaaaazzzzzzzzzzzzzzzzz",
  "cardinaliteAmdtMultiples": "1",
  "amendementParent": {
    "@xmlns:xsi": "http://www.w3.org/2001/XMLSchema-instance",
    "@xsi:nil": "true"
  },
  "etat": "Discuté",
  "signataires": {
    "auteur": {
      "typeAuteur": "Depute",
      "acteurRef": "PA330909",
      "organeRef": {
        "@xmlns:xsi": "http://www.w3.org/2001/XMLSchema-instance",
        "@xsi:nil": "true"
      },
      "groupePolitiqueRef": "PO730934"
    },
    "cosignataires": {
      "acteurRef": [
        "PA334654",
        "PA721968",
        "PA330909",
        "PA721816",
        "PA720210",
        "PA606712",
        "PA607090",
        "PA267260",
        "PA719318",
        "PA267527",
        "PA267204",
        "PA718780",
        "PA718838",
        "PA767",
        "PA718884",
        "PA608416",
        "PA721314",
        "PA712015",
        "PA1874",
        "PA266776",
        "PA267429",
        "PA720386",
        "PA267785",
        "PA2155",
        "PA608016",
        "PA346218",
        "PA267735",
        "PA266793",
        "PA643134",
        "PA340853",
        "PA720644",
        "PA709315",
        "PA1012",
        "PA720586",
        "PA642847",
        "PA722390"
      ]
    },
    "texteAffichable": "M.&#160;Descoeur,  M.&#160;Sermier, M.&#160;Schellenberger, Mme&#160;Bazin-Malgras, Mme&#160;Anthoine, Mme&#160;Poletti, Mme&#160;Beauvais, M.&#160;Lurton, M.&#160;Vialay, M.&#160;Hetzel, M.&#160;Brun, Mme&#160;Corneloup, M.&#160;Straumann, M.&#160;Reiss, Mme&#160;Valentin, M.&#160;Dive, M.&#160;Boucard, M.&#160;Vatin, M.&#160;de la Verpilli&#232;re, M.&#160;de Ganay, M.&#160;Di Filippo, M.&#160;Jean-Pierre&#160;Vigier, M.&#160;Leclerc, M.&#160;Bony, M.&#160;Saddier, M.&#160;Bazin, M.&#160;Viala, M.&#160;Menuel, M.&#160;Larriv&#233;, M.&#160;Le Fur, M.&#160;Nury, M.&#160;Masson, Mme&#160;Louwagie, M.&#160;Cinieri, Mme&#160;Trastour-Isnart et M.&#160;Cattin"
  },
  "pointeurFragmentTexte": {
    "missionVisee": {
      "@xmlns:xsi": "http://www.w3.org/2001/XMLSchema-instance",
      "@xsi:nil": "true"
    },
    "division": {
      "titre": "RAPPORT ANNEXÉ",
      "articleDesignationCourte": "ART. 1ER A",
      "type": "ANNEXE",
      "avant_A_Apres": "A",
      "divisionRattachee": "ARTICLE 1ER A",
      "articleAdditionnel": {
        "@xmlns:xsi": "http://www.w3.org/2001/XMLSchema-instance",
        "@xsi:nil": "true"
      },
      "chapitreAdditionnel": {
        "@xmlns:xsi": "http://www.w3.org/2001/XMLSchema-instance",
        "@xsi:nil": "true"
      },
      "urlDivisionTexteVise": "/15/textes/2206.asp#D_RAPPORT_ANNEXE"
    },
    "alinea": {
      "avant_A_Apres": {
        "@xmlns:xsi": "http://www.w3.org/2001/XMLSchema-instance",
        "@xsi:nil": "true"
      },
      "numero": "38",
      "alineaDesignation": {
        "@xmlns:xsi": "http://www.w3.org/2001/XMLSchema-instance",
        "@xsi:nil": "true"
      }
    }
  },
  "corps": {
    "dispositif": "<p>Compl&#233;ter l&#8217;alin&#233;a&#160;38 par les mots&#160;:</p><p style=\"text-align: justify;\">&#171;&#160;, prioritairement dans les zones rurales et de montagne reconnues enclav&#233;es&#160;&#187;.</p>",
    "exposeSommaire": "<p style=\"text-align: justify;\">Aujourd&#8217;hui, les ruraux n&#8217;ont souvent pas d&#8217;autres alternatives comme moyen de locomotion que leur voiture. Souvent, du fait de l&#8217;absence de r&#233;seaux de transport en commun, chaque foyer dispose de deux voitures.. Avec la hausse du prix des carburants, cela repr&#233;sente pour de nombreux m&#233;nages un budget tr&#232;s important. Certaines zones du territoires et leurs habitants se trouvent ainsi de plus en plus p&#233;nalis&#233;s en raison d&#8217;un manque d&#8217;entretien des r&#233;seaux qui les entourent. Il est donc urgent d&#8217;apporter une attention particuli&#232;re et d&#8217;investir prioritairement dans ces zones. Tel est l&#8217;objet du pr&#233;sent amendement.</p>",
    "annexeExposeSommaire": {
      "@xmlns:xsi": "http://www.w3.org/2001/XMLSchema-instance",
      "@xsi:nil": "true"
    },
    "cartoucheDelaiDepotDepasse": {
      "@xmlns:xsi": "http://www.w3.org/2001/XMLSchema-instance",
      "@xsi:nil": "true"
    },
    "avantAppel": {
      "@xmlns:xsi": "http://www.w3.org/2001/XMLSchema-instance",
      "@xsi:nil": "true"
    }
  },
  "representations": {
    "representation": {
      "nom": "PDF",
      "typeMime": {
        "type": "application",
        "subType": "PDF"
      },
      "statutRepresentation": {
        "verbatim": "true",
        "canonique": "true",
        "officielle": "true",
        "transcription": "false",
        "enregistrement": "false"
      },
      "repSource": {
        "@xmlns:xsi": "http://www.w3.org/2001/XMLSchema-instance",
        "@xsi:nil": "true"
      },
      "offset": {
        "@xmlns:xsi": "http://www.w3.org/2001/XMLSchema-instance",
        "@xsi:nil": "true"
      },
      "contenu": {
        "documentURI": "/15/amendements/2206/AN/78.pdf"
      },
      "dateDispoRepresentation": {
        "@xmlns:xsi": "http://www.w3.org/2001/XMLSchema-instance",
        "@xsi:nil": "true"
      }
    }
  },
  "seanceDiscussion": "RUANR5L15S2019IDS21806",
  "sort": {
    "dateSaisie": "2019-09-12T15:53:40.000+02:00",
    "sortEnSeance": "Rejeté"
  },
  "dateDepot": "2019-09-05T02:00:00.000+02:00",
  "dateDistribution": "2019-09-10T02:00:00.000+02:00",
  "article99": "0",
  "loiReference": {
    "codeLoi": {
      "@xmlns:xsi": "http://www.w3.org/2001/XMLSchema-instance",
      "@xsi:nil": "true"
    },
    "divisionCodeLoi": {
      "@xmlns:xsi": "http://www.w3.org/2001/XMLSchema-instance",
      "@xsi:nil": "true"
    }
  }
}