{
  "@xmlns": "http://schemas.assemblee-nationale.fr/referentiel",
  "uid": "AMANR5L15SEA717460BTC1629P0D1N5",
  "identifiant": {
    "legislature": "15",
    "numero": "5",
    "numRect": "0",
    "saisine": {
      "refTexteLegislatif": "PRJLANR5L15BTC1629",
      "numeroPartiePLF": "0",
      "organeExamen": "PO717460",
      "mentionSecondeDeliberation": "1"
    }
  },
  "numeroLong": "5",
  "etapeTexte": "1ère lecture (1ère assemblée saisie)",
  "triAmendement": "efaaaaaaaaaaaaaaaaaaaaaaaaaaaaaaaaaaaaaaaaaaaaaaaao",
  "cardinaliteAmdtMultiples": "1",
  "amendementParent": {
    "@xmlns:xsi": "http://www.w3.org/2001/XMLSchema-instance",
    "@xsi:nil": "true"
  },
  "etat": "Discuté",
  "signataires": {
    "auteur": {
      "typeAuteur": "Depute",
      "acteurRef": "PA340853",
      "organeRef": {
        "@xmlns:xsi": "http://www.w3.org/2001/XMLSchema-instance",
        "@xsi:nil": "true"
      },
      "groupePolitiqueRef": "PO730934"
    },
    "cosignataires": {
      "acteurRef": [
        "PA605036",
        "PA719318",
        "PA266793",
        "PA718884",
        "PA340853",
        "PA642847",
        "PA721506",
        "PA334654",
        "PA267527",
        "PA643103",
        "PA606712",
        "PA267204",
        "PA608016",
        "PA336316",
        "PA709315",
        "PA721968"
      ]
    },
    "texteAffichable": "M.&#160;Leclerc,  M.&#160;Bony, M.&#160;Sermier, Mme&#160;Anthoine, Mme&#160;Bazin-Malgras, M.&#160;Straumann, M.&#160;Abad, Mme&#160;Kuster, M.&#160;Vialay, M.&#160;Lurton, Mme&#160;Louwagie, M.&#160;Bouchet, M.&#160;Viala, M.&#160;Bazin, M.&#160;Ferrara et M.&#160;Saddier"
  },
  "pointeurFragmentTexte": {
    "missionVisee": {
      "@xmlns:xsi": "http://www.w3.org/2001/XMLSchema-instance",
      "@xsi:nil": "true"
    },
    "division": {
      "titre": "Article 9",
      "articleDesignationCourte": "ART. 9",
      "type": "ARTICLE",
      "avant_A_Apres": "A",
      "divisionRattachee": "ARTICLE 9",
      "articleAdditionnel": {
        "@xmlns:xsi": "http://www.w3.org/2001/XMLSchema-instance",
        "@xsi:nil": "true"
      },
      "chapitreAdditionnel": {
        "@xmlns:xsi": "http://www.w3.org/2001/XMLSchema-instance",
        "@xsi:nil": "true"
      },
      "urlDivisionTexteVise": "/15/textes/1629.asp#D_Article_9"
    },
    "alinea": {
      "avant_A_Apres": {
        "@xmlns:xsi": "http://www.w3.org/2001/XMLSchema-instance",
        "@xsi:nil": "true"
      },
      "numero": "13",
      "alineaDesignation": {
        "@xmlns:xsi": "http://www.w3.org/2001/XMLSchema-instance",
        "@xsi:nil": "true"
      }
    }
  },
  "corps": {
    "dispositif": "<p style=\"text-align: justify;\">Compl&#233;ter l&#8217;alin&#233;a&#160;13 par la phrase suivante&#160;:</p><p style=\"text-align: justify;\">&#171;&#160;Les parlementaires d&#233;sign&#233;s ne peuvent pas &#234;tre des fonctionnaires de l&#8217;&#233;ducation nationale en disponibilit&#233; ou en retraite.&#160;&#187;</p>",
    "exposeSommaire": "<p style=\"text-align: justify;\">Afin d&#8217;assurer une certaine diversit&#233; au sein de ce conseil d&#8217;&#233;valuation de l&#8217;&#233;cole, il appara&#238;t souhaitable que la pr&#233;sence de parlementaires ne vienne pas indirectement renforcer le contingent des fonctionnaires de l&#8217;&#233;ducation nationale qui en sont membres.</p>",
    "annexeExposeSommaire": {
      "@xmlns:xsi": "http://www.w3.org/2001/XMLSchema-instance",
      "@xsi:nil": "true"
    },
    "cartoucheDelaiDepotDepasse": {
      "@xmlns:xsi": "http://www.w3.org/2001/XMLSchema-instance",
      "@xsi:nil": "true"
    }
  },
  "representations": {
    "representation": {
      "nom": "PDF",
      "typeMime": {
        "type": "application",
        "subType": "PDF"
      },
      "statutRepresentation": {
        "verbatim": "true",
        "canonique": "true",
        "officielle": "true",
        "transcription": "false",
        "enregistrement": "false"
      },
      "repSource": {
        "@xmlns:xsi": "http://www.w3.org/2001/XMLSchema-instance",
        "@xsi:nil": "true"
      },
      "offset": {
        "@xmlns:xsi": "http://www.w3.org/2001/XMLSchema-instance",
        "@xsi:nil": "true"
      },
      "contenu": {
        "documentURI": "/15/amendements/1629/AN/5.pdf"
      },
      "dateDispoRepresentation": {
        "@xmlns:xsi": "http://www.w3.org/2001/XMLSchema-instance",
        "@xsi:nil": "true"
      }
    }
  },
  "seanceDiscussion": "RUANR5L15S2019IDS21507",
  "sort": {
    "dateSaisie": "2019-02-15T18:23:15.000+01:00",
    "sortEnSeance": "Rejeté"
  },
  "dateDepot": "2019-02-04T01:00:00.000+01:00",
  "dateDistribution": "2019-02-11T01:00:00.000+01:00",
  "article99": "0",
  "loiReference": {
    "codeLoi": {
      "@xmlns:xsi": "http://www.w3.org/2001/XMLSchema-instance",
      "@xsi:nil": "true"
    },
    "divisionCodeLoi": {
      "@xmlns:xsi": "http://www.w3.org/2001/XMLSchema-instance",
      "@xsi:nil": "true"
    }
  }
}