{
  "@xmlns": "http://schemas.assemblee-nationale.fr/referentiel",
  "uid": "AMANR5L15PO59048B0235P2D1N225",
  "identifiant": {
    "legislature": "15",
    "numero": "225",
    "numRect": "0",
    "saisine": {
      "refTexteLegislatif": "PRJLANR5L15B0235",
      "numeroPartiePLF": "2",
      "organeExamen": "PO59048",
      "mentionSecondeDeliberation": "0"
    }
  },
  "numeroLong": "II-CF225",
  "etapeTexte": "1ère lecture (1ère assemblée saisie)",
  "triAmendement": "fi",
  "cardinaliteAmdtMultiples": "1",
  "amendementParent": {
    "@xmlns:xsi": "http://www.w3.org/2001/XMLSchema-instance",
    "@xsi:nil": "true"
  },
  "etat": "Discuté",
  "signataires": {
    "auteur": {
      "typeAuteur": "Depute",
      "acteurRef": "PA2960",
      "organeRef": {
        "@xmlns:xsi": "http://www.w3.org/2001/XMLSchema-instance",
        "@xsi:nil": "true"
      },
      "groupePolitiqueRef": "PO730934"
    },
    "cosignataires": {
      "acteurRef": [
        "PA856",
        "PA720630",
        "PA718850",
        "PA605036",
        "PA712015",
        "PA2960",
        "PA330240",
        "PA330008",
        "PA267429",
        "PA266797",
        "PA267735",
        "PA346218",
        "PA334654",
        "PA267527",
        "PA721506",
        "PA606712",
        "PA718780",
        "PA721070",
        "PA642847",
        "PA267260",
        "PA720210",
        "PA721410",
        "PA2377",
        "PA1874",
        "PA1498",
        "PA267378",
        "PA607090",
        "PA608416",
        "PA330684",
        "PA605991",
        "PA608016",
        "PA2086",
        "PA718838",
        "PA608826",
        "PA643134",
        "PA719946",
        "PA2492"
      ]
    },
    "texteAffichable": "M.&#160;Woerth,  M.&#160;Abad, M.&#160;Bazin, Mme&#160;Beauvais, Mme&#160;Bonnivard, Mme&#160;Val&#233;rie&#160;Boyer, M.&#160;Breton, M.&#160;Brun, M.&#160;Cinieri, M.&#160;Cherpion, M.&#160;Ciotti, M.&#160;Cordier, M.&#160;de Ganay, M.&#160;Dive, Mme&#160;Duby-Muller, Mme&#160;Genevard, M.&#160;Goasguen, M.&#160;Gosselin, M.&#160;Hetzel, Mme&#160;Kuster, M.&#160;Le Fur, Mme&#160;Levy, Mme&#160;Louwagie, M.&#160;Lurton, M.&#160;Marlin, M.&#160;Masson, M.&#160;Minot, M.&#160;Quentin, M.&#160;Peltier, M.&#160;Perrut, Mme&#160;Poletti, Mme&#160;Ramassamy, M.&#160;Saddier, M.&#160;Straumann, Mme&#160;Trastour-Isnart, Mme&#160;Valentin et M.&#160;Jean-Pierre&#160;Vigier"
  },
  "pointeurFragmentTexte": {
    "missionVisee": {
      "idMissionAN": "32",
      "libelleMission": "Travail et emploi",
      "codeMissionPLF": "B",
      "libelleMissionPLF": "Répartition, par mission et programme, des crédits du budget général"
    },
    "division": {
      "titre": "ÉTAT B",
      "articleDesignationCourte": "ART. 29",
      "type": "ANNEXE",
      "avant_A_Apres": "A",
      "divisionRattachee": "ARTICLE 29",
      "articleAdditionnel": {
        "@xmlns:xsi": "http://www.w3.org/2001/XMLSchema-instance",
        "@xsi:nil": "true"
      },
      "chapitreAdditionnel": {
        "@xmlns:xsi": "http://www.w3.org/2001/XMLSchema-instance",
        "@xsi:nil": "true"
      },
      "urlDivisionTexteVise": "/15/textes/0235C.asp#D_ETAT_B"
    },
    "alinea": {
      "@xmlns:xsi": "http://www.w3.org/2001/XMLSchema-instance",
      "@xsi:nil": "true"
    }
  },
  "corps": {
    "exposeSommaire": "<p style=\"text-align: justify;\">Alors que le gouvernement annonce un effort budg&#233;taire en faveur des dispositifs de solidarit&#233;, la mission &#171;&#160;travail, emploi&#160;&#187; pr&#233;voit dans le m&#234;me temps une baisse du financement public accord&#233; aux entreprises adapt&#233;es.</p><p style=\"text-align: justify;\">Cr&#233;&#233;es par la loi du 11 f&#233;vrier 2005 pour l&#8217;&#233;galit&#233; des droits et des chances, la participation et la citoyennet&#233; des personnes handicap&#233;es, ces entreprises emploient 32 000 personnes dont 26 000 personnes en situation de handicap. Leur financement est port&#233; par deux dispositifs&#160;:</p><p style=\"text-align: justify;\">- l&#8217;aide au poste&#160;;</p><p style=\"text-align: justify;\">- la subvention sp&#233;cifique.</p><p style=\"text-align: justify;\">Ces aides sont essentielles au fonctionnement des entreprises adapt&#233;es, tenues d&#8217;employer au moins 80&#160;% de travailleurs handicap&#233;s. Elles leur permettent de compenser leur moindre productivit&#233;.</p><p style=\"text-align: justify;\">En mars 2017, le pr&#233;c&#233;dent gouvernement avait pr&#233;vu la cr&#233;ation de 5 000 nouveaux emplois b&#233;n&#233;ficiant de l&#8217;aide au poste dans ces entreprises. Certes les 1000 nouveaux postes sont bien inscrits au PLF pour un co&#251;t annuel de 14 415&#160;&#8364;, soit un smic horaire 2018 pr&#233;vu &#224; 9,88&#160;&#8364; (le montant de l&#8217;aide par b&#233;n&#233;ficiaire est fix&#233; &#224; 80&#160;% du SMIC). Ceci nous conduit normalement &#224; un budget total de 346,47 M&#8364; pour que le taux d&#8217;aide par b&#233;n&#233;ficiaire ne diminue pas.</p><p style=\"text-align: justify;\">Or, ces nouveaux postes ne sont pas financ&#233;s par une augmentation &#233;quivalente des cr&#233;dits allou&#233;s &#224; l&#8217;aide au poste. En effet, le PLF 2018 anticipe la mise en &#339;uvre de nouvelles modalit&#233;s de financement &#224; compter du 1<sup>er</sup> juillet 2018, et escompte une &#233;conomie de 8 M&#8364;, n&#8217;inscrivant les autorisations de d&#233;penses qu&#8217;&#224; hauteur de 338,47 M&#8364;.</p><p style=\"text-align: justify;\">Le montant de l&#8217;aide par b&#233;n&#233;ficiaire diminuera donc.</p><p style=\"text-align: justify;\">Cet amendement vise donc &#224; combler les 8 millions d&#8217;euros manquant pour que le nombre de b&#233;n&#233;ficiaires soit augment&#233; conform&#233;ment aux engagements pris, sans que le taux de l&#8217;aide baisse.</p><p style=\"text-align: justify;\">L&#8217;augmentation des cr&#233;dits affect&#233;s au programme Acc&#232;s et retour &#224; l&#8217;emploi est gag&#233;e par une diminution des cr&#233;dits du programme Conception, gestion et &#233;valuation des politiques de l&#8217;emploi qui finance les fonctions support des politiques de l&#8217;emploi. Cette diminution porte pour 7,5 millions d&#8217;euros sur les d&#233;penses de personnel et pour 500 000&#160;euros sur les autres d&#233;penses de fonctionnement, soit 1,2&#160;% du total des cr&#233;dits du programme.</p>",
    "annexeExposeSommaire": {
      "@xmlns:xsi": "http://www.w3.org/2001/XMLSchema-instance",
      "@xsi:nil": "true"
    },
    "dispositifAmdtCredit": {
      "listeProgrammes": {
        "programme": [
          {
            "libelle": "Accès et retour à l'emploi",
            "id": "5296",
            "AE": {
              "montantPositif": "8000000",
              "montantNegatif": "0"
            },
            "CP": {
              "montantPositif": "8000000",
              "montantNegatif": "0"
            },
            "action": "modification",
            "lignesCredits": null
          },
          {
            "libelle": "Accompagnement des mutations économiques et développement de l'emploi",
            "id": "5297",
            "AE": {
              "montantPositif": "0",
              "montantNegatif": "0"
            },
            "CP": {
              "montantPositif": "0",
              "montantNegatif": "0"
            },
            "action": "modification",
            "lignesCredits": null
          },
          {
            "libelle": "Amélioration de la qualité de l'emploi et des relations du travail",
            "id": "5298",
            "AE": {
              "montantPositif": "0",
              "montantNegatif": "0"
            },
            "CP": {
              "montantPositif": "0",
              "montantNegatif": "0"
            },
            "action": "modification",
            "lignesCredits": null
          },
          {
            "libelle": "Conception, gestion et évaluation des politiques de l'emploi et du travail",
            "id": "5299",
            "AE": {
              "montantPositif": "0",
              "montantNegatif": "8000000"
            },
            "CP": {
              "montantPositif": "0",
              "montantNegatif": "8000000"
            },
            "action": "modification",
            "lignesCredits": {
              "ligneCredit": {
                "id": "240",
                "libelle": "Dont titre 2",
                "AE": {
                  "montantPositif": "0",
                  "montantNegatif": "7500000"
                },
                "CP": {
                  "montantPositif": "0",
                  "montantNegatif": "7500000"
                }
              }
            }
          }
        ]
      },
      "totalAE": {
        "montantPositif": "8000000",
        "montantNegatif": "8000000",
        "solde": "0"
      },
      "totalCP": {
        "montantPositif": "8000000",
        "montantNegatif": "8000000",
        "solde": "0"
      }
    }
  },
  "representations": {
    "representation": {
      "nom": "PDF",
      "typeMime": {
        "type": "application",
        "subType": "PDF"
      },
      "statutRepresentation": {
        "verbatim": "true",
        "canonique": "true",
        "officielle": "true",
        "transcription": "false",
        "enregistrement": "false"
      },
      "repSource": {
        "@xmlns:xsi": "http://www.w3.org/2001/XMLSchema-instance",
        "@xsi:nil": "true"
      },
      "offset": {
        "@xmlns:xsi": "http://www.w3.org/2001/XMLSchema-instance",
        "@xsi:nil": "true"
      },
      "contenu": {
        "documentURI": "/15/amendements/0235C/CION_TOUTE/CF225.pdf"
      },
      "dateDispoRepresentation": {
        "@xmlns:xsi": "http://www.w3.org/2001/XMLSchema-instance",
        "@xsi:nil": "true"
      }
    }
  },
  "seanceDiscussion": {
    "@xmlns:xsi": "http://www.w3.org/2001/XMLSchema-instance",
    "@xsi:nil": "true"
  },
  "sort": {
    "dateSaisie": "2017-10-31T12:34:11.000+01:00",
    "sortEnSeance": "Non soutenu"
  },
  "dateDepot": "2017-10-27T02:00:00.000+02:00",
  "dateDistribution": "2017-10-30T01:00:00.000+01:00",
  "article99": "0",
  "loiReference": {
    "codeLoi": {
      "@xmlns:xsi": "http://www.w3.org/2001/XMLSchema-instance",
      "@xsi:nil": "true"
    },
    "divisionCodeLoi": {
      "@xmlns:xsi": "http://www.w3.org/2001/XMLSchema-instance",
      "@xsi:nil": "true"
    }
  }
}