{
  "@xmlns": "http://schemas.assemblee-nationale.fr/referentiel",
  "uid": "AMANR5L15SEA717460BTC1237P0D1N2856",
  "identifiant": {
    "legislature": "15",
    "numero": "2856",
    "numRect": "1",
    "saisine": {
      "refTexteLegislatif": "PRJLANR5L15BTC1237",
      "numeroPartiePLF": "0",
      "organeExamen": "PO717460",
      "mentionSecondeDeliberation": "0"
    }
  },
  "numeroLong": "2856 (Rect)",
  "etapeTexte": "1ère lecture (1ère assemblée saisie)",
  "triAmendement": "cciaaaaaaaaaaaaaaaaaaaaaaaaaaaaaaaaaaaaaaaaaaaaaaaajc",
  "cardinaliteAmdtMultiples": "1",
  "amendementParent": {
    "@xmlns:xsi": "http://www.w3.org/2001/XMLSchema-instance",
    "@xsi:nil": "true"
  },
  "etat": "Discuté",
  "signataires": {
    "auteur": {
      "typeAuteur": "Rapporteur",
      "acteurRef": "PA721836",
      "organeRef": "PO757134",
      "groupePolitiqueRef": "PO730970"
    },
    "cosignataires": {
      "acteurRef": [
        "PA721134",
        "PA721836"
      ]
    },
    "texteAffichable": "M.&#160;Barrot, rapporteur au nom de la commission sp&#233;ciale charg&#233;e d&apos;examiner le projet de loi relatif &#224; la croissance et la transformation des entreprises et M.&#160;Lescure"
  },
  "pointeurFragmentTexte": {
    "missionVisee": {
      "@xmlns:xsi": "http://www.w3.org/2001/XMLSchema-instance",
      "@xsi:nil": "true"
    },
    "division": {
      "titre": "Article 21",
      "articleDesignationCourte": "ART. 21",
      "type": "ARTICLE",
      "avant_A_Apres": "A",
      "divisionRattachee": "ARTICLE 21",
      "articleAdditionnel": {
        "@xmlns:xsi": "http://www.w3.org/2001/XMLSchema-instance",
        "@xsi:nil": "true"
      },
      "chapitreAdditionnel": {
        "@xmlns:xsi": "http://www.w3.org/2001/XMLSchema-instance",
        "@xsi:nil": "true"
      },
      "urlDivisionTexteVise": "/15/textes/1237.asp#D_Article_21"
    },
    "alinea": {
      "avant_A_Apres": {
        "@xmlns:xsi": "http://www.w3.org/2001/XMLSchema-instance",
        "@xsi:nil": "true"
      },
      "numero": "12",
      "alineaDesignation": {
        "@xmlns:xsi": "http://www.w3.org/2001/XMLSchema-instance",
        "@xsi:nil": "true"
      }
    }
  },
  "corps": {
    "dispositif": "<p>Substituer &#224; l&#8217;alin&#233;a&#160;12 les cinq alin&#233;as suivants&#160;:</p><p>&#171;&#160;<i>Art.&#160;L.&#160;131&#8209;1&#8209;2.&#160;&#8211;&#160;</i>Le contrat comportant des garanties exprim&#233;es en unit&#233;s de compte vis&#233;es au deuxi&#232;me alin&#233;a de l&#8217;article L.&#160;131&#8209;1 fait r&#233;f&#233;rence &#224; au moins une unit&#233; de compte constitu&#233;e&#160;de valeurs mobili&#232;res, d&#8217;organismes de placement collectif ou d&#8217;actifs figurant sur la liste mentionn&#233;e au m&#234;me article et qui respectent au moins l&#8217;une des modalit&#233;s suivantes&#160;:</p><p>&#171;&#160;1&#176; Ils sont compos&#233;s,&#160;pour une part comprise entre 5 et 10&#160;%, de titres &#233;mis par des entreprises solidaires d&#8217;utilit&#233; sociale agr&#233;&#233;es en application de l&#8217;article L.&#160;3332&#8209;17&#8209;1 du code du travail ou par des soci&#233;t&#233;s de capital-risque mentionn&#233;es au I de l&#8217;article&#160;1<sup>er</sup> de la loi n&#176; 85&#8209;695 du 11 juillet 1985 portant diverses dispositions d&#8217;ordre &#233;conomique et financier ou par des fonds communs de placements &#224; risque mentionn&#233;s &#224; l&#8217;article L.&#160;214&#8209;28 du code mon&#233;taire et financier, sous r&#233;serve que l&#8217;actif de ces fonds soit compos&#233; d&#8217;au moins 40&#160;% de titres &#233;mis par des entreprises solidaires mentionn&#233;es &#224; l&#8217;article L.&#160;3332&#8209;17&#8209;1 du code du travail&#160;;</p><p>&#171;&#160;2&#176; Ils ont obtenu un label cr&#233;&#233; par l&#8217;&#201;tat et satisfaisant &#224; des crit&#232;res de financement de la transition &#233;nerg&#233;tique et &#233;cologique selon des modalit&#233;s d&#233;finies par d&#233;cret&#160;;</p><p>&#171;&#160;3&#176; Ils ont obtenu un label cr&#233;&#233; par l&#8217;&#201;tat et satisfaisant aux crit&#232;res d&#8217;investissement socialement responsable selon des modalit&#233;s d&#233;finies par d&#233;cret.</p><p>&#171;&#160;Le pr&#233;sent article s&#8217;applique aux contrats conclus et aux adh&#233;sions effectu&#233;es &#224; compter du 1<sup>er</sup>&#160;janvier&#160;2020.&#160;Les contrats conclus et les adh&#233;sions effectu&#233;es &#224; compter du 1<sup>er</sup> janvier 2022 font r&#233;f&#233;rence &#224; au moins une unit&#233; de compte respectant la modalit&#233; mentionn&#233;e au 3&#176; et &#224; au moins une unit&#233; de compte respectant l&#8217;une ou l&#8217;autre des modalit&#233;s mentionn&#233;es aux 1&#176; et 2&#176;.&#160;&#187;<br /><br /></p>",
    "exposeSommaire": "<p>Amendement de pr&#233;cision juridique.</p><p>Pour que cette disposition adopt&#233;e en commission soit applicable, il convient de pr&#233;ciser la d&#233;signation juridique des fonds solidaires d&#8217;une part, et des fonds ayant obtenu un label li&#233; &#224; des crit&#232;res d&#8217;investissement socialement responsable ou de financement de la transition &#233;nerg&#233;tique et &#233;cologique d&#8217;autre part.</p><p>En outre, cette disposition serait applicable aux contrats ouverts &#224; compter du 1er janvier 2020 afin de ne pas porter atteinte aux contrats en cours et de laisser aux fournisseurs et aux interm&#233;diaires un d&#233;lai suffisant pour mettre entre &#339;uvre cette nouvelle obligation.</p><p>Enfin, a partir de 2022, les contrats devront pr&#233;senter au moins deux UC, dont une relevant de l'investissement socialement responsable et une relevant de la finance verte ou solidaire.</p>",
    "annexeExposeSommaire": {
      "@xmlns:xsi": "http://www.w3.org/2001/XMLSchema-instance",
      "@xsi:nil": "true"
    }
  },
  "representations": {
    "representation": {
      "nom": "PDF",
      "typeMime": {
        "type": "application",
        "subType": "PDF"
      },
      "statutRepresentation": {
        "verbatim": "true",
        "canonique": "true",
        "officielle": "true",
        "transcription": "false",
        "enregistrement": "false"
      },
      "repSource": {
        "@xmlns:xsi": "http://www.w3.org/2001/XMLSchema-instance",
        "@xsi:nil": "true"
      },
      "offset": {
        "@xmlns:xsi": "http://www.w3.org/2001/XMLSchema-instance",
        "@xsi:nil": "true"
      },
      "contenu": {
        "documentURI": "/15/amendements/1237/AN/2856.pdf"
      },
      "dateDispoRepresentation": {
        "@xmlns:xsi": "http://www.w3.org/2001/XMLSchema-instance",
        "@xsi:nil": "true"
      }
    }
  },
  "seanceDiscussion": "RUANR5L15S2018IDS21254",
  "sort": {
    "dateSaisie": "2018-09-28T18:38:40.000+02:00",
    "sortEnSeance": "Adopté"
  },
  "dateDepot": "2018-09-28T02:00:00.000+02:00",
  "dateDistribution": "2018-09-28T02:00:00.000+02:00",
  "article99": "1",
  "loiReference": {
    "codeLoi": {
      "@xmlns:xsi": "http://www.w3.org/2001/XMLSchema-instance",
      "@xsi:nil": "true"
    },
    "divisionCodeLoi": {
      "@xmlns:xsi": "http://www.w3.org/2001/XMLSchema-instance",
      "@xsi:nil": "true"
    }
  }
}