{
  "@xmlns": "http://schemas.assemblee-nationale.fr/referentiel",
  "uid": "AMANR5L15SEA717460BTC1019P0D1N1885",
  "identifiant": {
    "legislature": "15",
    "numero": "1885",
    "numRect": "0",
    "saisine": {
      "refTexteLegislatif": "PRJLANR5L15BTC1019",
      "numeroPartiePLF": "0",
      "organeExamen": "PO717460",
      "mentionSecondeDeliberation": "0"
    }
  },
  "numeroLong": "1885",
  "etapeTexte": "1ère lecture (1ère assemblée saisie)",
  "triAmendement": "aji",
  "cardinaliteAmdtMultiples": "1",
  "amendementParent": {
    "@xmlns:xsi": "http://www.w3.org/2001/XMLSchema-instance",
    "@xsi:nil": "true"
  },
  "etat": "Discuté",
  "signataires": {
    "auteur": {
      "typeAuteur": "Depute",
      "acteurRef": "PA721062",
      "organeRef": {
        "@xmlns:xsi": "http://www.w3.org/2001/XMLSchema-instance",
        "@xsi:nil": "true"
      },
      "groupePolitiqueRef": "PO730958"
    },
    "cosignataires": {
      "acteurRef": [
        "PA718868",
        "PA721226",
        "PA721202",
        "PA721210",
        "PA719578",
        "PA722142",
        "PA721062",
        "PA720846",
        "PA720892",
        "PA2150",
        "PA721960",
        "PA720286",
        "PA720422",
        "PA720430",
        "PA718860",
        "PA719676",
        "PA588884"
      ]
    },
    "texteAffichable": "M.&#160;Ratenon,  Mme&#160;Autain, M.&#160;Bernalicis, M.&#160;Coquerel, M.&#160;Corbi&#232;re, Mme&#160;Fiat, M.&#160;Lachaud, M.&#160;Larive, M.&#160;M&#233;lenchon, Mme&#160;Obono, Mme&#160;Panot, M.&#160;Prud&apos;homme, M.&#160;Quatennens, Mme&#160;Ressiguier, Mme&#160;Rubin, M.&#160;Ruffin et Mme&#160;Taurine"
  },
  "pointeurFragmentTexte": {
    "missionVisee": {
      "@xmlns:xsi": "http://www.w3.org/2001/XMLSchema-instance",
      "@xsi:nil": "true"
    },
    "division": {
      "titre": "Article PREMIER",
      "articleDesignationCourte": "ART. PREMIER",
      "type": "ARTICLE",
      "avant_A_Apres": "A",
      "divisionRattachee": "ARTICLE PREMIER",
      "articleAdditionnel": {
        "@xmlns:xsi": "http://www.w3.org/2001/XMLSchema-instance",
        "@xsi:nil": "true"
      },
      "chapitreAdditionnel": {
        "@xmlns:xsi": "http://www.w3.org/2001/XMLSchema-instance",
        "@xsi:nil": "true"
      },
      "urlDivisionTexteVise": "/15/textes/1019.asp#D_Article_1er"
    },
    "alinea": {
      "@xmlns:xsi": "http://www.w3.org/2001/XMLSchema-instance",
      "@xsi:nil": "true"
    }
  },
  "corps": {
    "dispositif": "<p style=\"text-align: justify;\">Supprimer cet article.</p>",
    "exposeSommaire": "<p style=\"text-align: justify;\">Mis en place en 2015, le Compte personnel de formation (CPF) vise &#224; permettre &#224; tous les actifs de b&#233;n&#233;ficier d&#8217;un accompagnement dans le cadre de sa formation professionnelle. Il s&#8217;inscrivait d&#232;s lors dans le cadre d&#8217;une v&#233;ritable &#8220;fabrique de l&#8217;employabilit&#233;&#8221; n&#233;olib&#233;rale, qui fait de chaque travailleur le responsable de sa propre adaptabilit&#233; au march&#233; du travail. Ce faisant, il diminuait la responsabilit&#233; de l&#8217;entreprise dans la concr&#233;tisation du droit &#224; la formation professionnelle, en le faisant reposer davantage sur des financements ext&#233;rieurs.</p><p style=\"text-align: justify;\">La pr&#233;sente r&#233;forme du compte personnel de formation accentue ces logiques, tout en cr&#233;ant, par la mon&#233;tisation de son abondement, une illusion de choix pour les salari&#233;s.</p><p style=\"text-align: justify;\">Actuellement, le CPF est aliment&#233; &#224; hauteur de 24 heures par an, dans la limite de 150 heures et permet de suivre des formations. Le CPF pr&#233;sente de nombreuses difficult&#233;s. Sa complexit&#233;, par exemple, favorise les cadres des grandes entreprises. Les demandeurs d&#8217;emploi ne sont que 15&#160;% &#224; en profiter.</p><p style=\"text-align: justify;\">L&#8217;Inspection g&#233;n&#233;rale des Affaires sociales proposait par ailleurs de doubler le rythme d&#8217;alimentation et le plafond. Passer de 48h annuelles dans un plafond de 300h permettrait de donner &#224; des formations plus compl&#232;tes, mieux valoris&#233;es et plus utiles.</p><p style=\"text-align: justify;\">La r&#233;forme du CPF que pr&#233;voit le gouvernement ne r&#233;pond absolument pas &#224; ces probl&#233;matiques. En alimentant le CPF en&#160;euros plut&#244;t qu&#8217;en heures de formation, le gouvernement r&#233;duit en fait les capacit&#233;s de formation des actifs.</p><p style=\"text-align: justify;\">Compte tenu du co&#251;t moyen d&#8217;une heure de formation (31&#160;euros), le CPF devrait &#234;tre aliment&#233; &#224; hauteur de 750&#160;euros par an. Cette somme ne correspondrait qu&#8217;au maintien des droits existants.</p><p style=\"text-align: justify;\">Le gouvernement ne pr&#233;voit pourtant qu&#8217;une alimentation de 500&#160;euros par an. C&#8217;est donc une r&#233;duction de 50&#160;% des droits &#224; la formation.</p><p style=\"text-align: justify;\">Pour toutes ces raisons, les auteurs de cet amendement demandent la suppression de cet article.</p>",
    "annexeExposeSommaire": {
      "@xmlns:xsi": "http://www.w3.org/2001/XMLSchema-instance",
      "@xsi:nil": "true"
    }
  },
  "representations": {
    "representation": {
      "nom": "PDF",
      "typeMime": {
        "type": "application",
        "subType": "PDF"
      },
      "statutRepresentation": {
        "verbatim": "true",
        "canonique": "true",
        "officielle": "true",
        "transcription": "false",
        "enregistrement": "false"
      },
      "repSource": {
        "@xmlns:xsi": "http://www.w3.org/2001/XMLSchema-instance",
        "@xsi:nil": "true"
      },
      "offset": {
        "@xmlns:xsi": "http://www.w3.org/2001/XMLSchema-instance",
        "@xsi:nil": "true"
      },
      "contenu": {
        "documentURI": "/15/amendements/1019/AN/1885.pdf"
      },
      "dateDispoRepresentation": {
        "@xmlns:xsi": "http://www.w3.org/2001/XMLSchema-instance",
        "@xsi:nil": "true"
      }
    }
  },
  "seanceDiscussion": "RUANR5L15S2018IDS21097",
  "sort": {
    "dateSaisie": "2018-06-12T17:41:34.000+02:00",
    "sortEnSeance": "Rejeté"
  },
  "dateDepot": "2018-06-07T02:00:00.000+02:00",
  "dateDistribution": "2018-06-09T02:00:00.000+02:00",
  "article99": "0",
  "loiReference": {
    "codeLoi": {
      "@xmlns:xsi": "http://www.w3.org/2001/XMLSchema-instance",
      "@xsi:nil": "true"
    },
    "divisionCodeLoi": {
      "@xmlns:xsi": "http://www.w3.org/2001/XMLSchema-instance",
      "@xsi:nil": "true"
    }
  }
}