{
  "@xmlns": "http://schemas.assemblee-nationale.fr/referentiel",
  "uid": "AMANR5L15SEA717460B0235P1D1N842",
  "identifiant": {
    "legislature": "15",
    "numero": "842",
    "numRect": "0",
    "saisine": {
      "refTexteLegislatif": "PRJLANR5L15B0235",
      "numeroPartiePLF": "1",
      "organeExamen": "PO717460",
      "mentionSecondeDeliberation": "0"
    }
  },
  "numeroLong": "I-842",
  "etapeTexte": "1ère lecture (1ère assemblée saisie)",
  "triAmendement": "i",
  "cardinaliteAmdtMultiples": "1",
  "amendementParent": {
    "@xmlns:xsi": "http://www.w3.org/2001/XMLSchema-instance",
    "@xsi:nil": "true"
  },
  "etat": "Discuté",
  "signataires": {
    "auteur": {
      "typeAuteur": "Depute",
      "acteurRef": "PA718720",
      "organeRef": {
        "@xmlns:xsi": "http://www.w3.org/2001/XMLSchema-instance",
        "@xsi:nil": "true"
      },
      "groupePolitiqueRef": "PO730940"
    },
    "cosignataires": {
      "acteurRef": [
        "PA335612",
        "PA441",
        "PA722202",
        "PA267306",
        "PA721270",
        "PA610654",
        "PA722110",
        "PA721896",
        "PA689",
        "PA720692",
        "PA718720",
        "PA721118",
        "PA720546",
        "PA718926",
        "PA610634",
        "PA610667"
      ]
    },
    "texteAffichable": "M.&#160;Dufr&#232;gne,  M.&#160;Fabien&#160;Roussel, M.&#160;Azerot, Mme&#160;Bello, M.&#160;Brotherson, M.&#160;Bruneel, Mme&#160;Buffet, M.&#160;Chassaigne, M.&#160;Dharr&#233;ville, Mme&#160;Faucillon, M.&#160;Jumel, M.&#160;Lecoq, M.&#160;Nilor, M.&#160;Peu, M.&#160;Serville et M.&#160;Wulfranc"
  },
  "pointeurFragmentTexte": {
    "missionVisee": {
      "@xmlns:xsi": "http://www.w3.org/2001/XMLSchema-instance",
      "@xsi:nil": "true"
    },
    "division": {
      "titre": "Article 13",
      "articleDesignationCourte": "APRÈS ART. 13",
      "type": "ARTICLE",
      "avant_A_Apres": "Après",
      "divisionRattachee": "APRÈS L'ARTICLE 13, insérer l'article suivant:",
      "articleAdditionnel": "1",
      "chapitreAdditionnel": {
        "@xmlns:xsi": "http://www.w3.org/2001/XMLSchema-instance",
        "@xsi:nil": "true"
      },
      "urlDivisionTexteVise": "/15/textes/0235A.asp#D_Article_13"
    },
    "alinea": {
      "@xmlns:xsi": "http://www.w3.org/2001/XMLSchema-instance",
      "@xsi:nil": "true"
    }
  },
  "corps": {
    "dispositif": "<p>Il est institu&#233; une contribution de solidarit&#233; des grandes entreprises au titre de l&#8217;ann&#233;e en cours &#224; la charge&#160;:</p><p>1&#176;) Des soci&#233;t&#233;s anonymes et des soci&#233;t&#233;s par actions simplifi&#233;es, quelles que soient, le cas &#233;ch&#233;ant, la nature et la r&#233;partition de leur capital&#160;;</p><p>2&#176;) Des soci&#233;t&#233;s &#224; responsabilit&#233; limit&#233;e&#160;;</p><p>3&#176;) Des soci&#233;t&#233;s en commandite&#160;;</p><p>4&#176;) Des personnes morales de droit public dans les limites de leur activit&#233; concurrentielle&#160;;</p><p>4&#176; <i>bis</i>) Des groupements d&#8217;int&#233;r&#234;t public assujettis &#224; la taxe sur la valeur ajout&#233;e en application de dispositions du chapitre Ier du titre II de la premi&#232;re partie du livre Ier du code g&#233;n&#233;ral des imp&#244;ts autres que celles de l&#8217;article&#160;256 B&#160;;</p><p>5&#176;) Des personnes morales dont le si&#232;ge est situ&#233; hors du territoire de la France m&#233;tropolitaine ou des d&#233;partements d&#8217;outre-mer, &#224; raison des affaires r&#233;alis&#233;es sur ce territoire et le rendant passibles de l&#8217;imp&#244;t sur les soci&#233;t&#233;s&#160;;</p><p>6&#176;) Des soci&#233;t&#233;s en nom collectif&#160;;</p><p>7&#176;) Des groupements d&#8217;int&#233;r&#234;t &#233;conomique&#160;;</p><p>8&#176;) Des groupements&#160;europ&#233;ens d&#8217;int&#233;r&#234;t &#233;conomique &#224; raison des affaires r&#233;alis&#233;es sur le territoire de la France m&#233;tropolitaine ou des d&#233;partements d&#8217;outre-mer&#160;;</p><p>9&#176;) Ind&#233;pendamment de leur forme juridique, des &#233;tablissements et entreprises mentionn&#233;s aux I et II de l&#8217;article L.&#160;511&#8209;1 du code mon&#233;taire et financier et relevant des chapitres Ier &#224; VII ainsi que de la section 2 du chapitre VIII du titre Ier du livre V du m&#234;me code&#160;;</p><p>9&#176; <i>bis</i>) Ind&#233;pendamment de leur forme juridique, des entreprises ou soci&#233;t&#233;s d&#8217;assurance, de capitalisation et de r&#233;assurance de toute nature r&#233;gies par le code des assurances, des mutuelles et unions de mutuelles relevant du livre II du code de la mutualit&#233;, des institutions de pr&#233;voyance et unions d&#8217;institutions de pr&#233;voyance relevant du titre III du livre IX du pr&#233;sent code ou du titre VII du livre VII du code rural et de la p&#234;che maritime&#160;;</p><p>9&#176; <i>ter</i>) Ind&#233;pendamment de leur forme juridique, des fonds de retraite professionnelle suppl&#233;mentaire mentionn&#233;s &#224; l&#8217;article L.&#160;381&#8209;1 du code des assurances, des mutuelles ou unions de retraite professionnelle suppl&#233;mentaire mentionn&#233;es &#224; l&#8217;article L.&#160;222&#8209;12 du code de la mutualit&#233; et des institutions de retraite professionnelle suppl&#233;mentaire&#160;;</p><p>10&#176;) Des soci&#233;t&#233;s ou organismes non vis&#233;s aux 1&#176; &#224; 9&#176; bis qui sont r&#233;gis par la loi n&#176; 47&#8209;1775 du 10 septembre 1947 portant statut de la coop&#233;ration, &#224; l&#8217;exception de ceux vis&#233;s &#224; l&#8217;article L.&#160;521&#8209;1 du code rural et de la p&#234;che maritime, au titre Ier de la loi n&#176; 83&#8209;657 du 20 juillet 1983 relative au d&#233;veloppement de certaines activit&#233;s d&#8217;&#233;conomie sociale, aux articles L.&#160;3441&#8209;2 et L.&#160;4431&#8209;2 du code des transports et aux articles L.&#160;931&#8209;5, L.&#160;931&#8209;24 et L.&#160;931&#8209;28 du code rural et de la p&#234;che maritime&#160;;</p><p>11&#176;) Des soci&#233;t&#233;s&#160;europ&#233;ennes au sens de l&#8217;article L.&#160;229&#8209;1 du code de commerce et des soci&#233;t&#233;s coop&#233;ratives&#160;europ&#233;ennes, au sens du r&#232;glement (CE) 1435/2003 du Conseil du 22 juillet 2003 relatif au statut de la soci&#233;t&#233; coop&#233;rative&#160;europ&#233;enne.</p><p>II.&#160;&#8211;&#160;Cette contribution suppl&#233;mentaire, dont le taux est de 0,5&#160;% est assise, recouvr&#233;e, exigible, contr&#244;l&#233;e dans les m&#234;mes conditions que celles applicables &#224; la contribution sociale de solidarit&#233; &#224; la charge des soci&#233;t&#233;s, pr&#233;vue aux articles L651&#8209;1 et suivants du code de la s&#233;curit&#233; sociale, sous r&#233;serve des dispositions suivantes&#160;:</p><p>1&#176; Elle est due par les soci&#233;t&#233;s, entreprises et &#233;tablissements existant au 1<sup>er</sup> janvier de l&#8217;ann&#233;e au titre de laquelle elle est due et dont le chiffre d&#8217;affaires, r&#233;alis&#233; l&#8217;ann&#233;e pr&#233;c&#233;dente, est sup&#233;rieur ou &#233;gal &#224; 500 millions d&#8217;euros&#160;;</p><p>2&#176; Elle est assise sur le chiffre d&#8217;affaires r&#233;alis&#233; l&#8217;ann&#233;e au titre de laquelle elle est due&#160;;</p><p>3&#176; En cas de cessation d&#233;finitive d&#8217;activit&#233;, de cession totale ou de dissolution survenant entre le 1<sup>er</sup> janvier de l&#8217;ann&#233;e au titre de laquelle elle est due et la date d&#8217;exigibilit&#233;, la contribution de solidarit&#233; des grandes entreprises, calcul&#233;e sur la base du chiffre d&#8217;affaires r&#233;alis&#233; jusqu&#8217;au 31 d&#233;cembre de cette ann&#233;e ou, si elle est ant&#233;rieure, jusqu&#8217;&#224; la date de cessation d&#233;finitive d&#8217;activit&#233;, de cession totale ou de dissolution, devient imm&#233;diatement exigible&#160;;</p><p>4&#176; Les redevables de la contribution suppl&#233;mentaire sont tenus de d&#233;clarer et de verser au plus tard le 15 d&#233;cembre de l&#8217;ann&#233;e au titre de laquelle elle est due un acompte &#233;gal &#224; 90&#160;% de la contribution assise sur le chiffre d&#8217;affaires estim&#233; de cette m&#234;me ann&#233;e, selon les modalit&#233;s et sous les sanctions pr&#233;vues aux articles L.&#160;651&#8209;5&#8209;3 et L.&#160;651&#8209;5&#8209;4 du code de la s&#233;curit&#233; sociale. Lorsque le montant de l&#8217;acompte est sup&#233;rieur au montant de la contribution due, l&#8217;exc&#233;dent est restitu&#233; dans un d&#233;lai de trente jours &#224; compter de la date de la d&#233;claration de solde. Une majoration de 5&#160;% est appliqu&#233;e &#224; l&#8217;insuffisance de versement d&#8217;acompte lorsque cette insuffisance, constat&#233;e lors du d&#233;p&#244;t de la d&#233;claration de solde, est sup&#233;rieure &#224; 10&#160;% du montant de l&#8217;acompte qui aurait &#233;t&#233; d&#251; et &#224; 100&#160;000&#160;&#8364;.</p>",
    "exposeSommaire": "<p style=\"text-align: justify;\">L&#8217;article&#160;13 du pr&#233;sent projet de loi de finances pour 2018 pr&#233;voit la suppression de la contribution additionnelle de 3&#160;% sur les revenus distribu&#233;s en dividendes. Cette mesure va r&#233;duire de 2 milliards d&#8217;euros les recettes budg&#233;taires de l&#8217;&#201;tat.</p><p style=\"text-align: justify;\">Par cet amendement, il est propos&#233; de compenser ladite perte de recettes fiscales par une mesure fiscale cibl&#233;e sur les grandes entreprises, comme l&#8217;avait envisag&#233; le Gouvernement cet &#233;t&#233; avant de reculer. Cette &#171;&#160;contribution de solidarit&#233; des grandes entreprises&#160;&#187;, assise sur le chiffre d&#8217;affaires, serait due par les entreprises dont l&#8217;activit&#233; est sup&#233;rieure ou &#233;gale &#224; 500 millions d&#8217;euros.</p>",
    "annexeExposeSommaire": {
      "@xmlns:xsi": "http://www.w3.org/2001/XMLSchema-instance",
      "@xsi:nil": "true"
    }
  },
  "representations": {
    "representation": {
      "nom": "PDF",
      "typeMime": {
        "type": "application",
        "subType": "PDF"
      },
      "statutRepresentation": {
        "verbatim": "true",
        "canonique": "true",
        "officielle": "true",
        "transcription": "false",
        "enregistrement": "false"
      },
      "repSource": {
        "@xmlns:xsi": "http://www.w3.org/2001/XMLSchema-instance",
        "@xsi:nil": "true"
      },
      "offset": {
        "@xmlns:xsi": "http://www.w3.org/2001/XMLSchema-instance",
        "@xsi:nil": "true"
      },
      "contenu": {
        "documentURI": "/15/amendements/0235A/AN/842.pdf"
      },
      "dateDispoRepresentation": {
        "@xmlns:xsi": "http://www.w3.org/2001/XMLSchema-instance",
        "@xsi:nil": "true"
      }
    }
  },
  "seanceDiscussion": "RUANR5L15S2018IDS20699",
  "sort": {
    "dateSaisie": "2017-10-20T19:57:15.000+02:00",
    "sortEnSeance": "Rejeté"
  },
  "dateDepot": "2017-10-13T02:00:00.000+02:00",
  "dateDistribution": "2017-10-17T02:00:00.000+02:00",
  "article99": "0",
  "loiReference": {
    "codeLoi": {
      "@xmlns:xsi": "http://www.w3.org/2001/XMLSchema-instance",
      "@xsi:nil": "true"
    },
    "divisionCodeLoi": {
      "@xmlns:xsi": "http://www.w3.org/2001/XMLSchema-instance",
      "@xsi:nil": "true"
    }
  }
}