{
  "@xmlns": "http://schemas.assemblee-nationale.fr/referentiel",
  "uid": "AMANR5L15SEA717460B0911P0D1N2260",
  "identifiant": {
    "legislature": "15",
    "numero": "2260",
    "numRect": "0",
    "saisine": {
      "refTexteLegislatif": "PRJLANR5L15B0911",
      "numeroPartiePLF": "0",
      "organeExamen": "PO717460",
      "mentionSecondeDeliberation": "0"
    }
  },
  "numeroLong": "2260",
  "etapeTexte": "1ère lecture (1ère assemblée saisie)",
  "triAmendement": "mvo",
  "cardinaliteAmdtMultiples": "1",
  "amendementParent": {
    "@xmlns:xsi": "http://www.w3.org/2001/XMLSchema-instance",
    "@xsi:nil": "true"
  },
  "etat": "A discuter",
  "signataires": {
    "auteur": {
      "typeAuteur": "Depute",
      "acteurRef": "PA267306",
      "organeRef": {
        "@xmlns:xsi": "http://www.w3.org/2001/XMLSchema-instance",
        "@xsi:nil": "true"
      },
      "groupePolitiqueRef": "PO730940"
    },
    "cosignataires": {
      "acteurRef": [
        "PA721270",
        "PA689",
        "PA722110",
        "PA267306",
        "PA718926",
        "PA721896",
        "PA610667",
        "PA722202",
        "PA441",
        "PA720692",
        "PA721118",
        "PA718720",
        "PA720546",
        "PA335612",
        "PA721012",
        "PA610654"
      ]
    },
    "texteAffichable": "M.&#160;Chassaigne,  M.&#160;Jumel, Mme&#160;Bello, M.&#160;Brotherson, M.&#160;Bruneel, Mme&#160;Buffet, M.&#160;Dharr&#233;ville, M.&#160;Dufr&#232;gne, Mme&#160;Faucillon, Mme&#160;K&#233;clard-Mond&#233;sir, M.&#160;Lecoq, M.&#160;Nilor, M.&#160;Peu, M.&#160;Fabien&#160;Roussel, M.&#160;Serville et M.&#160;Wulfranc"
  },
  "pointeurFragmentTexte": {
    "missionVisee": {
      "@xmlns:xsi": "http://www.w3.org/2001/XMLSchema-instance",
      "@xsi:nil": "true"
    },
    "division": {
      "titre": "Article 4",
      "articleDesignationCourte": "APRÈS ART. 4",
      "type": "ARTICLE",
      "avant_A_Apres": "Après",
      "divisionRattachee": "APRÈS L'ARTICLE 4, insérer l'article suivant:",
      "articleAdditionnel": "1",
      "chapitreAdditionnel": {
        "@xmlns:xsi": "http://www.w3.org/2001/XMLSchema-instance",
        "@xsi:nil": "true"
      },
      "urlDivisionTexteVise": "/15/textes/0911.asp#D_Article_4"
    },
    "alinea": {
      "@xmlns:xsi": "http://www.w3.org/2001/XMLSchema-instance",
      "@xsi:nil": "true"
    }
  },
  "corps": {
    "dispositif": "<p style=\"text-align: justify;\">Apr&#232;s le deuxi&#232;me alin&#233;a de l&#8217;article&#160;44 de la Constitution, il est ins&#233;r&#233; un alin&#233;a ainsi r&#233;dig&#233;&#160;:</p><p style=\"text-align: justify;\">&#171;&#160;Lorsqu&#8217;un amendement a &#233;t&#233; adopt&#233; par une assembl&#233;e, le Gouvernement ne peut demander une nouvelle d&#233;lib&#233;ration de l&#8217;article amend&#233; au cours de la m&#234;me lecture devant ladite assembl&#233;e.&#160;&#187;</p>",
    "exposeSommaire": "<p style=\"text-align: justify;\">Les propositions que nous portons dans le cadre de la r&#233;forme constitutionnelle visent &#224; renforcer les pouvoirs du Parlement et de l&#8217;opposition face &#224; l&#8217;hypertrophie du pouvoir ex&#233;cutif. Mettre fin &#224; ce d&#233;s&#233;quilibre des pouvoirs est indispensable pour corriger le d&#233;ficit d&#233;mocratique du r&#233;gime. Dans cet esprit, nous proposons &#233;galement de renforcer les droits de participation d&#233;mocratique. Enfin, une r&#233;forme de la Constitution ne peut se concevoir sans y inscrire des principes essentiels aujourd&#8217;hui absents de notre Loi fondamentale.</p><p style=\"text-align: justify;\">La navette parlementaire permettant toujours au Gouvernement de repr&#233;senter ses arguments devant l&#8217;une ou l&#8217;autre des assembl&#233;es, il n&#8217;est pas n&#233;cessaire de proc&#233;der &#224; une seconde d&#233;lib&#233;ration d&#8217;un amendement au cours de la m&#234;me lecture, devant la m&#234;me assembl&#233;e. Le d&#233;bat est utile et la facult&#233; donn&#233;e au Gouvernement de demander, une seconde d&#233;lib&#233;ration revient &#224; nier le travail du l&#233;gislateur.</p>",
    "annexeExposeSommaire": {
      "@xmlns:xsi": "http://www.w3.org/2001/XMLSchema-instance",
      "@xsi:nil": "true"
    }
  },
  "representations": {
    "representation": {
      "nom": "PDF",
      "typeMime": {
        "type": "application",
        "subType": "PDF"
      },
      "statutRepresentation": {
        "verbatim": "true",
        "canonique": "true",
        "officielle": "true",
        "transcription": "false",
        "enregistrement": "false"
      },
      "repSource": {
        "@xmlns:xsi": "http://www.w3.org/2001/XMLSchema-instance",
        "@xsi:nil": "true"
      },
      "offset": {
        "@xmlns:xsi": "http://www.w3.org/2001/XMLSchema-instance",
        "@xsi:nil": "true"
      },
      "contenu": {
        "documentURI": "/15/amendements/0911/AN/2260.pdf"
      },
      "dateDispoRepresentation": {
        "@xmlns:xsi": "http://www.w3.org/2001/XMLSchema-instance",
        "@xsi:nil": "true"
      }
    }
  },
  "seanceDiscussion": {
    "@xmlns:xsi": "http://www.w3.org/2001/XMLSchema-instance",
    "@xsi:nil": "true"
  },
  "sort": {
    "@xmlns:xsi": "http://www.w3.org/2001/XMLSchema-instance",
    "@xsi:nil": "true"
  },
  "dateDepot": "2018-07-06T02:00:00.000+02:00",
  "dateDistribution": "2018-07-10T02:00:00.000+02:00",
  "article99": "0",
  "loiReference": {
    "codeLoi": "Constitution",
    "divisionCodeLoi": "44"
  }
}