{
  "@xmlns": "http://schemas.assemblee-nationale.fr/referentiel",
  "uid": "AMANR5L15PO59048B1255P1D1N6",
  "identifiant": {
    "legislature": "15",
    "numero": "6",
    "numRect": "0",
    "saisine": {
      "refTexteLegislatif": "PRJLANR5L15B1255",
      "numeroPartiePLF": "1",
      "organeExamen": "PO59048",
      "mentionSecondeDeliberation": "0"
    }
  },
  "numeroLong": "I-CF6",
  "etapeTexte": "1ère lecture (1ère assemblée saisie)",
  "triAmendement": "aoaaaaaaaaaaaaaaaaaaaaaaaaaaaaaaaaaaaaaaaaaaaaaaaadti",
  "cardinaliteAmdtMultiples": "1",
  "amendementParent": {
    "@xmlns:xsi": "http://www.w3.org/2001/XMLSchema-instance",
    "@xsi:nil": "true"
  },
  "etat": "Discuté",
  "signataires": {
    "auteur": {
      "typeAuteur": "Depute",
      "acteurRef": "PA1874",
      "organeRef": {
        "@xmlns:xsi": "http://www.w3.org/2001/XMLSchema-instance",
        "@xsi:nil": "true"
      },
      "groupePolitiqueRef": "PO730934"
    },
    "cosignataires": {
      "acteurRef": [
        "PA330909",
        "PA2492",
        "PA608826",
        "PA1874",
        "PA718838",
        "PA718884",
        "PA608416",
        "PA609726",
        "PA719318",
        "PA605036",
        "PA608016",
        "PA721474",
        "PA332523",
        "PA267527",
        "PA709315",
        "PA267901",
        "PA346218",
        "PA340853",
        "PA330684",
        "PA2155",
        "PA334654",
        "PA718850",
        "PA721678",
        "PA266793",
        "PA267429",
        "PA721968",
        "PA267289"
      ]
    },
    "texteAffichable": "M.&#160;Le Fur,  M.&#160;Abad, Mme&#160;Anthoine, M.&#160;Aubert, Mme&#160;Bazin-Malgras, M.&#160;Bony, Mme&#160;Val&#233;rie&#160;Boyer, M.&#160;Brun, M.&#160;Cinieri, M.&#160;Cordier, Mme&#160;Dalloz, M.&#160;Descoeur, M.&#160;Door, Mme&#160;Duby-Muller, M.&#160;Hetzel, M.&#160;Kamardine, M.&#160;Leclerc, Mme&#160;Louwagie, M.&#160;Masson, M.&#160;Menuel, M.&#160;Quentin, M.&#160;Reda, M.&#160;Saddier, M.&#160;Straumann, M.&#160;Viala, M.&#160;Vialay et M.&#160;Viry"
  },
  "pointeurFragmentTexte": {
    "missionVisee": {
      "@xmlns:xsi": "http://www.w3.org/2001/XMLSchema-instance",
      "@xsi:nil": "true"
    },
    "division": {
      "titre": "Article 2",
      "articleDesignationCourte": "APRÈS ART. 2",
      "type": "ARTICLE",
      "avant_A_Apres": "Après",
      "divisionRattachee": "APRÈS L'ARTICLE 2, insérer l'article suivant:",
      "articleAdditionnel": "1",
      "chapitreAdditionnel": {
        "@xmlns:xsi": "http://www.w3.org/2001/XMLSchema-instance",
        "@xsi:nil": "true"
      },
      "urlDivisionTexteVise": "/15/textes/1255A.asp#D_Article_2"
    },
    "alinea": {
      "@xmlns:xsi": "http://www.w3.org/2001/XMLSchema-instance",
      "@xsi:nil": "true"
    }
  },
  "corps": {
    "dispositif": "<p style=\"text-align: justify;\">I.&#160;&#8211;&#160;L&#8217;article&#160;157 du code g&#233;n&#233;ral des imp&#244;ts est compl&#233;t&#233; par un alin&#233;a ainsi r&#233;dig&#233;&#160;: &#171;&#160;24&#176;&#160;Les dons en nature r&#233;alis&#233;s par les professionnels ayant une activit&#233; agricole, telle que d&#233;finie &#224; l&#8217;article L.&#160;311&#8209;1 du code rural et de la p&#234;che maritime.&#160;&#187;.</p><p style=\"text-align: justify;\">II.&#160;&#8211; &#192; la deuxi&#232;me phrase du&#160;1&#160;ter de l&#8217;article&#160;200 du code g&#233;n&#233;ral des imp&#244;ts, le montant&#160;: &#171;&#160;531&#160;&#8364;&#160;&#187; est remplac&#233; par le montant&#160;: &#171;&#160;1&#160;000&#160;&#8364;&#160;&#187;.</p><p style=\"text-align: justify;\">III.&#160;&#8211;&#160;La perte de recettes pour l&#8217;&#201;tat est compens&#233;e &#224; due concurrence par la cr&#233;ation d&#8217;une taxe additionnelle aux droits mentionn&#233;s aux articles&#160;575 et 575&#160;A du code g&#233;n&#233;ral des imp&#244;ts.</p>",
    "exposeSommaire": "<p style=\"text-align: justify;\">Lors de la campagne 2013&#8209;2014, l&#8217;association cr&#233;&#233;e par Coluche en 1985 a d&#233;pass&#233; pour la premi&#232;re fois le million de personnes inscrites dans ses centres, et servi 130 millions de repas.</p><p style=\"text-align: justify;\">Les associations qui concourent &#224; permettre &#224; nombre de nos concitoyens de pouvoir s&#8217;alimenter sont confront&#233;es &#224; un afflux de personnes qui demandent une aide.</p><p style=\"text-align: justify;\">Dans le cadre de la loi de finances pour 2014, l&#8217;exon&#233;ration fiscale dont b&#233;n&#233;ficient les professionnels qui effectuent des dons a &#233;t&#233; &#233;tendue aux dons des producteurs laitiers.</p><p style=\"text-align: justify;\">Cette mesure a permis de r&#233;colter deux millions de litres de lait pour les associations.</p><p style=\"text-align: justify;\">Selon le Pr&#233;sident des &#171;&#160;Restos du c&#339;ur&#160;&#187;&#160;: &#171;&#160;Viande, &#339;ufs, l&#233;gumes, c&#233;r&#233;ales, il faut que toutes les fili&#232;res puissent b&#233;n&#233;ficier d&#8217;un dispositif fiscal incitatif&#160;&#187;, au regard de la situation.</p><p style=\"text-align: justify;\">C&#8217;est pourquoi, le pr&#233;sent amendement, vise d&#8217;une part &#224; &#233;tendre aux dons en nature r&#233;alis&#233;s par les professionnels de l&#8217;agriculture le b&#233;n&#233;fice de la &#171;&#160;loi Coluche&#160;&#187; et d&#8217;autre part &#224; porter &#224; 1 000&#160;euros le plafond de la valeur des dons aux associations caritatives sur lequel la d&#233;duction fiscale est accord&#233;e au titre de la &#171;&#160;loi Coluche&#160;&#187;.</p>",
    "annexeExposeSommaire": {
      "@xmlns:xsi": "http://www.w3.org/2001/XMLSchema-instance",
      "@xsi:nil": "true"
    }
  },
  "representations": {
    "representation": {
      "nom": "PDF",
      "typeMime": {
        "type": "application",
        "subType": "PDF"
      },
      "statutRepresentation": {
        "verbatim": "true",
        "canonique": "true",
        "officielle": "true",
        "transcription": "false",
        "enregistrement": "false"
      },
      "repSource": {
        "@xmlns:xsi": "http://www.w3.org/2001/XMLSchema-instance",
        "@xsi:nil": "true"
      },
      "offset": {
        "@xmlns:xsi": "http://www.w3.org/2001/XMLSchema-instance",
        "@xsi:nil": "true"
      },
      "contenu": {
        "documentURI": "/15/amendements/1255A/CION_FIN/CF6.pdf"
      },
      "dateDispoRepresentation": {
        "@xmlns:xsi": "http://www.w3.org/2001/XMLSchema-instance",
        "@xsi:nil": "true"
      }
    }
  },
  "seanceDiscussion": {
    "@xmlns:xsi": "http://www.w3.org/2001/XMLSchema-instance",
    "@xsi:nil": "true"
  },
  "sort": {
    "dateSaisie": "2018-10-09T19:02:43.000+02:00",
    "sortEnSeance": "Rejeté"
  },
  "dateDepot": "2018-09-28T02:00:00.000+02:00",
  "dateDistribution": "2018-10-08T02:00:00.000+02:00",
  "article99": "0",
  "loiReference": {
    "codeLoi": "commerce",
    "divisionCodeLoi": "157"
  }
}