{
  "@xmlns": "http://schemas.assemblee-nationale.fr/referentiel",
  "uid": "AMANR5L15SEA717460BTC2063P0D1N518",
  "identifiant": {
    "legislature": "15",
    "numero": "518",
    "numRect": "0",
    "saisine": {
      "refTexteLegislatif": "PRJLANR5L15BTC2063",
      "numeroPartiePLF": "0",
      "organeExamen": "PO717460",
      "mentionSecondeDeliberation": "0"
    }
  },
  "numeroLong": "518",
  "etapeTexte": "1ère lecture (1ère assemblée saisie)",
  "triAmendement": "bfaaaaaaaaaaaaaaaaaaaaaaaaaaaaaaaaaaaaaaaaaaaaaaaafh",
  "cardinaliteAmdtMultiples": "1",
  "amendementParent": {
    "@xmlns:xsi": "http://www.w3.org/2001/XMLSchema-instance",
    "@xsi:nil": "true"
  },
  "etat": "Discuté",
  "signataires": {
    "auteur": {
      "typeAuteur": "Depute",
      "acteurRef": "PA720652",
      "organeRef": {
        "@xmlns:xsi": "http://www.w3.org/2001/XMLSchema-instance",
        "@xsi:nil": "true"
      },
      "groupePolitiqueRef": "PO730970"
    },
    "cosignataires": {
      "acteurRef": [
        "PA721418",
        "PA720746",
        "PA719640",
        "PA719044",
        "PA720598",
        "PA721234",
        "PA720178",
        "PA720764",
        "PA720256",
        "PA721924",
        "PA720652",
        "PA720162",
        "PA721976",
        "PA721992",
        "PA720092",
        "PA719942",
        "PA720326",
        "PA721836",
        "PA719210",
        "PA719504",
        "PA722374",
        "PA719874",
        "PA720968",
        "PA720720",
        "PA720924",
        "PA720728",
        "PA721182",
        "PA719266",
        "PA721984",
        "PA722284",
        "PA720704",
        "PA718978",
        "PA719488",
        "PA720002",
        "PA720334",
        "PA721734",
        "PA719918",
        "PA721530",
        "PA717151",
        "PA721742",
        "PA719558",
        "PA720772",
        "PA720976",
        "PA721608",
        "PA1276",
        "PA722162"
      ]
    },
    "texteAffichable": "M.&#160;Duverg&#233;,  M.&#160;Bolo, Mme&#160;Deprez-Audebert, M.&#160;Lagleize, M.&#160;Mathiasin, M.&#160;Ramos, M.&#160;Turquois, Mme&#160;Gallerneau, Mme&#160;Lasserre-David, Mme&#160;Luquet, M.&#160;Millienne, M.&#160;Pahun, M.&#160;Waserman, M.&#160;Balanant, Mme&#160;Bannier, M.&#160;Barrot, M.&#160;Baudu, Mme&#160;Benin, M.&#160;Berta, M.&#160;Bourlanges, M.&#160;Bru, M.&#160;Cubertafon, Mme&#160;de Sarnez, Mme&#160;de Vaucouleurs, Mme&#160;El Ha&#239;ry, Mme&#160;Elimas, Mme&#160;Essayan, M.&#160;Fanget, Mme&#160;Florennes, M.&#160;Fuchs, M.&#160;Garcia, M.&#160;Hammouche, M.&#160;Isaac-Sibille, Mme&#160;Jacquier-Laforge, M.&#160;Joncour, M.&#160;Lain&#233;, M.&#160;Laqhila, M.&#160;Latombe, M.&#160;Mattei, Mme&#160;Mette, M.&#160;Michel-Kleisbauer, M.&#160;Mignola, M.&#160;Fr&#233;d&#233;ric&#160;Petit, Mme&#160;Maud&#160;Petit, Mme&#160;Poueyto et Mme&#160;Vichnievsky"
  },
  "pointeurFragmentTexte": {
    "missionVisee": {
      "@xmlns:xsi": "http://www.w3.org/2001/XMLSchema-instance",
      "@xsi:nil": "true"
    },
    "division": {
      "titre": "Article 2",
      "articleDesignationCourte": "ART. 2",
      "type": "ARTICLE",
      "avant_A_Apres": "A",
      "divisionRattachee": "ARTICLE 2",
      "articleAdditionnel": {
        "@xmlns:xsi": "http://www.w3.org/2001/XMLSchema-instance",
        "@xsi:nil": "true"
      },
      "chapitreAdditionnel": {
        "@xmlns:xsi": "http://www.w3.org/2001/XMLSchema-instance",
        "@xsi:nil": "true"
      },
      "urlDivisionTexteVise": "/15/textes/2063.asp#D_Article_2"
    },
    "alinea": {
      "avant_A_Apres": {
        "@xmlns:xsi": "http://www.w3.org/2001/XMLSchema-instance",
        "@xsi:nil": "true"
      },
      "numero": "17",
      "alineaDesignation": {
        "@xmlns:xsi": "http://www.w3.org/2001/XMLSchema-instance",
        "@xsi:nil": "true"
      }
    }
  },
  "corps": {
    "dispositif": "<p style=\"text-align: justify;\">Compl&#233;ter l&#8217;alin&#233;a&#160;17 par la phrase suivante&#160;:</p><p style=\"text-align: justify;\">&#171;&#160;Les suites donn&#233;es &#224; ce rapport peuvent faire l&#8217;objet d&#8217;un d&#233;bat devant chaque assembl&#233;e parlementaire.&#160;&#187;</p>",
    "exposeSommaire": "<p style=\"text-align: justify;\">Afin de renforcer la relation entre le Haut Conseil pour le Climat et le Parlement, il convient de s&#8217;inspirer du Comit&#233; pour le changement climatique (CCC) au Royaume-Uni qui est l&#8217;acteur central de la gouvernance climat au Royaume-Uni. Apr&#232;s 10 ans d&#8217;exp&#233;rience, le CCC est un v&#233;ritable succ&#232;s dont s&#8217;inspire aujourd&#8217;hui divers pays europ&#233;ens. Il est, &#224; ce titre, consid&#233;r&#233; aujourd&#8217;hui dans le monde comme l&#8217;exemple de la meilleure pratique d&#8217;expertise ind&#233;pendante au service de la gouvernance climat.</p><p style=\"text-align: justify;\">Cette instance permet au Parlement de donner son avis sur les suites donn&#233;es par le Gouvernement au rapport remis par le Haut Conseil pour le Climat.</p><p style=\"text-align: justify;\">Le pr&#233;sent amendement entend renforcer les liens entre le Haut Conseil pour le climat et le Parlement, en permettant au Parlement, &#224; l&#8217;instar de son homologue britannique, de se prononcer &#224; la suite du Gouvernement sur la r&#233;ponse qu&#8217;il entend apporter au rapport remis par le Haut Conseil pour le Climat.</p>",
    "annexeExposeSommaire": {
      "@xmlns:xsi": "http://www.w3.org/2001/XMLSchema-instance",
      "@xsi:nil": "true"
    },
    "cartoucheDelaiDepotDepasse": {
      "@xmlns:xsi": "http://www.w3.org/2001/XMLSchema-instance",
      "@xsi:nil": "true"
    }
  },
  "representations": {
    "representation": {
      "nom": "PDF",
      "typeMime": {
        "type": "application",
        "subType": "PDF"
      },
      "statutRepresentation": {
        "verbatim": "true",
        "canonique": "true",
        "officielle": "true",
        "transcription": "false",
        "enregistrement": "false"
      },
      "repSource": {
        "@xmlns:xsi": "http://www.w3.org/2001/XMLSchema-instance",
        "@xsi:nil": "true"
      },
      "offset": {
        "@xmlns:xsi": "http://www.w3.org/2001/XMLSchema-instance",
        "@xsi:nil": "true"
      },
      "contenu": {
        "documentURI": "/15/amendements/2063/AN/518.pdf"
      },
      "dateDispoRepresentation": {
        "@xmlns:xsi": "http://www.w3.org/2001/XMLSchema-instance",
        "@xsi:nil": "true"
      }
    }
  },
  "seanceDiscussion": "RUANR5L15S2019IDS21736",
  "sort": {
    "dateSaisie": "2019-06-27T19:13:19.000+02:00",
    "sortEnSeance": "Rejeté"
  },
  "dateDepot": "2019-06-21T02:00:00.000+02:00",
  "dateDistribution": "2019-06-25T02:00:00.000+02:00",
  "article99": "0",
  "loiReference": {
    "codeLoi": {
      "@xmlns:xsi": "http://www.w3.org/2001/XMLSchema-instance",
      "@xsi:nil": "true"
    },
    "divisionCodeLoi": {
      "@xmlns:xsi": "http://www.w3.org/2001/XMLSchema-instance",
      "@xsi:nil": "true"
    }
  }
}