{
  "@xmlns": "http://schemas.assemblee-nationale.fr/referentiel",
  "uid": "AMANR5L15PO757134B1088P0D1N1157",
  "identifiant": {
    "legislature": "15",
    "numero": "1157",
    "numRect": "0",
    "saisine": {
      "refTexteLegislatif": "PRJLANR5L15B1088",
      "numeroPartiePLF": "0",
      "organeExamen": "PO757134",
      "mentionSecondeDeliberation": "0"
    }
  },
  "numeroLong": "1157",
  "etapeTexte": "1ère lecture (1ère assemblée saisie)",
  "triAmendement": "kbaaaaaaaaaaaaaaaaaaaaaaaaaaaaaaaaaaaaaaaaaaaaaaaaabli",
  "cardinaliteAmdtMultiples": "1",
  "amendementParent": {
    "@xmlns:xsi": "http://www.w3.org/2001/XMLSchema-instance",
    "@xsi:nil": "true"
  },
  "etat": "Discuté",
  "signataires": {
    "auteur": {
      "typeAuteur": "Depute",
      "acteurRef": "PA719372",
      "organeRef": {
        "@xmlns:xsi": "http://www.w3.org/2001/XMLSchema-instance",
        "@xsi:nil": "true"
      },
      "groupePolitiqueRef": "PO730964"
    },
    "cosignataires": {
      "acteurRef": [
        "PA719778",
        "PA721808",
        "PA607595",
        "PA719710",
        "PA642695",
        "PA720520",
        "PA721916",
        "PA720146",
        "PA720222",
        "PA722038",
        "PA719372",
        "PA719052"
      ]
    },
    "texteAffichable": "M.&#160;Kasbarian,  Mme&#160;Dominique&#160;David, Mme&#160;Pouzyreff, M.&#160;Pellois, Mme&#160;Cattelot, M.&#160;Girardin, M.&#160;Kervran, Mme&#160;Crouzet, M.&#160;Bothorel, M.&#160;Damien&#160;Adam, M.&#160;Mass&#233;glia et M.&#160;Jolivet"
  },
  "pointeurFragmentTexte": {
    "missionVisee": {
      "@xmlns:xsi": "http://www.w3.org/2001/XMLSchema-instance",
      "@xsi:nil": "true"
    },
    "division": {
      "titre": "Article 55",
      "articleDesignationCourte": "ART. 55",
      "type": "ARTICLE",
      "avant_A_Apres": "A",
      "divisionRattachee": "ARTICLE 55",
      "articleAdditionnel": {
        "@xmlns:xsi": "http://www.w3.org/2001/XMLSchema-instance",
        "@xsi:nil": "true"
      },
      "chapitreAdditionnel": {
        "@xmlns:xsi": "http://www.w3.org/2001/XMLSchema-instance",
        "@xsi:nil": "true"
      },
      "urlDivisionTexteVise": "/15/textes/1088.asp#D_Article_55"
    },
    "alinea": {
      "avant_A_Apres": "Apres",
      "numero": "2",
      "alineaDesignation": {
        "@xmlns:xsi": "http://www.w3.org/2001/XMLSchema-instance",
        "@xsi:nil": "true"
      }
    }
  },
  "corps": {
    "dispositif": "<p style=\"text-align: justify;\">Apr&#232;s l&#8217;alin&#233;a&#160;2, ins&#233;rer les deux alin&#233;as suivants&#160;:</p><p style=\"text-align: justify;\">&#171;&#160;<i>aa</i>) Apr&#232;s le <i>b</i> du I, il est ins&#233;r&#233; un <i>c </i>ainsi r&#233;dig&#233;&#160;:</p><p style=\"text-align: justify;\">&#171;<i>&#160;c</i>) Activit&#233;s de recherche, de production ou de commercialisation de technologies strat&#233;giques essentielles &#224; la garantie des int&#233;r&#234;ts du pays dont la liste est d&#233;finie par d&#233;cret.&#160;&#187;</p>",
    "exposeSommaire": "<p style=\"text-align: justify;\">La protection des actifs strat&#233;giques repose aujourd&#8217;hui sur une approche sectorielle. Celle-ci, trop restrictive, ne permet pas de prot&#233;ger efficacement des technologies sensibles.</p><p style=\"text-align: justify;\">Le pr&#233;sent amendement s&#8217;inspire des conclusions du rapport de la commission d&#8217;enqu&#234;te de l&#8217;Assembl&#233;e nationale sur les d&#233;cisions de l&#8217;&#201;tat en mati&#232;re de politique industrielle. Il vise &#224; renforcer le dispositif de contr&#244;le des investissements &#233;trangers en ajoutant une dimension suppl&#233;mentaire &#224; la protection sectorielle actuellement en vigueur.</p><p style=\"text-align: justify;\">Il propose au gouvernement de d&#233;finir par voie r&#233;glementaire, comme s&#8217;y &#233;tait engag&#233; Monsieur Bruno Le Maire, ministre de l&#8217;&#201;conomie et des Finances, devant la commission d&#8217;enqu&#234;te, quelles sont les technologies strat&#233;giques (intelligence artificielle, stockage d&#8217;&#233;nergie, technologies duales, stockage de donn&#233;es, semi-conducteurs, etc.) dont le d&#233;veloppement suppose une protection particuli&#232;re vis-&#224;-vis des investissements &#233;trangers eu &#233;gard &#224; leur caract&#232;re essentiel &#224; la garantie des int&#233;r&#234;ts du pays.</p><p style=\"text-align: justify;\">Cet ajout offrira une souplesse suppl&#233;mentaire dans le pouvoir de contr&#244;le d&#233;volu au ministre charg&#233; de l&#8217;&#233;conomie tout en maintenant l&#8217;existence de crit&#232;res objectifs au d&#233;clenchement d&#8217;une proc&#233;dure de contr&#244;le.</p>",
    "annexeExposeSommaire": {
      "@xmlns:xsi": "http://www.w3.org/2001/XMLSchema-instance",
      "@xsi:nil": "true"
    }
  },
  "representations": {
    "representation": {
      "nom": "PDF",
      "typeMime": {
        "type": "application",
        "subType": "PDF"
      },
      "statutRepresentation": {
        "verbatim": "true",
        "canonique": "true",
        "officielle": "true",
        "transcription": "false",
        "enregistrement": "false"
      },
      "repSource": {
        "@xmlns:xsi": "http://www.w3.org/2001/XMLSchema-instance",
        "@xsi:nil": "true"
      },
      "offset": {
        "@xmlns:xsi": "http://www.w3.org/2001/XMLSchema-instance",
        "@xsi:nil": "true"
      },
      "contenu": {
        "documentURI": "/15/amendements/1088/CSPACTE/1157.pdf"
      },
      "dateDispoRepresentation": {
        "@xmlns:xsi": "http://www.w3.org/2001/XMLSchema-instance",
        "@xsi:nil": "true"
      }
    }
  },
  "seanceDiscussion": {
    "@xmlns:xsi": "http://www.w3.org/2001/XMLSchema-instance",
    "@xsi:nil": "true"
  },
  "sort": {
    "dateSaisie": "2018-09-14T10:00:37.000+02:00",
    "sortEnSeance": "Retiré"
  },
  "dateDepot": "2018-09-03T02:00:00.000+02:00",
  "dateDistribution": "2018-09-11T02:00:00.000+02:00",
  "article99": "0",
  "loiReference": {
    "codeLoi": {
      "@xmlns:xsi": "http://www.w3.org/2001/XMLSchema-instance",
      "@xsi:nil": "true"
    },
    "divisionCodeLoi": {
      "@xmlns:xsi": "http://www.w3.org/2001/XMLSchema-instance",
      "@xsi:nil": "true"
    }
  }
}