{
  "@xmlns": "http://schemas.assemblee-nationale.fr/referentiel",
  "uid": "AMANR5L15SEA717460BTC1396P0D1N127",
  "identifiant": {
    "legislature": "15",
    "numero": "127",
    "numRect": "0",
    "saisine": {
      "refTexteLegislatif": "PRJLANR5L15BTC1396",
      "numeroPartiePLF": "0",
      "organeExamen": "PO717460",
      "mentionSecondeDeliberation": "0"
    }
  },
  "numeroLong": "127",
  "etapeTexte": "1ère lecture (2ème assemblée saisie)",
  "triAmendement": "ataaaaaaaaaaaaaaaaaaaaaaaaaaaaaaaaaaaaaaaaaaaaaaaab",
  "cardinaliteAmdtMultiples": "1",
  "amendementParent": {
    "@xmlns:xsi": "http://www.w3.org/2001/XMLSchema-instance",
    "@xsi:nil": "true"
  },
  "etat": "Discuté",
  "signataires": {
    "auteur": {
      "typeAuteur": "Depute",
      "acteurRef": "PA720430",
      "organeRef": {
        "@xmlns:xsi": "http://www.w3.org/2001/XMLSchema-instance",
        "@xsi:nil": "true"
      },
      "groupePolitiqueRef": "PO730958"
    },
    "cosignataires": {
      "acteurRef": [
        "PA720422",
        "PA721210",
        "PA588884",
        "PA722142",
        "PA720430",
        "PA718868",
        "PA721960",
        "PA720286",
        "PA720846",
        "PA719676",
        "PA718860",
        "PA721202",
        "PA720892",
        "PA2150",
        "PA719578",
        "PA721226",
        "PA721062"
      ]
    },
    "texteAffichable": "M.&#160;Bernalicis,  Mme&#160;Autain, M.&#160;Coquerel, M.&#160;Corbi&#232;re, Mme&#160;Fiat, M.&#160;Lachaud, M.&#160;Larive, M.&#160;M&#233;lenchon, Mme&#160;Obono, Mme&#160;Panot, M.&#160;Prud&apos;homme, M.&#160;Quatennens, M.&#160;Ratenon, Mme&#160;Ressiguier, Mme&#160;Rubin, M.&#160;Ruffin et Mme&#160;Taurine"
  },
  "pointeurFragmentTexte": {
    "missionVisee": {
      "@xmlns:xsi": "http://www.w3.org/2001/XMLSchema-instance",
      "@xsi:nil": "true"
    },
    "division": {
      "titre": "Article 10",
      "articleDesignationCourte": "ART. 10",
      "type": "ARTICLE",
      "avant_A_Apres": "A",
      "divisionRattachee": "ARTICLE 10",
      "articleAdditionnel": {
        "@xmlns:xsi": "http://www.w3.org/2001/XMLSchema-instance",
        "@xsi:nil": "true"
      },
      "chapitreAdditionnel": {
        "@xmlns:xsi": "http://www.w3.org/2001/XMLSchema-instance",
        "@xsi:nil": "true"
      },
      "urlDivisionTexteVise": "/15/textes/1396.asp#D_Article_10"
    },
    "alinea": {
      "@xmlns:xsi": "http://www.w3.org/2001/XMLSchema-instance",
      "@xsi:nil": "true"
    }
  },
  "corps": {
    "dispositif": "<p>Supprimer cet article.</p>",
    "exposeSommaire": "<p style=\"text-align: justify;\">Par cet amendement de suppression, nous proposons de pr&#233;server les ressources budg&#233;taire et financi&#232;res li&#233;es &#224; la d&#233;livrance par le service public des l&#233;galisations et des apostilles.</p><p style=\"text-align: justify;\">En effet, le projet de loi propos&#233; par le Gouvernement pr&#233;voit, par ordonnance, dans cet article de&#160;:</p><p style=\"text-align: justify;\">- d&#233;l&#233;guer totalement ou partiellement la d&#233;livrance des apostilles et des l&#233;galisations &#224; des officiers publics ou minist&#233;riels ou &#224; toute personne publique ou tout organisme de droit priv&#233; charg&#233; d&#8217;une mission de service public&#8221;&#160;;</p><p style=\"text-align: justify;\">=&amp;gt; Ceci n&#8217;est pas acceptable car cela signifierait une perte s&#232;che pour l&#8217;&#201;tat de 1,3 millions d&#8217;euros de ressources (en ce qui concerne les l&#233;galisations) et de faire payer les apostilles qui &#233;taient jusqu&#8217;ici gratuites.</p><p style=\"text-align: justify;\">En d&#233;tail&#160;:</p><p style=\"text-align: justify;\">En ce qui concerne les l&#233;galisations et les apostilles (documents fran&#231;ais qui doivent &#234;tre utilis&#233;s &#224; l&#8217;&#233;tranger, la l&#233;galisation &#233;tant l&#8217;authentification d&#8217;un acte public par actuellement un bureau du minist&#232;re des affaires &#233;trang&#232;res pour 10&#160;euros / document https&#160;://www.service-public.fr/particuliers/vosdroits/F1400&#160;; l&#8217;apostille &#233;tant une proc&#233;dure de l&#233;galisation simplifi&#233;e r&#233;gl&#233; par la Convention de la Haye du 5 octobre 1965, d&#233;livr&#233;e par les cours d&#8217;appel et normalement gratuit), leur transfert cela constituerait un manque &#224; gagner de plus de 1,3 millions d&#8217;euros (l&#233;galisations - chiffre mentionn&#233; page 81 de l&#8217;&#233;tude d&#8217;impact https&#160;://www.senat.fr/leg/etudes-impact/pjl17&#8209;463-ei/pjl17&#8209;463-ei.pdf) par l&#8217;&#201;tat, et rendre le service public de d&#233;livrance des apostilles d&#233;sormais payant (puisqu&#8217;il serait assur&#233; par des notaires, huissiers, un organisme de droit priv&#233;, etc).</p><p style=\"text-align: justify;\">Pour la proc&#233;dure de changement irr&#233;gulier d&#8217;un local (651&#8209;2 du code de la construction et de l&#8217;habitation, relatif aux communes de plus de 200 000 habitants et &#224; celles des d&#233;partements des Hauts-de-Seine, de la Seine-Saint-Denis et du Val-de-Marne.), avant 2016, le procureur &#233;tait comp&#233;tent pour saisir le pr&#233;sident du Tribunal de Grande instance pour que celui prononce l&#8217;amende. Or, la loi du 20 novembre 2016 a confi&#233; cette comp&#233;tence au maire, avec seulement un avis du procureur.</p><p style=\"text-align: justify;\">Or, il est &#233;vident que les maires ne disposent pas des m&#234;mes garanties d&#8217;ind&#233;pendance que les magistrats et peuvent mener une lutte diversifi&#233;e contre de telles pratiques (que ce soit pour des consid&#233;rations locales, ou d&#8217;opportunit&#233;). En outre, il suffit de faire un peu d&#8217;arch&#233;ologie parlementaire pour se rendre compte que les seules raisons qui avaient &#233;t&#233; invoqu&#233;es &#224; l&#8217;&#233;poque &#233;taient &#8230; le manque de moyens (voir l&#8217;expos&#233; des motifs de l&#8217;amendement concern&#233;&#160;: http&#160;://www.assemblee-nationale.fr/14/amendements/3204/CION_LOIS/CL183.asp). La lutte efficace contre les promoteurs v&#233;reux et les marchands de sommeil est ainsi sacrifi&#233;e sur des consid&#233;rations budg&#233;taires.</p>",
    "annexeExposeSommaire": {
      "@xmlns:xsi": "http://www.w3.org/2001/XMLSchema-instance",
      "@xsi:nil": "true"
    },
    "cartoucheDelaiDepotDepasse": {
      "@xmlns:xsi": "http://www.w3.org/2001/XMLSchema-instance",
      "@xsi:nil": "true"
    }
  },
  "representations": {
    "representation": {
      "nom": "PDF",
      "typeMime": {
        "type": "application",
        "subType": "PDF"
      },
      "statutRepresentation": {
        "verbatim": "true",
        "canonique": "true",
        "officielle": "true",
        "transcription": "false",
        "enregistrement": "false"
      },
      "repSource": {
        "@xmlns:xsi": "http://www.w3.org/2001/XMLSchema-instance",
        "@xsi:nil": "true"
      },
      "offset": {
        "@xmlns:xsi": "http://www.w3.org/2001/XMLSchema-instance",
        "@xsi:nil": "true"
      },
      "contenu": {
        "documentURI": "/15/amendements/1396/AN/127.pdf"
      },
      "dateDispoRepresentation": {
        "@xmlns:xsi": "http://www.w3.org/2001/XMLSchema-instance",
        "@xsi:nil": "true"
      }
    }
  },
  "seanceDiscussion": "RUANR5L15S2019IDS21373",
  "sort": {
    "dateSaisie": "2018-11-22T12:36:50.000+01:00",
    "sortEnSeance": "Rejeté"
  },
  "dateDepot": "2018-11-14T01:00:00.000+01:00",
  "dateDistribution": "2018-11-19T01:00:00.000+01:00",
  "article99": "0",
  "loiReference": {
    "codeLoi": {
      "@xmlns:xsi": "http://www.w3.org/2001/XMLSchema-instance",
      "@xsi:nil": "true"
    },
    "divisionCodeLoi": {
      "@xmlns:xsi": "http://www.w3.org/2001/XMLSchema-instance",
      "@xsi:nil": "true"
    }
  }
}