{
  "@xmlns": "http://schemas.assemblee-nationale.fr/referentiel",
  "uid": "AMANR5L15SEA717460BTC1924P0D1N919",
  "identifiant": {
    "legislature": "15",
    "numero": "919",
    "numRect": "0",
    "saisine": {
      "refTexteLegislatif": "PRJLANR5L15BTC1924",
      "numeroPartiePLF": "0",
      "organeExamen": "PO717460",
      "mentionSecondeDeliberation": "1"
    }
  },
  "numeroLong": "919",
  "etapeTexte": "1ère lecture (1ère assemblée saisie)",
  "triAmendement": "psaaaaaaaaaaaaaaaaaaaaaaaaaaaaaaaaaaaaaaaaaaaaaaaazxc",
  "cardinaliteAmdtMultiples": "1",
  "amendementParent": {
    "@xmlns:xsi": "http://www.w3.org/2001/XMLSchema-instance",
    "@xsi:nil": "true"
  },
  "etat": "Discuté",
  "signataires": {
    "auteur": {
      "typeAuteur": "Depute",
      "acteurRef": "PA721062",
      "organeRef": {
        "@xmlns:xsi": "http://www.w3.org/2001/XMLSchema-instance",
        "@xsi:nil": "true"
      },
      "groupePolitiqueRef": "PO730958"
    },
    "cosignataires": {
      "acteurRef": [
        "PA719676",
        "PA718868",
        "PA720846",
        "PA588884",
        "PA722142",
        "PA720430",
        "PA720422",
        "PA721202",
        "PA2150",
        "PA720892",
        "PA719578",
        "PA721062",
        "PA721226",
        "PA721210",
        "PA721960",
        "PA720286",
        "PA718860"
      ]
    },
    "texteAffichable": "M.&#160;Ratenon,  Mme&#160;Autain, M.&#160;Bernalicis, M.&#160;Coquerel, M.&#160;Corbi&#232;re, Mme&#160;Fiat, M.&#160;Lachaud, M.&#160;Larive, M.&#160;M&#233;lenchon, Mme&#160;Obono, Mme&#160;Panot, M.&#160;Prud&apos;homme, M.&#160;Quatennens, Mme&#160;Ressiguier, Mme&#160;Rubin, M.&#160;Ruffin et Mme&#160;Taurine"
  },
  "pointeurFragmentTexte": {
    "missionVisee": {
      "@xmlns:xsi": "http://www.w3.org/2001/XMLSchema-instance",
      "@xsi:nil": "true"
    },
    "division": {
      "titre": "Article 36",
      "articleDesignationCourte": "APRÈS ART. 36",
      "type": "ARTICLE",
      "avant_A_Apres": "Après",
      "divisionRattachee": "APRÈS L'ARTICLE 36, insérer l'article suivant:",
      "articleAdditionnel": "1",
      "chapitreAdditionnel": {
        "@xmlns:xsi": "http://www.w3.org/2001/XMLSchema-instance",
        "@xsi:nil": "true"
      },
      "urlDivisionTexteVise": "/15/textes/1924.asp#D_Article_36"
    },
    "alinea": {
      "@xmlns:xsi": "http://www.w3.org/2001/XMLSchema-instance",
      "@xsi:nil": "true"
    }
  },
  "corps": {
    "dispositif": "<p>Le Gouvernement remet au Parlement, dans un d&#233;lai de douze mois &#224; compter de la promulgation de la pr&#233;sente loi, un rapport d&#8217;information ayant pour objectif de chiffrer la mise en place automatique de contrats &#224; dur&#233;e ind&#233;termin&#233;e, &#224; titre de r&#233;gularisation et y compris lorsque la r&#233;gularit&#233; du contrat ant&#233;rieur n&#8217;a pas &#233;t&#233; contest&#233;, au b&#233;n&#233;fice des agents publics non-titulaires recrut&#233;s ill&#233;galement au sein de la fonction publique territoriale &#224; La R&#233;union.</p>",
    "exposeSommaire": "<p>La Fonction Publique joue en Outre-Mer un r&#244;le majeur dans l'emploi. A titre d'exemple, les trois fonctions publiques repr&#233;sentent un tiers du salariat r&#233;unionnais. Cette situation fait des fonctions publiques un levier majeur dans l'&#233;conomie de nos territoires ultramarins.</p><p style=\"text-align: justify;\">De fa&#231;on plus pr&#233;cise, la Fonction Publique Territoriale &#224; La R&#233;union est proportionnellement deux fois plus pourvoyeuse d'emplois salari&#233;s qu'au niveau national.</p><p style=\"text-align: justify;\">Il convient donc d'apporter une attention particuli&#232;re &#224; la FPT en Outre-Mer.</p><p style=\"text-align: justify;\">Dans un rapport du Conseil Sup&#233;rieur de la Fonction Publique Territoriale sur &#171;la pr&#233;carit&#233; dans la fonction publique territoriale&#187; de 2011, on constate une &#171;pr&#233;carit&#233; record &#224; La R&#233;union&#187; : alors que seulement 25% des agents territoriaux r&#233;unionnais sont titulaires, c'est environs 75% des agents territoriaux en M&#233;tropole.</p><p style=\"text-align: justify;\">68% des agents non titulaires, majoritairement des agents de la cat&#233;gorie C, dont environ la moiti&#233; concerne les m&#233;tiers d'agents de nettoyage ou d'entretien des espaces verts, sont des &#171;journaliers&#187; et &#171;int&#233;gr&#233;s&#187; recrut&#233;s de mani&#232;re informelle pendant la p&#233;riode allant du d&#233;but des ann&#233;es 60 &#224; la fin des ann&#233;es 90, soit au total plus de 12 000 situations d&#233;pourvues de toute base l&#233;gale.</p><p style=\"text-align: justify;\">Il s'agit essentiellement d'agents permanents non titulaires du bloc communal, issus d'une politique de recrutement sp&#233;cifique &#224; La R&#233;union sur la base de contrats &#233;crits ou oraux en dehors du cadre l&#233;gal, y compris post&#233;rieurement &#224; la loi n&#176;84-53 du 26 janvier 1984 portant dispositions statutaires relatives &#224; la fonction publique territoriale &#8230;</p><p style=\"text-align: justify;\">Une partie d'entre eux a pu b&#233;n&#233;ficier d'un CDI suite &#224; une circulaire pr&#233;fectorale du 8 septembre 2016 dont l'objectif &#233;tait de cadrer sur le territoire r&#233;unionnais les modalit&#233;s d'application des dispositions relatives aux agents non titulaires de la loi du 26 juillet 2005 dite &#171;loi Dutreil&#187;. Toutefois, le cadre de cette circulaire n'a pas &#233;t&#233; totalement respect&#233; et sa validit&#233; a expir&#233; en 2016.</p>",
    "annexeExposeSommaire": {
      "@xmlns:xsi": "http://www.w3.org/2001/XMLSchema-instance",
      "@xsi:nil": "true"
    },
    "cartoucheDelaiDepotDepasse": {
      "@xmlns:xsi": "http://www.w3.org/2001/XMLSchema-instance",
      "@xsi:nil": "true"
    }
  },
  "representations": {
    "representation": {
      "nom": "PDF",
      "typeMime": {
        "type": "application",
        "subType": "PDF"
      },
      "statutRepresentation": {
        "verbatim": "true",
        "canonique": "true",
        "officielle": "true",
        "transcription": "false",
        "enregistrement": "false"
      },
      "repSource": {
        "@xmlns:xsi": "http://www.w3.org/2001/XMLSchema-instance",
        "@xsi:nil": "true"
      },
      "offset": {
        "@xmlns:xsi": "http://www.w3.org/2001/XMLSchema-instance",
        "@xsi:nil": "true"
      },
      "contenu": {
        "documentURI": "/15/amendements/1924/AN/919.pdf"
      },
      "dateDispoRepresentation": {
        "@xmlns:xsi": "http://www.w3.org/2001/XMLSchema-instance",
        "@xsi:nil": "true"
      }
    }
  },
  "seanceDiscussion": {
    "@xmlns:xsi": "http://www.w3.org/2001/XMLSchema-instance",
    "@xsi:nil": "true"
  },
  "sort": {
    "dateSaisie": "2019-05-22T00:44:46.000+02:00",
    "sortEnSeance": "Rejeté"
  },
  "dateDepot": "2019-05-09T02:00:00.000+02:00",
  "dateDistribution": "2019-05-16T02:00:00.000+02:00",
  "article99": "0",
  "loiReference": {
    "codeLoi": {
      "@xmlns:xsi": "http://www.w3.org/2001/XMLSchema-instance",
      "@xsi:nil": "true"
    },
    "divisionCodeLoi": {
      "@xmlns:xsi": "http://www.w3.org/2001/XMLSchema-instance",
      "@xsi:nil": "true"
    }
  }
}