{
  "@xmlns": "http://schemas.assemblee-nationale.fr/referentiel",
  "uid": "AMANR5L15PO419610B0235P2D1N39",
  "identifiant": {
    "legislature": "15",
    "numero": "39",
    "numRect": "0",
    "saisine": {
      "refTexteLegislatif": "PRJLANR5L15B0235",
      "numeroPartiePLF": "2",
      "organeExamen": "PO419610",
      "mentionSecondeDeliberation": "0"
    }
  },
  "numeroLong": "II-CE39",
  "etapeTexte": "1ère lecture (1ère assemblée saisie)",
  "triAmendement": "ezzzs",
  "cardinaliteAmdtMultiples": "1",
  "amendementParent": {
    "@xmlns:xsi": "http://www.w3.org/2001/XMLSchema-instance",
    "@xsi:nil": "true"
  },
  "etat": "Discuté",
  "signataires": {
    "auteur": {
      "typeAuteur": "Depute",
      "acteurRef": "PA722142",
      "organeRef": {
        "@xmlns:xsi": "http://www.w3.org/2001/XMLSchema-instance",
        "@xsi:nil": "true"
      },
      "groupePolitiqueRef": "PO730958"
    },
    "cosignataires": {
      "acteurRef": [
        "PA2150",
        "PA720430",
        "PA720286",
        "PA720422",
        "PA588884",
        "PA718860",
        "PA721226",
        "PA720892",
        "PA718868",
        "PA721210",
        "PA721202",
        "PA719676",
        "PA720846",
        "PA721960",
        "PA719578",
        "PA722142",
        "PA721062"
      ]
    },
    "texteAffichable": "M.&#160;Ruffin,  Mme&#160;Autain, M.&#160;Bernalicis, M.&#160;Coquerel, M.&#160;Corbi&#232;re, Mme&#160;Fiat, M.&#160;Lachaud, M.&#160;Larive, M.&#160;M&#233;lenchon, Mme&#160;Obono, Mme&#160;Panot, M.&#160;Prud&apos;homme, M.&#160;Quatennens, M.&#160;Ratenon, Mme&#160;Ressiguier, Mme&#160;Rubin et Mme&#160;Taurine"
  },
  "pointeurFragmentTexte": {
    "missionVisee": {
      "idMissionAN": "4",
      "libelleMission": "Agriculture, alimentation, forêt et affaires rurales",
      "codeMissionPLF": "B",
      "libelleMissionPLF": "Répartition, par mission et programme, des crédits du budget général"
    },
    "division": {
      "titre": "Article 49",
      "articleDesignationCourte": "APRÈS ART. 49",
      "type": "ARTICLE",
      "avant_A_Apres": "Après",
      "divisionRattachee": "APRÈS L'ARTICLE 49, insérer l'article suivant:",
      "articleAdditionnel": "1",
      "chapitreAdditionnel": {
        "@xmlns:xsi": "http://www.w3.org/2001/XMLSchema-instance",
        "@xsi:nil": "true"
      },
      "urlDivisionTexteVise": "/15/textes/0235C.asp#D_Article_49"
    },
    "alinea": {
      "@xmlns:xsi": "http://www.w3.org/2001/XMLSchema-instance",
      "@xsi:nil": "true"
    }
  },
  "corps": {
    "dispositif": "<p style=\"text-align: justify;\">Le Gouvernement remet au Parlement, dans un d&#233;lai de six mois &#224; compter de la promulgation de la pr&#233;sente loi, un rapport d&#8217;information sur les cons&#233;quences de l'Accord &#233;conomique et commercial global (CETA) pour le secteur agricole et alimentaire fran&#231;ais. Ce rapport &#233;value les risques que fait peser le CETA sur le secteur agricole fran&#231;ais et en mati&#232;re de respect des normes pour les produits import&#233;s du Canada vers la France. Ce rapport est r&#233;dig&#233; par un groupe de travail associant des universitaires sp&#233;cialistes de ces questions, des inspecteurs de l&#8217;inspection g&#233;n&#233;rale de l&#8217;agriculture et des syndicalistes agriculteurs repr&#233;sentant la pluralit&#233; des points de vue au sein de la profession.</p>",
    "exposeSommaire": "<p style=\"text-align: justify;\">Lors de l&#8217;audition sur l&#8217;impact du CETA, Sophie Devienne, professeur &#224; AgroParisTech, expliquait qu&#8217;il n&#8217;y avait pas eu d&#8217;&#233;tude sectorielle r&#233;alis&#233;e pour &#233;valuer l&#8217;impact du CETA. Ainsi on ne sait pas quel sera son impact sur le secteur agricole et il y a de multiples inqui&#233;tudes notamment sur la viande bovine canadienne.</p><p style=\"text-align: justify;\">Phil Hogan, commissaire&#160;europ&#233;en &#224; l&#8217;agriculture, a aussi d&#233;clar&#233; lors de son audition qu&#8217;il y avait eu des concessions sur la partie agricole de l&#8217;accord en &#233;change de gains sur les produits manufactur&#233;s et financiers.</p><p style=\"text-align: justify;\">Il nous appara&#238;t indispensable que l&#8217;impact du CETA en mati&#232;re agricole et le respect des normes sanitaires et environnementales soient &#233;valu&#233;s en profondeur alors que nous sommes en pleine r&#233;flexion sur notre mod&#232;le agricole avec les &#201;tats G&#233;n&#233;raux de l&#8217;Alimentation et que la grande majorit&#233; des repr&#233;sentants des agriculteurs et des &#233;leveurs &#233;taient tr&#232;s inquiets de l&#8217;impact du CETA sur leur activit&#233;.</p>",
    "annexeExposeSommaire": {
      "@xmlns:xsi": "http://www.w3.org/2001/XMLSchema-instance",
      "@xsi:nil": "true"
    }
  },
  "representations": {
    "representation": {
      "nom": "PDF",
      "typeMime": {
        "type": "application",
        "subType": "PDF"
      },
      "statutRepresentation": {
        "verbatim": "true",
        "canonique": "true",
        "officielle": "true",
        "transcription": "false",
        "enregistrement": "false"
      },
      "repSource": {
        "@xmlns:xsi": "http://www.w3.org/2001/XMLSchema-instance",
        "@xsi:nil": "true"
      },
      "offset": {
        "@xmlns:xsi": "http://www.w3.org/2001/XMLSchema-instance",
        "@xsi:nil": "true"
      },
      "contenu": {
        "documentURI": "/15/amendements/0235C/CION_TOUTE/CE39.pdf"
      },
      "dateDispoRepresentation": {
        "@xmlns:xsi": "http://www.w3.org/2001/XMLSchema-instance",
        "@xsi:nil": "true"
      }
    }
  },
  "seanceDiscussion": {
    "@xmlns:xsi": "http://www.w3.org/2001/XMLSchema-instance",
    "@xsi:nil": "true"
  },
  "sort": {
    "dateSaisie": {
      "@xmlns:xsi": "http://www.w3.org/2001/XMLSchema-instance",
      "@xsi:nil": "true"
    },
    "sortEnSeance": "Rejeté"
  },
  "dateDepot": "2017-10-23T02:00:00.000+02:00",
  "dateDistribution": "2017-10-25T02:00:00.000+02:00",
  "article99": "0",
  "loiReference": {
    "codeLoi": {
      "@xmlns:xsi": "http://www.w3.org/2001/XMLSchema-instance",
      "@xsi:nil": "true"
    },
    "divisionCodeLoi": {
      "@xmlns:xsi": "http://www.w3.org/2001/XMLSchema-instance",
      "@xsi:nil": "true"
    }
  }
}