{
  "@xmlns": "http://schemas.assemblee-nationale.fr/referentiel",
  "uid": "AMANR5L15SEA717460BTC1237P0D1N548",
  "identifiant": {
    "legislature": "15",
    "numero": "548",
    "numRect": "1",
    "saisine": {
      "refTexteLegislatif": "PRJLANR5L15BTC1237",
      "numeroPartiePLF": "0",
      "organeExamen": "PO717460",
      "mentionSecondeDeliberation": "0"
    }
  },
  "numeroLong": "548 (Rect)",
  "etapeTexte": "1ère lecture (1ère assemblée saisie)",
  "triAmendement": "baeiaaaaaaaaaaaaaaaaaaaaaaaaaaaaaaaaaaaaaaaaaaaaaazzzzzzzzw",
  "cardinaliteAmdtMultiples": "1",
  "amendementParent": {
    "@xmlns:xsi": "http://www.w3.org/2001/XMLSchema-instance",
    "@xsi:nil": "true"
  },
  "etat": "Discuté",
  "signataires": {
    "auteur": {
      "typeAuteur": "Depute",
      "acteurRef": "PA721270",
      "organeRef": {
        "@xmlns:xsi": "http://www.w3.org/2001/XMLSchema-instance",
        "@xsi:nil": "true"
      },
      "groupePolitiqueRef": "PO730940"
    },
    "cosignataires": {
      "acteurRef": [
        "PA267306",
        "PA721270",
        "PA720546",
        "PA335612",
        "PA721896",
        "PA720692",
        "PA610667",
        "PA722110",
        "PA718926",
        "PA441",
        "PA610654",
        "PA722202",
        "PA721118",
        "PA721012",
        "PA718720",
        "PA689"
      ]
    },
    "texteAffichable": "M.&#160;Peu,  M.&#160;Dharr&#233;ville, M.&#160;Jumel, Mme&#160;Bello, M.&#160;Brotherson, M.&#160;Bruneel, Mme&#160;Buffet, M.&#160;Chassaigne, M.&#160;Dufr&#232;gne, Mme&#160;Faucillon, Mme&#160;K&#233;clard-Mond&#233;sir, M.&#160;Lecoq, M.&#160;Nilor, M.&#160;Fabien&#160;Roussel, M.&#160;Serville et M.&#160;Wulfranc"
  },
  "pointeurFragmentTexte": {
    "missionVisee": {
      "@xmlns:xsi": "http://www.w3.org/2001/XMLSchema-instance",
      "@xsi:nil": "true"
    },
    "division": {
      "titre": "Article 41",
      "articleDesignationCourte": "ART. 41",
      "type": "ARTICLE",
      "avant_A_Apres": "A",
      "divisionRattachee": "ARTICLE 41",
      "articleAdditionnel": {
        "@xmlns:xsi": "http://www.w3.org/2001/XMLSchema-instance",
        "@xsi:nil": "true"
      },
      "chapitreAdditionnel": {
        "@xmlns:xsi": "http://www.w3.org/2001/XMLSchema-instance",
        "@xsi:nil": "true"
      },
      "urlDivisionTexteVise": "/15/textes/1237.asp#D_Article_41"
    },
    "alinea": {
      "avant_A_Apres": {
        "@xmlns:xsi": "http://www.w3.org/2001/XMLSchema-instance",
        "@xsi:nil": "true"
      },
      "numero": "35",
      "alineaDesignation": {
        "@xmlns:xsi": "http://www.w3.org/2001/XMLSchema-instance",
        "@xsi:nil": "true"
      }
    }
  },
  "corps": {
    "dispositif": "<p style=\"text-align: justify;\">I. &#8211; &#192; l&#8217;alin&#233;a&#160;35, apr&#232;s le mot&#160;:</p><p style=\"text-align: justify;\">&#171;&#160;fonctionnaire&#160;&#187;,</p><p style=\"text-align: justify;\">ins&#233;rer les mots&#160;:</p><p style=\"text-align: justify;\">&#171;&#160;, apr&#232;s avis conforme de la commission de d&#233;ontologie de la fonction publique mentionn&#233;e &#224; l&#8217;article&#160;25 octies de la loi n&#176;83&#8209;634 du 13 juillet 1983 portant droits et obligations des fonctionnaires,&#160;&#187;.</p><p style=\"text-align: justify;\">II. &#8211; En cons&#233;quence, supprimer l&#8217;alin&#233;a&#160;41.</p>",
    "exposeSommaire": "<p style=\"text-align: justify;\">Le nouvel article L.&#160;531&#8209;14 reprend les dispositions de l&#8217;article L.&#160;531&#8209;3 du code de la recherche, en&#160;supprimant l&#8217;&#233;mission d&#8217;un avis de la commission de d&#233;ontologie.&#160;</p><p style=\"text-align: justify;\">Cet article est un garde-fou essentiel pour pr&#233;venir les conflits d&#8217;int&#233;r&#234;t de chercheurs. Il permet &#224; l&#8217;autorit&#233; dont rel&#232;ve le chercheur de se prononcer afin de l&#8217;autoriser ou non &#224; cr&#233;er son entreprise, apporter son concours &#224; une entreprise priv&#233;e, prendre des parts au sein de cette entreprise ou participer &#224; son conseil d&#8217;administration. Le texte pr&#233;cise les conditions pour lesquelles une telle autorisation pourrait ne pas &#234;tre attribu&#233;e&#160;:&#160;</p><p style=\"text-align: justify;\">Risques vis-&#224;-vis du fonctionnement normal du service public</p><p style=\"text-align: justify;\">Inqui&#233;tudes par rapport aux fonctions pass&#233;es du fonctionnaires, vis-&#224;-vis desquelles la nouvelle activit&#233; du chercheur pourrait porter atteinte &#224; la dignit&#233;</p><p style=\"text-align: justify;\">Lorsque la prise d&#8217;int&#233;r&#234;ts dans l&#8217;entreprise est de nature &#224; porter atteinte au bon fonctionnement du service public<br />Nous consid&#233;rons n&#233;anmoins que cette prise de d&#233;cision de l&#8217;administration dont rel&#232;ve le fonctionnaire doit pouvoir &#234;tre &#233;clair&#233;e par un avis conforme de la commission de d&#233;ontologie.&#160;</p><p style=\"text-align: justify;\">Cet article vise donc, d&#8217;une part, &#224; r&#233;tablir son r&#244;le ant&#233;rieur et, d&#8217;autre part, &#224; la renforcer en donnant &#224; son avis une force obligatoire.</p>",
    "annexeExposeSommaire": {
      "@xmlns:xsi": "http://www.w3.org/2001/XMLSchema-instance",
      "@xsi:nil": "true"
    }
  },
  "representations": {
    "representation": {
      "nom": "PDF",
      "typeMime": {
        "type": "application",
        "subType": "PDF"
      },
      "statutRepresentation": {
        "verbatim": "true",
        "canonique": "true",
        "officielle": "true",
        "transcription": "false",
        "enregistrement": "false"
      },
      "repSource": {
        "@xmlns:xsi": "http://www.w3.org/2001/XMLSchema-instance",
        "@xsi:nil": "true"
      },
      "offset": {
        "@xmlns:xsi": "http://www.w3.org/2001/XMLSchema-instance",
        "@xsi:nil": "true"
      },
      "contenu": {
        "documentURI": "/15/amendements/1237/AN/548.pdf"
      },
      "dateDispoRepresentation": {
        "@xmlns:xsi": "http://www.w3.org/2001/XMLSchema-instance",
        "@xsi:nil": "true"
      }
    }
  },
  "seanceDiscussion": "RUANR5L15S2018IDS21252",
  "sort": {
    "dateSaisie": "2018-09-27T22:02:10.000+02:00",
    "sortEnSeance": "Rejeté"
  },
  "dateDepot": "2018-09-19T02:00:00.000+02:00",
  "dateDistribution": "2018-09-25T02:00:00.000+02:00",
  "article99": "0",
  "loiReference": {
    "codeLoi": {
      "@xmlns:xsi": "http://www.w3.org/2001/XMLSchema-instance",
      "@xsi:nil": "true"
    },
    "divisionCodeLoi": {
      "@xmlns:xsi": "http://www.w3.org/2001/XMLSchema-instance",
      "@xsi:nil": "true"
    }
  }
}