{
  "@xmlns": "http://schemas.assemblee-nationale.fr/referentiel",
  "uid": "AMANR5L15SEA717460BTC0857P0D1N888",
  "identifiant": {
    "legislature": "15",
    "numero": "888",
    "numRect": "0",
    "saisine": {
      "refTexteLegislatif": "PRJLANR5L15BTC0857",
      "numeroPartiePLF": "0",
      "organeExamen": "PO717460",
      "mentionSecondeDeliberation": "0"
    }
  },
  "numeroLong": "888",
  "etapeTexte": "1ère lecture (1ère assemblée saisie)",
  "triAmendement": "abhvzw",
  "cardinaliteAmdtMultiples": "1",
  "amendementParent": {
    "@xmlns:xsi": "http://www.w3.org/2001/XMLSchema-instance",
    "@xsi:nil": "true"
  },
  "etat": "Retiré",
  "signataires": {
    "auteur": {
      "typeAuteur": "Depute",
      "acteurRef": "PA719052",
      "organeRef": {
        "@xmlns:xsi": "http://www.w3.org/2001/XMLSchema-instance",
        "@xsi:nil": "true"
      },
      "groupePolitiqueRef": "PO730964"
    },
    "cosignataires": {
      "acteurRef": [
        "PA721792",
        "PA721844",
        "PA719170",
        "PA722118",
        "PA719790",
        "PA608083",
        "PA720916",
        "PA718710",
        "PA720552",
        "PA719230",
        "PA719052",
        "PA720342",
        "PA721888",
        "PA607155"
      ]
    },
    "texteAffichable": "M.&#160;Kervran,  Mme&#160;Bourguignon, Mme&#160;Pascale&#160;Boyer, M.&#160;Chalumeau, Mme&#160;Charvier, M.&#160;Daniel, Mme&#160;Guerel, M.&#160;Kerlogot, Mme&#160;Lazaar, Mme&#160;Le Peih, M.&#160;Raphan, Mme&#160;Rauch, Mme&#160;Piron et Mme&#160;Sylla"
  },
  "pointeurFragmentTexte": {
    "missionVisee": {
      "@xmlns:xsi": "http://www.w3.org/2001/XMLSchema-instance",
      "@xsi:nil": "true"
    },
    "division": {
      "titre": "Article 16",
      "articleDesignationCourte": "ART. 16",
      "type": "ARTICLE",
      "avant_A_Apres": "A",
      "divisionRattachee": "ARTICLE 16",
      "articleAdditionnel": {
        "@xmlns:xsi": "http://www.w3.org/2001/XMLSchema-instance",
        "@xsi:nil": "true"
      },
      "chapitreAdditionnel": {
        "@xmlns:xsi": "http://www.w3.org/2001/XMLSchema-instance",
        "@xsi:nil": "true"
      },
      "urlDivisionTexteVise": "/15/textes/0857.asp#D_Article_16"
    },
    "alinea": {
      "avant_A_Apres": "Apres",
      "numero": "7",
      "alineaDesignation": {
        "@xmlns:xsi": "http://www.w3.org/2001/XMLSchema-instance",
        "@xsi:nil": "true"
      }
    }
  },
  "corps": {
    "dispositif": "<p style=\"text-align: justify;\">Apr&#232;s l&#8217;alin&#233;a&#160;7, ins&#233;rer les deux alin&#233;as suivants&#160;:</p><p style=\"text-align: justify;\">&#171;&#160;c) &#192; la fin du deuxi&#232;me alin&#233;a du III, le mot&#160;: &#171;&#160;, sauf&#160;&#187; est remplac&#233; par les mots&#160;: &#171;&#160;de moins de treize ans. Ils sont applicables &#224; l&#8217;&#233;tranger accompagn&#233; d&#8217;un mineur de plus de treize ans uniquement dans les cas suivants&#160;:&#160;&#187;&#160;;&#160;&#187;</p>",
    "exposeSommaire": "<p style=\"text-align: justify;\">La Cour Europ&#233;enne des Droits de l'Homme a, par cinq arr&#234;ts rendus le 12 juillet 2016, condamn&#233; la France pour traitements inhumains et d&#233;gradants, violation du droit &#224; la libert&#233; et &#224; la s&#251;ret&#233; et violation du droit &#224; une vie familiale normale pour sa gestion des mineurs &#233;trangers accompagnants leurs parents en centre de r&#233;tention. Si elle n'a pas interdit par principe la mise en r&#233;tention des mineurs, la Cour a soulign&#233; la n&#233;cessit&#233; pour les &#233;tats de privil&#233;gier des solutions alternatives &#224; l'enfermement.</p><p style=\"text-align: justify;\">De mani&#232;re g&#233;n&#233;rale, le droit prot&#232;ge les mineurs qui ne peuvent faire l&#8217;objet de mesures d&#8217;&#233;loignement (article L. 511-4 du code de l'entr&#233;e et du s&#233;jour des &#233;trangers et du droit d'asile) ou d&#8217;expulsion (article L. 521-4 du m&#234;me code). Plus sp&#233;cifiquement, il existe d&#8217;autres dispositions ne s&#8217;appliquant qu&#8217;aux mineurs de moins de 13 ans notamment dans le cadre du champ d&#8217;application de l&#8217;article 16 du pr&#233;sent projet de loi et c&#8217;est la raison pour laquelle le pr&#233;sent amendement propose de retenir cet &#226;ge.&#160;</p><p style=\"text-align: justify;\">En de&#231;&#224; de 13 ans, le mineur se voit &#171;&#160;excus&#233;&#160;&#187; et fait, &#224; ce titre, l&#8217;objet d&#8217;un traitement particulier (irresponsabilit&#233; p&#233;nale absolue pour les mineurs de moins de 13 ans d&#233;finie dans la loi du 9 septembre 2002) pour lequel il ne peut se voir infliger aucune peine privative de libert&#233;. Or, dans les cas vis&#233;s par cet article 16, les centres de r&#233;tention administrative (CRA) ou les locaux de r&#233;tention administrative (LRA) &#8211;zones d&#8217;attente- sont pr&#233;cis&#233;ment des lieux de privation de libert&#233; et ce, bien qu&#8217;ils ne rel&#232;vent pas de l&#8217;administration p&#233;nitentiaire. Ainsi, cette disposition essentielle justifie le choix de l&#8217;&#226;ge retenu par le pr&#233;sent amendement pour interdire le placement d&#8217;enfants de moins de 13 ans et de leurs familles.</p><p style=\"text-align: justify;\">Selon le D&#233;fenseur des droits, la France (sans compter Mayotte) a plac&#233; 275 enfants en r&#233;tention administrative en 2017 &#171;&#160;soit presque autant que durant les ann&#233;es 2012, 2013, 2014 et 2015 r&#233;unies&#160;&#187;. Au 1er janvier 2018, le D&#233;fenseur des droits faisait &#233;tat de 40 enfants en r&#233;tention, toujours sans compter les enfants retenus &#224; Mayotte. Ainsi, en prenant en compte les cons&#233;quences de l&#8217;augmentation du nombre de mineurs plac&#233;s en CRA (accompagnants leurs parents, rattach&#233;s fictivement &#224; un adulte ou non accompagn&#233;s) sur le taux d&#8217;occupation de ces structures, il semble tr&#232;s probable que l&#8217;interdiction de la r&#233;tention des mineurs de moins de 13 ans et de leurs familles ait des effets salutaires sur les conditions d&#8217;accueil dans ces centres.</p><p style=\"text-align: justify;\">Comme cela a &#233;t&#233; rappel&#233; par nombreuses juridictions (D&#233;fenseur des droits, Cour europ&#233;enne des droits de l&#8217;homme, Conseil des droits de l&#8217;homme des Nations Unies), le placement en r&#233;tention de mineurs, encore plus lorsque ceux-ci ont moins de 13 ans, contrevient n&#233;cessairement au principe de l&#8217;int&#233;r&#234;t sup&#233;rieur de l&#8217;enfant. En effet, en privant un enfant de ses droits et notamment de sa libert&#233;, on l&#8217;expose &#224; des risques graves pouvant affecter, tout au long de sa vie, son d&#233;veloppement physique et psychique. Ainsi, il a &#233;t&#233; constat&#233; que les conditions de placement en r&#233;tention se rapprochent de celles de la d&#233;tention et qu&#8217;elles cr&#233;ent un fort traumatisme pour les retenus, particuli&#232;rement pour les enfants, et, encore plus lorsqu&#8217;ils ont moins de 13 ans.</p><p style=\"text-align: justify;\">Finalement, au regard du mauvais traitement susceptible d&#8217;&#234;tre inflig&#233; aux enfants, de l&#8217;atteinte au droit &#224; la libert&#233; et &#224; la suret&#233; que cet enfermement peut provoquer et de la perturbation du droit &#224; mener une vie familiale normale qu&#8217;il entraine, le placement de mineurs de moins de 13 ans et de leurs familles en CRA est &#224; proscrire. En pr&#233;sence d&#8217;un enfant, encore plus lorsque celui-ci &#224; moins de 13 ans, le juge doit toujours chercher une mesure moins coercitive que la r&#233;tention dans l&#8217;int&#233;r&#234;t sup&#233;rieur de celui-ci. Ainsi, les autorit&#233;s administratives devront prescrire des assignations &#224; r&#233;sidence pour les &#233;trangers accompagn&#233;s de mineurs de moins de 13 ans.</p>",
    "annexeExposeSommaire": {
      "@xmlns:xsi": "http://www.w3.org/2001/XMLSchema-instance",
      "@xsi:nil": "true"
    }
  },
  "representations": {
    "representation": {
      "nom": "PDF",
      "typeMime": {
        "type": "application",
        "subType": "PDF"
      },
      "statutRepresentation": {
        "verbatim": "true",
        "canonique": "true",
        "officielle": "true",
        "transcription": "false",
        "enregistrement": "false"
      },
      "repSource": {
        "@xmlns:xsi": "http://www.w3.org/2001/XMLSchema-instance",
        "@xsi:nil": "true"
      },
      "offset": {
        "@xmlns:xsi": "http://www.w3.org/2001/XMLSchema-instance",
        "@xsi:nil": "true"
      },
      "contenu": {
        "documentURI": "/15/amendements/0857/AN/888.pdf"
      },
      "dateDispoRepresentation": {
        "@xmlns:xsi": "http://www.w3.org/2001/XMLSchema-instance",
        "@xsi:nil": "true"
      }
    }
  },
  "seanceDiscussion": {
    "@xmlns:xsi": "http://www.w3.org/2001/XMLSchema-instance",
    "@xsi:nil": "true"
  },
  "sort": {
    "@xmlns:xsi": "http://www.w3.org/2001/XMLSchema-instance",
    "@xsi:nil": "true"
  },
  "dateDepot": "2018-04-12T02:00:00.000+02:00",
  "dateDistribution": "2018-04-16T02:00:00.000+02:00",
  "article99": "0",
  "loiReference": {
    "codeLoi": {
      "@xmlns:xsi": "http://www.w3.org/2001/XMLSchema-instance",
      "@xsi:nil": "true"
    },
    "divisionCodeLoi": {
      "@xmlns:xsi": "http://www.w3.org/2001/XMLSchema-instance",
      "@xsi:nil": "true"
    }
  }
}