{
  "@xmlns": "http://schemas.assemblee-nationale.fr/referentiel",
  "uid": "AMANR5L15PO59051B1106P0D1N274",
  "identifiant": {
    "legislature": "15",
    "numero": "274",
    "numRect": "0",
    "saisine": {
      "refTexteLegislatif": "PRJLANR5L15B1106",
      "numeroPartiePLF": "0",
      "organeExamen": "PO59051",
      "mentionSecondeDeliberation": "0"
    }
  },
  "numeroLong": "CL274",
  "etapeTexte": "Nouvelle Lecture",
  "triAmendement": "cm",
  "cardinaliteAmdtMultiples": "1",
  "amendementParent": {
    "@xmlns:xsi": "http://www.w3.org/2001/XMLSchema-instance",
    "@xsi:nil": "true"
  },
  "etat": "Discuté",
  "signataires": {
    "auteur": {
      "typeAuteur": "Depute",
      "acteurRef": "PA721564",
      "organeRef": {
        "@xmlns:xsi": "http://www.w3.org/2001/XMLSchema-instance",
        "@xsi:nil": "true"
      },
      "groupePolitiqueRef": "PO730964"
    },
    "cosignataires": {
      "acteurRef": "PA721564"
    },
    "texteAffichable": "Mme&#160;Fajgeles, rapporteure"
  },
  "pointeurFragmentTexte": {
    "missionVisee": {
      "@xmlns:xsi": "http://www.w3.org/2001/XMLSchema-instance",
      "@xsi:nil": "true"
    },
    "division": {
      "titre": "Article 5",
      "articleDesignationCourte": "ART. 5",
      "type": "ARTICLE",
      "avant_A_Apres": "A",
      "divisionRattachee": "ARTICLE 5",
      "articleAdditionnel": {
        "@xmlns:xsi": "http://www.w3.org/2001/XMLSchema-instance",
        "@xsi:nil": "true"
      },
      "chapitreAdditionnel": {
        "@xmlns:xsi": "http://www.w3.org/2001/XMLSchema-instance",
        "@xsi:nil": "true"
      },
      "urlDivisionTexteVise": "/15/textes/1106.asp#D_Article_5"
    },
    "alinea": {
      "@xmlns:xsi": "http://www.w3.org/2001/XMLSchema-instance",
      "@xsi:nil": "true"
    }
  },
  "corps": {
    "dispositif": "<p style=\"text-align: justify;\">R&#233;diger ainsi cet article&#160;:</p><p style=\"text-align: justify;\">&#171;&#160;I.&#160;&#8211;&#160;Le titre&#160;II du livre&#160;VII du code de l&#8217;entr&#233;e et du s&#233;jour des &#233;trangers et du droit d&#8217;asile est ainsi modifi&#233;&#160;:</p><p style=\"text-align: justify;\">1&#176;&#160;A Au quatri&#232;me alin&#233;a de l&#8217;article L.&#160;722&#8209;1, apr&#232;s le mot&#160;: &#171;&#160;femmes&#160;&#187;, sont ins&#233;r&#233;s les mots&#160;: &#171;&#160;,&#160;quelle que soit leur orientation sexuelle&#160;&#187;&#160;;</p><p style=\"text-align: justify;\">1&#176;&#160;L&#8217;article&#160;L.&#160;723&#8209;2 est ainsi modifi&#233;&#160;:</p><p style=\"text-align: justify;\"><i>a)</i>&#160;Au&#160;3&#176;&#160;du&#160;III, les mots&#160;: &#171;&#160;cent&#160;vingt&#160;&#187; sont remplac&#233;s par le mot&#160;: &#171;&#160;quatre-vingt-dix&#160;&#187;&#160;;</p><p style=\"text-align: justify;\"><i>b)</i>&#160;&#192; la seconde phrase du&#160;V, apr&#232;s le mot&#160;: &#171;&#160;acc&#233;l&#233;r&#233;e&#160;&#187;, sont ins&#233;r&#233;s les mots&#160;: &#171;&#160;,&#160;sauf si le demandeur est dans la situation mentionn&#233;e au&#160;5&#176; du&#160;III,&#160;&#187;&#160;;</p><p style=\"text-align: justify;\">2&#176;&#160;L&#8217;article L.&#160;723&#8209;6 est ainsi modifi&#233;&#160;:</p><p style=\"text-align: justify;\"><i>a)</i>&#160;&#192; la premi&#232;re phrase du premier alin&#233;a, apr&#232;s le mot&#160;: &#171;&#160;convoque&#160;&#187;, sont ins&#233;r&#233;s les mots&#160;: &#171;&#160;,&#160;par tout moyen garantissant la confidentialit&#233; et la r&#233;ception personnelle par le demandeur,&#160;&#187;&#160;;</p><p style=\"text-align: justify;\"><i>b)</i>&#160;La seconde phrase du sixi&#232;me alin&#233;a est ainsi r&#233;dig&#233;e&#160;: &#171;&#160;Il est entendu, dans les conditions pr&#233;vues &#224; l&#8217;article L.&#160;741&#8209;2&#8209;1, dans la langue de son choix ou dans une autre langue dont il a une connaissance suffisante.&#160;&#187;&#160;;</p><p style=\"text-align: justify;\">b&#160;bis) &#192; la premi&#232;re phrase du huiti&#232;me alin&#233;a, les mots&#160;: &#171;&#160;le sexe&#160;&#187; sont remplac&#233;s par les mots&#160;: &#171;&#160;l&#8217;identit&#233; de genre&#160;&#187;&#160;;</p><p style=\"text-align: justify;\"><i>c)</i>&#160;Apr&#232;s le m&#234;me huiti&#232;me alin&#233;a, il est ins&#233;r&#233; un alin&#233;a ainsi r&#233;dig&#233;&#160;:</p><p style=\"text-align: justify;\">&#171;&#160;Lorsque cela est justifi&#233; pour le bon d&#233;roulement de l&#8217;entretien, le demandeur d&#8217;asile en situation de handicap peut, &#224; sa demande et sur autorisation du directeur g&#233;n&#233;ral de l&#8217;Office fran&#231;ais de protection des r&#233;fugi&#233;s et apatrides, &#234;tre accompagn&#233; par le professionnel de sant&#233; qui le suit habituellement ou par le repr&#233;sentant d&#8217;une association d&#8217;aide aux personnes en situation de handicap.&#160;&#187;&#160;;</p><p style=\"text-align: justify;\">3&#176;&#160;La premi&#232;re phrase du premier alin&#233;a de l&#8217;article L.&#160;723&#8209;8 est compl&#233;t&#233;e par les mots&#160;: &#171;&#160;,&#160;par tout moyen garantissant la confidentialit&#233; et sa r&#233;ception personnelle par le demandeur&#160;&#187;&#160;;</p><p style=\"text-align: justify;\">4&#176;&#160;Au cinqui&#232;me alin&#233;a de l&#8217;article L.&#160;723&#8209;11, apr&#232;s le mot&#160;: &#171;&#160;asile&#160;&#187;, sont ins&#233;r&#233;s les mots&#160;: &#171;&#160;est effectu&#233;e par &#233;crit, par tout moyen garantissant la confidentialit&#233; et sa r&#233;ception personnelle par le demandeur, et&#160;&#187;&#160;;</p><p style=\"text-align: justify;\">5&#176;&#160;L&#8217;article L.&#160;723&#8209;13 est ainsi modifi&#233;&#160;:</p><p style=\"text-align: justify;\"><i>a)</i>&#160;Au&#160;1&#176;, les mots&#160;: &#171;&#160;n&#8217;a pas introduit sa demande &#224; l&#8217;office dans&#160;&#187; sont remplac&#233;s par les&#160;mots&#160;: &#171;&#160;a introduit sa demande &#224; l&#8217;office en ne respectant pas&#160;&#187;&#160;;</p><p style=\"text-align: justify;\"><i>b)</i>&#160;Apr&#232;s le&#160;3&#176;, il est ins&#233;r&#233; un alin&#233;a ainsi r&#233;dig&#233;&#160;:</p><p style=\"text-align: justify;\">&#171;&#160;Par exception &#224; l&#8217;article L.&#160;723&#8209;1, lorsque l&#8217;&#233;tranger, sans motif l&#233;gitime, n&#8217;a pas introduit sa demande, l&#8217;office prend une d&#233;cision de cl&#244;ture.&#160;&#187;&#160;;</p><p style=\"text-align: justify;\"><i>c)</i>&#160;Le dernier alin&#233;a est remplac&#233; par deux alin&#233;as ainsi r&#233;dig&#233;s&#160;:</p><p style=\"text-align: justify;\">&#171;&#160;L&#8217;office notifie par &#233;crit sa d&#233;cision au demandeur, par tout moyen garantissant la confidentialit&#233; et sa r&#233;ception personnelle par le demandeur. Cette d&#233;cision est motiv&#233;e en fait et en droit et pr&#233;cise les voies et d&#233;lais de recours.</p><p style=\"text-align: justify;\">&#171;&#160;Dans le cas pr&#233;vu au&#160;3&#176; du pr&#233;sent article, la d&#233;cision de cl&#244;ture est r&#233;put&#233;e notifi&#233;e &#224; la date de la d&#233;cision.&#160;&#187;&#160;;</p><p style=\"text-align: justify;\">6&#176;&#160;La premi&#232;re phrase de l&#8217;article L.&#160;724&#8209;3 est compl&#233;t&#233;e par les mots&#160;: &#171;&#160;,&#160;par tout moyen garantissant la confidentialit&#233; et sa r&#233;ception personnelle par le demandeur&#160;&#187;.</p><p style=\"text-align: justify;\">II.&#160;&#8211;&#160;La premi&#232;re phrase du premier alin&#233;a de l&#8217;article L.&#160;812&#8209;3 du code de l&#8217;entr&#233;e et du s&#233;jour des &#233;trangers et du droit d&#8217;asile est compl&#233;t&#233;e par les mots&#160;: &#171;&#160;,&#160;par tout moyen garantissant la confidentialit&#233; et sa r&#233;ception personnelle par le demandeur&#160;&#187;.</p>",
    "exposeSommaire": "<p>Cet amendement a pour objet de r&#233;tablir la r&#233;daction adopt&#233;e par l'Assembl&#233;e nationale en premi&#232;re lecture.</p>",
    "annexeExposeSommaire": {
      "@xmlns:xsi": "http://www.w3.org/2001/XMLSchema-instance",
      "@xsi:nil": "true"
    }
  },
  "representations": {
    "representation": {
      "nom": "PDF",
      "typeMime": {
        "type": "application",
        "subType": "PDF"
      },
      "statutRepresentation": {
        "verbatim": "true",
        "canonique": "true",
        "officielle": "true",
        "transcription": "false",
        "enregistrement": "false"
      },
      "repSource": {
        "@xmlns:xsi": "http://www.w3.org/2001/XMLSchema-instance",
        "@xsi:nil": "true"
      },
      "offset": {
        "@xmlns:xsi": "http://www.w3.org/2001/XMLSchema-instance",
        "@xsi:nil": "true"
      },
      "contenu": {
        "documentURI": "/15/amendements/1106/CION_LOIS/CL274.pdf"
      },
      "dateDispoRepresentation": {
        "@xmlns:xsi": "http://www.w3.org/2001/XMLSchema-instance",
        "@xsi:nil": "true"
      }
    }
  },
  "seanceDiscussion": {
    "@xmlns:xsi": "http://www.w3.org/2001/XMLSchema-instance",
    "@xsi:nil": "true"
  },
  "sort": {
    "dateSaisie": "2018-07-11T10:37:06.000+02:00",
    "sortEnSeance": "Adopté"
  },
  "dateDepot": "2018-07-08T02:00:00.000+02:00",
  "dateDistribution": "2018-07-10T02:00:00.000+02:00",
  "article99": "0",
  "loiReference": {
    "codeLoi": {
      "@xmlns:xsi": "http://www.w3.org/2001/XMLSchema-instance",
      "@xsi:nil": "true"
    },
    "divisionCodeLoi": {
      "@xmlns:xsi": "http://www.w3.org/2001/XMLSchema-instance",
      "@xsi:nil": "true"
    }
  }
}