{
  "@xmlns": "http://schemas.assemblee-nationale.fr/referentiel",
  "uid": "AMANR5L15PO59051B0490P0D1N235",
  "identifiant": {
    "legislature": "15",
    "numero": "235",
    "numRect": "0",
    "saisine": {
      "refTexteLegislatif": "PRJLANR5L15B0490",
      "numeroPartiePLF": "0",
      "organeExamen": "PO59051",
      "mentionSecondeDeliberation": "0"
    }
  },
  "numeroLong": "CL235",
  "etapeTexte": "1ère lecture (1ère assemblée saisie)",
  "triAmendement": "h",
  "cardinaliteAmdtMultiples": "1",
  "amendementParent": {
    "@xmlns:xsi": "http://www.w3.org/2001/XMLSchema-instance",
    "@xsi:nil": "true"
  },
  "etat": "Discuté",
  "signataires": {
    "auteur": {
      "typeAuteur": "Depute",
      "acteurRef": "PA721142",
      "organeRef": {
        "@xmlns:xsi": "http://www.w3.org/2001/XMLSchema-instance",
        "@xsi:nil": "true"
      },
      "groupePolitiqueRef": "PO730964"
    },
    "cosignataires": {
      "acteurRef": "PA721142"
    },
    "texteAffichable": "Mme&#160;Forteza, rapporteure"
  },
  "pointeurFragmentTexte": {
    "missionVisee": {
      "@xmlns:xsi": "http://www.w3.org/2001/XMLSchema-instance",
      "@xsi:nil": "true"
    },
    "division": {
      "titre": "Article 14",
      "articleDesignationCourte": "ART. 14",
      "type": "ARTICLE",
      "avant_A_Apres": "A",
      "divisionRattachee": "ARTICLE 14",
      "articleAdditionnel": {
        "@xmlns:xsi": "http://www.w3.org/2001/XMLSchema-instance",
        "@xsi:nil": "true"
      },
      "chapitreAdditionnel": {
        "@xmlns:xsi": "http://www.w3.org/2001/XMLSchema-instance",
        "@xsi:nil": "true"
      },
      "urlDivisionTexteVise": "/15/textes/0490.asp#D_Article_14"
    },
    "alinea": {
      "avant_A_Apres": {
        "@xmlns:xsi": "http://www.w3.org/2001/XMLSchema-instance",
        "@xsi:nil": "true"
      },
      "numero": "3",
      "alineaDesignation": {
        "@xmlns:xsi": "http://www.w3.org/2001/XMLSchema-instance",
        "@xsi:nil": "true"
      }
    }
  },
  "corps": {
    "dispositif": "<p style=\"text-align: justify;\">I.&#160;&#8211;&#160;Supprimer l&#8217;alin&#233;a&#160;3.</p><p style=\"text-align: justify;\">II.&#160;&#8211;&#160;En cons&#233;quence, apr&#232;s le mot&#160;:</p><p style=\"text-align: justify;\">&#171;&#160;exception&#160;&#187;,</p><p style=\"text-align: justify;\">supprimer la fin de l&#8217;alin&#233;a&#160;5.</p><p style=\"text-align: justify;\">III.&#160;&#8211;&#160;En cons&#233;quence, apr&#232;s l&#8217;alin&#233;a&#160;5, ins&#233;rer les trois alin&#233;as suivants&#160;:</p><p style=\"text-align: justify;\">1&#176;&#160;<i>bis</i>&#160;Apr&#232;s le deuxi&#232;me alin&#233;a, sont ins&#233;r&#233;s deux alin&#233;as ainsi r&#233;dig&#233;s :</p><p style=\"text-align: justify;\">&#171;&#160;1&#176;&#160;des cas mentionn&#233;s aux&#160;<i>a</i> et&#160;<i>c</i> du&#160;2 de l&#8217;article&#160;22 du r&#232;glement&#160;(UE)&#160;2016/679 du Parlement&#160;europ&#233;en et du Conseil du&#160;27&#160;avril&#160;2016 relatif &#224; la protection des personnes physiques &#224; l&#8217;&#233;gard du traitement des donn&#233;es &#224; caract&#232;re personnel et &#224; la libre circulation de ces donn&#233;es, et abrogeant la directive&#160;95/46/CE et sous les r&#233;serves mentionn&#233;es au&#160;3 du m&#234;me article&#160;;</p><p style=\"text-align: justify;\">&#171;&#160;2&#176;&#160;des d&#233;cisions administratives individuelles prises dans le respect de l&#8217;article L.&#160;311&#8209;3&#8209;1 et du chapitre&#160;I<sup>er</sup> du titre&#160;I<sup>er</sup> du livre&#160;IV du code des relations entre le public et l&#8217;administration, &#224; condition que le traitement ne porte pas sur des donn&#233;es mentionn&#233;es au&#160;I de l&#8217;article&#160;8 de la pr&#233;sente loi.&#160;&#187;&#160;;</p>",
    "exposeSommaire": "<p>Cet amendement, d'apparence r&#233;dactionnelle, vise &#224; clarifier le principe selon lequel aucune d&#233;cision produisant des effets juridiques &#224; l'&#233;gard d'une personne ne peut &#234;tre prise sur le seul fondement d'un traitement automatis&#233;s de donn&#233;es sauf exceptions. Ces exceptions sont les suivantes :</p><p>1) les d&#233;cisions r&#233;sultant de la conclusion ou de l'ex&#233;cution d'un contrat entre la personne concern&#233;e et un responsable du traitement et les d&#233;cisions fond&#233;es sur le consentement explicite de la personne concern&#233;e (exceptions mentionn&#233;s au a et c du 2 de l'article 22 du r&#232;glement g&#233;n&#233;ral sur les donn&#233;es personnelles - RGDP) d&#232;s lors que les garanties minimales suivantes sont assur&#233;es :</p><p>- droit de la personne concern&#233;e d'obtenir une intervention humaine de la part du responsable du traitement;</p><p>- droit d'exprimer son point de vue ;</p><p>- droit de contester la d&#233;cision.</p><p>2) les d&#233;cisions administratives individuelles d&#232;s lors que les garanties minimales suivantes sont assur&#233;es :</p><p>- le respect des obligations pr&#233;vues par l'article L. 311-3-1 et par le chapitre Ier du titre Ier du livre IV du code des relations entre le public et l&#8217;administration (droit d'acc&#232;s au code source, obligation g&#233;n&#233;rale d'information du public par l'administration des r&#232;gles d&#233;finissant les principaux traitements algorithmiques utilis&#233;s dans l'accomplissement de leurs missions lorsqu'ils fondent des d&#233;cisions individuelles, obligation d'information &#224; l'&#233;gard de la personne concern&#233;e qu'elle fait l'objet d'une d&#233;cision individuelle fond&#233;e sur un seul traitement algorithmique et qu'elle peut demander les principales caract&#233;ristiques de sa mise en oeuvre par l'administration selon les modalit&#233;s fix&#233;es par l'article R. 311-3-1-1) ;</p><p>- l'interdiction que le traitement porte sur des donn&#233;es faisant appara&#238;tre, directement ou indirectement, les origines raciales ou ethniques, les opinions politiques, philosophiques ou religieuses ou l'appartenance syndicale des personnes, ou qui sont relatives &#224; la sant&#233; ou &#224; la vie sexuelle de la personne concern&#233;e (I de l'article 8 de la loi n&#176; 78-17 du 6 janvier 1978).</p><p>- le droit d'exercer un recours comme pour toute d&#233;cision administrative individuelle.</p>",
    "annexeExposeSommaire": {
      "@xmlns:xsi": "http://www.w3.org/2001/XMLSchema-instance",
      "@xsi:nil": "true"
    }
  },
  "representations": {
    "representation": {
      "nom": "PDF",
      "typeMime": {
        "type": "application",
        "subType": "PDF"
      },
      "statutRepresentation": {
        "verbatim": "true",
        "canonique": "true",
        "officielle": "true",
        "transcription": "false",
        "enregistrement": "false"
      },
      "repSource": {
        "@xmlns:xsi": "http://www.w3.org/2001/XMLSchema-instance",
        "@xsi:nil": "true"
      },
      "offset": {
        "@xmlns:xsi": "http://www.w3.org/2001/XMLSchema-instance",
        "@xsi:nil": "true"
      },
      "contenu": {
        "documentURI": "/15/amendements/0490/CION_LOIS/CL235.pdf"
      },
      "dateDispoRepresentation": {
        "@xmlns:xsi": "http://www.w3.org/2001/XMLSchema-instance",
        "@xsi:nil": "true"
      }
    }
  },
  "seanceDiscussion": {
    "@xmlns:xsi": "http://www.w3.org/2001/XMLSchema-instance",
    "@xsi:nil": "true"
  },
  "sort": {
    "dateSaisie": "2018-01-24T21:36:19.000+01:00",
    "sortEnSeance": "Adopté"
  },
  "dateDepot": "2018-01-22T01:00:00.000+01:00",
  "dateDistribution": "2018-01-22T01:00:00.000+01:00",
  "article99": "0",
  "loiReference": {
    "codeLoi": {
      "@xmlns:xsi": "http://www.w3.org/2001/XMLSchema-instance",
      "@xsi:nil": "true"
    },
    "divisionCodeLoi": {
      "@xmlns:xsi": "http://www.w3.org/2001/XMLSchema-instance",
      "@xsi:nil": "true"
    }
  }
}