{
  "@xmlns": "http://schemas.assemblee-nationale.fr/referentiel",
  "uid": "AMANR5L15SEA717460B1255P2D1N488",
  "identifiant": {
    "legislature": "15",
    "numero": "488",
    "numRect": "0",
    "saisine": {
      "refTexteLegislatif": "PRJLANR5L15B1255",
      "numeroPartiePLF": "2",
      "organeExamen": "PO717460",
      "mentionSecondeDeliberation": "0"
    }
  },
  "numeroLong": "II-488",
  "etapeTexte": "1ère lecture (1ère assemblée saisie)",
  "triAmendement": "aadiaaaaaaaaaaaaaaaaaaaaaaaaaaaaaaaaaaaaaaaaaaaaaaazi",
  "cardinaliteAmdtMultiples": "1",
  "amendementParent": {
    "@xmlns:xsi": "http://www.w3.org/2001/XMLSchema-instance",
    "@xsi:nil": "true"
  },
  "etat": "Discuté",
  "signataires": {
    "auteur": {
      "typeAuteur": "Depute",
      "acteurRef": "PA721062",
      "organeRef": {
        "@xmlns:xsi": "http://www.w3.org/2001/XMLSchema-instance",
        "@xsi:nil": "true"
      },
      "groupePolitiqueRef": "PO730958"
    },
    "cosignataires": {
      "acteurRef": [
        "PA718860",
        "PA721210",
        "PA721062",
        "PA720422",
        "PA719578",
        "PA721202",
        "PA720892",
        "PA721960",
        "PA721226",
        "PA720846",
        "PA588884",
        "PA2150",
        "PA719676",
        "PA720286",
        "PA718868",
        "PA722142",
        "PA720430"
      ]
    },
    "texteAffichable": "M.&#160;Ratenon,  Mme&#160;Autain, M.&#160;Bernalicis, M.&#160;Coquerel, M.&#160;Corbi&#232;re, Mme&#160;Fiat, M.&#160;Lachaud, M.&#160;Larive, M.&#160;M&#233;lenchon, Mme&#160;Obono, Mme&#160;Panot, M.&#160;Prud&apos;homme, M.&#160;Quatennens, Mme&#160;Ressiguier, Mme&#160;Rubin, M.&#160;Ruffin et Mme&#160;Taurine"
  },
  "pointeurFragmentTexte": {
    "missionVisee": {
      "idMissionAN": "411",
      "libelleMission": "Outre-mer",
      "codeMissionPLF": "B",
      "libelleMissionPLF": "Répartition, par mission et programme, des crédits du budget général"
    },
    "division": {
      "titre": "ÉTAT B",
      "articleDesignationCourte": "ART. 39",
      "type": "ANNEXE",
      "avant_A_Apres": "A",
      "divisionRattachee": "ARTICLE 39",
      "articleAdditionnel": {
        "@xmlns:xsi": "http://www.w3.org/2001/XMLSchema-instance",
        "@xsi:nil": "true"
      },
      "chapitreAdditionnel": {
        "@xmlns:xsi": "http://www.w3.org/2001/XMLSchema-instance",
        "@xsi:nil": "true"
      },
      "urlDivisionTexteVise": "/15/textes/1255C.asp#D_ETAT_B"
    },
    "alinea": {
      "@xmlns:xsi": "http://www.w3.org/2001/XMLSchema-instance",
      "@xsi:nil": "true"
    }
  },
  "corps": {
    "exposeSommaire": "<p style=\"text-align: justify;\">Par cet amendement d&#8217;appel et de d&#233;nonciation, nous proposons que 3 millions d&#8217;euros soient red&#233;ploy&#233;s de l&#8217;action &#171;&#160;09 &#8211; Appui &#224; l'acc&#232;s aux financements bancaires&#160;&#187; (qui vise &#224; acquitter des int&#233;r&#234;ts bancaires) &#224; un Fonds d&#8217;urgence pour aider au rapatriement m&#233;dical et sanitaire.</p><p style=\"text-align: justify;\">Cet amendement est la traduction de sollicitations de citoyens et citoyennes, ainsi que d&#8217;une remont&#233;e d&#8217;informations op&#233;r&#233;e par les insoumises et insoumis d&#8217;Outre-mer.</p><p style=\"text-align: justify;\">Chaque ann&#233;e, de nombreux cas de personnes en fin de vie souhaitant retourner dans leur collectivit&#233; de naissance, en Outre-Mer, choquent l&#8217;opinion. En effet, les dispositifs publics pour permettre &#224; ces personnes de rentrer sur leurs terres sont si maigres qu&#8217;ils rendent factuellement impossible ce retour souhait&#233; aupr&#232;s de leurs proches.</p><p style=\"text-align: justify;\">Dans le m&#234;me sens, de nombreux d&#233;c&#232;s d&#8217;ultramarins en hexagone mettent les familles dans une difficult&#233; particuli&#232;re de financement du rapatriement du corps de leur proche.</p><p style=\"text-align: justify;\">Les parlementaires ultramarins sont r&#233;guli&#232;rement confront&#233;s &#224; ce probl&#232;me et sollicit&#233;s par les habitants de leur circonscription sans pouvoir trouver une solution concr&#232;te qui soit p&#233;renne.</p><p style=\"text-align: justify;\">Parall&#232;lement &#224; cela, trop de peu de solutions existent &#233;galement pour permettre des transferts m&#233;dicaux pour des personnes r&#233;sidant en Outre-mer n&#233;cessitant des soins tr&#232;s sp&#233;cialis&#233;s qui ne sont pas dispens&#233;s sur leur territoire de r&#233;sidence. Par exemple, trop peu de dispositifs permettent aux parents et &#224; la famille proche d&#8217;accompagner leur enfant se faire se soigner en hexagone.</p><p style=\"text-align: justify;\">Trop souvent, c&#8217;est la solidarit&#233; familiale et des territoires qui permettent de trouver une solution<span class=\"del cts-1\"  data-cid=\"2\" data-userid=\"1826\" data-username=\"Arnaud Iss\" data-time=\"1540564654657\">s</span> &#224; ces situations dramatiques.</p><p style=\"text-align: justify;\">Cet amendement vise donc &#224; pr&#233;lever 3 millions d&#8217;euros de l&#8217;action &#171;&#160;09 &#8211; Appui &#224; l'acc&#232;s aux financements bancaires&#160;&#187; du programme 123 \"Conditions de vie en Outre-mer\", pour abonder le nouveau programme : &#171; Fonds d&#8217;urgence d&#8217;aide suppl&#233;mentaire au rapatriement m&#233;dical et sanitaire &#187;.</p>",
    "annexeExposeSommaire": {
      "@xmlns:xsi": "http://www.w3.org/2001/XMLSchema-instance",
      "@xsi:nil": "true"
    },
    "dispositifAmdtCredit": {
      "listeProgrammes": {
        "programme": [
          {
            "libelle": "Emploi outre-mer",
            "id": "31451",
            "AE": {
              "montantPositif": "0",
              "montantNegatif": "0"
            },
            "CP": {
              "montantPositif": "0",
              "montantNegatif": "0"
            },
            "action": "modification",
            "lignesCredits": null
          },
          {
            "libelle": "Conditions de vie outre-mer",
            "id": "31452",
            "AE": {
              "montantPositif": "0",
              "montantNegatif": "3000000"
            },
            "CP": {
              "montantPositif": "0",
              "montantNegatif": "3000000"
            },
            "action": "modification",
            "lignesCredits": null
          },
          {
            "libelle": "Fonds d'urgence d'aide supplémentaire au rapatriement médical et sanitaire",
            "id": "31453",
            "AE": {
              "montantPositif": "3000000",
              "montantNegatif": "0"
            },
            "CP": {
              "montantPositif": "3000000",
              "montantNegatif": "0"
            },
            "action": "creation",
            "lignesCredits": null
          }
        ]
      },
      "totalAE": {
        "montantPositif": "3000000",
        "montantNegatif": "3000000",
        "solde": "0"
      },
      "totalCP": {
        "montantPositif": "3000000",
        "montantNegatif": "3000000",
        "solde": "0"
      }
    }
  },
  "representations": {
    "representation": {
      "nom": "PDF",
      "typeMime": {
        "type": "application",
        "subType": "PDF"
      },
      "statutRepresentation": {
        "verbatim": "true",
        "canonique": "true",
        "officielle": "true",
        "transcription": "false",
        "enregistrement": "false"
      },
      "repSource": {
        "@xmlns:xsi": "http://www.w3.org/2001/XMLSchema-instance",
        "@xsi:nil": "true"
      },
      "offset": {
        "@xmlns:xsi": "http://www.w3.org/2001/XMLSchema-instance",
        "@xsi:nil": "true"
      },
      "contenu": {
        "documentURI": "/15/amendements/1255C/AN/488.pdf"
      },
      "dateDispoRepresentation": {
        "@xmlns:xsi": "http://www.w3.org/2001/XMLSchema-instance",
        "@xsi:nil": "true"
      }
    }
  },
  "seanceDiscussion": "RUANR5L15S2019IDS21318",
  "sort": {
    "dateSaisie": "2018-10-30T22:06:20.000+01:00",
    "sortEnSeance": "Rejeté"
  },
  "dateDepot": "2018-10-26T02:00:00.000+02:00",
  "dateDistribution": "2018-10-29T01:00:00.000+01:00",
  "article99": "0",
  "loiReference": {
    "codeLoi": {
      "@xmlns:xsi": "http://www.w3.org/2001/XMLSchema-instance",
      "@xsi:nil": "true"
    },
    "divisionCodeLoi": {
      "@xmlns:xsi": "http://www.w3.org/2001/XMLSchema-instance",
      "@xsi:nil": "true"
    }
  }
}