{
  "@xmlns": "http://schemas.assemblee-nationale.fr/referentiel",
  "uid": "AMANR5L15PO419604B0904P0D1N82",
  "identifiant": {
    "legislature": "15",
    "numero": "82",
    "numRect": "0",
    "saisine": {
      "refTexteLegislatif": "PRJLANR5L15B0904",
      "numeroPartiePLF": "0",
      "organeExamen": "PO419604",
      "mentionSecondeDeliberation": "0"
    }
  },
  "numeroLong": "AC82",
  "etapeTexte": "1ère lecture (1ère assemblée saisie)",
  "triAmendement": "ii",
  "cardinaliteAmdtMultiples": "1",
  "amendementParent": {
    "@xmlns:xsi": "http://www.w3.org/2001/XMLSchema-instance",
    "@xsi:nil": "true"
  },
  "etat": "Discuté",
  "signataires": {
    "auteur": {
      "typeAuteur": "Depute",
      "acteurRef": "PA720988",
      "organeRef": {
        "@xmlns:xsi": "http://www.w3.org/2001/XMLSchema-instance",
        "@xsi:nil": "true"
      },
      "groupePolitiqueRef": "PO730946"
    },
    "cosignataires": {
      "acteurRef": [
        "PA1198",
        "PA333285",
        "PA609590",
        "PA337483",
        "PA1008",
        "PA267233",
        "PA429893",
        "PA608695",
        "PA335532",
        "PA643145",
        "PA508",
        "PA608011",
        "PA340343",
        "PA1592",
        "PA642764",
        "PA609332",
        "PA335054",
        "PA1809",
        "PA607553",
        "PA332614",
        "PA719930",
        "PA333818",
        "PA340357",
        "PA405480",
        "PA610681",
        "PA720988",
        "PA588886",
        "PA605069",
        "PA608172",
        "PA342415"
      ]
    },
    "texteAffichable": "Mme&#160;Manin,  Mme&#160;Pau-Langevin, M.&#160;Juanico, Mme&#160;Victory, Mme&#160;Bi&#233;mouret, Mme&#160;Bareigts, Mme&#160;Vainqueur-Christophe, M.&#160;Vallaud, M.&#160;Aviragnet, Mme&#160;Battistel, M.&#160;Bouillon, M.&#160;Jean-Louis&#160;Bricout, M.&#160;Carvounas, M.&#160;Alain&#160;David, Mme&#160;Laurence&#160;Dumont, M.&#160;Faure, M.&#160;Garot, M.&#160;David&#160;Habib, M.&#160;Hutin, Mme&#160;Karamanli, M.&#160;J&#233;r&#244;me&#160;Lambert, M.&#160;Le Foll, M.&#160;Letchimy, Mme&#160;Pires Beaune, M.&#160;Potier, M.&#160;Pueyo, M.&#160;Pupponi, Mme&#160;Rabault, M.&#160;Saulignac et Mme&#160;Untermaier"
  },
  "pointeurFragmentTexte": {
    "missionVisee": {
      "@xmlns:xsi": "http://www.w3.org/2001/XMLSchema-instance",
      "@xsi:nil": "true"
    },
    "division": {
      "titre": "Article 11",
      "articleDesignationCourte": "ART. 11",
      "type": "ARTICLE",
      "avant_A_Apres": "A",
      "divisionRattachee": "ARTICLE 11",
      "articleAdditionnel": {
        "@xmlns:xsi": "http://www.w3.org/2001/XMLSchema-instance",
        "@xsi:nil": "true"
      },
      "chapitreAdditionnel": {
        "@xmlns:xsi": "http://www.w3.org/2001/XMLSchema-instance",
        "@xsi:nil": "true"
      },
      "urlDivisionTexteVise": "/15/textes/0904.asp#D_Article_11"
    },
    "alinea": {
      "avant_A_Apres": "A",
      "numero": "10",
      "alineaDesignation": "Alinéa 10"
    }
  },
  "corps": {
    "dispositif": "<p>Supprimer l&#8217;alin&#233;a&#160;10.</p>",
    "exposeSommaire": "<p style=\"text-align: justify;\">La mission de l&#8217;inspection de l&#8217;apprentissage se compose de deux volets. Le premier vise &#224; l&#8217;inspection p&#233;dagogique des centres de formation d&#8217;apprentis et des sections d&#8217;apprentissage et le second &#224; l&#8217;inspection administrative et financi&#232;re de ces centres et sections d&#8217;apprentissage.</p><p style=\"text-align: justify;\">Votre texte&#160;abroge purement et simplement toutes&#160;les dispositions du code du travail relatives &#224; l&#8217;inspection et au contr&#244;le de l&#8217;apprentissage.&#160;</p><p style=\"text-align: justify;\">En effet,&#160;votre projet de loi supprime tout le titre de loi relatif au contr&#244;le et l&#8217;inspection et pr&#233;voit simplement, dans les dispositions g&#233;n&#233;rales, que&#160;&#171;&#160;<i>les formations conduisant &#224; l&#8217;obtention d&#8217;un dipl&#244;me sont soumises &#224; un contr&#244;le p&#233;dagogique associant les corps d&#8217;inspection ou les agents publics habilit&#233;s par les minist&#232;res certificateurs et des repr&#233;sentants d&#233;sign&#233;s par les branches professionnelles et les chambres consulaires selon des modalit&#233;s d&#233;termin&#233;es par d&#233;cret en Conseil d&#8217;&#201;tat</i>&#160;&#187;.&#160;</p><p style=\"text-align: justify;\">C&#8217;est pourquoi nous proposons de supprimer cet alin&#233;a afin de r&#233;tablir le pouvoir de l&#8217;inspection.&#160;</p><p style=\"text-align: justify;\">&#160;</p><p style=\"text-align: justify;\">&#160;</p>",
    "annexeExposeSommaire": {
      "@xmlns:xsi": "http://www.w3.org/2001/XMLSchema-instance",
      "@xsi:nil": "true"
    }
  },
  "representations": {
    "representation": {
      "nom": "PDF",
      "typeMime": {
        "type": "application",
        "subType": "PDF"
      },
      "statutRepresentation": {
        "verbatim": "true",
        "canonique": "true",
        "officielle": "true",
        "transcription": "false",
        "enregistrement": "false"
      },
      "repSource": {
        "@xmlns:xsi": "http://www.w3.org/2001/XMLSchema-instance",
        "@xsi:nil": "true"
      },
      "offset": {
        "@xmlns:xsi": "http://www.w3.org/2001/XMLSchema-instance",
        "@xsi:nil": "true"
      },
      "contenu": {
        "documentURI": "/15/amendements/0904/CION-CEDU/AC82.pdf"
      },
      "dateDispoRepresentation": {
        "@xmlns:xsi": "http://www.w3.org/2001/XMLSchema-instance",
        "@xsi:nil": "true"
      }
    }
  },
  "seanceDiscussion": {
    "@xmlns:xsi": "http://www.w3.org/2001/XMLSchema-instance",
    "@xsi:nil": "true"
  },
  "sort": {
    "dateSaisie": "2018-05-23T11:19:06.000+02:00",
    "sortEnSeance": "Rejeté"
  },
  "dateDepot": "2018-05-18T02:00:00.000+02:00",
  "dateDistribution": "2018-05-22T02:00:00.000+02:00",
  "article99": "0",
  "loiReference": {
    "codeLoi": {
      "@xmlns:xsi": "http://www.w3.org/2001/XMLSchema-instance",
      "@xsi:nil": "true"
    },
    "divisionCodeLoi": {
      "@xmlns:xsi": "http://www.w3.org/2001/XMLSchema-instance",
      "@xsi:nil": "true"
    }
  }
}