{
  "@xmlns": "http://schemas.assemblee-nationale.fr/referentiel",
  "uid": "AMANR5L15SEA717460B1255P2D1N1638",
  "identifiant": {
    "legislature": "15",
    "numero": "1638",
    "numRect": "0",
    "saisine": {
      "refTexteLegislatif": "PRJLANR5L15B1255",
      "numeroPartiePLF": "2",
      "organeExamen": "PO717460",
      "mentionSecondeDeliberation": "0"
    }
  },
  "numeroLong": "II-1638",
  "etapeTexte": "1ère lecture (1ère assemblée saisie)",
  "triAmendement": "dwaaaaaaaaaaaaaaaaaaaaaaaaaaaaaaaaaaaaaaaaaaaaaaaakns",
  "cardinaliteAmdtMultiples": "1",
  "amendementParent": {
    "@xmlns:xsi": "http://www.w3.org/2001/XMLSchema-instance",
    "@xsi:nil": "true"
  },
  "etat": "Discuté",
  "signataires": {
    "auteur": {
      "typeAuteur": "Depute",
      "acteurRef": "PA720230",
      "organeRef": {
        "@xmlns:xsi": "http://www.w3.org/2001/XMLSchema-instance",
        "@xsi:nil": "true"
      },
      "groupePolitiqueRef": "PO744425"
    },
    "cosignataires": {
      "acteurRef": [
        "PA721194",
        "PA1960",
        "PA721486",
        "PA610775",
        "PA712014",
        "PA267330",
        "PA721110",
        "PA267355",
        "PA266788",
        "PA720230",
        "PA267780",
        "PA267766",
        "PA642868",
        "PA719806",
        "PA721094"
      ]
    },
    "texteAffichable": "Mme&#160;Magnier,  Mme&#160;Auconie, M.&#160;Guy&#160;Bricout, M.&#160;Christophe, Mme&#160;Fr&#233;d&#233;rique&#160;Dumas, M.&#160;Dunoyer, Mme&#160;Firmin Le Bodo, M.&#160;Gom&#232;s, M.&#160;Herth, M.&#160;Ledoux, M.&#160;Leroy, M.&#160;Morel-&#192;-L&apos;Huissier, M.&#160;Naegelen, Mme&#160;Sanquer et M.&#160;Zumkeller"
  },
  "pointeurFragmentTexte": {
    "missionVisee": {
      "@xmlns:xsi": "http://www.w3.org/2001/XMLSchema-instance",
      "@xsi:nil": "true"
    },
    "division": {
      "titre": "Article 50",
      "articleDesignationCourte": "ART. 50",
      "type": "ARTICLE",
      "avant_A_Apres": "A",
      "divisionRattachee": "ARTICLE 50",
      "articleAdditionnel": {
        "@xmlns:xsi": "http://www.w3.org/2001/XMLSchema-instance",
        "@xsi:nil": "true"
      },
      "chapitreAdditionnel": {
        "@xmlns:xsi": "http://www.w3.org/2001/XMLSchema-instance",
        "@xsi:nil": "true"
      },
      "urlDivisionTexteVise": "/15/textes/1255C.asp#D_Article_50"
    },
    "alinea": {
      "avant_A_Apres": {
        "@xmlns:xsi": "http://www.w3.org/2001/XMLSchema-instance",
        "@xsi:nil": "true"
      },
      "numero": "7",
      "alineaDesignation": {
        "@xmlns:xsi": "http://www.w3.org/2001/XMLSchema-instance",
        "@xsi:nil": "true"
      }
    }
  },
  "corps": {
    "dispositif": "<p style=\"text-align: justify;\">I.&#160;&#8211;&#160;&#192; l&#8217;alin&#233;a&#160;7, substituer au mot&#160;:</p><p style=\"text-align: justify;\">&#171;&#160;cinquante&#160;&#187;</p><p style=\"text-align: justify;\">les mots&#160;:</p><p style=\"text-align: justify;\">&#171;&#160;deux cent cinquante&#160;&#187;.</p><p style=\"text-align: justify;\">II. &#8211; En cons&#233;quence, au m&#234;me alin&#233;a, substituer aux mots&#160;:</p><p style=\"text-align: justify;\">&#171;&#160;ou a r&#233;alis&#233; un chiffre d&#8217;affaires n&#8217;exc&#233;dant pas dix&#160;&#187;</p><p style=\"text-align: justify;\">les mots&#160;:</p><p style=\"text-align: justify;\">&#171;&#160;n&#8217;exc&#233;dant pas quarante-trois millions d&#8217;euros ou un chiffre d&#8217;affaires n&#8217;exc&#233;dant pas cinquante&#160;&#187;&#160;;</p><p style=\"text-align: justify;\">III. &#8211; En cons&#233;quence, au m&#234;me alin&#233;a, substituer au mot&#160;:</p><p style=\"text-align: justify;\">&#171;&#160;petite&#160;&#187;</p><p style=\"text-align: justify;\">le mot&#160;:</p><p style=\"text-align: justify;\">&#171;&#160;moyenne&#160;&#187;.&#160;</p><p style=\"text-align: justify;\">IV.&#160;&#8211;&#160;Compl&#233;ter cet article par l&#8217;alin&#233;a suivant&#160;:</p><p style=\"text-align: justify;\">&#171;&#160;III.&#160;&#8211;&#160;La perte de recettes est compens&#233;e &#224; due concurrence par la cr&#233;ation d&#8217;une taxe additionnelle aux droits mentionn&#233;s aux articles 575 et 575 A du code g&#233;n&#233;ral des imp&#244;ts.&#160;&#187;</p>",
    "exposeSommaire": "<p style=\"text-align: justify;\">L&#8217;article&#160;50 &#233;tend le b&#233;n&#233;fice du cr&#233;dit vendeur aux cessions de titres de soci&#233;t&#233;s dont le chiffre d&#8217;affaires ou le total du bilan n&#8217;exc&#232;de pas 10 millions d&#8217;&#8364; et le nombre de salari&#233;s 50.</p><p style=\"text-align: justify;\">On ne peut que se f&#233;liciter d&#8217;une telle disposition puisque les transmissions/reprises d&#8217;entreprise se heurtent au probl&#232;me du financement de l&#8217;acquisition par le repreneur. Or, le syst&#232;me du cr&#233;dit-vendeur qui permet au c&#233;dant d&#8217;&#233;taler une partie du prix de vente sur plusieurs ann&#233;es est un outil de plus en plus usit&#233;.</p><p style=\"text-align: justify;\">Par la confiance que met le c&#233;dant dans son repreneur, Il constitue un levier important pour l&#8217;octroi d&#8217;un pr&#234;t bancaire associ&#233;.</p><p style=\"text-align: justify;\">Mais, il serait donc dommageable que ce dispositif du cr&#233;dit-vendeur qui fait ses preuves ne puisse b&#233;n&#233;ficier d&#8217;une mesure fiscale favorable d&#8217;&#233;talement de l&#8217;imp&#244;t sur la plus-value applicable &#224; toutes les PME et non seulement &#224; certaines d&#8217;entre elles. La disposition pr&#233;sent&#233;e est trop restrictive quant au chiffre d&#8217;affaires et au nombre de salari&#233;s. A titre d&#8217;exemple, 50 salari&#233;s pour une activit&#233; de b&#226;timent correspondent &#224; un chiffre d&#8217;affaires d&#8217;environ 5 millions d&#8217;&#8364;.</p><p style=\"text-align: justify;\">&#160;On peut rappeler &#224; cet &#233;gard que, 60&#160;000 entreprises sont en &#233;tat d&#8217;&#234;tre vendues chaque ann&#233;e et que, seulement 30&#160;000 d&#8217;entre-elles arrivent au bout de la cession. Une fluidification du march&#233; permettrait en outre de sauvegarder 750&#160;000 emplois et pourrait en cr&#233;er de milliers d&#8217;autres.</p><p style=\"text-align: justify;\">C&#8217;est pourquoi, l&#8217;objet de l&#8217;amendement est d&#8217;&#233;tendre l&#8217;&#233;talement de l&#8217;imp&#244;t sur les plus-values en cas de cr&#233;dit-vendeur aux cessions de titres de soci&#233;t&#233;s qui r&#233;pondent &#224; la d&#233;finition de la PME au sens communautaire du terme (chiffre d&#8217;affaires n&#8217;exc&#233;dant pas 50 millions d&#8217;&#8364; avec un effectif salari&#233; ne d&#233;passant pas 250 personnes), seule d&#233;finition &#224; m&#234;me de r&#233;pondre aux activit&#233;s de ventes et de services.&#160;</p>",
    "annexeExposeSommaire": {
      "@xmlns:xsi": "http://www.w3.org/2001/XMLSchema-instance",
      "@xsi:nil": "true"
    },
    "cartoucheDelaiDepotDepasse": {
      "@xmlns:xsi": "http://www.w3.org/2001/XMLSchema-instance",
      "@xsi:nil": "true"
    }
  },
  "representations": {
    "representation": {
      "nom": "PDF",
      "typeMime": {
        "type": "application",
        "subType": "PDF"
      },
      "statutRepresentation": {
        "verbatim": "true",
        "canonique": "true",
        "officielle": "true",
        "transcription": "false",
        "enregistrement": "false"
      },
      "repSource": {
        "@xmlns:xsi": "http://www.w3.org/2001/XMLSchema-instance",
        "@xsi:nil": "true"
      },
      "offset": {
        "@xmlns:xsi": "http://www.w3.org/2001/XMLSchema-instance",
        "@xsi:nil": "true"
      },
      "contenu": {
        "documentURI": "/15/amendements/1255C/AN/1638.pdf"
      },
      "dateDispoRepresentation": {
        "@xmlns:xsi": "http://www.w3.org/2001/XMLSchema-instance",
        "@xsi:nil": "true"
      }
    }
  },
  "seanceDiscussion": "RUANR5L15S2019IDS21341",
  "sort": {
    "dateSaisie": "2018-11-15T10:11:43.000+01:00",
    "sortEnSeance": "Retiré"
  },
  "dateDepot": "2018-11-08T01:00:00.000+01:00",
  "dateDistribution": "2018-11-13T01:00:00.000+01:00",
  "article99": "0",
  "loiReference": {
    "codeLoi": {
      "@xmlns:xsi": "http://www.w3.org/2001/XMLSchema-instance",
      "@xsi:nil": "true"
    },
    "divisionCodeLoi": {
      "@xmlns:xsi": "http://www.w3.org/2001/XMLSchema-instance",
      "@xsi:nil": "true"
    }
  }
}