{
  "@xmlns": "http://schemas.assemblee-nationale.fr/referentiel",
  "uid": "AMANR5L15PO420120B0237P0D1N201",
  "identifiant": {
    "legislature": "15",
    "numero": "201",
    "numRect": "0",
    "saisine": {
      "refTexteLegislatif": "PRJLANR5L15B0237",
      "numeroPartiePLF": "0",
      "organeExamen": "PO420120",
      "mentionSecondeDeliberation": "0"
    }
  },
  "numeroLong": "AS201",
  "etapeTexte": "1ère lecture (1ère assemblée saisie)",
  "triAmendement": "gbeddi",
  "cardinaliteAmdtMultiples": "1",
  "amendementParent": {
    "@xmlns:xsi": "http://www.w3.org/2001/XMLSchema-instance",
    "@xsi:nil": "true"
  },
  "etat": "Discuté",
  "signataires": {
    "auteur": {
      "typeAuteur": "Depute",
      "acteurRef": "PA721062",
      "organeRef": {
        "@xmlns:xsi": "http://www.w3.org/2001/XMLSchema-instance",
        "@xsi:nil": "true"
      },
      "groupePolitiqueRef": "PO730958"
    },
    "cosignataires": {
      "acteurRef": [
        "PA719578",
        "PA718868",
        "PA588884",
        "PA720422",
        "PA720286",
        "PA720892",
        "PA721202",
        "PA721226",
        "PA721062",
        "PA722142",
        "PA720430",
        "PA721210",
        "PA721960",
        "PA718860",
        "PA720846",
        "PA719676",
        "PA2150"
      ]
    },
    "texteAffichable": "M.&#160;Ratenon,  Mme&#160;Autain, M.&#160;Bernalicis, M.&#160;Coquerel, M.&#160;Corbi&#232;re, Mme&#160;Fiat, M.&#160;Lachaud, M.&#160;Larive, M.&#160;M&#233;lenchon, Mme&#160;Obono, Mme&#160;Panot, M.&#160;Prud&apos;homme, M.&#160;Quatennens, Mme&#160;Ressiguier, Mme&#160;Rubin, M.&#160;Ruffin et Mme&#160;Taurine"
  },
  "pointeurFragmentTexte": {
    "missionVisee": {
      "@xmlns:xsi": "http://www.w3.org/2001/XMLSchema-instance",
      "@xsi:nil": "true"
    },
    "division": {
      "titre": "Article unique",
      "articleDesignationCourte": "APRÈS ART. UNIQUE",
      "type": "ARTICLE",
      "avant_A_Apres": "Après",
      "divisionRattachee": "APRÈS L'ARTICLE UNIQUE, insérer l'article suivant:",
      "articleAdditionnel": "1",
      "chapitreAdditionnel": {
        "@xmlns:xsi": "http://www.w3.org/2001/XMLSchema-instance",
        "@xsi:nil": "true"
      },
      "urlDivisionTexteVise": "/15/textes/0237.asp#D_Article_unique"
    },
    "alinea": {
      "@xmlns:xsi": "http://www.w3.org/2001/XMLSchema-instance",
      "@xsi:nil": "true"
    }
  },
  "corps": {
    "dispositif": "<p style=\"text-align: justify;\">Le chapitre III du titre III du livre II de la premi&#232;re partie du code du travail, dans sa r&#233;daction r&#233;sultant de l&#8217;ordonnance n&#176;&#160;2017&#8209;1387 du&#160;22&#160;septembre&#160;2017 relative &#224; la pr&#233;visibilit&#233; et la s&#233;curisation des relations de travail, est ainsi modifi&#233;&#160;:</p><p style=\"text-align: justify;\">1&#176;&#160;L&#8217;article L.&#160;1233&#8209;4 est ainsi modifi&#233;&#160;:</p><p style=\"text-align: justify;\"><i>a)</i>&#160;Au premier alin&#233;a, les mots&#160;: &#171;&#160;et dont l&#8217;organisation, les activit&#233;s ou le lieu d&#8217;exploitation assurent la permutation de tout ou partie du personnel&#160;&#187; sont supprim&#233;s&#160;;</p><p style=\"text-align: justify;\"><i>b)</i>&#160;Le deuxi&#232;me alin&#233;a est supprim&#233;&#160;;</p><p style=\"text-align: justify;\"><i>c)</i>&#160;L&#8217;avant-dernier alin&#233;a&#160;3 est supprim&#233;&#160;;</p><p style=\"text-align: justify;\">2&#176;&#160;Apr&#232;s l&#8217;article&#160;1233&#8209;4, il est ins&#233;r&#233; un article&#160;L.&#160;1233&#8209;4&#8209;1 ainsi r&#233;dig&#233;&#160;:</p><p style=\"text-align: justify;\">&#171;&#160;<i>Art.&#160;L.&#160;1233&#8209;4&#8209;1</i>.&#160;&#8211;&#160;Lorsque l&#8217;entreprise ou le groupe dont l&#8217;entreprise fait partie comporte des &#233;tablissements en dehors du territoire national, le salari&#233; dont le licenciement est envisag&#233; peut demander &#224; l&#8217;employeur de recevoir des offres de reclassement dans ces &#233;tablissements. Dans sa demande, il pr&#233;cise les restrictions &#233;ventuelles quant aux caract&#233;ristiques des emplois offerts, notamment en mati&#232;re de r&#233;mun&#233;ration et de localisation. L&#8217;employeur transmet les offres correspondantes au salari&#233; ayant manifest&#233; son int&#233;r&#234;t. Ces offres sont &#233;crites et pr&#233;cises.</p><p style=\"text-align: justify;\">&#171;&#160;Les modalit&#233;s d&#8217;application du pr&#233;sent article, en particulier celles relatives &#224; l&#8217;information du salari&#233; sur la possibilit&#233; dont il b&#233;n&#233;ficie de demander des offres de reclassement hors du territoire national, sont pr&#233;cis&#233;es par d&#233;cret.&#160;&#187;&#160;;</p><p style=\"text-align: justify;\">3&#176;&#160;&#192; la fin du 5&#176; de l&#8217;article L.&#160;1233&#8209;24&#8209;2, la r&#233;f&#233;rence&#160;:&#160;&#171;&#160;&#224; l&#8217;article L.&#160;1233&#8209;4&#160;&#187; est remplac&#233;e par les r&#233;f&#233;rences&#160;:&#160;&#171;&#160;aux articles L.&#160;1233&#8209;4 et L.&#160;1233&#8209;4&#8209;1&#160;&#187;&#160;;</p><p style=\"text-align: justify;\">4&#176;&#160;&#192; la fin du 5&#176; de l&#8217;article L.&#160;1233&#8209;24&#8209;3, la r&#233;f&#233;rence&#160;:&#160;&#171;&#160;&#224; l&#8217;article L.&#160;1233&#8209;4&#160;&#187; est remplac&#233;e par les r&#233;f&#233;rences&#160;:&#160;&#171;&#160;aux articles L.&#160;1233&#8209;4 et L.&#160;1233&#8209;4&#8209;1&#160;&#187;.</p>",
    "exposeSommaire": "<p style=\"text-align: justify;\">Cet article vise &#224; revenir sur les dispositions dangereuses introduites par l&#8217;ordonnance du 22 septembre, d&#233;finissant un p&#233;rim&#232;tre de reclassement obligatoire du salari&#233; au sein de l&#8217;entreprise ou&#160;des entreprises du groupe&#160;; ledit groupe dans sa d&#233;finition restreint de groupe capitalistique.</p><p style=\"text-align: justify;\">Or, la jurisprudence de la Cour de cassation prot&#233;geait bien davantage les salari&#233;s et s&#233;curisait leur relation de travail, vu que la d&#233;finition du groupe pouvait inclure les entreprises partenaires en cas de permutation possible, ce qui d&#233;cuplait les possibilit&#233;s de reclassement.</p><p style=\"text-align: justify;\">Les r&#233;dacteurs estiment que la disposition de l&#8217;ordonnance est contraire &#224; la s&#233;curisation de l&#8217;emploi vu qu&#8217;elle diminue les obligations de reclassement des salari&#233;s pour les employeurs.</p><p style=\"text-align: justify;\">Ainsi, la limitation du p&#233;rim&#232;tre de reclassement limite les possibilit&#233; d&#8217;un retour un emploi pour les salari&#233;s, ce qui est clairement contraire &#224; sa s&#233;curisation.</p><p style=\"text-align: justify;\">L&#8217;alin&#233;a comportant la liste des postes est supprim&#233;.</p><p style=\"text-align: justify;\">En effet, cette liste dispense l&#8217;employeur de faire une proposition pr&#233;cise et individuelle, et la publication de la liste suffirait &#224; satisfaire les obligations de reclassement. Or, les salari&#233;s n&#8217;ont pas &#224; savoir quels emplois sont en rapport avec leurs comp&#233;tences et qualifications.</p>",
    "annexeExposeSommaire": {
      "@xmlns:xsi": "http://www.w3.org/2001/XMLSchema-instance",
      "@xsi:nil": "true"
    }
  },
  "representations": {
    "representation": {
      "nom": "PDF",
      "typeMime": {
        "type": "application",
        "subType": "PDF"
      },
      "statutRepresentation": {
        "verbatim": "true",
        "canonique": "true",
        "officielle": "true",
        "transcription": "false",
        "enregistrement": "false"
      },
      "repSource": {
        "@xmlns:xsi": "http://www.w3.org/2001/XMLSchema-instance",
        "@xsi:nil": "true"
      },
      "offset": {
        "@xmlns:xsi": "http://www.w3.org/2001/XMLSchema-instance",
        "@xsi:nil": "true"
      },
      "contenu": {
        "documentURI": "/15/amendements/0237/CION-SOC/AS201.pdf"
      },
      "dateDispoRepresentation": {
        "@xmlns:xsi": "http://www.w3.org/2001/XMLSchema-instance",
        "@xsi:nil": "true"
      }
    }
  },
  "seanceDiscussion": {
    "@xmlns:xsi": "http://www.w3.org/2001/XMLSchema-instance",
    "@xsi:nil": "true"
  },
  "sort": {
    "dateSaisie": "2017-11-09T10:50:10.000+01:00",
    "sortEnSeance": "Rejeté"
  },
  "dateDepot": "2017-11-03T01:00:00.000+01:00",
  "dateDistribution": "2017-11-07T01:00:00.000+01:00",
  "article99": "0",
  "loiReference": {
    "codeLoi": "87.a6",
    "divisionCodeLoi": {
      "@xmlns:xsi": "http://www.w3.org/2001/XMLSchema-instance",
      "@xsi:nil": "true"
    }
  }
}