{
  "@xmlns": "http://schemas.assemblee-nationale.fr/referentiel",
  "uid": "AMANR5L15SEA717460B2296P0D1N721",
  "identifiant": {
    "legislature": "15",
    "numero": "721",
    "numRect": "0",
    "saisine": {
      "refTexteLegislatif": "PRJLANR5L15B2296",
      "numeroPartiePLF": "0",
      "organeExamen": "PO717460",
      "mentionSecondeDeliberation": "1"
    }
  },
  "numeroLong": "721",
  "etapeTexte": "1ère lecture (1ère assemblée saisie)",
  "triAmendement": "diaaaaaaaaaaaaaaaaaaaaaaaaaaaaaaaaaaaaaaaaaaaaaaaalu",
  "cardinaliteAmdtMultiples": "1",
  "amendementParent": {
    "@xmlns:xsi": "http://www.w3.org/2001/XMLSchema-instance",
    "@xsi:nil": "true"
  },
  "etat": "Discuté",
  "signataires": {
    "auteur": {
      "typeAuteur": "Rapporteur",
      "acteurRef": "PA642788",
      "organeRef": "PO420120",
      "groupePolitiqueRef": "PO730964"
    },
    "cosignataires": {
      "acteurRef": [
        "PA722102",
        "PA718910",
        "PA720512",
        "PA720362",
        "PA722022",
        "PA718810",
        "PA334768",
        "PA331835",
        "PA718694",
        "PA719186",
        "PA719512",
        "PA719652",
        "PA720932",
        "PA720738",
        "PA719756",
        "PA608083",
        "PA719980",
        "PA642788",
        "PA719072",
        "PA720916",
        "PA717379",
        "PA722126",
        "PA721246",
        "PA721336",
        "PA720066",
        "PA720046",
        "PA720074",
        "PA719858",
        "PA719350",
        "PA719570",
        "PA720170",
        "PA720952",
        "PA721466",
        "PA722268",
        "PA720480",
        "PA718728",
        "PA718744",
        "PA718706",
        "PA721710"
      ]
    },
    "texteAffichable": "M.&#160;V&#233;ran, rapporteur au nom de la commission des affaires sociales,  Mme&#160;Wonner, Mme&#160;Rist, M.&#160;Borowczyk, Mme&#160;Lecocq, Mme&#160;Cloarec-Le Nabour, Mme&#160;Bagarry, M.&#160;Belhaddad, Mme&#160;Bourguignon, Mme&#160;Brocard, M.&#160;Chiche, M.&#160;Da Silva, M.&#160;Marc&#160;Delatte, Mme&#160;Dufeu Schubert, Mme&#160;Fabre, Mme&#160;Fontaine-Domeizel, Mme&#160;Gaillot, Mme&#160;Grandjean, Mme&#160;Hammerer, Mme&#160;Iborra, Mme&#160;Janvier, Mme&#160;Khattabi, Mme&#160;Lazaar, Mme&#160;Limon, M.&#160;Maillard, M.&#160;Mesnier, M.&#160;Michels, Mme&#160;Peyron, M.&#160;Pietraszewski, Mme&#160;Pitollat, Mme&#160;Robert, Mme&#160;Romeiro Dias, M.&#160;Tach&#233;, Mme&#160;Tamarelle-Verhaeghe, M.&#160;Touraine, Mme&#160;Vanceunebrock-Mialon, Mme&#160;Vidal, Mme&#160;Vignon, M.&#160;Le Gendre et les membres du groupe La R&#233;publique en Marche"
  },
  "pointeurFragmentTexte": {
    "missionVisee": {
      "@xmlns:xsi": "http://www.w3.org/2001/XMLSchema-instance",
      "@xsi:nil": "true"
    },
    "division": {
      "titre": "Article 25",
      "articleDesignationCourte": "ART. 25",
      "type": "ARTICLE",
      "avant_A_Apres": "A",
      "divisionRattachee": "ARTICLE 25",
      "articleAdditionnel": {
        "@xmlns:xsi": "http://www.w3.org/2001/XMLSchema-instance",
        "@xsi:nil": "true"
      },
      "chapitreAdditionnel": {
        "@xmlns:xsi": "http://www.w3.org/2001/XMLSchema-instance",
        "@xsi:nil": "true"
      },
      "urlDivisionTexteVise": "/15/textes/2296.asp#D_Article_25"
    },
    "alinea": {
      "avant_A_Apres": {
        "@xmlns:xsi": "http://www.w3.org/2001/XMLSchema-instance",
        "@xsi:nil": "true"
      },
      "numero": "48",
      "alineaDesignation": {
        "@xmlns:xsi": "http://www.w3.org/2001/XMLSchema-instance",
        "@xsi:nil": "true"
      }
    }
  },
  "corps": {
    "dispositif": "<p style=\"text-align: justify;\">&#192; l&#8217;alin&#233;a&#160;48, apr&#232;s le mot&#160;:</p><p style=\"text-align: justify;\">&#171;&#160;soins&#160;&#187;,</p><p style=\"text-align: justify;\">ins&#233;rer les mots&#160;:</p><p style=\"text-align: justify;\">&#171;&#160;et de l&#8217;offre m&#233;dico-sociale&#160;&#187;.</p>",
    "exposeSommaire": "<p style=\"text-align: justify;\">Les soins en sant&#233; mentale de demain ne doivent plus &#234;tre hospitalo-centr&#233;s. Si l&#8217;h&#244;pital est un acteur de sant&#233; mentale comme les autres, il convient d&#8217;ouvrir la prise en charge des patients vers le m&#233;dico-social et le social qui peuvent encourager et faciliter la r&#233;habilitation psychosociale des individus, objectif ultime &#224; atteindre.</p><p style=\"text-align: justify;\">Pour cette raison, cet amendement vise &#224; ce que l&#8217;offre m&#233;dicosociale sur un territoire soit bien prise en compte. &#160;</p>",
    "annexeExposeSommaire": {
      "@xmlns:xsi": "http://www.w3.org/2001/XMLSchema-instance",
      "@xsi:nil": "true"
    },
    "cartoucheDelaiDepotDepasse": "Sous réserve de son traitement par les services de l'Assemblée nationale et de sa recevabilité",
    "avantAppel": {
      "@xmlns:xsi": "http://www.w3.org/2001/XMLSchema-instance",
      "@xsi:nil": "true"
    }
  },
  "representations": {
    "representation": {
      "nom": "PDF",
      "typeMime": {
        "type": "application",
        "subType": "PDF"
      },
      "statutRepresentation": {
        "verbatim": "true",
        "canonique": "true",
        "officielle": "true",
        "transcription": "false",
        "enregistrement": "false"
      },
      "repSource": {
        "@xmlns:xsi": "http://www.w3.org/2001/XMLSchema-instance",
        "@xsi:nil": "true"
      },
      "offset": {
        "@xmlns:xsi": "http://www.w3.org/2001/XMLSchema-instance",
        "@xsi:nil": "true"
      },
      "contenu": {
        "documentURI": "/15/amendements/2296/AN/721.pdf"
      },
      "dateDispoRepresentation": {
        "@xmlns:xsi": "http://www.w3.org/2001/XMLSchema-instance",
        "@xsi:nil": "true"
      }
    }
  },
  "seanceDiscussion": "RUANR5L15S2020IDS21878",
  "sort": {
    "dateSaisie": "2019-10-24T19:23:20.000+02:00",
    "sortEnSeance": "Adopté"
  },
  "dateDepot": "2019-10-17T02:00:00.000+02:00",
  "dateDistribution": "2019-10-24T02:00:00.000+02:00",
  "article99": "0",
  "loiReference": {
    "codeLoi": {
      "@xmlns:xsi": "http://www.w3.org/2001/XMLSchema-instance",
      "@xsi:nil": "true"
    },
    "divisionCodeLoi": {
      "@xmlns:xsi": "http://www.w3.org/2001/XMLSchema-instance",
      "@xsi:nil": "true"
    }
  }
}