{
  "@xmlns": "http://schemas.assemblee-nationale.fr/referentiel",
  "uid": "AMANR5L15SEA717460BTC0971P0D1N3103",
  "identifiant": {
    "legislature": "15",
    "numero": "3103",
    "numRect": "0",
    "saisine": {
      "refTexteLegislatif": "PRJLANR5L15BTC0971",
      "numeroPartiePLF": "0",
      "organeExamen": "PO717460",
      "mentionSecondeDeliberation": "0"
    }
  },
  "numeroLong": "3103",
  "etapeTexte": "1ère lecture (1ère assemblée saisie)",
  "triAmendement": "koasi",
  "cardinaliteAmdtMultiples": "1",
  "amendementParent": {
    "@xmlns:xsi": "http://www.w3.org/2001/XMLSchema-instance",
    "@xsi:nil": "true"
  },
  "etat": "Discuté",
  "signataires": {
    "auteur": {
      "typeAuteur": "Depute",
      "acteurRef": "PA719660",
      "organeRef": {
        "@xmlns:xsi": "http://www.w3.org/2001/XMLSchema-instance",
        "@xsi:nil": "true"
      },
      "groupePolitiqueRef": "PO730964"
    },
    "cosignataires": {
      "acteurRef": "PA719660"
    },
    "texteAffichable": "Mme&#160;Dubos"
  },
  "pointeurFragmentTexte": {
    "missionVisee": {
      "@xmlns:xsi": "http://www.w3.org/2001/XMLSchema-instance",
      "@xsi:nil": "true"
    },
    "division": {
      "titre": "Article 29",
      "articleDesignationCourte": "ART. 29",
      "type": "ARTICLE",
      "avant_A_Apres": "A",
      "divisionRattachee": "ARTICLE 29",
      "articleAdditionnel": {
        "@xmlns:xsi": "http://www.w3.org/2001/XMLSchema-instance",
        "@xsi:nil": "true"
      },
      "chapitreAdditionnel": {
        "@xmlns:xsi": "http://www.w3.org/2001/XMLSchema-instance",
        "@xsi:nil": "true"
      },
      "urlDivisionTexteVise": "/15/textes/0971.asp#D_Article_29"
    },
    "alinea": {
      "avant_A_Apres": "Apres",
      "numero": "19",
      "alineaDesignation": {
        "@xmlns:xsi": "http://www.w3.org/2001/XMLSchema-instance",
        "@xsi:nil": "true"
      }
    }
  },
  "corps": {
    "dispositif": "<p>Apr&#232;s l&#8217;alin&#233;a 19, ins&#233;rer l'alin&#233;a suivant&#160;:</p><p>&#171;&#160;La convention d&#8217;utilit&#233; sociale mentionn&#233;e &#224; l&#8217;article L.&#160;445-1 conclue entre l&#8217;&#201;tat et un organisme d&#8217;habitations &#224; loyer mod&#233;r&#233; vaut autorisation de vendre pour les logements mentionn&#233;s dans le plan de mise en vente de cette convention au b&#233;n&#233;fice de la soci&#233;t&#233; de vente d&#8217;habitations &#224; loyer mod&#233;r&#233; qui les a acquis aupr&#232;s de l&#8217;organisme ayant conclu la convention. L&#8217;autorisation de vendre au b&#233;n&#233;fice de la soci&#233;t&#233; de vente est valable pendant la dur&#233;e de la convention pr&#233;cit&#233;e.&#160;&#187;</p>",
    "exposeSommaire": "<p style=\"text-align: justify;\">Dans le cadre de la modernisation du r&#233;gime de vente de logements sociaux pr&#233;vue par le projet de loi, la convention d&#8217;utilit&#233; sociale de l&#8217;article L.&#160;445&#8209;1 du code de la construction et de l&#8217;habitation emportera autorisation de vendre les logements mentionn&#233;s dans le programme de vente de cette convention.</p><p style=\"text-align: justify;\">Les soci&#233;t&#233;s de vente d&#8217;habitations &#224; loyer mod&#233;r&#233; seront soumises aux autorisations de vendre, comme tous les organismes HLM.</p><p style=\"text-align: justify;\">Afin d&#8217;&#233;viter deux autorisations successives, cet amendement pr&#233;voit que les logements dont la vente aura d&#233;j&#224; &#233;t&#233; autoris&#233;e dans la CUS d&#8217;un organisme HLM, puissent &#234;tre &#233;galement vendus par les soci&#233;t&#233;s de vente pendant la dur&#233;e de cette m&#234;me convention.</p>",
    "annexeExposeSommaire": {
      "@xmlns:xsi": "http://www.w3.org/2001/XMLSchema-instance",
      "@xsi:nil": "true"
    }
  },
  "representations": {
    "representation": {
      "nom": "PDF",
      "typeMime": {
        "type": "application",
        "subType": "PDF"
      },
      "statutRepresentation": {
        "verbatim": "true",
        "canonique": "true",
        "officielle": "true",
        "transcription": "false",
        "enregistrement": "false"
      },
      "repSource": {
        "@xmlns:xsi": "http://www.w3.org/2001/XMLSchema-instance",
        "@xsi:nil": "true"
      },
      "offset": {
        "@xmlns:xsi": "http://www.w3.org/2001/XMLSchema-instance",
        "@xsi:nil": "true"
      },
      "contenu": {
        "documentURI": "/15/amendements/0971/AN/3103.pdf"
      },
      "dateDispoRepresentation": {
        "@xmlns:xsi": "http://www.w3.org/2001/XMLSchema-instance",
        "@xsi:nil": "true"
      }
    }
  },
  "seanceDiscussion": "RUANR5L15S2018IDS21126",
  "sort": {
    "dateSaisie": "2018-06-03T11:40:00.000+02:00",
    "sortEnSeance": "Adopté"
  },
  "dateDepot": "2018-05-26T02:00:00.000+02:00",
  "dateDistribution": "2018-05-30T02:00:00.000+02:00",
  "article99": "0",
  "loiReference": {
    "codeLoi": {
      "@xmlns:xsi": "http://www.w3.org/2001/XMLSchema-instance",
      "@xsi:nil": "true"
    },
    "divisionCodeLoi": {
      "@xmlns:xsi": "http://www.w3.org/2001/XMLSchema-instance",
      "@xsi:nil": "true"
    }
  }
}