{
  "@xmlns": "http://schemas.assemblee-nationale.fr/referentiel",
  "uid": "AMANR5L15PO419865B1908P0D1N136",
  "identifiant": {
    "legislature": "15",
    "numero": "136",
    "numRect": "0",
    "saisine": {
      "refTexteLegislatif": "PRJLANR5L15B1908",
      "numeroPartiePLF": "0",
      "organeExamen": "PO419865",
      "mentionSecondeDeliberation": "0"
    }
  },
  "numeroLong": "CD136",
  "etapeTexte": "1ère lecture (1ère assemblée saisie)",
  "triAmendement": "asaaaaaaaaaaaaaaaaaaaaaaaaaaaaaaaaaaaaaaaaaaaaaaaal",
  "cardinaliteAmdtMultiples": "1",
  "amendementParent": {
    "@xmlns:xsi": "http://www.w3.org/2001/XMLSchema-instance",
    "@xsi:nil": "true"
  },
  "etat": "Discuté",
  "signataires": {
    "auteur": {
      "typeAuteur": "Depute",
      "acteurRef": "PA719882",
      "organeRef": {
        "@xmlns:xsi": "http://www.w3.org/2001/XMLSchema-instance",
        "@xsi:nil": "true"
      },
      "groupePolitiqueRef": "PO730964"
    },
    "cosignataires": {
      "acteurRef": [
        "PA722000",
        "PA721860",
        "PA720310",
        "PA719664",
        "PA719740",
        "PA718710",
        "PA718894",
        "PA720944",
        "PA720038",
        "PA718802",
        "PA719632",
        "PA719624",
        "PA718962",
        "PA721600",
        "PA609520",
        "PA720414",
        "PA719194",
        "PA722366",
        "PA605084",
        "PA719412",
        "PA721876",
        "PA719080",
        "PA721514",
        "PA720538",
        "PA719718",
        "PA720806",
        "PA722228",
        "PA719882",
        "PA720054",
        "PA720242",
        "PA721372",
        "PA719890",
        "PA719092",
        "PA719922",
        "PA722336",
        "PA722236",
        "PA718736",
        "PA721426"
      ]
    },
    "texteAffichable": "Mme&#160;Meynier-Millefert,  Mme&#160;Peyrol, M.&#160;Colas-Roy, Mme&#160;Abba, M.&#160;Arend, Mme&#160;Pascale&#160;Boyer, Mme&#160;Brulebois, M.&#160;Buchou, M.&#160;Causse, M.&#160;Cesarini, Mme&#160;Couillard, Mme&#160;Yolaine&#160;de Courson, Mme&#160;De Temmerman, M.&#160;Djebbari, M.&#160;Dombreval, M.&#160;Fugit, Mme&#160;Gayte, M.&#160;Haury, Mme&#160;Josso, Mme&#160;Kerbarh, M.&#160;Krabal, M.&#160;Lavergne, Mme&#160;Le Feur, M.&#160;Leclabart, Mme&#160;Maillart-M&#233;haignerie, Mme&#160;Marsaud, M.&#160;Morenas, Mme&#160;Panonacle, Mme&#160;Park, M.&#160;Perea, M.&#160;Perrot, M.&#160;Pichereau, Mme&#160;Pompili, Mme&#160;Riotton, Mme&#160;Rossi, M.&#160;Thi&#233;baut, Mme&#160;Tuffnell, M.&#160;Zulesi et les membres du groupe La R&#233;publique en Marche"
  },
  "pointeurFragmentTexte": {
    "missionVisee": {
      "@xmlns:xsi": "http://www.w3.org/2001/XMLSchema-instance",
      "@xsi:nil": "true"
    },
    "division": {
      "titre": "Article PREMIER",
      "articleDesignationCourte": "APRÈS ART. PREMIER",
      "type": "ARTICLE",
      "avant_A_Apres": "Après",
      "divisionRattachee": "APRÈS L'ARTICLE PREMIER, insérer l'article suivant:",
      "articleAdditionnel": "1",
      "chapitreAdditionnel": {
        "@xmlns:xsi": "http://www.w3.org/2001/XMLSchema-instance",
        "@xsi:nil": "true"
      },
      "urlDivisionTexteVise": "/15/textes/1908.asp#D_Article_1er"
    },
    "alinea": {
      "@xmlns:xsi": "http://www.w3.org/2001/XMLSchema-instance",
      "@xsi:nil": "true"
    }
  },
  "corps": {
    "dispositif": "<p style=\"text-align: justify;\">Le Gouvernement soumet au Parlement un rapport, au plus tard le 1<sup>er</sup> octobre de chaque ann&#233;e, &#224; compter de 2019, sur la compatibilit&#233; du projet de loi de finances avec l&#8217;objectif international de limitation du r&#233;chauffement climatique. Cette &#233;valuation s'&#233;tablit notamment au regard des objectifs d&#233;finis dans les strat&#233;gies nationales relatives au d&#233;veloppement durable, &#224; la biodiversit&#233; et au d&#233;veloppement de la responsabilit&#233; soci&#233;tale et environnementale des entreprises et la strat&#233;gie bas-carbone. Le rapport identifie et quantifie les ressources et les charges budg&#233;taires concourant &#224; impacter positivement ou n&#233;gativement ces objectifs sur la base d&#8217;indicateurs. Il contribue ainsi &#224; une meilleure lisibilit&#233; et une transparence sur l&#8217;incidence environnementale des finances publiques.&#160;</p><p style=\"text-align: justify;\">Au titre du projet de loi de finances pour 2020 le rapport se concentre essentiellement sur les impacts climatiques en privil&#233;giant, si n&#233;cessaire, l&#8217;&#233;valuation de l&#8217;un des secteurs les plus &#233;metteurs de gaz &#224; effet de serre.&#160;</p><p style=\"text-align: justify;\">Le Haut conseil pour le climat, mentionn&#233; &#224; l&#8217;article L.&#160;132-4 du code de l&#8217;environnement, rend un avis sur le rapport cit&#233; au premier alin&#233;a qui est transmis par voie &#233;lectronique au Parlement.</p>",
    "exposeSommaire": "<p style=\"text-align: justify;\">Cet amendement vise &#224; instaurer&#160;en droit fran&#231;ais une d&#233;marche de budget vert, conform&#233;ment aux annoonces qui ont fait suite au conseil de d&#233;fense &#233;cologique. Cette d&#233;marche repose sur un rapport remis par le Gouvernement au Parlement, qui dresse une &#233;valuation du budget au regard des objectifs de la France en mati&#232;re d'environnement et de biodiversit&#233;. Ce rapport permet ainsi au Parlement de disposer d'une vision globale et pr&#233;cise des cons&#233;quences de l'action publique sur les strat&#233;gies de long terme d&#233;finies au niveau national et international.</p><p style=\"text-align: justify;\">L'amendement accorde aussi une place importante au Haut Conseil pour le Climat, en tant qu'il &#233;met un avis sur le rapport remis. Cela rejoint les missions du Haut Conseil institu&#233; par l'article 2,&#160;dans la continuit&#233; de son r&#244;le d'&#233;valuation r&#233;guli&#232;re et concr&#232;te de la politique &#233;nerg&#233;tique et environnementale.</p>",
    "annexeExposeSommaire": {
      "@xmlns:xsi": "http://www.w3.org/2001/XMLSchema-instance",
      "@xsi:nil": "true"
    },
    "cartoucheDelaiDepotDepasse": {
      "@xmlns:xsi": "http://www.w3.org/2001/XMLSchema-instance",
      "@xsi:nil": "true"
    }
  },
  "representations": {
    "representation": {
      "nom": "PDF",
      "typeMime": {
        "type": "application",
        "subType": "PDF"
      },
      "statutRepresentation": {
        "verbatim": "true",
        "canonique": "true",
        "officielle": "true",
        "transcription": "false",
        "enregistrement": "false"
      },
      "repSource": {
        "@xmlns:xsi": "http://www.w3.org/2001/XMLSchema-instance",
        "@xsi:nil": "true"
      },
      "offset": {
        "@xmlns:xsi": "http://www.w3.org/2001/XMLSchema-instance",
        "@xsi:nil": "true"
      },
      "contenu": {
        "documentURI": "/15/amendements/1908/CION-DVP/CD136.pdf"
      },
      "dateDispoRepresentation": {
        "@xmlns:xsi": "http://www.w3.org/2001/XMLSchema-instance",
        "@xsi:nil": "true"
      }
    }
  },
  "seanceDiscussion": {
    "@xmlns:xsi": "http://www.w3.org/2001/XMLSchema-instance",
    "@xsi:nil": "true"
  },
  "sort": {
    "dateSaisie": "2019-06-05T13:15:02.000+02:00",
    "sortEnSeance": "Adopté"
  },
  "dateDepot": "2019-06-01T02:00:00.000+02:00",
  "dateDistribution": "2019-06-04T02:00:00.000+02:00",
  "article99": "0",
  "loiReference": {
    "codeLoi": "xxrapport",
    "divisionCodeLoi": {
      "@xmlns:xsi": "http://www.w3.org/2001/XMLSchema-instance",
      "@xsi:nil": "true"
    }
  }
}