{
  "@xmlns": "http://schemas.assemblee-nationale.fr/referentiel",
  "uid": "AMANR5L15SEA717460BTC0105P0D1N128",
  "identifiant": {
    "legislature": "15",
    "numero": "128",
    "numRect": "0",
    "saisine": {
      "refTexteLegislatif": "PRJLANR5L15BTC0105",
      "numeroPartiePLF": "0",
      "organeExamen": "PO717460",
      "mentionSecondeDeliberation": "0"
    }
  },
  "numeroLong": "128",
  "etapeTexte": "1ère lecture (2ème assemblée saisie)",
  "triAmendement": "cmdo",
  "cardinaliteAmdtMultiples": "1",
  "amendementParent": {
    "@xmlns:xsi": "http://www.w3.org/2001/XMLSchema-instance",
    "@xsi:nil": "true"
  },
  "etat": "Discuté",
  "signataires": {
    "auteur": {
      "typeAuteur": "Depute",
      "acteurRef": "PA331567",
      "organeRef": {
        "@xmlns:xsi": "http://www.w3.org/2001/XMLSchema-instance",
        "@xsi:nil": "true"
      },
      "groupePolitiqueRef": "PO730952"
    },
    "cosignataires": {
      "acteurRef": [
        "PA266788",
        "PA267355",
        "PA267585",
        "PA267780",
        "PA331567",
        "PA421348",
        "PA722030",
        "PA719806",
        "PA267042"
      ]
    },
    "texteAffichable": "Mme&#160;de La Raudi&#232;re,  M.&#160;Vercamer, Mme&#160;Firmin Le Bodo, M.&#160;Favennec Becot, M.&#160;Herth, Mme&#160;Auconie, M.&#160;Morel-&#192;-L&apos;Huissier, M.&#160;Bournazel et M.&#160;Villiers"
  },
  "pointeurFragmentTexte": {
    "missionVisee": {
      "@xmlns:xsi": "http://www.w3.org/2001/XMLSchema-instance",
      "@xsi:nil": "true"
    },
    "division": {
      "titre": "Article 3",
      "articleDesignationCourte": "APRÈS ART. 3",
      "type": "ARTICLE",
      "avant_A_Apres": "Après",
      "divisionRattachee": "APRÈS L'ARTICLE 3, insérer l'article suivant:",
      "articleAdditionnel": "1",
      "chapitreAdditionnel": {
        "@xmlns:xsi": "http://www.w3.org/2001/XMLSchema-instance",
        "@xsi:nil": "true"
      },
      "urlDivisionTexteVise": "/15/textes/0105.asp#D_Article_3"
    },
    "alinea": {
      "@xmlns:xsi": "http://www.w3.org/2001/XMLSchema-instance",
      "@xsi:nil": "true"
    }
  },
  "corps": {
    "dispositif": "<p style=\"text-align: justify;\">Apr&#232;s l&#8217;article LO 142 du code &#233;lectoral, est ins&#233;r&#233; un article LO 142&#8209;1 ainsi r&#233;dig&#233;&#160;:</p><p style=\"text-align: justify;\">&#171;&#160;<i>Art.&#160;LO 142&#8209;1.</i>&#160;&#8211;&#160;Le mandat de parlementaire est incompatible avec le statut de fonctionnaire de cat&#233;gorie A.</p><p style=\"text-align: justify;\">&#171;&#160;Dans un d&#233;lai de trente jours suivant l&#8217;&#233;lection, le nouvel &#233;lu doit d&#233;missionner de la fonction publique. Faute d&#8217;avoir proc&#233;d&#233; &#224; cette formalit&#233; suivi de l&#8217;effectivit&#233; de la demande de d&#233;mission dans le d&#233;lai imparti, le mandat sera perdu de plein droit.&#160;&#187;</p>",
    "exposeSommaire": "<p style=\"text-align: justify;\">Le pr&#233;sent amendement vise &#224; contraindre les fonctionnaires de cat&#233;gorie A, &#224; d&#233;missionner de la haute fonction publique lorsqu&#8217;ils deviennent parlementaires.</p><p style=\"text-align: justify;\">On pourrait &#233;largir cette obligation aux autres cat&#233;gories de fonctionnaires, mais ils ne disposent pas du m&#234;me pouvoir de d&#233;cision que les fonctionnaires de cat&#233;gorie A.</p><p style=\"text-align: justify;\">Cet amendement permettra d&#8217;&#233;viter les risques de confusion ou de conflits d&#8217;int&#233;r&#234;ts qui pourraient r&#233;sulter.</p><p style=\"text-align: justify;\">Par ailleurs, le Pr&#233;sident de la R&#233;publique, avait lui m&#234;me d&#233;missionn&#233; de la haute fonction publique peu apr&#232;s son entr&#233;e en campagne, et invoqu&#233; le fait que &#171;&#160;la protection allou&#233;e &#224; la haute fonction publique ne se justifie plus&#160;&#187;</p>",
    "annexeExposeSommaire": {
      "@xmlns:xsi": "http://www.w3.org/2001/XMLSchema-instance",
      "@xsi:nil": "true"
    }
  },
  "representations": {
    "representation": {
      "nom": "PDF",
      "typeMime": {
        "type": "application",
        "subType": "PDF"
      },
      "statutRepresentation": {
        "verbatim": "true",
        "canonique": "true",
        "officielle": "true",
        "transcription": "false",
        "enregistrement": "false"
      },
      "repSource": {
        "@xmlns:xsi": "http://www.w3.org/2001/XMLSchema-instance",
        "@xsi:nil": "true"
      },
      "offset": {
        "@xmlns:xsi": "http://www.w3.org/2001/XMLSchema-instance",
        "@xsi:nil": "true"
      },
      "contenu": {
        "documentURI": "/15/amendements/0105/AN/128.pdf"
      },
      "dateDispoRepresentation": {
        "@xmlns:xsi": "http://www.w3.org/2001/XMLSchema-instance",
        "@xsi:nil": "true"
      }
    }
  },
  "seanceDiscussion": "RUANR5L15S2017IDS20663",
  "sort": {
    "dateSaisie": "2017-07-28T23:40:36.000+02:00",
    "sortEnSeance": "Rejeté"
  },
  "dateDepot": "2017-07-21T02:00:00.000+02:00",
  "dateDistribution": "2017-07-26T02:00:00.000+02:00",
  "article99": "0",
  "loiReference": {
    "codeLoi": "code electoral",
    "divisionCodeLoi": "LO 142"
  }
}