{
  "@xmlns": "http://schemas.assemblee-nationale.fr/referentiel",
  "uid": "AMANR5L15SEA717460B2272P2D1N1846",
  "identifiant": {
    "legislature": "15",
    "numero": "1846",
    "numRect": "0",
    "saisine": {
      "refTexteLegislatif": "PRJLANR5L15B2272",
      "numeroPartiePLF": "2",
      "organeExamen": "PO717460",
      "mentionSecondeDeliberation": "0"
    }
  },
  "numeroLong": "II-1846",
  "etapeTexte": "1ère lecture (1ère assemblée saisie)",
  "triAmendement": "ecaaaaaiaaaaaaaaaaaaaaaaaaaaaaaaaaaaaaaaaaaaaaaaaazzzzzzzzzzzzzzzzzzzzy",
  "cardinaliteAmdtMultiples": "1",
  "amendementParent": {
    "@xmlns:xsi": "http://www.w3.org/2001/XMLSchema-instance",
    "@xsi:nil": "true"
  },
  "etat": "Discuté",
  "signataires": {
    "auteur": {
      "typeAuteur": "Depute",
      "acteurRef": "PA405480",
      "organeRef": {
        "@xmlns:xsi": "http://www.w3.org/2001/XMLSchema-instance",
        "@xsi:nil": "true"
      },
      "groupePolitiqueRef": "PO759900"
    },
    "cosignataires": {
      "acteurRef": [
        "PA336175",
        "PA605694",
        "PA608292",
        "PA721194",
        "PA336439",
        "PA333421",
        "PA405480",
        "PA267042",
        "PA719138",
        "PA719146",
        "PA331582",
        "PA720996"
      ]
    },
    "texteAffichable": "M.&#160;Pupponi,  M.&#160;Acquaviva, M.&#160;Castellani, M.&#160;Cl&#233;ment, Mme&#160;Dubi&#233;, Mme&#160;Fr&#233;d&#233;rique&#160;Dumas, M.&#160;El Guerrab, M.&#160;Falorni, M.&#160;Favennec Becot, M.&#160;Pancher, Mme&#160;Pinel et M.&#160;Philippe&#160;Vigier"
  },
  "pointeurFragmentTexte": {
    "missionVisee": {
      "@xmlns:xsi": "http://www.w3.org/2001/XMLSchema-instance",
      "@xsi:nil": "true"
    },
    "division": {
      "titre": "Article 58",
      "articleDesignationCourte": "APRÈS ART. 58",
      "type": "ARTICLE",
      "avant_A_Apres": "Après",
      "divisionRattachee": "APRÈS L'ARTICLE 58, insérer l'article suivant:",
      "articleAdditionnel": "1",
      "chapitreAdditionnel": {
        "@xmlns:xsi": "http://www.w3.org/2001/XMLSchema-instance",
        "@xsi:nil": "true"
      },
      "urlDivisionTexteVise": "/15/textes/2272C.asp#D_Article_58"
    },
    "alinea": {
      "@xmlns:xsi": "http://www.w3.org/2001/XMLSchema-instance",
      "@xsi:nil": "true"
    }
  },
  "corps": {
    "dispositif": "<p>I.&#160;&#8211;&#160;L&#8217;article&#160;199 <i>novovicies</i> du code g&#233;n&#233;ral des imp&#244;ts est compl&#233;t&#233; par un XIII ainsi r&#233;dig&#233;&#160;:</p><p style=\"text-align: justify;\">&#171;&#160;XIII.&#160;&#8211;&#160;Par d&#233;rogation, dans les quartiers faisant l&#8217;objet d&#8217;une convention pr&#233;vue &#224; l&#8217;article&#160;10&#8209;3 de la loi n&#176;&#160;2003&#8209;710 du 1<sup>er</sup> ao&#251;t 2003 d&#8217;orientation et de programmation pour la ville et la r&#233;novation urbaine, les dispositions mentionn&#233;es au I sont applicables jusqu&#8217;au 31 d&#233;cembre 2024 ou &#224; la date d&#8217;expiration de ladite convention.&#160;&#187;</p><p style=\"text-align: justify;\">II.&#160;&#8211;&#160;Le I entre en vigueur au 1<sup>er</sup> janvier 2021.</p><p style=\"text-align: justify;\">III.&#160;&#8211;&#160;La perte de recettes pour l&#8217;&#201;tat est compens&#233;e &#224; due concurrence par la cr&#233;ation d&#8217;une taxe additionnelle aux droits mentionn&#233;s aux articles 575 et 575 A du code g&#233;n&#233;ral des imp&#244;ts.</p>",
    "exposeSommaire": "<p>Le pr&#233;sent amendement a pour objectif d&#8217;assurer l&#8217;&#233;ligibilit&#233; au dispositif &#171;&#160;Pinel&#160;&#187; des quartiers faisant l&#8217;objet d&#8217;une convention du Nouveau programme nationale de renouvellement urbain (NPNRU) sur la dur&#233;e des projets pr&#233;vus dans ce programme. En effet, alors que ces projets visent &#224; am&#233;liorer grandement le cadre de vie des habitants de ces quartiers avec des projets de r&#233;novation urbain et de diversification de l&#8217;habitat, par la construction en particulier d&#8217;habitat priv&#233;, cette mesure s&#8217;inscrit parfaitement dans cette logique et dans la volont&#233; d&#8217;un choc d&#8217;offre port&#233;e par le Gouvernement.</p>",
    "annexeExposeSommaire": {
      "@xmlns:xsi": "http://www.w3.org/2001/XMLSchema-instance",
      "@xsi:nil": "true"
    },
    "cartoucheDelaiDepotDepasse": {
      "@xmlns:xsi": "http://www.w3.org/2001/XMLSchema-instance",
      "@xsi:nil": "true"
    },
    "avantAppel": {
      "@xmlns:xsi": "http://www.w3.org/2001/XMLSchema-instance",
      "@xsi:nil": "true"
    }
  },
  "representations": {
    "representation": {
      "nom": "PDF",
      "typeMime": {
        "type": "application",
        "subType": "PDF"
      },
      "statutRepresentation": {
        "verbatim": "true",
        "canonique": "true",
        "officielle": "true",
        "transcription": "false",
        "enregistrement": "false"
      },
      "repSource": {
        "@xmlns:xsi": "http://www.w3.org/2001/XMLSchema-instance",
        "@xsi:nil": "true"
      },
      "offset": {
        "@xmlns:xsi": "http://www.w3.org/2001/XMLSchema-instance",
        "@xsi:nil": "true"
      },
      "contenu": {
        "documentURI": "/15/amendements/2272C/AN/1846.pdf"
      },
      "dateDispoRepresentation": {
        "@xmlns:xsi": "http://www.w3.org/2001/XMLSchema-instance",
        "@xsi:nil": "true"
      }
    }
  },
  "seanceDiscussion": "RUANR5L15S2020IDS21921",
  "sort": {
    "dateSaisie": "2019-11-14T09:54:21.000+01:00",
    "sortEnSeance": "Rejeté"
  },
  "dateDepot": "2019-11-05T01:00:00.000+01:00",
  "dateDistribution": "2019-11-13T01:00:00.000+01:00",
  "article99": "0",
  "loiReference": {
    "codeLoi": "CGI",
    "divisionCodeLoi": "199 novovicies"
  }
}