{
  "@xmlns": "http://schemas.assemblee-nationale.fr/referentiel",
  "uid": "AMANR5L15SEA717460BTC1955P0D1N510",
  "identifiant": {
    "legislature": "15",
    "numero": "510",
    "numRect": "1",
    "saisine": {
      "refTexteLegislatif": "PNREANR5L15BTC1955",
      "numeroPartiePLF": "0",
      "organeExamen": "PO717460",
      "mentionSecondeDeliberation": "0"
    }
  },
  "numeroLong": "510 (Rect)",
  "etapeTexte": "Lecture unique",
  "triAmendement": "apaaaaaaaaaaaaaaaaaaaaaaaaaaaaaaaaaaaaaaaaaaaaaaaaai",
  "cardinaliteAmdtMultiples": "1",
  "amendementParent": {
    "@xmlns:xsi": "http://www.w3.org/2001/XMLSchema-instance",
    "@xsi:nil": "true"
  },
  "etat": "Discuté",
  "signataires": {
    "auteur": {
      "typeAuteur": "Depute",
      "acteurRef": "PA720996",
      "organeRef": {
        "@xmlns:xsi": "http://www.w3.org/2001/XMLSchema-instance",
        "@xsi:nil": "true"
      },
      "groupePolitiqueRef": "PO759900"
    },
    "cosignataires": {
      "acteurRef": [
        "PA605518",
        "PA720996",
        "PA333421"
      ]
    },
    "texteAffichable": "M.&#160;El Guerrab,  M.&#160;Fran&#231;ois-Michel&#160;Lambert et M.&#160;Pancher"
  },
  "pointeurFragmentTexte": {
    "missionVisee": {
      "@xmlns:xsi": "http://www.w3.org/2001/XMLSchema-instance",
      "@xsi:nil": "true"
    },
    "division": {
      "titre": "Article 5",
      "articleDesignationCourte": "APRÈS ART. 5",
      "type": "ARTICLE",
      "avant_A_Apres": "Après",
      "divisionRattachee": "APRÈS L'ARTICLE 5, insérer l'article suivant:",
      "articleAdditionnel": "1",
      "chapitreAdditionnel": {
        "@xmlns:xsi": "http://www.w3.org/2001/XMLSchema-instance",
        "@xsi:nil": "true"
      },
      "urlDivisionTexteVise": "/15/textes/1955.asp#D_Article_5"
    },
    "alinea": {
      "@xmlns:xsi": "http://www.w3.org/2001/XMLSchema-instance",
      "@xsi:nil": "true"
    }
  },
  "corps": {
    "dispositif": "<p>Apr&#232;s la deuxi&#232;me phrase du deuxi&#232;me alin&#233;a de l&#8217;article&#160;39 du R&#232;glement, il est ins&#233;r&#233; une phrase ainsi r&#233;dig&#233;e&#160;: &#171;&#160;La r&#233;partition des pr&#233;sidences des commissions s&#8217;efforce de reproduire la configuration politique de l&#8217;Assembl&#233;e et d&#8217;assurer la repr&#233;sentation de toutes ses composantes.&#160;&#187;&#160;&#187;</p>",
    "exposeSommaire": "<p style=\"text-align: justify;\">La r&#233;partition des pr&#233;sidences des commissions &#224; la proportionnelle des groupes se fait de tr&#232;s longue date au sein de la Di&#232;te f&#233;d&#233;rale d&#8217;Allemagne. Il s&#8217;agit l&#224; d&#8217;une forme de &#171;&#160;courtoisie qui ne co&#251;te pas cher&#160;&#187; (Joseph Barth&#233;lemy, Essai sur le travail parlementaire et le syst&#232;me de commissions, Delagrave, 1934, p. 124), mais dont le m&#233;rite serait d&#8217;accorder quelque visibilit&#233; au pluralisme interne du Parlement. De la sorte, l&#8217;Assembl&#233;e nationale poursuivrait le mouvement engag&#233; en 2007 avec l&#8217;attribution de la pr&#233;sidence de la Commission des finances &#224; l&#8217;opposition parlementaire. Il importe de pr&#233;ciser qu&#8217;&#224; moyen terme une telle innovation serait facilit&#233;e par une (l&#233;g&#232;re) augmentation du nombre de commissions, (tr&#232;s) strictement contingent&#233; depuis 1958.</p>",
    "annexeExposeSommaire": {
      "@xmlns:xsi": "http://www.w3.org/2001/XMLSchema-instance",
      "@xsi:nil": "true"
    },
    "cartoucheDelaiDepotDepasse": {
      "@xmlns:xsi": "http://www.w3.org/2001/XMLSchema-instance",
      "@xsi:nil": "true"
    }
  },
  "representations": {
    "representation": {
      "nom": "PDF",
      "typeMime": {
        "type": "application",
        "subType": "PDF"
      },
      "statutRepresentation": {
        "verbatim": "true",
        "canonique": "true",
        "officielle": "true",
        "transcription": "false",
        "enregistrement": "false"
      },
      "repSource": {
        "@xmlns:xsi": "http://www.w3.org/2001/XMLSchema-instance",
        "@xsi:nil": "true"
      },
      "offset": {
        "@xmlns:xsi": "http://www.w3.org/2001/XMLSchema-instance",
        "@xsi:nil": "true"
      },
      "contenu": {
        "documentURI": "/15/amendements/1955/AN/510.pdf"
      },
      "dateDispoRepresentation": {
        "@xmlns:xsi": "http://www.w3.org/2001/XMLSchema-instance",
        "@xsi:nil": "true"
      }
    }
  },
  "seanceDiscussion": "RUANR5L15S2019IDS21667",
  "sort": {
    "dateSaisie": "2019-05-28T00:43:32.000+02:00",
    "sortEnSeance": "Rejeté"
  },
  "dateDepot": "2019-05-23T02:00:00.000+02:00",
  "dateDistribution": "2019-05-27T02:00:00.000+02:00",
  "article99": "0",
  "loiReference": {
    "codeLoi": {
      "@xmlns:xsi": "http://www.w3.org/2001/XMLSchema-instance",
      "@xsi:nil": "true"
    },
    "divisionCodeLoi": "39"
  }
}