{
  "@xmlns": "http://schemas.assemblee-nationale.fr/referentiel",
  "uid": "AMANR5L15SEA717460B1255P1D1N1597",
  "identifiant": {
    "legislature": "15",
    "numero": "1597",
    "numRect": "0",
    "saisine": {
      "refTexteLegislatif": "PRJLANR5L15B1255",
      "numeroPartiePLF": "1",
      "organeExamen": "PO717460",
      "mentionSecondeDeliberation": "0"
    }
  },
  "numeroLong": "I-1597",
  "etapeTexte": "1ère lecture (1ère assemblée saisie)",
  "triAmendement": "bboaaaaaaaaaaaaaaaaaaaaaaaaaaaaaaaaaaaaaaaaaaaaaaaw",
  "cardinaliteAmdtMultiples": "1",
  "amendementParent": {
    "@xmlns:xsi": "http://www.w3.org/2001/XMLSchema-instance",
    "@xsi:nil": "true"
  },
  "etat": "Irrecevable",
  "signataires": {
    "auteur": {
      "typeAuteur": "Depute",
      "acteurRef": "PA643145",
      "organeRef": {
        "@xmlns:xsi": "http://www.w3.org/2001/XMLSchema-instance",
        "@xsi:nil": "true"
      },
      "groupePolitiqueRef": "PO758835"
    },
    "cosignataires": {
      "acteurRef": [
        "PA643145",
        "PA337483",
        "PA610681"
      ]
    },
    "texteAffichable": "Mme&#160;Vainqueur-Christophe,  M.&#160;Letchimy et Mme&#160;Bareigts"
  },
  "pointeurFragmentTexte": {
    "missionVisee": {
      "@xmlns:xsi": "http://www.w3.org/2001/XMLSchema-instance",
      "@xsi:nil": "true"
    },
    "division": {
      "titre": "Article 5",
      "articleDesignationCourte": "APRÈS ART. 5",
      "type": "ARTICLE",
      "avant_A_Apres": "Après",
      "divisionRattachee": "APRÈS L'ARTICLE 5, insérer l'article suivant:",
      "articleAdditionnel": "1",
      "chapitreAdditionnel": {
        "@xmlns:xsi": "http://www.w3.org/2001/XMLSchema-instance",
        "@xsi:nil": "true"
      },
      "urlDivisionTexteVise": "/15/textes/1255A.asp#D_Article_5"
    },
    "alinea": {
      "@xmlns:xsi": "http://www.w3.org/2001/XMLSchema-instance",
      "@xsi:nil": "true"
    }
  },
  "corps": {
    "dispositif": "<p style=\"text-align: justify;\">I.&#160;&#8211;&#160;Afin de contribuer au respect des engagements pris par l&#8217;&#201;tat en mati&#232;re de planification pluriannuelle des investissements outre-mer pr&#233;vue au chapitre 1<sup>er</sup> du titre II de la loi n&#176; 2017&#8209;256 du 28 f&#233;vrier 2017 de programmation relative &#224; l&#8217;&#233;galit&#233; r&#233;elle outre-mer et portant autres dispositions en mati&#232;re sociale et &#233;conomique, il est institu&#233; un compte d&#8217;affectation sp&#233;ciale intitul&#233;&#160;:</p><p style=\"text-align: justify;\">&#171;&#160;Engagements en faveur de des plans et des contrats de convergence et de transformation des outre-mer&#160;&#187;.</p><p style=\"text-align: justify;\">II.&#160;&#8211;&#160;Ce compte retrace&#160;:</p><p style=\"text-align: justify;\">1&#176;&#160;En recettes&#160;:</p><p style=\"text-align: justify;\">- le produit des &#233;conomies en d&#233;penses fiscales et budg&#233;taires touchant aux contribuables et entreprises domicili&#233;es dans une collectivit&#233; des articles 73 de la Constitution r&#233;alis&#233;es par l&#8217;&#201;tat &#224; compter de l&#8217;exercice budg&#233;taire de 2019&#160;;</p><p style=\"text-align: justify;\">- les cr&#233;dits budg&#233;taires inscrits au programme 123 de la mission outre-mer en faveur des transferts aux collectivit&#233;s locales et du Fonds exceptionnel d&#8217;investissement.</p><p style=\"text-align: justify;\">2&#176;&#160;En d&#233;penses&#160;: des d&#233;penses relatives au financement ou cofinancement des mesures pr&#233;vues par les plans et contrats de convergence outre-mer&#160;;</p><p style=\"text-align: justify;\">III.&#160;&#8211;&#160;La perte de recettes pour l&#8217;&#201;tat est compens&#233;e &#224; due concurrence par la cr&#233;ation d&#8217;une taxe additionnelle aux droits mentionn&#233;s aux articles 575 et 575 A du code g&#233;n&#233;ral des imp&#244;ts.</p>",
    "exposeSommaire": "<p style=\"text-align: justify;\">A l&#8217;heure o&#249;, &#224; Paris, le Gouvernement se vante de faire baisser les imp&#244;ts, il pr&#233;voit, &#171;&#160;en m&#234;me temps&#160;&#187;, de faire porter aux contribuables et aux entreprises ultramarins le poids financier des investissements n&#233;cessaires outre-mer par une hausse consid&#233;rable de la fiscalit&#233;.</p><p style=\"text-align: justify;\">Pire, la manne financi&#232;re de 170 millions d&#8217;euros ponctionn&#233;e aux ultramarins ne b&#233;n&#233;ficiera qu&#8217;&#224; hauteur de 23 millions d&#8217;euros aux grands plans de convergence que nous appelons de nos v&#339;ux et pr&#233;vus par la loi Egalit&#233; r&#233;elle, sans garantie par ailleurs que ces sommes seront continuellement vers&#233;es dans les exercices ult&#233;rieurs. Nous sommes ainsi bien loin du milliard d&#8217;euros promis par le candidat Emmanuel Macron dans une interview donn&#233;e le 19 avril 2017 &#224; Actu Nouvelle-Cal&#233;donie &#171;&#160;pour financer sp&#233;cifiquement des plans de rattrapage et de d&#233;veloppement&#160;&#187;.</p><p style=\"text-align: justify;\">Conscients de la n&#233;cessit&#233; faire monter en puissance le financement des plans de convergence et d&#8217;y affecter des ressources p&#233;rennes et s&#233;curis&#233;es, nous proposions de cr&#233;er un compte d&#8217;affectation sp&#233;ciale (CAS). L&#8217;int&#233;r&#234;t du compte d&#8217;affectation sp&#233;ciale est qu&#8217;il permet de garantir et de s&#233;curiser les ressources qui seraient allou&#233;es aux plans territoriaux d&#8217;investissement&#160;: l&#8217;article&#160;21 de la LOLF pr&#233;cise en effet pr&#233;cise qu&#8217;aucun versement au profit du budget g&#233;n&#233;ral, d&#8217;un budget annexe ou d&#8217;un compte sp&#233;cial ne peut &#234;tre effectu&#233; &#224; partir d&#8217;un compte d&#8217;affectation sp&#233;ciale, ce qui permet de sanctuariser les ressources du compte et d&#8217;&#233;viter les mesures de r&#233;gulation budg&#233;taire.</p><p style=\"text-align: justify;\">Les autorisations d&#8217;engagement et les cr&#233;dits de paiement disponibles en fin d&#8217;ann&#233;e sont report&#233;s de droit sur l&#8217;ann&#233;e suivante, pour un montant qui ne peut exc&#233;der le solde du compte. Si les recettes affect&#233;es au CAS apparaissent plus dynamiques en cours d&#8217;ann&#233;e que le montant pr&#233;vu en LFI, des cr&#233;dits suppl&#233;mentaires peuvent &#234;tre ouverts dans la limite de cet exc&#233;dent. Ainsi, si le produit d&#8217;une taxe ou d&#8217;une fraction d&#8217;imp&#244;t est plus important que ce qui &#233;tait anticip&#233;, la dynamique de la recette peut b&#233;n&#233;ficier au CAS, et donc accro&#238;tre les moyens qui lui sont consacr&#233;s.</p><p style=\"text-align: justify;\">Ainsi donc, si nous demeureront fermement oppos&#233;s aux choix fiscaux faits &#224; travers les articles 4 et 5 de ce PLF, nous consid&#233;rons qu&#8217;il conviendrait de mettre en place ce CAS, r&#233;cipiendaire de recettes de nature fiscales ou non fiscales et des &#233;conomies budg&#233;taires r&#233;alis&#233;es, afin d&#8217;assurer la bonne r&#233;alisation des objectifs contenus dans les diff&#233;rents plans de convergence ainsi que les moyens budg&#233;taires et financiers pr&#233;vus soient r&#233;ellement mobilis&#233;s.</p>",
    "annexeExposeSommaire": {
      "@xmlns:xsi": "http://www.w3.org/2001/XMLSchema-instance",
      "@xsi:nil": "true"
    }
  },
  "representations": {
    "representation": {
      "nom": "PDF",
      "typeMime": {
        "type": "application",
        "subType": "PDF"
      },
      "statutRepresentation": {
        "verbatim": "true",
        "canonique": "true",
        "officielle": "true",
        "transcription": "false",
        "enregistrement": "false"
      },
      "repSource": {
        "@xmlns:xsi": "http://www.w3.org/2001/XMLSchema-instance",
        "@xsi:nil": "true"
      },
      "offset": {
        "@xmlns:xsi": "http://www.w3.org/2001/XMLSchema-instance",
        "@xsi:nil": "true"
      },
      "contenu": {
        "documentURI": "/15/amendements/1255A/AN/1597.pdf"
      },
      "dateDispoRepresentation": {
        "@xmlns:xsi": "http://www.w3.org/2001/XMLSchema-instance",
        "@xsi:nil": "true"
      }
    }
  },
  "seanceDiscussion": {
    "@xmlns:xsi": "http://www.w3.org/2001/XMLSchema-instance",
    "@xsi:nil": "true"
  },
  "sort": {
    "@xmlns:xsi": "http://www.w3.org/2001/XMLSchema-instance",
    "@xsi:nil": "true"
  },
  "dateDepot": "2018-10-11T02:00:00.000+02:00",
  "dateDistribution": {
    "@xmlns:xsi": "http://www.w3.org/2001/XMLSchema-instance",
    "@xsi:nil": "true"
  },
  "article99": "0",
  "loiReference": {
    "codeLoi": null,
    "divisionCodeLoi": {
      "@xmlns:xsi": "http://www.w3.org/2001/XMLSchema-instance",
      "@xsi:nil": "true"
    }
  }
}