{
  "@xmlns": "http://schemas.assemblee-nationale.fr/referentiel",
  "uid": "AMANR5L15SEA717460BTC0105P0D1N78",
  "identifiant": {
    "legislature": "15",
    "numero": "78",
    "numRect": "50",
    "saisine": {
      "refTexteLegislatif": "PRJLANR5L15BTC0105",
      "numeroPartiePLF": "0",
      "organeExamen": "PO717460",
      "mentionSecondeDeliberation": "0"
    }
  },
  "numeroLong": "78 (2ème Rect)",
  "etapeTexte": "1ère lecture (2ème assemblée saisie)",
  "triAmendement": "hf",
  "cardinaliteAmdtMultiples": "1",
  "amendementParent": {
    "@xmlns:xsi": "http://www.w3.org/2001/XMLSchema-instance",
    "@xsi:nil": "true"
  },
  "etat": "Discuté",
  "signataires": {
    "auteur": {
      "typeAuteur": "Depute",
      "acteurRef": "PA709315",
      "organeRef": {
        "@xmlns:xsi": "http://www.w3.org/2001/XMLSchema-instance",
        "@xsi:nil": "true"
      },
      "groupePolitiqueRef": "PO730934"
    },
    "cosignataires": {
      "acteurRef": [
        "PA720210",
        "PA718884",
        "PA712015",
        "PA709315"
      ]
    },
    "texteAffichable": "M.&#160;Viala,  M.&#160;Dive, Mme&#160;Bazin-Malgras et Mme&#160;Beauvais"
  },
  "pointeurFragmentTexte": {
    "missionVisee": {
      "@xmlns:xsi": "http://www.w3.org/2001/XMLSchema-instance",
      "@xsi:nil": "true"
    },
    "division": {
      "titre": "Article 2 bis",
      "articleDesignationCourte": "APRÈS ART. 2 BIS",
      "type": "ARTICLE",
      "avant_A_Apres": "Après",
      "divisionRattachee": "APRÈS L'ARTICLE 2 BIS, insérer l'article suivant:",
      "articleAdditionnel": "1",
      "chapitreAdditionnel": {
        "@xmlns:xsi": "http://www.w3.org/2001/XMLSchema-instance",
        "@xsi:nil": "true"
      },
      "urlDivisionTexteVise": "/15/textes/0105.asp#D_Article_2_bis"
    },
    "alinea": {
      "@xmlns:xsi": "http://www.w3.org/2001/XMLSchema-instance",
      "@xsi:nil": "true"
    }
  },
  "corps": {
    "dispositif": "<p style=\"text-align: justify;\">Apr&#232;s l&#8217;article L.O. 127 du code &#233;lectoral, est ins&#233;r&#233; un article L.O. 127&#8209;1 ainsi r&#233;dig&#233;&#160;:</p><p style=\"text-align: justify;\">&#171;&#160;Art.&#160;L.<i>O. 127&#8209;1</i>.&#160;&#8211; &#192; l&#8217;exception du mandat de conseiller municipal dans les communes de moins de 1 000 habitants, nul ne peut exercer plus de deux mandats cons&#233;cutifs de d&#233;put&#233; ou de s&#233;nateur dans les m&#234;mes fonctions. Lorsqu&#8217;une personne a exerc&#233; des fonctions de d&#233;put&#233; ou de s&#233;nateur pendant une dur&#233;e sup&#233;rieure &#224; la moiti&#233; de la dur&#233;e du mandat, elle est r&#233;put&#233;e avoir effectu&#233; un mandat.&#160;&#187;</p>",
    "exposeSommaire": "<p style=\"text-align: justify;\">Cet amendement vise &#224; encadrer les mandats des &#233;lus tel que&#160;:</p><p style=\"margin: 5pt 0cm 0.0001pt 36pt; text-align: justify;\">&#183; les Maires et conseillers municipaux des communes de plus de 1 000 habitants,</p><p style=\"margin: 5pt 0cm 0.0001pt 36pt; text-align: justify;\">&#183; les Pr&#233;sidents de d&#233;partement et Conseillers d&#233;partementaux,</p><p style=\"margin: 5pt 0cm 0.0001pt 36pt; text-align: justify;\">&#183; les Pr&#233;sidents de r&#233;gion et Conseillers r&#233;gionaux,</p><p style=\"margin: 5pt 0cm 0.0001pt 36pt; text-align: justify;\">&#183; les D&#233;put&#233;s,</p><p style=\"margin: 5pt 0cm 0.0001pt 36pt; text-align: justify;\">&#183; les S&#233;nateurs.</p><p style=\"text-align: justify;\">Cet amendement poursuit plusieurs objectifs.</p><p style=\"text-align: justify;\">Tout d&#8217;abord, il est indispensable et urgent de donner &#224; la vie d&#233;mocratique de notre pays une plus grande vitalit&#233;. L&#8217;id&#233;e simple que plus de citoyens doivent pouvoir&#160;&#8211;&#160;au cours de leur existence&#160;&#8211;&#160;acc&#233;der &#224; des fonctions &#233;lectives leur permettant de se confronter, et d&#8217;apporter leur contribution, &#224; la gestion de la chose publique, est le principal fondement de cette proposition.</p><p style=\"text-align: justify;\">Ensuite, de nombreux d&#233;bats, parfois pol&#233;miques, alimentent la vie politique de notre pays, et portent essentiellement sur les conditions d&#8217;exercice des mandats &#233;lectifs. Cette proposition part d&#8217;un postulat tout simple&#160;: tout &#233;lu, s&#8217;il souhaite mener &#224; bien son engagement, doit y consacrer beaucoup de temps et beaucoup d&#8217;&#233;nergie. Il est donc souhaitable que cet engagement soit circonscrit dans une &#233;chelle temporelle pr&#233;vue &#224; l&#8217;avance. Cet aspect ouvre tout naturellement la voie &#224; des r&#233;flexions compl&#233;mentaires, qu&#8217;il convient de conduire et de faire aboutir sur&#160;:</p><p style=\"margin: 5pt 0cm 0.0001pt 36pt; text-align: justify;\">- le statut de l&#8217;&#233;lu et les moyens mis &#224; disposition pour assumer ses charges,</p><p style=\"margin: 5pt 0cm 0.0001pt 36pt; text-align: justify;\">- le dispositif &#224; pr&#233;voir de retour &#224; la vie active, une fois les mandats achev&#233;s, en particulier pour ceux qui ont exig&#233; la suspension de toute activit&#233; professionnelle.</p><p style=\"text-align: justify;\">Enfin, cette mesure permet aussi de restaurer un climat de confiance entre les citoyens, les institutions de notre pays, et celles et ceux qui font le choix de s&#8217;y engager activement en tant qu&#8217;&#233;lus.</p><p style=\"text-align: justify;\">Cet amendement a pour but de limiter &#224; deux les mandats &#233;lectifs cons&#233;cutifs dans les m&#234;mes fonctions. Sur le m&#234;me principe que la loi du 23 juillet 2008, il permet de cibler une large partie des &#233;lus et ainsi, de participer au remplacement des dirigeants.</p><p style=\"text-align: justify;\">Des pr&#233;cisions peuvent &#234;tre apport&#233;es sur cet disposition&#160;:</p><p style=\"margin: 5pt 0cm 0.0001pt 36pt; text-align: justify;\">- si les &#233;lus exercent leur mandat pour une dur&#233;e inf&#233;rieure &#224; la moiti&#233; de la dur&#233;e initiale du mandat, c&#8217;est-&#224;-dire s&#8217;ils sont &#233;lus en cours de mandat mais pour la deuxi&#232;me partie de celui-ci, il n&#8217;est pas comptabilis&#233;.</p><p style=\"margin: 5pt 0cm 0.0001pt 36pt; text-align: justify;\">- les conseillers municipaux des communes de moins de 1 000 habitants ne sont pas soumis &#224; cette disposition. En effet, cette mesure est justifi&#233;e par le souhait de ne pas mettre en p&#233;ril par cette proposition la p&#233;rennit&#233; d&#233;mocratique des communes de petite taille, par ailleurs essentielles &#224; un am&#233;nagement &#233;quitable du territoire national.</p>",
    "annexeExposeSommaire": {
      "@xmlns:xsi": "http://www.w3.org/2001/XMLSchema-instance",
      "@xsi:nil": "true"
    }
  },
  "representations": {
    "representation": {
      "nom": "PDF",
      "typeMime": {
        "type": "application",
        "subType": "PDF"
      },
      "statutRepresentation": {
        "verbatim": "true",
        "canonique": "true",
        "officielle": "true",
        "transcription": "false",
        "enregistrement": "false"
      },
      "repSource": {
        "@xmlns:xsi": "http://www.w3.org/2001/XMLSchema-instance",
        "@xsi:nil": "true"
      },
      "offset": {
        "@xmlns:xsi": "http://www.w3.org/2001/XMLSchema-instance",
        "@xsi:nil": "true"
      },
      "contenu": {
        "documentURI": "/15/amendements/0105/AN/78.pdf"
      },
      "dateDispoRepresentation": {
        "@xmlns:xsi": "http://www.w3.org/2001/XMLSchema-instance",
        "@xsi:nil": "true"
      }
    }
  },
  "seanceDiscussion": "RUANR5L15S2017IDS20663",
  "sort": {
    "dateSaisie": "2017-07-28T23:17:00.000+02:00",
    "sortEnSeance": "Retiré"
  },
  "dateDepot": "2017-07-21T02:00:00.000+02:00",
  "dateDistribution": "2017-07-26T02:00:00.000+02:00",
  "article99": "0",
  "loiReference": {
    "codeLoi": {
      "@xmlns:xsi": "http://www.w3.org/2001/XMLSchema-instance",
      "@xsi:nil": "true"
    },
    "divisionCodeLoi": {
      "@xmlns:xsi": "http://www.w3.org/2001/XMLSchema-instance",
      "@xsi:nil": "true"
    }
  }
}