{
  "@xmlns": "http://schemas.assemblee-nationale.fr/referentiel",
  "uid": "AMANR5L15SEA717460BTC0575P0D1N116",
  "identifiant": {
    "legislature": "15",
    "numero": "116",
    "numRect": "0",
    "saisine": {
      "refTexteLegislatif": "PRJLANR5L15BTC0575",
      "numeroPartiePLF": "0",
      "organeExamen": "PO717460",
      "mentionSecondeDeliberation": "0"
    }
  },
  "numeroLong": "116",
  "etapeTexte": "1ère lecture (1ère assemblée saisie)",
  "triAmendement": "b",
  "cardinaliteAmdtMultiples": "1",
  "amendementParent": {
    "@xmlns:xsi": "http://www.w3.org/2001/XMLSchema-instance",
    "@xsi:nil": "true"
  },
  "etat": "Discuté",
  "signataires": {
    "auteur": {
      "typeAuteur": "Depute",
      "acteurRef": "PA267429",
      "organeRef": {
        "@xmlns:xsi": "http://www.w3.org/2001/XMLSchema-instance",
        "@xsi:nil": "true"
      },
      "groupePolitiqueRef": "PO730934"
    },
    "cosignataires": {
      "acteurRef": [
        "PA608416",
        "PA267204",
        "PA718850",
        "PA346218",
        "PA267429",
        "PA607090",
        "PA266793",
        "PA330909",
        "PA346054",
        "PA608016",
        "PA718838",
        "PA642847"
      ]
    },
    "texteAffichable": "M.&#160;Cinieri,  M.&#160;Cordier, M.&#160;Descoeur, M.&#160;Bony, M.&#160;Bazin, M.&#160;Masson, M.&#160;Brun, M.&#160;Hetzel, Mme&#160;Louwagie, M.&#160;Jean-Pierre&#160;Vigier, M.&#160;Sermier et M.&#160;Emmanuel&#160;Maquet"
  },
  "pointeurFragmentTexte": {
    "missionVisee": {
      "@xmlns:xsi": "http://www.w3.org/2001/XMLSchema-instance",
      "@xsi:nil": "true"
    },
    "division": {
      "titre": "Article 33",
      "articleDesignationCourte": "APRÈS ART. 33",
      "type": "ARTICLE",
      "avant_A_Apres": "Après",
      "divisionRattachee": "APRÈS L'ARTICLE 33, insérer l'article suivant:",
      "articleAdditionnel": "1",
      "chapitreAdditionnel": {
        "@xmlns:xsi": "http://www.w3.org/2001/XMLSchema-instance",
        "@xsi:nil": "true"
      },
      "urlDivisionTexteVise": "/15/textes/0575.asp#D_Article_33"
    },
    "alinea": {
      "@xmlns:xsi": "http://www.w3.org/2001/XMLSchema-instance",
      "@xsi:nil": "true"
    }
  },
  "corps": {
    "dispositif": "<p style=\"text-align: justify;\">&#192; la premi&#232;re phrase du dernier alin&#233;a du 1&#176; de l&#8217;article L.&#160;121&#8209;9 du code de l&#8217;environnement, apr&#232;s la premi&#232;re occurrence du mot&#160;:&#171;&#160;public&#160;&#187;, sont ins&#233;r&#233;s les mots&#160;:&#171;&#160;ou d&#8217;une concertation&#160;&#187;.</p>",
    "exposeSommaire": "<p style=\"text-align: justify;\">Cet amendement propose l&#8217;extension de la dispense de d&#233;bat public ou de concertation pr&#233;alable aux projets ayant fait l&#8217;objet d&#8217;une concertation lors de l&#8217;&#233;laboration d&#8217;un plan ou d&#8217;un programme approuv&#233; depuis moins de cinq ans et d&#233;finissant le cadre dans lequel le projet pourrait &#234;tre autoris&#233; et mis en &#339;uvre.</p><p style=\"text-align: justify;\">En effet, cette possibilit&#233; n&#8217;est pour l&#8217;instant pr&#233;vue que dans le cas d&#8217;un projet qui aurait fait l&#8217;objet d&#8217;un d&#233;bat public (article L.&#160;121&#8209;9 du code de l&#8217;environnement).</p><p style=\"text-align: justify;\">Or, dans un esprit de simplification et d&#8217;harmonisation, il convient d&#8217;&#233;largir cette possibilit&#233; &#224; la proc&#233;dure de consultation. Cela permettra ainsi de rationaliser les phases de participation, tout en &#233;vitant la multiplication des &#233;tapes de concertation pr&#233;alable portant sur un m&#234;me projet.</p>",
    "annexeExposeSommaire": {
      "@xmlns:xsi": "http://www.w3.org/2001/XMLSchema-instance",
      "@xsi:nil": "true"
    }
  },
  "representations": {
    "representation": {
      "nom": "PDF",
      "typeMime": {
        "type": "application",
        "subType": "PDF"
      },
      "statutRepresentation": {
        "verbatim": "true",
        "canonique": "true",
        "officielle": "true",
        "transcription": "false",
        "enregistrement": "false"
      },
      "repSource": {
        "@xmlns:xsi": "http://www.w3.org/2001/XMLSchema-instance",
        "@xsi:nil": "true"
      },
      "offset": {
        "@xmlns:xsi": "http://www.w3.org/2001/XMLSchema-instance",
        "@xsi:nil": "true"
      },
      "contenu": {
        "documentURI": "/15/amendements/0575/AN/116.pdf"
      },
      "dateDispoRepresentation": {
        "@xmlns:xsi": "http://www.w3.org/2001/XMLSchema-instance",
        "@xsi:nil": "true"
      }
    }
  },
  "seanceDiscussion": "RUANR5L15S2018IDS20868",
  "sort": {
    "dateSaisie": "2018-01-25T16:40:47.000+01:00",
    "sortEnSeance": "Rejeté"
  },
  "dateDepot": "2018-01-18T01:00:00.000+01:00",
  "dateDistribution": "2018-01-23T01:00:00.000+01:00",
  "article99": "0",
  "loiReference": {
    "codeLoi": {
      "@xmlns:xsi": "http://www.w3.org/2001/XMLSchema-instance",
      "@xsi:nil": "true"
    },
    "divisionCodeLoi": {
      "@xmlns:xsi": "http://www.w3.org/2001/XMLSchema-instance",
      "@xsi:nil": "true"
    }
  }
}