{
  "@xmlns": "http://schemas.assemblee-nationale.fr/referentiel",
  "uid": "AMANR5L15PO420120B0517P0D1N21",
  "identifiant": {
    "legislature": "15",
    "numero": "21",
    "numRect": "0",
    "saisine": {
      "refTexteLegislatif": "PIONANR5L15B0517",
      "numeroPartiePLF": "0",
      "organeExamen": "PO420120",
      "mentionSecondeDeliberation": "0"
    }
  },
  "numeroLong": "AS21",
  "etapeTexte": "1ère lecture (1ère assemblée saisie)",
  "triAmendement": "ari",
  "cardinaliteAmdtMultiples": "1",
  "amendementParent": {
    "@xmlns:xsi": "http://www.w3.org/2001/XMLSchema-instance",
    "@xsi:nil": "true"
  },
  "etat": "Discuté",
  "signataires": {
    "auteur": {
      "typeAuteur": "Depute",
      "acteurRef": "PA721924",
      "organeRef": {
        "@xmlns:xsi": "http://www.w3.org/2001/XMLSchema-instance",
        "@xsi:nil": "true"
      },
      "groupePolitiqueRef": "PO730970"
    },
    "cosignataires": {
      "acteurRef": [
        "PA722374",
        "PA720968",
        "PA720326",
        "PA720924",
        "PA721992",
        "PA721924"
      ]
    },
    "texteAffichable": "Mme&#160;de Vaucouleurs,  Mme&#160;Benin, Mme&#160;Elimas, Mme&#160;Gallerneau, M.&#160;Isaac-Sibille et M.&#160;Hammouche"
  },
  "pointeurFragmentTexte": {
    "missionVisee": {
      "@xmlns:xsi": "http://www.w3.org/2001/XMLSchema-instance",
      "@xsi:nil": "true"
    },
    "division": {
      "titre": "Article PREMIER",
      "articleDesignationCourte": "ART. PREMIER",
      "type": "ARTICLE",
      "avant_A_Apres": "A",
      "divisionRattachee": "ARTICLE PREMIER",
      "articleAdditionnel": {
        "@xmlns:xsi": "http://www.w3.org/2001/XMLSchema-instance",
        "@xsi:nil": "true"
      },
      "chapitreAdditionnel": {
        "@xmlns:xsi": "http://www.w3.org/2001/XMLSchema-instance",
        "@xsi:nil": "true"
      },
      "urlDivisionTexteVise": "/15/textes/0517.asp#D_Article_1er"
    },
    "alinea": {
      "@xmlns:xsi": "http://www.w3.org/2001/XMLSchema-instance",
      "@xsi:nil": "true"
    }
  },
  "corps": {
    "dispositif": "<p style=\"text-align: justify;\">Supprimer cet article.</p>",
    "exposeSommaire": "<p style=\"text-align: justify;\">Mourir dans la dignit&#233; et de mani&#232;re apais&#233;e est un droit inali&#233;nable pour chaque &#234;tre humain. Aujourd&#8217;hui en France, ce droit n&#8217;est pas toujours respect&#233;. Les raisons en sont nombreuses&#160;: manque de moyens dans les unit&#233;s de soins palliatifs, manque de connaissance de la loi et non application de celle-ci.</p><p style=\"text-align: justify;\">Avant d&#8217;aller plus loin dans la l&#233;gislation, il apparait d&#232;s lors n&#233;cessaire que les lois d&#233;j&#224; en place soient connues et respect&#233;es. La loi Claeys-Leonetti de 2016 pr&#233;voit le droit &#224; une s&#233;dation profonde et continue jusqu&#8217;au d&#233;c&#232;s. Cependant, elle est encore m&#233;connue du grand public et du personnel m&#233;dical. Un effort de communication et de p&#233;dagogie est donc essentiel pour permettre aux patients d&#8217;acc&#233;der aux possibilit&#233;s qu&#8217;offre cette loi et de mieux expliciter ce qu&#8217;est la s&#233;dation profonde et continue, parfois per&#231;ue comme un abandon du patient en le laissant mourir de faim et de soif.</p><p style=\"text-align: justify;\">Par ailleurs, alors que notre population vieillit, nous nous devons de d&#233;velopper nos unit&#233;s de soins palliatifs et de leur permettre de travailler dans des conditions dignes, ce qui n&#8217;est pas aujourd&#8217;hui toujours le cas.</p><p style=\"text-align: justify;\">Une meilleure prise en compte de la loi et un renforcement net des soins palliatifs en France permettraient selon nous d&#8217;am&#233;liorer significativement les conditions dans lesquelles les personnes meurent aujourd&#8217;hui dans notre pays. Il apparait ainsi pr&#233;matur&#233; de l&#233;gif&#233;rer de nouveau alors que la loi en vigueur n&#8217;est pas encore correctement appliqu&#233;e et n&#8217;a pas fait l&#8217;objet d&#8217;&#233;valuation. Les dispositions pr&#233;vues dans les articles de cette proposition de loi ne prenant pas en compte ces &#233;l&#233;ments, nous demandons leur suppression.</p>",
    "annexeExposeSommaire": {
      "@xmlns:xsi": "http://www.w3.org/2001/XMLSchema-instance",
      "@xsi:nil": "true"
    }
  },
  "representations": {
    "representation": {
      "nom": "PDF",
      "typeMime": {
        "type": "application",
        "subType": "PDF"
      },
      "statutRepresentation": {
        "verbatim": "true",
        "canonique": "true",
        "officielle": "true",
        "transcription": "false",
        "enregistrement": "false"
      },
      "repSource": {
        "@xmlns:xsi": "http://www.w3.org/2001/XMLSchema-instance",
        "@xsi:nil": "true"
      },
      "offset": {
        "@xmlns:xsi": "http://www.w3.org/2001/XMLSchema-instance",
        "@xsi:nil": "true"
      },
      "contenu": {
        "documentURI": "/15/amendements/0517/CION-SOC/AS21.pdf"
      },
      "dateDispoRepresentation": {
        "@xmlns:xsi": "http://www.w3.org/2001/XMLSchema-instance",
        "@xsi:nil": "true"
      }
    }
  },
  "seanceDiscussion": {
    "@xmlns:xsi": "http://www.w3.org/2001/XMLSchema-instance",
    "@xsi:nil": "true"
  },
  "sort": {
    "dateSaisie": "2018-01-24T12:50:13.000+01:00",
    "sortEnSeance": "Adopté"
  },
  "dateDepot": "2018-01-19T01:00:00.000+01:00",
  "dateDistribution": "2018-01-23T01:00:00.000+01:00",
  "article99": "0",
  "loiReference": {
    "codeLoi": {
      "@xmlns:xsi": "http://www.w3.org/2001/XMLSchema-instance",
      "@xsi:nil": "true"
    },
    "divisionCodeLoi": {
      "@xmlns:xsi": "http://www.w3.org/2001/XMLSchema-instance",
      "@xsi:nil": "true"
    }
  }
}