{
  "@xmlns": "http://schemas.assemblee-nationale.fr/referentiel",
  "uid": "AMANR5L15SEA717460BTC1237P0D1N1678",
  "identifiant": {
    "legislature": "15",
    "numero": "1678",
    "numRect": "0",
    "saisine": {
      "refTexteLegislatif": "PRJLANR5L15BTC1237",
      "numeroPartiePLF": "0",
      "organeExamen": "PO717460",
      "mentionSecondeDeliberation": "0"
    }
  },
  "numeroLong": "1678",
  "etapeTexte": "1ère lecture (1ère assemblée saisie)",
  "triAmendement": "bpaaaaaaaaaaaaaaaaaaaaaaaaaaaaaaaaaaaaaaaaaaaaaaaahew",
  "cardinaliteAmdtMultiples": "1",
  "amendementParent": {
    "@xmlns:xsi": "http://www.w3.org/2001/XMLSchema-instance",
    "@xsi:nil": "true"
  },
  "etat": "Discuté",
  "signataires": {
    "auteur": {
      "typeAuteur": "Depute",
      "acteurRef": "PA718926",
      "organeRef": {
        "@xmlns:xsi": "http://www.w3.org/2001/XMLSchema-instance",
        "@xsi:nil": "true"
      },
      "groupePolitiqueRef": "PO730940"
    },
    "cosignataires": {
      "acteurRef": [
        "PA689",
        "PA721270",
        "PA721012",
        "PA721896",
        "PA267306",
        "PA610654",
        "PA722110",
        "PA722202",
        "PA720692",
        "PA441",
        "PA720546",
        "PA335612",
        "PA718926",
        "PA718720",
        "PA721118",
        "PA610667"
      ]
    },
    "texteAffichable": "M.&#160;Dharr&#233;ville,  M.&#160;Jumel, M.&#160;Peu, Mme&#160;Bello, M.&#160;Brotherson, M.&#160;Bruneel, Mme&#160;Buffet, M.&#160;Chassaigne, M.&#160;Dufr&#232;gne, Mme&#160;Faucillon, Mme&#160;K&#233;clard-Mond&#233;sir, M.&#160;Lecoq, M.&#160;Nilor, M.&#160;Fabien&#160;Roussel, M.&#160;Serville et M.&#160;Wulfranc"
  },
  "pointeurFragmentTexte": {
    "missionVisee": {
      "@xmlns:xsi": "http://www.w3.org/2001/XMLSchema-instance",
      "@xsi:nil": "true"
    },
    "division": {
      "titre": "Article 19 ter",
      "articleDesignationCourte": "APRÈS ART. 19 TER",
      "type": "ARTICLE",
      "avant_A_Apres": "Après",
      "divisionRattachee": "APRÈS L'ARTICLE 19 TER, insérer l'article suivant:",
      "articleAdditionnel": "1",
      "chapitreAdditionnel": {
        "@xmlns:xsi": "http://www.w3.org/2001/XMLSchema-instance",
        "@xsi:nil": "true"
      },
      "urlDivisionTexteVise": "/15/textes/1237.asp#D_Article_19_ter"
    },
    "alinea": {
      "@xmlns:xsi": "http://www.w3.org/2001/XMLSchema-instance",
      "@xsi:nil": "true"
    }
  },
  "corps": {
    "dispositif": "<p style=\"text-align: justify;\">L&#8217;article premier de la loi n&#176; 75&#8209;1334 du 31 d&#233;cembre 1975 relative &#224; la sous-traitance est ainsi modifi&#233;&#160;:</p><p style=\"text-align: justify;\">1&#176;&#160;Apr&#232;s le mot &#171;&#160;entrepreneur&#160;&#187;, sont ins&#233;r&#233;s les mots &#171;&#160;donneur d&#8217;ordre&#160;&#187;&#160;;</p><p style=\"text-align: justify;\">2. Sont ajout&#233;s deux alin&#233;as ainsi r&#233;dig&#233;s&#160;:</p><p style=\"text-align: justify;\">&#171;&#160;La sous-traitance est, notamment, caract&#233;ris&#233;e lorsque que le donneur d&#8217;ordre direct ou indirect est une entreprise d&#8217;au moins 5&#160;000 salari&#233;s dont le si&#232;ge social est situ&#233; en France ou une entreprise d&#8217;au moins 10&#160;000 salari&#233;s dont le si&#232;ge social est situ&#233; &#224; l&#8217;&#233;tranger et qu&#8217;il existe une relation commerciale &#233;tablie de caract&#232;re stable, suivie et habituelle repr&#233;sentant au moins 30&#160;% du chiffre d&#8217;affaires de l&#8217;entreprise sous-traitante sur les cinq derni&#232;res ann&#233;es.&#160;&#187;</p><p style=\"text-align: justify;\">&#171;&#160;Le changement de capital social, de forme juridique ou de d&#233;nomination du sous-traitant n&#8217;interrompt pas le d&#233;lai de cinq ans mentionn&#233; au deuxi&#232;me alin&#233;a du pr&#233;sent article d&#232;s lors que le site de production est inchang&#233;&#160;&#187;.</p>",
    "exposeSommaire": "<p style=\"text-align: justify;\">Cet amendement, issu de la proposition de loi des&#160;GM&amp;amp;S, pr&#233;voit de compl&#233;ter la d&#233;finition de la sous-traitance contenue dans l&#8217;article&#160;1 de la loi n&#176;&#160;75&#8209;1334 du 31&#160;d&#233;cembre 1975 relative &#224; la sous-traitance. Il est propos&#233; de combiner un crit&#232;re relatif &#224; la taille de l&#8217;entreprise donneuse d&#8217;ordre, de l&#8217;existence d&#8217;une relation commerciale &#233;tablie avec le sous-traitant et de la proportion du chiffre d&#8217;affaire de l&#8217;entreprise sous-traitante r&#233;alis&#233; pour le donneur d&#8217;ordre.</p><p style=\"text-align: justify;\">Il est ainsi propos&#233; d&#8217;instaurer une pr&#233;somption de sous-traitance permettant une application plus large de la r&#233;glementation protectrice des entreprises sous-traitantes.</p>",
    "annexeExposeSommaire": {
      "@xmlns:xsi": "http://www.w3.org/2001/XMLSchema-instance",
      "@xsi:nil": "true"
    }
  },
  "representations": {
    "representation": {
      "nom": "PDF",
      "typeMime": {
        "type": "application",
        "subType": "PDF"
      },
      "statutRepresentation": {
        "verbatim": "true",
        "canonique": "true",
        "officielle": "true",
        "transcription": "false",
        "enregistrement": "false"
      },
      "repSource": {
        "@xmlns:xsi": "http://www.w3.org/2001/XMLSchema-instance",
        "@xsi:nil": "true"
      },
      "offset": {
        "@xmlns:xsi": "http://www.w3.org/2001/XMLSchema-instance",
        "@xsi:nil": "true"
      },
      "contenu": {
        "documentURI": "/15/amendements/1237/AN/1678.pdf"
      },
      "dateDispoRepresentation": {
        "@xmlns:xsi": "http://www.w3.org/2001/XMLSchema-instance",
        "@xsi:nil": "true"
      }
    }
  },
  "seanceDiscussion": "RUANR5L15S2018IDS21254",
  "sort": {
    "dateSaisie": "2018-09-28T15:56:48.000+02:00",
    "sortEnSeance": "Rejeté"
  },
  "dateDepot": "2018-09-21T02:00:00.000+02:00",
  "dateDistribution": "2018-09-24T02:00:00.000+02:00",
  "article99": "0",
  "loiReference": {
    "codeLoi": "loi 75-1334",
    "divisionCodeLoi": "1"
  }
}