{
  "@xmlns": "http://schemas.assemblee-nationale.fr/referentiel",
  "uid": "AMANR5L15PO420120B1681P0D1N460",
  "identifiant": {
    "legislature": "15",
    "numero": "460",
    "numRect": "0",
    "saisine": {
      "refTexteLegislatif": "PRJLANR5L15B1681",
      "numeroPartiePLF": "0",
      "organeExamen": "PO420120",
      "mentionSecondeDeliberation": "0"
    }
  },
  "numeroLong": "AS460",
  "etapeTexte": "1ère lecture (1ère assemblée saisie)",
  "triAmendement": "acaaaaaaaaaaaaaaaaaaaaaaaaaaaaaaaaaaaaaaaaaaaaaaaadddddddhzo",
  "cardinaliteAmdtMultiples": "1",
  "amendementParent": {
    "@xmlns:xsi": "http://www.w3.org/2001/XMLSchema-instance",
    "@xsi:nil": "true"
  },
  "etat": "Discuté",
  "signataires": {
    "auteur": {
      "typeAuteur": "Depute",
      "acteurRef": "PA718884",
      "organeRef": {
        "@xmlns:xsi": "http://www.w3.org/2001/XMLSchema-instance",
        "@xsi:nil": "true"
      },
      "groupePolitiqueRef": "PO730934"
    },
    "cosignataires": {
      "acteurRef": "PA718884"
    },
    "texteAffichable": "Mme&#160;Bazin-Malgras"
  },
  "pointeurFragmentTexte": {
    "missionVisee": {
      "@xmlns:xsi": "http://www.w3.org/2001/XMLSchema-instance",
      "@xsi:nil": "true"
    },
    "division": {
      "titre": "Article PREMIER",
      "articleDesignationCourte": "AVANT ART. PREMIER",
      "type": "ARTICLE",
      "avant_A_Apres": "Avant",
      "divisionRattachee": "AVANT L'ARTICLE PREMIER, insérer l'article suivant:",
      "articleAdditionnel": "1",
      "chapitreAdditionnel": {
        "@xmlns:xsi": "http://www.w3.org/2001/XMLSchema-instance",
        "@xsi:nil": "true"
      },
      "urlDivisionTexteVise": "/15/textes/1681.asp#D_Article_1er"
    },
    "alinea": {
      "@xmlns:xsi": "http://www.w3.org/2001/XMLSchema-instance",
      "@xsi:nil": "true"
    }
  },
  "corps": {
    "dispositif": "<p style=\"text-align: justify;\">Le dernier alin&#233;a de l&#8217;article L.&#160;1411&#8209;1 du code de la sant&#233; publique est compl&#233;t&#233; par des mots et deux phrases ainsi r&#233;dig&#233;s&#160;:</p><p style=\"text-align: justify;\">&#171;&#160;et les&#160;citoyens.&#160;Une conf&#233;rence nationale de consensus traitant, au regard notamment des &#233;volutions d&#233;mographiques et &#233;pid&#233;miologiques, de l&#8217;&#233;quilibre entre la qualit&#233; des soins, l&#8217;efficience &#233;conomique et la qualit&#233; de vie au travail des professionnels de sant&#233; est organis&#233;e tous les ans. Les modalit&#233;s de mise en &#339;uvre et d&#8217;&#233;valuation sont d&#233;finies par d&#233;cret.&#160;&#187;</p>",
    "exposeSommaire": "<p>Les f&#233;d&#233;rations hospitali&#232;res appellent &#224; l&#8217;organisation d&#8217;une concertation sur le juste &#233;quilibre entre imp&#233;ratif d&#8217;efficience &#233;conomique, qualit&#233; de soins et qualit&#233; de vie au travail. Quand le Parlement examine un projet de texte relatif &#224; la sant&#233;, cet examen doit se faire en ayant &#224; l&#8217;esprit la meilleure prise en charge de nos concitoyens, dans le secteur sanitaire comme m&#233;dico-social, la n&#233;cessaire efficience &#233;conomique, mais &#233;galement la qualit&#233; de vie au travail des professionnels, ainsi que les &#233;volutions d&#233;mographiques et &#233;pid&#233;miologiques.</p><p>&#160;</p><p>Il est donc n&#233;cessaire de mener une r&#233;flexion transparente sur l&#8217;&#233;quilibre entre ces diff&#233;rentes dimensions dans le cadre d&#8217;un d&#233;bat qui rassemblera parlementaires de toutes les sensibilit&#233;s, politiques, usagers, m&#233;decins, directeurs, citoyens et chercheurs avec le soutien de la Haute Autorit&#233; de Sant&#233;.&#160;</p>",
    "annexeExposeSommaire": {
      "@xmlns:xsi": "http://www.w3.org/2001/XMLSchema-instance",
      "@xsi:nil": "true"
    },
    "cartoucheDelaiDepotDepasse": {
      "@xmlns:xsi": "http://www.w3.org/2001/XMLSchema-instance",
      "@xsi:nil": "true"
    }
  },
  "representations": {
    "representation": {
      "nom": "PDF",
      "typeMime": {
        "type": "application",
        "subType": "PDF"
      },
      "statutRepresentation": {
        "verbatim": "true",
        "canonique": "true",
        "officielle": "true",
        "transcription": "false",
        "enregistrement": "false"
      },
      "repSource": {
        "@xmlns:xsi": "http://www.w3.org/2001/XMLSchema-instance",
        "@xsi:nil": "true"
      },
      "offset": {
        "@xmlns:xsi": "http://www.w3.org/2001/XMLSchema-instance",
        "@xsi:nil": "true"
      },
      "contenu": {
        "documentURI": "/15/amendements/1681/CION-SOC/AS460.pdf"
      },
      "dateDispoRepresentation": {
        "@xmlns:xsi": "http://www.w3.org/2001/XMLSchema-instance",
        "@xsi:nil": "true"
      }
    }
  },
  "seanceDiscussion": {
    "@xmlns:xsi": "http://www.w3.org/2001/XMLSchema-instance",
    "@xsi:nil": "true"
  },
  "sort": {
    "dateSaisie": "2019-03-12T16:44:15.000+01:00",
    "sortEnSeance": "Non soutenu"
  },
  "dateDepot": "2019-03-07T01:00:00.000+01:00",
  "dateDistribution": "2019-03-12T01:00:00.000+01:00",
  "article99": "0",
  "loiReference": {
    "codeLoi": "santé publique",
    "divisionCodeLoi": "L1411-1"
  }
}