{
  "@xmlns": "http://schemas.assemblee-nationale.fr/referentiel",
  "uid": "AMANR5L15SEA717460BTC1019P0D1N1898",
  "identifiant": {
    "legislature": "15",
    "numero": "1898",
    "numRect": "0",
    "saisine": {
      "refTexteLegislatif": "PRJLANR5L15BTC1019",
      "numeroPartiePLF": "0",
      "organeExamen": "PO717460",
      "mentionSecondeDeliberation": "1"
    }
  },
  "numeroLong": "1898",
  "etapeTexte": "1ère lecture (1ère assemblée saisie)",
  "triAmendement": "au",
  "cardinaliteAmdtMultiples": "1",
  "amendementParent": {
    "@xmlns:xsi": "http://www.w3.org/2001/XMLSchema-instance",
    "@xsi:nil": "true"
  },
  "etat": "Discuté",
  "signataires": {
    "auteur": {
      "typeAuteur": "Depute",
      "acteurRef": "PA720286",
      "organeRef": {
        "@xmlns:xsi": "http://www.w3.org/2001/XMLSchema-instance",
        "@xsi:nil": "true"
      },
      "groupePolitiqueRef": "PO730958"
    },
    "cosignataires": {
      "acteurRef": [
        "PA721202",
        "PA721960",
        "PA720422",
        "PA720892",
        "PA720430",
        "PA718860",
        "PA588884",
        "PA721210",
        "PA718868",
        "PA720286",
        "PA719578",
        "PA719676",
        "PA720846",
        "PA2150",
        "PA721226",
        "PA721062",
        "PA722142"
      ]
    },
    "texteAffichable": "Mme&#160;Fiat,  Mme&#160;Autain, M.&#160;Bernalicis, M.&#160;Coquerel, Mme&#160;Taurine, Mme&#160;Rubin, M.&#160;Ruffin, M.&#160;Corbi&#232;re, M.&#160;M&#233;lenchon, Mme&#160;Obono, Mme&#160;Panot, M.&#160;Prud&apos;homme, M.&#160;Quatennens, M.&#160;Ratenon, Mme&#160;Ressiguier, M.&#160;Lachaud et M.&#160;Larive"
  },
  "pointeurFragmentTexte": {
    "missionVisee": {
      "@xmlns:xsi": "http://www.w3.org/2001/XMLSchema-instance",
      "@xsi:nil": "true"
    },
    "division": {
      "titre": "Article 30",
      "articleDesignationCourte": "ART. 30",
      "type": "ARTICLE",
      "avant_A_Apres": "A",
      "divisionRattachee": "ARTICLE 30",
      "articleAdditionnel": {
        "@xmlns:xsi": "http://www.w3.org/2001/XMLSchema-instance",
        "@xsi:nil": "true"
      },
      "chapitreAdditionnel": {
        "@xmlns:xsi": "http://www.w3.org/2001/XMLSchema-instance",
        "@xsi:nil": "true"
      },
      "urlDivisionTexteVise": "/15/textes/1019.asp#D_Article_30"
    },
    "alinea": {
      "@xmlns:xsi": "http://www.w3.org/2001/XMLSchema-instance",
      "@xsi:nil": "true"
    }
  },
  "corps": {
    "dispositif": "<p style=\"text-align: justify;\">Supprimer cet article.</p>",
    "exposeSommaire": "<p>Les auteurs de cet amendement se sont oppos&#233;s &#224; l&#8217;augmentation de la CSG pour les retrait&#233;s au moment de l&#8217;examen de cette proposition du gouvernement dans le PLFSS 2018.</p><p>Attach&#233;s &#224; la progressivit&#233; de l&#8217;imp&#244;t, les auteurs d&#233;noncent cette contribution qui taxe au m&#234;me taux tous les contribuables retrait&#233;s qui y sont assujettis.</p><p>Ils remettent aussi en cause la vision selon laquelle une personne retrait&#233;e percevant 1 200 euros pourrait &#234;tre consid&#233;r&#233;e comme assez ais&#233;e pour &#234;tre mise &#224; contribution. D&#8217;autant que ces personnes participent &#224; la relance de l&#8217;activit&#233; gr&#226;ce &#224; leur consommation courante renfor&#231;ant le march&#233; int&#233;rieur, contrairement aux b&#233;n&#233;ficiaires de la transformation de l&#8217;ISF ou de la mise en place du PFU dont l&#8217;activit&#233; &#233;conomique est souvent virtuelle et sp&#233;culative.</p><p>Les adaptations promises par le gouvernement sont insuffisantes. Seuls 100 000 retrait&#233;s seraient concern&#233;s par l&#8217;annulation de l&#8217;augmentation mais la grande masse serait toujours impact&#233;e. Les effets n&#233;fastes de cette mesure n&#8217;ont pourtant pas tard&#233; puisque le pouvoir d&#8217;achat des retrait&#233;s de la m&#233;diane inf&#233;rieure et leur consommation sont en baisse.</p><p>Enfin, les auteurs de cet amendement alertent sur le basculement du financement de la S&#233;curit&#233; sociale des cotisations vers l&#8217;imp&#244;t. Ce basculement est contraire &#224; l&#8217;esprit de la S&#233;curit&#233; sociale.</p><p>Les auteurs de cet amendement demandent donc logiquement au gouvernement d&#8217;annuler cette mesure dangereuse.</p>",
    "annexeExposeSommaire": {
      "@xmlns:xsi": "http://www.w3.org/2001/XMLSchema-instance",
      "@xsi:nil": "true"
    }
  },
  "representations": {
    "representation": {
      "nom": "PDF",
      "typeMime": {
        "type": "application",
        "subType": "PDF"
      },
      "statutRepresentation": {
        "verbatim": "true",
        "canonique": "true",
        "officielle": "true",
        "transcription": "false",
        "enregistrement": "false"
      },
      "repSource": {
        "@xmlns:xsi": "http://www.w3.org/2001/XMLSchema-instance",
        "@xsi:nil": "true"
      },
      "offset": {
        "@xmlns:xsi": "http://www.w3.org/2001/XMLSchema-instance",
        "@xsi:nil": "true"
      },
      "contenu": {
        "documentURI": "/15/amendements/1019/AN/1898.pdf"
      },
      "dateDispoRepresentation": {
        "@xmlns:xsi": "http://www.w3.org/2001/XMLSchema-instance",
        "@xsi:nil": "true"
      }
    }
  },
  "seanceDiscussion": "RUANR5L15S2018IDS21106",
  "sort": {
    "dateSaisie": "2018-06-15T23:09:38.000+02:00",
    "sortEnSeance": "Rejeté"
  },
  "dateDepot": "2018-06-07T02:00:00.000+02:00",
  "dateDistribution": "2018-06-12T02:00:00.000+02:00",
  "article99": "0",
  "loiReference": {
    "codeLoi": {
      "@xmlns:xsi": "http://www.w3.org/2001/XMLSchema-instance",
      "@xsi:nil": "true"
    },
    "divisionCodeLoi": {
      "@xmlns:xsi": "http://www.w3.org/2001/XMLSchema-instance",
      "@xsi:nil": "true"
    }
  }
}