{
  "@xmlns": "http://schemas.assemblee-nationale.fr/referentiel",
  "uid": "AMANR5L15PO59048B2272P2D1N276",
  "identifiant": {
    "legislature": "15",
    "numero": "276",
    "numRect": "0",
    "saisine": {
      "refTexteLegislatif": "PRJLANR5L15B2272",
      "numeroPartiePLF": "2",
      "organeExamen": "PO59048",
      "mentionSecondeDeliberation": "0"
    }
  },
  "numeroLong": "II-CF276",
  "etapeTexte": "1ère lecture (1ère assemblée saisie)",
  "triAmendement": "abqaaaaaaaaaaaaaaaaaaaaaaaaaaaaaaaaaaaaaaaaaaaaaaas",
  "cardinaliteAmdtMultiples": "1",
  "amendementParent": {
    "@xmlns:xsi": "http://www.w3.org/2001/XMLSchema-instance",
    "@xsi:nil": "true"
  },
  "etat": "Discuté",
  "signataires": {
    "auteur": {
      "typeAuteur": "Depute",
      "acteurRef": "PA1008",
      "organeRef": {
        "@xmlns:xsi": "http://www.w3.org/2001/XMLSchema-instance",
        "@xsi:nil": "true"
      },
      "groupePolitiqueRef": "PO758835"
    },
    "cosignataires": {
      "acteurRef": [
        "PA607553",
        "PA1008",
        "PA605069",
        "PA1809",
        "PA1592",
        "PA609590",
        "PA608172",
        "PA335532",
        "PA1198",
        "PA333818"
      ]
    },
    "texteAffichable": "M.&#160;Alain&#160;David,  M.&#160;Hutin, Mme&#160;Laurence&#160;Dumont, M.&#160;J&#233;r&#244;me&#160;Lambert, Mme&#160;Pau-Langevin, M.&#160;Potier, Mme&#160;Pires Beaune, M.&#160;Jean-Louis&#160;Bricout, Mme&#160;Rabault et M.&#160;David&#160;Habib"
  },
  "pointeurFragmentTexte": {
    "missionVisee": {
      "idMissionAN": "802",
      "libelleMission": "Aide publique au développement",
      "codeMissionPLF": "B",
      "libelleMissionPLF": "Répartition, par mission et programme, des crédits du budget général"
    },
    "division": {
      "titre": "ÉTAT B",
      "articleDesignationCourte": "ART. 38",
      "type": "ANNEXE",
      "avant_A_Apres": "A",
      "divisionRattachee": "ARTICLE 38",
      "articleAdditionnel": {
        "@xmlns:xsi": "http://www.w3.org/2001/XMLSchema-instance",
        "@xsi:nil": "true"
      },
      "chapitreAdditionnel": {
        "@xmlns:xsi": "http://www.w3.org/2001/XMLSchema-instance",
        "@xsi:nil": "true"
      },
      "urlDivisionTexteVise": "/15/textes/2272C.asp#D_ETAT_B"
    },
    "alinea": {
      "@xmlns:xsi": "http://www.w3.org/2001/XMLSchema-instance",
      "@xsi:nil": "true"
    }
  },
  "corps": {
    "exposeSommaire": "<p style=\"text-align: justify;\">L&#8217;objet de cet amendement d&#233;pos&#233; par le groupe Socialistes et apparent&#233;s vise &#224; red&#233;ployer une partie de l&#8217;importante augmentation de plus de 3 milliards d&#8217;euros des autorisations d&#8217;engagement par rapport au projet de loi de finances pour 2019.</p><p style=\"text-align: justify;\">La plus grande partie de l&#8217;augmentation moyenne de pr&#232;s de 3 milliards d&#8217;euros des cr&#233;dits d&#8217;engagement de la mission &#171;&#160;Aide publique au d&#233;veloppement&#160;&#187; par rapport au projet de loi de finances pour 2019 ne va pas en faveur de l&#8217;aide projet bilat&#233;rale mais &#224; l&#8217;aide &#233;conomique et financi&#232;re, c&#8217;est-&#224;-dire essentiellement &#224; des pr&#234;ts dont la logique veut qu&#8217;ils privil&#233;gient les pays &#233;mergents plus rentables et plus s&#251;rs que les pays pauvres tr&#232;s endett&#233;s.</p><p style=\"text-align: justify;\">De plus, malgr&#233; un montant &#233;lev&#233; d&#8217;aide projet d&#8217;un peu plus de 1 milliard d&#8217;euro en cr&#233;dits d&#8217;engagement, ce montant est en baisse de pr&#232;s de 500 millions d&#8217;euros par rapport au projet de loi de finances pour 2019, mettant en danger l&#8217;atteinte de l&#8217;objectif de 0,55&#160;% du PIB en 2022 consacr&#233;e &#224; l&#8217;aide publique au d&#233;veloppement (APD).&#160;</p><p style=\"text-align: justify;\">Le pr&#233;sent amendement vise donc &#224; r&#233;tablir pour partie &#224; son niveau de 2019 &#171;&#160;l&#8217;aide projet&#160;&#187; en affectant 100 millions d&#8217;euros initialement pr&#233;vus pour la mission &#171;&#160;aide &#233;conomique et financi&#232;re au d&#233;veloppement&#160;&#187;, dont les principaux b&#233;n&#233;ficiaires sont les grands bailleurs internationaux, &#224; la mission &#171;&#160;solidarit&#233; &#224; l&#8217;&#233;gard des pays en d&#233;veloppement&#160;&#187; qui dispense les dons projets via notamment l&#8217;AFD.&#160;</p><p style=\"text-align: justify;\">Cet amendement&#160;:</p><p style=\"text-align: justify;\">- fl&#232;che 100 millions d&#8217;euros de cr&#233;dits de paiement suppl&#233;mentaires vers l&#8217;action &#171;&#160;coop&#233;ration bilat&#233;rale&#160;&#187; (au sein du programme &#171;&#160;Solidarit&#233; &#224; l&#8217;&#233;gard des pays en d&#233;veloppement&#160;&#187;&#160;;</p><p style=\"text-align: justify;\">- et r&#233;duit de 100&#160; millions d&#8217;euros les cr&#233;dits de paiement de l&#8217;action &#171;&#160;Aide &#233;conomique et financi&#232;re multilat&#233;rale&#160;&#187; (au sein du programme &#171;&#160;Aide &#233;conomique et financi&#232;re au d&#233;veloppement&#160;&#187;).</p>",
    "annexeExposeSommaire": {
      "@xmlns:xsi": "http://www.w3.org/2001/XMLSchema-instance",
      "@xsi:nil": "true"
    },
    "cartoucheDelaiDepotDepasse": {
      "@xmlns:xsi": "http://www.w3.org/2001/XMLSchema-instance",
      "@xsi:nil": "true"
    },
    "avantAppel": {
      "@xmlns:xsi": "http://www.w3.org/2001/XMLSchema-instance",
      "@xsi:nil": "true"
    },
    "dispositifAmdtCredit": {
      "listeProgrammes": {
        "programme": [
          {
            "libelle": "Aide économique et financière au développement",
            "id": "68528",
            "AE": {
              "montantPositif": "0",
              "montantNegatif": "100000000"
            },
            "CP": {
              "montantPositif": "0",
              "montantNegatif": "100000000"
            },
            "action": "modification",
            "lignesCredits": null
          },
          {
            "libelle": "Solidarité à l'égard des pays en développement",
            "id": "68529",
            "AE": {
              "montantPositif": "100000000",
              "montantNegatif": "0"
            },
            "CP": {
              "montantPositif": "100000000",
              "montantNegatif": "0"
            },
            "action": "modification",
            "lignesCredits": null
          }
        ]
      },
      "totalAE": {
        "montantPositif": "100000000",
        "montantNegatif": "100000000",
        "solde": "0"
      },
      "totalCP": {
        "montantPositif": "100000000",
        "montantNegatif": "100000000",
        "solde": "0"
      }
    }
  },
  "representations": {
    "representation": {
      "nom": "PDF",
      "typeMime": {
        "type": "application",
        "subType": "PDF"
      },
      "statutRepresentation": {
        "verbatim": "true",
        "canonique": "true",
        "officielle": "true",
        "transcription": "false",
        "enregistrement": "false"
      },
      "repSource": {
        "@xmlns:xsi": "http://www.w3.org/2001/XMLSchema-instance",
        "@xsi:nil": "true"
      },
      "offset": {
        "@xmlns:xsi": "http://www.w3.org/2001/XMLSchema-instance",
        "@xsi:nil": "true"
      },
      "contenu": {
        "documentURI": "/15/amendements/2272C/CION_FIN/CF276.pdf"
      },
      "dateDispoRepresentation": {
        "@xmlns:xsi": "http://www.w3.org/2001/XMLSchema-instance",
        "@xsi:nil": "true"
      }
    }
  },
  "seanceDiscussion": {
    "@xmlns:xsi": "http://www.w3.org/2001/XMLSchema-instance",
    "@xsi:nil": "true"
  },
  "sort": {
    "dateSaisie": "2019-10-23T12:22:48.000+02:00",
    "sortEnSeance": "Rejeté"
  },
  "dateDepot": "2019-10-17T02:00:00.000+02:00",
  "dateDistribution": "2019-10-22T02:00:00.000+02:00",
  "article99": "0",
  "loiReference": {
    "codeLoi": {
      "@xmlns:xsi": "http://www.w3.org/2001/XMLSchema-instance",
      "@xsi:nil": "true"
    },
    "divisionCodeLoi": {
      "@xmlns:xsi": "http://www.w3.org/2001/XMLSchema-instance",
      "@xsi:nil": "true"
    }
  }
}