{
  "@xmlns": "http://schemas.assemblee-nationale.fr/referentiel",
  "uid": "AMANR5L15SEA717460BTC1548P0D1N424",
  "identifiant": {
    "legislature": "15",
    "numero": "424",
    "numRect": "0",
    "saisine": {
      "refTexteLegislatif": "PRJLANR5L15BTC1548",
      "numeroPartiePLF": "0",
      "organeExamen": "PO717460",
      "mentionSecondeDeliberation": "0"
    }
  },
  "numeroLong": "424",
  "etapeTexte": "Nouvelle Lecture",
  "triAmendement": "aaeaaaaaaaaaaaaaaaaaaaaaaaaaaaaaaaaaaaaaaaaaaaaaaabg",
  "cardinaliteAmdtMultiples": "1",
  "amendementParent": {
    "@xmlns:xsi": "http://www.w3.org/2001/XMLSchema-instance",
    "@xsi:nil": "true"
  },
  "etat": "Discuté",
  "signataires": {
    "auteur": {
      "typeAuteur": "Depute",
      "acteurRef": "PA266797",
      "organeRef": {
        "@xmlns:xsi": "http://www.w3.org/2001/XMLSchema-instance",
        "@xsi:nil": "true"
      },
      "groupePolitiqueRef": "PO730934"
    },
    "cosignataires": {
      "acteurRef": [
        "PA267204",
        "PA267735",
        "PA721410",
        "PA266808",
        "PA721816",
        "PA718850",
        "PA721126",
        "PA1327",
        "PA721968",
        "PA1874",
        "PA719272",
        "PA856",
        "PA223837",
        "PA721054",
        "PA606098",
        "PA721506",
        "PA267318",
        "PA2529",
        "PA606712",
        "PA720644",
        "PA721678",
        "PA609726",
        "PA1012",
        "PA709315",
        "PA267200",
        "PA266797",
        "PA342935",
        "PA266776",
        "PA722390",
        "PA332523",
        "PA746",
        "PA2960",
        "PA643134",
        "PA2377",
        "PA719946",
        "PA718838",
        "PA718784",
        "PA767",
        "PA720630",
        "PA718780",
        "PA330909",
        "PA720684",
        "PA720210",
        "PA266774",
        "PA1695",
        "PA721046",
        "PA267450",
        "PA334843",
        "PA2796",
        "PA2086",
        "PA998",
        "PA1630",
        "PA721636",
        "PA267440",
        "PA720100",
        "PA720586",
        "PA2792",
        "PA643103",
        "PA923",
        "PA267785",
        "PA346054",
        "PA721070",
        "PA607090",
        "PA2155",
        "PA713448",
        "PA1498",
        "PA721474",
        "PA267901",
        "PA266793",
        "PA605991",
        "PA330788",
        "PA267324",
        "PA267260",
        "PA334149",
        "PA720386",
        "PA759192"
      ]
    },
    "texteAffichable": "M.&#160;Gosselin,  M.&#160;Jacob, M.&#160;Aubert, Mme&#160;Bassire, Mme&#160;Beauvais, Mme&#160;Bonnivard, M.&#160;Bony, M.&#160;Boucard, Mme&#160;Brenier, M.&#160;Brochand, M.&#160;Brun, M.&#160;Carrez, M.&#160;Cattin, M.&#160;Cherpion, M.&#160;Cordier, Mme&#160;Corneloup, M.&#160;Cornut-Gentille, Mme&#160;Dalloz, M.&#160;Dassault, M.&#160;de Ganay, M.&#160;de la Verpilli&#232;re, M.&#160;R&#233;mi&#160;Delatte, M.&#160;Descoeur, M.&#160;Di Filippo, M.&#160;Diard, Mme&#160;Marianne&#160;Dubois, M.&#160;Pierre-Henri&#160;Dumont, M.&#160;Fasquelle, M.&#160;Ferrara, M.&#160;Forissier, M.&#160;Furst, M.&#160;Gaultier, Mme&#160;Genevard, M.&#160;Goasguen, M.&#160;Grelier, Mme&#160;Guion-Firmin, M.&#160;Herbillon, M.&#160;Huyghe, M.&#160;Kamardine, Mme&#160;Kuster, M.&#160;Larriv&#233;, M.&#160;Le Fur, M.&#160;Lorion, M.&#160;Lurton, M.&#160;Emmanuel&#160;Maquet, M.&#160;Marleix, M.&#160;Marlin, M.&#160;Menuel, Mme&#160;Meunier, M.&#160;Minot, M.&#160;Nury, M.&#160;Parigi, M.&#160;Pauget, M.&#160;Peltier, M.&#160;Perrut, Mme&#160;Poletti, M.&#160;Poudroux, M.&#160;Pradi&#233;, Mme&#160;Ramassamy, M.&#160;Reda, M.&#160;Reiss, M.&#160;Reitzer, M.&#160;Reyn&#232;s, M.&#160;Rolland, M.&#160;Sermier, M.&#160;Taugourdeau, M.&#160;Teissier, Mme&#160;Trastour-Isnart, Mme&#160;Valentin, M.&#160;Vatin, M.&#160;Verch&#232;re, M.&#160;Viala, M.&#160;Vialay, M.&#160;Jean-Pierre&#160;Vigier, M.&#160;Viry et M.&#160;Woerth"
  },
  "pointeurFragmentTexte": {
    "missionVisee": {
      "@xmlns:xsi": "http://www.w3.org/2001/XMLSchema-instance",
      "@xsi:nil": "true"
    },
    "division": {
      "titre": "Article PREMIER",
      "articleDesignationCourte": "ART. PREMIER",
      "type": "ARTICLE",
      "avant_A_Apres": "A",
      "divisionRattachee": "ARTICLE PREMIER",
      "articleAdditionnel": {
        "@xmlns:xsi": "http://www.w3.org/2001/XMLSchema-instance",
        "@xsi:nil": "true"
      },
      "chapitreAdditionnel": {
        "@xmlns:xsi": "http://www.w3.org/2001/XMLSchema-instance",
        "@xsi:nil": "true"
      },
      "urlDivisionTexteVise": "/15/textes/1548.asp#D_Article_1er"
    },
    "alinea": {
      "avant_A_Apres": {
        "@xmlns:xsi": "http://www.w3.org/2001/XMLSchema-instance",
        "@xsi:nil": "true"
      },
      "numero": "3",
      "alineaDesignation": {
        "@xmlns:xsi": "http://www.w3.org/2001/XMLSchema-instance",
        "@xsi:nil": "true"
      }
    }
  },
  "corps": {
    "dispositif": "<p style=\"text-align: justify;\">I.&#160;&#8211;&#160;R&#233;diger ainsi la seconde ligne du tableau de l&#8217;alin&#233;a&#160;3&#160;:</p><p style=\"text-align: justify;\">&#171;</p><table style=\"border-collapse: collapse; height: 29px;\" width=\"253\"><tbody><tr><td style=\"white-space: normal; border: 1px solid #000000; width: 47.4px;\">&#160;6,98</td><td style=\"white-space: normal; border: 1px solid #000000; width: 47.4px;\">7,29</td><td style=\"white-space: normal; border: 1px solid #000000; width: 47.4px;\">7,65</td><td style=\"white-space: normal; border: 1px solid #000000; width: 47.4px;\">8,20</td><td style=\"white-space: normal; border: 1px solid #000000; width: 47.4px;\">8,99</td></tr></tbody></table><p style=\"text-align: right;\">&#160;&#187;</p><p style=\"text-align: justify;\">II.&#160;&#8211;&#160;En cons&#233;quence, &#224; l&#8217;alin&#233;a&#160;4, substituer au nombre&#160;:</p><p style=\"text-align: justify;\">&#171;&#160;6 500&#160;&#187;</p><p style=\"text-align: justify;\">le nombre&#160;:</p><p style=\"text-align: justify;\">&#171;&#160;13 728&#160;&#187;.</p><p style=\"text-align: justify;\">III.&#160;&#8211;&#160;En cons&#233;quence, r&#233;diger ainsi les deuxi&#232;me &#224; derni&#232;re colonnes de la seconde ligne du tableau de l&#8217;alin&#233;a&#160;5&#160;:</p><p style=\"text-align: justify;\">&#171;&#160;</p><table style=\"border-collapse: collapse; height: 32px;\" width=\"260\"><tbody><tr><td style=\"white-space: normal; border: 1px solid #000000; width: 48.8px;\">2987</td><td style=\"white-space: normal; border: 1px solid #000000; width: 48.8px;\">3095</td><td style=\"white-space: normal; border: 1px solid #000000; width: 48.8px;\">3213</td><td style=\"white-space: normal; border: 1px solid #000000; width: 48.8px;\">3333</td></tr></tbody></table><p style=\"text-align: right;\">&#187;</p><p style=\"text-align: justify;\">IV.&#160;&#8211;&#160;En cons&#233;quence, supprimer l&#8217;alin&#233;a&#160;6.</p>",
    "exposeSommaire": "<p style=\"text-align: justify;\">Cet amendement reprend ce que le S&#233;nat avait adopt&#233; en premi&#232;re lecture et qui acte un v&#233;ritable budget pour la justice.&#160;</p><p style=\"text-align: justify;\">L&#8217;article&#160;1<sup>er</sup>&#160;du projet de loi reprend la trajectoire budg&#233;taire de la mission &#171;&#160;Justice&#160;&#187; d&#233;j&#224; vot&#233;e par le Parlement dans la loi du 22 janvier 2018 de programmation des finances publiques pour les ann&#233;es 2018 &#224; 2022.</p><p style=\"text-align: justify;\">L&#8217;effort propos&#233; appara&#238;t n&#233;anmoins insuffisant pour assurer le redressement budg&#233;taire des juridictions et de l&#8217;administration p&#233;nitentiaire.</p><p style=\"text-align: justify;\">Le projet de loi pr&#233;voit une augmentation des cr&#233;dits de 23,5&#160;% sur l&#8217;ensemble de la p&#233;riode 2018&#8209;2022 par rapport &#224; 2017, en passant de 7 milliards en 2018 &#224; 8,3 milliards d&#8217;euros constants en 2022, hors charges de pensions, soit une hausse de 1,3 milliard d&#8217;euros.</p><p style=\"text-align: justify;\">Or, dans la proposition de loi d&#8217;orientation et de programmation pour le redressement de la justice adopt&#233;e le 24 octobre 2017, le S&#233;nat avait adopt&#233; une trajectoire budg&#233;taire bien plus ambitieuse, &#224; la hauteur des enjeux et du manque actuel de moyens de la justice.</p><p style=\"text-align: justify;\">Sur la m&#234;me p&#233;riode de 2018 &#224; 2022, cette trajectoire pr&#233;voyait une augmentation des cr&#233;dits de 33,8&#160;%, pour atteindre 8,99 milliards d&#8217;euros, soit une hausse de 1,9 milliard d&#8217;euros, hors charges de pensions.</p><p style=\"text-align: justify;\">S&#8217;agissant des cr&#233;ations d&#8217;emplois, le projet de loi pr&#233;voit la cr&#233;ation de 6&#160;500 emplois au sein du minist&#232;re de la justice entre 2018 et 2022, quand la proposition de loi adopt&#233;e par le S&#233;nat en pr&#233;voyait 13 728.</p><p style=\"text-align: justify;\">Le pr&#233;sent amendement tend donc &#224; reprendre la trajectoire budg&#233;taire d&#233;j&#224; vot&#233;e par le S&#233;nat, de fa&#231;on &#224; aboutir, en 2022, &#224; 33,8&#160;% d&#8217;augmentation du budget, hors charges de pensions,&#160;et &#224; 13&#160;728 cr&#233;ations d&#8217;emploi suppl&#233;mentaires, par rapport &#224; 2017.</p><p style=\"text-align: justify;\">La loi de finances pour 2018 &#233;tant en cours d&#8217;ex&#233;cution, deux ajustements sont r&#233;alis&#233;s par rapport aux montants adopt&#233;s dans la proposition de loi pour le redressement de la justice&#160;:</p><p style=\"text-align: justify;\">-&#160;l&#8217;amendement reprend le montant des cr&#233;dits de paiement et le plafond de cr&#233;ation d&#8217;emplois vot&#233;s dans la loi de finances pour 2018 (le nombre des cr&#233;ations d&#8217;emplois est donc ajust&#233; sur les ann&#233;es suivantes pour aboutir &#224; 13&#160;728 cr&#233;ations d&#8217;emplois au total)&#160;;</p><p style=\"text-align: justify;\">-&#160;il reprend&#160;&#233;galement, pour 2019 et 2020, les montants vot&#233;s dans la loi de programmation des finances publiques, qui convergeaient avec la proposition de loi pour le redressement de la justice adopt&#233;e par le S&#233;nat.</p><p style=\"text-align: justify;\">En outre, le pr&#233;sent amendement supprime la mention selon laquelle la programmation fera l&#8217;objet d&#8217;actualisations d&#8217;ici 2021. En effet, il n&#8217;est nul besoin de le pr&#233;voir puisque la valeur de l&#8217;article&#160;1er, purement programmatique, n&#8217;est aucunement contraignante. Les cr&#233;dits et les emplois devront &#234;tre formellement vot&#233;s chaque ann&#233;e par la loi de finances, conform&#233;ment &#224; la jurisprudence du Conseil constitutionnel.</p>",
    "annexeExposeSommaire": {
      "@xmlns:xsi": "http://www.w3.org/2001/XMLSchema-instance",
      "@xsi:nil": "true"
    },
    "cartoucheDelaiDepotDepasse": {
      "@xmlns:xsi": "http://www.w3.org/2001/XMLSchema-instance",
      "@xsi:nil": "true"
    }
  },
  "representations": {
    "representation": {
      "nom": "PDF",
      "typeMime": {
        "type": "application",
        "subType": "PDF"
      },
      "statutRepresentation": {
        "verbatim": "true",
        "canonique": "true",
        "officielle": "true",
        "transcription": "false",
        "enregistrement": "false"
      },
      "repSource": {
        "@xmlns:xsi": "http://www.w3.org/2001/XMLSchema-instance",
        "@xsi:nil": "true"
      },
      "offset": {
        "@xmlns:xsi": "http://www.w3.org/2001/XMLSchema-instance",
        "@xsi:nil": "true"
      },
      "contenu": {
        "documentURI": "/15/amendements/1548/AN/424.pdf"
      },
      "dateDispoRepresentation": {
        "@xmlns:xsi": "http://www.w3.org/2001/XMLSchema-instance",
        "@xsi:nil": "true"
      }
    }
  },
  "seanceDiscussion": "RUANR5L15S2019IDS21447",
  "sort": {
    "dateSaisie": "2019-01-15T23:20:46.000+01:00",
    "sortEnSeance": "Rejeté"
  },
  "dateDepot": "2019-01-10T01:00:00.000+01:00",
  "dateDistribution": "2019-01-14T01:00:00.000+01:00",
  "article99": "0",
  "loiReference": {
    "codeLoi": {
      "@xmlns:xsi": "http://www.w3.org/2001/XMLSchema-instance",
      "@xsi:nil": "true"
    },
    "divisionCodeLoi": {
      "@xmlns:xsi": "http://www.w3.org/2001/XMLSchema-instance",
      "@xsi:nil": "true"
    }
  }
}