{
  "@xmlns": "http://schemas.assemblee-nationale.fr/referentiel",
  "uid": "AMANR5L15PO766718B2187P0D1N2029",
  "identifiant": {
    "legislature": "15",
    "numero": "2029",
    "numRect": "0",
    "saisine": {
      "refTexteLegislatif": "PRJLANR5L15B2187",
      "numeroPartiePLF": "0",
      "organeExamen": "PO766718",
      "mentionSecondeDeliberation": "0"
    }
  },
  "numeroLong": "2029",
  "etapeTexte": "1ère lecture (1ère assemblée saisie)",
  "triAmendement": "duaaaaaaaaaaaaaaaaaaaaaaaaaaaaaaaaaaaaaaaaaaaaaaaawaak",
  "cardinaliteAmdtMultiples": "1",
  "amendementParent": {
    "@xmlns:xsi": "http://www.w3.org/2001/XMLSchema-instance",
    "@xsi:nil": "true"
  },
  "etat": "Discuté",
  "signataires": {
    "auteur": {
      "typeAuteur": "Depute",
      "acteurRef": "PA718694",
      "organeRef": {
        "@xmlns:xsi": "http://www.w3.org/2001/XMLSchema-instance",
        "@xsi:nil": "true"
      },
      "groupePolitiqueRef": "PO730964"
    },
    "cosignataires": {
      "acteurRef": [
        "PA722252",
        "PA721776",
        "PA718910",
        "PA719624",
        "PA721600",
        "PA721726",
        "PA760658",
        "PA718728",
        "PA722090",
        "PA721296",
        "PA718706",
        "PA722046",
        "PA2449",
        "PA643205",
        "PA719350",
        "PA722194",
        "PA718694",
        "PA642788",
        "PA719108",
        "PA719496",
        "PA721262",
        "PA720116",
        "PA721946",
        "PA719072",
        "PA720446",
        "PA721466",
        "PA720154",
        "PA722126",
        "PA721142",
        "PA722268",
        "PA721852",
        "PA719154",
        "PA720074",
        "PA719858",
        "PA721888"
      ]
    },
    "texteAffichable": "M.&#160;Marc&#160;Delatte,  M.&#160;Chiche, Mme&#160;Berg&#233;, M.&#160;Baich&#232;re, Mme&#160;Brunet, M.&#160;Cabar&#233;, M.&#160;Chouat, Mme&#160;Couillard, Mme&#160;Dubr&#233;-Chirat, Mme&#160;Fontaine-Domeizel, Mme&#160;Forteza, M.&#160;Gouffier-Cha, M.&#160;G&#233;rard, Mme&#160;Janvier, Mme&#160;Lang, Mme&#160;Lebec, Mme&#160;Limon, Mme&#160;Liso, M.&#160;Marilossian, M.&#160;Martin, Mme&#160;Mauborgne, M.&#160;Mesnier, Mme&#160;Pitollat, M.&#160;Pont, Mme&#160;Provendier, Mme&#160;P&#233;telle, M.&#160;Raphan, Mme&#160;Rixain, Mme&#160;Rossi, Mme&#160;Tamarelle-Verhaeghe, Mme&#160;Vanceunebrock-Mialon, M.&#160;Vuilletet, M.&#160;V&#233;ran, Mme&#160;Wonner, M.&#160;Le Gendre et les membres du groupe La R&#233;publique en Marche"
  },
  "pointeurFragmentTexte": {
    "missionVisee": {
      "@xmlns:xsi": "http://www.w3.org/2001/XMLSchema-instance",
      "@xsi:nil": "true"
    },
    "division": {
      "titre": "Article 15",
      "articleDesignationCourte": "ART. 15",
      "type": "ARTICLE",
      "avant_A_Apres": "A",
      "divisionRattachee": "ARTICLE 15",
      "articleAdditionnel": {
        "@xmlns:xsi": "http://www.w3.org/2001/XMLSchema-instance",
        "@xsi:nil": "true"
      },
      "chapitreAdditionnel": {
        "@xmlns:xsi": "http://www.w3.org/2001/XMLSchema-instance",
        "@xsi:nil": "true"
      },
      "urlDivisionTexteVise": "/15/textes/2187.asp#D_Article_15"
    },
    "alinea": {
      "avant_A_Apres": {
        "@xmlns:xsi": "http://www.w3.org/2001/XMLSchema-instance",
        "@xsi:nil": "true"
      },
      "numero": "4",
      "alineaDesignation": {
        "@xmlns:xsi": "http://www.w3.org/2001/XMLSchema-instance",
        "@xsi:nil": "true"
      }
    }
  },
  "corps": {
    "dispositif": "<p style=\"text-align: justify;\">&#192; l&#8217;alin&#233;a&#160;4, apr&#232;s le mot&#160;: </p><p style=\"text-align: justify;\">&#171;&#160;extra-embryonnaires&#160;&#187;, </p><p style=\"text-align: justify;\">ins&#233;rer les mots&#160;:</p><p style=\"text-align: justify;\">&#171;&#160;ou leur insertion dans un embryon animal dans le but de son transfert chez la femelle&#160;&#187;.</p>",
    "exposeSommaire": "<p style=\"text-align: justify;\">En 2011, le l&#233;gislateur a consacr&#233; l&#8217;interdiction de cr&#233;er des embryons chim&#233;riques. Toutefois, il a pos&#233; cet interdit dans le code de la sant&#233; publique dans une partie consacr&#233;e &#224; la &#171;&#160;sant&#233; sexuelle et reproductive, droits de la femme et protection de la sant&#233; de l&#8217;enfant, de l&#8217;adolescent et du jeune adulte&#160;&#187;, et sans d&#233;finir cette notion, ce qui pose question quant &#224; son application aux nouvelles recherches r&#233;alis&#233;es sur l&#8217;embryon animal. Le Conseil d&#8217;&#201;tat rel&#232;ve ainsi dans son rapport sur la r&#233;vision de la loi de bio&#233;thique que cet interdit ne semble pas avoir vocation &#224; couvrir certaines recherches utilisant des techniques innovantes telles que l&#8217;insertion de cellules iPS humaines dans des embryons animaux pour v&#233;rifier leur pluripotence ou celles men&#233;es en vue de r&#233;aliser des greffes, et indique qu&#8217;une nouvelle disposition pourrait &#234;tre envisag&#233;e dans la loi.</p><p style=\"text-align: justify;\">Des recherches r&#233;centes men&#233;es chez l&#8217;embryon animal consistant &#224; explorer la possibilit&#233; d&#8217;obtenir des organes humains d&#233;velopp&#233;s &#224; partir de cellules souches pluripotentes humaines chez l&#8217;animal ouvrent aujourd&#8217;hui une voie de recherche d&#8217;int&#233;r&#234;t. La plupart de ces recherches ne conduisent pas au d&#233;veloppement in utero d&#8217;un embryon, et il n&#8217;y a donc aucun risque de faire na&#238;tre un animal porteur de cellules, de tissus ou d&#8217;organes humains. Toutefois, certaines peuvent donner lieu &#224; un transfert d&#8217;embryon et soul&#232;vent des interrogations &#233;thiques tenant notamment au franchissement de la barri&#232;re des esp&#232;ces. Dans son avis 129, le Comit&#233; consultatif national d&#8217;&#233;thique indique, pour ces raisons, que &#171;&#160;sans &#234;tre interdite, la cr&#233;ation d&#8217;embryons chim&#233;riques impliquant l&#8217;insertion dans un embryon animal de cellules souches pluripotentes&#160;&#8211;&#160;quelle qu&#8217;en soit la source, CSEh ou iPS, pourrait faire l&#8217;objet d&#8217;une &#233;valuation et d&#8217;un encadrement par une instance ad hoc, multidisciplinaire et incluant des chercheurs connaissant les questions &#233;thiques chez l&#8217;animal, a fortiori si ces embryons sont transf&#233;r&#233;s dans l&#8217;ut&#233;rus d&#8217;un animal et que la naissance d&#8217;animaux chim&#232;res est envisag&#233;e&#160;&#187;.</p><p style=\"text-align: justify;\">En cons&#233;quence, il est propos&#233;, au-del&#224; de la r&#233;affirmation &#224; l&#8217;article&#160;17 du projet de loi de l&#8217;interdit de modifier un embryon humain par adjonction de cellules provenant d&#8217;autres esp&#232;ces et dans l&#8217;esprit de la mesure pr&#233;vue &#224; l&#8217;article&#160;15 qui consiste &#224; mettre en place le contr&#244;le de certaines utilisations en recherche des iPS humaines, de soumettre &#224; d&#233;claration &#224; l&#8217;Agence de la biom&#233;decine, les recherches consistant en l&#8217;insertion d&#8217;iPS dans un embryon animal si le transfert de l&#8217;embryon chez la femelle est pr&#233;vu. Ces recherches seront ainsi soumises &#224; la m&#234;me proc&#233;dure que les autres voies de recherche n&#233;cessitant une attention particuli&#232;re, telles que celles ayant pour objet la diff&#233;rentiation de ces cellules en gam&#232;tes.</p>",
    "annexeExposeSommaire": {
      "@xmlns:xsi": "http://www.w3.org/2001/XMLSchema-instance",
      "@xsi:nil": "true"
    },
    "cartoucheDelaiDepotDepasse": {
      "@xmlns:xsi": "http://www.w3.org/2001/XMLSchema-instance",
      "@xsi:nil": "true"
    },
    "avantAppel": {
      "@xmlns:xsi": "http://www.w3.org/2001/XMLSchema-instance",
      "@xsi:nil": "true"
    }
  },
  "representations": {
    "representation": {
      "nom": "PDF",
      "typeMime": {
        "type": "application",
        "subType": "PDF"
      },
      "statutRepresentation": {
        "verbatim": "true",
        "canonique": "true",
        "officielle": "true",
        "transcription": "false",
        "enregistrement": "false"
      },
      "repSource": {
        "@xmlns:xsi": "http://www.w3.org/2001/XMLSchema-instance",
        "@xsi:nil": "true"
      },
      "offset": {
        "@xmlns:xsi": "http://www.w3.org/2001/XMLSchema-instance",
        "@xsi:nil": "true"
      },
      "contenu": {
        "documentURI": "/15/amendements/2187/CSBIOETH/2029.pdf"
      },
      "dateDispoRepresentation": {
        "@xmlns:xsi": "http://www.w3.org/2001/XMLSchema-instance",
        "@xsi:nil": "true"
      }
    }
  },
  "seanceDiscussion": {
    "@xmlns:xsi": "http://www.w3.org/2001/XMLSchema-instance",
    "@xsi:nil": "true"
  },
  "sort": {
    "dateSaisie": "2019-09-13T17:27:36.000+02:00",
    "sortEnSeance": "Adopté"
  },
  "dateDepot": "2019-09-05T02:00:00.000+02:00",
  "dateDistribution": "2019-09-11T02:00:00.000+02:00",
  "article99": "0",
  "loiReference": {
    "codeLoi": {
      "@xmlns:xsi": "http://www.w3.org/2001/XMLSchema-instance",
      "@xsi:nil": "true"
    },
    "divisionCodeLoi": {
      "@xmlns:xsi": "http://www.w3.org/2001/XMLSchema-instance",
      "@xsi:nil": "true"
    }
  }
}