{
  "@xmlns": "http://schemas.assemblee-nationale.fr/referentiel",
  "uid": "AMANR5L15PO420120B0904P0D1N645",
  "identifiant": {
    "legislature": "15",
    "numero": "645",
    "numRect": "0",
    "saisine": {
      "refTexteLegislatif": "PRJLANR5L15B0904",
      "numeroPartiePLF": "0",
      "organeExamen": "PO420120",
      "mentionSecondeDeliberation": "0"
    }
  },
  "numeroLong": "AS645",
  "etapeTexte": "1ère lecture (1ère assemblée saisie)",
  "triAmendement": "bi",
  "cardinaliteAmdtMultiples": "1",
  "amendementParent": {
    "@xmlns:xsi": "http://www.w3.org/2001/XMLSchema-instance",
    "@xsi:nil": "true"
  },
  "etat": "Discuté",
  "signataires": {
    "auteur": {
      "typeAuteur": "Depute",
      "acteurRef": "PA720422",
      "organeRef": {
        "@xmlns:xsi": "http://www.w3.org/2001/XMLSchema-instance",
        "@xsi:nil": "true"
      },
      "groupePolitiqueRef": "PO730958"
    },
    "cosignataires": {
      "acteurRef": [
        "PA720422",
        "PA720846",
        "PA721226",
        "PA588884",
        "PA718860",
        "PA721202",
        "PA721062",
        "PA720430",
        "PA721960",
        "PA720892",
        "PA719578",
        "PA722142",
        "PA720286",
        "PA719676",
        "PA721210",
        "PA718868",
        "PA2150"
      ]
    },
    "texteAffichable": "M.&#160;Quatennens,  Mme&#160;Autain, M.&#160;Bernalicis, M.&#160;Coquerel, M.&#160;Corbi&#232;re, Mme&#160;Fiat, M.&#160;Lachaud, M.&#160;Larive, M.&#160;M&#233;lenchon, Mme&#160;Obono, Mme&#160;Panot, M.&#160;Prud&apos;homme, M.&#160;Ratenon, Mme&#160;Ressiguier, Mme&#160;Rubin, M.&#160;Ruffin et Mme&#160;Taurine"
  },
  "pointeurFragmentTexte": {
    "missionVisee": {
      "@xmlns:xsi": "http://www.w3.org/2001/XMLSchema-instance",
      "@xsi:nil": "true"
    },
    "division": {
      "titre": "Article 65",
      "articleDesignationCourte": "APRÈS ART. 65",
      "type": "ARTICLE",
      "avant_A_Apres": "Après",
      "divisionRattachee": "APRÈS L'ARTICLE 65, insérer l'article suivant:",
      "articleAdditionnel": "1",
      "chapitreAdditionnel": {
        "@xmlns:xsi": "http://www.w3.org/2001/XMLSchema-instance",
        "@xsi:nil": "true"
      },
      "urlDivisionTexteVise": "/15/textes/0904.asp#D_Article_65"
    },
    "alinea": {
      "@xmlns:xsi": "http://www.w3.org/2001/XMLSchema-instance",
      "@xsi:nil": "true"
    }
  },
  "corps": {
    "dispositif": "<p>Apr&#232;s l&#8217;article&#160;25&#160;<i>decies</i> de la loi n&#176;&#160;83&#8209;634 du 13&#160;juillet 1983 portant droits et obligations des fonctionnaires, il est ins&#233;r&#233; un article&#160;25&#160;<i>undecies</i> ainsi r&#233;dig&#233;&#160;:</p><p>&#171;&#160;<i>Art.&#160;25&#160;undecies.</i>&#160;&#8211;&#160;Il est interdit &#224; tout ancien fonctionnaire ou agent public d&#8217;exercer une activit&#233; de conseil qui a trait directement ou indirectement aux missions de service public attach&#233;es &#224; ses anciennes fonctions pendant un d&#233;lai de dix ans.&#160;&#187;</p>",
    "exposeSommaire": "<p style=\"text-align: justify;\">Afin de pr&#233;venir toute situation de conflit d&#8217;int&#233;r&#234;t et de garantir l&#8217;entier engagement du fonctionnaire au service de l&#8217;int&#233;r&#234;t g&#233;n&#233;ral, le passage dans le priv&#233; pour des activit&#233;s de conseils qui auraient trait directement ou indirectement aux missions de service public attach&#233;es &#224; ses anciennes fonctions ne peut &#234;tre effectu&#233; avant une p&#233;riode d&#8217;attente de dix ans.</p><p style=\"text-align: justify;\">Carnet d&#8217;adresse, connaissance du fonctionnement intime des institutions, leviers relationnels, sont autant de ressources qu&#8217;une entreprise priv&#233;e peut esp&#233;rer trouver en la personne d&#8217;un fonctionnaire de l&#8217;&#201;tat. Les situations de conflit d&#8217;int&#233;r&#234;t que cela engendre sont pr&#233;judiciables aux int&#233;r&#234;ts de la Nation et nuisent &#224; la probit&#233; des agents de l&#8217;&#201;tat.</p>",
    "annexeExposeSommaire": {
      "@xmlns:xsi": "http://www.w3.org/2001/XMLSchema-instance",
      "@xsi:nil": "true"
    }
  },
  "representations": {
    "representation": {
      "nom": "PDF",
      "typeMime": {
        "type": "application",
        "subType": "PDF"
      },
      "statutRepresentation": {
        "verbatim": "true",
        "canonique": "true",
        "officielle": "true",
        "transcription": "false",
        "enregistrement": "false"
      },
      "repSource": {
        "@xmlns:xsi": "http://www.w3.org/2001/XMLSchema-instance",
        "@xsi:nil": "true"
      },
      "offset": {
        "@xmlns:xsi": "http://www.w3.org/2001/XMLSchema-instance",
        "@xsi:nil": "true"
      },
      "contenu": {
        "documentURI": "/15/amendements/0904/CION-SOC/AS645.pdf"
      },
      "dateDispoRepresentation": {
        "@xmlns:xsi": "http://www.w3.org/2001/XMLSchema-instance",
        "@xsi:nil": "true"
      }
    }
  },
  "seanceDiscussion": {
    "@xmlns:xsi": "http://www.w3.org/2001/XMLSchema-instance",
    "@xsi:nil": "true"
  },
  "sort": {
    "dateSaisie": "2018-06-01T01:47:47.000+02:00",
    "sortEnSeance": "Rejeté"
  },
  "dateDepot": "2018-05-25T02:00:00.000+02:00",
  "dateDistribution": "2018-05-29T02:00:00.000+02:00",
  "article99": "0",
  "loiReference": {
    "codeLoi": "83-634",
    "divisionCodeLoi": "25 undecies"
  }
}