{
  "@xmlns": "http://schemas.assemblee-nationale.fr/referentiel",
  "uid": "AMANR5L15PO59048B0235P2D1N519",
  "identifiant": {
    "legislature": "15",
    "numero": "519",
    "numRect": "0",
    "saisine": {
      "refTexteLegislatif": "PRJLANR5L15B0235",
      "numeroPartiePLF": "2",
      "organeExamen": "PO59048",
      "mentionSecondeDeliberation": "0"
    }
  },
  "numeroLong": "II-CF519",
  "etapeTexte": "1ère lecture (1ère assemblée saisie)",
  "triAmendement": "bcs",
  "cardinaliteAmdtMultiples": "1",
  "amendementParent": {
    "@xmlns:xsi": "http://www.w3.org/2001/XMLSchema-instance",
    "@xsi:nil": "true"
  },
  "etat": "Discuté",
  "signataires": {
    "auteur": {
      "typeAuteur": "Depute",
      "acteurRef": "PA721486",
      "organeRef": {
        "@xmlns:xsi": "http://www.w3.org/2001/XMLSchema-instance",
        "@xsi:nil": "true"
      },
      "groupePolitiqueRef": "PO730952"
    },
    "cosignataires": {
      "acteurRef": [
        "PA695100",
        "PA721110",
        "PA720696",
        "PA721486"
      ]
    },
    "texteAffichable": "M.&#160;Naegelen,  Mme&#160;Descamps, M.&#160;Meyer&#160;Habib et Mme&#160;Sanquer"
  },
  "pointeurFragmentTexte": {
    "missionVisee": {
      "@xmlns:xsi": "http://www.w3.org/2001/XMLSchema-instance",
      "@xsi:nil": "true"
    },
    "division": {
      "titre": "Article 42",
      "articleDesignationCourte": "ART. 42",
      "type": "ARTICLE",
      "avant_A_Apres": "A",
      "divisionRattachee": "ARTICLE 42",
      "articleAdditionnel": {
        "@xmlns:xsi": "http://www.w3.org/2001/XMLSchema-instance",
        "@xsi:nil": "true"
      },
      "chapitreAdditionnel": {
        "@xmlns:xsi": "http://www.w3.org/2001/XMLSchema-instance",
        "@xsi:nil": "true"
      },
      "urlDivisionTexteVise": "/15/textes/0235C.asp#D_Article_42"
    },
    "alinea": {
      "avant_A_Apres": "A",
      "numero": "2",
      "alineaDesignation": "Alinéa 2"
    }
  },
  "corps": {
    "dispositif": "<p>I.- Supprimer l&#8217;alin&#233;a 2.</p><p>II.- En cons&#233;quence, supprimer l&#8217;alin&#233;a 10.</p><p>III.- En cons&#233;quence, &#224; l&#8217;alin&#233;a 11, substituer les mots &#171; le 2&#176; du I et les II &#224; IV &#187; par &#171; le pr&#233;sent article &#187;.</p>",
    "exposeSommaire": "<p>L&#8217;article 42 du pr&#233;sent projet de loi vise &#224; r&#233;duire le cr&#233;dit d&#8217;imp&#244;t pour la comp&#233;titivit&#233; et l&#8217;emploi (CICE) de 7 &#224; 6 points sur les salaires inf&#233;rieurs &#224; 2,5 fois le salaire minimum de croissance (SMIC). Cette mesure s'inscrit dans la transformation voulue par le gouvernement &#224; compter de 2019 du CICE en baisse de cotisations sociales p&#233;rennes pour les entreprises et dont elles pourront b&#233;n&#233;ficier de fa&#231;on imm&#233;diate. Cette transformation va dans le bon sens puisqu&#8217;elle p&#233;rennise les all&#232;gements de charges patronales tout en rem&#233;diant au probl&#232;me du d&#233;calage dans le temps du gain du CICE par rapport au fait g&#233;n&#233;rateur.</p><p>N&#233;anmoins le gouvernement ne va pas assez loin puisqu&#8217;il baisse le taux du CICE de 7&#160;% &#224; 6&#160;%, si bien que les entreprises y perdent 3,1 milliards d&#8217;euros. Cette perte dans la comptabilit&#233; des entreprises, d&#232;s janvier 218, risque de remettre en cause leur &#233;quilibre financier puisqu'elle &#233;tait difficile &#224; anticiper. R&#233;duire le CICE de 7 &#224; 6% de la masse salariale aurait des cons&#233;quences n&#233;fastes en augmentant le co&#251;t du travail. Les secteurs &#224; forte intensit&#233; de main d&#8217;&#339;uvre seraient particuli&#232;rement touch&#233;s par cette mesure.</p><p>Cet amendement propose de conserver pendant encore un an le CICE &#224; son taux de 7% et vise donc &#224; faire r&#233;ellement baisser le co&#251;t du travail pour les entreprises.</p>",
    "annexeExposeSommaire": {
      "@xmlns:xsi": "http://www.w3.org/2001/XMLSchema-instance",
      "@xsi:nil": "true"
    }
  },
  "representations": {
    "representation": {
      "nom": "PDF",
      "typeMime": {
        "type": "application",
        "subType": "PDF"
      },
      "statutRepresentation": {
        "verbatim": "true",
        "canonique": "true",
        "officielle": "true",
        "transcription": "false",
        "enregistrement": "false"
      },
      "repSource": {
        "@xmlns:xsi": "http://www.w3.org/2001/XMLSchema-instance",
        "@xsi:nil": "true"
      },
      "offset": {
        "@xmlns:xsi": "http://www.w3.org/2001/XMLSchema-instance",
        "@xsi:nil": "true"
      },
      "contenu": {
        "documentURI": "/15/amendements/0235C/CION_TOUTE/CF519.pdf"
      },
      "dateDispoRepresentation": {
        "@xmlns:xsi": "http://www.w3.org/2001/XMLSchema-instance",
        "@xsi:nil": "true"
      }
    }
  },
  "seanceDiscussion": {
    "@xmlns:xsi": "http://www.w3.org/2001/XMLSchema-instance",
    "@xsi:nil": "true"
  },
  "sort": {
    "dateSaisie": {
      "@xmlns:xsi": "http://www.w3.org/2001/XMLSchema-instance",
      "@xsi:nil": "true"
    },
    "sortEnSeance": "Non soutenu"
  },
  "dateDepot": "2017-11-06T01:00:00.000+01:00",
  "dateDistribution": "2017-11-09T01:00:00.000+01:00",
  "article99": "0",
  "loiReference": {
    "codeLoi": {
      "@xmlns:xsi": "http://www.w3.org/2001/XMLSchema-instance",
      "@xsi:nil": "true"
    },
    "divisionCodeLoi": {
      "@xmlns:xsi": "http://www.w3.org/2001/XMLSchema-instance",
      "@xsi:nil": "true"
    }
  }
}