{
  "@xmlns": "http://schemas.assemblee-nationale.fr/referentiel",
  "uid": "AMANR5L15PO420120B1681P0D1N435",
  "identifiant": {
    "legislature": "15",
    "numero": "435",
    "numRect": "0",
    "saisine": {
      "refTexteLegislatif": "PRJLANR5L15B1681",
      "numeroPartiePLF": "0",
      "organeExamen": "PO420120",
      "mentionSecondeDeliberation": "0"
    }
  },
  "numeroLong": "AS435",
  "etapeTexte": "1ère lecture (1ère assemblée saisie)",
  "triAmendement": "boaaaaaaaaaaaaaaaaaaaaaaaaaaaaaaaaaaaaaaaaaaaaaaaafx",
  "cardinaliteAmdtMultiples": "1",
  "amendementParent": {
    "@xmlns:xsi": "http://www.w3.org/2001/XMLSchema-instance",
    "@xsi:nil": "true"
  },
  "etat": "Retiré",
  "signataires": {
    "auteur": {
      "typeAuteur": "Depute",
      "acteurRef": "PA722312",
      "organeRef": {
        "@xmlns:xsi": "http://www.w3.org/2001/XMLSchema-instance",
        "@xsi:nil": "true"
      },
      "groupePolitiqueRef": "PO730964"
    },
    "cosignataires": {
      "acteurRef": [
        "PA721398",
        "PA721434",
        "PA718728",
        "PA606639",
        "PA721784",
        "PA719326",
        "PA722366",
        "PA720342",
        "PA720622",
        "PA718876",
        "PA719480",
        "PA722312",
        "PA719154",
        "PA721888",
        "PA720038",
        "PA720814",
        "PA719890",
        "PA722000",
        "PA719592",
        "PA719294",
        "PA719440"
      ]
    },
    "texteAffichable": "Mme&#160;Bessot Ballot,  M.&#160;Besson-Moreau, Mme&#160;Josso, Mme&#160;Lardet, Mme&#160;Brulebois, M.&#160;Simian, Mme&#160;Degois, M.&#160;Vignal, Mme&#160;Gomez-Bassac, Mme&#160;Gipson, M.&#160;Fugit, Mme&#160;Vanceunebrock-Mialon, Mme&#160;Le Peih, M.&#160;Cellier, Mme&#160;Clapot, M.&#160;Cazenove, M.&#160;Gaillard, M.&#160;Raphan, Mme&#160;Bureau-Bonnard, M.&#160;Martin et M.&#160;Buchou"
  },
  "pointeurFragmentTexte": {
    "missionVisee": {
      "@xmlns:xsi": "http://www.w3.org/2001/XMLSchema-instance",
      "@xsi:nil": "true"
    },
    "division": {
      "titre": "Article 7",
      "articleDesignationCourte": "ART. 7",
      "type": "ARTICLE",
      "avant_A_Apres": "A",
      "divisionRattachee": "ARTICLE 7",
      "articleAdditionnel": {
        "@xmlns:xsi": "http://www.w3.org/2001/XMLSchema-instance",
        "@xsi:nil": "true"
      },
      "chapitreAdditionnel": {
        "@xmlns:xsi": "http://www.w3.org/2001/XMLSchema-instance",
        "@xsi:nil": "true"
      },
      "urlDivisionTexteVise": "/15/textes/1681.asp#D_Article_7"
    },
    "alinea": {
      "avant_A_Apres": {
        "@xmlns:xsi": "http://www.w3.org/2001/XMLSchema-instance",
        "@xsi:nil": "true"
      },
      "numero": "8",
      "alineaDesignation": {
        "@xmlns:xsi": "http://www.w3.org/2001/XMLSchema-instance",
        "@xsi:nil": "true"
      }
    }
  },
  "corps": {
    "dispositif": "<p style=\"text-align: justify;\">A l&#8217;alin&#233;a&#160;8, apr&#232;s les mots&#160;:</p><p style=\"text-align: justify;\">&#171;&#160;l&#8217;&#233;laboration&#160;&#187;</p><p style=\"text-align: justify;\">ins&#233;rer les mots&#160;:</p><p style=\"text-align: justify;\">&#171;&#160;, la mise en &#339;uvre et l&#8217;&#233;valuation&#160;&#187;.</p>",
    "exposeSommaire": "<p style=\"text-align: justify;\">L&#8217;article 7 vise &#224; cr&#233;er le projet territorial de sant&#233;, qui concr&#233;tise l&#8217;objectif de d&#233;cloisonnement entre m&#233;decine de ville, h&#244;pital et m&#233;dico-social. Il pr&#233;voit aussi que les projets des communaut&#233;s professionnelles territoriales de sant&#233; (CPTS) sont soumis &#224; l&#8217;approbation du directeur g&#233;n&#233;ral de l&#8217;agence r&#233;gionale de sant&#233; afin d&#8217;assurer leur coordination avec les autres acteurs du syst&#232;me de sant&#233;.</p><p style=\"text-align: justify;\">Par ailleurs, le projet de loi inclut dans l'&#233;laboration du Projet Territorial de Sant&#233; les associations agr&#233;&#233;es mentionn&#233;es &#224; l&#8217;article L. 1114&#8209;1 du code de la sant&#233; publique ainsi que les collectivit&#233;s territoriales; <b>cet amendement vise donc &#224; donner un r&#244;le plus accru aux</b> <b>associations et collectivit&#233;s territoriales</b> qui, <b>au del&#224; de participer &#224; l'&#233;laboration du PTS, participent &#233;galement &#224; sa mise en &#339;uvre et &#224; son &#233;valuation. <br /></b></p>",
    "annexeExposeSommaire": {
      "@xmlns:xsi": "http://www.w3.org/2001/XMLSchema-instance",
      "@xsi:nil": "true"
    },
    "cartoucheDelaiDepotDepasse": {
      "@xmlns:xsi": "http://www.w3.org/2001/XMLSchema-instance",
      "@xsi:nil": "true"
    }
  },
  "representations": {
    "representation": {
      "nom": "PDF",
      "typeMime": {
        "type": "application",
        "subType": "PDF"
      },
      "statutRepresentation": {
        "verbatim": "true",
        "canonique": "true",
        "officielle": "true",
        "transcription": "false",
        "enregistrement": "false"
      },
      "repSource": {
        "@xmlns:xsi": "http://www.w3.org/2001/XMLSchema-instance",
        "@xsi:nil": "true"
      },
      "offset": {
        "@xmlns:xsi": "http://www.w3.org/2001/XMLSchema-instance",
        "@xsi:nil": "true"
      },
      "contenu": {
        "documentURI": "/15/amendements/1681/CION-SOC/AS435.pdf"
      },
      "dateDispoRepresentation": {
        "@xmlns:xsi": "http://www.w3.org/2001/XMLSchema-instance",
        "@xsi:nil": "true"
      }
    }
  },
  "seanceDiscussion": {
    "@xmlns:xsi": "http://www.w3.org/2001/XMLSchema-instance",
    "@xsi:nil": "true"
  },
  "sort": {
    "@xmlns:xsi": "http://www.w3.org/2001/XMLSchema-instance",
    "@xsi:nil": "true"
  },
  "dateDepot": "2019-03-07T01:00:00.000+01:00",
  "dateDistribution": "2019-03-13T01:00:00.000+01:00",
  "article99": "0",
  "loiReference": {
    "codeLoi": {
      "@xmlns:xsi": "http://www.w3.org/2001/XMLSchema-instance",
      "@xsi:nil": "true"
    },
    "divisionCodeLoi": {
      "@xmlns:xsi": "http://www.w3.org/2001/XMLSchema-instance",
      "@xsi:nil": "true"
    }
  }
}