{
  "@xmlns": "http://schemas.assemblee-nationale.fr/referentiel",
  "uid": "AMANR5L15PO59051B2357P0D1N698",
  "identifiant": {
    "legislature": "15",
    "numero": "698",
    "numRect": "0",
    "saisine": {
      "refTexteLegislatif": "PRJLANR5L15B2357",
      "numeroPartiePLF": "0",
      "organeExamen": "PO59051",
      "mentionSecondeDeliberation": "0"
    }
  },
  "numeroLong": "CL698",
  "etapeTexte": "1ère lecture (2ème assemblée saisie)",
  "triAmendement": "kkaaaaaaaaaaaaaaaaaaaaaaaaaaaaaaaaaaaaaaaaaaaaaaaagmbaaabo",
  "cardinaliteAmdtMultiples": "1",
  "amendementParent": {
    "@xmlns:xsi": "http://www.w3.org/2001/XMLSchema-instance",
    "@xsi:nil": "true"
  },
  "etat": "Discuté",
  "signataires": {
    "auteur": {
      "typeAuteur": "Depute",
      "acteurRef": "PA719874",
      "organeRef": {
        "@xmlns:xsi": "http://www.w3.org/2001/XMLSchema-instance",
        "@xsi:nil": "true"
      },
      "groupePolitiqueRef": "PO730970"
    },
    "cosignataires": {
      "acteurRef": [
        "PA719874",
        "PA721742",
        "PA721984",
        "PA719558"
      ]
    },
    "texteAffichable": "Mme&#160;Jacquier-Laforge,  M.&#160;Balanant, Mme&#160;Florennes et M.&#160;Latombe"
  },
  "pointeurFragmentTexte": {
    "missionVisee": {
      "@xmlns:xsi": "http://www.w3.org/2001/XMLSchema-instance",
      "@xsi:nil": "true"
    },
    "division": {
      "titre": "Article 23",
      "articleDesignationCourte": "ART. 23",
      "type": "ARTICLE",
      "avant_A_Apres": "A",
      "divisionRattachee": "ARTICLE 23",
      "articleAdditionnel": {
        "@xmlns:xsi": "http://www.w3.org/2001/XMLSchema-instance",
        "@xsi:nil": "true"
      },
      "chapitreAdditionnel": {
        "@xmlns:xsi": "http://www.w3.org/2001/XMLSchema-instance",
        "@xsi:nil": "true"
      },
      "urlDivisionTexteVise": "/15/textes/2357.asp#D_Article_23"
    },
    "alinea": {
      "avant_A_Apres": {
        "@xmlns:xsi": "http://www.w3.org/2001/XMLSchema-instance",
        "@xsi:nil": "true"
      },
      "numero": "7",
      "alineaDesignation": {
        "@xmlns:xsi": "http://www.w3.org/2001/XMLSchema-instance",
        "@xsi:nil": "true"
      }
    }
  },
  "corps": {
    "dispositif": "<p>I.&#160;&#8211;&#160;&#192; l&#8217;alin&#233;a&#160;7, substituer aux r&#233;f&#233;rences&#160;:</p><p style=\"text-align: justify;\">&#171;&#160;, L.&#160;5211&#8209;10&#8209;1, L.&#160;5211&#8209;39&#8209;1, L.&#160;5217&#8209;9 et L.&#160;5218&#8209;10 et le&#160;IV de l&#8217;article L.&#160;5741&#8209;1&#160;&#187;</p><p style=\"text-align: justify;\">la r&#233;f&#233;rence&#160;:</p><p style=\"text-align: justify;\">&#171;&#160;et L.&#160;5211&#8209;39&#8209;1&#160;&#187;.</p><p style=\"text-align: justify;\">II.&#160;&#8211;&#160;En cons&#233;quence, supprimer les alin&#233;as&#160;9 &#224;&#160;15.</p>",
    "exposeSommaire": "<p>Les conseils de d&#233;veloppement sont constitu&#233;s de membres b&#233;n&#233;voles issus de la soci&#233;t&#233; civile et sont cr&#233;&#233;s par les m&#233;tropoles, communaut&#233;s urbaines, d&#8217;agglom&#233;ration, de communes (&#224; fiscalit&#233; propre de plus de 20 000 habitants), pays et P&#244;les d&#8217;&#233;quilibre territoriaux et ruraux (PETR), en tant qu&#8217;instances de consultation et de proposition sur les orientations majeures des politiques publiques locales. Ils engagent leurs travaux sur saisine de la collectivit&#233; territoriale ou par auto-saisine. Un pr&#233;sident et souvent, une &#233;quipe d&#8217;animation, concourent &#224; l&#8217;organisation de ses travaux.</p><p>Cet amendement vise &#224; les r&#233;tablir, ainsi que leur caract&#232;re obligatoire.</p><p>Attach&#233;s &#224; la construction collective par le d&#233;bat, les Conseils de d&#233;veloppement s&#8217;efforcent d&#8217;apporter une expertise citoyenne dans le contenu des politiques locales. La loi leur laisse la possibilit&#233; de s&#8217;organiser librement. C&#8217;est donc en s&#8217;appuyant sur le dynamisme et les capacit&#233;s de dialogue de chaque Conseil que se d&#233;finit l&#8217;organisation concr&#232;te de leur travail et les relations qu&#8217;ils &#233;tablissent, d&#8217;une part, avec les responsables de communaut&#233;s urbaines, d&#8217;agglom&#233;ration et de pays, et d&#8217;autre part, avec le territoire et la population.</p><p>Leur utilit&#233; sur le terrain est concr&#232;te. Leur renforcement figurait d&#8217;ailleurs dans les 200 propositions remises au Gouvernement pour revaloriser les territoires ruraux, en juillet dernier, dans le rapport &#171;&#160;Ruralit&#233;s : une ambition &#224; partager &#187;.</p><p>Apr&#232;s les grands d&#233;bats organis&#233;s dans toute la France, le besoin de d&#233;mocratie participative est plus que jamais exprim&#233;.</p><p>Supprimer ces Conseils ou leur caract&#232;re obligatoire, serait supprimer tous les &#171;&#160;petits&#160;&#187; d&#233;bats qui doivent avoir lieu dans nos communes pour oxyg&#233;ner la d&#233;mocratie.</p>",
    "annexeExposeSommaire": {
      "@xmlns:xsi": "http://www.w3.org/2001/XMLSchema-instance",
      "@xsi:nil": "true"
    },
    "cartoucheDelaiDepotDepasse": {
      "@xmlns:xsi": "http://www.w3.org/2001/XMLSchema-instance",
      "@xsi:nil": "true"
    },
    "avantAppel": {
      "@xmlns:xsi": "http://www.w3.org/2001/XMLSchema-instance",
      "@xsi:nil": "true"
    }
  },
  "representations": {
    "representation": {
      "nom": "PDF",
      "typeMime": {
        "type": "application",
        "subType": "PDF"
      },
      "statutRepresentation": {
        "verbatim": "true",
        "canonique": "true",
        "officielle": "true",
        "transcription": "false",
        "enregistrement": "false"
      },
      "repSource": {
        "@xmlns:xsi": "http://www.w3.org/2001/XMLSchema-instance",
        "@xsi:nil": "true"
      },
      "offset": {
        "@xmlns:xsi": "http://www.w3.org/2001/XMLSchema-instance",
        "@xsi:nil": "true"
      },
      "contenu": {
        "documentURI": "/15/amendements/2357/CION_LOIS/CL698.pdf"
      },
      "dateDispoRepresentation": {
        "@xmlns:xsi": "http://www.w3.org/2001/XMLSchema-instance",
        "@xsi:nil": "true"
      }
    }
  },
  "seanceDiscussion": {
    "@xmlns:xsi": "http://www.w3.org/2001/XMLSchema-instance",
    "@xsi:nil": "true"
  },
  "sort": {
    "dateSaisie": "2019-11-07T18:02:20.000+01:00",
    "sortEnSeance": "Tombé"
  },
  "dateDepot": "2019-10-31T01:00:00.000+01:00",
  "dateDistribution": "2019-11-05T01:00:00.000+01:00",
  "article99": "0",
  "loiReference": {
    "codeLoi": "2.2 id",
    "divisionCodeLoi": "dc"
  }
}