{
  "@xmlns": "http://schemas.assemblee-nationale.fr/referentiel",
  "uid": "AMANR5L15PO59048B0384P0D1N126",
  "identifiant": {
    "legislature": "15",
    "numero": "126",
    "numRect": "0",
    "saisine": {
      "refTexteLegislatif": "PRJLANR5L15B0384",
      "numeroPartiePLF": "0",
      "organeExamen": "PO59048",
      "mentionSecondeDeliberation": "0"
    }
  },
  "numeroLong": "CF126",
  "etapeTexte": "1ère lecture (1ère assemblée saisie)",
  "triAmendement": "dbo",
  "cardinaliteAmdtMultiples": "1",
  "amendementParent": {
    "@xmlns:xsi": "http://www.w3.org/2001/XMLSchema-instance",
    "@xsi:nil": "true"
  },
  "etat": "Discuté",
  "signataires": {
    "auteur": {
      "typeAuteur": "Depute",
      "acteurRef": "PA609245",
      "organeRef": {
        "@xmlns:xsi": "http://www.w3.org/2001/XMLSchema-instance",
        "@xsi:nil": "true"
      },
      "groupePolitiqueRef": "PO730934"
    },
    "cosignataires": {
      "acteurRef": "PA609245"
    },
    "texteAffichable": "Mme&#160;Lacroute"
  },
  "pointeurFragmentTexte": {
    "missionVisee": {
      "@xmlns:xsi": "http://www.w3.org/2001/XMLSchema-instance",
      "@xsi:nil": "true"
    },
    "division": {
      "titre": "Article 9",
      "articleDesignationCourte": "ART. 9",
      "type": "ARTICLE",
      "avant_A_Apres": "A",
      "divisionRattachee": "ARTICLE 9",
      "articleAdditionnel": {
        "@xmlns:xsi": "http://www.w3.org/2001/XMLSchema-instance",
        "@xsi:nil": "true"
      },
      "chapitreAdditionnel": {
        "@xmlns:xsi": "http://www.w3.org/2001/XMLSchema-instance",
        "@xsi:nil": "true"
      },
      "urlDivisionTexteVise": "/15/textes/0384.asp#D_Article_9"
    },
    "alinea": {
      "@xmlns:xsi": "http://www.w3.org/2001/XMLSchema-instance",
      "@xsi:nil": "true"
    }
  },
  "corps": {
    "dispositif": "<p style=\"text-align: justify;\">R&#233;diger ainsi cet article&#160;:</p><p style=\"text-align: justify;\">&#171;&#160;L&#8217;article&#160;60 de la loi n&#176;&#160;2016&#8209;1917 du 29&#160;d&#233;cembre 2016 de finances pour 2017 est abrog&#233;.&#160;&#187;</p>",
    "exposeSommaire": "<p style=\"text-align: justify;\">L&#8217;ordonnance n&#176;2017&#8209;1390 sign&#233;e par le Pr&#233;sident de la R&#233;publique le 22 septembre 2017 d&#233;cale d&#8217;une ann&#233;e l&#8217;entr&#233;e en vigueur du pr&#233;l&#232;vement &#224; la source.</p><p style=\"text-align: justify;\">Le pr&#233;l&#232;vement &#224; la source se veut &#234;tre une simplification, mais c&#8217;est en fait une v&#233;ritable usine &#224; gaz, pour les Fran&#231;ais, les entreprises et pour l&#8217;administration.</p><p style=\"text-align: justify;\">Par ailleurs, le pr&#233;l&#232;vement &#224; la source est en fait un tompe l&#8217;oeil. En effet, la majorit&#233; des Fran&#231;ais pensent qu&#8217;il s&#8217;agira un imp&#244;t lib&#233;ratoire, ce qui n&#8217;est pas le cas.</p><p style=\"text-align: justify;\">L&#8217;avantage suppos&#233; du pr&#233;l&#232;vement &#224; la source serait son imm&#233;diatet&#233;, sa r&#233;activit&#233; &#224; l&#8217;&#233;volution du revenu. C&#8217;est oublier que la mensualisation volontaire de l&#8217;imp&#244;t qui concerne aujourd&#8217;hui pr&#232;s de 70&#160;% des contribuables, de fait, a permis une imm&#233;diatet&#233; de la perception de l&#8217;imp&#244;t.</p><p style=\"text-align: justify;\">En France, l&#8217;imp&#244;t est jusqu&#8217;&#224; maintenant &#171;&#160;familialis&#233;&#160;&#187;. Il repose sur la famille, le foyer fiscal, et non sur l&#8217;individu. Il est le reflet de la capacit&#233; contributive des familles, c&#8217;est-&#224;-dire la diff&#233;rence entre leurs revenus et leurs charges. Le dispositif actuel est inadapt&#233; &#224; ce principe.<br /><br />Cette r&#233;forme va &#233;galement repr&#233;senter un co&#251;t suppl&#233;mentaire pour les entreprises de l&#8217;ordre de 2 milliards d&#8217;euros selon le Conseil des pr&#233;l&#232;vements obligatoires. Ce dernier estime que le co&#251;t induit par cette r&#233;forme pour les employeurs pourrait repr&#233;senter entre 1,3&#160;% et 3,5&#160;% de la valeur des imp&#244;ts collect&#233;s.</p><p style=\"text-align: justify;\">Pour toutes ces raisons il convient de supprimer le pr&#233;l&#232;vement &#224; la source.</p>",
    "annexeExposeSommaire": {
      "@xmlns:xsi": "http://www.w3.org/2001/XMLSchema-instance",
      "@xsi:nil": "true"
    }
  },
  "representations": {
    "representation": {
      "nom": "PDF",
      "typeMime": {
        "type": "application",
        "subType": "PDF"
      },
      "statutRepresentation": {
        "verbatim": "true",
        "canonique": "true",
        "officielle": "true",
        "transcription": "false",
        "enregistrement": "false"
      },
      "repSource": {
        "@xmlns:xsi": "http://www.w3.org/2001/XMLSchema-instance",
        "@xsi:nil": "true"
      },
      "offset": {
        "@xmlns:xsi": "http://www.w3.org/2001/XMLSchema-instance",
        "@xsi:nil": "true"
      },
      "contenu": {
        "documentURI": "/15/amendements/0384/CION_FIN/CF126.pdf"
      },
      "dateDispoRepresentation": {
        "@xmlns:xsi": "http://www.w3.org/2001/XMLSchema-instance",
        "@xsi:nil": "true"
      }
    }
  },
  "seanceDiscussion": {
    "@xmlns:xsi": "http://www.w3.org/2001/XMLSchema-instance",
    "@xsi:nil": "true"
  },
  "sort": {
    "dateSaisie": "2017-11-29T10:34:42.000+01:00",
    "sortEnSeance": "Rejeté"
  },
  "dateDepot": "2017-11-23T01:00:00.000+01:00",
  "dateDistribution": "2017-11-28T01:00:00.000+01:00",
  "article99": "0",
  "loiReference": {
    "codeLoi": {
      "@xmlns:xsi": "http://www.w3.org/2001/XMLSchema-instance",
      "@xsi:nil": "true"
    },
    "divisionCodeLoi": {
      "@xmlns:xsi": "http://www.w3.org/2001/XMLSchema-instance",
      "@xsi:nil": "true"
    }
  }
}