{
  "@xmlns": "http://schemas.assemblee-nationale.fr/referentiel",
  "uid": "AMANR5L15SEA717460B1255P1D1N2583",
  "identifiant": {
    "legislature": "15",
    "numero": "2583",
    "numRect": "1",
    "saisine": {
      "refTexteLegislatif": "PRJLANR5L15B1255",
      "numeroPartiePLF": "1",
      "organeExamen": "PO717460",
      "mentionSecondeDeliberation": "0"
    }
  },
  "numeroLong": "I-2583 (Rect)",
  "etapeTexte": "1ère lecture (1ère assemblée saisie)",
  "triAmendement": "efaaaaaaaaaaaaaaaaaaaaaaaaaaaaaaaaaaaaaaaaaaaaaaaaaaclzzzzzzzzzhzzzzzqyznvznvei",
  "cardinaliteAmdtMultiples": "1",
  "amendementParent": "AMANR5L15SEA717460B1255P1D1N2511",
  "etat": "Discuté",
  "signataires": {
    "auteur": {
      "typeAuteur": "Depute",
      "acteurRef": "PA720754",
      "organeRef": {
        "@xmlns:xsi": "http://www.w3.org/2001/XMLSchema-instance",
        "@xsi:nil": "true"
      },
      "groupePolitiqueRef": "PO730964"
    },
    "cosignataires": {
      "acteurRef": [
        "PA722062",
        "PA720446",
        "PA720854",
        "PA606639",
        "PA722046",
        "PA718902",
        "PA720030",
        "PA721844",
        "PA722252",
        "PA720124",
        "PA719728",
        "PA719108",
        "PA720576",
        "PA719456",
        "PA702054",
        "PA721218",
        "PA719230",
        "PA720754",
        "PA719814",
        "PA718944",
        "PA719170",
        "PA719162",
        "PA721328",
        "PA721750",
        "PA720242",
        "PA721888",
        "PA721352"
      ]
    },
    "texteAffichable": "M.&#160;Studer,  M.&#160;G&#233;rard, Mme&#160;Abba, Mme&#160;Amadou, Mme&#160;Berg&#233;, M.&#160;Bois, Mme&#160;Brugnera, Mme&#160;Calvez, Mme&#160;Cazarian, Mme&#160;Charri&#232;re, Mme&#160;Charvier, M.&#160;Claireaux, Mme&#160;Colboc, Mme&#160;Jacqueline&#160;Dubois, M.&#160;Freschi, Mme&#160;Granjus, M.&#160;Kerlogot, M.&#160;Le Bohec, Mme&#160;Liso, Mme&#160;M&#246;rch, Mme&#160;Piron, Mme&#160;Racon-Bouzon, M.&#160;Raphan, Mme&#160;Rixain, M.&#160;C&#233;dric&#160;Roussel, M.&#160;Test&#233; et M.&#160;Vignal"
  },
  "pointeurFragmentTexte": {
    "missionVisee": {
      "@xmlns:xsi": "http://www.w3.org/2001/XMLSchema-instance",
      "@xsi:nil": "true"
    },
    "division": {
      "titre": "Article 18",
      "articleDesignationCourte": "APRÈS ART. 18",
      "type": "ARTICLE",
      "avant_A_Apres": "Après",
      "divisionRattachee": "APRÈS L'ARTICLE 18, insérer l'article suivant:",
      "articleAdditionnel": "1",
      "chapitreAdditionnel": {
        "@xmlns:xsi": "http://www.w3.org/2001/XMLSchema-instance",
        "@xsi:nil": "true"
      },
      "urlDivisionTexteVise": "/15/textes/1255A.asp#D_Article_18"
    },
    "alinea": {
      "@xmlns:xsi": "http://www.w3.org/2001/XMLSchema-instance",
      "@xsi:nil": "true"
    }
  },
  "corps": {
    "dispositif": "<p style=\"text-align: justify;\">I. &#8211; Apr&#232;s l&#8217;alin&#233;a2, ins&#233;rer les deux alin&#233;as suivants&#160;:</p><p style=\"text-align: justify;\">&#171;&#160;I <i>bis.</i> &#8211; Apr&#232;s le vingt-deuxi&#232;me alin&#233;a du m&#234;me 1, il est ins&#233;r&#233; un alin&#233;a ainsi r&#233;dig&#233;&#160;:</p><p style=\"text-align: justify;\">&#171;&#160;Le plafond de dix millions d&#8217;euros mentionn&#233; au premier alin&#233;a du pr&#233;sent 1 ne s&#8217;applique pas aux versements effectu&#233;s au b&#233;n&#233;fice de l&#8217;&#201;tat, des collectivit&#233;s territoriales, des &#233;tablissements publics nationaux ou territoriaux, des associations et fondations reconnues d&#8217;utilit&#233; publique ainsi que des organismes priv&#233;s ou publics d&#233;tenus majoritairement par l&#8217;&#201;tat, les collectivit&#233;s territoriales ou leurs &#233;tablissements publics, sous r&#233;serve qu'ils remplissent les crit&#232;res fix&#233;s au pr&#233;sent 1.</p><p style=\"text-align: justify;\">II. &#8211; Compl&#233;ter cet amendement par l&#8217;alin&#233;a suivant&#160;:</p><p style=\"text-align: justify;\">&#171;&#160;III. La perte de recettes pour l&#8217;&#201;tat est compens&#233;e &#224; due concurrence par la cr&#233;ation d&#8217;une taxe additionnelle aux droits mentionn&#233;s aux articles 575 et 575 A du code g&#233;n&#233;ral des imp&#244;ts.&#187;</p>",
    "exposeSommaire": "<p>L&#8217;amendement n&#176;I-2511 adopt&#233; par la commission des finances propose de modifier l&#8217;article 238bis du code g&#233;n&#233;ral des imp&#244;ts qui r&#233;git les r&#232;gles applicables en mati&#232;re de m&#233;c&#233;nat.</p><p>Si l&#8217;introduction d&#8217;une &#171;franchise&#187; de 10 000 euros est une bonne fa&#231;on d&#8217;encourager le m&#233;c&#233;nat des PME, aujourd&#8217;hui r&#233;guli&#232;rement emp&#234;ch&#233;es par le plafond de 0,5% du chiffre d&#8217;affaires, qui limite consid&#233;rablement le montant potentiel des dons de ce type d&#8217;entreprises, en revanche, l&#8217;introduction d&#8217;un plafonnement &#224; 10 millions d&#8217;euros par an des d&#233;penses de m&#233;c&#233;nat prises en compte pour b&#233;n&#233;ficier de la r&#233;duction d&#8217;imp&#244;t risque de porter gravement atteinte au dispositif et de nuire tr&#232;s fortement &#224; la g&#233;n&#233;rosit&#233; des grandes entreprises.</p><p>Le plafond, tel qu&#8217;il est propos&#233; par cet amendement, n&#8217;a pas fait l&#8217;objet d&#8217;une &#233;valuation et est susceptible de mettre en p&#233;ril de nombreux projets d&#8217;int&#233;r&#234;t g&#233;n&#233;ral dans le social, l&#8217;&#233;ducation, le sport, la culture, la sant&#233;, o&#249; les besoins sont pourtant croissants. En effet, le m&#233;c&#233;nat d&#8217;entreprise est aujourd&#8217;hui un outil au service de l&#8217;attractivit&#233; des territoires et permet bien souvent la mise en &#339;uvre de politiques publiques. Les dons des entreprises, qui s&#8217;&#233;levaient &#224; 1,7 milliard d&#8217;euros en 2016, sont prioritairement destin&#233;s aux secteurs social (28%), culturel (25%) et &#233;ducatif (23%).</p><p>Il ne faudrait donc pas que la volont&#233; d&#8217;&#233;viter que quelques tr&#232;s grandes entreprises, aux chiffres d&#8217;affaires tr&#232;s &#233;lev&#233;s, abusent du dispositif, vienne d&#233;truire un outil devenu indispensable, notamment en mati&#232;re culturelle, tant pour la r&#233;alisation de projet ponctuels (acquisition de biens culturels, production de spectacles, restauration de monuments) que p&#233;rennes (organisation de festivals, soutien &#224; l&#8217;activit&#233; de mus&#233;es de France ou d&#8217;EPCC, &#8230;).</p><p>Pour assurer cette l&#233;gitime &#171;moralisation&#187; du dispositif, le pr&#233;sent sous&#8209;amendement propose donc de pr&#233;ciser que le plafonnement &#224; 10 millions d&#8217;euros n&#8217;est pas applicable aux versements destin&#233;s aux structures publiques b&#233;n&#233;ficiant actuellement du m&#233;c&#233;nat d&#8217;entreprise.</p>",
    "annexeExposeSommaire": {
      "@xmlns:xsi": "http://www.w3.org/2001/XMLSchema-instance",
      "@xsi:nil": "true"
    }
  },
  "representations": {
    "representation": {
      "nom": "PDF",
      "typeMime": {
        "type": "application",
        "subType": "PDF"
      },
      "statutRepresentation": {
        "verbatim": "true",
        "canonique": "true",
        "officielle": "true",
        "transcription": "false",
        "enregistrement": "false"
      },
      "repSource": {
        "@xmlns:xsi": "http://www.w3.org/2001/XMLSchema-instance",
        "@xsi:nil": "true"
      },
      "offset": {
        "@xmlns:xsi": "http://www.w3.org/2001/XMLSchema-instance",
        "@xsi:nil": "true"
      },
      "contenu": {
        "documentURI": "/15/amendements/1255A/AN/2583.pdf"
      },
      "dateDispoRepresentation": {
        "@xmlns:xsi": "http://www.w3.org/2001/XMLSchema-instance",
        "@xsi:nil": "true"
      }
    }
  },
  "seanceDiscussion": "RUANR5L15S2019IDS21283",
  "sort": {
    "dateSaisie": "2018-10-20T00:53:19.000+02:00",
    "sortEnSeance": "Tombé"
  },
  "dateDepot": "2018-10-17T02:00:00.000+02:00",
  "dateDistribution": "2018-10-18T02:00:00.000+02:00",
  "article99": "0",
  "loiReference": {
    "codeLoi": {
      "@xmlns:xsi": "http://www.w3.org/2001/XMLSchema-instance",
      "@xsi:nil": "true"
    },
    "divisionCodeLoi": {
      "@xmlns:xsi": "http://www.w3.org/2001/XMLSchema-instance",
      "@xsi:nil": "true"
    }
  }
}