{
  "@xmlns": "http://schemas.assemblee-nationale.fr/referentiel",
  "uid": "AMANR5L15SEA717460B2296P0D1N791",
  "identifiant": {
    "legislature": "15",
    "numero": "791",
    "numRect": "0",
    "saisine": {
      "refTexteLegislatif": "PRJLANR5L15B2296",
      "numeroPartiePLF": "0",
      "organeExamen": "PO717460",
      "mentionSecondeDeliberation": "1"
    }
  },
  "numeroLong": "791",
  "etapeTexte": "1ère lecture (1ère assemblée saisie)",
  "triAmendement": "ifaaaaaaaaaaaaaaaaaaaaaaaaaaaaaaaaaaaaaaaaaaaaaaaarx",
  "cardinaliteAmdtMultiples": "1",
  "amendementParent": {
    "@xmlns:xsi": "http://www.w3.org/2001/XMLSchema-instance",
    "@xsi:nil": "true"
  },
  "etat": "Discuté",
  "signataires": {
    "auteur": {
      "typeAuteur": "Rapporteur",
      "acteurRef": "PA642788",
      "organeRef": "PO420120",
      "groupePolitiqueRef": "PO730964"
    },
    "cosignataires": {
      "acteurRef": [
        "PA722102",
        "PA721246",
        "PA719858",
        "PA718910",
        "PA720738",
        "PA720916",
        "PA720480",
        "PA722268",
        "PA642788",
        "PA720170",
        "PA719652",
        "PA719072",
        "PA718728",
        "PA719186",
        "PA721466",
        "PA720952",
        "PA720066",
        "PA719512",
        "PA718810",
        "PA720932",
        "PA722022",
        "PA719756",
        "PA719980",
        "PA720074",
        "PA718706",
        "PA720046",
        "PA717379",
        "PA720362",
        "PA608083",
        "PA719350",
        "PA720512",
        "PA334768",
        "PA719570",
        "PA718744",
        "PA331835",
        "PA721710",
        "PA722126",
        "PA721336",
        "PA718694"
      ]
    },
    "texteAffichable": "M.&#160;V&#233;ran, rapporteur au nom de la commission des affaires sociales,  M.&#160;Belhaddad, Mme&#160;Wonner, Mme&#160;Rist, M.&#160;Borowczyk, Mme&#160;Lecocq, Mme&#160;Cloarec-Le Nabour, Mme&#160;Bagarry, Mme&#160;Bourguignon, Mme&#160;Brocard, M.&#160;Chiche, M.&#160;Da Silva, M.&#160;Marc&#160;Delatte, Mme&#160;Dufeu Schubert, Mme&#160;Fabre, Mme&#160;Fontaine-Domeizel, Mme&#160;Gaillot, Mme&#160;Grandjean, Mme&#160;Hammerer, Mme&#160;Iborra, Mme&#160;Janvier, Mme&#160;Khattabi, Mme&#160;Lazaar, Mme&#160;Limon, M.&#160;Maillard, M.&#160;Mesnier, M.&#160;Michels, Mme&#160;Peyron, M.&#160;Pietraszewski, Mme&#160;Pitollat, Mme&#160;Robert, Mme&#160;Romeiro Dias, M.&#160;Tach&#233;, Mme&#160;Tamarelle-Verhaeghe, M.&#160;Touraine, Mme&#160;Vanceunebrock-Mialon, Mme&#160;Vidal, Mme&#160;Vignon et M.&#160;Le Gendre"
  },
  "pointeurFragmentTexte": {
    "missionVisee": {
      "@xmlns:xsi": "http://www.w3.org/2001/XMLSchema-instance",
      "@xsi:nil": "true"
    },
    "division": {
      "titre": "Article 40",
      "articleDesignationCourte": "APRÈS ART. 40",
      "type": "ARTICLE",
      "avant_A_Apres": "Après",
      "divisionRattachee": "APRÈS L'ARTICLE 40, insérer l'article suivant:",
      "articleAdditionnel": "1",
      "chapitreAdditionnel": {
        "@xmlns:xsi": "http://www.w3.org/2001/XMLSchema-instance",
        "@xsi:nil": "true"
      },
      "urlDivisionTexteVise": "/15/textes/2296.asp#D_Article_40"
    },
    "alinea": {
      "@xmlns:xsi": "http://www.w3.org/2001/XMLSchema-instance",
      "@xsi:nil": "true"
    }
  },
  "corps": {
    "dispositif": "<p style=\"text-align: justify;\">&#192; titre exp&#233;rimental et pour une dur&#233;e de trois ans, l&#8217;&#201;tat peut autoriser le financement par le fonds d&#8217;intervention r&#233;gional mentionn&#233; &#224; l&#8217;article L.&#160;1435&#8209;8 du code de la sant&#233; publique de la mise en place, par certaines agences r&#233;gionales de sant&#233;, d&#8217;un parcours soumis &#224; prescription m&#233;dicale visant &#224; accompagner les personnes b&#233;n&#233;ficiant d&#8217;un traitement contre un diab&#232;te de type 2 ou une hypertension art&#233;rielle.</p><p style=\"text-align: justify;\">Un d&#233;cret fixe les conditions d&#8217;application du pr&#233;sent article, notamment les agences r&#233;gionales de sant&#233; concern&#233;es par cette exp&#233;rimentation et le contenu de ce parcours, qui peut comprendre un bilan d&#8217;activit&#233; physique, ainsi qu&#8217;un bilan et des consultations de suivi nutritionnels et psychologiques.</p>",
    "exposeSommaire": "<p style=\"text-align: justify;\">Cet amendement propose une exp&#233;rimentation visant &#224; mettre en place un parcours d&#8217;accompagnement comprenant un bilan d&#8217;activit&#233; physique ainsi qu&#8217;un bilan et des consultations de suivi nutritionnels et psychologiques pour les personnes atteintes de diab&#232;te de type 2 ou d&#8217;hypertension.<br />L&#8217;article&#160;40 du projet de loi propose en effet la mise en place d&#8217;un parcours d&#8217;accompagnement pour les seules personnes ayant subi un traitement contre le cancer. Or, d&#8217;autres pathologies chroniques ont des niveaux de pr&#233;valence comparables voire sup&#233;rieurs &#224; celui du cancer&#160;:</p><p style=\"text-align: justify;\">&#8211; 3,3 millions de personnes sont trait&#233;es pour le diab&#232;te, dont 92&#160;% des cas sont des diab&#232;tes de type 2, pour un co&#251;t estim&#233; &#224; 8,5 milliards d&#8217;euros&#160;;</p><p style=\"text-align: justify;\">&#8211; en outre, 10,8 millions de personnes suivent un traitement m&#233;dicamenteux pour l&#8217;hypertension art&#233;rielle, pour un co&#251;t estim&#233; &#224; pr&#232;s de 3 milliards d&#8217;euros.</p><p style=\"text-align: justify;\">Pour ces deux maladies chroniques, les effets positifs, significatifs et rapides de l&#8217;activit&#233; physique adapt&#233;e sur le traitement de ces affections sont reconnus de mani&#232;re incontest&#233;e par la litt&#233;rature m&#233;dicale et scientifique. L&#8217;activit&#233; physique adapt&#233;e permet ainsi de diminuer le co&#251;t de la prise en charge, notamment par la baisse de la consommation de m&#233;dicaments.</p><p style=\"text-align: justify;\">L&#8217;exp&#233;rimentation propos&#233;e vise en cons&#233;quence &#224; permettre &#224; ces patients un meilleur acc&#232;s &#224; l&#8217;activit&#233; physique adapt&#233;e &#224; leur pathologie gr&#226;ce &#224; la r&#233;alisation d&#8217;un bilan, qui permettra de les orienter le cas &#233;ch&#233;ant vers les maisons Sport-Sant&#233;, et gr&#226;ce aux consultations de suivi nutritionnel ou psychologique.</p>",
    "annexeExposeSommaire": {
      "@xmlns:xsi": "http://www.w3.org/2001/XMLSchema-instance",
      "@xsi:nil": "true"
    },
    "cartoucheDelaiDepotDepasse": "Sous réserve de son traitement par les services de l'Assemblée nationale et de sa recevabilité",
    "avantAppel": {
      "@xmlns:xsi": "http://www.w3.org/2001/XMLSchema-instance",
      "@xsi:nil": "true"
    }
  },
  "representations": {
    "representation": {
      "nom": "PDF",
      "typeMime": {
        "type": "application",
        "subType": "PDF"
      },
      "statutRepresentation": {
        "verbatim": "true",
        "canonique": "true",
        "officielle": "true",
        "transcription": "false",
        "enregistrement": "false"
      },
      "repSource": {
        "@xmlns:xsi": "http://www.w3.org/2001/XMLSchema-instance",
        "@xsi:nil": "true"
      },
      "offset": {
        "@xmlns:xsi": "http://www.w3.org/2001/XMLSchema-instance",
        "@xsi:nil": "true"
      },
      "contenu": {
        "documentURI": "/15/amendements/2296/AN/791.pdf"
      },
      "dateDispoRepresentation": {
        "@xmlns:xsi": "http://www.w3.org/2001/XMLSchema-instance",
        "@xsi:nil": "true"
      }
    }
  },
  "seanceDiscussion": "RUANR5L15S2020IDS21881",
  "sort": {
    "dateSaisie": "2019-10-25T15:33:15.000+02:00",
    "sortEnSeance": "Rejeté"
  },
  "dateDepot": "2019-10-17T02:00:00.000+02:00",
  "dateDistribution": "2019-10-25T02:00:00.000+02:00",
  "article99": "0",
  "loiReference": {
    "codeLoi": {
      "@xmlns:xsi": "http://www.w3.org/2001/XMLSchema-instance",
      "@xsi:nil": "true"
    },
    "divisionCodeLoi": {
      "@xmlns:xsi": "http://www.w3.org/2001/XMLSchema-instance",
      "@xsi:nil": "true"
    }
  }
}