{
  "@xmlns": "http://schemas.assemblee-nationale.fr/referentiel",
  "uid": "AMANR5L15PO419865B2274P0D1N597",
  "identifiant": {
    "legislature": "15",
    "numero": "597",
    "numRect": "0",
    "saisine": {
      "refTexteLegislatif": "PRJLANR5L15B2274",
      "numeroPartiePLF": "0",
      "organeExamen": "PO419865",
      "mentionSecondeDeliberation": "0"
    }
  },
  "numeroLong": "CD597",
  "etapeTexte": "1ère lecture (2ème assemblée saisie)",
  "triAmendement": "ipaaaaaaaaaaaaaaaaaaaaaaaaaaaaaaaaaaaaaaaaaaaaaaaaef",
  "cardinaliteAmdtMultiples": "1",
  "amendementParent": {
    "@xmlns:xsi": "http://www.w3.org/2001/XMLSchema-instance",
    "@xsi:nil": "true"
  },
  "etat": "En traitement",
  "signataires": {
    "auteur": {
      "typeAuteur": "Depute",
      "acteurRef": "PA333421",
      "organeRef": {
        "@xmlns:xsi": "http://www.w3.org/2001/XMLSchema-instance",
        "@xsi:nil": "true"
      },
      "groupePolitiqueRef": "PO759900"
    },
    "cosignataires": {
      "acteurRef": [
        "PA333421",
        "PA719286",
        "PA605518",
        "PA720278"
      ]
    },
    "texteAffichable": "M.&#160;Pancher,  M.&#160;Colombani, M.&#160;Fran&#231;ois-Michel&#160;Lambert et M.&#160;Orphelin"
  },
  "pointeurFragmentTexte": {
    "missionVisee": {
      "@xmlns:xsi": "http://www.w3.org/2001/XMLSchema-instance",
      "@xsi:nil": "true"
    },
    "division": {
      "titre": "Article 10",
      "articleDesignationCourte": "ART. 10",
      "type": "ARTICLE",
      "avant_A_Apres": "A",
      "divisionRattachee": "ARTICLE 10",
      "articleAdditionnel": {
        "@xmlns:xsi": "http://www.w3.org/2001/XMLSchema-instance",
        "@xsi:nil": "true"
      },
      "chapitreAdditionnel": {
        "@xmlns:xsi": "http://www.w3.org/2001/XMLSchema-instance",
        "@xsi:nil": "true"
      },
      "urlDivisionTexteVise": "/15/textes/2274.asp#D_Article_10"
    },
    "alinea": {
      "avant_A_Apres": {
        "@xmlns:xsi": "http://www.w3.org/2001/XMLSchema-instance",
        "@xsi:nil": "true"
      },
      "numero": "10",
      "alineaDesignation": {
        "@xmlns:xsi": "http://www.w3.org/2001/XMLSchema-instance",
        "@xsi:nil": "true"
      }
    }
  },
  "corps": {
    "dispositif": "<p style=\"text-align: justify;\">Modifier ainsi la premi&#232;re phrase de l&#8217;alin&#233;a&#160;10&#160;:</p><p style=\"text-align: justify;\">1&#176;&#160;Substituer aux mots&#160;:</p><p style=\"text-align: justify;\">&#171;&#160;distribution gratuite&#160;&#187;</p><p style=\"text-align: justify;\">les mots&#160;:</p><p style=\"text-align: justify;\">&#171;&#160;mise &#224; disposition &#224; titre on&#233;reux ou gratuit&#160;&#187;&#160;;</p><p style=\"text-align: justify;\">2&#176;&#160;Substituer au mot&#160;:</p><p style=\"text-align: justify;\">&#171;&#160;et&#160;&#187;</p><p style=\"text-align: justify;\">le signe&#160;:</p><p style=\"text-align: justify;\">&#171;&#160;,&#160;&#187;&#160;;</p><p style=\"text-align: justify;\">3&#176;&#160;Compl&#233;ter la phrase par les mots&#160;:</p><p style=\"text-align: justify;\">&#171;&#160;et durant les &#233;v&#233;nements dans l&#8217;espace public&#160;&#187;.</p>",
    "exposeSommaire": "<p style=\"text-align: justify;\">1 million de bouteilles en plastique sont produites chaque minute &#224; travers le monde. Con&#231;ues pour un usage unique, le temps de vider leurs contenus, ces bouteilles finissent bien trop souvent dans l&#8217;environnement, incin&#233;r&#233;es ou encore enfouies. Plus de 80 000 sont collect&#233;es chaque ann&#233;e &#224; l&#8217;occasion des initiatives oc&#233;ane. En effet, les bouteilles en plastiques et leurs bouchons font partie des 10 d&#233;chets que l&#8217;on retrouve le plus souvent sur les plages. Une fois pr&#233;sents dans le milieu aquatique, ces d&#233;chets peuvent mettre jusqu&#8217;&#224; 1000 ans pour se d&#233;grader en microparticules de plastiques contribuant ainsi &#224; la pollution plastique de l&#8217;oc&#233;an.</p><p style=\"text-align: justify;\">Pour limiter la pollution li&#233;e aux bouteilles en plastique il faut agir &#224; la source et tout au long de son cycle de vie&#160;: limiter la production de bouteilles afin de r&#233;duire l&#8217;utilisation de ressources naturelles (eau, &#233;nergie, ressource fossile), optimiser leur conception et allonger leur dur&#233;e d&#8217;utilisation en cr&#233;ant des contenants r&#233;utilisables (&#233;co-conception), et optimiser leur fin de vie afin qu&#8217;elles soient toutes effectivement recycl&#233;es (aucun enfouissement ou incin&#233;ration).</p><p style=\"text-align: justify;\">L&#8217;administration dans son mandat de repr&#233;sentation se doit d&#8217;&#234;tre exemplaire dans la mise en &#339;uvre des politiques publiques de pr&#233;vention des d&#233;chets. Ainsi, dans la lign&#233;e des dispositions l&#233;gislatives d&#233;j&#224; adopt&#233;es et des engagements du Gouvernement dans la lutte contre la pollution plastique, il parait essentiel que les d&#233;positaires de l&#8217;autorit&#233; publique adopte un comportement &#233;coresponsable&#160;: cela passe notamment par l&#8217;arr&#234;t de l&#8217;utilisation de plastique &#224; usage unique, telles que les bouteilles en plastique au profit d&#8217;alternatives r&#233;utilisables (carafes, bouteilles r&#233;utilisables, fontaines d&#8217;eau etc&#8230;), dans les administrations et &#233;v&#233;nements r&#233;gis par l&#8217;autorit&#233; publique&#160;; la commande publique est ici un levier cl&#233; pour r&#233;aliser cet objectif.</p><p style=\"text-align: justify;\"><br /> <br /><br /></p>",
    "annexeExposeSommaire": {
      "@xmlns:xsi": "http://www.w3.org/2001/XMLSchema-instance",
      "@xsi:nil": "true"
    },
    "cartoucheDelaiDepotDepasse": "Sous réserve de son traitement par les services de l'Assemblée nationale et de sa recevabilité",
    "avantAppel": {
      "@xmlns:xsi": "http://www.w3.org/2001/XMLSchema-instance",
      "@xsi:nil": "true"
    }
  },
  "representations": {
    "representation": {
      "nom": "PDF",
      "typeMime": {
        "type": "application",
        "subType": "PDF"
      },
      "statutRepresentation": {
        "verbatim": "true",
        "canonique": "true",
        "officielle": "true",
        "transcription": "false",
        "enregistrement": "false"
      },
      "repSource": {
        "@xmlns:xsi": "http://www.w3.org/2001/XMLSchema-instance",
        "@xsi:nil": "true"
      },
      "offset": {
        "@xmlns:xsi": "http://www.w3.org/2001/XMLSchema-instance",
        "@xsi:nil": "true"
      },
      "contenu": {
        "documentURI": "/15/amendements/2274/CION-DVP/CD597.pdf"
      },
      "dateDispoRepresentation": {
        "@xmlns:xsi": "http://www.w3.org/2001/XMLSchema-instance",
        "@xsi:nil": "true"
      }
    }
  },
  "seanceDiscussion": {
    "@xmlns:xsi": "http://www.w3.org/2001/XMLSchema-instance",
    "@xsi:nil": "true"
  },
  "sort": {
    "@xmlns:xsi": "http://www.w3.org/2001/XMLSchema-instance",
    "@xsi:nil": "true"
  },
  "dateDepot": "2019-11-19T01:00:00.000+01:00",
  "dateDistribution": {
    "@xmlns:xsi": "http://www.w3.org/2001/XMLSchema-instance",
    "@xsi:nil": "true"
  },
  "article99": "0",
  "loiReference": {
    "codeLoi": {
      "@xmlns:xsi": "http://www.w3.org/2001/XMLSchema-instance",
      "@xsi:nil": "true"
    },
    "divisionCodeLoi": {
      "@xmlns:xsi": "http://www.w3.org/2001/XMLSchema-instance",
      "@xsi:nil": "true"
    }
  }
}