{
  "@xmlns": "http://schemas.assemblee-nationale.fr/referentiel",
  "uid": "AMANR5L15PO59048B1490P0D1N516",
  "identifiant": {
    "legislature": "15",
    "numero": "516",
    "numRect": "0",
    "saisine": {
      "refTexteLegislatif": "PRJLANR5L15B1490",
      "numeroPartiePLF": "0",
      "organeExamen": "PO59048",
      "mentionSecondeDeliberation": "0"
    }
  },
  "numeroLong": "CF516",
  "etapeTexte": "Nouvelle Lecture",
  "triAmendement": "bjkaaaaaaaaaaaaaaaaaaaaaaaaaaaaaaaaaaaaaaaaaaaaaaadf",
  "cardinaliteAmdtMultiples": "1",
  "amendementParent": {
    "@xmlns:xsi": "http://www.w3.org/2001/XMLSchema-instance",
    "@xsi:nil": "true"
  },
  "etat": "Discuté",
  "signataires": {
    "auteur": {
      "typeAuteur": "Depute",
      "acteurRef": "PA720644",
      "organeRef": {
        "@xmlns:xsi": "http://www.w3.org/2001/XMLSchema-instance",
        "@xsi:nil": "true"
      },
      "groupePolitiqueRef": "PO730934"
    },
    "cosignataires": {
      "acteurRef": "PA720644"
    },
    "texteAffichable": "M.&#160;Nury"
  },
  "pointeurFragmentTexte": {
    "missionVisee": {
      "@xmlns:xsi": "http://www.w3.org/2001/XMLSchema-instance",
      "@xsi:nil": "true"
    },
    "division": {
      "titre": "Article 18",
      "articleDesignationCourte": "ART. 18",
      "type": "ARTICLE",
      "avant_A_Apres": "A",
      "divisionRattachee": "ARTICLE 18",
      "articleAdditionnel": {
        "@xmlns:xsi": "http://www.w3.org/2001/XMLSchema-instance",
        "@xsi:nil": "true"
      },
      "chapitreAdditionnel": {
        "@xmlns:xsi": "http://www.w3.org/2001/XMLSchema-instance",
        "@xsi:nil": "true"
      },
      "urlDivisionTexteVise": "/15/textes/1490.asp#D_Article_18"
    },
    "alinea": {
      "avant_A_Apres": "A",
      "numero": "12",
      "alineaDesignation": "Alinéa 12"
    }
  },
  "corps": {
    "dispositif": "<p style=\"text-align: justify;\">I.&#160;&#8211;&#160;Substituer aux alin&#233;as 12 et 13 les deux alin&#233;as suivants&#160;:</p><p style=\"text-align: justify;\">&#171;&#160;1&#176; Pour les exploitants individuels, soit &#224; la diff&#233;rence positive entre la somme de 150 000&#160;&#8364; et le montant de d&#233;ductions pratiqu&#233;es et non encore rapport&#233;es au r&#233;sultat, soit au chiffre d&#8217;affaires moyen des cinq derniers exercices, un compl&#233;ment de d&#233;duction peut &#234;tre op&#233;r&#233; en cas de variation &#224; la hausse du chiffre d&#8217;affaires moyen&#160;;</p><p style=\"text-align: justify;\">&#171;&#160;2 &#176; Pour les groupements agricoles d&#8217;exploitation en commun et les exploitations agricoles &#224; responsabilit&#233; limit&#233;e qui n&#8217;ont pas opt&#233; pour le r&#233;gime fiscal des soci&#233;t&#233;s de capitaux, soit &#224; la diff&#233;rence positive entre la somme de 150 000&#160;&#8364;, multipli&#233;e par le nombre des associ&#233;s exploitants, dans la limite de quatre, et le montant des d&#233;ductions pratiqu&#233;es et non encore rapport&#233;es au r&#233;sultat, soit au chiffre d&#8217;affaires moyen des cinq derniers exercices&#160;; un compl&#233;ment de d&#233;duction peut &#234;tre op&#233;r&#233; en cas de variation &#224; la hausse du chiffre d&#8217;affaires moyen&#160;;&#160;&#187;</p><p style=\"text-align: justify;\">II.&#160;&#8211;&#160;La perte de recettes pour l&#8217;&#201;tat est compens&#233;e, &#224; due concurrence, par la cr&#233;ation d&#8217;une taxe additionnelle aux droits mentionn&#233;s aux articles 575 et 575 A du code g&#233;n&#233;ral des imp&#244;ts.&#160;&#187;.</p>",
    "exposeSommaire": "<p style=\"text-align: justify;\">Cet amendement vise &#224; porter le plafonnement global de la d&#233;duction pour &#233;pargne de pr&#233;caution &#224; une ann&#233;e de chiffre d&#8217;affaires afin de doter la &#171;&#160;ferme France&#160;&#187; d&#8217;un outil de gestion des risques raisonn&#233; dans chaque exploitation et compl&#233;mentaire aux produits d&#8217;assurance.</p><p style=\"text-align: justify;\">En effet, le montant maximum pluriannuel, fix&#233; &#224; 150 000&#160;&#8364; dans le projet de loi de finances pour 2019, n&#8217;apparait pas suffisant ni adapt&#233; &#224; toutes les exploitations dont les tailles &#233;conomiques sont diverses.</p><p style=\"text-align: justify;\">Afin de r&#233;pondre &#224; des al&#233;as dont l&#8217;ampleur et l&#8217;occurrence sont croissantes, les exploitants agricoles doivent disposer d&#8217;une tr&#233;sorerie ad hoc. Ainsi, la r&#233;serve de pr&#233;caution doit pouvoir atteindre un plafond global &#233;gal &#224; une ann&#233;e de chiffre d&#8217;affaires de l&#8217;exploitation &#233;tabli selon la moyenne des cinq derni&#232;res ann&#233;es, et susceptible d&#8217;&#233;voluer &#224; la hausse en cas de d&#233;veloppement de l&#8217;activit&#233;.</p><p style=\"text-align: justify;\">S&#8217;il est sup&#233;rieur &#224; ce montant, le plafond de 150 000&#160;&#8364;, tel que propos&#233; dans l&#8217;article&#160;18 du projet de loi de finances pour 2019 peut &#234;tre retenu par l&#8217;exploitant.</p>",
    "annexeExposeSommaire": {
      "@xmlns:xsi": "http://www.w3.org/2001/XMLSchema-instance",
      "@xsi:nil": "true"
    },
    "cartoucheDelaiDepotDepasse": {
      "@xmlns:xsi": "http://www.w3.org/2001/XMLSchema-instance",
      "@xsi:nil": "true"
    }
  },
  "representations": {
    "representation": {
      "nom": "PDF",
      "typeMime": {
        "type": "application",
        "subType": "PDF"
      },
      "statutRepresentation": {
        "verbatim": "true",
        "canonique": "true",
        "officielle": "true",
        "transcription": "false",
        "enregistrement": "false"
      },
      "repSource": {
        "@xmlns:xsi": "http://www.w3.org/2001/XMLSchema-instance",
        "@xsi:nil": "true"
      },
      "offset": {
        "@xmlns:xsi": "http://www.w3.org/2001/XMLSchema-instance",
        "@xsi:nil": "true"
      },
      "contenu": {
        "documentURI": "/15/amendements/1490/CION_FIN/CF516.pdf"
      },
      "dateDispoRepresentation": {
        "@xmlns:xsi": "http://www.w3.org/2001/XMLSchema-instance",
        "@xsi:nil": "true"
      }
    }
  },
  "seanceDiscussion": {
    "@xmlns:xsi": "http://www.w3.org/2001/XMLSchema-instance",
    "@xsi:nil": "true"
  },
  "sort": {
    "dateSaisie": "2018-12-14T11:08:33.000+01:00",
    "sortEnSeance": "Non soutenu"
  },
  "dateDepot": "2018-12-13T01:00:00.000+01:00",
  "dateDistribution": "2018-12-14T01:00:00.000+01:00",
  "article99": "0",
  "loiReference": {
    "codeLoi": {
      "@xmlns:xsi": "http://www.w3.org/2001/XMLSchema-instance",
      "@xsi:nil": "true"
    },
    "divisionCodeLoi": {
      "@xmlns:xsi": "http://www.w3.org/2001/XMLSchema-instance",
      "@xsi:nil": "true"
    }
  }
}