{
  "@xmlns": "http://schemas.assemblee-nationale.fr/referentiel",
  "uid": "AMANR5L15PO59051B0098P0D1N62",
  "identifiant": {
    "legislature": "15",
    "numero": "62",
    "numRect": "0",
    "saisine": {
      "refTexteLegislatif": "PRJLANR5L15B0098",
      "numeroPartiePLF": "0",
      "organeExamen": "PO59051",
      "mentionSecondeDeliberation": "0"
    }
  },
  "numeroLong": "CL62",
  "etapeTexte": "1ère lecture (2ème assemblée saisie)",
  "triAmendement": "jbi",
  "cardinaliteAmdtMultiples": "1",
  "amendementParent": {
    "@xmlns:xsi": "http://www.w3.org/2001/XMLSchema-instance",
    "@xsi:nil": "true"
  },
  "etat": "Discuté",
  "signataires": {
    "auteur": {
      "typeAuteur": "Depute",
      "acteurRef": "PA720430",
      "organeRef": {
        "@xmlns:xsi": "http://www.w3.org/2001/XMLSchema-instance",
        "@xsi:nil": "true"
      },
      "groupePolitiqueRef": "PO730958"
    },
    "cosignataires": {
      "acteurRef": [
        "PA721210",
        "PA2150",
        "PA720286",
        "PA720846",
        "PA718860",
        "PA719676",
        "PA718868",
        "PA588884",
        "PA720430",
        "PA721226",
        "PA719578",
        "PA720422",
        "PA722142",
        "PA720892",
        "PA721062",
        "PA721960",
        "PA721202"
      ]
    },
    "texteAffichable": "M.&#160;Bernalicis,  Mme&#160;Autain, M.&#160;Coquerel, M.&#160;Corbi&#232;re, Mme&#160;Fiat, M.&#160;Lachaud, M.&#160;Larive, M.&#160;M&#233;lenchon, Mme&#160;Obono, Mme&#160;Panot, M.&#160;Prud&apos;homme, M.&#160;Quatennens, M.&#160;Ratenon, Mme&#160;Ressiguier, Mme&#160;Rubin, M.&#160;Ruffin et Mme&#160;Taurine"
  },
  "pointeurFragmentTexte": {
    "missionVisee": {
      "@xmlns:xsi": "http://www.w3.org/2001/XMLSchema-instance",
      "@xsi:nil": "true"
    },
    "division": {
      "titre": "Article PREMIER",
      "articleDesignationCourte": "ART. PREMIER",
      "type": "ARTICLE",
      "avant_A_Apres": "A",
      "divisionRattachee": "ARTICLE PREMIER",
      "articleAdditionnel": {
        "@xmlns:xsi": "http://www.w3.org/2001/XMLSchema-instance",
        "@xsi:nil": "true"
      },
      "chapitreAdditionnel": {
        "@xmlns:xsi": "http://www.w3.org/2001/XMLSchema-instance",
        "@xsi:nil": "true"
      },
      "urlDivisionTexteVise": "/15/textes/0098.asp#D_Article_1er"
    },
    "alinea": {
      "avant_A_Apres": "Apres",
      "numero": "9",
      "alineaDesignation": {
        "@xmlns:xsi": "http://www.w3.org/2001/XMLSchema-instance",
        "@xsi:nil": "true"
      }
    }
  },
  "corps": {
    "dispositif": "<p style=\"text-align: justify;\">Apr&#232;s l&#8217;alin&#233;a&#160;9, ins&#233;rer l&#8217;alin&#233;a suivant&#160;:</p><p style=\"text-align: justify;\">&#171;&#160;&#8211;&#160;les s&#233;vices graves ou actes de cruaut&#233; envers les animaux, pr&#233;vus notamment aux articles&#160;521&#8209;1 et&#160;521&#8209;2&#160;;&#160;&#187;.</p>",
    "exposeSommaire": "<p style=\"border: none;\">En compl&#233;ment de notre amendement sur l&#8217;article 3 du projet de loi organique qui d&#233;finit des conditions de probit&#233; stricte pour les candidats aux &#233;lections, mais &#233;galement pour les ministres et secr&#233;taires d&#8217;&#201;tat, pour leurs membres de cabinet et pour les membres du Conseil &#233;conomique, social et environnemental, nous estimons que le prononc&#233; obligatoire d&#8217;une peine compl&#233;mentaire pour les infractions list&#233;es dans cet article va dans le sens d&#8217;une meilleure probit&#233; de la vie publique.</p><p>Nous proposons de compl&#233;ter cette liste par les crimes et d&#233;lits suivants&#160;qui nous paraissent tout autant incompatible avec l&#8217;exercice de tels mandats : crimes, violences, agression sexuelle autre que le viol, harc&#232;lement sexuel, harc&#232;lement moral, prox&#233;n&#233;tisme.</p>",
    "annexeExposeSommaire": {
      "@xmlns:xsi": "http://www.w3.org/2001/XMLSchema-instance",
      "@xsi:nil": "true"
    }
  },
  "representations": {
    "representation": {
      "nom": "PDF",
      "typeMime": {
        "type": "application",
        "subType": "PDF"
      },
      "statutRepresentation": {
        "verbatim": "true",
        "canonique": "true",
        "officielle": "true",
        "transcription": "false",
        "enregistrement": "false"
      },
      "repSource": {
        "@xmlns:xsi": "http://www.w3.org/2001/XMLSchema-instance",
        "@xsi:nil": "true"
      },
      "offset": {
        "@xmlns:xsi": "http://www.w3.org/2001/XMLSchema-instance",
        "@xsi:nil": "true"
      },
      "contenu": {
        "documentURI": "/15/amendements/0098/CION_LOIS/CL62.pdf"
      },
      "dateDispoRepresentation": {
        "@xmlns:xsi": "http://www.w3.org/2001/XMLSchema-instance",
        "@xsi:nil": "true"
      }
    }
  },
  "seanceDiscussion": {
    "@xmlns:xsi": "http://www.w3.org/2001/XMLSchema-instance",
    "@xsi:nil": "true"
  },
  "sort": {
    "dateSaisie": "2017-07-19T10:45:50.000+02:00",
    "sortEnSeance": "Tombé"
  },
  "dateDepot": "2017-07-17T02:00:00.000+02:00",
  "dateDistribution": "2017-07-19T02:00:00.000+02:00",
  "article99": "0",
  "loiReference": {
    "codeLoi": null,
    "divisionCodeLoi": {
      "@xmlns:xsi": "http://www.w3.org/2001/XMLSchema-instance",
      "@xsi:nil": "true"
    }
  }
}