{
  "@xmlns": "http://schemas.assemblee-nationale.fr/referentiel",
  "uid": "AMANR5L15PO59048B0235P1D1N336",
  "identifiant": {
    "legislature": "15",
    "numero": "336",
    "numRect": "0",
    "saisine": {
      "refTexteLegislatif": "PRJLANR5L15B0235",
      "numeroPartiePLF": "1",
      "organeExamen": "PO59048",
      "mentionSecondeDeliberation": "0"
    }
  },
  "numeroLong": "I-CF336",
  "etapeTexte": "1ère lecture (1ère assemblée saisie)",
  "triAmendement": "aabo",
  "cardinaliteAmdtMultiples": "1",
  "amendementParent": {
    "@xmlns:xsi": "http://www.w3.org/2001/XMLSchema-instance",
    "@xsi:nil": "true"
  },
  "etat": "Discuté",
  "signataires": {
    "auteur": {
      "typeAuteur": "Depute",
      "acteurRef": "PA332523",
      "organeRef": {
        "@xmlns:xsi": "http://www.w3.org/2001/XMLSchema-instance",
        "@xsi:nil": "true"
      },
      "groupePolitiqueRef": "PO730934"
    },
    "cosignataires": {
      "acteurRef": "PA332523"
    },
    "texteAffichable": "Mme&#160;Dalloz"
  },
  "pointeurFragmentTexte": {
    "missionVisee": {
      "@xmlns:xsi": "http://www.w3.org/2001/XMLSchema-instance",
      "@xsi:nil": "true"
    },
    "division": {
      "titre": "Article 19",
      "articleDesignationCourte": "APRÈS ART. 19",
      "type": "ARTICLE",
      "avant_A_Apres": "Après",
      "divisionRattachee": "APRÈS L'ARTICLE 19, insérer l'article suivant:",
      "articleAdditionnel": "1",
      "chapitreAdditionnel": {
        "@xmlns:xsi": "http://www.w3.org/2001/XMLSchema-instance",
        "@xsi:nil": "true"
      },
      "urlDivisionTexteVise": "/15/textes/0235A.asp#D_Article_19"
    },
    "alinea": {
      "@xmlns:xsi": "http://www.w3.org/2001/XMLSchema-instance",
      "@xsi:nil": "true"
    }
  },
  "corps": {
    "dispositif": "<p style=\"text-align: justify;\">&#171;&#160;Au 4 de l&#8217;article&#160;224 du code des douanes &#171;&#160;33&#160;%&#160;&#187; est remplac&#233; par &#171;&#160;25&#160;%&#160;&#187;, &#171;&#160;55&#160;%&#160;&#187; est remplac&#233; par &#171;&#160;45&#160;%&#160;&#187; et &#171;&#160;80&#160;%&#160;&#187; est remplac&#233; par &#171;&#160;75&#160;%&#160;&#187;&#160;&#187;.</p>",
    "exposeSommaire": "<p style=\"text-align: justify;\">Depuis 2006, le Conservatoire est affectataire principal du DAFN. Dans ce contexte, le plafond d&#8217;affectation est fix&#233; &#224; 38,5 M&#8364; depuis l&#8217;exercice 2016 gr&#226;ce &#224; la forte mobilisation des parlementaires lors des discussions des lois de finances. Ce niveau est maintenu par le Gouvernement dans l&#8217;actuel projet de loi de finances.&#160;</p><p style=\"text-align: justify;\">Cependant le produit de cette taxe (hors DAFN Corse) a connu une baisse r&#233;guli&#232;re de 41 M&#8364; en 2014 (frais de recouvrement des douanes d&#233;duits) &#224; 38 M&#8364; en 2017 et ce en d&#233;pit de l&#8217;augmentation du nombre de navires de plaisance pr&#233;sents en flotte.</p><p style=\"text-align: justify;\">En effet, du fait d&#8217;une forte d&#233;gressivit&#233; de la taxe, les entr&#233;es en flotte ne suffisent pas &#224; compenser&#160;les sorties d&#8217;un nombre important de navires du dispositif par l&#8217;effet m&#233;canique des abattements v&#233;tust&#233; pr&#233;vus &#224; l&#8217;article&#160;224 du code des douanes.</p><p style=\"text-align: justify;\">En outre, et &#224; la diff&#233;rence de nombreux dispositifs fiscaux, ces abattements ob&#233;issent &#224; un bar&#232;me qui ne connait pas d&#8217;actualisation automatique et qui se trouve donc inchang&#233; depuis le 1<sup>er</sup> janvier 2013.</p><p style=\"text-align: justify;\">Le vieillissement de la flotte de plaisance (les bateaux de plus de 25 ans constituent aujourd&#8217;hui la majorit&#233; de la flotte de navires) conduit par cons&#233;quent &#224; une baisse de l&#8217;assiette de collecte du DAFN.</p><p style=\"text-align: justify;\">Enfin, dans la perspective de la mise en place du financement de la fili&#232;re de recyclage des bateaux hors d&#8217;usage, assise pour partie sur la mobilisation de cette ressource fiscale, il parait coh&#233;rent de faire contribuer au moins en partie les navires les plus anciens &#224; ce dispositif.</p><p style=\"text-align: justify;\">La modification propos&#233;e permettrait donc de financer conjointement le Conservatoire (38,5 M&#8364;) et la mise en place de la REP &#224; hauteur de 2&#160;%&#160;et potentiellement jusqu&#8217;&#224; 5&#160;% telle que pr&#233;vue par la loi.</p>",
    "annexeExposeSommaire": {
      "@xmlns:xsi": "http://www.w3.org/2001/XMLSchema-instance",
      "@xsi:nil": "true"
    }
  },
  "representations": {
    "representation": {
      "nom": "PDF",
      "typeMime": {
        "type": "application",
        "subType": "PDF"
      },
      "statutRepresentation": {
        "verbatim": "true",
        "canonique": "true",
        "officielle": "true",
        "transcription": "false",
        "enregistrement": "false"
      },
      "repSource": {
        "@xmlns:xsi": "http://www.w3.org/2001/XMLSchema-instance",
        "@xsi:nil": "true"
      },
      "offset": {
        "@xmlns:xsi": "http://www.w3.org/2001/XMLSchema-instance",
        "@xsi:nil": "true"
      },
      "contenu": {
        "documentURI": "/15/amendements/0235A/CION_FIN/CF336.pdf"
      },
      "dateDispoRepresentation": {
        "@xmlns:xsi": "http://www.w3.org/2001/XMLSchema-instance",
        "@xsi:nil": "true"
      }
    }
  },
  "seanceDiscussion": {
    "@xmlns:xsi": "http://www.w3.org/2001/XMLSchema-instance",
    "@xsi:nil": "true"
  },
  "sort": {
    "dateSaisie": "2017-10-12T13:43:40.000+02:00",
    "sortEnSeance": "Non soutenu"
  },
  "dateDepot": "2017-10-06T02:00:00.000+02:00",
  "dateDistribution": "2017-10-11T02:00:00.000+02:00",
  "article99": "0",
  "loiReference": {
    "codeLoi": "douanes",
    "divisionCodeLoi": "224 4"
  }
}