{
  "@xmlns": "http://schemas.assemblee-nationale.fr/referentiel",
  "uid": "AMANR5L15PO419610B0846P0D1N630",
  "identifiant": {
    "legislature": "15",
    "numero": "630",
    "numRect": "0",
    "saisine": {
      "refTexteLegislatif": "PRJLANR5L15B0846",
      "numeroPartiePLF": "0",
      "organeExamen": "PO419610",
      "mentionSecondeDeliberation": "0"
    }
  },
  "numeroLong": "CE630",
  "etapeTexte": "1ère lecture (1ère assemblée saisie)",
  "triAmendement": "fwi",
  "cardinaliteAmdtMultiples": "1",
  "amendementParent": {
    "@xmlns:xsi": "http://www.w3.org/2001/XMLSchema-instance",
    "@xsi:nil": "true"
  },
  "etat": "Discuté",
  "signataires": {
    "auteur": {
      "typeAuteur": "Depute",
      "acteurRef": "PA721718",
      "organeRef": {
        "@xmlns:xsi": "http://www.w3.org/2001/XMLSchema-instance",
        "@xsi:nil": "true"
      },
      "groupePolitiqueRef": "PO730964"
    },
    "cosignataires": {
      "acteurRef": [
        "PA721792",
        "PA719528",
        "PA722118",
        "PA720576",
        "PA719154",
        "PA721710",
        "PA719388",
        "PA721718",
        "PA721024",
        "PA606202",
        "PA718810"
      ]
    },
    "texteAffichable": "Mme&#160;Do,  M.&#160;Portarrieu, Mme&#160;Mireille&#160;Robert, Mme&#160;Le Meur, M.&#160;Martin, Mme&#160;Sylla, Mme&#160;Peyron, Mme&#160;Guerel, M.&#160;Bois, Mme&#160;Fran&#231;oise&#160;Dumas et Mme&#160;Genetet"
  },
  "pointeurFragmentTexte": {
    "missionVisee": {
      "@xmlns:xsi": "http://www.w3.org/2001/XMLSchema-instance",
      "@xsi:nil": "true"
    },
    "division": {
      "titre": "Article 51",
      "articleDesignationCourte": "ART. 51",
      "type": "ARTICLE",
      "avant_A_Apres": "A",
      "divisionRattachee": "ARTICLE 51",
      "articleAdditionnel": {
        "@xmlns:xsi": "http://www.w3.org/2001/XMLSchema-instance",
        "@xsi:nil": "true"
      },
      "chapitreAdditionnel": {
        "@xmlns:xsi": "http://www.w3.org/2001/XMLSchema-instance",
        "@xsi:nil": "true"
      },
      "urlDivisionTexteVise": "/15/textes/0846.asp#D_Article_51"
    },
    "alinea": {
      "avant_A_Apres": "A",
      "numero": "12",
      "alineaDesignation": "Alinéa 12"
    }
  },
  "corps": {
    "dispositif": "<p style=\"text-align: justify;\">I.&#160;&#8211;&#160;Au d&#233;but de l&#8217;alin&#233;a&#160;12, substituer aux mots&#160;:</p><p style=\"text-align: justify;\">&#171;&#160;Dans les communes ayant mis en &#339;uvre la proc&#233;dure d&#8217;enregistrement de la d&#233;claration pr&#233;alable mentionn&#233;e au III,&#160;&#187;</p><p style=\"text-align: justify;\">les mots&#160;:</p><p style=\"text-align: justify;\">&#171;&#160;Dans les communes o&#249; le changement d&#8217;usage des locaux destin&#233;s &#224; l&#8217;habitation est soumis &#224; autorisation pr&#233;alable au sens des articles L.&#160;631&#8209;7 et suivants du code de la construction et de l&#8217;habitation et dans les communes se caract&#233;risant par un d&#233;s&#233;quilibre important entre l&#8217;offre et la demande de logements entra&#238;nant des difficult&#233;s d&#8217;acc&#232;s au logement dans le parc r&#233;sidentiel existant&#160;&#187;.</p><p style=\"text-align: justify;\">II.&#160;&#8211;&#160;En cons&#233;quence, &#224; l&#8217;alin&#233;a&#160;13, apr&#232;s les mots&#160;:</p><p style=\"text-align: justify;\">&#171;&#160;La commune&#160;&#187;,</p><p style=\"text-align: justify;\">ins&#233;rer les mots&#160;:</p><p style=\"text-align: justify;\">&#171;&#160;ou le repr&#233;sentant de l&#8217;&#201;tat dans le d&#233;partement&#160;&#187;.</p><p style=\"text-align: justify;\">III.&#160;&#8211;&#160;En cons&#233;quence, &#224; l&#8217;alin&#233;a&#160;16, apr&#232;s les mots&#160;:</p><p style=\"text-align: justify;\">&#171;&#160;dans laquelle est situ&#233; le meubl&#233; de tourisme&#160;&#187;</p><p style=\"text-align: justify;\">ins&#233;rer les mots&#160;:</p><p style=\"text-align: justify;\">&#171;&#160;ou du repr&#233;sentant de l&#8217;&#201;tat dans le d&#233;partement concern&#233;&#160;&#187;.</p><p style=\"text-align: justify;\">III.&#160;&#8211;&#160;En cons&#233;quence, apr&#232;s l&#8217;alin&#233;a&#160;16, ins&#233;rer l&#8217;alin&#233;a suivant&#160;:</p><p style=\"text-align: justify;\">&#171;&#160;VI.&#160;&#8211;&#160;Un arr&#234;t&#233; du ministre charg&#233; du logement pr&#233;cise les communes qui correspondent &#224; un d&#233;s&#233;quilibre important entre l&#8217;offre et la demande de logements entra&#238;nant des difficult&#233;s d&#8217;acc&#232;s au logement dans le parc r&#233;sidentiel existant, pour l&#8217;application du IV.&#160;&#187;</p>",
    "exposeSommaire": "<p style=\"text-align: justify;\">L&#8217;&#233;tude d&#8217;impact d&#8217;ELAN montre bien que l&#8217;interdiction de louer plus de 120 jours par an un logement sous le statut de r&#233;sidence principale n&#8217;est pas respect&#233; parce que la loi ne donne pas les moyens aux autorit&#233;s de la faire respecter. ELAN propose une interdiction effective assortie de sanctions.</p><p style=\"text-align: justify;\">Cette interdiction est utile parce que de nombreux loueurs abusent du statut de &#171;&#160;r&#233;sidence principale&#160;&#187; pour pouvoir louer&#160;:</p><p style=\"text-align: justify;\">- dans toute la France, sans d&#233;claration</p><p style=\"text-align: justify;\">- dans les communes de plus de 200&#160;000 habitants et dans la petite couronne parisienne, ainsi que dans les commues qui l&#8217;ont mis en place, sans autorisation de changement d&#8217;usage</p><p style=\"text-align: justify;\">- dans les communes qui ont institu&#233; cette r&#232;gle, sans d&#233;claration avec num&#233;ro d&#8217;enregistrement</p><p style=\"text-align: justify;\">Mais ELAN n&#8217;interdit l&#8217;abus de la r&#232;gle des 120 jours que pour les communes qui ont opt&#233; pour la le num&#233;ro d&#8217;enregistrement.</p><p style=\"text-align: justify;\">Or il serait utile de faire respecter cette r&#232;gle pour toutes les communes en situation de d&#233;s&#233;quilibre entre l&#8217;offre et la demande. Cela &#233;tendrait cette interdiction aux villes des r&#233;gions en d&#233;veloppement ou aux r&#233;gions touristiques dans lesquelles les locaux ont du mal &#224; se loger. Par ailleurs, cela permettrait d&#8217;&#233;tendre cette interdiction &#224; toutes les communes qui sont soumises au changement d&#8217;usage, et pas seulement &#224; celles qui ont opt&#233; pour le num&#233;ro d&#8217;enregistrement.</p><p style=\"text-align: justify;\">Concr&#232;tement, cet amendement permettra d&#8217;&#233;viter, dans les zones tendues qui seront d&#233;finies par un d&#233;cret du ministre charg&#233; du logement, qu&#8217;un bailleur ne puisse se r&#233;clamer abusivement du statut de &#171;&#160;r&#233;sidence principale&#160;&#187; pour &#233;viter de d&#233;clarer son meubl&#233; de tourisme ou pour &#233;viter de faire une demande de changement d&#8217;usage.</p><p style=\"text-align: justify;\">Cela emp&#234;chera le recours &#224; cette man&#339;uvre abusive qui facilite le d&#233;tournement des logements &#224; des fins de location touristique, et cela aidera les locaux ou les personnes en mobilit&#233; professionnelle &#224; se loger dans l&#8217;ensemble des r&#233;gions de France en situation de tension immobili&#232;re.</p><p style=\"text-align: justify;\">Il serait utile d&#8217;&#233;tendre la possibilit&#233; de contr&#244;le de cette r&#232;gle au pr&#233;fet, sans quoi celle-ci risque de rester lettre morte dans certains endroits.</p><p style=\"text-align: justify;\">(Cet amendement constitue un amendement de repli par rapport &#224; l&#8217;amendement n&#176;<span class=\"ins cts-1\"  data-cid=\"4\" data-userid=\"2039\" data-username=\"Olivier Dumont\" data-time=\"1525446365176\">CE652</span><span class=\"del cts-1\"  data-cid=\"2\" data-userid=\"2039\" data-username=\"Olivier Dumont\" data-time=\"1525446363638\">49</span> qui &#233;tend l&#8217;interdiction aux zones class&#233;<span class=\"ins cts-1\"  data-cid=\"3\" data-userid=\"2039\" data-username=\"Olivier Dumont\" data-time=\"1525859046346\">e</span>s A-B1. Il laisse le choix au gouvernement de d&#233;finir par d&#233;cret les villes en d&#233;s&#233;quilibre concern&#233;es par cette mesure. Il est suivi de l&#8217;amendement de repli n&#176;<span class=\"ins cts-1\"  data-cid=\"11\" data-userid=\"2039\" data-username=\"Olivier Dumont\" data-time=\"1525446393824\">CE247</span><span class=\"del cts-1\"  data-cid=\"9\" data-userid=\"2039\" data-username=\"Olivier Dumont\" data-time=\"1525446392626\">51</span> qui ne permet pas le contr&#244;le de cette r&#232;gle par le pr&#233;fet.)</p><p style=\"text-align: justify;\">&#160;</p>",
    "annexeExposeSommaire": {
      "@xmlns:xsi": "http://www.w3.org/2001/XMLSchema-instance",
      "@xsi:nil": "true"
    }
  },
  "representations": {
    "representation": {
      "nom": "PDF",
      "typeMime": {
        "type": "application",
        "subType": "PDF"
      },
      "statutRepresentation": {
        "verbatim": "true",
        "canonique": "true",
        "officielle": "true",
        "transcription": "false",
        "enregistrement": "false"
      },
      "repSource": {
        "@xmlns:xsi": "http://www.w3.org/2001/XMLSchema-instance",
        "@xsi:nil": "true"
      },
      "offset": {
        "@xmlns:xsi": "http://www.w3.org/2001/XMLSchema-instance",
        "@xsi:nil": "true"
      },
      "contenu": {
        "documentURI": "/15/amendements/0846/CION-ECO/CE630.pdf"
      },
      "dateDispoRepresentation": {
        "@xmlns:xsi": "http://www.w3.org/2001/XMLSchema-instance",
        "@xsi:nil": "true"
      }
    }
  },
  "seanceDiscussion": {
    "@xmlns:xsi": "http://www.w3.org/2001/XMLSchema-instance",
    "@xsi:nil": "true"
  },
  "sort": {
    "dateSaisie": "2018-05-18T18:27:49.000+02:00",
    "sortEnSeance": "Retiré"
  },
  "dateDepot": "2018-05-04T02:00:00.000+02:00",
  "dateDistribution": "2018-05-15T02:00:00.000+02:00",
  "article99": "0",
  "loiReference": {
    "codeLoi": "4",
    "divisionCodeLoi": {
      "@xmlns:xsi": "http://www.w3.org/2001/XMLSchema-instance",
      "@xsi:nil": "true"
    }
  }
}