{
  "@xmlns": "http://schemas.assemblee-nationale.fr/referentiel",
  "uid": "AMANR5L15SEA717460BTC0105P0D1N287",
  "identifiant": {
    "legislature": "15",
    "numero": "287",
    "numRect": "0",
    "saisine": {
      "refTexteLegislatif": "PRJLANR5L15BTC0105",
      "numeroPartiePLF": "0",
      "organeExamen": "PO717460",
      "mentionSecondeDeliberation": "0"
    }
  },
  "numeroLong": "287",
  "etapeTexte": "1ère lecture (2ème assemblée saisie)",
  "triAmendement": "bzzzzs",
  "cardinaliteAmdtMultiples": "1",
  "amendementParent": {
    "@xmlns:xsi": "http://www.w3.org/2001/XMLSchema-instance",
    "@xsi:nil": "true"
  },
  "etat": "Discuté",
  "signataires": {
    "auteur": {
      "typeAuteur": "Depute",
      "acteurRef": "PA719930",
      "organeRef": {
        "@xmlns:xsi": "http://www.w3.org/2001/XMLSchema-instance",
        "@xsi:nil": "true"
      },
      "groupePolitiqueRef": "PO730946"
    },
    "cosignataires": {
      "acteurRef": "PA719930"
    },
    "texteAffichable": "M.&#160;Vallaud"
  },
  "pointeurFragmentTexte": {
    "missionVisee": {
      "@xmlns:xsi": "http://www.w3.org/2001/XMLSchema-instance",
      "@xsi:nil": "true"
    },
    "division": {
      "titre": "Article 19",
      "articleDesignationCourte": "APRÈS ART. 19",
      "type": "ARTICLE",
      "avant_A_Apres": "Après",
      "divisionRattachee": "APRÈS L'ARTICLE 19, insérer l'article suivant:",
      "articleAdditionnel": "1",
      "chapitreAdditionnel": {
        "@xmlns:xsi": "http://www.w3.org/2001/XMLSchema-instance",
        "@xsi:nil": "true"
      },
      "urlDivisionTexteVise": "/15/textes/0105.asp#D_Article_19"
    },
    "alinea": {
      "@xmlns:xsi": "http://www.w3.org/2001/XMLSchema-instance",
      "@xsi:nil": "true"
    }
  },
  "corps": {
    "dispositif": "<p style=\"text-align: justify;\">Apr&#232;s le dixi&#232;me alin&#233;a de l&#8217;article&#160;8 de la loi organique n&#176; 2009&#8209;403 du 15 avril 2009 relative &#224; l&#8217;application des articles 34&#8209;1, 39 et 44 de la Constitution, est ins&#233;r&#233; un nouvel alin&#233;a ainsi r&#233;dig&#233;&#160;:</p><p style=\"text-align: justify;\">&#171;&#160;- le r&#233;sultat de la consultation organis&#233;e avant la saisine du Conseil d&#8217;&#201;tat afin de recueillir l&#8217;avis des citoyens&#160;;&#160;&#187;</p>",
    "exposeSommaire": "<p style=\"text-align: justify;\">&#171;&#160;La confiance ne se d&#233;cr&#232;te pas, elle se gagne&#160;&#187; ainsi que la d&#233;clar&#233; la Garde des sceaux lors de la pr&#233;sentation de ces deux projets de loi devant la commission des lois de l&#8217;Assembl&#233;e nationale. Mais comment pourrait-elle &#234;tre gagn&#233;e lorsque les textes sont discut&#233;s dans de telles conditions&#160;? Ne faudrait-il pas pour gagner cette confiance, s&#8217;assurer que les lois soient &#233;labor&#233;es de mani&#232;re &#224; garantir leur bonne qualit&#233;&#160;? &#192; ce rythme les lois s&#8217;empilent sans que les citoyens soient en mesure d&#8217;en comprendre le sens. Prendre le temps de consulter les citoyens est certainement une mesure qui permettrait de gagner leur confiance au regard de l&#8217;action publique. Tel est l&#8217;objet de cet amendement.</p><p style=\"text-align: justify;\">Cette consultation aurait lieu par principe sur tout projet de loi et pourrait donc varier dans son ampleur selon l&#8217;int&#233;r&#234;t suscit&#233; du c&#244;t&#233; des citoyens, qui pourraient formuler un avis g&#233;n&#233;ral et/ou des suggestions de modifications sur l&#8217;ensemble des projets de loi. En attendant de pouvoir proposer dans le cadre d&#8217;un &#233;ventuel projet de loi constitutionnelle le droit d&#8217;amendement citoyen, cet amendement permettrait de faire un premier pas dans le sens d&#8217;une d&#233;mocratie collaboratrice.</p>",
    "annexeExposeSommaire": {
      "@xmlns:xsi": "http://www.w3.org/2001/XMLSchema-instance",
      "@xsi:nil": "true"
    }
  },
  "representations": {
    "representation": {
      "nom": "PDF",
      "typeMime": {
        "type": "application",
        "subType": "PDF"
      },
      "statutRepresentation": {
        "verbatim": "true",
        "canonique": "true",
        "officielle": "true",
        "transcription": "false",
        "enregistrement": "false"
      },
      "repSource": {
        "@xmlns:xsi": "http://www.w3.org/2001/XMLSchema-instance",
        "@xsi:nil": "true"
      },
      "offset": {
        "@xmlns:xsi": "http://www.w3.org/2001/XMLSchema-instance",
        "@xsi:nil": "true"
      },
      "contenu": {
        "documentURI": "/15/amendements/0105/AN/287.pdf"
      },
      "dateDispoRepresentation": {
        "@xmlns:xsi": "http://www.w3.org/2001/XMLSchema-instance",
        "@xsi:nil": "true"
      }
    }
  },
  "seanceDiscussion": "RUANR5L15S2017IDS20663",
  "sort": {
    "dateSaisie": "2017-07-29T02:43:28.000+02:00",
    "sortEnSeance": "Rejeté"
  },
  "dateDepot": "2017-07-21T02:00:00.000+02:00",
  "dateDistribution": "2017-07-25T02:00:00.000+02:00",
  "article99": "0",
  "loiReference": {
    "codeLoi": {
      "@xmlns:xsi": "http://www.w3.org/2001/XMLSchema-instance",
      "@xsi:nil": "true"
    },
    "divisionCodeLoi": {
      "@xmlns:xsi": "http://www.w3.org/2001/XMLSchema-instance",
      "@xsi:nil": "true"
    }
  }
}