{
  "@xmlns": "http://schemas.assemblee-nationale.fr/referentiel",
  "uid": "AMANR5L15PO59051B2357P0D1N1047",
  "identifiant": {
    "legislature": "15",
    "numero": "1047",
    "numRect": "0",
    "saisine": {
      "refTexteLegislatif": "PRJLANR5L15B2357",
      "numeroPartiePLF": "0",
      "organeExamen": "PO59051",
      "mentionSecondeDeliberation": "0"
    }
  },
  "numeroLong": "CL1047",
  "etapeTexte": "1ère lecture (2ème assemblée saisie)",
  "triAmendement": "bkiaaaaaaaaaaaaaaaaaaaaaaaaaaaaaaaaaaaaaaaaaaaaaaaax",
  "cardinaliteAmdtMultiples": "1",
  "amendementParent": {
    "@xmlns:xsi": "http://www.w3.org/2001/XMLSchema-instance",
    "@xsi:nil": "true"
  },
  "etat": "Discuté",
  "signataires": {
    "auteur": {
      "typeAuteur": "Depute",
      "acteurRef": "PA722150",
      "organeRef": {
        "@xmlns:xsi": "http://www.w3.org/2001/XMLSchema-instance",
        "@xsi:nil": "true"
      },
      "groupePolitiqueRef": "PO730964"
    },
    "cosignataires": {
      "acteurRef": [
        "PA721142",
        "PA721792",
        "PA719994",
        "PA719684",
        "PA722292",
        "PA721262",
        "PA721584",
        "PA721568",
        "PA719616",
        "PA721616",
        "PA719692",
        "PA677483",
        "PA721158",
        "PA721800",
        "PA720108",
        "PA721296",
        "PA721364",
        "PA718918",
        "PA719748",
        "PA720370",
        "PA721908",
        "PA2449",
        "PA606507",
        "PA720454",
        "PA722150",
        "PA2828",
        "PA720154",
        "PA721702",
        "PA719302",
        "PA721624",
        "PA721880",
        "PA719866",
        "PA720908",
        "PA720318",
        "PA719952",
        "PA719202"
      ]
    },
    "texteAffichable": "M.&#160;Houli&#233;,  M.&#160;Vuilletet, Mme&#160;Abadie, M.&#160;Anglade, Mme&#160;Avia, M.&#160;Boudi&#233;, Mme&#160;Braun-Pivet, Mme&#160;Chalas, Mme&#160;Dubost, Mme&#160;Dubr&#233;-Chirat, M.&#160;Eliaou, M.&#160;Euzet, M.&#160;Fauvergue, Mme&#160;Forteza, M.&#160;Gauvain, M.&#160;Gouffier-Cha, Mme&#160;Guerel, Mme&#160;Gu&#233;venoux, M.&#160;Houbron, Mme&#160;Kamowski, Mme&#160;Louis, M.&#160;Matras, M.&#160;Mazars, M.&#160;Mendes, M.&#160;Mis, Mme&#160;Moutchou, Mme&#160;Oppelt, M.&#160;Paris, M.&#160;Person, M.&#160;Pont, M.&#160;Rudigoz, M.&#160;Rupin, M.&#160;Terlier, Mme&#160;Thourot, M.&#160;Tourret et Mme&#160;Zannier"
  },
  "pointeurFragmentTexte": {
    "missionVisee": {
      "@xmlns:xsi": "http://www.w3.org/2001/XMLSchema-instance",
      "@xsi:nil": "true"
    },
    "division": {
      "titre": "Article 7 bis",
      "articleDesignationCourte": "ART. 7 BIS",
      "type": "ARTICLE",
      "avant_A_Apres": "A",
      "divisionRattachee": "ARTICLE 7 BIS",
      "articleAdditionnel": {
        "@xmlns:xsi": "http://www.w3.org/2001/XMLSchema-instance",
        "@xsi:nil": "true"
      },
      "chapitreAdditionnel": {
        "@xmlns:xsi": "http://www.w3.org/2001/XMLSchema-instance",
        "@xsi:nil": "true"
      },
      "urlDivisionTexteVise": "/15/textes/2357.asp#D_Article_7_bis"
    },
    "alinea": {
      "@xmlns:xsi": "http://www.w3.org/2001/XMLSchema-instance",
      "@xsi:nil": "true"
    }
  },
  "corps": {
    "dispositif": "<p>Supprimer cet article.</p>",
    "exposeSommaire": "<p>Le pr&#233;sent amendement supprime l&#8217;article 7 bis ayant pour objet de r&#233;tablir l&#8217;int&#233;r&#234;t communautaire de la comp&#233;tence voirie.</p><p>En l'&#233;tat actuel du droit, cette derni&#232;re est attribu&#233;e de plein droit aux intercommunalit&#233;s sans n&#233;cessit&#233; de reconna&#238;tre pr&#233;alablement un int&#233;r&#234;t communautaire. Cet article aurait pour effet de transf&#233;rer uniquement les voiries reconnues d'int&#233;r&#234;t communautaire aux EPCI et de conserver la comp&#233;tence des communes sur les autres.</p>",
    "annexeExposeSommaire": {
      "@xmlns:xsi": "http://www.w3.org/2001/XMLSchema-instance",
      "@xsi:nil": "true"
    },
    "cartoucheDelaiDepotDepasse": {
      "@xmlns:xsi": "http://www.w3.org/2001/XMLSchema-instance",
      "@xsi:nil": "true"
    },
    "avantAppel": {
      "@xmlns:xsi": "http://www.w3.org/2001/XMLSchema-instance",
      "@xsi:nil": "true"
    }
  },
  "representations": {
    "representation": {
      "nom": "PDF",
      "typeMime": {
        "type": "application",
        "subType": "PDF"
      },
      "statutRepresentation": {
        "verbatim": "true",
        "canonique": "true",
        "officielle": "true",
        "transcription": "false",
        "enregistrement": "false"
      },
      "repSource": {
        "@xmlns:xsi": "http://www.w3.org/2001/XMLSchema-instance",
        "@xsi:nil": "true"
      },
      "offset": {
        "@xmlns:xsi": "http://www.w3.org/2001/XMLSchema-instance",
        "@xsi:nil": "true"
      },
      "contenu": {
        "documentURI": "/15/amendements/2357/CION_LOIS/CL1047.pdf"
      },
      "dateDispoRepresentation": {
        "@xmlns:xsi": "http://www.w3.org/2001/XMLSchema-instance",
        "@xsi:nil": "true"
      }
    }
  },
  "seanceDiscussion": {
    "@xmlns:xsi": "http://www.w3.org/2001/XMLSchema-instance",
    "@xsi:nil": "true"
  },
  "sort": {
    "dateSaisie": "2019-11-06T23:16:19.000+01:00",
    "sortEnSeance": "Adopté"
  },
  "dateDepot": "2019-11-02T01:00:00.000+01:00",
  "dateDistribution": "2019-11-05T01:00:00.000+01:00",
  "article99": "0",
  "loiReference": {
    "codeLoi": {
      "@xmlns:xsi": "http://www.w3.org/2001/XMLSchema-instance",
      "@xsi:nil": "true"
    },
    "divisionCodeLoi": {
      "@xmlns:xsi": "http://www.w3.org/2001/XMLSchema-instance",
      "@xsi:nil": "true"
    }
  }
}