{
  "@xmlns": "http://schemas.assemblee-nationale.fr/referentiel",
  "uid": "AMANR5L15PO420120B1681P0D1N806",
  "identifiant": {
    "legislature": "15",
    "numero": "806",
    "numRect": "0",
    "saisine": {
      "refTexteLegislatif": "PRJLANR5L15B1681",
      "numeroPartiePLF": "0",
      "organeExamen": "PO420120",
      "mentionSecondeDeliberation": "0"
    }
  },
  "numeroLong": "AS806",
  "etapeTexte": "1ère lecture (1ère assemblée saisie)",
  "triAmendement": "ckaaaaaaaaaaaaaaaaaaaaaaaaaaaaaaaaaaaaaaaaaaaaaaaabhp",
  "cardinaliteAmdtMultiples": "1",
  "amendementParent": {
    "@xmlns:xsi": "http://www.w3.org/2001/XMLSchema-instance",
    "@xsi:nil": "true"
  },
  "etat": "Irrecevable",
  "signataires": {
    "auteur": {
      "typeAuteur": "Depute",
      "acteurRef": "PA719146",
      "organeRef": {
        "@xmlns:xsi": "http://www.w3.org/2001/XMLSchema-instance",
        "@xsi:nil": "true"
      },
      "groupePolitiqueRef": "PO759900"
    },
    "cosignataires": {
      "acteurRef": [
        "PA719286",
        "PA331582",
        "PA719146",
        "PA405480",
        "PA719138",
        "PA608292"
      ]
    },
    "texteAffichable": "M.&#160;Acquaviva,  M.&#160;Castellani, M.&#160;Colombani, Mme&#160;Dubi&#233;, M.&#160;Pupponi et M.&#160;Philippe&#160;Vigier"
  },
  "pointeurFragmentTexte": {
    "missionVisee": {
      "@xmlns:xsi": "http://www.w3.org/2001/XMLSchema-instance",
      "@xsi:nil": "true"
    },
    "division": {
      "titre": "Article 9",
      "articleDesignationCourte": "APRÈS ART. 9",
      "type": "ARTICLE",
      "avant_A_Apres": "Après",
      "divisionRattachee": "APRÈS L'ARTICLE 9, insérer l'article suivant:",
      "articleAdditionnel": "1",
      "chapitreAdditionnel": {
        "@xmlns:xsi": "http://www.w3.org/2001/XMLSchema-instance",
        "@xsi:nil": "true"
      },
      "urlDivisionTexteVise": "/15/textes/1681.asp#D_Article_9"
    },
    "alinea": {
      "@xmlns:xsi": "http://www.w3.org/2001/XMLSchema-instance",
      "@xsi:nil": "true"
    }
  },
  "corps": {
    "dispositif": "<p style=\"text-align: justify;\">I - Apr&#232;s l'article L322-5-4 du code de la s&#233;curit&#233; sociale, il est rajout&#233; un nouvel article ainsi r&#233;dig&#233; :</p><p>\"Article L322-5-5 nouveau. En Corse, en l'absence d'une sp&#233;cialit&#233; m&#233;dicale sur place et en raison de son statut d'&#238;le-montagne conform&#233;ment &#224; l'article 8 bis de la loi n&#176;85-30 du 9 janvier 1985, la prise en charge des frais de transport de l'assur&#233; et de la personne l'accompagnant par avion ou par bateau de ligne r&#233;guli&#232;re est automatique par l'organisme qui sert les prestations.<br /> Lorsque l'assur&#233; est un mineur en Affectation de Longue Dur&#233;e qui rel&#232;ve d'une sp&#233;cialit&#233; inexistante en Corse, les frais de transport d'une deuxi&#232;me personne l'accompagnant sont &#233;galement pris en charge ainsi que les frais d'h&#233;bergement expos&#233;s par l'assur&#233; et la personne l'accompagnant. Un d&#233;cret fixe les modalit&#233;s d&#8217;application du pr&#233;sent article.\"</p><p>II. &#8211; Le I entre en vigueur &#224; compter du 1er janvier 2020.</p><p>III.&#160;&#8211;&#160;La perte de recettes pour l&#8217;&#201;tat est compens&#233;e &#224; due concurrence par la cr&#233;ation d&#8217;une taxe additionnelle aux droits mentionn&#233;s aux articles 575 et 575 A du code g&#233;n&#233;ral des imp&#244;ts.</p><p>IV.&#160;&#8211;&#160;La perte de recettes pour les organismes de s&#233;curit&#233; sociale est compens&#233;e &#224; due concurrence par la majoration des droits mentionn&#233;s aux articles 575 et 575 A du code g&#233;n&#233;ral des imp&#244;ts.</p>",
    "exposeSommaire": "<p style=\"text-align: justify;\">La Corse est la seule r&#233;gion qui ne dispose pas de Centre Hospitalier Universitaire (CHU). Cette situation ne permet pas de r&#233;pondre &#224; tous les besoins des patients dans la mesure o&#249; certaines sp&#233;cialit&#233;s n'y sont pas pratiqu&#233;es, entrainant ainsi 26 000 d&#233;placements environ sur le continent &#224; Marseille, Nice ou Paris.<br /> Cette probl&#233;matique, que l'on peut qualifier d'intrins&#232;que &#224; l'insularit&#233; et &#224; la faible d&#233;mographie, rev&#234;t donc une ampleur consid&#233;rable occasionnant de nombreuses difficult&#233;s mat&#233;rielles et financi&#232;res pour de nombreuses familles.</p><p>A cette sp&#233;cificit&#233; sanitaire bien identifi&#233;e, source d'in&#233;galit&#233; devant l'acc&#232;s au soin des patients insulaires, ce sont les r&#232;gles de droit commun du code de la S&#233;curit&#233; sociale qui y sont appliqu&#233;es, en termes de prise en charge des frais de transport et d'h&#233;bergement (assur&#233; et accompagnant(s)), alors que ces frais sont directement li&#233;s &#224; l&#8217;insularit&#233; et &#224; l&#8217;absence de C.H.U. On est face &#224; une v&#233;ritable double peine, assez difficile &#224; accepter, venant s&#8217;ajouter &#224; la maladie.</p><p>Il faut souligner, par ailleurs, que cette probl&#233;matique prend une toute autre tournure lorsqu&#8217;il s'agit d'un enfant en Affectation de Longue Dur&#233;e qui doit se rendre tr&#232;s r&#233;guli&#232;rement sur le continent pour y recevoir les soins.</p><p>Il faut saluer le travail et l'engagement de plusieurs associations, comme l'association \"Inseme\" ou la \"Marie-Do\", qui viennent en soutien aux personnes qui vivent en Corse et qui doivent se rendre sur le continent pour des raisons m&#233;dicales et qui, sans ces derni&#232;res, rencontreraient de tr&#232;s grandes difficult&#233;s.<br /> Ces associations alertent les pouvoirs publics, depuis de nombreuses ann&#233;es, sur les in&#233;galit&#233;s devant l'acc&#232;s aux soins des Corses. Elles pointent notamment du doigt les &#233;carts r&#232;glementaires, au premier rang desquels l&#8217;accord pr&#233;alable de l'organisme assureur constituant une formalit&#233; administrative p&#233;nalisante et inutile pour les sp&#233;cialit&#233;s qui sont inexistantes en Corse ou en cas d&#8217;&#233;vacuation sanitaire.</p><p>L'association indique que \"<i>le patient et sa famille doivent attendre 15 jours l&#8217;accord de l&#8217;Assurance maladie pour un enfant ayant un cancer alors qu&#8217;il ne peut pas &#234;tre pris en charge en Corse ! Une personne dont l&#8217;&#233;tat de sant&#233; a entrain&#233; une &#233;vacuation sanitaire, n&#8217;a pas une prise en charge syst&#233;matique de son billet retour. Elle doit faire l&#8217;avance des frais et ne peut pas b&#233;n&#233;ficier du tarif r&#233;sident car l&#8217;aller n&#8217;a pas &#233;t&#233; effectu&#233; sur un avion de ligne</i> !\"</p><p>C'est pourquoi, les auteurs de l'amendement proposent de r&#233;tablir l'&#233;quit&#233; entre les assur&#233;s r&#233;sidant en Corse et les autres, en modifiant le code de la s&#233;curit&#233; sociale (dans la partie l&#233;gislative) afin de permettre la prise en charge syst&#233;matique des frais de transport et d'h&#233;bergement.</p><p>L'introduction de cet article dans ce pr&#233;sent projet de loi constituerait une avanc&#233;e majeure pour la Corse qui permettrait, par la suite, de pr&#233;parer et de publier les d&#233;crets visant &#224; modifier et rajouter des dispositions aux articles R.322-10-4 et R.322-10-7 du code de la s&#233;curit&#233; sociale sur la prise en charge des frais de transport.</p>",
    "annexeExposeSommaire": {
      "@xmlns:xsi": "http://www.w3.org/2001/XMLSchema-instance",
      "@xsi:nil": "true"
    },
    "cartoucheDelaiDepotDepasse": {
      "@xmlns:xsi": "http://www.w3.org/2001/XMLSchema-instance",
      "@xsi:nil": "true"
    }
  },
  "representations": {
    "representation": {
      "nom": "PDF",
      "typeMime": {
        "type": "application",
        "subType": "PDF"
      },
      "statutRepresentation": {
        "verbatim": "true",
        "canonique": "true",
        "officielle": "true",
        "transcription": "false",
        "enregistrement": "false"
      },
      "repSource": {
        "@xmlns:xsi": "http://www.w3.org/2001/XMLSchema-instance",
        "@xsi:nil": "true"
      },
      "offset": {
        "@xmlns:xsi": "http://www.w3.org/2001/XMLSchema-instance",
        "@xsi:nil": "true"
      },
      "contenu": {
        "documentURI": "/15/amendements/1681/CION-SOC/AS806.pdf"
      },
      "dateDispoRepresentation": {
        "@xmlns:xsi": "http://www.w3.org/2001/XMLSchema-instance",
        "@xsi:nil": "true"
      }
    }
  },
  "seanceDiscussion": {
    "@xmlns:xsi": "http://www.w3.org/2001/XMLSchema-instance",
    "@xsi:nil": "true"
  },
  "sort": {
    "@xmlns:xsi": "http://www.w3.org/2001/XMLSchema-instance",
    "@xsi:nil": "true"
  },
  "dateDepot": "2019-03-08T01:00:00.000+01:00",
  "dateDistribution": "2019-03-09T01:00:00.000+01:00",
  "article99": "0",
  "loiReference": {
    "codeLoi": "sécurité sociale",
    "divisionCodeLoi": "l322-5-4"
  }
}