{
  "@xmlns": "http://schemas.assemblee-nationale.fr/referentiel",
  "uid": "AMANR5L15PO419865B0627P0D1N185",
  "identifiant": {
    "legislature": "15",
    "numero": "185",
    "numRect": "0",
    "saisine": {
      "refTexteLegislatif": "PRJLANR5L15B0627",
      "numeroPartiePLF": "0",
      "organeExamen": "PO419865",
      "mentionSecondeDeliberation": "0"
    }
  },
  "numeroLong": "CD185",
  "etapeTexte": "1ère lecture (1ère assemblée saisie)",
  "triAmendement": "bazi",
  "cardinaliteAmdtMultiples": "1",
  "amendementParent": {
    "@xmlns:xsi": "http://www.w3.org/2001/XMLSchema-instance",
    "@xsi:nil": "true"
  },
  "etat": "Discuté",
  "signataires": {
    "auteur": {
      "typeAuteur": "Depute",
      "acteurRef": "PA720278",
      "organeRef": {
        "@xmlns:xsi": "http://www.w3.org/2001/XMLSchema-instance",
        "@xsi:nil": "true"
      },
      "groupePolitiqueRef": "PO730964"
    },
    "cosignataires": {
      "acteurRef": [
        "PA609520",
        "PA720278"
      ]
    },
    "texteAffichable": "M.&#160;Orphelin et Mme&#160;Pompili"
  },
  "pointeurFragmentTexte": {
    "missionVisee": {
      "@xmlns:xsi": "http://www.w3.org/2001/XMLSchema-instance",
      "@xsi:nil": "true"
    },
    "division": {
      "titre": "Article 11",
      "articleDesignationCourte": "ART. 11",
      "type": "ARTICLE",
      "avant_A_Apres": "A",
      "divisionRattachee": "ARTICLE 11",
      "articleAdditionnel": {
        "@xmlns:xsi": "http://www.w3.org/2001/XMLSchema-instance",
        "@xsi:nil": "true"
      },
      "chapitreAdditionnel": {
        "@xmlns:xsi": "http://www.w3.org/2001/XMLSchema-instance",
        "@xsi:nil": "true"
      },
      "urlDivisionTexteVise": "/15/textes/0627.asp#D_Article_11"
    },
    "alinea": {
      "avant_A_Apres": "A",
      "numero": "2",
      "alineaDesignation": "Alinéa 2"
    }
  },
  "corps": {
    "dispositif": "<p style=\"text-align: justify;\">I.&#160;&#8211;&#160;Substituer &#224; l&#8217;alin&#233;a&#160;2 les neuf alin&#233;as suivants&#160;:</p><p style=\"text-align: justify;\">&#171;&#160;<i>Art L.&#160;230&#8209;5&#8209;1</i>.&#160;&#8211;&#160;Au plus tard le 1<sup>er</sup> janvier 2022, les personnes morales de droit public incluent, dans la composition des repas servis dans les restaurants collectifs dont elles ont la charge&#160;:</p><p style=\"text-align: justify;\">&#171;&#160;1&#176;&#160;20&#160;% de produits issus de l&#8217;agriculture biologique ou de surfaces agricoles en conversion, au sens de l&#8217;article&#160;17 du r&#232;glement (CE) n&#176; 834/2007 du Conseil du 28 juin 2007 relatif &#224; la production biologique et &#224; l&#8217;&#233;tiquetage des produits biologiques&#160;;</p><p style=\"text-align: justify;\">&#171;&#160;2&#176;&#160;30&#160;% de produits b&#233;n&#233;ficiant d&#8217;un des crit&#232;res suivants, ou satisfaisant de mani&#232;re &#233;quivalente &#224; ces crit&#232;res&#160;:</p><p style=\"text-align: justify;\">&#171;&#160;-&#160;signes ou mentions list&#233;s au 1 et au 2 de l&#8217;article L.&#160;640&#8209;2, du code rural et de la p&#234;che maritime&#160;;</p><p style=\"text-align: justify;\">&#171;&#160;-&#160;autres signes ou mentions de qualit&#233; environnementale ou sociale, selon une liste d&#233;finie par d&#233;cret et qui comprend notamment certaines des d&#233;marches de certification de conformit&#233; produits&#160;et des d&#233;marches visant une p&#234;che durable&#160;;</p><p style=\"text-align: justify;\">&#171;&#160;-&#160;commerce &#233;quitable tel que d&#233;fini au 1 et au 2 de l&#8217;article&#160;94 de la LOI n&#176; 2014&#8209;856 du 31 juillet 2014 relative &#224; l&#8217;&#233;conomie sociale et solidaire&#160;;&#160;</p><p style=\"text-align: justify;\">&#171;&#160;-&#160;produits distribu&#233;s en circuits courts, impliquant un exploitant agricole ou une organisation regroupant des exploitants agricoles, comme d&#233;finit &#224; l&#8217;article&#160;1 de la loi loi n&#176;2010&#8209;874 du 27 juillet 2010 de modernisation de l&#8217;agriculture et de la p&#234;che dans sa version consolid&#233;e au 13 mars 2018, ou produits en minimisant les impacts environnementaux et climatiques du transport de produits.</p><p style=\"text-align: justify;\">&#171;&#160;Les personnes morales de droit public mentionn&#233;es au premier alin&#233;a peuvent prendre &#233;galement progressivement en compte le co&#251;t du cycle de vie du produit.</p><p style=\"text-align: justify;\">&#171;&#160;Les personnes morales de droit public mentionn&#233;es au premier alin&#233;a informent, deux fois par an, les usagers des restaurants collectifs dont elles ont la charge de la part des produits entrant dans la composition des repas mentionn&#233;s aux deuxi&#232;me et troisi&#232;me alin&#233;as du pr&#233;sent article.&#160;&#187;</p><p style=\"text-align: justify;\">II.&#160;&#8211;&#160;En cons&#233;quence, &#224; l&#8217;alin&#233;a&#160;3, apr&#232;s le mot&#160;: &#171;&#160;&#339;uvre&#160;&#187;, supprimer les mots&#160;: &#171;&#160;ainsi que le pourcentage de produits acquis devant entrer dans la composition des repas&#160;&#187;.</p>",
    "exposeSommaire": "<p style=\"text-align: justify;\">Inscrire l&#8217;objectif de 50&#160;% dans la loi permettrait de garantir, de mani&#232;re p&#233;renne, l&#8217;atteinte de cet objectif &#224; l&#8217;horizon 2022. Pour rappel l&#8217;objectif inscrit dans le programme &#233;lectoral &#233;tait &#171;&#160;d&#8217;ici 2022, 50&#160;% des produits propos&#233;s par les cantines scolaires et les restaurants d&#8217;entreprise devront &#234;tre bio, &#233;cologiques ou issus de circuits courts.&#160;&#187;</p><p style=\"text-align: justify;\">L&#8217;amendement permet de prendre en compte toutes les d&#233;marches int&#233;ressantes, par exemple&#160;:</p><p style=\"text-align: justify;\">- Agriculture bio ou en conversion</p><p style=\"text-align: justify;\">- Label Rouge, IGP&#8230;</p><p style=\"text-align: justify;\">- P&#234;che durable, bleu blanc c&#339;ur</p><p style=\"text-align: justify;\">- Commerce &#233;quitable</p><p style=\"text-align: justify;\">- Circuits courts</p>",
    "annexeExposeSommaire": {
      "@xmlns:xsi": "http://www.w3.org/2001/XMLSchema-instance",
      "@xsi:nil": "true"
    }
  },
  "representations": {
    "representation": {
      "nom": "PDF",
      "typeMime": {
        "type": "application",
        "subType": "PDF"
      },
      "statutRepresentation": {
        "verbatim": "true",
        "canonique": "true",
        "officielle": "true",
        "transcription": "false",
        "enregistrement": "false"
      },
      "repSource": {
        "@xmlns:xsi": "http://www.w3.org/2001/XMLSchema-instance",
        "@xsi:nil": "true"
      },
      "offset": {
        "@xmlns:xsi": "http://www.w3.org/2001/XMLSchema-instance",
        "@xsi:nil": "true"
      },
      "contenu": {
        "documentURI": "/15/amendements/0627/CION-DVP/CD185.pdf"
      },
      "dateDispoRepresentation": {
        "@xmlns:xsi": "http://www.w3.org/2001/XMLSchema-instance",
        "@xsi:nil": "true"
      }
    }
  },
  "seanceDiscussion": {
    "@xmlns:xsi": "http://www.w3.org/2001/XMLSchema-instance",
    "@xsi:nil": "true"
  },
  "sort": {
    "dateSaisie": "2018-03-27T22:54:26.000+02:00",
    "sortEnSeance": "Retiré"
  },
  "dateDepot": "2018-03-23T01:00:00.000+01:00",
  "dateDistribution": "2018-03-27T02:00:00.000+02:00",
  "article99": "0",
  "loiReference": {
    "codeLoi": {
      "@xmlns:xsi": "http://www.w3.org/2001/XMLSchema-instance",
      "@xsi:nil": "true"
    },
    "divisionCodeLoi": {
      "@xmlns:xsi": "http://www.w3.org/2001/XMLSchema-instance",
      "@xsi:nil": "true"
    }
  }
}