{
  "@xmlns": "http://schemas.assemblee-nationale.fr/referentiel",
  "uid": "AMANR5L15PO420120B2296P0D1N866",
  "identifiant": {
    "legislature": "15",
    "numero": "866",
    "numRect": "0",
    "saisine": {
      "refTexteLegislatif": "PRJLANR5L15B2296",
      "numeroPartiePLF": "0",
      "organeExamen": "PO420120",
      "mentionSecondeDeliberation": "0"
    }
  },
  "numeroLong": "AS866",
  "etapeTexte": "1ère lecture (1ère assemblée saisie)",
  "triAmendement": "moaaaaaaaaaaaaaaaaaaaaaaaaaaaaaaaaaaaaaaaaaaaaaaaaabs",
  "cardinaliteAmdtMultiples": "1",
  "amendementParent": {
    "@xmlns:xsi": "http://www.w3.org/2001/XMLSchema-instance",
    "@xsi:nil": "true"
  },
  "etat": "Discuté",
  "signataires": {
    "auteur": {
      "typeAuteur": "Depute",
      "acteurRef": "PA642764",
      "organeRef": {
        "@xmlns:xsi": "http://www.w3.org/2001/XMLSchema-instance",
        "@xsi:nil": "true"
      },
      "groupePolitiqueRef": "PO758835"
    },
    "cosignataires": {
      "acteurRef": [
        "PA429893",
        "PA1198",
        "PA340343",
        "PA642764",
        "PA1592",
        "PA605069",
        "PA609590",
        "PA333818",
        "PA608695",
        "PA337483",
        "PA332614",
        "PA267233",
        "PA607553",
        "PA720988",
        "PA340357",
        "PA335532",
        "PA643145",
        "PA719930",
        "PA609332",
        "PA1809",
        "PA508",
        "PA342415",
        "PA1008",
        "PA608172",
        "PA608011",
        "PA335054",
        "PA608741",
        "PA333285",
        "PA610681"
      ]
    },
    "texteAffichable": "M.&#160;Aviragnet,  Mme&#160;Bareigts, Mme&#160;Bi&#233;mouret, Mme&#160;Vainqueur-Christophe, M.&#160;Vallaud, Mme&#160;Rabault, Mme&#160;Battistel, M.&#160;Bouillon, M.&#160;Jean-Louis&#160;Bricout, M.&#160;Carvounas, M.&#160;Alain&#160;David, Mme&#160;Laurence&#160;Dumont, M.&#160;Faure, M.&#160;Garot, M.&#160;David&#160;Habib, M.&#160;Hutin, M.&#160;Juanico, Mme&#160;Karamanli, M.&#160;J&#233;r&#244;me&#160;Lambert, M.&#160;Letchimy, Mme&#160;Manin, Mme&#160;Pau-Langevin, Mme&#160;Pires Beaune, M.&#160;Potier, M.&#160;Pueyo, M.&#160;Saulignac, Mme&#160;Tolmont, Mme&#160;Untermaier et Mme&#160;Victory"
  },
  "pointeurFragmentTexte": {
    "missionVisee": {
      "@xmlns:xsi": "http://www.w3.org/2001/XMLSchema-instance",
      "@xsi:nil": "true"
    },
    "division": {
      "titre": "Article 56",
      "articleDesignationCourte": "APRÈS ART. 56",
      "type": "ARTICLE",
      "avant_A_Apres": "Après",
      "divisionRattachee": "APRÈS L'ARTICLE 56, insérer l'article suivant:",
      "articleAdditionnel": "1",
      "chapitreAdditionnel": {
        "@xmlns:xsi": "http://www.w3.org/2001/XMLSchema-instance",
        "@xsi:nil": "true"
      },
      "urlDivisionTexteVise": "/15/textes/2296.asp#D_Article_56"
    },
    "alinea": {
      "@xmlns:xsi": "http://www.w3.org/2001/XMLSchema-instance",
      "@xsi:nil": "true"
    }
  },
  "corps": {
    "dispositif": "<p style=\"text-align: justify;\">L&#8217;article L.&#160;115&#8209;3 du code de la s&#233;curit&#233; sociale est compl&#233;t&#233; par un alin&#233;a ainsi r&#233;dig&#233;&#160;:</p><p style=\"text-align: justify;\">&#171;&#160;Les modalit&#233;s de notification des d&#233;cisions individuelles peuvent &#234;tre plurielles si l&#8217;assur&#233; en fait la demande. La d&#233;livrance d&#8217;une information d&#233;mat&#233;rialis&#233;e sans preuve de son accession par le destinataire n&#8217;est pas valable s&#8217;il a express&#233;ment demand&#233; la non d&#233;mat&#233;rialisation des d&#233;cisions individuelles le concernant.&#160;&#187;</p>",
    "exposeSommaire": "<p style=\"text-align: justify;\">Cet amendement du groupe socialistes et apparent&#233;s propose de faciliter l'accessibilit&#233; aux services de la s&#233;curit&#233; sociale pour les assur&#233;s sociaux isol&#233;s en raison de la fracture num&#233;rique.<br />&#160;<br />La d&#233;mat&#233;rialisation des courriers de l&#8217;Assurance maladie d&#233;marr&#233;e depuis 2016, est une source de simplification et de r&#233;duction des co&#251;ts, mais elle entraine &#233;galement une vraie difficult&#233; d&#8217;acc&#232;s aux droits pour les personnes victimes de la fracture num&#233;rique.<br />&#160;<br />Aussi, afin de permettre &#224; chacun d'&#234;tre bien inform&#233; des d&#233;cisions le concernant prises par les organismes de la s&#233;curit&#233; sociale, il convient de permettre aux usag&#233;s qui en font la demande de ne pas &#234;tre soumis &#224; la d&#233;mat&#233;rialisation.<br />&#160;<br />Nous rappelons que le D&#233;fenseur de droits, dans son rapport D&#233;mat&#233;rialisation et in&#233;galit&#233;s d&#8217;acc&#232;s aux services publics, publi&#233; en 2019, recommande &#171;&#160;l&#8217;adoption d&#8217;une disposition l&#233;gislative au sein du code des relations entre les usagers et l&#8217;administration imposant de pr&#233;server plusieurs modalit&#233;s d&#8217;acc&#232;s aux services publics pour qu&#8217;aucune d&#233;marche administrative ne soit accessible uniquement par voie d&#233;mat&#233;rialis&#233;e.&#160;&#187;<br />&#160;<br />Pour garantir le principe de la continuit&#233; du service public ainsi que celui de l&#8217;&#233;galit&#233; de tous devant le service public, il est essentiel de pr&#233;voir diff&#233;rentes modalit&#233;s de communication avec les organismes de S&#233;curit&#233; sociale.<br />&#160;<br />Tel est l'objectif du pr&#233;sent amendement.</p>",
    "annexeExposeSommaire": {
      "@xmlns:xsi": "http://www.w3.org/2001/XMLSchema-instance",
      "@xsi:nil": "true"
    },
    "cartoucheDelaiDepotDepasse": {
      "@xmlns:xsi": "http://www.w3.org/2001/XMLSchema-instance",
      "@xsi:nil": "true"
    },
    "avantAppel": {
      "@xmlns:xsi": "http://www.w3.org/2001/XMLSchema-instance",
      "@xsi:nil": "true"
    }
  },
  "representations": {
    "representation": {
      "nom": "PDF",
      "typeMime": {
        "type": "application",
        "subType": "PDF"
      },
      "statutRepresentation": {
        "verbatim": "true",
        "canonique": "true",
        "officielle": "true",
        "transcription": "false",
        "enregistrement": "false"
      },
      "repSource": {
        "@xmlns:xsi": "http://www.w3.org/2001/XMLSchema-instance",
        "@xsi:nil": "true"
      },
      "offset": {
        "@xmlns:xsi": "http://www.w3.org/2001/XMLSchema-instance",
        "@xsi:nil": "true"
      },
      "contenu": {
        "documentURI": "/15/amendements/2296/CION-SOC/AS866.pdf"
      },
      "dateDispoRepresentation": {
        "@xmlns:xsi": "http://www.w3.org/2001/XMLSchema-instance",
        "@xsi:nil": "true"
      }
    }
  },
  "seanceDiscussion": {
    "@xmlns:xsi": "http://www.w3.org/2001/XMLSchema-instance",
    "@xsi:nil": "true"
  },
  "sort": {
    "dateSaisie": "2019-10-16T20:41:51.000+02:00",
    "sortEnSeance": "Rejeté"
  },
  "dateDepot": "2019-10-11T02:00:00.000+02:00",
  "dateDistribution": "2019-10-15T02:00:00.000+02:00",
  "article99": "0",
  "loiReference": {
    "codeLoi": "c sécurité sociale",
    "divisionCodeLoi": "L115-3"
  }
}