{
  "@xmlns": "http://schemas.assemblee-nationale.fr/referentiel",
  "uid": "AMANR5L15SEA717460BTC2243P0D1N1692",
  "identifiant": {
    "legislature": "15",
    "numero": "1692",
    "numRect": "0",
    "saisine": {
      "refTexteLegislatif": "PRJLANR5L15BTC2243",
      "numeroPartiePLF": "0",
      "organeExamen": "PO717460",
      "mentionSecondeDeliberation": "0"
    }
  },
  "numeroLong": "1692",
  "etapeTexte": "1ère lecture (1ère assemblée saisie)",
  "triAmendement": "awaaaaaaaaaaaaaaaaaaaaaaaaaaaaaaaaaaaaaaaaaaaaaaaaazu",
  "cardinaliteAmdtMultiples": "1",
  "amendementParent": {
    "@xmlns:xsi": "http://www.w3.org/2001/XMLSchema-instance",
    "@xsi:nil": "true"
  },
  "etat": "Discuté",
  "signataires": {
    "auteur": {
      "typeAuteur": "Depute",
      "acteurRef": "PA330684",
      "organeRef": {
        "@xmlns:xsi": "http://www.w3.org/2001/XMLSchema-instance",
        "@xsi:nil": "true"
      },
      "groupePolitiqueRef": "PO730934"
    },
    "cosignataires": {
      "acteurRef": "PA330684"
    },
    "texteAffichable": "Mme&#160;Val&#233;rie&#160;Boyer"
  },
  "pointeurFragmentTexte": {
    "missionVisee": {
      "@xmlns:xsi": "http://www.w3.org/2001/XMLSchema-instance",
      "@xsi:nil": "true"
    },
    "division": {
      "titre": "Article 4",
      "articleDesignationCourte": "APRÈS ART. 4",
      "type": "ARTICLE",
      "avant_A_Apres": "Après",
      "divisionRattachee": "APRÈS L'ARTICLE 4, insérer l'article suivant:",
      "articleAdditionnel": "1",
      "chapitreAdditionnel": {
        "@xmlns:xsi": "http://www.w3.org/2001/XMLSchema-instance",
        "@xsi:nil": "true"
      },
      "urlDivisionTexteVise": "/15/textes/2243.asp#D_Article_4"
    },
    "alinea": {
      "@xmlns:xsi": "http://www.w3.org/2001/XMLSchema-instance",
      "@xsi:nil": "true"
    }
  },
  "corps": {
    "dispositif": "<p style=\"text-align: justify;\">Apr&#232;s l&#8217;article&#160;227&#8209;13 du code p&#233;nal, il est ins&#233;r&#233; un article&#160;227&#8209;13&#8209;1 ainsi r&#233;dig&#233;&#160;:</p><p style=\"text-align: justify;\">&#171;&#160;<i>Art.&#160;227&#8209;13&#8209;1</i>.&#160;&#8211;&#160;Lorsque les infractions d&#233;finies &#224; la pr&#233;sente section sont commises hors du territoire de la R&#233;publique par un Fran&#231;ais ou par une personne r&#233;sidant habituellement sur le territoire fran&#231;ais, la loi fran&#231;aise est applicable par d&#233;rogation au deuxi&#232;me alin&#233;a de l&#8217;article&#160;113&#8209;6, et la seconde phrase de l&#8217;article&#160;113&#8209;8 n&#8217;est pas applicable.&#160;&#187;</p>",
    "exposeSommaire": "<p style=\"text-align: justify;\">Cet amendement a pour objectif d&#8217;&#233;tendre le champ d&#8217;application territoriale de la loi p&#233;nale fran&#231;aise &#224; l&#8217;ensemble des atteintes &#224; la filiation commises &#224; l&#8217;&#233;tranger par un Fran&#231;ais ou une personne r&#233;sidant habituellement sur le territoire fran&#231;ais pour les infractions suivantes&#160;: la provocation &#224; l&#8217;abandon d&#8217;enfant, l&#8217;entremise en vue de l&#8217;abandon d&#8217;enfant ou d&#8217;une gestion pour autrui, la substitution ou la dissimulation d&#8217;enfant, et la provocation &#224; la GPA, ou sa pr&#233;sentation sous un jour favorable.</p><p style=\"text-align: justify;\">Cette disposition, ins&#233;r&#233;e &#224; un nouvel article&#160;227&#8209;13&#8209;1, permet d&#8217;&#233;carter les conditions pos&#233;es &#224; la poursuite en France de d&#233;lits commis &#224; l&#8217;&#233;tranger&#160;: l&#8217;exigence de r&#233;ciprocit&#233; d&#8217;incrimination dans le pays o&#249; les faits sont commis et la n&#233;cessit&#233; d&#8217;une d&#233;nonciation officielle par ce pays.</p><p style=\"text-align: justify;\">Il s&#8217;agirait donc d&#8217;&#233;tendre aux infractions li&#233;es &#224; la GPA un dispositif d&#233;j&#224; pr&#233;vu pour certaines infractions dans le code p&#233;nal, tels que les d&#233;lits terroristes (113&#8209;3) ou les agressions sexuelles &#224; l&#8217;encontre d&#8217;un mineur (222&#8209;22 alin&#233;a&#160;3).</p>",
    "annexeExposeSommaire": {
      "@xmlns:xsi": "http://www.w3.org/2001/XMLSchema-instance",
      "@xsi:nil": "true"
    },
    "cartoucheDelaiDepotDepasse": {
      "@xmlns:xsi": "http://www.w3.org/2001/XMLSchema-instance",
      "@xsi:nil": "true"
    },
    "avantAppel": {
      "@xmlns:xsi": "http://www.w3.org/2001/XMLSchema-instance",
      "@xsi:nil": "true"
    }
  },
  "representations": {
    "representation": {
      "nom": "PDF",
      "typeMime": {
        "type": "application",
        "subType": "PDF"
      },
      "statutRepresentation": {
        "verbatim": "true",
        "canonique": "true",
        "officielle": "true",
        "transcription": "false",
        "enregistrement": "false"
      },
      "repSource": {
        "@xmlns:xsi": "http://www.w3.org/2001/XMLSchema-instance",
        "@xsi:nil": "true"
      },
      "offset": {
        "@xmlns:xsi": "http://www.w3.org/2001/XMLSchema-instance",
        "@xsi:nil": "true"
      },
      "contenu": {
        "documentURI": "/15/amendements/2243/AN/1692.pdf"
      },
      "dateDispoRepresentation": {
        "@xmlns:xsi": "http://www.w3.org/2001/XMLSchema-instance",
        "@xsi:nil": "true"
      }
    }
  },
  "seanceDiscussion": "RUANR5L15S2020IDS21846",
  "sort": {
    "dateSaisie": "2019-10-03T22:23:08.000+02:00",
    "sortEnSeance": "Non soutenu"
  },
  "dateDepot": "2019-09-19T02:00:00.000+02:00",
  "dateDistribution": "2019-09-27T02:00:00.000+02:00",
  "article99": "0",
  "loiReference": {
    "codeLoi": "c pénal",
    "divisionCodeLoi": "227-13"
  }
}