{
  "@xmlns": "http://schemas.assemblee-nationale.fr/referentiel",
  "uid": "AMANR5L15PO419610B0846P0D1N1382",
  "identifiant": {
    "legislature": "15",
    "numero": "1382",
    "numRect": "0",
    "saisine": {
      "refTexteLegislatif": "PRJLANR5L15B0846",
      "numeroPartiePLF": "0",
      "organeExamen": "PO419610",
      "mentionSecondeDeliberation": "0"
    }
  },
  "numeroLong": "CE1382",
  "etapeTexte": "1ère lecture (1ère assemblée saisie)",
  "triAmendement": "ji",
  "cardinaliteAmdtMultiples": "1",
  "amendementParent": {
    "@xmlns:xsi": "http://www.w3.org/2001/XMLSchema-instance",
    "@xsi:nil": "true"
  },
  "etat": "Discuté",
  "signataires": {
    "auteur": {
      "typeAuteur": "Depute",
      "acteurRef": "PA268019",
      "organeRef": {
        "@xmlns:xsi": "http://www.w3.org/2001/XMLSchema-instance",
        "@xsi:nil": "true"
      },
      "groupePolitiqueRef": "PO744425"
    },
    "cosignataires": {
      "acteurRef": [
        "PA332228",
        "PA267766",
        "PA719806",
        "PA267585",
        "PA720696",
        "PA267780",
        "PA267042",
        "PA721094",
        "PA721486",
        "PA268019",
        "PA267330",
        "PA720230",
        "PA610775",
        "PA722030",
        "PA266788",
        "PA1960"
      ]
    },
    "texteAffichable": "M.&#160;Lagarde,  Mme&#160;Auconie, M.&#160;Benoit, M.&#160;Bournazel, M.&#160;Guy&#160;Bricout, Mme&#160;Descamps, M.&#160;Dunoyer, M.&#160;Favennec Becot, Mme&#160;Firmin Le Bodo, M.&#160;Gom&#232;s, M.&#160;Leroy, Mme&#160;Magnier, M.&#160;Morel-&#192;-L&apos;Huissier, M.&#160;Naegelen, M.&#160;Vercamer et M.&#160;Zumkeller"
  },
  "pointeurFragmentTexte": {
    "missionVisee": {
      "@xmlns:xsi": "http://www.w3.org/2001/XMLSchema-instance",
      "@xsi:nil": "true"
    },
    "division": {
      "titre": "Article 58",
      "articleDesignationCourte": "ART. 58",
      "type": "ARTICLE",
      "avant_A_Apres": "A",
      "divisionRattachee": "ARTICLE 58",
      "articleAdditionnel": {
        "@xmlns:xsi": "http://www.w3.org/2001/XMLSchema-instance",
        "@xsi:nil": "true"
      },
      "chapitreAdditionnel": {
        "@xmlns:xsi": "http://www.w3.org/2001/XMLSchema-instance",
        "@xsi:nil": "true"
      },
      "urlDivisionTexteVise": "/15/textes/0846.asp#D_Article_58"
    },
    "alinea": {
      "avant_A_Apres": "A",
      "numero": "3",
      "alineaDesignation": "Alinéa 3"
    }
  },
  "corps": {
    "dispositif": "<p style=\"text-align: justify;\">I.&#160;&#192; l&#8217;alin&#233;a&#160;3, apr&#232;s la premi&#232;re occurrence du mot&#160;:</p><p style=\"text-align: justify;\">&#171;&#160;g&#233;n&#233;rale&#160;&#187;,</p><p style=\"text-align: justify;\">ins&#233;rer les mots&#160;:</p><p style=\"text-align: justify;\">&#171;&#160;, d&#8217;une part,&#160;&#187;.</p><p style=\"text-align: justify;\">II.&#160;&#8211;Au m&#234;me alin&#233;a, apr&#232;s le mot&#160;:</p><p style=\"text-align: justify;\">&#171;&#160;logements&#160;&#187;,</p><p style=\"text-align: justify;\">ins&#233;rer les mots&#160;:</p><p style=\"text-align: justify;\">&#171;&#160;auquel le propri&#233;taire et le locataire ne peuvent se soustraire lorsqu&#8217;il a des raisons s&#233;rieuses de penser que l&#8217;habitation ou l&#8217;ensemble d&#8217;habitation ne correspond pas aux normes d&#8217;habitabilit&#233;, d&#8217;hygi&#232;ne ou de d&#233;cence et, d&#8217;autre part,&#160;&#187;.</p>",
    "exposeSommaire": "<p style=\"text-align: justify;\">La possibilit&#233; du maire de visiter un logement dangereux ou insalubre souffre d&#8217;incertitude juridique&#160;: ce droit ne semble pouvoir &#234;tre exerc&#233; qu&#8217;en cas de r&#233;clamation pr&#233;alable de l&#8217;occupant. Or, la plupart du temps, les personnes h&#233;berg&#233;es par des marchands de sommeil ne d&#233;posent pas plainte pour diverses raisons.</p><p style=\"text-align: justify;\">La clarification pr&#233;vue par l&#8217;ordonnance est donc bienvenue. Il est propos&#233; de compl&#233;ter l&#8217;habilitation afin de pr&#233;voir un droit de visite de contr&#244;le le plus large possible dans des situations de p&#233;ril.</p>",
    "annexeExposeSommaire": {
      "@xmlns:xsi": "http://www.w3.org/2001/XMLSchema-instance",
      "@xsi:nil": "true"
    }
  },
  "representations": {
    "representation": {
      "nom": "PDF",
      "typeMime": {
        "type": "application",
        "subType": "PDF"
      },
      "statutRepresentation": {
        "verbatim": "true",
        "canonique": "true",
        "officielle": "true",
        "transcription": "false",
        "enregistrement": "false"
      },
      "repSource": {
        "@xmlns:xsi": "http://www.w3.org/2001/XMLSchema-instance",
        "@xsi:nil": "true"
      },
      "offset": {
        "@xmlns:xsi": "http://www.w3.org/2001/XMLSchema-instance",
        "@xsi:nil": "true"
      },
      "contenu": {
        "documentURI": "/15/amendements/0846/CION-ECO/CE1382.pdf"
      },
      "dateDispoRepresentation": {
        "@xmlns:xsi": "http://www.w3.org/2001/XMLSchema-instance",
        "@xsi:nil": "true"
      }
    }
  },
  "seanceDiscussion": {
    "@xmlns:xsi": "http://www.w3.org/2001/XMLSchema-instance",
    "@xsi:nil": "true"
  },
  "sort": {
    "dateSaisie": "2018-05-19T00:05:08.000+02:00",
    "sortEnSeance": "Non soutenu"
  },
  "dateDepot": "2018-05-09T02:00:00.000+02:00",
  "dateDistribution": "2018-05-15T02:00:00.000+02:00",
  "article99": "0",
  "loiReference": {
    "codeLoi": {
      "@xmlns:xsi": "http://www.w3.org/2001/XMLSchema-instance",
      "@xsi:nil": "true"
    },
    "divisionCodeLoi": {
      "@xmlns:xsi": "http://www.w3.org/2001/XMLSchema-instance",
      "@xsi:nil": "true"
    }
  }
}