{
  "@xmlns": "http://schemas.assemblee-nationale.fr/referentiel",
  "uid": "AMANR5L15SEA717460BTC1974P0D1N63",
  "identifiant": {
    "legislature": "15",
    "numero": "63",
    "numRect": "0",
    "saisine": {
      "refTexteLegislatif": "PRJLANR5L15BTC1974",
      "numeroPartiePLF": "0",
      "organeExamen": "PO717460",
      "mentionSecondeDeliberation": "0"
    }
  },
  "numeroLong": "63",
  "etapeTexte": "1ère lecture (2ème assemblée saisie)",
  "triAmendement": "adcaaaaaaaaaaaaaaaaaaaaaaaaaaaaaaaaaaaaaaaaaaaaaaabsw",
  "cardinaliteAmdtMultiples": "1",
  "amendementParent": {
    "@xmlns:xsi": "http://www.w3.org/2001/XMLSchema-instance",
    "@xsi:nil": "true"
  },
  "etat": "Discuté",
  "signataires": {
    "auteur": {
      "typeAuteur": "Depute",
      "acteurRef": "PA330909",
      "organeRef": {
        "@xmlns:xsi": "http://www.w3.org/2001/XMLSchema-instance",
        "@xsi:nil": "true"
      },
      "groupePolitiqueRef": "PO730934"
    },
    "cosignataires": {
      "acteurRef": [
        "PA334654",
        "PA267527",
        "PA643134",
        "PA709315",
        "PA2377",
        "PA608016",
        "PA718884",
        "PA608416",
        "PA721968",
        "PA267204",
        "PA1012",
        "PA330909",
        "PA267429",
        "PA332523",
        "PA720386",
        "PA266793",
        "PA712015",
        "PA721410",
        "PA606712",
        "PA340853",
        "PA346218",
        "PA719318",
        "PA605036",
        "PA2155",
        "PA748954",
        "PA607090",
        "PA721636"
      ]
    },
    "texteAffichable": "M.&#160;Descoeur,  M.&#160;Sermier, M.&#160;Lurton, M.&#160;Dive, M.&#160;Straumann, M.&#160;Hetzel, M.&#160;Abad, Mme&#160;Bonnivard, Mme&#160;Anthoine, Mme&#160;Bazin-Malgras, M.&#160;Saddier, M.&#160;Masson, Mme&#160;Valentin, M.&#160;Bony, M.&#160;Leclerc, Mme&#160;Dalloz, M.&#160;Menuel, M.&#160;Di Filippo, M.&#160;Jean-Pierre&#160;Vigier, M.&#160;Parigi, M.&#160;Savignat, M.&#160;Perrut, Mme&#160;Louwagie, M.&#160;Cinieri, M.&#160;Vialay, M.&#160;Viala et M.&#160;de la Verpilli&#232;re"
  },
  "pointeurFragmentTexte": {
    "missionVisee": {
      "@xmlns:xsi": "http://www.w3.org/2001/XMLSchema-instance",
      "@xsi:nil": "true"
    },
    "division": {
      "titre": "Article PREMIER",
      "articleDesignationCourte": "ART. PREMIER",
      "type": "ARTICLE",
      "avant_A_Apres": "A",
      "divisionRattachee": "ARTICLE PREMIER",
      "articleAdditionnel": {
        "@xmlns:xsi": "http://www.w3.org/2001/XMLSchema-instance",
        "@xsi:nil": "true"
      },
      "chapitreAdditionnel": {
        "@xmlns:xsi": "http://www.w3.org/2001/XMLSchema-instance",
        "@xsi:nil": "true"
      },
      "urlDivisionTexteVise": "/15/textes/1974.asp#D_Article_1er"
    },
    "alinea": {
      "avant_A_Apres": {
        "@xmlns:xsi": "http://www.w3.org/2001/XMLSchema-instance",
        "@xsi:nil": "true"
      },
      "numero": "18",
      "alineaDesignation": {
        "@xmlns:xsi": "http://www.w3.org/2001/XMLSchema-instance",
        "@xsi:nil": "true"
      }
    }
  },
  "corps": {
    "dispositif": "<p style=\"text-align: justify;\">&#192; l&#8217;alin&#233;a&#160;18, apr&#232;s le mot&#160;:</p><p style=\"text-align: justify;\">&#171;&#160;transfert&#160;&#187;,</p><p style=\"text-align: justify;\">ins&#233;rer les mots&#160;:</p><p style=\"text-align: justify;\">&#171;&#160;, &#224; titre exp&#233;rimental durant quelques ann&#233;es&#160;&#187;.</p>",
    "exposeSommaire": "<p>Il convient par cet amendement d'apporter davantage de souplesse au mode de gouvernance en mati&#232;re de mobilit&#233;. Permettre aux communaut&#233;s de communes de piloter la comp&#233;tence de l'organisation de la mobilit&#233;, alors que le territoire de ces collectivit&#233;s, en zone rurale, ne correspond pas forc&#233;ment &#224; ceux des bassins de mobilit&#233;, para&#238;t inopportun. De ce fait, nous n'avons pas l'assurance que la communaut&#233; de communes puisse exercer cette comp&#233;tence de mani&#232;re pleinement efficace. </p><p>Le besoin de souplesse sur le terrain est r&#233;el. Que la r&#233;gion chapeaute des projets de mobilit&#233; ou qu&#8217;elle soit l&#8217;autorit&#233; organisatrice ne pose pas de probl&#232;me seulement limiter, &#224; l&#8217;&#233;chelon inf&#233;rieur, les comp&#233;tences de mobilit&#233; aux seules intercommunalit&#233;s semble &#234;tre une mauvaise id&#233;e.<br />Premi&#232;rement, les E.P.C.I en milieu rural sont d&#233;j&#224; d&#233;bord&#233;s : ils doivent g&#233;rer leur nouveau p&#233;rim&#232;tre, qui s&#8217;est &#233;largi, et absorber de nouvelles comp&#233;tences ; de fait, l&#8217;ajout d&#8217;une comp&#233;tence suppl&#233;mentaire, avant la date butoir de 2020, semble inadapt&#233;, laissant, de plus, trop peu de temps aux nouvelles &#233;quipes &#233;lues pour s&#8217;organiser.<br />Secondement, circonscrire la comp&#233;tence mobilit&#233; au seul attelage r&#233;gion-intercommunalit&#233; risque d&#8217;exclure certains territoires de la r&#233;flexion de la mobilit&#233; et donc &#233;touffer des solutions qui pourraient &#233;merger du terrain. D&#8217;autant plus, qu&#8217;en se basant sur les cartes mobilit&#233;s de l&#8217;INSEE, il appara&#238;t que les p&#233;rim&#232;tres intercommunaux ne correspondent que tr&#232;s rarement aux bassins de mobilit&#233;, questionnant la coh&#233;rence de ce transfert obligatoire et jetant le doute sur les capacit&#233;s des intercommunalit&#233;s &#224; se saisir du sujet. Rares sont les lignes coh&#233;rentes de covoiturage qui ne traverseraient qu&#8217;un seul E.P.C.I. ; de la m&#234;me mani&#232;re, les lignes de rabattage ne sont souvent pertinente que sur deux ou trois villages. : de fait, sans cette souplesse, des projets resteront dans les tiroirs. Dans un second temps, si un projet fonctionne bien, rien n&#8217;emp&#234;che que sa gestion soit d&#233;l&#233;gu&#233;e &#224; la r&#233;gion ; au moins, il aura &#233;t&#233; imagin&#233; sur le terrain, au plus proche des citoyens. Les outils mobilisables pour monter ce type de projet pourraient prendre la forme de conventions, sign&#233;es entre les communes, sans n&#233;cessairement assister &#224; la cr&#233;ation d&#8217;un syndicat mixte : il est primordial que ces outils soient les plus simples possible, pour ne pas &#233;lever de barri&#232;re inutilement.</p><p>C&#8217;est pourquoi, il est propos&#233; que cette d&#233;l&#233;gation se fasse &#224; titre exp&#233;rimental sur une dur&#233;e limit&#233;e.</p><p>Le besoin de souplesse sur le terrain est r&#233;el. Que la r&#233;gion chapeaute des projets de mobilit&#233; ou qu&#8217;elle soit l&#8217;autorit&#233; organisatrice ne pose pas de probl&#232;me seulement limiter, &#224; l&#8217;&#233;chelon inf&#233;rieur, les comp&#233;tences de mobilit&#233; aux seules intercommunalit&#233;s semble &#234;tre une mauvaise id&#233;e.<br />Premi&#232;rement, les E.P.C.I en milieu rural sont d&#233;j&#224; d&#233;bord&#233;s : ils doivent g&#233;rer leur nouveau p&#233;rim&#232;tre, qui s&#8217;est &#233;largi, et absorber de nouvelles comp&#233;tences ; de fait, l&#8217;ajout d&#8217;une comp&#233;tence suppl&#233;mentaire, avant la date butoir de 2020, semble inadapt&#233;, laissant, de plus, trop peu de temps aux nouvelles &#233;quipes &#233;lues pour s&#8217;organiser.<br />Secondement, circonscrire la comp&#233;tence mobilit&#233; au seul attelage r&#233;gion-intercommunalit&#233; risque d&#8217;exclure certains territoires de la r&#233;flexion de la mobilit&#233; et donc &#233;touffer des solutions qui pourraient &#233;merger du terrain. D&#8217;autant plus, qu&#8217;en se basant sur les cartes mobilit&#233;s de l&#8217;INSEE, il appara&#238;t que les p&#233;rim&#232;tres intercommunaux ne correspondent que tr&#232;s rarement aux bassins de mobilit&#233;, questionnant la coh&#233;rence de ce transfert obligatoire et jetant le doute sur les capacit&#233;s des intercommunalit&#233;s &#224; se saisir du sujet. Rares sont les lignes coh&#233;rentes de covoiturage qui ne traverseraient qu&#8217;un seul E.P.C.I. ; de la m&#234;me mani&#232;re, les lignes de rabattage ne sont souvent pertinente que sur deux ou trois villages. : de fait, sans cette souplesse, des projets resteront dans les tiroirs. Dans un second temps, si un projet fonctionne bien, rien n&#8217;emp&#234;che que sa gestion soit d&#233;l&#233;gu&#233;e &#224; la r&#233;gion ; au moins, il aura &#233;t&#233; imagin&#233; sur le terrain, au plus proche des citoyens. Les outils mobilisables pour monter ce type de projet pourraient prendre la forme de conventions, sign&#233;es entre les communes, sans n&#233;cessairement assister &#224; la cr&#233;ation d&#8217;un syndicat mixte : il est primordial que ces outils soient les plus simples possible, pour ne pas &#233;lever de barri&#232;re inutilement.</p><p>C'est pourquoi, il est propos&#233; que cette d&#233;l&#233;gation se fasse &#224; titre exp&#233;rimental sur une dur&#233;e limit&#233;e. </p><p><br /><br /></p><p>&#160;</p>",
    "annexeExposeSommaire": {
      "@xmlns:xsi": "http://www.w3.org/2001/XMLSchema-instance",
      "@xsi:nil": "true"
    },
    "cartoucheDelaiDepotDepasse": {
      "@xmlns:xsi": "http://www.w3.org/2001/XMLSchema-instance",
      "@xsi:nil": "true"
    }
  },
  "representations": {
    "representation": {
      "nom": "PDF",
      "typeMime": {
        "type": "application",
        "subType": "PDF"
      },
      "statutRepresentation": {
        "verbatim": "true",
        "canonique": "true",
        "officielle": "true",
        "transcription": "false",
        "enregistrement": "false"
      },
      "repSource": {
        "@xmlns:xsi": "http://www.w3.org/2001/XMLSchema-instance",
        "@xsi:nil": "true"
      },
      "offset": {
        "@xmlns:xsi": "http://www.w3.org/2001/XMLSchema-instance",
        "@xsi:nil": "true"
      },
      "contenu": {
        "documentURI": "/15/amendements/1974/AN/63.pdf"
      },
      "dateDispoRepresentation": {
        "@xmlns:xsi": "http://www.w3.org/2001/XMLSchema-instance",
        "@xsi:nil": "true"
      }
    }
  },
  "seanceDiscussion": "RUANR5L15S2019IDS21674",
  "sort": {
    "dateSaisie": "2019-06-04T00:45:41.000+02:00",
    "sortEnSeance": "Rejeté"
  },
  "dateDepot": "2019-05-25T02:00:00.000+02:00",
  "dateDistribution": "2019-06-01T02:00:00.000+02:00",
  "article99": "0",
  "loiReference": {
    "codeLoi": {
      "@xmlns:xsi": "http://www.w3.org/2001/XMLSchema-instance",
      "@xsi:nil": "true"
    },
    "divisionCodeLoi": {
      "@xmlns:xsi": "http://www.w3.org/2001/XMLSchema-instance",
      "@xsi:nil": "true"
    }
  }
}