{
  "@xmlns": "http://schemas.assemblee-nationale.fr/referentiel",
  "uid": "AMANR5L15SEA717460B2272P2D1N1806",
  "identifiant": {
    "legislature": "15",
    "numero": "1806",
    "numRect": "0",
    "saisine": {
      "refTexteLegislatif": "PRJLANR5L15B2272",
      "numeroPartiePLF": "2",
      "organeExamen": "PO717460",
      "mentionSecondeDeliberation": "0"
    }
  },
  "numeroLong": "II-1806",
  "etapeTexte": "1ère lecture (1ère assemblée saisie)",
  "triAmendement": "ecaaaacaaaaaaaaaaaaaaaaaaaaaaaaaaaaaaaaaaaaaaaaaaazzzzzzzzzzzzzz",
  "cardinaliteAmdtMultiples": "1",
  "amendementParent": {
    "@xmlns:xsi": "http://www.w3.org/2001/XMLSchema-instance",
    "@xsi:nil": "true"
  },
  "etat": "Discuté",
  "signataires": {
    "auteur": {
      "typeAuteur": "Depute",
      "acteurRef": "PA405480",
      "organeRef": {
        "@xmlns:xsi": "http://www.w3.org/2001/XMLSchema-instance",
        "@xsi:nil": "true"
      },
      "groupePolitiqueRef": "PO759900"
    },
    "cosignataires": {
      "acteurRef": [
        "PA331582",
        "PA336175",
        "PA333421",
        "PA607619",
        "PA720996",
        "PA719138",
        "PA608292",
        "PA719146",
        "PA405480",
        "PA336439"
      ]
    },
    "texteAffichable": "M.&#160;Pupponi,  M.&#160;Acquaviva, M.&#160;Castellani, M.&#160;Cl&#233;ment, Mme&#160;Dubi&#233;, M.&#160;El Guerrab, M.&#160;Molac, M.&#160;Pancher, Mme&#160;Pinel et M.&#160;Philippe&#160;Vigier"
  },
  "pointeurFragmentTexte": {
    "missionVisee": {
      "@xmlns:xsi": "http://www.w3.org/2001/XMLSchema-instance",
      "@xsi:nil": "true"
    },
    "division": {
      "titre": "Article 59",
      "articleDesignationCourte": "APRÈS ART. 59",
      "type": "ARTICLE",
      "avant_A_Apres": "Après",
      "divisionRattachee": "APRÈS L'ARTICLE 59, insérer l'article suivant:",
      "articleAdditionnel": "1",
      "chapitreAdditionnel": {
        "@xmlns:xsi": "http://www.w3.org/2001/XMLSchema-instance",
        "@xsi:nil": "true"
      },
      "urlDivisionTexteVise": "/15/textes/2272C.asp#D_Article_59"
    },
    "alinea": {
      "@xmlns:xsi": "http://www.w3.org/2001/XMLSchema-instance",
      "@xsi:nil": "true"
    }
  },
  "corps": {
    "dispositif": "<p>L&#8217;article L.&#160;190 du livre des proc&#233;dures fiscales est compl&#233;t&#233; par un alin&#233;a ainsi r&#233;dig&#233;&#160;:</p><p style=\"text-align: justify;\">&#171;&#160;Le d&#233;lai pr&#233;vu au quatri&#232;me alin&#233;a n&#8217;est applicable aux demandes de restitution de retenue &#224; la source vis&#233;e au 2 &#224; l&#8217;article&#160;119 <i>bis</i> du code g&#233;n&#233;ral des imp&#244;ts, introduites par des contribuables non&#160;&#8211;&#160;r&#233;sidents &#233;tablis dans d&#8217;autres &#201;tats membres de l&#8217;Union Europ&#233;enne et pr&#233;sentant des r&#233;sultats fiscalement d&#233;ficitaires selon la loi de leur &#201;tat membre de r&#233;sidence, qu&#8217;&#224; compter du 1<sup>er&#160;</sup>janvier de l&#8217;ann&#233;e suivant celle &#224; l&#8217;issue de laquelle ils sont redevenus b&#233;n&#233;ficiaires.&#160;&#187;</p>",
    "exposeSommaire": "<p>Saisie de plaintes aff&#233;rentes &#224; l&#8217;application de la retenue &#224; la source vis&#233;e &#224; l&#8217;article&#160;119 <i>bis</i> 2 du CGI sur les dividendes de source fran&#231;aise vers&#233;s &#224; des actionnaires &#233;tablis dans d&#8217;autres &#201;tats membres de l&#8217;Union Europ&#233;enne et pr&#233;sentant des r&#233;sultats fiscalement d&#233;ficitaires, la Commission europ&#233;enne a relev&#233; que ce r&#233;gime appliqu&#233; par la France g&#233;n&#233;rait des effets discriminatoires, tant sur le fond (plainte n&#176;&#160;2013/4244) que d&#8217;un point de vue proc&#233;dural (plainte 2009/5064).</p><p style=\"text-align: justify;\">Sur le fond, saisie &#224; titre pr&#233;judicielle par le Conseil d&#8217;&#201;tat, la Cour de Justice de l&#8217;Union Europ&#233;enne (CJUE) a confirm&#233; les analyses de la Commission, en &#233;non&#231;ant que cette retenue &#224; la source &#233;tait bien euro-incompatible (CJUE, 22 novembre 2018, SOFINA, aff. C-575/17).</p><p style=\"text-align: justify;\">Suite &#224; cet arr&#234;t de la CJUE, la Commission europ&#233;enne a pris contact avec les autorit&#233;s fran&#231;aises, afin de conna&#238;tre les mesures qu&#8217;elles envisageaient pour mettre leur l&#233;gislation en conformit&#233; avec le droit de l&#8217;Union.</p><p style=\"text-align: justify;\">Dans leur r&#233;ponse, concernant les r&#232;gles de fond, les autorit&#233;s fran&#231;aises se sont engag&#233;es &#224; modifier la l&#233;gislation au cours de l&#8217;ann&#233;e 2019, pour tirer toutes les cons&#233;quences de l&#8217;arr&#234;t en question.</p><p style=\"text-align: justify;\">D&#8217;un point de vue proc&#233;dural, les autorit&#233;s fran&#231;aises ont r&#233;pondu &#224; la Commission europ&#233;enne que l&#8217;arr&#234;t SOFINA serait pris en consid&#233;ration dans le traitement des r&#233;clamations et des contentieux en cours, portant sur la retenue &#224; la source sur les dividendes d&#8217;origine nationale vers&#233;s &#224; des soci&#233;t&#233;s non-r&#233;sidentes en situation d&#233;ficitaire.</p><p style=\"text-align: justify;\">Nonobstant ces engagements pris par les autorit&#233;s fran&#231;aises, le projet de loi de finances pour 2020, ne contient pas de mesure sp&#233;cifique tendant &#224; &#233;liminer les discriminations proc&#233;durales identifi&#233;es par la Commission europ&#233;enne concernant le point de d&#233;part du d&#233;lai de r&#233;clamation.</p><p style=\"text-align: justify;\">La Commission a toutefois fait savoir aux plaignants le 16 avril 2019 que &#171;&#160;les services de la Commission veille[eront] &#224; ce que les autorit&#233;s fran&#231;aises se conforment aux principes &#233;tablis par la Cour dans l&#8217;arr&#234;t Sofina et n&#8217;appliquent pas des modalit&#233;s proc&#233;durales discriminatoires aux fins de l&#8217;imp&#244;t &#224; restituer&#160;&#187;.&#160;</p><p style=\"text-align: justify;\">La Commission europ&#233;enne continue ainsi l&#8217;instruction de la plainte n&#176;&#160;2013/4244, dans l&#8217;attente de la modification de la l&#233;gislation nationale et ne proc&#233;dera &#224; son classement que lorsque la r&#232;glementation fran&#231;aise aura &#233;t&#233; mise en conformit&#233;, tant sur le fond, que quant &#224; la discrimination proc&#233;durale concernant la taxe &#224; restituer.</p><p style=\"text-align: justify;\">C&#8217;est l&#8217;objet du pr&#233;sent amendement.</p><p style=\"text-align: justify;\">La discrimination proc&#233;durale relev&#233;e par la Commission est li&#233;e au fait que les demandes de restitution, fond&#233;es sur ledit arr&#234;t SOFINA, introduites par les contribuables non-r&#233;sidents pr&#233;sentant des r&#233;sultats fiscalement d&#233;ficitaires et sollicitant le remboursement de la retenue &#224; la source pr&#233;lev&#233;e par la France sur le fondement de l&#8217;article&#160;119 <i>bis</i> 2 du CGI, sont strictement encadr&#233;es par le d&#233;lai de deux ans pr&#233;vu au quatri&#232;me alin&#233;a de l&#8217;article L.&#160;190 du LPF, tandis que les contribuables r&#233;sidents, pr&#233;sentant &#233;galement des r&#233;sultats fiscalement d&#233;ficitaires et souhaitant introduire des r&#233;clamations en mati&#232;re d&#8217;imp&#244;t sur les soci&#233;t&#233;s, ne se voient pas opposer ce d&#233;lai de deux ans, puisqu&#8217;&#233;tant en droit d&#8217;introduire leur r&#233;clamation jusqu&#8217;au 31 d&#233;cembre de la deuxi&#232;me ann&#233;e suivant celle du paiement de l&#8217;imp&#244;t aff&#233;rent au premier exercice b&#233;n&#233;ficiaire suivant, ce premier exercice b&#233;n&#233;ficiaire suivant pouvant survenir bien des ann&#233;es plus tard.</p><p style=\"text-align: justify;\">D&#8217;o&#249; le pr&#233;sent amendement, ayant simplement pour objet d&#8217;aligner les r&#232;gles de proc&#233;dure, de sorte que les r&#232;gles de droit commun applicables aux contribuables r&#233;sidents, le soient &#233;galement aux contribuables non-r&#233;sidents.</p><p style=\"text-align: justify;\">Ainsi, avec cette modification de l&#8217;article L.&#160;190 du Livre des proc&#233;dures fiscales (LPF), contribuables r&#233;sidents et non-r&#233;sidents, pr&#233;sentant des r&#233;sultats fiscalement d&#233;ficitaires, pourront introduire leurs r&#233;clamations jusqu&#8217;au 31 d&#233;cembre de la seconde ann&#233;e suivant celle du paiement de l&#8217;imp&#244;t li&#233; au premier exercice b&#233;n&#233;ficiaire suivant.</p><p style=\"text-align: justify;\">&#160;</p>",
    "annexeExposeSommaire": {
      "@xmlns:xsi": "http://www.w3.org/2001/XMLSchema-instance",
      "@xsi:nil": "true"
    },
    "cartoucheDelaiDepotDepasse": {
      "@xmlns:xsi": "http://www.w3.org/2001/XMLSchema-instance",
      "@xsi:nil": "true"
    },
    "avantAppel": {
      "@xmlns:xsi": "http://www.w3.org/2001/XMLSchema-instance",
      "@xsi:nil": "true"
    }
  },
  "representations": {
    "representation": {
      "nom": "PDF",
      "typeMime": {
        "type": "application",
        "subType": "PDF"
      },
      "statutRepresentation": {
        "verbatim": "true",
        "canonique": "true",
        "officielle": "true",
        "transcription": "false",
        "enregistrement": "false"
      },
      "repSource": {
        "@xmlns:xsi": "http://www.w3.org/2001/XMLSchema-instance",
        "@xsi:nil": "true"
      },
      "offset": {
        "@xmlns:xsi": "http://www.w3.org/2001/XMLSchema-instance",
        "@xsi:nil": "true"
      },
      "contenu": {
        "documentURI": "/15/amendements/2272C/AN/1806.pdf"
      },
      "dateDispoRepresentation": {
        "@xmlns:xsi": "http://www.w3.org/2001/XMLSchema-instance",
        "@xsi:nil": "true"
      }
    }
  },
  "seanceDiscussion": "RUANR5L15S2020IDS21921",
  "sort": {
    "dateSaisie": "2019-11-14T11:36:02.000+01:00",
    "sortEnSeance": "Rejeté"
  },
  "dateDepot": "2019-11-04T01:00:00.000+01:00",
  "dateDistribution": "2019-11-14T01:00:00.000+01:00",
  "article99": "0",
  "loiReference": {
    "codeLoi": "livre procédures fiscales",
    "divisionCodeLoi": "L190"
  }
}