{
  "@xmlns": "http://schemas.assemblee-nationale.fr/referentiel",
  "uid": "AMANR5L15SEA717460BTC1175P0D1N768",
  "identifiant": {
    "legislature": "15",
    "numero": "768",
    "numRect": "0",
    "saisine": {
      "refTexteLegislatif": "PRJLANR5L15BTC1175",
      "numeroPartiePLF": "0",
      "organeExamen": "PO717460",
      "mentionSecondeDeliberation": "0"
    }
  },
  "numeroLong": "768",
  "etapeTexte": "Nouvelle Lecture",
  "triAmendement": "noaaaaaaaaaaaaaaaaaaaaaaaaaaaaaaaaaaaaaaaaaaaaaaaagi",
  "cardinaliteAmdtMultiples": "1",
  "amendementParent": {
    "@xmlns:xsi": "http://www.w3.org/2001/XMLSchema-instance",
    "@xsi:nil": "true"
  },
  "etat": "Discuté",
  "signataires": {
    "auteur": {
      "typeAuteur": "Depute",
      "acteurRef": "PA605518",
      "organeRef": {
        "@xmlns:xsi": "http://www.w3.org/2001/XMLSchema-instance",
        "@xsi:nil": "true"
      },
      "groupePolitiqueRef": "PO730964"
    },
    "cosignataires": {
      "acteurRef": "PA605518"
    },
    "texteAffichable": "M.&#160;Fran&#231;ois-Michel&#160;Lambert"
  },
  "pointeurFragmentTexte": {
    "missionVisee": {
      "@xmlns:xsi": "http://www.w3.org/2001/XMLSchema-instance",
      "@xsi:nil": "true"
    },
    "division": {
      "titre": "Article 14 quinquies",
      "articleDesignationCourte": "ART. 14 QUINQUIES",
      "type": "ARTICLE",
      "avant_A_Apres": "A",
      "divisionRattachee": "ARTICLE 14 QUINQUIES",
      "articleAdditionnel": {
        "@xmlns:xsi": "http://www.w3.org/2001/XMLSchema-instance",
        "@xsi:nil": "true"
      },
      "chapitreAdditionnel": {
        "@xmlns:xsi": "http://www.w3.org/2001/XMLSchema-instance",
        "@xsi:nil": "true"
      },
      "urlDivisionTexteVise": "/15/textes/1175.asp#D_Article_14_quinquies"
    },
    "alinea": {
      "avant_A_Apres": {
        "@xmlns:xsi": "http://www.w3.org/2001/XMLSchema-instance",
        "@xsi:nil": "true"
      },
      "numero": "5",
      "alineaDesignation": {
        "@xmlns:xsi": "http://www.w3.org/2001/XMLSchema-instance",
        "@xsi:nil": "true"
      }
    }
  },
  "corps": {
    "dispositif": "<p style=\"text-align: justify;\">I.&#160;&#8211;&#160;&#192; la premi&#232;re phrase de l&#8217;alin&#233;a&#160;5, supprimer les mots&#160;:</p><p style=\"text-align: justify;\">&#171;&#160;et des produits &#224; usage biostimulants&#160;&#187;.</p><p style=\"text-align: justify;\">II.&#160;&#8211;&#160;En cons&#233;quence, compl&#233;ter cet article par l&#8217;alin&#233;a suivant&#160;:</p><p style=\"text-align: justify;\">&#171;&#160;II.&#160;&#8211;&#160;&#192; la premi&#232;re phrase du 3&#176; de l&#8217;article L.&#160;255&#8209;1 du code rural et de la p&#234;che maritime, le mot&#160;: &#171;&#160;mati&#232;res&#160;&#187; est remplac&#233; par le mot&#160;: &#171;&#160;biostimulants&#160;&#187;, et apr&#232;s le mot&#160;: &#171;&#160;nutritifs&#160;&#187;, sont ins&#233;r&#233;s les mots&#160;: &#171;&#160;, d&#8217;am&#233;liorer leur qualit&#233;&#160;&#187;.&#160;&#187;</p>",
    "exposeSommaire": "<p style=\"text-align: justify;\">L&#8217;objectif de cet amendement est de mettre en coh&#233;rence le code rural avec la d&#233;finition&#160;europ&#233;enne des biostimulants, &#224; clarifier les r&#232;gles de mise en march&#233; de ces produits et &#224; &#233;viter les amalgames avec d&#8217;autres cat&#233;gories de produits distincts.</p><p style=\"text-align: justify;\">En effet, la d&#233;finition consensuelle des biostimulants au niveau&#160;europ&#233;en, qui sera publi&#233;e dans les prochains mois, pr&#233;cise que les biostimulants sont &#171;&#160;des fertilisants qui stimulent le processus de nutrition des v&#233;g&#233;taux ind&#233;pendamment des &#233;l&#233;ments nutritifs qu&#8217;ils contiennent, dans le seul but d&#8217;am&#233;liorer une ou plusieurs caract&#233;ristiques des v&#233;g&#233;taux (l&#8217;efficacit&#233; de l&#8217;utilisation des &#233;l&#233;ments nutritifs, la tol&#233;rance au stress abiotique et la qualit&#233; du v&#233;g&#233;tal cultiv&#233;)&#160;&#187;. Une d&#233;finition claire de ces produits permettra de mettre &#224; disposition des agriculteurs de nouveaux outils de production permettant l&#8217;&#233;conomie de fertilisants min&#233;raux, l&#8217;am&#233;lioration de la qualit&#233; des productions et l&#8217;adaptation aux changements climatiques.</p>",
    "annexeExposeSommaire": {
      "@xmlns:xsi": "http://www.w3.org/2001/XMLSchema-instance",
      "@xsi:nil": "true"
    }
  },
  "representations": {
    "representation": {
      "nom": "PDF",
      "typeMime": {
        "type": "application",
        "subType": "PDF"
      },
      "statutRepresentation": {
        "verbatim": "true",
        "canonique": "true",
        "officielle": "true",
        "transcription": "false",
        "enregistrement": "false"
      },
      "repSource": {
        "@xmlns:xsi": "http://www.w3.org/2001/XMLSchema-instance",
        "@xsi:nil": "true"
      },
      "offset": {
        "@xmlns:xsi": "http://www.w3.org/2001/XMLSchema-instance",
        "@xsi:nil": "true"
      },
      "contenu": {
        "documentURI": "/15/amendements/1175/AN/768.pdf"
      },
      "dateDispoRepresentation": {
        "@xmlns:xsi": "http://www.w3.org/2001/XMLSchema-instance",
        "@xsi:nil": "true"
      }
    }
  },
  "seanceDiscussion": "RUANR5L15S2018IDS21237",
  "sort": {
    "dateSaisie": "2018-09-14T23:40:51.000+02:00",
    "sortEnSeance": "Rejeté"
  },
  "dateDepot": "2018-09-07T02:00:00.000+02:00",
  "dateDistribution": "2018-09-11T02:00:00.000+02:00",
  "article99": "0",
  "loiReference": {
    "codeLoi": {
      "@xmlns:xsi": "http://www.w3.org/2001/XMLSchema-instance",
      "@xsi:nil": "true"
    },
    "divisionCodeLoi": {
      "@xmlns:xsi": "http://www.w3.org/2001/XMLSchema-instance",
      "@xsi:nil": "true"
    }
  }
}