{
  "@xmlns": "http://schemas.assemblee-nationale.fr/referentiel",
  "uid": "AMANR5L15SEA717460B0269P0D1N24",
  "identifiant": {
    "legislature": "15",
    "numero": "24",
    "numRect": "0",
    "saisine": {
      "refTexteLegislatif": "PRJLANR5L15B0269",
      "numeroPartiePLF": "0",
      "organeExamen": "PO717460",
      "mentionSecondeDeliberation": "0"
    }
  },
  "numeroLong": "24",
  "etapeTexte": "1ère lecture (1ère assemblée saisie)",
  "triAmendement": "bb",
  "cardinaliteAmdtMultiples": "1",
  "amendementParent": {
    "@xmlns:xsi": "http://www.w3.org/2001/XMLSchema-instance",
    "@xsi:nil": "true"
  },
  "etat": "Discuté",
  "signataires": {
    "auteur": {
      "typeAuteur": "Depute",
      "acteurRef": "PA718884",
      "organeRef": {
        "@xmlns:xsi": "http://www.w3.org/2001/XMLSchema-instance",
        "@xsi:nil": "true"
      },
      "groupePolitiqueRef": "PO730934"
    },
    "cosignataires": {
      "acteurRef": [
        "PA718884",
        "PA2155"
      ]
    },
    "texteAffichable": "Mme&#160;Bazin-Malgras et M.&#160;Menuel"
  },
  "pointeurFragmentTexte": {
    "missionVisee": {
      "@xmlns:xsi": "http://www.w3.org/2001/XMLSchema-instance",
      "@xsi:nil": "true"
    },
    "division": {
      "titre": "Article 44",
      "articleDesignationCourte": "ART. 44",
      "type": "ARTICLE",
      "avant_A_Apres": "A",
      "divisionRattachee": "ARTICLE 44",
      "articleAdditionnel": {
        "@xmlns:xsi": "http://www.w3.org/2001/XMLSchema-instance",
        "@xsi:nil": "true"
      },
      "chapitreAdditionnel": {
        "@xmlns:xsi": "http://www.w3.org/2001/XMLSchema-instance",
        "@xsi:nil": "true"
      },
      "urlDivisionTexteVise": "/15/textes/0269.asp#D_Article_44"
    },
    "alinea": {
      "avant_A_Apres": null,
      "numero": "3",
      "alineaDesignation": {
        "@xmlns:xsi": "http://www.w3.org/2001/XMLSchema-instance",
        "@xsi:nil": "true"
      }
    }
  },
  "corps": {
    "dispositif": "<p style=\"text-align: justify;\">R&#233;diger ainsi les alin&#233;as 3 et 4&#160;:</p><p style=\"text-align: justify;\">&#171;&#160;2&#176; Les F, G et H de l&#8217;annexe I sont abrog&#233;s.</p><p style=\"text-align: justify;\">&#171;&#160;3&#176;&#160;Les neuvi&#232;me &#224; trenti&#232;me alin&#233;as de l&#8217;article&#160;3 du r&#232;glement sont supprim&#233;s.&#160;&#187;</p>",
    "exposeSommaire": "<p style=\"text-align: justify;\">Les clauses de sauvegarde inscrites dans le R&#232;glement arbitral sont en contradiction flagrante avec la volont&#233; affich&#233;e par le gouvernement d&#8217;am&#233;liorer l&#8217;acc&#232;s aux soins. En effet, toute am&#233;lioration de l&#8217;acc&#232;s aux soins se traduira in&#233;vitablement par une augmentation du volume des actes, que ce soit sur les actes opposables comme sur les proth&#232;ses, ce qui est l&#8217;objectif recherch&#233; quand on parle d&#8217;acc&#232;s aux soins, avec pour corollaire une augmentation des d&#233;penses rembours&#233;es.</p><p style=\"text-align: justify;\">D&#232;s lors, instaurer des clauses de sauvegarde bas&#233;es sur le plafonnement des d&#233;penses rembours&#233;es n&#8217;a pas de sens et s&#8217;apparente &#224; la mise en place d&#8217;une maitrise comptable qui n&#8217;a aucune raison d&#8217;&#234;tre dans une discipline caract&#233;ris&#233;e par une absence de dynamique inflationniste en volume.</p><p style=\"text-align: justify;\">Par ailleurs, l&#8217;&#233;quilibre recherch&#233; par l&#8217;UNCAM et la profession se trouve pris en d&#233;faut par les clauses de sauvegarde dont l&#8217;application acc&#233;l&#233;reront la baisse des plafonds et bloqueront les revalorisations des soins conservateurs en cas d&#8217;augmentation significative de la fr&#233;quence des actes. Ces clauses de sauvegarde sont donc en contradiction avec la politique d&#8217;acc&#232;s aux soins pr&#244;n&#233;e et sont donc pr&#233;judiciables pour les patients et les praticiens.</p><p style=\"text-align: justify;\">Dans cette hypoth&#232;se, les clauses de sauvegarde s&#8217;analysent comme une clause punitive injustifi&#233;e. Elles figent les tarifs pour 5 ans sans possibilit&#233; d&#8217;infl&#233;chir la trajectoire du r&#233;&#233;quilibrage par des clauses de revoyure. Elles sont unilat&#233;rales et au pr&#233;judice des seuls chirurgiens-dentistes.</p><p style=\"text-align: justify;\">Enfin, les chiffres indiqu&#233;s par l&#8217;arbitre des trois p&#233;riodes observ&#233;es ne sont confort&#233;s par aucune justification et sont inv&#233;rifiables.</p><p style=\"text-align: justify;\">L&#8217;amendement vise donc &#224; supprimer ces clauses de sauvegarde contraire &#224; l&#8217;objectif affich&#233; d&#8217;acc&#232;s aux soins.</p>",
    "annexeExposeSommaire": {
      "@xmlns:xsi": "http://www.w3.org/2001/XMLSchema-instance",
      "@xsi:nil": "true"
    }
  },
  "representations": {
    "representation": {
      "nom": "PDF",
      "typeMime": {
        "type": "application",
        "subType": "PDF"
      },
      "statutRepresentation": {
        "verbatim": "true",
        "canonique": "true",
        "officielle": "true",
        "transcription": "false",
        "enregistrement": "false"
      },
      "repSource": {
        "@xmlns:xsi": "http://www.w3.org/2001/XMLSchema-instance",
        "@xsi:nil": "true"
      },
      "offset": {
        "@xmlns:xsi": "http://www.w3.org/2001/XMLSchema-instance",
        "@xsi:nil": "true"
      },
      "contenu": {
        "documentURI": "/15/amendements/0269/AN/24.pdf"
      },
      "dateDispoRepresentation": {
        "@xmlns:xsi": "http://www.w3.org/2001/XMLSchema-instance",
        "@xsi:nil": "true"
      }
    }
  },
  "seanceDiscussion": "RUANR5L15S2018IDS20714",
  "sort": {
    "dateSaisie": "2017-10-28T01:08:21.000+02:00",
    "sortEnSeance": "Non soutenu"
  },
  "dateDepot": "2017-10-17T02:00:00.000+02:00",
  "dateDistribution": "2017-10-23T02:00:00.000+02:00",
  "article99": "0",
  "loiReference": {
    "codeLoi": {
      "@xmlns:xsi": "http://www.w3.org/2001/XMLSchema-instance",
      "@xsi:nil": "true"
    },
    "divisionCodeLoi": {
      "@xmlns:xsi": "http://www.w3.org/2001/XMLSchema-instance",
      "@xsi:nil": "true"
    }
  }
}