{
  "@xmlns": "http://schemas.assemblee-nationale.fr/referentiel",
  "uid": "AMANR5L15PO757134B1088P0D1N1276",
  "identifiant": {
    "legislature": "15",
    "numero": "1276",
    "numRect": "0",
    "saisine": {
      "refTexteLegislatif": "PRJLANR5L15B1088",
      "numeroPartiePLF": "0",
      "organeExamen": "PO757134",
      "mentionSecondeDeliberation": "0"
    }
  },
  "numeroLong": "1276",
  "etapeTexte": "1ère lecture (1ère assemblée saisie)",
  "triAmendement": "maaaaaaaaaaaaaaaaaaaaaaaaaaaaaaaaaaaaaaaaaaaaaaaaabiam",
  "cardinaliteAmdtMultiples": "1",
  "amendementParent": {
    "@xmlns:xsi": "http://www.w3.org/2001/XMLSchema-instance",
    "@xsi:nil": "true"
  },
  "etat": "Discuté",
  "signataires": {
    "auteur": {
      "typeAuteur": "Depute",
      "acteurRef": "PA331567",
      "organeRef": {
        "@xmlns:xsi": "http://www.w3.org/2001/XMLSchema-instance",
        "@xsi:nil": "true"
      },
      "groupePolitiqueRef": "PO744425"
    },
    "cosignataires": {
      "acteurRef": "PA331567"
    },
    "texteAffichable": "Mme&#160;de La Raudi&#232;re"
  },
  "pointeurFragmentTexte": {
    "missionVisee": {
      "@xmlns:xsi": "http://www.w3.org/2001/XMLSchema-instance",
      "@xsi:nil": "true"
    },
    "division": {
      "titre": "Article 62",
      "articleDesignationCourte": "APRÈS ART. 62",
      "type": "ARTICLE",
      "avant_A_Apres": "Après",
      "divisionRattachee": "APRÈS L'ARTICLE 62, insérer l'article suivant:",
      "articleAdditionnel": "1",
      "chapitreAdditionnel": {
        "@xmlns:xsi": "http://www.w3.org/2001/XMLSchema-instance",
        "@xsi:nil": "true"
      },
      "urlDivisionTexteVise": "/15/textes/1088.asp#D_Article_62"
    },
    "alinea": {
      "@xmlns:xsi": "http://www.w3.org/2001/XMLSchema-instance",
      "@xsi:nil": "true"
    }
  },
  "corps": {
    "dispositif": "<p style=\"text-align: justify;\">L&#8217;article L.&#160;225&#8209;37&#8209;1 du code de commerce est compl&#233;t&#233; par un alin&#233;a ainsi r&#233;dig&#233;&#160;:</p><p style=\"text-align: justify;\">&#171;&#160;Le conseil d&#8217;administration d&#233;lib&#232;re annuellement sur la politique de la soci&#233;t&#233; en mati&#232;re d&#8217;innovation.&#160;&#187;</p>",
    "exposeSommaire": "<p style=\"text-align: justify;\">Afin que la politique d&#8217;innovation soit trait&#233;e de fa&#231;on incontournable dans les entreprises, cet amendement encourage les SA &#224; d&#233;lib&#233;rer chaque ann&#233;e, au sein de leur conseil d&#8217;administration, sur la politique d&#8217;innovation de l&#8217;entreprise.</p><p style=\"text-align: justify;\">Il est bas&#233; sur le m&#234;me mod&#232;le de ce qui est pr&#233;vu pour la politique d&#8217;&#233;galit&#233; femmes/hommes.</p>",
    "annexeExposeSommaire": {
      "@xmlns:xsi": "http://www.w3.org/2001/XMLSchema-instance",
      "@xsi:nil": "true"
    }
  },
  "representations": {
    "representation": {
      "nom": "PDF",
      "typeMime": {
        "type": "application",
        "subType": "PDF"
      },
      "statutRepresentation": {
        "verbatim": "true",
        "canonique": "true",
        "officielle": "true",
        "transcription": "false",
        "enregistrement": "false"
      },
      "repSource": {
        "@xmlns:xsi": "http://www.w3.org/2001/XMLSchema-instance",
        "@xsi:nil": "true"
      },
      "offset": {
        "@xmlns:xsi": "http://www.w3.org/2001/XMLSchema-instance",
        "@xsi:nil": "true"
      },
      "contenu": {
        "documentURI": "/15/amendements/1088/CSPACTE/1276.pdf"
      },
      "dateDispoRepresentation": {
        "@xmlns:xsi": "http://www.w3.org/2001/XMLSchema-instance",
        "@xsi:nil": "true"
      }
    }
  },
  "seanceDiscussion": {
    "@xmlns:xsi": "http://www.w3.org/2001/XMLSchema-instance",
    "@xsi:nil": "true"
  },
  "sort": {
    "dateSaisie": "2018-09-14T22:41:46.000+02:00",
    "sortEnSeance": "Retiré"
  },
  "dateDepot": "2018-09-03T02:00:00.000+02:00",
  "dateDistribution": "2018-09-12T02:00:00.000+02:00",
  "article99": "0",
  "loiReference": {
    "codeLoi": "commerce",
    "divisionCodeLoi": "L225-37-1"
  }
}