{
  "@xmlns": "http://schemas.assemblee-nationale.fr/referentiel",
  "uid": "AMANR5L15PO59051B0714P0D1N408",
  "identifiant": {
    "legislature": "15",
    "numero": "408",
    "numRect": "0",
    "saisine": {
      "refTexteLegislatif": "PRJLANR5L15B0714",
      "numeroPartiePLF": "0",
      "organeExamen": "PO59051",
      "mentionSecondeDeliberation": "0"
    }
  },
  "numeroLong": "CL408",
  "etapeTexte": "1ère lecture (1ère assemblée saisie)",
  "triAmendement": "bci",
  "cardinaliteAmdtMultiples": "1",
  "amendementParent": {
    "@xmlns:xsi": "http://www.w3.org/2001/XMLSchema-instance",
    "@xsi:nil": "true"
  },
  "etat": "Discuté",
  "signataires": {
    "auteur": {
      "typeAuteur": "Depute",
      "acteurRef": "PA719448",
      "organeRef": {
        "@xmlns:xsi": "http://www.w3.org/2001/XMLSchema-instance",
        "@xsi:nil": "true"
      },
      "groupePolitiqueRef": "PO730964"
    },
    "cosignataires": {
      "acteurRef": [
        "PA721384",
        "PA721742",
        "PA719558",
        "PA719448",
        "PA721296",
        "PA719624",
        "PA722252",
        "PA719806",
        "PA718860",
        "PA722054"
      ]
    },
    "texteAffichable": "Mme&#160;Chapelier,  Mme&#160;Hai, Mme&#160;Rixain, M.&#160;Gouffier-Cha, Mme&#160;Auconie, M.&#160;Balanant, Mme&#160;Taurine, Mme&#160;Florennes, Mme&#160;Fontenel-Personne et Mme&#160;Couillard"
  },
  "pointeurFragmentTexte": {
    "missionVisee": {
      "@xmlns:xsi": "http://www.w3.org/2001/XMLSchema-instance",
      "@xsi:nil": "true"
    },
    "division": {
      "titre": "Article 32",
      "articleDesignationCourte": "ART. 32",
      "type": "ARTICLE",
      "avant_A_Apres": "A",
      "divisionRattachee": "ARTICLE 32",
      "articleAdditionnel": {
        "@xmlns:xsi": "http://www.w3.org/2001/XMLSchema-instance",
        "@xsi:nil": "true"
      },
      "chapitreAdditionnel": {
        "@xmlns:xsi": "http://www.w3.org/2001/XMLSchema-instance",
        "@xsi:nil": "true"
      },
      "urlDivisionTexteVise": "/15/textes/0714.asp#D_Article_32"
    },
    "alinea": {
      "avant_A_Apres": "Apres",
      "numero": "3",
      "alineaDesignation": {
        "@xmlns:xsi": "http://www.w3.org/2001/XMLSchema-instance",
        "@xsi:nil": "true"
      }
    }
  },
  "corps": {
    "dispositif": "<p style=\"text-align: justify;\">Apr&#232;s l&#8217;alin&#233;a&#160;3, ins&#233;rer les deux alin&#233;as suivants&#160;: </p><p style=\"text-align: justify;\">&#171;&#160;1&#176;&#160;<i>bis</i>&#160;Le m&#234;me article est compl&#233;t&#233; par un alin&#233;a ainsi r&#233;dig&#233;&#160;:</p><p style=\"text-align: justify;\">&#171;&#160;Une fois arriv&#233;e &#224; expiration, la carte de s&#233;jour vis&#233;e aux alin&#233;as pr&#233;c&#233;dents est renouvel&#233;e de plein droit m&#234;me apr&#232;s l&#8217;expiration de l&#8217;ordonnance de protection, lorsque l&#8217;&#233;tranger a port&#233; plainte contre l&#8217;auteur des faits, pendant la dur&#233;e de la proc&#233;dure p&#233;nale y aff&#233;rente.&#160;&#187;</p>",
    "exposeSommaire": "<p>Cet amendement, issu de la recommandation n&#176;&#160;5 de la D&#233;l&#233;gation aux droits des femmes, vise &#224; compl&#233;ter l&#8217;article L.&#160;316-3 code de l'entr&#233;e et du s&#233;jour des &#233;trangers et du droit d'asile pour permettre aux personnes &#233;trang&#232;res victimes de violences conjugales ou familiales ou menac&#233;es de mariage forc&#233; d&#8217;obtenir de plein droit le renouvellement de leur carte de s&#233;jour temporaire m&#234;me dans les cas o&#249; l&#8217;ordonnance de protection n&#8217;est plus en vigueur d&#232;s lors que la victime a port&#233; plainte contre l'auteur des faits.</p>",
    "annexeExposeSommaire": {
      "@xmlns:xsi": "http://www.w3.org/2001/XMLSchema-instance",
      "@xsi:nil": "true"
    }
  },
  "representations": {
    "representation": {
      "nom": "PDF",
      "typeMime": {
        "type": "application",
        "subType": "PDF"
      },
      "statutRepresentation": {
        "verbatim": "true",
        "canonique": "true",
        "officielle": "true",
        "transcription": "false",
        "enregistrement": "false"
      },
      "repSource": {
        "@xmlns:xsi": "http://www.w3.org/2001/XMLSchema-instance",
        "@xsi:nil": "true"
      },
      "offset": {
        "@xmlns:xsi": "http://www.w3.org/2001/XMLSchema-instance",
        "@xsi:nil": "true"
      },
      "contenu": {
        "documentURI": "/15/amendements/0714/CION_LOIS/CL408.pdf"
      },
      "dateDispoRepresentation": {
        "@xmlns:xsi": "http://www.w3.org/2001/XMLSchema-instance",
        "@xsi:nil": "true"
      }
    }
  },
  "seanceDiscussion": {
    "@xmlns:xsi": "http://www.w3.org/2001/XMLSchema-instance",
    "@xsi:nil": "true"
  },
  "sort": {
    "dateSaisie": "2018-04-06T19:55:06.000+02:00",
    "sortEnSeance": "Adopté"
  },
  "dateDepot": "2018-03-30T02:00:00.000+02:00",
  "dateDistribution": "2018-04-03T02:00:00.000+02:00",
  "article99": "0",
  "loiReference": {
    "codeLoi": "1",
    "divisionCodeLoi": "L316-3"
  }
}