{
  "@xmlns": "http://schemas.assemblee-nationale.fr/referentiel",
  "uid": "AMANR5L15PO59048B0235P1D1N412",
  "identifiant": {
    "legislature": "15",
    "numero": "412",
    "numRect": "0",
    "saisine": {
      "refTexteLegislatif": "PRJLANR5L15B0235",
      "numeroPartiePLF": "1",
      "organeExamen": "PO59048",
      "mentionSecondeDeliberation": "0"
    }
  },
  "numeroLong": "I-CF412",
  "etapeTexte": "1ère lecture (1ère assemblée saisie)",
  "triAmendement": "ni",
  "cardinaliteAmdtMultiples": "1",
  "amendementParent": {
    "@xmlns:xsi": "http://www.w3.org/2001/XMLSchema-instance",
    "@xsi:nil": "true"
  },
  "etat": "Discuté",
  "signataires": {
    "auteur": {
      "typeAuteur": "Depute",
      "acteurRef": "PA609590",
      "organeRef": {
        "@xmlns:xsi": "http://www.w3.org/2001/XMLSchema-instance",
        "@xsi:nil": "true"
      },
      "groupePolitiqueRef": "PO730946"
    },
    "cosignataires": {
      "acteurRef": [
        "PA719930",
        "PA1008",
        "PA720988",
        "PA333285",
        "PA608172",
        "PA588886",
        "PA340343",
        "PA405480",
        "PA330357",
        "PA608011",
        "PA333818",
        "PA609590",
        "PA643145",
        "PA642764",
        "PA508",
        "PA335054",
        "PA337483",
        "PA607553",
        "PA608695",
        "PA609332",
        "PA335532",
        "PA332614",
        "PA1809",
        "PA610681",
        "PA1592",
        "PA605069",
        "PA429893",
        "PA267233",
        "PA342415",
        "PA1198"
      ]
    },
    "texteAffichable": "Mme&#160;Rabault,  M.&#160;Jean-Louis&#160;Bricout, Mme&#160;Pires Beaune, M.&#160;Pupponi, M.&#160;Faure, M.&#160;Aviragnet, Mme&#160;Bareigts, Mme&#160;Battistel, Mme&#160;Bi&#233;mouret, M.&#160;Bouillon, M.&#160;Carvounas, M.&#160;Alain&#160;David, Mme&#160;Laurence&#160;Dumont, M.&#160;Dussopt, M.&#160;Garot, M.&#160;David&#160;Habib, M.&#160;Hutin, M.&#160;Juanico, Mme&#160;Karamanli, M.&#160;J&#233;r&#244;me&#160;Lambert, M.&#160;Le Foll, M.&#160;Letchimy, Mme&#160;Manin, Mme&#160;Pau-Langevin, M.&#160;Potier, M.&#160;Pueyo, M.&#160;Saulignac, Mme&#160;Untermaier, Mme&#160;Vainqueur-Christophe et M.&#160;Vallaud"
  },
  "pointeurFragmentTexte": {
    "missionVisee": {
      "@xmlns:xsi": "http://www.w3.org/2001/XMLSchema-instance",
      "@xsi:nil": "true"
    },
    "division": {
      "titre": "Article 3",
      "articleDesignationCourte": "ART. 3",
      "type": "ARTICLE",
      "avant_A_Apres": "A",
      "divisionRattachee": "ARTICLE 3",
      "articleAdditionnel": {
        "@xmlns:xsi": "http://www.w3.org/2001/XMLSchema-instance",
        "@xsi:nil": "true"
      },
      "chapitreAdditionnel": {
        "@xmlns:xsi": "http://www.w3.org/2001/XMLSchema-instance",
        "@xsi:nil": "true"
      },
      "urlDivisionTexteVise": "/15/textes/0235A.asp#D_Article_3"
    },
    "alinea": {
      "avant_A_Apres": "Apres",
      "numero": "55",
      "alineaDesignation": {
        "@xmlns:xsi": "http://www.w3.org/2001/XMLSchema-instance",
        "@xsi:nil": "true"
      }
    }
  },
  "corps": {
    "dispositif": "<p>Compl&#233;ter cet article par l&#8217;alin&#233;a suivant&#160;:</p><p>&#171;&#160;Le Gouvernement remet chaque ann&#233;e au Parlement, au plus tard le 15 octobre, un rapport sur la mise en application progressive du d&#233;gr&#232;vement de la taxe d&#8217;habitation sur la r&#233;sidence principale pr&#233;vu au pr&#233;sent article.&#160;&#187;</p>",
    "exposeSommaire": "<p>L'article 3 instaure, &#224; compter des impositions de 2018, un nouveau d&#233;gr&#232;vement qui, s'ajoutant aux exon&#233;rations existantes, permettra &#224; environ 80 % des foyers d'&#234;tre dispens&#233;s du paiement de la taxe d'habitation au titre de leur r&#233;sidence principale d'ici 2020. Cet objectif sera atteint de mani&#232;re progressive sur 3 ans.</p><p style=\"text-align: justify;\">Cette r&#233;forme n'est pas sans poser de nombreuses questions, notamment &#224; la lumi&#232;re de l'expos&#233; des motifs qui pr&#233;cise qu' \"un m&#233;canisme de limitation des hausses de taux d&#233;cid&#233;es ult&#233;rieurement par les collectivit&#233;s et de prise en charge de leurs cons&#233;quences, de mani&#232;re &#224; garantir un d&#233;gr&#232;vement complet, en 2020, pour les foyers concern&#233;s, sera discut&#233; dans le cadre de la conf&#233;rence nationale des territoires\".</p><p>Aussi, cet amendement demande au Gouvernement de remettre chaque ann&#233;e au Parlement, au plus tard le 15 octobre, un rapport sur la mise en application progressive de cette r&#233;forme.</p><p>&#160;</p>",
    "annexeExposeSommaire": {
      "@xmlns:xsi": "http://www.w3.org/2001/XMLSchema-instance",
      "@xsi:nil": "true"
    }
  },
  "representations": {
    "representation": {
      "nom": "PDF",
      "typeMime": {
        "type": "application",
        "subType": "PDF"
      },
      "statutRepresentation": {
        "verbatim": "true",
        "canonique": "true",
        "officielle": "true",
        "transcription": "false",
        "enregistrement": "false"
      },
      "repSource": {
        "@xmlns:xsi": "http://www.w3.org/2001/XMLSchema-instance",
        "@xsi:nil": "true"
      },
      "offset": {
        "@xmlns:xsi": "http://www.w3.org/2001/XMLSchema-instance",
        "@xsi:nil": "true"
      },
      "contenu": {
        "documentURI": "/15/amendements/0235A/CION_FIN/CF412.pdf"
      },
      "dateDispoRepresentation": {
        "@xmlns:xsi": "http://www.w3.org/2001/XMLSchema-instance",
        "@xsi:nil": "true"
      }
    }
  },
  "seanceDiscussion": {
    "@xmlns:xsi": "http://www.w3.org/2001/XMLSchema-instance",
    "@xsi:nil": "true"
  },
  "sort": {
    "dateSaisie": "2017-10-11T11:20:52.000+02:00",
    "sortEnSeance": "Retiré"
  },
  "dateDepot": "2017-10-06T02:00:00.000+02:00",
  "dateDistribution": "2017-10-10T02:00:00.000+02:00",
  "article99": "0",
  "loiReference": {
    "codeLoi": {
      "@xmlns:xsi": "http://www.w3.org/2001/XMLSchema-instance",
      "@xsi:nil": "true"
    },
    "divisionCodeLoi": {
      "@xmlns:xsi": "http://www.w3.org/2001/XMLSchema-instance",
      "@xsi:nil": "true"
    }
  }
}