{
  "@xmlns": "http://schemas.assemblee-nationale.fr/referentiel",
  "uid": "AMANR5L15SEA717460B0911P0D1N876",
  "identifiant": {
    "legislature": "15",
    "numero": "876",
    "numRect": "0",
    "saisine": {
      "refTexteLegislatif": "PRJLANR5L15B0911",
      "numeroPartiePLF": "0",
      "organeExamen": "PO717460",
      "mentionSecondeDeliberation": "0"
    }
  },
  "numeroLong": "876",
  "etapeTexte": "1ère lecture (1ère assemblée saisie)",
  "triAmendement": "apsezwzrzzmi",
  "cardinaliteAmdtMultiples": "1",
  "amendementParent": {
    "@xmlns:xsi": "http://www.w3.org/2001/XMLSchema-instance",
    "@xsi:nil": "true"
  },
  "etat": "Discuté",
  "signataires": {
    "auteur": {
      "typeAuteur": "Depute",
      "acteurRef": "PA720996",
      "organeRef": {
        "@xmlns:xsi": "http://www.w3.org/2001/XMLSchema-instance",
        "@xsi:nil": "true"
      },
      "groupePolitiqueRef": "PO723569"
    },
    "cosignataires": {
      "acteurRef": [
        "PA720996",
        "PA333421",
        "PA605518"
      ]
    },
    "texteAffichable": "M.&#160;El Guerrab,  M.&#160;Pancher et M.&#160;Fran&#231;ois-Michel&#160;Lambert"
  },
  "pointeurFragmentTexte": {
    "missionVisee": {
      "@xmlns:xsi": "http://www.w3.org/2001/XMLSchema-instance",
      "@xsi:nil": "true"
    },
    "division": {
      "titre": "Article PREMIER",
      "articleDesignationCourte": "AVANT ART. PREMIER",
      "type": "ARTICLE",
      "avant_A_Apres": "Avant",
      "divisionRattachee": "AVANT L'ARTICLE PREMIER, insérer l'article suivant:",
      "articleAdditionnel": "1",
      "chapitreAdditionnel": {
        "@xmlns:xsi": "http://www.w3.org/2001/XMLSchema-instance",
        "@xsi:nil": "true"
      },
      "urlDivisionTexteVise": "/15/textes/0911.asp#D_Article_1er"
    },
    "alinea": {
      "@xmlns:xsi": "http://www.w3.org/2001/XMLSchema-instance",
      "@xsi:nil": "true"
    }
  },
  "corps": {
    "dispositif": "<p style=\"text-align: justify;\">L&#8217;article&#160;17 de la Constitution est compl&#233;t&#233; par les mots&#160;: &#171;&#160;apr&#232;s que le Conseil sup&#233;rieur de la magistrature a &#233;mis un avis sur la demande&#160;&#187;.</p>",
    "exposeSommaire": "<p style=\"text-align: justify;\">Par le biais de cet amendement, il s&#8217;agit de revenir sur ce que le Comit&#233; dit Balladur appelait, en 2007, une &#171;&#160;anomalie&#160;&#187; dans notre Constitution. En effet, le droit de gr&#226;ce non encadr&#233; du chef de l&#8217;&#201;tat repr&#233;sente un vestige d&#8217;&#233;poques tr&#232;s &#233;loign&#233;es. Un contreseing minist&#233;riel est certes n&#233;cessaire pour un tel acte de justice retenue (en vertu de l&#8217;article&#160;19 de la Constitution), mais la solidarit&#233; politique reliant habituellement le Gouvernement au chef de l&#8217;&#201;tat a pour cons&#233;quence d&#8217;en neutraliser les effets.</p><p style=\"text-align: justify;\">Du reste, un premier pas a &#233;t&#233; effectu&#233; en 2008, puisque le constituant a pr&#233;cis&#233; que ce droit de gr&#226;ce s&#8217;op&#233;rait d&#233;sormais &#224; titre individuel, mais il para&#238;t n&#233;cessaire d&#8217;aller plus loin, en r&#233;servant la possibilit&#233; d&#8217;une gr&#226;ce sous r&#233;serve d&#8217;un avis du Conseil sup&#233;rieur de la magistrature.</p><p style=\"text-align: justify;\">L&#8217;avis est consultatif, si bien que le chef de l&#8217;&#201;tat conserve une certaine marge de man&#339;uvre, mais la publicit&#233; qui y est attach&#233;e emp&#234;chera toute d&#233;rive. Par coordination, il conviendrait alors de compl&#233;ter la loi organique prise pour l&#8217;application de l&#8217;article&#160;65 de la Constitution.</p>",
    "annexeExposeSommaire": {
      "@xmlns:xsi": "http://www.w3.org/2001/XMLSchema-instance",
      "@xsi:nil": "true"
    }
  },
  "representations": {
    "representation": {
      "nom": "PDF",
      "typeMime": {
        "type": "application",
        "subType": "PDF"
      },
      "statutRepresentation": {
        "verbatim": "true",
        "canonique": "true",
        "officielle": "true",
        "transcription": "false",
        "enregistrement": "false"
      },
      "repSource": {
        "@xmlns:xsi": "http://www.w3.org/2001/XMLSchema-instance",
        "@xsi:nil": "true"
      },
      "offset": {
        "@xmlns:xsi": "http://www.w3.org/2001/XMLSchema-instance",
        "@xsi:nil": "true"
      },
      "contenu": {
        "documentURI": "/15/amendements/0911/AN/876.pdf"
      },
      "dateDispoRepresentation": {
        "@xmlns:xsi": "http://www.w3.org/2001/XMLSchema-instance",
        "@xsi:nil": "true"
      }
    }
  },
  "seanceDiscussion": "RUANR5L15S2018IDS21168",
  "sort": {
    "dateSaisie": "2018-07-17T00:11:18.000+02:00",
    "sortEnSeance": "Rejeté"
  },
  "dateDepot": "2018-07-05T02:00:00.000+02:00",
  "dateDistribution": "2018-07-09T02:00:00.000+02:00",
  "article99": "0",
  "loiReference": {
    "codeLoi": "Constitution",
    "divisionCodeLoi": "17"
  }
}