{
  "@xmlns": "http://schemas.assemblee-nationale.fr/referentiel",
  "uid": "AMANR5L15PO757134B1088P0D1N397",
  "identifiant": {
    "legislature": "15",
    "numero": "397",
    "numRect": "0",
    "saisine": {
      "refTexteLegislatif": "PRJLANR5L15B1088",
      "numeroPartiePLF": "0",
      "organeExamen": "PO757134",
      "mentionSecondeDeliberation": "0"
    }
  },
  "numeroLong": "397",
  "etapeTexte": "1ère lecture (1ère assemblée saisie)",
  "triAmendement": "bfaaaaaaaaaaaaaaaaaaaaaaaaaaaaaaaaaaaaaaaaaaaaaaaao",
  "cardinaliteAmdtMultiples": "1",
  "amendementParent": {
    "@xmlns:xsi": "http://www.w3.org/2001/XMLSchema-instance",
    "@xsi:nil": "true"
  },
  "etat": "Discuté",
  "signataires": {
    "auteur": {
      "typeAuteur": "Depute",
      "acteurRef": "PA942",
      "organeRef": {
        "@xmlns:xsi": "http://www.w3.org/2001/XMLSchema-instance",
        "@xsi:nil": "true"
      },
      "groupePolitiqueRef": "PO744425"
    },
    "cosignataires": {
      "acteurRef": [
        "PA332228",
        "PA942",
        "PA331567",
        "PA642868"
      ]
    },
    "texteAffichable": "M.&#160;Charles&#160;de Courson,  M.&#160;Christophe, Mme&#160;de La Raudi&#232;re et M.&#160;Benoit"
  },
  "pointeurFragmentTexte": {
    "missionVisee": {
      "@xmlns:xsi": "http://www.w3.org/2001/XMLSchema-instance",
      "@xsi:nil": "true"
    },
    "division": {
      "titre": "Article 16",
      "articleDesignationCourte": "ART. 16",
      "type": "ARTICLE",
      "avant_A_Apres": "A",
      "divisionRattachee": "ARTICLE 16",
      "articleAdditionnel": {
        "@xmlns:xsi": "http://www.w3.org/2001/XMLSchema-instance",
        "@xsi:nil": "true"
      },
      "chapitreAdditionnel": {
        "@xmlns:xsi": "http://www.w3.org/2001/XMLSchema-instance",
        "@xsi:nil": "true"
      },
      "urlDivisionTexteVise": "/15/textes/1088.asp#D_Article_16"
    },
    "alinea": {
      "avant_A_Apres": {
        "@xmlns:xsi": "http://www.w3.org/2001/XMLSchema-instance",
        "@xsi:nil": "true"
      },
      "numero": "12",
      "alineaDesignation": {
        "@xmlns:xsi": "http://www.w3.org/2001/XMLSchema-instance",
        "@xsi:nil": "true"
      }
    }
  },
  "corps": {
    "dispositif": "<p style=\"text-align: justify;\">&#192; l&#8217;alin&#233;a&#160;12, apr&#232;s le mot&#160;:</p><p style=\"text-align: justify;\">&#171;&#160;en rempla&#231;ant&#160;&#187;, </p><p style=\"text-align: justify;\">ins&#233;rer les mots&#160;:</p><p style=\"text-align: justify;\">&#171;&#160;, &#224; l&#8217;exception du privil&#232;ge de pr&#234;teur de deniers,&#160;&#187;.</p>",
    "exposeSommaire": "<p style=\"text-align: justify;\">Le privil&#232;ge du pr&#234;teur de deniers est une s&#251;ret&#233; qu&#8217;un pr&#234;teur peut r&#233;clamer lorsqu&#8217;il accorde un cr&#233;dit dont le montant est affect&#233; &#224; l&#8217;acquisition d&#8217;une vente immobili&#232;re (privil&#232;ge sp&#233;cial sur l&#8217;immeuble financ&#233;).</p><p style=\"text-align: justify;\">L&#8217;hypoth&#232;que l&#233;gale est une s&#251;ret&#233; r&#233;elle immobili&#232;re accord&#233;e au cr&#233;ancier par la loi (au profit de cr&#233;anciers que le l&#233;gislateur a entendu prot&#233;ger de fa&#231;on sp&#233;ciale).</p><p style=\"text-align: justify;\">L&#8217;article pr&#233;voit la suppression des privil&#232;ges immobiliers sp&#233;ciaux (dont fait partie le privil&#232;ge de pr&#234;teur de deniers) au profit d&#8217;une nouvelle l&#8217;hypoth&#232;que l&#233;gale.</p><p style=\"text-align: justify;\">Actuellement, le privil&#232;ge de pr&#234;teur de deniers est souvent pr&#233;f&#233;r&#233; &#224; l&#8217;hypoth&#232;que conventionnelle car c&#8217;est une garantie moins co&#251;teuse pour l&#8217;emprunteur, n&#8217;&#233;tant pas soumis &#224; la taxe de publicit&#233; fonci&#232;re.</p><p style=\"text-align: justify;\">Par exemple, le surco&#251;t support&#233; par le client pour un pr&#234;t de 100 000&#160;euros serait de plus de 800&#160;euros par rapport &#224; un pr&#234;t avec privil&#232;ge de pr&#234;teur de deniers.</p><p style=\"text-align: justify;\">Le r&#233;gime fiscal de la nouvelle hypoth&#232;que l&#233;gale n&#8217;est pas connu &#224; ce jour et pourrait &#234;tre align&#233; sur celui de l&#8217;hypoth&#232;que conventionnelle.</p><p style=\"text-align: justify;\">Pour ces raisons, il est propos&#233; de conserver le privil&#232;ge de pr&#234;teur de derniers.</p>",
    "annexeExposeSommaire": {
      "@xmlns:xsi": "http://www.w3.org/2001/XMLSchema-instance",
      "@xsi:nil": "true"
    }
  },
  "representations": {
    "representation": {
      "nom": "PDF",
      "typeMime": {
        "type": "application",
        "subType": "PDF"
      },
      "statutRepresentation": {
        "verbatim": "true",
        "canonique": "true",
        "officielle": "true",
        "transcription": "false",
        "enregistrement": "false"
      },
      "repSource": {
        "@xmlns:xsi": "http://www.w3.org/2001/XMLSchema-instance",
        "@xsi:nil": "true"
      },
      "offset": {
        "@xmlns:xsi": "http://www.w3.org/2001/XMLSchema-instance",
        "@xsi:nil": "true"
      },
      "contenu": {
        "documentURI": "/15/amendements/1088/CSPACTE/397.pdf"
      },
      "dateDispoRepresentation": {
        "@xmlns:xsi": "http://www.w3.org/2001/XMLSchema-instance",
        "@xsi:nil": "true"
      }
    }
  },
  "seanceDiscussion": {
    "@xmlns:xsi": "http://www.w3.org/2001/XMLSchema-instance",
    "@xsi:nil": "true"
  },
  "sort": {
    "dateSaisie": "2018-09-07T22:54:09.000+02:00",
    "sortEnSeance": "Retiré"
  },
  "dateDepot": "2018-08-09T02:00:00.000+02:00",
  "dateDistribution": "2018-09-06T02:00:00.000+02:00",
  "article99": "0",
  "loiReference": {
    "codeLoi": {
      "@xmlns:xsi": "http://www.w3.org/2001/XMLSchema-instance",
      "@xsi:nil": "true"
    },
    "divisionCodeLoi": {
      "@xmlns:xsi": "http://www.w3.org/2001/XMLSchema-instance",
      "@xsi:nil": "true"
    }
  }
}