{
  "@xmlns": "http://schemas.assemblee-nationale.fr/referentiel",
  "uid": "AMANR5L15SEA717460B0235P1D1N695",
  "identifiant": {
    "legislature": "15",
    "numero": "695",
    "numRect": "0",
    "saisine": {
      "refTexteLegislatif": "PRJLANR5L15B0235",
      "numeroPartiePLF": "1",
      "organeExamen": "PO717460",
      "mentionSecondeDeliberation": "0"
    }
  },
  "numeroLong": "I-695",
  "etapeTexte": "1ère lecture (1ère assemblée saisie)",
  "triAmendement": "am",
  "cardinaliteAmdtMultiples": "1",
  "amendementParent": {
    "@xmlns:xsi": "http://www.w3.org/2001/XMLSchema-instance",
    "@xsi:nil": "true"
  },
  "etat": "Discuté",
  "signataires": {
    "auteur": {
      "typeAuteur": "Depute",
      "acteurRef": "PA332523",
      "organeRef": {
        "@xmlns:xsi": "http://www.w3.org/2001/XMLSchema-instance",
        "@xsi:nil": "true"
      },
      "groupePolitiqueRef": "PO730934"
    },
    "cosignataires": {
      "acteurRef": "PA332523"
    },
    "texteAffichable": "Mme&#160;Dalloz"
  },
  "pointeurFragmentTexte": {
    "missionVisee": {
      "@xmlns:xsi": "http://www.w3.org/2001/XMLSchema-instance",
      "@xsi:nil": "true"
    },
    "division": {
      "titre": "Article 19",
      "articleDesignationCourte": "APRÈS ART. 19",
      "type": "ARTICLE",
      "avant_A_Apres": "Après",
      "divisionRattachee": "APRÈS L'ARTICLE 19, insérer l'article suivant:",
      "articleAdditionnel": "1",
      "chapitreAdditionnel": {
        "@xmlns:xsi": "http://www.w3.org/2001/XMLSchema-instance",
        "@xsi:nil": "true"
      },
      "urlDivisionTexteVise": "/15/textes/0235A.asp#D_Article_19"
    },
    "alinea": {
      "@xmlns:xsi": "http://www.w3.org/2001/XMLSchema-instance",
      "@xsi:nil": "true"
    }
  },
  "corps": {
    "dispositif": "<p style=\"text-align: justify;\">II.&#160;&#8211;&#160;Apr&#232;s le mot&#160;: &#171;&#160;&#224;&#160;&#187;, la fin du premier alin&#233;a du 6 de l&#8217;article&#160;224 du code des douanes est ainsi r&#233;dig&#233;e&#160;: &#171;&#160;0&#160;% pour 2018 et 2&#160;% pour les ann&#233;es 2019 et 2020.&#160;&#187;</p><p style=\"text-align: justify;\">II.&#160;&#8211;&#160;La perte de recettes pour l&#8217;&#201;tat est compens&#233;e &#224; due concurrence par la cr&#233;ation d&#8217;une taxe additionnelle aux droits mentionn&#233;s aux articles 575 et 575 A du code g&#233;n&#233;ral des imp&#244;ts.&#160;</p>",
    "exposeSommaire": "<p style=\"text-align: justify;\">La Loi de Transition Energ&#233;tique (LTE) a institu&#233; un mode de financement particulier pour le recyclage des navires de plaisance en fin de vie. En compl&#233;ment de l&#8217;&#233;co-contribution due par les vendeurs de bateaux neufs, une quote-part du Droit Annuel de Francisation des Navires (DAFN&#160;: taxe annuelle pay&#233;e par les propri&#233;taires de bateaux de plaisance) doit contribuer au dispositif qui est pr&#233;vu pour entrer en vigueur &#224; compter de 2018.</p><p style=\"text-align: justify;\">Or, le DAFN constitue depuis 2006 la principale ressource du Conservatoire du littoral. La LTE a donc institu&#233; une double affectation de cette taxe. En 2015, lorsque la LTE a &#233;t&#233; adopt&#233;e, le produit de cette taxe venait d&#8217;atteindre son maximum &#224; 41 M&#8364; pour l&#8217;exercice 2014. Il &#233;tait donc pr&#233;vu que le financement compl&#233;mentaire du recyclage des navires se fasse sur le solde revers&#233; par le Conservatoire du littoral au-del&#224; du plafond de taxe qui lui &#233;tait octroy&#233;.</p><p style=\"text-align: justify;\">Cependant, depuis 2014, le produit de cette taxe subi une baisse r&#233;guli&#232;re li&#233;e au vieillissement de la flotte qui paye la taxe. En 2016, le Conservatoire n&#8217;a ainsi revers&#233; que 0,1 M&#8364; (38,6 M&#8364; encaiss&#233; pour un plafond de taxe affect&#233;e fix&#233; &#224; 38,5 M&#8364;). En 2017, l&#8217;encaissement de DAFN est inf&#233;rieur de 0,5 M&#8364; au plafond de taxe affect&#233;e (38,0 M&#8364; de pr&#233;vision d&#8217;encaissement pour un plafond de taxe fix&#233; &#224; 38,5 M&#8364;).</p><p style=\"text-align: justify;\">Lors de la mise en place de la REP plaisance il n&#8217;&#233;tait pas dans les intentions du l&#233;gislateur que cette disposition se fasse au d&#233;triment des ressources effectivement disponibles pour l&#8217;action du Conservatoire du littoral.</p><p style=\"text-align: justify;\">Ce report d&#8217;un an permet devrait donc permettre de travailler, dans l&#8217;intervalle, &#224; un dispositif modernis&#233; permettant de maintenir les moyens du Conservatoire au niveau souhaitable pour la mise en &#339;uvre de la strat&#233;gie d&#8217;intervention de l&#8217;&#233;tablissement &#224; l&#8217;horizon 2050.</p>",
    "annexeExposeSommaire": {
      "@xmlns:xsi": "http://www.w3.org/2001/XMLSchema-instance",
      "@xsi:nil": "true"
    }
  },
  "representations": {
    "representation": {
      "nom": "PDF",
      "typeMime": {
        "type": "application",
        "subType": "PDF"
      },
      "statutRepresentation": {
        "verbatim": "true",
        "canonique": "true",
        "officielle": "true",
        "transcription": "false",
        "enregistrement": "false"
      },
      "repSource": {
        "@xmlns:xsi": "http://www.w3.org/2001/XMLSchema-instance",
        "@xsi:nil": "true"
      },
      "offset": {
        "@xmlns:xsi": "http://www.w3.org/2001/XMLSchema-instance",
        "@xsi:nil": "true"
      },
      "contenu": {
        "documentURI": "/15/amendements/0235A/AN/695.pdf"
      },
      "dateDispoRepresentation": {
        "@xmlns:xsi": "http://www.w3.org/2001/XMLSchema-instance",
        "@xsi:nil": "true"
      }
    }
  },
  "seanceDiscussion": "RUANR5L15S2018IDS20770",
  "sort": {
    "dateSaisie": "2017-10-22T01:38:52.000+02:00",
    "sortEnSeance": "Non soutenu"
  },
  "dateDepot": "2017-10-13T02:00:00.000+02:00",
  "dateDistribution": "2017-10-17T02:00:00.000+02:00",
  "article99": "0",
  "loiReference": {
    "codeLoi": "c douanes",
    "divisionCodeLoi": "224"
  }
}