{
  "@xmlns": "http://schemas.assemblee-nationale.fr/referentiel",
  "uid": "AMANR5L15SEA717460BTC0857P0D1N842",
  "identifiant": {
    "legislature": "15",
    "numero": "842",
    "numRect": "0",
    "saisine": {
      "refTexteLegislatif": "PRJLANR5L15BTC0857",
      "numeroPartiePLF": "0",
      "organeExamen": "PO717460",
      "mentionSecondeDeliberation": "0"
    }
  },
  "numeroLong": "842",
  "etapeTexte": "1ère lecture (1ère assemblée saisie)",
  "triAmendement": "dt",
  "cardinaliteAmdtMultiples": "1",
  "amendementParent": {
    "@xmlns:xsi": "http://www.w3.org/2001/XMLSchema-instance",
    "@xsi:nil": "true"
  },
  "etat": "Discuté",
  "signataires": {
    "auteur": {
      "typeAuteur": "Depute",
      "acteurRef": "PA721896",
      "organeRef": {
        "@xmlns:xsi": "http://www.w3.org/2001/XMLSchema-instance",
        "@xsi:nil": "true"
      },
      "groupePolitiqueRef": "PO730940"
    },
    "cosignataires": {
      "acteurRef": [
        "PA441",
        "PA720692",
        "PA610634",
        "PA721118",
        "PA720546",
        "PA610654",
        "PA722202",
        "PA722110",
        "PA721896",
        "PA718720",
        "PA721270",
        "PA267306",
        "PA335612",
        "PA610667",
        "PA718926",
        "PA689"
      ]
    },
    "texteAffichable": "Mme&#160;Faucillon,  M.&#160;Peu, Mme&#160;Bello, M.&#160;Bruneel, Mme&#160;Buffet, M.&#160;Chassaigne, M.&#160;Dharr&#233;ville, M.&#160;Wulfranc, M.&#160;Dufr&#232;gne, M.&#160;Jumel, M.&#160;Lecoq, M.&#160;Fabien&#160;Roussel, M.&#160;Azerot, M.&#160;Brotherson, M.&#160;Nilor et M.&#160;Serville"
  },
  "pointeurFragmentTexte": {
    "missionVisee": {
      "@xmlns:xsi": "http://www.w3.org/2001/XMLSchema-instance",
      "@xsi:nil": "true"
    },
    "division": {
      "titre": "Article 7",
      "articleDesignationCourte": "ART. 7",
      "type": "ARTICLE",
      "avant_A_Apres": "A",
      "divisionRattachee": "ARTICLE 7",
      "articleAdditionnel": {
        "@xmlns:xsi": "http://www.w3.org/2001/XMLSchema-instance",
        "@xsi:nil": "true"
      },
      "chapitreAdditionnel": {
        "@xmlns:xsi": "http://www.w3.org/2001/XMLSchema-instance",
        "@xsi:nil": "true"
      },
      "urlDivisionTexteVise": "/15/textes/0857.asp#D_Article_7"
    },
    "alinea": {
      "avant_A_Apres": "Apres",
      "numero": "5",
      "alineaDesignation": {
        "@xmlns:xsi": "http://www.w3.org/2001/XMLSchema-instance",
        "@xsi:nil": "true"
      }
    }
  },
  "corps": {
    "dispositif": "<p style=\"text-align: justify;\">Apre&#768;s l&#8217;aline&#769;a&#160;5, inse&#769;rer les deux alin&#233;as suivants&#160;:</p><p style=\"text-align: justify;\">1&#176;&#160;<i>bis</i>&#160;Apre&#768;s le deuxie&#768;me aline&#769;a du m&#234;me article, il est ins&#233;r&#233; un aline&#769;a ainsi re&#769;dige&#769;&#160;:</p><p style=\"text-align: justify;\">&#171;&#160;En l&#8217;absence d&#8217;enregistrement dans le de&#769;lai de dix jours ouvre&#769;s, le demandeur d&#8217;asile peut saisir directement l&#8217;Office franc&#807;ais de protection des re&#769;fugie&#769;s et apatrides.&#160;&#187;</p>",
    "exposeSommaire": "<p style=\"text-align: justify;\">Cet amendement reprend une pr&#233;conisation du Conseil national des barreaux. Le de&#769;lai fixe&#769; a&#768; l&#8217;article&#160;6 de la directive 2013/32/UE constitue l&#8217;une des principales mesures permettant de satisfaire l&#8217;objectif de raccourcissement des proce&#769;dures. Il est ne&#769;cessaire que son irrespect soit sanctionne&#769;, sauf a&#768; permettre a&#768; certaines pre&#769;fectures de de&#769;velopper des pratiques contra legem allongeant de fait les de&#769;lais le&#769;gaux dans des proportions pouvant e&#770;tre importantes.</p><p style=\"text-align: justify;\">L&#8217;intervention en amont d&#8217;ope&#769;rateurs, de&#769;cide&#769;e par la loi du 29 juillet 2015, ne facilite en rien l&#8217;acce&#768;s a&#768; l&#8217;enregistrement des demandes d&#8217;asile.</p>",
    "annexeExposeSommaire": {
      "@xmlns:xsi": "http://www.w3.org/2001/XMLSchema-instance",
      "@xsi:nil": "true"
    }
  },
  "representations": {
    "representation": {
      "nom": "PDF",
      "typeMime": {
        "type": "application",
        "subType": "PDF"
      },
      "statutRepresentation": {
        "verbatim": "true",
        "canonique": "true",
        "officielle": "true",
        "transcription": "false",
        "enregistrement": "false"
      },
      "repSource": {
        "@xmlns:xsi": "http://www.w3.org/2001/XMLSchema-instance",
        "@xsi:nil": "true"
      },
      "offset": {
        "@xmlns:xsi": "http://www.w3.org/2001/XMLSchema-instance",
        "@xsi:nil": "true"
      },
      "contenu": {
        "documentURI": "/15/amendements/0857/AN/842.pdf"
      },
      "dateDispoRepresentation": {
        "@xmlns:xsi": "http://www.w3.org/2001/XMLSchema-instance",
        "@xsi:nil": "true"
      }
    }
  },
  "seanceDiscussion": "RUANR5L15S2018IDS21024",
  "sort": {
    "dateSaisie": "2018-04-20T12:05:42.000+02:00",
    "sortEnSeance": "Rejeté"
  },
  "dateDepot": "2018-04-12T02:00:00.000+02:00",
  "dateDistribution": "2018-04-13T02:00:00.000+02:00",
  "article99": "0",
  "loiReference": {
    "codeLoi": {
      "@xmlns:xsi": "http://www.w3.org/2001/XMLSchema-instance",
      "@xsi:nil": "true"
    },
    "divisionCodeLoi": {
      "@xmlns:xsi": "http://www.w3.org/2001/XMLSchema-instance",
      "@xsi:nil": "true"
    }
  }
}