{
  "@xmlns": "http://schemas.assemblee-nationale.fr/referentiel",
  "uid": "AMANR5L15PO419865B0627P0D1N181",
  "identifiant": {
    "legislature": "15",
    "numero": "181",
    "numRect": "0",
    "saisine": {
      "refTexteLegislatif": "PRJLANR5L15B0627",
      "numeroPartiePLF": "0",
      "organeExamen": "PO419865",
      "mentionSecondeDeliberation": "0"
    }
  },
  "numeroLong": "CD181",
  "etapeTexte": "1ère lecture (1ère assemblée saisie)",
  "triAmendement": "baww",
  "cardinaliteAmdtMultiples": "1",
  "amendementParent": {
    "@xmlns:xsi": "http://www.w3.org/2001/XMLSchema-instance",
    "@xsi:nil": "true"
  },
  "etat": "Discuté",
  "signataires": {
    "auteur": {
      "typeAuteur": "Depute",
      "acteurRef": "PA335999",
      "organeRef": {
        "@xmlns:xsi": "http://www.w3.org/2001/XMLSchema-instance",
        "@xsi:nil": "true"
      },
      "groupePolitiqueRef": "PO730946"
    },
    "cosignataires": {
      "acteurRef": "PA335999"
    },
    "texteAffichable": "Mme&#160;Batho"
  },
  "pointeurFragmentTexte": {
    "missionVisee": {
      "@xmlns:xsi": "http://www.w3.org/2001/XMLSchema-instance",
      "@xsi:nil": "true"
    },
    "division": {
      "titre": "Article 11",
      "articleDesignationCourte": "APRÈS ART. 11",
      "type": "ARTICLE",
      "avant_A_Apres": "Après",
      "divisionRattachee": "APRÈS L'ARTICLE 11, insérer l'article suivant:",
      "articleAdditionnel": "1",
      "chapitreAdditionnel": {
        "@xmlns:xsi": "http://www.w3.org/2001/XMLSchema-instance",
        "@xsi:nil": "true"
      },
      "urlDivisionTexteVise": "/15/textes/0627.asp#D_Article_11"
    },
    "alinea": {
      "@xmlns:xsi": "http://www.w3.org/2001/XMLSchema-instance",
      "@xsi:nil": "true"
    }
  },
  "corps": {
    "dispositif": "<p style=\"text-align: justify;\">Apr&#232;s le premier alin&#233;a de l&#8217;article L.&#160;531&#8209;2&#8209;1 du code de l&#8217;environnement, est ins&#233;r&#233; un alin&#233;a ainsi r&#233;dig&#233;&#160;:</p><p style=\"text-align: justify;\">&#171;&#160;&#192; compter du 1<sup>er</sup> janvier 2023, l&#8217;&#233;tiquetage des denr&#233;es alimentaires issues d&#8217;animaux nourris avec des aliments g&#233;n&#233;tiquement modifi&#233;s est obligatoire.&#160;&#187;</p>",
    "exposeSommaire": "<p style=\"text-align: justify;\">La mention &#171;&#160;OGM&#160;&#187; ne figure obligatoirement que sur les produits alimentaires comprenant des organismes g&#233;n&#233;tiquement modifi&#233;s, sauf les produits issus d&#8217;animaux nourris avec des OGM.&#160;</p><p style=\"text-align: justify;\">Alors que&#160;les cultures OGM sont interdites en France, des OGM sont massivement import&#233;s pour nourrir notre cheptel. Il s&#8217;agit pour l&#8217;essentiel de tr&#232;s grandes cultures de soja, g&#233;n&#233;tiquement modifi&#233; pour &#234;tre tol&#233;rant au glyphosate.</p><p style=\"text-align: justify;\">La France ne peut plus accepter&#160;cette hypocrisie, et soutenir par ses importations ce type de culture<span class=\"ins cts-1\"  data-cid=\"2\" data-userid=\"1134\" data-username=\"Delphine Batho\" data-time=\"1521759362547\">s</span> d&#233;sastreuses pour l&#8217;environnement et la sant&#233; humaine.&#160;</p><p style=\"text-align: justify;\">L&#8217;adoption de l&#8217;&#233;tiquetage obligatoire &#171;&#160;OGM&#160;&#187; des produits alimentaires issus d&#8217;animaux nourris, d&#8217;ici <span class=\"del cts-1\"  data-cid=\"3\" data-userid=\"1134\" data-username=\"Delphine Batho\" data-time=\"1521759377452\">un d&#233;lais de </span>cinq ans en 2023, doit &#233;galement permettre de donner un signal clair et servir d&#8217;acc&#233;l&#233;rateur pour le d&#233;ploiement du&#160;plan prot&#233;ines v&#233;g&#233;tales et <span class=\"ins cts-1\"  data-cid=\"4\" data-userid=\"1134\" data-username=\"Delphine Batho\" data-time=\"1521759395594\">de </span>toutes les strat&#233;gies de d&#233;veloppement de l&#8217;autonomie prot&#233;ique des fili&#232;res&#160;d&#8217;&#233;levage&#160;de notre pays.</p>",
    "annexeExposeSommaire": {
      "@xmlns:xsi": "http://www.w3.org/2001/XMLSchema-instance",
      "@xsi:nil": "true"
    }
  },
  "representations": {
    "representation": {
      "nom": "PDF",
      "typeMime": {
        "type": "application",
        "subType": "PDF"
      },
      "statutRepresentation": {
        "verbatim": "true",
        "canonique": "true",
        "officielle": "true",
        "transcription": "false",
        "enregistrement": "false"
      },
      "repSource": {
        "@xmlns:xsi": "http://www.w3.org/2001/XMLSchema-instance",
        "@xsi:nil": "true"
      },
      "offset": {
        "@xmlns:xsi": "http://www.w3.org/2001/XMLSchema-instance",
        "@xsi:nil": "true"
      },
      "contenu": {
        "documentURI": "/15/amendements/0627/CION-DVP/CD181.pdf"
      },
      "dateDispoRepresentation": {
        "@xmlns:xsi": "http://www.w3.org/2001/XMLSchema-instance",
        "@xsi:nil": "true"
      }
    }
  },
  "seanceDiscussion": {
    "@xmlns:xsi": "http://www.w3.org/2001/XMLSchema-instance",
    "@xsi:nil": "true"
  },
  "sort": {
    "dateSaisie": "2018-03-28T16:43:38.000+02:00",
    "sortEnSeance": "Rejeté"
  },
  "dateDepot": "2018-03-22T01:00:00.000+01:00",
  "dateDistribution": "2018-03-26T02:00:00.000+02:00",
  "article99": "0",
  "loiReference": {
    "codeLoi": "environnement",
    "divisionCodeLoi": "531-2-1"
  }
}