{
  "@xmlns": "http://schemas.assemblee-nationale.fr/referentiel",
  "uid": "AMANR5L15SEA717460BTC0106P0D1N128",
  "identifiant": {
    "legislature": "15",
    "numero": "128",
    "numRect": "1",
    "saisine": {
      "refTexteLegislatif": "PRJLANR5L15BTC0106",
      "numeroPartiePLF": "0",
      "organeExamen": "PO717460",
      "mentionSecondeDeliberation": "0"
    }
  },
  "numeroLong": "128 (Rect)",
  "etapeTexte": "1ère lecture (2ème assemblée saisie)",
  "triAmendement": "k",
  "cardinaliteAmdtMultiples": "1",
  "amendementParent": {
    "@xmlns:xsi": "http://www.w3.org/2001/XMLSchema-instance",
    "@xsi:nil": "true"
  },
  "etat": "Discuté",
  "signataires": {
    "auteur": {
      "typeAuteur": "Depute",
      "acteurRef": "PA605036",
      "organeRef": {
        "@xmlns:xsi": "http://www.w3.org/2001/XMLSchema-instance",
        "@xsi:nil": "true"
      },
      "groupePolitiqueRef": "PO730934"
    },
    "cosignataires": {
      "acteurRef": [
        "PA608416",
        "PA720210",
        "PA266774",
        "PA608826",
        "PA267735",
        "PA267440",
        "PA642847",
        "PA721410",
        "PA721678",
        "PA605036",
        "PA767",
        "PA643134",
        "PA720630",
        "PA709315",
        "PA721816",
        "PA718884",
        "PA1498"
      ]
    },
    "texteAffichable": "M.&#160;Abad,  Mme&#160;Valentin, Mme&#160;Bazin-Malgras, M.&#160;Cattin, M.&#160;Hetzel, M.&#160;Goasguen, M.&#160;de Ganay, Mme&#160;Beauvais, M.&#160;Viala, M.&#160;Diard, M.&#160;Reda, M.&#160;Minot, Mme&#160;Duby-Muller, M.&#160;Bazin, M.&#160;Furst, Mme&#160;Bonnivard et M.&#160;Boucard"
  },
  "pointeurFragmentTexte": {
    "missionVisee": {
      "@xmlns:xsi": "http://www.w3.org/2001/XMLSchema-instance",
      "@xsi:nil": "true"
    },
    "division": {
      "titre": "Article 3",
      "articleDesignationCourte": "APRÈS ART. 3",
      "type": "ARTICLE",
      "avant_A_Apres": "Après",
      "divisionRattachee": "APRÈS L'ARTICLE 3, insérer l'article suivant:",
      "articleAdditionnel": "1",
      "chapitreAdditionnel": {
        "@xmlns:xsi": "http://www.w3.org/2001/XMLSchema-instance",
        "@xsi:nil": "true"
      },
      "urlDivisionTexteVise": "/15/textes/0106.asp#D_Article_3"
    },
    "alinea": {
      "@xmlns:xsi": "http://www.w3.org/2001/XMLSchema-instance",
      "@xsi:nil": "true"
    }
  },
  "corps": {
    "dispositif": "<p style=\"margin: 7.5pt 0cm; text-align: justify;\">Il est interdit au Pr&#233;sident de la R&#233;publique de compter parmi les membres de son cabinet&#160;:</p><p style=\"margin: 7.5pt 0cm; text-align: justify;\">1&#176;&#160;Son conjoint, partenaire li&#233; par un pacte civil de solidarit&#233; ou concubin&#160;;</p><p style=\"line-height: normal; text-align: justify;\">2&#176; Ses parents ou les parents de son conjoint, partenaire li&#233; par un pacte civil de solidarit&#233; ou concubin&#160;;</p><p style=\"line-height: normal; text-align: justify;\">3&#176; Ses enfants ou les enfants de son conjoint, partenaire li&#233; par un pacte civil de solidarit&#233; ou concubin.</p><p style=\"margin: 7.5pt 0cm; text-align: justify;\">La violation de cette interdiction emporte l&#8217;ill&#233;galit&#233; de l&#8217;acte de nomination et, le cas &#233;ch&#233;ant, la cessation de plein droit du contrat.</p><p style=\"margin: 7.5pt 0cm; text-align: justify;\">Un d&#233;cret en Conseil d&#8217;&#201;tat d&#233;termine les modalit&#233;s selon lesquelles le Pr&#233;sident de la R&#233;publique rembourse les sommes vers&#233;es en violation de cette interdiction.</p><p style=\"margin: 7.5pt 0cm; text-align: justify;\">Aucune restitution des sommes vers&#233;es ne peut &#234;tre exig&#233;e du collaborateur.</p>",
    "exposeSommaire": "<p>Dans une logique d&#8217;&#233;quilibre des exigences, il parait n&#233;cessaire que le cabinet du Pr&#233;sident de la R&#233;publique soit soumis aux m&#234;mes r&#232;gles que ceux des Ministres, Parlementaires et&#160; &#233;lus locaux.</p>",
    "annexeExposeSommaire": {
      "@xmlns:xsi": "http://www.w3.org/2001/XMLSchema-instance",
      "@xsi:nil": "true"
    }
  },
  "representations": {
    "representation": {
      "nom": "PDF",
      "typeMime": {
        "type": "application",
        "subType": "PDF"
      },
      "statutRepresentation": {
        "verbatim": "true",
        "canonique": "true",
        "officielle": "true",
        "transcription": "false",
        "enregistrement": "false"
      },
      "repSource": {
        "@xmlns:xsi": "http://www.w3.org/2001/XMLSchema-instance",
        "@xsi:nil": "true"
      },
      "offset": {
        "@xmlns:xsi": "http://www.w3.org/2001/XMLSchema-instance",
        "@xsi:nil": "true"
      },
      "contenu": {
        "documentURI": "/15/amendements/0106/AN/128.pdf"
      },
      "dateDispoRepresentation": {
        "@xmlns:xsi": "http://www.w3.org/2001/XMLSchema-instance",
        "@xsi:nil": "true"
      }
    }
  },
  "seanceDiscussion": "RUANR5L15S2017IDS20630",
  "sort": {
    "dateSaisie": "2017-07-26T23:19:32.000+02:00",
    "sortEnSeance": "Rejeté"
  },
  "dateDepot": "2017-07-21T02:00:00.000+02:00",
  "dateDistribution": "2017-07-25T02:00:00.000+02:00",
  "article99": "0",
  "loiReference": {
    "codeLoi": {
      "@xmlns:xsi": "http://www.w3.org/2001/XMLSchema-instance",
      "@xsi:nil": "true"
    },
    "divisionCodeLoi": {
      "@xmlns:xsi": "http://www.w3.org/2001/XMLSchema-instance",
      "@xsi:nil": "true"
    }
  }
}