{
  "@xmlns": "http://schemas.assemblee-nationale.fr/referentiel",
  "uid": "AMANR5L15SEA717460BTC1548P0D1N509",
  "identifiant": {
    "legislature": "15",
    "numero": "509",
    "numRect": "0",
    "saisine": {
      "refTexteLegislatif": "PRJLANR5L15BTC1548",
      "numeroPartiePLF": "0",
      "organeExamen": "PO717460",
      "mentionSecondeDeliberation": "0"
    }
  },
  "numeroLong": "509",
  "etapeTexte": "Nouvelle Lecture",
  "triAmendement": "kpaaaaaaaaaaaaaaaaaaaaaaaaaaaaaaaaaaaaaaaaaaaaaaaaey",
  "cardinaliteAmdtMultiples": "1",
  "amendementParent": {
    "@xmlns:xsi": "http://www.w3.org/2001/XMLSchema-instance",
    "@xsi:nil": "true"
  },
  "etat": "Discuté",
  "signataires": {
    "auteur": {
      "typeAuteur": "Depute",
      "acteurRef": "PA721270",
      "organeRef": {
        "@xmlns:xsi": "http://www.w3.org/2001/XMLSchema-instance",
        "@xsi:nil": "true"
      },
      "groupePolitiqueRef": "PO730940"
    },
    "cosignataires": {
      "acteurRef": [
        "PA441",
        "PA718926",
        "PA610667",
        "PA721896",
        "PA689",
        "PA720546",
        "PA721270",
        "PA720692",
        "PA721118",
        "PA335612",
        "PA267306",
        "PA722110",
        "PA718720",
        "PA721012",
        "PA722202"
      ]
    },
    "texteAffichable": "M.&#160;Peu,  M.&#160;Jumel, Mme&#160;Faucillon, Mme&#160;Bello, M.&#160;Brotherson, M.&#160;Bruneel, Mme&#160;Buffet, M.&#160;Chassaigne, M.&#160;Dharr&#233;ville, M.&#160;Dufr&#232;gne, Mme&#160;K&#233;clard-Mond&#233;sir, M.&#160;Lecoq, M.&#160;Fabien&#160;Roussel, M.&#160;Serville et M.&#160;Wulfranc"
  },
  "pointeurFragmentTexte": {
    "missionVisee": {
      "@xmlns:xsi": "http://www.w3.org/2001/XMLSchema-instance",
      "@xsi:nil": "true"
    },
    "division": {
      "titre": "Article 52 A",
      "articleDesignationCourte": "ART. 52 A",
      "type": "ARTICLE",
      "avant_A_Apres": "A",
      "divisionRattachee": "ARTICLE 52 A",
      "articleAdditionnel": {
        "@xmlns:xsi": "http://www.w3.org/2001/XMLSchema-instance",
        "@xsi:nil": "true"
      },
      "chapitreAdditionnel": {
        "@xmlns:xsi": "http://www.w3.org/2001/XMLSchema-instance",
        "@xsi:nil": "true"
      },
      "urlDivisionTexteVise": "/15/textes/1548.asp#D_Article_52_A"
    },
    "alinea": {
      "@xmlns:xsi": "http://www.w3.org/2001/XMLSchema-instance",
      "@xsi:nil": "true"
    }
  },
  "corps": {
    "dispositif": "<p style=\"text-align: justify;\">Supprimer cet article.</p>",
    "exposeSommaire": "<p style=\"text-align: justify;\">L&#8217;ordonnance de 45, prise au lendemain de la Lib&#233;ration donne la priorit&#233; &#224; l&#8217;&#233;ducatif, sans &#233;luder le besoin de sanction et consacrant le juge des enfants.</p><p style=\"text-align: justify;\">Une ordonnance mainte fois modifi&#233;e. Des modifications qui ont parfois &#233;corn&#233; son bel esprit mais qui ne l&#8217;ont jamais mis &#224; mal. Et pour cause&#160;: cette ordonnance est tout l&#8217;esprit de l&#8217;approche de notre pays dans le traitement de l&#8217;enfance en danger et de l&#8217;enfance d&#233;linquante. Une approche dont nous sommes fiers.</p><p style=\"text-align: justify;\">Le gouvernement a introduit par amendement cet article qui vise &#224; modifier l&#8217;ordonnance de 1945 par ordonnance.</p><p style=\"text-align: justify;\">La ministre souhaite donc acc&#233;l&#233;rer les jugements des mineurs, ce qui est totalement contraire &#224; l&#8217;esprit de l&#8217;ordonnance de 45.</p><p style=\"text-align: justify;\">Elle consid&#232;re les enfants comme des adultes en miniature quand l&#8217;ordonnance de 1945 les voit comme des adultes en devenir.</p><p style=\"text-align: justify;\">C&#8217;est tout le sens de notre vision de la question de l&#8217;enfance d&#233;linquante et en danger&#160;: un temps &#233;ducatif long et individualis&#233; garanti par des acteurs et actrices en mesure d&#8217;exercer leurs missions et des dispositifs &#233;ducatifs coh&#233;rents, pluridisciplinaires et en milieu ouvert, doit &#234;tre oppos&#233; &#224; cette vision qui donne la primaut&#233; &#224; la vitesse et donc au r&#233;pressif. Le temps long est n&#233;cessaire, efficace et n&#233;anmoins s&#233;v&#232;re. Il permet &#224; l&#8217;enfant &#224; prendre conscience des ses actes, de les mesurer et de ne pas les &#233;luder.</p><p style=\"text-align: justify;\">Le temps court, l&#8217;urgence, c&#8217;est en revanche faire le choix de l&#8217;&#233;chec. Il suffit de voir outre-manche le d&#233;sastre du traitement de l&#8217;enfance d&#233;linquante. Un &#233;chec pour l&#8217;enfance et notre soci&#233;t&#233; mais un succ&#232;s pour les finances. Cela co&#251;te beaucoup moins cher de juger dans l&#8217;urgence que de prendre le temps de l&#8217;&#233;ducatif.</p><p style=\"text-align: justify;\">Le choix du r&#233;pressif est le choix des restrictions budg&#233;taires faite sur le dos de nos enfants.</p><p style=\"text-align: justify;\">Faire le choix de modifier le droit des mineurs par ordonnances est une honte pour ce gouvernement et pour notre pays.</p><p style=\"text-align: justify;\">&#201;luder le d&#233;bat parlementaire sur une question aussi essentielle&#160;&#8211;&#160;qui concerne l&#8217;avenir de notre soci&#233;t&#233; &#8211; est une insulte pour notre parlement et donc pour le peuple via ses repr&#233;sentants. Les auteurs de cet amendement refusent cette logique et demandent la suppression de cet article.</p>",
    "annexeExposeSommaire": {
      "@xmlns:xsi": "http://www.w3.org/2001/XMLSchema-instance",
      "@xsi:nil": "true"
    },
    "cartoucheDelaiDepotDepasse": {
      "@xmlns:xsi": "http://www.w3.org/2001/XMLSchema-instance",
      "@xsi:nil": "true"
    }
  },
  "representations": {
    "representation": {
      "nom": "PDF",
      "typeMime": {
        "type": "application",
        "subType": "PDF"
      },
      "statutRepresentation": {
        "verbatim": "true",
        "canonique": "true",
        "officielle": "true",
        "transcription": "false",
        "enregistrement": "false"
      },
      "repSource": {
        "@xmlns:xsi": "http://www.w3.org/2001/XMLSchema-instance",
        "@xsi:nil": "true"
      },
      "offset": {
        "@xmlns:xsi": "http://www.w3.org/2001/XMLSchema-instance",
        "@xsi:nil": "true"
      },
      "contenu": {
        "documentURI": "/15/amendements/1548/AN/509.pdf"
      },
      "dateDispoRepresentation": {
        "@xmlns:xsi": "http://www.w3.org/2001/XMLSchema-instance",
        "@xsi:nil": "true"
      }
    }
  },
  "seanceDiscussion": "RUANR5L15S2019IDS21452",
  "sort": {
    "dateSaisie": "2019-01-18T00:52:27.000+01:00",
    "sortEnSeance": "Non soutenu"
  },
  "dateDepot": "2019-01-10T01:00:00.000+01:00",
  "dateDistribution": "2019-01-14T01:00:00.000+01:00",
  "article99": "0",
  "loiReference": {
    "codeLoi": {
      "@xmlns:xsi": "http://www.w3.org/2001/XMLSchema-instance",
      "@xsi:nil": "true"
    },
    "divisionCodeLoi": {
      "@xmlns:xsi": "http://www.w3.org/2001/XMLSchema-instance",
      "@xsi:nil": "true"
    }
  }
}