{
  "@xmlns": "http://schemas.assemblee-nationale.fr/referentiel",
  "uid": "AMANR5L15PO59048B1255P1D1N1291",
  "identifiant": {
    "legislature": "15",
    "numero": "1291",
    "numRect": "0",
    "saisine": {
      "refTexteLegislatif": "PRJLANR5L15B1255",
      "numeroPartiePLF": "1",
      "organeExamen": "PO59048",
      "mentionSecondeDeliberation": "0"
    }
  },
  "numeroLong": "I-CF1291",
  "etapeTexte": "1ère lecture (1ère assemblée saisie)",
  "triAmendement": "bdaaaaaaaaaaaaaaaaaaaaaaaaaaaaaaaaaaaaaaaaaaaaaaaact",
  "cardinaliteAmdtMultiples": "1",
  "amendementParent": {
    "@xmlns:xsi": "http://www.w3.org/2001/XMLSchema-instance",
    "@xsi:nil": "true"
  },
  "etat": "Discuté",
  "signataires": {
    "auteur": {
      "typeAuteur": "Depute",
      "acteurRef": "PA720976",
      "organeRef": {
        "@xmlns:xsi": "http://www.w3.org/2001/XMLSchema-instance",
        "@xsi:nil": "true"
      },
      "groupePolitiqueRef": "PO730970"
    },
    "cosignataires": {
      "acteurRef": "PA720976"
    },
    "texteAffichable": "M.&#160;Mathiasin"
  },
  "pointeurFragmentTexte": {
    "missionVisee": {
      "@xmlns:xsi": "http://www.w3.org/2001/XMLSchema-instance",
      "@xsi:nil": "true"
    },
    "division": {
      "titre": "Article 6",
      "articleDesignationCourte": "ART. 6",
      "type": "ARTICLE",
      "avant_A_Apres": "A",
      "divisionRattachee": "ARTICLE 6",
      "articleAdditionnel": {
        "@xmlns:xsi": "http://www.w3.org/2001/XMLSchema-instance",
        "@xsi:nil": "true"
      },
      "chapitreAdditionnel": {
        "@xmlns:xsi": "http://www.w3.org/2001/XMLSchema-instance",
        "@xsi:nil": "true"
      },
      "urlDivisionTexteVise": "/15/textes/1255A.asp#D_Article_6"
    },
    "alinea": {
      "avant_A_Apres": "Apres",
      "numero": "13",
      "alineaDesignation": {
        "@xmlns:xsi": "http://www.w3.org/2001/XMLSchema-instance",
        "@xsi:nil": "true"
      }
    }
  },
  "corps": {
    "dispositif": "<p style=\"text-align: justify;\">I.&#160;&#8211;&#160;Apr&#232;s l&#8217;alin&#233;a&#160;13, ins&#233;rer l&#8217;alin&#233;a suivant&#160;:</p><p style=\"text-align: justify;\">&#171;&#160;a bis)&#160;Le 3&#176; est compl&#233;t&#233; par un h et un i ainsi r&#233;dig&#233;s&#160;:</p><p style=\"text-align: justify;\">&#171;&#160;h) L&#8217;industrie&#160;;</p><p style=\"text-align: justify;\">&#171;&#160;i) Les activit&#233;s artisanales de production, de transformation et de r&#233;paration.&#160;&#187;</p><p style=\"text-align: justify;\">II. &#8211; La perte de recettes pour l&#8217;&#201;tat est compens&#233;e &#224; due concurrence par la cr&#233;ation d&#8217;une taxe additionnelle aux droits mentionn&#233;s aux articles 575 et 575 A du code g&#233;n&#233;ral des imp&#244;ts.&#160;&#187;</p>",
    "exposeSommaire": "<p style=\"text-align: justify;\">Les activit&#233;s industrielles Outre-mer ne font aujourd&#8217;hui pas partie des secteurs d&#8217;activit&#233; b&#233;n&#233;ficiant des abattements major&#233;s de la ZFA. Or, les entreprises industrielles ultramarines sont aujourd&#8217;hui particuli&#232;rement et doublement expos&#233;es &#224; la concurrence externe des pays tiers voisins et de la m&#233;tropole.&#160;</p><p style=\"text-align: justify;\">C&#8217;est pr&#233;cis&#233;ment ce crit&#232;re d&#8217;exposition &#224; la concurrence externe qui a conduit le Gouvernement &#224; int&#233;grer dans sa r&#233;forme propos&#233;e au PLFSS 2019 visant transformation du CICE en nouvelles exon&#233;rations de charges sociales patronales les secteurs industriels dans la liste des secteurs qui b&#233;n&#233;ficieront &#224; l&#8217;avenir des exon&#233;rations de charges sociales patronales les plus &#233;lev&#233;es, ce qui n&#8217;&#233;tait pas le cas dans le r&#233;gime actuel de la LODEOM sociale.</p><p style=\"text-align: justify;\">En toute logique et par &#171;&#160;parall&#233;lisme des formes&#160;&#187;, l&#8217;amendement propose d&#8217;int&#233;grer les secteurs industriels dans la liste des secteurs b&#233;n&#233;ficiant des abattements fiscaux major&#233;s de la nouvelle ZFANG.</p><p style=\"text-align: justify;\">Le secteur de l&#8217;industrie &#233;tant compos&#233; pour 75&#160;% d&#8217;entreprises artisanales des secteurs de la production, de la transformation et de la r&#233;paration, telles que mentionn&#233;es &#224; l&#8217;article&#160;19 de la loi 96&#8209;603 du 5 juillet 1996 relative au d&#233;veloppement et &#224; la promotion du commerce et de l&#8217;artisanat, il est rajout&#233; mention de ces activit&#233;s.</p>",
    "annexeExposeSommaire": {
      "@xmlns:xsi": "http://www.w3.org/2001/XMLSchema-instance",
      "@xsi:nil": "true"
    }
  },
  "representations": {
    "representation": {
      "nom": "PDF",
      "typeMime": {
        "type": "application",
        "subType": "PDF"
      },
      "statutRepresentation": {
        "verbatim": "true",
        "canonique": "true",
        "officielle": "true",
        "transcription": "false",
        "enregistrement": "false"
      },
      "repSource": {
        "@xmlns:xsi": "http://www.w3.org/2001/XMLSchema-instance",
        "@xsi:nil": "true"
      },
      "offset": {
        "@xmlns:xsi": "http://www.w3.org/2001/XMLSchema-instance",
        "@xsi:nil": "true"
      },
      "contenu": {
        "documentURI": "/15/amendements/1255A/CION_FIN/CF1291.pdf"
      },
      "dateDispoRepresentation": {
        "@xmlns:xsi": "http://www.w3.org/2001/XMLSchema-instance",
        "@xsi:nil": "true"
      }
    }
  },
  "seanceDiscussion": {
    "@xmlns:xsi": "http://www.w3.org/2001/XMLSchema-instance",
    "@xsi:nil": "true"
  },
  "sort": {
    "dateSaisie": "2018-10-10T00:42:41.000+02:00",
    "sortEnSeance": "Rejeté"
  },
  "dateDepot": "2018-10-05T02:00:00.000+02:00",
  "dateDistribution": "2018-10-08T02:00:00.000+02:00",
  "article99": "0",
  "loiReference": {
    "codeLoi": {
      "@xmlns:xsi": "http://www.w3.org/2001/XMLSchema-instance",
      "@xsi:nil": "true"
    },
    "divisionCodeLoi": {
      "@xmlns:xsi": "http://www.w3.org/2001/XMLSchema-instance",
      "@xsi:nil": "true"
    }
  }
}