{
  "@xmlns": "http://schemas.assemblee-nationale.fr/referentiel",
  "uid": "AMANR5L15PO59051B1802P0D1N819",
  "identifiant": {
    "legislature": "15",
    "numero": "819",
    "numRect": "0",
    "saisine": {
      "refTexteLegislatif": "PRJLANR5L15B1802",
      "numeroPartiePLF": "0",
      "organeExamen": "PO59051",
      "mentionSecondeDeliberation": "0"
    }
  },
  "numeroLong": "CL819",
  "etapeTexte": "1ère lecture (1ère assemblée saisie)",
  "triAmendement": "naaaaaaaaaaaaaaaaaaaaaaaaaaaaaaaaaaaaaaaaaaaaaaaaacf",
  "cardinaliteAmdtMultiples": "1",
  "amendementParent": {
    "@xmlns:xsi": "http://www.w3.org/2001/XMLSchema-instance",
    "@xsi:nil": "true"
  },
  "etat": "Discuté",
  "signataires": {
    "auteur": {
      "typeAuteur": "Depute",
      "acteurRef": "PA610681",
      "organeRef": {
        "@xmlns:xsi": "http://www.w3.org/2001/XMLSchema-instance",
        "@xsi:nil": "true"
      },
      "groupePolitiqueRef": "PO758835"
    },
    "cosignataires": {
      "acteurRef": [
        "PA643145",
        "PA610681"
      ]
    },
    "texteAffichable": "Mme&#160;Bareigts et Mme&#160;Vainqueur-Christophe"
  },
  "pointeurFragmentTexte": {
    "missionVisee": {
      "@xmlns:xsi": "http://www.w3.org/2001/XMLSchema-instance",
      "@xsi:nil": "true"
    },
    "division": {
      "titre": "Article 33",
      "articleDesignationCourte": "APRÈS ART. 33",
      "type": "ARTICLE",
      "avant_A_Apres": "Après",
      "divisionRattachee": "APRÈS L'ARTICLE 33, insérer l'article suivant:",
      "articleAdditionnel": "1",
      "chapitreAdditionnel": {
        "@xmlns:xsi": "http://www.w3.org/2001/XMLSchema-instance",
        "@xsi:nil": "true"
      },
      "urlDivisionTexteVise": "/15/textes/1802.asp#D_Article_33"
    },
    "alinea": {
      "@xmlns:xsi": "http://www.w3.org/2001/XMLSchema-instance",
      "@xsi:nil": "true"
    }
  },
  "corps": {
    "dispositif": "<p>Apr&#232;s le premier alin&#233;a de l&#8217;article&#160;29 de la loi n&#176; 84&#8209;16 du 11 janvier 1984 portant dispositions statutaires relatives &#224; la fonction publique de l&#8217;&#201;tat, il est ins&#233;r&#233; un alin&#233;a ainsi r&#233;dig&#233;&#160;:</p><p style=\"text-align: justify;\">&#171;&#160;&#192; titre d&#8217;exp&#233;rimentation, dans les d&#233;partements d&#8217;outre-mer, l&#8217;organisation des concours pour les cat&#233;gorie B et C et l&#8217;affectation des fonctionnaires laur&#233;ats est g&#233;r&#233;e au niveau des zones g&#233;ographiques correspondantes aux plates-formes r&#233;gionales d&#8217;appui interminist&#233;riel &#224; la gestion des ressources humaines.&#160;&#187;</p>",
    "exposeSommaire": "<p style=\"text-align: justify;\">L'organisation de concours locaux interministe&#769;riels pour les administrations de&#769;concentre&#769;es de l'Etat n'ayant pas la logistique de l'organisation d'un concours localement est d&#233;j&#224; possible. Cependant, l&#8217;affectation des fonctionnaires reste nationale. Or, l&#8217;organisation locale de ces concours permettrait d&#8217;e&#769;viter des situations mat&#233;rielles douloureuses. Ainsi, des agents, dont la vie familiale est profonde&#769;ment enracine&#769;e dans leur r&#233;gion peuvent &#234;tre affect&#233;s a&#768; plusieurs milliers de kilom&#232;tres alors que des postes peuvent &#234;tre disponibles dans leur zone de r&#233;sidence.</p><p style=\"text-align: justify;\">Cette affectation r&#233;gionale existe d&#233;j&#224; pour le concours de professeur des &#233;coles de l&#8217;&#201;ducation nationale.</p><p style=\"text-align: justify;\">De plus, un recrutement local, est une chance au regard de la connaissance fine des enjeux, du contexte linguistique, culturel et socio-e&#769;conomique que ces futurs agents pourraient apporter au c&#339;ur de nos territoires. Cela serait e&#769;galement un outil efficace dans la stabilisation des agents.</p><p>&#160;</p>",
    "annexeExposeSommaire": {
      "@xmlns:xsi": "http://www.w3.org/2001/XMLSchema-instance",
      "@xsi:nil": "true"
    },
    "cartoucheDelaiDepotDepasse": {
      "@xmlns:xsi": "http://www.w3.org/2001/XMLSchema-instance",
      "@xsi:nil": "true"
    }
  },
  "representations": {
    "representation": {
      "nom": "PDF",
      "typeMime": {
        "type": "application",
        "subType": "PDF"
      },
      "statutRepresentation": {
        "verbatim": "true",
        "canonique": "true",
        "officielle": "true",
        "transcription": "false",
        "enregistrement": "false"
      },
      "repSource": {
        "@xmlns:xsi": "http://www.w3.org/2001/XMLSchema-instance",
        "@xsi:nil": "true"
      },
      "offset": {
        "@xmlns:xsi": "http://www.w3.org/2001/XMLSchema-instance",
        "@xsi:nil": "true"
      },
      "contenu": {
        "documentURI": "/15/amendements/1802/CION_LOIS/CL819.pdf"
      },
      "dateDispoRepresentation": {
        "@xmlns:xsi": "http://www.w3.org/2001/XMLSchema-instance",
        "@xsi:nil": "true"
      }
    }
  },
  "seanceDiscussion": {
    "@xmlns:xsi": "http://www.w3.org/2001/XMLSchema-instance",
    "@xsi:nil": "true"
  },
  "sort": {
    "dateSaisie": "2019-05-03T17:30:35.000+02:00",
    "sortEnSeance": "Non soutenu"
  },
  "dateDepot": "2019-04-29T02:00:00.000+02:00",
  "dateDistribution": "2019-05-01T02:00:00.000+02:00",
  "article99": "0",
  "loiReference": {
    "codeLoi": "z1984-16",
    "divisionCodeLoi": "29"
  }
}