{
  "@xmlns": "http://schemas.assemblee-nationale.fr/referentiel",
  "uid": "AMANR5L15PO420120B2416P0D1N126",
  "identifiant": {
    "legislature": "15",
    "numero": "126",
    "numRect": "0",
    "saisine": {
      "refTexteLegislatif": "PRJLANR5L15B2416",
      "numeroPartiePLF": "0",
      "organeExamen": "PO420120",
      "mentionSecondeDeliberation": "0"
    }
  },
  "numeroLong": "AS126",
  "etapeTexte": "Nouvelle Lecture",
  "triAmendement": "ddiaaaaaaaaaaaaaaaaaaaaaaaaaaaaaaaaaaaaaaaaaaaaaaaci",
  "cardinaliteAmdtMultiples": "1",
  "amendementParent": {
    "@xmlns:xsi": "http://www.w3.org/2001/XMLSchema-instance",
    "@xsi:nil": "true"
  },
  "etat": "Discuté",
  "signataires": {
    "auteur": {
      "typeAuteur": "Depute",
      "acteurRef": "PA720286",
      "organeRef": {
        "@xmlns:xsi": "http://www.w3.org/2001/XMLSchema-instance",
        "@xsi:nil": "true"
      },
      "groupePolitiqueRef": "PO730958"
    },
    "cosignataires": {
      "acteurRef": [
        "PA721226",
        "PA720286",
        "PA719676",
        "PA718860",
        "PA588884",
        "PA720892",
        "PA720422",
        "PA720430",
        "PA721062",
        "PA720846",
        "PA721202",
        "PA2150",
        "PA721960",
        "PA721210",
        "PA722142",
        "PA718868",
        "PA719578"
      ]
    },
    "texteAffichable": "Mme&#160;Fiat,  Mme&#160;Autain, M.&#160;Bernalicis, M.&#160;Coquerel, M.&#160;Corbi&#232;re, M.&#160;Lachaud, M.&#160;Larive, M.&#160;M&#233;lenchon, Mme&#160;Obono, Mme&#160;Panot, M.&#160;Prud&apos;homme, M.&#160;Quatennens, M.&#160;Ratenon, Mme&#160;Ressiguier, Mme&#160;Rubin, M.&#160;Ruffin et Mme&#160;Taurine"
  },
  "pointeurFragmentTexte": {
    "missionVisee": {
      "@xmlns:xsi": "http://www.w3.org/2001/XMLSchema-instance",
      "@xsi:nil": "true"
    },
    "division": {
      "titre": "Article 25",
      "articleDesignationCourte": "ART. 25",
      "type": "ARTICLE",
      "avant_A_Apres": "A",
      "divisionRattachee": "ARTICLE 25",
      "articleAdditionnel": {
        "@xmlns:xsi": "http://www.w3.org/2001/XMLSchema-instance",
        "@xsi:nil": "true"
      },
      "chapitreAdditionnel": {
        "@xmlns:xsi": "http://www.w3.org/2001/XMLSchema-instance",
        "@xsi:nil": "true"
      },
      "urlDivisionTexteVise": "/15/textes/2416.asp#D_Article_25"
    },
    "alinea": {
      "avant_A_Apres": {
        "@xmlns:xsi": "http://www.w3.org/2001/XMLSchema-instance",
        "@xsi:nil": "true"
      },
      "numero": "34",
      "alineaDesignation": {
        "@xmlns:xsi": "http://www.w3.org/2001/XMLSchema-instance",
        "@xsi:nil": "true"
      }
    }
  },
  "corps": {
    "dispositif": "<p style=\"text-align: justify;\">I.&#160;&#8211;&#160;Supprimer l&#8217;alin&#233;a&#160;34.</p><p style=\"text-align: justify;\">II.&#160;&#8211;&#160;Substituer &#224; l&#8217;alin&#233;a&#160;36 les cinq alin&#233;as suivants&#160;:</p><p style=\"text-align: justify;\">&#171;&#160;4&#176;&#160;<i>bis</i> L&#8217;article L.&#160;162&#8209;22&#8209;1 est abrog&#233;&#160;;</p><p style=\"text-align: justify;\">&#171;&#160;5&#176;&#160;L&#8217;article L.&#160;162&#8209;22&#8209;2 du code de la s&#233;curit&#233; sociale est ainsi modifi&#233;&#160;:</p><p style=\"text-align: justify;\">&#171;&#160;<i>a)</i> Le I est abrog&#233;&#160;;</p><p style=\"text-align: justify;\">&#171;&#160;<i>b)</i> La deuxi&#232;me phrase du II est supprim&#233;e&#160;;&#160;&#187;.</p><p style=\"text-align: justify;\">&#171;&#160;5&#176;&#160;<i>bis</i> Les article L.&#160;162&#8209;22&#8209;2-1 &#224; L.&#160;162&#8209;22&#8209;5 sont abrog&#233;s&#160;;&#160;&#187;.</p><p style=\"text-align: justify;\">II.&#160;&#8211;&#160;Compl&#233;ter cet article par l&#8217;alin&#233;a suivant&#160;:</p><p style=\"text-align: justify;\">&#171;&#160;VI.&#160;&#8211;&#160;La perte de recettes pour les organismes de s&#233;curit&#233; sociale est compens&#233;e &#224; due concurrence par la majoration des droits mentionn&#233;s aux articles 575 et 575 A du code g&#233;n&#233;ral des imp&#244;ts.&#160;&#187;.</p>",
    "exposeSommaire": "<p style=\"text-align: justify;\">La tarification &#224; l&#8217;activit&#233; qui consiste &#224; r&#233;mun&#233;rer les h&#244;pitaux en fonction du nombre d&#8217;actes r&#233;alis&#233;s a montr&#233; ses limites concernant la prise en charge des patients &#224; l&#8217;h&#244;pital. Cette tarification est d&#233;fendable concernant des activit&#233;s techniques et standardis&#233;es qui demandent toujours les m&#234;mes gestes, le m&#234;me temps, etc&#8230; Mais tr&#232;s souvent &#224; l&#8217;h&#244;pital, les activit&#233;s ne sont justement pas standardisables. C&#8217;est particuli&#232;rement le cas en psychiatrie pour laquelle la T2A est totalement inadapt&#233;. Ce dont ont besoin les soignants, c&#8217;est avant tout de temps. Les soins psychiatriques ne sont pas des activit&#233;s standardis&#233;es. Chaque patient est unique et sa gu&#233;rison n&#233;cessite des relations humaines au long court. Par cet amendement, nous refusons que les soins psychiatriques fassent l&#8217;objet d&#8217;une tarification &#224; l&#8217;activit&#233;.</p>",
    "annexeExposeSommaire": {
      "@xmlns:xsi": "http://www.w3.org/2001/XMLSchema-instance",
      "@xsi:nil": "true"
    },
    "cartoucheDelaiDepotDepasse": {
      "@xmlns:xsi": "http://www.w3.org/2001/XMLSchema-instance",
      "@xsi:nil": "true"
    },
    "avantAppel": {
      "@xmlns:xsi": "http://www.w3.org/2001/XMLSchema-instance",
      "@xsi:nil": "true"
    }
  },
  "representations": {
    "representation": {
      "nom": "PDF",
      "typeMime": {
        "type": "application",
        "subType": "PDF"
      },
      "statutRepresentation": {
        "verbatim": "true",
        "canonique": "true",
        "officielle": "true",
        "transcription": "false",
        "enregistrement": "false"
      },
      "repSource": {
        "@xmlns:xsi": "http://www.w3.org/2001/XMLSchema-instance",
        "@xsi:nil": "true"
      },
      "offset": {
        "@xmlns:xsi": "http://www.w3.org/2001/XMLSchema-instance",
        "@xsi:nil": "true"
      },
      "contenu": {
        "documentURI": "/15/amendements/2416/CION-SOC/AS126.pdf"
      },
      "dateDispoRepresentation": {
        "@xmlns:xsi": "http://www.w3.org/2001/XMLSchema-instance",
        "@xsi:nil": "true"
      }
    }
  },
  "seanceDiscussion": {
    "@xmlns:xsi": "http://www.w3.org/2001/XMLSchema-instance",
    "@xsi:nil": "true"
  },
  "sort": {
    "dateSaisie": "2019-11-20T22:44:18.000+01:00",
    "sortEnSeance": "Rejeté"
  },
  "dateDepot": "2019-11-20T01:00:00.000+01:00",
  "dateDistribution": "2019-11-20T01:00:00.000+01:00",
  "article99": "0",
  "loiReference": {
    "codeLoi": {
      "@xmlns:xsi": "http://www.w3.org/2001/XMLSchema-instance",
      "@xsi:nil": "true"
    },
    "divisionCodeLoi": {
      "@xmlns:xsi": "http://www.w3.org/2001/XMLSchema-instance",
      "@xsi:nil": "true"
    }
  }
}