{
  "@xmlns": "http://schemas.assemblee-nationale.fr/referentiel",
  "uid": "AMANR5L15PO757134B1673P0D1N765",
  "identifiant": {
    "legislature": "15",
    "numero": "765",
    "numRect": "0",
    "saisine": {
      "refTexteLegislatif": "PRJLANR5L15B1673",
      "numeroPartiePLF": "0",
      "organeExamen": "PO757134",
      "mentionSecondeDeliberation": "0"
    }
  },
  "numeroLong": "765",
  "etapeTexte": "Nouvelle Lecture",
  "triAmendement": "pcaaaaaaaaaaaaaaaaaaaaaaaaaaaaaaaaaaaaaaaaaaaaaaaayi",
  "cardinaliteAmdtMultiples": "1",
  "amendementParent": {
    "@xmlns:xsi": "http://www.w3.org/2001/XMLSchema-instance",
    "@xsi:nil": "true"
  },
  "etat": "Discuté",
  "signataires": {
    "auteur": {
      "typeAuteur": "Depute",
      "acteurRef": "PA718962",
      "organeRef": {
        "@xmlns:xsi": "http://www.w3.org/2001/XMLSchema-instance",
        "@xsi:nil": "true"
      },
      "groupePolitiqueRef": "PO730964"
    },
    "cosignataires": {
      "acteurRef": "PA718962"
    },
    "texteAffichable": "M.&#160;Zulesi"
  },
  "pointeurFragmentTexte": {
    "missionVisee": {
      "@xmlns:xsi": "http://www.w3.org/2001/XMLSchema-instance",
      "@xsi:nil": "true"
    },
    "division": {
      "titre": "Article 63 bis A",
      "articleDesignationCourte": "ART. 63 BIS A",
      "type": "ARTICLE",
      "avant_A_Apres": "A",
      "divisionRattachee": "ARTICLE 63 BIS A",
      "articleAdditionnel": {
        "@xmlns:xsi": "http://www.w3.org/2001/XMLSchema-instance",
        "@xsi:nil": "true"
      },
      "chapitreAdditionnel": {
        "@xmlns:xsi": "http://www.w3.org/2001/XMLSchema-instance",
        "@xsi:nil": "true"
      },
      "urlDivisionTexteVise": "/15/textes/1673.asp#D_Article_63_bis_A"
    },
    "alinea": {
      "avant_A_Apres": {
        "@xmlns:xsi": "http://www.w3.org/2001/XMLSchema-instance",
        "@xsi:nil": "true"
      },
      "numero": "7",
      "alineaDesignation": {
        "@xmlns:xsi": "http://www.w3.org/2001/XMLSchema-instance",
        "@xsi:nil": "true"
      }
    }
  },
  "corps": {
    "dispositif": "<p style=\"text-align: justify;\">Apr&#232;s le mot&#160;:</p><p style=\"text-align: justify;\">&#171;&#160;des&#160;&#187;,</p><p style=\"text-align: justify;\">r&#233;diger ainsi la fin de l&#8217;alin&#233;a&#160;7&#160;:</p><p style=\"text-align: justify;\">&#171;&#160;factures par le biais d&#8217;un espace personnel s&#233;curis&#233; sur internet, il porte &#224; la connaissance du client l&#8217;existence et la disponibilit&#233; de ces factures sur cet espace.&#160;&#187;</p>",
    "exposeSommaire": "<p style=\"text-align: justify;\">L&#8217;article&#160;63 A <i>bis</i> porte sur la seule d&#233;mat&#233;rialisation des factures et non sur l&#8217;ensemble des documents et informations communiqu&#233;s par le fournisseur d&#8217;&#233;nergie au client dans le cadre de leurs relations contractuelles.</p><p style=\"text-align: justify;\">L&#8217;alin&#233;a&#160;7 propos&#233; par le S&#233;nat impose au fournisseur d&#8217;informer son client de l&#8217;existence et de la disponibilit&#233; des factures mais aussi &#171;&#160;des informations ou autres documents&#160;&#187; sur son espace personnel s&#233;curis&#233;.</p><p style=\"text-align: justify;\">Cette obligation est inop&#233;rante et constitue un alourdissement des proc&#233;dures aussi bien pour le fournisseur que pour le client. En effet au cours d&#8217;une journ&#233;e, le fournisseur est susceptible d&#8217;&#234;tre amen&#233; &#224; transmettre un certain nombre d&#8217;informations &#224; son client via l&#8217;espace personnel s&#233;curis&#233; de ce dernier (donn&#233;es de consommation en temps r&#233;el avec un pas de temps de trente minutes, comparaison de ces donn&#233;es avec des p&#233;riodes pr&#233;c&#233;dentes, etc.).</p><p style=\"text-align: justify;\">Aussi, dans le cas o&#249; le fournisseur serait contraint d&#8217;informer par courriel son client de tout ajout dans l&#8217;espace personnel de ce dernier, cela pourrait repr&#233;senter l&#8217;envoi de plusieurs courriels par jour. Cela aurait pour cons&#233;quence de saturer la bo&#238;te de r&#233;ception du client tout en repr&#233;sentant une charge suppl&#233;mentaire cons&#233;quente pour le fournisseur.</p><p style=\"text-align: justify;\">Cet amendement propose donc de circonscrire la disposition pr&#233;vue &#224; l&#8217;alin&#233;a&#160;7 aux seules factures.</p>",
    "annexeExposeSommaire": {
      "@xmlns:xsi": "http://www.w3.org/2001/XMLSchema-instance",
      "@xsi:nil": "true"
    },
    "cartoucheDelaiDepotDepasse": {
      "@xmlns:xsi": "http://www.w3.org/2001/XMLSchema-instance",
      "@xsi:nil": "true"
    }
  },
  "representations": {
    "representation": {
      "nom": "PDF",
      "typeMime": {
        "type": "application",
        "subType": "PDF"
      },
      "statutRepresentation": {
        "verbatim": "true",
        "canonique": "true",
        "officielle": "true",
        "transcription": "false",
        "enregistrement": "false"
      },
      "repSource": {
        "@xmlns:xsi": "http://www.w3.org/2001/XMLSchema-instance",
        "@xsi:nil": "true"
      },
      "offset": {
        "@xmlns:xsi": "http://www.w3.org/2001/XMLSchema-instance",
        "@xsi:nil": "true"
      },
      "contenu": {
        "documentURI": "/15/amendements/1673/CSPACTE/765.pdf"
      },
      "dateDispoRepresentation": {
        "@xmlns:xsi": "http://www.w3.org/2001/XMLSchema-instance",
        "@xsi:nil": "true"
      }
    }
  },
  "seanceDiscussion": {
    "@xmlns:xsi": "http://www.w3.org/2001/XMLSchema-instance",
    "@xsi:nil": "true"
  },
  "sort": {
    "dateSaisie": "2019-03-07T16:55:24.000+01:00",
    "sortEnSeance": "Adopté"
  },
  "dateDepot": "2019-03-01T01:00:00.000+01:00",
  "dateDistribution": "2019-03-06T01:00:00.000+01:00",
  "article99": "0",
  "loiReference": {
    "codeLoi": {
      "@xmlns:xsi": "http://www.w3.org/2001/XMLSchema-instance",
      "@xsi:nil": "true"
    },
    "divisionCodeLoi": {
      "@xmlns:xsi": "http://www.w3.org/2001/XMLSchema-instance",
      "@xsi:nil": "true"
    }
  }
}