{
  "@xmlns": "http://schemas.assemblee-nationale.fr/referentiel",
  "uid": "AMANR5L15SEA717460BTC0902P0D1N2445",
  "identifiant": {
    "legislature": "15",
    "numero": "2445",
    "numRect": "1",
    "saisine": {
      "refTexteLegislatif": "PRJLANR5L15BTC0902",
      "numeroPartiePLF": "0",
      "organeExamen": "PO717460",
      "mentionSecondeDeliberation": "0"
    }
  },
  "numeroLong": "2445 (Rect)",
  "etapeTexte": "1ère lecture (1ère assemblée saisie)",
  "triAmendement": "gs",
  "cardinaliteAmdtMultiples": "1",
  "amendementParent": {
    "@xmlns:xsi": "http://www.w3.org/2001/XMLSchema-instance",
    "@xsi:nil": "true"
  },
  "etat": "Discuté",
  "signataires": {
    "auteur": {
      "typeAuteur": "Depute",
      "acteurRef": "PA333285",
      "organeRef": {
        "@xmlns:xsi": "http://www.w3.org/2001/XMLSchema-instance",
        "@xsi:nil": "true"
      },
      "groupePolitiqueRef": "PO730946"
    },
    "cosignataires": {
      "acteurRef": [
        "PA508",
        "PA1809",
        "PA405480",
        "PA608172",
        "PA1198",
        "PA1592",
        "PA429893",
        "PA609332",
        "PA335054",
        "PA335532",
        "PA337483",
        "PA609590",
        "PA332614",
        "PA342415",
        "PA333818",
        "PA605069",
        "PA643145",
        "PA267233",
        "PA610681",
        "PA608695",
        "PA642764",
        "PA719930",
        "PA333285",
        "PA608011",
        "PA588886",
        "PA607553",
        "PA1008",
        "PA340343",
        "PA340357",
        "PA720988"
      ]
    },
    "texteAffichable": "M.&#160;Garot,  M.&#160;Potier, Mme&#160;Rabault, M.&#160;Letchimy, Mme&#160;Manin, Mme&#160;Vainqueur-Christophe, M.&#160;Aviragnet, Mme&#160;Bareigts, Mme&#160;Battistel, Mme&#160;Bi&#233;mouret, M.&#160;Bouillon, M.&#160;Jean-Louis&#160;Bricout, M.&#160;Carvounas, M.&#160;Alain&#160;David, Mme&#160;Laurence&#160;Dumont, M.&#160;Faure, M.&#160;David&#160;Habib, M.&#160;Hutin, M.&#160;Juanico, Mme&#160;Karamanli, M.&#160;J&#233;r&#244;me&#160;Lambert, M.&#160;Le Foll, Mme&#160;Pau-Langevin, Mme&#160;Pires Beaune, M.&#160;Pueyo, M.&#160;Pupponi, M.&#160;Saulignac, Mme&#160;Untermaier, M.&#160;Vallaud et Mme&#160;Victory"
  },
  "pointeurFragmentTexte": {
    "missionVisee": {
      "@xmlns:xsi": "http://www.w3.org/2001/XMLSchema-instance",
      "@xsi:nil": "true"
    },
    "division": {
      "titre": "Article 11 duodecies",
      "articleDesignationCourte": "APRÈS ART. 11 DUODECIES",
      "type": "ARTICLE",
      "avant_A_Apres": "Après",
      "divisionRattachee": "APRÈS L'ARTICLE 11 DUODECIES, insérer l'article suivant:",
      "articleAdditionnel": "1",
      "chapitreAdditionnel": {
        "@xmlns:xsi": "http://www.w3.org/2001/XMLSchema-instance",
        "@xsi:nil": "true"
      },
      "urlDivisionTexteVise": "/15/textes/0902.asp#D_Article_11_duodecies"
    },
    "alinea": {
      "@xmlns:xsi": "http://www.w3.org/2001/XMLSchema-instance",
      "@xsi:nil": "true"
    }
  },
  "corps": {
    "dispositif": "<p style=\"text-align: justify;\">Au 1<sup>er&#160;</sup>janvier&#160;2021, les signes d&#8217;identification de la qualit&#233; et de l&#8217;origine, les labels et mentions valorisantes int&#232;grent dans leurs cahiers des charges le respect de l&#8217;environnement.</p>",
    "exposeSommaire": "<p style=\"text-align: justify;\">Il s&#8217;agit de traduire dans la loi une demande issue des ateliers des EGAlim (atelier 11). Le ministre a pu pr&#233;c&#233;demment expliquer que l&#8217;ambition environnementale est inscrite dans le COP de l&#8217;INAO. Il est n&#233;cessaire de rappeler qu&#8217;un COP avan&#231;ant une ambition n&#8217;a d&#8217;une part pas la force d&#8217;une loi et, d&#8217;autre part que le pr&#233;sent COP ne donne pas d&#8217;objectif pr&#233;cis en mati&#232;re environnementale. D&#8217;ailleurs, cette trop relative discr&#233;tion de l&#8217;objectif environnemental dans la politique de l&#8217;INAO ressort du rapport d&#8217;&#233;valuation remis au ministre en septembre 2017 sur l&#8217;application du COP 2014&#8209;2017 (Rapport CGAAER n&#176;16085). Dans leur conclusion, les rapporteurs exposent ainsi&#160;: &#171;&#160;L&#8217;INAO est un bel outil qui a su engager une mutation strat&#233;gique dans des conditions difficiles. Les responsables professionnels, le directeur, les agents de l&#8217;INAO ont eu &#224; c&#339;ur de relever les d&#233;fis pour un institut auquel ils sont profond&#233;ment attach&#233;s.</p><p style=\"text-align: justify;\">Pour autant, le chemin de l&#8217;excellence est encore long avec des d&#233;fis nombreux auxquels il faudra r&#233;pondre collectivement et solidairement. La promesse faite au consommateur doit &#234;tre r&#233;affirm&#233;e et tenue en termes de diff&#233;renciation et de qualit&#233;s y compris environnementale.&#160;&#187;</p><p style=\"text-align: justify;\">Il est essentiel de porter cette ambition des SIQO par la loi pour r&#233;pondre &#224; l&#8217;attente croissante des consommateurs. Il est ainsi demand&#233; aux SIQO d&#8217;int&#233;grer progressivement dans leur cahier des charges des ambitions environnementales, et satisfaisant autant que possible les crit&#232;res HVE.</p>",
    "annexeExposeSommaire": {
      "@xmlns:xsi": "http://www.w3.org/2001/XMLSchema-instance",
      "@xsi:nil": "true"
    }
  },
  "representations": {
    "representation": {
      "nom": "PDF",
      "typeMime": {
        "type": "application",
        "subType": "PDF"
      },
      "statutRepresentation": {
        "verbatim": "true",
        "canonique": "true",
        "officielle": "true",
        "transcription": "false",
        "enregistrement": "false"
      },
      "repSource": {
        "@xmlns:xsi": "http://www.w3.org/2001/XMLSchema-instance",
        "@xsi:nil": "true"
      },
      "offset": {
        "@xmlns:xsi": "http://www.w3.org/2001/XMLSchema-instance",
        "@xsi:nil": "true"
      },
      "contenu": {
        "documentURI": "/15/amendements/0902/AN/2445.pdf"
      },
      "dateDispoRepresentation": {
        "@xmlns:xsi": "http://www.w3.org/2001/XMLSchema-instance",
        "@xsi:nil": "true"
      }
    }
  },
  "seanceDiscussion": "RUANR5L15S2018IDS21109",
  "sort": {
    "dateSaisie": "2018-05-27T00:59:20.000+02:00",
    "sortEnSeance": "Retiré"
  },
  "dateDepot": "2018-05-17T02:00:00.000+02:00",
  "dateDistribution": "2018-05-22T02:00:00.000+02:00",
  "article99": "0",
  "loiReference": {
    "codeLoi": {
      "@xmlns:xsi": "http://www.w3.org/2001/XMLSchema-instance",
      "@xsi:nil": "true"
    },
    "divisionCodeLoi": {
      "@xmlns:xsi": "http://www.w3.org/2001/XMLSchema-instance",
      "@xsi:nil": "true"
    }
  }
}