{
  "@xmlns": "http://schemas.assemblee-nationale.fr/referentiel",
  "uid": "AMANR5L15SEA717460B1297P0D1N990",
  "identifiant": {
    "legislature": "15",
    "numero": "990",
    "numRect": "0",
    "saisine": {
      "refTexteLegislatif": "PRJLANR5L15B1297",
      "numeroPartiePLF": "0",
      "organeExamen": "PO717460",
      "mentionSecondeDeliberation": "0"
    }
  },
  "numeroLong": "990",
  "etapeTexte": "1ère lecture (1ère assemblée saisie)",
  "triAmendement": "obiaaaaaaaaaaaaaaaaaaaaaaaaaaaaaaaaaaaaaaaaaaaaaaav",
  "cardinaliteAmdtMultiples": "1",
  "amendementParent": {
    "@xmlns:xsi": "http://www.w3.org/2001/XMLSchema-instance",
    "@xsi:nil": "true"
  },
  "etat": "Irrecevable",
  "signataires": {
    "auteur": {
      "typeAuteur": "Depute",
      "acteurRef": "PA267780",
      "organeRef": {
        "@xmlns:xsi": "http://www.w3.org/2001/XMLSchema-instance",
        "@xsi:nil": "true"
      },
      "groupePolitiqueRef": "PO744425"
    },
    "cosignataires": {
      "acteurRef": [
        "PA267241",
        "PA720696",
        "PA702052",
        "PA720230",
        "PA695100",
        "PA721094",
        "PA1960",
        "PA332228",
        "PA642935",
        "PA331567",
        "PA267330",
        "PA610775",
        "PA712014",
        "PA722030",
        "PA267780",
        "PA642868",
        "PA721194",
        "PA421348",
        "PA266788",
        "PA721110",
        "PA719806",
        "PA721486",
        "PA2952",
        "PA267585",
        "PA267355",
        "PA267766",
        "PA335758",
        "PA268019"
      ]
    },
    "texteAffichable": "Mme&#160;Firmin Le Bodo,  Mme&#160;Auconie, M.&#160;Becht, M.&#160;Benoit, M.&#160;Bournazel, M.&#160;Guy&#160;Bricout, M.&#160;Christophe, Mme&#160;de La Raudi&#232;re, M.&#160;Demilly, Mme&#160;Descamps, Mme&#160;Fr&#233;d&#233;rique&#160;Dumas, M.&#160;Dunoyer, M.&#160;Gom&#232;s, M.&#160;Meyer&#160;Habib, M.&#160;Herth, M.&#160;Lagarde, M.&#160;Ledoux, M.&#160;Leroy, Mme&#160;Magnier, M.&#160;Morel-&#192;-L&apos;Huissier, M.&#160;Naegelen, M.&#160;Riester, Mme&#160;Sage, Mme&#160;Sanquer, M.&#160;Vercamer, M.&#160;Villiers, M.&#160;Warsmann et M.&#160;Zumkeller"
  },
  "pointeurFragmentTexte": {
    "missionVisee": {
      "@xmlns:xsi": "http://www.w3.org/2001/XMLSchema-instance",
      "@xsi:nil": "true"
    },
    "division": {
      "titre": "Article 53",
      "articleDesignationCourte": "APRÈS ART. 53",
      "type": "ARTICLE",
      "avant_A_Apres": "Après",
      "divisionRattachee": "APRÈS L'ARTICLE 53, insérer l'article suivant:",
      "articleAdditionnel": "1",
      "chapitreAdditionnel": {
        "@xmlns:xsi": "http://www.w3.org/2001/XMLSchema-instance",
        "@xsi:nil": "true"
      },
      "urlDivisionTexteVise": "/15/textes/1297.asp#D_Article_53"
    },
    "alinea": {
      "@xmlns:xsi": "http://www.w3.org/2001/XMLSchema-instance",
      "@xsi:nil": "true"
    }
  },
  "corps": {
    "dispositif": "<p style=\"text-align: justify;\">Des fonds d&#8217;investissement financ&#233;s par le versement d&#8217;une partie des &#233;conomies g&#233;n&#233;r&#233;es par les &#233;tablissements publics de sant&#233; sont cr&#233;&#233;s.</p>",
    "exposeSommaire": "<p style=\"text-align: justify;\">Les &#233;tablissements publics de sant&#233; sont confront&#233;s depuis plusieurs ann&#233;es &#224; une baisse tr&#232;s cons&#233;quente de leurs d&#233;penses d&#8217;investissement. En 2011 elles se montaient &#224; 6 Mds&#8364;. Depuis 2012, elles ne cessent de diminuer et sont m&#234;mes pass&#233;es en 2017 sous le seuil de 4 Mds&#8364;. La dette des h&#244;pitaux publics s&#8217;est certes stabilis&#233;e autour de 30 Mds&#8364; mais au prix d&#8217;une diminution drastique de leurs investissements, ce qui pose la question de leur avenir, de la maintenance, de l&#8217;entretien et de la r&#233;novation de leurs locaux, du renouvellement des &#233;quipements m&#233;dicaux et h&#244;teliers et du financement de l&#8217;innovation technologique. Cette diminution continue de l&#8217;investissement risque de plus de g&#233;n&#233;rer un retard qu&#8217;il sera difficile de combler par la suite. La baisse des investissements pose &#233;galement des difficult&#233;s en termes d&#8217;attractivit&#233; m&#233;dicale, d&#233;j&#224; mise &#224; mal par les diff&#233;rences de r&#233;mun&#233;ration et de conditions d&#8217;exercice entre le secteur lib&#233;ral et le secteur public.</p><p style=\"text-align: justify;\">Le secteur hospitalier est de plus soumis &#224; d&#8217;importants efforts d&#8217;&#233;conomies, chaque ann&#233;e &#233;tant marqu&#233;e par des plans d&#8217;&#233;conomies aux montants tr&#232;s cons&#233;quents. Ainsi, les &#233;conomies demand&#233;es aux &#233;tablissements de sant&#233; entre 2005 et 2017 se montent &#224; 7 Mds&#8364;, se traduisant par des ponctions sur le sous-objectif de l&#8217;ONDAM. Ce sous-objectif de l&#8217;ONDAM est d&#8217;ailleurs respect&#233; depuis 2011, la sous-ex&#233;cution de l&#8217;enveloppe hospitali&#232;re &#233;tant utilis&#233;e pour combler le d&#233;passement de l&#8217;enveloppe de ville depuis 2015.</p><p style=\"text-align: justify;\">D&#8217;o&#249; un sentiment de profonde injustice au sein de la communaut&#233; hospitali&#232;re dont les r&#233;els efforts pour respecter l&#8217;enveloppe vot&#233;e par le parlement, au prix de r&#233;organisations, de restructurations et de changements de pratiques, servent &#224; financer les d&#233;passements des autres secteurs. Ces m&#233;canismes de ponction des &#233;conomies g&#233;n&#233;r&#233;es par les uns pour combler les d&#233;passements des autres g&#233;n&#232;rent une v&#233;ritable perte de sens dans les &#233;tablissements.</p><p style=\"text-align: justify;\">Il est donc propos&#233; d&#8217;utiliser une partie significative des &#233;conomies g&#233;n&#233;r&#233;es par les &#233;tablissements publics de sant&#233; afin d&#8217;abonder des fonds r&#233;gionaux d&#8217;investissement permettant de financer des projets d&#8217;investissement cibl&#233;s comme prioritaires au sein des territoires.</p><p style=\"text-align: justify;\">Le pr&#233;sent amendement vise &#224; garantir le financement de l&#8217;investissement au niveau des territoires.</p>",
    "annexeExposeSommaire": {
      "@xmlns:xsi": "http://www.w3.org/2001/XMLSchema-instance",
      "@xsi:nil": "true"
    }
  },
  "representations": {
    "representation": {
      "nom": "PDF",
      "typeMime": {
        "type": "application",
        "subType": "PDF"
      },
      "statutRepresentation": {
        "verbatim": "true",
        "canonique": "true",
        "officielle": "true",
        "transcription": "false",
        "enregistrement": "false"
      },
      "repSource": {
        "@xmlns:xsi": "http://www.w3.org/2001/XMLSchema-instance",
        "@xsi:nil": "true"
      },
      "offset": {
        "@xmlns:xsi": "http://www.w3.org/2001/XMLSchema-instance",
        "@xsi:nil": "true"
      },
      "contenu": {
        "documentURI": "/15/amendements/1297/AN/990.pdf"
      },
      "dateDispoRepresentation": {
        "@xmlns:xsi": "http://www.w3.org/2001/XMLSchema-instance",
        "@xsi:nil": "true"
      }
    }
  },
  "seanceDiscussion": {
    "@xmlns:xsi": "http://www.w3.org/2001/XMLSchema-instance",
    "@xsi:nil": "true"
  },
  "sort": {
    "@xmlns:xsi": "http://www.w3.org/2001/XMLSchema-instance",
    "@xsi:nil": "true"
  },
  "dateDepot": "2018-10-19T02:00:00.000+02:00",
  "dateDistribution": {
    "@xmlns:xsi": "http://www.w3.org/2001/XMLSchema-instance",
    "@xsi:nil": "true"
  },
  "article99": "0",
  "loiReference": {
    "codeLoi": {
      "@xmlns:xsi": "http://www.w3.org/2001/XMLSchema-instance",
      "@xsi:nil": "true"
    },
    "divisionCodeLoi": {
      "@xmlns:xsi": "http://www.w3.org/2001/XMLSchema-instance",
      "@xsi:nil": "true"
    }
  }
}