{
  "@xmlns": "http://schemas.assemblee-nationale.fr/referentiel",
  "uid": "AMANR5L15SEA717460BTC1600P0D1N166",
  "identifiant": {
    "legislature": "15",
    "numero": "166",
    "numRect": "0",
    "saisine": {
      "refTexteLegislatif": "PIONANR5L15BTC1600",
      "numeroPartiePLF": "0",
      "organeExamen": "PO717460",
      "mentionSecondeDeliberation": "0"
    }
  },
  "numeroLong": "166",
  "etapeTexte": "1ère lecture (2ème assemblée saisie)",
  "triAmendement": "biaaaaaaaaaaaaaaaaaaaaaaaaaaaaaaaaaaaaaaaaaaaaaaaajdbi",
  "cardinaliteAmdtMultiples": "1",
  "amendementParent": {
    "@xmlns:xsi": "http://www.w3.org/2001/XMLSchema-instance",
    "@xsi:nil": "true"
  },
  "etat": "Discuté",
  "signataires": {
    "auteur": {
      "typeAuteur": "Depute",
      "acteurRef": "PA722382",
      "organeRef": {
        "@xmlns:xsi": "http://www.w3.org/2001/XMLSchema-instance",
        "@xsi:nil": "true"
      },
      "groupePolitiqueRef": "PO730964"
    },
    "cosignataires": {
      "acteurRef": [
        "PA722398",
        "PA722382"
      ]
    },
    "texteAffichable": "M.&#160;Dirx et M.&#160;Rebeyrotte"
  },
  "pointeurFragmentTexte": {
    "missionVisee": {
      "@xmlns:xsi": "http://www.w3.org/2001/XMLSchema-instance",
      "@xsi:nil": "true"
    },
    "division": {
      "titre": "Article 2",
      "articleDesignationCourte": "ART. 2",
      "type": "ARTICLE",
      "avant_A_Apres": "A",
      "divisionRattachee": "ARTICLE 2",
      "articleAdditionnel": {
        "@xmlns:xsi": "http://www.w3.org/2001/XMLSchema-instance",
        "@xsi:nil": "true"
      },
      "chapitreAdditionnel": {
        "@xmlns:xsi": "http://www.w3.org/2001/XMLSchema-instance",
        "@xsi:nil": "true"
      },
      "urlDivisionTexteVise": "/15/textes/1600.asp#D_Article_2"
    },
    "alinea": {
      "avant_A_Apres": {
        "@xmlns:xsi": "http://www.w3.org/2001/XMLSchema-instance",
        "@xsi:nil": "true"
      },
      "numero": "2",
      "alineaDesignation": {
        "@xmlns:xsi": "http://www.w3.org/2001/XMLSchema-instance",
        "@xsi:nil": "true"
      }
    }
  },
  "corps": {
    "dispositif": "<p>I.&#160;&#8211;&#160;&#192; l&#8217;alin&#233;a&#160;2, substituer aux mots&#160;:</p><p style=\"text-align: justify;\">&#171;&#160;manifestation d&#233;clar&#233;e&#160;&#187;</p><p style=\"text-align: justify;\">les mots&#160;:</p><p style=\"text-align: justify;\">&#171;&#160;ou plusieurs manifestations d&#233;clar&#233;es&#160;&#187;.</p><p style=\"text-align: justify;\">II.&#160;&#8211;&#160;En cons&#233;quence, &#224; la premi&#232;re phrase de l&#8217;alin&#233;a&#160;3, substituer aux mots&#160;:</p><p style=\"text-align: justify;\">&#171;&#160;de la manifestation&#160;&#187;</p><p style=\"text-align: justify;\">les mots&#160;:</p><p style=\"text-align: justify;\">&#171;&#160;des manifestations&#160;&#187;.</p><p style=\"text-align: justify;\">III.&#160;&#8211;&#160;En cons&#233;quence, &#224; la premi&#232;re phrase de l&#8217;alin&#233;a&#160;4, substituer aux mots&#160;:&#160;</p><p style=\"text-align: justify;\">&#171;&#160;la manifestation concern&#233;e&#160;&#187;</p><p style=\"text-align: justify;\">les mots&#160;:</p><p style=\"text-align: justify;\">&#171;&#160;les manifestations concern&#233;es&#160;&#187;.</p><p style=\"text-align: justify;\">IV.&#160;&#8211;&#160;En cons&#233;quence, &#224; la m&#234;me phrase, substituer aux mots&#160;:</p><p style=\"text-align: justify;\">&#171;&#160;de la manifestation&#160;&#187;</p><p style=\"text-align: justify;\">les mots&#160;:</p><p style=\"text-align: justify;\">&#171;&#160;des manifestations&#160;&#187;.</p><p style=\"text-align: justify;\">V.&#160;&#8211;&#160;En cons&#233;quence, &#224; la fin de la seconde phrase du m&#234;me alin&#233;a, substituer aux mots&#160;:</p><p style=\"text-align: justify;\">&#171;&#160;de la manifestation concern&#233;e&#160;&#187;</p><p style=\"text-align: justify;\">les mots&#160;:</p><p style=\"text-align: justify;\">&#171;&#160;des manifestations concern&#233;es&#160;&#187;.</p>",
    "exposeSommaire": "<p>L&#8217;article&#160;2 de la proposition de loi cr&#233;&#233; un article L 211&#8209;4&#8209;1 du code de la s&#233;curit&#233; int&#233;rieure permettant au repr&#233;sentant de l&#8217;&#201;tat dans le d&#233;partement ou, &#224; Paris, au Pr&#233;fet de police, d&#8217;interdire &#224; une personne de prendre part &#224; une manifestation.</p><p style=\"text-align: justify;\"><br />Pour priver un individu de ce droit, l&#8217;autorit&#233; prenant la d&#233;cision doit cumulativement justifier que&#160;:</p><p style=\"text-align: justify;\"><br />il existe &#224; l&#8217;&#233;gard de la personne interdite de ladite manifestation &#8220;des raisons s&#233;rieuses de penser que son comportement constitue une menace d&#8217;une particuli&#232;re gravit&#233; pour l&#8217;ordre public&#8221;,<br />la personne s&#8217;est soit rendue coupable, &#224; l&#8217;occasion d&#8217;une ou plusieurs manifestations sur la voie publique, d&#8217;une infraction vis&#233;e aux articles&#160;222&#8209;7 &#224; 222&#8209;13, 222&#8209;14&#8209;2, 322&#8209;1 &#224; 322&#8209;3, 322&#8209;6 &#224; 322&#8209;10 et 431&#8209;9 &#224; 431&#8209;10 du code p&#233;nal, soit elle appartient &#224; un groupe ou entre en relation de mani&#232;re r&#233;guli&#232;re avec des individus incitant, facilitant ou participant &#224; la commission de ces m&#234;mes infractions.</p><p style=\"text-align: justify;\">Face &#224; un individu qui rempli les crit&#232;res pr&#233;vus par ce nouveau texte, la r&#233;daction de l&#8217;article&#160;2 de la pr&#233;sente proposition loi ne permet pas, dans un m&#234;me arr&#234;t&#233;, au repr&#233;sentant de l&#8217;&#201;tat dans le d&#233;partement ou, &#224; Paris, le Pr&#233;fet de police, d&#8217;interdire &#224; cette personne de participer &#224; plusieurs manifestation.</p><p style=\"text-align: justify;\"><br />Le pr&#233;sent amendement a pour objet de rem&#233;dier &#224; ce trop strict encadrement.</p><p style=\"text-align: justify;\"><br />En effet, il ne para&#238;t ni pertinent, ni op&#233;rationnel, pour le repr&#233;sentant de l&#8217;&#201;tat dans le d&#233;partement ou, &#224; Paris, le Pr&#233;fet de police, qui, eu &#233;gard aux crit&#232;res ci-dessus mentionn&#233;s, juge n&#233;cessaire d&#8217;interdire &#224; une personne de prendre part &#224; diff&#233;rentes manifestations se d&#233;roulant le m&#234;me jour dans une m&#234;me ville, de devoir prendre autant d&#8217;arr&#234;t&#233;s que de manifestations existantes.</p>",
    "annexeExposeSommaire": {
      "@xmlns:xsi": "http://www.w3.org/2001/XMLSchema-instance",
      "@xsi:nil": "true"
    },
    "cartoucheDelaiDepotDepasse": {
      "@xmlns:xsi": "http://www.w3.org/2001/XMLSchema-instance",
      "@xsi:nil": "true"
    }
  },
  "representations": {
    "representation": {
      "nom": "PDF",
      "typeMime": {
        "type": "application",
        "subType": "PDF"
      },
      "statutRepresentation": {
        "verbatim": "true",
        "canonique": "true",
        "officielle": "true",
        "transcription": "false",
        "enregistrement": "false"
      },
      "repSource": {
        "@xmlns:xsi": "http://www.w3.org/2001/XMLSchema-instance",
        "@xsi:nil": "true"
      },
      "offset": {
        "@xmlns:xsi": "http://www.w3.org/2001/XMLSchema-instance",
        "@xsi:nil": "true"
      },
      "contenu": {
        "documentURI": "/15/amendements/1600/AN/166.pdf"
      },
      "dateDispoRepresentation": {
        "@xmlns:xsi": "http://www.w3.org/2001/XMLSchema-instance",
        "@xsi:nil": "true"
      }
    }
  },
  "seanceDiscussion": "RUANR5L15S2019IDS21469",
  "sort": {
    "dateSaisie": "2019-01-30T20:30:01.000+01:00",
    "sortEnSeance": "Tombé"
  },
  "dateDepot": "2019-01-25T01:00:00.000+01:00",
  "dateDistribution": "2019-01-28T01:00:00.000+01:00",
  "article99": "0",
  "loiReference": {
    "codeLoi": {
      "@xmlns:xsi": "http://www.w3.org/2001/XMLSchema-instance",
      "@xsi:nil": "true"
    },
    "divisionCodeLoi": {
      "@xmlns:xsi": "http://www.w3.org/2001/XMLSchema-instance",
      "@xsi:nil": "true"
    }
  }
}