{
  "@xmlns": "http://schemas.assemblee-nationale.fr/referentiel",
  "uid": "AMANR5L15PO419865B1839P0D1N42",
  "identifiant": {
    "legislature": "15",
    "numero": "42",
    "numRect": "0",
    "saisine": {
      "refTexteLegislatif": "PIONANR5L15B1839",
      "numeroPartiePLF": "0",
      "organeExamen": "PO419865",
      "mentionSecondeDeliberation": "0"
    }
  },
  "numeroLong": "CD42",
  "etapeTexte": "Nouvelle Lecture",
  "triAmendement": "bcaaaaaaaaaaaaaaaaaaaaaaaaaaaaaaaaaaaaaaaaaaaaaaaakdgp",
  "cardinaliteAmdtMultiples": "1",
  "amendementParent": {
    "@xmlns:xsi": "http://www.w3.org/2001/XMLSchema-instance",
    "@xsi:nil": "true"
  },
  "etat": "Discuté",
  "signataires": {
    "auteur": {
      "typeAuteur": "Depute",
      "acteurRef": "PA330909",
      "organeRef": {
        "@xmlns:xsi": "http://www.w3.org/2001/XMLSchema-instance",
        "@xsi:nil": "true"
      },
      "groupePolitiqueRef": "PO730934"
    },
    "cosignataires": {
      "acteurRef": [
        "PA267901",
        "PA267735",
        "PA266793",
        "PA267527",
        "PA606712",
        "PA719318",
        "PA718884",
        "PA709315",
        "PA334654",
        "PA267429",
        "PA266808",
        "PA267450",
        "PA330909",
        "PA718838",
        "PA720630",
        "PA718850",
        "PA608016",
        "PA334843",
        "PA340853",
        "PA1874",
        "PA643134"
      ]
    },
    "texteAffichable": "M.&#160;Descoeur,  M.&#160;Leclerc, M.&#160;Bony, M.&#160;Cordier, M.&#160;Cinieri, M.&#160;de Ganay, M.&#160;Saddier, Mme&#160;Anthoine, Mme&#160;Bazin-Malgras, M.&#160;Kamardine, M.&#160;Straumann, M.&#160;Viala, Mme&#160;Valentin, M.&#160;Le Fur, M.&#160;Brun, M.&#160;Minot, M.&#160;Lurton, M.&#160;Verch&#232;re, M.&#160;Rolland, M.&#160;R&#233;mi&#160;Delatte et Mme&#160;Louwagie"
  },
  "pointeurFragmentTexte": {
    "missionVisee": {
      "@xmlns:xsi": "http://www.w3.org/2001/XMLSchema-instance",
      "@xsi:nil": "true"
    },
    "division": {
      "titre": "Article 3",
      "articleDesignationCourte": "ART. 3",
      "type": "ARTICLE",
      "avant_A_Apres": "A",
      "divisionRattachee": "ARTICLE 3",
      "articleAdditionnel": {
        "@xmlns:xsi": "http://www.w3.org/2001/XMLSchema-instance",
        "@xsi:nil": "true"
      },
      "chapitreAdditionnel": {
        "@xmlns:xsi": "http://www.w3.org/2001/XMLSchema-instance",
        "@xsi:nil": "true"
      },
      "urlDivisionTexteVise": "/15/textes/1839.asp#D_Article_3"
    },
    "alinea": {
      "avant_A_Apres": "Apres",
      "numero": "5",
      "alineaDesignation": {
        "@xmlns:xsi": "http://www.w3.org/2001/XMLSchema-instance",
        "@xsi:nil": "true"
      }
    }
  },
  "corps": {
    "dispositif": "<p style=\"text-align: justify;\">Apr&#232;s l&#8217;alin&#233;a&#160;5, ins&#233;rer l&#8217;alin&#233;a suivant&#160;:</p><p style=\"text-align: justify;\">&#171;&#160;Les repr&#233;sentants des collectivit&#233;s territoriales et de leurs groupements peuvent opposer un v&#233;to &#224; une d&#233;lib&#233;ration si les trois-quarts d&#8217;entre eux sont en d&#233;saccord avec une d&#233;cision du conseil d&#8217;administration.&#160;&#187;</p>",
    "exposeSommaire": "<p style=\"text-align: justify;\">Cet amendement est un amendement de repli au cas o&#249; la repr&#233;sentation paritaire des &#233;lus et de l'Etat au sein du conseil d'administration de l'agence telle qu'elle a &#233;t&#233; adopt&#233;e au s&#233;nat ne soit pas r&#233;introduite.</p><p>Il permet d'apporter des garanties pour les &#233;lus locaux en leur octroyant un droit de v&#233;to si les trois-quarts d'entre eux sont en d&#233;saccord avec une d&#233;cision du conseil d'administration.</p><p>Cet amendement propose ainsi de revenir sur la repr&#233;sentation d&#233;s&#233;quilibr&#233;e de l'Etat au sein de l'Agence en proposant un r&#233;&#233;quilibrage au profit des collectivit&#233;s territoriales.&#160;</p>",
    "annexeExposeSommaire": {
      "@xmlns:xsi": "http://www.w3.org/2001/XMLSchema-instance",
      "@xsi:nil": "true"
    },
    "cartoucheDelaiDepotDepasse": {
      "@xmlns:xsi": "http://www.w3.org/2001/XMLSchema-instance",
      "@xsi:nil": "true"
    }
  },
  "representations": {
    "representation": {
      "nom": "PDF",
      "typeMime": {
        "type": "application",
        "subType": "PDF"
      },
      "statutRepresentation": {
        "verbatim": "true",
        "canonique": "true",
        "officielle": "true",
        "transcription": "false",
        "enregistrement": "false"
      },
      "repSource": {
        "@xmlns:xsi": "http://www.w3.org/2001/XMLSchema-instance",
        "@xsi:nil": "true"
      },
      "offset": {
        "@xmlns:xsi": "http://www.w3.org/2001/XMLSchema-instance",
        "@xsi:nil": "true"
      },
      "contenu": {
        "documentURI": "/15/amendements/1839/CION-DVP/CD42.pdf"
      },
      "dateDispoRepresentation": {
        "@xmlns:xsi": "http://www.w3.org/2001/XMLSchema-instance",
        "@xsi:nil": "true"
      }
    }
  },
  "seanceDiscussion": {
    "@xmlns:xsi": "http://www.w3.org/2001/XMLSchema-instance",
    "@xsi:nil": "true"
  },
  "sort": {
    "dateSaisie": "2019-05-07T17:42:28.000+02:00",
    "sortEnSeance": "Rejeté"
  },
  "dateDepot": "2019-04-19T02:00:00.000+02:00",
  "dateDistribution": "2019-05-07T02:00:00.000+02:00",
  "article99": "0",
  "loiReference": {
    "codeLoi": "1",
    "divisionCodeLoi": {
      "@xmlns:xsi": "http://www.w3.org/2001/XMLSchema-instance",
      "@xsi:nil": "true"
    }
  }
}