{
  "@xmlns": "http://schemas.assemblee-nationale.fr/referentiel",
  "uid": "AMANR5L15PO419610B0846P0D1N1282",
  "identifiant": {
    "legislature": "15",
    "numero": "1282",
    "numRect": "0",
    "saisine": {
      "refTexteLegislatif": "PRJLANR5L15B0846",
      "numeroPartiePLF": "0",
      "organeExamen": "PO419610",
      "mentionSecondeDeliberation": "0"
    }
  },
  "numeroLong": "CE1282",
  "etapeTexte": "1ère lecture (1ère assemblée saisie)",
  "triAmendement": "aaky",
  "cardinaliteAmdtMultiples": "1",
  "amendementParent": {
    "@xmlns:xsi": "http://www.w3.org/2001/XMLSchema-instance",
    "@xsi:nil": "true"
  },
  "etat": "Discuté",
  "signataires": {
    "auteur": {
      "typeAuteur": "Depute",
      "acteurRef": "PA642847",
      "organeRef": {
        "@xmlns:xsi": "http://www.w3.org/2001/XMLSchema-instance",
        "@xsi:nil": "true"
      },
      "groupePolitiqueRef": "PO730934"
    },
    "cosignataires": {
      "acteurRef": "PA642847"
    },
    "texteAffichable": "M.&#160;Bazin"
  },
  "pointeurFragmentTexte": {
    "missionVisee": {
      "@xmlns:xsi": "http://www.w3.org/2001/XMLSchema-instance",
      "@xsi:nil": "true"
    },
    "division": {
      "titre": "Article 59",
      "articleDesignationCourte": "APRÈS ART. 59",
      "type": "ARTICLE",
      "avant_A_Apres": "Après",
      "divisionRattachee": "APRÈS L'ARTICLE 59, insérer l'article suivant:",
      "articleAdditionnel": "1",
      "chapitreAdditionnel": {
        "@xmlns:xsi": "http://www.w3.org/2001/XMLSchema-instance",
        "@xsi:nil": "true"
      },
      "urlDivisionTexteVise": "/15/textes/0846.asp#D_Article_59"
    },
    "alinea": {
      "@xmlns:xsi": "http://www.w3.org/2001/XMLSchema-instance",
      "@xsi:nil": "true"
    }
  },
  "corps": {
    "dispositif": "<p style=\"text-align: justify;\">L&#8217;article&#160;11 de la loi n&#176; 65&#8209;557 du 10 juillet 1965 fixant le statut de la copropri&#233;t&#233; des immeubles b&#226;tis est compl&#233;t&#233; par un alin&#233;a ainsi r&#233;dig&#233;&#160;:</p><p style=\"text-align: justify;\">&#171;&#160;Un appel de fonds type d&#233;fini par d&#233;cret en Conseil d&#8217;&#201;tat d&#233;finit la pr&#233;sentation et les informations qui doivent y figurer.&#160;&#187;</p>",
    "exposeSommaire": "<p>La plupart des copropri&#233;taires ont du mal &#224; lire les appels de fonds &#233;tablis et envoy&#233;s par leur syndic. Cette difficult&#233; est encore plus grande lorsqu&#8217;il s&#8217;agit de comprendre la r&#233;gularisation des charges de l&#8217;exercice.</p><p>Cette situation s&#8217;explique du fait que les appels de fonds ne sont pas normalis&#233;s permettant &#224; chaque cabinet de syndic de les pr&#233;senter sous la forme et avec les informations qu&#8217;il souhaite indiquer.</p><p>Ainsi, bien souvent, les copropri&#233;taires ne comprennent pas les sommes appel&#233;es et n&#8217;arrivent pas &#224; identifier les quotes-parts d&#8217;avance ou de fonds travaux r&#233;gl&#233;s &#224; la copropri&#233;t&#233;.</p><p>Pour permettre une plus grande transparence, il est donc essentiel d&#8217;imposer un mod&#232;le d&#8217;appel de fonds type. Ce qui, au-del&#224; de permettre aux copropri&#233;taires de comprendre les montants de charges qui leur sont r&#233;clam&#233;es, leur permettra d&#8217;obtenir les informations &#224; remettre avant la promesse de vente au potentiel acqu&#233;reur du lot.</p><p><br /> &#160;</p>",
    "annexeExposeSommaire": {
      "@xmlns:xsi": "http://www.w3.org/2001/XMLSchema-instance",
      "@xsi:nil": "true"
    }
  },
  "representations": {
    "representation": {
      "nom": "PDF",
      "typeMime": {
        "type": "application",
        "subType": "PDF"
      },
      "statutRepresentation": {
        "verbatim": "true",
        "canonique": "true",
        "officielle": "true",
        "transcription": "false",
        "enregistrement": "false"
      },
      "repSource": {
        "@xmlns:xsi": "http://www.w3.org/2001/XMLSchema-instance",
        "@xsi:nil": "true"
      },
      "offset": {
        "@xmlns:xsi": "http://www.w3.org/2001/XMLSchema-instance",
        "@xsi:nil": "true"
      },
      "contenu": {
        "documentURI": "/15/amendements/0846/CION-ECO/CE1282.pdf"
      },
      "dateDispoRepresentation": {
        "@xmlns:xsi": "http://www.w3.org/2001/XMLSchema-instance",
        "@xsi:nil": "true"
      }
    }
  },
  "seanceDiscussion": {
    "@xmlns:xsi": "http://www.w3.org/2001/XMLSchema-instance",
    "@xsi:nil": "true"
  },
  "sort": {
    "dateSaisie": "2018-05-19T00:12:52.000+02:00",
    "sortEnSeance": "Rejeté"
  },
  "dateDepot": "2018-05-09T02:00:00.000+02:00",
  "dateDistribution": "2018-05-15T02:00:00.000+02:00",
  "article99": "0",
  "loiReference": {
    "codeLoi": "x65-557",
    "divisionCodeLoi": "11"
  }
}