{
  "@xmlns": "http://schemas.assemblee-nationale.fr/referentiel",
  "uid": "AMANR5L15PO59051B1331P0D1N5",
  "identifiant": {
    "legislature": "15",
    "numero": "5",
    "numRect": "0",
    "saisine": {
      "refTexteLegislatif": "PIONANR5L15B1331",
      "numeroPartiePLF": "0",
      "organeExamen": "PO59051",
      "mentionSecondeDeliberation": "0"
    }
  },
  "numeroLong": "CL5",
  "etapeTexte": "1ère lecture (1ère assemblée saisie)",
  "triAmendement": "caaaaaaaaaaaaaaaaaaaaaaaaaaaaaaaaaaaaaaaaaaaaaaaaad",
  "cardinaliteAmdtMultiples": "1",
  "amendementParent": {
    "@xmlns:xsi": "http://www.w3.org/2001/XMLSchema-instance",
    "@xsi:nil": "true"
  },
  "etat": "Discuté",
  "signataires": {
    "auteur": {
      "typeAuteur": "Depute",
      "acteurRef": "PA721932",
      "organeRef": {
        "@xmlns:xsi": "http://www.w3.org/2001/XMLSchema-instance",
        "@xsi:nil": "true"
      },
      "groupePolitiqueRef": "PO723569"
    },
    "cosignataires": {
      "acteurRef": "PA721932"
    },
    "texteAffichable": "Mme&#160;Lorho"
  },
  "pointeurFragmentTexte": {
    "missionVisee": {
      "@xmlns:xsi": "http://www.w3.org/2001/XMLSchema-instance",
      "@xsi:nil": "true"
    },
    "division": {
      "titre": "Article PREMIER",
      "articleDesignationCourte": "ART. PREMIER",
      "type": "ARTICLE",
      "avant_A_Apres": "A",
      "divisionRattachee": "ARTICLE PREMIER",
      "articleAdditionnel": {
        "@xmlns:xsi": "http://www.w3.org/2001/XMLSchema-instance",
        "@xsi:nil": "true"
      },
      "chapitreAdditionnel": {
        "@xmlns:xsi": "http://www.w3.org/2001/XMLSchema-instance",
        "@xsi:nil": "true"
      },
      "urlDivisionTexteVise": "/15/textes/1331.asp#D_Article_1er"
    },
    "alinea": {
      "avant_A_Apres": {
        "@xmlns:xsi": "http://www.w3.org/2001/XMLSchema-instance",
        "@xsi:nil": "true"
      },
      "numero": "2",
      "alineaDesignation": {
        "@xmlns:xsi": "http://www.w3.org/2001/XMLSchema-instance",
        "@xsi:nil": "true"
      }
    }
  },
  "corps": {
    "dispositif": "<p>Apr&#232;s le mot&#160;:</p><p>&#171;&#160;parentale&#160;&#187;,</p><p>r&#233;diger ainsi la fin de la seconde phrase de l&#8217;alin&#233;a&#160;2&#160;:</p><p>&#171;&#160;sont tenus de ne pas commettre de violences ill&#233;gitimes &#224; l&#8217;&#233;gard de leur enfant, dans le respect des articles&#160;222&#8209;10 et&#160;R.&#160;624&#8209;1 du code p&#233;nal.&#160;&#187;</p>",
    "exposeSommaire": "<p style=\"text-align: justify;\">En l&#8217;&#233;tat, la formulation actuelle disconvient en ce qu&#8217;elle m&#233;conna&#238;t la jurisprudence du 10 mars 1981 &#8211; tribunal de police de Bordeaux - qui a d&#233;fini les crit&#232;res d&#8217;acceptabilit&#233; d&#8217;une punition comme la fess&#233;e. Elle m&#233;conna&#238;t &#233;galement l&#8217;article R624-1 du code p&#233;nal, qui sanctionne les ch&#226;timents corporels et le violences l&#233;g&#232;res. L&#8217;article 220-10 du code p&#233;nal assure d&#233;j&#224; la fonction de protection des mineurs et des personnes dont la particuli&#232;re vuln&#233;rabilit&#233; est due &#224; son &#226;ge est apparente et connue de son auteur. Il est donc suffisant de proposer un rappel de la loi et de sanctionner les violences qui seraient quant &#224; elles ill&#233;gitimes.</p>",
    "annexeExposeSommaire": {
      "@xmlns:xsi": "http://www.w3.org/2001/XMLSchema-instance",
      "@xsi:nil": "true"
    },
    "cartoucheDelaiDepotDepasse": {
      "@xmlns:xsi": "http://www.w3.org/2001/XMLSchema-instance",
      "@xsi:nil": "true"
    }
  },
  "representations": {
    "representation": {
      "nom": "PDF",
      "typeMime": {
        "type": "application",
        "subType": "PDF"
      },
      "statutRepresentation": {
        "verbatim": "true",
        "canonique": "true",
        "officielle": "true",
        "transcription": "false",
        "enregistrement": "false"
      },
      "repSource": {
        "@xmlns:xsi": "http://www.w3.org/2001/XMLSchema-instance",
        "@xsi:nil": "true"
      },
      "offset": {
        "@xmlns:xsi": "http://www.w3.org/2001/XMLSchema-instance",
        "@xsi:nil": "true"
      },
      "contenu": {
        "documentURI": "/15/amendements/1331/CION_LOIS/CL5.pdf"
      },
      "dateDispoRepresentation": {
        "@xmlns:xsi": "http://www.w3.org/2001/XMLSchema-instance",
        "@xsi:nil": "true"
      }
    }
  },
  "seanceDiscussion": {
    "@xmlns:xsi": "http://www.w3.org/2001/XMLSchema-instance",
    "@xsi:nil": "true"
  },
  "sort": {
    "dateSaisie": "2018-11-21T11:16:06.000+01:00",
    "sortEnSeance": "Tombé"
  },
  "dateDepot": "2018-11-12T01:00:00.000+01:00",
  "dateDistribution": "2018-11-19T01:00:00.000+01:00",
  "article99": "0",
  "loiReference": {
    "codeLoi": "3",
    "divisionCodeLoi": {
      "@xmlns:xsi": "http://www.w3.org/2001/XMLSchema-instance",
      "@xsi:nil": "true"
    }
  }
}