{
  "@xmlns": "http://schemas.assemblee-nationale.fr/referentiel",
  "uid": "AMANR5L15SEA717460BTC0971P0D1N546",
  "identifiant": {
    "legislature": "15",
    "numero": "546",
    "numRect": "0",
    "saisine": {
      "refTexteLegislatif": "PRJLANR5L15BTC0971",
      "numeroPartiePLF": "0",
      "organeExamen": "PO717460",
      "mentionSecondeDeliberation": "0"
    }
  },
  "numeroLong": "546",
  "etapeTexte": "1ère lecture (1ère assemblée saisie)",
  "triAmendement": "bbbw",
  "cardinaliteAmdtMultiples": "1",
  "amendementParent": {
    "@xmlns:xsi": "http://www.w3.org/2001/XMLSchema-instance",
    "@xsi:nil": "true"
  },
  "etat": "Discuté",
  "signataires": {
    "auteur": {
      "typeAuteur": "Depute",
      "acteurRef": "PA712015",
      "organeRef": {
        "@xmlns:xsi": "http://www.w3.org/2001/XMLSchema-instance",
        "@xsi:nil": "true"
      },
      "groupePolitiqueRef": "PO730934"
    },
    "cosignataires": {
      "acteurRef": [
        "PA266793",
        "PA721046",
        "PA721286",
        "PA334149",
        "PA1327",
        "PA718838",
        "PA605036",
        "PA718784",
        "PA643103",
        "PA998",
        "PA719272",
        "PA346054",
        "PA608016",
        "PA267378",
        "PA709315",
        "PA608416",
        "PA2377",
        "PA267450",
        "PA336316",
        "PA720210",
        "PA267200",
        "PA721968",
        "PA718780",
        "PA712015",
        "PA346218",
        "PA609245",
        "PA267429",
        "PA719318",
        "PA266808",
        "PA1874",
        "PA266776"
      ]
    },
    "texteAffichable": "M.&#160;Dive,  M.&#160;Viala, M.&#160;Rolland, Mme&#160;Bassire, M.&#160;Vialay, M.&#160;R&#233;mi&#160;Delatte, M.&#160;Perrut, M.&#160;Hetzel, M.&#160;Reiss, Mme&#160;Meunier, Mme&#160;Louwagie, M.&#160;Forissier, Mme&#160;Beauvais, M.&#160;Fasquelle, M.&#160;Emmanuel&#160;Maquet, Mme&#160;Levy, M.&#160;Brun, M.&#160;Bony, M.&#160;Ramadier, M.&#160;Le Fur, Mme&#160;Anthoine, M.&#160;Bouchet, M.&#160;Pauget, M.&#160;Masson, M.&#160;Abad, M.&#160;Huyghe, M.&#160;Dassault, M.&#160;Cinieri, M.&#160;Ferrara, Mme&#160;Lacroute et Mme&#160;Trastour-Isnart"
  },
  "pointeurFragmentTexte": {
    "missionVisee": {
      "@xmlns:xsi": "http://www.w3.org/2001/XMLSchema-instance",
      "@xsi:nil": "true"
    },
    "division": {
      "titre": "Article 54",
      "articleDesignationCourte": "ART. 54",
      "type": "ARTICLE",
      "avant_A_Apres": "A",
      "divisionRattachee": "ARTICLE 54",
      "articleAdditionnel": {
        "@xmlns:xsi": "http://www.w3.org/2001/XMLSchema-instance",
        "@xsi:nil": "true"
      },
      "chapitreAdditionnel": {
        "@xmlns:xsi": "http://www.w3.org/2001/XMLSchema-instance",
        "@xsi:nil": "true"
      },
      "urlDivisionTexteVise": "/15/textes/0971.asp#D_Article_54"
    },
    "alinea": {
      "avant_A_Apres": "A",
      "numero": "4",
      "alineaDesignation": "Alinéa 4"
    }
  },
  "corps": {
    "dispositif": "<p style=\"text-align: justify;\">&#192; l&#8217;alin&#233;a&#160;4, apr&#232;s le mot&#160;:</p><p style=\"text-align: justify;\">&#171;&#160;attractivit&#233;,&#160;&#187;,</p><p style=\"text-align: justify;\">ins&#233;rer les mots&#160;:</p><p style=\"text-align: justify;\">&#171;&#160;red&#233;ployer l&#8217;offre de services publics,&#160;&#187;.</p>",
    "exposeSommaire": "<p style=\"text-align: justify;\">Les services publics font partie des attentes et besoins exprim&#233;s par les populations habitant dans les territoires &#224; revitaliser. Cet amendement pr&#233;cise que le projet global de territoire a aussi vocation &#224; red&#233;ployer ces services publics, que ce soient les &#233;coles, les transports, l&#8217;offre de soins ou l&#8217;acc&#232;s &#224; la Justice, toutes ces activit&#233;s qui participent de la vie de nos territoires.</p>",
    "annexeExposeSommaire": {
      "@xmlns:xsi": "http://www.w3.org/2001/XMLSchema-instance",
      "@xsi:nil": "true"
    }
  },
  "representations": {
    "representation": {
      "nom": "PDF",
      "typeMime": {
        "type": "application",
        "subType": "PDF"
      },
      "statutRepresentation": {
        "verbatim": "true",
        "canonique": "true",
        "officielle": "true",
        "transcription": "false",
        "enregistrement": "false"
      },
      "repSource": {
        "@xmlns:xsi": "http://www.w3.org/2001/XMLSchema-instance",
        "@xsi:nil": "true"
      },
      "offset": {
        "@xmlns:xsi": "http://www.w3.org/2001/XMLSchema-instance",
        "@xsi:nil": "true"
      },
      "contenu": {
        "documentURI": "/15/amendements/0971/AN/546.pdf"
      },
      "dateDispoRepresentation": {
        "@xmlns:xsi": "http://www.w3.org/2001/XMLSchema-instance",
        "@xsi:nil": "true"
      }
    }
  },
  "seanceDiscussion": "RUANR5L15S2018IDS21138",
  "sort": {
    "dateSaisie": "2018-06-08T15:58:43.000+02:00",
    "sortEnSeance": "Rejeté"
  },
  "dateDepot": "2018-05-24T02:00:00.000+02:00",
  "dateDistribution": "2018-06-01T02:00:00.000+02:00",
  "article99": "0",
  "loiReference": {
    "codeLoi": {
      "@xmlns:xsi": "http://www.w3.org/2001/XMLSchema-instance",
      "@xsi:nil": "true"
    },
    "divisionCodeLoi": {
      "@xmlns:xsi": "http://www.w3.org/2001/XMLSchema-instance",
      "@xsi:nil": "true"
    }
  }
}