{
  "@xmlns": "http://schemas.assemblee-nationale.fr/referentiel",
  "uid": "AMANR5L15PO420120B0391P0D1N42",
  "identifiant": {
    "legislature": "15",
    "numero": "42",
    "numRect": "0",
    "saisine": {
      "refTexteLegislatif": "PRJLANR5L15B0391",
      "numeroPartiePLF": "0",
      "organeExamen": "PO420120",
      "mentionSecondeDeliberation": "0"
    }
  },
  "numeroLong": "AS42",
  "etapeTexte": "1ère lecture (1ère assemblée saisie)",
  "triAmendement": "s",
  "cardinaliteAmdtMultiples": "1",
  "amendementParent": {
    "@xmlns:xsi": "http://www.w3.org/2001/XMLSchema-instance",
    "@xsi:nil": "true"
  },
  "etat": "Discuté",
  "signataires": {
    "auteur": {
      "typeAuteur": "Depute",
      "acteurRef": "PA719756",
      "organeRef": {
        "@xmlns:xsi": "http://www.w3.org/2001/XMLSchema-instance",
        "@xsi:nil": "true"
      },
      "groupePolitiqueRef": "PO730964"
    },
    "cosignataires": {
      "acteurRef": "PA719756"
    },
    "texteAffichable": "Mme&#160;Cloarec, rapporteure"
  },
  "pointeurFragmentTexte": {
    "missionVisee": {
      "@xmlns:xsi": "http://www.w3.org/2001/XMLSchema-instance",
      "@xsi:nil": "true"
    },
    "division": {
      "titre": "Article 3",
      "articleDesignationCourte": "ART. 3",
      "type": "ARTICLE",
      "avant_A_Apres": "A",
      "divisionRattachee": "ARTICLE 3",
      "articleAdditionnel": {
        "@xmlns:xsi": "http://www.w3.org/2001/XMLSchema-instance",
        "@xsi:nil": "true"
      },
      "chapitreAdditionnel": {
        "@xmlns:xsi": "http://www.w3.org/2001/XMLSchema-instance",
        "@xsi:nil": "true"
      },
      "urlDivisionTexteVise": "/15/textes/0391.asp#D_Article_3"
    },
    "alinea": {
      "avant_A_Apres": "Apres",
      "numero": "34",
      "alineaDesignation": {
        "@xmlns:xsi": "http://www.w3.org/2001/XMLSchema-instance",
        "@xsi:nil": "true"
      }
    }
  },
  "corps": {
    "dispositif": "<p style=\"text-align: justify;\">Compl&#233;ter cet article par l&#8217;alin&#233;a suivant&#160;:</p><p style=\"text-align: justify;\">&#171;&#160;Le Gouvernement remet au Parlement, au 1<sup>er&#160;</sup>septembre&#160;2020, un rapport pr&#233;sentant le bilan du nouveau dispositif du r&#233;gime obligatoire de s&#233;curit&#233; sociale pour les &#233;tudiants et notamment l&#8217;&#233;valuation de la qualit&#233; de l&#8217;accueil et du service.&#160;&#187;</p>",
    "exposeSommaire": "<p style=\"text-align: justify;\">Cette &#233;volution va concerner un nombre cons&#233;quent d&#8217;&#233;tudiants, autour de 1,8 million et n&#233;cessitera un transfert de dossiers des mutuelles &#233;tudiantes vers les r&#233;gimes obligatoires d&#8217;assurance maladie. Par ailleurs, la CNAMTS devra g&#233;rer &#224; la m&#234;me p&#233;riode, le transferts des assur&#233;s du RSI.</p><p style=\"text-align: justify;\">C&#8217;est pourquoi, il semble important &#224; la Rapporteure de pouvoir v&#233;rifier la bonne application de cette r&#233;forme.</p>",
    "annexeExposeSommaire": {
      "@xmlns:xsi": "http://www.w3.org/2001/XMLSchema-instance",
      "@xsi:nil": "true"
    }
  },
  "representations": {
    "representation": {
      "nom": "PDF",
      "typeMime": {
        "type": "application",
        "subType": "PDF"
      },
      "statutRepresentation": {
        "verbatim": "true",
        "canonique": "true",
        "officielle": "true",
        "transcription": "false",
        "enregistrement": "false"
      },
      "repSource": {
        "@xmlns:xsi": "http://www.w3.org/2001/XMLSchema-instance",
        "@xsi:nil": "true"
      },
      "offset": {
        "@xmlns:xsi": "http://www.w3.org/2001/XMLSchema-instance",
        "@xsi:nil": "true"
      },
      "contenu": {
        "documentURI": "/15/amendements/0391/CION-SOC/AS42.pdf"
      },
      "dateDispoRepresentation": {
        "@xmlns:xsi": "http://www.w3.org/2001/XMLSchema-instance",
        "@xsi:nil": "true"
      }
    }
  },
  "seanceDiscussion": {
    "@xmlns:xsi": "http://www.w3.org/2001/XMLSchema-instance",
    "@xsi:nil": "true"
  },
  "sort": {
    "dateSaisie": "2017-12-05T09:43:31.000+01:00",
    "sortEnSeance": "Adopté"
  },
  "dateDepot": "2017-12-04T01:00:00.000+01:00",
  "dateDistribution": "2017-12-04T01:00:00.000+01:00",
  "article99": "0",
  "loiReference": {
    "codeLoi": {
      "@xmlns:xsi": "http://www.w3.org/2001/XMLSchema-instance",
      "@xsi:nil": "true"
    },
    "divisionCodeLoi": {
      "@xmlns:xsi": "http://www.w3.org/2001/XMLSchema-instance",
      "@xsi:nil": "true"
    }
  }
}