{
  "@xmlns": "http://schemas.assemblee-nationale.fr/referentiel",
  "uid": "AMANR5L15SEA717460BTC1548P0D1N689",
  "identifiant": {
    "legislature": "15",
    "numero": "689",
    "numRect": "0",
    "saisine": {
      "refTexteLegislatif": "PRJLANR5L15BTC1548",
      "numeroPartiePLF": "0",
      "organeExamen": "PO717460",
      "mentionSecondeDeliberation": "0"
    }
  },
  "numeroLong": "689",
  "etapeTexte": "Nouvelle Lecture",
  "triAmendement": "ldaaaaaaaaaaaaaaaaaaaaaaaaaaaaaaaaaaaaaaaaaaaaaaaachzzzi",
  "cardinaliteAmdtMultiples": "1",
  "amendementParent": {
    "@xmlns:xsi": "http://www.w3.org/2001/XMLSchema-instance",
    "@xsi:nil": "true"
  },
  "etat": "Discuté",
  "signataires": {
    "auteur": {
      "typeAuteur": "Depute",
      "acteurRef": "PA266808",
      "organeRef": {
        "@xmlns:xsi": "http://www.w3.org/2001/XMLSchema-instance",
        "@xsi:nil": "true"
      },
      "groupePolitiqueRef": "PO730934"
    },
    "cosignataires": {
      "acteurRef": "PA266808"
    },
    "texteAffichable": "M.&#160;Rolland"
  },
  "pointeurFragmentTexte": {
    "missionVisee": {
      "@xmlns:xsi": "http://www.w3.org/2001/XMLSchema-instance",
      "@xsi:nil": "true"
    },
    "division": {
      "titre": "Article 53",
      "articleDesignationCourte": "ART. 53",
      "type": "ARTICLE",
      "avant_A_Apres": "A",
      "divisionRattachee": "ARTICLE 53",
      "articleAdditionnel": {
        "@xmlns:xsi": "http://www.w3.org/2001/XMLSchema-instance",
        "@xsi:nil": "true"
      },
      "chapitreAdditionnel": {
        "@xmlns:xsi": "http://www.w3.org/2001/XMLSchema-instance",
        "@xsi:nil": "true"
      },
      "urlDivisionTexteVise": "/15/textes/1548.asp#D_Article_53"
    },
    "alinea": {
      "@xmlns:xsi": "http://www.w3.org/2001/XMLSchema-instance",
      "@xsi:nil": "true"
    }
  },
  "corps": {
    "dispositif": "<p style=\"text-align: justify;\">Supprimer cet article.</p>",
    "exposeSommaire": "<p style=\"text-align: justify;\">Cet article permet la fusion du tribunal de grande instance avec les tribunaux d&#8217;instance de son ressort.</p><p style=\"text-align: justify;\">La recherche de l&#8217;efficacit&#233; ne doit pas &#234;tre un pr&#233;texte pour instaurer une int&#233;grale refonte de la&#160;carte judiciaire.&#160;Les juridictions de proximit&#233;, permettant l&#8217;acc&#232;s de tous &#224; la justice, sont essentielles pour les citoyens et les territoires. Il s&#8217;agit de ne pas oublier les Fran&#231;ais qui habitent des territoires ruraux&#160;: un temps de trajet trop long, trop contraignant est une sorte d&#8217;obstacle &#224; l&#8217;acc&#232;s de tous &#224; la justice.&#160;</p><p style=\"text-align: justify;\">Le d&#233;sencombrement des tribunaux, en somme, ne doit pas passer par la renonciation des&#160;justiciables d&#8217;agir en justice, en raison des difficult&#233;s pour s&#8217;y rendre. La justice doit rester un service public accessible, aussi bien g&#233;ographiquement que mat&#233;riellement, &#224; tous.&#160;</p><p style=\"text-align: justify;\">Il convient donc de supprimer cet article, c&#8217;est l&#8217;objet de l&#8217;amendement.</p>",
    "annexeExposeSommaire": {
      "@xmlns:xsi": "http://www.w3.org/2001/XMLSchema-instance",
      "@xsi:nil": "true"
    },
    "cartoucheDelaiDepotDepasse": {
      "@xmlns:xsi": "http://www.w3.org/2001/XMLSchema-instance",
      "@xsi:nil": "true"
    }
  },
  "representations": {
    "representation": {
      "nom": "PDF",
      "typeMime": {
        "type": "application",
        "subType": "PDF"
      },
      "statutRepresentation": {
        "verbatim": "true",
        "canonique": "true",
        "officielle": "true",
        "transcription": "false",
        "enregistrement": "false"
      },
      "repSource": {
        "@xmlns:xsi": "http://www.w3.org/2001/XMLSchema-instance",
        "@xsi:nil": "true"
      },
      "offset": {
        "@xmlns:xsi": "http://www.w3.org/2001/XMLSchema-instance",
        "@xsi:nil": "true"
      },
      "contenu": {
        "documentURI": "/15/amendements/1548/AN/689.pdf"
      },
      "dateDispoRepresentation": {
        "@xmlns:xsi": "http://www.w3.org/2001/XMLSchema-instance",
        "@xsi:nil": "true"
      }
    }
  },
  "seanceDiscussion": "RUANR5L15S2019IDS21452",
  "sort": {
    "dateSaisie": "2019-01-18T01:51:10.000+01:00",
    "sortEnSeance": "Rejeté"
  },
  "dateDepot": "2019-01-11T01:00:00.000+01:00",
  "dateDistribution": "2019-01-14T01:00:00.000+01:00",
  "article99": "0",
  "loiReference": {
    "codeLoi": {
      "@xmlns:xsi": "http://www.w3.org/2001/XMLSchema-instance",
      "@xsi:nil": "true"
    },
    "divisionCodeLoi": {
      "@xmlns:xsi": "http://www.w3.org/2001/XMLSchema-instance",
      "@xsi:nil": "true"
    }
  }
}