{
  "@xmlns": "http://schemas.assemblee-nationale.fr/referentiel",
  "uid": "AMANR5L15SEA717460BTC2102P0D1N75",
  "identifiant": {
    "legislature": "15",
    "numero": "75",
    "numRect": "0",
    "saisine": {
      "refTexteLegislatif": "PIONANR5L15BTC2102",
      "numeroPartiePLF": "0",
      "organeExamen": "PO717460",
      "mentionSecondeDeliberation": "0"
    }
  },
  "numeroLong": "75",
  "etapeTexte": "1ère lecture (2ème assemblée saisie)",
  "triAmendement": "eiaaaaaaaaaaaaaaaaaaaaaaaaaaaaaaaaaaaaaaaaaaaaaaaafc",
  "cardinaliteAmdtMultiples": "1",
  "amendementParent": {
    "@xmlns:xsi": "http://www.w3.org/2001/XMLSchema-instance",
    "@xsi:nil": "true"
  },
  "etat": "Discuté",
  "signataires": {
    "auteur": {
      "typeAuteur": "Depute",
      "acteurRef": "PA607619",
      "organeRef": {
        "@xmlns:xsi": "http://www.w3.org/2001/XMLSchema-instance",
        "@xsi:nil": "true"
      },
      "groupePolitiqueRef": "PO759900"
    },
    "cosignataires": {
      "acteurRef": [
        "PA333421",
        "PA721194",
        "PA719286",
        "PA336175",
        "PA336439",
        "PA719146",
        "PA720038",
        "PA608292",
        "PA720996",
        "PA755549",
        "PA605694",
        "PA331582",
        "PA405480",
        "PA719138",
        "PA605518",
        "PA607619"
      ]
    },
    "texteAffichable": "M.&#160;Molac,  M.&#160;Acquaviva, M.&#160;Brial, M.&#160;Castellani, M.&#160;Cl&#233;ment, M.&#160;Colombani, Mme&#160;Dubi&#233;, Mme&#160;Fr&#233;d&#233;rique&#160;Dumas, M.&#160;El Guerrab, M.&#160;Falorni, Mme&#160;Josso, M.&#160;Fran&#231;ois-Michel&#160;Lambert, M.&#160;Pancher, Mme&#160;Pinel, M.&#160;Pupponi et M.&#160;Philippe&#160;Vigier"
  },
  "pointeurFragmentTexte": {
    "missionVisee": {
      "@xmlns:xsi": "http://www.w3.org/2001/XMLSchema-instance",
      "@xsi:nil": "true"
    },
    "division": {
      "titre": "Article 4 ter",
      "articleDesignationCourte": "APRÈS ART. 4 TER",
      "type": "ARTICLE",
      "avant_A_Apres": "Après",
      "divisionRattachee": "APRÈS L'ARTICLE 4 TER, insérer l'article suivant:",
      "articleAdditionnel": "1",
      "chapitreAdditionnel": {
        "@xmlns:xsi": "http://www.w3.org/2001/XMLSchema-instance",
        "@xsi:nil": "true"
      },
      "urlDivisionTexteVise": "/15/textes/2102.asp#D_Article_4_ter"
    },
    "alinea": {
      "@xmlns:xsi": "http://www.w3.org/2001/XMLSchema-instance",
      "@xsi:nil": "true"
    }
  },
  "corps": {
    "dispositif": "<p style=\"text-align: justify;\">&#192; la premi&#232;re phrase du premier alin&#233;a de l&#8217;article L.&#160;2113&#8209;6 du code g&#233;n&#233;ral des collectivit&#233;s territoriales, apr&#232;s la r&#233;f&#233;rence&#160;: &#171;&#160;L.&#160;2113&#8209;2&#160;&#187;, sont ins&#233;r&#233;s les mots&#160;: &#171;&#160;apr&#232;s consultation du conseil r&#233;gional&#160;&#187;.</p>",
    "exposeSommaire": "<p style=\"text-align: justify;\">Cet amendement propose que pour la d&#233;termination du nom de la commune nouvelle, les conseils municipaux consultent pour avis le Conseil r&#233;gional.</p><p style=\"text-align: justify;\">Pour toute cr&#233;ation de commune nouvelle, il s&#8217;agit de trouver un nouveau nom qui doive s&#8217;appliquer en remplacement des anciens noms de communes.</p><p style=\"text-align: justify;\">Cela est loin d&#8217;&#234;tre anodin, lorsque l&#8217;on sait que les noms des communes sont dans bien des cas issus d&#8217;une histoire plus que mill&#233;naire issue de la toponymie locale. Par bien des aspects, le nom de ces communes rel&#232;ve du patrimoine du territoire sur lequel elle se trouve. L&#8217;origine de ces noms qu&#8217;elle soit bretonne, corse, occitane, basque, alsacienne etc. mais aussi relevant des langues d&#8217;o&#239;l desquelles est issu le Fran&#231;ais, participe &#224; la richesse toponymique de notre pays. Sans parler d&#8217;origine linguistique, le nom des communes est surtout li&#233; &#224; l&#8217;histoire de ces territoires. Par la cr&#233;ation de nouveaux noms de communes, existe donc une crainte de d&#233;s-historicisation et de banalisation de ces territoires.</p><p style=\"text-align: justify;\">Actuellement, l&#8217;article L.&#160;2111&#8209;1 du code g&#233;n&#233;ral des collectivit&#233;s territoriales &#233;nonce que &#171;&#160;les changements de noms qui sont la cons&#233;quence d&#8217;une modification des limites territoriales des communes sont prononc&#233;s par les autorit&#233;s comp&#233;tentes pour prendre les d&#233;cisions de modification&#160;&#187;, sans aucune forme de consultation tierce, contrairement aux communes dont le p&#233;rim&#232;tre n&#8217;&#233;volue pas.</p><p style=\"text-align: justify;\">C&#8217;est pourquoi, afin d&#8217;accompagner un tant soit peu les &#233;lus des communes nouvelles dans la recherche d&#8217;un nom ne faisant notamment pas table rase de l&#8217;histoire toponymique du territoire, cet amendement propose qu&#8217;avant tout choix d&#8217;un nouveau nom, le conseil r&#233;gional concern&#233; soit consult&#233; pour avis.</p><p style=\"text-align: justify;\">Cette collectivit&#233; territoriale est en effet la plus &#224; m&#234;me de donner un avis &#233;clair&#233; sur cette question, ayant la protection du patrimoine, notamment culturel et immat&#233;riel, et la pr&#233;servation de son identit&#233; dans ses comp&#233;tences obligatoires. De m&#234;me, les r&#233;gions dans lesquelles les principales langues r&#233;gionales sont parl&#233;es ont &#224; leur service un office public de la langue r&#233;gionale concern&#233;e dont un d&#233;partement est consacr&#233; &#224; la toponymie.</p>",
    "annexeExposeSommaire": {
      "@xmlns:xsi": "http://www.w3.org/2001/XMLSchema-instance",
      "@xsi:nil": "true"
    },
    "cartoucheDelaiDepotDepasse": {
      "@xmlns:xsi": "http://www.w3.org/2001/XMLSchema-instance",
      "@xsi:nil": "true"
    }
  },
  "representations": {
    "representation": {
      "nom": "PDF",
      "typeMime": {
        "type": "application",
        "subType": "PDF"
      },
      "statutRepresentation": {
        "verbatim": "true",
        "canonique": "true",
        "officielle": "true",
        "transcription": "false",
        "enregistrement": "false"
      },
      "repSource": {
        "@xmlns:xsi": "http://www.w3.org/2001/XMLSchema-instance",
        "@xsi:nil": "true"
      },
      "offset": {
        "@xmlns:xsi": "http://www.w3.org/2001/XMLSchema-instance",
        "@xsi:nil": "true"
      },
      "contenu": {
        "documentURI": "/15/amendements/2102/AN/75.pdf"
      },
      "dateDispoRepresentation": {
        "@xmlns:xsi": "http://www.w3.org/2001/XMLSchema-instance",
        "@xsi:nil": "true"
      }
    }
  },
  "seanceDiscussion": "RUANR5L15S2019IDS21756",
  "sort": {
    "dateSaisie": "2019-07-10T23:00:32.000+02:00",
    "sortEnSeance": "Rejeté"
  },
  "dateDepot": "2019-07-05T02:00:00.000+02:00",
  "dateDistribution": "2019-07-10T02:00:00.000+02:00",
  "article99": "0",
  "loiReference": {
    "codeLoi": "CGCT",
    "divisionCodeLoi": "L2113-6"
  }
}