{
  "@xmlns": "http://schemas.assemblee-nationale.fr/referentiel",
  "uid": "AMANR5L15SEA717460BTC1548P0D1N432",
  "identifiant": {
    "legislature": "15",
    "numero": "432",
    "numRect": "0",
    "saisine": {
      "refTexteLegislatif": "PRJLANR5L15BTC1548",
      "numeroPartiePLF": "0",
      "organeExamen": "PO717460",
      "mentionSecondeDeliberation": "0"
    }
  },
  "numeroLong": "432",
  "etapeTexte": "Nouvelle Lecture",
  "triAmendement": "aiaaaaaaaaaaaaaaaaaaaaaaaaaaaaaaaaaaaaaaaaaaaaaaaabhz",
  "cardinaliteAmdtMultiples": "1",
  "amendementParent": {
    "@xmlns:xsi": "http://www.w3.org/2001/XMLSchema-instance",
    "@xsi:nil": "true"
  },
  "etat": "Discuté",
  "signataires": {
    "auteur": {
      "typeAuteur": "Depute",
      "acteurRef": "PA266797",
      "organeRef": {
        "@xmlns:xsi": "http://www.w3.org/2001/XMLSchema-instance",
        "@xsi:nil": "true"
      },
      "groupePolitiqueRef": "PO730934"
    },
    "cosignataires": {
      "acteurRef": [
        "PA720644",
        "PA1029",
        "PA721126",
        "PA330909",
        "PA332523",
        "PA334149",
        "PA746",
        "PA267794",
        "PA267785",
        "PA748954",
        "PA2529",
        "PA712015",
        "PA719272",
        "PA336316",
        "PA266774",
        "PA767",
        "PA709315",
        "PA721816",
        "PA2960",
        "PA998",
        "PA643103",
        "PA609726",
        "PA1630",
        "PA223837",
        "PA267318",
        "PA721054",
        "PA330240",
        "PA718784",
        "PA267200",
        "PA609245",
        "PA720100",
        "PA606712",
        "PA720630",
        "PA713448",
        "PA606098",
        "PA720586",
        "PA1327",
        "PA721968",
        "PA2155",
        "PA342935",
        "PA267527",
        "PA267289",
        "PA2377",
        "PA2796",
        "PA267440",
        "PA2792",
        "PA722390",
        "PA1498",
        "PA346054",
        "PA267901",
        "PA721636",
        "PA856",
        "PA720684",
        "PA267324",
        "PA2086",
        "PA643089",
        "PA267260",
        "PA605036",
        "PA720386",
        "PA721070",
        "PA719946",
        "PA608826",
        "PA266797",
        "PA1695",
        "PA721410",
        "PA334843",
        "PA266793",
        "PA266808",
        "PA330788",
        "PA643134",
        "PA607090",
        "PA759192",
        "PA923",
        "PA721678",
        "PA2492",
        "PA340853"
      ]
    },
    "texteAffichable": "M.&#160;Gosselin,  M.&#160;Savignat, M.&#160;Jacob, M.&#160;Abad, M.&#160;Aubert, Mme&#160;Bonnivard, M.&#160;Bony, M.&#160;Boucard, M.&#160;Bouchet, Mme&#160;Brenier, M.&#160;Brochand, M.&#160;Carrez, M.&#160;Cattin, M.&#160;Cherpion, M.&#160;Ciotti, Mme&#160;Corneloup, M.&#160;Cornut-Gentille, Mme&#160;Dalloz, M.&#160;Dassault, M.&#160;Deflesselles, M.&#160;Descoeur, M.&#160;Di Filippo, M.&#160;Diard, M.&#160;Dive, M.&#160;Door, Mme&#160;Marianne&#160;Dubois, Mme&#160;Duby-Muller, M.&#160;Pierre-Henri&#160;Dumont, M.&#160;Fasquelle, M.&#160;Ferrara, M.&#160;Forissier, M.&#160;Furst, M.&#160;Gaultier, M.&#160;Goasguen, M.&#160;Grelier, Mme&#160;Guion-Firmin, M.&#160;Herbillon, M.&#160;Huyghe, M.&#160;Kamardine, Mme&#160;Lacroute, M.&#160;Larriv&#233;, M.&#160;Leclerc, M.&#160;Lorion, M.&#160;Lurton, M.&#160;Emmanuel&#160;Maquet, M.&#160;Marleix, M.&#160;Marlin, M.&#160;Menuel, Mme&#160;Meunier, M.&#160;Minot, M.&#160;Nury, M.&#160;Parigi, M.&#160;Pauget, M.&#160;Peltier, M.&#160;Perrut, Mme&#160;Poletti, M.&#160;Poudroux, M.&#160;Pradi&#233;, M.&#160;Quentin, Mme&#160;Ramassamy, M.&#160;Reda, M.&#160;Reitzer, M.&#160;Reyn&#232;s, M.&#160;Rolland, M.&#160;Saddier, Mme&#160;Tabarot, M.&#160;Taugourdeau, M.&#160;Teissier, M.&#160;Thi&#233;riot, Mme&#160;Valentin, M.&#160;Vatin, M.&#160;Verch&#232;re, M.&#160;Viala, M.&#160;Vialay, M.&#160;Jean-Pierre&#160;Vigier et M.&#160;Woerth"
  },
  "pointeurFragmentTexte": {
    "missionVisee": {
      "@xmlns:xsi": "http://www.w3.org/2001/XMLSchema-instance",
      "@xsi:nil": "true"
    },
    "division": {
      "titre": "Article 7",
      "articleDesignationCourte": "ART. 7",
      "type": "ARTICLE",
      "avant_A_Apres": "A",
      "divisionRattachee": "ARTICLE 7",
      "articleAdditionnel": {
        "@xmlns:xsi": "http://www.w3.org/2001/XMLSchema-instance",
        "@xsi:nil": "true"
      },
      "chapitreAdditionnel": {
        "@xmlns:xsi": "http://www.w3.org/2001/XMLSchema-instance",
        "@xsi:nil": "true"
      },
      "urlDivisionTexteVise": "/15/textes/1548.asp#D_Article_7"
    },
    "alinea": {
      "avant_A_Apres": {
        "@xmlns:xsi": "http://www.w3.org/2001/XMLSchema-instance",
        "@xsi:nil": "true"
      },
      "numero": "5",
      "alineaDesignation": {
        "@xmlns:xsi": "http://www.w3.org/2001/XMLSchema-instance",
        "@xsi:nil": "true"
      }
    }
  },
  "corps": {
    "dispositif": "<p style=\"text-align: justify;\">&#192; l&#8217;alin&#233;a&#160;5, supprimer les mots&#160;:</p><p style=\"text-align: justify;\">&#171;&#160;d&#8217;enfant mineur sous tutelle ou&#160;&#187;.</p>",
    "exposeSommaire": "<p style=\"text-align: justify;\">Cet amendement adopt&#233; par le S&#233;nat en premi&#232;re lecture vise &#224; maintenir l&#8217;homologation par le juge des modifications de r&#233;gime matrimonial en pr&#233;sence d&#8217;enfants mineurs, que l&#8217;article&#160;7 propose de supprimer.</p><p style=\"text-align: justify;\">Il s&#8217;oppose &#224; la suppression de l&#8217;intervention du juge car elle permet de v&#233;rifier que la modification est bien conforme &#224; l&#8217;int&#233;r&#234;t de la famille, prise sans sa globalit&#233;, et pas seulement &#224; l&#8217;int&#233;r&#234;t des &#233;poux.</p><p style=\"text-align: justify;\">Il est &#233;galement d&#233;licat, comme le propose l&#8217;article&#160;7, de confier au notaire, qui ne sera pas parvenu &#224; convaincre les &#233;poux de renoncer &#224; la modification envisag&#233;e au nom de l&#8217;int&#233;r&#234;t de leurs enfants, le soin de saisir le juge. Cela le placerait dans une position d&#233;licate vis-&#224;-vis de ses clients.</p>",
    "annexeExposeSommaire": {
      "@xmlns:xsi": "http://www.w3.org/2001/XMLSchema-instance",
      "@xsi:nil": "true"
    },
    "cartoucheDelaiDepotDepasse": {
      "@xmlns:xsi": "http://www.w3.org/2001/XMLSchema-instance",
      "@xsi:nil": "true"
    }
  },
  "representations": {
    "representation": {
      "nom": "PDF",
      "typeMime": {
        "type": "application",
        "subType": "PDF"
      },
      "statutRepresentation": {
        "verbatim": "true",
        "canonique": "true",
        "officielle": "true",
        "transcription": "false",
        "enregistrement": "false"
      },
      "repSource": {
        "@xmlns:xsi": "http://www.w3.org/2001/XMLSchema-instance",
        "@xsi:nil": "true"
      },
      "offset": {
        "@xmlns:xsi": "http://www.w3.org/2001/XMLSchema-instance",
        "@xsi:nil": "true"
      },
      "contenu": {
        "documentURI": "/15/amendements/1548/AN/432.pdf"
      },
      "dateDispoRepresentation": {
        "@xmlns:xsi": "http://www.w3.org/2001/XMLSchema-instance",
        "@xsi:nil": "true"
      }
    }
  },
  "seanceDiscussion": "RUANR5L15S2019IDS21450",
  "sort": {
    "dateSaisie": "2019-01-17T11:17:45.000+01:00",
    "sortEnSeance": "Rejeté"
  },
  "dateDepot": "2019-01-10T01:00:00.000+01:00",
  "dateDistribution": "2019-01-14T01:00:00.000+01:00",
  "article99": "0",
  "loiReference": {
    "codeLoi": {
      "@xmlns:xsi": "http://www.w3.org/2001/XMLSchema-instance",
      "@xsi:nil": "true"
    },
    "divisionCodeLoi": {
      "@xmlns:xsi": "http://www.w3.org/2001/XMLSchema-instance",
      "@xsi:nil": "true"
    }
  }
}