{
  "@xmlns": "http://schemas.assemblee-nationale.fr/referentiel",
  "uid": "AMANR5L15SEA717460BTC0369P0D1N196",
  "identifiant": {
    "legislature": "15",
    "numero": "196",
    "numRect": "0",
    "saisine": {
      "refTexteLegislatif": "PRJLANR5L15BTC0369",
      "numeroPartiePLF": "0",
      "organeExamen": "PO717460",
      "mentionSecondeDeliberation": "0"
    }
  },
  "numeroLong": "196",
  "etapeTexte": "1ère lecture (1ère assemblée saisie)",
  "triAmendement": "rs",
  "cardinaliteAmdtMultiples": "1",
  "amendementParent": {
    "@xmlns:xsi": "http://www.w3.org/2001/XMLSchema-instance",
    "@xsi:nil": "true"
  },
  "etat": "Discuté",
  "signataires": {
    "auteur": {
      "typeAuteur": "Depute",
      "acteurRef": "PA719930",
      "organeRef": {
        "@xmlns:xsi": "http://www.w3.org/2001/XMLSchema-instance",
        "@xsi:nil": "true"
      },
      "groupePolitiqueRef": "PO730946"
    },
    "cosignataires": {
      "acteurRef": [
        "PA340343",
        "PA267233",
        "PA429893",
        "PA335054",
        "PA643145",
        "PA610681",
        "PA333285",
        "PA332614",
        "PA508",
        "PA342415",
        "PA608011",
        "PA1008",
        "PA1809",
        "PA337483",
        "PA608172",
        "PA605069",
        "PA335532",
        "PA330357",
        "PA720988",
        "PA609590",
        "PA588886",
        "PA607553",
        "PA1198",
        "PA719930",
        "PA333818",
        "PA335999",
        "PA608695",
        "PA642764",
        "PA405480",
        "PA609332",
        "PA1592"
      ]
    },
    "texteAffichable": "M.&#160;Vallaud,  M.&#160;Aviragnet, Mme&#160;Bareigts, Mme&#160;Vainqueur-Christophe, Mme&#160;Batho, Mme&#160;Battistel, Mme&#160;Bi&#233;mouret, M.&#160;Bouillon, M.&#160;Jean-Louis&#160;Bricout, M.&#160;Carvounas, M.&#160;Alain&#160;David, Mme&#160;Laurence&#160;Dumont, M.&#160;Dussopt, M.&#160;Faure, M.&#160;Garot, M.&#160;David&#160;Habib, M.&#160;Hutin, M.&#160;Juanico, Mme&#160;Karamanli, M.&#160;J&#233;r&#244;me&#160;Lambert, M.&#160;Le Foll, M.&#160;Letchimy, Mme&#160;Manin, Mme&#160;Pau-Langevin, Mme&#160;Pires Beaune, M.&#160;Potier, M.&#160;Pueyo, M.&#160;Pupponi, Mme&#160;Rabault, M.&#160;Saulignac et Mme&#160;Untermaier"
  },
  "pointeurFragmentTexte": {
    "missionVisee": {
      "@xmlns:xsi": "http://www.w3.org/2001/XMLSchema-instance",
      "@xsi:nil": "true"
    },
    "division": {
      "titre": "Article 6",
      "articleDesignationCourte": "ART. 6",
      "type": "ARTICLE",
      "avant_A_Apres": "A",
      "divisionRattachee": "ARTICLE 6",
      "articleAdditionnel": {
        "@xmlns:xsi": "http://www.w3.org/2001/XMLSchema-instance",
        "@xsi:nil": "true"
      },
      "chapitreAdditionnel": {
        "@xmlns:xsi": "http://www.w3.org/2001/XMLSchema-instance",
        "@xsi:nil": "true"
      },
      "urlDivisionTexteVise": "/15/textes/0369.asp#D_Article_6"
    },
    "alinea": {
      "avant_A_Apres": "Apres",
      "numero": "16",
      "alineaDesignation": {
        "@xmlns:xsi": "http://www.w3.org/2001/XMLSchema-instance",
        "@xsi:nil": "true"
      }
    }
  },
  "corps": {
    "dispositif": "<p>Apr&#232;s l&#8217;alin&#233;a&#160;16, ins&#233;rer les quatre alin&#233;as suivants&#160;:</p><p>&#171;&#160;8&#176; <i>bis</i> L&#8217;article L.&#160;1471&#8209;1 est ainsi modifi&#233;&#160;:</p><p>&#171;&#160;a) Au premier alin&#233;a, apr&#232;s le mot&#160;: &#171;&#160;ex&#233;cution&#160;&#187;, sont ins&#233;r&#233;s les mots&#160;: &#171;&#160;ou la rupture du contrat de travail&#160;&#187;&#160;;</p><p>&#171;&#160;b) Le deuxi&#232;me alin&#233;a est supprim&#233;&#160;;</p><p>&#171;&#160;c) &#192; la premi&#232;re phrase du dernier alin&#233;a, le mot&#160;:&#160;&#171; deuxi&#232;me &#187;&#160;est remplac&#233; par le mot&#160;:&#160;&#171; premier &#187;&#160;&#187;.</p>",
    "exposeSommaire": "<p style=\"text-align: justify;\">Par cet amendement, nous r&#233;tablissons le d&#233;lai de recours &#224; deux ans en cas de rupture du contrat de travail. Les d&#233;lais n&#8217;ont cess&#233; d&#8217;&#234;tre r&#233;duits pour s&#233;curiser les employeurs. Le d&#233;lai d&#8217;un an nous semble trop court, parce qu&#8217;il nous am&#232;nerait &#224; la situation paradoxale dans laquelle le requ&#233;rant aurait moins de temps pour monter son dossier que les tribunaux n&#8217;en auraient pour l&#8217;instruire, puisque certaines proc&#233;dures en r&#233;gion parisienne durent pr&#232;s de deux ans.</p><p style=\"text-align: justify;\">Lorsqu&#8217;un salari&#233; est victime d&#8217;un licenciement, les cons&#233;quences psychologiques peuvent &#234;tre lourdes et son premier r&#233;flexe ne sera pas forc&#233;ment de mettre en question la l&#233;galit&#233; de son licenciement, mais bien &#171;&#160;d&#8217;encaisser&#160;&#187;, si vous me permettez l&#8217;expression, le choc qu&#8217;il vient de subir.</p>",
    "annexeExposeSommaire": {
      "@xmlns:xsi": "http://www.w3.org/2001/XMLSchema-instance",
      "@xsi:nil": "true"
    }
  },
  "representations": {
    "representation": {
      "nom": "PDF",
      "typeMime": {
        "type": "application",
        "subType": "PDF"
      },
      "statutRepresentation": {
        "verbatim": "true",
        "canonique": "true",
        "officielle": "true",
        "transcription": "false",
        "enregistrement": "false"
      },
      "repSource": {
        "@xmlns:xsi": "http://www.w3.org/2001/XMLSchema-instance",
        "@xsi:nil": "true"
      },
      "offset": {
        "@xmlns:xsi": "http://www.w3.org/2001/XMLSchema-instance",
        "@xsi:nil": "true"
      },
      "contenu": {
        "documentURI": "/15/amendements/0369/AN/196.pdf"
      },
      "dateDispoRepresentation": {
        "@xmlns:xsi": "http://www.w3.org/2001/XMLSchema-instance",
        "@xsi:nil": "true"
      }
    }
  },
  "seanceDiscussion": "RUANR5L15S2018IDS20779",
  "sort": {
    "dateSaisie": "2017-11-23T18:12:34.000+01:00",
    "sortEnSeance": "Rejeté"
  },
  "dateDepot": "2017-11-17T01:00:00.000+01:00",
  "dateDistribution": "2017-11-20T01:00:00.000+01:00",
  "article99": "0",
  "loiReference": {
    "codeLoi": "c travail",
    "divisionCodeLoi": "L1471-1"
  }
}