{
  "@xmlns": "http://schemas.assemblee-nationale.fr/referentiel",
  "uid": "AMANR5L15SEA717460B2272P1D1N1018",
  "identifiant": {
    "legislature": "15",
    "numero": "1018",
    "numRect": "0",
    "saisine": {
      "refTexteLegislatif": "PRJLANR5L15B2272",
      "numeroPartiePLF": "1",
      "organeExamen": "PO717460",
      "mentionSecondeDeliberation": "0"
    }
  },
  "numeroLong": "I-1018",
  "etapeTexte": "1ère lecture (1ère assemblée saisie)",
  "triAmendement": "bfaaaaaaaaaaaaaaaaaaaaaaaaaaaaaaaaaaaaaaaaaaaaaaaabf",
  "cardinaliteAmdtMultiples": "1",
  "amendementParent": {
    "@xmlns:xsi": "http://www.w3.org/2001/XMLSchema-instance",
    "@xsi:nil": "true"
  },
  "etat": "Discuté",
  "signataires": {
    "auteur": {
      "typeAuteur": "Depute",
      "acteurRef": "PA722284",
      "organeRef": {
        "@xmlns:xsi": "http://www.w3.org/2001/XMLSchema-instance",
        "@xsi:nil": "true"
      },
      "groupePolitiqueRef": "PO730970"
    },
    "cosignataires": {
      "acteurRef": "PA722284"
    },
    "texteAffichable": "M.&#160;Fuchs"
  },
  "pointeurFragmentTexte": {
    "missionVisee": {
      "@xmlns:xsi": "http://www.w3.org/2001/XMLSchema-instance",
      "@xsi:nil": "true"
    },
    "division": {
      "titre": "Article 6",
      "articleDesignationCourte": "APRÈS ART. 6",
      "type": "ARTICLE",
      "avant_A_Apres": "Après",
      "divisionRattachee": "APRÈS L'ARTICLE 6, insérer l'article suivant:",
      "articleAdditionnel": "1",
      "chapitreAdditionnel": {
        "@xmlns:xsi": "http://www.w3.org/2001/XMLSchema-instance",
        "@xsi:nil": "true"
      },
      "urlDivisionTexteVise": "/15/textes/2272A.asp#D_Article_6"
    },
    "alinea": {
      "@xmlns:xsi": "http://www.w3.org/2001/XMLSchema-instance",
      "@xsi:nil": "true"
    }
  },
  "corps": {
    "dispositif": "<p style=\"text-align: justify;\">I.&#160;&#8211;&#160;Le dernier alin&#233;a de l&#8217;article&#160;150 VK du code ge&#769;ne&#769;ral des impo&#770;ts est ainsi r&#233;dig&#233;&#160;:</p><p style=\"text-align: justify;\">&#171;&#160;III.&#160;&#8211;&#160;La vente d&#8217;or est enti&#232;rement d&#233;fiscalis&#233;e pendant une ann&#233;e.&#160;&#187;</p><p style=\"text-align: justify;\">II.&#160;&#8211;&#160;La perte de recettes pour l&#8217;&#201;tat est compens&#233;e &#224; due concurrence par la cr&#233;ation d&#8217;une taxe additionnelle aux droits mentionn&#233;s aux articles 575 et 575 A du code g&#233;n&#233;ral des imp&#244;ts.&#160;</p>",
    "exposeSommaire": "<p style=\"text-align: justify;\">Cet amendement a pour objet d&#8217;inciter les particuliers a&#768; c&#233;der une partie de l&#8217;or th&#233;sauris&#233;, &#224; stimuler le march&#233; fran&#231;ais de l&#8217;or et &#224; l&#8217;orienter vers l&#8217;investissement productif, notamment dans les petites et moyennes entreprises et le secteur agricole.</p><p style=\"text-align: justify;\">D&#8217;apr&#232;s une enqu&#234;te Ipsos, 16&#160;% des Fran&#231;ais poss&#232;dent de l&#8217;or pour une quantit&#233; &#233;valu&#233;e a&#768; environ 3 000 tonnes&#160;; ce qui correspond au cours actuel &#224; 105 milliards d&#8217;euros.&#160;</p><p style=\"text-align: justify;\">D&#8217;apr&#232;s les experts, ces 3000 tonnes sont compos&#233;es de 515 millions de pi&#232;ces Napol&#233;on frapp&#233;es entre 1803 et 1914, (2/3 du total et 1/3 de lingots), principalement acquises (&#224; 80&#160;%) sous le r&#233;gime de l&#8217;anonymat par h&#233;ritage familial et transmission de la main &#224; la main.</p><p style=\"text-align: justify;\">La fiscalit&#233; en vigueur en France est un frein s&#233;rieux pour les &#233;pargnants fran&#231;ais qui pr&#233;f&#232;rent le th&#233;sauriser. L&#8217;essentiel du bas de laine ne pouvant pas justifier du prix et de la date d&#8217;acquisition (80&#160;% des d&#233;tenteurs d&#8217;or), ces particuliers conservent leur or (73&#160;% d&#8217;entre eux depuis plus de 10&#160;ans) en attendant des jours meilleurs.</p><p style=\"text-align: justify;\">Au total, en 2016 seules 9 tonnes d&#8217;or ont &#233;t&#233; &#233;chang&#233;es en France dont seulement 1/3 &#224; la vente, contre 160 tonnes achet&#233;es en Allemagne (o&#249; la fiscalit&#233; est nulle, pass&#233; un an de d&#233;tention).</p><p style=\"text-align: justify;\">Cette mesure unique pendant un an pourrait d&#233;bloquer, en prenant l&#8217;hypoth&#232;se de 5&#160;% du stock, 4,5 milliards qui seraient inject&#233;s dans l&#8217;&#233;conomie r&#233;elle.</p><p style=\"text-align: justify;\">Cette mesure exceptionnelle serait est &#224; prendre comme une contribution des fran&#231;ais &#224; leur &#233;conomie et leur emploi.</p><p style=\"text-align: justify;\">Contrairement aux id&#233;es re&#231;ues, elle n&#8217;est en rien une mesure de riches puisque 13&#160;% des ouvriers, 17&#160;% des employ&#233;s 13&#160;% des familles modestes et 20&#160;% de cadres poss&#232;dent de l&#8217;or.</p>",
    "annexeExposeSommaire": {
      "@xmlns:xsi": "http://www.w3.org/2001/XMLSchema-instance",
      "@xsi:nil": "true"
    },
    "cartoucheDelaiDepotDepasse": {
      "@xmlns:xsi": "http://www.w3.org/2001/XMLSchema-instance",
      "@xsi:nil": "true"
    },
    "avantAppel": {
      "@xmlns:xsi": "http://www.w3.org/2001/XMLSchema-instance",
      "@xsi:nil": "true"
    }
  },
  "representations": {
    "representation": {
      "nom": "PDF",
      "typeMime": {
        "type": "application",
        "subType": "PDF"
      },
      "statutRepresentation": {
        "verbatim": "true",
        "canonique": "true",
        "officielle": "true",
        "transcription": "false",
        "enregistrement": "false"
      },
      "repSource": {
        "@xmlns:xsi": "http://www.w3.org/2001/XMLSchema-instance",
        "@xsi:nil": "true"
      },
      "offset": {
        "@xmlns:xsi": "http://www.w3.org/2001/XMLSchema-instance",
        "@xsi:nil": "true"
      },
      "contenu": {
        "documentURI": "/15/amendements/2272A/AN/1018.pdf"
      },
      "dateDispoRepresentation": {
        "@xmlns:xsi": "http://www.w3.org/2001/XMLSchema-instance",
        "@xsi:nil": "true"
      }
    }
  },
  "seanceDiscussion": "RUANR5L15S2020IDS21870",
  "sort": {
    "dateSaisie": "2019-10-18T17:19:04.000+02:00",
    "sortEnSeance": "Non soutenu"
  },
  "dateDepot": "2019-10-09T02:00:00.000+02:00",
  "dateDistribution": "2019-10-16T02:00:00.000+02:00",
  "article99": "0",
  "loiReference": {
    "codeLoi": "CGI",
    "divisionCodeLoi": "150 VK"
  }
}