{
  "@xmlns": "http://schemas.assemblee-nationale.fr/referentiel",
  "uid": "AMANR5L15SEA717460B1255P1D1N791",
  "identifiant": {
    "legislature": "15",
    "numero": "791",
    "numRect": "0",
    "saisine": {
      "refTexteLegislatif": "PRJLANR5L15B1255",
      "numeroPartiePLF": "1",
      "organeExamen": "PO717460",
      "mentionSecondeDeliberation": "0"
    }
  },
  "numeroLong": "I-791",
  "etapeTexte": "1ère lecture (1ère assemblée saisie)",
  "triAmendement": "ibaaaaaaaaaaaaaaaaaaaaaaaaaaaaaaaaaaaaaaaaaaaaaaaab",
  "cardinaliteAmdtMultiples": "1",
  "amendementParent": {
    "@xmlns:xsi": "http://www.w3.org/2001/XMLSchema-instance",
    "@xsi:nil": "true"
  },
  "etat": "Discuté",
  "signataires": {
    "auteur": {
      "typeAuteur": "Depute",
      "acteurRef": "PA720386",
      "organeRef": {
        "@xmlns:xsi": "http://www.w3.org/2001/XMLSchema-instance",
        "@xsi:nil": "true"
      },
      "groupePolitiqueRef": "PO730934"
    },
    "cosignataires": {
      "acteurRef": [
        "PA346218",
        "PA605036",
        "PA719272",
        "PA718850",
        "PA267901",
        "PA334654",
        "PA721968",
        "PA267204",
        "PA267429",
        "PA642847",
        "PA718784",
        "PA718884",
        "PA336316",
        "PA608016",
        "PA1874",
        "PA330909",
        "PA606712",
        "PA720386",
        "PA721474",
        "PA719318",
        "PA721070",
        "PA608416"
      ]
    },
    "texteAffichable": "M.&#160;Di Filippo,  Mme&#160;Anthoine, M.&#160;Bazin, Mme&#160;Bazin-Malgras, M.&#160;Cinieri, M.&#160;Cordier, M.&#160;Descoeur, M.&#160;Kamardine, M.&#160;Le Fur, M.&#160;Lurton, Mme&#160;Meunier, M.&#160;Pauget, M.&#160;Sermier, M.&#160;Straumann, M.&#160;Vialay, M.&#160;Bouchet, M.&#160;Masson, Mme&#160;Ramassamy, M.&#160;Hetzel, Mme&#160;Louwagie, M.&#160;Viry et M.&#160;Abad"
  },
  "pointeurFragmentTexte": {
    "missionVisee": {
      "@xmlns:xsi": "http://www.w3.org/2001/XMLSchema-instance",
      "@xsi:nil": "true"
    },
    "division": {
      "titre": "Article 23",
      "articleDesignationCourte": "APRÈS ART. 23",
      "type": "ARTICLE",
      "avant_A_Apres": "Après",
      "divisionRattachee": "APRÈS L'ARTICLE 23, insérer l'article suivant:",
      "articleAdditionnel": "1",
      "chapitreAdditionnel": {
        "@xmlns:xsi": "http://www.w3.org/2001/XMLSchema-instance",
        "@xsi:nil": "true"
      },
      "urlDivisionTexteVise": "/15/textes/1255A.asp#D_Article_23"
    },
    "alinea": {
      "@xmlns:xsi": "http://www.w3.org/2001/XMLSchema-instance",
      "@xsi:nil": "true"
    }
  },
  "corps": {
    "dispositif": "<p style=\"text-align: justify;\">I.&#160;&#8211;&#160;L&#8217;article L.&#160;1613&#8209;1 du code g&#233;n&#233;ral des collectivit&#233;s territoriales est compl&#233;t&#233; par un alin&#233;a ainsi r&#233;dig&#233;&#160;:</p><p style=\"text-align: justify;\">&#171;&#160;Toute cr&#233;ation, extension ou modification des conditions d&#8217;exercice d&#8217;une comp&#233;tence pour une collectivit&#233; territoriale est accompagn&#233;e du versement par l&#8217;&#201;tat d&#8217;une compensation financi&#232;re proportionn&#233;e.&#160;&#187;</p><p style=\"text-align: justify;\">II.&#160;&#8211;&#160;La perte de recettes pour l&#8217;&#201;tat est compens&#233;e &#224; due concurrence par la cr&#233;ation d&#8217;une taxe additionnelle aux droits mentionn&#233;s aux articles 575 et 575 A du code g&#233;n&#233;ral des imp&#244;ts.&#160;</p>",
    "exposeSommaire": "<p style=\"text-align: justify;\">Depuis les lois de d&#233;centralisation, l&#8217;&#201;tat n&#8217;a eu de cesse de transf&#233;rer des comp&#233;tences aux collectivit&#233;s territoriales. Celles-ci, d&#233;sormais accul&#233;es par la baisse des dotations, se retrouvent en charge d&#8217;un nombre important de missions sans pour autant disposer des cr&#233;dits suffisants.</p><p style=\"text-align: justify;\">Si la Constitution pr&#233;voit que les collectivit&#233;s territoriales sont indemnis&#233;es en cas d&#8217;augmentation des d&#233;penses due &#224; la cr&#233;ation et ou &#224; l&#8217;extension des comp&#233;tences qui leur sont attribu&#233;es, elle n&#8217;en pr&#233;cise toutefois pas l&#8217;automaticit&#233;, ni m&#234;me l&#8217;&#233;quivalence.</p><p style=\"text-align: justify;\">Cet amendement vise ainsi &#224; garantir aux collectivit&#233;s une &#233;quitable compensation financi&#232;re.</p>",
    "annexeExposeSommaire": {
      "@xmlns:xsi": "http://www.w3.org/2001/XMLSchema-instance",
      "@xsi:nil": "true"
    }
  },
  "representations": {
    "representation": {
      "nom": "PDF",
      "typeMime": {
        "type": "application",
        "subType": "PDF"
      },
      "statutRepresentation": {
        "verbatim": "true",
        "canonique": "true",
        "officielle": "true",
        "transcription": "false",
        "enregistrement": "false"
      },
      "repSource": {
        "@xmlns:xsi": "http://www.w3.org/2001/XMLSchema-instance",
        "@xsi:nil": "true"
      },
      "offset": {
        "@xmlns:xsi": "http://www.w3.org/2001/XMLSchema-instance",
        "@xsi:nil": "true"
      },
      "contenu": {
        "documentURI": "/15/amendements/1255A/AN/791.pdf"
      },
      "dateDispoRepresentation": {
        "@xmlns:xsi": "http://www.w3.org/2001/XMLSchema-instance",
        "@xsi:nil": "true"
      }
    }
  },
  "seanceDiscussion": "RUANR5L15S2019IDS21283",
  "sort": {
    "dateSaisie": "2018-10-20T02:56:30.000+02:00",
    "sortEnSeance": "Rejeté"
  },
  "dateDepot": "2018-10-10T02:00:00.000+02:00",
  "dateDistribution": "2018-10-16T02:00:00.000+02:00",
  "article99": "0",
  "loiReference": {
    "codeLoi": "CGCT",
    "divisionCodeLoi": "L1613-1"
  }
}