{
  "@xmlns": "http://schemas.assemblee-nationale.fr/referentiel",
  "uid": "AMANR5L15SEA717460B1490P0D1N330",
  "identifiant": {
    "legislature": "15",
    "numero": "330",
    "numRect": "0",
    "saisine": {
      "refTexteLegislatif": "PRJLANR5L15B1490",
      "numeroPartiePLF": "0",
      "organeExamen": "PO717460",
      "mentionSecondeDeliberation": "0"
    }
  },
  "numeroLong": "330",
  "etapeTexte": "Nouvelle Lecture",
  "triAmendement": "cocaaaaaaaaaaaaaaaaaaaaaaaaaaaaaaaaaaaaaaaaaaaaaaau",
  "cardinaliteAmdtMultiples": "1",
  "amendementParent": {
    "@xmlns:xsi": "http://www.w3.org/2001/XMLSchema-instance",
    "@xsi:nil": "true"
  },
  "etat": "Irrecevable",
  "signataires": {
    "auteur": {
      "typeAuteur": "Depute",
      "acteurRef": "PA720230",
      "organeRef": {
        "@xmlns:xsi": "http://www.w3.org/2001/XMLSchema-instance",
        "@xsi:nil": "true"
      },
      "groupePolitiqueRef": "PO744425"
    },
    "cosignataires": {
      "acteurRef": [
        "PA719806",
        "PA267780",
        "PA267585",
        "PA267766",
        "PA712014",
        "PA332228",
        "PA721632",
        "PA267330",
        "PA721110",
        "PA267355",
        "PA721194",
        "PA331567",
        "PA720230",
        "PA267241"
      ]
    },
    "texteAffichable": "Mme&#160;Magnier,  Mme&#160;Auconie, M.&#160;Benoit, M.&#160;Guy&#160;Bricout, Mme&#160;de La Raudi&#232;re, M.&#160;Demilly, Mme&#160;Fr&#233;d&#233;rique&#160;Dumas, Mme&#160;Firmin Le Bodo, M.&#160;Herth, M.&#160;Ledoux, Mme&#160;Lemoine, Mme&#160;Sanquer, M.&#160;Vercamer et M.&#160;Zumkeller"
  },
  "pointeurFragmentTexte": {
    "missionVisee": {
      "@xmlns:xsi": "http://www.w3.org/2001/XMLSchema-instance",
      "@xsi:nil": "true"
    },
    "division": {
      "titre": "Article 22 ter E",
      "articleDesignationCourte": "ART. 22 TER E",
      "type": "ARTICLE",
      "avant_A_Apres": "A",
      "divisionRattachee": "ARTICLE 22 TER E",
      "articleAdditionnel": {
        "@xmlns:xsi": "http://www.w3.org/2001/XMLSchema-instance",
        "@xsi:nil": "true"
      },
      "chapitreAdditionnel": {
        "@xmlns:xsi": "http://www.w3.org/2001/XMLSchema-instance",
        "@xsi:nil": "true"
      },
      "urlDivisionTexteVise": "/15/textes/1490.asp#D_Article_22_ter_E"
    },
    "alinea": {
      "avant_A_Apres": "Avant",
      "numero": "1",
      "alineaDesignation": "Avant l'alinéa 1"
    }
  },
  "corps": {
    "dispositif": "<p>I.&#160;&#8211;&#160;Le 9 du I de l&#8217;article&#160;278 sexies du code g&#233;n&#233;ral des imp&#244;ts est ainsi r&#233;tabli&#160;:</p><p>&#171;&#160;9. Les livraisons de locaux aux &#233;tablissements mentionn&#233;s au 8&#176;&#160;et 9&#176;&#160;du I de l&#8217;article&#160;L.&#160;312&#8209;1 du code de l&#8217;action sociale et des familles, agissant sans but lucratif et dont la gestion est d&#233;sint&#233;ress&#233;e, lorsqu&#8217;ils h&#233;bergent &#224; titre permanent ou temporaire des personnes ou des familles en difficult&#233; ou en situation de d&#233;tresse ou confront&#233;es &#224; des difficult&#233;s sp&#233;cifiques.</p><p>II.&#160;&#8211;&#160;La perte de recettes r&#233;sultant pour l&#8217;&#201;tat du I est compens&#233;e, &#224; due concurrence, par la cr&#233;ation d&#8217;une taxe additionnelle aux droits pr&#233;vus aux articles 575 et 575&#160;A du code g&#233;n&#233;ral des imp&#244;ts.</p><p>&#160;</p>",
    "exposeSommaire": "<p>&#160;</p><p>La loi relative &#224; l&#8217;h&#244;pital, aux patients, &#224; la sant&#233; et aux territoires a &#233;tendu en son article&#160;124 II, le dispositif de la TVA &#224; taux r&#233;duit concernant certaines op&#233;rations de travaux aux &#233;tablissements h&#233;bergeant des enfants handicap&#233;s, sachant que la loi DALO du 5 mars 2007 avait ouvert le b&#233;n&#233;fice de la TVA &#224; taux r&#233;duit pour les op&#233;rations de travaux conduits par les &#233;tablissements m&#233;dico-sociaux pour personnes handicap&#233;es adultes et pour personnes &#226;g&#233;es, &#224; but non lucratif. Ces dispositions ont &#233;t&#233; codifi&#233;es depuis &#224; l&#8217;article&#160;278 sexies du code g&#233;n&#233;ral des imp&#244;ts.</p><p>A ce jour, certains &#233;tablissements avec h&#233;bergement accueillant des personnes ou des familles en difficult&#233; ou en situation de d&#233;tresse ou confront&#233;es &#224; des difficult&#233;s sp&#233;cifiques ne font l&#8217;objet d&#8217;aucune disposition explicite dans le Code G&#233;n&#233;ral des Imp&#244;ts ou le BOFIP ou le Code de la Construction et de l&#8217;Habitation</p><p>Au regard des besoins sociaux et des programmes d&#8217;action des pouvoirs publics, cet amendement propose donc d&#8217;apporter une clarification et une simplification du statut fiscal des op&#233;rations de construction et de r&#233;novation dans ces domaines mis en &#339;uvre notamment par le secteur associatif et caritatif.</p><p>Par ailleurs, dans le cadre des travaux parlementaires sur la Loi portant Evolution du Logement de l&#8217;Am&#233;nagement et du Num&#233;rique (ELAN), tant devant l&#8217;Assembl&#233;e Nationale que le S&#233;nat, un amendement similaire avait &#233;t&#233; discut&#233; et le Gouvernement avait indiqu&#233; &#171;&#160;partager les objectifs&#160;&#187;, en indiquant qu&#8217;il r&#233;pondrait &#224; sa l&#233;gitimit&#233; soit par un amendement dans le cadre du pr&#233;sent projet de loi de finances, soit par voie r&#233;glementaire.</p><p>Cet amendement&#160;a&#160;donc&#160;vocation &#224; attirer l&#8217;attention du Gouvernement sur&#160;l&#8217;importance&#160;de concr&#233;tiser les engagements qu&#8217;il a pris devant le Parlement.</p>",
    "annexeExposeSommaire": {
      "@xmlns:xsi": "http://www.w3.org/2001/XMLSchema-instance",
      "@xsi:nil": "true"
    },
    "cartoucheDelaiDepotDepasse": {
      "@xmlns:xsi": "http://www.w3.org/2001/XMLSchema-instance",
      "@xsi:nil": "true"
    }
  },
  "representations": {
    "representation": {
      "nom": "PDF",
      "typeMime": {
        "type": "application",
        "subType": "PDF"
      },
      "statutRepresentation": {
        "verbatim": "true",
        "canonique": "true",
        "officielle": "true",
        "transcription": "false",
        "enregistrement": "false"
      },
      "repSource": {
        "@xmlns:xsi": "http://www.w3.org/2001/XMLSchema-instance",
        "@xsi:nil": "true"
      },
      "offset": {
        "@xmlns:xsi": "http://www.w3.org/2001/XMLSchema-instance",
        "@xsi:nil": "true"
      },
      "contenu": {
        "documentURI": "/15/amendements/1490/AN/330.pdf"
      },
      "dateDispoRepresentation": {
        "@xmlns:xsi": "http://www.w3.org/2001/XMLSchema-instance",
        "@xsi:nil": "true"
      }
    }
  },
  "seanceDiscussion": {
    "@xmlns:xsi": "http://www.w3.org/2001/XMLSchema-instance",
    "@xsi:nil": "true"
  },
  "sort": {
    "@xmlns:xsi": "http://www.w3.org/2001/XMLSchema-instance",
    "@xsi:nil": "true"
  },
  "dateDepot": "2018-12-14T01:00:00.000+01:00",
  "dateDistribution": "2018-12-16T01:00:00.000+01:00",
  "article99": "0",
  "loiReference": {
    "codeLoi": {
      "@xmlns:xsi": "http://www.w3.org/2001/XMLSchema-instance",
      "@xsi:nil": "true"
    },
    "divisionCodeLoi": {
      "@xmlns:xsi": "http://www.w3.org/2001/XMLSchema-instance",
      "@xsi:nil": "true"
    }
  }
}