{
  "@xmlns": "http://schemas.assemblee-nationale.fr/referentiel",
  "uid": "AMANR5L15PO59048B2296P0D1N8",
  "identifiant": {
    "legislature": "15",
    "numero": "8",
    "numRect": "0",
    "saisine": {
      "refTexteLegislatif": "PRJLANR5L15B2296",
      "numeroPartiePLF": "0",
      "organeExamen": "PO59048",
      "mentionSecondeDeliberation": "0"
    }
  },
  "numeroLong": "CF8",
  "etapeTexte": "1ère lecture (1ère assemblée saisie)",
  "triAmendement": "bacaaaaaaaaaaaaaaaaaaaaaaaaaaaaaaaaaaaaaaaaaaaaaaah",
  "cardinaliteAmdtMultiples": "1",
  "amendementParent": {
    "@xmlns:xsi": "http://www.w3.org/2001/XMLSchema-instance",
    "@xsi:nil": "true"
  },
  "etat": "Discuté",
  "signataires": {
    "auteur": {
      "typeAuteur": "Depute",
      "acteurRef": "PA720092",
      "organeRef": {
        "@xmlns:xsi": "http://www.w3.org/2001/XMLSchema-instance",
        "@xsi:nil": "true"
      },
      "groupePolitiqueRef": "PO730970"
    },
    "cosignataires": {
      "acteurRef": [
        "PA720002",
        "PA720092",
        "PA720728",
        "PA718978",
        "PA721836",
        "PA720652"
      ]
    },
    "texteAffichable": "M.&#160;Ramos,  Mme&#160;El Ha&#239;ry, M.&#160;Barrot, M.&#160;Duverg&#233;, M.&#160;Laqhila et M.&#160;Mattei"
  },
  "pointeurFragmentTexte": {
    "missionVisee": {
      "@xmlns:xsi": "http://www.w3.org/2001/XMLSchema-instance",
      "@xsi:nil": "true"
    },
    "division": {
      "titre": "Article 9",
      "articleDesignationCourte": "APRÈS ART. 9",
      "type": "ARTICLE",
      "avant_A_Apres": "Après",
      "divisionRattachee": "APRÈS L'ARTICLE 9, insérer l'article suivant:",
      "articleAdditionnel": "1",
      "chapitreAdditionnel": {
        "@xmlns:xsi": "http://www.w3.org/2001/XMLSchema-instance",
        "@xsi:nil": "true"
      },
      "urlDivisionTexteVise": "/15/textes/2296.asp#D_Article_9"
    },
    "alinea": {
      "@xmlns:xsi": "http://www.w3.org/2001/XMLSchema-instance",
      "@xsi:nil": "true"
    }
  },
  "corps": {
    "dispositif": "<p style=\"text-align: justify;\">La section&#160;III du chapitre&#160;II du&#160;titre&#160;III de la deuxi&#232;me partie du livre I<sup>er</sup> du code g&#233;n&#233;ral des imp&#244;ts est compl&#233;t&#233;e par un article&#160;1613&#160;<i>ter</i>&#160;A ainsi r&#233;dig&#233;&#160;:</p><p style=\"text-align: justify;\">&#171;&#160;<i>Art.&#160;1613&#160;<i>ter</i>&#160;A</i>.&#160;&#8211;&#160;I.&#160;&#8211;&#160;Il est institu&#233; au profit de la caisse nationale de l&#8217;assurance maladie des travailleurs salari&#233;s, une contribution per&#231;ue sur les produits de charcuterie (andouilles, andouillettes, boudins blancs et noirs, charcuteries p&#226;tissi&#232;res, jambons, lardons, p&#226;t&#233;s, terrines, rillettes, saucisses, saucissons, tripes) destin&#233;s&#160;&#224; la consommation humaine&#160;:</p><p style=\"text-align: justify;\">&#171;&#160;1&#176;&#160;Relevant des codes SH16010099 et SH&#160;16024190&#160;de la nomenclature douani&#232;re&#160;;</p><p style=\"text-align: justify;\">&#171;&#160;2&#176;&#160;Contenant des additifs nitr&#233;s (nitrite, nitrate et/ou sel nitrit&#233;)&#160;;</p><p style=\"text-align: justify;\">&#171;&#160;3&#176;&#160;Conditionn&#233;s dans des r&#233;cipients destin&#233;s &#224; la vente au d&#233;tail, soit directement, soit par l&#8217;interm&#233;diaire d&#8217;un professionnel.</p><p style=\"text-align: justify;\">&#171;&#160;II.&#160;&#8211;&#160;Le taux de la contribution est fix&#233; &#224;&#160;0.10 centimes d&#8217;euros par&#160;kilogramme. Ce tarif est relev&#233; au&#160;1<sup>er</sup>&#160;janvier de&#160;chaque&#160;ann&#233;e, &#224;&#160;compter du&#160;1<sup>er</sup>&#160;janvier&#160;2021, dans une proportion &#233;gale au taux de croissance de l&#8217;indice des prix &#224; la consommation hors tabac de l&#8217;avant-derni&#232;re ann&#233;e. Il est exprim&#233; avec deux&#160;chiffres&#160;significatifs apr&#232;s la virgule, le deuxi&#232;me chiffre &#233;tant augment&#233; d&#8217;une unit&#233; si le chiffre suivant est &#233;gal ou sup&#233;rieur &#224;&#160;cinq. Il est constat&#233; par arr&#234;t&#233; du ministre charg&#233; du budget, publi&#233; au Journal officiel.</p><p style=\"text-align: justify;\">&#171;&#160;III.&#160;&#8211;&#160;1&#176;&#160;La contribution est due &#224; raison des produits de charcuterie mentionn&#233;s au&#160;I par leurs fabricants &#233;tablis en France, leurs importateurs et les personnes qui r&#233;alisent en France des acquisitions intracommunautaires, sur toutes les quantit&#233;s livr&#233;es &#224; titre on&#233;reux ou&#160;gratuit&#160;;</p><p style=\"text-align: justify;\">&#171;&#160;2&#176;&#160;Sont &#233;galement redevables de la contribution les personnes qui, dans le cadre de leur activit&#233; commerciale, fournissent &#224; titre on&#233;reux ou gratuit &#224; leurs clients des produits de charcuterie en l&#8217;&#233;tat mentionn&#233;es au&#160;I, dont elles ont pr&#233;alablement assembl&#233; les diff&#233;rents composants pr&#233;sent&#233;s dans des r&#233;cipients non destin&#233;s &#224; la vente au d&#233;tail.</p><p style=\"text-align: justify;\">&#171;&#160;IV.&#160;&#8211;&#160;Les exp&#233;ditions vers un autre&#160;&#201;tat membre de&#160;l&#8217;Union&#160;europ&#233;enne ou&#160;un&#160;autre&#160;&#201;tat partie &#224; l&#8217;accord sur l&#8217;Espace &#233;conomique europ&#233;en ainsi que les exportations vers un pays&#160;tiers sont exon&#233;r&#233;es de la contribution lorsqu&#8217;elles sont r&#233;alis&#233;es directement par les personnes mentionn&#233;es au&#160;1&#176;&#160;du&#160;III.</p><p style=\"text-align: justify;\">&#171;&#160;Les personnes qui acqui&#232;rent aupr&#232;s d&#8217;un redevable de la contribution, qui re&#231;oivent en provenance d&#8217;un&#160;autre &#201;tat&#160;membre de&#160;l&#8217;Union&#160;europ&#233;enne ou d&#8217;un&#160;autre &#201;tat&#160;partie &#224; l&#8217;accord sur l&#8217;Espace &#233;conomique europ&#233;en, ou qui importent en provenance de pays tiers des produits mentionn&#233;s au&#160;I qu&#8217;elles destinent &#224; une livraison vers un autre &#201;tat membre de l&#8217;Union europ&#233;enne ou un autre &#201;tat partie &#224; l&#8217;accord sur l&#8217;Espace &#233;conomique europ&#233;en, ou &#224; une exportation vers un pays&#160;tiers, acqui&#232;rent, re&#231;oivent ou importent ces produits en franchise de la contribution.</p><p style=\"text-align: justify;\">&#171;&#160;Pour b&#233;n&#233;ficier des dispositions du pr&#233;c&#233;dent alin&#233;a, les int&#233;ress&#233;s doivent adresser au fournisseur, lorsqu&#8217;il est situ&#233; en&#160;France, et dans tous les cas au service des douanes dont ils d&#233;pendent, une attestation certifiant que les produits de charcuterie sont destin&#233;s &#224; faire l&#8217;objet d&#8217;une livraison ou d&#8217;une exportation mentionn&#233;e au pr&#233;c&#233;dent alin&#233;a. Cette attestation comporte l&#8217;engagement d&#8217;acquitter la contribution au cas o&#249; le produit ne recevrait pas la destination qui a motiv&#233; la franchise. Une copie de l&#8217;attestation est conserv&#233;e &#224; l&#8217;appui de la comptabilit&#233; des int&#233;ress&#233;s.</p><p style=\"text-align: justify;\">&#171;&#160;V.&#160;&#8211;&#160;La contribution mentionn&#233;e au&#160;I est acquitt&#233;e aupr&#232;s de l&#8217;administration des douanes. Elle est recouvr&#233;e et contr&#244;l&#233;e selon les r&#232;gles, sanctions, garanties et privil&#232;ges applicables au droit sp&#233;cifique mentionn&#233; au&#160;II de&#160;l&#8217;article&#160;520&#160;A. Le droit de reprise de l&#8217;administration s&#8217;exerce dans les m&#234;mes d&#233;lais.&#160;&#187;</p>",
    "exposeSommaire": "<p style=\"text-align: justify;\">La mesure propos&#233;e consiste &#224; cr&#233;er une contribution sp&#233;cifique frappant les produits de charcuterie contenant des additifs nitr&#233;s. Cette contribution s&#8217;inscrit dans le cadre du plan national nutrition sant&#233; publique qui promeut une alimentation &#233;quilibr&#233;e comme composante essentielle de la sant&#233; publique.</p><p style=\"text-align: justify;\">La charcuterie industrielle est en effet le seul produit alimentaire, avec le poisson sal&#233; &#224; la mode cantonaise, class&#233; comme agent canc&#233;rig&#232;ne pour l&#8217;homme de niveau 1 par l&#8217;Organisation mondiale de la sant&#233; (OMS) depuis 2015.</p><p style=\"text-align: justify;\">Le centre international de recherche sur le cancer de l&#8217;OMS &#233;value que &#171;&#160;chaque portion de 50 grammes de viande transform&#233;e consomm&#233;e tous les jours augmente le risque de cancer colorectal de 18&#160;% environ.&#160;&#187;</p><p style=\"text-align: justify;\">Le caract&#232;re canc&#233;rig&#232;ne de la charcuterie tient &#224; l&#8217;ajout d&#8217;additifs nitr&#233;s dans les produits de charcuterie (nitrates, nitrites, sel nitrit&#233;), alors que ces additifs ne sont pas n&#233;cessaires.</p><p style=\"text-align: justify;\">Le montant de la contribution envisag&#233;e, qui s&#8217;&#233;l&#232;ve &#224;&#160;0.10 centimes d&#8217;euros par kilogramme, vise, en augmentant le prix de ces produits, &#224; dissuader le consommateur et &#224; l&#8217;orienter vers des produits similaires mais exempts d&#8217;additifs nitr&#233;s.</p><p style=\"text-align: justify;\">Les produits concern&#233;s par la contribution sont les produits de charcuterie dans leur ensemble (jambon, saucisson, p&#226;t&#233;, rillettes&#8230;), quel que soit leur circuit de distribution.</p><p style=\"text-align: justify;\">Le produit de la contribution est affect&#233; au r&#233;gime g&#233;n&#233;ral de l&#8217;Assurance maladie, sur lequel repose le financement des politiques de sant&#233; publique.</p><p style=\"text-align: justify;\">&#160;</p>",
    "annexeExposeSommaire": {
      "@xmlns:xsi": "http://www.w3.org/2001/XMLSchema-instance",
      "@xsi:nil": "true"
    },
    "cartoucheDelaiDepotDepasse": {
      "@xmlns:xsi": "http://www.w3.org/2001/XMLSchema-instance",
      "@xsi:nil": "true"
    },
    "avantAppel": {
      "@xmlns:xsi": "http://www.w3.org/2001/XMLSchema-instance",
      "@xsi:nil": "true"
    }
  },
  "representations": {
    "representation": {
      "nom": "PDF",
      "typeMime": {
        "type": "application",
        "subType": "PDF"
      },
      "statutRepresentation": {
        "verbatim": "true",
        "canonique": "true",
        "officielle": "true",
        "transcription": "false",
        "enregistrement": "false"
      },
      "repSource": {
        "@xmlns:xsi": "http://www.w3.org/2001/XMLSchema-instance",
        "@xsi:nil": "true"
      },
      "offset": {
        "@xmlns:xsi": "http://www.w3.org/2001/XMLSchema-instance",
        "@xsi:nil": "true"
      },
      "contenu": {
        "documentURI": "/15/amendements/2296/CION_FIN/CF8.pdf"
      },
      "dateDispoRepresentation": {
        "@xmlns:xsi": "http://www.w3.org/2001/XMLSchema-instance",
        "@xsi:nil": "true"
      }
    }
  },
  "seanceDiscussion": {
    "@xmlns:xsi": "http://www.w3.org/2001/XMLSchema-instance",
    "@xsi:nil": "true"
  },
  "sort": {
    "dateSaisie": "2019-10-16T12:00:45.000+02:00",
    "sortEnSeance": "Rejeté"
  },
  "dateDepot": "2019-10-12T02:00:00.000+02:00",
  "dateDistribution": "2019-10-16T02:00:00.000+02:00",
  "article99": "0",
  "loiReference": {
    "codeLoi": "CGI",
    "divisionCodeLoi": {
      "@xmlns:xsi": "http://www.w3.org/2001/XMLSchema-instance",
      "@xsi:nil": "true"
    }
  }
}