{
  "@xmlns": "http://schemas.assemblee-nationale.fr/referentiel",
  "uid": "AMANR5L15SEA717460B0384P0D1N488",
  "identifiant": {
    "legislature": "15",
    "numero": "488",
    "numRect": "0",
    "saisine": {
      "refTexteLegislatif": "PRJLANR5L15B0384",
      "numeroPartiePLF": "0",
      "organeExamen": "PO717460",
      "mentionSecondeDeliberation": "0"
    }
  },
  "numeroLong": "488",
  "etapeTexte": "1ère lecture (1ère assemblée saisie)",
  "triAmendement": "c",
  "cardinaliteAmdtMultiples": "1",
  "amendementParent": {
    "@xmlns:xsi": "http://www.w3.org/2001/XMLSchema-instance",
    "@xsi:nil": "true"
  },
  "etat": "Discuté",
  "signataires": {
    "auteur": {
      "typeAuteur": "Depute",
      "acteurRef": "PA719540",
      "organeRef": {
        "@xmlns:xsi": "http://www.w3.org/2001/XMLSchema-instance",
        "@xsi:nil": "true"
      },
      "groupePolitiqueRef": "PO730964"
    },
    "cosignataires": {
      "acteurRef": "PA719540"
    },
    "texteAffichable": "Mme&#160;Toutut-Picard"
  },
  "pointeurFragmentTexte": {
    "missionVisee": {
      "@xmlns:xsi": "http://www.w3.org/2001/XMLSchema-instance",
      "@xsi:nil": "true"
    },
    "division": {
      "titre": "Article 19",
      "articleDesignationCourte": "APRÈS ART. 19",
      "type": "ARTICLE",
      "avant_A_Apres": "Après",
      "divisionRattachee": "APRÈS L'ARTICLE 19, insérer l'article suivant:",
      "articleAdditionnel": "1",
      "chapitreAdditionnel": {
        "@xmlns:xsi": "http://www.w3.org/2001/XMLSchema-instance",
        "@xsi:nil": "true"
      },
      "urlDivisionTexteVise": "/15/textes/0384.asp#D_Article_19"
    },
    "alinea": {
      "@xmlns:xsi": "http://www.w3.org/2001/XMLSchema-instance",
      "@xsi:nil": "true"
    }
  },
  "corps": {
    "dispositif": "<p style=\"text-align: justify;\">I.&#160;&#8211;&#160;Apr&#232;s l&#8217;article L.&#160;131&#8209;5&#8209;1 du code de l&#8217;environnement, il est ins&#233;r&#233; un article L.&#160;131&#8209;5&#8209;2 ainsi r&#233;dig&#233;&#160;:</p><p style=\"text-align: justify;\">&#171;&#160;<i>Art.&#160;L.&#160;131&#8209;5&#8209;2</i>.&#160;&#8211;&#160;&#192; compter du 1<sup>er</sup> janvier 2019, le produit de la taxe mentionn&#233;e &#224; l&#8217;article&#160;266&#160;<i>quinquies</i> du code des douanes est affect&#233; &#224; l&#8217;Agence de l&#8217;environnement et de la ma&#238;trise de l&#8217;&#233;nergie &#224; hauteur de 0,53&#160;euro par m&#233;gawattheure d&#251; par chaque redevable&#160;&#187;.</p><p style=\"text-align: justify;\">II.&#160;&#8211;&#160;La perte de recettes pour l&#8217;&#201;tat r&#233;sultant de l&#8217;alin&#233;a pr&#233;c&#233;dent est compens&#233;e, &#224; due concurrence, par la cr&#233;ation d&#8217;une taxe additionnelle aux droits pr&#233;vus aux articles 575 et 575 A du code g&#233;n&#233;ral des imp&#244;ts.&#160;</p>",
    "exposeSommaire": "<p style=\"text-align: justify;\">La chaleur repr&#233;sente pr&#232;s de 50&#160;% des besoins &#233;nerg&#233;tiques de la France. Elle est aujourd&#8217;hui massivement produite par des &#233;nergies fossiles import&#233;es et &#233;mettrices de gaz &#224; effet de serre. Les objectifs &#233;nerg&#233;tiques de la France sont d&#8217;atteindre 23&#160;% en 2020 puis 32&#160;% en 2030 d&#8217;&#233;nergies renouvelables dans notre consommation et de multiplier par 5 la quantit&#233; d&#8217;&#233;nergies renouvelables et de r&#233;cup&#233;ration dans les r&#233;seaux de chaleur et de froid entre 2012 et 2030.</p><p style=\"text-align: justify;\">Le Fonds chaleur, g&#233;r&#233; par l&#8217;ADEME, est un des dispositifs de soutien &#224; la chaleur renouvelable les plus efficaces. Il a permis entre 2009 et 2016 de financer 4000 installations et 1880 km de r&#233;seaux de chaleur en d&#233;clenchant 5,15 milliards d&#8217;euros d&#8217;investissements pour 1,57Mds&#8364; apport&#233;s (220M&#8364;/an en 2014, 2015 et 2016). Pour autant, la dynamique de d&#233;veloppement de la chaleur renouvelable doit &#234;tre acc&#233;l&#233;r&#233;e pour atteindre nos objectifs.</p><p style=\"text-align: justify;\">Le Pr&#233;sident de la R&#233;publique s&#8217;est engag&#233; &#224; doubler l&#8217;enveloppe du Fonds chaleur. Cet amendement propose de concr&#233;tiser ce doublement par une affectation d&#8217;une partie de l&#8217;augmentation de la TICGN au Fonds chaleur (0,53&#160;&#8364;/MWh pour 420 TWh de gaz consomm&#233;, soit 220 millions d&#8217;euros).</p>",
    "annexeExposeSommaire": {
      "@xmlns:xsi": "http://www.w3.org/2001/XMLSchema-instance",
      "@xsi:nil": "true"
    }
  },
  "representations": {
    "representation": {
      "nom": "PDF",
      "typeMime": {
        "type": "application",
        "subType": "PDF"
      },
      "statutRepresentation": {
        "verbatim": "true",
        "canonique": "true",
        "officielle": "true",
        "transcription": "false",
        "enregistrement": "false"
      },
      "repSource": {
        "@xmlns:xsi": "http://www.w3.org/2001/XMLSchema-instance",
        "@xsi:nil": "true"
      },
      "offset": {
        "@xmlns:xsi": "http://www.w3.org/2001/XMLSchema-instance",
        "@xsi:nil": "true"
      },
      "contenu": {
        "documentURI": "/15/amendements/0384/AN/488.pdf"
      },
      "dateDispoRepresentation": {
        "@xmlns:xsi": "http://www.w3.org/2001/XMLSchema-instance",
        "@xsi:nil": "true"
      }
    }
  },
  "seanceDiscussion": "RUANR5L15S2018IDS20818",
  "sort": {
    "dateSaisie": "2017-12-07T00:09:36.000+01:00",
    "sortEnSeance": "Non soutenu"
  },
  "dateDepot": "2017-11-30T01:00:00.000+01:00",
  "dateDistribution": "2017-12-04T01:00:00.000+01:00",
  "article99": "0",
  "loiReference": {
    "codeLoi": "c environnement",
    "divisionCodeLoi": "L131-5-1 bis"
  }
}