{
  "@xmlns": "http://schemas.assemblee-nationale.fr/referentiel",
  "uid": "AMANR5L15SEA717460BTC2063P0D1N816",
  "identifiant": {
    "legislature": "15",
    "numero": "816",
    "numRect": "1",
    "saisine": {
      "refTexteLegislatif": "PRJLANR5L15BTC2063",
      "numeroPartiePLF": "0",
      "organeExamen": "PO717460",
      "mentionSecondeDeliberation": "0"
    }
  },
  "numeroLong": "816 (Rect)",
  "etapeTexte": "1ère lecture (1ère assemblée saisie)",
  "triAmendement": "jbaaaaaaaaaaaaaaaaaaaaaaaaaaaaaaaaaaaaaaaaaaaaaaaabbeno",
  "cardinaliteAmdtMultiples": "1",
  "amendementParent": {
    "@xmlns:xsi": "http://www.w3.org/2001/XMLSchema-instance",
    "@xsi:nil": "true"
  },
  "etat": "Discuté",
  "signataires": {
    "auteur": {
      "typeAuteur": "Depute",
      "acteurRef": "PA342415",
      "organeRef": {
        "@xmlns:xsi": "http://www.w3.org/2001/XMLSchema-instance",
        "@xsi:nil": "true"
      },
      "groupePolitiqueRef": "PO758835"
    },
    "cosignataires": {
      "acteurRef": "PA342415"
    },
    "texteAffichable": "Mme&#160;Battistel"
  },
  "pointeurFragmentTexte": {
    "missionVisee": {
      "@xmlns:xsi": "http://www.w3.org/2001/XMLSchema-instance",
      "@xsi:nil": "true"
    },
    "division": {
      "titre": "Article 6",
      "articleDesignationCourte": "APRÈS ART. 6",
      "type": "ARTICLE",
      "avant_A_Apres": "Après",
      "divisionRattachee": "APRÈS L'ARTICLE 6, insérer l'article suivant:",
      "articleAdditionnel": "1",
      "chapitreAdditionnel": {
        "@xmlns:xsi": "http://www.w3.org/2001/XMLSchema-instance",
        "@xsi:nil": "true"
      },
      "urlDivisionTexteVise": "/15/textes/2063.asp#D_Article_6"
    },
    "alinea": {
      "@xmlns:xsi": "http://www.w3.org/2001/XMLSchema-instance",
      "@xsi:nil": "true"
    }
  },
  "corps": {
    "dispositif": "<p style=\"text-align: justify;\">Apr&#232;s l&#8217;article L.&#160;511&#8209;6 du code de l&#8217;&#233;nergie, il est ins&#233;r&#233; un article L.&#160;511&#8209;6&#8209;1 ainsi r&#233;dig&#233;&#160;:</p><p style=\"text-align: justify;\">&#171;&#160;Art.&#160;L.&#160;511&#8209;6&#8209;1.&#160;&#8211;&#160;Afin d&#8217;optimiser l&#8217;exploitation d&#8217;une concession hydro&#233;lectrique et de contribuer &#224; l&#8217;atteinte des objectifs nationaux et europ&#233;ens de d&#233;veloppement des &#233;nergies &#233;lectriques renouvelables, la puissance d&#8217;une installation conc&#233;d&#233;e peut &#234;tre augment&#233;e d&#8217;au plus 15&#160;% de la puissance initialement pr&#233;vue au contrat par des travaux suppl&#233;mentaires qui ne figuraient pas au contrat initial, par d&#233;claration du concessionnaire &#224; l&#8217;autorit&#233; administrative ayant octroy&#233; la concession. Dans ce cas, l&#8217;article L.&#160;3135&#8209;1 du code de la commande publique n&#8217;est pas applicable.</p><p style=\"text-align: justify;\">&#171;&#160;L&#8217;autorit&#233; administrative susvis&#233;e dispose d&#8217;un d&#233;lai de trois mois, renouvelable une fois, apr&#232;s transmission du dossier de d&#233;claration d&#233;montrant que l&#8217;augmentation de puissance ne porte pas atteinte &#224; la s&#251;ret&#233; et &#224; la s&#233;curit&#233; des ouvrages, pour le cas &#233;ch&#233;ant s&#8217;y opposer par refus motiv&#233;. L&#8217;absence de r&#233;ponse de l&#8217;autorit&#233; administrative dans le d&#233;lai pr&#233;cit&#233; vaut acceptation.</p><p style=\"text-align: justify;\">&#171;&#160;Cette augmentation n&#8217;ouvre pas droit au dispositif de prolongation de dur&#233;e de la concession pr&#233;vu &#224; l&#8217;article L.&#160;521&#8209;16&#8209;3.</p><p style=\"text-align: justify;\">&#171;&#160;Un d&#233;cret en Conseil d&#8217;&#201;tat pr&#233;cise les modalit&#233;s d&#8217;application du pr&#233;sent article.&#160;&#187;</p>",
    "exposeSommaire": "<p>Le mix &#233;lectrique fran&#231;ais et europ&#233;en a connu ces derni&#232;res ann&#233;es de nombreuses mutations avec l&#8217;&#233;mergence de nouvelles technologies, telles que l&#8217;&#233;olien ou le solaire.</p><p style=\"text-align: justify;\">Ce mouvement est amen&#233; &#224; s&#8217;acc&#233;l&#233;rer encore en France, avec la maturit&#233; et le d&#233;veloppement exponentiel de ces technologies, l&#8217;arr&#234;t des centrales &#224; charbon et la r&#233;duction programm&#233;e de la part d&#8217;&#233;lectricit&#233; nucl&#233;aire.</p><p style=\"text-align: justify;\">La p&#233;n&#233;tration des &#233;nergies renouvelables intermittentes dans le mix impose de disposer de moyens pilotables, et donc de puissance flexible pour prendre le relais et assurer en permanence l&#8217;&#233;quilibre du r&#233;seau.</p><p style=\"text-align: justify;\">De plus, l&#8217;acc&#233;l&#233;ration de la r&#233;duction des &#233;missions de gaz &#224; effet de serre pour atteindre la neutralit&#233; carbone pr&#233;vue &#224; l&#8217;article&#160;1<sup>er</sup> du pr&#233;sent projet de loi, et la limitation dans cet objectif des &#233;missions du secteur de la production &#233;lectrique devant conduire &#224; la fermeture des centrales &#224; charbon, telle que pr&#233;vue par l&#8217;article&#160;3, vont rendre le besoin de nouveaux moyens de production pilotables, flexibles, mobilisables &#224; la pointe de consommation et non &#233;metteurs de gaz &#224; effet de serre, encore plus urgent.</p><p style=\"text-align: justify;\">L&#8217;hydro&#233;lectricit&#233; est pr&#233;cis&#233;ment une &#233;nergie renouvelable flexible, qui permet de r&#233;pondre &#224; ce besoin. Ainsi, &#224; ce jour, elle couvre la moiti&#233; de l&#8217;ajustement en &#233;nergie.</p><p style=\"text-align: justify;\">Il importe donc de la d&#233;velopper encore, pour garantir l&#8217;&#233;quilibre du mix de demain, et permettre l&#8217;atteinte des objectifs tant fran&#231;ais qu&#8217;europ&#233;ens en mati&#232;re de r&#233;duction des &#233;missions de gaz &#224; effet de serre et de d&#233;veloppement des &#233;nergies &#233;lectriques renouvelables, pour la transition &#233;nerg&#233;tique et la lutte contre le changement climatique.</p><p style=\"text-align: justify;\">Parmi les voies possibles, le d&#233;veloppement des installations d&#233;j&#224; existantes rencontre l&#8217;adh&#233;sion g&#233;n&#233;rale, comme a pu le constater la mission d&#8217;information relative aux freins &#224; la transition &#233;nerg&#233;tique &#224; l&#8217;occasion de l&#8217;audition consacr&#233;e &#224; l&#8217;hydro&#233;lectricit&#233;, le 4 avril dernier.</p><p style=\"text-align: justify;\">Pour favoriser le d&#233;veloppement des installations existantes, la LTECV a institu&#233; un dispositif de prolongation des concessions contre investissements n&#233;cessaires &#224; la transition &#233;nerg&#233;tique (article L 521&#8209;16&#8209;3 du code de l&#8217;&#233;nergie).</p><p style=\"text-align: justify;\">Pour autant, certains investissements pourraient &#234;tre r&#233;alis&#233;s sans n&#233;cessit&#233; de prolonger la concession concern&#233;e, le concessionnaire investissant &#224; ses frais et risques, et faisant le pari de la rentabilisation sur la dur&#233;e r&#233;siduelle de concession.</p><p style=\"text-align: justify;\">Plusieurs op&#233;rateurs ont indiqu&#233; &#224; la mission d&#8217;information qu&#8217;un r&#233;el potentiel existait &#224; ce titre. Celui-ci ne peut n&#233;anmoins &#234;tre d&#233;velopp&#233; pour des raisons juridiques li&#233;es &#224; la suppression de la disposition de l&#8217;article L.&#160;511&#8209;6 du Code de l&#8217;&#233;nergie qui permettait au titulaire d&#8217;une installation hydro&#233;lectrique conc&#233;d&#233;e d&#8217;augmenter la puissance de ses ouvrages, dans la limite de 20&#160;%, en faisant une simple d&#233;claration &#224; l&#8217;administration.</p><p style=\"text-align: justify;\">A l&#8217;heure de la transition &#233;nerg&#233;tique, alors qu&#8217;il est possible de b&#233;n&#233;ficier de nombreux progr&#232;s technologiques, emp&#234;cher tout d&#233;veloppement sur des concessions hydro&#233;lectriques en cours, et donc parfois pour des dizaines d&#8217;ann&#233;es, est un contre sens.</p><p style=\"text-align: justify;\">Le pr&#233;sent amendement vise donc &#224; combler ce vide en r&#233;introduisant dans notre droit la possibilit&#233; pour le concessionnaire d&#8217;augmenter la puissance de son installation au-del&#224; de ce qui &#233;tait pr&#233;vu au contrat initial, afin d&#8217;optimiser le fonctionnement de la concession et de contribuer ainsi &#224; l&#8217;atteinte des objectifs de d&#233;veloppement des &#233;nergies renouvelables, mais ce sans b&#233;n&#233;ficier en contrepartie d&#8217;un allongement de la dur&#233;e de sa concession.</p><p style=\"text-align: justify;\">Cette disposition, conforme au droit des concessions et en particulier aux articles L&#160;3135&#8209;1 et R&#160;3135&#8209;2 du code de la commande publique permet d&#8217;optimiser la concession tout en b&#233;n&#233;ficiant &#224; l&#8217;&#201;tat conc&#233;dant. En effet, les am&#233;nagements construits par le concessionnaire appartiennent et font retour &#224; l&#8217;&#201;tat, qui en b&#233;n&#233;ficie pour la r&#233;ussite de sa politique &#233;nergique, mais aussi de fa&#231;on patrimoniale.</p><p style=\"text-align: justify;\">Il est propos&#233; d&#8217;exclure l&#8217;application des articles R.&#160;3135&#8209;3 et R.&#160;3135&#8209;4 du code de la commande publique, &#224; cette augmentation de puissance. Ils pr&#233;voient en effet que le montant de la modification ne peut &#234;tre sup&#233;rieur &#224; 50&#160;% du montant du contrat initial. Or, il est particuli&#232;rement difficile d&#8217;&#233;tablir a posteriori le montant initial d&#8217;une concession hydro&#233;lectrique, et donc de d&#233;montrer le montant modifi&#233;, m&#234;me si une augmentation de 15&#160;% ne devrait en tout &#233;tat de cause pas d&#233;passer le seuil de 50&#160;%.</p><p style=\"text-align: justify;\">Enfin, le pr&#233;sent amendement donne &#224; l&#8217;&#201;tat la possibilit&#233; de s&#8217;opposer &#224; la demande d&#8217;augmentation de puissance si celle-ci pr&#233;sentait un risque pour la s&#251;ret&#233; ou la s&#233;curit&#233;. On rappellera que la r&#233;alisation des travaux imposera le respect des proc&#233;dures, notamment environnementales, en vigueur, m&#234;me une fois acquis le droit de principe d&#8217;augmentation de puissance.</p>",
    "annexeExposeSommaire": {
      "@xmlns:xsi": "http://www.w3.org/2001/XMLSchema-instance",
      "@xsi:nil": "true"
    },
    "cartoucheDelaiDepotDepasse": {
      "@xmlns:xsi": "http://www.w3.org/2001/XMLSchema-instance",
      "@xsi:nil": "true"
    }
  },
  "representations": {
    "representation": {
      "nom": "PDF",
      "typeMime": {
        "type": "application",
        "subType": "PDF"
      },
      "statutRepresentation": {
        "verbatim": "true",
        "canonique": "true",
        "officielle": "true",
        "transcription": "false",
        "enregistrement": "false"
      },
      "repSource": {
        "@xmlns:xsi": "http://www.w3.org/2001/XMLSchema-instance",
        "@xsi:nil": "true"
      },
      "offset": {
        "@xmlns:xsi": "http://www.w3.org/2001/XMLSchema-instance",
        "@xsi:nil": "true"
      },
      "contenu": {
        "documentURI": "/15/amendements/2063/AN/816.pdf"
      },
      "dateDispoRepresentation": {
        "@xmlns:xsi": "http://www.w3.org/2001/XMLSchema-instance",
        "@xsi:nil": "true"
      }
    }
  },
  "seanceDiscussion": "RUANR5L15S2019IDS21739",
  "sort": {
    "dateSaisie": "2019-06-28T16:36:04.000+02:00",
    "sortEnSeance": "Retiré"
  },
  "dateDepot": "2019-06-22T02:00:00.000+02:00",
  "dateDistribution": "2019-06-27T02:00:00.000+02:00",
  "article99": "0",
  "loiReference": {
    "codeLoi": "c énergie",
    "divisionCodeLoi": "L511-6-1"
  }
}