{
  "@xmlns": "http://schemas.assemblee-nationale.fr/referentiel",
  "uid": "AMANR5L15SEA717460BTC0575P0D1N976",
  "identifiant": {
    "legislature": "15",
    "numero": "976",
    "numRect": "0",
    "saisine": {
      "refTexteLegislatif": "PRJLANR5L15BTC0575",
      "numeroPartiePLF": "0",
      "organeExamen": "PO717460",
      "mentionSecondeDeliberation": "0"
    }
  },
  "numeroLong": "976",
  "etapeTexte": "1ère lecture (1ère assemblée saisie)",
  "triAmendement": "dhy",
  "cardinaliteAmdtMultiples": "1",
  "amendementParent": {
    "@xmlns:xsi": "http://www.w3.org/2001/XMLSchema-instance",
    "@xsi:nil": "true"
  },
  "etat": "Discuté",
  "signataires": {
    "auteur": {
      "typeAuteur": "Depute",
      "acteurRef": "PA1327",
      "organeRef": {
        "@xmlns:xsi": "http://www.w3.org/2001/XMLSchema-instance",
        "@xsi:nil": "true"
      },
      "groupePolitiqueRef": "PO730934"
    },
    "cosignataires": {
      "acteurRef": "PA1327"
    },
    "texteAffichable": "M.&#160;Forissier"
  },
  "pointeurFragmentTexte": {
    "missionVisee": {
      "@xmlns:xsi": "http://www.w3.org/2001/XMLSchema-instance",
      "@xsi:nil": "true"
    },
    "division": {
      "titre": "Article 20",
      "articleDesignationCourte": "APRÈS ART. 20",
      "type": "ARTICLE",
      "avant_A_Apres": "Après",
      "divisionRattachee": "APRÈS L'ARTICLE 20, insérer l'article suivant:",
      "articleAdditionnel": "1",
      "chapitreAdditionnel": {
        "@xmlns:xsi": "http://www.w3.org/2001/XMLSchema-instance",
        "@xsi:nil": "true"
      },
      "urlDivisionTexteVise": "/15/textes/0575.asp#D_Article_20"
    },
    "alinea": {
      "@xmlns:xsi": "http://www.w3.org/2001/XMLSchema-instance",
      "@xsi:nil": "true"
    }
  },
  "corps": {
    "dispositif": "<p style=\"text-align: justify;\">Au I de l&#8217;article L.&#160;415&#8209;7 du code de l&#8217;environnement, les mots&#160;: &#171;&#160;puni de six mois d&#8217;emprisonnement et de 30 000&#160;euros d&#8217;amende&#160;&#187;, sont remplac&#233;s par les mots&#160;: &#171;&#160;passible d&#8217;une amende administrative, prononc&#233;e par l&#8217;autorit&#233; administrative comp&#233;tente, dont le montant ne peut exc&#233;der 15&#160;000&#160;euros,&#160;&#187;.</p>",
    "exposeSommaire": "<p style=\"text-align: justify;\">Cet amendement propose de remplacer les sanctions p&#233;nales pr&#233;vues en cas de non-respect de la proc&#233;dure d&#8217;&#233;valuation Natura 2000, par une sanction administrative. Cela devrait permettre de maintenir le caract&#232;re dissuasif de l&#8217;infraction, tout en enlevant le caract&#232;re p&#233;nal, qui peut paraitre disproportionn&#233; au regard de l&#8217;acte vis&#233; (une absence de d&#233;claration). Il propose de supprimer la peine privative de libert&#233; (6 mois), de transformer l&#8217;amende p&#233;nale en amende administrative et d&#8217;en r&#233;duire le montant (de 30 000&#160;&#8364; &#224; 15 000&#160;&#8364;).</p>",
    "annexeExposeSommaire": {
      "@xmlns:xsi": "http://www.w3.org/2001/XMLSchema-instance",
      "@xsi:nil": "true"
    }
  },
  "representations": {
    "representation": {
      "nom": "PDF",
      "typeMime": {
        "type": "application",
        "subType": "PDF"
      },
      "statutRepresentation": {
        "verbatim": "true",
        "canonique": "true",
        "officielle": "true",
        "transcription": "false",
        "enregistrement": "false"
      },
      "repSource": {
        "@xmlns:xsi": "http://www.w3.org/2001/XMLSchema-instance",
        "@xsi:nil": "true"
      },
      "offset": {
        "@xmlns:xsi": "http://www.w3.org/2001/XMLSchema-instance",
        "@xsi:nil": "true"
      },
      "contenu": {
        "documentURI": "/15/amendements/0575/AN/976.pdf"
      },
      "dateDispoRepresentation": {
        "@xmlns:xsi": "http://www.w3.org/2001/XMLSchema-instance",
        "@xsi:nil": "true"
      }
    }
  },
  "seanceDiscussion": "RUANR5L15S2018IDS20867",
  "sort": {
    "dateSaisie": "2018-01-25T10:16:43.000+01:00",
    "sortEnSeance": "Non soutenu"
  },
  "dateDepot": "2018-01-19T01:00:00.000+01:00",
  "dateDistribution": "2018-01-22T01:00:00.000+01:00",
  "article99": "0",
  "loiReference": {
    "codeLoi": "c environnement",
    "divisionCodeLoi": "L415-7"
  }
}