{
  "@xmlns": "http://schemas.assemblee-nationale.fr/referentiel",
  "uid": "AMANR5L15SEA717460B1255P2D1N1422",
  "identifiant": {
    "legislature": "15",
    "numero": "1422",
    "numRect": "0",
    "saisine": {
      "refTexteLegislatif": "PRJLANR5L15B1255",
      "numeroPartiePLF": "2",
      "organeExamen": "PO717460",
      "mentionSecondeDeliberation": "0"
    }
  },
  "numeroLong": "II-1422",
  "etapeTexte": "1ère lecture (1ère assemblée saisie)",
  "triAmendement": "fbaaaaaaaaaaaaaaaaaaaaaaaaaaaaaaaaaaaaaaaaaaaaaaaaibdddzzzzu",
  "cardinaliteAmdtMultiples": "1",
  "amendementParent": {
    "@xmlns:xsi": "http://www.w3.org/2001/XMLSchema-instance",
    "@xsi:nil": "true"
  },
  "etat": "Discuté",
  "signataires": {
    "auteur": {
      "typeAuteur": "Depute",
      "acteurRef": "PA267766",
      "organeRef": {
        "@xmlns:xsi": "http://www.w3.org/2001/XMLSchema-instance",
        "@xsi:nil": "true"
      },
      "groupePolitiqueRef": "PO744425"
    },
    "cosignataires": {
      "acteurRef": [
        "PA267355",
        "PA267766",
        "PA712014",
        "PA719806"
      ]
    },
    "texteAffichable": "M.&#160;Guy&#160;Bricout,  M.&#160;Ledoux, Mme&#160;Auconie et M.&#160;Herth"
  },
  "pointeurFragmentTexte": {
    "missionVisee": {
      "@xmlns:xsi": "http://www.w3.org/2001/XMLSchema-instance",
      "@xsi:nil": "true"
    },
    "division": {
      "titre": "Article 56",
      "articleDesignationCourte": "ART. 56",
      "type": "ARTICLE",
      "avant_A_Apres": "A",
      "divisionRattachee": "ARTICLE 56",
      "articleAdditionnel": {
        "@xmlns:xsi": "http://www.w3.org/2001/XMLSchema-instance",
        "@xsi:nil": "true"
      },
      "chapitreAdditionnel": {
        "@xmlns:xsi": "http://www.w3.org/2001/XMLSchema-instance",
        "@xsi:nil": "true"
      },
      "urlDivisionTexteVise": "/15/textes/1255C.asp#D_Article_56"
    },
    "alinea": {
      "avant_A_Apres": {
        "@xmlns:xsi": "http://www.w3.org/2001/XMLSchema-instance",
        "@xsi:nil": "true"
      },
      "numero": "10",
      "alineaDesignation": {
        "@xmlns:xsi": "http://www.w3.org/2001/XMLSchema-instance",
        "@xsi:nil": "true"
      }
    }
  },
  "corps": {
    "dispositif": "<p style=\"text-align: justify;\">I.&#160;&#8211;&#160;&#192; l&#8217;alin&#233;a&#160;10, substituer au montant&#160;:</p><p style=\"text-align: justify;\">&#171;&#160;de 300&#160;000&#160;euros&#160;&#187;</p><p style=\"text-align: justify;\">les mots&#160;:</p><p style=\"text-align: justify;\">&#171;&#160;d&#233;fini par d&#233;cret selon les activit&#233;s&#160;&#187;.</p><p style=\"text-align: justify;\">II.&#160;&#8211;&#160;Compl&#233;ter cet article par l'alin&#233;a suivant&#160;:</p><p style=\"text-align: justify;\">&#171;&#160;IV.&#160;&#8211;&#160;La perte de recettes pour les collectivit&#233;s territoriales est compens&#233;e &#224; due concurrence par la majoration de la dotation globale de fonctionnement et, corr&#233;lativement pour l&#8217;&#201;tat, par la cr&#233;ation d&#8217;une taxe additionnelle aux droits mentionn&#233;s aux articles 575 et 575 A du code g&#233;n&#233;ral des imp&#244;ts.&#160;&#187;</p>",
    "exposeSommaire": "<p style=\"text-align: justify;\">L&#8217;article&#160;56 du projet de loi de finances pour 2019 donne une nouvelle d&#233;finition des &#233;tablissements dits industriels au regard de l&#8217;article&#160;1500 du CGI. Cette disposition tente de l&#233;galiser l&#8217;absence d&#8217;une telle d&#233;finition dans le CGI et ainsi de mettre fin au flou entourant les impositions locales de nombreux &#233;tablissements.</p><p style=\"text-align: justify;\">En effet, faute de d&#233;finition l&#233;gale de la notion d&#8217;&#233;tablissement industriel, l&#8217;administration en a fait une interpr&#233;tation extensive, s&#8217;autorisant &#224; soumettre &#224; ce r&#233;gime tout &#233;tablissement dans lequel les installations techniques, mat&#233;riels et outillages repr&#233;sentaient une valeur significative. Elle a ainsi multipli&#233; les requalifications en immobilisations industrielles des entrep&#244;ts ou b&#226;timents de stockage de produits manufactur&#233;s, au seul motif qu&#8217;y sont utilis&#233;s chariots, &#233;l&#233;vateurs, monte-charges et autres outils destin&#233;s &#224; faciliter le travail des manutentionnaires et en limiter la p&#233;nibilit&#233;.&#160;</p><p style=\"text-align: justify;\">Les activit&#233;s de b&#226;timent, et plus particuli&#232;rement les entreprises de charpente et de menuiseries bois ainsi que les entreprises de m&#233;talleries, sont aussi vis&#233;es puisqu&#8217;elles ont des ateliers de fabrication. Or, ce sont des entreprises qui ont des contrats de louage d&#8217;ouvrage aupr&#232;s de leurs clients et qui peuvent fabriquer certains produits qui rentrent dans la composition de l&#8217;ouvrage.</p><p style=\"text-align: justify;\">Ces requalifications ne sont pas justifi&#233;es, car ces entreprises n&#8217;ont pas pour vocation principale de produire ou de transformer des biens&#160;: en r&#233;alit&#233;, elles ne fabriquent que partiellement en ateliers, elles ach&#232;tent aussi des produits finis pour la r&#233;alisation du march&#233; de travaux. Aussi, l&#8217;&#233;tablissement dont il est question remplit plusieurs fonctions au-del&#224; de la fabrication&#160;: bureau d&#8217;&#233;tudes, stockage des produits finis achet&#233;s, entreposage du mat&#233;riel destin&#233; &#224; la pose (&#233;chafaudages, v&#233;hicules, mat&#233;riel de pose&#8230;), locaux administratifs et, la plupart du temps &#233;tablissement auquel sont rattach&#233;s la majorit&#233; des salari&#233;s travaillant chez les clients.</p><p style=\"text-align: justify;\">Une vague de redressements visant &#224; requalifier en &#233;tablissement industriel les ateliers de ces entreprises traditionnellement class&#233;es en b&#226;timent commercial a eu pour cons&#233;quence de g&#233;n&#233;rer une explosion des bases d&#8217;imposition et par l&#224;-m&#234;me, des imp&#244;ts dus. Il n&#8217;est pas rare de voir la CFE et la taxe fonci&#232;re multipli&#233;es par trois.</p><p style=\"text-align: justify;\">Les cons&#233;quences sont les suivantes&#160;:</p><p style=\"text-align: justify;\">- D&#8217;une part, financi&#232;rement, il s&#8217;agit d&#8217;une charge tr&#232;s lourde puisque les redressements portent sur trois ans. La tr&#233;sorerie des entreprises est lourdement handicap&#233;e. Or, en p&#233;riode de reprise, le besoin de tr&#233;sorerie est essentiel pour pouvoir assurer le red&#233;marrage de l&#8217;activit&#233;. Une telle charge pour des entreprises de b&#226;timent qui sont des TPE (98&#160;% d&#8217;entre elles ont moins de 50 salari&#233;s et 72&#160;% en ont moins de 10) est susceptible de compromettre tr&#232;s clairement leurs perspectives d&#8217;embauches ou d&#8217;investissement. Pour le futur, cette charge suppl&#233;mentaire vient ob&#233;rer les mesures prises par le Gouvernement pour am&#233;liorer la comp&#233;titivit&#233; des entreprises</p><p style=\"text-align: justify;\">- D&#8217;autre part, dans un contexte &#233;conomique qui reste difficile (fracture territoriale, prix trop bas, concurrence &#233;trang&#232;re), les entreprises de b&#226;timent qui ont, jusqu&#8217;&#224; pr&#233;sent, privil&#233;gi&#233; l&#8217;emploi se posent aujourd&#8217;hui la question de savoir si la fabrication en France m&#233;rite d&#8217;&#234;tre poursuivie.</p><p style=\"text-align: justify;\">Au regard des co&#251;ts, sur le segment de la menuiserie par exemple, l&#8217;importation peut s&#8217;av&#233;rer plus int&#233;ressante. Ainsi, la part des importations progresse fortement et repr&#233;sente 10&#160;% du march&#233; en 2015. C&#8217;est tout un savoir-faire d&#233;velopp&#233; en France qui risque de dispara&#238;tre avec des emplois &#224; la cl&#233;. Il est donc paradoxal de vouloir promouvoir un savoir-faire fran&#231;ais et en parall&#232;le d&#8217;appliquer aux entreprises de nouvelles contraintes qui au final, d&#233;boucheront sur des restructurations et des pertes d&#8217;emplois.</p><p style=\"text-align: justify;\">- Enfin, on ne peut &#234;tre que surpris du d&#233;calage existant avec par exemple, la Pologne, qui exporte ses menuiseries avec le soutien de l&#8217;&#201;tat et des fonds&#160;europ&#233;ens et la France qui, tout en am&#233;liorant la comp&#233;titivit&#233; de ses entreprises, laisse ces derni&#232;res subir les cons&#233;quences dommageables d&#8217;une fiscalit&#233; complexe et confiscatoire. Il y a l&#224; une distorsion de concurrence incompr&#233;hensible cr&#233;&#233;e par l&#8217;&#201;tat lui-m&#234;me au travers de son application, d&#8217;une l&#233;gislation pour le moins mal d&#233;finie.</p><p style=\"text-align: justify;\">C&#8217;est pourquoi, l&#8217;objet de cet amendement, &#224; d&#233;faut d&#8217;exclure purement et simplement les activit&#233;s de b&#226;timent de la notion d&#8217;&#233;tablissement industriel, est de pr&#233;ciser le montant minimum des mat&#233;riels, outillages et installations techniques. En effet, les activit&#233;s potentiellement vis&#233;es par la notion d&#8217;&#233;tablissement industriel sont importantes et vari&#233;es. Selon l&#8217;activit&#233;, le recours aux moyens techniques est plus ou moins important. Or, instaurer un montant unique ne tenant pas compte du caract&#232;re capitalistique de chacune des activit&#233;s ne r&#233;sout pas la difficult&#233; et cr&#233;e une in&#233;galit&#233; entre les contribuables. Ainsi, il est propos&#233; de renvoyer ce montant minimum de moyens techniques &#224; un d&#233;cret qui fixerait activit&#233; par activit&#233;, ce chiffre.</p>",
    "annexeExposeSommaire": {
      "@xmlns:xsi": "http://www.w3.org/2001/XMLSchema-instance",
      "@xsi:nil": "true"
    },
    "cartoucheDelaiDepotDepasse": {
      "@xmlns:xsi": "http://www.w3.org/2001/XMLSchema-instance",
      "@xsi:nil": "true"
    }
  },
  "representations": {
    "representation": {
      "nom": "PDF",
      "typeMime": {
        "type": "application",
        "subType": "PDF"
      },
      "statutRepresentation": {
        "verbatim": "true",
        "canonique": "true",
        "officielle": "true",
        "transcription": "false",
        "enregistrement": "false"
      },
      "repSource": {
        "@xmlns:xsi": "http://www.w3.org/2001/XMLSchema-instance",
        "@xsi:nil": "true"
      },
      "offset": {
        "@xmlns:xsi": "http://www.w3.org/2001/XMLSchema-instance",
        "@xsi:nil": "true"
      },
      "contenu": {
        "documentURI": "/15/amendements/1255C/AN/1422.pdf"
      },
      "dateDispoRepresentation": {
        "@xmlns:xsi": "http://www.w3.org/2001/XMLSchema-instance",
        "@xsi:nil": "true"
      }
    }
  },
  "seanceDiscussion": "RUANR5L15S2019IDS21343",
  "sort": {
    "dateSaisie": "2018-11-16T00:37:05.000+01:00",
    "sortEnSeance": "Non soutenu"
  },
  "dateDepot": "2018-11-06T01:00:00.000+01:00",
  "dateDistribution": "2018-11-15T01:00:00.000+01:00",
  "article99": "0",
  "loiReference": {
    "codeLoi": {
      "@xmlns:xsi": "http://www.w3.org/2001/XMLSchema-instance",
      "@xsi:nil": "true"
    },
    "divisionCodeLoi": {
      "@xmlns:xsi": "http://www.w3.org/2001/XMLSchema-instance",
      "@xsi:nil": "true"
    }
  }
}