{
  "@xmlns": "http://schemas.assemblee-nationale.fr/referentiel",
  "uid": "AMANR5L15SEA717460B1255P2D1N405",
  "identifiant": {
    "legislature": "15",
    "numero": "405",
    "numRect": "0",
    "saisine": {
      "refTexteLegislatif": "PRJLANR5L15B1255",
      "numeroPartiePLF": "2",
      "organeExamen": "PO717460",
      "mentionSecondeDeliberation": "1"
    }
  },
  "numeroLong": "II-405",
  "etapeTexte": "1ère lecture (1ère assemblée saisie)",
  "triAmendement": "hiaaaaaaaaaaaaaaaaaaaaaaaaaaaaaaaaaaaaaaaaaaaaaaaaelnzw",
  "cardinaliteAmdtMultiples": "1",
  "amendementParent": {
    "@xmlns:xsi": "http://www.w3.org/2001/XMLSchema-instance",
    "@xsi:nil": "true"
  },
  "etat": "Discuté",
  "signataires": {
    "auteur": {
      "typeAuteur": "Depute",
      "acteurRef": "PA330909",
      "organeRef": {
        "@xmlns:xsi": "http://www.w3.org/2001/XMLSchema-instance",
        "@xsi:nil": "true"
      },
      "groupePolitiqueRef": "PO730934"
    },
    "cosignataires": {
      "acteurRef": [
        "PA334843",
        "PA346218",
        "PA719318",
        "PA266793",
        "PA267204",
        "PA1630",
        "PA334654",
        "PA607090",
        "PA266808",
        "PA605036",
        "PA609726",
        "PA718838",
        "PA330909",
        "PA721968"
      ]
    },
    "texteAffichable": "M.&#160;Descoeur,  M.&#160;Aubert, M.&#160;Brun, M.&#160;Straumann, M.&#160;Masson, M.&#160;Sermier, M.&#160;Jean-Pierre&#160;Vigier, M.&#160;Abad, M.&#160;Verch&#232;re, M.&#160;Bony, Mme&#160;Anthoine, M.&#160;Vialay, M.&#160;Rolland et M.&#160;Herbillon"
  },
  "pointeurFragmentTexte": {
    "missionVisee": {
      "@xmlns:xsi": "http://www.w3.org/2001/XMLSchema-instance",
      "@xsi:nil": "true"
    },
    "division": {
      "titre": "Article 60",
      "articleDesignationCourte": "APRÈS ART. 60",
      "type": "ARTICLE",
      "avant_A_Apres": "Après",
      "divisionRattachee": "APRÈS L'ARTICLE 60, insérer l'article suivant:",
      "articleAdditionnel": "1",
      "chapitreAdditionnel": {
        "@xmlns:xsi": "http://www.w3.org/2001/XMLSchema-instance",
        "@xsi:nil": "true"
      },
      "urlDivisionTexteVise": "/15/textes/1255C.asp#D_Article_60"
    },
    "alinea": {
      "@xmlns:xsi": "http://www.w3.org/2001/XMLSchema-instance",
      "@xsi:nil": "true"
    }
  },
  "corps": {
    "dispositif": "<p>I.&#160;&#8211;&#160;Le tableau du I de l&#8217;article 46 de la loi n&#176;&#160;2011-1977 du 28 d&#233;cembre 2011 de finances pour 2012 est ainsi modifi&#233;&#160;:</p><p>1&#176;. Apr&#232;s la premi&#232;re ligne, est ins&#233;r&#233;e une ligne ainsi r&#233;dig&#233;e :</p><p>&#171;</p><table style=\"border-collapse: collapse; width: 525px;\"><tbody><tr><td style=\"white-space: normal; border: 1px solid #000000; width: 171px;\">Article L. 131-5-1 du code de l'environnement</td><td style=\"white-space: normal; border: 1px solid #000000; width: 177.167px;\">Agence de l'environnement et de la ma&#238;trise de l'&#233;nergie (ADEME)</td><td style=\"white-space: normal; border: 1px solid #000000; width: 194.833px;\">200 000</td></tr></tbody></table><p>&#160;&#160;&#160;&#160;&#160;&#160;&#160;&#160;&#160;&#160;&#160;&#160;&#160;&#160;&#160;&#160;&#160;&#160;&#160;&#160;&#160;&#160;&#160;&#160;&#160;&#160;&#160;&#160;&#160;&#160;&#160;&#160;&#160;&#160;&#160;&#160;&#160;&#160;&#160;&#160;&#160;&#160;&#160;&#160;&#160;&#160;&#160;&#160;&#160;&#160;&#160;&#160;&#160;&#160;&#160;&#160;&#160;&#160;&#160;&#160;&#160;&#160;&#160;&#160;&#160;&#160;&#160;&#160;&#160;&#160;&#160;&#160;&#160;&#160;&#160;&#160;&#160;&#160;&#160;&#160;&#160;&#160;&#160;&#160;&#160;&#160;&#160;&#160;&#160;&#160;&#160;&#160;&#160;&#160;&#160;&#160;&#160;&#160;&#160;&#160;&#160;&#160;&#160;&#160;&#160;&#160;&#160;&#160;&#160; &#187;&#160;;</p><p>II.&#160;&#8211;&#160;Apr&#232;s l&#8217;article 131&#8209;5 du code de l&#8217;environnement est ins&#233;r&#233; un article 131-5-1 ainsi r&#233;dig&#233; :</p><p><i>&#171;&#160;Art.&#160;L.&#160;131&#8209;5&#8209;1.&#160;</i>&#8211;&#160;Le produit de la taxe int&#233;rieure de consommation sur les produits &#233;nerg&#233;tiques pr&#233;vue &#224; l&#8217;article 265 du code des douanes est affect&#233;, dans la limite du plafond pr&#233;vu au I de l&#8217;article 46 de la loi n&#176; 2011&#8209;1977 du 28 d&#233;cembre 2011 de finances pour 2012, &#224; l&#8217;Agence de l&#8217;environnement et de la ma&#238;trise de l&#8217;&#233;nergie. &#187;</p><p>III.&#160;&#8211;&#160;Les I et II s&#8217;appliquent &#224; compter du 1<sup>er</sup>&#160;janvier&#160;2020</p><p>IV.&#160;&#8211;&#160;La perte de recettes pour l&#8217;&#201;tat est compens&#233;e, &#224; due concurrence, par la cr&#233;ation d&#8217;une taxe additionnelle aux droits pr&#233;vus aux articles 575 et 575 A du code g&#233;n&#233;ral des imp&#244;ts.</p>",
    "exposeSommaire": "<p style=\"text-align: justify;\">La chaleur repr&#233;sente pr&#232;s de 50&#160;% des besoins &#233;nerg&#233;tiques de la France. Elle est pourtant aujourd&#8217;hui massivement produite par des &#233;nergies fossiles import&#233;es et &#233;mettrices de gaz &#224; effet de serre. Les objectifs &#233;nerg&#233;tiques de la France sont d&#8217;atteindre 23&#160;% en 2020 puis 32&#160;% en 2030 d&#8217;&#233;nergies renouvelables dans notre consommation et de multiplier par 5 la quantit&#233; d&#8217;&#233;nergies renouvelables et de r&#233;cup&#233;ration livr&#233;e par les r&#233;seaux de chaleur et de froid entre 2012 et 2030.</p><p style=\"text-align: justify;\">Le Fonds chaleur doit d&#233;sormais apporter le soutien n&#233;cessaire &#224; la chaleur renouvelable et de r&#233;cup&#233;ration pour permettre d&#8217;atteindre ces objectifs. Il a &#233;t&#233; d&#233;montr&#233; que le Fonds chaleur, g&#233;r&#233; par l&#8217;ADEME, est un des dispositifs de soutien &#224; la chaleur renouvelable les plus efficaces. Il a permis entre 2009 et 2016 de financer 4000 installations et 1880 km de r&#233;seaux de chaleur en d&#233;clenchant 5,15 milliards d&#8217;euros d&#8217;investissements pour 1,57Mds&#8364; apport&#233;s (220M&#8364;/an en 2014, 2015 et 2016). Pour autant, la dynamique de d&#233;veloppement de la chaleur renouvelable doit &#234;tre acc&#233;l&#233;r&#233;e pour atteindre nos objectifs (voir graphe ci-dessous).</p><p style=\"text-align: justify;\">Le Pr&#233;sident de la R&#233;publique, Emmanuel MACRON, s&#8217;est engag&#233; &#224; doubler l&#8217;enveloppe du Fonds chaleur lors de la campagne pr&#233;sidentielle. Cet amendement propose de concr&#233;tiser ce doublement au cours du quinquennat.</p><p style=\"text-align: justify;\">Par ailleurs le secteur de la chaleur renouvelable conna&#238;t actuellement d&#8217;importantes difficult&#233;s, et ne se d&#233;veloppe pas du tout &#224; un rythme suffisant pour atteindre les objectifs de transition &#233;nerg&#233;tique de la France. Ce retard est notamment d&#251; au manque d&#8217;attractivit&#233; des investissements dans ce secteur&#160;: actuellement un projet sur 2 de chaleur renouvelable finit par &#234;tre abandonn&#233; car pas suffisamment attractif. Ainsi, il est essentiel que ce doublement du Fonds chaleur permette d&#8217;am&#233;liorer le niveau de soutien apport&#233; &#224; chaque projet, afin de donner aux projets de r&#233;seau de chaleur renouvelable un niveau de rentabilit&#233; suffisant pour attirer les investisseurs.</p>",
    "annexeExposeSommaire": {
      "@xmlns:xsi": "http://www.w3.org/2001/XMLSchema-instance",
      "@xsi:nil": "true"
    },
    "cartoucheDelaiDepotDepasse": {
      "@xmlns:xsi": "http://www.w3.org/2001/XMLSchema-instance",
      "@xsi:nil": "true"
    }
  },
  "representations": {
    "representation": {
      "nom": "PDF",
      "typeMime": {
        "type": "application",
        "subType": "PDF"
      },
      "statutRepresentation": {
        "verbatim": "true",
        "canonique": "true",
        "officielle": "true",
        "transcription": "false",
        "enregistrement": "false"
      },
      "repSource": {
        "@xmlns:xsi": "http://www.w3.org/2001/XMLSchema-instance",
        "@xsi:nil": "true"
      },
      "offset": {
        "@xmlns:xsi": "http://www.w3.org/2001/XMLSchema-instance",
        "@xsi:nil": "true"
      },
      "contenu": {
        "documentURI": "/15/amendements/1255C/AN/405.pdf"
      },
      "dateDispoRepresentation": {
        "@xmlns:xsi": "http://www.w3.org/2001/XMLSchema-instance",
        "@xsi:nil": "true"
      }
    }
  },
  "seanceDiscussion": "RUANR5L15S2019IDS21345",
  "sort": {
    "dateSaisie": "2018-11-16T18:21:29.000+01:00",
    "sortEnSeance": "Non soutenu"
  },
  "dateDepot": "2018-10-26T02:00:00.000+02:00",
  "dateDistribution": "2018-11-16T01:00:00.000+01:00",
  "article99": "0",
  "loiReference": {
    "codeLoi": "loi 2011-1977",
    "divisionCodeLoi": "46"
  }
}