{
  "@xmlns": "http://schemas.assemblee-nationale.fr/referentiel",
  "uid": "AMANR5L15SEA717460B0269P0D1N221",
  "identifiant": {
    "legislature": "15",
    "numero": "221",
    "numRect": "0",
    "saisine": {
      "refTexteLegislatif": "PRJLANR5L15B0269",
      "numeroPartiePLF": "0",
      "organeExamen": "PO717460",
      "mentionSecondeDeliberation": "0"
    }
  },
  "numeroLong": "221",
  "etapeTexte": "1ère lecture (1ère assemblée saisie)",
  "triAmendement": "bhi",
  "cardinaliteAmdtMultiples": "1",
  "amendementParent": {
    "@xmlns:xsi": "http://www.w3.org/2001/XMLSchema-instance",
    "@xsi:nil": "true"
  },
  "etat": "Discuté",
  "signataires": {
    "auteur": {
      "typeAuteur": "Depute",
      "acteurRef": "PA267289",
      "organeRef": {
        "@xmlns:xsi": "http://www.w3.org/2001/XMLSchema-instance",
        "@xsi:nil": "true"
      },
      "groupePolitiqueRef": "PO730934"
    },
    "cosignataires": {
      "acteurRef": [
        "PA336316",
        "PA606098",
        "PA709315",
        "PA267200",
        "PA2155",
        "PA721816",
        "PA266774",
        "PA267785",
        "PA746",
        "PA334149",
        "PA267260",
        "PA998",
        "PA720100",
        "PA346218",
        "PA330788",
        "PA721678",
        "PA330008",
        "PA346054",
        "PA223837",
        "PA1327",
        "PA267794",
        "PA2529",
        "PA266776",
        "PA721286",
        "PA605991",
        "PA267440",
        "PA721126",
        "PA1498",
        "PA721314",
        "PA2377",
        "PA267289",
        "PA721054",
        "PA2960",
        "PA330240",
        "PA608016",
        "PA1029",
        "PA1695",
        "PA923",
        "PA767",
        "PA267324",
        "PA718780",
        "PA267901",
        "PA720210",
        "PA267735",
        "PA722390",
        "PA720630"
      ]
    },
    "texteAffichable": "M.&#160;Door,  M.&#160;Jacob, M.&#160;Woerth, Mme&#160;Beauvais, M.&#160;Boucard, M.&#160;Bouchet, M.&#160;Breton, M.&#160;Brochand, M.&#160;Carrez, M.&#160;Cattin, M.&#160;Ciotti, Mme&#160;Corneloup, M.&#160;Cornut-Gentille, M.&#160;Dassault, M.&#160;de Ganay, M.&#160;Deflesselles, M.&#160;Diard, M.&#160;Fasquelle, M.&#160;Forissier, M.&#160;Furst, M.&#160;Gaultier, Mme&#160;Genevard, M.&#160;Goasguen, Mme&#160;Guion-Firmin, M.&#160;Huyghe, M.&#160;Kamardine, M.&#160;Larriv&#233;, M.&#160;Lorion, Mme&#160;Louwagie, M.&#160;Emmanuel&#160;Maquet, M.&#160;Marleix, M.&#160;Masson, M.&#160;Menuel, M.&#160;Minot, M.&#160;Perrut, Mme&#160;Poletti, M.&#160;Pradi&#233;, M.&#160;Ramadier, M.&#160;Reda, M.&#160;Reiss, M.&#160;Reitzer, M.&#160;Reyn&#232;s, M.&#160;Schellenberger, Mme&#160;Tabarot, Mme&#160;Trastour-Isnart et M.&#160;Viala"
  },
  "pointeurFragmentTexte": {
    "missionVisee": {
      "@xmlns:xsi": "http://www.w3.org/2001/XMLSchema-instance",
      "@xsi:nil": "true"
    },
    "division": {
      "titre": "Article 7",
      "articleDesignationCourte": "ART. 7",
      "type": "ARTICLE",
      "avant_A_Apres": "A",
      "divisionRattachee": "ARTICLE 7",
      "articleAdditionnel": {
        "@xmlns:xsi": "http://www.w3.org/2001/XMLSchema-instance",
        "@xsi:nil": "true"
      },
      "chapitreAdditionnel": {
        "@xmlns:xsi": "http://www.w3.org/2001/XMLSchema-instance",
        "@xsi:nil": "true"
      },
      "urlDivisionTexteVise": "/15/textes/0269.asp#D_Article_7"
    },
    "alinea": {
      "@xmlns:xsi": "http://www.w3.org/2001/XMLSchema-instance",
      "@xsi:nil": "true"
    }
  },
  "corps": {
    "dispositif": "<p>Supprimer cet article.</p>",
    "exposeSommaire": "<p style=\"text-align: justify;\">Le nouveau slogan du gouvernement est la promesse d&#8217;un &#171;&#160;13<sup>&#232;me</sup> mois&#160;&#187; pour tous les actifs. Ce que veut Emmanuel Macron, c&#8217;est inverser la courbe de l&#8217;opinion en misant sur le pouvoir d&#8217;achat. A chacun sa courbe, Hollande avait celle du ch&#244;mage, Macron celle des sondages.</p><p style=\"text-align: justify;\">Pour y parvenir, le Gouvernement, dans cet article, va r&#233;aliser des transferts de pouvoir d&#8217;achat entre cat&#233;gories de Fran&#231;ais, notamment prendre aux retrait&#233;s pour donner aux actifs.</p><p style=\"text-align: justify;\">En effet, le gouvernement pr&#233;voit d&#8217;augmenter le taux normal de la CSG de 22&#160;% (soit un taux de 9,2&#160;%, contre 7,5&#160;% aujourd&#8217;hui). Cette hausse de 22.5 Md&#8364; du produit de la CSG permettra de compenser la suppression de 18,5 Md&#8364; des cotisations salariales maladie et d&#8217;assurance ch&#244;mage.</p><p style=\"text-align: justify;\">Cette augmentation de la CSG sera imm&#233;diate alors que la suppression des cotisations salariales se fera en deux temps et ne compensera donc pas la hausse d&#8217;imp&#244;t en 2018.</p><p style=\"text-align: justify;\">La preuve en est que gr&#226;ce &#224; ce tour de passe -passe, l&#8217;ACOSS va engranger 3 milliards de recettes suppl&#233;mentaires pour l&#8217;ann&#233;e 2018, ce qui permet au Gouvernement d&#8217;afficher artificiellement un d&#233;ficit de l&#8217;assurance maladie non plus de 4,1Md&#8364; mais de 0,8Md&#8364;&#160;! Ce genre de m&#233;thodes, d&#233;nonc&#233;e par le Cour des compte participe &#224; l&#8217;insinc&#233;rit&#233; des compte sociaux en servant d&#8217;alibi pour repousser sans cesse les r&#233;formes n&#233;cessaires. Elle ne constitue en rien une mesure de pouvoir d&#8217;achat&#160;!</p><p style=\"text-align: justify;\">Au-del&#224;, l&#8217;augmentation de la CSG fera de nombreux perdants&#160;: 8 millions de retrait&#233;s (soit 60&#160;% d&#8217;entre eux) paieront la CSG &#224; taux plein sans aucune compensation. Un retrait&#233; qui per&#231;oit 1 200&#160;&#8364; par mois, devra d&#233;bourser 250&#160;&#8364; en plus &#224; payer chaque ann&#233;e. E. Macron sacrifie les retrait&#233;s au profit des actifs. Or ils vont d&#233;j&#224; subir la d&#233;cision concomitante du gouvernement de d&#233;caler d&#8217;octobre 2018 &#224; janvier 2019 la prochaine revalorisation du montant de la pension du r&#233;gime de base.</p><p style=\"text-align: justify;\">Enfin, la mesure de compensation pour les fonctionnaires est immorale puisqu&#8217;il s&#8217;agit de supprimer l&#8217;effort de 1&#160;% qu&#8217;ils fournissaient pour le financement solidaire du risque ch&#244;mage&#8230;</p><p style=\"text-align: justify;\">Bien au contraire, les signataires de l&#8217;amendement consid&#232;rent que l&#8217;augmentation du pouvoir d&#8217;achat des salari&#233;s doit se faire par l&#8217;am&#233;lioration de la comp&#233;titivit&#233;, la cr&#233;ation d&#8217;emplois et de richesses, et non par des transferts sociaux ou des transferts d&#8217;une cat&#233;gorie de Fran&#231;ais sur l&#8217;autre.&#160;Il est &#233;galement indispensable que ceux qui ont &#233;t&#233; matraqu&#233;s fiscalement ces 5 derni&#232;res ann&#233;es retrouvent un peu de pouvoir d&#8217;achat&#160;: c&#8217;est la raison pour laquelle ils ont &#233;galement d&#233;pos&#233; dans le PLF pour 2018, un amendement de vraie justice fiscale pr&#233;voyant une baisse de 10&#160;% de l&#8217;imp&#244;t sur le revenu.</p>",
    "annexeExposeSommaire": {
      "@xmlns:xsi": "http://www.w3.org/2001/XMLSchema-instance",
      "@xsi:nil": "true"
    }
  },
  "representations": {
    "representation": {
      "nom": "PDF",
      "typeMime": {
        "type": "application",
        "subType": "PDF"
      },
      "statutRepresentation": {
        "verbatim": "true",
        "canonique": "true",
        "officielle": "true",
        "transcription": "false",
        "enregistrement": "false"
      },
      "repSource": {
        "@xmlns:xsi": "http://www.w3.org/2001/XMLSchema-instance",
        "@xsi:nil": "true"
      },
      "offset": {
        "@xmlns:xsi": "http://www.w3.org/2001/XMLSchema-instance",
        "@xsi:nil": "true"
      },
      "contenu": {
        "documentURI": "/15/amendements/0269/AN/221.pdf"
      },
      "dateDispoRepresentation": {
        "@xmlns:xsi": "http://www.w3.org/2001/XMLSchema-instance",
        "@xsi:nil": "true"
      }
    }
  },
  "seanceDiscussion": "RUANR5L15S2018IDS20708",
  "sort": {
    "dateSaisie": "2017-10-25T19:37:31.000+02:00",
    "sortEnSeance": "Rejeté"
  },
  "dateDepot": "2017-10-19T02:00:00.000+02:00",
  "dateDistribution": "2017-10-23T02:00:00.000+02:00",
  "article99": "0",
  "loiReference": {
    "codeLoi": {
      "@xmlns:xsi": "http://www.w3.org/2001/XMLSchema-instance",
      "@xsi:nil": "true"
    },
    "divisionCodeLoi": {
      "@xmlns:xsi": "http://www.w3.org/2001/XMLSchema-instance",
      "@xsi:nil": "true"
    }
  }
}