{
  "@xmlns": "http://schemas.assemblee-nationale.fr/referentiel",
  "uid": "AMANR5L15SEA717460B1490P0D1N1369",
  "identifiant": {
    "legislature": "15",
    "numero": "1369",
    "numRect": "0",
    "saisine": {
      "refTexteLegislatif": "PRJLANR5L15B1490",
      "numeroPartiePLF": "0",
      "organeExamen": "PO717460",
      "mentionSecondeDeliberation": "0"
    }
  },
  "numeroLong": "1369",
  "etapeTexte": "Nouvelle Lecture",
  "triAmendement": "ebaaaaaaaaaaaaaaaaaaaaaaaaaaaaaaaaaaaaaaaaaaaaaaaaqbzji",
  "cardinaliteAmdtMultiples": "1",
  "amendementParent": {
    "@xmlns:xsi": "http://www.w3.org/2001/XMLSchema-instance",
    "@xsi:nil": "true"
  },
  "etat": "Discuté",
  "signataires": {
    "auteur": {
      "typeAuteur": "Gouvernement",
      "acteurRef": {
        "@xmlns:xsi": "http://www.w3.org/2001/XMLSchema-instance",
        "@xsi:nil": "true"
      },
      "organeRef": {
        "@xmlns:xsi": "http://www.w3.org/2001/XMLSchema-instance",
        "@xsi:nil": "true"
      },
      "groupePolitiqueRef": {
        "@xmlns:xsi": "http://www.w3.org/2001/XMLSchema-instance",
        "@xsi:nil": "true"
      }
    },
    "cosignataires": {
      "@xmlns:xsi": "http://www.w3.org/2001/XMLSchema-instance",
      "@xsi:nil": "true"
    },
    "texteAffichable": "le Gouvernement"
  },
  "pointeurFragmentTexte": {
    "missionVisee": {
      "idMissionAN": "713",
      "libelleMission": "Immigration, asile et intégration",
      "codeMissionPLF": "B",
      "libelleMissionPLF": "Répartition, par mission et programme, des crédits du budget général"
    },
    "division": {
      "titre": "ÉTAT B",
      "articleDesignationCourte": "ART. 39",
      "type": "ANNEXE",
      "avant_A_Apres": "A",
      "divisionRattachee": "ARTICLE 39",
      "articleAdditionnel": {
        "@xmlns:xsi": "http://www.w3.org/2001/XMLSchema-instance",
        "@xsi:nil": "true"
      },
      "chapitreAdditionnel": {
        "@xmlns:xsi": "http://www.w3.org/2001/XMLSchema-instance",
        "@xsi:nil": "true"
      },
      "urlDivisionTexteVise": "/15/textes/1490.asp#D_Etat_B"
    },
    "alinea": {
      "@xmlns:xsi": "http://www.w3.org/2001/XMLSchema-instance",
      "@xsi:nil": "true"
    }
  },
  "corps": {
    "exposeSommaire": "<p style=\"text-align: justify;\">Le pr&#233;sent amendement proc&#232;de au r&#233;tablissement des cr&#233;dits de la mission &#171;&#160;Immigration, asile et int&#233;gration&#160;&#187;vot&#233;s en premi&#232;re lecture &#224; l&#8217;Assembl&#233;e nationale. &#192; cette fin, il convient de majorer de 1&#160;850&#160;908&#160;630&#160;&#8364; les autorisations d&#8217;engagement et de 1&#160;688&#160;406&#160;760&#160;&#8364; les cr&#233;dits de paiement de la mission &#171;&#160;Immigration, asile et int&#233;gration&#160;&#187;. Ce changement se d&#233;compose en&#160;:</p><p style=\"text-align: justify;\">-&#160;une majoration de 1&#160;442&#160;297&#160;816&#160;&#8364; en autorisations d&#8217;engagement et de 1&#160;279&#160;742&#160;068&#160;&#8364; en cr&#233;dits de paiement du programme &#171;&#160;Immigration et asile&#160;&#187;&#160;;</p><p style=\"text-align: justify;\">-&#160;une majoration de 408&#160;610&#160;814&#160;&#8364; en autorisations d&#8217;engagement et de 408&#160;664&#160;692&#160;&#8364; en cr&#233;dits de paiement du programme &#171;&#160;Int&#233;gration et acc&#232;s &#224; la nationalit&#233; fran&#231;aise&#160;&#187;.</p>",
    "annexeExposeSommaire": {
      "@xmlns:xsi": "http://www.w3.org/2001/XMLSchema-instance",
      "@xsi:nil": "true"
    },
    "cartoucheDelaiDepotDepasse": {
      "@xmlns:xsi": "http://www.w3.org/2001/XMLSchema-instance",
      "@xsi:nil": "true"
    },
    "dispositifAmdtCredit": {
      "listeProgrammes": {
        "programme": [
          {
            "libelle": "Immigration et asile",
            "id": "58569",
            "AE": {
              "montantPositif": "1442297816",
              "montantNegatif": "0"
            },
            "CP": {
              "montantPositif": "1279742068",
              "montantNegatif": "0"
            },
            "action": "modification",
            "lignesCredits": null
          },
          {
            "libelle": "Intégration et accès à la nationalité française",
            "id": "58570",
            "AE": {
              "montantPositif": "408610814",
              "montantNegatif": "0"
            },
            "CP": {
              "montantPositif": "408664692",
              "montantNegatif": "0"
            },
            "action": "modification",
            "lignesCredits": null
          }
        ]
      },
      "totalAE": {
        "montantPositif": "1850908630",
        "montantNegatif": "0",
        "solde": "1850908630"
      },
      "totalCP": {
        "montantPositif": "1688406760",
        "montantNegatif": "0",
        "solde": "1688406760"
      }
    }
  },
  "representations": {
    "representation": {
      "nom": "PDF",
      "typeMime": {
        "type": "application",
        "subType": "PDF"
      },
      "statutRepresentation": {
        "verbatim": "true",
        "canonique": "true",
        "officielle": "true",
        "transcription": "false",
        "enregistrement": "false"
      },
      "repSource": {
        "@xmlns:xsi": "http://www.w3.org/2001/XMLSchema-instance",
        "@xsi:nil": "true"
      },
      "offset": {
        "@xmlns:xsi": "http://www.w3.org/2001/XMLSchema-instance",
        "@xsi:nil": "true"
      },
      "contenu": {
        "documentURI": "/15/amendements/1490/AN/1369.pdf"
      },
      "dateDispoRepresentation": {
        "@xmlns:xsi": "http://www.w3.org/2001/XMLSchema-instance",
        "@xsi:nil": "true"
      }
    }
  },
  "seanceDiscussion": "RUANR5L15S2019IDS21433",
  "sort": {
    "dateSaisie": "2018-12-19T02:05:18.000+01:00",
    "sortEnSeance": "Adopté"
  },
  "dateDepot": "2018-12-18T01:00:00.000+01:00",
  "dateDistribution": "2018-12-19T01:00:00.000+01:00",
  "article99": "1",
  "loiReference": {
    "codeLoi": {
      "@xmlns:xsi": "http://www.w3.org/2001/XMLSchema-instance",
      "@xsi:nil": "true"
    },
    "divisionCodeLoi": {
      "@xmlns:xsi": "http://www.w3.org/2001/XMLSchema-instance",
      "@xsi:nil": "true"
    }
  }
}