{
  "@xmlns": "http://schemas.assemblee-nationale.fr/referentiel",
  "uid": "AMANR5L15SEA717460B0235P2D1N1629",
  "identifiant": {
    "legislature": "15",
    "numero": "1629",
    "numRect": "0",
    "saisine": {
      "refTexteLegislatif": "PRJLANR5L15B0235",
      "numeroPartiePLF": "2",
      "organeExamen": "PO717460",
      "mentionSecondeDeliberation": "0"
    }
  },
  "numeroLong": "II-1629",
  "etapeTexte": "1ère lecture (1ère assemblée saisie)",
  "triAmendement": "zzzzzzzzzzzzzz",
  "cardinaliteAmdtMultiples": "1",
  "amendementParent": {
    "@xmlns:xsi": "http://www.w3.org/2001/XMLSchema-instance",
    "@xsi:nil": "true"
  },
  "etat": "Irrecevable",
  "signataires": {
    "auteur": {
      "typeAuteur": "Depute",
      "acteurRef": "PA721916",
      "organeRef": {
        "@xmlns:xsi": "http://www.w3.org/2001/XMLSchema-instance",
        "@xsi:nil": "true"
      },
      "groupePolitiqueRef": "PO730964"
    },
    "cosignataires": {
      "acteurRef": "PA721916"
    },
    "texteAffichable": "Mme&#160;Pouzyreff"
  },
  "pointeurFragmentTexte": {
    "missionVisee": {
      "@xmlns:xsi": "http://www.w3.org/2001/XMLSchema-instance",
      "@xsi:nil": "true"
    },
    "division": {
      "titre": "Article 45",
      "articleDesignationCourte": "APRÈS ART. 45",
      "type": "ARTICLE",
      "avant_A_Apres": "Après",
      "divisionRattachee": "APRÈS L'ARTICLE 45, insérer l'article suivant:",
      "articleAdditionnel": "1",
      "chapitreAdditionnel": {
        "@xmlns:xsi": "http://www.w3.org/2001/XMLSchema-instance",
        "@xsi:nil": "true"
      },
      "urlDivisionTexteVise": "/15/textes/0235C.asp#D_Article_45"
    },
    "alinea": {
      "@xmlns:xsi": "http://www.w3.org/2001/XMLSchema-instance",
      "@xsi:nil": "true"
    }
  },
  "corps": {
    "dispositif": "<p style=\"text-align: justify;\">&#160;</p><p style=\"text-align: justify;\">I.&#160;&#8211;&#160;Le K du II de l&#8217;article&#160;244 <i>quater</i> B du code g&#233;n&#233;ral des imp&#244;ts est ainsi modifi&#233;&#160;:</p><p style=\"text-align: justify;\">1&#176; Le 1&#176; est ainsi r&#233;dig&#233;&#160;: </p><p style=\"text-align: justify;\">&#171;&#160;1&#176; Les dotations aux amortissements des immobilisations, cr&#233;&#233;es ou acquises &#224; l&#8217;&#233;tat neuf et affect&#233;es directement &#224; la r&#233;alisation d&#8217;op&#233;rations de recherche scientifique et technique, y compris la r&#233;alisation d&#8217;op&#233;rations de conception de prototypes ou d&#8217;installations pilotes et le d&#233;veloppement de proc&#233;d&#233;s d&#8217;industrialisation&#160;;&#160;&#187;&#160;;</p><p style=\"text-align: justify;\">2&#176; Au deuxi&#232;me alin&#233;a du 6&#176;, le montant&#160;: &#171;&#160;400&#160;000&#160;&#8364;&#160;&#187; est remplac&#233; par le montant&#160;: &#171;&#160;800&#160;000&#160;&#8364;&#160;&#187;.</p><p style=\"text-align: justify;\">II.&#160;&#8211;&#160;La perte de recettes pour l&#8217;&#201;tat est compens&#233;e &#224; due concurrence par la cr&#233;ation d&#8217;une taxe additionnelle aux droits mentionnes aux articles 575 et 575 A du code&#160;g&#233;n&#233;ral&#160;des imp&#244;ts.</p><p style=\"text-align: justify;\">&#160;</p>",
    "exposeSommaire": "<p style=\"text-align: justify;\">Le Cr&#233;dit d&#8217;Imp&#244;t Innovation est un dispositif li&#233; au CIR d&#233;di&#233; &#224; l&#8217;innovation dans les PME. Si&#160;le CIR a des effets positifs sur la comp&#233;titivit&#233; et constitue un avantage reconnu, il s&#8217;agit de veiller &#224; ce qu&#8217;il b&#233;n&#233;ficie tout autant &#224; l&#8217;innovation men&#233;e par les PME.&#160;</p><p style=\"text-align: justify;\">Afin de stimuler les investissements dans les PME et ETI innovantes, cet amendement propose de doubler le plafond des d&#233;penses &#233;ligibles et d&#8217;y inclure le d&#233;veloppement et l&#8217;automatisation de proc&#233;d&#233;s industriels de pointe.&#160;</p><p style=\"text-align: justify;\">En appui du PIA3 et de la future loi entreprise, il a pour finalit&#233; de cr&#233;er les conditions favorables aux PME/ ETI pour qu&#8217;elles investissent et se d&#233;veloppent.</p>",
    "annexeExposeSommaire": {
      "@xmlns:xsi": "http://www.w3.org/2001/XMLSchema-instance",
      "@xsi:nil": "true"
    }
  },
  "representations": {
    "representation": {
      "nom": "PDF",
      "typeMime": {
        "type": "application",
        "subType": "PDF"
      },
      "statutRepresentation": {
        "verbatim": "true",
        "canonique": "true",
        "officielle": "true",
        "transcription": "false",
        "enregistrement": "false"
      },
      "repSource": {
        "@xmlns:xsi": "http://www.w3.org/2001/XMLSchema-instance",
        "@xsi:nil": "true"
      },
      "offset": {
        "@xmlns:xsi": "http://www.w3.org/2001/XMLSchema-instance",
        "@xsi:nil": "true"
      },
      "contenu": {
        "documentURI": "/15/amendements/0235C/AN/1629.pdf"
      },
      "dateDispoRepresentation": {
        "@xmlns:xsi": "http://www.w3.org/2001/XMLSchema-instance",
        "@xsi:nil": "true"
      }
    }
  },
  "seanceDiscussion": {
    "@xmlns:xsi": "http://www.w3.org/2001/XMLSchema-instance",
    "@xsi:nil": "true"
  },
  "sort": {
    "@xmlns:xsi": "http://www.w3.org/2001/XMLSchema-instance",
    "@xsi:nil": "true"
  },
  "dateDepot": "2017-11-13T01:00:00.000+01:00",
  "dateDistribution": {
    "@xmlns:xsi": "http://www.w3.org/2001/XMLSchema-instance",
    "@xsi:nil": "true"
  },
  "article99": "0",
  "loiReference": {
    "codeLoi": "CGI",
    "divisionCodeLoi": "244 quater B"
  }
}