{
  "@xmlns": "http://schemas.assemblee-nationale.fr/referentiel",
  "uid": "AMANR5L15PO766718B2187P0D1N1135",
  "identifiant": {
    "legislature": "15",
    "numero": "1135",
    "numRect": "0",
    "saisine": {
      "refTexteLegislatif": "PRJLANR5L15B2187",
      "numeroPartiePLF": "0",
      "organeExamen": "PO766718",
      "mentionSecondeDeliberation": "0"
    }
  },
  "numeroLong": "1135",
  "etapeTexte": "1ère lecture (1ère assemblée saisie)",
  "triAmendement": "apaaaaaaaaaaaaaaaaaaaaaaaaaaaaaaaaaaaaaaaaaaaaaaaakrxuo",
  "cardinaliteAmdtMultiples": "1",
  "amendementParent": {
    "@xmlns:xsi": "http://www.w3.org/2001/XMLSchema-instance",
    "@xsi:nil": "true"
  },
  "etat": "Discuté",
  "signataires": {
    "auteur": {
      "typeAuteur": "Depute",
      "acteurRef": "PA719558",
      "organeRef": {
        "@xmlns:xsi": "http://www.w3.org/2001/XMLSchema-instance",
        "@xsi:nil": "true"
      },
      "groupePolitiqueRef": "PO730970"
    },
    "cosignataires": {
      "acteurRef": [
        "PA719874",
        "PA722284",
        "PA719488",
        "PA721530",
        "PA719558"
      ]
    },
    "texteAffichable": "M.&#160;Balanant,  M.&#160;Fuchs, Mme&#160;Luquet, M.&#160;Berta, rapporteur et Mme&#160;Jacquier-Laforge"
  },
  "pointeurFragmentTexte": {
    "missionVisee": {
      "@xmlns:xsi": "http://www.w3.org/2001/XMLSchema-instance",
      "@xsi:nil": "true"
    },
    "division": {
      "titre": "Article 4",
      "articleDesignationCourte": "ART. 4",
      "type": "ARTICLE",
      "avant_A_Apres": "A",
      "divisionRattachee": "ARTICLE 4",
      "articleAdditionnel": {
        "@xmlns:xsi": "http://www.w3.org/2001/XMLSchema-instance",
        "@xsi:nil": "true"
      },
      "chapitreAdditionnel": {
        "@xmlns:xsi": "http://www.w3.org/2001/XMLSchema-instance",
        "@xsi:nil": "true"
      },
      "urlDivisionTexteVise": "/15/textes/2187.asp#D_Article_4"
    },
    "alinea": {
      "avant_A_Apres": {
        "@xmlns:xsi": "http://www.w3.org/2001/XMLSchema-instance",
        "@xsi:nil": "true"
      },
      "numero": "6",
      "alineaDesignation": {
        "@xmlns:xsi": "http://www.w3.org/2001/XMLSchema-instance",
        "@xsi:nil": "true"
      }
    }
  },
  "corps": {
    "dispositif": "<p style=\"text-align: justify;\">L&#8217;article&#160;4 est ainsi modifi&#233;&#160;:</p><p style=\"text-align: justify;\">I. - &#192; l&#8217;alin&#233;a&#160;6, apr&#232;s les mots &#171;&#160;les couples compos&#233;s d&#8217;un homme et d&#8217;une femme&#160;&#187;, ins&#233;rer les mots &#171;&#160;ou de deux femmes&#160;&#187;.</p><p style=\"text-align: justify;\">II. - A l&#8217;alin&#233;a&#160;9, apr&#232;s les mots &#171;&#160;Il est &#233;galement priv&#233; d&#8217;effet lorsque&#160;&#187;, remplacer les mots &#171;&#160;l&#8217;homme ou la femme&#160;&#187; par les mots &#171;&#160;l&#8217;un ou l&#8217;autre des membres du couple&#160;&#187;.</p><p style=\"text-align: justify;\">III.- Supprimer les alin&#233;as 10 &#224; 34 inclus.</p>",
    "exposeSommaire": "<p style=\"text-align: justify;\">Cet amendement a pour objet de supprimer la proc&#233;dure sp&#233;cifique d&#8217;&#233;tablissement de la filiation pour les couples de femmes qui ont recours &#224; l&#8217;assistance m&#233;dicale &#224; la procr&#233;ation. L&#8217;ouverture de l&#8217;assistance m&#233;dicale &#224; la procr&#233;ation aux couples de femmes est une avanc&#233;e sociale incontestable dans notre soci&#233;t&#233;. Mais plusieurs associations LGBT ont d&#233;nonc&#233; le dispositif de pr&#233;somption d&#8217;engagement retenu sous le terme de &#171;&#160;d&#233;claration anticip&#233;e de volont&#233;&#160;&#187; pour les couples de femmes. Ce mode d&#8217;&#233;tablissement de filiation risquerait de stigmatiser les parents homosexuels et leurs enfants, qui seraient marqu&#233;s au fer rouge par l&#8217;inscription de l&#8217;orientation sexuelle de leurs parents sur leur &#233;tat civil. Afin de ne pas marginaliser les couples de femmes, et pour des raisons d&#8217;&#233;galit&#233; entre les couples, les modes d&#8217;&#233;tablissement de filiation de droit commun devrait leur &#234;tre appliqu&#233;s.</p>",
    "annexeExposeSommaire": {
      "@xmlns:xsi": "http://www.w3.org/2001/XMLSchema-instance",
      "@xsi:nil": "true"
    },
    "cartoucheDelaiDepotDepasse": {
      "@xmlns:xsi": "http://www.w3.org/2001/XMLSchema-instance",
      "@xsi:nil": "true"
    },
    "avantAppel": {
      "@xmlns:xsi": "http://www.w3.org/2001/XMLSchema-instance",
      "@xsi:nil": "true"
    }
  },
  "representations": {
    "representation": {
      "nom": "PDF",
      "typeMime": {
        "type": "application",
        "subType": "PDF"
      },
      "statutRepresentation": {
        "verbatim": "true",
        "canonique": "true",
        "officielle": "true",
        "transcription": "false",
        "enregistrement": "false"
      },
      "repSource": {
        "@xmlns:xsi": "http://www.w3.org/2001/XMLSchema-instance",
        "@xsi:nil": "true"
      },
      "offset": {
        "@xmlns:xsi": "http://www.w3.org/2001/XMLSchema-instance",
        "@xsi:nil": "true"
      },
      "contenu": {
        "documentURI": "/15/amendements/2187/CSBIOETH/1135.pdf"
      },
      "dateDispoRepresentation": {
        "@xmlns:xsi": "http://www.w3.org/2001/XMLSchema-instance",
        "@xsi:nil": "true"
      }
    }
  },
  "seanceDiscussion": {
    "@xmlns:xsi": "http://www.w3.org/2001/XMLSchema-instance",
    "@xsi:nil": "true"
  },
  "sort": {
    "dateSaisie": "2019-09-13T00:07:48.000+02:00",
    "sortEnSeance": "Tombé"
  },
  "dateDepot": "2019-09-05T02:00:00.000+02:00",
  "dateDistribution": "2019-09-10T02:00:00.000+02:00",
  "article99": "0",
  "loiReference": {
    "codeLoi": {
      "@xmlns:xsi": "http://www.w3.org/2001/XMLSchema-instance",
      "@xsi:nil": "true"
    },
    "divisionCodeLoi": {
      "@xmlns:xsi": "http://www.w3.org/2001/XMLSchema-instance",
      "@xsi:nil": "true"
    }
  }
}