{
  "@xmlns": "http://schemas.assemblee-nationale.fr/referentiel",
  "uid": "AMANR5L15SEA717460BTC2073P0D1N176",
  "identifiant": {
    "legislature": "15",
    "numero": "176",
    "numRect": "0",
    "saisine": {
      "refTexteLegislatif": "PRJLANR5L15BTC2073",
      "numeroPartiePLF": "0",
      "organeExamen": "PO717460",
      "mentionSecondeDeliberation": "0"
    }
  },
  "numeroLong": "176",
  "etapeTexte": "Nouvelle Lecture",
  "triAmendement": "bsaaaaaaaaaaaaaaaaaaaaaaaaaaaaaaaaaaaaaaaaaaaaaaaajqs",
  "cardinaliteAmdtMultiples": "1",
  "amendementParent": {
    "@xmlns:xsi": "http://www.w3.org/2001/XMLSchema-instance",
    "@xsi:nil": "true"
  },
  "etat": "Discuté",
  "signataires": {
    "auteur": {
      "typeAuteur": "Depute",
      "acteurRef": "PA643134",
      "organeRef": {
        "@xmlns:xsi": "http://www.w3.org/2001/XMLSchema-instance",
        "@xsi:nil": "true"
      },
      "groupePolitiqueRef": "PO730934"
    },
    "cosignataires": {
      "acteurRef": [
        "PA643134",
        "PA346218",
        "PA330684",
        "PA608016",
        "PA718884",
        "PA721410",
        "PA330008",
        "PA608416",
        "PA266793",
        "PA721046",
        "PA709315",
        "PA266808",
        "PA334654",
        "PA642847",
        "PA605036",
        "PA720100",
        "PA1874"
      ]
    },
    "texteAffichable": "Mme&#160;Valentin,  M.&#160;Abad, Mme&#160;Bassire, M.&#160;Bazin, Mme&#160;Bazin-Malgras, Mme&#160;Bonnivard, M.&#160;Bony, M.&#160;Breton, M.&#160;Le Fur, M.&#160;Hetzel, M.&#160;Rolland, M.&#160;Straumann, M.&#160;Viala, Mme&#160;Louwagie, M.&#160;Masson, Mme&#160;Val&#233;rie&#160;Boyer et M.&#160;Pradi&#233;"
  },
  "pointeurFragmentTexte": {
    "missionVisee": {
      "@xmlns:xsi": "http://www.w3.org/2001/XMLSchema-instance",
      "@xsi:nil": "true"
    },
    "division": {
      "titre": "Article 3",
      "articleDesignationCourte": "ART. 3",
      "type": "ARTICLE",
      "avant_A_Apres": "A",
      "divisionRattachee": "ARTICLE 3",
      "articleAdditionnel": {
        "@xmlns:xsi": "http://www.w3.org/2001/XMLSchema-instance",
        "@xsi:nil": "true"
      },
      "chapitreAdditionnel": {
        "@xmlns:xsi": "http://www.w3.org/2001/XMLSchema-instance",
        "@xsi:nil": "true"
      },
      "urlDivisionTexteVise": "/15/textes/2073.asp#D_Article_3"
    },
    "alinea": {
      "avant_A_Apres": {
        "@xmlns:xsi": "http://www.w3.org/2001/XMLSchema-instance",
        "@xsi:nil": "true"
      },
      "numero": "1",
      "alineaDesignation": {
        "@xmlns:xsi": "http://www.w3.org/2001/XMLSchema-instance",
        "@xsi:nil": "true"
      }
    }
  },
  "corps": {
    "dispositif": "<p style=\"text-align: justify;\">&#192; l&#8217;alin&#233;a&#160;1, apr&#232;s le mot&#160;:</p><p style=\"text-align: justify;\">&#171;&#160;restauration&#160;&#187;,</p><p style=\"text-align: justify;\">ins&#233;rer les mots&#160;:</p><p style=\"text-align: justify;\">&#171;&#160;dans le dernier &#233;tat visuel connu avant le sinistre&#160;&#187;.</p>",
    "exposeSommaire": "<p style=\"text-align: justify;\">Si tout le monde convient que les mat&#233;riaux utilis&#233;s ne seront pas identiques, en revanche la restauration de ce lieu de culte doit se faire dans le dernier &#233;tat visuel connu avant le sinistre, respectant en cela la charte de Venise.</p>",
    "annexeExposeSommaire": {
      "@xmlns:xsi": "http://www.w3.org/2001/XMLSchema-instance",
      "@xsi:nil": "true"
    },
    "cartoucheDelaiDepotDepasse": {
      "@xmlns:xsi": "http://www.w3.org/2001/XMLSchema-instance",
      "@xsi:nil": "true"
    }
  },
  "representations": {
    "representation": {
      "nom": "PDF",
      "typeMime": {
        "type": "application",
        "subType": "PDF"
      },
      "statutRepresentation": {
        "verbatim": "true",
        "canonique": "true",
        "officielle": "true",
        "transcription": "false",
        "enregistrement": "false"
      },
      "repSource": {
        "@xmlns:xsi": "http://www.w3.org/2001/XMLSchema-instance",
        "@xsi:nil": "true"
      },
      "offset": {
        "@xmlns:xsi": "http://www.w3.org/2001/XMLSchema-instance",
        "@xsi:nil": "true"
      },
      "contenu": {
        "documentURI": "/15/amendements/2073/AN/176.pdf"
      },
      "dateDispoRepresentation": {
        "@xmlns:xsi": "http://www.w3.org/2001/XMLSchema-instance",
        "@xsi:nil": "true"
      }
    }
  },
  "seanceDiscussion": "RUANR5L15S2019IDS21747",
  "sort": {
    "dateSaisie": "2019-07-03T00:40:41.000+02:00",
    "sortEnSeance": "Rejeté"
  },
  "dateDepot": "2019-06-28T02:00:00.000+02:00",
  "dateDistribution": "2019-07-02T02:00:00.000+02:00",
  "article99": "0",
  "loiReference": {
    "codeLoi": {
      "@xmlns:xsi": "http://www.w3.org/2001/XMLSchema-instance",
      "@xsi:nil": "true"
    },
    "divisionCodeLoi": {
      "@xmlns:xsi": "http://www.w3.org/2001/XMLSchema-instance",
      "@xsi:nil": "true"
    }
  }
}