{
  "@xmlns": "http://schemas.assemblee-nationale.fr/referentiel",
  "uid": "AMANR5L15SEA717460BTC0857P0D1N747",
  "identifiant": {
    "legislature": "15",
    "numero": "747",
    "numRect": "0",
    "saisine": {
      "refTexteLegislatif": "PRJLANR5L15BTC0857",
      "numeroPartiePLF": "0",
      "organeExamen": "PO717460",
      "mentionSecondeDeliberation": "0"
    }
  },
  "numeroLong": "747",
  "etapeTexte": "1ère lecture (1ère assemblée saisie)",
  "triAmendement": "wi",
  "cardinaliteAmdtMultiples": "1",
  "amendementParent": {
    "@xmlns:xsi": "http://www.w3.org/2001/XMLSchema-instance",
    "@xsi:nil": "true"
  },
  "etat": "Irrecevable",
  "signataires": {
    "auteur": {
      "typeAuteur": "Depute",
      "acteurRef": "PA719138",
      "organeRef": {
        "@xmlns:xsi": "http://www.w3.org/2001/XMLSchema-instance",
        "@xsi:nil": "true"
      },
      "groupePolitiqueRef": "PO723569"
    },
    "cosignataires": {
      "acteurRef": [
        "PA719138",
        "PA719146",
        "PA719286"
      ]
    },
    "texteAffichable": "M.&#160;Castellani,  M.&#160;Acquaviva et M.&#160;Colombani"
  },
  "pointeurFragmentTexte": {
    "missionVisee": {
      "@xmlns:xsi": "http://www.w3.org/2001/XMLSchema-instance",
      "@xsi:nil": "true"
    },
    "division": {
      "titre": "Article 19 bis",
      "articleDesignationCourte": "APRÈS ART. 19 BIS",
      "type": "ARTICLE",
      "avant_A_Apres": "Après",
      "divisionRattachee": "APRÈS L'ARTICLE 19 BIS, insérer l'article suivant:",
      "articleAdditionnel": "1",
      "chapitreAdditionnel": {
        "@xmlns:xsi": "http://www.w3.org/2001/XMLSchema-instance",
        "@xsi:nil": "true"
      },
      "urlDivisionTexteVise": "/15/textes/0857.asp#D_Article_19_bis"
    },
    "alinea": {
      "@xmlns:xsi": "http://www.w3.org/2001/XMLSchema-instance",
      "@xsi:nil": "true"
    }
  },
  "corps": {
    "dispositif": "<p style=\"text-align: justify;\">Compl&#233;ter cet article par les alin&#233;as suivants&#160;:</p><p style=\"text-align: justify;\">7&#176; L&#8217;article L.&#160;744&#8209;11 est ainsi r&#233;dig&#233;&#160;:&#160;</p><p style=\"text-align: justify;\">&#171;&#160;<i>Art.&#160;L.&#160;744&#8209;11</i>. &#8211; L&#8217;acc&#232;s au march&#233; du travail est autoris&#233; au demandeur d&#8217;asile lorsque l&#8217;Office fran&#231;ais de protection des r&#233;fugi&#233;s et apatrides, pour des raisons qui ne sont pas imputables au demandeur, n&#8217;a pas statu&#233; sur la demande d&#8217;asile dans un d&#233;lai de six mois suivant l&#8217;introduction de la demande, sans que la situation de l&#8217;emploi ne lui soit opposable.&#160;Le demandeur d&#8217;asile qui est autoris&#233; &#224; acc&#233;der au march&#233; du travail b&#233;n&#233;ficie des actions de formation professionnelle continue pr&#233;vues &#224; l&#8217;article L.&#160;6313&#8209;1 du code du travail&#160;&#187;.&#160;</p><p style=\"text-align: justify;\">8&#176; Apr&#232;s l&#8217;article L.&#160;744&#8209;11, il est ins&#233;r&#233; un article L.&#160;744&#8209;12 ainsi r&#233;dig&#233;&#160;:</p><p style=\"text-align: justify;\">&#171;&#160;<i>Art.&#160;L. 744&#8209;12</i>.&#160;&#8211;&#160;Le demandeur d&#8217;asile qui accepte les conditions mat&#233;rielles d&#8217;accueil propos&#233;es en application de l&#8217;article L.&#160;744&#8209;1 a acc&#232;s &#224; une formation linguistique visant &#224; l&#8217;apprentissage de la langue fran&#231;aise dans l&#8217;attente de la d&#233;cision d&#233;finitive lui accordant ou lui refusant une protection au titre de l&#8217;asile ou jusqu&#8217;&#224; son transfert effectif vers un autre &#201;tat responsable de l&#8217;examen de sa demande d&#8217;asile.&#160;&#187;</p>",
    "exposeSommaire": "<p style=\"text-align: justify;\">Cet amendement a pour objectif de favoriser l&#8217;autonomie et l&#8217;insertion des demandeur d&#8217;asile pendant l&#8217;instruction de leur demande par l&#8217;OFPRA en leur garantissant un droit effectif au travail et &#224; la formation professionnelle conform&#233;ment &#224; la directive &#171;&#160;Accueil&#160;&#187; et en leur permettant un acc&#232;s &#224; l&#8217;apprentissage du fran&#231;ais.</p><p style=\"text-align: justify;\">L&#8217;acc&#232;s au travail est un droit fondamental, solidement ancr&#233; dans le droit international, et sans lequel les autres droits perdent bien souvent tout leur sens. Il renforce leur sentiment de dignit&#233;, de respect et d&#8217;estime de soi et permet d&#8217;acc&#233;der &#224; l&#8217;ind&#233;pendance et &#224; l&#8217;autonomie financi&#232;re. L&#8217;emploi est aussi, d&#8217;une mani&#232;re plus g&#233;n&#233;rale, un aspect essentiel de l&#8217;int&#233;gration et peut les aider &#224; se remettre d&#8217;exp&#233;riences bien souvent traumatisantes.</p><p style=\"text-align: justify;\">Dans le cadre de la refonte des r&#232;gles communes, la commission&#160;europ&#233;enne a rappel&#233; l&#8217;importance de l&#8217;acc&#232;s &#224; l&#8217;emploi des demandeurs d&#8217;asile et propose qu&#8217;il soit rendu possible dans un d&#233;lai de 6 mois maximum. Cette proposition est en coh&#233;rence avec l&#8217;objectif de r&#233;duction du d&#233;lai d&#8217;instruction de la demande d&#8217;asile port&#233; par le projet de loi</p><p style=\"text-align: justify;\">Par ailleurs, l&#8217;acc&#232;s des demandeurs d&#8217;asile &#224; des cours de langue fran&#231;aise pendant l&#8217;instruction de leur demande contribue &#233;galement &#224; favoriser leur autonomie. La langue est une barri&#232;re rendant les demandeurs d&#8217;asile d&#233;pendants des structures ou des intervenants sociaux dans toutes leurs d&#233;marches, que ce soit pour la proc&#233;dure d&#8217;asile mais aussi pour l&#8217;acc&#232;s aux soins, l&#8217;accompagnement de leurs enfants &#224; la scolarit&#233; ou tout simplement les actes du quotidien. L&#8217;apprentissage du fran&#231;ais le plus t&#244;t possible est aussi un facteur important pour l&#8217;int&#233;gration et l&#8217;insertion professionnelle de ceux qui obtiendront le statut de r&#233;fugi&#233; ou la protection subsidiaire, ce qui a d&#233;j&#224; &#233;t&#233; mis en &#233;vidence &#224; l&#8217;occasion de programmes sp&#233;cifiques organis&#233;s notamment dans le cadre du Fonds social&#160;europ&#233;en (ex&#160;: Programme d&#8217;Initiative Communautaire &#171;&#160;EQUAL&#160;&#187;)</p><p style=\"text-align: justify;\">Cet amendement vise ainsi &#224; permettre aux demandeurs d&#8217;asile de travailler &#224; partir de 6 mois, sans que la situation de l&#8217;emploi leur soit oppos&#233;e s&#8217;ils ont l&#8217;opportunit&#233; d&#8217;&#234;tre embauch&#233; et &#224; favoriser leur acc&#232;s &#224; des cours de fran&#231;ais le temps de l&#8217;instruction de leur demande.</p>",
    "annexeExposeSommaire": {
      "@xmlns:xsi": "http://www.w3.org/2001/XMLSchema-instance",
      "@xsi:nil": "true"
    }
  },
  "representations": {
    "representation": {
      "nom": "PDF",
      "typeMime": {
        "type": "application",
        "subType": "PDF"
      },
      "statutRepresentation": {
        "verbatim": "true",
        "canonique": "true",
        "officielle": "true",
        "transcription": "false",
        "enregistrement": "false"
      },
      "repSource": {
        "@xmlns:xsi": "http://www.w3.org/2001/XMLSchema-instance",
        "@xsi:nil": "true"
      },
      "offset": {
        "@xmlns:xsi": "http://www.w3.org/2001/XMLSchema-instance",
        "@xsi:nil": "true"
      },
      "contenu": {
        "documentURI": "/15/amendements/0857/AN/747.pdf"
      },
      "dateDispoRepresentation": {
        "@xmlns:xsi": "http://www.w3.org/2001/XMLSchema-instance",
        "@xsi:nil": "true"
      }
    }
  },
  "seanceDiscussion": {
    "@xmlns:xsi": "http://www.w3.org/2001/XMLSchema-instance",
    "@xsi:nil": "true"
  },
  "sort": {
    "@xmlns:xsi": "http://www.w3.org/2001/XMLSchema-instance",
    "@xsi:nil": "true"
  },
  "dateDepot": "2018-04-12T02:00:00.000+02:00",
  "dateDistribution": {
    "@xmlns:xsi": "http://www.w3.org/2001/XMLSchema-instance",
    "@xsi:nil": "true"
  },
  "article99": "0",
  "loiReference": {
    "codeLoi": {
      "@xmlns:xsi": "http://www.w3.org/2001/XMLSchema-instance",
      "@xsi:nil": "true"
    },
    "divisionCodeLoi": {
      "@xmlns:xsi": "http://www.w3.org/2001/XMLSchema-instance",
      "@xsi:nil": "true"
    }
  }
}