{
  "@xmlns": "http://schemas.assemblee-nationale.fr/referentiel",
  "uid": "AMANR5L15PO59048B1255P2D1N1278",
  "identifiant": {
    "legislature": "15",
    "numero": "1278",
    "numRect": "0",
    "saisine": {
      "refTexteLegislatif": "PRJLANR5L15B1255",
      "numeroPartiePLF": "2",
      "organeExamen": "PO59048",
      "mentionSecondeDeliberation": "0"
    }
  },
  "numeroLong": "II-CF1278",
  "etapeTexte": "1ère lecture (1ère assemblée saisie)",
  "triAmendement": "mcaaaaaaaaaaaaaaaaaaaaaaaaaaaaaaaaaaaaaaaaaaaaaaaaab",
  "cardinaliteAmdtMultiples": "1",
  "amendementParent": {
    "@xmlns:xsi": "http://www.w3.org/2001/XMLSchema-instance",
    "@xsi:nil": "true"
  },
  "etat": "Irrecevable",
  "signataires": {
    "auteur": {
      "typeAuteur": "Depute",
      "acteurRef": "PA336175",
      "organeRef": {
        "@xmlns:xsi": "http://www.w3.org/2001/XMLSchema-instance",
        "@xsi:nil": "true"
      },
      "groupePolitiqueRef": "PO759900"
    },
    "cosignataires": {
      "acteurRef": [
        "PA942",
        "PA719286",
        "PA719138",
        "PA336439",
        "PA333421",
        "PA267042",
        "PA608292",
        "PA607619",
        "PA605518",
        "PA720996",
        "PA755549",
        "PA605694",
        "PA336175",
        "PA331582",
        "PA405480",
        "PA719146"
      ]
    },
    "texteAffichable": "Mme&#160;Pinel,  M.&#160;Philippe&#160;Vigier, M.&#160;Pupponi, M.&#160;Acquaviva, M.&#160;Brial, M.&#160;Castellani, M.&#160;Cl&#233;ment, M.&#160;Colombani, M.&#160;Charles&#160;de Courson, Mme&#160;Dubi&#233;, M.&#160;El Guerrab, M.&#160;Falorni, M.&#160;Favennec Becot, M.&#160;Fran&#231;ois-Michel&#160;Lambert, M.&#160;Molac et M.&#160;Pancher"
  },
  "pointeurFragmentTexte": {
    "missionVisee": {
      "@xmlns:xsi": "http://www.w3.org/2001/XMLSchema-instance",
      "@xsi:nil": "true"
    },
    "division": {
      "titre": "Article 71",
      "articleDesignationCourte": "APRÈS ART. 71",
      "type": "ARTICLE",
      "avant_A_Apres": "Après",
      "divisionRattachee": "APRÈS L'ARTICLE 71, insérer l'article suivant:",
      "articleAdditionnel": "1",
      "chapitreAdditionnel": {
        "@xmlns:xsi": "http://www.w3.org/2001/XMLSchema-instance",
        "@xsi:nil": "true"
      },
      "urlDivisionTexteVise": "/15/textes/1255C.asp#D_Article_71"
    },
    "alinea": {
      "@xmlns:xsi": "http://www.w3.org/2001/XMLSchema-instance",
      "@xsi:nil": "true"
    }
  },
  "corps": {
    "dispositif": "<p style=\"text-align: justify;\">I. - Le code de la construction et de l'habitation est ainsi modifi&#233;:</p><p style=\"text-align: justify;\">A la premi&#232;re phrase du troisi&#232;me alin&#233;a de l'article L. 312-1,</p><p style=\"text-align: justify;\">apr&#232;s les mots:</p><p style=\"text-align: justify;\">\"destin&#233;s &#224; l'accession sociale &#224; la propri&#233;t&#233;\"</p><p style=\"text-align: justify;\">ins&#233;rer les mots:</p><p style=\"text-align: justify;\">\"ou &#224; l'acquisition de droits r&#233;els immobiliers dans le cadre d'un bail r&#233;el solidaire , \"</p><p>II.&#160;&#8211;&#160;La perte de recettes pour l&#8217;&#201;tat est compens&#233;e &#224; due concurrence par la cr&#233;ation d&#8217;une taxe additionnelle aux droits mentionn&#233;s aux articles 575 et 575 A du code g&#233;n&#233;ral des imp&#244;ts.</p><p>III.&#160;&#8211;&#160;La perte de recettes pour les collectivit&#233;s territoriales est compens&#233;e &#224; due concurrence par la majoration de la dotation globale de fonctionnement et, corr&#233;lativement pour l&#8217;&#201;tat, par la cr&#233;ation d&#8217;une taxe additionnelle aux droits mentionn&#233;s aux articles 575 et 575 A du code g&#233;n&#233;ral des imp&#244;ts.</p>",
    "exposeSommaire": "<p style=\"text-align: justify;\">Le pr&#233;sent amendement vise &#224; ouvrir la garantie du pr&#234;t d'accession sociale aux preneurs de droits r&#233;els par modification de l'article L. 312-1 du code de la construction et de l'habitation.</p><p style=\"text-align: justify;\">La cr&#233;ation r&#233;cente du bail r&#233;el solidaire (BRS) permet de favoriser notamment l&#8217;accession sociale &#224; la propri&#233;t&#233; en dissociant le foncier et le b&#226;ti. Le BRS permet de consentir des droits r&#233;els immobiliers portant sur des logements en vue notamment de l'accession &#224; la propri&#233;t&#233;. Le m&#233;nage acc&#233;dant supporte la charge du co&#251;t du b&#226;ti et verse une redevance lui permettant d'occuper le foncier. Il permet une accession &#224; la propri&#233;t&#233; pour les m&#233;nages modestes sous plafond de ressources, particuli&#232;rement en zone tendue, qui louent du foncier contre une redevance moindre &#224; un organisme de foncier solidaire (OFS) pour y faire construire leur logement. </p><p style=\"text-align: justify;\">Les preneurs de droits r&#233;els immobiliers doivent s'acquitter d'une part de leur mensualit&#233; de pr&#234;t et d'autre part d'une redevance aupr&#232;s de l'OFS. Actuellement, les acc&#233;dants &#224; la propri&#233;t&#233; peuvent b&#233;n&#233;ficier, sous condition de ressources, au titre de leurs mensualit&#233;s de pr&#234;t, du pr&#234;t d'accession sociale garanti en partie par l&#8217;&#201;tat au titre du Fonds de Garantie pour l'Accession Sociale. Cependant, les preneurs de droits r&#233;els immobiliers ne peuvent pas en b&#233;n&#233;ficier.</p><p style=\"text-align: justify;\">C'est pourquoi, cet amendement souhaite permettre aux acqu&#233;reurs de droits r&#233;els immobiliers de pouvoir b&#233;n&#233;ficier du pr&#234;t d'accession sociale, en vue d'assurer une &#233;galit&#233; de traitement entre eux et les acc&#233;dants &#224; la propri&#233;t&#233;.</p><p style=\"text-align: justify;\">&#160;</p>",
    "annexeExposeSommaire": {
      "@xmlns:xsi": "http://www.w3.org/2001/XMLSchema-instance",
      "@xsi:nil": "true"
    }
  },
  "representations": {
    "representation": {
      "nom": "PDF",
      "typeMime": {
        "type": "application",
        "subType": "PDF"
      },
      "statutRepresentation": {
        "verbatim": "true",
        "canonique": "true",
        "officielle": "true",
        "transcription": "false",
        "enregistrement": "false"
      },
      "repSource": {
        "@xmlns:xsi": "http://www.w3.org/2001/XMLSchema-instance",
        "@xsi:nil": "true"
      },
      "offset": {
        "@xmlns:xsi": "http://www.w3.org/2001/XMLSchema-instance",
        "@xsi:nil": "true"
      },
      "contenu": {
        "documentURI": "/15/amendements/1255C/CION_FIN/CF1278.pdf"
      },
      "dateDispoRepresentation": {
        "@xmlns:xsi": "http://www.w3.org/2001/XMLSchema-instance",
        "@xsi:nil": "true"
      }
    }
  },
  "seanceDiscussion": {
    "@xmlns:xsi": "http://www.w3.org/2001/XMLSchema-instance",
    "@xsi:nil": "true"
  },
  "sort": {
    "@xmlns:xsi": "http://www.w3.org/2001/XMLSchema-instance",
    "@xsi:nil": "true"
  },
  "dateDepot": "2018-11-02T01:00:00.000+01:00",
  "dateDistribution": {
    "@xmlns:xsi": "http://www.w3.org/2001/XMLSchema-instance",
    "@xsi:nil": "true"
  },
  "article99": "0",
  "loiReference": {
    "codeLoi": "construction et habitation",
    "divisionCodeLoi": "L 312-1"
  }
}