{
  "@xmlns": "http://schemas.assemblee-nationale.fr/referentiel",
  "uid": "AMANR5L15SEA717460BTC0971P0D1N2971",
  "identifiant": {
    "legislature": "15",
    "numero": "2971",
    "numRect": "0",
    "saisine": {
      "refTexteLegislatif": "PRJLANR5L15BTC0971",
      "numeroPartiePLF": "0",
      "organeExamen": "PO717460",
      "mentionSecondeDeliberation": "0"
    }
  },
  "numeroLong": "2971",
  "etapeTexte": "1ère lecture (1ère assemblée saisie)",
  "triAmendement": "eabddzs",
  "cardinaliteAmdtMultiples": "1",
  "amendementParent": {
    "@xmlns:xsi": "http://www.w3.org/2001/XMLSchema-instance",
    "@xsi:nil": "true"
  },
  "etat": "Discuté",
  "signataires": {
    "auteur": {
      "typeAuteur": "Depute",
      "acteurRef": "PA642695",
      "organeRef": {
        "@xmlns:xsi": "http://www.w3.org/2001/XMLSchema-instance",
        "@xsi:nil": "true"
      },
      "groupePolitiqueRef": "PO730964"
    },
    "cosignataires": {
      "acteurRef": [
        "PA642695",
        "PA721522"
      ]
    },
    "texteAffichable": "M.&#160;Bothorel et M.&#160;Batut"
  },
  "pointeurFragmentTexte": {
    "missionVisee": {
      "@xmlns:xsi": "http://www.w3.org/2001/XMLSchema-instance",
      "@xsi:nil": "true"
    },
    "division": {
      "titre": "Article 62",
      "articleDesignationCourte": "APRÈS ART. 62",
      "type": "ARTICLE",
      "avant_A_Apres": "Après",
      "divisionRattachee": "APRÈS L'ARTICLE 62, insérer l'article suivant:",
      "articleAdditionnel": "1",
      "chapitreAdditionnel": {
        "@xmlns:xsi": "http://www.w3.org/2001/XMLSchema-instance",
        "@xsi:nil": "true"
      },
      "urlDivisionTexteVise": "/15/textes/0971.asp#D_Article_62"
    },
    "alinea": {
      "@xmlns:xsi": "http://www.w3.org/2001/XMLSchema-instance",
      "@xsi:nil": "true"
    }
  },
  "corps": {
    "dispositif": "<p style=\"text-align: justify;\">Le B du II de l&#8217;article L.&#160;34&#8209;9&#8209;1 du code des postes et des communications &#233;lectroniques est compl&#233;t&#233; par un alin&#233;a ainsi r&#233;dig&#233;&#160;:</p><p style=\"text-align: justify;\">&#171;&#160;Par d&#233;rogation, les travaux ayant pour objectif l&#8217;installation d&#8217;un ou de plusieurs op&#233;rateurs sur un &#233;quipement existant, ne rel&#232;vent pas du r&#233;gime pr&#233;vu aux deux alin&#233;as pr&#233;c&#233;dents, d&#232;s lors que le support ne fait pas l&#8217;objet d&#8217;une extension ou d&#8217;une rehausse substantielle.&#160;&#187;</p>",
    "exposeSommaire": "<p style=\"text-align: justify;\">Depuis la loi n&#176; 2015136 du 9 f&#233;vrier 2015 relative &#224; la sobri&#233;t&#233;, &#224; la transparence, &#224; l&#8217;information et &#224; la concertation en mati&#232;re d&#8217;exposition aux ondes &#233;lectromagn&#233;tiques, les op&#233;rateurs ont l&#8217;obligation de d&#233;poser un dossier d&#8217;information en mairie deux mois avant la demande d&#8217;autorisation d&#8217;urbanisme (d&#233;claration pr&#233;alable ou permis de construire) pour toute construction ou modification de sites mobiles. Ce dossier vise essentiellement &#224; divulguer des informations relatives &#224; l&#8217;exposition aux ondes. Cette &#233;tape a consid&#233;rablement alourdi et ralentit les proc&#233;dures administratives des op&#233;rateurs notamment dans le d&#233;ploiement des nouvelles technologies (4G) et cela va s&#8217;accroitre avec le d&#233;ploiement de la 5G qui reposera notamment sur des &#171;&#160;small cells&#160;&#187;.</p><p style=\"text-align: justify;\">Il est ici propos&#233; de n&#8217;y soumettre que les constructions de nouveaux sites et non les ajouts de technologies ou d&#8217;op&#233;rateurs qui ne n&#233;cessitent pas de travaux importants. L&#8217;ajout d&#8217;une technologie (par exemple le passage de la 3G &#224; la 4G) ou d&#8217;un nouvel op&#233;rateur sur un site existant, syst&#233;matiquement consid&#233;r&#233; comme une modification substantielle du site ind&#233;pendamment de la r&#233;alit&#233; des travaux effectu&#233;s, est soumis au d&#233;p&#244;t d&#8217;un nouveau DIM. Cela ajoute une complexit&#233; inutile compte tenu du fait que ces modifications doivent obtenir un avis ou une autorisation de l&#8217;ANFR qui a pour mission, entre autres, de veiller au respect des valeurs limites d&#8217;exposition du public. Elle apporte de ce fait d&#233;j&#224; une garantie sur le respect de la r&#233;glementation en vigueur. Il est donc propos&#233; d&#8217;exclure les travaux qui n&#8217;emportent pas de modifications substantielles visant &#224; accueillir un nouvel op&#233;rateur et d&#8217;exon&#233;rer du DIM les travaux de partage d&#8217;infrastructures qui n&#8217;emportent pas de modification substantielle du site.</p>",
    "annexeExposeSommaire": {
      "@xmlns:xsi": "http://www.w3.org/2001/XMLSchema-instance",
      "@xsi:nil": "true"
    }
  },
  "representations": {
    "representation": {
      "nom": "PDF",
      "typeMime": {
        "type": "application",
        "subType": "PDF"
      },
      "statutRepresentation": {
        "verbatim": "true",
        "canonique": "true",
        "officielle": "true",
        "transcription": "false",
        "enregistrement": "false"
      },
      "repSource": {
        "@xmlns:xsi": "http://www.w3.org/2001/XMLSchema-instance",
        "@xsi:nil": "true"
      },
      "offset": {
        "@xmlns:xsi": "http://www.w3.org/2001/XMLSchema-instance",
        "@xsi:nil": "true"
      },
      "contenu": {
        "documentURI": "/15/amendements/0971/AN/2971.pdf"
      },
      "dateDispoRepresentation": {
        "@xmlns:xsi": "http://www.w3.org/2001/XMLSchema-instance",
        "@xsi:nil": "true"
      }
    }
  },
  "seanceDiscussion": "RUANR5L15S2018IDS21139",
  "sort": {
    "dateSaisie": "2018-06-09T02:30:54.000+02:00",
    "sortEnSeance": "Retiré"
  },
  "dateDepot": "2018-05-26T02:00:00.000+02:00",
  "dateDistribution": "2018-06-02T02:00:00.000+02:00",
  "article99": "0",
  "loiReference": {
    "codeLoi": "c postes et communications électroniques",
    "divisionCodeLoi": "L34-9-1"
  }
}