{
  "@xmlns": "http://schemas.assemblee-nationale.fr/referentiel",
  "uid": "AMANR5L15SEA717460B0235P1D1N1359",
  "identifiant": {
    "legislature": "15",
    "numero": "1359",
    "numRect": "0",
    "saisine": {
      "refTexteLegislatif": "PRJLANR5L15B0235",
      "numeroPartiePLF": "1",
      "organeExamen": "PO717460",
      "mentionSecondeDeliberation": "0"
    }
  },
  "numeroLong": "I-1359",
  "etapeTexte": "1ère lecture (1ère assemblée saisie)",
  "triAmendement": "abajk",
  "cardinaliteAmdtMultiples": "1",
  "amendementParent": {
    "@xmlns:xsi": "http://www.w3.org/2001/XMLSchema-instance",
    "@xsi:nil": "true"
  },
  "etat": "Discuté",
  "signataires": {
    "auteur": {
      "typeAuteur": "Gouvernement",
      "acteurRef": {
        "@xmlns:xsi": "http://www.w3.org/2001/XMLSchema-instance",
        "@xsi:nil": "true"
      },
      "organeRef": {
        "@xmlns:xsi": "http://www.w3.org/2001/XMLSchema-instance",
        "@xsi:nil": "true"
      },
      "groupePolitiqueRef": {
        "@xmlns:xsi": "http://www.w3.org/2001/XMLSchema-instance",
        "@xsi:nil": "true"
      }
    },
    "cosignataires": {
      "@xmlns:xsi": "http://www.w3.org/2001/XMLSchema-instance",
      "@xsi:nil": "true"
    },
    "texteAffichable": "le Gouvernement"
  },
  "pointeurFragmentTexte": {
    "missionVisee": {
      "@xmlns:xsi": "http://www.w3.org/2001/XMLSchema-instance",
      "@xsi:nil": "true"
    },
    "division": {
      "titre": "Article 2",
      "articleDesignationCourte": "APRÈS ART. 2",
      "type": "ARTICLE",
      "avant_A_Apres": "Après",
      "divisionRattachee": "APRÈS L'ARTICLE 2, insérer l'article suivant:",
      "articleAdditionnel": "1",
      "chapitreAdditionnel": {
        "@xmlns:xsi": "http://www.w3.org/2001/XMLSchema-instance",
        "@xsi:nil": "true"
      },
      "urlDivisionTexteVise": "/15/textes/0235A.asp#D_Article_2"
    },
    "alinea": {
      "@xmlns:xsi": "http://www.w3.org/2001/XMLSchema-instance",
      "@xsi:nil": "true"
    }
  },
  "corps": {
    "dispositif": "<p style=\"text-align: justify;\">Au 1&#176; du 1 de l&#8217;article 80 <i>duodecies</i> du code g&#233;n&#233;ral des imp&#244;ts, le mot : &#171; et &#187; est remplac&#233; par le signe : &#171; , &#187; et apr&#232;s la r&#233;f&#233;rence : &#171;&#160;L.&#160;1235-13&#160;&#187;, sont ins&#233;r&#233;s les mots : &#171;&#160;,&#160;au 7&#176; de l&#8217;article L.&#160;1237-18-2 et au 5&#176; de l&#8217;article L.&#160;1237-19-1 &#187;.</p>",
    "exposeSommaire": "<p style=\"text-align: justify;\">Cet amendement vise &#224; aligner le r&#233;gime social et fiscal des indemnit&#233;s vers&#233;es dans le cadre d&#8217;un accord portant rupture conventionnelle collective ou dans le cadre d&#8217;une rupture &#224; la suite de l&#8217;acceptation du cong&#233; de mobilit&#233; sur celui applicable aux indemnit&#233;s vers&#233;es dans le cadre d&#8217;un plan de sauvegarde de l&#8217;emploi. </p><p style=\"text-align: justify;\">En effet, les nouveaux r&#233;gimes de la rupture conventionnelle collective et du cong&#233; de mobilit&#233;, cr&#233;&#233;s par l&#8217;ordonnance n&#176; 2017-1387 du 22 septembre 2017 relative &#224; la pr&#233;visibilit&#233; et la s&#233;curisation des relations de travail, viennent compl&#233;ter le droit du travail en mati&#232;re de rupture collective.</p><p style=\"text-align: justify;\">Aussi les ajustements port&#233;s par cet amendement visent-ils &#224; pr&#233;ciser leur traitement au regard de l&#8217;imp&#244;t sur le revenu en garantissant, par coh&#233;rence, un r&#233;gime fiscal similaire &#224; celui des indemnit&#233;s de rupture vers&#233;es dans le cadre d&#8217;un plan de sauvegarde de l&#8217;emploi. Elles seront donc exon&#233;r&#233;es d&#8217;imp&#244;t sur le revenu. </p><p style=\"text-align: justify;\">Cette disposition emportera aussi des cons&#233;quences au plan social et ces nouvelles indemnit&#233;s b&#233;n&#233;ficieront d&#8217;un traitement social &#233;quivalent &#224; celui des autres indemnit&#233;s de rupture. Cr&#233;ant une perte de recette pour la s&#233;curit&#233; sociale, une disposition de non compensation est pr&#233;vue en projet de loi de financement de la s&#233;curit&#233; sociale, en application du IV de l'article LO. 111-3 du code de la s&#233;curit&#233; sociale.</p>",
    "annexeExposeSommaire": {
      "@xmlns:xsi": "http://www.w3.org/2001/XMLSchema-instance",
      "@xsi:nil": "true"
    }
  },
  "representations": {
    "representation": {
      "nom": "PDF",
      "typeMime": {
        "type": "application",
        "subType": "PDF"
      },
      "statutRepresentation": {
        "verbatim": "true",
        "canonique": "true",
        "officielle": "true",
        "transcription": "false",
        "enregistrement": "false"
      },
      "repSource": {
        "@xmlns:xsi": "http://www.w3.org/2001/XMLSchema-instance",
        "@xsi:nil": "true"
      },
      "offset": {
        "@xmlns:xsi": "http://www.w3.org/2001/XMLSchema-instance",
        "@xsi:nil": "true"
      },
      "contenu": {
        "documentURI": "/15/amendements/0235A/AN/1359.pdf"
      },
      "dateDispoRepresentation": {
        "@xmlns:xsi": "http://www.w3.org/2001/XMLSchema-instance",
        "@xsi:nil": "true"
      }
    }
  },
  "seanceDiscussion": "RUANR5L15S2018IDS20700",
  "sort": {
    "dateSaisie": "2017-10-21T00:29:57.000+02:00",
    "sortEnSeance": "Adopté"
  },
  "dateDepot": "2017-10-18T02:00:00.000+02:00",
  "dateDistribution": "2017-10-18T02:00:00.000+02:00",
  "article99": "1",
  "loiReference": {
    "codeLoi": "CGI",
    "divisionCodeLoi": "80 duodecies"
  }
}