{
  "@xmlns": "http://schemas.assemblee-nationale.fr/referentiel",
  "uid": "AMANR5L15SEA717460BTC0575P0D1N443",
  "identifiant": {
    "legislature": "15",
    "numero": "443",
    "numRect": "0",
    "saisine": {
      "refTexteLegislatif": "PRJLANR5L15BTC0575",
      "numeroPartiePLF": "0",
      "organeExamen": "PO717460",
      "mentionSecondeDeliberation": "0"
    }
  },
  "numeroLong": "443",
  "etapeTexte": "1ère lecture (1ère assemblée saisie)",
  "triAmendement": "apthvw",
  "cardinaliteAmdtMultiples": "1",
  "amendementParent": {
    "@xmlns:xsi": "http://www.w3.org/2001/XMLSchema-instance",
    "@xsi:nil": "true"
  },
  "etat": "Discuté",
  "signataires": {
    "auteur": {
      "typeAuteur": "Depute",
      "acteurRef": "PA346054",
      "organeRef": {
        "@xmlns:xsi": "http://www.w3.org/2001/XMLSchema-instance",
        "@xsi:nil": "true"
      },
      "groupePolitiqueRef": "PO730934"
    },
    "cosignataires": {
      "acteurRef": [
        "PA718884",
        "PA712015",
        "PA721968",
        "PA1874",
        "PA346054"
      ]
    },
    "texteAffichable": "M.&#160;Emmanuel&#160;Maquet,  M.&#160;Dive, Mme&#160;Bazin-Malgras, M.&#160;Le Fur et M.&#160;Vialay"
  },
  "pointeurFragmentTexte": {
    "missionVisee": {
      "@xmlns:xsi": "http://www.w3.org/2001/XMLSchema-instance",
      "@xsi:nil": "true"
    },
    "division": {
      "titre": "Article 35",
      "articleDesignationCourte": "APRÈS ART. 35",
      "type": "ARTICLE",
      "avant_A_Apres": "Après",
      "divisionRattachee": "APRÈS L'ARTICLE 35, insérer l'article suivant:",
      "articleAdditionnel": "1",
      "chapitreAdditionnel": {
        "@xmlns:xsi": "http://www.w3.org/2001/XMLSchema-instance",
        "@xsi:nil": "true"
      },
      "urlDivisionTexteVise": "/15/textes/0575.asp#D_Article_35"
    },
    "alinea": {
      "@xmlns:xsi": "http://www.w3.org/2001/XMLSchema-instance",
      "@xsi:nil": "true"
    }
  },
  "corps": {
    "dispositif": "<p style=\"text-align: justify;\">L&#8217;article L.&#160;514&#8209;6 du code de l&#8217;environnement est compl&#233;t&#233; par des V et VI ainsi r&#233;dig&#233;s&#160;:</p><p style=\"text-align: justify;\">&#171;&#160;V.&#160;&#8211;&#160;Le juge administratif qui, saisi de conclusions dirig&#233;es contre une des d&#233;cisions prises en application des articles L.&#160;512&#8209;7&#8209;3 et L.&#160;512&#8209;8, estime, apr&#232;s avoir constat&#233; que les autres moyens ne sont pas fond&#233;s&#160;:</p><p style=\"text-align: justify;\">&#171;&#160;1&#176; Qu&#8217;un vice n&#8217;affecte qu&#8217;une phase de l&#8217;instruction de la demande d&#8217;enregistrement ou de d&#233;claration, ou une partie de cette demande, peut limiter &#224; cette phase ou &#224; cette partie la port&#233;e de l&#8217;annulation qu&#8217;il prononce et demander &#224; l&#8217;autorit&#233; administrative comp&#233;tente de reprendre l&#8217;instruction &#224; la phase ou sur la partie qui a &#233;t&#233; entach&#233;e d&#8217;irr&#233;gularit&#233;&#160;;</p><p style=\"text-align: justify;\">&#171;&#160;2&#176; Qu&#8217;un vice entra&#238;nant l&#8217;ill&#233;galit&#233; de cet acte est susceptible d&#8217;&#234;tre r&#233;gularis&#233; par une d&#233;cision modificative peut, apr&#232;s avoir invit&#233; les parties &#224; pr&#233;senter leurs observations, surseoir &#224; statuer jusqu&#8217;&#224; l&#8217;expiration du d&#233;lai qu&#8217;il fixe pour cette r&#233;gularisation. Si une telle d&#233;cision modificative est notifi&#233;e dans ce d&#233;lai au juge, celui-ci statue apr&#232;s avoir invit&#233; les parties &#224; pr&#233;senter leurs observations.</p><p style=\"text-align: justify;\">&#171;&#160;VI.&#160;&#8211;&#160;En cas d&#8217;annulation ou de sursis &#224; statuer affectant une partie seulement de l&#8217;une des d&#233;cisions vis&#233;es au V, le juge d&#233;termine s&#8217;il y a lieu de suspendre l&#8217;ex&#233;cution des parties de l&#8217;autorisation non vici&#233;es.&#160;&#187;</p>",
    "exposeSommaire": "<p style=\"text-align: justify;\">Il est propos&#233; d&#8217;harmoniser les r&#233;gimes de l&#8217;autorisation environnementale et des installations class&#233;es pour la protection de l&#8217;environnement soumises aux r&#233;gimes de l&#8217;enregistrement et de la d&#233;claration en g&#233;n&#233;ralisant la possibilit&#233; pour le juge de r&#233;gulariser en cours d&#8217;instance l&#8217;arr&#234;t&#233; d&#8217;autorisation d&#8217;exploiter.</p><p style=\"text-align: justify;\">En effet, l&#8217;article L.&#160;181&#8209;18 du code de l&#8217;environnement permet au juge, saisi d&#8217;une demande d&#8217;annulation d&#8217;une autorisation environnementale, de prononcer une annulation partielle de ladite autorisation et de surseoir &#224; statuer jusqu&#8217;&#224; r&#233;gularisation du vice invoqu&#233;.</p><p style=\"text-align: justify;\">Or, une telle possibilit&#233; de r&#233;gularisation n&#8217;est pas pr&#233;vue pour les installations class&#233;es soumises au r&#233;gime de l&#8217;enregistrement et au r&#233;gime de la d&#233;claration.</p><p style=\"text-align: justify;\">D&#232;s lors, il est propos&#233; de permettre au juge de surseoir &#224; statuer jusqu&#8217;&#224; r&#233;gularisation du vice invoqu&#233; pour les ICPE.</p>",
    "annexeExposeSommaire": {
      "@xmlns:xsi": "http://www.w3.org/2001/XMLSchema-instance",
      "@xsi:nil": "true"
    }
  },
  "representations": {
    "representation": {
      "nom": "PDF",
      "typeMime": {
        "type": "application",
        "subType": "PDF"
      },
      "statutRepresentation": {
        "verbatim": "true",
        "canonique": "true",
        "officielle": "true",
        "transcription": "false",
        "enregistrement": "false"
      },
      "repSource": {
        "@xmlns:xsi": "http://www.w3.org/2001/XMLSchema-instance",
        "@xsi:nil": "true"
      },
      "offset": {
        "@xmlns:xsi": "http://www.w3.org/2001/XMLSchema-instance",
        "@xsi:nil": "true"
      },
      "contenu": {
        "documentURI": "/15/amendements/0575/AN/443.pdf"
      },
      "dateDispoRepresentation": {
        "@xmlns:xsi": "http://www.w3.org/2001/XMLSchema-instance",
        "@xsi:nil": "true"
      }
    }
  },
  "seanceDiscussion": "RUANR5L15S2018IDS20868",
  "sort": {
    "dateSaisie": "2018-01-25T18:03:16.000+01:00",
    "sortEnSeance": "Non soutenu"
  },
  "dateDepot": "2018-01-19T01:00:00.000+01:00",
  "dateDistribution": "2018-01-23T01:00:00.000+01:00",
  "article99": "0",
  "loiReference": {
    "codeLoi": "c environnement",
    "divisionCodeLoi": "L514-6"
  }
}