{
  "@xmlns": "http://schemas.assemblee-nationale.fr/referentiel",
  "uid": "AMANR5L15SEA717460BTC1237P0D1N2209",
  "identifiant": {
    "legislature": "15",
    "numero": "2209",
    "numRect": "0",
    "saisine": {
      "refTexteLegislatif": "PRJLANR5L15BTC1237",
      "numeroPartiePLF": "0",
      "organeExamen": "PO717460",
      "mentionSecondeDeliberation": "0"
    }
  },
  "numeroLong": "2209",
  "etapeTexte": "1ère lecture (1ère assemblée saisie)",
  "triAmendement": "eeaaaaaaaaaaaaaaaaaaaaaaaaaaaaaaaaaaaaaaaaaaaaaaaap",
  "cardinaliteAmdtMultiples": "1",
  "amendementParent": {
    "@xmlns:xsi": "http://www.w3.org/2001/XMLSchema-instance",
    "@xsi:nil": "true"
  },
  "etat": "Discuté",
  "signataires": {
    "auteur": {
      "typeAuteur": "Depute",
      "acteurRef": "PA720746",
      "organeRef": {
        "@xmlns:xsi": "http://www.w3.org/2001/XMLSchema-instance",
        "@xsi:nil": "true"
      },
      "groupePolitiqueRef": "PO730970"
    },
    "cosignataires": {
      "acteurRef": [
        "PA719640",
        "PA720326",
        "PA720092",
        "PA719938",
        "PA722374",
        "PA720598",
        "PA721924",
        "PA720652",
        "PA721976",
        "PA719918",
        "PA719210",
        "PA719558",
        "PA721182",
        "PA721530",
        "PA720002",
        "PA721418",
        "PA722284",
        "PA721734",
        "PA721608",
        "PA719488",
        "PA720968",
        "PA719044",
        "PA721234",
        "PA720334",
        "PA720178",
        "PA1276",
        "PA720728",
        "PA721984",
        "PA720976",
        "PA720162",
        "PA720746",
        "PA720720",
        "PA718978",
        "PA720772",
        "PA720704",
        "PA719874",
        "PA721992",
        "PA720764",
        "PA722162",
        "PA717151",
        "PA719266",
        "PA719504",
        "PA720924",
        "PA721742",
        "PA720256"
      ]
    },
    "texteAffichable": "M.&#160;Waserman,  M.&#160;Bolo, M.&#160;Mattei, Mme&#160;Jacquier-Laforge, M.&#160;Laqhila, Mme&#160;Vichnievsky, M.&#160;Balanant, Mme&#160;Bannier, Mme&#160;Benin, M.&#160;Berta, M.&#160;Bourlanges, M.&#160;Bru, M.&#160;Cubertafon, Mme&#160;de Sarnez, Mme&#160;de Vaucouleurs, Mme&#160;Deprez-Audebert, M.&#160;Duverg&#233;, Mme&#160;El Ha&#239;ry, Mme&#160;Elimas, Mme&#160;Essayan, M.&#160;Fanget, M.&#160;Fesneau, Mme&#160;Florennes, M.&#160;Fuchs, Mme&#160;Gallerneau, M.&#160;Garcia, M.&#160;Hammouche, M.&#160;Isaac-Sibille, M.&#160;Joncour, M.&#160;Lagleize, M.&#160;Lain&#233;, Mme&#160;Lasserre-David, M.&#160;Latombe, Mme&#160;Luquet, M.&#160;Mathiasin, Mme&#160;Mette, M.&#160;Michel-Kleisbauer, M.&#160;Mignola, M.&#160;Millienne, M.&#160;Pahun, M.&#160;Fr&#233;d&#233;ric&#160;Petit, Mme&#160;Maud&#160;Petit, Mme&#160;Poueyto, M.&#160;Ramos et M.&#160;Turquois"
  },
  "pointeurFragmentTexte": {
    "missionVisee": {
      "@xmlns:xsi": "http://www.w3.org/2001/XMLSchema-instance",
      "@xsi:nil": "true"
    },
    "division": {
      "titre": "Article 30",
      "articleDesignationCourte": "ART. 30",
      "type": "ARTICLE",
      "avant_A_Apres": "A",
      "divisionRattachee": "ARTICLE 30",
      "articleAdditionnel": {
        "@xmlns:xsi": "http://www.w3.org/2001/XMLSchema-instance",
        "@xsi:nil": "true"
      },
      "chapitreAdditionnel": {
        "@xmlns:xsi": "http://www.w3.org/2001/XMLSchema-instance",
        "@xsi:nil": "true"
      },
      "urlDivisionTexteVise": "/15/textes/1237.asp#D_Article_30"
    },
    "alinea": {
      "avant_A_Apres": "A",
      "numero": "4",
      "alineaDesignation": "Alinéa 4"
    }
  },
  "corps": {
    "dispositif": "<p style=\"text-align: justify;\">I.&#160;&#8211;&#160;&#192; la fin de l&#8217;alin&#233;a&#160;4, supprimer les mots&#160;:</p><p style=\"text-align: justify;\">&#171;&#160;, &#233;lu par cette assembl&#233;e&#160;&#187;.</p><p style=\"text-align: justify;\">II.&#160;&#8211;&#160;En cons&#233;quence, &#224; la fin de l&#8217;alin&#233;a&#160;5, supprimer les mots&#160;:</p><p style=\"text-align: justify;\">&#171;&#160;, &#233;lu par cette assembl&#233;e&#160;&#187;.</p><p style=\"text-align: justify;\">III.&#160;&#8211;&#160;En cons&#233;quence, &#224; la fin de l&#8217;alin&#233;a&#160;6, supprimer les mots&#160;:</p><p style=\"text-align: justify;\">&#171;&#160;, &#233;lu par cette assembl&#233;e&#160;&#187;.</p>",
    "exposeSommaire": "<p style=\"text-align: justify;\">La loi n&#176;2018&#8209;699 visant &#224; garantir la pr&#233;sence des parlementaires dans certains organismes ext&#233;rieurs au Parlement et &#224; simplifier les modalit&#233;s de leur nomination a &#233;t&#233; promulgu&#233;e le 3 ao&#251;t 2018. Son article&#160;72 pr&#233;voit la suppression de la mention, figurant &#224; l&#8217;article L.&#160;518&#8209;4 du code mon&#233;taire et financier, pr&#233;cisant que les d&#233;put&#233;s et s&#233;nateurs membres de la Commission de surveillance de la Caisse des d&#233;p&#244;ts et consignations sont &#171;&#160;&#233;lus par leur assembl&#233;e&#160;&#187; respective. En effet l&#8217;article&#160;4 de cette loi a vocation &#224; harmoniser les conditions de d&#233;signation des parlementaires dans l&#8217;ensemble des organismes ext&#233;rieurs au Parlement.</p><p style=\"text-align: justify;\">Dans un souci de coh&#233;rence r&#233;dactionnelle et l&#233;gistique avec ces dispositions nouvelles, l&#8217;amendement pr&#233;sent&#233; pr&#233;voit &#233;galement de supprimer les r&#233;f&#233;rences &#224; &#171;&#160;l&#8217;&#233;lection&#160;&#187; des parlementaires par leur assembl&#233;e respective s&#8217;agissant des d&#233;put&#233;s et s&#233;nateurs membres de la Commission de surveillance de la Caisse des d&#233;p&#244;ts et consignations. Ceux-ci seront issus, selon les termes du projet de loi, &#224; la fois des commissions des finances et des affaires &#233;conomiques de chacune des assembl&#233;es.</p>",
    "annexeExposeSommaire": {
      "@xmlns:xsi": "http://www.w3.org/2001/XMLSchema-instance",
      "@xsi:nil": "true"
    }
  },
  "representations": {
    "representation": {
      "nom": "PDF",
      "typeMime": {
        "type": "application",
        "subType": "PDF"
      },
      "statutRepresentation": {
        "verbatim": "true",
        "canonique": "true",
        "officielle": "true",
        "transcription": "false",
        "enregistrement": "false"
      },
      "repSource": {
        "@xmlns:xsi": "http://www.w3.org/2001/XMLSchema-instance",
        "@xsi:nil": "true"
      },
      "offset": {
        "@xmlns:xsi": "http://www.w3.org/2001/XMLSchema-instance",
        "@xsi:nil": "true"
      },
      "contenu": {
        "documentURI": "/15/amendements/1237/AN/2209.pdf"
      },
      "dateDispoRepresentation": {
        "@xmlns:xsi": "http://www.w3.org/2001/XMLSchema-instance",
        "@xsi:nil": "true"
      }
    }
  },
  "seanceDiscussion": "RUANR5L15S2019IDS21258",
  "sort": {
    "dateSaisie": "2018-10-02T23:00:35.000+02:00",
    "sortEnSeance": "Tombé"
  },
  "dateDepot": "2018-09-21T02:00:00.000+02:00",
  "dateDistribution": "2018-09-25T02:00:00.000+02:00",
  "article99": "0",
  "loiReference": {
    "codeLoi": {
      "@xmlns:xsi": "http://www.w3.org/2001/XMLSchema-instance",
      "@xsi:nil": "true"
    },
    "divisionCodeLoi": {
      "@xmlns:xsi": "http://www.w3.org/2001/XMLSchema-instance",
      "@xsi:nil": "true"
    }
  }
}