{
  "@xmlns": "http://schemas.assemblee-nationale.fr/referentiel",
  "uid": "AMANR5L15SEA717460BTC2243P0D1N628",
  "identifiant": {
    "legislature": "15",
    "numero": "628",
    "numRect": "0",
    "saisine": {
      "refTexteLegislatif": "PRJLANR5L15BTC2243",
      "numeroPartiePLF": "0",
      "organeExamen": "PO717460",
      "mentionSecondeDeliberation": "0"
    }
  },
  "numeroLong": "628",
  "etapeTexte": "1ère lecture (1ère assemblée saisie)",
  "triAmendement": "dsaaaaaaaaaaaaaaaaaaaaaaaaaaaaaaaaaaaaaaaaaaaaaaaaeeqzzzzhzzzw",
  "cardinaliteAmdtMultiples": "1",
  "amendementParent": {
    "@xmlns:xsi": "http://www.w3.org/2001/XMLSchema-instance",
    "@xsi:nil": "true"
  },
  "etat": "Discuté",
  "signataires": {
    "auteur": {
      "typeAuteur": "Depute",
      "acteurRef": "PA266797",
      "organeRef": {
        "@xmlns:xsi": "http://www.w3.org/2001/XMLSchema-instance",
        "@xsi:nil": "true"
      },
      "groupePolitiqueRef": "PO730934"
    },
    "cosignataires": {
      "acteurRef": "PA266797"
    },
    "texteAffichable": "M.&#160;Gosselin"
  },
  "pointeurFragmentTexte": {
    "missionVisee": {
      "@xmlns:xsi": "http://www.w3.org/2001/XMLSchema-instance",
      "@xsi:nil": "true"
    },
    "division": {
      "titre": "Article 14",
      "articleDesignationCourte": "ART. 14",
      "type": "ARTICLE",
      "avant_A_Apres": "A",
      "divisionRattachee": "ARTICLE 14",
      "articleAdditionnel": {
        "@xmlns:xsi": "http://www.w3.org/2001/XMLSchema-instance",
        "@xsi:nil": "true"
      },
      "chapitreAdditionnel": {
        "@xmlns:xsi": "http://www.w3.org/2001/XMLSchema-instance",
        "@xsi:nil": "true"
      },
      "urlDivisionTexteVise": "/15/textes/2243.asp#D_Article_14"
    },
    "alinea": {
      "avant_A_Apres": {
        "@xmlns:xsi": "http://www.w3.org/2001/XMLSchema-instance",
        "@xsi:nil": "true"
      },
      "numero": "2",
      "alineaDesignation": {
        "@xmlns:xsi": "http://www.w3.org/2001/XMLSchema-instance",
        "@xsi:nil": "true"
      }
    }
  },
  "corps": {
    "dispositif": "<p style=\"text-align: justify;\">Compl&#233;ter l&#8217;alin&#233;a&#160;2 par la phrase suivante&#160;:</p><p style=\"text-align: justify;\">&#171;&#160;Ces recherches rel&#232;vent de la cat&#233;gorie des recherches d&#233;finies au 3&#176;&#160;de l&#8217;article L.&#160;1121&#8209;1.&#160;&#187;.</p>",
    "exposeSommaire": "<p style=\"text-align: justify;\">Le r&#233;gime de recherches biom&#233;dicales men&#233;es dans le cadre de l&#8217;assistance m&#233;dicale &#224; la procr&#233;ation (AMP) a &#233;t&#233; adopt&#233; par la loi du 26 janvier 2016. Ce nouveau r&#233;gime de recherche permettait une nouvelle manipulation des gam&#232;tes ou de l&#8217;embryon humain dans le cadre de l&#8217;AMP.</p><p style=\"text-align: justify;\">Lorsqu&#8217;il a &#233;t&#233; vot&#233; en 2016, il &#233;tait pr&#233;vu que ce r&#233;gime de recherche rel&#232;ve de recherches biom&#233;dicales non interventionnelles, et plus pr&#233;cis&#233;ment de recherches observationnelles. Il donnait une base l&#233;gale &#224; un d&#233;cret du 11 f&#233;vrier 2015 qui cantonne ce r&#233;gime aux recherches observationnelles.</p><p style=\"text-align: justify;\">Le Conseil constitutionnel, saisi de ces recherches biom&#233;dicales en AMP dans le cadre du recours en inconstitutionnalit&#233; d&#233;pos&#233; par les d&#233;put&#233;s, avait valid&#233; ces recherches &#224; caract&#232;re observationnel</p><p style=\"text-align: justify;\">Or, d&#232;s le 4 mars 2016, le d&#233;cret d&#8217;application de la loi sant&#233; a &#233;tendu ces recherches biom&#233;dicales en AMP aux recherches interventionnelles qui permettent des interventions &#224; risque.&#160;</p><p style=\"text-align: justify;\">Cet &#233;largissement pas voie r&#232;glementaire est contraire &#224; l&#8217;esprit et &#224; la lettre de la loi de 2016.&#160;</p>",
    "annexeExposeSommaire": {
      "@xmlns:xsi": "http://www.w3.org/2001/XMLSchema-instance",
      "@xsi:nil": "true"
    },
    "cartoucheDelaiDepotDepasse": {
      "@xmlns:xsi": "http://www.w3.org/2001/XMLSchema-instance",
      "@xsi:nil": "true"
    },
    "avantAppel": {
      "@xmlns:xsi": "http://www.w3.org/2001/XMLSchema-instance",
      "@xsi:nil": "true"
    }
  },
  "representations": {
    "representation": {
      "nom": "PDF",
      "typeMime": {
        "type": "application",
        "subType": "PDF"
      },
      "statutRepresentation": {
        "verbatim": "true",
        "canonique": "true",
        "officielle": "true",
        "transcription": "false",
        "enregistrement": "false"
      },
      "repSource": {
        "@xmlns:xsi": "http://www.w3.org/2001/XMLSchema-instance",
        "@xsi:nil": "true"
      },
      "offset": {
        "@xmlns:xsi": "http://www.w3.org/2001/XMLSchema-instance",
        "@xsi:nil": "true"
      },
      "contenu": {
        "documentURI": "/15/amendements/2243/AN/628.pdf"
      },
      "dateDispoRepresentation": {
        "@xmlns:xsi": "http://www.w3.org/2001/XMLSchema-instance",
        "@xsi:nil": "true"
      }
    }
  },
  "seanceDiscussion": "RUANR5L15S2020IDS21848",
  "sort": {
    "dateSaisie": "2019-10-04T17:23:04.000+02:00",
    "sortEnSeance": "Non soutenu"
  },
  "dateDepot": "2019-09-17T02:00:00.000+02:00",
  "dateDistribution": "2019-09-30T02:00:00.000+02:00",
  "article99": "0",
  "loiReference": {
    "codeLoi": {
      "@xmlns:xsi": "http://www.w3.org/2001/XMLSchema-instance",
      "@xsi:nil": "true"
    },
    "divisionCodeLoi": {
      "@xmlns:xsi": "http://www.w3.org/2001/XMLSchema-instance",
      "@xsi:nil": "true"
    }
  }
}