{
  "@xmlns": "http://schemas.assemblee-nationale.fr/referentiel",
  "uid": "AMANR5L15PO419604B0799P0D1N125",
  "identifiant": {
    "legislature": "15",
    "numero": "125",
    "numRect": "0",
    "saisine": {
      "refTexteLegislatif": "PIONANR5L15B0799",
      "numeroPartiePLF": "0",
      "organeExamen": "PO419604",
      "mentionSecondeDeliberation": "0"
    }
  },
  "numeroLong": "AC125",
  "etapeTexte": "1ère lecture (1ère assemblée saisie)",
  "triAmendement": "ahzw",
  "cardinaliteAmdtMultiples": "1",
  "amendementParent": {
    "@xmlns:xsi": "http://www.w3.org/2001/XMLSchema-instance",
    "@xsi:nil": "true"
  },
  "etat": "Discuté",
  "signataires": {
    "auteur": {
      "typeAuteur": "Depute",
      "acteurRef": "PA721210",
      "organeRef": {
        "@xmlns:xsi": "http://www.w3.org/2001/XMLSchema-instance",
        "@xsi:nil": "true"
      },
      "groupePolitiqueRef": "PO730958"
    },
    "cosignataires": {
      "acteurRef": [
        "PA720846",
        "PA721226",
        "PA718860",
        "PA720892",
        "PA721062",
        "PA718868",
        "PA721210",
        "PA721202",
        "PA2150",
        "PA719676",
        "PA720430",
        "PA588884",
        "PA722142",
        "PA719578",
        "PA720422",
        "PA720286",
        "PA721960"
      ]
    },
    "texteAffichable": "M.&#160;Corbi&#232;re,  Mme&#160;Autain, M.&#160;Bernalicis, M.&#160;Coquerel, Mme&#160;Fiat, M.&#160;Lachaud, M.&#160;Larive, M.&#160;M&#233;lenchon, Mme&#160;Obono, Mme&#160;Panot, M.&#160;Prud&apos;homme, M.&#160;Quatennens, M.&#160;Ratenon, Mme&#160;Ressiguier, Mme&#160;Rubin, M.&#160;Ruffin et Mme&#160;Taurine"
  },
  "pointeurFragmentTexte": {
    "missionVisee": {
      "@xmlns:xsi": "http://www.w3.org/2001/XMLSchema-instance",
      "@xsi:nil": "true"
    },
    "division": {
      "titre": "Article 9",
      "articleDesignationCourte": "APRÈS ART. 9",
      "type": "ARTICLE",
      "avant_A_Apres": "Après",
      "divisionRattachee": "APRÈS L'ARTICLE 9, insérer la division et l'intitulé suivants:",
      "articleAdditionnel": {
        "@xmlns:xsi": "http://www.w3.org/2001/XMLSchema-instance",
        "@xsi:nil": "true"
      },
      "chapitreAdditionnel": "1",
      "urlDivisionTexteVise": "/15/textes/0799.asp#D_Article_9"
    },
    "alinea": {
      "@xmlns:xsi": "http://www.w3.org/2001/XMLSchema-instance",
      "@xsi:nil": "true"
    }
  },
  "corps": {
    "dispositif": "<p style=\"text-align: justify;\">Titre III bis</p><p style=\"text-align: justify;\">De nouveaux droits pour les journalistes afin de lutter efficacement contre les fausses informations</p><p style=\"text-align: justify;\">Article XX</p><p style=\"text-align: justify;\">I.&#160;&#8211;&#160;L&#8217;article&#160;7 de la loi du 29 juillet 1881 relative &#224; la libert&#233; de la presse est ainsi r&#233;tabli&#160;:</p><p style=\"text-align: justify;\">&#171;&#160;<i>Art.&#160;7</i>.&#160;&#8211;&#160;Seules les publications d&#8217;information politique g&#233;n&#233;rale peuvent recevoir une aide de l&#8217;&#201;tat dans la limite des cr&#233;dits ouverts par la loi de finance.</p><p style=\"text-align: justify;\">&#171;&#160;Pour &#234;tre consid&#233;r&#233;es comme pr&#233;sentant le caract&#232;re d&#8217;information politique et g&#233;n&#233;rale, les publications doivent r&#233;unir les caract&#233;ristiques suivantes&#160;:</p><p style=\"text-align: justify;\">&#171;&#160;1&#176;&#160;Apporter de fa&#231;on permanente sur l&#8217;actualit&#233; politique et g&#233;n&#233;rale, locale, nationale ou internationale, des informations et des commentaires tendant &#224; &#233;clairer le jugement des citoyens&#160;;</p><p style=\"text-align: justify;\">&#171;&#160;2&#176;&#160;Consacrer la majorit&#233; de leur surface r&#233;dactionnelle &#224; cet objet&#160;;</p><p style=\"text-align: justify;\">&#171;&#160;3&#176;&#160;Pr&#233;senter un int&#233;r&#234;t d&#233;passant d&#8217;une fa&#231;on manifeste les pr&#233;occupations d&#8217;une cat&#233;gorie de lecteurs&#160;;&#160;&#187;</p><p style=\"text-align: justify;\">II.&#160;&#8211;&#160;Les publications nationales d&#8217;information politique et g&#233;n&#233;rale &#233;tant financ&#233;es en partie par les annonceurs et la publicit&#233; ne peuvent b&#233;n&#233;ficier d&#8217;aides de l&#8217;&#201;tat.</p><p style=\"text-align: justify;\">III.&#160;&#8211;&#160;La r&#233;partition des cr&#233;dits est effectu&#233;e par le Conseil de d&#233;ontologie des journalistes. Cette r&#233;partition veille notamment &#224; faciliter l&#8217;&#233;mergence de nouveaux m&#233;dias. Elle encourage la cr&#233;ation et s&#8217;assure que le pluralisme est respect&#233;.</p><p style=\"text-align: justify;\">IV.&#160;&#8211;&#160;Les modalit&#233;s de distribution des aides envers les diff&#233;rentes cat&#233;gories de titres ainsi que la presse en ligne sont &#233;tablies par un d&#233;cret en conseil d&#8217;&#201;tat.</p>",
    "exposeSommaire": "<p style=\"text-align: justify;\">Par cet amendement, nous proposons une r&#233;&#233;criture g&#233;n&#233;rale des grands principes qui dictent l&#8217;attribution des aides &#224; la presse.</p><p style=\"text-align: justify;\"><br />Nous consid&#233;rons que ces aides doivent, pour assurer le pluralisme des id&#233;es et assurer l&#8217;essor d&#8217;un journalisme de qualit&#233;, &#234;tre articul&#233;es autour de 4 principes&#160;:</p><p style=\"text-align: justify;\"><br />D&#8217;une part, il faut que ces aides soient dirig&#233;es uniquement vers l&#8217;information de politique g&#233;n&#233;rale, telle que d&#233;finie actuellement par l&#8217;article&#160;19D du code des postes et des communications, (qui apportent de fa&#231;on permanente sur l&#8217;actualit&#233; politique et g&#233;n&#233;rales, locale, nationale ou internationale, des informations et des commentaires tendant &#224; &#233;clairer le jugement des citoyens&#160;; qui consacrent la majorit&#233; de leur surface r&#233;dactionnelle &#224; cet objet&#160;; qui pr&#233;sentent un int&#233;r&#234;t d&#233;passant d&#8217;une fa&#231;on manifeste les pr&#233;occupations d&#8217;une cat&#233;gorie de lecteurs).</p><p style=\"text-align: justify;\"><br />D&#8217;autre part, il faut que cette aide soit dirig&#233;e vers des journaux qui ne sont pas, d&#8217;une mani&#232;re ou d&#8217;une autre, li&#233;s &#224; des puissances d&#8217;argent qui mettent les journalistes dans un &#233;tau et qui les emp&#234;chent de pouvoir exercer leur devoir d&#8217;enqu&#234;te de fa&#231;on absolument libre.</p><p style=\"text-align: justify;\"><br />Plus encore, la presse num&#233;rique se d&#233;veloppe, les publications en ligne ne re&#231;oivent actuellement des aides que du fonds strat&#233;gique pour le d&#233;veloppement de la presse, les autres aides &#233;tant attribu&#233;es de fa&#231;on discriminante aux journaux papier. Nous consid&#233;rons qu&#8217;il faut envisager une nouvelle fa&#231;on d&#8217;attribuer ces aides de fa&#231;on &#233;quitable (http&#160;://www.spiil.org/20170606/spiil-publie-un-panorama-complet-aides-presse-de-2014) .</p><p style=\"text-align: justify;\"><br />Enfin, afin d&#8217;assurer une ind&#233;pendance des journaux vis-&#224;-vis du pouvoir politique, nous pensons qu&#8217;il faut confier au Conseil national de d&#233;ontologie que nous appelons de nos voeux le pouvoir d&#8217;attribuer ces aides.</p><p style=\"text-align: justify;\"><br />D&#8217;un point de vue juridique, par la r&#233;daction nouvelle de cet article, nous proposons que les aides &#224; la presse aient le niveau l&#233;gal qui convient&#160;: actuellement, tout se fait au niveau d&#233;cr&#233;tal, alors que l&#8217;article&#160;34 pr&#233;voit que la loi doit fixer les r&#232;gles concernant la libert&#233;, le pluralisme et l&#8217;ind&#233;pendance des m&#233;dias. Les aides &#224; la presse sont le nerf de la guerre, c&#8217;est donc au pouvoir l&#233;gislatif de s&#8217;en emparer et de d&#233;cider, de fa&#231;on fine, les conditions de l&#8217;attribution des aides &#224; la presse.</p>",
    "annexeExposeSommaire": {
      "@xmlns:xsi": "http://www.w3.org/2001/XMLSchema-instance",
      "@xsi:nil": "true"
    }
  },
  "representations": {
    "representation": {
      "nom": "PDF",
      "typeMime": {
        "type": "application",
        "subType": "PDF"
      },
      "statutRepresentation": {
        "verbatim": "true",
        "canonique": "true",
        "officielle": "true",
        "transcription": "false",
        "enregistrement": "false"
      },
      "repSource": {
        "@xmlns:xsi": "http://www.w3.org/2001/XMLSchema-instance",
        "@xsi:nil": "true"
      },
      "offset": {
        "@xmlns:xsi": "http://www.w3.org/2001/XMLSchema-instance",
        "@xsi:nil": "true"
      },
      "contenu": {
        "documentURI": "/15/amendements/0799/CION-CEDU/AC125.pdf"
      },
      "dateDispoRepresentation": {
        "@xmlns:xsi": "http://www.w3.org/2001/XMLSchema-instance",
        "@xsi:nil": "true"
      }
    }
  },
  "seanceDiscussion": {
    "@xmlns:xsi": "http://www.w3.org/2001/XMLSchema-instance",
    "@xsi:nil": "true"
  },
  "sort": {
    "dateSaisie": "2018-05-30T11:27:29.000+02:00",
    "sortEnSeance": "Rejeté"
  },
  "dateDepot": "2018-05-25T02:00:00.000+02:00",
  "dateDistribution": "2018-05-29T02:00:00.000+02:00",
  "article99": "0",
  "loiReference": {
    "codeLoi": "z1881",
    "divisionCodeLoi": "7"
  }
}