{
  "@xmlns": "http://schemas.assemblee-nationale.fr/referentiel",
  "uid": "AMANR5L15SEA717460B2272P2D1N1456",
  "identifiant": {
    "legislature": "15",
    "numero": "1456",
    "numRect": "0",
    "saisine": {
      "refTexteLegislatif": "PRJLANR5L15B2272",
      "numeroPartiePLF": "2",
      "organeExamen": "PO717460",
      "mentionSecondeDeliberation": "0"
    }
  },
  "numeroLong": "II-1456",
  "etapeTexte": "1ère lecture (1ère assemblée saisie)",
  "triAmendement": "bbeoaaaaaaaaaaaaaaaaaaaaaaaaaaaaaaaaaaaaaaaaaaaaaayc",
  "cardinaliteAmdtMultiples": "1",
  "amendementParent": {
    "@xmlns:xsi": "http://www.w3.org/2001/XMLSchema-instance",
    "@xsi:nil": "true"
  },
  "etat": "Discuté",
  "signataires": {
    "auteur": {
      "typeAuteur": "Depute",
      "acteurRef": "PA719108",
      "organeRef": {
        "@xmlns:xsi": "http://www.w3.org/2001/XMLSchema-instance",
        "@xsi:nil": "true"
      },
      "groupePolitiqueRef": "PO730964"
    },
    "cosignataires": {
      "acteurRef": [
        "PA718728",
        "PA719108"
      ]
    },
    "texteAffichable": "M.&#160;G&#233;rard et Mme&#160;Vanceunebrock-Mialon"
  },
  "pointeurFragmentTexte": {
    "missionVisee": {
      "idMissionAN": "826",
      "libelleMission": "Sécurités",
      "codeMissionPLF": "B",
      "libelleMissionPLF": "Répartition, par mission et programme, des crédits du budget général"
    },
    "division": {
      "titre": "ÉTAT B",
      "articleDesignationCourte": "ART. 38",
      "type": "ANNEXE",
      "avant_A_Apres": "A",
      "divisionRattachee": "ARTICLE 38",
      "articleAdditionnel": {
        "@xmlns:xsi": "http://www.w3.org/2001/XMLSchema-instance",
        "@xsi:nil": "true"
      },
      "chapitreAdditionnel": {
        "@xmlns:xsi": "http://www.w3.org/2001/XMLSchema-instance",
        "@xsi:nil": "true"
      },
      "urlDivisionTexteVise": "/15/textes/2272C.asp#D_ETAT_B"
    },
    "alinea": {
      "@xmlns:xsi": "http://www.w3.org/2001/XMLSchema-instance",
      "@xsi:nil": "true"
    }
  },
  "corps": {
    "exposeSommaire": "<p style=\"text-align: justify;\">et amendement vise &#224; sanctuariser le budget allou&#233; &#224; la formation de la police nationale par rapport &#224; celui de 2019.</p><p style=\"text-align: justify;\">Compte tenu des besoins croissants en mati&#232;re de formation initiale et continue des agents de police, notamment en mati&#232;re d&#8217;accueil et de prise en charge des victimes de violences conjugales ou de crimes de haine, il appara&#238;t indispensable de maintenir l&#8217;effort financier allou&#233; &#224; la formation des forces de l&#8217;ordre, d&#8217;autant que les effectifs d&#8217;&#233;l&#232;ves gardiens de la paix &#224; former sont en hausse de pr&#232;s de 10&#160;% ( plus de 3900 &#233;l&#232;ves gardiens de la paix contre 3452 incorpor&#233;s en 2019).</p><p style=\"text-align: justify;\">Aussi, les &#233;conomies d&#233;gag&#233;es dans les efforts de rationalisation de la formation initiale qui s&#8217;articule d&#233;sormais autour de 8 mois en &#233;cole (contre 12 mois actuellement) doivent &#234;tre fl&#233;ch&#233;es vers le renforcement de la formation continue.</p><p style=\"text-align: justify;\">&#160;Enfin, le plan de mesures d&#8217;urgence contre la haine anti-LGBT pr&#233;sent&#233; par Marl&#232;ne Schiappa, secr&#233;taire d&#8217;&#201;tat en charge de l&#8217;&#233;galit&#233; entre les femmes et les hommes et de la lutte contre les discriminations, pr&#233;voit la mise en place de r&#233;f&#233;rent accueil luttant contre la haine antiLGBT qui ont &#233;t&#233; progressivement d&#233;sign&#233;s dans tous les commissariats de police au cours de l&#8217;ann&#233;e 2019. Au-del&#224; des s&#233;ances de sensibilisation organis&#233;es sur la base du volontariat par la DILCRAH, ces r&#233;f&#233;rents doivent b&#233;n&#233;ficier de formations d&#233;di&#233;es &#224; l&#8217;accueil des victimes d&#8217;actes de haine qu&#8217;il convient de piloter et de financer pour consacrer leur r&#244;le de fonction support dans les commissariats de police.</p><p style=\"text-align: justify;\">C&#8217;est pourquoi, cet amendement&#160;:</p><p style=\"text-align: justify;\">&#183;&#160; augmente le montant des cr&#233;dits de l&#8217;action 6 du programme 176 Police nationale&#160; de 1 100 000 d&#8217;euros en autorisations d&#8217;engagement et en cr&#233;dits de paiement&#160;;</p><p style=\"text-align: justify;\">&#183;&#160; diminue &#224; due concurrence le montant des cr&#233;dits de l&#8217;action 3 du programme 207 S&#233;curit&#233; et &#233;ducation routi&#232;re (dont le budget pr&#233;visionnel est en hausse).</p>",
    "annexeExposeSommaire": {
      "@xmlns:xsi": "http://www.w3.org/2001/XMLSchema-instance",
      "@xsi:nil": "true"
    },
    "cartoucheDelaiDepotDepasse": {
      "@xmlns:xsi": "http://www.w3.org/2001/XMLSchema-instance",
      "@xsi:nil": "true"
    },
    "avantAppel": {
      "@xmlns:xsi": "http://www.w3.org/2001/XMLSchema-instance",
      "@xsi:nil": "true"
    },
    "dispositifAmdtCredit": {
      "listeProgrammes": {
        "programme": [
          {
            "libelle": "Police nationale",
            "id": "98630",
            "AE": {
              "montantPositif": "1100000",
              "montantNegatif": "0"
            },
            "CP": {
              "montantPositif": "1100000",
              "montantNegatif": "0"
            },
            "action": "modification",
            "lignesCredits": null
          },
          {
            "libelle": "Gendarmerie nationale",
            "id": "98631",
            "AE": {
              "montantPositif": "0",
              "montantNegatif": "0"
            },
            "CP": {
              "montantPositif": "0",
              "montantNegatif": "0"
            },
            "action": "modification",
            "lignesCredits": null
          },
          {
            "libelle": "Sécurité et éducation routières",
            "id": "98632",
            "AE": {
              "montantPositif": "0",
              "montantNegatif": "1100000"
            },
            "CP": {
              "montantPositif": "0",
              "montantNegatif": "1100000"
            },
            "action": "modification",
            "lignesCredits": null
          },
          {
            "libelle": "Sécurité civile",
            "id": "98633",
            "AE": {
              "montantPositif": "0",
              "montantNegatif": "0"
            },
            "CP": {
              "montantPositif": "0",
              "montantNegatif": "0"
            },
            "action": "modification",
            "lignesCredits": null
          }
        ]
      },
      "totalAE": {
        "montantPositif": "1100000",
        "montantNegatif": "1100000",
        "solde": "0"
      },
      "totalCP": {
        "montantPositif": "1100000",
        "montantNegatif": "1100000",
        "solde": "0"
      }
    }
  },
  "representations": {
    "representation": {
      "nom": "PDF",
      "typeMime": {
        "type": "application",
        "subType": "PDF"
      },
      "statutRepresentation": {
        "verbatim": "true",
        "canonique": "true",
        "officielle": "true",
        "transcription": "false",
        "enregistrement": "false"
      },
      "repSource": {
        "@xmlns:xsi": "http://www.w3.org/2001/XMLSchema-instance",
        "@xsi:nil": "true"
      },
      "offset": {
        "@xmlns:xsi": "http://www.w3.org/2001/XMLSchema-instance",
        "@xsi:nil": "true"
      },
      "contenu": {
        "documentURI": "/15/amendements/2272C/AN/1456.pdf"
      },
      "dateDispoRepresentation": {
        "@xmlns:xsi": "http://www.w3.org/2001/XMLSchema-instance",
        "@xsi:nil": "true"
      }
    }
  },
  "seanceDiscussion": "RUANR5L15S2020IDS21903",
  "sort": {
    "dateSaisie": "2019-11-05T22:25:51.000+01:00",
    "sortEnSeance": "Non soutenu"
  },
  "dateDepot": "2019-10-31T01:00:00.000+01:00",
  "dateDistribution": "2019-11-04T01:00:00.000+01:00",
  "article99": "0",
  "loiReference": {
    "codeLoi": {
      "@xmlns:xsi": "http://www.w3.org/2001/XMLSchema-instance",
      "@xsi:nil": "true"
    },
    "divisionCodeLoi": {
      "@xmlns:xsi": "http://www.w3.org/2001/XMLSchema-instance",
      "@xsi:nil": "true"
    }
  }
}