{
  "@xmlns": "http://schemas.assemblee-nationale.fr/referentiel",
  "uid": "AMANR5L15SEA717460BTC1974P0D1N347",
  "identifiant": {
    "legislature": "15",
    "numero": "347",
    "numRect": "0",
    "saisine": {
      "refTexteLegislatif": "PRJLANR5L15BTC1974",
      "numeroPartiePLF": "0",
      "organeExamen": "PO717460",
      "mentionSecondeDeliberation": "0"
    }
  },
  "numeroLong": "347",
  "etapeTexte": "1ère lecture (2ème assemblée saisie)",
  "triAmendement": "hiaaaiaaaaaaaaaaaaaaaaaaaaaaaaaaaaaaaaaaaaaaaaaaaazzzzzzzzzzzzzzzzzzzzzzzzzzzzzx",
  "cardinaliteAmdtMultiples": "1",
  "amendementParent": {
    "@xmlns:xsi": "http://www.w3.org/2001/XMLSchema-instance",
    "@xsi:nil": "true"
  },
  "etat": "Discuté",
  "signataires": {
    "auteur": {
      "typeAuteur": "Depute",
      "acteurRef": "PA720644",
      "organeRef": {
        "@xmlns:xsi": "http://www.w3.org/2001/XMLSchema-instance",
        "@xsi:nil": "true"
      },
      "groupePolitiqueRef": "PO730934"
    },
    "cosignataires": {
      "acteurRef": [
        "PA721678",
        "PA718884",
        "PA721816",
        "PA266808",
        "PA267901",
        "PA608016",
        "PA719272",
        "PA720644",
        "PA336316",
        "PA719318",
        "PA605036",
        "PA767",
        "PA267735",
        "PA642847",
        "PA340853",
        "PA721968",
        "PA1029",
        "PA1012",
        "PA346218",
        "PA709315",
        "PA606712"
      ]
    },
    "texteAffichable": "M.&#160;Nury,  M.&#160;Abad, Mme&#160;Anthoine, Mme&#160;Bazin-Malgras, Mme&#160;Louwagie, M.&#160;Lurton, M.&#160;Masson, M.&#160;Cattin, Mme&#160;Meunier, M.&#160;Bouchet, M.&#160;Kamardine, M.&#160;Deflesselles, M.&#160;de la Verpilli&#232;re, M.&#160;Bazin, M.&#160;Boucard, M.&#160;de Ganay, M.&#160;Leclerc, M.&#160;Vialay, M.&#160;Viala, M.&#160;Reda et M.&#160;Rolland"
  },
  "pointeurFragmentTexte": {
    "missionVisee": {
      "@xmlns:xsi": "http://www.w3.org/2001/XMLSchema-instance",
      "@xsi:nil": "true"
    },
    "division": {
      "titre": "Article 1er A",
      "articleDesignationCourte": "ART. 1ER A",
      "type": "ARTICLE",
      "avant_A_Apres": "A",
      "divisionRattachee": "ARTICLE 1ER A",
      "articleAdditionnel": {
        "@xmlns:xsi": "http://www.w3.org/2001/XMLSchema-instance",
        "@xsi:nil": "true"
      },
      "chapitreAdditionnel": {
        "@xmlns:xsi": "http://www.w3.org/2001/XMLSchema-instance",
        "@xsi:nil": "true"
      },
      "urlDivisionTexteVise": "/15/textes/1974.asp#D_Article_1er_A"
    },
    "alinea": {
      "avant_A_Apres": {
        "@xmlns:xsi": "http://www.w3.org/2001/XMLSchema-instance",
        "@xsi:nil": "true"
      },
      "numero": "10",
      "alineaDesignation": {
        "@xmlns:xsi": "http://www.w3.org/2001/XMLSchema-instance",
        "@xsi:nil": "true"
      }
    }
  },
  "corps": {
    "dispositif": "<p style=\"text-align: justify;\">Compl&#233;ter l&#8217;alin&#233;a&#160;10 par les mots&#160;:</p><p style=\"text-align: justify;\">&#171;&#160;sur les routes d&#233;partementales et nationales&#160;&#187;.</p>",
    "exposeSommaire": "<p style=\"text-align: justify;\">Le d&#233;senclavement routier des villes moyennes et des r&#233;gions rurales fait partie des cinq programmes d&#8217;investissement prioritaires mis en place par le texte. Il doit permettre de lutter contre la d&#233;sertification des campagnes en am&#233;liorant leur acc&#232;s et les mobilit&#233;s en leur sein.</p><p style=\"text-align: justify;\">Le texte pr&#233;voit un am&#233;nagement des itin&#233;raires existants au profit de cette mobilit&#233;. Il convient de pr&#233;ciser que ces am&#233;nagements sont effectu&#233;s sur routes d&#233;partementales et nationales.</p><p style=\"text-align: justify;\">Ces routes forment un maillage important qui suffit &#224; relier les territoires mais elles n&#233;cessitent de grands am&#233;nagements et ainsi de gros investissements. C&#8217;est pourquoi le programme d&#8217;investissement doit essentiellement porter sur ces r&#233;seaux routiers.</p>",
    "annexeExposeSommaire": {
      "@xmlns:xsi": "http://www.w3.org/2001/XMLSchema-instance",
      "@xsi:nil": "true"
    },
    "cartoucheDelaiDepotDepasse": {
      "@xmlns:xsi": "http://www.w3.org/2001/XMLSchema-instance",
      "@xsi:nil": "true"
    }
  },
  "representations": {
    "representation": {
      "nom": "PDF",
      "typeMime": {
        "type": "application",
        "subType": "PDF"
      },
      "statutRepresentation": {
        "verbatim": "true",
        "canonique": "true",
        "officielle": "true",
        "transcription": "false",
        "enregistrement": "false"
      },
      "repSource": {
        "@xmlns:xsi": "http://www.w3.org/2001/XMLSchema-instance",
        "@xsi:nil": "true"
      },
      "offset": {
        "@xmlns:xsi": "http://www.w3.org/2001/XMLSchema-instance",
        "@xsi:nil": "true"
      },
      "contenu": {
        "documentURI": "/15/amendements/1974/AN/347.pdf"
      },
      "dateDispoRepresentation": {
        "@xmlns:xsi": "http://www.w3.org/2001/XMLSchema-instance",
        "@xsi:nil": "true"
      }
    }
  },
  "seanceDiscussion": "RUANR5L15S2019IDS21699",
  "sort": {
    "dateSaisie": "2019-06-13T15:43:49.000+02:00",
    "sortEnSeance": "Retiré"
  },
  "dateDepot": "2019-05-27T02:00:00.000+02:00",
  "dateDistribution": "2019-06-05T02:00:00.000+02:00",
  "article99": "0",
  "loiReference": {
    "codeLoi": {
      "@xmlns:xsi": "http://www.w3.org/2001/XMLSchema-instance",
      "@xsi:nil": "true"
    },
    "divisionCodeLoi": {
      "@xmlns:xsi": "http://www.w3.org/2001/XMLSchema-instance",
      "@xsi:nil": "true"
    }
  }
}