{
  "@xmlns": "http://schemas.assemblee-nationale.fr/referentiel",
  "uid": "AMANR5L15SEA717460BTC1019P0D1N805",
  "identifiant": {
    "legislature": "15",
    "numero": "805",
    "numRect": "0",
    "saisine": {
      "refTexteLegislatif": "PRJLANR5L15BTC1019",
      "numeroPartiePLF": "0",
      "organeExamen": "PO717460",
      "mentionSecondeDeliberation": "1"
    }
  },
  "numeroLong": "805",
  "etapeTexte": "1ère lecture (1ère assemblée saisie)",
  "triAmendement": "hs",
  "cardinaliteAmdtMultiples": "1",
  "amendementParent": {
    "@xmlns:xsi": "http://www.w3.org/2001/XMLSchema-instance",
    "@xsi:nil": "true"
  },
  "etat": "Discuté",
  "signataires": {
    "auteur": {
      "typeAuteur": "Depute",
      "acteurRef": "PA721046",
      "organeRef": {
        "@xmlns:xsi": "http://www.w3.org/2001/XMLSchema-instance",
        "@xsi:nil": "true"
      },
      "groupePolitiqueRef": "PO730934"
    },
    "cosignataires": {
      "acteurRef": [
        "PA721046",
        "PA721968",
        "PA608016",
        "PA334654",
        "PA718838",
        "PA721070",
        "PA719318",
        "PA718884"
      ]
    },
    "texteAffichable": "Mme&#160;Bassire,  Mme&#160;Louwagie, Mme&#160;Anthoine, Mme&#160;Bazin-Malgras, M.&#160;Brun, M.&#160;Straumann, M.&#160;Vialay et Mme&#160;Ramassamy"
  },
  "pointeurFragmentTexte": {
    "missionVisee": {
      "@xmlns:xsi": "http://www.w3.org/2001/XMLSchema-instance",
      "@xsi:nil": "true"
    },
    "division": {
      "titre": "Article 22",
      "articleDesignationCourte": "ART. 22",
      "type": "ARTICLE",
      "avant_A_Apres": "A",
      "divisionRattachee": "ARTICLE 22",
      "articleAdditionnel": {
        "@xmlns:xsi": "http://www.w3.org/2001/XMLSchema-instance",
        "@xsi:nil": "true"
      },
      "chapitreAdditionnel": {
        "@xmlns:xsi": "http://www.w3.org/2001/XMLSchema-instance",
        "@xsi:nil": "true"
      },
      "urlDivisionTexteVise": "/15/textes/1019.asp#D_Article_22"
    },
    "alinea": {
      "avant_A_Apres": {
        "@xmlns:xsi": "http://www.w3.org/2001/XMLSchema-instance",
        "@xsi:nil": "true"
      },
      "numero": "17",
      "alineaDesignation": {
        "@xmlns:xsi": "http://www.w3.org/2001/XMLSchema-instance",
        "@xsi:nil": "true"
      }
    }
  },
  "corps": {
    "dispositif": "<p style=\"text-align: justify;\">Compl&#233;ter l'alin&#233;a&#160;17 par les mots&#160;:</p><p style=\"text-align: justify;\">&#171;&#160;en Conseil d&#8217;&#201;tat apr&#232;s avis des conseils r&#233;gionaux respectifs de la Guadeloupe et de La R&#233;union, du conseil d&#233;partemental de Mayotte, et des conseils territoriaux respectifs des autres collectivit&#233;s d&#8217;outre-mer. L&#8217;avis est r&#233;put&#233; favorable s&#8217;il n&#8217;est pas &#233;mis dans un d&#233;lai de trois mois.&#160;&#187;</p>",
    "exposeSommaire": "<p style=\"text-align: justify;\">En Outre-Mer, et plus particuli&#232;rement &#224; La R&#233;union o&#249; le conseil r&#233;gional est seul propri&#233;taire de tous les Centres de Formation des Apprentis (il n&#8217;y a pas de CFA de branche ou priv&#233;) et porte l&#8217;ensemble des financements, il convient de conforter le travail et l&#8217;investissement r&#233;alis&#233;s depuis une vingtaine d&#8217;ann&#233;es, et les r&#233;sultats probants en d&#233;coulant, par un droit &#224; la diff&#233;renciation vis-&#224;-vis de la France M&#233;tropolitaine, notamment en assurant le maintien d&#8217;un pilotage fort de la collectivit&#233; territoriale comp&#233;tente sur le plan local, et en prenant en compte le r&#244;le pr&#233;&#233;minent de l&#8217;interprofession en Outre-Mer.</p><p style=\"text-align: justify;\">En premier lieu, s&#8217;agissant des r&#233;sultats, force est de constater qu&#8217;en six ans les effectifs &#224; la R&#233;union ont progress&#233; de +37&#160;%, passant de 3 631 en 2009 &#224; pr&#232;s de 5 000 apprentis en 2017, et que le nombre d&#8217;organismes gestionnaires de CFA a &#233;t&#233; multipli&#233; par trois sur la m&#234;me p&#233;riode.<br /> En outre, le nombre de formations par voie d&#8217;apprentissage &#224; La R&#233;union est pass&#233; de 172 en 2010 &#224; 259 en 2017, soit une &#233;volution sensible de +50,58&#160;% en sept ans.</p><p style=\"text-align: justify;\"><br /> La R&#233;union pr&#233;sente ainsi un taux d&#8217;insertion durable l&#233;g&#232;rement sup&#233;rieur au taux national. L&#8217;apprentissage constitue ainsi pour le Conseil R&#233;gional le levier majeur pour am&#233;liorer l&#8217;acc&#232;s &#224; l&#8217;emploi des jeunes, et est souvent utilis&#233; comme pr&#233;-embauche &#224; La R&#233;union.</p><p style=\"text-align: justify;\"><br /> S&#8217;agissant du nouveau syst&#232;me propos&#233; dans le pr&#233;sent projet de loi, l&#8217;objectif est de permettre aux entreprises d&#8217;&#234;tre accompagn&#233;es plus efficacement.<br /> Or, le cadre d&#8217;intervention actuel de la R&#233;gion R&#233;union est plus avantageux pour les entreprises aussi bien en terme de montant attribu&#233; qu&#8217;en terme de p&#233;rim&#232;tre d&#8217;&#233;ligibilit&#233;, que celui qui devrait d&#233;couler du pr&#233;sent projet de loi.</p><p style=\"text-align: justify;\"><br /> Ainsi, ce projet de loi dispose que la nouvelle aide unique ne serait vers&#233;e qu&#8217;aux entreprises accueillant des apprentis pr&#233;parant un dipl&#244;me ou un titre &#224; finalit&#233; professionnelle &#233;quivalent au plus au baccalaur&#233;at.</p><p style=\"text-align: justify;\">A La R&#233;union, la R&#233;gion accompagne les entreprises quelque soit le niveau de formation des apprentis.</p><p style=\"text-align: justify;\">Par cons&#233;quent, les modalit&#233;s d&#8217;attribution de l&#8217;aide unique d&#233;finies dans le cadre de la r&#233;forme entra&#238;neraient m&#233;caniquement l&#8217;exclusion de toutes les entreprises qui ont fait le choix de miser sur un apprenti de niveau sup&#233;rieur au baccalaur&#233;at.</p><p style=\"text-align: justify;\">Sur la base des chiffres de 2016, cela repr&#233;senterait l&#8217;exclusion de 68 actions de formation (de niveau sup&#233;rieur au baccalaur&#233;at) sur un total de 235 tous niveaux confondus, soit pr&#232;s de 30&#160;% pour La R&#233;union.</p><p style=\"text-align: justify;\">Ainsi, il y a pour ce d&#233;partement d&#8217;Outre-Mer un risque de nivellement par le bas alors que, depuis 2010, l&#8217;ensemble des acteurs travaillent pour faire de l&#8217;apprentissage une v&#233;ritable voie d&#8217;excellence.</p><p style=\"text-align: justify;\">Il est important d&#8217;int&#233;grer le fait que le niveau de dipl&#244;me demeure toujours d&#233;terminant dans l&#8217;insertion professionnelle des jeunes.</p><p style=\"text-align: justify;\"><br /> Par ailleurs, l&#8217;apprentissage constitue &#224; la R&#233;union une offre de formation post-bac pour les baccalaur&#233;ats des voies professionnelle &amp;amp; technologique.</p><p style=\"text-align: justify;\">Il est rappel&#233; qu&#8217;en six ans la R&#233;gion R&#233;union a cr&#233;&#233; trois &#233;coles d&#8217;ing&#233;nieurs par la voie de l&#8217;apprentissage (domaines du Num&#233;rique &amp;amp; du BTP).<br /> Au sein de l&#8217;Acad&#233;mie de La R&#233;union, le nombre de bacheliers progresse r&#233;guli&#232;rement. Pour la session de 2017, le nombre de bacheliers a franchi le cap des 10 000 laur&#233;ats avec une r&#233;partition entre les trois voies d&#8217;enseignement comme suit&#160;: 45&#160;% de la voie g&#233;n&#233;rale, 27&#160;% de la voie technologique et 28&#160;% de la voie professionnelle.</p><p style=\"text-align: justify;\"><br /> Enfin, le dispositif actuel, &#224; La R&#233;union, permet d&#8217;accompagner les apprentis au titre de la restauration, du transport, de l&#8217;h&#233;bergement, de la mobilit&#233;, du petit mat&#233;riel, &#8230;</p><p style=\"text-align: justify;\">Le pr&#233;sent projet de loi ne pr&#233;voit pas le maintien de cet accompagnement global de l&#8217;apprenti et propose uniquement la prise en charge du permis de conduire (dont le financement est d&#8217;ores et d&#233;j&#224; &#233;ligible au CPF).</p><p style=\"text-align: justify;\"><br /> En conclusion, il faut maintenir, voire renforcer, le caract&#232;re attractif de l&#8217;apprentissage pour nos jeunes en Outre-Mer.<br /> Afin de maintenir des prestations de qualit&#233; &#224; notre jeunesse r&#233;unionnaise et ultramarine, et trouver ensemble des solutions respectueuses de leurs int&#233;r&#234;ts, la situation locale n&#8217;&#233;tant en rien comparable avec celle sur le plan national, il convient d&#8217;apporter des garanties et des gages de stabilit&#233; en amont des proc&#233;dures, notamment en sollicitant l&#8217;avis&#160;simple du territoire.</p><p style=\"text-align: justify;\">C&#8217;est l&#8217;objet du pr&#233;sent amendement de repli (par rapport &#224; un pr&#233;c&#233;dent amendement proposant l&#8217;avis conforme du territoire).</p>",
    "annexeExposeSommaire": {
      "@xmlns:xsi": "http://www.w3.org/2001/XMLSchema-instance",
      "@xsi:nil": "true"
    }
  },
  "representations": {
    "representation": {
      "nom": "PDF",
      "typeMime": {
        "type": "application",
        "subType": "PDF"
      },
      "statutRepresentation": {
        "verbatim": "true",
        "canonique": "true",
        "officielle": "true",
        "transcription": "false",
        "enregistrement": "false"
      },
      "repSource": {
        "@xmlns:xsi": "http://www.w3.org/2001/XMLSchema-instance",
        "@xsi:nil": "true"
      },
      "offset": {
        "@xmlns:xsi": "http://www.w3.org/2001/XMLSchema-instance",
        "@xsi:nil": "true"
      },
      "contenu": {
        "documentURI": "/15/amendements/1019/AN/805.pdf"
      },
      "dateDispoRepresentation": {
        "@xmlns:xsi": "http://www.w3.org/2001/XMLSchema-instance",
        "@xsi:nil": "true"
      }
    }
  },
  "seanceDiscussion": "RUANR5L15S2018IDS21105",
  "sort": {
    "dateSaisie": "2018-06-15T18:46:39.000+02:00",
    "sortEnSeance": "Rejeté"
  },
  "dateDepot": "2018-06-07T02:00:00.000+02:00",
  "dateDistribution": "2018-06-12T02:00:00.000+02:00",
  "article99": "0",
  "loiReference": {
    "codeLoi": {
      "@xmlns:xsi": "http://www.w3.org/2001/XMLSchema-instance",
      "@xsi:nil": "true"
    },
    "divisionCodeLoi": {
      "@xmlns:xsi": "http://www.w3.org/2001/XMLSchema-instance",
      "@xsi:nil": "true"
    }
  }
}