{
  "@xmlns": "http://schemas.assemblee-nationale.fr/referentiel",
  "uid": "AMANR5L15SEA717460B0911P0D1N2036",
  "identifiant": {
    "legislature": "15",
    "numero": "2036",
    "numRect": "0",
    "saisine": {
      "refTexteLegislatif": "PRJLANR5L15B0911",
      "numeroPartiePLF": "0",
      "organeExamen": "PO717460",
      "mentionSecondeDeliberation": "0"
    }
  },
  "numeroLong": "2036",
  "etapeTexte": "1ère lecture (1ère assemblée saisie)",
  "triAmendement": "afo",
  "cardinaliteAmdtMultiples": "1",
  "amendementParent": {
    "@xmlns:xsi": "http://www.w3.org/2001/XMLSchema-instance",
    "@xsi:nil": "true"
  },
  "etat": "A discuter",
  "signataires": {
    "auteur": {
      "typeAuteur": "Depute",
      "acteurRef": "PA330240",
      "organeRef": {
        "@xmlns:xsi": "http://www.w3.org/2001/XMLSchema-instance",
        "@xsi:nil": "true"
      },
      "groupePolitiqueRef": "PO730934"
    },
    "cosignataires": {
      "acteurRef": [
        "PA346218",
        "PA608416",
        "PA330684",
        "PA767",
        "PA720386",
        "PA720684",
        "PA721054",
        "PA340853",
        "PA266776",
        "PA2086",
        "PA721410",
        "PA330240",
        "PA721678",
        "PA642847",
        "PA719272",
        "PA608016"
      ]
    },
    "texteAffichable": "M.&#160;Ciotti,  M.&#160;Pierre-Henri&#160;Dumont, M.&#160;Leclerc, M.&#160;Cattin, M.&#160;Masson, Mme&#160;Meunier, Mme&#160;Louwagie, M.&#160;Reda, M.&#160;Hetzel, M.&#160;Di Filippo, Mme&#160;Val&#233;rie&#160;Boyer, M.&#160;Marlin, M.&#160;Lorion, M.&#160;Reiss, Mme&#160;Bonnivard et M.&#160;Bazin"
  },
  "pointeurFragmentTexte": {
    "missionVisee": {
      "@xmlns:xsi": "http://www.w3.org/2001/XMLSchema-instance",
      "@xsi:nil": "true"
    },
    "division": {
      "titre": "Article 2",
      "articleDesignationCourte": "APRÈS ART. 2",
      "type": "ARTICLE",
      "avant_A_Apres": "Après",
      "divisionRattachee": "APRÈS L'ARTICLE 2, insérer l'article suivant:",
      "articleAdditionnel": "1",
      "chapitreAdditionnel": {
        "@xmlns:xsi": "http://www.w3.org/2001/XMLSchema-instance",
        "@xsi:nil": "true"
      },
      "urlDivisionTexteVise": "/15/textes/0911.asp#D_Article_2"
    },
    "alinea": {
      "@xmlns:xsi": "http://www.w3.org/2001/XMLSchema-instance",
      "@xsi:nil": "true"
    }
  },
  "corps": {
    "dispositif": "<p style=\"text-align: justify;\">Apr&#232;s l&#8217;article&#160;36 de la Constitution, il est ins&#233;r&#233; un article&#160;36&#8209;1 ainsi r&#233;dig&#233;&#160;:</p><p style=\"text-align: justify;\">&#171;&#160;<i>Art.&#160;36&#8209;1</i>.&#160;&#8211;&#160;L&#8217;&#233;tat d&#8217;urgence est d&#233;cr&#233;t&#233; en conseil des ministres, sur tout ou partie du territoire de la R&#233;publique, soit en cas de p&#233;ril imminent r&#233;sultant d&#8217;atteintes graves &#224; l&#8217;ordre public, soit en cas d&#8217;&#233;v&#233;nements pr&#233;sentant, par leur nature et leur gravit&#233;, le caract&#232;re de calamit&#233; publique.</p><p style=\"text-align: justify;\">&#171;&#160;La loi fixe les mesures de police administrative d&#233;rogatoires au droit commun que les autorit&#233;s civiles peuvent prendre pour pr&#233;venir ce p&#233;ril ou faire face &#224; ces &#233;v&#233;nements.</p><p style=\"text-align: justify;\">&#171;&#160;Pendant toute la dur&#233;e de l&#8217;&#233;tat d&#8217;urgence, le Parlement se r&#233;unit de plein droit.</p><p style=\"text-align: justify;\">&#171;&#160;L&#8217;Assembl&#233;e nationale et le S&#233;nat sont inform&#233;s sans d&#233;lai des mesures prises par le Gouvernement pendant l&#8217;&#233;tat d&#8217;urgence. Ils peuvent requ&#233;rir toute information compl&#233;mentaire dans le cadre du contr&#244;le et de l&#8217;&#233;valuation de ces mesures. Les r&#232;glements des assembl&#233;es pr&#233;voient les conditions dans lesquelles le Parlement contr&#244;le la mise en &#339;uvre de l&#8217;&#233;tat d&#8217;urgence.</p><p style=\"text-align: justify;\">&#171;&#160;La prorogation de l&#8217;&#233;tat d&#8217;urgence au-del&#224; de douze jours ne peut &#234;tre autoris&#233;e que par la loi. Celle-ci en fixe la dur&#233;e, qui ne peut exc&#233;der quatre mois. Cette prorogation peut &#234;tre renouvel&#233;e dans les m&#234;mes conditions.&#160;&#187;</p>",
    "exposeSommaire": "<p style=\"text-align: justify;\">Dans sa d&#233;cision n&#176; 2017&#8209;677 QPC du 1<sup>er</sup> d&#233;cembre 2017, le Conseil constitutionnel a d&#233;clar&#233; contraire &#224; la Constitution les dispositions de l&#8217;article&#160;8&#8209;1 de la loi n&#176; 55&#8209;385 du 3 avril 1955 relative &#224; l&#8217;&#233;tat d&#8217;urgence, dans sa r&#233;daction issue de la loi n&#176; 2016&#8209;987 du 21 juillet 2016.</p><p style=\"text-align: justify;\">Cet article pr&#233;voyait que, pour les zones dans lesquelles l&#8217;&#233;tat d&#8217;urgence a &#233;t&#233; d&#233;clar&#233;, le pr&#233;fet pouvait autoriser, par d&#233;cision motiv&#233;e, les officiers de police judiciaire et, sous leur responsabilit&#233;, les agents de police judiciaire et certains agents de police judiciaire adjoints &#224; proc&#233;der &#224; des contr&#244;les d&#8217;identit&#233;, &#224; l&#8217;inspection visuelle et &#224; la fouille des bagages ainsi qu&#8217;&#224; la visite des v&#233;hicules circulant, arr&#234;t&#233;s ou stationnant sur la voie publique ou dans des lieux accessibles au public.</p><p style=\"text-align: justify;\">Preuve de leur efficacit&#233;, cette possibilit&#233; a &#233;t&#233; utilis&#233;e plus de 2&#160;000 fois pendant l&#8217;&#233;tat d&#8217;urgence.</p><p style=\"text-align: justify;\">Le Conseil a jug&#233; qu&#8217; &#171;&#160;en pr&#233;voyant que ces op&#233;rations peuvent &#234;tre autoris&#233;es en tout lieu dans les zones o&#249; s&#8217;applique l&#8217;&#233;tat d&#8217;urgence, le l&#233;gislateur a permis leur mise en &#339;uvre sans que celles-ci soient n&#233;cessairement justifi&#233;es par des circonstances particuli&#232;res &#233;tablissant le risque d&#8217;atteinte &#224; l&#8217;ordre public dans les lieux en cause.&#160;&#187; et donc que le l&#233;gislateur n&#8217;avait &#171;&#160;pas assur&#233; une conciliation &#233;quilibr&#233;e entre, d&#8217;une part, l&#8217;objectif de valeur constitutionnelle de sauvegarde de l&#8217;ordre public, et, d&#8217;autre part, la libert&#233; d&#8217;aller et de venir et le droit au respect de la vie priv&#233;e.&#160;&#187;</p><p style=\"text-align: justify;\">Afin d&#8217;autoriser ces mesures au niveau constitutionnel, cet amendement introduit un nouvel article relatif &#224; l&#8217;&#233;tat d&#8217;urgence, pr&#233;vu actuellement seulement par la loi n&#176; 55&#8209;385 du 3 avril 1955. La r&#233;daction reprend celle adopt&#233;e par l&#8217;Assembl&#233;e nationale le 10 f&#233;vrier 2016, mais faisant r&#233;f&#233;rence, &#224; des mesures administratives &#171;&#160;d&#233;rogatoires au droit commun&#160;&#187;.<br /><br /></p>",
    "annexeExposeSommaire": {
      "@xmlns:xsi": "http://www.w3.org/2001/XMLSchema-instance",
      "@xsi:nil": "true"
    }
  },
  "representations": {
    "representation": {
      "nom": "PDF",
      "typeMime": {
        "type": "application",
        "subType": "PDF"
      },
      "statutRepresentation": {
        "verbatim": "true",
        "canonique": "true",
        "officielle": "true",
        "transcription": "false",
        "enregistrement": "false"
      },
      "repSource": {
        "@xmlns:xsi": "http://www.w3.org/2001/XMLSchema-instance",
        "@xsi:nil": "true"
      },
      "offset": {
        "@xmlns:xsi": "http://www.w3.org/2001/XMLSchema-instance",
        "@xsi:nil": "true"
      },
      "contenu": {
        "documentURI": "/15/amendements/0911/AN/2036.pdf"
      },
      "dateDispoRepresentation": {
        "@xmlns:xsi": "http://www.w3.org/2001/XMLSchema-instance",
        "@xsi:nil": "true"
      }
    }
  },
  "seanceDiscussion": {
    "@xmlns:xsi": "http://www.w3.org/2001/XMLSchema-instance",
    "@xsi:nil": "true"
  },
  "sort": {
    "@xmlns:xsi": "http://www.w3.org/2001/XMLSchema-instance",
    "@xsi:nil": "true"
  },
  "dateDepot": "2018-07-06T02:00:00.000+02:00",
  "dateDistribution": "2018-07-10T02:00:00.000+02:00",
  "article99": "0",
  "loiReference": {
    "codeLoi": "Constitution",
    "divisionCodeLoi": "36"
  }
}