{
  "@xmlns": "http://schemas.assemblee-nationale.fr/referentiel",
  "uid": "AMANR5L15SEA717460B1371P0D1N286",
  "identifiant": {
    "legislature": "15",
    "numero": "286",
    "numRect": "0",
    "saisine": {
      "refTexteLegislatif": "PRJLANR5L15B1371",
      "numeroPartiePLF": "0",
      "organeExamen": "PO717460",
      "mentionSecondeDeliberation": "0"
    }
  },
  "numeroLong": "286",
  "etapeTexte": "1ère lecture (1ère assemblée saisie)",
  "triAmendement": "jiaaaaaaaaaaaaaaaaaaaaaaaaaaaaaaaaaaaaaaaaaaaaaaaajoacdc",
  "cardinaliteAmdtMultiples": "1",
  "amendementParent": {
    "@xmlns:xsi": "http://www.w3.org/2001/XMLSchema-instance",
    "@xsi:nil": "true"
  },
  "etat": "Discuté",
  "signataires": {
    "auteur": {
      "typeAuteur": "Depute",
      "acteurRef": "PA718720",
      "organeRef": {
        "@xmlns:xsi": "http://www.w3.org/2001/XMLSchema-instance",
        "@xsi:nil": "true"
      },
      "groupePolitiqueRef": "PO730940"
    },
    "cosignataires": {
      "acteurRef": [
        "PA721896",
        "PA721270",
        "PA441",
        "PA718926",
        "PA722202",
        "PA722110",
        "PA610667",
        "PA720546",
        "PA720692",
        "PA718720",
        "PA721118",
        "PA721012",
        "PA267306",
        "PA610654",
        "PA689",
        "PA335612"
      ]
    },
    "texteAffichable": "M.&#160;Dufr&#232;gne,  M.&#160;Fabien&#160;Roussel, Mme&#160;Bello, M.&#160;Brotherson, M.&#160;Bruneel, Mme&#160;Buffet, M.&#160;Chassaigne, M.&#160;Dharr&#233;ville, Mme&#160;Faucillon, M.&#160;Jumel, Mme&#160;K&#233;clard-Mond&#233;sir, M.&#160;Lecoq, M.&#160;Nilor, M.&#160;Peu, M.&#160;Serville et M.&#160;Wulfranc"
  },
  "pointeurFragmentTexte": {
    "missionVisee": {
      "@xmlns:xsi": "http://www.w3.org/2001/XMLSchema-instance",
      "@xsi:nil": "true"
    },
    "division": {
      "titre": "Article 8",
      "articleDesignationCourte": "APRÈS ART. 8",
      "type": "ARTICLE",
      "avant_A_Apres": "Après",
      "divisionRattachee": "APRÈS L'ARTICLE 8, insérer l'article suivant:",
      "articleAdditionnel": "1",
      "chapitreAdditionnel": {
        "@xmlns:xsi": "http://www.w3.org/2001/XMLSchema-instance",
        "@xsi:nil": "true"
      },
      "urlDivisionTexteVise": "/15/textes/1371.asp#D_Article_8"
    },
    "alinea": {
      "@xmlns:xsi": "http://www.w3.org/2001/XMLSchema-instance",
      "@xsi:nil": "true"
    }
  },
  "corps": {
    "dispositif": "<p style=\"text-align: justify;\">I.&#160;&#8211;&#160;Le chapitre I<sup>er</sup> du titre II <i>bis</i> de la deuxi&#232;me partie du livre I<sup>er</sup> du code g&#233;n&#233;ral des imp&#244;ts est compl&#233;t&#233; par un VIII ainsi r&#233;dig&#233;&#160;:</p><p style=\"text-align: justify;\">&#171;&#160;VIII. &#8211; Taxes per&#231;ues pour le financement des infrastructures de transport</p><p style=\"text-align: justify;\">&#171;&#160;<i>Art.&#160;1599&#160;</i>quinquies&#160;D.&#160;&#8211;&#160;I.&#160;&#8211;&#160;&#192; compter du 1<sup>er</sup> janvier 2019, il est institu&#233;, au profit de l&#8217;Agence de financement des infrastructures de transport de France, une taxe annuelle sur les surfaces de stationnement annex&#233;es &#224; des locaux commerciaux exer&#231;ant une activit&#233; de commerce de d&#233;tail sur une surface de vente de plus de 2&#160;500 m&#232;tres carr&#233;s.</p><p style=\"text-align: justify;\">&#171;&#160;II. &#8211; Sont soumises &#224; la taxe les personnes priv&#233;es et publiques propri&#233;taires de surfaces de stationnement ou titulaires d&#8217;un droit r&#233;el portant sur celles-ci.</p><p style=\"text-align: justify;\">&#171;&#160;La taxe est acquitt&#233;e par le propri&#233;taire, l&#8217;usufruitier, le preneur &#224; bail &#224; construction, l&#8217;emphyt&#233;ote ou le titulaire d&#8217;une autorisation d&#8217;occupation temporaire du domaine public constitutive d&#8217;un droit r&#233;el qui dispose, au 1<sup>er</sup> janvier de l&#8217;ann&#233;e d&#8217;imposition, d&#8217;une surface taxable.</p><p style=\"text-align: justify;\">&#171;&#160;III. &#8211; Le montant de la taxe est de 40&#160;euros le m&#232;tre carr&#233;.</p><p style=\"text-align: justify;\">&#171;&#160;IV. &#8211; Ces tarifs sont actualis&#233;s au 1er janvier de chaque ann&#233;e en fonction du dernier indice du co&#251;t de la construction publi&#233; par l&#8217;Institut national de la statistique et des &#233;tudes &#233;conomiques. Les valeurs sont arrondies, s&#8217;il y a lieu, au centime d&#8217;euro sup&#233;rieur.</p><p style=\"text-align: justify;\">&#171;&#160;V. &#8211; Les redevables d&#233;posent une d&#233;claration selon les modalit&#233;s pr&#233;vues au VII de l&#8217;article&#160;231&#160;<i>ter</i>.</p><p style=\"text-align: justify;\">&#171;&#160;VI. &#8211; Le contr&#244;le, le recouvrement, le contentieux, les garanties et les sanctions relatifs &#224; la taxe sont r&#233;gis par les r&#232;gles applicables en mati&#232;re de taxe sur les salaires.&#160;&#187;</p><p style=\"text-align: justify;\">II.&#160;&#8211;&#160;Lepr&#233;sent article entre en vigueur &#224; compter du 1<sup>er</sup> janvier 2019.</p>",
    "exposeSommaire": "<p style=\"text-align: justify;\">Les hypermarch&#233;s d&#233;tiennent en France une part de march&#233; unique en Europe. Avec leurs 1,6 million de places de parkings, ils g&#233;n&#232;rent de tr&#232;s nombreux d&#233;placements automobiles, qui constituent une nuisance environnementale, et concurrencent les commerces de centre-ville et de centre-bourg. Pour corriger ces exc&#232;s et privil&#233;gier les autres formes de commerces alimentaires, supermarch&#233;s, sup&#233;rettes et commerces sp&#233;cialis&#233;s, et participer &#224; la revitalisation des villes et villages dans le pays, pour limiter &#233;galement l&#8217;artificialisation des sols en incitant &#224; un urbanisme moins consommateur d&#8217;espaces, il est n&#233;cessaire de prendre des mesures &#233;nergiques, d&#8217;autant que les besoins d&#8217;investissements en mati&#232;re de mobilit&#233; sont tr&#232;s importants. Il est n&#233;cessaire d&#8217;investir ainsi beaucoup plus dans le r&#233;seau ferr&#233;, les transports publics routiers et les am&#233;nagements cyclables. En 2015, a &#233;t&#233; cr&#233;&#233;e dans la seule r&#233;gion Ile-de-France, une taxe additionnelle annuelle sur les surfaces de stationnement annex&#233;es aux locaux &#224; usage de bureaux, aux locaux commerciaux et aux locaux de stockage, en vue de financer les d&#233;penses d&#8217;investissement de la R&#233;gion &#206;le-de-France en faveur des transports en commun. Cette taxe vertueuse du point de vue &#233;cologique concerne les surfaces de stationnements des hypermarch&#233;s et centres commerciaux offrant plus de 2&#160;500 m&#178; de surface de vente. Les auteurs de l'amendement proposent ici de l'&#233;tendre &#224; l'ensemble du territoire.</p>",
    "annexeExposeSommaire": {
      "@xmlns:xsi": "http://www.w3.org/2001/XMLSchema-instance",
      "@xsi:nil": "true"
    }
  },
  "representations": {
    "representation": {
      "nom": "PDF",
      "typeMime": {
        "type": "application",
        "subType": "PDF"
      },
      "statutRepresentation": {
        "verbatim": "true",
        "canonique": "true",
        "officielle": "true",
        "transcription": "false",
        "enregistrement": "false"
      },
      "repSource": {
        "@xmlns:xsi": "http://www.w3.org/2001/XMLSchema-instance",
        "@xsi:nil": "true"
      },
      "offset": {
        "@xmlns:xsi": "http://www.w3.org/2001/XMLSchema-instance",
        "@xsi:nil": "true"
      },
      "contenu": {
        "documentURI": "/15/amendements/1371/AN/286.pdf"
      },
      "dateDispoRepresentation": {
        "@xmlns:xsi": "http://www.w3.org/2001/XMLSchema-instance",
        "@xsi:nil": "true"
      }
    }
  },
  "seanceDiscussion": "RUANR5L15S2019IDS21366",
  "sort": {
    "dateSaisie": "2018-11-13T02:03:40.000+01:00",
    "sortEnSeance": "Non soutenu"
  },
  "dateDepot": "2018-11-09T01:00:00.000+01:00",
  "dateDistribution": "2018-11-12T01:00:00.000+01:00",
  "article99": "0",
  "loiReference": {
    "codeLoi": "CGI",
    "divisionCodeLoi": "1599 quinquies D"
  }
}