{
  "@xmlns": "http://schemas.assemblee-nationale.fr/referentiel",
  "uid": "AMANR5L15PO59051B0490P0D1N234",
  "identifiant": {
    "legislature": "15",
    "numero": "234",
    "numRect": "0",
    "saisine": {
      "refTexteLegislatif": "PRJLANR5L15B0490",
      "numeroPartiePLF": "0",
      "organeExamen": "PO59051",
      "mentionSecondeDeliberation": "0"
    }
  },
  "numeroLong": "CL234",
  "etapeTexte": "1ère lecture (1ère assemblée saisie)",
  "triAmendement": "d",
  "cardinaliteAmdtMultiples": "1",
  "amendementParent": {
    "@xmlns:xsi": "http://www.w3.org/2001/XMLSchema-instance",
    "@xsi:nil": "true"
  },
  "etat": "Discuté",
  "signataires": {
    "auteur": {
      "typeAuteur": "Depute",
      "acteurRef": "PA721142",
      "organeRef": {
        "@xmlns:xsi": "http://www.w3.org/2001/XMLSchema-instance",
        "@xsi:nil": "true"
      },
      "groupePolitiqueRef": "PO730964"
    },
    "cosignataires": {
      "acteurRef": "PA721142"
    },
    "texteAffichable": "Mme&#160;Forteza, rapporteure"
  },
  "pointeurFragmentTexte": {
    "missionVisee": {
      "@xmlns:xsi": "http://www.w3.org/2001/XMLSchema-instance",
      "@xsi:nil": "true"
    },
    "division": {
      "titre": "Article 14",
      "articleDesignationCourte": "AVANT ART. 14",
      "type": "ARTICLE",
      "avant_A_Apres": "Avant",
      "divisionRattachee": "AVANT L'ARTICLE 14, insérer l'article suivant:",
      "articleAdditionnel": "1",
      "chapitreAdditionnel": {
        "@xmlns:xsi": "http://www.w3.org/2001/XMLSchema-instance",
        "@xsi:nil": "true"
      },
      "urlDivisionTexteVise": "/15/textes/0490.asp#D_Article_14"
    },
    "alinea": {
      "@xmlns:xsi": "http://www.w3.org/2001/XMLSchema-instance",
      "@xsi:nil": "true"
    }
  },
  "corps": {
    "dispositif": "<p style=\"text-align: justify;\">La section&#160;1 du chapitre&#160;II de la loi n&#176;&#160;78&#8209;17 du&#160;6 janvier&#160;1978 pr&#233;cit&#233;e est compl&#233;t&#233;e par un article&#160;7&#160;<i>bi</i>s ainsi r&#233;dig&#233;&#160;:</p><p style=\"text-align: justify;\">&#171;&#160;<i>Art.&#160;7&#160;</i>bis.&#160;&#8211;&#160;En application du&#160;1 de l&#8217;article&#160;8 du r&#232;glement&#160;(UE)&#160;2016/679 du Parlement&#160;europ&#233;en et du Conseil du&#160;27&#160;avril&#160;2016 pr&#233;cit&#233;, un mineur peut consentir seul &#224; un traitement de donn&#233;es &#224; caract&#232;re personnel en ce qui concerne l&#8217;offre directe de services de la soci&#233;t&#233; de l&#8217;information &#224; compter de l&#8217;&#226;ge de quinze ans.</p><p style=\"text-align: justify;\">&#171;&#160;Un mineur &#226;g&#233; de moins de quinze ans peut &#234;tre autoris&#233; par le ou les titulaires de l&#8217;autorit&#233; parentale &#224; l&#8217;&#233;gard de ce mineur &#224; consentir seul &#224; un traitement mentionn&#233; au premier alin&#233;a du pr&#233;sent article.</p><p style=\"text-align: justify;\">&#171;&#160;Le responsable de traitement r&#233;dige en des termes clairs et simples, ais&#233;ment compr&#233;hensibles par le mineur, toute information et communication relatives au traitement qui le concerne.&#160;&#187;</p>",
    "exposeSommaire": "<p style=\"text-align: justify;\">Le r&#232;glement&#160;europ&#233;en sur la protection des donn&#233;es fixe &#224; 16 ans l&#8217;&#226;ge &#224; partir duquel un mineur peut consentir seul au traitement de ses donn&#233;es. En dessous de cet &#226;ge, le consentement de ses parents sera n&#233;cessaire. Il autorise toutefois les &#201;tats &#224; abaisser ce seuil &#224; 13, 14 ou 15 ans, marge de man&#339;uvre qui a &#233;t&#233; largement utilis&#233; par nos voisins.</p><p style=\"text-align: justify;\">Cette situation, protectrice des int&#233;r&#234;ts de l&#8217;enfant dans l&#8217;univers num&#233;rique, traite toutefois de mani&#232;re homog&#232;ne et indiscrimin&#233;e un enfant pr&#233;-adolescent et un adolescent. Or, un enfant de 11 ans ne peut pas &#234;tre trait&#233; de la m&#234;me mani&#232;re qu&#8217;un jeune de 15 ans. Il convient &#233;galement de prendre en compte les seuils &#233;tablis dans d&#8217;autres domaines, comme en mati&#232;re d&#8217;opposition &#224; l&#8217;acc&#232;s des parents aux donn&#233;es de sant&#233; (15 ans) ou dans le domaine encore plus sensible de la majorit&#233; sexuelle (fix&#233;e, en droit fran&#231;ais, &#224; 15 ans).</p><p style=\"text-align: justify;\">C&#8217;est pourquoi le pr&#233;sent amendement propose un nouvel &#233;quilibre dans la protection des enfants face au traitement de leurs donn&#233;es personnelles.</p><p style=\"text-align: justify;\">En premier lieu, il abaisse de 16 &#224; 15 ans l&#8217;&#226;ge &#224; partir duquel un mineur pourra consentir seul au traitement des donn&#233;es qui le concerne.</p><p style=\"text-align: justify;\">En deuxi&#232;me lieu, et afin d&#8217;accompagner les enfants dans leur apprentissage de l&#8217;univers num&#233;rique et des r&#233;seaux sociaux, il soumet le traitement de donn&#233;es relatives &#224; un mineur de moins de 15 ans au double consentement des parents et du mineur.</p><p style=\"text-align: justify;\">En dernier lieu, il impose aux responsables de traitements une obligation d&#8217;information du mineur dans des termes adapt&#233;s &#224; son &#226;ge. En effet, les enfants doivent &#234;tre accompagn&#233;s dans leur apprentissage d&#8217;internet et de ses usages, en particulier au moment de leur inscription sur les r&#233;seaux sociaux.</p><p style=\"text-align: justify;\">Par ailleurs, cette proposition n&#8217;est pas exclusive des initiatives de &#171;&#160;droit souple&#160;&#187; qui pourront &#234;tre prises afin d&#8217;encourager les acteurs du num&#233;rique au respect de r&#232;gles protectrices des int&#233;r&#234;ts de l&#8217;enfant sur internet (blocage de certaines fonctionnalit&#233;s, absence de r&#233;f&#233;rencement des profils de mineurs sur les moteurs de recherche, facilitation des m&#233;canismes de signalement...). Ces initiatives pourraient parfaitement s&#8217;inscrire dans la mission de labellisation de produits et de proc&#233;dures reconnue &#224; la CNIL au c) du 3&#176; de l&#8217;article&#160;11 de la loi de 1978.</p>",
    "annexeExposeSommaire": {
      "@xmlns:xsi": "http://www.w3.org/2001/XMLSchema-instance",
      "@xsi:nil": "true"
    }
  },
  "representations": {
    "representation": {
      "nom": "PDF",
      "typeMime": {
        "type": "application",
        "subType": "PDF"
      },
      "statutRepresentation": {
        "verbatim": "true",
        "canonique": "true",
        "officielle": "true",
        "transcription": "false",
        "enregistrement": "false"
      },
      "repSource": {
        "@xmlns:xsi": "http://www.w3.org/2001/XMLSchema-instance",
        "@xsi:nil": "true"
      },
      "offset": {
        "@xmlns:xsi": "http://www.w3.org/2001/XMLSchema-instance",
        "@xsi:nil": "true"
      },
      "contenu": {
        "documentURI": "/15/amendements/0490/CION_LOIS/CL234.pdf"
      },
      "dateDispoRepresentation": {
        "@xmlns:xsi": "http://www.w3.org/2001/XMLSchema-instance",
        "@xsi:nil": "true"
      }
    }
  },
  "seanceDiscussion": {
    "@xmlns:xsi": "http://www.w3.org/2001/XMLSchema-instance",
    "@xsi:nil": "true"
  },
  "sort": {
    "dateSaisie": "2018-01-24T21:35:42.000+01:00",
    "sortEnSeance": "Adopté"
  },
  "dateDepot": "2018-01-22T01:00:00.000+01:00",
  "dateDistribution": "2018-01-23T01:00:00.000+01:00",
  "article99": "0",
  "loiReference": {
    "codeLoi": "z78-17",
    "divisionCodeLoi": "7 bis 1"
  }
}