{
  "@xmlns": "http://schemas.assemblee-nationale.fr/referentiel",
  "uid": "AMANR5L15PO419610B0846P0D1N780",
  "identifiant": {
    "legislature": "15",
    "numero": "780",
    "numRect": "0",
    "saisine": {
      "refTexteLegislatif": "PRJLANR5L15B0846",
      "numeroPartiePLF": "0",
      "organeExamen": "PO419610",
      "mentionSecondeDeliberation": "0"
    }
  },
  "numeroLong": "CE780",
  "etapeTexte": "1ère lecture (1ère assemblée saisie)",
  "triAmendement": "bykkkzi",
  "cardinaliteAmdtMultiples": "1",
  "amendementParent": {
    "@xmlns:xsi": "http://www.w3.org/2001/XMLSchema-instance",
    "@xsi:nil": "true"
  },
  "etat": "Discuté",
  "signataires": {
    "auteur": {
      "typeAuteur": "Depute",
      "acteurRef": "PA267429",
      "organeRef": {
        "@xmlns:xsi": "http://www.w3.org/2001/XMLSchema-instance",
        "@xsi:nil": "true"
      },
      "groupePolitiqueRef": "PO730934"
    },
    "cosignataires": {
      "acteurRef": [
        "PA605036",
        "PA720684",
        "PA266793",
        "PA330684",
        "PA267260",
        "PA330909",
        "PA748954",
        "PA721286",
        "PA267429"
      ]
    },
    "texteAffichable": "M.&#160;Cinieri,  M.&#160;Descoeur, Mme&#160;Val&#233;rie&#160;Boyer, M.&#160;Bony, M.&#160;Savignat, Mme&#160;Poletti, M.&#160;Abad, M.&#160;Ramadier et M.&#160;Pierre-Henri&#160;Dumont"
  },
  "pointeurFragmentTexte": {
    "missionVisee": {
      "@xmlns:xsi": "http://www.w3.org/2001/XMLSchema-instance",
      "@xsi:nil": "true"
    },
    "division": {
      "titre": "Article 28",
      "articleDesignationCourte": "ART. 28",
      "type": "ARTICLE",
      "avant_A_Apres": "A",
      "divisionRattachee": "ARTICLE 28",
      "articleAdditionnel": {
        "@xmlns:xsi": "http://www.w3.org/2001/XMLSchema-instance",
        "@xsi:nil": "true"
      },
      "chapitreAdditionnel": {
        "@xmlns:xsi": "http://www.w3.org/2001/XMLSchema-instance",
        "@xsi:nil": "true"
      },
      "urlDivisionTexteVise": "/15/textes/0846.asp#D_Article_28"
    },
    "alinea": {
      "avant_A_Apres": "A",
      "numero": "89",
      "alineaDesignation": "Alinéa 89"
    }
  },
  "corps": {
    "dispositif": "<p style=\"text-align: justify;\">Supprimer les alin&#233;as&#160;89 &#224;&#160;91.</p>",
    "exposeSommaire": "<p style=\"text-align: justify;\">Autoriser les bailleurs sociaux &#224; d&#233;roger au titre II de la loi MOP relatif &#224; la ma&#238;trise d&#8217;&#339;uvre revient &#224; les dispenser de faire appel &#224; une &#233;quipe de ma&#238;trise d&#8217;&#339;uvre charg&#233;e de la r&#233;alisation d&#8217;une mission permettant &#224; la ma&#238;trise d&#8217;ouvrage de s&#8217;assurer de la qualit&#233; de l&#8217;ouvrage et du respect de son programme.</p><p style=\"text-align: justify;\">Le principe majeur de la loi MOP est qu&#8217;il faut confier la ma&#238;trise d&#8217;&#339;uvre &#224; une &#233;quipe unique qui sera responsable de la coh&#233;rence d&#8217;un projet, et, in fine, de la r&#233;ussite de l&#8217;op&#233;ration, du d&#233;but &#224; la fin de celle-ci.</p><p style=\"text-align: justify;\">Le l&#233;gislateur de l&#8217;&#233;poque avait bien compris l&#8217;int&#233;r&#234;t d&#8217;une ma&#238;trise d&#8217;&#339;uvre ind&#233;pendante des entreprises, d&#233;fendant et prot&#233;geant les ma&#238;tres d&#8217;ouvrage publics, faisant respecter l&#8217;ex&#233;cution et la qualit&#233; des prestations demand&#233;es, et les d&#233;lais bien souvent impos&#233;s</p><p style=\"text-align: justify;\">Supprimer le titre 2, c&#8217;est emp&#234;cher les ma&#238;tres d&#8217;ouvrage de b&#233;n&#233;ficier d&#8217;une &#233;quipe de ma&#238;trise d&#8217;&#339;uvre pluridisciplinaire et ind&#233;pendante, travaillant ensemble du premier coup de crayon &#224; la livraison des ouvrages. A l&#8217;heure du BIM, o&#249; le travail collaboratif est indispensable, ces alin&#233;as 89 &#224; 91 semblent inad&#233;quats.</p>",
    "annexeExposeSommaire": {
      "@xmlns:xsi": "http://www.w3.org/2001/XMLSchema-instance",
      "@xsi:nil": "true"
    }
  },
  "representations": {
    "representation": {
      "nom": "PDF",
      "typeMime": {
        "type": "application",
        "subType": "PDF"
      },
      "statutRepresentation": {
        "verbatim": "true",
        "canonique": "true",
        "officielle": "true",
        "transcription": "false",
        "enregistrement": "false"
      },
      "repSource": {
        "@xmlns:xsi": "http://www.w3.org/2001/XMLSchema-instance",
        "@xsi:nil": "true"
      },
      "offset": {
        "@xmlns:xsi": "http://www.w3.org/2001/XMLSchema-instance",
        "@xsi:nil": "true"
      },
      "contenu": {
        "documentURI": "/15/amendements/0846/CION-ECO/CE780.pdf"
      },
      "dateDispoRepresentation": {
        "@xmlns:xsi": "http://www.w3.org/2001/XMLSchema-instance",
        "@xsi:nil": "true"
      }
    }
  },
  "seanceDiscussion": {
    "@xmlns:xsi": "http://www.w3.org/2001/XMLSchema-instance",
    "@xsi:nil": "true"
  },
  "sort": {
    "dateSaisie": "2018-05-17T12:57:49.000+02:00",
    "sortEnSeance": "Non soutenu"
  },
  "dateDepot": "2018-05-07T02:00:00.000+02:00",
  "dateDistribution": "2018-05-14T02:00:00.000+02:00",
  "article99": "0",
  "loiReference": {
    "codeLoi": "s 89-91",
    "divisionCodeLoi": {
      "@xmlns:xsi": "http://www.w3.org/2001/XMLSchema-instance",
      "@xsi:nil": "true"
    }
  }
}