{
  "@xmlns": "http://schemas.assemblee-nationale.fr/referentiel",
  "uid": "AMANR5L15PO59048B1490P0D1N48",
  "identifiant": {
    "legislature": "15",
    "numero": "48",
    "numRect": "0",
    "saisine": {
      "refTexteLegislatif": "PRJLANR5L15B1490",
      "numeroPartiePLF": "0",
      "organeExamen": "PO59048",
      "mentionSecondeDeliberation": "0"
    }
  },
  "numeroLong": "CF48",
  "etapeTexte": "Nouvelle Lecture",
  "triAmendement": "ebaaaaaaaaaaaaaaaaaaaaaaaaaaaaaaaaaaaaaaaaaaaaaaaabx",
  "cardinaliteAmdtMultiples": "1",
  "amendementParent": {
    "@xmlns:xsi": "http://www.w3.org/2001/XMLSchema-instance",
    "@xsi:nil": "true"
  },
  "etat": "Irrecevable",
  "signataires": {
    "auteur": {
      "typeAuteur": "Depute",
      "acteurRef": "PA608172",
      "organeRef": {
        "@xmlns:xsi": "http://www.w3.org/2001/XMLSchema-instance",
        "@xsi:nil": "true"
      },
      "groupePolitiqueRef": "PO758835"
    },
    "cosignataires": {
      "acteurRef": [
        "PA609590",
        "PA429893",
        "PA720988",
        "PA332614",
        "PA267233",
        "PA340357",
        "PA1809",
        "PA719930",
        "PA608741",
        "PA609332",
        "PA643145",
        "PA335054",
        "PA608011",
        "PA337483",
        "PA335532",
        "PA610681",
        "PA342415",
        "PA642764",
        "PA1008",
        "PA508",
        "PA340343",
        "PA1198",
        "PA333285",
        "PA605069",
        "PA608172",
        "PA608695",
        "PA1592",
        "PA607553",
        "PA333818"
      ]
    },
    "texteAffichable": "Mme&#160;Pires Beaune,  M.&#160;Jean-Louis&#160;Bricout, Mme&#160;Rabault, M.&#160;Aviragnet, Mme&#160;Bareigts, Mme&#160;Battistel, Mme&#160;Bi&#233;mouret, M.&#160;Bouillon, M.&#160;Carvounas, M.&#160;Alain&#160;David, Mme&#160;Laurence&#160;Dumont, M.&#160;Faure, M.&#160;Garot, M.&#160;David&#160;Habib, M.&#160;Hutin, M.&#160;Juanico, Mme&#160;Karamanli, M.&#160;J&#233;r&#244;me&#160;Lambert, M.&#160;Letchimy, Mme&#160;Manin, Mme&#160;Pau-Langevin, M.&#160;Potier, M.&#160;Pueyo, M.&#160;Saulignac, Mme&#160;Tolmont, Mme&#160;Untermaier, Mme&#160;Vainqueur-Christophe, M.&#160;Vallaud et Mme&#160;Victory"
  },
  "pointeurFragmentTexte": {
    "missionVisee": {
      "idMissionAN": "702",
      "libelleMission": "Cohésion des territoires",
      "codeMissionPLF": "B",
      "libelleMissionPLF": "Répartition, par mission et programme, des crédits du budget général"
    },
    "division": {
      "titre": "ÉTAT B",
      "articleDesignationCourte": "ART. 39",
      "type": "ANNEXE",
      "avant_A_Apres": "A",
      "divisionRattachee": "ARTICLE 39",
      "articleAdditionnel": {
        "@xmlns:xsi": "http://www.w3.org/2001/XMLSchema-instance",
        "@xsi:nil": "true"
      },
      "chapitreAdditionnel": {
        "@xmlns:xsi": "http://www.w3.org/2001/XMLSchema-instance",
        "@xsi:nil": "true"
      },
      "urlDivisionTexteVise": "/15/textes/1490.asp#D_Etat_B"
    },
    "alinea": {
      "@xmlns:xsi": "http://www.w3.org/2001/XMLSchema-instance",
      "@xsi:nil": "true"
    }
  },
  "corps": {
    "exposeSommaire": "<p style=\"text-align: justify;\">Cet amendement vise &#224; maintenir une contribution de l&#8217;&#201;tat au financement du Fonds national des aides &#224; la pierre (FNAP) &#224; un niveau &#233;gal &#224; celui de 2018, c&#8217;est-&#224;-dire 38,8 millions d&#8217;euros.</p><p style=\"text-align: justify;\">La suppression de toute contribution de l&#8217;&#201;tat au FNAP serait un mauvais signal alors m&#234;me que les objectifs de construction fix&#233;s au bailleurs sociaux (40 000 PLAI) demeurent &#233;lev&#233;s pour r&#233;pondre &#224; une demande en hausse. Dans un contexte de rationalisation du secteur HLM, l&#8217;&#201;tat doit continuer &#224; soutenir et orienter l&#8217;effort de construction de logements locatifs sociaux.</p><p style=\"text-align: justify;\">Il est donc propos&#233; d&#8217;augmenter les cr&#233;dits de l&#8217;action n&#176;01 du programme 135 de 38,8 millions d&#8217;euros. Afin d&#8217;assurer la recevabilit&#233; financi&#232;re de cet amendement au titre de l&#8217;article&#160;40 de la Constitution, les cr&#233;dits de l&#8217;action n&#176;2 du programme 112 sont diminu&#233;s d&#8217;autant. Si cet amendement avait vocation &#224; &#234;tre adopt&#233;, il serait cependant souhaitable que le Gouvernement l&#232;ve ce gage pour ne pas p&#233;naliser le programme 112.</p>",
    "annexeExposeSommaire": {
      "@xmlns:xsi": "http://www.w3.org/2001/XMLSchema-instance",
      "@xsi:nil": "true"
    },
    "cartoucheDelaiDepotDepasse": {
      "@xmlns:xsi": "http://www.w3.org/2001/XMLSchema-instance",
      "@xsi:nil": "true"
    },
    "dispositifAmdtCredit": {
      "listeProgrammes": {
        "programme": [
          {
            "libelle": "Hébergement, parcours vers le logement et insertion des personnes vulnérables",
            "id": "52267",
            "AE": {
              "montantPositif": "0",
              "montantNegatif": "0"
            },
            "CP": {
              "montantPositif": "0",
              "montantNegatif": "0"
            },
            "action": "modification",
            "lignesCredits": null
          },
          {
            "libelle": "Aide à l'accès au logement",
            "id": "52268",
            "AE": {
              "montantPositif": "0",
              "montantNegatif": "0"
            },
            "CP": {
              "montantPositif": "0",
              "montantNegatif": "0"
            },
            "action": "modification",
            "lignesCredits": null
          },
          {
            "libelle": "Urbanisme, territoires et amélioration de l'habitat",
            "id": "52269",
            "AE": {
              "montantPositif": "38800000",
              "montantNegatif": "0"
            },
            "CP": {
              "montantPositif": "38800000",
              "montantNegatif": "0"
            },
            "action": "modification",
            "lignesCredits": null
          },
          {
            "libelle": "Impulsion et coordination de la politique d'aménagement du territoire",
            "id": "52270",
            "AE": {
              "montantPositif": "0",
              "montantNegatif": "38800000"
            },
            "CP": {
              "montantPositif": "0",
              "montantNegatif": "38800000"
            },
            "action": "modification",
            "lignesCredits": null
          },
          {
            "libelle": "Interventions territoriales de l'État",
            "id": "52271",
            "AE": {
              "montantPositif": "0",
              "montantNegatif": "0"
            },
            "CP": {
              "montantPositif": "0",
              "montantNegatif": "0"
            },
            "action": "modification",
            "lignesCredits": null
          },
          {
            "libelle": "Politique de la ville",
            "id": "52272",
            "AE": {
              "montantPositif": "0",
              "montantNegatif": "0"
            },
            "CP": {
              "montantPositif": "0",
              "montantNegatif": "0"
            },
            "action": "modification",
            "lignesCredits": null
          }
        ]
      },
      "totalAE": {
        "montantPositif": "38800000",
        "montantNegatif": "38800000",
        "solde": "0"
      },
      "totalCP": {
        "montantPositif": "38800000",
        "montantNegatif": "38800000",
        "solde": "0"
      }
    }
  },
  "representations": {
    "representation": {
      "nom": "PDF",
      "typeMime": {
        "type": "application",
        "subType": "PDF"
      },
      "statutRepresentation": {
        "verbatim": "true",
        "canonique": "true",
        "officielle": "true",
        "transcription": "false",
        "enregistrement": "false"
      },
      "repSource": {
        "@xmlns:xsi": "http://www.w3.org/2001/XMLSchema-instance",
        "@xsi:nil": "true"
      },
      "offset": {
        "@xmlns:xsi": "http://www.w3.org/2001/XMLSchema-instance",
        "@xsi:nil": "true"
      },
      "contenu": {
        "documentURI": "/15/amendements/1490/CION_FIN/CF48.pdf"
      },
      "dateDispoRepresentation": {
        "@xmlns:xsi": "http://www.w3.org/2001/XMLSchema-instance",
        "@xsi:nil": "true"
      }
    }
  },
  "seanceDiscussion": {
    "@xmlns:xsi": "http://www.w3.org/2001/XMLSchema-instance",
    "@xsi:nil": "true"
  },
  "sort": {
    "@xmlns:xsi": "http://www.w3.org/2001/XMLSchema-instance",
    "@xsi:nil": "true"
  },
  "dateDepot": "2018-12-13T01:00:00.000+01:00",
  "dateDistribution": {
    "@xmlns:xsi": "http://www.w3.org/2001/XMLSchema-instance",
    "@xsi:nil": "true"
  },
  "article99": "0",
  "loiReference": {
    "codeLoi": {
      "@xmlns:xsi": "http://www.w3.org/2001/XMLSchema-instance",
      "@xsi:nil": "true"
    },
    "divisionCodeLoi": {
      "@xmlns:xsi": "http://www.w3.org/2001/XMLSchema-instance",
      "@xsi:nil": "true"
    }
  }
}