{
  "@xmlns": "http://schemas.assemblee-nationale.fr/referentiel",
  "uid": "AMANR5L15SEA717460B1371P0D1N252",
  "identifiant": {
    "legislature": "15",
    "numero": "252",
    "numRect": "0",
    "saisine": {
      "refTexteLegislatif": "PRJLANR5L15B1371",
      "numeroPartiePLF": "0",
      "organeExamen": "PO717460",
      "mentionSecondeDeliberation": "0"
    }
  },
  "numeroLong": "252",
  "etapeTexte": "1ère lecture (1ère assemblée saisie)",
  "triAmendement": "jiaaaaaaaaaaaaaaaaaaaaaaaaaaaaaaaaaaaaaaaaaaaaaaaait",
  "cardinaliteAmdtMultiples": "1",
  "amendementParent": {
    "@xmlns:xsi": "http://www.w3.org/2001/XMLSchema-instance",
    "@xsi:nil": "true"
  },
  "etat": "Discuté",
  "signataires": {
    "auteur": {
      "typeAuteur": "Depute",
      "acteurRef": "PA709315",
      "organeRef": {
        "@xmlns:xsi": "http://www.w3.org/2001/XMLSchema-instance",
        "@xsi:nil": "true"
      },
      "groupePolitiqueRef": "PO730934"
    },
    "cosignataires": {
      "acteurRef": [
        "PA709315",
        "PA334843",
        "PA720644",
        "PA718838",
        "PA2492",
        "PA267429",
        "PA721046",
        "PA718850",
        "PA267289",
        "PA1874",
        "PA720684"
      ]
    },
    "texteAffichable": "M.&#160;Viala,  M.&#160;Cordier, M.&#160;Cinieri, M.&#160;Nury, M.&#160;Door, M.&#160;Quentin, M.&#160;Verch&#232;re, M.&#160;Pierre-Henri&#160;Dumont, M.&#160;Le Fur, Mme&#160;Bassire et M.&#160;Brun"
  },
  "pointeurFragmentTexte": {
    "missionVisee": {
      "@xmlns:xsi": "http://www.w3.org/2001/XMLSchema-instance",
      "@xsi:nil": "true"
    },
    "division": {
      "titre": "Article 8",
      "articleDesignationCourte": "APRÈS ART. 8",
      "type": "ARTICLE",
      "avant_A_Apres": "Après",
      "divisionRattachee": "APRÈS L'ARTICLE 8, insérer l'article suivant:",
      "articleAdditionnel": "1",
      "chapitreAdditionnel": {
        "@xmlns:xsi": "http://www.w3.org/2001/XMLSchema-instance",
        "@xsi:nil": "true"
      },
      "urlDivisionTexteVise": "/15/textes/1371.asp#D_Article_8"
    },
    "alinea": {
      "@xmlns:xsi": "http://www.w3.org/2001/XMLSchema-instance",
      "@xsi:nil": "true"
    }
  },
  "corps": {
    "dispositif": "<p style=\"text-align: justify;\">I.&#160;&#8211;&#160;Le code g&#233;n&#233;ral des imp&#244;ts est ainsi modifi&#233;&#160;:</p><p style=\"text-align: justify;\">1&#176; L&#8217;article&#160;683 est ainsi modifi&#233;&#160;:</p><p style=\"text-align: justify;\"><i>a</i>) Au premier alin&#233;a du I, la deuxi&#232;me occurrence du mot&#160;: &#171;&#160;&#224;&#160;&#187; est remplac&#233;e par les mots&#160;: &#171;&#160;au I de&#160;&#187;&#160;;</p><p style=\"text-align: justify;\"><i>b</i>) Il est ajout&#233; un III ainsi r&#233;dig&#233;&#160;:</p><p style=\"text-align: justify;\">&#171;&#160;III.&#160;&#8211;&#160;Les apports immobiliers effectu&#233;s &#224; un groupement foncier agricole, en application du dernier alin&#233;a de l&#8217;article L.&#160;322&#8209;15 du code rural et de la p&#234;che maritime, par un parent ou un alli&#233;, jusqu&#8217;au quatri&#232;me degr&#233; inclus, d&#8217;un d&#233;tenteur de parts de ce groupement ou par l&#8217;un de ses membres sont assujettis &#224; la taxe de publicit&#233; fonci&#232;re ou au droit d&#8217;enregistrement aux taux pr&#233;vu au II de l&#8217;article&#160;1594 D.&#160;&#187;&#160;;</p><p style=\"text-align: justify;\">2&#176; Apr&#232;s le I de l&#8217;article&#160;810, il est ins&#233;r&#233; un I <i>bis</i> ainsi r&#233;dig&#233;&#160;:</p><p style=\"text-align: justify;\">&#171;&#160;I <i>bis</i>.&#160;&#8211;&#160;L&#8217;enregistrement des apports effectu&#233;s &#224; un groupement foncier agricole par un parent ou un alli&#233; jusqu&#8217;au quatri&#232;me degr&#233; inclus d&#8217;un d&#233;tenteur de parts de ce groupement ou par l&#8217;un de ses membres donne lieu au paiement d&#8217;un droit fixe de 250&#160;euros, port&#233; &#224; 350&#160;euros pour les soci&#233;t&#233;s ayant un capital d&#8217;au moins 300 000&#160;euros.&#160;&#187;&#160;;</p><p style=\"text-align: justify;\">3&#176; L&#8217;article&#160;1594 D est compl&#233;t&#233; par un II ainsi r&#233;dig&#233;&#160;:</p><p style=\"text-align: justify;\">&#171;&#160;II.&#160;&#8211;&#160;Les apports immobiliers mentionn&#233;s au III de l&#8217;article&#160;683 sont assujettis &#224; la taxe de publicit&#233; fonci&#232;re ou au droit d&#8217;enregistrement au taux de 2,50&#160;%, sous r&#233;serve des dispositions du II de l&#8217;article&#160;1594 F <i>quinquies</i>.</p><p style=\"text-align: justify;\">&#171;&#160;Il peut &#234;tre modifi&#233; par les conseils d&#233;partementaux sans que ces modifications puissent avoir pour effet de le r&#233;duire &#224; moins de 0,50&#160;% ou de le relever au-del&#224; de 4,50&#160;%.&#160;&#187;&#160;;</p><p style=\"text-align: justify;\">4&#176; L&#8217;article&#160;1594 F <i>quinquies</i> est compl&#233;t&#233; par un II ainsi r&#233;dig&#233;&#160;:</p><p style=\"text-align: justify;\">&#171;&#160;II.&#160;&#8211;&#160;Les actes constatant l&#8217;apport &#224; un groupement foncier agricole de biens acquis dans les conditions du D du I du m&#234;me article sont soumis &#224; la taxe de publicit&#233; fonci&#232;re ou au droit d&#8217;enregistrement au taux de 0,5&#160;%, lorsque l&#8217;apport a &#233;t&#233; effectu&#233; par un parent ou un alli&#233; jusqu&#8217;au quatri&#232;me degr&#233; inclus d&#8217;un d&#233;tenteur de parts de ce groupement ou par l&#8217;un de ses membres.&#160;&#187;</p><p style=\"text-align: justify;\">II. &#8211; L&#8217;article L.&#160;322&#8209;15 du code rural et de la p&#234;che maritime est ainsi r&#233;dig&#233;&#160;:</p><p style=\"text-align: justify;\">&#171;&#160;<i>Art.&#160;L.&#160;322&#8209;15.&#160;&#8211;&#160;</i>Les actes constatant des apports mobiliers &#224; un groupement foncier agricole, l&#8217;augmentation du capital social ou la prorogation d&#8217;un groupement foncier agricole sont enregistr&#233;s au droit fixe pr&#233;vu au I de l&#8217;article&#160;810 du code g&#233;n&#233;ral des imp&#244;ts ou, lorsque ces actes ont &#233;t&#233; effectu&#233;s par un parent ou un alli&#233; jusqu&#8217;au quatri&#232;me degr&#233; inclus d&#8217;un des d&#233;tenteurs de parts de ce groupement ou par l&#8217;un de ses membres, au droit fixe pr&#233;vu au I bis l&#8217;article&#160;810 du m&#234;me code.</p><p style=\"text-align: justify;\">&#171;&#160;Les apports immobiliers &#224; un groupement foncier agricole sont assujettis &#224; la taxe de publicit&#233; fonci&#232;re ou au droit d&#8217;enregistrement aux taux pr&#233;vus aux I et III de l&#8217;article&#160;683 du code g&#233;n&#233;ral des imp&#244;ts.&#160;&#187;</p><p style=\"text-align: justify;\">III.&#160;&#8211;&#160;La perte de recettes pour les collectivit&#233;s territoriales est compens&#233;e &#224; due concurrence par la cr&#233;ation d&#8217;une taxe additionnelle aux droits mentionn&#233;s aux articles 575 et 575 A du code g&#233;n&#233;ral des imp&#244;ts.</p>",
    "exposeSommaire": "<p style=\"text-align: justify;\">Cet amendement compl&#232;te l&#8217;article L.&#160;322&#8209;15 du code rural et de la p&#234;che maritime et les articles 683, 810, 1594 D et 1594 F quinquies du code g&#233;n&#233;ral des imp&#244;ts dans le but de diminuer les droits d&#8217;enregistrement et la taxe fonci&#232;re acquitt&#233;s lors des apports &#224; un groupement foncier agricole.</p><p style=\"text-align: justify;\">Actuellement, l&#8217;augmentation du capital social d&#8217;un groupement foncier agricole et les apports mobiliers sont enregistr&#233;s au droit fixe pr&#233;vu &#224; l&#8217;article&#160;810 du code g&#233;n&#233;ral des imp&#244;ts, d&#8217;un montant de 375&#160;euros, port&#233; &#224; 500&#160;euros pour les soci&#233;t&#233;s dont le capital exc&#232;de 225 000&#160;euros. Ce droit sera abaiss&#233; &#224; 250&#160;euros, port&#233; &#224; 350&#160;euros pour les soci&#233;t&#233;s dont le capital est sup&#233;rieur &#224; 300 000&#160;euros lorsque l&#8217;apport &#233;mane soit d&#8217;un parent ou alli&#233; du donateur jusqu&#8217;au quatri&#232;me degr&#233; inclus, soit d&#8217;un membre du groupement.</p><p style=\"text-align: justify;\">Les apports immobiliers sont assujettis &#224; la taxe fonci&#232;re ou au droit d&#8217;enregistrement soit au taux de 3,80&#160;% qui, en application de l&#8217;article&#160;1594 D, peut &#234;tre modul&#233; par les conseils d&#233;partementaux entre 1,2&#160;% et 4,5&#160;%, soit au taux de 0,7&#160;%, lorsque l&#8217;apport concerne un bien acquis dans les conditions du D de l&#8217;article&#160;1594 F quinquies. Il est propos&#233; de r&#233;duire ces taux respectivement &#224; 2,50&#160;% et &#224; 0,5&#160;% lorsque l&#8217;apport &#233;mane soit d&#8217;un parent ou alli&#233; du donateur jusqu&#8217;au quatri&#232;me degr&#233; inclus, soit d&#8217;un membre du groupement.</p><p style=\"text-align: justify;\">Le taux de 2,50&#160;% pourrait &#234;tre modul&#233; par les conseils d&#233;partementaux en fonction des caract&#233;ristiques de la propri&#233;t&#233; agricole sur leur territoire et de leur situation financi&#232;re, entre 0,5&#160;% et 4,5&#160;%, le taux de 0,5&#160;% &#233;tant celui qui est propos&#233; dans cette proposition de loi lorsque les biens apport&#233;s avaient b&#233;n&#233;fici&#233;, au moment de leur acquisition, du taux pr&#233;vu &#224; l&#8217;article&#160;1594 F quinquies.</p>",
    "annexeExposeSommaire": {
      "@xmlns:xsi": "http://www.w3.org/2001/XMLSchema-instance",
      "@xsi:nil": "true"
    }
  },
  "representations": {
    "representation": {
      "nom": "PDF",
      "typeMime": {
        "type": "application",
        "subType": "PDF"
      },
      "statutRepresentation": {
        "verbatim": "true",
        "canonique": "true",
        "officielle": "true",
        "transcription": "false",
        "enregistrement": "false"
      },
      "repSource": {
        "@xmlns:xsi": "http://www.w3.org/2001/XMLSchema-instance",
        "@xsi:nil": "true"
      },
      "offset": {
        "@xmlns:xsi": "http://www.w3.org/2001/XMLSchema-instance",
        "@xsi:nil": "true"
      },
      "contenu": {
        "documentURI": "/15/amendements/1371/AN/252.pdf"
      },
      "dateDispoRepresentation": {
        "@xmlns:xsi": "http://www.w3.org/2001/XMLSchema-instance",
        "@xsi:nil": "true"
      }
    }
  },
  "seanceDiscussion": "RUANR5L15S2019IDS21366",
  "sort": {
    "dateSaisie": "2018-11-13T01:50:17.000+01:00",
    "sortEnSeance": "Rejeté"
  },
  "dateDepot": "2018-11-09T01:00:00.000+01:00",
  "dateDistribution": "2018-11-12T01:00:00.000+01:00",
  "article99": "0",
  "loiReference": {
    "codeLoi": "CGI",
    "divisionCodeLoi": "683"
  }
}