{
  "@xmlns": "http://schemas.assemblee-nationale.fr/referentiel",
  "uid": "AMANR5L15PO59051B1503P0D1N225",
  "identifiant": {
    "legislature": "15",
    "numero": "225",
    "numRect": "0",
    "saisine": {
      "refTexteLegislatif": "PRJLANR5L15B1503",
      "numeroPartiePLF": "0",
      "organeExamen": "PO59051",
      "mentionSecondeDeliberation": "0"
    }
  },
  "numeroLong": "CL225",
  "etapeTexte": "Nouvelle Lecture",
  "triAmendement": "bboaaaaaaaaaaaaaaaaaaaaaaaaaaaaaaaaaaaaaaaaaaaaaaak",
  "cardinaliteAmdtMultiples": "1",
  "amendementParent": {
    "@xmlns:xsi": "http://www.w3.org/2001/XMLSchema-instance",
    "@xsi:nil": "true"
  },
  "etat": "Discuté",
  "signataires": {
    "auteur": {
      "typeAuteur": "Depute",
      "acteurRef": "PA330008",
      "organeRef": {
        "@xmlns:xsi": "http://www.w3.org/2001/XMLSchema-instance",
        "@xsi:nil": "true"
      },
      "groupePolitiqueRef": "PO730934"
    },
    "cosignataires": {
      "acteurRef": [
        "PA267735",
        "PA721046",
        "PA330008",
        "PA1874",
        "PA1012",
        "PA719318",
        "PA330684",
        "PA720210",
        "PA608416",
        "PA718850",
        "PA606098",
        "PA345722",
        "PA266776",
        "PA267429",
        "PA718884",
        "PA721286",
        "PA608016",
        "PA605991",
        "PA267204",
        "PA267450",
        "PA709315"
      ]
    },
    "texteAffichable": "M.&#160;Breton,  M.&#160;Hetzel, M.&#160;Le Fur, M.&#160;Reiss, Mme&#160;Bassire, M.&#160;Sermier, Mme&#160;Bazin-Malgras, Mme&#160;Anthoine, M.&#160;Cordier, M.&#160;Cinieri, M.&#160;Ramadier, M.&#160;R&#233;mi&#160;Delatte, Mme&#160;Val&#233;rie&#160;Boyer, Mme&#160;Louwagie, M.&#160;de Ganay, M.&#160;Marleix, M.&#160;Viala, M.&#160;de la Verpilli&#232;re, Mme&#160;Beauvais, Mme&#160;Genevard et Mme&#160;Le Grip"
  },
  "pointeurFragmentTexte": {
    "missionVisee": {
      "@xmlns:xsi": "http://www.w3.org/2001/XMLSchema-instance",
      "@xsi:nil": "true"
    },
    "division": {
      "titre": "Article 12 bis",
      "articleDesignationCourte": "ART. 12 BIS",
      "type": "ARTICLE",
      "avant_A_Apres": "A",
      "divisionRattachee": "ARTICLE 12 BIS",
      "articleAdditionnel": {
        "@xmlns:xsi": "http://www.w3.org/2001/XMLSchema-instance",
        "@xsi:nil": "true"
      },
      "chapitreAdditionnel": {
        "@xmlns:xsi": "http://www.w3.org/2001/XMLSchema-instance",
        "@xsi:nil": "true"
      },
      "urlDivisionTexteVise": "/15/textes/1503.asp#D_Article_12_bis"
    },
    "alinea": {
      "@xmlns:xsi": "http://www.w3.org/2001/XMLSchema-instance",
      "@xsi:nil": "true"
    }
  },
  "corps": {
    "dispositif": "<p style=\"text-align: justify;\">Supprimer cet article.</p>",
    "exposeSommaire": "<p>S&#8217;il faut affirmer le caract&#232;re exclusivement judiciaire du divorce dans un but de protection et de bonne justice, il convient de supprimer l&#8217;article 12 bis qui introduit la s&#233;paration de corps conventionnelle sans juge.</p><p>Ce type de mesure ne r&#233;aliserait pas des &#233;conomies car la diminution de la protection judiciaire et des temps de r&#233;flexion favorise le d&#233;veloppement de contentieux post s&#233;paration.</p><p>Selon les r&#233;f&#233;rences statistiques de la Justice 2014, le chiffre de s&#233;paration de corps est de 2531.</p>",
    "annexeExposeSommaire": {
      "@xmlns:xsi": "http://www.w3.org/2001/XMLSchema-instance",
      "@xsi:nil": "true"
    },
    "cartoucheDelaiDepotDepasse": {
      "@xmlns:xsi": "http://www.w3.org/2001/XMLSchema-instance",
      "@xsi:nil": "true"
    }
  },
  "representations": {
    "representation": {
      "nom": "PDF",
      "typeMime": {
        "type": "application",
        "subType": "PDF"
      },
      "statutRepresentation": {
        "verbatim": "true",
        "canonique": "true",
        "officielle": "true",
        "transcription": "false",
        "enregistrement": "false"
      },
      "repSource": {
        "@xmlns:xsi": "http://www.w3.org/2001/XMLSchema-instance",
        "@xsi:nil": "true"
      },
      "offset": {
        "@xmlns:xsi": "http://www.w3.org/2001/XMLSchema-instance",
        "@xsi:nil": "true"
      },
      "contenu": {
        "documentURI": "/15/amendements/1503/CION_LOIS/CL225.pdf"
      },
      "dateDispoRepresentation": {
        "@xmlns:xsi": "http://www.w3.org/2001/XMLSchema-instance",
        "@xsi:nil": "true"
      }
    }
  },
  "seanceDiscussion": {
    "@xmlns:xsi": "http://www.w3.org/2001/XMLSchema-instance",
    "@xsi:nil": "true"
  },
  "sort": {
    "dateSaisie": "2018-12-19T16:43:02.000+01:00",
    "sortEnSeance": "Non soutenu"
  },
  "dateDepot": "2018-12-17T01:00:00.000+01:00",
  "dateDistribution": "2018-12-18T01:00:00.000+01:00",
  "article99": "0",
  "loiReference": {
    "codeLoi": {
      "@xmlns:xsi": "http://www.w3.org/2001/XMLSchema-instance",
      "@xsi:nil": "true"
    },
    "divisionCodeLoi": {
      "@xmlns:xsi": "http://www.w3.org/2001/XMLSchema-instance",
      "@xsi:nil": "true"
    }
  }
}