{
  "@xmlns": "http://schemas.assemblee-nationale.fr/referentiel",
  "uid": "AMANR5L15PO419610B0627P0D1N1961",
  "identifiant": {
    "legislature": "15",
    "numero": "1961",
    "numRect": "0",
    "saisine": {
      "refTexteLegislatif": "PRJLANR5L15B0627",
      "numeroPartiePLF": "0",
      "organeExamen": "PO419610",
      "mentionSecondeDeliberation": "0"
    }
  },
  "numeroLong": "CE1961",
  "etapeTexte": "1ère lecture (1ère assemblée saisie)",
  "triAmendement": "klyx",
  "cardinaliteAmdtMultiples": "1",
  "amendementParent": {
    "@xmlns:xsi": "http://www.w3.org/2001/XMLSchema-instance",
    "@xsi:nil": "true"
  },
  "etat": "Discuté",
  "signataires": {
    "auteur": {
      "typeAuteur": "Depute",
      "acteurRef": "PA942",
      "organeRef": {
        "@xmlns:xsi": "http://www.w3.org/2001/XMLSchema-instance",
        "@xsi:nil": "true"
      },
      "groupePolitiqueRef": "PO744425"
    },
    "cosignataires": {
      "acteurRef": [
        "PA267766",
        "PA719806",
        "PA332228",
        "PA421348",
        "PA610775",
        "PA942",
        "PA720230"
      ]
    },
    "texteAffichable": "M.&#160;Charles&#160;de Courson,  Mme&#160;Auconie, M.&#160;Guy&#160;Bricout, M.&#160;Benoit, M.&#160;Gom&#232;s, Mme&#160;Magnier et M.&#160;Villiers"
  },
  "pointeurFragmentTexte": {
    "missionVisee": {
      "@xmlns:xsi": "http://www.w3.org/2001/XMLSchema-instance",
      "@xsi:nil": "true"
    },
    "division": {
      "titre": "Article 6",
      "articleDesignationCourte": "ART. 6",
      "type": "ARTICLE",
      "avant_A_Apres": "A",
      "divisionRattachee": "ARTICLE 6",
      "articleAdditionnel": {
        "@xmlns:xsi": "http://www.w3.org/2001/XMLSchema-instance",
        "@xsi:nil": "true"
      },
      "chapitreAdditionnel": {
        "@xmlns:xsi": "http://www.w3.org/2001/XMLSchema-instance",
        "@xsi:nil": "true"
      },
      "urlDivisionTexteVise": "/15/textes/0627.asp#D_Article_6"
    },
    "alinea": {
      "avant_A_Apres": "Apres",
      "numero": "3",
      "alineaDesignation": {
        "@xmlns:xsi": "http://www.w3.org/2001/XMLSchema-instance",
        "@xsi:nil": "true"
      }
    }
  },
  "corps": {
    "dispositif": "<p style=\"text-align: justify;\">Apr&#232;s l&#8217;alin&#233;a&#160;5, ins&#233;rer un 3&#176;&#160;<i>bis</i> ainsi r&#233;dig&#233;&#160;:</p><p style=\"text-align: justify;\">&#171;&#160;3&#176;&#160;<i>bis</i>&#160;Apr&#232;s le troisi&#232;me alin&#233;a, il est ins&#233;r&#233; un alin&#233;a ainsi r&#233;dig&#233;&#160;:</p><p style=\"text-align: justify;\">&#171;&#160;En cas d&#8217;&#233;chec de la ren&#233;gociation, chacune des parties pourra, de bonne foi, mettre fin au contrat dans les meilleures dispositions&#160;&#187;.</p>",
    "exposeSommaire": "<p style=\"text-align: justify;\">L&#8217;article L.&#160;441&#8209;8 du code de commerce actuellement en vigueur ne pr&#233;voit aucune disposition visant &#224; tirer les cons&#233;quences d&#8217;un &#233;chec de la ren&#233;gociation du prix convenu.</p><p style=\"text-align: justify;\">Cette lacune est dommageable aux vendeurs qui sont expos&#233;s &#224; la poursuite des relations commerciales, l&#8217;acheteur continuant de commander et de r&#233;gler les commandes au tarif initial. Ceci entraine une recrudescence des aux litiges factures entrainant des co&#251;ts suppl&#233;mentaires pour le vendeur.</p><p style=\"text-align: justify;\">Afin d&#8217;y mettre un terme, un nouvel alin&#233;a au sein de l&#8217;article L.&#160;441&#8209;8 du code de commerce doit pr&#233;voir que chacune des parties pourra mettre un terme au contrat en cas d&#8217;&#233;chec de la ren&#233;gociation et ce, dans les meilleures dispositions.</p>",
    "annexeExposeSommaire": {
      "@xmlns:xsi": "http://www.w3.org/2001/XMLSchema-instance",
      "@xsi:nil": "true"
    }
  },
  "representations": {
    "representation": {
      "nom": "PDF",
      "typeMime": {
        "type": "application",
        "subType": "PDF"
      },
      "statutRepresentation": {
        "verbatim": "true",
        "canonique": "true",
        "officielle": "true",
        "transcription": "false",
        "enregistrement": "false"
      },
      "repSource": {
        "@xmlns:xsi": "http://www.w3.org/2001/XMLSchema-instance",
        "@xsi:nil": "true"
      },
      "offset": {
        "@xmlns:xsi": "http://www.w3.org/2001/XMLSchema-instance",
        "@xsi:nil": "true"
      },
      "contenu": {
        "documentURI": "/15/amendements/0627/CION-ECO/CE1961.pdf"
      },
      "dateDispoRepresentation": {
        "@xmlns:xsi": "http://www.w3.org/2001/XMLSchema-instance",
        "@xsi:nil": "true"
      }
    }
  },
  "seanceDiscussion": {
    "@xmlns:xsi": "http://www.w3.org/2001/XMLSchema-instance",
    "@xsi:nil": "true"
  },
  "sort": {
    "dateSaisie": "2018-04-18T17:08:20.000+02:00",
    "sortEnSeance": "Rejeté"
  },
  "dateDepot": "2018-04-13T02:00:00.000+02:00",
  "dateDistribution": "2018-04-16T02:00:00.000+02:00",
  "article99": "0",
  "loiReference": {
    "codeLoi": {
      "@xmlns:xsi": "http://www.w3.org/2001/XMLSchema-instance",
      "@xsi:nil": "true"
    },
    "divisionCodeLoi": {
      "@xmlns:xsi": "http://www.w3.org/2001/XMLSchema-instance",
      "@xsi:nil": "true"
    }
  }
}