{
  "@xmlns": "http://schemas.assemblee-nationale.fr/referentiel",
  "uid": "AMANR5L15PO419865B2274P0D1N203",
  "identifiant": {
    "legislature": "15",
    "numero": "203",
    "numRect": "0",
    "saisine": {
      "refTexteLegislatif": "PRJLANR5L15B2274",
      "numeroPartiePLF": "0",
      "organeExamen": "PO419865",
      "mentionSecondeDeliberation": "0"
    }
  },
  "numeroLong": "CD203",
  "etapeTexte": "1ère lecture (2ème assemblée saisie)",
  "triAmendement": "abiaaaaaaaaaaaaaaaaaaaaaaaaaaaaaaaaaaaaaaaaaaaaaaai",
  "cardinaliteAmdtMultiples": "1",
  "amendementParent": {
    "@xmlns:xsi": "http://www.w3.org/2001/XMLSchema-instance",
    "@xsi:nil": "true"
  },
  "etat": "En traitement",
  "signataires": {
    "auteur": {
      "typeAuteur": "Depute",
      "acteurRef": "PA605518",
      "organeRef": {
        "@xmlns:xsi": "http://www.w3.org/2001/XMLSchema-instance",
        "@xsi:nil": "true"
      },
      "groupePolitiqueRef": "PO759900"
    },
    "cosignataires": {
      "acteurRef": [
        "PA336175",
        "PA719146",
        "PA267042",
        "PA719286",
        "PA331582",
        "PA942",
        "PA405480",
        "PA608292",
        "PA720038",
        "PA719138",
        "PA720996",
        "PA607619",
        "PA721194",
        "PA720278",
        "PA336439",
        "PA333421",
        "PA605518",
        "PA755549",
        "PA605694"
      ]
    },
    "texteAffichable": "M.&#160;Fran&#231;ois-Michel&#160;Lambert,  M.&#160;Acquaviva, M.&#160;Brial, M.&#160;Castellani, M.&#160;Cl&#233;ment, M.&#160;Colombani, M.&#160;Charles&#160;de Courson, Mme&#160;Dubi&#233;, Mme&#160;Fr&#233;d&#233;rique&#160;Dumas, M.&#160;El Guerrab, M.&#160;Falorni, M.&#160;Favennec Becot, Mme&#160;Josso, M.&#160;Molac, M.&#160;Orphelin, M.&#160;Pancher, Mme&#160;Pinel, M.&#160;Pupponi et M.&#160;Philippe&#160;Vigier"
  },
  "pointeurFragmentTexte": {
    "missionVisee": {
      "@xmlns:xsi": "http://www.w3.org/2001/XMLSchema-instance",
      "@xsi:nil": "true"
    },
    "division": {
      "titre": "Article 1er AB",
      "articleDesignationCourte": "ART. 1ER AB",
      "type": "ARTICLE",
      "avant_A_Apres": "A",
      "divisionRattachee": "ARTICLE 1ER AB",
      "articleAdditionnel": {
        "@xmlns:xsi": "http://www.w3.org/2001/XMLSchema-instance",
        "@xsi:nil": "true"
      },
      "chapitreAdditionnel": {
        "@xmlns:xsi": "http://www.w3.org/2001/XMLSchema-instance",
        "@xsi:nil": "true"
      },
      "urlDivisionTexteVise": "/15/textes/2274.asp#D_Article_1er_AB"
    },
    "alinea": {
      "avant_A_Apres": {
        "@xmlns:xsi": "http://www.w3.org/2001/XMLSchema-instance",
        "@xsi:nil": "true"
      },
      "numero": "1",
      "alineaDesignation": {
        "@xmlns:xsi": "http://www.w3.org/2001/XMLSchema-instance",
        "@xsi:nil": "true"
      }
    }
  },
  "corps": {
    "dispositif": "<p style=\"text-align: justify;\">&#192; l&#8217;alin&#233;a&#160;1, substituer au pourcentage&#160;:</p><p style=\"text-align: justify;\">&#171;&#160;5&#160;%&#160;&#187;</p><p style=\"text-align: justify;\">le pourcentage&#160;:</p><p style=\"text-align: justify;\">&#171;&#160;10&#160;%&#160;&#187;.</p>",
    "exposeSommaire": "<p style=\"text-align: justify;\">Le pr&#233;sent article compl&#232;te l&#8217;article L.&#160;541&#8209;1 du code de l&#8217;environnement qui mentionnait le r&#233;emploi et la r&#233;utilisation comme objectifs de la politique nationale de pr&#233;vention et de gestion des d&#233;chets m&#233;nagers sans toutefois fixer d&#8217;objectif chiffr&#233;.</p><p style=\"text-align: justify;\">Aujourd&#8217;hui sur 37,7 millions de tonnes de d&#233;chets m&#233;nagers produits annuellement en France, seules 900 000 tonnes sont effectivement r&#233;utilis&#233;es, soit 2,5&#160;%. Un quadruplement des tonnages est envisageable et permettrait des &#233;conomies sur le co&#251;t de collecte et de gestion des d&#233;chets et la cr&#233;ation de dizaines de milliers d&#8217;emplois. En effet, 10&#160;000&#160;tonnes trait&#233;es par voie d&#8217;incin&#233;ration cr&#233;ent 3 emplois contre 800 emplois lorsqu&#8217;elles sont trait&#233;es par des structures de la fili&#232;re du r&#233;emploi et de la r&#233;utilisation qui rel&#232;vent le plus souvent de l&#8217;&#233;conomie sociale et solidaire. Aussi, en fixant un objectif ambitieux de quadruplement des tonnages orient&#233;s vers le r&#233;emploi et la r&#233;utilisation &#224; l&#8217;horizon 2030, cet amendement r&#233;pond &#224; des objectifs environnementaux, sociaux et &#233;conomiques.</p>",
    "annexeExposeSommaire": {
      "@xmlns:xsi": "http://www.w3.org/2001/XMLSchema-instance",
      "@xsi:nil": "true"
    },
    "cartoucheDelaiDepotDepasse": "Sous réserve de son traitement par les services de l'Assemblée nationale et de sa recevabilité",
    "avantAppel": {
      "@xmlns:xsi": "http://www.w3.org/2001/XMLSchema-instance",
      "@xsi:nil": "true"
    }
  },
  "representations": {
    "representation": {
      "nom": "PDF",
      "typeMime": {
        "type": "application",
        "subType": "PDF"
      },
      "statutRepresentation": {
        "verbatim": "true",
        "canonique": "true",
        "officielle": "true",
        "transcription": "false",
        "enregistrement": "false"
      },
      "repSource": {
        "@xmlns:xsi": "http://www.w3.org/2001/XMLSchema-instance",
        "@xsi:nil": "true"
      },
      "offset": {
        "@xmlns:xsi": "http://www.w3.org/2001/XMLSchema-instance",
        "@xsi:nil": "true"
      },
      "contenu": {
        "documentURI": "/15/amendements/2274/CION-DVP/CD203.pdf"
      },
      "dateDispoRepresentation": {
        "@xmlns:xsi": "http://www.w3.org/2001/XMLSchema-instance",
        "@xsi:nil": "true"
      }
    }
  },
  "seanceDiscussion": {
    "@xmlns:xsi": "http://www.w3.org/2001/XMLSchema-instance",
    "@xsi:nil": "true"
  },
  "sort": {
    "@xmlns:xsi": "http://www.w3.org/2001/XMLSchema-instance",
    "@xsi:nil": "true"
  },
  "dateDepot": "2019-11-15T01:00:00.000+01:00",
  "dateDistribution": {
    "@xmlns:xsi": "http://www.w3.org/2001/XMLSchema-instance",
    "@xsi:nil": "true"
  },
  "article99": "0",
  "loiReference": {
    "codeLoi": {
      "@xmlns:xsi": "http://www.w3.org/2001/XMLSchema-instance",
      "@xsi:nil": "true"
    },
    "divisionCodeLoi": {
      "@xmlns:xsi": "http://www.w3.org/2001/XMLSchema-instance",
      "@xsi:nil": "true"
    }
  }
}