{
  "@xmlns": "http://schemas.assemblee-nationale.fr/referentiel",
  "uid": "AMANR5L15SEA717460B0269P0D1N920",
  "identifiant": {
    "legislature": "15",
    "numero": "920",
    "numRect": "0",
    "saisine": {
      "refTexteLegislatif": "PRJLANR5L15B0269",
      "numeroPartiePLF": "0",
      "organeExamen": "PO717460",
      "mentionSecondeDeliberation": "0"
    }
  },
  "numeroLong": "920",
  "etapeTexte": "1ère lecture (1ère assemblée saisie)",
  "triAmendement": "zi",
  "cardinaliteAmdtMultiples": "1",
  "amendementParent": {
    "@xmlns:xsi": "http://www.w3.org/2001/XMLSchema-instance",
    "@xsi:nil": "true"
  },
  "etat": "Irrecevable",
  "signataires": {
    "auteur": {
      "typeAuteur": "Depute",
      "acteurRef": "PA642764",
      "organeRef": {
        "@xmlns:xsi": "http://www.w3.org/2001/XMLSchema-instance",
        "@xsi:nil": "true"
      },
      "groupePolitiqueRef": "PO730946"
    },
    "cosignataires": {
      "acteurRef": [
        "PA610681",
        "PA643145",
        "PA332614",
        "PA642764",
        "PA609332",
        "PA340343",
        "PA719930",
        "PA508",
        "PA1008"
      ]
    },
    "texteAffichable": "M.&#160;Aviragnet,  Mme&#160;Bareigts, Mme&#160;Bi&#233;mouret, M.&#160;Faure, Mme&#160;Vainqueur-Christophe, M.&#160;Vallaud, M.&#160;Saulignac, M.&#160;Juanico, M.&#160;Alain&#160;David et les membres du groupe Nouvelle Gauche"
  },
  "pointeurFragmentTexte": {
    "missionVisee": {
      "@xmlns:xsi": "http://www.w3.org/2001/XMLSchema-instance",
      "@xsi:nil": "true"
    },
    "division": {
      "titre": "Article 31",
      "articleDesignationCourte": "APRÈS ART. 31",
      "type": "ARTICLE",
      "avant_A_Apres": "Après",
      "divisionRattachee": "APRÈS L'ARTICLE 31, insérer l'article suivant:",
      "articleAdditionnel": "1",
      "chapitreAdditionnel": {
        "@xmlns:xsi": "http://www.w3.org/2001/XMLSchema-instance",
        "@xsi:nil": "true"
      },
      "urlDivisionTexteVise": "/15/textes/0269.asp#D_Article_31"
    },
    "alinea": {
      "@xmlns:xsi": "http://www.w3.org/2001/XMLSchema-instance",
      "@xsi:nil": "true"
    }
  },
  "corps": {
    "dispositif": "<p style=\"text-align: justify;\">L&#8217;&#201;tat peut autoriser, &#224; compter du 1<sup>er</sup> janvier 2018, &#224; titre d&#8217;exp&#233;rimentation et pour une dur&#233;e n&#8217;exc&#233;dant pas trois ann&#233;es, la suppression des conditions d&#8217;examen pr&#233;vues au dernier alin&#233;a&#160;de l&#8217;article L.&#160;461&#8209;1 du code de la s&#233;curit&#233; sociale pour les pathologies psychiques pouvant &#234;tre reconnues comme maladies d&#8217;origine professionnelle. Cette exp&#233;rimentation est limit&#233;e au seul comit&#233; r&#233;gional de reconnaissance des maladies professionnelles de la r&#233;gion de Toulouse. Pour qu&#8217;une pathologie psychique soit reconnue comme maladie d&#8217;origine professionnelle, le comit&#233; devra &#233;tablir qu&#8217;elle est essentiellement et directement caus&#233;e par le travail habituel de la victime.&#160;</p><p style=\"text-align: justify;\">L&#8217;exp&#233;rimentation mentionn&#233;e &#224; l&#8217;alin&#233;a pr&#233;c&#233;dent donne lieu, au plus tard neuf mois avant son terme, &#224; la transmission au Parlement d&#8217;un rapport d&#8217;&#233;valuation de l&#8217;exp&#233;rimentation et de l&#8217;impact financier observ&#233;.&#160;</p>",
    "exposeSommaire": "<p style=\"text-align: justify;\">Cet amendement a pour objectif d&#8217;exp&#233;rimenter pendant trois ans la suppression du seuil d&#8217;incapacit&#233; permanente partielle (IPP) lors d&#8217;une demande d&#8217;instruction concernant le syndrome d&#8217;&#233;puisement professionnel, commun&#233;ment appel&#233; &#171;&#160;burn-out&#160;&#187;.</p><p style=\"text-align: justify;\">Ce faisant, il s&#8217;agit de lever l&#8217;obstacle principal &#224; la reconnaissance des pathologies psychiques par le comit&#233; r&#233;gional de reconnaissances des maladies professionnelles, et ainsi par la S&#233;curit&#233; sociale.</p><p style=\"text-align: justify;\">Aujourd&#8217;hui, cette reconnaissance est rare et le chemin pour y parvenir en fait un parcours pour le moins difficile&#160;: alors que 3,2 millions d&#8217;actifs en France sont expos&#233;s &#224; un risque &#233;lev&#233; d&#8217;&#233;puisement professionnel, la proc&#233;dure de reconnaissance requiert toujours un taux d&#8217;IPP de 25&#160;% pour une simple instruction du dossier.&#160;</p><p style=\"text-align: justify;\">Cette exp&#233;rimentation et le rapport &#233;tablit &#224; sa suite permettra donc de mieux cerner le probl&#232;me et de progresser vers une reconnaissance du syndrome d&#8217;&#233;puisement professionnel.</p>",
    "annexeExposeSommaire": {
      "@xmlns:xsi": "http://www.w3.org/2001/XMLSchema-instance",
      "@xsi:nil": "true"
    }
  },
  "representations": {
    "representation": {
      "nom": "PDF",
      "typeMime": {
        "type": "application",
        "subType": "PDF"
      },
      "statutRepresentation": {
        "verbatim": "true",
        "canonique": "true",
        "officielle": "true",
        "transcription": "false",
        "enregistrement": "false"
      },
      "repSource": {
        "@xmlns:xsi": "http://www.w3.org/2001/XMLSchema-instance",
        "@xsi:nil": "true"
      },
      "offset": {
        "@xmlns:xsi": "http://www.w3.org/2001/XMLSchema-instance",
        "@xsi:nil": "true"
      },
      "contenu": {
        "documentURI": "/15/amendements/0269/AN/920.pdf"
      },
      "dateDispoRepresentation": {
        "@xmlns:xsi": "http://www.w3.org/2001/XMLSchema-instance",
        "@xsi:nil": "true"
      }
    }
  },
  "seanceDiscussion": {
    "@xmlns:xsi": "http://www.w3.org/2001/XMLSchema-instance",
    "@xsi:nil": "true"
  },
  "sort": {
    "@xmlns:xsi": "http://www.w3.org/2001/XMLSchema-instance",
    "@xsi:nil": "true"
  },
  "dateDepot": "2017-10-20T02:00:00.000+02:00",
  "dateDistribution": {
    "@xmlns:xsi": "http://www.w3.org/2001/XMLSchema-instance",
    "@xsi:nil": "true"
  },
  "article99": "0",
  "loiReference": {
    "codeLoi": {
      "@xmlns:xsi": "http://www.w3.org/2001/XMLSchema-instance",
      "@xsi:nil": "true"
    },
    "divisionCodeLoi": {
      "@xmlns:xsi": "http://www.w3.org/2001/XMLSchema-instance",
      "@xsi:nil": "true"
    }
  }
}