{
  "@xmlns": "http://schemas.assemblee-nationale.fr/referentiel",
  "uid": "AMANR5L15SEA717460B1490P0D1N437",
  "identifiant": {
    "legislature": "15",
    "numero": "437",
    "numRect": "0",
    "saisine": {
      "refTexteLegislatif": "PRJLANR5L15B1490",
      "numeroPartiePLF": "0",
      "organeExamen": "PO717460",
      "mentionSecondeDeliberation": "0"
    }
  },
  "numeroLong": "437",
  "etapeTexte": "Nouvelle Lecture",
  "triAmendement": "ajeaaaaaaaaaaaaaaaaaaaaaaaaaaaaaaaaaaaaaaaaaaaaaaaibo",
  "cardinaliteAmdtMultiples": "1",
  "amendementParent": {
    "@xmlns:xsi": "http://www.w3.org/2001/XMLSchema-instance",
    "@xsi:nil": "true"
  },
  "etat": "Discuté",
  "signataires": {
    "auteur": {
      "typeAuteur": "Depute",
      "acteurRef": "PA441",
      "organeRef": {
        "@xmlns:xsi": "http://www.w3.org/2001/XMLSchema-instance",
        "@xsi:nil": "true"
      },
      "groupePolitiqueRef": "PO730940"
    },
    "cosignataires": {
      "acteurRef": [
        "PA718720",
        "PA610654",
        "PA335612",
        "PA441",
        "PA720546",
        "PA721118",
        "PA722202",
        "PA689",
        "PA722110",
        "PA721012",
        "PA267306",
        "PA721896",
        "PA721270",
        "PA718926",
        "PA720692"
      ]
    },
    "texteAffichable": "Mme&#160;Bello,  M.&#160;Dufr&#232;gne, M.&#160;Fabien&#160;Roussel, M.&#160;Peu, M.&#160;Brotherson, M.&#160;Bruneel, Mme&#160;Buffet, M.&#160;Chassaigne, M.&#160;Dharr&#233;ville, Mme&#160;Faucillon, M.&#160;Jumel, Mme&#160;K&#233;clard-Mond&#233;sir, M.&#160;Lecoq, M.&#160;Nilor et M.&#160;Wulfranc"
  },
  "pointeurFragmentTexte": {
    "missionVisee": {
      "@xmlns:xsi": "http://www.w3.org/2001/XMLSchema-instance",
      "@xsi:nil": "true"
    },
    "division": {
      "titre": "Article 5",
      "articleDesignationCourte": "ART. 5",
      "type": "ARTICLE",
      "avant_A_Apres": "A",
      "divisionRattachee": "ARTICLE 5",
      "articleAdditionnel": {
        "@xmlns:xsi": "http://www.w3.org/2001/XMLSchema-instance",
        "@xsi:nil": "true"
      },
      "chapitreAdditionnel": {
        "@xmlns:xsi": "http://www.w3.org/2001/XMLSchema-instance",
        "@xsi:nil": "true"
      },
      "urlDivisionTexteVise": "/15/textes/1490.asp#D_Article_5"
    },
    "alinea": {
      "@xmlns:xsi": "http://www.w3.org/2001/XMLSchema-instance",
      "@xsi:nil": "true"
    }
  },
  "corps": {
    "dispositif": "<p>Supprimer cet article.</p><p>&#160;</p>",
    "exposeSommaire": "<p style=\"text-align: justify;\">Cette suppression de la TVA NPR poursuit la m&#234;me logique que la diminution de l&#8217;abattement fiscal pr&#233;vu &#224; l&#8217;article&#160;4&#160;: Faire financer par les Outre-mer eux-m&#234;mes leur d&#233;veloppement.</p><p style=\"text-align: justify;\">Ce sont encore les contribuables des Outre-mer qui devront participer, pour une bonne part, &#224; l&#8217;augmentation du budget de 20&#160;% annonc&#233; par le gouvernement, et se substituer ainsi &#224; l&#8217;&#201;tat dans l&#8217;investissement programm&#233;. Bref, les territoires les plus fragiles doivent autofinancer leur d&#233;veloppement.</p>",
    "annexeExposeSommaire": {
      "@xmlns:xsi": "http://www.w3.org/2001/XMLSchema-instance",
      "@xsi:nil": "true"
    },
    "cartoucheDelaiDepotDepasse": {
      "@xmlns:xsi": "http://www.w3.org/2001/XMLSchema-instance",
      "@xsi:nil": "true"
    }
  },
  "representations": {
    "representation": {
      "nom": "PDF",
      "typeMime": {
        "type": "application",
        "subType": "PDF"
      },
      "statutRepresentation": {
        "verbatim": "true",
        "canonique": "true",
        "officielle": "true",
        "transcription": "false",
        "enregistrement": "false"
      },
      "repSource": {
        "@xmlns:xsi": "http://www.w3.org/2001/XMLSchema-instance",
        "@xsi:nil": "true"
      },
      "offset": {
        "@xmlns:xsi": "http://www.w3.org/2001/XMLSchema-instance",
        "@xsi:nil": "true"
      },
      "contenu": {
        "documentURI": "/15/amendements/1490/AN/437.pdf"
      },
      "dateDispoRepresentation": {
        "@xmlns:xsi": "http://www.w3.org/2001/XMLSchema-instance",
        "@xsi:nil": "true"
      }
    }
  },
  "seanceDiscussion": "RUANR5L15S2019IDS21433",
  "sort": {
    "dateSaisie": "2018-12-18T21:34:56.000+01:00",
    "sortEnSeance": "Rejeté"
  },
  "dateDepot": "2018-12-14T01:00:00.000+01:00",
  "dateDistribution": "2018-12-16T01:00:00.000+01:00",
  "article99": "0",
  "loiReference": {
    "codeLoi": {
      "@xmlns:xsi": "http://www.w3.org/2001/XMLSchema-instance",
      "@xsi:nil": "true"
    },
    "divisionCodeLoi": {
      "@xmlns:xsi": "http://www.w3.org/2001/XMLSchema-instance",
      "@xsi:nil": "true"
    }
  }
}