{
  "@xmlns": "http://schemas.assemblee-nationale.fr/referentiel",
  "uid": "AMANR5L15SEA717460BTC1924P0D1N511",
  "identifiant": {
    "legislature": "15",
    "numero": "511",
    "numRect": "0",
    "saisine": {
      "refTexteLegislatif": "PRJLANR5L15BTC1924",
      "numeroPartiePLF": "0",
      "organeExamen": "PO717460",
      "mentionSecondeDeliberation": "1"
    }
  },
  "numeroLong": "511",
  "etapeTexte": "1ère lecture (1ère assemblée saisie)",
  "triAmendement": "poaaaaaaaaaaaaaaaaaaaaaaaaaaaaaaaaaaaaaaaaaaaaaaaam",
  "cardinaliteAmdtMultiples": "1",
  "amendementParent": {
    "@xmlns:xsi": "http://www.w3.org/2001/XMLSchema-instance",
    "@xsi:nil": "true"
  },
  "etat": "Discuté",
  "signataires": {
    "auteur": {
      "typeAuteur": "Depute",
      "acteurRef": "PA719748",
      "organeRef": {
        "@xmlns:xsi": "http://www.w3.org/2001/XMLSchema-instance",
        "@xsi:nil": "true"
      },
      "groupePolitiqueRef": "PO730964"
    },
    "cosignataires": {
      "acteurRef": "PA719748"
    },
    "texteAffichable": "Mme&#160;Chalas"
  },
  "pointeurFragmentTexte": {
    "missionVisee": {
      "@xmlns:xsi": "http://www.w3.org/2001/XMLSchema-instance",
      "@xsi:nil": "true"
    },
    "division": {
      "titre": "Article 36",
      "articleDesignationCourte": "ART. 36",
      "type": "ARTICLE",
      "avant_A_Apres": "A",
      "divisionRattachee": "ARTICLE 36",
      "articleAdditionnel": {
        "@xmlns:xsi": "http://www.w3.org/2001/XMLSchema-instance",
        "@xsi:nil": "true"
      },
      "chapitreAdditionnel": {
        "@xmlns:xsi": "http://www.w3.org/2001/XMLSchema-instance",
        "@xsi:nil": "true"
      },
      "urlDivisionTexteVise": "/15/textes/1924.asp#D_Article_36"
    },
    "alinea": {
      "avant_A_Apres": "Apres",
      "numero": "10",
      "alineaDesignation": {
        "@xmlns:xsi": "http://www.w3.org/2001/XMLSchema-instance",
        "@xsi:nil": "true"
      }
    }
  },
  "corps": {
    "dispositif": "<p style=\"text-align: justify;\">Apr&#232;s l&#8217;alin&#233;a&#160;10, ins&#233;rer l&#8217;alin&#233;a suivant&#160;:</p><p style=\"text-align: justify;\">&#171;&#160;F.&#160;&#8211;&#160;L&#8217;article&#160;4 <i>ter</i> entre en vigueur lors du prochain renouvellement des commissions consultatives paritaires.&#160;&#187;</p>",
    "exposeSommaire": "<p>Amendement r&#233;dactionnel.</p>",
    "annexeExposeSommaire": {
      "@xmlns:xsi": "http://www.w3.org/2001/XMLSchema-instance",
      "@xsi:nil": "true"
    },
    "cartoucheDelaiDepotDepasse": {
      "@xmlns:xsi": "http://www.w3.org/2001/XMLSchema-instance",
      "@xsi:nil": "true"
    }
  },
  "representations": {
    "representation": {
      "nom": "PDF",
      "typeMime": {
        "type": "application",
        "subType": "PDF"
      },
      "statutRepresentation": {
        "verbatim": "true",
        "canonique": "true",
        "officielle": "true",
        "transcription": "false",
        "enregistrement": "false"
      },
      "repSource": {
        "@xmlns:xsi": "http://www.w3.org/2001/XMLSchema-instance",
        "@xsi:nil": "true"
      },
      "offset": {
        "@xmlns:xsi": "http://www.w3.org/2001/XMLSchema-instance",
        "@xsi:nil": "true"
      },
      "contenu": {
        "documentURI": "/15/amendements/1924/AN/511.pdf"
      },
      "dateDispoRepresentation": {
        "@xmlns:xsi": "http://www.w3.org/2001/XMLSchema-instance",
        "@xsi:nil": "true"
      }
    }
  },
  "seanceDiscussion": {
    "@xmlns:xsi": "http://www.w3.org/2001/XMLSchema-instance",
    "@xsi:nil": "true"
  },
  "sort": {
    "dateSaisie": "2019-05-21T22:57:24.000+02:00",
    "sortEnSeance": "Adopté"
  },
  "dateDepot": "2019-05-09T02:00:00.000+02:00",
  "dateDistribution": "2019-05-21T02:00:00.000+02:00",
  "article99": "0",
  "loiReference": {
    "codeLoi": {
      "@xmlns:xsi": "http://www.w3.org/2001/XMLSchema-instance",
      "@xsi:nil": "true"
    },
    "divisionCodeLoi": {
      "@xmlns:xsi": "http://www.w3.org/2001/XMLSchema-instance",
      "@xsi:nil": "true"
    }
  }
}