{
  "@xmlns": "http://schemas.assemblee-nationale.fr/referentiel",
  "uid": "AMANR5L15SEA717460B0911P0D1N469",
  "identifiant": {
    "legislature": "15",
    "numero": "469",
    "numRect": "0",
    "saisine": {
      "refTexteLegislatif": "PRJLANR5L15B0911",
      "numeroPartiePLF": "0",
      "organeExamen": "PO717460",
      "mentionSecondeDeliberation": "0"
    }
  },
  "numeroLong": "469",
  "etapeTexte": "1ère lecture (1ère assemblée saisie)",
  "triAmendement": "aezyzzxdzxzzwtzo",
  "cardinaliteAmdtMultiples": "1",
  "amendementParent": {
    "@xmlns:xsi": "http://www.w3.org/2001/XMLSchema-instance",
    "@xsi:nil": "true"
  },
  "etat": "Discuté",
  "signataires": {
    "auteur": {
      "typeAuteur": "Depute",
      "acteurRef": "PA642847",
      "organeRef": {
        "@xmlns:xsi": "http://www.w3.org/2001/XMLSchema-instance",
        "@xsi:nil": "true"
      },
      "groupePolitiqueRef": "PO730934"
    },
    "cosignataires": {
      "acteurRef": "PA642847"
    },
    "texteAffichable": "M.&#160;Bazin"
  },
  "pointeurFragmentTexte": {
    "missionVisee": {
      "@xmlns:xsi": "http://www.w3.org/2001/XMLSchema-instance",
      "@xsi:nil": "true"
    },
    "division": {
      "titre": "Article PREMIER",
      "articleDesignationCourte": "APRÈS ART. PREMIER",
      "type": "ARTICLE",
      "avant_A_Apres": "Après",
      "divisionRattachee": "APRÈS L'ARTICLE PREMIER, insérer l'article suivant:",
      "articleAdditionnel": "1",
      "chapitreAdditionnel": {
        "@xmlns:xsi": "http://www.w3.org/2001/XMLSchema-instance",
        "@xsi:nil": "true"
      },
      "urlDivisionTexteVise": "/15/textes/0911.asp#D_Article_1er"
    },
    "alinea": {
      "@xmlns:xsi": "http://www.w3.org/2001/XMLSchema-instance",
      "@xsi:nil": "true"
    }
  },
  "corps": {
    "dispositif": "<p style=\"text-align: justify;\">L&#8217;article&#160;24 de la Constitution est compl&#233;t&#233; par un alin&#233;a ainsi r&#233;dig&#233;&#160;:</p><p style=\"text-align: justify;\">&#171;&#160;Le nombre de d&#233;put&#233;s et s&#233;nateurs ne peut &#234;tre inf&#233;rieur &#224; un pour chaque d&#233;partement et collectivit&#233; r&#233;gie par les articles&#160;73 et&#160;74 de la Constitution et la Nouvelle-Cal&#233;donie&#160;&#187;.</p>",
    "exposeSommaire": "<p style=\"text-align: justify;\">Le Gouvernement s&#8217;est engag&#233; &#224; ce que, malgr&#233; la r&#233;duction du nombre de parlementaires, chaque D&#233;partement ou collectivit&#233; soit repr&#233;sent&#233; par au moins un D&#233;put&#233; et un s&#233;nateur.</p><p style=\"text-align: justify;\">Or &#224; ce stade, le projet de loi constitutionnelle ne contient pas cette disposition.</p><p style=\"text-align: justify;\">C&#8217;est &#224; l&#8217;article&#160;6 du projet de loi ordinaire que l&#8217;on retrouve cette exigence, qui, si elle restait inscrite au titre de la loi ordinaire, risquerait de se heurter, en sa d&#233;faveur, &#224; la jurisprudence constitutionnelle de l&#8217;&#233;lection des d&#233;put&#233;s et des s&#233;nateurs sur &#171;&#160;des&#160;bases essentiellement d&#233;mographiques&#160;&#187;, et au principe d&#8217;&#233;galit&#233; devant le suffrage.</p><p style=\"text-align: justify;\">C&#8217;est la raison pour laquelle cet amendement entend donner la garantie constitutionnelle n&#233;cessaire &#224; l&#8217;effectivit&#233; de la promesse d&#8217;un D&#233;put&#233; et d&#8217;un S&#233;nateur a minima par D&#233;partement.</p>",
    "annexeExposeSommaire": {
      "@xmlns:xsi": "http://www.w3.org/2001/XMLSchema-instance",
      "@xsi:nil": "true"
    }
  },
  "representations": {
    "representation": {
      "nom": "PDF",
      "typeMime": {
        "type": "application",
        "subType": "PDF"
      },
      "statutRepresentation": {
        "verbatim": "true",
        "canonique": "true",
        "officielle": "true",
        "transcription": "false",
        "enregistrement": "false"
      },
      "repSource": {
        "@xmlns:xsi": "http://www.w3.org/2001/XMLSchema-instance",
        "@xsi:nil": "true"
      },
      "offset": {
        "@xmlns:xsi": "http://www.w3.org/2001/XMLSchema-instance",
        "@xsi:nil": "true"
      },
      "contenu": {
        "documentURI": "/15/amendements/0911/AN/469.pdf"
      },
      "dateDispoRepresentation": {
        "@xmlns:xsi": "http://www.w3.org/2001/XMLSchema-instance",
        "@xsi:nil": "true"
      }
    }
  },
  "seanceDiscussion": "RUANR5L15S2018IDS21171",
  "sort": {
    "dateSaisie": "2018-07-18T17:07:03.000+02:00",
    "sortEnSeance": "Rejeté"
  },
  "dateDepot": "2018-07-04T02:00:00.000+02:00",
  "dateDistribution": "2018-07-09T02:00:00.000+02:00",
  "article99": "0",
  "loiReference": {
    "codeLoi": "Constitution",
    "divisionCodeLoi": "24"
  }
}