{
  "@xmlns": "http://schemas.assemblee-nationale.fr/referentiel",
  "uid": "AMANR5L15PO419865B1402P0D1N252",
  "identifiant": {
    "legislature": "15",
    "numero": "252",
    "numRect": "0",
    "saisine": {
      "refTexteLegislatif": "PRJLANR5L15B1402",
      "numeroPartiePLF": "0",
      "organeExamen": "PO419865",
      "mentionSecondeDeliberation": "0"
    }
  },
  "numeroLong": "CD252",
  "etapeTexte": "1ère lecture (1ère assemblée saisie)",
  "triAmendement": "aiaaaaaaaaaaaaaaaaaaaaaaaaaaaaaaaaaaaaaaaaaaaaaaaabidi",
  "cardinaliteAmdtMultiples": "1",
  "amendementParent": {
    "@xmlns:xsi": "http://www.w3.org/2001/XMLSchema-instance",
    "@xsi:nil": "true"
  },
  "etat": "Retiré",
  "signataires": {
    "auteur": {
      "typeAuteur": "Depute",
      "acteurRef": "PA719092",
      "organeRef": {
        "@xmlns:xsi": "http://www.w3.org/2001/XMLSchema-instance",
        "@xsi:nil": "true"
      },
      "groupePolitiqueRef": "PO730964"
    },
    "cosignataires": {
      "acteurRef": [
        "PA718894",
        "PA720278",
        "PA719412",
        "PA719092"
      ]
    },
    "texteAffichable": "Mme&#160;Tuffnell,  M.&#160;Orphelin, Mme&#160;Le Feur et M.&#160;Dombreval"
  },
  "pointeurFragmentTexte": {
    "missionVisee": {
      "@xmlns:xsi": "http://www.w3.org/2001/XMLSchema-instance",
      "@xsi:nil": "true"
    },
    "division": {
      "titre": "Article PREMIER",
      "articleDesignationCourte": "ART. PREMIER",
      "type": "ARTICLE",
      "avant_A_Apres": "A",
      "divisionRattachee": "ARTICLE PREMIER",
      "articleAdditionnel": {
        "@xmlns:xsi": "http://www.w3.org/2001/XMLSchema-instance",
        "@xsi:nil": "true"
      },
      "chapitreAdditionnel": {
        "@xmlns:xsi": "http://www.w3.org/2001/XMLSchema-instance",
        "@xsi:nil": "true"
      },
      "urlDivisionTexteVise": "/15/textes/1402.asp#D_Article_1er"
    },
    "alinea": {
      "avant_A_Apres": "A",
      "numero": "9",
      "alineaDesignation": "Alinéa 9"
    }
  },
  "corps": {
    "dispositif": "<p style=\"text-align: justify;\">Substituer aux alin&#233;as 9 et 10 les huit alin&#233;as suivants&#160;:</p><p style=\"text-align: justify;\">&#171;&#160;3&#176; Appui technique et administratif&#160;:</p><p style=\"text-align: justify;\">&#171;&#160;<i>a)</i> Appui technique et expertise, animation et mutualisation des techniques et bonnes pratiques, coordination technique des conservatoires botaniques nationaux&#160;;</p><p style=\"text-align: justify;\">&#171;&#160;<i>b)</i> Concours technique et administratif aux autres &#233;tablissements publics charg&#233;s de la gestion de l&#8217;eau, de la biodiversit&#233; et des espaces naturels, notamment par la cr&#233;ation de services communs&#160;; cette cr&#233;ation ne peut intervenir qu&#8217;&#224; la demande du conseil d&#8217;administration de l&#8217;&#233;tablissement public int&#233;ress&#233;, statuant &#224; la majorit&#233; des deux tiers&#160;;</p><p style=\"text-align: justify;\">&#171;&#160;<i>c)</i> Appui technique et expertise aux services de l&#8217;&#201;tat, aux collectivit&#233;s territoriales et aux &#233;tablissements publics charg&#233;s de la gestion de l&#8217;eau, de la biodiversit&#233; et des espaces naturels dans la mise en &#339;uvre des politiques publiques&#160;;</p><p style=\"text-align: justify;\">&#171;&#160;<i>d)</i> Appui technique et expertise aux services de l&#8217;&#201;tat, aux collectivit&#233;s territoriales et aux &#233;tablissements publics charg&#233;s de la gestion de l&#8217;eau, de la biodiversit&#233; et des espaces naturels pour la mise en &#339;uvre de plans de lutte contre l&#8217;introduction et le d&#233;veloppement des esp&#232;ces invasives&#160;;</p><p style=\"text-align: justify;\">&#171;&#160;<i>e)</i> Appui technique et expertise aupr&#232;s des acteurs socio-&#233;conomiques dans leurs actions en faveur de la biodiversit&#233;&#160;;</p><p style=\"text-align: justify;\">&#171;&#160;<i>f)</i> Appui au suivi de la mise en &#339;uvre des r&#232;glements et directives&#160;europ&#233;ens et des conventions internationales, contribution aux comptes rendus qu&#8217;ils pr&#233;voient et participation et appui aux actions de coop&#233;ration et aux instances&#160;europ&#233;ennes ou internationales, en concertation avec l&#8217;Agence fran&#231;aise de d&#233;veloppement et le Fonds fran&#231;ais pour l&#8217;environnement mondial&#160;;</p><p style=\"text-align: justify;\">&#171;&#160;<i>g)</i> Appui &#224; la pr&#233;servation des continuit&#233;s &#233;cologiques transfrontali&#232;res et aux actions de coop&#233;ration r&#233;gionale d&#233;finies entre la France et les &#201;tats voisins&#160;;&#160;&#187;.</p>",
    "exposeSommaire": "<p style=\"text-align: justify;\">Du point de vue de la nouvelle r&#233;daction de l&#8217;article L.&#160;131&#8209;9 du code de l&#8217;environnement port&#233;e par le projet de loi, s&#8217;il est l&#233;gitime d&#8217;introduire une s&#233;rie compl&#233;mentaire de missions correspondant &#224; l&#8217;adjonction de l&#8217;ONCFS et donc de ses missions propres, il semble incompr&#233;hensible que des missions de l&#8217;AFB, clairement identifi&#233;es dans la loi sur la reconqu&#234;te de la biodiversit&#233; fondatrice de l&#8217;AFB, ne se retrouvent plus dans les missions consolid&#233;es du nouvel &#233;tablissement &#224; cr&#233;er. Il en va notamment et symboliquement de la n&#233;cessaire affirmation d&#8217;une comp&#233;tence sur les milieux tant terrestres qu&#8217;aquatiques et marins. L&#8217;objet de cet amendement est, en compl&#233;ment des nouvelles missions correspondant aux missions de l&#8217;ONCFS, de r&#233;tablir les missions de l&#8217;AFB comme fix&#233;es &#224; sa cr&#233;ation, afin que cet exercice de fusion, ne se solde pas par une r&#233;duction de ses missions et comp&#233;tences.</p>",
    "annexeExposeSommaire": {
      "@xmlns:xsi": "http://www.w3.org/2001/XMLSchema-instance",
      "@xsi:nil": "true"
    },
    "cartoucheDelaiDepotDepasse": {
      "@xmlns:xsi": "http://www.w3.org/2001/XMLSchema-instance",
      "@xsi:nil": "true"
    }
  },
  "representations": {
    "representation": {
      "nom": "PDF",
      "typeMime": {
        "type": "application",
        "subType": "PDF"
      },
      "statutRepresentation": {
        "verbatim": "true",
        "canonique": "true",
        "officielle": "true",
        "transcription": "false",
        "enregistrement": "false"
      },
      "repSource": {
        "@xmlns:xsi": "http://www.w3.org/2001/XMLSchema-instance",
        "@xsi:nil": "true"
      },
      "offset": {
        "@xmlns:xsi": "http://www.w3.org/2001/XMLSchema-instance",
        "@xsi:nil": "true"
      },
      "contenu": {
        "documentURI": "/15/amendements/1402/CION-DVP/CD252.pdf"
      },
      "dateDispoRepresentation": {
        "@xmlns:xsi": "http://www.w3.org/2001/XMLSchema-instance",
        "@xsi:nil": "true"
      }
    }
  },
  "seanceDiscussion": {
    "@xmlns:xsi": "http://www.w3.org/2001/XMLSchema-instance",
    "@xsi:nil": "true"
  },
  "sort": {
    "@xmlns:xsi": "http://www.w3.org/2001/XMLSchema-instance",
    "@xsi:nil": "true"
  },
  "dateDepot": "2018-11-30T01:00:00.000+01:00",
  "dateDistribution": "2018-12-03T01:00:00.000+01:00",
  "article99": "0",
  "loiReference": {
    "codeLoi": "rg 9-10",
    "divisionCodeLoi": {
      "@xmlns:xsi": "http://www.w3.org/2001/XMLSchema-instance",
      "@xsi:nil": "true"
    }
  }
}