{
  "@xmlns": "http://schemas.assemblee-nationale.fr/referentiel",
  "uid": "AMANR5L15PO59051B2357P0D1N305",
  "identifiant": {
    "legislature": "15",
    "numero": "305",
    "numRect": "0",
    "saisine": {
      "refTexteLegislatif": "PRJLANR5L15B2357",
      "numeroPartiePLF": "0",
      "organeExamen": "PO59051",
      "mentionSecondeDeliberation": "0"
    }
  },
  "numeroLong": "CL305",
  "etapeTexte": "1ère lecture (2ème assemblée saisie)",
  "triAmendement": "qiaaaaaaaaaaaaaaaaaaaaaaaaaaaaaaaaaaaaaaaaaaaaaaaai",
  "cardinaliteAmdtMultiples": "1",
  "amendementParent": {
    "@xmlns:xsi": "http://www.w3.org/2001/XMLSchema-instance",
    "@xsi:nil": "true"
  },
  "etat": "Irrecevable",
  "signataires": {
    "auteur": {
      "typeAuteur": "Depute",
      "acteurRef": "PA720054",
      "organeRef": {
        "@xmlns:xsi": "http://www.w3.org/2001/XMLSchema-instance",
        "@xsi:nil": "true"
      },
      "groupePolitiqueRef": "PO730964"
    },
    "cosignataires": {
      "acteurRef": [
        "PA607595",
        "PA719364",
        "PA718962",
        "PA718694",
        "PA720202",
        "PA607155",
        "PA720054",
        "PA719952",
        "PA722000",
        "PA718894",
        "PA721876",
        "PA720622"
      ]
    },
    "texteAffichable": "M.&#160;Haury,  M.&#160;Buchou, Mme&#160;Bureau-Bonnard, M.&#160;Mis, M.&#160;Pellois, M.&#160;Daniel, Mme&#160;Krimi, M.&#160;Morenas, M.&#160;Dombreval, M.&#160;Marc&#160;Delatte, M.&#160;Zulesi et Mme&#160;O&apos;Petit"
  },
  "pointeurFragmentTexte": {
    "missionVisee": {
      "@xmlns:xsi": "http://www.w3.org/2001/XMLSchema-instance",
      "@xsi:nil": "true"
    },
    "division": {
      "titre": "Article 30 bis",
      "articleDesignationCourte": "APRÈS ART. 30 BIS",
      "type": "ARTICLE",
      "avant_A_Apres": "Après",
      "divisionRattachee": "APRÈS L'ARTICLE 30 BIS, insérer l'article suivant:",
      "articleAdditionnel": "1",
      "chapitreAdditionnel": {
        "@xmlns:xsi": "http://www.w3.org/2001/XMLSchema-instance",
        "@xsi:nil": "true"
      },
      "urlDivisionTexteVise": "/15/textes/2357.asp#D_Article_30_bis"
    },
    "alinea": {
      "@xmlns:xsi": "http://www.w3.org/2001/XMLSchema-instance",
      "@xsi:nil": "true"
    }
  },
  "corps": {
    "exposeSommaire": {
      "@xmlns:xsi": "http://www.w3.org/2001/XMLSchema-instance",
      "@xsi:nil": "true"
    },
    "annexeExposeSommaire": {
      "@xmlns:xsi": "http://www.w3.org/2001/XMLSchema-instance",
      "@xsi:nil": "true"
    },
    "cartoucheDelaiDepotDepasse": {
      "@xmlns:xsi": "http://www.w3.org/2001/XMLSchema-instance",
      "@xsi:nil": "true"
    },
    "avantAppel": {
      "@xmlns:xsi": "http://www.w3.org/2001/XMLSchema-instance",
      "@xsi:nil": "true"
    }
  },
  "representations": {
    "representation": {
      "nom": "PDF",
      "typeMime": {
        "type": "application",
        "subType": "PDF"
      },
      "statutRepresentation": {
        "verbatim": "true",
        "canonique": "true",
        "officielle": "true",
        "transcription": "false",
        "enregistrement": "false"
      },
      "repSource": {
        "@xmlns:xsi": "http://www.w3.org/2001/XMLSchema-instance",
        "@xsi:nil": "true"
      },
      "offset": {
        "@xmlns:xsi": "http://www.w3.org/2001/XMLSchema-instance",
        "@xsi:nil": "true"
      },
      "contenu": {
        "documentURI": "/15/amendements/2357/CION_LOIS/CL305.pdf"
      },
      "dateDispoRepresentation": {
        "@xmlns:xsi": "http://www.w3.org/2001/XMLSchema-instance",
        "@xsi:nil": "true"
      }
    }
  },
  "seanceDiscussion": {
    "@xmlns:xsi": "http://www.w3.org/2001/XMLSchema-instance",
    "@xsi:nil": "true"
  },
  "sort": {
    "@xmlns:xsi": "http://www.w3.org/2001/XMLSchema-instance",
    "@xsi:nil": "true"
  },
  "dateDepot": "2019-10-31T01:00:00.000+01:00",
  "dateDistribution": "2019-11-02T01:00:00.000+01:00",
  "article99": "0",
  "loiReference": {
    "codeLoi": "zzzz",
    "divisionCodeLoi": {
      "@xmlns:xsi": "http://www.w3.org/2001/XMLSchema-instance",
      "@xsi:nil": "true"
    }
  }
}