{
  "@xmlns": "http://schemas.assemblee-nationale.fr/referentiel",
  "uid": "AMANR5L15SEA717460B2272P2D1N2695",
  "identifiant": {
    "legislature": "15",
    "numero": "2695",
    "numRect": "0",
    "saisine": {
      "refTexteLegislatif": "PRJLANR5L15B2272",
      "numeroPartiePLF": "2",
      "organeExamen": "PO717460",
      "mentionSecondeDeliberation": "1"
    }
  },
  "numeroLong": "II-2695",
  "etapeTexte": "1ère lecture (1ère assemblée saisie)",
  "triAmendement": "fcaaaaaaaaaaaaaaaaaaaaaaaaaaaaaaaaaaaaaaaaaaaaaaaafjtykx",
  "cardinaliteAmdtMultiples": "1",
  "amendementParent": {
    "@xmlns:xsi": "http://www.w3.org/2001/XMLSchema-instance",
    "@xsi:nil": "true"
  },
  "etat": "Discuté",
  "signataires": {
    "auteur": {
      "typeAuteur": "Depute",
      "acteurRef": "PA718838",
      "organeRef": {
        "@xmlns:xsi": "http://www.w3.org/2001/XMLSchema-instance",
        "@xsi:nil": "true"
      },
      "groupePolitiqueRef": "PO730934"
    },
    "cosignataires": {
      "acteurRef": [
        "PA334654",
        "PA608016",
        "PA721286",
        "PA721410",
        "PA1874",
        "PA605036",
        "PA2492",
        "PA709315",
        "PA606712",
        "PA330909",
        "PA718838",
        "PA712015",
        "PA267794",
        "PA722390",
        "PA266793",
        "PA719318",
        "PA267260",
        "PA642847",
        "PA719272",
        "PA267429",
        "PA608416",
        "PA998",
        "PA721678",
        "PA346218",
        "PA607090",
        "PA267204",
        "PA721474",
        "PA856",
        "PA340853",
        "PA336316",
        "PA718884",
        "PA718784"
      ]
    },
    "texteAffichable": "M.&#160;Brun,  M.&#160;Abad, Mme&#160;Anthoine, M.&#160;Bazin, Mme&#160;Bazin-Malgras, Mme&#160;Bonnivard, M.&#160;Bony, M.&#160;Bouchet, M.&#160;Cherpion, M.&#160;Cinieri, Mme&#160;Corneloup, M.&#160;Dassault, M.&#160;Descoeur, M.&#160;Dive, M.&#160;Hetzel, M.&#160;Leclerc, M.&#160;Le Fur, Mme&#160;Louwagie, M.&#160;Lurton, M.&#160;Masson, Mme&#160;Meunier, M.&#160;Pauget, Mme&#160;Poletti, M.&#160;Quentin, M.&#160;Ramadier, M.&#160;Reda, M.&#160;Sermier, M.&#160;Straumann, Mme&#160;Tabarot, M.&#160;Viala, M.&#160;Jean-Pierre&#160;Vigier et M.&#160;Viry"
  },
  "pointeurFragmentTexte": {
    "missionVisee": {
      "@xmlns:xsi": "http://www.w3.org/2001/XMLSchema-instance",
      "@xsi:nil": "true"
    },
    "division": {
      "titre": "Article 50",
      "articleDesignationCourte": "APRÈS ART. 50",
      "type": "ARTICLE",
      "avant_A_Apres": "Après",
      "divisionRattachee": "APRÈS L'ARTICLE 50, insérer l'article suivant:",
      "articleAdditionnel": "1",
      "chapitreAdditionnel": {
        "@xmlns:xsi": "http://www.w3.org/2001/XMLSchema-instance",
        "@xsi:nil": "true"
      },
      "urlDivisionTexteVise": "/15/textes/2272C.asp#D_Article_50"
    },
    "alinea": {
      "@xmlns:xsi": "http://www.w3.org/2001/XMLSchema-instance",
      "@xsi:nil": "true"
    }
  },
  "corps": {
    "dispositif": "<p>I.&#160;&#8211;&#160;L&#8217;article&#160;244 <i>quater</i> L du code g&#233;n&#233;ral des imp&#244;ts est ainsi modifi&#233;&#160;:</p><p style=\"text-align: justify;\">1&#176;&#160;Apr&#232;s le I, il est ins&#233;r&#233; un I <i>bis</i> ainsi r&#233;dig&#233;&#160;:</p><p style=\"text-align: justify;\">&#171;&#160;I <i>bis</i>.&#160;&#8211;&#160;Les entreprises agricoles qui obtiennent la certification de troisi&#232;me niveau permettant l&#8217;utilisation de la mention &#171;&#160;exploitation de haute valeur environnementale&#160;&#187;, conform&#233;ment &#224; l&#8217;article L.&#160;611&#8209;6 du code rural et de la p&#234;che maritime, avant le 31 d&#233;cembre 2025, b&#233;n&#233;ficient d&#8217;un cr&#233;dit d&#8217;imp&#244;t au titre de l&#8217;ann&#233;e d&#8217;obtention de ladite certification.&#160;&#187;&#160;;</p><p style=\"text-align: justify;\">2&#176;&#160;Au 1 du II, apr&#232;s la r&#233;f&#233;rence&#160;: &#171;&#160;I&#160;&#187;, sont ins&#233;r&#233;s les mots&#160;:&#171;&#160;et au I <i>bis</i>&#160;&#187;&#160;;</p><p style=\"text-align: justify;\">3&#176;&#160;Au IV, apr&#232;s la r&#233;f&#233;rence&#160;: &#171;&#160;I&#160;&#187;, sont ins&#233;r&#233;s les mots&#160;: &#171;&#160;et au I <i>bis</i>&#160;&#187;.</p><p style=\"text-align: justify;\">II.&#160;&#8211;&#160;Le I n&#8217;est applicable qu&#8217;aux sommes venant en d&#233;duction de l&#8217;imp&#244;t d&#251;.</p><p style=\"text-align: justify;\">III.&#160;&#8211;&#160;Le I et le II sont applicables &#224; compter du 1<sup>er</sup> janvier 2021.</p><p style=\"text-align: justify;\">IV.&#160;&#8211;&#160;La perte de recettes pour l&#8217;&#201;tat est compens&#233;e &#224; due concurrence par la cr&#233;ation d&#8217;une taxe additionnelle aux droits mentionn&#233;s aux articles 575 et 575 A du code g&#233;n&#233;ral des imp&#244;ts.</p>",
    "exposeSommaire": "<p>Un dispositif incitatif permettrait d&#8217;acc&#233;l&#233;rer l&#8217;engagement des viticulteurs dans la viticulture durable. Cette d&#233;marche volontaire est aujourd&#8217;hui frein&#233;e par le fait qu&#8217;elle implique de nouveaux investissements, une hausse des co&#251;ts de production, une baisse de la production et des contraintes administratives suppl&#233;mentaires. Le co&#251;t de la certification par un organisme agr&#233;&#233;, ind&#233;pendant de la taille de l&#8217;entreprise, est particuli&#232;rement lourd pour les petites exploitations.&#160;</p><p style=\"text-align: justify;\">Afin de compenser ces handicaps et d&#8217;accompagner les exploitants dans leur d&#233;marche en faveur de l&#8217;environnement et de la biodiversit&#233;, il est propos&#233; d&#8217;att&#233;nuer le co&#251;t administratif de la certification environnementale en octroyant aux exploitants un cr&#233;dit d&#8217;imp&#244;t &#233;gal &#224; celui de l&#8217;engagement en agriculture biologique.&#160;</p><p style=\"text-align: justify;\">Il est important de ne pas opposer les diff&#233;rentes d&#233;marches. Ce cr&#233;dit d&#8217;imp&#244;t b&#233;n&#233;ficierait &#224; la certification environnementale de niveau 3(Haute Valeur Environnementale) vis&#233;e &#224; l&#8217;article D.617&#8209;4 du code rural, dans le but d&#8217;inciter le plus grand nombre d&#8217;exploitants &#224; s&#8217;engager dans cette d&#233;marche HVE.&#160;</p><p style=\"text-align: justify;\">Cet all&#233;gement fiscal pourrait &#234;tre limit&#233; dans sa dur&#233;e&#160;&#8211;&#160;jusqu&#8217;au 31 d&#233;cembre 2025&#160;&#8211;&#160;pour en marquer le caract&#232;re incitatif, tout en en limitant le risque budg&#233;taire et cela seulement pour la premi&#232;re ann&#233;e marquant l&#8217;engagement dans cette d&#233;marche. &#192; l&#8217;instar du cr&#233;dit d&#8217;imp&#244;t en faveur de l&#8217;agriculture biologique, ce cr&#233;dit d&#8217;imp&#244;t devrait s&#8217;inscrire dans le respect de la r&#233;glementation europ&#233;enne relatives aux aides de minimis dans le secteur de l&#8217;agriculture.&#160;</p>",
    "annexeExposeSommaire": {
      "@xmlns:xsi": "http://www.w3.org/2001/XMLSchema-instance",
      "@xsi:nil": "true"
    },
    "cartoucheDelaiDepotDepasse": {
      "@xmlns:xsi": "http://www.w3.org/2001/XMLSchema-instance",
      "@xsi:nil": "true"
    },
    "avantAppel": {
      "@xmlns:xsi": "http://www.w3.org/2001/XMLSchema-instance",
      "@xsi:nil": "true"
    }
  },
  "representations": {
    "representation": {
      "nom": "PDF",
      "typeMime": {
        "type": "application",
        "subType": "PDF"
      },
      "statutRepresentation": {
        "verbatim": "true",
        "canonique": "true",
        "officielle": "true",
        "transcription": "false",
        "enregistrement": "false"
      },
      "repSource": {
        "@xmlns:xsi": "http://www.w3.org/2001/XMLSchema-instance",
        "@xsi:nil": "true"
      },
      "offset": {
        "@xmlns:xsi": "http://www.w3.org/2001/XMLSchema-instance",
        "@xsi:nil": "true"
      },
      "contenu": {
        "documentURI": "/15/amendements/2272C/AN/2695.pdf"
      },
      "dateDispoRepresentation": {
        "@xmlns:xsi": "http://www.w3.org/2001/XMLSchema-instance",
        "@xsi:nil": "true"
      }
    }
  },
  "seanceDiscussion": "RUANR5L15S2020IDS21925",
  "sort": {
    "dateSaisie": "2019-11-15T17:34:23.000+01:00",
    "sortEnSeance": "Retiré"
  },
  "dateDepot": "2019-11-08T01:00:00.000+01:00",
  "dateDistribution": "2019-11-15T01:00:00.000+01:00",
  "article99": "0",
  "loiReference": {
    "codeLoi": "CGI",
    "divisionCodeLoi": "244 quater L"
  }
}