{
  "@xmlns": "http://schemas.assemblee-nationale.fr/referentiel",
  "uid": "AMANR5L15SEA717460BTC1974P0D1N2353",
  "identifiant": {
    "legislature": "15",
    "numero": "2353",
    "numRect": "0",
    "saisine": {
      "refTexteLegislatif": "PRJLANR5L15BTC1974",
      "numeroPartiePLF": "0",
      "organeExamen": "PO717460",
      "mentionSecondeDeliberation": "0"
    }
  },
  "numeroLong": "2353",
  "etapeTexte": "1ère lecture (2ème assemblée saisie)",
  "triAmendement": "alaaaaaaaaaaaaaaaaaaaaaaaaaaaaaaaaaaaaaaaaaaaaaaaaesrwvu",
  "cardinaliteAmdtMultiples": "1",
  "amendementParent": {
    "@xmlns:xsi": "http://www.w3.org/2001/XMLSchema-instance",
    "@xsi:nil": "true"
  },
  "etat": "Discuté",
  "signataires": {
    "auteur": {
      "typeAuteur": "Depute",
      "acteurRef": "PA719922",
      "organeRef": {
        "@xmlns:xsi": "http://www.w3.org/2001/XMLSchema-instance",
        "@xsi:nil": "true"
      },
      "groupePolitiqueRef": "PO730964"
    },
    "cosignataires": {
      "acteurRef": "PA719922"
    },
    "texteAffichable": "M.&#160;Causse"
  },
  "pointeurFragmentTexte": {
    "missionVisee": {
      "@xmlns:xsi": "http://www.w3.org/2001/XMLSchema-instance",
      "@xsi:nil": "true"
    },
    "division": {
      "titre": "Article 4",
      "articleDesignationCourte": "ART. 4",
      "type": "ARTICLE",
      "avant_A_Apres": "A",
      "divisionRattachee": "ARTICLE 4",
      "articleAdditionnel": {
        "@xmlns:xsi": "http://www.w3.org/2001/XMLSchema-instance",
        "@xsi:nil": "true"
      },
      "chapitreAdditionnel": {
        "@xmlns:xsi": "http://www.w3.org/2001/XMLSchema-instance",
        "@xsi:nil": "true"
      },
      "urlDivisionTexteVise": "/15/textes/1974.asp#D_Article_4"
    },
    "alinea": {
      "avant_A_Apres": {
        "@xmlns:xsi": "http://www.w3.org/2001/XMLSchema-instance",
        "@xsi:nil": "true"
      },
      "numero": "18",
      "alineaDesignation": {
        "@xmlns:xsi": "http://www.w3.org/2001/XMLSchema-instance",
        "@xsi:nil": "true"
      }
    }
  },
  "corps": {
    "dispositif": "<p style=\"text-align: justify;\">Apr&#232;s la deuxi&#232;me phrase de l&#8217;alin&#233;a&#160;18, ins&#233;rer les trois phrases suivantes&#160;:</p><p style=\"text-align: justify;\">&#171;&#160;Il recueille et analyse les avis des usagers, les donn&#233;es et indicateurs relevant de la mobilit&#233; sur le bassin de mobilit&#233; concern&#233;. Il peut formuler des propositions aupr&#232;s de l&#8217;autorit&#233; organisatrice dont il d&#233;pend, notamment en mati&#232;re de projet d&#8217;infrastructure, de r&#233;duction de l&#8217;accidentologie, de r&#233;duction de la pollution et de politique tarifaire. Il informe la population sur ses travaux et propositions.&#160;&#187;</p>",
    "exposeSommaire": "<p style=\"text-align: justify;\">Cet amendement vise &#224; &#233;largir les missions des comit&#233;s des partenaires.</p><p style=\"text-align: justify;\">Les comit&#233;s de partenaires&#160;auront ainsi&#160;des missions &#233;largies au-del&#224; d&#8217;un simple r&#244;le consultatif. Ils pourront suivre depuis leur conception jusqu&#8217;&#224; la r&#233;alisation de projets de d&#233;veloppement de nouvelles solutions ou de nouveaux trajets, d&#233;finir, suivre et analyser un ensemble d&#8217;indicateurs tels que le trafic des diff&#233;rents types de v&#233;hicules, le nombre d&#8217;usagers des transports en commun, la ponctualit&#233; des services de mobilit&#233; et la pollution (gaz toxiques, particules fines, nuisances sonores) g&#233;n&#233;r&#233;e dans les zones sensibles. Ils peuvent &#233;galement recueillir l&#8217;avis des usagers et les dysfonctionnements<br /> constat&#233;s, en mettant en place une plate-forme num&#233;rique accessible &#224; tout citoyen, analyser les probl&#232;mes et accidents recens&#233;s afin de pouvoir faire des bilans r&#233;guli&#232;rement et proposer des modifications pour minimiser ou supprimer les risques, proposer des pistes d&#8217;am&#233;lioration des infrastructures et des services de mobilit&#233;, sur la politique tarifaire ou sur le taux de versement mobilit&#233;.</p><p style=\"text-align: justify;\"><br /> Enfin les comit&#233;s de partenaires auront la possibilit&#233; d&#8217;organiser des groupes de travail, des r&#233;unions publiques, des consultations dans le but d&#8217;am&#233;liorer les services de mobilit&#233;, et informer la population sur leurs solutions de mobilit&#233; et sur leurs travaux.</p>",
    "annexeExposeSommaire": {
      "@xmlns:xsi": "http://www.w3.org/2001/XMLSchema-instance",
      "@xsi:nil": "true"
    },
    "cartoucheDelaiDepotDepasse": {
      "@xmlns:xsi": "http://www.w3.org/2001/XMLSchema-instance",
      "@xsi:nil": "true"
    }
  },
  "representations": {
    "representation": {
      "nom": "PDF",
      "typeMime": {
        "type": "application",
        "subType": "PDF"
      },
      "statutRepresentation": {
        "verbatim": "true",
        "canonique": "true",
        "officielle": "true",
        "transcription": "false",
        "enregistrement": "false"
      },
      "repSource": {
        "@xmlns:xsi": "http://www.w3.org/2001/XMLSchema-instance",
        "@xsi:nil": "true"
      },
      "offset": {
        "@xmlns:xsi": "http://www.w3.org/2001/XMLSchema-instance",
        "@xsi:nil": "true"
      },
      "contenu": {
        "documentURI": "/15/amendements/1974/AN/2353.pdf"
      },
      "dateDispoRepresentation": {
        "@xmlns:xsi": "http://www.w3.org/2001/XMLSchema-instance",
        "@xsi:nil": "true"
      }
    }
  },
  "seanceDiscussion": "RUANR5L15S2019IDS21677",
  "sort": {
    "dateSaisie": "2019-06-05T19:03:06.000+02:00",
    "sortEnSeance": "Non soutenu"
  },
  "dateDepot": "2019-05-29T02:00:00.000+02:00",
  "dateDistribution": "2019-06-05T02:00:00.000+02:00",
  "article99": "0",
  "loiReference": {
    "codeLoi": {
      "@xmlns:xsi": "http://www.w3.org/2001/XMLSchema-instance",
      "@xsi:nil": "true"
    },
    "divisionCodeLoi": {
      "@xmlns:xsi": "http://www.w3.org/2001/XMLSchema-instance",
      "@xsi:nil": "true"
    }
  }
}