{
  "@xmlns": "http://schemas.assemblee-nationale.fr/referentiel",
  "uid": "AMANR5L15SEA717460BTC0575P0D1N243",
  "identifiant": {
    "legislature": "15",
    "numero": "243",
    "numRect": "0",
    "saisine": {
      "refTexteLegislatif": "PRJLANR5L15BTC0575",
      "numeroPartiePLF": "0",
      "organeExamen": "PO717460",
      "mentionSecondeDeliberation": "0"
    }
  },
  "numeroLong": "243",
  "etapeTexte": "1ère lecture (1ère assemblée saisie)",
  "triAmendement": "bzu",
  "cardinaliteAmdtMultiples": "1",
  "amendementParent": {
    "@xmlns:xsi": "http://www.w3.org/2001/XMLSchema-instance",
    "@xsi:nil": "true"
  },
  "etat": "Discuté",
  "signataires": {
    "auteur": {
      "typeAuteur": "Depute",
      "acteurRef": "PA608016",
      "organeRef": {
        "@xmlns:xsi": "http://www.w3.org/2001/XMLSchema-instance",
        "@xsi:nil": "true"
      },
      "groupePolitiqueRef": "PO730934"
    },
    "cosignataires": {
      "acteurRef": [
        "PA608416",
        "PA330684",
        "PA330909",
        "PA334654",
        "PA332523",
        "PA719318",
        "PA340853",
        "PA720644",
        "PA718838",
        "PA1012",
        "PA642847",
        "PA712015",
        "PA718884",
        "PA856",
        "PA267260",
        "PA606712",
        "PA608016",
        "PA607090",
        "PA266776"
      ]
    },
    "texteAffichable": "Mme&#160;Louwagie,  M.&#160;Nury, M.&#160;Straumann, Mme&#160;Bazin-Malgras, Mme&#160;Val&#233;rie&#160;Boyer, Mme&#160;Anthoine, M.&#160;Reiss, M.&#160;Lurton, Mme&#160;Poletti, M.&#160;Brun, M.&#160;de la Verpilli&#232;re, M.&#160;Descoeur, M.&#160;Hetzel, M.&#160;Jean-Pierre&#160;Vigier, M.&#160;Leclerc, M.&#160;Dive, M.&#160;Bazin, Mme&#160;Dalloz et M.&#160;Cherpion"
  },
  "pointeurFragmentTexte": {
    "missionVisee": {
      "@xmlns:xsi": "http://www.w3.org/2001/XMLSchema-instance",
      "@xsi:nil": "true"
    },
    "division": {
      "titre": "Article 26",
      "articleDesignationCourte": "APRÈS ART. 26",
      "type": "ARTICLE",
      "avant_A_Apres": "Après",
      "divisionRattachee": "APRÈS L'ARTICLE 26, insérer l'article suivant:",
      "articleAdditionnel": "1",
      "chapitreAdditionnel": {
        "@xmlns:xsi": "http://www.w3.org/2001/XMLSchema-instance",
        "@xsi:nil": "true"
      },
      "urlDivisionTexteVise": "/15/textes/0575.asp#D_Article_26"
    },
    "alinea": {
      "@xmlns:xsi": "http://www.w3.org/2001/XMLSchema-instance",
      "@xsi:nil": "true"
    }
  },
  "corps": {
    "dispositif": "<p style=\"text-align: justify;\">Une exp&#233;rimentation, sur une dur&#233;e de cinq ans, d&#8217;une proc&#233;dure unique particuli&#232;re pour des b&#226;timents accueillant une mixit&#233; programmatique est mise en place. Cette proc&#233;dure est instruite dans un d&#233;lai maximal de six mois. La proc&#233;dure comprend une &#233;tude d&#8217;impact adapt&#233;e dont le contenu est d&#233;fini par d&#233;cret.</p>",
    "exposeSommaire": "<p style=\"text-align: justify;\">Redonner des marges d&#8217;innovation et de comp&#233;titivit&#233; au secteur immobilier d&#8217;activit&#233;s</p><p style=\"text-align: justify;\">Dans un contexte de besoin d&#8217;intensification de l&#8217;usage du foncier, de pr&#233;servation des terres agricoles et de limitation de l&#8217;imperm&#233;abilisation des sols, il est important de permettre la conception de b&#226;timents accueillant des activit&#233;s mixtes&#160;: logistique, activit&#233;s productives, artisanales, tertiaires, &#233;quipements.</p><p style=\"text-align: justify;\">Or, ces b&#226;timents relevant de r&#233;glementations diff&#233;rentes, elles sont difficiles &#224; instruire par les services en charge de la police de l&#8217;urbanisme et de l&#8217;environnement. L&#8217;ensemble des autorisations d&#8217;un b&#226;timent comme Chapelle International a &#233;t&#233; obtenu en plus de trois ans.</p><p style=\"text-align: justify;\">Sur une p&#233;riode de cinq ans, exp&#233;rimenter la conception et la construction de b&#226;timents mixtes et une instruction born&#233;e dans le temps, permettra d&#8217;affiner le cadre pour aller vers une proc&#233;dure d&#233;finitive.</p>",
    "annexeExposeSommaire": {
      "@xmlns:xsi": "http://www.w3.org/2001/XMLSchema-instance",
      "@xsi:nil": "true"
    }
  },
  "representations": {
    "representation": {
      "nom": "PDF",
      "typeMime": {
        "type": "application",
        "subType": "PDF"
      },
      "statutRepresentation": {
        "verbatim": "true",
        "canonique": "true",
        "officielle": "true",
        "transcription": "false",
        "enregistrement": "false"
      },
      "repSource": {
        "@xmlns:xsi": "http://www.w3.org/2001/XMLSchema-instance",
        "@xsi:nil": "true"
      },
      "offset": {
        "@xmlns:xsi": "http://www.w3.org/2001/XMLSchema-instance",
        "@xsi:nil": "true"
      },
      "contenu": {
        "documentURI": "/15/amendements/0575/AN/243.pdf"
      },
      "dateDispoRepresentation": {
        "@xmlns:xsi": "http://www.w3.org/2001/XMLSchema-instance",
        "@xsi:nil": "true"
      }
    }
  },
  "seanceDiscussion": "RUANR5L15S2018IDS20867",
  "sort": {
    "dateSaisie": "2018-01-25T12:27:27.000+01:00",
    "sortEnSeance": "Rejeté"
  },
  "dateDepot": "2018-01-19T01:00:00.000+01:00",
  "dateDistribution": "2018-01-22T01:00:00.000+01:00",
  "article99": "0",
  "loiReference": {
    "codeLoi": null,
    "divisionCodeLoi": {
      "@xmlns:xsi": "http://www.w3.org/2001/XMLSchema-instance",
      "@xsi:nil": "true"
    }
  }
}