{
  "@xmlns": "http://schemas.assemblee-nationale.fr/referentiel",
  "uid": "AMANR5L15SEA717460BTC1461P0D1N35",
  "identifiant": {
    "legislature": "15",
    "numero": "35",
    "numRect": "1",
    "saisine": {
      "refTexteLegislatif": "PRJLANR5L15BTC1461",
      "numeroPartiePLF": "0",
      "organeExamen": "PO717460",
      "mentionSecondeDeliberation": "0"
    }
  },
  "numeroLong": "35 (Rect)",
  "etapeTexte": "1ère lecture (2ème assemblée saisie)",
  "triAmendement": "baaaaaaaaaaaaaaaaaaaaaaaaaaaaaaaaaaaaaaaaaaaaaaaaajs",
  "cardinaliteAmdtMultiples": "1",
  "amendementParent": {
    "@xmlns:xsi": "http://www.w3.org/2001/XMLSchema-instance",
    "@xsi:nil": "true"
  },
  "etat": "Discuté",
  "signataires": {
    "auteur": {
      "typeAuteur": "Depute",
      "acteurRef": "PA608011",
      "organeRef": {
        "@xmlns:xsi": "http://www.w3.org/2001/XMLSchema-instance",
        "@xsi:nil": "true"
      },
      "groupePolitiqueRef": "PO758835"
    },
    "cosignataires": {
      "acteurRef": [
        "PA1592",
        "PA1809",
        "PA608011",
        "PA335532",
        "PA643145",
        "PA342415",
        "PA340343",
        "PA337483",
        "PA608695",
        "PA267233",
        "PA1008",
        "PA720988",
        "PA333285",
        "PA609590",
        "PA333818",
        "PA1198",
        "PA607553",
        "PA609332",
        "PA605069",
        "PA608172",
        "PA608741",
        "PA335054",
        "PA508",
        "PA340357",
        "PA642764",
        "PA332614",
        "PA719930",
        "PA429893",
        "PA610681"
      ]
    },
    "texteAffichable": "M.&#160;Pueyo,  M.&#160;Bouillon, Mme&#160;Karamanli, Mme&#160;Rabault, M.&#160;Aviragnet, Mme&#160;Bareigts, Mme&#160;Battistel, Mme&#160;Bi&#233;mouret, M.&#160;Jean-Louis&#160;Bricout, M.&#160;Carvounas, M.&#160;Alain&#160;David, Mme&#160;Laurence&#160;Dumont, M.&#160;Faure, M.&#160;Garot, M.&#160;David&#160;Habib, M.&#160;Hutin, M.&#160;Juanico, M.&#160;J&#233;r&#244;me&#160;Lambert, M.&#160;Letchimy, Mme&#160;Manin, Mme&#160;Pau-Langevin, Mme&#160;Pires Beaune, M.&#160;Potier, M.&#160;Saulignac, Mme&#160;Tolmont, Mme&#160;Untermaier, Mme&#160;Vainqueur-Christophe, M.&#160;Vallaud et Mme&#160;Victory"
  },
  "pointeurFragmentTexte": {
    "missionVisee": {
      "@xmlns:xsi": "http://www.w3.org/2001/XMLSchema-instance",
      "@xsi:nil": "true"
    },
    "division": {
      "titre": "Article PREMIER",
      "articleDesignationCourte": "ART. PREMIER",
      "type": "ARTICLE",
      "avant_A_Apres": "A",
      "divisionRattachee": "ARTICLE PREMIER",
      "articleAdditionnel": {
        "@xmlns:xsi": "http://www.w3.org/2001/XMLSchema-instance",
        "@xsi:nil": "true"
      },
      "chapitreAdditionnel": {
        "@xmlns:xsi": "http://www.w3.org/2001/XMLSchema-instance",
        "@xsi:nil": "true"
      },
      "urlDivisionTexteVise": "/15/textes/1461.asp#D_Article_1er"
    },
    "alinea": {
      "avant_A_Apres": {
        "@xmlns:xsi": "http://www.w3.org/2001/XMLSchema-instance",
        "@xsi:nil": "true"
      },
      "numero": "12",
      "alineaDesignation": {
        "@xmlns:xsi": "http://www.w3.org/2001/XMLSchema-instance",
        "@xsi:nil": "true"
      }
    }
  },
  "corps": {
    "dispositif": "<p style=\"text-align: justify;\">&#192; l&#8217;alin&#233;a&#160;12, apr&#232;s le mot&#160;:</p><p style=\"text-align: justify;\">&#171;&#160;poursuite&#160;&#187;,</p><p style=\"text-align: justify;\">ins&#233;rer les mots&#160;:</p><p style=\"text-align: justify;\">&#171;&#160;et la pr&#233;servation&#160;&#187;.</p>",
    "exposeSommaire": "<p style=\"text-align: justify;\">Cet amendement du groupe Socialistes et apparent&#233;s propose de r&#233;introduire la notion de pr&#233;servation des int&#233;r&#234;ts &#233;conomiques &#233;nonc&#233;e dans la version du S&#233;nat.</p><p style=\"text-align: justify;\">La formulation propos&#233;e par le S&#233;nat affirmait dans son l&#8217;alin&#233;a&#160;12 que les ordonnances prisent en cas de retrait du Royaume-Uni sans accord visaient notamment &#224; &#171;&#160;pr&#233;server les activit&#233;s &#233;conomiques sur le territoire fran&#231;ais&#160;&#187;.</p><p style=\"text-align: justify;\">La r&#233;daction prise en commission para&#238;t donc moins protectrice car elle envisage une simple poursuite et n&#8217;incorpore pas la dimension de protection intrins&#232;que &#224; la notion de pr&#233;servation.</p>",
    "annexeExposeSommaire": {
      "@xmlns:xsi": "http://www.w3.org/2001/XMLSchema-instance",
      "@xsi:nil": "true"
    },
    "cartoucheDelaiDepotDepasse": {
      "@xmlns:xsi": "http://www.w3.org/2001/XMLSchema-instance",
      "@xsi:nil": "true"
    }
  },
  "representations": {
    "representation": {
      "nom": "PDF",
      "typeMime": {
        "type": "application",
        "subType": "PDF"
      },
      "statutRepresentation": {
        "verbatim": "true",
        "canonique": "true",
        "officielle": "true",
        "transcription": "false",
        "enregistrement": "false"
      },
      "repSource": {
        "@xmlns:xsi": "http://www.w3.org/2001/XMLSchema-instance",
        "@xsi:nil": "true"
      },
      "offset": {
        "@xmlns:xsi": "http://www.w3.org/2001/XMLSchema-instance",
        "@xsi:nil": "true"
      },
      "contenu": {
        "documentURI": "/15/amendements/1461/AN/35.pdf"
      },
      "dateDispoRepresentation": {
        "@xmlns:xsi": "http://www.w3.org/2001/XMLSchema-instance",
        "@xsi:nil": "true"
      }
    }
  },
  "seanceDiscussion": "RUANR5L15S2019IDS21418",
  "sort": {
    "dateSaisie": "2018-12-10T22:00:29.000+01:00",
    "sortEnSeance": "Rejeté"
  },
  "dateDepot": "2018-12-06T01:00:00.000+01:00",
  "dateDistribution": "2018-12-10T01:00:00.000+01:00",
  "article99": "0",
  "loiReference": {
    "codeLoi": {
      "@xmlns:xsi": "http://www.w3.org/2001/XMLSchema-instance",
      "@xsi:nil": "true"
    },
    "divisionCodeLoi": {
      "@xmlns:xsi": "http://www.w3.org/2001/XMLSchema-instance",
      "@xsi:nil": "true"
    }
  }
}