{
  "@xmlns": "http://schemas.assemblee-nationale.fr/referentiel",
  "uid": "AMANR5L15SEA717460BTC1396P0D1N417",
  "identifiant": {
    "legislature": "15",
    "numero": "417",
    "numRect": "0",
    "saisine": {
      "refTexteLegislatif": "PRJLANR5L15BTC1396",
      "numeroPartiePLF": "0",
      "organeExamen": "PO717460",
      "mentionSecondeDeliberation": "0"
    }
  },
  "numeroLong": "417",
  "etapeTexte": "1ère lecture (2ème assemblée saisie)",
  "triAmendement": "aeaaaaaaaaaaaaaaaaaaaaaaaaaaaaaaaaaaaaaaaaaaaaaaaakpkku",
  "cardinaliteAmdtMultiples": "1",
  "amendementParent": {
    "@xmlns:xsi": "http://www.w3.org/2001/XMLSchema-instance",
    "@xsi:nil": "true"
  },
  "etat": "Discuté",
  "signataires": {
    "auteur": {
      "typeAuteur": "Depute",
      "acteurRef": "PA718838",
      "organeRef": {
        "@xmlns:xsi": "http://www.w3.org/2001/XMLSchema-instance",
        "@xsi:nil": "true"
      },
      "groupePolitiqueRef": "PO730934"
    },
    "cosignataires": {
      "acteurRef": [
        "PA267735",
        "PA2377",
        "PA718850",
        "PA605036",
        "PA2492",
        "PA718838"
      ]
    },
    "texteAffichable": "M.&#160;Brun,  M.&#160;Abad, M.&#160;Cordier, M.&#160;de Ganay, M.&#160;Perrut et M.&#160;Quentin"
  },
  "pointeurFragmentTexte": {
    "missionVisee": {
      "@xmlns:xsi": "http://www.w3.org/2001/XMLSchema-instance",
      "@xsi:nil": "true"
    },
    "division": {
      "titre": "Article 4",
      "articleDesignationCourte": "ART. 4",
      "type": "ARTICLE",
      "avant_A_Apres": "A",
      "divisionRattachee": "ARTICLE 4",
      "articleAdditionnel": {
        "@xmlns:xsi": "http://www.w3.org/2001/XMLSchema-instance",
        "@xsi:nil": "true"
      },
      "chapitreAdditionnel": {
        "@xmlns:xsi": "http://www.w3.org/2001/XMLSchema-instance",
        "@xsi:nil": "true"
      },
      "urlDivisionTexteVise": "/15/textes/1396.asp#D_Article_4"
    },
    "alinea": {
      "avant_A_Apres": {
        "@xmlns:xsi": "http://www.w3.org/2001/XMLSchema-instance",
        "@xsi:nil": "true"
      },
      "numero": "30",
      "alineaDesignation": {
        "@xmlns:xsi": "http://www.w3.org/2001/XMLSchema-instance",
        "@xsi:nil": "true"
      }
    }
  },
  "corps": {
    "dispositif": "<p style=\"text-align: justify;\">&#192; la fin de l&#8217;alin&#233;a&#160;30, substituer aux mots&#160;:</p><p style=\"text-align: justify;\">&#171;&#160;d&#233;termin&#233; par d&#233;cret en Conseil d&#8217;&#201;tat&#160;&#187;</p><p style=\"text-align: justify;\">les mots&#160;:</p><p style=\"text-align: justify;\">&#171;&#160;de 10&#160;000&#160;euros&#160;&#187;.</p>",
    "exposeSommaire": "<p style=\"text-align: justify;\">La repr&#233;sentation obligatoire demeure, en pratique, un frein financier pour les justiciables. En effet, bien souvent, le montant des litiges en jeu en mati&#232;re de consommation sont eux-m&#234;mes plus faibles que la somme &#224; d&#233;bourser pour s&#8217;attacher les services d&#8217;un avocat. Cette difficult&#233; est renforc&#233;e d&#232;s lors qu&#8217;il s&#8217;agit de trouver un avocat en droit de la consommation n&#8217;ayant pas de clients &#171;&#160;professionnels&#160;&#187;, seul gage de l&#8217;&#233;loignement de tout risque de conflit d&#8217;int&#233;r&#234;t.</p><p style=\"text-align: justify;\">En outre, obliger les parties &#224; s&#8217;octroyer un avocat afin de faire ex&#233;cuter leur d&#233;cision pourra se r&#233;v&#233;ler contreproductif et d&#233;courager les justiciables &#224; agir pour les litiges de la vie quotidienne dont le montant est inf&#233;rieur &#224; 10&#160;000&#160;euros.</p><p style=\"text-align: justify;\">C&#8217;est pourquoi le pr&#233;sent amendement propose de remplacer le renvoi &#224; un d&#233;cret pris en Conseil d&#8217;&#201;tat par un seuil plac&#233; &#224; 10&#160;000&#160;euros, lequel correspond au seuil d&#233;terminant actuellement la comp&#233;tence entre le Tribunal d&#8217;instance et le Tribunal de grande instance et de fait, d&#233;terminant les cas o&#249; la repr&#233;sentation est obligatoire. Cette proposition est dans la lign&#233;e d&#8217;un rapport d&#8217;information d&#8217;avril 2017 du S&#233;nat intitul&#233; &#171;&#160;5 ans pour sauver la justice&#160;&#187; qui pr&#233;conisait qu&#8217;il &#233;tait &#171;&#160;n&#233;cessaire de rendre la justice plus proche et plus accessible&#160;&#187;.</p><p style=\"text-align: justify;\">&#160;</p><p style=\"text-align: justify;\">&#160;</p>",
    "annexeExposeSommaire": {
      "@xmlns:xsi": "http://www.w3.org/2001/XMLSchema-instance",
      "@xsi:nil": "true"
    },
    "cartoucheDelaiDepotDepasse": {
      "@xmlns:xsi": "http://www.w3.org/2001/XMLSchema-instance",
      "@xsi:nil": "true"
    }
  },
  "representations": {
    "representation": {
      "nom": "PDF",
      "typeMime": {
        "type": "application",
        "subType": "PDF"
      },
      "statutRepresentation": {
        "verbatim": "true",
        "canonique": "true",
        "officielle": "true",
        "transcription": "false",
        "enregistrement": "false"
      },
      "repSource": {
        "@xmlns:xsi": "http://www.w3.org/2001/XMLSchema-instance",
        "@xsi:nil": "true"
      },
      "offset": {
        "@xmlns:xsi": "http://www.w3.org/2001/XMLSchema-instance",
        "@xsi:nil": "true"
      },
      "contenu": {
        "documentURI": "/15/amendements/1396/AN/417.pdf"
      },
      "dateDispoRepresentation": {
        "@xmlns:xsi": "http://www.w3.org/2001/XMLSchema-instance",
        "@xsi:nil": "true"
      }
    }
  },
  "seanceDiscussion": "RUANR5L15S2019IDS21372",
  "sort": {
    "dateSaisie": "2018-11-21T21:46:01.000+01:00",
    "sortEnSeance": "Non soutenu"
  },
  "dateDepot": "2018-11-14T01:00:00.000+01:00",
  "dateDistribution": "2018-11-18T01:00:00.000+01:00",
  "article99": "0",
  "loiReference": {
    "codeLoi": {
      "@xmlns:xsi": "http://www.w3.org/2001/XMLSchema-instance",
      "@xsi:nil": "true"
    },
    "divisionCodeLoi": {
      "@xmlns:xsi": "http://www.w3.org/2001/XMLSchema-instance",
      "@xsi:nil": "true"
    }
  }
}