{
  "@xmlns": "http://schemas.assemblee-nationale.fr/referentiel",
  "uid": "AMANR5L15SEA717460BTC0851P0D1N256",
  "identifiant": {
    "legislature": "15",
    "numero": "256",
    "numRect": "0",
    "saisine": {
      "refTexteLegislatif": "PRJLANR5L15BTC0851",
      "numeroPartiePLF": "0",
      "organeExamen": "PO717460",
      "mentionSecondeDeliberation": "0"
    }
  },
  "numeroLong": "256",
  "etapeTexte": "1ère lecture (1ère assemblée saisie)",
  "triAmendement": "b",
  "cardinaliteAmdtMultiples": "1",
  "amendementParent": {
    "@xmlns:xsi": "http://www.w3.org/2001/XMLSchema-instance",
    "@xsi:nil": "true"
  },
  "etat": "Discuté",
  "signataires": {
    "auteur": {
      "typeAuteur": "Depute",
      "acteurRef": "PA719146",
      "organeRef": {
        "@xmlns:xsi": "http://www.w3.org/2001/XMLSchema-instance",
        "@xsi:nil": "true"
      },
      "groupePolitiqueRef": "PO723569"
    },
    "cosignataires": {
      "acteurRef": [
        "PA719286",
        "PA719146",
        "PA719138"
      ]
    },
    "texteAffichable": "M.&#160;Acquaviva,  M.&#160;Castellani et M.&#160;Colombani"
  },
  "pointeurFragmentTexte": {
    "missionVisee": {
      "@xmlns:xsi": "http://www.w3.org/2001/XMLSchema-instance",
      "@xsi:nil": "true"
    },
    "division": {
      "titre": "Article 3 quater",
      "articleDesignationCourte": "ART. 3 QUATER",
      "type": "ARTICLE",
      "avant_A_Apres": "A",
      "divisionRattachee": "ARTICLE 3 QUATER",
      "articleAdditionnel": {
        "@xmlns:xsi": "http://www.w3.org/2001/XMLSchema-instance",
        "@xsi:nil": "true"
      },
      "chapitreAdditionnel": {
        "@xmlns:xsi": "http://www.w3.org/2001/XMLSchema-instance",
        "@xsi:nil": "true"
      },
      "urlDivisionTexteVise": "/15/textes/0851.asp#D_Article_3_quater"
    },
    "alinea": {
      "@xmlns:xsi": "http://www.w3.org/2001/XMLSchema-instance",
      "@xsi:nil": "true"
    }
  },
  "corps": {
    "dispositif": "<p style=\"text-align: justify;\">R&#233;diger ainsi cet article&#160;:</p><p style=\"text-align: justify;\">&#171;&#160;Dans le cadre de l&#8217;&#233;laboration des prochains contrats de plan &#201;tat-R&#233;gions, le Gouvernement remet&#160; au Parlement&#160;un rapport pr&#233;sentant et analysant l&#8217;&#233;tat du r&#233;seau et des circulations sur les lignes les moins circul&#233;es, et tout particuli&#232;rement sur les lignes cat&#233;goris&#233;es UIC 7 &#224; 9.</p><p style=\"text-align: justify;\">&#171;&#160;Le rapport &#233;value l&#8217;opportunit&#233; d&#8217;une nouvelle cat&#233;gorisation de ces lignes, eu &#233;gard notamment &#224; leur situation actuelle et future par rapport &#224; la mise en service des nouvelles lignes de TGV.</p><p style=\"text-align: justify;\">&#171;&#160;En concertation avec les r&#233;gions concern&#233;es, le rapport &#233;tudie les possibilit&#233;s de reprise des lignes menac&#233;es par un arr&#234;t du trafic, ainsi que les moyens de substitution, dans une perspective de maintien du service public &#224; destination des usagers.&#160;&#187;</p>",
    "exposeSommaire": "<p style=\"text-align: justify;\">Afin de pr&#233;server une desserte r&#233;elle et effective des territoires ruraux et de montagne ou &#224; faible d&#233;mographie, les autorit&#233;s organisatrices en mati&#232;re de transports, en collaboration avec les r&#233;gions notamment, doivent &#233;tudier tous les moyens pour maintenir co&#251;t que co&#251;t des lignes de transport. C&#8217;est le c&#339;ur m&#234;me du service public qui doit &#234;tre l&#224; o&#249; la rentabilit&#233; n&#8217;est pas au rendez-vous.</p><p style=\"text-align: justify;\">N&#8217;oublions pas que si certaines de ces lignes sont &#171;&#160;petites&#160;&#187; en nombre de passagers, elles sont grandes en termes de services pour des personnes r&#233;sidant dans des territoires parfois &#233;loign&#233;es des centres de d&#233;cisions et des services de base qu&#8217;il faut aider.</p><p style=\"text-align: justify;\">C&#8217;est pourquoi, cet amendement propose de r&#233;&#233;crire l&#8217;article r&#233;dig&#233; par le rapporteur du projet de loi, relatif &#224; la remise d&#8217;un rapport sur l&#8217;&#233;tat du r&#233;seau et des lignes menac&#233;es de fermeture, afin que ce dernier ne se cantonne pas &#224; &#233;tablir une simple description. Mais il s&#8217;agit bien pour nous de r&#233;fl&#233;chir aux possibilit&#233;s de reprises d&#8217;exploitation ou d&#8217;&#233;ventuelles substitutions. L&#8217;amendement indique notamment l&#8217;opportunit&#233; de refondre la cat&#233;gorisation des lignes dites &#171;&#160;petites&#160;&#187; au regard notamment des nouvelles lignes de TGV. En effet, certaines d&#8217;entre elles peuvent faire l&#8217;objet d&#8217;un regain d&#8217;int&#233;r&#234;t ou pourront conna&#238;tre un avenir meilleur, eu &#233;gard aux possibilit&#233;s de correspondance qu&#8217;elles peuvent ou pourront offrir.</p><p style=\"text-align: justify;\">Enfin, l&#8217;amendement pr&#233;cise que toute cette r&#233;fl&#233;xion doit s&#8217;effectuer en &#233;troite collaboration avec les r&#233;gions.</p>",
    "annexeExposeSommaire": {
      "@xmlns:xsi": "http://www.w3.org/2001/XMLSchema-instance",
      "@xsi:nil": "true"
    }
  },
  "representations": {
    "representation": {
      "nom": "PDF",
      "typeMime": {
        "type": "application",
        "subType": "PDF"
      },
      "statutRepresentation": {
        "verbatim": "true",
        "canonique": "true",
        "officielle": "true",
        "transcription": "false",
        "enregistrement": "false"
      },
      "repSource": {
        "@xmlns:xsi": "http://www.w3.org/2001/XMLSchema-instance",
        "@xsi:nil": "true"
      },
      "offset": {
        "@xmlns:xsi": "http://www.w3.org/2001/XMLSchema-instance",
        "@xsi:nil": "true"
      },
      "contenu": {
        "documentURI": "/15/amendements/0851/AN/256.pdf"
      },
      "dateDispoRepresentation": {
        "@xmlns:xsi": "http://www.w3.org/2001/XMLSchema-instance",
        "@xsi:nil": "true"
      }
    }
  },
  "seanceDiscussion": "RUANR5L15S2018IDS20994",
  "sort": {
    "dateSaisie": "2018-04-11T23:11:52.000+02:00",
    "sortEnSeance": "Rejeté"
  },
  "dateDepot": "2018-04-06T02:00:00.000+02:00",
  "dateDistribution": "2018-04-09T02:00:00.000+02:00",
  "article99": "0",
  "loiReference": {
    "codeLoi": {
      "@xmlns:xsi": "http://www.w3.org/2001/XMLSchema-instance",
      "@xsi:nil": "true"
    },
    "divisionCodeLoi": {
      "@xmlns:xsi": "http://www.w3.org/2001/XMLSchema-instance",
      "@xsi:nil": "true"
    }
  }
}