{
  "@xmlns": "http://schemas.assemblee-nationale.fr/referentiel",
  "uid": "AMANR5L15SEA717460B1255P2D1N2504",
  "identifiant": {
    "legislature": "15",
    "numero": "2504",
    "numRect": "0",
    "saisine": {
      "refTexteLegislatif": "PRJLANR5L15B1255",
      "numeroPartiePLF": "2",
      "organeExamen": "PO717460",
      "mentionSecondeDeliberation": "0"
    }
  },
  "numeroLong": "II-2504",
  "etapeTexte": "1ère lecture (1ère assemblée saisie)",
  "triAmendement": "esaaaaaaaaaaaaaaaaaaaaaaaaaaaaaaaaaaaaaaaaaaaaaaaabds",
  "cardinaliteAmdtMultiples": "1",
  "amendementParent": {
    "@xmlns:xsi": "http://www.w3.org/2001/XMLSchema-instance",
    "@xsi:nil": "true"
  },
  "etat": "Retiré",
  "signataires": {
    "auteur": {
      "typeAuteur": "Depute",
      "acteurRef": "PA721094",
      "organeRef": {
        "@xmlns:xsi": "http://www.w3.org/2001/XMLSchema-instance",
        "@xsi:nil": "true"
      },
      "groupePolitiqueRef": "PO744425"
    },
    "cosignataires": {
      "acteurRef": [
        "PA642868",
        "PA331582",
        "PA267780",
        "PA721194",
        "PA718780",
        "PA702054",
        "PA755549",
        "PA721062",
        "PA695100",
        "PA720968",
        "PA712014",
        "PA268019",
        "PA266774",
        "PA702052",
        "PA267585",
        "PA267355",
        "PA719806",
        "PA332228",
        "PA421348",
        "PA335758",
        "PA266788",
        "PA720960",
        "PA721094",
        "PA718978",
        "PA267901",
        "PA721110",
        "PA266797",
        "PA1960",
        "PA720696",
        "PA721054",
        "PA721118",
        "PA721012",
        "PA721486",
        "PA331567",
        "PA337483",
        "PA2952",
        "PA267330",
        "PA721046",
        "PA721286",
        "PA720230",
        "PA720976",
        "PA722030",
        "PA267241",
        "PA610681",
        "PA721070",
        "PA610667",
        "PA267766",
        "PA610775",
        "PA642935",
        "PA721126"
      ]
    },
    "texteAffichable": "M.&#160;Dunoyer,  M.&#160;Gom&#232;s, Mme&#160;Auconie, M.&#160;Becht, M.&#160;Benoit, M.&#160;Bournazel, M.&#160;Guy&#160;Bricout, M.&#160;Christophe, Mme&#160;de La Raudi&#232;re, M.&#160;Demilly, Mme&#160;Descamps, Mme&#160;Fr&#233;d&#233;rique&#160;Dumas, Mme&#160;Firmin Le Bodo, M.&#160;Meyer&#160;Habib, M.&#160;Herth, M.&#160;Lagarde, M.&#160;Ledoux, M.&#160;Leroy, Mme&#160;Magnier, M.&#160;Morel-&#192;-L&apos;Huissier, M.&#160;Naegelen, M.&#160;Riester, Mme&#160;Sage, Mme&#160;Sanquer, M.&#160;Vercamer, M.&#160;Villiers, M.&#160;Warsmann, M.&#160;Zumkeller, M.&#160;Serva, Mme&#160;Bareigts, Mme&#160;Bassire, Mme&#160;Benin, M.&#160;Brial, M.&#160;Brotherson, M.&#160;Claireaux, M.&#160;Furst, M.&#160;Gosselin, Mme&#160;Guion-Firmin, M.&#160;Kamardine, Mme&#160;K&#233;clard-Mond&#233;sir, M.&#160;Laqhila, M.&#160;Letchimy, M.&#160;Lorion, M.&#160;Mathiasin, M.&#160;Ramadier, Mme&#160;Ramassamy, M.&#160;Ratenon, M.&#160;Serville, Mme&#160;Trastour-Isnart et M.&#160;Philippe&#160;Vigier"
  },
  "pointeurFragmentTexte": {
    "missionVisee": {
      "@xmlns:xsi": "http://www.w3.org/2001/XMLSchema-instance",
      "@xsi:nil": "true"
    },
    "division": {
      "titre": "Article 55",
      "articleDesignationCourte": "ART. 55",
      "type": "ARTICLE",
      "avant_A_Apres": "A",
      "divisionRattachee": "ARTICLE 55",
      "articleAdditionnel": {
        "@xmlns:xsi": "http://www.w3.org/2001/XMLSchema-instance",
        "@xsi:nil": "true"
      },
      "chapitreAdditionnel": {
        "@xmlns:xsi": "http://www.w3.org/2001/XMLSchema-instance",
        "@xsi:nil": "true"
      },
      "urlDivisionTexteVise": "/15/textes/1255C.asp#D_Article_55"
    },
    "alinea": {
      "avant_A_Apres": {
        "@xmlns:xsi": "http://www.w3.org/2001/XMLSchema-instance",
        "@xsi:nil": "true"
      },
      "numero": "27",
      "alineaDesignation": {
        "@xmlns:xsi": "http://www.w3.org/2001/XMLSchema-instance",
        "@xsi:nil": "true"
      }
    }
  },
  "corps": {
    "dispositif": "<p>Apr&#232;s l&#8217;alin&#233;a&#160;27, ins&#233;rer l&#8217;alin&#233;a suivant&#160;:</p><p style=\"text-align: justify;\">&#171;&#160;2&#176;&#160;<i>bis</i> Le 6&#176; est compl&#233;t&#233; par les mots&#160;: &#171;&#160;et &#224; ce titre, ne pas exercer directement ou indirectement par l&#8217;un de ses dirigeants ou associ&#233;s une profession r&#233;glement&#233;e telle qu&#8217;avocat, commissaire aux comptes, expert-comptable, huissier de justice ou notaire.&#160;&#187;</p>",
    "exposeSommaire": "<p style=\"text-align: justify;\">L&#8217;activit&#233; de monteur en d&#233;fiscalisation a &#233;t&#233; progressivement encadr&#233;e depuis la Loi de Finances pour 2011, de fa&#231;on &#224; moraliser l&#8217;application des dispositifs d&#8217;aide &#224; l&#8217;investissement outre-mer et apporter une plus grande s&#233;curit&#233; aux investisseurs et aux tiers.</p><p style=\"text-align: justify;\">Le pr&#233;sent amendement a pour objet de d&#233;finir de fa&#231;on plus pr&#233;cise la nature des assurances en mati&#232;re de responsabilit&#233; professionnelle exig&#233;es aupr&#232;s des monteurs en d&#233;fiscalisation et d&#8217;interdire l&#8217;exercice direct ou indirect de l&#8217;activit&#233; de montage d&#8217;op&#233;rations en d&#233;fiscalisation par&#160;des personnes appartenant &#224; des professions incompatibles et r&#233;glement&#233;es telles qu&#8217;avocat, commissaire aux comptes, expert-comptable, huissier de justice ou notaire.&#160;</p><p style=\"text-align: justify;\">Les dispositifs d&#8217;aide &#224; l&#8217;investissement outre-mer ayant &#233;t&#233; prolong&#233;s jusqu&#8217;en 2025, il convient de poursuivre les efforts de moralisation entrepris de fa&#231;on &#224; en permettre une application toujours plus vertueuse et mieux contr&#244;l&#233;e.</p>",
    "annexeExposeSommaire": {
      "@xmlns:xsi": "http://www.w3.org/2001/XMLSchema-instance",
      "@xsi:nil": "true"
    },
    "cartoucheDelaiDepotDepasse": {
      "@xmlns:xsi": "http://www.w3.org/2001/XMLSchema-instance",
      "@xsi:nil": "true"
    }
  },
  "representations": {
    "representation": {
      "nom": "PDF",
      "typeMime": {
        "type": "application",
        "subType": "PDF"
      },
      "statutRepresentation": {
        "verbatim": "true",
        "canonique": "true",
        "officielle": "true",
        "transcription": "false",
        "enregistrement": "false"
      },
      "repSource": {
        "@xmlns:xsi": "http://www.w3.org/2001/XMLSchema-instance",
        "@xsi:nil": "true"
      },
      "offset": {
        "@xmlns:xsi": "http://www.w3.org/2001/XMLSchema-instance",
        "@xsi:nil": "true"
      },
      "contenu": {
        "documentURI": "/15/amendements/1255C/AN/2504.pdf"
      },
      "dateDispoRepresentation": {
        "@xmlns:xsi": "http://www.w3.org/2001/XMLSchema-instance",
        "@xsi:nil": "true"
      }
    }
  },
  "seanceDiscussion": {
    "@xmlns:xsi": "http://www.w3.org/2001/XMLSchema-instance",
    "@xsi:nil": "true"
  },
  "sort": {
    "@xmlns:xsi": "http://www.w3.org/2001/XMLSchema-instance",
    "@xsi:nil": "true"
  },
  "dateDepot": "2018-11-12T01:00:00.000+01:00",
  "dateDistribution": "2018-11-15T01:00:00.000+01:00",
  "article99": "0",
  "loiReference": {
    "codeLoi": {
      "@xmlns:xsi": "http://www.w3.org/2001/XMLSchema-instance",
      "@xsi:nil": "true"
    },
    "divisionCodeLoi": {
      "@xmlns:xsi": "http://www.w3.org/2001/XMLSchema-instance",
      "@xsi:nil": "true"
    }
  }
}