{
  "@xmlns": "http://schemas.assemblee-nationale.fr/referentiel",
  "uid": "AMANR5L15SEA717460BTC1600P0D1N157",
  "identifiant": {
    "legislature": "15",
    "numero": "157",
    "numRect": "0",
    "saisine": {
      "refTexteLegislatif": "PIONANR5L15BTC1600",
      "numeroPartiePLF": "0",
      "organeExamen": "PO717460",
      "mentionSecondeDeliberation": "0"
    }
  },
  "numeroLong": "157",
  "etapeTexte": "1ère lecture (2ème assemblée saisie)",
  "triAmendement": "diaaaaaaaaaaaaaaaaaaaaaaaaaaaaaaaaaaaaaaaaaaaaaaaais",
  "cardinaliteAmdtMultiples": "1",
  "amendementParent": {
    "@xmlns:xsi": "http://www.w3.org/2001/XMLSchema-instance",
    "@xsi:nil": "true"
  },
  "etat": "Discuté",
  "signataires": {
    "auteur": {
      "typeAuteur": "Depute",
      "acteurRef": "PA721262",
      "organeRef": {
        "@xmlns:xsi": "http://www.w3.org/2001/XMLSchema-instance",
        "@xsi:nil": "true"
      },
      "groupePolitiqueRef": "PO730964"
    },
    "cosignataires": {
      "acteurRef": "PA721262"
    },
    "texteAffichable": "M.&#160;Vuilletet"
  },
  "pointeurFragmentTexte": {
    "missionVisee": {
      "@xmlns:xsi": "http://www.w3.org/2001/XMLSchema-instance",
      "@xsi:nil": "true"
    },
    "division": {
      "titre": "Article 3 bis",
      "articleDesignationCourte": "APRÈS ART. 3 BIS",
      "type": "ARTICLE",
      "avant_A_Apres": "Après",
      "divisionRattachee": "APRÈS L'ARTICLE 3 BIS, insérer l'article suivant:",
      "articleAdditionnel": "1",
      "chapitreAdditionnel": {
        "@xmlns:xsi": "http://www.w3.org/2001/XMLSchema-instance",
        "@xsi:nil": "true"
      },
      "urlDivisionTexteVise": "/15/textes/1600.asp#D_Article_3_bis"
    },
    "alinea": {
      "@xmlns:xsi": "http://www.w3.org/2001/XMLSchema-instance",
      "@xsi:nil": "true"
    }
  },
  "corps": {
    "dispositif": "<p style=\"text-align: justify;\">Le chapitre II du titre V du livre II du code de la s&#233;curit&#233; int&#233;rieure est compl&#233;t&#233; par un article&#160;L.&#160;252&#8209;8 ainsi r&#233;dig&#233;&#160;:</p><p style=\"text-align: justify;\">&#171;&#160;<i>Art.&#160;L.&#160;252&#8209;8</i>.&#160;&#8211;&#160;Lorsqu&#8217;il est inform&#233; de la tenue imminente d&#8217;une manifestation ou d&#8217;un rassemblement de grande ampleur pr&#233;sentant des risques particuliers d&#8217;atteinte &#224; la s&#233;curit&#233; des personnes et des biens, le repr&#233;sentant de l&#8217;&#201;tat dans le d&#233;partement et, &#224; Paris, le pr&#233;fet de police, peuvent conf&#233;rer, par arr&#234;t&#233;, l&#8217;autorisation aux forces de l&#8217;ordre comp&#233;tentes de faire usage, en temps r&#233;el, des syst&#232;mes de vid&#233;osurveillance g&#233;r&#233;s par les autorit&#233;s locales.</p><p style=\"text-align: justify;\">&#171;&#160;L&#8217;arr&#234;t&#233; pr&#233;fectoral est limit&#233; dans le temps.&#160;&#187;</p>",
    "exposeSommaire": "<p style=\"text-align: justify;\">Une grande partie des r&#233;seaux de t&#233;l&#233;-surveillance est aujourd&#8217;hui g&#233;r&#233;e par les collectivit&#233;s locales. Cet amendement vise &#224; renforcer les pr&#233;rogatives des autorit&#233;s comp&#233;tentes en mati&#232;re de pr&#233;vention des troubles &#224; l&#8217;ordre public. Il s&#8217;agit de leur conf&#233;rer, par arr&#234;t&#233;, l&#8217;autorisation de faire usage des syst&#232;mes de vid&#233;osurveillance en temps r&#233;el g&#233;r&#233;s par les autorit&#233;s locales dans le cadre, par exemple, de pr&#233;vention d&#8217;une manifestation non autoris&#233;e et/ou &#224; risques.</p>",
    "annexeExposeSommaire": {
      "@xmlns:xsi": "http://www.w3.org/2001/XMLSchema-instance",
      "@xsi:nil": "true"
    },
    "cartoucheDelaiDepotDepasse": {
      "@xmlns:xsi": "http://www.w3.org/2001/XMLSchema-instance",
      "@xsi:nil": "true"
    }
  },
  "representations": {
    "representation": {
      "nom": "PDF",
      "typeMime": {
        "type": "application",
        "subType": "PDF"
      },
      "statutRepresentation": {
        "verbatim": "true",
        "canonique": "true",
        "officielle": "true",
        "transcription": "false",
        "enregistrement": "false"
      },
      "repSource": {
        "@xmlns:xsi": "http://www.w3.org/2001/XMLSchema-instance",
        "@xsi:nil": "true"
      },
      "offset": {
        "@xmlns:xsi": "http://www.w3.org/2001/XMLSchema-instance",
        "@xsi:nil": "true"
      },
      "contenu": {
        "documentURI": "/15/amendements/1600/AN/157.pdf"
      },
      "dateDispoRepresentation": {
        "@xmlns:xsi": "http://www.w3.org/2001/XMLSchema-instance",
        "@xsi:nil": "true"
      }
    }
  },
  "seanceDiscussion": "RUANR5L15S2019IDS21470",
  "sort": {
    "dateSaisie": "2019-01-30T23:34:23.000+01:00",
    "sortEnSeance": "Retiré"
  },
  "dateDepot": "2019-01-25T01:00:00.000+01:00",
  "dateDistribution": "2019-01-28T01:00:00.000+01:00",
  "article99": "0",
  "loiReference": {
    "codeLoi": "c sécurité intérieure",
    "divisionCodeLoi": "L252-8"
  }
}