{
  "@xmlns": "http://schemas.assemblee-nationale.fr/referentiel",
  "uid": "AMANR5L15SEA717460BTC1629P0D1N1121",
  "identifiant": {
    "legislature": "15",
    "numero": "1121",
    "numRect": "0",
    "saisine": {
      "refTexteLegislatif": "PRJLANR5L15BTC1629",
      "numeroPartiePLF": "0",
      "organeExamen": "PO717460",
      "mentionSecondeDeliberation": "0"
    }
  },
  "numeroLong": "1121",
  "etapeTexte": "1ère lecture (1ère assemblée saisie)",
  "triAmendement": "aoaaaaaaaaaaaaaaaaaaaaaaaaaaaaaaaaaaaaaaaaaaaaaaaagrb",
  "cardinaliteAmdtMultiples": "1",
  "amendementParent": {
    "@xmlns:xsi": "http://www.w3.org/2001/XMLSchema-instance",
    "@xsi:nil": "true"
  },
  "etat": "Discuté",
  "signataires": {
    "auteur": {
      "typeAuteur": "Rapporteur",
      "acteurRef": "PA643205",
      "organeRef": "PO419604",
      "groupePolitiqueRef": "PO730964"
    },
    "cosignataires": {
      "acteurRef": "PA643205"
    },
    "texteAffichable": "Mme&#160;Lang, rapporteure au nom de la commission des affaires culturelles et de l&apos;&#233;ducation"
  },
  "pointeurFragmentTexte": {
    "missionVisee": {
      "@xmlns:xsi": "http://www.w3.org/2001/XMLSchema-instance",
      "@xsi:nil": "true"
    },
    "division": {
      "titre": "Article 3",
      "articleDesignationCourte": "ART. 3",
      "type": "ARTICLE",
      "avant_A_Apres": "A",
      "divisionRattachee": "ARTICLE 3",
      "articleAdditionnel": {
        "@xmlns:xsi": "http://www.w3.org/2001/XMLSchema-instance",
        "@xsi:nil": "true"
      },
      "chapitreAdditionnel": {
        "@xmlns:xsi": "http://www.w3.org/2001/XMLSchema-instance",
        "@xsi:nil": "true"
      },
      "urlDivisionTexteVise": "/15/textes/1629.asp#D_Article_3"
    },
    "alinea": {
      "avant_A_Apres": "Apres",
      "numero": "2",
      "alineaDesignation": {
        "@xmlns:xsi": "http://www.w3.org/2001/XMLSchema-instance",
        "@xsi:nil": "true"
      }
    }
  },
  "corps": {
    "dispositif": "<p style=\"text-align: justify;\">Apr&#232;s l&#8217;alin&#233;a&#160;2, ins&#233;rer les deux alin&#233;as suivants&#160;:</p><p style=\"text-align: justify;\">&#171;&#160;1&#176; <i>bis</i> Le m&#234;me article est compl&#233;t&#233; par un alin&#233;a ainsi r&#233;dig&#233;&#160;:</p><p style=\"text-align: justify;\">&#171;&#160;Afin d&#8217;acqu&#233;rir une expertise et une culture communes et dans le cadre de l&#8217;accomplissement de leurs fonctions, l&#8217;ensemble des professionnels intervenant aupr&#232;s d&#8217;enfants de moins de six ans b&#233;n&#233;ficient de modules de formation continue communs dans les conditions d&#233;finies aux articles L.&#160;6111&#8209;1 et L.&#160;6311&#8209;1 du code du travail et peuvent demander &#224; faire valider l&#8217;exp&#233;rience acquise dans les conditions d&#233;finies aux articles L.&#160;6411&#8209;1 et L.&#160;6422&#8209;1 du m&#234;me code, en vue de l&#8217;obtention d&#8217;un dipl&#244;me national ou d&#8217;un titre professionnel enregistr&#233; et class&#233; au niveau III ou au niveau IV du r&#233;pertoire national des certifications professionnelles. Le contenu de ces modules et les modalit&#233;s de cette validation sont fix&#233;s par d&#233;cret.&#160;&#187;</p>",
    "exposeSommaire": "<p style=\"text-align: justify;\">Cet amendement vise &#224; pr&#233;voir des modules de formation communs et obligatoires pour les 600 000 professionnels qui interviennent aupr&#232;s d&#8217;enfants de moins de six ans, et &#224; favoriser leur mobilit&#233; professionnelle &#224; travers la formation continue et la validation des acquis de l&#8217;exp&#233;rience. Il transcrit ainsi l&#8217;objectif 3 de l&#8217;engagement n&#176; 1 de la strat&#233;gie nationale de pr&#233;vention et de lutte contre la pauvret&#233;, publi&#233;e en septembre 2018, visant &#224; am&#233;liorer la qualit&#233; &#233;ducative des modes d&#8217;accueil du jeune enfant.</p><p style=\"text-align: justify;\">Il s&#8217;agit, tout d&#8217;abord, de cr&#233;er une culture commune &#224; ces professionnels dans l&#8217;ensemble des domaines int&#233;ressant le jeune enfant afin de cr&#233;er un continuum &#233;ducatif sur toute cette tranche d&#8217;&#226;ge. Cela permettra, en particulier, de favoriser la pr&#233;vention en mati&#232;re de sant&#233; et le rep&#233;rage pr&#233;coce des troubles de l&#8217;apprentissage et des situations de handicap.</p><p style=\"text-align: justify;\">Il s&#8217;agit &#233;galement de favoriser les parcours professionnels de ces personnels, en leur permettant de circuler plus facilement d&#8217;une profession li&#233;e &#224; la petite enfance &#224; une autre.</p><p style=\"text-align: justify;\">Il conviendra de soumettre le contenu de ce socle et de ces modules de formation communs et ces modalit&#233;s de validation des acquis de l&#8217;exp&#233;rience aux professionnels de la petite enfance, en particulier l&#8217;Institut Petite enfance, qui a d&#233;velopp&#233; une expertise importante dans ce domaine.</p>",
    "annexeExposeSommaire": {
      "@xmlns:xsi": "http://www.w3.org/2001/XMLSchema-instance",
      "@xsi:nil": "true"
    },
    "cartoucheDelaiDepotDepasse": {
      "@xmlns:xsi": "http://www.w3.org/2001/XMLSchema-instance",
      "@xsi:nil": "true"
    }
  },
  "representations": {
    "representation": {
      "nom": "PDF",
      "typeMime": {
        "type": "application",
        "subType": "PDF"
      },
      "statutRepresentation": {
        "verbatim": "true",
        "canonique": "true",
        "officielle": "true",
        "transcription": "false",
        "enregistrement": "false"
      },
      "repSource": {
        "@xmlns:xsi": "http://www.w3.org/2001/XMLSchema-instance",
        "@xsi:nil": "true"
      },
      "offset": {
        "@xmlns:xsi": "http://www.w3.org/2001/XMLSchema-instance",
        "@xsi:nil": "true"
      },
      "contenu": {
        "documentURI": "/15/amendements/1629/AN/1121.pdf"
      },
      "dateDispoRepresentation": {
        "@xmlns:xsi": "http://www.w3.org/2001/XMLSchema-instance",
        "@xsi:nil": "true"
      }
    }
  },
  "seanceDiscussion": "RUANR5L15S2019IDS21502",
  "sort": {
    "dateSaisie": "2019-02-14T00:01:26.000+01:00",
    "sortEnSeance": "Adopté"
  },
  "dateDepot": "2019-02-12T01:00:00.000+01:00",
  "dateDistribution": "2019-02-13T01:00:00.000+01:00",
  "article99": "1",
  "loiReference": {
    "codeLoi": {
      "@xmlns:xsi": "http://www.w3.org/2001/XMLSchema-instance",
      "@xsi:nil": "true"
    },
    "divisionCodeLoi": {
      "@xmlns:xsi": "http://www.w3.org/2001/XMLSchema-instance",
      "@xsi:nil": "true"
    }
  }
}