{
  "@xmlns": "http://schemas.assemblee-nationale.fr/referentiel",
  "uid": "AMANR5L15SEA717460BTC1767P0D1N722",
  "identifiant": {
    "legislature": "15",
    "numero": "722",
    "numRect": "0",
    "saisine": {
      "refTexteLegislatif": "PRJLANR5L15BTC1767",
      "numeroPartiePLF": "0",
      "organeExamen": "PO717460",
      "mentionSecondeDeliberation": "0"
    }
  },
  "numeroLong": "722",
  "etapeTexte": "1ère lecture (1ère assemblée saisie)",
  "triAmendement": "buaaaaaaaaaaaaaaaaaaaaaaaaaaaaaaaaaaaaaaaaaaaaaaaabskbs",
  "cardinaliteAmdtMultiples": "1",
  "amendementParent": {
    "@xmlns:xsi": "http://www.w3.org/2001/XMLSchema-instance",
    "@xsi:nil": "true"
  },
  "etat": "Discuté",
  "signataires": {
    "auteur": {
      "typeAuteur": "Depute",
      "acteurRef": "PA722374",
      "organeRef": {
        "@xmlns:xsi": "http://www.w3.org/2001/XMLSchema-instance",
        "@xsi:nil": "true"
      },
      "groupePolitiqueRef": "PO730970"
    },
    "cosignataires": {
      "acteurRef": [
        "PA721418",
        "PA720764",
        "PA719874",
        "PA722284",
        "PA720720",
        "PA719504",
        "PA721234",
        "PA721734",
        "PA720178",
        "PA720772",
        "PA720746",
        "PA720092",
        "PA720652",
        "PA721182",
        "PA720924",
        "PA721924",
        "PA720598",
        "PA719558",
        "PA719044",
        "PA719640",
        "PA718978",
        "PA720728",
        "PA720334",
        "PA720002",
        "PA722374",
        "PA1276",
        "PA720968",
        "PA721742",
        "PA719488",
        "PA721608",
        "PA721984",
        "PA721976",
        "PA720704",
        "PA719918",
        "PA722162",
        "PA720162",
        "PA717151",
        "PA719210",
        "PA720326",
        "PA721992",
        "PA721530",
        "PA720256",
        "PA719266",
        "PA720976",
        "PA721836",
        "PA719942"
      ]
    },
    "texteAffichable": "M.&#160;Isaac-Sibille,  Mme&#160;Benin, Mme&#160;de Vaucouleurs, Mme&#160;Elimas, M.&#160;Hammouche, M.&#160;Mignola, M.&#160;Balanant, Mme&#160;Bannier, M.&#160;Barrot, M.&#160;Baudu, M.&#160;Berta, M.&#160;Bolo, M.&#160;Bourlanges, M.&#160;Bru, M.&#160;Cubertafon, Mme&#160;de Sarnez, Mme&#160;Deprez-Audebert, M.&#160;Duverg&#233;, Mme&#160;El Ha&#239;ry, Mme&#160;Essayan, M.&#160;Fanget, Mme&#160;Florennes, M.&#160;Fuchs, Mme&#160;Gallerneau, M.&#160;Garcia, Mme&#160;Jacquier-Laforge, M.&#160;Joncour, M.&#160;Lagleize, M.&#160;Lain&#233;, M.&#160;Laqhila, Mme&#160;Lasserre-David, M.&#160;Latombe, Mme&#160;Luquet, M.&#160;Mathiasin, M.&#160;Mattei, Mme&#160;Mette, M.&#160;Michel-Kleisbauer, M.&#160;Millienne, M.&#160;Pahun, M.&#160;Fr&#233;d&#233;ric&#160;Petit, Mme&#160;Maud&#160;Petit, Mme&#160;Poueyto, M.&#160;Ramos, M.&#160;Turquois, Mme&#160;Vichnievsky et M.&#160;Waserman"
  },
  "pointeurFragmentTexte": {
    "missionVisee": {
      "@xmlns:xsi": "http://www.w3.org/2001/XMLSchema-instance",
      "@xsi:nil": "true"
    },
    "division": {
      "titre": "Article 7",
      "articleDesignationCourte": "ART. 7",
      "type": "ARTICLE",
      "avant_A_Apres": "A",
      "divisionRattachee": "ARTICLE 7",
      "articleAdditionnel": {
        "@xmlns:xsi": "http://www.w3.org/2001/XMLSchema-instance",
        "@xsi:nil": "true"
      },
      "chapitreAdditionnel": {
        "@xmlns:xsi": "http://www.w3.org/2001/XMLSchema-instance",
        "@xsi:nil": "true"
      },
      "urlDivisionTexteVise": "/15/textes/1767.asp#D_Article_7"
    },
    "alinea": {
      "avant_A_Apres": {
        "@xmlns:xsi": "http://www.w3.org/2001/XMLSchema-instance",
        "@xsi:nil": "true"
      },
      "numero": "22",
      "alineaDesignation": {
        "@xmlns:xsi": "http://www.w3.org/2001/XMLSchema-instance",
        "@xsi:nil": "true"
      }
    }
  },
  "corps": {
    "dispositif": "<p>I. &#8211; &#192; la fin de l&#8217;alin&#233;a&#160;22, substituer aux mots&#160;:</p><p style=\"text-align: justify;\">&#171;&#160;pour approbation&#160;&#187;</p><p style=\"text-align: justify;\">les mots&#160;:</p><p style=\"text-align: justify;\">&#171;&#160;qui l&#8217;enregistre&#160;&#187;.</p><p style=\"text-align: justify;\">II. &#8211;En cons&#233;quence, r&#233;diger ainsi l&#8217;alin&#233;a&#160;23&#160;:</p><p style=\"text-align: justify;\">&#171;&#160;<i>b)</i> L&#8217;avant&#8209;dernier alin&#233;a est compl&#233;t&#233; par les mots&#160;:&#160;&#171;&#160;dont la coh&#233;rence est approuv&#233;e par le directeur g&#233;n&#233;ral de l&#8217;agence r&#233;gionale de sant&#233; au regard des territoires des autres communaut&#233;s professionnelles territoriales de sant&#233; enregistr&#233;es&#160;&#187;&#160;;&#160;&#187;.</p>",
    "exposeSommaire": "<p>Le pr&#233;sent amendement vise &#224; pr&#233;ciser que l&#8217;approbation du directeur g&#233;n&#233;ral de l&#8217;agence r&#233;gional de sant&#233; du projet de sant&#233; port&#233; par la CPTS doit se faire au regard des autres territoires des CPTS enregistr&#233;es.</p><p style=\"text-align: justify;\">En effet, il est important que les territoires des CPTS se compl&#232;tent sans se concurrencer. Ainsi, une approbation &#224; cet &#233;gard est n&#233;cessaire et l&#233;gitime.</p><p style=\"text-align: justify;\">Toutefois, l&#8217;approbation au sens large, tel que le pr&#233;voit l&#8217;article&#160;7, est d&#233;j&#224; implicitement pr&#233;vue &#224; l&#8217;article L.&#160;1434&#8209;12, premier alin&#233;a, du code de la sant&#233; publique qui pr&#233;cise que les CPTS doivent concourir &#224; &#171;&#160;la r&#233;alisation des objectifs du projet r&#233;gional de sant&#233;&#160;&#187;. C&#8217;est pourquoi, le pr&#233;sent amendement pr&#233;cise qu&#8217;un simple enregistrement du projet de sant&#233; r&#233;pond parfaitement &#224; cet objectif de coh&#233;rence du projet de sant&#233; vis &#224; vis du projet r&#233;gional de sant&#233; et all&#232;ge le dispositif pr&#233;vu par cet article&#160;7.</p><p style=\"text-align: justify;\">All&#233;ger le disposition tout en veillant &#224; la coh&#233;rence des CPTS sur un territoire est primordial pour &#233;viter de mettre en p&#233;ril la Constitution de CPTS par les professionnels de sant&#233;, qui doit rester &#224; leur initiative, comme le pr&#233;cise la mission IGAS 2018 &#171;&#160;d&#233;ploiement des communaut&#233;s professionnelles territoriales de sant&#233;&#160;&#187;.</p><p style=\"text-align: justify;\">L&#8217;amendement pr&#233;cise ainsi que le r&#244;le des ARS doit se limiter &#224; une v&#233;rification de coh&#233;rence territoriale des projets de sant&#233;, et non pas &#224; une approbation, qui complexifierait la mise en &#339;uvre des initiatives locales.</p>",
    "annexeExposeSommaire": {
      "@xmlns:xsi": "http://www.w3.org/2001/XMLSchema-instance",
      "@xsi:nil": "true"
    },
    "cartoucheDelaiDepotDepasse": {
      "@xmlns:xsi": "http://www.w3.org/2001/XMLSchema-instance",
      "@xsi:nil": "true"
    }
  },
  "representations": {
    "representation": {
      "nom": "PDF",
      "typeMime": {
        "type": "application",
        "subType": "PDF"
      },
      "statutRepresentation": {
        "verbatim": "true",
        "canonique": "true",
        "officielle": "true",
        "transcription": "false",
        "enregistrement": "false"
      },
      "repSource": {
        "@xmlns:xsi": "http://www.w3.org/2001/XMLSchema-instance",
        "@xsi:nil": "true"
      },
      "offset": {
        "@xmlns:xsi": "http://www.w3.org/2001/XMLSchema-instance",
        "@xsi:nil": "true"
      },
      "contenu": {
        "documentURI": "/15/amendements/1767/AN/722.pdf"
      },
      "dateDispoRepresentation": {
        "@xmlns:xsi": "http://www.w3.org/2001/XMLSchema-instance",
        "@xsi:nil": "true"
      }
    }
  },
  "seanceDiscussion": "RUANR5L15S2019IDS21563",
  "sort": {
    "dateSaisie": "2019-03-21T18:19:36.000+01:00",
    "sortEnSeance": "Rejeté"
  },
  "dateDepot": "2019-03-15T01:00:00.000+01:00",
  "dateDistribution": "2019-03-18T01:00:00.000+01:00",
  "article99": "0",
  "loiReference": {
    "codeLoi": {
      "@xmlns:xsi": "http://www.w3.org/2001/XMLSchema-instance",
      "@xsi:nil": "true"
    },
    "divisionCodeLoi": {
      "@xmlns:xsi": "http://www.w3.org/2001/XMLSchema-instance",
      "@xsi:nil": "true"
    }
  }
}