{
  "@xmlns": "http://schemas.assemblee-nationale.fr/referentiel",
  "uid": "AMANR5L15PO419865B2135P0D1N32",
  "identifiant": {
    "legislature": "15",
    "numero": "32",
    "numRect": "0",
    "saisine": {
      "refTexteLegislatif": "PRJLANR5L15B2135",
      "numeroPartiePLF": "0",
      "organeExamen": "PO419865",
      "mentionSecondeDeliberation": "0"
    }
  },
  "numeroLong": "CD32",
  "etapeTexte": "Nouvelle Lecture",
  "triAmendement": "aicaaaaaaaaaaaaaaaaaaaaaaaaaaaaaaaaaaaaaaaaaaaaaaabo",
  "cardinaliteAmdtMultiples": "1",
  "amendementParent": {
    "@xmlns:xsi": "http://www.w3.org/2001/XMLSchema-instance",
    "@xsi:nil": "true"
  },
  "etat": "Discuté",
  "signataires": {
    "auteur": {
      "typeAuteur": "Depute",
      "acteurRef": "PA330909",
      "organeRef": {
        "@xmlns:xsi": "http://www.w3.org/2001/XMLSchema-instance",
        "@xsi:nil": "true"
      },
      "groupePolitiqueRef": "PO730934"
    },
    "cosignataires": {
      "acteurRef": [
        "PA709315",
        "PA266793",
        "PA712015",
        "PA720386",
        "PA607090",
        "PA1012",
        "PA720210",
        "PA718838",
        "PA267204",
        "PA721314",
        "PA722390",
        "PA642847",
        "PA606712",
        "PA608416",
        "PA721816",
        "PA718884",
        "PA267260",
        "PA340853",
        "PA334654",
        "PA719318",
        "PA267735",
        "PA720586",
        "PA266776",
        "PA330909",
        "PA721968",
        "PA643134"
      ]
    },
    "texteAffichable": "M.&#160;Descoeur,  M.&#160;Sermier, M.&#160;Schellenberger, Mme&#160;Bazin-Malgras, Mme&#160;Anthoine, Mme&#160;Poletti, Mme&#160;Beauvais, M.&#160;Lurton, M.&#160;Vialay, M.&#160;Hetzel, M.&#160;Brun, Mme&#160;Corneloup, M.&#160;Straumann, M.&#160;Reiss, Mme&#160;Valentin, M.&#160;Dive, M.&#160;Boucard, M.&#160;Vatin, M.&#160;de la Verpilli&#232;re, M.&#160;de Ganay, M.&#160;Di Filippo, M.&#160;Jean-Pierre&#160;Vigier, M.&#160;Leclerc, M.&#160;Bony, M.&#160;Bazin et M.&#160;Viala"
  },
  "pointeurFragmentTexte": {
    "missionVisee": {
      "@xmlns:xsi": "http://www.w3.org/2001/XMLSchema-instance",
      "@xsi:nil": "true"
    },
    "division": {
      "titre": "Article 2",
      "articleDesignationCourte": "ART. 2",
      "type": "ARTICLE",
      "avant_A_Apres": "A",
      "divisionRattachee": "ARTICLE 2",
      "articleAdditionnel": {
        "@xmlns:xsi": "http://www.w3.org/2001/XMLSchema-instance",
        "@xsi:nil": "true"
      },
      "chapitreAdditionnel": {
        "@xmlns:xsi": "http://www.w3.org/2001/XMLSchema-instance",
        "@xsi:nil": "true"
      },
      "urlDivisionTexteVise": "/15/textes/2135.asp#D_Article_2"
    },
    "alinea": {
      "avant_A_Apres": "Apres",
      "numero": "20",
      "alineaDesignation": {
        "@xmlns:xsi": "http://www.w3.org/2001/XMLSchema-instance",
        "@xsi:nil": "true"
      }
    }
  },
  "corps": {
    "dispositif": "<p style=\"text-align: justify;\">Apr&#232;s l&#8217;alin&#233;a&#160;20, ins&#233;rer l&#8217;alin&#233;a suivant&#160;:</p><p style=\"text-align: justify;\">&#171;&#160;<i> c)</i> Est ajout&#233;e une phrase ainsi r&#233;dig&#233;e&#160;: &#171;&#160;Le versement est &#233;galement affect&#233; au financement des travaux d&#8217;infrastructures concourant au d&#233;veloppement des mobilit&#233;s actives, telles que les pistes cyclables, des mobilit&#233;s inclusives et aux d&#233;ploiement des nouveaux usages de mobilit&#233;, telles que les voies d&#233;di&#233;es au covoiturage ou les parkings relais, &#224; l&#8217;autopartage et au v&#233;hicule autonome et connect&#233;.&#160;&#187;</p>",
    "exposeSommaire": "<p style=\"text-align: justify;\">Le projet de loi propose de remplacer les termes &#171;&#160;versement transport&#160;&#187; par une terminologie plus conforme &#224; l&#8217;usage et &#224; la finalit&#233; de ce mode de financement des mobilit&#233;s. C&#8217;est ainsi que la d&#233;nomination suivante a &#233;t&#233; retenue &#224; l&#8217;issue de l&#8217;examen en premi&#232;re lecture au S&#233;nat&#160;: &#171;&#160;versement destin&#233; au financement des services de mobilit&#233;&#160;&#187;.</p><p style=\"text-align: justify;\">Cette r&#233;daction pr&#233;sente n&#233;anmoins une ambigu&#239;t&#233; dans la mesure o&#249; elle laisse appara&#238;tre une distinction entre le financement des services li&#233;s aux mobilit&#233;s d&#8217;une part, et le financement des infrastructures qui les rendent possibles d&#8217;autre part.</p><p style=\"text-align: justify;\">Ces deux aspects n&#8217;&#233;tant pas dissociables, le pr&#233;sent amendement propose donc faire appara&#238;tre clairement l&#8217;int&#233;gration des infrastructures concourant au d&#233;veloppement des mobilit&#233;s au sein du p&#233;rim&#232;tre de financement du versement mobilit&#233;.</p>",
    "annexeExposeSommaire": {
      "@xmlns:xsi": "http://www.w3.org/2001/XMLSchema-instance",
      "@xsi:nil": "true"
    },
    "cartoucheDelaiDepotDepasse": {
      "@xmlns:xsi": "http://www.w3.org/2001/XMLSchema-instance",
      "@xsi:nil": "true"
    },
    "avantAppel": {
      "@xmlns:xsi": "http://www.w3.org/2001/XMLSchema-instance",
      "@xsi:nil": "true"
    }
  },
  "representations": {
    "representation": {
      "nom": "PDF",
      "typeMime": {
        "type": "application",
        "subType": "PDF"
      },
      "statutRepresentation": {
        "verbatim": "true",
        "canonique": "true",
        "officielle": "true",
        "transcription": "false",
        "enregistrement": "false"
      },
      "repSource": {
        "@xmlns:xsi": "http://www.w3.org/2001/XMLSchema-instance",
        "@xsi:nil": "true"
      },
      "offset": {
        "@xmlns:xsi": "http://www.w3.org/2001/XMLSchema-instance",
        "@xsi:nil": "true"
      },
      "contenu": {
        "documentURI": "/15/amendements/2135/CION-DVP/CD32.pdf"
      },
      "dateDispoRepresentation": {
        "@xmlns:xsi": "http://www.w3.org/2001/XMLSchema-instance",
        "@xsi:nil": "true"
      }
    }
  },
  "seanceDiscussion": {
    "@xmlns:xsi": "http://www.w3.org/2001/XMLSchema-instance",
    "@xsi:nil": "true"
  },
  "sort": {
    "dateSaisie": "2019-09-02T18:32:26.000+02:00",
    "sortEnSeance": "Retiré"
  },
  "dateDepot": "2019-07-16T02:00:00.000+02:00",
  "dateDistribution": "2019-09-02T02:00:00.000+02:00",
  "article99": "0",
  "loiReference": {
    "codeLoi": {
      "@xmlns:xsi": "http://www.w3.org/2001/XMLSchema-instance",
      "@xsi:nil": "true"
    },
    "divisionCodeLoi": {
      "@xmlns:xsi": "http://www.w3.org/2001/XMLSchema-instance",
      "@xsi:nil": "true"
    }
  }
}