{
  "@xmlns": "http://schemas.assemblee-nationale.fr/referentiel",
  "uid": "AMANR5L15PO420120B2416P0D1N187",
  "identifiant": {
    "legislature": "15",
    "numero": "187",
    "numRect": "0",
    "saisine": {
      "refTexteLegislatif": "PRJLANR5L15B2416",
      "numeroPartiePLF": "0",
      "organeExamen": "PO420120",
      "mentionSecondeDeliberation": "0"
    }
  },
  "numeroLong": "AS187",
  "etapeTexte": "Nouvelle Lecture",
  "triAmendement": "aciaaaaaaaaaaaaaaaaaaaaaaaaaaaaaaaaaaaaaaaaaaaaaaado",
  "cardinaliteAmdtMultiples": "1",
  "amendementParent": {
    "@xmlns:xsi": "http://www.w3.org/2001/XMLSchema-instance",
    "@xsi:nil": "true"
  },
  "etat": "Discuté",
  "signataires": {
    "auteur": {
      "typeAuteur": "Depute",
      "acteurRef": "PA718926",
      "organeRef": {
        "@xmlns:xsi": "http://www.w3.org/2001/XMLSchema-instance",
        "@xsi:nil": "true"
      },
      "groupePolitiqueRef": "PO730940"
    },
    "cosignataires": {
      "acteurRef": [
        "PA718926",
        "PA721270",
        "PA720546",
        "PA722202",
        "PA721118",
        "PA720692",
        "PA689",
        "PA610667",
        "PA721896",
        "PA721012",
        "PA610654",
        "PA335612",
        "PA267306",
        "PA722110",
        "PA441",
        "PA718720"
      ]
    },
    "texteAffichable": "M.&#160;Dharr&#233;ville,  Mme&#160;Bello, M.&#160;Brotherson, M.&#160;Bruneel, Mme&#160;Buffet, M.&#160;Chassaigne, M.&#160;Dufr&#232;gne, Mme&#160;Faucillon, M.&#160;Jumel, Mme&#160;K&#233;clard-Mond&#233;sir, M.&#160;Lecoq, M.&#160;Nilor, M.&#160;Peu, M.&#160;Fabien&#160;Roussel, M.&#160;Serville et M.&#160;Wulfranc"
  },
  "pointeurFragmentTexte": {
    "missionVisee": {
      "@xmlns:xsi": "http://www.w3.org/2001/XMLSchema-instance",
      "@xsi:nil": "true"
    },
    "division": {
      "titre": "Article 3",
      "articleDesignationCourte": "ART. 3",
      "type": "ARTICLE",
      "avant_A_Apres": "A",
      "divisionRattachee": "ARTICLE 3",
      "articleAdditionnel": {
        "@xmlns:xsi": "http://www.w3.org/2001/XMLSchema-instance",
        "@xsi:nil": "true"
      },
      "chapitreAdditionnel": {
        "@xmlns:xsi": "http://www.w3.org/2001/XMLSchema-instance",
        "@xsi:nil": "true"
      },
      "urlDivisionTexteVise": "/15/textes/2416.asp#D_Article_3"
    },
    "alinea": {
      "@xmlns:xsi": "http://www.w3.org/2001/XMLSchema-instance",
      "@xsi:nil": "true"
    }
  },
  "corps": {
    "dispositif": "<p>Supprimer cet article.</p>",
    "exposeSommaire": "<p>L&#8217;article&#160;3 du PLFSS 2020 organise l&#8217;appauvrissement chronique de la S&#233;curit&#233; sociale.&#160;</p><p style=\"text-align: justify;\">Il pr&#233;voit notamment que plusieurs mesures d&#8217;exon&#233;ration, prises suite au mouvement des Gilets jaunes, ne seront pas compens&#233;es par l&#8217;&#201;tat. Il s&#8217;agit de&#160;:</p><p style=\"text-align: justify;\">- l&#8217;avancement au 1er janvier 2019 de l&#8217;exon&#233;ration de cotisations sociales des heures suppl&#233;mentaires&#160;;</p><p style=\"text-align: justify;\">- le r&#233;tablissement du taux de CSG interm&#233;diaire &#224; 6,6&#160;% pour les retraites inf&#233;rieures &#224; 2000&#160;euros&#160;;</p><p style=\"text-align: justify;\">- et de la diminution du forfait social, pr&#233;vu par la LFSS 2019 pour un montant de 600 millions d&#8217;euros, s&#8217;agissant des entreprises de moins de 250 salari&#233;s qui versent de l&#8217;int&#233;ressement.</p><p style=\"text-align: justify;\">La non compensation de ces mesures repr&#233;sente une perte de recettes de 2,8 milliards d&#8217;euros en 2019 pour la S&#233;curit&#233; sociale, ce qui explique en grande partie la d&#233;gradation rapide des comptes sociaux.</p><p style=\"text-align: justify;\">Cet article remet donc en cause le principe fondamental de l&#8217;autonomie de la S&#233;curit&#233; sociale. La diminution injuste des recettes aide ainsi le Gouvernement &#224; justifier de nouveaux efforts dans les d&#233;penses en 2020&#160;: 4,2 milliards d&#8217;euros d&#8217;&#233;conomies sur l&#8217;assurance maladie dont 1 milliard d&#8217;euros sur les h&#244;pitaux, et 500 millions d&#8217;euros d&#8217;&#233;conomies sur les prestations sociales (allocations familiales et pensions de retraite).</p><p>Pour toutes ces raisons, nous demandons la suppression de cet article.</p>",
    "annexeExposeSommaire": {
      "@xmlns:xsi": "http://www.w3.org/2001/XMLSchema-instance",
      "@xsi:nil": "true"
    },
    "cartoucheDelaiDepotDepasse": {
      "@xmlns:xsi": "http://www.w3.org/2001/XMLSchema-instance",
      "@xsi:nil": "true"
    },
    "avantAppel": {
      "@xmlns:xsi": "http://www.w3.org/2001/XMLSchema-instance",
      "@xsi:nil": "true"
    }
  },
  "representations": {
    "representation": {
      "nom": "PDF",
      "typeMime": {
        "type": "application",
        "subType": "PDF"
      },
      "statutRepresentation": {
        "verbatim": "true",
        "canonique": "true",
        "officielle": "true",
        "transcription": "false",
        "enregistrement": "false"
      },
      "repSource": {
        "@xmlns:xsi": "http://www.w3.org/2001/XMLSchema-instance",
        "@xsi:nil": "true"
      },
      "offset": {
        "@xmlns:xsi": "http://www.w3.org/2001/XMLSchema-instance",
        "@xsi:nil": "true"
      },
      "contenu": {
        "documentURI": "/15/amendements/2416/CION-SOC/AS187.pdf"
      },
      "dateDispoRepresentation": {
        "@xmlns:xsi": "http://www.w3.org/2001/XMLSchema-instance",
        "@xsi:nil": "true"
      }
    }
  },
  "seanceDiscussion": {
    "@xmlns:xsi": "http://www.w3.org/2001/XMLSchema-instance",
    "@xsi:nil": "true"
  },
  "sort": {
    "dateSaisie": "2019-11-20T21:38:40.000+01:00",
    "sortEnSeance": "Rejeté"
  },
  "dateDepot": "2019-11-20T01:00:00.000+01:00",
  "dateDistribution": "2019-11-20T01:00:00.000+01:00",
  "article99": "0",
  "loiReference": {
    "codeLoi": {
      "@xmlns:xsi": "http://www.w3.org/2001/XMLSchema-instance",
      "@xsi:nil": "true"
    },
    "divisionCodeLoi": {
      "@xmlns:xsi": "http://www.w3.org/2001/XMLSchema-instance",
      "@xsi:nil": "true"
    }
  }
}