{
  "@xmlns": "http://schemas.assemblee-nationale.fr/referentiel",
  "uid": "AMANR5L15PO419865B2274P0D1N1358",
  "identifiant": {
    "legislature": "15",
    "numero": "1358",
    "numRect": "0",
    "saisine": {
      "refTexteLegislatif": "PRJLANR5L15B2274",
      "numeroPartiePLF": "0",
      "organeExamen": "PO419865",
      "mentionSecondeDeliberation": "0"
    }
  },
  "numeroLong": "CD1358",
  "etapeTexte": "1ère lecture (2ème assemblée saisie)",
  "triAmendement": "ejaaaaaaaaaaaaaaaaaaaaaaaaaaaaaaaaaaaaaaaaaaaaaaaakkskzi",
  "cardinaliteAmdtMultiples": "1",
  "amendementParent": {
    "@xmlns:xsi": "http://www.w3.org/2001/XMLSchema-instance",
    "@xsi:nil": "true"
  },
  "etat": "En traitement",
  "signataires": {
    "auteur": {
      "typeAuteur": "Depute",
      "acteurRef": "PA721976",
      "organeRef": {
        "@xmlns:xsi": "http://www.w3.org/2001/XMLSchema-instance",
        "@xsi:nil": "true"
      },
      "groupePolitiqueRef": "PO730970"
    },
    "cosignataires": {
      "acteurRef": [
        "PA721182",
        "PA721530",
        "PA720764",
        "PA720178",
        "PA720598",
        "PA721608",
        "PA721734",
        "PA720092",
        "PA720976",
        "PA722284",
        "PA721742",
        "PA721984",
        "PA720924",
        "PA720728",
        "PA719504",
        "PA721836",
        "PA721924",
        "PA720746",
        "PA722162",
        "PA719874",
        "PA721418",
        "PA717151",
        "PA720326",
        "PA721996",
        "PA720002",
        "PA719210",
        "PA720334",
        "PA719942",
        "PA722374",
        "PA721976",
        "PA1276",
        "PA719640",
        "PA719558",
        "PA720652",
        "PA719918",
        "PA720162",
        "PA720704",
        "PA719044",
        "PA718978",
        "PA719488",
        "PA720720",
        "PA721234",
        "PA720256",
        "PA719266",
        "PA720968",
        "PA720772"
      ]
    },
    "texteAffichable": "M.&#160;Millienne,  M.&#160;Pahun, Mme&#160;Essayan, Mme&#160;Lasserre, M.&#160;Loiseau, Mme&#160;Luquet, M.&#160;Balanant, Mme&#160;Bannier, M.&#160;Barrot, M.&#160;Baudu, Mme&#160;Benin, M.&#160;Berta, M.&#160;Bolo, M.&#160;Bourlanges, M.&#160;Bru, M.&#160;Cubertafon, Mme&#160;de Sarnez, Mme&#160;de Vaucouleurs, Mme&#160;Deprez-Audebert, M.&#160;Duverg&#233;, Mme&#160;El Ha&#239;ry, Mme&#160;Elimas, M.&#160;Fanget, Mme&#160;Florennes, M.&#160;Fuchs, M.&#160;Garcia, M.&#160;Hammouche, M.&#160;Isaac-Sibille, Mme&#160;Jacquier-Laforge, M.&#160;Joncour, M.&#160;Lagleize, M.&#160;Lain&#233;, M.&#160;Laqhila, M.&#160;Latombe, M.&#160;Mathiasin, M.&#160;Mattei, Mme&#160;Mette, M.&#160;Michel-Kleisbauer, M.&#160;Mignola, M.&#160;Fr&#233;d&#233;ric&#160;Petit, Mme&#160;Maud&#160;Petit, Mme&#160;Poueyto, M.&#160;Ramos, M.&#160;Turquois, Mme&#160;Vichnievsky et M.&#160;Waserman"
  },
  "pointeurFragmentTexte": {
    "missionVisee": {
      "@xmlns:xsi": "http://www.w3.org/2001/XMLSchema-instance",
      "@xsi:nil": "true"
    },
    "division": {
      "titre": "Article 8",
      "articleDesignationCourte": "ART. 8",
      "type": "ARTICLE",
      "avant_A_Apres": "A",
      "divisionRattachee": "ARTICLE 8",
      "articleAdditionnel": {
        "@xmlns:xsi": "http://www.w3.org/2001/XMLSchema-instance",
        "@xsi:nil": "true"
      },
      "chapitreAdditionnel": {
        "@xmlns:xsi": "http://www.w3.org/2001/XMLSchema-instance",
        "@xsi:nil": "true"
      },
      "urlDivisionTexteVise": "/15/textes/2274.asp#D_Article_8"
    },
    "alinea": {
      "avant_A_Apres": {
        "@xmlns:xsi": "http://www.w3.org/2001/XMLSchema-instance",
        "@xsi:nil": "true"
      },
      "numero": "25",
      "alineaDesignation": {
        "@xmlns:xsi": "http://www.w3.org/2001/XMLSchema-instance",
        "@xsi:nil": "true"
      }
    }
  },
  "corps": {
    "dispositif": "<p style=\"text-align: justify;\">A l&#8217;alin&#233;a 25, apr&#232;s les mots &#171;&#160;soient assur&#233;es.&#160;&#187;, sont ins&#233;r&#233;s les mots&#160;:</p><p style=\"text-align: justify;\">&#171;&#160;Les professionnels du secteur s&#8217;acquittent du d&#233;p&#244;t de d&#233;chets &#224; r&#233;ception d&#8217;un certificat de mise en d&#233;p&#244;t d&#233;livr&#233; par les installations de reprises de ces d&#233;chets. Le certificat de mise en d&#233;p&#244;t de d&#233;chets est communiqu&#233; &#224; l&#8217;ex&#233;cutif de la collectivit&#233; territoriale ayant autoris&#233; le permis de construire dont les op&#233;rations de travaux ont conduit &#224; la production des d&#233;chets de construction ou de d&#233;molition.&#160;&#187;</p>",
    "exposeSommaire": "<p style=\"text-align: justify;\">L&#8217;instauration de certificats de mise en d&#233;p&#244;t de d&#233;chets issus du b&#226;timent en d&#233;chetterie, &#224; titre on&#233;reux ou gratuit, est n&#233;cessaire pour permettre une tra&#231;abilit&#233; de ces d&#233;chets. En effet, ce m&#233;canisme permet de responsabiliser et d&#8217;informer l&#8217;ensemble des acteurs de la chaine, du maitre d&#8217;&#339;uvre, &#224; l&#8217;&#233;ventuel prestataire en charge du d&#233;p&#244;t, en passant par la collectivit&#233; territoriale comp&#233;tente dans la d&#233;livrance du permis de construire.</p>",
    "annexeExposeSommaire": {
      "@xmlns:xsi": "http://www.w3.org/2001/XMLSchema-instance",
      "@xsi:nil": "true"
    },
    "cartoucheDelaiDepotDepasse": "Sous réserve de son traitement par les services de l'Assemblée nationale et de sa recevabilité",
    "avantAppel": {
      "@xmlns:xsi": "http://www.w3.org/2001/XMLSchema-instance",
      "@xsi:nil": "true"
    }
  },
  "representations": {
    "representation": {
      "nom": "PDF",
      "typeMime": {
        "type": "application",
        "subType": "PDF"
      },
      "statutRepresentation": {
        "verbatim": "true",
        "canonique": "true",
        "officielle": "true",
        "transcription": "false",
        "enregistrement": "false"
      },
      "repSource": {
        "@xmlns:xsi": "http://www.w3.org/2001/XMLSchema-instance",
        "@xsi:nil": "true"
      },
      "offset": {
        "@xmlns:xsi": "http://www.w3.org/2001/XMLSchema-instance",
        "@xsi:nil": "true"
      },
      "contenu": {
        "documentURI": "/15/amendements/2274/CION-DVP/CD1358.pdf"
      },
      "dateDispoRepresentation": {
        "@xmlns:xsi": "http://www.w3.org/2001/XMLSchema-instance",
        "@xsi:nil": "true"
      }
    }
  },
  "seanceDiscussion": {
    "@xmlns:xsi": "http://www.w3.org/2001/XMLSchema-instance",
    "@xsi:nil": "true"
  },
  "sort": {
    "@xmlns:xsi": "http://www.w3.org/2001/XMLSchema-instance",
    "@xsi:nil": "true"
  },
  "dateDepot": "2019-11-20T01:00:00.000+01:00",
  "dateDistribution": "2019-11-20T01:00:00.000+01:00",
  "article99": "0",
  "loiReference": {
    "codeLoi": {
      "@xmlns:xsi": "http://www.w3.org/2001/XMLSchema-instance",
      "@xsi:nil": "true"
    },
    "divisionCodeLoi": {
      "@xmlns:xsi": "http://www.w3.org/2001/XMLSchema-instance",
      "@xsi:nil": "true"
    }
  }
}