{
  "@xmlns": "http://schemas.assemblee-nationale.fr/referentiel",
  "uid": "AMANR5L15PO419610B2274P0D1N343",
  "identifiant": {
    "legislature": "15",
    "numero": "343",
    "numRect": "0",
    "saisine": {
      "refTexteLegislatif": "PRJLANR5L15B2274",
      "numeroPartiePLF": "0",
      "organeExamen": "PO419610",
      "mentionSecondeDeliberation": "0"
    }
  },
  "numeroLong": "CE343",
  "etapeTexte": "1ère lecture (2ème assemblée saisie)",
  "triAmendement": "aaesaaaaaaaaaaaaaaaaaaaaaaaaaaaaaaaaaaaaaaaaaaaaaaw",
  "cardinaliteAmdtMultiples": "1",
  "amendementParent": {
    "@xmlns:xsi": "http://www.w3.org/2001/XMLSchema-instance",
    "@xsi:nil": "true"
  },
  "etat": "Discuté",
  "signataires": {
    "auteur": {
      "typeAuteur": "Depute",
      "acteurRef": "PA719338",
      "organeRef": {
        "@xmlns:xsi": "http://www.w3.org/2001/XMLSchema-instance",
        "@xsi:nil": "true"
      },
      "groupePolitiqueRef": "PO730964"
    },
    "cosignataires": {
      "acteurRef": "PA719338"
    },
    "texteAffichable": "Mme&#160;Melchior, rapporteure"
  },
  "pointeurFragmentTexte": {
    "missionVisee": {
      "@xmlns:xsi": "http://www.w3.org/2001/XMLSchema-instance",
      "@xsi:nil": "true"
    },
    "division": {
      "titre": "Article 12 G",
      "articleDesignationCourte": "ART. 12 G",
      "type": "ARTICLE",
      "avant_A_Apres": "A",
      "divisionRattachee": "ARTICLE 12 G",
      "articleAdditionnel": {
        "@xmlns:xsi": "http://www.w3.org/2001/XMLSchema-instance",
        "@xsi:nil": "true"
      },
      "chapitreAdditionnel": {
        "@xmlns:xsi": "http://www.w3.org/2001/XMLSchema-instance",
        "@xsi:nil": "true"
      },
      "urlDivisionTexteVise": "/15/textes/2274.asp#D_Article_12_G"
    },
    "alinea": {
      "avant_A_Apres": {
        "@xmlns:xsi": "http://www.w3.org/2001/XMLSchema-instance",
        "@xsi:nil": "true"
      },
      "numero": "2",
      "alineaDesignation": {
        "@xmlns:xsi": "http://www.w3.org/2001/XMLSchema-instance",
        "@xsi:nil": "true"
      }
    }
  },
  "corps": {
    "dispositif": "<p style=\"text-align: justify;\">&#192; la seconde phrase de l&#8217;alin&#233;a&#160;2, substituer aux mots&#160;:</p><p style=\"text-align: justify;\">&#171;&#160;ces d&#233;chets ont vocation &#224; &#234;tre&#160;&#187;</p><p style=\"text-align: justify;\">les mots&#160;:</p><p style=\"text-align: justify;\">&#171;&#160;il est pr&#233;vu que ces d&#233;chets soient&#160;&#187;.&#160;</p>",
    "exposeSommaire": "<p style=\"text-align: justify;\">Amendement de clarification r&#233;dactionnelle. L&#8217;objectif est bien que les artisans inscrivent sur le devis les installations dans lesquelles il est pr&#233;vu que ces d&#233;chets soient collect&#233;s, ce qui offre une certaine souplesse si l&#8217;installation de collecte pr&#233;vue au stade du devis diff&#232;re de celle finalement choisie par l&#8217;artisan. Les installations auxquelles les d&#233;chets se destinent peuvent &#233;voluer entre le d&#233;but et la fin du chantier, pour des questions logistiques.</p>",
    "annexeExposeSommaire": {
      "@xmlns:xsi": "http://www.w3.org/2001/XMLSchema-instance",
      "@xsi:nil": "true"
    },
    "cartoucheDelaiDepotDepasse": {
      "@xmlns:xsi": "http://www.w3.org/2001/XMLSchema-instance",
      "@xsi:nil": "true"
    },
    "avantAppel": {
      "@xmlns:xsi": "http://www.w3.org/2001/XMLSchema-instance",
      "@xsi:nil": "true"
    }
  },
  "representations": {
    "representation": {
      "nom": "PDF",
      "typeMime": {
        "type": "application",
        "subType": "PDF"
      },
      "statutRepresentation": {
        "verbatim": "true",
        "canonique": "true",
        "officielle": "true",
        "transcription": "false",
        "enregistrement": "false"
      },
      "repSource": {
        "@xmlns:xsi": "http://www.w3.org/2001/XMLSchema-instance",
        "@xsi:nil": "true"
      },
      "offset": {
        "@xmlns:xsi": "http://www.w3.org/2001/XMLSchema-instance",
        "@xsi:nil": "true"
      },
      "contenu": {
        "documentURI": "/15/amendements/2274/CION-ECO/CE343.pdf"
      },
      "dateDispoRepresentation": {
        "@xmlns:xsi": "http://www.w3.org/2001/XMLSchema-instance",
        "@xsi:nil": "true"
      }
    }
  },
  "seanceDiscussion": {
    "@xmlns:xsi": "http://www.w3.org/2001/XMLSchema-instance",
    "@xsi:nil": "true"
  },
  "sort": {
    "dateSaisie": "2019-11-19T20:06:25.000+01:00",
    "sortEnSeance": "Adopté"
  },
  "dateDepot": "2019-11-16T01:00:00.000+01:00",
  "dateDistribution": "2019-11-19T01:00:00.000+01:00",
  "article99": "0",
  "loiReference": {
    "codeLoi": {
      "@xmlns:xsi": "http://www.w3.org/2001/XMLSchema-instance",
      "@xsi:nil": "true"
    },
    "divisionCodeLoi": {
      "@xmlns:xsi": "http://www.w3.org/2001/XMLSchema-instance",
      "@xsi:nil": "true"
    }
  }
}