{
  "@xmlns": "http://schemas.assemblee-nationale.fr/referentiel",
  "uid": "AMANR5L15PO59048B1490P0D1N466",
  "identifiant": {
    "legislature": "15",
    "numero": "466",
    "numRect": "0",
    "saisine": {
      "refTexteLegislatif": "PRJLANR5L15B1490",
      "numeroPartiePLF": "0",
      "organeExamen": "PO59048",
      "mentionSecondeDeliberation": "0"
    }
  },
  "numeroLong": "CF466",
  "etapeTexte": "Nouvelle Lecture",
  "triAmendement": "iriaaaaaaaaaaaaaaaaaaaaaaaaaaaaaaaaaaaaaaaaaaaaaaake",
  "cardinaliteAmdtMultiples": "1",
  "amendementParent": {
    "@xmlns:xsi": "http://www.w3.org/2001/XMLSchema-instance",
    "@xsi:nil": "true"
  },
  "etat": "Irrecevable",
  "signataires": {
    "auteur": {
      "typeAuteur": "Depute",
      "acteurRef": "PA405480",
      "organeRef": {
        "@xmlns:xsi": "http://www.w3.org/2001/XMLSchema-instance",
        "@xsi:nil": "true"
      },
      "groupePolitiqueRef": "PO759900"
    },
    "cosignataires": {
      "acteurRef": "PA405480"
    },
    "texteAffichable": "M.&#160;Pupponi"
  },
  "pointeurFragmentTexte": {
    "missionVisee": {
      "@xmlns:xsi": "http://www.w3.org/2001/XMLSchema-instance",
      "@xsi:nil": "true"
    },
    "division": {
      "titre": "Article 56",
      "articleDesignationCourte": "ART. 56",
      "type": "ARTICLE",
      "avant_A_Apres": "A",
      "divisionRattachee": "ARTICLE 56",
      "articleAdditionnel": {
        "@xmlns:xsi": "http://www.w3.org/2001/XMLSchema-instance",
        "@xsi:nil": "true"
      },
      "chapitreAdditionnel": {
        "@xmlns:xsi": "http://www.w3.org/2001/XMLSchema-instance",
        "@xsi:nil": "true"
      },
      "urlDivisionTexteVise": "/15/textes/1490.asp#D_Article_56"
    },
    "alinea": {
      "avant_A_Apres": "Apres",
      "numero": "39",
      "alineaDesignation": {
        "@xmlns:xsi": "http://www.w3.org/2001/XMLSchema-instance",
        "@xsi:nil": "true"
      }
    }
  },
  "corps": {
    "dispositif": "<p>Le d&#233;but du premier alin&#233;a de l&#8217;article 1449 du code g&#233;n&#233;ral des imp&#244;ts est ainsi r&#233;dig&#233; : &#171; Sauf d&#233;lib&#233;ration contraire de la collectivit&#233; territoriale ou de l&#8217;&#233;tablissement public de coop&#233;ration intercommunale dot&#233; d&#8217;une fiscalit&#233; propre, pour la part de cotisation fonci&#232;re qui lui revient, prise dans les conditions pr&#233;vues au I de l&#8217;article 1639 A bis, ... (le reste sans changement). &#187;</p><p>II.&#160;&#8211;&#160;Compl&#233;ter cet article par les deux alin&#233;as suivants&#160;:</p><p>&#171;&#160;II.&#160;&#8211;&#160;La perte de recettes pour l&#8217;&#201;tat est compens&#233;e &#224; due concurrence par la cr&#233;ation d&#8217;une taxe additionnelle aux droits mentionn&#233;s aux articles 575 et 575 A du code g&#233;n&#233;ral des imp&#244;ts.</p><p>&#171;&#160;III.&#160;&#8211;&#160;La perte de recettes pour les collectivit&#233;s territoriales est compens&#233;e &#224; due concurrence par la majoration de la dotation globale de fonctionnement et, corr&#233;lativement pour l&#8217;&#201;tat, par la cr&#233;ation d&#8217;une taxe additionnelle aux droits mentionn&#233;s aux articles 575 et 575 A du code g&#233;n&#233;ral des imp&#244;ts.&#160;&#187;.</p>",
    "exposeSommaire": "<p>L&#8217;&#201;tat a mis en place un certain nombre de dispositifs d&#8217;exon&#233;ration d&#8217;imp&#244;ts directs locaux afin de soutenir la construction de logements sociaux ou encore&#160;le d&#233;veloppement &#233;conomique de territoires en difficult&#233;. La CFE entre dans le champ de ces exon&#233;rations.</p><p>Si ces mesures sont positives dans leurs intentions, depuis que les compensations de ces exon&#233;rations par l&#8217;&#201;tat sont devenues d&#233;gressives, les pertes de recettes pour les collectivit&#233;s concern&#233;es, souvent les plus d&#233;favoris&#233;es, se chiffrent en millions d&#8217;euros. Il est d&#8217;ailleurs int&#233;ressant de noter que les services de l&#8217;&#201;tat peinent &#224; retracer le co&#251;t exact pour chaque collectivit&#233; de ces mesures. Ainsi un rapport du Minist&#232;re de l&#8217;Action et des Comptes publics de 2016 chiffre rien que pour l&#8217;ann&#233;e 2016 une perte nette annuelle pour les communes et les EPCI de 43 millions d&#8217;euros, une perte qui s&#8217;est aggrav&#233;e depuis 2017 avec la diminution progressive des compensations.</p><p>Le pr&#233;sent amendement propose donc que pour l&#8217;exon&#233;ration de CFE, la collectivit&#233; territoriale concern&#233;e puisse d&#233;cider d&#8217;opposer son veto &#224; la mise en &#339;uvre de cette exon&#233;ration sur son territoire.</p>",
    "annexeExposeSommaire": {
      "@xmlns:xsi": "http://www.w3.org/2001/XMLSchema-instance",
      "@xsi:nil": "true"
    },
    "cartoucheDelaiDepotDepasse": {
      "@xmlns:xsi": "http://www.w3.org/2001/XMLSchema-instance",
      "@xsi:nil": "true"
    }
  },
  "representations": {
    "representation": {
      "nom": "PDF",
      "typeMime": {
        "type": "application",
        "subType": "PDF"
      },
      "statutRepresentation": {
        "verbatim": "true",
        "canonique": "true",
        "officielle": "true",
        "transcription": "false",
        "enregistrement": "false"
      },
      "repSource": {
        "@xmlns:xsi": "http://www.w3.org/2001/XMLSchema-instance",
        "@xsi:nil": "true"
      },
      "offset": {
        "@xmlns:xsi": "http://www.w3.org/2001/XMLSchema-instance",
        "@xsi:nil": "true"
      },
      "contenu": {
        "documentURI": "/15/amendements/1490/CION_FIN/CF466.pdf"
      },
      "dateDispoRepresentation": {
        "@xmlns:xsi": "http://www.w3.org/2001/XMLSchema-instance",
        "@xsi:nil": "true"
      }
    }
  },
  "seanceDiscussion": {
    "@xmlns:xsi": "http://www.w3.org/2001/XMLSchema-instance",
    "@xsi:nil": "true"
  },
  "sort": {
    "@xmlns:xsi": "http://www.w3.org/2001/XMLSchema-instance",
    "@xsi:nil": "true"
  },
  "dateDepot": "2018-12-13T01:00:00.000+01:00",
  "dateDistribution": "2018-12-13T01:00:00.000+01:00",
  "article99": "0",
  "loiReference": {
    "codeLoi": {
      "@xmlns:xsi": "http://www.w3.org/2001/XMLSchema-instance",
      "@xsi:nil": "true"
    },
    "divisionCodeLoi": {
      "@xmlns:xsi": "http://www.w3.org/2001/XMLSchema-instance",
      "@xsi:nil": "true"
    }
  }
}