{
  "@xmlns": "http://schemas.assemblee-nationale.fr/referentiel",
  "uid": "AMANR5L15SEA717460BTC1054P0D1N13",
  "identifiant": {
    "legislature": "15",
    "numero": "13",
    "numRect": "0",
    "saisine": {
      "refTexteLegislatif": "PIONANR5L15BTC1054",
      "numeroPartiePLF": "0",
      "organeExamen": "PO717460",
      "mentionSecondeDeliberation": "0"
    }
  },
  "numeroLong": "13",
  "etapeTexte": "1ère lecture (1ère assemblée saisie)",
  "triAmendement": "ae",
  "cardinaliteAmdtMultiples": "1",
  "amendementParent": {
    "@xmlns:xsi": "http://www.w3.org/2001/XMLSchema-instance",
    "@xsi:nil": "true"
  },
  "etat": "Retiré",
  "signataires": {
    "auteur": {
      "typeAuteur": "Depute",
      "acteurRef": "PA719830",
      "organeRef": {
        "@xmlns:xsi": "http://www.w3.org/2001/XMLSchema-instance",
        "@xsi:nil": "true"
      },
      "groupePolitiqueRef": "PO730964"
    },
    "cosignataires": {
      "acteurRef": "PA719830"
    },
    "texteAffichable": "M.&#160;D&#233;moulin"
  },
  "pointeurFragmentTexte": {
    "missionVisee": {
      "@xmlns:xsi": "http://www.w3.org/2001/XMLSchema-instance",
      "@xsi:nil": "true"
    },
    "division": {
      "titre": "Article 2",
      "articleDesignationCourte": "ART. 2",
      "type": "ARTICLE",
      "avant_A_Apres": "A",
      "divisionRattachee": "ARTICLE 2",
      "articleAdditionnel": {
        "@xmlns:xsi": "http://www.w3.org/2001/XMLSchema-instance",
        "@xsi:nil": "true"
      },
      "chapitreAdditionnel": {
        "@xmlns:xsi": "http://www.w3.org/2001/XMLSchema-instance",
        "@xsi:nil": "true"
      },
      "urlDivisionTexteVise": "/15/textes/1054.asp#D_Article_2"
    },
    "alinea": {
      "avant_A_Apres": "Apres",
      "numero": "1",
      "alineaDesignation": {
        "@xmlns:xsi": "http://www.w3.org/2001/XMLSchema-instance",
        "@xsi:nil": "true"
      }
    }
  },
  "corps": {
    "dispositif": "<p style=\"text-align: justify;\">Compl&#233;ter cet article par les deux alin&#233;as suivants&#160;:</p><p style=\"text-align: justify;\">&#171;&#160;II.&#160;&#8211;&#160;Apr&#232;s le premier alin&#233;a de l&#8217;article L.&#160;221&#8209;16 du code de la consommation est ainsi modifi&#233;, il est ins&#233;r&#233; un alin&#233;a ainsi r&#233;dig&#233;&#160;:</p><p style=\"text-align: justify;\">&#171;&#160;Le professionnel qui contacte un consommateur par t&#233;l&#233;phone en vue de conclure un contrat portant sur la vente d&#8217;un bien ou sur la fourniture d&#8217;un service se doit de l&#8217;informer de la possibilit&#233; de s&#8217;inscrire sur la liste d&#8217;opposition au d&#233;marchage t&#233;l&#233;phonique.&#160;&#187;</p>",
    "exposeSommaire": "<p style=\"text-align: justify;\">Bloctel est un service qui permet aux consommateurs apr&#232;s inscription de ne plus &#234;tre d&#233;march&#233; par t&#233;l&#233;phone. Ce qui permet aussi aux professionnels de travailler de mani&#232;re plus cibl&#233;e. Cependant, bloctel souffre d&#8217;une manque de notori&#233;t&#233;.</p><p style=\"text-align: justify;\">Cet amendement vise &#224; rendre obligatoire sa pr&#233;sentation lors d&#8217;un d&#233;marchage t&#233;l&#233;phonique aupr&#232;s du consommateur.</p>",
    "annexeExposeSommaire": {
      "@xmlns:xsi": "http://www.w3.org/2001/XMLSchema-instance",
      "@xsi:nil": "true"
    }
  },
  "representations": {
    "representation": {
      "nom": "PDF",
      "typeMime": {
        "type": "application",
        "subType": "PDF"
      },
      "statutRepresentation": {
        "verbatim": "true",
        "canonique": "true",
        "officielle": "true",
        "transcription": "false",
        "enregistrement": "false"
      },
      "repSource": {
        "@xmlns:xsi": "http://www.w3.org/2001/XMLSchema-instance",
        "@xsi:nil": "true"
      },
      "offset": {
        "@xmlns:xsi": "http://www.w3.org/2001/XMLSchema-instance",
        "@xsi:nil": "true"
      },
      "contenu": {
        "documentURI": "/15/amendements/1054/AN/13.pdf"
      },
      "dateDispoRepresentation": {
        "@xmlns:xsi": "http://www.w3.org/2001/XMLSchema-instance",
        "@xsi:nil": "true"
      }
    }
  },
  "seanceDiscussion": {
    "@xmlns:xsi": "http://www.w3.org/2001/XMLSchema-instance",
    "@xsi:nil": "true"
  },
  "sort": {
    "@xmlns:xsi": "http://www.w3.org/2001/XMLSchema-instance",
    "@xsi:nil": "true"
  },
  "dateDepot": "2018-06-18T02:00:00.000+02:00",
  "dateDistribution": "2018-06-20T02:00:00.000+02:00",
  "article99": "0",
  "loiReference": {
    "codeLoi": {
      "@xmlns:xsi": "http://www.w3.org/2001/XMLSchema-instance",
      "@xsi:nil": "true"
    },
    "divisionCodeLoi": {
      "@xmlns:xsi": "http://www.w3.org/2001/XMLSchema-instance",
      "@xsi:nil": "true"
    }
  }
}