{
  "@xmlns": "http://schemas.assemblee-nationale.fr/referentiel",
  "uid": "AMANR5L15SEA717460B1297P0D1N154",
  "identifiant": {
    "legislature": "15",
    "numero": "154",
    "numRect": "0",
    "saisine": {
      "refTexteLegislatif": "PRJLANR5L15B1297",
      "numeroPartiePLF": "0",
      "organeExamen": "PO717460",
      "mentionSecondeDeliberation": "0"
    }
  },
  "numeroLong": "154",
  "etapeTexte": "1ère lecture (1ère assemblée saisie)",
  "triAmendement": "obaaaaaaaaaaaaaaaaaaaaaaaaaaaaaaaaaaaaaaaaaaaaaaaag",
  "cardinaliteAmdtMultiples": "1",
  "amendementParent": {
    "@xmlns:xsi": "http://www.w3.org/2001/XMLSchema-instance",
    "@xsi:nil": "true"
  },
  "etat": "Irrecevable",
  "signataires": {
    "auteur": {
      "typeAuteur": "Depute",
      "acteurRef": "PA713448",
      "organeRef": {
        "@xmlns:xsi": "http://www.w3.org/2001/XMLSchema-instance",
        "@xsi:nil": "true"
      },
      "groupePolitiqueRef": "PO730934"
    },
    "cosignataires": {
      "acteurRef": [
        "PA721070",
        "PA643134",
        "PA721474",
        "PA712015",
        "PA718780",
        "PA718784",
        "PA713448",
        "PA718884",
        "PA266776",
        "PA719318",
        "PA267318",
        "PA642847",
        "PA718838",
        "PA721286",
        "PA605036",
        "PA267378"
      ]
    },
    "texteAffichable": "Mme&#160;Brenier,  Mme&#160;Levy, M.&#160;Abad, Mme&#160;Anthoine, M.&#160;Bazin, Mme&#160;Bazin-Malgras, M.&#160;Ramadier, M.&#160;Reiss, Mme&#160;Valentin, M.&#160;Brun, M.&#160;Dive, Mme&#160;Ramassamy, M.&#160;Grelier, M.&#160;Viry, M.&#160;Pauget et Mme&#160;Trastour-Isnart"
  },
  "pointeurFragmentTexte": {
    "missionVisee": {
      "@xmlns:xsi": "http://www.w3.org/2001/XMLSchema-instance",
      "@xsi:nil": "true"
    },
    "division": {
      "titre": "Article 53",
      "articleDesignationCourte": "ART. 53",
      "type": "ARTICLE",
      "avant_A_Apres": "A",
      "divisionRattachee": "ARTICLE 53",
      "articleAdditionnel": {
        "@xmlns:xsi": "http://www.w3.org/2001/XMLSchema-instance",
        "@xsi:nil": "true"
      },
      "chapitreAdditionnel": {
        "@xmlns:xsi": "http://www.w3.org/2001/XMLSchema-instance",
        "@xsi:nil": "true"
      },
      "urlDivisionTexteVise": "/15/textes/1297.asp#D_Article_53"
    },
    "alinea": {
      "avant_A_Apres": "Apres",
      "numero": "2",
      "alineaDesignation": {
        "@xmlns:xsi": "http://www.w3.org/2001/XMLSchema-instance",
        "@xsi:nil": "true"
      }
    }
  },
  "corps": {
    "dispositif": "<p style=\"text-align: justify;\">Compl&#233;ter cet article par l'alin&#233;a suivant&#160;:</p><p style=\"text-align: justify;\">&#171;&#160;Le financement de la recherche et de l&#8217;innovation est sanctuaris&#233; et ce, sans baisse tarifaire associ&#233;e, par la cr&#233;ation d&#8217;un nouveau sous-objectif. Ce sous-objectif est rendu possible par un transfert de cr&#233;dits du sous-objectif de d&#233;penses relatives aux &#233;tablissements de sant&#233;.&#160;&#187;</p>",
    "exposeSommaire": "<p style=\"text-align: justify;\">Nous connaissons aujourd&#8217;hui une v&#233;ritable &#233;volution de la sant&#233;, de ses technologies et de la recherche. Pour ne pas manquer le virage de cette grande &#233;volution, il est important de donner &#224; ce grand tournant le financement n&#233;cessaire. Pour ce qui est de la recherche et de l&#8217;innovation, les cr&#233;dits, ces derni&#232;res ann&#233;es, ce financement a peu &#233;volu&#233; et a m&#234;me &#233;t&#233; gel&#233; dans certains cas.</p><p style=\"text-align: justify;\">De plus les enveloppes attribu&#233;es &#224; cette recherche et &#224; l&#8217;innovation sont parfois utilis&#233;es &#224; d&#8217;autres fins.</p><p style=\"text-align: justify;\">Cet amendement a donc pour objectif d&#8217;&#233;viter que les cr&#233;dits qui leur sont d&#233;di&#233;s fassent l&#8217;objet d&#8217;autres d&#233;penses. C&#8217;est pour cela qu&#8217;il cr&#233;e un nouveau sous-objectif, dans le but de sanctuariser ces enveloppes et donc garantir le financement de la recherche et de l&#8217;innovation dans les &#233;tablissements de sant&#233;.</p>",
    "annexeExposeSommaire": {
      "@xmlns:xsi": "http://www.w3.org/2001/XMLSchema-instance",
      "@xsi:nil": "true"
    }
  },
  "representations": {
    "representation": {
      "nom": "PDF",
      "typeMime": {
        "type": "application",
        "subType": "PDF"
      },
      "statutRepresentation": {
        "verbatim": "true",
        "canonique": "true",
        "officielle": "true",
        "transcription": "false",
        "enregistrement": "false"
      },
      "repSource": {
        "@xmlns:xsi": "http://www.w3.org/2001/XMLSchema-instance",
        "@xsi:nil": "true"
      },
      "offset": {
        "@xmlns:xsi": "http://www.w3.org/2001/XMLSchema-instance",
        "@xsi:nil": "true"
      },
      "contenu": {
        "documentURI": "/15/amendements/1297/AN/154.pdf"
      },
      "dateDispoRepresentation": {
        "@xmlns:xsi": "http://www.w3.org/2001/XMLSchema-instance",
        "@xsi:nil": "true"
      }
    }
  },
  "seanceDiscussion": {
    "@xmlns:xsi": "http://www.w3.org/2001/XMLSchema-instance",
    "@xsi:nil": "true"
  },
  "sort": {
    "@xmlns:xsi": "http://www.w3.org/2001/XMLSchema-instance",
    "@xsi:nil": "true"
  },
  "dateDepot": "2018-10-17T02:00:00.000+02:00",
  "dateDistribution": {
    "@xmlns:xsi": "http://www.w3.org/2001/XMLSchema-instance",
    "@xsi:nil": "true"
  },
  "article99": "0",
  "loiReference": {
    "codeLoi": {
      "@xmlns:xsi": "http://www.w3.org/2001/XMLSchema-instance",
      "@xsi:nil": "true"
    },
    "divisionCodeLoi": {
      "@xmlns:xsi": "http://www.w3.org/2001/XMLSchema-instance",
      "@xsi:nil": "true"
    }
  }
}