{
  "@xmlns": "http://schemas.assemblee-nationale.fr/referentiel",
  "uid": "AMANR5L15PO59048B0384P0D1N107",
  "identifiant": {
    "legislature": "15",
    "numero": "107",
    "numRect": "0",
    "saisine": {
      "refTexteLegislatif": "PRJLANR5L15B0384",
      "numeroPartiePLF": "0",
      "organeExamen": "PO59048",
      "mentionSecondeDeliberation": "0"
    }
  },
  "numeroLong": "CF107",
  "etapeTexte": "1ère lecture (1ère assemblée saisie)",
  "triAmendement": "b",
  "cardinaliteAmdtMultiples": "1",
  "amendementParent": {
    "@xmlns:xsi": "http://www.w3.org/2001/XMLSchema-instance",
    "@xsi:nil": "true"
  },
  "etat": "Discuté",
  "signataires": {
    "auteur": {
      "typeAuteur": "Depute",
      "acteurRef": "PA332523",
      "organeRef": {
        "@xmlns:xsi": "http://www.w3.org/2001/XMLSchema-instance",
        "@xsi:nil": "true"
      },
      "groupePolitiqueRef": "PO730934"
    },
    "cosignataires": {
      "acteurRef": "PA332523"
    },
    "texteAffichable": "Mme&#160;Dalloz"
  },
  "pointeurFragmentTexte": {
    "missionVisee": {
      "@xmlns:xsi": "http://www.w3.org/2001/XMLSchema-instance",
      "@xsi:nil": "true"
    },
    "division": {
      "titre": "Article 26",
      "articleDesignationCourte": "ART. 26",
      "type": "ARTICLE",
      "avant_A_Apres": "A",
      "divisionRattachee": "ARTICLE 26",
      "articleAdditionnel": {
        "@xmlns:xsi": "http://www.w3.org/2001/XMLSchema-instance",
        "@xsi:nil": "true"
      },
      "chapitreAdditionnel": {
        "@xmlns:xsi": "http://www.w3.org/2001/XMLSchema-instance",
        "@xsi:nil": "true"
      },
      "urlDivisionTexteVise": "/15/textes/0384.asp#D_Article_26"
    },
    "alinea": {
      "avant_A_Apres": "Apres",
      "numero": "17",
      "alineaDesignation": {
        "@xmlns:xsi": "http://www.w3.org/2001/XMLSchema-instance",
        "@xsi:nil": "true"
      }
    }
  },
  "corps": {
    "dispositif": "<p style=\"text-align: justify;\">Apr&#232;s l&#8217;alin&#233;a&#160;17, ins&#233;rer les deux alin&#233;as suivants&#160;:</p><p style=\"text-align: justify;\">&#171;&#160;Aucune infraction ne sera constat&#233;e lorsque l&#8217;&#233;tablissement a appliqu&#233; une interpr&#233;tation formellement admise par l&#8217;administration fiscale, la Direction du Tr&#233;sor ou de la Soci&#233;t&#233; de gestion des financements et de la garantie de l&#8217;accession sociale &#224; la propri&#233;t&#233;.</p><p style=\"text-align: justify;\">&#171;&#160;Lorsque le contr&#244;le est achev&#233; pour une p&#233;riode donn&#233;e, l&#8217;administration ne peut pas proc&#233;der &#224; un contr&#244;le au regard des m&#234;mes obligations et la m&#234;me p&#233;riode.&#160;&#187;</p>",
    "exposeSommaire": "<p style=\"text-align: justify;\">Cet amendement vise &#224; assortir l&#8217;application du nouvel article L.&#160;80 Q. du livre des proc&#233;dures fiscales de deux garanties qui s&#233;curisent l&#8217;ensemble du contr&#244;le fiscal&#160;:</p><p style=\"text-align: justify;\">- Ainsi, lorsque l&#8217;&#233;tablissement bancaire suit les recommandations et interpr&#233;tations &#233;crites d&#8217;autorit&#233;s publiques comme la DGT, la DGFIP ou SGFGAS, en mati&#232;re d&#8217;&#233;pargne r&#232;glement&#233;e, il n&#8217;y a pas lieu de constater une infraction.</p><p style=\"text-align: justify;\">- Par ailleurs, l&#8217;administration fiscale ne doit pas notamment pouvoir proc&#233;der &#224; nouveau &#224; un contr&#244;le du respect des obligations des articles L.&#160;112&#8209;6 &#224; L.&#160;112&#8209;6&#8209;2 et L.&#160;211&#8209;35 du code mon&#233;taire et financier si un contr&#244;le portant sur la m&#234;me p&#233;riode et sur le m&#234;me imp&#244;t a d&#233;j&#224; eu lieu.</p>",
    "annexeExposeSommaire": {
      "@xmlns:xsi": "http://www.w3.org/2001/XMLSchema-instance",
      "@xsi:nil": "true"
    }
  },
  "representations": {
    "representation": {
      "nom": "PDF",
      "typeMime": {
        "type": "application",
        "subType": "PDF"
      },
      "statutRepresentation": {
        "verbatim": "true",
        "canonique": "true",
        "officielle": "true",
        "transcription": "false",
        "enregistrement": "false"
      },
      "repSource": {
        "@xmlns:xsi": "http://www.w3.org/2001/XMLSchema-instance",
        "@xsi:nil": "true"
      },
      "offset": {
        "@xmlns:xsi": "http://www.w3.org/2001/XMLSchema-instance",
        "@xsi:nil": "true"
      },
      "contenu": {
        "documentURI": "/15/amendements/0384/CION_FIN/CF107.pdf"
      },
      "dateDispoRepresentation": {
        "@xmlns:xsi": "http://www.w3.org/2001/XMLSchema-instance",
        "@xsi:nil": "true"
      }
    }
  },
  "seanceDiscussion": {
    "@xmlns:xsi": "http://www.w3.org/2001/XMLSchema-instance",
    "@xsi:nil": "true"
  },
  "sort": {
    "dateSaisie": "2017-11-29T18:25:51.000+01:00",
    "sortEnSeance": "Adopté"
  },
  "dateDepot": "2017-11-22T01:00:00.000+01:00",
  "dateDistribution": "2017-11-28T01:00:00.000+01:00",
  "article99": "0",
  "loiReference": {
    "codeLoi": {
      "@xmlns:xsi": "http://www.w3.org/2001/XMLSchema-instance",
      "@xsi:nil": "true"
    },
    "divisionCodeLoi": {
      "@xmlns:xsi": "http://www.w3.org/2001/XMLSchema-instance",
      "@xsi:nil": "true"
    }
  }
}