{
  "@xmlns": "http://schemas.assemblee-nationale.fr/referentiel",
  "uid": "AMANR5L15PO59051B0714P0D1N513",
  "identifiant": {
    "legislature": "15",
    "numero": "513",
    "numRect": "0",
    "saisine": {
      "refTexteLegislatif": "PRJLANR5L15B0714",
      "numeroPartiePLF": "0",
      "organeExamen": "PO59051",
      "mentionSecondeDeliberation": "0"
    }
  },
  "numeroLong": "CL513",
  "etapeTexte": "1ère lecture (1ère assemblée saisie)",
  "triAmendement": "job",
  "cardinaliteAmdtMultiples": "1",
  "amendementParent": {
    "@xmlns:xsi": "http://www.w3.org/2001/XMLSchema-instance",
    "@xsi:nil": "true"
  },
  "etat": "Discuté",
  "signataires": {
    "auteur": {
      "typeAuteur": "Depute",
      "acteurRef": "PA643175",
      "organeRef": {
        "@xmlns:xsi": "http://www.w3.org/2001/XMLSchema-instance",
        "@xsi:nil": "true"
      },
      "groupePolitiqueRef": "PO730964"
    },
    "cosignataires": {
      "acteurRef": [
        "PA721426",
        "PA643175",
        "PA719326",
        "PA719032",
        "PA720500",
        "PA719448",
        "PA719230",
        "PA721246",
        "PA720014",
        "PA718728",
        "PA722118",
        "PA720278",
        "PA608083",
        "PA720146",
        "PA721218",
        "PA719154",
        "PA609520",
        "PA719814",
        "PA720968",
        "PA721792",
        "PA720870",
        "PA719100",
        "PA719972",
        "PA719364",
        "PA719456",
        "PA718710",
        "PA720074",
        "PA720598",
        "PA719130",
        "PA720538",
        "PA720198",
        "PA721946",
        "PA719882",
        "PA719464",
        "PA719558",
        "PA334116"
      ]
    },
    "texteAffichable": "Mme&#160;Dupont,  M.&#160;Orphelin, M.&#160;Ardouin, M.&#160;Balanant, Mme&#160;Benin, Mme&#160;Bourguignon, M.&#160;Bouyx, Mme&#160;Pascale&#160;Boyer, Mme&#160;Chapelier, Mme&#160;Charri&#232;re, Mme&#160;Colboc, Mme&#160;Deprez-Audebert, Mme&#160;De Temmerman, Mme&#160;Gaillot, M.&#160;Galbadon, Mme&#160;Gipson, Mme&#160;Guerel, Mme&#160;Janvier, M.&#160;Kerlogot, Mme&#160;Jacqueline&#160;Maquet, M.&#160;Marilossian, M.&#160;Martin, M.&#160;Mass&#233;glia, M.&#160;Mbaye, Mme&#160;Meynier-Millefert, Mme&#160;Michel, Mme&#160;M&#246;rch, M.&#160;Nadot, Mme&#160;O&apos;Petit, Mme&#160;Val&#233;rie&#160;Petit, Mme&#160;Pompili, Mme&#160;Riotton, Mme&#160;Sarles, Mme&#160;Sylla, Mme&#160;Tiegna et Mme&#160;Vanceunebrock-Mialon"
  },
  "pointeurFragmentTexte": {
    "missionVisee": {
      "@xmlns:xsi": "http://www.w3.org/2001/XMLSchema-instance",
      "@xsi:nil": "true"
    },
    "division": {
      "titre": "Article 9",
      "articleDesignationCourte": "ART. 9",
      "type": "ARTICLE",
      "avant_A_Apres": "A",
      "divisionRattachee": "ARTICLE 9",
      "articleAdditionnel": {
        "@xmlns:xsi": "http://www.w3.org/2001/XMLSchema-instance",
        "@xsi:nil": "true"
      },
      "chapitreAdditionnel": {
        "@xmlns:xsi": "http://www.w3.org/2001/XMLSchema-instance",
        "@xsi:nil": "true"
      },
      "urlDivisionTexteVise": "/15/textes/0714.asp#D_Article_9"
    },
    "alinea": {
      "avant_A_Apres": "Apres",
      "numero": "3",
      "alineaDesignation": {
        "@xmlns:xsi": "http://www.w3.org/2001/XMLSchema-instance",
        "@xsi:nil": "true"
      }
    }
  },
  "corps": {
    "dispositif": "<p style=\"text-align: justify;\">Apr&#232;s l&#8217;alin&#233;a&#160;3, ins&#233;rer les deux alin&#233;as suivants&#160;:</p><p style=\"text-align: justify;\">&#171;&#160;<i>a</i> bis<i>)</i> Apr&#232;s le deuxi&#232;me alin&#233;a,&#160;il est ins&#233;r&#233; alin&#233;a ainsi r&#233;dig&#233;&#160;:</p><p style=\"text-align: justify;\">&#171;&#160;&#171;&#160;Une d&#233;clinaison d&#233;partementale est &#233;tablie par le repr&#233;sentant de l&#8217;&#201;tat dans le d&#233;partement, apr&#232;s avis d&#8217;une instance d&#233;partementale qu&#8217;il pr&#233;side, compos&#233;e des acteurs institutionnels, des &#233;lus locaux et des acteurs associatifs. Cette d&#233;clinaison d&#233;partementale est &#233;labor&#233;e en conformit&#233; avec le sch&#233;ma r&#233;gional d&#8217;accueil des demandeurs d&#8217;asile. Cette instance d&#233;partementale se r&#233;unit une fois par an pour &#233;tablir un diagnostic territorial d&#8217;accueil et effectuer un &#233;tat des lieux de l&#8217;application de la d&#233;clinaison d&#233;partementale du sch&#233;ma r&#233;gional d&#8217;accueil des demandeurs d&#8217;asile.&#160;&#187;&#160;&#187;</p>",
    "exposeSommaire": "<p>Le pr&#233;sent amendement vise &#224; d&#233;cliner au niveau d&#233;partemental le sch&#233;ma r&#233;gional des demandeurs d&#8217;asile. Pour faciliter l&#8217;int&#233;gration des demandeurs d&#8217;asile par le biais de leur r&#233;partition sur le territoire et de leur h&#233;bergement, il convient de permettre aux acteurs locaux d&#8217;&#233;tablir ensemble, et sous la responsabilit&#233; du Pr&#233;fet, une d&#233;clinaison coh&#233;rente et diffuse, adapt&#233;e aux sp&#233;cificit&#233;s du territoire.</p><p>Pour ce faire, cet amendement vise &#224; cr&#233;er une instance d&#233;partementale, qui se r&#233;unit tous les ans afin de dresser un diagnostic territorial d&#8217;accueil permettant de recenser les diff&#233;rents acteurs et les capacit&#233;s d&#8217;h&#233;bergements. Il &#233;tablit &#233;galement un &#233;tat des lieux du sch&#233;ma d&#233;partemental en cours d&#8217;application pour s&#8217;assurer de sa bonne coh&#233;rence et de sa mise en &#339;uvre.</p><p>Cette instance est &#233;galement un lieu d&#8217;&#233;changes de bonnes pratiques dans le d&#233;partement.</p>",
    "annexeExposeSommaire": {
      "@xmlns:xsi": "http://www.w3.org/2001/XMLSchema-instance",
      "@xsi:nil": "true"
    }
  },
  "representations": {
    "representation": {
      "nom": "PDF",
      "typeMime": {
        "type": "application",
        "subType": "PDF"
      },
      "statutRepresentation": {
        "verbatim": "true",
        "canonique": "true",
        "officielle": "true",
        "transcription": "false",
        "enregistrement": "false"
      },
      "repSource": {
        "@xmlns:xsi": "http://www.w3.org/2001/XMLSchema-instance",
        "@xsi:nil": "true"
      },
      "offset": {
        "@xmlns:xsi": "http://www.w3.org/2001/XMLSchema-instance",
        "@xsi:nil": "true"
      },
      "contenu": {
        "documentURI": "/15/amendements/0714/CION_LOIS/CL513.pdf"
      },
      "dateDispoRepresentation": {
        "@xmlns:xsi": "http://www.w3.org/2001/XMLSchema-instance",
        "@xsi:nil": "true"
      }
    }
  },
  "seanceDiscussion": {
    "@xmlns:xsi": "http://www.w3.org/2001/XMLSchema-instance",
    "@xsi:nil": "true"
  },
  "sort": {
    "dateSaisie": "2018-04-05T10:41:50.000+02:00",
    "sortEnSeance": "Retiré"
  },
  "dateDepot": "2018-03-30T02:00:00.000+02:00",
  "dateDistribution": "2018-04-02T02:00:00.000+02:00",
  "article99": "0",
  "loiReference": {
    "codeLoi": "3",
    "divisionCodeLoi": {
      "@xmlns:xsi": "http://www.w3.org/2001/XMLSchema-instance",
      "@xsi:nil": "true"
    }
  }
}