{
  "@xmlns": "http://schemas.assemblee-nationale.fr/referentiel",
  "uid": "AMANR5L15PO59051B1802P0D1N903",
  "identifiant": {
    "legislature": "15",
    "numero": "903",
    "numRect": "0",
    "saisine": {
      "refTexteLegislatif": "PRJLANR5L15B1802",
      "numeroPartiePLF": "0",
      "organeExamen": "PO59051",
      "mentionSecondeDeliberation": "0"
    }
  },
  "numeroLong": "CL903",
  "etapeTexte": "1ère lecture (1ère assemblée saisie)",
  "triAmendement": "aiaaaaaaaaaaaaaaaaaaaaaaaaaaaaaaaaaaaaaaaaaaaaaaaajci",
  "cardinaliteAmdtMultiples": "1",
  "amendementParent": {
    "@xmlns:xsi": "http://www.w3.org/2001/XMLSchema-instance",
    "@xsi:nil": "true"
  },
  "etat": "En traitement",
  "signataires": {
    "auteur": {
      "typeAuteur": "Gouvernement",
      "acteurRef": {
        "@xmlns:xsi": "http://www.w3.org/2001/XMLSchema-instance",
        "@xsi:nil": "true"
      },
      "organeRef": {
        "@xmlns:xsi": "http://www.w3.org/2001/XMLSchema-instance",
        "@xsi:nil": "true"
      },
      "groupePolitiqueRef": {
        "@xmlns:xsi": "http://www.w3.org/2001/XMLSchema-instance",
        "@xsi:nil": "true"
      }
    },
    "cosignataires": {
      "@xmlns:xsi": "http://www.w3.org/2001/XMLSchema-instance",
      "@xsi:nil": "true"
    },
    "texteAffichable": "le Gouvernement"
  },
  "pointeurFragmentTexte": {
    "missionVisee": {
      "@xmlns:xsi": "http://www.w3.org/2001/XMLSchema-instance",
      "@xsi:nil": "true"
    },
    "division": {
      "titre": "Article 3",
      "articleDesignationCourte": "ART. 3",
      "type": "ARTICLE",
      "avant_A_Apres": "A",
      "divisionRattachee": "ARTICLE 3",
      "articleAdditionnel": {
        "@xmlns:xsi": "http://www.w3.org/2001/XMLSchema-instance",
        "@xsi:nil": "true"
      },
      "chapitreAdditionnel": {
        "@xmlns:xsi": "http://www.w3.org/2001/XMLSchema-instance",
        "@xsi:nil": "true"
      },
      "urlDivisionTexteVise": "/15/textes/1802.asp#D_Article_3"
    },
    "alinea": {
      "avant_A_Apres": "Apres",
      "numero": "23",
      "alineaDesignation": {
        "@xmlns:xsi": "http://www.w3.org/2001/XMLSchema-instance",
        "@xsi:nil": "true"
      }
    }
  },
  "corps": {
    "dispositif": "<p>Apr&#232;s l&#8217;alin&#233;a 23, il est ins&#233;r&#233; un article 15 ter ainsi r&#233;dig&#233;&#160;:</p><p>&#160;&#171; Par d&#233;rogation &#224; l&#8217;article 9 bis de la loi n&#176;83-634 du 83-634 du 13 juillet 1983 portant droits et obligations des fonctionnaires&#160;et &#224; l&#8217;article 15 bis de la pr&#233;sente loi, pour la d&#233;signation des repr&#233;sentants du personnel si&#233;geant aux comit&#233;s sociaux d&#8217;administration du minist&#232;re de la justice&#160;:</p><p>a)&#160;&#160;&#160;&#160;&#160; sont&#160;&#233;lecteurs les agents publics et les magistrats de l&#8217;ordre judiciaire ;</p><p>&#160;</p><p>b)&#160;&#160;&#160;&#160;&#160; sont &#233;ligibles, outre les organisations syndicales mentionn&#233;es &#224; l&#8217;article 9 bis de la loi du 13 juillet 1983 portant droits et obligations des fonctionnaires, les &#160;organisations syndicales mentionn&#233;es &#224; l'article 10-1 de l'ordonnance n&#176;58-1270 du 22 d&#233;cembre 1958 portant loi organique relative au statut de la magistrature.</p><p>Un d&#233;cret en Conseil d&#8217;Etat pr&#233;voit les conditions d&#8217;application du pr&#233;sent article.&#160;&#187;</p>",
    "exposeSommaire": "<p>Le projet de loi de transformation de la fonction publique pr&#233;voit, dans son article 3, la cr&#233;ation d&#8217;une instance unique pour d&#233;battre des sujets d&#8217;int&#233;r&#234;t collectif, le comit&#233; social d&#8217;administration, issu de la fusion du comit&#233; technique et du comit&#233; d&#8217;hygi&#232;ne, de s&#233;curit&#233; et des conditions de travail.</p><p>Toutefois, les magistrats, acteurs essentiels du service public de la justice et de l&#8217;encadrement sup&#233;rieur du minist&#232;re, ne peuvent participer aux d&#233;bats du comit&#233; social portant sur la politique de ressources humaines du minist&#232;re, d&#232;s lors qu&#8217;ils ne sont ni &#233;lecteurs ni &#233;ligibles aux &#233;lections professionnelles de la fonction publique.</p><p>Cet amendement a pour objet de donner aux magistrats judiciaires toute leur place dans le dialogue social du minist&#232;re de la justice, en leur permettant d&#8217;&#234;tre &#233;lecteurs et &#233;ligibles, comme les agents publics, aux comit&#233;s sociaux d&#8217;administration du minist&#232;re.</p>",
    "annexeExposeSommaire": {
      "@xmlns:xsi": "http://www.w3.org/2001/XMLSchema-instance",
      "@xsi:nil": "true"
    },
    "cartoucheDelaiDepotDepasse": "Sous réserve de son traitement par les services de l'Assemblée nationale et de sa recevabilité"
  },
  "representations": {
    "representation": {
      "nom": "PDF",
      "typeMime": {
        "type": "application",
        "subType": "PDF"
      },
      "statutRepresentation": {
        "verbatim": "true",
        "canonique": "true",
        "officielle": "true",
        "transcription": "false",
        "enregistrement": "false"
      },
      "repSource": {
        "@xmlns:xsi": "http://www.w3.org/2001/XMLSchema-instance",
        "@xsi:nil": "true"
      },
      "offset": {
        "@xmlns:xsi": "http://www.w3.org/2001/XMLSchema-instance",
        "@xsi:nil": "true"
      },
      "contenu": {
        "documentURI": "/15/amendements/1802/CION_LOIS/CL903.pdf"
      },
      "dateDispoRepresentation": {
        "@xmlns:xsi": "http://www.w3.org/2001/XMLSchema-instance",
        "@xsi:nil": "true"
      }
    }
  },
  "seanceDiscussion": {
    "@xmlns:xsi": "http://www.w3.org/2001/XMLSchema-instance",
    "@xsi:nil": "true"
  },
  "sort": {
    "@xmlns:xsi": "http://www.w3.org/2001/XMLSchema-instance",
    "@xsi:nil": "true"
  },
  "dateDepot": "2019-05-09T02:00:00.000+02:00",
  "dateDistribution": {
    "@xmlns:xsi": "http://www.w3.org/2001/XMLSchema-instance",
    "@xsi:nil": "true"
  },
  "article99": "0",
  "loiReference": {
    "codeLoi": {
      "@xmlns:xsi": "http://www.w3.org/2001/XMLSchema-instance",
      "@xsi:nil": "true"
    },
    "divisionCodeLoi": {
      "@xmlns:xsi": "http://www.w3.org/2001/XMLSchema-instance",
      "@xsi:nil": "true"
    }
  }
}