{
  "@xmlns": "http://schemas.assemblee-nationale.fr/referentiel",
  "uid": "AMANR5L15SEA717460BTC0164P0D1N109",
  "identifiant": {
    "legislature": "15",
    "numero": "109",
    "numRect": "0",
    "saisine": {
      "refTexteLegislatif": "PRJLANR5L15BTC0164",
      "numeroPartiePLF": "0",
      "organeExamen": "PO717460",
      "mentionSecondeDeliberation": "0"
    }
  },
  "numeroLong": "109",
  "etapeTexte": "1ère lecture (2ème assemblée saisie)",
  "triAmendement": "deu",
  "cardinaliteAmdtMultiples": "1",
  "amendementParent": {
    "@xmlns:xsi": "http://www.w3.org/2001/XMLSchema-instance",
    "@xsi:nil": "true"
  },
  "etat": "Discuté",
  "signataires": {
    "auteur": {
      "typeAuteur": "Depute",
      "acteurRef": "PA719558",
      "organeRef": {
        "@xmlns:xsi": "http://www.w3.org/2001/XMLSchema-instance",
        "@xsi:nil": "true"
      },
      "groupePolitiqueRef": "PO730970"
    },
    "cosignataires": {
      "acteurRef": [
        "PA721984",
        "PA719874",
        "PA719558",
        "PA720704",
        "PA721742",
        "PA720772"
      ]
    },
    "texteAffichable": "M.&#160;Balanant,  M.&#160;Bru, Mme&#160;Florennes, Mme&#160;Jacquier-Laforge, M.&#160;Latombe, Mme&#160;Vichnievsky et les membres du groupe du Mouvement D&#233;mocrate et apparent&#233;s"
  },
  "pointeurFragmentTexte": {
    "missionVisee": {
      "@xmlns:xsi": "http://www.w3.org/2001/XMLSchema-instance",
      "@xsi:nil": "true"
    },
    "division": {
      "titre": "Article 4",
      "articleDesignationCourte": "ART. 4",
      "type": "ARTICLE",
      "avant_A_Apres": "A",
      "divisionRattachee": "ARTICLE 4",
      "articleAdditionnel": {
        "@xmlns:xsi": "http://www.w3.org/2001/XMLSchema-instance",
        "@xsi:nil": "true"
      },
      "chapitreAdditionnel": {
        "@xmlns:xsi": "http://www.w3.org/2001/XMLSchema-instance",
        "@xsi:nil": "true"
      },
      "urlDivisionTexteVise": "/15/textes/0164.asp#D_Article_4"
    },
    "alinea": {
      "avant_A_Apres": {
        "@xmlns:xsi": "http://www.w3.org/2001/XMLSchema-instance",
        "@xsi:nil": "true"
      },
      "numero": "4",
      "alineaDesignation": {
        "@xmlns:xsi": "http://www.w3.org/2001/XMLSchema-instance",
        "@xsi:nil": "true"
      }
    }
  },
  "corps": {
    "dispositif": "<p style=\"text-align: justify;\">&#192; l&#8217;alin&#233;a&#160;4, apr&#232;s la deuxi&#232;me occurrence du mot&#160;:</p><p style=\"text-align: justify;\">&#171;&#160;Paris&#160;&#187;,</p><p style=\"text-align: justify;\">ins&#233;rer les mots&#160;:</p><p style=\"text-align: justify;\">&#171;&#160;qui peut se saisir prioritairement et d&#233;cider d&#8217;une perquisition judiciaire,&#160;&#187;</p>",
    "exposeSommaire": "<p style=\"text-align: justify;\">L&#8217;objet de cet amendement est de garantir la primaut&#233; des perquisitions judiciaires lorsqu&#8217;elles sont possibles afin de judiciariser les situations et les individus int&#233;ress&#233;s&#160;le plus t&#244;t possible, objectif que partagent les services de renseignement, les forces de l&#8217;ordre ainsi que les magistrats.</p><p style=\"text-align: justify;\">Permettre au procureur de la R&#233;publique de Paris de d&#233;cider d&#8217;une perquisition, en application de ces attributions pr&#233;vues par le code de proc&#233;dure p&#233;nale et notamment par l&#8217;article&#160;39&#8209;3 dudit code, lorsqu&#8217;il est inform&#233; pour avis, d&#8217;une saisine du juge des libert&#233;s et de la d&#233;tention, par le repr&#233;sentant de l&#8217;&#201;tat ou le pr&#233;fet, aux fins d&#8217;une &#171;&#160;visite et saisie&#160;&#187; pr&#233;ventive, r&#233;affirme la pr&#233;&#233;minence du juge judiciaire.</p>",
    "annexeExposeSommaire": {
      "@xmlns:xsi": "http://www.w3.org/2001/XMLSchema-instance",
      "@xsi:nil": "true"
    }
  },
  "representations": {
    "representation": {
      "nom": "PDF",
      "typeMime": {
        "type": "application",
        "subType": "PDF"
      },
      "statutRepresentation": {
        "verbatim": "true",
        "canonique": "true",
        "officielle": "true",
        "transcription": "false",
        "enregistrement": "false"
      },
      "repSource": {
        "@xmlns:xsi": "http://www.w3.org/2001/XMLSchema-instance",
        "@xsi:nil": "true"
      },
      "offset": {
        "@xmlns:xsi": "http://www.w3.org/2001/XMLSchema-instance",
        "@xsi:nil": "true"
      },
      "contenu": {
        "documentURI": "/15/amendements/0164/AN/109.pdf"
      },
      "dateDispoRepresentation": {
        "@xmlns:xsi": "http://www.w3.org/2001/XMLSchema-instance",
        "@xsi:nil": "true"
      }
    }
  },
  "seanceDiscussion": "RUANR5L15S2017IDS20672",
  "sort": {
    "dateSaisie": "2017-09-27T16:30:55.000+02:00",
    "sortEnSeance": "Retiré"
  },
  "dateDepot": "2017-09-20T02:00:00.000+02:00",
  "dateDistribution": "2017-09-22T02:00:00.000+02:00",
  "article99": "0",
  "loiReference": {
    "codeLoi": {
      "@xmlns:xsi": "http://www.w3.org/2001/XMLSchema-instance",
      "@xsi:nil": "true"
    },
    "divisionCodeLoi": {
      "@xmlns:xsi": "http://www.w3.org/2001/XMLSchema-instance",
      "@xsi:nil": "true"
    }
  }
}