{
  "@xmlns": "http://schemas.assemblee-nationale.fr/referentiel",
  "uid": "AMANR5L15PO419604B1481P0D1N69",
  "identifiant": {
    "legislature": "15",
    "numero": "69",
    "numRect": "0",
    "saisine": {
      "refTexteLegislatif": "PRJLANR5L15B1481",
      "numeroPartiePLF": "0",
      "organeExamen": "PO419604",
      "mentionSecondeDeliberation": "0"
    }
  },
  "numeroLong": "AC69",
  "etapeTexte": "1ère lecture (1ère assemblée saisie)",
  "triAmendement": "adaaaaaaaaaaaaaaaaaaaaaaaaaaaaaaaaaaaaaaaaaaaaaaaayo",
  "cardinaliteAmdtMultiples": "1",
  "amendementParent": {
    "@xmlns:xsi": "http://www.w3.org/2001/XMLSchema-instance",
    "@xsi:nil": "true"
  },
  "etat": "Discuté",
  "signataires": {
    "auteur": {
      "typeAuteur": "Depute",
      "acteurRef": "PA330008",
      "organeRef": {
        "@xmlns:xsi": "http://www.w3.org/2001/XMLSchema-instance",
        "@xsi:nil": "true"
      },
      "groupePolitiqueRef": "PO730934"
    },
    "cosignataires": {
      "acteurRef": "PA330008"
    },
    "texteAffichable": "M.&#160;Breton"
  },
  "pointeurFragmentTexte": {
    "missionVisee": {
      "@xmlns:xsi": "http://www.w3.org/2001/XMLSchema-instance",
      "@xsi:nil": "true"
    },
    "division": {
      "titre": "Article PREMIER",
      "articleDesignationCourte": "ART. PREMIER",
      "type": "ARTICLE",
      "avant_A_Apres": "A",
      "divisionRattachee": "ARTICLE PREMIER",
      "articleAdditionnel": {
        "@xmlns:xsi": "http://www.w3.org/2001/XMLSchema-instance",
        "@xsi:nil": "true"
      },
      "chapitreAdditionnel": {
        "@xmlns:xsi": "http://www.w3.org/2001/XMLSchema-instance",
        "@xsi:nil": "true"
      },
      "urlDivisionTexteVise": "/15/textes/1481.asp#D_Article_1er"
    },
    "alinea": {
      "avant_A_Apres": "Apres",
      "numero": "2",
      "alineaDesignation": {
        "@xmlns:xsi": "http://www.w3.org/2001/XMLSchema-instance",
        "@xsi:nil": "true"
      }
    }
  },
  "corps": {
    "dispositif": "<p style=\"text-align: justify;\">Compl&#233;ter cet article par les deux alin&#233;as suivants&#160;:</p><p style=\"text-align: justify;\">&#171;&#160;Le Parlement vote chaque ann&#233;e en loi de finances les moyens n&#233;cessaires, en termes de cr&#233;ation de postes, &#224; la mise en place d&#8217;une politique ambitieuse pour l&#8217;&#233;cole, tout en consid&#233;rant que la r&#233;ussite d&#8217;une telle politique ne se mesure pas en nombre de postes ouverts.</p><p style=\"text-align: justify;\">&#171;&#160;Une r&#233;flexion est men&#233;e sur la mani&#232;re dont on peut red&#233;ployer les moyens engag&#233;s, notamment en faveur de l&#8217;enseignement du premier degr&#233;, du nombre et de la r&#233;mun&#233;ration des enseignants des &#233;tablissements situ&#233;s dans les territoires les plus en difficult&#233;, ainsi que la revalorisation du m&#233;tier des enseignants.&#160;&#187;</p>",
    "exposeSommaire": "<p style=\"text-align: justify;\">La plupart des experts, notamment ceux qui font des comparaisons internationales, estiment qu&#8217;il n&#8217;y a pas de corr&#233;lation entre augmentation des moyens et am&#233;lioration d&#8217;un syst&#232;me &#233;ducatif. Les moyens financiers de notre pays en mati&#232;re d&#8217;&#233;ducation sont consid&#233;rables et l&#8217;on pourrait faire beaucoup mieux &#224; moyens constants.</p><p>En outre, la France a un niveau de salaire des enseignants nettement inf&#233;rieur &#224; la moyenne des pays de l&#8217;OCDE en d&#233;but et milieu de carri&#232;re&#8230; En effet, dans notre pays, les enseignants d&#233;butants et apr&#232;s 15 ans d&#8217;exercice sont bien moins r&#233;mun&#233;r&#233;s par rapport &#224; la moyenne des pays de l&#8217;OCDE.</p><p>Il est n&#233;cessaire d'aller plus loin.</p>",
    "annexeExposeSommaire": {
      "@xmlns:xsi": "http://www.w3.org/2001/XMLSchema-instance",
      "@xsi:nil": "true"
    },
    "cartoucheDelaiDepotDepasse": {
      "@xmlns:xsi": "http://www.w3.org/2001/XMLSchema-instance",
      "@xsi:nil": "true"
    }
  },
  "representations": {
    "representation": {
      "nom": "PDF",
      "typeMime": {
        "type": "application",
        "subType": "PDF"
      },
      "statutRepresentation": {
        "verbatim": "true",
        "canonique": "true",
        "officielle": "true",
        "transcription": "false",
        "enregistrement": "false"
      },
      "repSource": {
        "@xmlns:xsi": "http://www.w3.org/2001/XMLSchema-instance",
        "@xsi:nil": "true"
      },
      "offset": {
        "@xmlns:xsi": "http://www.w3.org/2001/XMLSchema-instance",
        "@xsi:nil": "true"
      },
      "contenu": {
        "documentURI": "/15/amendements/1481/CION-CEDU/AC69.pdf"
      },
      "dateDispoRepresentation": {
        "@xmlns:xsi": "http://www.w3.org/2001/XMLSchema-instance",
        "@xsi:nil": "true"
      }
    }
  },
  "seanceDiscussion": {
    "@xmlns:xsi": "http://www.w3.org/2001/XMLSchema-instance",
    "@xsi:nil": "true"
  },
  "sort": {
    "dateSaisie": "2019-01-29T21:42:23.000+01:00",
    "sortEnSeance": "Non soutenu"
  },
  "dateDepot": "2019-01-23T01:00:00.000+01:00",
  "dateDistribution": "2019-01-29T01:00:00.000+01:00",
  "article99": "0",
  "loiReference": {
    "codeLoi": {
      "@xmlns:xsi": "http://www.w3.org/2001/XMLSchema-instance",
      "@xsi:nil": "true"
    },
    "divisionCodeLoi": {
      "@xmlns:xsi": "http://www.w3.org/2001/XMLSchema-instance",
      "@xsi:nil": "true"
    }
  }
}