{
  "@xmlns": "http://schemas.assemblee-nationale.fr/referentiel",
  "uid": "AMANR5L15SEA717460BTC0902P0D1N1005",
  "identifiant": {
    "legislature": "15",
    "numero": "1005",
    "numRect": "0",
    "saisine": {
      "refTexteLegislatif": "PRJLANR5L15BTC0902",
      "numeroPartiePLF": "0",
      "organeExamen": "PO717460",
      "mentionSecondeDeliberation": "0"
    }
  },
  "numeroLong": "1005",
  "etapeTexte": "1ère lecture (1ère assemblée saisie)",
  "triAmendement": "bjzi",
  "cardinaliteAmdtMultiples": "1",
  "amendementParent": {
    "@xmlns:xsi": "http://www.w3.org/2001/XMLSchema-instance",
    "@xsi:nil": "true"
  },
  "etat": "Discuté",
  "signataires": {
    "auteur": {
      "typeAuteur": "Depute",
      "acteurRef": "PA267289",
      "organeRef": {
        "@xmlns:xsi": "http://www.w3.org/2001/XMLSchema-instance",
        "@xsi:nil": "true"
      },
      "groupePolitiqueRef": "PO730934"
    },
    "cosignataires": {
      "acteurRef": "PA267289"
    },
    "texteAffichable": "M.&#160;Door"
  },
  "pointeurFragmentTexte": {
    "missionVisee": {
      "@xmlns:xsi": "http://www.w3.org/2001/XMLSchema-instance",
      "@xsi:nil": "true"
    },
    "division": {
      "titre": "Article 14 septies",
      "articleDesignationCourte": "ART. 14 SEPTIES",
      "type": "ARTICLE",
      "avant_A_Apres": "A",
      "divisionRattachee": "ARTICLE 14 SEPTIES",
      "articleAdditionnel": {
        "@xmlns:xsi": "http://www.w3.org/2001/XMLSchema-instance",
        "@xsi:nil": "true"
      },
      "chapitreAdditionnel": {
        "@xmlns:xsi": "http://www.w3.org/2001/XMLSchema-instance",
        "@xsi:nil": "true"
      },
      "urlDivisionTexteVise": "/15/textes/0902.asp#D_Article_14_septies"
    },
    "alinea": {
      "@xmlns:xsi": "http://www.w3.org/2001/XMLSchema-instance",
      "@xsi:nil": "true"
    }
  },
  "corps": {
    "dispositif": "<p style=\"text-align: justify;\">Apr&#232;s la seconde occurrence du mot&#160;:</p><p style=\"text-align: justify;\">&#171;&#160;mots&#160;&#187;,</p><p style=\"text-align: justify;\">ins&#233;rer les mots&#160;:</p><p style=\"text-align: justify;\">&#171;&#160;plus pr&#233;cis&#233;ment les substances suivantes&#160;: le thiam&#233;toxame, l&#8217;imidacloprid et le clothianidine&#160;&#187;.</p>",
    "exposeSommaire": "<p style=\"text-align: justify;\">Le 22 F&#233;vrier 2018, le Pr&#233;sident de la R&#233;publique, Emmanuel Macron, s&#8217;est engag&#233; &#224; l&#8217;Elys&#233;e devant 1000 jeunes agriculteurs en d&#233;clarant&#160;: &#171;&#160;Jamais je ne demanderai &#224; quelqu&#8217;un d&#8217;abandonner une pratique productive si elle lui fait perdre de l&#8217;argent ou qu&#8217;il n&#8217;y a pas une vraie substitution qui lui garantit qu&#8217;il peut tout &#224; fait vivre du prix pay&#233; [&#8230;]&#160;&#187;&#160;.</p><p style=\"text-align: justify;\">L&#8217;Union&#160;europ&#233;enne a vot&#233;, le 27 Avril 2018, l&#8217;interdiction de trois n&#233;onicotino&#239;des. Or, lors des d&#233;bats en Commission des Affaires &#233;conomiques sur le projet de loi pour l&#8217;&#233;quilibre des relations commerciales dans le secteur agricole et alimentaire et une alimentation saine et durable, la disposition vot&#233;e est beaucoup plus large que l&#8217;interdiction de ces trois n&#233;onicotino&#239;des.</p><p style=\"text-align: justify;\">Il s&#8217;agit ici de ne pas sur-l&#233;gif&#233;rer, de ne pas imposer &#224; nos agriculteurs des r&#232;gles plus drastiques que dans le reste de l&#8217;Europe. Car cela cr&#233;erait in&#233;vitablement de nouvelles distorsions de concurrence, dont la France n&#8217;a pas besoin. En outre, la r&#233;daction de la disposition, vot&#233;e en Commission le 27 Avril, serait contraire &#224; la promesse du Pr&#233;sident de la R&#233;publique, car elle supprimerait de facto toute alternative &#224; l&#8217;usage des n&#233;onicotino&#239;des.</p><p style=\"text-align: justify;\">La loi pour la reconqu&#234;te de la Biodiversit&#233;, vot&#233;e en 2016, pr&#233;voyait l&#8217;interdiction d&#8217;utiliser l&#8217;ensemble des produits de la famille des n&#233;onicotino&#239;des, &#224; compter du 1<sup>er</sup> septembre 2018, hormis les d&#233;rogations possibles jusqu&#8217;au 1er Juillet 2020, sur la base d&#8217;&#233;valuation fournies par l&#8217;Anses&#160;comparant les risques et les b&#233;n&#233;fices de ces produits et de leurs alternatives possibles.</p><p style=\"text-align: justify;\">En effet, seules les autorit&#233;s comp&#233;tentes sont en capacit&#233; de d&#233;terminer le risque acceptable ou non de ces substances sur l&#8217;homme et la biodiversit&#233;.</p><p style=\"text-align: justify;\">Aussi, s&#8217;il convient de se mettre en conformit&#233; imm&#233;diate avec le droit&#160;europ&#233;en sur des substances aux risques av&#233;r&#233;s, le l&#233;gislateur ne peut se permettre d&#8217;&#233;tendre des interdictions sous couvert de cr&#233;er - par l&#8217;interpr&#233;tation juridique d&#8217;une telle disposition - une ins&#233;curit&#233; juridique pour le r&#233;gime des autorisations de mises sur le march&#233; et le bon fonctionnement du travail scientifique de l&#8217;ANSES, notamment.</p>",
    "annexeExposeSommaire": {
      "@xmlns:xsi": "http://www.w3.org/2001/XMLSchema-instance",
      "@xsi:nil": "true"
    }
  },
  "representations": {
    "representation": {
      "nom": "PDF",
      "typeMime": {
        "type": "application",
        "subType": "PDF"
      },
      "statutRepresentation": {
        "verbatim": "true",
        "canonique": "true",
        "officielle": "true",
        "transcription": "false",
        "enregistrement": "false"
      },
      "repSource": {
        "@xmlns:xsi": "http://www.w3.org/2001/XMLSchema-instance",
        "@xsi:nil": "true"
      },
      "offset": {
        "@xmlns:xsi": "http://www.w3.org/2001/XMLSchema-instance",
        "@xsi:nil": "true"
      },
      "contenu": {
        "documentURI": "/15/amendements/0902/AN/1005.pdf"
      },
      "dateDispoRepresentation": {
        "@xmlns:xsi": "http://www.w3.org/2001/XMLSchema-instance",
        "@xsi:nil": "true"
      }
    }
  },
  "seanceDiscussion": "RUANR5L15S2018IDS21058",
  "sort": {
    "dateSaisie": "2018-05-29T00:47:42.000+02:00",
    "sortEnSeance": "Tombé"
  },
  "dateDepot": "2018-05-16T02:00:00.000+02:00",
  "dateDistribution": "2018-05-22T02:00:00.000+02:00",
  "article99": "0",
  "loiReference": {
    "codeLoi": {
      "@xmlns:xsi": "http://www.w3.org/2001/XMLSchema-instance",
      "@xsi:nil": "true"
    },
    "divisionCodeLoi": {
      "@xmlns:xsi": "http://www.w3.org/2001/XMLSchema-instance",
      "@xsi:nil": "true"
    }
  }
}