{
  "@xmlns": "http://schemas.assemblee-nationale.fr/referentiel",
  "uid": "AMANR5L15PO59048B1255P2D1N89",
  "identifiant": {
    "legislature": "15",
    "numero": "89",
    "numRect": "0",
    "saisine": {
      "refTexteLegislatif": "PRJLANR5L15B1255",
      "numeroPartiePLF": "2",
      "organeExamen": "PO59048",
      "mentionSecondeDeliberation": "0"
    }
  },
  "numeroLong": "II-CF89",
  "etapeTexte": "1ère lecture (1ère assemblée saisie)",
  "triAmendement": "jfaaaaaaaaaaaaaaaaaaaaaaaaaaaaaaaaaaaaaaaaaaaaaaaady",
  "cardinaliteAmdtMultiples": "1",
  "amendementParent": {
    "@xmlns:xsi": "http://www.w3.org/2001/XMLSchema-instance",
    "@xsi:nil": "true"
  },
  "etat": "Discuté",
  "signataires": {
    "auteur": {
      "typeAuteur": "Depute",
      "acteurRef": "PA721054",
      "organeRef": {
        "@xmlns:xsi": "http://www.w3.org/2001/XMLSchema-instance",
        "@xsi:nil": "true"
      },
      "groupePolitiqueRef": "PO730934"
    },
    "cosignataires": {
      "acteurRef": "PA721054"
    },
    "texteAffichable": "M.&#160;Lorion"
  },
  "pointeurFragmentTexte": {
    "missionVisee": {
      "@xmlns:xsi": "http://www.w3.org/2001/XMLSchema-instance",
      "@xsi:nil": "true"
    },
    "division": {
      "titre": "Article 55",
      "articleDesignationCourte": "ART. 55",
      "type": "ARTICLE",
      "avant_A_Apres": "A",
      "divisionRattachee": "ARTICLE 55",
      "articleAdditionnel": {
        "@xmlns:xsi": "http://www.w3.org/2001/XMLSchema-instance",
        "@xsi:nil": "true"
      },
      "chapitreAdditionnel": {
        "@xmlns:xsi": "http://www.w3.org/2001/XMLSchema-instance",
        "@xsi:nil": "true"
      },
      "urlDivisionTexteVise": "/15/textes/1255C.asp#D_Article_55"
    },
    "alinea": {
      "avant_A_Apres": {
        "@xmlns:xsi": "http://www.w3.org/2001/XMLSchema-instance",
        "@xsi:nil": "true"
      },
      "numero": "33",
      "alineaDesignation": {
        "@xmlns:xsi": "http://www.w3.org/2001/XMLSchema-instance",
        "@xsi:nil": "true"
      }
    }
  },
  "corps": {
    "dispositif": "<p style=\"text-align: justify;\">I.&#160;&#8211;&#160;Supprimer l&#8217;alin&#233;a&#160;33.</p><p style=\"text-align: justify;\">II.&#160;&#8211;&#160;&#192; l&#8217;alin&#233;a&#160;34, supprimer les mots&#160;: </p><p style=\"text-align: justify;\">&#171;&#160;dans le d&#233;partement dans lequel l&#8217;investissement est r&#233;alis&#233;.&#160;&#187;</p>",
    "exposeSommaire": "<p>Conform&#233;ment aux engagements pris &#224; l'issue des assises de l'outre-mer, l'article 55 du projet de loi de finances pour 2019 proroge jusqu'au 31 d&#233;cembre 2025 l'ensemble des dispositifs d'investissement outre-mer r&#233;serv&#233;s aux entreprises. Seraient ainsi concern&#233;s la r&#233;duction d'imp&#244;t pr&#233;vue &#224; l'article 199 undecies B du CGI, la d&#233;duction d'imp&#244;t pr&#233;vue aux articles 217 undecies et 217 duodecies, le cr&#233;dit d'imp&#244;t productif vis&#233; &#224; l'article 244 quater W et enfin le cr&#233;dit d'imp&#244;t en faveur du logement social pr&#233;vu &#224; l'article 244 quater X.</p><p>N&#233;anmoins, le cr&#233;dit d'imp&#244;t pour investissements productifs r&#233;alis&#233;s en outre-mer pr&#233;vu &#224; l'article 244 quater W du CGI serait recentr&#233; pour que l'int&#233;gralit&#233; de l'avantage fiscal b&#233;n&#233;ficie effectivement aux seuls exploitants ultramarins.</p><p>Cette nouvelle &#233;criture du dispositif op&#232;re une confusion compl&#232;te entre l'exploitant et l'investisseur ce qui peut avoir pour effet de rendre le dispositif contre-productif. En pratique, le cr&#233;dit d'imp&#244;t issu des investissements via des soci&#233;t&#233;s de personnes ne serait applicable aux investisseurs redevables de l'imp&#244;t soci&#233;t&#233; qu'&#224; la seule condition que ces derniers exercent leur activit&#233; dans un secteur &#233;ligible et, de surcro&#238;t, dans le d&#233;partement dans lequel l'investissement est r&#233;alis&#233;. De fait, l'obligation de localisation qui aurait d&#251; &#234;tre sur l'exploitant se trouve transport&#233; &#224; tort sur l'investisseur. Si cette approche peut &#234;tre louable, elle aura malheureusement pour effet de r&#233;duire l'&#233;ventail des associ&#233;s de soci&#233;t&#233; en nom collectif aux seules entreprises locales et d'interdire l'afflux de financement ext&#233;rieurs qui jusqu'alors soutenait les investissements locaux.</p><p>Pour garantir l&#8217;attractivit&#233; de l&#8217;outre-mer et continuer &#224; attirer des investisseurs, il est n&#233;cessaire de les encourager, c&#8217;est pourquoi il est propos&#233; de revenir sur cette restriction.</p>",
    "annexeExposeSommaire": {
      "@xmlns:xsi": "http://www.w3.org/2001/XMLSchema-instance",
      "@xsi:nil": "true"
    }
  },
  "representations": {
    "representation": {
      "nom": "PDF",
      "typeMime": {
        "type": "application",
        "subType": "PDF"
      },
      "statutRepresentation": {
        "verbatim": "true",
        "canonique": "true",
        "officielle": "true",
        "transcription": "false",
        "enregistrement": "false"
      },
      "repSource": {
        "@xmlns:xsi": "http://www.w3.org/2001/XMLSchema-instance",
        "@xsi:nil": "true"
      },
      "offset": {
        "@xmlns:xsi": "http://www.w3.org/2001/XMLSchema-instance",
        "@xsi:nil": "true"
      },
      "contenu": {
        "documentURI": "/15/amendements/1255C/CION_FIN/CF89.pdf"
      },
      "dateDispoRepresentation": {
        "@xmlns:xsi": "http://www.w3.org/2001/XMLSchema-instance",
        "@xsi:nil": "true"
      }
    }
  },
  "seanceDiscussion": {
    "@xmlns:xsi": "http://www.w3.org/2001/XMLSchema-instance",
    "@xsi:nil": "true"
  },
  "sort": {
    "dateSaisie": "2018-11-07T15:42:16.000+01:00",
    "sortEnSeance": "Non soutenu"
  },
  "dateDepot": "2018-10-17T02:00:00.000+02:00",
  "dateDistribution": "2018-11-06T01:00:00.000+01:00",
  "article99": "0",
  "loiReference": {
    "codeLoi": {
      "@xmlns:xsi": "http://www.w3.org/2001/XMLSchema-instance",
      "@xsi:nil": "true"
    },
    "divisionCodeLoi": {
      "@xmlns:xsi": "http://www.w3.org/2001/XMLSchema-instance",
      "@xsi:nil": "true"
    }
  }
}