{
  "@xmlns": "http://schemas.assemblee-nationale.fr/referentiel",
  "uid": "AMANR5L15SEA717460BTC2243P0D1N679",
  "identifiant": {
    "legislature": "15",
    "numero": "679",
    "numRect": "0",
    "saisine": {
      "refTexteLegislatif": "PRJLANR5L15BTC2243",
      "numeroPartiePLF": "0",
      "organeExamen": "PO717460",
      "mentionSecondeDeliberation": "0"
    }
  },
  "numeroLong": "679",
  "etapeTexte": "1ère lecture (1ère assemblée saisie)",
  "triAmendement": "acaaaaaaaaaaaaaaaaaaaaaaaaaaaaaaaaaaaaaaaaaaaaaaaahbzds",
  "cardinaliteAmdtMultiples": "1",
  "amendementParent": {
    "@xmlns:xsi": "http://www.w3.org/2001/XMLSchema-instance",
    "@xsi:nil": "true"
  },
  "etat": "Retiré",
  "signataires": {
    "auteur": {
      "typeAuteur": "Depute",
      "acteurRef": "PA1874",
      "organeRef": {
        "@xmlns:xsi": "http://www.w3.org/2001/XMLSchema-instance",
        "@xsi:nil": "true"
      },
      "groupePolitiqueRef": "PO730934"
    },
    "cosignataires": {
      "acteurRef": [
        "PA722390",
        "PA266776",
        "PA719318",
        "PA609726",
        "PA608016",
        "PA2492",
        "PA643134",
        "PA330684",
        "PA1874"
      ]
    },
    "texteAffichable": "M.&#160;Le Fur,  Mme&#160;Anthoine, Mme&#160;Val&#233;rie&#160;Boyer, Mme&#160;Corneloup, Mme&#160;Louwagie, M.&#160;Quentin, M.&#160;Reiss, Mme&#160;Valentin et M.&#160;Aubert"
  },
  "pointeurFragmentTexte": {
    "missionVisee": {
      "@xmlns:xsi": "http://www.w3.org/2001/XMLSchema-instance",
      "@xsi:nil": "true"
    },
    "division": {
      "titre": "Article PREMIER",
      "articleDesignationCourte": "ART. PREMIER",
      "type": "ARTICLE",
      "avant_A_Apres": "A",
      "divisionRattachee": "ARTICLE PREMIER",
      "articleAdditionnel": {
        "@xmlns:xsi": "http://www.w3.org/2001/XMLSchema-instance",
        "@xsi:nil": "true"
      },
      "chapitreAdditionnel": {
        "@xmlns:xsi": "http://www.w3.org/2001/XMLSchema-instance",
        "@xsi:nil": "true"
      },
      "urlDivisionTexteVise": "/15/textes/2243.asp#D_Article_1er"
    },
    "alinea": {
      "avant_A_Apres": {
        "@xmlns:xsi": "http://www.w3.org/2001/XMLSchema-instance",
        "@xsi:nil": "true"
      },
      "numero": "26",
      "alineaDesignation": {
        "@xmlns:xsi": "http://www.w3.org/2001/XMLSchema-instance",
        "@xsi:nil": "true"
      }
    }
  },
  "corps": {
    "dispositif": "<p style=\"text-align: justify;\">&#192; la fin de la deuxi&#232;me phrase de l&#8217;alin&#233;a&#160;26, substituer aux mots&#160;:</p><p>&#171;&#160;ou de la femme non mari&#233;e concern&#233;s&#160;&#187;</p><p>le mot&#160;:</p><p>&#171;&#160;concern&#233;&#160;&#187;.</p>",
    "exposeSommaire": "<p style=\"text-align: justify;\">Ce projet de loi pr&#233;voit d&#8217;&#233;tendre l&#8217;AMP aux femmes c&#233;libataires.</p><p style=\"text-align: justify;\">Toutes les &#233;tudes tendent &#224; montrer que les familles monoparentales sont plus pr&#233;caires financi&#232;rement.</p><p style=\"text-align: justify;\">Un rapport de l&#8217;Observatoire des in&#233;galit&#233;s a r&#233;cemment r&#233;v&#233;l&#233; que ces familles constituent un quart de la population pauvre.</p><p style=\"text-align: justify;\">Quand les s&#233;parations entra&#238;nent une chute du niveau de vie de 3&#160;% pour les hommes, c&#8217;est 22&#160;% pour les femmes, qui occupent en majorit&#233; les emplois pr&#233;caires (CDD et temps partiels).</p><p style=\"text-align: justify;\">Dans le cadre de ces d&#233;placements en r&#233;gions, Emmanuel Macron a estim&#233; que le Gouvernement pouvait &#171;&#160;sans doute aller plus loin&#160;&#187; pour soutenir le quotidien de ces &#171;&#160;femmes de courage&#160;&#187;.</p><p style=\"text-align: justify;\">Face &#224; ce constat et &#224; l&#8217;augmentation constante de ces familles monoparentales, le Gouvernement r&#233;fl&#233;chit &#224; de nouvelles mesures en plus des dispositifs existants notamment dans le plan pauvret&#233;.</p><p style=\"text-align: justify;\">Il para&#238;t alors contradictoire de pr&#233;voir par ce projet de loi d&#8217;&#233;largir la procr&#233;ation aux femmes c&#233;libataires alors que le gouvernent prend des dispositions pour venir en aide aux familles monoparentales pour r&#233;duire leur fragilit&#233;.</p><p style=\"text-align: justify;\">&#160;</p><p style=\"text-align: justify;\">&#160;</p>",
    "annexeExposeSommaire": {
      "@xmlns:xsi": "http://www.w3.org/2001/XMLSchema-instance",
      "@xsi:nil": "true"
    },
    "cartoucheDelaiDepotDepasse": {
      "@xmlns:xsi": "http://www.w3.org/2001/XMLSchema-instance",
      "@xsi:nil": "true"
    },
    "avantAppel": {
      "@xmlns:xsi": "http://www.w3.org/2001/XMLSchema-instance",
      "@xsi:nil": "true"
    }
  },
  "representations": {
    "representation": {
      "nom": "PDF",
      "typeMime": {
        "type": "application",
        "subType": "PDF"
      },
      "statutRepresentation": {
        "verbatim": "true",
        "canonique": "true",
        "officielle": "true",
        "transcription": "false",
        "enregistrement": "false"
      },
      "repSource": {
        "@xmlns:xsi": "http://www.w3.org/2001/XMLSchema-instance",
        "@xsi:nil": "true"
      },
      "offset": {
        "@xmlns:xsi": "http://www.w3.org/2001/XMLSchema-instance",
        "@xsi:nil": "true"
      },
      "contenu": {
        "documentURI": "/15/amendements/2243/AN/679.pdf"
      },
      "dateDispoRepresentation": {
        "@xmlns:xsi": "http://www.w3.org/2001/XMLSchema-instance",
        "@xsi:nil": "true"
      }
    }
  },
  "seanceDiscussion": {
    "@xmlns:xsi": "http://www.w3.org/2001/XMLSchema-instance",
    "@xsi:nil": "true"
  },
  "sort": {
    "@xmlns:xsi": "http://www.w3.org/2001/XMLSchema-instance",
    "@xsi:nil": "true"
  },
  "dateDepot": "2019-09-17T02:00:00.000+02:00",
  "dateDistribution": "2019-09-20T02:00:00.000+02:00",
  "article99": "0",
  "loiReference": {
    "codeLoi": {
      "@xmlns:xsi": "http://www.w3.org/2001/XMLSchema-instance",
      "@xsi:nil": "true"
    },
    "divisionCodeLoi": {
      "@xmlns:xsi": "http://www.w3.org/2001/XMLSchema-instance",
      "@xsi:nil": "true"
    }
  }
}