{
  "@xmlns": "http://schemas.assemblee-nationale.fr/referentiel",
  "uid": "AMANR5L15SEA717460BTC1974P0D1N522",
  "identifiant": {
    "legislature": "15",
    "numero": "522",
    "numRect": "0",
    "saisine": {
      "refTexteLegislatif": "PRJLANR5L15BTC1974",
      "numeroPartiePLF": "0",
      "organeExamen": "PO717460",
      "mentionSecondeDeliberation": "0"
    }
  },
  "numeroLong": "522",
  "etapeTexte": "1ère lecture (2ème assemblée saisie)",
  "triAmendement": "adcaaaaaaaaaaaaaaaaaaaaaaaaaaaaaaaaaaaaaaaaaaaaaaaagohu",
  "cardinaliteAmdtMultiples": "1",
  "amendementParent": {
    "@xmlns:xsi": "http://www.w3.org/2001/XMLSchema-instance",
    "@xsi:nil": "true"
  },
  "etat": "Discuté",
  "signataires": {
    "auteur": {
      "typeAuteur": "Depute",
      "acteurRef": "PA605991",
      "organeRef": {
        "@xmlns:xsi": "http://www.w3.org/2001/XMLSchema-instance",
        "@xsi:nil": "true"
      },
      "groupePolitiqueRef": "PO730934"
    },
    "cosignataires": {
      "acteurRef": [
        "PA720586",
        "PA608826",
        "PA2155",
        "PA605991",
        "PA2377",
        "PA712015",
        "PA642847",
        "PA334149",
        "PA332523",
        "PA718780",
        "PA718784",
        "PA856",
        "PA720386",
        "PA336316"
      ]
    },
    "texteAffichable": "Mme&#160;Genevard,  Mme&#160;Duby-Muller, Mme&#160;Trastour-Isnart, M.&#160;Fasquelle, M.&#160;Menuel, M.&#160;Pauget, M.&#160;Perrut, M.&#160;Dive, M.&#160;Bazin, Mme&#160;Dalloz, M.&#160;Bouchet, M.&#160;Cherpion, M.&#160;Di Filippo et M.&#160;Vatin"
  },
  "pointeurFragmentTexte": {
    "missionVisee": {
      "@xmlns:xsi": "http://www.w3.org/2001/XMLSchema-instance",
      "@xsi:nil": "true"
    },
    "division": {
      "titre": "Article PREMIER",
      "articleDesignationCourte": "ART. PREMIER",
      "type": "ARTICLE",
      "avant_A_Apres": "A",
      "divisionRattachee": "ARTICLE PREMIER",
      "articleAdditionnel": {
        "@xmlns:xsi": "http://www.w3.org/2001/XMLSchema-instance",
        "@xsi:nil": "true"
      },
      "chapitreAdditionnel": {
        "@xmlns:xsi": "http://www.w3.org/2001/XMLSchema-instance",
        "@xsi:nil": "true"
      },
      "urlDivisionTexteVise": "/15/textes/1974.asp#D_Article_1er"
    },
    "alinea": {
      "avant_A_Apres": {
        "@xmlns:xsi": "http://www.w3.org/2001/XMLSchema-instance",
        "@xsi:nil": "true"
      },
      "numero": "5",
      "alineaDesignation": {
        "@xmlns:xsi": "http://www.w3.org/2001/XMLSchema-instance",
        "@xsi:nil": "true"
      }
    }
  },
  "corps": {
    "dispositif": "<p>&#192; l&#8217;alin&#233;a&#160;5, substituer au mot&#160;:</p><p style=\"text-align: justify;\">&#171;&#160;transfrontaliers&#160;&#187;</p><p style=\"text-align: justify;\">les mots&#160;:</p><p style=\"text-align: justify;\">&#171;&#160;des territoires frontaliers en termes de mobilit&#233; routi&#232;re et ferroviaire&#160;&#187;.</p>",
    "exposeSommaire": "<p>Cet amendement vise &#224; inscrire parmi les objectifs de la programmation des infrastructures l&#8217;importance des liaisons &#224; caract&#232;re international pour le transport routier et ferroviaire.</p><p style=\"text-align: justify;\">La population de l&#8217;Arc jurassien se bat actuellement pour mettre en lumi&#232;re ces liaisons notamment dans le cadre des difficult&#233;s qu&#8217;elle rencontre avec la soci&#233;t&#233; LYRIA, filiale de la SNCF. En effet, LYRIA souhaite supprimer la quatri&#232;me desserte de la liaison ferroviaire Paris-Lausanne via notamment la gare de Frasne dans le Doubs.</p><p style=\"text-align: justify;\">Cette d&#233;cision est totalement contraire aux objectifs poursuivis par la pr&#233;sente loi, c&#8217;est-&#224;-dire un d&#233;senclavement des territoires de montagne et frontaliers.</p><p style=\"text-align: justify;\">Cette d&#233;cision serait, en outre, contraire aux&#160;missions qui ont &#233;t&#233; confi&#233;es &#224; la SNCF&#160;par la loi &#171;&#160;pour un nouveau pacte ferroviaire&#160;&#187; qui a &#233;t&#233; vot&#233;e au Parlement en juin 2018 et notamment celle d&#8217;assurer &#171;&#160;le d&#233;veloppement, l&#8217;am&#233;nagement, la coh&#233;rence et la mise en valeur du r&#233;seau ferr&#233; national&#160;&#187;.</p><p style=\"text-align: justify;\">Bien que les trois autres courses soient maintenues&#160;&#8211;&#160;avec des changements partiels d&#8217;horaires&#160;&#8211;&#160;avec les connexions RegioExpress entre Neuch&#226;tel-Travers-Pontarlier-Frasne-Paris, les collectivit&#233;s et associations consid&#232;rent toutes que cette suppression est une double peine&#160;: non seulement une perte de desserte est un signal tr&#232;s n&#233;gatif pour l&#8217;attractivit&#233; des territoires. Mais les horaires inadapt&#233;s aux besoins des usagers comportent un risque majeur de fragilisation des dessertes qui sont maintenues et peuvent &#224; terme pr&#233;senter un risque pour la p&#233;rennit&#233; de la ligne.</p><p style=\"text-align: justify;\">L&#8217;ensemble du Massif transfrontalier sera fortement fragilis&#233; par cette d&#233;gradation qui amorce le contournement de la Bourgogne-Franche-Comt&#233;, ce qui ne peut qu&#8217;entretenir le sentiment d&#8217;abandon des populations.</p>",
    "annexeExposeSommaire": {
      "@xmlns:xsi": "http://www.w3.org/2001/XMLSchema-instance",
      "@xsi:nil": "true"
    },
    "cartoucheDelaiDepotDepasse": {
      "@xmlns:xsi": "http://www.w3.org/2001/XMLSchema-instance",
      "@xsi:nil": "true"
    }
  },
  "representations": {
    "representation": {
      "nom": "PDF",
      "typeMime": {
        "type": "application",
        "subType": "PDF"
      },
      "statutRepresentation": {
        "verbatim": "true",
        "canonique": "true",
        "officielle": "true",
        "transcription": "false",
        "enregistrement": "false"
      },
      "repSource": {
        "@xmlns:xsi": "http://www.w3.org/2001/XMLSchema-instance",
        "@xsi:nil": "true"
      },
      "offset": {
        "@xmlns:xsi": "http://www.w3.org/2001/XMLSchema-instance",
        "@xsi:nil": "true"
      },
      "contenu": {
        "documentURI": "/15/amendements/1974/AN/522.pdf"
      },
      "dateDispoRepresentation": {
        "@xmlns:xsi": "http://www.w3.org/2001/XMLSchema-instance",
        "@xsi:nil": "true"
      }
    }
  },
  "seanceDiscussion": "RUANR5L15S2019IDS21674",
  "sort": {
    "dateSaisie": "2019-06-03T23:45:22.000+02:00",
    "sortEnSeance": "Rejeté"
  },
  "dateDepot": "2019-05-27T02:00:00.000+02:00",
  "dateDistribution": "2019-06-03T02:00:00.000+02:00",
  "article99": "0",
  "loiReference": {
    "codeLoi": {
      "@xmlns:xsi": "http://www.w3.org/2001/XMLSchema-instance",
      "@xsi:nil": "true"
    },
    "divisionCodeLoi": {
      "@xmlns:xsi": "http://www.w3.org/2001/XMLSchema-instance",
      "@xsi:nil": "true"
    }
  }
}