{
  "@xmlns": "http://schemas.assemblee-nationale.fr/referentiel",
  "uid": "AMANR5L15SEA717460B0235P2D1N1654",
  "identifiant": {
    "legislature": "15",
    "numero": "1654",
    "numRect": "0",
    "saisine": {
      "refTexteLegislatif": "PRJLANR5L15B0235",
      "numeroPartiePLF": "2",
      "organeExamen": "PO717460",
      "mentionSecondeDeliberation": "1"
    }
  },
  "numeroLong": "II-1654",
  "etapeTexte": "1ère lecture (1ère assemblée saisie)",
  "triAmendement": "ahi",
  "cardinaliteAmdtMultiples": "1",
  "amendementParent": {
    "@xmlns:xsi": "http://www.w3.org/2001/XMLSchema-instance",
    "@xsi:nil": "true"
  },
  "etat": "Discuté",
  "signataires": {
    "auteur": {
      "typeAuteur": "Depute",
      "acteurRef": "PA720692",
      "organeRef": {
        "@xmlns:xsi": "http://www.w3.org/2001/XMLSchema-instance",
        "@xsi:nil": "true"
      },
      "groupePolitiqueRef": "PO730940"
    },
    "cosignataires": {
      "acteurRef": [
        "PA267306",
        "PA441",
        "PA689",
        "PA335612",
        "PA610634",
        "PA721896",
        "PA718720",
        "PA722110",
        "PA722202",
        "PA721270",
        "PA720546",
        "PA720692",
        "PA610654",
        "PA721118",
        "PA610667",
        "PA718926"
      ]
    },
    "texteAffichable": "M.&#160;Fabien&#160;Roussel,  M.&#160;Dufr&#232;gne, M.&#160;Azerot, Mme&#160;Bello, M.&#160;Brotherson, M.&#160;Bruneel, Mme&#160;Buffet, M.&#160;Chassaigne, M.&#160;Dharr&#233;ville, Mme&#160;Faucillon, M.&#160;Jumel, M.&#160;Lecoq, M.&#160;Nilor, M.&#160;Peu, M.&#160;Serville et M.&#160;Wulfranc"
  },
  "pointeurFragmentTexte": {
    "missionVisee": {
      "@xmlns:xsi": "http://www.w3.org/2001/XMLSchema-instance",
      "@xsi:nil": "true"
    },
    "division": {
      "titre": "Article 40",
      "articleDesignationCourte": "APRÈS ART. 40",
      "type": "ARTICLE",
      "avant_A_Apres": "Après",
      "divisionRattachee": "APRÈS L'ARTICLE 40, insérer l'article suivant:",
      "articleAdditionnel": "1",
      "chapitreAdditionnel": {
        "@xmlns:xsi": "http://www.w3.org/2001/XMLSchema-instance",
        "@xsi:nil": "true"
      },
      "urlDivisionTexteVise": "/15/textes/0235C.asp#D_Article_40"
    },
    "alinea": {
      "@xmlns:xsi": "http://www.w3.org/2001/XMLSchema-instance",
      "@xsi:nil": "true"
    }
  },
  "corps": {
    "dispositif": "<p style=\"text-align: justify;\">Apr&#232;s l&#8217;article&#160;231 <i>ter</i> du code g&#233;n&#233;ral des imp&#244;ts, il est ins&#233;r&#233; un article&#160;231 <i>quater</i> ainsi r&#233;dig&#233;&#160;:</p><p style=\"text-align: justify;\">&#171;&#160;<i>Art.&#160;231</i> quater.&#160;I.&#160;&#8211;&#160;&#192; compter du 1<sup>er</sup> janvier 2019, une taxe additionnelle &#224; la taxe sur les locaux &#224; usage de bureaux, les locaux commerciaux, les locaux de stockage et les surfaces de stationnement annex&#233;es &#224; ces cat&#233;gories de locaux est per&#231;ue, dans les limites territoriales de Paris et des Hauts-de-Seine.</p><p style=\"text-align: justify;\">&#171;&#160;II.&#160;&#8211;&#160;Sont soumises &#224; la taxe les personnes priv&#233;es ou publiques qui sont propri&#233;taires de locaux imposables ou titulaires d&#8217;un droit r&#233;el portant sur de tels locaux.</p><p style=\"text-align: justify;\">&#171;&#160;La taxe est acquitt&#233;e par le propri&#233;taire, l&#8217;usufruitier, le preneur &#224; bail &#224; construction, l&#8217;emphyt&#233;ote ou le titulaire d&#8217;une autorisation d&#8217;occupation temporaire du domaine public constitutive d&#8217;un droit r&#233;el qui dispose, au 1er janvier de l&#8217;ann&#233;e d&#8217;imposition, d&#8217;un local taxable.</p><p style=\"text-align: justify;\">&#171;&#160;III.&#160;&#8211;&#160;La taxe est due pour les locaux &#224; usage de bureaux, qui s&#8217;entendent, d&#8217;une part, des bureaux proprement dits et de leurs d&#233;pendances imm&#233;diates et indispensables destin&#233;s &#224; l&#8217;exercice d&#8217;une activit&#233;, de quelque nature que ce soit, par des personnes physiques ou morales priv&#233;es, ou utilis&#233;s par l&#8217;&#201;tat, les collectivit&#233;s territoriales, les &#233;tablissements ou organismes publics et les organismes professionnels, et, d&#8217;autre part, des locaux professionnels destin&#233;s &#224; l&#8217;exercice d&#8217;activit&#233;s lib&#233;rales ou utilis&#233;s par des associations ou organismes priv&#233;s poursuivant ou non un but lucratif&#160;;</p><p style=\"text-align: justify;\">&#171;&#160;IV.&#160;&#8211;&#160;Pour le calcul des surfaces vis&#233;es au 3&#176; du V et au VI, il est tenu compte de tous les locaux de m&#234;me nature, hors parties communes, qu&#8217;une personne priv&#233;e ou publique poss&#232;de &#224; une m&#234;me adresse ou, en cas de pluralit&#233; d&#8217;adresses, dans un m&#234;me groupement topographique.</p><p style=\"text-align: justify;\">&#171;&#160;V.&#160;&#8211;&#160;Sont exon&#233;r&#233;s de la taxe les locaux &#224; usage de bureaux situ&#233;s dans une commune b&#233;n&#233;ficiant de la dotation de solidarit&#233; urbaine et du fonds de solidarit&#233; des communes de la R&#233;gion &#206;le-de-France, et ceux situ&#233;s dans une zone franche urbaine-territoire entrepreneur, telle que d&#233;finie au B du 3 de l&#8217;article&#160;42 de la loi n&#176; 95&#8209;115 du 4 f&#233;vrier 1995 d&#8217;orientation pour l&#8217;am&#233;nagement et le d&#233;veloppement du territoire&#160;;</p><p style=\"text-align: justify;\">&#171;&#160;VI.&#160;&#8211;&#160;Le montant de la taxe est de 20&#160;euros par m&#232;tre carr&#233; pour l&#8217;ann&#233;e 2017. Ce tarif est actualis&#233; au 1<sup>er</sup> janvier de chaque ann&#233;e en fonction du dernier indice du co&#251;t de la construction publi&#233; par l&#8217;Institut national de la statistique et des &#233;tudes &#233;conomiques. Les valeurs sont arrondies, s&#8217;il y a lieu, au centime d&#8217;euro sup&#233;rieur.</p><p style=\"text-align: justify;\">&#171;&#160;VII.&#160;&#8211;&#160;Les redevables sont tenus de d&#233;poser une d&#233;claration accompagn&#233;e du paiement de la taxe, avant le 1<sup>er</sup> mars de chaque ann&#233;e, aupr&#232;s du comptable public comp&#233;tent du lieu de situation des locaux imposables.</p><p style=\"text-align: justify;\">&#171;&#160;VIII.&#160;&#8211;&#160;Le contr&#244;le, le recouvrement, le contentieux, les garanties et les sanctions relatifs &#224; la taxe sont r&#233;gis par les r&#232;gles applicables en mati&#232;re de taxe sur les salaires jusqu&#8217;au 31 d&#233;cembre 2003.</p><p style=\"text-align: justify;\">&#171;&#160;Le privil&#232;ge pr&#233;vu au 1&#176; du 2 de l&#8217;article&#160;1920 peut &#234;tre exerc&#233; pour le recouvrement de la taxe.</p><p style=\"text-align: justify;\">&#171;&#160;IX.&#160;&#8211;&#160;La taxe n&#8217;est pas d&#233;ductible de l&#8217;assiette de l&#8217;imp&#244;t sur le revenu ou de l&#8217;imp&#244;t sur les soci&#233;t&#233;s.</p><p style=\"text-align: justify;\">&#171;&#160;X.&#160;&#8211;&#160;Le produit de cette taxe est affect&#233; &#224; l&#8217;Agence de financement des infrastructures de transport de France.&#160;&#187;</p>",
    "exposeSommaire": "<p style=\"text-align: justify;\">Les besoins d&#8217;investissements en mati&#232;re de mobilit&#233; sont tr&#232;s importants dans le pays, et l&#8217;AFITF manque de moyens. Il est n&#233;cessaire d&#8217;investir beaucoup plus dans le r&#233;seau ferr&#233;, les transports urbains et les am&#233;nagements cyclables.</p><p style=\"text-align: justify;\">La ville de Paris et le d&#233;partement des Hauts-de-Seine concentrent une tr&#232;s grande part de l&#8217;immobilier de bureaux de la r&#233;gion Ile-de-France, et &#224; l&#8217;&#233;chelle du pays. Y travaillent de tr&#232;s nombreux salari&#233;s venant de l&#8217;ensemble du pays. Cette hyper-concentration participe du d&#233;s&#233;quilibre en mati&#232;re de d&#233;veloppement &#233;conomique de l&#8217;ensemble du pays. Elle g&#233;n&#232;re de nombreux d&#233;placements depuis le reste du pays vers ces centres d&#8217;affaires.</p><p style=\"text-align: justify;\">Les entreprises localis&#233;es dans l&#8217;immobilier de bureaux de ces deux d&#233;partements acquittent des loyers tr&#232;s &#233;lev&#233;s, qui participent au rench&#233;rissement des prix de l&#8217;immobilier en Ile-de-France&#160;;</p><p style=\"text-align: justify;\">Afin de participer au d&#233;veloppement des transports durables dans l&#8217;ensemble du pays, et de travailler &#224; un r&#233;&#233;quilibrage du d&#233;veloppement &#233;conomique au profit des autres r&#233;gions fran&#231;aises et des six autres d&#233;partements d&#8217;Ile-de-France, il est l&#233;gitime que ces acteurs participent au financement de l&#8217;AFITF, via une contribution qui reste tr&#232;s mod&#233;r&#233;e &#224; l&#8217;&#233;chelle des loyers acquitt&#233;s pour occuper ces bureaux.</p>",
    "annexeExposeSommaire": {
      "@xmlns:xsi": "http://www.w3.org/2001/XMLSchema-instance",
      "@xsi:nil": "true"
    }
  },
  "representations": {
    "representation": {
      "nom": "PDF",
      "typeMime": {
        "type": "application",
        "subType": "PDF"
      },
      "statutRepresentation": {
        "verbatim": "true",
        "canonique": "true",
        "officielle": "true",
        "transcription": "false",
        "enregistrement": "false"
      },
      "repSource": {
        "@xmlns:xsi": "http://www.w3.org/2001/XMLSchema-instance",
        "@xsi:nil": "true"
      },
      "offset": {
        "@xmlns:xsi": "http://www.w3.org/2001/XMLSchema-instance",
        "@xsi:nil": "true"
      },
      "contenu": {
        "documentURI": "/15/amendements/0235C/AN/1654.pdf"
      },
      "dateDispoRepresentation": {
        "@xmlns:xsi": "http://www.w3.org/2001/XMLSchema-instance",
        "@xsi:nil": "true"
      }
    }
  },
  "seanceDiscussion": "RUANR5L15S2018IDS20766",
  "sort": {
    "dateSaisie": "2017-11-17T23:49:16.000+01:00",
    "sortEnSeance": "Rejeté"
  },
  "dateDepot": "2017-11-13T01:00:00.000+01:00",
  "dateDistribution": "2017-11-16T01:00:00.000+01:00",
  "article99": "0",
  "loiReference": {
    "codeLoi": "CGI",
    "divisionCodeLoi": "231 quater"
  }
}