{
  "@xmlns": "http://schemas.assemblee-nationale.fr/referentiel",
  "uid": "AMANR5L15SEA717460BTC1175P0D1N889",
  "identifiant": {
    "legislature": "15",
    "numero": "889",
    "numRect": "1",
    "saisine": {
      "refTexteLegislatif": "PRJLANR5L15BTC1175",
      "numeroPartiePLF": "0",
      "organeExamen": "PO717460",
      "mentionSecondeDeliberation": "0"
    }
  },
  "numeroLong": "889 (Rect)",
  "etapeTexte": "Nouvelle Lecture",
  "triAmendement": "oaiaaaaaaaaaaaaaaaaaaaaaaaaaaaaaaaaaaaaaaaaaaaaaaakzi",
  "cardinaliteAmdtMultiples": "1",
  "amendementParent": {
    "@xmlns:xsi": "http://www.w3.org/2001/XMLSchema-instance",
    "@xsi:nil": "true"
  },
  "etat": "Discuté",
  "signataires": {
    "auteur": {
      "typeAuteur": "Depute",
      "acteurRef": "PA335999",
      "organeRef": {
        "@xmlns:xsi": "http://www.w3.org/2001/XMLSchema-instance",
        "@xsi:nil": "true"
      },
      "groupePolitiqueRef": "PO723569"
    },
    "cosignataires": {
      "acteurRef": "PA335999"
    },
    "texteAffichable": "Mme&#160;Batho"
  },
  "pointeurFragmentTexte": {
    "missionVisee": {
      "@xmlns:xsi": "http://www.w3.org/2001/XMLSchema-instance",
      "@xsi:nil": "true"
    },
    "division": {
      "titre": "Article 14 sexies A",
      "articleDesignationCourte": "ART. 14 SEXIES A",
      "type": "ARTICLE",
      "avant_A_Apres": "A",
      "divisionRattachee": "ARTICLE 14 SEXIES A",
      "articleAdditionnel": {
        "@xmlns:xsi": "http://www.w3.org/2001/XMLSchema-instance",
        "@xsi:nil": "true"
      },
      "chapitreAdditionnel": {
        "@xmlns:xsi": "http://www.w3.org/2001/XMLSchema-instance",
        "@xsi:nil": "true"
      },
      "urlDivisionTexteVise": "/15/textes/1175.asp#D_Article_14_sexies_A"
    },
    "alinea": {
      "@xmlns:xsi": "http://www.w3.org/2001/XMLSchema-instance",
      "@xsi:nil": "true"
    }
  },
  "corps": {
    "dispositif": "<p style=\"text-align: justify;\">R&#233;diger ainsi cet article&#160;:</p><p style=\"text-align: justify;\">I.&#160;&#8211;&#160;Apr&#232;s le chapitre&#160;III du titre&#160;V du livre&#160;II du code rural et de la p&#234;che maritime, il est ins&#233;r&#233; un chapitre&#160;III&#160;<i>bis</i> ainsi r&#233;dig&#233;&#160;:</p><p style=\"text-align: justify;\">&#171;&#160;Chapitre&#160;III&#160;<i>bis</i></p><p style=\"text-align: justify;\">&#171;&#160;Dispositions relatives &#224; la r&#233;paration int&#233;grale des pr&#233;judices directement caus&#233;s par l&#8217;utilisation des produits phytopharmaceutiques</p><p style=\"text-align: justify;\">&#171;&#160;Section 1</p><p style=\"text-align: justify;\">&#171;&#160;R&#233;paration des divers pr&#233;judices</p><p style=\"text-align: justify;\">&#171;&#160;<i>Art.&#160;L.&#160;253&#8209;19</i>.&#160;&#8211;&#160;Peuvent obtenir la r&#233;paration int&#233;grale de leurs pr&#233;judices&#160;: les personnes qui ont obtenu la reconnaissance, au titre de la l&#233;gislation fran&#231;aise de s&#233;curit&#233; sociale ou d&#8217;un r&#233;gime assimil&#233; ou de la l&#233;gislation applicable aux pensions civiles et militaires d&#8217;invalidit&#233;, d&#8217;une maladie professionnelle occasionn&#233;e par les produits phytopharmaceutiques mentionn&#233;s &#224; l&#8217;article&#160;L.&#160;253&#8209;1.</p><p style=\"text-align: justify;\">&#171;&#160;Section 2</p><p style=\"text-align: justify;\">&#171;&#160;Fonds d&#8217;indemnisation des victimes des produits phytopharmaceutiques</p><p style=\"text-align: justify;\">&#171;&#160;<i>Art.&#160;L.&#160;253&#8209;20</i>.&#160;&#8211;&#160;Il est cr&#233;&#233; un Fonds d&#8217;indemnisation des victimes des produits phytopharmaceutiques, personne morale de droit priv&#233;. Il groupe toutes les soci&#233;t&#233;s ou caisses d&#8217;assurances et de r&#233;assurances mutuelles agricoles.</p><p style=\"text-align: justify;\">&#171;&#160;Ce fonds a pour mission de r&#233;parer les pr&#233;judices d&#233;finis &#224; l&#8217;article&#160;L.&#160;253&#8209;19. Il est repr&#233;sent&#233; &#224; l&#8217;&#233;gard des tiers par son directeur.</p><p style=\"text-align: justify;\">&#171;&#160;<i>Art.&#160;L.&#160;253&#8209;21</i>.&#160;&#8211;&#160;Le demandeur justifie de l&#8217;exposition &#224; des produits phytopharmaceutiques et de l&#8217;atteinte &#224; l&#8217;&#233;tat de sant&#233; de la victime.</p><p style=\"text-align: justify;\">&#171;&#160;Il informe le fonds des autres proc&#233;dures relatives &#224; l&#8217;indemnisation des pr&#233;judices d&#233;finis au pr&#233;sent article &#233;ventuellement en cours. Si une action en justice est intent&#233;e, il informe le juge de la saisine du fonds.</p><p style=\"text-align: justify;\">&#171;&#160;En l&#8217;absence de d&#233;claration pr&#233;alable par la victime, le fonds transmet sans d&#233;lai le dossier &#224; l&#8217;organisme concern&#233; au titre de la l&#233;gislation fran&#231;aise de s&#233;curit&#233; sociale ou d&#8217;un r&#233;gime assimil&#233; ou de la l&#233;gislation applicable aux pensions civiles et militaires d&#8217;invalidit&#233;. Cette transmission vaut d&#233;claration de maladie professionnelle. Elle suspend le d&#233;lai pr&#233;vu &#224; l&#8217;article&#160;L.&#160;253&#8209;23 jusqu&#8217;&#224; ce que l&#8217;organisme concern&#233; communique au fonds les d&#233;cisions prises. En tout &#233;tat de cause, l&#8217;organisme saisi dispose pour prendre sa d&#233;cision d&#8217;un d&#233;lai de trois&#160;mois, renouvelable une fois si une enqu&#234;te compl&#233;mentaire est n&#233;cessaire. Faute de d&#233;cision prise par l&#8217;organisme concern&#233; dans ce d&#233;lai, le fonds statue dans un d&#233;lai de trois&#160;mois.</p><p style=\"text-align: justify;\">&#171;&#160;Le fonds examine si les conditions d&#8217;indemnisation sont r&#233;unies. Il recherche les circonstances de l&#8217;exposition aux produits phytopharmaceutiques et ses cons&#233;quences sur l&#8217;&#233;tat de sant&#233; de la victime&#160;; il proc&#232;de ou fait proc&#233;der &#224; toutes investigation et expertise utiles sans que puisse lui &#234;tre oppos&#233; le secret professionnel ou industriel.</p><p style=\"text-align: justify;\">&#171;&#160;Au sein du fonds, une commission m&#233;dicale ind&#233;pendante se prononce sur l&#8217;existence d&#8217;un lien entre l&#8217;exposition aux produits phytopharmaceutiques et la survenue de la pathologie. Sa composition est fix&#233;e par un arr&#234;t&#233; conjoint des ministres charg&#233;s de la sant&#233;, des outre-mer et de l&#8217;agriculture.</p><p style=\"text-align: justify;\">&#171;&#160;Vaut justification de l&#8217;exposition &#224; des produits phytopharmaceutiques la reconnaissance d&#8217;une maladie professionnelle occasionn&#233;e par ces produits au titre de la l&#233;gislation fran&#231;aise de s&#233;curit&#233; sociale ou d&#8217;un r&#233;gime assimil&#233; ou de la l&#233;gislation applicable aux pensions civiles et militaires d&#8217;invalidit&#233;.</p><p style=\"text-align: justify;\">&#171;&#160;Vaut &#233;galement justification du lien entre l&#8217;exposition &#224; des produits phytopharmaceutiques et le d&#233;c&#232;s la d&#233;cision de prise en charge de ce d&#233;c&#232;s au titre d&#8217;une maladie professionnelle occasionn&#233;e par des produits phytopharmaceutiques en application de la l&#233;gislation fran&#231;aise de s&#233;curit&#233; sociale ou d&#8217;un r&#233;gime assimil&#233; ou de la l&#233;gislation applicable aux pensions civiles et militaires d&#8217;invalidit&#233;.</p><p style=\"text-align: justify;\">&#171;&#160;Dans les cas valant justification de l&#8217;exposition aux produits phytopharmaceutiques mentionn&#233;s aux deux&#160;alin&#233;as pr&#233;c&#233;dents, le fonds peut verser une provision si la demande lui en a &#233;t&#233; faite. Il est statu&#233; dans le d&#233;lai d&#8217;un mois &#224; compter de la demande de provision.</p><p style=\"text-align: justify;\">&#171;&#160;Le fonds peut demander &#224; tout service de l&#8217;&#201;tat, collectivit&#233; publique, organisme assurant la gestion des prestations sociales, organisme assureur susceptibles de r&#233;parer tout ou partie du pr&#233;judice, la communication des renseignements relatifs &#224; l&#8217;ex&#233;cution de leurs obligations &#233;ventuelles.</p><p style=\"text-align: justify;\">&#171;&#160;Les renseignements ainsi recueillis ne peuvent &#234;tre utilis&#233;s &#224; d&#8217;autres fins que l&#8217;instruction de la demande faite au fonds d&#8217;indemnisation et leur divulgation est interdite. Les personnes qui ont &#224; conna&#238;tre des documents et informations fournis au fonds sont tenues au secret professionnel.</p><p style=\"text-align: justify;\">&#171;&#160;Le demandeur peut obtenir la communication de son dossier, sous r&#233;serve du respect du secret m&#233;dical et du secret industriel et commercial.</p><p style=\"text-align: justify;\">&#171;&#160;<i>Art.&#160;L.&#160;253&#8209;22</i>.&#160;&#8211;&#160;Dans les neuf&#160;mois &#224; compter de la r&#233;ception d&#8217;une demande d&#8217;indemnisation, le fonds pr&#233;sente au demandeur une offre d&#8217;indemnisation. Il indique l&#8217;&#233;valuation retenue pour chaque chef de pr&#233;judice, ainsi que le montant des indemnit&#233;s qui lui reviennent compte tenu des prestations &#233;num&#233;r&#233;es &#224; l&#8217;article&#160;29 de la loi&#160;n&#176;&#160;85&#8209;677 du 5&#160;juillet&#160;1985 tendant &#224; l&#8217;am&#233;lioration de la situation des victimes d&#8217;accidents de la circulation et &#224; l&#8217;acc&#233;l&#233;ration des proc&#233;dures d&#8217;indemnisation, et des indemnit&#233;s de toute nature re&#231;ues ou &#224; recevoir d&#8217;autres d&#233;biteurs du chef du m&#234;me pr&#233;judice. &#192; d&#233;faut de consolidation de l&#8217;&#233;tat de la victime, l&#8217;offre pr&#233;sent&#233;e par le fonds a un caract&#232;re provisionnel.</p><p style=\"text-align: justify;\">&#171;&#160;Le fonds pr&#233;sente une offre dans les m&#234;mes conditions en cas d&#8217;aggravation de l&#8217;&#233;tat de sant&#233; de la victime.</p><p style=\"text-align: justify;\">&#171;&#160;L&#8217;offre d&#233;finitive est faite dans un d&#233;lai de deux&#160;mois &#224; compter de la date &#224; laquelle le fonds a &#233;t&#233; inform&#233; de cette consolidation.</p><p style=\"text-align: justify;\">&#171;&#160;Le paiement doit intervenir dans un d&#233;lai d&#8217;un mois &#224; compter de la r&#233;ception par le fonds de l&#8217;acceptation de son offre par la victime, que cette offre ait un caract&#232;re provisionnel ou d&#233;finitif.</p><p style=\"text-align: justify;\">&#171;&#160;L&#8217;acceptation de l&#8217;offre ou la d&#233;cision juridictionnelle d&#233;finitive rendue dans l&#8217;action en justice pr&#233;vue &#224; l&#8217;article&#160;L.&#160;253&#8209;23 vaut d&#233;sistement des actions juridictionnelles en indemnisation en cours et rend irrecevable toute autre action juridictionnelle future en r&#233;paration du m&#234;me pr&#233;judice. Il en va de m&#234;me des d&#233;cisions juridictionnelles devenues d&#233;finitives allouant une indemnisation int&#233;grale pour les cons&#233;quences de l&#8217;exposition &#224; des produits phytopharmaceutiques.</p><p style=\"text-align: justify;\">&#171;&#160;<i>Art.&#160;L.&#160;253&#8209;23</i>.&#160;&#8211;&#160;Le demandeur ne dispose du droit d&#8217;action en justice contre le fonds d&#8217;indemnisation que si sa demande d&#8217;indemnisation a &#233;t&#233; rejet&#233;e, si aucune offre ne lui a &#233;t&#233; pr&#233;sent&#233;e dans le d&#233;lai mentionn&#233; &#224; l&#8217;article&#160;L.&#160;253&#8209;22 ou s&#8217;il n&#8217;a pas accept&#233; l&#8217;offre qui lui a &#233;t&#233; faite.</p><p style=\"text-align: justify;\">&#171;&#160;Cette action est intent&#233;e devant la cour d&#8217;appel dans le ressort de laquelle se trouve le domicile du demandeur.</p><p style=\"text-align: justify;\">&#171;&#160;<i>Art.&#160;L.&#160;253&#8209;24</i>.&#160;&#8211;&#160;Le fonds est subrog&#233;, &#224; due concurrence des sommes vers&#233;es, dans les droits que poss&#232;de le demandeur contre la personne responsable du dommage ainsi que contre les personnes ou organismes tenus &#224; un titre quelconque d&#8217;en assurer la r&#233;paration totale ou partielle dans la limite du montant des prestations &#224; la charge desdites personnes.</p><p style=\"text-align: justify;\">&#171;&#160;Le fonds intervient devant les juridictions civiles, y compris celles du contentieux de la s&#233;curit&#233; sociale, notamment dans les actions en faute inexcusable, et devant les juridictions de jugement en mati&#232;re r&#233;pressive, m&#234;me pour la premi&#232;re fois en cause d&#8217;appel, en cas de constitution de partie civile du demandeur contre le ou les responsables des pr&#233;judices&#160;; il intervient &#224; titre principal et peut user de toutes les voies de recours ouvertes par la loi.</p><p style=\"text-align: justify;\">&#171;&#160;Si le fait g&#233;n&#233;rateur du dommage a donn&#233; lieu &#224; des poursuites p&#233;nales, le juge civil n&#8217;est pas tenu de surseoir &#224; statuer jusqu&#8217;&#224; d&#233;cision d&#233;finitive de la juridiction r&#233;pressive.</p><p style=\"text-align: justify;\">&#171;&#160;La reconnaissance de la faute inexcusable de l&#8217;employeur, &#224; l&#8217;occasion de l&#8217;action &#224; laquelle le fonds est partie, ouvre droit &#224; la majoration des indemnit&#233;s vers&#233;es &#224; la victime en application de la l&#233;gislation de s&#233;curit&#233; sociale. L&#8217;indemnisation &#224; la charge du fonds est r&#233;vis&#233;e en cons&#233;quence.</p><p style=\"text-align: justify;\">&#171;&#160;<i>Art.&#160;L.&#160;253&#8209;25</i>.&#160;&#8211;&#160;Le fonds est financ&#233; par&#160;:</p><p style=\"text-align: justify;\">&#171;&#160;1&#176;&#160;L&#8217;affectation d&#8217;une fraction du produit de la taxe pr&#233;vue &#224; l&#8217;article&#160;L.&#160;253&#8209;8&#8209;2&#160;;</p><p style=\"text-align: justify;\">&#171;&#160;2&#176;&#160;Les sommes per&#231;ues en application de l&#8217;article&#160;L.&#160;253&#8209;23&#160;;</p><p style=\"text-align: justify;\">&#171;&#160;3&#176;&#160;Les produits divers, dons et legs.</p><p style=\"text-align: justify;\">&#171;&#160;<i>Art.&#160;L.&#160;253&#8209;26</i>.&#160;&#8211;&#160;Les demandes d&#8217;indemnisation doivent &#234;tre adress&#233;es au fonds dans un d&#233;lai de dix&#160;ans.</p><p style=\"text-align: justify;\">&#171;&#160;Pour les victimes, le d&#233;lai de prescription commence &#224; courir &#224; compter de&#160;:</p><p style=\"text-align: justify;\">&#171;&#160;-&#160;pour la maladie initiale, la date du premier certificat m&#233;dical &#233;tablissant le lien entre la maladie et l&#8217;exposition aux produits phytopharmaceutiques&#160;;</p><p style=\"text-align: justify;\">&#171;&#160;-&#160;pour l&#8217;aggravation de la maladie, la date du premier certificat m&#233;dical constatant cette aggravation d&#232;s lors qu&#8217;un certificat m&#233;dical pr&#233;c&#233;dent &#233;tablissait d&#233;j&#224; le lien entre cette maladie et une exposition aux produits phytopharmaceutiques.</p><p style=\"text-align: justify;\">&#171;&#160;<i>Art.&#160;L.&#160;253&#8209;27</i>.&#160;&#8211;&#160;L&#8217;activit&#233; du fonds fait l&#8217;objet d&#8217;un rapport annuel remis au Gouvernement et au Parlement avant le 30 avril.</p><p style=\"text-align: justify;\">&#171;&#160;Les modalit&#233;s d&#8217;application du pr&#233;sent chapitre sont fix&#233;es par d&#233;cret en Conseil d&#8217;&#201;tat.</p><p style=\"text-align: justify;\">&#171;&#160;Le d&#233;lai fix&#233; au premier alin&#233;a de l&#8217;article&#160;L.&#160;253&#8209;23 est port&#233; &#224; douze&#160;mois pendant l&#8217;ann&#233;e qui suit la publication du d&#233;cret mentionn&#233; au deuxi&#232;me alin&#233;a du pr&#233;sent article.&#160;&#187;</p><p style=\"text-align: justify;\">II.&#160;&#8211;&#160;Le&#160;VI de l&#8217;article&#160;L.&#160;253&#8209;8&#8209;2 du code rural et de la p&#234;che maritime est ainsi r&#233;dig&#233;&#160;:</p><p style=\"text-align: justify;\">&#171;&#160;VI.&#160;&#8211;&#160;Le produit de la taxe est affect&#233;&#160;:</p><p style=\"text-align: justify;\">&#171;&#160;1&#176;&#160;En priorit&#233;, &#224; l&#8217;Agence nationale de s&#233;curit&#233; sanitaire de l&#8217;alimentation, de l&#8217;environnement et du travail, dans la limite du plafond fix&#233; au&#160;I de l&#8217;article&#160;46 de la loi&#160;n&#176;&#160;2011&#8209;1977 du 28&#160;d&#233;cembre&#160;2011 de finances pour 2012, pour financer la mise en place du dispositif de phytopharmacovigilance d&#233;fini &#224; l&#8217;article&#160;L.&#160;253&#8209;8&#8209;1 du pr&#233;sent code et pour am&#233;liorer la prise en compte des pr&#233;judices en lien direct avec l&#8217;utilisation des produits phytopharmaceutiques&#160;;</p><p style=\"text-align: justify;\">&#171;&#160;2&#176;&#160;Pour le solde, au Fonds d&#8217;indemnisation des victimes des produits phytopharmaceutiques.&#160;&#187;</p>",
    "exposeSommaire": "<p style=\"text-align: justify;\">Le pr&#233;sent amendement vise &#224; permettre la cr&#233;ation d&#8217;un fonds d&#8217;indemnisation des victimes des produits phytopharmaceutiques, personne morale de droit priv&#233;, dont le financement est assur&#233; par une taxe additionnelle sur la taxe pr&#233;vue &#224; l&#8217;article L.&#160;253&#8209;8&#8209;2 du code rural et de la p&#234;che maritime.</p><p style=\"text-align: justify;\">La cr&#233;ation d&#8217;un fonds d&#8217;indemnisation pour les victimes des produits phytopharmaceutiques a &#233;t&#233; adopt&#233;e par le S&#233;nat en premi&#232;re lecture &#224; l&#8217;unanimit&#233;.</p><p style=\"text-align: justify;\">La reconnaissance et la r&#233;paration int&#233;grale du pr&#233;judice que constituent les maladies professionnelles directement li&#233;es &#224; l&#8217;utilisation de ces produits est due au monde agricole.</p><p style=\"text-align: justify;\">Alors qu&#8217;un rapport conjoint de l&#8217;IGAS, de l&#8217;IGF et du CGAAER pr&#233;conise la cr&#233;ation d&#8217;un tel fonds, l&#8217;Assembl&#233;e nationale doit prendre ses responsabilit&#233;s et r&#233;tablir cet article supprim&#233; par la Commission des Affaires &#201;conomiques.</p>",
    "annexeExposeSommaire": {
      "@xmlns:xsi": "http://www.w3.org/2001/XMLSchema-instance",
      "@xsi:nil": "true"
    }
  },
  "representations": {
    "representation": {
      "nom": "PDF",
      "typeMime": {
        "type": "application",
        "subType": "PDF"
      },
      "statutRepresentation": {
        "verbatim": "true",
        "canonique": "true",
        "officielle": "true",
        "transcription": "false",
        "enregistrement": "false"
      },
      "repSource": {
        "@xmlns:xsi": "http://www.w3.org/2001/XMLSchema-instance",
        "@xsi:nil": "true"
      },
      "offset": {
        "@xmlns:xsi": "http://www.w3.org/2001/XMLSchema-instance",
        "@xsi:nil": "true"
      },
      "contenu": {
        "documentURI": "/15/amendements/1175/AN/889.pdf"
      },
      "dateDispoRepresentation": {
        "@xmlns:xsi": "http://www.w3.org/2001/XMLSchema-instance",
        "@xsi:nil": "true"
      }
    }
  },
  "seanceDiscussion": "RUANR5L15S2018IDS21237",
  "sort": {
    "dateSaisie": "2018-09-15T00:34:36.000+02:00",
    "sortEnSeance": "Rejeté"
  },
  "dateDepot": "2018-09-08T02:00:00.000+02:00",
  "dateDistribution": "2018-09-11T02:00:00.000+02:00",
  "article99": "0",
  "loiReference": {
    "codeLoi": {
      "@xmlns:xsi": "http://www.w3.org/2001/XMLSchema-instance",
      "@xsi:nil": "true"
    },
    "divisionCodeLoi": {
      "@xmlns:xsi": "http://www.w3.org/2001/XMLSchema-instance",
      "@xsi:nil": "true"
    }
  }
}