{
  "@xmlns": "http://schemas.assemblee-nationale.fr/referentiel",
  "uid": "AMANR5L15PO757134B1673P0D1N205",
  "identifiant": {
    "legislature": "15",
    "numero": "205",
    "numRect": "0",
    "saisine": {
      "refTexteLegislatif": "PRJLANR5L15B1673",
      "numeroPartiePLF": "0",
      "organeExamen": "PO757134",
      "mentionSecondeDeliberation": "0"
    }
  },
  "numeroLong": "205",
  "etapeTexte": "Nouvelle Lecture",
  "triAmendement": "kdaaaaaaaaaaaaaaaaaaaaaaaaaaaaaaaaaaaaaaaaaaaaaaaaf",
  "cardinaliteAmdtMultiples": "1",
  "amendementParent": {
    "@xmlns:xsi": "http://www.w3.org/2001/XMLSchema-instance",
    "@xsi:nil": "true"
  },
  "etat": "Retiré",
  "signataires": {
    "auteur": {
      "typeAuteur": "Depute",
      "acteurRef": "PA334149",
      "organeRef": {
        "@xmlns:xsi": "http://www.w3.org/2001/XMLSchema-instance",
        "@xsi:nil": "true"
      },
      "groupePolitiqueRef": "PO730934"
    },
    "cosignataires": {
      "acteurRef": [
        "PA608826",
        "PA608016",
        "PA719318",
        "PA709315",
        "PA608416",
        "PA2492",
        "PA267735",
        "PA340853",
        "PA334149",
        "PA330909",
        "PA721070",
        "PA721474",
        "PA721410",
        "PA346218",
        "PA721286",
        "PA720684",
        "PA721816",
        "PA266808",
        "PA722390",
        "PA767",
        "PA266793",
        "PA334654",
        "PA605036",
        "PA718884",
        "PA336316",
        "PA346054",
        "PA721126",
        "PA267527",
        "PA712015",
        "PA267260",
        "PA642847",
        "PA609245"
      ]
    },
    "texteAffichable": "M.&#160;Fasquelle,  M.&#160;Boucard, M.&#160;Descoeur, Mme&#160;Guion-Firmin, M.&#160;Emmanuel&#160;Maquet, M.&#160;Rolland, M.&#160;Saddier, M.&#160;Viala, M.&#160;Viry, M.&#160;Bony, M.&#160;Leclerc, M.&#160;Ramadier, M.&#160;Quentin, Mme&#160;Duby-Muller, M.&#160;Hetzel, M.&#160;Straumann, Mme&#160;Ramassamy, Mme&#160;Poletti, Mme&#160;Bonnivard, Mme&#160;Corneloup, M.&#160;Cattin, M.&#160;Dive, M.&#160;Masson, M.&#160;Bouchet, M.&#160;Pierre-Henri&#160;Dumont, M.&#160;Abad, Mme&#160;Lacroute, Mme&#160;Louwagie, M.&#160;de Ganay, M.&#160;Bazin, Mme&#160;Anthoine et Mme&#160;Bazin-Malgras"
  },
  "pointeurFragmentTexte": {
    "missionVisee": {
      "@xmlns:xsi": "http://www.w3.org/2001/XMLSchema-instance",
      "@xsi:nil": "true"
    },
    "division": {
      "titre": "Article 54",
      "articleDesignationCourte": "ART. 54",
      "type": "ARTICLE",
      "avant_A_Apres": "A",
      "divisionRattachee": "ARTICLE 54",
      "articleAdditionnel": {
        "@xmlns:xsi": "http://www.w3.org/2001/XMLSchema-instance",
        "@xsi:nil": "true"
      },
      "chapitreAdditionnel": {
        "@xmlns:xsi": "http://www.w3.org/2001/XMLSchema-instance",
        "@xsi:nil": "true"
      },
      "urlDivisionTexteVise": "/15/textes/1673.asp#D_Article_54"
    },
    "alinea": {
      "@xmlns:xsi": "http://www.w3.org/2001/XMLSchema-instance",
      "@xsi:nil": "true"
    }
  },
  "corps": {
    "dispositif": "<p style=\"text-align: justify;\">Supprimer cet article.</p>",
    "exposeSommaire": "<p style=\"text-align: justify;\">L&#8217;article&#160;54, dans sa version initiale, pr&#233;voyait de revenir sur la gouvernance du Groupe La Poste.</p><p style=\"text-align: justify;\">Mais par amendement adopt&#233; en commission sp&#233;ciale, le Gouvernement a propos&#233; un rapprochement des activit&#233;s du Groupe La Poste avec celles de CNP Assurances afin de cr&#233;er un g&#233;ant fran&#231;ais de la bancassurance mondiale dont l&#8217;actionnaire majoritaire serait la Caisse des d&#233;p&#244;ts (CDC).</p><p style=\"text-align: justify;\">Si sur le fond, cette proposition peut &#234;tre d&#233;battue, sur la forme, elle pose question. En effet, le d&#233;p&#244;t d&#8217;un amendement tardif du Gouvernement, sans aucune &#233;tude d&#8217;impact, &#233;vitant par la m&#234;me occasion tout contr&#244;le du Conseil d&#8217;&#201;tat ainsi que toute concertation avec l&#8217;ensemble des parties prenantes, semble tout-&#224;-fait inappropri&#233;.</p><p style=\"text-align: justify;\">Il convient d&#232;s lors de revenir sur cette proposition et ainsi reporter ce d&#233;bat &#224; une date ult&#233;rieure afin de permettre &#224; l&#8217;ensemble des parties prenantes de pouvoir participer &#224; un d&#233;bat serein &#244; combien important pour l&#8217;avenir de la CDC et de La Poste.</p>",
    "annexeExposeSommaire": {
      "@xmlns:xsi": "http://www.w3.org/2001/XMLSchema-instance",
      "@xsi:nil": "true"
    },
    "cartoucheDelaiDepotDepasse": {
      "@xmlns:xsi": "http://www.w3.org/2001/XMLSchema-instance",
      "@xsi:nil": "true"
    }
  },
  "representations": {
    "representation": {
      "nom": "PDF",
      "typeMime": {
        "type": "application",
        "subType": "PDF"
      },
      "statutRepresentation": {
        "verbatim": "true",
        "canonique": "true",
        "officielle": "true",
        "transcription": "false",
        "enregistrement": "false"
      },
      "repSource": {
        "@xmlns:xsi": "http://www.w3.org/2001/XMLSchema-instance",
        "@xsi:nil": "true"
      },
      "offset": {
        "@xmlns:xsi": "http://www.w3.org/2001/XMLSchema-instance",
        "@xsi:nil": "true"
      },
      "contenu": {
        "documentURI": "/15/amendements/1673/CSPACTE/205.pdf"
      },
      "dateDispoRepresentation": {
        "@xmlns:xsi": "http://www.w3.org/2001/XMLSchema-instance",
        "@xsi:nil": "true"
      }
    }
  },
  "seanceDiscussion": {
    "@xmlns:xsi": "http://www.w3.org/2001/XMLSchema-instance",
    "@xsi:nil": "true"
  },
  "sort": {
    "@xmlns:xsi": "http://www.w3.org/2001/XMLSchema-instance",
    "@xsi:nil": "true"
  },
  "dateDepot": "2019-02-27T01:00:00.000+01:00",
  "dateDistribution": "2019-03-01T01:00:00.000+01:00",
  "article99": "0",
  "loiReference": {
    "codeLoi": {
      "@xmlns:xsi": "http://www.w3.org/2001/XMLSchema-instance",
      "@xsi:nil": "true"
    },
    "divisionCodeLoi": {
      "@xmlns:xsi": "http://www.w3.org/2001/XMLSchema-instance",
      "@xsi:nil": "true"
    }
  }
}