{
  "@xmlns": "http://schemas.assemblee-nationale.fr/referentiel",
  "uid": "AMANR5L15SEA717460BTC1767P0D1N1063",
  "identifiant": {
    "legislature": "15",
    "numero": "1063",
    "numRect": "0",
    "saisine": {
      "refTexteLegislatif": "PRJLANR5L15BTC1767",
      "numeroPartiePLF": "0",
      "organeExamen": "PO717460",
      "mentionSecondeDeliberation": "0"
    }
  },
  "numeroLong": "1063",
  "etapeTexte": "1ère lecture (1ère assemblée saisie)",
  "triAmendement": "paaaaaaaaaaaaaaaaaaaaaaaaaaaaaaaaaaaaaaaaaaaaaaaaaabi",
  "cardinaliteAmdtMultiples": "1",
  "amendementParent": {
    "@xmlns:xsi": "http://www.w3.org/2001/XMLSchema-instance",
    "@xsi:nil": "true"
  },
  "etat": "Irrecevable",
  "signataires": {
    "auteur": {
      "typeAuteur": "Depute",
      "acteurRef": "PA330684",
      "organeRef": {
        "@xmlns:xsi": "http://www.w3.org/2001/XMLSchema-instance",
        "@xsi:nil": "true"
      },
      "groupePolitiqueRef": "PO730934"
    },
    "cosignataires": {
      "acteurRef": "PA330684"
    },
    "texteAffichable": "Mme&#160;Val&#233;rie&#160;Boyer"
  },
  "pointeurFragmentTexte": {
    "missionVisee": {
      "@xmlns:xsi": "http://www.w3.org/2001/XMLSchema-instance",
      "@xsi:nil": "true"
    },
    "division": {
      "titre": "Article 23",
      "articleDesignationCourte": "APRÈS ART. 23",
      "type": "ARTICLE",
      "avant_A_Apres": "Après",
      "divisionRattachee": "APRÈS L'ARTICLE 23, insérer l'article suivant:",
      "articleAdditionnel": "1",
      "chapitreAdditionnel": {
        "@xmlns:xsi": "http://www.w3.org/2001/XMLSchema-instance",
        "@xsi:nil": "true"
      },
      "urlDivisionTexteVise": "/15/textes/1767.asp#D_Article_23"
    },
    "alinea": {
      "@xmlns:xsi": "http://www.w3.org/2001/XMLSchema-instance",
      "@xsi:nil": "true"
    }
  },
  "corps": {
    "dispositif": "<p style=\"text-align: justify;\">I. Apr&#232;s le chapitre III du titre II du livre Ier de la deuxi&#232;me partie du code de la sant&#233; publique, il est ins&#233;r&#233; un chapitre ainsi r&#233;dig&#233;&#160;:</p><p>&#171;&#160;Chapitre IV. Pr&#233;vention des actes contraires &#224; la dignit&#233; de la femme</p><p>&#171;&#160;Art. L. 2123-3. - Lorsqu&#8217;un m&#233;decin ou une sage-femme constate &#224; l&#8217;occasion d&#8217;un examen m&#233;dical qu&#8217;une femme enceinte a subi une mutilation de nature sexuelle, il remet &#224; celle-ci un document intitul&#233; &#171;&#160;Charte de protection de l&#8217;int&#233;grit&#233; g&#233;nitale de la femme&#160;&#187;.</p><p>&#171;&#160;Ce document pr&#233;sente le droit applicable en mati&#232;re de protection du corps humain, notamment l&#8217;interdiction de toute forme de mutilation pr&#233;vue &#224; l&#8217;article 222-9 du code p&#233;nal, ainsi que les risques sanitaires encourus &#224; l&#8217;occasion d&#8217;une mutilation g&#233;nitale.</p><p>&#171;&#160;Le contenu de ce document et les modalit&#233;s de sa remise &#224; la personne int&#233;ress&#233;e sont pr&#233;cis&#233;s par arr&#234;t&#233; du ministre charg&#233; de la sant&#233;.&#160;&#187;&#160;</p><p>II. La charge qui pourrait r&#233;sulter pour les collectivit&#233;s territoriales de l&#8217;application de la pr&#233;sente loi est compens&#233;e par la majoration &#224; due concurrence de la dotation globale de fonctionnement, et corr&#233;lativement pour l&#8217;Etat par la cr&#233;ation d&#8217;une taxe additionnelle aux droits mentionn&#233;s aux articles 575 et 575 A du code g&#233;n&#233;ral des imp&#244;ts.</p><p>La charge qui pourrait r&#233;sulter pour les organismes de s&#233;curit&#233; sociale de l&#8217;application de la pr&#233;sente loi est compens&#233;e &#224; due concurrence par la cr&#233;ation d&#8217;une taxe additionnelle aux droits mentionn&#233;s aux articles 575 et 575 A du code g&#233;n&#233;ral des imp&#244;ts.</p><p>La charge qui pourrait r&#233;sulter pour l&#8217;Etat de l&#8217;application de la pr&#233;sente loi est compens&#233;e &#224; due concurrence par la cr&#233;ation d&#8217;une taxe additionnelle aux droits mentionn&#233;s aux articles 575 et 575 A du code g&#233;n&#233;ral des imp&#244;ts.</p><p>&#160;</p>",
    "exposeSommaire": "<p style=\"text-align: justify;\"><span class=\"ins cts-1\"  data-cid=\"3\"   data-time=\"1552664080197\"><u><i><b>Cr&#233;er une charte de protection de l&#8217;int&#233;grit&#233; g&#233;nitale de la femme d&#233;livr&#233;e dans les maternit&#233;s</b></i></u> <span></span></span></p><p style=\"text-align: justify;\">Dans certaine maternit&#233;s, des &#233;quipes m&#233;dico-chirurgicales se sont mises en place pour prendre en charge les femmes victimes de telles mutilations.</p><p>C&#8217;est le cas par exemple de la Maternit&#233; de la Conception Marseille (AP-HM) qui est depuis 2008 associ&#233;e avec l&#8217;Union des femmes du monde GAMS Sud, pr&#233;sid&#233;e par la com&#233;dienne ivoirienne Naky SY SAVANE.</p><p>Ces initiatives permettent d&#8217;accompagner et de sensibiliser les patientes en abordant tous les aspects de pr&#233;vention, de conseils, de soutien et d&#8217;information, avec rappel du cadre l&#233;gislatif fran&#231;ais.</p><p>Lorsqu&#8217;un m&#233;decin ou une sage-femme constate &#224; l&#8217;occasion d&#8217;un examen m&#233;dical qu&#8217;une femme enceinte a subi une mutilation de nature sexuelle, le pouvoir de sant&#233; doit pouvoir remettre &#224; celle-ci une &#171;&#160;charte de protection de l&#8217;int&#233;grit&#233; g&#233;nitale de la femme&#160;&#187;.</p><p>Ce document pr&#233;sentera le droit applicable en mati&#232;re de protection du corps humain, notamment l&#8217;interdiction de toute forme de mutilation pr&#233;vue par le code p&#233;nal, ainsi que les risques sanitaires encourus&#160; &#224; l&#8217;occasion d&#8217;une mutilation g&#233;nitale.</p><p>Le contenu de ce document et les modalit&#233;s de sa remise &#224; la personne int&#233;ress&#233;e seront pr&#233;cis&#233;s par arr&#234;t&#233; du ministre charg&#233; de la sant&#233;.</p><p>La cr&#233;ation d&#8217;actes inopposables devant un juge &#8211; comme les &#171;&#160;chartes&#160;&#187; &#8211; r&#233;sulte rarement d&#8217;une disposition l&#233;gislative. Certaines chartes ont cependant &#233;t&#233; pr&#233;vues par des dispositions l&#233;gislatives. C&#8217;est le cas lorsqu&#8217;elles fixent des obligations d&#233;ontologiques applicables &#224; un groupe de personnes physiques ou morales[1].</p><p>La charte envisag&#233;e ayant principalement pour objet d&#8217;exposer certaines obligations juridiques &#224; son destinataire, se rapproche de la charte des droits et devoirs du citoyen fran&#231;ais que doit signer la personne qui souhaite acqu&#233;rir la nationalit&#233; fran&#231;aise dans les conditions pr&#233;vues par l&#8217;article 22-21 du code civil et par le d&#233;cret n&#176;2012-27 du 30 janvier 2012.</p><p>Signer cette &#171;&#160;charte de protection de l&#8217;int&#233;grit&#233; g&#233;nitale de la femme&#160;&#187; c&#8217;est aussi r&#233;affirmer son adh&#233;sion aux valeurs de la R&#233;publique.</p><p><u><b>L&#8217;objet de la charte</b></u></p><p>L&#8217;objet doit &#234;tre pr&#233;vu dans la loi afin de lui conf&#233;rer une certaine densit&#233; normative. Il sera pr&#233;vu d&#8217;exposer les r&#232;gles juridiques interdisant les mutilations g&#233;nitales f&#233;minines ainsi que les risques qu&#8217;implique ce type d&#8217;op&#233;ration au regard de la sant&#233;.</p><p>La notion de mutilation g&#233;nitale f&#233;minine &#233;tant inconnue du droit positif, la charte pourrait &#234;tre intitul&#233;e &#171;&#160;Charte de la protection de l&#8217;int&#233;grit&#233; g&#233;nitale de la femme&#160;&#187;, dans une perspective&#160; &#171;&#160;positive&#160;&#187; de pr&#233;vention en mati&#232;re de sant&#233; publique et de respect des droits individuels fondamentaux. Le soin de d&#233;finir le contenu pr&#233;cis du document sera renvoy&#233; au pouvoir r&#233;glementaire.</p><p><u><b>La remise de la charte</b></u></p><p>Il est souhaitable de fonder le dispositif envisag&#233; sur la notion &#171;&#160;d&#8217;examen m&#233;dical&#160;&#187;, d&#233;j&#224; pr&#233;vu dans des articles du code la sant&#233; publique consacr&#233;s &#224; la pr&#233;vention.</p><p>Les conditions pr&#233;cises entourant la remise du document (format et support mat&#233;riel de la charte, obligation de conseil accompagnant la remise, signature&#8230;) seront renvoy&#233;es au pouvoir r&#233;glementaire.</p><p><br /> <br /><i>[1] Comme par exemple la charge d&#233;ontologique de l&#8217;entreprise ou de la soci&#233;t&#233; &#233;ditrice en mati&#232;re de presse (article 2 bis de la loi du 29 juillet 1881 sur la libert&#233; de la presse) ou encore la charte nationale d&#8217;insertion de l&#8217;Agence nationale pour la r&#233;novation urbaine qui s&#8217;adresse notamment aux habitants de quartiers prioritaires de la politique de la ville (article 10-3 de la loi n&#176;2003-710 du 1er ao&#251;t 2003 d&#8217;orientation et de programmation pour la ville et la r&#233;novation urbaine).</i></p><p><i>&#160;</i></p><p>&#160;</p><p>&#160;</p>",
    "annexeExposeSommaire": {
      "@xmlns:xsi": "http://www.w3.org/2001/XMLSchema-instance",
      "@xsi:nil": "true"
    },
    "cartoucheDelaiDepotDepasse": {
      "@xmlns:xsi": "http://www.w3.org/2001/XMLSchema-instance",
      "@xsi:nil": "true"
    }
  },
  "representations": {
    "representation": {
      "nom": "PDF",
      "typeMime": {
        "type": "application",
        "subType": "PDF"
      },
      "statutRepresentation": {
        "verbatim": "true",
        "canonique": "true",
        "officielle": "true",
        "transcription": "false",
        "enregistrement": "false"
      },
      "repSource": {
        "@xmlns:xsi": "http://www.w3.org/2001/XMLSchema-instance",
        "@xsi:nil": "true"
      },
      "offset": {
        "@xmlns:xsi": "http://www.w3.org/2001/XMLSchema-instance",
        "@xsi:nil": "true"
      },
      "contenu": {
        "documentURI": "/15/amendements/1767/AN/1063.pdf"
      },
      "dateDispoRepresentation": {
        "@xmlns:xsi": "http://www.w3.org/2001/XMLSchema-instance",
        "@xsi:nil": "true"
      }
    }
  },
  "seanceDiscussion": {
    "@xmlns:xsi": "http://www.w3.org/2001/XMLSchema-instance",
    "@xsi:nil": "true"
  },
  "sort": {
    "@xmlns:xsi": "http://www.w3.org/2001/XMLSchema-instance",
    "@xsi:nil": "true"
  },
  "dateDepot": "2019-03-15T01:00:00.000+01:00",
  "dateDistribution": "2019-03-16T01:00:00.000+01:00",
  "article99": "0",
  "loiReference": {
    "codeLoi": "c santé publique",
    "divisionCodeLoi": "L2123-3"
  }
}