{
  "@xmlns": "http://schemas.assemblee-nationale.fr/referentiel",
  "uid": "AMANR5L15SEA717460BTC1547P0D1N123",
  "identifiant": {
    "legislature": "15",
    "numero": "123",
    "numRect": "0",
    "saisine": {
      "refTexteLegislatif": "PRJLANR5L15BTC1547",
      "numeroPartiePLF": "0",
      "organeExamen": "PO717460",
      "mentionSecondeDeliberation": "1"
    }
  },
  "numeroLong": "123",
  "etapeTexte": "1ère lecture (1ère assemblée saisie)",
  "triAmendement": "daaaaaaaaaaaaaaaaaaaaaaaaaaaaaaaaaaaaaaaaaaaaaaaaaas",
  "cardinaliteAmdtMultiples": "1",
  "amendementParent": {
    "@xmlns:xsi": "http://www.w3.org/2001/XMLSchema-instance",
    "@xsi:nil": "true"
  },
  "etat": "Discuté",
  "signataires": {
    "auteur": {
      "typeAuteur": "Depute",
      "acteurRef": "PA720422",
      "organeRef": {
        "@xmlns:xsi": "http://www.w3.org/2001/XMLSchema-instance",
        "@xsi:nil": "true"
      },
      "groupePolitiqueRef": "PO730958"
    },
    "cosignataires": {
      "acteurRef": "PA720422"
    },
    "texteAffichable": "M.&#160;Quatennens"
  },
  "pointeurFragmentTexte": {
    "missionVisee": {
      "@xmlns:xsi": "http://www.w3.org/2001/XMLSchema-instance",
      "@xsi:nil": "true"
    },
    "division": {
      "titre": "Article 2",
      "articleDesignationCourte": "ART. 2",
      "type": "ARTICLE",
      "avant_A_Apres": "A",
      "divisionRattachee": "ARTICLE 2",
      "articleAdditionnel": {
        "@xmlns:xsi": "http://www.w3.org/2001/XMLSchema-instance",
        "@xsi:nil": "true"
      },
      "chapitreAdditionnel": {
        "@xmlns:xsi": "http://www.w3.org/2001/XMLSchema-instance",
        "@xsi:nil": "true"
      },
      "urlDivisionTexteVise": "/15/textes/1547.asp#D_Article_2"
    },
    "alinea": {
      "avant_A_Apres": "A",
      "numero": "1",
      "alineaDesignation": "Alinéa 1"
    }
  },
  "corps": {
    "dispositif": "<p style=\"text-align: justify;\">Supprimer les alin&#233;as 1 &#224; 6.</p>",
    "exposeSommaire": "<p style=\"text-align: justify;\">&#171;&#160;Du c&#244;t&#233; des m&#233;nages l&#8217;exon&#233;ration d&#8217;imp&#244;t a procur&#233; des gains tr&#232;s in&#233;gaux car l&#8217;avantage &#233;tait croissant en fonction du niveau de revenus en raison de la proportionnalit&#233; des cotisations sociales et, plus encore, de la progressivit&#233; de l&#8217;imp&#244;t sur le revenu. En d&#8217;autres termes, l&#8217;avantage tir&#233; de l&#8217;exon&#233;ration fiscale favorisait les m&#233;nages aux revenus de tranche sup&#233;rieure&#160;&#8211;&#160;car plus un employ&#233; est qualifi&#233;, plus il est soumis aux heures suppl&#233;mentaires&#160;&#8211;&#160;et ne b&#233;n&#233;ficiait pas aux m&#233;nages non imposables, lesquels repr&#233;sentent aujourd&#8217;hui un foyer sur deux.&#8221;&#160;</p><p style=\"text-align: justify;\">Cette brillante d&#233;monstration n&#8217;est pas de notre fait, mais de celui de Corinne Vignon, d&#233;put&#233;e de la majorit&#233;, lors de sa motion de renvoi en commission d&#8217;avril dernier, contre la proposition de loi des R&#233;publicain pr&#233;voyant la d&#233;fiscalisation des heures supl&#233;mentaires. A l&#8217;&#233;poque, la majorit&#233; &#233;tait au diapason des nombreux rapports &#233;tablis sur cette mesure mise en oeuvre sous Sarkozy, et abrog&#233;e depuis, en raison de son co&#251;t exhorbitant pour les finances publiques et de ses effets destructeurs sur l&#8217;emploi. A cela s&#8217;ajoute un effet moins connu mais tout autant &#224; rebours du climat actuel&#160;: l&#8217;exon&#233;ration fiscale des heures supl&#233;mentaires b&#233;n&#233;ficie aux m&#233;nages les plus ais&#233;s, aux salari&#233;s les plus qualifi&#233;s. Et ce n&#8217;est qu&#8217;un des moindres effets n&#233;gatifs de cette mesure, dont le bilan catastrophique &#233;tait, le 11 septembre 2013, d&#233;nonc&#233; ici-m&#234;me par l&#8217;actuel ministre de l&#8217;int&#233;rieur Christophe Castaner qui temp&#233;tait &#171;&#160;La d&#233;fiscalisation des heures supl&#233;mentaires c&#8217;est 4 milliards de cout et 100 000 emplois perdus. Ne l&#8217;oublions pas&#160;!&#160;&#187;</p><p style=\"text-align: justify;\">C&#8217;est un constat que nous partageons, et qui est aussi vrai en 2018 qu&#8217;il ne l&#8217;&#233;tait en 2013. Bien que selon la presse Monsieur Sarkozy serait devenu un fid&#232;le conseiller de Monsieur Macron, comment expliquer un tel revirement&#160;?&#160;</p><p style=\"text-align: justify;\">Rien de moins que le tarissement de votre imagination face &#224; des revendications qui vous d&#233;passent et que vous ne pouvez pas honorer pour ne surtout pas d&#233;cevoir ceux qui vous ont fait &#233;lire et vous soutiennent&#160;: les riches.</p><p style=\"text-align: justify;\">Ne pas contrarier le MEDEF, ne pas contrarier le CAC 40, voici ce qui vous pousse &#224; d&#233;fendre, apr&#232;s l&#8217;avoir combattu il y a moins d&#8217;un an, une mesure purement id&#233;ologique, car inefficace, hostile aux ch&#244;meurs, favorable aux mieux pay&#233;s et ruineuse pour le contribuable, &#224; l&#8217;heure o&#249; nous ne savons toujours pas quelles coupes budg&#233;taires vont venir financer cette mesure.&#160;&#187;</p>",
    "annexeExposeSommaire": {
      "@xmlns:xsi": "http://www.w3.org/2001/XMLSchema-instance",
      "@xsi:nil": "true"
    },
    "cartoucheDelaiDepotDepasse": {
      "@xmlns:xsi": "http://www.w3.org/2001/XMLSchema-instance",
      "@xsi:nil": "true"
    }
  },
  "representations": {
    "representation": {
      "nom": "PDF",
      "typeMime": {
        "type": "application",
        "subType": "PDF"
      },
      "statutRepresentation": {
        "verbatim": "true",
        "canonique": "true",
        "officielle": "true",
        "transcription": "false",
        "enregistrement": "false"
      },
      "repSource": {
        "@xmlns:xsi": "http://www.w3.org/2001/XMLSchema-instance",
        "@xsi:nil": "true"
      },
      "offset": {
        "@xmlns:xsi": "http://www.w3.org/2001/XMLSchema-instance",
        "@xsi:nil": "true"
      },
      "contenu": {
        "documentURI": "/15/amendements/1547/AN/123.pdf"
      },
      "dateDispoRepresentation": {
        "@xmlns:xsi": "http://www.w3.org/2001/XMLSchema-instance",
        "@xsi:nil": "true"
      }
    }
  },
  "seanceDiscussion": "RUANR5L15S2019IDS21438",
  "sort": {
    "dateSaisie": "2018-12-21T00:16:09.000+01:00",
    "sortEnSeance": "Rejeté"
  },
  "dateDepot": "2018-12-20T01:00:00.000+01:00",
  "dateDistribution": "2018-12-20T01:00:00.000+01:00",
  "article99": "0",
  "loiReference": {
    "codeLoi": {
      "@xmlns:xsi": "http://www.w3.org/2001/XMLSchema-instance",
      "@xsi:nil": "true"
    },
    "divisionCodeLoi": {
      "@xmlns:xsi": "http://www.w3.org/2001/XMLSchema-instance",
      "@xsi:nil": "true"
    }
  }
}