{
  "@xmlns": "http://schemas.assemblee-nationale.fr/referentiel",
  "uid": "AMANR5L15PO419604B2272P2D1N68",
  "identifiant": {
    "legislature": "15",
    "numero": "68",
    "numRect": "0",
    "saisine": {
      "refTexteLegislatif": "PRJLANR5L15B2272",
      "numeroPartiePLF": "2",
      "organeExamen": "PO419604",
      "mentionSecondeDeliberation": "0"
    }
  },
  "numeroLong": "II-AC68",
  "etapeTexte": "1ère lecture (1ère assemblée saisie)",
  "triAmendement": "abwaaaaaaaaaaaaaaaaaaaaaaaaaaaaaaaaaaaaaaaaaaaaaaai",
  "cardinaliteAmdtMultiples": "1",
  "amendementParent": {
    "@xmlns:xsi": "http://www.w3.org/2001/XMLSchema-instance",
    "@xsi:nil": "true"
  },
  "etat": "Discuté",
  "signataires": {
    "auteur": {
      "typeAuteur": "Depute",
      "acteurRef": "PA608741",
      "organeRef": {
        "@xmlns:xsi": "http://www.w3.org/2001/XMLSchema-instance",
        "@xsi:nil": "true"
      },
      "groupePolitiqueRef": "PO758835"
    },
    "cosignataires": {
      "acteurRef": [
        "PA720988",
        "PA608741",
        "PA340357",
        "PA332614"
      ]
    },
    "texteAffichable": "Mme&#160;Tolmont,  M.&#160;Juanico, Mme&#160;Manin et Mme&#160;Victory"
  },
  "pointeurFragmentTexte": {
    "missionVisee": {
      "idMissionAN": "843",
      "libelleMission": "Avances à l'audiovisuel public",
      "codeMissionPLF": "D",
      "libelleMissionPLF": "Répartition, par mission et programme, des crédits des comptes d'affectation spéciale et des comptes de concours financiers"
    },
    "division": {
      "titre": "Article 73",
      "articleDesignationCourte": "AVANT ART. 73",
      "type": "ARTICLE",
      "avant_A_Apres": "Avant",
      "divisionRattachee": "AVANT L'ARTICLE 73, insérer l'article suivant:",
      "articleAdditionnel": "1",
      "chapitreAdditionnel": {
        "@xmlns:xsi": "http://www.w3.org/2001/XMLSchema-instance",
        "@xsi:nil": "true"
      },
      "urlDivisionTexteVise": "/15/textes/2272C.asp#D_Article_73"
    },
    "alinea": {
      "@xmlns:xsi": "http://www.w3.org/2001/XMLSchema-instance",
      "@xsi:nil": "true"
    }
  },
  "corps": {
    "dispositif": "<p style=\"text-align: justify;\">Le Gouvernement remet au Parlement, dans un d&#233;lai de six mois &#224; compter de la promulgation de la pr&#233;sente loi, un rapport d&#8217;information sur la situation de France T&#233;l&#233;visions.</p><p style=\"text-align: justify;\">Ce rapport est r&#233;dig&#233; par un groupe de travail associant des membres du Conseil sup&#233;rieur de l&#8217;audiovisuel, de l&#8217;inspection g&#233;n&#233;rale des finances et des repr&#233;sentants des syndicats de France T&#233;l&#233;visions.</p>",
    "exposeSommaire": "<p style=\"text-align: justify;\">Cet amendement des d&#233;put&#233;s Socialistes et apparent&#233;s vise &#224; demander au Gouvernement de remettre un rapport d&#8217;information au Parlement sur la situation de France T&#233;l&#233;visions, dans un d&#233;lai de 6 mois &#224; compter de la promulgation de la pr&#233;sente loi.</p><p style=\"text-align: justify;\">Alors que nous nous approchons de l&#8217;&#233;ch&#233;ance &#224; laquelle la cha&#238;ne France 4 doit &#234;tre supprim&#233;e, un rapport parlementaire d&#8217;un ancien membre de la majorit&#233; pr&#233;sidentielle remet en cause cette suppression en&#160;rappelant que&#160;l&#8217;existence d&#8217;une cha&#238;ne enfants dans le service public est un enjeu politique et culturel.</p><p style=\"text-align: justify;\">Il en va de m&#234;me concernant France &#212;, qui s&#8217;appr&#234;te &#224; dispara&#238;tre. Une telle d&#233;cision remet en cause la parole du candidat Macron, lequel avait exclu une telle hypoth&#232;se en avril 2017.&#160;La fermeture de France &#212;, outre le respect d&#8217;une parole donn&#233;e, porterait atteinte &#224; une mission essentielle de service public&#160;: la continuit&#233; territoriale.</p><p style=\"text-align: justify;\">Entre non-respect de la parole donn&#233;e et contradictions, la majorit&#233; fait ici preuve d&#8217;un cynisme particuli&#232;rement grave. Aussi,&#160;le groupe Socialistes et apparent&#233;s&#160;demande&#160;&#224; ce qu&#8217;un rapport lui soit remis par le gouvernement&#160;afin que le ministre de la Culture puisse d&#233;montrer la n&#233;cessit&#233; de telles suppressions.&#160;</p>",
    "annexeExposeSommaire": {
      "@xmlns:xsi": "http://www.w3.org/2001/XMLSchema-instance",
      "@xsi:nil": "true"
    },
    "cartoucheDelaiDepotDepasse": {
      "@xmlns:xsi": "http://www.w3.org/2001/XMLSchema-instance",
      "@xsi:nil": "true"
    },
    "avantAppel": {
      "@xmlns:xsi": "http://www.w3.org/2001/XMLSchema-instance",
      "@xsi:nil": "true"
    }
  },
  "representations": {
    "representation": {
      "nom": "PDF",
      "typeMime": {
        "type": "application",
        "subType": "PDF"
      },
      "statutRepresentation": {
        "verbatim": "true",
        "canonique": "true",
        "officielle": "true",
        "transcription": "false",
        "enregistrement": "false"
      },
      "repSource": {
        "@xmlns:xsi": "http://www.w3.org/2001/XMLSchema-instance",
        "@xsi:nil": "true"
      },
      "offset": {
        "@xmlns:xsi": "http://www.w3.org/2001/XMLSchema-instance",
        "@xsi:nil": "true"
      },
      "contenu": {
        "documentURI": "/15/amendements/2272C/CION-CEDU/AC68.pdf"
      },
      "dateDispoRepresentation": {
        "@xmlns:xsi": "http://www.w3.org/2001/XMLSchema-instance",
        "@xsi:nil": "true"
      }
    }
  },
  "seanceDiscussion": {
    "@xmlns:xsi": "http://www.w3.org/2001/XMLSchema-instance",
    "@xsi:nil": "true"
  },
  "sort": {
    "dateSaisie": "2019-10-24T13:09:18.000+02:00",
    "sortEnSeance": "Rejeté"
  },
  "dateDepot": "2019-10-18T02:00:00.000+02:00",
  "dateDistribution": "2019-10-22T02:00:00.000+02:00",
  "article99": "0",
  "loiReference": {
    "codeLoi": {
      "@xmlns:xsi": "http://www.w3.org/2001/XMLSchema-instance",
      "@xsi:nil": "true"
    },
    "divisionCodeLoi": {
      "@xmlns:xsi": "http://www.w3.org/2001/XMLSchema-instance",
      "@xsi:nil": "true"
    }
  }
}