{
  "@xmlns": "http://schemas.assemblee-nationale.fr/referentiel",
  "uid": "AMANR5L15SEA717460B1610P0D1N2",
  "identifiant": {
    "legislature": "15",
    "numero": "2",
    "numRect": "0",
    "saisine": {
      "refTexteLegislatif": "PIONANR5L15B1610",
      "numeroPartiePLF": "0",
      "organeExamen": "PO717460",
      "mentionSecondeDeliberation": "0"
    }
  },
  "numeroLong": "2",
  "etapeTexte": "1ère lecture (1ère assemblée saisie)",
  "triAmendement": "biaaaaaaaaaaaaaaaaaaaaaaaaaaaaaaaaaaaaaaaaaaaaaaaai",
  "cardinaliteAmdtMultiples": "1",
  "amendementParent": {
    "@xmlns:xsi": "http://www.w3.org/2001/XMLSchema-instance",
    "@xsi:nil": "true"
  },
  "etat": "Discuté",
  "signataires": {
    "auteur": {
      "typeAuteur": "Depute",
      "acteurRef": "PA721270",
      "organeRef": {
        "@xmlns:xsi": "http://www.w3.org/2001/XMLSchema-instance",
        "@xsi:nil": "true"
      },
      "groupePolitiqueRef": "PO730940"
    },
    "cosignataires": {
      "acteurRef": "PA721270"
    },
    "texteAffichable": "M.&#160;Peu"
  },
  "pointeurFragmentTexte": {
    "missionVisee": {
      "@xmlns:xsi": "http://www.w3.org/2001/XMLSchema-instance",
      "@xsi:nil": "true"
    },
    "division": {
      "titre": "Article PREMIER",
      "articleDesignationCourte": "APRÈS ART. PREMIER",
      "type": "ARTICLE",
      "avant_A_Apres": "Après",
      "divisionRattachee": "APRÈS L'ARTICLE PREMIER, insérer l'article suivant:",
      "articleAdditionnel": "1",
      "chapitreAdditionnel": {
        "@xmlns:xsi": "http://www.w3.org/2001/XMLSchema-instance",
        "@xsi:nil": "true"
      },
      "urlDivisionTexteVise": "/15/textes/1610.asp#D_Article_1er"
    },
    "alinea": {
      "@xmlns:xsi": "http://www.w3.org/2001/XMLSchema-instance",
      "@xsi:nil": "true"
    }
  },
  "corps": {
    "dispositif": "<p style=\"text-align: justify;\">Le dernier alin&#233;a du I de l&#8217;article&#160;24 de la loi n&#176;&#160;2008&#8209;1258 du 3&#160;d&#233;cembre&#160;2008 en faveur des revenus du travail est ainsi r&#233;dig&#233;&#160;:</p><p style=\"text-align: justify;\">&#171;&#160;Les membres du groupe d&#8217;experts sont d&#233;sign&#233;s par la Commission nationale de la n&#233;gociation collective, de l&#8217;emploi et de la formation professionnelle mentionn&#233;e &#224; l&#8217;article L.&#160;2271&#8209;1 du code du travail. Un d&#233;cret d&#233;termine les modalit&#233;s d&#8217;application du pr&#233;sent article.&#160;&#187;</p>",
    "exposeSommaire": "<p style=\"text-align: justify;\">Cet amendement confie &#224; la Commission nationale de la n&#233;gociation collective, de l&#8217;emploi et de la formation professionnelle la comp&#233;tence pour d&#233;signer les membres du groupe d&#8217;experts relatif au SMIC.</p><p style=\"text-align: justify;\">Il s&#8217;agit ainsi de garantir une ind&#233;pendance totale de ses membres, et un avis refl&#233;tant la diversit&#233; des points de vue exprim&#233;s dans le domaine de la revalorisation salariale.</p><p style=\"text-align: justify;\">Il maintient, enfin, le renvoi au pouvoir r&#233;glementaire de la d&#233;finition des modalit&#233;s de fonctionnement du groupe.</p>",
    "annexeExposeSommaire": {
      "@xmlns:xsi": "http://www.w3.org/2001/XMLSchema-instance",
      "@xsi:nil": "true"
    },
    "cartoucheDelaiDepotDepasse": {
      "@xmlns:xsi": "http://www.w3.org/2001/XMLSchema-instance",
      "@xsi:nil": "true"
    }
  },
  "representations": {
    "representation": {
      "nom": "PDF",
      "typeMime": {
        "type": "application",
        "subType": "PDF"
      },
      "statutRepresentation": {
        "verbatim": "true",
        "canonique": "true",
        "officielle": "true",
        "transcription": "false",
        "enregistrement": "false"
      },
      "repSource": {
        "@xmlns:xsi": "http://www.w3.org/2001/XMLSchema-instance",
        "@xsi:nil": "true"
      },
      "offset": {
        "@xmlns:xsi": "http://www.w3.org/2001/XMLSchema-instance",
        "@xsi:nil": "true"
      },
      "contenu": {
        "documentURI": "/15/amendements/1610/AN/2.pdf"
      },
      "dateDispoRepresentation": {
        "@xmlns:xsi": "http://www.w3.org/2001/XMLSchema-instance",
        "@xsi:nil": "true"
      }
    }
  },
  "seanceDiscussion": "RUANR5L15S2019IDS21522",
  "sort": {
    "dateSaisie": "2019-03-07T16:52:18.000+01:00",
    "sortEnSeance": "Tombé"
  },
  "dateDepot": "2019-02-22T01:00:00.000+01:00",
  "dateDistribution": "2019-03-05T01:00:00.000+01:00",
  "article99": "0",
  "loiReference": {
    "codeLoi": "loi  2008-1258",
    "divisionCodeLoi": "24"
  }
}