{
  "@xmlns": "http://schemas.assemblee-nationale.fr/referentiel",
  "uid": "AMANR5L15SEA717460B0235P1D1N158",
  "identifiant": {
    "legislature": "15",
    "numero": "158",
    "numRect": "0",
    "saisine": {
      "refTexteLegislatif": "PRJLANR5L15B0235",
      "numeroPartiePLF": "1",
      "organeExamen": "PO717460",
      "mentionSecondeDeliberation": "0"
    }
  },
  "numeroLong": "I-158",
  "etapeTexte": "1ère lecture (1ère assemblée saisie)",
  "triAmendement": "zzzzzzu",
  "cardinaliteAmdtMultiples": "1",
  "amendementParent": {
    "@xmlns:xsi": "http://www.w3.org/2001/XMLSchema-instance",
    "@xsi:nil": "true"
  },
  "etat": "Discuté",
  "signataires": {
    "auteur": {
      "typeAuteur": "Depute",
      "acteurRef": "PA719608",
      "organeRef": {
        "@xmlns:xsi": "http://www.w3.org/2001/XMLSchema-instance",
        "@xsi:nil": "true"
      },
      "groupePolitiqueRef": "PO723569"
    },
    "cosignataires": {
      "acteurRef": "PA719608"
    },
    "texteAffichable": "Mme&#160;M&#233;nard"
  },
  "pointeurFragmentTexte": {
    "missionVisee": {
      "@xmlns:xsi": "http://www.w3.org/2001/XMLSchema-instance",
      "@xsi:nil": "true"
    },
    "division": {
      "titre": "Article 11",
      "articleDesignationCourte": "ART. 11",
      "type": "ARTICLE",
      "avant_A_Apres": "A",
      "divisionRattachee": "ARTICLE 11",
      "articleAdditionnel": {
        "@xmlns:xsi": "http://www.w3.org/2001/XMLSchema-instance",
        "@xsi:nil": "true"
      },
      "chapitreAdditionnel": {
        "@xmlns:xsi": "http://www.w3.org/2001/XMLSchema-instance",
        "@xsi:nil": "true"
      },
      "urlDivisionTexteVise": "/15/textes/0235A.asp#D_Article_11"
    },
    "alinea": {
      "avant_A_Apres": {
        "@xmlns:xsi": "http://www.w3.org/2001/XMLSchema-instance",
        "@xsi:nil": "true"
      },
      "numero": "6",
      "alineaDesignation": {
        "@xmlns:xsi": "http://www.w3.org/2001/XMLSchema-instance",
        "@xsi:nil": "true"
      }
    }
  },
  "corps": {
    "dispositif": "<p>I.&#160;&#8211;&#160;&#192; la fin de l&#8217;alin&#233;a&#160;6, substituer au taux&#160;:</p><p>&#171;&#160;12,8&#160;%&#160;&#187;,</p><p>le taux&#160;:</p><p>&#171;&#160;22,8&#160;%&#160;&#187;.</p><p>II.&#160;&#8211;&#160;En cons&#233;quence, &#224; la fin des alin&#233;a&#160;27, 46, 180, &#224; l&#8217;alin&#233;a&#160;196, &#224; la fin de l&#8217;alin&#233;a&#160;205, &#224; l&#8217;alin&#233;a&#160;212, &#224; la fin des alin&#233;as 225 et 244 et &#224; l&#8217;alin&#233;a&#160;261, proc&#233;der &#224; la m&#234;me substitution.</p><p>&#160;</p>",
    "exposeSommaire": "<p style=\"text-align: justify;\">L&#8217;article&#160;11 du projet de loi de finances pour 2018 r&#233;tablit les pr&#233;l&#232;vements forfaitaires lib&#233;ratoires sur les revenus de capitaux mobiliers et les plus-values mobili&#232;res, qui avaient &#233;t&#233; supprim&#233;s sous la pr&#233;sidence de M. Fran&#231;ois Hollande.</p><p style=\"text-align: justify;\">Cette r&#233;forme est favorable &#224; l&#8217;&#233;pargne des m&#233;nages et donc au financement de l&#8217;&#233;conomie. En revanche, le taux retenu&#160;&#8211;&#160;12,8&#160;% pour l&#8217;imp&#244;t sur le revenu, auxquels s&#8217;ajouteront 17,2&#160;% de pr&#233;l&#232;vements sociaux&#160;&#8211;&#160;est faible en comparaison du bar&#232;me progressif allant jusqu&#8217;&#224; 45&#160;%, auxquels seront soumis les autres revenus (salaires, pensions, b&#233;n&#233;fices professionnels, revenus fonciers).</p><p style=\"text-align: justify;\">Pour assurer une plus grande &#233;quit&#233; entre les foyers quelle que soit la composition de leurs revenus, le pr&#233;sent amendement rel&#232;ve de 10 points le taux de 12,8&#160;%, qui est donc port&#233; &#224; 22,8&#160;%. L&#8217;&#233;conomie r&#233;sultant de cet amendement pourrait financer une augmentation de l&#8217;abattement sur les successions et donations en ligne directe, qui fait l&#8217;objet d&#8217;un amendement distinct.</p>",
    "annexeExposeSommaire": {
      "@xmlns:xsi": "http://www.w3.org/2001/XMLSchema-instance",
      "@xsi:nil": "true"
    }
  },
  "representations": {
    "representation": {
      "nom": "PDF",
      "typeMime": {
        "type": "application",
        "subType": "PDF"
      },
      "statutRepresentation": {
        "verbatim": "true",
        "canonique": "true",
        "officielle": "true",
        "transcription": "false",
        "enregistrement": "false"
      },
      "repSource": {
        "@xmlns:xsi": "http://www.w3.org/2001/XMLSchema-instance",
        "@xsi:nil": "true"
      },
      "offset": {
        "@xmlns:xsi": "http://www.w3.org/2001/XMLSchema-instance",
        "@xsi:nil": "true"
      },
      "contenu": {
        "documentURI": "/15/amendements/0235A/AN/158.pdf"
      },
      "dateDispoRepresentation": {
        "@xmlns:xsi": "http://www.w3.org/2001/XMLSchema-instance",
        "@xsi:nil": "true"
      }
    }
  },
  "seanceDiscussion": "RUANR5L15S2018IDS20697",
  "sort": {
    "dateSaisie": "2017-10-19T22:16:19.000+02:00",
    "sortEnSeance": "Rejeté"
  },
  "dateDepot": "2017-10-11T02:00:00.000+02:00",
  "dateDistribution": "2017-10-16T02:00:00.000+02:00",
  "article99": "0",
  "loiReference": {
    "codeLoi": {
      "@xmlns:xsi": "http://www.w3.org/2001/XMLSchema-instance",
      "@xsi:nil": "true"
    },
    "divisionCodeLoi": {
      "@xmlns:xsi": "http://www.w3.org/2001/XMLSchema-instance",
      "@xsi:nil": "true"
    }
  }
}