{
  "@xmlns": "http://schemas.assemblee-nationale.fr/referentiel",
  "uid": "AMANR5L15SEA717460BTC2063P0D1N411",
  "identifiant": {
    "legislature": "15",
    "numero": "411",
    "numRect": "1",
    "saisine": {
      "refTexteLegislatif": "PRJLANR5L15BTC2063",
      "numeroPartiePLF": "0",
      "organeExamen": "PO717460",
      "mentionSecondeDeliberation": "0"
    }
  },
  "numeroLong": "411 (Rect)",
  "etapeTexte": "1ère lecture (1ère assemblée saisie)",
  "triAmendement": "boaaaaaaaaaaaaaaaaaaaaaaaaaaaaaaaaaaaaaaaaaaaaaaaaafxc",
  "cardinaliteAmdtMultiples": "1",
  "amendementParent": {
    "@xmlns:xsi": "http://www.w3.org/2001/XMLSchema-instance",
    "@xsi:nil": "true"
  },
  "etat": "Discuté",
  "signataires": {
    "auteur": {
      "typeAuteur": "Depute",
      "acteurRef": "PA719578",
      "organeRef": {
        "@xmlns:xsi": "http://www.w3.org/2001/XMLSchema-instance",
        "@xsi:nil": "true"
      },
      "groupePolitiqueRef": "PO730958"
    },
    "cosignataires": {
      "acteurRef": [
        "PA722142",
        "PA588884",
        "PA719676",
        "PA721062",
        "PA720286",
        "PA720892",
        "PA721210",
        "PA718868",
        "PA721960",
        "PA720422",
        "PA721202",
        "PA719578",
        "PA721226",
        "PA720430",
        "PA2150",
        "PA718860",
        "PA720846"
      ]
    },
    "texteAffichable": "M.&#160;Prud&apos;homme,  Mme&#160;Autain, M.&#160;Bernalicis, M.&#160;Coquerel, M.&#160;Corbi&#232;re, Mme&#160;Fiat, M.&#160;Lachaud, M.&#160;Larive, M.&#160;M&#233;lenchon, Mme&#160;Obono, Mme&#160;Panot, M.&#160;Quatennens, M.&#160;Ratenon, Mme&#160;Ressiguier, Mme&#160;Rubin, M.&#160;Ruffin et Mme&#160;Taurine"
  },
  "pointeurFragmentTexte": {
    "missionVisee": {
      "@xmlns:xsi": "http://www.w3.org/2001/XMLSchema-instance",
      "@xsi:nil": "true"
    },
    "division": {
      "titre": "Article 3",
      "articleDesignationCourte": "APRÈS ART. 3",
      "type": "ARTICLE",
      "avant_A_Apres": "Après",
      "divisionRattachee": "APRÈS L'ARTICLE 3, insérer l'article suivant:",
      "articleAdditionnel": "1",
      "chapitreAdditionnel": {
        "@xmlns:xsi": "http://www.w3.org/2001/XMLSchema-instance",
        "@xsi:nil": "true"
      },
      "urlDivisionTexteVise": "/15/textes/2063.asp#D_Article_3"
    },
    "alinea": {
      "@xmlns:xsi": "http://www.w3.org/2001/XMLSchema-instance",
      "@xsi:nil": "true"
    }
  },
  "corps": {
    "dispositif": "<p style=\"text-align: justify;\">&#192; compter du 1<sup>er</sup> janvier 2020 en cas de changement de locataire et &#224; compter du 1<sup>er</sup> janvier 2022 en cas de changement de propri&#233;taire, tous les logements locatifs du parc priv&#233; dont la consommation en &#233;nergie primaire est sup&#233;rieure &#224; 330 kWh/m&#178; par an doivent avoir fait l&#8217;objet, au moment d&#8217;une mutation, d&#8217;une r&#233;novation &#233;nerg&#233;tique visant une performance &#233;nerg&#233;tique &#233;quivalente aux normes du label &#171;&#160;b&#226;timent basse consommation r&#233;novation&#160;&#187; mentionn&#233; &#224; l&#8217;article&#160;3 de l&#8217;arr&#234;t&#233; du 29 septembre 2009. Un d&#233;cret en Conseil d&#8217;&#201;tat pr&#233;cise les dispositifs financiers mis en place pour accompagner les propri&#233;taires non-occupants qui seraient dans l&#8217;impossibilit&#233; financi&#232;re de r&#233;aliser ces travaux.</p>",
    "exposeSommaire": "<p>Alors que 12 millions de personnes sont encore en situation de pr&#233;carit&#233; &#233;nerg&#233;tique en France et que les prix de l&#8217;&#233;nergie sont amen&#233;s &#224; augmenter, acter un droit pour tous &#224; un logement &#224; la facture d&#8217;&#233;nergie abordable est essentiel. &#160;S&#8217;attaquer &#224; ce chantier de la r&#233;novation n&#8217;est pas seulement capital pour le climat. C&#8217;est essentiel pour l&#8217;&#233;conomie (en r&#233;duisant la facture &#233;nerg&#233;tique), pour l&#8217;emploi (avec des centaines de milliers de cr&#233;ations de postes non-d&#233;localisables), pour faire reculer la pauvret&#233; et am&#233;liorer la sant&#233; de la population (la France compte 3,8 millions de passoires thermiques occup&#233;es par des m&#233;nages appartenant aux quatre premiers d&#233;ciles de revenus).</p><p style=\"text-align: justify;\">Il existe en France 7,4 millions de logements avec une &#233;tiquette &#233;nergie F ou G. Le Gouvernement affichait l&#8217;ambition de r&#233;nover 500 000 logements par an &#224; partir de 2017 et d&#8217;avoir r&#233;nov&#233; avant 2025 les 7 &#224; 8 millions de passoires thermiques du parc priv&#233;. Il disait aussi vouloir concentrer l&#8217;effort de l&#8217;&#201;tat sur l&#8217;&#233;radication en dix ans des 1,5 million de passoires thermiques habit&#233;es par des m&#233;nages propri&#233;taires aux faibles revenus. Or un an apr&#232;s, &#171;&#160;la r&#233;novation &#233;nerg&#233;tique des b&#226;timents [est] au point mort&#160;&#187;, titre un &#233;tat des lieux (https&#160;://cler.org/la-renovation-energetique-des-batiments-au-point-mort/) pr&#233;sent&#233; par le Cler-R&#233;seau pour la transition &#233;nerg&#233;tique.Si la loi vise 500 000 r&#233;novations annuelles au niveau BBC (&#233;tiquette &#233;nergie &#171;&#160;B&#160;&#187;), la r&#233;alit&#233; serait plut&#244;t 40 000, auxquelles s&#8217;ajoutent 300 000 r&#233;novations n&#8217;atteignant pas ce niveau.</p><p style=\"text-align: justify;\">Une r&#233;cente &#233;tude d&#8217;EpE (Entreprises pour l&#8217;Environnement) sur la neutralit&#233; carbone en 2050 (ZEN 2050) pr&#233;conise de passer &#224; une obligation de r&#233;novation. Tel est le sens de notre amendement qui oblige les propri&#233;taires &#224; effectuer la r&#233;novation &#233;nerg&#233;tique de leur logement en cas de changement de locataire apr&#232;s le 1<sup>er</sup> janvier 2020 ou en cas de vente &#224; partir de 2022. Il convient par ailleurs d&#8217;anticiper la n&#233;cessit&#233; d&#8217;aider les bailleurs en difficult&#233; et nous l&#8217; envisageons &#233;galement par le biais d&#8217;un d&#233;cret. Pour autant, notons que la tr&#232;s grande majorit&#233; de ces propri&#233;taires bailleurs peut investir sans aide suppl&#233;mentaire. En effet, seulement 7&#160;% des passoires du parc locatif priv&#233; (218 000 logements) appartiennent &#224; des bailleurs tr&#232;s modestes, et 6&#160;% (197 000 logements) &#224; des bailleurs modestes. Pour eux, l&#8217;Agence nationale de l&#8217;Habitat propose d&#233;j&#224; des aides aux travaux, qui pourraient &#234;tre augment&#233;es en cas d&#8217;obligation r&#233;elle de r&#233;nover.</p>",
    "annexeExposeSommaire": {
      "@xmlns:xsi": "http://www.w3.org/2001/XMLSchema-instance",
      "@xsi:nil": "true"
    },
    "cartoucheDelaiDepotDepasse": {
      "@xmlns:xsi": "http://www.w3.org/2001/XMLSchema-instance",
      "@xsi:nil": "true"
    }
  },
  "representations": {
    "representation": {
      "nom": "PDF",
      "typeMime": {
        "type": "application",
        "subType": "PDF"
      },
      "statutRepresentation": {
        "verbatim": "true",
        "canonique": "true",
        "officielle": "true",
        "transcription": "false",
        "enregistrement": "false"
      },
      "repSource": {
        "@xmlns:xsi": "http://www.w3.org/2001/XMLSchema-instance",
        "@xsi:nil": "true"
      },
      "offset": {
        "@xmlns:xsi": "http://www.w3.org/2001/XMLSchema-instance",
        "@xsi:nil": "true"
      },
      "contenu": {
        "documentURI": "/15/amendements/2063/AN/411.pdf"
      },
      "dateDispoRepresentation": {
        "@xmlns:xsi": "http://www.w3.org/2001/XMLSchema-instance",
        "@xsi:nil": "true"
      }
    }
  },
  "seanceDiscussion": "RUANR5L15S2019IDS21737",
  "sort": {
    "dateSaisie": "2019-06-27T23:48:02.000+02:00",
    "sortEnSeance": "Rejeté"
  },
  "dateDepot": "2019-06-21T02:00:00.000+02:00",
  "dateDistribution": "2019-06-26T02:00:00.000+02:00",
  "article99": "0",
  "loiReference": {
    "codeLoi": {
      "@xmlns:xsi": "http://www.w3.org/2001/XMLSchema-instance",
      "@xsi:nil": "true"
    },
    "divisionCodeLoi": {
      "@xmlns:xsi": "http://www.w3.org/2001/XMLSchema-instance",
      "@xsi:nil": "true"
    }
  }
}