{
  "@xmlns": "http://schemas.assemblee-nationale.fr/referentiel",
  "uid": "AMANR5L15PO419865B0627P0D1N222",
  "identifiant": {
    "legislature": "15",
    "numero": "222",
    "numRect": "0",
    "saisine": {
      "refTexteLegislatif": "PRJLANR5L15B0627",
      "numeroPartiePLF": "0",
      "organeExamen": "PO419865",
      "mentionSecondeDeliberation": "0"
    }
  },
  "numeroLong": "CD222",
  "etapeTexte": "1ère lecture (1ère assemblée saisie)",
  "triAmendement": "bawnx",
  "cardinaliteAmdtMultiples": "1",
  "amendementParent": {
    "@xmlns:xsi": "http://www.w3.org/2001/XMLSchema-instance",
    "@xsi:nil": "true"
  },
  "etat": "Discuté",
  "signataires": {
    "auteur": {
      "typeAuteur": "Depute",
      "acteurRef": "PA720278",
      "organeRef": {
        "@xmlns:xsi": "http://www.w3.org/2001/XMLSchema-instance",
        "@xsi:nil": "true"
      },
      "groupePolitiqueRef": "PO730964"
    },
    "cosignataires": {
      "acteurRef": "PA720278"
    },
    "texteAffichable": "M.&#160;Orphelin"
  },
  "pointeurFragmentTexte": {
    "missionVisee": {
      "@xmlns:xsi": "http://www.w3.org/2001/XMLSchema-instance",
      "@xsi:nil": "true"
    },
    "division": {
      "titre": "Article 11",
      "articleDesignationCourte": "APRÈS ART. 11",
      "type": "ARTICLE",
      "avant_A_Apres": "Après",
      "divisionRattachee": "APRÈS L'ARTICLE 11, insérer l'article suivant:",
      "articleAdditionnel": "1",
      "chapitreAdditionnel": {
        "@xmlns:xsi": "http://www.w3.org/2001/XMLSchema-instance",
        "@xsi:nil": "true"
      },
      "urlDivisionTexteVise": "/15/textes/0627.asp#D_Article_11"
    },
    "alinea": {
      "@xmlns:xsi": "http://www.w3.org/2001/XMLSchema-instance",
      "@xsi:nil": "true"
    }
  },
  "corps": {
    "dispositif": "<p style=\"text-align: justify;\">La liste des indications mentionnant de mani&#232;re exhaustive le ou les pays d&#8217;origine du miel est pr&#233;cis&#233;e par d&#233;cret, venant ainsi modifier le d&#233;cret n&#176;&#160;2003&#8209;587 du 30&#160;juin 2003 pris pour l&#8217;application de l&#8217;article L.&#160;214&#8209;1 du code de la consommation en ce qui concerne le miel.</p>",
    "exposeSommaire": "<p style=\"text-align: justify;\">Le d&#233;cret n&#176;&#160;2003&#8209;587 du 30&#160;juin 2003 pris pour l&#8217;application de l&#8217;article L.&#160;214&#8209;1 du code de la consommation en ce qui concerne le miel ne fournit pas une indication exhaustive de l&#8217;origine du miel. En effet l&#8217;obligation actuelle en cas de m&#233;lange de miels provenant de diff&#233;rents pays est mentionn&#233; comme il suit&#160;:</p><p style=\"text-align: justify;\">&#171;&#160;Le pays ou les pays d&#8217;origine o&#249; le miel a &#233;t&#233; r&#233;colt&#233; sont indiqu&#233;s sur l&#8217;&#233;tiquette.<br /> Toutefois, si le miel est originaire de plus d&#8217;un &#201;tat membre de la Communaut&#233;&#160;europ&#233;enne ou de plus d&#8217;un pays tiers, cette indication peut &#234;tre remplac&#233;e par l&#8217;une des indications suivantes, selon le cas&#160;:<br /> 1&#176; &#171;&#160;M&#233;lange de miels originaires de la CE&#160;&#187;&#160;;<br /> 2&#176; &#171;&#160;M&#233;lange de miels non originaires de la CE&#160;&#187;&#160;;<br /> 3&#176; &#171;&#160;M&#233;lange de miels originaires et non originaires de la CE&#160;&#187;.&#160;&#187;</p><p style=\"text-align: justify;\">Cette indication impr&#233;cise ne permet qu&#8217;une lisibilit&#233; limit&#233;e du ou des pays d&#8217;origine(s) et peut tendre &#224; tromper les consommateurs comme stipul&#233; par l&#8217;&#233;tude de juin&#160;2016 de France Agrimer &#171;&#160;Une origine fran&#231;aise d&#233;clar&#233;e tr&#232;s importante pour les consommateurs ( 80&#160;% des achats en volume), mais un d&#233;calage frappant entre la part r&#233;elle des miels fran&#231;ais disponibles sur le march&#233; et la perception des consommateurs qui pensent acheter essentiellement du miel fran&#231;ais&#160;&#187;.</p><p style=\"text-align: justify;\">Le but de cet amendement est donc que le conseil d&#8217;&#233;tat prenne un nouveau d&#233;cret venant modifier le d&#233;cret actuel en supprimant l&#8217;exception actuellement donn&#233;e en cas de miel r&#233;colt&#233; dans plusieurs pays en obligeant &#224; indiquer de mani&#232;re exhaustive chaque pays d&#8217;origine sur l&#8217;&#233;tiquetage.</p>",
    "annexeExposeSommaire": {
      "@xmlns:xsi": "http://www.w3.org/2001/XMLSchema-instance",
      "@xsi:nil": "true"
    }
  },
  "representations": {
    "representation": {
      "nom": "PDF",
      "typeMime": {
        "type": "application",
        "subType": "PDF"
      },
      "statutRepresentation": {
        "verbatim": "true",
        "canonique": "true",
        "officielle": "true",
        "transcription": "false",
        "enregistrement": "false"
      },
      "repSource": {
        "@xmlns:xsi": "http://www.w3.org/2001/XMLSchema-instance",
        "@xsi:nil": "true"
      },
      "offset": {
        "@xmlns:xsi": "http://www.w3.org/2001/XMLSchema-instance",
        "@xsi:nil": "true"
      },
      "contenu": {
        "documentURI": "/15/amendements/0627/CION-DVP/CD222.pdf"
      },
      "dateDispoRepresentation": {
        "@xmlns:xsi": "http://www.w3.org/2001/XMLSchema-instance",
        "@xsi:nil": "true"
      }
    }
  },
  "seanceDiscussion": {
    "@xmlns:xsi": "http://www.w3.org/2001/XMLSchema-instance",
    "@xsi:nil": "true"
  },
  "sort": {
    "dateSaisie": "2018-03-28T00:32:24.000+02:00",
    "sortEnSeance": "Retiré"
  },
  "dateDepot": "2018-03-23T01:00:00.000+01:00",
  "dateDistribution": "2018-03-26T02:00:00.000+02:00",
  "article99": "0",
  "loiReference": {
    "codeLoi": "xxx",
    "divisionCodeLoi": {
      "@xmlns:xsi": "http://www.w3.org/2001/XMLSchema-instance",
      "@xsi:nil": "true"
    }
  }
}