{
  "@xmlns": "http://schemas.assemblee-nationale.fr/referentiel",
  "uid": "AMANR5L15SEA717460B1297P0D1N279",
  "identifiant": {
    "legislature": "15",
    "numero": "279",
    "numRect": "0",
    "saisine": {
      "refTexteLegislatif": "PRJLANR5L15B1297",
      "numeroPartiePLF": "0",
      "organeExamen": "PO717460",
      "mentionSecondeDeliberation": "0"
    }
  },
  "numeroLong": "279",
  "etapeTexte": "1ère lecture (1ère assemblée saisie)",
  "triAmendement": "beaaaaaaaaaaaaaaaaaaaaaaaaaaaaaaaaaaaaaaaaaaaaaaaajabdzs",
  "cardinaliteAmdtMultiples": "1",
  "amendementParent": {
    "@xmlns:xsi": "http://www.w3.org/2001/XMLSchema-instance",
    "@xsi:nil": "true"
  },
  "etat": "Discuté",
  "signataires": {
    "auteur": {
      "typeAuteur": "Depute",
      "acteurRef": "PA719608",
      "organeRef": {
        "@xmlns:xsi": "http://www.w3.org/2001/XMLSchema-instance",
        "@xsi:nil": "true"
      },
      "groupePolitiqueRef": "PO723569"
    },
    "cosignataires": {
      "acteurRef": "PA719608"
    },
    "texteAffichable": "Mme&#160;M&#233;nard"
  },
  "pointeurFragmentTexte": {
    "missionVisee": {
      "@xmlns:xsi": "http://www.w3.org/2001/XMLSchema-instance",
      "@xsi:nil": "true"
    },
    "division": {
      "titre": "Article 11",
      "articleDesignationCourte": "ART. 11",
      "type": "ARTICLE",
      "avant_A_Apres": "A",
      "divisionRattachee": "ARTICLE 11",
      "articleAdditionnel": {
        "@xmlns:xsi": "http://www.w3.org/2001/XMLSchema-instance",
        "@xsi:nil": "true"
      },
      "chapitreAdditionnel": {
        "@xmlns:xsi": "http://www.w3.org/2001/XMLSchema-instance",
        "@xsi:nil": "true"
      },
      "urlDivisionTexteVise": "/15/textes/1297.asp#D_Article_11"
    },
    "alinea": {
      "avant_A_Apres": "Avant",
      "numero": "1",
      "alineaDesignation": "Avant l'alinéa 1"
    }
  },
  "corps": {
    "dispositif": "<p style=\"text-align: justify;\">I.&#160;&#8211;&#160;Au d&#233;but, ajouter l&#8217;alin&#233;a suivant&#160;:</p><p style=\"text-align: justify;\">&#171;&#160;I&#160;A.&#160;&#8211;&#160;Au 2&#176; du II de l&#8217;article L.&#160;136&#8209;8 du code de la s&#233;curit&#233; sociale, le taux&#160;: &#171;&#160;8,3&#160;%&#160;&#187; est remplac&#233; par le taux&#160;: &#171;&#160;6,6&#160;%&#160;&#187;.</p><p style=\"text-align: justify;\">II.&#160;&#8211;&#160;Compl&#233;ter cet article par l&#8217;alin&#233;a suivant&#160;:</p><p style=\"text-align: justify;\">&#171;&#160;III.&#160;&#8211;&#160;La perte de recettes pour les organismes de s&#233;curit&#233; sociale est compens&#233;e par une majoration, &#224; due concurrence, des droits vis&#233;s aux articles 575 et 575 A du code g&#233;n&#233;ral des imp&#244;ts.&#160;&#187;</p>",
    "exposeSommaire": "<p style=\"text-align: justify;\">D&#233;j&#224;, lors du pr&#233;c&#233;dent projet de loi de financement de la s&#233;curit&#233; sociale, de nombreux parlementaires s&#8217;&#233;taient exprim&#233;s pour que l&#8217;augmentation du taux de la Contribution sociale g&#233;n&#233;ralis&#233;e (CSG) soit supprim&#233;e au motif qu&#8217;elle affectait 60&#160;% des retrait&#233;s&#160;&#8211;&#160;soit 8 millions de Fran&#231;ais - qui ont travaill&#233; toute leur vie. Malgr&#233; les nombreuses mises en garde de tous les bords de l&#8217;h&#233;micycle qui d&#233;criaient une mesure particuli&#232;rement injuste, Emmanuel Macron &#171;&#160;assumait&#160;&#187; -&#160;et continue de le faire - vouloir transf&#233;rer une partie de l&#8217;argent des &#171;&#160;passifs&#160;&#187; vers les &#171;&#160;actifs&#160;&#187;.</p><p style=\"text-align: justify;\">Aujourd&#8217;hui le gouvernement r&#233;vise sa copie estimant que sa mesure n&#8217;&#233;tait tout de m&#234;me pas si juste que cela.</p><p style=\"text-align: justify;\">Malgr&#233; cette r&#233;vision, la hausse de la CSG pour les retrait&#233;s reste une mesure in&#233;quitable. C&#8217;est pourquoi il convient de la supprimer.</p>",
    "annexeExposeSommaire": {
      "@xmlns:xsi": "http://www.w3.org/2001/XMLSchema-instance",
      "@xsi:nil": "true"
    }
  },
  "representations": {
    "representation": {
      "nom": "PDF",
      "typeMime": {
        "type": "application",
        "subType": "PDF"
      },
      "statutRepresentation": {
        "verbatim": "true",
        "canonique": "true",
        "officielle": "true",
        "transcription": "false",
        "enregistrement": "false"
      },
      "repSource": {
        "@xmlns:xsi": "http://www.w3.org/2001/XMLSchema-instance",
        "@xsi:nil": "true"
      },
      "offset": {
        "@xmlns:xsi": "http://www.w3.org/2001/XMLSchema-instance",
        "@xsi:nil": "true"
      },
      "contenu": {
        "documentURI": "/15/amendements/1297/AN/279.pdf"
      },
      "dateDispoRepresentation": {
        "@xmlns:xsi": "http://www.w3.org/2001/XMLSchema-instance",
        "@xsi:nil": "true"
      }
    }
  },
  "seanceDiscussion": "RUANR5L15S2019IDS21292",
  "sort": {
    "dateSaisie": "2018-10-25T22:20:35.000+02:00",
    "sortEnSeance": "Rejeté"
  },
  "dateDepot": "2018-10-17T02:00:00.000+02:00",
  "dateDistribution": "2018-10-22T02:00:00.000+02:00",
  "article99": "0",
  "loiReference": {
    "codeLoi": null,
    "divisionCodeLoi": null
  }
}