{
  "@xmlns": "http://schemas.assemblee-nationale.fr/referentiel",
  "uid": "AMANR5L15SEA717460BTC0938P0D1N103",
  "identifiant": {
    "legislature": "15",
    "numero": "103",
    "numRect": "0",
    "saisine": {
      "refTexteLegislatif": "PRJLANR5L15BTC0938",
      "numeroPartiePLF": "0",
      "organeExamen": "PO717460",
      "mentionSecondeDeliberation": "0"
    }
  },
  "numeroLong": "103",
  "etapeTexte": "1ère lecture (1ère assemblée saisie)",
  "triAmendement": "broo",
  "cardinaliteAmdtMultiples": "1",
  "amendementParent": {
    "@xmlns:xsi": "http://www.w3.org/2001/XMLSchema-instance",
    "@xsi:nil": "true"
  },
  "etat": "Discuté",
  "signataires": {
    "auteur": {
      "typeAuteur": "Depute",
      "acteurRef": "PA721384",
      "organeRef": {
        "@xmlns:xsi": "http://www.w3.org/2001/XMLSchema-instance",
        "@xsi:nil": "true"
      },
      "groupePolitiqueRef": "PO730964"
    },
    "cosignataires": {
      "acteurRef": [
        "PA720046",
        "PA718962",
        "PA721384",
        "PA719624",
        "PA721398",
        "PA721876",
        "PA720854",
        "PA720560",
        "PA720202",
        "PA721784",
        "PA720108",
        "PA720814",
        "PA719024",
        "PA719330",
        "PA721946",
        "PA719440",
        "PA720806",
        "PA719170",
        "PA719830",
        "PA718756",
        "PA720310",
        "PA721246",
        "PA720014",
        "PA720198"
      ]
    },
    "texteAffichable": "Mme&#160;Fontenel-Personne,  Mme&#160;Couillard, Mme&#160;Oppelt, M.&#160;Cazenove, M.&#160;D&#233;moulin, Mme&#160;Dufeu Schubert, M.&#160;Test&#233;, M.&#160;Arend, Mme&#160;Goulet, Mme&#160;Tiegna, Mme&#160;Gaillot, M.&#160;Morenas, Mme&#160;Gomez-Bassac, M.&#160;Cellier, M.&#160;Zulesi, M.&#160;Marilossian, Mme&#160;Charvier, M.&#160;Blanchet, M.&#160;Galbadon, Mme&#160;Bono-Vandorme, M.&#160;Gouttefarde, Mme&#160;Gayte, Mme&#160;Krimi et Mme&#160;Degois"
  },
  "pointeurFragmentTexte": {
    "missionVisee": {
      "@xmlns:xsi": "http://www.w3.org/2001/XMLSchema-instance",
      "@xsi:nil": "true"
    },
    "division": {
      "titre": "Article 2",
      "articleDesignationCourte": "ART. 2",
      "type": "ARTICLE",
      "avant_A_Apres": "A",
      "divisionRattachee": "ARTICLE 2",
      "articleAdditionnel": {
        "@xmlns:xsi": "http://www.w3.org/2001/XMLSchema-instance",
        "@xsi:nil": "true"
      },
      "chapitreAdditionnel": {
        "@xmlns:xsi": "http://www.w3.org/2001/XMLSchema-instance",
        "@xsi:nil": "true"
      },
      "urlDivisionTexteVise": "/15/textes/0938.asp#D_Article_2"
    },
    "alinea": {
      "avant_A_Apres": "Apres",
      "numero": "4",
      "alineaDesignation": {
        "@xmlns:xsi": "http://www.w3.org/2001/XMLSchema-instance",
        "@xsi:nil": "true"
      }
    }
  },
  "corps": {
    "dispositif": "<p>Apr&#232;s l&#8217;alin&#233;a&#160;4, ins&#233;rer l&#8217;alin&#233;a suivant&#160;:</p><p>&#171;&#160;2&#176;&#160;<i>bis </i>Le&#160;11&#176; de l&#8217;article&#160;222&#8209;24 est compl&#233;t&#233; par les mots&#160;: &#171;&#160;, qu&#8217;il s&#8217;agisse d&#8217;une relation actuelle ou pass&#233;e&#160;&#187;.&#160;&#187;</p>",
    "exposeSommaire": "<p style=\"text-align: justify;\">L&#8217;article&#160;132&#8209;80 du code p&#233;nal &#233;nonce que, dans les cas respectivement pr&#233;vus par la loi ou le r&#232;glement, les peines sont aggrav&#233;es lorsque l&#8217;infraction est commise par le conjoint, le concubin ou le partenaire li&#233; &#224; la victime de violences par un PACS. Il pr&#233;cise qu&#8217;elles sont &#233;galement aggrav&#233;es en raison des relations ayant exist&#233; entre l&#8217;auteur des faits et la victime.</p><p style=\"text-align: justify;\">N&#233;anmoins, l&#8217;infraction d&#233;finie &#224; l&#8217;article&#160;222&#8209;24 du code p&#233;nal pour laquelle cette circonstance aggravante est pr&#233;vue ne pr&#233;cise pas qu&#8217;il peut s&#8217;agir d&#8217;une relation pass&#233;e.</p><p style=\"text-align: justify;\">La circonstance aggravante est applicable d&#232;s lors que l&#8217;infraction est commise en raison des relations existantes entre l&#8217;auteur des faits et la victime mais il n&#8217;est en effet pas clair qu&#8217;elle s&#8217;applique &#233;galement pour une ancienne relation.</p><p style=\"text-align: justify;\">Il s&#8217;agit donc d&#8217;inscrire cette pr&#233;cision dans cet article concern&#233; par cette circonstance aggravante.</p><p style=\"text-align: justify;\">Dans le cadre du projet de loi visant &#224; lutter contre les violences sexuelles et sexistes, l&#8217;int&#233;r&#234;t pour la victime de violences est d&#8217;avoir pleinement conscience que cette circonstance aggravante s&#8217;applique aussi lorsque lorsque l&#8217;infraction est commise par l&#8217;ancien conjoint, l&#8217;ancien concubin ou l&#8217;ancien partenaire li&#233; &#224; la victime par un PACS.</p>",
    "annexeExposeSommaire": {
      "@xmlns:xsi": "http://www.w3.org/2001/XMLSchema-instance",
      "@xsi:nil": "true"
    }
  },
  "representations": {
    "representation": {
      "nom": "PDF",
      "typeMime": {
        "type": "application",
        "subType": "PDF"
      },
      "statutRepresentation": {
        "verbatim": "true",
        "canonique": "true",
        "officielle": "true",
        "transcription": "false",
        "enregistrement": "false"
      },
      "repSource": {
        "@xmlns:xsi": "http://www.w3.org/2001/XMLSchema-instance",
        "@xsi:nil": "true"
      },
      "offset": {
        "@xmlns:xsi": "http://www.w3.org/2001/XMLSchema-instance",
        "@xsi:nil": "true"
      },
      "contenu": {
        "documentURI": "/15/amendements/0938/AN/103.pdf"
      },
      "dateDispoRepresentation": {
        "@xmlns:xsi": "http://www.w3.org/2001/XMLSchema-instance",
        "@xsi:nil": "true"
      }
    }
  },
  "seanceDiscussion": "RUANR5L15S2018IDS21031",
  "sort": {
    "dateSaisie": "2018-05-16T00:32:51.000+02:00",
    "sortEnSeance": "Retiré"
  },
  "dateDepot": "2018-05-11T02:00:00.000+02:00",
  "dateDistribution": "2018-05-14T02:00:00.000+02:00",
  "article99": "0",
  "loiReference": {
    "codeLoi": {
      "@xmlns:xsi": "http://www.w3.org/2001/XMLSchema-instance",
      "@xsi:nil": "true"
    },
    "divisionCodeLoi": {
      "@xmlns:xsi": "http://www.w3.org/2001/XMLSchema-instance",
      "@xsi:nil": "true"
    }
  }
}