{
  "@xmlns": "http://schemas.assemblee-nationale.fr/referentiel",
  "uid": "AMANR5L15SEA717460B0235P1D1N457",
  "identifiant": {
    "legislature": "15",
    "numero": "457",
    "numRect": "0",
    "saisine": {
      "refTexteLegislatif": "PRJLANR5L15B0235",
      "numeroPartiePLF": "1",
      "organeExamen": "PO717460",
      "mentionSecondeDeliberation": "0"
    }
  },
  "numeroLong": "I-457",
  "etapeTexte": "1ère lecture (1ère assemblée saisie)",
  "triAmendement": "zzzzzs",
  "cardinaliteAmdtMultiples": "1",
  "amendementParent": {
    "@xmlns:xsi": "http://www.w3.org/2001/XMLSchema-instance",
    "@xsi:nil": "true"
  },
  "etat": "Irrecevable",
  "signataires": {
    "auteur": {
      "typeAuteur": "Depute",
      "acteurRef": "PA605036",
      "organeRef": {
        "@xmlns:xsi": "http://www.w3.org/2001/XMLSchema-instance",
        "@xsi:nil": "true"
      },
      "groupePolitiqueRef": "PO730934"
    },
    "cosignataires": {
      "acteurRef": [
        "PA330684",
        "PA266797",
        "PA718850",
        "PA608826",
        "PA721474",
        "PA1327",
        "PA607090",
        "PA721636",
        "PA719318",
        "PA605036",
        "PA721314",
        "PA721410",
        "PA712015",
        "PA642847",
        "PA605991",
        "PA332523",
        "PA267318",
        "PA719946",
        "PA2377",
        "PA334654",
        "PA856",
        "PA2086",
        "PA718884",
        "PA342935",
        "PA267204",
        "PA267429",
        "PA606712",
        "PA608016",
        "PA608416"
      ]
    },
    "texteAffichable": "M.&#160;Abad,  M.&#160;Peltier, M.&#160;Sermier, M.&#160;Bazin, Mme&#160;Bazin-Malgras, M.&#160;Viry, Mme&#160;Val&#233;rie&#160;Boyer, M.&#160;Grelier, M.&#160;Straumann, M.&#160;Hetzel, M.&#160;Forissier, Mme&#160;Anthoine, M.&#160;Perrut, M.&#160;Marlin, M.&#160;Cordier, M.&#160;Cinieri, Mme&#160;Dalloz, M.&#160;Cherpion, M.&#160;Dive, M.&#160;Parigi, Mme&#160;Louwagie, Mme&#160;Bonnivard, Mme&#160;Marianne&#160;Dubois, M.&#160;Lurton, M.&#160;Jean-Pierre&#160;Vigier, M.&#160;Schellenberger, M.&#160;Gosselin, Mme&#160;Duby-Muller et Mme&#160;Genevard"
  },
  "pointeurFragmentTexte": {
    "missionVisee": {
      "@xmlns:xsi": "http://www.w3.org/2001/XMLSchema-instance",
      "@xsi:nil": "true"
    },
    "division": {
      "titre": "Article 2",
      "articleDesignationCourte": "APRÈS ART. 2",
      "type": "ARTICLE",
      "avant_A_Apres": "Après",
      "divisionRattachee": "APRÈS L'ARTICLE 2, insérer l'article suivant:",
      "articleAdditionnel": "1",
      "chapitreAdditionnel": {
        "@xmlns:xsi": "http://www.w3.org/2001/XMLSchema-instance",
        "@xsi:nil": "true"
      },
      "urlDivisionTexteVise": "/15/textes/0235A.asp#D_Article_2"
    },
    "alinea": {
      "@xmlns:xsi": "http://www.w3.org/2001/XMLSchema-instance",
      "@xsi:nil": "true"
    }
  },
  "corps": {
    "dispositif": "<p style=\"text-align: justify;\">Avant le 30&#160;avril 2018, le Gouvernement pr&#233;sente au Parlement un rapport sur l&#8217;opportunit&#233; d&#8217;une optimisation fiscale encourageant l&#8217;installation des m&#233;decins dans la France des territoires, et sur les solutions pr&#233;conis&#233;es pour rem&#233;dier aux probl&#232;mes soulev&#233;s.</p>",
    "exposeSommaire": "<p style=\"text-align: justify;\">La France des territoires, riche de sa diversit&#233;, ne doit pas &#234;tre la grande d&#233;laiss&#233;e de la R&#233;publique.</p><p style=\"text-align: justify;\">Si la m&#233;tropolisation a permis &#224; la France de conserver son rang international, elle a accentu&#233; les fractures et les in&#233;galit&#233;s internes. Pour la premi&#232;re fois depuis plus d&#8217;un si&#232;cle, 51&#160;% des Fran&#231;ais vivent dans les communes de moins de 10&#160;000 habitants. Ce chiffre est &#233;loquent&#160;: il traduit la n&#233;cessit&#233; de trouver un mod&#232;le compl&#233;mentaire et alternatif &#224; celui des m&#233;tropoles qui est celui de la France des territoires.</p><p style=\"text-align: justify;\">Les patients se retrouvent sans m&#233;decin traitant, les praticiens voient leurs conditions de travail se d&#233;grader faute de rempla&#231;ants, et les &#233;lus locaux sont confront&#233;s &#224; la col&#232;re de leurs administr&#233;s devant le manque de solutions.</p><p style=\"text-align: justify;\">Une r&#233;cente &#233;tude (UFC-Que choisir&#160;&#8211;&#160;juin 2016) r&#233;v&#232;le que 14,6 millions de personnes vivent en 2016 dans un territoire o&#249; l&#8217;offre de soins lib&#233;rale est &#171;&#160;notoirement insuffisante&#160;&#187;. En quatre ans, plus du quart des Fran&#231;ais a vu diminuer le nombre de m&#233;decins g&#233;n&#233;ralistes accessibles en moins de 30 minutes en voiture.</p><p style=\"text-align: justify;\">Plus grave encore, le temps d&#8217;attente pour obtenir un rendez-vous chez un m&#233;decin n&#8217;a cess&#233; d&#8217;augmenter depuis cinq ans. Deux Fran&#231;ais sur trois renoncent aujourd&#8217;hui &#224; des soins &#224; cause des d&#233;lais d&#8217;attente, contre 59&#160;% en 2012 (selon une &#233;tude men&#233;e en 2015 par l&#8217;Observatoire Jalma sur l&#8217;acc&#232;s aux soins). La situation concernant les sp&#233;cialistes est pire encore&#160;: &#224; titre d&#8217;exemple, le d&#233;lai est en moyenne de 110 jours pour un rendez-vous avec un ophtalmologiste...</p><p style=\"text-align: justify;\">Cet amendement propose que le Gouvernement remette au Parlement un rapport sur l&#8217;impact de la d&#233;sertification m&#233;dicale sur les territoires et de proposer des solutions concr&#232;tes, comme des instances fiscales pour aider &#224; lutter contre ce fl&#233;au.</p>",
    "annexeExposeSommaire": {
      "@xmlns:xsi": "http://www.w3.org/2001/XMLSchema-instance",
      "@xsi:nil": "true"
    }
  },
  "representations": {
    "representation": {
      "nom": "PDF",
      "typeMime": {
        "type": "application",
        "subType": "PDF"
      },
      "statutRepresentation": {
        "verbatim": "true",
        "canonique": "true",
        "officielle": "true",
        "transcription": "false",
        "enregistrement": "false"
      },
      "repSource": {
        "@xmlns:xsi": "http://www.w3.org/2001/XMLSchema-instance",
        "@xsi:nil": "true"
      },
      "offset": {
        "@xmlns:xsi": "http://www.w3.org/2001/XMLSchema-instance",
        "@xsi:nil": "true"
      },
      "contenu": {
        "documentURI": "/15/amendements/0235A/AN/457.pdf"
      },
      "dateDispoRepresentation": {
        "@xmlns:xsi": "http://www.w3.org/2001/XMLSchema-instance",
        "@xsi:nil": "true"
      }
    }
  },
  "seanceDiscussion": {
    "@xmlns:xsi": "http://www.w3.org/2001/XMLSchema-instance",
    "@xsi:nil": "true"
  },
  "sort": {
    "@xmlns:xsi": "http://www.w3.org/2001/XMLSchema-instance",
    "@xsi:nil": "true"
  },
  "dateDepot": "2017-10-12T02:00:00.000+02:00",
  "dateDistribution": {
    "@xmlns:xsi": "http://www.w3.org/2001/XMLSchema-instance",
    "@xsi:nil": "true"
  },
  "article99": "0",
  "loiReference": {
    "codeLoi": {
      "@xmlns:xsi": "http://www.w3.org/2001/XMLSchema-instance",
      "@xsi:nil": "true"
    },
    "divisionCodeLoi": {
      "@xmlns:xsi": "http://www.w3.org/2001/XMLSchema-instance",
      "@xsi:nil": "true"
    }
  }
}