{
  "@xmlns": "http://schemas.assemblee-nationale.fr/referentiel",
  "uid": "AMANR5L15SEA717460B1255P2D1N292",
  "identifiant": {
    "legislature": "15",
    "numero": "292",
    "numRect": "0",
    "saisine": {
      "refTexteLegislatif": "PRJLANR5L15B1255",
      "numeroPartiePLF": "2",
      "organeExamen": "PO717460",
      "mentionSecondeDeliberation": "1"
    }
  },
  "numeroLong": "II-292",
  "etapeTexte": "1ère lecture (1ère assemblée saisie)",
  "triAmendement": "hiaaaaaaaaaaaaaaaaaaaaaaaaaaaaaaaaaaaaaaaaaaaaaaaawkknzzi",
  "cardinaliteAmdtMultiples": "1",
  "amendementParent": {
    "@xmlns:xsi": "http://www.w3.org/2001/XMLSchema-instance",
    "@xsi:nil": "true"
  },
  "etat": "Discuté",
  "signataires": {
    "auteur": {
      "typeAuteur": "Depute",
      "acteurRef": "PA608016",
      "organeRef": {
        "@xmlns:xsi": "http://www.w3.org/2001/XMLSchema-instance",
        "@xsi:nil": "true"
      },
      "groupePolitiqueRef": "PO730934"
    },
    "cosignataires": {
      "acteurRef": [
        "PA721636",
        "PA718780",
        "PA720644",
        "PA2377",
        "PA720210",
        "PA642847",
        "PA608016",
        "PA721506",
        "PA267289"
      ]
    },
    "texteAffichable": "Mme&#160;Louwagie,  M.&#160;Perrut, M.&#160;Nury, Mme&#160;Trastour-Isnart, M.&#160;Bazin, M.&#160;Door, M.&#160;Parigi, Mme&#160;Beauvais et Mme&#160;Kuster"
  },
  "pointeurFragmentTexte": {
    "missionVisee": {
      "@xmlns:xsi": "http://www.w3.org/2001/XMLSchema-instance",
      "@xsi:nil": "true"
    },
    "division": {
      "titre": "Article 60",
      "articleDesignationCourte": "APRÈS ART. 60",
      "type": "ARTICLE",
      "avant_A_Apres": "Après",
      "divisionRattachee": "APRÈS L'ARTICLE 60, insérer l'article suivant:",
      "articleAdditionnel": "1",
      "chapitreAdditionnel": {
        "@xmlns:xsi": "http://www.w3.org/2001/XMLSchema-instance",
        "@xsi:nil": "true"
      },
      "urlDivisionTexteVise": "/15/textes/1255C.asp#D_Article_60"
    },
    "alinea": {
      "@xmlns:xsi": "http://www.w3.org/2001/XMLSchema-instance",
      "@xsi:nil": "true"
    }
  },
  "corps": {
    "dispositif": "<p style=\"text-align: justify;\">I.&#160;&#8211;&#160;Pour l&#8217;ann&#233;e 2020, une fraction du produit de la taxe int&#233;rieure de consommation sur les produits &#233;nerg&#233;tiques pr&#233;vue &#224; l&#8217;article&#160;265 du code des douanes revenant &#224; l&#8217;&#201;tat est attribu&#233;e aux collectivit&#233;s territoriales ou leurs groupements ayant adopt&#233; un plan climat-air-&#233;nergie territorial conform&#233;ment au I de l&#8217;article L.&#160;229&#8209;26 du code de l&#8217;environnement.</p><p style=\"text-align: justify;\">Cette fraction est calcul&#233;e de mani&#232;re &#224; ce que le montant vers&#233; &#224; chaque collectivit&#233; concern&#233;e s&#8217;&#233;l&#232;ve &#224; 10&#160;&#8364; par habitant au maximum.</p><p style=\"text-align: justify;\">II.&#160;&#8211;&#160;Pour l&#8217;ann&#233;e 2020, une fraction du produit de la taxe int&#233;rieure de consommation sur les produits &#233;nerg&#233;tiques pr&#233;vue &#224; l&#8217;article&#160;265 du code des douanes revenant &#224; l&#8217;&#201;tat est attribu&#233;e aux collectivit&#233;s territoriales ayant adopt&#233; un sch&#233;ma r&#233;gional du climat, de l&#8217;air et de l&#8217;&#233;nergie conform&#233;ment &#224; l&#8217;article L.&#160;222&#8209;1 du code de l&#8217;environnement ou un sch&#233;ma r&#233;gional d&#8217;am&#233;nagement, de d&#233;veloppement durable et d&#8217;&#233;galit&#233; des territoires conform&#233;ment &#224; l&#8217;article L.&#160;4251&#8209;1 du code g&#233;n&#233;ral des collectivit&#233;s territoriales.</p><p style=\"text-align: justify;\">Cette fraction est calcul&#233;e de mani&#232;re &#224; ce que le montant vers&#233; &#224; chaque collectivit&#233; concern&#233;e s&#8217;&#233;l&#232;ve &#224; 5&#160;&#8364; par habitant au maximum.</p><p style=\"text-align: justify;\">III.&#160;&#8211;&#160;Le versement de la fraction du produit de la taxe int&#233;rieure de consommation sur les produits &#233;nerg&#233;tiques pr&#233;vue &#224; l&#8217;article&#160;265 du code des douanes mentionn&#233;e au I et au II est conditionn&#233;e &#224; la signature d&#8217;un contrat territorial bas carbone entre l&#8217;&#201;tat et la collectivit&#233; b&#233;n&#233;ficiaire. Ce contrat est accessible &#224; toutes les collectivit&#233;s ayant adopt&#233; un plan climat-air-&#233;nergie territorial conform&#233;ment au I de l&#8217;article L.&#160;229&#8209;26 du code de l&#8217;environnement, un sch&#233;ma r&#233;gional du climat, de l&#8217;air et de l&#8217;&#233;nergie conform&#233;ment &#224; l&#8217;article L.&#160;222&#8209;1 du code de l&#8217;environnement ou un sch&#233;ma r&#233;gional d&#8217;am&#233;nagement, de d&#233;veloppement durable et d&#8217;&#233;galit&#233; des territoires conform&#233;ment &#224; l&#8217;article L.&#160;4251&#8209;1 du code g&#233;n&#233;ral des collectivit&#233;s territoriales. Il &#233;tablit les besoins en ing&#233;nierie, en &#233;tudes et en animation qui sont n&#233;cessaires &#224; la collectivit&#233; pour enclencher les investissements qui permettront de mettre en &#339;uvre les actions pr&#233;vues par le plan climat air &#233;nergie territorial, le sch&#233;ma r&#233;gional du climat, de l&#8217;air et de l&#8217;&#233;nergie, ou le sch&#233;ma r&#233;gional d&#8217;am&#233;nagement, de d&#233;veloppement durable et d&#8217;&#233;galit&#233; des territoires, et les actions que la collectivit&#233; s&#8217;engage &#224; financer avec la fraction de taxe qui lui est affect&#233;e.&#160;</p><p style=\"text-align: justify;\">IV.&#160;&#8211;&#160;La perte de recettes r&#233;sultant pour l&#8217;&#201;tat du I et du II du pr&#233;sent article est compens&#233;e, &#224; due concurrence, par la cr&#233;ation d&#8217;une taxe additionnelle aux droits pr&#233;vus aux articles 575 et 575 A du code g&#233;n&#233;ral des imp&#244;ts.</p>",
    "exposeSommaire": "<p style=\"text-align: justify;\">Amendement de repli.</p><p style=\"text-align: justify;\">La loi de transition &#233;nerg&#233;tique a fix&#233; des objectifs pr&#233;cis et ambitieux (r&#233;duction de 40&#160;% des &#233;missions de gaz &#224; effet de serre, r&#233;duction de 50&#160;% de la consommation d&#8217;&#233;nergie finale, augmentation &#224; 32&#160;% de la part des &#233;nergies renouvelables dans la consommation d&#8217;&#233;nergie, r&#233;novation &#233;nerg&#233;tique de 500 000 logements par an &#224; partir de 2017).</p><p style=\"text-align: justify;\">Cependant, force est de constater que le risque que ces objectifs nationaux vot&#233;s par une grande majorit&#233; des parlementaires ne soient pas atteints est important, &#224; la fois en raison des prix bas de l&#8217;&#233;nergie et en raison du manque de moyens financiers des acteurs potentiels de la transition &#233;nerg&#233;tique.</p><p style=\"text-align: justify;\">En France, l&#8217;&#233;laboration et la mise en &#339;uvre des Plans Climat-Air-&#201;nergie territoriaux (PCAET) &#224; l&#8217;&#233;chelle des intercommunalit&#233;s et du volet &#233;nergie des Sch&#233;mas R&#233;gionaux d&#8217;Am&#233;nagement et de D&#233;veloppement Durable et d&#8217;&#201;galit&#233; des Territoires (SRADDET) &#224; l&#8217;&#233;chelle des r&#233;gions doivent permettre de structurer cette mise en mouvement g&#233;n&#233;ralis&#233;e des territoires en faveur de la transition &#233;nerg&#233;tique.</p><p style=\"text-align: justify;\">Mais les collectivit&#233;s comp&#233;tentes (EPCI, R&#233;gion) se sont vues transf&#233;rer de nouvelles comp&#233;tences sans aucun transfert de moyens. Sans moyens, ces plans et sch&#233;mas ne pourront &#234;tre mis en &#339;uvre et risquent de rester en grande partie &#224; l&#8217;&#233;tat d&#8217;intention. Ce risque est aggrav&#233; en cette p&#233;riode de restriction budg&#233;taire et de r&#233;forme des finances publiques locales privant quasiment de toute marge de man&#339;uvre les collectivit&#233;s.</p><p style=\"text-align: justify;\">Si l&#8217;&#233;laboration d&#8217;un plan ou sch&#233;ma co&#251;te environ 1&#160;euro/habitant, sa mise en &#339;uvre &#224; l&#8217;&#233;chelle du territoire co&#251;te 100 &#224; 200&#160;euros/habitant. L&#8217;atteinte des objectifs de ces documents de planification suppose en effet des actions importantes et co&#251;teuses pour les collectivit&#233;s&#160;: r&#233;novation &#233;nerg&#233;tique de leur propre patrimoine (rendue obligatoire par la loi de transition &#233;nerg&#233;tique pour les b&#226;timents &#224; usage tertiaire), accompagnement de la r&#233;novation des particuliers (notamment via la mise en place des Plateformes Territoriales de la R&#233;novation &#201;nerg&#233;tique, qui doivent couvrir l&#8217;ensemble du territoire d&#8217;apr&#232;s la loi de transition &#233;nerg&#233;tique, et dont le financement est assur&#233; en partie par les collectivit&#233;s), d&#233;veloppement de projets d&#8217;&#233;nergies&#160;renouvelables &#233;lectriques et thermiques&#8230;</p><p style=\"text-align: justify;\">Dans le m&#234;me temps, la loi de finances pour 2018 a act&#233; une acc&#233;l&#233;ration de l&#8217;augmentation de la Contribution Climat &#201;nergie (CCE), qui atteindra 86&#160;&#8364;/t CO2 en 2022. La CCE est pass&#233;e de 30 &#224; 44,6&#160;&#8364;/t de CO2 cette ann&#233;e, ce qui a g&#233;n&#233;r&#233; environ plus de 2 milliards d&#8217;euros de recettes suppl&#233;mentaires, portant la CCE &#224; environ 8 milliards d&#8217;euros au total. Alors que l&#8217;impact de cette fiscalit&#233; sur le budget des fran&#231;ais commence d&#233;j&#224; &#224; susciter des r&#233;actions, le niveau de pr&#233;l&#232;vement est appel&#233; &#224; presque doubler d&#8217;ici 2022 (plus de 15 milliards d&#8217;euros de recettes). Si rien n&#8217;est fait pour donner plus de coh&#233;rence &#224; cette fiscalit&#233; en consacrant une part significative aux financements des actions qui permettront de r&#233;duire la consommation d&#8217;&#233;nergie fossile, celle-ci risque de rencontrer une tr&#232;s vive opposition.</p><table style=\"border-collapse: collapse; width: 574px;\"><tbody><tr><td style=\"white-space: normal; border: 1px solid #000000; width: 143.5px;\" colspan=\"3\"><b>Trajectoire d'augmentation de la Contribution Climat Energie</b></td></tr><tr><td style=\"white-space: normal; border: 1px solid #000000; width: 143.5px;\">Ann&#233;e</td><td style=\"white-space: normal; border: 1px solid #000000; width: 175.5px;\">Taux de CCE</td><td style=\"white-space: normal; border: 1px solid #000000; width: 275px;\">Recettes</td></tr><tr><td style=\"white-space: normal; border: 1px solid #000000; width: 143.5px;\">2018</td><td style=\"white-space: normal; border: 1px solid #000000; width: 175.5px;\">44,6 &#8364;/t CO2</td><td style=\"white-space: normal; border: 1px solid #000000; width: 275px;\">8 milliards &#8364;</td></tr><tr><td style=\"white-space: normal; border: 1px solid #000000; width: 143.5px;\">2019</td><td style=\"white-space: normal; border: 1px solid #000000; width: 175.5px;\">55 &#8364;/t CO2</td><td style=\"white-space: normal; border: 1px solid #000000; width: 275px;\">9,8 milliards &#8364;</td></tr><tr><td style=\"white-space: normal; border: 1px solid #000000; width: 143.5px;\">2020</td><td style=\"white-space: normal; border: 1px solid #000000; width: 175.5px;\">65,4&#160;&#8364; t/ CO2</td><td style=\"white-space: normal; border: 1px solid #000000; width: 275px;\">11,7 milliards &#8364;</td></tr><tr><td style=\"white-space: normal; border: 1px solid #000000; width: 143.5px;\">2021</td><td style=\"white-space: normal; border: 1px solid #000000; width: 175.5px;\">75,8 &#8364;/t CO2</td><td style=\"white-space: normal; border: 1px solid #000000; width: 275px;\">13,56 milliards &#8364;</td></tr><tr><td style=\"white-space: normal; border: 1px solid #000000; width: 143.5px;\">2022</td><td style=\"white-space: normal; border: 1px solid #000000; width: 175.5px;\">86,20 &#8364;/t CO2</td><td style=\"white-space: normal; border: 1px solid #000000; width: 275px;\">15 milliards &#8364;</td></tr></tbody></table><p style=\"text-align: justify;\">Pour contribuer &#224; lancer dans les territoires les investissements qui permettront de r&#233;ussir la transition &#233;nerg&#233;tique, cet amendement vise &#224; cr&#233;er des contrats territoriaux bas carbone entre l&#8217;&#201;tat et les collectivit&#233;s. Ces contrats, accessibles aux collectivit&#233;s ayant adopt&#233; un SRADDET ou un PCAET, viseraient &#224; financer l&#8217;ing&#233;nierie territoriale permettant &#224; terme d&#8217;engager les actions n&#233;cessaires pour mettre en &#339;uvre ces plans (&#233;tudes de faisabilit&#233;, animation territoriale afin de mobiliser tous les acteurs locaux de la transition &#233;nerg&#233;tique&#8230;). En effet, au-del&#224; de la capacit&#233; &#224; financer les diff&#233;rentes actions, une partie du retard pris dans le d&#233;ploiement de la transition &#233;nerg&#233;tique &#224; l&#8217;&#233;chelon locale s&#8217;explique par une difficult&#233; &#224; d&#233;finir et &#224; &#233;valuer les op&#233;rations &#224; mettre en &#339;uvre, les collectivit&#233;s ne disposant souvent pas de l&#8217;ing&#233;nierie n&#233;cessaire.</p><p style=\"text-align: justify;\">Financ&#233;s par une partie des recettes de la Contribution Climat &#201;nergie, ces contrats permettraient de fournir cette ing&#233;nierie aux collectivit&#233;s et donc d&#8217;enclencher les investissements futurs. L&#8217;effet de levier serait donc important, chaque&#160;euro fourni par l&#8217;&#201;tat dans ce cadre contribuera en effet &#224; d&#233;clencher des investissements des collectivit&#233;s et des entreprises. Cela permettra notamment de mobiliser davantage les collectivit&#233;s pour faire appel aux financements mis &#224; disposition par le gouvernement dans le cadre du Grand Plan d&#8217;Investissement. En effet, ces fonds sont encore relativement sous-utilis&#233;s aujourd&#8217;hui, notamment parce que les acteurs ne peuvent y acc&#233;der qu&#8217;avec des projets d&#233;j&#224; &#233;labor&#233;s, ce qui suppose donc une ing&#233;nierie qui fait d&#233;faut aujourd&#8217;hui.</p><p style=\"text-align: justify;\">Ces contrats bas carbone permettraient donc de financer l&#8217;ing&#233;nierie avec laquelle les collectivit&#233;s &#233;laboreraient les projets et contribuerait &#224; d&#233;clencher les investissements.</p><p style=\"text-align: justify;\">Cette proposition s&#8217;appliquerait en 2020, elle n&#8217;entrerait donc pas en conflit avec les choix budg&#233;taires du gouvernement sur l&#8217;utilisation des recettes de la hausse de la fiscalit&#233; carbone en 2019 et serait largement couverte par l&#8217;augmentation de cette fiscalit&#233; en 2020.</p>",
    "annexeExposeSommaire": {
      "@xmlns:xsi": "http://www.w3.org/2001/XMLSchema-instance",
      "@xsi:nil": "true"
    },
    "cartoucheDelaiDepotDepasse": {
      "@xmlns:xsi": "http://www.w3.org/2001/XMLSchema-instance",
      "@xsi:nil": "true"
    }
  },
  "representations": {
    "representation": {
      "nom": "PDF",
      "typeMime": {
        "type": "application",
        "subType": "PDF"
      },
      "statutRepresentation": {
        "verbatim": "true",
        "canonique": "true",
        "officielle": "true",
        "transcription": "false",
        "enregistrement": "false"
      },
      "repSource": {
        "@xmlns:xsi": "http://www.w3.org/2001/XMLSchema-instance",
        "@xsi:nil": "true"
      },
      "offset": {
        "@xmlns:xsi": "http://www.w3.org/2001/XMLSchema-instance",
        "@xsi:nil": "true"
      },
      "contenu": {
        "documentURI": "/15/amendements/1255C/AN/292.pdf"
      },
      "dateDispoRepresentation": {
        "@xmlns:xsi": "http://www.w3.org/2001/XMLSchema-instance",
        "@xsi:nil": "true"
      }
    }
  },
  "seanceDiscussion": "RUANR5L15S2019IDS21345",
  "sort": {
    "dateSaisie": "2018-11-16T18:40:19.000+01:00",
    "sortEnSeance": "Rejeté"
  },
  "dateDepot": "2018-10-25T02:00:00.000+02:00",
  "dateDistribution": "2018-11-15T01:00:00.000+01:00",
  "article99": "0",
  "loiReference": {
    "codeLoi": {
      "@xmlns:xsi": "http://www.w3.org/2001/XMLSchema-instance",
      "@xsi:nil": "true"
    },
    "divisionCodeLoi": {
      "@xmlns:xsi": "http://www.w3.org/2001/XMLSchema-instance",
      "@xsi:nil": "true"
    }
  }
}