{
  "@xmlns": "http://schemas.assemblee-nationale.fr/referentiel",
  "uid": "AMANR5L15SEA717460BTC1019P0D1N1113",
  "identifiant": {
    "legislature": "15",
    "numero": "1113",
    "numRect": "0",
    "saisine": {
      "refTexteLegislatif": "PRJLANR5L15BTC1019",
      "numeroPartiePLF": "0",
      "organeExamen": "PO717460",
      "mentionSecondeDeliberation": "1"
    }
  },
  "numeroLong": "1113",
  "etapeTexte": "1ère lecture (1ère assemblée saisie)",
  "triAmendement": "az",
  "cardinaliteAmdtMultiples": "1",
  "amendementParent": {
    "@xmlns:xsi": "http://www.w3.org/2001/XMLSchema-instance",
    "@xsi:nil": "true"
  },
  "etat": "Discuté",
  "signataires": {
    "auteur": {
      "typeAuteur": "Depute",
      "acteurRef": "PA721992",
      "organeRef": {
        "@xmlns:xsi": "http://www.w3.org/2001/XMLSchema-instance",
        "@xsi:nil": "true"
      },
      "groupePolitiqueRef": "PO730970"
    },
    "cosignataires": {
      "acteurRef": "PA721992"
    },
    "texteAffichable": "Mme&#160;Gallerneau"
  },
  "pointeurFragmentTexte": {
    "missionVisee": {
      "@xmlns:xsi": "http://www.w3.org/2001/XMLSchema-instance",
      "@xsi:nil": "true"
    },
    "division": {
      "titre": "Article 26",
      "articleDesignationCourte": "ART. 26",
      "type": "ARTICLE",
      "avant_A_Apres": "A",
      "divisionRattachee": "ARTICLE 26",
      "articleAdditionnel": {
        "@xmlns:xsi": "http://www.w3.org/2001/XMLSchema-instance",
        "@xsi:nil": "true"
      },
      "chapitreAdditionnel": {
        "@xmlns:xsi": "http://www.w3.org/2001/XMLSchema-instance",
        "@xsi:nil": "true"
      },
      "urlDivisionTexteVise": "/15/textes/1019.asp#D_Article_26"
    },
    "alinea": {
      "avant_A_Apres": {
        "@xmlns:xsi": "http://www.w3.org/2001/XMLSchema-instance",
        "@xsi:nil": "true"
      },
      "numero": "14",
      "alineaDesignation": {
        "@xmlns:xsi": "http://www.w3.org/2001/XMLSchema-instance",
        "@xsi:nil": "true"
      }
    }
  },
  "corps": {
    "dispositif": "<p style=\"text-align: justify;\">Apr&#232;s le mot&#160;:</p><p style=\"text-align: justify;\">&#171;&#160;attest&#233;&#160;&#187;,</p><p style=\"text-align: justify;\">r&#233;diger ainsi la fin de la seconde phrase de l&#8217;alin&#233;a&#160;14&#160;:</p><p style=\"text-align: justify;\">&#171;&#160;post&#233;rieurement &#224; l&#8217;inscription en tant que demandeur d&#8217;emploi par P&#244;le emploi.&#160;&#187;</p>",
    "exposeSommaire": "<p style=\"text-align: justify;\">L&#8217;article L.&#160;5422&#8209;1 II 2&#176; du code du travail tel que r&#233;dig&#233; dans le projet de loi pr&#233;voit un contr&#244;le en amont du projet du salari&#233; d&#233;missionnaire par une entit&#233; qu&#8217;il sera n&#233;cessaire de cr&#233;er et dont la forme et les moyens ne sont pas d&#233;finis.</p><p style=\"text-align: justify;\">Or, non seulement cela aura un co&#251;t &#233;lev&#233; car l&#8217;&#233;tude d&#8217;impact table sur 30.000 dossiers &#224; traiter par an mais en plus ce contr&#244;le pour lutter contre un pr&#233;tendu al&#233;a moral ne semble pas pertinent.</p><p style=\"text-align: justify;\">Les conditions pour qu&#8217;un d&#233;missionnaire puisse b&#233;n&#233;ficier de l&#8217;assurance ch&#244;mage semblent suffisamment strictes pour &#233;viter un effet d&#8217;aubaine.</p><p style=\"text-align: justify;\">Enfin, le contr&#244;le &#224; posteriori des d&#233;marches effectu&#233;es par le demandeur d&#8217;emploi d&#233;missionnaire semble suffisant pour lutter contre un effet d&#8217;aubaine avec la possibilit&#233; offerte &#224; P&#244;le emploi de cesser d&#8217;indemniser le demandeur d&#8217;emploi d&#233;missionnaire qui n&#8217;effectuerait pas les d&#233;marches n&#233;cessaires pour sa formation ou la reprise, cr&#233;ation d&#8217;une entreprise.</p>",
    "annexeExposeSommaire": {
      "@xmlns:xsi": "http://www.w3.org/2001/XMLSchema-instance",
      "@xsi:nil": "true"
    }
  },
  "representations": {
    "representation": {
      "nom": "PDF",
      "typeMime": {
        "type": "application",
        "subType": "PDF"
      },
      "statutRepresentation": {
        "verbatim": "true",
        "canonique": "true",
        "officielle": "true",
        "transcription": "false",
        "enregistrement": "false"
      },
      "repSource": {
        "@xmlns:xsi": "http://www.w3.org/2001/XMLSchema-instance",
        "@xsi:nil": "true"
      },
      "offset": {
        "@xmlns:xsi": "http://www.w3.org/2001/XMLSchema-instance",
        "@xsi:nil": "true"
      },
      "contenu": {
        "documentURI": "/15/amendements/1019/AN/1113.pdf"
      },
      "dateDispoRepresentation": {
        "@xmlns:xsi": "http://www.w3.org/2001/XMLSchema-instance",
        "@xsi:nil": "true"
      }
    }
  },
  "seanceDiscussion": "RUANR5L15S2018IDS21105",
  "sort": {
    "dateSaisie": "2018-06-15T19:25:00.000+02:00",
    "sortEnSeance": "Non soutenu"
  },
  "dateDepot": "2018-06-07T02:00:00.000+02:00",
  "dateDistribution": "2018-06-12T02:00:00.000+02:00",
  "article99": "0",
  "loiReference": {
    "codeLoi": {
      "@xmlns:xsi": "http://www.w3.org/2001/XMLSchema-instance",
      "@xsi:nil": "true"
    },
    "divisionCodeLoi": {
      "@xmlns:xsi": "http://www.w3.org/2001/XMLSchema-instance",
      "@xsi:nil": "true"
    }
  }
}