{
  "@xmlns": "http://schemas.assemblee-nationale.fr/referentiel",
  "uid": "AMANR5L15PO59046B0235P2D1N30",
  "identifiant": {
    "legislature": "15",
    "numero": "30",
    "numRect": "0",
    "saisine": {
      "refTexteLegislatif": "PRJLANR5L15B0235",
      "numeroPartiePLF": "2",
      "organeExamen": "PO59046",
      "mentionSecondeDeliberation": "0"
    }
  },
  "numeroLong": "II-DN30",
  "etapeTexte": "1ère lecture (1ère assemblée saisie)",
  "triAmendement": "ei",
  "cardinaliteAmdtMultiples": "1",
  "amendementParent": {
    "@xmlns:xsi": "http://www.w3.org/2001/XMLSchema-instance",
    "@xsi:nil": "true"
  },
  "etat": "Discuté",
  "signataires": {
    "auteur": {
      "typeAuteur": "Depute",
      "acteurRef": "PA719938",
      "organeRef": {
        "@xmlns:xsi": "http://www.w3.org/2001/XMLSchema-instance",
        "@xsi:nil": "true"
      },
      "groupePolitiqueRef": "PO730970"
    },
    "cosignataires": {
      "acteurRef": [
        "PA720256",
        "PA720162",
        "PA720720",
        "PA720002",
        "PA719504",
        "PA721608",
        "PA719210",
        "PA610733",
        "PA719558",
        "PA721182",
        "PA720178",
        "PA721742",
        "PA719874",
        "PA720334",
        "PA721418",
        "PA720924",
        "PA721234",
        "PA720976",
        "PA719938",
        "PA720598",
        "PA721992",
        "PA721924",
        "PA720326",
        "PA721530",
        "PA720968",
        "PA719266",
        "PA718978",
        "PA719488",
        "PA721984",
        "PA722374",
        "PA719918",
        "PA720652",
        "PA721734",
        "PA722284",
        "PA721836",
        "PA1276",
        "PA720746",
        "PA720772",
        "PA720092",
        "PA720764",
        "PA717151",
        "PA721976",
        "PA720704",
        "PA719640",
        "PA722162",
        "PA719044",
        "PA720728"
      ]
    },
    "texteAffichable": "M.&#160;Fesneau,  M.&#160;Balanant, Mme&#160;Bannier, M.&#160;Barrot, Mme&#160;Benin, M.&#160;Berta, M.&#160;Bolo, M.&#160;Bourlanges, M.&#160;Bru, M.&#160;Cubertafon, Mme&#160;de Sarnez, Mme&#160;de Vaucouleurs, Mme&#160;Deprez-Audebert, M.&#160;Duverg&#233;, Mme&#160;El Ha&#239;ry, Mme&#160;Elimas, Mme&#160;Essayan, M.&#160;Fanget, Mme&#160;Florennes, M.&#160;Fuchs, Mme&#160;Gallerneau, M.&#160;Garcia, M.&#160;Hammouche, M.&#160;Isaac-Sibille, Mme&#160;Jacquier-Laforge, M.&#160;Joncour, M.&#160;Lagleize, M.&#160;Lain&#233;, M.&#160;Laqhila, Mme&#160;Lasserre-David, M.&#160;Latombe, Mme&#160;Luquet, M.&#160;Mathiasin, M.&#160;Mattei, Mme&#160;Mette, M.&#160;Michel-Kleisbauer, M.&#160;Mignola, M.&#160;Millienne, M.&#160;Pahun, M.&#160;Fr&#233;d&#233;ric&#160;Petit, Mme&#160;Maud&#160;Petit, Mme&#160;Poueyto, M.&#160;Ramos, M.&#160;Thierry&#160;Robert, M.&#160;Turquois, Mme&#160;Vichnievsky et M.&#160;Waserman"
  },
  "pointeurFragmentTexte": {
    "missionVisee": {
      "idMissionAN": "26",
      "libelleMission": "Relations avec les collectivités territoriales",
      "codeMissionPLF": "B",
      "libelleMissionPLF": "Répartition, par mission et programme, des crédits du budget général"
    },
    "division": {
      "titre": "Article 59",
      "articleDesignationCourte": "APRÈS ART. 59",
      "type": "ARTICLE",
      "avant_A_Apres": "Après",
      "divisionRattachee": "APRÈS L'ARTICLE 59, insérer l'article suivant:",
      "articleAdditionnel": "1",
      "chapitreAdditionnel": {
        "@xmlns:xsi": "http://www.w3.org/2001/XMLSchema-instance",
        "@xsi:nil": "true"
      },
      "urlDivisionTexteVise": "/15/textes/0235C.asp#D_Article_59"
    },
    "alinea": {
      "@xmlns:xsi": "http://www.w3.org/2001/XMLSchema-instance",
      "@xsi:nil": "true"
    }
  },
  "corps": {
    "dispositif": "<p style=\"text-align: justify;\">Le onzi&#232;me alin&#233;a de l&#8217;article L.&#160;2334-37 du code g&#233;n&#233;ral des collectivit&#233;s territoriales est remplac&#233; par deux alin&#233;as ainsi r&#233;dig&#233;s&#160;:</p><p style=\"text-align: justify;\">&#171;&#160;La commission arr&#234;te chaque ann&#233;e, suivant les cat&#233;gories, la liste des op&#233;rations &#224; subventionner ainsi que le montant de la subvention de l&#8217;&#201;tat qui leur est attribu&#233;e pour les projets dont la subvention au titre de la dotation d&#8217;&#233;quipement des territoires ruraux porte sur un montant sup&#233;rieurs &#224; 150&#160;000 euros. Dans les d&#233;partements comptant cinq parlementaires ou plus, les parlementaires non membres de la commission sont saisis pour avis, en amont de la commission, pour les projets dont la subvention au titre de la dotation d&#8217;&#233;quipement des territoires ruraux porte sur un montant sup&#233;rieurs &#224; 150&#160;000 euros.</p><p style=\"text-align: justify;\">&#171;&#160;Pour les op&#233;rations de moins de 150&#160;000 euros, le repr&#233;sentant de l&#8217;&#201;tat dans le d&#233;partement arr&#234;te chaque ann&#233;e, suivant les cat&#233;gories et dans les limites fix&#233;es par la commission, la liste des op&#233;rations &#224; subventionner ainsi que le montant de la subvention de l&#8217;&#201;tat qui leur est attribu&#233;e. Il porte &#224; la connaissance de la commission la liste des op&#233;rations qu&#8217;il a retenues. &#187;</p>",
    "exposeSommaire": "<p style=\"text-align: justify;\">Cet amendement vise &#224; int&#233;grer les d&#233;put&#233;s et s&#233;nateurs &#233;lus dans le d&#233;partement &#224; la commission d&#8217;attribution des subventions de l&#8217;&#201;tat dans le cadre de la DETR.</p><p style=\"text-align: justify;\">Leur l&#233;gitimit&#233; est compl&#233;mentaire de celle des repr&#233;sentants de l&#8217;&#201;tat dans le d&#233;partement dans un contexte de r&#233;forme des dotations et subventions qui a vu notamment la suppression de la r&#233;serve parlementaire.</p><p style=\"text-align: justify;\">Le pr&#233;sente amendement vise &#224; associer 4 parlementaires du d&#233;partement &#224; la commission qui doit se prononcer sur l&#8217;ensemble des subventions dont le montant est sup&#233;rieur ou &#233;gal &#224; 150&#160;000 &#8364;.</p>",
    "annexeExposeSommaire": {
      "@xmlns:xsi": "http://www.w3.org/2001/XMLSchema-instance",
      "@xsi:nil": "true"
    }
  },
  "representations": {
    "representation": {
      "nom": "PDF",
      "typeMime": {
        "type": "application",
        "subType": "PDF"
      },
      "statutRepresentation": {
        "verbatim": "true",
        "canonique": "true",
        "officielle": "true",
        "transcription": "false",
        "enregistrement": "false"
      },
      "repSource": {
        "@xmlns:xsi": "http://www.w3.org/2001/XMLSchema-instance",
        "@xsi:nil": "true"
      },
      "offset": {
        "@xmlns:xsi": "http://www.w3.org/2001/XMLSchema-instance",
        "@xsi:nil": "true"
      },
      "contenu": {
        "documentURI": "/15/amendements/0235C/CION_TOUTE/DN30.pdf"
      },
      "dateDispoRepresentation": {
        "@xmlns:xsi": "http://www.w3.org/2001/XMLSchema-instance",
        "@xsi:nil": "true"
      }
    }
  },
  "seanceDiscussion": {
    "@xmlns:xsi": "http://www.w3.org/2001/XMLSchema-instance",
    "@xsi:nil": "true"
  },
  "sort": {
    "dateSaisie": "2017-11-09T18:07:24.000+01:00",
    "sortEnSeance": "Rejeté"
  },
  "dateDepot": "2017-11-06T01:00:00.000+01:00",
  "dateDistribution": "2017-11-09T01:00:00.000+01:00",
  "article99": "0",
  "loiReference": {
    "codeLoi": "général des collectivités territoriales",
    "divisionCodeLoi": "L2334-37"
  }
}