{
  "@xmlns": "http://schemas.assemblee-nationale.fr/referentiel",
  "uid": "AMANR5L15SEA717460BTC0971P0D1N952",
  "identifiant": {
    "legislature": "15",
    "numero": "952",
    "numRect": "0",
    "saisine": {
      "refTexteLegislatif": "PRJLANR5L15BTC0971",
      "numeroPartiePLF": "0",
      "organeExamen": "PO717460",
      "mentionSecondeDeliberation": "0"
    }
  },
  "numeroLong": "952",
  "etapeTexte": "1ère lecture (1ère assemblée saisie)",
  "triAmendement": "ans",
  "cardinaliteAmdtMultiples": "1",
  "amendementParent": {
    "@xmlns:xsi": "http://www.w3.org/2001/XMLSchema-instance",
    "@xsi:nil": "true"
  },
  "etat": "Discuté",
  "signataires": {
    "auteur": {
      "typeAuteur": "Depute",
      "acteurRef": "PA642847",
      "organeRef": {
        "@xmlns:xsi": "http://www.w3.org/2001/XMLSchema-instance",
        "@xsi:nil": "true"
      },
      "groupePolitiqueRef": "PO730934"
    },
    "cosignataires": {
      "acteurRef": "PA642847"
    },
    "texteAffichable": "M.&#160;Bazin"
  },
  "pointeurFragmentTexte": {
    "missionVisee": {
      "@xmlns:xsi": "http://www.w3.org/2001/XMLSchema-instance",
      "@xsi:nil": "true"
    },
    "division": {
      "titre": "Article 47",
      "articleDesignationCourte": "APRÈS ART. 47",
      "type": "ARTICLE",
      "avant_A_Apres": "Après",
      "divisionRattachee": "APRÈS L'ARTICLE 47, insérer l'article suivant:",
      "articleAdditionnel": "1",
      "chapitreAdditionnel": {
        "@xmlns:xsi": "http://www.w3.org/2001/XMLSchema-instance",
        "@xsi:nil": "true"
      },
      "urlDivisionTexteVise": "/15/textes/0971.asp#D_Article_47"
    },
    "alinea": {
      "@xmlns:xsi": "http://www.w3.org/2001/XMLSchema-instance",
      "@xsi:nil": "true"
    }
  },
  "corps": {
    "dispositif": "<p style=\"text-align: justify;\">L&#8217;article&#160;14&#8209;1 de la loi n&#176;89&#8209;462 du 6 juillet 1989 tendant a&#768; ame&#769;liorer les rapports locatifs et portant modification de la loi n&#176; 86&#8209;1290 du 23 de&#769;cembre 1986 est ainsi modifi&#233;&#160;:</p><p style=\"text-align: justify;\">1&#176;&#160;&#192; la premi&#232;re phrase du quatri&#232;me alin&#233;a, les mots&#160;: &#171;&#160;en vue de voir constater par le juge la r&#233;siliation du bail&#160;&#187; sont supprim&#233;s&#160;;</p><p style=\"text-align: justify;\">2&#176;&#160;Apr&#232;s le m&#234;me alin&#233;a, est ins&#233;r&#233;e une phrase ainsi r&#233;dig&#233;e&#160;: &#171;&#160;Le proc&#232;s-verbal qui constate l&#8217;abandon du logement fait &#233;galement office de constat de r&#233;siliation du bail&#160;&#187;&#160;;</p><p style=\"text-align: justify;\">3&#176;&#160;Le d&#233;but du cinqui&#232;me alin&#233;a est ainsi r&#233;dig&#233;&#160;: &#171;&#160;Le juge d&#8217;instance est saisi afin d&#8217;autoriser, si n&#233;cessaire... <i>(le reste sans changement)</i>&#160;&#187;.</p>",
    "exposeSommaire": "<p style=\"text-align: justify;\">Actuellement, lorsqu&#8217;un logement est abandonn&#233; par le locataire, les d&#233;marches &#224; effectuer par le propri&#233;taire pour pouvoir le louer &#224; nouveau sont tr&#232;s longues et ont des r&#233;percussions financi&#232;res importantes du fait des loyers non vers&#233;s.</p><p style=\"text-align: justify;\">La premi&#232;re &#233;tape est une mise en demeure du locataire de justifier qu&#8217;il occupe le logement, faite par acte d&#8217;huissier de justice.</p><p style=\"text-align: justify;\">Il revient ensuite, apr&#232;s d&#233;lais, au juge de constater la r&#233;siliation du bail, sachant que le propri&#233;taire ne peut entrer dans le logement sans l&#8217;ordonnance du juge.</p><p style=\"text-align: justify;\">Cet amendement vise &#224; all&#233;ger les proc&#233;dures pour r&#233;siliation du bail et reprise des lieux abandonn&#233;s en donnant l&#8217;autorit&#233; ex&#233;cutive &#224; l&#8217;huissier de justice suite au proc&#232;s-verbal &#233;tabli.</p>",
    "annexeExposeSommaire": {
      "@xmlns:xsi": "http://www.w3.org/2001/XMLSchema-instance",
      "@xsi:nil": "true"
    }
  },
  "representations": {
    "representation": {
      "nom": "PDF",
      "typeMime": {
        "type": "application",
        "subType": "PDF"
      },
      "statutRepresentation": {
        "verbatim": "true",
        "canonique": "true",
        "officielle": "true",
        "transcription": "false",
        "enregistrement": "false"
      },
      "repSource": {
        "@xmlns:xsi": "http://www.w3.org/2001/XMLSchema-instance",
        "@xsi:nil": "true"
      },
      "offset": {
        "@xmlns:xsi": "http://www.w3.org/2001/XMLSchema-instance",
        "@xsi:nil": "true"
      },
      "contenu": {
        "documentURI": "/15/amendements/0971/AN/952.pdf"
      },
      "dateDispoRepresentation": {
        "@xmlns:xsi": "http://www.w3.org/2001/XMLSchema-instance",
        "@xsi:nil": "true"
      }
    }
  },
  "seanceDiscussion": "RUANR5L15S2018IDS21137",
  "sort": {
    "dateSaisie": "2018-06-08T09:46:55.000+02:00",
    "sortEnSeance": "Rejeté"
  },
  "dateDepot": "2018-05-24T02:00:00.000+02:00",
  "dateDistribution": "2018-05-31T02:00:00.000+02:00",
  "article99": "0",
  "loiReference": {
    "codeLoi": "loi 89-462",
    "divisionCodeLoi": "14-1"
  }
}