{
  "@xmlns": "http://schemas.assemblee-nationale.fr/referentiel",
  "uid": "AMANR5L15PO59048B1255P2D1N451",
  "identifiant": {
    "legislature": "15",
    "numero": "451",
    "numRect": "0",
    "saisine": {
      "refTexteLegislatif": "PRJLANR5L15B1255",
      "numeroPartiePLF": "2",
      "organeExamen": "PO59048",
      "mentionSecondeDeliberation": "0"
    }
  },
  "numeroLong": "II-CF451",
  "etapeTexte": "1ère lecture (1ère assemblée saisie)",
  "triAmendement": "bbiaaaaaaaaaaaaaaaaaaaaaaaaaaaaaaaaaaaaaaaaaaaaaaamo",
  "cardinaliteAmdtMultiples": "1",
  "amendementParent": {
    "@xmlns:xsi": "http://www.w3.org/2001/XMLSchema-instance",
    "@xsi:nil": "true"
  },
  "etat": "Discuté",
  "signataires": {
    "auteur": {
      "typeAuteur": "Depute",
      "acteurRef": "PA720278",
      "organeRef": {
        "@xmlns:xsi": "http://www.w3.org/2001/XMLSchema-instance",
        "@xsi:nil": "true"
      },
      "groupePolitiqueRef": "PO730964"
    },
    "cosignataires": {
      "acteurRef": [
        "PA721600",
        "PA719540",
        "PA718810",
        "PA722126",
        "PA720854",
        "PA720242",
        "PA720198",
        "PA718894",
        "PA609520",
        "PA722366",
        "PA718768",
        "PA605963",
        "PA719882",
        "PA719154",
        "PA718744",
        "PA720538",
        "PA721876",
        "PA718706",
        "PA719456",
        "PA720900",
        "PA722000",
        "PA720202",
        "PA720414",
        "PA721296",
        "PA607155",
        "PA719972",
        "PA722268",
        "PA718728",
        "PA719258",
        "PA719412",
        "PA721426",
        "PA643175",
        "PA719448",
        "PA720278"
      ]
    },
    "texteAffichable": "M.&#160;Orphelin,  Mme&#160;Pompili, M.&#160;Alauzet, Mme&#160;Rilhac, Mme&#160;Fontaine-Domeizel, M.&#160;Daniel, Mme&#160;Vanceunebrock-Mialon, Mme&#160;Wonner, Mme&#160;Valetta Ardisson, Mme&#160;Chapelier, Mme&#160;Riotton, Mme&#160;Bagarry, M.&#160;Galbadon, Mme&#160;Robert, M.&#160;Dombreval, Mme&#160;Sarles, M.&#160;Morenas, Mme&#160;M&#246;rch, M.&#160;Perrot, M.&#160;Buchou, Mme&#160;Dupont, Mme&#160;Abba, Mme&#160;Meynier-Millefert, M.&#160;Martin, M.&#160;Test&#233;, M.&#160;Fugit, M.&#160;Chiche, Mme&#160;De Temmerman, Mme&#160;Le Feur, Mme&#160;Toutut-Picard, Mme&#160;Krimi, Mme&#160;Rossi, M.&#160;Delpon et M.&#160;Gouffier-Cha"
  },
  "pointeurFragmentTexte": {
    "missionVisee": {
      "idMissionAN": "402",
      "libelleMission": "Écologie, développement et mobilité durables",
      "codeMissionPLF": "B",
      "libelleMissionPLF": "Répartition, par mission et programme, des crédits du budget général"
    },
    "division": {
      "titre": "ÉTAT B",
      "articleDesignationCourte": "ART. 39",
      "type": "ANNEXE",
      "avant_A_Apres": "A",
      "divisionRattachee": "ARTICLE 39",
      "articleAdditionnel": {
        "@xmlns:xsi": "http://www.w3.org/2001/XMLSchema-instance",
        "@xsi:nil": "true"
      },
      "chapitreAdditionnel": {
        "@xmlns:xsi": "http://www.w3.org/2001/XMLSchema-instance",
        "@xsi:nil": "true"
      },
      "urlDivisionTexteVise": "/15/textes/1255C.asp#D_ETAT_B"
    },
    "alinea": {
      "@xmlns:xsi": "http://www.w3.org/2001/XMLSchema-instance",
      "@xsi:nil": "true"
    }
  },
  "corps": {
    "exposeSommaire": "<p style=\"text-align: justify;\">Cet amendement vise &#224; doter d&#232;s 2019 le programme 181 &#171;&#160;Pr&#233;vention des risques&#160;&#187; (&#224; l&#8217;action 1 &#171;&#160;la pr&#233;vention des risques technologiques et des pollutions&#160;&#187;) comprenant le budget de l&#8217;ADEME de 85 millions d&#8217;euros suppl&#233;mentaires pour le Fonds Chaleur.</p><p style=\"text-align: justify;\">Le doublement du Fonds Chaleur est un engagement de campagne des programmes pr&#233;sidentiel et l&#233;gislatif de La R&#233;publique En Marche&#160;!. L&#8217;augmentation propos&#233;e dans cet amendement est une hausse significative de 40&#160;% du Fonds Chaleur qui participe au d&#233;veloppement de la production renouvelable de chaleur, devant permettre de poursuivre la r&#233;alisation des objectifs de la transition &#233;cologique et solidaire et la mise en &#339;uvre du plan climat. Il est conforme &#224; l&#8217;annonce du ministre de la Transition &#233;cologique et solidaire de hausse du Fonds Chaleur de 215 M&#8364; &#224; 300M&#8364; en 2019. Il s&#8217;agit d&#8217;une premi&#232;re &#233;tape importante vers le doublement n&#233;cessaire du Fonds chaleur.</p><p style=\"text-align: justify;\">Pour rappel, la Cour des Comptes a montr&#233; dans un rapport en mars 2017 l&#8217;efficience de l&#8217;euro public investi dans le cadre du Fonds Chaleur.</p><p style=\"text-align: justify;\">Le Fonds Chaleur est en effet d&#8217;un outil essentiel pour atteindre 23&#160;% d&#8217;EnR en 2020 et r&#233;duire la facture &#233;nerg&#233;tique et les &#233;missions de CO2. Il doit ainsi permettre la production suppl&#233;mentaire de 5,5&#160;millions de tonnes &#233;quivalent p&#233;trole (tep) de chaleur renouvelable ou de r&#233;cup&#233;ration &#224; l&#8217;horizon 2020, soit pr&#232;s de 4 fois plus que la production annuelle actuelle pour y parvenir. L&#8217;objectif de 23&#160;% d&#8217;EnR en 2020 ne pourra donc &#234;tre atteint avec l&#8217;enveloppe budg&#233;taire actuelle du Fonds Chaleur, ce qui n&#233;cessite une hausse significative de cette enveloppe.</p><p style=\"text-align: justify;\">Il s&#8217;agit d&#8217;un amendement d&#8217;appel puisque, conform&#233;ment aux r&#232;gles de la LOLF, pour &#233;quilibrer la mission, les frais de fonctionnement du Minist&#232;re de la Transition &#201;cologique et Solidaire sont r&#233;duits de 85 millions d&#8217;euros, dans le programme &#171;&#160;Conduite et pilotage des politiques de l&#8217;&#233;cologie, du d&#233;veloppement et de la mobilit&#233; durables&#160;&#187; (&#224; l&#8217;action 3 &#171;&#160;la politique et la programmation de l&#8217;immobilier de l&#8217;administration centrale et des moyens de fonctionnement des services&#160;&#187;).</p><p style=\"text-align: justify;\">&#160;</p>",
    "annexeExposeSommaire": {
      "@xmlns:xsi": "http://www.w3.org/2001/XMLSchema-instance",
      "@xsi:nil": "true"
    },
    "dispositifAmdtCredit": {
      "listeProgrammes": {
        "programme": [
          {
            "libelle": "Infrastructures et services de transports",
            "id": "25189",
            "AE": {
              "montantPositif": "0",
              "montantNegatif": "0"
            },
            "CP": {
              "montantPositif": "0",
              "montantNegatif": "0"
            },
            "action": "modification",
            "lignesCredits": null
          },
          {
            "libelle": "Affaires maritimes",
            "id": "25190",
            "AE": {
              "montantPositif": "0",
              "montantNegatif": "0"
            },
            "CP": {
              "montantPositif": "0",
              "montantNegatif": "0"
            },
            "action": "modification",
            "lignesCredits": null
          },
          {
            "libelle": "Paysages, eau et biodiversité",
            "id": "25191",
            "AE": {
              "montantPositif": "0",
              "montantNegatif": "0"
            },
            "CP": {
              "montantPositif": "0",
              "montantNegatif": "0"
            },
            "action": "modification",
            "lignesCredits": null
          },
          {
            "libelle": "Expertise, information géographique et météorologie",
            "id": "25192",
            "AE": {
              "montantPositif": "0",
              "montantNegatif": "0"
            },
            "CP": {
              "montantPositif": "0",
              "montantNegatif": "0"
            },
            "action": "modification",
            "lignesCredits": null
          },
          {
            "libelle": "Prévention des risques",
            "id": "25193",
            "AE": {
              "montantPositif": "85000000",
              "montantNegatif": "0"
            },
            "CP": {
              "montantPositif": "85000000",
              "montantNegatif": "0"
            },
            "action": "modification",
            "lignesCredits": null
          },
          {
            "libelle": "Énergie, climat et après-mines",
            "id": "25194",
            "AE": {
              "montantPositif": "0",
              "montantNegatif": "0"
            },
            "CP": {
              "montantPositif": "0",
              "montantNegatif": "0"
            },
            "action": "modification",
            "lignesCredits": null
          },
          {
            "libelle": "Service public de l'énergie",
            "id": "25195",
            "AE": {
              "montantPositif": "0",
              "montantNegatif": "0"
            },
            "CP": {
              "montantPositif": "0",
              "montantNegatif": "0"
            },
            "action": "modification",
            "lignesCredits": null
          },
          {
            "libelle": "Conduite et pilotage des politiques de l'écologie, du développement et de la mobilité durables",
            "id": "25196",
            "AE": {
              "montantPositif": "0",
              "montantNegatif": "85000000"
            },
            "CP": {
              "montantPositif": "0",
              "montantNegatif": "85000000"
            },
            "action": "modification",
            "lignesCredits": null
          }
        ]
      },
      "totalAE": {
        "montantPositif": "85000000",
        "montantNegatif": "85000000",
        "solde": "0"
      },
      "totalCP": {
        "montantPositif": "85000000",
        "montantNegatif": "85000000",
        "solde": "0"
      }
    }
  },
  "representations": {
    "representation": {
      "nom": "PDF",
      "typeMime": {
        "type": "application",
        "subType": "PDF"
      },
      "statutRepresentation": {
        "verbatim": "true",
        "canonique": "true",
        "officielle": "true",
        "transcription": "false",
        "enregistrement": "false"
      },
      "repSource": {
        "@xmlns:xsi": "http://www.w3.org/2001/XMLSchema-instance",
        "@xsi:nil": "true"
      },
      "offset": {
        "@xmlns:xsi": "http://www.w3.org/2001/XMLSchema-instance",
        "@xsi:nil": "true"
      },
      "contenu": {
        "documentURI": "/15/amendements/1255C/CION_FIN/CF451.pdf"
      },
      "dateDispoRepresentation": {
        "@xmlns:xsi": "http://www.w3.org/2001/XMLSchema-instance",
        "@xsi:nil": "true"
      }
    }
  },
  "seanceDiscussion": {
    "@xmlns:xsi": "http://www.w3.org/2001/XMLSchema-instance",
    "@xsi:nil": "true"
  },
  "sort": {
    "dateSaisie": "2018-10-26T10:11:33.000+02:00",
    "sortEnSeance": "Rejeté"
  },
  "dateDepot": "2018-10-23T02:00:00.000+02:00",
  "dateDistribution": "2018-10-25T02:00:00.000+02:00",
  "article99": "0",
  "loiReference": {
    "codeLoi": {
      "@xmlns:xsi": "http://www.w3.org/2001/XMLSchema-instance",
      "@xsi:nil": "true"
    },
    "divisionCodeLoi": {
      "@xmlns:xsi": "http://www.w3.org/2001/XMLSchema-instance",
      "@xsi:nil": "true"
    }
  }
}