{
  "@xmlns": "http://schemas.assemblee-nationale.fr/referentiel",
  "uid": "AMANR5L15PO59051B0235P2D1N71",
  "identifiant": {
    "legislature": "15",
    "numero": "71",
    "numRect": "0",
    "saisine": {
      "refTexteLegislatif": "PRJLANR5L15B0235",
      "numeroPartiePLF": "2",
      "organeExamen": "PO59051",
      "mentionSecondeDeliberation": "0"
    }
  },
  "numeroLong": "II-CL71",
  "etapeTexte": "1ère lecture (1ère assemblée saisie)",
  "triAmendement": "u",
  "cardinaliteAmdtMultiples": "1",
  "amendementParent": {
    "@xmlns:xsi": "http://www.w3.org/2001/XMLSchema-instance",
    "@xsi:nil": "true"
  },
  "etat": "Irrecevable",
  "signataires": {
    "auteur": {
      "typeAuteur": "Depute",
      "acteurRef": "PA721960",
      "organeRef": {
        "@xmlns:xsi": "http://www.w3.org/2001/XMLSchema-instance",
        "@xsi:nil": "true"
      },
      "groupePolitiqueRef": "PO730958"
    },
    "cosignataires": {
      "acteurRef": [
        "PA721062",
        "PA721960",
        "PA721202",
        "PA719578",
        "PA720846",
        "PA722142",
        "PA721226",
        "PA721210",
        "PA720286",
        "PA2150",
        "PA718868",
        "PA588884",
        "PA720422",
        "PA720892",
        "PA720430",
        "PA719676",
        "PA718860"
      ]
    },
    "texteAffichable": "Mme&#160;Obono,  Mme&#160;Autain, M.&#160;Bernalicis, M.&#160;Coquerel, M.&#160;Corbi&#232;re, Mme&#160;Fiat, M.&#160;Lachaud, M.&#160;Larive, M.&#160;M&#233;lenchon, Mme&#160;Panot, M.&#160;Prud&apos;homme, M.&#160;Quatennens, M.&#160;Ratenon, Mme&#160;Ressiguier, Mme&#160;Rubin, M.&#160;Ruffin et Mme&#160;Taurine"
  },
  "pointeurFragmentTexte": {
    "missionVisee": {
      "idMissionAN": "22",
      "libelleMission": "Outre-mer",
      "codeMissionPLF": "B",
      "libelleMissionPLF": "Répartition, par mission et programme, des crédits du budget général"
    },
    "division": {
      "titre": "Article 57",
      "articleDesignationCourte": "APRÈS ART. 57",
      "type": "ARTICLE",
      "avant_A_Apres": "Après",
      "divisionRattachee": "APRÈS L'ARTICLE 57, insérer l'article suivant:",
      "articleAdditionnel": "1",
      "chapitreAdditionnel": {
        "@xmlns:xsi": "http://www.w3.org/2001/XMLSchema-instance",
        "@xsi:nil": "true"
      },
      "urlDivisionTexteVise": "/15/textes/0235C.asp#D_Article_57"
    },
    "alinea": {
      "@xmlns:xsi": "http://www.w3.org/2001/XMLSchema-instance",
      "@xsi:nil": "true"
    }
  },
  "corps": {
    "dispositif": "<p>I.&#160;&#8211;&#160;Le Gouvernement remet au Parlement, dans un d&#233;lai de trois mois &#224; compter de la promulgation de la pr&#233;sente loi, un rapport d&#8217;information sur le co&#251;t et les &#233;conomies qu&#8217;induirait le contr&#244;le des prix des billets d&#8217;avion et qui r&#233;alise aussi un audit relatif &#224; la situation oligopolistique du secteur a&#233;rien.</p><p>II.&#160;&#8211;&#160;Ce rapport est r&#233;dig&#233; par un groupe de travail constitu&#233; de quatre repr&#233;sentants de l&#8217;administration, &#224; savoir un repr&#233;sentant de l&#8217;inspection g&#233;n&#233;rale des finances, un repr&#233;sentant de l&#8217;inspection g&#233;n&#233;rale de l&#8217;administration, un repr&#233;sentant de l&#8217;inspection g&#233;n&#233;rale de l&#8217;environnement, un repr&#233;sentant de l&#8217;inspection g&#233;n&#233;rale des affaires sociales, ainsi que des repr&#233;sentants d&#8217;associations de consommateurs, des syndicats, et des repr&#233;sentants de chaque collectivit&#233; territoriale concern&#233;e.</p>",
    "exposeSommaire": "<p>Tout comme l'Etat a pu mettre en place un dispositif de contr&#244;le des prix du p&#233;trole en Outre-Mer, nous posons la question du co&#251;t d'un dispositif de contr&#244;le des prix des billets d'avion.</p><p>Ce dispositif pourra notamment permettre de revoir &#224; la baisse le prix des billets d'avions (a distance &#233;quivalente, le trajet Paris-R&#233;union est le plus cher).</p><p>Par ailleurs, alors que l'ensemble des billets d'avion on vu leur prix chuter lors de la baisse du prix du p&#233;trole, certains billets pour les destinations ultra-marine n'ont pas b&#233;n&#233;fici&#233; de cette baisse.</p><p>Il est l&#233;gitime que la repr&#233;sentation nationale puisse &#234;tre inform&#233;e sur la situation oligopolistique de la desserte a&#233;rienne des Outre-Mer et puisse envisager une fixation &#224; la baisse des prix des billets d'avion.</p>",
    "annexeExposeSommaire": {
      "@xmlns:xsi": "http://www.w3.org/2001/XMLSchema-instance",
      "@xsi:nil": "true"
    }
  },
  "representations": {
    "representation": {
      "nom": "PDF",
      "typeMime": {
        "type": "application",
        "subType": "PDF"
      },
      "statutRepresentation": {
        "verbatim": "true",
        "canonique": "true",
        "officielle": "true",
        "transcription": "false",
        "enregistrement": "false"
      },
      "repSource": {
        "@xmlns:xsi": "http://www.w3.org/2001/XMLSchema-instance",
        "@xsi:nil": "true"
      },
      "offset": {
        "@xmlns:xsi": "http://www.w3.org/2001/XMLSchema-instance",
        "@xsi:nil": "true"
      },
      "contenu": {
        "documentURI": "/15/amendements/0235C/CION_TOUTE/CL71.pdf"
      },
      "dateDispoRepresentation": {
        "@xmlns:xsi": "http://www.w3.org/2001/XMLSchema-instance",
        "@xsi:nil": "true"
      }
    }
  },
  "seanceDiscussion": {
    "@xmlns:xsi": "http://www.w3.org/2001/XMLSchema-instance",
    "@xsi:nil": "true"
  },
  "sort": {
    "@xmlns:xsi": "http://www.w3.org/2001/XMLSchema-instance",
    "@xsi:nil": "true"
  },
  "dateDepot": "2017-10-26T02:00:00.000+02:00",
  "dateDistribution": {
    "@xmlns:xsi": "http://www.w3.org/2001/XMLSchema-instance",
    "@xsi:nil": "true"
  },
  "article99": "0",
  "loiReference": {
    "codeLoi": "zzzz",
    "divisionCodeLoi": {
      "@xmlns:xsi": "http://www.w3.org/2001/XMLSchema-instance",
      "@xsi:nil": "true"
    }
  }
}