{
  "@xmlns": "http://schemas.assemblee-nationale.fr/referentiel",
  "uid": "AMANR5L15PO59048B2400P0D1N23",
  "identifiant": {
    "legislature": "15",
    "numero": "23",
    "numRect": "0",
    "saisine": {
      "refTexteLegislatif": "PRJLANR5L15B2400",
      "numeroPartiePLF": "0",
      "organeExamen": "PO59048",
      "mentionSecondeDeliberation": "0"
    }
  },
  "numeroLong": "CF23",
  "etapeTexte": "1ère lecture (1ère assemblée saisie)",
  "triAmendement": "kaaaaaaaaaaaaaaaaaaaaaaaaaaaaaaaaaaaaaaaaaaaaaaaaabf",
  "cardinaliteAmdtMultiples": "1",
  "amendementParent": {
    "@xmlns:xsi": "http://www.w3.org/2001/XMLSchema-instance",
    "@xsi:nil": "true"
  },
  "etat": "Discuté",
  "signataires": {
    "auteur": {
      "typeAuteur": "Depute",
      "acteurRef": "PA942",
      "organeRef": {
        "@xmlns:xsi": "http://www.w3.org/2001/XMLSchema-instance",
        "@xsi:nil": "true"
      },
      "groupePolitiqueRef": "PO759900"
    },
    "cosignataires": {
      "acteurRef": [
        "PA719138",
        "PA331582",
        "PA405480",
        "PA942"
      ]
    },
    "texteAffichable": "M.&#160;Charles&#160;de Courson,  M.&#160;Castellani, M.&#160;Pupponi et M.&#160;Philippe&#160;Vigier"
  },
  "pointeurFragmentTexte": {
    "missionVisee": {
      "@xmlns:xsi": "http://www.w3.org/2001/XMLSchema-instance",
      "@xsi:nil": "true"
    },
    "division": {
      "titre": "Article 9",
      "articleDesignationCourte": "APRÈS ART. 9",
      "type": "ARTICLE",
      "avant_A_Apres": "Après",
      "divisionRattachee": "APRÈS L'ARTICLE 9, insérer l'article suivant:",
      "articleAdditionnel": "1",
      "chapitreAdditionnel": {
        "@xmlns:xsi": "http://www.w3.org/2001/XMLSchema-instance",
        "@xsi:nil": "true"
      },
      "urlDivisionTexteVise": "/15/textes/2400.asp#D_Article_9"
    },
    "alinea": {
      "@xmlns:xsi": "http://www.w3.org/2001/XMLSchema-instance",
      "@xsi:nil": "true"
    }
  },
  "corps": {
    "dispositif": "<p style=\"text-align: justify;\">I.&#160;&#8211;&#160;Apr&#232;s les mots&#160;:&#160;&#171;&#160;des personnes&#160;&#187;, la fin du f du 1 de l&#8217;article&#160;195 du code g&#233;n&#233;ral des imp&#244;ts est ainsi r&#233;dig&#233;e&#160;:&#160;&#171;&#160;ayant b&#233;n&#233;fici&#233; de la retraite du combattant.&#160;&#187;.</p><p style=\"text-align: justify;\">II.&#160;&#8211;&#160;Le I entre en vigueur au 1<sup>er</sup> janvier 2020.</p><p style=\"text-align: justify;\">III.&#160;&#8211;&#160;La perte de recettes pour l&#8217;&#201;tat est compens&#233;e &#224; due concurrence par la cr&#233;ation d&#8217;une taxe additionnelle aux droits mentionn&#233;s aux articles 575 et 575 A du code g&#233;n&#233;ral des imp&#244;ts.</p>",
    "exposeSommaire": "<p style=\"text-align: justify;\">Selon les dispositions de l&#8217;article&#160;195 du code g&#233;n&#233;ral des imp&#244;ts, les titulaires de la carte du combattant ou d&#8217;une pension servie en vertu des dispositions du code des pensions militaires d&#8217;invalidit&#233; &#226;g&#233;s de plus de 74 ans b&#233;n&#233;ficient d&#8217;une demi-part fiscale suppl&#233;mentaire.</p><p style=\"text-align: justify;\">Cette demi-part fiscale est &#233;galement octroy&#233;e aux veuves de ces personnes, si celles-ci ont plus de 74 ans, et que leur conjoint ont pu en b&#233;n&#233;ficier de leur vivant.</p><p style=\"text-align: justify;\">Cette disposition cr&#233;&#233; une diff&#233;rence de traitement entre les veuves de plus de 74 ans, en fonction de l&#8217;&#226;ge auquel leur &#233;poux est d&#233;c&#233;d&#233;.</p><p style=\"text-align: justify;\">Le pr&#233;sent amendement permet &#224; toutes les veuves, ayant atteint l&#8217;&#226;ge de 74 ans, de b&#233;n&#233;ficier de la demi-part additionnelle, d&#232;s lors que leur mari a touch&#233; la retraite du combattant.</p><p style=\"text-align: justify;\">La retraite du combattant, pr&#233;vue par l&#8217;article L.&#160;321&#8209;1 du code des pensions militaires d&#8217;invalidit&#233; et des victimes de la guerre, est vers&#233;e aux titulaires de la carte du combattant apr&#232;s l&#8217;&#226;ge de 65 ans, et &#224; titre r&#233;siduel d&#232;s 60 ans (353 personnes en 2018).</p><p style=\"text-align: justify;\">Le chiffrage de cette mesure est estim&#233; &#224; environ 30 millions d&#8217;euros.</p><p style=\"text-align: justify;\">Fin 2018, 940 071 personnes b&#233;n&#233;ficiaient de la retraite du combattant. &#192; cette date, l&#8217;ONAC-VG indique que le nombre de veuves de ressortissants &#233;tait de 799 500 (tous &#226;ges confondus). En 2021, date d&#8217;application de la mesure, on estime qu&#8217;elles ne seraient plus que 730 000 (en incluant l&#8217;extension de la carte du combattant aux soldats pr&#233;sents en Alg&#233;rie entre 1962 et 1964).</p><p style=\"text-align: justify;\">Sur ces 730 000, 720 000 ont plus de 74 ans selon la pyramide des &#226;ges de 2021. La probabilit&#233; qu&#8217;une personne d&#233;c&#232;de entre 65 et 74 ans est de 15 pour 1 000, selon les chiffres de l&#8217;INED. 100 000&#160;veuves seraient donc concern&#233;es (720 000*(1&#160;&#8211;&#160;(1&#160;&#8211;&#160;15/1000)^10) ). Sur ces 100 000 personnes, la moiti&#233; payent l&#8217;imp&#244;t sur le revenu, soit 50 000 veuves au total. Aujourd&#8217;hui, l&#8217;avantage fiscal li&#233; &#224; cette mesure est de 600&#160;euros par foyer. En multipliant 600 par 50 000, ont obtient 30 millions d&#8217;euros.</p><p style=\"text-align: justify;\">En outre, la soutenabilit&#233; financi&#232;re de cet amendement est assur&#233;e &#233;tant donn&#233; la baisse tendancielle des effectifs de la mission. Les cr&#233;dits de paiement de la mission Anciens combattants diminuent structurellement d&#8217;une ann&#233;e sur l&#8217;autre (&#8211;&#160;141 millions d&#8217;euros pour le projet de loi de finances pour 2020, &#8211;&#160;130 millions d&#8217;euros pour la loi de finances initiale pour 2019). S&#8217;agissant de cette d&#233;pense fiscale, elle a co&#251;t&#233; 560 millions d&#8217;euros en ex&#233;cution en 2018 et elle est chiffr&#233;e &#224; 540 millions d&#8217;euros en 2019 (&#8211;&#160;20 millions d&#8217;euros).</p>",
    "annexeExposeSommaire": {
      "@xmlns:xsi": "http://www.w3.org/2001/XMLSchema-instance",
      "@xsi:nil": "true"
    },
    "cartoucheDelaiDepotDepasse": {
      "@xmlns:xsi": "http://www.w3.org/2001/XMLSchema-instance",
      "@xsi:nil": "true"
    },
    "avantAppel": {
      "@xmlns:xsi": "http://www.w3.org/2001/XMLSchema-instance",
      "@xsi:nil": "true"
    }
  },
  "representations": {
    "representation": {
      "nom": "PDF",
      "typeMime": {
        "type": "application",
        "subType": "PDF"
      },
      "statutRepresentation": {
        "verbatim": "true",
        "canonique": "true",
        "officielle": "true",
        "transcription": "false",
        "enregistrement": "false"
      },
      "repSource": {
        "@xmlns:xsi": "http://www.w3.org/2001/XMLSchema-instance",
        "@xsi:nil": "true"
      },
      "offset": {
        "@xmlns:xsi": "http://www.w3.org/2001/XMLSchema-instance",
        "@xsi:nil": "true"
      },
      "contenu": {
        "documentURI": "/15/amendements/2400/CION_FIN/CF23.pdf"
      },
      "dateDispoRepresentation": {
        "@xmlns:xsi": "http://www.w3.org/2001/XMLSchema-instance",
        "@xsi:nil": "true"
      }
    }
  },
  "seanceDiscussion": {
    "@xmlns:xsi": "http://www.w3.org/2001/XMLSchema-instance",
    "@xsi:nil": "true"
  },
  "sort": {
    "dateSaisie": "2019-11-12T09:39:44.000+01:00",
    "sortEnSeance": "Rejeté"
  },
  "dateDepot": "2019-11-08T01:00:00.000+01:00",
  "dateDistribution": "2019-11-12T01:00:00.000+01:00",
  "article99": "0",
  "loiReference": {
    "codeLoi": "CGI",
    "divisionCodeLoi": "195 1 f"
  }
}