{
  "@xmlns": "http://schemas.assemblee-nationale.fr/referentiel",
  "uid": "AMANR5L15PO59051B2201P0D1N118",
  "identifiant": {
    "legislature": "15",
    "numero": "118",
    "numRect": "0",
    "saisine": {
      "refTexteLegislatif": "PIONANR5L15B2201",
      "numeroPartiePLF": "0",
      "organeExamen": "PO59051",
      "mentionSecondeDeliberation": "0"
    }
  },
  "numeroLong": "CL118",
  "etapeTexte": "1ère lecture (1ère assemblée saisie)",
  "triAmendement": "baaaaaaaaaaaaaaaaaaaaaaaaaaaaaaaaaaaaaaaaaaaaaaaaanhs",
  "cardinaliteAmdtMultiples": "1",
  "amendementParent": {
    "@xmlns:xsi": "http://www.w3.org/2001/XMLSchema-instance",
    "@xsi:nil": "true"
  },
  "etat": "Discuté",
  "signataires": {
    "auteur": {
      "typeAuteur": "Depute",
      "acteurRef": "PA720100",
      "organeRef": {
        "@xmlns:xsi": "http://www.w3.org/2001/XMLSchema-instance",
        "@xsi:nil": "true"
      },
      "groupePolitiqueRef": "PO730934"
    },
    "cosignataires": {
      "acteurRef": "PA720100"
    },
    "texteAffichable": "M.&#160;Pradi&#233;, rapporteur"
  },
  "pointeurFragmentTexte": {
    "missionVisee": {
      "@xmlns:xsi": "http://www.w3.org/2001/XMLSchema-instance",
      "@xsi:nil": "true"
    },
    "division": {
      "titre": "Article 2",
      "articleDesignationCourte": "ART. 2",
      "type": "ARTICLE",
      "avant_A_Apres": "A",
      "divisionRattachee": "ARTICLE 2",
      "articleAdditionnel": {
        "@xmlns:xsi": "http://www.w3.org/2001/XMLSchema-instance",
        "@xsi:nil": "true"
      },
      "chapitreAdditionnel": {
        "@xmlns:xsi": "http://www.w3.org/2001/XMLSchema-instance",
        "@xsi:nil": "true"
      },
      "urlDivisionTexteVise": "/15/textes/2201.asp#D_Article_2"
    },
    "alinea": {
      "avant_A_Apres": {
        "@xmlns:xsi": "http://www.w3.org/2001/XMLSchema-instance",
        "@xsi:nil": "true"
      },
      "numero": "4",
      "alineaDesignation": {
        "@xmlns:xsi": "http://www.w3.org/2001/XMLSchema-instance",
        "@xsi:nil": "true"
      }
    }
  },
  "corps": {
    "dispositif": "<p>Apr&#232;s le mot&#160;:</p><p style=\"text-align: justify;\">&#171;&#160;attribu&#233;e&#160;&#187;,</p><p style=\"text-align: justify;\">r&#233;diger ainsi la fin de la seconde phrase de l'alin&#233;a&#160;4&#160;:</p><p style=\"text-align: justify;\">&#171;&#160;,&#160;sauf circonstances particuli&#232;res et m&#234;me s'il a b&#233;n&#233;fici&#233; d'un h&#233;bergement d'urgence, et la prise en charge des frais aff&#233;rents peut &#234;tre &#224; la charge du conjoint violent.&#160;&#187;</p>",
    "exposeSommaire": "<p>Le pr&#233;sent amendement proc&#232;de &#224; plusieurs modifications sur les r&#232;gles d'attribution du logement conjugal en cas de violences vraisemblables entre deux &#233;poux.</p><p style=\"text-align: justify;\">En premier lieu, il pr&#233;cise que la jouissance du bien est accord&#233;e &#224; la victime &#224; sa demande sauf circonstances particuli&#232;res, comme le pr&#233;voit le droit en vigueur, de fa&#231;on &#224; laisser au juge une capacit&#233; d'appr&#233;ciation des faits. Une attribution automatique pourrait, en effet, faire peser un risque d'inconstitutionnalit&#233;.</p><p style=\"text-align: justify;\">En second lieu et suivant le m&#234;me principe, il permet &#8211; mais n'impose pas &#8211; au juge de mettre &#224; la charge du conjoint violent les frais aff&#233;rents au logement. Les violences conjugales touchent tous les milieux sociaux : s'il est certain que certaines personnes n'auront pas la capacit&#233; d'assumer les sommes en question, il est tout aussi certain qu'un conjoint violent qui gagne plusieurs fois le salaire moyen peut bien davantage y contribuer que son &#233;pouse dont, par ailleurs, la pr&#233;carit&#233; a bien souvent &#233;t&#233; organis&#233;e par son agresseur.</p><p style=\"text-align: justify;\">Enfin, l'amendement supprime l'extension de la mesure jusqu'&#224; un jugement un fond, l'ordonnance de protection pouvant d&#233;j&#224; &#234;tre prorog&#233;e jusqu'&#224; la d&#233;cision de divorce.</p>",
    "annexeExposeSommaire": {
      "@xmlns:xsi": "http://www.w3.org/2001/XMLSchema-instance",
      "@xsi:nil": "true"
    },
    "cartoucheDelaiDepotDepasse": {
      "@xmlns:xsi": "http://www.w3.org/2001/XMLSchema-instance",
      "@xsi:nil": "true"
    },
    "avantAppel": {
      "@xmlns:xsi": "http://www.w3.org/2001/XMLSchema-instance",
      "@xsi:nil": "true"
    }
  },
  "representations": {
    "representation": {
      "nom": "PDF",
      "typeMime": {
        "type": "application",
        "subType": "PDF"
      },
      "statutRepresentation": {
        "verbatim": "true",
        "canonique": "true",
        "officielle": "true",
        "transcription": "false",
        "enregistrement": "false"
      },
      "repSource": {
        "@xmlns:xsi": "http://www.w3.org/2001/XMLSchema-instance",
        "@xsi:nil": "true"
      },
      "offset": {
        "@xmlns:xsi": "http://www.w3.org/2001/XMLSchema-instance",
        "@xsi:nil": "true"
      },
      "contenu": {
        "documentURI": "/15/amendements/2201/CION_LOIS/CL118.pdf"
      },
      "dateDispoRepresentation": {
        "@xmlns:xsi": "http://www.w3.org/2001/XMLSchema-instance",
        "@xsi:nil": "true"
      }
    }
  },
  "seanceDiscussion": {
    "@xmlns:xsi": "http://www.w3.org/2001/XMLSchema-instance",
    "@xsi:nil": "true"
  },
  "sort": {
    "dateSaisie": "2019-10-02T11:55:54.000+02:00",
    "sortEnSeance": "Adopté"
  },
  "dateDepot": "2019-09-30T02:00:00.000+02:00",
  "dateDistribution": "2019-10-01T02:00:00.000+02:00",
  "article99": "0",
  "loiReference": {
    "codeLoi": "0 dc",
    "divisionCodeLoi": {
      "@xmlns:xsi": "http://www.w3.org/2001/XMLSchema-instance",
      "@xsi:nil": "true"
    }
  }
}