{
  "@xmlns": "http://schemas.assemblee-nationale.fr/referentiel",
  "uid": "AMANR5L15SEA717460BTC1974P0D1N2668",
  "identifiant": {
    "legislature": "15",
    "numero": "2668",
    "numRect": "0",
    "saisine": {
      "refTexteLegislatif": "PRJLANR5L15BTC1974",
      "numeroPartiePLF": "0",
      "organeExamen": "PO717460",
      "mentionSecondeDeliberation": "0"
    }
  },
  "numeroLong": "2668",
  "etapeTexte": "1ère lecture (2ème assemblée saisie)",
  "triAmendement": "bbkaaaaaaaaaaaaaaaaaaaaaaaaaaaaaaaaaaaaaaaaaaaaaaauol",
  "cardinaliteAmdtMultiples": "1",
  "amendementParent": {
    "@xmlns:xsi": "http://www.w3.org/2001/XMLSchema-instance",
    "@xsi:nil": "true"
  },
  "etat": "Discuté",
  "signataires": {
    "auteur": {
      "typeAuteur": "Depute",
      "acteurRef": "PA718860",
      "organeRef": {
        "@xmlns:xsi": "http://www.w3.org/2001/XMLSchema-instance",
        "@xsi:nil": "true"
      },
      "groupePolitiqueRef": "PO730958"
    },
    "cosignataires": {
      "acteurRef": [
        "PA588884",
        "PA720430",
        "PA720846",
        "PA720892",
        "PA718868",
        "PA721226",
        "PA721062",
        "PA721202",
        "PA719676",
        "PA720422",
        "PA720286",
        "PA2150",
        "PA721960",
        "PA721210",
        "PA719578",
        "PA718860",
        "PA722142"
      ]
    },
    "texteAffichable": "Mme&#160;Taurine,  Mme&#160;Autain, M.&#160;Bernalicis, M.&#160;Ruffin, M.&#160;Coquerel, M.&#160;Corbi&#232;re, Mme&#160;Fiat, M.&#160;Lachaud, M.&#160;Larive, M.&#160;M&#233;lenchon, Mme&#160;Obono, Mme&#160;Panot, M.&#160;Prud&apos;homme, M.&#160;Quatennens, M.&#160;Ratenon, Mme&#160;Ressiguier et Mme&#160;Rubin"
  },
  "pointeurFragmentTexte": {
    "missionVisee": {
      "@xmlns:xsi": "http://www.w3.org/2001/XMLSchema-instance",
      "@xsi:nil": "true"
    },
    "division": {
      "titre": "Article 11",
      "articleDesignationCourte": "ART. 11",
      "type": "ARTICLE",
      "avant_A_Apres": "A",
      "divisionRattachee": "ARTICLE 11",
      "articleAdditionnel": {
        "@xmlns:xsi": "http://www.w3.org/2001/XMLSchema-instance",
        "@xsi:nil": "true"
      },
      "chapitreAdditionnel": {
        "@xmlns:xsi": "http://www.w3.org/2001/XMLSchema-instance",
        "@xsi:nil": "true"
      },
      "urlDivisionTexteVise": "/15/textes/1974.asp#D_Article_11"
    },
    "alinea": {
      "avant_A_Apres": {
        "@xmlns:xsi": "http://www.w3.org/2001/XMLSchema-instance",
        "@xsi:nil": "true"
      },
      "numero": "15",
      "alineaDesignation": {
        "@xmlns:xsi": "http://www.w3.org/2001/XMLSchema-instance",
        "@xsi:nil": "true"
      }
    }
  },
  "corps": {
    "dispositif": "<p style=\"text-align: justify;\">Compl&#233;ter l&#8217;alin&#233;a&#160;15 par la phrase suivante&#160;:</p><p style=\"text-align: justify;\">&#171;&#160;La tarification flexible sur la vente des produits et services est proscrite.&#160;&#187;</p>",
    "exposeSommaire": "<p style=\"text-align: justify;\">Dans les ann&#233;es 1990, la SNCF &#233;tait une des premi&#232;res compagnies &#224; adopter le syst&#232;me de &#171;&#160;yield management&#160;&#187;, un mode de tarification emprunt&#233; aux compagnies a&#233;riennes et qui fixe les prix en fonction de complexe calculs li&#233;s au moment du trajet et au taux de remplissage des TGV.</p><p style=\"text-align: justify;\">Cette pratique tarifaire a cr&#233;&#233; un transport ferroviaire &#224; deux vitesses&#160;: aux plus ais&#233;s la possibilit&#233; de partir au d&#233;but et &#224; la fin des vacances scolaires, en prenant son billet quelques jours &#224; l&#8217;avance. Aux plus modestes le hors saison et la n&#233;cessit&#233; de planifier ses trajets des semaines voire des mois &#224; l&#8217;avance, alors m&#234;me qu&#8217;ils sont souvent plus pr&#233;caires et ont donc moins de visibilit&#233; sur leur avenir.</p><p style=\"text-align: justify;\">Ce mode de tarification, per&#231;u comme normal pour le transport a&#233;rien, un mode de transport de luxe, ne l&#8217;est pas pour un service public ayant vocation &#224; participer de l&#8217;unit&#233; du territoire.</p><p style=\"text-align: justify;\">Les transports &#233;cologiques et populaires que nous appelons de nos voeux ne peuvent pas pratiquer un tel mode de tarification, contraire &#224; toute norme commerciale de base et nuisible &#224; l&#8217;&#233;galit&#233; des usagers. Nous en demandons l&#8217;interdiction et le remplacement par une grille tarifaire transparente, &#224; la variabilit&#233; r&#233;duite et accessible &#224; toutes et tous.</p>",
    "annexeExposeSommaire": {
      "@xmlns:xsi": "http://www.w3.org/2001/XMLSchema-instance",
      "@xsi:nil": "true"
    },
    "cartoucheDelaiDepotDepasse": {
      "@xmlns:xsi": "http://www.w3.org/2001/XMLSchema-instance",
      "@xsi:nil": "true"
    }
  },
  "representations": {
    "representation": {
      "nom": "PDF",
      "typeMime": {
        "type": "application",
        "subType": "PDF"
      },
      "statutRepresentation": {
        "verbatim": "true",
        "canonique": "true",
        "officielle": "true",
        "transcription": "false",
        "enregistrement": "false"
      },
      "repSource": {
        "@xmlns:xsi": "http://www.w3.org/2001/XMLSchema-instance",
        "@xsi:nil": "true"
      },
      "offset": {
        "@xmlns:xsi": "http://www.w3.org/2001/XMLSchema-instance",
        "@xsi:nil": "true"
      },
      "contenu": {
        "documentURI": "/15/amendements/1974/AN/2668.pdf"
      },
      "dateDispoRepresentation": {
        "@xmlns:xsi": "http://www.w3.org/2001/XMLSchema-instance",
        "@xsi:nil": "true"
      }
    }
  },
  "seanceDiscussion": "RUANR5L15S2019IDS21680",
  "sort": {
    "dateSaisie": "2019-06-06T16:19:08.000+02:00",
    "sortEnSeance": "Rejeté"
  },
  "dateDepot": "2019-05-29T02:00:00.000+02:00",
  "dateDistribution": "2019-06-03T02:00:00.000+02:00",
  "article99": "0",
  "loiReference": {
    "codeLoi": {
      "@xmlns:xsi": "http://www.w3.org/2001/XMLSchema-instance",
      "@xsi:nil": "true"
    },
    "divisionCodeLoi": {
      "@xmlns:xsi": "http://www.w3.org/2001/XMLSchema-instance",
      "@xsi:nil": "true"
    }
  }
}