{
  "@xmlns": "http://schemas.assemblee-nationale.fr/referentiel",
  "uid": "AMANR5L15PO59048B2272P1D1N703",
  "identifiant": {
    "legislature": "15",
    "numero": "703",
    "numRect": "0",
    "saisine": {
      "refTexteLegislatif": "PRJLANR5L15B2272",
      "numeroPartiePLF": "1",
      "organeExamen": "PO59048",
      "mentionSecondeDeliberation": "0"
    }
  },
  "numeroLong": "I-CF703",
  "etapeTexte": "1ère lecture (1ère assemblée saisie)",
  "triAmendement": "iiaaaaaaaaaaaaaaaaaaaaaaaaaaaaaaaaaaaaaaaaaaaaaaaabo",
  "cardinaliteAmdtMultiples": "1",
  "amendementParent": {
    "@xmlns:xsi": "http://www.w3.org/2001/XMLSchema-instance",
    "@xsi:nil": "true"
  },
  "etat": "Discuté",
  "signataires": {
    "auteur": {
      "typeAuteur": "Depute",
      "acteurRef": "PA1874",
      "organeRef": {
        "@xmlns:xsi": "http://www.w3.org/2001/XMLSchema-instance",
        "@xsi:nil": "true"
      },
      "groupePolitiqueRef": "PO730934"
    },
    "cosignataires": {
      "acteurRef": "PA1874"
    },
    "texteAffichable": "M.&#160;Le Fur"
  },
  "pointeurFragmentTexte": {
    "missionVisee": {
      "@xmlns:xsi": "http://www.w3.org/2001/XMLSchema-instance",
      "@xsi:nil": "true"
    },
    "division": {
      "titre": "Article 24",
      "articleDesignationCourte": "ART. 24",
      "type": "ARTICLE",
      "avant_A_Apres": "A",
      "divisionRattachee": "ARTICLE 24",
      "articleAdditionnel": {
        "@xmlns:xsi": "http://www.w3.org/2001/XMLSchema-instance",
        "@xsi:nil": "true"
      },
      "chapitreAdditionnel": {
        "@xmlns:xsi": "http://www.w3.org/2001/XMLSchema-instance",
        "@xsi:nil": "true"
      },
      "urlDivisionTexteVise": "/15/textes/2272A.asp#D_Article_24"
    },
    "alinea": {
      "avant_A_Apres": "A",
      "numero": "10",
      "alineaDesignation": "Alinéa 10"
    }
  },
  "corps": {
    "dispositif": "<p style=\"text-align: justify;\">L&#8217;alin&#233;a&#160;10 est ainsi r&#233;dig&#233;&#160;:</p><p style=\"text-align: justify;\">&#171;&#160;III.&#160;&#8211;&#160;&#192; la derni&#232;re phrase du II de l&#8217;article L.&#160;6211&#8209;3 du code du travail, les mots&#160;: &#171;&#160;et r&#233;parties chaque ann&#233;e par la loi de finances&#160;&#187;&#160;sont supprim&#233;s et les mots&#160;: &#171;&#160;2017, 2018 et 2019&#160;&#187; sont remplac&#233;s par les mots&#160;: &#171;&#160;2017 et 2018&#160;&#187;.&#160;&#187;</p>",
    "exposeSommaire": "<p style=\"text-align: justify;\">La loi du 5 septembre 2018 pour la libert&#233; de choisir son avenir professionnel pr&#233;voit qu&#8217;&#224; compter du 1<sup>er</sup> janvier 2020, les r&#233;gions recevront deux dotations dont une dotation pour accompagner l&#8217;investissement des centres de formation d&#8217;apprentis (CFA).</p><p style=\"text-align: justify;\">France comp&#233;tences, nouvel organisme de gouvernance de la formation professionnelle et de l&#8217;apprentissage, aura notamment pour mission de verser aux r&#233;gions ces dotations.</p><p style=\"text-align: justify;\">La loi du 5 septembre 2018 pr&#233;voyait que le montant de la dotation d&#8217;investissement serait r&#233;parti par r&#233;gion sur la base de la moyenne des d&#233;penses d&#8217;investissement constat&#233;es au titre des exercices 2017 &#224; 2019.</p><p style=\"text-align: justify;\">Le Gouvernement propose de modifier la base de calcul en prenant pour r&#233;f&#233;rence la moyenne 2017&#8209;2018 ce qui permettra de r&#233;partir entre les r&#233;gions une dotation de 180 M&#8364;.</p><p style=\"text-align: justify;\">Le pr&#233;sent amendement vise &#224; dissocier le calcul du montant de la dotation d&#8217;investissement, de la d&#233;termination des attributions individuelles dont les modalit&#233;s de calcul seront d&#233;finies par d&#233;cret.</p>",
    "annexeExposeSommaire": {
      "@xmlns:xsi": "http://www.w3.org/2001/XMLSchema-instance",
      "@xsi:nil": "true"
    },
    "cartoucheDelaiDepotDepasse": {
      "@xmlns:xsi": "http://www.w3.org/2001/XMLSchema-instance",
      "@xsi:nil": "true"
    },
    "avantAppel": {
      "@xmlns:xsi": "http://www.w3.org/2001/XMLSchema-instance",
      "@xsi:nil": "true"
    }
  },
  "representations": {
    "representation": {
      "nom": "PDF",
      "typeMime": {
        "type": "application",
        "subType": "PDF"
      },
      "statutRepresentation": {
        "verbatim": "true",
        "canonique": "true",
        "officielle": "true",
        "transcription": "false",
        "enregistrement": "false"
      },
      "repSource": {
        "@xmlns:xsi": "http://www.w3.org/2001/XMLSchema-instance",
        "@xsi:nil": "true"
      },
      "offset": {
        "@xmlns:xsi": "http://www.w3.org/2001/XMLSchema-instance",
        "@xsi:nil": "true"
      },
      "contenu": {
        "documentURI": "/15/amendements/2272A/CION_FIN/CF703.pdf"
      },
      "dateDispoRepresentation": {
        "@xmlns:xsi": "http://www.w3.org/2001/XMLSchema-instance",
        "@xsi:nil": "true"
      }
    }
  },
  "seanceDiscussion": {
    "@xmlns:xsi": "http://www.w3.org/2001/XMLSchema-instance",
    "@xsi:nil": "true"
  },
  "sort": {
    "dateSaisie": "2019-10-10T12:57:05.000+02:00",
    "sortEnSeance": "Non soutenu"
  },
  "dateDepot": "2019-10-04T02:00:00.000+02:00",
  "dateDistribution": "2019-10-09T02:00:00.000+02:00",
  "article99": "0",
  "loiReference": {
    "codeLoi": {
      "@xmlns:xsi": "http://www.w3.org/2001/XMLSchema-instance",
      "@xsi:nil": "true"
    },
    "divisionCodeLoi": {
      "@xmlns:xsi": "http://www.w3.org/2001/XMLSchema-instance",
      "@xsi:nil": "true"
    }
  }
}