{
  "@xmlns": "http://schemas.assemblee-nationale.fr/referentiel",
  "uid": "AMANR5L15SEA717460B0235P2D1N1556",
  "identifiant": {
    "legislature": "15",
    "numero": "1556",
    "numRect": "0",
    "saisine": {
      "refTexteLegislatif": "PRJLANR5L15B0235",
      "numeroPartiePLF": "2",
      "organeExamen": "PO717460",
      "mentionSecondeDeliberation": "0"
    }
  },
  "numeroLong": "II-1556",
  "etapeTexte": "1ère lecture (1ère assemblée saisie)",
  "triAmendement": "bhzwny",
  "cardinaliteAmdtMultiples": "1",
  "amendementParent": {
    "@xmlns:xsi": "http://www.w3.org/2001/XMLSchema-instance",
    "@xsi:nil": "true"
  },
  "etat": "Discuté",
  "signataires": {
    "auteur": {
      "typeAuteur": "Depute",
      "acteurRef": "PA405480",
      "organeRef": {
        "@xmlns:xsi": "http://www.w3.org/2001/XMLSchema-instance",
        "@xsi:nil": "true"
      },
      "groupePolitiqueRef": "PO730946"
    },
    "cosignataires": {
      "acteurRef": [
        "PA720988",
        "PA335532",
        "PA508",
        "PA608011",
        "PA605069",
        "PA1198",
        "PA607553",
        "PA405480",
        "PA337483",
        "PA335054",
        "PA342415",
        "PA608695",
        "PA609332",
        "PA719930",
        "PA333285",
        "PA609590",
        "PA332614",
        "PA333818",
        "PA642764",
        "PA1592",
        "PA643145",
        "PA608172",
        "PA588886",
        "PA1809",
        "PA267233",
        "PA1008",
        "PA610681",
        "PA335999",
        "PA340343",
        "PA330357",
        "PA429893"
      ]
    },
    "texteAffichable": "M.&#160;Pupponi,  Mme&#160;Rabault, Mme&#160;Pires Beaune, M.&#160;Jean-Louis&#160;Bricout, M.&#160;Aviragnet, Mme&#160;Bareigts, Mme&#160;Batho, Mme&#160;Battistel, Mme&#160;Bi&#233;mouret, M.&#160;Bouillon, M.&#160;Carvounas, M.&#160;Alain&#160;David, Mme&#160;Laurence&#160;Dumont, M.&#160;Dussopt, M.&#160;Faure, M.&#160;Garot, M.&#160;David&#160;Habib, M.&#160;Hutin, M.&#160;Juanico, Mme&#160;Karamanli, M.&#160;J&#233;r&#244;me&#160;Lambert, M.&#160;Le Foll, M.&#160;Letchimy, Mme&#160;Manin, Mme&#160;Pau-Langevin, M.&#160;Potier, M.&#160;Pueyo, M.&#160;Saulignac, Mme&#160;Untermaier, Mme&#160;Vainqueur-Christophe et M.&#160;Vallaud"
  },
  "pointeurFragmentTexte": {
    "missionVisee": {
      "@xmlns:xsi": "http://www.w3.org/2001/XMLSchema-instance",
      "@xsi:nil": "true"
    },
    "division": {
      "titre": "Article 39",
      "articleDesignationCourte": "ART. 39",
      "type": "ARTICLE",
      "avant_A_Apres": "A",
      "divisionRattachee": "ARTICLE 39",
      "articleAdditionnel": {
        "@xmlns:xsi": "http://www.w3.org/2001/XMLSchema-instance",
        "@xsi:nil": "true"
      },
      "chapitreAdditionnel": {
        "@xmlns:xsi": "http://www.w3.org/2001/XMLSchema-instance",
        "@xsi:nil": "true"
      },
      "urlDivisionTexteVise": "/15/textes/0235C.asp#D_Article_39"
    },
    "alinea": {
      "avant_A_Apres": {
        "@xmlns:xsi": "http://www.w3.org/2001/XMLSchema-instance",
        "@xsi:nil": "true"
      },
      "numero": "7",
      "alineaDesignation": {
        "@xmlns:xsi": "http://www.w3.org/2001/XMLSchema-instance",
        "@xsi:nil": "true"
      }
    }
  },
  "corps": {
    "dispositif": "<p style=\"text-align: justify;\">I.&#160;&#8211;&#160;R&#233;diger ainsi les alin&#233;as 7 &#224; 9&#160;:</p><p style=\"text-align: justify;\">&#171;&#160;Toutefois, le <i>b</i> du 1&#176; ne s&#8217;applique pas aux acquisitions de logements ayant fait l&#8217;objet d&#8217;une demande de permis de construire d&#233;pos&#233;e au plus tard le 31 d&#233;cembre 2017 et dont la date de signature de l&#8217;acte authentique d&#8217;acquisition intervient dans un d&#233;lai de 18 mois maximum &#224; compter de la date d&#8217;obtention du permis de construire.&#160;&#187;</p><p style=\"text-align: justify;\">II.&#160;&#8211;&#160;En cons&#233;quence, compl&#233;ter cet article par l&#8217;alin&#233;a suivant&#160;:</p><p style=\"text-align: justify;\">&#171;&#160;IV.&#160;&#8211;&#160;Les pertes de recettes pour l&#8217;&#201;tat sont compens&#233;es &#224; due concurrence par la cr&#233;ation d&#8217;une taxe additionnelle aux droits vis&#233;s aux articles&#160;575 et 575&#160;A du code g&#233;n&#233;ral des imp&#244;ts.</p>",
    "exposeSommaire": "<p style=\"text-align: justify;\">Dans le cadre de sa Strat&#233;gie Logement, le Gouvernement a annonc&#233; la prorogation et le recentrage g&#233;ographique du dispositif Pinel dans les zones tendues.</p><p style=\"text-align: justify;\">Applicable &#224; compter du 1<sup>er</sup> janvier 2018, ce recentrage g&#233;ographique, tardivement annonc&#233;, menace la production de logements neufs dans les communes situ&#233;es en zone B2 et C.</p><p style=\"text-align: justify;\">De nombreux programmes immobiliers, qui sont compos&#233;s de logements priv&#233;s en accession et en location et de logements sociaux, sont ainsi menac&#233;s alors m&#234;me qu&#8217;ils r&#233;pondent &#224; des besoins exprim&#233;s dans ces territoires. S&#8217;agissant en particulier des zones d&#233;tendues ce recentrage se cumule avec la r&#233;forme du PTZ et la suppression pr&#233;vue de l&#8217;APL accession.</p><p style=\"text-align: justify;\">En effet, sans une part d&#8217;investisseurs locatifs, ces programmes ne trouveront plus leur &#233;quilibre &#233;conomique et seront abandonn&#233;s. Les loyers encadr&#233;s des logements &#171;&#160;Pinel&#160;&#187; r&#233;pondent par ailleurs aux attentes de populations soucieuses de b&#233;n&#233;ficier de loyers interm&#233;diaires, inf&#233;rieurs aux prix du march&#233;.</p><p style=\"text-align: justify;\">Pour att&#233;nuer l&#8217;impact de cette mesure sur les territoires de villes moyennes concern&#233;es, que le Gouvernement souhaite par ailleurs revitaliser, il est propos&#233; de modifier les mesures transitoires inscrites dans le pr&#233;sent projet de loi pour pr&#233;server les dynamiques &#233;conomiques et d&#233;mographiques de ces territoires.&#160;</p><p style=\"text-align: justify;\">La mesure propos&#233;e ne cr&#233;e pas d&#8217;effet d&#8217;aubaine&#160;: aucun promoteur ne serait en mesure de d&#233;poser une demande de permis de construire avant le 31 d&#233;cembre 2017 pour de nouveaux projets qui n&#8217;auraient pas d&#233;j&#224; donn&#233; lieu &#224; une n&#233;gociation fonci&#232;re, &#224; une pr&#233;paration du dossier avec un architecte etc. Elle ne concerne donc que des projets d&#233;j&#224; lanc&#233;s.</p><p style=\"text-align: justify;\">La mesure propos&#233;e ne cr&#233;e pas d&#8217;effet d&#8217;aubaine&#160;: aucun promoteur ne serait en mesure de d&#233;poser une demande de permis de construire avant le 31 d&#233;cembre 2017 pour de nouveaux projets qui n&#8217;auraient pas d&#233;j&#224; donn&#233; lieu &#224; une n&#233;gociation fonci&#232;re, &#224; une pr&#233;paration du dossier avec un architecte etc. Elle ne concerne donc que des projets d&#233;j&#224; lanc&#233;s.</p>",
    "annexeExposeSommaire": {
      "@xmlns:xsi": "http://www.w3.org/2001/XMLSchema-instance",
      "@xsi:nil": "true"
    }
  },
  "representations": {
    "representation": {
      "nom": "PDF",
      "typeMime": {
        "type": "application",
        "subType": "PDF"
      },
      "statutRepresentation": {
        "verbatim": "true",
        "canonique": "true",
        "officielle": "true",
        "transcription": "false",
        "enregistrement": "false"
      },
      "repSource": {
        "@xmlns:xsi": "http://www.w3.org/2001/XMLSchema-instance",
        "@xsi:nil": "true"
      },
      "offset": {
        "@xmlns:xsi": "http://www.w3.org/2001/XMLSchema-instance",
        "@xsi:nil": "true"
      },
      "contenu": {
        "documentURI": "/15/amendements/0235C/AN/1556.pdf"
      },
      "dateDispoRepresentation": {
        "@xmlns:xsi": "http://www.w3.org/2001/XMLSchema-instance",
        "@xsi:nil": "true"
      }
    }
  },
  "seanceDiscussion": "RUANR5L15S2018IDS20766",
  "sort": {
    "dateSaisie": "2017-11-17T17:55:50.000+01:00",
    "sortEnSeance": "Rejeté"
  },
  "dateDepot": "2017-11-10T01:00:00.000+01:00",
  "dateDistribution": "2017-11-15T01:00:00.000+01:00",
  "article99": "0",
  "loiReference": {
    "codeLoi": {
      "@xmlns:xsi": "http://www.w3.org/2001/XMLSchema-instance",
      "@xsi:nil": "true"
    },
    "divisionCodeLoi": {
      "@xmlns:xsi": "http://www.w3.org/2001/XMLSchema-instance",
      "@xsi:nil": "true"
    }
  }
}