{
  "@xmlns": "http://schemas.assemblee-nationale.fr/referentiel",
  "uid": "AMANR5L15SEA717460BTC1212P0D1N29",
  "identifiant": {
    "legislature": "15",
    "numero": "29",
    "numRect": "0",
    "saisine": {
      "refTexteLegislatif": "PRJLANR5L15BTC1212",
      "numeroPartiePLF": "0",
      "organeExamen": "PO717460",
      "mentionSecondeDeliberation": "0"
    }
  },
  "numeroLong": "29",
  "etapeTexte": "1ère lecture (2ème assemblée saisie)",
  "triAmendement": "fiaaaaaaaaaaaaaaaaaaaaaaaaaaaaaaaaaaaaaaaaaaaaaaaar",
  "cardinaliteAmdtMultiples": "1",
  "amendementParent": {
    "@xmlns:xsi": "http://www.w3.org/2001/XMLSchema-instance",
    "@xsi:nil": "true"
  },
  "etat": "Discuté",
  "signataires": {
    "auteur": {
      "typeAuteur": "Depute",
      "acteurRef": "PA718720",
      "organeRef": {
        "@xmlns:xsi": "http://www.w3.org/2001/XMLSchema-instance",
        "@xsi:nil": "true"
      },
      "groupePolitiqueRef": "PO730940"
    },
    "cosignataires": {
      "acteurRef": [
        "PA721270",
        "PA722110",
        "PA610667",
        "PA441",
        "PA720546",
        "PA721896",
        "PA722202",
        "PA721118",
        "PA335612",
        "PA718720",
        "PA721012",
        "PA689",
        "PA267306",
        "PA610654",
        "PA718926",
        "PA720692"
      ]
    },
    "texteAffichable": "M.&#160;Dufr&#232;gne,  M.&#160;Fabien&#160;Roussel, Mme&#160;Bello, M.&#160;Brotherson, M.&#160;Bruneel, Mme&#160;Buffet, M.&#160;Chassaigne, M.&#160;Dharr&#233;ville, Mme&#160;Faucillon, M.&#160;Jumel, Mme&#160;K&#233;clard-Mond&#233;sir, M.&#160;Lecoq, M.&#160;Nilor, M.&#160;Peu, M.&#160;Serville et M.&#160;Wulfranc"
  },
  "pointeurFragmentTexte": {
    "missionVisee": {
      "@xmlns:xsi": "http://www.w3.org/2001/XMLSchema-instance",
      "@xsi:nil": "true"
    },
    "division": {
      "titre": "Article 7",
      "articleDesignationCourte": "APRÈS ART. 7",
      "type": "ARTICLE",
      "avant_A_Apres": "Après",
      "divisionRattachee": "APRÈS L'ARTICLE 7, insérer l'article suivant:",
      "articleAdditionnel": "1",
      "chapitreAdditionnel": {
        "@xmlns:xsi": "http://www.w3.org/2001/XMLSchema-instance",
        "@xsi:nil": "true"
      },
      "urlDivisionTexteVise": "/15/textes/1212.asp#D_Article_7"
    },
    "alinea": {
      "@xmlns:xsi": "http://www.w3.org/2001/XMLSchema-instance",
      "@xsi:nil": "true"
    }
  },
  "corps": {
    "dispositif": "<p style=\"text-align: justify;\">Le premier alin&#233;a de l&#8217;article L.&#160;2312&#8209;25 du code du travail est compl&#233;t&#233; par les mots&#160;:</p><p style=\"text-align: justify;\">&#171;&#160;et sur les prix de transfert pratiqu&#233;s entre les entreprises et entit&#233;s appartenant au m&#234;me groupe, y compris celles bas&#233;es ou exer&#231;ant &#224; l&#8217;&#233;tranger. Elle porte &#233;galement sur les cessions d&#8217;actifs, y compris les actifs immat&#233;riels&#160;&#187;.</p>",
    "exposeSommaire": "<p style=\"text-align: justify;\">Le traitement de la d&#233;licate question des prix de transfert occupe une place essentielle dans le combat contre la fraude, l&#8217;&#233;vasion et l&#8217;optimisation fiscales.</p><p style=\"text-align: justify;\">Il est d&#233;sormais &#233;vident que les repr&#233;sentants du personnel jouent un r&#244;le essentiel dans cette bataille. Ils sont parfois les victimes des agissements fiscaux de leur entreprise.</p><p style=\"text-align: justify;\">Nous proposons de permettre une information et une consultation de ces repr&#233;sentants quant &#224; la politique de prix de transfert retenue par l&#8217;entreprise et quant aux cessions d&#8217;actifs au sein d&#8217;un m&#234;me groupe.</p>",
    "annexeExposeSommaire": {
      "@xmlns:xsi": "http://www.w3.org/2001/XMLSchema-instance",
      "@xsi:nil": "true"
    }
  },
  "representations": {
    "representation": {
      "nom": "PDF",
      "typeMime": {
        "type": "application",
        "subType": "PDF"
      },
      "statutRepresentation": {
        "verbatim": "true",
        "canonique": "true",
        "officielle": "true",
        "transcription": "false",
        "enregistrement": "false"
      },
      "repSource": {
        "@xmlns:xsi": "http://www.w3.org/2001/XMLSchema-instance",
        "@xsi:nil": "true"
      },
      "offset": {
        "@xmlns:xsi": "http://www.w3.org/2001/XMLSchema-instance",
        "@xsi:nil": "true"
      },
      "contenu": {
        "documentURI": "/15/amendements/1212/AN/29.pdf"
      },
      "dateDispoRepresentation": {
        "@xmlns:xsi": "http://www.w3.org/2001/XMLSchema-instance",
        "@xsi:nil": "true"
      }
    }
  },
  "seanceDiscussion": "RUANR5L15S2018IDS21240",
  "sort": {
    "dateSaisie": "2018-09-18T18:22:00.000+02:00",
    "sortEnSeance": "Adopté"
  },
  "dateDepot": "2018-09-05T02:00:00.000+02:00",
  "dateDistribution": "2018-09-15T02:00:00.000+02:00",
  "article99": "0",
  "loiReference": {
    "codeLoi": "c travail",
    "divisionCodeLoi": "L.2312-25"
  }
}