{
  "@xmlns": "http://schemas.assemblee-nationale.fr/referentiel",
  "uid": "AMANR5L15PO757134B1088P0D1N1394",
  "identifiant": {
    "legislature": "15",
    "numero": "1394",
    "numRect": "0",
    "saisine": {
      "refTexteLegislatif": "PRJLANR5L15B1088",
      "numeroPartiePLF": "0",
      "organeExamen": "PO757134",
      "mentionSecondeDeliberation": "0"
    }
  },
  "numeroLong": "1394",
  "etapeTexte": "1ère lecture (1ère assemblée saisie)",
  "triAmendement": "lkaaaaaaaaaaaaaaaaaaaaaaaaaaaaaaaaaaaaaaaaaaaaaaaajbdddh",
  "cardinaliteAmdtMultiples": "1",
  "amendementParent": {
    "@xmlns:xsi": "http://www.w3.org/2001/XMLSchema-instance",
    "@xsi:nil": "true"
  },
  "etat": "Discuté",
  "signataires": {
    "auteur": {
      "typeAuteur": "Depute",
      "acteurRef": "PA346054",
      "organeRef": {
        "@xmlns:xsi": "http://www.w3.org/2001/XMLSchema-instance",
        "@xsi:nil": "true"
      },
      "groupePolitiqueRef": "PO730934"
    },
    "cosignataires": {
      "acteurRef": [
        "PA712015",
        "PA346054"
      ]
    },
    "texteAffichable": "M.&#160;Emmanuel&#160;Maquet et M.&#160;Dive"
  },
  "pointeurFragmentTexte": {
    "missionVisee": {
      "@xmlns:xsi": "http://www.w3.org/2001/XMLSchema-instance",
      "@xsi:nil": "true"
    },
    "division": {
      "titre": "Article 61",
      "articleDesignationCourte": "ART. 61",
      "type": "ARTICLE",
      "avant_A_Apres": "A",
      "divisionRattachee": "ARTICLE 61",
      "articleAdditionnel": {
        "@xmlns:xsi": "http://www.w3.org/2001/XMLSchema-instance",
        "@xsi:nil": "true"
      },
      "chapitreAdditionnel": {
        "@xmlns:xsi": "http://www.w3.org/2001/XMLSchema-instance",
        "@xsi:nil": "true"
      },
      "urlDivisionTexteVise": "/15/textes/1088.asp#D_Article_61"
    },
    "alinea": {
      "@xmlns:xsi": "http://www.w3.org/2001/XMLSchema-instance",
      "@xsi:nil": "true"
    }
  },
  "corps": {
    "dispositif": "<p>Supprimer cet article.</p>",
    "exposeSommaire": "<p>Les concepts d'&#171; objet social &#187; et de &#171; raison d'&#234;tre &#187; de l'entreprise, issus du rapport Senard-Notat de mars 2018, sont des neutrons l&#233;gislatifs. Leurs cons&#233;quences juridiques, en plus d'&#234;tre &#224; vocation purement communicationnelles, sont mal ma&#238;tris&#233;es.</p><p>Sur le fond, ils pr&#233;tendent r&#233;pondre &#224; la &#171; m&#233;fiance &#187; que ressentiraient les Fran&#231;ais envers leurs entreprises, per&#231;ues comme des pr&#233;dateurs financiers recherchant le profit &#224; court terme. Cette mani&#232;re de voir les choses n'est ni vraie, ni neutre. Elle est une grille de lecture politique impos&#233;e par certains courants id&#233;ologiques pour caricaturer le capitalisme, les actionnaires et la cr&#233;ation de richesse dans son ensemble. Y r&#233;pondre par des carcans l&#233;gislatifs, c'est d&#233;j&#224; souscrire &#224; ce paradigme. Une r&#233;ponse saine consisterait plut&#244;t en une promotion de l'entreprise comme vecteur de prosp&#233;rit&#233; et de valeur. Il faut militer pour l'id&#233;e que le march&#233; est synonyme de libert&#233;, que le profit r&#233;sulte d'un choix libre et &#233;clair&#233; des consommateurs, et que par cons&#233;quent, en produisant les meilleurs produits au co&#251;t le plus adapt&#233; &#224; sa client&#232;le, l'entreprise remplit pleinement son objet social : la production de richesses pour ses actionnaires, subordonn&#233;e &#224; la satisfaction des consommateurs. La loi n'a pas besoin d'encombrer les entreprises de principes moraux imp&#233;rieux et condescendants.</p><p>Sur la forme, les termes choisis paraissent pour le moins obscurs. Ils seront sujets &#224; interpr&#233;tation des juges et les cons&#233;quences jurisprudentielles de tels principes sont impr&#233;visibles. D'autant plus que ce dispositif vient s'ajouter &#224; des codes instables et foisonnants. En effet, cette notion d'int&#233;r&#234;t social a ceci de d&#233;rangeant qu'elle sous-entend que jusqu'&#224; 2018, les entreprises agissaient au m&#233;pris de l'int&#233;r&#234;t g&#233;n&#233;ral. C'est oublier qu'elles agissent, tant bien que mal, dans le cadre de l'&#201;tat de droit fran&#231;ais, peu suspect de l&#233;g&#232;ret&#233; en mati&#232;re de lois, r&#233;glementations, codes et autres proc&#233;d&#233;s impos&#233;s.</p><p>Face &#224; cet exemple de loi bavarde, le pr&#233;sent amendement vise supprimer cette mesure inutile et bas&#233;e sur des pr&#233;suppos&#233;s hostiles aux entreprises.</p>",
    "annexeExposeSommaire": {
      "@xmlns:xsi": "http://www.w3.org/2001/XMLSchema-instance",
      "@xsi:nil": "true"
    }
  },
  "representations": {
    "representation": {
      "nom": "PDF",
      "typeMime": {
        "type": "application",
        "subType": "PDF"
      },
      "statutRepresentation": {
        "verbatim": "true",
        "canonique": "true",
        "officielle": "true",
        "transcription": "false",
        "enregistrement": "false"
      },
      "repSource": {
        "@xmlns:xsi": "http://www.w3.org/2001/XMLSchema-instance",
        "@xsi:nil": "true"
      },
      "offset": {
        "@xmlns:xsi": "http://www.w3.org/2001/XMLSchema-instance",
        "@xsi:nil": "true"
      },
      "contenu": {
        "documentURI": "/15/amendements/1088/CSPACTE/1394.pdf"
      },
      "dateDispoRepresentation": {
        "@xmlns:xsi": "http://www.w3.org/2001/XMLSchema-instance",
        "@xsi:nil": "true"
      }
    }
  },
  "seanceDiscussion": {
    "@xmlns:xsi": "http://www.w3.org/2001/XMLSchema-instance",
    "@xsi:nil": "true"
  },
  "sort": {
    "dateSaisie": "2018-09-14T16:34:24.000+02:00",
    "sortEnSeance": "Non soutenu"
  },
  "dateDepot": "2018-09-03T02:00:00.000+02:00",
  "dateDistribution": "2018-09-11T02:00:00.000+02:00",
  "article99": "0",
  "loiReference": {
    "codeLoi": {
      "@xmlns:xsi": "http://www.w3.org/2001/XMLSchema-instance",
      "@xsi:nil": "true"
    },
    "divisionCodeLoi": {
      "@xmlns:xsi": "http://www.w3.org/2001/XMLSchema-instance",
      "@xsi:nil": "true"
    }
  }
}