{
  "@xmlns": "http://schemas.assemblee-nationale.fr/referentiel",
  "uid": "AMANR5L15SEA717460B2272P2D1N1940",
  "identifiant": {
    "legislature": "15",
    "numero": "1940",
    "numRect": "0",
    "saisine": {
      "refTexteLegislatif": "PRJLANR5L15B2272",
      "numeroPartiePLF": "2",
      "organeExamen": "PO717460",
      "mentionSecondeDeliberation": "1"
    }
  },
  "numeroLong": "II-1940",
  "etapeTexte": "1ère lecture (1ère assemblée saisie)",
  "triAmendement": "kuaaaaaaaaaaaaaaaaaaaaaaaaaaaaaaaaaaaaaaaaaaaaaaaaaczu",
  "cardinaliteAmdtMultiples": "1",
  "amendementParent": {
    "@xmlns:xsi": "http://www.w3.org/2001/XMLSchema-instance",
    "@xsi:nil": "true"
  },
  "etat": "Discuté",
  "signataires": {
    "auteur": {
      "typeAuteur": "Depute",
      "acteurRef": "PA335999",
      "organeRef": {
        "@xmlns:xsi": "http://www.w3.org/2001/XMLSchema-instance",
        "@xsi:nil": "true"
      },
      "groupePolitiqueRef": "PO723569"
    },
    "cosignataires": {
      "acteurRef": "PA335999"
    },
    "texteAffichable": "Mme&#160;Batho"
  },
  "pointeurFragmentTexte": {
    "missionVisee": {
      "@xmlns:xsi": "http://www.w3.org/2001/XMLSchema-instance",
      "@xsi:nil": "true"
    },
    "division": {
      "titre": "Article 68",
      "articleDesignationCourte": "ART. 68",
      "type": "ARTICLE",
      "avant_A_Apres": "A",
      "divisionRattachee": "ARTICLE 68",
      "articleAdditionnel": {
        "@xmlns:xsi": "http://www.w3.org/2001/XMLSchema-instance",
        "@xsi:nil": "true"
      },
      "chapitreAdditionnel": {
        "@xmlns:xsi": "http://www.w3.org/2001/XMLSchema-instance",
        "@xsi:nil": "true"
      },
      "urlDivisionTexteVise": "/15/textes/2272C.asp#D_Article_68"
    },
    "alinea": {
      "avant_A_Apres": "A",
      "numero": "2",
      "alineaDesignation": "Alinéa 2"
    }
  },
  "corps": {
    "dispositif": "<p style=\"text-align: justify;\">Apr&#232;s le mot&#160;:</p><p style=\"text-align: justify;\">&#171;&#160;extraction&#160;&#187;,</p><p style=\"text-align: justify;\">r&#233;diger ainsi la fin de l&#8217;alin&#233;a&#160;2&#160;:</p><p style=\"text-align: justify;\">&#171;&#160;la production, le transport, le stockage et la combustion d&#8217;&#233;nergies fossiles.&#160;&#187;</p>",
    "exposeSommaire": "<p style=\"text-align: justify;\">Cet amendement vise &#224; mettre fin aux garanties &#224; l&#8217;export en faveur des &#233;nergies fossiles. Il traduit dans la loi de finances pour 2020 les propos du Pr&#233;sident de la R&#233;publique qui, le 24 septembre dernier, lors de son discours &#224; la tribune de l&#8217;Assembl&#233;e g&#233;n&#233;rale de l&#8217;ONU, indiquait&#160;: &#171;&#160;Il faut ensuite que les grands pays de ce monde arr&#234;tent de financer de nouvelles installations polluantes dans les pays en voie de d&#233;veloppement. Nous continuons encore aujourd&#8217;hui &#224; avoir du financement export, et des projets dans tant de pays, financ&#233;s par des pays d&#233;velopp&#233;s qui consistent &#224; ouvrir de nouvelles structures polluantes (...) c&#8217;est incoh&#233;rent, c&#8217;est irresponsable&#160;&#187;.</p><p style=\"text-align: justify;\">Or, &#224; l&#8217;occasion de l&#8217;examen du projet de loi &#233;nergie climat, la Commission des affaires &#233;conomiques avait adopt&#233; un amendement qui mettait fin aux aides publiques accord&#233;es sous forme de garanties &#224; l&#8217;export pour des op&#233;rations li&#233;es &#224; l&#8217;exploration, l&#8217;exploitation, le transport ou la combustion d&#8217;&#233;nergies fossiles. Cette avanc&#233;e importante avait &#233;t&#233; supprim&#233;e par un amendement du Gouvernement en s&#233;ance.</p><p style=\"text-align: justify;\">L&#8217;actuelle r&#233;daction de l&#8217;article&#160;68 du projet de loi de finances pour 2020 inscrit dans le code des assurances l&#8217;interdiction des garanties export, mais seulement pour le charbon. En pratique cette interdiction ne visant que le charbon est d&#233;j&#224; en vigueur en France et appliqu&#233;e par BPI France, car d&#233;cid&#233;e par le Gouvernement avant la COP21. De plus, elle est une obligation de l&#8217;OCDE. Les dispositions de l&#8217;article&#160;68 n&#8217;apportent donc rien de nouveau et ne constituent pas une avanc&#233;e en l&#8217;&#233;tat.</p><p style=\"text-align: justify;\">De plus, il apparait qu&#8217;entre 2014 et 2018, Bpifrance Assurance Export a apport&#233;, sur d&#233;cision du Gouvernement, une garantie export &#224; plusieurs projets d&#8217;&#233;nergie fossiles selon la d&#233;finition de l&#8217;OCDE &#224; hauteur d&#8217;au moins 2 milliards d&#8217;euros. C&#8217;est &#224; ces pratiques qu&#8217;il convient de mettre un terme d&#233;finitif.</p><p style=\"text-align: justify;\">Le rapport de GIEC SR 15 publi&#233; en octobre 2018 montre qu&#8217;il ne reste qu&#8217;une dizaine d&#8217;ann&#233;e pour op&#233;rer des changements rapides et radicaux de nos modes de production et de consommation pour limiter le r&#233;chauffement climatique global &#224; 1,5 ou 2 degr&#233;. Dans ce cadre, il faut renoncer &#224; la cr&#233;ation de toute nouvelle capacit&#233; li&#233;e aux &#233;nergies fossiles. Aussi, la garantie publique ne doit plus &#234;tre accord&#233;e &#224; aucun projet d&#8217;exploitation, d&#8217;extraction, de transport ou de stockage des &#233;nergies fossiles de toute nature.</p><p style=\"text-align: justify;\">L&#8217;Agence internationale de l&#8217;&#233;nergie, dans son rapport annuel de 2018, est formelle&#160;: il ne faut pas cr&#233;er de nouvelles capacit&#233;s d&#8217;exploitation des &#233;nergies fossiles. En juin dernier, dans son rapport &#224; l&#8217;intention du G20, l&#8217;OCDE a de nouveau d&#233;clar&#233; que les subventions aux &#233;nergies fossiles sapent les efforts d&#233;ploy&#233;s au niveau mondial pour lutter contre le changement climatique.</p><p style=\"text-align: justify;\">Toutes les garanties exports aux &#233;nergies fossiles doivent &#234;tre supprim&#233;es. Cela en coh&#233;rence avec l&#8217;Accord de Paris sur le climat et l&#8217;engagement de l&#8217;Union europ&#233;enne de supprimer les subventions aux &#233;nergies fossiles d&#8217;ici 2020.</p>",
    "annexeExposeSommaire": {
      "@xmlns:xsi": "http://www.w3.org/2001/XMLSchema-instance",
      "@xsi:nil": "true"
    },
    "cartoucheDelaiDepotDepasse": {
      "@xmlns:xsi": "http://www.w3.org/2001/XMLSchema-instance",
      "@xsi:nil": "true"
    },
    "avantAppel": {
      "@xmlns:xsi": "http://www.w3.org/2001/XMLSchema-instance",
      "@xsi:nil": "true"
    }
  },
  "representations": {
    "representation": {
      "nom": "PDF",
      "typeMime": {
        "type": "application",
        "subType": "PDF"
      },
      "statutRepresentation": {
        "verbatim": "true",
        "canonique": "true",
        "officielle": "true",
        "transcription": "false",
        "enregistrement": "false"
      },
      "repSource": {
        "@xmlns:xsi": "http://www.w3.org/2001/XMLSchema-instance",
        "@xsi:nil": "true"
      },
      "offset": {
        "@xmlns:xsi": "http://www.w3.org/2001/XMLSchema-instance",
        "@xsi:nil": "true"
      },
      "contenu": {
        "documentURI": "/15/amendements/2272C/AN/1940.pdf"
      },
      "dateDispoRepresentation": {
        "@xmlns:xsi": "http://www.w3.org/2001/XMLSchema-instance",
        "@xsi:nil": "true"
      }
    }
  },
  "seanceDiscussion": "RUANR5L15S2020IDS21925",
  "sort": {
    "dateSaisie": "2019-11-15T18:56:33.000+01:00",
    "sortEnSeance": "Rejeté"
  },
  "dateDepot": "2019-11-06T01:00:00.000+01:00",
  "dateDistribution": "2019-11-14T01:00:00.000+01:00",
  "article99": "0",
  "loiReference": {
    "codeLoi": {
      "@xmlns:xsi": "http://www.w3.org/2001/XMLSchema-instance",
      "@xsi:nil": "true"
    },
    "divisionCodeLoi": {
      "@xmlns:xsi": "http://www.w3.org/2001/XMLSchema-instance",
      "@xsi:nil": "true"
    }
  }
}