{
  "@xmlns": "http://schemas.assemblee-nationale.fr/referentiel",
  "uid": "AMANR5L15SEA717460B2272P1D1N3004",
  "identifiant": {
    "legislature": "15",
    "numero": "3004",
    "numRect": "0",
    "saisine": {
      "refTexteLegislatif": "PRJLANR5L15B2272",
      "numeroPartiePLF": "1",
      "organeExamen": "PO717460",
      "mentionSecondeDeliberation": "0"
    }
  },
  "numeroLong": "I-3004",
  "etapeTexte": "1ère lecture (1ère assemblée saisie)",
  "triAmendement": "aoacaaaaaaaaaaaaaaaaaaaaaaaaaaaaaaaaaaaaaaaaaaaaaazzzzzzzzzzzzi",
  "cardinaliteAmdtMultiples": "1",
  "amendementParent": {
    "@xmlns:xsi": "http://www.w3.org/2001/XMLSchema-instance",
    "@xsi:nil": "true"
  },
  "etat": "Retiré",
  "signataires": {
    "auteur": {
      "typeAuteur": "Gouvernement",
      "acteurRef": {
        "@xmlns:xsi": "http://www.w3.org/2001/XMLSchema-instance",
        "@xsi:nil": "true"
      },
      "organeRef": {
        "@xmlns:xsi": "http://www.w3.org/2001/XMLSchema-instance",
        "@xsi:nil": "true"
      },
      "groupePolitiqueRef": {
        "@xmlns:xsi": "http://www.w3.org/2001/XMLSchema-instance",
        "@xsi:nil": "true"
      }
    },
    "cosignataires": {
      "@xmlns:xsi": "http://www.w3.org/2001/XMLSchema-instance",
      "@xsi:nil": "true"
    },
    "texteAffichable": "le Gouvernement"
  },
  "pointeurFragmentTexte": {
    "missionVisee": {
      "@xmlns:xsi": "http://www.w3.org/2001/XMLSchema-instance",
      "@xsi:nil": "true"
    },
    "division": {
      "titre": "Article 19",
      "articleDesignationCourte": "ART. 19",
      "type": "ARTICLE",
      "avant_A_Apres": "A",
      "divisionRattachee": "ARTICLE 19",
      "articleAdditionnel": {
        "@xmlns:xsi": "http://www.w3.org/2001/XMLSchema-instance",
        "@xsi:nil": "true"
      },
      "chapitreAdditionnel": {
        "@xmlns:xsi": "http://www.w3.org/2001/XMLSchema-instance",
        "@xsi:nil": "true"
      },
      "urlDivisionTexteVise": "/15/textes/2272A.asp#D_Article_19"
    },
    "alinea": {
      "@xmlns:xsi": "http://www.w3.org/2001/XMLSchema-instance",
      "@xsi:nil": "true"
    }
  },
  "corps": {
    "dispositif": "<p>L&#8217;article 19 est ainsi compl&#233;t&#233;&#160;:</p><p>III.&#160; A compter de 2020, l&#8217;affectation de TICPE &#224; l&#8217;AFITF pr&#233;vue au III de l&#8217;article 36 de la LFI 2015 int&#232;gre le montant des recettes issues de la baisse du remboursement partiel de la taxe int&#233;rieure de consommation sur les produits &#233;nerg&#233;tiques pr&#233;vue au I.</p><p>IV. Apr&#232;s l&#8217;article L3221-2 du code des transports, il est cr&#233;&#233; un article L3221-3 ainsi r&#233;dig&#233; :</p><p>&#171; La facture de transport fait appara&#238;tre le montant de l&#8217;augmentation de la taxe int&#233;rieure de consommation sur les produits &#233;nerg&#233;tiques d&#251; au titre de la facture, affect&#233; au financement de l&#8217;Agence de Financement des Infrastructures de Transport de France en application du III.</p><p>Un arr&#234;t&#233; conjoint des ministres charg&#233;s de l&#8217;&#233;conomie et des transports fixe les modalit&#233;s de cette mention.\"</p><p>&#160;</p>",
    "exposeSommaire": "<p>Le III du pr&#233;sent amendement a pour objet d&#8217;identifier l&#8217;affectation&#160; &#224; l&#8217;Agence de financement des infrastructures de transport de France (AFITF) du produit de TICPE issu de la diminution de 2cts, pr&#233;vue au I, du remboursement partiel de taxe int&#233;rieure de consommation sur les produits &#233;nerg&#233;tiques (TICPE) sur le gazole acquis en France, accord&#233; aux personnes utilisatrices de v&#233;hicules routiers de plus de 7,5 tonnes pour le transport de marchandises. L&#8217;objectif de cette mesure est d&#8217;assurer une meilleure participation du transport routier de marchandises au financement des infrastructures routi&#232;res nationales non conc&#233;d&#233;es qu&#8217;il emprunte et d&#8217;en assurer ainsi la visibilit&#233;.&#160;</p><p>Le IV du pr&#233;sent amendement a pour objet d&#8217;instaurer une mesure de transparence en pied de facture faisant appara&#238;tre un montant &#233;valuatif et informatif de la part du prix de la prestation affect&#233;e au financement des infrastructures de transport au titre de la mesure pr&#233;vue au I .</p><p>&#160;</p><p>&#160;</p>",
    "annexeExposeSommaire": {
      "@xmlns:xsi": "http://www.w3.org/2001/XMLSchema-instance",
      "@xsi:nil": "true"
    },
    "cartoucheDelaiDepotDepasse": {
      "@xmlns:xsi": "http://www.w3.org/2001/XMLSchema-instance",
      "@xsi:nil": "true"
    },
    "avantAppel": {
      "@xmlns:xsi": "http://www.w3.org/2001/XMLSchema-instance",
      "@xsi:nil": "true"
    }
  },
  "representations": {
    "representation": {
      "nom": "PDF",
      "typeMime": {
        "type": "application",
        "subType": "PDF"
      },
      "statutRepresentation": {
        "verbatim": "true",
        "canonique": "true",
        "officielle": "true",
        "transcription": "false",
        "enregistrement": "false"
      },
      "repSource": {
        "@xmlns:xsi": "http://www.w3.org/2001/XMLSchema-instance",
        "@xsi:nil": "true"
      },
      "offset": {
        "@xmlns:xsi": "http://www.w3.org/2001/XMLSchema-instance",
        "@xsi:nil": "true"
      },
      "contenu": {
        "documentURI": "/15/amendements/2272A/AN/3004.pdf"
      },
      "dateDispoRepresentation": {
        "@xmlns:xsi": "http://www.w3.org/2001/XMLSchema-instance",
        "@xsi:nil": "true"
      }
    }
  },
  "seanceDiscussion": {
    "@xmlns:xsi": "http://www.w3.org/2001/XMLSchema-instance",
    "@xsi:nil": "true"
  },
  "sort": {
    "@xmlns:xsi": "http://www.w3.org/2001/XMLSchema-instance",
    "@xsi:nil": "true"
  },
  "dateDepot": "2019-10-15T02:00:00.000+02:00",
  "dateDistribution": "2019-10-15T02:00:00.000+02:00",
  "article99": "0",
  "loiReference": {
    "codeLoi": "c pénal",
    "divisionCodeLoi": {
      "@xmlns:xsi": "http://www.w3.org/2001/XMLSchema-instance",
      "@xsi:nil": "true"
    }
  }
}