{
  "@xmlns": "http://schemas.assemblee-nationale.fr/referentiel",
  "uid": "AMANR5L15SEA717460B2272P2D1N2472",
  "identifiant": {
    "legislature": "15",
    "numero": "2472",
    "numRect": "1",
    "saisine": {
      "refTexteLegislatif": "PRJLANR5L15B2272",
      "numeroPartiePLF": "2",
      "organeExamen": "PO717460",
      "mentionSecondeDeliberation": "0"
    }
  },
  "numeroLong": "II-2472 (Rect)",
  "etapeTexte": "1ère lecture (1ère assemblée saisie)",
  "triAmendement": "bfiaaaaaaaaaaaaaaaaaaaaaaaaaaaaaaaaaaaaaaaaaaaaaaaaahzz",
  "cardinaliteAmdtMultiples": "1",
  "amendementParent": {
    "@xmlns:xsi": "http://www.w3.org/2001/XMLSchema-instance",
    "@xsi:nil": "true"
  },
  "etat": "Discuté",
  "signataires": {
    "auteur": {
      "typeAuteur": "Gouvernement",
      "acteurRef": {
        "@xmlns:xsi": "http://www.w3.org/2001/XMLSchema-instance",
        "@xsi:nil": "true"
      },
      "organeRef": {
        "@xmlns:xsi": "http://www.w3.org/2001/XMLSchema-instance",
        "@xsi:nil": "true"
      },
      "groupePolitiqueRef": {
        "@xmlns:xsi": "http://www.w3.org/2001/XMLSchema-instance",
        "@xsi:nil": "true"
      }
    },
    "cosignataires": {
      "@xmlns:xsi": "http://www.w3.org/2001/XMLSchema-instance",
      "@xsi:nil": "true"
    },
    "texteAffichable": "le Gouvernement"
  },
  "pointeurFragmentTexte": {
    "missionVisee": {
      "idMissionAN": "823",
      "libelleMission": "Relations avec les collectivités territoriales",
      "codeMissionPLF": "B",
      "libelleMissionPLF": "Répartition, par mission et programme, des crédits du budget général"
    },
    "division": {
      "titre": "Article 78",
      "articleDesignationCourte": "APRÈS ART. 78",
      "type": "ARTICLE",
      "avant_A_Apres": "Après",
      "divisionRattachee": "APRÈS L'ARTICLE 78, insérer l'article suivant:",
      "articleAdditionnel": "1",
      "chapitreAdditionnel": {
        "@xmlns:xsi": "http://www.w3.org/2001/XMLSchema-instance",
        "@xsi:nil": "true"
      },
      "urlDivisionTexteVise": "/15/textes/2272C.asp#D_Article_78"
    },
    "alinea": {
      "@xmlns:xsi": "http://www.w3.org/2001/XMLSchema-instance",
      "@xsi:nil": "true"
    }
  },
  "corps": {
    "dispositif": "<p style=\"text-align: justify;\">L&#8217;article L.&#160;2335&#8209;15 du code g&#233;n&#233;ral des collectivit&#233;s territoriales est ainsi modifi&#233;&#160;:</p><p style=\"text-align: justify;\">&#160;1&#176;&#160;Les deuxi&#232;me et troisi&#232;me alin&#233;as sont ainsi r&#233;dig&#233;s&#160;:</p><p style=\"text-align: justify;\">&#160;&#171;&#160;Ce fonds est destin&#233; &#224; apporter une aide financi&#232;re aux communes, aux &#233;tablissements publics locaux comp&#233;tents ou aux groupements d&#8217;int&#233;r&#234;t public comp&#233;tents, afin d&#8217;assurer durant une p&#233;riode maximale de six mois l&#8217;h&#233;bergement d&#8217;urgence ou le relogement temporaire de personnes occupant des locaux qui pr&#233;sentent un danger pour leur sant&#233; ou leur s&#233;curit&#233;, et qui ont fait l&#8217;objet soit d&#8217;une ordonnance d&#8217;expulsion, soit d&#8217;un ordre d&#8217;&#233;vacuation.&#160;&#187;</p><p style=\"text-align: justify;\">&#160;&#171;&#160;Une aide financi&#232;re peut &#233;galement leur &#234;tre attribu&#233;e pour mettre les locaux hors d&#8217;&#233;tat d&#8217;&#234;tre utilisables.&#160;&#187;.</p><p style=\"text-align: justify;\">&#160;2&#176;&#160;Le dernier alin&#233;a est ainsi r&#233;dig&#233;&#160;:</p><p style=\"text-align: justify;\">&#160;&#171;&#160;Un d&#233;cret fixe les modalit&#233;s d&#8217;application du pr&#233;sent article.&#160;&#187;&#160;</p>",
    "exposeSommaire": "<p style=\"text-align: justify;\">Cr&#233;&#233; par la loi n&#176;&#160;2005&#8209;1719 du 30 d&#233;cembre 2005 de finances pour 2006, le fonds d&#8217;aide au relogement d&#8217;urgence (FARU), codifi&#233; &#224; l&#8217;article L.&#160;2335&#8209;15 du code g&#233;n&#233;ral des collectivit&#233;s territoriales (CGCT), permet d&#8217;octroyer des aides aux communes et &#233;tablissements publics comp&#233;tents qui prennent en charge le relogement temporaire d&#8217;occupants de logements &#233;vacu&#233;s sur la base d&#8217;une mesure de police sp&#233;ciale, g&#233;n&#233;rale ou dans le cadre d&#8217;une catastrophe naturelle. Des subventions peuvent aussi &#234;tre octroy&#233;es pour les op&#233;rations de murage des logements &#233;vacu&#233;s afin d&#8217;&#233;viter leur r&#233;int&#233;gration pendant que le danger persiste.</p><p style=\"text-align: justify;\">Les dispositions l&#233;gislatives actuelles pr&#233;voient que la d&#233;cision d&#8217;attribution des subventions rel&#232;ve du ministre de l&#8217;int&#233;rieur.</p><p style=\"text-align: justify;\">Au vu de l&#8217;exp&#233;rience acquise, il appara&#238;t pertinent de simplifier et de moderniser l&#8217;instruction des dossiers (environ 100 par an), aujourd&#8217;hui d&#233;pos&#233;s par les communes ou leurs &#233;tablissements publics, instruits par les services pr&#233;fectoraux, puis transmis avec avis &#224; l&#8217;administration centrale, qui exerce un contr&#244;le de coh&#233;rence et prend la d&#233;cision d&#8217;attribution.</p><p style=\"text-align: justify;\">La d&#233;concentration de la proc&#233;dure doit permettre de gagner en r&#233;activit&#233; et en souplesse. Elle s&#8217;inscrit dans le cadre de l&#8217;instruction du Premier ministre du 24 juillet 2018 relative &#224; la d&#233;concentration et &#224; l&#8217;organisation des administrations centrales.</p><p style=\"text-align: justify;\">Sur ces bases, le pr&#233;sent amendement propose de modifier l&#8217;article L.&#160;2335&#8209;15 du CGCT afin de pr&#233;voir que la d&#233;cision d&#8217;octroi de la subvention ne rel&#232;ve plus d&#8217;une d&#233;cision du ministre. Un d&#233;cret viendra notamment pr&#233;ciser les conditions dans lesquelles le repr&#233;sentant de l&#8217;&#201;tat dans le d&#233;partement prendra les d&#233;cisions d&#8217;attribution.</p>",
    "annexeExposeSommaire": {
      "@xmlns:xsi": "http://www.w3.org/2001/XMLSchema-instance",
      "@xsi:nil": "true"
    },
    "cartoucheDelaiDepotDepasse": {
      "@xmlns:xsi": "http://www.w3.org/2001/XMLSchema-instance",
      "@xsi:nil": "true"
    },
    "avantAppel": {
      "@xmlns:xsi": "http://www.w3.org/2001/XMLSchema-instance",
      "@xsi:nil": "true"
    }
  },
  "representations": {
    "representation": {
      "nom": "PDF",
      "typeMime": {
        "type": "application",
        "subType": "PDF"
      },
      "statutRepresentation": {
        "verbatim": "true",
        "canonique": "true",
        "officielle": "true",
        "transcription": "false",
        "enregistrement": "false"
      },
      "repSource": {
        "@xmlns:xsi": "http://www.w3.org/2001/XMLSchema-instance",
        "@xsi:nil": "true"
      },
      "offset": {
        "@xmlns:xsi": "http://www.w3.org/2001/XMLSchema-instance",
        "@xsi:nil": "true"
      },
      "contenu": {
        "documentURI": "/15/amendements/2272C/AN/2472.pdf"
      },
      "dateDispoRepresentation": {
        "@xmlns:xsi": "http://www.w3.org/2001/XMLSchema-instance",
        "@xsi:nil": "true"
      }
    }
  },
  "seanceDiscussion": "RUANR5L15S2020IDS21910",
  "sort": {
    "dateSaisie": "2019-11-08T11:26:58.000+01:00",
    "sortEnSeance": "Adopté"
  },
  "dateDepot": "2019-11-08T01:00:00.000+01:00",
  "dateDistribution": "2019-11-08T01:00:00.000+01:00",
  "article99": "1",
  "loiReference": {
    "codeLoi": "CGCT",
    "divisionCodeLoi": "L2335-15"
  }
}