{
  "@xmlns": "http://schemas.assemblee-nationale.fr/referentiel",
  "uid": "AMANR5L15PO59046B0235P2D1N21",
  "identifiant": {
    "legislature": "15",
    "numero": "21",
    "numRect": "0",
    "saisine": {
      "refTexteLegislatif": "PRJLANR5L15B0235",
      "numeroPartiePLF": "2",
      "organeExamen": "PO59046",
      "mentionSecondeDeliberation": "0"
    }
  },
  "numeroLong": "II-DN21",
  "etapeTexte": "1ère lecture (1ère assemblée saisie)",
  "triAmendement": "zzs",
  "cardinaliteAmdtMultiples": "1",
  "amendementParent": {
    "@xmlns:xsi": "http://www.w3.org/2001/XMLSchema-instance",
    "@xsi:nil": "true"
  },
  "etat": "Discuté",
  "signataires": {
    "auteur": {
      "typeAuteur": "Depute",
      "acteurRef": "PA720846",
      "organeRef": {
        "@xmlns:xsi": "http://www.w3.org/2001/XMLSchema-instance",
        "@xsi:nil": "true"
      },
      "groupePolitiqueRef": "PO730958"
    },
    "cosignataires": {
      "acteurRef": [
        "PA719578",
        "PA719676",
        "PA718860",
        "PA2150",
        "PA721960",
        "PA721202",
        "PA721226",
        "PA720422",
        "PA721210",
        "PA720846",
        "PA722142",
        "PA720892",
        "PA588884",
        "PA721062",
        "PA718868",
        "PA720430",
        "PA720286"
      ]
    },
    "texteAffichable": "M.&#160;Lachaud,  Mme&#160;Autain, M.&#160;Bernalicis, M.&#160;Coquerel, M.&#160;Corbi&#232;re, Mme&#160;Fiat, M.&#160;Larive, M.&#160;M&#233;lenchon, Mme&#160;Obono, Mme&#160;Panot, M.&#160;Prud&apos;homme, M.&#160;Quatennens, M.&#160;Ratenon, Mme&#160;Ressiguier, Mme&#160;Rubin, M.&#160;Ruffin et Mme&#160;Taurine"
  },
  "pointeurFragmentTexte": {
    "missionVisee": {
      "idMissionAN": "11",
      "libelleMission": "Défense",
      "codeMissionPLF": "B",
      "libelleMissionPLF": "Répartition, par mission et programme, des crédits du budget général"
    },
    "division": {
      "titre": "Article 49",
      "articleDesignationCourte": "APRÈS ART. 49",
      "type": "ARTICLE",
      "avant_A_Apres": "Après",
      "divisionRattachee": "APRÈS L'ARTICLE 49, insérer l'article suivant:",
      "articleAdditionnel": "1",
      "chapitreAdditionnel": {
        "@xmlns:xsi": "http://www.w3.org/2001/XMLSchema-instance",
        "@xsi:nil": "true"
      },
      "urlDivisionTexteVise": "/15/textes/0235C.asp#D_Article_49"
    },
    "alinea": {
      "@xmlns:xsi": "http://www.w3.org/2001/XMLSchema-instance",
      "@xsi:nil": "true"
    }
  },
  "corps": {
    "dispositif": "<p>Apr&#232;s l&#8217;article 49, ins&#233;rer un article 49&#160;bis r&#233;dig&#233; ainsi :</p><p>&#171;&#160;I. Le Gouvernement remet au Parlement, dans un d&#233;lai de trois mois &#224; compter de la promulgation de la pr&#233;sente loi, un rapport d&#8217;information sur les surco&#251;ts induits par les retards et les malfa&#231;ons dans le d&#233;veloppement des grands projets informatiques et l'opportunit&#233; de l'internalisation de la comp&#233;tence.</p><p>II. Ce rapport &#233;valuera notamment les cons&#233;quences &#233;conomiques, financi&#232;res et strat&#233;giques du retard pris par les grands programmes informatiques. Il analysera &#233;galement l'opportunit&#233; d'internaliser la comp&#233;tence en faisant une analyse compar&#233;e des b&#233;n&#233;fices et risques, tant financiers que strat&#233;giques, du recours &#224; des prestataires, &#233;ventuellement &#233;trangers, et du recours &#224; des services internes.</p><p>III. Ce rapport sera produit par un groupe de travail compos&#233; de trois repr&#233;sentants de l&#8217;administration, &#224; savoir un repr&#233;sentant de l&#8217;Inspection g&#233;n&#233;rale des finances, un repr&#233;sentant de l&#8217;Inspection g&#233;n&#233;rale de l'administration, et un repr&#233;sentant du minist&#232;re des Arm&#233;es&#160;; ainsi que de trois repr&#233;sentants d'ETALAB&#160;&#187;</p>",
    "exposeSommaire": "<p>Cet amendement vise &#224; &#233;tablir un rapport d&#8217;information sur les surco&#251;ts induits par les retards et les malfa&#231;ons dans le d&#233;veloppement des grands projets informatiques et l'opportunit&#233; de l'internalisation de la comp&#233;tence.</p><p>La num&#233;risation est un enjeu majeur de la modernisation des arm&#233;es. L'&#233;chec grave qui a conduit &#224; l'abandon progressif du logiciel de traitement des soldes LOUVOIS remet en question le dogme du recours &#224; des prestataires priv&#233;s pour le d&#233;veloppement de grands projets informatiques tant les pertes ont &#233;t&#233; importantes pour le minist&#232;re.</p><p>Enfin l'&#233;valuation de l'opportunit&#233; de d&#233;velopper la comp&#233;tence en interne ne peut se borner &#224; mobiliser des indicateurs strictement financiers tant le recours aux prestataires externes et leurs insucc&#232;s comportent de risques de diff&#233;rentes natures.</p><p>Eclair&#233; par un tel rapport le Parlement serait alors fond&#233; &#224; d&#233;fendre lors de l'&#233;laboration de la prochaine loi de programmation militaire des propositions ambitieuses &#224; m&#234;me de doter la d&#233;fense d'un service informatique qui satisfasse les besoins dans des conditions de s&#233;curit&#233; optimales.</p><p>&#160;</p>",
    "annexeExposeSommaire": {
      "@xmlns:xsi": "http://www.w3.org/2001/XMLSchema-instance",
      "@xsi:nil": "true"
    }
  },
  "representations": {
    "representation": {
      "nom": "PDF",
      "typeMime": {
        "type": "application",
        "subType": "PDF"
      },
      "statutRepresentation": {
        "verbatim": "true",
        "canonique": "true",
        "officielle": "true",
        "transcription": "false",
        "enregistrement": "false"
      },
      "repSource": {
        "@xmlns:xsi": "http://www.w3.org/2001/XMLSchema-instance",
        "@xsi:nil": "true"
      },
      "offset": {
        "@xmlns:xsi": "http://www.w3.org/2001/XMLSchema-instance",
        "@xsi:nil": "true"
      },
      "contenu": {
        "documentURI": "/15/amendements/0235C/CION_TOUTE/DN21.pdf"
      },
      "dateDispoRepresentation": {
        "@xmlns:xsi": "http://www.w3.org/2001/XMLSchema-instance",
        "@xsi:nil": "true"
      }
    }
  },
  "seanceDiscussion": {
    "@xmlns:xsi": "http://www.w3.org/2001/XMLSchema-instance",
    "@xsi:nil": "true"
  },
  "sort": {
    "dateSaisie": "2017-11-03T00:40:15.000+01:00",
    "sortEnSeance": "Rejeté"
  },
  "dateDepot": "2017-10-27T02:00:00.000+02:00",
  "dateDistribution": "2017-10-31T01:00:00.000+01:00",
  "article99": "0",
  "loiReference": {
    "codeLoi": {
      "@xmlns:xsi": "http://www.w3.org/2001/XMLSchema-instance",
      "@xsi:nil": "true"
    },
    "divisionCodeLoi": {
      "@xmlns:xsi": "http://www.w3.org/2001/XMLSchema-instance",
      "@xsi:nil": "true"
    }
  }
}