{
  "@xmlns": "http://schemas.assemblee-nationale.fr/referentiel",
  "uid": "AMANR5L15PO59051B2357P0D1N55",
  "identifiant": {
    "legislature": "15",
    "numero": "55",
    "numRect": "0",
    "saisine": {
      "refTexteLegislatif": "PRJLANR5L15B2357",
      "numeroPartiePLF": "0",
      "organeExamen": "PO59051",
      "mentionSecondeDeliberation": "0"
    }
  },
  "numeroLong": "CL55",
  "etapeTexte": "1ère lecture (2ème assemblée saisie)",
  "triAmendement": "deaaaaaaaaaaaaaaaaaaaaaaaaaaaaaaaaaaaaaaaaaaaaaaaaf",
  "cardinaliteAmdtMultiples": "1",
  "amendementParent": {
    "@xmlns:xsi": "http://www.w3.org/2001/XMLSchema-instance",
    "@xsi:nil": "true"
  },
  "etat": "Discuté",
  "signataires": {
    "auteur": {
      "typeAuteur": "Depute",
      "acteurRef": "PA721410",
      "organeRef": {
        "@xmlns:xsi": "http://www.w3.org/2001/XMLSchema-instance",
        "@xsi:nil": "true"
      },
      "groupePolitiqueRef": "PO730934"
    },
    "cosignataires": {
      "acteurRef": [
        "PA718850",
        "PA267735",
        "PA721314",
        "PA346218",
        "PA721410",
        "PA267429",
        "PA336316",
        "PA340853",
        "PA330008",
        "PA718838",
        "PA267794",
        "PA642847"
      ]
    },
    "texteAffichable": "Mme&#160;Bonnivard,  Mme&#160;Tabarot, M.&#160;Leclerc, M.&#160;Masson, M.&#160;Cordier, M.&#160;Cinieri, M.&#160;Bouchet, M.&#160;Brun, M.&#160;Schellenberger, M.&#160;Bazin, M.&#160;de Ganay et M.&#160;Breton"
  },
  "pointeurFragmentTexte": {
    "missionVisee": {
      "@xmlns:xsi": "http://www.w3.org/2001/XMLSchema-instance",
      "@xsi:nil": "true"
    },
    "division": {
      "titre": "Article 11 quinquies",
      "articleDesignationCourte": "APRÈS ART. 11 QUINQUIES",
      "type": "ARTICLE",
      "avant_A_Apres": "Après",
      "divisionRattachee": "APRÈS L'ARTICLE 11 QUINQUIES, insérer l'article suivant:",
      "articleAdditionnel": "1",
      "chapitreAdditionnel": {
        "@xmlns:xsi": "http://www.w3.org/2001/XMLSchema-instance",
        "@xsi:nil": "true"
      },
      "urlDivisionTexteVise": "/15/textes/2357.asp#D_Article_11_quinquies"
    },
    "alinea": {
      "@xmlns:xsi": "http://www.w3.org/2001/XMLSchema-instance",
      "@xsi:nil": "true"
    }
  },
  "corps": {
    "dispositif": "<p style=\"text-align: justify;\">&#171;&#160;Le Gouvernement remet au Parlement, avant le&#160;1<sup>er</sup>&#160;septembre&#160;2020, un rapport sur la repr&#233;sentation des communes touristiques dans les instances de d&#233;cision des intercommunalit&#233;s.&#160;&#187;</p>",
    "exposeSommaire": "<p style=\"text-align: justify;\">Aujourd&#8217;hui, l&#8217;octroi des si&#232;ges de conseillers communautaires dans les instances intercommunales est bas&#233; sur la population municipale qui ne prend pas en compte la population touristique.</p><p>Les communes touristiques ne sont d&#232;s lors que tr&#232;s faiblement repr&#233;sent&#233;es &#224; l&#8217;&#233;chelle intercommunale malgr&#233; leur abondement financier parfois largement majoritaire. Leurs &#233;lus perdent alors la maitrise de projets et politiques impactant directement le d&#233;veloppement &#233;conomique de leurs communes et, de ce fait, sa capacit&#233; &#224; g&#233;n&#233;rer des retomb&#233;es (emplois, richesses&#8230;) pour l&#8217;ensemble du territoire.</p><p>Afin que les enjeux touristiques soient mieux int&#233;gr&#233;s dans l&#8217;ensemble des d&#233;cisions prises &#224; l&#8217;&#233;chelle intercommunale, il pourrait &#234;tre pertinent de prendre en compte la population &#171;&#160;DGF&#160;&#187; au lieu de la population municipale pour la r&#233;partition des si&#232;ges.</p><p>Dans l&#8217;objectif de disposer d&#8217;une &#233;valuation de la situation actuelle et de d&#233;finir des mesures d&#8217;am&#233;lioration, il est donc propos&#233; que le Gouvernement remette au Parlement un rapport sur la repr&#233;sentation des communes touristiques dans les instances de d&#233;cision des intercommunalit&#233;s.</p>",
    "annexeExposeSommaire": {
      "@xmlns:xsi": "http://www.w3.org/2001/XMLSchema-instance",
      "@xsi:nil": "true"
    },
    "cartoucheDelaiDepotDepasse": {
      "@xmlns:xsi": "http://www.w3.org/2001/XMLSchema-instance",
      "@xsi:nil": "true"
    },
    "avantAppel": {
      "@xmlns:xsi": "http://www.w3.org/2001/XMLSchema-instance",
      "@xsi:nil": "true"
    }
  },
  "representations": {
    "representation": {
      "nom": "PDF",
      "typeMime": {
        "type": "application",
        "subType": "PDF"
      },
      "statutRepresentation": {
        "verbatim": "true",
        "canonique": "true",
        "officielle": "true",
        "transcription": "false",
        "enregistrement": "false"
      },
      "repSource": {
        "@xmlns:xsi": "http://www.w3.org/2001/XMLSchema-instance",
        "@xsi:nil": "true"
      },
      "offset": {
        "@xmlns:xsi": "http://www.w3.org/2001/XMLSchema-instance",
        "@xsi:nil": "true"
      },
      "contenu": {
        "documentURI": "/15/amendements/2357/CION_LOIS/CL55.pdf"
      },
      "dateDispoRepresentation": {
        "@xmlns:xsi": "http://www.w3.org/2001/XMLSchema-instance",
        "@xsi:nil": "true"
      }
    }
  },
  "seanceDiscussion": {
    "@xmlns:xsi": "http://www.w3.org/2001/XMLSchema-instance",
    "@xsi:nil": "true"
  },
  "sort": {
    "dateSaisie": "2019-11-07T12:13:44.000+01:00",
    "sortEnSeance": "Rejeté"
  },
  "dateDepot": "2019-10-28T01:00:00.000+01:00",
  "dateDistribution": "2019-11-05T01:00:00.000+01:00",
  "article99": "0",
  "loiReference": {
    "codeLoi": "zzzz",
    "divisionCodeLoi": "id"
  }
}