{
  "@xmlns": "http://schemas.assemblee-nationale.fr/referentiel",
  "uid": "AMANR5L15SEA717460BTC0369P0D1N269",
  "identifiant": {
    "legislature": "15",
    "numero": "269",
    "numRect": "0",
    "saisine": {
      "refTexteLegislatif": "PRJLANR5L15BTC0369",
      "numeroPartiePLF": "0",
      "organeExamen": "PO717460",
      "mentionSecondeDeliberation": "0"
    }
  },
  "numeroLong": "269",
  "etapeTexte": "1ère lecture (1ère assemblée saisie)",
  "triAmendement": "ad",
  "cardinaliteAmdtMultiples": "1",
  "amendementParent": {
    "@xmlns:xsi": "http://www.w3.org/2001/XMLSchema-instance",
    "@xsi:nil": "true"
  },
  "etat": "Irrecevable",
  "signataires": {
    "auteur": {
      "typeAuteur": "Depute",
      "acteurRef": "PA721062",
      "organeRef": {
        "@xmlns:xsi": "http://www.w3.org/2001/XMLSchema-instance",
        "@xsi:nil": "true"
      },
      "groupePolitiqueRef": "PO730958"
    },
    "cosignataires": {
      "acteurRef": [
        "PA722142",
        "PA721226",
        "PA719676",
        "PA718868",
        "PA2150",
        "PA720286",
        "PA720892",
        "PA721960",
        "PA721210",
        "PA721202",
        "PA720846",
        "PA588884",
        "PA718860",
        "PA720430",
        "PA719578",
        "PA720422",
        "PA721062"
      ]
    },
    "texteAffichable": "M.&#160;Ratenon,  Mme&#160;Autain, M.&#160;Bernalicis, M.&#160;Coquerel, M.&#160;Corbi&#232;re, Mme&#160;Fiat, M.&#160;Lachaud, M.&#160;Larive, M.&#160;M&#233;lenchon, Mme&#160;Obono, Mme&#160;Panot, M.&#160;Prud&apos;homme, M.&#160;Quatennens, Mme&#160;Ressiguier, Mme&#160;Rubin, M.&#160;Ruffin et Mme&#160;Taurine"
  },
  "pointeurFragmentTexte": {
    "missionVisee": {
      "@xmlns:xsi": "http://www.w3.org/2001/XMLSchema-instance",
      "@xsi:nil": "true"
    },
    "division": {
      "titre": "Article 6",
      "articleDesignationCourte": "APRÈS ART. 6",
      "type": "ARTICLE",
      "avant_A_Apres": "Après",
      "divisionRattachee": "APRÈS L'ARTICLE 6, insérer l'article suivant:",
      "articleAdditionnel": "1",
      "chapitreAdditionnel": {
        "@xmlns:xsi": "http://www.w3.org/2001/XMLSchema-instance",
        "@xsi:nil": "true"
      },
      "urlDivisionTexteVise": "/15/textes/0369.asp#D_Article_6"
    },
    "alinea": {
      "@xmlns:xsi": "http://www.w3.org/2001/XMLSchema-instance",
      "@xsi:nil": "true"
    }
  },
  "corps": {
    "dispositif": "<p style=\"text-align: justify;\">I.&#160;&#8211;&#160;L&#8217;article L.&#160;331&#8209;8 du code de la s&#233;curit&#233; sociale est ainsi r&#233;dig&#233;&#160;:</p><p style=\"text-align: justify;\">&#171;&#160;<i>Art. L. 331-8.</i>&#160;&#8211;&#160;Lorsqu&#8217;il exerce son droit &#224; cong&#233; pr&#233;vu &#224; l&#8217;article L.&#160;1225&#8209;35 du code du travail et dans un d&#233;lai fix&#233; par d&#233;cret, l&#8217;assur&#233; re&#231;oit, pendant une dur&#233;e maximale de six semaines et dans les m&#234;mes conditions d&#8217;ouverture de droit, de liquidation et de service, l&#8217;indemnit&#233; journali&#232;re vis&#233;e &#224; l&#8217;article L.&#160;331&#8209;3, sous r&#233;serve de cesser toute activit&#233; salari&#233;e ou assimil&#233;e.</p><p style=\"text-align: justify;\">&#171;&#160;L&#8217;indemnit&#233; journali&#232;re n&#8217;est pas cumulable avec l&#8217;indemnisation des cong&#233;s maladie et d&#8217;accident du travail, ni avec l&#8217;indemnisation par l&#8217;assurance ch&#244;mage ou le r&#233;gime de solidarit&#233;.</p><p style=\"text-align: justify;\">&#171;&#160;Un d&#233;cret fixe les modalit&#233;s d&#8217;application du pr&#233;sent article.&#160;&#187;</p><p style=\"text-align: justify;\">II.&#160;&#8211;&#160;La perte de recettes pour les organismes de s&#233;curit&#233; sociale est compens&#233;e &#224; due concurrence par la majoration des droits mentionn&#233;s aux articles 575 et 575 A du code g&#233;n&#233;ral des imp&#244;ts.</p>",
    "exposeSommaire": "<p style=\"text-align: justify;\">Il n&#8217;est pas question de r&#233;server aux seules familles ais&#233;es la possibilit&#233; d&#8217;accueillir dignement et de fa&#231;on &#233;gale un enfant dans un foyer.</p><p style=\"text-align: justify;\">Il s&#8217;av&#232;re donc n&#233;cessaire de faire en sorte que les coparents puissent voir maintenue leur r&#233;mun&#233;ration pendant toute la dur&#233;e du cong&#233; d&#8217;accueil.</p><p style=\"text-align: justify;\">Cette disposition permettra en outre d&#8217;encourager les p&#232;res &#224; prendre ces cong&#233;s, et aura un v&#233;ritable effet pour l&#8217;&#233;tablissement de l&#8217;&#233;galit&#233; salariale. En effet, si la France est un des pays en&#160;Europe, avec l&#8217;Espagne, qui donne le plus de temps de cong&#233;s &#224; la m&#232;re, en revanche le tr&#232;s court temps du cong&#233; paternel cr&#233;e de fait une situation tr&#232;s in&#233;galitaire. Contrairement au Portugal (o&#249; le cong&#233; additionnel peut &#234;tre pris par les deux parents et o&#249; le p&#232;re est oblig&#233; de prendre au moins la moiti&#233; de son cong&#233; paternit&#233;), &#224; la Belgique ou&#160;&#224; la Su&#232;de qui ont pens&#233; une organisation de l&#8217;accueil de l&#8217;enfant de mani&#232;re &#224; privil&#233;gier l&#8217;&#233;galit&#233; salariale entre les femmes et les hommes.</p><p style=\"text-align: justify;\">Pour 47&#160;% des femmes cadres, le fait d&#8217;avoir un enfant est l&#8217;&#233;v&#233;nement qui bouleverse le plus le cours d&#8217;une carri&#232;re et qui a un impact sur leur &#233;volution professionnelle. Ceci loin devant un changement de poste choisi (18&#160;%) ou subi (16&#160;%). Tandis que du c&#244;t&#233; des hommes cadres, leur carri&#232;re est d&#8217;abord perturb&#233;e par un changement de poste subi (32&#160;%), un licenciement ou une mobilit&#233; forc&#233;e et seulement 25&#160;% qui mettent en avant la paternit&#233;.</p><p style=\"text-align: justify;\">Enfin, seulement 4&#160;% des cong&#233;s parentaux pour s&#8217;occuper des enfants sont pris par des hommes.</p>",
    "annexeExposeSommaire": {
      "@xmlns:xsi": "http://www.w3.org/2001/XMLSchema-instance",
      "@xsi:nil": "true"
    }
  },
  "representations": {
    "representation": {
      "nom": "PDF",
      "typeMime": {
        "type": "application",
        "subType": "PDF"
      },
      "statutRepresentation": {
        "verbatim": "true",
        "canonique": "true",
        "officielle": "true",
        "transcription": "false",
        "enregistrement": "false"
      },
      "repSource": {
        "@xmlns:xsi": "http://www.w3.org/2001/XMLSchema-instance",
        "@xsi:nil": "true"
      },
      "offset": {
        "@xmlns:xsi": "http://www.w3.org/2001/XMLSchema-instance",
        "@xsi:nil": "true"
      },
      "contenu": {
        "documentURI": "/15/amendements/0369/AN/269.pdf"
      },
      "dateDispoRepresentation": {
        "@xmlns:xsi": "http://www.w3.org/2001/XMLSchema-instance",
        "@xsi:nil": "true"
      }
    }
  },
  "seanceDiscussion": {
    "@xmlns:xsi": "http://www.w3.org/2001/XMLSchema-instance",
    "@xsi:nil": "true"
  },
  "sort": {
    "@xmlns:xsi": "http://www.w3.org/2001/XMLSchema-instance",
    "@xsi:nil": "true"
  },
  "dateDepot": "2017-11-17T01:00:00.000+01:00",
  "dateDistribution": {
    "@xmlns:xsi": "http://www.w3.org/2001/XMLSchema-instance",
    "@xsi:nil": "true"
  },
  "article99": "0",
  "loiReference": {
    "codeLoi": "c sécurité sociale",
    "divisionCodeLoi": "L331-8"
  }
}