{
  "@xmlns": "http://schemas.assemblee-nationale.fr/referentiel",
  "uid": "AMANR5L15SEA717460B0269P0D1N1028",
  "identifiant": {
    "legislature": "15",
    "numero": "1028",
    "numRect": "0",
    "saisine": {
      "refTexteLegislatif": "PRJLANR5L15B0269",
      "numeroPartiePLF": "0",
      "organeExamen": "PO717460",
      "mentionSecondeDeliberation": "0"
    }
  },
  "numeroLong": "1028",
  "etapeTexte": "1ère lecture (1ère assemblée saisie)",
  "triAmendement": "zo",
  "cardinaliteAmdtMultiples": "1",
  "amendementParent": {
    "@xmlns:xsi": "http://www.w3.org/2001/XMLSchema-instance",
    "@xsi:nil": "true"
  },
  "etat": "Irrecevable",
  "signataires": {
    "auteur": {
      "typeAuteur": "Depute",
      "acteurRef": "PA610654",
      "organeRef": {
        "@xmlns:xsi": "http://www.w3.org/2001/XMLSchema-instance",
        "@xsi:nil": "true"
      },
      "groupePolitiqueRef": "PO730940"
    },
    "cosignataires": {
      "acteurRef": [
        "PA610654",
        "PA267306",
        "PA720692",
        "PA721896",
        "PA722202",
        "PA721270",
        "PA718926",
        "PA441",
        "PA335612",
        "PA720546",
        "PA689",
        "PA610634",
        "PA610667",
        "PA721118",
        "PA722110",
        "PA718720"
      ]
    },
    "texteAffichable": "M.&#160;Nilor,  M.&#160;Azerot, Mme&#160;Bello, M.&#160;Brotherson, M.&#160;Bruneel, Mme&#160;Buffet, M.&#160;Chassaigne, M.&#160;Dharr&#233;ville, M.&#160;Dufr&#232;gne, Mme&#160;Faucillon, M.&#160;Jumel, M.&#160;Lecoq, M.&#160;Peu, M.&#160;Fabien&#160;Roussel, M.&#160;Serville et M.&#160;Wulfranc"
  },
  "pointeurFragmentTexte": {
    "missionVisee": {
      "@xmlns:xsi": "http://www.w3.org/2001/XMLSchema-instance",
      "@xsi:nil": "true"
    },
    "division": {
      "titre": "Article 35",
      "articleDesignationCourte": "APRÈS ART. 35",
      "type": "ARTICLE",
      "avant_A_Apres": "Après",
      "divisionRattachee": "APRÈS L'ARTICLE 35, insérer l'article suivant:",
      "articleAdditionnel": "1",
      "chapitreAdditionnel": {
        "@xmlns:xsi": "http://www.w3.org/2001/XMLSchema-instance",
        "@xsi:nil": "true"
      },
      "urlDivisionTexteVise": "/15/textes/0269.asp#D_Article_35"
    },
    "alinea": {
      "@xmlns:xsi": "http://www.w3.org/2001/XMLSchema-instance",
      "@xsi:nil": "true"
    }
  },
  "corps": {
    "dispositif": "<p style=\"text-align: justify;\">Dans les six mois &#224; compter de la promulgation de la pr&#233;sente loi, le Gouvernement remet au Parlement un rapport sur la possibilit&#233; d&#8217;effectuer des essais cliniques sur le m&#233;dicament HeberProt-P, con&#231;u dans les laboratoires cubains, dans le traitement de l&#8217;ulc&#232;re du pied diab&#233;tique.</p>",
    "exposeSommaire": "<p style=\"text-align: justify;\">Le nombre de personnes touch&#233;es par le diab&#232;te est malheureusement en constante &#233;volution en France, la population d&#8217;outremers &#233;tant encore davantage concern&#233;e.</p><p style=\"text-align: justify;\">En effet, si la pr&#233;valence du diab&#232;te atteignait 4,4&#160;% de la population sur le territoire fran&#231;ais en 2009, cette derni&#232;re atteignait 8,8&#160;% de la population &#224; la R&#233;union, 8,1&#160;% de la population en Guadeloupe, 7,4&#160;% de la population en Martinique et 7,3&#160;% de la population en Guyane.</p><p style=\"text-align: justify;\">En Martinique, le diab&#232;te a de ce fait, &#233;t&#233; identifi&#233; comme &#233;tant une des priorit&#233;s de sant&#233; publique inscrite au c&#339;ur du plan strat&#233;gique r&#233;gional de sant&#233; 2011&#8209;2015 de l&#8217;ARS (Agence r&#233;gionale de sant&#233;).</p><p style=\"text-align: justify;\">Maladie difficilement traitable et r&#233;cidivante, le diab&#232;te a &#233;t&#233; reconnu comme &#233;tant la deuxi&#232;me cause d&#8217;amputation.</p><p style=\"text-align: justify;\">Or, cette solution &#224; la fois extr&#234;me voire traumatisante pour le patient et co&#251;teuse, le co&#251;t moyen s&#8217;&#233;levant approximativement &#224; 64 000&#160;euros, pourrait &#234;tre &#233;vit&#233;e gr&#226;ce au m&#233;dicament HeberProt-P.</p><p style=\"text-align: justify;\">Mis au point par des chercheurs cubains, ce m&#233;dicament permet d&#8217;&#233;viter de fa&#231;on spectaculaire les amputations li&#233;es &#224; l&#8217;ulc&#232;re du pied diab&#233;tique.</p><p style=\"text-align: justify;\">Ce traitement a aujourd&#8217;hui fait ses preuves &#224; l&#8217;&#233;chelle mondiale puisque, pr&#232;s de 220&#160;000 personnes dans le monde ont d&#233;j&#224; b&#233;n&#233;fici&#233; des bienfaits de ce m&#233;dicament brevet&#233; dans plus de 30 pays dont 14 de l&#8217;Union&#160;europ&#233;enne.</p><p style=\"text-align: justify;\">En outre, aucune alternative viable n&#8217;ayant &#233;t&#233; pr&#233;sent&#233;e &#224; ce jour en France, et compte-tenu de la pr&#233;valence observ&#233;e en Martinique, la voie de l&#8217;exp&#233;rimentation appara&#238;t comme une &#233;vidence.</p>",
    "annexeExposeSommaire": {
      "@xmlns:xsi": "http://www.w3.org/2001/XMLSchema-instance",
      "@xsi:nil": "true"
    }
  },
  "representations": {
    "representation": {
      "nom": "PDF",
      "typeMime": {
        "type": "application",
        "subType": "PDF"
      },
      "statutRepresentation": {
        "verbatim": "true",
        "canonique": "true",
        "officielle": "true",
        "transcription": "false",
        "enregistrement": "false"
      },
      "repSource": {
        "@xmlns:xsi": "http://www.w3.org/2001/XMLSchema-instance",
        "@xsi:nil": "true"
      },
      "offset": {
        "@xmlns:xsi": "http://www.w3.org/2001/XMLSchema-instance",
        "@xsi:nil": "true"
      },
      "contenu": {
        "documentURI": "/15/amendements/0269/AN/1028.pdf"
      },
      "dateDispoRepresentation": {
        "@xmlns:xsi": "http://www.w3.org/2001/XMLSchema-instance",
        "@xsi:nil": "true"
      }
    }
  },
  "seanceDiscussion": {
    "@xmlns:xsi": "http://www.w3.org/2001/XMLSchema-instance",
    "@xsi:nil": "true"
  },
  "sort": {
    "@xmlns:xsi": "http://www.w3.org/2001/XMLSchema-instance",
    "@xsi:nil": "true"
  },
  "dateDepot": "2017-10-20T02:00:00.000+02:00",
  "dateDistribution": {
    "@xmlns:xsi": "http://www.w3.org/2001/XMLSchema-instance",
    "@xsi:nil": "true"
  },
  "article99": "0",
  "loiReference": {
    "codeLoi": {
      "@xmlns:xsi": "http://www.w3.org/2001/XMLSchema-instance",
      "@xsi:nil": "true"
    },
    "divisionCodeLoi": {
      "@xmlns:xsi": "http://www.w3.org/2001/XMLSchema-instance",
      "@xsi:nil": "true"
    }
  }
}