{
  "@xmlns": "http://schemas.assemblee-nationale.fr/referentiel",
  "uid": "AMANR5L15PO59048B0269P0D1N17",
  "identifiant": {
    "legislature": "15",
    "numero": "17",
    "numRect": "0",
    "saisine": {
      "refTexteLegislatif": "PRJLANR5L15B0269",
      "numeroPartiePLF": "0",
      "organeExamen": "PO59048",
      "mentionSecondeDeliberation": "0"
    }
  },
  "numeroLong": "CF17",
  "etapeTexte": "1ère lecture (1ère assemblée saisie)",
  "triAmendement": "i",
  "cardinaliteAmdtMultiples": "1",
  "amendementParent": {
    "@xmlns:xsi": "http://www.w3.org/2001/XMLSchema-instance",
    "@xsi:nil": "true"
  },
  "etat": "Irrecevable",
  "signataires": {
    "auteur": {
      "typeAuteur": "Depute",
      "acteurRef": "PA608416",
      "organeRef": {
        "@xmlns:xsi": "http://www.w3.org/2001/XMLSchema-instance",
        "@xsi:nil": "true"
      },
      "groupePolitiqueRef": "PO730934"
    },
    "cosignataires": {
      "acteurRef": "PA608416"
    },
    "texteAffichable": "M.&#160;Hetzel"
  },
  "pointeurFragmentTexte": {
    "missionVisee": {
      "@xmlns:xsi": "http://www.w3.org/2001/XMLSchema-instance",
      "@xsi:nil": "true"
    },
    "division": {
      "titre": "Article 18",
      "articleDesignationCourte": "APRÈS ART. 18",
      "type": "ARTICLE",
      "avant_A_Apres": "Après",
      "divisionRattachee": "APRÈS L'ARTICLE 18, insérer l'article suivant:",
      "articleAdditionnel": "1",
      "chapitreAdditionnel": {
        "@xmlns:xsi": "http://www.w3.org/2001/XMLSchema-instance",
        "@xsi:nil": "true"
      },
      "urlDivisionTexteVise": "/15/textes/0269.asp#D_Article_18"
    },
    "alinea": {
      "@xmlns:xsi": "http://www.w3.org/2001/XMLSchema-instance",
      "@xsi:nil": "true"
    }
  },
  "corps": {
    "dispositif": "<p>I.- Apr&#232;s l&#8217;article 18, ins&#233;rer un nouvel article ainsi r&#233;dig&#233;&#160;:</p><p>&#160;&#171;&#160;Le IX du point VI de l&#8217;article 34 de la loi n&#176; 2016-1827 du&#160;23 d&#233;cembre 2016&#160;de financement de la s&#233;curit&#233; sociale pour 2017, modifiant le&#160;V de l&#8217;article 9 de la loi&#160;n&#176;&#160;2013-1203 du&#160;23 d&#233;cembre&#160;2013 de financement de la s&#233;curit&#233; sociale, est abrog&#233;&#160;&#187;.</p><p>II.- Les tableaux d&#8217;&#233;quilibre figurant aux articles 20 et 21 et en annexe C sont modifi&#233;s en cons&#233;quence.</p><p>III.- Les pertes de recettes pour les organismes de s&#233;curit&#233; sociale sont compens&#233;es &#224; due concurrence par la cr&#233;ation d&#8217;une taxe additionnelle aux droits vis&#233;s aux articles 575 et 575 A du code g&#233;n&#233;ral des imp&#244;ts.</p>",
    "exposeSommaire": "<p>La loi n&#176; 2016-1827 du 23 d&#233;cembre 2016 de financement de la s&#233;curit&#233; sociale pour 2017 pr&#233;voit dans son article 34 un transfert progressif - d&#8217;ici le 31 d&#233;cembre 2019 - du financement du minimum contributif par le FSV vers les branches vieillesse des r&#233;gimes align&#233;s et notamment vers la branche vieillesse du r&#233;gime g&#233;n&#233;ral (CNAV).</p><p>Or, cette mesure de transfert du financement du minimum contributif du FSV vers la CNAV constitue un tour de passe-passe qui, &#224; terme, revient &#224; faire financer par les salari&#233;s et les entreprises un dispositif de solidarit&#233;.</p><p>Par ailleurs, cette mesure brouille la ligne de partage entre prestations de solidarit&#233; et prestations contributives que le FSV cr&#233;&#233; en 1993 a le grand m&#233;rite de d&#233;finir. Pour m&#233;moire, le minimum contributif est financ&#233; depuis 2011 par le FSV car il constitue bien en majeure partie une mesure de solidarit&#233;. Il s&#8217;agit d&#8217;une majoration de pension visant &#224; permettre &#224; l'assur&#233; qui a cotis&#233; tout au long de sa carri&#232;re sur un salaire faible de b&#233;n&#233;ficier d&#8217;un montant de pension minimum.</p><p>Aussi, et dans ce contexte, il n&#8217;apparait pas opportun de revenir sur la disposition pr&#233;vue par la loi de financement de la s&#233;curit&#233; sociale pour 2015 qui a pr&#233;vu les conditions de prise en charge du minimum contributif par le FSV&#160;: depuis le 1er janvier 2016, le FSV finance les r&#233;gimes &#224; hauteur d&#8217;une fraction de son co&#251;t r&#233;el, fix&#233;e par d&#233;cret, qui ne pourra &#234;tre inf&#233;rieure &#224; 50 %.</p><p>&#160;</p><p>&#160;</p>",
    "annexeExposeSommaire": {
      "@xmlns:xsi": "http://www.w3.org/2001/XMLSchema-instance",
      "@xsi:nil": "true"
    }
  },
  "representations": {
    "representation": {
      "nom": "PDF",
      "typeMime": {
        "type": "application",
        "subType": "PDF"
      },
      "statutRepresentation": {
        "verbatim": "true",
        "canonique": "true",
        "officielle": "true",
        "transcription": "false",
        "enregistrement": "false"
      },
      "repSource": {
        "@xmlns:xsi": "http://www.w3.org/2001/XMLSchema-instance",
        "@xsi:nil": "true"
      },
      "offset": {
        "@xmlns:xsi": "http://www.w3.org/2001/XMLSchema-instance",
        "@xsi:nil": "true"
      },
      "contenu": {
        "documentURI": "/15/amendements/0269/CION_FIN/CF17.pdf"
      },
      "dateDispoRepresentation": {
        "@xmlns:xsi": "http://www.w3.org/2001/XMLSchema-instance",
        "@xsi:nil": "true"
      }
    }
  },
  "seanceDiscussion": {
    "@xmlns:xsi": "http://www.w3.org/2001/XMLSchema-instance",
    "@xsi:nil": "true"
  },
  "sort": {
    "@xmlns:xsi": "http://www.w3.org/2001/XMLSchema-instance",
    "@xsi:nil": "true"
  },
  "dateDepot": "2017-10-13T02:00:00.000+02:00",
  "dateDistribution": {
    "@xmlns:xsi": "http://www.w3.org/2001/XMLSchema-instance",
    "@xsi:nil": "true"
  },
  "article99": "0",
  "loiReference": {
    "codeLoi": {
      "@xmlns:xsi": "http://www.w3.org/2001/XMLSchema-instance",
      "@xsi:nil": "true"
    },
    "divisionCodeLoi": {
      "@xmlns:xsi": "http://www.w3.org/2001/XMLSchema-instance",
      "@xsi:nil": "true"
    }
  }
}