{
  "@xmlns": "http://schemas.assemblee-nationale.fr/referentiel",
  "uid": "AMANR5L15PO419865B2135P0D1N376",
  "identifiant": {
    "legislature": "15",
    "numero": "376",
    "numRect": "0",
    "saisine": {
      "refTexteLegislatif": "PRJLANR5L15B2135",
      "numeroPartiePLF": "0",
      "organeExamen": "PO419865",
      "mentionSecondeDeliberation": "0"
    }
  },
  "numeroLong": "CD376",
  "etapeTexte": "Nouvelle Lecture",
  "triAmendement": "adiaaaaaaaaaaaaaaaaaaaaaaaaaaaaaaaaaaaaaaaaaaaaaaaddh",
  "cardinaliteAmdtMultiples": "1",
  "amendementParent": {
    "@xmlns:xsi": "http://www.w3.org/2001/XMLSchema-instance",
    "@xsi:nil": "true"
  },
  "etat": "Discuté",
  "signataires": {
    "auteur": {
      "typeAuteur": "Depute",
      "acteurRef": "PA609590",
      "organeRef": {
        "@xmlns:xsi": "http://www.w3.org/2001/XMLSchema-instance",
        "@xsi:nil": "true"
      },
      "groupePolitiqueRef": "PO758835"
    },
    "cosignataires": {
      "acteurRef": [
        "PA608741",
        "PA333818",
        "PA1809",
        "PA719930",
        "PA340343",
        "PA335054",
        "PA608011",
        "PA610681",
        "PA429893",
        "PA643145",
        "PA342415",
        "PA1198",
        "PA1008",
        "PA607553",
        "PA1592",
        "PA508",
        "PA337483",
        "PA609332",
        "PA333285",
        "PA332614",
        "PA605069",
        "PA642764",
        "PA609590",
        "PA608172",
        "PA608695",
        "PA335532",
        "PA267233",
        "PA340357",
        "PA720988"
      ]
    },
    "texteAffichable": "Mme&#160;Rabault,  M.&#160;Bouillon, M.&#160;Garot, Mme&#160;Bi&#233;mouret, M.&#160;Aviragnet, Mme&#160;Bareigts, Mme&#160;Battistel, M.&#160;Jean-Louis&#160;Bricout, M.&#160;Carvounas, M.&#160;Alain&#160;David, Mme&#160;Laurence&#160;Dumont, M.&#160;Faure, M.&#160;David&#160;Habib, M.&#160;Hutin, M.&#160;Juanico, Mme&#160;Karamanli, M.&#160;J&#233;r&#244;me&#160;Lambert, M.&#160;Letchimy, Mme&#160;Manin, Mme&#160;Pau-Langevin, Mme&#160;Pires Beaune, M.&#160;Potier, M.&#160;Pueyo, M.&#160;Saulignac, Mme&#160;Tolmont, Mme&#160;Untermaier, Mme&#160;Vainqueur-Christophe, M.&#160;Vallaud, Mme&#160;Victory et les membres du groupe Socialistes et apparent&#233;s"
  },
  "pointeurFragmentTexte": {
    "missionVisee": {
      "@xmlns:xsi": "http://www.w3.org/2001/XMLSchema-instance",
      "@xsi:nil": "true"
    },
    "division": {
      "titre": "Article PREMIER",
      "articleDesignationCourte": "ART. PREMIER",
      "type": "ARTICLE",
      "avant_A_Apres": "A",
      "divisionRattachee": "ARTICLE PREMIER",
      "articleAdditionnel": {
        "@xmlns:xsi": "http://www.w3.org/2001/XMLSchema-instance",
        "@xsi:nil": "true"
      },
      "chapitreAdditionnel": {
        "@xmlns:xsi": "http://www.w3.org/2001/XMLSchema-instance",
        "@xsi:nil": "true"
      },
      "urlDivisionTexteVise": "/15/textes/2135.asp#D_Article_1er"
    },
    "alinea": {
      "avant_A_Apres": {
        "@xmlns:xsi": "http://www.w3.org/2001/XMLSchema-instance",
        "@xsi:nil": "true"
      },
      "numero": "18",
      "alineaDesignation": {
        "@xmlns:xsi": "http://www.w3.org/2001/XMLSchema-instance",
        "@xsi:nil": "true"
      }
    }
  },
  "corps": {
    "dispositif": "<p>I.&#160;&#8211;&#160;&#192; l&#8217;alin&#233;a&#160;18, apr&#232;s la seconde occurrence du mot&#160;:</p><p style=\"text-align: justify;\">&#171;&#160;commune&#160;&#187;,</p><p style=\"text-align: justify;\">ins&#233;rer les mots&#160;:</p><p style=\"text-align: justify;\">&#171;&#160;, apr&#232;s accord de la r&#233;gion&#160;&#187;.</p><p style=\"text-align: justify;\">II.&#160;&#8211;&#160;En cons&#233;quence, &#224; la fin du m&#234;me alin&#233;a, substituer aux mots&#160;:</p><p style=\"text-align: justify;\">&#171;&#160;la r&#233;gion&#160;&#187;</p><p style=\"text-align: justify;\">les mots&#160;:</p><p style=\"text-align: justify;\">&#171;&#160;celle-ci&#160;&#187;.</p>",
    "exposeSommaire": "<p>Il est apparu lors de l&#8217;examen du texte que la reprise des services r&#233;gionaux internes &#224; une nouvelle AOM, sans que celle-ci en assume l&#8217;ensemble, pourrait conduire &#224; &#171;&#160;&#233;mietter&#160;&#187; la comp&#233;tence, la commande publique, et cr&#233;er une certaine confusion entre les niveaux de responsabilit&#233;s.</p><p style=\"text-align: justify;\">Le pr&#233;sent amendement conserve la clarification apport&#233;e par le rapporteur en vue d&#8217;un transfert en bloc des services r&#233;gionaux scolaires, r&#233;guliers et &#224; la demande. Il introduit un m&#233;canisme compl&#233;mentaire en proposant que la prise de comp&#233;tence en mati&#232;re d&#8217;organisation de la mobilit&#233; par les communaut&#233;s de communes s&#8217;effectue apr&#232;s accord de la r&#233;gion. Ainsi, les deux collectivit&#233;s concern&#233;es, la nouvelle AOM et la r&#233;gion, peuvent d&#233;finir la meilleure organisation des services sur le terrain&#160;: soit un transfert en bloc de la comp&#233;tence, soit la mise en &#339;uvre d&#8217;une d&#233;l&#233;gation op&#233;rationnelle de la r&#233;gion vers l&#8217;AOM.</p><p style=\"text-align: justify;\">Cet amendement permet le transfert des services aff&#233;rents dans le cadre d&#8217;un accord conjoint, tout en conservant une architecture claire et &#233;vite ainsi tout risque de fragmentation de la comp&#233;tence mobilit&#233;.</p>",
    "annexeExposeSommaire": {
      "@xmlns:xsi": "http://www.w3.org/2001/XMLSchema-instance",
      "@xsi:nil": "true"
    },
    "cartoucheDelaiDepotDepasse": {
      "@xmlns:xsi": "http://www.w3.org/2001/XMLSchema-instance",
      "@xsi:nil": "true"
    },
    "avantAppel": {
      "@xmlns:xsi": "http://www.w3.org/2001/XMLSchema-instance",
      "@xsi:nil": "true"
    }
  },
  "representations": {
    "representation": {
      "nom": "PDF",
      "typeMime": {
        "type": "application",
        "subType": "PDF"
      },
      "statutRepresentation": {
        "verbatim": "true",
        "canonique": "true",
        "officielle": "true",
        "transcription": "false",
        "enregistrement": "false"
      },
      "repSource": {
        "@xmlns:xsi": "http://www.w3.org/2001/XMLSchema-instance",
        "@xsi:nil": "true"
      },
      "offset": {
        "@xmlns:xsi": "http://www.w3.org/2001/XMLSchema-instance",
        "@xsi:nil": "true"
      },
      "contenu": {
        "documentURI": "/15/amendements/2135/CION-DVP/CD376.pdf"
      },
      "dateDispoRepresentation": {
        "@xmlns:xsi": "http://www.w3.org/2001/XMLSchema-instance",
        "@xsi:nil": "true"
      }
    }
  },
  "seanceDiscussion": {
    "@xmlns:xsi": "http://www.w3.org/2001/XMLSchema-instance",
    "@xsi:nil": "true"
  },
  "sort": {
    "dateSaisie": "2019-09-02T17:35:37.000+02:00",
    "sortEnSeance": "Rejeté"
  },
  "dateDepot": "2019-08-27T02:00:00.000+02:00",
  "dateDistribution": "2019-08-31T02:00:00.000+02:00",
  "article99": "0",
  "loiReference": {
    "codeLoi": {
      "@xmlns:xsi": "http://www.w3.org/2001/XMLSchema-instance",
      "@xsi:nil": "true"
    },
    "divisionCodeLoi": {
      "@xmlns:xsi": "http://www.w3.org/2001/XMLSchema-instance",
      "@xsi:nil": "true"
    }
  }
}