{
  "@xmlns": "http://schemas.assemblee-nationale.fr/referentiel",
  "uid": "AMANR5L15SEA717460BTC1237P0D1N36",
  "identifiant": {
    "legislature": "15",
    "numero": "36",
    "numRect": "0",
    "saisine": {
      "refTexteLegislatif": "PRJLANR5L15BTC1237",
      "numeroPartiePLF": "0",
      "organeExamen": "PO717460",
      "mentionSecondeDeliberation": "0"
    }
  },
  "numeroLong": "36",
  "etapeTexte": "1ère lecture (1ère assemblée saisie)",
  "triAmendement": "aeoaaaaaaaaaaaaaaaaaaaaaaaaaaaaaaaaaaaaaaaaaaaaaaaijh",
  "cardinaliteAmdtMultiples": "1",
  "amendementParent": {
    "@xmlns:xsi": "http://www.w3.org/2001/XMLSchema-instance",
    "@xsi:nil": "true"
  },
  "etat": "Discuté",
  "signataires": {
    "auteur": {
      "typeAuteur": "Depute",
      "acteurRef": "PA334149",
      "organeRef": {
        "@xmlns:xsi": "http://www.w3.org/2001/XMLSchema-instance",
        "@xsi:nil": "true"
      },
      "groupePolitiqueRef": "PO730934"
    },
    "cosignataires": {
      "acteurRef": [
        "PA332523",
        "PA2792",
        "PA267204",
        "PA608016",
        "PA266776",
        "PA721816",
        "PA709315",
        "PA267378",
        "PA721506",
        "PA713448",
        "PA720684",
        "PA642847",
        "PA609245",
        "PA346218",
        "PA606712",
        "PA334149",
        "PA266793",
        "PA336316",
        "PA346054",
        "PA340853"
      ]
    },
    "texteAffichable": "M.&#160;Fasquelle,  M.&#160;Bony, M.&#160;Boucard, M.&#160;Bouchet, Mme&#160;Brenier, Mme&#160;Dalloz, M.&#160;Pierre-Henri&#160;Dumont, Mme&#160;Kuster, Mme&#160;Lacroute, M.&#160;Leclerc, Mme&#160;Levy, Mme&#160;Louwagie, M.&#160;Lurton, M.&#160;Emmanuel&#160;Maquet, M.&#160;Masson, M.&#160;Reiss, M.&#160;Sermier, M.&#160;Viala, M.&#160;Taugourdeau et M.&#160;Bazin"
  },
  "pointeurFragmentTexte": {
    "missionVisee": {
      "@xmlns:xsi": "http://www.w3.org/2001/XMLSchema-instance",
      "@xsi:nil": "true"
    },
    "division": {
      "titre": "Article 6",
      "articleDesignationCourte": "ART. 6",
      "type": "ARTICLE",
      "avant_A_Apres": "A",
      "divisionRattachee": "ARTICLE 6",
      "articleAdditionnel": {
        "@xmlns:xsi": "http://www.w3.org/2001/XMLSchema-instance",
        "@xsi:nil": "true"
      },
      "chapitreAdditionnel": {
        "@xmlns:xsi": "http://www.w3.org/2001/XMLSchema-instance",
        "@xsi:nil": "true"
      },
      "urlDivisionTexteVise": "/15/textes/1237.asp#D_Article_6"
    },
    "alinea": {
      "avant_A_Apres": {
        "@xmlns:xsi": "http://www.w3.org/2001/XMLSchema-instance",
        "@xsi:nil": "true"
      },
      "numero": "36",
      "alineaDesignation": {
        "@xmlns:xsi": "http://www.w3.org/2001/XMLSchema-instance",
        "@xsi:nil": "true"
      }
    }
  },
  "corps": {
    "dispositif": "<p style=\"text-align: justify;\">Substituer aux alin&#233;as 36 &#224; 39 les huit alin&#233;as suivants&#160;:</p><p style=\"text-align: justify;\">&#171;&#160;1&#176; L&#8217;article L.&#160;2333&#8209;64 est ainsi modifi&#233;&#160;:</p><p style=\"text-align: justify;\">&#171;&#160;<i>a)</i>&#160;Au premier alin&#233;a, le mot&#160;: &#171;&#160;onze&#160;&#187; est remplac&#233; par le mot&#160;: &#171;&#160;vingt-et-un&#160;&#187;&#160;;</p><p style=\"text-align: justify;\">&#171;&#160;<i>b)</i>&#160;Le dernier alin&#233;a est ainsi r&#233;dig&#233;&#160;:</p><p style=\"text-align: justify;\">&#171;&#160;Pour l&#8217;application du pr&#233;sent I, l&#8217;effectif salari&#233; employ&#233; dans chacune des zones o&#249; est institu&#233; le versement de transport et le franchissement du seuil de vingt et un salari&#233;s sont d&#233;compt&#233;s selon les modalit&#233;s pr&#233;vues &#224; l&#8217;article L.&#160;130&#8209;1 du code de la s&#233;curit&#233; sociale.&#160;&#187;&#160;;</p><p style=\"text-align: justify;\">&#171;&#160;2&#176; L&#8217;article L.&#160;2531&#8209;2&#160;est ainsi modifi&#233;&#160;:</p><p style=\"text-align: justify;\">&#171;&#160;<i>a)</i>&#160;Au premier alin&#233;a, le mot&#160;: &#171;&#160;onze&#160;&#187; est remplac&#233; par le mot&#160;: &#171;&#160;vingt-et-un&#160;&#187;&#160;;</p><p style=\"text-align: justify;\">&#171;&#160;<i>b)</i>&#160;Le second alin&#233;a est ainsi r&#233;dig&#233;&#160;:</p><p style=\"text-align: justify;\">&#171;&#160;Pour l&#8217;application du pr&#233;sent I, l&#8217;effectif salari&#233; employ&#233; dans chacune des zones o&#249; est institu&#233; le versement de transport et le franchissement du seuil de vingt et un salari&#233;s sont d&#233;compt&#233;s selon les modalit&#233;s pr&#233;vues &#224; l&#8217;article L.&#160;130&#8209;1 du code de la s&#233;curit&#233; sociale.&#160;&#187;</p><p style=\"text-align: justify;\">II.&#160;&#8211;&#160;Compl&#233;ter cet article par l&#8217;alin&#233;a suivant&#160;:</p><p style=\"text-align: justify;\">&#171;&#160;XII.&#160;&#8211;&#160;La perte de recettes r&#233;sultant pour les autorit&#233;s locales organisatrices des transports est compens&#233;e, &#224; due concurrence, par la cr&#233;ation d&#8217;une taxe additionnelle aux droits pr&#233;vus aux articles 575 et 575 A du code g&#233;n&#233;ral des imp&#244;ts.&#160;&#187;</p>",
    "exposeSommaire": "<p style=\"text-align: justify;\">L&#8217;article&#160;6 pr&#233;voit notamment une rationalisation des seuils d&#8217;effectif en se fondant sur les niveaux de onze, cinquante et deux cent cinquante salari&#233;s. Le nombre de seuils fix&#233;s &#224; vingt salari&#233;s est r&#233;duit de mani&#232;re substantielle. Certains d&#8217;entre eux sont supprim&#233;s.</p><p style=\"text-align: justify;\">Ces dispositions traduisent la volont&#233; du gouvernement de soutenir la croissance des plus petites entreprises et de modifier des contraintes r&#233;glementaires qui aujourd&#8217;hui dissuadent nombre de chefs d&#8217;entreprise de faire cro&#238;tre leur activit&#233; au-del&#224; de seuils qui induisent de nouvelles obligations.</p><p style=\"text-align: justify;\">Pour autant, l&#8217;immense majorit&#233; des entreprises sont marginalement touch&#233;es par le seuil de 20 alors qu&#8217;elles le sont majoritairement par le seuil de 10.</p><p style=\"text-align: justify;\">Le pr&#233;sent amendement vise donc &#224; modifier le seuil d&#233;clenchant l&#8217;obligation du versement transport en le portant de onze &#224; vingt et un salari&#233;s, cr&#233;ant ainsi une disposition de soutien direct aux plus petites entreprises.</p>",
    "annexeExposeSommaire": {
      "@xmlns:xsi": "http://www.w3.org/2001/XMLSchema-instance",
      "@xsi:nil": "true"
    }
  },
  "representations": {
    "representation": {
      "nom": "PDF",
      "typeMime": {
        "type": "application",
        "subType": "PDF"
      },
      "statutRepresentation": {
        "verbatim": "true",
        "canonique": "true",
        "officielle": "true",
        "transcription": "false",
        "enregistrement": "false"
      },
      "repSource": {
        "@xmlns:xsi": "http://www.w3.org/2001/XMLSchema-instance",
        "@xsi:nil": "true"
      },
      "offset": {
        "@xmlns:xsi": "http://www.w3.org/2001/XMLSchema-instance",
        "@xsi:nil": "true"
      },
      "contenu": {
        "documentURI": "/15/amendements/1237/AN/36.pdf"
      },
      "dateDispoRepresentation": {
        "@xmlns:xsi": "http://www.w3.org/2001/XMLSchema-instance",
        "@xsi:nil": "true"
      }
    }
  },
  "seanceDiscussion": "RUANR5L15S2018IDS21251",
  "sort": {
    "dateSaisie": "2018-09-27T15:13:41.000+02:00",
    "sortEnSeance": "Rejeté"
  },
  "dateDepot": "2018-09-19T02:00:00.000+02:00",
  "dateDistribution": "2018-09-24T02:00:00.000+02:00",
  "article99": "0",
  "loiReference": {
    "codeLoi": {
      "@xmlns:xsi": "http://www.w3.org/2001/XMLSchema-instance",
      "@xsi:nil": "true"
    },
    "divisionCodeLoi": {
      "@xmlns:xsi": "http://www.w3.org/2001/XMLSchema-instance",
      "@xsi:nil": "true"
    }
  }
}