{
  "@xmlns": "http://schemas.assemblee-nationale.fr/referentiel",
  "uid": "AMANR5L15PO59048B0659P0D1N19",
  "identifiant": {
    "legislature": "15",
    "numero": "19",
    "numRect": "0",
    "saisine": {
      "refTexteLegislatif": "PRJLANR5L15B0659",
      "numeroPartiePLF": "0",
      "organeExamen": "PO59048",
      "mentionSecondeDeliberation": "0"
    }
  },
  "numeroLong": "CF19",
  "etapeTexte": "1ère lecture (1ère assemblée saisie)",
  "triAmendement": "h",
  "cardinaliteAmdtMultiples": "1",
  "amendementParent": {
    "@xmlns:xsi": "http://www.w3.org/2001/XMLSchema-instance",
    "@xsi:nil": "true"
  },
  "etat": "Discuté",
  "signataires": {
    "auteur": {
      "typeAuteur": "Depute",
      "acteurRef": "PA609590",
      "organeRef": {
        "@xmlns:xsi": "http://www.w3.org/2001/XMLSchema-instance",
        "@xsi:nil": "true"
      },
      "groupePolitiqueRef": "PO730946"
    },
    "cosignataires": {
      "acteurRef": [
        "PA405480",
        "PA608172",
        "PA608011",
        "PA605069",
        "PA609590"
      ]
    },
    "texteAffichable": "Mme&#160;Rabault,  M.&#160;Pueyo, M.&#160;Jean-Louis&#160;Bricout, Mme&#160;Pires Beaune et M.&#160;Pupponi"
  },
  "pointeurFragmentTexte": {
    "missionVisee": {
      "@xmlns:xsi": "http://www.w3.org/2001/XMLSchema-instance",
      "@xsi:nil": "true"
    },
    "division": {
      "titre": "RAPPORT ANNEXÉ",
      "articleDesignationCourte": "ART. 2",
      "type": "ANNEXE",
      "avant_A_Apres": "A",
      "divisionRattachee": "ARTICLE 2",
      "articleAdditionnel": {
        "@xmlns:xsi": "http://www.w3.org/2001/XMLSchema-instance",
        "@xsi:nil": "true"
      },
      "chapitreAdditionnel": {
        "@xmlns:xsi": "http://www.w3.org/2001/XMLSchema-instance",
        "@xsi:nil": "true"
      },
      "urlDivisionTexteVise": "/15/textes/0659.asp#D_RAPPORT_ANNEXe"
    },
    "alinea": {
      "avant_A_Apres": "A",
      "numero": "274",
      "alineaDesignation": "Alinéa 274"
    }
  },
  "corps": {
    "dispositif": "<p style=\"text-align: justify;\">Compl&#233;ter l&#8217;alin&#233;a&#160;274 par la phrase suivante&#160;:</p><p style=\"text-align: justify;\">&#171;&#160;Selon la demande et les offres de formations disponibles, deux nouveaux centres pourront voir le jour afin d&#8217;am&#233;liorer la couverture de l&#8217;ensemble du territoire et ainsi faciliter l&#8217;acc&#232;s des jeunes fran&#231;ais aux opportunit&#233;s offertes par le service militaire volontaire.&#160;&#187;</p>",
    "exposeSommaire": "<p style=\"text-align: justify;\">Par son taux d&#8217;insertion professionnel de 70&#160;% et le nombre de volontaires form&#233;s, le service militaire volontaire (SMV), transposition du service militaire adapt&#233; en m&#233;tropole, est une r&#233;ussite &#224; encourager.</p><p style=\"text-align: justify;\">Pour rappel, le SMV est un dispositif militaire d&#8217;insertion socioprofessionnelle des jeunes de 18 &#224; 25 ans les plus en difficult&#233; et &#233;loign&#233;s de l&#8217;emploi. Pla&#231;ant les jeunes volontaires sous statut militaire et dans un cadre exigeant, il contribue directement au renforcement de la coh&#233;sion et de la r&#233;silience nationale.</p><p style=\"text-align: justify;\">Mis en &#339;uvre, avec des entreprises, organismes et collectivit&#233;s locales partenaires, dans le but de favoriser l&#8217;acc&#232;s &#224; l&#8217;emploi, le SMV s&#8217;articule actuellement autour de six centres, sous la responsabilit&#233; des trois arm&#233;es, et forme pr&#232;s de 1 000 volontaires par an dans cinq r&#233;gions diff&#233;rentes.</p><p style=\"text-align: justify;\">Cet amendement vise donc &#224; ouvrir l&#8217;opportunit&#233; d&#8217;ouvrir deux nouveaux centres si la demande du public est pr&#233;sente et si les territoires offrent des formations et d&#233;bouch&#233;es. Ces centres pourraient ouvrir dans les zones g&#233;ographiques moins dot&#233;es comme le nord et le sud de la France qui sont plus &#233;loign&#233;s des centres actuellement envisag&#233;s ou ouverts.</p>",
    "annexeExposeSommaire": {
      "@xmlns:xsi": "http://www.w3.org/2001/XMLSchema-instance",
      "@xsi:nil": "true"
    }
  },
  "representations": {
    "representation": {
      "nom": "PDF",
      "typeMime": {
        "type": "application",
        "subType": "PDF"
      },
      "statutRepresentation": {
        "verbatim": "true",
        "canonique": "true",
        "officielle": "true",
        "transcription": "false",
        "enregistrement": "false"
      },
      "repSource": {
        "@xmlns:xsi": "http://www.w3.org/2001/XMLSchema-instance",
        "@xsi:nil": "true"
      },
      "offset": {
        "@xmlns:xsi": "http://www.w3.org/2001/XMLSchema-instance",
        "@xsi:nil": "true"
      },
      "contenu": {
        "documentURI": "/15/amendements/0659/CION_FIN/CF19.pdf"
      },
      "dateDispoRepresentation": {
        "@xmlns:xsi": "http://www.w3.org/2001/XMLSchema-instance",
        "@xsi:nil": "true"
      }
    }
  },
  "seanceDiscussion": {
    "@xmlns:xsi": "http://www.w3.org/2001/XMLSchema-instance",
    "@xsi:nil": "true"
  },
  "sort": {
    "dateSaisie": "2018-03-13T12:56:16.000+01:00",
    "sortEnSeance": "Retiré"
  },
  "dateDepot": "2018-03-09T01:00:00.000+01:00",
  "dateDistribution": "2018-03-12T01:00:00.000+01:00",
  "article99": "0",
  "loiReference": {
    "codeLoi": {
      "@xmlns:xsi": "http://www.w3.org/2001/XMLSchema-instance",
      "@xsi:nil": "true"
    },
    "divisionCodeLoi": {
      "@xmlns:xsi": "http://www.w3.org/2001/XMLSchema-instance",
      "@xsi:nil": "true"
    }
  }
}