{
  "@xmlns": "http://schemas.assemblee-nationale.fr/referentiel",
  "uid": "AMANR5L15SEA717460B2296P0D1N1414",
  "identifiant": {
    "legislature": "15",
    "numero": "1414",
    "numRect": "0",
    "saisine": {
      "refTexteLegislatif": "PRJLANR5L15B2296",
      "numeroPartiePLF": "0",
      "organeExamen": "PO717460",
      "mentionSecondeDeliberation": "0"
    }
  },
  "numeroLong": "1414",
  "etapeTexte": "1ère lecture (1ère assemblée saisie)",
  "triAmendement": "auaaaaaaaaaaaaaaaaaaaaaaaaaaaaaaaaaaaaaaaaaaaaaaaazwi",
  "cardinaliteAmdtMultiples": "1",
  "amendementParent": {
    "@xmlns:xsi": "http://www.w3.org/2001/XMLSchema-instance",
    "@xsi:nil": "true"
  },
  "etat": "Discuté",
  "signataires": {
    "auteur": {
      "typeAuteur": "Depute",
      "acteurRef": "PA609726",
      "organeRef": {
        "@xmlns:xsi": "http://www.w3.org/2001/XMLSchema-instance",
        "@xsi:nil": "true"
      },
      "groupePolitiqueRef": "PO730934"
    },
    "cosignataires": {
      "acteurRef": [
        "PA718780",
        "PA608416",
        "PA605991",
        "PA719318",
        "PA267527",
        "PA609726",
        "PA267260",
        "PA267450",
        "PA336316",
        "PA1874",
        "PA643134",
        "PA709315",
        "PA718838",
        "PA721816",
        "PA605036",
        "PA998",
        "PA718884",
        "PA608016",
        "PA721678"
      ]
    },
    "texteAffichable": "M.&#160;Aubert,  Mme&#160;Poletti, M.&#160;Viala, M.&#160;Reda, M.&#160;Le Fur, M.&#160;Brun, M.&#160;Boucard, Mme&#160;Anthoine, Mme&#160;Bazin-Malgras, Mme&#160;Trastour-Isnart, M.&#160;Abad, M.&#160;R&#233;mi&#160;Delatte, M.&#160;Bouchet, Mme&#160;Valentin, M.&#160;Saddier, Mme&#160;Louwagie, M.&#160;Dassault, Mme&#160;Genevard et M.&#160;Hetzel"
  },
  "pointeurFragmentTexte": {
    "missionVisee": {
      "@xmlns:xsi": "http://www.w3.org/2001/XMLSchema-instance",
      "@xsi:nil": "true"
    },
    "division": {
      "titre": "Article 8",
      "articleDesignationCourte": "APRÈS ART. 8",
      "type": "ARTICLE",
      "avant_A_Apres": "Après",
      "divisionRattachee": "APRÈS L'ARTICLE 8, insérer l'article suivant:",
      "articleAdditionnel": "1",
      "chapitreAdditionnel": {
        "@xmlns:xsi": "http://www.w3.org/2001/XMLSchema-instance",
        "@xsi:nil": "true"
      },
      "urlDivisionTexteVise": "/15/textes/2296.asp#D_Article_8"
    },
    "alinea": {
      "@xmlns:xsi": "http://www.w3.org/2001/XMLSchema-instance",
      "@xsi:nil": "true"
    }
  },
  "corps": {
    "dispositif": "<p style=\"text-align: justify;\">Le Gouvernement remet au Parlement, au plus tard le 1<sup>er</sup> septembre 2020, un rapport d&#8217;&#233;valuation du co&#251;t financier et de l&#8217;impact &#233;conomique du dispositif d&#8217;exon&#233;ration des cotisations patronales pour les travailleurs occasionnels agricoles pr&#233;vu &#224; l&#8217;article L.&#160;741&#8209;16 du code rural et de la p&#234;che maritime.</p>",
    "exposeSommaire": "<p style=\"text-align: justify;\">L&#8217;ann&#233;e derni&#232;re le Gouvernement entendait mettre fin au dispositif d&#8217;exon&#233;rations patronales pour les Travailleurs occasionnels demandeurs d&#8217;emploi (TODE) dans le PLFSS pour 2019. Au terme d&#8217;un combat politique important, nous avons obtenu le report de cette suppression &#224; 2021. Il n&#8217;en reste pas moins que ces exon&#233;rations sont toujours aussi essentielles pour la comp&#233;titivit&#233; des exploitations agricoles fran&#231;aises. Aussi, compte tenu du fait que ces exon&#233;rations doivent cesser &#224; partir du 1<sup>er</sup> janvier 2021, il convient&#160; d&#8217;alerter la repr&#233;sentation nationale sur la n&#233;cessit&#233; de ne pas remettre en cause ce dispositif.</p><p style=\"text-align: justify;\">Dans un d&#233;partement comme le Vaucluse, premier d&#233;partement fran&#231;ais b&#233;n&#233;ficiaire des exon&#233;rations de charges patronales sur les travailleurs occasionnels, 33,1 millions d&#8217;euros<br />d&#8217;exon&#233;rations patronales annuelles ont &#233;t&#233; re&#231;ues en 2016 par 38 861 saisonniers agricoles b&#233;n&#233;ficiaires.<br /><br />Cet amendement vise donc &#224; demander au Gouvernement de r&#233;diger un rapport afin d&#8217;&#233;valuer le co&#251;t financier et l&#8217;impact &#233;conomique li&#233;s &#224; ce dispositif. Il s&#8217;agira notamment d&#8217;informer la repr&#233;sentation nationale sur la variation du nombre d&#8217;emplois agricoles qui b&#233;n&#233;ficient de cette exon&#233;ration, ainsi que de calculer le co&#251;t pour les employeurs des nouvelles embauches sans ce dispositif. Ce rapport devra &#234;tre remis au Parlement au plus tard le 1<sup>er</sup> septembre 2020.</p>",
    "annexeExposeSommaire": {
      "@xmlns:xsi": "http://www.w3.org/2001/XMLSchema-instance",
      "@xsi:nil": "true"
    },
    "cartoucheDelaiDepotDepasse": {
      "@xmlns:xsi": "http://www.w3.org/2001/XMLSchema-instance",
      "@xsi:nil": "true"
    },
    "avantAppel": {
      "@xmlns:xsi": "http://www.w3.org/2001/XMLSchema-instance",
      "@xsi:nil": "true"
    }
  },
  "representations": {
    "representation": {
      "nom": "PDF",
      "typeMime": {
        "type": "application",
        "subType": "PDF"
      },
      "statutRepresentation": {
        "verbatim": "true",
        "canonique": "true",
        "officielle": "true",
        "transcription": "false",
        "enregistrement": "false"
      },
      "repSource": {
        "@xmlns:xsi": "http://www.w3.org/2001/XMLSchema-instance",
        "@xsi:nil": "true"
      },
      "offset": {
        "@xmlns:xsi": "http://www.w3.org/2001/XMLSchema-instance",
        "@xsi:nil": "true"
      },
      "contenu": {
        "documentURI": "/15/amendements/2296/AN/1414.pdf"
      },
      "dateDispoRepresentation": {
        "@xmlns:xsi": "http://www.w3.org/2001/XMLSchema-instance",
        "@xsi:nil": "true"
      }
    }
  },
  "seanceDiscussion": "RUANR5L15S2020IDS21876",
  "sort": {
    "dateSaisie": "2019-10-23T23:49:16.000+02:00",
    "sortEnSeance": "Rejeté"
  },
  "dateDepot": "2019-10-18T02:00:00.000+02:00",
  "dateDistribution": "2019-10-21T02:00:00.000+02:00",
  "article99": "0",
  "loiReference": {
    "codeLoi": {
      "@xmlns:xsi": "http://www.w3.org/2001/XMLSchema-instance",
      "@xsi:nil": "true"
    },
    "divisionCodeLoi": {
      "@xmlns:xsi": "http://www.w3.org/2001/XMLSchema-instance",
      "@xsi:nil": "true"
    }
  }
}