{
  "@xmlns": "http://schemas.assemblee-nationale.fr/referentiel",
  "uid": "AMANR5L15SEA717460BTC1237P0D1N1725",
  "identifiant": {
    "legislature": "15",
    "numero": "1725",
    "numRect": "0",
    "saisine": {
      "refTexteLegislatif": "PRJLANR5L15BTC1237",
      "numeroPartiePLF": "0",
      "organeExamen": "PO717460",
      "mentionSecondeDeliberation": "1"
    }
  },
  "numeroLong": "1725",
  "etapeTexte": "1ère lecture (1ère assemblée saisie)",
  "triAmendement": "roaaaaaaaaaaaaaaaaaaaaaaaaaaaaaaaaaaaaaaaaaaaaaaaaarzzz",
  "cardinaliteAmdtMultiples": "1",
  "amendementParent": {
    "@xmlns:xsi": "http://www.w3.org/2001/XMLSchema-instance",
    "@xsi:nil": "true"
  },
  "etat": "Discuté",
  "signataires": {
    "auteur": {
      "typeAuteur": "Depute",
      "acteurRef": "PA607553",
      "organeRef": {
        "@xmlns:xsi": "http://www.w3.org/2001/XMLSchema-instance",
        "@xsi:nil": "true"
      },
      "groupePolitiqueRef": "PO758835"
    },
    "cosignataires": {
      "acteurRef": [
        "PA1592",
        "PA608695",
        "PA609590",
        "PA405480",
        "PA643145",
        "PA608011",
        "PA429893",
        "PA1008",
        "PA720988",
        "PA335054",
        "PA342415",
        "PA609332",
        "PA340343",
        "PA340357",
        "PA610681",
        "PA332614",
        "PA1198",
        "PA642764",
        "PA333285",
        "PA719930",
        "PA607553",
        "PA333818",
        "PA608741",
        "PA1809",
        "PA337483",
        "PA605069",
        "PA508",
        "PA267233",
        "PA335532",
        "PA608172"
      ]
    },
    "texteAffichable": "M.&#160;Potier,  Mme&#160;Battistel, M.&#160;Juanico, M.&#160;Vallaud, Mme&#160;Rabault, M.&#160;Aviragnet, Mme&#160;Bareigts, Mme&#160;Bi&#233;mouret, M.&#160;Bouillon, M.&#160;Jean-Louis&#160;Bricout, M.&#160;Carvounas, M.&#160;Alain&#160;David, Mme&#160;Laurence&#160;Dumont, M.&#160;Faure, M.&#160;Garot, M.&#160;David&#160;Habib, M.&#160;Hutin, Mme&#160;Karamanli, M.&#160;J&#233;r&#244;me&#160;Lambert, M.&#160;Letchimy, Mme&#160;Manin, Mme&#160;Pau-Langevin, Mme&#160;Pires Beaune, M.&#160;Pueyo, M.&#160;Pupponi, M.&#160;Saulignac, Mme&#160;Tolmont, Mme&#160;Untermaier, Mme&#160;Vainqueur-Christophe et Mme&#160;Victory"
  },
  "pointeurFragmentTexte": {
    "missionVisee": {
      "@xmlns:xsi": "http://www.w3.org/2001/XMLSchema-instance",
      "@xsi:nil": "true"
    },
    "division": {
      "titre": "Article 71",
      "articleDesignationCourte": "APRÈS ART. 71",
      "type": "ARTICLE",
      "avant_A_Apres": "Après",
      "divisionRattachee": "APRÈS L'ARTICLE 71, insérer l'article suivant:",
      "articleAdditionnel": "1",
      "chapitreAdditionnel": {
        "@xmlns:xsi": "http://www.w3.org/2001/XMLSchema-instance",
        "@xsi:nil": "true"
      },
      "urlDivisionTexteVise": "/15/textes/1237.asp#D_Article_71"
    },
    "alinea": {
      "@xmlns:xsi": "http://www.w3.org/2001/XMLSchema-instance",
      "@xsi:nil": "true"
    }
  },
  "corps": {
    "dispositif": "<p style=\"text-align: justify;\">Le premier alin&#233;a de l&#8217;article L.&#160;313&#8209;25&#8209;1 du code de la consommation est compl&#233;t&#233; par les mots&#160;:</p><p style=\"text-align: justify;\">&#171;&#160;et de garantir que les conditions tarifaires en vigueur au moment de la signature du cr&#233;dit ne pourront &#234;tre modifi&#233;es dans un sens d&#233;favorable &#224; l&#8217;emprunteur par rapport &#224; leur situation &#224; la signature du cr&#233;dit pour le m&#234;me type de prestation, et ce, sur la dur&#233;e fix&#233;e par le pr&#233;teur pour la condition de domiciliation de revenus.&#160;&#187;</p>",
    "exposeSommaire": "<p style=\"text-align: justify;\">L&#8217;Ordonnance n&#176;2017&#8209;1090 du 1<sup>er</sup> juin 2017 offre la possibilit&#233;, pour les &#233;tablissements de cr&#233;dit pr&#233;teurs, d&#8217;imposer au client particulier, en contrepartie d&#8217;un avantage sur le taux d&#8217;un cr&#233;dit immobilier, la domiciliation des revenus de ce m&#234;me client au sein de l&#8217;&#233;tablissement. Et ce pour une dur&#233;e pouvant aller jusqu&#8217;&#224; 10 ans.</p><p style=\"text-align: justify;\">Cette obligation de domiciliation des revenus emp&#234;che toute concurrence sur le produit li&#233; au cr&#233;dit immobilier qu&#8217;est le compte de d&#233;p&#244;t. Or, aujourd&#8217;hui, les banques ont la possibilit&#233; de changer de mani&#232;re discr&#233;tionnaire les tarifs des services li&#233;s &#224; ce compte de d&#233;p&#244;t.</p><p style=\"text-align: justify;\">De ce fait, le client qui aujourd&#8217;hui se voit imposer l&#8217;obligation de domiciliation des revenus n&#8217;a aucune visibilit&#233; sur le traitement tarifaire qui pourrait lui &#234;tre impos&#233; sur son compte de d&#233;p&#244;t pour les 10 ans &#224; venir. Le risque est ainsi que le client se voit imposer des conditions tarifaires insupportables pour son budget, alors m&#234;me qu&#8217;il ne peut plus faire appel &#224; la concurrence.</p><p style=\"text-align: justify;\">Cet amendement a pour objectif de donner de la visibilit&#233; aux clients souscripteurs de cr&#233;dits immobiliers assortis d&#8217;obligation de domiciliation en emp&#234;chant le pr&#234;teur de pouvoir imposer des conditions tarifaires d&#233;savantageuses pour le m&#234;me type de prestations par rapport &#224; ce qu&#8217;elles &#233;taient au moment de la signature de l&#8217;offre. En cas d&#8217;adoption, cette mesure permettrait ainsi de r&#233;&#233;quilibrer la relation contractuelle sur la partie compte de d&#233;p&#244;t.</p>",
    "annexeExposeSommaire": {
      "@xmlns:xsi": "http://www.w3.org/2001/XMLSchema-instance",
      "@xsi:nil": "true"
    }
  },
  "representations": {
    "representation": {
      "nom": "PDF",
      "typeMime": {
        "type": "application",
        "subType": "PDF"
      },
      "statutRepresentation": {
        "verbatim": "true",
        "canonique": "true",
        "officielle": "true",
        "transcription": "false",
        "enregistrement": "false"
      },
      "repSource": {
        "@xmlns:xsi": "http://www.w3.org/2001/XMLSchema-instance",
        "@xsi:nil": "true"
      },
      "offset": {
        "@xmlns:xsi": "http://www.w3.org/2001/XMLSchema-instance",
        "@xsi:nil": "true"
      },
      "contenu": {
        "documentURI": "/15/amendements/1237/AN/1725.pdf"
      },
      "dateDispoRepresentation": {
        "@xmlns:xsi": "http://www.w3.org/2001/XMLSchema-instance",
        "@xsi:nil": "true"
      }
    }
  },
  "seanceDiscussion": "RUANR5L15S2019IDS21349",
  "sort": {
    "dateSaisie": "2018-10-05T17:28:22.000+02:00",
    "sortEnSeance": "Non soutenu"
  },
  "dateDepot": "2018-09-21T02:00:00.000+02:00",
  "dateDistribution": "2018-09-26T02:00:00.000+02:00",
  "article99": "0",
  "loiReference": {
    "codeLoi": "c consommation",
    "divisionCodeLoi": "L313-25-1"
  }
}