{
  "@xmlns": "http://schemas.assemblee-nationale.fr/referentiel",
  "uid": "AMANR5L15SEA717460BTC1212P0D1N179",
  "identifiant": {
    "legislature": "15",
    "numero": "179",
    "numRect": "0",
    "saisine": {
      "refTexteLegislatif": "PRJLANR5L15BTC1212",
      "numeroPartiePLF": "0",
      "organeExamen": "PO717460",
      "mentionSecondeDeliberation": "0"
    }
  },
  "numeroLong": "179",
  "etapeTexte": "1ère lecture (2ème assemblée saisie)",
  "triAmendement": "buaaaaaaaaaaaaaaaaaaaaaaaaaaaaaaaaaaaaaaaaaaaaaaaai",
  "cardinaliteAmdtMultiples": "1",
  "amendementParent": {
    "@xmlns:xsi": "http://www.w3.org/2001/XMLSchema-instance",
    "@xsi:nil": "true"
  },
  "etat": "Discuté",
  "signataires": {
    "auteur": {
      "typeAuteur": "Depute",
      "acteurRef": "PA719980",
      "organeRef": {
        "@xmlns:xsi": "http://www.w3.org/2001/XMLSchema-instance",
        "@xsi:nil": "true"
      },
      "groupePolitiqueRef": "PO730964"
    },
    "cosignataires": {
      "acteurRef": [
        "PA721398",
        "PA721876",
        "PA719952",
        "PA719624",
        "PA719980",
        "PA719972",
        "PA722292",
        "PA721600",
        "PA605518",
        "PA721860",
        "PA719512",
        "PA720622",
        "PA720198"
      ]
    },
    "texteAffichable": "M.&#160;Borowczyk,  Mme&#160;Degois, M.&#160;Rudigoz, M.&#160;Fran&#231;ois-Michel&#160;Lambert, Mme&#160;Couillard, Mme&#160;Vignon, Mme&#160;Bureau-Bonnard, M.&#160;Mis, M.&#160;Morenas, Mme&#160;Rossi, M.&#160;Cesarini, M.&#160;Galbadon et Mme&#160;Sarles"
  },
  "pointeurFragmentTexte": {
    "missionVisee": {
      "@xmlns:xsi": "http://www.w3.org/2001/XMLSchema-instance",
      "@xsi:nil": "true"
    },
    "division": {
      "titre": "Article 3 ter",
      "articleDesignationCourte": "APRÈS ART. 3 TER",
      "type": "ARTICLE",
      "avant_A_Apres": "Après",
      "divisionRattachee": "APRÈS L'ARTICLE 3 TER, insérer l'article suivant:",
      "articleAdditionnel": "1",
      "chapitreAdditionnel": {
        "@xmlns:xsi": "http://www.w3.org/2001/XMLSchema-instance",
        "@xsi:nil": "true"
      },
      "urlDivisionTexteVise": "/15/textes/1212.asp#D_Article_3_ter"
    },
    "alinea": {
      "@xmlns:xsi": "http://www.w3.org/2001/XMLSchema-instance",
      "@xsi:nil": "true"
    }
  },
  "corps": {
    "dispositif": "<p style=\"text-align: justify;\">&#192; la premi&#232;re phrase du premier alin&#233;a de l&#8217;article L.&#160;561&#8209;19 du code mon&#233;taire et financier, la r&#233;f&#233;rence &#171;&#160;7&#160;&#187; est remplac&#233;e par la r&#233;f&#233;rence&#160;: &#171;&#160;9&#176; <i>bis</i>&#160;&#187;.</p>",
    "exposeSommaire": "<p style=\"text-align: justify;\">Les personnes physiques ou morales dont les activit&#233;s portent sur les biens d&#8217;autrui, ainsi que les op&#233;rateurs de jeux ou de paris sont aussi en mesure de faire face &#224; des soup&#231;ons de fraude. Du fait de leur activit&#233;, les mouvements d&#8217;argents font partie de leur quotidien et ont affaire au plus pr&#232;s des personnes qui engagent des sommes d&#8217;argent parfois cons&#233;quentes.</p><p style=\"text-align: justify;\">Notamment dans les casinos, dans lesquels la masse d&#8217;argent circulant peut donner lieu &#224; des m&#233;thodes de fraude.</p><p style=\"text-align: justify;\">C&#8217;est pourquoi, la cellule TRACFIN est d&#233;j&#224; habilit&#233;e &#224; recevoir des op&#233;rateurs de jeux ou de paris des d&#233;clarations de soup&#231;ons afin de les aider dans leur mission de lutte contre le blanchiment de capitaux et le financement du terrorisme. </p><p style=\"text-align: justify;\">Actuellement, l&#8217;autorit&#233; judiciaire ne peut &#234;tre inform&#233;e que de telles d&#233;clarations ont &#233;t&#233; envoy&#233;es &#224; la cellule que par une liste restreinte de professionnels d&#233;finie &#224; l&#8217;article L561&#8209;19 du CMF.</p><p style=\"text-align: justify;\">A la suite de cette r&#233;v&#233;lation, des v&#233;rifications peuvent &#234;tre effectu&#233;es voire servir pour l&#8217;objet d&#8217;une enqu&#234;te.</p><p style=\"text-align: justify;\">Mais afin de renforcer l&#8217;efficacit&#233; de ce syst&#232;me et am&#233;liorer la lutte contre la fraude, le pr&#233;sent amendement propose d&#8217;&#233;tendre cette possibilit&#233; de r&#233;v&#233;lation &#224; l&#8217;autorit&#233; judiciaire des d&#233;clarations envoy&#233;es &#224; la cellule TRACFIN, aux personnes exer&#231;ant des activit&#233;s relatives &#224; certaines op&#233;rations sur les immeubles et les fonds de commerce ainsi qu&#8217;aux op&#233;rateurs de jeux ou de paris.</p><p style=\"text-align: justify;\">L&#8217;int&#233;r&#234;t d&#8217;&#233;largir la coop&#233;ration et le partage d&#8217;information permettrait encore d&#8217;am&#233;liorer la lutte contre la fraude et les moyens qui lui sont donn&#233;s.&#160;</p>",
    "annexeExposeSommaire": {
      "@xmlns:xsi": "http://www.w3.org/2001/XMLSchema-instance",
      "@xsi:nil": "true"
    }
  },
  "representations": {
    "representation": {
      "nom": "PDF",
      "typeMime": {
        "type": "application",
        "subType": "PDF"
      },
      "statutRepresentation": {
        "verbatim": "true",
        "canonique": "true",
        "officielle": "true",
        "transcription": "false",
        "enregistrement": "false"
      },
      "repSource": {
        "@xmlns:xsi": "http://www.w3.org/2001/XMLSchema-instance",
        "@xsi:nil": "true"
      },
      "offset": {
        "@xmlns:xsi": "http://www.w3.org/2001/XMLSchema-instance",
        "@xsi:nil": "true"
      },
      "contenu": {
        "documentURI": "/15/amendements/1212/AN/179.pdf"
      },
      "dateDispoRepresentation": {
        "@xmlns:xsi": "http://www.w3.org/2001/XMLSchema-instance",
        "@xsi:nil": "true"
      }
    }
  },
  "seanceDiscussion": "RUANR5L15S2018IDS21239",
  "sort": {
    "dateSaisie": "2018-09-17T21:45:29.000+02:00",
    "sortEnSeance": "Retiré"
  },
  "dateDepot": "2018-09-13T02:00:00.000+02:00",
  "dateDistribution": "2018-09-14T02:00:00.000+02:00",
  "article99": "0",
  "loiReference": {
    "codeLoi": "c monétaire",
    "divisionCodeLoi": "L561-19"
  }
}