{
  "@xmlns": "http://schemas.assemblee-nationale.fr/referentiel",
  "uid": "AMANR5L15SEA717460BTC1019P0D1N596",
  "identifiant": {
    "legislature": "15",
    "numero": "596",
    "numRect": "1",
    "saisine": {
      "refTexteLegislatif": "PRJLANR5L15BTC1019",
      "numeroPartiePLF": "0",
      "organeExamen": "PO717460",
      "mentionSecondeDeliberation": "0"
    }
  },
  "numeroLong": "596 (Rect)",
  "etapeTexte": "1ère lecture (1ère assemblée saisie)",
  "triAmendement": "nk",
  "cardinaliteAmdtMultiples": "1",
  "amendementParent": {
    "@xmlns:xsi": "http://www.w3.org/2001/XMLSchema-instance",
    "@xsi:nil": "true"
  },
  "etat": "Discuté",
  "signataires": {
    "auteur": {
      "typeAuteur": "Depute",
      "acteurRef": "PA720684",
      "organeRef": {
        "@xmlns:xsi": "http://www.w3.org/2001/XMLSchema-instance",
        "@xsi:nil": "true"
      },
      "groupePolitiqueRef": "PO730934"
    },
    "cosignataires": {
      "acteurRef": [
        "PA608016",
        "PA718850",
        "PA718780",
        "PA721816",
        "PA330684",
        "PA609726",
        "PA267527",
        "PA721314",
        "PA606712",
        "PA332523",
        "PA720684",
        "PA266797",
        "PA267429",
        "PA346218",
        "PA721636",
        "PA720100",
        "PA643134",
        "PA721410"
      ]
    },
    "texteAffichable": "M.&#160;Pierre-Henri&#160;Dumont,  M.&#160;Pradi&#233;, Mme&#160;Bonnivard, M.&#160;Parigi, M.&#160;Lurton, Mme&#160;Valentin, M.&#160;Masson, M.&#160;Schellenberger, Mme&#160;Dalloz, M.&#160;Cordier, M.&#160;Cinieri, M.&#160;Gosselin, M.&#160;Aubert, Mme&#160;Val&#233;rie&#160;Boyer, Mme&#160;Louwagie, Mme&#160;Trastour-Isnart, M.&#160;Saddier et M.&#160;Boucard"
  },
  "pointeurFragmentTexte": {
    "missionVisee": {
      "@xmlns:xsi": "http://www.w3.org/2001/XMLSchema-instance",
      "@xsi:nil": "true"
    },
    "division": {
      "titre": "Article 13",
      "articleDesignationCourte": "APRÈS ART. 13",
      "type": "ARTICLE",
      "avant_A_Apres": "Après",
      "divisionRattachee": "APRÈS L'ARTICLE 13, insérer l'article suivant:",
      "articleAdditionnel": "1",
      "chapitreAdditionnel": {
        "@xmlns:xsi": "http://www.w3.org/2001/XMLSchema-instance",
        "@xsi:nil": "true"
      },
      "urlDivisionTexteVise": "/15/textes/1019.asp#D_Article_13"
    },
    "alinea": {
      "@xmlns:xsi": "http://www.w3.org/2001/XMLSchema-instance",
      "@xsi:nil": "true"
    }
  },
  "corps": {
    "dispositif": "<p style=\"text-align: justify;\">L&#8217;article L.&#160;6325&#8209;3 du code du travail est compl&#233;t&#233; par un alin&#233;a ainsi r&#233;dig&#233;&#160;:</p><p style=\"text-align: justify;\">&#171;&#160;Dans le contrat de professionnalisation entre l&#8217;employeur et le salari&#233;, est ins&#233;r&#233;e une clause de d&#233;dit-formation dans laquelle le salari&#233; s&#8217;engage &#224; rembourser &#224; l&#8217;employeur les frais de sa formation s&#8217;il quitte volontairement l&#8217;entreprise avant la fin de son contrat.&#160;&#187;</p>",
    "exposeSommaire": "<p style=\"text-align: justify;\">L&#8217;article L.&#160;6325&#8209;3 du code du travail, dans sa r&#233;daction actuelle, dispose que l&#8217;employeur s&#8217;engage &#224; assurer une formation au salari&#233; afin que ce dernier puisse acqu&#233;rir une formation professionnelle et &#224; lui fournir un emploi en relation avec cet objectif.</p><p style=\"text-align: justify;\">En revanche, dans le texte, aucune contrepartie n&#8217;est pr&#233;vue lorsque le salari&#233; se d&#233;sengage dans le cadre du contrat de professionnalisation.</p><p style=\"text-align: justify;\">En droit, la clause de d&#233;dit-formation est une clause contractuelle par laquelle le salari&#233;, en contrepartie d&#8217;une formation, rembourse les frais de formation engag&#233;s par l&#8217;entreprise s&#8217;il d&#233;missionne avant la fin du contrat.</p><p style=\"text-align: justify;\">L&#8217;objet de cet amendement est de g&#233;n&#233;raliser la clause de d&#233;dit &#224; tous les contrats de professionnalisation. En effet, de nombreuses entreprises se voient confront&#233;es &#224; des d&#233;parts volontaires de salari&#233;s avant la fin de leur contrat de professionnalisation. Ainsi, par exemple, des entreprises de transports routiers d&#233;plorent une d&#233;perdition de 23&#160;% de leurs salari&#233;s avant l&#8217;ach&#232;vement du contrat de professionnalisation.</p><p style=\"text-align: justify;\">Nombre de TPE sont ainsi fragilis&#233;es non seulement du fait des co&#251;ts engag&#233;s pour la formation du salari&#233; mais aussi par la perte de main d&#8217;oeuvre du fait du d&#233;part de ce dernier.</p><p style=\"text-align: justify;\">Dans le cadre des contrats de professionnalisation, il est donc essentiel de r&#233;tablir un juste &#233;quilibre entre l&#8217;employeur et le salari&#233; en pr&#233;voyant le remboursement &#224; l&#8217;employeur des frais de sa formation via la clause de d&#233;dit lorsque ce dernier se d&#233;sengage avant la fin du contrat.</p><p style=\"text-align: justify;\">&#160;</p>",
    "annexeExposeSommaire": {
      "@xmlns:xsi": "http://www.w3.org/2001/XMLSchema-instance",
      "@xsi:nil": "true"
    }
  },
  "representations": {
    "representation": {
      "nom": "PDF",
      "typeMime": {
        "type": "application",
        "subType": "PDF"
      },
      "statutRepresentation": {
        "verbatim": "true",
        "canonique": "true",
        "officielle": "true",
        "transcription": "false",
        "enregistrement": "false"
      },
      "repSource": {
        "@xmlns:xsi": "http://www.w3.org/2001/XMLSchema-instance",
        "@xsi:nil": "true"
      },
      "offset": {
        "@xmlns:xsi": "http://www.w3.org/2001/XMLSchema-instance",
        "@xsi:nil": "true"
      },
      "contenu": {
        "documentURI": "/15/amendements/1019/AN/596.pdf"
      },
      "dateDispoRepresentation": {
        "@xmlns:xsi": "http://www.w3.org/2001/XMLSchema-instance",
        "@xsi:nil": "true"
      }
    }
  },
  "seanceDiscussion": "RUANR5L15S2018IDS21104",
  "sort": {
    "dateSaisie": "2018-06-15T10:43:30.000+02:00",
    "sortEnSeance": "Non soutenu"
  },
  "dateDepot": "2018-06-06T02:00:00.000+02:00",
  "dateDistribution": "2018-06-09T02:00:00.000+02:00",
  "article99": "0",
  "loiReference": {
    "codeLoi": "c travail",
    "divisionCodeLoi": "L6325-3"
  }
}