{
  "@xmlns": "http://schemas.assemblee-nationale.fr/referentiel",
  "uid": "AMANR5L15PO59051B0778P0D1N131",
  "identifiant": {
    "legislature": "15",
    "numero": "131",
    "numRect": "0",
    "saisine": {
      "refTexteLegislatif": "PRJLANR5L15B0778",
      "numeroPartiePLF": "0",
      "organeExamen": "PO59051",
      "mentionSecondeDeliberation": "0"
    }
  },
  "numeroLong": "CL131",
  "etapeTexte": "1ère lecture (1ère assemblée saisie)",
  "triAmendement": "adi",
  "cardinaliteAmdtMultiples": "1",
  "amendementParent": {
    "@xmlns:xsi": "http://www.w3.org/2001/XMLSchema-instance",
    "@xsi:nil": "true"
  },
  "etat": "Discuté",
  "signataires": {
    "auteur": {
      "typeAuteur": "Depute",
      "acteurRef": "PA718860",
      "organeRef": {
        "@xmlns:xsi": "http://www.w3.org/2001/XMLSchema-instance",
        "@xsi:nil": "true"
      },
      "groupePolitiqueRef": "PO730958"
    },
    "cosignataires": {
      "acteurRef": [
        "PA721062",
        "PA720846",
        "PA720430",
        "PA718860",
        "PA718868",
        "PA588884",
        "PA721202",
        "PA719676",
        "PA2150",
        "PA720892",
        "PA722142",
        "PA720286",
        "PA721210",
        "PA721960",
        "PA721226",
        "PA719578",
        "PA720422"
      ]
    },
    "texteAffichable": "Mme&#160;Taurine,  Mme&#160;Autain, M.&#160;Bernalicis, M.&#160;Coquerel, M.&#160;Corbi&#232;re, Mme&#160;Fiat, M.&#160;Lachaud, M.&#160;Larive, M.&#160;M&#233;lenchon, Mme&#160;Obono, Mme&#160;Panot, M.&#160;Prud&apos;homme, M.&#160;Quatennens, M.&#160;Ratenon, Mme&#160;Ressiguier, Mme&#160;Rubin et M.&#160;Ruffin"
  },
  "pointeurFragmentTexte": {
    "missionVisee": {
      "@xmlns:xsi": "http://www.w3.org/2001/XMLSchema-instance",
      "@xsi:nil": "true"
    },
    "division": {
      "titre": "Article 4",
      "articleDesignationCourte": "APRÈS ART. 4",
      "type": "ARTICLE",
      "avant_A_Apres": "Après",
      "divisionRattachee": "APRÈS L'ARTICLE 4, insérer l'article suivant:",
      "articleAdditionnel": "1",
      "chapitreAdditionnel": {
        "@xmlns:xsi": "http://www.w3.org/2001/XMLSchema-instance",
        "@xsi:nil": "true"
      },
      "urlDivisionTexteVise": "/15/textes/0778.asp#D_Article_4"
    },
    "alinea": {
      "@xmlns:xsi": "http://www.w3.org/2001/XMLSchema-instance",
      "@xsi:nil": "true"
    }
  },
  "corps": {
    "dispositif": "<p style=\"text-align: justify;\">&#171;&#160;Dans un d&#233;lai d&#8217;un an &#224; compter de la promulgation de la pr&#233;sente loi, le Gouvernement remet au Parlement un rapport d&#8217;&#233;valuation sur la mise en place de l&#8217;infraction visant &#224; sanctionner les agissements sexistes.</p><p style=\"text-align: justify;\">&#171;&#160;Il d&#233;taille le nombre de contraventions qui ont &#233;t&#233; &#233;tablies et effectue une enqu&#234;te de v&#233;rification de l&#8217;am&#233;lioration du sentiment de s&#233;curit&#233; dans l&#8217;espace public.&#160;&#187;</p>",
    "exposeSommaire": "<p>La pr&#233;sente disposition a une vis&#233;e &#8220;p&#233;dagogique&#8221;, nous a dit le gouvernement.</p><p><br />L&#8217;objectif est donc de dissuader les contrevenants de tenir des propos d&#233;plac&#233;s dans l&#8217;espace public, afin de faire en sorte que les femmes tout comme les personnes qui sortent des &#8220;standards&#8221; impos&#233;s par l&#8217;h&#233;t&#233;ronormativit&#233; puissent se d&#233;placer plus librement, sans sentiment de peur, sans crainte pour leur int&#233;grit&#233; physique.</p><p><br />On constate d&#233;j&#224;, en mati&#232;re de droits des femmes que de nombreuses dispositions p&#233;nales ne sont pas appliqu&#233;es. Toute la proc&#233;dure pour faire reculer ou pour d&#233;noncer les violences que les femmes subissent est sem&#233;e d&#8217;emb&#251;ches.</p><p><br />Le Groupe F, groupe d&#8217;action qui d&#233;nonce l&#8217;inapplication de la loi p&#233;nale, a d&#8217;ailleurs r&#233;colt&#233; il y a quelques semaines les t&#233;moignages de 500 femmes qui racontent les circonstances dans lesquelles leurs plaintes ont &#233;t&#233; recueillies. Selon ce groupe, 60% des d&#233;marches ont abouti sur un refus de prendre la plainte, ce qui est ill&#233;gal. Il s&#8217;agirait donc de ne pas ajouter un dispositif inefficace pour donner l&#8217;impression de faire quelque chose, mais plut&#244;t de s&#8217;assurer que l&#8217;existant fonctionne et est correctement appliqu&#233;.</p><p><br />Si nous plaidons pour une loi cadre, c&#8217;est pr&#233;cis&#233;ment parce que nous pensons que la cl&#233; pour lutter contre les violences faites aux femmes passe par le d&#233;veloppement massif de moyens &#224; destination de la pr&#233;vention et de l&#8217;&#233;ducation, ainsi que dans les services &#160;concern&#233;s par l&#8217;application de la loi existante (notamment la police et la justice).</p><p><br />Nous souhaitons donc que le dispositif soit &#233;valu&#233;, pour s&#8217;assurer de son efficacit&#233; et &#233;ventuellement le modifier &#224; l&#8217;aune des r&#233;sultats obtenus.</p>",
    "annexeExposeSommaire": {
      "@xmlns:xsi": "http://www.w3.org/2001/XMLSchema-instance",
      "@xsi:nil": "true"
    }
  },
  "representations": {
    "representation": {
      "nom": "PDF",
      "typeMime": {
        "type": "application",
        "subType": "PDF"
      },
      "statutRepresentation": {
        "verbatim": "true",
        "canonique": "true",
        "officielle": "true",
        "transcription": "false",
        "enregistrement": "false"
      },
      "repSource": {
        "@xmlns:xsi": "http://www.w3.org/2001/XMLSchema-instance",
        "@xsi:nil": "true"
      },
      "offset": {
        "@xmlns:xsi": "http://www.w3.org/2001/XMLSchema-instance",
        "@xsi:nil": "true"
      },
      "contenu": {
        "documentURI": "/15/amendements/0778/CION_LOIS/CL131.pdf"
      },
      "dateDispoRepresentation": {
        "@xmlns:xsi": "http://www.w3.org/2001/XMLSchema-instance",
        "@xsi:nil": "true"
      }
    }
  },
  "seanceDiscussion": {
    "@xmlns:xsi": "http://www.w3.org/2001/XMLSchema-instance",
    "@xsi:nil": "true"
  },
  "sort": {
    "dateSaisie": "2018-05-09T23:26:21.000+02:00",
    "sortEnSeance": "Rejeté"
  },
  "dateDepot": "2018-05-04T02:00:00.000+02:00",
  "dateDistribution": "2018-05-07T02:00:00.000+02:00",
  "article99": "0",
  "loiReference": {
    "codeLoi": "zzzz",
    "divisionCodeLoi": {
      "@xmlns:xsi": "http://www.w3.org/2001/XMLSchema-instance",
      "@xsi:nil": "true"
    }
  }
}