{
  "@xmlns": "http://schemas.assemblee-nationale.fr/referentiel",
  "uid": "AMANR5L15PO757134B1088P0D1N1461",
  "identifiant": {
    "legislature": "15",
    "numero": "1461",
    "numRect": "0",
    "saisine": {
      "refTexteLegislatif": "PRJLANR5L15B1088",
      "numeroPartiePLF": "0",
      "organeExamen": "PO757134",
      "mentionSecondeDeliberation": "0"
    }
  },
  "numeroLong": "1461",
  "etapeTexte": "1ère lecture (1ère assemblée saisie)",
  "triAmendement": "ahaaaaaaaaaaaaaaaaaaaaaaaaaaaaaaaaaaaaaaaaaaaaaaaaboav",
  "cardinaliteAmdtMultiples": "1",
  "amendementParent": {
    "@xmlns:xsi": "http://www.w3.org/2001/XMLSchema-instance",
    "@xsi:nil": "true"
  },
  "etat": "Discuté",
  "signataires": {
    "auteur": {
      "typeAuteur": "Depute",
      "acteurRef": "PA722086",
      "organeRef": {
        "@xmlns:xsi": "http://www.w3.org/2001/XMLSchema-instance",
        "@xsi:nil": "true"
      },
      "groupePolitiqueRef": "PO730964"
    },
    "cosignataires": {
      "acteurRef": [
        "PA719372",
        "PA718674",
        "PA720108",
        "PA720414",
        "PA719310",
        "PA719440",
        "PA720146",
        "PA719778",
        "PA722170",
        "PA720022",
        "PA719668",
        "PA720512",
        "PA721542",
        "PA719952",
        "PA606171",
        "PA720222",
        "PA722078",
        "PA722054",
        "PA719960",
        "PA719250",
        "PA722228",
        "PA721776",
        "PA719186",
        "PA719338",
        "PA722086",
        "PA721784",
        "PA642695",
        "PA720878",
        "PA718930",
        "PA721344",
        "PA720116",
        "PA721498",
        "PA718962",
        "PA721764",
        "PA721808",
        "PA719850",
        "PA721278"
      ]
    },
    "texteAffichable": "M.&#160;Taquet,  M.&#160;Mass&#233;glia, M.&#160;Girardin, M.&#160;Anato, M.&#160;Baich&#232;re, Mme&#160;Beaudouin-Hubiere, M.&#160;Bonnell, M.&#160;Bothorel, Mme&#160;Brunet, M.&#160;Cellier, M.&#160;Chassaing, Mme&#160;Crouzet, Mme&#160;Faure-Muntian, Mme&#160;Givernet, Mme&#160;Gomez-Bassac, Mme&#160;Gregoire, M.&#160;Guerini, Mme&#160;Hai, M.&#160;Jolivet, M.&#160;Kasbarian, Mme&#160;Khattabi, M.&#160;Lauzzana, Mme&#160;de Lavergne, M.&#160;Leclabart, Mme&#160;Melchior, Mme&#160;Mirall&#232;s, M.&#160;Mis, Mme&#160;Motin, M.&#160;Perrot, Mme&#160;Petel, M.&#160;Pietraszewski, Mme&#160;Oppelt, M.&#160;Saint-Martin, M.&#160;Savatier, Mme&#160;Verdier-Jouclas, M.&#160;Zulesi, M.&#160;Ferrand et les membres du groupe La R&#233;publique en Marche"
  },
  "pointeurFragmentTexte": {
    "missionVisee": {
      "@xmlns:xsi": "http://www.w3.org/2001/XMLSchema-instance",
      "@xsi:nil": "true"
    },
    "division": {
      "titre": "Article 5",
      "articleDesignationCourte": "APRÈS ART. 5",
      "type": "ARTICLE",
      "avant_A_Apres": "Après",
      "divisionRattachee": "APRÈS L'ARTICLE 5, insérer l'article suivant:",
      "articleAdditionnel": "1",
      "chapitreAdditionnel": {
        "@xmlns:xsi": "http://www.w3.org/2001/XMLSchema-instance",
        "@xsi:nil": "true"
      },
      "urlDivisionTexteVise": "/15/textes/1088.asp#D_Article_5"
    },
    "alinea": {
      "@xmlns:xsi": "http://www.w3.org/2001/XMLSchema-instance",
      "@xsi:nil": "true"
    }
  },
  "corps": {
    "dispositif": "<p style=\"text-align: justify;\">La loi n&#176;&#160;83&#8209;657 du 20 juillet 1983 relative au d&#233;veloppement de certaines activit&#233;s d&#8217;&#233;conomie sociale est ainsi modifi&#233;e&#160;:</p><p style=\"text-align: justify;\">1&#176;&#160;Apr&#232;s l&#8217;article&#160;1, il est ins&#233;r&#233; un article&#160;1&#8209;1 ainsi r&#233;dig&#233;&#160;:</p><p style=\"text-align: justify;\">&#171;&#160;<i>Art.&#160;1&#8209;1</i>.&#160;&#8211;&#160;Les relations entre l&#8217;associ&#233; coop&#233;rateur et la coop&#233;rative artisanale &#224; laquelle il adh&#232;re et entre une coop&#233;rative artisanale et l&#8217;union de soci&#233;t&#233;s coop&#233;ratives artisanales dont elle est membre sont notamment r&#233;gies par les principes et les r&#232;gles sp&#233;cifiques pr&#233;vus par le pr&#233;sent titre et par la loi n&#176;&#160;47&#8209;1775 du 10 septembre 1947 portant statut de la coop&#233;ration. Cette relation est d&#233;finie dans les statuts de la coop&#233;rative artisanale ou de l&#8217;union de soci&#233;t&#233;s coop&#233;ratives artisanales et, au besoin, dans leur r&#232;glement int&#233;rieur. Elle repose, notamment, sur le caract&#232;re indissociable de la double qualit&#233; d&#8217;utilisateur des services et d&#8217;associ&#233; de la coop&#233;rative artisanale ou de l&#8217;union de soci&#233;t&#233;s coop&#233;ratives artisanales.&#160;&#187;&#160;;</p><p style=\"text-align: justify;\">2&#176;&#160;Les deuxi&#232;me et troisi&#232;me phrases du premier alin&#233;a de l&#8217;article&#160;18 sont remplac&#233;es par trois phrases ainsi r&#233;dig&#233;es&#160;:</p><p style=\"text-align: justify;\">&#171;&#160;Deux tiers au moins de ces mandataires sont des associ&#233;s de la cat&#233;gorie pr&#233;vue au 1&#176; de l&#8217;article&#160;6 de la pr&#233;sente loi, des conjoints collaborateurs mentionn&#233;s au r&#233;pertoire des m&#233;tiers ou au registre tenu par les chambres de m&#233;tiers d&#8217;Alsace et de Moselle, des conjoints associ&#233;s ou des conjoints salari&#233;s. Le pr&#233;sident du conseil d&#8217;administration, le pr&#233;sident du directoire, le g&#233;rant unique ou deux tiers des g&#233;rants s&#8217;ils sont plusieurs, le pr&#233;sident du conseil de surveillance, notamment lorsque ce dernier est d&#233;sign&#233; dans les conditions fix&#233;es &#224; l&#8217;article&#160;19, et le vice-pr&#233;sident du conseil de surveillance sont choisis parmi les mandataires mentionn&#233;s &#224; la deuxi&#232;me phrase du pr&#233;sent article. Lorsque la personne d&#233;sign&#233;e est une personne morale, elle peut &#234;tre repr&#233;sent&#233;e par son repr&#233;sentant l&#233;gal, le conjoint collaborateur mentionn&#233; en cette qualit&#233; au r&#233;pertoire des m&#233;tiers ou au registre tenu par les chambres de m&#233;tiers d&#8217;Alsace et de Moselle, le conjoint associ&#233; ou le conjoint salari&#233;.&#160;&#187;</p>",
    "exposeSommaire": "<p style=\"text-align: justify;\">Le pr&#233;sent amendement vise &#224; moderniser le statut coop&#233;ratif artisanal fix&#233; par la loi du n&#176;&#160;83&#8209;657 du 20 juillet 1983 relative au d&#233;veloppement de certaines activit&#233;s d&#8217;&#233;conomie sociale et &#224; y apporter des corrections techniques.</p><p style=\"text-align: justify;\">Il pr&#233;voit en premier lieu de d&#233;finir le contrat coop&#233;ratif au sein d&#8217;un nouvel article&#160;1&#8209;1 afin de s&#233;curiser la relation associ&#233;-coop&#233;rative, celle-ci s&#8217;inscrivant dans un cadre juridique sp&#233;cifique distinct d&#8217;autres r&#233;gimes (sous-traitance, notamment). Les cessions de produits et fournitures de services effectu&#233;es par la coop&#233;rative au profit d&#8217;un associ&#233; entrent dans l&#8217;ex&#233;cution du contrat de soci&#233;t&#233; et ne peuvent par exemple pas &#234;tre requalifi&#233;s en contrat de vente ce qui entra&#238;ne l&#8217;exclusion de l&#8217;application de certaines r&#232;gles comme celles relatives aux d&#233;lais de paiement.</p><p style=\"text-align: justify;\">Il pr&#233;voit &#233;galement de r&#233;&#233;crire partiellement l&#8217;article&#160;18 relatif aux conditions de nomination des membres des organes d&#8217;administration des soci&#233;t&#233;s coop&#233;ratives. Il s&#8217;agit de permettre aux conjoints des chefs d&#8217;entreprise membres de la soci&#233;t&#233; coop&#233;rative (entrepreneurs individuels ou repr&#233;sentants l&#233;gaux de personnes morales) de si&#233;ger quel que soit leur statut - collaborateur, associ&#233; ou salari&#233; - dans les organes d&#8217;administration de la coop&#233;rative et, le cas &#233;ch&#233;ant, d&#8217;en assurer les fonctions de pr&#233;sidence.</p><p style=\"text-align: justify;\">L&#8217;amendement propose enfin de clarifier la r&#233;daction de l&#8217;article&#160;18 en pr&#233;cisant que le pr&#233;sident de l&#8217;instance d&#8217;administration est &#233;lu en tant qu&#8217;associ&#233;, personne physique ou morale immatricul&#233;e au r&#233;pertoire des m&#233;tiers. Le projet pr&#233;cise &#233;galement que cette personne morale est alors repr&#233;sent&#233;e par son repr&#233;sentant l&#233;gal ou par le conjoint collaborateur, associ&#233; ou salari&#233; de celle-ci.</p>",
    "annexeExposeSommaire": {
      "@xmlns:xsi": "http://www.w3.org/2001/XMLSchema-instance",
      "@xsi:nil": "true"
    }
  },
  "representations": {
    "representation": {
      "nom": "PDF",
      "typeMime": {
        "type": "application",
        "subType": "PDF"
      },
      "statutRepresentation": {
        "verbatim": "true",
        "canonique": "true",
        "officielle": "true",
        "transcription": "false",
        "enregistrement": "false"
      },
      "repSource": {
        "@xmlns:xsi": "http://www.w3.org/2001/XMLSchema-instance",
        "@xsi:nil": "true"
      },
      "offset": {
        "@xmlns:xsi": "http://www.w3.org/2001/XMLSchema-instance",
        "@xsi:nil": "true"
      },
      "contenu": {
        "documentURI": "/15/amendements/1088/CSPACTE/1461.pdf"
      },
      "dateDispoRepresentation": {
        "@xmlns:xsi": "http://www.w3.org/2001/XMLSchema-instance",
        "@xsi:nil": "true"
      }
    }
  },
  "seanceDiscussion": {
    "@xmlns:xsi": "http://www.w3.org/2001/XMLSchema-instance",
    "@xsi:nil": "true"
  },
  "sort": {
    "dateSaisie": "2018-09-06T22:51:01.000+02:00",
    "sortEnSeance": "Adopté"
  },
  "dateDepot": "2018-09-03T02:00:00.000+02:00",
  "dateDistribution": "2018-09-06T02:00:00.000+02:00",
  "article99": "0",
  "loiReference": {
    "codeLoi": "83-657",
    "divisionCodeLoi": "1"
  }
}