{
  "@xmlns": "http://schemas.assemblee-nationale.fr/referentiel",
  "uid": "AMANR5L15PO766718B2187P0D1N639",
  "identifiant": {
    "legislature": "15",
    "numero": "639",
    "numRect": "0",
    "saisine": {
      "refTexteLegislatif": "PRJLANR5L15B2187",
      "numeroPartiePLF": "0",
      "organeExamen": "PO766718",
      "mentionSecondeDeliberation": "0"
    }
  },
  "numeroLong": "639",
  "etapeTexte": "1ère lecture (1ère assemblée saisie)",
  "triAmendement": "acaaaaaaaaaaaaaaaaaaaaaaaaaaaaaaaaaaaaaaaaaaaaaaaataabtarzzs",
  "cardinaliteAmdtMultiples": "1",
  "amendementParent": {
    "@xmlns:xsi": "http://www.w3.org/2001/XMLSchema-instance",
    "@xsi:nil": "true"
  },
  "etat": "Discuté",
  "signataires": {
    "auteur": {
      "typeAuteur": "Depute",
      "acteurRef": "PA642847",
      "organeRef": {
        "@xmlns:xsi": "http://www.w3.org/2001/XMLSchema-instance",
        "@xsi:nil": "true"
      },
      "groupePolitiqueRef": "PO730934"
    },
    "cosignataires": {
      "acteurRef": [
        "PA605991",
        "PA709315",
        "PA642847",
        "PA267289",
        "PA767"
      ]
    },
    "texteAffichable": "M.&#160;Bazin,  M.&#160;Cattin, M.&#160;Door, M.&#160;Viala et Mme&#160;Genevard"
  },
  "pointeurFragmentTexte": {
    "missionVisee": {
      "@xmlns:xsi": "http://www.w3.org/2001/XMLSchema-instance",
      "@xsi:nil": "true"
    },
    "division": {
      "titre": "Article PREMIER",
      "articleDesignationCourte": "ART. PREMIER",
      "type": "ARTICLE",
      "avant_A_Apres": "A",
      "divisionRattachee": "ARTICLE PREMIER",
      "articleAdditionnel": {
        "@xmlns:xsi": "http://www.w3.org/2001/XMLSchema-instance",
        "@xsi:nil": "true"
      },
      "chapitreAdditionnel": {
        "@xmlns:xsi": "http://www.w3.org/2001/XMLSchema-instance",
        "@xsi:nil": "true"
      },
      "urlDivisionTexteVise": "/15/textes/2187.asp#D_Article_1er"
    },
    "alinea": {
      "avant_A_Apres": "A",
      "numero": "6",
      "alineaDesignation": "Alinéa 6"
    }
  },
  "corps": {
    "dispositif": "<p style=\"text-align: justify;\">R&#233;diger ainsi la premi&#232;re phrase de l&#8217;alin&#233;a&#160;6&#160;: </p><p style=\"text-align: justify;\">&#171;&#160;L&#8217;&#226;ge limite de la femme pour b&#233;n&#233;ficier d&#8217;une assistance m&#233;dicale &#224; la procr&#233;ation est fix&#233; &#224; quarante-trois ans.&#160;&#187;</p>",
    "exposeSommaire": "<p style=\"text-align: justify;\">A partir de 38 ans, les taux de grossesse en assistance m&#233;dicale &#224; la procr&#233;ation chutent&#160;: alors qu&#8217;ils sont sup&#233;rieurs &#224; 25&#160;% avant 37 ans, ils passent &#224; 12&#160;% &#224; 38 ans, puis 9&#160;% &#224; 40 ans et 5&#160;% &#224; 42 ans.</p><p style=\"text-align: justify;\">Les risques pour la sant&#233; de la femme sont aussi plus importants.</p><p style=\"text-align: justify;\">C&#8217;est pourquoi la S&#233;curit&#233; Sociale a fix&#233; comme limite d&#8217;&#226;ge &#224; la prise en charge &#224; 43 ans pour une FIV.</p><p style=\"text-align: justify;\">Il convient donc de poser clairement cette limite d&#8217;&#226;ge dans la loi.</p><p style=\"text-align: justify;\">Tel est le sens de cet amendement.</p>",
    "annexeExposeSommaire": {
      "@xmlns:xsi": "http://www.w3.org/2001/XMLSchema-instance",
      "@xsi:nil": "true"
    },
    "cartoucheDelaiDepotDepasse": {
      "@xmlns:xsi": "http://www.w3.org/2001/XMLSchema-instance",
      "@xsi:nil": "true"
    },
    "avantAppel": {
      "@xmlns:xsi": "http://www.w3.org/2001/XMLSchema-instance",
      "@xsi:nil": "true"
    }
  },
  "representations": {
    "representation": {
      "nom": "PDF",
      "typeMime": {
        "type": "application",
        "subType": "PDF"
      },
      "statutRepresentation": {
        "verbatim": "true",
        "canonique": "true",
        "officielle": "true",
        "transcription": "false",
        "enregistrement": "false"
      },
      "repSource": {
        "@xmlns:xsi": "http://www.w3.org/2001/XMLSchema-instance",
        "@xsi:nil": "true"
      },
      "offset": {
        "@xmlns:xsi": "http://www.w3.org/2001/XMLSchema-instance",
        "@xsi:nil": "true"
      },
      "contenu": {
        "documentURI": "/15/amendements/2187/CSBIOETH/639.pdf"
      },
      "dateDispoRepresentation": {
        "@xmlns:xsi": "http://www.w3.org/2001/XMLSchema-instance",
        "@xsi:nil": "true"
      }
    }
  },
  "seanceDiscussion": {
    "@xmlns:xsi": "http://www.w3.org/2001/XMLSchema-instance",
    "@xsi:nil": "true"
  },
  "sort": {
    "dateSaisie": "2019-09-11T11:51:46.000+02:00",
    "sortEnSeance": "Rejeté"
  },
  "dateDepot": "2019-09-03T02:00:00.000+02:00",
  "dateDistribution": "2019-09-09T02:00:00.000+02:00",
  "article99": "0",
  "loiReference": {
    "codeLoi": "R1",
    "divisionCodeLoi": {
      "@xmlns:xsi": "http://www.w3.org/2001/XMLSchema-instance",
      "@xsi:nil": "true"
    }
  }
}