{
  "@xmlns": "http://schemas.assemblee-nationale.fr/referentiel",
  "uid": "AMANR5L15SEA717460BTC1237P0D1N653",
  "identifiant": {
    "legislature": "15",
    "numero": "653",
    "numRect": "0",
    "saisine": {
      "refTexteLegislatif": "PRJLANR5L15BTC1237",
      "numeroPartiePLF": "0",
      "organeExamen": "PO717460",
      "mentionSecondeDeliberation": "1"
    }
  },
  "numeroLong": "653",
  "etapeTexte": "1ère lecture (1ère assemblée saisie)",
  "triAmendement": "maaaaaaaaaaaaaaaaaaaaaaaaaaaaaaaaaaaaaaaaaaaaaaaaafb",
  "cardinaliteAmdtMultiples": "1",
  "amendementParent": {
    "@xmlns:xsi": "http://www.w3.org/2001/XMLSchema-instance",
    "@xsi:nil": "true"
  },
  "etat": "Discuté",
  "signataires": {
    "auteur": {
      "typeAuteur": "Depute",
      "acteurRef": "PA709315",
      "organeRef": {
        "@xmlns:xsi": "http://www.w3.org/2001/XMLSchema-instance",
        "@xsi:nil": "true"
      },
      "groupePolitiqueRef": "PO730934"
    },
    "cosignataires": {
      "acteurRef": [
        "PA721474",
        "PA721314",
        "PA609245",
        "PA608016",
        "PA718784",
        "PA718838",
        "PA334149",
        "PA334654",
        "PA856",
        "PA709315",
        "PA712015",
        "PA721286",
        "PA719318",
        "PA721070",
        "PA346218",
        "PA346054",
        "PA336316",
        "PA718884",
        "PA266808",
        "PA718780",
        "PA330909"
      ]
    },
    "texteAffichable": "M.&#160;Viala,  M.&#160;Fasquelle, Mme&#160;Anthoine, Mme&#160;Bazin-Malgras, M.&#160;Brun, M.&#160;Straumann, M.&#160;Emmanuel&#160;Maquet, M.&#160;Cherpion, M.&#160;Masson, M.&#160;Bouchet, Mme&#160;Ramassamy, M.&#160;Dive, Mme&#160;Louwagie, M.&#160;Pauget, M.&#160;Ramadier, Mme&#160;Lacroute, M.&#160;Schellenberger, M.&#160;Rolland, M.&#160;Viry, Mme&#160;Trastour-Isnart et M.&#160;Descoeur"
  },
  "pointeurFragmentTexte": {
    "missionVisee": {
      "@xmlns:xsi": "http://www.w3.org/2001/XMLSchema-instance",
      "@xsi:nil": "true"
    },
    "division": {
      "titre": "Article 61",
      "articleDesignationCourte": "ART. 61",
      "type": "ARTICLE",
      "avant_A_Apres": "A",
      "divisionRattachee": "ARTICLE 61",
      "articleAdditionnel": {
        "@xmlns:xsi": "http://www.w3.org/2001/XMLSchema-instance",
        "@xsi:nil": "true"
      },
      "chapitreAdditionnel": {
        "@xmlns:xsi": "http://www.w3.org/2001/XMLSchema-instance",
        "@xsi:nil": "true"
      },
      "urlDivisionTexteVise": "/15/textes/1237.asp#D_Article_61"
    },
    "alinea": {
      "avant_A_Apres": {
        "@xmlns:xsi": "http://www.w3.org/2001/XMLSchema-instance",
        "@xsi:nil": "true"
      },
      "numero": "9",
      "alineaDesignation": {
        "@xmlns:xsi": "http://www.w3.org/2001/XMLSchema-instance",
        "@xsi:nil": "true"
      }
    }
  },
  "corps": {
    "dispositif": "<p style=\"text-align: justify;\">&#192; l&#8217;alin&#233;a&#160;9, apr&#232;s le mot&#160;:</p><p style=\"text-align: justify;\">&#171;&#160;sociaux&#160;&#187;, </p><p style=\"text-align: justify;\">ins&#233;rer les mots&#160;: </p><p style=\"text-align: justify;\">&#171;&#160;, &#233;conomiques, d&#8217;emploi&#160;&#187;.</p>",
    "exposeSommaire": "<p style=\"text-align: justify;\">La volont&#233; du gouvernement de repositionner l&#8217;entreprise dans son environnement social, soci&#233;tal et environnemental et de lui donner une dimension pleine et enti&#232;re dans notre soci&#233;t&#233; et compr&#233;hensible et m&#234;me louable mais il n&#8217;en demeure pas moins essentiel, si l&#8217;on proc&#232;de &#224; l&#8217;inscription explicite dans la loi de ses diff&#233;rentes fonctions, de rappeler aussi son r&#244;le en mati&#232;re &#233;conomique et d&#8217;emploi.</p>",
    "annexeExposeSommaire": {
      "@xmlns:xsi": "http://www.w3.org/2001/XMLSchema-instance",
      "@xsi:nil": "true"
    }
  },
  "representations": {
    "representation": {
      "nom": "PDF",
      "typeMime": {
        "type": "application",
        "subType": "PDF"
      },
      "statutRepresentation": {
        "verbatim": "true",
        "canonique": "true",
        "officielle": "true",
        "transcription": "false",
        "enregistrement": "false"
      },
      "repSource": {
        "@xmlns:xsi": "http://www.w3.org/2001/XMLSchema-instance",
        "@xsi:nil": "true"
      },
      "offset": {
        "@xmlns:xsi": "http://www.w3.org/2001/XMLSchema-instance",
        "@xsi:nil": "true"
      },
      "contenu": {
        "documentURI": "/15/amendements/1237/AN/653.pdf"
      },
      "dateDispoRepresentation": {
        "@xmlns:xsi": "http://www.w3.org/2001/XMLSchema-instance",
        "@xsi:nil": "true"
      }
    }
  },
  "seanceDiscussion": "RUANR5L15S2019IDS21349",
  "sort": {
    "dateSaisie": "2018-10-05T10:22:37.000+02:00",
    "sortEnSeance": "Rejeté"
  },
  "dateDepot": "2018-09-19T02:00:00.000+02:00",
  "dateDistribution": "2018-09-26T02:00:00.000+02:00",
  "article99": "0",
  "loiReference": {
    "codeLoi": {
      "@xmlns:xsi": "http://www.w3.org/2001/XMLSchema-instance",
      "@xsi:nil": "true"
    },
    "divisionCodeLoi": {
      "@xmlns:xsi": "http://www.w3.org/2001/XMLSchema-instance",
      "@xsi:nil": "true"
    }
  }
}