{
  "@xmlns": "http://schemas.assemblee-nationale.fr/referentiel",
  "uid": "AMANR5L15PO420120B1681P0D1N1270",
  "identifiant": {
    "legislature": "15",
    "numero": "1270",
    "numRect": "0",
    "saisine": {
      "refTexteLegislatif": "PRJLANR5L15B1681",
      "numeroPartiePLF": "0",
      "organeExamen": "PO420120",
      "mentionSecondeDeliberation": "0"
    }
  },
  "numeroLong": "AS1270",
  "etapeTexte": "1ère lecture (1ère assemblée saisie)",
  "triAmendement": "dkaaaaaaaaaaaaaaaaaaaaaaaaaaaaaaaaaaaaaaaaaaaaaaaaofi",
  "cardinaliteAmdtMultiples": "1",
  "amendementParent": {
    "@xmlns:xsi": "http://www.w3.org/2001/XMLSchema-instance",
    "@xsi:nil": "true"
  },
  "etat": "Discuté",
  "signataires": {
    "auteur": {
      "typeAuteur": "Depute",
      "acteurRef": "PA720286",
      "organeRef": {
        "@xmlns:xsi": "http://www.w3.org/2001/XMLSchema-instance",
        "@xsi:nil": "true"
      },
      "groupePolitiqueRef": "PO730958"
    },
    "cosignataires": {
      "acteurRef": [
        "PA718868",
        "PA720892",
        "PA720422",
        "PA721226",
        "PA719676",
        "PA720286",
        "PA720846",
        "PA2150",
        "PA588884",
        "PA721960",
        "PA718860",
        "PA719578",
        "PA721202",
        "PA721062",
        "PA720430",
        "PA721210",
        "PA722142"
      ]
    },
    "texteAffichable": "Mme&#160;Fiat,  Mme&#160;Autain, M.&#160;Bernalicis, M.&#160;Coquerel, M.&#160;Corbi&#232;re, M.&#160;Lachaud, M.&#160;Larive, M.&#160;M&#233;lenchon, Mme&#160;Obono, Mme&#160;Panot, M.&#160;Prud&apos;homme, M.&#160;Quatennens, M.&#160;Ratenon, Mme&#160;Ressiguier, Mme&#160;Rubin, M.&#160;Ruffin et Mme&#160;Taurine"
  },
  "pointeurFragmentTexte": {
    "missionVisee": {
      "@xmlns:xsi": "http://www.w3.org/2001/XMLSchema-instance",
      "@xsi:nil": "true"
    },
    "division": {
      "titre": "Article 11",
      "articleDesignationCourte": "ART. 11",
      "type": "ARTICLE",
      "avant_A_Apres": "A",
      "divisionRattachee": "ARTICLE 11",
      "articleAdditionnel": {
        "@xmlns:xsi": "http://www.w3.org/2001/XMLSchema-instance",
        "@xsi:nil": "true"
      },
      "chapitreAdditionnel": {
        "@xmlns:xsi": "http://www.w3.org/2001/XMLSchema-instance",
        "@xsi:nil": "true"
      },
      "urlDivisionTexteVise": "/15/textes/1681.asp#D_Article_11"
    },
    "alinea": {
      "avant_A_Apres": {
        "@xmlns:xsi": "http://www.w3.org/2001/XMLSchema-instance",
        "@xsi:nil": "true"
      },
      "numero": "48",
      "alineaDesignation": {
        "@xmlns:xsi": "http://www.w3.org/2001/XMLSchema-instance",
        "@xsi:nil": "true"
      }
    }
  },
  "corps": {
    "dispositif": "<p style=\"text-align: justify;\">Compl&#233;<i>ter</i> l&#8217;alin&#233;a&#160;48 par la phrase suivante&#160;:</p><p style=\"text-align: justify;\">&#171;&#160;Il assure la cyberprotection des donn&#233;es de sant&#233; dont il dispose.&#160;&#187;</p>",
    "exposeSommaire": "<p style=\"text-align: justify;\">Selon un article des Echos de f&#233;vrier 2019, aux &#201;tats-Unis, 176 millions de dossiers de sant&#233; ont &#233;t&#233; pirat&#233;s entre 2010 et 2017&#160;! En janvier 2015, c&#8217;est la compagnie d&#8217;assurance sant&#233; am&#233;ricaine Anthem qui se faisait pirater plusieurs dizaines de millions de dossiers de clients comprenant leurs noms, dates de naissance, num&#233;ros de s&#233;curit&#233; sociale, informations m&#233;dicales, revenus, etc. R&#233;guli&#232;rement, de nouvelles fuites de donn&#233;es de sant&#233; ont lieu. Ces derni&#232;res font l&#8217;objet de cyberattaques redoutables qui menacent la protection d&#8217;informations particuli&#232;rement sensibles. Et il suffit d&#8217;une fuite, pour que les cons&#233;quences soient quasi-irr&#233;versibles. En France, en 2015, c&#8217;est le laboratoire de biologie m&#233;dicale Labio qui se faisait hacker et voler des centaines de bilans m&#233;dicaux et d&#8217;analyses sanguines. De nombreux acteurs priv&#233;s lorgnent d&#8217;ores et d&#233;j&#224; la Plateforme des donn&#233;es de sant&#233; que cet article pr&#233;voit de mettre en place. Or pseudonymiser les donn&#233;es n&#8217;apporte aucune garantie. C&#233;dric Villani lui-m&#234;me le reconnaissait lors de son audition &#224; l&#8217;Assembl&#233;e nationale le 7 novembre 2018&#160;: &#171;&#160;Se contenter de pseudonymiser les donn&#233;es n&#8217;est pas suffisant, car il est assez facile en pratique&#160;&#8211;&#160;et ce le sera de plus en plus&#160;&#8211;&#160;de les r&#233;identifier dans bien des situations. Cela a &#233;t&#233; d&#233;montr&#233; de fa&#231;on spectaculaire aux &#201;tats-Unis par l&#8217;&#233;quipe de Latanya Sweeney qui a, dans des bases de donn&#233;es de sant&#233; publiques, accessibles, r&#233;identifi&#233; le dossier du gouverneur du Massachusetts.&#160;&#187;</p><p style=\"text-align: justify;\"><br />Dans ces conditions, il serait dramatique de ne pas mettre en place un syst&#232;me de cybers&#233;curit&#233; efficient pour prot&#233;ger les donn&#233;es de sant&#233; qui seront partag&#233;es sur cette Plate-forme.<br />Le pr&#233;sent article indique que le groupement d&#8217;int&#233;r&#234;t public d&#233;nomm&#233; &#171;&#160;Plateforme des donn&#233;es de sant&#233;&#160;&#187; sera charg&#233; de contribuer &#224; l&#8217;&#233;laboration de r&#233;f&#233;rentiels et de m&#233;thodologies de r&#233;f&#233;rence au sens du b du 2&#176; de l&#8217;article&#160;8 de la loi n&#176;78&#8209;17 du 6 janvier 1978 relative &#224; l&#8217;informatique et aux libert&#233;s. Or, ces r&#233;f&#233;rentiels et m&#233;thodologies tel que d&#233;crits dans la loi du 6 janvier 1978 ne font d&#8217;aucune mani&#232;re r&#233;f&#233;rence &#224; un haut-risque de cyberattaque.&#160;</p><p style=\"text-align: justify;\"><br />Par cet amendement, nous voulons garantir que les donn&#233;es de sant&#233; des fran&#231;ais feront l&#8217;objet d&#8217;un syst&#232;me de cybers&#233;curit&#233;.</p>",
    "annexeExposeSommaire": {
      "@xmlns:xsi": "http://www.w3.org/2001/XMLSchema-instance",
      "@xsi:nil": "true"
    },
    "cartoucheDelaiDepotDepasse": {
      "@xmlns:xsi": "http://www.w3.org/2001/XMLSchema-instance",
      "@xsi:nil": "true"
    }
  },
  "representations": {
    "representation": {
      "nom": "PDF",
      "typeMime": {
        "type": "application",
        "subType": "PDF"
      },
      "statutRepresentation": {
        "verbatim": "true",
        "canonique": "true",
        "officielle": "true",
        "transcription": "false",
        "enregistrement": "false"
      },
      "repSource": {
        "@xmlns:xsi": "http://www.w3.org/2001/XMLSchema-instance",
        "@xsi:nil": "true"
      },
      "offset": {
        "@xmlns:xsi": "http://www.w3.org/2001/XMLSchema-instance",
        "@xsi:nil": "true"
      },
      "contenu": {
        "documentURI": "/15/amendements/1681/CION-SOC/AS1270.pdf"
      },
      "dateDispoRepresentation": {
        "@xmlns:xsi": "http://www.w3.org/2001/XMLSchema-instance",
        "@xsi:nil": "true"
      }
    }
  },
  "seanceDiscussion": {
    "@xmlns:xsi": "http://www.w3.org/2001/XMLSchema-instance",
    "@xsi:nil": "true"
  },
  "sort": {
    "dateSaisie": "2019-03-14T00:36:22.000+01:00",
    "sortEnSeance": "Rejeté"
  },
  "dateDepot": "2019-03-08T01:00:00.000+01:00",
  "dateDistribution": "2019-03-12T01:00:00.000+01:00",
  "article99": "0",
  "loiReference": {
    "codeLoi": {
      "@xmlns:xsi": "http://www.w3.org/2001/XMLSchema-instance",
      "@xsi:nil": "true"
    },
    "divisionCodeLoi": {
      "@xmlns:xsi": "http://www.w3.org/2001/XMLSchema-instance",
      "@xsi:nil": "true"
    }
  }
}