{
  "@xmlns": "http://schemas.assemblee-nationale.fr/referentiel",
  "uid": "AMANR5L15SEA717460BTC1019P0D1N519",
  "identifiant": {
    "legislature": "15",
    "numero": "519",
    "numRect": "0",
    "saisine": {
      "refTexteLegislatif": "PRJLANR5L15BTC1019",
      "numeroPartiePLF": "0",
      "organeExamen": "PO717460",
      "mentionSecondeDeliberation": "1"
    }
  },
  "numeroLong": "519",
  "etapeTexte": "1ère lecture (1ère assemblée saisie)",
  "triAmendement": "ci",
  "cardinaliteAmdtMultiples": "1",
  "amendementParent": {
    "@xmlns:xsi": "http://www.w3.org/2001/XMLSchema-instance",
    "@xsi:nil": "true"
  },
  "etat": "Discuté",
  "signataires": {
    "auteur": {
      "typeAuteur": "Depute",
      "acteurRef": "PA608416",
      "organeRef": {
        "@xmlns:xsi": "http://www.w3.org/2001/XMLSchema-instance",
        "@xsi:nil": "true"
      },
      "groupePolitiqueRef": "PO730934"
    },
    "cosignataires": {
      "acteurRef": [
        "PA721506",
        "PA334654",
        "PA266776",
        "PA642847",
        "PA2792",
        "PA267378",
        "PA719318",
        "PA721314",
        "PA718784",
        "PA2155",
        "PA1874",
        "PA605991",
        "PA267450",
        "PA266793",
        "PA718780",
        "PA332523",
        "PA2529",
        "PA608016",
        "PA346218",
        "PA608416",
        "PA267204",
        "PA606712",
        "PA856",
        "PA718884"
      ]
    },
    "texteAffichable": "M.&#160;Hetzel,  Mme&#160;Levy, M.&#160;Cherpion, M.&#160;Pauget, M.&#160;Straumann, M.&#160;Sermier, M.&#160;Le Fur, M.&#160;Bony, Mme&#160;Kuster, Mme&#160;Trastour-Isnart, M.&#160;Schellenberger, Mme&#160;Dalloz, M.&#160;R&#233;mi&#160;Delatte, M.&#160;Masson, M.&#160;Taugourdeau, M.&#160;Bazin, Mme&#160;Louwagie, Mme&#160;Anthoine, Mme&#160;Bazin-Malgras, M.&#160;Menuel, M.&#160;Reiss, M.&#160;Lurton, Mme&#160;Genevard et M.&#160;Reitzer"
  },
  "pointeurFragmentTexte": {
    "missionVisee": {
      "@xmlns:xsi": "http://www.w3.org/2001/XMLSchema-instance",
      "@xsi:nil": "true"
    },
    "division": {
      "titre": "Article 63",
      "articleDesignationCourte": "ART. 63",
      "type": "ARTICLE",
      "avant_A_Apres": "A",
      "divisionRattachee": "ARTICLE 63",
      "articleAdditionnel": {
        "@xmlns:xsi": "http://www.w3.org/2001/XMLSchema-instance",
        "@xsi:nil": "true"
      },
      "chapitreAdditionnel": {
        "@xmlns:xsi": "http://www.w3.org/2001/XMLSchema-instance",
        "@xsi:nil": "true"
      },
      "urlDivisionTexteVise": "/15/textes/1019.asp#D_Article_63"
    },
    "alinea": {
      "@xmlns:xsi": "http://www.w3.org/2001/XMLSchema-instance",
      "@xsi:nil": "true"
    }
  },
  "corps": {
    "dispositif": "<p>Supprimer cet article.</p>",
    "exposeSommaire": "<p style=\"text-align: justify;\">Cet article vise &#224; permettre aux fonctionnaires de la fonction publique de l&#8217;&#201;tat, en disponibilit&#233; qui exercent une activit&#233; professionnelle de conserver, pendant cinq ans au maximum, leurs droits &#224; l&#8217;avancement. Cette p&#233;riode pourra m&#234;me &#234;tre prise en compte pour une promotion &#224; un grade &#224; acc&#232;s fonctionnel.</p><p style=\"text-align: justify;\">Le III de cet article indique que &#171;&#160;les dispositions du pr&#233;sent article sont applicables &#224; l&#8217;ensemble des corps et notamment &#224; ceux recrutant par la voie de l&#8217;&#201;cole nationale d&#8217;administration et de l&#8217;&#201;cole polytechnique et aux corps de niveau comparable&#160;&#187;. On peut s&#8217;&#233;tonner que la haute fonction publique ne fasse pas partie de &#171;&#160;l&#8217;ensemble des corps&#160;&#187; au point de la nommer de fa&#231;on sp&#233;cifique.</p><p style=\"text-align: justify;\">Il est pour le moins surprenant de voir cet article dans un projet de loi consacr&#233; &#224; la formation et &#224; l&#8217;assurance ch&#244;mage.</p><p style=\"text-align: justify;\">Alors que le Premier ministre a annonc&#233; un &#171;&#160;big bang&#160;&#187; de la fonction publique et un projet de loi en 2019 pr&#233;voyant une refonte profonde de la fonction publique et du statut de ses agents, il convient de supprimer cet article pour l&#8217;ins&#233;rer &#233;ventuellement dans un projet de loi sp&#233;cifique sur la fonction publique.</p>",
    "annexeExposeSommaire": {
      "@xmlns:xsi": "http://www.w3.org/2001/XMLSchema-instance",
      "@xsi:nil": "true"
    }
  },
  "representations": {
    "representation": {
      "nom": "PDF",
      "typeMime": {
        "type": "application",
        "subType": "PDF"
      },
      "statutRepresentation": {
        "verbatim": "true",
        "canonique": "true",
        "officielle": "true",
        "transcription": "false",
        "enregistrement": "false"
      },
      "repSource": {
        "@xmlns:xsi": "http://www.w3.org/2001/XMLSchema-instance",
        "@xsi:nil": "true"
      },
      "offset": {
        "@xmlns:xsi": "http://www.w3.org/2001/XMLSchema-instance",
        "@xsi:nil": "true"
      },
      "contenu": {
        "documentURI": "/15/amendements/1019/AN/519.pdf"
      },
      "dateDispoRepresentation": {
        "@xmlns:xsi": "http://www.w3.org/2001/XMLSchema-instance",
        "@xsi:nil": "true"
      }
    }
  },
  "seanceDiscussion": "RUANR5L15S2018IDS21106",
  "sort": {
    "dateSaisie": "2018-06-16T03:18:02.000+02:00",
    "sortEnSeance": "Rejeté"
  },
  "dateDepot": "2018-06-06T02:00:00.000+02:00",
  "dateDistribution": "2018-06-12T02:00:00.000+02:00",
  "article99": "0",
  "loiReference": {
    "codeLoi": {
      "@xmlns:xsi": "http://www.w3.org/2001/XMLSchema-instance",
      "@xsi:nil": "true"
    },
    "divisionCodeLoi": {
      "@xmlns:xsi": "http://www.w3.org/2001/XMLSchema-instance",
      "@xsi:nil": "true"
    }
  }
}