{
  "@xmlns": "http://schemas.assemblee-nationale.fr/referentiel",
  "uid": "AMANR5L15SEA717460BTC1974P0D1N188",
  "identifiant": {
    "legislature": "15",
    "numero": "188",
    "numRect": "0",
    "saisine": {
      "refTexteLegislatif": "PRJLANR5L15BTC1974",
      "numeroPartiePLF": "0",
      "organeExamen": "PO717460",
      "mentionSecondeDeliberation": "0"
    }
  },
  "numeroLong": "188",
  "etapeTexte": "1ère lecture (2ème assemblée saisie)",
  "triAmendement": "hiaaaoaaaaaaaaaaaaaaaaaaaaaaaaaaaaaaaaaaaaaaaaaaaahzzzzzzzzzzzzzzzzzzzzzzzzzzzzzzzzzzzzzzzzzzzzzzzzzzzzzzzzzzzzzzzzzzzps",
  "cardinaliteAmdtMultiples": "1",
  "amendementParent": {
    "@xmlns:xsi": "http://www.w3.org/2001/XMLSchema-instance",
    "@xsi:nil": "true"
  },
  "etat": "Discuté",
  "signataires": {
    "auteur": {
      "typeAuteur": "Depute",
      "acteurRef": "PA718850",
      "organeRef": {
        "@xmlns:xsi": "http://www.w3.org/2001/XMLSchema-instance",
        "@xsi:nil": "true"
      },
      "groupePolitiqueRef": "PO730934"
    },
    "cosignataires": {
      "acteurRef": [
        "PA267429",
        "PA718780",
        "PA767",
        "PA340853",
        "PA718850",
        "PA718884",
        "PA267735",
        "PA266793",
        "PA336316",
        "PA608416",
        "PA719318"
      ]
    },
    "texteAffichable": "M.&#160;Cordier,  M.&#160;Cinieri, Mme&#160;Anthoine, Mme&#160;Bazin-Malgras, M.&#160;Leclerc, M.&#160;Bony, M.&#160;Cattin, M.&#160;Hetzel, M.&#160;de Ganay, Mme&#160;Trastour-Isnart et M.&#160;Bouchet"
  },
  "pointeurFragmentTexte": {
    "missionVisee": {
      "@xmlns:xsi": "http://www.w3.org/2001/XMLSchema-instance",
      "@xsi:nil": "true"
    },
    "division": {
      "titre": "RAPPORT ANNEXÉ",
      "articleDesignationCourte": "ART. 1ER A",
      "type": "ANNEXE",
      "avant_A_Apres": "A",
      "divisionRattachee": "ARTICLE 1ER A",
      "articleAdditionnel": {
        "@xmlns:xsi": "http://www.w3.org/2001/XMLSchema-instance",
        "@xsi:nil": "true"
      },
      "chapitreAdditionnel": {
        "@xmlns:xsi": "http://www.w3.org/2001/XMLSchema-instance",
        "@xsi:nil": "true"
      },
      "urlDivisionTexteVise": "/15/textes/1974.asp#D_RAPPORT_ANNEXE"
    },
    "alinea": {
      "avant_A_Apres": "A",
      "numero": "61",
      "alineaDesignation": "Alinéa 61"
    }
  },
  "corps": {
    "dispositif": "<p>I.&#160;&#8211;&#160;&#192; l&#8217;alin&#233;a&#160;61, substituer au montant&#160;:</p><p>&#171;&#160;1,1 milliard&#160;&#187;</p><p>le montant&#160;:</p><p>&#171;&#160;2 milliards&#160;&#187;.</p><p>II.&#160;&#8211;&#160;En cons&#233;quence, &#224; l&#8217;alin&#233;a&#160;64, substituer au montant&#160;:</p><p>&#171;&#160;350 M&#8364; &#187;</p><p>les mots :</p><p>&#171;&#160;200 M&#8364; par an&#160;&#187;.</p>",
    "exposeSommaire": "<p>Cet amendement a pour objectif d&#8217;augmenter le montant des appels &#224; projets visant &#224; soutenir les modes actifs, notamment le v&#233;lo et la marche &#224; pied. En effet, les 50M&#8364; par an sur 7 ans pr&#233;vus dans le rapport du Gouvernement ne sont pas suffisants pour que la part modale du v&#233;lo atteigne 9&#160;% d&#8217;ici 2024. Le pr&#233;sent amendement fixe donc &#224; 200M&#8364; par an le montant des appels &#224; projets.<br />Cet investissement est indispensable pour augmenter les retomb&#233;es &#233;conomiques directes du v&#233;lo qui repr&#233;sentent d&#233;j&#224; 4,5 milliards d&#8217;euros en France. Ces retomb&#233;es pourraient &#234;tre ais&#233;ment multipli&#233;es par dix si un investissement suffisant permettait de faire cro&#238;tre l&#8217;usage du v&#233;lo (&#233;tude Altermodal&#160;&#8211;&#160;Atout France 2009).<br />De m&#234;me, une &#233;tude de l&#8217;ECF (European Cyclists&#8217; Federation) a r&#233;v&#233;l&#233; que les retomb&#233;es &#233;conomiques actuelles du v&#233;lo s&#8217;&#233;l&#232;vent &#224; plus de 513 milliards d&#8217;euros par an en Europe, soit plus de 1 000&#160;euros par citoyen europ&#233;en. Ce chiffre pourrait encore s&#8217;accro&#238;tre, car on sait que plus la pratique est intense, plus les retomb&#233;es sont importantes.<br />C&#8217;est en mati&#232;re de sant&#233; que les retomb&#233;es &#233;conomiques sont les plus consid&#233;rables, avec plus de 190 milliards d&#8217;euros &#233;conomis&#233;s par an en Europe. En France, le b&#233;n&#233;fice des 4,6 milliards de kilom&#232;tres parcourus annuellement &#224; v&#233;lo par les cyclistes est estim&#233; &#224; 5,6 milliards d&#8217;euros par an&#160;; se rapprocher des politiques ambitieuses europ&#233;ennes par un investissement national significatif conduirait &#224; un b&#233;n&#233;fice sant&#233; &#233;valu&#233; &#224; 15 milliards d&#8217;euros. Ce b&#233;n&#233;fice participerait &#224; la r&#233;sorption du d&#233;ficit de la s&#233;curit&#233; sociale.<br /><br />L&#8217;examen au S&#233;nat a permis de sanctuariser le budget de l&#8217;AFITF en le fondant sur des ressources stables et pr&#233;visibles. N&#233;anmoins, il est indispensable de s&#8217;assurer qu&#8217;une partie des sommes perc&#807;ues par l&#8217;AFITF est bien utilis&#233;e en faveur du soutien des modes actifs, conform&#233;ment aux annonces du Gouvernement. Il est donc primordial que le montant des appels &#224; projets visant &#224; soutenir les modes actifs soit rehauss&#233; &#224; 200 M&#8364; / an, chiffrage consensuel qui r&#233;sulte d&#8217;une concertation entre les usagers, les professionnels et les collectivit&#233;s.</p>",
    "annexeExposeSommaire": {
      "@xmlns:xsi": "http://www.w3.org/2001/XMLSchema-instance",
      "@xsi:nil": "true"
    },
    "cartoucheDelaiDepotDepasse": {
      "@xmlns:xsi": "http://www.w3.org/2001/XMLSchema-instance",
      "@xsi:nil": "true"
    }
  },
  "representations": {
    "representation": {
      "nom": "PDF",
      "typeMime": {
        "type": "application",
        "subType": "PDF"
      },
      "statutRepresentation": {
        "verbatim": "true",
        "canonique": "true",
        "officielle": "true",
        "transcription": "false",
        "enregistrement": "false"
      },
      "repSource": {
        "@xmlns:xsi": "http://www.w3.org/2001/XMLSchema-instance",
        "@xsi:nil": "true"
      },
      "offset": {
        "@xmlns:xsi": "http://www.w3.org/2001/XMLSchema-instance",
        "@xsi:nil": "true"
      },
      "contenu": {
        "documentURI": "/15/amendements/1974/AN/188.pdf"
      },
      "dateDispoRepresentation": {
        "@xmlns:xsi": "http://www.w3.org/2001/XMLSchema-instance",
        "@xsi:nil": "true"
      }
    }
  },
  "seanceDiscussion": "RUANR5L15S2019IDS21699",
  "sort": {
    "dateSaisie": "2019-06-13T19:36:24.000+02:00",
    "sortEnSeance": "Non soutenu"
  },
  "dateDepot": "2019-05-27T02:00:00.000+02:00",
  "dateDistribution": "2019-06-05T02:00:00.000+02:00",
  "article99": "0",
  "loiReference": {
    "codeLoi": {
      "@xmlns:xsi": "http://www.w3.org/2001/XMLSchema-instance",
      "@xsi:nil": "true"
    },
    "divisionCodeLoi": {
      "@xmlns:xsi": "http://www.w3.org/2001/XMLSchema-instance",
      "@xsi:nil": "true"
    }
  }
}