{
  "@xmlns": "http://schemas.assemblee-nationale.fr/referentiel",
  "uid": "AMANR5L15SEA717460B1255P2D1N2336",
  "identifiant": {
    "legislature": "15",
    "numero": "2336",
    "numRect": "0",
    "saisine": {
      "refTexteLegislatif": "PRJLANR5L15B1255",
      "numeroPartiePLF": "2",
      "organeExamen": "PO717460",
      "mentionSecondeDeliberation": "0"
    }
  },
  "numeroLong": "II-2336",
  "etapeTexte": "1ère lecture (1ère assemblée saisie)",
  "triAmendement": "euaaaaaaaaaaaaaaaaaaaaaaaaaaaaaaaaaaaaaaaaaaaaaaaacepw",
  "cardinaliteAmdtMultiples": "1",
  "amendementParent": {
    "@xmlns:xsi": "http://www.w3.org/2001/XMLSchema-instance",
    "@xsi:nil": "true"
  },
  "etat": "Discuté",
  "signataires": {
    "auteur": {
      "typeAuteur": "Depute",
      "acteurRef": "PA720960",
      "organeRef": {
        "@xmlns:xsi": "http://www.w3.org/2001/XMLSchema-instance",
        "@xsi:nil": "true"
      },
      "groupePolitiqueRef": "PO730964"
    },
    "cosignataires": {
      "acteurRef": [
        "PA721234",
        "PA721012",
        "PA720960",
        "PA721054",
        "PA441",
        "PA755549",
        "PA718978",
        "PA610681",
        "PA720968",
        "PA610775",
        "PA267901",
        "PA720038",
        "PA610667",
        "PA721094",
        "PA718728"
      ]
    },
    "texteAffichable": "M.&#160;Serva,  Mme&#160;Bareigts, Mme&#160;Bello, Mme&#160;Benin, M.&#160;Brial, M.&#160;Kamardine, M.&#160;Laqhila, Mme&#160;Josso, M.&#160;Lorion, M.&#160;Dunoyer, M.&#160;Gom&#232;s, Mme&#160;K&#233;clard-Mond&#233;sir, Mme&#160;Maud&#160;Petit, M.&#160;Serville et Mme&#160;Vanceunebrock-Mialon"
  },
  "pointeurFragmentTexte": {
    "missionVisee": {
      "@xmlns:xsi": "http://www.w3.org/2001/XMLSchema-instance",
      "@xsi:nil": "true"
    },
    "division": {
      "titre": "Article 55",
      "articleDesignationCourte": "APRÈS ART. 55",
      "type": "ARTICLE",
      "avant_A_Apres": "Après",
      "divisionRattachee": "APRÈS L'ARTICLE 55, insérer l'article suivant:",
      "articleAdditionnel": "1",
      "chapitreAdditionnel": {
        "@xmlns:xsi": "http://www.w3.org/2001/XMLSchema-instance",
        "@xsi:nil": "true"
      },
      "urlDivisionTexteVise": "/15/textes/1255C.asp#D_Article_55"
    },
    "alinea": {
      "@xmlns:xsi": "http://www.w3.org/2001/XMLSchema-instance",
      "@xsi:nil": "true"
    }
  },
  "corps": {
    "dispositif": "<p style=\"text-align: justify;\">I.&#160;&#8211;&#160;Le I de l&#8217;article&#160;244 <i>quater</i> X du code g&#233;n&#233;ral des imp&#244;ts est compl&#233;t&#233; par un 5 ainsi r&#233;dig&#233;&#160;:</p><p style=\"text-align: justify;\">&#171;&#160;5. Ouvrent &#233;galement droit au b&#233;n&#233;fice du cr&#233;dit d&#8217;imp&#244;t les travaux de r&#233;habilitation des logements qui, quelle que soit la date &#224; laquelle ces derniers ont &#233;t&#233; achev&#233;s, satisfont aux conditions fix&#233;es au 1 du I, pour la r&#233;paration des d&#233;g&#226;ts caus&#233;s par une catastrophe naturelle reconnue dans les conditions fix&#233;es au quatri&#232;me alin&#233;a de l&#8217;article L.&#160;125&#8209;1 du code des assurances. Les d&#233;penses de r&#233;habilitation prises en compte pour le cr&#233;dit d&#8217;imp&#244;t sont limit&#233;es &#224; 13&#160;000&#160;euros par logement.&#160;&#187;&#160;&#187;.</p><p style=\"text-align: justify;\">II.&#160;&#8211;&#160;Le I s&#8217;applique aux travaux achev&#233;s &#224; compter du 1<sup>er</sup> janvier 2019.</p><p style=\"text-align: justify;\">III.&#160;&#8211;&#160;Le I est applicable aux sommes venant en d&#233;duction de l&#8217;imp&#244;t d&#251;.</p><p style=\"text-align: justify;\">IV. &#160;&#8211;&#160;La perte de recettes r&#233;sultant pour l&#8217;&#201;tat du I ci-dessus est compens&#233;e, &#224; due concurrence, par la cr&#233;ation d&#8217;une taxe additionnelle aux droits pr&#233;vus aux articles&#160;575 et 575&#160;A du code g&#233;n&#233;ral des imp&#244;ts.</p>",
    "exposeSommaire": "<p style=\"text-align: justify;\">Le pr&#233;sent amendement vise &#224; &#233;tendre le b&#233;n&#233;fice du cr&#233;dit d&#8217;imp&#244;t de l&#8217;article&#160;244 <i>quater</i> X en faveur du logement social dans les outre-mer aux travaux de r&#233;paration de logements sociaux ayant &#233;t&#233; endommag&#233;s par une catastrophe naturelle. Cet avantage fiscal serait donc ouvert dans les DOM, le cr&#233;dit d&#8217;imp&#244;t ne s&#8217;appliquant que dans ces territoires.</p><p style=\"text-align: justify;\">L&#8217;article&#160;244 <i>quater</i> X ouvre d&#233;j&#224; un avantage fiscal pour la r&#233;habilitation de logements sociaux, mais il est r&#233;serv&#233; aux logements sociaux de plus de vingt ans.</p><p style=\"text-align: justify;\">La disposition propos&#233;e concernerait &#233;galement les logements sociaux de moins de vingt ans.</p><p style=\"text-align: justify;\">Le parc locatif ultramarin subit r&#233;guli&#232;rement les cons&#233;quences d&#8217;&#233;v&#233;nements climatiques d&#8217;ampleur exceptionnelle engendrant d&#8217;importants d&#233;g&#226;ts, comme &#224; Saint&#8209;Martin l&#8217;ann&#233;e derni&#232;re, sans que l&#8217;aide fiscale ait pu &#234;tre mobilis&#233;e &#224; ce moment-l&#224;. Dans ce contexte la pr&#233;sente mesure appara&#238;t d&#8217;autant plus justifi&#233;e.</p>",
    "annexeExposeSommaire": {
      "@xmlns:xsi": "http://www.w3.org/2001/XMLSchema-instance",
      "@xsi:nil": "true"
    },
    "cartoucheDelaiDepotDepasse": {
      "@xmlns:xsi": "http://www.w3.org/2001/XMLSchema-instance",
      "@xsi:nil": "true"
    }
  },
  "representations": {
    "representation": {
      "nom": "PDF",
      "typeMime": {
        "type": "application",
        "subType": "PDF"
      },
      "statutRepresentation": {
        "verbatim": "true",
        "canonique": "true",
        "officielle": "true",
        "transcription": "false",
        "enregistrement": "false"
      },
      "repSource": {
        "@xmlns:xsi": "http://www.w3.org/2001/XMLSchema-instance",
        "@xsi:nil": "true"
      },
      "offset": {
        "@xmlns:xsi": "http://www.w3.org/2001/XMLSchema-instance",
        "@xsi:nil": "true"
      },
      "contenu": {
        "documentURI": "/15/amendements/1255C/AN/2336.pdf"
      },
      "dateDispoRepresentation": {
        "@xmlns:xsi": "http://www.w3.org/2001/XMLSchema-instance",
        "@xsi:nil": "true"
      }
    }
  },
  "seanceDiscussion": "RUANR5L15S2019IDS21343",
  "sort": {
    "dateSaisie": "2018-11-15T22:07:15.000+01:00",
    "sortEnSeance": "Rejeté"
  },
  "dateDepot": "2018-11-12T01:00:00.000+01:00",
  "dateDistribution": "2018-11-15T01:00:00.000+01:00",
  "article99": "0",
  "loiReference": {
    "codeLoi": "CGI",
    "divisionCodeLoi": "244 quater X"
  }
}