{
  "@xmlns": "http://schemas.assemblee-nationale.fr/referentiel",
  "uid": "AMANR5L15SEA717460BTC1237P0D1N679",
  "identifiant": {
    "legislature": "15",
    "numero": "679",
    "numRect": "0",
    "saisine": {
      "refTexteLegislatif": "PRJLANR5L15BTC1237",
      "numeroPartiePLF": "0",
      "organeExamen": "PO717460",
      "mentionSecondeDeliberation": "0"
    }
  },
  "numeroLong": "679",
  "etapeTexte": "1ère lecture (1ère assemblée saisie)",
  "triAmendement": "amaaaaaaaaaaaaaaaaaaaaaaaaaaaaaaaaaaaaaaaaaaaaaaaaari",
  "cardinaliteAmdtMultiples": "1",
  "amendementParent": {
    "@xmlns:xsi": "http://www.w3.org/2001/XMLSchema-instance",
    "@xsi:nil": "true"
  },
  "etat": "Discuté",
  "signataires": {
    "auteur": {
      "typeAuteur": "Depute",
      "acteurRef": "PA267527",
      "organeRef": {
        "@xmlns:xsi": "http://www.w3.org/2001/XMLSchema-instance",
        "@xsi:nil": "true"
      },
      "groupePolitiqueRef": "PO730934"
    },
    "cosignataires": {
      "acteurRef": [
        "PA266793",
        "PA340853",
        "PA718784",
        "PA718884",
        "PA721314",
        "PA330909",
        "PA266776",
        "PA334654",
        "PA609245",
        "PA721054",
        "PA267527",
        "PA718780",
        "PA346054",
        "PA267260",
        "PA721070",
        "PA2377",
        "PA267204",
        "PA718838",
        "PA767",
        "PA721678",
        "PA605036",
        "PA334149",
        "PA721816",
        "PA608826",
        "PA267429",
        "PA719318",
        "PA608016",
        "PA721474"
      ]
    },
    "texteAffichable": "M.&#160;Saddier,  Mme&#160;Duby-Muller, M.&#160;Sermier, M.&#160;Straumann, M.&#160;Brun, M.&#160;Reda, Mme&#160;Poletti, M.&#160;Reiss, M.&#160;Schellenberger, Mme&#160;Louwagie, Mme&#160;Anthoine, Mme&#160;Bazin-Malgras, M.&#160;Perrut, Mme&#160;Lacroute, M.&#160;Cinieri, M.&#160;Emmanuel&#160;Maquet, M.&#160;Leclerc, M.&#160;Cattin, M.&#160;Bony, M.&#160;Lorion, M.&#160;Fasquelle, Mme&#160;Ramassamy, M.&#160;Pauget, Mme&#160;Trastour-Isnart, M.&#160;Descoeur, M.&#160;Viry, M.&#160;Boucard et M.&#160;Abad"
  },
  "pointeurFragmentTexte": {
    "missionVisee": {
      "@xmlns:xsi": "http://www.w3.org/2001/XMLSchema-instance",
      "@xsi:nil": "true"
    },
    "division": {
      "titre": "Article 9",
      "articleDesignationCourte": "APRÈS ART. 9",
      "type": "ARTICLE",
      "avant_A_Apres": "Après",
      "divisionRattachee": "APRÈS L'ARTICLE 9, insérer l'article suivant:",
      "articleAdditionnel": "1",
      "chapitreAdditionnel": {
        "@xmlns:xsi": "http://www.w3.org/2001/XMLSchema-instance",
        "@xsi:nil": "true"
      },
      "urlDivisionTexteVise": "/15/textes/1237.asp#D_Article_9"
    },
    "alinea": {
      "@xmlns:xsi": "http://www.w3.org/2001/XMLSchema-instance",
      "@xsi:nil": "true"
    }
  },
  "corps": {
    "dispositif": "<p style=\"text-align: justify;\">I.&#160;&#8211;&#160;Le premier alin&#233;a de l&#8217;article L.&#160;612&#8209;1 du code de commerce est ainsi r&#233;dig&#233;&#160;:</p><p style=\"text-align: justify;\">&#171;&#160;Les personnes morales de droit priv&#233; non commer&#231;antes ayant une activit&#233; &#233;conomique dont le montant hors taxes du chiffre d&#8217;affaires ou les ressources d&#233;passent le seuil fix&#233; par d&#233;cret en Conseil d&#8217;&#201;tat, doivent &#233;tablir chaque ann&#233;e un bilan, un compte de r&#233;sultat et une annexe. Les modalit&#233;s d&#8217;&#233;tablissement de ces documents sont pr&#233;cis&#233;es par d&#233;cret.&#160;&#187;</p><p style=\"text-align: justify;\">II.&#160;&#8211;&#160;Le premier alin&#233;a de l&#8217;article&#160;4&#8209;1 de la loi 87&#8209;571 du 23 juillet 1987 sur le d&#233;veloppement du m&#233;c&#233;nat est ainsi r&#233;dig&#233;&#160;:</p><p style=\"text-align: justify;\">&#171;&#160;Tout organisme b&#233;n&#233;ficiaire de dons de personnes physiques ou morales ouvrant droit, au b&#233;n&#233;fice des donateurs, &#224; un avantage fiscal doit assurer, dans des conditions d&#233;termin&#233;es par d&#233;cret en Conseil d&#8217;&#201;tat, la publicit&#233; par tous moyens et la certification de ses comptes annuels au-dessus d&#8217;un montant de dons de 75 000&#160;euros par an.&#160;&#187;</p>",
    "exposeSommaire": "<p style=\"text-align: justify;\">On estime aujourd&#8217;hui &#224; 1,3 million le nombre d&#8217;associations actives en France, employant pr&#232;s de 1,8 millions de salari&#233;s (5% des salari&#233;s fran&#231;ais) et 16 millions de b&#233;n&#233;voles.</p><p style=\"text-align: justify;\">Compte tenu de l&#8217;importance du secteur associatif dans notre &#233;conomie (70 mld &#8364; de budget cumul&#233; et 3,5 % du PIB) de son mode de financement (43 % d&#8217;origine publique) et des risques attach&#233;s, l&#8217;intervention d&#8217;un commissaire aux comptes, garantissant la transparence financi&#232;re, doit &#234;tre &#233;tendue.</p><p style=\"text-align: justify;\">La premi&#232;re disposition de cet amendement consiste &#224; abaisser le seuil d&#8217;intervention des commissaires aux comptes d&#232;s l&#8217;octroi de fonds publics de plus de 75&#160;000 &#8364;.</p><p style=\"text-align: justify;\">La deuxi&#232;me disposition s&#8217;attache &#224; rassurer les donateurs pour les associations qui per&#231;oivent plus de 75&#160;000 &#8364; de dons ouvrant droit &#224; avantage fiscal.</p><p style=\"text-align: justify;\">Enfin, les derni&#232;res dispositions conduisent &#224; simplifier, pour les associations ayant une activit&#233; &#233;conomique, le seuil de nomination et le fixer uniquement &#224; partir du total des ressources ou du chiffre d&#8217;affaires.</p>",
    "annexeExposeSommaire": {
      "@xmlns:xsi": "http://www.w3.org/2001/XMLSchema-instance",
      "@xsi:nil": "true"
    }
  },
  "representations": {
    "representation": {
      "nom": "PDF",
      "typeMime": {
        "type": "application",
        "subType": "PDF"
      },
      "statutRepresentation": {
        "verbatim": "true",
        "canonique": "true",
        "officielle": "true",
        "transcription": "false",
        "enregistrement": "false"
      },
      "repSource": {
        "@xmlns:xsi": "http://www.w3.org/2001/XMLSchema-instance",
        "@xsi:nil": "true"
      },
      "offset": {
        "@xmlns:xsi": "http://www.w3.org/2001/XMLSchema-instance",
        "@xsi:nil": "true"
      },
      "contenu": {
        "documentURI": "/15/amendements/1237/AN/679.pdf"
      },
      "dateDispoRepresentation": {
        "@xmlns:xsi": "http://www.w3.org/2001/XMLSchema-instance",
        "@xsi:nil": "true"
      }
    }
  },
  "seanceDiscussion": "RUANR5L15S2018IDS21251",
  "sort": {
    "dateSaisie": "2018-09-27T18:04:15.000+02:00",
    "sortEnSeance": "Rejeté"
  },
  "dateDepot": "2018-09-19T02:00:00.000+02:00",
  "dateDistribution": "2018-09-24T02:00:00.000+02:00",
  "article99": "0",
  "loiReference": {
    "codeLoi": "c commerce",
    "divisionCodeLoi": "L621-1"
  }
}