{
  "@xmlns": "http://schemas.assemblee-nationale.fr/referentiel",
  "uid": "AMANR5L15SEA717460BTC1019P0D1N425",
  "identifiant": {
    "legislature": "15",
    "numero": "425",
    "numRect": "0",
    "saisine": {
      "refTexteLegislatif": "PRJLANR5L15BTC1019",
      "numeroPartiePLF": "0",
      "organeExamen": "PO717460",
      "mentionSecondeDeliberation": "1"
    }
  },
  "numeroLong": "425",
  "etapeTexte": "1ère lecture (1ère assemblée saisie)",
  "triAmendement": "hqkhz",
  "cardinaliteAmdtMultiples": "1",
  "amendementParent": {
    "@xmlns:xsi": "http://www.w3.org/2001/XMLSchema-instance",
    "@xsi:nil": "true"
  },
  "etat": "Discuté",
  "signataires": {
    "auteur": {
      "typeAuteur": "Depute",
      "acteurRef": "PA718784",
      "organeRef": {
        "@xmlns:xsi": "http://www.w3.org/2001/XMLSchema-instance",
        "@xsi:nil": "true"
      },
      "groupePolitiqueRef": "PO730934"
    },
    "cosignataires": {
      "acteurRef": [
        "PA266776",
        "PA720630",
        "PA998",
        "PA712015",
        "PA1874",
        "PA718784",
        "PA719318",
        "PA334654",
        "PA608416",
        "PA2155",
        "PA767",
        "PA718838",
        "PA346218",
        "PA608016",
        "PA346054",
        "PA718884",
        "PA340853"
      ]
    },
    "texteAffichable": "M.&#160;Pauget,  M.&#160;Reiss, Mme&#160;Anthoine, M.&#160;Masson, Mme&#160;Bazin-Malgras, M.&#160;Dive, Mme&#160;Louwagie, M.&#160;Dassault, M.&#160;Leclerc, M.&#160;Emmanuel&#160;Maquet, M.&#160;Brun, M.&#160;Cattin, M.&#160;Le Fur, M.&#160;Hetzel, M.&#160;Straumann, M.&#160;Menuel et M.&#160;Minot"
  },
  "pointeurFragmentTexte": {
    "missionVisee": {
      "@xmlns:xsi": "http://www.w3.org/2001/XMLSchema-instance",
      "@xsi:nil": "true"
    },
    "division": {
      "titre": "Article 19",
      "articleDesignationCourte": "ART. 19",
      "type": "ARTICLE",
      "avant_A_Apres": "A",
      "divisionRattachee": "ARTICLE 19",
      "articleAdditionnel": {
        "@xmlns:xsi": "http://www.w3.org/2001/XMLSchema-instance",
        "@xsi:nil": "true"
      },
      "chapitreAdditionnel": {
        "@xmlns:xsi": "http://www.w3.org/2001/XMLSchema-instance",
        "@xsi:nil": "true"
      },
      "urlDivisionTexteVise": "/15/textes/1019.asp#D_Article_19"
    },
    "alinea": {
      "avant_A_Apres": {
        "@xmlns:xsi": "http://www.w3.org/2001/XMLSchema-instance",
        "@xsi:nil": "true"
      },
      "numero": "68",
      "alineaDesignation": {
        "@xmlns:xsi": "http://www.w3.org/2001/XMLSchema-instance",
        "@xsi:nil": "true"
      }
    }
  },
  "corps": {
    "dispositif": "<p style=\"text-align: justify;\">Compl&#233;ter l'alin&#233;a&#160;68 par la phrase suivante&#160;:</p><p style=\"text-align: justify;\">&#171;&#160;Ces co&#251;ts int&#232;grent, pour toutes les formations techniques n&#233;cessitant l&#8217;acquisition pour l&#8217;apprenti d&#8217;un &#233;quipement particulier, le co&#251;t de cet &#233;quipement.&#160;&#187;</p>",
    "exposeSommaire": "<p style=\"text-align: justify;\">Le projet de loi pr&#233;voit un financement par les futurs op&#233;rateurs de comp&#233;tences des contrats d&#8217;apprentissage et de professionnalisation sur la base d&#8217;un co&#251;t &#171;&#160;au contrat&#160;&#187; fix&#233; par les branches professionnelles et prenant en compte les recommandations de France Comp&#233;tences en mati&#232;re d&#8217;observation des co&#251;ts et de niveaux de prise en charge.</p><p style=\"text-align: justify;\">Dans le cadre de formations techniques, les alternants peuvent &#234;tre amen&#233;s &#224; devoir proc&#233;der &#224; l&#8217;achat d&#8217;&#233;quipements particuliers, qui peuvent s&#8217;av&#233;rer co&#251;teux pour les familles et emp&#234;cher les jeunes aux revenus les plus modestes d&#8217;acc&#233;der &#224; ces formations.</p><p style=\"text-align: justify;\">Pour faire face &#224; cette situation et permettre aux diff&#233;rents publics une &#233;galit&#233; d&#8217;acc&#232;s &#224; la formation, nombre de CFA proposent d&#8217;aider ou de financer int&#233;gralement l&#8217;achat de cet &#233;quipement.</p><p style=\"text-align: justify;\">Il serait donc logique que les d&#233;penses engag&#233;es par les CFA pour le premier &#233;quipement de leurs apprentis se r&#233;percutent dans la d&#233;finition du co&#251;t au contrat et dans la prise en charge financi&#232;re effectu&#233;e par les op&#233;rateurs de comp&#233;tences.</p><p style=\"text-align: justify;\">&#160;</p>",
    "annexeExposeSommaire": {
      "@xmlns:xsi": "http://www.w3.org/2001/XMLSchema-instance",
      "@xsi:nil": "true"
    }
  },
  "representations": {
    "representation": {
      "nom": "PDF",
      "typeMime": {
        "type": "application",
        "subType": "PDF"
      },
      "statutRepresentation": {
        "verbatim": "true",
        "canonique": "true",
        "officielle": "true",
        "transcription": "false",
        "enregistrement": "false"
      },
      "repSource": {
        "@xmlns:xsi": "http://www.w3.org/2001/XMLSchema-instance",
        "@xsi:nil": "true"
      },
      "offset": {
        "@xmlns:xsi": "http://www.w3.org/2001/XMLSchema-instance",
        "@xsi:nil": "true"
      },
      "contenu": {
        "documentURI": "/15/amendements/1019/AN/425.pdf"
      },
      "dateDispoRepresentation": {
        "@xmlns:xsi": "http://www.w3.org/2001/XMLSchema-instance",
        "@xsi:nil": "true"
      }
    }
  },
  "seanceDiscussion": "RUANR5L15S2018IDS21105",
  "sort": {
    "dateSaisie": "2018-06-15T18:02:20.000+02:00",
    "sortEnSeance": "Tombé"
  },
  "dateDepot": "2018-06-06T02:00:00.000+02:00",
  "dateDistribution": "2018-06-12T02:00:00.000+02:00",
  "article99": "0",
  "loiReference": {
    "codeLoi": {
      "@xmlns:xsi": "http://www.w3.org/2001/XMLSchema-instance",
      "@xsi:nil": "true"
    },
    "divisionCodeLoi": {
      "@xmlns:xsi": "http://www.w3.org/2001/XMLSchema-instance",
      "@xsi:nil": "true"
    }
  }
}