{
  "@xmlns": "http://schemas.assemblee-nationale.fr/referentiel",
  "uid": "AMANR5L15PO420120B0904P0D1N843",
  "identifiant": {
    "legislature": "15",
    "numero": "843",
    "numRect": "0",
    "saisine": {
      "refTexteLegislatif": "PRJLANR5L15B0904",
      "numeroPartiePLF": "0",
      "organeExamen": "PO420120",
      "mentionSecondeDeliberation": "0"
    }
  },
  "numeroLong": "AS843",
  "etapeTexte": "1ère lecture (1ère assemblée saisie)",
  "triAmendement": "ai",
  "cardinaliteAmdtMultiples": "1",
  "amendementParent": {
    "@xmlns:xsi": "http://www.w3.org/2001/XMLSchema-instance",
    "@xsi:nil": "true"
  },
  "etat": "Discuté",
  "signataires": {
    "auteur": {
      "typeAuteur": "Depute",
      "acteurRef": "PA508",
      "organeRef": {
        "@xmlns:xsi": "http://www.w3.org/2001/XMLSchema-instance",
        "@xsi:nil": "true"
      },
      "groupePolitiqueRef": "PO730946"
    },
    "cosignataires": {
      "acteurRef": [
        "PA609332",
        "PA1592",
        "PA1008",
        "PA335532",
        "PA1809",
        "PA719930",
        "PA643145",
        "PA610681",
        "PA605069",
        "PA429893",
        "PA333818",
        "PA405480",
        "PA333285",
        "PA267233",
        "PA342415",
        "PA340343",
        "PA337483",
        "PA642764",
        "PA340357",
        "PA1198",
        "PA608695",
        "PA608172",
        "PA720988",
        "PA588886",
        "PA332614",
        "PA508",
        "PA609590",
        "PA608011",
        "PA335054",
        "PA607553"
      ]
    },
    "texteAffichable": "Mme&#160;Bi&#233;mouret,  M.&#160;Aviragnet, Mme&#160;Bareigts, Mme&#160;Manin, Mme&#160;Vainqueur-Christophe, M.&#160;Vallaud, Mme&#160;Victory, Mme&#160;Battistel, M.&#160;Bouillon, M.&#160;Jean-Louis&#160;Bricout, M.&#160;Carvounas, M.&#160;Alain&#160;David, Mme&#160;Laurence&#160;Dumont, M.&#160;Faure, M.&#160;Garot, M.&#160;David&#160;Habib, M.&#160;Hutin, M.&#160;Juanico, Mme&#160;Karamanli, M.&#160;J&#233;r&#244;me&#160;Lambert, M.&#160;Le Foll, M.&#160;Letchimy, Mme&#160;Pau-Langevin, Mme&#160;Pires Beaune, M.&#160;Potier, M.&#160;Pueyo, M.&#160;Pupponi, Mme&#160;Rabault, M.&#160;Saulignac et Mme&#160;Untermaier"
  },
  "pointeurFragmentTexte": {
    "missionVisee": {
      "@xmlns:xsi": "http://www.w3.org/2001/XMLSchema-instance",
      "@xsi:nil": "true"
    },
    "division": {
      "titre": "Article 28",
      "articleDesignationCourte": "ART. 28",
      "type": "ARTICLE",
      "avant_A_Apres": "A",
      "divisionRattachee": "ARTICLE 28",
      "articleAdditionnel": {
        "@xmlns:xsi": "http://www.w3.org/2001/XMLSchema-instance",
        "@xsi:nil": "true"
      },
      "chapitreAdditionnel": {
        "@xmlns:xsi": "http://www.w3.org/2001/XMLSchema-instance",
        "@xsi:nil": "true"
      },
      "urlDivisionTexteVise": "/15/textes/0904.asp#D_Article_28"
    },
    "alinea": {
      "@xmlns:xsi": "http://www.w3.org/2001/XMLSchema-instance",
      "@xsi:nil": "true"
    }
  },
  "corps": {
    "dispositif": "<p style=\"text-align: justify;\">Supprimer cet article.</p>",
    "exposeSommaire": "<p style=\"text-align: justify;\">La r&#233;forme de l&#8217;assurance ch&#244;mage pour les ind&#233;pendants est insatisfaisante et comporte des dangers.&#160;Le nouveau dispositif devrait permettre &#224; moins de 30 000 ind&#233;pendants de b&#233;n&#233;ficier des droits au ch&#244;mage sur 2,8 millions d&#8217;ind&#233;pendants.</p><p style=\"text-align: justify;\">L&#224; encore, il s&#8217;agit de la transposition d&#8217;une promesse de campagne d&#8217;Emmanuel Macron, mais force est de constater une fois de plus que le dispositif envisag&#233; n&#8217;est pas &#224; la hauteur des enjeux et ne r&#233;pond pas aux besoins de s&#233;curisation des parcours professionnels des nouveaux actifs ind&#233;pendants (notamment ceux qui travaillent en lien avec les plateformes num&#233;riques).</p>",
    "annexeExposeSommaire": {
      "@xmlns:xsi": "http://www.w3.org/2001/XMLSchema-instance",
      "@xsi:nil": "true"
    }
  },
  "representations": {
    "representation": {
      "nom": "PDF",
      "typeMime": {
        "type": "application",
        "subType": "PDF"
      },
      "statutRepresentation": {
        "verbatim": "true",
        "canonique": "true",
        "officielle": "true",
        "transcription": "false",
        "enregistrement": "false"
      },
      "repSource": {
        "@xmlns:xsi": "http://www.w3.org/2001/XMLSchema-instance",
        "@xsi:nil": "true"
      },
      "offset": {
        "@xmlns:xsi": "http://www.w3.org/2001/XMLSchema-instance",
        "@xsi:nil": "true"
      },
      "contenu": {
        "documentURI": "/15/amendements/0904/CION-SOC/AS843.pdf"
      },
      "dateDispoRepresentation": {
        "@xmlns:xsi": "http://www.w3.org/2001/XMLSchema-instance",
        "@xsi:nil": "true"
      }
    }
  },
  "seanceDiscussion": {
    "@xmlns:xsi": "http://www.w3.org/2001/XMLSchema-instance",
    "@xsi:nil": "true"
  },
  "sort": {
    "dateSaisie": "2018-05-31T19:11:48.000+02:00",
    "sortEnSeance": "Rejeté"
  },
  "dateDepot": "2018-05-25T02:00:00.000+02:00",
  "dateDistribution": "2018-05-29T02:00:00.000+02:00",
  "article99": "0",
  "loiReference": {
    "codeLoi": {
      "@xmlns:xsi": "http://www.w3.org/2001/XMLSchema-instance",
      "@xsi:nil": "true"
    },
    "divisionCodeLoi": {
      "@xmlns:xsi": "http://www.w3.org/2001/XMLSchema-instance",
      "@xsi:nil": "true"
    }
  }
}