{
  "@xmlns": "http://schemas.assemblee-nationale.fr/referentiel",
  "uid": "AMANR5L15SEA717460BTC1974P0D1N1248",
  "identifiant": {
    "legislature": "15",
    "numero": "1248",
    "numRect": "0",
    "saisine": {
      "refTexteLegislatif": "PRJLANR5L15BTC1974",
      "numeroPartiePLF": "0",
      "organeExamen": "PO717460",
      "mentionSecondeDeliberation": "0"
    }
  },
  "numeroLong": "1248",
  "etapeTexte": "1ère lecture (2ème assemblée saisie)",
  "triAmendement": "ktaaaaaaaaaaaaaaaaaaaaaaaaaaaaaaaaaaaaaaaaaaaaaaaaadi",
  "cardinaliteAmdtMultiples": "1",
  "amendementParent": {
    "@xmlns:xsi": "http://www.w3.org/2001/XMLSchema-instance",
    "@xsi:nil": "true"
  },
  "etat": "Discuté",
  "signataires": {
    "auteur": {
      "typeAuteur": "Depute",
      "acteurRef": "PA719632",
      "organeRef": {
        "@xmlns:xsi": "http://www.w3.org/2001/XMLSchema-instance",
        "@xsi:nil": "true"
      },
      "groupePolitiqueRef": "PO730964"
    },
    "cosignataires": {
      "acteurRef": [
        "PA722134",
        "PA719632",
        "PA719922",
        "PA2449",
        "PA720054",
        "PA719130",
        "PA719890",
        "PA722000",
        "PA718794",
        "PA606202",
        "PA702054",
        "PA607595",
        "PA720854"
      ]
    },
    "texteAffichable": "Mme&#160;Panonacle,  M.&#160;Buchou, M.&#160;Claireaux, M.&#160;Haury, Mme&#160;Michel, M.&#160;Pellois, M.&#160;Pont, Mme&#160;Brulebois, M.&#160;Causse, Mme&#160;Fran&#231;oise&#160;Dumas, M.&#160;Fi&#233;vet, Mme&#160;H&#233;rin et M.&#160;Test&#233;"
  },
  "pointeurFragmentTexte": {
    "missionVisee": {
      "@xmlns:xsi": "http://www.w3.org/2001/XMLSchema-instance",
      "@xsi:nil": "true"
    },
    "division": {
      "titre": "Article 37",
      "articleDesignationCourte": "APRÈS ART. 37",
      "type": "ARTICLE",
      "avant_A_Apres": "Après",
      "divisionRattachee": "APRÈS L'ARTICLE 37, insérer l'article suivant:",
      "articleAdditionnel": "1",
      "chapitreAdditionnel": {
        "@xmlns:xsi": "http://www.w3.org/2001/XMLSchema-instance",
        "@xsi:nil": "true"
      },
      "urlDivisionTexteVise": "/15/textes/1974.asp#D_Article_37"
    },
    "alinea": {
      "@xmlns:xsi": "http://www.w3.org/2001/XMLSchema-instance",
      "@xsi:nil": "true"
    }
  },
  "corps": {
    "dispositif": "<p style=\"text-align: justify;\">Le&#160;<i>b</i>&#160;du F du I de l&#8217;article&#160;219 du code des douanes est ainsi r&#233;dig&#233;&#160;:</p><p style=\"text-align: justify;\">&#171;&#160;<i>b)</i>&#160;Le gestionnaire de navire est d&#233;tenteur d&#8217;un document de conformit&#233; en application du code international de gestion de la s&#233;curit&#233; et remplit les conditions de nationalit&#233;, de r&#233;sidence, de si&#232;ge social ou de principal &#233;tablissement d&#233;finies aux A ou B. Lorsque le navire est hors du champ d&#8217;application du code international de gestion de la s&#233;curit&#233; et que son gestionnaire ne d&#233;tient donc pas un document de conformit&#233; au sens du code susvis&#233;, le gestionnaire prouve &#224; d&#233;faut qu&#8217;il assure depuis la France les mesures &#233;quivalentes de gestion n&#233;cessaires &#224; l&#8217;exploitation du navire.&#160;&#187;</p>",
    "exposeSommaire": "<p style=\"text-align: justify;\">Afin de favoriser la croissance du pavillon fran&#231;ais, la facult&#233; de franciser des navires sur la base de l&#8217;exercice de leur gestion technique en France a &#233;t&#233; introduite par la loi pour l&#8217;&#233;conomie bleue &#224; l&#8217;article&#160;219 du code des douanes (point I-2-F).</p><p style=\"text-align: justify;\">Cette disposition nouvelle a pr&#233;vu que la r&#233;alit&#233; de l&#8217;exercice de la gestion technique soit, aux fins d&#8217;obtenir la francisation, prouv&#233;e par la pr&#233;sentation d&#8217;un document de conformit&#233; d&#233;livr&#233; en application du code international de gestion de la s&#233;curit&#233; (code ISM). Cette modalit&#233; commode a toutefois l&#8217;effet non d&#233;sir&#233; d&#8217;exclure du b&#233;n&#233;fice de cette disposition les navires qui n&#8217;entrent pas dans le champ d&#8217;application du code ISM. Cela cr&#233;e une discrimination &#224; l&#8217;&#233;gard des yachts professionnels, ou des navires qui sont temporairement non soumis au code ISM (par exemple, les navires en arr&#234;t technique de longue dur&#233;e).</p><p style=\"text-align: justify;\">Le pr&#233;sent amendement vise notamment les yachts et permet que les &#171;&#160;petits&#160;&#187; navires n&#8217;entrant pas dans le champ d&#8217;application du code ISM b&#233;n&#233;ficient &#233;galement de la facult&#233; d&#8217;&#234;tre francis&#233;s sur la base de l&#8217;exercice en France de leur gestion, charge au gestionnaire de prouver la r&#233;alit&#233; de l&#8217;exercice en France de cette gestion.</p>",
    "annexeExposeSommaire": {
      "@xmlns:xsi": "http://www.w3.org/2001/XMLSchema-instance",
      "@xsi:nil": "true"
    },
    "cartoucheDelaiDepotDepasse": {
      "@xmlns:xsi": "http://www.w3.org/2001/XMLSchema-instance",
      "@xsi:nil": "true"
    }
  },
  "representations": {
    "representation": {
      "nom": "PDF",
      "typeMime": {
        "type": "application",
        "subType": "PDF"
      },
      "statutRepresentation": {
        "verbatim": "true",
        "canonique": "true",
        "officielle": "true",
        "transcription": "false",
        "enregistrement": "false"
      },
      "repSource": {
        "@xmlns:xsi": "http://www.w3.org/2001/XMLSchema-instance",
        "@xsi:nil": "true"
      },
      "offset": {
        "@xmlns:xsi": "http://www.w3.org/2001/XMLSchema-instance",
        "@xsi:nil": "true"
      },
      "contenu": {
        "documentURI": "/15/amendements/1974/AN/1248.pdf"
      },
      "dateDispoRepresentation": {
        "@xmlns:xsi": "http://www.w3.org/2001/XMLSchema-instance",
        "@xsi:nil": "true"
      }
    }
  },
  "seanceDiscussion": "RUANR5L15S2019IDS21702",
  "sort": {
    "dateSaisie": "2019-06-14T19:00:39.000+02:00",
    "sortEnSeance": "Adopté"
  },
  "dateDepot": "2019-05-28T02:00:00.000+02:00",
  "dateDistribution": "2019-06-07T02:00:00.000+02:00",
  "article99": "0",
  "loiReference": {
    "codeLoi": "c douanes",
    "divisionCodeLoi": "219"
  }
}