{
  "@xmlns": "http://schemas.assemblee-nationale.fr/referentiel",
  "uid": "AMANR5L15PO59048B2272P1D1N47",
  "identifiant": {
    "legislature": "15",
    "numero": "47",
    "numRect": "0",
    "saisine": {
      "refTexteLegislatif": "PRJLANR5L15B2272",
      "numeroPartiePLF": "1",
      "organeExamen": "PO59048",
      "mentionSecondeDeliberation": "0"
    }
  },
  "numeroLong": "I-CF47",
  "etapeTexte": "1ère lecture (1ère assemblée saisie)",
  "triAmendement": "auaaaaaaaaaaaaaaaaaaaaaaaaaaaaaaaaaaaaaaaaaaaaaaaaipkkkkku",
  "cardinaliteAmdtMultiples": "1",
  "amendementParent": {
    "@xmlns:xsi": "http://www.w3.org/2001/XMLSchema-instance",
    "@xsi:nil": "true"
  },
  "etat": "Discuté",
  "signataires": {
    "auteur": {
      "typeAuteur": "Depute",
      "acteurRef": "PA718838",
      "organeRef": {
        "@xmlns:xsi": "http://www.w3.org/2001/XMLSchema-instance",
        "@xsi:nil": "true"
      },
      "groupePolitiqueRef": "PO730934"
    },
    "cosignataires": {
      "acteurRef": "PA718838"
    },
    "texteAffichable": "M.&#160;Brun"
  },
  "pointeurFragmentTexte": {
    "missionVisee": {
      "@xmlns:xsi": "http://www.w3.org/2001/XMLSchema-instance",
      "@xsi:nil": "true"
    },
    "division": {
      "titre": "Article 3",
      "articleDesignationCourte": "APRÈS ART. 3",
      "type": "ARTICLE",
      "avant_A_Apres": "Après",
      "divisionRattachee": "APRÈS L'ARTICLE 3, insérer l'article suivant:",
      "articleAdditionnel": "1",
      "chapitreAdditionnel": {
        "@xmlns:xsi": "http://www.w3.org/2001/XMLSchema-instance",
        "@xsi:nil": "true"
      },
      "urlDivisionTexteVise": "/15/textes/2272A.asp#D_Article_3"
    },
    "alinea": {
      "@xmlns:xsi": "http://www.w3.org/2001/XMLSchema-instance",
      "@xsi:nil": "true"
    }
  },
  "corps": {
    "dispositif": "<p>I.&#160;&#8211;&#160;Apr&#232;s le 6&#176;&#160;du 1 de l&#8217;article&#160;793 du code g&#233;n&#233;ral des imp&#244;ts, il est ins&#233;r&#233; un 7&#176;&#160;ainsi r&#233;dig&#233;&#160;:&#160;</p><p style=\"text-align: justify;\">&#171;&#160;7&#176;&#160;Les successions et donations entre vifs int&#233;ressant les parts de groupements fonciers agricoles et de groupements fonciers ruraux cr&#233;&#233;s conform&#233;ment &#224; la loi n&#176;&#160;62&#8209;933 du 8 ao&#251;t 1962 et r&#233;pondant aux diverses caract&#233;ristiques des articles L.&#160;322&#8209;1 &#224; L.&#160;322&#8209;21, L.&#160;322&#8209;23 et L.&#160;322&#8209;24 du code rural et de la p&#234;che maritime, ainsi que les parts et actions de soci&#233;t&#233;s &#224; objet principalement agricole, &#224; concurrence de la valeur nette des immeubles &#224; usage agricole vis&#233;s aux articles 1394 B <i>bis</i> et 1382, 6&#176;, a, alin&#233;a&#160;1<sup>er</sup> et des titres de soci&#233;t&#233;s attribu&#233;s &#224; la suite d&#8217;une op&#233;ration de r&#233;trocession r&#233;alis&#233;e en application de l&#8217;article L.&#160;143&#8209;15&#8209;1 du code rural et de la p&#234;che maritime, qui composent leur patrimoine, &#224; concurrence de 80&#160;% de leur valeur plafonn&#233;e &#224; vingt millions d&#8217;euros, &#224; condition&#160;:&#160;</p><p style=\"text-align: justify;\">&#171;&#160;a. Que l&#8217;acte constatant la donation ou la d&#233;claration de succession contienne l&#8217;engagement pris par chacun des h&#233;ritiers, l&#233;gataires ou donataires, pour eux et leurs ayants cause, de conserver les parts ou actions transmises pendant une dur&#233;e de dix-huit ans &#224; compter de la date de la transmission &#224; titre gratuit&#160;;&#160;</p><p style=\"text-align: justify;\">&#171;&#160;b. Que la soci&#233;t&#233; dont les titres sont transmis ou la soci&#233;t&#233; dont elle est devenue associ&#233;e &#224; la suite d&#8217;une op&#233;ration de r&#233;trocession vis&#233;e au 1<sup>er</sup> alin&#233;a, conserve l&#8217;ensemble des immeubles &#224; usage agricole dont la valeur nette est l&#8217;objet de l&#8217;exon&#233;ration, pendant toute la dur&#233;e de l&#8217;engagement pr&#233;vu au a&#160;; En cas de r&#233;trocession, la soci&#233;t&#233; dont les titres sont transmis doit &#233;galement conserver, pendant la m&#234;me dur&#233;e, l&#8217;ensemble des titres de la soci&#233;t&#233; d&#233;tentrice des immeubles &#224; usage agricole, re&#231;us en contrepartie de son apport&#160;;&#160;</p><p style=\"text-align: justify;\">&#171;&#160;c. Que l&#8217;ensemble des immeubles &#224; usage agricole vis&#233;s au b, soient, pendant la dur&#233;e de l&#8217;engagement pr&#233;vu au a, exploit&#233;s directement ou en vertu d&#8217;un bail souscrit dans les conditions pr&#233;vues aux articles L.&#160;416&#8209;1 &#224; L.&#160;416&#8209;6, L.&#160;416&#8209;8 et L.&#160;416&#8209;9 ainsi qu&#8217;aux articles L.&#160;418&#8209;1 &#224; L.&#160;418&#8209;5 du code rural et de la p&#234;che maritime, ou d&#8217;une convention pr&#233;vue au dernier alin&#233;a de l&#8217;article L.&#160;411&#8209;2 ou &#224; l&#8217;article L.&#160;411&#8209;37 dudit code, souscrite pour une dur&#233;e au moins &#233;quivalente &#224; celle pr&#233;vue &#224; l&#8217;article L.&#160;416&#8209;1 du code rural et de la p&#234;che maritime, par l&#8217;un ou plusieurs des h&#233;ritiers, l&#233;gataires ou donataires des titres mentionn&#233;s au a, leur conjoint, leur partenaire li&#233; par un pacte civil de solidarit&#233;, l&#8217;un de leurs fr&#232;res et s&#339;urs, l&#8217;un de leurs ascendants ou descendants, le conjoint ou le partenaire li&#233; par un pacte civil de solidarit&#233; de l&#8217;un de leurs ascendants ou descendants dans les conditions fix&#233;es au c de l&#8217;article&#160;787 C, ou par une soci&#233;t&#233; &#224; objet principalement agricole dont l&#8217;une ou plusieurs des personnes susmentionn&#233;es sont associ&#233;es et y exercent une activit&#233; professionnelle agricole dans les conditions fix&#233;es au d de l&#8217;article&#160;787 B.&#160;</p><p style=\"text-align: justify;\">&#171;&#160;Lorsque ces conditions ne sont pas respect&#233;es, les droits de mutation &#224; titre gratuit sont rappel&#233;s, assortis de l&#8217;int&#233;r&#234;t de retard vis&#233; &#224; l&#8217;article&#160;1727 et donnent lieu &#224; l&#8217;application d&#8217;une majoration de 40&#160;% des sommes non acquitt&#233;es au cours des 10 derni&#232;res ann&#233;es, 30&#160;% au cours des huit suivantes.&#160;</p><p style=\"text-align: justify;\">&#171;&#160;Toutefois, lorsque le non-respect de la condition pr&#233;vue au a n&#8217;est le fait que de l&#8217;un des h&#233;ritiers, l&#233;gataires ou donataires, l&#8217;exon&#233;ration n&#8217;est remise en cause qu&#8217;&#224; l&#8217;&#233;gard de celui-ci sous r&#233;serve que les autres h&#233;ritiers, l&#233;gataires ou donataires poursuivent leur propre engagement de conservation jusqu&#8217;&#224; son terme.&#160;</p><p style=\"text-align: justify;\">&#171;&#160;d. En cas de non-respect de la condition pr&#233;vu au a par suite d&#8217;une donation des parts ou actions, l&#8217;exon&#233;ration accord&#233;e au titre de la mutation &#224; titre gratuit n&#8217;est pas remise en cause &#224; la condition que le ou les donataires soient les h&#233;ritiers du donateur et qu&#8217;ils poursuivent l&#8217;engagement pr&#233;vu au a, souscrit par le donateur, jusqu&#8217;&#224; son terme.&#160;</p><p style=\"text-align: justify;\">&#171;&#160;e. En cas de non-respect de la condition pr&#233;vue au a par suite du partage, de la vente, de l&#8217;&#233;change ou de la donation de titres transmis ou de quotes-parts indivises de ces titres entre h&#233;ritiers, l&#233;gataires ou donataires ayant souscrit l&#8217;engagement de conservation, l&#8217;exon&#233;ration accord&#233;e au titre de la mutation &#224; titre gratuit n&#8217;est pas remise en cause &#224; la condition que le ou les b&#233;n&#233;ficiaires de la donation ou de la cession des parts ou actions, poursuivent l&#8217;engagement pr&#233;vu au a jusqu&#8217;&#224; son terme.&#160;</p><p style=\"text-align: justify;\">&#171;&#160;f. En cas de non-respect de la condition pr&#233;vue au a par suite de l&#8217;apport pur et simple, par l&#8217;un ou les h&#233;ritiers, l&#233;gataires ou donataires, de tout ou partie des titres de la soci&#233;t&#233; objet de de la transmission &#224; une autre soci&#233;t&#233;, l&#8217;exon&#233;ration accord&#233;e au titre de la mutation &#224; titre gratuit n&#8217;est pas remise en cause &#224; la condition que la soci&#233;t&#233; b&#233;n&#233;ficiaire de l&#8217;apport prenne l&#8217;engagement de conserver les parts ou actions apport&#233;es jusqu&#8217;au terme de l&#8217;engagement pr&#233;vu au a et que le ou les h&#233;ritiers, l&#233;gataires ou donataires conservent les titres re&#231;us en contrepartie de l&#8217;apport pendant la m&#234;me dur&#233;e.&#160;</p><p style=\"text-align: justify;\">&#171;&#160;g. En cas de non-respect des conditions pr&#233;vues aux a et b par suite d&#8217;une fusion ou d&#8217;une scission au sens de l&#8217;article&#160;817 A, l&#8217;exon&#233;ration accord&#233;e au titre de la mutation &#224; titre gratuit n&#8217;est pas remise en cause si la ou les soci&#233;t&#233;s b&#233;n&#233;ficiaires des immeubles &#224; usage agricole ou des titres de la soci&#233;t&#233; cr&#233;&#233;e &#224; la suite d&#8217;une op&#233;ration de r&#233;trocession vis&#233;e au 1<sup>er</sup> alin&#233;a, respectent l&#8217;engagement pr&#233;vu au b jusqu&#8217;&#224; son terme. Les titres re&#231;us en contrepartie de ces op&#233;rations doivent par ailleurs &#234;tre conserv&#233;s jusqu&#8217;au terme de l&#8217;engagement pr&#233;vu au a.&#160;</p><p style=\"text-align: justify;\">&#171;&#160;h. En cas de non-respect des conditions pr&#233;vues aux b et c par suite de la cession amiable ou forc&#233;e de tout ou partie des immeubles &#224; usage agricole, pour lesquels une d&#233;claration publique a &#233;t&#233; prononc&#233;e en vue d&#8217;une expropriation, l&#8217;exon&#233;ration accord&#233;e au titre de la mutation &#224; titre gratuit n&#8217;est pas remise en cause.&#160;</p><p style=\"text-align: justify;\">&#171;&#160;i. L&#8217;exon&#233;ration accord&#233;e au titre de la mutation &#224; titre gratuit n&#8217;est pas remise en cause lorsque les conditions pr&#233;vues aux a, b et c ne sont pas respect&#233;es par suite d&#8217;une annulation des titres objets de la transmission, de leur vente, ou de la vente des immeubles &#224; usage agricole ou des titres de la soci&#233;t&#233; cr&#233;&#233;e &#224; la suite d&#8217;une op&#233;ration de r&#233;trocession vis&#233;e au 1<sup>er</sup> alin&#233;a composant leur patrimoine, pour cause de pertes, ou intervenant dans le cadre d&#8217;une proc&#233;dure de r&#232;glement amiable, de redressement ou de liquidation judiciaire vis&#233;e aux articles L.&#160;351&#8209;1 &#224; L.&#160;351&#8209;9 du code rural et de la p&#234;che maritime.&#160;</p><p style=\"text-align: justify;\">&#171;&#160;Les dispositions du pr&#233;sent 10&#176;&#160;s&#8217;appliquent aux mutations &#224; titre gratuit portant sur l&#8217;usufruit ou la nue-propri&#233;t&#233; des parts des soci&#233;t&#233;s vis&#233;es au 1<sup>er</sup> alin&#233;a, sous r&#233;serve que l&#8217;ensemble des conditions susmentionn&#233;es soient respect&#233;es, notamment celles pr&#233;vues aux <i>a</i> et <i>c</i> par les h&#233;ritiers ou donataires de l&#8217;usufruit ou de la nue-propri&#233;t&#233; en fonction de leurs droits respectifs&#160;&#187;.&#160;</p><p style=\"text-align: justify;\">II.&#160;&#8211;&#160;Apr&#232;s le 8&#176;&#160;du 2 de l&#8217;article&#160;793 du code g&#233;n&#233;ral des imp&#244;ts, il est ins&#233;r&#233; un 9&#176;&#160;ainsi r&#233;dig&#233;&#160;:&#160;</p><p style=\"text-align: justify;\">&#171;&#160;9&#176;&#160;Les successions et donations entre vifs int&#233;ressant les immeubles &#224; usage agricole vis&#233;s aux articles 1394 B <i>bis</i> et 1382, 6&#176;&#160;, a, alin&#233;a&#160;1<sup>er</sup>, &#224; concurrence de 80&#160;% de leur valeur plafonn&#233;e &#224; vingt millions d&#8217;euros, &#224; condition&#160;:&#160;</p><p style=\"text-align: justify;\">&#171;&#160;a. Que l&#8217;acte constatant la donation ou la d&#233;claration de succession contienne l&#8217;engagement pris par chacun des h&#233;ritiers, l&#233;gataires ou donataires, pour eux et leurs ayants cause, de conserver les immeubles transmis pendant une dur&#233;e de dix-huit ans &#224; compter de la date de la transmission &#224; titre gratuit&#160;;&#160;</p><p style=\"text-align: justify;\">&#171;&#160;b. Que l&#8217;ensemble des immeubles &#224; usage agricole transmis soient, pendant la dur&#233;e de l&#8217;engagement pr&#233;vu au a, exploit&#233;s directement ou en vertu d&#8217;un bail souscrit dans les conditions pr&#233;vues aux articles L.&#160;416&#8209;1 &#224; L.&#160;416&#8209;6, L.&#160;416&#8209;8 et L.&#160;416&#8209;9 ainsi qu&#8217;aux articles L.&#160;418&#8209;1 &#224; L.&#160;418&#8209;5 du code rural et de la p&#234;che maritime, ou d&#8217;une convention pr&#233;vue au dernier alin&#233;a de l&#8217;article L.&#160;411&#8209;2 ou &#224; l&#8217;article L.&#160;411&#8209;37 dudit code, souscrite pour une dur&#233;e au moins &#233;quivalente &#224; celle pr&#233;vue &#224; l&#8217;article L.&#160;416&#8209;1 du code rural et de la p&#234;che maritime, par l&#8217;un ou plusieurs des h&#233;ritiers, l&#233;gataires ou donataires mentionn&#233;s au a, leur conjoint, leur partenaire li&#233; par un pacte civil de solidarit&#233;, l&#8217;un de leurs fr&#232;res et s&#339;urs, l&#8217;un de leurs ascendants ou descendants, le conjoint ou le partenaire li&#233; par un pacte civil de solidarit&#233; de l&#8217;un de leurs ascendants ou descendants dans les conditions fix&#233;es au c de l&#8217;article&#160;787 C, ou par une soci&#233;t&#233; &#224; objet principalement agricole dont l&#8217;une ou plusieurs des personnes susmentionn&#233;es sont associ&#233;es et y exercent une activit&#233; professionnelle agricole dans les conditions fix&#233;es au d de l&#8217;article&#160;787 B. Lorsque ces conditions ne sont pas respect&#233;es, les droits de mutation &#224; titre gratuit sont rappel&#233;s, assortis de l&#8217;int&#233;r&#234;t de retard vis&#233; &#224; l&#8217;article&#160;1727 et donnent lieu &#224; l&#8217;application d&#8217;une majoration de 40&#160;% des sommes non acquitt&#233;es au cours des 10 premi&#232;res ann&#233;es, 30&#160;% au cours des 8 suivantes. Toutefois, lorsque le non-respect de la condition pr&#233;vue au a n&#8217;est le fait que de l&#8217;un des h&#233;ritiers, l&#233;gataires ou donataires, l&#8217;exon&#233;ration n&#8217;est remise en cause qu&#8217;&#224; l&#8217;&#233;gard de celui-ci sous r&#233;serve que les autres h&#233;ritiers, l&#233;gataires ou donataires poursuivent leur propre engagement de conservation jusqu&#8217;&#224; son terme.&#160;</p><p style=\"text-align: justify;\">&#171;&#160;c. En cas de non-respect de la condition pr&#233;vue au a par suite d&#8217;une donation, l&#8217;exon&#233;ration accord&#233;e au titre de la mutation &#224; titre gratuit n&#8217;est pas remise en cause &#224; la condition que le ou les donataires soient les h&#233;ritiers du donateur et qu&#8217;ils poursuivent l&#8217;engagement pr&#233;vu au a, souscrit par le donateur, jusqu&#8217;&#224; son terme.&#160;</p><p style=\"text-align: justify;\">&#171;&#160;d. En cas de non-respect de la condition pr&#233;vue au a par suite du partage, de la vente, de l&#8217;&#233;change ou de la donation d&#8217;immeubles ou de quotes-parts indivises d&#8217;immeubles entre h&#233;ritiers, l&#233;gataires ou donataires ayant souscrit l&#8217;engagement de conservation, l&#8217;exon&#233;ration accord&#233;e au titre de la mutation &#224; titre gratuit n&#8217;est pas remise en cause &#224; la condition que le ou les b&#233;n&#233;ficiaires de la donation ou de la cession, poursuivent l&#8217;engagement pr&#233;vu au a jusqu&#8217;&#224; son terme.&#160;</p><p style=\"text-align: justify;\">&#171;&#160;e. En cas de non-respect de la condition pr&#233;vue au a par suite de l&#8217;apport conjoint pur et simple, par les h&#233;ritiers, l&#233;gataires ou donataires ayant souscrit l&#8217;engagement de conservation, des immeubles ou des quotes-parts indivises de ceux-ci &#224; un groupement foncier agricole ou &#224; un groupement foncier rural cr&#233;&#233;s conform&#233;ment &#224; la loi n&#176;&#160;62&#8209;933 du 8 ao&#251;t 1962 et r&#233;pondant aux diverses caract&#233;ristiques des articles L.&#160;322&#8209;1 &#224; L.&#160;322&#8209;21, L.&#160;322&#8209;23 et L.&#160;322&#8209;24 du code rural et de la p&#234;che maritime, ou encore &#224; une soci&#233;t&#233; &#224; objet principalement agricole dont ils sont associ&#233;s, l&#8217;exon&#233;ration accord&#233;e au titre de la mutation &#224; titre gratuit accord&#233;e n&#8217;est pas remise en cause &#224; condition que la soci&#233;t&#233; b&#233;n&#233;ficiaire de l&#8217;apport prenne l&#8217;engagement de conserver les immeubles apport&#233;s jusqu&#8217;au terme de l&#8217;engagement pr&#233;vu au a et que les h&#233;ritiers, l&#233;gataires ou donataires conservent les titres re&#231;us en contrepartie de l&#8217;apport pendant la m&#234;me dur&#233;e.&#160;</p><p style=\"text-align: justify;\">&#171;&#160;f. En cas de non-respect des conditions pr&#233;vues aux a et b par suite de la cession amiable ou forc&#233;e de tout ou partie des immeubles transmis, pour lesquels une d&#233;claration publique a &#233;t&#233; prononc&#233;e en vue d&#8217;une expropriation, l&#8217;exon&#233;ration accord&#233;e au titre de la mutation &#224; titre gratuit n&#8217;est pas remise en cause.&#160;</p><p style=\"text-align: justify;\">&#171;&#160;g. En cas de non-respect des conditions pr&#233;vues aux a et b par suite de la vente des immeubles &#224; usage agricole r&#233;alis&#233;e pour cause de pertes ou dans le cadre d&#8217;une proc&#233;dure de r&#232;glement amiable, de redressement ou de liquidation judiciaire vis&#233;es aux articles L.&#160;351&#8209;1 &#224; L.&#160;351&#8209;9 du code rural et de la p&#234;che maritime, l&#8217;exon&#233;ration accord&#233;e au titre de la mutation &#224; titre gratuit n&#8217;est pas remise en cause. Les dispositions du pr&#233;sent 9&#176;&#160;s&#8217;appliquent aux mutations &#224; titre gratuit de l&#8217;usufruit ou de la nue-propri&#233;t&#233; des immeubles &#224; usage agricole vis&#233;s aux articles 1394 B <i>bis</i> et 1382, 6&#176;&#160;, a, alin&#233;a&#160;1<sup>er</sup>, sous r&#233;serve que les conditions pr&#233;vues aux a et b soient respect&#233;es par les h&#233;ritiers ou donataires de l&#8217;usufruit ou de la nue-propri&#233;t&#233; en fonction de leurs droits respectifs.&#160;</p><p style=\"text-align: justify;\">III.&#160;&#8211;&#160;Les pertes de recettes r&#233;sultant du I sont compens&#233;es par la cr&#233;ation d&#8217;une taxe additionnelle aux droits vis&#233;s aux articles 575 et 575&#160;A du code g&#233;n&#233;ral des imp&#244;ts.&#160;</p>",
    "exposeSommaire": "<p>Le pr&#233;sent amendement vise &#224; prot&#233;ger les exploitations agricoles et viticoles familiales, en all&#233;geant la fiscalit&#233; des donations et successions lorsque les h&#233;ritiers s&#8217;engagent &#224; ne pas vendre les biens re&#231;us et &#224; les laisser affect&#233;s &#224; l&#8217;exploitation familiale pendant une longue dur&#233;e (18 ans).</p><p style=\"text-align: justify;\">La fiscalit&#233; qui s&#8217;applique actuellement &#224; la transmission familiale des terres agricoles et des vignes, compte tenu de la valeur &#233;lev&#233;e de ces biens, incite les propri&#233;taires &#224; repousser &#224; plus tard cette transmission. Lorsque les successions s&#8217;ouvrent, les droits &#224; payer par les h&#233;ritiers les incite &#224; vendre les biens. L&#8217;exploitation familiale poursuivie par un ou plusieurs de ces h&#233;ritiers est alors menac&#233;e de dislocation.</p><p style=\"text-align: justify;\">Les r&#232;gles actuelles sont insuffisantes pour endiguer ce ph&#233;nom&#232;ne.</p><p style=\"text-align: justify;\">Les biens lou&#233;s par bail &#224; long terme b&#233;n&#233;ficient d&#8217;une exon&#233;ration partielle sous condition de conserver les biens re&#231;us pendant au moins cinq ans.</p><p style=\"text-align: justify;\">Les entreprises b&#233;n&#233;ficient d&#8217;une exon&#233;ration de 75&#160;% sous condition de conserver les biens professionnels ou les titres de la soci&#233;t&#233; pendant au moins 4 ans.</p><p style=\"text-align: justify;\">Le pr&#233;sent texte pr&#233;voit un engagement de conservation beaucoup plus long&#160;&#8211;&#160;au moins 18 ans&#160;&#8211;&#160;constituant une garantie p&#233;renne de stabilit&#233; pour les exploitations familiales, en contrepartie d&#8217;une exon&#233;ration&#160;80&#160;% de droits de mutation &#224; titre gratuit et ce dans la limite de 20 millions d&#8217;euros afin de s&#8217;aligner sur les pratiques de nos voisins europ&#233;ens (Allemagne, Italie et Suisse).</p><p style=\"text-align: justify;\">&#160;</p>",
    "annexeExposeSommaire": {
      "@xmlns:xsi": "http://www.w3.org/2001/XMLSchema-instance",
      "@xsi:nil": "true"
    },
    "cartoucheDelaiDepotDepasse": {
      "@xmlns:xsi": "http://www.w3.org/2001/XMLSchema-instance",
      "@xsi:nil": "true"
    },
    "avantAppel": {
      "@xmlns:xsi": "http://www.w3.org/2001/XMLSchema-instance",
      "@xsi:nil": "true"
    }
  },
  "representations": {
    "representation": {
      "nom": "PDF",
      "typeMime": {
        "type": "application",
        "subType": "PDF"
      },
      "statutRepresentation": {
        "verbatim": "true",
        "canonique": "true",
        "officielle": "true",
        "transcription": "false",
        "enregistrement": "false"
      },
      "repSource": {
        "@xmlns:xsi": "http://www.w3.org/2001/XMLSchema-instance",
        "@xsi:nil": "true"
      },
      "offset": {
        "@xmlns:xsi": "http://www.w3.org/2001/XMLSchema-instance",
        "@xsi:nil": "true"
      },
      "contenu": {
        "documentURI": "/15/amendements/2272A/CION_FIN/CF47.pdf"
      },
      "dateDispoRepresentation": {
        "@xmlns:xsi": "http://www.w3.org/2001/XMLSchema-instance",
        "@xsi:nil": "true"
      }
    }
  },
  "seanceDiscussion": {
    "@xmlns:xsi": "http://www.w3.org/2001/XMLSchema-instance",
    "@xsi:nil": "true"
  },
  "sort": {
    "dateSaisie": "2019-10-08T23:43:29.000+02:00",
    "sortEnSeance": "Rejeté"
  },
  "dateDepot": "2019-10-02T02:00:00.000+02:00",
  "dateDistribution": "2019-10-08T02:00:00.000+02:00",
  "article99": "0",
  "loiReference": {
    "codeLoi": "CGI",
    "divisionCodeLoi": "793"
  }
}