{
  "@xmlns": "http://schemas.assemblee-nationale.fr/referentiel",
  "uid": "AMANR5L15SEA717460BTC0971P0D1N3075",
  "identifiant": {
    "legislature": "15",
    "numero": "3075",
    "numRect": "0",
    "saisine": {
      "refTexteLegislatif": "PRJLANR5L15BTC0971",
      "numeroPartiePLF": "0",
      "organeExamen": "PO717460",
      "mentionSecondeDeliberation": "0"
    }
  },
  "numeroLong": "3075",
  "etapeTexte": "1ère lecture (1ère assemblée saisie)",
  "triAmendement": "bobnw",
  "cardinaliteAmdtMultiples": "1",
  "amendementParent": {
    "@xmlns:xsi": "http://www.w3.org/2001/XMLSchema-instance",
    "@xsi:nil": "true"
  },
  "etat": "Discuté",
  "signataires": {
    "auteur": {
      "typeAuteur": "Depute",
      "acteurRef": "PA719938",
      "organeRef": {
        "@xmlns:xsi": "http://www.w3.org/2001/XMLSchema-instance",
        "@xsi:nil": "true"
      },
      "groupePolitiqueRef": "PO730970"
    },
    "cosignataires": {
      "acteurRef": [
        "PA719938",
        "PA719504"
      ]
    },
    "texteAffichable": "M.&#160;Fesneau,  M.&#160;Lagleize et les membres du groupe du Mouvement D&#233;mocrate et apparent&#233;s"
  },
  "pointeurFragmentTexte": {
    "missionVisee": {
      "@xmlns:xsi": "http://www.w3.org/2001/XMLSchema-instance",
      "@xsi:nil": "true"
    },
    "division": {
      "titre": "Article 6",
      "articleDesignationCourte": "ART. 6",
      "type": "ARTICLE",
      "avant_A_Apres": "A",
      "divisionRattachee": "ARTICLE 6",
      "articleAdditionnel": {
        "@xmlns:xsi": "http://www.w3.org/2001/XMLSchema-instance",
        "@xsi:nil": "true"
      },
      "chapitreAdditionnel": {
        "@xmlns:xsi": "http://www.w3.org/2001/XMLSchema-instance",
        "@xsi:nil": "true"
      },
      "urlDivisionTexteVise": "/15/textes/0971.asp#D_Article_6"
    },
    "alinea": {
      "avant_A_Apres": "A",
      "numero": "6",
      "alineaDesignation": "Alinéa 6"
    }
  },
  "corps": {
    "dispositif": "<p style=\"text-align: justify;\">Apr&#232;s l&#8217;alin&#233;a&#160;6, ins&#233;rer les deux alin&#233;as suivants&#160;:</p><p style=\"text-align: justify;\">&#171;&#160;1&#176; <i>bis</i> Le II <i>bis</i> est ainsi r&#233;tabli&#160;:</p><p style=\"text-align: justify;\">&#171;&#160;II <i>bis</i>.&#160;&#8211;&#160;Lorsqu&#8217;elle se fait au b&#233;n&#233;fice de collectivit&#233;s territoriales disposant de r&#233;serves fonci&#232;res propres permettant la r&#233;alisation des op&#233;rations de construction de logement social &#224; un prix similaire ou inf&#233;rieur &#224; celui qui r&#233;sulterait de l&#8217;application du dispositif mentionn&#233; au I, la cession des biens du domaine priv&#233; de l&#8217;&#201;tat op&#233;r&#233;e en vertu de ce dispositif ne saurait exc&#233;der 75&#160;% du montant de l&#8217;op&#233;ration, calcul&#233; sur la base du prix moyen de construction de logement social par m&#232;tre carr&#233; observ&#233; &#224; l&#8217;&#233;chelle de ladite collectivit&#233; territoriale&#160;&#187;.&#160;&#187;</p>",
    "exposeSommaire": "<p style=\"text-align: justify;\">Cet amendement vise &#224; renforcer l&#8217;efficacit&#233; du dispositif de &#171;&#160;d&#233;cote&#160;&#187; des biens du domaine priv&#233; de l&#8217;&#201;tat pr&#233;vu &#224; l&#8217;article L3211&#8209;7 du code de la propri&#233;t&#233; des personnes publiques afin d&#8217;&#233;viter les ph&#233;nom&#232;nes sp&#233;culatifs constat&#233;s par la Cour des Comptes. Il pr&#233;voit d&#8217;instaurer un m&#233;canisme de plafonnement de la d&#233;cote si deux conditions sont rassembl&#233;es&#160;: d&#8217;une part, si la collectivit&#233; territoriale b&#233;n&#233;ficiaire dispose d&#233;j&#224; de r&#233;serves fonci&#232;res propres qui permettraient de r&#233;aliser ce programme pour un co&#251;t &#233;quivalent&#160;; d&#8217;autre part, en limitant le niveau de la d&#233;cote &#224; 75&#160;% du prix moyen par m&#232;tre carr&#233; de r&#233;alisation d&#8217;une op&#233;ration de logement social observ&#233; &#224; l&#8217;&#233;chelle de ladite collectivit&#233; territoriale en cas d&#8217;utilisation de ses propres ressources fonci&#232;res.</p>",
    "annexeExposeSommaire": {
      "@xmlns:xsi": "http://www.w3.org/2001/XMLSchema-instance",
      "@xsi:nil": "true"
    }
  },
  "representations": {
    "representation": {
      "nom": "PDF",
      "typeMime": {
        "type": "application",
        "subType": "PDF"
      },
      "statutRepresentation": {
        "verbatim": "true",
        "canonique": "true",
        "officielle": "true",
        "transcription": "false",
        "enregistrement": "false"
      },
      "repSource": {
        "@xmlns:xsi": "http://www.w3.org/2001/XMLSchema-instance",
        "@xsi:nil": "true"
      },
      "offset": {
        "@xmlns:xsi": "http://www.w3.org/2001/XMLSchema-instance",
        "@xsi:nil": "true"
      },
      "contenu": {
        "documentURI": "/15/amendements/0971/AN/3075.pdf"
      },
      "dateDispoRepresentation": {
        "@xmlns:xsi": "http://www.w3.org/2001/XMLSchema-instance",
        "@xsi:nil": "true"
      }
    }
  },
  "seanceDiscussion": "RUANR5L15S2018IDS21064",
  "sort": {
    "dateSaisie": "2018-05-31T19:57:55.000+02:00",
    "sortEnSeance": "Rejeté"
  },
  "dateDepot": "2018-05-26T02:00:00.000+02:00",
  "dateDistribution": "2018-05-28T02:00:00.000+02:00",
  "article99": "0",
  "loiReference": {
    "codeLoi": {
      "@xmlns:xsi": "http://www.w3.org/2001/XMLSchema-instance",
      "@xsi:nil": "true"
    },
    "divisionCodeLoi": {
      "@xmlns:xsi": "http://www.w3.org/2001/XMLSchema-instance",
      "@xsi:nil": "true"
    }
  }
}