{
  "@xmlns": "http://schemas.assemblee-nationale.fr/referentiel",
  "uid": "AMANR5L15SEA717460BTC1915P0D1N14",
  "identifiant": {
    "legislature": "15",
    "numero": "14",
    "numRect": "0",
    "saisine": {
      "refTexteLegislatif": "PIONANR5L15BTC1915",
      "numeroPartiePLF": "0",
      "organeExamen": "PO717460",
      "mentionSecondeDeliberation": "0"
    }
  },
  "numeroLong": "14",
  "etapeTexte": "1ère lecture (1ère assemblée saisie)",
  "triAmendement": "eaaaaaaaaaaaaaaaaaaaaaaaaaaaaaaaaaaaaaaaaaaaaaaaaaap",
  "cardinaliteAmdtMultiples": "1",
  "amendementParent": {
    "@xmlns:xsi": "http://www.w3.org/2001/XMLSchema-instance",
    "@xsi:nil": "true"
  },
  "etat": "Discuté",
  "signataires": {
    "auteur": {
      "typeAuteur": "Depute",
      "acteurRef": "PA677483",
      "organeRef": {
        "@xmlns:xsi": "http://www.w3.org/2001/XMLSchema-instance",
        "@xsi:nil": "true"
      },
      "groupePolitiqueRef": "PO730964"
    },
    "cosignataires": {
      "acteurRef": [
        "PA720268",
        "PA719448",
        "PA719700",
        "PA721584",
        "PA677483",
        "PA722312"
      ]
    },
    "texteAffichable": "M.&#160;Mazars,  Mme&#160;Bessot Ballot, Mme&#160;Chapelier, M.&#160;Damaisin, M.&#160;Hupp&#233; et M.&#160;Terlier"
  },
  "pointeurFragmentTexte": {
    "missionVisee": {
      "@xmlns:xsi": "http://www.w3.org/2001/XMLSchema-instance",
      "@xsi:nil": "true"
    },
    "division": {
      "titre": "Article unique",
      "articleDesignationCourte": "ART. UNIQUE",
      "type": "ARTICLE",
      "avant_A_Apres": "A",
      "divisionRattachee": "ARTICLE UNIQUE",
      "articleAdditionnel": {
        "@xmlns:xsi": "http://www.w3.org/2001/XMLSchema-instance",
        "@xsi:nil": "true"
      },
      "chapitreAdditionnel": {
        "@xmlns:xsi": "http://www.w3.org/2001/XMLSchema-instance",
        "@xsi:nil": "true"
      },
      "urlDivisionTexteVise": "/15/textes/1915.asp#D_Article_unique"
    },
    "alinea": {
      "avant_A_Apres": "Apres",
      "numero": "1",
      "alineaDesignation": {
        "@xmlns:xsi": "http://www.w3.org/2001/XMLSchema-instance",
        "@xsi:nil": "true"
      }
    }
  },
  "corps": {
    "dispositif": "<p>I.&#160;&#8211;&#160;Supprimer l&#8217;alin&#233;a&#160;2&#160;:</p><p style=\"text-align: justify;\">II.&#160;&#8211;&#160;En cons&#233;quence, compl&#233;ter cet article par les trois alin&#233;as suivants&#160;:</p><p style=\"text-align: justify;\">&#171;&#160;II.&#160;&#8211;&#160;Apr&#232;s le quatri&#232;me alin&#233;a de l&#8217;article L.&#160;581&#8209;19 du code de l&#8217;environnement, sont ins&#233;r&#233;s deux alin&#233;as ainsi r&#233;dig&#233;s&#160;:</p><p style=\"text-align: justify;\">&#171;&#160;- les activit&#233;s de restauration qui pr&#233;parent, cuisinent et proposent les produits alimentaires selon des techniques ou des coutumes traditionnelles locales et dont la majorit&#233; des plats propos&#233;s &#224; la client&#232;le dispose de la mention fait maison&#160;;</p><p style=\"text-align: justify;\">&#171;&#160;- les activit&#233;s artisanales de fabrication et de vente faisant appel &#224; des techniques, des comp&#233;tences et des connaissances traditionnelles et sp&#233;cialis&#233;es locales&#160;;&#160;&#187;</p>",
    "exposeSommaire": "<p>La loi portant engagement national pour l&#8217;environnement du 12 juillet 2010 a profond&#233;ment modifi&#233; le statut et les conditions d&#8217;installation des pr&#233;-enseignes. Aujourd&#8217;hui, donc les pr&#233;-enseignes sont interdites hors agglom&#233;ration et dans les agglom&#233;rations de moins de 10.000 habitants, sauf d&#233;rogations qui tiennent notamment &#224; une amovibilit&#233; des panneaux, &#224; des manifestations ou des op&#233;rations exceptionnelles de moins de 3 mois.</p><p style=\"text-align: justify;\">Cette disposition interdit donc toute forme de publicit&#233; et les pr&#233;-enseignes sauf pour les &#171;&#160;activit&#233;s en relation avec la fabrication ou la vente de produits du terroir par les entreprises locales&#160;&#187;. Cette interdiction d&#232;s lors vise les artisans et les restaurateurs. Si la proposition de nos coll&#232;gues MODEM, permet d&#8217;&#233;tendre le champ de d&#233;rogation aux restaurateurs, sans limitation par ailleurs, elle ne permet pas de sortir de l&#8217;interdiction les artisans.</p><p style=\"text-align: justify;\">Il s&#8217;agit avec notre amendement, de ne faire aucune distinction entre l&#8217;activit&#233; de production ( qui b&#233;n&#233;ficie d&#8217;ores et d&#233;j&#224; de la d&#233;rogation), celle de restauration/h&#244;tellerie et enfin l&#8217;activit&#233; artisanale.</p><p style=\"text-align: justify;\">En effet, dans les villages et les bourgs, nos artisans et commer&#231;ants, et chacun &#224; leur mesure, par leur savoir-faire ou par tradition participent &#224; l&#8217;&#233;conomie du territoire. En exer&#231;ant leur m&#233;tier ou leur art, ces acteurs locaux perp&#233;tuent les traditions et promeuvent les richesses et les sp&#233;cialit&#233;s de nos territoires. Aucun ne peut et ne doit &#234;tre exclu de la d&#233;rogation, ou plus exactement chacun doit pouvoir disposer des m&#234;mes moyens de promotion. Les pr&#233;-enseignes dans le cadre d&#8217;une charte uniformis&#233;e et harmonis&#233;e sont ces outils de connaissance, de reconnaissance et d&#8217;accessibilit&#233; indispensables au maintien des acteurs artisans et commer&#231;ants ruraux.</p><p style=\"text-align: justify;\">Aussi, par notre amendement nous &#233;tendons le champ de la d&#233;rogation aux artisans traditionnels dans l&#8217;esprit de l&#8217;expos&#233; des motifs de cette proposition de loi et dans le cadre de la d&#233;rogation adopt&#233;e dans Grenelle 2 pour les &#171;&#160;activit&#233;s de production du terroir&#160;&#187;</p>",
    "annexeExposeSommaire": {
      "@xmlns:xsi": "http://www.w3.org/2001/XMLSchema-instance",
      "@xsi:nil": "true"
    },
    "cartoucheDelaiDepotDepasse": {
      "@xmlns:xsi": "http://www.w3.org/2001/XMLSchema-instance",
      "@xsi:nil": "true"
    }
  },
  "representations": {
    "representation": {
      "nom": "PDF",
      "typeMime": {
        "type": "application",
        "subType": "PDF"
      },
      "statutRepresentation": {
        "verbatim": "true",
        "canonique": "true",
        "officielle": "true",
        "transcription": "false",
        "enregistrement": "false"
      },
      "repSource": {
        "@xmlns:xsi": "http://www.w3.org/2001/XMLSchema-instance",
        "@xsi:nil": "true"
      },
      "offset": {
        "@xmlns:xsi": "http://www.w3.org/2001/XMLSchema-instance",
        "@xsi:nil": "true"
      },
      "contenu": {
        "documentURI": "/15/amendements/1915/AN/14.pdf"
      },
      "dateDispoRepresentation": {
        "@xmlns:xsi": "http://www.w3.org/2001/XMLSchema-instance",
        "@xsi:nil": "true"
      }
    }
  },
  "seanceDiscussion": {
    "@xmlns:xsi": "http://www.w3.org/2001/XMLSchema-instance",
    "@xsi:nil": "true"
  },
  "sort": {
    "dateSaisie": "2019-05-09T11:38:17.000+02:00",
    "sortEnSeance": "Retiré"
  },
  "dateDepot": "2019-05-03T02:00:00.000+02:00",
  "dateDistribution": "2019-05-07T02:00:00.000+02:00",
  "article99": "0",
  "loiReference": {
    "codeLoi": {
      "@xmlns:xsi": "http://www.w3.org/2001/XMLSchema-instance",
      "@xsi:nil": "true"
    },
    "divisionCodeLoi": {
      "@xmlns:xsi": "http://www.w3.org/2001/XMLSchema-instance",
      "@xsi:nil": "true"
    }
  }
}