{
  "@xmlns": "http://schemas.assemblee-nationale.fr/referentiel",
  "uid": "AMANR5L15PO420120B0004P0D1N136",
  "identifiant": {
    "legislature": "15",
    "numero": "136",
    "numRect": "0",
    "saisine": {
      "refTexteLegislatif": "PRJLANR5L15B0004",
      "numeroPartiePLF": "0",
      "organeExamen": "PO420120",
      "mentionSecondeDeliberation": "0"
    }
  },
  "numeroLong": "AS136",
  "etapeTexte": "1ère lecture (1ère assemblée saisie)",
  "triAmendement": "iw",
  "cardinaliteAmdtMultiples": "1",
  "amendementParent": {
    "@xmlns:xsi": "http://www.w3.org/2001/XMLSchema-instance",
    "@xsi:nil": "true"
  },
  "etat": "Discuté",
  "signataires": {
    "auteur": {
      "typeAuteur": "Depute",
      "acteurRef": "PA720422",
      "organeRef": {
        "@xmlns:xsi": "http://www.w3.org/2001/XMLSchema-instance",
        "@xsi:nil": "true"
      },
      "groupePolitiqueRef": "PO730958"
    },
    "cosignataires": {
      "acteurRef": [
        "PA722142",
        "PA721226",
        "PA721062",
        "PA720430",
        "PA721210",
        "PA588884",
        "PA719578",
        "PA719676",
        "PA721202",
        "PA2150",
        "PA720892",
        "PA720846",
        "PA718868",
        "PA720422",
        "PA720286",
        "PA718860",
        "PA721960"
      ]
    },
    "texteAffichable": "M.&#160;Quatennens,  Mme&#160;Autain, M.&#160;Bernalicis, M.&#160;Coquerel, M.&#160;Corbi&#232;re, Mme&#160;Fiat, M.&#160;Lachaud, M.&#160;Larive, M.&#160;M&#233;lenchon, Mme&#160;Obono, Mme&#160;Panot, M.&#160;Prud&apos;homme, M.&#160;Ratenon, Mme&#160;Ressiguier, Mme&#160;Rubin, M.&#160;Ruffin et Mme&#160;Taurine"
  },
  "pointeurFragmentTexte": {
    "missionVisee": {
      "@xmlns:xsi": "http://www.w3.org/2001/XMLSchema-instance",
      "@xsi:nil": "true"
    },
    "division": {
      "titre": "Article PREMIER",
      "articleDesignationCourte": "ART. PREMIER",
      "type": "ARTICLE",
      "avant_A_Apres": "A",
      "divisionRattachee": "ARTICLE PREMIER",
      "articleAdditionnel": {
        "@xmlns:xsi": "http://www.w3.org/2001/XMLSchema-instance",
        "@xsi:nil": "true"
      },
      "chapitreAdditionnel": {
        "@xmlns:xsi": "http://www.w3.org/2001/XMLSchema-instance",
        "@xsi:nil": "true"
      },
      "urlDivisionTexteVise": "/15/textes/0004.asp#D_Article_1er"
    },
    "alinea": {
      "avant_A_Apres": {
        "@xmlns:xsi": "http://www.w3.org/2001/XMLSchema-instance",
        "@xsi:nil": "true"
      },
      "numero": "15",
      "alineaDesignation": {
        "@xmlns:xsi": "http://www.w3.org/2001/XMLSchema-instance",
        "@xsi:nil": "true"
      }
    }
  },
  "corps": {
    "dispositif": "<p style=\"text-align: justify;\">R&#233;diger ainsi l&#8217;alin&#233;a&#160;15&#160;:</p><p style=\"text-align: justify;\">&#171;&#160;<em>d)</em>&#160;Revenant sur la proc&#233;dure de restructuration des branches professionnelles et modifiant la section&#160;8 du chapitre&#160;Ier du titre&#160;VI du livre&#160;II de la deuxi&#232;me partie du code du travail et l&#8217;article&#160;25 de la loi&#160;n&#176;&#160;2016&#8209;1088 du 8&#160;ao&#251;t 2016 relative au travail, &#224; la modernisation du dialogue social et &#224; la s&#233;curisation des parcours professionnels dans un sens garantissant que le droit conventionnel retenu soit le plus favorable aux salari&#233;s&#160;;&#160;&#187;.</p>",
    "exposeSommaire": "<p style=\"text-align: justify;\">Le d) du 2&#176; de l&#8217;article&#160;1<sup>er</sup> vise &#224; habiliter le gouvernement &#224; prendre une ordonnance permettant l&#8217;acc&#233;l&#233;ration de la restructuration des branches.</p><p style=\"text-align: justify;\">Or, le dispositif de restructuration des branches engag&#233; par la loi du 8 ao&#251;t 2016 pr&#233;sentait d&#233;j&#224; une volont&#233; de forcer les branches &#224; n&#233;gocier leur fusion sous peine de fusion d&#8217;autorit&#233; par d&#233;cision gouvernementale. L&#8217;article&#160;25 de la loi El Khomri pr&#233;voit des d&#233;lais de mise en &#339;uvre de la fusion forc&#233;e en cas d&#8217;absence de n&#233;gociation de nouvelles conventions de branche. Ces d&#233;lais sont de 3 ans &#224; compter d&#8217;ao&#251;t 2016, soit d&#8217;ici ao&#251;t 2019. Avant cette date le gouvernement ne peut, sauf exception, proc&#233;der &#224; la fusion des branches d&#8217;autorit&#233;. Ce d&#233;lai pourrait &#234;tre r&#233;duit par la loi d&#8217;habilitation.</p><p style=\"text-align: justify;\">Le gouvernement pourrait plus facilement fusionner les branches (par exemple en supprimant les obligations de consultation de la Commission nationale de la n&#233;gociation collective ou en limitant le droit accord&#233; aux organisations syndicales de proposer un projet alternatif). Cette fusion pourrait avoir lieu par le bas pour les droits des salari&#233;s et &#234;tre effectu&#233;e d&#8217;autorit&#233; par le gouvernement dans des d&#233;lais tr&#232;s courts.</p><p style=\"text-align: justify;\">L&#8217;amendement vise au contraire &#224; donner plus de temps &#224; la n&#233;gociation au niveau des branches pour aboutir &#224; une fusion concert&#233;e que les repr&#233;sentants des salari&#233;s et des employeurs pourront s&#8217;approprier pleinement.</p><p style=\"text-align: justify;\">L&#8217;amendement vise &#233;galement &#224; une harmonisation par le haut des droits des salari&#233;s.</p>",
    "annexeExposeSommaire": {
      "@xmlns:xsi": "http://www.w3.org/2001/XMLSchema-instance",
      "@xsi:nil": "true"
    }
  },
  "representations": {
    "representation": {
      "nom": "PDF",
      "typeMime": {
        "type": "application",
        "subType": "PDF"
      },
      "statutRepresentation": {
        "verbatim": "true",
        "canonique": "true",
        "officielle": "true",
        "transcription": "false",
        "enregistrement": "false"
      },
      "repSource": {
        "@xmlns:xsi": "http://www.w3.org/2001/XMLSchema-instance",
        "@xsi:nil": "true"
      },
      "offset": {
        "@xmlns:xsi": "http://www.w3.org/2001/XMLSchema-instance",
        "@xsi:nil": "true"
      },
      "contenu": {
        "documentURI": "/15/amendements/0004/CION-SOC/AS136.pdf"
      },
      "dateDispoRepresentation": {
        "@xmlns:xsi": "http://www.w3.org/2001/XMLSchema-instance",
        "@xsi:nil": "true"
      }
    }
  },
  "seanceDiscussion": {
    "@xmlns:xsi": "http://www.w3.org/2001/XMLSchema-instance",
    "@xsi:nil": "true"
  },
  "sort": {
    "dateSaisie": "2017-07-05T18:17:17.000+02:00",
    "sortEnSeance": "Rejeté"
  },
  "dateDepot": "2017-07-03T02:00:00.000+02:00",
  "dateDistribution": "2017-07-04T02:00:00.000+02:00",
  "article99": "0",
  "loiReference": {
    "codeLoi": "2",
    "divisionCodeLoi": {
      "@xmlns:xsi": "http://www.w3.org/2001/XMLSchema-instance",
      "@xsi:nil": "true"
    }
  }
}