{
  "@xmlns": "http://schemas.assemblee-nationale.fr/referentiel",
  "uid": "AMANR5L15SEA717460B0387P0D1N176",
  "identifiant": {
    "legislature": "15",
    "numero": "176",
    "numRect": "0",
    "saisine": {
      "refTexteLegislatif": "PRJLANR5L15B0387",
      "numeroPartiePLF": "0",
      "organeExamen": "PO717460",
      "mentionSecondeDeliberation": "0"
    }
  },
  "numeroLong": "176",
  "etapeTexte": "Nouvelle Lecture",
  "triAmendement": "il",
  "cardinaliteAmdtMultiples": "1",
  "amendementParent": {
    "@xmlns:xsi": "http://www.w3.org/2001/XMLSchema-instance",
    "@xsi:nil": "true"
  },
  "etat": "Discuté",
  "signataires": {
    "auteur": {
      "typeAuteur": "Depute",
      "acteurRef": "PA720614",
      "organeRef": {
        "@xmlns:xsi": "http://www.w3.org/2001/XMLSchema-instance",
        "@xsi:nil": "true"
      },
      "groupePolitiqueRef": "PO723569"
    },
    "cosignataires": {
      "acteurRef": [
        "PA720606",
        "PA720614",
        "PA720798",
        "PA720664",
        "PA720468",
        "PA720822",
        "PA606212"
      ]
    },
    "texteAffichable": "Mme&#160;Le Pen,  M.&#160;Aliot, M.&#160;Bilde, M.&#160;Chenu, M.&#160;Collard, M.&#160;Evrard et M.&#160;Pajot"
  },
  "pointeurFragmentTexte": {
    "missionVisee": {
      "@xmlns:xsi": "http://www.w3.org/2001/XMLSchema-instance",
      "@xsi:nil": "true"
    },
    "division": {
      "titre": "Article 12",
      "articleDesignationCourte": "ART. 12",
      "type": "ARTICLE",
      "avant_A_Apres": "A",
      "divisionRattachee": "ARTICLE 12",
      "articleAdditionnel": {
        "@xmlns:xsi": "http://www.w3.org/2001/XMLSchema-instance",
        "@xsi:nil": "true"
      },
      "chapitreAdditionnel": {
        "@xmlns:xsi": "http://www.w3.org/2001/XMLSchema-instance",
        "@xsi:nil": "true"
      },
      "urlDivisionTexteVise": "/15/textes/0387.asp#D_Article_12"
    },
    "alinea": {
      "@xmlns:xsi": "http://www.w3.org/2001/XMLSchema-instance",
      "@xsi:nil": "true"
    }
  },
  "corps": {
    "dispositif": "<p>Supprimer cet article.</p>",
    "exposeSommaire": "<p>Derri&#232;re le titre pompeux de &#171;&#160;fiscalit&#233; comportementale&#160;&#187; , se dessine une augmentation massive de la fiscalit&#233; de poche sur les tabacs pr&#233;vue par l&#8217;article&#160;575 du code g&#233;n&#233;ral des imp&#244;ts .</p><p>L&#8217;exp&#233;rience montre qu&#8217;une telle augmentation n&#8217;est pas durablement corr&#233;l&#233;e avec une baisse de la consommation des tabacs .</p><p>Enfin, cet article, qui pr&#233;voit une &#233;volution fiscale jusqu&#8217;en 2020, est contraire au principe constitutionnel de l&#8217;annualit&#233; budg&#233;taire</p>",
    "annexeExposeSommaire": {
      "@xmlns:xsi": "http://www.w3.org/2001/XMLSchema-instance",
      "@xsi:nil": "true"
    }
  },
  "representations": {
    "representation": {
      "nom": "PDF",
      "typeMime": {
        "type": "application",
        "subType": "PDF"
      },
      "statutRepresentation": {
        "verbatim": "true",
        "canonique": "true",
        "officielle": "true",
        "transcription": "false",
        "enregistrement": "false"
      },
      "repSource": {
        "@xmlns:xsi": "http://www.w3.org/2001/XMLSchema-instance",
        "@xsi:nil": "true"
      },
      "offset": {
        "@xmlns:xsi": "http://www.w3.org/2001/XMLSchema-instance",
        "@xsi:nil": "true"
      },
      "contenu": {
        "documentURI": "/15/amendements/0387/AN/176.pdf"
      },
      "dateDispoRepresentation": {
        "@xmlns:xsi": "http://www.w3.org/2001/XMLSchema-instance",
        "@xsi:nil": "true"
      }
    }
  },
  "seanceDiscussion": "RUANR5L15S2018IDS20789",
  "sort": {
    "dateSaisie": "2017-11-29T18:20:45.000+01:00",
    "sortEnSeance": "Rejeté"
  },
  "dateDepot": "2017-11-24T01:00:00.000+01:00",
  "dateDistribution": "2017-11-27T01:00:00.000+01:00",
  "article99": "0",
  "loiReference": {
    "codeLoi": {
      "@xmlns:xsi": "http://www.w3.org/2001/XMLSchema-instance",
      "@xsi:nil": "true"
    },
    "divisionCodeLoi": {
      "@xmlns:xsi": "http://www.w3.org/2001/XMLSchema-instance",
      "@xsi:nil": "true"
    }
  }
}