{
  "@xmlns": "http://schemas.assemblee-nationale.fr/referentiel",
  "uid": "AMANR5L15PO419865B1831P0D1N2324",
  "identifiant": {
    "legislature": "15",
    "numero": "2324",
    "numRect": "0",
    "saisine": {
      "refTexteLegislatif": "PRJLANR5L15B1831",
      "numeroPartiePLF": "0",
      "organeExamen": "PO419865",
      "mentionSecondeDeliberation": "0"
    }
  },
  "numeroLong": "CD2324",
  "etapeTexte": "1ère lecture (2ème assemblée saisie)",
  "triAmendement": "bdaaaaaaaaaaaaaaaaaaaaaaaaaaaaaaaaaaaaaaaaaaaaaaaaudo",
  "cardinaliteAmdtMultiples": "1",
  "amendementParent": {
    "@xmlns:xsi": "http://www.w3.org/2001/XMLSchema-instance",
    "@xsi:nil": "true"
  },
  "etat": "Discuté",
  "signataires": {
    "auteur": {
      "typeAuteur": "Depute",
      "acteurRef": "PA267204",
      "organeRef": {
        "@xmlns:xsi": "http://www.w3.org/2001/XMLSchema-instance",
        "@xsi:nil": "true"
      },
      "groupePolitiqueRef": "PO730934"
    },
    "cosignataires": {
      "acteurRef": [
        "PA721678",
        "PA767",
        "PA643134",
        "PA1012",
        "PA267901",
        "PA267204",
        "PA346218",
        "PA605036",
        "PA267527",
        "PA267429",
        "PA721410",
        "PA606712",
        "PA267735",
        "PA266776",
        "PA720210",
        "PA609245",
        "PA2155",
        "PA605991",
        "PA267260",
        "PA332523",
        "PA608416",
        "PA709315",
        "PA719318",
        "PA608016",
        "PA267450",
        "PA721046",
        "PA340853",
        "PA642847"
      ]
    },
    "texteAffichable": "M.&#160;Sermier,  Mme&#160;Lacroute, M.&#160;Kamardine, M.&#160;Cattin, Mme&#160;Bonnivard, M.&#160;Hetzel, M.&#160;Reda, M.&#160;de la Verpilli&#232;re, M.&#160;Leclerc, M.&#160;Cinieri, Mme&#160;Bassire, M.&#160;Masson, M.&#160;R&#233;mi&#160;Delatte, Mme&#160;Louwagie, Mme&#160;Beauvais, M.&#160;Lurton, M.&#160;de Ganay, M.&#160;Bazin, Mme&#160;Anthoine, M.&#160;Reiss, Mme&#160;Valentin, M.&#160;Menuel, Mme&#160;Genevard, M.&#160;Abad, Mme&#160;Poletti, Mme&#160;Dalloz, M.&#160;Saddier et M.&#160;Viala"
  },
  "pointeurFragmentTexte": {
    "missionVisee": {
      "@xmlns:xsi": "http://www.w3.org/2001/XMLSchema-instance",
      "@xsi:nil": "true"
    },
    "division": {
      "titre": "Article 9",
      "articleDesignationCourte": "ART. 9",
      "type": "ARTICLE",
      "avant_A_Apres": "A",
      "divisionRattachee": "ARTICLE 9",
      "articleAdditionnel": {
        "@xmlns:xsi": "http://www.w3.org/2001/XMLSchema-instance",
        "@xsi:nil": "true"
      },
      "chapitreAdditionnel": {
        "@xmlns:xsi": "http://www.w3.org/2001/XMLSchema-instance",
        "@xsi:nil": "true"
      },
      "urlDivisionTexteVise": "/15/textes/1831.asp#D_Article_9"
    },
    "alinea": {
      "avant_A_Apres": {
        "@xmlns:xsi": "http://www.w3.org/2001/XMLSchema-instance",
        "@xsi:nil": "true"
      },
      "numero": "13",
      "alineaDesignation": {
        "@xmlns:xsi": "http://www.w3.org/2001/XMLSchema-instance",
        "@xsi:nil": "true"
      }
    }
  },
  "corps": {
    "dispositif": "<p style=\"text-align: justify;\">A la derni&#232;re phrase de l&#8217;alin&#233;a&#160;13, apr&#232;s le mot&#160;:</p><p style=\"text-align: justify;\">&#171;&#160;mobilit&#233;&#160;&#187;,</p><p style=\"text-align: justify;\">ins&#233;rer les mots&#160;:</p><p style=\"text-align: justify;\">&#171;&#160;, tel que mentionn&#233; au dernier alin&#233;a de l&#8217;article L.&#160;1215&#8209;1&#160;&#187;.</p>",
    "exposeSommaire": "<p style=\"text-align: justify;\">Cet amendement vise &#224; pr&#233;ciser la d&#233;finition du bassin de mobilit&#233; et la mettre en coh&#233;rence avec l&#8217;article&#160;4 du pr&#233;sent projet de loi. Cette d&#233;finition sera &#233;tablie en concertation entre la r&#233;gion et les autres collectivit&#233;s territoriales en charge de la mobilit&#233;. Elle satisfait l&#8217;ensemble des acteurs en clarifiant les comp&#233;tences de chacun.</p>",
    "annexeExposeSommaire": {
      "@xmlns:xsi": "http://www.w3.org/2001/XMLSchema-instance",
      "@xsi:nil": "true"
    },
    "cartoucheDelaiDepotDepasse": {
      "@xmlns:xsi": "http://www.w3.org/2001/XMLSchema-instance",
      "@xsi:nil": "true"
    }
  },
  "representations": {
    "representation": {
      "nom": "PDF",
      "typeMime": {
        "type": "application",
        "subType": "PDF"
      },
      "statutRepresentation": {
        "verbatim": "true",
        "canonique": "true",
        "officielle": "true",
        "transcription": "false",
        "enregistrement": "false"
      },
      "repSource": {
        "@xmlns:xsi": "http://www.w3.org/2001/XMLSchema-instance",
        "@xsi:nil": "true"
      },
      "offset": {
        "@xmlns:xsi": "http://www.w3.org/2001/XMLSchema-instance",
        "@xsi:nil": "true"
      },
      "contenu": {
        "documentURI": "/15/amendements/1831/CION-DVP/CD2324.pdf"
      },
      "dateDispoRepresentation": {
        "@xmlns:xsi": "http://www.w3.org/2001/XMLSchema-instance",
        "@xsi:nil": "true"
      }
    }
  },
  "seanceDiscussion": {
    "@xmlns:xsi": "http://www.w3.org/2001/XMLSchema-instance",
    "@xsi:nil": "true"
  },
  "sort": {
    "dateSaisie": "2019-05-16T22:16:24.000+02:00",
    "sortEnSeance": "Tombé"
  },
  "dateDepot": "2019-05-09T02:00:00.000+02:00",
  "dateDistribution": "2019-05-14T02:00:00.000+02:00",
  "article99": "0",
  "loiReference": {
    "codeLoi": {
      "@xmlns:xsi": "http://www.w3.org/2001/XMLSchema-instance",
      "@xsi:nil": "true"
    },
    "divisionCodeLoi": {
      "@xmlns:xsi": "http://www.w3.org/2001/XMLSchema-instance",
      "@xsi:nil": "true"
    }
  }
}