{
  "@xmlns": "http://schemas.assemblee-nationale.fr/referentiel",
  "uid": "AMANR5L15PO419865B2274P0D1N780",
  "identifiant": {
    "legislature": "15",
    "numero": "780",
    "numRect": "0",
    "saisine": {
      "refTexteLegislatif": "PRJLANR5L15B2274",
      "numeroPartiePLF": "0",
      "organeExamen": "PO419865",
      "mentionSecondeDeliberation": "0"
    }
  },
  "numeroLong": "CD780",
  "etapeTexte": "1ère lecture (2ème assemblée saisie)",
  "triAmendement": "olaaaaaaaaaaaaaaaaaaaaaaaaaaaaaaaaaaaaaaaaaaaaaaaac",
  "cardinaliteAmdtMultiples": "1",
  "amendementParent": {
    "@xmlns:xsi": "http://www.w3.org/2001/XMLSchema-instance",
    "@xsi:nil": "true"
  },
  "etat": "En traitement",
  "signataires": {
    "auteur": {
      "typeAuteur": "Depute",
      "acteurRef": "PA720916",
      "organeRef": {
        "@xmlns:xsi": "http://www.w3.org/2001/XMLSchema-instance",
        "@xsi:nil": "true"
      },
      "groupePolitiqueRef": "PO730964"
    },
    "cosignataires": {
      "acteurRef": "PA720916"
    },
    "texteAffichable": "Mme&#160;Lazaar"
  },
  "pointeurFragmentTexte": {
    "missionVisee": {
      "@xmlns:xsi": "http://www.w3.org/2001/XMLSchema-instance",
      "@xsi:nil": "true"
    },
    "division": {
      "titre": "Article 12 G",
      "articleDesignationCourte": "APRÈS ART. 12 G",
      "type": "ARTICLE",
      "avant_A_Apres": "Après",
      "divisionRattachee": "APRÈS L'ARTICLE 12 G, insérer l'article suivant:",
      "articleAdditionnel": "1",
      "chapitreAdditionnel": {
        "@xmlns:xsi": "http://www.w3.org/2001/XMLSchema-instance",
        "@xsi:nil": "true"
      },
      "urlDivisionTexteVise": "/15/textes/2274.asp#D_Article_12_G"
    },
    "alinea": {
      "@xmlns:xsi": "http://www.w3.org/2001/XMLSchema-instance",
      "@xsi:nil": "true"
    }
  },
  "corps": {
    "dispositif": "<p style=\"text-align: justify;\">&#192; la fin d&#8217;un chantier public ou priv&#233; de construction, d&#233;molition ou r&#233;habilitation,&#160;l&#8217;entit&#233;&#160;responsable de la conduite des travaux ou mandat&#233;e pour la conduite de ces travaux&#160;peut produire un certificat de tra&#231;abilit&#233; des d&#233;chets. &#192; partir d&#8217;un certain volume de d&#233;chets produits, pr&#233;cis&#233; par d&#233;cret, ce certificat devient obligatoire et mentionne &#224; minima&#160;les informations de tra&#231;abilit&#233; dont la liste est&#160;pr&#233;cis&#233;e par d&#233;cret.</p>",
    "exposeSommaire": "<p style=\"text-align: justify;\">Pour lutter contre les d&#233;p&#244;ts sauvages et assurer un meilleur suivi des d&#233;chets produits par le secteur du b&#226;timent et des travaux publics, qui repr&#233;sentent plus de 70% de la production nationale de d&#233;chets, le pr&#233;sent amendement vise &#224;&#160;mettre en place un certificat de tra&#231;abilit&#233; qui sera &#233;tabli &#224; la fin des travaux par l'entit&#233; en charge de la conduite du chantier.&#160;</p><p style=\"text-align: justify;\">Ce certificat pourra mentionner un certain nombre d'informations utiles dont la liste sera pr&#233;cis&#233;e par d&#233;cret, et visant notamment &#224; pr&#233;ciser&#160;la quantit&#233; de d&#233;chets produits, leur nature, et leur destination.&#160;</p>",
    "annexeExposeSommaire": {
      "@xmlns:xsi": "http://www.w3.org/2001/XMLSchema-instance",
      "@xsi:nil": "true"
    },
    "cartoucheDelaiDepotDepasse": "Sous réserve de son traitement par les services de l'Assemblée nationale et de sa recevabilité",
    "avantAppel": {
      "@xmlns:xsi": "http://www.w3.org/2001/XMLSchema-instance",
      "@xsi:nil": "true"
    }
  },
  "representations": {
    "representation": {
      "nom": "PDF",
      "typeMime": {
        "type": "application",
        "subType": "PDF"
      },
      "statutRepresentation": {
        "verbatim": "true",
        "canonique": "true",
        "officielle": "true",
        "transcription": "false",
        "enregistrement": "false"
      },
      "repSource": {
        "@xmlns:xsi": "http://www.w3.org/2001/XMLSchema-instance",
        "@xsi:nil": "true"
      },
      "offset": {
        "@xmlns:xsi": "http://www.w3.org/2001/XMLSchema-instance",
        "@xsi:nil": "true"
      },
      "contenu": {
        "documentURI": "/15/amendements/2274/CION-DVP/CD780.pdf"
      },
      "dateDispoRepresentation": {
        "@xmlns:xsi": "http://www.w3.org/2001/XMLSchema-instance",
        "@xsi:nil": "true"
      }
    }
  },
  "seanceDiscussion": {
    "@xmlns:xsi": "http://www.w3.org/2001/XMLSchema-instance",
    "@xsi:nil": "true"
  },
  "sort": {
    "@xmlns:xsi": "http://www.w3.org/2001/XMLSchema-instance",
    "@xsi:nil": "true"
  },
  "dateDepot": "2019-11-20T01:00:00.000+01:00",
  "dateDistribution": "2019-11-21T01:00:00.000+01:00",
  "article99": "0",
  "loiReference": {
    "codeLoi": "xcertificat traçabilité",
    "divisionCodeLoi": {
      "@xmlns:xsi": "http://www.w3.org/2001/XMLSchema-instance",
      "@xsi:nil": "true"
    }
  }
}