{
  "@xmlns": "http://schemas.assemblee-nationale.fr/referentiel",
  "uid": "AMANR5L15PO757134B1673P0D1N973",
  "identifiant": {
    "legislature": "15",
    "numero": "973",
    "numRect": "0",
    "saisine": {
      "refTexteLegislatif": "PRJLANR5L15B1673",
      "numeroPartiePLF": "0",
      "organeExamen": "PO757134",
      "mentionSecondeDeliberation": "0"
    }
  },
  "numeroLong": "973",
  "etapeTexte": "Nouvelle Lecture",
  "triAmendement": "ckaaaaaaaaaaaaaaaaaaaaaaaaaaaaaaaaaaaaaaaaaaaaaaaab",
  "cardinaliteAmdtMultiples": "1",
  "amendementParent": {
    "@xmlns:xsi": "http://www.w3.org/2001/XMLSchema-instance",
    "@xsi:nil": "true"
  },
  "etat": "Discuté",
  "signataires": {
    "auteur": {
      "typeAuteur": "Depute",
      "acteurRef": "PA721344",
      "organeRef": {
        "@xmlns:xsi": "http://www.w3.org/2001/XMLSchema-instance",
        "@xsi:nil": "true"
      },
      "groupePolitiqueRef": "PO730964"
    },
    "cosignataires": {
      "acteurRef": [
        "PA722054",
        "PA721344"
      ]
    },
    "texteAffichable": "M.&#160;Bonnell et Mme&#160;Hai"
  },
  "pointeurFragmentTexte": {
    "missionVisee": {
      "@xmlns:xsi": "http://www.w3.org/2001/XMLSchema-instance",
      "@xsi:nil": "true"
    },
    "division": {
      "titre": "Article 19 ter",
      "articleDesignationCourte": "ART. 19 TER",
      "type": "ARTICLE",
      "avant_A_Apres": "A",
      "divisionRattachee": "ARTICLE 19 TER",
      "articleAdditionnel": {
        "@xmlns:xsi": "http://www.w3.org/2001/XMLSchema-instance",
        "@xsi:nil": "true"
      },
      "chapitreAdditionnel": {
        "@xmlns:xsi": "http://www.w3.org/2001/XMLSchema-instance",
        "@xsi:nil": "true"
      },
      "urlDivisionTexteVise": "/15/textes/1673.asp#D_Article_19_ter"
    },
    "alinea": {
      "avant_A_Apres": {
        "@xmlns:xsi": "http://www.w3.org/2001/XMLSchema-instance",
        "@xsi:nil": "true"
      },
      "numero": "3",
      "alineaDesignation": {
        "@xmlns:xsi": "http://www.w3.org/2001/XMLSchema-instance",
        "@xsi:nil": "true"
      }
    }
  },
  "corps": {
    "dispositif": "<p>Supprimer l'alin&#233;a&#160;3.</p>",
    "exposeSommaire": "<p style=\"text-align: justify;\">Cet amendement supprime l&#8217;ajout de la justification du paiement total de la prime &#224; l&#8217;attestation d&#8217;assurance d&#233;cennale que le professionnel de la construction doit obligatoirement remettre au ma&#238;tre d&#8217;ouvrage, &#224; l&#8217;ouverture du chantier.</p><p style=\"text-align: justify;\">Cet ajout, propos&#233; par le S&#233;nat dans le 2<sup>&#232;me</sup> alin&#233;a de l&#8217;article, est susceptible de rencontrer d&#8217;importants obstacles de mise en &#339;uvre dans la majorit&#233; des situations contractuelles relevant du domaine de l&#8217;assurance construction. En effet, le paiement de la prime d&#8217;assurance d&#233;cennale est habituellement fractionn&#233; selon un &#233;ch&#233;ancier pr&#233;d&#233;termin&#233; et n&#233;cessite une r&#233;gularisation une fois le co&#251;t d&#233;finitif du chantier connu.</p><p style=\"text-align: justify;\">Cet amendement supprime &#233;galement le 3<sup>&#232;me</sup> alin&#233;a de l&#8217;article propos&#233; par le S&#233;nat qui introduit une pr&#233;cision r&#233;dactionnelle superflue car l&#8217;exigence d&#8217;agr&#233;ment en Union Europ&#233;enne existe d&#233;j&#224; pour l&#8217;ensemble des activit&#233;s d&#8217;assurance. Il est donc inutile d&#8217;introduire une particularit&#233; pour l&#8217;assurance construction, car les dispositions actuelles du code des assurances visent d&#233;j&#224; ces risques. De plus, aucun acteur n&#8217;est concern&#233; par cette disposition, les assureurs issus de pays tiers &#224; l&#8217;UE ne couvrant pas les risques de construction sur le march&#233; fran&#231;ais&#160;: l&#8217;amendement est donc inop&#233;rant. Enfin, cet amendement introduit un a contrario malheureux, qui n&#8217;est pas souhaitable en termes de clart&#233; et d&#8217;intelligibilit&#233; de la norme.</p>",
    "annexeExposeSommaire": {
      "@xmlns:xsi": "http://www.w3.org/2001/XMLSchema-instance",
      "@xsi:nil": "true"
    },
    "cartoucheDelaiDepotDepasse": {
      "@xmlns:xsi": "http://www.w3.org/2001/XMLSchema-instance",
      "@xsi:nil": "true"
    }
  },
  "representations": {
    "representation": {
      "nom": "PDF",
      "typeMime": {
        "type": "application",
        "subType": "PDF"
      },
      "statutRepresentation": {
        "verbatim": "true",
        "canonique": "true",
        "officielle": "true",
        "transcription": "false",
        "enregistrement": "false"
      },
      "repSource": {
        "@xmlns:xsi": "http://www.w3.org/2001/XMLSchema-instance",
        "@xsi:nil": "true"
      },
      "offset": {
        "@xmlns:xsi": "http://www.w3.org/2001/XMLSchema-instance",
        "@xsi:nil": "true"
      },
      "contenu": {
        "documentURI": "/15/amendements/1673/CSPACTE/973.pdf"
      },
      "dateDispoRepresentation": {
        "@xmlns:xsi": "http://www.w3.org/2001/XMLSchema-instance",
        "@xsi:nil": "true"
      }
    }
  },
  "seanceDiscussion": {
    "@xmlns:xsi": "http://www.w3.org/2001/XMLSchema-instance",
    "@xsi:nil": "true"
  },
  "sort": {
    "dateSaisie": "2019-03-06T22:35:08.000+01:00",
    "sortEnSeance": "Adopté"
  },
  "dateDepot": "2019-03-01T01:00:00.000+01:00",
  "dateDistribution": "2019-03-05T01:00:00.000+01:00",
  "article99": "0",
  "loiReference": {
    "codeLoi": "s",
    "divisionCodeLoi": {
      "@xmlns:xsi": "http://www.w3.org/2001/XMLSchema-instance",
      "@xsi:nil": "true"
    }
  }
}