{
  "@xmlns": "http://schemas.assemblee-nationale.fr/referentiel",
  "uid": "AMANR5L15PO419865B1831P0D1N2091",
  "identifiant": {
    "legislature": "15",
    "numero": "2091",
    "numRect": "0",
    "saisine": {
      "refTexteLegislatif": "PRJLANR5L15B1831",
      "numeroPartiePLF": "0",
      "organeExamen": "PO419865",
      "mentionSecondeDeliberation": "0"
    }
  },
  "numeroLong": "CD2091",
  "etapeTexte": "1ère lecture (2ème assemblée saisie)",
  "triAmendement": "iqaaaaaaaaaaaaaaaaaaaaaaaaaaaaaaaaaaaaaaaaaaaaaaaabazzs",
  "cardinaliteAmdtMultiples": "1",
  "amendementParent": {
    "@xmlns:xsi": "http://www.w3.org/2001/XMLSchema-instance",
    "@xsi:nil": "true"
  },
  "etat": "Discuté",
  "signataires": {
    "auteur": {
      "typeAuteur": "Depute",
      "acteurRef": "PA333421",
      "organeRef": {
        "@xmlns:xsi": "http://www.w3.org/2001/XMLSchema-instance",
        "@xsi:nil": "true"
      },
      "groupePolitiqueRef": "PO759900"
    },
    "cosignataires": {
      "acteurRef": [
        "PA405480",
        "PA719138",
        "PA719286",
        "PA333421",
        "PA605694",
        "PA719146",
        "PA331582",
        "PA720996",
        "PA605518"
      ]
    },
    "texteAffichable": "M.&#160;Pancher,  M.&#160;Acquaviva, M.&#160;Castellani, M.&#160;Colombani, M.&#160;El Guerrab, M.&#160;Falorni, M.&#160;Fran&#231;ois-Michel&#160;Lambert, M.&#160;Pupponi et M.&#160;Philippe&#160;Vigier"
  },
  "pointeurFragmentTexte": {
    "missionVisee": {
      "@xmlns:xsi": "http://www.w3.org/2001/XMLSchema-instance",
      "@xsi:nil": "true"
    },
    "division": {
      "titre": "Article 31 bis",
      "articleDesignationCourte": "APRÈS ART. 31 BIS",
      "type": "ARTICLE",
      "avant_A_Apres": "Après",
      "divisionRattachee": "APRÈS L'ARTICLE 31 BIS, insérer l'article suivant:",
      "articleAdditionnel": "1",
      "chapitreAdditionnel": {
        "@xmlns:xsi": "http://www.w3.org/2001/XMLSchema-instance",
        "@xsi:nil": "true"
      },
      "urlDivisionTexteVise": "/15/textes/1831.asp#D_Article_31_bis"
    },
    "alinea": {
      "@xmlns:xsi": "http://www.w3.org/2001/XMLSchema-instance",
      "@xsi:nil": "true"
    }
  },
  "corps": {
    "dispositif": "<p style=\"text-align: justify;\">Le titre III du livre VI de la premi&#232;re partie du code des transports est compl&#233;t&#233; par un chapitre III ainsi r&#233;dig&#233;&#160;:</p><p style=\"text-align: justify;\">&#171;&#160;Chapitre III</p><p style=\"text-align: justify;\">&#171;&#160;Des peines compl&#233;mentaires&#160;&#187;</p><p style=\"text-align: justify;\">&#171;&#160;<i>Art.&#160;L.&#160;1633&#8209;1</i>.&#160;&#8211;&#160;La juridiction peut, lorsqu&#8217;elle a prononc&#233; une peine contraventionnelle, correctionnelle ou criminelle, pour des faits commis au sein d&#8217;une installation, d&#8217;un v&#233;hicule, d&#8217;une infrastructure ou de tout autre dispositif employ&#233;s dans le cadre de la mise en &#339;uvre d&#8217;un transport public, prononcer, &#224; titre de peine compl&#233;mentaire, l&#8217;une des peines pr&#233;vues &#224; l&#8217;article&#160;131&#8209;6 du code p&#233;nal.&#160;&#187;</p>",
    "exposeSommaire": "<p style=\"text-align: justify;\">Les services de s&#251;ret&#233; de la RATP (GPSR) et de la SNCF (SUGE) signalent de plus en plus le cas de personnes r&#233;cidivistes dans les r&#233;seaux de transport public sans qu&#8217;il soit toujours possible juridiquement de les emp&#234;cher de p&#233;n&#233;trer &#224; nouveau dans les r&#233;seaux de transports.</p><p style=\"text-align: justify;\">Depuis d&#233;but janvier, il est notamment constat&#233; une hausse importante des vols &#224; la tire, commis par des bandes organis&#233;es, le cas &#233;ch&#233;ant commis avec des mineurs, qui d&#233;troussent les voyageurs en toute impunit&#233;. La pr&#233;fecture de police de Paris a constat&#233; une hausse de 33&#160;% de ces d&#233;lits sur les rails de la capitale principalement.</p><p style=\"text-align: justify;\">Cette situation n&#8217;est &#233;videmment pas admissible ni pour les Franciliens ni pour les touristes. Elle donne &#233;galement une image d&#233;plorable de notre r&#233;seau de transports. Elle peut enfin &#234;tre source de lassitude et de d&#233;couragement pour les personnes qui interpellent ces personnes et constatent le peu d&#8217;effet de leur travail.</p><p style=\"text-align: justify;\">Si les services de s&#251;ret&#233; disposent d&#233;j&#224; de certaines pr&#233;rogatives, force est de constater qu&#8217;elles ne sont pas suffisantes pour dissuader les r&#233;cidivistes d&#8217;agir.</p><p style=\"text-align: justify;\">C&#8217;est pourquoi, afin de restaurer la s&#233;curit&#233; au sein des r&#233;seaux de transport, il appara&#238;t n&#233;cessaire d&#8217;ouvrir plus largement la possibilit&#233;, pour les juges, de prononcer, au titre d&#8217;une peine compl&#233;mentaire, l&#8217;interdiction de para&#238;tre dans les r&#233;seaux de transport public.</p>",
    "annexeExposeSommaire": {
      "@xmlns:xsi": "http://www.w3.org/2001/XMLSchema-instance",
      "@xsi:nil": "true"
    },
    "cartoucheDelaiDepotDepasse": {
      "@xmlns:xsi": "http://www.w3.org/2001/XMLSchema-instance",
      "@xsi:nil": "true"
    }
  },
  "representations": {
    "representation": {
      "nom": "PDF",
      "typeMime": {
        "type": "application",
        "subType": "PDF"
      },
      "statutRepresentation": {
        "verbatim": "true",
        "canonique": "true",
        "officielle": "true",
        "transcription": "false",
        "enregistrement": "false"
      },
      "repSource": {
        "@xmlns:xsi": "http://www.w3.org/2001/XMLSchema-instance",
        "@xsi:nil": "true"
      },
      "offset": {
        "@xmlns:xsi": "http://www.w3.org/2001/XMLSchema-instance",
        "@xsi:nil": "true"
      },
      "contenu": {
        "documentURI": "/15/amendements/1831/CION-DVP/CD2091.pdf"
      },
      "dateDispoRepresentation": {
        "@xmlns:xsi": "http://www.w3.org/2001/XMLSchema-instance",
        "@xsi:nil": "true"
      }
    }
  },
  "seanceDiscussion": {
    "@xmlns:xsi": "http://www.w3.org/2001/XMLSchema-instance",
    "@xsi:nil": "true"
  },
  "sort": {
    "dateSaisie": "2019-05-22T00:50:36.000+02:00",
    "sortEnSeance": "Retiré"
  },
  "dateDepot": "2019-05-09T02:00:00.000+02:00",
  "dateDistribution": "2019-05-19T02:00:00.000+02:00",
  "article99": "0",
  "loiReference": {
    "codeLoi": "transports",
    "divisionCodeLoi": "L1633-1"
  }
}