{
  "@xmlns": "http://schemas.assemblee-nationale.fr/referentiel",
  "uid": "AMANR5L15PO744107B0424P0D1N773",
  "identifiant": {
    "legislature": "15",
    "numero": "773",
    "numRect": "0",
    "saisine": {
      "refTexteLegislatif": "PRJLANR5L15B0424",
      "numeroPartiePLF": "0",
      "organeExamen": "PO744107",
      "mentionSecondeDeliberation": "0"
    }
  },
  "numeroLong": "773",
  "etapeTexte": "1ère lecture (1ère assemblée saisie)",
  "triAmendement": "ahx",
  "cardinaliteAmdtMultiples": "1",
  "amendementParent": {
    "@xmlns:xsi": "http://www.w3.org/2001/XMLSchema-instance",
    "@xsi:nil": "true"
  },
  "etat": "Discuté",
  "signataires": {
    "auteur": {
      "typeAuteur": "Depute",
      "acteurRef": "PA720878",
      "organeRef": {
        "@xmlns:xsi": "http://www.w3.org/2001/XMLSchema-instance",
        "@xsi:nil": "true"
      },
      "groupePolitiqueRef": "PO730964"
    },
    "cosignataires": {
      "acteurRef": [
        "PA721514",
        "PA720960",
        "PA607155",
        "PA677483",
        "PA719302",
        "PA721398",
        "PA719456",
        "PA720512",
        "PA722118",
        "PA721584",
        "PA720862",
        "PA719740",
        "PA722170",
        "PA719858",
        "PA719130",
        "PA719850",
        "PA720590",
        "PA720066",
        "PA722086",
        "PA607193",
        "PA720520",
        "PA720878",
        "PA720342",
        "PA720932",
        "PA643127",
        "PA608641",
        "PA719242",
        "PA606171",
        "PA718876",
        "PA721860",
        "PA720170",
        "PA607595",
        "PA720014",
        "PA722398",
        "PA642695",
        "PA719652",
        "PA719728",
        "PA718902",
        "PA721690"
      ]
    },
    "texteAffichable": "M.&#160;Saint-Martin,  Mme&#160;Beaudouin-Hubiere, M.&#160;Besson-Moreau, M.&#160;Blein, M.&#160;Bothorel, Mme&#160;Cattelot, M.&#160;Cesarini, M.&#160;Colas-Roy, M.&#160;Da Silva, M.&#160;Daniel, Mme&#160;Degois, M.&#160;Descrozaille, Mme&#160;Errante, Mme&#160;Grandjean, Mme&#160;Hammerer, Mme&#160;Kerbarh, M.&#160;Le Bohec, Mme&#160;Le Peih, Mme&#160;Limon, M.&#160;Mazars, Mme&#160;M&#246;rch, M.&#160;Moreau, Mme&#160;Motin, M.&#160;Pellois, M.&#160;Pietraszewski, M.&#160;Potterie, M.&#160;Questel, M.&#160;Rebeyrotte, Mme&#160;Rist, M.&#160;C&#233;dric&#160;Roussel, M.&#160;Serva, Mme&#160;Sylla, M.&#160;Tan, M.&#160;Taquet, M.&#160;Terlier, Mme&#160;Thourot, Mme&#160;Tiegna, M.&#160;Ferrand, Mme&#160;Michel et les membres du groupe La R&#233;publique en Marche"
  },
  "pointeurFragmentTexte": {
    "missionVisee": {
      "@xmlns:xsi": "http://www.w3.org/2001/XMLSchema-instance",
      "@xsi:nil": "true"
    },
    "division": {
      "titre": "Article 4",
      "articleDesignationCourte": "APRÈS ART. 4",
      "type": "ARTICLE",
      "avant_A_Apres": "Après",
      "divisionRattachee": "APRÈS L'ARTICLE 4, insérer l'article suivant:",
      "articleAdditionnel": "1",
      "chapitreAdditionnel": {
        "@xmlns:xsi": "http://www.w3.org/2001/XMLSchema-instance",
        "@xsi:nil": "true"
      },
      "urlDivisionTexteVise": "/15/textes/0424.asp#D_Article_4"
    },
    "alinea": {
      "@xmlns:xsi": "http://www.w3.org/2001/XMLSchema-instance",
      "@xsi:nil": "true"
    }
  },
  "corps": {
    "dispositif": "<p style=\"text-align: justify;\">Les deux alin&#233;as du II de l&#8217;article L.&#160;59&#160;A du livre des proc&#233;dures fiscales sont remplac&#233;s par un alin&#233;a ainsi r&#233;dig&#233;&#160;:</p><p style=\"text-align: justify;\">&#160;&#171;&#160;II.&#160;&#8211;&#160;Dans les domaines mentionn&#233;s au I, la commission des imp&#244;ts directs et des taxes sur le chiffre d&#8217;affaires se prononce sur les faits, leur qualification et les cons&#233;quences qui en d&#233;coulent sur la rectification notifi&#233;e.&#160;&#187;</p>",
    "exposeSommaire": "<p style=\"text-align: justify;\">Les commissions d&#233;partementales des imp&#244;ts directs et des taxes sur le chiffre d&#8217;affaire sont un r&#244;le de pr&#233;vention des litiges et repr&#233;sentent une chance d&#8217;&#233;viter une proc&#233;dure contentieuse longue et al&#233;atoire.</p><p style=\"text-align: justify;\">Cet amendement a pour objet d&#8217;&#233;tendre le champ de comp&#233;tence des commissions pour couvrir les questions de fait, les questions de qualification et leurs cons&#233;quences sur les rectifications propos&#233;es.</p>",
    "annexeExposeSommaire": {
      "@xmlns:xsi": "http://www.w3.org/2001/XMLSchema-instance",
      "@xsi:nil": "true"
    }
  },
  "representations": {
    "representation": {
      "nom": "PDF",
      "typeMime": {
        "type": "application",
        "subType": "PDF"
      },
      "statutRepresentation": {
        "verbatim": "true",
        "canonique": "true",
        "officielle": "true",
        "transcription": "false",
        "enregistrement": "false"
      },
      "repSource": {
        "@xmlns:xsi": "http://www.w3.org/2001/XMLSchema-instance",
        "@xsi:nil": "true"
      },
      "offset": {
        "@xmlns:xsi": "http://www.w3.org/2001/XMLSchema-instance",
        "@xsi:nil": "true"
      },
      "contenu": {
        "documentURI": "/15/amendements/0424/CSCONF/773.pdf"
      },
      "dateDispoRepresentation": {
        "@xmlns:xsi": "http://www.w3.org/2001/XMLSchema-instance",
        "@xsi:nil": "true"
      }
    }
  },
  "seanceDiscussion": {
    "@xmlns:xsi": "http://www.w3.org/2001/XMLSchema-instance",
    "@xsi:nil": "true"
  },
  "sort": {
    "dateSaisie": "2018-01-15T22:33:37.000+01:00",
    "sortEnSeance": "Retiré"
  },
  "dateDepot": "2018-01-11T01:00:00.000+01:00",
  "dateDistribution": "2018-01-15T01:00:00.000+01:00",
  "article99": "0",
  "loiReference": {
    "codeLoi": "livre procédures fiscales",
    "divisionCodeLoi": "59A"
  }
}