{
  "@xmlns": "http://schemas.assemblee-nationale.fr/referentiel",
  "uid": "AMANR5L15PO419865B2274P0D1N918",
  "identifiant": {
    "legislature": "15",
    "numero": "918",
    "numRect": "0",
    "saisine": {
      "refTexteLegislatif": "PRJLANR5L15B2274",
      "numeroPartiePLF": "0",
      "organeExamen": "PO419865",
      "mentionSecondeDeliberation": "0"
    }
  },
  "numeroLong": "CD918",
  "etapeTexte": "1ère lecture (2ème assemblée saisie)",
  "triAmendement": "caiaaaaaaaaaaaaaaaaaaaaaaaaaaaaaaaaaaaaaaaaaaaaaaackkw",
  "cardinaliteAmdtMultiples": "1",
  "amendementParent": {
    "@xmlns:xsi": "http://www.w3.org/2001/XMLSchema-instance",
    "@xsi:nil": "true"
  },
  "etat": "En traitement",
  "signataires": {
    "auteur": {
      "typeAuteur": "Depute",
      "acteurRef": "PA722312",
      "organeRef": {
        "@xmlns:xsi": "http://www.w3.org/2001/XMLSchema-instance",
        "@xsi:nil": "true"
      },
      "groupePolitiqueRef": "PO730964"
    },
    "cosignataires": {
      "acteurRef": [
        "PA718876",
        "PA722312",
        "PA718710",
        "PA722090",
        "PA719230",
        "PA722300",
        "PA606639",
        "PA722000",
        "PA719024",
        "PA719456",
        "PA607595",
        "PA719154",
        "PA722260",
        "PA718944",
        "PA720414"
      ]
    },
    "texteAffichable": "Mme&#160;Bessot Ballot,  Mme&#160;Pascale&#160;Boyer, Mme&#160;Racon-Bouzon, M.&#160;Blanchet, Mme&#160;M&#246;rch, M.&#160;Vignal, Mme&#160;P&#233;telle, M.&#160;Kerlogot, M.&#160;Villani, M.&#160;Martin, M.&#160;Pellois, M.&#160;Besson-Moreau, M.&#160;Perrot, Mme&#160;Khedher et M.&#160;Buchou"
  },
  "pointeurFragmentTexte": {
    "missionVisee": {
      "@xmlns:xsi": "http://www.w3.org/2001/XMLSchema-instance",
      "@xsi:nil": "true"
    },
    "division": {
      "titre": "Article 5 B",
      "articleDesignationCourte": "ART. 5 B",
      "type": "ARTICLE",
      "avant_A_Apres": "A",
      "divisionRattachee": "ARTICLE 5 B",
      "articleAdditionnel": {
        "@xmlns:xsi": "http://www.w3.org/2001/XMLSchema-instance",
        "@xsi:nil": "true"
      },
      "chapitreAdditionnel": {
        "@xmlns:xsi": "http://www.w3.org/2001/XMLSchema-instance",
        "@xsi:nil": "true"
      },
      "urlDivisionTexteVise": "/15/textes/2274.asp#D_Article_5_B"
    },
    "alinea": {
      "@xmlns:xsi": "http://www.w3.org/2001/XMLSchema-instance",
      "@xsi:nil": "true"
    }
  },
  "corps": {
    "dispositif": "<p style=\"text-align: justify;\">Supprimer cet article.</p>",
    "exposeSommaire": "<p style=\"text-align: justify;\">L&#8217;article&#160;5 B introduit par le S&#233;nat pr&#233;voit qu&#8217;&#224; partir du 1<sup>er</sup> janvier 2021, les professionnels proposant des denr&#233;es alimentaires sur les halles, les march&#233;s et les foires ou lors de ventes au d&#233;ballage sont tenus de proposer &#224; une ou plusieurs associations agr&#233;es la cession &#224; titre gratuit des denr&#233;es ne pouvant donner lieu &#224; la transformation ou valorisation, avant qu&#8217;elles ne soient impropres &#224; la consommation humaine. Il &#233;tend ainsi le dispositif issu de la loi visant &#224; lutter contre le gaspillage alimentaire.</p><p style=\"text-align: justify;\">Plusieurs arguments justifient la proposition de supprimer cet article.</p><p style=\"text-align: justify;\">En effet, comme l&#8217;indiquent les acteurs de l&#8217;alimentation de proximit&#233;, l&#8217;id&#233;e selon laquelle les march&#233;s seraient responsables de 5&#160;% du gaspillage alimentaire en France, en particulier dans la fili&#232;re des fruits et l&#233;gumes, n&#8217;est en r&#233;alit&#233; &#171;&#160;que&#160;&#187; de 2,8&#160;% au stade de la vente au d&#233;tail, dont 1,32&#160;% pour les Primeurs. C&#8217;est ce qui ressort d&#8217;une &#233;tude r&#233;alis&#233;e en collaboration avec l&#8217;INRA pour Interfel, l&#8217;interprofession des fruits et l&#233;gumes, et France Agrimer.</p><p style=\"text-align: justify;\">Par ailleurs, il y aurait peu d&#8217;invendus &#224; proposer aux associations caritatives. Il y en aurait d&#8217;autant moins que les denr&#233;es alimentaires donn&#233;es ne doivent pas &#234;tre impropres &#224; la consommation humaine. Or, peu de denr&#233;es sont emball&#233;es dans les halles et march&#233;s et peuvent donc facilement entrer en contact les unes avec les autres lors du transport ou sur le lieu de stockage, la viande ou le poisson avec les fruits et l&#233;gumes par exemple. Il faut souligner que les associations sont soumises aux m&#234;mes r&#232;gles d&#8217;hygi&#232;ne que les commer&#231;ants car il est essentiel que les denr&#233;es soient conserv&#233;es dans des conditions &#233;quivalentes. Aussi, il est important de souligner que dans les halles et march&#233;s, les petits commer&#231;ants ne disposent pas des m&#234;mes moyens logistiques que la grande distribution, en termes par exemple de reconditionnement des invendus ou de leur collecte.</p><p style=\"text-align: justify;\">A ce titre, comme l&#8217;a soulign&#233; le rapport d&#8217;&#233;valuation de la loi GAROT remis en juin 2019, le dispositif l&#233;gislatif actuel qui contraint tous les commerces de d&#233;tail alimentaires de plus de 400 m&#178; &#224; signer une convention avec des associations est suffisant. Il estime par ailleurs qu&#8217;il serait contreproductif d&#8217;obliger tous les commer&#231;ants &#224; &#233;tablir de telles conventions d&#8217;aide alimentaire, d&#8217;autant que, dans certaines zones, les associations d&#8217;aide ne sont tout simplement pas en mesure de collecter les denr&#233;es alimentaires dans des conditions optimales.</p><p style=\"text-align: justify;\">Enfin, &#224; l&#8217;heure d&#8217;une transition importante vers la simplification administrative, il ne semble pas raisonnable de vouloir ajouter des contraintes administratives suppl&#233;mentaires aux commer&#231;ants travaillant dans les halles et march&#233;s, en les notamment obligeant &#224; signer des conventions de dons alimentaires.</p><p style=\"text-align: justify;\">Enfin, de nombreux petits commer&#231;ants dans nos territoires ont une vraie conscience environnementale et d&#233;montrent la volont&#233; de lutter contre le gaspillage alimentaire.</p><p style=\"text-align: justify;\">Aid&#233;s par les services municipaux, qui pr&#233;voient des zones de collecte, et quelques associations locales, ils parviennent souvent &#224; venir en aide aux plus d&#233;munis dans de bonnes conditions de collecte de leurs invendus.</p>",
    "annexeExposeSommaire": {
      "@xmlns:xsi": "http://www.w3.org/2001/XMLSchema-instance",
      "@xsi:nil": "true"
    },
    "cartoucheDelaiDepotDepasse": "Sous réserve de son traitement par les services de l'Assemblée nationale et de sa recevabilité",
    "avantAppel": {
      "@xmlns:xsi": "http://www.w3.org/2001/XMLSchema-instance",
      "@xsi:nil": "true"
    }
  },
  "representations": {
    "representation": {
      "nom": "PDF",
      "typeMime": {
        "type": "application",
        "subType": "PDF"
      },
      "statutRepresentation": {
        "verbatim": "true",
        "canonique": "true",
        "officielle": "true",
        "transcription": "false",
        "enregistrement": "false"
      },
      "repSource": {
        "@xmlns:xsi": "http://www.w3.org/2001/XMLSchema-instance",
        "@xsi:nil": "true"
      },
      "offset": {
        "@xmlns:xsi": "http://www.w3.org/2001/XMLSchema-instance",
        "@xsi:nil": "true"
      },
      "contenu": {
        "documentURI": "/15/amendements/2274/CION-DVP/CD918.pdf"
      },
      "dateDispoRepresentation": {
        "@xmlns:xsi": "http://www.w3.org/2001/XMLSchema-instance",
        "@xsi:nil": "true"
      }
    }
  },
  "seanceDiscussion": {
    "@xmlns:xsi": "http://www.w3.org/2001/XMLSchema-instance",
    "@xsi:nil": "true"
  },
  "sort": {
    "@xmlns:xsi": "http://www.w3.org/2001/XMLSchema-instance",
    "@xsi:nil": "true"
  },
  "dateDepot": "2019-11-20T01:00:00.000+01:00",
  "dateDistribution": "2019-11-20T01:00:00.000+01:00",
  "article99": "0",
  "loiReference": {
    "codeLoi": {
      "@xmlns:xsi": "http://www.w3.org/2001/XMLSchema-instance",
      "@xsi:nil": "true"
    },
    "divisionCodeLoi": {
      "@xmlns:xsi": "http://www.w3.org/2001/XMLSchema-instance",
      "@xsi:nil": "true"
    }
  }
}