{
  "@xmlns": "http://schemas.assemblee-nationale.fr/referentiel",
  "uid": "AMANR5L15SEA717460BTC0446P0D1N197",
  "identifiant": {
    "legislature": "15",
    "numero": "197",
    "numRect": "0",
    "saisine": {
      "refTexteLegislatif": "PRJLANR5L15BTC0446",
      "numeroPartiePLF": "0",
      "organeExamen": "PO717460",
      "mentionSecondeDeliberation": "0"
    }
  },
  "numeroLong": "197",
  "etapeTexte": "1ère lecture (1ère assemblée saisie)",
  "triAmendement": "m",
  "cardinaliteAmdtMultiples": "1",
  "amendementParent": {
    "@xmlns:xsi": "http://www.w3.org/2001/XMLSchema-instance",
    "@xsi:nil": "true"
  },
  "etat": "Discuté",
  "signataires": {
    "auteur": {
      "typeAuteur": "Depute",
      "acteurRef": "PA721226",
      "organeRef": {
        "@xmlns:xsi": "http://www.w3.org/2001/XMLSchema-instance",
        "@xsi:nil": "true"
      },
      "groupePolitiqueRef": "PO730958"
    },
    "cosignataires": {
      "acteurRef": [
        "PA719578",
        "PA721226",
        "PA718860",
        "PA588884",
        "PA718868",
        "PA719676",
        "PA721960",
        "PA720430",
        "PA721202",
        "PA720892",
        "PA721210",
        "PA2150",
        "PA721062",
        "PA720286",
        "PA722142",
        "PA720846",
        "PA720422"
      ]
    },
    "texteAffichable": "Mme&#160;Rubin,  Mme&#160;Autain, M.&#160;Bernalicis, M.&#160;Coquerel, M.&#160;Corbi&#232;re, Mme&#160;Fiat, M.&#160;Lachaud, M.&#160;Larive, M.&#160;M&#233;lenchon, Mme&#160;Obono, Mme&#160;Panot, M.&#160;Prud&apos;homme, M.&#160;Quatennens, M.&#160;Ratenon, Mme&#160;Ressiguier, M.&#160;Ruffin et Mme&#160;Taurine"
  },
  "pointeurFragmentTexte": {
    "missionVisee": {
      "@xmlns:xsi": "http://www.w3.org/2001/XMLSchema-instance",
      "@xsi:nil": "true"
    },
    "division": {
      "titre": "Article 2",
      "articleDesignationCourte": "APRÈS ART. 2",
      "type": "ARTICLE",
      "avant_A_Apres": "Après",
      "divisionRattachee": "APRÈS L'ARTICLE 2, insérer l'article suivant:",
      "articleAdditionnel": "1",
      "chapitreAdditionnel": {
        "@xmlns:xsi": "http://www.w3.org/2001/XMLSchema-instance",
        "@xsi:nil": "true"
      },
      "urlDivisionTexteVise": "/15/textes/0446.asp#D_Article_2"
    },
    "alinea": {
      "@xmlns:xsi": "http://www.w3.org/2001/XMLSchema-instance",
      "@xsi:nil": "true"
    }
  },
  "corps": {
    "dispositif": "<p style=\"text-align: justify;\">&#171;&#160;Le Gouvernement remet au Parlement, dans un d&#233;lai d&#8217;un an &#224; compter de la promulgation de la pr&#233;sente loi, un rapport &#233;valuant l&#8217;impact sur les in&#233;galit&#233;s scolaires et la r&#233;ussite en premier cycle d&#8217;enseignement sup&#233;rieur d&#8217;une fusion budg&#233;taire et organisationnelle entre les deux ann&#233;es de classe pr&#233;paratoire aux grandes &#233;coles et les deux premi&#232;res ann&#233;es de premier cycle universitaire. Il proposera des modalit&#233;s d&#8217;int&#233;gration des effectifs et des moyens des classes pr&#233;paratoires dans l&#8217;universit&#233; publique afin de lancer une r&#233;flexion sur la fin de l&#8217;enseignement sup&#233;rieur &#224; deux vitesses et la mise en &#339;uvre d&#8217;une universit&#233; d&#233;mocratique d&#8217;excellence.&#160;&#187;</p>",
    "exposeSommaire": "<p style=\"text-align: justify;\">Le co&#251;t moyen d&#8217;un &#233;tudiant d&#8217;universit&#233; pour les finances publiques est de 10 390&#160;euros par an. Il est de 15 100&#160;euros pour un &#233;tudiant de classe pr&#233;paratoire aux grandes &#233;coles. De cette diff&#233;rence de moyens r&#233;sulte des conditions d&#8217;&#233;tudes in&#233;gales&#160;: les effectifs des classes pr&#233;paratoires sont limit&#233;s, les professeurs sont mobilis&#233;s &#224; plein temps sur les activit&#233;s d&#8217;enseignement, le nombre d&#8217;heures de cours est beaucoup plus important et l&#8217;encadrement individualis&#233; est tr&#232;s fort.</p><p style=\"text-align: justify;\">Or, la composition sociale des deux formations diff&#232;re. Les effets de s&#233;lection sociale, fort bien document&#233;s par la sociologie fran&#231;aise depuis plusieurs d&#233;cennies, ont favoris&#233; la mise &#224; l&#8217;&#233;cart des enfants de classes populaires de ces formations tr&#232;s qualitatives. Ainsi, elles ne sont compos&#233;es que de 6&#160;% d&#8217;enfants d&#8217;ouvriers contre 50&#160;% d&#8217;enfants de cadres et professions intellectuelles sup&#233;rieures, alors que la premi&#232;re cat&#233;gorie occupe une part nettement plus importante de la population fran&#231;aise.</p><p style=\"text-align: justify;\">Nous sommes arriv&#233;s dans une situation paradoxale o&#249; les plus favoris&#233;s par leur milieu sont ceux &#224; qui on donne plus, alors que ceux qui ont moins sont moins bien accompagn&#233;s par notre syst&#232;me scolaire.</p><p style=\"text-align: justify;\">L&#8217;objectif de cette demande de rapport est de permettre l&#8217;instauration d&#8217;une v&#233;ritable &#233;galit&#233; des chances en permettant &#224; tous les &#233;tudiants de disposer des m&#234;mes conditions d&#8217;&#233;tudes d&#8217;excellence pour d&#233;marrer leurs &#233;tudes sup&#233;rieures.</p><p style=\"text-align: justify;\">Il s&#8217;agirait de prendre le meilleur des classes pr&#233;paratoires (fort encadrement, enseignements exigeants) et de l&#8217;int&#233;grer au premier cycle de l&#8217;universit&#233;.</p><p style=\"text-align: justify;\">Cela aurait pour effet de permettre la d&#233;mocratisation des grandes &#233;coles, puisque tous les &#233;tudiants de fili&#232;re g&#233;n&#233;rale auraient d&#233;sormais la possibilit&#233; d&#8217;en tenter les concours.</p>",
    "annexeExposeSommaire": {
      "@xmlns:xsi": "http://www.w3.org/2001/XMLSchema-instance",
      "@xsi:nil": "true"
    }
  },
  "representations": {
    "representation": {
      "nom": "PDF",
      "typeMime": {
        "type": "application",
        "subType": "PDF"
      },
      "statutRepresentation": {
        "verbatim": "true",
        "canonique": "true",
        "officielle": "true",
        "transcription": "false",
        "enregistrement": "false"
      },
      "repSource": {
        "@xmlns:xsi": "http://www.w3.org/2001/XMLSchema-instance",
        "@xsi:nil": "true"
      },
      "offset": {
        "@xmlns:xsi": "http://www.w3.org/2001/XMLSchema-instance",
        "@xsi:nil": "true"
      },
      "contenu": {
        "documentURI": "/15/amendements/0446/AN/197.pdf"
      },
      "dateDispoRepresentation": {
        "@xmlns:xsi": "http://www.w3.org/2001/XMLSchema-instance",
        "@xsi:nil": "true"
      }
    }
  },
  "seanceDiscussion": "RUANR5L15S2018IDS20836",
  "sort": {
    "dateSaisie": "2017-12-13T22:50:39.000+01:00",
    "sortEnSeance": "Rejeté"
  },
  "dateDepot": "2017-12-08T01:00:00.000+01:00",
  "dateDistribution": "2017-12-11T01:00:00.000+01:00",
  "article99": "0",
  "loiReference": {
    "codeLoi": {
      "@xmlns:xsi": "http://www.w3.org/2001/XMLSchema-instance",
      "@xsi:nil": "true"
    },
    "divisionCodeLoi": {
      "@xmlns:xsi": "http://www.w3.org/2001/XMLSchema-instance",
      "@xsi:nil": "true"
    }
  }
}