{
  "@xmlns": "http://schemas.assemblee-nationale.fr/referentiel",
  "uid": "AMANR5L15PO59048B0235P2D1N610",
  "identifiant": {
    "legislature": "15",
    "numero": "610",
    "numRect": "0",
    "saisine": {
      "refTexteLegislatif": "PRJLANR5L15B0235",
      "numeroPartiePLF": "2",
      "organeExamen": "PO59048",
      "mentionSecondeDeliberation": "0"
    }
  },
  "numeroLong": "II-CF610",
  "etapeTexte": "1ère lecture (1ère assemblée saisie)",
  "triAmendement": "dri",
  "cardinaliteAmdtMultiples": "1",
  "amendementParent": {
    "@xmlns:xsi": "http://www.w3.org/2001/XMLSchema-instance",
    "@xsi:nil": "true"
  },
  "etat": "Discuté",
  "signataires": {
    "auteur": {
      "typeAuteur": "Depute",
      "acteurRef": "PA608172",
      "organeRef": {
        "@xmlns:xsi": "http://www.w3.org/2001/XMLSchema-instance",
        "@xsi:nil": "true"
      },
      "groupePolitiqueRef": "PO730946"
    },
    "cosignataires": {
      "acteurRef": [
        "PA719930",
        "PA1198",
        "PA332614",
        "PA609590",
        "PA608695",
        "PA1809",
        "PA267233",
        "PA335532",
        "PA607553",
        "PA429893",
        "PA720988",
        "PA342415",
        "PA340343",
        "PA610681",
        "PA333285",
        "PA608011",
        "PA330357",
        "PA333818",
        "PA1592",
        "PA605069",
        "PA642764",
        "PA335999",
        "PA337483",
        "PA608172",
        "PA588886",
        "PA508",
        "PA609332",
        "PA335054",
        "PA405480",
        "PA643145",
        "PA1008"
      ]
    },
    "texteAffichable": "Mme&#160;Pires Beaune,  Mme&#160;Rabault, M.&#160;Jean-Louis&#160;Bricout, M.&#160;Pupponi, M.&#160;Faure, M.&#160;Aviragnet, Mme&#160;Bareigts, Mme&#160;Batho, Mme&#160;Battistel, Mme&#160;Bi&#233;mouret, M.&#160;Bouillon, M.&#160;Carvounas, M.&#160;Alain&#160;David, Mme&#160;Laurence&#160;Dumont, M.&#160;Dussopt, M.&#160;Garot, M.&#160;David&#160;Habib, M.&#160;Hutin, M.&#160;Juanico, Mme&#160;Karamanli, M.&#160;J&#233;r&#244;me&#160;Lambert, M.&#160;Le Foll, M.&#160;Letchimy, Mme&#160;Manin, Mme&#160;Pau-Langevin, M.&#160;Potier, M.&#160;Pueyo, M.&#160;Saulignac, Mme&#160;Untermaier, Mme&#160;Vainqueur-Christophe et M.&#160;Vallaud"
  },
  "pointeurFragmentTexte": {
    "missionVisee": {
      "@xmlns:xsi": "http://www.w3.org/2001/XMLSchema-instance",
      "@xsi:nil": "true"
    },
    "division": {
      "titre": "Article 39",
      "articleDesignationCourte": "ART. 39",
      "type": "ARTICLE",
      "avant_A_Apres": "A",
      "divisionRattachee": "ARTICLE 39",
      "articleAdditionnel": {
        "@xmlns:xsi": "http://www.w3.org/2001/XMLSchema-instance",
        "@xsi:nil": "true"
      },
      "chapitreAdditionnel": {
        "@xmlns:xsi": "http://www.w3.org/2001/XMLSchema-instance",
        "@xsi:nil": "true"
      },
      "urlDivisionTexteVise": "/15/textes/0235C.asp#D_Article_39"
    },
    "alinea": {
      "avant_A_Apres": {
        "@xmlns:xsi": "http://www.w3.org/2001/XMLSchema-instance",
        "@xsi:nil": "true"
      },
      "numero": "4",
      "alineaDesignation": {
        "@xmlns:xsi": "http://www.w3.org/2001/XMLSchema-instance",
        "@xsi:nil": "true"
      }
    }
  },
  "corps": {
    "dispositif": "<p style=\"text-align: justify;\">I&#160;&#8211;&#160;Supprimer les alin&#233;as 4 &#224; 9.</p><p style=\"text-align: justify;\">II.&#160;&#8211;&#160;La perte de recettes pour l&#8217;&#201;tat est compens&#233;e &#224; due concurrence par la cr&#233;ation d&#8217;une taxe additionnelle aux droits mentionn&#233;s aux articles 575 et 575 A du code g&#233;n&#233;ral des imp&#244;ts.&#160;&#187;.</p>",
    "exposeSommaire": "<p style=\"text-align: justify;\">La mise en place de la r&#233;duction d&#8217;imp&#244;t &#171;&#160;Pinel&#160;&#187; a particip&#233; grandement &#224; la relance de la production de logements neufs. Pour rappel, apr&#232;s des ann&#233;es de crise entre 2011 et 2015, le secteur de la construction de logements neufs a connu un rebond en 2016, qui s&#8217;est confirm&#233; en 2017.</p><p style=\"text-align: justify;\">D&#8217;apr&#232;s le minist&#232;re de la coh&#233;sion des territoires, de septembre 2016 &#224; septembre 2017, 499 500 logements ont &#233;t&#233; autoris&#233;s &#224; la construction et 411 300 logements ont &#233;t&#233; mis en chantier, soit une augmentation respective de 15,2&#160;% et 17,1&#160;% par rapport au cumul des douze mois pr&#233;c&#233;dents.</p><p style=\"text-align: justify;\">D&#8217;apr&#232;s la F&#233;d&#233;ration des promoteurs immobiliers, gr&#226;ce au dispositif &#171;&#160;Pinel&#160;&#187;, les ventes de logements neufs &#224; des investisseurs sont pass&#233;es de 38 144 en 2014 &#224; 66 280 en 2016, soit une hausse de 74&#160;% en trois ans.</p><p style=\"text-align: justify;\">La fin du dispositif &#171;&#160;Pinel&#160;&#187; est brutale pour les zones B2 et C. Cet amendement propose de maintenir le dispositif actuellement en vigueur pour l&#8217;ann&#233;e 2018.</p>",
    "annexeExposeSommaire": {
      "@xmlns:xsi": "http://www.w3.org/2001/XMLSchema-instance",
      "@xsi:nil": "true"
    }
  },
  "representations": {
    "representation": {
      "nom": "PDF",
      "typeMime": {
        "type": "application",
        "subType": "PDF"
      },
      "statutRepresentation": {
        "verbatim": "true",
        "canonique": "true",
        "officielle": "true",
        "transcription": "false",
        "enregistrement": "false"
      },
      "repSource": {
        "@xmlns:xsi": "http://www.w3.org/2001/XMLSchema-instance",
        "@xsi:nil": "true"
      },
      "offset": {
        "@xmlns:xsi": "http://www.w3.org/2001/XMLSchema-instance",
        "@xsi:nil": "true"
      },
      "contenu": {
        "documentURI": "/15/amendements/0235C/CION_TOUTE/CF610.pdf"
      },
      "dateDispoRepresentation": {
        "@xmlns:xsi": "http://www.w3.org/2001/XMLSchema-instance",
        "@xsi:nil": "true"
      }
    }
  },
  "seanceDiscussion": {
    "@xmlns:xsi": "http://www.w3.org/2001/XMLSchema-instance",
    "@xsi:nil": "true"
  },
  "sort": {
    "dateSaisie": "2017-11-09T09:35:44.000+01:00",
    "sortEnSeance": "Tombé"
  },
  "dateDepot": "2017-11-06T01:00:00.000+01:00",
  "dateDistribution": "2017-11-09T01:00:00.000+01:00",
  "article99": "0",
  "loiReference": {
    "codeLoi": {
      "@xmlns:xsi": "http://www.w3.org/2001/XMLSchema-instance",
      "@xsi:nil": "true"
    },
    "divisionCodeLoi": {
      "@xmlns:xsi": "http://www.w3.org/2001/XMLSchema-instance",
      "@xsi:nil": "true"
    }
  }
}