{
  "@xmlns": "http://schemas.assemblee-nationale.fr/referentiel",
  "uid": "AMANR5L15SEA717460B1297P0D1N1479",
  "identifiant": {
    "legislature": "15",
    "numero": "1479",
    "numRect": "0",
    "saisine": {
      "refTexteLegislatif": "PRJLANR5L15B1297",
      "numeroPartiePLF": "0",
      "organeExamen": "PO717460",
      "mentionSecondeDeliberation": "0"
    }
  },
  "numeroLong": "1479",
  "etapeTexte": "1ère lecture (1ère assemblée saisie)",
  "triAmendement": "bbcaaaaaaaaaaaaaaaaaaaaaaaaaaaaaaaaaaaaaaaaaaaaaaaaji",
  "cardinaliteAmdtMultiples": "1",
  "amendementParent": {
    "@xmlns:xsi": "http://www.w3.org/2001/XMLSchema-instance",
    "@xsi:nil": "true"
  },
  "etat": "Discuté",
  "signataires": {
    "auteur": {
      "typeAuteur": "Depute",
      "acteurRef": "PA720286",
      "organeRef": {
        "@xmlns:xsi": "http://www.w3.org/2001/XMLSchema-instance",
        "@xsi:nil": "true"
      },
      "groupePolitiqueRef": "PO730958"
    },
    "cosignataires": {
      "acteurRef": [
        "PA721226",
        "PA720430",
        "PA721202",
        "PA721960",
        "PA720422",
        "PA718868",
        "PA719676",
        "PA721210",
        "PA722142",
        "PA2150",
        "PA721062",
        "PA719578",
        "PA718860",
        "PA720286",
        "PA720892",
        "PA720846",
        "PA588884"
      ]
    },
    "texteAffichable": "Mme&#160;Fiat,  Mme&#160;Autain, M.&#160;Bernalicis, M.&#160;Ratenon, M.&#160;Coquerel, M.&#160;Corbi&#232;re, M.&#160;Lachaud, M.&#160;Larive, M.&#160;M&#233;lenchon, Mme&#160;Obono, Mme&#160;Panot, M.&#160;Prud&apos;homme, M.&#160;Quatennens, Mme&#160;Ressiguier, Mme&#160;Rubin, M.&#160;Ruffin et Mme&#160;Taurine"
  },
  "pointeurFragmentTexte": {
    "missionVisee": {
      "@xmlns:xsi": "http://www.w3.org/2001/XMLSchema-instance",
      "@xsi:nil": "true"
    },
    "division": {
      "titre": "Article 9",
      "articleDesignationCourte": "APRÈS ART. 9",
      "type": "ARTICLE",
      "avant_A_Apres": "Après",
      "divisionRattachee": "APRÈS L'ARTICLE 9, insérer l'article suivant:",
      "articleAdditionnel": "1",
      "chapitreAdditionnel": {
        "@xmlns:xsi": "http://www.w3.org/2001/XMLSchema-instance",
        "@xsi:nil": "true"
      },
      "urlDivisionTexteVise": "/15/textes/1297.asp#D_Article_9"
    },
    "alinea": {
      "@xmlns:xsi": "http://www.w3.org/2001/XMLSchema-instance",
      "@xsi:nil": "true"
    }
  },
  "corps": {
    "dispositif": "<p style=\"text-align: justify;\">Le chapitre II du titre unique du livre II <i>bis</i> de la troisi&#232;me partie du code de la sant&#233; publique est compl&#233;t&#233; par des articles L.&#160;3232&#8209;10, L.&#160;3232&#8209;11, L.&#160;3232&#8209;12 et L.&#160;3232&#8209;13 ainsi r&#233;dig&#233;s&#160;:</p><p style=\"text-align: justify;\">&#171;&#160;<i>Art.&#160;L.&#160;3232-10</i>.&#160;&#8211;&#160;La propagande ou la publicit&#233;, directe ou indirecte, des boissons sucr&#233;es relevant du code NC 2202 du tarif des douanes, ainsi que toute distribution gratuite de boissons sucr&#233;es relevant du code NC 2202 du tarif des douanes. Les amendes prononc&#233;es sur le fondement de la m&#233;connaissance &#224; ce titre constituent des recettes affect&#233;es au financement des r&#233;gimes obligatoires de base.</p><p style=\"text-align: justify;\">&#171;&#160;Elles ne s&#8217;appliquent pas non plus&#160;:</p><p style=\"text-align: justify;\">&#171;&#160;1&#176; Aux publications et services de communication en ligne &#233;dit&#233;s par les organisations professionnelles de producteurs, fabricants et distributeurs des boissons sucr&#233;es relevant du code NC 2202 du tarif des douanes, r&#233;serv&#233;s &#224; leurs adh&#233;rents, ni aux publications professionnelles sp&#233;cialis&#233;es dont la liste est &#233;tablie par arr&#234;t&#233; sign&#233; par les ministres charg&#233;s de la sant&#233; et de la communication, ni aux services de communication en ligne &#233;dit&#233;s &#224; titre professionnel qui ne sont accessibles qu&#8217;aux professionnels de la production, de la fabrication et de la distribution des boissons sucr&#233;es relevant du code NC 2202 du tarif des douanes.</p><p style=\"text-align: justify;\">&#171;&#160;2&#176; Aux publications imprim&#233;es et &#233;dit&#233;es et aux services de communication en ligne mis &#224; disposition du public par des personnes &#233;tablies dans un pays n&#8217;appartenant pas &#224; l&#8217;Union&#160;europ&#233;enne ou &#224; l&#8217;Espace &#233;conomique&#160;europ&#233;en, lorsque ces publications et services de communication en ligne ne sont pas principalement destin&#233;s au march&#233; communautaire.</p><p style=\"text-align: justify;\">&#171;&#160;Toute op&#233;ration de parrainage ou de m&#233;c&#233;nat est interdite lorsqu&#8217;elle est effectu&#233;e par les fabricants, les importateurs ou les distributeurs des boissons sucr&#233;es relevant du code NC 2202 du tarif des douanes ou lorsqu&#8217;elle a pour objet ou pour effet la propagande ou la publicit&#233; directe ou indirecte en faveur des boissons sucr&#233;es relevant du code NC 2202 du tarif des douanes.</p><p style=\"text-align: justify;\">&#171;&#160;<i>Art.&#160;L.&#160;3232&#8209;11.</i>&#160;&#8211;&#160;Est consid&#233;r&#233;e comme propagande ou publicit&#233; indirecte la propagande ou la publicit&#233; en faveur d&#8217;un organisme, d&#8217;un service, d&#8217;une activit&#233;, d&#8217;un produit ou d&#8217;un article autre que les boissons sucr&#233;es relevant du code NC 2202 du tarif des douanes. lorsque, par son graphisme, sa pr&#233;sentation, l&#8217;utilisation d&#8217;une marque, d&#8217;un embl&#232;me publicitaire ou un autre signe distinctif, elle rappelle les boissons sucr&#233;es relevant du code NC 2202 du tarif des douanes.</p><p style=\"text-align: justify;\">&#171;&#160;Toutefois, ces dispositions ne sont pas applicables &#224; la propagande ou &#224; la publicit&#233; en faveur des boissons sucr&#233;es relevant du code NC 2202 du tarif des douanes qui a &#233;t&#233; mis sur le march&#233; avant le 1<sup>er</sup> janvier 1990 par une entreprise juridiquement et financi&#232;rement distincte de toute entreprise qui fabrique, importe ou commercialise boissons sucr&#233;es relevant du code NC 2202 du tarif des douanes. La cr&#233;ation d&#8217;un lien juridique ou financier entre ces entreprises rend caduque cette d&#233;rogation.</p><p style=\"text-align: justify;\">&#171;&#160;<i>Art.&#160;L.&#160;3232&#8209;12</i>.&#160;&#8211;&#160;La retransmission des comp&#233;titions de sport m&#233;canique, contenant de la publicit&#233; directe ou indirecte en faveur des boissons sucr&#233;es relevant du code NC 2202 du tarif des douanes et qui se d&#233;roulent dans des pays o&#249; la publicit&#233; pour les boissons sucr&#233;es relevant du code NC 2202 du tarif des douanes est autoris&#233;e, peut &#234;tre assur&#233;e par les cha&#238;nes de t&#233;l&#233;vision.</p><p style=\"text-align: justify;\">&#171;&#160;<i>Art.&#160;L.&#160;3232 13.&#160;</i>&#8211;&#160;I.&#160;&#8211;&#160;Les fabricants, les importateurs et les distributeurs de boissons sucr&#233;es relevant du code NC 2202 du tarif des douanes. ainsi que les entreprises, les organisations professionnelles ou les associations les repr&#233;sentant adressent chaque ann&#233;e au ministre charg&#233; de la sant&#233; un rapport d&#233;taillant l&#8217;ensemble des d&#233;penses li&#233;es &#224; des activit&#233;s d&#8217;influence ou de repr&#233;sentation d&#8217;int&#233;r&#234;ts.</p><p style=\"text-align: justify;\">&#171;&#160;II. &#8211; Sont consid&#233;r&#233;es comme des d&#233;penses li&#233;es &#224; des activit&#233;s d&#8217;influence ou de repr&#233;sentation d&#8217;int&#233;r&#234;ts&#160;:</p><p style=\"text-align: justify;\">&#171;&#160;1&#176; Les r&#233;mun&#233;rations de personnels employ&#233;s en totalit&#233; ou en partie pour exercer des activit&#233;s d&#8217;influence ou de repr&#233;sentation d&#8217;int&#233;r&#234;ts&#160;;</p><p style=\"text-align: justify;\">&#171;&#160;2&#176; Les achats de prestations aupr&#232;s de soci&#233;t&#233;s de conseil en activit&#233;s d&#8217;influence ou de repr&#233;sentation d&#8217;int&#233;r&#234;ts&#160;;</p><p style=\"text-align: justify;\">&#171;&#160;3&#176; Les avantages en nature ou en esp&#232;ces, sous quelque forme que ce soit, d&#8217;une fa&#231;on directe ou indirecte, dont la valeur d&#233;passe 10&#160;&#8364;, procur&#233;s &#224;&#160;:</p><p style=\"text-align: justify;\">&#171;&#160;<i>a)</i> Des membres du Gouvernement&#160;;</p><p style=\"text-align: justify;\">&#171;&#160;<i>b)</i> Des membres des cabinets minist&#233;riels ou &#224; des collaborateurs du Pr&#233;sident de la R&#233;publique&#160;;</p><p style=\"text-align: justify;\">&#171;&#160;<i>c)</i> Des collaborateurs du Pr&#233;sident de l&#8217;Assembl&#233;e nationale ou du Pr&#233;sident du S&#233;nat&#160;;</p><p style=\"text-align: justify;\">&#171;&#160;<i>d)</i> Des parlementaires&#160;;</p><p style=\"text-align: justify;\">&#171;&#160;<i>e)</i> Des personnes charg&#233;es d&#8217;une mission de service public que leur mission ou la nature de leur fonction appelle &#224; prendre ou &#224; pr&#233;parer les d&#233;cisions et les avis des autorit&#233;s publiques relatifs aux produits du tabac&#160;;</p><p style=\"text-align: justify;\">&#171;&#160;<i>f)</i> Des experts, personnes physiques ou morales, charg&#233;s, par convention avec une personne publique, d&#8217;une mission de conseil pour le compte d&#8217;une personne publique qui a pour mission de prendre ou de pr&#233;parer les d&#233;cisions et les avis des autorit&#233;s publiques relatifs aux produits du tabac. </p><p style=\"text-align: justify;\">III.&#160;&#8211;&#160;Le rapport mentionn&#233; au I indique, pour chaque entreprise tenue de l&#8217;&#233;tablir&#160;:</p><p style=\"text-align: justify;\">&#171;&#160;1&#176; Le montant total des r&#233;mun&#233;rations mentionn&#233;es au 1&#176; du II et le nombre des personnes concern&#233;es&#160;;</p><p style=\"text-align: justify;\">&#171;&#160;2&#176; Le montant total et l&#8217;identit&#233; des b&#233;n&#233;ficiaires des d&#233;penses mentionn&#233;es au 2&#176; du II&#160;;</p><p style=\"text-align: justify;\">&#171;&#160;3&#176; La nature et l&#8217;identit&#233; du b&#233;n&#233;ficiaire de chaque d&#233;pense mentionn&#233;e au 3&#176; du II.&#160;&#187;</p>",
    "exposeSommaire": "<p style=\"text-align: justify;\">Cet article additionnel vise &#224; interdire la publicit&#233; sur les boissons sucr&#233;es et les sodas. En effet, ces produits posent de graves probl&#232;mes de sant&#233; publique par leur consommation excessive, que la publicit&#233; vise &#224; obtenir.</p><p style=\"text-align: justify;\">Cet amendement est d&#8217;autant plus recevable que les amendes prononc&#233;es en cons&#233;quence de la m&#233;connaissance de cette interdiction sont des recettes affect&#233;es au financement des r&#233;gimes obligatoires de base, en conformit&#233; avec le 1&#176; du B du V de l&#8217;article LO 111&#8209;3 du code de la s&#233;curit&#233; sociale&#160;: (&#171;&#160;Peuvent figurer dans la partie de la loi de financement de l&#8217;ann&#233;e comprenant les dispositions relatives aux recettes et &#224; l&#8217;&#233;quilibre g&#233;n&#233;ral pour l&#8217;ann&#233;e &#224; venir, outre celles pr&#233;vues au C du I, les dispositions&#160;: &#171;&#160;1&#176; Ayant un effet sur les recettes de l&#8217;ann&#233;e des r&#233;gimes obligatoires de base ou des organismes concourant &#224; leur financement, ou relatives, (...)&#160;&#187;).</p><p style=\"text-align: justify;\">Interdire la publicit&#233; sur les boissons sucr&#233;es permet, sinon de r&#233;duire directement leur consommation, au moins de ne pas la promouvoir.</p><p style=\"text-align: justify;\">En effet, la consommation excessive de sucre, notamment par le biais des boissons sucr&#233;es, est encourag&#233;e par la publicit&#233;. Pourtant, ces boissons ont une densit&#233; calorique majeure&#160;: elles apportent un taux de calories &#233;lev&#233;, mais aucune sensation de sati&#233;t&#233;, ce qui fait que leurs consommateurs ont l&#8217;impression de s&#8217;&#234;tre simplement d&#233;salt&#233;r&#233;s, alors qu&#8217;en r&#233;alit&#233; ils ont ingurgit&#233; une grande quantit&#233; de calories, sans en avoir pleinement conscience. La publicit&#233;, axant son message sur le go&#251;t agr&#233;able, la convivialit&#233;, vise &#224; baisser encore la conscience que les sodas apportent une grande quantit&#233; de calories, en en banalisant la consommation.</p><p style=\"text-align: justify;\">Comme le d&#233;montre l&#8217;&#233;conomiste et philosophe Adam Smith dans La Richesse des nations&#160;: &#171;&#160;Le sucre, le rhum, le tabac sont des produits universellement consomm&#233;s mais nulle part n&#233;cessaires &#224; la vie, ils s&#8217;av&#232;rent donc particuli&#232;rement propices &#224; la taxation.&#160;&#187; Or, cette taxation, tout comme pour le tabac, a pour but et effet de r&#233;duire leur consommation. Dans la m&#234;me logique que la l&#233;gislation sur le tabac, qui a interdit depuis 1976 sa publicit&#233; directe et d&#233;tourn&#233;e, il est temps de faire une l&#233;gislation semblable sur le sucre, qui a des effets graves sur la sant&#233;.</p><p style=\"text-align: justify;\">En effet, la surconsommation de sucre par le biais des sodas et boissons sucr&#233;es est une des causes majeures de l&#8217;ob&#233;sit&#233;, et notamment de l&#8217;ob&#233;sit&#233; infantile.</p><p style=\"text-align: justify;\">Or, une situation de surpoids chez l&#8217;enfant peut avoir des cons&#233;quences graves sur son avenir. Il augmente ses risques d&#8216;ob&#233;sit&#233; une fois adulte et de maladies inflammatoires de l&#8217;intestin ou h&#233;patiques. Les r&#233;percussions peuvent &#233;galement &#234;tre &#233;motionnelles, avec un risque accru de d&#233;pression &#224; l&#8217;adolescence.</p><p style=\"text-align: justify;\">En France, un enfant sur cinq est en surpoids (1,7 million) et 3,5&#160;% sont en situation d&#8217;ob&#233;sit&#233; (450 000). Dans la population g&#233;n&#233;rale, ces chiffres s&#8217;&#233;l&#232;vent respectivement &#224; 30&#160;% et 15&#160;%. Chaque ann&#233;e, 5,6 milliards d&#8217;euros sont d&#233;bours&#233;s par l&#8217;&#201;tat pour le traitement des patients, soit 4&#160;% des d&#233;penses de sant&#233;.</p><p style=\"text-align: justify;\">Si la progression continue &#224; ce rythme, le nombre d&#8217;enfants en surpoids dans le monde pourrait presque doubler d&#8217;ici &#224; 2025, passant de 41 millions &#224; 70 millions. L&#8217;autorisation de la publicit&#233; pour les sodas, en France, y contribue nettement.</p><p style=\"text-align: justify;\">Cette hausse du surpoids infantile est accompagn&#233;e par le d&#233;veloppement de nombreuses pathologies inflammatoires de l&#8217;intestin (maladie de Crohn, rectocolite h&#233;morragique). Auparavant rarement diagnostiqu&#233;es chez l&#8217;enfant, ces maladies comptent aujourd&#8217;hui un quart de patients de moins de 10 ans. Ce constat est d&#8217;autant plus pr&#233;occupant que leurs manifestations sont plus s&#233;v&#232;res chez les enfants, et sont difficilement soignables. Les personnes qui en sont affect&#233;es en souffrent tout au long de leur vie.</p><p style=\"text-align: justify;\">Suivant une &#233;tude datant de 1992, les personnes atteintes d&#8217;ob&#233;sit&#233; simple ont un risque relatif, par rapport aux personnes non surpond&#233;r&#233;es, de d&#233;velopper&#160;:<br />- 25&#160;% de plus de maladies ost&#233;o-articulaires,<br />- 50&#160;% de plus de coronaropathies,<br />- 380&#160;% de plus de diab&#232;te de type gras,<br />- 370&#160;% de plus de goutte,<br />- et 240&#160;% de plus de maladies li&#233;es &#224; une hypertension art&#233;rielle.</p><p style=\"text-align: justify;\">La m&#234;me &#233;tude &#233;value &#224; 178.000, en 1992, le nombre de d&#233;c&#232;s li&#233;s &#224; l&#8217;ob&#233;sit&#233; en France.<br />Pire, selon rapport de l&#8217;OPECST n&#176; 267 (2003 2004) de M. Claude Saunier, fait au nom de l&#8217;Office parlementaire d&#8217;&#233;valuation des choix scientifiques et techniques, d&#233;pos&#233; le 14 avril 2004, &#224; un certain stade de sa constitution, l&#8217;ob&#233;sit&#233; devient une maladie chronique difficilement r&#233;versible, ce qui a des cons&#233;quences en cascade sur l&#8217;&#233;tat de sant&#233; des personnes atteintes d&#8217;ob&#233;sit&#233; infantile. Parmi les facteurs d&#233;cisifs de d&#233;clenchement de l&#8217;ob&#233;sit&#233;, le rapport pointe l&#8217;&#233;volution de la disponibilit&#233; alimentaire. Or, la publicit&#233; vise &#224; axer cette disponibilit&#233; sur des produits n&#233;fastes pour la sant&#233;.</p><p style=\"text-align: justify;\">Pire encore, le rapport montre une convergence entre les propositions alimentaires &#224; forte densit&#233; calorique et leur faible prix. Ce qui conduit &#224; ce que l&#8217;&#233;pid&#233;mie d&#8217;ob&#233;sit&#233; frappe particuli&#232;rement les classes populaires et les personnes touch&#233;es par la pauvret&#233;. Cela surajoute aux probl&#232;mes d&#233;j&#224; existants des probl&#232;mes de sant&#233;. L&#8217;ob&#233;sit&#233; constitue un facteur de discrimination suppl&#233;mentaire des classes populaires, notamment chez les enfants. Ainsi, cela aggrave la possibilit&#233; de malaise scolaire, par la discrimination par les enfants de celles et ceux qui parmi eux sont touch&#233;s par l&#8217;ob&#233;sit&#233;. Au del&#224; des probl&#232;mes de sant&#233; directs, l&#8217;ob&#233;sit&#233; ajoute des probl&#232;mes de r&#233;ussite scolaire.</p><p style=\"text-align: justify;\">Pourtant, la simple substitution par l&#8217;eau des boissons sucr&#233;es a un impact substantiel sur l&#8217;ob&#233;sit&#233;, d&#8217;apr&#232;s une enqu&#234;te nationale sur la sant&#233; et la nutrition en 2003&#8209;2004, r&#233;pertoriant l&#8217;alimentation des jeunes de 2 &#224; 19 ans, men&#233;e aux &#201;tats-Unis. Pour chaque verre de soda sucr&#233; en plus, le risque de devenir ob&#232;se pour un enfant augmente de 60&#160;%. Or, les campagnes publicitaires apportent des informations inexactes ou fallacieuses, qui pr&#233;tendent que les boissons sucr&#233;es apportent, par exemple, de l&#8217;&#233;nergie et des vitamines. Les mentions l&#233;gales modulant l&#8217;impact sur la sant&#233; d&#8217;une alimentation trop sucr&#233;es sont trop rapides ou trop petites pour impacter ou dissuader significativement la consommation des sodas. D&#8217;autant que ces mentions conduisent &#224; un message contradictoire, suscitant le d&#233;sir de consommation d&#8217;une part, et visant &#224; le r&#233;duire d&#8217;autre part. Cet article simplifie cette situation en supprimant la publicit&#233; pour les sodas, afin d&#8217;en r&#233;duire la consommation. La diminution de la consommation de sodas et boissons sucr&#233;es a un impact direct sur l&#8217;ob&#233;sit&#233;, donc sur la sant&#233; publique. Or, cela permet, &#224; terme de faire de larges &#233;conomies pour l&#8217;assurance maladie, vu que sont &#233;vit&#233;es nombre de complications li&#233;es au d&#233;veloppement de maladies r&#233;sultant directement d&#8217;une surconsommation de sucre.</p>",
    "annexeExposeSommaire": {
      "@xmlns:xsi": "http://www.w3.org/2001/XMLSchema-instance",
      "@xsi:nil": "true"
    }
  },
  "representations": {
    "representation": {
      "nom": "PDF",
      "typeMime": {
        "type": "application",
        "subType": "PDF"
      },
      "statutRepresentation": {
        "verbatim": "true",
        "canonique": "true",
        "officielle": "true",
        "transcription": "false",
        "enregistrement": "false"
      },
      "repSource": {
        "@xmlns:xsi": "http://www.w3.org/2001/XMLSchema-instance",
        "@xsi:nil": "true"
      },
      "offset": {
        "@xmlns:xsi": "http://www.w3.org/2001/XMLSchema-instance",
        "@xsi:nil": "true"
      },
      "contenu": {
        "documentURI": "/15/amendements/1297/AN/1479.pdf"
      },
      "dateDispoRepresentation": {
        "@xmlns:xsi": "http://www.w3.org/2001/XMLSchema-instance",
        "@xsi:nil": "true"
      }
    }
  },
  "seanceDiscussion": "RUANR5L15S2019IDS21291",
  "sort": {
    "dateSaisie": "2018-10-25T18:29:21.000+02:00",
    "sortEnSeance": "Rejeté"
  },
  "dateDepot": "2018-10-19T02:00:00.000+02:00",
  "dateDistribution": "2018-10-22T02:00:00.000+02:00",
  "article99": "0",
  "loiReference": {
    "codeLoi": "c santé publique",
    "divisionCodeLoi": "L3232-10"
  }
}