{
  "@xmlns": "http://schemas.assemblee-nationale.fr/referentiel",
  "uid": "AMANR5L15PO419610B1135P0D1N388",
  "identifiant": {
    "legislature": "15",
    "numero": "388",
    "numRect": "0",
    "saisine": {
      "refTexteLegislatif": "PRJLANR5L15B1135",
      "numeroPartiePLF": "0",
      "organeExamen": "PO419610",
      "mentionSecondeDeliberation": "0"
    }
  },
  "numeroLong": "CE388",
  "etapeTexte": "Nouvelle Lecture",
  "triAmendement": "xknz",
  "cardinaliteAmdtMultiples": "1",
  "amendementParent": {
    "@xmlns:xsi": "http://www.w3.org/2001/XMLSchema-instance",
    "@xsi:nil": "true"
  },
  "etat": "Discuté",
  "signataires": {
    "auteur": {
      "typeAuteur": "Depute",
      "acteurRef": "PA720414",
      "organeRef": {
        "@xmlns:xsi": "http://www.w3.org/2001/XMLSchema-instance",
        "@xsi:nil": "true"
      },
      "groupePolitiqueRef": "PO730964"
    },
    "cosignataires": {
      "acteurRef": [
        "PA722398",
        "PA720414"
      ]
    },
    "texteAffichable": "M.&#160;Perrot et M.&#160;Rebeyrotte"
  },
  "pointeurFragmentTexte": {
    "missionVisee": {
      "@xmlns:xsi": "http://www.w3.org/2001/XMLSchema-instance",
      "@xsi:nil": "true"
    },
    "division": {
      "titre": "Article PREMIER",
      "articleDesignationCourte": "ART. PREMIER",
      "type": "ARTICLE",
      "avant_A_Apres": "A",
      "divisionRattachee": "ARTICLE PREMIER",
      "articleAdditionnel": {
        "@xmlns:xsi": "http://www.w3.org/2001/XMLSchema-instance",
        "@xsi:nil": "true"
      },
      "chapitreAdditionnel": {
        "@xmlns:xsi": "http://www.w3.org/2001/XMLSchema-instance",
        "@xsi:nil": "true"
      },
      "urlDivisionTexteVise": "/15/textes/1135.asp#D_Article_1er"
    },
    "alinea": {
      "avant_A_Apres": {
        "@xmlns:xsi": "http://www.w3.org/2001/XMLSchema-instance",
        "@xsi:nil": "true"
      },
      "numero": "50",
      "alineaDesignation": {
        "@xmlns:xsi": "http://www.w3.org/2001/XMLSchema-instance",
        "@xsi:nil": "true"
      }
    }
  },
  "corps": {
    "dispositif": "<p style=\"text-align: justify;\">Substituer &#224; l&#8217;alin&#233;a&#160;50 les deux alin&#233;as suivants&#160;:</p><p style=\"text-align: justify;\">&#171;&#160;Les contrats types mentionn&#233;s au premier alin&#233;a du pr&#233;sent IV comportent des dispositions relatives aux clauses <i>a minima</i> pr&#233;vues au II de l&#8217;article L.&#160;631&#8209;24 et peuvent comporter des r&#233;f&#233;rences aux indicateurs mentionn&#233;s au m&#234;me article.</p><p style=\"text-align: justify;\">&#171;&#160;Le fait de signer un contrat non conforme aux contrats types mentionn&#233;s au premier alin&#233;a du pr&#233;sent IV est passible de l&#8217;amende administrative pr&#233;vue &#224; l&#8217;article L.&#160;631&#8209;25.&#160;&#187;</p>",
    "exposeSommaire": "<p style=\"text-align: justify;\">Le pr&#233;sent texte a fait l&#8217;objet d&#8217;une n&#233;cessaire adaptation aux sp&#233;cificit&#233;s de la fili&#232;re viti vinicole aux alin&#233;as 49 et 50 de l&#8217;article&#160;1<sup>er</sup>. Le texte nouveau permet le maintien du fonctionnement contractuel de la fili&#232;re viticole au sein de laquelle la contractualisation &#233;crite remplit d&#233;j&#224; un r&#244;le extr&#234;mement positif.</p><p style=\"text-align: justify;\">Afin de renforcer l&#8217;articulation entre la loi est les contrats types interprofessionnels en viticulture et afin de rassurer sur le caract&#232;re protecteur de ces derniers, il est propos&#233; de sp&#233;cifier, que les contrats types interprofessionnels viticoles doivent comporter les clauses a minima de l&#8217;article L.&#160;631&#8209;24 II d&#8217;une part et&#160;que le non-respect des contrats-types interprofessionnels par l&#8217;ensemble des op&#233;rateurs soit passible de sanctions administratives pr&#233;vues par la loi.</p>",
    "annexeExposeSommaire": {
      "@xmlns:xsi": "http://www.w3.org/2001/XMLSchema-instance",
      "@xsi:nil": "true"
    }
  },
  "representations": {
    "representation": {
      "nom": "PDF",
      "typeMime": {
        "type": "application",
        "subType": "PDF"
      },
      "statutRepresentation": {
        "verbatim": "true",
        "canonique": "true",
        "officielle": "true",
        "transcription": "false",
        "enregistrement": "false"
      },
      "repSource": {
        "@xmlns:xsi": "http://www.w3.org/2001/XMLSchema-instance",
        "@xsi:nil": "true"
      },
      "offset": {
        "@xmlns:xsi": "http://www.w3.org/2001/XMLSchema-instance",
        "@xsi:nil": "true"
      },
      "contenu": {
        "documentURI": "/15/amendements/1135/CION-ECO/CE388.pdf"
      },
      "dateDispoRepresentation": {
        "@xmlns:xsi": "http://www.w3.org/2001/XMLSchema-instance",
        "@xsi:nil": "true"
      }
    }
  },
  "seanceDiscussion": {
    "@xmlns:xsi": "http://www.w3.org/2001/XMLSchema-instance",
    "@xsi:nil": "true"
  },
  "sort": {
    "dateSaisie": "2018-07-17T19:47:50.000+02:00",
    "sortEnSeance": "Tombé"
  },
  "dateDepot": "2018-07-13T02:00:00.000+02:00",
  "dateDistribution": "2018-07-16T02:00:00.000+02:00",
  "article99": "0",
  "loiReference": {
    "codeLoi": {
      "@xmlns:xsi": "http://www.w3.org/2001/XMLSchema-instance",
      "@xsi:nil": "true"
    },
    "divisionCodeLoi": {
      "@xmlns:xsi": "http://www.w3.org/2001/XMLSchema-instance",
      "@xsi:nil": "true"
    }
  }
}