{
  "@xmlns": "http://schemas.assemblee-nationale.fr/referentiel",
  "uid": "AMANR5L15PO744107B0424P0D1N93",
  "identifiant": {
    "legislature": "15",
    "numero": "93",
    "numRect": "0",
    "saisine": {
      "refTexteLegislatif": "PRJLANR5L15B0424",
      "numeroPartiePLF": "0",
      "organeExamen": "PO744107",
      "mentionSecondeDeliberation": "0"
    }
  },
  "numeroLong": "93",
  "etapeTexte": "1ère lecture (1ère assemblée saisie)",
  "triAmendement": "bc",
  "cardinaliteAmdtMultiples": "1",
  "amendementParent": {
    "@xmlns:xsi": "http://www.w3.org/2001/XMLSchema-instance",
    "@xsi:nil": "true"
  },
  "etat": "Discuté",
  "signataires": {
    "auteur": {
      "typeAuteur": "Depute",
      "acteurRef": "PA718850",
      "organeRef": {
        "@xmlns:xsi": "http://www.w3.org/2001/XMLSchema-instance",
        "@xsi:nil": "true"
      },
      "groupePolitiqueRef": "PO730934"
    },
    "cosignataires": {
      "acteurRef": [
        "PA720644",
        "PA267318",
        "PA720630",
        "PA719272",
        "PA998",
        "PA712015",
        "PA2086",
        "PA2529",
        "PA2377",
        "PA332523",
        "PA266774",
        "PA340853",
        "PA608416",
        "PA720684",
        "PA266797",
        "PA266793",
        "PA722390",
        "PA2155",
        "PA609245",
        "PA721314",
        "PA605036",
        "PA721636",
        "PA267429",
        "PA605991",
        "PA267527",
        "PA1630",
        "PA718884",
        "PA330684",
        "PA721286",
        "PA2792",
        "PA718780",
        "PA609726",
        "PA608016",
        "PA1012",
        "PA767",
        "PA330240",
        "PA718838",
        "PA606712",
        "PA267378",
        "PA642847",
        "PA719946",
        "PA719318",
        "PA334149",
        "PA1874",
        "PA267794",
        "PA720100",
        "PA266776",
        "PA720586",
        "PA608826",
        "PA2492",
        "PA334654",
        "PA718850",
        "PA606098",
        "PA721968",
        "PA346054",
        "PA223837"
      ]
    },
    "texteAffichable": "M.&#160;Cordier,  M.&#160;Abad, Mme&#160;Anthoine, M.&#160;Aubert, M.&#160;Bazin, Mme&#160;Bazin-Malgras, Mme&#160;Val&#233;rie&#160;Boyer, M.&#160;Cattin, M.&#160;Cinieri, M.&#160;Ciotti, Mme&#160;Genevard, M.&#160;Herbillon, M.&#160;Hetzel, Mme&#160;Lacroute, M.&#160;Grelier, M.&#160;Gosselin, M.&#160;Leclerc, Mme&#160;Levy, Mme&#160;Louwagie, Mme&#160;Duby-Muller, M.&#160;Dive, Mme&#160;Dalloz, M.&#160;Menuel, M.&#160;Dassault, Mme&#160;Meunier, M.&#160;Marleix, M.&#160;Fasquelle, M.&#160;Nury, M.&#160;Pierre-Henri&#160;Dumont, M.&#160;Perrut, M.&#160;Peltier, M.&#160;Ramadier, M.&#160;Saddier, M.&#160;Schellenberger, Mme&#160;Tabarot, M.&#160;Taugourdeau, M.&#160;Vialay, M.&#160;Parigi, M.&#160;Bony, M.&#160;de la Verpilli&#232;re, M.&#160;Furst, M.&#160;Pradi&#233;, M.&#160;Emmanuel&#160;Maquet, M.&#160;Brun, M.&#160;Le Fur, M.&#160;Vatin, M.&#160;Lurton, M.&#160;Quentin, M.&#160;Reiss, Mme&#160;Corneloup, Mme&#160;Trastour-Isnart, M.&#160;Straumann, M.&#160;Minot, M.&#160;Reitzer, M.&#160;Marlin et M.&#160;Brochand"
  },
  "pointeurFragmentTexte": {
    "missionVisee": {
      "@xmlns:xsi": "http://www.w3.org/2001/XMLSchema-instance",
      "@xsi:nil": "true"
    },
    "division": {
      "titre": "Article 3",
      "articleDesignationCourte": "APRÈS ART. 3",
      "type": "ARTICLE",
      "avant_A_Apres": "Après",
      "divisionRattachee": "APRÈS L'ARTICLE 3, insérer l'article suivant:",
      "articleAdditionnel": "1",
      "chapitreAdditionnel": {
        "@xmlns:xsi": "http://www.w3.org/2001/XMLSchema-instance",
        "@xsi:nil": "true"
      },
      "urlDivisionTexteVise": "/15/textes/0424.asp#D_Article_3"
    },
    "alinea": {
      "@xmlns:xsi": "http://www.w3.org/2001/XMLSchema-instance",
      "@xsi:nil": "true"
    }
  },
  "corps": {
    "dispositif": "<p style=\"text-align: justify;\">Le code g&#233;n&#233;ral des imp&#244;ts est ainsi modifi&#233; : </p><p style=\"text-align: justify;\">I.&#160;-&#160;L&#8217;article&#160;1649 <i>quater</i> B <i>quinquies</i> est compl&#233;t&#233; par un alin&#233;a ainsi r&#233;dig&#233;&#160;:</p><p style=\"text-align: justify;\">&#171;&#160;Les contribuables, personnes physiques &#226;g&#233;s d&#8217;au moins soixante-dix ans, et personnes en situation de handicap dont le taux d&#8217;invalidit&#233; est d&#8217;au moins quarante pour cent, sont dispens&#233;s de l&#8217;obligation de t&#233;l&#233;d&#233;claration de leurs revenus et de t&#233;l&#233;paiement de leurs imp&#244;ts.&#160;&#187;</p><p style=\"text-align: justify;\">II.&#160;-L&#8217;article&#160;1738 est compl&#233;t&#233; par un alin&#233;a ainsi r&#233;dig&#233;&#160;:</p><p style=\"text-align: justify;\">&#171;&#160;6.&#160;Les contribuables, personnes physiques &#226;g&#233;s d&#8217;au moins soixante-dix ans, et personnes en situation de handicap dont le taux d&#8217;invalidit&#233; est d&#8217;au moins quarante pour cent, sont dispens&#233;s de l&#8217;obligation de t&#233;l&#233;d&#233;claration de leurs revenus et de t&#233;l&#233;paiement de leurs imp&#244;ts.&#160;&#187;</p>",
    "exposeSommaire": "<p style=\"text-align: justify;\">Depuis 2016, les contribuables dont le revenu fiscal de r&#233;f&#233;rence est sup&#233;rieur &#224; 40 000&#160;euros sont d&#233;j&#224; oblig&#233;s de t&#233;l&#233;d&#233;clarer leurs revenus. Et &#224; partir de 2019 (revenus 2018), la d&#233;claration num&#233;rique et le t&#233;l&#233;paiement seront obligatoires pour tous les contribuables.</p><p style=\"text-align: justify;\">Les contribuables dont la r&#233;sidence principale n&#8217;est pas connect&#233;e &#224; Internet sont dispens&#233;s de la t&#233;l&#233;d&#233;claration et peuvent pour l&#8217;instant continuer &#224; envoyer des formulaires papier. Ces contribuables doivent pr&#233;alablement faire savoir &#224; l&#8217;administration fiscale qu&#8217;ils n&#8217;ont pas acc&#232;s &#224; Internet. Une amende forfaitaire de 15&#160;&#8364; par d&#233;claration ou annexe est appliqu&#233;e en cas de non-respect de l&#8217;obligation de t&#233;l&#233;d&#233;claration des revenus. Toutefois, cette sanction n&#8217;est mise en &#339;uvre qu&#8217;&#224; partir de deux manquements constat&#233;s (r&#233;ponse minist&#233;rielle du ministre des finances, JOAN du 22&#160;d&#233;cembre 2015).</p><p style=\"text-align: justify;\">N&#233;anmoins, dans une communication aux contribuables, la Direction g&#233;n&#233;rale des finances publiques pr&#233;cise&#160;: &#171;&#160;si vous estimez ne pas &#234;tre en mesure de le faire, vous pouvez continuer &#224; utiliser une d&#233;claration papier&#160;&#187;. Ce qui laisserait supposer une certaine marge de tol&#233;rance de la part de l&#8217;administration fiscale.</p><p style=\"text-align: justify;\">Il n&#8217;en demeure pas moins que cette situation est anxiog&#232;ne pour bon nombre de personnes &#226;g&#233;es qui vivent particuli&#232;rement mal cette pression des service fiscaux &#224; vouloir leur faire d&#233;clarer et r&#233;gler leurs imp&#244;ts par Internet, alors m&#234;me qu&#8217;elles apportent une contribution significative au financement des administrations publiques.</p><p style=\"text-align: justify;\">Cet amendement vise donc &#224; permettre aux personnes de plus de 70 ans et aux personnes en situation de handicap - qui le souhaitent - de continuer &#224; d&#233;clarer leurs revenus avec les formulaires &#171;&#160;papier&#160;&#187; et &#224; r&#233;gler leurs imp&#244;ts par ch&#232;que.<br /> <br />Si de nombreux seniors sont d&#233;sormais familiaris&#233;s avec les nouvelles technologies, certains ne sont toujours pas &#233;quip&#233;s d&#8217;ordinateur ou n&#8217;ont pas de connexion internet, et il ne leur est pas toujours ais&#233; de se faire aider pour les d&#233;clarations et t&#233;l&#233;paiement. Il convient donc de leur permettre de choisir leur mode de d&#233;claration et de paiement afin que ceux qui ne maitrisent pas bien l&#8217;informatique ne se sentent pas d&#233;valoris&#233;s et humili&#233;s par une telle contrainte.</p>",
    "annexeExposeSommaire": {
      "@xmlns:xsi": "http://www.w3.org/2001/XMLSchema-instance",
      "@xsi:nil": "true"
    }
  },
  "representations": {
    "representation": {
      "nom": "PDF",
      "typeMime": {
        "type": "application",
        "subType": "PDF"
      },
      "statutRepresentation": {
        "verbatim": "true",
        "canonique": "true",
        "officielle": "true",
        "transcription": "false",
        "enregistrement": "false"
      },
      "repSource": {
        "@xmlns:xsi": "http://www.w3.org/2001/XMLSchema-instance",
        "@xsi:nil": "true"
      },
      "offset": {
        "@xmlns:xsi": "http://www.w3.org/2001/XMLSchema-instance",
        "@xsi:nil": "true"
      },
      "contenu": {
        "documentURI": "/15/amendements/0424/CSCONF/93.pdf"
      },
      "dateDispoRepresentation": {
        "@xmlns:xsi": "http://www.w3.org/2001/XMLSchema-instance",
        "@xsi:nil": "true"
      }
    }
  },
  "seanceDiscussion": {
    "@xmlns:xsi": "http://www.w3.org/2001/XMLSchema-instance",
    "@xsi:nil": "true"
  },
  "sort": {
    "dateSaisie": "2018-01-15T21:52:51.000+01:00",
    "sortEnSeance": "Retiré"
  },
  "dateDepot": "2018-01-08T01:00:00.000+01:00",
  "dateDistribution": "2018-01-15T01:00:00.000+01:00",
  "article99": "0",
  "loiReference": {
    "codeLoi": "impôts",
    "divisionCodeLoi": "1649 quater B quinquies"
  }
}