{
  "@xmlns": "http://schemas.assemblee-nationale.fr/referentiel",
  "uid": "AMANR5L15SEA717460BTC1212P0D1N281",
  "identifiant": {
    "legislature": "15",
    "numero": "281",
    "numRect": "0",
    "saisine": {
      "refTexteLegislatif": "PRJLANR5L15BTC1212",
      "numeroPartiePLF": "0",
      "organeExamen": "PO717460",
      "mentionSecondeDeliberation": "0"
    }
  },
  "numeroLong": "281",
  "etapeTexte": "1ère lecture (2ème assemblée saisie)",
  "triAmendement": "fiaaaaaaaaaaaaaaaaaaaaaaaaaaaaaaaaaaaaaaaaaaaaaaaabto",
  "cardinaliteAmdtMultiples": "1",
  "amendementParent": {
    "@xmlns:xsi": "http://www.w3.org/2001/XMLSchema-instance",
    "@xsi:nil": "true"
  },
  "etat": "Discuté",
  "signataires": {
    "auteur": {
      "typeAuteur": "Depute",
      "acteurRef": "PA721202",
      "organeRef": {
        "@xmlns:xsi": "http://www.w3.org/2001/XMLSchema-instance",
        "@xsi:nil": "true"
      },
      "groupePolitiqueRef": "PO730958"
    },
    "cosignataires": {
      "acteurRef": [
        "PA720430",
        "PA718860",
        "PA721960",
        "PA588884",
        "PA718868",
        "PA722142",
        "PA720892",
        "PA2150",
        "PA720422",
        "PA721202",
        "PA719578",
        "PA721062",
        "PA720286",
        "PA720846",
        "PA721226",
        "PA721210",
        "PA719676"
      ]
    },
    "texteAffichable": "M.&#160;Coquerel,  Mme&#160;Autain, M.&#160;Bernalicis, M.&#160;Corbi&#232;re, Mme&#160;Fiat, M.&#160;Lachaud, M.&#160;Larive, M.&#160;M&#233;lenchon, Mme&#160;Obono, Mme&#160;Panot, M.&#160;Prud&apos;homme, M.&#160;Quatennens, M.&#160;Ratenon, Mme&#160;Ressiguier, Mme&#160;Rubin, M.&#160;Ruffin et Mme&#160;Taurine"
  },
  "pointeurFragmentTexte": {
    "missionVisee": {
      "@xmlns:xsi": "http://www.w3.org/2001/XMLSchema-instance",
      "@xsi:nil": "true"
    },
    "division": {
      "titre": "Article 7",
      "articleDesignationCourte": "APRÈS ART. 7",
      "type": "ARTICLE",
      "avant_A_Apres": "Après",
      "divisionRattachee": "APRÈS L'ARTICLE 7, insérer l'article suivant:",
      "articleAdditionnel": "1",
      "chapitreAdditionnel": {
        "@xmlns:xsi": "http://www.w3.org/2001/XMLSchema-instance",
        "@xsi:nil": "true"
      },
      "urlDivisionTexteVise": "/15/textes/1212.asp#D_Article_7"
    },
    "alinea": {
      "@xmlns:xsi": "http://www.w3.org/2001/XMLSchema-instance",
      "@xsi:nil": "true"
    }
  },
  "corps": {
    "dispositif": "<p style=\"text-align: justify;\">Apr&#232;s l&#8217;article&#160;1741 du code g&#233;n&#233;ral des imp&#244;ts, il est ins&#233;r&#233; un article&#160;1741-0-A ainsi r&#233;dig&#233;&#160;:</p><p style=\"text-align: justify;\">&#171;&#160;<i>Art.&#160;1741-0-A</i>.&#160;&#8211;&#160;Quiconque incite, soustrait ou tente de soustraire frauduleusement un contribuable &#224; l&#8217;&#233;tablissement ou au paiement total ou partiel des imp&#244;ts vis&#233;s au pr&#233;sent code, notamment par la voie de la promotion, de la publicit&#233; ou de l&#8217;offre de montages frauduleux, est passible, ind&#233;pendamment des sanctions fiscales applicables, d&#8217;un emprisonnement de cinq ans et d&#8217;une amende de 500 000&#160;&#8364;.&#160;&#187;</p>",
    "exposeSommaire": "<p style=\"text-align: justify;\">Cet amendement tend &#224; renforcer notre arsenal juridique par la mise en place d&#8217;un d&#233;lit d&#8217;incitation &#224; la fraude fiscale.</p><p style=\"text-align: justify;\">Cette proposition s&#8217;appuie notamment sur un rapport d&#8217;enqu&#234;te de la commission s&#233;natoriale portant sur le r&#244;le des banques et acteurs financiers dans l&#8217;&#233;vasion fiscale, rendu public le 17/10/2013, et plus particuli&#232;rement de sa 30<sup>&#232;me</sup> proposition.</p><p style=\"text-align: justify;\">Outre le fait de grever lourdement le budget de l&#8217;&#201;tat, la fraude fiscale est un poison qui ronge notre R&#233;publique en sapant les fondements m&#234;mes du consentement &#224; l&#8217;imp&#244;t, qui suppose une parfaite &#233;galit&#233; des citoyens devant la loi commune.</p><p style=\"text-align: justify;\">Afin de mieux lutter contre la fraude fiscale, il est indispensable de frapper avec toute la vigueur de la loi l&#8217;ensemble des op&#233;rateurs qui proposent, par voie de promotion ou de publicit&#233;, de se soustraire aux obligations fiscales pourtant en vigueur.</p><p style=\"text-align: justify;\">Il est aberrant de constater la facilit&#233; avec laquelle l&#8217;on peut aujourd&#8217;hui trouver sur internet un nombre foisonnant de sites proposant des services frauduleux et des sch&#233;mas clef en main pour &#233;chapper &#224; l&#8217;imp&#244;t en d&#233;tournant la loi fiscale de son sens initial.</p><p style=\"text-align: justify;\">Appeler ouvertement &#224; se soustraire &#224; ses obligations civiques par des services g&#233;n&#233;ralement tarif&#233;s, dans un esprit de lucre et au m&#233;pris de notre &#201;tat de droit, devrait &#234;tre passible d&#8217;une amende de 500 000&#160;euros et d&#8217;un emprisonnement de cinq ans, la peine devant &#234;tre proportionnelle &#224; l&#8217;atteinte grave qu&#8217;elle constitue au regard du civisme fiscal et suffisamment dissuasive pour &#234;tre efficace.</p><p style=\"text-align: justify;\">A titre de comparaison, le d&#233;lit d&#8217;incitation &#224; la fraude dans les transports en commun tels que la RATP est passible d&#8217;une amende de 3750&#160;euros et d&#8217;une peine de deux mois d&#8217;emprisonnement.</p><p style=\"text-align: justify;\">Il est proprement inadmissible de constater avec quel empressement on sanctionne ainsi certains particuliers dans les transports en commun alors qu&#8217;en m&#234;me temps on exon&#232;re de toute peine une incitation &#224; la fraude fiscale aux cons&#233;quences dramatiques pour le budget de l&#8217;&#201;tat et le civisme de nos concitoyens. A cet &#233;gard, l&#8217;article&#160;7 de ce projet de loi appara&#238;t presque provocateur&#160;: les peines propos&#233;es ne sont qu&#8217;administratives et si faibles qu&#8217;elles ne dissuaderont en rien les interm&#233;diaires de proposer leurs services pour aider les fraudeurs fiscaux.</p>",
    "annexeExposeSommaire": {
      "@xmlns:xsi": "http://www.w3.org/2001/XMLSchema-instance",
      "@xsi:nil": "true"
    }
  },
  "representations": {
    "representation": {
      "nom": "PDF",
      "typeMime": {
        "type": "application",
        "subType": "PDF"
      },
      "statutRepresentation": {
        "verbatim": "true",
        "canonique": "true",
        "officielle": "true",
        "transcription": "false",
        "enregistrement": "false"
      },
      "repSource": {
        "@xmlns:xsi": "http://www.w3.org/2001/XMLSchema-instance",
        "@xsi:nil": "true"
      },
      "offset": {
        "@xmlns:xsi": "http://www.w3.org/2001/XMLSchema-instance",
        "@xsi:nil": "true"
      },
      "contenu": {
        "documentURI": "/15/amendements/1212/AN/281.pdf"
      },
      "dateDispoRepresentation": {
        "@xmlns:xsi": "http://www.w3.org/2001/XMLSchema-instance",
        "@xsi:nil": "true"
      }
    }
  },
  "seanceDiscussion": "RUANR5L15S2018IDS21240",
  "sort": {
    "dateSaisie": "2018-09-18T18:03:55.000+02:00",
    "sortEnSeance": "Rejeté"
  },
  "dateDepot": "2018-09-13T02:00:00.000+02:00",
  "dateDistribution": "2018-09-14T02:00:00.000+02:00",
  "article99": "0",
  "loiReference": {
    "codeLoi": "CGI",
    "divisionCodeLoi": "1741AA"
  }
}