{
  "@xmlns": "http://schemas.assemblee-nationale.fr/referentiel",
  "uid": "AMANR5L15SEA717460BTC1974P0D1N1661",
  "identifiant": {
    "legislature": "15",
    "numero": "1661",
    "numRect": "0",
    "saisine": {
      "refTexteLegislatif": "PRJLANR5L15BTC1974",
      "numeroPartiePLF": "0",
      "organeExamen": "PO717460",
      "mentionSecondeDeliberation": "0"
    }
  },
  "numeroLong": "1661",
  "etapeTexte": "1ère lecture (2ème assemblée saisie)",
  "triAmendement": "kbaaaaaaaaaaaaaaaaaaaaaaaaaaaaaaaaaaaaaaaaaaaaaaaai",
  "cardinaliteAmdtMultiples": "1",
  "amendementParent": {
    "@xmlns:xsi": "http://www.w3.org/2001/XMLSchema-instance",
    "@xsi:nil": "true"
  },
  "etat": "Discuté",
  "signataires": {
    "auteur": {
      "typeAuteur": "Depute",
      "acteurRef": "PA719890",
      "organeRef": {
        "@xmlns:xsi": "http://www.w3.org/2001/XMLSchema-instance",
        "@xsi:nil": "true"
      },
      "groupePolitiqueRef": "PO730964"
    },
    "cosignataires": {
      "acteurRef": [
        "PA722000",
        "PA720790",
        "PA722312",
        "PA720622",
        "PA720814",
        "PA721398",
        "PA720054",
        "PA718710",
        "PA719154",
        "PA718894",
        "PA718902",
        "PA719496",
        "PA720298",
        "PA606639",
        "PA719890",
        "PA721600",
        "PA721434",
        "PA720538",
        "PA721384",
        "PA719540"
      ]
    },
    "texteAffichable": "Mme&#160;Brulebois,  Mme&#160;Bessot Ballot, Mme&#160;Pascale&#160;Boyer, Mme&#160;Bureau-Bonnard, Mme&#160;De Temmerman, M.&#160;Cabar&#233;, M.&#160;Cazenove, M.&#160;Buchou, Mme&#160;Degois, Mme&#160;Fontenel-Personne, M.&#160;Grau, Mme&#160;Lardet, M.&#160;Martin, Mme&#160;Rossi, M.&#160;Haury, M.&#160;Vignal, M.&#160;Dombreval, Mme&#160;Toutut-Picard, Mme&#160;Cariou et M.&#160;C&#233;dric&#160;Roussel"
  },
  "pointeurFragmentTexte": {
    "missionVisee": {
      "@xmlns:xsi": "http://www.w3.org/2001/XMLSchema-instance",
      "@xsi:nil": "true"
    },
    "division": {
      "titre": "Article 33 quater",
      "articleDesignationCourte": "APRÈS ART. 33 QUATER",
      "type": "ARTICLE",
      "avant_A_Apres": "Après",
      "divisionRattachee": "APRÈS L'ARTICLE 33 QUATER, insérer l'article suivant:",
      "articleAdditionnel": "1",
      "chapitreAdditionnel": {
        "@xmlns:xsi": "http://www.w3.org/2001/XMLSchema-instance",
        "@xsi:nil": "true"
      },
      "urlDivisionTexteVise": "/15/textes/1974.asp#D_Article_33_quater"
    },
    "alinea": {
      "@xmlns:xsi": "http://www.w3.org/2001/XMLSchema-instance",
      "@xsi:nil": "true"
    }
  },
  "corps": {
    "dispositif": "<p style=\"text-align: justify;\">Le titre&#160;I<sup>er</sup>&#160;du livre&#160;VI de la premi&#232;re partie du code des transports est compl&#233;t&#233; par un chapitre&#160;V ainsi r&#233;dig&#233;&#160;:</p><p style=\"text-align: justify;\">&#171;&#160;Chapitre V</p><p style=\"text-align: justify;\">&#171;&#160;Passages &#224; niveau</p><p style=\"text-align: justify;\">&#171;&#160;<i>Art.&#160;L.&#160;1615&#8209;1</i>.&#160;&#8211;&#160;Les v&#233;hicules de transport scolaire de voyageurs ne sont pas autoris&#233;s &#224; franchir de passage &#224; niveau si celui-ci n&#8217;est pas &#233;quip&#233; de barri&#232;res ou de demi-barri&#232;res.&#160;&#187;</p>",
    "exposeSommaire": "<p style=\"text-align: justify;\">En France, chaque ann&#233;e, des dizaines d&#8217;accidents souvent tragiques ont lieu sur les passages &#224; niveau. Depuis 2014, le nombre de d&#233;c&#232;s recens&#233;s &#224; la suite de collisions sur les passages &#224; niveau n&#8217;a cess&#233; d&#8217;augmenter&#160;: il s&#8217;est &#233;tabli &#224; 25 en 2014 (et 17 bless&#233;s graves), &#224; 27 en 2015 (et 15 bless&#233;s graves), &#224; 31 en 2016 (et 15 bless&#233;s graves) et enfin &#224; 42 en 2017.</p><p style=\"text-align: justify;\">Selon les statistiques, il se produit en moyenne un accident tous les 3 jours &#224; un passage &#224; niveau. Le non-respect des consignes et du Code de la Route en sont souvent la 1<sup>&#232;re</sup>cause&#160;</p><p style=\"text-align: justify;\">Il est donc primordial de mieux garantir la s&#233;curit&#233; de ces lieux dangereux.</p><p style=\"text-align: justify;\">Cet amendement vise donc &#224; davantage s&#233;curiser les passages &#224; niveau en interdisant le passage des transports scolaires sur les passages &#224; niveau non dot&#233;s de barri&#232;res ou de demi barri&#232;res. Cette interdiction favorisera ainsi l&#8217;&#233;quipement en barri&#232;res et demi-barri&#232;res de ces passages &#224; niveau. En cas d&#8217;impossibilit&#233;, il conviendra de d&#233;tourner la circulation des bus scolaires par un autre itin&#233;raire.</p>",
    "annexeExposeSommaire": {
      "@xmlns:xsi": "http://www.w3.org/2001/XMLSchema-instance",
      "@xsi:nil": "true"
    },
    "cartoucheDelaiDepotDepasse": {
      "@xmlns:xsi": "http://www.w3.org/2001/XMLSchema-instance",
      "@xsi:nil": "true"
    }
  },
  "representations": {
    "representation": {
      "nom": "PDF",
      "typeMime": {
        "type": "application",
        "subType": "PDF"
      },
      "statutRepresentation": {
        "verbatim": "true",
        "canonique": "true",
        "officielle": "true",
        "transcription": "false",
        "enregistrement": "false"
      },
      "repSource": {
        "@xmlns:xsi": "http://www.w3.org/2001/XMLSchema-instance",
        "@xsi:nil": "true"
      },
      "offset": {
        "@xmlns:xsi": "http://www.w3.org/2001/XMLSchema-instance",
        "@xsi:nil": "true"
      },
      "contenu": {
        "documentURI": "/15/amendements/1974/AN/1661.pdf"
      },
      "dateDispoRepresentation": {
        "@xmlns:xsi": "http://www.w3.org/2001/XMLSchema-instance",
        "@xsi:nil": "true"
      }
    }
  },
  "seanceDiscussion": "RUANR5L15S2019IDS21702",
  "sort": {
    "dateSaisie": "2019-06-14T17:08:32.000+02:00",
    "sortEnSeance": "Rejeté"
  },
  "dateDepot": "2019-05-29T02:00:00.000+02:00",
  "dateDistribution": "2019-06-05T02:00:00.000+02:00",
  "article99": "0",
  "loiReference": {
    "codeLoi": "c transports",
    "divisionCodeLoi": "L1615-1"
  }
}