{
  "@xmlns": "http://schemas.assemblee-nationale.fr/referentiel",
  "uid": "AMANR5L15PO59048B0235P2D1N211",
  "identifiant": {
    "legislature": "15",
    "numero": "211",
    "numRect": "0",
    "saisine": {
      "refTexteLegislatif": "PRJLANR5L15B0235",
      "numeroPartiePLF": "2",
      "organeExamen": "PO59048",
      "mentionSecondeDeliberation": "0"
    }
  },
  "numeroLong": "II-CF211",
  "etapeTexte": "1ère lecture (1ère assemblée saisie)",
  "triAmendement": "i",
  "cardinaliteAmdtMultiples": "1",
  "amendementParent": {
    "@xmlns:xsi": "http://www.w3.org/2001/XMLSchema-instance",
    "@xsi:nil": "true"
  },
  "etat": "Irrecevable",
  "signataires": {
    "auteur": {
      "typeAuteur": "Depute",
      "acteurRef": "PA719420",
      "organeRef": {
        "@xmlns:xsi": "http://www.w3.org/2001/XMLSchema-instance",
        "@xsi:nil": "true"
      },
      "groupePolitiqueRef": "PO730964"
    },
    "cosignataires": {
      "acteurRef": "PA719420"
    },
    "texteAffichable": "M.&#160;Sommer"
  },
  "pointeurFragmentTexte": {
    "missionVisee": {
      "@xmlns:xsi": "http://www.w3.org/2001/XMLSchema-instance",
      "@xsi:nil": "true"
    },
    "division": {
      "titre": "Article 46",
      "articleDesignationCourte": "APRÈS ART. 46",
      "type": "ARTICLE",
      "avant_A_Apres": "Après",
      "divisionRattachee": "APRÈS L'ARTICLE 46, insérer l'article suivant:",
      "articleAdditionnel": "1",
      "chapitreAdditionnel": {
        "@xmlns:xsi": "http://www.w3.org/2001/XMLSchema-instance",
        "@xsi:nil": "true"
      },
      "urlDivisionTexteVise": "/15/textes/0235C.asp#D_Article_46"
    },
    "alinea": {
      "@xmlns:xsi": "http://www.w3.org/2001/XMLSchema-instance",
      "@xsi:nil": "true"
    }
  },
  "corps": {
    "dispositif": "<p>&#160;</p><p>I.&#160;&#160;&#160;&#160;&#160;&#160;&#160;&#160;&#160;&#160;&#160;&#160;&#160;&#160;&#160;&#160;&#160;&#160;&#160; Le code g&#233;n&#233;ral des imp&#244;ts est ainsi modifi&#233;&#160;:</p><p>II.&#160;&#160;&#160;&#160;&#160;&#160;&#160;&#160;&#160;&#160;&#160;&#160;&#160;&#160;&#160;&#160;&#160; 1&#176; L&#8217;article 1635-0 quinquies est ainsi r&#233;dig&#233;&#160;:</p><p>&#171;&#160;Il est institu&#233; au profit des collectivit&#233;s territoriales, de leurs &#233;tablissements publics de coop&#233;ration intercommunale une imposition forfaitaire sur les entreprises de r&#233;seaux. Les &#233;tablissements publics de coop&#233;ration intercommunale peuvent redistribuer aux communes concern&#233;es une attribution de compensation.</p><p>&#160;</p><p>Cette imposition est d&#233;termin&#233;e dans les conditions pr&#233;vues aux articles 1519 D, 1519 E, 1519 F, 1519 G, 1519 H, 1519 HA, 1599 quater A, 1599 quater A bis et 1599 quater B.&#160;&#187;</p><p>&#160;</p><p>III.&#160;&#160;&#160;&#160;&#160;&#160;&#160;&#160;&#160;&#160;&#160;&#160;&#160;&#160;&#160; 2&#176; Au 9&#176; de l&#8217;article 1379, remplacer&#160;le taux:</p><p>&#171;&#160;20%&#160;&#187;</p><p>Par&#160;:</p><p>Le taux &#171;&#160;60%&#160;&#187;.</p><p>&#160;</p><p>IV.&#160;&#160;&#160;&#160;&#160;&#160;&#160;&#160;&#160;&#160;&#160;&#160;&#160;&#160;&#160; 3&#176; Au 1&#176; du V bis de l&#8217;article 1379-0 bis du code g&#233;n&#233;ral des imp&#244;ts, remplacer&#160;le taux :</p><p>&#171;&#160;50%&#160;&#187;</p><p>Par&#160;le taux:</p><p>&#171;&#160;40%&#160;&#187;</p><p>&#160;</p><p>V.&#160;&#160;&#160;&#160;&#160;&#160;&#160;&#160;&#160;&#160;&#160;&#160;&#160;&#160;&#160;&#160;&#160; 4&#176; Supprimer le 3&#176;de l&#8217;article 1586.</p><p>&#160;</p><p>VI.&#160;&#160;&#160;&#160;&#160;&#160;&#160;&#160;&#160;&#160;&#160;&#160;&#160;&#160;&#160; La perte de recettes pour les d&#233;partements est compens&#233;e par la majoration &#224; due concurrence de la dotation globale de fonctionnement et corr&#233;lativement pour l&#8217;&#201;tat par la cr&#233;ation d&#8217;une taxe additionnelle vis&#233;s aux articles 575 et 575 A du code g&#233;n&#233;ral des imp&#244;ts.</p>",
    "exposeSommaire": "<p>Afin d&#8217;inciter les communes &#224; installer des &#233;oliennes, le pr&#233;sent amendement propose de modifier la r&#233;partition de l&#8217;imposition forfaitaire pour les entreprises de r&#233;seaux (IFER).</p><p>&#160;</p><p>L&#8217;IFER est actuellement r&#233;parti &#224; 50% pour les &#233;tablissements publics de coop&#233;ration intercommunale (EPCI), 30% pour les d&#233;partements et 20% pour les communes pour les EPCI &#224; fiscalit&#233; additionnelle.</p><p>Et &#224; 70% pour l&#8217;EPCI et 30% au d&#233;partement pour les EPCI &#224; fiscalit&#233; propre.</p><p>&#160;</p><p>L&#8217;amendement propose de redistribuer l&#8217;IFER &#224; 60% pour les communes et &#224; 40% pour les EPCI.</p>",
    "annexeExposeSommaire": {
      "@xmlns:xsi": "http://www.w3.org/2001/XMLSchema-instance",
      "@xsi:nil": "true"
    }
  },
  "representations": {
    "representation": {
      "nom": "PDF",
      "typeMime": {
        "type": "application",
        "subType": "PDF"
      },
      "statutRepresentation": {
        "verbatim": "true",
        "canonique": "true",
        "officielle": "true",
        "transcription": "false",
        "enregistrement": "false"
      },
      "repSource": {
        "@xmlns:xsi": "http://www.w3.org/2001/XMLSchema-instance",
        "@xsi:nil": "true"
      },
      "offset": {
        "@xmlns:xsi": "http://www.w3.org/2001/XMLSchema-instance",
        "@xsi:nil": "true"
      },
      "contenu": {
        "documentURI": "/15/amendements/0235C/CION_TOUTE/CF211.pdf"
      },
      "dateDispoRepresentation": {
        "@xmlns:xsi": "http://www.w3.org/2001/XMLSchema-instance",
        "@xsi:nil": "true"
      }
    }
  },
  "seanceDiscussion": {
    "@xmlns:xsi": "http://www.w3.org/2001/XMLSchema-instance",
    "@xsi:nil": "true"
  },
  "sort": {
    "@xmlns:xsi": "http://www.w3.org/2001/XMLSchema-instance",
    "@xsi:nil": "true"
  },
  "dateDepot": "2017-10-26T02:00:00.000+02:00",
  "dateDistribution": {
    "@xmlns:xsi": "http://www.w3.org/2001/XMLSchema-instance",
    "@xsi:nil": "true"
  },
  "article99": "0",
  "loiReference": {
    "codeLoi": {
      "@xmlns:xsi": "http://www.w3.org/2001/XMLSchema-instance",
      "@xsi:nil": "true"
    },
    "divisionCodeLoi": {
      "@xmlns:xsi": "http://www.w3.org/2001/XMLSchema-instance",
      "@xsi:nil": "true"
    }
  }
}