{
  "@xmlns": "http://schemas.assemblee-nationale.fr/referentiel",
  "uid": "AMANR5L15PO419610B2274P0D1N280",
  "identifiant": {
    "legislature": "15",
    "numero": "280",
    "numRect": "0",
    "saisine": {
      "refTexteLegislatif": "PRJLANR5L15B2274",
      "numeroPartiePLF": "0",
      "organeExamen": "PO419610",
      "mentionSecondeDeliberation": "0"
    }
  },
  "numeroLong": "CE280",
  "etapeTexte": "1ère lecture (2ème assemblée saisie)",
  "triAmendement": "ciaaaaaaaaaaaaaaaaaaaaaaaaaaaaaaaaaaaaaaaaaaaaaaaae",
  "cardinaliteAmdtMultiples": "1",
  "amendementParent": {
    "@xmlns:xsi": "http://www.w3.org/2001/XMLSchema-instance",
    "@xsi:nil": "true"
  },
  "etat": "Discuté",
  "signataires": {
    "auteur": {
      "typeAuteur": "Depute",
      "acteurRef": "PA718930",
      "organeRef": {
        "@xmlns:xsi": "http://www.w3.org/2001/XMLSchema-instance",
        "@xsi:nil": "true"
      },
      "groupePolitiqueRef": "PO730964"
    },
    "cosignataires": {
      "acteurRef": "PA718930"
    },
    "texteAffichable": "Mme&#160;Petel"
  },
  "pointeurFragmentTexte": {
    "missionVisee": {
      "@xmlns:xsi": "http://www.w3.org/2001/XMLSchema-instance",
      "@xsi:nil": "true"
    },
    "division": {
      "titre": "Article 5 bis A",
      "articleDesignationCourte": "APRÈS ART. 5 BIS A",
      "type": "ARTICLE",
      "avant_A_Apres": "Après",
      "divisionRattachee": "APRÈS L'ARTICLE 5 BIS A, insérer l'article suivant:",
      "articleAdditionnel": "1",
      "chapitreAdditionnel": {
        "@xmlns:xsi": "http://www.w3.org/2001/XMLSchema-instance",
        "@xsi:nil": "true"
      },
      "urlDivisionTexteVise": "/15/textes/2274.asp#D_Article_5_bis_A"
    },
    "alinea": {
      "@xmlns:xsi": "http://www.w3.org/2001/XMLSchema-instance",
      "@xsi:nil": "true"
    }
  },
  "corps": {
    "dispositif": "<p style=\"text-align: justify;\">Apr&#232;s l&#8217;article&#160;5 <i>bis</i> A, ins&#233;rer l&#8217;article suivant&#160;:</p><p style=\"text-align: justify;\">&#171;&#160;Le Gouvernement remet un rapport au Parlement avant le 1<sup>er</sup> janvier 2021 portant sur la mise en place de la vente des m&#233;dicament &#224; l&#8217;unit&#233;. Il dresse un &#233;tat des lieux du gaspillage de m&#233;dicament et explore des pistes de r&#233;flexion pour la m&#233;thode de mise en place de la vente des m&#233;dicaments &#224; l&#8217;unit&#233;.&#160;&#187;</p>",
    "exposeSommaire": "<p style=\"text-align: justify;\">Cet amendement demande un rapport au Gouvernement pr&#233;sentant un &#233;tat des lieux du gaspillage de m&#233;dicament en France et pr&#233;figurant la mise en place de la vente des m&#233;dicaments &#224; l'unit&#233;.</p><p>Le secteur pharmacologique est &#233;galement concern&#233; par les ph&#233;nom&#232;nes de surproduction, et de surconsommation, et l'on retrouve dans les milieux naturels des traces de substances m&#233;dicamenteuses. Ainsi, le Conseil scientifique des &#206;les de L&#233;rins a men&#233; une &#233;tude en partenariat avec l'observatoire du D&#233;veloppement Durable de la M&#233;tropole Nice-C&#244;te d'Azur, l'Universit&#233; de Nice C&#244;te d&#8217;Azur et le Centre Hospitalier Universitaire de Nice C&#244;te d&#8217;Azur, . Cette &#233;tude a montr&#233; que 3 mol&#233;cules ont &#233;t&#233; d&#233;tect&#233;es dans l&#8217;eau &#224; l&#8217;&#233;tat de trace, &#224; une valeur inf&#233;rieure au seuil de quantification : l&#8217;ibuprof&#232;ne, la carbamaz&#233;pine et le sulfamethoxazole.</p><p>La pollution m&#233;dicamenteuse atteignant la mer, il devient urgent de lutter contre la surm&#233;dication, et le gaspillage des m&#233;dicaments. Par cons&#233;quent, ce rapport et la mise en place du m&#233;dicament &#224; l'unit&#233; devraient apporter une r&#233;ponse en amont en adaptant mieux les traitements et en diminuant la source de pollution.</p>",
    "annexeExposeSommaire": {
      "@xmlns:xsi": "http://www.w3.org/2001/XMLSchema-instance",
      "@xsi:nil": "true"
    },
    "cartoucheDelaiDepotDepasse": {
      "@xmlns:xsi": "http://www.w3.org/2001/XMLSchema-instance",
      "@xsi:nil": "true"
    },
    "avantAppel": {
      "@xmlns:xsi": "http://www.w3.org/2001/XMLSchema-instance",
      "@xsi:nil": "true"
    }
  },
  "representations": {
    "representation": {
      "nom": "PDF",
      "typeMime": {
        "type": "application",
        "subType": "PDF"
      },
      "statutRepresentation": {
        "verbatim": "true",
        "canonique": "true",
        "officielle": "true",
        "transcription": "false",
        "enregistrement": "false"
      },
      "repSource": {
        "@xmlns:xsi": "http://www.w3.org/2001/XMLSchema-instance",
        "@xsi:nil": "true"
      },
      "offset": {
        "@xmlns:xsi": "http://www.w3.org/2001/XMLSchema-instance",
        "@xsi:nil": "true"
      },
      "contenu": {
        "documentURI": "/15/amendements/2274/CION-ECO/CE280.pdf"
      },
      "dateDispoRepresentation": {
        "@xmlns:xsi": "http://www.w3.org/2001/XMLSchema-instance",
        "@xsi:nil": "true"
      }
    }
  },
  "seanceDiscussion": {
    "@xmlns:xsi": "http://www.w3.org/2001/XMLSchema-instance",
    "@xsi:nil": "true"
  },
  "sort": {
    "dateSaisie": "2019-11-19T23:03:11.000+01:00",
    "sortEnSeance": "Adopté"
  },
  "dateDepot": "2019-11-15T01:00:00.000+01:00",
  "dateDistribution": "2019-11-18T01:00:00.000+01:00",
  "article99": "0",
  "loiReference": {
    "codeLoi": "xrapport médicaments unité",
    "divisionCodeLoi": {
      "@xmlns:xsi": "http://www.w3.org/2001/XMLSchema-instance",
      "@xsi:nil": "true"
    }
  }
}