{
  "@xmlns": "http://schemas.assemblee-nationale.fr/referentiel",
  "uid": "AMANR5L15SEA717460BTC1173P0D1N382",
  "identifiant": {
    "legislature": "15",
    "numero": "382",
    "numRect": "0",
    "saisine": {
      "refTexteLegislatif": "PRJLANR5L15BTC1173",
      "numeroPartiePLF": "0",
      "organeExamen": "PO717460",
      "mentionSecondeDeliberation": "0"
    }
  },
  "numeroLong": "382",
  "etapeTexte": "Nouvelle Lecture",
  "triAmendement": "no",
  "cardinaliteAmdtMultiples": "1",
  "amendementParent": {
    "@xmlns:xsi": "http://www.w3.org/2001/XMLSchema-instance",
    "@xsi:nil": "true"
  },
  "etat": "Discuté",
  "signataires": {
    "auteur": {
      "typeAuteur": "Depute",
      "acteurRef": "PA332523",
      "organeRef": {
        "@xmlns:xsi": "http://www.w3.org/2001/XMLSchema-instance",
        "@xsi:nil": "true"
      },
      "groupePolitiqueRef": "PO730934"
    },
    "cosignataires": {
      "acteurRef": "PA332523"
    },
    "texteAffichable": "Mme&#160;Dalloz"
  },
  "pointeurFragmentTexte": {
    "missionVisee": {
      "@xmlns:xsi": "http://www.w3.org/2001/XMLSchema-instance",
      "@xsi:nil": "true"
    },
    "division": {
      "titre": "Article 33 ter",
      "articleDesignationCourte": "ART. 33 TER",
      "type": "ARTICLE",
      "avant_A_Apres": "A",
      "divisionRattachee": "ARTICLE 33 TER",
      "articleAdditionnel": {
        "@xmlns:xsi": "http://www.w3.org/2001/XMLSchema-instance",
        "@xsi:nil": "true"
      },
      "chapitreAdditionnel": {
        "@xmlns:xsi": "http://www.w3.org/2001/XMLSchema-instance",
        "@xsi:nil": "true"
      },
      "urlDivisionTexteVise": "/15/textes/1173.asp#D_Article_33_ter"
    },
    "alinea": {
      "@xmlns:xsi": "http://www.w3.org/2001/XMLSchema-instance",
      "@xsi:nil": "true"
    }
  },
  "corps": {
    "dispositif": "<p style=\"text-align: justify;\">R&#233;diger ainsi cet article&#160;:</p><p style=\"text-align: justify;\">&#171;&#160;Apr&#232;s l&#8217;article&#160;L.&#160;313&#8209;14 du code de l&#8217;entr&#233;e et du s&#233;jour des &#233;trangers et du droit d&#8217;asile, il est ins&#233;r&#233; un article&#160;L.&#160;313&#8209;14&#8209;1 ainsi r&#233;dig&#233;&#160;:</p><p style=\"text-align: justify;\">&#171;&#160;<i>Art.&#160;L.&#160;313&#8209;14&#8209;1</i>.&#160;&#8211;&#160;Sauf si sa pr&#233;sence constitue une menace &#224; l&#8217;ordre public et &#224; condition qu&#8217;il ne vive pas en &#233;tat de polygamie, la carte de s&#233;jour temporaire mentionn&#233;e &#224; l&#8217;article&#160;L.&#160;313&#8209;11 ou la carte de s&#233;jour temporaire mentionn&#233;e aux 1&#176;&#160;et 2&#176;&#160;de l&#8217;article&#160;L.&#160;313&#8209;10 peut &#234;tre d&#233;livr&#233;e, sans que soit opposable la condition pr&#233;vue &#224; l&#8217;article&#160;L.&#160;313&#8209;2, &#224; l&#8217;&#233;tranger, accueilli par les organismes mentionn&#233;s au premier alin&#233;a de l&#8217;article&#160;L.&#160;265&#8209;1 du code de l&#8217;action sociale et des familles, qui justifie de trois ann&#233;es d&#8217;activit&#233; ininterrompue, sous r&#233;serve du caract&#232;re r&#233;el et s&#233;rieux de cette activit&#233; et de ses perspectives d&#8217;int&#233;gration.</p><p style=\"text-align: justify;\">&#171;&#160;L&#8217;autorit&#233; administrative d&#233;livre l&#8217;une des cartes de s&#233;jour mentionn&#233;es au premier alin&#233;a du pr&#233;sent article, pour services rendus &#224; la collectivit&#233; et au regard d&#8217;une dur&#233;e de pr&#233;sence en France de l&#8217;&#233;tranger, selon des modalit&#233;s d&#233;finies par le d&#233;cret pr&#233;vu au dernier alin&#233;a qui fixe notamment les conditions dans lesquelles l&#8217;organisme qui accueille l&#8217;&#233;tranger &#233;met un avis sur son parcours d&#8217;int&#233;gration complet et son projet personnel dans le cadre de son activit&#233; au sein de ces organismes.</p><p style=\"text-align: justify;\">&#171;&#160;Pour l&#8217;application du pr&#233;sent article, l&#8217;autorit&#233; administrative est tenue de soumettre pour avis &#224; la commission mentionn&#233;e &#224; l&#8217;article&#160;L.&#160;312&#8209;1 la demande d&#8217;admission exceptionnelle au s&#233;jour form&#233;e par l&#8217;&#233;tranger qui justifie par tout moyen r&#233;sider en France habituellement depuis plus de dix ans.</p><p style=\"text-align: justify;\">&#171;&#160;Un d&#233;cret en Conseil d&#8217;&#201;tat d&#233;finit les modalit&#233;s d&#8217;application du pr&#233;sent article.&#160;&#187;</p><p style=\"text-align: justify;\">&#160;</p>",
    "exposeSommaire": "<p style=\"text-align: justify;\">Le pr&#233;sent amendement vise &#224; int&#233;grer le contenu de l&#8217;article&#160;33 ter du pr&#233;sent projet de loi au CESEDA en compl&#233;tant l&#8217;article L.&#160;313&#8209;14 relatif &#224; l&#8217;admission exceptionnelle au s&#233;jour pour motifs humanitaires par un second alin&#233;a identifiant une seconde cat&#233;gorie de b&#233;n&#233;ficiaires&#160;: celle des ressortissants &#233;trangers accueillis dans un organisme agr&#233;e pour l&#8217;h&#233;bergement des personnes en difficult&#233; qui les fait participer &#224; des activit&#233;s d&#8217;&#233;conomie solidaire afin de favoriser leur insertion sociale et professionnelle.</p><p style=\"text-align: justify;\">L&#8217;admission exceptionnelle au s&#233;jour &#233;tant li&#233;e au pouvoir discr&#233;tionnaire de r&#233;gularisation du pr&#233;fet, et afin d&#8217;&#233;viter tout risque de d&#233;tournement, il est propos&#233; de substituer &#224; la d&#233;livrance de plein droit d&#8217;un titre de s&#233;jour au ressortissant &#233;tranger accueilli depuis au moins 3 ans dans un organisme vis&#233; &#224; l&#8217;article L.&#160;265&#8209;1 du CASF une possibilit&#233; de r&#233;gularisation subordonn&#233;e, outre la r&#233;serve d&#8217;ordre public et de non polygamie, au caract&#232;re r&#233;el et s&#233;rieux de l&#8217;activit&#233; exerc&#233;e, de mani&#232;re ininterrompue, dans l&#8217;organisme et aux perspectives d&#8217;int&#233;gration de l&#8217;int&#233;ress&#233;. Celles-ci seront appr&#233;ci&#233;es par le pr&#233;fet au regard notamment d&#8217;un avis &#233;mis par l&#8217;organisme d&#8217;accueil selon des modalit&#233;s qui seront fix&#233;es par d&#233;cret en Conseil d&#8217;&#201;tat.</p><p style=\"text-align: justify;\">Les ressortissants &#233;trangers vis&#233;s par les deux dispositifs d&#8217;admission au s&#233;jour de l&#8217;article L.&#160;313&#8209;14 b&#233;n&#233;ficieront par ailleurs des m&#234;mes garanties proc&#233;durales obligeant le pr&#233;fet &#224; saisir pr&#233;alablement la commission du titre de s&#233;jour en cas de r&#233;sidence habituelle en France sup&#233;rieure &#224; 10 ans.</p><p style=\"text-align: justify;\">&#160;</p>",
    "annexeExposeSommaire": {
      "@xmlns:xsi": "http://www.w3.org/2001/XMLSchema-instance",
      "@xsi:nil": "true"
    }
  },
  "representations": {
    "representation": {
      "nom": "PDF",
      "typeMime": {
        "type": "application",
        "subType": "PDF"
      },
      "statutRepresentation": {
        "verbatim": "true",
        "canonique": "true",
        "officielle": "true",
        "transcription": "false",
        "enregistrement": "false"
      },
      "repSource": {
        "@xmlns:xsi": "http://www.w3.org/2001/XMLSchema-instance",
        "@xsi:nil": "true"
      },
      "offset": {
        "@xmlns:xsi": "http://www.w3.org/2001/XMLSchema-instance",
        "@xsi:nil": "true"
      },
      "contenu": {
        "documentURI": "/15/amendements/1173/AN/382.pdf"
      },
      "dateDispoRepresentation": {
        "@xmlns:xsi": "http://www.w3.org/2001/XMLSchema-instance",
        "@xsi:nil": "true"
      }
    }
  },
  "seanceDiscussion": "RUANR5L15S2018IDS21205",
  "sort": {
    "dateSaisie": "2018-07-27T00:38:04.000+02:00",
    "sortEnSeance": "Non soutenu"
  },
  "dateDepot": "2018-07-20T02:00:00.000+02:00",
  "dateDistribution": "2018-07-24T02:00:00.000+02:00",
  "article99": "0",
  "loiReference": {
    "codeLoi": {
      "@xmlns:xsi": "http://www.w3.org/2001/XMLSchema-instance",
      "@xsi:nil": "true"
    },
    "divisionCodeLoi": {
      "@xmlns:xsi": "http://www.w3.org/2001/XMLSchema-instance",
      "@xsi:nil": "true"
    }
  }
}