{
  "@xmlns": "http://schemas.assemblee-nationale.fr/referentiel",
  "uid": "AMANR5L15PO59051B1695P0D1N5",
  "identifiant": {
    "legislature": "15",
    "numero": "5",
    "numRect": "0",
    "saisine": {
      "refTexteLegislatif": "PRJLANR5L15B1695",
      "numeroPartiePLF": "0",
      "organeExamen": "PO59051",
      "mentionSecondeDeliberation": "0"
    }
  },
  "numeroLong": "CL5",
  "etapeTexte": "1ère lecture (2ème assemblée saisie)",
  "triAmendement": "acaaaaaaaaaaaaaaaaaaaaaaaaaaaaaaaaaaaaaaaaaaaaaaaai",
  "cardinaliteAmdtMultiples": "1",
  "amendementParent": {
    "@xmlns:xsi": "http://www.w3.org/2001/XMLSchema-instance",
    "@xsi:nil": "true"
  },
  "etat": "Discuté",
  "signataires": {
    "auteur": {
      "typeAuteur": "Depute",
      "acteurRef": "PA721960",
      "organeRef": {
        "@xmlns:xsi": "http://www.w3.org/2001/XMLSchema-instance",
        "@xsi:nil": "true"
      },
      "groupePolitiqueRef": "PO730958"
    },
    "cosignataires": {
      "acteurRef": [
        "PA719578",
        "PA588884",
        "PA721210",
        "PA718860",
        "PA721960",
        "PA720286",
        "PA720846",
        "PA719676",
        "PA721062",
        "PA2150",
        "PA718868",
        "PA720892",
        "PA722142",
        "PA720430",
        "PA721202",
        "PA720422",
        "PA721226"
      ]
    },
    "texteAffichable": "Mme&#160;Obono,  Mme&#160;Autain, M.&#160;Bernalicis, M.&#160;Coquerel, M.&#160;Corbi&#232;re, Mme&#160;Fiat, M.&#160;Lachaud, M.&#160;Larive, M.&#160;M&#233;lenchon, Mme&#160;Panot, M.&#160;Prud&apos;homme, M.&#160;Quatennens, M.&#160;Ratenon, Mme&#160;Ressiguier, Mme&#160;Rubin, M.&#160;Ruffin et Mme&#160;Taurine"
  },
  "pointeurFragmentTexte": {
    "missionVisee": {
      "@xmlns:xsi": "http://www.w3.org/2001/XMLSchema-instance",
      "@xsi:nil": "true"
    },
    "division": {
      "titre": "Article PREMIER",
      "articleDesignationCourte": "APRÈS ART. PREMIER",
      "type": "ARTICLE",
      "avant_A_Apres": "Après",
      "divisionRattachee": "APRÈS L'ARTICLE PREMIER, insérer l'article suivant:",
      "articleAdditionnel": "1",
      "chapitreAdditionnel": {
        "@xmlns:xsi": "http://www.w3.org/2001/XMLSchema-instance",
        "@xsi:nil": "true"
      },
      "urlDivisionTexteVise": "/15/textes/1695.asp#D_Article_1er"
    },
    "alinea": {
      "@xmlns:xsi": "http://www.w3.org/2001/XMLSchema-instance",
      "@xsi:nil": "true"
    }
  },
  "corps": {
    "dispositif": "<p style=\"line-height: 1.2; text-align: justify;\">Le titre&#160;I<sup>er</sup> de la loi organique n&#176;&#160;2004&#8209;192 du&#160;27&#160;f&#233;vrier&#160;2004 portant statut d&#8217;autonomie de la Polyn&#233;sie fran&#231;aise est compl&#233;t&#233; par une section&#160;3 ainsi r&#233;dig&#233;e&#160;:</p><p style=\"line-height: 1.2; text-align: justify;\">&#171;&#160;Section 3</p><p style=\"line-height: 1.2; text-align: justify;\">&#171;&#160;De la planification &#233;cologique</p><p style=\"line-height: 1.2; text-align: justify;\">&#171;&#160;Sous-section 1</p><p style=\"line-height: 1.2; text-align: justify;\">&#171;&#160;D&#233;r&#232;glements climatiques</p><p style=\"text-align: justify;\">&#171;&#160;<i>Art.&#160;6&#8209;3</i>.&#8211;&#160;I.&#160;&#8211;&#160;La R&#233;publique reconna&#238;t la n&#233;cessit&#233; de garantir la planification &#233;cologique, en ce que l&#8217;&#201;tat s&#8217;engage &#224; soutenir, sur demande de la Polyn&#233;sie fran&#231;aise et en partenariat avec elle, la pr&#233;vention et &#224; l&#8217;adaptation aux impacts actuels et &#224; venir des d&#233;r&#232;glements climatiques.</p><p style=\"text-align: justify;\">&#171;&#160;II.&#160;&#8211;&#160;L&#8217;&#201;tat informe chaque ann&#233;e l&#8217;assembl&#233;e de la Polyn&#233;sie fran&#231;aise et le Parlement des co&#251;ts induits par ces d&#233;r&#232;glements climatiques par le biais d&#8217;un rapport chiffr&#233; et accompagne la Polyn&#233;sie fran&#231;aise dans la mise en &#339;uvre des politiques d&#8217;adaptation et de lutte qu&#8217;elle souhaitera mener.&#160;</p><p style=\"text-align: justify;\">&#171;&#160;Ces mesures s&#8217;appliquent dans le strict respect de la r&#233;partition des comp&#233;tences telle qu&#8217;organis&#233;e par les titres II et III de la pr&#233;sente Loi organique.</p><p style=\"text-align: justify;\">&#171;&#160;III.&#160;&#8211;&#160;Les dispositions des pr&#233;sents I et II s&#8217;appliquent dans le strict respect de la r&#233;partition des comp&#233;tences entre l&#8217;&#201;tat et la Polyn&#233;sie fran&#231;aise, telle qu&#8217;organis&#233;e par les titres II et III de la pr&#233;sente loi organique.&#160;&#187;</p>",
    "exposeSommaire": "<p style=\"line-height: 1.2;\">Par cet amendement, nous proposons, dans le respect des comp&#233;tences statutaires de la collectivit&#233; de Polyn&#233;sie fran&#231;aise, d&#8217;inscrire l&#8217;urgence &#233;cologique dans la loi organique n&#176; 2004-192 du 27 f&#233;vrier 2004 portant statut d&#8217;autonomie de la Polyn&#233;sie fran&#231;aise. Nous cr&#233;ons pour cela une sous-section intitul&#233;e &#171; De la planification &#233;cologique. &#187;</p><p style=\"text-align: justify;\">Par ce biais, nous entendons reconna&#238;tre les impacts actuels et &#224; venir des d&#233;r&#232;glements climatiques et leur sp&#233;cificit&#233; du fait du caract&#232;re insulaire de la Polyn&#233;sie fran&#231;aise. La mont&#233; des oc&#233;ans, leur acidification comme la multiplication des &#233;v&#233;nements&#160;climatiques extr&#234;mes auront des impacts non n&#233;gligeables sur les g&#233;ographies insulaires. Nous ne prenons pas ceux-l&#224; &#224; la l&#233;g&#232;re sur les archipels de Polyn&#233;sie fran&#231;aise. Ils risquent de bouleverser tout autant les &#233;cosyst&#232;mes que le mod&#232;le de d&#233;veloppement &#233;conomique. A ce titre, nous demandons que l&#8217;Etat informe chaque ann&#233;e l&#8217;assembl&#233;e de la Polyn&#233;sie fran&#231;aise des co&#251;ts induits par ces d&#233;r&#232;glements climatique par le biais d&#8217;un rapport chiffr&#233; et accompagne la Polyn&#233;sie dans la mise en oeuvre des politiques d&#8217;adaptation et de lutte qu&#8217;elle souhaitera mener.<br /><br />Loin de vouloir revenir sur les comp&#233;tences de la Polyn&#233;sie fran&#231;aise et son autonomie, cette proposition s'inscrit au contraire dans l'id&#233;e d'acter d'un soutien renforc&#233; de l'Etat si la Polyn&#233;sie fran&#231;aise le sollicite.</p>",
    "annexeExposeSommaire": {
      "@xmlns:xsi": "http://www.w3.org/2001/XMLSchema-instance",
      "@xsi:nil": "true"
    },
    "cartoucheDelaiDepotDepasse": {
      "@xmlns:xsi": "http://www.w3.org/2001/XMLSchema-instance",
      "@xsi:nil": "true"
    }
  },
  "representations": {
    "representation": {
      "nom": "PDF",
      "typeMime": {
        "type": "application",
        "subType": "PDF"
      },
      "statutRepresentation": {
        "verbatim": "true",
        "canonique": "true",
        "officielle": "true",
        "transcription": "false",
        "enregistrement": "false"
      },
      "repSource": {
        "@xmlns:xsi": "http://www.w3.org/2001/XMLSchema-instance",
        "@xsi:nil": "true"
      },
      "offset": {
        "@xmlns:xsi": "http://www.w3.org/2001/XMLSchema-instance",
        "@xsi:nil": "true"
      },
      "contenu": {
        "documentURI": "/15/amendements/1695/CION_LOIS/CL5.pdf"
      },
      "dateDispoRepresentation": {
        "@xmlns:xsi": "http://www.w3.org/2001/XMLSchema-instance",
        "@xsi:nil": "true"
      }
    }
  },
  "seanceDiscussion": {
    "@xmlns:xsi": "http://www.w3.org/2001/XMLSchema-instance",
    "@xsi:nil": "true"
  },
  "sort": {
    "dateSaisie": "2019-03-27T19:25:10.000+01:00",
    "sortEnSeance": "Rejeté"
  },
  "dateDepot": "2019-03-22T01:00:00.000+01:00",
  "dateDistribution": "2019-03-26T01:00:00.000+01:00",
  "article99": "0",
  "loiReference": {
    "codeLoi": "1",
    "divisionCodeLoi": {
      "@xmlns:xsi": "http://www.w3.org/2001/XMLSchema-instance",
      "@xsi:nil": "true"
    }
  }
}