{
  "@xmlns": "http://schemas.assemblee-nationale.fr/referentiel",
  "uid": "AMANR5L15SEA717460B2272P2D1N2437",
  "identifiant": {
    "legislature": "15",
    "numero": "2437",
    "numRect": "0",
    "saisine": {
      "refTexteLegislatif": "PRJLANR5L15B2272",
      "numeroPartiePLF": "2",
      "organeExamen": "PO717460",
      "mentionSecondeDeliberation": "0"
    }
  },
  "numeroLong": "II-2437",
  "etapeTexte": "1ère lecture (1ère assemblée saisie)",
  "triAmendement": "bksaaaaaaaaaaaaaaaaaaaaaaaaaaaaaaaaaaaaaaaaaaaaaaab",
  "cardinaliteAmdtMultiples": "1",
  "amendementParent": {
    "@xmlns:xsi": "http://www.w3.org/2001/XMLSchema-instance",
    "@xsi:nil": "true"
  },
  "etat": "Discuté",
  "signataires": {
    "auteur": {
      "typeAuteur": "Depute",
      "acteurRef": "PA721960",
      "organeRef": {
        "@xmlns:xsi": "http://www.w3.org/2001/XMLSchema-instance",
        "@xsi:nil": "true"
      },
      "groupePolitiqueRef": "PO730958"
    },
    "cosignataires": {
      "acteurRef": [
        "PA719676",
        "PA721062",
        "PA718868",
        "PA720846",
        "PA720892",
        "PA720430",
        "PA721210",
        "PA721202",
        "PA721960",
        "PA2150",
        "PA721226",
        "PA720286",
        "PA722142",
        "PA719578",
        "PA720422",
        "PA588884",
        "PA718860"
      ]
    },
    "texteAffichable": "Mme&#160;Obono,  Mme&#160;Autain, M.&#160;Bernalicis, M.&#160;Coquerel, M.&#160;Corbi&#232;re, Mme&#160;Fiat, M.&#160;Lachaud, M.&#160;Larive, M.&#160;M&#233;lenchon, Mme&#160;Panot, M.&#160;Prud&apos;homme, M.&#160;Quatennens, M.&#160;Ratenon, Mme&#160;Ressiguier, Mme&#160;Rubin, M.&#160;Ruffin et Mme&#160;Taurine"
  },
  "pointeurFragmentTexte": {
    "missionVisee": {
      "idMissionAN": "805",
      "libelleMission": "Conseil et contrôle de l'État",
      "codeMissionPLF": "B",
      "libelleMissionPLF": "Répartition, par mission et programme, des crédits du budget général"
    },
    "division": {
      "titre": "ÉTAT B",
      "articleDesignationCourte": "ART. 38",
      "type": "ANNEXE",
      "avant_A_Apres": "A",
      "divisionRattachee": "ARTICLE 38",
      "articleAdditionnel": {
        "@xmlns:xsi": "http://www.w3.org/2001/XMLSchema-instance",
        "@xsi:nil": "true"
      },
      "chapitreAdditionnel": {
        "@xmlns:xsi": "http://www.w3.org/2001/XMLSchema-instance",
        "@xsi:nil": "true"
      },
      "urlDivisionTexteVise": "/15/textes/2272C.asp#D_ETAT_B"
    },
    "alinea": {
      "@xmlns:xsi": "http://www.w3.org/2001/XMLSchema-instance",
      "@xsi:nil": "true"
    }
  },
  "corps": {
    "exposeSommaire": "<p style=\"text-align: justify;\">Par cet amendement, tout comme l&#8217;an pass&#233; lors de ce m&#234;me examen du projet de loi de finances, nous proposons de supprimer le Haut Conseil des finances publiques et de mobiliser ses cr&#233;dits &#224; une fin r&#233;ellement utile et justifi&#233;e, &#224; savoir les salari&#233;s et ex-salari&#233;s de GM&amp;amp;S.</p><p>Le Haut Conseil des finances publiques est une institution antisociale. Il a &#233;t&#233; cr&#233;&#233; en 2012 en application du 2e paragraphe de l&#8217;article&#160;3 du trait&#233; aust&#233;ritaire TSCG (Trait&#233; sur la stabilit&#233;, la coordination et la gouvernance au sein de l&#8217;Union &#233;conomique et mon&#233;taire) afin de donner son avis sur le respect par la France de principes d&#8217;orthodoxie budg&#233;taire, notamment des &#171;&#160;lois de programmation des finances publiques&#160;&#187; qui permettraient de viser des &#171;&#160;objectifs &#224; moyen-terme&#160;&#187; d&#8217;&#233;quilibre (OMT).</p><p>Ces 479 786&#160;euros ainsi lib&#233;r&#233;s pourraient &#234;tre affect&#233;s &#224; des entreprises en difficult&#233; pour aider au maintien de l&#8217;emploi. L&#8217;an pass&#233; nous avions propos&#233; de les affecter aux salari&#233;s de GM&amp;amp;S, un film racontant leur lutte vient d&#8217;ailleurs de sortir au cin&#233;ma, alors que pr&#232;s de la moiti&#233; des 157 licenci&#233;s est toujours sans solution durable. Cette ann&#233;e les dossiers ne manquent pas, mais nous sommes particuli&#232;rement indign&#233;s par la situation de GE Belfort. Apr&#232;s avoir brad&#233; la branche &#233;nergie Alstom en la vendant &#224; General Electric, la derni&#232;re version du plan social pr&#233;voit 485 licenciements.</p><p>Nous proposons donc le transfert des 479&#160;786&#160;euros tir&#233;s de la suppression du programme 340. Ce transfert pourra permettre la cr&#233;ation d&#8217;un tel fonds de soutien, en ce que le programme 126 &#171;&#160;Conseil &#233;conomique, social et environnemental&#160;&#187; se verra dot&#233; de cette somme.</p><p>Le Conseil &#233;conomique, social et environnemental pourra ainsi d&#233;cider s&#8217;il souhaite directement g&#233;rer ces 479&#160;786&#160;euros ou cr&#233;er un fonds ext&#233;rieur qui permettra notamment de mobiliser des fonds pour aider &#224; la sauvegarde de l&#8217;emploi et pour aider les salari&#233;s licenci&#233;s.</p>",
    "annexeExposeSommaire": {
      "@xmlns:xsi": "http://www.w3.org/2001/XMLSchema-instance",
      "@xsi:nil": "true"
    },
    "cartoucheDelaiDepotDepasse": {
      "@xmlns:xsi": "http://www.w3.org/2001/XMLSchema-instance",
      "@xsi:nil": "true"
    },
    "avantAppel": {
      "@xmlns:xsi": "http://www.w3.org/2001/XMLSchema-instance",
      "@xsi:nil": "true"
    },
    "dispositifAmdtCredit": {
      "listeProgrammes": {
        "programme": [
          {
            "libelle": "Conseil d'État et autres juridictions administratives",
            "id": "103516",
            "AE": {
              "montantPositif": "0",
              "montantNegatif": "0"
            },
            "CP": {
              "montantPositif": "0",
              "montantNegatif": "0"
            },
            "action": "modification",
            "lignesCredits": null
          },
          {
            "libelle": "Conseil économique, social et environnemental",
            "id": "103517",
            "AE": {
              "montantPositif": "479786",
              "montantNegatif": "0"
            },
            "CP": {
              "montantPositif": "479786",
              "montantNegatif": "0"
            },
            "action": "modification",
            "lignesCredits": {
              "ligneCredit": {
                "id": "3293",
                "libelle": "dont titre 2",
                "AE": {
                  "montantPositif": "429673",
                  "montantNegatif": "0"
                },
                "CP": {
                  "montantPositif": "429673",
                  "montantNegatif": "0"
                }
              }
            }
          },
          {
            "libelle": "Cour des comptes et autres juridictions financières",
            "id": "103518",
            "AE": {
              "montantPositif": "0",
              "montantNegatif": "0"
            },
            "CP": {
              "montantPositif": "0",
              "montantNegatif": "0"
            },
            "action": "modification",
            "lignesCredits": null
          },
          {
            "libelle": "Haut Conseil des finances publiques",
            "id": "103519",
            "AE": {
              "montantPositif": "0",
              "montantNegatif": "479786"
            },
            "CP": {
              "montantPositif": "0",
              "montantNegatif": "479786"
            },
            "action": "suppression",
            "lignesCredits": {
              "ligneCredit": {
                "id": "3294",
                "libelle": "dont titre 2",
                "AE": {
                  "montantPositif": "0",
                  "montantNegatif": "429673"
                },
                "CP": {
                  "montantPositif": "0",
                  "montantNegatif": "429673"
                }
              }
            }
          }
        ]
      },
      "totalAE": {
        "montantPositif": "479786",
        "montantNegatif": "479786",
        "solde": "0"
      },
      "totalCP": {
        "montantPositif": "479786",
        "montantNegatif": "479786",
        "solde": "0"
      }
    }
  },
  "representations": {
    "representation": {
      "nom": "PDF",
      "typeMime": {
        "type": "application",
        "subType": "PDF"
      },
      "statutRepresentation": {
        "verbatim": "true",
        "canonique": "true",
        "officielle": "true",
        "transcription": "false",
        "enregistrement": "false"
      },
      "repSource": {
        "@xmlns:xsi": "http://www.w3.org/2001/XMLSchema-instance",
        "@xsi:nil": "true"
      },
      "offset": {
        "@xmlns:xsi": "http://www.w3.org/2001/XMLSchema-instance",
        "@xsi:nil": "true"
      },
      "contenu": {
        "documentURI": "/15/amendements/2272C/AN/2437.pdf"
      },
      "dateDispoRepresentation": {
        "@xmlns:xsi": "http://www.w3.org/2001/XMLSchema-instance",
        "@xsi:nil": "true"
      }
    }
  },
  "seanceDiscussion": "RUANR5L15S2020IDS21935",
  "sort": {
    "dateSaisie": "2019-11-12T22:58:27.000+01:00",
    "sortEnSeance": "Rejeté"
  },
  "dateDepot": "2019-11-07T01:00:00.000+01:00",
  "dateDistribution": "2019-11-08T01:00:00.000+01:00",
  "article99": "0",
  "loiReference": {
    "codeLoi": {
      "@xmlns:xsi": "http://www.w3.org/2001/XMLSchema-instance",
      "@xsi:nil": "true"
    },
    "divisionCodeLoi": {
      "@xmlns:xsi": "http://www.w3.org/2001/XMLSchema-instance",
      "@xsi:nil": "true"
    }
  }
}