{
  "@xmlns": "http://schemas.assemblee-nationale.fr/referentiel",
  "uid": "AMANR5L15SEA717460BTC2401P0D1N1391",
  "identifiant": {
    "legislature": "15",
    "numero": "1391",
    "numRect": "0",
    "saisine": {
      "refTexteLegislatif": "PRJLANR5L15BTC2401",
      "numeroPartiePLF": "0",
      "organeExamen": "PO717460",
      "mentionSecondeDeliberation": "0"
    }
  },
  "numeroLong": "1391",
  "etapeTexte": "1ère lecture (2ème assemblée saisie)",
  "triAmendement": "dqaaaaaaaaaaaaaaaaaaaaaaaaaaaaaaaaaaaaaaaaaaaaaaaacb",
  "cardinaliteAmdtMultiples": "1",
  "amendementParent": {
    "@xmlns:xsi": "http://www.w3.org/2001/XMLSchema-instance",
    "@xsi:nil": "true"
  },
  "etat": "Discuté",
  "signataires": {
    "auteur": {
      "typeAuteur": "Depute",
      "acteurRef": "PA609590",
      "organeRef": {
        "@xmlns:xsi": "http://www.w3.org/2001/XMLSchema-instance",
        "@xsi:nil": "true"
      },
      "groupePolitiqueRef": "PO758835"
    },
    "cosignataires": {
      "acteurRef": [
        "PA642764",
        "PA608172",
        "PA643145",
        "PA605069",
        "PA333818",
        "PA340357",
        "PA332614",
        "PA1809",
        "PA340343",
        "PA508",
        "PA333285",
        "PA609590",
        "PA608695",
        "PA337483",
        "PA609332",
        "PA267233",
        "PA342415",
        "PA1008",
        "PA720988",
        "PA610681",
        "PA608741",
        "PA335054",
        "PA1592",
        "PA719930",
        "PA608011",
        "PA607553",
        "PA335532",
        "PA429893",
        "PA1198"
      ]
    },
    "texteAffichable": "Mme&#160;Rabault,  Mme&#160;Untermaier, Mme&#160;Pires Beaune, Mme&#160;Battistel, Mme&#160;Karamanli, M.&#160;Saulignac, M.&#160;Potier, M.&#160;Carvounas, M.&#160;Aviragnet, Mme&#160;Bareigts, Mme&#160;Bi&#233;mouret, M.&#160;Bouillon, M.&#160;Jean-Louis&#160;Bricout, M.&#160;Alain&#160;David, Mme&#160;Laurence&#160;Dumont, M.&#160;Faure, M.&#160;Garot, M.&#160;David&#160;Habib, M.&#160;Hutin, M.&#160;Juanico, M.&#160;J&#233;r&#244;me&#160;Lambert, M.&#160;Letchimy, Mme&#160;Manin, Mme&#160;Pau-Langevin, M.&#160;Pueyo, Mme&#160;Tolmont, Mme&#160;Vainqueur-Christophe, M.&#160;Vallaud, Mme&#160;Victory et les membres du groupe Socialistes et apparent&#233;s"
  },
  "pointeurFragmentTexte": {
    "missionVisee": {
      "@xmlns:xsi": "http://www.w3.org/2001/XMLSchema-instance",
      "@xsi:nil": "true"
    },
    "division": {
      "titre": "Article 12 A",
      "articleDesignationCourte": "APRÈS ART. 12 A",
      "type": "ARTICLE",
      "avant_A_Apres": "Après",
      "divisionRattachee": "APRÈS L'ARTICLE 12 A, insérer l'article suivant:",
      "articleAdditionnel": "1",
      "chapitreAdditionnel": {
        "@xmlns:xsi": "http://www.w3.org/2001/XMLSchema-instance",
        "@xsi:nil": "true"
      },
      "urlDivisionTexteVise": "/15/textes/2401.asp#D_Article_12_A"
    },
    "alinea": {
      "@xmlns:xsi": "http://www.w3.org/2001/XMLSchema-instance",
      "@xsi:nil": "true"
    }
  },
  "corps": {
    "dispositif": "<p style=\"text-align: justify;\">La section 7 du chapitre I<sup>er</sup> du titre II du livre I<sup>er</sup> de la deuxi&#232;me partie du code g&#233;n&#233;ral des collectivit&#233;s territoriales est compl&#233;t&#233;e par un article L.&#160;2121&#8209;42 ainsi r&#233;dig&#233;&#160;:</p><p style=\"text-align: justify;\">&#171;&#160;<i>Art.&#160;L.&#160;2121&#8209;42</i>.&#160;&#8211; Lorsqu&#8217;un signalement est effectu&#233; &#232;s qualit&#233;s par le maire d&#8217;une commune aupr&#232;s de la gendarmerie, le commandant de groupement de gendarmerie d&#233;partementale ou son repr&#233;sentant le tient inform&#233; des suites donn&#233;es &#224; ce signalement dans les meilleurs d&#233;lais.&#160;&#187;</p>",
    "exposeSommaire": "<p style=\"text-align: justify;\">Cet amendement propose que la loi pr&#233;voit l&#8217;obligation pour le commandant de groupement de gendarmerie d&#233;partementale ou son repr&#233;sentant de tenir inform&#233; le maire lorsqu&#8217;il a effectu&#233; un signalement en cette qualit&#233;.</p><p style=\"text-align: justify;\">Il est en effet imp&#233;ratif que le premier magistrat de la commune qui effectue un signalement en cette qualit&#233; puisse &#234;tre inform&#233; des suites qui seront r&#233;serv&#233;es &#224; celui-ci.</p>",
    "annexeExposeSommaire": {
      "@xmlns:xsi": "http://www.w3.org/2001/XMLSchema-instance",
      "@xsi:nil": "true"
    },
    "cartoucheDelaiDepotDepasse": {
      "@xmlns:xsi": "http://www.w3.org/2001/XMLSchema-instance",
      "@xsi:nil": "true"
    },
    "avantAppel": {
      "@xmlns:xsi": "http://www.w3.org/2001/XMLSchema-instance",
      "@xsi:nil": "true"
    }
  },
  "representations": {
    "representation": {
      "nom": "PDF",
      "typeMime": {
        "type": "application",
        "subType": "PDF"
      },
      "statutRepresentation": {
        "verbatim": "true",
        "canonique": "true",
        "officielle": "true",
        "transcription": "false",
        "enregistrement": "false"
      },
      "repSource": {
        "@xmlns:xsi": "http://www.w3.org/2001/XMLSchema-instance",
        "@xsi:nil": "true"
      },
      "offset": {
        "@xmlns:xsi": "http://www.w3.org/2001/XMLSchema-instance",
        "@xsi:nil": "true"
      },
      "contenu": {
        "documentURI": "/15/amendements/2401/AN/1391.pdf"
      },
      "dateDispoRepresentation": {
        "@xmlns:xsi": "http://www.w3.org/2001/XMLSchema-instance",
        "@xsi:nil": "true"
      }
    }
  },
  "seanceDiscussion": "RUANR5L15S2020IDS21952",
  "sort": {
    "dateSaisie": "2019-11-21T12:37:32.000+01:00",
    "sortEnSeance": "Rejeté"
  },
  "dateDepot": "2019-11-14T01:00:00.000+01:00",
  "dateDistribution": "2019-11-19T01:00:00.000+01:00",
  "article99": "0",
  "loiReference": {
    "codeLoi": "CGCT",
    "divisionCodeLoi": "L2121-42"
  }
}