{
  "@xmlns": "http://schemas.assemblee-nationale.fr/referentiel",
  "uid": "AMANR5L15PO59048B1490P0D1N696",
  "identifiant": {
    "legislature": "15",
    "numero": "696",
    "numRect": "0",
    "saisine": {
      "refTexteLegislatif": "PRJLANR5L15B1490",
      "numeroPartiePLF": "0",
      "organeExamen": "PO59048",
      "mentionSecondeDeliberation": "0"
    }
  },
  "numeroLong": "CF696",
  "etapeTexte": "Nouvelle Lecture",
  "triAmendement": "ebaaaaaaaaaaaaaaaaaaaaaaaaaaaaaaaaaaaaaaaaaaaaaaaanzw",
  "cardinaliteAmdtMultiples": "1",
  "amendementParent": {
    "@xmlns:xsi": "http://www.w3.org/2001/XMLSchema-instance",
    "@xsi:nil": "true"
  },
  "etat": "Retiré",
  "signataires": {
    "auteur": {
      "typeAuteur": "Depute",
      "acteurRef": "PA267336",
      "organeRef": {
        "@xmlns:xsi": "http://www.w3.org/2001/XMLSchema-instance",
        "@xsi:nil": "true"
      },
      "groupePolitiqueRef": "PO730964"
    },
    "cosignataires": {
      "acteurRef": "PA267336"
    },
    "texteAffichable": "M.&#160;Giraud, rapporteur g&#233;n&#233;ral"
  },
  "pointeurFragmentTexte": {
    "missionVisee": {
      "idMissionAN": "708",
      "libelleMission": "Écologie, développement et mobilité durables",
      "codeMissionPLF": "B",
      "libelleMissionPLF": "Répartition, par mission et programme, des crédits du budget général"
    },
    "division": {
      "titre": "ÉTAT B",
      "articleDesignationCourte": "ART. 39",
      "type": "ANNEXE",
      "avant_A_Apres": "A",
      "divisionRattachee": "ARTICLE 39",
      "articleAdditionnel": {
        "@xmlns:xsi": "http://www.w3.org/2001/XMLSchema-instance",
        "@xsi:nil": "true"
      },
      "chapitreAdditionnel": {
        "@xmlns:xsi": "http://www.w3.org/2001/XMLSchema-instance",
        "@xsi:nil": "true"
      },
      "urlDivisionTexteVise": "/15/textes/1490.asp#D_Etat_B"
    },
    "alinea": {
      "@xmlns:xsi": "http://www.w3.org/2001/XMLSchema-instance",
      "@xsi:nil": "true"
    }
  },
  "corps": {
    "exposeSommaire": "<p style=\"text-align: justify;\">Le pr&#233;sent amendement vise &#224; r&#233;tablir les cr&#233;dits de la mission <i>&#201;cologie, d&#233;veloppement et mobilit&#233; durables</i>, qui ont &#233;t&#233; rejet&#233;s au S&#233;nat.</p><p style=\"text-align: justify;\">En revanche, l&#8217;amendement revient sur l&#8217;ouverture de 115 millions d&#8217;euros en AE et 100 millions d&#8217;euros en CP sur le programme <i>Service public de l&#8217;&#233;nergie</i>, qui avait &#233;t&#233; adopt&#233; en seconde d&#233;lib&#233;ration en premi&#232;re lecture &#224; l&#8217;Assembl&#233;e nationale, au titre de la compensation de la hausse de la fiscalit&#233; du carburant. Celle-ci n'ayant finalement pas lieu, il n'appara&#238;t pas n&#233;cessaire de conserver les mesures de compensation.</p>",
    "annexeExposeSommaire": {
      "@xmlns:xsi": "http://www.w3.org/2001/XMLSchema-instance",
      "@xsi:nil": "true"
    },
    "cartoucheDelaiDepotDepasse": {
      "@xmlns:xsi": "http://www.w3.org/2001/XMLSchema-instance",
      "@xsi:nil": "true"
    },
    "dispositifAmdtCredit": {
      "listeProgrammes": {
        "programme": [
          {
            "libelle": "Infrastructures et services de transports",
            "id": "57702",
            "AE": {
              "montantPositif": "3365600659",
              "montantNegatif": "0"
            },
            "CP": {
              "montantPositif": "3193638870",
              "montantNegatif": "0"
            },
            "action": "modification",
            "lignesCredits": null
          },
          {
            "libelle": "Affaires maritimes",
            "id": "57703",
            "AE": {
              "montantPositif": "163055254",
              "montantNegatif": "0"
            },
            "CP": {
              "montantPositif": "157335254",
              "montantNegatif": "0"
            },
            "action": "modification",
            "lignesCredits": null
          },
          {
            "libelle": "Paysages, eau et biodiversité",
            "id": "57704",
            "AE": {
              "montantPositif": "164130813",
              "montantNegatif": "0"
            },
            "CP": {
              "montantPositif": "159930812",
              "montantNegatif": "0"
            },
            "action": "modification",
            "lignesCredits": null
          },
          {
            "libelle": "Expertise, information géographique et météorologie",
            "id": "57705",
            "AE": {
              "montantPositif": "494607687",
              "montantNegatif": "0"
            },
            "CP": {
              "montantPositif": "494607687",
              "montantNegatif": "0"
            },
            "action": "modification",
            "lignesCredits": null
          },
          {
            "libelle": "Prévention des risques",
            "id": "57706",
            "AE": {
              "montantPositif": "831328679",
              "montantNegatif": "0"
            },
            "CP": {
              "montantPositif": "825802247",
              "montantNegatif": "0"
            },
            "action": "modification",
            "lignesCredits": {
              "ligneCredit": {
                "id": "2314",
                "libelle": "Dont titre 2",
                "AE": {
                  "montantPositif": "46446540",
                  "montantNegatif": "0"
                },
                "CP": {
                  "montantPositif": "46446540",
                  "montantNegatif": "0"
                }
              }
            }
          },
          {
            "libelle": "Énergie, climat et après-mines",
            "id": "57707",
            "AE": {
              "montantPositif": "400130246",
              "montantNegatif": "0"
            },
            "CP": {
              "montantPositif": "400130246",
              "montantNegatif": "0"
            },
            "action": "modification",
            "lignesCredits": null
          },
          {
            "libelle": "Service public de l'énergie",
            "id": "57708",
            "AE": {
              "montantPositif": "3182503669",
              "montantNegatif": "0"
            },
            "CP": {
              "montantPositif": "3219360538",
              "montantNegatif": "0"
            },
            "action": "modification",
            "lignesCredits": null
          },
          {
            "libelle": "Conduite et pilotage des politiques de l'écologie, du développement et de la mobilité durables",
            "id": "57709",
            "AE": {
              "montantPositif": "2962988288",
              "montantNegatif": "0"
            },
            "CP": {
              "montantPositif": "3000490434",
              "montantNegatif": "0"
            },
            "action": "modification",
            "lignesCredits": {
              "ligneCredit": {
                "id": "2315",
                "libelle": "Dont titre 2",
                "AE": {
                  "montantPositif": "2766032479",
                  "montantNegatif": "0"
                },
                "CP": {
                  "montantPositif": "2766032479",
                  "montantNegatif": "0"
                }
              }
            }
          },
          {
            "libelle": "Économie sociale et solidaire",
            "id": "57710",
            "AE": {
              "montantPositif": "18394587",
              "montantNegatif": "0"
            },
            "CP": {
              "montantPositif": "18394587",
              "montantNegatif": "0"
            },
            "action": "modification",
            "lignesCredits": null
          }
        ]
      },
      "totalAE": {
        "montantPositif": "11582739882",
        "montantNegatif": "0",
        "solde": "11582739882"
      },
      "totalCP": {
        "montantPositif": "11469690675",
        "montantNegatif": "0",
        "solde": "11469690675"
      }
    }
  },
  "representations": {
    "representation": {
      "nom": "PDF",
      "typeMime": {
        "type": "application",
        "subType": "PDF"
      },
      "statutRepresentation": {
        "verbatim": "true",
        "canonique": "true",
        "officielle": "true",
        "transcription": "false",
        "enregistrement": "false"
      },
      "repSource": {
        "@xmlns:xsi": "http://www.w3.org/2001/XMLSchema-instance",
        "@xsi:nil": "true"
      },
      "offset": {
        "@xmlns:xsi": "http://www.w3.org/2001/XMLSchema-instance",
        "@xsi:nil": "true"
      },
      "contenu": {
        "documentURI": "/15/amendements/1490/CION_FIN/CF696.pdf"
      },
      "dateDispoRepresentation": {
        "@xmlns:xsi": "http://www.w3.org/2001/XMLSchema-instance",
        "@xsi:nil": "true"
      }
    }
  },
  "seanceDiscussion": {
    "@xmlns:xsi": "http://www.w3.org/2001/XMLSchema-instance",
    "@xsi:nil": "true"
  },
  "sort": {
    "@xmlns:xsi": "http://www.w3.org/2001/XMLSchema-instance",
    "@xsi:nil": "true"
  },
  "dateDepot": "2018-12-17T01:00:00.000+01:00",
  "dateDistribution": "2018-12-17T01:00:00.000+01:00",
  "article99": "0",
  "loiReference": {
    "codeLoi": {
      "@xmlns:xsi": "http://www.w3.org/2001/XMLSchema-instance",
      "@xsi:nil": "true"
    },
    "divisionCodeLoi": {
      "@xmlns:xsi": "http://www.w3.org/2001/XMLSchema-instance",
      "@xsi:nil": "true"
    }
  }
}