{
  "@xmlns": "http://schemas.assemblee-nationale.fr/referentiel",
  "uid": "AMANR5L15SEA717460BTC1082P0D1N19",
  "identifiant": {
    "legislature": "15",
    "numero": "19",
    "numRect": "0",
    "saisine": {
      "refTexteLegislatif": "PIONANR5L15BTC1082",
      "numeroPartiePLF": "0",
      "organeExamen": "PO717460",
      "mentionSecondeDeliberation": "0"
    }
  },
  "numeroLong": "19",
  "etapeTexte": "Nouvelle Lecture",
  "triAmendement": "u",
  "cardinaliteAmdtMultiples": "1",
  "amendementParent": {
    "@xmlns:xsi": "http://www.w3.org/2001/XMLSchema-instance",
    "@xsi:nil": "true"
  },
  "etat": "Discuté",
  "signataires": {
    "auteur": {
      "typeAuteur": "Depute",
      "acteurRef": "PA718838",
      "organeRef": {
        "@xmlns:xsi": "http://www.w3.org/2001/XMLSchema-instance",
        "@xsi:nil": "true"
      },
      "groupePolitiqueRef": "PO730934"
    },
    "cosignataires": {
      "acteurRef": [
        "PA643103",
        "PA642847",
        "PA1695",
        "PA267440",
        "PA721636",
        "PA267378",
        "PA608016",
        "PA856",
        "PA1874",
        "PA998",
        "PA334843",
        "PA720210",
        "PA223837",
        "PA2377",
        "PA2960",
        "PA719946",
        "PA721474",
        "PA340853",
        "PA609726",
        "PA267260",
        "PA266776",
        "PA266808",
        "PA267204",
        "PA721126",
        "PA721410",
        "PA720644",
        "PA330788",
        "PA720386",
        "PA721678",
        "PA334654",
        "PA721816",
        "PA267785",
        "PA721314",
        "PA267450",
        "PA721046",
        "PA718884",
        "PA721286",
        "PA267318",
        "PA643134",
        "PA330240",
        "PA606712",
        "PA719318",
        "PA720630",
        "PA721054",
        "PA334149",
        "PA746",
        "PA605991",
        "PA267901",
        "PA267429",
        "PA923",
        "PA609245",
        "PA1630",
        "PA718784",
        "PA767",
        "PA330684",
        "PA2155",
        "PA2796",
        "PA712015",
        "PA1029",
        "PA346218",
        "PA748954",
        "PA267200",
        "PA709315",
        "PA721506",
        "PA2492",
        "PA606098",
        "PA267289",
        "PA267324",
        "PA330909",
        "PA721070",
        "PA2529",
        "PA608826",
        "PA267735",
        "PA720586",
        "PA1012",
        "PA713448",
        "PA332523",
        "PA720100",
        "PA718850",
        "PA720684",
        "PA718838",
        "PA346054",
        "PA608416",
        "PA721968",
        "PA1498",
        "PA718780",
        "PA342935",
        "PA2086",
        "PA719272",
        "PA330008",
        "PA605036",
        "PA722390",
        "PA1327",
        "PA345722",
        "PA267527",
        "PA266774",
        "PA336316",
        "PA267794",
        "PA266793",
        "PA266797"
      ]
    },
    "texteAffichable": "M.&#160;Brun,  M.&#160;Jacob, M.&#160;Abad, Mme&#160;Anthoine, M.&#160;Aubert, Mme&#160;Bassire, M.&#160;Bazin, Mme&#160;Bazin-Malgras, Mme&#160;Beauvais, Mme&#160;Bonnivard, M.&#160;Bony, M.&#160;Boucard, M.&#160;Bouchet, Mme&#160;Val&#233;rie&#160;Boyer, Mme&#160;Brenier, M.&#160;Breton, M.&#160;Brochand, M.&#160;Carrez, M.&#160;Cattin, M.&#160;Cherpion, M.&#160;Cinieri, M.&#160;Ciotti, M.&#160;Cordier, Mme&#160;Corneloup, M.&#160;Cornut-Gentille, Mme&#160;Dalloz, M.&#160;Dassault, M.&#160;de Ganay, M.&#160;de la Verpilli&#232;re, M.&#160;Deflesselles, M.&#160;R&#233;mi&#160;Delatte, M.&#160;Descoeur, M.&#160;Di Filippo, M.&#160;Diard, M.&#160;Dive, M.&#160;Door, Mme&#160;Marianne&#160;Dubois, Mme&#160;Duby-Muller, M.&#160;Pierre-Henri&#160;Dumont, M.&#160;Fasquelle, M.&#160;Ferrara, M.&#160;Forissier, M.&#160;Furst, M.&#160;Gaultier, Mme&#160;Genevard, M.&#160;Goasguen, M.&#160;Gosselin, M.&#160;Grelier, Mme&#160;Guion-Firmin, M.&#160;Herbillon, M.&#160;Hetzel, M.&#160;Huyghe, M.&#160;Kamardine, Mme&#160;Kuster, Mme&#160;Lacroute, M.&#160;Larriv&#233;, M.&#160;Le Fur, Mme&#160;Le Grip, M.&#160;Leclerc, Mme&#160;Levy, M.&#160;Lorion, Mme&#160;Louwagie, M.&#160;Lurton, M.&#160;Emmanuel&#160;Maquet, M.&#160;Marleix, M.&#160;Marlin, M.&#160;Masson, M.&#160;Menuel, Mme&#160;Meunier, M.&#160;Minot, M.&#160;Nury, M.&#160;Parigi, M.&#160;Pauget, M.&#160;Peltier, M.&#160;Perrut, Mme&#160;Poletti, M.&#160;Pradi&#233;, M.&#160;Quentin, M.&#160;Ramadier, Mme&#160;Ramassamy, M.&#160;Reda, M.&#160;Reiss, M.&#160;Reitzer, M.&#160;Reyn&#232;s, M.&#160;Rolland, M.&#160;Saddier, M.&#160;Savignat, M.&#160;Schellenberger, M.&#160;Sermier, M.&#160;Straumann, Mme&#160;Tabarot, M.&#160;Teissier, Mme&#160;Trastour-Isnart, Mme&#160;Valentin, M.&#160;Vatin, M.&#160;Verch&#232;re, M.&#160;Viala, M.&#160;Vialay, M.&#160;Viry et M.&#160;Woerth"
  },
  "pointeurFragmentTexte": {
    "missionVisee": {
      "@xmlns:xsi": "http://www.w3.org/2001/XMLSchema-instance",
      "@xsi:nil": "true"
    },
    "division": {
      "titre": "Article 1er quater",
      "articleDesignationCourte": "ART. 1ER QUATER",
      "type": "ARTICLE",
      "avant_A_Apres": "A",
      "divisionRattachee": "ARTICLE 1ER QUATER",
      "articleAdditionnel": {
        "@xmlns:xsi": "http://www.w3.org/2001/XMLSchema-instance",
        "@xsi:nil": "true"
      },
      "chapitreAdditionnel": {
        "@xmlns:xsi": "http://www.w3.org/2001/XMLSchema-instance",
        "@xsi:nil": "true"
      },
      "urlDivisionTexteVise": "/15/textes/1082.asp#D_6322"
    },
    "alinea": {
      "@xmlns:xsi": "http://www.w3.org/2001/XMLSchema-instance",
      "@xsi:nil": "true"
    }
  },
  "corps": {
    "dispositif": "<p style=\"text-align: justify;\">R&#233;tablir cet article dans sa r&#233;daction suivante&#160;:</p><p style=\"text-align: justify;\">&#171;&#160;Au huiti&#232;me alin&#233;a de l&#8217;article&#160;L.&#160;2224&#8209;2 du code g&#233;n&#233;ral des collectivit&#233;s territoriales, les deux occurrences du nombre&#160;: &#171;&#160;3&#160;000&#160;&#187;&#160;sont remplac&#233;es par le nombre&#160;: &#171;&#160;5&#160;000&#160;&#187;.&#160;&#187;<br /><br /></p>",
    "exposeSommaire": "<p style=\"text-align: justify;\">Cet amendement reprend l&#8217;article&#160;2 de la proposition de loi&#160;pour le maintien des comp&#233;tences &#171;&#160;eau&#160;&#187; et &#171;&#160;assainissement&#160;&#187; dans les comp&#233;tences optionnelles des communaut&#233;s de communes et des communaut&#233;s d&#8217;agglom&#233;ration tel qu&#8217;adopt&#233; par le S&#233;nat,&#160;le 23 f&#233;vrier 2017.</p><p style=\"text-align: justify;\">L&#8217;article&#160;2 relevait le plafond sous lequel les missions &#171;&#160;eau&#160;&#187; et &#171;&#160;assainissement&#160;&#187; peuvent &#234;tre financ&#233;es par le budget g&#233;n&#233;ral de la commune, constituant une exception au principe d&#8217;&#233;quilibre des services publics industriels et commerciaux. Cette exception concerne actuellement les communes de moins de 3.000 habitants ou les EPCI dont aucune commune ne compte plus de 3.000 habitants. L&#8217;objet du pr&#233;sent amendement consiste &#224; relever ces plafonds &#224; 5.000 habitants.</p>",
    "annexeExposeSommaire": {
      "@xmlns:xsi": "http://www.w3.org/2001/XMLSchema-instance",
      "@xsi:nil": "true"
    }
  },
  "representations": {
    "representation": {
      "nom": "PDF",
      "typeMime": {
        "type": "application",
        "subType": "PDF"
      },
      "statutRepresentation": {
        "verbatim": "true",
        "canonique": "true",
        "officielle": "true",
        "transcription": "false",
        "enregistrement": "false"
      },
      "repSource": {
        "@xmlns:xsi": "http://www.w3.org/2001/XMLSchema-instance",
        "@xsi:nil": "true"
      },
      "offset": {
        "@xmlns:xsi": "http://www.w3.org/2001/XMLSchema-instance",
        "@xsi:nil": "true"
      },
      "contenu": {
        "documentURI": "/15/amendements/1082/AN/19.pdf"
      },
      "dateDispoRepresentation": {
        "@xmlns:xsi": "http://www.w3.org/2001/XMLSchema-instance",
        "@xsi:nil": "true"
      }
    }
  },
  "seanceDiscussion": "RUANR5L15S2018IDS21157",
  "sort": {
    "dateSaisie": "2018-07-06T00:02:19.000+02:00",
    "sortEnSeance": "Rejeté"
  },
  "dateDepot": "2018-06-19T02:00:00.000+02:00",
  "dateDistribution": "2018-06-28T02:00:00.000+02:00",
  "article99": "0",
  "loiReference": {
    "codeLoi": {
      "@xmlns:xsi": "http://www.w3.org/2001/XMLSchema-instance",
      "@xsi:nil": "true"
    },
    "divisionCodeLoi": {
      "@xmlns:xsi": "http://www.w3.org/2001/XMLSchema-instance",
      "@xsi:nil": "true"
    }
  }
}