{
  "@xmlns": "http://schemas.assemblee-nationale.fr/referentiel",
  "uid": "AMANR5L15SEA717460BTC1548P0D1N265",
  "identifiant": {
    "legislature": "15",
    "numero": "265",
    "numRect": "0",
    "saisine": {
      "refTexteLegislatif": "PRJLANR5L15BTC1548",
      "numeroPartiePLF": "0",
      "organeExamen": "PO717460",
      "mentionSecondeDeliberation": "0"
    }
  },
  "numeroLong": "265",
  "etapeTexte": "Nouvelle Lecture",
  "triAmendement": "ejaaaaaaaaaaaaaaaaaaaaaaaaaaaaaaaaaaaaaaaaaaaaaaaaam",
  "cardinaliteAmdtMultiples": "1",
  "amendementParent": {
    "@xmlns:xsi": "http://www.w3.org/2001/XMLSchema-instance",
    "@xsi:nil": "true"
  },
  "etat": "Discuté",
  "signataires": {
    "auteur": {
      "typeAuteur": "Depute",
      "acteurRef": "PA608695",
      "organeRef": {
        "@xmlns:xsi": "http://www.w3.org/2001/XMLSchema-instance",
        "@xsi:nil": "true"
      },
      "groupePolitiqueRef": "PO758835"
    },
    "cosignataires": {
      "acteurRef": [
        "PA335532",
        "PA1592",
        "PA608695",
        "PA340343",
        "PA333285",
        "PA1008",
        "PA337483",
        "PA720988",
        "PA719930",
        "PA267233",
        "PA642764",
        "PA342415",
        "PA333818",
        "PA609590",
        "PA608741",
        "PA609332",
        "PA340357",
        "PA608172",
        "PA335054",
        "PA508",
        "PA332614",
        "PA1809",
        "PA608011",
        "PA610681",
        "PA607553",
        "PA605069",
        "PA429893",
        "PA643145",
        "PA1198"
      ]
    },
    "texteAffichable": "Mme&#160;Untermaier,  Mme&#160;Karamanli, M.&#160;David&#160;Habib, M.&#160;Saulignac, M.&#160;Aviragnet, Mme&#160;Bareigts, Mme&#160;Battistel, Mme&#160;Bi&#233;mouret, M.&#160;Bouillon, M.&#160;Jean-Louis&#160;Bricout, M.&#160;Carvounas, M.&#160;Alain&#160;David, Mme&#160;Laurence&#160;Dumont, M.&#160;Faure, M.&#160;Garot, M.&#160;Hutin, M.&#160;Juanico, M.&#160;J&#233;r&#244;me&#160;Lambert, M.&#160;Letchimy, Mme&#160;Manin, Mme&#160;Pau-Langevin, Mme&#160;Pires Beaune, M.&#160;Potier, M.&#160;Pueyo, Mme&#160;Rabault, Mme&#160;Tolmont, Mme&#160;Vainqueur-Christophe, M.&#160;Vallaud, Mme&#160;Victory et les membres du groupe Socialistes et apparent&#233;s"
  },
  "pointeurFragmentTexte": {
    "missionVisee": {
      "@xmlns:xsi": "http://www.w3.org/2001/XMLSchema-instance",
      "@xsi:nil": "true"
    },
    "division": {
      "titre": "Article 37",
      "articleDesignationCourte": "ART. 37",
      "type": "ARTICLE",
      "avant_A_Apres": "A",
      "divisionRattachee": "ARTICLE 37",
      "articleAdditionnel": {
        "@xmlns:xsi": "http://www.w3.org/2001/XMLSchema-instance",
        "@xsi:nil": "true"
      },
      "chapitreAdditionnel": {
        "@xmlns:xsi": "http://www.w3.org/2001/XMLSchema-instance",
        "@xsi:nil": "true"
      },
      "urlDivisionTexteVise": "/15/textes/1548.asp#D_Article_37"
    },
    "alinea": {
      "avant_A_Apres": "A",
      "numero": "5",
      "alineaDesignation": "Alinéa 5"
    }
  },
  "corps": {
    "dispositif": "<p style=\"text-align: justify;\">I. &#8211; &#192; la premi&#232;re phrase de l&#8217;alin&#233;a&#160;5, substituer au montant&#160;:</p><p style=\"text-align: justify;\">&#171;&#160;300&#160;&#8364;&#160;&#187;,</p><p style=\"text-align: justify;\">le montant&#160;: </p><p style=\"text-align: justify;\">&#171;&#160;135&#160;&#8364;&#160;&#187;.</p><p style=\"text-align: justify;\">II. &#8211; En cons&#233;quence, &#224; la seconde phrase du m&#234;me alin&#233;a, substituer au montant&#160;:</p><p style=\"text-align: justify;\">&#171;&#160;250&#160;&#8364;&#160;&#187;,</p><p style=\"text-align: justify;\">le montant&#160;:</p><p style=\"text-align: justify;\">&#171;&#160;90&#160;&#8364;&#160;&#187;.</p><p style=\"text-align: justify;\">III. &#8211; En cons&#233;quence, &#224; la fin de la m&#234;me phrase du m&#234;me alin&#233;a, substituer au montant&#160;:</p><p style=\"text-align: justify;\">&#171;&#160;600&#160;&#8364;&#160;&#187;,</p><p style=\"text-align: justify;\">le montant&#160;:</p><p style=\"text-align: justify;\">&#171;&#160;375&#160;&#8364;&#160;&#187;.</p>",
    "exposeSommaire": "<p style=\"text-align: justify;\">En cas d&#8217;usage de stup&#233;fiants, le Gouvernement souhaite mettre en place une amende forfaitaire d&#8217;un montant de 200&#160;&#8364; (ou de 150&#160;&#8364; pour l&#8217;amende minor&#233;e). Au regard de l&#8217;importance de ces montants, la question de l&#8217;effectivit&#233; de la sanction, d&#233;ficiente dans le syst&#232;me actuel, continuera de se poser&#160;: le taux de recouvrement des amendes prononc&#233;es par la justice d&#233;passe aujourd&#8217;hui &#224; peine les 40&#160;%.</p><p style=\"text-align: justify;\">Cet amendement vise donc &#224; proposer la mise en place d&#8217;une amende forfaitaire d&#8217;un montant de 135&#160;&#8364;, de 90&#160;&#8364; en cas de minoration, et de 375&#160;&#8364; en cas de majoration, sur le mod&#232;le de l&#8217;amende de quatri&#232;me classe.</p>",
    "annexeExposeSommaire": {
      "@xmlns:xsi": "http://www.w3.org/2001/XMLSchema-instance",
      "@xsi:nil": "true"
    },
    "cartoucheDelaiDepotDepasse": {
      "@xmlns:xsi": "http://www.w3.org/2001/XMLSchema-instance",
      "@xsi:nil": "true"
    }
  },
  "representations": {
    "representation": {
      "nom": "PDF",
      "typeMime": {
        "type": "application",
        "subType": "PDF"
      },
      "statutRepresentation": {
        "verbatim": "true",
        "canonique": "true",
        "officielle": "true",
        "transcription": "false",
        "enregistrement": "false"
      },
      "repSource": {
        "@xmlns:xsi": "http://www.w3.org/2001/XMLSchema-instance",
        "@xsi:nil": "true"
      },
      "offset": {
        "@xmlns:xsi": "http://www.w3.org/2001/XMLSchema-instance",
        "@xsi:nil": "true"
      },
      "contenu": {
        "documentURI": "/15/amendements/1548/AN/265.pdf"
      },
      "dateDispoRepresentation": {
        "@xmlns:xsi": "http://www.w3.org/2001/XMLSchema-instance",
        "@xsi:nil": "true"
      }
    }
  },
  "seanceDiscussion": "RUANR5L15S2019IDS21451",
  "sort": {
    "dateSaisie": "2019-01-17T19:06:57.000+01:00",
    "sortEnSeance": "Rejeté"
  },
  "dateDepot": "2019-01-09T01:00:00.000+01:00",
  "dateDistribution": "2019-01-14T01:00:00.000+01:00",
  "article99": "0",
  "loiReference": {
    "codeLoi": {
      "@xmlns:xsi": "http://www.w3.org/2001/XMLSchema-instance",
      "@xsi:nil": "true"
    },
    "divisionCodeLoi": {
      "@xmlns:xsi": "http://www.w3.org/2001/XMLSchema-instance",
      "@xsi:nil": "true"
    }
  }
}