{
  "@xmlns": "http://schemas.assemblee-nationale.fr/referentiel",
  "uid": "AMANR5L15SEA717460BTC1237P0D1N2153",
  "identifiant": {
    "legislature": "15",
    "numero": "2153",
    "numRect": "0",
    "saisine": {
      "refTexteLegislatif": "PRJLANR5L15BTC1237",
      "numeroPartiePLF": "0",
      "organeExamen": "PO717460",
      "mentionSecondeDeliberation": "1"
    }
  },
  "numeroLong": "2153",
  "etapeTexte": "1ère lecture (1ère assemblée saisie)",
  "triAmendement": "oeaaaaaaaaaaaaaaaaaaaaaaaaaaaaaaaaaaaaaaaaaaaaaaaagbk",
  "cardinaliteAmdtMultiples": "1",
  "amendementParent": {
    "@xmlns:xsi": "http://www.w3.org/2001/XMLSchema-instance",
    "@xsi:nil": "true"
  },
  "etat": "Discuté",
  "signataires": {
    "auteur": {
      "typeAuteur": "Depute",
      "acteurRef": "PA721916",
      "organeRef": {
        "@xmlns:xsi": "http://www.w3.org/2001/XMLSchema-instance",
        "@xsi:nil": "true"
      },
      "groupePolitiqueRef": "PO730964"
    },
    "cosignataires": {
      "acteurRef": "PA721916"
    },
    "texteAffichable": "Mme&#160;Pouzyreff"
  },
  "pointeurFragmentTexte": {
    "missionVisee": {
      "@xmlns:xsi": "http://www.w3.org/2001/XMLSchema-instance",
      "@xsi:nil": "true"
    },
    "division": {
      "titre": "Article 62",
      "articleDesignationCourte": "ART. 62",
      "type": "ARTICLE",
      "avant_A_Apres": "A",
      "divisionRattachee": "ARTICLE 62",
      "articleAdditionnel": {
        "@xmlns:xsi": "http://www.w3.org/2001/XMLSchema-instance",
        "@xsi:nil": "true"
      },
      "chapitreAdditionnel": {
        "@xmlns:xsi": "http://www.w3.org/2001/XMLSchema-instance",
        "@xsi:nil": "true"
      },
      "urlDivisionTexteVise": "/15/textes/1237.asp#D_Article_62"
    },
    "alinea": {
      "avant_A_Apres": "Apres",
      "numero": "2",
      "alineaDesignation": {
        "@xmlns:xsi": "http://www.w3.org/2001/XMLSchema-instance",
        "@xsi:nil": "true"
      }
    }
  },
  "corps": {
    "dispositif": "<p style=\"text-align: justify;\">I.&#160;&#8211;&#160;Apr&#232;s l&#8217;alin&#233;a&#160;2, ins&#233;rer les deux alin&#233;as suivants&#160;:</p><p style=\"text-align: justify;\">&#171;&#160;1&#176; B Apr&#232;s le quatri&#232;me alin&#233;a de l&#8217;article L.&#160;225&#8209;23 du code de commerce, il est ins&#233;r&#233; un alin&#233;a ainsi r&#233;dig&#233;&#160;:</p><p style=\"text-align: justify;\">&#171;&#160;Le seuil de 3&#160;% mentionn&#233; au premier alin&#233;a est ramen&#233; &#224; 1&#160;% lorsque au moins un administrateur repr&#233;sentant les salari&#233;s est d&#233;sign&#233; en application de l&#8217;article L.&#160;225&#8209;27&#8209;1.&#160;&#187;</p><p style=\"text-align: justify;\">II.&#160;&#8211;&#160;En cons&#233;quence, apr&#232;s l'alin&#233;a 8, ins&#233;rer les deux alin&#233;as suivants&#160;:</p><p style=\"text-align: justify;\">&#171;&#160;1&#176;&#160;<i>bis</i> Apr&#232;s le quatri&#232;me alin&#233;a de l&#8217;article L.&#160;225&#8209;71 du m&#234;me code, il est ins&#233;r&#233; un alin&#233;a ainsi r&#233;dig&#233;&#160;:</p><p style=\"text-align: justify;\">&#171;&#160;Le seuil de 3&#160;% mentionn&#233; au premier alin&#233;a est ramen&#233; &#224; 1&#160;% lorsque au moins un membre du conseil de surveillance repr&#233;sentant les salari&#233;s est d&#233;sign&#233; en application de l&#8217;article L.&#160;225&#8209;79&#8209;2.&#160;&#187;</p>",
    "exposeSommaire": "<p style=\"text-align: justify;\">Cet amendement vise &#224; renforcer la confiance dans la repr&#233;sentation des actionnaires salari&#233;s au niveau des organes de gouvernance alors que la loi vise au d&#233;veloppement de l&#8217;actionnariat salari&#233; au sein des entreprises.</p><p style=\"text-align: justify;\">Cette disposition d&#8217;abaissement du seuil de 3&#160;% &#224; 1&#160;% d&#233;clenchant la pr&#233;sence d&#8217;un repr&#233;sentant des salari&#233;s actionnaires dans les organes de gouvernance ne s&#8217;appliquerait que dans les soci&#233;t&#233;s qui emploient &#224; la cl&#244;ture de deux exercices cons&#233;cutifs au moins mille salari&#233;s permanents dans la soci&#233;t&#233; et ses filiales, directes ou indirectes, dont le si&#232;ge social est fix&#233; sur le territoire fran&#231;ais, ou au moins cinq mille salari&#233;s permanents dans la soci&#233;t&#233; et ses filiales, directes ou indirectes, dont le si&#232;ge social est fix&#233; sur le territoire fran&#231;ais et &#224; l&#8217;&#233;tranger.</p>",
    "annexeExposeSommaire": {
      "@xmlns:xsi": "http://www.w3.org/2001/XMLSchema-instance",
      "@xsi:nil": "true"
    }
  },
  "representations": {
    "representation": {
      "nom": "PDF",
      "typeMime": {
        "type": "application",
        "subType": "PDF"
      },
      "statutRepresentation": {
        "verbatim": "true",
        "canonique": "true",
        "officielle": "true",
        "transcription": "false",
        "enregistrement": "false"
      },
      "repSource": {
        "@xmlns:xsi": "http://www.w3.org/2001/XMLSchema-instance",
        "@xsi:nil": "true"
      },
      "offset": {
        "@xmlns:xsi": "http://www.w3.org/2001/XMLSchema-instance",
        "@xsi:nil": "true"
      },
      "contenu": {
        "documentURI": "/15/amendements/1237/AN/2153.pdf"
      },
      "dateDispoRepresentation": {
        "@xmlns:xsi": "http://www.w3.org/2001/XMLSchema-instance",
        "@xsi:nil": "true"
      }
    }
  },
  "seanceDiscussion": "RUANR5L15S2019IDS21349",
  "sort": {
    "dateSaisie": "2018-10-05T12:19:43.000+02:00",
    "sortEnSeance": "Retiré"
  },
  "dateDepot": "2018-09-21T02:00:00.000+02:00",
  "dateDistribution": "2018-09-26T02:00:00.000+02:00",
  "article99": "0",
  "loiReference": {
    "codeLoi": "c commerce",
    "divisionCodeLoi": "L225-23"
  }
}