{
  "@xmlns": "http://schemas.assemblee-nationale.fr/referentiel",
  "uid": "AMANR5L15PO59048B0485P0D1N243",
  "identifiant": {
    "legislature": "15",
    "numero": "243",
    "numRect": "0",
    "saisine": {
      "refTexteLegislatif": "PRJLANR5L15B0485",
      "numeroPartiePLF": "0",
      "organeExamen": "PO59048",
      "mentionSecondeDeliberation": "0"
    }
  },
  "numeroLong": "CF243",
  "etapeTexte": "Nouvelle Lecture",
  "triAmendement": "ad",
  "cardinaliteAmdtMultiples": "1",
  "amendementParent": {
    "@xmlns:xsi": "http://www.w3.org/2001/XMLSchema-instance",
    "@xsi:nil": "true"
  },
  "etat": "Discuté",
  "signataires": {
    "auteur": {
      "typeAuteur": "Depute",
      "acteurRef": "PA267336",
      "organeRef": {
        "@xmlns:xsi": "http://www.w3.org/2001/XMLSchema-instance",
        "@xsi:nil": "true"
      },
      "groupePolitiqueRef": "PO730964"
    },
    "cosignataires": {
      "acteurRef": [
        "PA719472",
        "PA267336",
        "PA719060"
      ]
    },
    "texteAffichable": "M.&#160;Giraud, rapporteur g&#233;n&#233;ral,  M.&#160;Cazeneuve et M.&#160;Jerretie"
  },
  "pointeurFragmentTexte": {
    "missionVisee": {
      "@xmlns:xsi": "http://www.w3.org/2001/XMLSchema-instance",
      "@xsi:nil": "true"
    },
    "division": {
      "titre": "Article 60",
      "articleDesignationCourte": "ART. 60",
      "type": "ARTICLE",
      "avant_A_Apres": "A",
      "divisionRattachee": "ARTICLE 60",
      "articleAdditionnel": {
        "@xmlns:xsi": "http://www.w3.org/2001/XMLSchema-instance",
        "@xsi:nil": "true"
      },
      "chapitreAdditionnel": {
        "@xmlns:xsi": "http://www.w3.org/2001/XMLSchema-instance",
        "@xsi:nil": "true"
      },
      "urlDivisionTexteVise": "/15/textes/0485.asp#D_Article_60"
    },
    "alinea": {
      "avant_A_Apres": {
        "@xmlns:xsi": "http://www.w3.org/2001/XMLSchema-instance",
        "@xsi:nil": "true"
      },
      "numero": "14",
      "alineaDesignation": {
        "@xmlns:xsi": "http://www.w3.org/2001/XMLSchema-instance",
        "@xsi:nil": "true"
      }
    }
  },
  "corps": {
    "dispositif": "<p style=\"text-align: justify;\">Substituer &#224; l&#8217;alin&#233;a&#160;14 les deux alin&#233;as suivants&#160;:</p><p style=\"text-align: justify;\">&#171;&#160;<i>a)</i> Le deuxi&#232;me alin&#233;a est ainsi r&#233;dig&#233;&#160;:&#160;</p><p style=\"text-align: justify;\">&#171;&#160;Toutefois, les communes nouvelles dont l&#8217;arr&#234;t&#233; de cr&#233;ation a &#233;t&#233; pris entre le 2 janvier 2017 et le 1<sup>er</sup> janvier 2019 en application de d&#233;lib&#233;rations concordantes des conseils municipaux et regroupant une population inf&#233;rieure ou &#233;gale &#224; 15 000 habitants per&#231;oivent au cours des trois ann&#233;es suivant le 1er janvier de l&#8217;ann&#233;e de leur cr&#233;ation une attribution au titre de la dotation de solidarit&#233; rurale au moins &#233;gale &#224; la somme des attributions per&#231;ues au titre de chacune des trois fractions de la dotation de solidarit&#233; rurale par les anciennes communes l&#8217;ann&#233;e pr&#233;c&#233;dant la cr&#233;ation de la commune nouvelle.&#160;&#187;&#160;;</p>",
    "exposeSommaire": "<p style=\"text-align: justify;\">Le rapporteur g&#233;n&#233;ral propose de modifier le texte adopt&#233; par le S&#233;nat en supprimant la modification apport&#233;e aux modalit&#233;s de la garantie accord&#233;es aux communes nouvelles en ce qui concerne la DSR.</p>",
    "annexeExposeSommaire": {
      "@xmlns:xsi": "http://www.w3.org/2001/XMLSchema-instance",
      "@xsi:nil": "true"
    }
  },
  "representations": {
    "representation": {
      "nom": "PDF",
      "typeMime": {
        "type": "application",
        "subType": "PDF"
      },
      "statutRepresentation": {
        "verbatim": "true",
        "canonique": "true",
        "officielle": "true",
        "transcription": "false",
        "enregistrement": "false"
      },
      "repSource": {
        "@xmlns:xsi": "http://www.w3.org/2001/XMLSchema-instance",
        "@xsi:nil": "true"
      },
      "offset": {
        "@xmlns:xsi": "http://www.w3.org/2001/XMLSchema-instance",
        "@xsi:nil": "true"
      },
      "contenu": {
        "documentURI": "/15/amendements/0485/CION_FIN/CF243.pdf"
      },
      "dateDispoRepresentation": {
        "@xmlns:xsi": "http://www.w3.org/2001/XMLSchema-instance",
        "@xsi:nil": "true"
      }
    }
  },
  "seanceDiscussion": {
    "@xmlns:xsi": "http://www.w3.org/2001/XMLSchema-instance",
    "@xsi:nil": "true"
  },
  "sort": {
    "dateSaisie": "2017-12-14T11:50:27.000+01:00",
    "sortEnSeance": "Adopté"
  },
  "dateDepot": "2017-12-13T01:00:00.000+01:00",
  "dateDistribution": "2017-12-14T01:00:00.000+01:00",
  "article99": "0",
  "loiReference": {
    "codeLoi": {
      "@xmlns:xsi": "http://www.w3.org/2001/XMLSchema-instance",
      "@xsi:nil": "true"
    },
    "divisionCodeLoi": {
      "@xmlns:xsi": "http://www.w3.org/2001/XMLSchema-instance",
      "@xsi:nil": "true"
    }
  }
}