{
  "@xmlns": "http://schemas.assemblee-nationale.fr/referentiel",
  "uid": "AMANR5L15SEA717460BTC2283P0D1N170",
  "identifiant": {
    "legislature": "15",
    "numero": "170",
    "numRect": "0",
    "saisine": {
      "refTexteLegislatif": "PIONANR5L15BTC2283",
      "numeroPartiePLF": "0",
      "organeExamen": "PO717460",
      "mentionSecondeDeliberation": "0"
    }
  },
  "numeroLong": "170",
  "etapeTexte": "1ère lecture (1ère assemblée saisie)",
  "triAmendement": "akaaaaaaaaaaaaaaaaaaaaaaaaaaaaaaaaaaaaaaaaaaaaaaaat",
  "cardinaliteAmdtMultiples": "1",
  "amendementParent": "AMANR5L15SEA717460BTC2283P0D1N115",
  "etat": "Discuté",
  "signataires": {
    "auteur": {
      "typeAuteur": "Depute",
      "acteurRef": "PA721234",
      "organeRef": {
        "@xmlns:xsi": "http://www.w3.org/2001/XMLSchema-instance",
        "@xsi:nil": "true"
      },
      "groupePolitiqueRef": "PO730970"
    },
    "cosignataires": {
      "acteurRef": "PA721234"
    },
    "texteAffichable": "Mme&#160;Maud&#160;Petit"
  },
  "pointeurFragmentTexte": {
    "missionVisee": {
      "@xmlns:xsi": "http://www.w3.org/2001/XMLSchema-instance",
      "@xsi:nil": "true"
    },
    "division": {
      "titre": "Article PREMIER",
      "articleDesignationCourte": "APRÈS ART. PREMIER",
      "type": "ARTICLE",
      "avant_A_Apres": "Après",
      "divisionRattachee": "APRÈS L'ARTICLE PREMIER, insérer l'article suivant:",
      "articleAdditionnel": "1",
      "chapitreAdditionnel": {
        "@xmlns:xsi": "http://www.w3.org/2001/XMLSchema-instance",
        "@xsi:nil": "true"
      },
      "urlDivisionTexteVise": "/15/textes/2283.asp#D_Article_1er"
    },
    "alinea": {
      "@xmlns:xsi": "http://www.w3.org/2001/XMLSchema-instance",
      "@xsi:nil": "true"
    }
  },
  "corps": {
    "dispositif": "<p style=\"text-align: justify;\">I.&#160;&#8211;&#160;&#192; l&#8217;alin&#233;a&#160;2, substituer au&#160;mot&#160;:&#160;</p><p style=\"text-align: justify;\">&#171;&#160;conjugales&#160;&#187;</p><p style=\"text-align: justify;\">le mot&#160;:</p><p style=\"text-align: justify;\">&#171;&#160;intrafamiliales&#160;&#187;.</p><p style=\"text-align: justify;\">II.&#160;&#8211;&#160;En cons&#233;quence, proc&#233;der &#224; la m&#234;me substitution &#224; l&#8217;alin&#233;a&#160;3.</p>",
    "exposeSommaire": "<p style=\"text-align: justify;\">Ce sous-amendement a pour objectif de renommer la cr&#233;ation des r&#233;f&#233;rents violences conjugales, propos&#233; dans l'amendement de mes coll&#232;gues, en \"r&#233;f&#233;rents violences intrafamiliales\".&#160;</p><p>En effet, il est important de rappeler que dans la majorit&#233; des cas, les violences conjugales affectent aussi&#160;la famille du couple, notamment leurs enfants, qui subissent les cons&#233;quences directes de ces violences ; ils en sont les t&#233;moins et en subissent parfois &#233;galement. Cet aspect doit absolument &#234;tre pris en compte dans le r&#244;le des&#160;juridictions&#160;qui sont charg&#233;es de ces affaires. Le terme \"intrafamilial\" semble donc ici plus ad&#233;quat &#224; la r&#233;alit&#233; de la situation et des d&#233;cisions&#160;qui en d&#233;couleront pour les&#160;juridictions.</p>",
    "annexeExposeSommaire": {
      "@xmlns:xsi": "http://www.w3.org/2001/XMLSchema-instance",
      "@xsi:nil": "true"
    },
    "cartoucheDelaiDepotDepasse": {
      "@xmlns:xsi": "http://www.w3.org/2001/XMLSchema-instance",
      "@xsi:nil": "true"
    },
    "avantAppel": {
      "@xmlns:xsi": "http://www.w3.org/2001/XMLSchema-instance",
      "@xsi:nil": "true"
    }
  },
  "representations": {
    "representation": {
      "nom": "PDF",
      "typeMime": {
        "type": "application",
        "subType": "PDF"
      },
      "statutRepresentation": {
        "verbatim": "true",
        "canonique": "true",
        "officielle": "true",
        "transcription": "false",
        "enregistrement": "false"
      },
      "repSource": {
        "@xmlns:xsi": "http://www.w3.org/2001/XMLSchema-instance",
        "@xsi:nil": "true"
      },
      "offset": {
        "@xmlns:xsi": "http://www.w3.org/2001/XMLSchema-instance",
        "@xsi:nil": "true"
      },
      "contenu": {
        "documentURI": "/15/amendements/2283/AN/170.pdf"
      },
      "dateDispoRepresentation": {
        "@xmlns:xsi": "http://www.w3.org/2001/XMLSchema-instance",
        "@xsi:nil": "true"
      }
    }
  },
  "seanceDiscussion": "RUANR5L15S2020IDS21856",
  "sort": {
    "dateSaisie": "2019-10-10T12:58:21.000+02:00",
    "sortEnSeance": "Rejeté"
  },
  "dateDepot": "2019-10-10T02:00:00.000+02:00",
  "dateDistribution": "2019-10-10T02:00:00.000+02:00",
  "article99": "0",
  "loiReference": {
    "codeLoi": {
      "@xmlns:xsi": "http://www.w3.org/2001/XMLSchema-instance",
      "@xsi:nil": "true"
    },
    "divisionCodeLoi": {
      "@xmlns:xsi": "http://www.w3.org/2001/XMLSchema-instance",
      "@xsi:nil": "true"
    }
  }
}