{
  "@xmlns": "http://schemas.assemblee-nationale.fr/referentiel",
  "uid": "AMANR5L15PO419865B2274P0D1N1532",
  "identifiant": {
    "legislature": "15",
    "numero": "1532",
    "numRect": "0",
    "saisine": {
      "refTexteLegislatif": "PRJLANR5L15B2274",
      "numeroPartiePLF": "0",
      "organeExamen": "PO419865",
      "mentionSecondeDeliberation": "0"
    }
  },
  "numeroLong": "CD1532",
  "etapeTexte": "1ère lecture (2ème assemblée saisie)",
  "triAmendement": "ipaaaaaaaaaaaaaaaaaaaaaaaaaaaaaaaaaaaaaaaaaaaaaaaabohc",
  "cardinaliteAmdtMultiples": "1",
  "amendementParent": {
    "@xmlns:xsi": "http://www.w3.org/2001/XMLSchema-instance",
    "@xsi:nil": "true"
  },
  "etat": "En traitement",
  "signataires": {
    "auteur": {
      "typeAuteur": "Depute",
      "acteurRef": "PA722038",
      "organeRef": {
        "@xmlns:xsi": "http://www.w3.org/2001/XMLSchema-instance",
        "@xsi:nil": "true"
      },
      "groupePolitiqueRef": "PO730964"
    },
    "cosignataires": {
      "acteurRef": [
        "PA718710",
        "PA607595",
        "PA722194",
        "PA722260",
        "PA720854",
        "PA722038",
        "PA722000"
      ]
    },
    "texteAffichable": "M.&#160;Damien&#160;Adam,  M.&#160;Test&#233;, M.&#160;Pellois, Mme&#160;Pascale&#160;Boyer, M.&#160;Buchou, M.&#160;Villani et Mme&#160;Provendier"
  },
  "pointeurFragmentTexte": {
    "missionVisee": {
      "@xmlns:xsi": "http://www.w3.org/2001/XMLSchema-instance",
      "@xsi:nil": "true"
    },
    "division": {
      "titre": "Article 10",
      "articleDesignationCourte": "ART. 10",
      "type": "ARTICLE",
      "avant_A_Apres": "A",
      "divisionRattachee": "ARTICLE 10",
      "articleAdditionnel": {
        "@xmlns:xsi": "http://www.w3.org/2001/XMLSchema-instance",
        "@xsi:nil": "true"
      },
      "chapitreAdditionnel": {
        "@xmlns:xsi": "http://www.w3.org/2001/XMLSchema-instance",
        "@xsi:nil": "true"
      },
      "urlDivisionTexteVise": "/15/textes/2274.asp#D_Article_10"
    },
    "alinea": {
      "avant_A_Apres": {
        "@xmlns:xsi": "http://www.w3.org/2001/XMLSchema-instance",
        "@xsi:nil": "true"
      },
      "numero": "4",
      "alineaDesignation": {
        "@xmlns:xsi": "http://www.w3.org/2001/XMLSchema-instance",
        "@xsi:nil": "true"
      }
    }
  },
  "corps": {
    "dispositif": "<p style=\"text-align: justify;\">Apr&#232;s le mot&#160;:</p><p style=\"text-align: justify;\">&#171;&#160;table&#160;&#187;,</p><p style=\"text-align: justify;\">supprimer la fin de l&#8217;alin&#233;a&#160;4.</p>",
    "exposeSommaire": "<p style=\"text-align: justify;\">Amendement propos&#233; par Surfrider.</p><p style=\"text-align: justify;\">&#160;Cet amendement vise &#224; supprimer l&#8217;exemption &#224; la suppression des gobelets, verres et assiettes jetables dits &#171;&#160;compostables&#160;&#187; ou &#171;&#160;biosourc&#233;s&#160;&#187;. En effet, qu&#8217;ils soient dits biosourc&#233;s et/ou compostables ces plastiques ne sont en r&#233;alit&#233; biod&#233;gradables que dans certaines conditions drastiques. A ce jour, aucun produit fini n&#8217;a encore &#233;t&#233; approuv&#233; comme biod&#233;gradable dans l&#8217;environnement marin, et la norme europ&#233;enne de compostage des emballages EN 13432 garantie seulement la biod&#233;gradation des emballages dans des conditions industrielles et non pas domestique. Par ailleurs, qu&#8217;ils soient biosourc&#233;s et/ou biod&#233;gradables ces plastiques peuvent perturber les fili&#232;res de tri et de recyclage. Leur composition complexe implique la mise en place de fili&#232;re de traitement sp&#233;cifique (de compostage industriel ou de recyclage) qui n&#8217;existent pas toujours. En leur absence, ils finissent en d&#233;charge, enfouis ou incin&#233;r&#233;s, produisant comme le plastique conventionnel des &#233;missions de gaz &#224; effet de serre et un impact sur l&#8217;environnement. De plus, la m&#233;connaissance du concept de biod&#233;gradabilit&#233; peut augmenter les fuites dans l&#8217;environnement en trompant le consommateur sur l&#8217;absence d&#8217;impacts de ces produits sur le milieu naturel.</p>",
    "annexeExposeSommaire": {
      "@xmlns:xsi": "http://www.w3.org/2001/XMLSchema-instance",
      "@xsi:nil": "true"
    },
    "cartoucheDelaiDepotDepasse": "Sous réserve de son traitement par les services de l'Assemblée nationale et de sa recevabilité",
    "avantAppel": {
      "@xmlns:xsi": "http://www.w3.org/2001/XMLSchema-instance",
      "@xsi:nil": "true"
    }
  },
  "representations": {
    "representation": {
      "nom": "PDF",
      "typeMime": {
        "type": "application",
        "subType": "PDF"
      },
      "statutRepresentation": {
        "verbatim": "true",
        "canonique": "true",
        "officielle": "true",
        "transcription": "false",
        "enregistrement": "false"
      },
      "repSource": {
        "@xmlns:xsi": "http://www.w3.org/2001/XMLSchema-instance",
        "@xsi:nil": "true"
      },
      "offset": {
        "@xmlns:xsi": "http://www.w3.org/2001/XMLSchema-instance",
        "@xsi:nil": "true"
      },
      "contenu": {
        "documentURI": "/15/amendements/2274/CION-DVP/CD1532.pdf"
      },
      "dateDispoRepresentation": {
        "@xmlns:xsi": "http://www.w3.org/2001/XMLSchema-instance",
        "@xsi:nil": "true"
      }
    }
  },
  "seanceDiscussion": {
    "@xmlns:xsi": "http://www.w3.org/2001/XMLSchema-instance",
    "@xsi:nil": "true"
  },
  "sort": {
    "@xmlns:xsi": "http://www.w3.org/2001/XMLSchema-instance",
    "@xsi:nil": "true"
  },
  "dateDepot": "2019-11-20T01:00:00.000+01:00",
  "dateDistribution": "2019-11-20T01:00:00.000+01:00",
  "article99": "0",
  "loiReference": {
    "codeLoi": {
      "@xmlns:xsi": "http://www.w3.org/2001/XMLSchema-instance",
      "@xsi:nil": "true"
    },
    "divisionCodeLoi": {
      "@xmlns:xsi": "http://www.w3.org/2001/XMLSchema-instance",
      "@xsi:nil": "true"
    }
  }
}