{
  "@xmlns": "http://schemas.assemblee-nationale.fr/referentiel",
  "uid": "AMANR5L15PO744107B0424P0D1N459",
  "identifiant": {
    "legislature": "15",
    "numero": "459",
    "numRect": "0",
    "saisine": {
      "refTexteLegislatif": "PRJLANR5L15B0424",
      "numeroPartiePLF": "0",
      "organeExamen": "PO744107",
      "mentionSecondeDeliberation": "0"
    }
  },
  "numeroLong": "459",
  "etapeTexte": "1ère lecture (1ère assemblée saisie)",
  "triAmendement": "bq",
  "cardinaliteAmdtMultiples": "1",
  "amendementParent": {
    "@xmlns:xsi": "http://www.w3.org/2001/XMLSchema-instance",
    "@xsi:nil": "true"
  },
  "etat": "Discuté",
  "signataires": {
    "auteur": {
      "typeAuteur": "Depute",
      "acteurRef": "PA333421",
      "organeRef": {
        "@xmlns:xsi": "http://www.w3.org/2001/XMLSchema-instance",
        "@xsi:nil": "true"
      },
      "groupePolitiqueRef": "PO744425"
    },
    "cosignataires": {
      "acteurRef": [
        "PA267355",
        "PA2952",
        "PA267766",
        "PA267330",
        "PA333421"
      ]
    },
    "texteAffichable": "M.&#160;Pancher,  M.&#160;Zumkeller, M.&#160;Herth, M.&#160;Guy&#160;Bricout et M.&#160;Warsmann"
  },
  "pointeurFragmentTexte": {
    "missionVisee": {
      "@xmlns:xsi": "http://www.w3.org/2001/XMLSchema-instance",
      "@xsi:nil": "true"
    },
    "division": {
      "titre": "Article 34",
      "articleDesignationCourte": "APRÈS ART. 34",
      "type": "ARTICLE",
      "avant_A_Apres": "Après",
      "divisionRattachee": "APRÈS L'ARTICLE 34, insérer l'article suivant:",
      "articleAdditionnel": "1",
      "chapitreAdditionnel": {
        "@xmlns:xsi": "http://www.w3.org/2001/XMLSchema-instance",
        "@xsi:nil": "true"
      },
      "urlDivisionTexteVise": "/15/textes/0424.asp#D_Article_34"
    },
    "alinea": {
      "@xmlns:xsi": "http://www.w3.org/2001/XMLSchema-instance",
      "@xsi:nil": "true"
    }
  },
  "corps": {
    "dispositif": "<p style=\"text-align: justify;\">L&#8217;article L.&#160;181&#8209;15 du code de l&#8217;environnement est compl&#233;t&#233; par un alin&#233;a ainsi r&#233;dig&#233;&#160;:</p><p style=\"text-align: justify;\">&#171;&#160;Lorsque le renouvellement de l&#8217;autorisation d&#8217;une installation hydro&#233;lectrique ne s&#8217;accompagne pas de modification substantielle, le dossier de demande et la proc&#233;dure applicable sont adapt&#233;s et simplifi&#233;s. Un d&#233;cret d&#233;finit les formalit&#233;s dont sont dispens&#233;es ces demandes de renouvellement.&#160;&#187;</p>",
    "exposeSommaire": "<p>Cet amendement vise, pour le renouvellement des autorisations hydro&#233;lectriques dont les caract&#233;ristiques essentielles sont inchang&#233;es et qui n'ont donc pas d'impact nouveau sur l'environnement, sur les autres usages et sur les droits des tiers, &#224; instituer une proc&#233;dure simplifi&#233;e telle qu'elle existe d&#233;j&#224; pour le renouvellement des concessions hydro&#233;lectriques.</p>",
    "annexeExposeSommaire": {
      "@xmlns:xsi": "http://www.w3.org/2001/XMLSchema-instance",
      "@xsi:nil": "true"
    }
  },
  "representations": {
    "representation": {
      "nom": "PDF",
      "typeMime": {
        "type": "application",
        "subType": "PDF"
      },
      "statutRepresentation": {
        "verbatim": "true",
        "canonique": "true",
        "officielle": "true",
        "transcription": "false",
        "enregistrement": "false"
      },
      "repSource": {
        "@xmlns:xsi": "http://www.w3.org/2001/XMLSchema-instance",
        "@xsi:nil": "true"
      },
      "offset": {
        "@xmlns:xsi": "http://www.w3.org/2001/XMLSchema-instance",
        "@xsi:nil": "true"
      },
      "contenu": {
        "documentURI": "/15/amendements/0424/CSCONF/459.pdf"
      },
      "dateDispoRepresentation": {
        "@xmlns:xsi": "http://www.w3.org/2001/XMLSchema-instance",
        "@xsi:nil": "true"
      }
    }
  },
  "seanceDiscussion": {
    "@xmlns:xsi": "http://www.w3.org/2001/XMLSchema-instance",
    "@xsi:nil": "true"
  },
  "sort": {
    "dateSaisie": "2018-01-17T21:35:13.000+01:00",
    "sortEnSeance": "Non soutenu"
  },
  "dateDepot": "2018-01-11T01:00:00.000+01:00",
  "dateDistribution": "2018-01-15T01:00:00.000+01:00",
  "article99": "0",
  "loiReference": {
    "codeLoi": "environnement",
    "divisionCodeLoi": "181-15"
  }
}