{
  "@xmlns": "http://schemas.assemblee-nationale.fr/referentiel",
  "uid": "AMANR5L15PO744107B0424P0D1N164",
  "identifiant": {
    "legislature": "15",
    "numero": "164",
    "numRect": "0",
    "saisine": {
      "refTexteLegislatif": "PRJLANR5L15B0424",
      "numeroPartiePLF": "0",
      "organeExamen": "PO744107",
      "mentionSecondeDeliberation": "0"
    }
  },
  "numeroLong": "164",
  "etapeTexte": "1ère lecture (1ère assemblée saisie)",
  "triAmendement": "bhu",
  "cardinaliteAmdtMultiples": "1",
  "amendementParent": {
    "@xmlns:xsi": "http://www.w3.org/2001/XMLSchema-instance",
    "@xsi:nil": "true"
  },
  "etat": "Discuté",
  "signataires": {
    "auteur": {
      "typeAuteur": "Depute",
      "acteurRef": "PA718850",
      "organeRef": {
        "@xmlns:xsi": "http://www.w3.org/2001/XMLSchema-instance",
        "@xsi:nil": "true"
      },
      "groupePolitiqueRef": "PO730934"
    },
    "cosignataires": {
      "acteurRef": [
        "PA608416",
        "PA223837",
        "PA330684",
        "PA642847",
        "PA720644",
        "PA718838",
        "PA720100",
        "PA722390",
        "PA334654",
        "PA606712",
        "PA605036",
        "PA718850",
        "PA266776",
        "PA608826",
        "PA718884",
        "PA267527",
        "PA2377",
        "PA718780",
        "PA720684",
        "PA266793",
        "PA267378",
        "PA330240",
        "PA721636",
        "PA1630",
        "PA267429",
        "PA2529",
        "PA998",
        "PA721314",
        "PA608016",
        "PA1874",
        "PA2086",
        "PA609245",
        "PA1012",
        "PA609726",
        "PA712015",
        "PA605991",
        "PA2792",
        "PA720630",
        "PA267318",
        "PA720586",
        "PA2155",
        "PA767",
        "PA719272",
        "PA340853",
        "PA266774",
        "PA332523",
        "PA721968",
        "PA721286",
        "PA334149",
        "PA606098",
        "PA267794",
        "PA719946",
        "PA346054",
        "PA2492",
        "PA266797",
        "PA719318"
      ]
    },
    "texteAffichable": "M.&#160;Cordier,  M.&#160;Abad, Mme&#160;Anthoine, M.&#160;Aubert, M.&#160;Bazin, Mme&#160;Bazin-Malgras, Mme&#160;Val&#233;rie&#160;Boyer, M.&#160;Cattin, M.&#160;Cinieri, M.&#160;Ciotti, Mme&#160;Genevard, M.&#160;Herbillon, M.&#160;Hetzel, Mme&#160;Lacroute, M.&#160;Grelier, M.&#160;Gosselin, M.&#160;Leclerc, Mme&#160;Levy, Mme&#160;Louwagie, Mme&#160;Duby-Muller, M.&#160;Dive, Mme&#160;Dalloz, M.&#160;Menuel, M.&#160;Dassault, Mme&#160;Meunier, M.&#160;Marleix, M.&#160;Fasquelle, M.&#160;Nury, M.&#160;Pierre-Henri&#160;Dumont, M.&#160;Perrut, M.&#160;Peltier, M.&#160;Ramadier, M.&#160;Saddier, M.&#160;Schellenberger, Mme&#160;Tabarot, M.&#160;Taugourdeau, M.&#160;Vialay, M.&#160;Parigi, M.&#160;Bony, M.&#160;de la Verpilli&#232;re, M.&#160;Furst, M.&#160;Pradi&#233;, M.&#160;Emmanuel&#160;Maquet, M.&#160;Brun, M.&#160;Le Fur, M.&#160;Vatin, M.&#160;Lurton, M.&#160;Quentin, M.&#160;Reiss, Mme&#160;Corneloup, Mme&#160;Trastour-Isnart, M.&#160;Straumann, M.&#160;Minot, M.&#160;Reitzer, M.&#160;Marlin et M.&#160;Brochand"
  },
  "pointeurFragmentTexte": {
    "missionVisee": {
      "@xmlns:xsi": "http://www.w3.org/2001/XMLSchema-instance",
      "@xsi:nil": "true"
    },
    "division": {
      "titre": "Article 3",
      "articleDesignationCourte": "APRÈS ART. 3",
      "type": "ARTICLE",
      "avant_A_Apres": "Après",
      "divisionRattachee": "APRÈS L'ARTICLE 3, insérer l'article suivant:",
      "articleAdditionnel": "1",
      "chapitreAdditionnel": {
        "@xmlns:xsi": "http://www.w3.org/2001/XMLSchema-instance",
        "@xsi:nil": "true"
      },
      "urlDivisionTexteVise": "/15/textes/0424.asp#D_Article_3"
    },
    "alinea": {
      "@xmlns:xsi": "http://www.w3.org/2001/XMLSchema-instance",
      "@xsi:nil": "true"
    }
  },
  "corps": {
    "dispositif": "<p style=\"text-align: justify;\">I.&#160;-&#160;L&#8217;article&#160;1649 <i>quater</i> B <i>quinquies</i> du code g&#233;n&#233;ral des imp&#244;ts est compl&#233;t&#233; par un alin&#233;a ainsi r&#233;dig&#233;&#160;:</p><p style=\"text-align: justify;\">&#171;&#160;Les contribuables, personnes physiques &#226;g&#233;s d&#8217;au moins soixante-dix ans sont dispens&#233;s de l&#8217;obligation de t&#233;l&#233;d&#233;claration de leurs revenus et de t&#233;l&#233;paiement de leurs imp&#244;ts jusqu&#8217;au 31 d&#233;cembre 2027.&#160;&#187;</p><p style=\"text-align: justify;\">II.&#160;-L&#8217;article&#160;1738 du code g&#233;n&#233;ral des imp&#244;ts est compl&#233;t&#233; par un alin&#233;a ainsi r&#233;dig&#233;&#160;:</p><p style=\"text-align: justify;\">&#171;&#160;6. Les contribuables, personnes physiques &#226;g&#233;s d&#8217;au moins soixante-dix ans sont dispens&#233;s de l&#8217;obligation de t&#233;l&#233;d&#233;claration de leurs revenus et de t&#233;l&#233;paiement de leurs imp&#244;ts jusqu&#8217;au 31 d&#233;cembre 2027.&#160;&#187;</p>",
    "exposeSommaire": "<p style=\"text-align: justify;\">Depuis 2016, les contribuables dont le revenu fiscal de r&#233;f&#233;rence est sup&#233;rieur &#224; 40 000&#160;euros sont d&#233;j&#224; oblig&#233;s de t&#233;l&#233;d&#233;clarer leurs revenus. Et &#224; partir de 2019 (revenus 2018), la d&#233;claration num&#233;rique et le t&#233;l&#233;paiement seront obligatoires pour tous les contribuables.</p><p style=\"text-align: justify;\">Cet amendement propose de reporter cette obligation &#224; 2028 pour les personnes &#226;g&#233;es de plus de 70 ans.</p><p style=\"text-align: justify;\">En effet, si de nombreux seniors sont d&#233;sormais familiaris&#233;s avec les nouvelles technologies, certains ne sont toujours pas &#233;quip&#233;s d&#8217;ordinateur ou n&#8217;ont pas de connexion internet, et il ne leur est pas toujours ais&#233; de se faire aider pour les d&#233;clarations et t&#233;l&#233;paiement.</p><p style=\"text-align: justify;\">Il convient donc de leur permettre de choisir leur mode de d&#233;claration et de paiement afin que ceux qui ne maitrisent pas bien l&#8217;informatique ne se sentent pas d&#233;valoris&#233;s et humili&#233;s par une telle contrainte.</p>",
    "annexeExposeSommaire": {
      "@xmlns:xsi": "http://www.w3.org/2001/XMLSchema-instance",
      "@xsi:nil": "true"
    }
  },
  "representations": {
    "representation": {
      "nom": "PDF",
      "typeMime": {
        "type": "application",
        "subType": "PDF"
      },
      "statutRepresentation": {
        "verbatim": "true",
        "canonique": "true",
        "officielle": "true",
        "transcription": "false",
        "enregistrement": "false"
      },
      "repSource": {
        "@xmlns:xsi": "http://www.w3.org/2001/XMLSchema-instance",
        "@xsi:nil": "true"
      },
      "offset": {
        "@xmlns:xsi": "http://www.w3.org/2001/XMLSchema-instance",
        "@xsi:nil": "true"
      },
      "contenu": {
        "documentURI": "/15/amendements/0424/CSCONF/164.pdf"
      },
      "dateDispoRepresentation": {
        "@xmlns:xsi": "http://www.w3.org/2001/XMLSchema-instance",
        "@xsi:nil": "true"
      }
    }
  },
  "seanceDiscussion": {
    "@xmlns:xsi": "http://www.w3.org/2001/XMLSchema-instance",
    "@xsi:nil": "true"
  },
  "sort": {
    "dateSaisie": "2018-01-15T21:53:04.000+01:00",
    "sortEnSeance": "Retiré"
  },
  "dateDepot": "2018-01-09T01:00:00.000+01:00",
  "dateDistribution": "2018-01-15T01:00:00.000+01:00",
  "article99": "0",
  "loiReference": {
    "codeLoi": "impôts",
    "divisionCodeLoi": "1649 quater B quinquies"
  }
}