{
  "@xmlns": "http://schemas.assemblee-nationale.fr/referentiel",
  "uid": "AMANR5L15PO766718B2187P0D1N1627",
  "identifiant": {
    "legislature": "15",
    "numero": "1627",
    "numRect": "0",
    "saisine": {
      "refTexteLegislatif": "PRJLANR5L15B2187",
      "numeroPartiePLF": "0",
      "organeExamen": "PO766718",
      "mentionSecondeDeliberation": "0"
    }
  },
  "numeroLong": "1627",
  "etapeTexte": "1ère lecture (1ère assemblée saisie)",
  "triAmendement": "bsaaaaaaaaaaaaaaaaaaaaaaaaaaaaaaaaaaaaaaaaaaaaaaaal",
  "cardinaliteAmdtMultiples": "1",
  "amendementParent": {
    "@xmlns:xsi": "http://www.w3.org/2001/XMLSchema-instance",
    "@xsi:nil": "true"
  },
  "etat": "Discuté",
  "signataires": {
    "auteur": {
      "typeAuteur": "Depute",
      "acteurRef": "PA722374",
      "organeRef": {
        "@xmlns:xsi": "http://www.w3.org/2001/XMLSchema-instance",
        "@xsi:nil": "true"
      },
      "groupePolitiqueRef": "PO730970"
    },
    "cosignataires": {
      "acteurRef": [
        "PA719210",
        "PA720764",
        "PA719266",
        "PA721530",
        "PA718978",
        "PA720598",
        "PA720746",
        "PA720178",
        "PA720092",
        "PA720002",
        "PA719488",
        "PA720720",
        "PA720704",
        "PA717151",
        "PA720162",
        "PA721182",
        "PA721608",
        "PA719558",
        "PA720968",
        "PA720976",
        "PA719942",
        "PA721234",
        "PA719640",
        "PA722162",
        "PA719918",
        "PA722284",
        "PA720772",
        "PA721984",
        "PA719044",
        "PA721734",
        "PA720728",
        "PA721836",
        "PA720326",
        "PA721924",
        "PA720256",
        "PA721742",
        "PA719874",
        "PA720334",
        "PA1276",
        "PA721976",
        "PA720924",
        "PA721418",
        "PA722374",
        "PA720652",
        "PA719504"
      ]
    },
    "texteAffichable": "M.&#160;Isaac-Sibille,  M.&#160;Berta, rapporteur Mme&#160;de Vaucouleurs, Mme&#160;Elimas, M.&#160;Fuchs, M.&#160;Hammouche, M.&#160;Balanant, Mme&#160;Bannier, M.&#160;Barrot, M.&#160;Baudu, Mme&#160;Benin, M.&#160;Bolo, M.&#160;Bourlanges, M.&#160;Bru, M.&#160;Cubertafon, Mme&#160;de Sarnez, Mme&#160;Deprez-Audebert, M.&#160;Duverg&#233;, Mme&#160;El Ha&#239;ry, Mme&#160;Essayan, M.&#160;Fanget, Mme&#160;Florennes, M.&#160;Garcia, Mme&#160;Jacquier-Laforge, M.&#160;Joncour, M.&#160;Lagleize, M.&#160;Lain&#233;, M.&#160;Laqhila, Mme&#160;Lasserre-David, M.&#160;Latombe, Mme&#160;Luquet, M.&#160;Mathiasin, M.&#160;Mattei, Mme&#160;Mette, M.&#160;Michel-Kleisbauer, M.&#160;Mignola, M.&#160;Millienne, M.&#160;Pahun, M.&#160;Fr&#233;d&#233;ric&#160;Petit, Mme&#160;Maud&#160;Petit, Mme&#160;Poueyto, M.&#160;Ramos, M.&#160;Turquois, Mme&#160;Vichnievsky et M.&#160;Waserman"
  },
  "pointeurFragmentTexte": {
    "missionVisee": {
      "@xmlns:xsi": "http://www.w3.org/2001/XMLSchema-instance",
      "@xsi:nil": "true"
    },
    "division": {
      "titre": "Article 9",
      "articleDesignationCourte": "APRÈS ART. 9",
      "type": "ARTICLE",
      "avant_A_Apres": "Après",
      "divisionRattachee": "APRÈS L'ARTICLE 9, insérer l'article suivant:",
      "articleAdditionnel": "1",
      "chapitreAdditionnel": {
        "@xmlns:xsi": "http://www.w3.org/2001/XMLSchema-instance",
        "@xsi:nil": "true"
      },
      "urlDivisionTexteVise": "/15/textes/2187.asp#D_Article_9"
    },
    "alinea": {
      "@xmlns:xsi": "http://www.w3.org/2001/XMLSchema-instance",
      "@xsi:nil": "true"
    }
  },
  "corps": {
    "dispositif": "<p>Apr&#232;s le deuxi&#232;me alin&#233;a de l&#8217;article&#160;L.&#160;1411&#8209;6 du code de la sant&#233; publique, il est ins&#233;r&#233; un alin&#233;a ainsi r&#233;dig&#233;&#160;:</p><p style=\"text-align: justify;\">&#171;&#160;La liste des maladies pour lesquelles est pratiqu&#233; un d&#233;pistage n&#233;onatal est fix&#233;e par arr&#234;t&#233; du ministre charg&#233; de la sant&#233; apr&#232;s avis de l&#8217;Agence de la biom&#233;decine. Elle est r&#233;vis&#233;e p&#233;riodiquement au regard des progr&#232;s m&#233;dicaux et scientifiques.&#160;&#187;</p>",
    "exposeSommaire": "<p>Le pr&#233;sent amendement vise &#224; permettre la r&#233;vision de la liste fixant les maladies donnant lieu &#224; un d&#233;pistage n&#233;onatal. Ce d&#233;pistage, pratiqu&#233; imm&#233;diatement apr&#232;s la naissance par l&#8217;analyse d&#8217;une goutte de sang pr&#233;lev&#233; sur chaque enfant, permet de d&#233;tecter au plus t&#244;t la pr&#233;sence d&#8217;&#233;ventuelles maladies&#160; rares afin de maximiser les chances de survie de chaque nouveau-n&#233;.</p><p style=\"text-align: justify;\">Malheureusement, la France est tr&#232;s en retard dans ce domaine par rapport aux autres pays d&#233;velopp&#233;s. En effet, ne sont d&#233;pist&#233;es dans notre pays que cinq maladies rares dans le cadre du d&#233;pistage n&#233;onatal. A titre de comparaison, beaucoup de pays europ&#233;ens en diagnostiquent au moins vingt et certains &#201;tats am&#233;ricains soixante-cinq. En 2011, la HAS pr&#233;conisait d&#233;j&#224; une extension du diagnostic &#224; une pathologie suppl&#233;mentaire (d&#233;ficit en MCAD). En 2018, le CCNE propose d&#8217;&#233;tendre le d&#233;pistage aux d&#233;ficits immunitaires. En 2019, alors que cette extension n&#8217;a toujours pas eu lieu, le d&#233;put&#233; Jean Louis Touraine estime dans son rapport sur la r&#233;vision de la loi relative &#224; la bio&#233;thique qu&#8217;il est &#171;&#160;l&#233;gitime et urgent d&#8217;&#233;tendre [le diagnostic n&#233;onatal] en incorporant plusieurs maladies suppl&#233;mentaires&#160;&#187;. Les maladies &#224; cibler sont celles pour lesquelles une prise en charge pr&#233;coce offre un avantage significatif en termes de survie ou de r&#233;duction de la morbidit&#233;. Il convient &#233;galement de r&#233;viser p&#233;riodiquement cette liste, au regard des progr&#232;s m&#233;dicaux et scientifiques.&#160;</p>",
    "annexeExposeSommaire": {
      "@xmlns:xsi": "http://www.w3.org/2001/XMLSchema-instance",
      "@xsi:nil": "true"
    },
    "cartoucheDelaiDepotDepasse": {
      "@xmlns:xsi": "http://www.w3.org/2001/XMLSchema-instance",
      "@xsi:nil": "true"
    },
    "avantAppel": {
      "@xmlns:xsi": "http://www.w3.org/2001/XMLSchema-instance",
      "@xsi:nil": "true"
    }
  },
  "representations": {
    "representation": {
      "nom": "PDF",
      "typeMime": {
        "type": "application",
        "subType": "PDF"
      },
      "statutRepresentation": {
        "verbatim": "true",
        "canonique": "true",
        "officielle": "true",
        "transcription": "false",
        "enregistrement": "false"
      },
      "repSource": {
        "@xmlns:xsi": "http://www.w3.org/2001/XMLSchema-instance",
        "@xsi:nil": "true"
      },
      "offset": {
        "@xmlns:xsi": "http://www.w3.org/2001/XMLSchema-instance",
        "@xsi:nil": "true"
      },
      "contenu": {
        "documentURI": "/15/amendements/2187/CSBIOETH/1627.pdf"
      },
      "dateDispoRepresentation": {
        "@xmlns:xsi": "http://www.w3.org/2001/XMLSchema-instance",
        "@xsi:nil": "true"
      }
    }
  },
  "seanceDiscussion": {
    "@xmlns:xsi": "http://www.w3.org/2001/XMLSchema-instance",
    "@xsi:nil": "true"
  },
  "sort": {
    "dateSaisie": "2019-09-13T10:36:07.000+02:00",
    "sortEnSeance": "Rejeté"
  },
  "dateDepot": "2019-09-05T02:00:00.000+02:00",
  "dateDistribution": "2019-09-11T02:00:00.000+02:00",
  "article99": "0",
  "loiReference": {
    "codeLoi": "c santé publique",
    "divisionCodeLoi": "L1411-6"
  }
}