{
  "@xmlns": "http://schemas.assemblee-nationale.fr/referentiel",
  "uid": "AMANR5L15PO419610B0846P0D1N2036",
  "identifiant": {
    "legislature": "15",
    "numero": "2036",
    "numRect": "0",
    "saisine": {
      "refTexteLegislatif": "PRJLANR5L15B0846",
      "numeroPartiePLF": "0",
      "organeExamen": "PO419610",
      "mentionSecondeDeliberation": "0"
    }
  },
  "numeroLong": "CE2036",
  "etapeTexte": "1ère lecture (1ère assemblée saisie)",
  "triAmendement": "pni",
  "cardinaliteAmdtMultiples": "1",
  "amendementParent": {
    "@xmlns:xsi": "http://www.w3.org/2001/XMLSchema-instance",
    "@xsi:nil": "true"
  },
  "etat": "Discuté",
  "signataires": {
    "auteur": {
      "typeAuteur": "Depute",
      "acteurRef": "PA721070",
      "organeRef": {
        "@xmlns:xsi": "http://www.w3.org/2001/XMLSchema-instance",
        "@xsi:nil": "true"
      },
      "groupePolitiqueRef": "PO730934"
    },
    "cosignataires": {
      "acteurRef": [
        "PA266793",
        "PA720968",
        "PA608016",
        "PA998",
        "PA721054",
        "PA605036",
        "PA610667",
        "PA709315",
        "PA721070",
        "PA267429"
      ]
    },
    "texteAffichable": "Mme&#160;Ramassamy,  M.&#160;Bony, M.&#160;Cinieri, M.&#160;Viala, Mme&#160;Louwagie, Mme&#160;Benin, M.&#160;Abad, M.&#160;Lorion, M.&#160;Serville et M.&#160;Dassault"
  },
  "pointeurFragmentTexte": {
    "missionVisee": {
      "@xmlns:xsi": "http://www.w3.org/2001/XMLSchema-instance",
      "@xsi:nil": "true"
    },
    "division": {
      "titre": "Article 45",
      "articleDesignationCourte": "ART. 45",
      "type": "ARTICLE",
      "avant_A_Apres": "A",
      "divisionRattachee": "ARTICLE 45",
      "articleAdditionnel": {
        "@xmlns:xsi": "http://www.w3.org/2001/XMLSchema-instance",
        "@xsi:nil": "true"
      },
      "chapitreAdditionnel": {
        "@xmlns:xsi": "http://www.w3.org/2001/XMLSchema-instance",
        "@xsi:nil": "true"
      },
      "urlDivisionTexteVise": "/15/textes/0846.asp#D_Article_45"
    },
    "alinea": {
      "avant_A_Apres": "A",
      "numero": "5",
      "alineaDesignation": "Alinéa 5"
    }
  },
  "corps": {
    "dispositif": "<p style=\"text-align: justify;\">&#192; l&#8217;alin&#233;a&#160;5, apr&#232;s le mot&#160;:</p><p style=\"text-align: justify;\">&#171;&#160;handicap&#160;&#187;,</p><p style=\"text-align: justify;\">ins&#233;rer les mots&#160;:</p><p style=\"text-align: justify;\">&#171;&#160;et aux personnes aidantes ou auxiliaires professionnels&#160;&#187;.&#160;</p><p style=\"text-align: justify;\">&#160;</p>",
    "exposeSommaire": "<p>Cet amendement vise &#224; ouvrir la collocation entre personnes en perte d'autonomie li&#233;e au handicap et aux personnes aidantes ou auxiliaires professionnels qui les accompagnent, tous les jours, pour accomplir les t&#226;ches principales ou secondaires de la vie quotidienne.&#160;</p><p>Cette mesure permettrait de r&#233;pondre &#224; une demande forte des personnes en situation de handicap et des personnes aidantes qui sont actuellement d&#233;laiss&#233;es par le syst&#232;me en place.&#160;</p>",
    "annexeExposeSommaire": {
      "@xmlns:xsi": "http://www.w3.org/2001/XMLSchema-instance",
      "@xsi:nil": "true"
    }
  },
  "representations": {
    "representation": {
      "nom": "PDF",
      "typeMime": {
        "type": "application",
        "subType": "PDF"
      },
      "statutRepresentation": {
        "verbatim": "true",
        "canonique": "true",
        "officielle": "true",
        "transcription": "false",
        "enregistrement": "false"
      },
      "repSource": {
        "@xmlns:xsi": "http://www.w3.org/2001/XMLSchema-instance",
        "@xsi:nil": "true"
      },
      "offset": {
        "@xmlns:xsi": "http://www.w3.org/2001/XMLSchema-instance",
        "@xsi:nil": "true"
      },
      "contenu": {
        "documentURI": "/15/amendements/0846/CION-ECO/CE2036.pdf"
      },
      "dateDispoRepresentation": {
        "@xmlns:xsi": "http://www.w3.org/2001/XMLSchema-instance",
        "@xsi:nil": "true"
      }
    }
  },
  "seanceDiscussion": {
    "@xmlns:xsi": "http://www.w3.org/2001/XMLSchema-instance",
    "@xsi:nil": "true"
  },
  "sort": {
    "dateSaisie": "2018-05-18T15:37:40.000+02:00",
    "sortEnSeance": "Non soutenu"
  },
  "dateDepot": "2018-05-09T02:00:00.000+02:00",
  "dateDistribution": "2018-05-15T02:00:00.000+02:00",
  "article99": "0",
  "loiReference": {
    "codeLoi": {
      "@xmlns:xsi": "http://www.w3.org/2001/XMLSchema-instance",
      "@xsi:nil": "true"
    },
    "divisionCodeLoi": {
      "@xmlns:xsi": "http://www.w3.org/2001/XMLSchema-instance",
      "@xsi:nil": "true"
    }
  }
}