{
  "@xmlns": "http://schemas.assemblee-nationale.fr/referentiel",
  "uid": "AMANR5L15SEA717460BTC1237P0D1N189",
  "identifiant": {
    "legislature": "15",
    "numero": "189",
    "numRect": "0",
    "saisine": {
      "refTexteLegislatif": "PRJLANR5L15BTC1237",
      "numeroPartiePLF": "0",
      "organeExamen": "PO717460",
      "mentionSecondeDeliberation": "0"
    }
  },
  "numeroLong": "189",
  "etapeTexte": "1ère lecture (1ère assemblée saisie)",
  "triAmendement": "aeaaaaaaaaaaaaaaaaaaaaaaaaaaaaaaaaaaaaaaaaaaaaaaaaado",
  "cardinaliteAmdtMultiples": "1",
  "amendementParent": {
    "@xmlns:xsi": "http://www.w3.org/2001/XMLSchema-instance",
    "@xsi:nil": "true"
  },
  "etat": "Discuté",
  "signataires": {
    "auteur": {
      "typeAuteur": "Depute",
      "acteurRef": "PA330909",
      "organeRef": {
        "@xmlns:xsi": "http://www.w3.org/2001/XMLSchema-instance",
        "@xsi:nil": "true"
      },
      "groupePolitiqueRef": "PO730934"
    },
    "cosignataires": {
      "acteurRef": [
        "PA267260",
        "PA2155",
        "PA266776",
        "PA721816",
        "PA334149",
        "PA266793",
        "PA334654",
        "PA643089",
        "PA340853",
        "PA720586",
        "PA267527",
        "PA720210",
        "PA330909",
        "PA606712",
        "PA609245",
        "PA719318",
        "PA719272",
        "PA767",
        "PA721506",
        "PA721678",
        "PA332523"
      ]
    },
    "texteAffichable": "M.&#160;Descoeur,  M.&#160;Straumann, M.&#160;Thi&#233;riot, Mme&#160;Meunier, M.&#160;Cattin, M.&#160;Leclerc, M.&#160;Menuel, M.&#160;Reiss, M.&#160;Saddier, Mme&#160;Poletti, M.&#160;Bony, M.&#160;Reda, M.&#160;Lurton, Mme&#160;Anthoine, M.&#160;Boucard, Mme&#160;Lacroute, Mme&#160;Kuster, Mme&#160;Beauvais, M.&#160;Fasquelle, Mme&#160;Dalloz et M.&#160;Vatin"
  },
  "pointeurFragmentTexte": {
    "missionVisee": {
      "@xmlns:xsi": "http://www.w3.org/2001/XMLSchema-instance",
      "@xsi:nil": "true"
    },
    "division": {
      "titre": "Article 5 ter",
      "articleDesignationCourte": "APRÈS ART. 5 TER",
      "type": "ARTICLE",
      "avant_A_Apres": "Après",
      "divisionRattachee": "APRÈS L'ARTICLE 5 TER, insérer l'article suivant:",
      "articleAdditionnel": "1",
      "chapitreAdditionnel": {
        "@xmlns:xsi": "http://www.w3.org/2001/XMLSchema-instance",
        "@xsi:nil": "true"
      },
      "urlDivisionTexteVise": "/15/textes/1237.asp#D_Article_5_ter"
    },
    "alinea": {
      "@xmlns:xsi": "http://www.w3.org/2001/XMLSchema-instance",
      "@xsi:nil": "true"
    }
  },
  "corps": {
    "dispositif": "<p style=\"text-align: justify;\">Le code de commerce est ainsi modifi&#233;&#160;:</p><p style=\"text-align: justify;\">1&#176; Au d&#233;but de la section 2 du chapitre VI du titre II du livre V, il est ajout&#233; un article L.&#160;526&#8209;6-A ainsi r&#233;dig&#233;&#160;:</p><p style=\"text-align: justify;\">&#171;&#160;<i>Art.&#160;L.&#160;526&#8209;6-A.</i>&#160;&#8211;&#160;Toute personne physique souhaitant exercer une activit&#233; professionnelle en nom propre d&#233;clare, lors de la cr&#233;ation de l&#8217;entreprise, si elle souhaite exercer en tant qu&#8217;entrepreneur individuel &#224; responsabilit&#233; limit&#233;e relevant de la pr&#233;sente section ou en tant qu&#8217;entrepreneur individuel non soumis aux dispositions de la pr&#233;sente section.</p><p style=\"text-align: justify;\">&#171;&#160;L&#8217;entrepreneur individuel peut &#233;galement opter &#224; tout moment pour le r&#233;gime de l&#8217;entrepreneur individuel &#224; responsabilit&#233; limit&#233;e.&#160;&#187;</p><p style=\"text-align: justify;\">2&#176; Le premier alin&#233;a de l&#8217;article L.&#160;526&#8209;6 est ainsi modifi&#233;&#160;:</p><p style=\"text-align: justify;\">1&#176;&#160;Au d&#233;but, les mots &#171;&#160;Tout entrepreneur individuel peut affecter&#160;&#187; sont remplac&#233;s par les mots&#160;:&#160;&#171;&#160;Lorsqu&#8217;il choisit d&#8217;exercer son activit&#233; en tant qu&#8217;entrepreneur individuel &#224; responsabilit&#233; limit&#233;e, l&#8217;entrepreneur individuel affecte&#160;&#187;&#160;;</p><p style=\"text-align: justify;\">2&#176;&#160;Il est compl&#233;t&#233; par les mots&#160;:&#160;&#171;&#160;dans les conditions pr&#233;vues &#224; l&#8217;article L.&#160;526&#8209;7&#160;&#187;.</p>",
    "exposeSommaire": "<p style=\"text-align: justify;\">Dans l&#8217;immense majorit&#233; des cas, la d&#233;cision de cr&#233;er une entreprise est le fait d&#8217;une personne voire d&#8217;un couple.</p><p style=\"text-align: justify;\">Le futur chef d&#8217;entreprise est face &#224; deux grandes formes de statut pour l&#8217;exercice de son activit&#233;&#160;: personne physique (autrement dit l&#8217;exercice en nom propre) ou personne morale.</p><p style=\"text-align: justify;\">Dans la pratique, les deux tiers des cr&#233;ations d&#8217;entreprise ne se font pas sous la forme soci&#233;taire.</p><p style=\"text-align: justify;\">En ce qui concerne les travailleurs ind&#233;pendants, on distingue deux formes d&#8217;entreprise individuelle&#160;: le statut de l&#8217;entrepreneur individuel (EI) et le statut de l&#8217;entrepreneur individuel &#224; responsabilit&#233; limit&#233; (EIRL) lorsque l&#8217;entrepreneur d&#233;cide d&#8217;affecter &#224; son activit&#233; professionnelle un patrimoine s&#233;par&#233; de son patrimoine personnel.</p><p style=\"text-align: justify;\">Les entrepreneurs peuvent &#233;galement choisir une forme de soci&#233;t&#233;, m&#234;me s&#8217;ils n&#8217;ont pas d&#8217;associ&#233;&#160;: l&#8217;entreprise unipersonnelle &#224; responsabilit&#233; limit&#233; (EURL) qui est une SARL &#224; associ&#233; unique, la soci&#233;t&#233; par actions simplifi&#233;e unipersonnelle (SASU) et, pour les professions lib&#233;rales, certaines soci&#233;t&#233;s d&#8217;exercice lib&#233;ral (SEL).</p><p style=\"text-align: justify;\">On rappellera que la micro-entreprise n&#8217;est pas un statut juridique mais un r&#233;gime fiscal et social d&#233;rogatoire. Celui ou celle qui choisit ce r&#233;gime est, au plan juridique, un entrepreneur individuel.</p><p style=\"text-align: justify;\">En coh&#233;rence avec l&#8217;esprit du projet de loi, dans un souci de simplification des d&#233;marches li&#233;es &#224; la cr&#233;ation d&#8217;une entreprise individuelle et de protection du chef d&#8217;entreprise, le pr&#233;sent amendement propose de consacrer le choix entre le statut de l&#8217;entrepreneur individuel (EI) et le statut de l&#8217;entrepreneur individuel &#224; responsabilit&#233; limit&#233; (EIRL) comme premier arbitrage pour tout cr&#233;ateur d&#8217;entreprise souhaitant exercer son activit&#233; en nom propre.</p><p style=\"text-align: justify;\">Cette disposition est motiv&#233;e par deux caract&#233;ristiques essentielles de l&#8217;EIRL&#160;:</p><p style=\"text-align: justify;\">- d&#8217;une part, la protection du patrimoine priv&#233; de l&#8217;entrepreneur (au-del&#224; de la seule insaisissabilit&#233; de la r&#233;sidence principale, d&#233;j&#224; accord&#233;e &#224; l&#8217;entreprise individuelle par la loi du 6 ao&#251;t 2015 pour la croissance, l&#8217;activit&#233; &#233;conomique et l&#8217;&#233;galit&#233; des chances). Cette protection r&#233;sulte, dans le cadre de l&#8217;EIRL, de l&#8217;affectation &#224; l&#8217;activit&#233; professionnelle de l&#8217;entrepreneur d&#8217;un patrimoine s&#233;par&#233; de son patrimoine personnel, sans cr&#233;ation d&#8217;une personne morale&#160;;</p><p style=\"text-align: justify;\">- d&#8217;autre part, la possibilit&#233; d&#8217;opter pour l&#8217;imp&#244;t sur les soci&#233;t&#233;s, sans pour autant subir la charge administrative du formalisme li&#233; &#224; la forme soci&#233;taire.</p><p style=\"text-align: justify;\">Pour &#234;tre pleinement efficace, cette disposition devra s&#8217;accompagner d&#8217;une r&#233;vision du cerfa de d&#233;claration de cr&#233;ation d&#8217;entreprise ainsi que d&#8217;une &#233;volution dans l&#8217;accompagnement des cr&#233;ateurs pour que leurs interlocuteurs &#233;voquent syst&#233;matiquement l&#8217;alternative possible et que le choix pour l&#8217;un ou l&#8217;autre statut soit d&#232;s lors pleinement motiv&#233;.</p>",
    "annexeExposeSommaire": {
      "@xmlns:xsi": "http://www.w3.org/2001/XMLSchema-instance",
      "@xsi:nil": "true"
    }
  },
  "representations": {
    "representation": {
      "nom": "PDF",
      "typeMime": {
        "type": "application",
        "subType": "PDF"
      },
      "statutRepresentation": {
        "verbatim": "true",
        "canonique": "true",
        "officielle": "true",
        "transcription": "false",
        "enregistrement": "false"
      },
      "repSource": {
        "@xmlns:xsi": "http://www.w3.org/2001/XMLSchema-instance",
        "@xsi:nil": "true"
      },
      "offset": {
        "@xmlns:xsi": "http://www.w3.org/2001/XMLSchema-instance",
        "@xsi:nil": "true"
      },
      "contenu": {
        "documentURI": "/15/amendements/1237/AN/189.pdf"
      },
      "dateDispoRepresentation": {
        "@xmlns:xsi": "http://www.w3.org/2001/XMLSchema-instance",
        "@xsi:nil": "true"
      }
    }
  },
  "seanceDiscussion": "RUANR5L15S2018IDS21250",
  "sort": {
    "dateSaisie": "2018-09-27T10:45:47.000+02:00",
    "sortEnSeance": "Retiré"
  },
  "dateDepot": "2018-09-19T02:00:00.000+02:00",
  "dateDistribution": "2018-09-24T02:00:00.000+02:00",
  "article99": "0",
  "loiReference": {
    "codeLoi": "c commerce",
    "divisionCodeLoi": "L526-6-A"
  }
}