{
  "@xmlns": "http://schemas.assemblee-nationale.fr/referentiel",
  "uid": "AMANR5L15SEA717460BTA0216P0D1N97",
  "identifiant": {
    "legislature": "15",
    "numero": "97",
    "numRect": "0",
    "saisine": {
      "refTexteLegislatif": "PRJLANR5L15BTA0216",
      "numeroPartiePLF": "0",
      "organeExamen": "PO717460",
      "mentionSecondeDeliberation": "0"
    }
  },
  "numeroLong": "97",
  "etapeTexte": "Lecture définitive",
  "triAmendement": "aaeaaaaaaaaaaaaaaaaaaaaaaaaaaaaaaaaaaaaaaaaaaaaaaabpkks",
  "cardinaliteAmdtMultiples": "1",
  "amendementParent": {
    "@xmlns:xsi": "http://www.w3.org/2001/XMLSchema-instance",
    "@xsi:nil": "true"
  },
  "etat": "Discuté",
  "signataires": {
    "auteur": {
      "typeAuteur": "Depute",
      "acteurRef": "PA346218",
      "organeRef": {
        "@xmlns:xsi": "http://www.w3.org/2001/XMLSchema-instance",
        "@xsi:nil": "true"
      },
      "groupePolitiqueRef": "PO730934"
    },
    "cosignataires": {
      "acteurRef": [
        "PA267429",
        "PA748954",
        "PA267289",
        "PA721286",
        "PA721816",
        "PA642847",
        "PA718850",
        "PA330684",
        "PA719318",
        "PA267527",
        "PA266774",
        "PA718780",
        "PA718884",
        "PA346218",
        "PA267204",
        "PA709315"
      ]
    },
    "texteAffichable": "M.&#160;Masson,  Mme&#160;Trastour-Isnart, M.&#160;Cordier, M.&#160;Cinieri, Mme&#160;Val&#233;rie&#160;Boyer, M.&#160;Ramadier, M.&#160;Saddier, M.&#160;Door, Mme&#160;Anthoine, Mme&#160;Bazin-Malgras, M.&#160;Savignat, M.&#160;Sermier, M.&#160;Furst, M.&#160;Bazin, M.&#160;Boucard et M.&#160;Viala"
  },
  "pointeurFragmentTexte": {
    "missionVisee": {
      "@xmlns:xsi": "http://www.w3.org/2001/XMLSchema-instance",
      "@xsi:nil": "true"
    },
    "division": {
      "titre": "Article PREMIER",
      "articleDesignationCourte": "ART. PREMIER",
      "type": "ARTICLE",
      "avant_A_Apres": "A",
      "divisionRattachee": "ARTICLE PREMIER",
      "articleAdditionnel": {
        "@xmlns:xsi": "http://www.w3.org/2001/XMLSchema-instance",
        "@xsi:nil": "true"
      },
      "chapitreAdditionnel": {
        "@xmlns:xsi": "http://www.w3.org/2001/XMLSchema-instance",
        "@xsi:nil": "true"
      },
      "urlDivisionTexteVise": "/15/textes/TA0216.asp#D_Article_1er"
    },
    "alinea": {
      "@xmlns:xsi": "http://www.w3.org/2001/XMLSchema-instance",
      "@xsi:nil": "true"
    }
  },
  "corps": {
    "dispositif": "<p style=\"text-align: justify;\">R&#233;diger ainsi cet article&#160;:</p><p style=\"text-align: justify;\">Le rapport d&#233;finissant les orientations et la programmation des moyens de la justice pour la p&#233;riode 2019-2022, annex&#233; &#224; la pr&#233;sente loi, est approuv&#233;.</p><p style=\"text-align: justify;\">Les cr&#233;dits de paiement de la mission &#171;&#160;Justice&#160;&#187;, hors charges de pensions, exprim&#233;s en milliards&#160;d'euros courants, &#233;volueront comme suit&#160;:&#160;</p><table style=\"border-collapse: collapse;\"><tbody><tr><td style=\"white-space: normal; border: 1px solid #000000;\">2019</td><td style=\"white-space: normal; border: 1px solid #000000;\">2020</td><td style=\"white-space: normal; border: 1px solid #000000;\">2021</td><td style=\"white-space: normal; border: 1px solid #000000;\">2022</td></tr><tr><td style=\"white-space: normal; border: 1px solid #000000;\">7,29</td><td style=\"white-space: normal; border: 1px solid #000000;\">7,65</td><td style=\"white-space: normal; border: 1px solid #000000;\">8,20</td><td style=\"white-space: normal; border: 1px solid #000000;\">8,99</td></tr></tbody></table><p style=\"text-align: justify;\">Les cr&#233;ations nettes d'emplois du minist&#232;re de la justice s'&#233;l&#232;veront &#224; 12&#160;628 &#233;quivalents temps plein et s'effectueront selon le calendrier suivant&#160;:</p><table style=\"border-collapse: collapse;\"><tbody><tr><td style=\"white-space: normal; border: 1px solid #000000;\">2019</td><td style=\"white-space: normal; border: 1px solid #000000;\">2020</td><td style=\"white-space: normal; border: 1px solid #000000;\">2021</td><td style=\"white-space: normal; border: 1px solid #000000;\">2022</td></tr><tr><td style=\"white-space: normal; border: 1px solid #000000;\">2&#160;987</td><td style=\"white-space: normal; border: 1px solid #000000;\">3&#160;095</td><td style=\"white-space: normal; border: 1px solid #000000;\">3&#160;213</td><td style=\"white-space: normal; border: 1px solid #000000;\">3&#160;333</td></tr></tbody></table>",
    "exposeSommaire": "<p style=\"text-align: justify;\">Le pr&#233;sent amendement vise &#224; r&#233;tablir la trajectoire budg&#233;taire de la mission &#171;&#160;Justice&#160;&#187; adopt&#233;e par le S&#233;nat en premi&#232;re lecture. Elle pr&#233;voit une augmentation des cr&#233;dits de 33,8&#160;% entre 2017 et 2022 et la cr&#233;ation de 13&#160;700 emplois, suivant les pr&#233;conisations du rapport de la mission d&#8217;information de la commission des lois sur le redressement de la justice publi&#233; en avril 2017.</p><p style=\"text-align: justify;\">La programmation budg&#233;taire du Gouvernement, adopt&#233;e par l&#8217;Assembl&#233;e nationale en premi&#232;re lecture, pr&#233;voit une progression des cr&#233;dits de 23,5&#160;% et la cr&#233;ation de 6&#160;500 emplois sur la m&#234;me p&#233;riode.</p><p style=\"text-align: justify;\">Les rapporteurs estiment que cette programmation est manifestement insuffisante pour assurer le redressement budg&#233;taire des juridictions et de l&#8217;administration p&#233;nitentiaire.</p>",
    "annexeExposeSommaire": {
      "@xmlns:xsi": "http://www.w3.org/2001/XMLSchema-instance",
      "@xsi:nil": "true"
    },
    "cartoucheDelaiDepotDepasse": {
      "@xmlns:xsi": "http://www.w3.org/2001/XMLSchema-instance",
      "@xsi:nil": "true"
    }
  },
  "representations": {
    "representation": {
      "nom": "PDF",
      "typeMime": {
        "type": "application",
        "subType": "PDF"
      },
      "statutRepresentation": {
        "verbatim": "true",
        "canonique": "true",
        "officielle": "true",
        "transcription": "false",
        "enregistrement": "false"
      },
      "repSource": {
        "@xmlns:xsi": "http://www.w3.org/2001/XMLSchema-instance",
        "@xsi:nil": "true"
      },
      "offset": {
        "@xmlns:xsi": "http://www.w3.org/2001/XMLSchema-instance",
        "@xsi:nil": "true"
      },
      "contenu": {
        "documentURI": "/15/amendements/TA0216/AN/97.pdf"
      },
      "dateDispoRepresentation": {
        "@xmlns:xsi": "http://www.w3.org/2001/XMLSchema-instance",
        "@xsi:nil": "true"
      }
    }
  },
  "seanceDiscussion": {
    "@xmlns:xsi": "http://www.w3.org/2001/XMLSchema-instance",
    "@xsi:nil": "true"
  },
  "sort": {
    "dateSaisie": "2019-02-18T22:25:58.000+01:00",
    "sortEnSeance": "Rejeté"
  },
  "dateDepot": "2019-02-15T01:00:00.000+01:00",
  "dateDistribution": "2019-02-18T01:00:00.000+01:00",
  "article99": "0",
  "loiReference": {
    "codeLoi": {
      "@xmlns:xsi": "http://www.w3.org/2001/XMLSchema-instance",
      "@xsi:nil": "true"
    },
    "divisionCodeLoi": {
      "@xmlns:xsi": "http://www.w3.org/2001/XMLSchema-instance",
      "@xsi:nil": "true"
    }
  }
}