{
  "@xmlns": "http://schemas.assemblee-nationale.fr/referentiel",
  "uid": "AMANR5L15SEA717460B0235P2D1N1525",
  "identifiant": {
    "legislature": "15",
    "numero": "1525",
    "numRect": "0",
    "saisine": {
      "refTexteLegislatif": "PRJLANR5L15B0235",
      "numeroPartiePLF": "2",
      "organeExamen": "PO717460",
      "mentionSecondeDeliberation": "0"
    }
  },
  "numeroLong": "II-1525",
  "etapeTexte": "1ère lecture (1ère assemblée saisie)",
  "triAmendement": "azrhzzzui",
  "cardinaliteAmdtMultiples": "1",
  "amendementParent": {
    "@xmlns:xsi": "http://www.w3.org/2001/XMLSchema-instance",
    "@xsi:nil": "true"
  },
  "etat": "Discuté",
  "signataires": {
    "auteur": {
      "typeAuteur": "Depute",
      "acteurRef": "PA720960",
      "organeRef": {
        "@xmlns:xsi": "http://www.w3.org/2001/XMLSchema-instance",
        "@xsi:nil": "true"
      },
      "groupePolitiqueRef": "PO730964"
    },
    "cosignataires": {
      "acteurRef": [
        "PA722344",
        "PA610681",
        "PA721046",
        "PA720968",
        "PA702052",
        "PA721036",
        "PA643145",
        "PA693008",
        "PA721094",
        "PA610775",
        "PA720900",
        "PA610733",
        "PA724827",
        "PA718978",
        "PA720960",
        "PA610667",
        "PA610634",
        "PA721644",
        "PA721070",
        "PA720976",
        "PA267901"
      ]
    },
    "texteAffichable": "M.&#160;Serva,  M.&#160;L&#233;na&#239;ck&#160;Adam, Mme&#160;Ali, M.&#160;Azerot, Mme&#160;Bareigts, Mme&#160;Bassire, Mme&#160;Benin, M.&#160;Dunoyer, M.&#160;Gom&#232;s, M.&#160;Julien-Laferriere, M.&#160;Kamardine, M.&#160;Kokouendo, M.&#160;Laqhila, M.&#160;Mathiasin, M.&#160;Polutele, Mme&#160;Ramassamy, Mme&#160;Rilhac, M.&#160;Thierry&#160;Robert, Mme&#160;Sage, M.&#160;Serville et Mme&#160;Vainqueur-Christophe"
  },
  "pointeurFragmentTexte": {
    "missionVisee": {
      "@xmlns:xsi": "http://www.w3.org/2001/XMLSchema-instance",
      "@xsi:nil": "true"
    },
    "division": {
      "titre": "Article 39",
      "articleDesignationCourte": "APRÈS ART. 39",
      "type": "ARTICLE",
      "avant_A_Apres": "Après",
      "divisionRattachee": "APRÈS L'ARTICLE 39, insérer l'article suivant:",
      "articleAdditionnel": "1",
      "chapitreAdditionnel": {
        "@xmlns:xsi": "http://www.w3.org/2001/XMLSchema-instance",
        "@xsi:nil": "true"
      },
      "urlDivisionTexteVise": "/15/textes/0235C.asp#D_Article_39"
    },
    "alinea": {
      "@xmlns:xsi": "http://www.w3.org/2001/XMLSchema-instance",
      "@xsi:nil": "true"
    }
  },
  "corps": {
    "dispositif": "<p style=\"text-align: justify;\"><span  data-cid=\"51\" data-userid=\"1562\" data-username=\"Geoffroy de Vitry d'Avaucourt\" data-time=\"1510491652846\">I.&#160;&#8211;&#160;</span>&#192; la fin du premier alin&#233;a du VI <i>ter</i> A<span  data-cid=\"4\" data-userid=\"1562\" data-username=\"Geoffroy de Vitry d'Avaucourt\" data-time=\"1510491576635\"> de l&#8217;article&#160;199 <i>terdecies</i>-0 A du code g&#233;n&#233;ral des imp&#244;ts</span>, <span  data-cid=\"36\" data-userid=\"1562\" data-username=\"Geoffroy de Vitry d'Avaucourt\" data-time=\"1510491613835\">les mots</span>&#160;: &#171;&#160;et dans les secteurs retenus pour l&#8217;application de la r&#233;duction d&#8217;imp&#244;t sur le revenu pr&#233;vue au I de l&#8217;article&#160;199 <i>undecies</i> B&#160;&#187; <span  data-cid=\"45\" data-userid=\"1562\" data-username=\"Geoffroy de Vitry d'Avaucourt\" data-time=\"1510491618332\">sont</span> supprim&#233;<span  data-cid=\"50\" data-userid=\"1562\" data-username=\"Geoffroy de Vitry d'Avaucourt\" data-time=\"1510491621202\">s</span>.</p><p style=\"text-align: justify;\">II.&#160;&#8211;&#160;Le I est applicable <span  data-cid=\"3\" data-userid=\"1562\" data-username=\"Geoffroy de Vitry d'Avaucourt\" data-time=\"1510588430915\">&#224; compter de l&#8217;imposition des revenus de l&#8217;ann&#233;e 2018</span>.</p><p style=\"text-align: justify;\">III.&#160;&#8211;&#160;La perte de recettes pour l&#8217;&#201;tat est compens&#233;e &#224; due concurrence par la cr&#233;ation d&#8217;une taxe additionnelle aux droits mentionn&#233;s aux articles 575 et 575 A du code g&#233;n&#233;ral des imp&#244;ts.&#160;&#187;</p>",
    "exposeSommaire": "<p style=\"text-align: justify;\">&#160;Les FIP-DOM constituent un instrument particuli&#232;rement efficace pour les PME et ont un effet direct sur l&#8217;&#233;conomie gr&#226;ce&#160;:</p><p style=\"text-align: justify;\">- &#224; l&#8217;effet de levier sur le bilan par l&#8217;augmentation des capacit&#233;s d&#8217;emprunt en proportion des montants investis en fonds propres et le maintien ou l&#8217;accroissement de l&#8217;emploi des entreprises concern&#233;es (environ 30 emplois pour 1 million d&#8217;euros investis)&#160;;</p><p style=\"text-align: justify;\">- au financement du besoin en fonds de roulement des entreprises permettant d&#8217;assumer leur exploitation ainsi que le paiement des taxes publiques directes et indirectes notamment des charges sociales et fiscales ainsi que l&#8217;octroi de mer.</p><p style=\"text-align: justify;\">Les FIP outre-mer sont pour l&#8217;instant limit&#233;s aux investissements au sein d&#8217;entreprises elles-m&#234;mes &#233;ligibles &#224; l&#8217;aide fiscale &#224; l&#8217;investissement Outre-Mer. Ces m&#234;mes entreprises sont g&#233;n&#233;ralement &#233;ligibles aux fonds&#160;Europ&#233;ens alors que les entreprises du commerce et des services ne sont &#233;ligibles &#224; aucune aide dans les DOM.</p><p style=\"text-align: justify;\">La loi &#233;galit&#233; r&#233;elle outre-mer a permis d&#8217;&#233;largir la r&#233;duction fiscale &#224; l&#8217;ensemble des contribuables afin de garantir une ressource suffisante.</p><p style=\"text-align: justify;\">L&#8217;objet de cet amendement est de lever un deuxi&#232;me verrou en ouvrant l&#8217;investissement &#224; l&#8217;ensemble des secteurs d&#8217;activit&#233;, compte tenu des handicaps permanents structurels qui caract&#233;risent ces territoires.</p>",
    "annexeExposeSommaire": {
      "@xmlns:xsi": "http://www.w3.org/2001/XMLSchema-instance",
      "@xsi:nil": "true"
    }
  },
  "representations": {
    "representation": {
      "nom": "PDF",
      "typeMime": {
        "type": "application",
        "subType": "PDF"
      },
      "statutRepresentation": {
        "verbatim": "true",
        "canonique": "true",
        "officielle": "true",
        "transcription": "false",
        "enregistrement": "false"
      },
      "repSource": {
        "@xmlns:xsi": "http://www.w3.org/2001/XMLSchema-instance",
        "@xsi:nil": "true"
      },
      "offset": {
        "@xmlns:xsi": "http://www.w3.org/2001/XMLSchema-instance",
        "@xsi:nil": "true"
      },
      "contenu": {
        "documentURI": "/15/amendements/0235C/AN/1525.pdf"
      },
      "dateDispoRepresentation": {
        "@xmlns:xsi": "http://www.w3.org/2001/XMLSchema-instance",
        "@xsi:nil": "true"
      }
    }
  },
  "seanceDiscussion": "RUANR5L15S2018IDS20766",
  "sort": {
    "dateSaisie": "2017-11-17T19:39:41.000+01:00",
    "sortEnSeance": "Rejeté"
  },
  "dateDepot": "2017-11-10T01:00:00.000+01:00",
  "dateDistribution": "2017-11-15T01:00:00.000+01:00",
  "article99": "0",
  "loiReference": {
    "codeLoi": "CGI",
    "divisionCodeLoi": "199 terdecies 0 A"
  }
}