{
  "@xmlns": "http://schemas.assemblee-nationale.fr/referentiel",
  "uid": "AMANR5L15PO59051B0714P0D1N404",
  "identifiant": {
    "legislature": "15",
    "numero": "404",
    "numRect": "0",
    "saisine": {
      "refTexteLegislatif": "PRJLANR5L15B0714",
      "numeroPartiePLF": "0",
      "organeExamen": "PO59051",
      "mentionSecondeDeliberation": "0"
    }
  },
  "numeroLong": "CL404",
  "etapeTexte": "1ère lecture (1ère assemblée saisie)",
  "triAmendement": "j",
  "cardinaliteAmdtMultiples": "1",
  "amendementParent": {
    "@xmlns:xsi": "http://www.w3.org/2001/XMLSchema-instance",
    "@xsi:nil": "true"
  },
  "etat": "Discuté",
  "signataires": {
    "auteur": {
      "typeAuteur": "Depute",
      "acteurRef": "PA719448",
      "organeRef": {
        "@xmlns:xsi": "http://www.w3.org/2001/XMLSchema-instance",
        "@xsi:nil": "true"
      },
      "groupePolitiqueRef": "PO730964"
    },
    "cosignataires": {
      "acteurRef": [
        "PA722054",
        "PA719624",
        "PA719558",
        "PA719448",
        "PA722252",
        "PA721742",
        "PA718860",
        "PA719806",
        "PA721384",
        "PA721296"
      ]
    },
    "texteAffichable": "Mme&#160;Chapelier,  Mme&#160;Hai, Mme&#160;Rixain, M.&#160;Gouffier-Cha, Mme&#160;Auconie, M.&#160;Balanant, Mme&#160;Taurine, Mme&#160;Florennes, Mme&#160;Fontenel-Personne et Mme&#160;Couillard"
  },
  "pointeurFragmentTexte": {
    "missionVisee": {
      "@xmlns:xsi": "http://www.w3.org/2001/XMLSchema-instance",
      "@xsi:nil": "true"
    },
    "division": {
      "titre": "Article 32",
      "articleDesignationCourte": "ART. 32",
      "type": "ARTICLE",
      "avant_A_Apres": "A",
      "divisionRattachee": "ARTICLE 32",
      "articleAdditionnel": {
        "@xmlns:xsi": "http://www.w3.org/2001/XMLSchema-instance",
        "@xsi:nil": "true"
      },
      "chapitreAdditionnel": {
        "@xmlns:xsi": "http://www.w3.org/2001/XMLSchema-instance",
        "@xsi:nil": "true"
      },
      "urlDivisionTexteVise": "/15/textes/0714.asp#D_Article_32"
    },
    "alinea": {
      "avant_A_Apres": {
        "@xmlns:xsi": "http://www.w3.org/2001/XMLSchema-instance",
        "@xsi:nil": "true"
      },
      "numero": "4",
      "alineaDesignation": {
        "@xmlns:xsi": "http://www.w3.org/2001/XMLSchema-instance",
        "@xsi:nil": "true"
      }
    }
  },
  "corps": {
    "dispositif": "<p style=\"text-align: justify;\">Apr&#232;s le mot&#160;:</p><p style=\"text-align: justify;\">&#171;&#160;est&#160;&#187;, </p><p style=\"text-align: justify;\">supprimer la fin de l&#8217;alin&#233;a&#160;4.</p>",
    "exposeSommaire": "<p style=\"text-align: justify;\">L&#8217;article L.&#160;316-3 du code de l'entr&#233;e et du s&#233;jour des &#233;trangers et du droit d'asile pr&#233;voit que &#171;&#160;l'autorit&#233; administrative d&#233;livre dans les plus brefs d&#233;lais une carte de s&#233;jour temporaire portant la mention \"&#160;vie priv&#233;e et familiale&#160;\" &#224; l'&#233;tranger qui b&#233;n&#233;ficie d'une ordonnance de protection en vertu de l'article&#160;515-9 du code civil, en raison des violences exerc&#233;es au sein du couple ou par un ancien conjoint, un ancien partenaire li&#233; par un pacte civil de solidarit&#233; ou un ancien concubin &#187;.</p><p style=\"text-align: justify;\">Cet amendement, issu de la recommandation n&#176;&#160;6 de la D&#233;l&#233;gation aux droits des femmes, propose de supprimer la condition suppl&#233;mentaire ajout&#233;e par l&#8217;alin&#233;a 4 de l&#8217;article 32 du pr&#233;sent projet de loi qui pr&#233;voit que pour pouvoir pr&#233;tendre &#224; cette carte de r&#233;sidence, l&#8217;&#233;tranger doit &#234;tre d&#233;tenteur d&#8217;une carte de s&#233;jour &#171; ordonnance de protection &#187; d&#233;livr&#233;e sur le fondement de l&#8217;article L.&#160;316&#8209;3.</p>",
    "annexeExposeSommaire": {
      "@xmlns:xsi": "http://www.w3.org/2001/XMLSchema-instance",
      "@xsi:nil": "true"
    }
  },
  "representations": {
    "representation": {
      "nom": "PDF",
      "typeMime": {
        "type": "application",
        "subType": "PDF"
      },
      "statutRepresentation": {
        "verbatim": "true",
        "canonique": "true",
        "officielle": "true",
        "transcription": "false",
        "enregistrement": "false"
      },
      "repSource": {
        "@xmlns:xsi": "http://www.w3.org/2001/XMLSchema-instance",
        "@xsi:nil": "true"
      },
      "offset": {
        "@xmlns:xsi": "http://www.w3.org/2001/XMLSchema-instance",
        "@xsi:nil": "true"
      },
      "contenu": {
        "documentURI": "/15/amendements/0714/CION_LOIS/CL404.pdf"
      },
      "dateDispoRepresentation": {
        "@xmlns:xsi": "http://www.w3.org/2001/XMLSchema-instance",
        "@xsi:nil": "true"
      }
    }
  },
  "seanceDiscussion": {
    "@xmlns:xsi": "http://www.w3.org/2001/XMLSchema-instance",
    "@xsi:nil": "true"
  },
  "sort": {
    "dateSaisie": "2018-04-06T19:55:56.000+02:00",
    "sortEnSeance": "Retiré"
  },
  "dateDepot": "2018-03-30T02:00:00.000+02:00",
  "dateDistribution": "2018-04-03T02:00:00.000+02:00",
  "article99": "0",
  "loiReference": {
    "codeLoi": {
      "@xmlns:xsi": "http://www.w3.org/2001/XMLSchema-instance",
      "@xsi:nil": "true"
    },
    "divisionCodeLoi": {
      "@xmlns:xsi": "http://www.w3.org/2001/XMLSchema-instance",
      "@xsi:nil": "true"
    }
  }
}