{
  "@xmlns": "http://schemas.assemblee-nationale.fr/referentiel",
  "uid": "AMANR5L15PO419865B0627P0D1N173",
  "identifiant": {
    "legislature": "15",
    "numero": "173",
    "numRect": "0",
    "saisine": {
      "refTexteLegislatif": "PRJLANR5L15B0627",
      "numeroPartiePLF": "0",
      "organeExamen": "PO419865",
      "mentionSecondeDeliberation": "0"
    }
  },
  "numeroLong": "CD173",
  "etapeTexte": "1ère lecture (1ère assemblée saisie)",
  "triAmendement": "sw",
  "cardinaliteAmdtMultiples": "1",
  "amendementParent": {
    "@xmlns:xsi": "http://www.w3.org/2001/XMLSchema-instance",
    "@xsi:nil": "true"
  },
  "etat": "Discuté",
  "signataires": {
    "auteur": {
      "typeAuteur": "Depute",
      "acteurRef": "PA718894",
      "organeRef": {
        "@xmlns:xsi": "http://www.w3.org/2001/XMLSchema-instance",
        "@xsi:nil": "true"
      },
      "groupePolitiqueRef": "PO730964"
    },
    "cosignataires": {
      "acteurRef": "PA718894"
    },
    "texteAffichable": "M.&#160;Dombreval"
  },
  "pointeurFragmentTexte": {
    "missionVisee": {
      "@xmlns:xsi": "http://www.w3.org/2001/XMLSchema-instance",
      "@xsi:nil": "true"
    },
    "division": {
      "titre": "Article 13",
      "articleDesignationCourte": "ART. 13",
      "type": "ARTICLE",
      "avant_A_Apres": "A",
      "divisionRattachee": "ARTICLE 13",
      "articleAdditionnel": {
        "@xmlns:xsi": "http://www.w3.org/2001/XMLSchema-instance",
        "@xsi:nil": "true"
      },
      "chapitreAdditionnel": {
        "@xmlns:xsi": "http://www.w3.org/2001/XMLSchema-instance",
        "@xsi:nil": "true"
      },
      "urlDivisionTexteVise": "/15/textes/0627.asp#D_Article_13"
    },
    "alinea": {
      "avant_A_Apres": "Apres",
      "numero": "5",
      "alineaDesignation": {
        "@xmlns:xsi": "http://www.w3.org/2001/XMLSchema-instance",
        "@xsi:nil": "true"
      }
    }
  },
  "corps": {
    "dispositif": "<p style=\"text-align: justify;\">Compl&#233;ter cet article par les deux alin&#233;as suivants&#160;:</p><p style=\"text-align: justify;\">&#171;&#160;III. - La viande provenant des parties non consacr&#233;es des carcasses issues d&#8217;animaux abattus rituellement, et les r&#233;formes de viande issue d&#8217;animaux abattus rituellement, qui sont r&#233;introduites dans la fili&#232;re conventionnelle, sont soumises &#224; un obligation d&#8217;&#233;tiquetage affichant la mention \"&#160;r&#233;forme d&#8217;abattage rituel&#160;\" &#224; l&#8217;occasion de leur mise sur le march&#233;.</p><p style=\"text-align: justify;\">&#171;&#160;Un d&#233;cret du ministre charg&#233; de l&#8217;agriculture en fixe les modalit&#233;s d&#8217;application.&#160;&#187;</p>",
    "exposeSommaire": "<p style=\"text-align: justify;\">Aujourd&#8217;hui, la r&#233;glementation en vigueur pr&#233;voit l&#8217;obligation d&#8217;un &#233;tourdissement pr&#233;alable &#224; la saign&#233;e et &#224; la mise &#224; mort des animaux en abattoirs, m&#234;me si cette obligation s&#8217;av&#232;re mal appliqu&#233;e, elle en demeure la r&#232;gle. R&#232;gle qui souffre n&#233;anmoins d&#8217;une d&#233;rogation de taille accord&#233;e jusqu&#8217;ici &#224; l&#8217;abattage rituel, pour lequel aucun &#233;tourdissement pr&#233;alable n&#8217;est respect&#233;. La saign&#233;e et la mise &#224; mort par exsanguination est source d&#8217;une souffrance et d&#8217;une douleur suppl&#233;mentaire &#233;vidente et scientifiquement d&#233;montr&#233;e. Si l&#8217;on peut admettre que cette d&#233;rogation vise &#224; satisfaire aux besoins de viandes consacr&#233;es, et que l&#8217;on doive respecter let permettre l&#8217;exercice d&#8217;une foi religieuse et l&#8217;observance de ses pr&#233;ceptes, &#224; l&#8217;inverse, la la&#239;cit&#233; doit nous imposer de permettre &#224; nos concitoyens qui ne partagent pas cette foi, et qui ne cautionnent pas un mode d&#8217;abattage se soustrayant aux r&#232;gles du bien-&#234;tre animal d&#8217;&#234;tre en mesure de ne pas consommer de la viande issue d&#8217;abattage rituel.</p><p style=\"text-align: justify;\">De plus, au-del&#224; donc de la pratique elle-m&#234;me, l&#8217;abattage rituel sans &#233;tourdissement suscite de vives pol&#233;miques parce qu&#8217;il serait &#224; l&#8217;origine de nombreuses d&#233;rives pour des motifs purement &#233;conomiques. Ainsi, en d&#233;pit des mesures prises pour pr&#233;venir tout d&#233;tournement des r&#232;gles en vigueur (autorisation pr&#233;alable de mise en &#339;uvre de la d&#233;rogation, obligation d&#8217;enregistrement des commandes ou des ventes n&#233;cessitant un abattage d&#233;rogatoire, formation et habilitation des sacrificateurs&#8230;), il s&#8217;av&#232;re que le nombre d&#8217;animaux abattus sans &#233;tourdissement est largement sup&#233;rieur aux besoins des consommateurs de viandes consacr&#233;es et que ce surplus est r&#233;introduit dans la fili&#232;re conventionnelle. On estime ainsi &#224; plus de 20&#160;% le nombre d&#8217;animaux abattus selon des rites cultuels.</p><p style=\"text-align: justify;\">L&#8217;objet de cet amendement est donc d&#8217;imposer un &#233;tiquetage &#171;&#160;r&#233;forme d&#8217;abattage rituel&#160;&#187; sur la viande r&#233;form&#233;e ou disqualifi&#233;e. Il s&#8217;agit de la viande issue de parties non consacr&#233;es (les quartiers arri&#232;res d&#8217;animaux abattus selon le rite casher d&#8217;animaux abattus selon le rite casher d&#8217;animaux abattus selon le rite casher d&#8217;animaux abattus selon le rite casher qui ne consacre que l&#8217;avant), la viande r&#233;form&#233;e apr&#232;s inspection (par exemple quand les poumons s&#8217;av&#232;rent perfor&#233;s la viande n&#8217;est finalement pas consacr&#233;e et labellis&#233;e). Cette viande qui est r&#233;introduite dans la fili&#232;re conventionnelle et mise sur le march&#233;, doit &#234;tre tra&#231;able pour que les consommateurs soient libres, par leur consommation avertie, de cautionner ou non ce mode d&#8217;abattage qui aujourd&#8217;hui ne correspond pas &#224; la meilleure application du respect du bien-&#234;tre animal en abattoir.</p>",
    "annexeExposeSommaire": {
      "@xmlns:xsi": "http://www.w3.org/2001/XMLSchema-instance",
      "@xsi:nil": "true"
    }
  },
  "representations": {
    "representation": {
      "nom": "PDF",
      "typeMime": {
        "type": "application",
        "subType": "PDF"
      },
      "statutRepresentation": {
        "verbatim": "true",
        "canonique": "true",
        "officielle": "true",
        "transcription": "false",
        "enregistrement": "false"
      },
      "repSource": {
        "@xmlns:xsi": "http://www.w3.org/2001/XMLSchema-instance",
        "@xsi:nil": "true"
      },
      "offset": {
        "@xmlns:xsi": "http://www.w3.org/2001/XMLSchema-instance",
        "@xsi:nil": "true"
      },
      "contenu": {
        "documentURI": "/15/amendements/0627/CION-DVP/CD173.pdf"
      },
      "dateDispoRepresentation": {
        "@xmlns:xsi": "http://www.w3.org/2001/XMLSchema-instance",
        "@xsi:nil": "true"
      }
    }
  },
  "seanceDiscussion": {
    "@xmlns:xsi": "http://www.w3.org/2001/XMLSchema-instance",
    "@xsi:nil": "true"
  },
  "sort": {
    "dateSaisie": "2018-03-29T11:00:22.000+02:00",
    "sortEnSeance": "Retiré"
  },
  "dateDepot": "2018-03-22T01:00:00.000+01:00",
  "dateDistribution": "2018-03-26T02:00:00.000+02:00",
  "article99": "0",
  "loiReference": {
    "codeLoi": {
      "@xmlns:xsi": "http://www.w3.org/2001/XMLSchema-instance",
      "@xsi:nil": "true"
    },
    "divisionCodeLoi": {
      "@xmlns:xsi": "http://www.w3.org/2001/XMLSchema-instance",
      "@xsi:nil": "true"
    }
  }
}