{
  "@xmlns": "http://schemas.assemblee-nationale.fr/referentiel",
  "uid": "AMANR5L15SEA717460B2272P1D1N2319",
  "identifiant": {
    "legislature": "15",
    "numero": "2319",
    "numRect": "0",
    "saisine": {
      "refTexteLegislatif": "PRJLANR5L15B2272",
      "numeroPartiePLF": "1",
      "organeExamen": "PO717460",
      "mentionSecondeDeliberation": "0"
    }
  },
  "numeroLong": "I-2319",
  "etapeTexte": "1ère lecture (1ère assemblée saisie)",
  "triAmendement": "daaaaaaaaaaaaaaaaaaaaaaaaaaaaaaaaaaaaaaaaaaaaaaaaaaddhzo",
  "cardinaliteAmdtMultiples": "1",
  "amendementParent": {
    "@xmlns:xsi": "http://www.w3.org/2001/XMLSchema-instance",
    "@xsi:nil": "true"
  },
  "etat": "Discuté",
  "signataires": {
    "auteur": {
      "typeAuteur": "Depute",
      "acteurRef": "PA720644",
      "organeRef": {
        "@xmlns:xsi": "http://www.w3.org/2001/XMLSchema-instance",
        "@xsi:nil": "true"
      },
      "groupePolitiqueRef": "PO730934"
    },
    "cosignataires": {
      "acteurRef": "PA720644"
    },
    "texteAffichable": "M.&#160;Nury"
  },
  "pointeurFragmentTexte": {
    "missionVisee": {
      "@xmlns:xsi": "http://www.w3.org/2001/XMLSchema-instance",
      "@xsi:nil": "true"
    },
    "division": {
      "titre": "Article 13",
      "articleDesignationCourte": "APRÈS ART. 13",
      "type": "ARTICLE",
      "avant_A_Apres": "Après",
      "divisionRattachee": "APRÈS L'ARTICLE 13, insérer l'article suivant:",
      "articleAdditionnel": "1",
      "chapitreAdditionnel": {
        "@xmlns:xsi": "http://www.w3.org/2001/XMLSchema-instance",
        "@xsi:nil": "true"
      },
      "urlDivisionTexteVise": "/15/textes/2272A.asp#D_Article_13"
    },
    "alinea": {
      "@xmlns:xsi": "http://www.w3.org/2001/XMLSchema-instance",
      "@xsi:nil": "true"
    }
  },
  "corps": {
    "dispositif": "<p style=\"text-align: justify;\">I.&#160;&#8211;&#160;&#192; la fin du second alin&#233;a du VI de l&#8217;article&#160;69 du code g&#233;n&#233;ral des imp&#244;ts, le mot&#160;: &#171;&#160;cinq&#160;&#187; est remplac&#233; par le mot&#160;: &#171;&#160;trois&#160;&#187;.</p><p style=\"text-align: justify;\">II.&#160;&#8211;&#160;La perte de recettes r&#233;sultant pour l&#8217;&#201;tat du I est compens&#233;e, &#224; due concurrence, par la cr&#233;ation d&#8217;une taxe additionnelle aux droits pr&#233;vus aux articles 575 et 575 A du code g&#233;n&#233;ral des imp&#244;ts.</p>",
    "exposeSommaire": "<p>Le r&#233;gime fiscal qui s&#8217;applique aux contrats d&#8217;int&#233;gration pr&#233;voit que les recettes provenant des op&#233;rations d&#8217;&#233;levage ou de culture portant sur des animaux ou des produits appartenant &#224; des tiers sont multipli&#233;es par cinq.&#160; Au titre de ces contrats, les entreprises de production fournissent l&#8217;aliment et se chargent de la commercialisation des animaux ainsi engraiss&#233;s. L&#8217;exploitant agricole reste propri&#233;taire des installations d&#8217;&#233;levage et est r&#233;mun&#233;r&#233; pour une prestation d&#8217;&#233;levage dont il assume le poids &#233;conomique des investissements et en partie les risques.&#160;</p><p style=\"text-align: justify;\">Le coefficient multiplicateur &#233;tait justifi&#233; par l&#8217;objectif de neutralit&#233; fiscale entre les diff&#233;rents types d&#8217;exploitations&#160;: les producteurs int&#233;gr&#233;s avaient un chiffre d&#8217;affaires nettement sup&#233;rieur &#224; ceux qui vendent leur production. Or, il n&#8217;existe plus, &#224; ce jour, de diff&#233;rences significatives qui justifieraient la diff&#233;rence de traitement fiscal selon le mode de production et le maintien de ce coefficient multiplicateur.</p><p style=\"text-align: justify;\">La p&#233;rennit&#233; de la fili&#232;re fran&#231;aise d&#233;pend de sa capacit&#233; &#224; maintenir son potentiel de production, aujourd&#8217;hui ob&#233;r&#233; par une fiscalit&#233; dissuasive qui affecte les capacit&#233;s d&#8217;investissement notamment dans les installations d&#8217;&#233;levage. L&#8217;am&#233;lioration et la modernisation des conditions d&#8217;&#233;levage est un facteur de durabilit&#233; &#233;conomique de la fili&#232;re. Ainsi, la production de veaux, &#224; 90&#160;% r&#233;alis&#233;e sous contrat d&#8217;int&#233;gration entre les soci&#233;t&#233;s de production et les &#233;leveurs, est indissociable de la production laiti&#232;re et concourt &#224; l&#8217;&#233;quilibre de cette derni&#232;re. Redonner de l&#8217;attrait &#224; la production sous int&#233;gration permettrait de renforcer la fili&#232;re bovine (lait, viande) dans son ensemble et de favoriser l&#8217;investissement, gage de r&#233;silience et de transmissibilit&#233; des exploitations.&#160;</p><p style=\"text-align: justify;\">Le pr&#233;sent amendement propose de r&#233;viser la fiscalit&#233; appliqu&#233;e aux &#233;leveurs int&#233;gr&#233;s afin de favoriser le maintien de la comp&#233;titivit&#233; et la transmission de ces exploitations. Il est propos&#233; d&#8217;abaisser le coefficient multiplicateur de deux points, c&#8217;est-&#224;-dire de le faire passer &#224; trois.</p>",
    "annexeExposeSommaire": {
      "@xmlns:xsi": "http://www.w3.org/2001/XMLSchema-instance",
      "@xsi:nil": "true"
    },
    "cartoucheDelaiDepotDepasse": {
      "@xmlns:xsi": "http://www.w3.org/2001/XMLSchema-instance",
      "@xsi:nil": "true"
    },
    "avantAppel": {
      "@xmlns:xsi": "http://www.w3.org/2001/XMLSchema-instance",
      "@xsi:nil": "true"
    }
  },
  "representations": {
    "representation": {
      "nom": "PDF",
      "typeMime": {
        "type": "application",
        "subType": "PDF"
      },
      "statutRepresentation": {
        "verbatim": "true",
        "canonique": "true",
        "officielle": "true",
        "transcription": "false",
        "enregistrement": "false"
      },
      "repSource": {
        "@xmlns:xsi": "http://www.w3.org/2001/XMLSchema-instance",
        "@xsi:nil": "true"
      },
      "offset": {
        "@xmlns:xsi": "http://www.w3.org/2001/XMLSchema-instance",
        "@xsi:nil": "true"
      },
      "contenu": {
        "documentURI": "/15/amendements/2272A/AN/2319.pdf"
      },
      "dateDispoRepresentation": {
        "@xmlns:xsi": "http://www.w3.org/2001/XMLSchema-instance",
        "@xsi:nil": "true"
      }
    }
  },
  "seanceDiscussion": "RUANR5L15S2020IDS21871",
  "sort": {
    "dateSaisie": "2019-10-18T22:56:10.000+02:00",
    "sortEnSeance": "Non soutenu"
  },
  "dateDepot": "2019-10-10T02:00:00.000+02:00",
  "dateDistribution": "2019-10-17T02:00:00.000+02:00",
  "article99": "0",
  "loiReference": {
    "codeLoi": "CGI",
    "divisionCodeLoi": "69"
  }
}