{
  "@xmlns": "http://schemas.assemblee-nationale.fr/referentiel",
  "uid": "AMANR5L15PO419865B2274P0D1N292",
  "identifiant": {
    "legislature": "15",
    "numero": "292",
    "numRect": "0",
    "saisine": {
      "refTexteLegislatif": "PRJLANR5L15B2274",
      "numeroPartiePLF": "0",
      "organeExamen": "PO419865",
      "mentionSecondeDeliberation": "0"
    }
  },
  "numeroLong": "CD292",
  "etapeTexte": "1ère lecture (2ème assemblée saisie)",
  "triAmendement": "icaaaaaaaaaaaaaaaaaaaaaaaaaaaaaaaaaaaaaaaaaaaaaaaalg",
  "cardinaliteAmdtMultiples": "1",
  "amendementParent": {
    "@xmlns:xsi": "http://www.w3.org/2001/XMLSchema-instance",
    "@xsi:nil": "true"
  },
  "etat": "En traitement",
  "signataires": {
    "auteur": {
      "typeAuteur": "Depute",
      "acteurRef": "PA330909",
      "organeRef": {
        "@xmlns:xsi": "http://www.w3.org/2001/XMLSchema-instance",
        "@xsi:nil": "true"
      },
      "groupePolitiqueRef": "PO730934"
    },
    "cosignataires": {
      "acteurRef": [
        "PA643089",
        "PA267260",
        "PA712015",
        "PA718850",
        "PA267527",
        "PA719318",
        "PA2155",
        "PA721678",
        "PA334654",
        "PA608016",
        "PA722390",
        "PA609245",
        "PA267429",
        "PA718838",
        "PA266793",
        "PA1630",
        "PA718884",
        "PA330909",
        "PA720210",
        "PA340853",
        "PA267735",
        "PA267204"
      ]
    },
    "texteAffichable": "M.&#160;Descoeur,  Mme&#160;Beauvais, Mme&#160;Lacroute, M.&#160;Sermier, M.&#160;Cinieri, M.&#160;Dive, M.&#160;Menuel, M.&#160;Thi&#233;riot, M.&#160;Straumann, Mme&#160;Louwagie, M.&#160;Reda, M.&#160;Leclerc, Mme&#160;Bazin-Malgras, Mme&#160;Anthoine, M.&#160;Bony, M.&#160;Herbillon, Mme&#160;Corneloup, M.&#160;de Ganay, M.&#160;Cordier, Mme&#160;Poletti, M.&#160;Saddier et M.&#160;Brun"
  },
  "pointeurFragmentTexte": {
    "missionVisee": {
      "@xmlns:xsi": "http://www.w3.org/2001/XMLSchema-instance",
      "@xsi:nil": "true"
    },
    "division": {
      "titre": "Article 9",
      "articleDesignationCourte": "ART. 9",
      "type": "ARTICLE",
      "avant_A_Apres": "A",
      "divisionRattachee": "ARTICLE 9",
      "articleAdditionnel": {
        "@xmlns:xsi": "http://www.w3.org/2001/XMLSchema-instance",
        "@xsi:nil": "true"
      },
      "chapitreAdditionnel": {
        "@xmlns:xsi": "http://www.w3.org/2001/XMLSchema-instance",
        "@xsi:nil": "true"
      },
      "urlDivisionTexteVise": "/15/textes/2274.asp#D_Article_9"
    },
    "alinea": {
      "avant_A_Apres": {
        "@xmlns:xsi": "http://www.w3.org/2001/XMLSchema-instance",
        "@xsi:nil": "true"
      },
      "numero": "15",
      "alineaDesignation": {
        "@xmlns:xsi": "http://www.w3.org/2001/XMLSchema-instance",
        "@xsi:nil": "true"
      }
    }
  },
  "corps": {
    "dispositif": "<p style=\"text-align: justify;\">Modifier ainsi l&#8217;alin&#233;a&#160;15&#160;:</p><p style=\"text-align: justify;\">1&#176;&#160;&#192; la premi&#232;re phrase, apr&#232;s le mot&#160;:</p><p style=\"text-align: justify;\">&#171;&#160;recycl&#233;e&#160;&#187;,</p><p style=\"text-align: justify;\">ins&#233;rer les mots&#160;:</p><p style=\"text-align: justify;\">&#171;&#160;ou issue de la biomasse&#160;&#187;&#160;;</p><p style=\"text-align: justify;\">2&#176;&#160;&#192; la m&#234;me phrase, apr&#232;s le mot&#160;:</p><p style=\"text-align: justify;\">&#171;&#160;recyclabilit&#233;&#160;&#187;,</p><p style=\"text-align: justify;\">ins&#233;rer les mots&#160;:</p><p style=\"text-align: justify;\">&#171;&#160;et la renouvelabilit&#233;&#160;&#187;.&#160;</p>",
    "exposeSommaire": "<p style=\"text-align: justify;\">L&#8217;utilisation de ressources renouvelables issues de la biomasse pour fabriquer des produits est circulaire par nature, et peut contribuer &#224; l&#8217;atteinte des objectifs du pr&#233;sent projet de loi&#160;: elle permet la r&#233;duction de l&#8217;empreinte environnementale des produits, par la captation de CO2 au moment de leur fabrication et par la non-utilisation de ressources fossiles &#233;puisables.</p><p style=\"text-align: justify;\">De plus une &#233;conomie, m&#234;me circulaire, aura toujours besoin d&#8217;apport de mati&#232;res vierges&#160;: le recours aux mati&#232;res renouvelables permettra ainsi de compl&#233;ter les besoins en mati&#232;res en minimisant le recours aux ressources fossiles.</p><p style=\"text-align: justify;\">Le d&#233;veloppement de l&#8217;utilisation de ce type de ressource pour la fabrication de produits est donc un des objets de ce texte, avec le recyclage. Aux articles 1 et 8, l&#8217;emploi de ressources renouvelables fait ainsi partie des crit&#232;res de performance environnementale des produits, &#224; c&#244;t&#233; de l&#8217;incorporation de mati&#232;re recycl&#233;e.</p><p style=\"text-align: justify;\">Cet amendement vise &#224; promouvoir la transition vers une bio&#233;conomie circulaire dans le domaine des emballages, en introduisant une &#233;quivalence entre la mati&#232;re recycl&#233;e et celle issue de la biomasse dans le plan de pr&#233;vention et d&#8217;&#233;co-conception que devront transmettre &#224; l&#8217;autorit&#233; administrative les producteurs mettant sur le march&#233; des emballages mentionn&#233;s aux 1&#176;&#160;et 2&#176;&#160;de l&#8217;article L541&#8209;10&#8209;1.</p>",
    "annexeExposeSommaire": {
      "@xmlns:xsi": "http://www.w3.org/2001/XMLSchema-instance",
      "@xsi:nil": "true"
    },
    "cartoucheDelaiDepotDepasse": "Sous réserve de son traitement par les services de l'Assemblée nationale et de sa recevabilité",
    "avantAppel": {
      "@xmlns:xsi": "http://www.w3.org/2001/XMLSchema-instance",
      "@xsi:nil": "true"
    }
  },
  "representations": {
    "representation": {
      "nom": "PDF",
      "typeMime": {
        "type": "application",
        "subType": "PDF"
      },
      "statutRepresentation": {
        "verbatim": "true",
        "canonique": "true",
        "officielle": "true",
        "transcription": "false",
        "enregistrement": "false"
      },
      "repSource": {
        "@xmlns:xsi": "http://www.w3.org/2001/XMLSchema-instance",
        "@xsi:nil": "true"
      },
      "offset": {
        "@xmlns:xsi": "http://www.w3.org/2001/XMLSchema-instance",
        "@xsi:nil": "true"
      },
      "contenu": {
        "documentURI": "/15/amendements/2274/CION-DVP/CD292.pdf"
      },
      "dateDispoRepresentation": {
        "@xmlns:xsi": "http://www.w3.org/2001/XMLSchema-instance",
        "@xsi:nil": "true"
      }
    }
  },
  "seanceDiscussion": {
    "@xmlns:xsi": "http://www.w3.org/2001/XMLSchema-instance",
    "@xsi:nil": "true"
  },
  "sort": {
    "@xmlns:xsi": "http://www.w3.org/2001/XMLSchema-instance",
    "@xsi:nil": "true"
  },
  "dateDepot": "2019-11-18T01:00:00.000+01:00",
  "dateDistribution": {
    "@xmlns:xsi": "http://www.w3.org/2001/XMLSchema-instance",
    "@xsi:nil": "true"
  },
  "article99": "0",
  "loiReference": {
    "codeLoi": {
      "@xmlns:xsi": "http://www.w3.org/2001/XMLSchema-instance",
      "@xsi:nil": "true"
    },
    "divisionCodeLoi": {
      "@xmlns:xsi": "http://www.w3.org/2001/XMLSchema-instance",
      "@xsi:nil": "true"
    }
  }
}