{
  "@xmlns": "http://schemas.assemblee-nationale.fr/referentiel",
  "uid": "AMANR5L15SEA717460BTC0164P0D1N91",
  "identifiant": {
    "legislature": "15",
    "numero": "91",
    "numRect": "0",
    "saisine": {
      "refTexteLegislatif": "PRJLANR5L15BTC0164",
      "numeroPartiePLF": "0",
      "organeExamen": "PO717460",
      "mentionSecondeDeliberation": "0"
    }
  },
  "numeroLong": "91",
  "etapeTexte": "1ère lecture (2ème assemblée saisie)",
  "triAmendement": "gq",
  "cardinaliteAmdtMultiples": "1",
  "amendementParent": {
    "@xmlns:xsi": "http://www.w3.org/2001/XMLSchema-instance",
    "@xsi:nil": "true"
  },
  "etat": "Discuté",
  "signataires": {
    "auteur": {
      "typeAuteur": "Depute",
      "acteurRef": "PA713448",
      "organeRef": {
        "@xmlns:xsi": "http://www.w3.org/2001/XMLSchema-instance",
        "@xsi:nil": "true"
      },
      "groupePolitiqueRef": "PO730952"
    },
    "cosignataires": {
      "acteurRef": [
        "PA722030",
        "PA267585",
        "PA713448",
        "PA266788",
        "PA693008",
        "PA332228",
        "PA695100",
        "PA267042",
        "PA267330",
        "PA421348",
        "PA642868",
        "PA712014"
      ]
    },
    "texteAffichable": "Mme&#160;Brenier,  M.&#160;Morel-&#192;-L&apos;Huissier, M.&#160;Benoit, M.&#160;Bournazel, M.&#160;Christophe, M.&#160;Favennec Becot, M.&#160;Meyer&#160;Habib, M.&#160;Ledoux, M.&#160;Polutele, M.&#160;Vercamer, M.&#160;Villiers et M.&#160;Zumkeller"
  },
  "pointeurFragmentTexte": {
    "missionVisee": {
      "@xmlns:xsi": "http://www.w3.org/2001/XMLSchema-instance",
      "@xsi:nil": "true"
    },
    "division": {
      "titre": "Article 4",
      "articleDesignationCourte": "ART. 4",
      "type": "ARTICLE",
      "avant_A_Apres": "A",
      "divisionRattachee": "ARTICLE 4",
      "articleAdditionnel": {
        "@xmlns:xsi": "http://www.w3.org/2001/XMLSchema-instance",
        "@xsi:nil": "true"
      },
      "chapitreAdditionnel": {
        "@xmlns:xsi": "http://www.w3.org/2001/XMLSchema-instance",
        "@xsi:nil": "true"
      },
      "urlDivisionTexteVise": "/15/textes/0164.asp#D_Article_4"
    },
    "alinea": {
      "avant_A_Apres": {
        "@xmlns:xsi": "http://www.w3.org/2001/XMLSchema-instance",
        "@xsi:nil": "true"
      },
      "numero": "12",
      "alineaDesignation": {
        "@xmlns:xsi": "http://www.w3.org/2001/XMLSchema-instance",
        "@xsi:nil": "true"
      }
    }
  },
  "corps": {
    "dispositif": "<p>Supprimer l&#8217;alin&#233;a&#160;12.</p>",
    "exposeSommaire": "<p style=\"text-align: justify;\">Cet alin&#233;a conduit &#224; restreindre les visites et saisies entre 21 heures et 6 heures du matin. Or le projet de loi permet aux agents qui lors d&#8217;une visite d&#233;couvrent l&#8217;existence d&#8217;autres lieux r&#233;pondant aux conditions de l&#8217;article L.&#160;229&#8209;1 de proc&#233;der sans d&#233;lai &#224; la visite de ces lieux. Il convient donc par coh&#233;rence de leur permettre de proc&#233;der &#224; ces visites sans restrictions horaires eu &#233;gard &#224; la menace &#233;ventuelle.</p>",
    "annexeExposeSommaire": {
      "@xmlns:xsi": "http://www.w3.org/2001/XMLSchema-instance",
      "@xsi:nil": "true"
    }
  },
  "representations": {
    "representation": {
      "nom": "PDF",
      "typeMime": {
        "type": "application",
        "subType": "PDF"
      },
      "statutRepresentation": {
        "verbatim": "true",
        "canonique": "true",
        "officielle": "true",
        "transcription": "false",
        "enregistrement": "false"
      },
      "repSource": {
        "@xmlns:xsi": "http://www.w3.org/2001/XMLSchema-instance",
        "@xsi:nil": "true"
      },
      "offset": {
        "@xmlns:xsi": "http://www.w3.org/2001/XMLSchema-instance",
        "@xsi:nil": "true"
      },
      "contenu": {
        "documentURI": "/15/amendements/0164/AN/91.pdf"
      },
      "dateDispoRepresentation": {
        "@xmlns:xsi": "http://www.w3.org/2001/XMLSchema-instance",
        "@xsi:nil": "true"
      }
    }
  },
  "seanceDiscussion": "RUANR5L15S2017IDS20672",
  "sort": {
    "dateSaisie": "2017-09-27T16:54:45.000+02:00",
    "sortEnSeance": "Non soutenu"
  },
  "dateDepot": "2017-09-20T02:00:00.000+02:00",
  "dateDistribution": "2017-09-22T02:00:00.000+02:00",
  "article99": "0",
  "loiReference": {
    "codeLoi": {
      "@xmlns:xsi": "http://www.w3.org/2001/XMLSchema-instance",
      "@xsi:nil": "true"
    },
    "divisionCodeLoi": {
      "@xmlns:xsi": "http://www.w3.org/2001/XMLSchema-instance",
      "@xsi:nil": "true"
    }
  }
}