{
  "@xmlns": "http://schemas.assemblee-nationale.fr/referentiel",
  "uid": "AMANR5L15PO59048B1255P2D1N1303",
  "identifiant": {
    "legislature": "15",
    "numero": "1303",
    "numRect": "0",
    "saisine": {
      "refTexteLegislatif": "PRJLANR5L15B1255",
      "numeroPartiePLF": "2",
      "organeExamen": "PO59048",
      "mentionSecondeDeliberation": "0"
    }
  },
  "numeroLong": "II-CF1303",
  "etapeTexte": "1ère lecture (1ère assemblée saisie)",
  "triAmendement": "kbaaaaaaaaaaaaaaaaaaaaaaaaaaaaaaaaaaaaaaaaaaaaaaaaaky",
  "cardinaliteAmdtMultiples": "1",
  "amendementParent": {
    "@xmlns:xsi": "http://www.w3.org/2001/XMLSchema-instance",
    "@xsi:nil": "true"
  },
  "etat": "Discuté",
  "signataires": {
    "auteur": {
      "typeAuteur": "Depute",
      "acteurRef": "PA719286",
      "organeRef": {
        "@xmlns:xsi": "http://www.w3.org/2001/XMLSchema-instance",
        "@xsi:nil": "true"
      },
      "groupePolitiqueRef": "PO759900"
    },
    "cosignataires": {
      "acteurRef": [
        "PA719146",
        "PA719286",
        "PA719138"
      ]
    },
    "texteAffichable": "M.&#160;Colombani,  M.&#160;Acquaviva et M.&#160;Castellani"
  },
  "pointeurFragmentTexte": {
    "missionVisee": {
      "@xmlns:xsi": "http://www.w3.org/2001/XMLSchema-instance",
      "@xsi:nil": "true"
    },
    "division": {
      "titre": "Article 60",
      "articleDesignationCourte": "APRÈS ART. 60",
      "type": "ARTICLE",
      "avant_A_Apres": "Après",
      "divisionRattachee": "APRÈS L'ARTICLE 60, insérer l'article suivant:",
      "articleAdditionnel": "1",
      "chapitreAdditionnel": {
        "@xmlns:xsi": "http://www.w3.org/2001/XMLSchema-instance",
        "@xsi:nil": "true"
      },
      "urlDivisionTexteVise": "/15/textes/1255C.asp#D_Article_60"
    },
    "alinea": {
      "@xmlns:xsi": "http://www.w3.org/2001/XMLSchema-instance",
      "@xsi:nil": "true"
    }
  },
  "corps": {
    "dispositif": "<p style=\"text-align: justify;\">I. Au II de l&#8217;article&#160;266 sexies du code des douanes, apr&#232;s l&#8217;alin&#233;a&#160;1 septies, ins&#233;rer un alin&#233;a&#160;1 octies ainsi r&#233;dig&#233;&#160;:&#160;</p><p style=\"text-align: justify;\">&#171;&#160;1 octies. Aux r&#233;ceptions de d&#233;chets m&#233;nagers et assimil&#233;s collect&#233;s au titre du service public de gestion des d&#233;chets d&#233;fini aux articles L.&#160;2224&#8209;13 et L.&#160;2224&#8209;14 du code g&#233;n&#233;ral des collectivit&#233;s territoriales, dans une limite annuelle correspondant &#224; 120 kilogrammes de d&#233;chets par habitant collect&#233;.&#160;&#187;</p><p style=\"text-align: justify;\">II. La perte de recettes pour l&#8217;&#201;tat est compens&#233;e, &#224; due concurrence, par la cr&#233;ation d&#8217;une taxe additionnelle aux droits pr&#233;vus aux articles 575 et 575 A du code g&#233;n&#233;ral des imp&#244;ts.</p><p style=\"text-align: justify;\">III. Les I et II du pr&#233;sent article entrent en application &#224; compter du 1<sup>er</sup> janvier 2021.</p>",
    "exposeSommaire": "<p style=\"text-align: justify;\">Sur les 568 kg de d&#233;chets produit par un Fran&#231;ais chaque ann&#233;e, 190 kg sont concern&#233;s par la Responsabilit&#233; &#233;largie du producteur (REP) et peuvent donc &#234;tre d&#233;tourn&#233;s de l&#8217;&#233;limination, 194 sont des biod&#233;chets (d&#233;chets alimentaires et d&#233;chets verts) que les collectivit&#233;s sont en charge de valoriser. Les 184 kg/hab restant ne disposent d&#8217;aucune fili&#232;re de recyclage, et sont donc n&#233;cessairement &#233;limin&#233;s dans les installations de stockage et de traitement thermique. Les collectivit&#233;s doivent payer la TGAP pour l&#8217;&#233;limination de ces d&#233;chets.</p><p style=\"text-align: justify;\">Pourtant, les collectivit&#233;s n&#8217;ont aucune prise ni sur la conception de ces produits qui n&#8217;ont aucune fili&#232;re de recyclage, ni sur leur mise sur le march&#233;, ni sur leur consommation. Il semble donc injuste de les taxer pour l&#8217;&#233;limination de ces d&#233;chets pour lesquels il n&#8217;existe aucune alternative. Cet amendement vise donc &#224; accorder aux collectivit&#233;s une franchise correspondant &#224; cette part de d&#233;chets r&#233;siduels in&#233;vitables.&#160;</p><p style=\"text-align: justify;\">Le montant de 120 kg/hab correspond aux 184 kg &#233;voqu&#233;s plus haut, moins 64 kg/hab correspondant aux d&#233;chets concern&#233;s par les nouvelles fili&#232;res de recyclage annonc&#233;es par le gouvernement dans le cadre de la feuille de route &#233;conomie circulaire (jouets/jeux, articles de sport et loisir, articles de bricolage et de jardin y compris d&#233;chets du b&#226;timent). Il est &#233;galement important de noter que ce chiffre est sous-&#233;valu&#233;, car une part significative des d&#233;chets sous REP ne sont pas recyclables.</p><p style=\"text-align: justify;\">Cette mesure est facile &#224; mettre en place pour les exploitants et &#224; contr&#244;ler par les douanes. Elle a &#233;galement le m&#233;rite de maintenir le signal prix voulu par le gouvernement sur l&#8217;&#233;limination des d&#233;chets, qui justifie l&#8217;augmentation de la TGAP en discussion dans ce projet de loi de finances. En effet, avec cette mesure, l&#8217;&#233;limination sera toujours plus ch&#232;re que le recyclage pour tous les d&#233;chets pour lesquels les collectivit&#233;s ont v&#233;ritablement des marges de man&#339;uvre. Cette mesure permettrait donc de mettre en place une fiscalit&#233; incitative pour contribuer &#224; la r&#233;duction de l&#8217;&#233;limination des d&#233;chets, sans entra&#238;ner une hausse trop importante de la pression fiscale pour les collectivit&#233;s. Cet amendement pr&#233;voit une application &#224; partir de 2021 pour &#234;tre en coh&#233;rence avec la trajectoire d&#8217;augmentation du TGAP pr&#233;vue par ce projet de loi de finances.</p>",
    "annexeExposeSommaire": {
      "@xmlns:xsi": "http://www.w3.org/2001/XMLSchema-instance",
      "@xsi:nil": "true"
    }
  },
  "representations": {
    "representation": {
      "nom": "PDF",
      "typeMime": {
        "type": "application",
        "subType": "PDF"
      },
      "statutRepresentation": {
        "verbatim": "true",
        "canonique": "true",
        "officielle": "true",
        "transcription": "false",
        "enregistrement": "false"
      },
      "repSource": {
        "@xmlns:xsi": "http://www.w3.org/2001/XMLSchema-instance",
        "@xsi:nil": "true"
      },
      "offset": {
        "@xmlns:xsi": "http://www.w3.org/2001/XMLSchema-instance",
        "@xsi:nil": "true"
      },
      "contenu": {
        "documentURI": "/15/amendements/1255C/CION_FIN/CF1303.pdf"
      },
      "dateDispoRepresentation": {
        "@xmlns:xsi": "http://www.w3.org/2001/XMLSchema-instance",
        "@xsi:nil": "true"
      }
    }
  },
  "seanceDiscussion": {
    "@xmlns:xsi": "http://www.w3.org/2001/XMLSchema-instance",
    "@xsi:nil": "true"
  },
  "sort": {
    "dateSaisie": "2018-11-08T10:36:38.000+01:00",
    "sortEnSeance": "Rejeté"
  },
  "dateDepot": "2018-11-02T01:00:00.000+01:00",
  "dateDistribution": "2018-11-06T01:00:00.000+01:00",
  "article99": "0",
  "loiReference": {
    "codeLoi": "douanes",
    "divisionCodeLoi": "266 sexies"
  }
}