{
  "@xmlns": "http://schemas.assemblee-nationale.fr/referentiel",
  "uid": "AMANR5L15SEA717460B2272P1D1N877",
  "identifiant": {
    "legislature": "15",
    "numero": "877",
    "numRect": "0",
    "saisine": {
      "refTexteLegislatif": "PRJLANR5L15B2272",
      "numeroPartiePLF": "1",
      "organeExamen": "PO717460",
      "mentionSecondeDeliberation": "0"
    }
  },
  "numeroLong": "I-877",
  "etapeTexte": "1ère lecture (1ère assemblée saisie)",
  "triAmendement": "jccaaaaaaaaaaaaaaaaaaaaaaaaaaaaaaaaaaaaaaaaaaaaaaazzzzzzzzzzzzzzzzzzzzw",
  "cardinaliteAmdtMultiples": "1",
  "amendementParent": {
    "@xmlns:xsi": "http://www.w3.org/2001/XMLSchema-instance",
    "@xsi:nil": "true"
  },
  "etat": "Discuté",
  "signataires": {
    "auteur": {
      "typeAuteur": "Depute",
      "acteurRef": "PA608016",
      "organeRef": {
        "@xmlns:xsi": "http://www.w3.org/2001/XMLSchema-instance",
        "@xsi:nil": "true"
      },
      "groupePolitiqueRef": "PO730934"
    },
    "cosignataires": {
      "acteurRef": [
        "PA266797",
        "PA748954",
        "PA267289",
        "PA2377",
        "PA330684",
        "PA608016",
        "PA267901",
        "PA720644",
        "PA721474",
        "PA346054",
        "PA1874",
        "PA642847"
      ]
    },
    "texteAffichable": "Mme&#160;Louwagie,  M.&#160;Bazin, Mme&#160;Val&#233;rie&#160;Boyer, M.&#160;Gosselin, M.&#160;Emmanuel&#160;Maquet, M.&#160;Nury, M.&#160;Perrut, M.&#160;Viry, M.&#160;Door, M.&#160;Kamardine, M.&#160;Le Fur et M.&#160;Savignat"
  },
  "pointeurFragmentTexte": {
    "missionVisee": {
      "@xmlns:xsi": "http://www.w3.org/2001/XMLSchema-instance",
      "@xsi:nil": "true"
    },
    "division": {
      "titre": "Article 27",
      "articleDesignationCourte": "ART. 27",
      "type": "ARTICLE",
      "avant_A_Apres": "A",
      "divisionRattachee": "ARTICLE 27",
      "articleAdditionnel": {
        "@xmlns:xsi": "http://www.w3.org/2001/XMLSchema-instance",
        "@xsi:nil": "true"
      },
      "chapitreAdditionnel": {
        "@xmlns:xsi": "http://www.w3.org/2001/XMLSchema-instance",
        "@xsi:nil": "true"
      },
      "urlDivisionTexteVise": "/15/textes/2272A.asp#D_Article_27"
    },
    "alinea": {
      "avant_A_Apres": {
        "@xmlns:xsi": "http://www.w3.org/2001/XMLSchema-instance",
        "@xsi:nil": "true"
      },
      "numero": "8",
      "alineaDesignation": {
        "@xmlns:xsi": "http://www.w3.org/2001/XMLSchema-instance",
        "@xsi:nil": "true"
      }
    }
  },
  "corps": {
    "dispositif": "<p style=\"text-align: justify;\">I.&#160;&#8211;&#160;R&#233;diger ainsi l&#8217;alin&#233;a&#160;8&#160;:</p><p style=\"text-align: justify;\">&#171;&#160;4&#176;&#160;La quatri&#232;me ligne est supprim&#233;e&#160;;&#160;&#187;.</p><p style=\"text-align: justify;\">II.&#8211;&#160;En cons&#233;quence, r&#233;diger ainsi l&#8217;alin&#233;a&#160;43&#160;:</p><p style=\"text-align: justify;\">&#171;&#160;C-&#160;Le III <i>bis</i> est abrog&#233;.&#160;&#187;</p><p style=\"text-align: justify;\">III.&#160;&#8211;&#160;Compl&#233;ter cet article par l'alin&#233;a suivant&#160;:</p><p style=\"text-align: justify;\">&#171;&#160;XIV.&#160;&#8211;&#160;La perte de recettes pour l&#8217;&#201;tat est compens&#233;e, &#224; due concurrence, par la cr&#233;ation d&#8217;une taxe additionnelle aux droits pr&#233;vus aux articles 575 et 575 A du code g&#233;n&#233;ral des imp&#244;ts.&#160;&#187;</p>",
    "exposeSommaire": "<p style=\"text-align: justify;\">Le m&#233;canisme du plafond mordant vise la ponction par l&#8217;&#201;tat des recettes des agences de l&#8217;eau au-del&#224; du montant maximum de pr&#233;l&#232;vement des redevances. Ce principe remet en cause le principe de l&#8217;eau paie l&#8217;eau et permet &#224; l&#8217;&#201;tat d&#8217;op&#233;rer une ponction sur les agences de l&#8217;eau.</p><p style=\"text-align: justify;\">Alors que dans le cadre du 11<sup>&#232;me</sup> programme, les agences de l&#8217;eau voient leur champ d&#8217;action &#233;tendu notamment &#224; la lutte contre le changement climatique, l&#8217;institution d&#8217;un plafond mordant induira n&#233;cessairement la diminution et l&#8217;arr&#234;t de certaines aides pourtant toujours n&#233;cessaires pour les territoires. Avec le plafond pr&#233;vu actuellement, les agences se verront amput&#233;es de plus d&#8217;1 milliard d&#8217;euros par rapport au 10<sup>&#232;me</sup> programme.</p><p style=\"text-align: justify;\">Cet amendement vise donc &#224; supprimer ce plafond pour donner aux agences de l&#8217;eau les moyens de faire face aux d&#233;fis li&#233;s au r&#233;chauffement climatique.</p>",
    "annexeExposeSommaire": {
      "@xmlns:xsi": "http://www.w3.org/2001/XMLSchema-instance",
      "@xsi:nil": "true"
    },
    "cartoucheDelaiDepotDepasse": {
      "@xmlns:xsi": "http://www.w3.org/2001/XMLSchema-instance",
      "@xsi:nil": "true"
    },
    "avantAppel": {
      "@xmlns:xsi": "http://www.w3.org/2001/XMLSchema-instance",
      "@xsi:nil": "true"
    }
  },
  "representations": {
    "representation": {
      "nom": "PDF",
      "typeMime": {
        "type": "application",
        "subType": "PDF"
      },
      "statutRepresentation": {
        "verbatim": "true",
        "canonique": "true",
        "officielle": "true",
        "transcription": "false",
        "enregistrement": "false"
      },
      "repSource": {
        "@xmlns:xsi": "http://www.w3.org/2001/XMLSchema-instance",
        "@xsi:nil": "true"
      },
      "offset": {
        "@xmlns:xsi": "http://www.w3.org/2001/XMLSchema-instance",
        "@xsi:nil": "true"
      },
      "contenu": {
        "documentURI": "/15/amendements/2272A/AN/877.pdf"
      },
      "dateDispoRepresentation": {
        "@xmlns:xsi": "http://www.w3.org/2001/XMLSchema-instance",
        "@xsi:nil": "true"
      }
    }
  },
  "seanceDiscussion": "RUANR5L15S2020IDS21886",
  "sort": {
    "dateSaisie": "2019-10-21T22:42:42.000+02:00",
    "sortEnSeance": "Rejeté"
  },
  "dateDepot": "2019-10-09T02:00:00.000+02:00",
  "dateDistribution": "2019-10-21T02:00:00.000+02:00",
  "article99": "0",
  "loiReference": {
    "codeLoi": {
      "@xmlns:xsi": "http://www.w3.org/2001/XMLSchema-instance",
      "@xsi:nil": "true"
    },
    "divisionCodeLoi": {
      "@xmlns:xsi": "http://www.w3.org/2001/XMLSchema-instance",
      "@xsi:nil": "true"
    }
  }
}