{
  "@xmlns": "http://schemas.assemblee-nationale.fr/referentiel",
  "uid": "AMANR5L15PO419865B1393P0D1N415",
  "identifiant": {
    "legislature": "15",
    "numero": "415",
    "numRect": "0",
    "saisine": {
      "refTexteLegislatif": "PIONANR5L15B1393",
      "numeroPartiePLF": "0",
      "organeExamen": "PO419865",
      "mentionSecondeDeliberation": "0"
    }
  },
  "numeroLong": "CD415",
  "etapeTexte": "1ère lecture (2ème assemblée saisie)",
  "triAmendement": "baaaaaaaaaaaaaaaaaaaaaaaaaaaaaaaaaaaaaaaaaaaaaaaaabansi",
  "cardinaliteAmdtMultiples": "1",
  "amendementParent": "AMANR5L15PO419865B1393P0D1N410",
  "etat": "Discuté",
  "signataires": {
    "auteur": {
      "typeAuteur": "Depute",
      "acteurRef": "PA722228",
      "organeRef": {
        "@xmlns:xsi": "http://www.w3.org/2001/XMLSchema-instance",
        "@xsi:nil": "true"
      },
      "groupePolitiqueRef": "PO730964"
    },
    "cosignataires": {
      "acteurRef": [
        "PA605084",
        "PA720538",
        "PA719080",
        "PA721426",
        "PA721860",
        "PA722228",
        "PA720242",
        "PA721466",
        "PA722366",
        "PA721876",
        "PA719092",
        "PA609520",
        "PA718962",
        "PA719624",
        "PA720054",
        "PA719740",
        "PA719718",
        "PA719882",
        "PA720944",
        "PA721514",
        "PA721600",
        "PA719890",
        "PA719632",
        "PA720038",
        "PA719922",
        "PA722336",
        "PA720310",
        "PA719412",
        "PA722236",
        "PA720414",
        "PA722000",
        "PA718710",
        "PA718802",
        "PA720278",
        "PA720806",
        "PA721372",
        "PA719972",
        "PA718894"
      ]
    },
    "texteAffichable": "M.&#160;Leclabart,  M.&#160;Colas-Roy, Mme&#160;Abba, M.&#160;Arend, Mme&#160;Pascale&#160;Boyer, Mme&#160;Brulebois, M.&#160;Buchou, M.&#160;Causse, M.&#160;Cesarini, Mme&#160;Couillard, Mme&#160;De Temmerman, M.&#160;Djebbari, M.&#160;Dombreval, M.&#160;Fugit, Mme&#160;Gayte, M.&#160;Haury, Mme&#160;Josso, Mme&#160;Kerbarh, M.&#160;Krabal, Mme&#160;Le Feur, Mme&#160;Maillart-M&#233;haignerie, Mme&#160;Marsaud, Mme&#160;Meynier-Millefert, M.&#160;Morenas, M.&#160;Orphelin, Mme&#160;Panonacle, Mme&#160;Park, M.&#160;Perea, M.&#160;Perrot, M.&#160;Pichereau, Mme&#160;Pompili, Mme&#160;Riotton, Mme&#160;Rossi, Mme&#160;Sarles, M.&#160;Thi&#233;baut, Mme&#160;Tuffnell, M.&#160;Zulesi, M.&#160;Le Gendre et les membres du groupe La R&#233;publique en Marche"
  },
  "pointeurFragmentTexte": {
    "missionVisee": {
      "@xmlns:xsi": "http://www.w3.org/2001/XMLSchema-instance",
      "@xsi:nil": "true"
    },
    "division": {
      "titre": "Article 2",
      "articleDesignationCourte": "ART. 2",
      "type": "ARTICLE",
      "avant_A_Apres": "A",
      "divisionRattachee": "ARTICLE 2",
      "articleAdditionnel": {
        "@xmlns:xsi": "http://www.w3.org/2001/XMLSchema-instance",
        "@xsi:nil": "true"
      },
      "chapitreAdditionnel": {
        "@xmlns:xsi": "http://www.w3.org/2001/XMLSchema-instance",
        "@xsi:nil": "true"
      },
      "urlDivisionTexteVise": "/15/textes/1393.asp#D_Article_2"
    },
    "alinea": {
      "avant_A_Apres": {
        "@xmlns:xsi": "http://www.w3.org/2001/XMLSchema-instance",
        "@xsi:nil": "true"
      },
      "numero": "2",
      "alineaDesignation": {
        "@xmlns:xsi": "http://www.w3.org/2001/XMLSchema-instance",
        "@xsi:nil": "true"
      }
    }
  },
  "corps": {
    "dispositif": "<p style=\"text-align: justify;\">&#192; l&#8217;alin&#233;a&#160;4, apr&#232;s le mot&#160;:</p><p style=\"text-align: justify;\">&#171;&#160;soins&#160;&#187;,</p><p style=\"text-align: justify;\">ins&#233;rer les mots&#160;:</p><p style=\"text-align: justify;\">&#171;&#160;, du logement,&#160;&#187;.</p>",
    "exposeSommaire": "<p style=\"text-align: justify;\">Ce sous-amendement vise &#224; expliciter le r&#244;le de l&#8217;agence en mati&#232;re de logement.</p>",
    "annexeExposeSommaire": {
      "@xmlns:xsi": "http://www.w3.org/2001/XMLSchema-instance",
      "@xsi:nil": "true"
    },
    "cartoucheDelaiDepotDepasse": {
      "@xmlns:xsi": "http://www.w3.org/2001/XMLSchema-instance",
      "@xsi:nil": "true"
    }
  },
  "representations": {
    "representation": {
      "nom": "PDF",
      "typeMime": {
        "type": "application",
        "subType": "PDF"
      },
      "statutRepresentation": {
        "verbatim": "true",
        "canonique": "true",
        "officielle": "true",
        "transcription": "false",
        "enregistrement": "false"
      },
      "repSource": {
        "@xmlns:xsi": "http://www.w3.org/2001/XMLSchema-instance",
        "@xsi:nil": "true"
      },
      "offset": {
        "@xmlns:xsi": "http://www.w3.org/2001/XMLSchema-instance",
        "@xsi:nil": "true"
      },
      "contenu": {
        "documentURI": "/15/amendements/1393/CION-DVP/CD415.pdf"
      },
      "dateDispoRepresentation": {
        "@xmlns:xsi": "http://www.w3.org/2001/XMLSchema-instance",
        "@xsi:nil": "true"
      }
    }
  },
  "seanceDiscussion": {
    "@xmlns:xsi": "http://www.w3.org/2001/XMLSchema-instance",
    "@xsi:nil": "true"
  },
  "sort": {
    "dateSaisie": "2019-02-05T19:02:08.000+01:00",
    "sortEnSeance": "Adopté"
  },
  "dateDepot": "2019-02-05T01:00:00.000+01:00",
  "dateDistribution": "2019-02-05T01:00:00.000+01:00",
  "article99": "0",
  "loiReference": {
    "codeLoi": "1",
    "divisionCodeLoi": {
      "@xmlns:xsi": "http://www.w3.org/2001/XMLSchema-instance",
      "@xsi:nil": "true"
    }
  }
}