{
  "@xmlns": "http://schemas.assemblee-nationale.fr/referentiel",
  "uid": "AMANR5L15SEA717460BTC1924P0D1N1046",
  "identifiant": {
    "legislature": "15",
    "numero": "1046",
    "numRect": "1",
    "saisine": {
      "refTexteLegislatif": "PRJLANR5L15BTC1924",
      "numeroPartiePLF": "0",
      "organeExamen": "PO717460",
      "mentionSecondeDeliberation": "0"
    }
  },
  "numeroLong": "1046 (Rect)",
  "etapeTexte": "1ère lecture (1ère assemblée saisie)",
  "triAmendement": "eeaaaaaaaaaaaaaaaaaaaaaaaaaaaaaaaaaaaaaaaaaaaaaaaaabddzy",
  "cardinaliteAmdtMultiples": "1",
  "amendementParent": {
    "@xmlns:xsi": "http://www.w3.org/2001/XMLSchema-instance",
    "@xsi:nil": "true"
  },
  "etat": "Discuté",
  "signataires": {
    "auteur": {
      "typeAuteur": "Depute",
      "acteurRef": "PA607619",
      "organeRef": {
        "@xmlns:xsi": "http://www.w3.org/2001/XMLSchema-instance",
        "@xsi:nil": "true"
      },
      "groupePolitiqueRef": "PO759900"
    },
    "cosignataires": {
      "acteurRef": [
        "PA719138",
        "PA755549",
        "PA336439",
        "PA405480",
        "PA267042",
        "PA336175",
        "PA608292",
        "PA333421",
        "PA605518",
        "PA720996",
        "PA607619",
        "PA719146",
        "PA605694",
        "PA331582",
        "PA719286"
      ]
    },
    "texteAffichable": "M.&#160;Molac,  M.&#160;Acquaviva, M.&#160;Brial, M.&#160;Castellani, M.&#160;Cl&#233;ment, M.&#160;Colombani, Mme&#160;Dubi&#233;, M.&#160;El Guerrab, M.&#160;Falorni, M.&#160;Favennec Becot, M.&#160;Fran&#231;ois-Michel&#160;Lambert, M.&#160;Pancher, Mme&#160;Pinel, M.&#160;Pupponi et M.&#160;Philippe&#160;Vigier"
  },
  "pointeurFragmentTexte": {
    "missionVisee": {
      "@xmlns:xsi": "http://www.w3.org/2001/XMLSchema-instance",
      "@xsi:nil": "true"
    },
    "division": {
      "titre": "Article 16 bis",
      "articleDesignationCourte": "ART. 16 BIS",
      "type": "ARTICLE",
      "avant_A_Apres": "A",
      "divisionRattachee": "ARTICLE 16 BIS",
      "articleAdditionnel": {
        "@xmlns:xsi": "http://www.w3.org/2001/XMLSchema-instance",
        "@xsi:nil": "true"
      },
      "chapitreAdditionnel": {
        "@xmlns:xsi": "http://www.w3.org/2001/XMLSchema-instance",
        "@xsi:nil": "true"
      },
      "urlDivisionTexteVise": "/15/textes/1924.asp#D_Article_16_bis"
    },
    "alinea": {
      "avant_A_Apres": "A",
      "numero": "2",
      "alineaDesignation": "Alinéa 2"
    }
  },
  "corps": {
    "dispositif": "<p style=\"text-align: justify;\">I.&#160;&#8211;&#160;Supprimer l&#8217;alin&#233;a&#160;2.</p><p style=\"text-align: justify;\">II.&#160;&#8211;&#160;En cons&#233;quence, substituer aux alin&#233;as 3 &#224; 10 les dix alin&#233;as suivants&#160;:</p><p style=\"text-align: justify;\">&#171;&#160;1&#176; Le II de l&#8217;article&#160;19 est ainsi r&#233;dig&#233;&#160;:</p><p style=\"text-align: justify;\">&#171;&#160;Le pr&#233;sident de la Haute Autorit&#233; est nomm&#233; par d&#233;cret du pr&#233;sident de la R&#233;publique.</p><p style=\"text-align: justify;\">&#171;&#160;Outre son pr&#233;sident, la Haute Autorit&#233; comprend&#160;:</p><p style=\"text-align: justify;\">&#171;&#160;1&#176; Deux conseillers d&#8217;&#201;tat, dont au moins un en activit&#233;, &#233;lus par l&#8217;assembl&#233;e g&#233;n&#233;rale du Conseil d&#8217;&#201;tat&#160;;</p><p style=\"text-align: justify;\">&#171;&#160;2&#176; Deux conseillers &#224; la Cour de cassation, dont au moins un en activit&#233;, &#233;lus par l&#8217;ensemble des magistrats du si&#232;ge hors hi&#233;rarchie de la cour&#160;;</p><p style=\"text-align: justify;\">&#171;&#160;3&#176; Deux conseillers-ma&#238;tres &#224; la Cour des comptes, dont au moins un en activit&#233;, &#233;lus par la chambre du conseil&#160;;</p><p style=\"text-align: justify;\">&#171;&#160;4&#176; Trois personnalit&#233;s qualifi&#233;es choisies en raison de leur exp&#233;rience de l&#8217;administration centrale de l&#8217;&#201;tat, des collectivit&#233;s territoriales, de la sant&#233; publique ou de la recherche, du monde universitaire ou ayant exerc&#233; au sein d&#8217;une entreprise priv&#233;e, n&#8217;ayant pas exerc&#233; de fonctions de membre du Gouvernement, de mandat parlementaire ou de fonctions &#233;num&#233;r&#233;es au I de l&#8217;article&#160;11 depuis au moins trois ans, nomm&#233;es par le Pr&#233;sident de l&#8217;Assembl&#233;e nationale, apr&#232;s avis conformes de la commission permanente de l&#8217;Assembl&#233;e nationale charg&#233;e des lois constitutionnelles, rendus &#224; la majorit&#233; des trois cinqui&#232;mes des suffrages exprim&#233;s&#160;;</p><p style=\"text-align: justify;\">&#171;&#160;5&#176; Trois personnalit&#233;s qualifi&#233;es choisies en raison de leur exp&#233;rience de l&#8217;administration centrale de l&#8217;&#201;tat, des collectivit&#233;s territoriales, de la sant&#233; publique ou de la recherche, du monde universitaire ou ayant exerc&#233; au sein d&#8217;une entreprise priv&#233;e, n&#8217;ayant pas exerc&#233; de fonctions de membre du Gouvernement, de mandat parlementaire ou de fonctions &#233;num&#233;r&#233;es au I de l&#8217;article&#160;11 depuis au moins trois ans, nomm&#233;es par le Pr&#233;sident du S&#233;nat, apr&#232;s avis conformes de la commission permanente du S&#233;nat charg&#233;e des lois constitutionnelles, rendus &#224; la majorit&#233; des trois cinqui&#232;mes des suffrages exprim&#233;s.</p><p style=\"text-align: justify;\">&#171;&#160;L&#8217;&#233;cart entre le nombre de femmes et d&#8217;hommes parmi l&#8217;ensemble des membres ne peut &#234;tre sup&#233;rieur &#224; un.</p><p style=\"text-align: justify;\">&#171;&#160;Lorsque la Haute Autorit&#233; &#233;met un avis en application des 3&#176; &#224; 5&#176; du II de l&#8217;article&#160;25 <i>octies</i> de la loi n&#176; 83&#8209;634 du 13&#160;juillet 1983 portant droit et obligations des fonctionnaires, le r&#233;f&#233;rent d&#233;ontologue de l&#8217;administration dont rel&#232;ve l&#8217;int&#233;ress&#233; peut assister aux s&#233;ances de la Haute Autorit&#233;, sans voix d&#233;lib&#233;rative.&#160;&#187;</p>",
    "exposeSommaire": "<p style=\"text-align: justify;\">Le pr&#233;sent amendement a pour objet de modifier la composition de la Haute Autorit&#233; pour la transparence de la vie publique (HATVP) pour tenir compte du transfert des comp&#233;tences de la commission de d&#233;ontologie de la fonction publique.</p><p style=\"text-align: justify;\">Il substitue, to<span  data-cid=\"3\"   data-time=\"1557413591098\">u</span><span  data-cid=\"2\"   data-time=\"1557413590748\">i</span>t d&#8217;abord, pour plus de lisibilit&#233; et d&#8217;efficacit&#233;, un coll&#232;ge unique aux deux coll&#232;ges initialement envisag&#233;s lors de l&#8217;examen en commission.</p><p style=\"text-align: justify;\">Afin de donner plus de places &#224; des personnalit&#233;s qualifi&#233;es issues de divers secteurs d&#8217;activit&#233;, il fait passer de 2 &#224; 6 le nombre de personnalit&#233;s qualifi&#233;es nomm&#233;es par le Parlement.. Dans la mesure o&#249; la Haute Autorit&#233; sera d&#233;sormais comp&#233;tente pour examiner les situations individuelles des fonctionnaires des trois fonctions publiques, en cas de d&#233;part ou de retour du secteur priv&#233;, il importe en effet qu&#8217;elle comprenne des personnalit&#233;s connaissant bien ces secteurs, comme la commission de d&#233;ontologie en est actuellement pourvue.</p><p style=\"text-align: justify;\">Cet amendement pr&#233;voit donc que ces 6 personnalit&#233;s qualifi&#233;es soient d&#233;sign&#233;es par l&#8217;Assembl&#233;e nationale et le S&#233;nat, apr&#232;s avis conforme des commissions permanentes comp&#233;tentes. Il pr&#233;cise que le Parlement devra choisir des personnalit&#233;s dans au moins un des secteurs suivants&#160;:</p><p style=\"text-align: justify;\">- administration centrale de l&#8217;&#201;tat&#160;;</p><p style=\"text-align: justify;\">- collectivit&#233;s territoriales&#160;;</p><p style=\"text-align: justify;\">- sante publique ou recherche&#160;;</p><p style=\"text-align: justify;\">- monde universitaire&#160;;</p><p style=\"text-align: justify;\">- issue du secteur priv&#233;.</p><p style=\"text-align: justify;\">Au total, le nouveau coll&#232;ge comprendra donc 13 membres, contre 9 actuellement, dont 6 seront choisis et entendus par le Parlement, contre 2 actuellement.</p><p style=\"text-align: justify;\">Tous devront d&#233;poser une d&#233;claration d&#8217;int&#233;r&#234;ts et une d&#233;claration de patrimoine, ainsi que le pr&#233;voit d&#233;j&#224; la loi de 2013.</p><p style=\"text-align: justify;\">L&#8217;amendement ouvre &#233;galement la possibilit&#233; aux r&#233;f&#233;rents d&#233;ontologues de l&#8217;administration concern&#233;e par une demande d&#8217;avis de la Haute Autorit&#233;, de si&#233;ger lors de l&#8217;examen de cet avis. Cela doit permettre &#224; la Haute Autorit&#233; d&#8217;appr&#233;hender au mieux la situation individuelle du cas qui lui est soumis. Le r&#233;f&#233;rent d&#233;ontologue n&#8217;aura naturellement pas voix d&#233;lib&#233;rative lors de l&#8217;examen de cette situation, seuls les membres de la Haute Autorit&#233; &#233;tant appel&#233;s &#224; se prononcer.</p><p style=\"text-align: justify;\">L&#8217;amendement pr&#233;cise, enfin, qu&#8217;au moins la moiti&#233; des conseillers d&#8217;&#201;tat, conseillers &#224; la Cour de cassation et conseillers-ma&#238;tre &#224; la Cour des comptes devront &#234;tre en activit&#233; au moment de leur nomination et pour la dur&#233;e de leur mandat.</p>",
    "annexeExposeSommaire": {
      "@xmlns:xsi": "http://www.w3.org/2001/XMLSchema-instance",
      "@xsi:nil": "true"
    },
    "cartoucheDelaiDepotDepasse": {
      "@xmlns:xsi": "http://www.w3.org/2001/XMLSchema-instance",
      "@xsi:nil": "true"
    }
  },
  "representations": {
    "representation": {
      "nom": "PDF",
      "typeMime": {
        "type": "application",
        "subType": "PDF"
      },
      "statutRepresentation": {
        "verbatim": "true",
        "canonique": "true",
        "officielle": "true",
        "transcription": "false",
        "enregistrement": "false"
      },
      "repSource": {
        "@xmlns:xsi": "http://www.w3.org/2001/XMLSchema-instance",
        "@xsi:nil": "true"
      },
      "offset": {
        "@xmlns:xsi": "http://www.w3.org/2001/XMLSchema-instance",
        "@xsi:nil": "true"
      },
      "contenu": {
        "documentURI": "/15/amendements/1924/AN/1046.pdf"
      },
      "dateDispoRepresentation": {
        "@xmlns:xsi": "http://www.w3.org/2001/XMLSchema-instance",
        "@xsi:nil": "true"
      }
    }
  },
  "seanceDiscussion": {
    "@xmlns:xsi": "http://www.w3.org/2001/XMLSchema-instance",
    "@xsi:nil": "true"
  },
  "sort": {
    "dateSaisie": "2019-05-17T17:56:09.000+02:00",
    "sortEnSeance": "Non soutenu"
  },
  "dateDepot": "2019-05-09T02:00:00.000+02:00",
  "dateDistribution": "2019-05-15T02:00:00.000+02:00",
  "article99": "0",
  "loiReference": {
    "codeLoi": {
      "@xmlns:xsi": "http://www.w3.org/2001/XMLSchema-instance",
      "@xsi:nil": "true"
    },
    "divisionCodeLoi": {
      "@xmlns:xsi": "http://www.w3.org/2001/XMLSchema-instance",
      "@xsi:nil": "true"
    }
  }
}