{
  "@xmlns": "http://schemas.assemblee-nationale.fr/referentiel",
  "uid": "AMANR5L15PO420120B1681P0D1N182",
  "identifiant": {
    "legislature": "15",
    "numero": "182",
    "numRect": "0",
    "saisine": {
      "refTexteLegislatif": "PRJLANR5L15B1681",
      "numeroPartiePLF": "0",
      "organeExamen": "PO420120",
      "mentionSecondeDeliberation": "0"
    }
  },
  "numeroLong": "AS182",
  "etapeTexte": "1ère lecture (1ère assemblée saisie)",
  "triAmendement": "bpaaaaaaaaaaaaaaaaaaaaaaaaaaaaaaaaaaaaaaaaaaaaaaaaaayaaabmz",
  "cardinaliteAmdtMultiples": "1",
  "amendementParent": {
    "@xmlns:xsi": "http://www.w3.org/2001/XMLSchema-instance",
    "@xsi:nil": "true"
  },
  "etat": "Discuté",
  "signataires": {
    "auteur": {
      "typeAuteur": "Depute",
      "acteurRef": "PA721070",
      "organeRef": {
        "@xmlns:xsi": "http://www.w3.org/2001/XMLSchema-instance",
        "@xsi:nil": "true"
      },
      "groupePolitiqueRef": "PO730934"
    },
    "cosignataires": {
      "acteurRef": [
        "PA336316",
        "PA721070",
        "PA720630",
        "PA267901"
      ]
    },
    "texteAffichable": "Mme&#160;Ramassamy,  M.&#160;Minot, M.&#160;Kamardine et M.&#160;Bouchet"
  },
  "pointeurFragmentTexte": {
    "missionVisee": {
      "@xmlns:xsi": "http://www.w3.org/2001/XMLSchema-instance",
      "@xsi:nil": "true"
    },
    "division": {
      "titre": "Article 7",
      "articleDesignationCourte": "APRÈS ART. 7",
      "type": "ARTICLE",
      "avant_A_Apres": "Après",
      "divisionRattachee": "APRÈS L'ARTICLE 7, insérer l'article suivant:",
      "articleAdditionnel": "1",
      "chapitreAdditionnel": {
        "@xmlns:xsi": "http://www.w3.org/2001/XMLSchema-instance",
        "@xsi:nil": "true"
      },
      "urlDivisionTexteVise": "/15/textes/1681.asp#D_Article_7"
    },
    "alinea": {
      "@xmlns:xsi": "http://www.w3.org/2001/XMLSchema-instance",
      "@xsi:nil": "true"
    }
  },
  "corps": {
    "dispositif": "<p style=\"text-align: justify;\">L&#8217;article L.&#160;6211&#8209;23 du code de la sant&#233; publique est ainsi modifi&#233;&#160;:</p><p style=\"text-align: justify;\">1&#176; Au premier alin&#233;a, apr&#232;s les mots&#160;: &#171;&#160;L&#8217;ex&#233;cution des examens de biologie m&#233;dicale,&#160;&#187;, ins&#233;rer les mots&#160;: &#171;&#160;des actes de vaccination antigrippale&#160;&#187;&#160;;</p><p style=\"text-align: justify;\">2&#176; Au deuxi&#232;me alin&#233;a, apr&#232;s les mots&#160;: &#171;&#160;La liste de ces examens&#160;&#187;, ins&#233;rer les mots&#160;: &#171;&#160;, de ces actes&#160;&#187;.&#160;&#187;</p><p style=\"text-align: justify;\">&#160;</p>",
    "exposeSommaire": "<p>Les 4716 sites de laboratoires de biologie m&#233;dicale repr&#233;sentent un point d&#8217;acc&#232;s suppl&#233;mentaire &#224; la vaccination antigrippale pour les fran&#231;ais. Ils pourraient ainsi contribuer &#224; augmenter la couverture vaccinale contre la grippe. Les biologistes m&#233;dicaux qui y exercent sont d&#233;j&#224; form&#233;s &#224; r&#233;aliser de nombreux types de pr&#233;l&#232;vements aupr&#232;s des patients. La tra&#231;abilit&#233; des vaccinations et leur &#233;limination par le circuit des d&#233;chets DASRI pourraient &#234;tre des &#233;l&#233;ments parfaitement ma&#238;tris&#233;s par les laboratoires de biologie m&#233;dicale.</p><p>Cette mesure est en coh&#233;rence avec le Plan Priorit&#233; Pr&#233;vention ainsi que les annonces du Premier ministre lors du Comit&#233; interminist&#233;riel de la sant&#233; du 26 mars 2018. Elle permettrait la r&#233;alisation d&#8217;&#233;conomies de sant&#233; &#224; court, moyen et long terme &#224; travers l&#8217;am&#233;lioration du dispositif de pr&#233;vention et la diminution, d&#232;s 2019, du nombre de cas de grippe lors de l&#8217;&#233;pid&#233;mie hivernale.</p>",
    "annexeExposeSommaire": {
      "@xmlns:xsi": "http://www.w3.org/2001/XMLSchema-instance",
      "@xsi:nil": "true"
    },
    "cartoucheDelaiDepotDepasse": {
      "@xmlns:xsi": "http://www.w3.org/2001/XMLSchema-instance",
      "@xsi:nil": "true"
    }
  },
  "representations": {
    "representation": {
      "nom": "PDF",
      "typeMime": {
        "type": "application",
        "subType": "PDF"
      },
      "statutRepresentation": {
        "verbatim": "true",
        "canonique": "true",
        "officielle": "true",
        "transcription": "false",
        "enregistrement": "false"
      },
      "repSource": {
        "@xmlns:xsi": "http://www.w3.org/2001/XMLSchema-instance",
        "@xsi:nil": "true"
      },
      "offset": {
        "@xmlns:xsi": "http://www.w3.org/2001/XMLSchema-instance",
        "@xsi:nil": "true"
      },
      "contenu": {
        "documentURI": "/15/amendements/1681/CION-SOC/AS182.pdf"
      },
      "dateDispoRepresentation": {
        "@xmlns:xsi": "http://www.w3.org/2001/XMLSchema-instance",
        "@xsi:nil": "true"
      }
    }
  },
  "seanceDiscussion": {
    "@xmlns:xsi": "http://www.w3.org/2001/XMLSchema-instance",
    "@xsi:nil": "true"
  },
  "sort": {
    "dateSaisie": "2019-03-13T18:54:08.000+01:00",
    "sortEnSeance": "Non soutenu"
  },
  "dateDepot": "2019-03-06T01:00:00.000+01:00",
  "dateDistribution": "2019-03-13T01:00:00.000+01:00",
  "article99": "0",
  "loiReference": {
    "codeLoi": "santé publique",
    "divisionCodeLoi": "l6211-23"
  }
}