{
  "@xmlns": "http://schemas.assemblee-nationale.fr/referentiel",
  "uid": "AMANR5L15SEA717460B2272P2D1N2116",
  "identifiant": {
    "legislature": "15",
    "numero": "2116",
    "numRect": "0",
    "saisine": {
      "refTexteLegislatif": "PRJLANR5L15B2272",
      "numeroPartiePLF": "2",
      "organeExamen": "PO717460",
      "mentionSecondeDeliberation": "0"
    }
  },
  "numeroLong": "II-2116",
  "etapeTexte": "1ère lecture (1ère assemblée saisie)",
  "triAmendement": "edaaaaaaaaaaaaaaaaaaaaaaaaaaaaaaaaaaaaaaaaaaaaaaaaahzp",
  "cardinaliteAmdtMultiples": "1",
  "amendementParent": {
    "@xmlns:xsi": "http://www.w3.org/2001/XMLSchema-instance",
    "@xsi:nil": "true"
  },
  "etat": "Discuté",
  "signataires": {
    "auteur": {
      "typeAuteur": "Depute",
      "acteurRef": "PA605069",
      "organeRef": {
        "@xmlns:xsi": "http://www.w3.org/2001/XMLSchema-instance",
        "@xsi:nil": "true"
      },
      "groupePolitiqueRef": "PO758835"
    },
    "cosignataires": {
      "acteurRef": [
        "PA642764",
        "PA609332",
        "PA335532",
        "PA610681",
        "PA608172",
        "PA605069",
        "PA608011",
        "PA342415",
        "PA332614",
        "PA1198",
        "PA719930",
        "PA429893",
        "PA333285",
        "PA340343",
        "PA609590",
        "PA720988",
        "PA335054",
        "PA1809",
        "PA1592",
        "PA333818",
        "PA340357",
        "PA1008",
        "PA508",
        "PA607553",
        "PA267233",
        "PA337483",
        "PA608741",
        "PA608695",
        "PA643145"
      ]
    },
    "texteAffichable": "M.&#160;Jean-Louis&#160;Bricout,  Mme&#160;Pires Beaune, M.&#160;David&#160;Habib, Mme&#160;Rabault, M.&#160;Aviragnet, Mme&#160;Bareigts, Mme&#160;Battistel, Mme&#160;Bi&#233;mouret, M.&#160;Bouillon, M.&#160;Carvounas, M.&#160;Alain&#160;David, Mme&#160;Laurence&#160;Dumont, M.&#160;Faure, M.&#160;Garot, M.&#160;Hutin, M.&#160;Juanico, Mme&#160;Karamanli, M.&#160;J&#233;r&#244;me&#160;Lambert, M.&#160;Letchimy, Mme&#160;Manin, Mme&#160;Pau-Langevin, M.&#160;Potier, M.&#160;Pueyo, M.&#160;Saulignac, Mme&#160;Tolmont, Mme&#160;Untermaier, Mme&#160;Vainqueur-Christophe, M.&#160;Vallaud, Mme&#160;Victory et les membres du groupe Socialistes et apparent&#233;s"
  },
  "pointeurFragmentTexte": {
    "missionVisee": {
      "@xmlns:xsi": "http://www.w3.org/2001/XMLSchema-instance",
      "@xsi:nil": "true"
    },
    "division": {
      "titre": "Article 47",
      "articleDesignationCourte": "AVANT ART. 47",
      "type": "ARTICLE",
      "avant_A_Apres": "Avant",
      "divisionRattachee": "AVANT L'ARTICLE 47, insérer l'article suivant:",
      "articleAdditionnel": "1",
      "chapitreAdditionnel": {
        "@xmlns:xsi": "http://www.w3.org/2001/XMLSchema-instance",
        "@xsi:nil": "true"
      },
      "urlDivisionTexteVise": "/15/textes/2272C.asp#D_Article_47"
    },
    "alinea": {
      "@xmlns:xsi": "http://www.w3.org/2001/XMLSchema-instance",
      "@xsi:nil": "true"
    }
  },
  "corps": {
    "dispositif": "<p>I.&#160;&#8211;&#160;Les articles du code g&#233;n&#233;ral des imp&#244;ts modifi&#233;s par les articles 28 et 29 de la loi n&#176;&#160;2017&#8209;1837 du 30 d&#233;cembre 2017 de finances pour 2018 sont r&#233;tablis dans leur r&#233;daction ant&#233;rieure &#224; la publication de la loi n&#176;&#160;2017&#8209;1837 du 30 d&#233;cembre 2017 de finances pour 2018.</p><p style=\"text-align: justify;\">II.&#160;&#8211;&#160;Les articles du code mon&#233;taire et financier modifi&#233;s par l&#8217;article de la loi n&#176;&#160;2017&#8209;1837 du 30&#160;d&#233;cembre 2017 de finances pour 2018 sont r&#233;tablis dans leur r&#233;daction ant&#233;rieure &#224; la publication de la loi n&#176;&#160;2017&#8209;1837 du 30 d&#233;cembre 2017 de finances pour 2018.</p><p style=\"text-align: justify;\">III.&#160;&#8211;&#160;Les articles du code de la construction et de l&#8217;habitation modifi&#233;s par l&#8217;article de la loi n&#176;&#160;2017&#8209;1837 du 30 d&#233;cembre 2017 de finances pour 2018 sont r&#233;tablis dans leur r&#233;daction ant&#233;rieure &#224; la publication de la loi n&#176;&#160;2017&#8209;1837 du 30 d&#233;cembre 2017 de finances pour 2018.</p><p style=\"text-align: justify;\">IV.&#160;&#8211;&#160;Les articles du code de la s&#233;curit&#233; sociale modifi&#233;s par l&#8217;article de la loi n&#176;&#160;2017&#8209;1837 du 30&#160;d&#233;cembre 2017 de finances pour 2018 sont r&#233;tablis dans leur r&#233;daction ant&#233;rieure &#224; la publication de la loi n&#176;&#160;2017&#8209;1837 du 30 d&#233;cembre 2017 de finances pour 2018.</p><p style=\"text-align: justify;\">V.&#160;&#8211;&#160;Les articles du livre des proc&#233;dures fiscales modifi&#233;s par l&#8217;article de la loi n&#176;&#160;2017&#8209;1837 du 30&#160;d&#233;cembre 2017 de finances pour 2018 sont r&#233;tablis dans leur r&#233;daction ant&#233;rieure &#224; la publication de la loi n&#176;&#160;2017&#8209;1837 du 30 d&#233;cembre 2017 de finances pour 2018.</p><p style=\"text-align: justify;\">VI.&#160;&#8211;&#160;Les articles 28 et 29 de la loi n&#176;&#160;2017&#8209;1837 du 30 d&#233;cembre 2017 de finances pour 2018 sont abrog&#233;s.</p><p style=\"text-align: justify;\">VII. &#8211; Les I. &#224; VI. entrent en vigueur &#224; compter du 1<sup>er</sup> janvier 2021.</p>",
    "exposeSommaire": "<p>Cet amendement du groupe Socialistes et apparent&#233;s vise &#224; supprimer, au 1<sup>er</sup> janvier 2021, le pr&#233;l&#232;vement forfaitaire unique, autrement appel&#233; <i>flat tax</i>, mis en place par l&#8217;article&#160;28 de la loi de finances pour 2018.</p><p style=\"text-align: justify;\">Cet amendement se justifie d&#8217;autant plus que le Comit&#233; d&#8217;&#233;valuation des r&#233;formes sur la fiscalit&#233; du capital a remis son premier rapport le 1<sup>er</sup> octobre 2019. Ce rapport montre que&#160;:</p><ul style=\"text-align: justify;\"><li>Il n&#8217;est aujourd&#8217;hui pas possible de conclure &#224; un effet positif de ces r&#233;formes sur la croissance, l&#8217;investissement et le financement des entreprises&#160;;</li><li>Il est en revanche possible de dire que la <i>flat tax</i> est &#224; l&#8217;origine d&#8217;une forte progression des dividendes en 2018&#160;;</li><li>Le co&#251;t 2018 de ces r&#233;formes est de 3,1 milliards d&#8217;euros pour l&#8217;ISF et 1,7 milliard d&#8217;euros pour la <i>flat tax</i>, soit un total de 4,8 milliards d&#8217;euros&#160;;</li><li>S&#8217;agissant de la <i>flat tax</i>, les gains fiscaux sont concentr&#233;s sur les 15 % des m&#233;nages les plus ais&#233;s et particuli&#232;rement sur les 5 % des m&#233;nages les plus ais&#233;s. Ces derniers ont ainsi b&#233;n&#233;fici&#233; en 2018 d&#8217;un cadeau fiscal d&#8217;en moyenne 1&#160;000&#160;euros&#160;;</li><li>S&#8217;agissant de la transformation de l&#8217;ISF en IFI, 57 % des 3,1 milliards d&#8217;euros de cadeau fiscal sont per&#231;us par les 5 % des m&#233;nages les plus ais&#233;s. Le gain moyen annuel pour les ex-assujettis &#224; l&#8217;ISF est &#233;valu&#233; &#224; 6&#160;500&#160;euros en moyenne&#160;;</li><li>Ces r&#233;formes peuvent expliquer en partie la baisse des ressources de 150 millions d&#8217;euros pour les associations au titre des dons ayant b&#233;n&#233;fici&#233; de r&#233;ductions ou cr&#233;dits d&#8217;imp&#244;t.</li></ul>",
    "annexeExposeSommaire": {
      "@xmlns:xsi": "http://www.w3.org/2001/XMLSchema-instance",
      "@xsi:nil": "true"
    },
    "cartoucheDelaiDepotDepasse": {
      "@xmlns:xsi": "http://www.w3.org/2001/XMLSchema-instance",
      "@xsi:nil": "true"
    },
    "avantAppel": {
      "@xmlns:xsi": "http://www.w3.org/2001/XMLSchema-instance",
      "@xsi:nil": "true"
    }
  },
  "representations": {
    "representation": {
      "nom": "PDF",
      "typeMime": {
        "type": "application",
        "subType": "PDF"
      },
      "statutRepresentation": {
        "verbatim": "true",
        "canonique": "true",
        "officielle": "true",
        "transcription": "false",
        "enregistrement": "false"
      },
      "repSource": {
        "@xmlns:xsi": "http://www.w3.org/2001/XMLSchema-instance",
        "@xsi:nil": "true"
      },
      "offset": {
        "@xmlns:xsi": "http://www.w3.org/2001/XMLSchema-instance",
        "@xsi:nil": "true"
      },
      "contenu": {
        "documentURI": "/15/amendements/2272C/AN/2116.pdf"
      },
      "dateDispoRepresentation": {
        "@xmlns:xsi": "http://www.w3.org/2001/XMLSchema-instance",
        "@xsi:nil": "true"
      }
    }
  },
  "seanceDiscussion": "RUANR5L15S2020IDS21922",
  "sort": {
    "dateSaisie": "2019-11-14T18:36:11.000+01:00",
    "sortEnSeance": "Rejeté"
  },
  "dateDepot": "2019-11-06T01:00:00.000+01:00",
  "dateDistribution": "2019-11-12T01:00:00.000+01:00",
  "article99": "0",
  "loiReference": {
    "codeLoi": "CGI",
    "divisionCodeLoi": "28"
  }
}