{
  "@xmlns": "http://schemas.assemblee-nationale.fr/referentiel",
  "uid": "AMANR5L15PO59048B1255P2D1N1167",
  "identifiant": {
    "legislature": "15",
    "numero": "1167",
    "numRect": "0",
    "saisine": {
      "refTexteLegislatif": "PRJLANR5L15B1255",
      "numeroPartiePLF": "2",
      "organeExamen": "PO59048",
      "mentionSecondeDeliberation": "0"
    }
  },
  "numeroLong": "II-CF1167",
  "etapeTexte": "1ère lecture (1ère assemblée saisie)",
  "triAmendement": "kiaaaaaaaaaaaaaaaaaaaaaaaaaaaaaaaaaaaaaaaaaaaaaaaabs",
  "cardinaliteAmdtMultiples": "1",
  "amendementParent": {
    "@xmlns:xsi": "http://www.w3.org/2001/XMLSchema-instance",
    "@xsi:nil": "true"
  },
  "etat": "Discuté",
  "signataires": {
    "auteur": {
      "typeAuteur": "Depute",
      "acteurRef": "PA942",
      "organeRef": {
        "@xmlns:xsi": "http://www.w3.org/2001/XMLSchema-instance",
        "@xsi:nil": "true"
      },
      "groupePolitiqueRef": "PO759900"
    },
    "cosignataires": {
      "acteurRef": [
        "PA405480",
        "PA755549",
        "PA605518",
        "PA267042",
        "PA331582",
        "PA942",
        "PA719138",
        "PA336175"
      ]
    },
    "texteAffichable": "M.&#160;Charles&#160;de Courson,  M.&#160;Brial, M.&#160;Castellani, M.&#160;Favennec Becot, M.&#160;Fran&#231;ois-Michel&#160;Lambert, Mme&#160;Pinel, M.&#160;Pupponi et M.&#160;Philippe&#160;Vigier"
  },
  "pointeurFragmentTexte": {
    "missionVisee": {
      "@xmlns:xsi": "http://www.w3.org/2001/XMLSchema-instance",
      "@xsi:nil": "true"
    },
    "division": {
      "titre": "Article 63",
      "articleDesignationCourte": "APRÈS ART. 63",
      "type": "ARTICLE",
      "avant_A_Apres": "Après",
      "divisionRattachee": "APRÈS L'ARTICLE 63, insérer l'article suivant:",
      "articleAdditionnel": "1",
      "chapitreAdditionnel": {
        "@xmlns:xsi": "http://www.w3.org/2001/XMLSchema-instance",
        "@xsi:nil": "true"
      },
      "urlDivisionTexteVise": "/15/textes/1255C.asp#D_Article_63"
    },
    "alinea": {
      "@xmlns:xsi": "http://www.w3.org/2001/XMLSchema-instance",
      "@xsi:nil": "true"
    }
  },
  "corps": {
    "dispositif": "<p style=\"text-align: justify;\">L&#8217;article&#160;73 de la loi n&#176; 2017&#8209;1775 du 28 d&#233;cembre 2017 de finances rectificative pour 2017 est ainsi modifi&#233;&#160;:</p><p style=\"text-align: justify;\">Apr&#232;s l&#8217;alin&#233;a&#160;7, est ins&#233;r&#233; l&#8217;alin&#233;a suivant&#160;:</p><p style=\"text-align: justify;\">&#171;&#160;Par d&#233;rogation &#224; l&#8217;alin&#233;a&#160;2 de l&#8217;article L.&#160;162&#8209;1 du code des proc&#233;dures civiles d&#8217;ex&#233;cution, le destinataire de la saisie est tenu de rendre les fonds qu&#8217;il d&#233;tient indisponibles uniquement &#224; concurrence du montant de la saisie.&#160;&#187;</p>",
    "exposeSommaire": "<p style=\"text-align: justify;\">Le PLFR 2017 institue &#224; compter du 1<sup>er</sup> janvier 2019 une nouvelle saisie administrative qui remplacera et unifiera toutes les saisies de cr&#233;ances existant aujourd&#8217;hui, et notamment l&#8217;opposition administrative. Il s&#8217;agit de la saisie administrative &#224; tiers d&#233;tenteur.</p><p style=\"text-align: justify;\">Or, pour cette nouvelle saisie, aucun cantonnement n&#8217;est pr&#233;vu. En effet, elle impose de bloquer l&#8217;int&#233;gralit&#233; des fonds pr&#233;sents sur les comptes bancaires du d&#233;biteur alors qu&#8217;auparavant les fonds indisponibles &#233;taient limit&#233;s au montant de la cr&#233;ance.</p><p style=\"text-align: justify;\">Cette mesure disproportionn&#233;e est particuli&#232;rement injuste dans le cadre des oppositions administratives, dont le montant moyen est inf&#233;rieur &#224; 50&#160;&#8364;.</p><p style=\"text-align: justify;\">En l&#8217;absence de cantonnement, cette mesure pourra mettre en grande difficult&#233; les particuliers comme les entreprises, puisqu&#8217;une cr&#233;ance d&#8217;une somme m&#234;me minime entra&#238;nera un blocage de l&#8217;ensemble des fonds durant 15 jours ouvrables.</p><p style=\"text-align: justify;\">Le pr&#233;sent amendement vise donc &#224; r&#233;introduire la notion de cantonnement des fonds pour la nouvelle la saisie administrative &#224; tiers d&#233;tenteur, afin que les sommes indisponibles soient &#224; nouveau limit&#233;es au montant de la cr&#233;ance.</p>",
    "annexeExposeSommaire": {
      "@xmlns:xsi": "http://www.w3.org/2001/XMLSchema-instance",
      "@xsi:nil": "true"
    }
  },
  "representations": {
    "representation": {
      "nom": "PDF",
      "typeMime": {
        "type": "application",
        "subType": "PDF"
      },
      "statutRepresentation": {
        "verbatim": "true",
        "canonique": "true",
        "officielle": "true",
        "transcription": "false",
        "enregistrement": "false"
      },
      "repSource": {
        "@xmlns:xsi": "http://www.w3.org/2001/XMLSchema-instance",
        "@xsi:nil": "true"
      },
      "offset": {
        "@xmlns:xsi": "http://www.w3.org/2001/XMLSchema-instance",
        "@xsi:nil": "true"
      },
      "contenu": {
        "documentURI": "/15/amendements/1255C/CION_FIN/CF1167.pdf"
      },
      "dateDispoRepresentation": {
        "@xmlns:xsi": "http://www.w3.org/2001/XMLSchema-instance",
        "@xsi:nil": "true"
      }
    }
  },
  "seanceDiscussion": {
    "@xmlns:xsi": "http://www.w3.org/2001/XMLSchema-instance",
    "@xsi:nil": "true"
  },
  "sort": {
    "dateSaisie": "2018-11-08T11:31:08.000+01:00",
    "sortEnSeance": "Retiré"
  },
  "dateDepot": "2018-11-02T01:00:00.000+01:00",
  "dateDistribution": "2018-11-06T01:00:00.000+01:00",
  "article99": "0",
  "loiReference": {
    "codeLoi": "loi 2017-1775",
    "divisionCodeLoi": "73"
  }
}