{
  "@xmlns": "http://schemas.assemblee-nationale.fr/referentiel",
  "uid": "AMANR5L15SEA717460BTC1019P0D1N2117",
  "identifiant": {
    "legislature": "15",
    "numero": "2117",
    "numRect": "0",
    "saisine": {
      "refTexteLegislatif": "PRJLANR5L15BTC1019",
      "numeroPartiePLF": "0",
      "organeExamen": "PO717460",
      "mentionSecondeDeliberation": "0"
    }
  },
  "numeroLong": "2117",
  "etapeTexte": "1ère lecture (1ère assemblée saisie)",
  "triAmendement": "bc",
  "cardinaliteAmdtMultiples": "1",
  "amendementParent": {
    "@xmlns:xsi": "http://www.w3.org/2001/XMLSchema-instance",
    "@xsi:nil": "true"
  },
  "etat": "Discuté",
  "signataires": {
    "auteur": {
      "typeAuteur": "Depute",
      "acteurRef": "PA718926",
      "organeRef": {
        "@xmlns:xsi": "http://www.w3.org/2001/XMLSchema-instance",
        "@xsi:nil": "true"
      },
      "groupePolitiqueRef": "PO730940"
    },
    "cosignataires": {
      "acteurRef": [
        "PA721118",
        "PA718720",
        "PA718926",
        "PA721896",
        "PA721012",
        "PA441",
        "PA267306",
        "PA720546",
        "PA335612",
        "PA610667",
        "PA610654",
        "PA720692",
        "PA689",
        "PA722110",
        "PA721270",
        "PA722202"
      ]
    },
    "texteAffichable": "M.&#160;Dharr&#233;ville,  Mme&#160;Bello, M.&#160;Brotherson, M.&#160;Bruneel, Mme&#160;Buffet, M.&#160;Chassaigne, M.&#160;Dufr&#232;gne, Mme&#160;Faucillon, M.&#160;Jumel, Mme&#160;K&#233;clard-Mond&#233;sir, M.&#160;Lecoq, M.&#160;Nilor, M.&#160;Peu, M.&#160;Fabien&#160;Roussel, M.&#160;Serville et M.&#160;Wulfranc"
  },
  "pointeurFragmentTexte": {
    "missionVisee": {
      "@xmlns:xsi": "http://www.w3.org/2001/XMLSchema-instance",
      "@xsi:nil": "true"
    },
    "division": {
      "titre": "Article PREMIER",
      "articleDesignationCourte": "APRÈS ART. PREMIER",
      "type": "ARTICLE",
      "avant_A_Apres": "Après",
      "divisionRattachee": "APRÈS L'ARTICLE PREMIER, insérer l'article suivant:",
      "articleAdditionnel": "1",
      "chapitreAdditionnel": {
        "@xmlns:xsi": "http://www.w3.org/2001/XMLSchema-instance",
        "@xsi:nil": "true"
      },
      "urlDivisionTexteVise": "/15/textes/1019.asp#D_Article_1er"
    },
    "alinea": {
      "@xmlns:xsi": "http://www.w3.org/2001/XMLSchema-instance",
      "@xsi:nil": "true"
    }
  },
  "corps": {
    "dispositif": "<p style=\"text-align: justify;\">Apr&#232;s le premier alin&#233;a de l&#8217;article&#160;6111&#8209;1 du code du travail, il est ins&#233;r&#233; un alin&#233;a ainsi r&#233;dig&#233;&#160;:</p><p style=\"text-align: justify;\">&#171;&#160;Les salari&#233;s qui ont arr&#234;t&#233; leur formation initiale avant le premier cycle de l&#8217;enseignement sup&#233;rieure ou qui n&#8217;ont pas obtenu de qualification professionnelle reconnue, et qui souhaitent poursuivre ult&#233;rieurement des &#233;tudes en vue d&#8217;une promotion sociale, ont un acc&#232;s prioritaire &#224; une formation dipl&#244;mante ou qualifiante.&#160;&#187;</p>",
    "exposeSommaire": "<p style=\"text-align: justify;\">Cet amendement a pour objet de pr&#233;ciser que la formation professionnelle tout au long de la vie doit concerner particuli&#232;rement les personnes les moins form&#233;es, afin d&#8217;inverser la tendance selon laquelle la formation b&#233;n&#233;ficie aux personnes les plus form&#233;es.</p><p style=\"text-align: justify;\">Il pose ainsi le principe de l&#8217;acc&#232;s prioritaire des publics qui n&#8217;ont pas pu b&#233;n&#233;ficier d&#8217;une formation initiale longue ou qui n&#8217;ont pas de qualification professionnelle reconnue.</p>",
    "annexeExposeSommaire": {
      "@xmlns:xsi": "http://www.w3.org/2001/XMLSchema-instance",
      "@xsi:nil": "true"
    }
  },
  "representations": {
    "representation": {
      "nom": "PDF",
      "typeMime": {
        "type": "application",
        "subType": "PDF"
      },
      "statutRepresentation": {
        "verbatim": "true",
        "canonique": "true",
        "officielle": "true",
        "transcription": "false",
        "enregistrement": "false"
      },
      "repSource": {
        "@xmlns:xsi": "http://www.w3.org/2001/XMLSchema-instance",
        "@xsi:nil": "true"
      },
      "offset": {
        "@xmlns:xsi": "http://www.w3.org/2001/XMLSchema-instance",
        "@xsi:nil": "true"
      },
      "contenu": {
        "documentURI": "/15/amendements/1019/AN/2117.pdf"
      },
      "dateDispoRepresentation": {
        "@xmlns:xsi": "http://www.w3.org/2001/XMLSchema-instance",
        "@xsi:nil": "true"
      }
    }
  },
  "seanceDiscussion": "RUANR5L15S2018IDS21099",
  "sort": {
    "dateSaisie": "2018-06-13T18:44:45.000+02:00",
    "sortEnSeance": "Rejeté"
  },
  "dateDepot": "2018-06-07T02:00:00.000+02:00",
  "dateDistribution": "2018-06-09T02:00:00.000+02:00",
  "article99": "0",
  "loiReference": {
    "codeLoi": "c travail",
    "divisionCodeLoi": "L6111-1"
  }
}