{
  "@xmlns": "http://schemas.assemblee-nationale.fr/referentiel",
  "uid": "AMANR5L15SEA717460B0384P0D1N130",
  "identifiant": {
    "legislature": "15",
    "numero": "130",
    "numRect": "0",
    "saisine": {
      "refTexteLegislatif": "PRJLANR5L15B0384",
      "numeroPartiePLF": "0",
      "organeExamen": "PO717460",
      "mentionSecondeDeliberation": "0"
    }
  },
  "numeroLong": "130",
  "etapeTexte": "1ère lecture (1ère assemblée saisie)",
  "triAmendement": "io",
  "cardinaliteAmdtMultiples": "1",
  "amendementParent": {
    "@xmlns:xsi": "http://www.w3.org/2001/XMLSchema-instance",
    "@xsi:nil": "true"
  },
  "etat": "Discuté",
  "signataires": {
    "auteur": {
      "typeAuteur": "Depute",
      "acteurRef": "PA606712",
      "organeRef": {
        "@xmlns:xsi": "http://www.w3.org/2001/XMLSchema-instance",
        "@xsi:nil": "true"
      },
      "groupePolitiqueRef": "PO730934"
    },
    "cosignataires": {
      "acteurRef": [
        "PA267735",
        "PA2492",
        "PA346054",
        "PA2155",
        "PA718838",
        "PA267429",
        "PA1327",
        "PA608826",
        "PA720684",
        "PA642847",
        "PA605036",
        "PA609245",
        "PA712015",
        "PA606712",
        "PA718850",
        "PA267324",
        "PA340853",
        "PA767"
      ]
    },
    "texteAffichable": "M.&#160;Lurton,  M.&#160;Cinieri, M.&#160;Cordier, M.&#160;Quentin, M.&#160;Emmanuel&#160;Maquet, M.&#160;Cattin, M.&#160;Gaultier, Mme&#160;Duby-Muller, M.&#160;Pierre-Henri&#160;Dumont, M.&#160;Menuel, M.&#160;Forissier, M.&#160;Brun, M.&#160;Leclerc, M.&#160;Dive, M.&#160;Bazin, M.&#160;Abad, Mme&#160;Lacroute et M.&#160;de Ganay"
  },
  "pointeurFragmentTexte": {
    "missionVisee": {
      "@xmlns:xsi": "http://www.w3.org/2001/XMLSchema-instance",
      "@xsi:nil": "true"
    },
    "division": {
      "titre": "Article 18",
      "articleDesignationCourte": "ART. 18",
      "type": "ARTICLE",
      "avant_A_Apres": "A",
      "divisionRattachee": "ARTICLE 18",
      "articleAdditionnel": {
        "@xmlns:xsi": "http://www.w3.org/2001/XMLSchema-instance",
        "@xsi:nil": "true"
      },
      "chapitreAdditionnel": {
        "@xmlns:xsi": "http://www.w3.org/2001/XMLSchema-instance",
        "@xsi:nil": "true"
      },
      "urlDivisionTexteVise": "/15/textes/0384.asp#D_Article_18"
    },
    "alinea": {
      "avant_A_Apres": "Apres",
      "numero": "41",
      "alineaDesignation": {
        "@xmlns:xsi": "http://www.w3.org/2001/XMLSchema-instance",
        "@xsi:nil": "true"
      }
    }
  },
  "corps": {
    "dispositif": "<p>I.&#160;&#8211;&#160;Apr&#232;s l&#8217;alin&#233;a&#160;41, ins&#233;rer les trois alin&#233;as suivants&#160;:</p><p>&#171;&#160;IV <i>bis</i>.&#160;&#8211;&#160;Le code g&#233;n&#233;ral des collectivit&#233;s territoriales est ainsi modifi&#233;&#160;:</p><p>&#171;&#160;1&#176;&#160;&#192; l&#8217;avant-dernier alin&#233;a de l&#8217;article L.&#160;2333&#8209;54, les deux occurrences du taux&#160;: &#171;&#160;83,5&#160;%&#160;&#187; sont remplac&#233;es par le taux&#160;: &#171;&#160;82&#160;%&#160;&#187;&#160;;</p><p>&#171;&#160;2&#176;&#160;Le dernier alin&#233;a de l&#8217;article L.&#160;2333&#8209;56 est compl&#233;t&#233; par les mots&#160;: &#171;&#160;, pour le produit brut des jeux mentionn&#233;s aux 1&#176;, 2&#176; et 3&#176; de&#160;l&#8217;article L.&#160;2333&#8209;55&#8209;1 et de&#160;4,5&#160;% et de 82&#160;%, pour le produit brut des jeux mentionn&#233;s aux 4&#176; et 5&#176; de&#160;l&#8217;article L.&#160;2333&#8209;55&#8209;1.&#160;&#187;</p><p>II.&#160;&#8211;&#160;Compl&#233;ter cet article par les deux alin&#233;as suivants&#160;:</p><p>&#171;&#160;VI.&#160;&#8211;&#160;La perte de recettes pour l&#8217;&#201;tat est compens&#233;e &#224; due concurrence par la cr&#233;ation d&#8217;une taxe additionnelle aux droits mentionn&#233;s aux articles 575 et 575 A du code g&#233;n&#233;ral des imp&#244;ts.</p><p>&#171;&#160;VII.&#160;&#8211;&#160;La perte de recettes pour les collectivit&#233;s territoriales est compens&#233;e &#224; due concurrence par la majoration des droits mentionn&#233;s aux articles 575 et 575 A du code g&#233;n&#233;ral des imp&#244;ts.&#160;&#187;</p>",
    "exposeSommaire": "<p style=\"text-align: justify;\">Le projet de loi de financement de la s&#233;curit&#233; Sociale 2018 pr&#233;voit une augmentation de la CSG de 1.7 point sur les jeux de casino, d&#233;finis au III de l&#8217;article L.&#160;136&#8209;7&#8209;1 du code de la s&#233;curit&#233; sociale. Le taux de 9.5&#160;% applicable &#224; une fraction (68&#160;%) du produit des jeux automatiques, dits &#171;&#160;machines &#224; sous&#160;&#187; est port&#233; &#224; 11,2&#160;%.</p><p style=\"text-align: justify;\">Il est rappel&#233; qu&#8217;&#224; ce jour les casinos sont les seules personnes morales de droit priv&#233; assujetties &#224; la CSG.</p><p style=\"text-align: justify;\">Cette augmentation de taux les p&#233;nalise encore davantage.</p><p style=\"text-align: justify;\">Cet amendement propose de compenser en partie cette augmentation en modifiant les limites minimale et maximale du bar&#232;me du pr&#233;l&#232;vement progressif applicable aux jeux concern&#233;s par cette hausse du taux de CSG.</p><p style=\"text-align: justify;\">La Cour des comptes et les parlementaires l&#8217;ont r&#233;cemment d&#233;montr&#233; dans leurs tous derniers rapports, les casinos sortent difficilement d&#8217;une longue p&#233;riode de crise qui les a fortement &#233;branl&#233;s.</p><p style=\"text-align: justify;\">Les casinos sont n&#233;cessaires &#224; plus d&#8217;un titre&#160;:</p><p style=\"text-align: justify;\">- Les casinos permettent premi&#232;rement d&#8217;organiser le jeu, en assurant aux joueurs &#224; l&#8217;&#201;tat et aux collectivit&#233;s leur sinc&#233;rit&#233; et leur r&#233;gularit&#233;, dans des lieux contr&#244;l&#233;s par les pouvoirs de police, o&#249; les mineurs et les personnes fragiles ne sont pas admis.</p><p style=\"text-align: justify;\">L&#8217;affaiblissement des casinos favoriserait le d&#233;veloppement des tripots clandestins et leurs pratiques mafieuses, o&#249; ni les r&#232;gles, ni les personnes&#160;ne sont respect&#233;es&#160;; pour s&#8217;en convaincre, il suffit de voir la prolif&#233;ration de maisons de jeux clandestins entrain&#233;e par la fermeture successive des cercles &#224; Paris, et qui a oblig&#233; le gouvernement &#224; r&#233;agir, dans l&#8217;urgence, en proposant une nouvelle formule d&#8217;organisation du jeu &#224; Paris&#160;: &#171;&#160;les Clubs&#160;&#187;.</p><p style=\"text-align: justify;\">- Deuxi&#232;mement, les casinos g&#233;n&#232;rent encore 15&#160;000 emplois directs et 35&#160;000 emplois induits.</p><p style=\"text-align: justify;\">Ceux-ci doivent &#234;tre p&#233;rennis&#233;s, particuli&#232;rement parce que la plupart sont propos&#233;s dans des secteurs g&#233;ographiques souvent d&#233;pourvus d&#8217;activit&#233;s &#233;conomiques.</p><p style=\"text-align: justify;\">- Troisi&#232;mement, les casinos, depuis 1806 (D&#233;cret imp&#233;rial de Saint Cloud), ont permis l&#8217;incomparable d&#233;veloppement &#233;conomique des stations baln&#233;aires et thermales fran&#231;aises&#160;; ce sont les casinos qui ont fait les stations et pas l&#8217;inverse, contribuant ainsi &#224; faire de la France la premi&#232;re destination touristique au monde.</p><p style=\"text-align: justify;\">Au-del&#224;, ils jouent un r&#244;le particulier et pr&#233;pond&#233;rant dans les stations, dont ils sont g&#233;n&#233;ralement la principale ressource fiscale, mais &#233;galement des acteurs socio-&#233;conomiques qui participent activement &#224; la vie culturelle et artistique (premiers organisateurs de spectacles vivants en France), au maintien d&#8217;h&#244;telleries de qualit&#233; et enfin au soutien notable de la vie associative locale.</p><p style=\"text-align: justify;\">C&#8217;est pourquoi la hausse du taux de la contribution sociale doit &#234;tre compens&#233;e par une adaptation de son assiette de pr&#233;l&#232;vement sur le produit brut des jeux.</p>",
    "annexeExposeSommaire": {
      "@xmlns:xsi": "http://www.w3.org/2001/XMLSchema-instance",
      "@xsi:nil": "true"
    }
  },
  "representations": {
    "representation": {
      "nom": "PDF",
      "typeMime": {
        "type": "application",
        "subType": "PDF"
      },
      "statutRepresentation": {
        "verbatim": "true",
        "canonique": "true",
        "officielle": "true",
        "transcription": "false",
        "enregistrement": "false"
      },
      "repSource": {
        "@xmlns:xsi": "http://www.w3.org/2001/XMLSchema-instance",
        "@xsi:nil": "true"
      },
      "offset": {
        "@xmlns:xsi": "http://www.w3.org/2001/XMLSchema-instance",
        "@xsi:nil": "true"
      },
      "contenu": {
        "documentURI": "/15/amendements/0384/AN/130.pdf"
      },
      "dateDispoRepresentation": {
        "@xmlns:xsi": "http://www.w3.org/2001/XMLSchema-instance",
        "@xsi:nil": "true"
      }
    }
  },
  "seanceDiscussion": "RUANR5L15S2018IDS20818",
  "sort": {
    "dateSaisie": "2017-12-07T00:08:55.000+01:00",
    "sortEnSeance": "Rejeté"
  },
  "dateDepot": "2017-11-30T01:00:00.000+01:00",
  "dateDistribution": "2017-12-05T01:00:00.000+01:00",
  "article99": "0",
  "loiReference": {
    "codeLoi": {
      "@xmlns:xsi": "http://www.w3.org/2001/XMLSchema-instance",
      "@xsi:nil": "true"
    },
    "divisionCodeLoi": {
      "@xmlns:xsi": "http://www.w3.org/2001/XMLSchema-instance",
      "@xsi:nil": "true"
    }
  }
}