{
  "@xmlns": "http://schemas.assemblee-nationale.fr/referentiel",
  "uid": "AMANR5L15SEA717460B2272P2D1N34",
  "identifiant": {
    "legislature": "15",
    "numero": "34",
    "numRect": "0",
    "saisine": {
      "refTexteLegislatif": "PRJLANR5L15B2272",
      "numeroPartiePLF": "2",
      "organeExamen": "PO717460",
      "mentionSecondeDeliberation": "0"
    }
  },
  "numeroLong": "II-34",
  "etapeTexte": "1ère lecture (1ère assemblée saisie)",
  "triAmendement": "emaaaaaaaaaaaaaaaaaaaaaaaaaaaaaaaaaaaaaaaaaaaaaaaazzzzzzzzzzzx",
  "cardinaliteAmdtMultiples": "1",
  "amendementParent": {
    "@xmlns:xsi": "http://www.w3.org/2001/XMLSchema-instance",
    "@xsi:nil": "true"
  },
  "etat": "Discuté",
  "signataires": {
    "auteur": {
      "typeAuteur": "Depute",
      "acteurRef": "PA266793",
      "organeRef": {
        "@xmlns:xsi": "http://www.w3.org/2001/XMLSchema-instance",
        "@xsi:nil": "true"
      },
      "groupePolitiqueRef": "PO730934"
    },
    "cosignataires": {
      "acteurRef": [
        "PA340853",
        "PA266793"
      ]
    },
    "texteAffichable": "M.&#160;Bony et M.&#160;Leclerc"
  },
  "pointeurFragmentTexte": {
    "missionVisee": {
      "@xmlns:xsi": "http://www.w3.org/2001/XMLSchema-instance",
      "@xsi:nil": "true"
    },
    "division": {
      "titre": "Article 48",
      "articleDesignationCourte": "APRÈS ART. 48",
      "type": "ARTICLE",
      "avant_A_Apres": "Après",
      "divisionRattachee": "APRÈS L'ARTICLE 48, insérer l'article suivant:",
      "articleAdditionnel": "1",
      "chapitreAdditionnel": {
        "@xmlns:xsi": "http://www.w3.org/2001/XMLSchema-instance",
        "@xsi:nil": "true"
      },
      "urlDivisionTexteVise": "/15/textes/2272C.asp#D_Article_48"
    },
    "alinea": {
      "@xmlns:xsi": "http://www.w3.org/2001/XMLSchema-instance",
      "@xsi:nil": "true"
    }
  },
  "corps": {
    "dispositif": "<p style=\"text-align: justify;\">Le I de l&#8217;article&#160;1520 du code g&#233;n&#233;ral des imp&#244;ts est compl&#233;t&#233; par un alin&#233;a ainsi r&#233;dig&#233;&#160;:</p><p style=\"text-align: justify;\">&#171;&#160;Le produit de la taxe ne peut exc&#233;der de plus de 15&#160;% le montant des d&#233;penses du service de collecte et de traitement des d&#233;chets mentionn&#233;es au premier alin&#233;a non couvertes par des recettes ordinaires non fiscales.&#160;&#187;</p>",
    "exposeSommaire": "<p>De nombreuses jurisprudences sont venues fragiliser ces derni&#232;res ann&#233;es la taxe d&#8217;enl&#232;vement des ordures m&#233;nag&#232;res (TEOM) entra&#238;nant des annulations de taux et mettant en difficult&#233;s le financement du service public.</p><p style=\"text-align: justify;\">Ainsi, le Conseil d&#8217;&#201;tat a, dans une s&#233;rie de d&#233;cisions d&#233;clin&#233;es ensuite au niveau des tribunaux infra, rappel&#233; que seule est admise une disproportion limit&#233;e entre les recettes de la TEOM et le co&#251;t du service public de gestion des d&#233;chets. Toutefois, aujourd&#8217;hui, la notion de disproportion limit&#233;e est difficile &#224; appr&#233;hender et laisse donc planer une incertitude pour les collectivit&#233;s. Le pr&#233;sent amendement vise donc &#224; s&#233;curiser juridiquement la notion de disproportion en la d&#233;finissant pr&#233;cis&#233;ment.</p>",
    "annexeExposeSommaire": {
      "@xmlns:xsi": "http://www.w3.org/2001/XMLSchema-instance",
      "@xsi:nil": "true"
    },
    "cartoucheDelaiDepotDepasse": {
      "@xmlns:xsi": "http://www.w3.org/2001/XMLSchema-instance",
      "@xsi:nil": "true"
    },
    "avantAppel": {
      "@xmlns:xsi": "http://www.w3.org/2001/XMLSchema-instance",
      "@xsi:nil": "true"
    }
  },
  "representations": {
    "representation": {
      "nom": "PDF",
      "typeMime": {
        "type": "application",
        "subType": "PDF"
      },
      "statutRepresentation": {
        "verbatim": "true",
        "canonique": "true",
        "officielle": "true",
        "transcription": "false",
        "enregistrement": "false"
      },
      "repSource": {
        "@xmlns:xsi": "http://www.w3.org/2001/XMLSchema-instance",
        "@xsi:nil": "true"
      },
      "offset": {
        "@xmlns:xsi": "http://www.w3.org/2001/XMLSchema-instance",
        "@xsi:nil": "true"
      },
      "contenu": {
        "documentURI": "/15/amendements/2272C/AN/34.pdf"
      },
      "dateDispoRepresentation": {
        "@xmlns:xsi": "http://www.w3.org/2001/XMLSchema-instance",
        "@xsi:nil": "true"
      }
    }
  },
  "seanceDiscussion": "RUANR5L15S2020IDS21924",
  "sort": {
    "dateSaisie": "2019-11-15T09:37:21.000+01:00",
    "sortEnSeance": "Non soutenu"
  },
  "dateDepot": "2019-10-22T02:00:00.000+02:00",
  "dateDistribution": "2019-11-14T01:00:00.000+01:00",
  "article99": "0",
  "loiReference": {
    "codeLoi": "CGI",
    "divisionCodeLoi": "1520"
  }
}