{
  "@xmlns": "http://schemas.assemblee-nationale.fr/referentiel",
  "uid": "AMANR5L15PO59051B0911P0D1N635",
  "identifiant": {
    "legislature": "15",
    "numero": "635",
    "numRect": "0",
    "saisine": {
      "refTexteLegislatif": "PRJLANR5L15B0911",
      "numeroPartiePLF": "0",
      "organeExamen": "PO59051",
      "mentionSecondeDeliberation": "0"
    }
  },
  "numeroLong": "CL635",
  "etapeTexte": "1ère lecture (1ère assemblée saisie)",
  "triAmendement": "bgi",
  "cardinaliteAmdtMultiples": "1",
  "amendementParent": {
    "@xmlns:xsi": "http://www.w3.org/2001/XMLSchema-instance",
    "@xsi:nil": "true"
  },
  "etat": "Discuté",
  "signataires": {
    "auteur": {
      "typeAuteur": "Depute",
      "acteurRef": "PA722142",
      "organeRef": {
        "@xmlns:xsi": "http://www.w3.org/2001/XMLSchema-instance",
        "@xsi:nil": "true"
      },
      "groupePolitiqueRef": "PO730958"
    },
    "cosignataires": {
      "acteurRef": [
        "PA721960",
        "PA722142",
        "PA720892",
        "PA719578",
        "PA721202",
        "PA721210",
        "PA718868",
        "PA2150",
        "PA720422",
        "PA720286",
        "PA588884",
        "PA720846",
        "PA719676",
        "PA720430",
        "PA721226",
        "PA718860",
        "PA721062"
      ]
    },
    "texteAffichable": "M.&#160;Ruffin,  Mme&#160;Autain, M.&#160;Bernalicis, M.&#160;Coquerel, M.&#160;Corbi&#232;re, Mme&#160;Fiat, M.&#160;Lachaud, M.&#160;Larive, M.&#160;M&#233;lenchon, Mme&#160;Obono, Mme&#160;Panot, M.&#160;Prud&apos;homme, M.&#160;Quatennens, M.&#160;Ratenon, Mme&#160;Ressiguier, Mme&#160;Rubin et Mme&#160;Taurine"
  },
  "pointeurFragmentTexte": {
    "missionVisee": {
      "@xmlns:xsi": "http://www.w3.org/2001/XMLSchema-instance",
      "@xsi:nil": "true"
    },
    "division": {
      "titre": "Article PREMIER",
      "articleDesignationCourte": "APRÈS ART. PREMIER",
      "type": "ARTICLE",
      "avant_A_Apres": "Après",
      "divisionRattachee": "APRÈS L'ARTICLE PREMIER, insérer l'article suivant:",
      "articleAdditionnel": "1",
      "chapitreAdditionnel": {
        "@xmlns:xsi": "http://www.w3.org/2001/XMLSchema-instance",
        "@xsi:nil": "true"
      },
      "urlDivisionTexteVise": "/15/textes/0911.asp#D_Article_1er"
    },
    "alinea": {
      "@xmlns:xsi": "http://www.w3.org/2001/XMLSchema-instance",
      "@xsi:nil": "true"
    }
  },
  "corps": {
    "dispositif": "<p style=\"line-height: 1.2; text-align: justify;\">Apr&#232;s le troisi&#232;me alin&#233;a de l&#8217;article&#160;24 de la Constitution, il est ins&#233;r&#233; un alin&#233;a ainsi r&#233;dig&#233;&#160;: </p><p style=\"line-height: 1.2; text-align: justify;\">&#171;&#160;Les pouvoirs de l&#8217;Assembl&#233;e nationale expirent le troisi&#232;me mardi de juin de la cinqui&#232;me ann&#233;e qui suit son &#233;lection, quand la date de son &#233;lection s&#8217;est tenue plus d&#8217;un an avant ou apr&#232;s celle de l&#8217;&#233;lection du pr&#233;sident de la R&#233;publique. Si l&#8217;Assembl&#233;e nationale a &#233;t&#233; &#233;lue moins d&#8217;un an avant ou apr&#232;s la date de l&#8217;&#233;lection du pr&#233;sident de la R&#233;publique, ses pouvoirs expirent le troisi&#232;me mardi de juin de la quatri&#232;me ann&#233;e qui suit son &#233;lection.&#160;&#187;</p>",
    "exposeSommaire": "<p style=\"line-height: 1.2; padding: 0pt 0pt 0pt 3.75pt; text-align: justify;\">Par cet amendement, nous proposons de d&#233;connecter le temps &#233;lectoral des &#233;lections pr&#233;sidentielles et l&#233;gislatives en pr&#233;cisant que ces derni&#232;res doivent avoir lieu un an avant.</p><p style=\"text-align: justify;\">Depuis les r&#233;visions constitutionnelles Chirac sur le quinquennat et Sarkozy en 2008, il est un constat partag&#233; qu&#8217;un d&#233;s&#233;quilibre majeur existe entre les pouvoirs l&#233;gislatif et ex&#233;cutif, ce dernier ayant une pr&#233;dominance marqu&#233;e et pr&#233;judiciable pour notre vitalit&#233; d&#233;mocratique Cet amendement vise tout d&#8217;abord &#224; garantir l&#8217;ind&#233;pendance calendaire de l&#8217;&#233;lection de l&#8217;Assembl&#233;e nationale, hors cas pr&#233;vus par l&#8217;article 12 de la Constitution, en posant le principe d&#8217;une disjonction des temps de d&#233;signation du pouvoir ex&#233;cutif et d&#8217;&#233;lection de l&#8217;Assembl&#233;e nationale. A cet, effet, cet amendement implique que la dur&#233;e du mandat d&#8217;un d&#233;put&#233; est de 5 ans si les &#233;lections ont lieu a minima un an avant ou apr&#232;s les &#233;lections pr&#233;sidentielles, et si cela n&#8217;est pas le cas, que son mandat soit ajust&#233; de fa&#231;on &#224; ce que le rythme &#233;lectoral permette cette absence de domination observ&#233;e en pratique du pouvoir ex&#233;cutif sur le pouvoir l&#233;gislatif.</p>",
    "annexeExposeSommaire": {
      "@xmlns:xsi": "http://www.w3.org/2001/XMLSchema-instance",
      "@xsi:nil": "true"
    }
  },
  "representations": {
    "representation": {
      "nom": "PDF",
      "typeMime": {
        "type": "application",
        "subType": "PDF"
      },
      "statutRepresentation": {
        "verbatim": "true",
        "canonique": "true",
        "officielle": "true",
        "transcription": "false",
        "enregistrement": "false"
      },
      "repSource": {
        "@xmlns:xsi": "http://www.w3.org/2001/XMLSchema-instance",
        "@xsi:nil": "true"
      },
      "offset": {
        "@xmlns:xsi": "http://www.w3.org/2001/XMLSchema-instance",
        "@xsi:nil": "true"
      },
      "contenu": {
        "documentURI": "/15/amendements/0911/CION_LOIS/CL635.pdf"
      },
      "dateDispoRepresentation": {
        "@xmlns:xsi": "http://www.w3.org/2001/XMLSchema-instance",
        "@xsi:nil": "true"
      }
    }
  },
  "seanceDiscussion": {
    "@xmlns:xsi": "http://www.w3.org/2001/XMLSchema-instance",
    "@xsi:nil": "true"
  },
  "sort": {
    "dateSaisie": "2018-06-28T19:03:10.000+02:00",
    "sortEnSeance": "Rejeté"
  },
  "dateDepot": "2018-06-22T02:00:00.000+02:00",
  "dateDistribution": "2018-06-25T02:00:00.000+02:00",
  "article99": "0",
  "loiReference": {
    "codeLoi": "24",
    "divisionCodeLoi": "3-5-0"
  }
}