{
  "@xmlns": "http://schemas.assemblee-nationale.fr/referentiel",
  "uid": "AMANR5L15SEA717460B0269P0D1N145",
  "identifiant": {
    "legislature": "15",
    "numero": "145",
    "numRect": "0",
    "saisine": {
      "refTexteLegislatif": "PRJLANR5L15B0269",
      "numeroPartiePLF": "0",
      "organeExamen": "PO717460",
      "mentionSecondeDeliberation": "0"
    }
  },
  "numeroLong": "145",
  "etapeTexte": "1ère lecture (1ère assemblée saisie)",
  "triAmendement": "li",
  "cardinaliteAmdtMultiples": "1",
  "amendementParent": {
    "@xmlns:xsi": "http://www.w3.org/2001/XMLSchema-instance",
    "@xsi:nil": "true"
  },
  "etat": "Discuté",
  "signataires": {
    "auteur": {
      "typeAuteur": "Depute",
      "acteurRef": "PA267289",
      "organeRef": {
        "@xmlns:xsi": "http://www.w3.org/2001/XMLSchema-instance",
        "@xsi:nil": "true"
      },
      "groupePolitiqueRef": "PO730934"
    },
    "cosignataires": {
      "acteurRef": [
        "PA608016",
        "PA267289",
        "PA606712",
        "PA721474",
        "PA2377",
        "PA856"
      ]
    },
    "texteAffichable": "M.&#160;Door,  M.&#160;Viry, M.&#160;Perrut, M.&#160;Lurton, M.&#160;Cherpion et Mme&#160;Louwagie"
  },
  "pointeurFragmentTexte": {
    "missionVisee": {
      "@xmlns:xsi": "http://www.w3.org/2001/XMLSchema-instance",
      "@xsi:nil": "true"
    },
    "division": {
      "titre": "Article 42",
      "articleDesignationCourte": "ART. 42",
      "type": "ARTICLE",
      "avant_A_Apres": "A",
      "divisionRattachee": "ARTICLE 42",
      "articleAdditionnel": {
        "@xmlns:xsi": "http://www.w3.org/2001/XMLSchema-instance",
        "@xsi:nil": "true"
      },
      "chapitreAdditionnel": {
        "@xmlns:xsi": "http://www.w3.org/2001/XMLSchema-instance",
        "@xsi:nil": "true"
      },
      "urlDivisionTexteVise": "/15/textes/0269.asp#D_Article_42"
    },
    "alinea": {
      "@xmlns:xsi": "http://www.w3.org/2001/XMLSchema-instance",
      "@xsi:nil": "true"
    }
  },
  "corps": {
    "dispositif": "<p style=\"text-align: justify;\">Supprimer les alin&#233;as 2 et 3.</p>",
    "exposeSommaire": "<p style=\"text-align: justify;\">Le dispositif de demande d&#8217;autorisation pr&#233;alable permet de conditionner un remboursement du r&#233;gime obligatoire &#224; l&#8217;obtention d&#8217;un accord pr&#233;alable du service m&#233;dical de l&#8217;assurance maladie. Le 5&#176; du I. pr&#233;voit d&#8217;une part, d&#8217;obliger les prescripteurs &#224; inscrire la mention &#171;&#160;non remboursable&#160;&#187; sur l&#8217;ordonnance d&#8217;une prestation ou d&#8217;un produit prescrit en l&#8217;absence d&#8217;accord pr&#233;alable, et d&#8217;autre part, de les obliger &#224; inscrire que la prise en charge est subordonn&#233;e &#224; un accord pr&#233;alable du service m&#233;dical lorsqu&#8217;une demande d&#8217;accord est en cours d&#8217;instruction.</p><p style=\"text-align: justify;\">Force est de constater, qu&#8217;encore une fois, tout est fait pour alourdir la charge administrative d&#233;j&#224; cons&#233;quente des m&#233;decins, mais qu&#8217;en plus, le renforcement du m&#233;canisme d&#8217;accord pr&#233;alable voulu par la Ministre repose essentiellement sur les m&#233;decins. Cette disposition doit, pour ces raisons, &#234;tre supprim&#233;e.</p>",
    "annexeExposeSommaire": {
      "@xmlns:xsi": "http://www.w3.org/2001/XMLSchema-instance",
      "@xsi:nil": "true"
    }
  },
  "representations": {
    "representation": {
      "nom": "PDF",
      "typeMime": {
        "type": "application",
        "subType": "PDF"
      },
      "statutRepresentation": {
        "verbatim": "true",
        "canonique": "true",
        "officielle": "true",
        "transcription": "false",
        "enregistrement": "false"
      },
      "repSource": {
        "@xmlns:xsi": "http://www.w3.org/2001/XMLSchema-instance",
        "@xsi:nil": "true"
      },
      "offset": {
        "@xmlns:xsi": "http://www.w3.org/2001/XMLSchema-instance",
        "@xsi:nil": "true"
      },
      "contenu": {
        "documentURI": "/15/amendements/0269/AN/145.pdf"
      },
      "dateDispoRepresentation": {
        "@xmlns:xsi": "http://www.w3.org/2001/XMLSchema-instance",
        "@xsi:nil": "true"
      }
    }
  },
  "seanceDiscussion": "RUANR5L15S2018IDS20714",
  "sort": {
    "dateSaisie": "2017-10-28T00:34:05.000+02:00",
    "sortEnSeance": "Rejeté"
  },
  "dateDepot": "2017-10-19T02:00:00.000+02:00",
  "dateDistribution": "2017-10-23T02:00:00.000+02:00",
  "article99": "0",
  "loiReference": {
    "codeLoi": {
      "@xmlns:xsi": "http://www.w3.org/2001/XMLSchema-instance",
      "@xsi:nil": "true"
    },
    "divisionCodeLoi": {
      "@xmlns:xsi": "http://www.w3.org/2001/XMLSchema-instance",
      "@xsi:nil": "true"
    }
  }
}