{
  "@xmlns": "http://schemas.assemblee-nationale.fr/referentiel",
  "uid": "AMANR5L15PO420120B0904P0D1N81",
  "identifiant": {
    "legislature": "15",
    "numero": "81",
    "numRect": "0",
    "saisine": {
      "refTexteLegislatif": "PRJLANR5L15B0904",
      "numeroPartiePLF": "0",
      "organeExamen": "PO420120",
      "mentionSecondeDeliberation": "0"
    }
  },
  "numeroLong": "AS81",
  "etapeTexte": "1ère lecture (1ère assemblée saisie)",
  "triAmendement": "kgs",
  "cardinaliteAmdtMultiples": "1",
  "amendementParent": {
    "@xmlns:xsi": "http://www.w3.org/2001/XMLSchema-instance",
    "@xsi:nil": "true"
  },
  "etat": "Irrecevable",
  "signataires": {
    "auteur": {
      "typeAuteur": "Depute",
      "acteurRef": "PA718768",
      "organeRef": {
        "@xmlns:xsi": "http://www.w3.org/2001/XMLSchema-instance",
        "@xsi:nil": "true"
      },
      "groupePolitiqueRef": "PO730964"
    },
    "cosignataires": {
      "acteurRef": [
        "PA721166",
        "PA718768",
        "PA718682",
        "PA721384",
        "PA721792",
        "PA721800",
        "PA719790",
        "PA720074",
        "PA720576",
        "PA721946",
        "PA718902",
        "PA719100",
        "PA722134",
        "PA720414",
        "PA718876",
        "PA719024"
      ]
    },
    "texteAffichable": "Mme&#160;Valetta Ardisson,  M.&#160;Besson-Moreau, M.&#160;Perrot, M.&#160;Marilossian, M.&#160;Fi&#233;vet, M.&#160;Blanchet, Mme&#160;Janvier, M.&#160;Matras, Mme&#160;Guerel, Mme&#160;Cazebonne, M.&#160;Ardouin, M.&#160;Chalumeau, M.&#160;C&#233;dric&#160;Roussel, M.&#160;Bois, M.&#160;Trompille et Mme&#160;Fontenel-Personne"
  },
  "pointeurFragmentTexte": {
    "missionVisee": {
      "@xmlns:xsi": "http://www.w3.org/2001/XMLSchema-instance",
      "@xsi:nil": "true"
    },
    "division": {
      "titre": "Article 16",
      "articleDesignationCourte": "ART. 16",
      "type": "ARTICLE",
      "avant_A_Apres": "A",
      "divisionRattachee": "ARTICLE 16",
      "articleAdditionnel": {
        "@xmlns:xsi": "http://www.w3.org/2001/XMLSchema-instance",
        "@xsi:nil": "true"
      },
      "chapitreAdditionnel": {
        "@xmlns:xsi": "http://www.w3.org/2001/XMLSchema-instance",
        "@xsi:nil": "true"
      },
      "urlDivisionTexteVise": "/15/textes/0904.asp#D_Article_16"
    },
    "alinea": {
      "avant_A_Apres": "Apres",
      "numero": "41",
      "alineaDesignation": {
        "@xmlns:xsi": "http://www.w3.org/2001/XMLSchema-instance",
        "@xsi:nil": "true"
      }
    }
  },
  "corps": {
    "dispositif": "<p style=\"text-align: justify;\">Apr&#232;s l&#8217;alin&#233;a&#160;41, ins&#233;rer l&#8217;alin&#233;a suivant&#160;:</p><p style=\"text-align: justify;\">&#171;&#160;10&#176;&#160;<i>(nouveau)</i>&#160;De renforcer l&#8217;acc&#232;s &#224; la formation professionnelle et &#224; l&#8217;apprentissage des travailleurs mentionn&#233;s &#224; l&#8217;article L.&#160;5213&#8209;1 et de veiller &#224; l&#8217;accessibilit&#233; et au caract&#232;re adapt&#233; des formations.&#160;&#187;</p>",
    "exposeSommaire": "<p>L&#8217;article 16 cr&#233;e un nouvel &#233;tablissement public, compos&#233; de fa&#231;on quadripartite, qui sera charg&#233; de la r&#233;gulation de la formation professionnelle continue et de l&#8217;apprentissage : France comp&#233;tences.</p><p>Afin de s&#8217;assurer que cette question soit pleinement incluse dans les missions de France Comp&#233;tences et constitue un sujet de pr&#233;occupation, il est &#233;galement propos&#233; que cet &#233;tablissement public puisse faire des recommandations sur l&#8217;acc&#232;s des personnes en situation de handicap &#224; la formation professionnelle continue et &#224; l&#8217;apprentissage.</p>",
    "annexeExposeSommaire": {
      "@xmlns:xsi": "http://www.w3.org/2001/XMLSchema-instance",
      "@xsi:nil": "true"
    }
  },
  "representations": {
    "representation": {
      "nom": "PDF",
      "typeMime": {
        "type": "application",
        "subType": "PDF"
      },
      "statutRepresentation": {
        "verbatim": "true",
        "canonique": "true",
        "officielle": "true",
        "transcription": "false",
        "enregistrement": "false"
      },
      "repSource": {
        "@xmlns:xsi": "http://www.w3.org/2001/XMLSchema-instance",
        "@xsi:nil": "true"
      },
      "offset": {
        "@xmlns:xsi": "http://www.w3.org/2001/XMLSchema-instance",
        "@xsi:nil": "true"
      },
      "contenu": {
        "documentURI": "/15/amendements/0904/CION-SOC/AS81.pdf"
      },
      "dateDispoRepresentation": {
        "@xmlns:xsi": "http://www.w3.org/2001/XMLSchema-instance",
        "@xsi:nil": "true"
      }
    }
  },
  "seanceDiscussion": {
    "@xmlns:xsi": "http://www.w3.org/2001/XMLSchema-instance",
    "@xsi:nil": "true"
  },
  "sort": {
    "@xmlns:xsi": "http://www.w3.org/2001/XMLSchema-instance",
    "@xsi:nil": "true"
  },
  "dateDepot": "2018-05-22T02:00:00.000+02:00",
  "dateDistribution": {
    "@xmlns:xsi": "http://www.w3.org/2001/XMLSchema-instance",
    "@xsi:nil": "true"
  },
  "article99": "0",
  "loiReference": {
    "codeLoi": {
      "@xmlns:xsi": "http://www.w3.org/2001/XMLSchema-instance",
      "@xsi:nil": "true"
    },
    "divisionCodeLoi": {
      "@xmlns:xsi": "http://www.w3.org/2001/XMLSchema-instance",
      "@xsi:nil": "true"
    }
  }
}