{
  "@xmlns": "http://schemas.assemblee-nationale.fr/referentiel",
  "uid": "AMANR5L15SEA717460BTC1955P0D1N513",
  "identifiant": {
    "legislature": "15",
    "numero": "513",
    "numRect": "0",
    "saisine": {
      "refTexteLegislatif": "PNREANR5L15BTC1955",
      "numeroPartiePLF": "0",
      "organeExamen": "PO717460",
      "mentionSecondeDeliberation": "0"
    }
  },
  "numeroLong": "513",
  "etapeTexte": "Lecture unique",
  "triAmendement": "apaaaaaaaaaaaaaaaaaaaaaaaaaaaaaaaaaaaaaaaaaaaaaaaaaw",
  "cardinaliteAmdtMultiples": "1",
  "amendementParent": {
    "@xmlns:xsi": "http://www.w3.org/2001/XMLSchema-instance",
    "@xsi:nil": "true"
  },
  "etat": "Discuté",
  "signataires": {
    "auteur": {
      "typeAuteur": "Depute",
      "acteurRef": "PA720996",
      "organeRef": {
        "@xmlns:xsi": "http://www.w3.org/2001/XMLSchema-instance",
        "@xsi:nil": "true"
      },
      "groupePolitiqueRef": "PO759900"
    },
    "cosignataires": {
      "acteurRef": [
        "PA720996",
        "PA607619",
        "PA333421",
        "PA605518"
      ]
    },
    "texteAffichable": "M.&#160;El Guerrab,  M.&#160;Molac, M.&#160;Fran&#231;ois-Michel&#160;Lambert et M.&#160;Pancher"
  },
  "pointeurFragmentTexte": {
    "missionVisee": {
      "@xmlns:xsi": "http://www.w3.org/2001/XMLSchema-instance",
      "@xsi:nil": "true"
    },
    "division": {
      "titre": "Article 5",
      "articleDesignationCourte": "APRÈS ART. 5",
      "type": "ARTICLE",
      "avant_A_Apres": "Après",
      "divisionRattachee": "APRÈS L'ARTICLE 5, insérer l'article suivant:",
      "articleAdditionnel": "1",
      "chapitreAdditionnel": {
        "@xmlns:xsi": "http://www.w3.org/2001/XMLSchema-instance",
        "@xsi:nil": "true"
      },
      "urlDivisionTexteVise": "/15/textes/1955.asp#D_Article_5"
    },
    "alinea": {
      "@xmlns:xsi": "http://www.w3.org/2001/XMLSchema-instance",
      "@xsi:nil": "true"
    }
  },
  "corps": {
    "dispositif": "<p>Au troisi&#232;me alin&#233;a de l&#8217;article&#160;39 du R&#232;glement, apr&#232;s le mot&#160;: &#171;&#160;budg&#233;taire&#160;&#187;, sont ins&#233;r&#233;s les mots&#160;: &#171;&#160;, ainsi qu&#8217;&#224; celle de la Commission des affaires sociales,&#160;&#187;.</p>",
    "exposeSommaire": "<p style=\"text-align: justify;\">En 2007, le Pr&#233;sident de la R&#233;publique avait souhait&#233; que la majorit&#233; permette &#224; l&#8217;opposition de pr&#233;sider la Commission des finances, comme c&#8217;est le cas au Bundestag de tr&#232;s longue date. En 2009, cet usage s&#8217;&#233;tait cristallis&#233; dans le R&#232;glement de l&#8217;Assembl&#233;e nationale, afin de faire suite &#224; la r&#233;vision constitutionnelle de 2008.</p><p style=\"text-align: justify;\">Le budget de la S&#233;curit&#233; sociale &#233;tant sup&#233;rieur &#224; celui de l&#8217;&#201;tat, il serait opportun que la pr&#233;sidence de la Commission des affaires sociales soit attribu&#233;e &#224; l&#8217;opposition. En l&#8217;esp&#232;ce, le &#171;&#160;parall&#233;lisme des formes&#160;&#187; (J.-J. Urvoas) s&#8217;impose. Tel est d&#8217;autant plus le cas que la fonction de rapporteur g&#233;n&#233;ral y a &#233;t&#233; cr&#233;&#233;e durant la pr&#233;c&#233;dente l&#233;gislature.</p>",
    "annexeExposeSommaire": {
      "@xmlns:xsi": "http://www.w3.org/2001/XMLSchema-instance",
      "@xsi:nil": "true"
    },
    "cartoucheDelaiDepotDepasse": {
      "@xmlns:xsi": "http://www.w3.org/2001/XMLSchema-instance",
      "@xsi:nil": "true"
    }
  },
  "representations": {
    "representation": {
      "nom": "PDF",
      "typeMime": {
        "type": "application",
        "subType": "PDF"
      },
      "statutRepresentation": {
        "verbatim": "true",
        "canonique": "true",
        "officielle": "true",
        "transcription": "false",
        "enregistrement": "false"
      },
      "repSource": {
        "@xmlns:xsi": "http://www.w3.org/2001/XMLSchema-instance",
        "@xsi:nil": "true"
      },
      "offset": {
        "@xmlns:xsi": "http://www.w3.org/2001/XMLSchema-instance",
        "@xsi:nil": "true"
      },
      "contenu": {
        "documentURI": "/15/amendements/1955/AN/513.pdf"
      },
      "dateDispoRepresentation": {
        "@xmlns:xsi": "http://www.w3.org/2001/XMLSchema-instance",
        "@xsi:nil": "true"
      }
    }
  },
  "seanceDiscussion": "RUANR5L15S2019IDS21667",
  "sort": {
    "dateSaisie": "2019-05-28T00:47:12.000+02:00",
    "sortEnSeance": "Rejeté"
  },
  "dateDepot": "2019-05-23T02:00:00.000+02:00",
  "dateDistribution": "2019-05-27T02:00:00.000+02:00",
  "article99": "0",
  "loiReference": {
    "codeLoi": {
      "@xmlns:xsi": "http://www.w3.org/2001/XMLSchema-instance",
      "@xsi:nil": "true"
    },
    "divisionCodeLoi": "39"
  }
}