{
  "@xmlns": "http://schemas.assemblee-nationale.fr/referentiel",
  "uid": "AMANR5L15PO59051B1802P0D1N325",
  "identifiant": {
    "legislature": "15",
    "numero": "325",
    "numRect": "0",
    "saisine": {
      "refTexteLegislatif": "PRJLANR5L15B1802",
      "numeroPartiePLF": "0",
      "organeExamen": "PO59051",
      "mentionSecondeDeliberation": "0"
    }
  },
  "numeroLong": "CL325",
  "etapeTexte": "1ère lecture (1ère assemblée saisie)",
  "triAmendement": "eiaaaaaaaaaaaaaaaaaaaaaaaaaaaaaaaaaaaaaaaaaaaaaaaac",
  "cardinaliteAmdtMultiples": "1",
  "amendementParent": {
    "@xmlns:xsi": "http://www.w3.org/2001/XMLSchema-instance",
    "@xsi:nil": "true"
  },
  "etat": "Retiré",
  "signataires": {
    "auteur": {
      "typeAuteur": "Depute",
      "acteurRef": "PA722170",
      "organeRef": {
        "@xmlns:xsi": "http://www.w3.org/2001/XMLSchema-instance",
        "@xsi:nil": "true"
      },
      "groupePolitiqueRef": "PO730964"
    },
    "cosignataires": {
      "acteurRef": [
        "PA719850",
        "PA722170"
      ]
    },
    "texteAffichable": "Mme&#160;Beaudouin-Hubiere et Mme&#160;Motin"
  },
  "pointeurFragmentTexte": {
    "missionVisee": {
      "@xmlns:xsi": "http://www.w3.org/2001/XMLSchema-instance",
      "@xsi:nil": "true"
    },
    "division": {
      "titre": "Article 18",
      "articleDesignationCourte": "APRÈS ART. 18",
      "type": "ARTICLE",
      "avant_A_Apres": "Après",
      "divisionRattachee": "APRÈS L'ARTICLE 18, insérer l'article suivant:",
      "articleAdditionnel": "1",
      "chapitreAdditionnel": {
        "@xmlns:xsi": "http://www.w3.org/2001/XMLSchema-instance",
        "@xsi:nil": "true"
      },
      "urlDivisionTexteVise": "/15/textes/1802.asp#D_Article_18"
    },
    "alinea": {
      "@xmlns:xsi": "http://www.w3.org/2001/XMLSchema-instance",
      "@xsi:nil": "true"
    }
  },
  "corps": {
    "dispositif": "<p style=\"text-align: justify;\">&#192; la premi&#232;re phrase de l&#8217;article L.&#160;521&#8209;6 du code du travail, les mots&#160;: &#171;&#160;non soumis aux dispositions de l&#8217;article premier de la loi n&#176; 82&#8209;889 du 19 octobre 1982&#160;&#187; sont supprim&#233;s.</p>",
    "exposeSommaire": "<p>Dans la Fonction publique d'&#201;tat, la retenue sur salaire en cas de gr&#232;ve correspond &#224; la r&#232;gle du \"trenti&#232;me indivisible\", c'est-&#224;-dire que quel que soit le nombre d'heures durant lesquelles le fonctionnaire cesse le travail sur une journ&#233;e, la retenue est la m&#234;me, celle d'une journ&#233;e enti&#232;re.</p><p>Pour la Fonction publique territoriale, la r&#232;gle est celle d'une stricte proportionnalit&#233; des retenues par rapport &#224; la dur&#233;e de l'arr&#234;t de travail. Cette diff&#233;rence subsiste en vertu du maintien de la r&#233;f&#233;rence, dans l&#8217;article 521-6, aux dispositions de l&#8217;article 1 de la loi de 1982, bien que cet article ait &#233;t&#233; abrog&#233;.</p><p>Supprimer cette r&#233;f&#233;rence permet d&#8217;harmoniser les r&#232;gles de calcul de la retenue applicable en raison de l&#8217;absence de service fait&#160;: la retenue se fait &#224; la journ&#233;e et non &#224; l&#8217;heure.</p>",
    "annexeExposeSommaire": {
      "@xmlns:xsi": "http://www.w3.org/2001/XMLSchema-instance",
      "@xsi:nil": "true"
    },
    "cartoucheDelaiDepotDepasse": {
      "@xmlns:xsi": "http://www.w3.org/2001/XMLSchema-instance",
      "@xsi:nil": "true"
    }
  },
  "representations": {
    "representation": {
      "nom": "PDF",
      "typeMime": {
        "type": "application",
        "subType": "PDF"
      },
      "statutRepresentation": {
        "verbatim": "true",
        "canonique": "true",
        "officielle": "true",
        "transcription": "false",
        "enregistrement": "false"
      },
      "repSource": {
        "@xmlns:xsi": "http://www.w3.org/2001/XMLSchema-instance",
        "@xsi:nil": "true"
      },
      "offset": {
        "@xmlns:xsi": "http://www.w3.org/2001/XMLSchema-instance",
        "@xsi:nil": "true"
      },
      "contenu": {
        "documentURI": "/15/amendements/1802/CION_LOIS/CL325.pdf"
      },
      "dateDispoRepresentation": {
        "@xmlns:xsi": "http://www.w3.org/2001/XMLSchema-instance",
        "@xsi:nil": "true"
      }
    }
  },
  "seanceDiscussion": {
    "@xmlns:xsi": "http://www.w3.org/2001/XMLSchema-instance",
    "@xsi:nil": "true"
  },
  "sort": {
    "@xmlns:xsi": "http://www.w3.org/2001/XMLSchema-instance",
    "@xsi:nil": "true"
  },
  "dateDepot": "2019-04-26T02:00:00.000+02:00",
  "dateDistribution": "2019-04-30T02:00:00.000+02:00",
  "article99": "0",
  "loiReference": {
    "codeLoi": "travail",
    "divisionCodeLoi": "L521-6"
  }
}