{
  "@xmlns": "http://schemas.assemblee-nationale.fr/referentiel",
  "uid": "AMANR5L15SEA717460BTC1974P0D1N3370",
  "identifiant": {
    "legislature": "15",
    "numero": "3370",
    "numRect": "0",
    "saisine": {
      "refTexteLegislatif": "PRJLANR5L15BTC1974",
      "numeroPartiePLF": "0",
      "organeExamen": "PO717460",
      "mentionSecondeDeliberation": "0"
    }
  },
  "numeroLong": "3370",
  "etapeTexte": "1ère lecture (2ème assemblée saisie)",
  "triAmendement": "qbaaaaaaaaaaaaaaaaaaaaaaaaaaaaaaaaaaaaaaaaaaaaaaaas",
  "cardinaliteAmdtMultiples": "1",
  "amendementParent": {
    "@xmlns:xsi": "http://www.w3.org/2001/XMLSchema-instance",
    "@xsi:nil": "true"
  },
  "etat": "Retiré",
  "signataires": {
    "auteur": {
      "typeAuteur": "Depute",
      "acteurRef": "PA609245",
      "organeRef": {
        "@xmlns:xsi": "http://www.w3.org/2001/XMLSchema-instance",
        "@xsi:nil": "true"
      },
      "groupePolitiqueRef": "PO730934"
    },
    "cosignataires": {
      "acteurRef": [
        "PA1012",
        "PA643089",
        "PA721678",
        "PA609245",
        "PA709315",
        "PA267527",
        "PA719318",
        "PA720210",
        "PA267204",
        "PA607090",
        "PA340853",
        "PA718884",
        "PA267289",
        "PA643134",
        "PA267735",
        "PA2155",
        "PA332523"
      ]
    },
    "texteAffichable": "Mme&#160;Lacroute,  M.&#160;Sermier, Mme&#160;Bazin-Malgras, Mme&#160;Anthoine, M.&#160;Thi&#233;riot, M.&#160;de Ganay, M.&#160;Saddier, M.&#160;Viala, M.&#160;de la Verpilli&#232;re, M.&#160;Jean-Pierre&#160;Vigier, Mme&#160;Beauvais, Mme&#160;Dalloz, M.&#160;Reda, Mme&#160;Valentin, M.&#160;Menuel, M.&#160;Leclerc et M.&#160;Door"
  },
  "pointeurFragmentTexte": {
    "missionVisee": {
      "@xmlns:xsi": "http://www.w3.org/2001/XMLSchema-instance",
      "@xsi:nil": "true"
    },
    "division": {
      "titre": "Article 44 bis",
      "articleDesignationCourte": "APRÈS ART. 44 BIS",
      "type": "ARTICLE",
      "avant_A_Apres": "Après",
      "divisionRattachee": "APRÈS L'ARTICLE 44 BIS, insérer l'article suivant:",
      "articleAdditionnel": "1",
      "chapitreAdditionnel": {
        "@xmlns:xsi": "http://www.w3.org/2001/XMLSchema-instance",
        "@xsi:nil": "true"
      },
      "urlDivisionTexteVise": "/15/textes/1974.asp#D_Article_44_bis"
    },
    "alinea": {
      "@xmlns:xsi": "http://www.w3.org/2001/XMLSchema-instance",
      "@xsi:nil": "true"
    }
  },
  "corps": {
    "dispositif": "<p style=\"text-align: justify;\">A la premi&#232;re phrase de l&#8217;article L. 1324-7 du code des transports, les mots &#171; quarante-huit &#187; sont remplac&#233;s par les mots &#171; soixante-douze &#187;.</p>",
    "exposeSommaire": "<p>L&#8217;article L. 1324-7 du code des transports dispose que &#171;&#160;les salari&#233;s relevant des cat&#233;gories d'agents mentionn&#233;es dans l'accord collectif ou le plan de pr&#233;visibilit&#233; pr&#233;vus &#224; l'article L. 1222-7 informent, au plus tard quarante-huit heures avant de participer &#224; la gr&#232;ve, le chef d'entreprise ou la personne d&#233;sign&#233;e par lui de leur intention d'y participer.&#160;&#187;</p><p>Cette information est n&#233;cessaire aux entreprises de transport pour mettre en place l&#8217;accord collectif de pr&#233;visibilit&#233; pr&#233;vu &#224; l&#8217;article L. 1222-7, accord lui-m&#234;me n&#233;cessaire &#224; la mise en &#339;uvre du plan de transport adapt&#233; pr&#233;vu &#224; l&#8217;article L. 1222-4.</p><p>Toutefois, il appara&#238;t que ce d&#233;lai de quarante-huit heures est trop court pour permettre une organisation optimum du service en cas de perturbation.</p><p>Il est donc propos&#233; de porter &#224; soixante-douze heures le d&#233;lai de pr&#233;avis afin de de mieux organiser le service en cas de gr&#232;ve.</p>",
    "annexeExposeSommaire": {
      "@xmlns:xsi": "http://www.w3.org/2001/XMLSchema-instance",
      "@xsi:nil": "true"
    },
    "cartoucheDelaiDepotDepasse": {
      "@xmlns:xsi": "http://www.w3.org/2001/XMLSchema-instance",
      "@xsi:nil": "true"
    }
  },
  "representations": {
    "representation": {
      "nom": "PDF",
      "typeMime": {
        "type": "application",
        "subType": "PDF"
      },
      "statutRepresentation": {
        "verbatim": "true",
        "canonique": "true",
        "officielle": "true",
        "transcription": "false",
        "enregistrement": "false"
      },
      "repSource": {
        "@xmlns:xsi": "http://www.w3.org/2001/XMLSchema-instance",
        "@xsi:nil": "true"
      },
      "offset": {
        "@xmlns:xsi": "http://www.w3.org/2001/XMLSchema-instance",
        "@xsi:nil": "true"
      },
      "contenu": {
        "documentURI": "/15/amendements/1974/AN/3370.pdf"
      },
      "dateDispoRepresentation": {
        "@xmlns:xsi": "http://www.w3.org/2001/XMLSchema-instance",
        "@xsi:nil": "true"
      }
    }
  },
  "seanceDiscussion": {
    "@xmlns:xsi": "http://www.w3.org/2001/XMLSchema-instance",
    "@xsi:nil": "true"
  },
  "sort": {
    "@xmlns:xsi": "http://www.w3.org/2001/XMLSchema-instance",
    "@xsi:nil": "true"
  },
  "dateDepot": "2019-05-29T02:00:00.000+02:00",
  "dateDistribution": "2019-05-31T02:00:00.000+02:00",
  "article99": "0",
  "loiReference": {
    "codeLoi": {
      "@xmlns:xsi": "http://www.w3.org/2001/XMLSchema-instance",
      "@xsi:nil": "true"
    },
    "divisionCodeLoi": {
      "@xmlns:xsi": "http://www.w3.org/2001/XMLSchema-instance",
      "@xsi:nil": "true"
    }
  }
}