{
  "@xmlns": "http://schemas.assemblee-nationale.fr/referentiel",
  "uid": "AMANR5L15SEA717460BTC1212P0D1N206",
  "identifiant": {
    "legislature": "15",
    "numero": "206",
    "numRect": "0",
    "saisine": {
      "refTexteLegislatif": "PRJLANR5L15BTC1212",
      "numeroPartiePLF": "0",
      "organeExamen": "PO717460",
      "mentionSecondeDeliberation": "0"
    }
  },
  "numeroLong": "206",
  "etapeTexte": "1ère lecture (2ème assemblée saisie)",
  "triAmendement": "raaaaaaaaaaaaaaaaaaaaaaaaaaaaaaaaaaaaaaaaaaaaaaaaaazo",
  "cardinaliteAmdtMultiples": "1",
  "amendementParent": {
    "@xmlns:xsi": "http://www.w3.org/2001/XMLSchema-instance",
    "@xsi:nil": "true"
  },
  "etat": "Discuté",
  "signataires": {
    "auteur": {
      "typeAuteur": "Depute",
      "acteurRef": "PA720298",
      "organeRef": {
        "@xmlns:xsi": "http://www.w3.org/2001/XMLSchema-instance",
        "@xsi:nil": "true"
      },
      "groupePolitiqueRef": "PO730964"
    },
    "cosignataires": {
      "acteurRef": "PA720298"
    },
    "texteAffichable": "Mme&#160;Cariou"
  },
  "pointeurFragmentTexte": {
    "missionVisee": {
      "@xmlns:xsi": "http://www.w3.org/2001/XMLSchema-instance",
      "@xsi:nil": "true"
    },
    "division": {
      "titre": "Article 13",
      "articleDesignationCourte": "ART. 13",
      "type": "ARTICLE",
      "avant_A_Apres": "A",
      "divisionRattachee": "ARTICLE 13",
      "articleAdditionnel": {
        "@xmlns:xsi": "http://www.w3.org/2001/XMLSchema-instance",
        "@xsi:nil": "true"
      },
      "chapitreAdditionnel": {
        "@xmlns:xsi": "http://www.w3.org/2001/XMLSchema-instance",
        "@xsi:nil": "true"
      },
      "urlDivisionTexteVise": "/15/textes/1212.asp#D_Article_13"
    },
    "alinea": {
      "avant_A_Apres": {
        "@xmlns:xsi": "http://www.w3.org/2001/XMLSchema-instance",
        "@xsi:nil": "true"
      },
      "numero": "8",
      "alineaDesignation": {
        "@xmlns:xsi": "http://www.w3.org/2001/XMLSchema-instance",
        "@xsi:nil": "true"
      }
    }
  },
  "corps": {
    "dispositif": "<p style=\"text-align: justify;\">&#192; l&#8217;alin&#233;a&#160;8, substituer au mot&#160;:</p><p style=\"text-align: justify;\">&#171;&#160;lorsque&#160;&#187;</p><p style=\"text-align: justify;\">les mots&#160;:</p><p style=\"text-align: justify;\">&#171;&#160;lorsqu&#8217;au cours des six ann&#233;es civiles pr&#233;c&#233;dant son application,&#160;&#187;.</p>",
    "exposeSommaire": "<p style=\"text-align: justify;\">L&#8217;article&#160;13 pr&#233;voit la transmission automatique au procureur de la R&#233;publique d&#8217;un certain nombre d&#8217;affaires ayant donn&#233; lieu &#224; des p&#233;nalit&#233;s administratives.</p><p style=\"text-align: justify;\">Parmi les crit&#232;res retenus, figure celui du manquement d&#233;lib&#233;r&#233; lorsqu&#8217;il survient apr&#232;s un pr&#233;c&#233;dant comportement visant &#224; &#233;luder intentionnellement l&#8217;imp&#244;t.&#160;</p><p style=\"text-align: justify;\">Il est ainsi pr&#233;vu que les affaires ayant donn&#233; lieu &#224; une p&#233;nalit&#233; de 40&#160;% pour manquement d&#233;lib&#233;r&#233;, sur des droits dont le montant est sup&#233;rieur &#224; 100 000&#160;&#8364;, soient transmises au parquet lorsque le contribuable a commis par le pass&#233; des manquements ayant donn&#233; lieu &#224; des p&#233;nalit&#233;s de 40, 80 ou 100&#160;%.</p><p style=\"text-align: justify;\">Le pr&#233;sent amendement encadre ce crit&#232;re de transmission en pr&#233;voyant que le pr&#233;c&#233;dent manquement doit avoir &#233;t&#233; commis au cours des six ann&#233;es civiles pr&#233;c&#233;dant le nouveau manquement.</p>",
    "annexeExposeSommaire": {
      "@xmlns:xsi": "http://www.w3.org/2001/XMLSchema-instance",
      "@xsi:nil": "true"
    }
  },
  "representations": {
    "representation": {
      "nom": "PDF",
      "typeMime": {
        "type": "application",
        "subType": "PDF"
      },
      "statutRepresentation": {
        "verbatim": "true",
        "canonique": "true",
        "officielle": "true",
        "transcription": "false",
        "enregistrement": "false"
      },
      "repSource": {
        "@xmlns:xsi": "http://www.w3.org/2001/XMLSchema-instance",
        "@xsi:nil": "true"
      },
      "offset": {
        "@xmlns:xsi": "http://www.w3.org/2001/XMLSchema-instance",
        "@xsi:nil": "true"
      },
      "contenu": {
        "documentURI": "/15/amendements/1212/AN/206.pdf"
      },
      "dateDispoRepresentation": {
        "@xmlns:xsi": "http://www.w3.org/2001/XMLSchema-instance",
        "@xsi:nil": "true"
      }
    }
  },
  "seanceDiscussion": "RUANR5L15S2018IDS21242",
  "sort": {
    "dateSaisie": "2018-09-19T17:43:44.000+02:00",
    "sortEnSeance": "Adopté"
  },
  "dateDepot": "2018-09-13T02:00:00.000+02:00",
  "dateDistribution": "2018-09-17T02:00:00.000+02:00",
  "article99": "0",
  "loiReference": {
    "codeLoi": {
      "@xmlns:xsi": "http://www.w3.org/2001/XMLSchema-instance",
      "@xsi:nil": "true"
    },
    "divisionCodeLoi": {
      "@xmlns:xsi": "http://www.w3.org/2001/XMLSchema-instance",
      "@xsi:nil": "true"
    }
  }
}