{
  "@xmlns": "http://schemas.assemblee-nationale.fr/referentiel",
  "uid": "AMANR5L15PO59048B1490P0D1N634",
  "identifiant": {
    "legislature": "15",
    "numero": "634",
    "numRect": "0",
    "saisine": {
      "refTexteLegislatif": "PRJLANR5L15B1490",
      "numeroPartiePLF": "0",
      "organeExamen": "PO59048",
      "mentionSecondeDeliberation": "0"
    }
  },
  "numeroLong": "CF634",
  "etapeTexte": "Nouvelle Lecture",
  "triAmendement": "dniaaaaaaaaaaaaaaaaaaaaaaaaaaaaaaaaaaaaaaaaaaaaaaawi",
  "cardinaliteAmdtMultiples": "1",
  "amendementParent": {
    "@xmlns:xsi": "http://www.w3.org/2001/XMLSchema-instance",
    "@xsi:nil": "true"
  },
  "etat": "Irrecevable",
  "signataires": {
    "auteur": {
      "typeAuteur": "Depute",
      "acteurRef": "PA605991",
      "organeRef": {
        "@xmlns:xsi": "http://www.w3.org/2001/XMLSchema-instance",
        "@xsi:nil": "true"
      },
      "groupePolitiqueRef": "PO730934"
    },
    "cosignataires": {
      "acteurRef": "PA605991"
    },
    "texteAffichable": "Mme&#160;Genevard"
  },
  "pointeurFragmentTexte": {
    "missionVisee": {
      "@xmlns:xsi": "http://www.w3.org/2001/XMLSchema-instance",
      "@xsi:nil": "true"
    },
    "division": {
      "titre": "Article 33 bis",
      "articleDesignationCourte": "ART. 33 BIS",
      "type": "ARTICLE",
      "avant_A_Apres": "A",
      "divisionRattachee": "ARTICLE 33 BIS",
      "articleAdditionnel": {
        "@xmlns:xsi": "http://www.w3.org/2001/XMLSchema-instance",
        "@xsi:nil": "true"
      },
      "chapitreAdditionnel": {
        "@xmlns:xsi": "http://www.w3.org/2001/XMLSchema-instance",
        "@xsi:nil": "true"
      },
      "urlDivisionTexteVise": "/15/textes/1490.asp#D_Article_33_bis"
    },
    "alinea": {
      "avant_A_Apres": "Apres",
      "numero": "1",
      "alineaDesignation": {
        "@xmlns:xsi": "http://www.w3.org/2001/XMLSchema-instance",
        "@xsi:nil": "true"
      }
    }
  },
  "corps": {
    "dispositif": "<p>L&#8217;alin&#233;a 4 du I de l&#8217;article 1010 du CGI est compl&#233;t&#233; comme suit&#160;:</p><p>&#171; La taxe n'est &#233;galement pas applicable&#160;aux v&#233;hicules de type pickups &#224; usage professionnel, y compris s&#8217;ils poss&#232;dent quatre portes, dans les zones de montagne, d&#233;limit&#233;es conform&#233;ment &#224; l&#8217;article 3 de la loi modifi&#233;e n&#176;85-30 du 9 janvier 1985 relative au d&#233;veloppement et &#224; la protection de la montagne.&#187;</p><p>II.&#160;&#8211;&#160;Compl&#233;ter cet article par l&#8217;alin&#233;a suivant&#160;:</p><p>&#171;&#160;II.&#160;&#8211;&#160;La perte de recettes pour&#8230;&#160;&#187;.</p>",
    "exposeSommaire": "<p>Cet amendement vise &#224; exclure de la taxe sur les v&#233;hicules des soci&#233;t&#233;s les v&#233;hicules de type pickups &#224; usage professionnel, y compris s&#8217;ils poss&#232;dent quatre portes, en zone de montagne.</p><p>En effet, la vie en montagne et les activit&#233;s humaines sont marqu&#233;es par la n&#233;cessit&#233; de s&#8217;adapter pour surmonter les difficult&#233;s intrins&#232;ques au milieu naturel, dont certains consid&#232;rent qu&#8217;il s&#8217;agit de handicaps, li&#233;es aux conditions g&#233;ophysiques (altitude et pente), aux conditions climatiques (neige pendant plusieurs mois, temp&#233;rature, longueur de la saison hivernale) &#8230; En cons&#233;quence, dans la vie courante et dans les activit&#233;s &#233;conomiques (artisanales, agricoles, foresti&#232;res, touristiques&#8230;) les montagnards sont contraints d&#8217;utiliser des techniques, des constructions,&#160;des ouvrages d&#8217;art, des &#233;quipements, des v&#233;hicules routiers, des tracteurs ou des engins plus co&#251;teux qu&#8217;en plaine.</p><p>Si l&#8217;article 4 de la loi montagne du 28 d&#233;cembre 2016 pr&#233;voit une solidarit&#233; financi&#232;re dans future r&#233;forme de la DGF et du FPIC en imposant que soit int&#233;gr&#233;s dans leur calcul les surco&#251;ts sp&#233;cifiques induits par des conditions climatiques et g&#233;ophysiques particuli&#232;res en montagne et les services &#233;cologiques et environnementaux que la montagne produit au profit de la collectivit&#233; nationale&#8230; il n&#8217;en demeure pas moins que les autres agents &#233;conomiques de la montagne restent confront&#233;s &#224; la double peine.</p><p>En cons&#233;quence, l&#8217;&#233;quit&#233; veut que les engins tels que les pickups &#224; usage professionnel, y compris s&#8217;ils poss&#232;dent quatre portes, ne soient pas assujettis &#224; la taxe sur les v&#233;hicules des soci&#233;t&#233;s.</p>",
    "annexeExposeSommaire": {
      "@xmlns:xsi": "http://www.w3.org/2001/XMLSchema-instance",
      "@xsi:nil": "true"
    },
    "cartoucheDelaiDepotDepasse": {
      "@xmlns:xsi": "http://www.w3.org/2001/XMLSchema-instance",
      "@xsi:nil": "true"
    }
  },
  "representations": {
    "representation": {
      "nom": "PDF",
      "typeMime": {
        "type": "application",
        "subType": "PDF"
      },
      "statutRepresentation": {
        "verbatim": "true",
        "canonique": "true",
        "officielle": "true",
        "transcription": "false",
        "enregistrement": "false"
      },
      "repSource": {
        "@xmlns:xsi": "http://www.w3.org/2001/XMLSchema-instance",
        "@xsi:nil": "true"
      },
      "offset": {
        "@xmlns:xsi": "http://www.w3.org/2001/XMLSchema-instance",
        "@xsi:nil": "true"
      },
      "contenu": {
        "documentURI": "/15/amendements/1490/CION_FIN/CF634.pdf"
      },
      "dateDispoRepresentation": {
        "@xmlns:xsi": "http://www.w3.org/2001/XMLSchema-instance",
        "@xsi:nil": "true"
      }
    }
  },
  "seanceDiscussion": {
    "@xmlns:xsi": "http://www.w3.org/2001/XMLSchema-instance",
    "@xsi:nil": "true"
  },
  "sort": {
    "@xmlns:xsi": "http://www.w3.org/2001/XMLSchema-instance",
    "@xsi:nil": "true"
  },
  "dateDepot": "2018-12-13T01:00:00.000+01:00",
  "dateDistribution": "2018-12-13T01:00:00.000+01:00",
  "article99": "0",
  "loiReference": {
    "codeLoi": {
      "@xmlns:xsi": "http://www.w3.org/2001/XMLSchema-instance",
      "@xsi:nil": "true"
    },
    "divisionCodeLoi": {
      "@xmlns:xsi": "http://www.w3.org/2001/XMLSchema-instance",
      "@xsi:nil": "true"
    }
  }
}