{
  "@xmlns": "http://schemas.assemblee-nationale.fr/referentiel",
  "uid": "AMANR5L15SEA717460BTC1924P0D1N1157",
  "identifiant": {
    "legislature": "15",
    "numero": "1157",
    "numRect": "0",
    "saisine": {
      "refTexteLegislatif": "PRJLANR5L15BTC1924",
      "numeroPartiePLF": "0",
      "organeExamen": "PO717460",
      "mentionSecondeDeliberation": "0"
    }
  },
  "numeroLong": "1157",
  "etapeTexte": "1ère lecture (1ère assemblée saisie)",
  "triAmendement": "efaaaaaaaaaaaaaaaaaaaaaaaaaaaaaaaaaaaaaaaaaaaaaaaaafwzzzq",
  "cardinaliteAmdtMultiples": "1",
  "amendementParent": "AMANR5L15SEA717460BTC1924P0D1N177",
  "etat": "Discuté",
  "signataires": {
    "auteur": {
      "typeAuteur": "Depute",
      "acteurRef": "PA719748",
      "organeRef": {
        "@xmlns:xsi": "http://www.w3.org/2001/XMLSchema-instance",
        "@xsi:nil": "true"
      },
      "groupePolitiqueRef": "PO730964"
    },
    "cosignataires": {
      "acteurRef": "PA719748"
    },
    "texteAffichable": "Mme&#160;Chalas"
  },
  "pointeurFragmentTexte": {
    "missionVisee": {
      "@xmlns:xsi": "http://www.w3.org/2001/XMLSchema-instance",
      "@xsi:nil": "true"
    },
    "division": {
      "titre": "Article 16 bis",
      "articleDesignationCourte": "APRÈS ART. 16 BIS",
      "type": "ARTICLE",
      "avant_A_Apres": "Après",
      "divisionRattachee": "APRÈS L'ARTICLE 16 BIS, insérer l'article suivant:",
      "articleAdditionnel": "1",
      "chapitreAdditionnel": {
        "@xmlns:xsi": "http://www.w3.org/2001/XMLSchema-instance",
        "@xsi:nil": "true"
      },
      "urlDivisionTexteVise": "/15/textes/1924.asp#D_Article_16_bis"
    },
    "alinea": {
      "@xmlns:xsi": "http://www.w3.org/2001/XMLSchema-instance",
      "@xsi:nil": "true"
    }
  },
  "corps": {
    "dispositif": "<p>I.&#160;&#8211;&#160;&#192; l&#8217;alin&#233;a&#160;1, substituer &#224; la r&#233;f&#233;rence&#160;:</p><p style=\"text-align: justify;\">&#171;&#160;I&#160;&#187;</p><p style=\"text-align: justify;\">la r&#233;f&#233;rence&#160;:</p><p style=\"text-align: justify;\">&#171;&#160;II&#160;&#187;.</p><p style=\"text-align: justify;\">II. &#8211; En cons&#233;quence, au m&#234;me alin&#233;a, substituer &#224; la r&#233;f&#233;rence&#160;:</p><p style=\"text-align: justify;\">&#171;&#160;I <i>bis</i>&#160;&#187;</p><p style=\"text-align: justify;\">la r&#233;f&#233;rence&#160;:</p><p style=\"text-align: justify;\">&#171;&#160;II <i>bis</i>&#160;&#187;.</p><p style=\"text-align: justify;\">III. &#8211; En cons&#233;quence, proc&#233;der &#224; la m&#234;me substitution au d&#233;but de l&#8217;alin&#233;a&#160;2.</p>",
    "exposeSommaire": "<p style=\"text-align: justify;\">Sous-amendement de pr&#233;cision.</p>",
    "annexeExposeSommaire": {
      "@xmlns:xsi": "http://www.w3.org/2001/XMLSchema-instance",
      "@xsi:nil": "true"
    },
    "cartoucheDelaiDepotDepasse": "Sous réserve de son traitement par les services de l'Assemblée nationale et de sa recevabilité"
  },
  "representations": {
    "representation": {
      "nom": "PDF",
      "typeMime": {
        "type": "application",
        "subType": "PDF"
      },
      "statutRepresentation": {
        "verbatim": "true",
        "canonique": "true",
        "officielle": "true",
        "transcription": "false",
        "enregistrement": "false"
      },
      "repSource": {
        "@xmlns:xsi": "http://www.w3.org/2001/XMLSchema-instance",
        "@xsi:nil": "true"
      },
      "offset": {
        "@xmlns:xsi": "http://www.w3.org/2001/XMLSchema-instance",
        "@xsi:nil": "true"
      },
      "contenu": {
        "documentURI": "/15/amendements/1924/AN/1157.pdf"
      },
      "dateDispoRepresentation": {
        "@xmlns:xsi": "http://www.w3.org/2001/XMLSchema-instance",
        "@xsi:nil": "true"
      }
    }
  },
  "seanceDiscussion": {
    "@xmlns:xsi": "http://www.w3.org/2001/XMLSchema-instance",
    "@xsi:nil": "true"
  },
  "sort": {
    "dateSaisie": "2019-05-17T19:09:42.000+02:00",
    "sortEnSeance": "Adopté"
  },
  "dateDepot": "2019-05-17T02:00:00.000+02:00",
  "dateDistribution": "2019-05-17T02:00:00.000+02:00",
  "article99": "0",
  "loiReference": {
    "codeLoi": {
      "@xmlns:xsi": "http://www.w3.org/2001/XMLSchema-instance",
      "@xsi:nil": "true"
    },
    "divisionCodeLoi": {
      "@xmlns:xsi": "http://www.w3.org/2001/XMLSchema-instance",
      "@xsi:nil": "true"
    }
  }
}