{
  "@xmlns": "http://schemas.assemblee-nationale.fr/referentiel",
  "uid": "AMANR5L15SEA717460BTC2124P0D1N5",
  "identifiant": {
    "legislature": "15",
    "numero": "5",
    "numRect": "0",
    "saisine": {
      "refTexteLegislatif": "PRJLANR5L15BTC2124",
      "numeroPartiePLF": "0",
      "organeExamen": "PO717460",
      "mentionSecondeDeliberation": "0"
    }
  },
  "numeroLong": "5",
  "etapeTexte": "1ère lecture (1ère assemblée saisie)",
  "triAmendement": "caaaaaaaaaaaaaaaaaaaaaaaaaaaaaaaaaaaaaaaaaaaaaaaaabx",
  "cardinaliteAmdtMultiples": "1",
  "amendementParent": {
    "@xmlns:xsi": "http://www.w3.org/2001/XMLSchema-instance",
    "@xsi:nil": "true"
  },
  "etat": "Discuté",
  "signataires": {
    "auteur": {
      "typeAuteur": "Depute",
      "acteurRef": "PA718850",
      "organeRef": {
        "@xmlns:xsi": "http://www.w3.org/2001/XMLSchema-instance",
        "@xsi:nil": "true"
      },
      "groupePolitiqueRef": "PO730934"
    },
    "cosignataires": {
      "acteurRef": [
        "PA718850",
        "PA721070"
      ]
    },
    "texteAffichable": "M.&#160;Cordier et Mme&#160;Ramassamy"
  },
  "pointeurFragmentTexte": {
    "missionVisee": {
      "@xmlns:xsi": "http://www.w3.org/2001/XMLSchema-instance",
      "@xsi:nil": "true"
    },
    "division": {
      "titre": "Article PREMIER",
      "articleDesignationCourte": "ART. PREMIER",
      "type": "ARTICLE",
      "avant_A_Apres": "A",
      "divisionRattachee": "ARTICLE PREMIER",
      "articleAdditionnel": {
        "@xmlns:xsi": "http://www.w3.org/2001/XMLSchema-instance",
        "@xsi:nil": "true"
      },
      "chapitreAdditionnel": {
        "@xmlns:xsi": "http://www.w3.org/2001/XMLSchema-instance",
        "@xsi:nil": "true"
      },
      "urlDivisionTexteVise": "/15/textes/2124.asp#D_Article_1er"
    },
    "alinea": {
      "@xmlns:xsi": "http://www.w3.org/2001/XMLSchema-instance",
      "@xsi:nil": "true"
    }
  },
  "corps": {
    "dispositif": "<p>Supprimer cet article.</p>",
    "exposeSommaire": "<p style=\"text-align: justify;\">Ce trait&#233; comporte certes des points positifs pour nos exportateurs, notamment de lait ou de fromage, mais il met en p&#233;ril des fili&#232;res agricoles, en particulier la fili&#232;re bovine.</p><p style=\"text-align: justify;\">Alors que le Gouvernement Fran&#231;ais impose toujours plus de normes aux &#233;leveurs fran&#231;ais, il n&#8217;est pas acceptable d&#8217;ouvrir nos portes &#224; des productions agricoles qui ne les respectent pas&#160;! Il est important de rappeler que 66&#160;% des produits phytosanitaires autoris&#233;s au Canada sont interdits en France.</p><p style=\"text-align: justify;\">Les agriculteurs rencontr&#233;s dans les Ardennes, notamment au Comice de Maubert-Fontaine, s&#8217;inqui&#232;tent l&#233;gitimement de la concurrence d&#233;loyale, par exemple sur l&#8217;Aloyau et les pi&#232;ces nobles.</p><p style=\"text-align: justify;\">Ce trait&#233; ne garantit pas non plus la s&#233;curit&#233; sanitaire de nos concitoyens car les hormones, les OGM et les farines animales sont autoris&#233;es au Canada.</p><p style=\"text-align: justify;\">Il ne s&#8217;agit pas de s&#8217;opposer &#224; une coop&#233;ration &#233;troite avec le Canada, pays ami de la France de longue date, mais de revoir le volet bovin de ce trait&#233; qui n&#8217;est pas satisfaisant &#224; ce stade.</p>",
    "annexeExposeSommaire": {
      "@xmlns:xsi": "http://www.w3.org/2001/XMLSchema-instance",
      "@xsi:nil": "true"
    },
    "cartoucheDelaiDepotDepasse": {
      "@xmlns:xsi": "http://www.w3.org/2001/XMLSchema-instance",
      "@xsi:nil": "true"
    }
  },
  "representations": {
    "representation": {
      "nom": "PDF",
      "typeMime": {
        "type": "application",
        "subType": "PDF"
      },
      "statutRepresentation": {
        "verbatim": "true",
        "canonique": "true",
        "officielle": "true",
        "transcription": "false",
        "enregistrement": "false"
      },
      "repSource": {
        "@xmlns:xsi": "http://www.w3.org/2001/XMLSchema-instance",
        "@xsi:nil": "true"
      },
      "offset": {
        "@xmlns:xsi": "http://www.w3.org/2001/XMLSchema-instance",
        "@xsi:nil": "true"
      },
      "contenu": {
        "documentURI": "/15/amendements/2124/AN/5.pdf"
      },
      "dateDispoRepresentation": {
        "@xmlns:xsi": "http://www.w3.org/2001/XMLSchema-instance",
        "@xsi:nil": "true"
      }
    }
  },
  "seanceDiscussion": "RUANR5L15S2019IDS21768",
  "sort": {
    "dateSaisie": "2019-07-18T00:41:01.000+02:00",
    "sortEnSeance": "Rejeté"
  },
  "dateDepot": "2019-07-11T02:00:00.000+02:00",
  "dateDistribution": "2019-07-16T02:00:00.000+02:00",
  "article99": "0",
  "loiReference": {
    "codeLoi": {
      "@xmlns:xsi": "http://www.w3.org/2001/XMLSchema-instance",
      "@xsi:nil": "true"
    },
    "divisionCodeLoi": {
      "@xmlns:xsi": "http://www.w3.org/2001/XMLSchema-instance",
      "@xsi:nil": "true"
    }
  }
}