{
  "@xmlns": "http://schemas.assemblee-nationale.fr/referentiel",
  "uid": "AMANR5L15PO59051B1503P0D1N197",
  "identifiant": {
    "legislature": "15",
    "numero": "197",
    "numRect": "0",
    "saisine": {
      "refTexteLegislatif": "PRJLANR5L15B1503",
      "numeroPartiePLF": "0",
      "organeExamen": "PO59051",
      "mentionSecondeDeliberation": "0"
    }
  },
  "numeroLong": "CL197",
  "etapeTexte": "Nouvelle Lecture",
  "triAmendement": "bbaaaaaaaaaaaaaaaaaaaaaaaaaaaaaaaaaaaaaaaaaaaaaaaafi",
  "cardinaliteAmdtMultiples": "1",
  "amendementParent": {
    "@xmlns:xsi": "http://www.w3.org/2001/XMLSchema-instance",
    "@xsi:nil": "true"
  },
  "etat": "Discuté",
  "signataires": {
    "auteur": {
      "typeAuteur": "Depute",
      "acteurRef": "PA748954",
      "organeRef": {
        "@xmlns:xsi": "http://www.w3.org/2001/XMLSchema-instance",
        "@xsi:nil": "true"
      },
      "groupePolitiqueRef": "PO730934"
    },
    "cosignataires": {
      "acteurRef": [
        "PA2960",
        "PA608016",
        "PA642847",
        "PA718884",
        "PA719318",
        "PA267378",
        "PA334654",
        "PA718838",
        "PA340853",
        "PA266793",
        "PA721314",
        "PA748954",
        "PA721506",
        "PA605036",
        "PA1874",
        "PA720630",
        "PA767"
      ]
    },
    "texteAffichable": "M.&#160;Savignat,  M.&#160;Abad, M.&#160;Bazin, M.&#160;Bony, M.&#160;Brun, M.&#160;Cattin, Mme&#160;Kuster, M.&#160;Le Fur, M.&#160;Leclerc, Mme&#160;Levy, Mme&#160;Louwagie, M.&#160;Minot, M.&#160;Schellenberger, M.&#160;Straumann, M.&#160;Woerth, Mme&#160;Anthoine et Mme&#160;Bazin-Malgras"
  },
  "pointeurFragmentTexte": {
    "missionVisee": {
      "@xmlns:xsi": "http://www.w3.org/2001/XMLSchema-instance",
      "@xsi:nil": "true"
    },
    "division": {
      "titre": "Article 12",
      "articleDesignationCourte": "ART. 12",
      "type": "ARTICLE",
      "avant_A_Apres": "A",
      "divisionRattachee": "ARTICLE 12",
      "articleAdditionnel": {
        "@xmlns:xsi": "http://www.w3.org/2001/XMLSchema-instance",
        "@xsi:nil": "true"
      },
      "chapitreAdditionnel": {
        "@xmlns:xsi": "http://www.w3.org/2001/XMLSchema-instance",
        "@xsi:nil": "true"
      },
      "urlDivisionTexteVise": "/15/textes/1503.asp#D_Article_12"
    },
    "alinea": {
      "avant_A_Apres": {
        "@xmlns:xsi": "http://www.w3.org/2001/XMLSchema-instance",
        "@xsi:nil": "true"
      },
      "numero": "5",
      "alineaDesignation": {
        "@xmlns:xsi": "http://www.w3.org/2001/XMLSchema-instance",
        "@xsi:nil": "true"
      }
    }
  },
  "corps": {
    "dispositif": "<p>R&#233;diger ainsi l&#8217;alin&#233;a&#160;5&#160;:</p><p>&#171;&#160;Les &#233;poux peuvent accepter le principe de la rupture du mariage en cours de proc&#233;dure.&#160;&#187;</p>",
    "exposeSommaire": "<p>Le fait de permettre l'acceptation du principe de la rupture aux seules proc&#233;dures introduites sans indication de leur fondement est en contradiction avec l'objectif avou&#233; de la pr&#233;sente r&#233;forme. Si en cours de proc&#233;dure, les parties s'entendent sur le principe de la rupture, cet accord aura pour cons&#233;quence d'all&#233;ger la proc&#233;dure, le fait qu'elle ait &#233;t&#233; introduite avec ou sans fondement &#233;tant parfaitement indiff&#233;rent.</p><p>&#160;</p>",
    "annexeExposeSommaire": {
      "@xmlns:xsi": "http://www.w3.org/2001/XMLSchema-instance",
      "@xsi:nil": "true"
    },
    "cartoucheDelaiDepotDepasse": {
      "@xmlns:xsi": "http://www.w3.org/2001/XMLSchema-instance",
      "@xsi:nil": "true"
    }
  },
  "representations": {
    "representation": {
      "nom": "PDF",
      "typeMime": {
        "type": "application",
        "subType": "PDF"
      },
      "statutRepresentation": {
        "verbatim": "true",
        "canonique": "true",
        "officielle": "true",
        "transcription": "false",
        "enregistrement": "false"
      },
      "repSource": {
        "@xmlns:xsi": "http://www.w3.org/2001/XMLSchema-instance",
        "@xsi:nil": "true"
      },
      "offset": {
        "@xmlns:xsi": "http://www.w3.org/2001/XMLSchema-instance",
        "@xsi:nil": "true"
      },
      "contenu": {
        "documentURI": "/15/amendements/1503/CION_LOIS/CL197.pdf"
      },
      "dateDispoRepresentation": {
        "@xmlns:xsi": "http://www.w3.org/2001/XMLSchema-instance",
        "@xsi:nil": "true"
      }
    }
  },
  "seanceDiscussion": {
    "@xmlns:xsi": "http://www.w3.org/2001/XMLSchema-instance",
    "@xsi:nil": "true"
  },
  "sort": {
    "dateSaisie": "2018-12-19T16:41:24.000+01:00",
    "sortEnSeance": "Retiré"
  },
  "dateDepot": "2018-12-17T01:00:00.000+01:00",
  "dateDistribution": "2018-12-18T01:00:00.000+01:00",
  "article99": "0",
  "loiReference": {
    "codeLoi": {
      "@xmlns:xsi": "http://www.w3.org/2001/XMLSchema-instance",
      "@xsi:nil": "true"
    },
    "divisionCodeLoi": {
      "@xmlns:xsi": "http://www.w3.org/2001/XMLSchema-instance",
      "@xsi:nil": "true"
    }
  }
}