{
  "@xmlns": "http://schemas.assemblee-nationale.fr/referentiel",
  "uid": "AMANR5L15PO59048B0485P0D1N331",
  "identifiant": {
    "legislature": "15",
    "numero": "331",
    "numRect": "0",
    "saisine": {
      "refTexteLegislatif": "PRJLANR5L15B0485",
      "numeroPartiePLF": "0",
      "organeExamen": "PO59048",
      "mentionSecondeDeliberation": "0"
    }
  },
  "numeroLong": "CF331",
  "etapeTexte": "Nouvelle Lecture",
  "triAmendement": "bgeeu",
  "cardinaliteAmdtMultiples": "1",
  "amendementParent": "AMANR5L15PO59048B0485P0D1N141",
  "etat": "Discuté",
  "signataires": {
    "auteur": {
      "typeAuteur": "Depute",
      "acteurRef": "PA608016",
      "organeRef": {
        "@xmlns:xsi": "http://www.w3.org/2001/XMLSchema-instance",
        "@xsi:nil": "true"
      },
      "groupePolitiqueRef": "PO730934"
    },
    "cosignataires": {
      "acteurRef": [
        "PA720644",
        "PA709315",
        "PA608016",
        "PA721286",
        "PA606712",
        "PA267429",
        "PA608416",
        "PA330684",
        "PA718850",
        "PA266797",
        "PA266793",
        "PA642847",
        "PA267735",
        "PA719318",
        "PA267200",
        "PA2377",
        "PA267204",
        "PA1874",
        "PA643134",
        "PA267450",
        "PA718884",
        "PA340853",
        "PA605036",
        "PA332523",
        "PA609245"
      ]
    },
    "texteAffichable": "Mme&#160;Louwagie,  M.&#160;Cordier, M.&#160;Cinieri, M.&#160;Abad, Mme&#160;Bazin-Malgras, Mme&#160;Val&#233;rie&#160;Boyer, M.&#160;Leclerc, M.&#160;Ramadier, M.&#160;Lurton, Mme&#160;Dalloz, M.&#160;Sermier, Mme&#160;Lacroute, M.&#160;Nury, M.&#160;Viala, M.&#160;Bony, M.&#160;Perrut, M.&#160;de Ganay, M.&#160;Le Fur, M.&#160;R&#233;mi&#160;Delatte, M.&#160;Gosselin, Mme&#160;Valentin, M.&#160;Bazin, M.&#160;Huyghe, M.&#160;Hetzel et Mme&#160;Anthoine"
  },
  "pointeurFragmentTexte": {
    "missionVisee": {
      "@xmlns:xsi": "http://www.w3.org/2001/XMLSchema-instance",
      "@xsi:nil": "true"
    },
    "division": {
      "titre": "Article 12",
      "articleDesignationCourte": "ART. 12",
      "type": "ARTICLE",
      "avant_A_Apres": "A",
      "divisionRattachee": "ARTICLE 12",
      "articleAdditionnel": {
        "@xmlns:xsi": "http://www.w3.org/2001/XMLSchema-instance",
        "@xsi:nil": "true"
      },
      "chapitreAdditionnel": {
        "@xmlns:xsi": "http://www.w3.org/2001/XMLSchema-instance",
        "@xsi:nil": "true"
      },
      "urlDivisionTexteVise": "/15/textes/0485.asp#D_Article_12"
    },
    "alinea": {
      "@xmlns:xsi": "http://www.w3.org/2001/XMLSchema-instance",
      "@xsi:nil": "true"
    }
  },
  "corps": {
    "dispositif": "<p>I.&#160;&#160;&#160;&#160;&#160;&#160;&#160;&#160;&#160;&#160;&#160;&#160;&#160;&#160;&#160; Apr&#232;s l&#8217;alin&#233;a 213 de l&#8217;article 12, est ins&#233;r&#233; l&#8217;alin&#233;a suivant&#160;:</p><p>&#171;&#160;3&#176; &#8211; les conditions pr&#233;vues aux articles 885 I bis et 885 I quater dans leur r&#233;daction en vigueur jusqu&#8217;au 31 d&#233;cembre 2017, sont r&#233;put&#233;es acquises si, au 1er janvier 2018, il n&#8217;existe pas de motif de remise en cause de l&#8217;exon&#233;ration partielle appliqu&#233;e, en vertu de ces articles, &#224; l'imp&#244;t de solidarit&#233; sur la fortune d&#251; jusqu'au titre de l'ann&#233;e 2017 incluse &#187;.</p><p>II.&#160;&#160;&#160;&#160;&#160;&#160;&#160;&#160;&#160;&#160;&#160;&#160;&#160; Le I s&#8217;applique &#224; compter du 1er janvier 2018.</p><p>&#160;</p><p>III.&#160;&#160;&#160;&#160;&#160;&#160;&#160;&#160;&#160;&#160;&#160;&#160; La perte de recettes r&#233;sultant pour l'&#201;tat des I et II est compens&#233;e, &#224; due concurrence, par la cr&#233;ation d'une taxe additionnelle aux droits pr&#233;vus aux articles 575 et 575 A du code g&#233;n&#233;ral des imp&#244;ts.</p>",
    "exposeSommaire": "<p>Le pr&#233;sent amendement vise &#224; mettre en coh&#233;rence la r&#233;forme de l&#8217;ISF port&#233;e par le Gouvernement avec les Pactes&#160;&#171;&#160;DUTREIL ISF&#160;&#187;. Il vise &#224; traiter le cas des Pactes DUTREIL qui auraient &#233;t&#233; nou&#233;s avant l&#8217;entr&#233;e en vigueur de la r&#233;forme au 1er janvier 2018 et qui auraient vocation &#224; courir au-del&#224; de cette date, induisant le maintien de rigidit&#233;s dans l&#8217;organisation des actionnariats que cette r&#233;forme vise justement &#224; supprimer. La correction de cet &#171;&#160;effet de tra&#238;ne&#160;&#187; va simplifier les reconfigurations et la consolidation des actionnariats de long terme des ETI familiales, indispensables &#224; l&#8217;acc&#233;l&#233;ration de leurs investissements et, partant, &#224; la poursuite des cr&#233;ations d&#8217;emplois dans les territoires.</p>",
    "annexeExposeSommaire": {
      "@xmlns:xsi": "http://www.w3.org/2001/XMLSchema-instance",
      "@xsi:nil": "true"
    }
  },
  "representations": {
    "representation": {
      "nom": "PDF",
      "typeMime": {
        "type": "application",
        "subType": "PDF"
      },
      "statutRepresentation": {
        "verbatim": "true",
        "canonique": "true",
        "officielle": "true",
        "transcription": "false",
        "enregistrement": "false"
      },
      "repSource": {
        "@xmlns:xsi": "http://www.w3.org/2001/XMLSchema-instance",
        "@xsi:nil": "true"
      },
      "offset": {
        "@xmlns:xsi": "http://www.w3.org/2001/XMLSchema-instance",
        "@xsi:nil": "true"
      },
      "contenu": {
        "documentURI": "/15/amendements/0485/CION_FIN/CF331.pdf"
      },
      "dateDispoRepresentation": {
        "@xmlns:xsi": "http://www.w3.org/2001/XMLSchema-instance",
        "@xsi:nil": "true"
      }
    }
  },
  "seanceDiscussion": {
    "@xmlns:xsi": "http://www.w3.org/2001/XMLSchema-instance",
    "@xsi:nil": "true"
  },
  "sort": {
    "dateSaisie": "2017-12-14T10:24:24.000+01:00",
    "sortEnSeance": "Rejeté"
  },
  "dateDepot": "2017-12-14T01:00:00.000+01:00",
  "dateDistribution": "2017-12-14T01:00:00.000+01:00",
  "article99": "0",
  "loiReference": {
    "codeLoi": {
      "@xmlns:xsi": "http://www.w3.org/2001/XMLSchema-instance",
      "@xsi:nil": "true"
    },
    "divisionCodeLoi": {
      "@xmlns:xsi": "http://www.w3.org/2001/XMLSchema-instance",
      "@xsi:nil": "true"
    }
  }
}