{
  "@xmlns": "http://schemas.assemblee-nationale.fr/referentiel",
  "uid": "AMANR5L15PO59051B0911P0D1N632",
  "identifiant": {
    "legislature": "15",
    "numero": "632",
    "numRect": "0",
    "saisine": {
      "refTexteLegislatif": "PRJLANR5L15B0911",
      "numeroPartiePLF": "0",
      "organeExamen": "PO59051",
      "mentionSecondeDeliberation": "0"
    }
  },
  "numeroLong": "CL632",
  "etapeTexte": "1ère lecture (1ère assemblée saisie)",
  "triAmendement": "iu",
  "cardinaliteAmdtMultiples": "1",
  "amendementParent": {
    "@xmlns:xsi": "http://www.w3.org/2001/XMLSchema-instance",
    "@xsi:nil": "true"
  },
  "etat": "Discuté",
  "signataires": {
    "auteur": {
      "typeAuteur": "Depute",
      "acteurRef": "PA722142",
      "organeRef": {
        "@xmlns:xsi": "http://www.w3.org/2001/XMLSchema-instance",
        "@xsi:nil": "true"
      },
      "groupePolitiqueRef": "PO730958"
    },
    "cosignataires": {
      "acteurRef": [
        "PA721202",
        "PA720846",
        "PA588884",
        "PA721960",
        "PA721226",
        "PA720286",
        "PA719578",
        "PA719676",
        "PA718868",
        "PA718860",
        "PA2150",
        "PA720422",
        "PA720430",
        "PA721062",
        "PA722142",
        "PA720892",
        "PA721210"
      ]
    },
    "texteAffichable": "M.&#160;Ruffin,  Mme&#160;Autain, M.&#160;Bernalicis, M.&#160;Coquerel, M.&#160;Corbi&#232;re, Mme&#160;Fiat, M.&#160;Lachaud, M.&#160;Larive, M.&#160;M&#233;lenchon, Mme&#160;Obono, Mme&#160;Panot, M.&#160;Prud&apos;homme, M.&#160;Quatennens, M.&#160;Ratenon, Mme&#160;Ressiguier, Mme&#160;Rubin et Mme&#160;Taurine"
  },
  "pointeurFragmentTexte": {
    "missionVisee": {
      "@xmlns:xsi": "http://www.w3.org/2001/XMLSchema-instance",
      "@xsi:nil": "true"
    },
    "division": {
      "titre": "Article PREMIER",
      "articleDesignationCourte": "APRÈS ART. PREMIER",
      "type": "ARTICLE",
      "avant_A_Apres": "Après",
      "divisionRattachee": "APRÈS L'ARTICLE PREMIER, insérer l'article suivant:",
      "articleAdditionnel": "1",
      "chapitreAdditionnel": {
        "@xmlns:xsi": "http://www.w3.org/2001/XMLSchema-instance",
        "@xsi:nil": "true"
      },
      "urlDivisionTexteVise": "/15/textes/0911.asp#D_Article_1er"
    },
    "alinea": {
      "@xmlns:xsi": "http://www.w3.org/2001/XMLSchema-instance",
      "@xsi:nil": "true"
    }
  },
  "corps": {
    "dispositif": "<p style=\"line-height: 1.2; padding: 0pt 0pt 0pt 5pt;\">L&#8217;article&#160;27 de la Constitution est compl&#233;t&#233; par un alin&#233;a ainsi r&#233;dig&#233;&#160;:</p><p style=\"line-height: 1.2; padding: 0pt 0pt 0pt 5pt;\">&#171;&#160;Toute atteinte &#224; l&#8217;ind&#233;pendance de pens&#233;e, de travail, de proposition, et de vote d&#8217;un membre du parlement fait l&#8217;objet de sanctions. Une loi organique fixe les conditions d&#8217;application du pr&#233;sent alin&#233;a.&#160;&#187;</p>",
    "exposeSommaire": "<p style=\"line-height: 1.2; text-align: justify;\">Par cet amendement, nous proposons de mettre en place des sanctions en cas de non-respect de la libert&#233; d&#8217;action d&#8217;un parlementaire.</p><p style=\"text-align: justify;\">En effet, cette actualit&#233; est br&#251;lante, le r&#232;glement int&#233;rieur du Groupe majoritaire de l&#8217;Assembl&#233;e nationale imposant notamment, par la menace de sanctions &#224; son article 16, l&#8217;interdiction de cosigner un amendement ou une proposition de loi d&#8217;autres d&#233;put&#233;s : &#8220;<i>Les d&#233;put&#233;s membres et apparent&#233;s du Groupe ne cosignent aucun amendement ou proposition de loi ou de r&#233;solution issus d&#8217;un autre groupe parlementaire. En cas de manquement, les sanctions mentionn&#233;es &#224; l&#8217;article 19 peuvent s&#8217;applique</i>r.&#8221;. De m&#234;me, sur certains projets de loi, tels celui sur l&#8217;asile et l&#8217;immigration, des d&#233;put&#233;s ne souhaitant pas voter dans le sens qui leur &#233;t&#233; indiqu&#233; ont &#233;t&#233; menac&#233;s (<a style=\"text-decoration: none;\" href=\"https://www.bfmtv.com/politique/loi-asile-immigration-des-deputes-larem-menaces-pour-leur-refus-de-voter-le-texte-1434227.html\">https://www.bfmtv.com/politique/loi-asile-immigration-des-deputes-larem-menaces-pour-leur-refus-de-voter-le-texte-1434227.html</a>). Il faut mettre fin &#224; ces atteintes inconstitutionnelles qui font des d&#233;put&#233;.e.s repr&#233;sentante.s du peuple des godillots.</p><p style=\"text-align: justify;\">En d&#233;tail, depuis les r&#233;visions constitutionnelles Chirac sur le quinquennat et Sarkozy en 2008, il est un constat partag&#233; qu&#8217;un d&#233;s&#233;quilibre majeur existe entre les pouvoirs l&#233;gislatif et ex&#233;cutifs, ce dernier ayant une pr&#233;dominance marqu&#233;e et pr&#233;judiciable pour notre vitalit&#233; d&#233;mocratique.</p><p style=\"text-align: justify;\">Cet amendement propose de mettre fin &#224; cette pratique pr&#233;judiciable pour la d&#233;mocratie et incompr&#233;hensible pour les citoyens fran&#231;ais, dite du &#171; fait majoritaire &#187;, observable depuis 2002 &#8211; que les majorit&#233;s aient &#233;t&#233; issues de l&#8217;UMP ou du PS -, qui consiste &#224; ce que les d&#233;put&#233;s, repr&#233;sentants du peuple fran&#231;ais et d&#233;tenteurs du pouvoir l&#233;gislatif arrach&#233; par le peuple depuis la r&#233;volution fran&#231;aise de 1789, soient r&#233;duits, selon les observateurs, en ex&#233;cutants muets d&#8217;oukazes pr&#233;sidentiels.</p><p style=\"line-height: 1.2; text-align: justify;\">A cet effet, nous proposons de pr&#233;ciser l&#8217;article 27 de la Constitution (&#171; Tout mandat imp&#233;ratif est nul. Le droit de vote des membres du Parlement est personnel &#187;.) dont la pratique du &#171; fait majoritaire &#187; est de fait inconstitutionnelle. En effet, celle-ci consiste &#224; ce que les parlementaires membres d&#8217;un Groupe soient menac&#233;s voire sanctionn&#233;s parce qu&#8217;ils s&#8217;&#233;carteraient d&#8217;une position collective d&#233;termin&#233;e par le Groupe politique auquel ils appartiennent ou un parti politique ext&#233;rieur au Parlement &#8211; position qui ne d&#233;coule au demeurant pas de la consultation du corps &#233;lectoral de leur circonscription -, et ainsi ne peuvent voter en leur &#226;me et conscience et en prenant en consid&#233;ration d&#8217;une part les attentes et demandes exprim&#233;es par leurs &#233;lecteurs et d&#8217;autre part les arguments des autres parlementaires les ayant convaincus.</p><p style=\"text-align: justify;\">En effet, la raison d&#8217;&#234;tre de la nullit&#233; de tout mandat imp&#233;ratif d&#233;coule de la pierre angulaire de la conception moderne du r&#233;gime r&#233;publicain. Quand les Anciens ne d&#233;finissaient la R&#233;publique que par la mise en commun de ce qui est public, les Modernes ont, eux, caract&#233;ris&#233; le r&#233;gime r&#233;publicain par l&#8217;usage collectif de la raison. C&#8217;est de la confrontation d&#8217;arguments fond&#233;s en raison qu&#8217;&#233;merge la d&#233;finition l&#233;gitime de l&#8217;int&#233;r&#234;t g&#233;n&#233;ral et des moyens n&#233;cessaires &#224; sa mise en oeuvre. Or, enserrer les parlementaires dans le carcan de la logique de groupe emp&#234;che toute confrontation d&#8217;id&#233;es et ne peut qu&#8217;aboutir &#224; ce que la volont&#233; pr&#233;sidentielle l&#8217;emporte sur celle du peuple fran&#231;ais, incarn&#233;e par ses repr&#233;sentants.</p><p style=\"line-height: 1.2; text-align: justify;\">Ainsi cette pratique m&#233;conna&#238;t l&#8217;esprit r&#233;publicain et la lettre de la Constitution en imposant une discipline de Groupe, en muselant l&#8217;ind&#233;pendance de pens&#233;e, et donc le caract&#232;re personnel du vote des parlementaires et pluraliste de leurs d&#233;bats.</p>",
    "annexeExposeSommaire": {
      "@xmlns:xsi": "http://www.w3.org/2001/XMLSchema-instance",
      "@xsi:nil": "true"
    }
  },
  "representations": {
    "representation": {
      "nom": "PDF",
      "typeMime": {
        "type": "application",
        "subType": "PDF"
      },
      "statutRepresentation": {
        "verbatim": "true",
        "canonique": "true",
        "officielle": "true",
        "transcription": "false",
        "enregistrement": "false"
      },
      "repSource": {
        "@xmlns:xsi": "http://www.w3.org/2001/XMLSchema-instance",
        "@xsi:nil": "true"
      },
      "offset": {
        "@xmlns:xsi": "http://www.w3.org/2001/XMLSchema-instance",
        "@xsi:nil": "true"
      },
      "contenu": {
        "documentURI": "/15/amendements/0911/CION_LOIS/CL632.pdf"
      },
      "dateDispoRepresentation": {
        "@xmlns:xsi": "http://www.w3.org/2001/XMLSchema-instance",
        "@xsi:nil": "true"
      }
    }
  },
  "seanceDiscussion": {
    "@xmlns:xsi": "http://www.w3.org/2001/XMLSchema-instance",
    "@xsi:nil": "true"
  },
  "sort": {
    "dateSaisie": "2018-06-28T21:33:41.000+02:00",
    "sortEnSeance": "Rejeté"
  },
  "dateDepot": "2018-06-22T02:00:00.000+02:00",
  "dateDistribution": "2018-06-25T02:00:00.000+02:00",
  "article99": "0",
  "loiReference": {
    "codeLoi": "27",
    "divisionCodeLoi": "4-2"
  }
}