{
  "@xmlns": "http://schemas.assemblee-nationale.fr/referentiel",
  "uid": "AMANR5L15SEA717460B1255P2D1N2073",
  "identifiant": {
    "legislature": "15",
    "numero": "2073",
    "numRect": "0",
    "saisine": {
      "refTexteLegislatif": "PRJLANR5L15B1255",
      "numeroPartiePLF": "2",
      "organeExamen": "PO717460",
      "mentionSecondeDeliberation": "1"
    }
  },
  "numeroLong": "II-2073",
  "etapeTexte": "1ère lecture (1ère assemblée saisie)",
  "triAmendement": "gaaaaaaaaaaaaaaaaaaaaaaaaaaaaaaaaaaaaaaaaaaaaaaaaaaxi",
  "cardinaliteAmdtMultiples": "1",
  "amendementParent": {
    "@xmlns:xsi": "http://www.w3.org/2001/XMLSchema-instance",
    "@xsi:nil": "true"
  },
  "etat": "Discuté",
  "signataires": {
    "auteur": {
      "typeAuteur": "Depute",
      "acteurRef": "PA642847",
      "organeRef": {
        "@xmlns:xsi": "http://www.w3.org/2001/XMLSchema-instance",
        "@xsi:nil": "true"
      },
      "groupePolitiqueRef": "PO730934"
    },
    "cosignataires": {
      "acteurRef": "PA642847"
    },
    "texteAffichable": "M.&#160;Bazin"
  },
  "pointeurFragmentTexte": {
    "missionVisee": {
      "@xmlns:xsi": "http://www.w3.org/2001/XMLSchema-instance",
      "@xsi:nil": "true"
    },
    "division": {
      "titre": "Article 58",
      "articleDesignationCourte": "APRÈS ART. 58",
      "type": "ARTICLE",
      "avant_A_Apres": "Après",
      "divisionRattachee": "APRÈS L'ARTICLE 58, insérer l'article suivant:",
      "articleAdditionnel": "1",
      "chapitreAdditionnel": {
        "@xmlns:xsi": "http://www.w3.org/2001/XMLSchema-instance",
        "@xsi:nil": "true"
      },
      "urlDivisionTexteVise": "/15/textes/1255C.asp#D_Article_58"
    },
    "alinea": {
      "@xmlns:xsi": "http://www.w3.org/2001/XMLSchema-instance",
      "@xsi:nil": "true"
    }
  },
  "corps": {
    "dispositif": "<p style=\"text-align: justify;\">I.&#160;&#8211;&#160;Le 2 du I de l&#8217;article&#160;197 du code g&#233;n&#233;ral des imp&#244;ts, dans sa r&#233;daction r&#233;sultant de la pr&#233;sente loi, est ainsi modifi&#233;&#160;:</p><p style=\"text-align: justify;\">- Au 1<sup>er</sup> janvier 2020, les montants&#160;: &#171;&#160;1 551&#160;&#8364;&#160;&#187;, &#171;&#160;3 660&#160;&#8364;&#160;&#187;, &#171;&#160;1 547&#160;&#8364;&#160;&#187; et &#171;&#160;1 728&#160;&#8364;&#160;&#187; sont remplac&#233;s, respectivement, par les montant&#160;: &#171;&#160;1 651&#160;&#8364;&#160;&#187;, &#171;&#160;3 760&#160;&#8364;&#160;&#187;, &#171;&#160;1 447&#160;&#8364;&#160;&#187; et &#171;&#160;1 528&#160;&#8364;&#160;&#187;,</p><p style=\"text-align: justify;\">- Au 1<sup>er</sup>&#160;janvier 2021, les montants&#160;: &#171;&#160;1 651&#160;&#8364;&#160;&#187;, &#171;&#160;3 760&#160;&#8364;&#160;&#187;, &#171;&#160;1 447&#160;&#8364;&#160;&#187; et &#171;&#160;1 528&#160;&#8364;&#160;&#187; sont remplac&#233;s, respectivement, par les montants&#160;: &#171;&#160;1 751&#160;&#8364;&#160;&#187;, &#171;&#160;3 860&#160;&#8364;&#160;&#187;, &#171;&#160;1 347&#160;&#8364;&#160;&#187; et &#171;&#160;1 328&#160;&#8364;&#160;&#187;&#160;;</p><p style=\"text-align: justify;\">- Au 1<sup>er</sup>&#160;janvier 2022, les montants&#160;:&#160;: &#171;&#160;1 751&#160;&#8364;&#160;&#187;, &#171;&#160;3 860&#160;&#8364;&#160;&#187;, &#171;&#160;1&#160;347&#160;&#8364;&#160;&#187; et &#171;&#160;1&#160;328&#160;&#8364;&#160;&#187; sont remplac&#233;s, respectivement, par les montants&#160;: &#171;&#160;1 851&#160;&#8364;&#160;&#187;, &#171;&#160;3&#160;960&#160;&#8364;&#160;&#187;, &#171;&#160;1&#160;247&#160;&#8364;&#160;&#187; et &#171;&#160;1 228&#160;&#8364;&#160;&#187;&#160;;&#160;&#187;</p><p style=\"text-align: justify;\">II.&#160;&#8211;&#160;La perte de recettes pour l&#8217;&#201;tat est compens&#233;e par&#160;:</p><p style=\"text-align: justify;\">&#171;&#160;1&#176; La baisse de 12&#160;% &#224; 9&#160;% du taux d&#233;fini au 1&#176; du VI et au 1&#176; du E. du VIII de l&#8217;article&#160;199 novovicies du code g&#233;n&#233;ral des imp&#244;ts&#160;;</p><p style=\"text-align: justify;\">&#171;&#160;2&#176; La baisse de 18&#160;% &#224; 15&#160;%&#160;du taux d&#233;fini au 2&#176; du VI et au 2&#176; du E. du VIII de l&#8217;article&#160;199 novovicies du code g&#233;n&#233;ral des imp&#244;ts&#160;;</p><p style=\"text-align: justify;\">&#171;&#160;3&#176; Par la cr&#233;ation d&#8217;une taxe additionnelle aux droits mentionn&#233;s aux articles 575 et 575 A du code g&#233;n&#233;ral des imp&#244;ts, &#224; due concurrence.&#160;&#187;</p>",
    "exposeSommaire": "<p style=\"text-align: justify;\">&#201;l&#233;ment fort de la politique familiale, le quotient familial a &#233;t&#233; fortement plafonn&#233; en 2012 de puis en 2013, en passant de 2 336&#160;euros &#224; 1500&#160;euros.</p><p style=\"text-align: justify;\">Or le quotient familial est un atout non n&#233;gligeable pour les m&#233;nages de la classe moyenne.</p><p style=\"text-align: justify;\">Le pr&#233;sent amendement vise &#224; remettre les plafonds &#224; des niveaux proches de ceux de 2013, de mani&#232;re progressive, d&#8217;ici 2022&#160;:</p><p style=\"text-align: justify;\">- Le plafonnement g&#233;n&#233;ral est relev&#233; de 100&#160;&#8364; par an en 2020, 2021 et 2022&#160;;</p><p style=\"text-align: justify;\">- L&#8217;avantage maximum en imp&#244;t procur&#233; par la part de quotient familial attach&#233;e au&#160;premier&#160;enfant &#224; charge accord&#233;e aux contribuables c&#233;libataires ou divorc&#233;s vivant seuls ayant des enfants &#224; charge est relev&#233; des m&#234;mes montants&#160;;</p><p style=\"text-align: justify;\">- Afin de stabiliser le montant du plafonnement g&#233;n&#233;ral des effets du quotient familial pour chaque demi-part accord&#233;e en application des dispositions particuli&#232;res li&#233;es &#224; la situation du contribuable (anciens combattants, invalides, maintien du quotient conjugal des veufs en cas d&#8217;enfant &#224; charge), ces derniers sont d&#233;plafonn&#233;s proportionnellement &#224; la hausse du plafonnement g&#233;n&#233;ral.</p>",
    "annexeExposeSommaire": {
      "@xmlns:xsi": "http://www.w3.org/2001/XMLSchema-instance",
      "@xsi:nil": "true"
    },
    "cartoucheDelaiDepotDepasse": {
      "@xmlns:xsi": "http://www.w3.org/2001/XMLSchema-instance",
      "@xsi:nil": "true"
    }
  },
  "representations": {
    "representation": {
      "nom": "PDF",
      "typeMime": {
        "type": "application",
        "subType": "PDF"
      },
      "statutRepresentation": {
        "verbatim": "true",
        "canonique": "true",
        "officielle": "true",
        "transcription": "false",
        "enregistrement": "false"
      },
      "repSource": {
        "@xmlns:xsi": "http://www.w3.org/2001/XMLSchema-instance",
        "@xsi:nil": "true"
      },
      "offset": {
        "@xmlns:xsi": "http://www.w3.org/2001/XMLSchema-instance",
        "@xsi:nil": "true"
      },
      "contenu": {
        "documentURI": "/15/amendements/1255C/AN/2073.pdf"
      },
      "dateDispoRepresentation": {
        "@xmlns:xsi": "http://www.w3.org/2001/XMLSchema-instance",
        "@xsi:nil": "true"
      }
    }
  },
  "seanceDiscussion": "RUANR5L15S2019IDS21345",
  "sort": {
    "dateSaisie": "2018-11-16T15:53:11.000+01:00",
    "sortEnSeance": "Rejeté"
  },
  "dateDepot": "2018-11-09T01:00:00.000+01:00",
  "dateDistribution": "2018-11-14T01:00:00.000+01:00",
  "article99": "0",
  "loiReference": {
    "codeLoi": "CGI",
    "divisionCodeLoi": "197"
  }
}