{
  "@xmlns": "http://schemas.assemblee-nationale.fr/referentiel",
  "uid": "AMANR5L15PO59051B1349P0D1N38",
  "identifiant": {
    "legislature": "15",
    "numero": "38",
    "numRect": "0",
    "saisine": {
      "refTexteLegislatif": "PRJLANR5L15B1349",
      "numeroPartiePLF": "0",
      "organeExamen": "PO59051",
      "mentionSecondeDeliberation": "0"
    }
  },
  "numeroLong": "CL38",
  "etapeTexte": "1ère lecture (2ème assemblée saisie)",
  "triAmendement": "aeoaaaaaaaaaaaaaaaaaaaaaaaaaaaaaaaaaaaaaaaaaaaaaaao",
  "cardinaliteAmdtMultiples": "1",
  "amendementParent": {
    "@xmlns:xsi": "http://www.w3.org/2001/XMLSchema-instance",
    "@xsi:nil": "true"
  },
  "etat": "Discuté",
  "signataires": {
    "auteur": {
      "typeAuteur": "Depute",
      "acteurRef": "PA720430",
      "organeRef": {
        "@xmlns:xsi": "http://www.w3.org/2001/XMLSchema-instance",
        "@xsi:nil": "true"
      },
      "groupePolitiqueRef": "PO730958"
    },
    "cosignataires": {
      "acteurRef": [
        "PA721210",
        "PA718868",
        "PA719676",
        "PA588884",
        "PA720430",
        "PA720422",
        "PA718860",
        "PA722142",
        "PA719578",
        "PA721226",
        "PA720846",
        "PA721202",
        "PA720892",
        "PA721062",
        "PA720286",
        "PA2150",
        "PA721960"
      ]
    },
    "texteAffichable": "M.&#160;Bernalicis,  Mme&#160;Autain, M.&#160;Coquerel, M.&#160;Corbi&#232;re, Mme&#160;Fiat, M.&#160;Lachaud, M.&#160;Larive, M.&#160;M&#233;lenchon, Mme&#160;Obono, Mme&#160;Panot, M.&#160;Prud&apos;homme, M.&#160;Quatennens, M.&#160;Ratenon, Mme&#160;Ressiguier, Mme&#160;Rubin, M.&#160;Ruffin et Mme&#160;Taurine"
  },
  "pointeurFragmentTexte": {
    "missionVisee": {
      "@xmlns:xsi": "http://www.w3.org/2001/XMLSchema-instance",
      "@xsi:nil": "true"
    },
    "division": {
      "titre": "Article 4",
      "articleDesignationCourte": "APRÈS ART. 4",
      "type": "ARTICLE",
      "avant_A_Apres": "Après",
      "divisionRattachee": "APRÈS L'ARTICLE 4, insérer la division et l'intitulé suivants:",
      "articleAdditionnel": {
        "@xmlns:xsi": "http://www.w3.org/2001/XMLSchema-instance",
        "@xsi:nil": "true"
      },
      "chapitreAdditionnel": "1",
      "urlDivisionTexteVise": "/15/textes/1349.asp#D_Article_4"
    },
    "alinea": {
      "@xmlns:xsi": "http://www.w3.org/2001/XMLSchema-instance",
      "@xsi:nil": "true"
    }
  },
  "corps": {
    "dispositif": "<p style=\"text-align: justify;\">Chapitre II <i>bis</i> </p><p style=\"text-align: justify;\">Repr&#233;sentation devant le Conseil d&#8217;Etat et la Cour de Cassation</p><p style=\"text-align: justify;\">Article 4 <i>bis</i></p><p style=\"line-height: 1.2; text-align: justify;\">A l&#8217;article 3 de l&#8217;ordonnance royale du 10 septembre 1817 qui r&#233;unit, sous la d&#233;nomination d'Ordre des avocats au Conseil d'Etat et &#224; la Cour de cassation, l'ordre des avocats aux conseils et le coll&#232;ge des avocats &#224; la Cour de cassation, fixe irr&#233;vocablement, le nombre des titulaires, et contient des dispositions pour la discipline int&#233;rieure de l'Ordre :</p><p style=\"text-align: justify;\">I. Supprimer les alin&#233;as 1 &#224; 3.</p><p style=\"text-align: justify;\">II. Au quatri&#232;me alin&#233;a :</p><p style=\"line-height: 1.2; text-align: justify;\">a) substituer au mot &#8220;II&#8221; le mot &#8220;I&#8221; ;</p><p style=\"line-height: 1.2; text-align: justify;\">b) aux mots &#8220;acc&#233;der &#224;&#8221;, substituer le mot &#8220;exercer&#8221;.</p>",
    "exposeSommaire": "<p style=\"line-height: 1.38; text-align: justify;\">Par cet amendement, nous proposons de mettre fin aux charges (et par extension aux frais de justice qui emp&#234;chent de nombreux requ&#233;rants de faire un recours en cassation pour certains types de contentieux) des avocats au Conseil d&#8217;Etat et &#224; la Cour de Cassation, ce en pr&#233;voyant que la seule r&#233;ussite du CAPAC (Certificat d'Aptitude &#224; la Profession d'Avocat aux Conseils), &#224; l&#8217;instar des modalit&#233;s en oeuvre pour les avocats (titulaires du CAPA - Certificat d&#8217;Aptitude &#224; la Profession d&#8217;Avocat), permette l'action aux fonctions concern&#233;es d'avocat aux Conseils.</p><p style=\"text-align: justify;\">L&#8217;exercice actuel de la profession d&#8217;avocat ou avocate aux Conseils est limit&#233;e par l&#8217;existence de charges avec monopole de repr&#233;sentation devant le Conseil d&#8217;Etat et la Cour de cassation (une cr&#233;ation historique d&#8217;un &#233;dit royal de Louis XIV du 2 septembre 1643, supprim&#233;e par la R&#233;volution fran&#231;aise, r&#233;tablie en 1799 pour la Cour de Cassation et dont le statut est toujours r&#233;gl&#233; par l&#8217;ordonnance royale du 10 septembre 1817 Louis XVIII, modifi&#233;e depuis), ces charges ayant &#233;t&#233; transmises, ou de nouvelles octroy&#233;es depuis 2009 (D&#233;cret n&#176; 2009-452 du 22 avril 2009 relatif &#224; l'&#233;volution des professions juridiques et judiciaires) par le ministre de la Justice, et depuis la Loi Macron (du 6 ao&#251;t 2015 pour la croissance, l'activit&#233; et l'&#233;galit&#233; des chances &#233;conomiques) qui soumet la cr&#233;ation de nouvelles charges &#224; l&#8217;expertise pr&#233;alable de l&#8217;Autorit&#233; de la Concurrence.</p><p style=\"text-align: justify;\">Au del&#224; de certaines exceptions (mati&#232;re p&#233;nale et contentieux &#233;lectoral - &#233;lections professionnelles par exemple - devant la Cour de cassation ; recours pour exc&#232;s de pouvoir devant le Conseil d&#8217;Etat). Si une expertise est requise pour les contentieux en cassation (tout comme pour les contentieux de premi&#232;re instance et en appel), celle-ci n&#8217;implique pas l&#8217;existence de ces charges limit&#233;es et h&#233;ritage royal entravant le bon droit au recours des justiciables.</p><p style=\"text-align: justify;\">Ainsi, nous proposons que la formation de l&#8217;IFRAC (L'Institut de formation et de recherche des avocats aux conseils), sanctionn&#233;e par le CAPAC apr&#232;s trois ann&#233;es de formation, qui garantit du s&#233;rieux et de l&#8217;aptitude des candidats pouvant exercer les fonctions d&#8217;Avocat au Conseil, soit la seule exigence pour qu&#8217;une&#160;personne puisse exercer cette fonction.</p>",
    "annexeExposeSommaire": {
      "@xmlns:xsi": "http://www.w3.org/2001/XMLSchema-instance",
      "@xsi:nil": "true"
    }
  },
  "representations": {
    "representation": {
      "nom": "PDF",
      "typeMime": {
        "type": "application",
        "subType": "PDF"
      },
      "statutRepresentation": {
        "verbatim": "true",
        "canonique": "true",
        "officielle": "true",
        "transcription": "false",
        "enregistrement": "false"
      },
      "repSource": {
        "@xmlns:xsi": "http://www.w3.org/2001/XMLSchema-instance",
        "@xsi:nil": "true"
      },
      "offset": {
        "@xmlns:xsi": "http://www.w3.org/2001/XMLSchema-instance",
        "@xsi:nil": "true"
      },
      "contenu": {
        "documentURI": "/15/amendements/1349/CION_LOIS/CL38.pdf"
      },
      "dateDispoRepresentation": {
        "@xmlns:xsi": "http://www.w3.org/2001/XMLSchema-instance",
        "@xsi:nil": "true"
      }
    }
  },
  "seanceDiscussion": {
    "@xmlns:xsi": "http://www.w3.org/2001/XMLSchema-instance",
    "@xsi:nil": "true"
  },
  "sort": {
    "dateSaisie": "2018-11-07T18:39:19.000+01:00",
    "sortEnSeance": "Rejeté"
  },
  "dateDepot": "2018-10-29T01:00:00.000+01:00",
  "dateDistribution": "2018-11-06T01:00:00.000+01:00",
  "article99": "0",
  "loiReference": {
    "codeLoi": "z ordo royale",
    "divisionCodeLoi": {
      "@xmlns:xsi": "http://www.w3.org/2001/XMLSchema-instance",
      "@xsi:nil": "true"
    }
  }
}