{
  "@xmlns": "http://schemas.assemblee-nationale.fr/referentiel",
  "uid": "AMANR5L15SEA717460BTC1212P0D1N131",
  "identifiant": {
    "legislature": "15",
    "numero": "131",
    "numRect": "0",
    "saisine": {
      "refTexteLegislatif": "PRJLANR5L15BTC1212",
      "numeroPartiePLF": "0",
      "organeExamen": "PO717460",
      "mentionSecondeDeliberation": "0"
    }
  },
  "numeroLong": "131",
  "etapeTexte": "1ère lecture (2ème assemblée saisie)",
  "triAmendement": "fcaaaaaaaaaaaaaaaaaaaaaaaaaaaaaaaaaaaaaaaaaaaaaaaabahzmhx",
  "cardinaliteAmdtMultiples": "1",
  "amendementParent": {
    "@xmlns:xsi": "http://www.w3.org/2001/XMLSchema-instance",
    "@xsi:nil": "true"
  },
  "etat": "Discuté",
  "signataires": {
    "auteur": {
      "typeAuteur": "Depute",
      "acteurRef": "PA721984",
      "organeRef": {
        "@xmlns:xsi": "http://www.w3.org/2001/XMLSchema-instance",
        "@xsi:nil": "true"
      },
      "groupePolitiqueRef": "PO730970"
    },
    "cosignataires": {
      "acteurRef": "PA721984"
    },
    "texteAffichable": "M.&#160;Latombe"
  },
  "pointeurFragmentTexte": {
    "missionVisee": {
      "@xmlns:xsi": "http://www.w3.org/2001/XMLSchema-instance",
      "@xsi:nil": "true"
    },
    "division": {
      "titre": "Article 7",
      "articleDesignationCourte": "ART. 7",
      "type": "ARTICLE",
      "avant_A_Apres": "A",
      "divisionRattachee": "ARTICLE 7",
      "articleAdditionnel": {
        "@xmlns:xsi": "http://www.w3.org/2001/XMLSchema-instance",
        "@xsi:nil": "true"
      },
      "chapitreAdditionnel": {
        "@xmlns:xsi": "http://www.w3.org/2001/XMLSchema-instance",
        "@xsi:nil": "true"
      },
      "urlDivisionTexteVise": "/15/textes/1212.asp#D_Article_7"
    },
    "alinea": {
      "avant_A_Apres": {
        "@xmlns:xsi": "http://www.w3.org/2001/XMLSchema-instance",
        "@xsi:nil": "true"
      },
      "numero": "4",
      "alineaDesignation": {
        "@xmlns:xsi": "http://www.w3.org/2001/XMLSchema-instance",
        "@xsi:nil": "true"
      }
    }
  },
  "corps": {
    "dispositif": "<p style=\"text-align: justify;\">&#192; l&#8217;alin&#233;a&#160;4, apr&#232;s la r&#233;f&#233;rence&#160;:</p><p style=\"text-align: justify;\">&#171;&#160;1729&#8209;0 A&#160;&#187;,</p><p style=\"text-align: justify;\">ins&#233;rer les mots&#160;:</p><p style=\"text-align: justify;\">&#171;&#160;et d&#232;s lors que cette sanction est devenue d&#233;finitive&#160;&#187;.</p>",
    "exposeSommaire": "<p style=\"text-align: justify;\">L&#8217;article&#160;7 instaure une amende &#224; l&#8217;encontre de certaines professions ayant intentionnellement fourni une prestation permettant directement la commission par&#160;le contribuable d&#8217;agissements, manquements ou man&#339;uvres sanctionn&#233;s par une majoration de 80&#160;% prononc&#233;e par l&#8217;administration sur le fondement de plusieurs dispositions du code g&#233;n&#233;ral des imp&#244;ts. L&#8217;amende s&#8217;appliquerait &#233;galement aux cas de fraude sociale notifi&#233;e sur le fondement de l&#8217;abus de droit.</p><p style=\"text-align: justify;\">La commission des finances a supprim&#233; ce dispositif adopt&#233; par le S&#233;nat cr&#233;ant ainsi une difficult&#233; juridique et pratique majeure pour le conseil du contribuable sanctionn&#233;. En effet, d&#232;s lors que le contribuable s&#8217;est vu prononcer une majoration de 80&#160;% en mati&#232;re fiscale ou une notification de rectification en mati&#232;re sociale, son conseil pourrait faire l&#8217;objet d&#8217;une amende. Ce dernier pourrait ainsi &#234;tre sanctionn&#233; alors m&#234;me que la sanction initiale visant son client fait l&#8217;objet d&#8217;un recours et que cette sanction n&#8217;est donc pas devenue d&#233;finitive. Il en r&#233;sulterait une difficult&#233; majeure dans le droit d&#8217;exercer un recours effectif, puisque le&#160;conseil se trouverait plac&#233; dans une situation de conflit entre sa propre d&#233;fense et le respect de l&#8217;&#233;ventuel secret professionnel couvrant les relations avec son client.</p><p style=\"text-align: justify;\">Cet amendement propose donc de ne permettre la sanction du tiers que dans l&#8217;hypoth&#232;se o&#249; la sanction initiale visant son client est devenue d&#233;finitive (ou les rectifications s&#8217;agissant de la fraude sociale).</p>",
    "annexeExposeSommaire": {
      "@xmlns:xsi": "http://www.w3.org/2001/XMLSchema-instance",
      "@xsi:nil": "true"
    }
  },
  "representations": {
    "representation": {
      "nom": "PDF",
      "typeMime": {
        "type": "application",
        "subType": "PDF"
      },
      "statutRepresentation": {
        "verbatim": "true",
        "canonique": "true",
        "officielle": "true",
        "transcription": "false",
        "enregistrement": "false"
      },
      "repSource": {
        "@xmlns:xsi": "http://www.w3.org/2001/XMLSchema-instance",
        "@xsi:nil": "true"
      },
      "offset": {
        "@xmlns:xsi": "http://www.w3.org/2001/XMLSchema-instance",
        "@xsi:nil": "true"
      },
      "contenu": {
        "documentURI": "/15/amendements/1212/AN/131.pdf"
      },
      "dateDispoRepresentation": {
        "@xmlns:xsi": "http://www.w3.org/2001/XMLSchema-instance",
        "@xsi:nil": "true"
      }
    }
  },
  "seanceDiscussion": "RUANR5L15S2018IDS21240",
  "sort": {
    "dateSaisie": "2018-09-18T16:33:02.000+02:00",
    "sortEnSeance": "Non soutenu"
  },
  "dateDepot": "2018-09-13T02:00:00.000+02:00",
  "dateDistribution": "2018-09-14T02:00:00.000+02:00",
  "article99": "0",
  "loiReference": {
    "codeLoi": {
      "@xmlns:xsi": "http://www.w3.org/2001/XMLSchema-instance",
      "@xsi:nil": "true"
    },
    "divisionCodeLoi": {
      "@xmlns:xsi": "http://www.w3.org/2001/XMLSchema-instance",
      "@xsi:nil": "true"
    }
  }
}