{
  "@xmlns": "http://schemas.assemblee-nationale.fr/referentiel",
  "uid": "AMANR5L15PO419604B0383P0D1N117",
  "identifiant": {
    "legislature": "15",
    "numero": "117",
    "numRect": "0",
    "saisine": {
      "refTexteLegislatif": "PRJLANR5L15B0383",
      "numeroPartiePLF": "0",
      "organeExamen": "PO419604",
      "mentionSecondeDeliberation": "0"
    }
  },
  "numeroLong": "AC117",
  "etapeTexte": "1ère lecture (1ère assemblée saisie)",
  "triAmendement": "b",
  "cardinaliteAmdtMultiples": "1",
  "amendementParent": {
    "@xmlns:xsi": "http://www.w3.org/2001/XMLSchema-instance",
    "@xsi:nil": "true"
  },
  "etat": "Retiré",
  "signataires": {
    "auteur": {
      "typeAuteur": "Depute",
      "acteurRef": "PA720124",
      "organeRef": {
        "@xmlns:xsi": "http://www.w3.org/2001/XMLSchema-instance",
        "@xsi:nil": "true"
      },
      "groupePolitiqueRef": "PO730964"
    },
    "cosignataires": {
      "acteurRef": "PA720124"
    },
    "texteAffichable": "Mme&#160;Amadou, rapporteure"
  },
  "pointeurFragmentTexte": {
    "missionVisee": {
      "@xmlns:xsi": "http://www.w3.org/2001/XMLSchema-instance",
      "@xsi:nil": "true"
    },
    "division": {
      "titre": "Article 14",
      "articleDesignationCourte": "APRÈS ART. 14",
      "type": "ARTICLE",
      "avant_A_Apres": "Après",
      "divisionRattachee": "APRÈS L'ARTICLE 14, insérer l'article suivant:",
      "articleAdditionnel": "1",
      "chapitreAdditionnel": {
        "@xmlns:xsi": "http://www.w3.org/2001/XMLSchema-instance",
        "@xsi:nil": "true"
      },
      "urlDivisionTexteVise": "/15/textes/0383.asp#D_Article_14"
    },
    "alinea": {
      "@xmlns:xsi": "http://www.w3.org/2001/XMLSchema-instance",
      "@xsi:nil": "true"
    }
  },
  "corps": {
    "dispositif": "<p style=\"text-align: justify;\">I.&#160;&#8211;&#160;Apr&#232;s l&#8217;article&#160;14, ins&#233;rer l&#8217;article suivant&#160;:</p><p style=\"text-align: justify;\">&#171;&#160;Dans un d&#233;lai de dix-huit mois &#224; compter de la promulgation de la pr&#233;sente loi, les autorit&#233;s organisatrices de transports comp&#233;tentes pour les p&#233;rim&#232;tres de la m&#233;tropole du Grand Paris et de la m&#233;tropole d&#8217;Aix-Marseille-Provence &#233;laborent un nouveau sch&#233;ma directeur d&#8217;accessibilit&#233; - agenda d&#8217;accessibilit&#233; programm&#233;e, prenant en compte la n&#233;cessit&#233; de d&#233;velopper l&#8217;accessibilit&#233; de l&#8217;ensemble des modes de transports n&#233;cessaires pour rejoindre les sites li&#233;s &#224; l&#8217;organisation et au d&#233;roulement des Jeux Olympiques et Paralympiques de 2024.&#160;&#187;</p><p style=\"text-align: justify;\">II.&#160;&#8211;&#160;En cons&#233;quence, compl&#233;ter l&#8217;intitul&#233; du titre&#160;III par les mots&#160;: </p><p style=\"text-align: justify;\">&#171;&#160;et &#224; la circulation&#160;&#187;.</p>",
    "exposeSommaire": "<p style=\"text-align: justify;\">Dans le cadre du projet d&#8217;organisation des Jeux, plusieurs lignes de transport du Grand Paris Express seront cr&#233;&#233;es et accessibles &#224; tous&#160;; cependant, aucune disposition n&#8217;est prise pour am&#233;liorer et acc&#233;l&#233;rer de mani&#232;re notable l&#8217;accessibilit&#233; des transports.</p><p style=\"text-align: justify;\">Or cela repr&#233;sente un enjeu essentiel pour les spectateurs, les organisateurs et b&#233;n&#233;voles, les athl&#232;tes des Jeux Olympiques et Paralympiques. Notamment, les sites situ&#233;s au centre de Paris resteraient, dans le cadre existant, inaccessibles par les lignes de m&#233;tro existantes.</p><p style=\"text-align: justify;\">L&#8217;article&#160;7 de l&#8217;ordonnance n&#176; 2014&#8209;1090 du 26 septembre 2014 relative &#224; la mise en accessibilit&#233; des &#233;tablissements recevant du public, des transports publics, des b&#226;timents d&#8217;habitation et de la voirie pour les personnes handicap&#233;es a ouvert aux autorit&#233;s organisatrices de transport (AOT) qui n&#8217;ont pas &#233;labor&#233; de sch&#233;ma directeur d&#8217;accessibilit&#233; (SDA) et &#224; l&#8217;&#201;tat, la possibilit&#233; d&#8217;&#233;laborer un sch&#233;ma directeur d&#8217;accessibilit&#233;-agenda d&#8217;accessibilit&#233; programm&#233;e (SDA-Ad&#8217;Ap). Contrairement aux Ad&#8217;Ap des &#233;tablissements recevant du public, ils ne sont pas obligatoires.</p><p style=\"text-align: justify;\">L&#8217;agenda comporte une analyse des actions n&#233;cessaires &#224; la mise en accessibilit&#233; et pr&#233;voit les modalit&#233;s et la programmation ainsi que le financement correspondant. Il pr&#233;cise les points d&#8217;arr&#234;t identifi&#233;s comme prioritaires, les d&#233;rogations sollicit&#233;es en cas d&#8217;impossibilit&#233; technique av&#233;r&#233;e et les mesures de substitution pr&#233;vues dans ces derniers cas.</p><p style=\"text-align: justify;\">Le projet de SDA-Ad&#8217;Ap comporte ainsi notamment&#160;:</p><p style=\"text-align: justify;\">&#8211;&#160;une partie descriptive de l&#8217;existant&#160;;</p><p style=\"text-align: justify;\">&#8211;&#160;un volet sur la programmation et le financement&#160;;</p><p style=\"text-align: justify;\">&#8211;&#160;pour chacun des points d&#8217;arr&#234;t prioritaires, les engagements pris par les ma&#238;tres d&#8217;ouvrage pour r&#233;aliser les am&#233;nagements n&#233;cessaires &#224; la mise en accessibilit&#233; qui leur incombent et les financements correspondants.</p><p style=\"text-align: justify;\">Le pr&#233;sent amendement vise &#224; obliger les autorit&#233;s organisatrices des transports des deux principales agglom&#233;rations concern&#233;es (&#206;le-de-France Mobilit&#233;s et la m&#233;tropole d&#8217;Aix-Marseille-Provence) &#224; prendre en compte le nouvel imp&#233;ratif que repr&#233;sente la tenue des Jeux en 2024 en engageant les &#233;tudes et les concertations et en &#233;laborant un nouveau sch&#233;ma directeur d&#8217;accessibilit&#233;-agenda d&#8217;accessibilit&#233; programm&#233;e, au sein duquel les AOT pourraient prendre des engagements plus ambitieux pour d&#233;velopper des transports accessibles, pour les Jeux, mais aussi pour l&#8217;ensemble de la population, comme un h&#233;ritage des Jeux.</p>",
    "annexeExposeSommaire": {
      "@xmlns:xsi": "http://www.w3.org/2001/XMLSchema-instance",
      "@xsi:nil": "true"
    }
  },
  "representations": {
    "representation": {
      "nom": "PDF",
      "typeMime": {
        "type": "application",
        "subType": "PDF"
      },
      "statutRepresentation": {
        "verbatim": "true",
        "canonique": "true",
        "officielle": "true",
        "transcription": "false",
        "enregistrement": "false"
      },
      "repSource": {
        "@xmlns:xsi": "http://www.w3.org/2001/XMLSchema-instance",
        "@xsi:nil": "true"
      },
      "offset": {
        "@xmlns:xsi": "http://www.w3.org/2001/XMLSchema-instance",
        "@xsi:nil": "true"
      },
      "contenu": {
        "documentURI": "/15/amendements/0383/CION-CEDU/AC117.pdf"
      },
      "dateDispoRepresentation": {
        "@xmlns:xsi": "http://www.w3.org/2001/XMLSchema-instance",
        "@xsi:nil": "true"
      }
    }
  },
  "seanceDiscussion": {
    "@xmlns:xsi": "http://www.w3.org/2001/XMLSchema-instance",
    "@xsi:nil": "true"
  },
  "sort": {
    "@xmlns:xsi": "http://www.w3.org/2001/XMLSchema-instance",
    "@xsi:nil": "true"
  },
  "dateDepot": "2017-12-11T01:00:00.000+01:00",
  "dateDistribution": "2017-12-11T01:00:00.000+01:00",
  "article99": "0",
  "loiReference": {
    "codeLoi": {
      "@xmlns:xsi": "http://www.w3.org/2001/XMLSchema-instance",
      "@xsi:nil": "true"
    },
    "divisionCodeLoi": {
      "@xmlns:xsi": "http://www.w3.org/2001/XMLSchema-instance",
      "@xsi:nil": "true"
    }
  }
}