{
  "@xmlns": "http://schemas.assemblee-nationale.fr/referentiel",
  "uid": "AMANR5L15PO419610B0627P0D1N1210",
  "identifiant": {
    "legislature": "15",
    "numero": "1210",
    "numRect": "0",
    "saisine": {
      "refTexteLegislatif": "PRJLANR5L15B0627",
      "numeroPartiePLF": "0",
      "organeExamen": "PO419610",
      "mentionSecondeDeliberation": "0"
    }
  },
  "numeroLong": "CE1210",
  "etapeTexte": "1ère lecture (1ère assemblée saisie)",
  "triAmendement": "blrenvdzx",
  "cardinaliteAmdtMultiples": "1",
  "amendementParent": {
    "@xmlns:xsi": "http://www.w3.org/2001/XMLSchema-instance",
    "@xsi:nil": "true"
  },
  "etat": "Discuté",
  "signataires": {
    "auteur": {
      "typeAuteur": "Depute",
      "acteurRef": "PA722398",
      "organeRef": {
        "@xmlns:xsi": "http://www.w3.org/2001/XMLSchema-instance",
        "@xsi:nil": "true"
      },
      "groupePolitiqueRef": "PO730964"
    },
    "cosignataires": {
      "acteurRef": "PA722398"
    },
    "texteAffichable": "M.&#160;Rebeyrotte"
  },
  "pointeurFragmentTexte": {
    "missionVisee": {
      "@xmlns:xsi": "http://www.w3.org/2001/XMLSchema-instance",
      "@xsi:nil": "true"
    },
    "division": {
      "titre": "Article PREMIER",
      "articleDesignationCourte": "ART. PREMIER",
      "type": "ARTICLE",
      "avant_A_Apres": "A",
      "divisionRattachee": "ARTICLE PREMIER",
      "articleAdditionnel": {
        "@xmlns:xsi": "http://www.w3.org/2001/XMLSchema-instance",
        "@xsi:nil": "true"
      },
      "chapitreAdditionnel": {
        "@xmlns:xsi": "http://www.w3.org/2001/XMLSchema-instance",
        "@xsi:nil": "true"
      },
      "urlDivisionTexteVise": "/15/textes/0627.asp#D_Article_1er"
    },
    "alinea": {
      "avant_A_Apres": {
        "@xmlns:xsi": "http://www.w3.org/2001/XMLSchema-instance",
        "@xsi:nil": "true"
      },
      "numero": "15",
      "alineaDesignation": {
        "@xmlns:xsi": "http://www.w3.org/2001/XMLSchema-instance",
        "@xsi:nil": "true"
      }
    }
  },
  "corps": {
    "dispositif": "<p style=\"text-align: justify;\">I.&#160;-&#160;&#192; l&#8217;alin&#233;a&#160;15, apr&#232;s les deux premi&#232;res occurrences du mot&#160;:</p><p style=\"text-align: justify;\">&#171;&#160;indicateurs&#160;&#187;,</p><p style=\"text-align: justify;\">ins&#233;rer le mot&#160;:</p><p style=\"text-align: justify;\">&#171;&#160;publics&#160;&#187;.</p><p style=\"text-align: justify;\">II.&#160;-&#160;R&#233;diger ainsi la seconde phrase du m&#234;me alin&#233;a&#160;:</p><p style=\"text-align: justify;\">&#171;&#160;Ces indicateurs publics sont d&#233;finis par l&#8217;&#233;tablissement mentionn&#233; &#224; l&#8217;article L.&#160;682&#8209;1 du m&#234;me code ou par accord interprofessionnel.&#160;&#187;</p>",
    "exposeSommaire": "<p style=\"text-align: justify;\">Alors que les &#201;tats G&#233;n&#233;raux de l&#8217;Alimentation ont fait clairement &#233;merger la n&#233;cessit&#233; urgente d&#8217;inverser la m&#233;canique de construction des prix alimentaires pour construire ces prix sur la base des co&#251;ts de production des &#233;leveurs, la r&#233;daction actuelle de l&#8217;alin&#233;a&#160;15 de l&#8217;article&#160;1<sup>er</sup> ne r&#233;pond pas &#224; cet objectif. En pr&#233;voyant uniquement, dans les contrats, la prise en compte d&#8217;indicateurs que chaque op&#233;rateur aura la libert&#233; de construire lui-m&#234;me, en fonction de ses int&#233;r&#234;ts propres, cette r&#233;daction n&#8217;est nullement s&#233;curisante pour les &#233;leveurs.</p><p style=\"text-align: justify;\">Il est donc propos&#233; de revenir &#224; l&#8217;ambition des &#201;tats G&#233;n&#233;raux de l&#8217;Alimentation en faisant des indicateurs de co&#251;ts de production des indicateurs publics non discutables. Pour cela, ces indicateurs devront &#234;tre d&#233;finis uniquement par l&#8217;Observatoire des Prix et des Marges des produits alimentaires ou par les interprofessions.</p>",
    "annexeExposeSommaire": {
      "@xmlns:xsi": "http://www.w3.org/2001/XMLSchema-instance",
      "@xsi:nil": "true"
    }
  },
  "representations": {
    "representation": {
      "nom": "PDF",
      "typeMime": {
        "type": "application",
        "subType": "PDF"
      },
      "statutRepresentation": {
        "verbatim": "true",
        "canonique": "true",
        "officielle": "true",
        "transcription": "false",
        "enregistrement": "false"
      },
      "repSource": {
        "@xmlns:xsi": "http://www.w3.org/2001/XMLSchema-instance",
        "@xsi:nil": "true"
      },
      "offset": {
        "@xmlns:xsi": "http://www.w3.org/2001/XMLSchema-instance",
        "@xsi:nil": "true"
      },
      "contenu": {
        "documentURI": "/15/amendements/0627/CION-ECO/CE1210.pdf"
      },
      "dateDispoRepresentation": {
        "@xmlns:xsi": "http://www.w3.org/2001/XMLSchema-instance",
        "@xsi:nil": "true"
      }
    }
  },
  "seanceDiscussion": {
    "@xmlns:xsi": "http://www.w3.org/2001/XMLSchema-instance",
    "@xsi:nil": "true"
  },
  "sort": {
    "dateSaisie": "2018-04-17T19:10:17.000+02:00",
    "sortEnSeance": "Retiré"
  },
  "dateDepot": "2018-04-13T02:00:00.000+02:00",
  "dateDistribution": "2018-04-16T02:00:00.000+02:00",
  "article99": "0",
  "loiReference": {
    "codeLoi": {
      "@xmlns:xsi": "http://www.w3.org/2001/XMLSchema-instance",
      "@xsi:nil": "true"
    },
    "divisionCodeLoi": {
      "@xmlns:xsi": "http://www.w3.org/2001/XMLSchema-instance",
      "@xsi:nil": "true"
    }
  }
}