{
  "@xmlns": "http://schemas.assemblee-nationale.fr/referentiel",
  "uid": "AMANR5L15PO419610B0627P0D1N378",
  "identifiant": {
    "legislature": "15",
    "numero": "378",
    "numRect": "0",
    "saisine": {
      "refTexteLegislatif": "PRJLANR5L15B0627",
      "numeroPartiePLF": "0",
      "organeExamen": "PO419610",
      "mentionSecondeDeliberation": "0"
    }
  },
  "numeroLong": "CE378",
  "etapeTexte": "1ère lecture (1ère assemblée saisie)",
  "triAmendement": "du",
  "cardinaliteAmdtMultiples": "1",
  "amendementParent": {
    "@xmlns:xsi": "http://www.w3.org/2001/XMLSchema-instance",
    "@xsi:nil": "true"
  },
  "etat": "Discuté",
  "signataires": {
    "auteur": {
      "typeAuteur": "Depute",
      "acteurRef": "PA608016",
      "organeRef": {
        "@xmlns:xsi": "http://www.w3.org/2001/XMLSchema-instance",
        "@xsi:nil": "true"
      },
      "groupePolitiqueRef": "PO730934"
    },
    "cosignataires": {
      "acteurRef": [
        "PA606712",
        "PA267429",
        "PA330684",
        "PA718850",
        "PA346218",
        "PA267204",
        "PA721968",
        "PA718838",
        "PA340853",
        "PA605036",
        "PA332523",
        "PA718780",
        "PA608016",
        "PA267318",
        "PA266797",
        "PA267260",
        "PA608416"
      ]
    },
    "texteAffichable": "Mme&#160;Louwagie,  Mme&#160;Val&#233;rie&#160;Boyer, M.&#160;Sermier, M.&#160;Hetzel, M.&#160;Abad, M.&#160;Vialay, M.&#160;Leclerc, M.&#160;Cordier, M.&#160;Cinieri, Mme&#160;Dalloz, Mme&#160;Trastour-Isnart, M.&#160;Brun, M.&#160;Lurton, M.&#160;Grelier, Mme&#160;Poletti, M.&#160;Masson et M.&#160;Gosselin"
  },
  "pointeurFragmentTexte": {
    "missionVisee": {
      "@xmlns:xsi": "http://www.w3.org/2001/XMLSchema-instance",
      "@xsi:nil": "true"
    },
    "division": {
      "titre": "Article 16",
      "articleDesignationCourte": "AVANT ART. 16",
      "type": "ARTICLE",
      "avant_A_Apres": "Avant",
      "divisionRattachee": "AVANT L'ARTICLE 16, insérer l'article suivant:",
      "articleAdditionnel": "1",
      "chapitreAdditionnel": {
        "@xmlns:xsi": "http://www.w3.org/2001/XMLSchema-instance",
        "@xsi:nil": "true"
      },
      "urlDivisionTexteVise": "/15/textes/0627.asp#D_Article_16"
    },
    "alinea": {
      "@xmlns:xsi": "http://www.w3.org/2001/XMLSchema-instance",
      "@xsi:nil": "true"
    }
  },
  "corps": {
    "dispositif": "<p>Au d&#233;but du 5&#176; de l&#8217;article L.&#160;331&#8209;3&#8209;1 du code rural et de la p&#234;che maritime, les mots&#160;: &#171;&#160;En Guadeloupe, en Guyane, en Martinique, &#224; Mayotte et &#224; La R&#233;union, &#224;&#160;&#187;, sont remplac&#233;s par le mot&#160;: &#171;&#160;&#192;&#160;&#187;.</p>",
    "exposeSommaire": "<p style=\"text-align: justify;\">Cet amendement, visant &#224; combler l&#8217;absence d&#8217;un volet de simplification dans le projet de loi alors qu&#8217;une circulaire &#233;tait cens&#233;e le pr&#233;voir, pr&#233;voit d&#8217;&#233;tendre &#224; la m&#233;tropole d&#8217;un cas de refus d&#8217;autorisation d&#8217;exploiter, li&#233; au respect des crit&#232;res du SDREA, applicable aujourd&#8217;hui sp&#233;cifiquement &#224; l&#8217;outre-mer. Il est ici pr&#233;vu de l&#8217;&#233;tendre &#224; la France enti&#232;re, tant le respect de ces sch&#233;mas publics para&#238;t &#233;vident, ceci refl&#233;tant un besoin local de plus grande rigueur pour l&#8217;application des textes, afin de permettre un refus de certaines autorisations d&#8217;exploiter apr&#232;s consultation, le cas &#233;ch&#233;ant, des membres de la CDOA.</p>",
    "annexeExposeSommaire": {
      "@xmlns:xsi": "http://www.w3.org/2001/XMLSchema-instance",
      "@xsi:nil": "true"
    }
  },
  "representations": {
    "representation": {
      "nom": "PDF",
      "typeMime": {
        "type": "application",
        "subType": "PDF"
      },
      "statutRepresentation": {
        "verbatim": "true",
        "canonique": "true",
        "officielle": "true",
        "transcription": "false",
        "enregistrement": "false"
      },
      "repSource": {
        "@xmlns:xsi": "http://www.w3.org/2001/XMLSchema-instance",
        "@xsi:nil": "true"
      },
      "offset": {
        "@xmlns:xsi": "http://www.w3.org/2001/XMLSchema-instance",
        "@xsi:nil": "true"
      },
      "contenu": {
        "documentURI": "/15/amendements/0627/CION-ECO/CE378.pdf"
      },
      "dateDispoRepresentation": {
        "@xmlns:xsi": "http://www.w3.org/2001/XMLSchema-instance",
        "@xsi:nil": "true"
      }
    }
  },
  "seanceDiscussion": {
    "@xmlns:xsi": "http://www.w3.org/2001/XMLSchema-instance",
    "@xsi:nil": "true"
  },
  "sort": {
    "dateSaisie": "2018-04-20T19:04:39.000+02:00",
    "sortEnSeance": "Non soutenu"
  },
  "dateDepot": "2018-04-06T02:00:00.000+02:00",
  "dateDistribution": "2018-04-17T02:00:00.000+02:00",
  "article99": "0",
  "loiReference": {
    "codeLoi": "rural et pêche maritime",
    "divisionCodeLoi": "L331-3-1"
  }
}