{
  "@xmlns": "http://schemas.assemblee-nationale.fr/referentiel",
  "uid": "AMANR5L15SEA717460BTC0971P0D1N159",
  "identifiant": {
    "legislature": "15",
    "numero": "159",
    "numRect": "0",
    "saisine": {
      "refTexteLegislatif": "PRJLANR5L15BTC0971",
      "numeroPartiePLF": "0",
      "organeExamen": "PO717460",
      "mentionSecondeDeliberation": "0"
    }
  },
  "numeroLong": "159",
  "etapeTexte": "1ère lecture (1ère assemblée saisie)",
  "triAmendement": "ahxl",
  "cardinaliteAmdtMultiples": "1",
  "amendementParent": {
    "@xmlns:xsi": "http://www.w3.org/2001/XMLSchema-instance",
    "@xsi:nil": "true"
  },
  "etat": "Discuté",
  "signataires": {
    "auteur": {
      "typeAuteur": "Depute",
      "acteurRef": "PA605991",
      "organeRef": {
        "@xmlns:xsi": "http://www.w3.org/2001/XMLSchema-instance",
        "@xsi:nil": "true"
      },
      "groupePolitiqueRef": "PO730934"
    },
    "cosignataires": {
      "acteurRef": [
        "PA267289",
        "PA609726",
        "PA2155",
        "PA267735",
        "PA334654",
        "PA266793",
        "PA719272",
        "PA718784",
        "PA605991",
        "PA334149",
        "PA642847",
        "PA330684",
        "PA605036",
        "PA721968",
        "PA856",
        "PA606712",
        "PA346218",
        "PA608416",
        "PA267901",
        "PA721678",
        "PA718884",
        "PA719318",
        "PA720210",
        "PA709315",
        "PA608826"
      ]
    },
    "texteAffichable": "Mme&#160;Genevard,  M.&#160;Straumann, M.&#160;Kamardine, Mme&#160;Val&#233;rie&#160;Boyer, M.&#160;Hetzel, Mme&#160;Anthoine, Mme&#160;Bazin-Malgras, M.&#160;Reda, M.&#160;Masson, M.&#160;Abad, M.&#160;Menuel, Mme&#160;Duby-Muller, M.&#160;de Ganay, M.&#160;Bony, Mme&#160;Beauvais, M.&#160;Vialay, M.&#160;Lurton, M.&#160;Door, M.&#160;Cherpion, M.&#160;Fasquelle, M.&#160;Bazin, Mme&#160;Meunier, M.&#160;Pauget, M.&#160;Viala et M.&#160;Aubert"
  },
  "pointeurFragmentTexte": {
    "missionVisee": {
      "@xmlns:xsi": "http://www.w3.org/2001/XMLSchema-instance",
      "@xsi:nil": "true"
    },
    "division": {
      "titre": "Article 15",
      "articleDesignationCourte": "ART. 15",
      "type": "ARTICLE",
      "avant_A_Apres": "A",
      "divisionRattachee": "ARTICLE 15",
      "articleAdditionnel": {
        "@xmlns:xsi": "http://www.w3.org/2001/XMLSchema-instance",
        "@xsi:nil": "true"
      },
      "chapitreAdditionnel": {
        "@xmlns:xsi": "http://www.w3.org/2001/XMLSchema-instance",
        "@xsi:nil": "true"
      },
      "urlDivisionTexteVise": "/15/textes/0971.asp#D_Article_15"
    },
    "alinea": {
      "avant_A_Apres": "A",
      "numero": "2",
      "alineaDesignation": "Alinéa 2"
    }
  },
  "corps": {
    "dispositif": "<p style=\"text-align: justify;\">I.&#160;&#8211;&#160;Supprimer l&#8217;alin&#233;a&#160;2.</p><p style=\"text-align: justify;\">II.&#160;&#8211;&#160;En cons&#233;quence, &#224; l&#8217;alin&#233;a&#160;5, supprimer les mots&#160;: &#171;&#160;, sous r&#233;serve de l&#8217;article L.&#160;632&#8209;2&#8209;1,&#160;&#187;.</p><p style=\"text-align: justify;\">III.&#160;&#8211;&#160;En cons&#233;quence, supprimer les alin&#233;as 9 &#224; 16.</p>",
    "exposeSommaire": "<p style=\"text-align: justify;\">L&#8217;article&#160;15 a pour objet d&#8217;acc&#233;l&#233;rer et de &#171;&#160;faciliter&#160;&#187;, en rendant simplement consultatif l&#8217;avis de l&#8217;architecte des B&#226;timents de France (ABF) dans certaines hypoth&#232;ses (les op&#233;rations de traitement de l&#8217;habitat indigne dans les secteurs prot&#233;g&#233;s au titre du patrimoine et les projets d&#8217;installation d&#8217;antennes relais de radiot&#233;l&#233;phonie mobile). Cette disposition cr&#233;e donc un pr&#233;c&#233;dent et nous pouvons craindre que la liste des projets exon&#233;r&#233;s soit &#233;largie a posteriori.</p><p style=\"text-align: justify;\">Les d&#233;cisions des ABF qui sont g&#233;n&#233;ralement peu contest&#233;es (100 recours dont 30 form&#233;s par l&#8217;autorit&#233; comp&#233;tente en mati&#232;re d&#8217;autorisation urbanisme sur 400 000 demandes) doivent &#234;tre maintenues car, loin de constituer un obstacle au bon d&#233;roulement des proc&#233;dures d&#8217;autorisation d&#8217;urbanisme dans les sites prot&#233;g&#233;s, elles participent &#224; la qualit&#233;, donc &#224; l&#8217;attractivit&#233; des centres villes dans des villes moyennes. Elles r&#233;pondent donc aux objectifs fix&#233;s par la strat&#233;gie nationale pour le logement et concilient la protection du patrimoine et les enjeux d&#8217;int&#233;r&#234;t public (comme la couverture num&#233;rique sur tout le territoire).</p><p style=\"text-align: justify;\">En tout &#233;tat de cause, la suppression de l&#8217;avis conforme de l&#8217;ABF sur de tels projets laisse craindre, afin de pallier ce manque de prise en compte des prescriptions patrimoniales, la multiplication de recours contentieux d&#233;pos&#233;s par des associations de protection du patrimoine post&#233;rieurement &#224; la d&#233;livrance des autorisations de construire, rallongeant ainsi les d&#233;lais de r&#233;alisation des projets.</p><p style=\"text-align: justify;\">Cet amendement propose donc la suppression de l&#8217;article L.&#160;632&#8209;2&#8209;1 nouveau du projet de loi.</p><p style=\"text-align: justify;\">A noter enfin que le projet de loi pourrait &#234;tre l&#8217;occasion de s&#233;curiser le cadre l&#233;gislatif et r&#233;glementaire permettant un renforcement du r&#244;le d&#8217;accompagnement des ABF en amont de la d&#233;livrance des autorisations d&#8217;urbanisme au regard des enjeu d&#8217;am&#233;nagement urbain et de revitalisation des centres historiques.</p>",
    "annexeExposeSommaire": {
      "@xmlns:xsi": "http://www.w3.org/2001/XMLSchema-instance",
      "@xsi:nil": "true"
    }
  },
  "representations": {
    "representation": {
      "nom": "PDF",
      "typeMime": {
        "type": "application",
        "subType": "PDF"
      },
      "statutRepresentation": {
        "verbatim": "true",
        "canonique": "true",
        "officielle": "true",
        "transcription": "false",
        "enregistrement": "false"
      },
      "repSource": {
        "@xmlns:xsi": "http://www.w3.org/2001/XMLSchema-instance",
        "@xsi:nil": "true"
      },
      "offset": {
        "@xmlns:xsi": "http://www.w3.org/2001/XMLSchema-instance",
        "@xsi:nil": "true"
      },
      "contenu": {
        "documentURI": "/15/amendements/0971/AN/159.pdf"
      },
      "dateDispoRepresentation": {
        "@xmlns:xsi": "http://www.w3.org/2001/XMLSchema-instance",
        "@xsi:nil": "true"
      }
    }
  },
  "seanceDiscussion": "RUANR5L15S2018IDS21082",
  "sort": {
    "dateSaisie": "2018-06-01T16:01:44.000+02:00",
    "sortEnSeance": "Rejeté"
  },
  "dateDepot": "2018-05-23T02:00:00.000+02:00",
  "dateDistribution": "2018-05-29T02:00:00.000+02:00",
  "article99": "0",
  "loiReference": {
    "codeLoi": {
      "@xmlns:xsi": "http://www.w3.org/2001/XMLSchema-instance",
      "@xsi:nil": "true"
    },
    "divisionCodeLoi": {
      "@xmlns:xsi": "http://www.w3.org/2001/XMLSchema-instance",
      "@xsi:nil": "true"
    }
  }
}