{
  "@xmlns": "http://schemas.assemblee-nationale.fr/referentiel",
  "uid": "AMANR5L15SEA717460B1490P0D1N506",
  "identifiant": {
    "legislature": "15",
    "numero": "506",
    "numRect": "0",
    "saisine": {
      "refTexteLegislatif": "PRJLANR5L15B1490",
      "numeroPartiePLF": "0",
      "organeExamen": "PO717460",
      "mentionSecondeDeliberation": "1"
    }
  },
  "numeroLong": "506",
  "etapeTexte": "Nouvelle Lecture",
  "triAmendement": "kaiaaaaaaaaaaaaaaaaaaaaaaaaaaaaaaaaaaaaaaaaaaaaaaajtdddddddhzzzu",
  "cardinaliteAmdtMultiples": "1",
  "amendementParent": {
    "@xmlns:xsi": "http://www.w3.org/2001/XMLSchema-instance",
    "@xsi:nil": "true"
  },
  "etat": "Discuté",
  "signataires": {
    "auteur": {
      "typeAuteur": "Depute",
      "acteurRef": "PA605518",
      "organeRef": {
        "@xmlns:xsi": "http://www.w3.org/2001/XMLSchema-instance",
        "@xsi:nil": "true"
      },
      "groupePolitiqueRef": "PO759900"
    },
    "cosignataires": {
      "acteurRef": "PA605518"
    },
    "texteAffichable": "M.&#160;Fran&#231;ois-Michel&#160;Lambert"
  },
  "pointeurFragmentTexte": {
    "missionVisee": {
      "@xmlns:xsi": "http://www.w3.org/2001/XMLSchema-instance",
      "@xsi:nil": "true"
    },
    "division": {
      "titre": "Article 57",
      "articleDesignationCourte": "ART. 57",
      "type": "ARTICLE",
      "avant_A_Apres": "A",
      "divisionRattachee": "ARTICLE 57",
      "articleAdditionnel": {
        "@xmlns:xsi": "http://www.w3.org/2001/XMLSchema-instance",
        "@xsi:nil": "true"
      },
      "chapitreAdditionnel": {
        "@xmlns:xsi": "http://www.w3.org/2001/XMLSchema-instance",
        "@xsi:nil": "true"
      },
      "urlDivisionTexteVise": "/15/textes/1490.asp#D_Article_57"
    },
    "alinea": {
      "avant_A_Apres": {
        "@xmlns:xsi": "http://www.w3.org/2001/XMLSchema-instance",
        "@xsi:nil": "true"
      },
      "numero": "7",
      "alineaDesignation": {
        "@xmlns:xsi": "http://www.w3.org/2001/XMLSchema-instance",
        "@xsi:nil": "true"
      }
    }
  },
  "corps": {
    "dispositif": "<p style=\"text-align: justify;\">&#160;I.&#160;&#8211; Compl&#233;ter l'alin&#233;a&#160;7 par les mots&#160;:</p><p style=\"text-align: justify;\">&#171;&#160;, de portes d&#8217;entr&#233;e donnant sur l&#8217;ext&#233;rieur et de syst&#232;mes de ventilation m&#233;canique contr&#244;l&#233;e.&#160;&#187;</p><p style=\"text-align: justify;\">&#160;II.&#160;&#8211;&#160;En cons&#233;quence, r&#233;diger ainsi l'alin&#233;a&#160;8&#160;:</p><p style=\"text-align: justify;\">&#171;&#160;Toutefois, pour l&#8217;acquisition de mat&#233;riaux d&#8217;isolation thermique des parois vitr&#233;es, et pour l&#8217;acquisition de portes d&#8217;entr&#233;e donnant sur l&#8217;ext&#233;rieur&#160;le cr&#233;dit d&#8217;imp&#244;t s&#8217;applique dans la limite de plafonds de d&#233;penses par parois vitr&#233;es remplac&#233;es et par porte d&#8217;entr&#233;e donnant sur l&#8217;ext&#233;rieur et&#160;fix&#233;s par arr&#234;t&#233; conjoint des ministres charg&#233;s de l&#8217;&#233;nergie, du logement et du budget&#160;;&#160;&#187;</p><p style=\"text-align: justify;\">III.&#160;&#8211;&#160;Compl&#233;ter cet article par les deux alin&#233;as suivants&#160;:</p><p style=\"text-align: justify;\">&#171;&#160;V.&#160;&#8211;&#160;La perte de recettes pour l&#8217;&#201;tat est compens&#233;e, &#224; due concurrence, par la cr&#233;ation d&#8217;une taxe additionnelle aux droits pr&#233;vus aux articles&#160;575 et&#160;575&#160;A du code g&#233;n&#233;ral des imp&#244;ts.&#160;&#187;</p><p>&#171;&#160;VI.&#160;&#8211;&#160;Le I n&#8217;est applicable qu&#8217;aux sommes venant en d&#233;duction de l&#8217;imp&#244;t d&#251;.&#160;&#187;</p>",
    "exposeSommaire": "<p style=\"text-align: justify;\">La loi de Finances pour 2018, avait pr&#233;vu que le Cr&#233;dit d&#8217;Imp&#244;t Transition &#201;nerg&#233;tique (CITE) serait transform&#233; en prime.</p><p style=\"text-align: justify;\">Dans le projet de loi de Finances initial pour 2019, le Gouvernement a finalement report&#233; la transformation du CITE en prime en prorogeant d&#8217;une ann&#233;e le CITE, tel qu&#8217;adopt&#233; dans le PLF 2018.</p><p style=\"text-align: justify;\">L&#8217;annulation de la transformation du CITE en prime pour certains travaux de r&#233;novation &#233;nerg&#233;tique est un mauvais signal envoy&#233; aux particuliers et ne peut que contribuer &#224; impacter de fa&#231;on n&#233;gative l&#8217;activit&#233; du secteur du b&#226;timent sur le segment de la r&#233;novation &#233;nerg&#233;tique.</p><p style=\"text-align: justify;\">Le remplacement du cr&#233;dit d&#8217;imp&#244;t par une prime &#233;tait en effet une proposition efficace de nature &#224; encourager les m&#233;nages &#224; effectuer davantage de travaux de r&#233;novation. Le report de celle-ci ajout&#233; &#224; la diminution du champ du CITE rend impossible le d&#233;fi de r&#233;nover 500&#160;000 passoires thermiques par an.</p><p style=\"text-align: justify;\">On rappellera que ce sont les particuliers qui doivent payer la transformation &#233;nerg&#233;tique&#160;du secteur de l&#8217;habitat en r&#233;novant leur propre logement. Comment pourront-ils le faire massivement (et plus qu&#8217;aujourd&#8217;hui) si dans le m&#234;me temps le Gouvernement n&#8217;a de cesse de diminuer les aides financi&#232;res et les dispositifs d&#8217;incitations&#160;?</p><p style=\"text-align: justify;\">Le budget allou&#233; au CITE pour 2019 a, en effet, diminu&#233; de plus de la moiti&#233; (800 millions) compar&#233; au 1,7 milliard du PLF 2018.</p><p style=\"text-align: justify;\">&#201;radiquer les passoires thermiques suppose de traiter tous les postes de d&#233;perdition dont les menuiseries et tout particuli&#232;rement les fen&#234;tres et portes d&#8217;entr&#233;e donnant sur l&#8217;ext&#233;rieur.</p><p style=\"text-align: justify;\">Les exclure du champ du CITE reviendrai &#224; rendre impossible l&#8217;atteinte des objectifs de performance &#233;nerg&#233;tique fix&#233;s par le plan de r&#233;novation &#233;nerg&#233;tique des logements, &#224; savoir une diminution globale de 15&#160;% de la consommation d&#8217;&#233;nergie finale des b&#226;timents en 2023 (par rapport &#224; l&#8217;ann&#233;e de r&#233;f&#233;rence 2010), en conformit&#233; avec celui de la programmation pluriannuelle de l&#8217;&#233;nergie (PPE).</p><p style=\"text-align: justify;\">Ce constat est &#233;tay&#233; par le r&#233;cent rapport du CSTB-ADEME (Centre Scientifique et Technique du B&#226;timent - Agence de l&#8217;environnement et de la ma&#238;trise de l&#8217;&#233;nergie) concernant la performance des diff&#233;rents &#171;&#160;gestes&#160;&#187; de r&#233;novation thermique pr&#233;sent&#233;s au Conseil Sup&#233;rieur de la Construction et de l&#8217;Efficacit&#233; &#201;nerg&#233;tique.</p><p style=\"text-align: justify;\">Ce rapport d&#233;montre, en effet, de fa&#231;on claire que les travaux de remplacement d&#8217;un simple vitrage par des fen&#234;tres performantes ont bien un impact significatif sur les consommations &#233;nerg&#233;tiques finales permettant ainsi de r&#233;aliser des &#233;conomies pour les m&#233;nages et particuli&#232;rement pour les plus modestes d&#8217;entre eux .</p><p style=\"text-align: justify;\">L&#8217;&#233;conomie d&#8217;&#233;nergie d&#8217;un m&#232;tre carr&#233; d&#8217;une fen&#234;tre performante en remplacement d&#8217;une ancienne fen&#234;tre simple vitrage serait ainsi directement comparable &#224; l&#8217;&#233;conomie d&#8217;un m&#232;tre carr&#233; d&#8217;isolation des combles ou des murs.</p><p style=\"text-align: justify;\">&#192; la suite de la pr&#233;sentation de ce rapport le Conseil Sup&#233;rieur de la Construction a d&#8217;ailleurs indiqu&#233; que&#160;: &#171;&#160;Reconduire le CITE &#224; l&#8217;identique en 2019 entrainera un frein durable &#224; la r&#233;novation qui d&#233;sengagera de nombreux acteurs loin des ambitions du plan de r&#233;novation &#233;nerg&#233;tique du b&#226;timent&#160;&#187;.</p><p style=\"text-align: justify;\">Lors de l&#8217;examen du pr&#233;sent article en 1<sup>&#232;re</sup> lecture au S&#233;nat , les S&#233;nateurs ont adopt&#233; un amendement en s&#233;ance qui r&#233;pond &#224; cette pr&#233;occupation en r&#233;introduisant dans le CITE les fen&#234;tres au taux de 15&#160;% sous condition de remplacement de fen&#234;tres en simple vitrage.&#160;</p><p style=\"text-align: justify;\">Il est donc indispensable de maintenir, comme cela a &#233;t&#233; adopt&#233; au S&#233;nat, le remplacement des menuiseries &#224; simple vitrage par des menuiseries performantes en y ajoutant dans un souci d&#8217;une meilleure efficacit&#233; &#233;nerg&#233;tique du logement, le remplacement des portes d&#8217;entr&#233;e donnant sur l&#8217;ext&#233;rieur, &#224; un taux de 15&#160;%.</p><p style=\"text-align: justify;\">Toutefois afin d&#8217;&#233;viter tout effet d&#8217;aubaine pour ces d&#233;penses, il est propos&#233; que le cr&#233;dit d&#8217;imp&#244;t s&#8217;applique dans la limite de plafonds de d&#233;penses fix&#233;s par arr&#234;t&#233; conjoint des ministres charg&#233;s de l&#8217;&#233;nergie, du logement et du budget&#160;.</p><p style=\"text-align: justify;\">L&#8217;amendement propose &#233;galement d&#8217;introduire au titre des travaux &#233;ligibles au CITE les travaux relatif &#224; la ventilation et l&#8217;a&#233;ration des logements.</p><p style=\"text-align: justify;\">En effet une &#233;tude conjointe de l&#8217;Agence Nationale de S&#233;curit&#233; Sanitaire de l&#8217;Alimentation, de l&#8217;Environnement et du Travail (ANSES), du Centre Scientifique et Technique du B&#226;timent (CSTB) et de l&#8217;Observatoire de la Qualit&#233; de l&#8217;Air Int&#233;rieur (OQAI) &#171;&#160;&#201;tude exploratoire du co&#251;t socio-&#233;conomique des polluants de l&#8217;air int&#233;rieur&#160;&#187; (2014), estime le nombre de d&#233;c&#232;s pr&#233;matur&#233;s, d&#251; &#224; ce facteur, &#224; 20 000 par an et un co&#251;t annuel associ&#233; pour la collectivit&#233; de 20 milliards d&#8217;euros.</p><p style=\"text-align: justify;\">Une mauvaise qualit&#233; de l&#8217;air int&#233;rieur engendre aussi, au travers du d&#233;veloppement de moisissures, une d&#233;gradation du b&#226;ti qui devra alors &#234;tre r&#233;habilit&#233; plus fr&#233;quemment et ne permet pas d&#8217;optimiser l&#8217;acte de r&#233;novation.</p><p style=\"text-align: justify;\">Dans son rapport de 2016 relatif aux &#171;&#160;Moisissures dans le B&#226;ti&#160;&#187;, l&#8217;ANSES recommande d&#8217;ailleurs de lier les mesures en faveur de l&#8217;isolation &#224; celles qui pourraient &#234;tre mises en &#339;uvre pour la ventilation au regard du caract&#232;re indissociable de ces deux actions.</p><p style=\"text-align: justify;\">Dans le souci d&#8217;optimiser la performance &#233;nerg&#233;tique des logements sans d&#233;grader la sant&#233; des occupants, le pr&#233;sent amendement pr&#233;conise donc d&#8217;int&#233;grer dans le CITE, les syst&#232;mes de ventilation m&#233;canique contr&#244;l&#233;e, au taux de 15&#160;%.</p><p style=\"text-align: justify;\">Concernant enfin la question des chaudi&#232;res fioul, qui n&#8217;est pas trait&#233;e dans le pr&#233;sent amendement, il est rappel&#233; que, pour les particuliers qui recourent &#224; une source &#233;nerg&#233;tique fioul, cela rel&#232;ve le plus souvent d&#8217;un choix contraint, notamment en raison de l&#8217;isolement g&#233;ographique du logement.</p><p style=\"text-align: justify;\">Les chaudi&#232;res au fioul n&#8217;&#233;tant plus &#233;ligibles au CITE, un plan d&#8217;accompagnement de remplacement de ces &#233;quipements devra &#234;tre mis en place dans le cadre des CEE (Certificat d&#8217;&#233;conomie d&#8217;&#233;nergie) pour pourvoir permettre aux particuliers concern&#233;s, et notamment les plus modestes d&#8217;entre eux, non seulement de changer d&#8217;&#233;nergie (et &#233;vacuer les anciens &#233;quipements et la cuve au fioul) mais &#233;galement de remplacer leur chaudi&#232;re v&#233;tuste.&#160;</p>",
    "annexeExposeSommaire": {
      "@xmlns:xsi": "http://www.w3.org/2001/XMLSchema-instance",
      "@xsi:nil": "true"
    },
    "cartoucheDelaiDepotDepasse": {
      "@xmlns:xsi": "http://www.w3.org/2001/XMLSchema-instance",
      "@xsi:nil": "true"
    }
  },
  "representations": {
    "representation": {
      "nom": "PDF",
      "typeMime": {
        "type": "application",
        "subType": "PDF"
      },
      "statutRepresentation": {
        "verbatim": "true",
        "canonique": "true",
        "officielle": "true",
        "transcription": "false",
        "enregistrement": "false"
      },
      "repSource": {
        "@xmlns:xsi": "http://www.w3.org/2001/XMLSchema-instance",
        "@xsi:nil": "true"
      },
      "offset": {
        "@xmlns:xsi": "http://www.w3.org/2001/XMLSchema-instance",
        "@xsi:nil": "true"
      },
      "contenu": {
        "documentURI": "/15/amendements/1490/AN/506.pdf"
      },
      "dateDispoRepresentation": {
        "@xmlns:xsi": "http://www.w3.org/2001/XMLSchema-instance",
        "@xsi:nil": "true"
      }
    }
  },
  "seanceDiscussion": "RUANR5L15S2019IDS21433",
  "sort": {
    "dateSaisie": "2018-12-19T03:39:19.000+01:00",
    "sortEnSeance": "Tombé"
  },
  "dateDepot": "2018-12-14T01:00:00.000+01:00",
  "dateDistribution": "2018-12-17T01:00:00.000+01:00",
  "article99": "0",
  "loiReference": {
    "codeLoi": {
      "@xmlns:xsi": "http://www.w3.org/2001/XMLSchema-instance",
      "@xsi:nil": "true"
    },
    "divisionCodeLoi": {
      "@xmlns:xsi": "http://www.w3.org/2001/XMLSchema-instance",
      "@xsi:nil": "true"
    }
  }
}