{
  "@xmlns": "http://schemas.assemblee-nationale.fr/referentiel",
  "uid": "AMANR5L15SEA717460BTC0990P0D1N152",
  "identifiant": {
    "legislature": "15",
    "numero": "152",
    "numRect": "0",
    "saisine": {
      "refTexteLegislatif": "PIONANR5L15BTC0990",
      "numeroPartiePLF": "0",
      "organeExamen": "PO717460",
      "mentionSecondeDeliberation": "0"
    }
  },
  "numeroLong": "152",
  "etapeTexte": "1ère lecture (1ère assemblée saisie)",
  "triAmendement": "sms",
  "cardinaliteAmdtMultiples": "1",
  "amendementParent": {
    "@xmlns:xsi": "http://www.w3.org/2001/XMLSchema-instance",
    "@xsi:nil": "true"
  },
  "etat": "Discuté",
  "signataires": {
    "auteur": {
      "typeAuteur": "Depute",
      "acteurRef": "PA722284",
      "organeRef": {
        "@xmlns:xsi": "http://www.w3.org/2001/XMLSchema-instance",
        "@xsi:nil": "true"
      },
      "groupePolitiqueRef": "PO730970"
    },
    "cosignataires": {
      "acteurRef": "PA722284"
    },
    "texteAffichable": "M.&#160;Fuchs"
  },
  "pointeurFragmentTexte": {
    "missionVisee": {
      "@xmlns:xsi": "http://www.w3.org/2001/XMLSchema-instance",
      "@xsi:nil": "true"
    },
    "division": {
      "titre": "Article 9",
      "articleDesignationCourte": "ART. 9",
      "type": "ARTICLE",
      "avant_A_Apres": "A",
      "divisionRattachee": "ARTICLE 9",
      "articleAdditionnel": {
        "@xmlns:xsi": "http://www.w3.org/2001/XMLSchema-instance",
        "@xsi:nil": "true"
      },
      "chapitreAdditionnel": {
        "@xmlns:xsi": "http://www.w3.org/2001/XMLSchema-instance",
        "@xsi:nil": "true"
      },
      "urlDivisionTexteVise": "/15/textes/0990.asp#D_Article_9"
    },
    "alinea": {
      "avant_A_Apres": "Apres",
      "numero": "6",
      "alineaDesignation": {
        "@xmlns:xsi": "http://www.w3.org/2001/XMLSchema-instance",
        "@xsi:nil": "true"
      }
    }
  },
  "corps": {
    "dispositif": "<p style=\"text-align: justify;\">Compl&#233;ter cet article par l&#8217;alin&#233;a suivant&#160;:</p><p style=\"text-align: justify;\">&#171;&#160;Il d&#233;livre, selon des modalit&#233;s et des crit&#232;res d&#233;finis par d&#233;cret, un label certifi&#233; permettant &#224; ces op&#233;rateurs d&#8217;identifier et de signaler &#224; leurs utilisateurs les contenus issus des entreprises de presse, agences de presse et services de m&#233;dia audiovisuels.&#160;&#187;</p>",
    "exposeSommaire": "<p style=\"text-align: justify;\">Le pr&#233;sent amendement substitut l&#8217;obligation de promotion par une obligation de signal&#233;tique, qui pourra s&#8217;exercer aussi bien pour labelliser les sites de confiance que pour mettre en garde contre les sites de moindre cr&#233;dibilit&#233;.</p><p style=\"text-align: justify;\">Cette signal&#233;tique pourra &#234;tre accompagn&#233;e par une proc&#233;dure de labellisation certifi&#233;e confi&#233;e au Conseil sup&#233;rieur de l&#8217;audiovisuel, qui permettra aux op&#233;rateurs de plateformes d&#8217;identifier et de faire conna&#238;tre les sources d&#8217;informations de confiance.</p>",
    "annexeExposeSommaire": {
      "@xmlns:xsi": "http://www.w3.org/2001/XMLSchema-instance",
      "@xsi:nil": "true"
    }
  },
  "representations": {
    "representation": {
      "nom": "PDF",
      "typeMime": {
        "type": "application",
        "subType": "PDF"
      },
      "statutRepresentation": {
        "verbatim": "true",
        "canonique": "true",
        "officielle": "true",
        "transcription": "false",
        "enregistrement": "false"
      },
      "repSource": {
        "@xmlns:xsi": "http://www.w3.org/2001/XMLSchema-instance",
        "@xsi:nil": "true"
      },
      "offset": {
        "@xmlns:xsi": "http://www.w3.org/2001/XMLSchema-instance",
        "@xsi:nil": "true"
      },
      "contenu": {
        "documentURI": "/15/amendements/0990/AN/152.pdf"
      },
      "dateDispoRepresentation": {
        "@xmlns:xsi": "http://www.w3.org/2001/XMLSchema-instance",
        "@xsi:nil": "true"
      }
    }
  },
  "seanceDiscussion": "RUANR5L15S2018IDS21152",
  "sort": {
    "dateSaisie": "2018-07-03T21:47:37.000+02:00",
    "sortEnSeance": "Non soutenu"
  },
  "dateDepot": "2018-06-04T02:00:00.000+02:00",
  "dateDistribution": "2018-06-07T02:00:00.000+02:00",
  "article99": "0",
  "loiReference": {
    "codeLoi": {
      "@xmlns:xsi": "http://www.w3.org/2001/XMLSchema-instance",
      "@xsi:nil": "true"
    },
    "divisionCodeLoi": {
      "@xmlns:xsi": "http://www.w3.org/2001/XMLSchema-instance",
      "@xsi:nil": "true"
    }
  }
}