{
  "@xmlns": "http://schemas.assemblee-nationale.fr/referentiel",
  "uid": "AMANR5L15PO59051B0911P0D1N622",
  "identifiant": {
    "legislature": "15",
    "numero": "622",
    "numRect": "0",
    "saisine": {
      "refTexteLegislatif": "PRJLANR5L15B0911",
      "numeroPartiePLF": "0",
      "organeExamen": "PO59051",
      "mentionSecondeDeliberation": "0"
    }
  },
  "numeroLong": "CL622",
  "etapeTexte": "1ère lecture (1ère assemblée saisie)",
  "triAmendement": "aaw",
  "cardinaliteAmdtMultiples": "1",
  "amendementParent": {
    "@xmlns:xsi": "http://www.w3.org/2001/XMLSchema-instance",
    "@xsi:nil": "true"
  },
  "etat": "Discuté",
  "signataires": {
    "auteur": {
      "typeAuteur": "Depute",
      "acteurRef": "PA2150",
      "organeRef": {
        "@xmlns:xsi": "http://www.w3.org/2001/XMLSchema-instance",
        "@xsi:nil": "true"
      },
      "groupePolitiqueRef": "PO730958"
    },
    "cosignataires": {
      "acteurRef": [
        "PA720422",
        "PA721210",
        "PA2150",
        "PA588884",
        "PA720430",
        "PA722142",
        "PA720286",
        "PA718868",
        "PA721062",
        "PA718860",
        "PA721960",
        "PA720892",
        "PA719578",
        "PA721202",
        "PA719676",
        "PA721226",
        "PA720846"
      ]
    },
    "texteAffichable": "M.&#160;M&#233;lenchon,  Mme&#160;Autain, M.&#160;Bernalicis, M.&#160;Coquerel, M.&#160;Corbi&#232;re, Mme&#160;Fiat, M.&#160;Lachaud, M.&#160;Larive, Mme&#160;Obono, Mme&#160;Panot, M.&#160;Prud&apos;homme, M.&#160;Quatennens, M.&#160;Ratenon, Mme&#160;Ressiguier, Mme&#160;Rubin, M.&#160;Ruffin et Mme&#160;Taurine"
  },
  "pointeurFragmentTexte": {
    "missionVisee": {
      "@xmlns:xsi": "http://www.w3.org/2001/XMLSchema-instance",
      "@xsi:nil": "true"
    },
    "division": {
      "titre": "Article PREMIER",
      "articleDesignationCourte": "AVANT ART. PREMIER",
      "type": "ARTICLE",
      "avant_A_Apres": "Avant",
      "divisionRattachee": "AVANT L'ARTICLE PREMIER, insérer l'article suivant:",
      "articleAdditionnel": "1",
      "chapitreAdditionnel": {
        "@xmlns:xsi": "http://www.w3.org/2001/XMLSchema-instance",
        "@xsi:nil": "true"
      },
      "urlDivisionTexteVise": "/15/textes/0911.asp#D_Article_1er"
    },
    "alinea": {
      "@xmlns:xsi": "http://www.w3.org/2001/XMLSchema-instance",
      "@xsi:nil": "true"
    }
  },
  "corps": {
    "dispositif": "<p style=\"text-align: justify;\">Apr&#232;s le deuxi&#232;me alin&#233;a l&#8217;article&#160;6 de la Constitution, il est ins&#233;r&#233; un alin&#233;a ainsi r&#233;dig&#233;&#160;:</p><p style=\"text-align: justify;\">&#171;&#160;La r&#233;vocation de la Pr&#233;sidente ou du Pr&#233;sident peut &#234;tre demand&#233;e par un r&#233;f&#233;rendum organis&#233; sur l&#8217;initiative d&#8217;un dixi&#232;me des &#233;lecteurs inscrits sur les listes &#233;lectorales, &#224; l&#8217;issue de la premi&#232;re moiti&#233; de son mandat. La r&#233;vocation est prononc&#233;e &#224; la majorit&#233; absolue des suffrages exprim&#233;s. Elle est d&#8217;effet imm&#233;diat, et constitue un des cas d&#8217;emp&#234;chement d&#233;finitif pr&#233;vu par l&#8217;article&#160;7.&#160;&#187;</p>",
    "exposeSommaire": "<p>Par cet amendement, en coh&#233;rence avec notre programme l&#8217;Avenir en Commun (Point 3, https://laec.fr/sommaire) et avec notre Livret Intervention populaire (https://avenirencommun.fr/livret-intervention-populaire/), nous proposons de consacrer un droit de r&#233;vocation du Pr&#233;sident de la R&#233;publique par le peuple fran&#231;ais.</p><p>Ce droit de r&#233;vocation impose au Pr&#233;sident de la R&#233;publique une responsabilit&#233; permanente vis-&#224;-vis du peuple, et conf&#232;re au peuple un pouvoir de contr&#244;le r&#233;gul&#233; et institutionnel du &#171; garant de l&#8217;ind&#233;pendance nationale, de l&#8217;int&#233;grit&#233; du territoire et du respect des trait&#233;s &#187;. Ainsi, tout &#233;lecteur peut voter en qui&#233;tude. Il sait disposer d&#233;sormais d&#8217;un pouvoir de contr&#244;le des Pr&#233;sidents de la R&#233;publique qui se renient, trahissent leurs engagements et tournent casaque d&#232;s leur arriv&#233;e au pouvoir.</p><p>En m&#234;me temps, le principe est suffisamment encadr&#233; pour que ce droit ne perturbe pas l&#8217;ordre d&#233;mocratique, mais soit au contraire employ&#233; avec parcimonie par les &#233;lecteurs, &#224; l&#8217;instar de ce que montrent les exp&#233;riences &#233;trang&#232;res (le droit de r&#233;vocation est en vigueur, &#224; diff&#233;rents degr&#233;s et pour diff&#233;rents &#233;lus publics, notamment dans 19 &#201;tats des &#201;tats-Unis d&#8217;Am&#233;rique, un &#201;tat du Canada, six cantons suisses).</p><p>La proc&#233;dure de r&#233;vocation serait lanc&#233;e &#224; l&#8217;initiative d&#8217;1/10e du corps &#233;lectoral concern&#233; et aboutit si une majorit&#233; absolue est r&#233;unie</p><p>Si le Pr&#233;sident de la R&#233;publique est r&#233;voqu&#233;, dans les conditions pr&#233;vues par l&#8217;article 7 de la Constitution, le Conseil Constitutionnel d&#233;clarerait son emp&#234;chement d&#233;finitif, et le scrutin pour l&#8217;&#233;lection du nouveau pr&#233;sident aurait lieu dans les vingt jours au moins et trente cinq jours au plus apr&#232;s cette r&#233;vocation. Ce dispositif permet pleinement d&#8217;allier l&#8217;exigence d&#233;mocratique avec la n&#233;cessit&#233; d&#8217;assurer la continuit&#233; et le fonctionnement r&#233;gulier des pouvoirs publics.</p>",
    "annexeExposeSommaire": {
      "@xmlns:xsi": "http://www.w3.org/2001/XMLSchema-instance",
      "@xsi:nil": "true"
    }
  },
  "representations": {
    "representation": {
      "nom": "PDF",
      "typeMime": {
        "type": "application",
        "subType": "PDF"
      },
      "statutRepresentation": {
        "verbatim": "true",
        "canonique": "true",
        "officielle": "true",
        "transcription": "false",
        "enregistrement": "false"
      },
      "repSource": {
        "@xmlns:xsi": "http://www.w3.org/2001/XMLSchema-instance",
        "@xsi:nil": "true"
      },
      "offset": {
        "@xmlns:xsi": "http://www.w3.org/2001/XMLSchema-instance",
        "@xsi:nil": "true"
      },
      "contenu": {
        "documentURI": "/15/amendements/0911/CION_LOIS/CL622.pdf"
      },
      "dateDispoRepresentation": {
        "@xmlns:xsi": "http://www.w3.org/2001/XMLSchema-instance",
        "@xsi:nil": "true"
      }
    }
  },
  "seanceDiscussion": {
    "@xmlns:xsi": "http://www.w3.org/2001/XMLSchema-instance",
    "@xsi:nil": "true"
  },
  "sort": {
    "dateSaisie": "2018-06-27T23:39:51.000+02:00",
    "sortEnSeance": "Rejeté"
  },
  "dateDepot": "2018-06-22T02:00:00.000+02:00",
  "dateDistribution": "2018-06-25T02:00:00.000+02:00",
  "article99": "0",
  "loiReference": {
    "codeLoi": "06",
    "divisionCodeLoi": "3"
  }
}