{
  "@xmlns": "http://schemas.assemblee-nationale.fr/referentiel",
  "uid": "AMANR5L15SEA717460BTC0971P0D1N3253",
  "identifiant": {
    "legislature": "15",
    "numero": "3253",
    "numRect": "0",
    "saisine": {
      "refTexteLegislatif": "PRJLANR5L15BTC0971",
      "numeroPartiePLF": "0",
      "organeExamen": "PO717460",
      "mentionSecondeDeliberation": "0"
    }
  },
  "numeroLong": "3253",
  "etapeTexte": "1ère lecture (1ère assemblée saisie)",
  "triAmendement": "ydi",
  "cardinaliteAmdtMultiples": "1",
  "amendementParent": "AMANR5L15SEA717460BTC0971P0D1N1885",
  "etat": "Discuté",
  "signataires": {
    "auteur": {
      "typeAuteur": "Gouvernement",
      "acteurRef": {
        "@xmlns:xsi": "http://www.w3.org/2001/XMLSchema-instance",
        "@xsi:nil": "true"
      },
      "organeRef": {
        "@xmlns:xsi": "http://www.w3.org/2001/XMLSchema-instance",
        "@xsi:nil": "true"
      },
      "groupePolitiqueRef": {
        "@xmlns:xsi": "http://www.w3.org/2001/XMLSchema-instance",
        "@xsi:nil": "true"
      }
    },
    "cosignataires": {
      "@xmlns:xsi": "http://www.w3.org/2001/XMLSchema-instance",
      "@xsi:nil": "true"
    },
    "texteAffichable": "le Gouvernement"
  },
  "pointeurFragmentTexte": {
    "missionVisee": {
      "@xmlns:xsi": "http://www.w3.org/2001/XMLSchema-instance",
      "@xsi:nil": "true"
    },
    "division": {
      "titre": "Article 51",
      "articleDesignationCourte": "ART. 51",
      "type": "ARTICLE",
      "avant_A_Apres": "A",
      "divisionRattachee": "ARTICLE 51",
      "articleAdditionnel": {
        "@xmlns:xsi": "http://www.w3.org/2001/XMLSchema-instance",
        "@xsi:nil": "true"
      },
      "chapitreAdditionnel": {
        "@xmlns:xsi": "http://www.w3.org/2001/XMLSchema-instance",
        "@xsi:nil": "true"
      },
      "urlDivisionTexteVise": "/15/textes/0971.asp#D_Article_51"
    },
    "alinea": {
      "avant_A_Apres": "Apres",
      "numero": "32",
      "alineaDesignation": {
        "@xmlns:xsi": "http://www.w3.org/2001/XMLSchema-instance",
        "@xsi:nil": "true"
      }
    }
  },
  "corps": {
    "dispositif": "<p style=\"text-align: justify;\">I.&#160;&#8211;&#160;&#192; la premi&#232;re phrase de l&#8217;alin&#233;a&#160;3, supprimer les mots&#160;:</p><p style=\"text-align: justify;\">&#171;&#160;ayant pour fonction le contr&#244;le de l&#8217;usage des locaux destin&#233;s &#224; l&#8217;habitation&#160;&#187;.</p><p style=\"text-align: justify;\">II.&#160;&#8211;&#160;En cons&#233;quence, &#224; la m&#234;me phrase, substituer aux mots&#160;:</p><p style=\"text-align: justify;\">&#171;&#160;dispositions du&#160;&#187;</p><p style=\"text-align: justify;\">les mots&#160;:</p><p style=\"text-align: justify;\">&#171;&#160;articles L.&#160;324&#8209;1&#8209;1, L.&#160;324&#8209;2 ainsi qu&#8217;au&#160;&#187;.</p><p style=\"text-align: justify;\">III.&#160;&#8211;&#160;En cons&#233;quence, compl&#233;ter ladite phrase par les mots&#160;:</p><p style=\"text-align: justify;\">&#171;&#160;sur le territoire relevant du service municipal du logement&#160;&#187;.</p><p style=\"text-align: justify;\">IV.&#160;&#8211;&#160;En cons&#233;quence, &#224; la seconde phrase du m&#234;me alin&#233;a, substituer au mot&#160;</p><p style=\"text-align: justify;\">&#171;&#160;communiquer&#160;&#187;</p><p style=\"text-align: justify;\">le mot&#160;:</p><p style=\"text-align: justify;\">&#171;&#160;pr&#233;senter&#160;&#187;.</p><p style=\"text-align: justify;\">IV.&#160;&#8211;&#160;En cons&#233;quence, &#224; la m&#234;me phrase, apr&#232;s la r&#233;f&#233;rence&#160;:</p><p style=\"text-align: justify;\">&#171;&#160;II&#160;&#187;</p><p style=\"text-align: justify;\">ins&#233;rer les mots&#160;:</p><p style=\"text-align: justify;\">&#171;&#160;de l&#8217;article L.&#160;324&#8209;1&#8209;1 et au I&#160;&#187;.</p><p style=\"text-align: justify;\">V.&#160;&#8211;&#160;En cons&#233;quence, &#224; la fin de ladite phrase, substituer aux mots&#160;:</p><p style=\"text-align: justify;\">&#171;&#160;m&#234;me paragraphe&#160;&#187;</p><p style=\"text-align: justify;\">les mots&#160;:</p><p style=\"text-align: justify;\">&#171;&#160;IV de l&#8217;article L.&#160;324&#8209;1&#8209;1&#160;&#187;.</p>",
    "exposeSommaire": "<p style=\"text-align: justify;\">Le pr&#233;sent sous-amendement vise &#224; garantir la coh&#233;rence d&#8217;ensemble des textes (notamment afin de garantir l&#8217;harmonisation de la d&#233;nomination des &#171;&#160;loueurs&#160;&#187; et des &#171;&#160;interm&#233;diaires&#160;&#187;) ainsi qu&#8217;&#224; assurer que les textes visent l&#8217;ensemble des agents asserment&#233;s.</p>",
    "annexeExposeSommaire": {
      "@xmlns:xsi": "http://www.w3.org/2001/XMLSchema-instance",
      "@xsi:nil": "true"
    }
  },
  "representations": {
    "representation": {
      "nom": "PDF",
      "typeMime": {
        "type": "application",
        "subType": "PDF"
      },
      "statutRepresentation": {
        "verbatim": "true",
        "canonique": "true",
        "officielle": "true",
        "transcription": "false",
        "enregistrement": "false"
      },
      "repSource": {
        "@xmlns:xsi": "http://www.w3.org/2001/XMLSchema-instance",
        "@xsi:nil": "true"
      },
      "offset": {
        "@xmlns:xsi": "http://www.w3.org/2001/XMLSchema-instance",
        "@xsi:nil": "true"
      },
      "contenu": {
        "documentURI": "/15/amendements/0971/AN/3253.pdf"
      },
      "dateDispoRepresentation": {
        "@xmlns:xsi": "http://www.w3.org/2001/XMLSchema-instance",
        "@xsi:nil": "true"
      }
    }
  },
  "seanceDiscussion": "RUANR5L15S2018IDS21137",
  "sort": {
    "dateSaisie": "2018-06-08T12:08:51.000+02:00",
    "sortEnSeance": "Adopté"
  },
  "dateDepot": "2018-06-08T02:00:00.000+02:00",
  "dateDistribution": "2018-06-08T02:00:00.000+02:00",
  "article99": "0",
  "loiReference": {
    "codeLoi": {
      "@xmlns:xsi": "http://www.w3.org/2001/XMLSchema-instance",
      "@xsi:nil": "true"
    },
    "divisionCodeLoi": {
      "@xmlns:xsi": "http://www.w3.org/2001/XMLSchema-instance",
      "@xsi:nil": "true"
    }
  }
}