{
  "@xmlns": "http://schemas.assemblee-nationale.fr/referentiel",
  "uid": "AMANR5L15SEA717460BTC1173P0D1N201",
  "identifiant": {
    "legislature": "15",
    "numero": "201",
    "numRect": "0",
    "saisine": {
      "refTexteLegislatif": "PRJLANR5L15BTC1173",
      "numeroPartiePLF": "0",
      "organeExamen": "PO717460",
      "mentionSecondeDeliberation": "0"
    }
  },
  "numeroLong": "201",
  "etapeTexte": "Nouvelle Lecture",
  "triAmendement": "ck",
  "cardinaliteAmdtMultiples": "1",
  "amendementParent": {
    "@xmlns:xsi": "http://www.w3.org/2001/XMLSchema-instance",
    "@xsi:nil": "true"
  },
  "etat": "Discuté",
  "signataires": {
    "auteur": {
      "typeAuteur": "Depute",
      "acteurRef": "PA720996",
      "organeRef": {
        "@xmlns:xsi": "http://www.w3.org/2001/XMLSchema-instance",
        "@xsi:nil": "true"
      },
      "groupePolitiqueRef": "PO723569"
    },
    "cosignataires": {
      "acteurRef": "PA720996"
    },
    "texteAffichable": "M.&#160;El Guerrab"
  },
  "pointeurFragmentTexte": {
    "missionVisee": {
      "@xmlns:xsi": "http://www.w3.org/2001/XMLSchema-instance",
      "@xsi:nil": "true"
    },
    "division": {
      "titre": "Article 19 ter",
      "articleDesignationCourte": "ART. 19 TER",
      "type": "ARTICLE",
      "avant_A_Apres": "A",
      "divisionRattachee": "ARTICLE 19 TER",
      "articleAdditionnel": {
        "@xmlns:xsi": "http://www.w3.org/2001/XMLSchema-instance",
        "@xsi:nil": "true"
      },
      "chapitreAdditionnel": {
        "@xmlns:xsi": "http://www.w3.org/2001/XMLSchema-instance",
        "@xsi:nil": "true"
      },
      "urlDivisionTexteVise": "/15/textes/1173.asp#D_Article_19_ter"
    },
    "alinea": {
      "avant_A_Apres": "A",
      "numero": "4",
      "alineaDesignation": "Alinéa 4"
    }
  },
  "corps": {
    "dispositif": "<p style=\"text-align: justify;\">Apr&#232;s le mot&#160;:</p><p style=\"text-align: justify;\">&#171;&#160;reproch&#233;&#160;&#187;</p><p style=\"text-align: justify;\">r&#233;diger ainsi la fin de l&#8217;alin&#233;a&#160;4&#160;:</p><p style=\"text-align: justify;\">&#171;&#160;est accompli sans but lucratif ou n&#8217;a donn&#233; lieu &#224; aucune contrepartie directe ou indirecte, et consistait &#224; fournir des conseils et de l&#8217;accompagnement, notamment juridiques, linguistiques ou sociaux, ou des prestations de restauration, d&#8217;h&#233;bergement ou de soins m&#233;dicaux destin&#233;es &#224; assurer des conditions de vie dignes et d&#233;centes &#224; l&#8217;&#233;tranger, ou bien toute autre aide visant &#224; pr&#233;server la dignit&#233; ou l&#8217;int&#233;grit&#233; physique de celui-ci, ou bien tout transport directement li&#233; &#224; l&#8217;une de ces exceptions.&#160;&#187;</p>",
    "exposeSommaire": "<p style=\"text-align: justify;\">Par le biais de cet amendement, il s&#8217;agit d&#8217;abroger le d&#233;lit de solidarit&#233;, dont on sait ce que le Conseil constitutionnel a fait au d&#233;but de ce mois de juillet... Avec cet amendement, il s&#8217;agit de prot&#233;ger l&#8217;aide apport&#233;e &#224; un &#233;tranger sans but lucratif. Cela ferait utilement &#233;cho au principe de constitutionnel de fraternit&#233;, r&#233;cemment r&#233;v&#233;l&#233; par le Conseil constitutionnel.</p>",
    "annexeExposeSommaire": {
      "@xmlns:xsi": "http://www.w3.org/2001/XMLSchema-instance",
      "@xsi:nil": "true"
    }
  },
  "representations": {
    "representation": {
      "nom": "PDF",
      "typeMime": {
        "type": "application",
        "subType": "PDF"
      },
      "statutRepresentation": {
        "verbatim": "true",
        "canonique": "true",
        "officielle": "true",
        "transcription": "false",
        "enregistrement": "false"
      },
      "repSource": {
        "@xmlns:xsi": "http://www.w3.org/2001/XMLSchema-instance",
        "@xsi:nil": "true"
      },
      "offset": {
        "@xmlns:xsi": "http://www.w3.org/2001/XMLSchema-instance",
        "@xsi:nil": "true"
      },
      "contenu": {
        "documentURI": "/15/amendements/1173/AN/201.pdf"
      },
      "dateDispoRepresentation": {
        "@xmlns:xsi": "http://www.w3.org/2001/XMLSchema-instance",
        "@xsi:nil": "true"
      }
    }
  },
  "seanceDiscussion": "RUANR5L15S2018IDS21205",
  "sort": {
    "dateSaisie": "2018-07-26T22:50:36.000+02:00",
    "sortEnSeance": "Non soutenu"
  },
  "dateDepot": "2018-07-20T02:00:00.000+02:00",
  "dateDistribution": "2018-07-23T02:00:00.000+02:00",
  "article99": "0",
  "loiReference": {
    "codeLoi": {
      "@xmlns:xsi": "http://www.w3.org/2001/XMLSchema-instance",
      "@xsi:nil": "true"
    },
    "divisionCodeLoi": {
      "@xmlns:xsi": "http://www.w3.org/2001/XMLSchema-instance",
      "@xsi:nil": "true"
    }
  }
}