{
  "@xmlns": "http://schemas.assemblee-nationale.fr/referentiel",
  "uid": "AMANR5L15PO59048B0235P2D1N529",
  "identifiant": {
    "legislature": "15",
    "numero": "529",
    "numRect": "0",
    "saisine": {
      "refTexteLegislatif": "PRJLANR5L15B0235",
      "numeroPartiePLF": "2",
      "organeExamen": "PO59048",
      "mentionSecondeDeliberation": "0"
    }
  },
  "numeroLong": "II-CF529",
  "etapeTexte": "1ère lecture (1ère assemblée saisie)",
  "triAmendement": "vzzy",
  "cardinaliteAmdtMultiples": "1",
  "amendementParent": {
    "@xmlns:xsi": "http://www.w3.org/2001/XMLSchema-instance",
    "@xsi:nil": "true"
  },
  "etat": "Irrecevable",
  "signataires": {
    "auteur": {
      "typeAuteur": "Depute",
      "acteurRef": "PA720598",
      "organeRef": {
        "@xmlns:xsi": "http://www.w3.org/2001/XMLSchema-instance",
        "@xsi:nil": "true"
      },
      "groupePolitiqueRef": "PO730970"
    },
    "cosignataires": {
      "acteurRef": [
        "PA720002",
        "PA720598",
        "PA720728",
        "PA721608",
        "PA721836",
        "PA718978",
        "PA721418"
      ]
    },
    "texteAffichable": "Mme&#160;Deprez-Audebert,  M.&#160;Barrot, M.&#160;Bourlanges, Mme&#160;El Ha&#239;ry, M.&#160;Laqhila, M.&#160;Mattei et M.&#160;Mignola"
  },
  "pointeurFragmentTexte": {
    "missionVisee": {
      "@xmlns:xsi": "http://www.w3.org/2001/XMLSchema-instance",
      "@xsi:nil": "true"
    },
    "division": {
      "titre": "Article 45",
      "articleDesignationCourte": "APRÈS ART. 45",
      "type": "ARTICLE",
      "avant_A_Apres": "Après",
      "divisionRattachee": "APRÈS L'ARTICLE 45, insérer l'article suivant:",
      "articleAdditionnel": "1",
      "chapitreAdditionnel": {
        "@xmlns:xsi": "http://www.w3.org/2001/XMLSchema-instance",
        "@xsi:nil": "true"
      },
      "urlDivisionTexteVise": "/15/textes/0235C.asp#D_Article_45"
    },
    "alinea": {
      "@xmlns:xsi": "http://www.w3.org/2001/XMLSchema-instance",
      "@xsi:nil": "true"
    }
  },
  "corps": {
    "dispositif": "<p>L'article L. 133-17 du code du tourisme est compl&#233;t&#233; par l'alin&#233;a suivant :</p><p>\"Par exception au 2&#176; et 3&#176; du pr&#233;sent article et &#224; condition qu'un dossier de demande de classement formul&#233;e au sens de l'article L. 133-13 du code de tourisme ait &#233;t&#233; d&#233;pos&#233; et d&#233;clar&#233; complet par la pr&#233;fecture au plus tard au 31 d&#233;cembre 2017, les classements ant&#233;rieurs continuent de produire leurs effets jusqu'&#224; la d&#233;cision d'approbation ou de refus de la demande de classement.\"</p>",
    "exposeSommaire": "<p>Cet amendement tend &#224; permettre aux communes ayant initi&#233; une d&#233;marche de classement par le d&#233;p&#244;t d'un dossier r&#233;put&#233; complet par la pr&#233;fecture de ne pas &#234;tre p&#233;nalis&#233;s par la date butoir du 1er janvier 2018.</p><p>En effet l'article L. 133-17 du code du tourisme pr&#233;voit que les anciens classements des stations, intervenus avant l'entr&#233;e en vigueur de la loi 2006-437 du 14 avril 2006, cessent de produire leurs effets le 1er janvier 2018.</p><p>Certaines communes seraient alors susceptibles de perdre leur statut malgr&#233; des d&#233;marches de classement anticip&#233;es avant le 1er janvier 2018. L'amendement permettra d'instruire l'ensemble des communes ayant d&#233;pos&#233; un dossier complet au plus tard le 31 d&#233;cembre 2017 sans cr&#233;er d'in&#233;galit&#233;s entre ces m&#234;mes communes.</p>",
    "annexeExposeSommaire": {
      "@xmlns:xsi": "http://www.w3.org/2001/XMLSchema-instance",
      "@xsi:nil": "true"
    }
  },
  "representations": {
    "representation": {
      "nom": "PDF",
      "typeMime": {
        "type": "application",
        "subType": "PDF"
      },
      "statutRepresentation": {
        "verbatim": "true",
        "canonique": "true",
        "officielle": "true",
        "transcription": "false",
        "enregistrement": "false"
      },
      "repSource": {
        "@xmlns:xsi": "http://www.w3.org/2001/XMLSchema-instance",
        "@xsi:nil": "true"
      },
      "offset": {
        "@xmlns:xsi": "http://www.w3.org/2001/XMLSchema-instance",
        "@xsi:nil": "true"
      },
      "contenu": {
        "documentURI": "/15/amendements/0235C/CION_TOUTE/CF529.pdf"
      },
      "dateDispoRepresentation": {
        "@xmlns:xsi": "http://www.w3.org/2001/XMLSchema-instance",
        "@xsi:nil": "true"
      }
    }
  },
  "seanceDiscussion": {
    "@xmlns:xsi": "http://www.w3.org/2001/XMLSchema-instance",
    "@xsi:nil": "true"
  },
  "sort": {
    "@xmlns:xsi": "http://www.w3.org/2001/XMLSchema-instance",
    "@xsi:nil": "true"
  },
  "dateDepot": "2017-11-06T01:00:00.000+01:00",
  "dateDistribution": {
    "@xmlns:xsi": "http://www.w3.org/2001/XMLSchema-instance",
    "@xsi:nil": "true"
  },
  "article99": "0",
  "loiReference": {
    "codeLoi": {
      "@xmlns:xsi": "http://www.w3.org/2001/XMLSchema-instance",
      "@xsi:nil": "true"
    },
    "divisionCodeLoi": {
      "@xmlns:xsi": "http://www.w3.org/2001/XMLSchema-instance",
      "@xsi:nil": "true"
    }
  }
}