{
  "@xmlns": "http://schemas.assemblee-nationale.fr/referentiel",
  "uid": "AMANR5L15SEA717460BTC0971P0D1N916",
  "identifiant": {
    "legislature": "15",
    "numero": "916",
    "numRect": "0",
    "saisine": {
      "refTexteLegislatif": "PRJLANR5L15BTC0971",
      "numeroPartiePLF": "0",
      "organeExamen": "PO717460",
      "mentionSecondeDeliberation": "0"
    }
  },
  "numeroLong": "916",
  "etapeTexte": "1ère lecture (1ère assemblée saisie)",
  "triAmendement": "afvhzzzvzhxv",
  "cardinaliteAmdtMultiples": "1",
  "amendementParent": {
    "@xmlns:xsi": "http://www.w3.org/2001/XMLSchema-instance",
    "@xsi:nil": "true"
  },
  "etat": "Discuté",
  "signataires": {
    "auteur": {
      "typeAuteur": "Depute",
      "acteurRef": "PA642847",
      "organeRef": {
        "@xmlns:xsi": "http://www.w3.org/2001/XMLSchema-instance",
        "@xsi:nil": "true"
      },
      "groupePolitiqueRef": "PO730934"
    },
    "cosignataires": {
      "acteurRef": "PA642847"
    },
    "texteAffichable": "M.&#160;Bazin"
  },
  "pointeurFragmentTexte": {
    "missionVisee": {
      "@xmlns:xsi": "http://www.w3.org/2001/XMLSchema-instance",
      "@xsi:nil": "true"
    },
    "division": {
      "titre": "Article 28",
      "articleDesignationCourte": "ART. 28",
      "type": "ARTICLE",
      "avant_A_Apres": "A",
      "divisionRattachee": "ARTICLE 28",
      "articleAdditionnel": {
        "@xmlns:xsi": "http://www.w3.org/2001/XMLSchema-instance",
        "@xsi:nil": "true"
      },
      "chapitreAdditionnel": {
        "@xmlns:xsi": "http://www.w3.org/2001/XMLSchema-instance",
        "@xsi:nil": "true"
      },
      "urlDivisionTexteVise": "/15/textes/0971.asp#D_Article_28"
    },
    "alinea": {
      "avant_A_Apres": "A",
      "numero": "19",
      "alineaDesignation": "Alinéa 19"
    }
  },
  "corps": {
    "dispositif": "<p style=\"text-align: justify;\">&#192; l&#8217;alin&#233;a&#160;19, supprimer les mots&#160;:</p><p style=\"text-align: justify;\">&#171;&#160;Cr&#233;er une filiale pour&#160;&#187;.</p>",
    "exposeSommaire": "<p style=\"text-align: justify;\">Cr&#233;er des filiales pour r&#233;aliser les missions d&#233;crites dans ces dispositions alourdit la fourniture des services et emp&#234;che les organismes d&#8217;&#234;tre efficaces et r&#233;actifs en la mati&#232;re alors que les organismes d&#8217;HLM doivent faire preuve d&#8217;agilit&#233; pour &#234;tre efficients.</p><p style=\"text-align: justify;\">Subsidiairement, si le modus operandi de filialisation avait &#233;t&#233; choisi pour &#233;tanch&#233;ifier les activit&#233;s de service d&#8217;int&#233;r&#234;t &#233;conomique g&#233;n&#233;ral&#160;(SIEG) des activit&#233;s hors SIEG, il est &#224; noter qu&#8217;une comptabilit&#233; analytique orient&#233;e vers cet objectif remplit le but escompt&#233;, d&#8217;autant plus que l&#8217;article&#160;28 dans son septi&#232;me alin&#233;a introduit une obligation de comptabilisation distincte du r&#233;sultat de l&#8217;activit&#233; relevant de la gestion de services d&#8217;int&#233;r&#234;t &#233;conomique g&#233;n&#233;ral.</p>",
    "annexeExposeSommaire": {
      "@xmlns:xsi": "http://www.w3.org/2001/XMLSchema-instance",
      "@xsi:nil": "true"
    }
  },
  "representations": {
    "representation": {
      "nom": "PDF",
      "typeMime": {
        "type": "application",
        "subType": "PDF"
      },
      "statutRepresentation": {
        "verbatim": "true",
        "canonique": "true",
        "officielle": "true",
        "transcription": "false",
        "enregistrement": "false"
      },
      "repSource": {
        "@xmlns:xsi": "http://www.w3.org/2001/XMLSchema-instance",
        "@xsi:nil": "true"
      },
      "offset": {
        "@xmlns:xsi": "http://www.w3.org/2001/XMLSchema-instance",
        "@xsi:nil": "true"
      },
      "contenu": {
        "documentURI": "/15/amendements/0971/AN/916.pdf"
      },
      "dateDispoRepresentation": {
        "@xmlns:xsi": "http://www.w3.org/2001/XMLSchema-instance",
        "@xsi:nil": "true"
      }
    }
  },
  "seanceDiscussion": "RUANR5L15S2018IDS21114",
  "sort": {
    "dateSaisie": "2018-06-02T18:37:51.000+02:00",
    "sortEnSeance": "Retiré"
  },
  "dateDepot": "2018-05-24T02:00:00.000+02:00",
  "dateDistribution": "2018-05-30T02:00:00.000+02:00",
  "article99": "0",
  "loiReference": {
    "codeLoi": {
      "@xmlns:xsi": "http://www.w3.org/2001/XMLSchema-instance",
      "@xsi:nil": "true"
    },
    "divisionCodeLoi": {
      "@xmlns:xsi": "http://www.w3.org/2001/XMLSchema-instance",
      "@xsi:nil": "true"
    }
  }
}