{
  "@xmlns": "http://schemas.assemblee-nationale.fr/referentiel",
  "uid": "AMANR5L15SEA717460BTC1761P0D1N803",
  "identifiant": {
    "legislature": "15",
    "numero": "803",
    "numRect": "0",
    "saisine": {
      "refTexteLegislatif": "PRJLANR5L15BTC1761",
      "numeroPartiePLF": "0",
      "organeExamen": "PO717460",
      "mentionSecondeDeliberation": "0"
    }
  },
  "numeroLong": "803",
  "etapeTexte": "Nouvelle Lecture",
  "triAmendement": "igaaaaaaaaaaaaaaaaaaaaaaaaaaaaaaaaaaaaaaaaaaaaaaaajdu",
  "cardinaliteAmdtMultiples": "1",
  "amendementParent": {
    "@xmlns:xsi": "http://www.w3.org/2001/XMLSchema-instance",
    "@xsi:nil": "true"
  },
  "etat": "Discuté",
  "signataires": {
    "auteur": {
      "typeAuteur": "Depute",
      "acteurRef": "PA721932",
      "organeRef": {
        "@xmlns:xsi": "http://www.w3.org/2001/XMLSchema-instance",
        "@xsi:nil": "true"
      },
      "groupePolitiqueRef": "PO723569"
    },
    "cosignataires": {
      "acteurRef": "PA721932"
    },
    "texteAffichable": "Mme&#160;Lorho"
  },
  "pointeurFragmentTexte": {
    "missionVisee": {
      "@xmlns:xsi": "http://www.w3.org/2001/XMLSchema-instance",
      "@xsi:nil": "true"
    },
    "division": {
      "titre": "Article 42 quater",
      "articleDesignationCourte": "ART. 42 QUATER",
      "type": "ARTICLE",
      "avant_A_Apres": "A",
      "divisionRattachee": "ARTICLE 42 QUATER",
      "articleAdditionnel": {
        "@xmlns:xsi": "http://www.w3.org/2001/XMLSchema-instance",
        "@xsi:nil": "true"
      },
      "chapitreAdditionnel": {
        "@xmlns:xsi": "http://www.w3.org/2001/XMLSchema-instance",
        "@xsi:nil": "true"
      },
      "urlDivisionTexteVise": "/15/textes/1761.asp#D_Article_42_quater"
    },
    "alinea": {
      "@xmlns:xsi": "http://www.w3.org/2001/XMLSchema-instance",
      "@xsi:nil": "true"
    }
  },
  "corps": {
    "dispositif": "<p style=\"text-align: justify;\">R&#233;tablir cet article dans la r&#233;daction suivante&#160;:</p><p style=\"text-align: justify;\">&#171;&#160;L&#8217;article L.&#160;422&#8209;11 du code de la propri&#233;t&#233; intellectuelle est ainsi modifi&#233;&#160;:</p><p style=\"text-align: justify;\">&#171;&#160;1&#176;&#160;&#192; la seconde phrase, apr&#232;s le mot&#160;: &#171;&#160;avocat,&#160;&#187;, sont ins&#233;r&#233;s les mots&#160;: &#171;&#160;&#224; l&#8217;exception pour ces deux&#160;derni&#232;res de celles portant la mention&#160;&#187;officielle&#171;&#160;,&#160;&#187;&#160;;</p><p style=\"text-align: justify;\">&#171;&#160;2&#176;&#160;Il est ajout&#233; un alin&#233;a ainsi r&#233;dig&#233;&#160;:</p><p style=\"text-align: justify;\">&#171;&#160;Lorsque le pr&#233;sent article s&#8217;applique &#224; une correspondance professionnelle &#233;chang&#233;e entre un conseil en propri&#233;t&#233; industrielle et un avocat, ce dernier est tenu vis-&#224;-vis de cette correspondance aux m&#234;mes obligations que celles que l&#8217;article&#160;66&#8209;5 de la loi&#160;n&#176;&#160;71&#8209;1130 du&#160;31&#160;d&#233;cembre&#160;1971 portant r&#233;forme de certaines professions judiciaires et juridiques lui impose en mati&#232;re de secret des correspondances professionnelles&#160;&#187;.</p>",
    "exposeSommaire": "<p style=\"text-align: justify;\">Cet amendement a pour but de r&#233;tablir l&#8217;article&#160;42 <i>quater</i> adopt&#233; au S&#233;nat.</p><p style=\"text-align: justify;\">Il s&#8217;agit d&#8217;un amendement clarification qui vise &#224; faire respecter l&#8217;&#233;galit&#233; de traitement entre le CPI et l&#8217;avocat lorsque ces deux professionnels sont en relation &#233;pistolaire dans le cadre du traitement d&#8217;un dossier au profit de leurs clients respectifs.</p><p style=\"text-align: justify;\">L&#8217;adoption de cet amendement viendrait simplement confirmer la jurisprudence de la Cour d&#8217;appel de Paris selon laquelle &#171;&#160;pr&#233;tendre que d&#232;s lors que l&#8217;avocat n&#8217;est pas de son c&#244;t&#233; tenu au secret &#233;dict&#233; par cet article (L.&#160;422&#8209;11 CPI), il lui serait loisible de divulguer une correspondance qui lui a &#233;t&#233; adress&#233;e sous couvert de confidentialit&#233;, revient &#224; vider de sa finalit&#233; ce secret destin&#233; &#224; prot&#233;ger les int&#233;r&#234;ts du client concern&#233;&#160;&#187; (CA Paris, p&#244;le 1, 3eme chambre, 24 novembre 2015, RG 2014/16359).</p>",
    "annexeExposeSommaire": {
      "@xmlns:xsi": "http://www.w3.org/2001/XMLSchema-instance",
      "@xsi:nil": "true"
    },
    "cartoucheDelaiDepotDepasse": {
      "@xmlns:xsi": "http://www.w3.org/2001/XMLSchema-instance",
      "@xsi:nil": "true"
    }
  },
  "representations": {
    "representation": {
      "nom": "PDF",
      "typeMime": {
        "type": "application",
        "subType": "PDF"
      },
      "statutRepresentation": {
        "verbatim": "true",
        "canonique": "true",
        "officielle": "true",
        "transcription": "false",
        "enregistrement": "false"
      },
      "repSource": {
        "@xmlns:xsi": "http://www.w3.org/2001/XMLSchema-instance",
        "@xsi:nil": "true"
      },
      "offset": {
        "@xmlns:xsi": "http://www.w3.org/2001/XMLSchema-instance",
        "@xsi:nil": "true"
      },
      "contenu": {
        "documentURI": "/15/amendements/1761/AN/803.pdf"
      },
      "dateDispoRepresentation": {
        "@xmlns:xsi": "http://www.w3.org/2001/XMLSchema-instance",
        "@xsi:nil": "true"
      }
    }
  },
  "seanceDiscussion": "RUANR5L15S2019IDS21553",
  "sort": {
    "dateSaisie": "2019-03-16T00:45:54.000+01:00",
    "sortEnSeance": "Non soutenu"
  },
  "dateDepot": "2019-03-11T01:00:00.000+01:00",
  "dateDistribution": "2019-03-12T01:00:00.000+01:00",
  "article99": "0",
  "loiReference": {
    "codeLoi": {
      "@xmlns:xsi": "http://www.w3.org/2001/XMLSchema-instance",
      "@xsi:nil": "true"
    },
    "divisionCodeLoi": {
      "@xmlns:xsi": "http://www.w3.org/2001/XMLSchema-instance",
      "@xsi:nil": "true"
    }
  }
}