{
  "@xmlns": "http://schemas.assemblee-nationale.fr/referentiel",
  "uid": "AMANR5L15SEA717460BTC0995P0D1N25",
  "identifiant": {
    "legislature": "15",
    "numero": "25",
    "numRect": "0",
    "saisine": {
      "refTexteLegislatif": "PIONANR5L15BTC0995",
      "numeroPartiePLF": "0",
      "organeExamen": "PO717460",
      "mentionSecondeDeliberation": "0"
    }
  },
  "numeroLong": "25",
  "etapeTexte": "1ère lecture (1ère assemblée saisie)",
  "triAmendement": "w",
  "cardinaliteAmdtMultiples": "1",
  "amendementParent": {
    "@xmlns:xsi": "http://www.w3.org/2001/XMLSchema-instance",
    "@xsi:nil": "true"
  },
  "etat": "Discuté",
  "signataires": {
    "auteur": {
      "typeAuteur": "Depute",
      "acteurRef": "PA340343",
      "organeRef": {
        "@xmlns:xsi": "http://www.w3.org/2001/XMLSchema-instance",
        "@xsi:nil": "true"
      },
      "groupePolitiqueRef": "PO730946"
    },
    "cosignataires": {
      "acteurRef": [
        "PA332614",
        "PA342415",
        "PA605069",
        "PA340357",
        "PA1592",
        "PA340343",
        "PA429893",
        "PA588886",
        "PA405480",
        "PA267233",
        "PA609590",
        "PA610681",
        "PA1198",
        "PA337483",
        "PA609332",
        "PA607553",
        "PA508",
        "PA1008",
        "PA608011",
        "PA643145",
        "PA608172",
        "PA719930",
        "PA333285",
        "PA642764",
        "PA335532",
        "PA608695",
        "PA335054",
        "PA1809",
        "PA720988",
        "PA333818"
      ]
    },
    "texteAffichable": "M.&#160;Saulignac,  M.&#160;Faure, Mme&#160;Untermaier, Mme&#160;Karamanli, M.&#160;David&#160;Habib, M.&#160;Aviragnet, Mme&#160;Bareigts, Mme&#160;Battistel, Mme&#160;Bi&#233;mouret, M.&#160;Bouillon, M.&#160;Jean-Louis&#160;Bricout, M.&#160;Carvounas, M.&#160;Alain&#160;David, Mme&#160;Laurence&#160;Dumont, M.&#160;Garot, M.&#160;Hutin, M.&#160;Juanico, M.&#160;J&#233;r&#244;me&#160;Lambert, M.&#160;Le Foll, M.&#160;Letchimy, Mme&#160;Manin, Mme&#160;Pau-Langevin, Mme&#160;Pires Beaune, M.&#160;Potier, M.&#160;Pueyo, M.&#160;Pupponi, Mme&#160;Rabault, Mme&#160;Vainqueur-Christophe, M.&#160;Vallaud, Mme&#160;Victory et les membres du groupe Nouvelle Gauche"
  },
  "pointeurFragmentTexte": {
    "missionVisee": {
      "@xmlns:xsi": "http://www.w3.org/2001/XMLSchema-instance",
      "@xsi:nil": "true"
    },
    "division": {
      "titre": "Article unique",
      "articleDesignationCourte": "APRÈS ART. UNIQUE",
      "type": "ARTICLE",
      "avant_A_Apres": "Après",
      "divisionRattachee": "APRÈS L'ARTICLE UNIQUE, insérer l'article suivant:",
      "articleAdditionnel": "1",
      "chapitreAdditionnel": {
        "@xmlns:xsi": "http://www.w3.org/2001/XMLSchema-instance",
        "@xsi:nil": "true"
      },
      "urlDivisionTexteVise": "/15/textes/0995.asp#D_Article_unique"
    },
    "alinea": {
      "@xmlns:xsi": "http://www.w3.org/2001/XMLSchema-instance",
      "@xsi:nil": "true"
    }
  },
  "corps": {
    "dispositif": "<p style=\"text-align: justify;\">Dans un d&#233;lai de six mois suivant la promulgation de la pr&#233;sente loi, le Gouvernement remet au Parlement un rapport sur l&#8217;opportunit&#233; d&#8217;int&#233;grer la conduite d&#8217;engins motoris&#233;s &#224; vocation ludique et sportive non homologu&#233;s dans le champ des infractions routi&#232;res pouvant &#234;tre constat&#233;es sans interception gr&#226;ce &#224; la vid&#233;o-verbalisation, comme le pr&#233;voit l&#8217;article L.&#160;130&#8209;9 du code de la route.</p>",
    "exposeSommaire": "<p style=\"text-align: justify;\">Selon les statistiques du minist&#232;re de l&#8217;Int&#233;rieur, plus de 8 700 interventions pour des rod&#233;os motoris&#233;s ont &#233;t&#233; men&#233;es par les forces de l&#8217;ordre en 2017, soit une augmentation de 20&#160;% par rapport &#224; 2016.</p><p style=\"text-align: justify;\">Pour autant, le travail des forces de l&#8217;ordre est rendu compliqu&#233; par l&#8217;impossibilit&#233; selon les cas de proc&#233;der &#224; des interpellations en flagrance, afin de ne pas mettre en jeu la s&#233;curit&#233; du conducteur ou d&#8217;autres personnes sur la voie publique. Pouvoir verbaliser celui-ci apr&#232;s la constatation des faits gr&#226;ce &#224; la vid&#233;o r&#233;pondrait en grande partie &#224; cette difficult&#233; et au sentiment d&#8217;impunit&#233; dont se pr&#233;valent certains.</p><p style=\"text-align: justify;\">Le pr&#233;sent amendement demande par cons&#233;quent au gouvernement un rapport sur la possibilit&#233; d&#8217;int&#233;grer la conduite d&#8217;engins motoris&#233;s &#224; vocation ludique et sportive non homologu&#233;s dans le champ des infractions routi&#232;res pouvant &#234;tre constat&#233;es sans interception gr&#226;ce &#224; la vid&#233;o-verbalisation, comme le pr&#233;voit l&#8217;article L130&#8209;9 du Code de la route.</p><p style=\"text-align: justify;\">Cette solution pourrait apporter une r&#233;ponse efficace &#224; un probl&#232;me bien r&#233;el, l&#224; o&#249; cette proposition de loi ne r&#232;gle aucunement la principale difficult&#233;, celle de la dangerosit&#233; des courses poursuites afin de faire cesser des infractions qui sont d&#233;j&#224; consacr&#233;es par le Code de la route.</p>",
    "annexeExposeSommaire": {
      "@xmlns:xsi": "http://www.w3.org/2001/XMLSchema-instance",
      "@xsi:nil": "true"
    }
  },
  "representations": {
    "representation": {
      "nom": "PDF",
      "typeMime": {
        "type": "application",
        "subType": "PDF"
      },
      "statutRepresentation": {
        "verbatim": "true",
        "canonique": "true",
        "officielle": "true",
        "transcription": "false",
        "enregistrement": "false"
      },
      "repSource": {
        "@xmlns:xsi": "http://www.w3.org/2001/XMLSchema-instance",
        "@xsi:nil": "true"
      },
      "offset": {
        "@xmlns:xsi": "http://www.w3.org/2001/XMLSchema-instance",
        "@xsi:nil": "true"
      },
      "contenu": {
        "documentURI": "/15/amendements/0995/AN/25.pdf"
      },
      "dateDispoRepresentation": {
        "@xmlns:xsi": "http://www.w3.org/2001/XMLSchema-instance",
        "@xsi:nil": "true"
      }
    }
  },
  "seanceDiscussion": "RUANR5L15S2018IDS21153",
  "sort": {
    "dateSaisie": "2018-07-04T19:04:25.000+02:00",
    "sortEnSeance": "Rejeté"
  },
  "dateDepot": "2018-06-04T02:00:00.000+02:00",
  "dateDistribution": "2018-06-05T02:00:00.000+02:00",
  "article99": "0",
  "loiReference": {
    "codeLoi": {
      "@xmlns:xsi": "http://www.w3.org/2001/XMLSchema-instance",
      "@xsi:nil": "true"
    },
    "divisionCodeLoi": {
      "@xmlns:xsi": "http://www.w3.org/2001/XMLSchema-instance",
      "@xsi:nil": "true"
    }
  }
}