{
  "@xmlns": "http://schemas.assemblee-nationale.fr/referentiel",
  "uid": "AMANR5L15SEA717460BTC1173P0D1N435",
  "identifiant": {
    "legislature": "15",
    "numero": "435",
    "numRect": "0",
    "saisine": {
      "refTexteLegislatif": "PRJLANR5L15BTC1173",
      "numeroPartiePLF": "0",
      "organeExamen": "PO717460",
      "mentionSecondeDeliberation": "0"
    }
  },
  "numeroLong": "435",
  "etapeTexte": "Nouvelle Lecture",
  "triAmendement": "ai",
  "cardinaliteAmdtMultiples": "1",
  "amendementParent": {
    "@xmlns:xsi": "http://www.w3.org/2001/XMLSchema-instance",
    "@xsi:nil": "true"
  },
  "etat": "Discuté",
  "signataires": {
    "auteur": {
      "typeAuteur": "Depute",
      "acteurRef": "PA719608",
      "organeRef": {
        "@xmlns:xsi": "http://www.w3.org/2001/XMLSchema-instance",
        "@xsi:nil": "true"
      },
      "groupePolitiqueRef": "PO723569"
    },
    "cosignataires": {
      "acteurRef": "PA719608"
    },
    "texteAffichable": "Mme&#160;M&#233;nard"
  },
  "pointeurFragmentTexte": {
    "missionVisee": {
      "@xmlns:xsi": "http://www.w3.org/2001/XMLSchema-instance",
      "@xsi:nil": "true"
    },
    "division": {
      "titre": "Article PREMIER",
      "articleDesignationCourte": "ART. PREMIER",
      "type": "ARTICLE",
      "avant_A_Apres": "A",
      "divisionRattachee": "ARTICLE PREMIER",
      "articleAdditionnel": {
        "@xmlns:xsi": "http://www.w3.org/2001/XMLSchema-instance",
        "@xsi:nil": "true"
      },
      "chapitreAdditionnel": {
        "@xmlns:xsi": "http://www.w3.org/2001/XMLSchema-instance",
        "@xsi:nil": "true"
      },
      "urlDivisionTexteVise": "/15/textes/1173.asp#D_Article_1er"
    },
    "alinea": {
      "@xmlns:xsi": "http://www.w3.org/2001/XMLSchema-instance",
      "@xsi:nil": "true"
    }
  },
  "corps": {
    "dispositif": "<p style=\"text-align: justify;\">Substituer &#224; l&#8217;alin&#233;a&#160;2 les deux alin&#233;as suivants&#160;:</p><p style=\"text-align: justify;\">&#171;&#160;1&#176;&#160;A Le 10&#176; de l&#8217;article L.&#160;313&#8209;11 est compl&#233;t&#233; par une phrase ainsi r&#233;dig&#233;e&#160;: &#171;&#160;La carte de s&#233;jour est d&#233;livr&#233;e dans un d&#233;lai d&#8217;un mois &#224; compter de la notification de la d&#233;cision reconnaissant le statut d&#8217;apatride par l&#8217;Office fran&#231;ais de protection des r&#233;fugi&#233;s et apatrides ou la Cour nationale du droit d&#8217;asile.&#160;&#187;&#160;;</p><p style=\"text-align: justify;\">&#171;&#160;1&#176;&#160;L&#8217;article&#160;313&#8209;13 est abrog&#233;.&#160;&#187;</p><p style=\"text-align: justify;\">&#160;</p>",
    "exposeSommaire": "<p style=\"text-align: justify;\">L&#8217;article&#160;1 bis adopt&#233; par le S&#233;nat pr&#233;voit, d&#232;s lors que l&#8217;OFPRA a reconnu le statut d&#8217;apatride &#224; une personne, que celle-ci se voit d&#233;livrer un titre de s&#233;jour temporaire dans le mois qui suit.</p><p style=\"text-align: justify;\">En effet, d&#232;s lors qu&#8217;une personne est en droit d&#8217;obtenir un titre de s&#233;jour, cela doit se faire dans les plus brefs d&#233;lais. C&#8217;est l&#8217;objet de cet amendement.</p>",
    "annexeExposeSommaire": {
      "@xmlns:xsi": "http://www.w3.org/2001/XMLSchema-instance",
      "@xsi:nil": "true"
    }
  },
  "representations": {
    "representation": {
      "nom": "PDF",
      "typeMime": {
        "type": "application",
        "subType": "PDF"
      },
      "statutRepresentation": {
        "verbatim": "true",
        "canonique": "true",
        "officielle": "true",
        "transcription": "false",
        "enregistrement": "false"
      },
      "repSource": {
        "@xmlns:xsi": "http://www.w3.org/2001/XMLSchema-instance",
        "@xsi:nil": "true"
      },
      "offset": {
        "@xmlns:xsi": "http://www.w3.org/2001/XMLSchema-instance",
        "@xsi:nil": "true"
      },
      "contenu": {
        "documentURI": "/15/amendements/1173/AN/435.pdf"
      },
      "dateDispoRepresentation": {
        "@xmlns:xsi": "http://www.w3.org/2001/XMLSchema-instance",
        "@xsi:nil": "true"
      }
    }
  },
  "seanceDiscussion": "RUANR5L15S2018IDS21202",
  "sort": {
    "dateSaisie": "2018-07-26T00:48:25.000+02:00",
    "sortEnSeance": "Rejeté"
  },
  "dateDepot": "2018-07-20T02:00:00.000+02:00",
  "dateDistribution": "2018-07-23T02:00:00.000+02:00",
  "article99": "0",
  "loiReference": {
    "codeLoi": {
      "@xmlns:xsi": "http://www.w3.org/2001/XMLSchema-instance",
      "@xsi:nil": "true"
    },
    "divisionCodeLoi": {
      "@xmlns:xsi": "http://www.w3.org/2001/XMLSchema-instance",
      "@xsi:nil": "true"
    }
  }
}