{
  "@xmlns": "http://schemas.assemblee-nationale.fr/referentiel",
  "uid": "AMANR5L15SEA717460BTC1974P0D1N2349",
  "identifiant": {
    "legislature": "15",
    "numero": "2349",
    "numRect": "0",
    "saisine": {
      "refTexteLegislatif": "PRJLANR5L15BTC1974",
      "numeroPartiePLF": "0",
      "organeExamen": "PO717460",
      "mentionSecondeDeliberation": "0"
    }
  },
  "numeroLong": "2349",
  "etapeTexte": "1ère lecture (2ème assemblée saisie)",
  "triAmendement": "adcaaaaaaaaaaaaaaaaaaaaaaaaaaaaaaaaaaaaaaaaaaaaaaabxlpkkzx",
  "cardinaliteAmdtMultiples": "1",
  "amendementParent": {
    "@xmlns:xsi": "http://www.w3.org/2001/XMLSchema-instance",
    "@xsi:nil": "true"
  },
  "etat": "Discuté",
  "signataires": {
    "auteur": {
      "typeAuteur": "Depute",
      "acteurRef": "PA266788",
      "organeRef": {
        "@xmlns:xsi": "http://www.w3.org/2001/XMLSchema-instance",
        "@xsi:nil": "true"
      },
      "groupePolitiqueRef": "PO744425"
    },
    "cosignataires": {
      "acteurRef": [
        "PA267241",
        "PA266788"
      ]
    },
    "texteAffichable": "M.&#160;Morel-&#192;-L&apos;Huissier et M.&#160;Demilly"
  },
  "pointeurFragmentTexte": {
    "missionVisee": {
      "@xmlns:xsi": "http://www.w3.org/2001/XMLSchema-instance",
      "@xsi:nil": "true"
    },
    "division": {
      "titre": "Article PREMIER",
      "articleDesignationCourte": "ART. PREMIER",
      "type": "ARTICLE",
      "avant_A_Apres": "A",
      "divisionRattachee": "ARTICLE PREMIER",
      "articleAdditionnel": {
        "@xmlns:xsi": "http://www.w3.org/2001/XMLSchema-instance",
        "@xsi:nil": "true"
      },
      "chapitreAdditionnel": {
        "@xmlns:xsi": "http://www.w3.org/2001/XMLSchema-instance",
        "@xsi:nil": "true"
      },
      "urlDivisionTexteVise": "/15/textes/1974.asp#D_Article_1er"
    },
    "alinea": {
      "avant_A_Apres": "Apres",
      "numero": "93",
      "alineaDesignation": {
        "@xmlns:xsi": "http://www.w3.org/2001/XMLSchema-instance",
        "@xsi:nil": "true"
      }
    }
  },
  "corps": {
    "dispositif": "<p style=\"text-align: justify;\">Apr&#232;s l&#8217;alin&#233;a&#160;93, ins&#233;rer l&#8217;alin&#233;a suivant&#160;:</p><p style=\"text-align: justify;\">&#171;&#160;17&#176; <i><i>bis</i> </i>&#192; la fin de la premi&#232;re phrase du troisi&#232;me alin&#233;a du m&#234;me article L.&#160;3111&#8209;5, les mots&#160;: &#171;&#160;d&#8217;une &#233;ventuelle modification du p&#233;rim&#232;tre de l&#8217;assiette du versement transport&#160;&#187; sont remplac&#233;s par les mots&#160;: &#171;&#160;de la modification du p&#233;rim&#232;tre de l&#8217;assiette du versement mobilit&#233;, au taux maximum ou le cas &#233;chant au taux existant fix&#233; pr&#233;c&#233;demment par l&#8217;&#233;tablissement public de coop&#233;ration intercommunale &#224; fiscalit&#233; propre&#160;&#187;.</p>",
    "exposeSommaire": "<p style=\"text-align: justify;\">L&#8217;article L.&#160;3111&#8209;5 du code des transports pr&#233;voit qu&#8217;une convention entre les autorit&#233;s organisatrices concern&#233;es fixe les modalit&#233;s du transfert et les conditions de financement des services de transport non urbains transf&#233;r&#233;s, en tenant compte notamment d&#8217;une &#233;ventuelle modification du p&#233;rim&#232;tre de l&#8217;assiette du versement transport.</p><p style=\"text-align: justify;\">Cette r&#233;daction est impr&#233;cise. D&#8217;une part (ci-dessus), le terme &#171;&#160;&#233;ventualit&#233;&#160;&#187; doit &#234;tre pr&#233;cis&#233; comme un fait subordonn&#233; &#224; une d&#233;cision de l&#8217;autorit&#233; organisatrice, et doit en cons&#233;quence prendre compte le calcul de l&#8217;&#233;volution &#233;ventuelle du rendement du versement mobilit&#233;.</p>",
    "annexeExposeSommaire": {
      "@xmlns:xsi": "http://www.w3.org/2001/XMLSchema-instance",
      "@xsi:nil": "true"
    },
    "cartoucheDelaiDepotDepasse": {
      "@xmlns:xsi": "http://www.w3.org/2001/XMLSchema-instance",
      "@xsi:nil": "true"
    }
  },
  "representations": {
    "representation": {
      "nom": "PDF",
      "typeMime": {
        "type": "application",
        "subType": "PDF"
      },
      "statutRepresentation": {
        "verbatim": "true",
        "canonique": "true",
        "officielle": "true",
        "transcription": "false",
        "enregistrement": "false"
      },
      "repSource": {
        "@xmlns:xsi": "http://www.w3.org/2001/XMLSchema-instance",
        "@xsi:nil": "true"
      },
      "offset": {
        "@xmlns:xsi": "http://www.w3.org/2001/XMLSchema-instance",
        "@xsi:nil": "true"
      },
      "contenu": {
        "documentURI": "/15/amendements/1974/AN/2349.pdf"
      },
      "dateDispoRepresentation": {
        "@xmlns:xsi": "http://www.w3.org/2001/XMLSchema-instance",
        "@xsi:nil": "true"
      }
    }
  },
  "seanceDiscussion": "RUANR5L15S2019IDS21675",
  "sort": {
    "dateSaisie": "2019-06-04T18:37:05.000+02:00",
    "sortEnSeance": "Rejeté"
  },
  "dateDepot": "2019-05-29T02:00:00.000+02:00",
  "dateDistribution": "2019-06-01T02:00:00.000+02:00",
  "article99": "0",
  "loiReference": {
    "codeLoi": {
      "@xmlns:xsi": "http://www.w3.org/2001/XMLSchema-instance",
      "@xsi:nil": "true"
    },
    "divisionCodeLoi": {
      "@xmlns:xsi": "http://www.w3.org/2001/XMLSchema-instance",
      "@xsi:nil": "true"
    }
  }
}