{
  "@xmlns": "http://schemas.assemblee-nationale.fr/referentiel",
  "uid": "AMANR5L15PO419865B1831P0D1N171",
  "identifiant": {
    "legislature": "15",
    "numero": "171",
    "numRect": "0",
    "saisine": {
      "refTexteLegislatif": "PRJLANR5L15B1831",
      "numeroPartiePLF": "0",
      "organeExamen": "PO419865",
      "mentionSecondeDeliberation": "0"
    }
  },
  "numeroLong": "CD171",
  "etapeTexte": "1ère lecture (2ème assemblée saisie)",
  "triAmendement": "araaaaaaaaaaaaaaaaaaaaaaaaaaaaaaaaaaaaaaaaaaaaaaaagdxou",
  "cardinaliteAmdtMultiples": "1",
  "amendementParent": {
    "@xmlns:xsi": "http://www.w3.org/2001/XMLSchema-instance",
    "@xsi:nil": "true"
  },
  "etat": "Discuté",
  "signataires": {
    "auteur": {
      "typeAuteur": "Depute",
      "acteurRef": "PA266808",
      "organeRef": {
        "@xmlns:xsi": "http://www.w3.org/2001/XMLSchema-instance",
        "@xsi:nil": "true"
      },
      "groupePolitiqueRef": "PO730934"
    },
    "cosignataires": {
      "acteurRef": [
        "PA266808",
        "PA1029",
        "PA336316",
        "PA767",
        "PA712015",
        "PA1012"
      ]
    },
    "texteAffichable": "M.&#160;Rolland,  M.&#160;Cattin, M.&#160;Dive, M.&#160;Deflesselles, M.&#160;de la Verpilli&#232;re et M.&#160;Bouchet"
  },
  "pointeurFragmentTexte": {
    "missionVisee": {
      "@xmlns:xsi": "http://www.w3.org/2001/XMLSchema-instance",
      "@xsi:nil": "true"
    },
    "division": {
      "titre": "Article 5",
      "articleDesignationCourte": "ART. 5",
      "type": "ARTICLE",
      "avant_A_Apres": "A",
      "divisionRattachee": "ARTICLE 5",
      "articleAdditionnel": {
        "@xmlns:xsi": "http://www.w3.org/2001/XMLSchema-instance",
        "@xsi:nil": "true"
      },
      "chapitreAdditionnel": {
        "@xmlns:xsi": "http://www.w3.org/2001/XMLSchema-instance",
        "@xsi:nil": "true"
      },
      "urlDivisionTexteVise": "/15/textes/1831.asp#D_Article_5"
    },
    "alinea": {
      "avant_A_Apres": {
        "@xmlns:xsi": "http://www.w3.org/2001/XMLSchema-instance",
        "@xsi:nil": "true"
      },
      "numero": "58",
      "alineaDesignation": {
        "@xmlns:xsi": "http://www.w3.org/2001/XMLSchema-instance",
        "@xsi:nil": "true"
      }
    }
  },
  "corps": {
    "dispositif": "<p style=\"text-align: justify;\">Compl&#233;ter l&#8217;alin&#233;a&#160;58 par&#160;les mots&#160;:</p><p style=\"text-align: justify;\">&#171;&#160;ou de montagne&#160;&#187;.</p>",
    "exposeSommaire": "<p style=\"text-align: justify;\">Cet amendement compl&#232;te le titre de la section du code des transports relative aux plans de mobilit&#233; rurale pour y ajouter la notion de plan de mobilit&#233; de montagne. En effet la section en question reconna&#238;t l&#8217;existence de plan de mobilit&#233; de montagne l&#8217;article L.&#160;1214&#8209;36&#8209;1 en pr&#233;voyant une consultation sp&#233;cifique (celle du comit&#233;s de massif ) &#224; leur sujet (voir l&#8217;alin&#233;a&#160;64 de l&#8217;article&#160;5).</p><p style=\"text-align: justify;\">L&#8217;affichage de la distinction a son importance car les territoires de montagne concern&#233;s ne sont pas forc&#233;ment ruraux (probl&#233;matique d&#8217;acc&#232;s aux stations de sports d&#8217;hiver par exemple), et ces plans peuvent avoir des contenus sp&#233;cifiques (saisonnalit&#233;, fermetures de cols, d&#233;neigement&#8230;).</p>",
    "annexeExposeSommaire": {
      "@xmlns:xsi": "http://www.w3.org/2001/XMLSchema-instance",
      "@xsi:nil": "true"
    },
    "cartoucheDelaiDepotDepasse": {
      "@xmlns:xsi": "http://www.w3.org/2001/XMLSchema-instance",
      "@xsi:nil": "true"
    }
  },
  "representations": {
    "representation": {
      "nom": "PDF",
      "typeMime": {
        "type": "application",
        "subType": "PDF"
      },
      "statutRepresentation": {
        "verbatim": "true",
        "canonique": "true",
        "officielle": "true",
        "transcription": "false",
        "enregistrement": "false"
      },
      "repSource": {
        "@xmlns:xsi": "http://www.w3.org/2001/XMLSchema-instance",
        "@xsi:nil": "true"
      },
      "offset": {
        "@xmlns:xsi": "http://www.w3.org/2001/XMLSchema-instance",
        "@xsi:nil": "true"
      },
      "contenu": {
        "documentURI": "/15/amendements/1831/CION-DVP/CD171.pdf"
      },
      "dateDispoRepresentation": {
        "@xmlns:xsi": "http://www.w3.org/2001/XMLSchema-instance",
        "@xsi:nil": "true"
      }
    }
  },
  "seanceDiscussion": {
    "@xmlns:xsi": "http://www.w3.org/2001/XMLSchema-instance",
    "@xsi:nil": "true"
  },
  "sort": {
    "dateSaisie": "2019-05-16T17:47:24.000+02:00",
    "sortEnSeance": "Non soutenu"
  },
  "dateDepot": "2019-04-25T02:00:00.000+02:00",
  "dateDistribution": "2019-05-14T02:00:00.000+02:00",
  "article99": "0",
  "loiReference": {
    "codeLoi": {
      "@xmlns:xsi": "http://www.w3.org/2001/XMLSchema-instance",
      "@xsi:nil": "true"
    },
    "divisionCodeLoi": {
      "@xmlns:xsi": "http://www.w3.org/2001/XMLSchema-instance",
      "@xsi:nil": "true"
    }
  }
}