{
  "@xmlns": "http://schemas.assemblee-nationale.fr/referentiel",
  "uid": "AMANR5L15SEA717460BTC0164P0D1N180",
  "identifiant": {
    "legislature": "15",
    "numero": "180",
    "numRect": "0",
    "saisine": {
      "refTexteLegislatif": "PRJLANR5L15BTC0164",
      "numeroPartiePLF": "0",
      "organeExamen": "PO717460",
      "mentionSecondeDeliberation": "0"
    }
  },
  "numeroLong": "180",
  "etapeTexte": "1ère lecture (2ème assemblée saisie)",
  "triAmendement": "ajtjw",
  "cardinaliteAmdtMultiples": "1",
  "amendementParent": {
    "@xmlns:xsi": "http://www.w3.org/2001/XMLSchema-instance",
    "@xsi:nil": "true"
  },
  "etat": "Discuté",
  "signataires": {
    "auteur": {
      "typeAuteur": "Depute",
      "acteurRef": "PA721094",
      "organeRef": {
        "@xmlns:xsi": "http://www.w3.org/2001/XMLSchema-instance",
        "@xsi:nil": "true"
      },
      "groupePolitiqueRef": "PO730952"
    },
    "cosignataires": {
      "acteurRef": [
        "PA721486",
        "PA335758",
        "PA720230",
        "PA1960",
        "PA267766",
        "PA266788",
        "PA712014",
        "PA267585",
        "PA722030",
        "PA331582",
        "PA267801",
        "PA267780",
        "PA721110",
        "PA642935",
        "PA719806",
        "PA268019",
        "PA721094",
        "PA713448",
        "PA267241",
        "PA267042",
        "PA702052",
        "PA610775",
        "PA267355"
      ]
    },
    "texteAffichable": "M.&#160;Dunoyer,  Mme&#160;Auconie, M.&#160;Becht, M.&#160;Bournazel, Mme&#160;Brenier, M.&#160;Guy&#160;Bricout, M.&#160;Demilly, M.&#160;Favennec Becot, Mme&#160;Firmin Le Bodo, M.&#160;Gom&#232;s, M.&#160;Herth, M.&#160;J&#233;go, M.&#160;Lagarde, M.&#160;Ledoux, M.&#160;Leroy, Mme&#160;Magnier, M.&#160;Morel-&#192;-L&apos;Huissier, M.&#160;Naegelen, M.&#160;Riester, Mme&#160;Sage, Mme&#160;Sanquer, M.&#160;Vercamer et M.&#160;Philippe&#160;Vigier"
  },
  "pointeurFragmentTexte": {
    "missionVisee": {
      "@xmlns:xsi": "http://www.w3.org/2001/XMLSchema-instance",
      "@xsi:nil": "true"
    },
    "division": {
      "titre": "Article 2",
      "articleDesignationCourte": "ART. 2",
      "type": "ARTICLE",
      "avant_A_Apres": "A",
      "divisionRattachee": "ARTICLE 2",
      "articleAdditionnel": {
        "@xmlns:xsi": "http://www.w3.org/2001/XMLSchema-instance",
        "@xsi:nil": "true"
      },
      "chapitreAdditionnel": {
        "@xmlns:xsi": "http://www.w3.org/2001/XMLSchema-instance",
        "@xsi:nil": "true"
      },
      "urlDivisionTexteVise": "/15/textes/0164.asp#D_Article_2"
    },
    "alinea": {
      "avant_A_Apres": {
        "@xmlns:xsi": "http://www.w3.org/2001/XMLSchema-instance",
        "@xsi:nil": "true"
      },
      "numero": "4",
      "alineaDesignation": {
        "@xmlns:xsi": "http://www.w3.org/2001/XMLSchema-instance",
        "@xsi:nil": "true"
      }
    }
  },
  "corps": {
    "dispositif": "<p style=\"text-align: justify;\">&#192; l&#8217;alin&#233;a&#160;4, apr&#232;s la deuxi&#232;me occurrence du mot&#160;:</p><p style=\"text-align: justify;\">&#171;&#160;&#224;&#160;&#187;, </p><p style=\"text-align: justify;\">ins&#233;rer les mots&#160;:</p><p style=\"text-align: justify;\">&#171;&#160;la haine ou&#160;&#187;.</p>",
    "exposeSommaire": "<p style=\"text-align: justify;\">Cet amendement conditionne la fermeture des lieux de culte &#224; la tenue de propos, &#233;crits, id&#233;es ou th&#233;ories ou activit&#233;s qui provoquent non seulement &#224; la violence mais &#233;galement &#224; la haine, conform&#233;ment &#224; la terminologie utilis&#233;e &#224; l&#8217;article&#160;8 de la loi du 3&#160;avril 1955 relative &#224; l&#8217;&#233;tat d&#8217;urgence dont s&#8217;inspire le pr&#233;sent article.</p>",
    "annexeExposeSommaire": {
      "@xmlns:xsi": "http://www.w3.org/2001/XMLSchema-instance",
      "@xsi:nil": "true"
    }
  },
  "representations": {
    "representation": {
      "nom": "PDF",
      "typeMime": {
        "type": "application",
        "subType": "PDF"
      },
      "statutRepresentation": {
        "verbatim": "true",
        "canonique": "true",
        "officielle": "true",
        "transcription": "false",
        "enregistrement": "false"
      },
      "repSource": {
        "@xmlns:xsi": "http://www.w3.org/2001/XMLSchema-instance",
        "@xsi:nil": "true"
      },
      "offset": {
        "@xmlns:xsi": "http://www.w3.org/2001/XMLSchema-instance",
        "@xsi:nil": "true"
      },
      "contenu": {
        "documentURI": "/15/amendements/0164/AN/180.pdf"
      },
      "dateDispoRepresentation": {
        "@xmlns:xsi": "http://www.w3.org/2001/XMLSchema-instance",
        "@xsi:nil": "true"
      }
    }
  },
  "seanceDiscussion": "RUANR5L15S2017IDS20669",
  "sort": {
    "dateSaisie": "2017-09-26T17:59:32.000+02:00",
    "sortEnSeance": "Tombé"
  },
  "dateDepot": "2017-09-20T02:00:00.000+02:00",
  "dateDistribution": "2017-09-22T02:00:00.000+02:00",
  "article99": "0",
  "loiReference": {
    "codeLoi": {
      "@xmlns:xsi": "http://www.w3.org/2001/XMLSchema-instance",
      "@xsi:nil": "true"
    },
    "divisionCodeLoi": {
      "@xmlns:xsi": "http://www.w3.org/2001/XMLSchema-instance",
      "@xsi:nil": "true"
    }
  }
}