{
  "@xmlns": "http://schemas.assemblee-nationale.fr/referentiel",
  "uid": "AMANR5L15SEA717460BTC2243P0D1N2388",
  "identifiant": {
    "legislature": "15",
    "numero": "2388",
    "numRect": "0",
    "saisine": {
      "refTexteLegislatif": "PRJLANR5L15BTC2243",
      "numeroPartiePLF": "0",
      "organeExamen": "PO717460",
      "mentionSecondeDeliberation": "0"
    }
  },
  "numeroLong": "2388",
  "etapeTexte": "1ère lecture (1ère assemblée saisie)",
  "triAmendement": "acaaaaaaaaaaaaaaaaaaaaaaaaaaaaaaaaaaaaaaaaaaaaaaaahchdro",
  "cardinaliteAmdtMultiples": "1",
  "amendementParent": {
    "@xmlns:xsi": "http://www.w3.org/2001/XMLSchema-instance",
    "@xsi:nil": "true"
  },
  "etat": "Discuté",
  "signataires": {
    "auteur": {
      "typeAuteur": "Depute",
      "acteurRef": "PA721174",
      "organeRef": {
        "@xmlns:xsi": "http://www.w3.org/2001/XMLSchema-instance",
        "@xsi:nil": "true"
      },
      "groupePolitiqueRef": "PO765636"
    },
    "cosignataires": {
      "acteurRef": "PA721174"
    },
    "texteAffichable": "M.&#160;Son-Forget"
  },
  "pointeurFragmentTexte": {
    "missionVisee": {
      "@xmlns:xsi": "http://www.w3.org/2001/XMLSchema-instance",
      "@xsi:nil": "true"
    },
    "division": {
      "titre": "Article PREMIER",
      "articleDesignationCourte": "ART. PREMIER",
      "type": "ARTICLE",
      "avant_A_Apres": "A",
      "divisionRattachee": "ARTICLE PREMIER",
      "articleAdditionnel": {
        "@xmlns:xsi": "http://www.w3.org/2001/XMLSchema-instance",
        "@xsi:nil": "true"
      },
      "chapitreAdditionnel": {
        "@xmlns:xsi": "http://www.w3.org/2001/XMLSchema-instance",
        "@xsi:nil": "true"
      },
      "urlDivisionTexteVise": "/15/textes/2243.asp#D_Article_1er"
    },
    "alinea": {
      "avant_A_Apres": {
        "@xmlns:xsi": "http://www.w3.org/2001/XMLSchema-instance",
        "@xsi:nil": "true"
      },
      "numero": "31",
      "alineaDesignation": {
        "@xmlns:xsi": "http://www.w3.org/2001/XMLSchema-instance",
        "@xsi:nil": "true"
      }
    }
  },
  "corps": {
    "dispositif": "<p style=\"text-align: justify;\">Supprimer l&#8217;alin&#233;a&#160;31.</p>",
    "exposeSommaire": "<p style=\"text-align: justify;\">Cet amendement vise &#224; supprimer l&#8217;alin&#233;a&#160;6 du pr&#233;sent article.</p><p style=\"text-align: justify;\">En effet, cet article ouvre aux couples homosexuels et aux femmes seules la possibilit&#233; de concevoir un enfant sans p&#232;re.</p><p style=\"text-align: justify;\">Aujourd&#8217;hui, nous remarquons que les enfants adopt&#233;s cherchent &#224; conna&#238;tre l&#8217;identit&#233; de leurs parents biologiques car il s&#8217;agit de leur identit&#233; g&#233;n&#233;tique.</p><p style=\"text-align: justify;\">Cet article transposerait ce flou d&#233;j&#224; existant aux enfants n&#233;s d&#8217;une conception par PMA et pourrait faire na&#238;tre un profond malaise chez ces enfants ne pouvant conna&#238;tre l&#8217;identit&#233; de leurs g&#233;niteurs de par l&#8217;Alin&#233;a&#160;19 du pr&#233;sent article.</p><p style=\"text-align: justify;\">Afin de pr&#233;server la stabilit&#233; psychique de ces enfants et leurs &#233;viter de faire face &#224; des questions existentielles nous demandons la suppression de cet article.</p><p style=\"text-align: justify;\">Alors qu&#8217;il s&#8217;agissait jusqu&#8217;ici d&#8217;un acte m&#233;dical, la mise en place d&#8217;une PMA pour des raisons d&#8217;infertilit&#233; &#171;&#160;sociale&#160;&#187; ouvrira logiquement la voie &#224; la l&#233;galisation de la gestation pour autrui.</p><p style=\"text-align: justify;\">De plus, nous pouvons aujourd&#8217;hui noter que pr&#232;s d&#8217;un quart des familles fran&#231;aises sont des familles monoparentales. 85&#160;% d&#8217;entre elles sont constitu&#233;es de m&#232;res seules. Les familles monoparentales sont plus pauvres, connaissent un taux de ch&#244;mage plus &#233;lev&#233;, sont moins bien log&#233;es que les familles traditionnelles. Leurs enfants connaissent des difficult&#233;s scolaires plus profondes que les autres. En un mot, les familles monoparentales concentrent les plus grandes fragilit&#233;s sociales, &#233;conomiques et scolaires fran&#231;aises. L&#8217;extension du recours &#224; la PMA pour les femmes en couple et les femmes seules, aura pour effet l&#8217;accroissement du nombre de familles monoparentales par ailleurs.</p><p style=\"text-align: justify;\">C&#8217;est pourquoi nous demandons la suppression de cet article&#160;1<sup>er</sup>.</p>",
    "annexeExposeSommaire": {
      "@xmlns:xsi": "http://www.w3.org/2001/XMLSchema-instance",
      "@xsi:nil": "true"
    },
    "cartoucheDelaiDepotDepasse": {
      "@xmlns:xsi": "http://www.w3.org/2001/XMLSchema-instance",
      "@xsi:nil": "true"
    },
    "avantAppel": {
      "@xmlns:xsi": "http://www.w3.org/2001/XMLSchema-instance",
      "@xsi:nil": "true"
    }
  },
  "representations": {
    "representation": {
      "nom": "PDF",
      "typeMime": {
        "type": "application",
        "subType": "PDF"
      },
      "statutRepresentation": {
        "verbatim": "true",
        "canonique": "true",
        "officielle": "true",
        "transcription": "false",
        "enregistrement": "false"
      },
      "repSource": {
        "@xmlns:xsi": "http://www.w3.org/2001/XMLSchema-instance",
        "@xsi:nil": "true"
      },
      "offset": {
        "@xmlns:xsi": "http://www.w3.org/2001/XMLSchema-instance",
        "@xsi:nil": "true"
      },
      "contenu": {
        "documentURI": "/15/amendements/2243/AN/2388.pdf"
      },
      "dateDispoRepresentation": {
        "@xmlns:xsi": "http://www.w3.org/2001/XMLSchema-instance",
        "@xsi:nil": "true"
      }
    }
  },
  "seanceDiscussion": "RUANR5L15S2019IDS21832",
  "sort": {
    "dateSaisie": "2019-09-27T09:57:44.000+02:00",
    "sortEnSeance": "Non soutenu"
  },
  "dateDepot": "2019-09-20T02:00:00.000+02:00",
  "dateDistribution": "2019-09-24T02:00:00.000+02:00",
  "article99": "0",
  "loiReference": {
    "codeLoi": {
      "@xmlns:xsi": "http://www.w3.org/2001/XMLSchema-instance",
      "@xsi:nil": "true"
    },
    "divisionCodeLoi": {
      "@xmlns:xsi": "http://www.w3.org/2001/XMLSchema-instance",
      "@xsi:nil": "true"
    }
  }
}