{
  "@xmlns": "http://schemas.assemblee-nationale.fr/referentiel",
  "uid": "AMANR5L15SEA717460B1297P0D1N1434",
  "identifiant": {
    "legislature": "15",
    "numero": "1434",
    "numRect": "0",
    "saisine": {
      "refTexteLegislatif": "PRJLANR5L15B1297",
      "numeroPartiePLF": "0",
      "organeExamen": "PO717460",
      "mentionSecondeDeliberation": "0"
    }
  },
  "numeroLong": "1434",
  "etapeTexte": "1ère lecture (1ère assemblée saisie)",
  "triAmendement": "juaaaaaaaaaaaaaaaaaaaaaaaaaaaaaaaaaaaaaaaaaaaaaaaafw",
  "cardinaliteAmdtMultiples": "1",
  "amendementParent": {
    "@xmlns:xsi": "http://www.w3.org/2001/XMLSchema-instance",
    "@xsi:nil": "true"
  },
  "etat": "Discuté",
  "signataires": {
    "auteur": {
      "typeAuteur": "Depute",
      "acteurRef": "PA722268",
      "organeRef": {
        "@xmlns:xsi": "http://www.w3.org/2001/XMLSchema-instance",
        "@xsi:nil": "true"
      },
      "groupePolitiqueRef": "PO730964"
    },
    "cosignataires": {
      "acteurRef": [
        "PA718810",
        "PA642724",
        "PA719154",
        "PA719456",
        "PA643175",
        "PA722268",
        "PA722300",
        "PA720202",
        "PA718706",
        "PA721246",
        "PA719186",
        "PA606639",
        "PA719464",
        "PA720576",
        "PA2449",
        "PA720038",
        "PA718744",
        "PA719480",
        "PA719338",
        "PA718728"
      ]
    },
    "texteAffichable": "Mme&#160;Wonner,  M.&#160;Pont, Mme&#160;Fontaine-Domeizel, Mme&#160;Bagarry, M.&#160;Vignal, Mme&#160;Josso, Mme&#160;M&#246;rch, M.&#160;Nadot, Mme&#160;Khedher, Mme&#160;Krimi, M.&#160;Gaillard, Mme&#160;Dupont, M.&#160;Martin, Mme&#160;Vanceunebrock-Mialon, M.&#160;Barbier, Mme&#160;Gaillot, Mme&#160;Khattabi, Mme&#160;Melchior, M.&#160;Bois et Mme&#160;Robert"
  },
  "pointeurFragmentTexte": {
    "missionVisee": {
      "@xmlns:xsi": "http://www.w3.org/2001/XMLSchema-instance",
      "@xsi:nil": "true"
    },
    "division": {
      "titre": "Article 43",
      "articleDesignationCourte": "ART. 43",
      "type": "ARTICLE",
      "avant_A_Apres": "A",
      "divisionRattachee": "ARTICLE 43",
      "articleAdditionnel": {
        "@xmlns:xsi": "http://www.w3.org/2001/XMLSchema-instance",
        "@xsi:nil": "true"
      },
      "chapitreAdditionnel": {
        "@xmlns:xsi": "http://www.w3.org/2001/XMLSchema-instance",
        "@xsi:nil": "true"
      },
      "urlDivisionTexteVise": "/15/textes/1297.asp#D_Article_43"
    },
    "alinea": {
      "avant_A_Apres": {
        "@xmlns:xsi": "http://www.w3.org/2001/XMLSchema-instance",
        "@xsi:nil": "true"
      },
      "numero": "13",
      "alineaDesignation": {
        "@xmlns:xsi": "http://www.w3.org/2001/XMLSchema-instance",
        "@xsi:nil": "true"
      }
    }
  },
  "corps": {
    "dispositif": "<p style=\"text-align: justify;\">&#192; la deuxi&#232;me phrase de l&#8217;alin&#233;a&#160;13, apr&#232;s le mot&#160;:</p><p style=\"text-align: justify;\">&#171;&#160;ordonnance,&#160;&#187;,</p><p style=\"text-align: justify;\">ins&#233;rer les mots&#160;:</p><p style=\"text-align: justify;\">&#171;&#160;dans le respect de la vie priv&#233;e et du secret des informations concernant la personne prise en charge,&#160;&#187;.</p>",
    "exposeSommaire": "<p style=\"text-align: justify;\">L&#8217;article&#160;43 permet aux prescripteurs, dans des conditions fix&#233;es par un arr&#234;t&#233; des ministres charg&#233;s de la sant&#233; et de la s&#233;curit&#233; sociale, de pr&#233;ciser sur l&#8217;ordonnance les justifications qui le conduisent &#224; exclure la d&#233;livrance d&#8217;un traitement du m&#234;me groupe g&#233;n&#233;rique ou du m&#234;me groupe hybride.</p><p style=\"text-align: justify;\">Cet amendement propose de rappeler le droit de toute personne, dans le cadre de l&#8217;inscription sur l&#8217;ordonnance, au respect du secret m&#233;dical et donc, de sa vie priv&#233;e et des informations la concernant.</p>",
    "annexeExposeSommaire": {
      "@xmlns:xsi": "http://www.w3.org/2001/XMLSchema-instance",
      "@xsi:nil": "true"
    }
  },
  "representations": {
    "representation": {
      "nom": "PDF",
      "typeMime": {
        "type": "application",
        "subType": "PDF"
      },
      "statutRepresentation": {
        "verbatim": "true",
        "canonique": "true",
        "officielle": "true",
        "transcription": "false",
        "enregistrement": "false"
      },
      "repSource": {
        "@xmlns:xsi": "http://www.w3.org/2001/XMLSchema-instance",
        "@xsi:nil": "true"
      },
      "offset": {
        "@xmlns:xsi": "http://www.w3.org/2001/XMLSchema-instance",
        "@xsi:nil": "true"
      },
      "contenu": {
        "documentURI": "/15/amendements/1297/AN/1434.pdf"
      },
      "dateDispoRepresentation": {
        "@xmlns:xsi": "http://www.w3.org/2001/XMLSchema-instance",
        "@xsi:nil": "true"
      }
    }
  },
  "seanceDiscussion": "RUANR5L15S2019IDS21295",
  "sort": {
    "dateSaisie": "2018-10-26T23:45:12.000+02:00",
    "sortEnSeance": "Non soutenu"
  },
  "dateDepot": "2018-10-19T02:00:00.000+02:00",
  "dateDistribution": "2018-10-23T02:00:00.000+02:00",
  "article99": "0",
  "loiReference": {
    "codeLoi": {
      "@xmlns:xsi": "http://www.w3.org/2001/XMLSchema-instance",
      "@xsi:nil": "true"
    },
    "divisionCodeLoi": {
      "@xmlns:xsi": "http://www.w3.org/2001/XMLSchema-instance",
      "@xsi:nil": "true"
    }
  }
}