{
  "@xmlns": "http://schemas.assemblee-nationale.fr/referentiel",
  "uid": "AMANR5L15SEA717460BTC1955P0D1N176",
  "identifiant": {
    "legislature": "15",
    "numero": "176",
    "numRect": "0",
    "saisine": {
      "refTexteLegislatif": "PNREANR5L15BTC1955",
      "numeroPartiePLF": "0",
      "organeExamen": "PO717460",
      "mentionSecondeDeliberation": "0"
    }
  },
  "numeroLong": "176",
  "etapeTexte": "Lecture unique",
  "triAmendement": "awaaaaaaaaaaaaaaaaaaaaaaaaaaaaaaaaaaaaaaaaaaaaaaaaaf",
  "cardinaliteAmdtMultiples": "1",
  "amendementParent": {
    "@xmlns:xsi": "http://www.w3.org/2001/XMLSchema-instance",
    "@xsi:nil": "true"
  },
  "etat": "Discuté",
  "signataires": {
    "auteur": {
      "typeAuteur": "Depute",
      "acteurRef": "PA1874",
      "organeRef": {
        "@xmlns:xsi": "http://www.w3.org/2001/XMLSchema-instance",
        "@xsi:nil": "true"
      },
      "groupePolitiqueRef": "PO730934"
    },
    "cosignataires": {
      "acteurRef": [
        "PA609245",
        "PA267260",
        "PA266776",
        "PA336316",
        "PA267429",
        "PA1029",
        "PA720644",
        "PA609726",
        "PA721474",
        "PA608016",
        "PA2155",
        "PA2377",
        "PA334654",
        "PA713448",
        "PA266793",
        "PA642847",
        "PA720386",
        "PA267735",
        "PA720100",
        "PA721286",
        "PA718850",
        "PA340853",
        "PA720210",
        "PA722390",
        "PA719318",
        "PA2086",
        "PA330684",
        "PA267901",
        "PA709315",
        "PA266808",
        "PA2492",
        "PA1012",
        "PA721636",
        "PA1874",
        "PA718884",
        "PA720684",
        "PA721506",
        "PA330909",
        "PA718780",
        "PA334843",
        "PA267440",
        "PA607090",
        "PA608416",
        "PA267204",
        "PA606098",
        "PA346218",
        "PA721070",
        "PA718838",
        "PA606712",
        "PA332523",
        "PA712015"
      ]
    },
    "texteAffichable": "M.&#160;Le Fur,  Mme&#160;Anthoine, M.&#160;Aubert, M.&#160;Bazin, Mme&#160;Bazin-Malgras, Mme&#160;Beauvais, M.&#160;Bony, M.&#160;Bouchet, Mme&#160;Val&#233;rie&#160;Boyer, Mme&#160;Brenier, M.&#160;Brun, M.&#160;Cinieri, M.&#160;Cordier, Mme&#160;Corneloup, Mme&#160;Dalloz, M.&#160;Deflesselles, M.&#160;Descoeur, M.&#160;Diard, M.&#160;Di Filippo, M.&#160;Dive, M.&#160;Pierre-Henri&#160;Dumont, M.&#160;de Ganay, M.&#160;Hetzel, M.&#160;Kamardine, Mme&#160;Kuster, Mme&#160;Lacroute, M.&#160;de la Verpilli&#232;re, M.&#160;Leclerc, Mme&#160;Louwagie, M.&#160;Lurton, M.&#160;Marleix, M.&#160;Marlin, M.&#160;Masson, M.&#160;Menuel, M.&#160;Nury, M.&#160;Parigi, M.&#160;Perrut, Mme&#160;Poletti, M.&#160;Pradi&#233;, M.&#160;Quentin, M.&#160;Ramadier, Mme&#160;Ramassamy, M.&#160;Reiss, M.&#160;Rolland, M.&#160;Sermier, M.&#160;Straumann, Mme&#160;Trastour-Isnart, M.&#160;Verch&#232;re, M.&#160;Viala, M.&#160;Jean-Pierre&#160;Vigier et M.&#160;Viry"
  },
  "pointeurFragmentTexte": {
    "missionVisee": {
      "@xmlns:xsi": "http://www.w3.org/2001/XMLSchema-instance",
      "@xsi:nil": "true"
    },
    "division": {
      "titre": "Article 6",
      "articleDesignationCourte": "APRÈS ART. 6",
      "type": "ARTICLE",
      "avant_A_Apres": "Après",
      "divisionRattachee": "APRÈS L'ARTICLE 6, insérer l'article suivant:",
      "articleAdditionnel": "1",
      "chapitreAdditionnel": {
        "@xmlns:xsi": "http://www.w3.org/2001/XMLSchema-instance",
        "@xsi:nil": "true"
      },
      "urlDivisionTexteVise": "/15/textes/1955.asp#D_Article_6"
    },
    "alinea": {
      "@xmlns:xsi": "http://www.w3.org/2001/XMLSchema-instance",
      "@xsi:nil": "true"
    }
  },
  "corps": {
    "dispositif": "<p style=\"text-align: justify;\">Apr&#232;s le premier alin&#233;a de l&#8217;article&#160;46 du R&#232;glement, il est ins&#233;r&#233; un alin&#233;a ainsi r&#233;dig&#233;&#160;:</p><p style=\"text-align: justify;\">&#171;&#160;Sur d&#233;cision du bureau de la commission, une projection d&#8217;images ou de texte peut avoir lieu lors des r&#233;unions afin d&#8217;accompagner les travaux.&#160;&#187;</p>",
    "exposeSommaire": "<p style=\"text-align: justify;\">Le pr&#233;sent amendement vise &#224; pr&#233;voir sur d&#233;cision du bureau de la commission la diffusion sur &#233;cran et en cours de r&#233;union, d&#8217;images ou de textes.</p><p style=\"text-align: justify;\">Lors d&#8217;auditions par exemple, pourraient ainsi &#234;tre diffus&#233;es des diaporamas accompagnant les propos du ou des intervenant(s), plut&#244;t que de les distribuer en format papier.</p>",
    "annexeExposeSommaire": {
      "@xmlns:xsi": "http://www.w3.org/2001/XMLSchema-instance",
      "@xsi:nil": "true"
    },
    "cartoucheDelaiDepotDepasse": {
      "@xmlns:xsi": "http://www.w3.org/2001/XMLSchema-instance",
      "@xsi:nil": "true"
    }
  },
  "representations": {
    "representation": {
      "nom": "PDF",
      "typeMime": {
        "type": "application",
        "subType": "PDF"
      },
      "statutRepresentation": {
        "verbatim": "true",
        "canonique": "true",
        "officielle": "true",
        "transcription": "false",
        "enregistrement": "false"
      },
      "repSource": {
        "@xmlns:xsi": "http://www.w3.org/2001/XMLSchema-instance",
        "@xsi:nil": "true"
      },
      "offset": {
        "@xmlns:xsi": "http://www.w3.org/2001/XMLSchema-instance",
        "@xsi:nil": "true"
      },
      "contenu": {
        "documentURI": "/15/amendements/1955/AN/176.pdf"
      },
      "dateDispoRepresentation": {
        "@xmlns:xsi": "http://www.w3.org/2001/XMLSchema-instance",
        "@xsi:nil": "true"
      }
    }
  },
  "seanceDiscussion": "RUANR5L15S2019IDS21668",
  "sort": {
    "dateSaisie": "2019-05-28T17:32:57.000+02:00",
    "sortEnSeance": "Rejeté"
  },
  "dateDepot": "2019-05-22T02:00:00.000+02:00",
  "dateDistribution": "2019-05-27T02:00:00.000+02:00",
  "article99": "0",
  "loiReference": {
    "codeLoi": {
      "@xmlns:xsi": "http://www.w3.org/2001/XMLSchema-instance",
      "@xsi:nil": "true"
    },
    "divisionCodeLoi": "46"
  }
}