{
  "@xmlns": "http://schemas.assemblee-nationale.fr/referentiel",
  "uid": "AMANR5L15SEA717460BTC1974P0D1N1564",
  "identifiant": {
    "legislature": "15",
    "numero": "1564",
    "numRect": "0",
    "saisine": {
      "refTexteLegislatif": "PRJLANR5L15BTC1974",
      "numeroPartiePLF": "0",
      "organeExamen": "PO717460",
      "mentionSecondeDeliberation": "0"
    }
  },
  "numeroLong": "1564",
  "etapeTexte": "1ère lecture (2ème assemblée saisie)",
  "triAmendement": "bbkaaaaaaaaaaaaaaaaaaaaaaaaaaaaaaaaaaaaaaaaaaaaaaavipu",
  "cardinaliteAmdtMultiples": "1",
  "amendementParent": {
    "@xmlns:xsi": "http://www.w3.org/2001/XMLSchema-instance",
    "@xsi:nil": "true"
  },
  "etat": "Discuté",
  "signataires": {
    "auteur": {
      "typeAuteur": "Depute",
      "acteurRef": "PA334654",
      "organeRef": {
        "@xmlns:xsi": "http://www.w3.org/2001/XMLSchema-instance",
        "@xsi:nil": "true"
      },
      "groupePolitiqueRef": "PO730934"
    },
    "cosignataires": {
      "acteurRef": [
        "PA334654",
        "PA767"
      ]
    },
    "texteAffichable": "M.&#160;Straumann et M.&#160;Cattin"
  },
  "pointeurFragmentTexte": {
    "missionVisee": {
      "@xmlns:xsi": "http://www.w3.org/2001/XMLSchema-instance",
      "@xsi:nil": "true"
    },
    "division": {
      "titre": "Article 11",
      "articleDesignationCourte": "ART. 11",
      "type": "ARTICLE",
      "avant_A_Apres": "A",
      "divisionRattachee": "ARTICLE 11",
      "articleAdditionnel": {
        "@xmlns:xsi": "http://www.w3.org/2001/XMLSchema-instance",
        "@xsi:nil": "true"
      },
      "chapitreAdditionnel": {
        "@xmlns:xsi": "http://www.w3.org/2001/XMLSchema-instance",
        "@xsi:nil": "true"
      },
      "urlDivisionTexteVise": "/15/textes/1974.asp#D_Article_11"
    },
    "alinea": {
      "avant_A_Apres": "A",
      "numero": "21",
      "alineaDesignation": "Alinéa 21"
    }
  },
  "corps": {
    "dispositif": "<p>Supprimer l&#8217;alin&#233;a 21.</p>",
    "exposeSommaire": "<p style=\"text-align: justify;\">L&#8217;article&#160;11 permet aux services num&#233;riques multimodaux d&#8217;acc&#233;der de droit aux canaux de vente des op&#233;rateurs de transport afin de proposer sur leur plateforme l&#8217;achat de titres de transport.</p><p style=\"text-align: justify;\">S&#8217;agissant de l&#8217;offre de transport non conventionn&#233;e, les entreprises doivent avoir le choix de garder la ma&#238;trise de leur r&#233;seau de distribution.</p><p style=\"text-align: justify;\">Il est notamment important pour les services librement organis&#233;s de transport par autocar (&#171;&#160;cars Macron&#160;&#187;) de ne pas &#234;tre soumis &#224; cette obligation.</p><p style=\"text-align: justify;\">C&#8217;est pourquoi il est propos&#233; de supprimer cet alin&#233;a.</p>",
    "annexeExposeSommaire": {
      "@xmlns:xsi": "http://www.w3.org/2001/XMLSchema-instance",
      "@xsi:nil": "true"
    },
    "cartoucheDelaiDepotDepasse": {
      "@xmlns:xsi": "http://www.w3.org/2001/XMLSchema-instance",
      "@xsi:nil": "true"
    }
  },
  "representations": {
    "representation": {
      "nom": "PDF",
      "typeMime": {
        "type": "application",
        "subType": "PDF"
      },
      "statutRepresentation": {
        "verbatim": "true",
        "canonique": "true",
        "officielle": "true",
        "transcription": "false",
        "enregistrement": "false"
      },
      "repSource": {
        "@xmlns:xsi": "http://www.w3.org/2001/XMLSchema-instance",
        "@xsi:nil": "true"
      },
      "offset": {
        "@xmlns:xsi": "http://www.w3.org/2001/XMLSchema-instance",
        "@xsi:nil": "true"
      },
      "contenu": {
        "documentURI": "/15/amendements/1974/AN/1564.pdf"
      },
      "dateDispoRepresentation": {
        "@xmlns:xsi": "http://www.w3.org/2001/XMLSchema-instance",
        "@xsi:nil": "true"
      }
    }
  },
  "seanceDiscussion": "RUANR5L15S2019IDS21680",
  "sort": {
    "dateSaisie": "2019-06-06T16:25:44.000+02:00",
    "sortEnSeance": "Non soutenu"
  },
  "dateDepot": "2019-05-29T02:00:00.000+02:00",
  "dateDistribution": "2019-06-03T02:00:00.000+02:00",
  "article99": "0",
  "loiReference": {
    "codeLoi": {
      "@xmlns:xsi": "http://www.w3.org/2001/XMLSchema-instance",
      "@xsi:nil": "true"
    },
    "divisionCodeLoi": {
      "@xmlns:xsi": "http://www.w3.org/2001/XMLSchema-instance",
      "@xsi:nil": "true"
    }
  }
}