{
  "@xmlns": "http://schemas.assemblee-nationale.fr/referentiel",
  "uid": "AMANR5L15PO59051B0911P0D1N740",
  "identifiant": {
    "legislature": "15",
    "numero": "740",
    "numRect": "0",
    "saisine": {
      "refTexteLegislatif": "PRJLANR5L15B0911",
      "numeroPartiePLF": "0",
      "organeExamen": "PO59051",
      "mentionSecondeDeliberation": "0"
    }
  },
  "numeroLong": "CL740",
  "etapeTexte": "1ère lecture (1ère assemblée saisie)",
  "triAmendement": "aaajyi",
  "cardinaliteAmdtMultiples": "1",
  "amendementParent": {
    "@xmlns:xsi": "http://www.w3.org/2001/XMLSchema-instance",
    "@xsi:nil": "true"
  },
  "etat": "Discuté",
  "signataires": {
    "auteur": {
      "typeAuteur": "Depute",
      "acteurRef": "PA720846",
      "organeRef": {
        "@xmlns:xsi": "http://www.w3.org/2001/XMLSchema-instance",
        "@xsi:nil": "true"
      },
      "groupePolitiqueRef": "PO730958"
    },
    "cosignataires": {
      "acteurRef": [
        "PA718860",
        "PA721210",
        "PA588884",
        "PA718868",
        "PA721062",
        "PA2150",
        "PA720422",
        "PA722142",
        "PA720846",
        "PA720286",
        "PA721960",
        "PA719676",
        "PA721202",
        "PA720892",
        "PA719578",
        "PA721226",
        "PA720430"
      ]
    },
    "texteAffichable": "M.&#160;Lachaud,  Mme&#160;Autain, M.&#160;Bernalicis, M.&#160;Coquerel, M.&#160;Corbi&#232;re, Mme&#160;Fiat, M.&#160;Larive, M.&#160;M&#233;lenchon, Mme&#160;Obono, Mme&#160;Panot, M.&#160;Prud&apos;homme, M.&#160;Quatennens, M.&#160;Ratenon, Mme&#160;Ressiguier, Mme&#160;Rubin, M.&#160;Ruffin et Mme&#160;Taurine"
  },
  "pointeurFragmentTexte": {
    "missionVisee": {
      "@xmlns:xsi": "http://www.w3.org/2001/XMLSchema-instance",
      "@xsi:nil": "true"
    },
    "division": {
      "titre": "Article PREMIER",
      "articleDesignationCourte": "AVANT ART. PREMIER",
      "type": "ARTICLE",
      "avant_A_Apres": "Avant",
      "divisionRattachee": "AVANT L'ARTICLE PREMIER, insérer l'article suivant:",
      "articleAdditionnel": "1",
      "chapitreAdditionnel": {
        "@xmlns:xsi": "http://www.w3.org/2001/XMLSchema-instance",
        "@xsi:nil": "true"
      },
      "urlDivisionTexteVise": "/15/textes/0911.asp#D_Article_1er"
    },
    "alinea": {
      "@xmlns:xsi": "http://www.w3.org/2001/XMLSchema-instance",
      "@xsi:nil": "true"
    }
  },
  "corps": {
    "dispositif": "<p>Au premier alin&#233;a du Pr&#233;ambule de la Constitution, apr&#232;s la r&#233;f&#233;rence&#160;: &#171;&#160;D&#233;claration de 1789&#160;&#187;, est ins&#233;r&#233;e la r&#233;f&#233;rence&#160;: &#171;&#160;et la D&#233;claration de 1793&#160;&#187;.</p>",
    "exposeSommaire": "<p style=\"line-height: 1.2; text-align: justify;\">Il s&#8217;agit premi&#232;rement d&#8217;un devoir r&#233;publicain. La D&#233;claration des droits de l&#8217;homme et du citoyen de 1789 est un texte fondamental dans la mesure o&#249; il fonde la conception fran&#231;aise de l&#8217;humanisme, de la citoyennet&#233; ainsi que la d&#233;finition de la patrie comme intrins&#232;quement r&#233;publicaine. C&#8217;est notamment ce texte qui permet de dire que les Fran&#231;ais n&#8217;ont pas fait la R&#233;volution pour eux-m&#234;mes, mais pour l&#8217;humanit&#233; universelle.</p><p style=\"text-align: justify;\">Nonobstant, la DDHC de 1789 ne suffit pas &#224; d&#233;finir le moment r&#233;volutionnaire qui a fond&#233; le peuple fran&#231;ais. En effet, du 26 ao&#251;t 1789 au 21 septembre 1792, la France reste une monarchie, et le document qui acte le passage, sur le plan th&#233;orique, d&#8217;un r&#233;gime sordide &#224; un r&#233;gime effectivement r&#233;publicain est justement cette D&#233;claration des droits de l&#8217;homme et du citoyen de 1793.</p><p style=\"text-align: justify;\">Outre son caract&#232;re symbolique, l&#8217;ajout de la DDHC de 1793 serait le moyen de faire d&#233;couler des principes r&#233;publicains originels &#224; la fois nos grandes lois de la fin du 19e si&#232;cle, notre organisation sociale issue de la Lib&#233;ration ainsi que nos engagements internationaux les plus fondamentaux. En effet, &#224; la diff&#233;rence de celle de 1789, elle proclame d&#233;j&#224; que (&#171; l&#8217;instruction est le besoin de tous. La soci&#233;t&#233; doit favoriser de tout son pouvoir le progr&#232;s de la raison publique, et mettre l&#8217;instruction &#224; la port&#233;e de tous les citoyens &#187; (article 22) ; que &#171; Les secours publics sont une dette sacr&#233;e. La soci&#233;t&#233; doit la subsistance aux citoyens malheureux, soit en leur procurant du travail, soit en assurant les moyens d&#8217;exister &#224; ceux qui sont hors d&#8217;&#233;tat de travailler. &#187; (article 21) ; que &#171; Quand le gouvernement viole les droits du peuple, l'insurrection est, pour le peuple et pour chaque portion du peuple, le plus sacr&#233; des droits et le plus indispensable des devoirs &#187; ; &#224; noter aussi dans la Constitution de 1793 elle-m&#234;me aussi que le peuple fran&#231;ais &#171; donne asile aux &#233;trangers bannis de leur patrie pour la cause de la libert&#233;. Il le refuse aux tyrans &#187; (article 120).</p><p style=\"text-align: justify;\">On voit donc qu&#8217;inscrire la DDHC de 1793 dans le bloc de constitutionnalit&#233; est un moyen de r&#233;affirmer les principes qui nous d&#233;finissent.</p>",
    "annexeExposeSommaire": {
      "@xmlns:xsi": "http://www.w3.org/2001/XMLSchema-instance",
      "@xsi:nil": "true"
    }
  },
  "representations": {
    "representation": {
      "nom": "PDF",
      "typeMime": {
        "type": "application",
        "subType": "PDF"
      },
      "statutRepresentation": {
        "verbatim": "true",
        "canonique": "true",
        "officielle": "true",
        "transcription": "false",
        "enregistrement": "false"
      },
      "repSource": {
        "@xmlns:xsi": "http://www.w3.org/2001/XMLSchema-instance",
        "@xsi:nil": "true"
      },
      "offset": {
        "@xmlns:xsi": "http://www.w3.org/2001/XMLSchema-instance",
        "@xsi:nil": "true"
      },
      "contenu": {
        "documentURI": "/15/amendements/0911/CION_LOIS/CL740.pdf"
      },
      "dateDispoRepresentation": {
        "@xmlns:xsi": "http://www.w3.org/2001/XMLSchema-instance",
        "@xsi:nil": "true"
      }
    }
  },
  "seanceDiscussion": {
    "@xmlns:xsi": "http://www.w3.org/2001/XMLSchema-instance",
    "@xsi:nil": "true"
  },
  "sort": {
    "dateSaisie": "2018-06-26T22:17:27.000+02:00",
    "sortEnSeance": "Rejeté"
  },
  "dateDepot": "2018-06-22T02:00:00.000+02:00",
  "dateDistribution": "2018-06-25T02:00:00.000+02:00",
  "article99": "0",
  "loiReference": {
    "codeLoi": "00 Préambule",
    "divisionCodeLoi": "1-20-1"
  }
}