{
  "@xmlns": "http://schemas.assemblee-nationale.fr/referentiel",
  "uid": "AMANR5L15SEA717460BTC1600P0D1N212",
  "identifiant": {
    "legislature": "15",
    "numero": "212",
    "numRect": "0",
    "saisine": {
      "refTexteLegislatif": "PIONANR5L15BTC1600",
      "numeroPartiePLF": "0",
      "organeExamen": "PO717460",
      "mentionSecondeDeliberation": "0"
    }
  },
  "numeroLong": "212",
  "etapeTexte": "1ère lecture (2ème assemblée saisie)",
  "triAmendement": "ooaaaaaaaaaaaaaaaaaaaaaaaaaaaaaaaaaaaaaaaaaaaaaaaal",
  "cardinaliteAmdtMultiples": "1",
  "amendementParent": {
    "@xmlns:xsi": "http://www.w3.org/2001/XMLSchema-instance",
    "@xsi:nil": "true"
  },
  "etat": "Discuté",
  "signataires": {
    "auteur": {
      "typeAuteur": "Depute",
      "acteurRef": "PA719692",
      "organeRef": {
        "@xmlns:xsi": "http://www.w3.org/2001/XMLSchema-instance",
        "@xsi:nil": "true"
      },
      "groupePolitiqueRef": "PO730964"
    },
    "cosignataires": {
      "acteurRef": [
        "PA720454",
        "PA2449",
        "PA719684",
        "PA719616",
        "PA722260",
        "PA722292",
        "PA2828",
        "PA721564",
        "PA722398",
        "PA722150",
        "PA721262",
        "PA719866",
        "PA720318",
        "PA721624",
        "PA721792",
        "PA720908",
        "PA677483",
        "PA719994",
        "PA721616",
        "PA719202",
        "PA643127",
        "PA721908",
        "PA721142",
        "PA721702",
        "PA719748",
        "PA721296",
        "PA720154",
        "PA721880",
        "PA721364",
        "PA721800",
        "PA721466",
        "PA719952",
        "PA606507",
        "PA719600",
        "PA721584",
        "PA718918",
        "PA719692"
      ]
    },
    "texteAffichable": "M.&#160;Eliaou,  M.&#160;Rebeyrotte, Mme&#160;Moutchou, Mme&#160;Abadie, Mme&#160;Avia, M.&#160;Boudi&#233;, Mme&#160;Braun-Pivet, Mme&#160;Chalas, Mme&#160;Dubost, Mme&#160;Dubr&#233;-Chirat, M.&#160;Euzet, Mme&#160;Fajgeles, M.&#160;Fauvergue, Mme&#160;Forteza, M.&#160;Gauvain, M.&#160;Gouffier-Cha, Mme&#160;Guerel, Mme&#160;Gu&#233;venoux, M.&#160;Houbron, M.&#160;Houli&#233;, Mme&#160;Kamowski, Mme&#160;Louis, M.&#160;Matras, M.&#160;Mazars, M.&#160;Mis, M.&#160;Paris, M.&#160;Pont, M.&#160;Poulliat, M.&#160;Questel, M.&#160;Rudigoz, M.&#160;Rupin, M.&#160;Terlier, M.&#160;Tourret, M.&#160;Villani, M.&#160;Vuilletet, Mme&#160;Zannier, M.&#160;Le Gendre et les membres du groupe La R&#233;publique en Marche"
  },
  "pointeurFragmentTexte": {
    "missionVisee": {
      "@xmlns:xsi": "http://www.w3.org/2001/XMLSchema-instance",
      "@xsi:nil": "true"
    },
    "division": {
      "titre": "visant à prévenir les violences lors des manifestations et à sanctionner leurs auteurs.",
      "articleDesignationCourte": "TITRE",
      "type": "TITRE",
      "avant_A_Apres": "A",
      "divisionRattachee": "TITRE",
      "articleAdditionnel": {
        "@xmlns:xsi": "http://www.w3.org/2001/XMLSchema-instance",
        "@xsi:nil": "true"
      },
      "chapitreAdditionnel": {
        "@xmlns:xsi": "http://www.w3.org/2001/XMLSchema-instance",
        "@xsi:nil": "true"
      },
      "urlDivisionTexteVise": "/15/textes/1600.asp#D_visant_a_prevenir_les_violences_lors_d"
    },
    "alinea": {
      "@xmlns:xsi": "http://www.w3.org/2001/XMLSchema-instance",
      "@xsi:nil": "true"
    }
  },
  "corps": {
    "dispositif": "<p style=\"text-align: justify;\">R&#233;diger ainsi le titre :</p><p style=\"text-align: justify;\">\"visant &#224; renforcer et garantir le maintien de l'ordre public lors des manifestations.\"</p>",
    "exposeSommaire": "<p>Cette proposition de loi a pour objet de renforcer les moyens juridiques et op&#233;rationnels des forces de l'ordre pour qu'elles puissent garantir la s&#233;curit&#233; lors des manifestations.</p><p>Pour faire face aux &#233;pisodes violents qui &#233;maillent de plus en plus les manifestations et afin d'en prot&#233;ger les participants (forces de l'ordre, manifestants, riverains), il convient d'adapter les capacit&#233;s l&#233;gales d'action des forces de l'ordre.</p><p>Cet amendement propose ainsi de modifier le titre pour une meilleure coh&#233;rence avec le texte.</p>",
    "annexeExposeSommaire": {
      "@xmlns:xsi": "http://www.w3.org/2001/XMLSchema-instance",
      "@xsi:nil": "true"
    },
    "cartoucheDelaiDepotDepasse": {
      "@xmlns:xsi": "http://www.w3.org/2001/XMLSchema-instance",
      "@xsi:nil": "true"
    }
  },
  "representations": {
    "representation": {
      "nom": "PDF",
      "typeMime": {
        "type": "application",
        "subType": "PDF"
      },
      "statutRepresentation": {
        "verbatim": "true",
        "canonique": "true",
        "officielle": "true",
        "transcription": "false",
        "enregistrement": "false"
      },
      "repSource": {
        "@xmlns:xsi": "http://www.w3.org/2001/XMLSchema-instance",
        "@xsi:nil": "true"
      },
      "offset": {
        "@xmlns:xsi": "http://www.w3.org/2001/XMLSchema-instance",
        "@xsi:nil": "true"
      },
      "contenu": {
        "documentURI": "/15/amendements/1600/AN/212.pdf"
      },
      "dateDispoRepresentation": {
        "@xmlns:xsi": "http://www.w3.org/2001/XMLSchema-instance",
        "@xsi:nil": "true"
      }
    }
  },
  "seanceDiscussion": "RUANR5L15S2019IDS21519",
  "sort": {
    "dateSaisie": "2019-02-01T11:57:13.000+01:00",
    "sortEnSeance": "Adopté"
  },
  "dateDepot": "2019-01-25T01:00:00.000+01:00",
  "dateDistribution": "2019-02-01T01:00:00.000+01:00",
  "article99": "0",
  "loiReference": {
    "codeLoi": {
      "@xmlns:xsi": "http://www.w3.org/2001/XMLSchema-instance",
      "@xsi:nil": "true"
    },
    "divisionCodeLoi": {
      "@xmlns:xsi": "http://www.w3.org/2001/XMLSchema-instance",
      "@xsi:nil": "true"
    }
  }
}