{
  "@xmlns": "http://schemas.assemblee-nationale.fr/referentiel",
  "uid": "AMANR5L15PO419610B0846P0D1N2150",
  "identifiant": {
    "legislature": "15",
    "numero": "2150",
    "numRect": "0",
    "saisine": {
      "refTexteLegislatif": "PRJLANR5L15B0846",
      "numeroPartiePLF": "0",
      "organeExamen": "PO419610",
      "mentionSecondeDeliberation": "0"
    }
  },
  "numeroLong": "CE2150",
  "etapeTexte": "1ère lecture (1ère assemblée saisie)",
  "triAmendement": "pc",
  "cardinaliteAmdtMultiples": "1",
  "amendementParent": {
    "@xmlns:xsi": "http://www.w3.org/2001/XMLSchema-instance",
    "@xsi:nil": "true"
  },
  "etat": "Discuté",
  "signataires": {
    "auteur": {
      "typeAuteur": "Depute",
      "acteurRef": "PA719578",
      "organeRef": {
        "@xmlns:xsi": "http://www.w3.org/2001/XMLSchema-instance",
        "@xsi:nil": "true"
      },
      "groupePolitiqueRef": "PO730958"
    },
    "cosignataires": {
      "acteurRef": [
        "PA718860",
        "PA719676",
        "PA720892",
        "PA721210",
        "PA720422",
        "PA721062",
        "PA721960",
        "PA720286",
        "PA718868",
        "PA719578",
        "PA588884",
        "PA720430",
        "PA2150",
        "PA722142",
        "PA720846",
        "PA721226",
        "PA721202"
      ]
    },
    "texteAffichable": "M.&#160;Prud&apos;homme,  Mme&#160;Autain, M.&#160;Bernalicis, M.&#160;Coquerel, M.&#160;Corbi&#232;re, Mme&#160;Fiat, M.&#160;Lachaud, M.&#160;Larive, M.&#160;M&#233;lenchon, Mme&#160;Obono, Mme&#160;Panot, M.&#160;Quatennens, M.&#160;Ratenon, Mme&#160;Ressiguier, Mme&#160;Rubin, M.&#160;Ruffin et Mme&#160;Taurine"
  },
  "pointeurFragmentTexte": {
    "missionVisee": {
      "@xmlns:xsi": "http://www.w3.org/2001/XMLSchema-instance",
      "@xsi:nil": "true"
    },
    "division": {
      "titre": "Article 51",
      "articleDesignationCourte": "APRÈS ART. 51",
      "type": "ARTICLE",
      "avant_A_Apres": "Après",
      "divisionRattachee": "APRÈS L'ARTICLE 51, insérer l'article suivant:",
      "articleAdditionnel": "1",
      "chapitreAdditionnel": {
        "@xmlns:xsi": "http://www.w3.org/2001/XMLSchema-instance",
        "@xsi:nil": "true"
      },
      "urlDivisionTexteVise": "/15/textes/0846.asp#D_Article_51"
    },
    "alinea": {
      "@xmlns:xsi": "http://www.w3.org/2001/XMLSchema-instance",
      "@xsi:nil": "true"
    }
  },
  "corps": {
    "dispositif": "<p style=\"text-align: justify;\">I.&#160;&#8211;&#160;L&#8217;autorisation de changement d&#8217;usage pour la transformation d&#8217;un local ou de locaux destin&#233;s &#224; l&#8217;habitation en locaux meubl&#233;s lou&#233;s de mani&#232;re r&#233;p&#233;t&#233;e pour de courtes dur&#233;es, &#224; une client&#232;le de passage qui n&#8217;y &#233;lit pas domicile,&#160;comme d&#233;fini &#224; l&#8217;article&#160;631&#8209;7 du code de la construction et de l&#8217;habitation, est subordonn&#233;e &#224; une compensation dans la m&#234;me commune que celle de la transformation. La compensation consiste en la transformation en habitation de locaux ayant un autre usage que l&#8217;habitation au 1<sup>er</sup> janvier 1970 ou ayant fait l&#8217;objet d&#8217;une autorisation d&#8217;urbanisme changeant leur destination post&#233;rieurement au 1<sup>er</sup> janvier 1970 et n&#8217;ayant pas d&#233;j&#224; &#233;t&#233; utilis&#233;s &#224; titre de compensation. Les locaux propos&#233;s en compensation doivent cumulativement&#160;:</p><p style=\"text-align: justify;\"><i>a)</i> correspondre &#224; des unit&#233;s de logement, et &#234;tre de qualit&#233; et de surface &#233;quivalentes &#224; celles faisant l&#8217;objet du changement d&#8217;usage, les dossiers &#233;tant examin&#233;s en fonction de la qualit&#233; d&#8217;habitabilit&#233; des locaux. Les locaux apport&#233;s en compensation doivent r&#233;pondre aux normes d&#233;finies par le d&#233;cret du 30 janvier 2002 relatif aux caract&#233;ristiques du logement d&#233;cent&#160;;</p><p style=\"text-align: justify;\"><i>b)</i> &#234;tre situ&#233;s dans la m&#234;me commune que les locaux d&#8217;habitation faisant l&#8217;objet du changement d&#8217;usage.</p><p style=\"text-align: justify;\">II.&#160;&#8211;&#160;La compensation doit se situer dans la m&#234;me commune que celle de la transformation&#160;:</p><p style=\"text-align: justify;\">1&#176;&#160;pour les locaux situ&#233;s dans les zones connaissant une p&#233;nurie de logements comme d&#233;finit &#224; l&#8217;article&#160;17 au chapitre III du titre I<sup>er</sup> de la loi n&#176; 89&#8209;462 du 6 juillet 1989 tendant &#224; am&#233;liorer les rapports locatifs et portant modification de la loi n&#176; 86-1290 du 23 d&#233;cembre 1986, la surface de compensation doit &#234;tre double de la surface transform&#233;e, sauf s&#8217;il s&#8217;agit de logements locatifs sociaux faisant l&#8217;objet d&#8217;une convention conclue en application de l&#8217;article L.&#160;351&#8209;2 du code de la construction et de l&#8217;habitation d&#8217;une dur&#233;e minimale de 20 ans.</p><p style=\"text-align: justify;\">2&#176;&#160;pour les autres locaux, la surface de compensation est &#233;quivalente &#224; la surface transform&#233;e en application de l&#8217;article R. 111&#8209;2 du code de la construction et de l&#8217;habitation.&#160;&#187;</p>",
    "exposeSommaire": "<p>Cet article vise &#224; pr&#233;venir les abus de certains propri&#233;taires dans la location de meubl&#233;s touristiques.</p><p>En effet, des propri&#233;taires louent parfois leur logement secondaire &#224; l&#8217;ann&#233;e avec une offre tr&#232;s similaire &#224; l'h&#244;tellerie, en s&#8217;exon&#233;rant pourtant des normes de ce secteur.</p><p>En outre, ces pratiquent jouent un r&#244;le n&#233;faste sur le march&#233; du logement. Comme le note tr&#232;s justement l&#8217;&#233;tude d&#8217;impact : &#8220;L&#8217;essor consid&#233;rable des locations saisonni&#232;res entre particuliers entra&#238;ne une diminution du parc locatif priv&#233; disponible pour les r&#233;sidents de certaines localisations. Cette r&#233;duction, estim&#233;e entre 15.000 et 20.000 logements &#224; Paris, entra&#238;ne une tension suppl&#233;mentaire sur le parc locatif et un effet inflationniste sur les loyers.&#8221;</p><p>Le syst&#232;me de compensation propos&#233; par le pr&#233;sent article permet d&#8217;&#233;quilibrer l&#8217;offre et la demande de logement et de diminuer la tension g&#233;n&#233;r&#233;e sur le parc locatif. En effet, chaque logement transform&#233; en logement de location touristique est compens&#233; par la transformation en logement d&#8217;un local non pr&#233;vu &#224; l&#8217;habitat.</p><p>Ce dispositif s&#8217;inspire du mod&#232;le existant dans la mairie de Paris, il s&#8217;agirait de l&#8217;&#233;tendre au reste du pays.</p><p>&#160;</p><p>&#160;</p>",
    "annexeExposeSommaire": {
      "@xmlns:xsi": "http://www.w3.org/2001/XMLSchema-instance",
      "@xsi:nil": "true"
    }
  },
  "representations": {
    "representation": {
      "nom": "PDF",
      "typeMime": {
        "type": "application",
        "subType": "PDF"
      },
      "statutRepresentation": {
        "verbatim": "true",
        "canonique": "true",
        "officielle": "true",
        "transcription": "false",
        "enregistrement": "false"
      },
      "repSource": {
        "@xmlns:xsi": "http://www.w3.org/2001/XMLSchema-instance",
        "@xsi:nil": "true"
      },
      "offset": {
        "@xmlns:xsi": "http://www.w3.org/2001/XMLSchema-instance",
        "@xsi:nil": "true"
      },
      "contenu": {
        "documentURI": "/15/amendements/0846/CION-ECO/CE2150.pdf"
      },
      "dateDispoRepresentation": {
        "@xmlns:xsi": "http://www.w3.org/2001/XMLSchema-instance",
        "@xsi:nil": "true"
      }
    }
  },
  "seanceDiscussion": {
    "@xmlns:xsi": "http://www.w3.org/2001/XMLSchema-instance",
    "@xsi:nil": "true"
  },
  "sort": {
    "dateSaisie": "2018-05-18T18:54:13.000+02:00",
    "sortEnSeance": "Non soutenu"
  },
  "dateDepot": "2018-05-09T02:00:00.000+02:00",
  "dateDistribution": "2018-05-15T02:00:00.000+02:00",
  "article99": "0",
  "loiReference": {
    "codeLoi": "xx",
    "divisionCodeLoi": {
      "@xmlns:xsi": "http://www.w3.org/2001/XMLSchema-instance",
      "@xsi:nil": "true"
    }
  }
}