{
  "@xmlns": "http://schemas.assemblee-nationale.fr/referentiel",
  "uid": "AMANR5L15PO59051B1401P0D1N1",
  "identifiant": {
    "legislature": "15",
    "numero": "1",
    "numRect": "0",
    "saisine": {
      "refTexteLegislatif": "PRJLANR5L15B1401",
      "numeroPartiePLF": "0",
      "organeExamen": "PO59051",
      "mentionSecondeDeliberation": "0"
    }
  },
  "numeroLong": "CL1",
  "etapeTexte": "1ère lecture (1ère assemblée saisie)",
  "triAmendement": "eaaaaaaaaaaaaaaaaaaaaaaaaaaaaaaaaaaaaaaaaaaaaaaaaaai",
  "cardinaliteAmdtMultiples": "1",
  "amendementParent": {
    "@xmlns:xsi": "http://www.w3.org/2001/XMLSchema-instance",
    "@xsi:nil": "true"
  },
  "etat": "Discuté",
  "signataires": {
    "auteur": {
      "typeAuteur": "Gouvernement",
      "acteurRef": {
        "@xmlns:xsi": "http://www.w3.org/2001/XMLSchema-instance",
        "@xsi:nil": "true"
      },
      "organeRef": {
        "@xmlns:xsi": "http://www.w3.org/2001/XMLSchema-instance",
        "@xsi:nil": "true"
      },
      "groupePolitiqueRef": {
        "@xmlns:xsi": "http://www.w3.org/2001/XMLSchema-instance",
        "@xsi:nil": "true"
      }
    },
    "cosignataires": {
      "@xmlns:xsi": "http://www.w3.org/2001/XMLSchema-instance",
      "@xsi:nil": "true"
    },
    "texteAffichable": "le Gouvernement"
  },
  "pointeurFragmentTexte": {
    "missionVisee": {
      "@xmlns:xsi": "http://www.w3.org/2001/XMLSchema-instance",
      "@xsi:nil": "true"
    },
    "division": {
      "titre": "Article unique",
      "articleDesignationCourte": "ART. UNIQUE",
      "type": "ARTICLE",
      "avant_A_Apres": "A",
      "divisionRattachee": "ARTICLE UNIQUE",
      "articleAdditionnel": {
        "@xmlns:xsi": "http://www.w3.org/2001/XMLSchema-instance",
        "@xsi:nil": "true"
      },
      "chapitreAdditionnel": {
        "@xmlns:xsi": "http://www.w3.org/2001/XMLSchema-instance",
        "@xsi:nil": "true"
      },
      "urlDivisionTexteVise": "/15/textes/1401.asp#D_Article_unique"
    },
    "alinea": {
      "avant_A_Apres": {
        "@xmlns:xsi": "http://www.w3.org/2001/XMLSchema-instance",
        "@xsi:nil": "true"
      },
      "numero": "2",
      "alineaDesignation": {
        "@xmlns:xsi": "http://www.w3.org/2001/XMLSchema-instance",
        "@xsi:nil": "true"
      }
    }
  },
  "corps": {
    "dispositif": "<p style=\"text-align: justify;\">&#192; l&#8217;alin&#233;a&#160;2, substituer aux mots&#160;: </p><p style=\"text-align: justify;\">&#171;&#160;AFB-ONCFS&#160;&#187;</p><p style=\"text-align: justify;\">les mots&#160;: </p><p style=\"text-align: justify;\">&#171;&#160;Office fran&#231;ais de la biodiversit&#233;&#160;&#187;.</p>",
    "exposeSommaire": "<p>L&#8217;&#233;tablissement a &#233;t&#233; d&#233;nomm&#233; &#171;&#160;AFB-ONCFS&#160;&#187; &#224; titre provisoire, afin que sa d&#233;nomination soit d&#233;finie en concertation avec les parties prenantes.</p><p>Le nom qui a &#233;t&#233; retenu &#224; l&#8217;issue de cette concertation est&#160;: &#171;&#160;Office fran&#231;ais de la biodiversit&#233;&#160;&#160;&#187;.</p><p>Cet amendement propose donc de remplacer les mots&#160;: &#171;&#160;AFB-ONCFS&#160;&#187; par les mots&#160;: &#171;&#160;Office fran&#231;ais de la biodiversit&#233;&#160;&#187; dans l&#8217;ensemble du projet de loi.</p>",
    "annexeExposeSommaire": {
      "@xmlns:xsi": "http://www.w3.org/2001/XMLSchema-instance",
      "@xsi:nil": "true"
    },
    "cartoucheDelaiDepotDepasse": {
      "@xmlns:xsi": "http://www.w3.org/2001/XMLSchema-instance",
      "@xsi:nil": "true"
    }
  },
  "representations": {
    "representation": {
      "nom": "PDF",
      "typeMime": {
        "type": "application",
        "subType": "PDF"
      },
      "statutRepresentation": {
        "verbatim": "true",
        "canonique": "true",
        "officielle": "true",
        "transcription": "false",
        "enregistrement": "false"
      },
      "repSource": {
        "@xmlns:xsi": "http://www.w3.org/2001/XMLSchema-instance",
        "@xsi:nil": "true"
      },
      "offset": {
        "@xmlns:xsi": "http://www.w3.org/2001/XMLSchema-instance",
        "@xsi:nil": "true"
      },
      "contenu": {
        "documentURI": "/15/amendements/1401/CION_LOIS/CL1.pdf"
      },
      "dateDispoRepresentation": {
        "@xmlns:xsi": "http://www.w3.org/2001/XMLSchema-instance",
        "@xsi:nil": "true"
      }
    }
  },
  "seanceDiscussion": {
    "@xmlns:xsi": "http://www.w3.org/2001/XMLSchema-instance",
    "@xsi:nil": "true"
  },
  "sort": {
    "dateSaisie": "2018-12-12T11:50:16.000+01:00",
    "sortEnSeance": "Adopté"
  },
  "dateDepot": "2018-11-30T01:00:00.000+01:00",
  "dateDistribution": "2018-12-10T01:00:00.000+01:00",
  "article99": "0",
  "loiReference": {
    "codeLoi": "1 id",
    "divisionCodeLoi": {
      "@xmlns:xsi": "http://www.w3.org/2001/XMLSchema-instance",
      "@xsi:nil": "true"
    }
  }
}