{
  "@xmlns": "http://schemas.assemblee-nationale.fr/referentiel",
  "uid": "AMANR5L15SEA717460BTC1237P0D1N2202",
  "identifiant": {
    "legislature": "15",
    "numero": "2202",
    "numRect": "0",
    "saisine": {
      "refTexteLegislatif": "PRJLANR5L15BTC1237",
      "numeroPartiePLF": "0",
      "organeExamen": "PO717460",
      "mentionSecondeDeliberation": "0"
    }
  },
  "numeroLong": "2202",
  "etapeTexte": "1ère lecture (1ère assemblée saisie)",
  "triAmendement": "doiaaaaaaaaaaaaaaaaaaaaaaaaaaaaaaaaaaaaaaaaaaaaaaateho",
  "cardinaliteAmdtMultiples": "1",
  "amendementParent": {
    "@xmlns:xsi": "http://www.w3.org/2001/XMLSchema-instance",
    "@xsi:nil": "true"
  },
  "etat": "Retiré",
  "signataires": {
    "auteur": {
      "typeAuteur": "Depute",
      "acteurRef": "PA720162",
      "organeRef": {
        "@xmlns:xsi": "http://www.w3.org/2001/XMLSchema-instance",
        "@xsi:nil": "true"
      },
      "groupePolitiqueRef": "PO730970"
    },
    "cosignataires": {
      "acteurRef": [
        "PA720256",
        "PA720720",
        "PA719044",
        "PA719558",
        "PA717151",
        "PA720598",
        "PA720704",
        "PA719874",
        "PA718978",
        "PA719938",
        "PA721418",
        "PA720162",
        "PA720924",
        "PA721992",
        "PA721182",
        "PA720772",
        "PA721924",
        "PA720002",
        "PA719266",
        "PA721530",
        "PA1276",
        "PA719640",
        "PA721608",
        "PA720746",
        "PA722162",
        "PA721234",
        "PA720764",
        "PA721742",
        "PA719210",
        "PA719918",
        "PA719504",
        "PA721984",
        "PA720092",
        "PA720326",
        "PA720976",
        "PA722374",
        "PA719488",
        "PA720178",
        "PA720728",
        "PA720334",
        "PA720968",
        "PA720652",
        "PA722284",
        "PA721976",
        "PA721734"
      ]
    },
    "texteAffichable": "M.&#160;Bolo,  M.&#160;Mattei, Mme&#160;Jacquier-Laforge, M.&#160;Laqhila, M.&#160;Waserman, M.&#160;Balanant, Mme&#160;Bannier, Mme&#160;Benin, M.&#160;Berta, M.&#160;Bourlanges, M.&#160;Bru, M.&#160;Cubertafon, Mme&#160;de Sarnez, Mme&#160;de Vaucouleurs, Mme&#160;Deprez-Audebert, M.&#160;Duverg&#233;, Mme&#160;El Ha&#239;ry, Mme&#160;Elimas, Mme&#160;Essayan, M.&#160;Fanget, M.&#160;Fesneau, Mme&#160;Florennes, M.&#160;Fuchs, Mme&#160;Gallerneau, M.&#160;Garcia, M.&#160;Hammouche, M.&#160;Isaac-Sibille, M.&#160;Joncour, M.&#160;Lagleize, M.&#160;Lain&#233;, Mme&#160;Lasserre-David, M.&#160;Latombe, Mme&#160;Luquet, M.&#160;Mathiasin, Mme&#160;Mette, M.&#160;Michel-Kleisbauer, M.&#160;Mignola, M.&#160;Millienne, M.&#160;Pahun, M.&#160;Fr&#233;d&#233;ric&#160;Petit, Mme&#160;Maud&#160;Petit, Mme&#160;Poueyto, M.&#160;Ramos, M.&#160;Turquois et Mme&#160;Vichnievsky"
  },
  "pointeurFragmentTexte": {
    "missionVisee": {
      "@xmlns:xsi": "http://www.w3.org/2001/XMLSchema-instance",
      "@xsi:nil": "true"
    },
    "division": {
      "titre": "Article 27 quinquies",
      "articleDesignationCourte": "ART. 27 QUINQUIES",
      "type": "ARTICLE",
      "avant_A_Apres": "A",
      "divisionRattachee": "ARTICLE 27 QUINQUIES",
      "articleAdditionnel": {
        "@xmlns:xsi": "http://www.w3.org/2001/XMLSchema-instance",
        "@xsi:nil": "true"
      },
      "chapitreAdditionnel": {
        "@xmlns:xsi": "http://www.w3.org/2001/XMLSchema-instance",
        "@xsi:nil": "true"
      },
      "urlDivisionTexteVise": "/15/textes/1237.asp#D_Article_27_quinquies"
    },
    "alinea": {
      "avant_A_Apres": "Apres",
      "numero": "3",
      "alineaDesignation": {
        "@xmlns:xsi": "http://www.w3.org/2001/XMLSchema-instance",
        "@xsi:nil": "true"
      }
    }
  },
  "corps": {
    "dispositif": "<p style=\"text-align: justify;\">Apr&#232;s l'alin&#233;a 2, ins&#233;rer l'alin&#233;a suivant&#160;:</p><p style=\"text-align: justify;\">&#171;&#160;1&#176; <i>bis</i>&#160;Apr&#232;s le mot&#160;: &#171;&#160;interm&#233;diaire&#160;&#187;, la fin de la phrase est supprim&#233;e.</p>",
    "exposeSommaire": "<p style=\"text-align: justify;\">Cet amendement vise &#224; accro&#238;tre et diversifier les capacit&#233;s de financement des petites et moyennes entreprises en &#233;largissant, dans la continuit&#233; de la loi du 6 ao&#251;t 2015 pour la croissance, l&#8217;activit&#233; et l&#8217;&#233;galit&#233; des chances &#233;conomiques, les exceptions au principe de monopole du cr&#233;dit bancaire&#160;; particularisme fran&#231;ais limitant les mouvements de capitaux en faveur du d&#233;veloppement des entreprises.</p><p style=\"text-align: justify;\">Mobiliser des capitaux disponibles pour le financement du tissu productif&#160;:</p><p style=\"text-align: justify;\">Le 3 bis de l&#8217;article&#160;511&#8209;6, s&#8217;il a ouvert la voie au pr&#234;t interentreprises, limite les capacit&#233;s de cr&#233;dits des entreprises aux cr&#233;anciers au statut de soci&#233;t&#233;s par actions et aux soci&#233;t&#233;s &#224; responsabilit&#233; limit&#233;e. Plus encore, la r&#233;daction actuelle de cette exception au principe de monopole du cr&#233;dit bancaire limite ce mouvement de capitaux aux entreprises entretenant des liens &#233;conomiques justifiant cette cr&#233;ance.</p><p style=\"text-align: justify;\">L&#8217;objet de cet amendement est de supprimer les freins &#224; la libre circulation des capitaux disponibles lorsque ceux-ci, &#224; disposition des entreprises, pourraient servir au financement des petites et moyennes entreprises dont les besoins de financement &#224; court terme peuvent &#234;tre importants.</p><p style=\"text-align: justify;\">Est conserv&#233;e la restriction visant &#224; ce que ces pr&#234;ts soient restreints &#224; l&#8217;accessoire de l&#8217;activit&#233; principale de l&#8217;entreprise exer&#231;ant cette capacit&#233; de cr&#233;dit (l&#8217;activit&#233; principale reste ainsi celle de son activit&#233; &#171;&#160;c&#339;ur de m&#233;tier&#160;&#187; et ne devient pas celle d&#8217;un organisme bancaire). Sont de m&#234;me conserv&#233;es les interdictions de titrisation, constitution d&#8217;instruments financiers &#224; termes ou de transfert des risques d&#8217;assurances. En effet, l&#8217;esprit de cet amendement est la lib&#233;ration des flux de capitaux vers les petites et moyennes entreprises et non la financiarisation &#224; outrance de ces capacit&#233;s.</p><p style=\"text-align: justify;\">Pr&#233;server les capitaux du d&#233;tournement de la loi&#160;:</p><p style=\"text-align: justify;\">Conscient par ailleurs des limites expos&#233;es par le gouvernement et par la Banque de France lors de l&#8217;&#233;tude du projet de loi pour la croissance, l&#8217;activit&#233; et l&#8217;&#233;galit&#233; des chances &#233;conomiques, cet amendement vise n&#233;anmoins &#224; conserver les diverses protections tierces au regard, notamment, du risque de blanchiment ainsi que de d&#233;tournement de la loi visant &#224; contourner les r&#232;gles de d&#233;lais de paiement.</p><p style=\"text-align: justify;\">Par cons&#233;quence, tout en accompagnant la r&#233;duction du caract&#232;re obligatoire de la certification des comptes (par l&#8217;augmentation des seuils de l&#8217;article&#160;6) cet amendement renforce l&#8217;attractivit&#233; de cette certification. En effet, si l&#8217;augmentation des seuils pourrait avoir tendance &#224; r&#233;duire le nombre d&#8217;entreprises certifi&#233;es, toute chose &#233;tant &#233;gale par ailleurs, cet amendement incite au contraire les entreprises non soumises &#224; l&#8217;obligation de certification &#224; user des services d&#8217;un commissaire au compte certificateur&#160;; seule voie permettant &#224; l&#8217;entreprise de participer au financement interentreprises. Cet amendement a ainsi pour cons&#233;quence indirecte de renforcer l&#8217;attractivit&#233; de ce contr&#244;le tout en pr&#233;servant son caract&#232;re facultatif pour la plupart d&#8217;entreprises.</p><p style=\"text-align: justify;\">In fine cet amendement lib&#232;re des capitaux disponibles tout en pr&#233;servant les garants d&#8217;ordre public&#160;&#8211;&#160;gages d&#8217;un circuit &#233;conomique sain&#160;&#8211;&#160;et renfor&#231;ant l&#8217;&#233;conomie des garants facultatifs.</p>",
    "annexeExposeSommaire": {
      "@xmlns:xsi": "http://www.w3.org/2001/XMLSchema-instance",
      "@xsi:nil": "true"
    }
  },
  "representations": {
    "representation": {
      "nom": "PDF",
      "typeMime": {
        "type": "application",
        "subType": "PDF"
      },
      "statutRepresentation": {
        "verbatim": "true",
        "canonique": "true",
        "officielle": "true",
        "transcription": "false",
        "enregistrement": "false"
      },
      "repSource": {
        "@xmlns:xsi": "http://www.w3.org/2001/XMLSchema-instance",
        "@xsi:nil": "true"
      },
      "offset": {
        "@xmlns:xsi": "http://www.w3.org/2001/XMLSchema-instance",
        "@xsi:nil": "true"
      },
      "contenu": {
        "documentURI": "/15/amendements/1237/AN/2202.pdf"
      },
      "dateDispoRepresentation": {
        "@xmlns:xsi": "http://www.w3.org/2001/XMLSchema-instance",
        "@xsi:nil": "true"
      }
    }
  },
  "seanceDiscussion": {
    "@xmlns:xsi": "http://www.w3.org/2001/XMLSchema-instance",
    "@xsi:nil": "true"
  },
  "sort": {
    "@xmlns:xsi": "http://www.w3.org/2001/XMLSchema-instance",
    "@xsi:nil": "true"
  },
  "dateDepot": "2018-09-21T02:00:00.000+02:00",
  "dateDistribution": "2018-09-25T02:00:00.000+02:00",
  "article99": "0",
  "loiReference": {
    "codeLoi": {
      "@xmlns:xsi": "http://www.w3.org/2001/XMLSchema-instance",
      "@xsi:nil": "true"
    },
    "divisionCodeLoi": {
      "@xmlns:xsi": "http://www.w3.org/2001/XMLSchema-instance",
      "@xsi:nil": "true"
    }
  }
}