{
  "@xmlns": "http://schemas.assemblee-nationale.fr/referentiel",
  "uid": "AMANR5L15SEA717460B1297P0D1N427",
  "identifiant": {
    "legislature": "15",
    "numero": "427",
    "numRect": "0",
    "saisine": {
      "refTexteLegislatif": "PRJLANR5L15B1297",
      "numeroPartiePLF": "0",
      "organeExamen": "PO717460",
      "mentionSecondeDeliberation": "0"
    }
  },
  "numeroLong": "427",
  "etapeTexte": "1ère lecture (1ère assemblée saisie)",
  "triAmendement": "fiaaaaaaaaaaaaaaaaaaaaaaaaaaaaaaaaaaaaaaaaaaaaaaaac",
  "cardinaliteAmdtMultiples": "1",
  "amendementParent": {
    "@xmlns:xsi": "http://www.w3.org/2001/XMLSchema-instance",
    "@xsi:nil": "true"
  },
  "etat": "Irrecevable",
  "signataires": {
    "auteur": {
      "typeAuteur": "Depute",
      "acteurRef": "PA720386",
      "organeRef": {
        "@xmlns:xsi": "http://www.w3.org/2001/XMLSchema-instance",
        "@xsi:nil": "true"
      },
      "groupePolitiqueRef": "PO730934"
    },
    "cosignataires": {
      "acteurRef": "PA720386"
    },
    "texteAffichable": "M.&#160;Di Filippo"
  },
  "pointeurFragmentTexte": {
    "missionVisee": {
      "@xmlns:xsi": "http://www.w3.org/2001/XMLSchema-instance",
      "@xsi:nil": "true"
    },
    "division": {
      "titre": "Article 31",
      "articleDesignationCourte": "APRÈS ART. 31",
      "type": "ARTICLE",
      "avant_A_Apres": "Après",
      "divisionRattachee": "APRÈS L'ARTICLE 31, insérer l'article suivant:",
      "articleAdditionnel": "1",
      "chapitreAdditionnel": {
        "@xmlns:xsi": "http://www.w3.org/2001/XMLSchema-instance",
        "@xsi:nil": "true"
      },
      "urlDivisionTexteVise": "/15/textes/1297.asp#D_Article_31"
    },
    "alinea": {
      "@xmlns:xsi": "http://www.w3.org/2001/XMLSchema-instance",
      "@xsi:nil": "true"
    }
  },
  "corps": {
    "dispositif": "<p style=\"text-align: justify;\">I.&#160;&#8211;&#160;Apr&#232;s l&#8217;article L.&#160;4311&#8209;1 du code de sant&#233; publique, il est ins&#233;r&#233; un article L.&#160;4311&#8209;1&#8209;1 ainsi r&#233;dig&#233;&#160;:</p><p style=\"text-align: justify;\">&#171;&#160;<i>Art.&#160;L.&#160;4311&#8209;1&#8209;1</i>.&#160;&#8211;&#160;La mise en place du bilan de soins infirmiers est g&#233;n&#233;ralis&#233;e sur l&#8217;ensemble du territoire fran&#231;ais.&#160;&#187;</p><p style=\"text-align: justify;\">II.&#160;&#8211;&#160;La perte de recettes pour l&#8217;&#201;tat est compens&#233;e &#224; due concurrence par la cr&#233;ation d&#8217;une taxe additionnelle aux droits mentionn&#233;s aux articles 575 et 575 A du code g&#233;n&#233;ral des imp&#244;ts.&#160;</p>",
    "exposeSommaire": "<p style=\"text-align: justify;\">Une exp&#233;rimentation du BSI dans la pratique quotidienne des infirmiers et m&#233;decins se d&#233;roule dans 11 d&#233;partements, depuis le 4 avril 2017, avec pour objectifs&#160;:</p><p style=\"text-align: justify;\">- d&#8217;&#233;valuer l&#8217;accueil et la pertinence du dispositif BSI aupr&#232;s des professionnels et voir s&#8217;il r&#233;pond &#224; leurs besoins et attentes,</p><p style=\"text-align: justify;\">- de mieux conna&#238;tre les interventions des infirmiers(&#232;res) aupr&#232;s des personnes d&#233;pendantes.</p><p style=\"text-align: justify;\">Malheureusement, la Mise en place g&#233;n&#233;ralis&#233;e du B.S.I. (Bilans de soins infirmiers) visant &#224; recenser tous les actes pratiqu&#233;s sur les patients et qui devrait faciliter leur prise en charge est syst&#233;matiquement repouss&#233;e.</p><p style=\"text-align: justify;\">Les comp&#233;tences r&#233;elles des infirmiers vont au-del&#224; des actes rembours&#233;s par la S&#233;curit&#233; Sociale, mais ne peuvent les proposer aux patients car ils se verraient alors dans l&#8217;obligation de les payer eux-m&#234;mes</p><p style=\"text-align: justify;\">Le futur Bilan de Soins Infirmiers (BSI) doit permettre de r&#233;mun&#233;rer les s&#233;ances de soins infirmiers en fonction de la charge en soins et non plus sur le crit&#232;re de la fameuse demi-heure minimale &#224; y consacrer.</p><p style=\"text-align: justify;\">Le BSI doit aussi servir de support de communication entre le m&#233;decin et l&#8217;infirmi&#232;re, et constituer un recueil de donn&#233;es comptables des actes infirmiers.</p><p style=\"text-align: justify;\">Dans son rapport au S&#233;nat de juillet 2014 sur les relations conventionnelles, la Cour des comptes pointait l&#8217;insuffisance de r&#233;sultats et ciblait entre autres le BSI&#160;: &#171;&#160;Malgr&#233; des stipulations en ce sens dans la convention de 2007, la d&#233;marche de soins infirmiers n&#8217;a pas encore &#233;t&#233; remplac&#233;e&#160;&#187;.</p><p style=\"text-align: justify;\">Nous devons aboutir le plus rapidement possible. Des gains d&#8217;efficience sont n&#233;cessaires au syst&#232;me de sant&#233;.</p>",
    "annexeExposeSommaire": {
      "@xmlns:xsi": "http://www.w3.org/2001/XMLSchema-instance",
      "@xsi:nil": "true"
    }
  },
  "representations": {
    "representation": {
      "nom": "PDF",
      "typeMime": {
        "type": "application",
        "subType": "PDF"
      },
      "statutRepresentation": {
        "verbatim": "true",
        "canonique": "true",
        "officielle": "true",
        "transcription": "false",
        "enregistrement": "false"
      },
      "repSource": {
        "@xmlns:xsi": "http://www.w3.org/2001/XMLSchema-instance",
        "@xsi:nil": "true"
      },
      "offset": {
        "@xmlns:xsi": "http://www.w3.org/2001/XMLSchema-instance",
        "@xsi:nil": "true"
      },
      "contenu": {
        "documentURI": "/15/amendements/1297/AN/427.pdf"
      },
      "dateDispoRepresentation": {
        "@xmlns:xsi": "http://www.w3.org/2001/XMLSchema-instance",
        "@xsi:nil": "true"
      }
    }
  },
  "seanceDiscussion": {
    "@xmlns:xsi": "http://www.w3.org/2001/XMLSchema-instance",
    "@xsi:nil": "true"
  },
  "sort": {
    "@xmlns:xsi": "http://www.w3.org/2001/XMLSchema-instance",
    "@xsi:nil": "true"
  },
  "dateDepot": "2018-10-18T02:00:00.000+02:00",
  "dateDistribution": {
    "@xmlns:xsi": "http://www.w3.org/2001/XMLSchema-instance",
    "@xsi:nil": "true"
  },
  "article99": "0",
  "loiReference": {
    "codeLoi": "c santé publique",
    "divisionCodeLoi": "L4311-1-1"
  }
}