{
  "@xmlns": "http://schemas.assemblee-nationale.fr/referentiel",
  "uid": "AMANR5L15SEA717460B1297P0D1N749",
  "identifiant": {
    "legislature": "15",
    "numero": "749",
    "numRect": "0",
    "saisine": {
      "refTexteLegislatif": "PRJLANR5L15B1297",
      "numeroPartiePLF": "0",
      "organeExamen": "PO717460",
      "mentionSecondeDeliberation": "0"
    }
  },
  "numeroLong": "749",
  "etapeTexte": "1ère lecture (1ère assemblée saisie)",
  "triAmendement": "epaaaaaaaaaaaaaaaaaaaaaaaaaaaaaaaaaaaaaaaaaaaaaaaaaws",
  "cardinaliteAmdtMultiples": "1",
  "amendementParent": {
    "@xmlns:xsi": "http://www.w3.org/2001/XMLSchema-instance",
    "@xsi:nil": "true"
  },
  "etat": "Irrecevable",
  "signataires": {
    "auteur": {
      "typeAuteur": "Depute",
      "acteurRef": "PA719540",
      "organeRef": {
        "@xmlns:xsi": "http://www.w3.org/2001/XMLSchema-instance",
        "@xsi:nil": "true"
      },
      "groupePolitiqueRef": "PO730964"
    },
    "cosignataires": {
      "acteurRef": "PA719540"
    },
    "texteAffichable": "Mme&#160;Toutut-Picard"
  },
  "pointeurFragmentTexte": {
    "missionVisee": {
      "@xmlns:xsi": "http://www.w3.org/2001/XMLSchema-instance",
      "@xsi:nil": "true"
    },
    "division": {
      "titre": "Article 29",
      "articleDesignationCourte": "APRÈS ART. 29",
      "type": "ARTICLE",
      "avant_A_Apres": "Après",
      "divisionRattachee": "APRÈS L'ARTICLE 29, insérer l'article suivant:",
      "articleAdditionnel": "1",
      "chapitreAdditionnel": {
        "@xmlns:xsi": "http://www.w3.org/2001/XMLSchema-instance",
        "@xsi:nil": "true"
      },
      "urlDivisionTexteVise": "/15/textes/1297.asp#D_Article_29"
    },
    "alinea": {
      "@xmlns:xsi": "http://www.w3.org/2001/XMLSchema-instance",
      "@xsi:nil": "true"
    }
  },
  "corps": {
    "dispositif": "<p style=\"text-align: justify;\">Apr&#232;s le 3&#176; du I de l&#8217;article&#160;14 de la loi n&#176; 94&#8209;628 du 25 juillet 1994 relative &#224; l&#8217;organisation du temps de travail, aux recrutements et aux mutations dans la fonction publique, il est ins&#233;r&#233; un 4&#176; ainsi r&#233;dig&#233;&#160;:</p><p style=\"text-align: justify;\">&#171;&#160;4&#176; Les charges r&#233;sultant, pour les &#233;tablissements mentionn&#233;s &#224; l&#8217;article&#160;2 de la loi n&#176; 86&#8209;33 du 9&#160;janvier 1986, de la connexion au dispositif pr&#233;vu par l&#8217;article&#160;2 de l&#8217;ordonnance n&#176;2017&#8209;543 du 13&#160;avril 2017&#160;portant dispositions statutaires relatives &#224; la fonction publique hospitali&#232;re&#160;&#187;.</p>",
    "exposeSommaire": "<p style=\"text-align: justify;\">L&#8217;article&#160;2 de l&#8217;ordonnance n&#176;2017&#8209;543 du 13 avril 2017 sur la mobilit&#233; pr&#233;voit une plus grande accessibilit&#233; des cr&#233;ations ou des vacances de postes au sein d&#8217;un espace num&#233;rique commun aux trois versants de la fonction publique.</p><p style=\"text-align: justify;\">Cette nouvelle obligation aura un co&#251;t pour les &#233;tablissements de sant&#233;, sociaux et m&#233;dico-sociaux, qu&#8217;il s&#8217;agit de compenser.</p><p style=\"text-align: justify;\">L&#8217;amendement permet de mobiliser le fonds pour l&#8217;emploi hospitalier afin de compenser le surco&#251;t induit directement aupr&#232;s de chaque &#233;tablissement concern&#233;.</p>",
    "annexeExposeSommaire": {
      "@xmlns:xsi": "http://www.w3.org/2001/XMLSchema-instance",
      "@xsi:nil": "true"
    }
  },
  "representations": {
    "representation": {
      "nom": "PDF",
      "typeMime": {
        "type": "application",
        "subType": "PDF"
      },
      "statutRepresentation": {
        "verbatim": "true",
        "canonique": "true",
        "officielle": "true",
        "transcription": "false",
        "enregistrement": "false"
      },
      "repSource": {
        "@xmlns:xsi": "http://www.w3.org/2001/XMLSchema-instance",
        "@xsi:nil": "true"
      },
      "offset": {
        "@xmlns:xsi": "http://www.w3.org/2001/XMLSchema-instance",
        "@xsi:nil": "true"
      },
      "contenu": {
        "documentURI": "/15/amendements/1297/AN/749.pdf"
      },
      "dateDispoRepresentation": {
        "@xmlns:xsi": "http://www.w3.org/2001/XMLSchema-instance",
        "@xsi:nil": "true"
      }
    }
  },
  "seanceDiscussion": {
    "@xmlns:xsi": "http://www.w3.org/2001/XMLSchema-instance",
    "@xsi:nil": "true"
  },
  "sort": {
    "@xmlns:xsi": "http://www.w3.org/2001/XMLSchema-instance",
    "@xsi:nil": "true"
  },
  "dateDepot": "2018-10-18T02:00:00.000+02:00",
  "dateDistribution": {
    "@xmlns:xsi": "http://www.w3.org/2001/XMLSchema-instance",
    "@xsi:nil": "true"
  },
  "article99": "0",
  "loiReference": {
    "codeLoi": "loi 94-628",
    "divisionCodeLoi": "14"
  }
}