{
  "@xmlns": "http://schemas.assemblee-nationale.fr/referentiel",
  "uid": "AMANR5L15SEA717460BTC1019P0D1N748",
  "identifiant": {
    "legislature": "15",
    "numero": "748",
    "numRect": "0",
    "saisine": {
      "refTexteLegislatif": "PRJLANR5L15BTC1019",
      "numeroPartiePLF": "0",
      "organeExamen": "PO717460",
      "mentionSecondeDeliberation": "0"
    }
  },
  "numeroLong": "748",
  "etapeTexte": "1ère lecture (1ère assemblée saisie)",
  "triAmendement": "khxvzzzzrw",
  "cardinaliteAmdtMultiples": "1",
  "amendementParent": {
    "@xmlns:xsi": "http://www.w3.org/2001/XMLSchema-instance",
    "@xsi:nil": "true"
  },
  "etat": "Discuté",
  "signataires": {
    "auteur": {
      "typeAuteur": "Depute",
      "acteurRef": "PA267766",
      "organeRef": {
        "@xmlns:xsi": "http://www.w3.org/2001/XMLSchema-instance",
        "@xsi:nil": "true"
      },
      "groupePolitiqueRef": "PO744425"
    },
    "cosignataires": {
      "acteurRef": "PA267766"
    },
    "texteAffichable": "M.&#160;Guy&#160;Bricout"
  },
  "pointeurFragmentTexte": {
    "missionVisee": {
      "@xmlns:xsi": "http://www.w3.org/2001/XMLSchema-instance",
      "@xsi:nil": "true"
    },
    "division": {
      "titre": "Article 10",
      "articleDesignationCourte": "ART. 10",
      "type": "ARTICLE",
      "avant_A_Apres": "A",
      "divisionRattachee": "ARTICLE 10",
      "articleAdditionnel": {
        "@xmlns:xsi": "http://www.w3.org/2001/XMLSchema-instance",
        "@xsi:nil": "true"
      },
      "chapitreAdditionnel": {
        "@xmlns:xsi": "http://www.w3.org/2001/XMLSchema-instance",
        "@xsi:nil": "true"
      },
      "urlDivisionTexteVise": "/15/textes/1019.asp#D_Article_10"
    },
    "alinea": {
      "avant_A_Apres": "Apres",
      "numero": "9",
      "alineaDesignation": {
        "@xmlns:xsi": "http://www.w3.org/2001/XMLSchema-instance",
        "@xsi:nil": "true"
      }
    }
  },
  "corps": {
    "dispositif": "<p style=\"text-align: justify;\">Apr&#232;s l&#8217;alin&#233;a&#160;9, ins&#233;rer l&#8217;alin&#233;a suivant&#160;:</p><p style=\"text-align: justify;\">&#171;&#160;3&#176; &#192; l&#8217;article L.&#160;332&#8209;3&#8209;1, apr&#232;s le mot&#160;: &#171;&#160;lyc&#233;es&#160;&#187;, sont ins&#233;r&#233;s les mots&#160;: &#171;&#160;ou aux &#233;tudiants de l&#8217;enseignement sup&#233;rieur&#160;&#187;.&#160;&#187;</p>",
    "exposeSommaire": "<p style=\"text-align: justify;\">La loi n&#176; 2011&#8209;893 du 28 juillet 2011 pour le d&#233;veloppement de l&#8217;alternance et la s&#233;curisation des parcours professionnels a cr&#233;&#233; la possibilit&#233; pour les scolaires de r&#233;aliser des p&#233;riodes d&#8217;observation en milieu professionnel d&#8217;une semaine en entreprise durant leurs vacances scolaires afin de les aider dans l&#8217;&#233;laboration de leur projet d&#8217;orientation professionnelle. Ces stages sont mis en &#339;uvre avec l&#8217;appui des chambres consulaires et rencontrent un vif succ&#232;s aupr&#232;s des jeunes et des entreprises qui pl&#233;biscitent cet outil pour aider les jeunes dans la construction de leur orientation.</p><p style=\"text-align: justify;\">Toutefois, les &#233;tudiants ne peuvent b&#233;n&#233;ficier de cette possibilit&#233; et ce alors m&#234;me qu&#8217;ils sont de plus en plus nombreux &#224; vouloir se r&#233;orienter en cours d&#8217;ann&#233;e universitaire et que leur projet d&#8217;orientation professionnelle reste encore bien souvent &#224; d&#233;finir ou &#224; confirmer.</p><p style=\"text-align: justify;\">Cet amendement a donc pour objet d&#8217;ouvrir la possibilit&#233; de recours aux stages pr&#233;vus &#224; l&#8217;article L.&#160;332&#8209;3&#8209;1 du code de l&#8217;&#233;ducation aux &#233;tudiants inscrits dans un cursus d&#8217;enseignement sup&#233;rieur.</p>",
    "annexeExposeSommaire": {
      "@xmlns:xsi": "http://www.w3.org/2001/XMLSchema-instance",
      "@xsi:nil": "true"
    }
  },
  "representations": {
    "representation": {
      "nom": "PDF",
      "typeMime": {
        "type": "application",
        "subType": "PDF"
      },
      "statutRepresentation": {
        "verbatim": "true",
        "canonique": "true",
        "officielle": "true",
        "transcription": "false",
        "enregistrement": "false"
      },
      "repSource": {
        "@xmlns:xsi": "http://www.w3.org/2001/XMLSchema-instance",
        "@xsi:nil": "true"
      },
      "offset": {
        "@xmlns:xsi": "http://www.w3.org/2001/XMLSchema-instance",
        "@xsi:nil": "true"
      },
      "contenu": {
        "documentURI": "/15/amendements/1019/AN/748.pdf"
      },
      "dateDispoRepresentation": {
        "@xmlns:xsi": "http://www.w3.org/2001/XMLSchema-instance",
        "@xsi:nil": "true"
      }
    }
  },
  "seanceDiscussion": "RUANR5L15S2018IDS21103",
  "sort": {
    "dateSaisie": "2018-06-14T22:58:19.000+02:00",
    "sortEnSeance": "Non soutenu"
  },
  "dateDepot": "2018-06-06T02:00:00.000+02:00",
  "dateDistribution": "2018-06-11T02:00:00.000+02:00",
  "article99": "0",
  "loiReference": {
    "codeLoi": {
      "@xmlns:xsi": "http://www.w3.org/2001/XMLSchema-instance",
      "@xsi:nil": "true"
    },
    "divisionCodeLoi": {
      "@xmlns:xsi": "http://www.w3.org/2001/XMLSchema-instance",
      "@xsi:nil": "true"
    }
  }
}