{
  "@xmlns": "http://schemas.assemblee-nationale.fr/referentiel",
  "uid": "AMANR5L15SEA717460BTC1237P0D1N1506",
  "identifiant": {
    "legislature": "15",
    "numero": "1506",
    "numRect": "0",
    "saisine": {
      "refTexteLegislatif": "PRJLANR5L15BTC1237",
      "numeroPartiePLF": "0",
      "organeExamen": "PO717460",
      "mentionSecondeDeliberation": "0"
    }
  },
  "numeroLong": "1506",
  "etapeTexte": "1ère lecture (1ère assemblée saisie)",
  "triAmendement": "aeoaaaaaaaaaaaaaaaaaaaaaaaaaaaaaaaaaaaaaaaaaaaaaaaaxi",
  "cardinaliteAmdtMultiples": "1",
  "amendementParent": {
    "@xmlns:xsi": "http://www.w3.org/2001/XMLSchema-instance",
    "@xsi:nil": "true"
  },
  "etat": "Retiré",
  "signataires": {
    "auteur": {
      "typeAuteur": "Depute",
      "acteurRef": "PA721542",
      "organeRef": {
        "@xmlns:xsi": "http://www.w3.org/2001/XMLSchema-instance",
        "@xsi:nil": "true"
      },
      "groupePolitiqueRef": "PO730964"
    },
    "cosignataires": {
      "acteurRef": [
        "PA719024",
        "PA721624",
        "PA719972",
        "PA721398",
        "PA719302",
        "PA719952",
        "PA720538",
        "PA720402",
        "PA718990",
        "PA677483",
        "PA722000",
        "PA267673",
        "PA722366",
        "PA721584",
        "PA718768",
        "PA721336",
        "PA721542",
        "PA722292",
        "PA718710",
        "PA722008",
        "PA722178"
      ]
    },
    "texteAffichable": "Mme&#160;Verdier-Jouclas,  M.&#160;Mazars, M.&#160;Terlier, Mme&#160;Avia, Mme&#160;Blanc, M.&#160;Blanchet, M.&#160;Folliot, Mme&#160;Pascale&#160;Boyer, Mme&#160;Brocard, M.&#160;Buchou, Mme&#160;Degois, Mme&#160;De Temmerman, M.&#160;Fugit, Mme&#160;Leguille-Balloy, M.&#160;Maire, M.&#160;Mis, M.&#160;Paluszkiewicz, M.&#160;Rudigoz, Mme&#160;Sarles, Mme&#160;Thourot et Mme&#160;Valetta Ardisson"
  },
  "pointeurFragmentTexte": {
    "missionVisee": {
      "@xmlns:xsi": "http://www.w3.org/2001/XMLSchema-instance",
      "@xsi:nil": "true"
    },
    "division": {
      "titre": "Article 6",
      "articleDesignationCourte": "ART. 6",
      "type": "ARTICLE",
      "avant_A_Apres": "A",
      "divisionRattachee": "ARTICLE 6",
      "articleAdditionnel": {
        "@xmlns:xsi": "http://www.w3.org/2001/XMLSchema-instance",
        "@xsi:nil": "true"
      },
      "chapitreAdditionnel": {
        "@xmlns:xsi": "http://www.w3.org/2001/XMLSchema-instance",
        "@xsi:nil": "true"
      },
      "urlDivisionTexteVise": "/15/textes/1237.asp#D_Article_6"
    },
    "alinea": {
      "avant_A_Apres": {
        "@xmlns:xsi": "http://www.w3.org/2001/XMLSchema-instance",
        "@xsi:nil": "true"
      },
      "numero": "10",
      "alineaDesignation": {
        "@xmlns:xsi": "http://www.w3.org/2001/XMLSchema-instance",
        "@xsi:nil": "true"
      }
    }
  },
  "corps": {
    "dispositif": "<p style=\"text-align: justify;\">Compl&#233;ter l&#8217;alin&#233;a&#160;10 par la phrase suivante&#160;:</p><p style=\"text-align: justify;\">&#171;&#160;Toutefois, en cas de nouveau franchissement &#224; la hausse d&#8217;un seuil d&#8217;effectif salari&#233; moins de dix-huit mois apr&#232;s le franchissement &#224; la baisse, le b&#233;n&#233;fice de la r&#232;gle &#233;nonc&#233;e pr&#233;c&#233;demment est perdu, pour une p&#233;riode de dix ann&#233;es civiles cons&#233;cutives.&#160;&#187;</p>",
    "exposeSommaire": "<p style=\"text-align: justify;\">Cet amendement vise &#224; limiter les risques de l&#8217;abus par les chefs d&#8217;entreprise de cette r&#232;gle qui permettra in fine tous les quatre ans &#224; quatre ans et demi de faire varier son effectif pour ne pas avoir, jamais, &#224; satisfaire aux obligations l&#233;gales li&#233;es au franchissement d&#8217;un seuil.</p><p style=\"text-align: justify;\">Il n&#8217;est pas impensable de voir certains chefs d&#8217;entreprises jouer au Yoyo tous les cinq ans, user et abuser de ce cycle cinq ans plus un an pour pouvoir pour une ann&#233;e d&#8217;effectif diminu&#233; d&#8217;un ou quel qu&#8217;uns b&#233;n&#233;ficier de fa&#231;on p&#233;renne de l&#8217;avantage d&#8217;appr&#233;ciation quinquennale du seuil.</p><p style=\"text-align: justify;\">Cet amendement vise donc &#224; limiter les risques de contournement d&#8217;une r&#232;gle incitative &#224; l&#8217;embauche.&#160;</p>",
    "annexeExposeSommaire": {
      "@xmlns:xsi": "http://www.w3.org/2001/XMLSchema-instance",
      "@xsi:nil": "true"
    }
  },
  "representations": {
    "representation": {
      "nom": "PDF",
      "typeMime": {
        "type": "application",
        "subType": "PDF"
      },
      "statutRepresentation": {
        "verbatim": "true",
        "canonique": "true",
        "officielle": "true",
        "transcription": "false",
        "enregistrement": "false"
      },
      "repSource": {
        "@xmlns:xsi": "http://www.w3.org/2001/XMLSchema-instance",
        "@xsi:nil": "true"
      },
      "offset": {
        "@xmlns:xsi": "http://www.w3.org/2001/XMLSchema-instance",
        "@xsi:nil": "true"
      },
      "contenu": {
        "documentURI": "/15/amendements/1237/AN/1506.pdf"
      },
      "dateDispoRepresentation": {
        "@xmlns:xsi": "http://www.w3.org/2001/XMLSchema-instance",
        "@xsi:nil": "true"
      }
    }
  },
  "seanceDiscussion": {
    "@xmlns:xsi": "http://www.w3.org/2001/XMLSchema-instance",
    "@xsi:nil": "true"
  },
  "sort": {
    "@xmlns:xsi": "http://www.w3.org/2001/XMLSchema-instance",
    "@xsi:nil": "true"
  },
  "dateDepot": "2018-09-20T02:00:00.000+02:00",
  "dateDistribution": "2018-09-24T02:00:00.000+02:00",
  "article99": "0",
  "loiReference": {
    "codeLoi": {
      "@xmlns:xsi": "http://www.w3.org/2001/XMLSchema-instance",
      "@xsi:nil": "true"
    },
    "divisionCodeLoi": {
      "@xmlns:xsi": "http://www.w3.org/2001/XMLSchema-instance",
      "@xsi:nil": "true"
    }
  }
}