{
  "@xmlns": "http://schemas.assemblee-nationale.fr/referentiel",
  "uid": "AMANR5L15SEA717460BTC2062P0D1N223",
  "identifiant": {
    "legislature": "15",
    "numero": "223",
    "numRect": "0",
    "saisine": {
      "refTexteLegislatif": "PIONANR5L15BTC2062",
      "numeroPartiePLF": "0",
      "organeExamen": "PO717460",
      "mentionSecondeDeliberation": "0"
    }
  },
  "numeroLong": "223",
  "etapeTexte": "1ère lecture (1ère assemblée saisie)",
  "triAmendement": "kaaaaaaaaaaaaaaaaaaaaaaaaaaaaaaaaaaaaaaaaaaaaaaaaau",
  "cardinaliteAmdtMultiples": "1",
  "amendementParent": {
    "@xmlns:xsi": "http://www.w3.org/2001/XMLSchema-instance",
    "@xsi:nil": "true"
  },
  "etat": "Irrecevable",
  "signataires": {
    "auteur": {
      "typeAuteur": "Depute",
      "acteurRef": "PA267450",
      "organeRef": {
        "@xmlns:xsi": "http://www.w3.org/2001/XMLSchema-instance",
        "@xsi:nil": "true"
      },
      "groupePolitiqueRef": "PO730934"
    },
    "cosignataires": {
      "acteurRef": [
        "PA334843",
        "PA642847",
        "PA719318",
        "PA267735",
        "PA709315",
        "PA720210",
        "PA340853",
        "PA720630",
        "PA2377",
        "PA2155",
        "PA767",
        "PA334654",
        "PA721678",
        "PA713448",
        "PA721070",
        "PA346054",
        "PA267440",
        "PA608826",
        "PA2086",
        "PA856",
        "PA330240",
        "PA266776",
        "PA609726",
        "PA332523",
        "PA721474",
        "PA719946",
        "PA1874",
        "PA719272",
        "PA608016",
        "PA718884",
        "PA346218",
        "PA334149",
        "PA712015",
        "PA266774",
        "PA267527",
        "PA721286",
        "PA330008",
        "PA1012",
        "PA718784",
        "PA605991",
        "PA608416",
        "PA605036",
        "PA267450",
        "PA267318",
        "PA267324",
        "PA606712",
        "PA267260",
        "PA267204"
      ]
    },
    "texteAffichable": "M.&#160;R&#233;mi&#160;Delatte,  M.&#160;Abad, Mme&#160;Anthoine, M.&#160;Aubert, M.&#160;Bazin, Mme&#160;Bazin-Malgras, Mme&#160;Beauvais, Mme&#160;Brenier, M.&#160;Breton, M.&#160;Cattin, M.&#160;Cherpion, M.&#160;Ciotti, Mme&#160;Dalloz, M.&#160;de Ganay, M.&#160;de la Verpilli&#232;re, M.&#160;Diard, M.&#160;Dive, Mme&#160;Duby-Muller, M.&#160;Fasquelle, M.&#160;Furst, M.&#160;Gaultier, Mme&#160;Genevard, M.&#160;Grelier, M.&#160;Hetzel, M.&#160;Le Fur, M.&#160;Leclerc, Mme&#160;Louwagie, M.&#160;Lurton, M.&#160;Emmanuel&#160;Maquet, M.&#160;Marlin, M.&#160;Masson, M.&#160;Menuel, Mme&#160;Meunier, M.&#160;Minot, M.&#160;Pauget, M.&#160;Peltier, M.&#160;Perrut, Mme&#160;Poletti, M.&#160;Ramadier, Mme&#160;Ramassamy, M.&#160;Reda, M.&#160;Reiss, M.&#160;Saddier, M.&#160;Sermier, M.&#160;Straumann, M.&#160;Verch&#232;re, M.&#160;Viala et M.&#160;Viry"
  },
  "pointeurFragmentTexte": {
    "missionVisee": {
      "@xmlns:xsi": "http://www.w3.org/2001/XMLSchema-instance",
      "@xsi:nil": "true"
    },
    "division": {
      "titre": "Article 6 ter",
      "articleDesignationCourte": "APRÈS ART. 6 TER",
      "type": "ARTICLE",
      "avant_A_Apres": "Après",
      "divisionRattachee": "APRÈS L'ARTICLE 6 TER, insérer l'article suivant:",
      "articleAdditionnel": "1",
      "chapitreAdditionnel": {
        "@xmlns:xsi": "http://www.w3.org/2001/XMLSchema-instance",
        "@xsi:nil": "true"
      },
      "urlDivisionTexteVise": "/15/textes/2062.asp#D_Article_6_ter"
    },
    "alinea": {
      "@xmlns:xsi": "http://www.w3.org/2001/XMLSchema-instance",
      "@xsi:nil": "true"
    }
  },
  "corps": {
    "exposeSommaire": {
      "@xmlns:xsi": "http://www.w3.org/2001/XMLSchema-instance",
      "@xsi:nil": "true"
    },
    "annexeExposeSommaire": {
      "@xmlns:xsi": "http://www.w3.org/2001/XMLSchema-instance",
      "@xsi:nil": "true"
    },
    "cartoucheDelaiDepotDepasse": {
      "@xmlns:xsi": "http://www.w3.org/2001/XMLSchema-instance",
      "@xsi:nil": "true"
    }
  },
  "representations": {
    "representation": {
      "nom": "PDF",
      "typeMime": {
        "type": "application",
        "subType": "PDF"
      },
      "statutRepresentation": {
        "verbatim": "true",
        "canonique": "true",
        "officielle": "true",
        "transcription": "false",
        "enregistrement": "false"
      },
      "repSource": {
        "@xmlns:xsi": "http://www.w3.org/2001/XMLSchema-instance",
        "@xsi:nil": "true"
      },
      "offset": {
        "@xmlns:xsi": "http://www.w3.org/2001/XMLSchema-instance",
        "@xsi:nil": "true"
      },
      "contenu": {
        "documentURI": "/15/amendements/2062/AN/223.pdf"
      },
      "dateDispoRepresentation": {
        "@xmlns:xsi": "http://www.w3.org/2001/XMLSchema-instance",
        "@xsi:nil": "true"
      }
    }
  },
  "seanceDiscussion": {
    "@xmlns:xsi": "http://www.w3.org/2001/XMLSchema-instance",
    "@xsi:nil": "true"
  },
  "sort": {
    "@xmlns:xsi": "http://www.w3.org/2001/XMLSchema-instance",
    "@xsi:nil": "true"
  },
  "dateDepot": "2019-06-28T02:00:00.000+02:00",
  "dateDistribution": "2019-06-29T02:00:00.000+02:00",
  "article99": "0",
  "loiReference": {
    "codeLoi": {
      "@xmlns:xsi": "http://www.w3.org/2001/XMLSchema-instance",
      "@xsi:nil": "true"
    },
    "divisionCodeLoi": {
      "@xmlns:xsi": "http://www.w3.org/2001/XMLSchema-instance",
      "@xsi:nil": "true"
    }
  }
}