{
  "@xmlns": "http://schemas.assemblee-nationale.fr/referentiel",
  "uid": "AMANR5L15SEA717460B2272P2D1N59",
  "identifiant": {
    "legislature": "15",
    "numero": "59",
    "numRect": "0",
    "saisine": {
      "refTexteLegislatif": "PRJLANR5L15B2272",
      "numeroPartiePLF": "2",
      "organeExamen": "PO717460",
      "mentionSecondeDeliberation": "0"
    }
  },
  "numeroLong": "II-59",
  "etapeTexte": "1ère lecture (1ère assemblée saisie)",
  "triAmendement": "bdoaaaaaaaaaaaaaaaaaaaaaaaaaaaaaaaaaaaaaaaaaaaaaaaabknu",
  "cardinaliteAmdtMultiples": "1",
  "amendementParent": {
    "@xmlns:xsi": "http://www.w3.org/2001/XMLSchema-instance",
    "@xsi:nil": "true"
  },
  "etat": "Discuté",
  "signataires": {
    "auteur": {
      "typeAuteur": "Depute",
      "acteurRef": "PA718780",
      "organeRef": {
        "@xmlns:xsi": "http://www.w3.org/2001/XMLSchema-instance",
        "@xsi:nil": "true"
      },
      "groupePolitiqueRef": "PO730934"
    },
    "cosignataires": {
      "acteurRef": "PA718780"
    },
    "texteAffichable": "Mme&#160;Trastour-Isnart"
  },
  "pointeurFragmentTexte": {
    "missionVisee": {
      "idMissionAN": "825",
      "libelleMission": "Santé",
      "codeMissionPLF": "B",
      "libelleMissionPLF": "Répartition, par mission et programme, des crédits du budget général"
    },
    "division": {
      "titre": "Article 78",
      "articleDesignationCourte": "APRÈS ART. 78",
      "type": "ARTICLE",
      "avant_A_Apres": "Après",
      "divisionRattachee": "APRÈS L'ARTICLE 78, insérer l'article suivant:",
      "articleAdditionnel": "1",
      "chapitreAdditionnel": {
        "@xmlns:xsi": "http://www.w3.org/2001/XMLSchema-instance",
        "@xsi:nil": "true"
      },
      "urlDivisionTexteVise": "/15/textes/2272C.asp#D_Article_78"
    },
    "alinea": {
      "@xmlns:xsi": "http://www.w3.org/2001/XMLSchema-instance",
      "@xsi:nil": "true"
    }
  },
  "corps": {
    "dispositif": "<p style=\"text-align: justify;\">I. &#8211;&#160; La section II du chapitre II du titre IV de la premi&#232;re partie du code g&#233;n&#233;ral des imp&#244;ts est compl&#233;t&#233;e par un VII ainsi r&#233;dig&#233;&#160;:</p><p style=\"text-align: justify;\">&#171;&#160;VII&#160;: Aide m&#233;dicale d&#8217;&#201;tat&#160;</p><p style=\"text-align: justify;\">&#171;&#160;Art.&#160;963 <i>bis</i>. &#8211; Le droit aux prestations mentionn&#233;es &#224; l&#8217;article L.&#160;251&#8209;2 du code de l&#8217;action sociale et des familles est conditionn&#233; au paiement d&#8217;un droit annuel par b&#233;n&#233;ficiaire majeur, dont le montant est fix&#233; par d&#233;cret.&#160;&#187;</p><p style=\"text-align: justify;\">II.&#160; &#8213; Au premier alin&#233;a de l&#8217;article L.&#160;251&#8209;1&#160; du code de l&#8217;action sociale et des familles, apr&#232;s le mot&#160;: &#171;&#160;&#201;tat&#160;&#187;, sont ins&#233;r&#233;s les mots&#160;: &#171;&#160;, sous r&#233;serve, s&#8217;il est majeur, de s&#8217;&#234;tre acquitt&#233;, &#224; son propre titre et au titre des personnes majeures &#224; sa charge, du droit annuel mentionn&#233; &#224; l&#8217;article&#160;963 <i>bis</i> du code g&#233;n&#233;ral des imp&#244;ts,&#160;&#187;.</p><p style=\"text-align: justify;\">III.&#160; &#8213; Le I et le II entrent en vigueur &#224; compter du 1<sup>er</sup> janvier 2020.</p>",
    "exposeSommaire": "<p style=\"text-align: justify;\">Cet amendement de repli a pour objet de r&#233;tablir un droit de timbre annuel devant &#234;tre acquitt&#233; par tous les demandeurs de l&#8217;Aide m&#233;dicale d&#8217;&#201;tat (AME) de droit commun afin de pouvoir b&#233;n&#233;ficier du dispositif. Ce droit de timbre, introduit en loi de finances pour 2011, a &#233;t&#233; supprim&#233; en loi de finances rectificative pour 2012. Le montant de ce droit correspondrait au montant du droit de timbre pr&#233;vu &#224; l&#8217;article&#160;960 du code g&#233;n&#233;ral des imp&#244;t d&#8217;une valeur actuelle de 55&#160;euros.</p><p style=\"text-align: justify;\">Depuis la suppression du droit de timbre, force est de constater que la d&#233;pense d&#8217;AME n&#8217;est pas ma&#238;tris&#233;e. Le nombre trimestriel moyen de b&#233;n&#233;ficiaires de l&#8217;AME a augment&#233; de 50&#160;% entre 2009 (210 000 b&#233;n&#233;ficiaires) et 2020 (316 000 b&#233;n&#233;ficiaires). Son budget allou&#233; repr&#233;sente pr&#232;s d&#8217;un milliard d&#8217;euros.</p><p style=\"text-align: justify;\">Ce rythme de progression n&#8217;est pas soutenable d&#8217;un point de vue financier. En l&#8217;absence d&#8217;une r&#233;elle politique de gestion des flux migratoires, une r&#233;forme de l&#8217;AME parait d&#233;sormais indispensable pour assurer la soutenabilit&#233; des d&#233;penses.</p><p style=\"text-align: justify;\">Le r&#233;tablissement d&#8217;un droit annuel forfaitaire constituerait une premi&#232;re avanc&#233;e en vue de cette r&#233;forme et pr&#233;senterait deux avantages majeurs&#160;:</p><p style=\"text-align: justify;\">-&#160; en premier lieu, il s&#8217;agirait d&#8217;une mesure symbolique forte, garantissant que les personnes en situation irr&#233;guli&#232;re participent &#224; leur couverture sociale, alors m&#234;me que cette derni&#232;re n&#233;cessite un effort de solidarit&#233; nationale&#160;;</p><p style=\"text-align: justify;\">&#160;-&#160; en second lieu, le droit de timbre constituerait une recette financi&#232;re non n&#233;gligeable dans un contexte d&#8217;attrition des cr&#233;dits d&#233;volus aux autres programmes de la mission &#171;&#160;Sant&#233;&#160;&#187;.</p>",
    "annexeExposeSommaire": {
      "@xmlns:xsi": "http://www.w3.org/2001/XMLSchema-instance",
      "@xsi:nil": "true"
    },
    "cartoucheDelaiDepotDepasse": {
      "@xmlns:xsi": "http://www.w3.org/2001/XMLSchema-instance",
      "@xsi:nil": "true"
    },
    "avantAppel": {
      "@xmlns:xsi": "http://www.w3.org/2001/XMLSchema-instance",
      "@xsi:nil": "true"
    }
  },
  "representations": {
    "representation": {
      "nom": "PDF",
      "typeMime": {
        "type": "application",
        "subType": "PDF"
      },
      "statutRepresentation": {
        "verbatim": "true",
        "canonique": "true",
        "officielle": "true",
        "transcription": "false",
        "enregistrement": "false"
      },
      "repSource": {
        "@xmlns:xsi": "http://www.w3.org/2001/XMLSchema-instance",
        "@xsi:nil": "true"
      },
      "offset": {
        "@xmlns:xsi": "http://www.w3.org/2001/XMLSchema-instance",
        "@xsi:nil": "true"
      },
      "contenu": {
        "documentURI": "/15/amendements/2272C/AN/59.pdf"
      },
      "dateDispoRepresentation": {
        "@xmlns:xsi": "http://www.w3.org/2001/XMLSchema-instance",
        "@xsi:nil": "true"
      }
    }
  },
  "seanceDiscussion": "RUANR5L15S2020IDS21908",
  "sort": {
    "dateSaisie": "2019-11-07T16:33:21.000+01:00",
    "sortEnSeance": "Rejeté"
  },
  "dateDepot": "2019-10-22T02:00:00.000+02:00",
  "dateDistribution": "2019-11-07T01:00:00.000+01:00",
  "article99": "0",
  "loiReference": {
    "codeLoi": "CGI",
    "divisionCodeLoi": "936 bis"
  }
}