{
  "@xmlns": "http://schemas.assemblee-nationale.fr/referentiel",
  "uid": "AMANR5L15PO766718B2187P0D1N1432",
  "identifiant": {
    "legislature": "15",
    "numero": "1432",
    "numRect": "0",
    "saisine": {
      "refTexteLegislatif": "PRJLANR5L15B2187",
      "numeroPartiePLF": "0",
      "organeExamen": "PO766718",
      "mentionSecondeDeliberation": "0"
    }
  },
  "numeroLong": "1432",
  "etapeTexte": "1ère lecture (1ère assemblée saisie)",
  "triAmendement": "icaaaaaaaaaaaaaaaaaaaaaaaaaaaaaaaaaaaaaaaaaaaaaaaaxfi",
  "cardinaliteAmdtMultiples": "1",
  "amendementParent": {
    "@xmlns:xsi": "http://www.w3.org/2001/XMLSchema-instance",
    "@xsi:nil": "true"
  },
  "etat": "Discuté",
  "signataires": {
    "auteur": {
      "typeAuteur": "Depute",
      "acteurRef": "PA722252",
      "organeRef": {
        "@xmlns:xsi": "http://www.w3.org/2001/XMLSchema-instance",
        "@xsi:nil": "true"
      },
      "groupePolitiqueRef": "PO730964"
    },
    "cosignataires": {
      "acteurRef": [
        "PA719632",
        "PA719728",
        "PA718860",
        "PA721656",
        "PA719520",
        "PA721296",
        "PA720806",
        "PA722252",
        "PA719448",
        "PA719624",
        "PA719558"
      ]
    },
    "texteAffichable": "Mme&#160;Rixain,  Mme&#160;Gayte, Mme&#160;Chapelier, M.&#160;Le Bohec, M.&#160;Gouffier-Cha, M.&#160;Balanant, M.&#160;Nogal, Mme&#160;Taurine, Mme&#160;Couillard, Mme&#160;Panonacle et Mme&#160;Muschotti"
  },
  "pointeurFragmentTexte": {
    "missionVisee": {
      "@xmlns:xsi": "http://www.w3.org/2001/XMLSchema-instance",
      "@xsi:nil": "true"
    },
    "division": {
      "titre": "Article 21",
      "articleDesignationCourte": "ART. 21",
      "type": "ARTICLE",
      "avant_A_Apres": "A",
      "divisionRattachee": "ARTICLE 21",
      "articleAdditionnel": {
        "@xmlns:xsi": "http://www.w3.org/2001/XMLSchema-instance",
        "@xsi:nil": "true"
      },
      "chapitreAdditionnel": {
        "@xmlns:xsi": "http://www.w3.org/2001/XMLSchema-instance",
        "@xsi:nil": "true"
      },
      "urlDivisionTexteVise": "/15/textes/2187.asp#D_Article_21"
    },
    "alinea": {
      "avant_A_Apres": {
        "@xmlns:xsi": "http://www.w3.org/2001/XMLSchema-instance",
        "@xsi:nil": "true"
      },
      "numero": "10",
      "alineaDesignation": {
        "@xmlns:xsi": "http://www.w3.org/2001/XMLSchema-instance",
        "@xsi:nil": "true"
      }
    }
  },
  "corps": {
    "dispositif": "<p>R&#233;diger ainsi l&#8217;alin&#233;a&#160;10&#160;:</p><p style=\"text-align: justify;\">&#171;&#160;<i>Art.&#160;L.&#160;2213&#8209;2-2</i>&#160;&#8211;&#160;L&#8217;article L.&#160;2212&#8209;8 est applicable &#224; l&#8217;interruption volontaire de la grossesse pratiqu&#233;e pour motif m&#233;dical.&#160;&#187;</p>",
    "exposeSommaire": "<p>En r&#233;digeant compl&#232;tement l&#8217;article L.&#160;2213&#8209;2 du code de la sant&#233; publique, le projet de loi supprime les renvois actuels selon lesquels les r&#232;gles applicables &#224; l&#8217;interruption volontaire de grossesse (IVG) s&#8217;appliquent &#233;galement pour l&#8217;interruption m&#233;dicale de grossesse (IMG). En particulier, le texte supprime le renvoi &#224; la clause de conscience sp&#233;cifique &#224; l&#8217;IVG et introduit &#224; la place une nouvelle clause de conscience sp&#233;cifique pour l&#8217;IMG.</p><p style=\"text-align: justify;\">&#160;</p><p style=\"text-align: justify;\">Si, la nouvelle clause reprend mot pour mot les dispositions de la clause actuelle, elle pourrait avoir un effet dangereux puisque cohabiteraient d&#233;sormais trois clauses de conscience&#160;: la g&#233;n&#233;rale (de nature r&#233;glementaire), la sp&#233;cifique &#224; l&#8217;IVG et la sp&#233;cifique &#224; l&#8217;IMG. &#192; ce stade, cela ne soul&#232;ve pas de difficult&#233; majeure dans la mesure o&#249; les r&#233;dactions sont identiques&#160;; en revanche proc&#233;der ainsi pourrait conduire &#224; modifier ult&#233;rieurement une disposition sans s&#8217;assurer de la coordination avec les autres et ainsi de cr&#233;er des r&#233;gimes parall&#232;les sp&#233;cifiques, complexes &#224; appliquer, et potentiellement moins protecteurs des droits des femmes.</p><p style=\"text-align: justify;\">&#160;</p><p style=\"text-align: justify;\">Par ailleurs, des travaux parlementaires sur l&#8217;IVG &#233;tant actuellement en cours (mission d&#8217;information de la D&#233;l&#233;gation aux droits des femmes et &#224; l&#8217;&#233;galit&#233; des chances entre les hommes et les femmes confi&#233;e &#224; Mme Muschotti et Mme Battistel) et ayant vocation &#224; s&#8217;interroger sur la pertinence de la double clause de conscience, il semble pr&#233;f&#233;rable de maintenir l&#8217;&#233;tat du droit dans l&#8217;attente de la publication de leurs conclusions et recommandations. Aussi, en respectant la r&#233;daction propos&#233;e par le Gouvernement, cet amendement vise &#224; restaurer le renvoi &#224; la clause de conscience telle qu&#8217;elle est d&#233;j&#224; r&#233;dig&#233;e pour l&#8217;IVG.</p><p style=\"text-align: justify;\">&#160;</p><p style=\"text-align: justify;\">Cet amendement est issu des &#233;changes de vue entre les membres de la D&#233;l&#233;gation aux droits des femmes et &#224; l&#8217;&#233;galit&#233; des chances entre les femmes et les hommes.</p>",
    "annexeExposeSommaire": {
      "@xmlns:xsi": "http://www.w3.org/2001/XMLSchema-instance",
      "@xsi:nil": "true"
    },
    "cartoucheDelaiDepotDepasse": {
      "@xmlns:xsi": "http://www.w3.org/2001/XMLSchema-instance",
      "@xsi:nil": "true"
    },
    "avantAppel": {
      "@xmlns:xsi": "http://www.w3.org/2001/XMLSchema-instance",
      "@xsi:nil": "true"
    }
  },
  "representations": {
    "representation": {
      "nom": "PDF",
      "typeMime": {
        "type": "application",
        "subType": "PDF"
      },
      "statutRepresentation": {
        "verbatim": "true",
        "canonique": "true",
        "officielle": "true",
        "transcription": "false",
        "enregistrement": "false"
      },
      "repSource": {
        "@xmlns:xsi": "http://www.w3.org/2001/XMLSchema-instance",
        "@xsi:nil": "true"
      },
      "offset": {
        "@xmlns:xsi": "http://www.w3.org/2001/XMLSchema-instance",
        "@xsi:nil": "true"
      },
      "contenu": {
        "documentURI": "/15/amendements/2187/CSBIOETH/1432.pdf"
      },
      "dateDispoRepresentation": {
        "@xmlns:xsi": "http://www.w3.org/2001/XMLSchema-instance",
        "@xsi:nil": "true"
      }
    }
  },
  "seanceDiscussion": {
    "@xmlns:xsi": "http://www.w3.org/2001/XMLSchema-instance",
    "@xsi:nil": "true"
  },
  "sort": {
    "dateSaisie": "2019-09-13T23:00:39.000+02:00",
    "sortEnSeance": "Non soutenu"
  },
  "dateDepot": "2019-09-05T02:00:00.000+02:00",
  "dateDistribution": "2019-09-10T02:00:00.000+02:00",
  "article99": "0",
  "loiReference": {
    "codeLoi": {
      "@xmlns:xsi": "http://www.w3.org/2001/XMLSchema-instance",
      "@xsi:nil": "true"
    },
    "divisionCodeLoi": {
      "@xmlns:xsi": "http://www.w3.org/2001/XMLSchema-instance",
      "@xsi:nil": "true"
    }
  }
}