{
  "@xmlns": "http://schemas.assemblee-nationale.fr/referentiel",
  "uid": "AMANR5L15PO59051B0911P0D1N390",
  "identifiant": {
    "legislature": "15",
    "numero": "390",
    "numRect": "0",
    "saisine": {
      "refTexteLegislatif": "PRJLANR5L15B0911",
      "numeroPartiePLF": "0",
      "organeExamen": "PO59051",
      "mentionSecondeDeliberation": "0"
    }
  },
  "numeroLong": "CL390",
  "etapeTexte": "1ère lecture (1ère assemblée saisie)",
  "triAmendement": "wcpiao",
  "cardinaliteAmdtMultiples": "1",
  "amendementParent": {
    "@xmlns:xsi": "http://www.w3.org/2001/XMLSchema-instance",
    "@xsi:nil": "true"
  },
  "etat": "Discuté",
  "signataires": {
    "auteur": {
      "typeAuteur": "Depute",
      "acteurRef": "PA346054",
      "organeRef": {
        "@xmlns:xsi": "http://www.w3.org/2001/XMLSchema-instance",
        "@xsi:nil": "true"
      },
      "groupePolitiqueRef": "PO730934"
    },
    "cosignataires": {
      "acteurRef": [
        "PA266793",
        "PA346218",
        "PA346054",
        "PA718784",
        "PA340853",
        "PA709315",
        "PA266776",
        "PA718780"
      ]
    },
    "texteAffichable": "M.&#160;Emmanuel&#160;Maquet,  M.&#160;Bony, M.&#160;Leclerc, Mme&#160;Trastour-Isnart, M.&#160;Reiss, M.&#160;Pauget, M.&#160;Masson et M.&#160;Viala"
  },
  "pointeurFragmentTexte": {
    "missionVisee": {
      "@xmlns:xsi": "http://www.w3.org/2001/XMLSchema-instance",
      "@xsi:nil": "true"
    },
    "division": {
      "titre": "Article 2",
      "articleDesignationCourte": "ART. 2",
      "type": "ARTICLE",
      "avant_A_Apres": "A",
      "divisionRattachee": "ARTICLE 2",
      "articleAdditionnel": {
        "@xmlns:xsi": "http://www.w3.org/2001/XMLSchema-instance",
        "@xsi:nil": "true"
      },
      "chapitreAdditionnel": {
        "@xmlns:xsi": "http://www.w3.org/2001/XMLSchema-instance",
        "@xsi:nil": "true"
      },
      "urlDivisionTexteVise": "/15/textes/0911.asp#D_Article_2"
    },
    "alinea": {
      "avant_A_Apres": "Apres",
      "numero": "1",
      "alineaDesignation": {
        "@xmlns:xsi": "http://www.w3.org/2001/XMLSchema-instance",
        "@xsi:nil": "true"
      }
    }
  },
  "corps": {
    "dispositif": "<p style=\"text-align: justify;\">I.&#160;&#8211;&#160;Compl&#233;ter cet article par les deux alin&#233;as suivants&#160;:</p><p style=\"text-align: justify;\">&#171;&#160;2&#176;&#160;Le dix-huiti&#232;me alin&#233;a est compl&#233;t&#233; une phrase ainsi r&#233;dig&#233;e&#160;:</p><p style=\"text-align: justify;\">&#171;&#160;&#171;&#160;Elles ne peuvent &#234;tre adopt&#233;es en d&#233;ficit de fonctionnement.&#160;&#187;&#160;&#187;</p><p style=\"text-align: justify;\">II.&#160;&#8211;&#160;En cons&#233;quence, avant l&#8217;alin&#233;a&#160;1, ins&#233;rer l&#8217;alin&#233;a suivant&#160;:</p><p style=\"text-align: justify;\">&#171;&#160;L&#8217;article&#160;34 de la Constitution est ainsi modifi&#233;&#160;:&#160;&#187;</p><p style=\"text-align: justify;\">III.&#160;&#8211;&#160;En cons&#233;quence, r&#233;diger ainsi le d&#233;but de l&#8217;alin&#233;a&#160;1&#160;:</p><p style=\"text-align: justify;\">&#171;&#160;1&#176;&#160;Au quinzi&#232;me alin&#233;a, apr&#232;s... <i>(le reste sans changement)</i>.&#160;&#187;</p>",
    "exposeSommaire": "<p>Le pr&#233;sent amendement vise &#224; fixer la r&#232;gle d'or budg&#233;taire.</p><p>&#171; L'argent public n'existe pas, disait Margaret Thatcher, il n'y a que l'argent des contribuables. &#187; Ce constat, partag&#233; par tous les lib&#233;raux, doit &#234;tre mis en regard des lois budg&#233;taires r&#233;centes. Sont-elles suffisantes ? Permettront-elles de rendre aux Fran&#231;ais le pouvoir d'achat qui est le leur ?</p><p>En tout &#233;tat de cause, l'am&#233;lioration actuelle de la situation financi&#232;re de la France n'est imputable qu'&#224; une chose : la reprise &#233;conomique. Si le programme de stabilit&#233; pr&#233;voit un exc&#233;dent budg&#233;taire en 2022, ce n'est que tr&#232;s marginalement gr&#226;ce &#224; des efforts de r&#233;duction de la d&#233;pense publique.</p><p>Le pr&#233;sent amendement vise donc &#224; brusquer les choses. Un rendant constitutionnellement op&#233;rationnelle la r&#232;gle d'&#233;quilibre budg&#233;taire d&#232;s l'entr&#233;e en vigueur de la pr&#233;sente r&#233;vision, il propose d'adresser aux Fran&#231;ais un message de s&#233;rieux et de loyaut&#233;. Il rendra obligatoires des efforts drastiques sur les d&#233;penses publiques, qui ne sont pas ma&#238;tris&#233;es et qui sont une machine &#224; dette. Or, comme l'a dit le pr&#233;sident de la R&#233;publique : &#171; La dette, c'est de l'imp&#244;t au carr&#233;. &#187;</p>",
    "annexeExposeSommaire": {
      "@xmlns:xsi": "http://www.w3.org/2001/XMLSchema-instance",
      "@xsi:nil": "true"
    }
  },
  "representations": {
    "representation": {
      "nom": "PDF",
      "typeMime": {
        "type": "application",
        "subType": "PDF"
      },
      "statutRepresentation": {
        "verbatim": "true",
        "canonique": "true",
        "officielle": "true",
        "transcription": "false",
        "enregistrement": "false"
      },
      "repSource": {
        "@xmlns:xsi": "http://www.w3.org/2001/XMLSchema-instance",
        "@xsi:nil": "true"
      },
      "offset": {
        "@xmlns:xsi": "http://www.w3.org/2001/XMLSchema-instance",
        "@xsi:nil": "true"
      },
      "contenu": {
        "documentURI": "/15/amendements/0911/CION_LOIS/CL390.pdf"
      },
      "dateDispoRepresentation": {
        "@xmlns:xsi": "http://www.w3.org/2001/XMLSchema-instance",
        "@xsi:nil": "true"
      }
    }
  },
  "seanceDiscussion": {
    "@xmlns:xsi": "http://www.w3.org/2001/XMLSchema-instance",
    "@xsi:nil": "true"
  },
  "sort": {
    "dateSaisie": "2018-06-28T23:05:51.000+02:00",
    "sortEnSeance": "Tombé"
  },
  "dateDepot": "2018-06-20T02:00:00.000+02:00",
  "dateDistribution": "2018-06-25T02:00:00.000+02:00",
  "article99": "0",
  "loiReference": {
    "codeLoi": "18",
    "divisionCodeLoi": "1 DC"
  }
}