{
  "@xmlns": "http://schemas.assemblee-nationale.fr/referentiel",
  "uid": "AMANR5L15SEA717460BTC1767P0D1N973",
  "identifiant": {
    "legislature": "15",
    "numero": "973",
    "numRect": "0",
    "saisine": {
      "refTexteLegislatif": "PRJLANR5L15BTC1767",
      "numeroPartiePLF": "0",
      "organeExamen": "PO717460",
      "mentionSecondeDeliberation": "0"
    }
  },
  "numeroLong": "973",
  "etapeTexte": "1ère lecture (1ère assemblée saisie)",
  "triAmendement": "fiaaaaaaaaaaaaaaaaaaaaaaaaaaaaaaaaaaaaaaaaaaaaaaaad",
  "cardinaliteAmdtMultiples": "1",
  "amendementParent": {
    "@xmlns:xsi": "http://www.w3.org/2001/XMLSchema-instance",
    "@xsi:nil": "true"
  },
  "etat": "Discuté",
  "signataires": {
    "auteur": {
      "typeAuteur": "Depute",
      "acteurRef": "PA608416",
      "organeRef": {
        "@xmlns:xsi": "http://www.w3.org/2001/XMLSchema-instance",
        "@xsi:nil": "true"
      },
      "groupePolitiqueRef": "PO730934"
    },
    "cosignataires": {
      "acteurRef": [
        "PA642847",
        "PA721286",
        "PA340853",
        "PA346218",
        "PA721816",
        "PA712015",
        "PA1874",
        "PA608416",
        "PA267901",
        "PA267735",
        "PA332523",
        "PA266808",
        "PA608016",
        "PA718838",
        "PA718850",
        "PA719272",
        "PA721046",
        "PA2377",
        "PA720684",
        "PA266793",
        "PA718780",
        "PA718884",
        "PA767",
        "PA721968",
        "PA267378",
        "PA605036",
        "PA609245",
        "PA330008",
        "PA266776",
        "PA643134",
        "PA720630",
        "PA267429",
        "PA709315",
        "PA267289",
        "PA606712"
      ]
    },
    "texteAffichable": "M.&#160;Hetzel,  M.&#160;Door, M.&#160;Ramadier, M.&#160;Breton, M.&#160;Bazin, M.&#160;Lurton, M.&#160;Le Fur, M.&#160;Brun, M.&#160;Kamardine, Mme&#160;Levy, M.&#160;Cattin, Mme&#160;Louwagie, M.&#160;Minot, M.&#160;Abad, M.&#160;Masson, M.&#160;Bony, Mme&#160;Dalloz, M.&#160;Leclerc, Mme&#160;Bassire, M.&#160;Cordier, M.&#160;Cinieri, M.&#160;Perrut, M.&#160;de Ganay, M.&#160;Reiss, Mme&#160;Meunier, M.&#160;Pierre-Henri&#160;Dumont, M.&#160;Rolland, Mme&#160;Valentin, Mme&#160;Bazin-Malgras, M.&#160;Dive, M.&#160;Boucard, M.&#160;Viala, M.&#160;Vialay, Mme&#160;Lacroute et Mme&#160;Trastour-Isnart"
  },
  "pointeurFragmentTexte": {
    "missionVisee": {
      "@xmlns:xsi": "http://www.w3.org/2001/XMLSchema-instance",
      "@xsi:nil": "true"
    },
    "division": {
      "titre": "Article 11",
      "articleDesignationCourte": "ART. 11",
      "type": "ARTICLE",
      "avant_A_Apres": "A",
      "divisionRattachee": "ARTICLE 11",
      "articleAdditionnel": {
        "@xmlns:xsi": "http://www.w3.org/2001/XMLSchema-instance",
        "@xsi:nil": "true"
      },
      "chapitreAdditionnel": {
        "@xmlns:xsi": "http://www.w3.org/2001/XMLSchema-instance",
        "@xsi:nil": "true"
      },
      "urlDivisionTexteVise": "/15/textes/1767.asp#D_Article_11"
    },
    "alinea": {
      "avant_A_Apres": {
        "@xmlns:xsi": "http://www.w3.org/2001/XMLSchema-instance",
        "@xsi:nil": "true"
      },
      "numero": "61",
      "alineaDesignation": {
        "@xmlns:xsi": "http://www.w3.org/2001/XMLSchema-instance",
        "@xsi:nil": "true"
      }
    }
  },
  "corps": {
    "dispositif": "<p style=\"text-align: justify;\">Supprimer l&#8217;alin&#233;a 61.</p>",
    "exposeSommaire": "<p style=\"text-align: justify;\">Cet alin&#233;a reste tr&#232;s flou sur la gestion d&#8217;une base de donn&#233;es visant &#224; faire une future activit&#233; de recherche. En effet cet alin&#233;a dispose&#160;: &#171;&#160;ou servant &#224; constituer des bases de donn&#233;es &#224; des fins ult&#233;rieures de recherche, d&#8217;&#233;tude ou d&#8217;&#233;valuation dans le domaine de la sant&#233;.&#160;&#187;.</p><p style=\"text-align: justify;\">&#160;La gestion des donn&#233;es de sant&#233; reste particuli&#232;rement sensible autant dans leur traitement que dans leur s&#233;curisation. L&#8217;encadrement juridique sur les &#233;tablissements de sant&#233; (RGPD) est particuli&#232;rement exigeant et il est &#233;tonnant que sur la plateforme ayant pour but de g&#233;rer des donn&#233;es de sant&#233; soit moins encadr&#233;e que les &#233;tablissements de sant&#233; avec la cr&#233;ation d&#8217;une base de donn&#233;es sur des recherches non pr&#233;cis&#233;es avec une information des personnes concern&#233;es par ces donn&#233;es qui ne pourrait &#234;tre que partielle.</p><p style=\"text-align: justify;\">&#160;Aussi, il convient de supprimer cet alin&#233;a pour que le sujet de la recherche en sant&#233; par le biais de cette plateforme soit r&#233;ellement encadr&#233; et que les bases de donn&#233;es de la plateforme ne soient constitu&#233;es que pour un but pr&#233;cis et non pas &#171;&#160;au cas o&#249;&#160;&#187; une recherche serait faite.</p>",
    "annexeExposeSommaire": {
      "@xmlns:xsi": "http://www.w3.org/2001/XMLSchema-instance",
      "@xsi:nil": "true"
    },
    "cartoucheDelaiDepotDepasse": {
      "@xmlns:xsi": "http://www.w3.org/2001/XMLSchema-instance",
      "@xsi:nil": "true"
    }
  },
  "representations": {
    "representation": {
      "nom": "PDF",
      "typeMime": {
        "type": "application",
        "subType": "PDF"
      },
      "statutRepresentation": {
        "verbatim": "true",
        "canonique": "true",
        "officielle": "true",
        "transcription": "false",
        "enregistrement": "false"
      },
      "repSource": {
        "@xmlns:xsi": "http://www.w3.org/2001/XMLSchema-instance",
        "@xsi:nil": "true"
      },
      "offset": {
        "@xmlns:xsi": "http://www.w3.org/2001/XMLSchema-instance",
        "@xsi:nil": "true"
      },
      "contenu": {
        "documentURI": "/15/amendements/1767/AN/973.pdf"
      },
      "dateDispoRepresentation": {
        "@xmlns:xsi": "http://www.w3.org/2001/XMLSchema-instance",
        "@xsi:nil": "true"
      }
    }
  },
  "seanceDiscussion": "RUANR5L15S2019IDS21566",
  "sort": {
    "dateSaisie": "2019-03-22T19:09:09.000+01:00",
    "sortEnSeance": "Rejeté"
  },
  "dateDepot": "2019-03-15T01:00:00.000+01:00",
  "dateDistribution": "2019-03-19T01:00:00.000+01:00",
  "article99": "0",
  "loiReference": {
    "codeLoi": {
      "@xmlns:xsi": "http://www.w3.org/2001/XMLSchema-instance",
      "@xsi:nil": "true"
    },
    "divisionCodeLoi": {
      "@xmlns:xsi": "http://www.w3.org/2001/XMLSchema-instance",
      "@xsi:nil": "true"
    }
  }
}