{
  "@xmlns": "http://schemas.assemblee-nationale.fr/referentiel",
  "uid": "AMANR5L15SEA717460BTC1974P0D1N56",
  "identifiant": {
    "legislature": "15",
    "numero": "56",
    "numRect": "0",
    "saisine": {
      "refTexteLegislatif": "PRJLANR5L15BTC1974",
      "numeroPartiePLF": "0",
      "organeExamen": "PO717460",
      "mentionSecondeDeliberation": "0"
    }
  },
  "numeroLong": "56",
  "etapeTexte": "1ère lecture (2ème assemblée saisie)",
  "triAmendement": "eiaaaaaaaaaaaaaaaaaaaaaaaaaaaaaaaaaaaaaaaaaaaaaaaaabbdhzy",
  "cardinaliteAmdtMultiples": "1",
  "amendementParent": {
    "@xmlns:xsi": "http://www.w3.org/2001/XMLSchema-instance",
    "@xsi:nil": "true"
  },
  "etat": "Discuté",
  "signataires": {
    "auteur": {
      "typeAuteur": "Depute",
      "acteurRef": "PA330909",
      "organeRef": {
        "@xmlns:xsi": "http://www.w3.org/2001/XMLSchema-instance",
        "@xsi:nil": "true"
      },
      "groupePolitiqueRef": "PO730934"
    },
    "cosignataires": {
      "acteurRef": [
        "PA267429",
        "PA2155",
        "PA712015",
        "PA721968",
        "PA748954",
        "PA720386",
        "PA709315",
        "PA608016",
        "PA605036",
        "PA266793",
        "PA643134",
        "PA718884",
        "PA607090",
        "PA2377",
        "PA719272",
        "PA721816",
        "PA340853",
        "PA721410",
        "PA346218",
        "PA608416",
        "PA606712",
        "PA721636",
        "PA1012",
        "PA267204",
        "PA330909",
        "PA719318"
      ]
    },
    "texteAffichable": "M.&#160;Descoeur,  M.&#160;Hetzel, M.&#160;Masson, M.&#160;Boucard, Mme&#160;Anthoine, Mme&#160;Bazin-Malgras, M.&#160;Bony, M.&#160;Leclerc, M.&#160;Abad, M.&#160;Sermier, M.&#160;Dive, M.&#160;Viala, Mme&#160;Valentin, M.&#160;Menuel, M.&#160;Di Filippo, M.&#160;Jean-Pierre&#160;Vigier, M.&#160;Lurton, M.&#160;Parigi, M.&#160;Savignat, M.&#160;Perrut, Mme&#160;Meunier, Mme&#160;Bonnivard, Mme&#160;Louwagie, M.&#160;Cinieri, M.&#160;Vialay et M.&#160;de la Verpilli&#232;re"
  },
  "pointeurFragmentTexte": {
    "missionVisee": {
      "@xmlns:xsi": "http://www.w3.org/2001/XMLSchema-instance",
      "@xsi:nil": "true"
    },
    "division": {
      "titre": "Article 26 B",
      "articleDesignationCourte": "ART. 26 B",
      "type": "ARTICLE",
      "avant_A_Apres": "A",
      "divisionRattachee": "ARTICLE 26 B",
      "articleAdditionnel": {
        "@xmlns:xsi": "http://www.w3.org/2001/XMLSchema-instance",
        "@xsi:nil": "true"
      },
      "chapitreAdditionnel": {
        "@xmlns:xsi": "http://www.w3.org/2001/XMLSchema-instance",
        "@xsi:nil": "true"
      },
      "urlDivisionTexteVise": "/15/textes/1974.asp#D_Article_26_B"
    },
    "alinea": {
      "avant_A_Apres": {
        "@xmlns:xsi": "http://www.w3.org/2001/XMLSchema-instance",
        "@xsi:nil": "true"
      },
      "numero": "2",
      "alineaDesignation": {
        "@xmlns:xsi": "http://www.w3.org/2001/XMLSchema-instance",
        "@xsi:nil": "true"
      }
    }
  },
  "corps": {
    "dispositif": "<p style=\"text-align: justify;\">R&#233;diger ainsi l&#8217;alin&#233;a&#160;2&#160;:</p><p style=\"text-align: justify;\">&#171;&#160;<i>Art.&#160;L.&#160;224&#8209;11</i>.&#160;&#8211;&#160;Au plus tard en 2025, les loueurs de v&#233;hicules automobiles acqui&#232;rent, lors du renouvellement de leur parc, dans la proportion minimale de 20&#160;% de ce renouvellement, des v&#233;hicules d&#233;finis au 1&#176; de l&#8217;article L.&#160;224&#8209;7, ainsi que des v&#233;hicules hybrides, hybrides rechargeables, des v&#233;hicules roulant au gaz naturel et certains v&#233;hicules de motorisations thermiques produisant de faibles niveaux d&#8217;&#233;missions de gaz &#224; effet de serre et de polluants atmosph&#233;riques.&#160;&#187;</p>",
    "exposeSommaire": "<p style=\"text-align: justify;\">L&#8217;article&#160;37 de la loi du 17 ao&#251;t 2015 relative &#224; la transition &#233;nerg&#233;tique pour la croissance verte impose aux loueurs de v&#233;hicules d&#8217;acqu&#233;rir, lors du renouvellement de leur parc, et dans une proportion de 10&#160;% de ce renouvellement, des v&#233;hicules &#224; faibles &#233;missions avant 2020. Le pr&#233;sent article vise &#224; doubler les obligations actuelles en les portant &#224; 20&#160;% avant 2022. Les seuils de renouvellement fix&#233;s par le l&#233;gislateur doivent &#234;tre en coh&#233;rence avec les r&#233;alit&#233;s &#233;conomiques et techniques de l&#8217;offre du march&#233; de v&#233;hicules &#224; faibles &#233;missions. Sur cette typologie de v&#233;hicules, les loueurs d&#233;pendent &#233;troitement de la volont&#233; et de la capacit&#233; des constructeurs &#224; proposer des v&#233;hicules propres dans des conditions commerciales acceptables. Ainsi, au 1<sup>er</sup> trimestre 2019, la part de v&#233;hicules &#233;lectriques, hybrides, et hybrides rechargeables repr&#233;sentait seulement 5&#160;% du total des immatriculations en voitures particuli&#232;res. Sur cette proportion, seulement 3&#160;% de v&#233;hicules &#233;mettent moins de 60 grammes de CO2 par kilom&#232;tre, et respectent ainsi la d&#233;finition du v&#233;hicule &#224; faibles &#233;missions fix&#233;e par le d&#233;cret du 11 janvier 2017 pris en application de l&#8217;article L.&#160;224&#8209;7 du Code de l&#8217;Environnement. De plus, la nouvelle proc&#233;dure d&#8217;homologation WLTP, entr&#233;e en vigueur en 2018 et pleinement applicable d&#232;s 2020, va faire &#233;voluer de mani&#232;re significative la mesure des &#233;missions de CO2. Le passage de la norme NEDC au WLTP se traduit par une augmentation de 20 &#224; 30&#160;% des &#233;missions calcul&#233;es. Par ailleurs, la d&#233;tention d&#8217;une flotte de v&#233;hicules propres par les loueurs d&#233;pend de leur capacit&#233; &#224; &#234;tre approvisionn&#233;s en &#233;lectricit&#233; et de la disponibilit&#233; des infrastructures de recharges &#233;lectriques, encore insuffisamment pr&#233;sentes sur l&#8217;ensemble du territoire fran&#231;ais. L&#8217;ensemble de ces contraintes d&#8217;utilisations constitueront &#224; court et moyen terme un frein &#224; l&#8217;int&#233;gration de v&#233;hicules propres, en particulier &#233;lectriques, dans les flottes de location de courte dur&#233;e. Les diff&#233;rents objectifs fix&#233;s dans le pr&#233;sent article apparaissent ainsi trop ambitieux pour que les loueurs puissent remplir ces obligations de fa&#231;on viable et dans les &#233;ch&#233;ances imparties. C&#8217;est pourquoi, cet amendement propose&#160;: - d&#8217;&#233;largir la gamme de v&#233;hicules concern&#233;s par ces nouvelles obligations aux v&#233;hicules hybrides, aux hybrides rechargeables, aux v&#233;hicules roulant au gaz naturel ainsi qu&#8217;aux v&#233;hicules qui disposent de motorisations thermiques les plus vertueuses sur le plan environnemental (Euro 6) - de repousser la date de mise en application de ces obligations, en fixant l&#8217;&#233;ch&#233;ance de 2025 pour s&#8217;aligner sur l&#8217;offre des constructeurs automobiles. Afin d&#8217;&#233;valuer l&#8217;efficacit&#233; de la mesure et d&#8217;atteindre des objectifs ambitieux en mati&#232;re de verdissement des parcs, il conviendra d&#8217;effectuer, au milieu de la p&#233;riode et en concertation avec les professionnels, un bilan d&#8217;&#233;tape permettant d&#8217;&#233;tudier la faisabilit&#233; &#233;conomique et industrielle de cette mesure&#160;&#8211;&#160;en &#233;valuant le nombre d&#8217;infrastructures de recharges disponibles en France, ainsi que le nombre de v&#233;hicules &#224; faibles &#233;missions mis sur le march&#233; par les constructeurs.</p>",
    "annexeExposeSommaire": {
      "@xmlns:xsi": "http://www.w3.org/2001/XMLSchema-instance",
      "@xsi:nil": "true"
    },
    "cartoucheDelaiDepotDepasse": {
      "@xmlns:xsi": "http://www.w3.org/2001/XMLSchema-instance",
      "@xsi:nil": "true"
    }
  },
  "representations": {
    "representation": {
      "nom": "PDF",
      "typeMime": {
        "type": "application",
        "subType": "PDF"
      },
      "statutRepresentation": {
        "verbatim": "true",
        "canonique": "true",
        "officielle": "true",
        "transcription": "false",
        "enregistrement": "false"
      },
      "repSource": {
        "@xmlns:xsi": "http://www.w3.org/2001/XMLSchema-instance",
        "@xsi:nil": "true"
      },
      "offset": {
        "@xmlns:xsi": "http://www.w3.org/2001/XMLSchema-instance",
        "@xsi:nil": "true"
      },
      "contenu": {
        "documentURI": "/15/amendements/1974/AN/56.pdf"
      },
      "dateDispoRepresentation": {
        "@xmlns:xsi": "http://www.w3.org/2001/XMLSchema-instance",
        "@xsi:nil": "true"
      }
    }
  },
  "seanceDiscussion": "RUANR5L15S2019IDS21695",
  "sort": {
    "dateSaisie": "2019-06-11T21:41:56.000+02:00",
    "sortEnSeance": "Tombé"
  },
  "dateDepot": "2019-05-25T02:00:00.000+02:00",
  "dateDistribution": "2019-06-06T02:00:00.000+02:00",
  "article99": "0",
  "loiReference": {
    "codeLoi": {
      "@xmlns:xsi": "http://www.w3.org/2001/XMLSchema-instance",
      "@xsi:nil": "true"
    },
    "divisionCodeLoi": {
      "@xmlns:xsi": "http://www.w3.org/2001/XMLSchema-instance",
      "@xsi:nil": "true"
    }
  }
}