{
  "@xmlns": "http://schemas.assemblee-nationale.fr/referentiel",
  "uid": "AMANR5L15SEA717460BTA0216P0D1N41",
  "identifiant": {
    "legislature": "15",
    "numero": "41",
    "numRect": "0",
    "saisine": {
      "refTexteLegislatif": "PRJLANR5L15BTA0216",
      "numeroPartiePLF": "0",
      "organeExamen": "PO717460",
      "mentionSecondeDeliberation": "0"
    }
  },
  "numeroLong": "41",
  "etapeTexte": "Lecture définitive",
  "triAmendement": "aiaaaaaaaaaaaaaaaaaaaaaaaaaaaaaaaaaaaaaaaaaaaaaaaaek",
  "cardinaliteAmdtMultiples": "1",
  "amendementParent": {
    "@xmlns:xsi": "http://www.w3.org/2001/XMLSchema-instance",
    "@xsi:nil": "true"
  },
  "etat": "Discuté",
  "signataires": {
    "auteur": {
      "typeAuteur": "Depute",
      "acteurRef": "PA720430",
      "organeRef": {
        "@xmlns:xsi": "http://www.w3.org/2001/XMLSchema-instance",
        "@xsi:nil": "true"
      },
      "groupePolitiqueRef": "PO730958"
    },
    "cosignataires": {
      "acteurRef": [
        "PA588884",
        "PA720430",
        "PA720422",
        "PA722142",
        "PA720846",
        "PA721210",
        "PA720892",
        "PA721226",
        "PA718868",
        "PA721960",
        "PA720286",
        "PA719578",
        "PA721202",
        "PA718860",
        "PA721062",
        "PA719676",
        "PA2150"
      ]
    },
    "texteAffichable": "M.&#160;Bernalicis,  Mme&#160;Autain, M.&#160;Coquerel, M.&#160;Corbi&#232;re, Mme&#160;Fiat, M.&#160;Lachaud, M.&#160;Larive, M.&#160;M&#233;lenchon, Mme&#160;Obono, Mme&#160;Panot, M.&#160;Prud&apos;homme, M.&#160;Quatennens, M.&#160;Ratenon, Mme&#160;Ressiguier, Mme&#160;Rubin, M.&#160;Ruffin et Mme&#160;Taurine"
  },
  "pointeurFragmentTexte": {
    "missionVisee": {
      "@xmlns:xsi": "http://www.w3.org/2001/XMLSchema-instance",
      "@xsi:nil": "true"
    },
    "division": {
      "titre": "Article 7",
      "articleDesignationCourte": "ART. 7",
      "type": "ARTICLE",
      "avant_A_Apres": "A",
      "divisionRattachee": "ARTICLE 7",
      "articleAdditionnel": {
        "@xmlns:xsi": "http://www.w3.org/2001/XMLSchema-instance",
        "@xsi:nil": "true"
      },
      "chapitreAdditionnel": {
        "@xmlns:xsi": "http://www.w3.org/2001/XMLSchema-instance",
        "@xsi:nil": "true"
      },
      "urlDivisionTexteVise": "/15/textes/TA0216.asp#D_Article_7"
    },
    "alinea": {
      "avant_A_Apres": {
        "@xmlns:xsi": "http://www.w3.org/2001/XMLSchema-instance",
        "@xsi:nil": "true"
      },
      "numero": "5",
      "alineaDesignation": {
        "@xmlns:xsi": "http://www.w3.org/2001/XMLSchema-instance",
        "@xsi:nil": "true"
      }
    }
  },
  "corps": {
    "dispositif": "<p style=\"text-align: justify;\">I.- Alin&#233;a 5</p><p style=\"text-align: justify;\">Supprimer les mots&#160;:</p><p style=\"text-align: justify;\">d&#8217;enfant mineur sous tutelle ou</p><p style=\"text-align: justify;\">II.-Alin&#233;a 6</p><p style=\"text-align: justify;\">Supprimer cet alin&#233;a.</p>",
    "exposeSommaire": "<p style=\"text-align: justify;\">De par les contraintes induites par la proc&#233;dure parlementaire en lecture d&#233;finitive (Article 45 de la Constitution), le Groupe LFI ne peut d&#233;poser ses propres amendements et ne peut donc reprendre que ceux adopt&#233;s par le S&#233;nat en nouvelle lecture. Nous reprenons ici l&#8217;amendement <span><a href=\"http://www.senat.fr/amendements/commissions/2018-2019/269/Amdt_COM-122.html\">http://www.senat.fr/amendements/commissions/2018-2019/269/Amdt_COM-122.html</a></span> dont voici l&#8217;expos&#233; des motifs&#160;:</p><p style=\"text-align: justify;\">&#171;&#160;Le pr&#233;sent amendement vise &#224; r&#233;tablir le texte adopt&#233; par le S&#233;nat en premi&#232;re lecture. Il propose de maintenir l&#8217;homologation par le juge des modifications de r&#233;gime matrimonial en pr&#233;sence d&#8217;enfants mineurs, que l&#8217;article 7 propose de supprimer.</p><p style=\"text-align: justify;\">Lors de l&#8217;examen du projet de loi relatif &#224; la modernisation et &#224; la simplification du droit et des proc&#233;dures dans les domaines de la justice et des affaires int&#233;rieures, examin&#233; par le S&#233;nat en 2014 et 2015, la commission des lois, &#224; l&#8217;initiative de son rapporteur M. Thani Mohamed Soilihi, s&#8217;&#233;tait oppos&#233;e &#224; la suppression de cette homologation en pr&#233;sence d&#8217;enfants mineurs.</p><p style=\"text-align: justify;\">Par coh&#233;rence avec la position prise &#224; l&#8217;&#233;poque, cet amendement s&#8217;oppose &#224; la suppression de l&#8217;intervention du juge car elle permet de v&#233;rifier que la modification est bien conforme &#224; l&#8217;int&#233;r&#234;t de la famille, prise sans sa globalit&#233;, et pas seulement &#224; l&#8217;int&#233;r&#234;t des &#233;poux.&#187;</p>",
    "annexeExposeSommaire": {
      "@xmlns:xsi": "http://www.w3.org/2001/XMLSchema-instance",
      "@xsi:nil": "true"
    },
    "cartoucheDelaiDepotDepasse": {
      "@xmlns:xsi": "http://www.w3.org/2001/XMLSchema-instance",
      "@xsi:nil": "true"
    }
  },
  "representations": {
    "representation": {
      "nom": "PDF",
      "typeMime": {
        "type": "application",
        "subType": "PDF"
      },
      "statutRepresentation": {
        "verbatim": "true",
        "canonique": "true",
        "officielle": "true",
        "transcription": "false",
        "enregistrement": "false"
      },
      "repSource": {
        "@xmlns:xsi": "http://www.w3.org/2001/XMLSchema-instance",
        "@xsi:nil": "true"
      },
      "offset": {
        "@xmlns:xsi": "http://www.w3.org/2001/XMLSchema-instance",
        "@xsi:nil": "true"
      },
      "contenu": {
        "documentURI": "/15/amendements/TA0216/AN/41.pdf"
      },
      "dateDispoRepresentation": {
        "@xmlns:xsi": "http://www.w3.org/2001/XMLSchema-instance",
        "@xsi:nil": "true"
      }
    }
  },
  "seanceDiscussion": {
    "@xmlns:xsi": "http://www.w3.org/2001/XMLSchema-instance",
    "@xsi:nil": "true"
  },
  "sort": {
    "dateSaisie": "2019-02-18T23:11:15.000+01:00",
    "sortEnSeance": "Rejeté"
  },
  "dateDepot": "2019-02-14T01:00:00.000+01:00",
  "dateDistribution": "2019-02-18T01:00:00.000+01:00",
  "article99": "0",
  "loiReference": {
    "codeLoi": {
      "@xmlns:xsi": "http://www.w3.org/2001/XMLSchema-instance",
      "@xsi:nil": "true"
    },
    "divisionCodeLoi": {
      "@xmlns:xsi": "http://www.w3.org/2001/XMLSchema-instance",
      "@xsi:nil": "true"
    }
  }
}