{
  "@xmlns": "http://schemas.assemblee-nationale.fr/referentiel",
  "uid": "AMANR5L15PO59051B1802P0D1N515",
  "identifiant": {
    "legislature": "15",
    "numero": "515",
    "numRect": "0",
    "saisine": {
      "refTexteLegislatif": "PRJLANR5L15B1802",
      "numeroPartiePLF": "0",
      "organeExamen": "PO59051",
      "mentionSecondeDeliberation": "0"
    }
  },
  "numeroLong": "CL515",
  "etapeTexte": "1ère lecture (1ère assemblée saisie)",
  "triAmendement": "oeaaaaaaaaaaaaaaaaaaaaaaaaaaaaaaaaaaaaaaaaaaaaaaaao",
  "cardinaliteAmdtMultiples": "1",
  "amendementParent": {
    "@xmlns:xsi": "http://www.w3.org/2001/XMLSchema-instance",
    "@xsi:nil": "true"
  },
  "etat": "Discuté",
  "signataires": {
    "auteur": {
      "typeAuteur": "Depute",
      "acteurRef": "PA719930",
      "organeRef": {
        "@xmlns:xsi": "http://www.w3.org/2001/XMLSchema-instance",
        "@xsi:nil": "true"
      },
      "groupePolitiqueRef": "PO758835"
    },
    "cosignataires": {
      "acteurRef": [
        "PA605069",
        "PA1809",
        "PA609332",
        "PA335532",
        "PA337483",
        "PA720988",
        "PA608695",
        "PA642764",
        "PA340343",
        "PA508",
        "PA429893",
        "PA333285",
        "PA340357",
        "PA1198",
        "PA610681",
        "PA608172",
        "PA335054",
        "PA608011",
        "PA607553",
        "PA332614",
        "PA342415",
        "PA719930",
        "PA609590",
        "PA333818",
        "PA267233",
        "PA1592",
        "PA608741",
        "PA1008",
        "PA643145"
      ]
    },
    "texteAffichable": "M.&#160;Vallaud,  Mme&#160;Karamanli, Mme&#160;Untermaier, Mme&#160;Pau-Langevin, M.&#160;Saulignac, Mme&#160;Pires Beaune, Mme&#160;Rabault, M.&#160;Aviragnet, Mme&#160;Bareigts, Mme&#160;Battistel, Mme&#160;Bi&#233;mouret, M.&#160;Bouillon, M.&#160;Jean-Louis&#160;Bricout, M.&#160;Carvounas, M.&#160;Alain&#160;David, Mme&#160;Laurence&#160;Dumont, M.&#160;Faure, M.&#160;Garot, M.&#160;David&#160;Habib, M.&#160;Hutin, M.&#160;Juanico, M.&#160;J&#233;r&#244;me&#160;Lambert, M.&#160;Letchimy, Mme&#160;Manin, M.&#160;Potier, M.&#160;Pueyo, Mme&#160;Tolmont, Mme&#160;Vainqueur-Christophe et Mme&#160;Victory"
  },
  "pointeurFragmentTexte": {
    "missionVisee": {
      "@xmlns:xsi": "http://www.w3.org/2001/XMLSchema-instance",
      "@xsi:nil": "true"
    },
    "division": {
      "titre": "Article 35",
      "articleDesignationCourte": "ART. 35",
      "type": "ARTICLE",
      "avant_A_Apres": "A",
      "divisionRattachee": "ARTICLE 35",
      "articleAdditionnel": {
        "@xmlns:xsi": "http://www.w3.org/2001/XMLSchema-instance",
        "@xsi:nil": "true"
      },
      "chapitreAdditionnel": {
        "@xmlns:xsi": "http://www.w3.org/2001/XMLSchema-instance",
        "@xsi:nil": "true"
      },
      "urlDivisionTexteVise": "/15/textes/1802.asp#D_Article_35"
    },
    "alinea": {
      "avant_A_Apres": {
        "@xmlns:xsi": "http://www.w3.org/2001/XMLSchema-instance",
        "@xsi:nil": "true"
      },
      "numero": "3",
      "alineaDesignation": {
        "@xmlns:xsi": "http://www.w3.org/2001/XMLSchema-instance",
        "@xsi:nil": "true"
      }
    }
  },
  "corps": {
    "dispositif": "<p style=\"text-align: justify;\">R&#233;diger ainsi l&#8217;article&#160;3&#160;:</p><p style=\"text-align: justify;\">&#171;&#160;Une premi&#232;re &#233;valuation de ce dispositif est pr&#233;sent&#233;e au Parlement trois ans avant son terme. Une seconde &#233;valuation est pr&#233;sent&#233;e au Parlement un an avant son terme.&#160;&#187;</p>",
    "exposeSommaire": "<p>Cet amendement du groupe Socialistes et apparent&#233;s permet de pr&#233;senter au bout de trois ans une premi&#232;re &#233;valuation de l'exp&#233;rimentation mise en place par l'article 35.</p><p style=\"text-align: justify;\">Pour rappel, cet article&#160;instaure une exp&#233;rimentation, allant du 1er janvier 2020 au 31 d&#233;cembre 2025, d&#8217;une voie d&#233;rogatoire de promotion interne pour les fonctionnaires en situation de handicap.&#160;Concr&#232;tement, les fonctionnaires en situation de handicap pourront acc&#233;der &#224; un corps de niveau sup&#233;rieur ou de cat&#233;gorie sup&#233;rieur par la voie du d&#233;tachement, sous r&#233;serve d&#8217;avoir accompli pr&#233;alablement une certaine dur&#233;e de services publics. Ce d&#233;tachement pourra &#234;tre renouvel&#233; et &#224; l&#8217;issue de la dur&#233;e du d&#233;tachement, le fonctionnaire pourra &#234;tre int&#233;gr&#233; dans le corps concern&#233;.</p><p style=\"text-align: justify;\">Les d&#233;put&#233;s socialistes et apparent&#233;s sont favorables &#224; cette exp&#233;rimentation. Ils consid&#232;rent toutefois qu'il est n&#233;cessaire d'en avancer l'&#233;valuation, afin d'ajuster l'exp&#233;rimentation si n&#233;cessaire.</p>",
    "annexeExposeSommaire": {
      "@xmlns:xsi": "http://www.w3.org/2001/XMLSchema-instance",
      "@xsi:nil": "true"
    },
    "cartoucheDelaiDepotDepasse": {
      "@xmlns:xsi": "http://www.w3.org/2001/XMLSchema-instance",
      "@xsi:nil": "true"
    }
  },
  "representations": {
    "representation": {
      "nom": "PDF",
      "typeMime": {
        "type": "application",
        "subType": "PDF"
      },
      "statutRepresentation": {
        "verbatim": "true",
        "canonique": "true",
        "officielle": "true",
        "transcription": "false",
        "enregistrement": "false"
      },
      "repSource": {
        "@xmlns:xsi": "http://www.w3.org/2001/XMLSchema-instance",
        "@xsi:nil": "true"
      },
      "offset": {
        "@xmlns:xsi": "http://www.w3.org/2001/XMLSchema-instance",
        "@xsi:nil": "true"
      },
      "contenu": {
        "documentURI": "/15/amendements/1802/CION_LOIS/CL515.pdf"
      },
      "dateDispoRepresentation": {
        "@xmlns:xsi": "http://www.w3.org/2001/XMLSchema-instance",
        "@xsi:nil": "true"
      }
    }
  },
  "seanceDiscussion": {
    "@xmlns:xsi": "http://www.w3.org/2001/XMLSchema-instance",
    "@xsi:nil": "true"
  },
  "sort": {
    "dateSaisie": "2019-05-03T17:43:53.000+02:00",
    "sortEnSeance": "Rejeté"
  },
  "dateDepot": "2019-04-29T02:00:00.000+02:00",
  "dateDistribution": "2019-05-01T02:00:00.000+02:00",
  "article99": "0",
  "loiReference": {
    "codeLoi": {
      "@xmlns:xsi": "http://www.w3.org/2001/XMLSchema-instance",
      "@xsi:nil": "true"
    },
    "divisionCodeLoi": {
      "@xmlns:xsi": "http://www.w3.org/2001/XMLSchema-instance",
      "@xsi:nil": "true"
    }
  }
}