{
  "@xmlns": "http://schemas.assemblee-nationale.fr/referentiel",
  "uid": "AMANR5L15SEA717460BTC1838P0D1N84",
  "identifiant": {
    "legislature": "15",
    "numero": "84",
    "numRect": "0",
    "saisine": {
      "refTexteLegislatif": "PRJLANR5L15BTC1838",
      "numeroPartiePLF": "0",
      "organeExamen": "PO717460",
      "mentionSecondeDeliberation": "0"
    }
  },
  "numeroLong": "84",
  "etapeTexte": "1ère lecture (1ère assemblée saisie)",
  "triAmendement": "biaaaaaaaaaaaaaaaaaaaaaaaaaaaaaaaaaaaaaaaaaaaaaaaaqokjy",
  "cardinaliteAmdtMultiples": "1",
  "amendementParent": {
    "@xmlns:xsi": "http://www.w3.org/2001/XMLSchema-instance",
    "@xsi:nil": "true"
  },
  "etat": "Discuté",
  "signataires": {
    "auteur": {
      "typeAuteur": "Depute",
      "acteurRef": "PA608826",
      "organeRef": {
        "@xmlns:xsi": "http://www.w3.org/2001/XMLSchema-instance",
        "@xsi:nil": "true"
      },
      "groupePolitiqueRef": "PO730934"
    },
    "cosignataires": {
      "acteurRef": "PA608826"
    },
    "texteAffichable": "Mme&#160;Duby-Muller"
  },
  "pointeurFragmentTexte": {
    "missionVisee": {
      "@xmlns:xsi": "http://www.w3.org/2001/XMLSchema-instance",
      "@xsi:nil": "true"
    },
    "division": {
      "titre": "Article PREMIER",
      "articleDesignationCourte": "ART. PREMIER",
      "type": "ARTICLE",
      "avant_A_Apres": "A",
      "divisionRattachee": "ARTICLE PREMIER",
      "articleAdditionnel": {
        "@xmlns:xsi": "http://www.w3.org/2001/XMLSchema-instance",
        "@xsi:nil": "true"
      },
      "chapitreAdditionnel": {
        "@xmlns:xsi": "http://www.w3.org/2001/XMLSchema-instance",
        "@xsi:nil": "true"
      },
      "urlDivisionTexteVise": "/15/textes/1838.asp#D_Article_1er"
    },
    "alinea": {
      "avant_A_Apres": "Apres",
      "numero": "51",
      "alineaDesignation": {
        "@xmlns:xsi": "http://www.w3.org/2001/XMLSchema-instance",
        "@xsi:nil": "true"
      }
    }
  },
  "corps": {
    "dispositif": "<p style=\"text-align: justify;\">Apr&#232;s l&#8217;alin&#233;a&#160;51, ins&#233;rer l&#8217;alin&#233;a suivant&#160;:</p><p style=\"text-align: justify;\">&#171;&#160;V.&#160;&#8211;&#160;Les entreprises assujetties &#224; l&#8217;imp&#244;t sur les soci&#233;t&#233;s peuvent imputer la taxe dont elles sont redevables sur l&#8217;imp&#244;t sur les soci&#233;t&#233;s d&#251; au titre de l&#8217;exercice au cours duquel la taxe devient exigible.&#160;&#187;</p>",
    "exposeSommaire": "<p>Le texte pr&#233;sent&#233; par le Gouvernement vise &#224; imposer en France des revenus qui n&#8217;y sont pas d&#233;j&#224; impos&#233;s. A l&#8217;inverse, l'objectif n'est &#233;videmment pas d'appliquer la taxe &#224; des entreprises qui sont d&#233;j&#224; soumises &#224; l&#8217;imp&#244;t sur les soci&#233;t&#233;s en France, car cela aboutirait &#224; des situations de double imposition, qui pourraient s&#8217;av&#233;rer confiscatoires.&#160;</p><p>Une d&#233;duction d&#8217;assiette, telle que celle qui est pr&#233;vue par le projet de loi pr&#233;sent&#233; par le Gouvernement, ne permet pas de rem&#233;dier &#224; cette situation, car elle n&#8217;&#233;vite que tr&#232;s partiellement la double imposition et laisse donc subsister l&#8217;essentiel du probl&#232;me.</p><p>Le pr&#233;sent amendement vise donc &#224; mettre la lettre du projet de loi en accord avec son objet, en permettant aux entreprises assujetties &#224; l&#8217;imp&#244;t sur les soci&#233;t&#233;s d&#8217;imputer la taxe dont elles sont redevables sur le montant de l&#8217;imp&#244;t sur les soci&#233;t&#233;s d&#251; au titre de l&#8217;exercice au cours duquel la taxe devient exigible.</p><p>Cet amendement permettra non seulement de rem&#233;dier aux situations de double imposition, mais aussi d&#8217;&#233;viter une censure juridictionnelle en &#233;vitant la taxe puisse &#234;tre regard&#233;e comme confiscatoire.</p>",
    "annexeExposeSommaire": {
      "@xmlns:xsi": "http://www.w3.org/2001/XMLSchema-instance",
      "@xsi:nil": "true"
    },
    "cartoucheDelaiDepotDepasse": {
      "@xmlns:xsi": "http://www.w3.org/2001/XMLSchema-instance",
      "@xsi:nil": "true"
    }
  },
  "representations": {
    "representation": {
      "nom": "PDF",
      "typeMime": {
        "type": "application",
        "subType": "PDF"
      },
      "statutRepresentation": {
        "verbatim": "true",
        "canonique": "true",
        "officielle": "true",
        "transcription": "false",
        "enregistrement": "false"
      },
      "repSource": {
        "@xmlns:xsi": "http://www.w3.org/2001/XMLSchema-instance",
        "@xsi:nil": "true"
      },
      "offset": {
        "@xmlns:xsi": "http://www.w3.org/2001/XMLSchema-instance",
        "@xsi:nil": "true"
      },
      "contenu": {
        "documentURI": "/15/amendements/1838/AN/84.pdf"
      },
      "dateDispoRepresentation": {
        "@xmlns:xsi": "http://www.w3.org/2001/XMLSchema-instance",
        "@xsi:nil": "true"
      }
    }
  },
  "seanceDiscussion": "RUANR5L15S2019IDS21598",
  "sort": {
    "dateSaisie": "2019-04-08T23:11:40.000+02:00",
    "sortEnSeance": "Rejeté"
  },
  "dateDepot": "2019-04-05T02:00:00.000+02:00",
  "dateDistribution": "2019-04-08T02:00:00.000+02:00",
  "article99": "0",
  "loiReference": {
    "codeLoi": {
      "@xmlns:xsi": "http://www.w3.org/2001/XMLSchema-instance",
      "@xsi:nil": "true"
    },
    "divisionCodeLoi": {
      "@xmlns:xsi": "http://www.w3.org/2001/XMLSchema-instance",
      "@xsi:nil": "true"
    }
  }
}