{
  "@xmlns": "http://schemas.assemblee-nationale.fr/referentiel",
  "uid": "AMANR5L15SEA717460B2272P1D1N978",
  "identifiant": {
    "legislature": "15",
    "numero": "978",
    "numRect": "0",
    "saisine": {
      "refTexteLegislatif": "PRJLANR5L15B2272",
      "numeroPartiePLF": "1",
      "organeExamen": "PO717460",
      "mentionSecondeDeliberation": "0"
    }
  },
  "numeroLong": "I-978",
  "etapeTexte": "1ère lecture (1ère assemblée saisie)",
  "triAmendement": "beaaaaaaaaaaaaaaaaaaaaaaaaaaaaaaaaaaaaaaaaaaaaaaaahz",
  "cardinaliteAmdtMultiples": "1",
  "amendementParent": {
    "@xmlns:xsi": "http://www.w3.org/2001/XMLSchema-instance",
    "@xsi:nil": "true"
  },
  "etat": "Discuté",
  "signataires": {
    "auteur": {
      "typeAuteur": "Depute",
      "acteurRef": "PA942",
      "organeRef": {
        "@xmlns:xsi": "http://www.w3.org/2001/XMLSchema-instance",
        "@xsi:nil": "true"
      },
      "groupePolitiqueRef": "PO759900"
    },
    "cosignataires": {
      "acteurRef": [
        "PA405480",
        "PA942",
        "PA719138",
        "PA267042",
        "PA720996",
        "PA333421",
        "PA336439",
        "PA607619",
        "PA331582",
        "PA336175",
        "PA605518",
        "PA608292",
        "PA720038",
        "PA719286",
        "PA721194",
        "PA719146"
      ]
    },
    "texteAffichable": "M.&#160;Charles&#160;de Courson,  M.&#160;Pupponi, M.&#160;Acquaviva, M.&#160;Castellani, M.&#160;Cl&#233;ment, M.&#160;Colombani, Mme&#160;Dubi&#233;, Mme&#160;Fr&#233;d&#233;rique&#160;Dumas, M.&#160;El Guerrab, M.&#160;Favennec Becot, Mme&#160;Josso, M.&#160;Fran&#231;ois-Michel&#160;Lambert, M.&#160;Molac, M.&#160;Pancher, Mme&#160;Pinel et M.&#160;Philippe&#160;Vigier"
  },
  "pointeurFragmentTexte": {
    "missionVisee": {
      "@xmlns:xsi": "http://www.w3.org/2001/XMLSchema-instance",
      "@xsi:nil": "true"
    },
    "division": {
      "titre": "Article 6",
      "articleDesignationCourte": "ART. 6",
      "type": "ARTICLE",
      "avant_A_Apres": "A",
      "divisionRattachee": "ARTICLE 6",
      "articleAdditionnel": {
        "@xmlns:xsi": "http://www.w3.org/2001/XMLSchema-instance",
        "@xsi:nil": "true"
      },
      "chapitreAdditionnel": {
        "@xmlns:xsi": "http://www.w3.org/2001/XMLSchema-instance",
        "@xsi:nil": "true"
      },
      "urlDivisionTexteVise": "/15/textes/2272A.asp#D_Article_6"
    },
    "alinea": {
      "avant_A_Apres": null,
      "numero": "63",
      "alineaDesignation": {
        "@xmlns:xsi": "http://www.w3.org/2001/XMLSchema-instance",
        "@xsi:nil": "true"
      }
    }
  },
  "corps": {
    "dispositif": "<p>Supprimer les alin&#233;as 63 &#224; 65.</p>",
    "exposeSommaire": "<p style=\"text-align: justify;\">Le Gouvernement souhaite proc&#233;der &#224; la suppression du droit en faveur de l&#8217;Institut national de la qualit&#233; et de l&#8217;origine (INAO) &#224; l&#8217;instar d&#8217;autres taxes affect&#233;es dites &#224; faible rendement.</p><p style=\"text-align: justify;\">Cette suppression est un tr&#232;s mauvais signal pour ce qui concerne le maintien &#224; terme de cet outil original qu&#8217;est l&#8217;INAO dont le mod&#232;le est envi&#233; dans de tr&#232;s nombreux pays &#224; travers le monde.</p><p style=\"text-align: justify;\">Il doit &#234;tre rappel&#233; que cet &#233;tablissement public, n&#233; de la volont&#233; des vignerons et aujourd&#8217;hui comp&#233;tent pour l&#8217;ensemble de l&#8217;agriculture sous signe d&#8217;identification de la qualit&#233; et de l&#8217;origine, rassemble dans diff&#233;rents comit&#233;s nationaux, des repr&#233;sentants des productions agricoles sous SIQO, charg&#233;s en particulier d&#8217;&#233;laborer les cahiers des charges. Ce mode d&#8217;organisation permet notamment de mettre les cahiers des charges des AOC, IGP et Label rouge &#224; l&#8217;abri de d&#233;cisions unilat&#233;rales qui pourraient &#234;tre prises par les distributeurs. Ce mode d&#8217;organisation met aussi les professionnels et leurs cahiers des charges &#224; l&#8217;abri de toute pression de quelque nature qu&#8217;elle soit en confiant aux comit&#233;s nationaux un r&#244;le d&#8217;initiative et un pouvoir de proposition des cahiers charges au ministre de l&#8217;agriculture. Le ministre peut refuser une proposition mais il ne peut pas modifier. Ce pouvoir de proposition a &#233;t&#233; &#224; de nombreuses reprises reconnu par le Conseil d&#8217;&#201;tat.</p><p style=\"text-align: justify;\">Le droit INAO dont la l&#233;gitimit&#233; n&#8217;est pas contest&#233;e par les repr&#233;sentants des professionnels, en apportant jusqu&#8217;&#224; 25&#160;% du budget de l&#8217;Institut t&#233;moigne de leur attachement &#224; ce mode de gouvernance original. De plus, il est vers&#233; &#224; l&#8217;INAO par les organismes de d&#233;fense et de gestion eux-m&#234;mes et ne pr&#233;sente donc pas de co&#251;t de pr&#233;l&#232;vement pour l&#8217;&#201;tat.</p><p style=\"text-align: justify;\">Le Gouvernement souhaite supprimer ce droit au nom d&#8217;une logique administrative. Les professionnels souhaitent son maintien au nom d&#8217;une logique politique.</p><p style=\"text-align: justify;\">Si l&#8217;&#201;tat est pr&#234;t &#224; grever le budget du minist&#232;re de l&#8217;Agriculture de 7 millions d&#8217;euros suppl&#233;mentaires. Soyons certains que cela ne durera pas et que t&#244;t ou tard, le maintien d&#8217;une politique publique de l&#8217;alimentation de qualit&#233; sera remise en cause pour &#234;tre int&#233;gralement transf&#233;r&#233;e entre les mains des seules forces du march&#233;.</p>",
    "annexeExposeSommaire": {
      "@xmlns:xsi": "http://www.w3.org/2001/XMLSchema-instance",
      "@xsi:nil": "true"
    },
    "cartoucheDelaiDepotDepasse": "Sous réserve de son traitement par les services de l'Assemblée nationale et de sa recevabilité",
    "avantAppel": {
      "@xmlns:xsi": "http://www.w3.org/2001/XMLSchema-instance",
      "@xsi:nil": "true"
    }
  },
  "representations": {
    "representation": {
      "nom": "PDF",
      "typeMime": {
        "type": "application",
        "subType": "PDF"
      },
      "statutRepresentation": {
        "verbatim": "true",
        "canonique": "true",
        "officielle": "true",
        "transcription": "false",
        "enregistrement": "false"
      },
      "repSource": {
        "@xmlns:xsi": "http://www.w3.org/2001/XMLSchema-instance",
        "@xsi:nil": "true"
      },
      "offset": {
        "@xmlns:xsi": "http://www.w3.org/2001/XMLSchema-instance",
        "@xsi:nil": "true"
      },
      "contenu": {
        "documentURI": "/15/amendements/2272A/AN/978.pdf"
      },
      "dateDispoRepresentation": {
        "@xmlns:xsi": "http://www.w3.org/2001/XMLSchema-instance",
        "@xsi:nil": "true"
      }
    }
  },
  "seanceDiscussion": "RUANR5L15S2020IDS21870",
  "sort": {
    "dateSaisie": "2019-10-18T16:32:40.000+02:00",
    "sortEnSeance": "Adopté"
  },
  "dateDepot": "2019-10-09T02:00:00.000+02:00",
  "dateDistribution": "2019-10-18T02:00:00.000+02:00",
  "article99": "0",
  "loiReference": {
    "codeLoi": {
      "@xmlns:xsi": "http://www.w3.org/2001/XMLSchema-instance",
      "@xsi:nil": "true"
    },
    "divisionCodeLoi": {
      "@xmlns:xsi": "http://www.w3.org/2001/XMLSchema-instance",
      "@xsi:nil": "true"
    }
  }
}