{
  "@xmlns": "http://schemas.assemblee-nationale.fr/referentiel",
  "uid": "AMANR5L15PO59051B2357P0D1N741",
  "identifiant": {
    "legislature": "15",
    "numero": "741",
    "numRect": "0",
    "saisine": {
      "refTexteLegislatif": "PRJLANR5L15B2357",
      "numeroPartiePLF": "0",
      "organeExamen": "PO59051",
      "mentionSecondeDeliberation": "0"
    }
  },
  "numeroLong": "CL741",
  "etapeTexte": "1ère lecture (2ème assemblée saisie)",
  "triAmendement": "aaoaaaaaaaaaaaaaaaaaaaaaaaaaaaaaaaaaaaaaaaaaaaaaaablq",
  "cardinaliteAmdtMultiples": "1",
  "amendementParent": {
    "@xmlns:xsi": "http://www.w3.org/2001/XMLSchema-instance",
    "@xsi:nil": "true"
  },
  "etat": "Discuté",
  "signataires": {
    "auteur": {
      "typeAuteur": "Depute",
      "acteurRef": "PA722398",
      "organeRef": {
        "@xmlns:xsi": "http://www.w3.org/2001/XMLSchema-instance",
        "@xsi:nil": "true"
      },
      "groupePolitiqueRef": "PO730964"
    },
    "cosignataires": {
      "acteurRef": "PA722398"
    },
    "texteAffichable": "M.&#160;Rebeyrotte"
  },
  "pointeurFragmentTexte": {
    "missionVisee": {
      "@xmlns:xsi": "http://www.w3.org/2001/XMLSchema-instance",
      "@xsi:nil": "true"
    },
    "division": {
      "titre": "Article PREMIER",
      "articleDesignationCourte": "ART. PREMIER",
      "type": "ARTICLE",
      "avant_A_Apres": "A",
      "divisionRattachee": "ARTICLE PREMIER",
      "articleAdditionnel": {
        "@xmlns:xsi": "http://www.w3.org/2001/XMLSchema-instance",
        "@xsi:nil": "true"
      },
      "chapitreAdditionnel": {
        "@xmlns:xsi": "http://www.w3.org/2001/XMLSchema-instance",
        "@xsi:nil": "true"
      },
      "urlDivisionTexteVise": "/15/textes/2357.asp#D_Article_1er"
    },
    "alinea": {
      "avant_A_Apres": "Apres",
      "numero": "13",
      "alineaDesignation": {
        "@xmlns:xsi": "http://www.w3.org/2001/XMLSchema-instance",
        "@xsi:nil": "true"
      }
    }
  },
  "corps": {
    "dispositif": "<p>I. &#8211; Apr&#232;s l&#8217;alin&#233;a&#160;13, ins&#233;rer les&#160;sept alin&#233;as suivants&#160;:</p><p style=\"text-align: justify;\">&#171;&#160;7&#176;&#160;Le transfert &#233;ventuel au pr&#233;sident des attributions de police sp&#233;ciale des maires, sur tout ou partie des communes membres, lui permettant de r&#233;glementer, pour la dur&#233;e du pacte de gouvernance et sous r&#233;serve de l&#8217;approbation de chaque maire concern&#233;&#160;:</p><p style=\"text-align: justify;\">&#171;&#160;<i>a)</i> L&#8217;assainissement d&#232;s lors que l&#8217;&#233;tablissement public de coop&#233;ration intercommunale &#224; fiscalit&#233; propre est comp&#233;tent, sans pr&#233;judice de l&#8217;article L.&#160;2212&#8209;2, du pr&#233;sent code et par d&#233;rogation &#224; l&#8217;article L.&#160;1311&#8209;2 et au deuxi&#232;me alin&#233;a de l&#8217;article L.&#160;1331&#8209;1 du code de la sant&#233; publique&#160;;</p><p style=\"text-align: justify;\">&#171;&#160;<i>b)</i>&#160;La collecte des d&#233;chets d&#232;s lors que l&#8217;&#233;tablissement public de coop&#233;ration intercommunale &#224; fiscalit&#233; propre, sans pr&#233;judice de l&#8217;article L.&#160;2212&#8209;2 et par d&#233;rogation &#224; l&#8217;article L.&#160;2224&#8209;16&#160;;</p><p style=\"text-align: justify;\">&#171;&#160;<i>c)</i> Le stationnement des r&#233;sidences mobiles des gens du voyage d&#232;s lors que l&#8217;&#233;tablissement public de coop&#233;ration intercommunale &#224; fiscalit&#233; propre est comp&#233;tent en mati&#232;re d&#8217;aires d&#8217;accueil des gens du voyage, par d&#233;rogation &#224; l&#8217;article&#160;9 de la loi n&#176;&#160;2000&#8209;614 du 5 juillet 2000 relative &#224; l&#8217;accueil et &#224; l&#8217;habitat des gens du voyage&#160;;</p><p style=\"text-align: justify;\">&#171;&#160;<i>d)</i> La circulation et le stationnement d&#232;s lors que l&#8217;&#233;tablissement public de coop&#233;ration intercommunale &#224; fiscalit&#233; propre est comp&#233;tent en mati&#232;re de voirie, sans pr&#233;judice de l&#8217;article L.&#160;2212&#8209;2 et par d&#233;rogation aux articles L.&#160;2213&#8209;1 &#224; L.&#160;2213&#8209;6&#8209;1&#160;;</p><p style=\"text-align: justify;\">&#171;&#160;<i>e)</i> La d&#233;livrance des autorisations de stationnement sur la voie publique aux exploitants de taxi d&#232;s lors que l&#8217;&#233;tablissement public de coop&#233;ration intercommunale &#224; fiscalit&#233; propre est comp&#233;tent en mati&#232;re de voirie, sans pr&#233;judice de l&#8217;article L.&#160;2212&#8209;2 et par d&#233;rogation &#224; l&#8217;article L.&#160;2213&#8209;33&#160;;</p><p style=\"text-align: justify;\">&#171;&#160;<i>f)</i> L&#8217;habitat indigne gr&#226;ce &#224; la d&#233;l&#233;gation des pr&#233;rogatives pr&#233;vues aux articles L.&#160;123&#8209;3, L.&#160;129&#8209;1 &#224; L.&#160;129&#8209;6, L.&#160;511&#8209;1 &#224; L.&#160;511&#8209;4, L.&#160;511&#8209;5 et L.&#160;511&#8209;6 du code de la construction et de l&#8217;habitation, d&#232;s lors que l&#8217;&#233;tablissement public de coop&#233;ration intercommunale est comp&#233;tent en mati&#232;re d&#8217;&#233;quilibre social de l&#8217;habitat ou de politique de logement et du cadre de vie.&#160;&#187;</p><p style=\"text-align: justify;\">II. &#8211; En cons&#233;quence, apr&#232;s l&#8217;alin&#233;a&#160;22, ins&#233;rer les&#160;trois alin&#233;as suivants&#160;:</p><p style=\"text-align: justify;\">I <i>bis</i>. &#8211; Le A du I de l&#8217;article L.&#160;5211&#8209;9&#8209;2 du code g&#233;n&#233;ral des collectivit&#233;s territoriales est ainsi r&#233;dig&#233;&#160;:</p><p style=\"text-align: justify;\">&#171;&#160;A. &#8211; Sans pr&#233;judice de l&#8217;article L.&#160;2212&#8209;2 et par d&#233;rogation &#224; l&#8217;article L.&#160;2224&#8209;16, lorsqu&#8217;un syndicat mixte est comp&#233;tent en mati&#232;re de collecte des d&#233;chets m&#233;nagers, les maires des communes membres de celui-ci ou membres d&#8217;un &#233;tablissement public de coop&#233;ration intercommunale &#224; fiscalit&#233; propre membre du groupement de collectivit&#233;s transf&#232;rent au pr&#233;sident de ce syndicat les attributions lui permettant de r&#233;glementer cette activit&#233;, d&#232;s lors que les pactes de gouvernance des &#233;tablissements publics de coop&#233;ration intercommunale &#224; fiscalit&#233; propre pr&#233;vus &#224; l&#8217;article L.&#160;5211&#8209;11&#8209;1 n&#8217;en ont pas d&#233;termin&#233; le transfert aux pr&#233;sidents de ces &#233;tablissements.</p><p style=\"text-align: justify;\">&#171;&#160;Ce transfert a lieu &#224; l&#8217;expiration du d&#233;lai pr&#233;vu au I de l&#8217;article L.&#160;5211&#8209;11&#8209;1.&#160;&#187;</p>",
    "exposeSommaire": "<p>Le l&#233;gislateur a pr&#233;vu le transfert, aux pr&#233;sidents d&#8217;&#233;tablissements publics de coop&#233;ration intercommunale (EPCI) &#224; fiscalit&#233; propre, de pouvoirs de police administrative sp&#233;ciale correspondant aux comp&#233;tences exerc&#233;es par l&#8217;intercommunalit&#233;. Actuellement, le transfert est automatique lors de l&#8217;&#233;lection du pr&#233;sident et les maires disposent de six mois pour s&#8217;y opposer.</p><p>&#160;</p><p>Dans les faits, cette proc&#233;dure pr&#233;sente plusieurs inconv&#233;nients. Elle a pour effet de faire commencer le mandat municipal et intercommunal par une d&#233;cision n&#233;gative des maires alors que se construit le fonctionnement politique des nouvelles &#233;quipes. Par ailleurs, le d&#233;lai relativement court et l&#8217;absence de d&#233;bat collectif nuisent &#224; un choix serein de transf&#233;rer ou non les pouvoirs de police sp&#233;ciale et &#224; la coh&#233;rence des actions communales et intercommunales.</p><p>&#160;</p><p>Cet amendement propose d&#8217;int&#233;grer dans le pacte de gouvernance &#233;labor&#233; en d&#233;but de mandature un d&#233;bat sur le transfert des pouvoirs de police sp&#233;ciale. Il pr&#233;voit que ces transferts &#233;ventuels doivent &#234;tre approuv&#233;s par chacun des maires concern&#233;s. Ils sont d&#233;finis pour la dur&#233;e du pacte de gouvernance.</p><p>&#160;</p><p>Tel est l&#8217;objet du pr&#233;sent amendement.</p>",
    "annexeExposeSommaire": {
      "@xmlns:xsi": "http://www.w3.org/2001/XMLSchema-instance",
      "@xsi:nil": "true"
    },
    "cartoucheDelaiDepotDepasse": {
      "@xmlns:xsi": "http://www.w3.org/2001/XMLSchema-instance",
      "@xsi:nil": "true"
    },
    "avantAppel": {
      "@xmlns:xsi": "http://www.w3.org/2001/XMLSchema-instance",
      "@xsi:nil": "true"
    }
  },
  "representations": {
    "representation": {
      "nom": "PDF",
      "typeMime": {
        "type": "application",
        "subType": "PDF"
      },
      "statutRepresentation": {
        "verbatim": "true",
        "canonique": "true",
        "officielle": "true",
        "transcription": "false",
        "enregistrement": "false"
      },
      "repSource": {
        "@xmlns:xsi": "http://www.w3.org/2001/XMLSchema-instance",
        "@xsi:nil": "true"
      },
      "offset": {
        "@xmlns:xsi": "http://www.w3.org/2001/XMLSchema-instance",
        "@xsi:nil": "true"
      },
      "contenu": {
        "documentURI": "/15/amendements/2357/CION_LOIS/CL741.pdf"
      },
      "dateDispoRepresentation": {
        "@xmlns:xsi": "http://www.w3.org/2001/XMLSchema-instance",
        "@xsi:nil": "true"
      }
    }
  },
  "seanceDiscussion": {
    "@xmlns:xsi": "http://www.w3.org/2001/XMLSchema-instance",
    "@xsi:nil": "true"
  },
  "sort": {
    "dateSaisie": "2019-11-06T10:14:12.000+01:00",
    "sortEnSeance": "Tombé"
  },
  "dateDepot": "2019-11-01T01:00:00.000+01:00",
  "dateDistribution": "2019-11-05T01:00:00.000+01:00",
  "article99": "0",
  "loiReference": {
    "codeLoi": "3",
    "divisionCodeLoi": {
      "@xmlns:xsi": "http://www.w3.org/2001/XMLSchema-instance",
      "@xsi:nil": "true"
    }
  }
}