{
  "@xmlns": "http://schemas.assemblee-nationale.fr/referentiel",
  "uid": "AMANR5L15SEA717460B2416P0D1N119",
  "identifiant": {
    "legislature": "15",
    "numero": "119",
    "numRect": "0",
    "saisine": {
      "refTexteLegislatif": "PRJLANR5L15B2416",
      "numeroPartiePLF": "0",
      "organeExamen": "PO717460",
      "mentionSecondeDeliberation": "0"
    }
  },
  "numeroLong": "119",
  "etapeTexte": "Nouvelle Lecture",
  "triAmendement": "ddiaaaaaaaaaaaaaaaaaaaaaaaaaaaaaaaaaaaaaaaaaaaaaaafi",
  "cardinaliteAmdtMultiples": "1",
  "amendementParent": {
    "@xmlns:xsi": "http://www.w3.org/2001/XMLSchema-instance",
    "@xsi:nil": "true"
  },
  "etat": "En recevabilité",
  "signataires": {
    "auteur": {
      "typeAuteur": "Depute",
      "acteurRef": "PA720286",
      "organeRef": {
        "@xmlns:xsi": "http://www.w3.org/2001/XMLSchema-instance",
        "@xsi:nil": "true"
      },
      "groupePolitiqueRef": "PO730958"
    },
    "cosignataires": {
      "acteurRef": [
        "PA719578",
        "PA722142",
        "PA721960",
        "PA2150",
        "PA720892",
        "PA720422",
        "PA719676",
        "PA588884",
        "PA721202",
        "PA720846",
        "PA718860",
        "PA721062",
        "PA718868",
        "PA721226",
        "PA720286",
        "PA720430",
        "PA721210"
      ]
    },
    "texteAffichable": "Mme&#160;Fiat,  Mme&#160;Autain, M.&#160;Bernalicis, M.&#160;Coquerel, M.&#160;Corbi&#232;re, M.&#160;Lachaud, M.&#160;Larive, M.&#160;M&#233;lenchon, Mme&#160;Obono, Mme&#160;Panot, M.&#160;Prud&apos;homme, M.&#160;Quatennens, M.&#160;Ratenon, Mme&#160;Ressiguier, Mme&#160;Rubin, M.&#160;Ruffin et Mme&#160;Taurine"
  },
  "pointeurFragmentTexte": {
    "missionVisee": {
      "@xmlns:xsi": "http://www.w3.org/2001/XMLSchema-instance",
      "@xsi:nil": "true"
    },
    "division": {
      "titre": "Article 25",
      "articleDesignationCourte": "ART. 25",
      "type": "ARTICLE",
      "avant_A_Apres": "A",
      "divisionRattachee": "ARTICLE 25",
      "articleAdditionnel": {
        "@xmlns:xsi": "http://www.w3.org/2001/XMLSchema-instance",
        "@xsi:nil": "true"
      },
      "chapitreAdditionnel": {
        "@xmlns:xsi": "http://www.w3.org/2001/XMLSchema-instance",
        "@xsi:nil": "true"
      },
      "urlDivisionTexteVise": "/15/textes/2416.asp#D_Article_25"
    },
    "alinea": {
      "avant_A_Apres": {
        "@xmlns:xsi": "http://www.w3.org/2001/XMLSchema-instance",
        "@xsi:nil": "true"
      },
      "numero": "48",
      "alineaDesignation": {
        "@xmlns:xsi": "http://www.w3.org/2001/XMLSchema-instance",
        "@xsi:nil": "true"
      }
    }
  },
  "corps": {
    "dispositif": "<p style=\"text-align: justify;\">Compl&#233;ter la derni&#232;re phrase de l&#8217;alin&#233;a&#160;48 par les mots&#160;:</p><p style=\"text-align: justify;\">&#171;&#160;en fonction de crit&#232;res favorisant les &#233;tablissements de sant&#233; publics par rapport aux &#233;tablissements de sant&#233; priv&#233;s&#160;&#187;.</p>",
    "exposeSommaire": "<p style=\"text-align: justify;\">En 40 ans, le poids relatif du priv&#233; par rapport au public en mati&#232;re d&#8217;hospitalisation en psychiatrie a plus que doubl&#233;. Les cliniques psychiatriques priv&#233;es sont de plus en plus concentr&#233;es au sein de quelques grands groupes&#160;: Ramsey g&#233;n&#233;rale de sant&#233; (30 cliniques en France), Clinea, lui-m&#234;me propri&#233;t&#233; du groupe Orpea, l&#8217;un des leaders des maisons de retraites priv&#233;es (38 cliniques en France). Pourtant, qu&#8217;ils s&#8217;agisse de l&#8217;h&#244;pital ou des structures sociales et m&#233;dico-sociales, il est n&#233;cessaire de reb&#226;tir la psychiatrie publique car elle est &#224; la seule &#224; pouvoir assurer&#160;:</p><p style=\"text-align: justify;\">- la gratuit&#233; des soins&#160;: pas de d&#233;passements d&#8217;honoraires, pas de co&#251;ts suppl&#233;mentaires par nuit&#233;e, etc&#8230;</p><p style=\"text-align: justify;\">- la prise en charge des urgences et des cas les plus lourds. En France en 2017, plus de 99&#160;% des personnes hospitalis&#233;es sous contrainte ont &#233;t&#233; prises en charge dans les h&#244;pitaux publics. Tandis que les hospitalisations libres vont en majorit&#233; dans le priv&#233;.</p><p style=\"text-align: justify;\">- des conditions de travail meilleures (pour les fonctionnaires) que dans le priv&#233; (o&#249; la concurrence les tire vers le bas). Notons que le secteur priv&#233; est brandi comme une menace face aux soignants du public&#160;: &#171;&#160;on nous dit&#160;&#187;attention, si vous vous plaignez trop, les lits seront donn&#233;s au priv&#233;&#171;&#160;, t&#233;moigne Olivier, infirmier psy &#224; Caen.</p><p style=\"text-align: justify;\">- des &#233;quipes qui se connaissent tout au long du parcours du patient et qui assurent ainsi une continuit&#233; relationnelle entre l&#8217;extra-hospitalier et l&#8217;intra-hospitalier.</p><p style=\"text-align: justify;\">- une bonne r&#233;partition sur l&#8217;ensemble du territoire contrairement &#224; l&#8217;offre priv&#233; qui se concentrent dans les r&#233;gions les plus rentables</p><p style=\"text-align: justify;\">Cet amendement demande &#224; ce que le financement des &#233;tablissements psychiatriques favorise les &#233;tablissements publics.</p>",
    "annexeExposeSommaire": {
      "@xmlns:xsi": "http://www.w3.org/2001/XMLSchema-instance",
      "@xsi:nil": "true"
    },
    "cartoucheDelaiDepotDepasse": "Sous réserve de son traitement par les services de l'Assemblée nationale et de sa recevabilité",
    "avantAppel": {
      "@xmlns:xsi": "http://www.w3.org/2001/XMLSchema-instance",
      "@xsi:nil": "true"
    }
  },
  "representations": {
    "representation": {
      "nom": "PDF",
      "typeMime": {
        "type": "application",
        "subType": "PDF"
      },
      "statutRepresentation": {
        "verbatim": "true",
        "canonique": "true",
        "officielle": "true",
        "transcription": "false",
        "enregistrement": "false"
      },
      "repSource": {
        "@xmlns:xsi": "http://www.w3.org/2001/XMLSchema-instance",
        "@xsi:nil": "true"
      },
      "offset": {
        "@xmlns:xsi": "http://www.w3.org/2001/XMLSchema-instance",
        "@xsi:nil": "true"
      },
      "contenu": {
        "documentURI": "/15/amendements/2416/AN/119.pdf"
      },
      "dateDispoRepresentation": {
        "@xmlns:xsi": "http://www.w3.org/2001/XMLSchema-instance",
        "@xsi:nil": "true"
      }
    }
  },
  "seanceDiscussion": {
    "@xmlns:xsi": "http://www.w3.org/2001/XMLSchema-instance",
    "@xsi:nil": "true"
  },
  "sort": {
    "@xmlns:xsi": "http://www.w3.org/2001/XMLSchema-instance",
    "@xsi:nil": "true"
  },
  "dateDepot": "2019-11-21T01:00:00.000+01:00",
  "dateDistribution": "2019-11-21T01:00:00.000+01:00",
  "article99": "0",
  "loiReference": {
    "codeLoi": {
      "@xmlns:xsi": "http://www.w3.org/2001/XMLSchema-instance",
      "@xsi:nil": "true"
    },
    "divisionCodeLoi": {
      "@xmlns:xsi": "http://www.w3.org/2001/XMLSchema-instance",
      "@xsi:nil": "true"
    }
  }
}