{
  "@xmlns": "http://schemas.assemblee-nationale.fr/referentiel",
  "uid": "AMANR5L15SEA717460B0911P0D1N1886",
  "identifiant": {
    "legislature": "15",
    "numero": "1886",
    "numRect": "0",
    "saisine": {
      "refTexteLegislatif": "PRJLANR5L15B0911",
      "numeroPartiePLF": "0",
      "organeExamen": "PO717460",
      "mentionSecondeDeliberation": "0"
    }
  },
  "numeroLong": "1886",
  "etapeTexte": "1ère lecture (1ère assemblée saisie)",
  "triAmendement": "abzzhzxo",
  "cardinaliteAmdtMultiples": "1",
  "amendementParent": {
    "@xmlns:xsi": "http://www.w3.org/2001/XMLSchema-instance",
    "@xsi:nil": "true"
  },
  "etat": "Discuté",
  "signataires": {
    "auteur": {
      "typeAuteur": "Depute",
      "acteurRef": "PA720772",
      "organeRef": {
        "@xmlns:xsi": "http://www.w3.org/2001/XMLSchema-instance",
        "@xsi:nil": "true"
      },
      "groupePolitiqueRef": "PO730970"
    },
    "cosignataires": {
      "acteurRef": [
        "PA720780",
        "PA719138",
        "PA720178",
        "PA720772",
        "PA719210",
        "PA719558"
      ]
    },
    "texteAffichable": "M.&#160;Bru,  M.&#160;Joncour, M.&#160;Garcia, M.&#160;Sempastous, M.&#160;Castellani et M.&#160;Balanant"
  },
  "pointeurFragmentTexte": {
    "missionVisee": {
      "@xmlns:xsi": "http://www.w3.org/2001/XMLSchema-instance",
      "@xsi:nil": "true"
    },
    "division": {
      "titre": "Article PREMIER",
      "articleDesignationCourte": "AVANT ART. PREMIER",
      "type": "ARTICLE",
      "avant_A_Apres": "Avant",
      "divisionRattachee": "AVANT L'ARTICLE PREMIER, insérer l'article suivant:",
      "articleAdditionnel": "1",
      "chapitreAdditionnel": {
        "@xmlns:xsi": "http://www.w3.org/2001/XMLSchema-instance",
        "@xsi:nil": "true"
      },
      "urlDivisionTexteVise": "/15/textes/0911.asp#D_Article_1er"
    },
    "alinea": {
      "@xmlns:xsi": "http://www.w3.org/2001/XMLSchema-instance",
      "@xsi:nil": "true"
    }
  },
  "corps": {
    "dispositif": "<p style=\"text-align: justify;\">Le premier alin&#233;a de l&#8217;article&#160;1<sup>er</sup> de la Constitution est compl&#233;t&#233; par une phrase ainsi r&#233;dig&#233;e&#160;: &#171;&#160;Elle s&#8217;inscrit au sein de l&#8217;Union&#160;Europ&#233;enne.&#160;&#187;</p>",
    "exposeSommaire": "<p style=\"text-align: justify;\">La France est un membre fondateur de la Communaut&#233;&#160;europ&#233;enne, soit avant-m&#234;me la r&#233;daction de la Constitution de la Ve R&#233;publique en 1958. Ce n&#8217;est que tardivement que le Titre XV &#171;&#160;de l&#8217;Union&#160;europ&#233;enne&#160;&#187; a donn&#233; sa place &#224; l&#8217;espace politique&#160;europ&#233;en dans notre Constitution.&#160;</p><p style=\"text-align: justify;\">A l&#8217;heure de la multiplicit&#233; des d&#233;mocraties illib&#233;rales en&#160;Europe, il est essentiel de rappeler et montrer notre attachement &#224; l&#8217;Union&#160;Europ&#233;enne et ses valeurs, au sein-m&#234;me de notre Constitution. Avec le temps et par sa nature sui generis, l&#8217;espace&#160;europ&#233;en a impr&#233;gn&#233; nos institutions et notre soci&#233;t&#233; de son existence.&#160;</p><p style=\"text-align: justify;\">Ainsi, cet amendement vise &#224; inscrire au premier alin&#233;a de l&#8217;article&#160;1 de la Constitution que la R&#233;publique fran&#231;aise s&#8217;inscrit au sein de l&#8217;Union&#160;Europ&#233;enne.</p>",
    "annexeExposeSommaire": {
      "@xmlns:xsi": "http://www.w3.org/2001/XMLSchema-instance",
      "@xsi:nil": "true"
    }
  },
  "representations": {
    "representation": {
      "nom": "PDF",
      "typeMime": {
        "type": "application",
        "subType": "PDF"
      },
      "statutRepresentation": {
        "verbatim": "true",
        "canonique": "true",
        "officielle": "true",
        "transcription": "false",
        "enregistrement": "false"
      },
      "repSource": {
        "@xmlns:xsi": "http://www.w3.org/2001/XMLSchema-instance",
        "@xsi:nil": "true"
      },
      "offset": {
        "@xmlns:xsi": "http://www.w3.org/2001/XMLSchema-instance",
        "@xsi:nil": "true"
      },
      "contenu": {
        "documentURI": "/15/amendements/0911/AN/1886.pdf"
      },
      "dateDispoRepresentation": {
        "@xmlns:xsi": "http://www.w3.org/2001/XMLSchema-instance",
        "@xsi:nil": "true"
      }
    }
  },
  "seanceDiscussion": "RUANR5L15S2018IDS21163",
  "sort": {
    "dateSaisie": "2018-07-12T15:09:44.000+02:00",
    "sortEnSeance": "Rejeté"
  },
  "dateDepot": "2018-07-06T02:00:00.000+02:00",
  "dateDistribution": "2018-07-08T02:00:00.000+02:00",
  "article99": "0",
  "loiReference": {
    "codeLoi": "Constitution",
    "divisionCodeLoi": "1"
  }
}