{
  "@xmlns": "http://schemas.assemblee-nationale.fr/referentiel",
  "uid": "AMANR5L15PO419865B2274P0D1N802",
  "identifiant": {
    "legislature": "15",
    "numero": "802",
    "numRect": "0",
    "saisine": {
      "refTexteLegislatif": "PRJLANR5L15B2274",
      "numeroPartiePLF": "0",
      "organeExamen": "PO419865",
      "mentionSecondeDeliberation": "0"
    }
  },
  "numeroLong": "CD802",
  "etapeTexte": "1ère lecture (2ème assemblée saisie)",
  "triAmendement": "ejaaaaaaaaaaaaaaaaaaaaaaaaaaaaaaaaaaaaaaaaaaaaaaaaumi",
  "cardinaliteAmdtMultiples": "1",
  "amendementParent": {
    "@xmlns:xsi": "http://www.w3.org/2001/XMLSchema-instance",
    "@xsi:nil": "true"
  },
  "etat": "En traitement",
  "signataires": {
    "auteur": {
      "typeAuteur": "Depute",
      "acteurRef": "PA720586",
      "organeRef": {
        "@xmlns:xsi": "http://www.w3.org/2001/XMLSchema-instance",
        "@xsi:nil": "true"
      },
      "groupePolitiqueRef": "PO730934"
    },
    "cosignataires": {
      "acteurRef": "PA720586"
    },
    "texteAffichable": "M.&#160;Vatin"
  },
  "pointeurFragmentTexte": {
    "missionVisee": {
      "@xmlns:xsi": "http://www.w3.org/2001/XMLSchema-instance",
      "@xsi:nil": "true"
    },
    "division": {
      "titre": "Article 8",
      "articleDesignationCourte": "ART. 8",
      "type": "ARTICLE",
      "avant_A_Apres": "A",
      "divisionRattachee": "ARTICLE 8",
      "articleAdditionnel": {
        "@xmlns:xsi": "http://www.w3.org/2001/XMLSchema-instance",
        "@xsi:nil": "true"
      },
      "chapitreAdditionnel": {
        "@xmlns:xsi": "http://www.w3.org/2001/XMLSchema-instance",
        "@xsi:nil": "true"
      },
      "urlDivisionTexteVise": "/15/textes/2274.asp#D_Article_8"
    },
    "alinea": {
      "avant_A_Apres": {
        "@xmlns:xsi": "http://www.w3.org/2001/XMLSchema-instance",
        "@xsi:nil": "true"
      },
      "numero": "85",
      "alineaDesignation": {
        "@xmlns:xsi": "http://www.w3.org/2001/XMLSchema-instance",
        "@xsi:nil": "true"
      }
    }
  },
  "corps": {
    "dispositif": "<p style=\"text-align: justify;\">Apr&#232;s les mots \"service &#233;quivalent sont pr&#233;vus\" ins&#233;rer les mots suivants \", lorsque le distributeur finance et organise ou fait organiser un syst&#232;me de collecte de proximit&#233;\"</p>",
    "exposeSommaire": "<p style=\"text-align: justify;\">L&#8217;article 8 g&#233;n&#233;ralise le principe de reprise par le distributeur des produits usag&#233;s pour toute vente d&#8217;un produit neuf (obligation de reprise 1 pour 1). Au-del&#224; d&#8217;un certain seuil de surface d&#233;fini par voie r&#233;glementaire, cette reprise s&#8217;effectuerait sans obligation d&#8217;achat (reprise 1 pour 0) lorsque le distributeur dispose d&#8217;un magasin physique exposant des produits de m&#234;me type. Les places de march&#233; de vente en ligne assument &#233;galement cette obligation, au lieu de livraison. Dans le secteur textile, la reprise des produits usag&#233;s est d&#8217;ores et d&#233;j&#224; pratiqu&#233;e &#224; large &#233;chelle, gr&#226;ce &#224; un r&#233;seau de plus de 45 000 Points d&#8217;Apport Volontaire (bornes sur la voie publique, aux caisses en magasins, associations, etc.) mis en place par l&#8217;&#233;co-organisme ECO TLC. Cette obligation de reprise impos&#233;e au distributeur ajouterait, certes des points de collecte mais d&#233;sorganiserait surtout le circuit d&#233;j&#224; existant. Le secteur associatif, principal op&#233;rateur des points de collecte &#224; ce jour, serait tr&#232;s affaibli, car il se verrait priv&#233; d&#8217;une part substantielle de ses ressources. De plus, il serait injustifi&#233; que les enseignes du secteur textile r&#233;alisent une collecte dans leurs magasins, alors qu&#8217;elles y contribuent d&#233;j&#224; en finan&#231;ant l&#8217;&#233;co-organisme ECO TLC. Elles seraient amen&#233;es &#224; payer deux fois. Enfin, du point de vue des enseignes, cela poserait des difficult&#233;s pratiques. En premier lieu, l&#8217;organisation de ce syst&#232;me de reprise n&#233;cessiterait du personnel en plus pour la gestion des produits repris, leur tri et leur acheminement aupr&#232;s des associations. En second lieu, cela g&#233;n&#233;rerait des soucis de stockage. Dans les magasins les surfaces sont optimis&#233;es au maximum, laissant peu d&#8217;espace au stockage, d&#233;j&#224; encombr&#233; par les e-r&#233;servations et les colis &#171; click and collect &#187;. Il est donc &#224; craindre que cette obligation ne nuise plus qu&#8217;elle ne b&#233;n&#233;ficie aux magasins physiques, ceux-ci &#233;tant d&#233;j&#224; en difficult&#233;s face au e-commerce. Pour toutes ces raisons, il est n&#233;cessaire d&#8217;exempter les distributeurs du secteur textiles disposant d&#233;j&#224; d&#8217;un dispositif de collecte</p>",
    "annexeExposeSommaire": {
      "@xmlns:xsi": "http://www.w3.org/2001/XMLSchema-instance",
      "@xsi:nil": "true"
    },
    "cartoucheDelaiDepotDepasse": "Sous réserve de son traitement par les services de l'Assemblée nationale et de sa recevabilité",
    "avantAppel": {
      "@xmlns:xsi": "http://www.w3.org/2001/XMLSchema-instance",
      "@xsi:nil": "true"
    }
  },
  "representations": {
    "representation": {
      "nom": "PDF",
      "typeMime": {
        "type": "application",
        "subType": "PDF"
      },
      "statutRepresentation": {
        "verbatim": "true",
        "canonique": "true",
        "officielle": "true",
        "transcription": "false",
        "enregistrement": "false"
      },
      "repSource": {
        "@xmlns:xsi": "http://www.w3.org/2001/XMLSchema-instance",
        "@xsi:nil": "true"
      },
      "offset": {
        "@xmlns:xsi": "http://www.w3.org/2001/XMLSchema-instance",
        "@xsi:nil": "true"
      },
      "contenu": {
        "documentURI": "/15/amendements/2274/CION-DVP/CD802.pdf"
      },
      "dateDispoRepresentation": {
        "@xmlns:xsi": "http://www.w3.org/2001/XMLSchema-instance",
        "@xsi:nil": "true"
      }
    }
  },
  "seanceDiscussion": {
    "@xmlns:xsi": "http://www.w3.org/2001/XMLSchema-instance",
    "@xsi:nil": "true"
  },
  "sort": {
    "@xmlns:xsi": "http://www.w3.org/2001/XMLSchema-instance",
    "@xsi:nil": "true"
  },
  "dateDepot": "2019-11-20T01:00:00.000+01:00",
  "dateDistribution": {
    "@xmlns:xsi": "http://www.w3.org/2001/XMLSchema-instance",
    "@xsi:nil": "true"
  },
  "article99": "0",
  "loiReference": {
    "codeLoi": {
      "@xmlns:xsi": "http://www.w3.org/2001/XMLSchema-instance",
      "@xsi:nil": "true"
    },
    "divisionCodeLoi": {
      "@xmlns:xsi": "http://www.w3.org/2001/XMLSchema-instance",
      "@xsi:nil": "true"
    }
  }
}