{
  "@xmlns": "http://schemas.assemblee-nationale.fr/referentiel",
  "uid": "AMANR5L15PO59048B1255P1D1N1402",
  "identifiant": {
    "legislature": "15",
    "numero": "1402",
    "numRect": "0",
    "saisine": {
      "refTexteLegislatif": "PRJLANR5L15B1255",
      "numeroPartiePLF": "1",
      "organeExamen": "PO59048",
      "mentionSecondeDeliberation": "0"
    }
  },
  "numeroLong": "I-CF1402",
  "etapeTexte": "1ère lecture (1ère assemblée saisie)",
  "triAmendement": "efaaaaaaaaaaaaaaaaaaaaaaaaaaaaaaaaaaaaaaaaaaaaaaaahwwk",
  "cardinaliteAmdtMultiples": "1",
  "amendementParent": {
    "@xmlns:xsi": "http://www.w3.org/2001/XMLSchema-instance",
    "@xsi:nil": "true"
  },
  "etat": "Retiré",
  "signataires": {
    "auteur": {
      "typeAuteur": "Depute",
      "acteurRef": "PA718802",
      "organeRef": {
        "@xmlns:xsi": "http://www.w3.org/2001/XMLSchema-instance",
        "@xsi:nil": "true"
      },
      "groupePolitiqueRef": "PO730964"
    },
    "cosignataires": {
      "acteurRef": [
        "PA720342",
        "PA719326",
        "PA721398",
        "PA719130",
        "PA720414",
        "PA722170",
        "PA718794",
        "PA719154",
        "PA719890",
        "PA722300",
        "PA720054",
        "PA718876",
        "PA721384",
        "PA719592",
        "PA721426",
        "PA720538",
        "PA720362",
        "PA720944",
        "PA721876",
        "PA719024",
        "PA720790",
        "PA719790",
        "PA607619",
        "PA718728",
        "PA718802",
        "PA719258",
        "PA718902",
        "PA719032"
      ]
    },
    "texteAffichable": "M.&#160;Perea,  Mme&#160;Michel, M.&#160;Belhaddad, M.&#160;Martin, M.&#160;Haury, Mme&#160;Le Peih, M.&#160;Chalumeau, Mme&#160;Vanceunebrock-Mialon, M.&#160;Morenas, Mme&#160;Park, Mme&#160;Riotton, Mme&#160;Degois, M.&#160;Molac, M.&#160;Perrot, M.&#160;Bouyx, Mme&#160;Khedher, M.&#160;Delpon, M.&#160;C&#233;dric&#160;Roussel, Mme&#160;De Temmerman, Mme&#160;Beaudouin-Hubiere, M.&#160;Besson-Moreau, Mme&#160;H&#233;rin, Mme&#160;Fontenel-Personne, Mme&#160;Gipson, M.&#160;Blanchet, M.&#160;Grau, M.&#160;Simian et Mme&#160;Brulebois"
  },
  "pointeurFragmentTexte": {
    "missionVisee": {
      "@xmlns:xsi": "http://www.w3.org/2001/XMLSchema-instance",
      "@xsi:nil": "true"
    },
    "division": {
      "titre": "Article 18",
      "articleDesignationCourte": "APRÈS ART. 18",
      "type": "ARTICLE",
      "avant_A_Apres": "Après",
      "divisionRattachee": "APRÈS L'ARTICLE 18, insérer l'article suivant:",
      "articleAdditionnel": "1",
      "chapitreAdditionnel": {
        "@xmlns:xsi": "http://www.w3.org/2001/XMLSchema-instance",
        "@xsi:nil": "true"
      },
      "urlDivisionTexteVise": "/15/textes/1255A.asp#D_Article_18"
    },
    "alinea": {
      "@xmlns:xsi": "http://www.w3.org/2001/XMLSchema-instance",
      "@xsi:nil": "true"
    }
  },
  "corps": {
    "dispositif": "<p>I.&#160;&#160;&#160;&#160;&#160;&#160;&#160; Apr&#232;s l&#8217;article 73 du code g&#233;n&#233;ral des imp&#244;ts, il est cr&#233;&#233; un nouvel article 73 bis ainsi r&#233;dig&#233;&#160;:</p><p>&#160;&#171;&#160;Article 73 bis- I. Les exploitants agricoles soumis &#224; un r&#233;gime r&#233;el d&#8217;imposition peuvent constituer une r&#233;serve de pr&#233;caution en stocks dans les conditions et limites suivantes&#160;:</p><p>1&#176;. &#171; La constitution de la r&#233;serve doit &#234;tre inscrite dans les &#233;critures de l&#8217;exercice et ouvre droit &#224; une d&#233;duction du r&#233;sultat imposable. Cette r&#233;serve de pr&#233;caution est admise sous r&#233;serve d&#8217;un accroissement des stocks de produits constat&#233; au titre d&#8217;un exercice. Ainsi constitu&#233;e, elle ne peut exc&#233;der 30% de la valeur du stock de produits cumul&#233;e avec les r&#233;serves ainsi pratiqu&#233;es au titre des exercices ant&#233;rieurs.</p><p>2&#176;. Dans la limite du b&#233;n&#233;fice, la d&#233;duction &#224; laquelle donne droit la r&#233;serve est plafonn&#233;e&#160;&#224;&#160;un montant global fix&#233;, par exercice de douze mois, &#224; 20&#160;000 &#8364; major&#233; de 30% du chiffre d&#8217;affaires de l&#8217;exercice.</p><p>&#160;</p><p>3&#176;. La d&#233;duction ainsi pratiqu&#233;e est plafonn&#233;e, pour les exploitants individuels, soit &#224; la diff&#233;rence positive entre la somme de 150&#160;000 &#8364; et le montant des d&#233;ductions pratiqu&#233;es et non encore rapport&#233;es au r&#233;sultat, soit au chiffre d&#8217;affaires moyen d&#233;termin&#233; au titre des cinq derniers exercices pr&#233;c&#233;dant celui de la d&#233;duction.</p><p>&#160;</p><p>4&#176;. Pour les groupements agricoles d&#8217;exploitation en commun et les exploitations agricoles &#224; responsabilit&#233; limit&#233;e qui n&#8217;ont pas opt&#233; pour le r&#233;gime fiscal des soci&#233;t&#233;s de capitaux, la d&#233;duction ainsi pratiqu&#233;e est plafonn&#233;e soit &#224; la diff&#233;rence positive entre la somme de 150&#160;000 &#8364;, multipli&#233;e par le nombre des associ&#233;s exploitants, dans la limite de quatre, et le montant des d&#233;ductions pratiqu&#233;es et non encore rapport&#233;es au r&#233;sultat, soit au chiffre d&#8217;affaires moyen d&#233;termin&#233; au titre des cinq derniers exercices pr&#233;c&#233;dant celui de la d&#233;duction.</p><p>&#160;</p><p>II.&#160;&#160;&#160;&#160;&#160;&#160;&#160; L&#8217;exploitant peut utiliser la r&#233;serve ainsi constitu&#233;e selon le montant souhait&#233; et pour les cas suivants&#160;:</p><p>1&#176; Au titre de l'exercice de survenance d'un al&#233;a d'origine climatique, naturelle ou sanitaire, reconnu par une autorit&#233; administrative comp&#233;tente, ou au titre des deux exercices suivants ;</p><p>2&#176; Au titre de l'exercice de survenance d'un al&#233;a &#233;conomique, lequel est &#233;tabli par une baisse de la valeur ajout&#233;e de l'exercice, par rapport &#224; la moyenne des valeurs ajout&#233;es des trois ou des cinq exercices pr&#233;c&#233;dents, sup&#233;rieure &#224; 5% ;</p><p>III. &#160;1&#176; La r&#233;serve en stocks ainsi utilis&#233;e est rapport&#233;e au r&#233;sultat de l'exercice au cours duquel intervient son utilisation au sens du II.</p><p>Lorsque la r&#233;serve est utilis&#233;e dans des cas autres que ceux mentionn&#233;s au II du pr&#233;sent article, elle est rapport&#233;e au r&#233;sultat de l'exercice au cours duquel cette utilisation a &#233;t&#233; effectu&#233;e et major&#233;e d'un montant &#233;gal au produit de ces sommes et int&#233;r&#234;ts par le taux de l'int&#233;r&#234;t de retard pr&#233;vu &#224; l'article 1727. Les int&#233;r&#234;ts de retard courent &#224; compter de la date d&#8217;ouverture de l&#8217;exercice suivant celui au titre duquel la d&#233;duction a &#233;t&#233; op&#233;r&#233;e.</p><p>2&#176; La r&#233;serve est &#233;galement rapport&#233;e, &#224; hauteur de la fraction exc&#233;dant &#160;&#160;&#160;&#160;&#160;&#160;&#160;&#160;&#160;&#160; soit&#160;:</p><p>-&#160;&#160;&#160;&#160;&#160;&#160; 30% de la valeur du stock final &#224; la cl&#244;ture de l&#8217;exercice&#160;;</p><p>-&#160;&#160;&#160;&#160;&#160;&#160; le plafond global vis&#233; au 3&#176; du I.</p><p>Dans ces deux cas, la reprise de la r&#233;serve est r&#233;alis&#233;e soit, au titre de l&#8217;exercice de d&#233;passement desdites limites, soit au titre de l&#8217;exercice suivant.</p><p>&#160;</p><p>IV.&#160;&#160;&#160;&#160;&#160;&#160;&#160; En cas de cessation d&#8217;activit&#233;, ou d&#8217;assujettissement au r&#233;gime d&#8217;imposition vis&#233; &#224; l&#8217;article 64 bis, le montant de la r&#233;serve ouvrant droit &#224; d&#233;duction est obligatoirement rapport&#233; au r&#233;sultat de l&#8217;exercice clos &#224; l&#8217;occasion de cet &#233;v&#232;nement et impos&#233;es au choix de l&#8217;exploitant selon les modalit&#233;s de l&#8217;article 163 0 A du CGI.&#160;</p><p>V.&#160;&#160;&#160;&#160;&#160;&#160;&#160; L&#8217;apport d&#8217;une exploitation individuelle ou d&#8217;une branche compl&#232;te d&#8217;activit&#233;, dans les conditions vis&#233;es au I de l&#8217;article 151 octies, &#224; une soci&#233;t&#233; civile agricole par un exploitant agricole qui a constitu&#233; une r&#233;serve de pr&#233;caution au titre d&#8217;un exercice pr&#233;c&#233;dant celui de l&#8217;apport n&#8217;est pas consid&#233;r&#233; pour l&#8217;application du I comme une cessation d&#8217;activit&#233;.</p><p>VI.&#160;&#160;&#160;&#160;&#160;&#160;&#160; La transmission &#224; titre gratuit d&#8217;une exploitation dans les conditions pr&#233;vues &#224; l&#8217;article 41 par un exploitant agricole qui a constitu&#233; une r&#233;serve de pr&#233;caution au titre d&#8217;un exercice pr&#233;c&#233;dant celui de la transmission n&#8217;est pas consid&#233;r&#233; pour l&#8217;application du I comme une cessation d&#8217;activit&#233;.</p><p>VII.&#160;&#160;&#160;&#160;&#160;&#160;&#160; Pour les exploitations &#224; responsabilit&#233; limit&#233;e qui n&#8217;ont pas opt&#233; pour le r&#233;gime fiscal des soci&#233;t&#233;s de capitaux, les plafonds vis&#233;s au 2&#176; et 3 &#176; du I sont multipli&#233;s par le nombre d&#8217;associ&#233;s exploitants, dans la limite de quatre. Pour les groupements d&#8217;exploitation en commun, lesdits montants sont &#233;galement multipli&#233;s par le nombre d&#8217;associ&#233;s dans la limite de quatre.</p><p>&#160;</p><p>VIII.&#160;&#160;&#160;&#160;&#160;&#160;&#160; La d&#233;duction mentionn&#233;e au I est pratiqu&#233;e apr&#232;s application des abattements pr&#233;vus aux articles 44 quaterdecies et 73 B du code g&#233;n&#233;ral des imp&#244;ts.</p><p>&#160;</p><p>IX.&#160;&#160;&#160;&#160;&#160;&#160;&#160; Les pertes de recettes r&#233;sultant pour l&#8217;Etat des dispositions de I &#224; VIII sont compens&#233;es par la cr&#233;ation d&#8217;une taxe additionnelle aux droits pr&#233;vus aux articles 575 et 575 A du code g&#233;n&#233;ral des imp&#244;ts.&#160;&#187;</p>",
    "exposeSommaire": "<p>La r&#233;currence des al&#233;as climatiques, sanitaires ou naturels et la volatilit&#233; des cours fragilisent en effet les exploitations agricoles, et portent atteinte &#224; leur p&#233;rennit&#233; et &#224; leur d&#233;veloppement. Face &#224; ces al&#233;as, les exploitants ont&#160;besoin de se doter d&#8217;outils de gestion des risques s&#233;curisant leur entreprise.</p><p>Par ailleurs, avec la disparition programm&#233;e, dans le pr&#233;sent projet de loi, de la d&#233;duction pour investissement sur stocks &#224; rotation lente, les exploitants ont d&#233;sormais plus que besoin de se doter d&#8217;outils fiscaux destin&#233; &#224; accompagner le financement de leurs stocks.</p><p>La mise en place d&#8217;une &#233;pargne de pr&#233;caution pour al&#233;as climatiques constitue donc une r&#233;elle avanc&#233;e pour le monde agricole, et une r&#233;ponse longtemps attendue face aux al&#233;as climatiques qui frappent de plus en plus souvent nos producteurs.</p><p>Cependant le dispositif pr&#233;vu se concentre sur une &#233;pargne de pr&#233;caution en num&#233;raire, c&#8217;est-&#224;-dire en tr&#233;sorerie. Cet amendement propose donc de mettre en place une r&#233;serve de pr&#233;caution en nature simple et efficace guid&#233;e par la volont&#233; de renforcer la p&#233;rennit&#233; des entreprises agricoles.</p><p>En effet, &#224; c&#244;t&#233; d&#8217;une &#233;pargne de pr&#233;caution financi&#232;re accessible &#224; toutes les professions agricoles, il est n&#233;cessaire de prendre en compte la situation particuli&#232;re des exploitants commercialisant directement leur production et leur permettre de disposer d&#8217;un stock physique suffisant afin de ne pas perdre le fonds de commerce constitu&#233; pendant de nombreuses ann&#233;es au prix de nombreux investissements.</p><p>Le dispositif propos&#233; r&#233;pond plus particuli&#232;rement &#224; la demande de la profession viticole dont le souhait est de pouvoir constituer un stock de vins de pr&#233;caution en cas d&#8217;al&#233;a.</p><p>Cette r&#233;serve consiste pour l&#8217;exploitant, l&#8217;ann&#233;e de rendement &#233;lev&#233;, &#224; constituer un stock physique de vins, traduit comptablement par une augmentation de la valeur des stocks &#233;valu&#233;e au prix de revient.</p><p>Elle doit permettre &#224; l&#8217;exploitant de pratiquer en contrepartie une d&#233;duction annuelle de 20&#160;000 &#8364; augment&#233; de 30% du chiffre d&#8217;affaires de l&#8217;exploitation.</p><p>&#160;</p><p>Une fois constitu&#233;e, le viticulteur ou exploitant aura la facult&#233; de d&#233;bloquer cette r&#233;serve notamment en cas d&#8217;al&#233;as climatiques, sanitaires ou &#233;conomiques et estimera librement la quotit&#233; n&#233;cessaire &#224; d&#233;bloquer, qui sera alors fiscalis&#233;e.</p><p>&#160;</p><p>Cette &#233;pargne de pr&#233;caution ainsi propos&#233;e r&#233;pond &#224; plusieurs objectifs&#160;:</p><p>&#160;</p><p>-&#160;&#160;&#160;&#160;&#160;&#160; encourager et faciliter l&#8217;installation et le d&#233;veloppement des entreprises dont le besoin en fond de roulement est important&#160;;</p><p>-&#160;&#160;&#160;&#160;&#160;&#160; ne pas p&#233;naliser fiscalement et socialement l&#8217;entreprise qui constitue des stocks de produits (s&#233;curisation du circuit commercial, stock qualitatif) et qui n&#8217;a pas la tr&#233;sorerie pour constituer une &#233;pargne financi&#232;re en banque&#160;;</p><p>-&#160;&#160;&#160;&#160;&#160;&#160; renforcer la gestion des risques et des al&#233;as en constituant une &#233;pargne non fiscalis&#233;e l&#8217;ann&#233;e de sa constitution.</p><p>&#160;</p>",
    "annexeExposeSommaire": {
      "@xmlns:xsi": "http://www.w3.org/2001/XMLSchema-instance",
      "@xsi:nil": "true"
    }
  },
  "representations": {
    "representation": {
      "nom": "PDF",
      "typeMime": {
        "type": "application",
        "subType": "PDF"
      },
      "statutRepresentation": {
        "verbatim": "true",
        "canonique": "true",
        "officielle": "true",
        "transcription": "false",
        "enregistrement": "false"
      },
      "repSource": {
        "@xmlns:xsi": "http://www.w3.org/2001/XMLSchema-instance",
        "@xsi:nil": "true"
      },
      "offset": {
        "@xmlns:xsi": "http://www.w3.org/2001/XMLSchema-instance",
        "@xsi:nil": "true"
      },
      "contenu": {
        "documentURI": "/15/amendements/1255A/CION_FIN/CF1402.pdf"
      },
      "dateDispoRepresentation": {
        "@xmlns:xsi": "http://www.w3.org/2001/XMLSchema-instance",
        "@xsi:nil": "true"
      }
    }
  },
  "seanceDiscussion": {
    "@xmlns:xsi": "http://www.w3.org/2001/XMLSchema-instance",
    "@xsi:nil": "true"
  },
  "sort": {
    "@xmlns:xsi": "http://www.w3.org/2001/XMLSchema-instance",
    "@xsi:nil": "true"
  },
  "dateDepot": "2018-10-05T02:00:00.000+02:00",
  "dateDistribution": "2018-10-09T02:00:00.000+02:00",
  "article99": "0",
  "loiReference": {
    "codeLoi": "impôts",
    "divisionCodeLoi": "73 bis"
  }
}