{
  "@xmlns": "http://schemas.assemblee-nationale.fr/referentiel",
  "uid": "AMANR5L15PO420120B1681P0D1N1126",
  "identifiant": {
    "legislature": "15",
    "numero": "1126",
    "numRect": "0",
    "saisine": {
      "refTexteLegislatif": "PRJLANR5L15B1681",
      "numeroPartiePLF": "0",
      "organeExamen": "PO420120",
      "mentionSecondeDeliberation": "0"
    }
  },
  "numeroLong": "AS1126",
  "etapeTexte": "1ère lecture (1ère assemblée saisie)",
  "triAmendement": "aeaaaaaaaaaaaaaaaaaaaaaaaaaaaaaaaaaaaaaaaaaaaaaaaae",
  "cardinaliteAmdtMultiples": "1",
  "amendementParent": {
    "@xmlns:xsi": "http://www.w3.org/2001/XMLSchema-instance",
    "@xsi:nil": "true"
  },
  "etat": "Discuté",
  "signataires": {
    "auteur": {
      "typeAuteur": "Depute",
      "acteurRef": "PA721062",
      "organeRef": {
        "@xmlns:xsi": "http://www.w3.org/2001/XMLSchema-instance",
        "@xsi:nil": "true"
      },
      "groupePolitiqueRef": "PO730958"
    },
    "cosignataires": {
      "acteurRef": [
        "PA721226",
        "PA720422",
        "PA721960",
        "PA720430",
        "PA720286",
        "PA722142",
        "PA721202",
        "PA588884",
        "PA720892",
        "PA718860",
        "PA721062",
        "PA2150",
        "PA718868",
        "PA720846",
        "PA719676",
        "PA719578",
        "PA721210"
      ]
    },
    "texteAffichable": "M.&#160;Ratenon,  Mme&#160;Autain, M.&#160;Bernalicis, M.&#160;Coquerel, M.&#160;Corbi&#232;re, Mme&#160;Fiat, M.&#160;Lachaud, M.&#160;Larive, M.&#160;M&#233;lenchon, Mme&#160;Obono, Mme&#160;Panot, M.&#160;Prud&apos;homme, M.&#160;Quatennens, Mme&#160;Ressiguier, Mme&#160;Rubin, M.&#160;Ruffin et Mme&#160;Taurine"
  },
  "pointeurFragmentTexte": {
    "missionVisee": {
      "@xmlns:xsi": "http://www.w3.org/2001/XMLSchema-instance",
      "@xsi:nil": "true"
    },
    "division": {
      "titre": "Article PREMIER",
      "articleDesignationCourte": "APRÈS ART. PREMIER",
      "type": "ARTICLE",
      "avant_A_Apres": "Après",
      "divisionRattachee": "APRÈS L'ARTICLE PREMIER, insérer l'article suivant:",
      "articleAdditionnel": "1",
      "chapitreAdditionnel": {
        "@xmlns:xsi": "http://www.w3.org/2001/XMLSchema-instance",
        "@xsi:nil": "true"
      },
      "urlDivisionTexteVise": "/15/textes/1681.asp#D_Article_1er"
    },
    "alinea": {
      "@xmlns:xsi": "http://www.w3.org/2001/XMLSchema-instance",
      "@xsi:nil": "true"
    }
  },
  "corps": {
    "dispositif": "<p style=\"text-align: justify;\">Dans un d&#233;lai de six mois &#224; compter de la promulgation de la pr&#233;sente loi, le Gouvernement remet au Parlement un rapport sur le co&#251;t g&#233;n&#233;r&#233; par une augmentation des bourses des &#233;tudiant&#183;e&#183;s boursier&#183;e&#183;s &#233;tudiant&#183;e&#183;s dans une formation en m&#233;decine, en pharmacie, en odontologie et en ma&#239;eutique. </p><p style=\"text-align: justify;\">Le Gouvernement pourra notamment examiner l&#8217;augmentation de ces montants au regard du co&#251;t des cours pr&#233;paratoires priv&#233;s que les &#233;tudiants sont souvent contraints &#224; suivre.</p>",
    "exposeSommaire": "<p style=\"text-align: justify;\">Les &#233;tudiant&#183;e&#183;s en m&#233;decine sont souvent contraint&#183;e&#183;s de s&#8217;offrir les services de pr&#233;pas priv&#233;es pour r&#233;ussir leurs premi&#232;res ann&#233;es. <br />Si la suppression du numerus clausus limitera s&#251;rement ces ph&#233;nom&#232;nes, la r&#233;silience des pr&#233;pas priv&#233;es nous convainc qu&#8217;un rapport relatif aux charges importantes que repr&#233;sentent ces d&#233;penses pour les &#233;tudiant&#183;e&#183;s boursier&#183;e&#183;s.</p><p style=\"text-align: justify;\">Nous pensons qu&#8217;il est essentiel que le Gouvernement s&#8217;assure que les bourses d&#233;livr&#233;es aux &#233;tudiant&#183;e&#183;s boursier&#183;e&#183;s leur permettent de se consacrer enti&#232;rement &#224; leurs &#233;tudes, sans avoir &#224; travailler &#224; c&#244;t&#233; de cette activit&#233;. Si de telles analyses ne sont pas faites et corrig&#233;es, nous n&#8217;arriverons pas &#224; lutter contre les in&#233;galit&#233;s sociales, qui sont tr&#232;s largement perp&#233;tu&#233;es dans les universit&#233;s de m&#233;decine.</p>",
    "annexeExposeSommaire": {
      "@xmlns:xsi": "http://www.w3.org/2001/XMLSchema-instance",
      "@xsi:nil": "true"
    },
    "cartoucheDelaiDepotDepasse": {
      "@xmlns:xsi": "http://www.w3.org/2001/XMLSchema-instance",
      "@xsi:nil": "true"
    }
  },
  "representations": {
    "representation": {
      "nom": "PDF",
      "typeMime": {
        "type": "application",
        "subType": "PDF"
      },
      "statutRepresentation": {
        "verbatim": "true",
        "canonique": "true",
        "officielle": "true",
        "transcription": "false",
        "enregistrement": "false"
      },
      "repSource": {
        "@xmlns:xsi": "http://www.w3.org/2001/XMLSchema-instance",
        "@xsi:nil": "true"
      },
      "offset": {
        "@xmlns:xsi": "http://www.w3.org/2001/XMLSchema-instance",
        "@xsi:nil": "true"
      },
      "contenu": {
        "documentURI": "/15/amendements/1681/CION-SOC/AS1126.pdf"
      },
      "dateDispoRepresentation": {
        "@xmlns:xsi": "http://www.w3.org/2001/XMLSchema-instance",
        "@xsi:nil": "true"
      }
    }
  },
  "seanceDiscussion": {
    "@xmlns:xsi": "http://www.w3.org/2001/XMLSchema-instance",
    "@xsi:nil": "true"
  },
  "sort": {
    "dateSaisie": "2019-03-12T18:08:12.000+01:00",
    "sortEnSeance": "Rejeté"
  },
  "dateDepot": "2019-03-08T01:00:00.000+01:00",
  "dateDistribution": "2019-03-12T01:00:00.000+01:00",
  "article99": "0",
  "loiReference": {
    "codeLoi": "zzzz",
    "divisionCodeLoi": {
      "@xmlns:xsi": "http://www.w3.org/2001/XMLSchema-instance",
      "@xsi:nil": "true"
    }
  }
}