{
  "@xmlns": "http://schemas.assemblee-nationale.fr/referentiel",
  "uid": "AMANR5L15PO757134B1088P0D1N1943",
  "identifiant": {
    "legislature": "15",
    "numero": "1943",
    "numRect": "0",
    "saisine": {
      "refTexteLegislatif": "PRJLANR5L15B1088",
      "numeroPartiePLF": "0",
      "organeExamen": "PO757134",
      "mentionSecondeDeliberation": "0"
    }
  },
  "numeroLong": "1943",
  "etapeTexte": "1ère lecture (1ère assemblée saisie)",
  "triAmendement": "ahaaaaaaaaaaaaaaaaaaaaaaaaaaaaaaaaaaaaaaaaaaaaaaaabal",
  "cardinaliteAmdtMultiples": "1",
  "amendementParent": {
    "@xmlns:xsi": "http://www.w3.org/2001/XMLSchema-instance",
    "@xsi:nil": "true"
  },
  "etat": "Discuté",
  "signataires": {
    "auteur": {
      "typeAuteur": "Depute",
      "acteurRef": "PA720162",
      "organeRef": {
        "@xmlns:xsi": "http://www.w3.org/2001/XMLSchema-instance",
        "@xsi:nil": "true"
      },
      "groupePolitiqueRef": "PO730970"
    },
    "cosignataires": {
      "acteurRef": [
        "PA720746",
        "PA720162",
        "PA718978",
        "PA720728",
        "PA719874"
      ]
    },
    "texteAffichable": "M.&#160;Bolo,  M.&#160;Mattei, Mme&#160;Jacquier-Laforge, M.&#160;Laqhila et M.&#160;Waserman"
  },
  "pointeurFragmentTexte": {
    "missionVisee": {
      "@xmlns:xsi": "http://www.w3.org/2001/XMLSchema-instance",
      "@xsi:nil": "true"
    },
    "division": {
      "titre": "Article 5",
      "articleDesignationCourte": "APRÈS ART. 5",
      "type": "ARTICLE",
      "avant_A_Apres": "Après",
      "divisionRattachee": "APRÈS L'ARTICLE 5, insérer l'article suivant:",
      "articleAdditionnel": "1",
      "chapitreAdditionnel": {
        "@xmlns:xsi": "http://www.w3.org/2001/XMLSchema-instance",
        "@xsi:nil": "true"
      },
      "urlDivisionTexteVise": "/15/textes/1088.asp#D_Article_5"
    },
    "alinea": {
      "@xmlns:xsi": "http://www.w3.org/2001/XMLSchema-instance",
      "@xsi:nil": "true"
    }
  },
  "corps": {
    "dispositif": "<p style=\"text-align: justify;\">Le deuxi&#232;me alin&#233;a de l&#8217;article L.&#160;5-1 du code de l&#8217;artisanat est compl&#233;t&#233; par une phrase ainsi r&#233;dig&#233;e&#160;:</p><p style=\"text-align: justify;\">&#171;&#160;Il est notamment charg&#233; des missions d&#8217;appui, d&#8217;accompagnement, de mise en relation et de conseil&#160;&#8211;&#160;notamment en mati&#232;re de recherche de financements priv&#233;s et publics&#160;&#8211;&#160;aupr&#232;s des cr&#233;ateurs et repreneurs d&#8217;entreprises et des entreprises du secteur de l&#8217;artisanat, dans le respect des dispositions l&#233;gislatives et r&#233;glementaires en vigueur en mati&#232;re de droit de la concurrence.&#160;&#187;</p>",
    "exposeSommaire": "<p style=\"text-align: justify;\">Cet amendement vise &#224; pr&#233;ciser les missions des Chambres de M&#233;tier et d&#8217;Artisanat en y adjoignant la mission d&#8217;accompagnement, de mise en relation et de conseil en mati&#232;re sp&#233;cifique de recherche de financements priv&#233;s et publics (comprenant notamment les subventions).</p><p style=\"text-align: justify;\">&#201;tant entendu le besoin de financement et la diversit&#233; &#8211; voire complexit&#233; &#8211; croissante des sources de financement, un accompagnement institutionnel et rationnalis&#233; d&#233;riv&#233; des missions d&#8217;accompagnement et de formation des chambres consulaires s&#8217;av&#232;re n&#233;cessaire en vue de densifier et consolider le tissu &#233;conomique.</p><p style=\"text-align: justify;\">Cet amendement s&#8217;int&#232;gre ainsi autant dans le renforcement des missions des Chambres que dans l&#8217;am&#233;lioration et la diversification des modes de financement port&#233;s par le pr&#233;sent projet de loi.</p><p style=\"text-align: justify;\">&#160;</p>",
    "annexeExposeSommaire": {
      "@xmlns:xsi": "http://www.w3.org/2001/XMLSchema-instance",
      "@xsi:nil": "true"
    }
  },
  "representations": {
    "representation": {
      "nom": "PDF",
      "typeMime": {
        "type": "application",
        "subType": "PDF"
      },
      "statutRepresentation": {
        "verbatim": "true",
        "canonique": "true",
        "officielle": "true",
        "transcription": "false",
        "enregistrement": "false"
      },
      "repSource": {
        "@xmlns:xsi": "http://www.w3.org/2001/XMLSchema-instance",
        "@xsi:nil": "true"
      },
      "offset": {
        "@xmlns:xsi": "http://www.w3.org/2001/XMLSchema-instance",
        "@xsi:nil": "true"
      },
      "contenu": {
        "documentURI": "/15/amendements/1088/CSPACTE/1943.pdf"
      },
      "dateDispoRepresentation": {
        "@xmlns:xsi": "http://www.w3.org/2001/XMLSchema-instance",
        "@xsi:nil": "true"
      }
    }
  },
  "seanceDiscussion": {
    "@xmlns:xsi": "http://www.w3.org/2001/XMLSchema-instance",
    "@xsi:nil": "true"
  },
  "sort": {
    "dateSaisie": "2018-09-06T22:18:01.000+02:00",
    "sortEnSeance": "Retiré"
  },
  "dateDepot": "2018-09-03T02:00:00.000+02:00",
  "dateDistribution": "2018-09-06T02:00:00.000+02:00",
  "article99": "0",
  "loiReference": {
    "codeLoi": "artisanat",
    "divisionCodeLoi": "L5-1"
  }
}