{
  "@xmlns": "http://schemas.assemblee-nationale.fr/referentiel",
  "uid": "AMANR5L15PO59048B0235P2D1N287",
  "identifiant": {
    "legislature": "15",
    "numero": "287",
    "numRect": "0",
    "saisine": {
      "refTexteLegislatif": "PRJLANR5L15B0235",
      "numeroPartiePLF": "2",
      "organeExamen": "PO59048",
      "mentionSecondeDeliberation": "0"
    }
  },
  "numeroLong": "II-CF287",
  "etapeTexte": "1ère lecture (1ère assemblée saisie)",
  "triAmendement": "eris",
  "cardinaliteAmdtMultiples": "1",
  "amendementParent": {
    "@xmlns:xsi": "http://www.w3.org/2001/XMLSchema-instance",
    "@xsi:nil": "true"
  },
  "etat": "Discuté",
  "signataires": {
    "auteur": {
      "typeAuteur": "Depute",
      "acteurRef": "PA720230",
      "organeRef": {
        "@xmlns:xsi": "http://www.w3.org/2001/XMLSchema-instance",
        "@xsi:nil": "true"
      },
      "groupePolitiqueRef": "PO730952"
    },
    "cosignataires": {
      "acteurRef": [
        "PA266788",
        "PA702052",
        "PA267766",
        "PA332228",
        "PA267330",
        "PA267585",
        "PA720696",
        "PA268019",
        "PA642868",
        "PA720230",
        "PA1960",
        "PA719806",
        "PA712014",
        "PA942"
      ]
    },
    "texteAffichable": "Mme&#160;Magnier,  M.&#160;Morel-&#192;-L&apos;Huissier, Mme&#160;Auconie, M.&#160;Benoit, M.&#160;Guy&#160;Bricout, M.&#160;Christophe, M.&#160;Charles&#160;de Courson, Mme&#160;Descamps, M.&#160;Lagarde, M.&#160;Ledoux, M.&#160;Leroy, Mme&#160;Sage, M.&#160;Vercamer et M.&#160;Zumkeller"
  },
  "pointeurFragmentTexte": {
    "missionVisee": {
      "idMissionAN": "26",
      "libelleMission": "Relations avec les collectivités territoriales",
      "codeMissionPLF": "B",
      "libelleMissionPLF": "Répartition, par mission et programme, des crédits du budget général"
    },
    "division": {
      "titre": "Article 60",
      "articleDesignationCourte": "ART. 60",
      "type": "ARTICLE",
      "avant_A_Apres": "A",
      "divisionRattachee": "ARTICLE 60",
      "articleAdditionnel": {
        "@xmlns:xsi": "http://www.w3.org/2001/XMLSchema-instance",
        "@xsi:nil": "true"
      },
      "chapitreAdditionnel": {
        "@xmlns:xsi": "http://www.w3.org/2001/XMLSchema-instance",
        "@xsi:nil": "true"
      },
      "urlDivisionTexteVise": "/15/textes/0235C.asp#D_Article_60"
    },
    "alinea": {
      "avant_A_Apres": "Apres",
      "numero": "27",
      "alineaDesignation": {
        "@xmlns:xsi": "http://www.w3.org/2001/XMLSchema-instance",
        "@xsi:nil": "true"
      }
    }
  },
  "corps": {
    "dispositif": "<p>Apr&#232;s l'alin&#233;a&#160;27, ins&#233;rer les trois alin&#233;as suivants&#160;:</p><p>&#171; III. <i>bis</i> &#8211; &#192; l&#8217;article L.&#160;5214-23-1 du code g&#233;n&#233;ral des collectivit&#233;s territoriales, dans sa r&#233;daction issue de la loi n&#176;&#160;2016-1917 du 29 d&#233;cembre 2016 de finances pour 2017,</p><p>&#171; 1&#176; Le 10&#176; est abrog&#233;&#160;;</p><p>&#171; 2 &#176; Au premier alin&#233;a, le mot&#160;:&#171; neuf &#187; est remplac&#233; par le mot&#160;: &#171; huit &#187; et le mot&#160;:&#171; douze &#187; par le chiffre &#171; onze &#187;. &#187;.</p>",
    "exposeSommaire": "<p style=\"text-align: justify;\">De nombreuses communaut&#233;s de communes &#233;ligibles &#224; la dotation d&#8217;intercommunalit&#233;&#160;bonifi&#233;e&#160; (dite &#171;&#160;DGF bonifi&#233;e&#160;&#187;) et leurs communes membres se retrouvent dans une situation complexe au regard de l&#8217;exigence par la loi de la prise de 3 groupes suppl&#233;mentaires de comp&#233;tences au 1er janvier 2018, soit 9 au lieu de 6.</p><p style=\"text-align: justify;\">Alors que le traitement des incidences des proc&#233;dures de fusion et de modification des intercommunalit&#233;s au 1er 2017 sont encore en cours&#160;; le transfert de nouvelles comp&#233;tences lourdes et complexes dans un d&#233;lai aussi court que le 1er janvier 2018 pose de multiples difficult&#233;s. Tel est le cas notamment de la comp&#233;tence &#171;&#160;eau&#160;&#187; -comp&#233;tence obligatoire &#224; compter du 1er janvier 2020- mais ouvrant droit &#224; l&#8217;&#233;ligibilit&#233; de la DGF bonifi&#233;e d&#232;s le 1er janvier 2018.</p><p style=\"text-align: justify;\">Or, l&#8217;organisation des services de l&#8217;eau r&#233;pond &#224; des logiques de qualit&#233; et de disponibilit&#233; de la ressource qui d&#233;passent les fronti&#232;res administratives. Elle vise &#224; garantir la fourniture d&#8217;un service d&#8217;eau de haute qualit&#233; &#224; un co&#251;t ma&#238;tris&#233; tout en pr&#233;servant la ressource et en permettant la mise en &#339;uvre d&#8217;une solidarit&#233; entre les territoires.</p><p style=\"text-align: justify;\">Les objectifs de rationalisation et de mutualisation des services ne peuvent r&#233;ussir que dans le cadre d&#8217;une d&#233;marche concert&#233;e et s&#8217;appuyant sur un projet port&#233; par les &#233;lus.</p><p style=\"text-align: justify;\">Un grand nombre d&#8217;&#233;lus locaux qui anticipent la r&#233;forme constatent une forte in&#233;galit&#233; lors de la mutualisation des services et l&#8217;harmonisation de leur co&#251;t. Ainsi, le bon &#233;tat du patrimoine d&#8217;une commune (et les efforts qu&#8217;elle y a consenti) n&#8217;est pas forc&#233;ment valoris&#233; au moment du transfert &#224; l&#8217;EPCI. Un autre exemple parlant est celui soulev&#233; par des &#233;lus locaux de zones de montagne ou de territoires ruraux qui soulignent que leurs services d&#8217;eau distribuent actuellement une eau potable &#224; co&#251;t maitris&#233;, du fait de la proximit&#233; avec une ressource (abondante et de qualit&#233;), et du fait d&#8217;une structure de gestion all&#233;g&#233;e (puisque de proximit&#233; et souvent par les &#233;lus locaux b&#233;n&#233;voles).</p><p style=\"text-align: justify;\">Dans ces cas, le transfert des comp&#233;tences va certes diminuer le nombre de services mais &#233;galement s&#8217;accompagner d&#8217;une hausse du prix de l&#8217;eau, ce qui ne devrait pas &#234;tre un objectif qui se ferait au d&#233;triment des usagers.</p><p style=\"text-align: justify;\">La r&#233;organisation des services d&#8217;eau et d&#8217;assainissement doit &#234;tre guid&#233;e, avant toute autre consid&#233;ration, par des objectifs d&#8217;efficacit&#233; et de pr&#233;servation du patrimoine naturel et des &#233;quipements.</p><p style=\"text-align: justify;\">Tel est l&#8217;objectif de cet amendement.</p>",
    "annexeExposeSommaire": {
      "@xmlns:xsi": "http://www.w3.org/2001/XMLSchema-instance",
      "@xsi:nil": "true"
    }
  },
  "representations": {
    "representation": {
      "nom": "PDF",
      "typeMime": {
        "type": "application",
        "subType": "PDF"
      },
      "statutRepresentation": {
        "verbatim": "true",
        "canonique": "true",
        "officielle": "true",
        "transcription": "false",
        "enregistrement": "false"
      },
      "repSource": {
        "@xmlns:xsi": "http://www.w3.org/2001/XMLSchema-instance",
        "@xsi:nil": "true"
      },
      "offset": {
        "@xmlns:xsi": "http://www.w3.org/2001/XMLSchema-instance",
        "@xsi:nil": "true"
      },
      "contenu": {
        "documentURI": "/15/amendements/0235C/CION_TOUTE/CF287.pdf"
      },
      "dateDispoRepresentation": {
        "@xmlns:xsi": "http://www.w3.org/2001/XMLSchema-instance",
        "@xsi:nil": "true"
      }
    }
  },
  "seanceDiscussion": {
    "@xmlns:xsi": "http://www.w3.org/2001/XMLSchema-instance",
    "@xsi:nil": "true"
  },
  "sort": {
    "dateSaisie": "2017-11-09T18:30:48.000+01:00",
    "sortEnSeance": "Non soutenu"
  },
  "dateDepot": "2017-10-31T01:00:00.000+01:00",
  "dateDistribution": "2017-11-09T01:00:00.000+01:00",
  "article99": "0",
  "loiReference": {
    "codeLoi": {
      "@xmlns:xsi": "http://www.w3.org/2001/XMLSchema-instance",
      "@xsi:nil": "true"
    },
    "divisionCodeLoi": {
      "@xmlns:xsi": "http://www.w3.org/2001/XMLSchema-instance",
      "@xsi:nil": "true"
    }
  }
}