{
  "@xmlns": "http://schemas.assemblee-nationale.fr/referentiel",
  "uid": "AMANR5L15SEA717460BTC0857P0D1N976",
  "identifiant": {
    "legislature": "15",
    "numero": "976",
    "numRect": "0",
    "saisine": {
      "refTexteLegislatif": "PRJLANR5L15BTC0857",
      "numeroPartiePLF": "0",
      "organeExamen": "PO717460",
      "mentionSecondeDeliberation": "0"
    }
  },
  "numeroLong": "976",
  "etapeTexte": "1ère lecture (1ère assemblée saisie)",
  "triAmendement": "ce",
  "cardinaliteAmdtMultiples": "1",
  "amendementParent": {
    "@xmlns:xsi": "http://www.w3.org/2001/XMLSchema-instance",
    "@xsi:nil": "true"
  },
  "etat": "Discuté",
  "signataires": {
    "auteur": {
      "typeAuteur": "Depute",
      "acteurRef": "PA721202",
      "organeRef": {
        "@xmlns:xsi": "http://www.w3.org/2001/XMLSchema-instance",
        "@xsi:nil": "true"
      },
      "groupePolitiqueRef": "PO730958"
    },
    "cosignataires": {
      "acteurRef": [
        "PA720430",
        "PA720422",
        "PA718860",
        "PA720846",
        "PA721062",
        "PA722142",
        "PA719578",
        "PA720286",
        "PA718868",
        "PA719676",
        "PA721210",
        "PA588884",
        "PA2150",
        "PA720892",
        "PA721226",
        "PA721202",
        "PA721960"
      ]
    },
    "texteAffichable": "M.&#160;Coquerel,  Mme&#160;Autain, M.&#160;Bernalicis, M.&#160;Corbi&#232;re, Mme&#160;Fiat, M.&#160;Lachaud, M.&#160;Larive, M.&#160;M&#233;lenchon, Mme&#160;Obono, Mme&#160;Panot, M.&#160;Prud&apos;homme, M.&#160;Quatennens, M.&#160;Ratenon, Mme&#160;Ressiguier, Mme&#160;Rubin, M.&#160;Ruffin et Mme&#160;Taurine"
  },
  "pointeurFragmentTexte": {
    "missionVisee": {
      "@xmlns:xsi": "http://www.w3.org/2001/XMLSchema-instance",
      "@xsi:nil": "true"
    },
    "division": {
      "titre": "Article 24",
      "articleDesignationCourte": "ART. 24",
      "type": "ARTICLE",
      "avant_A_Apres": "A",
      "divisionRattachee": "ARTICLE 24",
      "articleAdditionnel": {
        "@xmlns:xsi": "http://www.w3.org/2001/XMLSchema-instance",
        "@xsi:nil": "true"
      },
      "chapitreAdditionnel": {
        "@xmlns:xsi": "http://www.w3.org/2001/XMLSchema-instance",
        "@xsi:nil": "true"
      },
      "urlDivisionTexteVise": "/15/textes/0857.asp#D_Article_24"
    },
    "alinea": {
      "avant_A_Apres": "A",
      "numero": "16",
      "alineaDesignation": "Alinéa 16"
    }
  },
  "corps": {
    "dispositif": "<p style=\"padding: 0cm; text-align: justify;\">Compl&#233;ter l&#8217;alin&#233;a&#160;16 par la phrase suivante&#160;:</p><p style=\"text-align: justify;\">&#171;&#160;Si l&#8217;enfant est n&#233; en France, ce document de circulation est intitul&#233; &#171;&#160;titre d&#8217;identit&#233; r&#233;publicain&#160;&#187;.&#160;&#187;</p>",
    "exposeSommaire": "<p style=\"border: none; padding: 0cm; text-align: justify;\">Par cet amendement, nous proposons de rappeler le statut particulier des enfants n&#233;s en France de parents &#233;trangers et qui peuvent acqu&#233;rir la nationalit&#233; fran&#231;aise sous condition de r&#233;sidence (article 21-7 du code civil).</p><p style=\"border: none; padding: 0cm; text-align: justify;\">En effet, en l&#8217;&#233;tat du droit actuel, une distinction est pos&#233;e entre les enfants de parents &#233;trangers. Ceux qui ne sont pas n&#233;s en France peuvent disposer d&#8217;un document de circulation pour &#233;tranger mineur (DCEM &#8211; article L. 321-4 du CESEDA), et ceux qui sont n&#233;s en France d&#8217;un titre d&#8217;identit&#233; r&#233;publicain (TIR &#8211; article L. 321-3 du CESEDA). Cette distinction permet de rappeler qu&#8217;aux termes du code civil les enfants n&#233;s en France, sont consid&#233;r&#233;s comme &#233;tant, s&#8217;ils le souhaitent (puisqu&#8217;ils pourront toujours ult&#233;rieurement renoncer &#224; cette nationalit&#233;), d&#8217;ores et d&#233;j&#224; partie au peuple et &#224; la nation fran&#231;aise (article 3 de la Constitution).</p><p style=\"border: none; padding: 0cm; text-align: justify;\">Etant donn&#233; la complexit&#233; du code de l&#8217;entr&#233;e et du s&#233;jour des &#233;trangers et du droit d&#8217;asile, la volont&#233; du Gouvernement de &#171;&#160;<i>fusionner [ces deux documents] dans un document unique dont les conditions de d&#233;livrance sont clarifi&#233;es.&#160;</i>&#187; (expos&#233; des motifs de ce projet de loi) est bienvenue. Toutefois, elle ne doit pas se faire en gommant l&#8217;appartenance potentielle des enfants n&#233;s en France au peuple et &#224; la nation fran&#231;aise.</p><p style=\"border: none; padding: 0cm; text-align: justify;\">Ainsi, tout en pr&#233;servant l&#8217;int&#233;gralit&#233; du dispositif unifi&#233; pour ce document pour &#233;tranger mineur, nous estimons n&#233;cessaire de pr&#233;server la seule mention de &#171;&#160;Titre d&#8217;identit&#233; r&#233;publicain&#160;&#187;, qui sera appos&#233;e sur le document d&#233;livr&#233; au mineur, ce sans aucune modification de la proc&#233;dure et des conditions d&#8217;attributions propos&#233;es par le Gouvernement.</p><p style=\"border: none; padding: 0cm; text-align: justify;\">Si cet amendement de bon sens n&#8217;&#233;tait pas adopt&#233;, il faudrait y voir une grave r&#233;gression du Gouvernement qui souhaiterait gommer l&#8217;appartenance potentielle des enfants n&#233;s en France de parents &#233;trangers, et donc de facto impliquer de remettre en question le droit du sol (articles 20 et suivants du code civil).</p>",
    "annexeExposeSommaire": {
      "@xmlns:xsi": "http://www.w3.org/2001/XMLSchema-instance",
      "@xsi:nil": "true"
    }
  },
  "representations": {
    "representation": {
      "nom": "PDF",
      "typeMime": {
        "type": "application",
        "subType": "PDF"
      },
      "statutRepresentation": {
        "verbatim": "true",
        "canonique": "true",
        "officielle": "true",
        "transcription": "false",
        "enregistrement": "false"
      },
      "repSource": {
        "@xmlns:xsi": "http://www.w3.org/2001/XMLSchema-instance",
        "@xsi:nil": "true"
      },
      "offset": {
        "@xmlns:xsi": "http://www.w3.org/2001/XMLSchema-instance",
        "@xsi:nil": "true"
      },
      "contenu": {
        "documentURI": "/15/amendements/0857/AN/976.pdf"
      },
      "dateDispoRepresentation": {
        "@xmlns:xsi": "http://www.w3.org/2001/XMLSchema-instance",
        "@xsi:nil": "true"
      }
    }
  },
  "seanceDiscussion": "RUANR5L15S2018IDS21078",
  "sort": {
    "dateSaisie": "2018-04-22T14:08:47.000+02:00",
    "sortEnSeance": "Rejeté"
  },
  "dateDepot": "2018-04-12T02:00:00.000+02:00",
  "dateDistribution": "2018-04-16T02:00:00.000+02:00",
  "article99": "0",
  "loiReference": {
    "codeLoi": {
      "@xmlns:xsi": "http://www.w3.org/2001/XMLSchema-instance",
      "@xsi:nil": "true"
    },
    "divisionCodeLoi": {
      "@xmlns:xsi": "http://www.w3.org/2001/XMLSchema-instance",
      "@xsi:nil": "true"
    }
  }
}