{
  "@xmlns": "http://schemas.assemblee-nationale.fr/referentiel",
  "uid": "AMANR5L15PO59051B2357P0D1N448",
  "identifiant": {
    "legislature": "15",
    "numero": "448",
    "numRect": "0",
    "saisine": {
      "refTexteLegislatif": "PRJLANR5L15B2357",
      "numeroPartiePLF": "0",
      "organeExamen": "PO59051",
      "mentionSecondeDeliberation": "0"
    }
  },
  "numeroLong": "CL448",
  "etapeTexte": "1ère lecture (2ème assemblée saisie)",
  "triAmendement": "eboaaaaaaaaaaaaaaaaaaaaaaaaaaaaaaaaaaaaaaaaaaaaaaab",
  "cardinaliteAmdtMultiples": "1",
  "amendementParent": {
    "@xmlns:xsi": "http://www.w3.org/2001/XMLSchema-instance",
    "@xsi:nil": "true"
  },
  "etat": "Discuté",
  "signataires": {
    "auteur": {
      "typeAuteur": "Depute",
      "acteurRef": "PA719024",
      "organeRef": {
        "@xmlns:xsi": "http://www.w3.org/2001/XMLSchema-instance",
        "@xsi:nil": "true"
      },
      "groupePolitiqueRef": "PO730964"
    },
    "cosignataires": {
      "acteurRef": "PA719024"
    },
    "texteAffichable": "M.&#160;Blanchet"
  },
  "pointeurFragmentTexte": {
    "missionVisee": {
      "@xmlns:xsi": "http://www.w3.org/2001/XMLSchema-instance",
      "@xsi:nil": "true"
    },
    "division": {
      "titre": "Article 13",
      "articleDesignationCourte": "ART. 13",
      "type": "ARTICLE",
      "avant_A_Apres": "A",
      "divisionRattachee": "ARTICLE 13",
      "articleAdditionnel": {
        "@xmlns:xsi": "http://www.w3.org/2001/XMLSchema-instance",
        "@xsi:nil": "true"
      },
      "chapitreAdditionnel": {
        "@xmlns:xsi": "http://www.w3.org/2001/XMLSchema-instance",
        "@xsi:nil": "true"
      },
      "urlDivisionTexteVise": "/15/textes/2357.asp#D_Article_13"
    },
    "alinea": {
      "avant_A_Apres": {
        "@xmlns:xsi": "http://www.w3.org/2001/XMLSchema-instance",
        "@xsi:nil": "true"
      },
      "numero": "4",
      "alineaDesignation": {
        "@xmlns:xsi": "http://www.w3.org/2001/XMLSchema-instance",
        "@xsi:nil": "true"
      }
    }
  },
  "corps": {
    "dispositif": "<p style=\"text-align: justify;\">Apr&#232;s la premi&#232;re phrase de l&#8217;alin&#233;a&#160;4, ins&#233;rer les trois phrases suivantes&#160;:</p><p style=\"text-align: justify;\">&#171;&#160;Le maire doit informer le propri&#233;taire ou l&#8217;exploitant du d&#233;bit concern&#233; dans les vingt jours apr&#232;s la commission d&#8217;un fait pouvant justifier d&#8217;une sanction. Cette information doit &#234;tre accompagn&#233;e d&#8217;une invitation &#224; venir pr&#233;senter les faits &#224; honorer sous quinzaine devant la commission comp&#233;tente. Les pr&#233;rogatives d&#233;l&#233;gu&#233;es doivent s&#8217;exercer dans un d&#233;lai de cinquante jours apr&#232;s que le maire ait inform&#233; le propri&#233;taire ou l&#8217;exploitant du d&#233;bit concern&#233;.&#160;&#187;</p>",
    "exposeSommaire": "<p>Le pr&#233;sent amendement vise &#224; moderniser la l&#233;gislation en vigueur. Il ne pr&#233;cise aucune limite de temps pour l&#8217;action du maire une fois transf&#233;r&#233;s les pouvoirs du repr&#233;sentant de l&#8217;Etat dans le d&#233;partement. Or, dans la pratique actuelle, il appara&#238;t que les propri&#233;taires ou exploitants des &#233;tablissements sont convoqu&#233;s pour &#234;tre entendus plusieurs semaines voire mois apr&#232;s les faits. En effet, une plainte est d&#233;pos&#233;e aupr&#232;s d&#8217;un service de police ou de gendarmerie lorsqu&#8217;elle survient apr&#232;s une infraction. Les services n&#8217;&#233;tant pas mutualis&#233;s et les enqu&#234;tes pouvant &#234;tre longues, plusieurs semaines peuvent s&#8217;&#233;couler avant que les faits soient amen&#233;s &#224; l&#8217;attention du d&#233;fenseur et du pr&#233;fet.</p><p>Dans ce cas, les propri&#233;taires ou exploitants concern&#233;s perdent vraisemblablement l&#8217;opportunit&#233; de prouver leur bonne foi, car l&#8217;article L252-5 du Code de la s&#233;curit&#233; int&#233;rieure les oblige &#224; supprimer les enregistrements audiovisuels de leurs cam&#233;ras de s&#233;curit&#233; pass&#233;s 30 jours. Lorsqu&#8217;ils re&#231;oivent leur convocation, les propri&#233;taires ou exploitants n&#8217;ont plus aucune preuve &#224; leur disposition &#224; apporter &#224; ce jugement. Cela fait peser une r&#233;elle menace sur les propri&#233;taires ou exploitants de ces &#233;tablissements qui subissent les cons&#233;quences d&#8217;actes ou d&#8217;infractions qu&#8217;ils n&#8217;ont pas directement commises &#8211; et dont ils n&#8217;ont souvent aucun souvenir, des semaines apr&#232;s leur occurrence.</p><p>L&#8217;instruction du dossier doit se d&#233;rouler de la mani&#232;re suivante&#160;: un fait pouvant justifier une sanction administrative (avertissement ou fermeture) advient au jour 1. Le Maire dispose alors de 20 jours maximum pour en informer le commer&#231;ant ou l&#8217;exploitant et lui adresser une convocation sous quinzaine pour que ce dernier expose sa version des faits.</p><p>Une fois cette d&#233;fense entendue, le Maire dispose de 15 jours pour prononcer ou non une sanction. Ainsi, le Maire dispose de 50 jours maximum pour faire usage de ses pr&#233;rogatives.</p><p>La frise chronologique suivante r&#233;sume la fa&#231;on dont le dossier doit &#234;tre instruit&#160;:</p><table style=\"border-collapse: collapse; width: 713px; height: 150px;\"><tbody><tr style=\"height: 82px;\"><td style=\"white-space: normal; border: 1px solid #000000; width: 99px; height: 82px;\">Chronologie</td><td style=\"white-space: normal; border: 1px solid #000000; width: 122.1px; height: 82px;\">Jour 1 : Commission des faits.</td><td style=\"white-space: normal; border: 1px solid #000000; width: 148.9px; height: 82px;\">J+20, d&#233;lais maximum pour entendre l'exploitant.</td><td style=\"white-space: normal; border: 1px solid #000000; width: 198px; height: 82px;\">J+35: d&#233;lais maximum pour entendre l'exploitant</td><td style=\"white-space: normal; border: 1px solid #000000; width: 124px; height: 82px;\">J+50, d&#233;lais maximum pour qu'une sanction soit prononc&#233;e.</td></tr><tr style=\"height: 65px;\"><td style=\"white-space: normal; border: 1px solid #000000; width: 99px; height: 65px;\">D&#233;lais</td><td style=\"white-space: normal; border: 1px solid #000000; width: 122.1px; height: 65px;\">20 jours</td><td style=\"white-space: normal; border: 1px solid #000000; width: 148.9px; height: 65px;\">15 jours</td><td style=\"white-space: normal; border: 1px solid #000000; width: 198px; height: 65px;\">15 jours</td><td style=\"white-space: normal; border: 1px solid #000000; width: 124px; height: 65px;\">&#160;</td></tr><tr style=\"height: 63.3833px;\"><td style=\"white-space: normal; border: 1px solid #000000; width: 99px; height: 63.3833px;\">Observations</td><td style=\"white-space: normal; border: 1px solid #000000; width: 122.1px; height: 63.3833px;\">Apr&#232;s avis de la commission concern&#233;e, le maire doit informer l'exploitant pour l'avertir d'un fait &#224; justifier.</td><td style=\"white-space: normal; border: 1px solid #000000; width: 148.9px; height: 63.3833px;\">L'exploitant a quinze jours pour pr&#233;senter sa version des faits.</td><td style=\"white-space: normal; border: 1px solid #000000; width: 198px; height: 63.3833px;\">Le maire dispose de quinze jours pour prononcer une sanction.</td><td style=\"white-space: normal; border: 1px solid #000000; width: 124px; height: 63.3833px;\">&#160;</td></tr></tbody></table>",
    "annexeExposeSommaire": {
      "@xmlns:xsi": "http://www.w3.org/2001/XMLSchema-instance",
      "@xsi:nil": "true"
    },
    "cartoucheDelaiDepotDepasse": {
      "@xmlns:xsi": "http://www.w3.org/2001/XMLSchema-instance",
      "@xsi:nil": "true"
    },
    "avantAppel": {
      "@xmlns:xsi": "http://www.w3.org/2001/XMLSchema-instance",
      "@xsi:nil": "true"
    }
  },
  "representations": {
    "representation": {
      "nom": "PDF",
      "typeMime": {
        "type": "application",
        "subType": "PDF"
      },
      "statutRepresentation": {
        "verbatim": "true",
        "canonique": "true",
        "officielle": "true",
        "transcription": "false",
        "enregistrement": "false"
      },
      "repSource": {
        "@xmlns:xsi": "http://www.w3.org/2001/XMLSchema-instance",
        "@xsi:nil": "true"
      },
      "offset": {
        "@xmlns:xsi": "http://www.w3.org/2001/XMLSchema-instance",
        "@xsi:nil": "true"
      },
      "contenu": {
        "documentURI": "/15/amendements/2357/CION_LOIS/CL448.pdf"
      },
      "dateDispoRepresentation": {
        "@xmlns:xsi": "http://www.w3.org/2001/XMLSchema-instance",
        "@xsi:nil": "true"
      }
    }
  },
  "seanceDiscussion": {
    "@xmlns:xsi": "http://www.w3.org/2001/XMLSchema-instance",
    "@xsi:nil": "true"
  },
  "sort": {
    "dateSaisie": "2019-11-07T14:57:28.000+01:00",
    "sortEnSeance": "Rejeté"
  },
  "dateDepot": "2019-10-31T01:00:00.000+01:00",
  "dateDistribution": "2019-11-05T01:00:00.000+01:00",
  "article99": "0",
  "loiReference": {
    "codeLoi": "1",
    "divisionCodeLoi": {
      "@xmlns:xsi": "http://www.w3.org/2001/XMLSchema-instance",
      "@xsi:nil": "true"
    }
  }
}