{
  "@xmlns": "http://schemas.assemblee-nationale.fr/referentiel",
  "uid": "AMANR5L15SEA717460B2272P2D1N2801",
  "identifiant": {
    "legislature": "15",
    "numero": "2801",
    "numRect": "0",
    "saisine": {
      "refTexteLegislatif": "PRJLANR5L15B2272",
      "numeroPartiePLF": "2",
      "organeExamen": "PO717460",
      "mentionSecondeDeliberation": "0"
    }
  },
  "numeroLong": "II-2801",
  "etapeTexte": "1ère lecture (1ère assemblée saisie)",
  "triAmendement": "ecaaaaaiaaaaaaaaaaaaaaaaaaaaaaaaaaaaaaaaaaaaaaaaaazzzzzzzzzzzzzzzzzzzs",
  "cardinaliteAmdtMultiples": "1",
  "amendementParent": {
    "@xmlns:xsi": "http://www.w3.org/2001/XMLSchema-instance",
    "@xsi:nil": "true"
  },
  "etat": "Discuté",
  "signataires": {
    "auteur": {
      "typeAuteur": "Depute",
      "acteurRef": "PA719922",
      "organeRef": {
        "@xmlns:xsi": "http://www.w3.org/2001/XMLSchema-instance",
        "@xsi:nil": "true"
      },
      "groupePolitiqueRef": "PO730964"
    },
    "cosignataires": {
      "acteurRef": [
        "PA720538",
        "PA721514",
        "PA719922",
        "PA719080",
        "PA718962",
        "PA720054",
        "PA719652"
      ]
    },
    "texteAffichable": "M.&#160;Causse,  Mme&#160;Hammerer, Mme&#160;Kerbarh, M.&#160;Haury, M.&#160;Zulesi, Mme&#160;De Temmerman et Mme&#160;Marsaud"
  },
  "pointeurFragmentTexte": {
    "missionVisee": {
      "@xmlns:xsi": "http://www.w3.org/2001/XMLSchema-instance",
      "@xsi:nil": "true"
    },
    "division": {
      "titre": "Article 58",
      "articleDesignationCourte": "APRÈS ART. 58",
      "type": "ARTICLE",
      "avant_A_Apres": "Après",
      "divisionRattachee": "APRÈS L'ARTICLE 58, insérer l'article suivant:",
      "articleAdditionnel": "1",
      "chapitreAdditionnel": {
        "@xmlns:xsi": "http://www.w3.org/2001/XMLSchema-instance",
        "@xsi:nil": "true"
      },
      "urlDivisionTexteVise": "/15/textes/2272C.asp#D_Article_58"
    },
    "alinea": {
      "@xmlns:xsi": "http://www.w3.org/2001/XMLSchema-instance",
      "@xsi:nil": "true"
    }
  },
  "corps": {
    "dispositif": "<p>I.&#160;&#8211;&#160;Au IV de l&#8217;article&#160;199 <i>novovicies </i>du code g&#233;n&#233;ral des imp&#244;ts, apr&#232;s le mot&#160;:&#160;&#171;&#160;existant&#160;&#187;, ins&#233;rer les mots&#160;: &#171;&#160;, dans les zones couvertes par les p&#233;rim&#232;tres des op&#233;rations de revitalisation de territoires mentionn&#233;e &#224; l&#8217;article L.&#160;303&#8209;2 du code de la construction et de l&#8217;habitation,&#160;&#187;.</p><p style=\"text-align: justify;\">II.&#160;&#8211;&#160;Le I entre en vigueur au 1<sup>er</sup>&#160;janvier 2021.</p><p style=\"text-align: justify;\">III.&#160;&#8211;&#160;La perte de recettes pour l&#8217;&#201;tat est compens&#233;e &#224; due concurrence par la cr&#233;ation d&#8217;une taxe additionnelle aux droits mentionn&#233;s aux articles 575 et 575 A du code g&#233;n&#233;ral des imp&#244;ts.<br /><br /></p>",
    "exposeSommaire": "<p style=\"text-align: justify;\"><br />Cet amendement vise &#224; prolonger le &#171;&#160;dispositif Pinel&#160;&#187; dans les zone&#160;appartenant &#224; un p&#233;rim&#232;tre&#160;d&#8217;op&#233;ration de revitalisation de territoire.</p><p style=\"text-align: justify;\">Ce dispositif&#160;devait se limiter en 2020 aux logements situ&#233;s dans des communes class&#233;es dans des zones&#160;A et B1 dites &#171;&#160;tendues&#160;&#187;.</p><p style=\"text-align: justify;\">Afin de pouvoir redynamiser nos territoires et particuli&#232;rement les plus ruraux, il est important de se doter d&#8217;outils suppl&#233;mentaires dans le cadre des op&#233;rations de revitalisation de territoire pilot&#233;es par les &#233;lus locaux.</p><p style=\"text-align: justify;\">Cela permettra &#233;galement de lutter contre l&#8217;&#233;talement urbain.</p>",
    "annexeExposeSommaire": {
      "@xmlns:xsi": "http://www.w3.org/2001/XMLSchema-instance",
      "@xsi:nil": "true"
    },
    "cartoucheDelaiDepotDepasse": {
      "@xmlns:xsi": "http://www.w3.org/2001/XMLSchema-instance",
      "@xsi:nil": "true"
    },
    "avantAppel": {
      "@xmlns:xsi": "http://www.w3.org/2001/XMLSchema-instance",
      "@xsi:nil": "true"
    }
  },
  "representations": {
    "representation": {
      "nom": "PDF",
      "typeMime": {
        "type": "application",
        "subType": "PDF"
      },
      "statutRepresentation": {
        "verbatim": "true",
        "canonique": "true",
        "officielle": "true",
        "transcription": "false",
        "enregistrement": "false"
      },
      "repSource": {
        "@xmlns:xsi": "http://www.w3.org/2001/XMLSchema-instance",
        "@xsi:nil": "true"
      },
      "offset": {
        "@xmlns:xsi": "http://www.w3.org/2001/XMLSchema-instance",
        "@xsi:nil": "true"
      },
      "contenu": {
        "documentURI": "/15/amendements/2272C/AN/2801.pdf"
      },
      "dateDispoRepresentation": {
        "@xmlns:xsi": "http://www.w3.org/2001/XMLSchema-instance",
        "@xsi:nil": "true"
      }
    }
  },
  "seanceDiscussion": "RUANR5L15S2020IDS21921",
  "sort": {
    "dateSaisie": "2019-11-14T09:42:08.000+01:00",
    "sortEnSeance": "Rejeté"
  },
  "dateDepot": "2019-11-08T01:00:00.000+01:00",
  "dateDistribution": "2019-11-13T01:00:00.000+01:00",
  "article99": "0",
  "loiReference": {
    "codeLoi": "CGI",
    "divisionCodeLoi": "199 novovicies"
  }
}