{
  "@xmlns": "http://schemas.assemblee-nationale.fr/referentiel",
  "uid": "AMANR5L15SEA717460B0269P0D1N912",
  "identifiant": {
    "legislature": "15",
    "numero": "912",
    "numRect": "0",
    "saisine": {
      "refTexteLegislatif": "PRJLANR5L15B0269",
      "numeroPartiePLF": "0",
      "organeExamen": "PO717460",
      "mentionSecondeDeliberation": "0"
    }
  },
  "numeroLong": "912",
  "etapeTexte": "1ère lecture (1ère assemblée saisie)",
  "triAmendement": "d",
  "cardinaliteAmdtMultiples": "1",
  "amendementParent": {
    "@xmlns:xsi": "http://www.w3.org/2001/XMLSchema-instance",
    "@xsi:nil": "true"
  },
  "etat": "Retiré",
  "signataires": {
    "auteur": {
      "typeAuteur": "Depute",
      "acteurRef": "PA642764",
      "organeRef": {
        "@xmlns:xsi": "http://www.w3.org/2001/XMLSchema-instance",
        "@xsi:nil": "true"
      },
      "groupePolitiqueRef": "PO730946"
    },
    "cosignataires": {
      "acteurRef": [
        "PA609332",
        "PA643145",
        "PA719930",
        "PA340343",
        "PA1008",
        "PA332614",
        "PA642764",
        "PA508",
        "PA610681"
      ]
    },
    "texteAffichable": "M.&#160;Aviragnet,  Mme&#160;Bareigts, M.&#160;Faure, Mme&#160;Vainqueur-Christophe, M.&#160;Vallaud, Mme&#160;Bi&#233;mouret, M.&#160;Juanico, M.&#160;Alain&#160;David, M.&#160;Saulignac et les membres du groupe Nouvelle Gauche"
  },
  "pointeurFragmentTexte": {
    "missionVisee": {
      "@xmlns:xsi": "http://www.w3.org/2001/XMLSchema-instance",
      "@xsi:nil": "true"
    },
    "division": {
      "titre": "Article 31",
      "articleDesignationCourte": "APRÈS ART. 31",
      "type": "ARTICLE",
      "avant_A_Apres": "Après",
      "divisionRattachee": "APRÈS L'ARTICLE 31, insérer l'article suivant:",
      "articleAdditionnel": "1",
      "chapitreAdditionnel": {
        "@xmlns:xsi": "http://www.w3.org/2001/XMLSchema-instance",
        "@xsi:nil": "true"
      },
      "urlDivisionTexteVise": "/15/textes/0269.asp#D_Article_31"
    },
    "alinea": {
      "@xmlns:xsi": "http://www.w3.org/2001/XMLSchema-instance",
      "@xsi:nil": "true"
    }
  },
  "corps": {
    "dispositif": "<p style=\"text-align: justify;\">Le deuxi&#232;me alin&#233;a de l&#8217;article L.&#160;176&#8209;2 du code de la s&#233;curit&#233; sociale est ainsi r&#233;dig&#233;&#160;:</p><p style=\"text-align: justify;\">&#171;&#160;Une commission pr&#233;sid&#233;e par un magistrat &#224; la Cour des comptes remet tous les trois ans, au Parlement et au Gouvernement, un rapport &#233;valuant le co&#251;t r&#233;el pour la branche maladie de la sous-d&#233;claration des accidents du travail, des maladies professionnelles et des pathologies psychiques li&#233;es au travail. La commission des accidents du travail et des maladies professionnelles mentionn&#233;e &#224; l&#8217;article L.&#160;221&#8209;4 rend un avis sur ce rapport, qui est &#233;galement transmis au Parlement et au Gouvernement avant le 1<sup>er</sup> juillet de l&#8217;ann&#233;e consid&#233;r&#233;e.&#160;&#187;</p>",
    "exposeSommaire": "<p style=\"text-align: justify;\">Cet amendement est issu du rapport parlementaire de G&#233;rard S&#233;baoun et d&#8217;Yves Censi relatif au syndrome d&#8217;&#233;puisement professionnel ou burn out.</p><p style=\"text-align: justify;\">Ainsi, cet amendement vise &#224; faire &#233;valuer par la commission institu&#233;e par l&#8217;article L.&#160;176&#8209;2 du code de la s&#233;curit&#233; sociale le co&#251;t des pathologies psychiques li&#233;es au travail actuellement support&#233; par l&#8217;assurance maladie.</p><p style=\"text-align: justify;\">Nous le savons, le Gouvernement le reconnait ais&#233;ment, chaque ann&#233;e la branche AT-MP reverse une somme importante d&#8217;argent &#224; la branche maladie pour tenir compte de la sous-d&#233;claration des accidents du travail des maladies professionnelles.</p><p style=\"text-align: justify;\">Il est donc propos&#233; de tenir compte &#233;galement du &#171;&#160;burn out&#160;&#187; dans le co&#251;t des maladies psychiques li&#233;es au travail alors qu&#8217;elles sont actuellement support&#233;es par l&#8217;assurance maladie.</p>",
    "annexeExposeSommaire": {
      "@xmlns:xsi": "http://www.w3.org/2001/XMLSchema-instance",
      "@xsi:nil": "true"
    }
  },
  "representations": {
    "representation": {
      "nom": "PDF",
      "typeMime": {
        "type": "application",
        "subType": "PDF"
      },
      "statutRepresentation": {
        "verbatim": "true",
        "canonique": "true",
        "officielle": "true",
        "transcription": "false",
        "enregistrement": "false"
      },
      "repSource": {
        "@xmlns:xsi": "http://www.w3.org/2001/XMLSchema-instance",
        "@xsi:nil": "true"
      },
      "offset": {
        "@xmlns:xsi": "http://www.w3.org/2001/XMLSchema-instance",
        "@xsi:nil": "true"
      },
      "contenu": {
        "documentURI": "/15/amendements/0269/AN/912.pdf"
      },
      "dateDispoRepresentation": {
        "@xmlns:xsi": "http://www.w3.org/2001/XMLSchema-instance",
        "@xsi:nil": "true"
      }
    }
  },
  "seanceDiscussion": {
    "@xmlns:xsi": "http://www.w3.org/2001/XMLSchema-instance",
    "@xsi:nil": "true"
  },
  "sort": {
    "@xmlns:xsi": "http://www.w3.org/2001/XMLSchema-instance",
    "@xsi:nil": "true"
  },
  "dateDepot": "2017-10-20T02:00:00.000+02:00",
  "dateDistribution": {
    "@xmlns:xsi": "http://www.w3.org/2001/XMLSchema-instance",
    "@xsi:nil": "true"
  },
  "article99": "0",
  "loiReference": {
    "codeLoi": "c sécurité sociale",
    "divisionCodeLoi": "L176-2"
  }
}