{
  "@xmlns": "http://schemas.assemblee-nationale.fr/referentiel",
  "uid": "AMANR5L15PO59051B1349P0D1N2",
  "identifiant": {
    "legislature": "15",
    "numero": "2",
    "numRect": "0",
    "saisine": {
      "refTexteLegislatif": "PRJLANR5L15B1349",
      "numeroPartiePLF": "0",
      "organeExamen": "PO59051",
      "mentionSecondeDeliberation": "0"
    }
  },
  "numeroLong": "CL2",
  "etapeTexte": "1ère lecture (2ème assemblée saisie)",
  "triAmendement": "adiaaaaaaaaaaaaaaaaaaaaaaaaaaaaaaaaaaaaaaaaaaaaaaai",
  "cardinaliteAmdtMultiples": "1",
  "amendementParent": {
    "@xmlns:xsi": "http://www.w3.org/2001/XMLSchema-instance",
    "@xsi:nil": "true"
  },
  "etat": "Discuté",
  "signataires": {
    "auteur": {
      "typeAuteur": "Depute",
      "acteurRef": "PA607090",
      "organeRef": {
        "@xmlns:xsi": "http://www.w3.org/2001/XMLSchema-instance",
        "@xsi:nil": "true"
      },
      "groupePolitiqueRef": "PO730934"
    },
    "cosignataires": {
      "acteurRef": [
        "PA608416",
        "PA267527",
        "PA332523",
        "PA719318",
        "PA608016",
        "PA606712",
        "PA721678",
        "PA718884",
        "PA336316",
        "PA721636",
        "PA643134",
        "PA266797",
        "PA346218",
        "PA607090"
      ]
    },
    "texteAffichable": "M.&#160;Jean-Pierre&#160;Vigier,  M.&#160;Hetzel, M.&#160;Parigi, Mme&#160;Bazin-Malgras, Mme&#160;Anthoine, M.&#160;Reda, Mme&#160;Valentin, M.&#160;Bouchet, Mme&#160;Dalloz, Mme&#160;Louwagie, M.&#160;Masson, M.&#160;Lurton, M.&#160;Saddier et M.&#160;Gosselin"
  },
  "pointeurFragmentTexte": {
    "missionVisee": {
      "@xmlns:xsi": "http://www.w3.org/2001/XMLSchema-instance",
      "@xsi:nil": "true"
    },
    "division": {
      "titre": "Article 3",
      "articleDesignationCourte": "ART. 3",
      "type": "ARTICLE",
      "avant_A_Apres": "A",
      "divisionRattachee": "ARTICLE 3",
      "articleAdditionnel": {
        "@xmlns:xsi": "http://www.w3.org/2001/XMLSchema-instance",
        "@xsi:nil": "true"
      },
      "chapitreAdditionnel": {
        "@xmlns:xsi": "http://www.w3.org/2001/XMLSchema-instance",
        "@xsi:nil": "true"
      },
      "urlDivisionTexteVise": "/15/textes/1349.asp#D_Article_3"
    },
    "alinea": {
      "avant_A_Apres": "Apres",
      "numero": "5",
      "alineaDesignation": {
        "@xmlns:xsi": "http://www.w3.org/2001/XMLSchema-instance",
        "@xsi:nil": "true"
      }
    }
  },
  "corps": {
    "dispositif": "<p style=\"text-align: justify;\">Apr&#232;s l&#8217;alin&#233;a&#160;5, ins&#233;rer l&#8217;alin&#233;a suivant&#160;:</p><p style=\"text-align: justify;\">&#171;&#160;Le consentement de chacun des int&#233;ress&#233;s pour un traitement par algorithme ou automatis&#233; vis&#233; &#224; l&#8217;alin&#233;a pr&#233;c&#233;dent ne pourra &#234;tre formul&#233; qu&#8217;apr&#232;s rencontre effective d&#8217;un m&#233;diateur ou d&#8217;un conciliateur selon les modalit&#233;s mises en place au sein de la juridiction locale dont il rel&#232;ve. Les modalit&#233;s de ces rencontres sont organis&#233;es par le ou les Conseils D&#233;partementaux de l&#8217;Acc&#232;s au Droit dont rel&#232;vent les parties.&#160;&#187;</p>",
    "exposeSommaire": "<p>L&#8217;article 3 du Projet de Loi de programmation 2018-2022 et de r&#233;forme pour la Justice pr&#233;voit d&#8217;ins&#233;rer, apr&#232;s l&#8217;article 4 de la loi n&#176; 2016-1547 du 18/11/2016, un article 4-1 qui vise la possibilit&#233; d&#8217; &#171; un service en ligne de conciliation, de m&#233;diation ou d&#8217;arbitrage &#187; et l&#8217;intervention d&#8217;une &#171; personne physique charg&#233;e de cette r&#233;solution amiable &#187;.</p><p>Ce texte ne pr&#233;voit pas, en ce cas, de r&#233;union physique des parties par la personne charg&#233;e de proc&#233;der &#224; la r&#233;solution amiable.</p><p>&#160;</p><p>Un &#171; traitement amiable par algorithme &#187; n&#8217;est pas un mode amiable, mais un simulacre de justice. Un v&#233;ritable mode amiable de r&#233;solution (conciliation ou m&#233;diation) suppose l&#8217;intervention d&#8217;un tiers neutre et ind&#233;pendant, afin de restaurer un dialogue et de parvenir &#224; une solution d&#233;finie par les parties elles-m&#234;mes.</p><p>&#160;</p><p>Un arbitrage automatis&#233; par les techniques de justice pr&#233;dictive ne peut &#234;tre envisag&#233; que pour des contentieux d&#8217;importance tr&#232;s limit&#233;e et avec un consentement parfaitement &#233;clair&#233; des parties.</p><p>&#160;</p><p>Il est indispensable que toutes les garanties soient pr&#233;vues, &#224; commencer par une information compl&#232;te des int&#233;ress&#233;s. Il est propos&#233; pour garantir cette information, de s&#8217;inspirer des r&#233;flexions d&#233;j&#224; men&#233;es au sein des juridictions entre magistrats et avocats. Il a &#233;t&#233; envisag&#233;, pour un consentement &#233;clair&#233; des parties, de leur demander de rencontrer un m&#233;diateur soit &#224; l&#8217;occasion d&#8217;une s&#233;ance collective de pr&#233;sentation, organis&#233;e p&#233;riodiquement par les organismes de m&#233;diation du ressort, soit individuellement sur la base d&#8217;une permanence au sein de la juridiction.</p>",
    "annexeExposeSommaire": {
      "@xmlns:xsi": "http://www.w3.org/2001/XMLSchema-instance",
      "@xsi:nil": "true"
    }
  },
  "representations": {
    "representation": {
      "nom": "PDF",
      "typeMime": {
        "type": "application",
        "subType": "PDF"
      },
      "statutRepresentation": {
        "verbatim": "true",
        "canonique": "true",
        "officielle": "true",
        "transcription": "false",
        "enregistrement": "false"
      },
      "repSource": {
        "@xmlns:xsi": "http://www.w3.org/2001/XMLSchema-instance",
        "@xsi:nil": "true"
      },
      "offset": {
        "@xmlns:xsi": "http://www.w3.org/2001/XMLSchema-instance",
        "@xsi:nil": "true"
      },
      "contenu": {
        "documentURI": "/15/amendements/1349/CION_LOIS/CL2.pdf"
      },
      "dateDispoRepresentation": {
        "@xmlns:xsi": "http://www.w3.org/2001/XMLSchema-instance",
        "@xsi:nil": "true"
      }
    }
  },
  "seanceDiscussion": {
    "@xmlns:xsi": "http://www.w3.org/2001/XMLSchema-instance",
    "@xsi:nil": "true"
  },
  "sort": {
    "dateSaisie": "2018-11-07T15:36:07.000+01:00",
    "sortEnSeance": "Rejeté"
  },
  "dateDepot": "2018-10-29T01:00:00.000+01:00",
  "dateDistribution": "2018-11-06T01:00:00.000+01:00",
  "article99": "0",
  "loiReference": {
    "codeLoi": {
      "@xmlns:xsi": "http://www.w3.org/2001/XMLSchema-instance",
      "@xsi:nil": "true"
    },
    "divisionCodeLoi": {
      "@xmlns:xsi": "http://www.w3.org/2001/XMLSchema-instance",
      "@xsi:nil": "true"
    }
  }
}