{
  "@xmlns": "http://schemas.assemblee-nationale.fr/referentiel",
  "uid": "AMANR5L15SEA717460BTC1237P0D1N1199",
  "identifiant": {
    "legislature": "15",
    "numero": "1199",
    "numRect": "0",
    "saisine": {
      "refTexteLegislatif": "PRJLANR5L15BTC1237",
      "numeroPartiePLF": "0",
      "organeExamen": "PO717460",
      "mentionSecondeDeliberation": "1"
    }
  },
  "numeroLong": "1199",
  "etapeTexte": "1ère lecture (1ère assemblée saisie)",
  "triAmendement": "odaaaaaaaaaaaaaaaaaaaaaaaaaaaaaaaaaaaaaaaaaaaaaaaanojo",
  "cardinaliteAmdtMultiples": "1",
  "amendementParent": {
    "@xmlns:xsi": "http://www.w3.org/2001/XMLSchema-instance",
    "@xsi:nil": "true"
  },
  "etat": "Discuté",
  "signataires": {
    "auteur": {
      "typeAuteur": "Depute",
      "acteurRef": "PA330909",
      "organeRef": {
        "@xmlns:xsi": "http://www.w3.org/2001/XMLSchema-instance",
        "@xsi:nil": "true"
      },
      "groupePolitiqueRef": "PO730934"
    },
    "cosignataires": {
      "acteurRef": [
        "PA721506",
        "PA1874",
        "PA330909",
        "PA332523",
        "PA346218",
        "PA608416",
        "PA720586",
        "PA720210",
        "PA719272"
      ]
    },
    "texteAffichable": "M.&#160;Descoeur,  M.&#160;Hetzel, Mme&#160;Meunier, M.&#160;Masson, Mme&#160;Kuster, M.&#160;Le Fur, Mme&#160;Beauvais, Mme&#160;Dalloz et M.&#160;Vatin"
  },
  "pointeurFragmentTexte": {
    "missionVisee": {
      "@xmlns:xsi": "http://www.w3.org/2001/XMLSchema-instance",
      "@xsi:nil": "true"
    },
    "division": {
      "titre": "Article 61 nonies",
      "articleDesignationCourte": "APRÈS ART. 61 NONIES",
      "type": "ARTICLE",
      "avant_A_Apres": "Après",
      "divisionRattachee": "APRÈS L'ARTICLE 61 NONIES, insérer l'article suivant:",
      "articleAdditionnel": "1",
      "chapitreAdditionnel": {
        "@xmlns:xsi": "http://www.w3.org/2001/XMLSchema-instance",
        "@xsi:nil": "true"
      },
      "urlDivisionTexteVise": "/15/textes/1237.asp#D_Article_61_nonies"
    },
    "alinea": {
      "@xmlns:xsi": "http://www.w3.org/2001/XMLSchema-instance",
      "@xsi:nil": "true"
    }
  },
  "corps": {
    "dispositif": "<p style=\"text-align: justify;\">I.&#160;&#8211;&#160;Le dernier alin&#233;a de l&#8217;article L.&#160;2152&#8209;1 du code du travail est compl&#233;t&#233; par une phrase ainsi r&#233;dig&#233;e&#160;:&#160;&#171;&#160;Pour mesurer l&#8217;audience des organisations professionnelles d&#8217;employeurs ayant exclusivement pour objet de regrouper des soci&#233;t&#233;s coop&#233;ratives de production, ou des soci&#233;t&#233;s coop&#233;ratives d&#8217;int&#233;r&#234;t collectif, affili&#233;es ou adh&#233;rentes d&#8217;une conf&#233;d&#233;ration nationale regroupant plusieurs f&#233;d&#233;rations professionnelles ayant ce m&#234;me objet, les seuils fix&#233;s &#224; l&#8217;alin&#233;a pr&#233;c&#233;dent se v&#233;rifient au regard du nombre total des soci&#233;t&#233;s coop&#233;ratives de la branche concern&#233;e.&#160;&#187;</p><p style=\"text-align: justify;\">II. Apr&#232;s l&#8217;article L.&#160;2261&#8209;23&#8209;1 du code du travail, il est ins&#233;r&#233; un article L.&#160;2261&#8209;23&#8209;2 ainsi r&#233;dig&#233;&#160;:</p><p style=\"text-align: justify;\">&#171;&#160;<i>Art.&#160;L.&#160;2261&#8209;23&#8209;2</i>.&#160;&#8211;&#160;La repr&#233;sentativit&#233; reconnue &#224; une organisation professionnelle d&#8217;employeurs ayant exclusivement pour objet de regrouper des soci&#233;t&#233;s coop&#233;ratives de production, ou des soci&#233;t&#233;s coop&#233;ratives d&#8217;int&#233;r&#234;t collectif, dans les conditions pr&#233;vues par le dernier alin&#233;a de l&#8217;article L.&#160;2152&#8209;1 du code du travail, lui conf&#232;re le droit de n&#233;gocier et de conclure seule toute disposition sp&#233;cifiquement applicable &#224; cette cat&#233;gorie de soci&#233;t&#233;s. Cette organisation d&#8217;employeurs peut &#233;galement conclure, avec les autres organisations professionnelles d&#8217;employeurs, toute disposition applicable &#224; l&#8217;ensemble des entreprises de la branche.&#160;&#187;</p>",
    "exposeSommaire": "<p style=\"text-align: justify;\">La loi n&#176; 2014&#8209;288 du 5 mars 2014 relative &#224; la formation professionnelle, &#224; l&#8217;emploi et &#224; la d&#233;mocratie sociale a, &#224; l&#8217;instar des r&#232;gles applicables aux organisations professionnelles de salari&#233;s, d&#233;fini les conditions d&#8217;&#233;tablissement de la repr&#233;sentativit&#233; patronale en introduisant notamment un double crit&#232;re d&#8217;audience&#160;: soit les adh&#233;rents des organisations professionnelles d&#8217;employeurs repr&#233;sentent au moins 8&#160;% de l&#8217;ensemble des entreprises adh&#233;rant &#224; des organisations professionnelles d&#8217;employeurs repr&#233;sentatives dans la branche, soit au moins 8&#160;% des salari&#233;s de ces m&#234;mes entreprises.</p><p style=\"text-align: justify;\">Ayant pour objectif de moderniser et dynamiser le dialogue social, la mise en &#339;uvre de ce texte, en limitant le pluralisme des organisations repr&#233;sentatives, a parfois produit l&#8217;effet inverse en emp&#234;chant l&#8217;expression au sein des branches de certains particularismes li&#233;s par exemple &#224; la taille des entreprises, &#224; leur activit&#233; ou &#224; leur nature juridique. C&#8217;est le cas notamment des soci&#233;t&#233;s coop&#233;ratives participatives.</p><p style=\"text-align: justify;\">Ces entreprises dont les salari&#233;s sont les associ&#233;s majoritaires sont rattach&#233;es au droit des soci&#233;t&#233;s commerciales (SA-SARL-SAS) mais aussi au droit coop&#233;ratif qui repose sur le principe de d&#233;mocratie (une personne-une voix) au sein de l&#8217;entreprise, une priorit&#233; donn&#233;e &#224; la p&#233;rennit&#233; du projet et une r&#233;partition &#233;quitable des b&#233;n&#233;fices.</p><p style=\"text-align: justify;\">Dans certains secteurs d&#8217;activit&#233;, les f&#233;d&#233;rations ayant pour objet de repr&#233;senter les soci&#233;t&#233;s coop&#233;ratives participatives sont des acteurs historiques, membres fondateurs de la quasi-totalit&#233; des organismes paritaires. C&#8217;est en particulier le cas dans le secteur du b&#226;timent et des travaux publics.</p><p style=\"text-align: justify;\">L&#8217;objet de cet amendement est d&#8217;introduire le principe d&#8217;une repr&#233;sentativit&#233; cat&#233;gorielle pour certaines organisations professionnelles d&#8217;employeurs ayant vocation &#224; ne repr&#233;senter que certaines cat&#233;gories sp&#233;cifiques d&#8217;employeurs &#224; l&#8217;instar de ce qui existe d&#233;j&#224; pour les organisations salariales notamment avec les syndicats de cadres adh&#233;rents de la CFE-CGC. En cons&#233;quence, le crit&#232;re d&#8217;affiliation &#224; une conf&#233;d&#233;ration cat&#233;gorielle applicable en mati&#232;re salariale a &#233;t&#233; repris ici.</p><p style=\"text-align: justify;\">De m&#234;me, l&#8217;amendement propose d&#8217;introduire une capacit&#233; de n&#233;gociation cat&#233;gorielle, pendant d&#8217;une repr&#233;sentativit&#233; qui le serait aussi. A l&#8217;instar des dispositions de l&#8217;article L.&#160;2232&#8209;7 du code du travail relatif &#224; la n&#233;gociation d&#8217;un accord de branche par un syndicat cat&#233;goriel, l&#8217;organisation d&#8217;employeurs cat&#233;gorielle ne pourra n&#233;gocier et conclure seule que les dispositions sp&#233;cifiques aux SCOP mais qu&#8217;elle pourra &#234;tre signataire de tout accord de branche d&#232;s lors qu&#8217;une autre organisation professionnelle d&#8217;employeurs l&#8217;est &#233;galement.</p><p style=\"text-align: justify;\">L&#8217;auteur de cet amendement consid&#232;re que le mod&#232;le coop&#233;ratif doit &#234;tre repr&#233;sent&#233; au sein du dialogue social de branche car, en d&#233;passant le clivage traditionnel employeurs-employ&#233;s, il facilite ce dialogue et participe de son renouveau.</p>",
    "annexeExposeSommaire": {
      "@xmlns:xsi": "http://www.w3.org/2001/XMLSchema-instance",
      "@xsi:nil": "true"
    }
  },
  "representations": {
    "representation": {
      "nom": "PDF",
      "typeMime": {
        "type": "application",
        "subType": "PDF"
      },
      "statutRepresentation": {
        "verbatim": "true",
        "canonique": "true",
        "officielle": "true",
        "transcription": "false",
        "enregistrement": "false"
      },
      "repSource": {
        "@xmlns:xsi": "http://www.w3.org/2001/XMLSchema-instance",
        "@xsi:nil": "true"
      },
      "offset": {
        "@xmlns:xsi": "http://www.w3.org/2001/XMLSchema-instance",
        "@xsi:nil": "true"
      },
      "contenu": {
        "documentURI": "/15/amendements/1237/AN/1199.pdf"
      },
      "dateDispoRepresentation": {
        "@xmlns:xsi": "http://www.w3.org/2001/XMLSchema-instance",
        "@xsi:nil": "true"
      }
    }
  },
  "seanceDiscussion": "RUANR5L15S2019IDS21349",
  "sort": {
    "dateSaisie": "2018-10-05T11:59:21.000+02:00",
    "sortEnSeance": "Non soutenu"
  },
  "dateDepot": "2018-09-20T02:00:00.000+02:00",
  "dateDistribution": "2018-09-26T02:00:00.000+02:00",
  "article99": "0",
  "loiReference": {
    "codeLoi": "c travail",
    "divisionCodeLoi": "L2152-1"
  }
}