{
  "@xmlns": "http://schemas.assemblee-nationale.fr/referentiel",
  "uid": "AMANR5L15SEA717460BTC1212P0D1N21",
  "identifiant": {
    "legislature": "15",
    "numero": "21",
    "numRect": "0",
    "saisine": {
      "refTexteLegislatif": "PRJLANR5L15BTC1212",
      "numeroPartiePLF": "0",
      "organeExamen": "PO717460",
      "mentionSecondeDeliberation": "0"
    }
  },
  "numeroLong": "21",
  "etapeTexte": "1ère lecture (2ème assemblée saisie)",
  "triAmendement": "giaaaaaaaaaaaaaaaaaaaaaaaaaaaaaaaaaaaaaaaaaaaaaaaabo",
  "cardinaliteAmdtMultiples": "1",
  "amendementParent": {
    "@xmlns:xsi": "http://www.w3.org/2001/XMLSchema-instance",
    "@xsi:nil": "true"
  },
  "etat": "Discuté",
  "signataires": {
    "auteur": {
      "typeAuteur": "Depute",
      "acteurRef": "PA605518",
      "organeRef": {
        "@xmlns:xsi": "http://www.w3.org/2001/XMLSchema-instance",
        "@xsi:nil": "true"
      },
      "groupePolitiqueRef": "PO730964"
    },
    "cosignataires": {
      "acteurRef": [
        "PA718794",
        "PA719480",
        "PA720576",
        "PA718876",
        "PA605518",
        "PA719170"
      ]
    },
    "texteAffichable": "M.&#160;Fran&#231;ois-Michel&#160;Lambert,  M.&#160;Besson-Moreau, M.&#160;Gaillard, M.&#160;Bois, Mme&#160;Charvier et Mme&#160;H&#233;rin"
  },
  "pointeurFragmentTexte": {
    "missionVisee": {
      "@xmlns:xsi": "http://www.w3.org/2001/XMLSchema-instance",
      "@xsi:nil": "true"
    },
    "division": {
      "titre": "Article 8",
      "articleDesignationCourte": "APRÈS ART. 8",
      "type": "ARTICLE",
      "avant_A_Apres": "Après",
      "divisionRattachee": "APRÈS L'ARTICLE 8, insérer l'article suivant:",
      "articleAdditionnel": "1",
      "chapitreAdditionnel": {
        "@xmlns:xsi": "http://www.w3.org/2001/XMLSchema-instance",
        "@xsi:nil": "true"
      },
      "urlDivisionTexteVise": "/15/textes/1212.asp#D_Article_8"
    },
    "alinea": {
      "@xmlns:xsi": "http://www.w3.org/2001/XMLSchema-instance",
      "@xsi:nil": "true"
    }
  },
  "corps": {
    "dispositif": "<p style=\"text-align: justify;\">Apr&#232;s le huiti&#232;me alin&#233;a de l&#8217;article&#160;1741 du code g&#233;n&#233;ral des imp&#244;ts, sont ins&#233;r&#233;s deux alin&#233;as ainsi r&#233;dig&#233;s&#160;:</p><p style=\"text-align: justify;\">&#171;&#160;Lorsque l&#8217;assujetti &#224; l&#8217;imp&#244;t a d&#233;j&#224; subi l&#8217;une des deux sanctions fiscales mentionn&#233;es aux deux premiers alin&#233;as et que celui-ci a organis&#233; frauduleusement sa soustraction aux obligations mentionn&#233;es au pr&#233;sent article sur plusieurs ann&#233;es, la peine d&#8217;amende est port&#233;e &#224; 60&#160;000&#160;000&#160;&#8364; et ne peut &#234;tre inf&#233;rieure au d&#233;cuple du montant de la fraude major&#233;e &#224; 80&#160;%.</p><p style=\"text-align: justify;\">&#171;&#160;Lorsque la fraude s&#8217;&#233;tend sur plusieurs ann&#233;es et que le montant de celle-ci d&#233;passe 250&#160;000&#160;&#8364;, les peines privatives de libert&#233; mentionn&#233;es aux deux premiers alin&#233;as ne peuvent &#234;tre inf&#233;rieures &#224; une dur&#233;e incompressible et non-am&#233;nageable de quatre ans d&#8217;emprisonnement.&#160;&#187;</p>",
    "exposeSommaire": "<p style=\"text-align: justify;\">L&#8217;actuel Code G&#233;n&#233;ral des Imp&#244;ts pr&#233;voit des sanctions importantes mais pas suffisamment d&#233;courageantes et qui s&#8217;av&#232;rent parfois, inf&#233;rieures &#224; la somme soustraite aux services de l&#8217;Administration fiscale. En ce sens, le Syndicat des finances publiques Solidaires a estim&#233; entre 60 et 80 milliards d&#8217;euros de recettes fiscales sont perdues chaque ann&#233;e en France, du fait de la fraude fiscale.</p><p style=\"text-align: justify;\">Il convient d&#232;s lors de mettre en place un arsenal juridique plus r&#233;pressif afin de d&#233;courager non seulement la r&#233;alisation des premiers faits constitutifs de l&#8217;infraction mais encore de punir beaucoup plus s&#233;v&#232;rement les cas de r&#233;cidives graves.</p>",
    "annexeExposeSommaire": {
      "@xmlns:xsi": "http://www.w3.org/2001/XMLSchema-instance",
      "@xsi:nil": "true"
    }
  },
  "representations": {
    "representation": {
      "nom": "PDF",
      "typeMime": {
        "type": "application",
        "subType": "PDF"
      },
      "statutRepresentation": {
        "verbatim": "true",
        "canonique": "true",
        "officielle": "true",
        "transcription": "false",
        "enregistrement": "false"
      },
      "repSource": {
        "@xmlns:xsi": "http://www.w3.org/2001/XMLSchema-instance",
        "@xsi:nil": "true"
      },
      "offset": {
        "@xmlns:xsi": "http://www.w3.org/2001/XMLSchema-instance",
        "@xsi:nil": "true"
      },
      "contenu": {
        "documentURI": "/15/amendements/1212/AN/21.pdf"
      },
      "dateDispoRepresentation": {
        "@xmlns:xsi": "http://www.w3.org/2001/XMLSchema-instance",
        "@xsi:nil": "true"
      }
    }
  },
  "seanceDiscussion": "RUANR5L15S2018IDS21240",
  "sort": {
    "dateSaisie": "2018-09-18T19:01:27.000+02:00",
    "sortEnSeance": "Non soutenu"
  },
  "dateDepot": "2018-08-25T02:00:00.000+02:00",
  "dateDistribution": "2018-09-15T02:00:00.000+02:00",
  "article99": "0",
  "loiReference": {
    "codeLoi": "CGI",
    "divisionCodeLoi": "1741"
  }
}