{
  "@xmlns": "http://schemas.assemblee-nationale.fr/referentiel",
  "uid": "AMANR5L15PO419610B1135P0D1N399",
  "identifiant": {
    "legislature": "15",
    "numero": "399",
    "numRect": "0",
    "saisine": {
      "refTexteLegislatif": "PRJLANR5L15B1135",
      "numeroPartiePLF": "0",
      "organeExamen": "PO419610",
      "mentionSecondeDeliberation": "0"
    }
  },
  "numeroLong": "CE399",
  "etapeTexte": "Nouvelle Lecture",
  "triAmendement": "i",
  "cardinaliteAmdtMultiples": "1",
  "amendementParent": {
    "@xmlns:xsi": "http://www.w3.org/2001/XMLSchema-instance",
    "@xsi:nil": "true"
  },
  "etat": "Discuté",
  "signataires": {
    "auteur": {
      "typeAuteur": "Depute",
      "acteurRef": "PA719718",
      "organeRef": {
        "@xmlns:xsi": "http://www.w3.org/2001/XMLSchema-instance",
        "@xsi:nil": "true"
      },
      "groupePolitiqueRef": "PO730964"
    },
    "cosignataires": {
      "acteurRef": "PA719718"
    },
    "texteAffichable": "Mme&#160;Maillart-M&#233;haignerie"
  },
  "pointeurFragmentTexte": {
    "missionVisee": {
      "@xmlns:xsi": "http://www.w3.org/2001/XMLSchema-instance",
      "@xsi:nil": "true"
    },
    "division": {
      "titre": "Article 14 ter",
      "articleDesignationCourte": "ART. 14 TER",
      "type": "ARTICLE",
      "avant_A_Apres": "A",
      "divisionRattachee": "ARTICLE 14 TER",
      "articleAdditionnel": {
        "@xmlns:xsi": "http://www.w3.org/2001/XMLSchema-instance",
        "@xsi:nil": "true"
      },
      "chapitreAdditionnel": {
        "@xmlns:xsi": "http://www.w3.org/2001/XMLSchema-instance",
        "@xsi:nil": "true"
      },
      "urlDivisionTexteVise": "/15/textes/1135.asp#D_Article_14_ter"
    },
    "alinea": {
      "avant_A_Apres": {
        "@xmlns:xsi": "http://www.w3.org/2001/XMLSchema-instance",
        "@xsi:nil": "true"
      },
      "numero": "1",
      "alineaDesignation": {
        "@xmlns:xsi": "http://www.w3.org/2001/XMLSchema-instance",
        "@xsi:nil": "true"
      }
    }
  },
  "corps": {
    "dispositif": "<p style=\"text-align: justify;\">R&#233;diger ainsi la derni&#232;re phrase de cet article&#160;:</p><p style=\"text-align: justify;\">&#171;&#160;Toutes les parties consommables de plantes utilis&#233;es en alimentation animale ou humaine dans l&#8217;&#233;tat dans lequel elles sont consomm&#233;es sont dispens&#233;es de cette proc&#233;dure d&#8217;autorisation&#160;&#187;.&#160;</p>",
    "exposeSommaire": "<p style=\"text-align: justify;\">Le pr&#233;sent article, tel qu&#8217;adopt&#233; en premi&#232;re lecture par l&#8217;Assembl&#233;e nationale, pr&#233;voyait que soient automatiquement qualifi&#233;es de substance naturelle &#224; usage biostimulant autoris&#233;e les parties consommables des plantes utilis&#233;es en alimentation animale ou humaine.</p><p style=\"text-align: justify;\">En revanche, la version adopt&#233;e par le S&#233;nat r&#233;tablit une proc&#233;dure d&#8217;&#233;valuation, adapt&#233;e, pour ces parties.</p><p style=\"text-align: justify;\">Un certain nombre de plantes sont consomm&#233;es, sous certaines formes, en alimentation humaine et animale. Il est donc possible d&#8217;exon&#233;rer ces diff&#233;rentes formes d&#8217;autorisation pr&#233;alable.</p><p style=\"text-align: justify;\">L&#8217;autorisation serait ainsi conserv&#233;e pour les parties des plantes ou dans des &#233;tats non consomm&#233;s par les animaux et l&#8217;homme, de fa&#231;on &#224; s&#8217;assurer de leur innocuit&#233;.</p>",
    "annexeExposeSommaire": {
      "@xmlns:xsi": "http://www.w3.org/2001/XMLSchema-instance",
      "@xsi:nil": "true"
    }
  },
  "representations": {
    "representation": {
      "nom": "PDF",
      "typeMime": {
        "type": "application",
        "subType": "PDF"
      },
      "statutRepresentation": {
        "verbatim": "true",
        "canonique": "true",
        "officielle": "true",
        "transcription": "false",
        "enregistrement": "false"
      },
      "repSource": {
        "@xmlns:xsi": "http://www.w3.org/2001/XMLSchema-instance",
        "@xsi:nil": "true"
      },
      "offset": {
        "@xmlns:xsi": "http://www.w3.org/2001/XMLSchema-instance",
        "@xsi:nil": "true"
      },
      "contenu": {
        "documentURI": "/15/amendements/1135/CION-ECO/CE399.pdf"
      },
      "dateDispoRepresentation": {
        "@xmlns:xsi": "http://www.w3.org/2001/XMLSchema-instance",
        "@xsi:nil": "true"
      }
    }
  },
  "seanceDiscussion": {
    "@xmlns:xsi": "http://www.w3.org/2001/XMLSchema-instance",
    "@xsi:nil": "true"
  },
  "sort": {
    "dateSaisie": "2018-07-18T10:27:42.000+02:00",
    "sortEnSeance": "Adopté"
  },
  "dateDepot": "2018-07-13T02:00:00.000+02:00",
  "dateDistribution": "2018-07-16T02:00:00.000+02:00",
  "article99": "0",
  "loiReference": {
    "codeLoi": {
      "@xmlns:xsi": "http://www.w3.org/2001/XMLSchema-instance",
      "@xsi:nil": "true"
    },
    "divisionCodeLoi": {
      "@xmlns:xsi": "http://www.w3.org/2001/XMLSchema-instance",
      "@xsi:nil": "true"
    }
  }
}