{
  "@xmlns": "http://schemas.assemblee-nationale.fr/referentiel",
  "uid": "AMANR5L15PO59048B1255P1D1N1139",
  "identifiant": {
    "legislature": "15",
    "numero": "1139",
    "numRect": "0",
    "saisine": {
      "refTexteLegislatif": "PRJLANR5L15B1255",
      "numeroPartiePLF": "1",
      "organeExamen": "PO59048",
      "mentionSecondeDeliberation": "0"
    }
  },
  "numeroLong": "I-CF1139",
  "etapeTexte": "1ère lecture (1ère assemblée saisie)",
  "triAmendement": "bdaaaaaaaaaaaaaaaaaaaaaaaaaaaaaaaaaaaaaaaaaaaaaaaadp",
  "cardinaliteAmdtMultiples": "1",
  "amendementParent": {
    "@xmlns:xsi": "http://www.w3.org/2001/XMLSchema-instance",
    "@xsi:nil": "true"
  },
  "etat": "Discuté",
  "signataires": {
    "auteur": {
      "typeAuteur": "Depute",
      "acteurRef": "PA609590",
      "organeRef": {
        "@xmlns:xsi": "http://www.w3.org/2001/XMLSchema-instance",
        "@xsi:nil": "true"
      },
      "groupePolitiqueRef": "PO758835"
    },
    "cosignataires": {
      "acteurRef": [
        "PA643145",
        "PA608741",
        "PA267233",
        "PA719930",
        "PA342415",
        "PA429893",
        "PA405480",
        "PA335054",
        "PA642764",
        "PA605069",
        "PA610681",
        "PA508",
        "PA1809",
        "PA337483",
        "PA332614",
        "PA1198",
        "PA333818",
        "PA333285",
        "PA608011",
        "PA340357",
        "PA340343",
        "PA609332",
        "PA1008",
        "PA609590",
        "PA607553",
        "PA720988",
        "PA608695",
        "PA1592",
        "PA335532",
        "PA608172"
      ]
    },
    "texteAffichable": "Mme&#160;Rabault,  Mme&#160;Pires Beaune, M.&#160;Jean-Louis&#160;Bricout, M.&#160;Pupponi, M.&#160;Aviragnet, Mme&#160;Bareigts, Mme&#160;Battistel, Mme&#160;Bi&#233;mouret, M.&#160;Bouillon, M.&#160;Carvounas, M.&#160;Alain&#160;David, Mme&#160;Laurence&#160;Dumont, M.&#160;Faure, M.&#160;Garot, M.&#160;David&#160;Habib, M.&#160;Hutin, M.&#160;Juanico, Mme&#160;Karamanli, M.&#160;J&#233;r&#244;me&#160;Lambert, M.&#160;Letchimy, Mme&#160;Manin, Mme&#160;Pau-Langevin, M.&#160;Potier, M.&#160;Pueyo, M.&#160;Saulignac, Mme&#160;Tolmont, Mme&#160;Untermaier, Mme&#160;Vainqueur-Christophe, M.&#160;Vallaud et Mme&#160;Victory"
  },
  "pointeurFragmentTexte": {
    "missionVisee": {
      "@xmlns:xsi": "http://www.w3.org/2001/XMLSchema-instance",
      "@xsi:nil": "true"
    },
    "division": {
      "titre": "Article 6",
      "articleDesignationCourte": "ART. 6",
      "type": "ARTICLE",
      "avant_A_Apres": "A",
      "divisionRattachee": "ARTICLE 6",
      "articleAdditionnel": {
        "@xmlns:xsi": "http://www.w3.org/2001/XMLSchema-instance",
        "@xsi:nil": "true"
      },
      "chapitreAdditionnel": {
        "@xmlns:xsi": "http://www.w3.org/2001/XMLSchema-instance",
        "@xsi:nil": "true"
      },
      "urlDivisionTexteVise": "/15/textes/1255A.asp#D_Article_6"
    },
    "alinea": {
      "avant_A_Apres": null,
      "numero": "50",
      "alineaDesignation": {
        "@xmlns:xsi": "http://www.w3.org/2001/XMLSchema-instance",
        "@xsi:nil": "true"
      }
    }
  },
  "corps": {
    "dispositif": "<p style=\"text-align: justify;\">A l&#8217;alin&#233;a&#160;50, substituer au taux&#160;:&#171;&#160;100&#160;%&#160;&#187; le taux&#160;: &#171;&#160;90&#160;%&#160;&#187;.</p>",
    "exposeSommaire": "<p style=\"text-align: justify;\">Cet amendement port&#233; par le groupe Socialistes et apparent&#233;s vise &#224; engager un d&#233;bat avec le gouvernement afin d&#8217;avoir une vision globale de l&#8217;impact &#233;conomique de ces dispositifs et &#224; comprendre pourquoi le gouvernement propose &#224; l&#8217;alin&#233;a&#160;50 un abattement &#233;gal &#224; 100&#160;% de la base nette imposable &#224; la cotisation fonci&#232;re des entreprises, alors que les dispositifs existants portaient sur des abaissements d&#8217;assiette de 40&#160;% et de 70&#160;% en cas de r&#233;gime major&#233;.</p><p style=\"text-align: justify;\">Pour rappel, l&#8217;&#233;tude d&#8217;impact transmise par le gouvernement indique que cette cr&#233;ation de nouvelles zones franches va co&#251;ter au budget de l&#8217;&#201;tat 10 millions d&#8217;euros en 2019 puis 124 millions d&#8217;euros en ann&#233;e pleine (c&#8217;est-&#224;-dire &#224; partir de 2020).</p><p style=\"text-align: justify;\">En revanche, l&#8217;&#233;tude d&#8217;impact ne pr&#233;sente aucune &#233;valuation globale, ce qui ne permet pas d&#8217;avoir une appr&#233;ciation globale.</p><p style=\"text-align: justify;\">&#160;</p>",
    "annexeExposeSommaire": {
      "@xmlns:xsi": "http://www.w3.org/2001/XMLSchema-instance",
      "@xsi:nil": "true"
    }
  },
  "representations": {
    "representation": {
      "nom": "PDF",
      "typeMime": {
        "type": "application",
        "subType": "PDF"
      },
      "statutRepresentation": {
        "verbatim": "true",
        "canonique": "true",
        "officielle": "true",
        "transcription": "false",
        "enregistrement": "false"
      },
      "repSource": {
        "@xmlns:xsi": "http://www.w3.org/2001/XMLSchema-instance",
        "@xsi:nil": "true"
      },
      "offset": {
        "@xmlns:xsi": "http://www.w3.org/2001/XMLSchema-instance",
        "@xsi:nil": "true"
      },
      "contenu": {
        "documentURI": "/15/amendements/1255A/CION_FIN/CF1139.pdf"
      },
      "dateDispoRepresentation": {
        "@xmlns:xsi": "http://www.w3.org/2001/XMLSchema-instance",
        "@xsi:nil": "true"
      }
    }
  },
  "seanceDiscussion": {
    "@xmlns:xsi": "http://www.w3.org/2001/XMLSchema-instance",
    "@xsi:nil": "true"
  },
  "sort": {
    "dateSaisie": "2018-10-10T00:43:01.000+02:00",
    "sortEnSeance": "Rejeté"
  },
  "dateDepot": "2018-10-05T02:00:00.000+02:00",
  "dateDistribution": "2018-10-08T02:00:00.000+02:00",
  "article99": "0",
  "loiReference": {
    "codeLoi": {
      "@xmlns:xsi": "http://www.w3.org/2001/XMLSchema-instance",
      "@xsi:nil": "true"
    },
    "divisionCodeLoi": {
      "@xmlns:xsi": "http://www.w3.org/2001/XMLSchema-instance",
      "@xsi:nil": "true"
    }
  }
}