{
  "@xmlns": "http://schemas.assemblee-nationale.fr/referentiel",
  "uid": "AMANR5L15PO419865B1831P0D1N2698",
  "identifiant": {
    "legislature": "15",
    "numero": "2698",
    "numRect": "0",
    "saisine": {
      "refTexteLegislatif": "PRJLANR5L15B1831",
      "numeroPartiePLF": "0",
      "organeExamen": "PO419865",
      "mentionSecondeDeliberation": "0"
    }
  },
  "numeroLong": "CD2698",
  "etapeTexte": "1ère lecture (2ème assemblée saisie)",
  "triAmendement": "aeoaaaaaaaaaaaaaaaaaaaaaaaaaaaaaaaaaaaaaaaaaaaaaaashebi",
  "cardinaliteAmdtMultiples": "1",
  "amendementParent": {
    "@xmlns:xsi": "http://www.w3.org/2001/XMLSchema-instance",
    "@xsi:nil": "true"
  },
  "etat": "Discuté",
  "signataires": {
    "auteur": {
      "typeAuteur": "Depute",
      "acteurRef": "PA709315",
      "organeRef": {
        "@xmlns:xsi": "http://www.w3.org/2001/XMLSchema-instance",
        "@xsi:nil": "true"
      },
      "groupePolitiqueRef": "PO730934"
    },
    "cosignataires": {
      "acteurRef": [
        "PA721678",
        "PA267204",
        "PA721046",
        "PA608416",
        "PA721070",
        "PA608016",
        "PA606712",
        "PA709315",
        "PA346218",
        "PA712015",
        "PA605036",
        "PA720684",
        "PA643134",
        "PA336316",
        "PA267527",
        "PA267901"
      ]
    },
    "texteAffichable": "M.&#160;Viala,  M.&#160;Sermier, M.&#160;Dive, M.&#160;Saddier, M.&#160;Hetzel, M.&#160;Abad, M.&#160;Lurton, M.&#160;Kamardine, M.&#160;Reda, Mme&#160;Bassire, Mme&#160;Ramassamy, M.&#160;Masson, M.&#160;Bouchet, M.&#160;Pierre-Henri&#160;Dumont, Mme&#160;Valentin et Mme&#160;Louwagie"
  },
  "pointeurFragmentTexte": {
    "missionVisee": {
      "@xmlns:xsi": "http://www.w3.org/2001/XMLSchema-instance",
      "@xsi:nil": "true"
    },
    "division": {
      "titre": "Article PREMIER",
      "articleDesignationCourte": "ART. PREMIER",
      "type": "ARTICLE",
      "avant_A_Apres": "A",
      "divisionRattachee": "ARTICLE PREMIER",
      "articleAdditionnel": {
        "@xmlns:xsi": "http://www.w3.org/2001/XMLSchema-instance",
        "@xsi:nil": "true"
      },
      "chapitreAdditionnel": {
        "@xmlns:xsi": "http://www.w3.org/2001/XMLSchema-instance",
        "@xsi:nil": "true"
      },
      "urlDivisionTexteVise": "/15/textes/1831.asp#D_Article_1er"
    },
    "alinea": {
      "avant_A_Apres": {
        "@xmlns:xsi": "http://www.w3.org/2001/XMLSchema-instance",
        "@xsi:nil": "true"
      },
      "numero": "83",
      "alineaDesignation": {
        "@xmlns:xsi": "http://www.w3.org/2001/XMLSchema-instance",
        "@xsi:nil": "true"
      }
    }
  },
  "corps": {
    "dispositif": "<p style=\"text-align: justify;\">&#192; l&#8217;alin&#233;a&#160;83, apr&#232;s le mot&#160;:</p><p style=\"text-align: justify;\">&#160;&#171;&#160;topographique&#160;&#187;, </p><p style=\"text-align: justify;\">ins&#233;rer le mot&#160;:</p><p style=\"text-align: justify;\">&#171;&#160;, d&#233;mographique&#160;&#187;.</p>",
    "exposeSommaire": "<p style=\"text-align: justify;\">L&#8217;&#201;tat en tant que ma&#238;tre d&#8217;ouvrage concernant les infrastructures de transport se doit de prendre en consid&#233;ration tous les aspects du territoire. Chacun d&#8217;entre eux, ont leurs propres caract&#233;ristiques d&#8217;ordre g&#233;ographique avec une situation topographique bien particuli&#232;re. Il convient d&#8217;adapter ses infrastructures aux besoins sociaux-&#233;conomiques de la population locale afin que le co&#251;t de celle-ci soit supportable pour les administr&#233;s et qu&#8217;elle ait un v&#233;ritable int&#233;r&#234;t en am&#233;liorant le quotidien des habitants.</p><p style=\"text-align: justify;\">Cependant, la r&#233;alisation d&#8217;une infrastructure de transport doit tenir compte de la d&#233;mographie de la population r&#233;sidant sur le territoire. Il est indispensable de prendre en compte le nombre d&#8217;habitants dans un cadre d&#8217;adaptation des infrastructures sur un territoire donn&#233;. Les enjeux sont diff&#233;rents s&#8217;ils concernent un espace urbain ou s&#8217;ils concernent un espace rural.&#160;</p><p style=\"text-align: justify;\">Cet amendement vise &#224; prendre en compte la situation d&#233;mographique des territoires lorsque L&#8217;&#201;tat adapte ces infrastructures de transport &#224; celui-ci.</p>",
    "annexeExposeSommaire": {
      "@xmlns:xsi": "http://www.w3.org/2001/XMLSchema-instance",
      "@xsi:nil": "true"
    },
    "cartoucheDelaiDepotDepasse": {
      "@xmlns:xsi": "http://www.w3.org/2001/XMLSchema-instance",
      "@xsi:nil": "true"
    }
  },
  "representations": {
    "representation": {
      "nom": "PDF",
      "typeMime": {
        "type": "application",
        "subType": "PDF"
      },
      "statutRepresentation": {
        "verbatim": "true",
        "canonique": "true",
        "officielle": "true",
        "transcription": "false",
        "enregistrement": "false"
      },
      "repSource": {
        "@xmlns:xsi": "http://www.w3.org/2001/XMLSchema-instance",
        "@xsi:nil": "true"
      },
      "offset": {
        "@xmlns:xsi": "http://www.w3.org/2001/XMLSchema-instance",
        "@xsi:nil": "true"
      },
      "contenu": {
        "documentURI": "/15/amendements/1831/CION-DVP/CD2698.pdf"
      },
      "dateDispoRepresentation": {
        "@xmlns:xsi": "http://www.w3.org/2001/XMLSchema-instance",
        "@xsi:nil": "true"
      }
    }
  },
  "seanceDiscussion": {
    "@xmlns:xsi": "http://www.w3.org/2001/XMLSchema-instance",
    "@xsi:nil": "true"
  },
  "sort": {
    "dateSaisie": "2019-05-16T09:38:47.000+02:00",
    "sortEnSeance": "Tombé"
  },
  "dateDepot": "2019-05-09T02:00:00.000+02:00",
  "dateDistribution": "2019-05-14T02:00:00.000+02:00",
  "article99": "0",
  "loiReference": {
    "codeLoi": {
      "@xmlns:xsi": "http://www.w3.org/2001/XMLSchema-instance",
      "@xsi:nil": "true"
    },
    "divisionCodeLoi": {
      "@xmlns:xsi": "http://www.w3.org/2001/XMLSchema-instance",
      "@xsi:nil": "true"
    }
  }
}