{
  "@xmlns": "http://schemas.assemblee-nationale.fr/referentiel",
  "uid": "AMANR5L15PO757134B1673P0D1N27",
  "identifiant": {
    "legislature": "15",
    "numero": "27",
    "numRect": "0",
    "saisine": {
      "refTexteLegislatif": "PRJLANR5L15B1673",
      "numeroPartiePLF": "0",
      "organeExamen": "PO757134",
      "mentionSecondeDeliberation": "0"
    }
  },
  "numeroLong": "27",
  "etapeTexte": "Nouvelle Lecture",
  "triAmendement": "akiaaaaaaaaaaaaaaaaaaaaaaaaaaaaaaaaaaaaaaaaaaaaaaaki",
  "cardinaliteAmdtMultiples": "1",
  "amendementParent": {
    "@xmlns:xsi": "http://www.w3.org/2001/XMLSchema-instance",
    "@xsi:nil": "true"
  },
  "etat": "Discuté",
  "signataires": {
    "auteur": {
      "typeAuteur": "Depute",
      "acteurRef": "PA605963",
      "organeRef": {
        "@xmlns:xsi": "http://www.w3.org/2001/XMLSchema-instance",
        "@xsi:nil": "true"
      },
      "groupePolitiqueRef": "PO730964"
    },
    "cosignataires": {
      "acteurRef": [
        "PA719364",
        "PA721296",
        "PA719186",
        "PA719330",
        "PA721278",
        "PA720854",
        "PA719540",
        "PA720222",
        "PA721328",
        "PA718728",
        "PA721876",
        "PA719170",
        "PA719790",
        "PA606639",
        "PA721458",
        "PA721784",
        "PA722366",
        "PA720538",
        "PA605963",
        "PA719480",
        "PA719440",
        "PA607155",
        "PA719718",
        "PA721246",
        "PA719230",
        "PA718944",
        "PA721600",
        "PA718744",
        "PA719866",
        "PA720932",
        "PA722336"
      ]
    },
    "texteAffichable": "M.&#160;Alauzet,  Mme&#160;Gaillot, Mme&#160;Vanceunebrock-Mialon, M.&#160;Anato, M.&#160;Gouttefarde, M.&#160;Girardin, M.&#160;Test&#233;, Mme&#160;Maillart-M&#233;haignerie, Mme&#160;Racon-Bouzon, M.&#160;Vignal, M.&#160;Cellier, Mme&#160;Khattabi, M.&#160;Thi&#233;baut, M.&#160;Daniel, Mme&#160;Toutut-Picard, Mme&#160;O&apos;Petit, M.&#160;Roseren, M.&#160;Gouffier-Cha, Mme&#160;Brugnera, M.&#160;Kerlogot, M.&#160;Gaillard, Mme&#160;Rossi, Mme&#160;De Temmerman, Mme&#160;Bagarry, M.&#160;Da Silva, Mme&#160;Charvier, M.&#160;Chalumeau, Mme&#160;Gomez-Bassac, M.&#160;Fugit, M.&#160;Morenas et Mme&#160;Abadie"
  },
  "pointeurFragmentTexte": {
    "missionVisee": {
      "@xmlns:xsi": "http://www.w3.org/2001/XMLSchema-instance",
      "@xsi:nil": "true"
    },
    "division": {
      "titre": "Article 8 bis B",
      "articleDesignationCourte": "ART. 8 BIS B",
      "type": "ARTICLE",
      "avant_A_Apres": "A",
      "divisionRattachee": "ARTICLE 8 BIS B",
      "articleAdditionnel": {
        "@xmlns:xsi": "http://www.w3.org/2001/XMLSchema-instance",
        "@xsi:nil": "true"
      },
      "chapitreAdditionnel": {
        "@xmlns:xsi": "http://www.w3.org/2001/XMLSchema-instance",
        "@xsi:nil": "true"
      },
      "urlDivisionTexteVise": "/15/textes/1673.asp#D_Article_8_bis_B"
    },
    "alinea": {
      "@xmlns:xsi": "http://www.w3.org/2001/XMLSchema-instance",
      "@xsi:nil": "true"
    }
  },
  "corps": {
    "dispositif": "<p style=\"text-align: justify;\">Supprimer cet article.</p>",
    "exposeSommaire": "<p style=\"text-align: justify;\">L&#8217;amendement vise &#224; supprimer cet article ajout&#233; au S&#233;nat contre l&#8217;avis du gouvernement qui abroge l&#8217;interdiction de fabriquer sur le territoire fran&#231;ais des produits phytosanitaires non-autoris&#233;s en&#160;Union&#160;Europ&#233;enne&#160;et &#233;tant destin&#233;s &#224; &#234;tre commercialis&#233;s dans des pays situ&#233;s hors de l&#8217;Union&#160;europ&#233;enne o&#249; leur utilisation est autoris&#233;e.</p><p style=\"text-align: justify;\">Cette interdiction, adopt&#233;e dans la loi Egalim il y a tout juste quelques mois, r&#233;pond &#224; des exigences environnementales et &#233;thiques de base. Elle interdit que soient produits sur le sol fran&#231;ais des produits reconnus comme nocifs dans l&#8217;Union&#160;Europ&#233;enne, refusant ainsi que ces productions fran&#231;aises viennent d&#233;grader les terres de pays non-membres et poser des dangers pour leurs populations.</p><p style=\"text-align: justify;\">De plus, la protection de l&#8217;environnement et l&#8217;am&#233;lioration de la qualit&#233; de la nourriture sont des enjeux mondiaux et non uniquement fran&#231;ais.</p>",
    "annexeExposeSommaire": {
      "@xmlns:xsi": "http://www.w3.org/2001/XMLSchema-instance",
      "@xsi:nil": "true"
    },
    "cartoucheDelaiDepotDepasse": {
      "@xmlns:xsi": "http://www.w3.org/2001/XMLSchema-instance",
      "@xsi:nil": "true"
    }
  },
  "representations": {
    "representation": {
      "nom": "PDF",
      "typeMime": {
        "type": "application",
        "subType": "PDF"
      },
      "statutRepresentation": {
        "verbatim": "true",
        "canonique": "true",
        "officielle": "true",
        "transcription": "false",
        "enregistrement": "false"
      },
      "repSource": {
        "@xmlns:xsi": "http://www.w3.org/2001/XMLSchema-instance",
        "@xsi:nil": "true"
      },
      "offset": {
        "@xmlns:xsi": "http://www.w3.org/2001/XMLSchema-instance",
        "@xsi:nil": "true"
      },
      "contenu": {
        "documentURI": "/15/amendements/1673/CSPACTE/27.pdf"
      },
      "dateDispoRepresentation": {
        "@xmlns:xsi": "http://www.w3.org/2001/XMLSchema-instance",
        "@xsi:nil": "true"
      }
    }
  },
  "seanceDiscussion": {
    "@xmlns:xsi": "http://www.w3.org/2001/XMLSchema-instance",
    "@xsi:nil": "true"
  },
  "sort": {
    "dateSaisie": "2019-03-06T00:14:58.000+01:00",
    "sortEnSeance": "Rejeté"
  },
  "dateDepot": "2019-02-21T01:00:00.000+01:00",
  "dateDistribution": "2019-03-05T01:00:00.000+01:00",
  "article99": "0",
  "loiReference": {
    "codeLoi": {
      "@xmlns:xsi": "http://www.w3.org/2001/XMLSchema-instance",
      "@xsi:nil": "true"
    },
    "divisionCodeLoi": {
      "@xmlns:xsi": "http://www.w3.org/2001/XMLSchema-instance",
      "@xsi:nil": "true"
    }
  }
}