{
  "@xmlns": "http://schemas.assemblee-nationale.fr/referentiel",
  "uid": "AMANR5L15SEA717460BTC0971P0D1N1753",
  "identifiant": {
    "legislature": "15",
    "numero": "1753",
    "numRect": "0",
    "saisine": {
      "refTexteLegislatif": "PRJLANR5L15BTC0971",
      "numeroPartiePLF": "0",
      "organeExamen": "PO717460",
      "mentionSecondeDeliberation": "0"
    }
  },
  "numeroLong": "1753",
  "etapeTexte": "1ère lecture (1ère assemblée saisie)",
  "triAmendement": "tg",
  "cardinaliteAmdtMultiples": "1",
  "amendementParent": {
    "@xmlns:xsi": "http://www.w3.org/2001/XMLSchema-instance",
    "@xsi:nil": "true"
  },
  "etat": "Discuté",
  "signataires": {
    "auteur": {
      "typeAuteur": "Depute",
      "acteurRef": "PA721718",
      "organeRef": {
        "@xmlns:xsi": "http://www.w3.org/2001/XMLSchema-instance",
        "@xsi:nil": "true"
      },
      "groupePolitiqueRef": "PO730964"
    },
    "cosignataires": {
      "acteurRef": "PA721718"
    },
    "texteAffichable": "Mme&#160;Do"
  },
  "pointeurFragmentTexte": {
    "missionVisee": {
      "@xmlns:xsi": "http://www.w3.org/2001/XMLSchema-instance",
      "@xsi:nil": "true"
    },
    "division": {
      "titre": "Article 12",
      "articleDesignationCourte": "ART. 12",
      "type": "ARTICLE",
      "avant_A_Apres": "A",
      "divisionRattachee": "ARTICLE 12",
      "articleAdditionnel": {
        "@xmlns:xsi": "http://www.w3.org/2001/XMLSchema-instance",
        "@xsi:nil": "true"
      },
      "chapitreAdditionnel": {
        "@xmlns:xsi": "http://www.w3.org/2001/XMLSchema-instance",
        "@xsi:nil": "true"
      },
      "urlDivisionTexteVise": "/15/textes/0971.asp#D_Article_12"
    },
    "alinea": {
      "avant_A_Apres": "A",
      "numero": "3",
      "alineaDesignation": "Alinéa 3"
    }
  },
  "corps": {
    "dispositif": "<p>Compl&#233;ter cet article par l&#8217;alin&#233;a suivant&#160;:</p><p>&#171;&#160;II.&#160;-&#160;&#192; l&#8217;article&#160;113 de la loi n&#176;&#160;2017&#8209;86 du 27 janvier 2017 relative &#224; l&#8217;&#233;galit&#233; et &#224; la citoyennet&#233;, le mot&#160;: &#171;&#160;deux&#160;&#187; est remplac&#233; par le mot&#160;: &#171;&#160;trois&#160;&#187;.&#160;&#187;</p>",
    "exposeSommaire": "<p style=\"text-align: justify;\">La comp&#233;tence en mati&#232;re de politique de l&#8217;habitat a &#233;t&#233; transf&#233;r&#233;e au 1<sup>er</sup> janvier 2017 &#224; la m&#233;tropole du Grand Paris, lui permettant ainsi d&#8217;engager la proc&#233;dure d&#8217;&#233;laboration du plan m&#233;tropolitain d&#8217;habitat et d&#8217;h&#233;bergement (PMHH).</p><p style=\"text-align: justify;\">L&#8217;article L.&#160;302&#8209;4&#8209;2 du code de la construction et de l&#8217;habitation dispose que lorsque des &#233;tablissements publics de coop&#233;ration intercommunale (EPCI) sont cr&#233;&#233;s par fusion, les dispositions des programmes locaux de l&#8217;habitat pr&#233;existants (PLH) demeurent applicables pendant une dur&#233;e maximale de deux ans jusqu&#8217;&#224; l&#8217;adoption d&#8217;un PLH couvrant l&#8217;ensemble du p&#233;rim&#232;tre du nouvel EPCI.</p><p style=\"text-align: justify;\">Les dispositions de cet article qui accordent une p&#233;riode transitoire ne sont pas applicables pour la MGP en ce qui concerne l&#8217;adoption de son PMHH. Ainsi, &#224; l&#8217;issue de cette dur&#233;e et jusqu&#8217;&#224; l&#8217;adoption du PMHH, aucun document cadre ne pourrait servir de r&#233;f&#233;rence pour fonder l&#8217;action des communes en mati&#232;re de politique de l&#8217;habitat et maintenir les exon&#233;rations de suppl&#233;ment de loyer de solidarit&#233; (SLS).&#160;</p><p style=\"text-align: justify;\">L&#8217;article&#160;113 de la loi n&#176; 2017&#8209;86 du 27 janvier 2017 relative &#224; l&#8217;&#233;galit&#233; et &#224; la citoyennet&#233; a donc pr&#233;vu que les dispositions des PLH pr&#233;existants demeurent applicables dans l&#8217;attente de l&#8217;adoption du PMHH et au plus tard dans un d&#233;lai de deux ans &#224; compter de la date du transfert de la comp&#233;tence politique locale de l&#8217;habitat, &#224; savoir le 1er janvier 2019.</p><p style=\"text-align: justify;\">Il est tr&#232;s probable que le PMHH de la MGP ne sera pas adopt&#233; &#224; cette date avec pour cons&#233;quence que la MGP, ses communes membres et leurs partenaires ne disposeront donc plus d&#8217;aucun document programmatique permettant d&#8217;assurer la continuit&#233; des politiques locales de l&#8217;habitat ainsi que le maintien des exon&#233;rations de suppl&#233;ment de loyer de solidarit&#233; (SLS).&#160;</p><p style=\"text-align: justify;\">Compte tenu du retard pris dans l&#8217;&#233;laboration du PMHH et de la n&#233;cessit&#233;, d&#8217;une part, d&#8217;assurer la continuit&#233; des politiques locales de l&#8217;habitat pour soutenir le d&#233;veloppement et l&#8217;am&#233;lioration de l&#8217;offre de logement social et, d&#8217;autre part, de maintenir les exon&#233;rations de suppl&#233;ment de loyer de solidarit&#233; qui visent &#224; garantir une mixit&#233; sociale dans ces territoires, le pr&#233;sent amendement a pour objet de porter la dur&#233;e d&#8217;application des PLH pr&#233;existants &#224; trois ans au lieu de deux ans, soit jusqu&#8217;au 1er janvier 2020.</p>",
    "annexeExposeSommaire": {
      "@xmlns:xsi": "http://www.w3.org/2001/XMLSchema-instance",
      "@xsi:nil": "true"
    }
  },
  "representations": {
    "representation": {
      "nom": "PDF",
      "typeMime": {
        "type": "application",
        "subType": "PDF"
      },
      "statutRepresentation": {
        "verbatim": "true",
        "canonique": "true",
        "officielle": "true",
        "transcription": "false",
        "enregistrement": "false"
      },
      "repSource": {
        "@xmlns:xsi": "http://www.w3.org/2001/XMLSchema-instance",
        "@xsi:nil": "true"
      },
      "offset": {
        "@xmlns:xsi": "http://www.w3.org/2001/XMLSchema-instance",
        "@xsi:nil": "true"
      },
      "contenu": {
        "documentURI": "/15/amendements/0971/AN/1753.pdf"
      },
      "dateDispoRepresentation": {
        "@xmlns:xsi": "http://www.w3.org/2001/XMLSchema-instance",
        "@xsi:nil": "true"
      }
    }
  },
  "seanceDiscussion": "RUANR5L15S2018IDS21065",
  "sort": {
    "dateSaisie": "2018-05-31T23:57:27.000+02:00",
    "sortEnSeance": "Retiré"
  },
  "dateDepot": "2018-05-25T02:00:00.000+02:00",
  "dateDistribution": "2018-05-29T02:00:00.000+02:00",
  "article99": "0",
  "loiReference": {
    "codeLoi": "loi 2017-86",
    "divisionCodeLoi": "113"
  }
}