{
  "@xmlns": "http://schemas.assemblee-nationale.fr/referentiel",
  "uid": "AMANR5L15SEA717460BTC1396P0D1N1142",
  "identifiant": {
    "legislature": "15",
    "numero": "1142",
    "numRect": "0",
    "saisine": {
      "refTexteLegislatif": "PRJLANR5L15BTC1396",
      "numeroPartiePLF": "0",
      "organeExamen": "PO717460",
      "mentionSecondeDeliberation": "0"
    }
  },
  "numeroLong": "1142",
  "etapeTexte": "1ère lecture (2ème assemblée saisie)",
  "triAmendement": "ktaaaabaaaaaaaaaaaaaaaaaaaaaaaaaaaaaaaaaaaaaaaaaaazzzzzzzzzzzzzzzzzzzx",
  "cardinaliteAmdtMultiples": "1",
  "amendementParent": {
    "@xmlns:xsi": "http://www.w3.org/2001/XMLSchema-instance",
    "@xsi:nil": "true"
  },
  "etat": "Discuté",
  "signataires": {
    "auteur": {
      "typeAuteur": "Depute",
      "acteurRef": "PA720586",
      "organeRef": {
        "@xmlns:xsi": "http://www.w3.org/2001/XMLSchema-instance",
        "@xsi:nil": "true"
      },
      "groupePolitiqueRef": "PO730934"
    },
    "cosignataires": {
      "acteurRef": [
        "PA720586",
        "PA2492"
      ]
    },
    "texteAffichable": "M.&#160;Vatin et M.&#160;Quentin"
  },
  "pointeurFragmentTexte": {
    "missionVisee": {
      "@xmlns:xsi": "http://www.w3.org/2001/XMLSchema-instance",
      "@xsi:nil": "true"
    },
    "division": {
      "titre": "Article 53",
      "articleDesignationCourte": "ART. 53",
      "type": "ARTICLE",
      "avant_A_Apres": "A",
      "divisionRattachee": "ARTICLE 53",
      "articleAdditionnel": {
        "@xmlns:xsi": "http://www.w3.org/2001/XMLSchema-instance",
        "@xsi:nil": "true"
      },
      "chapitreAdditionnel": {
        "@xmlns:xsi": "http://www.w3.org/2001/XMLSchema-instance",
        "@xsi:nil": "true"
      },
      "urlDivisionTexteVise": "/15/textes/1396.asp#D_Article_53"
    },
    "alinea": {
      "avant_A_Apres": {
        "@xmlns:xsi": "http://www.w3.org/2001/XMLSchema-instance",
        "@xsi:nil": "true"
      },
      "numero": "28",
      "alineaDesignation": {
        "@xmlns:xsi": "http://www.w3.org/2001/XMLSchema-instance",
        "@xsi:nil": "true"
      }
    }
  },
  "corps": {
    "dispositif": "<p>&#192; l&#8217;alin&#233;a&#160;28, substituer aux mots&#160;:</p><p>&#171;&#160;volume des affaires concern&#233;es et de la technicit&#233;&#160;&#187;</p><p>les mots&#160;:</p><p>&#171;&#160;tr&#232;s faible volume des affaires concern&#233;es et de la haute technicit&#233; juridique &#160;&#187;.</p>",
    "exposeSommaire": "<p style=\"text-align: justify;\">L'article 53 pr&#233;voit le regroupement de l&#8217;ensemble des contentieux relevant du Tribunal d'instance au Tribunal de grande instance afin d'unifier la comp&#233;tence civile au sein d'une m&#234;me juridiction.</p><p style=\"text-align: justify;\">Dans les d&#233;partements dans lesquels plusieurs TGI sont implant&#233;s, la d&#233;signation de l'un par d&#233;cret pour traiter de contentieux d&#233;termin&#233;s, qu'ils soient civils ou p&#233;naux sera d&#233;termin&#233;e &#224; partir d'une liste de contentieux limitativement fix&#233;e par d&#233;cret en Conseil d&#8217;&#201;tat et respectant, s'agissant des d&#233;lits, des crit&#232;res l&#233;gislatifs li&#233;s &#224; la coll&#233;gialit&#233; et au volume d'affaires.</p><p style=\"text-align: justify;\">Cet amendement tend &#224; pr&#233;ciser ces crit&#232;res : des contentieux &#224; haute sp&#233;cificit&#233; juridique et &#224; tr&#232;s faible volum&#233;trie.</p>",
    "annexeExposeSommaire": {
      "@xmlns:xsi": "http://www.w3.org/2001/XMLSchema-instance",
      "@xsi:nil": "true"
    },
    "cartoucheDelaiDepotDepasse": {
      "@xmlns:xsi": "http://www.w3.org/2001/XMLSchema-instance",
      "@xsi:nil": "true"
    }
  },
  "representations": {
    "representation": {
      "nom": "PDF",
      "typeMime": {
        "type": "application",
        "subType": "PDF"
      },
      "statutRepresentation": {
        "verbatim": "true",
        "canonique": "true",
        "officielle": "true",
        "transcription": "false",
        "enregistrement": "false"
      },
      "repSource": {
        "@xmlns:xsi": "http://www.w3.org/2001/XMLSchema-instance",
        "@xsi:nil": "true"
      },
      "offset": {
        "@xmlns:xsi": "http://www.w3.org/2001/XMLSchema-instance",
        "@xsi:nil": "true"
      },
      "contenu": {
        "documentURI": "/15/amendements/1396/AN/1142.pdf"
      },
      "dateDispoRepresentation": {
        "@xmlns:xsi": "http://www.w3.org/2001/XMLSchema-instance",
        "@xsi:nil": "true"
      }
    }
  },
  "seanceDiscussion": "RUANR5L15S2019IDS21403",
  "sort": {
    "dateSaisie": "2018-12-05T00:58:07.000+01:00",
    "sortEnSeance": "Rejeté"
  },
  "dateDepot": "2018-11-15T01:00:00.000+01:00",
  "dateDistribution": "2018-12-04T01:00:00.000+01:00",
  "article99": "0",
  "loiReference": {
    "codeLoi": {
      "@xmlns:xsi": "http://www.w3.org/2001/XMLSchema-instance",
      "@xsi:nil": "true"
    },
    "divisionCodeLoi": {
      "@xmlns:xsi": "http://www.w3.org/2001/XMLSchema-instance",
      "@xsi:nil": "true"
    }
  }
}