{
  "@xmlns": "http://schemas.assemblee-nationale.fr/referentiel",
  "uid": "AMANR5L15PO420120B0269P0D1N314",
  "identifiant": {
    "legislature": "15",
    "numero": "314",
    "numRect": "0",
    "saisine": {
      "refTexteLegislatif": "PRJLANR5L15B0269",
      "numeroPartiePLF": "0",
      "organeExamen": "PO420120",
      "mentionSecondeDeliberation": "0"
    }
  },
  "numeroLong": "AS314",
  "etapeTexte": "1ère lecture (1ère assemblée saisie)",
  "triAmendement": "abu",
  "cardinaliteAmdtMultiples": "1",
  "amendementParent": {
    "@xmlns:xsi": "http://www.w3.org/2001/XMLSchema-instance",
    "@xsi:nil": "true"
  },
  "etat": "Discuté",
  "signataires": {
    "auteur": {
      "typeAuteur": "Depute",
      "acteurRef": "PA608292",
      "organeRef": {
        "@xmlns:xsi": "http://www.w3.org/2001/XMLSchema-instance",
        "@xsi:nil": "true"
      },
      "groupePolitiqueRef": "PO723569"
    },
    "cosignataires": {
      "acteurRef": "PA608292"
    },
    "texteAffichable": "Mme&#160;Dubi&#233;"
  },
  "pointeurFragmentTexte": {
    "missionVisee": {
      "@xmlns:xsi": "http://www.w3.org/2001/XMLSchema-instance",
      "@xsi:nil": "true"
    },
    "division": {
      "titre": "Article 36",
      "articleDesignationCourte": "ART. 36",
      "type": "ARTICLE",
      "avant_A_Apres": "A",
      "divisionRattachee": "ARTICLE 36",
      "articleAdditionnel": {
        "@xmlns:xsi": "http://www.w3.org/2001/XMLSchema-instance",
        "@xsi:nil": "true"
      },
      "chapitreAdditionnel": {
        "@xmlns:xsi": "http://www.w3.org/2001/XMLSchema-instance",
        "@xsi:nil": "true"
      },
      "urlDivisionTexteVise": "/15/textes/0269.asp#D_Article_36"
    },
    "alinea": {
      "avant_A_Apres": "Apres",
      "numero": "2",
      "alineaDesignation": {
        "@xmlns:xsi": "http://www.w3.org/2001/XMLSchema-instance",
        "@xsi:nil": "true"
      }
    }
  },
  "corps": {
    "dispositif": "<p style=\"text-align: justify;\">Apr&#232;s l&#8217;alin&#233;a&#160;2, ins&#233;rer les quatre alin&#233;as suivants&#160;:</p><p style=\"text-align: justify;\">&#171;&#160;I&#160;bis.&#160;&#8211;&#160;Apr&#232;s l&#8217;article L.&#160;162&#8209;14&#8209;1&#8209;2 il est ins&#233;r&#233; un article L.&#160;162&#8209;14&#8209;1&#8209;3 ainsi r&#233;dig&#233;&#160;:</p><p style=\"text-align: justify;\">&#171;&#160;<i>Art.&#160;L.&#160;162&#8209;14&#8209;1&#8209;3</i>.&#160;&#8211;&#160;Une commission de la t&#233;l&#233;m&#233;decine est cr&#233;&#233;e aupr&#232;s de l&#8217;Union nationale des caisses d&#8217;assurance maladie. Cette commission, pr&#233;sid&#233;e par le directeur g&#233;n&#233;ral de l&#8217;Union nationale des caisses d&#8217;assurance maladie, est compos&#233;e de repr&#233;sentants des m&#233;decins lib&#233;raux et hospitaliers, de repr&#233;sentants des f&#233;d&#233;rations hospitali&#232;res repr&#233;sentatives publiques et priv&#233;es, et de repr&#233;sentants de l&#8217;Union nationale des caisses d&#8217;assurance maladie et de l&#8217;Union nationale des organismes des caisses d&#8217;assurance-maladie compl&#233;mentaire. Un repr&#233;sentant de l&#8217;&#201;tat assiste &#224; ses travaux.</p><p style=\"text-align: justify;\">&#171;&#160;Cette commission rend un avis motiv&#233; sur les propositions pr&#233;sent&#233;es par l&#8217;Union nationale des caisses d&#8217;assurance maladie, pr&#233;vues &#224; l&#8217;article L.&#160;162&#8209;14&#8209;1.</p><p style=\"text-align: justify;\">&#171;&#160;La composition et les r&#232;gles de fonctionnement de la commission sont fix&#233;es par arr&#234;t&#233;.&#160;&#187;&#160;&#187;</p>",
    "exposeSommaire": "<p style=\"text-align: justify;\">Cet amendement propose d&#8217;associer les professionnels hospitaliers et les f&#233;d&#233;rations hospitali&#232;res aux travaux permettant le d&#233;ploiement de la t&#233;l&#233;m&#233;decine.</p><p style=\"text-align: justify;\">L&#8217;int&#233;gration dans le droit commun tarifaire des actes de t&#233;l&#233;m&#233;decine et de t&#233;l&#233;consultation est une excellente option. Pour autant, il est indispensable que cette th&#233;matique nouvelle cr&#233;atrice de liens renouvel&#233;s entre la ville et l&#8217;h&#244;pital, au service des parcours de soins et de vie des patients &#224; domicile, associe d&#8217;embl&#233;e les professionnels hospitaliers et les f&#233;d&#233;rations hospitali&#232;res repr&#233;sentatives, publiques et priv&#233;es.</p><p style=\"text-align: justify;\">Le dispositif propos&#233; est &#233;tabli en analogie avec l&#8217;article L.&#160;162&#8209;1&#8209;9 du code de la s&#233;curit&#233; sociale, introduit &#224; l&#8217;article&#160;99 de la Loi de financement de la s&#233;curit&#233; sociale pour 2017.</p>",
    "annexeExposeSommaire": {
      "@xmlns:xsi": "http://www.w3.org/2001/XMLSchema-instance",
      "@xsi:nil": "true"
    }
  },
  "representations": {
    "representation": {
      "nom": "PDF",
      "typeMime": {
        "type": "application",
        "subType": "PDF"
      },
      "statutRepresentation": {
        "verbatim": "true",
        "canonique": "true",
        "officielle": "true",
        "transcription": "false",
        "enregistrement": "false"
      },
      "repSource": {
        "@xmlns:xsi": "http://www.w3.org/2001/XMLSchema-instance",
        "@xsi:nil": "true"
      },
      "offset": {
        "@xmlns:xsi": "http://www.w3.org/2001/XMLSchema-instance",
        "@xsi:nil": "true"
      },
      "contenu": {
        "documentURI": "/15/amendements/0269/CION-SOC/AS314.pdf"
      },
      "dateDispoRepresentation": {
        "@xmlns:xsi": "http://www.w3.org/2001/XMLSchema-instance",
        "@xsi:nil": "true"
      }
    }
  },
  "seanceDiscussion": {
    "@xmlns:xsi": "http://www.w3.org/2001/XMLSchema-instance",
    "@xsi:nil": "true"
  },
  "sort": {
    "dateSaisie": "2017-10-18T16:36:46.000+02:00",
    "sortEnSeance": "Non soutenu"
  },
  "dateDepot": "2017-10-13T02:00:00.000+02:00",
  "dateDistribution": "2017-10-16T02:00:00.000+02:00",
  "article99": "0",
  "loiReference": {
    "codeLoi": {
      "@xmlns:xsi": "http://www.w3.org/2001/XMLSchema-instance",
      "@xsi:nil": "true"
    },
    "divisionCodeLoi": {
      "@xmlns:xsi": "http://www.w3.org/2001/XMLSchema-instance",
      "@xsi:nil": "true"
    }
  }
}