{
  "@xmlns": "http://schemas.assemblee-nationale.fr/referentiel",
  "uid": "AMANR5L15SEA717460B2272P1D1N1732",
  "identifiant": {
    "legislature": "15",
    "numero": "1732",
    "numRect": "0",
    "saisine": {
      "refTexteLegislatif": "PRJLANR5L15B2272",
      "numeroPartiePLF": "1",
      "organeExamen": "PO717460",
      "mentionSecondeDeliberation": "0"
    }
  },
  "numeroLong": "I-1732",
  "etapeTexte": "1ère lecture (1ère assemblée saisie)",
  "triAmendement": "beaaaaaaaaaaaaaaaaaaaaaaaaaaaaaaaaaaaaaaaaaaaaaaaaotm",
  "cardinaliteAmdtMultiples": "1",
  "amendementParent": {
    "@xmlns:xsi": "http://www.w3.org/2001/XMLSchema-instance",
    "@xsi:nil": "true"
  },
  "etat": "Discuté",
  "signataires": {
    "auteur": {
      "typeAuteur": "Depute",
      "acteurRef": "PA720230",
      "organeRef": {
        "@xmlns:xsi": "http://www.w3.org/2001/XMLSchema-instance",
        "@xsi:nil": "true"
      },
      "groupePolitiqueRef": "PO767217"
    },
    "cosignataires": {
      "acteurRef": [
        "PA721486",
        "PA267585",
        "PA267330",
        "PA642868",
        "PA268019",
        "PA267241",
        "PA722030",
        "PA720230",
        "PA721632",
        "PA342601",
        "PA720696",
        "PA721110",
        "PA332228",
        "PA267355",
        "PA610775",
        "PA267780",
        "PA719806",
        "PA331567",
        "PA712014"
      ]
    },
    "texteAffichable": "Mme&#160;Magnier,  Mme&#160;Lemoine, M.&#160;Ledoux, Mme&#160;Auconie, M.&#160;Benoit, M.&#160;Bournazel, M.&#160;Brindeau, M.&#160;Christophe, Mme&#160;de La Raudi&#232;re, M.&#160;Demilly, Mme&#160;Descamps, Mme&#160;Firmin Le Bodo, M.&#160;Gom&#232;s, M.&#160;Herth, M.&#160;Lagarde, M.&#160;Naegelen, Mme&#160;Sanquer, M.&#160;Vercamer et M.&#160;Zumkeller"
  },
  "pointeurFragmentTexte": {
    "missionVisee": {
      "@xmlns:xsi": "http://www.w3.org/2001/XMLSchema-instance",
      "@xsi:nil": "true"
    },
    "division": {
      "titre": "Article 6",
      "articleDesignationCourte": "ART. 6",
      "type": "ARTICLE",
      "avant_A_Apres": "A",
      "divisionRattachee": "ARTICLE 6",
      "articleAdditionnel": {
        "@xmlns:xsi": "http://www.w3.org/2001/XMLSchema-instance",
        "@xsi:nil": "true"
      },
      "chapitreAdditionnel": {
        "@xmlns:xsi": "http://www.w3.org/2001/XMLSchema-instance",
        "@xsi:nil": "true"
      },
      "urlDivisionTexteVise": "/15/textes/2272A.asp#D_Article_6"
    },
    "alinea": {
      "avant_A_Apres": "Apres",
      "numero": "65",
      "alineaDesignation": {
        "@xmlns:xsi": "http://www.w3.org/2001/XMLSchema-instance",
        "@xsi:nil": "true"
      }
    }
  },
  "corps": {
    "dispositif": "<p>I.&#160;-&#160;Apr&#232;s l&#8217;alin&#233;a&#160;65, ins&#233;rer l&#8217;alin&#233;a suivant&#160;:</p><p style=\"text-align: justify;\">&#171;&#160;VI <i>bis</i>.&#160;- L&#8217;article&#160;224 du code des douanes est abrog&#233;.&#160;&#187;</p><p style=\"text-align: justify;\">II.&#160;- Compl&#233;ter cet article par l&#8217;alin&#233;a suivant&#160;:</p><p style=\"text-align: justify;\">&#171;&#160;XI.&#160;- La perte de recettes pour l&#8217;&#201;tat est compens&#233;e &#224; due concurrence par la cr&#233;ation d&#8217;une taxe additionnelle aux droits mentionn&#233;s aux articles 575 et 575 A du code g&#233;n&#233;ral des imp&#244;ts.&#160;&#187;</p><p style=\"text-align: justify;\">&#160;</p>",
    "exposeSommaire": "<p>Cet amendement fait suite &#224; un r&#233;f&#233;r&#233; de la Cour des Comptes transmis en d&#233;cembre 2019, au premier ministre Edouard Philippe, visant les taxes ayant un &#171;&#160;micro-rendement&#160;&#187;. Ces microtaxes selon la Cour auraient un rendement (montant collect&#233;) inf&#233;rieur &#224; 150&#160;millions d&#8217;euros.</p><p style=\"text-align: justify;\">Dans cet esprit l&#8217;amendement propose de supprimer le Droit de passeport applicable aux grands navires de plaisance dont le rendement est estim&#233; proche de 0&#160;euros.</p><p style=\"text-align: justify;\">&#160;</p><table style=\"width: 453.55pt;\" width=\"0\"><tbody><tr style=\"height: 16.75pt;\"><td style=\"width: 134.7pt; border: solid windowtext 1.0pt; padding: 0cm 3.5pt 0cm 3.5pt; height: 16.75pt;\" width=\"179\"><p style=\"text-align: center;\"><b>Taxe</b></p></td><td style=\"width: 106.3pt; border: solid windowtext 1.0pt; border-left: none; padding: 0cm 3.5pt 0cm 3.5pt; height: 16.75pt;\" width=\"143\"><p style=\"text-align: center;\"><b>Op&#233;rateur</b></p></td><td style=\"width: 99.2pt; border: solid windowtext 1.0pt; border-left: none; padding: 0cm 3.5pt 0cm 3.5pt; height: 16.75pt;\" width=\"132\"><p style=\"text-align: center;\"><b>Organisme b&#233;n&#233;ficiaire</b></p></td><td style=\"width: 4.0cm; border: solid windowtext 1.0pt; border-left: none; padding: 0cm 3.5pt 0cm 3.5pt; height: 16.75pt;\" width=\"151\"><p style=\"text-align: center;\"><b>Pr&#233;vision Produit 2019<br /> En millions d&#8217;euros</b></p></td></tr><tr style=\"height: 54.75pt;\"><td style=\"width: 134.7pt; border: solid windowtext 1.0pt; border-top: none; background: white; padding: 0cm 3.5pt 0cm 3.5pt; height: 54.75pt;\" width=\"179\"><p>Droit de passeport applicable aux grands navires de plaisance</p></td><td style=\"width: 106.3pt; border-top: none; border-left: none; border-bottom: solid windowtext 1.0pt; border-right: solid windowtext 1.0pt; background: white; padding: 0cm 3.5pt 0cm 3.5pt; height: 54.75pt;\" width=\"143\"><p>Divers</p></td><td style=\"width: 99.2pt; border-top: none; border-left: none; border-bottom: solid windowtext 1.0pt; border-right: solid windowtext 1.0pt; background: white; padding: 0cm 3.5pt 0cm 3.5pt; height: 54.75pt;\" width=\"132\"><p>Organismes mentionn&#233;s &#224; l&#8217;article L.&#160;742&#8209;9 du code de la s&#233;curit&#233; int&#233;rieure</p></td><td style=\"width: 4.0cm; border-top: none; border-left: none; border-bottom: solid windowtext 1.0pt; border-right: solid windowtext 1.0pt; background: white; padding: 0cm 3.5pt 0cm 3.5pt; height: 54.75pt;\" width=\"151\"><p style=\"text-align: right;\">0</p></td></tr></tbody></table><p style=\"text-align: justify;\">&#160;</p>",
    "annexeExposeSommaire": {
      "@xmlns:xsi": "http://www.w3.org/2001/XMLSchema-instance",
      "@xsi:nil": "true"
    },
    "cartoucheDelaiDepotDepasse": {
      "@xmlns:xsi": "http://www.w3.org/2001/XMLSchema-instance",
      "@xsi:nil": "true"
    },
    "avantAppel": {
      "@xmlns:xsi": "http://www.w3.org/2001/XMLSchema-instance",
      "@xsi:nil": "true"
    }
  },
  "representations": {
    "representation": {
      "nom": "PDF",
      "typeMime": {
        "type": "application",
        "subType": "PDF"
      },
      "statutRepresentation": {
        "verbatim": "true",
        "canonique": "true",
        "officielle": "true",
        "transcription": "false",
        "enregistrement": "false"
      },
      "repSource": {
        "@xmlns:xsi": "http://www.w3.org/2001/XMLSchema-instance",
        "@xsi:nil": "true"
      },
      "offset": {
        "@xmlns:xsi": "http://www.w3.org/2001/XMLSchema-instance",
        "@xsi:nil": "true"
      },
      "contenu": {
        "documentURI": "/15/amendements/2272A/AN/1732.pdf"
      },
      "dateDispoRepresentation": {
        "@xmlns:xsi": "http://www.w3.org/2001/XMLSchema-instance",
        "@xsi:nil": "true"
      }
    }
  },
  "seanceDiscussion": "RUANR5L15S2020IDS21870",
  "sort": {
    "dateSaisie": "2019-10-18T16:34:11.000+02:00",
    "sortEnSeance": "Non soutenu"
  },
  "dateDepot": "2019-10-10T02:00:00.000+02:00",
  "dateDistribution": "2019-10-18T02:00:00.000+02:00",
  "article99": "0",
  "loiReference": {
    "codeLoi": {
      "@xmlns:xsi": "http://www.w3.org/2001/XMLSchema-instance",
      "@xsi:nil": "true"
    },
    "divisionCodeLoi": {
      "@xmlns:xsi": "http://www.w3.org/2001/XMLSchema-instance",
      "@xsi:nil": "true"
    }
  }
}