{
  "@xmlns": "http://schemas.assemblee-nationale.fr/referentiel",
  "uid": "AMANR5L15PO419610B0846P0D1N919",
  "identifiant": {
    "legislature": "15",
    "numero": "919",
    "numRect": "0",
    "saisine": {
      "refTexteLegislatif": "PRJLANR5L15B0846",
      "numeroPartiePLF": "0",
      "organeExamen": "PO419610",
      "mentionSecondeDeliberation": "0"
    }
  },
  "numeroLong": "CE919",
  "etapeTexte": "1ère lecture (1ère assemblée saisie)",
  "triAmendement": "fy",
  "cardinaliteAmdtMultiples": "1",
  "amendementParent": {
    "@xmlns:xsi": "http://www.w3.org/2001/XMLSchema-instance",
    "@xsi:nil": "true"
  },
  "etat": "Discuté",
  "signataires": {
    "auteur": {
      "typeAuteur": "Depute",
      "acteurRef": "PA642847",
      "organeRef": {
        "@xmlns:xsi": "http://www.w3.org/2001/XMLSchema-instance",
        "@xsi:nil": "true"
      },
      "groupePolitiqueRef": "PO730934"
    },
    "cosignataires": {
      "acteurRef": "PA642847"
    },
    "texteAffichable": "M.&#160;Bazin"
  },
  "pointeurFragmentTexte": {
    "missionVisee": {
      "@xmlns:xsi": "http://www.w3.org/2001/XMLSchema-instance",
      "@xsi:nil": "true"
    },
    "division": {
      "titre": "Article PREMIER",
      "articleDesignationCourte": "ART. PREMIER",
      "type": "ARTICLE",
      "avant_A_Apres": "A",
      "divisionRattachee": "ARTICLE PREMIER",
      "articleAdditionnel": {
        "@xmlns:xsi": "http://www.w3.org/2001/XMLSchema-instance",
        "@xsi:nil": "true"
      },
      "chapitreAdditionnel": {
        "@xmlns:xsi": "http://www.w3.org/2001/XMLSchema-instance",
        "@xsi:nil": "true"
      },
      "urlDivisionTexteVise": "/15/textes/0846.asp#D_Article_1er"
    },
    "alinea": {
      "avant_A_Apres": "A",
      "numero": "18",
      "alineaDesignation": "Alinéa 18"
    }
  },
  "corps": {
    "dispositif": "<p style=\"text-align: justify;\">Supprimer la seconde phrase de l&#8217;alin&#233;a 18. </p><p>&#160;</p>",
    "exposeSommaire": "<p>L&#8217;article 1er compl&#232;te la cr&#233;ation d&#8217;un contrat partenarial d&#8217;am&#233;nagement par un nouvel outil d&#8217;am&#233;nagement similaire aux OIN initi&#233;es, apr&#232;s accord pr&#233;alable de l&#8217;Etat, par les intercommunalit&#233;s, la collectivit&#233; &#224; statut particulier qu&#8217;est la m&#233;tropole de Lyon et de celle que sera la Ville de Paris,&#160;d&#233;nomm&#233; &#171; grande op&#233;ration d&#8217;urbanisme&#160;&#187; (GOU).</p><p>Cette op&#233;ration emporte de nombreux effets d&#233;rogatoires au droit commun de l&#8217;urbanisme et plusieurs transferts de comp&#233;tences entre communes et EPCI afin de permettre l&#8217;acc&#233;l&#233;ration et la recherche de solutions innovantes en mati&#232;re de construction de logements dans le cadre des grandes op&#233;rations d&#8217;urbanisme&#160;:&#160; d&#233;rogation &#224; certaines normes de construction (permis de faire), b&#233;n&#233;fice d&#8217;un exercice prolong&#233; du droit de pr&#233;emption dans les ZAD&#160;; d&#233;rogation &#224; la loi MOP&#160;; int&#233;r&#234;t &#171;&#160;r&#233;put&#233;&#160;&#187; communautaire ou m&#233;tropolitain de l&#8217;op&#233;ration&#160;; transfert au pr&#233;sident de l&#8217;EPCI de la comp&#233;tence en mati&#232;re de d&#233;livrance des permis de construire, d&#8217;am&#233;nager, de d&#233;molir et du prononc&#233; sur les d&#233;clarations pr&#233;alables&#160;; substitution d&#8217;office, apr&#232;s accord du pr&#233;fet, de l&#8217;intercommunalit&#233; &#224; la commune pour la construction et l&#8217;adaptation d&#8217;un &#233;quipement public communal requis par la&#160; grande op&#233;ration d&#8217;urbanisme, en cas de refus de la commune d&#8217;y proc&#233;der, pouvoir de substitution d&#8217;office entre collectivit&#233;s territoriales consid&#233;r&#233; par le Conseil d&#8217;Etat (avis du 29 mars 2018, requ&#234;te n&#176; 394435) comme semblant &#171;&#160;jusqu&#8217;ici n&#8217;avoir pas de pr&#233;c&#233;dent&#160;&#187;..</p><p>Selon l&#8217;avis du Conseil d&#8217;Etat du 29 mars 2018 (requ&#234;te n&#176; 394435) rendu sur ces dispositions, la &#171; grande op&#233;ration d&#8217;urbanisme&#160;&#187; doit &#234;tre interpr&#233;t&#233;e non pas comme un outil d&#8217;am&#233;nagement servant les objectifs de l&#8217;Etat mais comme un outil au service des collectivit&#233;s&#160;:&#160; &#171;&#160;la similitude des r&#233;gimes juridiques de l&#8217;OIN et de la GOU et le maintien d&#8217;un contr&#244;le de l&#8217;Etat sur cette derni&#232;re ne paraissent cependant pas justifier de la ranger parmi les dispositifs servant les objectifs de l&#8217;Etat pr&#233;vus par le chapitre II du titre pr&#233;liminaire du livre Ier du code de l'urbanisme, puisqu&#8217;elle s&#8217;av&#232;re &#234;tre au service de l&#8217;&#233;tablissement ou la collectivit&#233;&#160;&#187;.</p><p>Et, selon l&#8217;expos&#233; des motifs, &#171;&#160;les crit&#232;res de cr&#233;ation des GOU sont d&#233;finis en r&#233;f&#233;rence &#224; la nature supra-locale des enjeux sur le territoire, soit par la dimension, soit par les caract&#233;ristiques particuli&#232;res des op&#233;rations d&#8217;am&#233;nagement concern&#233;es, ayant conduit &#224; la conclusion d&#8217;un contrat de PPA&#160;&#187;.</p><p>Or, &#224; l&#8217;instar du contrat de projet partenarial d&#8217;am&#233;nagement, si l&#8217;avis des communes incluses dans le p&#233;rim&#232;tre de l&#8217;op&#233;ration est recueilli pr&#233;alablement &#224; la d&#233;lib&#233;ration emportant cr&#233;ation de la grande op&#233;ration d&#8217;urbanisme, il appara&#238;t toutefois que cet outil rel&#232;ve in fine de la seule responsabilit&#233; de l&#8217;Etat qui, d&#8217;une part, donne son accord pr&#233;alablement &#224; la d&#233;lib&#233;ration de l&#8217;intercommunalit&#233; ou de la collectivit&#233;&#160; d&#233;cidant de la cr&#233;ation de cette op&#233;ration et r&#233;pute l&#8217;int&#233;r&#234;t communautaire des op&#233;rations d&#8217;am&#233;nagement engag&#233;es dans le p&#233;rim&#232;tre des GOU, et qui d&#8217;autre part,&#160; peut passer outre l&#8217;avis d&#233;favorable d&#8217;une des communes lors de cette d&#233;cision de cr&#233;ation ou encore enclencher, &#171;&#160;un pouvoir de substitution d&#8217;office&#160;&#187; permettant &#224; l&#8217;intercommunalit&#233; de prendre la main sur les &#233;quipements publics relevant de comp&#233;tence communales.&#160;&#160;</p><p>Or, un tel pouvoir de tutelle d&#8217;une part de l&#8217;Etat sur les collectivit&#233;s territoriales (accord pr&#233;alable du pr&#233;fet sur la d&#233;lib&#233;ration de l&#8217;intercommunalit&#233; cr&#233;ant la GOU) et d&#8217;une collectivit&#233; sur une autre (substitution d&#8217;office apr&#232;s accord du pr&#233;fet de l&#8217;intercommunalit&#233; sur les communes en mati&#232;re de gestion des &#233;quipements publics) est inacceptable &#224; plusieurs titres&#160;:</p><p>-&#160;&#160;&#160;&#160;&#160;&#160;&#160;&#160;&#160; Il porte atteinte au pouvoir de libre administration des collectivit&#233;s locales garanti par l&#8217;article 72 de la Constitution alors m&#234;me que le Conseil d&#8217;Etat consid&#232;re que la GOU s&#8217;av&#232;re &#171;&#160;&#234;tre au service de l&#8217;&#233;tablissement ou la collectivit&#233;&#160;&#187; et non pas de l&#8217;Etat.&#160;</p><p>&#160;</p><p>-&#160;&#160;&#160;&#160;&#160;&#160;&#160;&#160;&#160; Il entra&#238;ne des transferts automatiques de comp&#233;tences entre communes et intercommunalit&#233;s et la r&#233;alisation par ces derni&#232;res au nom et pour leur compte des communes d&#8217;&#233;quipements publics relevant de leurs comp&#233;tences sans leur accord, mais &#233;galement sans d&#233;bat pr&#233;alable des conseils municipaux et de l&#8217;organe d&#233;lib&#233;rant de l&#8217;intercommunalit&#233; sur les conditions de ces transferts et de ces mises &#224; dispositions.</p><p>En ce sens, cet article habilite l&#8217;intercommunalit&#233; non pas &#224; organiser mais &#224; disposer d&#8217;un pouvoir de d&#233;cision pour d&#233;terminer les modalit&#233;s de l'action commune de plusieurs collectivit&#233;s, ce qui a d&#233;j&#224; pu &#234;tre sanctionn&#233; par le conseil constitutionnel au regard de l&#8217;alin&#233;a 5 de l&#8217;article 72 de la Constitution (D&#233;cision n&#176; 2008-567 DC du 24 juillet 2008, loi relative aux contrats de partenariat point 33). L&#8217;article L. 312-8 du projet est donc supprim&#233; en cons&#233;quence.</p><p>&#160;</p><p>-&#160;&#160;&#160;&#160;&#160;&#160;&#160;&#160;&#160; L&#8217;int&#233;r&#234;t r&#233;put&#233; communautaire de la GOU entra&#238;ne une concurrence de cet outil d&#233;rogatoire et performant avec les projets d&#233;j&#224; engag&#233;s par les communes dans le cadre de leurs comp&#233;tences structurantes en mati&#232;re d&#8217;am&#233;nagement (voirie, am&#233;nagement des espaces publics, circulation pi&#233;tonne, &#233;quipements scolaires, culturels et sportifs, etc.) et fragilise l&#8217;&#233;quilibre contractuel et &#233;conomique des op&#233;rations en cours au d&#233;triment et des porteurs de projets (publics, du type des EPFL ou de SEM, SPL ou priv&#233;s) et de la coh&#233;rence des politiques locales d&#233;j&#224; mises en &#339;uvre.</p><p>&#160;</p><p>Or, les communes ne peuvent &#234;tre consid&#233;r&#233;es comme des partenaires institutionnels et financiers de second rang d&#232;s lors qu&#8217;elles disposent de comp&#233;tence structurantes en mati&#232;re d&#8217;am&#233;nagement des &#233;quipements publics relatifs &#224; ces comp&#233;tences (voirie, am&#233;nagement des espaces publics, circulation pi&#233;tonne, &#233;quipements scolaires, culturels et sportifs, etc.) qui participent &#224; la conception de la ville et, tr&#232;s souvent, du foncier mobilisable.</p><p>Seuls des engagements partag&#233;s et co-construits entre les communes, leurs groupements et l&#8217;Etat permettront de mettre en &#339;uvre durablement des op&#233;rations d&#8217;am&#233;nagements ambitieuses au service de projets de territoire et de leurs habitants.</p><p>Pour ces raisons, il serait contreproductif et ce, de mani&#232;re in&#233;dite en droit de l&#8217;am&#233;nagement, d&#8217;&#233;carter les communes de l&#8217;acc&#232;s &#224; un outil contractuel potentiellement d&#233;rogatoire au droit commun de l&#8217;urbanisme et potentiellement plus performant&#160;en mati&#232;re de politique publique (via les grandes op&#233;rations d&#8217;urbanisme - GOU) relevant pourtant de l&#8217;exercice de leurs comp&#233;tences et de leur ma&#238;trise fonci&#232;re.</p><p>Cet amendement est li&#233; &#224; l&#8217;amendement pr&#233;c&#233;dent sur le contrat de projet partenarial d&#8217;am&#233;nagement et vise &#224; adapter le r&#233;gime de la grande op&#233;ration d&#8217;urbanisme (GOU) au regard du principe de libre-administration des collectivit&#233;s territoriales.</p><p>Aussi, il vise d&#8217;une part &#224; r&#233;int&#233;grer les communes comme acteurs principaux ce grandes op&#233;rations d&#8217;urbanisme, la cr&#233;ation des GOU &#233;tant soumise &#224; leur accord pr&#233;alable.</p><p>D&#8217;autre part il a pour objet de r&#233;int&#233;grer, dans la proc&#233;dure de cr&#233;ation de la GOU, un d&#233;bat sur les conditions des transferts de comp&#233;tence entre les communes et leurs intercommunalit&#233;s et sur celles relatives &#224; la mise &#224; disposition des &#233;quipements publics entre une commune et l&#8217;&#233;tablissement public de coop&#233;ration intercommunale ou la collectivit&#233;&#160;&#224; l&#8217;initiative de la grande op&#233;ration d&#8217;urbanisme.</p><p>Conform&#233;ment au principe de libre-administration des collectivit&#233;s, il est &#224; noter qu&#8217;en l&#8217;&#233;tat actuel du droit, il est d&#233;j&#224; permis aux termes de l'article L.422-3 du code de l'urbanisme, lorsqu'une commune fait partie d'un &#233;tablissement public de coop&#233;ration intercommunale, en accord avec ce dernier, qu&#8217;elle puisse lui d&#233;l&#233;guer la comp&#233;tence pr&#233;vue au a) de l'article L. 422-1, &#224; savoir la d&#233;livrance des autorisations d'urbanisme, qui est alors exerc&#233;e par le pr&#233;sident de l'&#233;tablissement public au nom de l'&#233;tablissement. Dans ce cas, le maire adresse au pr&#233;sident de l'&#233;tablissement public son avis sur chaque demande de permis et sur chaque d&#233;claration pr&#233;alable.</p><p>&#160;Un transfert automatique de la comp&#233;tence en mati&#232;re de d&#233;livrance des autorisations de construire et ce, pour une dur&#233;e ind&#233;termin&#233;e dans le cadre des grandes op&#233;rations d&#8217;urbanisme, s&#8217;apparente &#224; un transfert de comp&#233;tence des communes aux EPCI en mati&#232;re d&#8217;am&#233;nagement et d&#8217;urbanisme, sous contr&#244;le de l&#8217;Etat. En cela il porte atteinte &#224; la n&#233;cessaire souplesse d&#8217;adaptation de ces comp&#233;tences aux circonstances locales qui devraient pourtant &#234;tre privil&#233;gi&#233;e dans le cadre du dispositif contractuel PPA-GOU.</p><p>La disposition relative au transfert automatique du pouvoir de d&#233;livrance de l&#8217;autorisation de construire au pr&#233;sident de l&#8217;EPCI est donc supprim&#233;e en cons&#233;quence.</p><p>&#160;</p><p>&#160;</p><p>&#160;</p>",
    "annexeExposeSommaire": {
      "@xmlns:xsi": "http://www.w3.org/2001/XMLSchema-instance",
      "@xsi:nil": "true"
    }
  },
  "representations": {
    "representation": {
      "nom": "PDF",
      "typeMime": {
        "type": "application",
        "subType": "PDF"
      },
      "statutRepresentation": {
        "verbatim": "true",
        "canonique": "true",
        "officielle": "true",
        "transcription": "false",
        "enregistrement": "false"
      },
      "repSource": {
        "@xmlns:xsi": "http://www.w3.org/2001/XMLSchema-instance",
        "@xsi:nil": "true"
      },
      "offset": {
        "@xmlns:xsi": "http://www.w3.org/2001/XMLSchema-instance",
        "@xsi:nil": "true"
      },
      "contenu": {
        "documentURI": "/15/amendements/0846/CION-ECO/CE919.pdf"
      },
      "dateDispoRepresentation": {
        "@xmlns:xsi": "http://www.w3.org/2001/XMLSchema-instance",
        "@xsi:nil": "true"
      }
    }
  },
  "seanceDiscussion": {
    "@xmlns:xsi": "http://www.w3.org/2001/XMLSchema-instance",
    "@xsi:nil": "true"
  },
  "sort": {
    "dateSaisie": "2018-05-15T21:32:59.000+02:00",
    "sortEnSeance": "Rejeté"
  },
  "dateDepot": "2018-05-07T02:00:00.000+02:00",
  "dateDistribution": "2018-05-14T02:00:00.000+02:00",
  "article99": "0",
  "loiReference": {
    "codeLoi": {
      "@xmlns:xsi": "http://www.w3.org/2001/XMLSchema-instance",
      "@xsi:nil": "true"
    },
    "divisionCodeLoi": {
      "@xmlns:xsi": "http://www.w3.org/2001/XMLSchema-instance",
      "@xsi:nil": "true"
    }
  }
}