{
  "@xmlns": "http://schemas.assemblee-nationale.fr/referentiel",
  "uid": "AMANR5L15SEA717460BTC2243P0D1N1997",
  "identifiant": {
    "legislature": "15",
    "numero": "1997",
    "numRect": "0",
    "saisine": {
      "refTexteLegislatif": "PRJLANR5L15BTC2243",
      "numeroPartiePLF": "0",
      "organeExamen": "PO717460",
      "mentionSecondeDeliberation": "0"
    }
  },
  "numeroLong": "1997",
  "etapeTexte": "1ère lecture (1ère assemblée saisie)",
  "triAmendement": "acaaaaaaaaaaaaaaaaaaaaaaaaaaaaaaaaaaaaaaaaaaaaaaaaabvhfti",
  "cardinaliteAmdtMultiples": "1",
  "amendementParent": {
    "@xmlns:xsi": "http://www.w3.org/2001/XMLSchema-instance",
    "@xsi:nil": "true"
  },
  "etat": "Discuté",
  "signataires": {
    "auteur": {
      "typeAuteur": "Depute",
      "acteurRef": "PA722284",
      "organeRef": {
        "@xmlns:xsi": "http://www.w3.org/2001/XMLSchema-instance",
        "@xsi:nil": "true"
      },
      "groupePolitiqueRef": "PO730970"
    },
    "cosignataires": {
      "acteurRef": [
        "PA719874",
        "PA721924",
        "PA720256",
        "PA720326",
        "PA722284"
      ]
    },
    "texteAffichable": "M.&#160;Fuchs,  M.&#160;Hammouche, Mme&#160;Bannier, Mme&#160;de Vaucouleurs et Mme&#160;Jacquier-Laforge"
  },
  "pointeurFragmentTexte": {
    "missionVisee": {
      "@xmlns:xsi": "http://www.w3.org/2001/XMLSchema-instance",
      "@xsi:nil": "true"
    },
    "division": {
      "titre": "Article PREMIER",
      "articleDesignationCourte": "ART. PREMIER",
      "type": "ARTICLE",
      "avant_A_Apres": "A",
      "divisionRattachee": "ARTICLE PREMIER",
      "articleAdditionnel": {
        "@xmlns:xsi": "http://www.w3.org/2001/XMLSchema-instance",
        "@xsi:nil": "true"
      },
      "chapitreAdditionnel": {
        "@xmlns:xsi": "http://www.w3.org/2001/XMLSchema-instance",
        "@xsi:nil": "true"
      },
      "urlDivisionTexteVise": "/15/textes/2243.asp#D_Article_1er"
    },
    "alinea": {
      "avant_A_Apres": {
        "@xmlns:xsi": "http://www.w3.org/2001/XMLSchema-instance",
        "@xsi:nil": "true"
      },
      "numero": "3",
      "alineaDesignation": {
        "@xmlns:xsi": "http://www.w3.org/2001/XMLSchema-instance",
        "@xsi:nil": "true"
      }
    }
  },
  "corps": {
    "dispositif": "<p style=\"text-align: justify;\">R&#233;diger ainsi l&#8217;alin&#233;a&#160;3&#160;:</p><p style=\"text-align: justify;\">&#171;&#160;<i>Art.&#160;L.&#160;2141&#8209;2</i>. &#8211; Tout couple form&#233; d&#8217;un homme et d&#8217;une femme ou de deux femmes, ou toute femme seule a acc&#232;s &#224; l&#8217;assistance m&#233;dicale &#224; la procr&#233;ation apr&#232;s une exploration m&#233;dicale et un accompagnement psychologique adapt&#233;s au contexte de l&#8217;assistance m&#233;dicale &#224; la procr&#233;ation intraconjugale ou avec tiers donneur selon les modalit&#233;s pr&#233;vues &#224; l&#8217;article L.&#160;2141&#8209;10.&#160;&#187;</p>",
    "exposeSommaire": "<p style=\"text-align: justify;\">L&#8217;article L.&#160;2141&#8209;2 pr&#233;voit que &#171;&#160;tout couple form&#233; d&#8217;un homme et d&#8217;une femme ou de deux femmes ou toute femme non mari&#233;e a acc&#232;s &#224; l&#8217;assistance m&#233;dicale &#224; la procr&#233;ation (AMP)&#160;&#187;. La d&#233;nomination &#171;&#160;toute femme non mari&#233;e&#160;&#187; pourrait mettre en difficult&#233; les praticiens mettant en oeuvre l&#8217;AMP car une femme non mari&#233;e peut faire partie d&#8217;un couple constitu&#233; d&#8217;un homme et d&#8217;une femme ou de deux femmes, sans obligatoirement &#234;tre mari&#233;e. Une femme non mari&#233;e peut &#233;galement avoir &#233;tabli un PACS avec son ou sa conjoint(e) avec lequel ou laquelle elle partage une vie commune. Il s&#8217;agirait d&#8217;accepter la possibilit&#233;, dans ce contexte, pour une femme de pouvoir acc&#233;der &#224; l&#8217;AMP avec tiers donneur sans l&#8217;accord de son conjoint ou de sa conjointe.</p><p style=\"text-align: justify;\">Cet article pr&#233;voit &#233;galement une &#233;valuation m&#233;dicale et psychologique qui semble &#234;tre syst&#233;matique pour tout type de demande qu&#8217;il s&#8217;agisse d&#8217;une AMP intraconjugale ou avec tiers donneur. Le terme &#171;&#160;&#233;valuation&#160;&#187; ne correspond pas &#224; la pratique habituelle de la prise en charge des couples infertiles dans le cadre de l&#8217;AMP en intraconjugale ou avec tiers donneurs. En effet, le terme &#171;&#160;&#233;valuation&#160;&#187; se r&#233;f&#232;re &#224; la n&#233;cessit&#233; de l&#8217;utilisation de crit&#232;res d&#8217;&#233;valuation pr&#233;d&#233;finis et applicables &#224; tous. M&#234;me si les pratiques m&#233;dicales sont habituellement standardis&#233;es, elles sont modulables et adaptables en fonction du contexte clinique du couple infertile et le seront aussi pour les couples de femmes ou les femmes seules.</p><p style=\"text-align: justify;\">Ainsi, les couples et les femmes seules doivent pouvoir b&#233;n&#233;ficier d&#8217;une prise en charge m&#233;dicale et d&#8217;un accompagnement psychologique adapt&#233;s au contexte de l&#8217;AMP intraconjugale ou avec tiers donneur.</p>",
    "annexeExposeSommaire": {
      "@xmlns:xsi": "http://www.w3.org/2001/XMLSchema-instance",
      "@xsi:nil": "true"
    },
    "cartoucheDelaiDepotDepasse": {
      "@xmlns:xsi": "http://www.w3.org/2001/XMLSchema-instance",
      "@xsi:nil": "true"
    },
    "avantAppel": {
      "@xmlns:xsi": "http://www.w3.org/2001/XMLSchema-instance",
      "@xsi:nil": "true"
    }
  },
  "representations": {
    "representation": {
      "nom": "PDF",
      "typeMime": {
        "type": "application",
        "subType": "PDF"
      },
      "statutRepresentation": {
        "verbatim": "true",
        "canonique": "true",
        "officielle": "true",
        "transcription": "false",
        "enregistrement": "false"
      },
      "repSource": {
        "@xmlns:xsi": "http://www.w3.org/2001/XMLSchema-instance",
        "@xsi:nil": "true"
      },
      "offset": {
        "@xmlns:xsi": "http://www.w3.org/2001/XMLSchema-instance",
        "@xsi:nil": "true"
      },
      "contenu": {
        "documentURI": "/15/amendements/2243/AN/1997.pdf"
      },
      "dateDispoRepresentation": {
        "@xmlns:xsi": "http://www.w3.org/2001/XMLSchema-instance",
        "@xsi:nil": "true"
      }
    }
  },
  "seanceDiscussion": "RUANR5L15S2019IDS21828",
  "sort": {
    "dateSaisie": "2019-09-25T21:51:17.000+02:00",
    "sortEnSeance": "Rejeté"
  },
  "dateDepot": "2019-09-20T02:00:00.000+02:00",
  "dateDistribution": "2019-09-23T02:00:00.000+02:00",
  "article99": "0",
  "loiReference": {
    "codeLoi": {
      "@xmlns:xsi": "http://www.w3.org/2001/XMLSchema-instance",
      "@xsi:nil": "true"
    },
    "divisionCodeLoi": {
      "@xmlns:xsi": "http://www.w3.org/2001/XMLSchema-instance",
      "@xsi:nil": "true"
    }
  }
}