{
  "@xmlns": "http://schemas.assemblee-nationale.fr/referentiel",
  "uid": "AMANR5L15SEA717460BTC1761P0D1N67",
  "identifiant": {
    "legislature": "15",
    "numero": "67",
    "numRect": "0",
    "saisine": {
      "refTexteLegislatif": "PRJLANR5L15BTC1761",
      "numeroPartiePLF": "0",
      "organeExamen": "PO717460",
      "mentionSecondeDeliberation": "0"
    }
  },
  "numeroLong": "67",
  "etapeTexte": "Nouvelle Lecture",
  "triAmendement": "mfaaaaaaaaaaaaaaaaaaaaaaaaaaaaaaaaaaaaaaaaaaaaaaaaldhu",
  "cardinaliteAmdtMultiples": "1",
  "amendementParent": {
    "@xmlns:xsi": "http://www.w3.org/2001/XMLSchema-instance",
    "@xsi:nil": "true"
  },
  "etat": "Discuté",
  "signataires": {
    "auteur": {
      "typeAuteur": "Depute",
      "acteurRef": "PA330909",
      "organeRef": {
        "@xmlns:xsi": "http://www.w3.org/2001/XMLSchema-instance",
        "@xsi:nil": "true"
      },
      "groupePolitiqueRef": "PO730934"
    },
    "cosignataires": {
      "acteurRef": [
        "PA718838",
        "PA340853",
        "PA334149",
        "PA643103",
        "PA606712",
        "PA267260",
        "PA1874",
        "PA267204",
        "PA721046",
        "PA332523",
        "PA267735",
        "PA330909",
        "PA719318",
        "PA2377",
        "PA718884",
        "PA605036",
        "PA346218",
        "PA266793",
        "PA718780",
        "PA719272",
        "PA334654",
        "PA608016"
      ]
    },
    "texteAffichable": "M.&#160;Descoeur,  Mme&#160;Trastour-Isnart, M.&#160;Straumann, Mme&#160;Meunier, M.&#160;Sermier, M.&#160;Masson, M.&#160;Lurton, M.&#160;Leclerc, Mme&#160;Anthoine, Mme&#160;Bazin-Malgras, M.&#160;Bony, M.&#160;Abad, M.&#160;Brun, M.&#160;Ferrara, M.&#160;Perrut, M.&#160;Le Fur, Mme&#160;Bassire, Mme&#160;Poletti, Mme&#160;Louwagie, M.&#160;de Ganay, Mme&#160;Dalloz et M.&#160;Fasquelle"
  },
  "pointeurFragmentTexte": {
    "missionVisee": {
      "@xmlns:xsi": "http://www.w3.org/2001/XMLSchema-instance",
      "@xsi:nil": "true"
    },
    "division": {
      "titre": "Article 61 ter A",
      "articleDesignationCourte": "ART. 61 TER A",
      "type": "ARTICLE",
      "avant_A_Apres": "A",
      "divisionRattachee": "ARTICLE 61 TER A",
      "articleAdditionnel": {
        "@xmlns:xsi": "http://www.w3.org/2001/XMLSchema-instance",
        "@xsi:nil": "true"
      },
      "chapitreAdditionnel": {
        "@xmlns:xsi": "http://www.w3.org/2001/XMLSchema-instance",
        "@xsi:nil": "true"
      },
      "urlDivisionTexteVise": "/15/textes/1761.asp#D_Article_61_ter_A"
    },
    "alinea": {
      "avant_A_Apres": {
        "@xmlns:xsi": "http://www.w3.org/2001/XMLSchema-instance",
        "@xsi:nil": "true"
      },
      "numero": "3",
      "alineaDesignation": {
        "@xmlns:xsi": "http://www.w3.org/2001/XMLSchema-instance",
        "@xsi:nil": "true"
      }
    }
  },
  "corps": {
    "dispositif": "<p>I.&#160;&#8211;&#160;Compl&#233;ter l&#8217;alin&#233;a&#160;3 par les mots&#160;:</p><p style=\"text-align: justify;\">&#171;&#160;permettant l&#8217;impression et le t&#233;l&#233;chargement, sous r&#233;serve du respect des droits d&#8217;auteur des organismes de normalisation&#160;&#187;.</p><p style=\"text-align: justify;\">II.&#160;&#8211;&#160;En cons&#233;quence, &#224; l'alin&#233;a 8, substituer aux mots&#160;:</p><p style=\"text-align: justify;\">&#171;&#160;d&#8217;application obligatoire en application du&#160;&#187;</p><p style=\"text-align: justify;\">les mots&#160;:</p><p style=\"text-align: justify;\">&#171;&#160;accessibles gratuitement conform&#233;ment au&#160;&#187;.</p>",
    "exposeSommaire": "<p>Le principe est que les normes Afnor sont d&#8217;application volontaire. Toutefois, les normes peuvent &#234;tre rendues d&#8217;application obligatoire par arr&#234;t&#233; sign&#233; du ministre charg&#233; de l&#8217;&#233;conomie ou des finances et du ou des ministres int&#233;ress&#233;s.</p><p style=\"text-align: justify;\">L&#8217;article&#160;17 du d&#233;cret n&#176; 2009&#8209;697 du 16 juin 2009 relatif &#224; la normalisation pr&#233;cise que &#171;&#160;les normes rendues d&#8217;application obligatoire sont consultables gratuitement sur le site internet de l&#8217;Association fran&#231;aise de normalisation.&#160;&#187;</p><p style=\"text-align: justify;\">Cette consultation gratuite est une avanc&#233;e puisque pr&#233;c&#233;demment, les entreprises ne pouvaient acc&#233;der &#224; ces normes, pourtant obligatoires. Elles devaient payer pour pouvoir appliquer la r&#233;glementation, ce qui &#233;tait difficilement compr&#233;hensible. Toutefois, cela n&#8217;est pas suffisant.</p><p style=\"text-align: justify;\">Les textes l&#233;gislatifs et r&#233;glementaires qui s&#8217;imposent aux citoyens sont aujourd&#8217;hui consultables, t&#233;l&#233;chargeables et imprimables gratuitement, notamment sur le site L&#233;gifrance. Il semble en effet indispensable, si l&#8217;on souhaite que les diff&#233;rentes r&#233;glementations soient correctement appliqu&#233;es, que l&#8217;on puisse y acc&#233;der sans restriction.</p><p style=\"text-align: justify;\">A cet &#233;gard, les normes obligatoires Afnor font exception puisque bien qu&#8217;accessibles, il n&#8217;est pas possible de toutes les t&#233;l&#233;charger ou de les imprimer gratuitement.</p><p style=\"text-align: justify;\">Afin de clarifier cette situation et de favoriser une bonne application des r&#232;gles obligatoires, il est propos&#233; d&#8217;inscrire dans la loi que, sous r&#233;serve du respect des droits d&#8217;auteur des organismes de normalisation, les citoyens et les entreprises peuvent t&#233;l&#233;charger et imprimer gratuitement toutes les normes Afnor obligatoires.</p>",
    "annexeExposeSommaire": {
      "@xmlns:xsi": "http://www.w3.org/2001/XMLSchema-instance",
      "@xsi:nil": "true"
    },
    "cartoucheDelaiDepotDepasse": "Sous réserve de son traitement par les services de l'Assemblée nationale et de sa recevabilité"
  },
  "representations": {
    "representation": {
      "nom": "PDF",
      "typeMime": {
        "type": "application",
        "subType": "PDF"
      },
      "statutRepresentation": {
        "verbatim": "true",
        "canonique": "true",
        "officielle": "true",
        "transcription": "false",
        "enregistrement": "false"
      },
      "repSource": {
        "@xmlns:xsi": "http://www.w3.org/2001/XMLSchema-instance",
        "@xsi:nil": "true"
      },
      "offset": {
        "@xmlns:xsi": "http://www.w3.org/2001/XMLSchema-instance",
        "@xsi:nil": "true"
      },
      "contenu": {
        "documentURI": "/15/amendements/1761/AN/67.pdf"
      },
      "dateDispoRepresentation": {
        "@xmlns:xsi": "http://www.w3.org/2001/XMLSchema-instance",
        "@xsi:nil": "true"
      }
    }
  },
  "seanceDiscussion": "RUANR5L15S2019IDS21553",
  "sort": {
    "dateSaisie": "2019-03-16T03:54:37.000+01:00",
    "sortEnSeance": "Adopté"
  },
  "dateDepot": "2019-03-09T01:00:00.000+01:00",
  "dateDistribution": "2019-03-13T01:00:00.000+01:00",
  "article99": "0",
  "loiReference": {
    "codeLoi": {
      "@xmlns:xsi": "http://www.w3.org/2001/XMLSchema-instance",
      "@xsi:nil": "true"
    },
    "divisionCodeLoi": {
      "@xmlns:xsi": "http://www.w3.org/2001/XMLSchema-instance",
      "@xsi:nil": "true"
    }
  }
}