{
  "@xmlns": "http://schemas.assemblee-nationale.fr/referentiel",
  "uid": "AMANR5L15PO757134B1673P0D1N394",
  "identifiant": {
    "legislature": "15",
    "numero": "394",
    "numRect": "0",
    "saisine": {
      "refTexteLegislatif": "PRJLANR5L15B1673",
      "numeroPartiePLF": "0",
      "organeExamen": "PO757134",
      "mentionSecondeDeliberation": "0"
    }
  },
  "numeroLong": "394",
  "etapeTexte": "Nouvelle Lecture",
  "triAmendement": "ccaaaaaaaaaaaaaaaaaaaaaaaaaaaaaaaaaaaaaaaaaaaaaaaakm",
  "cardinaliteAmdtMultiples": "1",
  "amendementParent": {
    "@xmlns:xsi": "http://www.w3.org/2001/XMLSchema-instance",
    "@xsi:nil": "true"
  },
  "etat": "Discuté",
  "signataires": {
    "auteur": {
      "typeAuteur": "Depute",
      "acteurRef": "PA608016",
      "organeRef": {
        "@xmlns:xsi": "http://www.w3.org/2001/XMLSchema-instance",
        "@xsi:nil": "true"
      },
      "groupePolitiqueRef": "PO730934"
    },
    "cosignataires": {
      "acteurRef": [
        "PA346054",
        "PA721474",
        "PA2492",
        "PA267289",
        "PA720644",
        "PA266776",
        "PA720630",
        "PA642847",
        "PA721506",
        "PA720684",
        "PA334149",
        "PA608016"
      ]
    },
    "texteAffichable": "Mme&#160;Louwagie,  M.&#160;Quentin, M.&#160;Fasquelle, M.&#160;Bazin, M.&#160;Door, M.&#160;Viry, M.&#160;Minot, M.&#160;Emmanuel&#160;Maquet, M.&#160;Reiss, M.&#160;Nury, M.&#160;Pierre-Henri&#160;Dumont et Mme&#160;Kuster"
  },
  "pointeurFragmentTexte": {
    "missionVisee": {
      "@xmlns:xsi": "http://www.w3.org/2001/XMLSchema-instance",
      "@xsi:nil": "true"
    },
    "division": {
      "titre": "Article 16",
      "articleDesignationCourte": "ART. 16",
      "type": "ARTICLE",
      "avant_A_Apres": "A",
      "divisionRattachee": "ARTICLE 16",
      "articleAdditionnel": {
        "@xmlns:xsi": "http://www.w3.org/2001/XMLSchema-instance",
        "@xsi:nil": "true"
      },
      "chapitreAdditionnel": {
        "@xmlns:xsi": "http://www.w3.org/2001/XMLSchema-instance",
        "@xsi:nil": "true"
      },
      "urlDivisionTexteVise": "/15/textes/1673.asp#D_Article_16"
    },
    "alinea": {
      "avant_A_Apres": {
        "@xmlns:xsi": "http://www.w3.org/2001/XMLSchema-instance",
        "@xsi:nil": "true"
      },
      "numero": "1",
      "alineaDesignation": {
        "@xmlns:xsi": "http://www.w3.org/2001/XMLSchema-instance",
        "@xsi:nil": "true"
      }
    }
  },
  "corps": {
    "dispositif": "<p>&#192; l&#8217;alin&#233;a&#160;1, substituer aux mots&#160;:</p><p>&#171;&#160;vingt-quatre&#160;&#187;</p><p>le mot&#160;:</p><p>&#171;&#160;douze&#160;&#187;.</p>",
    "exposeSommaire": "<p style=\"text-align: justify;\">- Compte tenu des enjeux sensibles que rev&#234;t la simplification des proc&#233;dures en termes de co&#251;t, de comp&#233;titivit&#233;, rentabilit&#233; et d&#8217;efficacit&#233;&#160;;</p><p style=\"text-align: justify;\">- Compte tenu du temps incompressible li&#233; &#224; l&#8217;examen par les assembl&#233;es et la promulgation du texte, de la n&#233;cessaire ratification parlementaire des ordonnances &#224; venir et de l&#8217;urgence &#224; agir&#160;;</p><p style=\"text-align: justify;\">- Compte tenu de l&#8217;ensemble des rapports et &#233;tudes d&#233;j&#224; disponibles sur le sujet&#160;;</p><p style=\"text-align: justify;\">- Compte tenu des d&#233;lais plus courts pr&#233;vus dans d&#8217;autres articles du texte (article&#160;42)&#160;;</p><p style=\"text-align: justify;\">Il convient de presser le Gouvernement de faire en sorte que ses administrations proc&#232;dent aux r&#233;formes n&#233;cessaires dans un d&#233;lai de douze mois.</p>",
    "annexeExposeSommaire": {
      "@xmlns:xsi": "http://www.w3.org/2001/XMLSchema-instance",
      "@xsi:nil": "true"
    },
    "cartoucheDelaiDepotDepasse": {
      "@xmlns:xsi": "http://www.w3.org/2001/XMLSchema-instance",
      "@xsi:nil": "true"
    }
  },
  "representations": {
    "representation": {
      "nom": "PDF",
      "typeMime": {
        "type": "application",
        "subType": "PDF"
      },
      "statutRepresentation": {
        "verbatim": "true",
        "canonique": "true",
        "officielle": "true",
        "transcription": "false",
        "enregistrement": "false"
      },
      "repSource": {
        "@xmlns:xsi": "http://www.w3.org/2001/XMLSchema-instance",
        "@xsi:nil": "true"
      },
      "offset": {
        "@xmlns:xsi": "http://www.w3.org/2001/XMLSchema-instance",
        "@xsi:nil": "true"
      },
      "contenu": {
        "documentURI": "/15/amendements/1673/CSPACTE/394.pdf"
      },
      "dateDispoRepresentation": {
        "@xmlns:xsi": "http://www.w3.org/2001/XMLSchema-instance",
        "@xsi:nil": "true"
      }
    }
  },
  "seanceDiscussion": {
    "@xmlns:xsi": "http://www.w3.org/2001/XMLSchema-instance",
    "@xsi:nil": "true"
  },
  "sort": {
    "dateSaisie": "2019-03-06T22:19:54.000+01:00",
    "sortEnSeance": "Rejeté"
  },
  "dateDepot": "2019-02-28T01:00:00.000+01:00",
  "dateDistribution": "2019-03-06T01:00:00.000+01:00",
  "article99": "0",
  "loiReference": {
    "codeLoi": {
      "@xmlns:xsi": "http://www.w3.org/2001/XMLSchema-instance",
      "@xsi:nil": "true"
    },
    "divisionCodeLoi": {
      "@xmlns:xsi": "http://www.w3.org/2001/XMLSchema-instance",
      "@xsi:nil": "true"
    }
  }
}