{
  "@xmlns": "http://schemas.assemblee-nationale.fr/referentiel",
  "uid": "AMANR5L15SEA717460BTC2243P0D1N1259",
  "identifiant": {
    "legislature": "15",
    "numero": "1259",
    "numRect": "0",
    "saisine": {
      "refTexteLegislatif": "PRJLANR5L15BTC2243",
      "numeroPartiePLF": "0",
      "organeExamen": "PO717460",
      "mentionSecondeDeliberation": "0"
    }
  },
  "numeroLong": "1259",
  "etapeTexte": "1ère lecture (1ère assemblée saisie)",
  "triAmendement": "dsaaaaaaaaaaaaaaaaaaaaaaaaaaaaaaaaaaaaaaaaaaaaaaaaeelzzzzl",
  "cardinaliteAmdtMultiples": "1",
  "amendementParent": {
    "@xmlns:xsi": "http://www.w3.org/2001/XMLSchema-instance",
    "@xsi:nil": "true"
  },
  "etat": "Discuté",
  "signataires": {
    "auteur": {
      "typeAuteur": "Depute",
      "acteurRef": "PA642847",
      "organeRef": {
        "@xmlns:xsi": "http://www.w3.org/2001/XMLSchema-instance",
        "@xsi:nil": "true"
      },
      "groupePolitiqueRef": "PO730934"
    },
    "cosignataires": {
      "acteurRef": "PA642847"
    },
    "texteAffichable": "M.&#160;Bazin"
  },
  "pointeurFragmentTexte": {
    "missionVisee": {
      "@xmlns:xsi": "http://www.w3.org/2001/XMLSchema-instance",
      "@xsi:nil": "true"
    },
    "division": {
      "titre": "Article 14",
      "articleDesignationCourte": "ART. 14",
      "type": "ARTICLE",
      "avant_A_Apres": "A",
      "divisionRattachee": "ARTICLE 14",
      "articleAdditionnel": {
        "@xmlns:xsi": "http://www.w3.org/2001/XMLSchema-instance",
        "@xsi:nil": "true"
      },
      "chapitreAdditionnel": {
        "@xmlns:xsi": "http://www.w3.org/2001/XMLSchema-instance",
        "@xsi:nil": "true"
      },
      "urlDivisionTexteVise": "/15/textes/2243.asp#D_Article_14"
    },
    "alinea": {
      "avant_A_Apres": {
        "@xmlns:xsi": "http://www.w3.org/2001/XMLSchema-instance",
        "@xsi:nil": "true"
      },
      "numero": "2",
      "alineaDesignation": {
        "@xmlns:xsi": "http://www.w3.org/2001/XMLSchema-instance",
        "@xsi:nil": "true"
      }
    }
  },
  "corps": {
    "dispositif": "<p style=\"text-align: justify;\">Substituer &#224; l&#8217;alin&#233;a&#160;2 les deux alin&#233;as suivants&#160;:</p><p style=\"text-align: justify;\">&#171;&#160;<i>Art.&#160;L.&#160;2141&#8209;3&#8209;1</i>.&#160;&#8211;&#160;&#192; titre exceptionnel, des &#233;tudes sur les embryons humains visant notamment &#224; d&#233;velopper les soins au b&#233;n&#233;fice de l&#8217;embryon humain et &#224; am&#233;liorer les techniques d&#8217;assistance m&#233;dicale &#224; la procr&#233;ation ne portant pas atteinte &#224; l&#8217;embryon humain peuvent &#234;tre conduites avant et apr&#232;s leur transfert &#224; des fins de gestation si le couple y consent, dans les conditions fix&#233;es au IV de l&#8217;article L.&#160;2151&#8209;5 du code de la sant&#233; publique.&#160;&#187;</p><p style=\"text-align: justify;\">&#171;&#160;Ces recherches ne peuvent porter atteinte &#224; l&#8217;embryon humain, elles sont men&#233;es au b&#233;n&#233;fice de celui-ci.&#160;&#187;</p>",
    "exposeSommaire": "<p style=\"text-align: justify;\">Il convient de circonscrire les potentielles recherches sur l&#8217;embryon humain destin&#233; &#224; &#234;tre implant&#233;.</p><p style=\"text-align: justify;\">Il convient donc a minima de revenir &#224; l&#8217;encadrement de la loi de bio&#233;thique de 2011 qui prudemment n&#8217;autorisait que les &#233;tudes avec un encadrement ad&#233;quat.</p><p style=\"text-align: justify;\">Ce r&#233;gime de recherches biom&#233;dicales &#233;tait cens&#233; r&#233;habiliter le r&#233;gime d&#8217;&#233;tudes sur l&#8217;embryon qui avait &#233;t&#233; supprim&#233; par la loi du 6 ao&#251;t 2013. Mais le r&#233;gime d&#8217;&#233;tudes sur l&#8217;embryon &#224; l&#8217;&#233;poque avait deux r&#233;elles garanties&#160;: celle de ne pas porter atteinte &#224; l&#8217;embryon et celle d&#8217;&#234;tre men&#233;e &#224; son b&#233;n&#233;fice.</p><p style=\"text-align: justify;\">Le r&#233;gime de recherches biom&#233;dicales en AMP de 2013 ne pr&#233;voit pas de telles garanties, ce qui est incompr&#233;hensible d&#232;s lors qu&#8217;il oblige le transfert de l&#8217;embryon &#224; des fins de gestation. Ces garanties permettront de poser les limites pour &#233;viter que des embryons humains soient utilis&#233;s dans le cadre des essais de ces recherches.</p>",
    "annexeExposeSommaire": {
      "@xmlns:xsi": "http://www.w3.org/2001/XMLSchema-instance",
      "@xsi:nil": "true"
    },
    "cartoucheDelaiDepotDepasse": {
      "@xmlns:xsi": "http://www.w3.org/2001/XMLSchema-instance",
      "@xsi:nil": "true"
    },
    "avantAppel": {
      "@xmlns:xsi": "http://www.w3.org/2001/XMLSchema-instance",
      "@xsi:nil": "true"
    }
  },
  "representations": {
    "representation": {
      "nom": "PDF",
      "typeMime": {
        "type": "application",
        "subType": "PDF"
      },
      "statutRepresentation": {
        "verbatim": "true",
        "canonique": "true",
        "officielle": "true",
        "transcription": "false",
        "enregistrement": "false"
      },
      "repSource": {
        "@xmlns:xsi": "http://www.w3.org/2001/XMLSchema-instance",
        "@xsi:nil": "true"
      },
      "offset": {
        "@xmlns:xsi": "http://www.w3.org/2001/XMLSchema-instance",
        "@xsi:nil": "true"
      },
      "contenu": {
        "documentURI": "/15/amendements/2243/AN/1259.pdf"
      },
      "dateDispoRepresentation": {
        "@xmlns:xsi": "http://www.w3.org/2001/XMLSchema-instance",
        "@xsi:nil": "true"
      }
    }
  },
  "seanceDiscussion": "RUANR5L15S2020IDS21848",
  "sort": {
    "dateSaisie": "2019-10-04T17:14:11.000+02:00",
    "sortEnSeance": "Rejeté"
  },
  "dateDepot": "2019-09-19T02:00:00.000+02:00",
  "dateDistribution": "2019-10-01T02:00:00.000+02:00",
  "article99": "0",
  "loiReference": {
    "codeLoi": {
      "@xmlns:xsi": "http://www.w3.org/2001/XMLSchema-instance",
      "@xsi:nil": "true"
    },
    "divisionCodeLoi": {
      "@xmlns:xsi": "http://www.w3.org/2001/XMLSchema-instance",
      "@xsi:nil": "true"
    }
  }
}