{
  "@xmlns": "http://schemas.assemblee-nationale.fr/referentiel",
  "uid": "AMANR5L15SEA717460B0485P0D1N476",
  "identifiant": {
    "legislature": "15",
    "numero": "476",
    "numRect": "0",
    "saisine": {
      "refTexteLegislatif": "PRJLANR5L15B0485",
      "numeroPartiePLF": "0",
      "organeExamen": "PO717460",
      "mentionSecondeDeliberation": "0"
    }
  },
  "numeroLong": "476",
  "etapeTexte": "Nouvelle Lecture",
  "triAmendement": "cvdzzu",
  "cardinaliteAmdtMultiples": "1",
  "amendementParent": "AMANR5L15SEA717460B0485P0D1N376",
  "etat": "Discuté",
  "signataires": {
    "auteur": {
      "typeAuteur": "Gouvernement",
      "acteurRef": {
        "@xmlns:xsi": "http://www.w3.org/2001/XMLSchema-instance",
        "@xsi:nil": "true"
      },
      "organeRef": {
        "@xmlns:xsi": "http://www.w3.org/2001/XMLSchema-instance",
        "@xsi:nil": "true"
      },
      "groupePolitiqueRef": {
        "@xmlns:xsi": "http://www.w3.org/2001/XMLSchema-instance",
        "@xsi:nil": "true"
      }
    },
    "cosignataires": {
      "@xmlns:xsi": "http://www.w3.org/2001/XMLSchema-instance",
      "@xsi:nil": "true"
    },
    "texteAffichable": "le Gouvernement"
  },
  "pointeurFragmentTexte": {
    "missionVisee": {
      "@xmlns:xsi": "http://www.w3.org/2001/XMLSchema-instance",
      "@xsi:nil": "true"
    },
    "division": {
      "titre": "Article 12",
      "articleDesignationCourte": "ART. 12",
      "type": "ARTICLE",
      "avant_A_Apres": "A",
      "divisionRattachee": "ARTICLE 12",
      "articleAdditionnel": {
        "@xmlns:xsi": "http://www.w3.org/2001/XMLSchema-instance",
        "@xsi:nil": "true"
      },
      "chapitreAdditionnel": {
        "@xmlns:xsi": "http://www.w3.org/2001/XMLSchema-instance",
        "@xsi:nil": "true"
      },
      "urlDivisionTexteVise": "/15/textes/0485.asp#D_Article_12"
    },
    "alinea": {
      "@xmlns:xsi": "http://www.w3.org/2001/XMLSchema-instance",
      "@xsi:nil": "true"
    }
  },
  "corps": {
    "dispositif": "<p style=\"text-align: justify;\">Apr&#232;s l&#8217;alin&#233;a&#160;49, ins&#233;rer l&#8217;alin&#233;a suivant&#160;:</p><p style=\"text-align: justify;\">&#171;&#160;Art.&#160;972 <i>ter</i>.&#160;&#8211;&#160;Pour l&#8217;application de l&#8217;article&#160;965 et sous les m&#234;mes conditions, ne sont pas retenues pour la d&#233;termination de l&#8217;assiette de l&#8217;imp&#244;t les actions de soci&#233;t&#233;s d&#8217;investissements immobiliers mentionn&#233;es au I de l&#8217;article&#160;208 C, lorsque le redevable d&#233;tient, directement et, le cas &#233;ch&#233;ant, indirectement, seul ou conjointement avec les personnes mentionn&#233;es au 1&#176; de l&#8217;article&#160;965, moins de 5&#160;% du capital et des droits de vote de la soci&#233;t&#233;.&#160;&#187;</p>",
    "exposeSommaire": "<p style=\"text-align: justify;\">Le pr&#233;sent sous-amendement propose d&#8217;instaurer une exon&#233;ration sp&#233;cifique en faveur des petits porteurs investissant dans une soci&#233;t&#233; d&#8217;investissements immobiliers cot&#233;e (SIIC).</p><p style=\"text-align: justify;\">L&#8217;actionnariat des SIIC est &#224; la fois tr&#232;s dispers&#233; et, pour une part significative, constitu&#233; d&#8217;actionnaires non-r&#233;sidents. L&#8217;inclusion des parts de SIIC dans l&#8217;assiette de l&#8217;imp&#244;t sur la fortune immobili&#232;re (IFI) pourrait d&#233;tourner des investisseurs, notamment des investisseurs non-r&#233;sidents, de l&#8217;investissement dans les SIIC.</p><p style=\"text-align: justify;\">La volont&#233; de limiter la charge administrative des SIIC et, surtout, de ne pas perturber le fonctionnement des march&#233;s financiers fran&#231;ais, compte tenu notamment de la place tenue par ces entit&#233;s dans l&#8217;&#233;quilibre du syst&#232;me financier, justifie de fixer un seuil de d&#233;tention (5&#160;%) en de&#231;&#224; duquel les parts de SIIC sont exclues de l&#8217;assiette de l&#8217;IFI.</p>",
    "annexeExposeSommaire": {
      "@xmlns:xsi": "http://www.w3.org/2001/XMLSchema-instance",
      "@xsi:nil": "true"
    }
  },
  "representations": {
    "representation": {
      "nom": "PDF",
      "typeMime": {
        "type": "application",
        "subType": "PDF"
      },
      "statutRepresentation": {
        "verbatim": "true",
        "canonique": "true",
        "officielle": "true",
        "transcription": "false",
        "enregistrement": "false"
      },
      "repSource": {
        "@xmlns:xsi": "http://www.w3.org/2001/XMLSchema-instance",
        "@xsi:nil": "true"
      },
      "offset": {
        "@xmlns:xsi": "http://www.w3.org/2001/XMLSchema-instance",
        "@xsi:nil": "true"
      },
      "contenu": {
        "documentURI": "/15/amendements/0485/AN/476.pdf"
      },
      "dateDispoRepresentation": {
        "@xmlns:xsi": "http://www.w3.org/2001/XMLSchema-instance",
        "@xsi:nil": "true"
      }
    }
  },
  "seanceDiscussion": "RUANR5L15S2018IDS20841",
  "sort": {
    "dateSaisie": "2017-12-15T17:22:16.000+01:00",
    "sortEnSeance": "Adopté"
  },
  "dateDepot": "2017-12-14T01:00:00.000+01:00",
  "dateDistribution": "2017-12-15T01:00:00.000+01:00",
  "article99": "0",
  "loiReference": {
    "codeLoi": {
      "@xmlns:xsi": "http://www.w3.org/2001/XMLSchema-instance",
      "@xsi:nil": "true"
    },
    "divisionCodeLoi": {
      "@xmlns:xsi": "http://www.w3.org/2001/XMLSchema-instance",
      "@xsi:nil": "true"
    }
  }
}