{
  "@xmlns": "http://schemas.assemblee-nationale.fr/referentiel",
  "uid": "AMANR5L15PO419865B1402P0D1N165",
  "identifiant": {
    "legislature": "15",
    "numero": "165",
    "numRect": "0",
    "saisine": {
      "refTexteLegislatif": "PRJLANR5L15B1402",
      "numeroPartiePLF": "0",
      "organeExamen": "PO419865",
      "mentionSecondeDeliberation": "0"
    }
  },
  "numeroLong": "CD165",
  "etapeTexte": "1ère lecture (1ère assemblée saisie)",
  "triAmendement": "aiaaaaaaaaaaaaaaaaaaaaaaaaaaaaaaaaaaaaaaaaaaaaaaaafayini",
  "cardinaliteAmdtMultiples": "1",
  "amendementParent": {
    "@xmlns:xsi": "http://www.w3.org/2001/XMLSchema-instance",
    "@xsi:nil": "true"
  },
  "etat": "Discuté",
  "signataires": {
    "auteur": {
      "typeAuteur": "Depute",
      "acteurRef": "PA720764",
      "organeRef": {
        "@xmlns:xsi": "http://www.w3.org/2001/XMLSchema-instance",
        "@xsi:nil": "true"
      },
      "groupePolitiqueRef": "PO730970"
    },
    "cosignataires": {
      "acteurRef": [
        "PA721992",
        "PA720334",
        "PA719918",
        "PA721530",
        "PA721976",
        "PA720764",
        "PA720652"
      ]
    },
    "texteAffichable": "Mme&#160;Lasserre-David,  M.&#160;Millienne, M.&#160;Lain&#233;, M.&#160;Duverg&#233;, Mme&#160;Gallerneau, M.&#160;Pahun et Mme&#160;Luquet"
  },
  "pointeurFragmentTexte": {
    "missionVisee": {
      "@xmlns:xsi": "http://www.w3.org/2001/XMLSchema-instance",
      "@xsi:nil": "true"
    },
    "division": {
      "titre": "Article PREMIER",
      "articleDesignationCourte": "ART. PREMIER",
      "type": "ARTICLE",
      "avant_A_Apres": "A",
      "divisionRattachee": "ARTICLE PREMIER",
      "articleAdditionnel": {
        "@xmlns:xsi": "http://www.w3.org/2001/XMLSchema-instance",
        "@xsi:nil": "true"
      },
      "chapitreAdditionnel": {
        "@xmlns:xsi": "http://www.w3.org/2001/XMLSchema-instance",
        "@xsi:nil": "true"
      },
      "urlDivisionTexteVise": "/15/textes/1402.asp#D_Article_1er"
    },
    "alinea": {
      "avant_A_Apres": "Apres",
      "numero": "13",
      "alineaDesignation": {
        "@xmlns:xsi": "http://www.w3.org/2001/XMLSchema-instance",
        "@xsi:nil": "true"
      }
    }
  },
  "corps": {
    "dispositif": "<p style=\"text-align: justify;\">Apr&#232;s l&#8217;alin&#233;a&#160;13, sont ins&#233;r&#233;s deux alin&#233;as ainsi r&#233;dig&#233;s&#160;:</p><p style=\"text-align: justify;\">&#171;&#160;Son intervention porte sur l&#8217;ensemble des milieux terrestres, aquatiques et marins du territoire m&#233;tropolitain, des collectivit&#233;s r&#233;gies par l&#8217;article&#160;73 de la Constitution, des collectivit&#233;s de Saint-Martin et de Saint-Pierre-et-Miquelon, ainsi que des Terres australes et antarctiques fran&#231;aises, y compris dans les eaux plac&#233;es sous la souverainet&#233; ou la juridiction de l&#8217;&#201;tat, ainsi que sur les espaces appartenant au domaine public maritime ou au plateau continental.</p><p style=\"text-align: justify;\">Elle peut aussi mener des actions &#224; Saint-Barth&#233;lemy, dans les &#238;les Wallis et Futuna, en Polyn&#233;sie fran&#231;aise, en Nouvelle-Cal&#233;donie et dans ses provinces, &#224; la demande de ces collectivit&#233;s. Le choix, l&#8217;organisation et la mise en &#339;uvre de ces actions sont pr&#233;vus par convention entre les parties.&#160;&#187;</p>",
    "exposeSommaire": "<p style=\"text-align: justify;\">Il convient d&#8217;expliciter que le futur op&#233;rateur exercera ses missions dans les milieux terrestres, marins et aquatiques du territoire national et des collectivit&#233;s et territoires d&#8217;Outre-mer.</p>",
    "annexeExposeSommaire": {
      "@xmlns:xsi": "http://www.w3.org/2001/XMLSchema-instance",
      "@xsi:nil": "true"
    },
    "cartoucheDelaiDepotDepasse": {
      "@xmlns:xsi": "http://www.w3.org/2001/XMLSchema-instance",
      "@xsi:nil": "true"
    }
  },
  "representations": {
    "representation": {
      "nom": "PDF",
      "typeMime": {
        "type": "application",
        "subType": "PDF"
      },
      "statutRepresentation": {
        "verbatim": "true",
        "canonique": "true",
        "officielle": "true",
        "transcription": "false",
        "enregistrement": "false"
      },
      "repSource": {
        "@xmlns:xsi": "http://www.w3.org/2001/XMLSchema-instance",
        "@xsi:nil": "true"
      },
      "offset": {
        "@xmlns:xsi": "http://www.w3.org/2001/XMLSchema-instance",
        "@xsi:nil": "true"
      },
      "contenu": {
        "documentURI": "/15/amendements/1402/CION-DVP/CD165.pdf"
      },
      "dateDispoRepresentation": {
        "@xmlns:xsi": "http://www.w3.org/2001/XMLSchema-instance",
        "@xsi:nil": "true"
      }
    }
  },
  "seanceDiscussion": {
    "@xmlns:xsi": "http://www.w3.org/2001/XMLSchema-instance",
    "@xsi:nil": "true"
  },
  "sort": {
    "dateSaisie": "2018-12-05T00:26:48.000+01:00",
    "sortEnSeance": "Retiré"
  },
  "dateDepot": "2018-11-30T01:00:00.000+01:00",
  "dateDistribution": "2018-12-04T01:00:00.000+01:00",
  "article99": "0",
  "loiReference": {
    "codeLoi": {
      "@xmlns:xsi": "http://www.w3.org/2001/XMLSchema-instance",
      "@xsi:nil": "true"
    },
    "divisionCodeLoi": {
      "@xmlns:xsi": "http://www.w3.org/2001/XMLSchema-instance",
      "@xsi:nil": "true"
    }
  }
}