{
  "@xmlns": "http://schemas.assemblee-nationale.fr/referentiel",
  "uid": "AMANR5L15SEA717460BTC0592P0D1N68",
  "identifiant": {
    "legislature": "15",
    "numero": "68",
    "numRect": "0",
    "saisine": {
      "refTexteLegislatif": "PRJLANR5L15BTC0592",
      "numeroPartiePLF": "0",
      "organeExamen": "PO717460",
      "mentionSecondeDeliberation": "0"
    }
  },
  "numeroLong": "68",
  "etapeTexte": "1ère lecture (1ère assemblée saisie)",
  "triAmendement": "ab",
  "cardinaliteAmdtMultiples": "1",
  "amendementParent": {
    "@xmlns:xsi": "http://www.w3.org/2001/XMLSchema-instance",
    "@xsi:nil": "true"
  },
  "etat": "Discuté",
  "signataires": {
    "auteur": {
      "typeAuteur": "Depute",
      "acteurRef": "PA720430",
      "organeRef": {
        "@xmlns:xsi": "http://www.w3.org/2001/XMLSchema-instance",
        "@xsi:nil": "true"
      },
      "groupePolitiqueRef": "PO730958"
    },
    "cosignataires": {
      "acteurRef": [
        "PA721210",
        "PA721960",
        "PA722142",
        "PA720846",
        "PA721226",
        "PA2150",
        "PA718868",
        "PA721202",
        "PA720422",
        "PA720286",
        "PA719578",
        "PA721062",
        "PA720892",
        "PA720430",
        "PA588884",
        "PA719676",
        "PA718860"
      ]
    },
    "texteAffichable": "M.&#160;Bernalicis,  Mme&#160;Autain, M.&#160;Coquerel, M.&#160;Corbi&#232;re, Mme&#160;Fiat, M.&#160;Lachaud, M.&#160;Larive, M.&#160;M&#233;lenchon, Mme&#160;Obono, Mme&#160;Panot, M.&#160;Prud&apos;homme, M.&#160;Quatennens, M.&#160;Ratenon, Mme&#160;Ressiguier, Mme&#160;Rubin, M.&#160;Ruffin et Mme&#160;Taurine"
  },
  "pointeurFragmentTexte": {
    "missionVisee": {
      "@xmlns:xsi": "http://www.w3.org/2001/XMLSchema-instance",
      "@xsi:nil": "true"
    },
    "division": {
      "titre": "Article 13",
      "articleDesignationCourte": "ART. 13",
      "type": "ARTICLE",
      "avant_A_Apres": "A",
      "divisionRattachee": "ARTICLE 13",
      "articleAdditionnel": {
        "@xmlns:xsi": "http://www.w3.org/2001/XMLSchema-instance",
        "@xsi:nil": "true"
      },
      "chapitreAdditionnel": {
        "@xmlns:xsi": "http://www.w3.org/2001/XMLSchema-instance",
        "@xsi:nil": "true"
      },
      "urlDivisionTexteVise": "/15/textes/0592.asp#D_Article_13"
    },
    "alinea": {
      "@xmlns:xsi": "http://www.w3.org/2001/XMLSchema-instance",
      "@xsi:nil": "true"
    }
  },
  "corps": {
    "dispositif": "<p style=\"text-align: justify;\">Supprimer cet article.</p>",
    "exposeSommaire": "<p style=\"text-align: justify;\">Cet article remplace les autorisations d&#233;livr&#233;es par la CNIL pour le traitement des donn&#233;es de sant&#233; par une s&#233;rie de r&#232;glements types que les acteurs &#8220;doivent&#8221; respecter (si jamais contr&#244;le il y a&#8230; sachant que le contr&#244;le de la CNIL ne s&#8217;effectuera plus qu&#8217;&#224; posteriori).</p><p style=\"text-align: justify;\">Malgr&#233; les exceptions que cr&#233;e l&#8217;article, il s&#8217;agit bien l&#224; d&#8217;une mesure de lib&#233;ralisation. La CNIL est affaiblie dans ses pr&#233;rogatives et au regard de la faiblesse actuelle de ses moyens, rien ne garantit que le respect de ces r&#232;glement pourra &#234;tre soumis &#224; son contr&#244;le. Les donn&#233;es de sant&#233; sont une manne financi&#232;re et doivent &#234;tre r&#233;gul&#233;es dans leurs usages sous peine d&#8217;&#233;chapper &#224; leur unique objectif de bien commun. C&#8217;est pourquoi nous demandons la suppression de cet article.</p>",
    "annexeExposeSommaire": {
      "@xmlns:xsi": "http://www.w3.org/2001/XMLSchema-instance",
      "@xsi:nil": "true"
    }
  },
  "representations": {
    "representation": {
      "nom": "PDF",
      "typeMime": {
        "type": "application",
        "subType": "PDF"
      },
      "statutRepresentation": {
        "verbatim": "true",
        "canonique": "true",
        "officielle": "true",
        "transcription": "false",
        "enregistrement": "false"
      },
      "repSource": {
        "@xmlns:xsi": "http://www.w3.org/2001/XMLSchema-instance",
        "@xsi:nil": "true"
      },
      "offset": {
        "@xmlns:xsi": "http://www.w3.org/2001/XMLSchema-instance",
        "@xsi:nil": "true"
      },
      "contenu": {
        "documentURI": "/15/amendements/0592/AN/68.pdf"
      },
      "dateDispoRepresentation": {
        "@xmlns:xsi": "http://www.w3.org/2001/XMLSchema-instance",
        "@xsi:nil": "true"
      }
    }
  },
  "seanceDiscussion": "RUANR5L15S2018IDS20899",
  "sort": {
    "dateSaisie": "2018-02-07T19:41:53.000+01:00",
    "sortEnSeance": "Rejeté"
  },
  "dateDepot": "2018-02-02T01:00:00.000+01:00",
  "dateDistribution": "2018-02-05T01:00:00.000+01:00",
  "article99": "0",
  "loiReference": {
    "codeLoi": {
      "@xmlns:xsi": "http://www.w3.org/2001/XMLSchema-instance",
      "@xsi:nil": "true"
    },
    "divisionCodeLoi": {
      "@xmlns:xsi": "http://www.w3.org/2001/XMLSchema-instance",
      "@xsi:nil": "true"
    }
  }
}