{
  "@xmlns": "http://schemas.assemblee-nationale.fr/referentiel",
  "uid": "AMANR5L15SEA717460B0911P0D1N2440",
  "identifiant": {
    "legislature": "15",
    "numero": "2440",
    "numRect": "0",
    "saisine": {
      "refTexteLegislatif": "PRJLANR5L15B0911",
      "numeroPartiePLF": "0",
      "organeExamen": "PO717460",
      "mentionSecondeDeliberation": "0"
    }
  },
  "numeroLong": "2440",
  "etapeTexte": "1ère lecture (1ère assemblée saisie)",
  "triAmendement": "aabttthyt",
  "cardinaliteAmdtMultiples": "1",
  "amendementParent": {
    "@xmlns:xsi": "http://www.w3.org/2001/XMLSchema-instance",
    "@xsi:nil": "true"
  },
  "etat": "Retiré",
  "signataires": {
    "auteur": {
      "typeAuteur": "Depute",
      "acteurRef": "PA330684",
      "organeRef": {
        "@xmlns:xsi": "http://www.w3.org/2001/XMLSchema-instance",
        "@xsi:nil": "true"
      },
      "groupePolitiqueRef": "PO730934"
    },
    "cosignataires": {
      "acteurRef": "PA330684"
    },
    "texteAffichable": "Mme&#160;Val&#233;rie&#160;Boyer"
  },
  "pointeurFragmentTexte": {
    "missionVisee": {
      "@xmlns:xsi": "http://www.w3.org/2001/XMLSchema-instance",
      "@xsi:nil": "true"
    },
    "division": {
      "titre": "Article 2",
      "articleDesignationCourte": "APRÈS ART. 2",
      "type": "ARTICLE",
      "avant_A_Apres": "Après",
      "divisionRattachee": "APRÈS L'ARTICLE 2, insérer l'article suivant:",
      "articleAdditionnel": "1",
      "chapitreAdditionnel": {
        "@xmlns:xsi": "http://www.w3.org/2001/XMLSchema-instance",
        "@xsi:nil": "true"
      },
      "urlDivisionTexteVise": "/15/textes/0911.asp#D_Article_2"
    },
    "alinea": {
      "@xmlns:xsi": "http://www.w3.org/2001/XMLSchema-instance",
      "@xsi:nil": "true"
    }
  },
  "corps": {
    "dispositif": "<p style=\"text-align: justify;\">Au quatri&#232;me alin&#233;a de l&#8217;article&#160;34 de la Constitution, apr&#232;s le mot&#160;: &#171;&#160;applicables&#160;;&#160;&#187;, sont ins&#233;r&#233;s les mots&#160;: &#171;&#160;les r&#233;gimes de pr&#233;somption&#160;;&#160;&#187;.</p>",
    "exposeSommaire": "<p style=\"text-align: justify;\">Plusieurs affaires de &#171;&#160;viols&#160;&#187; sur des mineures ont particuli&#232;rement &#233;mu les Fran&#231;ais en 2017.</p><p style=\"text-align: justify;\">Dans une des affaires, la victime &#226;g&#233;e de seulement 11 ans est tomb&#233;e enceinte apr&#232;s un rapport sexuel avec un homme de 22 ans qu&#8217;elle ne connaissait pas. Poursuivi pour viol sur mineure de moins de 15 ans, l&#8217;accus&#233; a pourtant &#233;t&#233; acquitt&#233; mardi 7 novembre 2017 par les jur&#233;s de la cour d&#8217;assises de Seine-et- Marne.</p><p style=\"text-align: justify;\">En effet, dans les motivations du jugement, la cour explique qu&#8217;aucun des &#233;l&#233;ments constitutifs du viol, &#224; savoir &#171;&#160;la menace, la violence, la contrainte ou la surprise&#160;&#187;, n&#8217;est &#233;tabli et qu&#8217;un doute existe quant &#224; savoir si l&#8217;accus&#233; avait conscience de contraindre celle avec qui il a eu une relation sexuelle.</p><p style=\"text-align: justify;\">Le parquet g&#233;n&#233;ral de la cour d&#8217;appel de Paris qui a fait appel de ce verdict a consid&#233;r&#233; &#224; juste titre que &#171;&#160;jusqu&#8217;&#224; 15 ans, un enfant doit &#234;tre pr&#233;serv&#233;&#160;&#187; et qu&#8217; &#171;&#160;on ne peut pas obtenir de lui des relations sexuelles car son consentement n&#8217;est pas &#233;clair&#233;&#160;&#187;.</p><p style=\"text-align: justify;\">La majorit&#233; sexuelle &#233;tant fix&#233;e &#224; quinze ans, la contrainte doit &#234;tre pr&#233;sum&#233;e pour les mineurs de moins de quinze ans. C&#8217;est pourquoi nous devons envisager une pr&#233;somption irr&#233;fragable de non consentement.</p><p style=\"text-align: justify;\">Entre 15 et 18 ans, nous pouvons consid&#233;rer qu&#8217;un mineur peut &#234;tre en mesure d&#8217;entretenir volontairement une relation sexuelle avec un majeur mais nous nous devons de mettre une limite.</p><p style=\"text-align: justify;\">Il conviendrait donc d&#8217;envisager &#233;galement une pr&#233;somption irr&#233;fragable de non consentement pour les mineurs de plus de quinze ans lorsque l&#8217;adulte est une personne ayant sur eux une autorit&#233; de droit ou de fait.</p><p style=\"text-align: justify;\">Malheureusement &#224; l&#8217;occasion de l&#8217;examen du projet de loi renfor&#231;ant la lutte contre les violences sexuelles et sexistes commises le Gouvernement a effectu&#233; un r&#233;trop&#233;dalage sur cette question &#171;&#160;pour motif d&#8217;inconstitutionnalit&#233;&#160;&#187;.</p><p style=\"text-align: justify;\">C&#8217;est pourquoi il appartiendra au l&#233;gislateur, sous le contr&#244;le du Conseil constitutionnel, de veiller &#224; ce que ces pr&#233;somptions, comme c&#8217;est d&#8217;ailleurs le cas aujourd&#8217;hui, soient pr&#233;vues au cas par cas et demeurent exceptionnelles, sans porter d&#8217;atteinte excessive au principe de la pr&#233;somption d&#8217;innocence consacr&#233; par l&#8217;article&#160;9 de la D&#233;claration des droits de l&#8217;Homme et du Citoyen.</p><p style=\"text-align: justify;\">Le pr&#233;sent amendement vise &#224; modifier le quatri&#232;me alin&#233;a de la Constitution de 1958.</p><p style=\"text-align: justify;\">Nous nous devons prot&#233;ger ces victimes mineures, qui sont consid&#233;r&#233;es, comme du gibier.</p>",
    "annexeExposeSommaire": {
      "@xmlns:xsi": "http://www.w3.org/2001/XMLSchema-instance",
      "@xsi:nil": "true"
    }
  },
  "representations": {
    "representation": {
      "nom": "PDF",
      "typeMime": {
        "type": "application",
        "subType": "PDF"
      },
      "statutRepresentation": {
        "verbatim": "true",
        "canonique": "true",
        "officielle": "true",
        "transcription": "false",
        "enregistrement": "false"
      },
      "repSource": {
        "@xmlns:xsi": "http://www.w3.org/2001/XMLSchema-instance",
        "@xsi:nil": "true"
      },
      "offset": {
        "@xmlns:xsi": "http://www.w3.org/2001/XMLSchema-instance",
        "@xsi:nil": "true"
      },
      "contenu": {
        "documentURI": "/15/amendements/0911/AN/2440.pdf"
      },
      "dateDispoRepresentation": {
        "@xmlns:xsi": "http://www.w3.org/2001/XMLSchema-instance",
        "@xsi:nil": "true"
      }
    }
  },
  "seanceDiscussion": {
    "@xmlns:xsi": "http://www.w3.org/2001/XMLSchema-instance",
    "@xsi:nil": "true"
  },
  "sort": {
    "@xmlns:xsi": "http://www.w3.org/2001/XMLSchema-instance",
    "@xsi:nil": "true"
  },
  "dateDepot": "2018-07-06T02:00:00.000+02:00",
  "dateDistribution": "2018-07-10T02:00:00.000+02:00",
  "article99": "0",
  "loiReference": {
    "codeLoi": "Constitution",
    "divisionCodeLoi": "34"
  }
}