{
  "@xmlns": "http://schemas.assemblee-nationale.fr/referentiel",
  "uid": "AMANR5L15PO59048B1255P2D1N1125",
  "identifiant": {
    "legislature": "15",
    "numero": "1125",
    "numRect": "0",
    "saisine": {
      "refTexteLegislatif": "PRJLANR5L15B1255",
      "numeroPartiePLF": "2",
      "organeExamen": "PO59048",
      "mentionSecondeDeliberation": "0"
    }
  },
  "numeroLong": "II-CF1125",
  "etapeTexte": "1ère lecture (1ère assemblée saisie)",
  "triAmendement": "iuaaaaaaaaaaaaaaaaaaaaaaaaaaaaaaaaaaaaaaaaaaaaaaaaki",
  "cardinaliteAmdtMultiples": "1",
  "amendementParent": {
    "@xmlns:xsi": "http://www.w3.org/2001/XMLSchema-instance",
    "@xsi:nil": "true"
  },
  "etat": "Discuté",
  "signataires": {
    "auteur": {
      "typeAuteur": "Depute",
      "acteurRef": "PA1874",
      "organeRef": {
        "@xmlns:xsi": "http://www.w3.org/2001/XMLSchema-instance",
        "@xsi:nil": "true"
      },
      "groupePolitiqueRef": "PO730934"
    },
    "cosignataires": {
      "acteurRef": "PA1874"
    },
    "texteAffichable": "M.&#160;Le Fur"
  },
  "pointeurFragmentTexte": {
    "missionVisee": {
      "@xmlns:xsi": "http://www.w3.org/2001/XMLSchema-instance",
      "@xsi:nil": "true"
    },
    "division": {
      "titre": "Article 51",
      "articleDesignationCourte": "APRÈS ART. 51",
      "type": "ARTICLE",
      "avant_A_Apres": "Après",
      "divisionRattachee": "APRÈS L'ARTICLE 51, insérer l'article suivant:",
      "articleAdditionnel": "1",
      "chapitreAdditionnel": {
        "@xmlns:xsi": "http://www.w3.org/2001/XMLSchema-instance",
        "@xsi:nil": "true"
      },
      "urlDivisionTexteVise": "/15/textes/1255C.asp#D_Article_51"
    },
    "alinea": {
      "@xmlns:xsi": "http://www.w3.org/2001/XMLSchema-instance",
      "@xsi:nil": "true"
    }
  },
  "corps": {
    "dispositif": "<p style=\"text-align: justify;\">I.&#160;&#8211;&#160;Le code g&#233;n&#233;ral des imp&#244;ts est ainsi modifi&#233;&#160;:</p><p style=\"text-align: justify;\">1&#176;&#160;L&#8217;article&#160;777 est compl&#233;t&#233; par un alin&#233;a ainsi r&#233;dig&#233;&#160;:</p><p style=\"text-align: justify;\">&#171;&#160;Les limites des tranches des tarifs pr&#233;vus aux tableaux du pr&#233;sent article sont actualis&#233;es au 1<sup>er</sup>&#160;janvier de chaque ann&#233;e dans la m&#234;me proportion que la limite sup&#233;rieure de la premi&#232;re tranche du bar&#232;me de l&#8217;imp&#244;t sur le revenu et arrondies &#224; l&#8217;euro le plus proche.&#160;&#187;&#160;;</p><p style=\"text-align: justify;\">2&#176;&#160;L&#8217;article&#160;779 est ainsi modifi&#233;&#160;:</p><p style=\"text-align: justify;\"><i>a</i>)&#160;Au premier alin&#233;a du I, le montant&#160;:&#171;&#160;100 000&#160;&#8364;&#160;&#187; est remplac&#233; par le montant&#160;: &#171;&#160;160 000&#160;&#8364;&#160;&#187;&#160;;</p><p style=\"text-align: justify;\"><i>b</i>)&#160;Le&#160;VI est ainsi r&#233;tabli&#160;:</p><p style=\"text-align: justify;\">&#171;&#160;VI.&#160;&#8211;&#160;Le montant des abattements du pr&#233;sent article est actualis&#233; au 1<sup>er</sup>&#160;janvier de chaque ann&#233;e dans la m&#234;me proportion que la limite sup&#233;rieure de la premi&#232;re tranche de l&#8217;imp&#244;t sur le revenu et arrondi &#224; l&#8217;euro le plus proche.&#160;&#187;&#160;;</p><p style=\"text-align: justify;\">3&#176;&#160;Au deuxi&#232;me alin&#233;a de l&#8217;article&#160;784, le mot&#160;: &#171;&#160;quinze est remplac&#233; par le mot&#160;: &#171;&#160;dix&#160;&#187;&#160;;</p><p style=\"text-align: justify;\">4&#176;&#160;Au premier alin&#233;a du I de l&#8217;article&#160;790 G, le mot&#160;: &#171;&#160;quinze&#160;&#187; est remplac&#233; par le mot&#160;: &#171;&#160;dix&#160;&#187;.</p><p style=\"text-align: justify;\">II.&#160;&#8211;&#160;La disposition du I est applicable &#224; compter du 1<sup>er</sup> janvier 2020.&#160;</p><p style=\"text-align: justify;\">III.&#160;&#8211;&#160;La perte de recettes pour l&#8217;&#201;tat est compens&#233;e &#224; due concurrence par la cr&#233;ation d&#8217;une taxe additionnelle aux droits vis&#233;s aux articles&#160;575 et&#160;575&#160;A du code g&#233;n&#233;ral des imp&#244;ts.</p>",
    "exposeSommaire": "<p style=\"text-align: justify;\">Le pr&#233;sent amendement vise &#224; revenir au dispositif abrog&#233; par la loi n&#176;&#160;2012&#8209;958 de finances rectificative du 16 ao&#251;t 2012.</p><p style=\"text-align: justify;\">Il vise ainsi &#224; revenir aux dispositions relatives aux droits de succession facilitant les transmissions contenue dans la loi n&#176; 2007&#8209;1223 du 21 ao&#251;t 2007, dite Loi TEPA.</p><p style=\"text-align: justify;\">Le 1&#176; modifie l&#8217;article&#160;779 du code g&#233;n&#233;ral des imp&#244;t et propose de porter l&#8217;abattement fiscal pour les donations ou succession en ligne directe entre parent et enfant de 100 000&#160;&#8364; &#224; 160&#160;000&#160;&#8364;.</p><p style=\"text-align: justify;\">Le 2&#176; &#8217;alin&#233;a II pr&#233;voit pour sa part que cet abattement sera applicable tous les 10 ans, au lieu des 15 ans pr&#233;vus par l&#8217;article&#160;784 du code g&#233;n&#233;ral des imp&#244;ts modifi&#233; par la loi n&#176; 2012&#8209;958 de finances rectificative du 16 ao&#251;t 2012, afin de permettre la transmission dans un laps de temps plus r&#233;duit en franchise de droit, &#224; un m&#234;me b&#233;n&#233;ficiaire.</p><p style=\"text-align: justify;\">Le 3&#176; pr&#233;voit en outre de porter de 15 ans &#224; 10 ans la possibilit&#233; de donations pr&#233;vues &#224; l&#8217;article&#160;790 du code g&#233;n&#233;ral des imp&#244;ts.</p><p style=\"text-align: justify;\">Les alin&#233;as 4&#176; et 5&#176; r&#233;tablissent la revalorisation annuelle des bar&#232;mes applicables pour les droits de succession et donation supprim&#233;e par le pr&#233;c&#233;dent gouvernement, suivant ainsi l&#8217;&#233;volution du taux d&#8217;inflation.</p><p>&#160;</p>",
    "annexeExposeSommaire": {
      "@xmlns:xsi": "http://www.w3.org/2001/XMLSchema-instance",
      "@xsi:nil": "true"
    }
  },
  "representations": {
    "representation": {
      "nom": "PDF",
      "typeMime": {
        "type": "application",
        "subType": "PDF"
      },
      "statutRepresentation": {
        "verbatim": "true",
        "canonique": "true",
        "officielle": "true",
        "transcription": "false",
        "enregistrement": "false"
      },
      "repSource": {
        "@xmlns:xsi": "http://www.w3.org/2001/XMLSchema-instance",
        "@xsi:nil": "true"
      },
      "offset": {
        "@xmlns:xsi": "http://www.w3.org/2001/XMLSchema-instance",
        "@xsi:nil": "true"
      },
      "contenu": {
        "documentURI": "/15/amendements/1255C/CION_FIN/CF1125.pdf"
      },
      "dateDispoRepresentation": {
        "@xmlns:xsi": "http://www.w3.org/2001/XMLSchema-instance",
        "@xsi:nil": "true"
      }
    }
  },
  "seanceDiscussion": {
    "@xmlns:xsi": "http://www.w3.org/2001/XMLSchema-instance",
    "@xsi:nil": "true"
  },
  "sort": {
    "dateSaisie": "2018-11-07T11:42:00.000+01:00",
    "sortEnSeance": "Non soutenu"
  },
  "dateDepot": "2018-11-02T01:00:00.000+01:00",
  "dateDistribution": "2018-11-06T01:00:00.000+01:00",
  "article99": "0",
  "loiReference": {
    "codeLoi": "impôts",
    "divisionCodeLoi": "777"
  }
}