{
  "@xmlns": "http://schemas.assemblee-nationale.fr/referentiel",
  "uid": "AMANR5L15SEA717460BTC0106P0D1N268",
  "identifiant": {
    "legislature": "15",
    "numero": "268",
    "numRect": "0",
    "saisine": {
      "refTexteLegislatif": "PRJLANR5L15BTC0106",
      "numeroPartiePLF": "0",
      "organeExamen": "PO717460",
      "mentionSecondeDeliberation": "0"
    }
  },
  "numeroLong": "268",
  "etapeTexte": "1ère lecture (2ème assemblée saisie)",
  "triAmendement": "an",
  "cardinaliteAmdtMultiples": "1",
  "amendementParent": {
    "@xmlns:xsi": "http://www.w3.org/2001/XMLSchema-instance",
    "@xsi:nil": "true"
  },
  "etat": "Discuté",
  "signataires": {
    "auteur": {
      "typeAuteur": "Depute",
      "acteurRef": "PA719558",
      "organeRef": {
        "@xmlns:xsi": "http://www.w3.org/2001/XMLSchema-instance",
        "@xsi:nil": "true"
      },
      "groupePolitiqueRef": "PO730970"
    },
    "cosignataires": {
      "acteurRef": [
        "PA720772",
        "PA719874",
        "PA720704",
        "PA719558",
        "PA721984",
        "PA721742"
      ]
    },
    "texteAffichable": "M.&#160;Balanant,  M.&#160;Bru, Mme&#160;Florennes, Mme&#160;Jacquier-Laforge, M.&#160;Latombe, Mme&#160;Vichnievsky et les membres du groupe du Mouvement D&#233;mocrate et apparent&#233;s"
  },
  "pointeurFragmentTexte": {
    "missionVisee": {
      "@xmlns:xsi": "http://www.w3.org/2001/XMLSchema-instance",
      "@xsi:nil": "true"
    },
    "division": {
      "titre": "pour la confiance dans la vie publique.",
      "articleDesignationCourte": "TITRE",
      "type": "TITRE",
      "avant_A_Apres": "A",
      "divisionRattachee": "TITRE",
      "articleAdditionnel": {
        "@xmlns:xsi": "http://www.w3.org/2001/XMLSchema-instance",
        "@xsi:nil": "true"
      },
      "chapitreAdditionnel": {
        "@xmlns:xsi": "http://www.w3.org/2001/XMLSchema-instance",
        "@xsi:nil": "true"
      },
      "urlDivisionTexteVise": "/15/textes/0106.asp#D_pour_la_confiance_dans_la_vie_publique"
    },
    "alinea": {
      "@xmlns:xsi": "http://www.w3.org/2001/XMLSchema-instance",
      "@xsi:nil": "true"
    }
  },
  "corps": {
    "dispositif": "<p style=\"text-align: justify;\">Substituer aux mots&#160;:</p><p style=\"text-align: justify;\">&#171;&#160;confiance dans la vie publique&#160;&#187;</p><p style=\"text-align: justify;\">les mots&#160;:</p><p style=\"text-align: justify;\">&#171;&#160;transparence de la vie politique&#160;&#187;.</p>",
    "exposeSommaire": "<p style=\"text-align: justify;\">Le choix du terme transparence semble plus adapt&#233; que celui du terme r&#233;gulation, les projets de loi organique et de loi ordinaire examin&#233;s se situent dans la continuit&#233; de la loi 2013&#8209;907 du 11 octobre 2013 relative &#224; la transparence de la vie publique.</p><p style=\"text-align: justify;\">Le terme transparence exprime clairement l&#8217;objectif des dispositions du projet de loi et sera certainement plus expressif pour tous les citoyens d&#8217;un engagement de confiance.</p><p style=\"text-align: justify;\">Le choix du terme politique en lieu et place du terme publique apparait mieux appropri&#233; au projet de loi dont les dispositions visent plus sp&#233;cifiquement les institutions politiques et non plus largement l&#8217;ensemble de la vie publique.</p>",
    "annexeExposeSommaire": {
      "@xmlns:xsi": "http://www.w3.org/2001/XMLSchema-instance",
      "@xsi:nil": "true"
    }
  },
  "representations": {
    "representation": {
      "nom": "PDF",
      "typeMime": {
        "type": "application",
        "subType": "PDF"
      },
      "statutRepresentation": {
        "verbatim": "true",
        "canonique": "true",
        "officielle": "true",
        "transcription": "false",
        "enregistrement": "false"
      },
      "repSource": {
        "@xmlns:xsi": "http://www.w3.org/2001/XMLSchema-instance",
        "@xsi:nil": "true"
      },
      "offset": {
        "@xmlns:xsi": "http://www.w3.org/2001/XMLSchema-instance",
        "@xsi:nil": "true"
      },
      "contenu": {
        "documentURI": "/15/amendements/0106/AN/268.pdf"
      },
      "dateDispoRepresentation": {
        "@xmlns:xsi": "http://www.w3.org/2001/XMLSchema-instance",
        "@xsi:nil": "true"
      }
    }
  },
  "seanceDiscussion": "RUANR5L15S2017IDS20661",
  "sort": {
    "dateSaisie": "2017-07-28T13:27:27.000+02:00",
    "sortEnSeance": "Retiré"
  },
  "dateDepot": "2017-07-21T02:00:00.000+02:00",
  "dateDistribution": "2017-07-24T02:00:00.000+02:00",
  "article99": "0",
  "loiReference": {
    "codeLoi": {
      "@xmlns:xsi": "http://www.w3.org/2001/XMLSchema-instance",
      "@xsi:nil": "true"
    },
    "divisionCodeLoi": {
      "@xmlns:xsi": "http://www.w3.org/2001/XMLSchema-instance",
      "@xsi:nil": "true"
    }
  }
}