{
  "@xmlns": "http://schemas.assemblee-nationale.fr/referentiel",
  "uid": "AMANR5L15SEA717460B1297P0D1N683",
  "identifiant": {
    "legislature": "15",
    "numero": "683",
    "numRect": "0",
    "saisine": {
      "refTexteLegislatif": "PRJLANR5L15B1297",
      "numeroPartiePLF": "0",
      "organeExamen": "PO717460",
      "mentionSecondeDeliberation": "0"
    }
  },
  "numeroLong": "683",
  "etapeTexte": "1ère lecture (1ère assemblée saisie)",
  "triAmendement": "eoaaaaaaaaaaaaaaaaaaaaaaaaaaaaaaaaaaaaaaaaaaaaaaaabakkkkkzz",
  "cardinaliteAmdtMultiples": "1",
  "amendementParent": {
    "@xmlns:xsi": "http://www.w3.org/2001/XMLSchema-instance",
    "@xsi:nil": "true"
  },
  "etat": "Discuté",
  "signataires": {
    "auteur": {
      "typeAuteur": "Depute",
      "acteurRef": "PA2377",
      "organeRef": {
        "@xmlns:xsi": "http://www.w3.org/2001/XMLSchema-instance",
        "@xsi:nil": "true"
      },
      "groupePolitiqueRef": "PO730934"
    },
    "cosignataires": {
      "acteurRef": "PA2377"
    },
    "texteAffichable": "M.&#160;Perrut"
  },
  "pointeurFragmentTexte": {
    "missionVisee": {
      "@xmlns:xsi": "http://www.w3.org/2001/XMLSchema-instance",
      "@xsi:nil": "true"
    },
    "division": {
      "titre": "Article 29",
      "articleDesignationCourte": "ART. 29",
      "type": "ARTICLE",
      "avant_A_Apres": "A",
      "divisionRattachee": "ARTICLE 29",
      "articleAdditionnel": {
        "@xmlns:xsi": "http://www.w3.org/2001/XMLSchema-instance",
        "@xsi:nil": "true"
      },
      "chapitreAdditionnel": {
        "@xmlns:xsi": "http://www.w3.org/2001/XMLSchema-instance",
        "@xsi:nil": "true"
      },
      "urlDivisionTexteVise": "/15/textes/1297.asp#D_Article_29"
    },
    "alinea": {
      "@xmlns:xsi": "http://www.w3.org/2001/XMLSchema-instance",
      "@xsi:nil": "true"
    }
  },
  "corps": {
    "dispositif": "<p>Apr&#232;s l'alin&#233;a 7, ins&#233;rer les cinq alin&#233;as suivants&#160;:</p><p style=\"text-align: justify;\">&#171;&#160;<i>j)</i> Les articles L.&#160;1111&#8209;6&#8209;1, L.&#160;4311&#8209;1 et L.&#160;4311&#8209;29 en ce qu&#8217;ils limitent les possibilit&#233;s d&#8217;organiser des d&#233;l&#233;gations de soins dans le cadre d&#8217;une prise en charge par un &#233;tablissement de sant&#233; ou par un &#233;tablissement ou service social ou m&#233;dico-social.</p><p style=\"text-align: justify;\">&#171;&#160;1&#176;&#160;<i>bis</i> Le 3&#176; du II est ainsi r&#233;dig&#233;&#160;:</p><p style=\"text-align: justify;\">&#171;&#160;3&#176; Aux dispositions suivantes du code de l&#8217;action sociale et des familles&#160;:</p><p style=\"text-align: justify;\"><i>a)</i> Les r&#232;gles de tarification et d&#8217;organisation pr&#233;vues par le code de l&#8217;action sociale et des familles applicables aux &#233;tablissements et services mentionn&#233;s &#224; l&#8217;article L.&#160;312&#8209;1 du m&#234;me code&#160;;</p><p style=\"text-align: justify;\"><i>b)</i> L&#8217;article L.&#160;313&#8209;26, afin de red&#233;finir les modalit&#233;s de qualification entre actes d&#8217;aide et actes de soins lors d&#8217;une prise en charge par un &#233;tablissement ou service social ou m&#233;dico-social.&#160;&#187;</p>",
    "exposeSommaire": "<p style=\"text-align: justify;\">Cet amendement propose d&#8217;amplifier la port&#233;e de l&#8217;article&#160;51 de la LFSS 2018 pour le secteur m&#233;dico-social en &#233;tant les d&#233;rogations sur deux points&#160;:</p><p style=\"text-align: justify;\">- les r&#232;gles d&#8217;organisation des &#233;tablissements et services sociaux et m&#233;dico-sociaux afin de favoriser les innovations organisationnelles et permettre d&#8217;exp&#233;rimenter de nouvelles formes de coop&#233;ration entre les acteurs sociaux, m&#233;dico-sociaux et sanitaires au service du parcours de sant&#233; et de vie des personnes&#160;;</p><p style=\"text-align: justify;\">- les modalit&#233;s de qualification entre actes d&#8217;aide et actes de soins dans le cadre d&#8217;un accompagnement par un &#233;tablissement ou service social ou m&#233;dico-social afin de rompte avec l&#8217;&#233;tanch&#233;it&#233; des missions en particulier &#224; domicile, entre aide &#224; domicile et aide-soignant et nuit &#224; la qualit&#233; et &#224; la pertinence de l&#8217;accompagnement dans son objectif de pr&#233;servation ou de renforcement de l&#8217;autonomie des personnes, d&#233;pendantes d&#8217;un tiers pour la r&#233;alisation de geste de soins rendus n&#233;cessaires du fait d&#8217;un handicap ou de l&#8217;avanc&#233;e en &#226;ge.</p><p style=\"text-align: justify;\">Le maintient des ces fronti&#232;res structurelles et arbitraires est n&#233;faste &#224; l&#8217;accompagnement et g&#233;n&#232;re des ruptures graves dans le parcours des personnes.</p><p style=\"text-align: justify;\">Si les acteurs d&#233;veloppent des organisations de coordination pour compenser ce cloisonnement, c&#8217;est bien la qualit&#233; des soins apport&#233;s aux personnes en perte d&#8217;autonomie qui en p&#226;tit le plus.</p><p style=\"text-align: justify;\">En exp&#233;rimentant de nouvelles r&#233;partitions entre actes d&#8217;aide et actes de soins en fonction des besoins des personnes elles-m&#234;mes, lors d&#8217;un accompagnement par un &#233;tablissement ou service social ou m&#233;dico-social, il sera alors possible d&#8217;identifier les &#171;&#160;transf&#233;rabilit&#233;s de comp&#233;tences&#160;&#187;, sociales et de soins en fonction des situations.</p><p style=\"text-align: justify;\">Tel est l&#8217;objet de ce pr&#233;sent amendement qui vise &#224; perfectionner l&#8217;article&#160;51 de la LFSS 2018 - dont les la possibilit&#233; de d&#233;roger aux r&#232;gles de tarification des &#233;tablissements et services sociaux et m&#233;dico-sociaux l&#232;vent certaines rigidit&#233;s financi&#232;res, mais ne r&#232;gle pas tous les cloisonnements nuisibles &#224; la pertinence des accompagnements.</p>",
    "annexeExposeSommaire": {
      "@xmlns:xsi": "http://www.w3.org/2001/XMLSchema-instance",
      "@xsi:nil": "true"
    }
  },
  "representations": {
    "representation": {
      "nom": "PDF",
      "typeMime": {
        "type": "application",
        "subType": "PDF"
      },
      "statutRepresentation": {
        "verbatim": "true",
        "canonique": "true",
        "officielle": "true",
        "transcription": "false",
        "enregistrement": "false"
      },
      "repSource": {
        "@xmlns:xsi": "http://www.w3.org/2001/XMLSchema-instance",
        "@xsi:nil": "true"
      },
      "offset": {
        "@xmlns:xsi": "http://www.w3.org/2001/XMLSchema-instance",
        "@xsi:nil": "true"
      },
      "contenu": {
        "documentURI": "/15/amendements/1297/AN/683.pdf"
      },
      "dateDispoRepresentation": {
        "@xmlns:xsi": "http://www.w3.org/2001/XMLSchema-instance",
        "@xsi:nil": "true"
      }
    }
  },
  "seanceDiscussion": "RUANR5L15S2019IDS21294",
  "sort": {
    "dateSaisie": "2018-10-26T15:24:22.000+02:00",
    "sortEnSeance": "Non soutenu"
  },
  "dateDepot": "2018-10-18T02:00:00.000+02:00",
  "dateDistribution": "2018-10-22T02:00:00.000+02:00",
  "article99": "0",
  "loiReference": {
    "codeLoi": {
      "@xmlns:xsi": "http://www.w3.org/2001/XMLSchema-instance",
      "@xsi:nil": "true"
    },
    "divisionCodeLoi": {
      "@xmlns:xsi": "http://www.w3.org/2001/XMLSchema-instance",
      "@xsi:nil": "true"
    }
  }
}