{
  "@xmlns": "http://schemas.assemblee-nationale.fr/referentiel",
  "uid": "AMANR5L15PO59046B0659P0D1N127",
  "identifiant": {
    "legislature": "15",
    "numero": "127",
    "numRect": "0",
    "saisine": {
      "refTexteLegislatif": "PRJLANR5L15B0659",
      "numeroPartiePLF": "0",
      "organeExamen": "PO59046",
      "mentionSecondeDeliberation": "0"
    }
  },
  "numeroLong": "DN127",
  "etapeTexte": "1ère lecture (1ère assemblée saisie)",
  "triAmendement": "i",
  "cardinaliteAmdtMultiples": "1",
  "amendementParent": {
    "@xmlns:xsi": "http://www.w3.org/2001/XMLSchema-instance",
    "@xsi:nil": "true"
  },
  "etat": "Discuté",
  "signataires": {
    "auteur": {
      "typeAuteur": "Depute",
      "acteurRef": "PA267306",
      "organeRef": {
        "@xmlns:xsi": "http://www.w3.org/2001/XMLSchema-instance",
        "@xsi:nil": "true"
      },
      "groupePolitiqueRef": "PO730940"
    },
    "cosignataires": {
      "acteurRef": [
        "PA610634",
        "PA441",
        "PA720546",
        "PA722110",
        "PA267306",
        "PA721270",
        "PA718926",
        "PA721118",
        "PA720692",
        "PA610654",
        "PA689",
        "PA610667",
        "PA721896",
        "PA335612",
        "PA718720",
        "PA722202"
      ]
    },
    "texteAffichable": "M.&#160;Chassaigne,  M.&#160;Azerot, Mme&#160;Bello, M.&#160;Brotherson, M.&#160;Bruneel, Mme&#160;Buffet, M.&#160;Dharr&#233;ville, M.&#160;Dufr&#232;gne, Mme&#160;Faucillon, M.&#160;Jumel, M.&#160;Lecoq, M.&#160;Nilor, M.&#160;Peu, M.&#160;Fabien&#160;Roussel, M.&#160;Serville et M.&#160;Wulfranc"
  },
  "pointeurFragmentTexte": {
    "missionVisee": {
      "@xmlns:xsi": "http://www.w3.org/2001/XMLSchema-instance",
      "@xsi:nil": "true"
    },
    "division": {
      "titre": "Article 9",
      "articleDesignationCourte": "ART. 9",
      "type": "ARTICLE",
      "avant_A_Apres": "A",
      "divisionRattachee": "ARTICLE 9",
      "articleAdditionnel": {
        "@xmlns:xsi": "http://www.w3.org/2001/XMLSchema-instance",
        "@xsi:nil": "true"
      },
      "chapitreAdditionnel": {
        "@xmlns:xsi": "http://www.w3.org/2001/XMLSchema-instance",
        "@xsi:nil": "true"
      },
      "urlDivisionTexteVise": "/15/textes/0659.asp#D_Article_9"
    },
    "alinea": {
      "@xmlns:xsi": "http://www.w3.org/2001/XMLSchema-instance",
      "@xsi:nil": "true"
    }
  },
  "corps": {
    "dispositif": "<p>Supprimer l'article 9.</p>",
    "exposeSommaire": "<p>Cet article est propos&#233; dans une logique d&#8217;abolir des r&#233;gimes sp&#233;ciaux de retraite des arm&#233;es qui sont plus favorables que le r&#233;gime g&#233;n&#233;ral.</p><p>L&#8217;article aligne la limite d&#8217;&#226;ge de certaines professions m&#233;dicales (infirmiers&#8230;) dans l&#8217;arm&#233;e sur le statut de la fonction publique hospitali&#232;re qui est moins favorable. Cela annonce la future r&#233;forme des retraites qui vise &#224; abolir les r&#233;gimes sp&#233;ciaux. Nous nous opposons &#224; ce jeu de chamboule-tout qui a pour seul objectif de niveler par le bas les conditions de retraite.</p>",
    "annexeExposeSommaire": {
      "@xmlns:xsi": "http://www.w3.org/2001/XMLSchema-instance",
      "@xsi:nil": "true"
    }
  },
  "representations": {
    "representation": {
      "nom": "PDF",
      "typeMime": {
        "type": "application",
        "subType": "PDF"
      },
      "statutRepresentation": {
        "verbatim": "true",
        "canonique": "true",
        "officielle": "true",
        "transcription": "false",
        "enregistrement": "false"
      },
      "repSource": {
        "@xmlns:xsi": "http://www.w3.org/2001/XMLSchema-instance",
        "@xsi:nil": "true"
      },
      "offset": {
        "@xmlns:xsi": "http://www.w3.org/2001/XMLSchema-instance",
        "@xsi:nil": "true"
      },
      "contenu": {
        "documentURI": "/15/amendements/0659/CION_DEF/DN127.pdf"
      },
      "dateDispoRepresentation": {
        "@xmlns:xsi": "http://www.w3.org/2001/XMLSchema-instance",
        "@xsi:nil": "true"
      }
    }
  },
  "seanceDiscussion": {
    "@xmlns:xsi": "http://www.w3.org/2001/XMLSchema-instance",
    "@xsi:nil": "true"
  },
  "sort": {
    "dateSaisie": "2018-03-14T11:10:03.000+01:00",
    "sortEnSeance": "Non soutenu"
  },
  "dateDepot": "2018-03-08T01:00:00.000+01:00",
  "dateDistribution": "2018-03-12T01:00:00.000+01:00",
  "article99": "0",
  "loiReference": {
    "codeLoi": {
      "@xmlns:xsi": "http://www.w3.org/2001/XMLSchema-instance",
      "@xsi:nil": "true"
    },
    "divisionCodeLoi": {
      "@xmlns:xsi": "http://www.w3.org/2001/XMLSchema-instance",
      "@xsi:nil": "true"
    }
  }
}