{
  "@xmlns": "http://schemas.assemblee-nationale.fr/referentiel",
  "uid": "AMANR5L15PO419604B1481P0D1N456",
  "identifiant": {
    "legislature": "15",
    "numero": "456",
    "numRect": "0",
    "saisine": {
      "refTexteLegislatif": "PRJLANR5L15B1481",
      "numeroPartiePLF": "0",
      "organeExamen": "PO419604",
      "mentionSecondeDeliberation": "0"
    }
  },
  "numeroLong": "AC456",
  "etapeTexte": "1ère lecture (1ère assemblée saisie)",
  "triAmendement": "doaaaaaaaaaaaaaaaaaaaaaaaaaaaaaaaaaaaaaaaaaaaaaaaabc",
  "cardinaliteAmdtMultiples": "1",
  "amendementParent": {
    "@xmlns:xsi": "http://www.w3.org/2001/XMLSchema-instance",
    "@xsi:nil": "true"
  },
  "etat": "Discuté",
  "signataires": {
    "auteur": {
      "typeAuteur": "Depute",
      "acteurRef": "PA340357",
      "organeRef": {
        "@xmlns:xsi": "http://www.w3.org/2001/XMLSchema-instance",
        "@xsi:nil": "true"
      },
      "groupePolitiqueRef": "PO758835"
    },
    "cosignataires": {
      "acteurRef": [
        "PA609590",
        "PA508",
        "PA335054",
        "PA643145",
        "PA335532",
        "PA1198",
        "PA332614",
        "PA340357",
        "PA1008",
        "PA608695",
        "PA642764",
        "PA340343",
        "PA610681",
        "PA333818",
        "PA429893",
        "PA720988",
        "PA608172",
        "PA342415",
        "PA605069",
        "PA608011",
        "PA267233",
        "PA1809",
        "PA608741",
        "PA1592",
        "PA719930",
        "PA609332",
        "PA607553",
        "PA333285",
        "PA337483"
      ]
    },
    "texteAffichable": "Mme&#160;Victory,  M.&#160;Juanico, Mme&#160;Manin, Mme&#160;Pau-Langevin, Mme&#160;Tolmont, M.&#160;Aviragnet, Mme&#160;Bareigts, Mme&#160;Battistel, Mme&#160;Bi&#233;mouret, M.&#160;Bouillon, M.&#160;Jean-Louis&#160;Bricout, M.&#160;Carvounas, M.&#160;Alain&#160;David, Mme&#160;Laurence&#160;Dumont, M.&#160;Faure, M.&#160;Garot, M.&#160;David&#160;Habib, M.&#160;Hutin, Mme&#160;Karamanli, M.&#160;J&#233;r&#244;me&#160;Lambert, M.&#160;Letchimy, Mme&#160;Pires Beaune, M.&#160;Potier, M.&#160;Pueyo, Mme&#160;Rabault, M.&#160;Saulignac, Mme&#160;Untermaier, Mme&#160;Vainqueur-Christophe et M.&#160;Vallaud"
  },
  "pointeurFragmentTexte": {
    "missionVisee": {
      "@xmlns:xsi": "http://www.w3.org/2001/XMLSchema-instance",
      "@xsi:nil": "true"
    },
    "division": {
      "titre": "Article 11",
      "articleDesignationCourte": "ART. 11",
      "type": "ARTICLE",
      "avant_A_Apres": "A",
      "divisionRattachee": "ARTICLE 11",
      "articleAdditionnel": {
        "@xmlns:xsi": "http://www.w3.org/2001/XMLSchema-instance",
        "@xsi:nil": "true"
      },
      "chapitreAdditionnel": {
        "@xmlns:xsi": "http://www.w3.org/2001/XMLSchema-instance",
        "@xsi:nil": "true"
      },
      "urlDivisionTexteVise": "/15/textes/1481.asp#D_Article_11"
    },
    "alinea": {
      "@xmlns:xsi": "http://www.w3.org/2001/XMLSchema-instance",
      "@xsi:nil": "true"
    }
  },
  "corps": {
    "dispositif": "<p style=\"text-align: justify;\">Supprimer cet article.&#160;</p>",
    "exposeSommaire": "<p style=\"text-align: justify;\">Le texte propose de supprimer les Esp&#233; et de les transformer en &#171;&#160;instituts nationaux sup&#233;rieurs du professorat et de l&#8217;&#233;ducation&#160;&#187;. Ce changement de d&#233;nomination n&#8217;est pas anodin et renvoie &#224; un jugement n&#233;gatif sur ce qui a &#233;t&#233; fait pendant 5 ans. Une nouvelle fois l&#8217;ex&#233;cutif supprime un outil sans avoir proc&#233;d&#233; &#224; son &#233;valuation et ce alors m&#234;me que nous attendons un rapport intitul&#233; &#171;&#160;Former au XXI&#232; si&#232;cle&#160;&#187; dont le Ministre a retard&#233; la publication.&#160;</p><p style=\"text-align: justify;\">Pourtant sur le terrain c&#8217;est bien un travail important qui a &#233;t&#233; r&#233;alis&#233; pour transformer en profondeur les formations. Alors que les Esp&#233; commen&#231;aient &#224; peine &#224; &#234;tre reconnus, ils sont abandonn&#233;s sans aucune forme d&#8217;&#233;valuation pr&#233;alable.&#160;</p><p style=\"text-align: justify;\">C&#8217;est pourquoi le groupe Socialistes et apparent&#233;s propose de supprimer&#160;ces dispositions et demande au gouvernement de proc&#233;der &#224; une &#233;valuation s&#233;rieuse des Esp&#233; actuels.&#160;</p>",
    "annexeExposeSommaire": {
      "@xmlns:xsi": "http://www.w3.org/2001/XMLSchema-instance",
      "@xsi:nil": "true"
    },
    "cartoucheDelaiDepotDepasse": {
      "@xmlns:xsi": "http://www.w3.org/2001/XMLSchema-instance",
      "@xsi:nil": "true"
    }
  },
  "representations": {
    "representation": {
      "nom": "PDF",
      "typeMime": {
        "type": "application",
        "subType": "PDF"
      },
      "statutRepresentation": {
        "verbatim": "true",
        "canonique": "true",
        "officielle": "true",
        "transcription": "false",
        "enregistrement": "false"
      },
      "repSource": {
        "@xmlns:xsi": "http://www.w3.org/2001/XMLSchema-instance",
        "@xsi:nil": "true"
      },
      "offset": {
        "@xmlns:xsi": "http://www.w3.org/2001/XMLSchema-instance",
        "@xsi:nil": "true"
      },
      "contenu": {
        "documentURI": "/15/amendements/1481/CION-CEDU/AC456.pdf"
      },
      "dateDispoRepresentation": {
        "@xmlns:xsi": "http://www.w3.org/2001/XMLSchema-instance",
        "@xsi:nil": "true"
      }
    }
  },
  "seanceDiscussion": {
    "@xmlns:xsi": "http://www.w3.org/2001/XMLSchema-instance",
    "@xsi:nil": "true"
  },
  "sort": {
    "dateSaisie": "2019-01-30T23:21:29.000+01:00",
    "sortEnSeance": "Rejeté"
  },
  "dateDepot": "2019-01-25T01:00:00.000+01:00",
  "dateDistribution": "2019-01-28T01:00:00.000+01:00",
  "article99": "0",
  "loiReference": {
    "codeLoi": {
      "@xmlns:xsi": "http://www.w3.org/2001/XMLSchema-instance",
      "@xsi:nil": "true"
    },
    "divisionCodeLoi": {
      "@xmlns:xsi": "http://www.w3.org/2001/XMLSchema-instance",
      "@xsi:nil": "true"
    }
  }
}