{
  "@xmlns": "http://schemas.assemblee-nationale.fr/referentiel",
  "uid": "AMANR5L15PO419610B0627P0D1N1004",
  "identifiant": {
    "legislature": "15",
    "numero": "1004",
    "numRect": "0",
    "saisine": {
      "refTexteLegislatif": "PRJLANR5L15B0627",
      "numeroPartiePLF": "0",
      "organeExamen": "PO419610",
      "mentionSecondeDeliberation": "0"
    }
  },
  "numeroLong": "CE1004",
  "etapeTexte": "1ère lecture (1ère assemblée saisie)",
  "triAmendement": "dkno",
  "cardinaliteAmdtMultiples": "1",
  "amendementParent": {
    "@xmlns:xsi": "http://www.w3.org/2001/XMLSchema-instance",
    "@xsi:nil": "true"
  },
  "etat": "Discuté",
  "signataires": {
    "auteur": {
      "typeAuteur": "Depute",
      "acteurRef": "PA722398",
      "organeRef": {
        "@xmlns:xsi": "http://www.w3.org/2001/XMLSchema-instance",
        "@xsi:nil": "true"
      },
      "groupePolitiqueRef": "PO730964"
    },
    "cosignataires": {
      "acteurRef": "PA722398"
    },
    "texteAffichable": "M.&#160;Rebeyrotte"
  },
  "pointeurFragmentTexte": {
    "missionVisee": {
      "@xmlns:xsi": "http://www.w3.org/2001/XMLSchema-instance",
      "@xsi:nil": "true"
    },
    "division": {
      "titre": "Article 13",
      "articleDesignationCourte": "ART. 13",
      "type": "ARTICLE",
      "avant_A_Apres": "A",
      "divisionRattachee": "ARTICLE 13",
      "articleAdditionnel": {
        "@xmlns:xsi": "http://www.w3.org/2001/XMLSchema-instance",
        "@xsi:nil": "true"
      },
      "chapitreAdditionnel": {
        "@xmlns:xsi": "http://www.w3.org/2001/XMLSchema-instance",
        "@xsi:nil": "true"
      },
      "urlDivisionTexteVise": "/15/textes/0627.asp#D_Article_13"
    },
    "alinea": {
      "avant_A_Apres": {
        "@xmlns:xsi": "http://www.w3.org/2001/XMLSchema-instance",
        "@xsi:nil": "true"
      },
      "numero": "1",
      "alineaDesignation": {
        "@xmlns:xsi": "http://www.w3.org/2001/XMLSchema-instance",
        "@xsi:nil": "true"
      }
    }
  },
  "corps": {
    "dispositif": "<p>Supprimer l'alin&#233;a&#160;1.</p>",
    "exposeSommaire": "<p style=\"text-align: justify;\">Le renforcement de l&#8217;arsenal r&#233;pressif en mati&#232;re de protection animale peut poser question, d&#8217;autant plus qu&#8217;aucun atelier des &#201;tats g&#233;n&#233;raux de l&#8217;alimentation n&#8217;avait conclu sur de telles mesures. La priorit&#233; doit plut&#244;t &#234;tre d&#8217;accompagner les d&#233;marches de progr&#232;s engag&#233;es par les professionnels par du soutien aux investissements, de la formation et de r&#233;mun&#233;rer les &#233;leveurs &#224; un prix juste. </p><p style=\"text-align: justify;\">Dans les cas d&#8217;&#233;leveurs en d&#233;sh&#233;rence, rares mais qui sont le reflet d&#8217;une d&#233;tresse humaine profonde, les r&#233;seaux professionnels privil&#233;gient la pr&#233;vention et la d&#233;tection de ces grandes difficult&#233;s de la fa&#231;on la plus pr&#233;coce possible pour &#233;viter les d&#233;fauts de soin apport&#233;s aux animaux, en accompagnant au plus pr&#232;s les &#233;leveurs concern&#233;s.</p><p style=\"text-align: justify;\">L&#8217;article&#160;2&#8209;13 du code de proc&#233;dure p&#233;nale ouvre d&#233;j&#224; aux associations la possibilit&#233; d&#8217;exercer les droits reconnus &#224; la partie civile pour les d&#233;lits envers des animaux d&#233;finis par le code p&#233;nal. Ces dispositions sont l&#233;gitimes et protectrices. Le risque de leur extension au code rural serait d&#8217;accentuer la pression de la part des ONG sur le terrain, alors que certaines sont fondamentalement anti-&#233;levage et pourraient avoir int&#233;r&#234;t &#224; multiplier les signalements pour demander des dommages et int&#233;r&#234;ts.</p>",
    "annexeExposeSommaire": {
      "@xmlns:xsi": "http://www.w3.org/2001/XMLSchema-instance",
      "@xsi:nil": "true"
    }
  },
  "representations": {
    "representation": {
      "nom": "PDF",
      "typeMime": {
        "type": "application",
        "subType": "PDF"
      },
      "statutRepresentation": {
        "verbatim": "true",
        "canonique": "true",
        "officielle": "true",
        "transcription": "false",
        "enregistrement": "false"
      },
      "repSource": {
        "@xmlns:xsi": "http://www.w3.org/2001/XMLSchema-instance",
        "@xsi:nil": "true"
      },
      "offset": {
        "@xmlns:xsi": "http://www.w3.org/2001/XMLSchema-instance",
        "@xsi:nil": "true"
      },
      "contenu": {
        "documentURI": "/15/amendements/0627/CION-ECO/CE1004.pdf"
      },
      "dateDispoRepresentation": {
        "@xmlns:xsi": "http://www.w3.org/2001/XMLSchema-instance",
        "@xsi:nil": "true"
      }
    }
  },
  "seanceDiscussion": {
    "@xmlns:xsi": "http://www.w3.org/2001/XMLSchema-instance",
    "@xsi:nil": "true"
  },
  "sort": {
    "dateSaisie": "2018-04-20T00:06:34.000+02:00",
    "sortEnSeance": "Non soutenu"
  },
  "dateDepot": "2018-04-12T02:00:00.000+02:00",
  "dateDistribution": "2018-04-17T02:00:00.000+02:00",
  "article99": "0",
  "loiReference": {
    "codeLoi": "s",
    "divisionCodeLoi": {
      "@xmlns:xsi": "http://www.w3.org/2001/XMLSchema-instance",
      "@xsi:nil": "true"
    }
  }
}