{
  "@xmlns": "http://schemas.assemblee-nationale.fr/referentiel",
  "uid": "AMANR5L15PO419604B1255P2D1N88",
  "identifiant": {
    "legislature": "15",
    "numero": "88",
    "numRect": "0",
    "saisine": {
      "refTexteLegislatif": "PRJLANR5L15B1255",
      "numeroPartiePLF": "2",
      "organeExamen": "PO419604",
      "mentionSecondeDeliberation": "0"
    }
  },
  "numeroLong": "II-AC88",
  "etapeTexte": "1ère lecture (1ère assemblée saisie)",
  "triAmendement": "alaaaaaaaaaaaaaaaaaaaaaaaaaaaaaaaaaaaaaaaaaaaaaaaazz",
  "cardinaliteAmdtMultiples": "1",
  "amendementParent": {
    "@xmlns:xsi": "http://www.w3.org/2001/XMLSchema-instance",
    "@xsi:nil": "true"
  },
  "etat": "Discuté",
  "signataires": {
    "auteur": {
      "typeAuteur": "Depute",
      "acteurRef": "PA722070",
      "organeRef": {
        "@xmlns:xsi": "http://www.w3.org/2001/XMLSchema-instance",
        "@xsi:nil": "true"
      },
      "groupePolitiqueRef": "PO730964"
    },
    "cosignataires": {
      "acteurRef": "PA722070"
    },
    "texteAffichable": "M.&#160;Henriet, rapporteur"
  },
  "pointeurFragmentTexte": {
    "missionVisee": {
      "idMissionAN": "413",
      "libelleMission": "Recherche et enseignement supérieur",
      "codeMissionPLF": "B",
      "libelleMissionPLF": "Répartition, par mission et programme, des crédits du budget général"
    },
    "division": {
      "titre": "ÉTAT B",
      "articleDesignationCourte": "ART. 39",
      "type": "ANNEXE",
      "avant_A_Apres": "A",
      "divisionRattachee": "ARTICLE 39",
      "articleAdditionnel": {
        "@xmlns:xsi": "http://www.w3.org/2001/XMLSchema-instance",
        "@xsi:nil": "true"
      },
      "chapitreAdditionnel": {
        "@xmlns:xsi": "http://www.w3.org/2001/XMLSchema-instance",
        "@xsi:nil": "true"
      },
      "urlDivisionTexteVise": "/15/textes/1255C.asp#D_ETAT_B"
    },
    "alinea": {
      "@xmlns:xsi": "http://www.w3.org/2001/XMLSchema-instance",
      "@xsi:nil": "true"
    }
  },
  "corps": {
    "exposeSommaire": "<p style=\"text-align: justify;\">Le pr&#233;sent amendement vise &#224; &#233;toffer les effectifs des d&#233;l&#233;gations r&#233;gionales &#224; la recherche et &#224; la technologie (DRRT), qui sont charg&#233;es de l&#8217;action d&#233;concentr&#233;e de l&#8217;&#201;tat dans les domaines de la recherche, de la technologie et de l&#8217;innovation. Elles assurent des missions d&#8217;animation, de coordination et d&#8217;accompagnement, aupr&#232;s des &#233;tablissements et organismes de recherche, et aupr&#232;s des entreprises, sur le terrain. Elles exercent aussi des fonctions d&#8217;expertise en mati&#232;re de cr&#233;dit d&#8217;imp&#244;t pour la recherche, pour r&#233;aliser des rescrits et appuyer les services fiscaux dans le cadre de leurs contr&#244;les.</p><p style=\"text-align: justify;\">Le pr&#233;sent amendement vise &#224; renforcer leurs effectifs, qui sont relativement restreints sur l&#8217;ensemble du territoire, en repr&#233;sentant une centaine de personnels r&#233;partis dans les 17 DRRT. Les cr&#233;dits aff&#233;rents aux personnels des DRRT figurent dans le programme 172, au titre des mises &#224; disposition pour les postes de d&#233;l&#233;gu&#233;s r&#233;gionaux et de leurs adjoints, et dans le programme 150, essentiellement pour les autres personnels des DRRT&#160;; ils repr&#233;sentent au total de l&#8217;ordre de 6 millions d&#8217;euros. Le pr&#233;sent amendement vient majorer de 300 000&#160;euros les cr&#233;dits inscrits sur l&#8217;action 15 du programme 150, et de 700 000&#160;euros ceux de l&#8217;action 1 du programme 172. En contrepartie, l&#8217;amendement minore les cr&#233;dits allou&#233;s au programme 193 sur la recherche spatiale, &#224; hauteur de 1 000 000&#160;euros, sur l&#8217;action 1.</p>",
    "annexeExposeSommaire": {
      "@xmlns:xsi": "http://www.w3.org/2001/XMLSchema-instance",
      "@xsi:nil": "true"
    },
    "dispositifAmdtCredit": {
      "listeProgrammes": {
        "programme": [
          {
            "libelle": "Formations supérieures et recherche universitaire",
            "id": "45491",
            "AE": {
              "montantPositif": "300000",
              "montantNegatif": "0"
            },
            "CP": {
              "montantPositif": "300000",
              "montantNegatif": "0"
            },
            "action": "modification",
            "lignesCredits": {
              "ligneCredit": {
                "id": "1520",
                "libelle": "Dont titre 2",
                "AE": {
                  "montantPositif": "300000",
                  "montantNegatif": "0"
                },
                "CP": {
                  "montantPositif": "300000",
                  "montantNegatif": "0"
                }
              }
            }
          },
          {
            "libelle": "Vie étudiante",
            "id": "45492",
            "AE": {
              "montantPositif": "0",
              "montantNegatif": "0"
            },
            "CP": {
              "montantPositif": "0",
              "montantNegatif": "0"
            },
            "action": "modification",
            "lignesCredits": null
          },
          {
            "libelle": "Recherches scientifiques et technologiques pluridisciplinaires",
            "id": "45493",
            "AE": {
              "montantPositif": "700000",
              "montantNegatif": "0"
            },
            "CP": {
              "montantPositif": "700000",
              "montantNegatif": "0"
            },
            "action": "modification",
            "lignesCredits": null
          },
          {
            "libelle": "Recherche spatiale",
            "id": "45494",
            "AE": {
              "montantPositif": "0",
              "montantNegatif": "1000000"
            },
            "CP": {
              "montantPositif": "0",
              "montantNegatif": "1000000"
            },
            "action": "modification",
            "lignesCredits": null
          },
          {
            "libelle": "Recherche dans les domaines de l'énergie, du développement et de la mobilité durables",
            "id": "45495",
            "AE": {
              "montantPositif": "0",
              "montantNegatif": "0"
            },
            "CP": {
              "montantPositif": "0",
              "montantNegatif": "0"
            },
            "action": "modification",
            "lignesCredits": null
          },
          {
            "libelle": "Recherche et enseignement supérieur en matière économique et industrielle",
            "id": "45496",
            "AE": {
              "montantPositif": "0",
              "montantNegatif": "0"
            },
            "CP": {
              "montantPositif": "0",
              "montantNegatif": "0"
            },
            "action": "modification",
            "lignesCredits": null
          },
          {
            "libelle": "Recherche duale (civile et militaire)",
            "id": "45497",
            "AE": {
              "montantPositif": "0",
              "montantNegatif": "0"
            },
            "CP": {
              "montantPositif": "0",
              "montantNegatif": "0"
            },
            "action": "modification",
            "lignesCredits": null
          },
          {
            "libelle": "Recherche culturelle et culture scientifique",
            "id": "45498",
            "AE": {
              "montantPositif": "0",
              "montantNegatif": "0"
            },
            "CP": {
              "montantPositif": "0",
              "montantNegatif": "0"
            },
            "action": "modification",
            "lignesCredits": null
          },
          {
            "libelle": "Enseignement supérieur et recherche agricoles",
            "id": "45499",
            "AE": {
              "montantPositif": "0",
              "montantNegatif": "0"
            },
            "CP": {
              "montantPositif": "0",
              "montantNegatif": "0"
            },
            "action": "modification",
            "lignesCredits": null
          }
        ]
      },
      "totalAE": {
        "montantPositif": "1000000",
        "montantNegatif": "1000000",
        "solde": "0"
      },
      "totalCP": {
        "montantPositif": "1000000",
        "montantNegatif": "1000000",
        "solde": "0"
      }
    }
  },
  "representations": {
    "representation": {
      "nom": "PDF",
      "typeMime": {
        "type": "application",
        "subType": "PDF"
      },
      "statutRepresentation": {
        "verbatim": "true",
        "canonique": "true",
        "officielle": "true",
        "transcription": "false",
        "enregistrement": "false"
      },
      "repSource": {
        "@xmlns:xsi": "http://www.w3.org/2001/XMLSchema-instance",
        "@xsi:nil": "true"
      },
      "offset": {
        "@xmlns:xsi": "http://www.w3.org/2001/XMLSchema-instance",
        "@xsi:nil": "true"
      },
      "contenu": {
        "documentURI": "/15/amendements/1255C/CION-CEDU/AC88.pdf"
      },
      "dateDispoRepresentation": {
        "@xmlns:xsi": "http://www.w3.org/2001/XMLSchema-instance",
        "@xsi:nil": "true"
      }
    }
  },
  "seanceDiscussion": {
    "@xmlns:xsi": "http://www.w3.org/2001/XMLSchema-instance",
    "@xsi:nil": "true"
  },
  "sort": {
    "dateSaisie": "2018-11-07T19:48:39.000+01:00",
    "sortEnSeance": "Retiré"
  },
  "dateDepot": "2018-11-07T01:00:00.000+01:00",
  "dateDistribution": "2018-11-07T01:00:00.000+01:00",
  "article99": "0",
  "loiReference": {
    "codeLoi": {
      "@xmlns:xsi": "http://www.w3.org/2001/XMLSchema-instance",
      "@xsi:nil": "true"
    },
    "divisionCodeLoi": {
      "@xmlns:xsi": "http://www.w3.org/2001/XMLSchema-instance",
      "@xsi:nil": "true"
    }
  }
}