{
  "@xmlns": "http://schemas.assemblee-nationale.fr/referentiel",
  "uid": "AMANR5L15PO59048B1255P2D1N1323",
  "identifiant": {
    "legislature": "15",
    "numero": "1323",
    "numRect": "0",
    "saisine": {
      "refTexteLegislatif": "PRJLANR5L15B1255",
      "numeroPartiePLF": "2",
      "organeExamen": "PO59048",
      "mentionSecondeDeliberation": "0"
    }
  },
  "numeroLong": "II-CF1323",
  "etapeTexte": "1ère lecture (1ère assemblée saisie)",
  "triAmendement": "jlaaaaaaaaaaaaaaaaaaaaaaaaaaaaaaaaaaaaaaaaaaaaaaaafukzq",
  "cardinaliteAmdtMultiples": "1",
  "amendementParent": {
    "@xmlns:xsi": "http://www.w3.org/2001/XMLSchema-instance",
    "@xsi:nil": "true"
  },
  "etat": "Discuté",
  "signataires": {
    "auteur": {
      "typeAuteur": "Depute",
      "acteurRef": "PA719440",
      "organeRef": {
        "@xmlns:xsi": "http://www.w3.org/2001/XMLSchema-instance",
        "@xsi:nil": "true"
      },
      "groupePolitiqueRef": "PO730964"
    },
    "cosignataires": {
      "acteurRef": [
        "PA721844",
        "PA718990",
        "PA722038",
        "PA606639",
        "PA719440",
        "PA719420",
        "PA720198",
        "PA721876",
        "PA721426",
        "PA722118",
        "PA721384",
        "PA721398",
        "PA719480",
        "PA721522",
        "PA722336",
        "PA721024",
        "PA721624",
        "PA719790",
        "PA719258",
        "PA722000",
        "PA720414",
        "PA720030",
        "PA721616",
        "PA718962",
        "PA720402",
        "PA722366"
      ]
    },
    "texteAffichable": "M.&#160;Cellier,  M.&#160;Damien&#160;Adam, Mme&#160;Avia, M.&#160;Batut, Mme&#160;Blanc, M.&#160;Buchou, M.&#160;Chalumeau, Mme&#160;Degois, M.&#160;Delpon, Mme&#160;Fontenel-Personne, M.&#160;Freschi, M.&#160;Fugit, M.&#160;Gaillard, M.&#160;Galbadon, Mme&#160;Genetet, M.&#160;Morenas, M.&#160;Paluszkiewicz, M.&#160;Perrot, Mme&#160;Piron, Mme&#160;Riotton, M.&#160;Rupin, M.&#160;Sommer, Mme&#160;Sylla, M.&#160;Thi&#233;baut, M.&#160;Vignal et M.&#160;Zulesi"
  },
  "pointeurFragmentTexte": {
    "missionVisee": {
      "@xmlns:xsi": "http://www.w3.org/2001/XMLSchema-instance",
      "@xsi:nil": "true"
    },
    "division": {
      "titre": "Article 57",
      "articleDesignationCourte": "ART. 57",
      "type": "ARTICLE",
      "avant_A_Apres": "A",
      "divisionRattachee": "ARTICLE 57",
      "articleAdditionnel": {
        "@xmlns:xsi": "http://www.w3.org/2001/XMLSchema-instance",
        "@xsi:nil": "true"
      },
      "chapitreAdditionnel": {
        "@xmlns:xsi": "http://www.w3.org/2001/XMLSchema-instance",
        "@xsi:nil": "true"
      },
      "urlDivisionTexteVise": "/15/textes/1255C.asp#D_Article_57"
    },
    "alinea": {
      "avant_A_Apres": "Apres",
      "numero": "8",
      "alineaDesignation": {
        "@xmlns:xsi": "http://www.w3.org/2001/XMLSchema-instance",
        "@xsi:nil": "true"
      }
    }
  },
  "corps": {
    "dispositif": "<p style=\"text-align: justify;\">I.&#160;&#8211;&#160;Apre&#768;s l&#8217;aline&#769;a 8 sont inse&#769;re&#769;s les sept aline&#769;as suivants&#160;:</p><p style=\"text-align: justify;\">&#171;&#160;A <i>bis</i>.&#160;&#8211;&#160;Le 1 <i>bis</i> est r&#233;tabli dans la r&#233;daction suivante&#160;:</p><p style=\"text-align: justify;\">&#171;&#160;1 <i>bis.</i> Les contribuables domicilie&#769;s en France au sens de l&#8217;article&#160;4 B peuvent be&#769;ne&#769;ficier d&#8217;un cre&#769;dit&#160;d&#8217;impo&#770;t sur le revenu au titre des de&#769;penses effectivement supporte&#769;es pour la contribution a&#768; la transition e&#769;nerge&#769;tique du logement dont ils sont proprie&#769;taires, locataires ou occupants a&#768; titre gratuit et qu&#8217;ils affectent a&#768; leur habitation principale.</p><p style=\"text-align: justify;\">&#171;&#160;&#192; la condition que le logement soit acheve&#769; depuis plus de deux ans a&#768; la date de de&#769;but d&#8217;exe&#769;cution des travaux, ce cre&#769;dit d&#8217;impo&#770;t s&#8217;applique aux de&#769;penses paye&#769;es entre le 1<sup>er</sup> janvier 2019 et le 31 de&#769;cembre 2020, au titre de&#160;:</p><p style=\"text-align: justify;\">&#171;&#160;1&#176; L&#8217;acquisition et l&#8217;installation de pompe a&#768; chaleur eau/eau assurant la production mixte de chauffage et d&#8217;eau chaude sanitaire ou de chauffage et utilisant la ge&#769;othermie comme source d&#8217;e&#769;nergie.</p><p style=\"text-align: justify;\">&#171;&#160;2&#176; L&#8217;acquisition et l&#8217;installation d&#8217;une chaudie&#768;re individuelle de classe 5 selon la norme NF EN 303.5 assurant la production mixte de chauffage et d&#8217;eau chaude sanitaire ou de chauffage utilisant la biomasse comme source d&#8217;e&#769;nergie.</p><p style=\"text-align: justify;\">&#171;&#160;3&#176; L&#8217;acquisition et l&#8217;installation de syste&#768;me solaire combine&#769; assurant la production de chauffage et d&#8217;eau chaude sanitaire.&#160;&#187;</p><p style=\"text-align: justify;\">&#171;&#160;A <i>ter</i>. &#8211; Au 1 <i>ter</i>, apre&#768;s les mots &#171;&#160;mentionne&#769;s au 1&#160;&#187; sont ins&#233;r&#233;s les mots &#171;&#160;et au 1 <i>bis</i>&#160;&#187;.&#160;</p><p style=\"text-align: justify;\">II.&#160;&#8211;&#160;Apre&#768;s l&#8217;aline&#769;a 10 sont inse&#769;re&#769;s les aline&#769;as suivants&#160;:</p><p style=\"text-align: justify;\">&#171;&#160;C <i>bis</i>.&#160;&#8211;&#160;Apre&#768;s le 5, il est inse&#769;re&#769; un 5 <i>bis</i> ainsi r&#233;dig&#233;&#160;:</p><p style=\"text-align: justify;\">&#171;&#160;5 <i>bis</i>. Le cre&#769;dit d&#8217;impo&#770;t mentionne&#769; au 1 bis est e&#769;gal a&#768; la somme forfaitaire de 4 500&#160;&#8364;. Ce cre&#769;dit d&#8217;impo&#770;t n&#8217;est pas cumulable avec celui mentionne&#769; au 1.&#160;&#187;</p><p style=\"text-align: justify;\">III.&#160;&#8211;&#160;Substituer &#224; l&#8217;alin&#233;a&#160;11 les cinq alin&#233;as suivants&#160;:</p><p style=\"text-align: justify;\">&#171;&#160;D.&#160;&#8211;&#160;Au 6&#160;:</p><p style=\"text-align: justify;\">&#171;&#160;1&#176; Au <i>a</i>, apre&#768;s les mots &#171;&#160;mentionne&#769;s au 1&#160;&#187; sont ajoute&#769; les mots &#171;&#160;et au 1 <i>bis</i>&#160;&#187;&#160;;</p><p style=\"text-align: justify;\">&#171;&#160;2&#176; Au <i>b</i>&#160;:</p><p style=\"text-align: justify;\">&#171;&#160;<i>a)</i> Apre&#768;s les mots &#171;&#160;mentionne&#769;s au 1&#160;&#187; sont ajoute&#769;s les mots &#171;&#160;et au 1 <i>bis</i>&#160;&#187;&#160;;&#160;</p><p style=\"text-align: justify;\">&#171;&#160;<i>b)</i> Le 8&#176; est abroge&#769;.</p><p style=\"text-align: justify;\">IV.&#160;&#8211;&#160;Les I &#224; III ne sont applicables qu&#8217;aux sommes venant en d&#233;duction de l&#8217;imp&#244;t d&#251;.</p><p style=\"text-align: justify;\">V.&#160;&#8211;&#160;La perte de recettes pour l&#8217;&#201;tat est compens&#233;e &#224; due concurrence par la majoration des droits mentionn&#233;s aux articles 575 et 575 A du code g&#233;n&#233;ral des imp&#244;ts.</p>",
    "exposeSommaire": "<p style=\"text-align: justify;\">Le cre&#769;dit d&#8217;impo&#770;t transition e&#769;nerge&#769;tique (CITE) permet de financer la re&#769;novation e&#769;nerge&#769;tique.</p><p style=\"text-align: justify;\">De&#768;s 2020, le CITE ne devrait&#160;plus prendre la forme d&#8217;un cre&#769;dit d&#8217;impo&#770;t mais d&#8217;une prime disponible directement pour les me&#769;nages.</p><p style=\"text-align: justify;\">Cet amendement permet d&#8217;initier la transformation du CITE en prime en cre&#769;ant un montant forfaitaire de 4500 &#8364; en faveur de trois actions particulie&#768;rement e&#769;conomes en carbone, l&#8217;installation d&#8217;une chaudie&#768;re biomasse ou d&#8217;une pompe a&#768; chaleur ge&#769;othermie ou d&#8217;un syste&#768;me solaire combine&#769;. Les m&#233;nages auraient le choix entre ce montant ou le CITE &#224; 30 %.</p><p style=\"text-align: justify;\">Ce montant forfaitaire serait expe&#769;rimente&#769; sur les anne&#769;es 2019 et 2020 et servirait ainsi de premier retour sur expe&#769;rience a&#768; la transformation du CITE en prime, de&#768;s 2020.&#160;</p>",
    "annexeExposeSommaire": {
      "@xmlns:xsi": "http://www.w3.org/2001/XMLSchema-instance",
      "@xsi:nil": "true"
    }
  },
  "representations": {
    "representation": {
      "nom": "PDF",
      "typeMime": {
        "type": "application",
        "subType": "PDF"
      },
      "statutRepresentation": {
        "verbatim": "true",
        "canonique": "true",
        "officielle": "true",
        "transcription": "false",
        "enregistrement": "false"
      },
      "repSource": {
        "@xmlns:xsi": "http://www.w3.org/2001/XMLSchema-instance",
        "@xsi:nil": "true"
      },
      "offset": {
        "@xmlns:xsi": "http://www.w3.org/2001/XMLSchema-instance",
        "@xsi:nil": "true"
      },
      "contenu": {
        "documentURI": "/15/amendements/1255C/CION_FIN/CF1323.pdf"
      },
      "dateDispoRepresentation": {
        "@xmlns:xsi": "http://www.w3.org/2001/XMLSchema-instance",
        "@xsi:nil": "true"
      }
    }
  },
  "seanceDiscussion": {
    "@xmlns:xsi": "http://www.w3.org/2001/XMLSchema-instance",
    "@xsi:nil": "true"
  },
  "sort": {
    "dateSaisie": "2018-11-08T00:28:05.000+01:00",
    "sortEnSeance": "Rejeté"
  },
  "dateDepot": "2018-11-02T01:00:00.000+01:00",
  "dateDistribution": "2018-11-06T01:00:00.000+01:00",
  "article99": "0",
  "loiReference": {
    "codeLoi": {
      "@xmlns:xsi": "http://www.w3.org/2001/XMLSchema-instance",
      "@xsi:nil": "true"
    },
    "divisionCodeLoi": {
      "@xmlns:xsi": "http://www.w3.org/2001/XMLSchema-instance",
      "@xsi:nil": "true"
    }
  }
}