{
  "@xmlns": "http://schemas.assemblee-nationale.fr/referentiel",
  "uid": "AMANR5L15PO419865B0627P0D1N44",
  "identifiant": {
    "legislature": "15",
    "numero": "44",
    "numRect": "0",
    "saisine": {
      "refTexteLegislatif": "PRJLANR5L15B0627",
      "numeroPartiePLF": "0",
      "organeExamen": "PO419865",
      "mentionSecondeDeliberation": "0"
    }
  },
  "numeroLong": "CD44",
  "etapeTexte": "1ère lecture (1ère assemblée saisie)",
  "triAmendement": "adkkkzz",
  "cardinaliteAmdtMultiples": "1",
  "amendementParent": {
    "@xmlns:xsi": "http://www.w3.org/2001/XMLSchema-instance",
    "@xsi:nil": "true"
  },
  "etat": "Discuté",
  "signataires": {
    "auteur": {
      "typeAuteur": "Depute",
      "acteurRef": "PA267527",
      "organeRef": {
        "@xmlns:xsi": "http://www.w3.org/2001/XMLSchema-instance",
        "@xsi:nil": "true"
      },
      "groupePolitiqueRef": "PO730934"
    },
    "cosignataires": {
      "acteurRef": [
        "PA721410",
        "PA267527"
      ]
    },
    "texteAffichable": "M.&#160;Saddier et Mme&#160;Bonnivard"
  },
  "pointeurFragmentTexte": {
    "missionVisee": {
      "@xmlns:xsi": "http://www.w3.org/2001/XMLSchema-instance",
      "@xsi:nil": "true"
    },
    "division": {
      "titre": "Article 15",
      "articleDesignationCourte": "APRÈS ART. 15",
      "type": "ARTICLE",
      "avant_A_Apres": "Après",
      "divisionRattachee": "APRÈS L'ARTICLE 15, insérer l'article suivant:",
      "articleAdditionnel": "1",
      "chapitreAdditionnel": {
        "@xmlns:xsi": "http://www.w3.org/2001/XMLSchema-instance",
        "@xsi:nil": "true"
      },
      "urlDivisionTexteVise": "/15/textes/0627.asp#D_Article_15"
    },
    "alinea": {
      "@xmlns:xsi": "http://www.w3.org/2001/XMLSchema-instance",
      "@xsi:nil": "true"
    }
  },
  "corps": {
    "dispositif": "<p style=\"text-align: justify;\">Le&#160;1&#176; du&#160;I de l&#8217;article L&#160;1 du code rural et de la p&#234;che maritime est compl&#233;t&#233; par les mots suivants&#160;: &#171;&#160;en interdisant les importations de produits ne respectant pas strictement les m&#234;mes normes de production que celles impos&#233;es au niveau national, telle que l&#8217;interdiction des farines animales dans l&#8217;alimentation des bovins&#160;;&#160;&#187;.</p>",
    "exposeSommaire": "<p>Les accords de libre-&#233;change en voie de ratification ou en cours de n&#233;gociation (CETA, Mercosur, &#8230;), qui pr&#233;voient notamment l&#8217;ouverture du march&#233; communautaire &#224; plusieurs centaines de milliers de tonnes de viandes issues de bovins engraiss&#233;s au sein de &#171;&#160;feedlots&#160;&#187; aux farines animales et aux antibiotiques utilis&#233;s comme activateurs de croissance, sont parfaitement incompatibles avec le mod&#232;le d&#8217;&#233;levage pr&#244;n&#233; par les &#201;tats g&#233;n&#233;raux de l&#8217;alimentation et les objectifs de la politique de l&#8217;agriculture et de l&#8217;alimentation d&#233;finie au livre pr&#233;liminaire du code rural.</p><p>De telles importations de viandes issues de bovins nourris aux farines animales, une pratique strictement interdite en France et en Europe depuis la crise de la vache folle et qui ne peut faire l&#8217;objet d&#8217;aucune tra&#231;abilit&#233;, pr&#233;sentent, en outre, un risque r&#233;el pour la sant&#233; des consommateurs.</p><p>C&#8217;est pourquoi cet amendement vise &#224; renforcer ce livre pr&#233;liminaire du code rural et de la p&#234;che maritime en exprimant clairement le refus de la France d&#8217;importer des produits ne r&#233;pondant pas strictement aux m&#234;mes normes de production que celles impos&#233;es aux producteurs fran&#231;ais pour prot&#233;ger l&#8217;environnement, la sant&#233; des consommateurs et le bien-&#234;tre des animaux.</p>",
    "annexeExposeSommaire": {
      "@xmlns:xsi": "http://www.w3.org/2001/XMLSchema-instance",
      "@xsi:nil": "true"
    }
  },
  "representations": {
    "representation": {
      "nom": "PDF",
      "typeMime": {
        "type": "application",
        "subType": "PDF"
      },
      "statutRepresentation": {
        "verbatim": "true",
        "canonique": "true",
        "officielle": "true",
        "transcription": "false",
        "enregistrement": "false"
      },
      "repSource": {
        "@xmlns:xsi": "http://www.w3.org/2001/XMLSchema-instance",
        "@xsi:nil": "true"
      },
      "offset": {
        "@xmlns:xsi": "http://www.w3.org/2001/XMLSchema-instance",
        "@xsi:nil": "true"
      },
      "contenu": {
        "documentURI": "/15/amendements/0627/CION-DVP/CD44.pdf"
      },
      "dateDispoRepresentation": {
        "@xmlns:xsi": "http://www.w3.org/2001/XMLSchema-instance",
        "@xsi:nil": "true"
      }
    }
  },
  "seanceDiscussion": {
    "@xmlns:xsi": "http://www.w3.org/2001/XMLSchema-instance",
    "@xsi:nil": "true"
  },
  "sort": {
    "dateSaisie": "2018-03-29T15:06:30.000+02:00",
    "sortEnSeance": "Non soutenu"
  },
  "dateDepot": "2018-03-19T01:00:00.000+01:00",
  "dateDistribution": "2018-03-26T02:00:00.000+02:00",
  "article99": "0",
  "loiReference": {
    "codeLoi": "rural et pêche maritime",
    "divisionCodeLoi": "1"
  }
}