{
  "@xmlns": "http://schemas.assemblee-nationale.fr/referentiel",
  "uid": "AMANR5L15SEA717460BTC2401P0D1N537",
  "identifiant": {
    "legislature": "15",
    "numero": "537",
    "numRect": "0",
    "saisine": {
      "refTexteLegislatif": "PRJLANR5L15BTC2401",
      "numeroPartiePLF": "0",
      "organeExamen": "PO717460",
      "mentionSecondeDeliberation": "0"
    }
  },
  "numeroLong": "537",
  "etapeTexte": "1ère lecture (2ème assemblée saisie)",
  "triAmendement": "akoaaaaaaaaaaaaaaaaaaaaaaaaaaaaaaaaaaaaaaaaaaaaaaaki",
  "cardinaliteAmdtMultiples": "1",
  "amendementParent": {
    "@xmlns:xsi": "http://www.w3.org/2001/XMLSchema-instance",
    "@xsi:nil": "true"
  },
  "etat": "Discuté",
  "signataires": {
    "auteur": {
      "typeAuteur": "Depute",
      "acteurRef": "PA346218",
      "organeRef": {
        "@xmlns:xsi": "http://www.w3.org/2001/XMLSchema-instance",
        "@xsi:nil": "true"
      },
      "groupePolitiqueRef": "PO730934"
    },
    "cosignataires": {
      "acteurRef": [
        "PA643134",
        "PA267260",
        "PA267429",
        "PA722390",
        "PA330684",
        "PA718780",
        "PA718884",
        "PA2377",
        "PA266808",
        "PA721070",
        "PA719318",
        "PA748954",
        "PA267378",
        "PA267204",
        "PA346218"
      ]
    },
    "texteAffichable": "M.&#160;Masson,  M.&#160;Sermier, M.&#160;Savignat, Mme&#160;Val&#233;rie&#160;Boyer, Mme&#160;Anthoine, Mme&#160;Bazin-Malgras, M.&#160;Perrut, M.&#160;Cinieri, Mme&#160;Levy, Mme&#160;Trastour-Isnart, Mme&#160;Valentin, M.&#160;Rolland, Mme&#160;Ramassamy, Mme&#160;Corneloup et Mme&#160;Poletti"
  },
  "pointeurFragmentTexte": {
    "missionVisee": {
      "@xmlns:xsi": "http://www.w3.org/2001/XMLSchema-instance",
      "@xsi:nil": "true"
    },
    "division": {
      "titre": "Article 4",
      "articleDesignationCourte": "ART. 4",
      "type": "ARTICLE",
      "avant_A_Apres": "A",
      "divisionRattachee": "ARTICLE 4",
      "articleAdditionnel": {
        "@xmlns:xsi": "http://www.w3.org/2001/XMLSchema-instance",
        "@xsi:nil": "true"
      },
      "chapitreAdditionnel": {
        "@xmlns:xsi": "http://www.w3.org/2001/XMLSchema-instance",
        "@xsi:nil": "true"
      },
      "urlDivisionTexteVise": "/15/textes/2401.asp#D_Article_4"
    },
    "alinea": {
      "avant_A_Apres": {
        "@xmlns:xsi": "http://www.w3.org/2001/XMLSchema-instance",
        "@xsi:nil": "true"
      },
      "numero": "4",
      "alineaDesignation": {
        "@xmlns:xsi": "http://www.w3.org/2001/XMLSchema-instance",
        "@xsi:nil": "true"
      }
    }
  },
  "corps": {
    "dispositif": "<p>I.&#160;&#8211;&#160;&#192; la premi&#232;re phrase de l'alin&#233;a 4, apr&#232;s le mot&#160;:</p><p style=\"text-align: justify;\">&#171;&#160;d&#233;mat&#233;rialis&#233;e&#160;&#187;,</p><p style=\"text-align: justify;\">ins&#233;rer les mots&#160;:</p><p style=\"text-align: justify;\">&#171;&#160;, et concomitamment aux envois effectu&#233;s aux conseillers municipaux des communes membres d&#8217;un &#233;tablissement public de coop&#233;ration intercommunale,&#160;&#187;.</p><p style=\"text-align: justify;\">II.&#160;&#8211;&#160;En cons&#233;quence, &#224;&#160;la fin de la m&#234;me phrase, substituer aux mots&#160;:</p><p style=\"text-align: justify;\">&#171;&#160;de coop&#233;ration intercommunale&#160;&#187;</p><p style=\"text-align: justify;\">le mot&#160;:</p><p style=\"text-align: justify;\">&#171;&#160;concern&#233;&#160;&#187;.</p>",
    "exposeSommaire": "<p>Afin que la volont&#233; gouvernementale d&#8217;information la plus large possible des &#233;lus non communautaires puisse avoir un maximum de port&#233;e effective, il convient de pr&#233;ciser que l&#8217;envoi des documents concern&#233;s se fait dans les m&#234;mes d&#233;lais que ceux d&#233;termin&#233;s pour les conseillers communautaires.</p>",
    "annexeExposeSommaire": {
      "@xmlns:xsi": "http://www.w3.org/2001/XMLSchema-instance",
      "@xsi:nil": "true"
    },
    "cartoucheDelaiDepotDepasse": {
      "@xmlns:xsi": "http://www.w3.org/2001/XMLSchema-instance",
      "@xsi:nil": "true"
    },
    "avantAppel": {
      "@xmlns:xsi": "http://www.w3.org/2001/XMLSchema-instance",
      "@xsi:nil": "true"
    }
  },
  "representations": {
    "representation": {
      "nom": "PDF",
      "typeMime": {
        "type": "application",
        "subType": "PDF"
      },
      "statutRepresentation": {
        "verbatim": "true",
        "canonique": "true",
        "officielle": "true",
        "transcription": "false",
        "enregistrement": "false"
      },
      "repSource": {
        "@xmlns:xsi": "http://www.w3.org/2001/XMLSchema-instance",
        "@xsi:nil": "true"
      },
      "offset": {
        "@xmlns:xsi": "http://www.w3.org/2001/XMLSchema-instance",
        "@xsi:nil": "true"
      },
      "contenu": {
        "documentURI": "/15/amendements/2401/AN/537.pdf"
      },
      "dateDispoRepresentation": {
        "@xmlns:xsi": "http://www.w3.org/2001/XMLSchema-instance",
        "@xsi:nil": "true"
      }
    }
  },
  "seanceDiscussion": "RUANR5L15S2020IDS21949",
  "sort": {
    "dateSaisie": "2019-11-19T21:36:44.000+01:00",
    "sortEnSeance": "Tombé"
  },
  "dateDepot": "2019-11-14T01:00:00.000+01:00",
  "dateDistribution": "2019-11-17T01:00:00.000+01:00",
  "article99": "0",
  "loiReference": {
    "codeLoi": {
      "@xmlns:xsi": "http://www.w3.org/2001/XMLSchema-instance",
      "@xsi:nil": "true"
    },
    "divisionCodeLoi": {
      "@xmlns:xsi": "http://www.w3.org/2001/XMLSchema-instance",
      "@xsi:nil": "true"
    }
  }
}