{
  "@xmlns": "http://schemas.assemblee-nationale.fr/referentiel",
  "uid": "AMANR5L15PO757134B1088P0D1N2405",
  "identifiant": {
    "legislature": "15",
    "numero": "2405",
    "numRect": "0",
    "saisine": {
      "refTexteLegislatif": "PRJLANR5L15B1088",
      "numeroPartiePLF": "0",
      "organeExamen": "PO757134",
      "mentionSecondeDeliberation": "0"
    }
  },
  "numeroLong": "2405",
  "etapeTexte": "1ère lecture (1ère assemblée saisie)",
  "triAmendement": "efaaaaaaaaaaaaaaaaaaaaaaaaaaaaaaaaaaaaaaaaaaaaaaaaho",
  "cardinaliteAmdtMultiples": "1",
  "amendementParent": {
    "@xmlns:xsi": "http://www.w3.org/2001/XMLSchema-instance",
    "@xsi:nil": "true"
  },
  "etat": "Discuté",
  "signataires": {
    "auteur": {
      "typeAuteur": "Depute",
      "acteurRef": "PA721836",
      "organeRef": {
        "@xmlns:xsi": "http://www.w3.org/2001/XMLSchema-instance",
        "@xsi:nil": "true"
      },
      "groupePolitiqueRef": "PO730970"
    },
    "cosignataires": {
      "acteurRef": [
        "PA721836",
        "PA721134"
      ]
    },
    "texteAffichable": "M.&#160;Barrot, rapporteur th&#233;matique et M.&#160;Lescure, rapporteur"
  },
  "pointeurFragmentTexte": {
    "missionVisee": {
      "@xmlns:xsi": "http://www.w3.org/2001/XMLSchema-instance",
      "@xsi:nil": "true"
    },
    "division": {
      "titre": "Article 36",
      "articleDesignationCourte": "ART. 36",
      "type": "ARTICLE",
      "avant_A_Apres": "A",
      "divisionRattachee": "ARTICLE 36",
      "articleAdditionnel": {
        "@xmlns:xsi": "http://www.w3.org/2001/XMLSchema-instance",
        "@xsi:nil": "true"
      },
      "chapitreAdditionnel": {
        "@xmlns:xsi": "http://www.w3.org/2001/XMLSchema-instance",
        "@xsi:nil": "true"
      },
      "urlDivisionTexteVise": "/15/textes/1088.asp#D_Article_36"
    },
    "alinea": {
      "@xmlns:xsi": "http://www.w3.org/2001/XMLSchema-instance",
      "@xsi:nil": "true"
    }
  },
  "corps": {
    "dispositif": "<p style=\"text-align: justify;\">R&#233;diger ainsi cet article&#160;:</p><p style=\"text-align: justify;\">&#171;&#160;L&#8217;article L.&#160;518&#8209;16 du code mon&#233;taire et financier est ainsi modifi&#233;&#160;:</p><p style=\"text-align: justify;\">&#171;&#160;1&#176; Le mot&#160;: &#171;&#160;d&#233;termin&#233;e&#160;&#187; est remplac&#233; par les mots&#160;: &#171;&#160;fix&#233;e par d&#233;cret&#160;&#187;&#160;;</p><p style=\"text-align: justify;\">&#171;&#160;2&#176; &#192; la fin, les mots&#160;: &#171;&#160;saisie par le directeur g&#233;n&#233;ral, dans le cadre des lois et r&#232;glements fixant le statut de l&#8217;&#233;tablissement&#160;&#187; sont supprim&#233;s&#160;;</p><p style=\"text-align: justify;\">&#171;&#160;3&#176; Est ajout&#233;e une phrase ainsi r&#233;dig&#233;e&#160;: &#171;&#160;Ce versement ne saurait, par son montant, &#234;tre de nature &#224; mettre en cause la solvabilit&#233; de la Caisse des d&#233;p&#244;ts et consignations ou le respect par celle-ci des r&#232;gles prudentielles qui lui sont applicables.&#160;&#187;</p>",
    "exposeSommaire": "<p style=\"text-align: justify;\">Il convient de garantir que la fixation unilat&#233;rale par l&#8217;&#201;tat du montant du versement annuel de la Caisse &#224; ce dernier ne saurait aboutir &#224; remettre en cause la solvabilit&#233; de la Caisse ou la mettre en difficult&#233; d&#8217;un point de vue prudentiel.</p>",
    "annexeExposeSommaire": {
      "@xmlns:xsi": "http://www.w3.org/2001/XMLSchema-instance",
      "@xsi:nil": "true"
    }
  },
  "representations": {
    "representation": {
      "nom": "PDF",
      "typeMime": {
        "type": "application",
        "subType": "PDF"
      },
      "statutRepresentation": {
        "verbatim": "true",
        "canonique": "true",
        "officielle": "true",
        "transcription": "false",
        "enregistrement": "false"
      },
      "repSource": {
        "@xmlns:xsi": "http://www.w3.org/2001/XMLSchema-instance",
        "@xsi:nil": "true"
      },
      "offset": {
        "@xmlns:xsi": "http://www.w3.org/2001/XMLSchema-instance",
        "@xsi:nil": "true"
      },
      "contenu": {
        "documentURI": "/15/amendements/1088/CSPACTE/2405.pdf"
      },
      "dateDispoRepresentation": {
        "@xmlns:xsi": "http://www.w3.org/2001/XMLSchema-instance",
        "@xsi:nil": "true"
      }
    }
  },
  "seanceDiscussion": {
    "@xmlns:xsi": "http://www.w3.org/2001/XMLSchema-instance",
    "@xsi:nil": "true"
  },
  "sort": {
    "dateSaisie": "2018-09-13T15:15:01.000+02:00",
    "sortEnSeance": "Adopté"
  },
  "dateDepot": "2018-09-13T02:00:00.000+02:00",
  "dateDistribution": "2018-09-13T02:00:00.000+02:00",
  "article99": "0",
  "loiReference": {
    "codeLoi": {
      "@xmlns:xsi": "http://www.w3.org/2001/XMLSchema-instance",
      "@xsi:nil": "true"
    },
    "divisionCodeLoi": {
      "@xmlns:xsi": "http://www.w3.org/2001/XMLSchema-instance",
      "@xsi:nil": "true"
    }
  }
}