{
  "@xmlns": "http://schemas.assemblee-nationale.fr/referentiel",
  "uid": "AMANR5L15PO419865B0627P0D1N360",
  "identifiant": {
    "legislature": "15",
    "numero": "360",
    "numRect": "0",
    "saisine": {
      "refTexteLegislatif": "PRJLANR5L15B0627",
      "numeroPartiePLF": "0",
      "organeExamen": "PO419865",
      "mentionSecondeDeliberation": "0"
    }
  },
  "numeroLong": "CD360",
  "etapeTexte": "1ère lecture (1ère assemblée saisie)",
  "triAmendement": "fvs",
  "cardinaliteAmdtMultiples": "1",
  "amendementParent": {
    "@xmlns:xsi": "http://www.w3.org/2001/XMLSchema-instance",
    "@xsi:nil": "true"
  },
  "etat": "Discuté",
  "signataires": {
    "auteur": {
      "typeAuteur": "Depute",
      "acteurRef": "PA605694",
      "organeRef": {
        "@xmlns:xsi": "http://www.w3.org/2001/XMLSchema-instance",
        "@xsi:nil": "true"
      },
      "groupePolitiqueRef": "PO723569"
    },
    "cosignataires": {
      "acteurRef": "PA605694"
    },
    "texteAffichable": "M.&#160;Falorni"
  },
  "pointeurFragmentTexte": {
    "missionVisee": {
      "@xmlns:xsi": "http://www.w3.org/2001/XMLSchema-instance",
      "@xsi:nil": "true"
    },
    "division": {
      "titre": "Article 13",
      "articleDesignationCourte": "ART. 13",
      "type": "ARTICLE",
      "avant_A_Apres": "A",
      "divisionRattachee": "ARTICLE 13",
      "articleAdditionnel": {
        "@xmlns:xsi": "http://www.w3.org/2001/XMLSchema-instance",
        "@xsi:nil": "true"
      },
      "chapitreAdditionnel": {
        "@xmlns:xsi": "http://www.w3.org/2001/XMLSchema-instance",
        "@xsi:nil": "true"
      },
      "urlDivisionTexteVise": "/15/textes/0627.asp#D_Article_13"
    },
    "alinea": {
      "avant_A_Apres": "Apres",
      "numero": "5",
      "alineaDesignation": {
        "@xmlns:xsi": "http://www.w3.org/2001/XMLSchema-instance",
        "@xsi:nil": "true"
      }
    }
  },
  "corps": {
    "dispositif": "<p style=\"text-align: justify;\">Compl&#233;ter cet article par les cinq alin&#233;as suivants&#160;:</p><p style=\"text-align: justify;\">&#171;&#160;III&#160;&#8211;&#160;La section 4 du chapitre IV du titre Ier du livre II du m&#234;me code est compl&#233;t&#233;e par un article L.&#160;214&#8209;13 ainsi r&#233;dig&#233;&#160;:</p><p style=\"text-align: justify;\">&#171;&#160;<i>Art. L. 214&#8209;13</i>. - Pour les transports d&#8217;animaux au d&#233;part du territoire fran&#231;ais et &#224; destination de pays tiers de l&#8217;Union&#160;europ&#233;enne, les conditions particuli&#232;res suivantes s&#8217;appliquent&#160;:</p><p style=\"text-align: justify;\">&#171;&#160;-&#160;Un accord de partenariat entre la France et le pays tiers de destination encadre la protection des animaux durant le transport, l&#8217;abattage et les op&#233;rations annexes. Il encadre l&#8217;application des recommandations relatives au bien-&#234;tre animal durant l&#8217;&#233;levage, le transport et l&#8217;abattage, de l&#8217;Organisation mondiale de la sant&#233; animale dans le pays de destination&#160;;</p><p style=\"text-align: justify;\">&#171;&#160;-&#160;L&#8217;organisateur de transport dispose d&#8217;un certificat pour l&#8217;exportation d&#233;livr&#233; par les autorit&#233;s comp&#233;tentes permettant de garantir que le traitement et l&#8217;abattage des animaux export&#233;s au sein du pays importateur sont conformes aux recommandations de l&#8217;Organisation mondiale de la sant&#233; animale relatives au bien-&#234;tre animal jusqu&#8217;au point d&#8217;abattage. L&#8217;organisateur de transport doit justifier d&#8217;une tra&#231;abilit&#233; compl&#232;te de la cha&#238;ne logistique dans le pays de destination, du transport &#224; l&#8217;abattage des animaux export&#233;s, appuy&#233; d&#8217;un audit ind&#233;pendant des standards de bien-&#234;tre animal appliqu&#233;s.</p><p style=\"text-align: justify;\">&#171;&#160;Un d&#233;cret en Conseil d&#8217;&#201;tat pr&#233;cise les modalit&#233;s d&#8217;application du pr&#233;sent article.&#160;&#187;</p>",
    "exposeSommaire": "<p style=\"text-align: justify;\">Chaque ann&#233;e, environ trois millions d&#8217;animaux sont export&#233;s de l&#8217;Union&#160;Europ&#233;enne vers des pays tiers, notamment vers l&#8217;Afrique et le Moyen-Orient. La France figure parmi les premiers exportateurs, principalement vers les pays d&#8217;Afrique du Nord (Alg&#233;rie, Maroc, Libye), le Moyen-Orient (Liban) et la Turquie.</p><p style=\"text-align: justify;\">Le r&#232;glement 1/2005 du Conseil du 22 d&#233;cembre 2004 relatif &#224; la protection des animaux pendant le transport et les op&#233;rations annexes s&#8217;applique th&#233;oriquement aux animaux m&#234;me une fois qu&#8217;ils ont quitt&#233; l&#8217;Union&#160;europ&#233;enne (jurisprudence Zuchtvieh C-424/13). Pourtant, une fois franchies les fronti&#232;res de l&#8217;Europe, la r&#233;alit&#233; est tout autre&#160;: les voyages peuvent durer jusqu&#8217;&#224; 14 jours dans des conditions d&#8217;extr&#234;me densit&#233; de chargement, sous des chaleurs d&#233;passant parfois les 40&#176;C, sans temps de repos appropri&#233;, ni suffisamment de nourriture ou d&#8217;eau&#160;; les conditions d&#8217;engraissement et d&#8217;abattage &#224; l&#8217;arriv&#233;e se d&#233;roulent dans des conditions qui, pour la plupart, sont contraires aux standards internationaux de l&#8217;Organisation Mondiale de la Sant&#233; Animale (OIE).</p><p style=\"text-align: justify;\">Depuis 2011, &#224; la suite de nombreux scandales relatifs aux conditions de traitement des animaux dans les pays de destination, (en particulier l&#8217;Indon&#233;sie), l&#8217;Australie a mis en place un syst&#232;me assurantiel (Exporter Supply Chain Assurance System&#160;&#8211;&#160;ESCAS) qui exige des exportateurs de garantir que les animaux seront trait&#233;s &#224; l&#8217;arriv&#233;e en conformit&#233; avec les recommandations de l&#8217;OIE sur le bien-&#234;tre animal.</p><p style=\"text-align: justify;\">Fort de cet exemple, il est propos&#233; par cet amendement d&#8217;introduire un encadrement sp&#233;cifique des exportations d&#8217;animaux vivants vers des pays hors de l&#8217;Union&#160;europ&#233;enne, par l&#8217;obligation d&#8217;introduire dans les accords de partenariat avec les pays de destination des clauses encadrant la protection des animaux dans les pays de destination, ainsi que la mise en place d&#8217;un certificat export sur le mod&#232;le australien.</p>",
    "annexeExposeSommaire": {
      "@xmlns:xsi": "http://www.w3.org/2001/XMLSchema-instance",
      "@xsi:nil": "true"
    }
  },
  "representations": {
    "representation": {
      "nom": "PDF",
      "typeMime": {
        "type": "application",
        "subType": "PDF"
      },
      "statutRepresentation": {
        "verbatim": "true",
        "canonique": "true",
        "officielle": "true",
        "transcription": "false",
        "enregistrement": "false"
      },
      "repSource": {
        "@xmlns:xsi": "http://www.w3.org/2001/XMLSchema-instance",
        "@xsi:nil": "true"
      },
      "offset": {
        "@xmlns:xsi": "http://www.w3.org/2001/XMLSchema-instance",
        "@xsi:nil": "true"
      },
      "contenu": {
        "documentURI": "/15/amendements/0627/CION-DVP/CD360.pdf"
      },
      "dateDispoRepresentation": {
        "@xmlns:xsi": "http://www.w3.org/2001/XMLSchema-instance",
        "@xsi:nil": "true"
      }
    }
  },
  "seanceDiscussion": {
    "@xmlns:xsi": "http://www.w3.org/2001/XMLSchema-instance",
    "@xsi:nil": "true"
  },
  "sort": {
    "dateSaisie": "2018-03-29T10:24:12.000+02:00",
    "sortEnSeance": "Rejeté"
  },
  "dateDepot": "2018-03-23T01:00:00.000+01:00",
  "dateDistribution": "2018-03-26T02:00:00.000+02:00",
  "article99": "0",
  "loiReference": {
    "codeLoi": {
      "@xmlns:xsi": "http://www.w3.org/2001/XMLSchema-instance",
      "@xsi:nil": "true"
    },
    "divisionCodeLoi": {
      "@xmlns:xsi": "http://www.w3.org/2001/XMLSchema-instance",
      "@xsi:nil": "true"
    }
  }
}