{
  "@xmlns": "http://schemas.assemblee-nationale.fr/referentiel",
  "uid": "AMANR5L15SEA717460BTC0369P0D1N127",
  "identifiant": {
    "legislature": "15",
    "numero": "127",
    "numRect": "0",
    "saisine": {
      "refTexteLegislatif": "PRJLANR5L15BTC0369",
      "numeroPartiePLF": "0",
      "organeExamen": "PO717460",
      "mentionSecondeDeliberation": "0"
    }
  },
  "numeroLong": "127",
  "etapeTexte": "1ère lecture (1ère assemblée saisie)",
  "triAmendement": "c",
  "cardinaliteAmdtMultiples": "1",
  "amendementParent": {
    "@xmlns:xsi": "http://www.w3.org/2001/XMLSchema-instance",
    "@xsi:nil": "true"
  },
  "etat": "Discuté",
  "signataires": {
    "auteur": {
      "typeAuteur": "Depute",
      "acteurRef": "PA719930",
      "organeRef": {
        "@xmlns:xsi": "http://www.w3.org/2001/XMLSchema-instance",
        "@xsi:nil": "true"
      },
      "groupePolitiqueRef": "PO730946"
    },
    "cosignataires": {
      "acteurRef": [
        "PA607553",
        "PA609590",
        "PA609332",
        "PA335054",
        "PA643145",
        "PA588886",
        "PA719930",
        "PA1592",
        "PA608172",
        "PA405480",
        "PA335532",
        "PA608011",
        "PA605069",
        "PA340343",
        "PA1198",
        "PA1809",
        "PA508",
        "PA642764",
        "PA333818",
        "PA1008",
        "PA267233",
        "PA333285",
        "PA332614",
        "PA610681",
        "PA720988",
        "PA342415",
        "PA337483",
        "PA608695",
        "PA335999",
        "PA330357",
        "PA429893"
      ]
    },
    "texteAffichable": "M.&#160;Vallaud,  M.&#160;Aviragnet, Mme&#160;Bareigts, Mme&#160;Vainqueur-Christophe, Mme&#160;Batho, Mme&#160;Battistel, Mme&#160;Bi&#233;mouret, M.&#160;Bouillon, M.&#160;Jean-Louis&#160;Bricout, M.&#160;Carvounas, M.&#160;Alain&#160;David, Mme&#160;Laurence&#160;Dumont, M.&#160;Dussopt, M.&#160;Faure, M.&#160;Garot, M.&#160;David&#160;Habib, M.&#160;Hutin, M.&#160;Juanico, Mme&#160;Karamanli, M.&#160;J&#233;r&#244;me&#160;Lambert, M.&#160;Le Foll, M.&#160;Letchimy, Mme&#160;Manin, Mme&#160;Pau-Langevin, Mme&#160;Pires Beaune, M.&#160;Potier, M.&#160;Pueyo, M.&#160;Pupponi, Mme&#160;Rabault, M.&#160;Saulignac et Mme&#160;Untermaier"
  },
  "pointeurFragmentTexte": {
    "missionVisee": {
      "@xmlns:xsi": "http://www.w3.org/2001/XMLSchema-instance",
      "@xsi:nil": "true"
    },
    "division": {
      "titre": "Article PREMIER",
      "articleDesignationCourte": "ART. PREMIER",
      "type": "ARTICLE",
      "avant_A_Apres": "A",
      "divisionRattachee": "ARTICLE PREMIER",
      "articleAdditionnel": {
        "@xmlns:xsi": "http://www.w3.org/2001/XMLSchema-instance",
        "@xsi:nil": "true"
      },
      "chapitreAdditionnel": {
        "@xmlns:xsi": "http://www.w3.org/2001/XMLSchema-instance",
        "@xsi:nil": "true"
      },
      "urlDivisionTexteVise": "/15/textes/0369.asp#D_Article_1er"
    },
    "alinea": {
      "avant_A_Apres": {
        "@xmlns:xsi": "http://www.w3.org/2001/XMLSchema-instance",
        "@xsi:nil": "true"
      },
      "numero": "1",
      "alineaDesignation": {
        "@xmlns:xsi": "http://www.w3.org/2001/XMLSchema-instance",
        "@xsi:nil": "true"
      }
    }
  },
  "corps": {
    "dispositif": "<p style=\"text-align: justify;\">&#192; la fin, substituer au mot&#160;: &#171;&#160;ratifi&#233;e&#160;&#187;, le mot&#160;: &#171;&#160;abrog&#233;e&#160;&#187;.</p>",
    "exposeSommaire": "<p style=\"text-align: justify;\">Par cet amendement nous proposons de supprimer l&#8217;ordonnance relative au renforcement de la n&#233;gociation collective.</p><p style=\"text-align: justify;\">Cette ordonnance entend offrir une place centrale &#224; la n&#233;gociation d&#8217;entreprise laquelle pourrait d&#233;roger aux dispositions de la branche, sauf pour certains domaines.</p><p style=\"text-align: justify;\">Le travail de r&#233;&#233;quilibrage des r&#244;les entre la branche et l&#8217;entreprise n&#8217;est pas nouveau puisque 3 lois en 10 ans ont trait&#233; ce sujet. Dans la loi Travail nous avons d&#233;j&#224; demand&#233; aux branches de d&#233;finir les cas dans lesquels les accords d&#8217;entreprise ne peuvent pas &#234;tre moins favorables que les accords de branche. Mais remettre en cause le r&#244;le r&#233;gulateur de la branche serait catastrophique d&#8217;abord pour les salari&#233;s mais aussi pour les TPE/PME qui s&#8217;appuient en permanence sur les accords de branche.</p><p style=\"text-align: justify;\">Vous nous demandez aujourd&#8217;hui d&#8217;accorder plus de place &#224; la n&#233;gociation collective mais vos ordonnances et notamment la deuxi&#232;me font preuve de d&#233;fiance &#224; l&#8217;&#233;gard des organisations syndicales notamment dans les entreprises de moins de 50 salari&#233;s. De plus les incertitudes quant aux moyens allou&#233;s pour faire vivre le dialogue social sont particuli&#232;rement importantes puisque vous nous renvoyez au d&#233;cret. Finalement vous nous proposez beaucoup d&#8217;agilit&#233; mais peu de s&#233;curit&#233; pour les salari&#233;s comme pour les acteurs du dialogue social.</p>",
    "annexeExposeSommaire": {
      "@xmlns:xsi": "http://www.w3.org/2001/XMLSchema-instance",
      "@xsi:nil": "true"
    }
  },
  "representations": {
    "representation": {
      "nom": "PDF",
      "typeMime": {
        "type": "application",
        "subType": "PDF"
      },
      "statutRepresentation": {
        "verbatim": "true",
        "canonique": "true",
        "officielle": "true",
        "transcription": "false",
        "enregistrement": "false"
      },
      "repSource": {
        "@xmlns:xsi": "http://www.w3.org/2001/XMLSchema-instance",
        "@xsi:nil": "true"
      },
      "offset": {
        "@xmlns:xsi": "http://www.w3.org/2001/XMLSchema-instance",
        "@xsi:nil": "true"
      },
      "contenu": {
        "documentURI": "/15/amendements/0369/AN/127.pdf"
      },
      "dateDispoRepresentation": {
        "@xmlns:xsi": "http://www.w3.org/2001/XMLSchema-instance",
        "@xsi:nil": "true"
      }
    }
  },
  "seanceDiscussion": "RUANR5L15S2018IDS20775",
  "sort": {
    "dateSaisie": "2017-11-21T22:58:45.000+01:00",
    "sortEnSeance": "Rejeté"
  },
  "dateDepot": "2017-11-17T01:00:00.000+01:00",
  "dateDistribution": "2017-11-20T01:00:00.000+01:00",
  "article99": "0",
  "loiReference": {
    "codeLoi": {
      "@xmlns:xsi": "http://www.w3.org/2001/XMLSchema-instance",
      "@xsi:nil": "true"
    },
    "divisionCodeLoi": {
      "@xmlns:xsi": "http://www.w3.org/2001/XMLSchema-instance",
      "@xsi:nil": "true"
    }
  }
}