{
  "@xmlns": "http://schemas.assemblee-nationale.fr/referentiel",
  "uid": "AMANR5L15SEA717460B1490P0D1N1346",
  "identifiant": {
    "legislature": "15",
    "numero": "1346",
    "numRect": "0",
    "saisine": {
      "refTexteLegislatif": "PRJLANR5L15B1490",
      "numeroPartiePLF": "0",
      "organeExamen": "PO717460",
      "mentionSecondeDeliberation": "1"
    }
  },
  "numeroLong": "1346",
  "etapeTexte": "Nouvelle Lecture",
  "triAmendement": "kecaaaaaaaaaaaaaaaaaaaaaaaaaaaaaaaaaaaaaaaaaaaaaaahk",
  "cardinaliteAmdtMultiples": "1",
  "amendementParent": "AMANR5L15SEA717460B1490P0D1N962",
  "etat": "Discuté",
  "signataires": {
    "auteur": {
      "typeAuteur": "Depute",
      "acteurRef": "PA720728",
      "organeRef": {
        "@xmlns:xsi": "http://www.w3.org/2001/XMLSchema-instance",
        "@xsi:nil": "true"
      },
      "groupePolitiqueRef": "PO730970"
    },
    "cosignataires": {
      "acteurRef": "PA720728"
    },
    "texteAffichable": "M.&#160;Mattei"
  },
  "pointeurFragmentTexte": {
    "missionVisee": {
      "@xmlns:xsi": "http://www.w3.org/2001/XMLSchema-instance",
      "@xsi:nil": "true"
    },
    "division": {
      "titre": "Article 58 quinquies",
      "articleDesignationCourte": "ART. 58 QUINQUIES",
      "type": "ARTICLE",
      "avant_A_Apres": "A",
      "divisionRattachee": "ARTICLE 58 QUINQUIES",
      "articleAdditionnel": {
        "@xmlns:xsi": "http://www.w3.org/2001/XMLSchema-instance",
        "@xsi:nil": "true"
      },
      "chapitreAdditionnel": {
        "@xmlns:xsi": "http://www.w3.org/2001/XMLSchema-instance",
        "@xsi:nil": "true"
      },
      "urlDivisionTexteVise": "/15/textes/1490.asp#D_Article_58_quinquies"
    },
    "alinea": {
      "@xmlns:xsi": "http://www.w3.org/2001/XMLSchema-instance",
      "@xsi:nil": "true"
    }
  },
  "corps": {
    "dispositif": "<p>I.&#160;&#8211;&#160;Apr&#232;s la derni&#232;re occurrence de l&#8217;ann&#233;e&#160;:</p><p>&#171;&#160;2018&#160;&#187;,</p><p>r&#233;diger ainsi la fin de l&#8217;alin&#233;a&#160;2&#160;:</p><p>&#171;&#160;, &#224; la condition que le contrat de r&#233;servation ou la promesse de vente en tenant lieu ait acquis date certaine par l&#8217;enregistrement ou le d&#233;p&#244;t au rang des minutes d&#8217;un notaire avant le 31 d&#233;cembre 2018 et que la vente soit sign&#233;e avant le 31 mars 2019&#160;&#187;.</p><p style=\"text-align: justify;\"><span  data-cid=\"2\"   data-time=\"1545126427256\">II.&#160;&#8211;&#160;Compl&#233;ter cet amendement par l'alin&#233;a suivant&#160;:</span></p><p style=\"text-align: justify;\"><span  data-cid=\"3\"   data-time=\"1545126427257\">&#171;&#160;II.&#160;&#8211;&#160;La perte de recettes pour l&#8217;&#201;tat est compens&#233;e &#224; due concurrence par la cr&#233;ation d&#8217;une taxe additionnelle aux droits mentionn&#233;s aux articles 575 et 575 A du code g&#233;n&#233;ral des imp&#244;ts.</span></p><p style=\"text-align: justify;\">&#160;</p>",
    "exposeSommaire": "<p style=\"text-align: justify;\">Amendement de pr&#233;cisions r&#233;dactionnelle</p>",
    "annexeExposeSommaire": {
      "@xmlns:xsi": "http://www.w3.org/2001/XMLSchema-instance",
      "@xsi:nil": "true"
    },
    "cartoucheDelaiDepotDepasse": {
      "@xmlns:xsi": "http://www.w3.org/2001/XMLSchema-instance",
      "@xsi:nil": "true"
    }
  },
  "representations": {
    "representation": {
      "nom": "PDF",
      "typeMime": {
        "type": "application",
        "subType": "PDF"
      },
      "statutRepresentation": {
        "verbatim": "true",
        "canonique": "true",
        "officielle": "true",
        "transcription": "false",
        "enregistrement": "false"
      },
      "repSource": {
        "@xmlns:xsi": "http://www.w3.org/2001/XMLSchema-instance",
        "@xsi:nil": "true"
      },
      "offset": {
        "@xmlns:xsi": "http://www.w3.org/2001/XMLSchema-instance",
        "@xsi:nil": "true"
      },
      "contenu": {
        "documentURI": "/15/amendements/1490/AN/1346.pdf"
      },
      "dateDispoRepresentation": {
        "@xmlns:xsi": "http://www.w3.org/2001/XMLSchema-instance",
        "@xsi:nil": "true"
      }
    }
  },
  "seanceDiscussion": "RUANR5L15S2019IDS21433",
  "sort": {
    "dateSaisie": "2018-12-19T03:44:51.000+01:00",
    "sortEnSeance": "Rejeté"
  },
  "dateDepot": "2018-12-18T01:00:00.000+01:00",
  "dateDistribution": "2018-12-18T01:00:00.000+01:00",
  "article99": "0",
  "loiReference": {
    "codeLoi": {
      "@xmlns:xsi": "http://www.w3.org/2001/XMLSchema-instance",
      "@xsi:nil": "true"
    },
    "divisionCodeLoi": {
      "@xmlns:xsi": "http://www.w3.org/2001/XMLSchema-instance",
      "@xsi:nil": "true"
    }
  }
}