{
  "@xmlns": "http://schemas.assemblee-nationale.fr/referentiel",
  "uid": "AMANR5L15PO59048B1255P2D1N291",
  "identifiant": {
    "legislature": "15",
    "numero": "291",
    "numRect": "0",
    "saisine": {
      "refTexteLegislatif": "PRJLANR5L15B1255",
      "numeroPartiePLF": "2",
      "organeExamen": "PO59048",
      "mentionSecondeDeliberation": "0"
    }
  },
  "numeroLong": "II-CF291",
  "etapeTexte": "1ère lecture (1ère assemblée saisie)",
  "triAmendement": "bicaaaaaaaaaaaaaaaaaaaaaaaaaaaaaaaaaaaaaaaaaaaaaaai",
  "cardinaliteAmdtMultiples": "1",
  "amendementParent": {
    "@xmlns:xsi": "http://www.w3.org/2001/XMLSchema-instance",
    "@xsi:nil": "true"
  },
  "etat": "Discuté",
  "signataires": {
    "auteur": {
      "typeAuteur": "Depute",
      "acteurRef": "PA721202",
      "organeRef": {
        "@xmlns:xsi": "http://www.w3.org/2001/XMLSchema-instance",
        "@xsi:nil": "true"
      },
      "groupePolitiqueRef": "PO730958"
    },
    "cosignataires": {
      "acteurRef": [
        "PA720846",
        "PA721210",
        "PA722142",
        "PA721226",
        "PA718868",
        "PA721960",
        "PA718860",
        "PA719578",
        "PA721062",
        "PA721202",
        "PA720422",
        "PA720286",
        "PA2150",
        "PA719676",
        "PA588884",
        "PA720430",
        "PA720892"
      ]
    },
    "texteAffichable": "M.&#160;Coquerel,  Mme&#160;Autain, M.&#160;Bernalicis, M.&#160;Corbi&#232;re, Mme&#160;Fiat, M.&#160;Lachaud, M.&#160;Larive, M.&#160;M&#233;lenchon, Mme&#160;Obono, Mme&#160;Panot, M.&#160;Prud&apos;homme, M.&#160;Quatennens, M.&#160;Ratenon, Mme&#160;Ressiguier, Mme&#160;Rubin, M.&#160;Ruffin et Mme&#160;Taurine"
  },
  "pointeurFragmentTexte": {
    "missionVisee": {
      "idMissionAN": "404",
      "libelleMission": "Engagements financiers de l'État",
      "codeMissionPLF": "B",
      "libelleMissionPLF": "Répartition, par mission et programme, des crédits du budget général"
    },
    "division": {
      "titre": "Article 77",
      "articleDesignationCourte": "APRÈS ART. 77",
      "type": "ARTICLE",
      "avant_A_Apres": "Après",
      "divisionRattachee": "APRÈS L'ARTICLE 77, insérer l'article suivant:",
      "articleAdditionnel": "1",
      "chapitreAdditionnel": {
        "@xmlns:xsi": "http://www.w3.org/2001/XMLSchema-instance",
        "@xsi:nil": "true"
      },
      "urlDivisionTexteVise": "/15/textes/1255C.asp#D_Article_77"
    },
    "alinea": {
      "@xmlns:xsi": "http://www.w3.org/2001/XMLSchema-instance",
      "@xsi:nil": "true"
    }
  },
  "corps": {
    "dispositif": "<p style=\"text-align: justify;\">Le Gouvernement remet au Parlement, dans un d&#233;lai de douze mois &#224; compter de la promulgation de la pr&#233;sente loi, un rapport d&#8217;information faisant l&#8217;audit de la dette publique.</p>",
    "exposeSommaire": "<p style=\"text-align: justify;\">Ce rapport pourra &#234;tre r&#233;dig&#233; par un groupe de travail associant quatre repr&#233;sentants de l&#8217;administration (&#224; savoir un membre de l&#8217;Inspection g&#233;n&#233;rale des finances, deux membres de l&#8217;Inspection g&#233;n&#233;rale des affaires sociales et un membre de l&#8217;Inspection g&#233;n&#233;rale de l&#8217;administration) ainsi que des repr&#233;sentants d&#8217;associations, de syndicats et des universitaires.</p><p style=\"text-align: justify;\">La dette publique fran&#231;aise repr&#233;sente 98,7&#160;% du PIB. La logique lib&#233;rale et les crit&#232;res impos&#233;s par les trait&#233;s europ&#233;ens en font la pierre angulaire de toute politique budg&#233;taire. Cette logique est absurde sur le plan &#233;conomique et d&#233;sastreuse quant &#224; ses cons&#233;quences sociales.</p><p style=\"text-align: justify;\">Il est propos&#233; que le gouvernement produise un rapport d&#8217;information portant audit de la dette publique.</p><p style=\"text-align: justify;\">Il s&#8217;agit de questionner la mani&#232;re dont s&#8217;est form&#233;e la dette publique. Quelles sont les politiques publiques qui l&#8217;ont amen&#233;e &#224; son niveau actuel&#160;?</p><p style=\"text-align: justify;\">A revers du discours dominant sur l&#8217;hypertrophie de l&#8217;&#201;tat et des services publics, l&#8217;accroissement du poids de la dette est en grande partie la cons&#233;quence d&#8217;autres causes.</p><p style=\"text-align: justify;\">Ainsi, il ressort d&#8217;un rapport du Collectif pour un audit citoyen sur la dette publique publi&#233; en 2014 que&#160;:</p><p style=\"text-align: justify;\">- &#171;&#160;Si la dette a augment&#233; c&#8217;est d&#8217;abord parce que tout au long de ces ann&#233;es l&#8217;&#201;tat s&#8217;est syst&#233;matiquement priv&#233; de recettes en exon&#233;rant les m&#233;nages ais&#233;s et les grandes entreprises&#160;: du fait de la multiplication des cadeaux fiscaux et des niches, la part des recettes de l&#8217;&#201;tat dans le PIB a chut&#233; de 5 points en 30 ans.&#160;&#187;</p><p style=\"text-align: justify;\">- &#171;&#160;Si l&#8217;&#201;tat, au lieu de se d&#233;pouiller lui-m&#234;me, avait maintenu constante la part de ses recettes dans le PIB (au lieu de la baisser), la dette publique serait aujourd&#8217;hui inf&#233;rieure de 24 points de PIB (soit 488&#160;milliards&#160;d'euros) &#224; son niveau actuel.&#160;&#187;</p><p style=\"text-align: justify;\">- &#171;&#160;Si l&#8217;&#201;tat, au lieu de se financer depuis 30 ans sur les march&#233;s financiers, avait recouru &#224; des emprunts directement aupr&#232;s des m&#233;nages ou des banques &#224; un taux d&#8217;int&#233;r&#234;t r&#233;el de 2&#160;%, la dette publique serait aujourd&#8217;hui inf&#233;rieure de 29 points de PIB (soit 589&#160;milliards&#160;d'euros) &#224; son niveau actuel.&#160;&#187;</p><p style=\"text-align: justify;\">De la m&#234;me mani&#232;re, l&#8217;impact des paradis fiscaux et de la crise financi&#232;re de 2008 dans l&#8217;envol&#233;e de la dette publique doit &#234;tre analys&#233;e. Cette &#233;tude de 2014 pr&#233;cit&#233;e conclue que la part ill&#233;gitime de la dette fran&#231;aise &#8212; celle que l&#8217;&#201;tat serait fond&#233; &#224; ne pas rembourser &#8212; s&#8217;&#233;l&#232;verait &#224; 59&#160;% de son montant actuel.</p><p style=\"text-align: justify;\">En somme, la dette publique m&#233;rite d&#8217;&#234;tre analys&#233;e dans sa totalit&#233; en vue de l&#8217;examen d&#233;taill&#233; de sa l&#233;gitimit&#233;. C&#8217;est tout l&#8217;objet de ce rapport d&#8217;information portant audit de la dette publique.</p>",
    "annexeExposeSommaire": {
      "@xmlns:xsi": "http://www.w3.org/2001/XMLSchema-instance",
      "@xsi:nil": "true"
    }
  },
  "representations": {
    "representation": {
      "nom": "PDF",
      "typeMime": {
        "type": "application",
        "subType": "PDF"
      },
      "statutRepresentation": {
        "verbatim": "true",
        "canonique": "true",
        "officielle": "true",
        "transcription": "false",
        "enregistrement": "false"
      },
      "repSource": {
        "@xmlns:xsi": "http://www.w3.org/2001/XMLSchema-instance",
        "@xsi:nil": "true"
      },
      "offset": {
        "@xmlns:xsi": "http://www.w3.org/2001/XMLSchema-instance",
        "@xsi:nil": "true"
      },
      "contenu": {
        "documentURI": "/15/amendements/1255C/CION_FIN/CF291.pdf"
      },
      "dateDispoRepresentation": {
        "@xmlns:xsi": "http://www.w3.org/2001/XMLSchema-instance",
        "@xsi:nil": "true"
      }
    }
  },
  "seanceDiscussion": {
    "@xmlns:xsi": "http://www.w3.org/2001/XMLSchema-instance",
    "@xsi:nil": "true"
  },
  "sort": {
    "dateSaisie": "2018-10-24T09:23:06.000+02:00",
    "sortEnSeance": "Non soutenu"
  },
  "dateDepot": "2018-10-19T02:00:00.000+02:00",
  "dateDistribution": "2018-10-23T02:00:00.000+02:00",
  "article99": "0",
  "loiReference": {
    "codeLoi": {
      "@xmlns:xsi": "http://www.w3.org/2001/XMLSchema-instance",
      "@xsi:nil": "true"
    },
    "divisionCodeLoi": {
      "@xmlns:xsi": "http://www.w3.org/2001/XMLSchema-instance",
      "@xsi:nil": "true"
    }
  }
}