{
  "@xmlns": "http://schemas.assemblee-nationale.fr/referentiel",
  "uid": "AMANR5L15SEA717460B0911P0D1N289",
  "identifiant": {
    "legislature": "15",
    "numero": "289",
    "numRect": "0",
    "saisine": {
      "refTexteLegislatif": "PRJLANR5L15B0911",
      "numeroPartiePLF": "0",
      "organeExamen": "PO717460",
      "mentionSecondeDeliberation": "0"
    }
  },
  "numeroLong": "289",
  "etapeTexte": "1ère lecture (1ère assemblée saisie)",
  "triAmendement": "cbozzzzzi",
  "cardinaliteAmdtMultiples": "1",
  "amendementParent": {
    "@xmlns:xsi": "http://www.w3.org/2001/XMLSchema-instance",
    "@xsi:nil": "true"
  },
  "etat": "A discuter",
  "signataires": {
    "auteur": {
      "typeAuteur": "Depute",
      "acteurRef": "PA268019",
      "organeRef": {
        "@xmlns:xsi": "http://www.w3.org/2001/XMLSchema-instance",
        "@xsi:nil": "true"
      },
      "groupePolitiqueRef": "PO744425"
    },
    "cosignataires": {
      "acteurRef": [
        "PA333421",
        "PA719806",
        "PA712014",
        "PA267330",
        "PA720230",
        "PA266788",
        "PA721110",
        "PA721486",
        "PA1960",
        "PA267766",
        "PA331567",
        "PA267042",
        "PA268019",
        "PA721094",
        "PA610775",
        "PA642868"
      ]
    },
    "texteAffichable": "M.&#160;Lagarde,  Mme&#160;Auconie, M.&#160;Guy&#160;Bricout, M.&#160;Christophe, Mme&#160;de La Raudi&#232;re, M.&#160;Dunoyer, M.&#160;Favennec Becot, M.&#160;Gom&#232;s, M.&#160;Ledoux, M.&#160;Leroy, Mme&#160;Magnier, M.&#160;Morel-&#192;-L&apos;Huissier, M.&#160;Naegelen, M.&#160;Pancher, Mme&#160;Sanquer et M.&#160;Zumkeller"
  },
  "pointeurFragmentTexte": {
    "missionVisee": {
      "@xmlns:xsi": "http://www.w3.org/2001/XMLSchema-instance",
      "@xsi:nil": "true"
    },
    "division": {
      "titre": "Article 3",
      "articleDesignationCourte": "ART. 3",
      "type": "ARTICLE",
      "avant_A_Apres": "A",
      "divisionRattachee": "ARTICLE 3",
      "articleAdditionnel": {
        "@xmlns:xsi": "http://www.w3.org/2001/XMLSchema-instance",
        "@xsi:nil": "true"
      },
      "chapitreAdditionnel": {
        "@xmlns:xsi": "http://www.w3.org/2001/XMLSchema-instance",
        "@xsi:nil": "true"
      },
      "urlDivisionTexteVise": "/15/textes/0911.asp#D_Article_3"
    },
    "alinea": {
      "avant_A_Apres": {
        "@xmlns:xsi": "http://www.w3.org/2001/XMLSchema-instance",
        "@xsi:nil": "true"
      },
      "numero": "3",
      "alineaDesignation": {
        "@xmlns:xsi": "http://www.w3.org/2001/XMLSchema-instance",
        "@xsi:nil": "true"
      }
    }
  },
  "corps": {
    "dispositif": "<p style=\"text-align: justify;\">&#192; l&#8217;alin&#233;a&#160;3, substituer aux mots&#160;:</p><p style=\"text-align: justify;\">&#171;&#160;d&#233;pos&#233; ou transmis en premi&#232;re lecture&#160;&#187;,</p><p style=\"text-align: justify;\">les mots&#160;:</p><p style=\"text-align: justify;\">&#171;&#160;discut&#233; en s&#233;ance et qui n&#8217;ont pas &#233;t&#233; d&#233;pos&#233;s en commission&#160;&#187;.</p>",
    "exposeSommaire": "<p style=\"text-align: justify;\">L&#8217;article&#160;3 du projet de loi constitutionnelle pr&#233;voit de restreindre de mani&#232;re disproportionn&#233;e le droit d&#8217;amendement des parlementaires.</p><p style=\"text-align: justify;\">Aussi, cet amendement vise &#224; modifier l&#8217;article&#160;3 afin que les amendements qui sont sans lien direct avec le texte soient irrecevables uniquement lors de l&#8217;examen en s&#233;ance publique et lorsqu&#8217;ils n&#8217;ont pas &#233;t&#233; auparavant d&#233;pos&#233;s en commission. Ainsi, des amendements sans lien direct avec le texte pourront toujours &#234;tre d&#233;fendus lors de l&#8217;examen en commission puis en s&#233;ance.</p>",
    "annexeExposeSommaire": {
      "@xmlns:xsi": "http://www.w3.org/2001/XMLSchema-instance",
      "@xsi:nil": "true"
    }
  },
  "representations": {
    "representation": {
      "nom": "PDF",
      "typeMime": {
        "type": "application",
        "subType": "PDF"
      },
      "statutRepresentation": {
        "verbatim": "true",
        "canonique": "true",
        "officielle": "true",
        "transcription": "false",
        "enregistrement": "false"
      },
      "repSource": {
        "@xmlns:xsi": "http://www.w3.org/2001/XMLSchema-instance",
        "@xsi:nil": "true"
      },
      "offset": {
        "@xmlns:xsi": "http://www.w3.org/2001/XMLSchema-instance",
        "@xsi:nil": "true"
      },
      "contenu": {
        "documentURI": "/15/amendements/0911/AN/289.pdf"
      },
      "dateDispoRepresentation": {
        "@xmlns:xsi": "http://www.w3.org/2001/XMLSchema-instance",
        "@xsi:nil": "true"
      }
    }
  },
  "seanceDiscussion": {
    "@xmlns:xsi": "http://www.w3.org/2001/XMLSchema-instance",
    "@xsi:nil": "true"
  },
  "sort": {
    "@xmlns:xsi": "http://www.w3.org/2001/XMLSchema-instance",
    "@xsi:nil": "true"
  },
  "dateDepot": "2018-07-03T02:00:00.000+02:00",
  "dateDistribution": "2018-07-10T02:00:00.000+02:00",
  "article99": "0",
  "loiReference": {
    "codeLoi": {
      "@xmlns:xsi": "http://www.w3.org/2001/XMLSchema-instance",
      "@xsi:nil": "true"
    },
    "divisionCodeLoi": {
      "@xmlns:xsi": "http://www.w3.org/2001/XMLSchema-instance",
      "@xsi:nil": "true"
    }
  }
}