{
  "@xmlns": "http://schemas.assemblee-nationale.fr/referentiel",
  "uid": "AMANR5L15PO59051B1349P0D1N764",
  "identifiant": {
    "legislature": "15",
    "numero": "764",
    "numRect": "0",
    "saisine": {
      "refTexteLegislatif": "PRJLANR5L15B1349",
      "numeroPartiePLF": "0",
      "organeExamen": "PO59051",
      "mentionSecondeDeliberation": "0"
    }
  },
  "numeroLong": "CL764",
  "etapeTexte": "1ère lecture (2ème assemblée saisie)",
  "triAmendement": "dkaaaaaaaaaaaaaaaaaaaaaaaaaaaaaaaaaaaaaaaaaaaaaaaari",
  "cardinaliteAmdtMultiples": "1",
  "amendementParent": {
    "@xmlns:xsi": "http://www.w3.org/2001/XMLSchema-instance",
    "@xsi:nil": "true"
  },
  "etat": "Discuté",
  "signataires": {
    "auteur": {
      "typeAuteur": "Depute",
      "acteurRef": "PA677483",
      "organeRef": {
        "@xmlns:xsi": "http://www.w3.org/2001/XMLSchema-instance",
        "@xsi:nil": "true"
      },
      "groupePolitiqueRef": "PO730964"
    },
    "cosignataires": {
      "acteurRef": [
        "PA721344",
        "PA721262",
        "PA721498",
        "PA720342",
        "PA720402",
        "PA721328",
        "PA721800",
        "PA721670",
        "PA722300",
        "PA721584",
        "PA719302",
        "PA719756",
        "PA720830",
        "PA722244",
        "PA720394",
        "PA721710",
        "PA719632",
        "PA722102",
        "PA720278",
        "PA722134",
        "PA331835",
        "PA722062",
        "PA719600",
        "PA718962",
        "PA719242",
        "PA720318",
        "PA720242",
        "PA719294",
        "PA719616",
        "PA719118",
        "PA718910",
        "PA722382",
        "PA718944",
        "PA720454",
        "PA719092",
        "PA722118",
        "PA677483",
        "PA719330",
        "PA719186",
        "PA719692",
        "PA607595",
        "PA721764",
        "PA720202",
        "PA721458",
        "PA719412",
        "PA722190",
        "PA719032",
        "PA722150",
        "PA719910",
        "PA724827",
        "PA718810",
        "PA608641",
        "PA720354",
        "PA643205",
        "PA721644",
        "PA721784",
        "PA721946",
        "PA702054",
        "PA720520",
        "PA720138",
        "PA719528",
        "PA719814",
        "PA720512",
        "PA719472",
        "PA720878",
        "PA720378",
        "PA718894",
        "PA720298",
        "PA721024",
        "PA720370",
        "PA719080",
        "PA642788",
        "PA721792",
        "PA720560",
        "PA721036",
        "PA643175",
        "PA721690",
        "PA719624",
        "PA721718",
        "PA720268",
        "PA722070",
        "PA719464",
        "PA719170",
        "PA720154",
        "PA721142",
        "PA722260",
        "PA721296",
        "PA719100",
        "PA719660",
        "PA720046",
        "PA720870",
        "PA718736",
        "PA719388",
        "PA719922",
        "PA721808",
        "PA719130",
        "PA719338",
        "PA718710",
        "PA720806",
        "PA720538",
        "PA606202",
        "PA719718",
        "PA721246",
        "PA722000",
        "PA719728",
        "PA722228",
        "PA608083",
        "PA719440",
        "PA719218",
        "PA719350",
        "PA346876",
        "PA343493",
        "PA722086",
        "PA720916",
        "PA719496",
        "PA719250",
        "PA720170",
        "PA721218",
        "PA721166",
        "PA721824",
        "PA720590",
        "PA720944",
        "PA721852",
        "PA267673",
        "PA721844",
        "PA721750",
        "PA718756",
        "PA719372",
        "PA720116",
        "PA719882",
        "PA718794",
        "PA719456",
        "PA719194",
        "PA719006",
        "PA720446",
        "PA719798",
        "PA722008",
        "PA642724",
        "PA722312",
        "PA720190",
        "PA722292",
        "PA721450",
        "PA719520",
        "PA720054",
        "PA722236",
        "PA720038",
        "PA606639",
        "PA722358",
        "PA720960",
        "PA721434",
        "PA719952",
        "PA721426",
        "PA718990",
        "PA717379",
        "PA719770",
        "PA2828",
        "PA720900",
        "PA721600",
        "PA722398",
        "PA719108",
        "PA719972",
        "PA605084",
        "PA720814",
        "PA719684",
        "PA719154",
        "PA721336",
        "PA672",
        "PA718768",
        "PA719994",
        "PA721398",
        "PA607155",
        "PA722054",
        "PA721616",
        "PA719310",
        "PA720952",
        "PA721134",
        "PA719420",
        "PA720908",
        "PA722078",
        "PA721384",
        "PA721726",
        "PA720552",
        "PA719822",
        "PA720862",
        "PA721364",
        "PA722320",
        "PA722126",
        "PA721004",
        "PA720310",
        "PA722344",
        "PA718674",
        "PA719512",
        "PA720932",
        "PA719668",
        "PA334116",
        "PA719710",
        "PA718682",
        "PA720854",
        "PA642695",
        "PA719830",
        "PA719480",
        "PA609520",
        "PA719072",
        "PA719550",
        "PA719024",
        "PA719060",
        "PA607193",
        "PA719960",
        "PA720480",
        "PA719230",
        "PA719570",
        "PA718918",
        "PA719404",
        "PA721278",
        "PA722038",
        "PA721568",
        "PA718954",
        "PA720030",
        "PA719396",
        "PA719866",
        "PA719748",
        "PA720124",
        "PA722170",
        "PA720214",
        "PA718876",
        "PA643127",
        "PA719592",
        "PA721908",
        "PA720198",
        "PA719700",
        "PA606171",
        "PA720568",
        "PA719890",
        "PA721466",
        "PA720108",
        "PA722252",
        "PA719052",
        "PA719540",
        "PA721888",
        "PA721150",
        "PA719162",
        "PA721860",
        "PA720014",
        "PA722094",
        "PA718902",
        "PA720066",
        "PA720414",
        "PA267336",
        "PA721372",
        "PA721916",
        "PA720754",
        "PA2449",
        "PA719740",
        "PA718706",
        "PA721514",
        "PA719858",
        "PA720622",
        "PA719652",
        "PA718694",
        "PA719980",
        "PA722022",
        "PA721956",
        "PA721876",
        "PA722268",
        "PA721174",
        "PA719448",
        "PA719778",
        "PA721352",
        "PA720074",
        "PA719850",
        "PA721522",
        "PA721624",
        "PA719364",
        "PA719790",
        "PA721542",
        "PA720492",
        "PA606675",
        "PA722046",
        "PA721776",
        "PA718802",
        "PA334768",
        "PA720362",
        "PA718744",
        "PA721656",
        "PA720022",
        "PA720780",
        "PA719326",
        "PA718728",
        "PA605963",
        "PA721880",
        "PA720738",
        "PA720146",
        "PA718930",
        "PA719842",
        "PA721158",
        "PA720500",
        "PA722178",
        "PA720438",
        "PA720576",
        "PA719258",
        "PA720790",
        "PA721564",
        "PA722366",
        "PA722336",
        "PA721702",
        "PA606507",
        "PA720222"
      ]
    },
    "texteAffichable": "M.&#160;Mazars,  Mme&#160;Moutchou, Mme&#160;Abadie, Mme&#160;Avia, rapporteure M.&#160;Boudi&#233;, Mme&#160;Braun-Pivet, Mme&#160;Chalas, Mme&#160;Degois, Mme&#160;Dubost, Mme&#160;Dubr&#233;-Chirat, M.&#160;Eliaou, M.&#160;Euzet, Mme&#160;Fajgeles, M.&#160;Fauvergue, Mme&#160;Forteza, M.&#160;Gauvain, M.&#160;Gouffier-Cha, Mme&#160;Guerel, Mme&#160;Gu&#233;venoux, M.&#160;Houbron, M.&#160;Houli&#233;, Mme&#160;Kamowski, Mme&#160;Louis, M.&#160;Matras, M.&#160;Mis, M.&#160;Pont, M.&#160;Poulliat, M.&#160;Questel, M.&#160;Rebeyrotte, M.&#160;Rudigoz, M.&#160;Rupin, M.&#160;Terlier, Mme&#160;Thourot, M.&#160;Tourret, M.&#160;Villani, M.&#160;Vuilletet, Mme&#160;Zannier, Mme&#160;Abba, M.&#160;Damien&#160;Adam, M.&#160;L&#233;na&#239;ck&#160;Adam, M.&#160;Ahamada, M.&#160;Alauzet, Mme&#160;Ali, Mme&#160;Amadou, M.&#160;Anato, M.&#160;Andr&#233;, M.&#160;Anglade, M.&#160;Ardouin, M.&#160;Arend, M.&#160;Attal, M.&#160;Bachelier, Mme&#160;Bagarry, M.&#160;Baich&#232;re, M.&#160;Barbier, M.&#160;Batut, Mme&#160;Beaudouin-Hubiere, M.&#160;Belhaddad, M.&#160;Belhamiti, Mme&#160;Berg&#233;, M.&#160;Berville, M.&#160;Besson-Moreau, Mme&#160;Bessot Ballot, Mme&#160;Blanc, M.&#160;Blanchet, M.&#160;Blein, M.&#160;Bois, M.&#160;Bonnell, Mme&#160;Bono-Vandorme, M.&#160;Borowczyk, M.&#160;Bothorel, Mme&#160;Bourguignon, M.&#160;Bouyx, Mme&#160;Pascale&#160;Boyer, M.&#160;Bridey, Mme&#160;Brocard, Mme&#160;Brugnera, Mme&#160;Brulebois, Mme&#160;Brunet, M.&#160;Buchou, Mme&#160;Bureau-Bonnard, M.&#160;Cabar&#233;, Mme&#160;Calvez, Mme&#160;Cariou, Mme&#160;Cattelot, M.&#160;Causse, Mme&#160;Cazarian, Mme&#160;Cazebonne, M.&#160;Cazeneuve, M.&#160;Cazenove, M.&#160;Cellier, M.&#160;Cesarini, M.&#160;Chalumeau, Mme&#160;Chapelier, Mme&#160;Charri&#232;re, Mme&#160;Charvier, M.&#160;Chassaing, M.&#160;Chiche, M.&#160;Claireaux, Mme&#160;Clapot, Mme&#160;Cloarec, M.&#160;Colas-Roy, Mme&#160;Colboc, M.&#160;Cormier-Bouligeon, Mme&#160;Couillard, Mme&#160;Crouzet, M.&#160;Da Silva, M.&#160;Damaisin, M.&#160;Daniel, Mme&#160;Dominique&#160;David, Mme&#160;Yolaine&#160;de Courson, Mme&#160;de Lavergne, Mme&#160;de Montchalin, Mme&#160;De Temmerman, M.&#160;Marc&#160;Delatte, M.&#160;Delpon, M.&#160;Descrozaille, M.&#160;Di Pompeo, M.&#160;Dirx, M.&#160;Djebbari, Mme&#160;Do, M.&#160;Dombreval, Mme&#160;Jacqueline&#160;Dubois, Mme&#160;Dubos, Mme&#160;Dufeu Schubert, Mme&#160;Fran&#231;oise&#160;Dumas, Mme&#160;Dupont, M.&#160;D&#233;moulin, Mme&#160;Errante, Mme&#160;Fabre, Mme&#160;Faure-Muntian, M.&#160;Ferrand, M.&#160;Fi&#233;vet, M.&#160;Folliot, Mme&#160;Fontaine-Domeizel, Mme&#160;Fontenel-Personne, M.&#160;Freschi, M.&#160;Fugit, M.&#160;Gaillard, Mme&#160;Gaillot, M.&#160;Galbadon, M.&#160;Gassilloud, Mme&#160;Gayte, Mme&#160;Genetet, Mme&#160;Gipson, M.&#160;Girardin, M.&#160;Giraud, Mme&#160;Givernet, Mme&#160;Gomez-Bassac, Mme&#160;Goulet, M.&#160;Gouttefarde, Mme&#160;Grandjean, Mme&#160;Granjus, M.&#160;Grau, Mme&#160;Gregoire, M.&#160;Guerini, M.&#160;G&#233;rard, Mme&#160;Hai, Mme&#160;Hammerer, M.&#160;Haury, Mme&#160;Hennion, M.&#160;Henriet, M.&#160;Holroyd, M.&#160;Hupp&#233;, Mme&#160;H&#233;rin, Mme&#160;Iborra, M.&#160;Jacques, Mme&#160;Janvier, M.&#160;Jerretie, M.&#160;Jolivet, Mme&#160;Josso, M.&#160;Julien-Laferriere, M.&#160;Kasbarian, Mme&#160;Kerbarh, M.&#160;Kerlogot, M.&#160;Kervran, Mme&#160;Khattabi, Mme&#160;Khedher, M.&#160;Kokouendo, M.&#160;Krabal, Mme&#160;Krimi, Mme&#160;Kuric, M.&#160;Laabid, M.&#160;Labaronne, Mme&#160;Lakrafi, Mme&#160;Lang, Mme&#160;Lardet, M.&#160;Larsonneur, M.&#160;Lauzzana, Mme&#160;Lazaar, M.&#160;Le Bohec, Mme&#160;Le Feur, M.&#160;Le Gac, Mme&#160;Le Meur, Mme&#160;Le Peih, M.&#160;Le Vigoureux, Mme&#160;Lebec, M.&#160;Leclabart, Mme&#160;Lecocq, Mme&#160;Leguille-Balloy, M.&#160;Lejeune, Mme&#160;Lenne, M.&#160;Lescure, Mme&#160;Limon, M.&#160;Lioger, Mme&#160;Liso, Mme&#160;Magne, M.&#160;Maillard, Mme&#160;Maillart-M&#233;haignerie, M.&#160;Maire, Mme&#160;Jacqueline&#160;Maquet, M.&#160;Marilossian, Mme&#160;Marsaud, M.&#160;Martin, M.&#160;Mass&#233;glia, Mme&#160;Mauborgne, M.&#160;Mbaye, Mme&#160;Melchior, M.&#160;Mendes, M.&#160;Mesnier, Mme&#160;Meynier-Millefert, Mme&#160;Michel, M.&#160;Michels, Mme&#160;Mirall&#232;s, M.&#160;Moreau, M.&#160;Morenas, Mme&#160;Motin, Mme&#160;Muschotti, Mme&#160;M&#246;rch, M.&#160;Nadot, M.&#160;Nogal, Mme&#160;O, Mme&#160;O&apos;Petit, Mme&#160;Oppelt, M.&#160;Orphelin, Mme&#160;Osson, M.&#160;Paluszkiewicz, Mme&#160;Panonacle, Mme&#160;Park, M.&#160;Pellois, M.&#160;Perea, M.&#160;Perrot, M.&#160;Person, Mme&#160;Petel, Mme&#160;Val&#233;rie&#160;Petit, Mme&#160;Peyrol, Mme&#160;Peyron, M.&#160;Pichereau, M.&#160;Pietraszewski, Mme&#160;Piron, Mme&#160;Pitollat, Mme&#160;Pompili, M.&#160;Portarrieu, M.&#160;Potterie, Mme&#160;Pouzyreff, Mme&#160;Racon-Bouzon, M.&#160;Raphan, Mme&#160;Rauch, M.&#160;Renson, Mme&#160;Rilhac, Mme&#160;Riotton, Mme&#160;Rist, Mme&#160;Rixain, Mme&#160;Robert, Mme&#160;Romeiro Dias, M.&#160;Roseren, Mme&#160;Rossi, M.&#160;Rouillard, M.&#160;C&#233;dric&#160;Roussel, M.&#160;Saint-Martin, Mme&#160;Saint-Paul, Mme&#160;Sarles, M.&#160;Savatier, M.&#160;Sempastous, M.&#160;Serva, M.&#160;Simian, M.&#160;Sol&#232;re, M.&#160;Sommer, M.&#160;Son-Forget, M.&#160;Sorre, M.&#160;Studer, Mme&#160;Sylla, M.&#160;Tach&#233;, Mme&#160;Tamarelle-Verhaeghe, M.&#160;Tan, Mme&#160;Tanguy, M.&#160;Taquet, M.&#160;Test&#233;, Mme&#160;Thill, Mme&#160;Thillaye, M.&#160;Thi&#233;baut, Mme&#160;Thomas, Mme&#160;Tiegna, M.&#160;Touraine, Mme&#160;Toutut-Picard, Mme&#160;Trisse, M.&#160;Trompille, Mme&#160;Tuffnell, Mme&#160;Valetta Ardisson, Mme&#160;Vanceunebrock-Mialon, Mme&#160;Verdier-Jouclas, Mme&#160;Vidal, M.&#160;Vignal, Mme&#160;Vignon, M.&#160;V&#233;ran, Mme&#160;Wonner, M.&#160;Zulesi, M.&#160;Le Gendre et les membres du groupe La R&#233;publique en Marche"
  },
  "pointeurFragmentTexte": {
    "missionVisee": {
      "@xmlns:xsi": "http://www.w3.org/2001/XMLSchema-instance",
      "@xsi:nil": "true"
    },
    "division": {
      "titre": "Article 31",
      "articleDesignationCourte": "ART. 31",
      "type": "ARTICLE",
      "avant_A_Apres": "A",
      "divisionRattachee": "ARTICLE 31",
      "articleAdditionnel": {
        "@xmlns:xsi": "http://www.w3.org/2001/XMLSchema-instance",
        "@xsi:nil": "true"
      },
      "chapitreAdditionnel": {
        "@xmlns:xsi": "http://www.w3.org/2001/XMLSchema-instance",
        "@xsi:nil": "true"
      },
      "urlDivisionTexteVise": "/15/textes/1349.asp#D_Article_31"
    },
    "alinea": {
      "avant_A_Apres": "Apres",
      "numero": "4",
      "alineaDesignation": {
        "@xmlns:xsi": "http://www.w3.org/2001/XMLSchema-instance",
        "@xsi:nil": "true"
      }
    }
  },
  "corps": {
    "dispositif": "<p style=\"text-align: justify;\">Compl&#233;ter cet article par les sept alin&#233;as suivants&#160;:</p><p style=\"text-align: justify;\">III. - Apr&#232;s l&#8217;article&#160;706&#8209;112 du code de proc&#233;dure p&#233;nale, il est ins&#233;r&#233; un article&#160;706&#8209;112&#8209;1 ainsi r&#233;dig&#233;&#160;:</p><p style=\"text-align: justify;\">&#171;&#160;<i>Art.&#160;706&#8209;112&#8209;1</i>. - Lorsque les &#233;l&#233;ments recueillis au cours de la garde &#224; vue d&#8217;une personne font appara&#238;tre que celle-ci fait l&#8217;objet d&#8217;une mesure de protection juridique, l&#8217;officier ou l&#8217;agent de police judiciaire en avise le curateur ou le tuteur. S&#8217;il est &#233;tabli que la personne b&#233;n&#233;ficie d&#8217;une mesure de sauvegarde de justice, l&#8217;officier ou l&#8217;agent de police judiciaire avise s&#8217;il y a lieu le mandataire sp&#233;cial d&#233;sign&#233; par le juge des tutelles.</p><p style=\"text-align: justify;\">&#171;&#160;Si la personne n&#8217;est pas assist&#233;e d&#8217;un avocat ou n&#8217;a pas fait l&#8217;objet d&#8217;un examen m&#233;dical, le curateur, le tuteur ou le mandataire sp&#233;cial peuvent d&#233;signer un avocat ou demander qu&#8217;un avocat soit d&#233;sign&#233; par le b&#226;tonnier, et ils peuvent demander que la personne soit examin&#233;e par un m&#233;decin.</p><p style=\"text-align: justify;\">&#171;&#160;Sauf en cas de circonstance insurmontable, qui doit &#234;tre mentionn&#233;e au proc&#232;s-verbal, les diligences incombant aux enqu&#234;teurs en application du pr&#233;sent article doivent intervenir au plus tard dans un d&#233;lai de six heures &#224; compter du moment auquel est apparu l&#8217;existence d&#8217;une mesure de protection juridique.</p><p style=\"text-align: justify;\">&#171;&#160;Le procureur de la R&#233;publique peut, &#224; la demande de l&#8217;officier de police judiciaire, d&#233;cider que l&#8217;avis pr&#233;vu au pr&#233;sent article sera diff&#233;r&#233; ou ne sera pas d&#233;livr&#233; si cette d&#233;cision est, au regard des circonstances, indispensable afin de permettre le recueil ou la conservation des preuves ou de pr&#233;venir une atteinte grave &#224; la vie, &#224; la libert&#233; ou &#224; l&#8217;int&#233;grit&#233; physique d&#8217;une personne.&#160;&#187;</p><p style=\"text-align: justify;\">IV. -&#160;La premi&#232;re phrase du premier alin&#233;a de l&#8217;article&#160;706&#8209;113 du code de proc&#233;dure p&#233;nale est ainsi r&#233;dig&#233;e&#160;:</p><p style=\"text-align: justify;\">&#171;&#160;Lorsque la personne fait l&#8217;objet de poursuites, le procureur de la R&#233;publique ou le juge d&#8217;instruction en avise le curateur, le tuteur, ainsi que le juge des tutelles.&#160;&#187;.</p>",
    "exposeSommaire": "<p>Objet</p><p>Cet amendement tire les cons&#233;quences de la d&#233;cision QPC&#160; n&#176; 2018-730 du 14 septembre 2018 par laquelle le Conseil constitutionnel a d&#233;clar&#233; contraire &#224; la Constitution le premier alin&#233;a de l&#8217;article 706-113 code de proc&#233;dure p&#233;nale parce qu&#8217;il ne pr&#233;voyait pas l&#8217;information du curateur ou du tuteur d&#8217;une personne sous protection de justice lorsqu&#8217;elle est plac&#233;e garde &#224; vue.</p><p>&#160;</p><p>Le pr&#233;sent amendement cr&#233;e donc un nouvel article 706-112-1 qui pr&#233;voit d&#233;sormais qu&#8217;un avis doit &#234;tre donn&#233; au curateur, tuteur ou au mandataire sp&#233;cial lorsque les &#233;l&#233;ments recueillis au cours de la garde &#224; vue d&#8217;une personne font apparaitre que celle-ci b&#233;n&#233;ficie d&#8217;une mesure de protection. Ces derniers pourront si n&#233;cessaire demander que la personne soit assist&#233;e par un avocat ou soit examin&#233;e par un m&#233;decin. Dans le souci de concilier respect des droits de la d&#233;fense et efficacit&#233; de l&#8217;enqu&#234;te, il sera laiss&#233; un d&#233;lai de six heures &#224; l&#8217;enqu&#234;teur pour proc&#233;der &#224; cet avis. Cet avis pourra en outre &#234;tre diff&#233;r&#233; ou ne pas &#234;tre d&#233;livr&#233; si cette d&#233;cision est, au regard des circonstances, indispensable afin de permettre le recueil ou la conservation des preuves ou de pr&#233;venir une atteinte grave &#224; la vie, &#224; la libert&#233; ou &#224; l'int&#233;grit&#233; physique d'une personne, soit dans les m&#234;mes cas que ceux pr&#233;vus par l&#8217;article 63-2 du code de proc&#233;dure p&#233;nale pour diff&#233;rer le droit &#224; l&#8217;assistance d&#8217;un avocat.</p><p>&#160;</p>",
    "annexeExposeSommaire": {
      "@xmlns:xsi": "http://www.w3.org/2001/XMLSchema-instance",
      "@xsi:nil": "true"
    }
  },
  "representations": {
    "representation": {
      "nom": "PDF",
      "typeMime": {
        "type": "application",
        "subType": "PDF"
      },
      "statutRepresentation": {
        "verbatim": "true",
        "canonique": "true",
        "officielle": "true",
        "transcription": "false",
        "enregistrement": "false"
      },
      "repSource": {
        "@xmlns:xsi": "http://www.w3.org/2001/XMLSchema-instance",
        "@xsi:nil": "true"
      },
      "offset": {
        "@xmlns:xsi": "http://www.w3.org/2001/XMLSchema-instance",
        "@xsi:nil": "true"
      },
      "contenu": {
        "documentURI": "/15/amendements/1349/CION_LOIS/CL764.pdf"
      },
      "dateDispoRepresentation": {
        "@xmlns:xsi": "http://www.w3.org/2001/XMLSchema-instance",
        "@xsi:nil": "true"
      }
    }
  },
  "seanceDiscussion": {
    "@xmlns:xsi": "http://www.w3.org/2001/XMLSchema-instance",
    "@xsi:nil": "true"
  },
  "sort": {
    "dateSaisie": "2018-11-08T18:32:42.000+01:00",
    "sortEnSeance": "Adopté"
  },
  "dateDepot": "2018-11-03T01:00:00.000+01:00",
  "dateDistribution": "2018-11-06T01:00:00.000+01:00",
  "article99": "0",
  "loiReference": {
    "codeLoi": "procédure pénale",
    "divisionCodeLoi": "706-112 2 id"
  }
}