{
  "@xmlns": "http://schemas.assemblee-nationale.fr/referentiel",
  "uid": "AMANR5L15SEA717460BTC1547P0D1N203",
  "identifiant": {
    "legislature": "15",
    "numero": "203",
    "numRect": "0",
    "saisine": {
      "refTexteLegislatif": "PRJLANR5L15BTC1547",
      "numeroPartiePLF": "0",
      "organeExamen": "PO717460",
      "mentionSecondeDeliberation": "0"
    }
  },
  "numeroLong": "203",
  "etapeTexte": "1ère lecture (1ère assemblée saisie)",
  "triAmendement": "baaaaaaaaaaaaaaaaaaaaaaaaaaaaaaaaaaaaaaaaaaaaaaaaaczzu",
  "cardinaliteAmdtMultiples": "1",
  "amendementParent": {
    "@xmlns:xsi": "http://www.w3.org/2001/XMLSchema-instance",
    "@xsi:nil": "true"
  },
  "etat": "Discuté",
  "signataires": {
    "auteur": {
      "typeAuteur": "Depute",
      "acteurRef": "PA334149",
      "organeRef": {
        "@xmlns:xsi": "http://www.w3.org/2001/XMLSchema-instance",
        "@xsi:nil": "true"
      },
      "groupePolitiqueRef": "PO730934"
    },
    "cosignataires": {
      "acteurRef": [
        "PA346054",
        "PA720386",
        "PA334149",
        "PA642847"
      ]
    },
    "texteAffichable": "M.&#160;Fasquelle,  M.&#160;Di Filippo, M.&#160;Bazin et M.&#160;Emmanuel&#160;Maquet"
  },
  "pointeurFragmentTexte": {
    "missionVisee": {
      "@xmlns:xsi": "http://www.w3.org/2001/XMLSchema-instance",
      "@xsi:nil": "true"
    },
    "division": {
      "titre": "Article PREMIER",
      "articleDesignationCourte": "ART. PREMIER",
      "type": "ARTICLE",
      "avant_A_Apres": "A",
      "divisionRattachee": "ARTICLE PREMIER",
      "articleAdditionnel": {
        "@xmlns:xsi": "http://www.w3.org/2001/XMLSchema-instance",
        "@xsi:nil": "true"
      },
      "chapitreAdditionnel": {
        "@xmlns:xsi": "http://www.w3.org/2001/XMLSchema-instance",
        "@xsi:nil": "true"
      },
      "urlDivisionTexteVise": "/15/textes/1547.asp#D_Article_1er"
    },
    "alinea": {
      "avant_A_Apres": "Apres",
      "numero": "9",
      "alineaDesignation": {
        "@xmlns:xsi": "http://www.w3.org/2001/XMLSchema-instance",
        "@xsi:nil": "true"
      }
    }
  },
  "corps": {
    "dispositif": "<p style=\"text-align: justify;\">I. &#8211; Apr&#232;s l&#8217;alin&#233;a&#160;9, ins&#233;rer l&#8217;alin&#233;a suivant&#160;:</p><p style=\"text-align: justify;\">&#171;&#160;IV <i>bis.</i> &#8211; Le principe, les exon&#233;rations ainsi que les modalit&#233;s de versement de cette prime exceptionnelle peuvent &#234;tre reconduits chaque ann&#233;e &#224; compter du 1<sup>er</sup> janvier 2020.&#160;&#187;</p><p style=\"text-align: justify;\">II. &#8211; Compl&#233;ter cet article par les deux alin&#233;as suivants&#160;:</p><p style=\"text-align: justify;\">&#171;&#160;VI. &#8211; La perte de recettes pour l&#8217;&#201;tat est compens&#233;e &#224; due concurrence par la cr&#233;ation d&#8217;une taxe additionnelle aux droits mentionn&#233;s aux articles 575 et 575 A du code g&#233;n&#233;ral des imp&#244;ts.</p><p style=\"text-align: justify;\">&#171;&#160;VII. &#8211; La perte de recettes pour les organismes de s&#233;curit&#233; sociale est compens&#233;e &#224; due concurrence par la majoration des droits mentionn&#233;s aux articles 575 et 575 A du code g&#233;n&#233;ral des imp&#244;ts.&#160;&#187;.</p>",
    "exposeSommaire": "<p>De fa&#231;on &#224; soutenir le pouvoir d&#8217;achat des m&#233;nages, mais aussi &#224; valoriser le travail des salari&#233;s, tout en permettant aux entreprises de pouvoir, si elles en ont la possibilit&#233;, gratifier leurs collaborateurs sans devoir payer de charges patronales, cette mesure doit pouvoir &#234;tre reconductible d&#8217;une ann&#233;e sur l&#8217;autre.</p>",
    "annexeExposeSommaire": {
      "@xmlns:xsi": "http://www.w3.org/2001/XMLSchema-instance",
      "@xsi:nil": "true"
    },
    "cartoucheDelaiDepotDepasse": {
      "@xmlns:xsi": "http://www.w3.org/2001/XMLSchema-instance",
      "@xsi:nil": "true"
    }
  },
  "representations": {
    "representation": {
      "nom": "PDF",
      "typeMime": {
        "type": "application",
        "subType": "PDF"
      },
      "statutRepresentation": {
        "verbatim": "true",
        "canonique": "true",
        "officielle": "true",
        "transcription": "false",
        "enregistrement": "false"
      },
      "repSource": {
        "@xmlns:xsi": "http://www.w3.org/2001/XMLSchema-instance",
        "@xsi:nil": "true"
      },
      "offset": {
        "@xmlns:xsi": "http://www.w3.org/2001/XMLSchema-instance",
        "@xsi:nil": "true"
      },
      "contenu": {
        "documentURI": "/15/amendements/1547/AN/203.pdf"
      },
      "dateDispoRepresentation": {
        "@xmlns:xsi": "http://www.w3.org/2001/XMLSchema-instance",
        "@xsi:nil": "true"
      }
    }
  },
  "seanceDiscussion": "RUANR5L15S2019IDS21438",
  "sort": {
    "dateSaisie": "2018-12-20T22:25:10.000+01:00",
    "sortEnSeance": "Rejeté"
  },
  "dateDepot": "2018-12-20T01:00:00.000+01:00",
  "dateDistribution": "2018-12-20T01:00:00.000+01:00",
  "article99": "0",
  "loiReference": {
    "codeLoi": {
      "@xmlns:xsi": "http://www.w3.org/2001/XMLSchema-instance",
      "@xsi:nil": "true"
    },
    "divisionCodeLoi": {
      "@xmlns:xsi": "http://www.w3.org/2001/XMLSchema-instance",
      "@xsi:nil": "true"
    }
  }
}