{
  "@xmlns": "http://schemas.assemblee-nationale.fr/referentiel",
  "uid": "AMANR5L15SEA717460BTC0575P0D1N982",
  "identifiant": {
    "legislature": "15",
    "numero": "982",
    "numRect": "0",
    "saisine": {
      "refTexteLegislatif": "PRJLANR5L15BTC0575",
      "numeroPartiePLF": "0",
      "organeExamen": "PO717460",
      "mentionSecondeDeliberation": "0"
    }
  },
  "numeroLong": "982",
  "etapeTexte": "1ère lecture (1ère assemblée saisie)",
  "triAmendement": "b",
  "cardinaliteAmdtMultiples": "1",
  "amendementParent": {
    "@xmlns:xsi": "http://www.w3.org/2001/XMLSchema-instance",
    "@xsi:nil": "true"
  },
  "etat": "Discuté",
  "signataires": {
    "auteur": {
      "typeAuteur": "Depute",
      "acteurRef": "PA720878",
      "organeRef": {
        "@xmlns:xsi": "http://www.w3.org/2001/XMLSchema-instance",
        "@xsi:nil": "true"
      },
      "groupePolitiqueRef": "PO730964"
    },
    "cosignataires": {
      "acteurRef": [
        "PA720014",
        "PA720932",
        "PA719242",
        "PA720960",
        "PA718682",
        "PA642695",
        "PA721398",
        "PA721726",
        "PA719130",
        "PA721514",
        "PA607595",
        "PA722086",
        "PA722170",
        "PA643127",
        "PA722118",
        "PA720512",
        "PA607155",
        "PA677483",
        "PA720590",
        "PA719728",
        "PA719850",
        "PA721860",
        "PA720066",
        "PA718876",
        "PA720342",
        "PA719740",
        "PA719456",
        "PA608641",
        "PA720878",
        "PA721584",
        "PA720520",
        "PA719858",
        "PA607193",
        "PA718902",
        "PA721690",
        "PA720170",
        "PA719652",
        "PA606171",
        "PA719302"
      ]
    },
    "texteAffichable": "M.&#160;Saint-Martin,  M.&#160;Colas-Roy, Mme&#160;Beaudouin-Hubiere, M.&#160;Besson-Moreau, M.&#160;Blein, M.&#160;Bothorel, Mme&#160;Cattelot, M.&#160;Cesarini, M.&#160;Da Silva, M.&#160;Daniel, Mme&#160;Degois, Mme&#160;Errante, Mme&#160;Grandjean, Mme&#160;Hammerer, Mme&#160;Kerbarh, M.&#160;Le Bohec, Mme&#160;Le Peih, Mme&#160;Limon, Mme&#160;Mauborgne, M.&#160;Mazars, Mme&#160;Michel, Mme&#160;M&#246;rch, M.&#160;Moreau, Mme&#160;Motin, M.&#160;Pellois, M.&#160;Pietraszewski, M.&#160;Potterie, M.&#160;Questel, Mme&#160;Rist, M.&#160;C&#233;dric&#160;Roussel, M.&#160;Serva, Mme&#160;Sylla, M.&#160;Tan, M.&#160;Taquet, M.&#160;Terlier, Mme&#160;Thourot, Mme&#160;Tiegna, M.&#160;Trompille, M.&#160;Ferrand et les membres du groupe La R&#233;publique en Marche"
  },
  "pointeurFragmentTexte": {
    "missionVisee": {
      "@xmlns:xsi": "http://www.w3.org/2001/XMLSchema-instance",
      "@xsi:nil": "true"
    },
    "division": {
      "titre": "Article 34",
      "articleDesignationCourte": "APRÈS ART. 34",
      "type": "ARTICLE",
      "avant_A_Apres": "Après",
      "divisionRattachee": "APRÈS L'ARTICLE 34, insérer l'article suivant:",
      "articleAdditionnel": "1",
      "chapitreAdditionnel": {
        "@xmlns:xsi": "http://www.w3.org/2001/XMLSchema-instance",
        "@xsi:nil": "true"
      },
      "urlDivisionTexteVise": "/15/textes/0575.asp#D_Article_34"
    },
    "alinea": {
      "@xmlns:xsi": "http://www.w3.org/2001/XMLSchema-instance",
      "@xsi:nil": "true"
    }
  },
  "corps": {
    "dispositif": "<p style=\"text-align: justify;\">L&#8217;article L.&#160;122&#8209;1 du code de l&#8217;&#233;nergie est ainsi modifi&#233;&#160;:</p><p style=\"text-align: justify;\">1&#176; La premi&#232;re phrase du premier alin&#233;a est remplac&#233; par deux phrases ainsi r&#233;dig&#233;es&#160;: &#171;&#160;Le m&#233;diateur national de l&#8217;&#233;nergie est charg&#233; de recommander des solutions aux litiges entre, d&#8217;une part, les personnes physiques ou morales, hors professionnels et microentreprises au sens de l&#8217;article&#160;51 de la loi n&#176; 2008&#8209;776 du 4 ao&#251;t 2008 de modernisation de l&#8217;&#233;conomie, et, d&#8217;autre part, les entreprises du secteur de l&#8217;&#233;nergie ainsi que celles de services &#233;nerg&#233;tiques et de travaux d&#8217;efficacit&#233; &#233;nerg&#233;tique des b&#226;timents. Il participe &#233;galement &#224; l&#8217;information des consommateurs d&#8217;&#233;nergie sur leurs droits.&#160;&#187;&#160;;</p><p style=\"text-align: justify;\">2&#176; Les deuxi&#232;me et troisi&#232;me alin&#233;as sont ainsi r&#233;dig&#233;s&#160;:</p><p style=\"text-align: justify;\">&#171;&#160;Il est saisi directement et gratuitement par le requ&#233;rant ou son mandataire apr&#232;s une r&#233;clamation &#233;crite pr&#233;alable aupr&#232;s de l&#8217;entreprise concern&#233;e qui n&#8217;a pas permis de r&#233;gler le diff&#233;rend dans un d&#233;lai fix&#233; par voie r&#233;glementaire.</p><p style=\"text-align: justify;\">&#171;&#160;Il formule sa recommandation dans un d&#233;lai fix&#233; par voie r&#233;glementaire et motive sa r&#233;ponse. Sa saisine suspend la prescription des actions en mati&#232;re civile et p&#233;nale pendant ce d&#233;lai&#160;&#187;.</p>",
    "exposeSommaire": "<p style=\"text-align: justify;\">Cet amendement est un amendement de simplification dans la mesure o&#249; il vise &#224; clarifier les comp&#233;tences du m&#233;diateur national de l&#8217;&#233;nergie.</p><p style=\"text-align: justify;\">En effet, l&#8217;alin&#233;a&#160;1<sup>er</sup>&#160;de l&#8217;article L.&#160;122&#8209;1 du code de l&#8217;&#233;nergie pose le principe selon lequel le m&#233;diateur national de l&#8217;&#233;nergie peut conna&#238;tre de tous les &#171;&#160;litiges&#160;&#187; entre d&#8217;une part &#171;&#160;les personnes physiques ou morales&#160;&#187; et, d&#8217;autre part, &#171;&#160;les entreprises du secteur de l&#8217;&#233;nergie&#160;&#187;. Or, cette affirmation g&#233;n&#233;rale est contredite par l&#8217;alin&#233;a&#160;2 qui fait &#233;tat de &#171;&#160;litiges n&#233;s de l&#8217;ex&#233;cution d&#8217;un contrat&#160;&#187; (alors que le litige peut &#234;tre pr&#233;contractuel).</p><p style=\"text-align: justify;\">Ce manque de coh&#233;rence se double d&#8217;une &#233;quivoque sur l&#8217;&#233;tendue du champ de comp&#233;tences du m&#233;diateur national de l&#8217;&#233;nergie. En effet, ce dernier est r&#233;guli&#232;rement saisi de litiges que la r&#233;daction actuelle du texte l&#8217;emp&#234;che d&#8217;examiner, comme par exemple les litiges li&#233;s aux contestations de souscription et aux m&#233;thodes de vente abusives (10&#160;% des litiges entrants). Il ne peut instruire ces dossiers et les oriente donc vers la DGCCRF, susceptible de diligenter une enqu&#234;te dont la dur&#233;e est souvent sup&#233;rieure &#224; un an (par contraste, une m&#233;diation ne peut d&#233;passer 90 jours). D&#8217;autre part, lorsque ces litiges concernent EDF et ENGIE, les dossiers peuvent valablement &#234;tre orient&#233;s vers le service de m&#233;diation interne mis en place au sein de chacun de ces groupes. On peut y voir une disparit&#233; choquante entre consommateurs, car les clients d&#8217;autres fournisseurs sont priv&#233;s de tout recours &#224; la m&#233;diation pour ces litiges. Pour rem&#233;dier &#224; cette situation, la modification propos&#233;e supprime toute r&#233;f&#233;rence &#224; &#171;&#160;l&#8217;ex&#233;cution des contrats&#160;&#187; &#8211; &#233;tant pr&#233;cis&#233; que le m&#233;diateur s&#8217;engage &#224; transmettre &#224; la DGCCRF les litiges significatifs.&#160;</p><p style=\"text-align: justify;\">La simplification propos&#233;e permet &#233;galement de lever l&#8217;&#233;quivoque concernant les entreprises vis-&#224;-vis desquelles une m&#233;diation peut &#234;tre op&#233;r&#233;e. En effet, avec la mont&#233;e en puissance de l&#8217;autoconsommation, la limitation du champ de comp&#233;tences aux seuls fournisseurs et distributeurs appara&#238;t restrictive. Dans le m&#234;me objectif de clarification, la r&#233;daction propos&#233;e pr&#233;cise express&#233;ment que l&#8217;expression &#171;&#160;entreprises du secteur de l&#8217;&#233;nergie&#160;&#187; inclut les entreprises de services &#233;nerg&#233;tiques et celles effectuant des travaux d&#8217;efficacit&#233; &#233;nerg&#233;tique des b&#226;timents,&#160;car il s&#8217;agit d&#8217;un point qui n&#8217;avait pas &#233;t&#233; enti&#232;rement tranch&#233; par le pass&#233;.</p><p style=\"text-align: justify;\">En supprimant les incoh&#233;rences r&#233;dactionnelles, cet amendement permet donc d&#8217;homog&#233;n&#233;iser le champ de comp&#233;tences du m&#233;diateur national de l&#8217;&#233;nergie afin d&#8217;en faire un guichet unique pour la m&#233;diation de l&#8217;ensemble des litiges dans le secteur de l&#8217;&#233;nergie.</p>",
    "annexeExposeSommaire": {
      "@xmlns:xsi": "http://www.w3.org/2001/XMLSchema-instance",
      "@xsi:nil": "true"
    }
  },
  "representations": {
    "representation": {
      "nom": "PDF",
      "typeMime": {
        "type": "application",
        "subType": "PDF"
      },
      "statutRepresentation": {
        "verbatim": "true",
        "canonique": "true",
        "officielle": "true",
        "transcription": "false",
        "enregistrement": "false"
      },
      "repSource": {
        "@xmlns:xsi": "http://www.w3.org/2001/XMLSchema-instance",
        "@xsi:nil": "true"
      },
      "offset": {
        "@xmlns:xsi": "http://www.w3.org/2001/XMLSchema-instance",
        "@xsi:nil": "true"
      },
      "contenu": {
        "documentURI": "/15/amendements/0575/AN/982.pdf"
      },
      "dateDispoRepresentation": {
        "@xmlns:xsi": "http://www.w3.org/2001/XMLSchema-instance",
        "@xsi:nil": "true"
      }
    }
  },
  "seanceDiscussion": "RUANR5L15S2018IDS20868",
  "sort": {
    "dateSaisie": "2018-01-25T17:22:08.000+01:00",
    "sortEnSeance": "Rejeté"
  },
  "dateDepot": "2018-01-19T01:00:00.000+01:00",
  "dateDistribution": "2018-01-23T01:00:00.000+01:00",
  "article99": "0",
  "loiReference": {
    "codeLoi": "c énergie",
    "divisionCodeLoi": "L122-1"
  }
}