{
  "@xmlns": "http://schemas.assemblee-nationale.fr/referentiel",
  "uid": "AMANR5L15PO419610B0627P0D1N30",
  "identifiant": {
    "legislature": "15",
    "numero": "30",
    "numRect": "0",
    "saisine": {
      "refTexteLegislatif": "PRJLANR5L15B0627",
      "numeroPartiePLF": "0",
      "organeExamen": "PO419610",
      "mentionSecondeDeliberation": "0"
    }
  },
  "numeroLong": "CE30",
  "etapeTexte": "1ère lecture (1ère assemblée saisie)",
  "triAmendement": "ahzkzy",
  "cardinaliteAmdtMultiples": "1",
  "amendementParent": {
    "@xmlns:xsi": "http://www.w3.org/2001/XMLSchema-instance",
    "@xsi:nil": "true"
  },
  "etat": "Discuté",
  "signataires": {
    "auteur": {
      "typeAuteur": "Depute",
      "acteurRef": "PA720862",
      "organeRef": {
        "@xmlns:xsi": "http://www.w3.org/2001/XMLSchema-instance",
        "@xsi:nil": "true"
      },
      "groupePolitiqueRef": "PO730964"
    },
    "cosignataires": {
      "acteurRef": [
        "PA720862",
        "PA719778"
      ]
    },
    "texteAffichable": "M.&#160;Descrozaille et M.&#160;Jolivet"
  },
  "pointeurFragmentTexte": {
    "missionVisee": {
      "@xmlns:xsi": "http://www.w3.org/2001/XMLSchema-instance",
      "@xsi:nil": "true"
    },
    "division": {
      "titre": "Article 5",
      "articleDesignationCourte": "APRÈS ART. 5",
      "type": "ARTICLE",
      "avant_A_Apres": "Après",
      "divisionRattachee": "APRÈS L'ARTICLE 5, insérer l'article suivant:",
      "articleAdditionnel": "1",
      "chapitreAdditionnel": {
        "@xmlns:xsi": "http://www.w3.org/2001/XMLSchema-instance",
        "@xsi:nil": "true"
      },
      "urlDivisionTexteVise": "/15/textes/0627.asp#D_Article_5"
    },
    "alinea": {
      "@xmlns:xsi": "http://www.w3.org/2001/XMLSchema-instance",
      "@xsi:nil": "true"
    }
  },
  "corps": {
    "dispositif": "<p style=\"text-align: justify;\">I.&#160;&#8211;&#160;Le premier alin&#233;a de l&#8217;article L.&#160;632&#8209;6 du code rural et de la p&#234;che maritime est compl&#233;t&#233; par la phrase suivante&#160;:</p><p style=\"text-align: justify;\">&#171;&#160;&#192; ce titre, les organisations interprofessionnelles percevant ces cr&#233;ances ne sont pas soumises au contr&#244;le pr&#233;vu &#224; l&#8217;article L.&#160;133&#8209;4 du code des juridictions financi&#232;res.&#160;&#187;&#160;</p>",
    "exposeSommaire": "<p style=\"text-align: justify;\">Les ateliers des &#201;tats g&#233;n&#233;raux de l&#8217;alimentation ont rappel&#233; la n&#233;cessit&#233; de s&#233;curiser sur le plan juridique les actions des interprofessions reconnues et leur ont assign&#233;, comme le projet de loi, un r&#244;le majeur dans le r&#233;&#233;quilibrage des relations commerciales dans le secteur agricole et alimentaire.</p><p style=\"text-align: justify;\">L&#8217;article L.&#160;632&#8209;6 du Code rural et de la p&#234;che maritime pr&#233;cise que nonobstant leur caract&#232;re obligatoire, les cotisations interprofessionnelles &#233;tendues demeurent des cr&#233;ances de droit priv&#233;.</p><p style=\"text-align: justify;\">Dans cette lign&#233;e et conform&#233;ment &#224; la position du gouvernement fran&#231;ais, la Cour de Justice de l&#8217;Union&#160;Europ&#233;enne a exclu du r&#233;gime des aides d&#8217;&#201;tat les actions des interprofessions en s&#8217;appuyant notamment sur l&#8217;absence d&#8217;intervention de l&#8217;&#201;tat dans la gestion des organisations interprofessionnelles en dehors d&#8217;un strict contr&#244;le de l&#233;galit&#233; (CJUE, 30 mai 2013, Doux &#201;levage SNC, Coop&#233;rative agricole UKL-ARREE c. Minist&#232;re de l&#8217;Agriculture, CIDEF, aff. C-677.11, point 38).</p><p style=\"text-align: justify;\">Or, dans le cadre du contr&#244;le des comptes et de gestion exerc&#233; par la Cour des comptes sur l&#8217;emploi des cotisations interprofessionnelles &#233;tendues, elles sont susceptibles de faire l&#8217;objet de recommandations allant au-del&#224; d&#8217;un examen de conformit&#233; &#224; la loi et relevant d&#8217;un contr&#244;le d&#8217;opportunit&#233;.</p><p style=\"text-align: justify;\">En cons&#233;quence, le pr&#233;sent amendement a pour objet de mettre fin au contr&#244;le des organisations interprofessionnelles par la Cour des comptes afin de s&#233;curiser le r&#233;gime juridique applicable aux actions interprofessionnelles.</p><p style=\"text-align: justify;\">Cet amendement ne remet bien entendu nullement en cause les contr&#244;les de l&#233;galit&#233; tels que celui exerc&#233; par le Contr&#244;le g&#233;n&#233;ral &#233;conomique et financier d&#8217;&#201;tat en application du d&#233;cret n&#176;53&#8209;707 du 9&#160;ao&#251;t&#160;1953, ou celui exerc&#233; par la DGCCRF et la DGPE &#224; l&#8217;occasion des extensions d&#8217;accords interprofessionnels.</p>",
    "annexeExposeSommaire": {
      "@xmlns:xsi": "http://www.w3.org/2001/XMLSchema-instance",
      "@xsi:nil": "true"
    }
  },
  "representations": {
    "representation": {
      "nom": "PDF",
      "typeMime": {
        "type": "application",
        "subType": "PDF"
      },
      "statutRepresentation": {
        "verbatim": "true",
        "canonique": "true",
        "officielle": "true",
        "transcription": "false",
        "enregistrement": "false"
      },
      "repSource": {
        "@xmlns:xsi": "http://www.w3.org/2001/XMLSchema-instance",
        "@xsi:nil": "true"
      },
      "offset": {
        "@xmlns:xsi": "http://www.w3.org/2001/XMLSchema-instance",
        "@xsi:nil": "true"
      },
      "contenu": {
        "documentURI": "/15/amendements/0627/CION-ECO/CE30.pdf"
      },
      "dateDispoRepresentation": {
        "@xmlns:xsi": "http://www.w3.org/2001/XMLSchema-instance",
        "@xsi:nil": "true"
      }
    }
  },
  "seanceDiscussion": {
    "@xmlns:xsi": "http://www.w3.org/2001/XMLSchema-instance",
    "@xsi:nil": "true"
  },
  "sort": {
    "dateSaisie": "2018-04-18T12:33:43.000+02:00",
    "sortEnSeance": "Rejeté"
  },
  "dateDepot": "2018-03-29T02:00:00.000+02:00",
  "dateDistribution": "2018-04-17T02:00:00.000+02:00",
  "article99": "0",
  "loiReference": {
    "codeLoi": "rural et pêche maritime",
    "divisionCodeLoi": "L632-6"
  }
}