{
  "@xmlns": "http://schemas.assemblee-nationale.fr/referentiel",
  "uid": "AMANR5L15PO59051B0911P0D1N722",
  "identifiant": {
    "legislature": "15",
    "numero": "722",
    "numRect": "0",
    "saisine": {
      "refTexteLegislatif": "PRJLANR5L15B0911",
      "numeroPartiePLF": "0",
      "organeExamen": "PO59051",
      "mentionSecondeDeliberation": "0"
    }
  },
  "numeroLong": "CL722",
  "etapeTexte": "1ère lecture (1ère assemblée saisie)",
  "triAmendement": "szg",
  "cardinaliteAmdtMultiples": "1",
  "amendementParent": {
    "@xmlns:xsi": "http://www.w3.org/2001/XMLSchema-instance",
    "@xsi:nil": "true"
  },
  "etat": "Discuté",
  "signataires": {
    "auteur": {
      "typeAuteur": "Depute",
      "acteurRef": "PA721094",
      "organeRef": {
        "@xmlns:xsi": "http://www.w3.org/2001/XMLSchema-instance",
        "@xsi:nil": "true"
      },
      "groupePolitiqueRef": "PO744425"
    },
    "cosignataires": {
      "acteurRef": [
        "PA267330",
        "PA720230",
        "PA721110",
        "PA268019",
        "PA695100",
        "PA721486",
        "PA610775",
        "PA721094",
        "PA1960",
        "PA642935",
        "PA266788"
      ]
    },
    "texteAffichable": "M.&#160;Dunoyer,  M.&#160;Gom&#232;s, M.&#160;Becht, M.&#160;Meyer&#160;Habib, M.&#160;Lagarde, M.&#160;Leroy, Mme&#160;Magnier, M.&#160;Morel-&#192;-L&apos;Huissier, M.&#160;Naegelen, Mme&#160;Sanquer et M.&#160;Zumkeller"
  },
  "pointeurFragmentTexte": {
    "missionVisee": {
      "@xmlns:xsi": "http://www.w3.org/2001/XMLSchema-instance",
      "@xsi:nil": "true"
    },
    "division": {
      "titre": "Article 4",
      "articleDesignationCourte": "ART. 4",
      "type": "ARTICLE",
      "avant_A_Apres": "A",
      "divisionRattachee": "ARTICLE 4",
      "articleAdditionnel": {
        "@xmlns:xsi": "http://www.w3.org/2001/XMLSchema-instance",
        "@xsi:nil": "true"
      },
      "chapitreAdditionnel": {
        "@xmlns:xsi": "http://www.w3.org/2001/XMLSchema-instance",
        "@xsi:nil": "true"
      },
      "urlDivisionTexteVise": "/15/textes/0911.asp#D_Article_4"
    },
    "alinea": {
      "avant_A_Apres": {
        "@xmlns:xsi": "http://www.w3.org/2001/XMLSchema-instance",
        "@xsi:nil": "true"
      },
      "numero": "2",
      "alineaDesignation": {
        "@xmlns:xsi": "http://www.w3.org/2001/XMLSchema-instance",
        "@xsi:nil": "true"
      }
    }
  },
  "corps": {
    "dispositif": "<p style=\"text-align: justify;\">Compl&#233;ter la premi&#232;re phrase de l&#8217;alin&#233;a&#160;2 par les mots&#160;:</p><p style=\"text-align: justify;\">&#171;&#160;,&#160;si la mise en &#339;uvre de cette proc&#233;dure ne fait pas l&#8217;objet d&#8217;une opposition du Gouvernement, du pr&#233;sident de la commission saisie au fond ou du pr&#233;sident d&#8217;un groupe&#160;&#187;.</p>",
    "exposeSommaire": "<p style=\"text-align: justify;\">L'article 4 du projet de loi &#233;l&#232;ve au rang constitutionnel la proc&#233;dure qui rend possible l'examen en commission d'un certain nombre de textes qui, en tout ou partie, seraient mis seuls en discussion en s&#233;ance. Cet amendement vise &#224; inscrire dans la Constitution la possibilit&#233; pour le Gouvernement, le pr&#233;sident de la commission saisie au fond ou le pr&#233;sident d'un groupe de s'opposer &#224; l'utilisation de cette proc&#233;dure sur un texte. Cette r&#233;daction s'inspire de l'article 16 de l'ordonnance du 17 novembre 1958 relative au fonctionnement des assembl&#233;es parlementaires : \"Les r&#232;glements des assembl&#233;es peuvent, s'ils instituent une proc&#233;dure d'examen simplifi&#233;e d'un texte et si la mise en &#339;uvre de cette proc&#233;dure ne fait pas l'objet d'une opposition du Gouvernement, du pr&#233;sident de la commission saisie au fond ou du pr&#233;sident d'un groupe, pr&#233;voir que le texte adopt&#233; par la commission saisie au fond est seul mis en discussion en s&#233;ance.\" Il s'inspire &#233;galement de la proc&#233;dure d'examen simplifi&#233;e (article 104 du r&#232;glement de l'Assembl&#233;e nationale et 47 decies du r&#232;glement du S&#233;nat).</p>",
    "annexeExposeSommaire": {
      "@xmlns:xsi": "http://www.w3.org/2001/XMLSchema-instance",
      "@xsi:nil": "true"
    }
  },
  "representations": {
    "representation": {
      "nom": "PDF",
      "typeMime": {
        "type": "application",
        "subType": "PDF"
      },
      "statutRepresentation": {
        "verbatim": "true",
        "canonique": "true",
        "officielle": "true",
        "transcription": "false",
        "enregistrement": "false"
      },
      "repSource": {
        "@xmlns:xsi": "http://www.w3.org/2001/XMLSchema-instance",
        "@xsi:nil": "true"
      },
      "offset": {
        "@xmlns:xsi": "http://www.w3.org/2001/XMLSchema-instance",
        "@xsi:nil": "true"
      },
      "contenu": {
        "documentURI": "/15/amendements/0911/CION_LOIS/CL722.pdf"
      },
      "dateDispoRepresentation": {
        "@xmlns:xsi": "http://www.w3.org/2001/XMLSchema-instance",
        "@xsi:nil": "true"
      }
    }
  },
  "seanceDiscussion": {
    "@xmlns:xsi": "http://www.w3.org/2001/XMLSchema-instance",
    "@xsi:nil": "true"
  },
  "sort": {
    "dateSaisie": "2018-06-29T10:56:12.000+02:00",
    "sortEnSeance": "Rejeté"
  },
  "dateDepot": "2018-06-22T02:00:00.000+02:00",
  "dateDistribution": "2018-06-25T02:00:00.000+02:00",
  "article99": "0",
  "loiReference": {
    "codeLoi": "3",
    "divisionCodeLoi": {
      "@xmlns:xsi": "http://www.w3.org/2001/XMLSchema-instance",
      "@xsi:nil": "true"
    }
  }
}