{
  "@xmlns": "http://schemas.assemblee-nationale.fr/referentiel",
  "uid": "AMANR5L15SEA717460B2272P2D1N3097",
  "identifiant": {
    "legislature": "15",
    "numero": "3097",
    "numRect": "0",
    "saisine": {
      "refTexteLegislatif": "PRJLANR5L15B2272",
      "numeroPartiePLF": "2",
      "organeExamen": "PO717460",
      "mentionSecondeDeliberation": "1"
    }
  },
  "numeroLong": "II-3097",
  "etapeTexte": "1ère lecture (1ère assemblée saisie)",
  "triAmendement": "kuaaaaaaaaaaaaaaaaaaaaaaaaaaaaaaaaaaaaaaaaaaaaaaaahkzqbs",
  "cardinaliteAmdtMultiples": "1",
  "amendementParent": "AMANR5L15SEA717460B2272P2D1N2607",
  "etat": "Discuté",
  "signataires": {
    "auteur": {
      "typeAuteur": "Depute",
      "acteurRef": "PA267336",
      "organeRef": {
        "@xmlns:xsi": "http://www.w3.org/2001/XMLSchema-instance",
        "@xsi:nil": "true"
      },
      "groupePolitiqueRef": "PO730964"
    },
    "cosignataires": {
      "acteurRef": "PA267336"
    },
    "texteAffichable": "M.&#160;Giraud"
  },
  "pointeurFragmentTexte": {
    "missionVisee": {
      "@xmlns:xsi": "http://www.w3.org/2001/XMLSchema-instance",
      "@xsi:nil": "true"
    },
    "division": {
      "titre": "Article 68",
      "articleDesignationCourte": "ART. 68",
      "type": "ARTICLE",
      "avant_A_Apres": "A",
      "divisionRattachee": "ARTICLE 68",
      "articleAdditionnel": {
        "@xmlns:xsi": "http://www.w3.org/2001/XMLSchema-instance",
        "@xsi:nil": "true"
      },
      "chapitreAdditionnel": {
        "@xmlns:xsi": "http://www.w3.org/2001/XMLSchema-instance",
        "@xsi:nil": "true"
      },
      "urlDivisionTexteVise": "/15/textes/2272C.asp#D_Article_68"
    },
    "alinea": {
      "avant_A_Apres": "Apres",
      "numero": "2",
      "alineaDesignation": {
        "@xmlns:xsi": "http://www.w3.org/2001/XMLSchema-instance",
        "@xsi:nil": "true"
      }
    }
  },
  "corps": {
    "dispositif": "<p style=\"text-align: justify;\">&#192; la fin de la premi&#232;re phrase l&#8217;alin&#233;a&#160;4, substituer aux mots&#160;:</p><p style=\"text-align: justify;\">&#171;&#160;d&#8217;hydrocarbures&#160;&#187;,</p><p style=\"text-align: justify;\">les mots&#160;:</p><p style=\"text-align: justify;\">&#171;&#160;p&#233;troliers et gaziers&#160;&#187;.</p>",
    "exposeSommaire": "<p>L&#8217;objet de ce sous-amendement est de pr&#233;ciser la commande politique des deux rapports pr&#233;sent&#233;s.</p><p>S'agissant de la premi&#232;re demande de rapport, il convient d'abord de rappeler son objet prospectif, l&#8217;id&#233;e n&#8217;&#233;tant pas de disposer d&#8217;un outil op&#233;rationnel de conditionnalit&#233; environnementale des garanties export d&#232;s septembre 2020. En outre, les normes permettant l&#8217;octroi des garanties doivent reposer sur plusieurs crit&#232;res environnementaux, qui peuvent &#234;tre des seuils d&#8217;&#233;mission de GES mais pas seulement. Enfin, l&#8217;amendement pr&#233;cise que la conditionnalit&#233;, pour qu&#8217;elle soit efficace, doit peser sur des op&#233;rations d&#8217;export ayant un effet directement nuisible pour l&#8217;environnement. Cela comprend toutes les op&#233;rations en lien avec la production d&#8217;&#233;nergie &#224; partir d&#8217;&#233;nergies fossiles mais &#233;galement certains secteurs industriels polluants (transports a&#233;rien et naval, par exemple).</p><p>S'agissant de la seconde demande de rapport, une pr&#233;cision est apport&#233;e pour indiquer que ce sont bien les gisements p&#233;troliers mais aussi gaziers qui doivent faire l'objet d'une r&#233;flexion permettant d'&#233;laborer des sc&#233;narios de cessation d'octroi de garanties publiques.</p>",
    "annexeExposeSommaire": {
      "@xmlns:xsi": "http://www.w3.org/2001/XMLSchema-instance",
      "@xsi:nil": "true"
    },
    "cartoucheDelaiDepotDepasse": "Sous réserve de son traitement par les services de l'Assemblée nationale et de sa recevabilité",
    "avantAppel": {
      "@xmlns:xsi": "http://www.w3.org/2001/XMLSchema-instance",
      "@xsi:nil": "true"
    }
  },
  "representations": {
    "representation": {
      "nom": "PDF",
      "typeMime": {
        "type": "application",
        "subType": "PDF"
      },
      "statutRepresentation": {
        "verbatim": "true",
        "canonique": "true",
        "officielle": "true",
        "transcription": "false",
        "enregistrement": "false"
      },
      "repSource": {
        "@xmlns:xsi": "http://www.w3.org/2001/XMLSchema-instance",
        "@xsi:nil": "true"
      },
      "offset": {
        "@xmlns:xsi": "http://www.w3.org/2001/XMLSchema-instance",
        "@xsi:nil": "true"
      },
      "contenu": {
        "documentURI": "/15/amendements/2272C/AN/3097.pdf"
      },
      "dateDispoRepresentation": {
        "@xmlns:xsi": "http://www.w3.org/2001/XMLSchema-instance",
        "@xsi:nil": "true"
      }
    }
  },
  "seanceDiscussion": "RUANR5L15S2020IDS21925",
  "sort": {
    "dateSaisie": "2019-11-15T19:23:45.000+01:00",
    "sortEnSeance": "Adopté"
  },
  "dateDepot": "2019-11-14T01:00:00.000+01:00",
  "dateDistribution": "2019-11-15T01:00:00.000+01:00",
  "article99": "0",
  "loiReference": {
    "codeLoi": {
      "@xmlns:xsi": "http://www.w3.org/2001/XMLSchema-instance",
      "@xsi:nil": "true"
    },
    "divisionCodeLoi": {
      "@xmlns:xsi": "http://www.w3.org/2001/XMLSchema-instance",
      "@xsi:nil": "true"
    }
  }
}