{
  "@xmlns": "http://schemas.assemblee-nationale.fr/referentiel",
  "uid": "AMANR5L15PO59051B1844P0D1N95",
  "identifiant": {
    "legislature": "15",
    "numero": "95",
    "numRect": "0",
    "saisine": {
      "refTexteLegislatif": "PRJLANR5L15B1844",
      "numeroPartiePLF": "0",
      "organeExamen": "PO59051",
      "mentionSecondeDeliberation": "0"
    }
  },
  "numeroLong": "CL95",
  "etapeTexte": "1ère lecture (2ème assemblée saisie)",
  "triAmendement": "aiaaaaaaaaaaaaaaaaaaaaaaaaaaaaaaaaaaaaaaaaaaaaaaaanofzo",
  "cardinaliteAmdtMultiples": "1",
  "amendementParent": {
    "@xmlns:xsi": "http://www.w3.org/2001/XMLSchema-instance",
    "@xsi:nil": "true"
  },
  "etat": "Discuté",
  "signataires": {
    "auteur": {
      "typeAuteur": "Depute",
      "acteurRef": "PA720746",
      "organeRef": {
        "@xmlns:xsi": "http://www.w3.org/2001/XMLSchema-instance",
        "@xsi:nil": "true"
      },
      "groupePolitiqueRef": "PO730970"
    },
    "cosignataires": {
      "acteurRef": [
        "PA720746",
        "PA720772",
        "PA719558",
        "PA722284",
        "PA721984",
        "PA721742",
        "PA719874",
        "PA720704"
      ]
    },
    "texteAffichable": "M.&#160;Waserman,  M.&#160;Fuchs, M.&#160;Balanant, M.&#160;Bru, Mme&#160;Florennes, Mme&#160;Jacquier-Laforge, M.&#160;Latombe et Mme&#160;Vichnievsky"
  },
  "pointeurFragmentTexte": {
    "missionVisee": {
      "@xmlns:xsi": "http://www.w3.org/2001/XMLSchema-instance",
      "@xsi:nil": "true"
    },
    "division": {
      "titre": "Article PREMIER",
      "articleDesignationCourte": "ART. PREMIER",
      "type": "ARTICLE",
      "avant_A_Apres": "A",
      "divisionRattachee": "ARTICLE PREMIER",
      "articleAdditionnel": {
        "@xmlns:xsi": "http://www.w3.org/2001/XMLSchema-instance",
        "@xsi:nil": "true"
      },
      "chapitreAdditionnel": {
        "@xmlns:xsi": "http://www.w3.org/2001/XMLSchema-instance",
        "@xsi:nil": "true"
      },
      "urlDivisionTexteVise": "/15/textes/1844.asp#D_Article_1er"
    },
    "alinea": {
      "avant_A_Apres": {
        "@xmlns:xsi": "http://www.w3.org/2001/XMLSchema-instance",
        "@xsi:nil": "true"
      },
      "numero": "20",
      "alineaDesignation": {
        "@xmlns:xsi": "http://www.w3.org/2001/XMLSchema-instance",
        "@xsi:nil": "true"
      }
    }
  },
  "corps": {
    "dispositif": "<p>I.&#160;&#8211;&#160;Apr&#232;s le mot&#160;:</p><p>&#171;&#160;promotion&#160;&#187;,</p><p>r&#233;diger ainsi la fin de l&#8217;alin&#233;a&#160;20&#160;:</p><p style=\"text-align: justify;\">&#171;&#160;de l&#8217;allemand&#160;&#187;.</p><p style=\"text-align: justify;\">II.&#160;&#8211;&#160;En cons&#233;quence, &#224; la seconde phrase de l&#8217;alin&#233;a&#160;20, substituer aux mots :</p><p style=\"text-align: justify;\">&#171;&#160;la langue r&#233;gionale&#160;&#187;</p><p style=\"text-align: justify;\">les mots :</p><p style=\"text-align: justify;\">&#171;&#160;l&#8217;allemand&#160;&#187;.</p>",
    "exposeSommaire": "<p>Amendement visant &#224; lever une ambigu&#239;t&#233;&#160;: il s&#8217;agit de promouvoir l&#8217;enseignement au sein de la Collectivit&#233; Europ&#233;enne d&#8217;Alsace de la langue allemande, qui rev&#234;t une importance particuli&#232;re pour la Collectivit&#233; Europ&#233;enne d&#8217;Alsace au vu des enjeux &#233;conomiques et culturels et &#224; sa situation frontali&#232;re.</p><p>Du fait de la proximit&#233; avec les dialectes alsaciens, l&#8217;allemand peut &#234;tre consid&#233;r&#233; comme une langue r&#233;gionale et donc rel&#232;ve &#224; ce titre de la convention pr&#233;vue a&#768; l&#8217;article L. 312-10 du code de l&#8217;&#233;ducation.</p>",
    "annexeExposeSommaire": {
      "@xmlns:xsi": "http://www.w3.org/2001/XMLSchema-instance",
      "@xsi:nil": "true"
    },
    "cartoucheDelaiDepotDepasse": {
      "@xmlns:xsi": "http://www.w3.org/2001/XMLSchema-instance",
      "@xsi:nil": "true"
    }
  },
  "representations": {
    "representation": {
      "nom": "PDF",
      "typeMime": {
        "type": "application",
        "subType": "PDF"
      },
      "statutRepresentation": {
        "verbatim": "true",
        "canonique": "true",
        "officielle": "true",
        "transcription": "false",
        "enregistrement": "false"
      },
      "repSource": {
        "@xmlns:xsi": "http://www.w3.org/2001/XMLSchema-instance",
        "@xsi:nil": "true"
      },
      "offset": {
        "@xmlns:xsi": "http://www.w3.org/2001/XMLSchema-instance",
        "@xsi:nil": "true"
      },
      "contenu": {
        "documentURI": "/15/amendements/1844/CION_LOIS/CL95.pdf"
      },
      "dateDispoRepresentation": {
        "@xmlns:xsi": "http://www.w3.org/2001/XMLSchema-instance",
        "@xsi:nil": "true"
      }
    }
  },
  "seanceDiscussion": {
    "@xmlns:xsi": "http://www.w3.org/2001/XMLSchema-instance",
    "@xsi:nil": "true"
  },
  "sort": {
    "dateSaisie": "2019-06-18T21:51:08.000+02:00",
    "sortEnSeance": "Tombé"
  },
  "dateDepot": "2019-06-14T02:00:00.000+02:00",
  "dateDistribution": "2019-06-18T02:00:00.000+02:00",
  "article99": "0",
  "loiReference": {
    "codeLoi": "4.1",
    "divisionCodeLoi": "dc"
  }
}