{
  "@xmlns": "http://schemas.assemblee-nationale.fr/referentiel",
  "uid": "AMANR5L15PO419865B1831P0D1N1950",
  "identifiant": {
    "legislature": "15",
    "numero": "1950",
    "numRect": "0",
    "saisine": {
      "refTexteLegislatif": "PRJLANR5L15B1831",
      "numeroPartiePLF": "0",
      "organeExamen": "PO419865",
      "mentionSecondeDeliberation": "0"
    }
  },
  "numeroLong": "CD1950",
  "etapeTexte": "1ère lecture (2ème assemblée saisie)",
  "triAmendement": "iqaaaaaaaaaaaaaaaaaaaaaaaaaaaaaaaaaaaaaaaaaaaaaaaabazzzg",
  "cardinaliteAmdtMultiples": "1",
  "amendementParent": {
    "@xmlns:xsi": "http://www.w3.org/2001/XMLSchema-instance",
    "@xsi:nil": "true"
  },
  "etat": "Discuté",
  "signataires": {
    "auteur": {
      "typeAuteur": "Depute",
      "acteurRef": "PA722236",
      "organeRef": {
        "@xmlns:xsi": "http://www.w3.org/2001/XMLSchema-instance",
        "@xsi:nil": "true"
      },
      "groupePolitiqueRef": "PO730964"
    },
    "cosignataires": {
      "acteurRef": "PA722236"
    },
    "texteAffichable": "M.&#160;Djebbari"
  },
  "pointeurFragmentTexte": {
    "missionVisee": {
      "@xmlns:xsi": "http://www.w3.org/2001/XMLSchema-instance",
      "@xsi:nil": "true"
    },
    "division": {
      "titre": "Article 31 bis",
      "articleDesignationCourte": "APRÈS ART. 31 BIS",
      "type": "ARTICLE",
      "avant_A_Apres": "Après",
      "divisionRattachee": "APRÈS L'ARTICLE 31 BIS, insérer l'article suivant:",
      "articleAdditionnel": "1",
      "chapitreAdditionnel": {
        "@xmlns:xsi": "http://www.w3.org/2001/XMLSchema-instance",
        "@xsi:nil": "true"
      },
      "urlDivisionTexteVise": "/15/textes/1831.asp#D_Article_31_bis"
    },
    "alinea": {
      "@xmlns:xsi": "http://www.w3.org/2001/XMLSchema-instance",
      "@xsi:nil": "true"
    }
  },
  "corps": {
    "dispositif": "<p style=\"text-align: justify;\">La section 1 du chapitre VI du titre I<sup>er</sup> du livre I<sup>er</sup> de la troisi&#232;me partie du code des transports est compl&#233;t&#233;e par un article L.&#160;3116&#8209;1&#8209;2 ainsi r&#233;dig&#233;&#160;:</p><p style=\"text-align: justify;\">&#171;&#160;<i>Art.&#160;L.&#160;3116&#8209;1-2</i>.&#160;&#8211;&#160;I. Les personnes fournissant des services r&#233;guliers ou occasionnels de transport routier international de voyageurs mettent &#224; disposition des passagers la source d&#8217;information ad&#233;quate sur les limites maximales autoris&#233;es de transport pour leurs besoins propres de tabacs manufactur&#233;s et de boissons alcoolis&#233;es ainsi que sur les sanctions encourues en cas de d&#233;passement de ces limites.&#160;</p><p style=\"text-align: justify;\">&#171;&#160;II. Les modalit&#233;s d&#8217;application du pr&#233;sent article sont fix&#233;es par d&#233;cret en Conseil d&#8217;&#201;tat.&#160;&#187;</p>",
    "exposeSommaire": "<p style=\"text-align: justify;\">Justifi&#233;e par des pr&#233;occupations de sant&#233; publique, la politique de taxation importante des produits du tabac et des boissons alcoolis&#233;es men&#233;e par l&#8217;&#201;tat est contourn&#233;e de fa&#231;on croissante par la contrebande de ces produits, tout particuli&#232;rement en provenance de pays voisins tels que l&#8217;Espagne, Andorre, la Belgique ou encore le Luxembourg. Ainsi, la consommation parall&#232;le de tabac repr&#233;senterait plus de 25&#160;% de la consommation fran&#231;aise.</p><p style=\"text-align: justify;\">La mont&#233;e en puissance des services r&#233;guliers ou occasionnels de transport routier international de voyageurs par autobus ou autocar est &#233;vidente&#160;: chaque ann&#233;e 4 &#224; 5 millions de personnes franchissent chaque ann&#233;e les fronti&#232;res fran&#231;aises par autobus ou autocar. Ce ph&#233;nom&#232;ne se traduit par une augmentation des importations illicites de ces produits, non seulement en raison de l&#8217;inexistence de contr&#244;les de bagages aussi pouss&#233;s que pour les voyages par avion, mais &#233;galement &#224; cause du manque d&#8217;information des voyageurs.</p><p style=\"text-align: justify;\">En effet, ces derniers ignorent souvent qu&#8217;ils ne peuvent emporter dans leurs bagages qu&#8217;une quantit&#233; maximale de produits du tabac manufactur&#233; ou de boissons alcoolis&#233;es (art.&#160;302 D du code g&#233;n&#233;ral des imp&#244;ts et art.&#160;50 <i>octies</i> de l&#8217;annexe IV du m&#234;me code).</p><p style=\"text-align: justify;\">Le droit de l&#8217;Union impose aux personnes fournissant des services de transport routier international de voyageurs par autobus ou autocar l&#8217;obligation de d&#233;livrer des informations ad&#233;quates aux passagers tout au long du voyage.</p>",
    "annexeExposeSommaire": {
      "@xmlns:xsi": "http://www.w3.org/2001/XMLSchema-instance",
      "@xsi:nil": "true"
    },
    "cartoucheDelaiDepotDepasse": {
      "@xmlns:xsi": "http://www.w3.org/2001/XMLSchema-instance",
      "@xsi:nil": "true"
    }
  },
  "representations": {
    "representation": {
      "nom": "PDF",
      "typeMime": {
        "type": "application",
        "subType": "PDF"
      },
      "statutRepresentation": {
        "verbatim": "true",
        "canonique": "true",
        "officielle": "true",
        "transcription": "false",
        "enregistrement": "false"
      },
      "repSource": {
        "@xmlns:xsi": "http://www.w3.org/2001/XMLSchema-instance",
        "@xsi:nil": "true"
      },
      "offset": {
        "@xmlns:xsi": "http://www.w3.org/2001/XMLSchema-instance",
        "@xsi:nil": "true"
      },
      "contenu": {
        "documentURI": "/15/amendements/1831/CION-DVP/CD1950.pdf"
      },
      "dateDispoRepresentation": {
        "@xmlns:xsi": "http://www.w3.org/2001/XMLSchema-instance",
        "@xsi:nil": "true"
      }
    }
  },
  "seanceDiscussion": {
    "@xmlns:xsi": "http://www.w3.org/2001/XMLSchema-instance",
    "@xsi:nil": "true"
  },
  "sort": {
    "dateSaisie": "2019-05-22T01:00:18.000+02:00",
    "sortEnSeance": "Retiré"
  },
  "dateDepot": "2019-05-09T02:00:00.000+02:00",
  "dateDistribution": "2019-05-19T02:00:00.000+02:00",
  "article99": "0",
  "loiReference": {
    "codeLoi": "transports",
    "divisionCodeLoi": "L3116-1-2"
  }
}