{
  "@xmlns": "http://schemas.assemblee-nationale.fr/referentiel",
  "uid": "AMANR5L15SEA717460BTC1175P0D1N184",
  "identifiant": {
    "legislature": "15",
    "numero": "184",
    "numRect": "0",
    "saisine": {
      "refTexteLegislatif": "PRJLANR5L15BTC1175",
      "numeroPartiePLF": "0",
      "organeExamen": "PO717460",
      "mentionSecondeDeliberation": "0"
    }
  },
  "numeroLong": "184",
  "etapeTexte": "Nouvelle Lecture",
  "triAmendement": "ojaaaaaaaaaaaaaaaaaaaaaaaaaaaaaaaaaaaaaaaaaaaaaaaabkm",
  "cardinaliteAmdtMultiples": "1",
  "amendementParent": {
    "@xmlns:xsi": "http://www.w3.org/2001/XMLSchema-instance",
    "@xsi:nil": "true"
  },
  "etat": "Retiré",
  "signataires": {
    "auteur": {
      "typeAuteur": "Depute",
      "acteurRef": "PA720230",
      "organeRef": {
        "@xmlns:xsi": "http://www.w3.org/2001/XMLSchema-instance",
        "@xsi:nil": "true"
      },
      "groupePolitiqueRef": "PO744425"
    },
    "cosignataires": {
      "acteurRef": "PA720230"
    },
    "texteAffichable": "Mme&#160;Magnier"
  },
  "pointeurFragmentTexte": {
    "missionVisee": {
      "@xmlns:xsi": "http://www.w3.org/2001/XMLSchema-instance",
      "@xsi:nil": "true"
    },
    "division": {
      "titre": "Article 14 septies",
      "articleDesignationCourte": "ART. 14 SEPTIES",
      "type": "ARTICLE",
      "avant_A_Apres": "A",
      "divisionRattachee": "ARTICLE 14 SEPTIES",
      "articleAdditionnel": {
        "@xmlns:xsi": "http://www.w3.org/2001/XMLSchema-instance",
        "@xsi:nil": "true"
      },
      "chapitreAdditionnel": {
        "@xmlns:xsi": "http://www.w3.org/2001/XMLSchema-instance",
        "@xsi:nil": "true"
      },
      "urlDivisionTexteVise": "/15/textes/1175.asp#D_Article_14_septies"
    },
    "alinea": {
      "avant_A_Apres": {
        "@xmlns:xsi": "http://www.w3.org/2001/XMLSchema-instance",
        "@xsi:nil": "true"
      },
      "numero": "7",
      "alineaDesignation": {
        "@xmlns:xsi": "http://www.w3.org/2001/XMLSchema-instance",
        "@xsi:nil": "true"
      }
    }
  },
  "corps": {
    "dispositif": "<p style=\"text-align: justify;\">Supprimer les alin&#233;as 7 &#224; 11.</p>",
    "exposeSommaire": "<p style=\"text-align: justify;\">Les chartes de bonnes pratiques concernant l&#8217;application de produis phytosanitaires b&#233;n&#233;ficiant d&#8217;une autorisation de mise sur le march&#233; (AMM) sont en discussion entre agriculteurs, &#233;lus locaux et riverains au niveau d&#233;partemental et sont &#224; d&#233;cliner au niveau local. L&#8217;objectif est de r&#233;pondre aux enjeux de sant&#233; publique et de d&#8217;environnement li&#233;s &#224; l&#8217;utilisation des produits phytosanitaires.</p><p style=\"text-align: justify;\">Cependant, ces d&#233;marches volontaires bas&#233;es sur la concertation et la compr&#233;hension mutuelle, ne doivent pas servir de pr&#233;texte &#224; des mesures l&#233;gislatives qui risquent de conduire &#224; des retraits de terre de la production agricole par l&#8217;introduction de nouvelles Zones Non Trait&#233;es.</p><p style=\"text-align: justify;\">Or ce nouveau paragraphe de l&#8217;article&#160;14 septies fait courir ce risque. Par ailleurs, il transforme les chartes en v&#233;ritables textes r&#233;glementaires avec toutes les cons&#233;quences aff&#233;rentes en termes de sanctions, et revient &#224; privil&#233;gier la norme &#224; l&#8217;engagement. C&#8217;est pourquoi les alin&#233;as 7 &#224; 11 de l&#8217;article&#160;14 septies doivent &#234;tre supprim&#233;s.</p>",
    "annexeExposeSommaire": {
      "@xmlns:xsi": "http://www.w3.org/2001/XMLSchema-instance",
      "@xsi:nil": "true"
    }
  },
  "representations": {
    "representation": {
      "nom": "PDF",
      "typeMime": {
        "type": "application",
        "subType": "PDF"
      },
      "statutRepresentation": {
        "verbatim": "true",
        "canonique": "true",
        "officielle": "true",
        "transcription": "false",
        "enregistrement": "false"
      },
      "repSource": {
        "@xmlns:xsi": "http://www.w3.org/2001/XMLSchema-instance",
        "@xsi:nil": "true"
      },
      "offset": {
        "@xmlns:xsi": "http://www.w3.org/2001/XMLSchema-instance",
        "@xsi:nil": "true"
      },
      "contenu": {
        "documentURI": "/15/amendements/1175/AN/184.pdf"
      },
      "dateDispoRepresentation": {
        "@xmlns:xsi": "http://www.w3.org/2001/XMLSchema-instance",
        "@xsi:nil": "true"
      }
    }
  },
  "seanceDiscussion": {
    "@xmlns:xsi": "http://www.w3.org/2001/XMLSchema-instance",
    "@xsi:nil": "true"
  },
  "sort": {
    "@xmlns:xsi": "http://www.w3.org/2001/XMLSchema-instance",
    "@xsi:nil": "true"
  },
  "dateDepot": "2018-08-01T02:00:00.000+02:00",
  "dateDistribution": "2018-09-11T02:00:00.000+02:00",
  "article99": "0",
  "loiReference": {
    "codeLoi": {
      "@xmlns:xsi": "http://www.w3.org/2001/XMLSchema-instance",
      "@xsi:nil": "true"
    },
    "divisionCodeLoi": {
      "@xmlns:xsi": "http://www.w3.org/2001/XMLSchema-instance",
      "@xsi:nil": "true"
    }
  }
}