{
  "@xmlns": "http://schemas.assemblee-nationale.fr/referentiel",
  "uid": "AMANR5L15PO420120B0904P0D1N1054",
  "identifiant": {
    "legislature": "15",
    "numero": "1054",
    "numRect": "0",
    "saisine": {
      "refTexteLegislatif": "PRJLANR5L15B0904",
      "numeroPartiePLF": "0",
      "organeExamen": "PO420120",
      "mentionSecondeDeliberation": "0"
    }
  },
  "numeroLong": "AS1054",
  "etapeTexte": "1ère lecture (1ère assemblée saisie)",
  "triAmendement": "omi",
  "cardinaliteAmdtMultiples": "1",
  "amendementParent": {
    "@xmlns:xsi": "http://www.w3.org/2001/XMLSchema-instance",
    "@xsi:nil": "true"
  },
  "etat": "Discuté",
  "signataires": {
    "auteur": {
      "typeAuteur": "Depute",
      "acteurRef": "PA719660",
      "organeRef": {
        "@xmlns:xsi": "http://www.w3.org/2001/XMLSchema-instance",
        "@xsi:nil": "true"
      },
      "groupePolitiqueRef": "PO730964"
    },
    "cosignataires": {
      "acteurRef": [
        "PA719660",
        "PA719338",
        "PA718930",
        "PA719404"
      ]
    },
    "texteAffichable": "Mme&#160;Dubos,  Mme&#160;Melchior, Mme&#160;Petel et M.&#160;Le Gac"
  },
  "pointeurFragmentTexte": {
    "missionVisee": {
      "@xmlns:xsi": "http://www.w3.org/2001/XMLSchema-instance",
      "@xsi:nil": "true"
    },
    "division": {
      "titre": "Article 19",
      "articleDesignationCourte": "ART. 19",
      "type": "ARTICLE",
      "avant_A_Apres": "A",
      "divisionRattachee": "ARTICLE 19",
      "articleAdditionnel": {
        "@xmlns:xsi": "http://www.w3.org/2001/XMLSchema-instance",
        "@xsi:nil": "true"
      },
      "chapitreAdditionnel": {
        "@xmlns:xsi": "http://www.w3.org/2001/XMLSchema-instance",
        "@xsi:nil": "true"
      },
      "urlDivisionTexteVise": "/15/textes/0904.asp#D_Article_19"
    },
    "alinea": {
      "avant_A_Apres": "A",
      "numero": "67",
      "alineaDesignation": "Alinéa 67"
    }
  },
  "corps": {
    "dispositif": "<p style=\"text-align: justify;\">&#192; la premi&#232;re phrase de l&#8217;alin&#233;a&#160;67, apr&#232;s les mots&#160;:</p><p style=\"text-align: justify;\">&#171;&#160;de professionnalisation&#160;&#187;,</p><p style=\"text-align: justify;\">ins&#233;rer les mots&#160;:</p><p style=\"text-align: justify;\">&#171;&#160;ainsi que, pour les salari&#233;s en contrat de travail &#224; dur&#233;e d&#233;termin&#233;e conclu en application de l&#8217;article L.&#160;1242&#8209;3 du pr&#233;sent code avec un employeur relevant de l&#8217;article L.&#160;5132&#8209;4 , des formations mentionn&#233;es &#224; l&#8217;article L.&#160;6314&#8209;1 et des formations permettant d&#8217;obtenir une partie identifi&#233;e de certification professionnelle, class&#233;e au sein du r&#233;pertoire national, visant &#224; l&#8217;acquisition d&#8217;un bloc de comp&#233;tences au sens de l&#8217;article L.&#160;6113&#8209;4. La prise en charge s&#8217;effectue&#160;&#187;.</p>",
    "exposeSommaire": "<p style=\"text-align: justify;\">Depuis le 1<sup>er</sup> juillet 2014, les structures d&#8217;insertion par l&#8217;activit&#233; &#233;conomique (SIAE) utilisent exclusivement le contrat &#224; dur&#233;e d&#233;termin&#233;e d&#8217;insertion (CDDI), contrat de travail approchant le droit commun, dans leurs relations contractuelles avec les salari&#233;s en insertion. Ces contrats permettent un accompagnement ajust&#233; aux besoins de la personne tant sur la dur&#233;e du contrat que sur la souplesse des horaires ce qui permet de s&#8217;adapter au mieux aux capacit&#233;s des b&#233;n&#233;ficiaires.</p><p style=\"text-align: justify;\">Ces salari&#233;s en insertion sont toutefois constamment confront&#233;s &#224; l&#8217;extr&#234;me tension qui existe sur les disponibilit&#233;s financi&#232;res r&#233;glementairement mobilisables pour accompagner leurs projets de formation. Or le mod&#232;le des SIAE int&#232;gre la mise en &#339;uvre de formation au profit des salari&#233;s en insertion, celles &#233;tant r&#233;alis&#233;es en interne (en situation de travail) ou en externe dans des organismes de formation (formations th&#233;oriques et pratiques). Ces formations, aujourd&#8217;hui financ&#233;es par les OPCA, visent notamment la validation de formations certifiantes&#160;&#8211;&#160;en lien avec les attentes du march&#233; du travail - et participent ainsi &#224; un renforcement de leur employabilit&#233;.</p><p style=\"text-align: justify;\">Ainsi le mod&#232;le p&#233;dagogique effectivement mis en &#339;uvre dans les SIAE correspond bien &#224; une alternance de formations pratiques et de formations th&#233;oriques en situation de travail. De plus, l&#8217;accompagnement propos&#233; dans ces structures s&#8217;apparente &#224; un tutorat notamment pour ce qui est l&#8217;acquisition des comp&#233;tences professionnelles n&#233;cessaires &#224; l&#8217;exercice d&#8217;un m&#233;tier.</p><p style=\"text-align: justify;\">D&#232;s lors, il est justifi&#233; de proposer de permettre la prise en charge par les op&#233;rateurs de comp&#233;tences, sur la section financi&#232;re consacr&#233;e &#224; l&#8217;alternance, des formations certifiantes suivies par les salari&#233;s en CDDI, afin de leur offrir un moyen de financement p&#233;renne.</p>",
    "annexeExposeSommaire": {
      "@xmlns:xsi": "http://www.w3.org/2001/XMLSchema-instance",
      "@xsi:nil": "true"
    }
  },
  "representations": {
    "representation": {
      "nom": "PDF",
      "typeMime": {
        "type": "application",
        "subType": "PDF"
      },
      "statutRepresentation": {
        "verbatim": "true",
        "canonique": "true",
        "officielle": "true",
        "transcription": "false",
        "enregistrement": "false"
      },
      "repSource": {
        "@xmlns:xsi": "http://www.w3.org/2001/XMLSchema-instance",
        "@xsi:nil": "true"
      },
      "offset": {
        "@xmlns:xsi": "http://www.w3.org/2001/XMLSchema-instance",
        "@xsi:nil": "true"
      },
      "contenu": {
        "documentURI": "/15/amendements/0904/CION-SOC/AS1054.pdf"
      },
      "dateDispoRepresentation": {
        "@xmlns:xsi": "http://www.w3.org/2001/XMLSchema-instance",
        "@xsi:nil": "true"
      }
    }
  },
  "seanceDiscussion": {
    "@xmlns:xsi": "http://www.w3.org/2001/XMLSchema-instance",
    "@xsi:nil": "true"
  },
  "sort": {
    "dateSaisie": "2018-05-31T17:43:26.000+02:00",
    "sortEnSeance": "Retiré"
  },
  "dateDepot": "2018-05-25T02:00:00.000+02:00",
  "dateDistribution": "2018-05-29T02:00:00.000+02:00",
  "article99": "0",
  "loiReference": {
    "codeLoi": "1",
    "divisionCodeLoi": {
      "@xmlns:xsi": "http://www.w3.org/2001/XMLSchema-instance",
      "@xsi:nil": "true"
    }
  }
}