{
  "@xmlns": "http://schemas.assemblee-nationale.fr/referentiel",
  "uid": "AMANR5L15SEA717460BTC0857P0D1N603",
  "identifiant": {
    "legislature": "15",
    "numero": "603",
    "numRect": "0",
    "saisine": {
      "refTexteLegislatif": "PRJLANR5L15BTC0857",
      "numeroPartiePLF": "0",
      "organeExamen": "PO717460",
      "mentionSecondeDeliberation": "0"
    }
  },
  "numeroLong": "603",
  "etapeTexte": "1ère lecture (1ère assemblée saisie)",
  "triAmendement": "oacy",
  "cardinaliteAmdtMultiples": "1",
  "amendementParent": {
    "@xmlns:xsi": "http://www.w3.org/2001/XMLSchema-instance",
    "@xsi:nil": "true"
  },
  "etat": "Discuté",
  "signataires": {
    "auteur": {
      "typeAuteur": "Depute",
      "acteurRef": "PA720798",
      "organeRef": {
        "@xmlns:xsi": "http://www.w3.org/2001/XMLSchema-instance",
        "@xsi:nil": "true"
      },
      "groupePolitiqueRef": "PO723569"
    },
    "cosignataires": {
      "acteurRef": [
        "PA720614",
        "PA720822",
        "PA720798",
        "PA720606",
        "PA606212",
        "PA720468"
      ]
    },
    "texteAffichable": "M.&#160;Aliot,  M.&#160;Bilde, M.&#160;Chenu, Mme&#160;Le Pen, M.&#160;Pajot et M.&#160;Collard"
  },
  "pointeurFragmentTexte": {
    "missionVisee": {
      "@xmlns:xsi": "http://www.w3.org/2001/XMLSchema-instance",
      "@xsi:nil": "true"
    },
    "division": {
      "titre": "Article PREMIER",
      "articleDesignationCourte": "ART. PREMIER",
      "type": "ARTICLE",
      "avant_A_Apres": "A",
      "divisionRattachee": "ARTICLE PREMIER",
      "articleAdditionnel": {
        "@xmlns:xsi": "http://www.w3.org/2001/XMLSchema-instance",
        "@xsi:nil": "true"
      },
      "chapitreAdditionnel": {
        "@xmlns:xsi": "http://www.w3.org/2001/XMLSchema-instance",
        "@xsi:nil": "true"
      },
      "urlDivisionTexteVise": "/15/textes/0857.asp#D_Article_1er"
    },
    "alinea": {
      "avant_A_Apres": {
        "@xmlns:xsi": "http://www.w3.org/2001/XMLSchema-instance",
        "@xsi:nil": "true"
      },
      "numero": "9",
      "alineaDesignation": {
        "@xmlns:xsi": "http://www.w3.org/2001/XMLSchema-instance",
        "@xsi:nil": "true"
      }
    }
  },
  "corps": {
    "dispositif": "<p>I.&#160;&#8211;&#160;&#192; l&#8217;alin&#233;a&#160;9, substituer &#224; la premi&#232;re occurrence du signe&#160;:</p><p>&#171;&#160;,&#160;&#187;</p><p>le mot&#160;:</p><p>&#171;&#160;ou&#160;&#187;.</p><p>II.&#160;&#8211;&#160;En cons&#233;quence, au m&#234;me alin&#233;a, supprimer les mots&#160;:</p><p>&#171;&#160;ou &#224; son concubin&#160;&#187;.</p><p>III.&#160;&#8211;&#160;En cons&#233;quence, proc&#233;der &#224; la m&#234;me&#160;substitution et &#224; la m&#234;me suppression &#224; l&#8217;alin&#233;a&#160;20.</p>",
    "exposeSommaire": "<p style=\"text-align: justify;\">La situation de concubinage, ne reposant sur aucune reconnaissance officielle, parait trop floue et pourrait servir de pr&#233;texte pour abuser de cette possibilit&#233; de regroupement familial pour les personnes b&#233;n&#233;ficiant de la protection subsidiaire.</p>",
    "annexeExposeSommaire": {
      "@xmlns:xsi": "http://www.w3.org/2001/XMLSchema-instance",
      "@xsi:nil": "true"
    }
  },
  "representations": {
    "representation": {
      "nom": "PDF",
      "typeMime": {
        "type": "application",
        "subType": "PDF"
      },
      "statutRepresentation": {
        "verbatim": "true",
        "canonique": "true",
        "officielle": "true",
        "transcription": "false",
        "enregistrement": "false"
      },
      "repSource": {
        "@xmlns:xsi": "http://www.w3.org/2001/XMLSchema-instance",
        "@xsi:nil": "true"
      },
      "offset": {
        "@xmlns:xsi": "http://www.w3.org/2001/XMLSchema-instance",
        "@xsi:nil": "true"
      },
      "contenu": {
        "documentURI": "/15/amendements/0857/AN/603.pdf"
      },
      "dateDispoRepresentation": {
        "@xmlns:xsi": "http://www.w3.org/2001/XMLSchema-instance",
        "@xsi:nil": "true"
      }
    }
  },
  "seanceDiscussion": "RUANR5L15S2018IDS21010",
  "sort": {
    "dateSaisie": "2018-04-17T23:13:50.000+02:00",
    "sortEnSeance": "Rejeté"
  },
  "dateDepot": "2018-04-12T02:00:00.000+02:00",
  "dateDistribution": "2018-04-13T02:00:00.000+02:00",
  "article99": "0",
  "loiReference": {
    "codeLoi": {
      "@xmlns:xsi": "http://www.w3.org/2001/XMLSchema-instance",
      "@xsi:nil": "true"
    },
    "divisionCodeLoi": {
      "@xmlns:xsi": "http://www.w3.org/2001/XMLSchema-instance",
      "@xsi:nil": "true"
    }
  }
}