{
  "@xmlns": "http://schemas.assemblee-nationale.fr/referentiel",
  "uid": "AMANR5L15SEA717460B1297P0D1N1427",
  "identifiant": {
    "legislature": "15",
    "numero": "1427",
    "numRect": "0",
    "saisine": {
      "refTexteLegislatif": "PRJLANR5L15B1297",
      "numeroPartiePLF": "0",
      "organeExamen": "PO717460",
      "mentionSecondeDeliberation": "0"
    }
  },
  "numeroLong": "1427",
  "etapeTexte": "1ère lecture (1ère assemblée saisie)",
  "triAmendement": "joaaaaaaaaaaaaaaaaaaaaaaaaaaaaaaaaaaaaaaaaaaaaaaaabts",
  "cardinaliteAmdtMultiples": "1",
  "amendementParent": {
    "@xmlns:xsi": "http://www.w3.org/2001/XMLSchema-instance",
    "@xsi:nil": "true"
  },
  "etat": "Irrecevable",
  "signataires": {
    "auteur": {
      "typeAuteur": "Depute",
      "acteurRef": "PA722268",
      "organeRef": {
        "@xmlns:xsi": "http://www.w3.org/2001/XMLSchema-instance",
        "@xsi:nil": "true"
      },
      "groupePolitiqueRef": "PO730964"
    },
    "cosignataires": {
      "acteurRef": [
        "PA606639",
        "PA2449",
        "PA720576",
        "PA720038",
        "PA718706",
        "PA643175",
        "PA719338",
        "PA719456",
        "PA720202",
        "PA722268",
        "PA718810",
        "PA718744",
        "PA718876",
        "PA718728"
      ]
    },
    "texteAffichable": "Mme&#160;Wonner,  M.&#160;Pont, Mme&#160;Fontaine-Domeizel, Mme&#160;Bagarry, M.&#160;Vignal, Mme&#160;Josso, Mme&#160;Vanceunebrock-Mialon, M.&#160;Besson-Moreau, Mme&#160;Krimi, Mme&#160;Melchior, Mme&#160;Dupont, Mme&#160;M&#246;rch, M.&#160;Bois et Mme&#160;Robert"
  },
  "pointeurFragmentTexte": {
    "missionVisee": {
      "@xmlns:xsi": "http://www.w3.org/2001/XMLSchema-instance",
      "@xsi:nil": "true"
    },
    "division": {
      "titre": "Article 42",
      "articleDesignationCourte": "ART. 42",
      "type": "ARTICLE",
      "avant_A_Apres": "A",
      "divisionRattachee": "ARTICLE 42",
      "articleAdditionnel": {
        "@xmlns:xsi": "http://www.w3.org/2001/XMLSchema-instance",
        "@xsi:nil": "true"
      },
      "chapitreAdditionnel": {
        "@xmlns:xsi": "http://www.w3.org/2001/XMLSchema-instance",
        "@xsi:nil": "true"
      },
      "urlDivisionTexteVise": "/15/textes/1297.asp#D_Article_42"
    },
    "alinea": {
      "avant_A_Apres": {
        "@xmlns:xsi": "http://www.w3.org/2001/XMLSchema-instance",
        "@xsi:nil": "true"
      },
      "numero": "28",
      "alineaDesignation": {
        "@xmlns:xsi": "http://www.w3.org/2001/XMLSchema-instance",
        "@xsi:nil": "true"
      }
    }
  },
  "corps": {
    "dispositif": "<p style=\"text-align: justify;\">&#192; l&#8217;alin&#233;a&#160;28, substituer aux mots&#160;:</p><p style=\"text-align: justify;\">&#171;&#160;certains &#233;tablissements de sant&#233; mentionn&#233;s &#224; l&#8217;article L.&#160;162&#8209;22&#8209;6 ou dans certains &#233;tablissements de sant&#233;&#160;&#187;</p><p style=\"text-align: justify;\">les mots&#160;:</p><p style=\"text-align: justify;\">&#171;&#160;les &#233;tablissements de sant&#233; mentionn&#233;s &#224; l&#8217;article L.&#160;162&#8209;22&#8209;6, d&#233;tenteurs d&#8217;une autorisation d&#8217;activit&#233; pouvant donner lieu &#224; l&#8217;utilisation desdites sp&#233;cialit&#233;s pharmaceutiques, et&#160;&#187;.</p>",
    "exposeSommaire": "<p style=\"text-align: justify;\">L&#8217;article&#160;42 a pour objet de d&#233;finir le p&#233;rim&#232;tre l&#233;gal des autorisations temporaires d&#8217;utilisation de m&#233;dicament.</p><p style=\"text-align: justify;\">Le pr&#233;sent amendement concerne l&#8217;utilisation des m&#233;dicaments b&#233;n&#233;ficiant d&#8217;une ATU dans les &#233;tablissements de sant&#233;. Il propose, pour que ne soit exclu aucun des patients dont le m&#233;dicament est susceptible de repr&#233;senter une derni&#232;re chance ou un traitement vital, que l&#8217;ATU b&#233;n&#233;ficie aux &#233;tablissements dont l&#8217;autorisation d&#8217;activit&#233; est en lien avec la pathologie trait&#233;e par ce m&#233;dicament, et qui dispose d&#8217;une pharmacie &#224; usage interne.</p>",
    "annexeExposeSommaire": {
      "@xmlns:xsi": "http://www.w3.org/2001/XMLSchema-instance",
      "@xsi:nil": "true"
    }
  },
  "representations": {
    "representation": {
      "nom": "PDF",
      "typeMime": {
        "type": "application",
        "subType": "PDF"
      },
      "statutRepresentation": {
        "verbatim": "true",
        "canonique": "true",
        "officielle": "true",
        "transcription": "false",
        "enregistrement": "false"
      },
      "repSource": {
        "@xmlns:xsi": "http://www.w3.org/2001/XMLSchema-instance",
        "@xsi:nil": "true"
      },
      "offset": {
        "@xmlns:xsi": "http://www.w3.org/2001/XMLSchema-instance",
        "@xsi:nil": "true"
      },
      "contenu": {
        "documentURI": "/15/amendements/1297/AN/1427.pdf"
      },
      "dateDispoRepresentation": {
        "@xmlns:xsi": "http://www.w3.org/2001/XMLSchema-instance",
        "@xsi:nil": "true"
      }
    }
  },
  "seanceDiscussion": {
    "@xmlns:xsi": "http://www.w3.org/2001/XMLSchema-instance",
    "@xsi:nil": "true"
  },
  "sort": {
    "@xmlns:xsi": "http://www.w3.org/2001/XMLSchema-instance",
    "@xsi:nil": "true"
  },
  "dateDepot": "2018-10-19T02:00:00.000+02:00",
  "dateDistribution": {
    "@xmlns:xsi": "http://www.w3.org/2001/XMLSchema-instance",
    "@xsi:nil": "true"
  },
  "article99": "0",
  "loiReference": {
    "codeLoi": {
      "@xmlns:xsi": "http://www.w3.org/2001/XMLSchema-instance",
      "@xsi:nil": "true"
    },
    "divisionCodeLoi": {
      "@xmlns:xsi": "http://www.w3.org/2001/XMLSchema-instance",
      "@xsi:nil": "true"
    }
  }
}