{
  "@xmlns": "http://schemas.assemblee-nationale.fr/referentiel",
  "uid": "AMANR5L15SEA717460B2416P0D1N66",
  "identifiant": {
    "legislature": "15",
    "numero": "66",
    "numRect": "0",
    "saisine": {
      "refTexteLegislatif": "PRJLANR5L15B2416",
      "numeroPartiePLF": "0",
      "organeExamen": "PO717460",
      "mentionSecondeDeliberation": "0"
    }
  },
  "numeroLong": "66",
  "etapeTexte": "Nouvelle Lecture",
  "triAmendement": "ifaaaaaaaaaaaaaaaaaaaaaaaaaaaaaaaaaaaaaaaaaaaaaaaaak",
  "cardinaliteAmdtMultiples": "1",
  "amendementParent": {
    "@xmlns:xsi": "http://www.w3.org/2001/XMLSchema-instance",
    "@xsi:nil": "true"
  },
  "etat": "En recevabilité",
  "signataires": {
    "auteur": {
      "typeAuteur": "Depute",
      "acteurRef": "PA718884",
      "organeRef": {
        "@xmlns:xsi": "http://www.w3.org/2001/XMLSchema-instance",
        "@xsi:nil": "true"
      },
      "groupePolitiqueRef": "PO730934"
    },
    "cosignataires": {
      "acteurRef": [
        "PA719318",
        "PA718884"
      ]
    },
    "texteAffichable": "Mme&#160;Bazin-Malgras et Mme&#160;Anthoine"
  },
  "pointeurFragmentTexte": {
    "missionVisee": {
      "@xmlns:xsi": "http://www.w3.org/2001/XMLSchema-instance",
      "@xsi:nil": "true"
    },
    "division": {
      "titre": "Article 38 ter",
      "articleDesignationCourte": "ART. 38 TER",
      "type": "ARTICLE",
      "avant_A_Apres": "A",
      "divisionRattachee": "ARTICLE 38 TER",
      "articleAdditionnel": {
        "@xmlns:xsi": "http://www.w3.org/2001/XMLSchema-instance",
        "@xsi:nil": "true"
      },
      "chapitreAdditionnel": {
        "@xmlns:xsi": "http://www.w3.org/2001/XMLSchema-instance",
        "@xsi:nil": "true"
      },
      "urlDivisionTexteVise": "/15/textes/2416.asp#D_Article_38_ter"
    },
    "alinea": {
      "avant_A_Apres": "A",
      "numero": "4",
      "alineaDesignation": "Alinéa 4"
    }
  },
  "corps": {
    "dispositif": "<p style=\"text-align: justify;\">R&#233;diger ainsi les alin&#233;as 4 et 5&#160;:</p><p style=\"text-align: justify;\">&#171;&#160;2&#176;&#160;Aux soins d&#8217;hygi&#232;ne et de confort permettant de pr&#233;server l&#8217;autonomie&#160;;</p><p style=\"text-align: justify;\">&#171;&#160;3 &#176;&#160;Aux soins et actes de r&#233;adaptation et d&#8217;accompagnement &#224; l&#8217;autonomie compte tenu des conditions de fonctionnement et des projets des &#233;tablissements concern&#233;s.&#160;&#187;</p>",
    "exposeSommaire": "<p style=\"text-align: justify;\">Cet amendement a pour vocation d&#8217;apporter une am&#233;lioration r&#233;dactionnelle &#224; l&#8217;article introduit par le Gouvernement.</p><p style=\"text-align: justify;\">Les termes &#171;&#160;fonctions d&#8217;entretiens et de continuit&#233; de la vie&#160;&#187; ne semblent en effet pas correspondre &#224; la nature des soins r&#233;alis&#233;s par les &#233;tablissements.</p><p style=\"text-align: justify;\">De m&#234;me, le terme &#171;&#160;pr&#233;vu&#160;&#187; est remplac&#233; par &#171;&#160;compte tenu&#160;&#187;&#160;: en effet, c&#8217;est en fonction du plateau technique de l&#8217;&#233;tablissement que sont r&#233;alis&#233;s les soins et actes de r&#233;adaptation.&#160;</p>",
    "annexeExposeSommaire": {
      "@xmlns:xsi": "http://www.w3.org/2001/XMLSchema-instance",
      "@xsi:nil": "true"
    },
    "cartoucheDelaiDepotDepasse": "Sous réserve de son traitement par les services de l'Assemblée nationale et de sa recevabilité",
    "avantAppel": {
      "@xmlns:xsi": "http://www.w3.org/2001/XMLSchema-instance",
      "@xsi:nil": "true"
    }
  },
  "representations": {
    "representation": {
      "nom": "PDF",
      "typeMime": {
        "type": "application",
        "subType": "PDF"
      },
      "statutRepresentation": {
        "verbatim": "true",
        "canonique": "true",
        "officielle": "true",
        "transcription": "false",
        "enregistrement": "false"
      },
      "repSource": {
        "@xmlns:xsi": "http://www.w3.org/2001/XMLSchema-instance",
        "@xsi:nil": "true"
      },
      "offset": {
        "@xmlns:xsi": "http://www.w3.org/2001/XMLSchema-instance",
        "@xsi:nil": "true"
      },
      "contenu": {
        "documentURI": "/15/amendements/2416/AN/66.pdf"
      },
      "dateDispoRepresentation": {
        "@xmlns:xsi": "http://www.w3.org/2001/XMLSchema-instance",
        "@xsi:nil": "true"
      }
    }
  },
  "seanceDiscussion": {
    "@xmlns:xsi": "http://www.w3.org/2001/XMLSchema-instance",
    "@xsi:nil": "true"
  },
  "sort": {
    "@xmlns:xsi": "http://www.w3.org/2001/XMLSchema-instance",
    "@xsi:nil": "true"
  },
  "dateDepot": "2019-11-20T01:00:00.000+01:00",
  "dateDistribution": "2019-11-21T01:00:00.000+01:00",
  "article99": "0",
  "loiReference": {
    "codeLoi": {
      "@xmlns:xsi": "http://www.w3.org/2001/XMLSchema-instance",
      "@xsi:nil": "true"
    },
    "divisionCodeLoi": {
      "@xmlns:xsi": "http://www.w3.org/2001/XMLSchema-instance",
      "@xsi:nil": "true"
    }
  }
}