{
  "@xmlns": "http://schemas.assemblee-nationale.fr/referentiel",
  "uid": "AMANR5L15PO419865B2274P0D1N1418",
  "identifiant": {
    "legislature": "15",
    "numero": "1418",
    "numRect": "0",
    "saisine": {
      "refTexteLegislatif": "PRJLANR5L15B2274",
      "numeroPartiePLF": "0",
      "organeExamen": "PO419865",
      "mentionSecondeDeliberation": "0"
    }
  },
  "numeroLong": "CD1418",
  "etapeTexte": "1ère lecture (2ème assemblée saisie)",
  "triAmendement": "ipaaaaaaaaaaaaaaaaaaaaaaaaaaaaaaaaaaaaaaaaaaaaaaaaxs",
  "cardinaliteAmdtMultiples": "1",
  "amendementParent": {
    "@xmlns:xsi": "http://www.w3.org/2001/XMLSchema-instance",
    "@xsi:nil": "true"
  },
  "etat": "En traitement",
  "signataires": {
    "auteur": {
      "typeAuteur": "Depute",
      "acteurRef": "PA719668",
      "organeRef": {
        "@xmlns:xsi": "http://www.w3.org/2001/XMLSchema-instance",
        "@xsi:nil": "true"
      },
      "groupePolitiqueRef": "PO730964"
    },
    "cosignataires": {
      "acteurRef": [
        "PA720310",
        "PA718894",
        "PA719080",
        "PA719922",
        "PA719632",
        "PA722000",
        "PA719540",
        "PA721372",
        "PA719882",
        "PA609520",
        "PA720054",
        "PA721860",
        "PA719668",
        "PA718962",
        "PA719972",
        "PA719664",
        "PA722336",
        "PA721876",
        "PA721600",
        "PA719092",
        "PA605084",
        "PA720414",
        "PA720242",
        "PA719718",
        "PA722366",
        "PA719194",
        "PA718802",
        "PA722228",
        "PA719624",
        "PA719310",
        "PA722038",
        "PA719364",
        "PA719890",
        "PA719740",
        "PA719412",
        "PA720944"
      ]
    },
    "texteAffichable": "Mme&#160;Mirall&#232;s,  M.&#160;Damien&#160;Adam, Mme&#160;Maillart-M&#233;haignerie, M.&#160;Colas-Roy, Mme&#160;Abba, M.&#160;Arend, Mme&#160;Brulebois, M.&#160;Buchou, M.&#160;Causse, Mme&#160;Couillard, Mme&#160;Yolaine&#160;de Courson, M.&#160;Dombreval, M.&#160;Fugit, M.&#160;Haury, M.&#160;Krabal, M.&#160;Lavergne, Mme&#160;de Lavergne, M.&#160;Cesarini, Mme&#160;Le Feur, M.&#160;Leclabart, Mme&#160;Marsaud, Mme&#160;Meynier-Millefert, M.&#160;Morenas, Mme&#160;O&apos;Petit, Mme&#160;Panonacle, Mme&#160;Park, M.&#160;Perea, M.&#160;Perrot, M.&#160;Pichereau, Mme&#160;Pompili, Mme&#160;Rossi, Mme&#160;Sarles, M.&#160;Thi&#233;baut, Mme&#160;Toutut-Picard, Mme&#160;Tuffnell, M.&#160;Zulesi et les membres du groupe La R&#233;publique en Marche"
  },
  "pointeurFragmentTexte": {
    "missionVisee": {
      "@xmlns:xsi": "http://www.w3.org/2001/XMLSchema-instance",
      "@xsi:nil": "true"
    },
    "division": {
      "titre": "Article 10",
      "articleDesignationCourte": "ART. 10",
      "type": "ARTICLE",
      "avant_A_Apres": "A",
      "divisionRattachee": "ARTICLE 10",
      "articleAdditionnel": {
        "@xmlns:xsi": "http://www.w3.org/2001/XMLSchema-instance",
        "@xsi:nil": "true"
      },
      "chapitreAdditionnel": {
        "@xmlns:xsi": "http://www.w3.org/2001/XMLSchema-instance",
        "@xsi:nil": "true"
      },
      "urlDivisionTexteVise": "/15/textes/2274.asp#D_Article_10"
    },
    "alinea": {
      "avant_A_Apres": "Apres",
      "numero": "11",
      "alineaDesignation": {
        "@xmlns:xsi": "http://www.w3.org/2001/XMLSchema-instance",
        "@xsi:nil": "true"
      }
    }
  },
  "corps": {
    "dispositif": "<p>A l'article 10, apr&#232;s l'alin&#233;a 11, il est ins&#233;r&#233; les phrases suivantes :</p><p style=\"text-align: justify;\">L&#8217;article L. 541-10-5 du code de l&#8217;environnement est compl&#233;t&#233; par un IV r&#233;dig&#233; comme suit :</p><p style=\"text-align: justify;\">&#171; IV. &#8211; Au plus tard le 1er janvier 2022, sauf demande contraire du client, l&#8217;impression syst&#233;matique des tickets de carte bancaire sera interdite en France.</p><p style=\"text-align: justify;\">Les modalit&#233;s d&#8217;application du pr&#233;sent article sont fix&#233;es par d&#233;cret.&#187;.</p>",
    "exposeSommaire": "<p>La France s&#8217;est depuis longtemps, et plus fortement encore au cours des derni&#232;res ann&#233;es, distingu&#233;e par le choix de politiques environnementales ambitieuses et innovantes. Ce r&#244;le et cette place n&#8217;ont fait que s&#8217;accro&#238;tre avec la signature le 22 avril 2016 des accords de Paris dont les Etats-Unis ont malheureusement choisi de se retirer.</p><p style=\"text-align: justify;\">C&#8217;est dans cette d&#233;marche qu&#8217;a &#233;t&#233; adopt&#233;e en 2015 la loi de transition &#233;nerg&#233;tique pour la croissance verte laquelle est venue offrir un cadre juridique, attendu depuis des ann&#233;es, aux fins notamment de parvenir &#224; la r&#233;duction substantielle de nos d&#233;chets m&#233;nagers &#224; horizon 2020.</p><p style=\"text-align: justify;\">C&#8217;est ainsi que la fin de la distribution des sacs plastiques en caisse et la limitation de la mise &#224; disposition de gobelets, verres et assiettes jetables en mati&#232;re plastique &#224; compter du 1er janvier 2020 vont permettre d&#8217;endiguer durablement les impacts environnementaux qu&#8217;occasionnaient pr&#233;c&#233;demment ces d&#233;chets.</p><p style=\"text-align: justify;\">Avec une part &#224; peu pr&#232;s constante de 518 kilogrammes de d&#233;chets municipaux par habitant, la France n&#8217;a cess&#233; d&#8217;accroitre au cours des dix derni&#232;res ann&#233;es le taux de recyclage de ses d&#233;chets lequel avoisine d&#233;sormais les 50 %.</p><p style=\"text-align: justify;\">Il appartient toutefois de souligner que la France accuse un retard certain en la mati&#232;re au niveau europ&#233;en en comparaison de pays comme l&#8217;Allemagne, l&#8217;Autriche, la Slov&#233;nie ou la Belgique qui se sont&#160; inscrits depuis de nombreuses ann&#233;es dans des politiques d&#8217;&#233;conomie&#160; de ressources et de r&#233;utilisation des d&#233;chets.&#160;Parce que notre plan&#232;te ne peut plus &#234;tre l&#8217;otage&#160; de&#160;production&#160; irraisonn&#233;e quelle qu&#8217;en soit la nature, il revient &#224; chacun d&#8217;entre nous, &#224; commencer par le l&#233;gislateur, de veiller scrupuleusement &#224; l&#8217;emploi superf&#233;tatoire de ressources.&#160;Il en est notamment ainsi des tickets de carte bancaire, non vis&#233;s par les dispositions de l&#8217;article L 514-10-5 du Code de l&#8217;environnement, dont l&#8217;impact environnemental fort n&#8217;est malheureusement plus &#224; d&#233;montrer.</p>",
    "annexeExposeSommaire": {
      "@xmlns:xsi": "http://www.w3.org/2001/XMLSchema-instance",
      "@xsi:nil": "true"
    },
    "cartoucheDelaiDepotDepasse": "Sous réserve de son traitement par les services de l'Assemblée nationale et de sa recevabilité",
    "avantAppel": {
      "@xmlns:xsi": "http://www.w3.org/2001/XMLSchema-instance",
      "@xsi:nil": "true"
    }
  },
  "representations": {
    "representation": {
      "nom": "PDF",
      "typeMime": {
        "type": "application",
        "subType": "PDF"
      },
      "statutRepresentation": {
        "verbatim": "true",
        "canonique": "true",
        "officielle": "true",
        "transcription": "false",
        "enregistrement": "false"
      },
      "repSource": {
        "@xmlns:xsi": "http://www.w3.org/2001/XMLSchema-instance",
        "@xsi:nil": "true"
      },
      "offset": {
        "@xmlns:xsi": "http://www.w3.org/2001/XMLSchema-instance",
        "@xsi:nil": "true"
      },
      "contenu": {
        "documentURI": "/15/amendements/2274/CION-DVP/CD1418.pdf"
      },
      "dateDispoRepresentation": {
        "@xmlns:xsi": "http://www.w3.org/2001/XMLSchema-instance",
        "@xsi:nil": "true"
      }
    }
  },
  "seanceDiscussion": {
    "@xmlns:xsi": "http://www.w3.org/2001/XMLSchema-instance",
    "@xsi:nil": "true"
  },
  "sort": {
    "@xmlns:xsi": "http://www.w3.org/2001/XMLSchema-instance",
    "@xsi:nil": "true"
  },
  "dateDepot": "2019-11-20T01:00:00.000+01:00",
  "dateDistribution": {
    "@xmlns:xsi": "http://www.w3.org/2001/XMLSchema-instance",
    "@xsi:nil": "true"
  },
  "article99": "0",
  "loiReference": {
    "codeLoi": {
      "@xmlns:xsi": "http://www.w3.org/2001/XMLSchema-instance",
      "@xsi:nil": "true"
    },
    "divisionCodeLoi": {
      "@xmlns:xsi": "http://www.w3.org/2001/XMLSchema-instance",
      "@xsi:nil": "true"
    }
  }
}