{
  "@xmlns": "http://schemas.assemblee-nationale.fr/referentiel",
  "uid": "AMANR5L15SEA717460BTC0902P0D1N894",
  "identifiant": {
    "legislature": "15",
    "numero": "894",
    "numRect": "0",
    "saisine": {
      "refTexteLegislatif": "PRJLANR5L15BTC0902",
      "numeroPartiePLF": "0",
      "organeExamen": "PO717460",
      "mentionSecondeDeliberation": "0"
    }
  },
  "numeroLong": "894",
  "etapeTexte": "1ère lecture (1ère assemblée saisie)",
  "triAmendement": "qabtzddzzi",
  "cardinaliteAmdtMultiples": "1",
  "amendementParent": {
    "@xmlns:xsi": "http://www.w3.org/2001/XMLSchema-instance",
    "@xsi:nil": "true"
  },
  "etat": "Discuté",
  "signataires": {
    "auteur": {
      "typeAuteur": "Depute",
      "acteurRef": "PA1874",
      "organeRef": {
        "@xmlns:xsi": "http://www.w3.org/2001/XMLSchema-instance",
        "@xsi:nil": "true"
      },
      "groupePolitiqueRef": "PO730934"
    },
    "cosignataires": {
      "acteurRef": [
        "PA2492",
        "PA1874",
        "PA643103",
        "PA609245",
        "PA332523",
        "PA606712",
        "PA266776",
        "PA998",
        "PA267200",
        "PA330909",
        "PA2155",
        "PA721410",
        "PA720210",
        "PA346218",
        "PA330684",
        "PA334654"
      ]
    },
    "texteAffichable": "M.&#160;Le Fur,  Mme&#160;Beauvais, Mme&#160;Bonnivard, Mme&#160;Val&#233;rie&#160;Boyer, Mme&#160;Dalloz, M.&#160;Dassault, M.&#160;Descoeur, M.&#160;Ferrara, M.&#160;Huyghe, Mme&#160;Lacroute, M.&#160;Lurton, M.&#160;Masson, M.&#160;Menuel, M.&#160;Quentin, M.&#160;Reiss et M.&#160;Straumann"
  },
  "pointeurFragmentTexte": {
    "missionVisee": {
      "@xmlns:xsi": "http://www.w3.org/2001/XMLSchema-instance",
      "@xsi:nil": "true"
    },
    "division": {
      "titre": "Article 6",
      "articleDesignationCourte": "ART. 6",
      "type": "ARTICLE",
      "avant_A_Apres": "A",
      "divisionRattachee": "ARTICLE 6",
      "articleAdditionnel": {
        "@xmlns:xsi": "http://www.w3.org/2001/XMLSchema-instance",
        "@xsi:nil": "true"
      },
      "chapitreAdditionnel": {
        "@xmlns:xsi": "http://www.w3.org/2001/XMLSchema-instance",
        "@xsi:nil": "true"
      },
      "urlDivisionTexteVise": "/15/textes/0902.asp#D_Article_6"
    },
    "alinea": {
      "avant_A_Apres": "A",
      "numero": "8",
      "alineaDesignation": "Alinéa 8"
    }
  },
  "corps": {
    "dispositif": "<p style=\"text-align: justify;\">Compl&#233;ter cet article par les cinq alin&#233;as suivants&#160;:</p><p style=\"text-align: justify;\">&#171;&#160;II.&#160;&#8211;&#160;Apr&#232;s l&#8217;article L.&#160;441&#8209;8 du code de commerce, il est ins&#233;r&#233; un article L.&#160;441&#8209;8&#8209;1 ainsi r&#233;dig&#233;&#160;:</p><p style=\"text-align: justify;\">&#171;&#160;<i>Art.&#160;L.&#160;441&#8209;8&#8209;1</i>.&#160;&#8211;&#160;I.&#160;&#8211;&#160;Lorsque les produits finis vis&#233;s &#224; l&#8217;article L.&#160;441&#8209;8 sont compos&#233;s &#224; plus de 50&#160;% d&#8217;un produit agricole ou alimentaire dont le cours est refl&#233;t&#233; par un indice public librement accessible aux deux parties et qu&#8217;ils ne font pas l&#8217;objet d&#8217;un march&#233; &#224; terme, leur prix est automatiquement r&#233;vis&#233; &#224; la hausse lorsqu&#8217;il peut &#234;tre d&#233;montr&#233; que le cours dudit produit agricole ou alimentaire a subi une augmentation sup&#233;rieure au seuil d&#233;fini par d&#233;cret ou par accord interprofessionnel. Les produits finis concern&#233;s figurent sur une liste &#233;tablie par d&#233;cret et sont issus de fili&#232;res agroalimentaires.</p><p style=\"text-align: justify;\">&#171;&#160;Le taux de variation du prix du produit fini est limit&#233; au taux d&#8217;augmentation du cours du produit agricole ou alimentaire qui le compose majoritairement multipli&#233; par la part que repr&#233;sente ledit produit agricole ou alimentaire dans le produit fini.</p><p style=\"text-align: justify;\">&#171;&#160;II.&#160;&#8211;&#160;Lorsque les conditions vis&#233;es au I sont remplies, le fournisseur r&#233;vise son tarif et le communique &#224; l&#8217;ensemble des acheteurs avec lesquels il a conclu un contrat de vente d&#8217;une dur&#233;e d&#8217;ex&#233;cution sup&#233;rieure &#224; trois mois en y joignant l&#8217;ensemble des pi&#232;ces justificatives&#160;; c&#8217;est ce nouveau tarif qui sert alors de base au calcul du prix convenu entre le fournisseur et chacun de ses acheteurs, &#224; compter de l&#8217;expiration d&#8217;un d&#233;lai de huit jours suivant la date d&#8217;envoi du tarif r&#233;vis&#233; par le fournisseur.</p><p style=\"text-align: justify;\">&#171;&#160;III.&#160;&#8211;&#160;Lorsque les conditions vis&#233;es au I sont remplies, le fournisseur informe chacun des acheteurs avec lesquels il a conclu un contrat de fabrication d&#8217;une dur&#233;e sup&#233;rieure &#224; trois mois de ses prix r&#233;vis&#233;s en y joignant l&#8217;ensemble des pi&#232;ces justificatives&#160;; ceux-ci entrent en vigueur &#224; l&#8217;expiration d&#8217;un d&#233;lai de huit jours suivant la communication des prix r&#233;vis&#233;s.&#160;&#187;</p>",
    "exposeSommaire": "<p style=\"text-align: justify;\">La clause de ren&#233;gociation pr&#233;vue &#224; l&#8217;article L441&#8209;8 du code de commerce ne permet pas, dans sa forme actuelle, une r&#233;percussion des hausses des cours des mati&#232;res premi&#232;res agricoles de l&#8217;amont &#224; l&#8217;aval des fili&#232;res agricoles. En effet, alors que les baisses de prix sont syst&#233;matiquement int&#233;gr&#233;es aux tarifs pass&#233;s avec les clients, les hausses sont insuffisamment prises en compte.</p><p style=\"text-align: justify;\">Il est n&#233;cessaire que la loi encadre plus formellement ces hausses de cours en introduisant une clause d&#8217;indexation de ces variations dans les contrats de plus de trois mois portant sur des produits d&#233;j&#224; concern&#233;s par l&#8217;article L441&#8209;8 et &#233;tant compos&#233;s &#224; plus de 50&#160;% par une mati&#232;re premi&#232;re agricole dont la hausse est objectivement justifi&#233;e.</p><p style=\"text-align: justify;\">Une fois ces hausses de cours justifi&#233;es et int&#233;gr&#233;es au nouveau tarif du fournisseur industriel, celui-ci s&#8217;engage dans une adaptation, au minimum de m&#234;me ordre, des prix d&#8217;achat de la mati&#232;re premi&#232;re agricole aupr&#232;s des producteurs agricoles.</p>",
    "annexeExposeSommaire": {
      "@xmlns:xsi": "http://www.w3.org/2001/XMLSchema-instance",
      "@xsi:nil": "true"
    }
  },
  "representations": {
    "representation": {
      "nom": "PDF",
      "typeMime": {
        "type": "application",
        "subType": "PDF"
      },
      "statutRepresentation": {
        "verbatim": "true",
        "canonique": "true",
        "officielle": "true",
        "transcription": "false",
        "enregistrement": "false"
      },
      "repSource": {
        "@xmlns:xsi": "http://www.w3.org/2001/XMLSchema-instance",
        "@xsi:nil": "true"
      },
      "offset": {
        "@xmlns:xsi": "http://www.w3.org/2001/XMLSchema-instance",
        "@xsi:nil": "true"
      },
      "contenu": {
        "documentURI": "/15/amendements/0902/AN/894.pdf"
      },
      "dateDispoRepresentation": {
        "@xmlns:xsi": "http://www.w3.org/2001/XMLSchema-instance",
        "@xsi:nil": "true"
      }
    }
  },
  "seanceDiscussion": "RUANR5L15S2018IDS21053",
  "sort": {
    "dateSaisie": "2018-05-24T23:25:14.000+02:00",
    "sortEnSeance": "Rejeté"
  },
  "dateDepot": "2018-05-16T02:00:00.000+02:00",
  "dateDistribution": "2018-05-21T02:00:00.000+02:00",
  "article99": "0",
  "loiReference": {
    "codeLoi": {
      "@xmlns:xsi": "http://www.w3.org/2001/XMLSchema-instance",
      "@xsi:nil": "true"
    },
    "divisionCodeLoi": {
      "@xmlns:xsi": "http://www.w3.org/2001/XMLSchema-instance",
      "@xsi:nil": "true"
    }
  }
}