{
  "@xmlns": "http://schemas.assemblee-nationale.fr/referentiel",
  "uid": "AMANR5L15SEA717460BTC0971P0D1N2372",
  "identifiant": {
    "legislature": "15",
    "numero": "2372",
    "numRect": "0",
    "saisine": {
      "refTexteLegislatif": "PRJLANR5L15BTC0971",
      "numeroPartiePLF": "0",
      "organeExamen": "PO717460",
      "mentionSecondeDeliberation": "0"
    }
  },
  "numeroLong": "2372",
  "etapeTexte": "1ère lecture (1ère assemblée saisie)",
  "triAmendement": "ekv",
  "cardinaliteAmdtMultiples": "1",
  "amendementParent": {
    "@xmlns:xsi": "http://www.w3.org/2001/XMLSchema-instance",
    "@xsi:nil": "true"
  },
  "etat": "Discuté",
  "signataires": {
    "auteur": {
      "typeAuteur": "Depute",
      "acteurRef": "PA332228",
      "organeRef": {
        "@xmlns:xsi": "http://www.w3.org/2001/XMLSchema-instance",
        "@xsi:nil": "true"
      },
      "groupePolitiqueRef": "PO744425"
    },
    "cosignataires": {
      "acteurRef": [
        "PA268019",
        "PA702052",
        "PA1960",
        "PA266788",
        "PA267780",
        "PA695100",
        "PA721486",
        "PA942",
        "PA712014",
        "PA267585",
        "PA333421",
        "PA332228",
        "PA267330",
        "PA719806",
        "PA610775",
        "PA642868",
        "PA720230",
        "PA331582",
        "PA267766",
        "PA267042"
      ]
    },
    "texteAffichable": "M.&#160;Benoit,  Mme&#160;Auconie, M.&#160;Guy&#160;Bricout, M.&#160;Christophe, M.&#160;Charles&#160;de Courson, M.&#160;Favennec Becot, Mme&#160;Firmin Le Bodo, M.&#160;Gom&#232;s, M.&#160;Meyer&#160;Habib, M.&#160;Lagarde, M.&#160;Ledoux, M.&#160;Leroy, Mme&#160;Magnier, M.&#160;Morel-&#192;-L&apos;Huissier, M.&#160;Naegelen, M.&#160;Pancher, Mme&#160;Sage, M.&#160;Vercamer, M.&#160;Philippe&#160;Vigier et M.&#160;Zumkeller"
  },
  "pointeurFragmentTexte": {
    "missionVisee": {
      "@xmlns:xsi": "http://www.w3.org/2001/XMLSchema-instance",
      "@xsi:nil": "true"
    },
    "division": {
      "titre": "Article 28",
      "articleDesignationCourte": "ART. 28",
      "type": "ARTICLE",
      "avant_A_Apres": "A",
      "divisionRattachee": "ARTICLE 28",
      "articleAdditionnel": {
        "@xmlns:xsi": "http://www.w3.org/2001/XMLSchema-instance",
        "@xsi:nil": "true"
      },
      "chapitreAdditionnel": {
        "@xmlns:xsi": "http://www.w3.org/2001/XMLSchema-instance",
        "@xsi:nil": "true"
      },
      "urlDivisionTexteVise": "/15/textes/0971.asp#D_Article_28"
    },
    "alinea": {
      "avant_A_Apres": "A",
      "numero": "103",
      "alineaDesignation": "Alinéa 103"
    }
  },
  "corps": {
    "dispositif": "<p style=\"text-align: justify;\">Compl&#233;ter l&#8217;alin&#233;a&#160;103 par les mots :</p><p style=\"text-align: justify;\">&#171;&#160;sans compromettre manifestement leur &#233;quilibre &#233;conomique, ni les droits des candidats &#224; la location&#160;&#187;.</p>",
    "exposeSommaire": "<p style=\"text-align: justify;\">Le gouvernement envisage de r&#233;former la politique des loyers pour qu&#8217;ils soient davantage lies aux capacit&#233;s financi&#232;res des m&#233;nages et non aux financements d&#8217;origine.</p><p style=\"text-align: justify;\">D&#232;s lors, maintenir l&#8217;&#233;quilibre financier de certains OHLM risque d&#8217;&#234;tre compliqu&#233; et des dissensions risquent de se cr&#233;er entre zones tendues et d&#233;tendues. Par ailleurs, cet alin&#233;a pr&#233;sente aussi le risque &#224; long terme d&#8217;inciter les bailleurs sociaux &#224; s&#233;lectionner des locataires qui ont une capacit&#233; financi&#232;re suffisante, ce qui implique une s&#233;lection par l&#8217;argent et peut &#234;tre des cons&#233;quences ind&#233;sirables.</p><p style=\"text-align: justify;\">Le pr&#233;sent amendement vise donc &#224; pr&#233;ciser que cette r&#233;forme, par ordonnances, ne devra ni alt&#233;rer l&#8217;&#233;quilibre &#233;conomique des bailleurs sociaux, ni alt&#233;rer la s&#233;lection des candidats &#224; la location.</p>",
    "annexeExposeSommaire": {
      "@xmlns:xsi": "http://www.w3.org/2001/XMLSchema-instance",
      "@xsi:nil": "true"
    }
  },
  "representations": {
    "representation": {
      "nom": "PDF",
      "typeMime": {
        "type": "application",
        "subType": "PDF"
      },
      "statutRepresentation": {
        "verbatim": "true",
        "canonique": "true",
        "officielle": "true",
        "transcription": "false",
        "enregistrement": "false"
      },
      "repSource": {
        "@xmlns:xsi": "http://www.w3.org/2001/XMLSchema-instance",
        "@xsi:nil": "true"
      },
      "offset": {
        "@xmlns:xsi": "http://www.w3.org/2001/XMLSchema-instance",
        "@xsi:nil": "true"
      },
      "contenu": {
        "documentURI": "/15/amendements/0971/AN/2372.pdf"
      },
      "dateDispoRepresentation": {
        "@xmlns:xsi": "http://www.w3.org/2001/XMLSchema-instance",
        "@xsi:nil": "true"
      }
    }
  },
  "seanceDiscussion": "RUANR5L15S2018IDS21115",
  "sort": {
    "dateSaisie": "2018-06-02T21:41:47.000+02:00",
    "sortEnSeance": "Rejeté"
  },
  "dateDepot": "2018-05-25T02:00:00.000+02:00",
  "dateDistribution": "2018-05-30T02:00:00.000+02:00",
  "article99": "0",
  "loiReference": {
    "codeLoi": {
      "@xmlns:xsi": "http://www.w3.org/2001/XMLSchema-instance",
      "@xsi:nil": "true"
    },
    "divisionCodeLoi": {
      "@xmlns:xsi": "http://www.w3.org/2001/XMLSchema-instance",
      "@xsi:nil": "true"
    }
  }
}