{
  "@xmlns": "http://schemas.assemblee-nationale.fr/referentiel",
  "uid": "AMANR5L15SEA717460B2416P0D1N67",
  "identifiant": {
    "legislature": "15",
    "numero": "67",
    "numRect": "0",
    "saisine": {
      "refTexteLegislatif": "PRJLANR5L15B2416",
      "numeroPartiePLF": "0",
      "organeExamen": "PO717460",
      "mentionSecondeDeliberation": "0"
    }
  },
  "numeroLong": "67",
  "etapeTexte": "Nouvelle Lecture",
  "triAmendement": "ifaaaaaaaaaaaaaaaaaaaaaaaaaaaaaaaaaaaaaaaaaaaaaaaabs",
  "cardinaliteAmdtMultiples": "1",
  "amendementParent": {
    "@xmlns:xsi": "http://www.w3.org/2001/XMLSchema-instance",
    "@xsi:nil": "true"
  },
  "etat": "En recevabilité",
  "signataires": {
    "auteur": {
      "typeAuteur": "Depute",
      "acteurRef": "PA718884",
      "organeRef": {
        "@xmlns:xsi": "http://www.w3.org/2001/XMLSchema-instance",
        "@xsi:nil": "true"
      },
      "groupePolitiqueRef": "PO730934"
    },
    "cosignataires": {
      "acteurRef": [
        "PA719318",
        "PA718884"
      ]
    },
    "texteAffichable": "Mme&#160;Bazin-Malgras et Mme&#160;Anthoine"
  },
  "pointeurFragmentTexte": {
    "missionVisee": {
      "@xmlns:xsi": "http://www.w3.org/2001/XMLSchema-instance",
      "@xsi:nil": "true"
    },
    "division": {
      "titre": "Article 38 ter",
      "articleDesignationCourte": "ART. 38 TER",
      "type": "ARTICLE",
      "avant_A_Apres": "A",
      "divisionRattachee": "ARTICLE 38 TER",
      "articleAdditionnel": {
        "@xmlns:xsi": "http://www.w3.org/2001/XMLSchema-instance",
        "@xsi:nil": "true"
      },
      "chapitreAdditionnel": {
        "@xmlns:xsi": "http://www.w3.org/2001/XMLSchema-instance",
        "@xsi:nil": "true"
      },
      "urlDivisionTexteVise": "/15/textes/2416.asp#D_Article_38_ter"
    },
    "alinea": {
      "avant_A_Apres": {
        "@xmlns:xsi": "http://www.w3.org/2001/XMLSchema-instance",
        "@xsi:nil": "true"
      },
      "numero": "8",
      "alineaDesignation": {
        "@xmlns:xsi": "http://www.w3.org/2001/XMLSchema-instance",
        "@xsi:nil": "true"
      }
    }
  },
  "corps": {
    "dispositif": "<p>I.&#160;&#8211;&#160;&#192; l&#8217;alin&#233;a&#160;8, substituer au mot&#160;:</p><p style=\"text-align: justify;\">&#171;&#160;champ&#160;&#187;</p><p style=\"text-align: justify;\">les mots&#160;:</p><p style=\"text-align: justify;\">&#171;&#160;p&#233;rim&#232;tre du forfait sant&#233;&#160;&#187;.</p><p style=\"text-align: justify;\">II.&#160;&#8211;&#160;En cons&#233;quence, au m&#234;me alin&#233;a, apr&#232;s la premi&#232;re occurrence du mot&#160;:</p><p style=\"text-align: justify;\">&#171;&#160;de&#160;&#187;,</p><p style=\"text-align: justify;\">ins&#233;rer les mots&#160;:</p><p style=\"text-align: justify;\">&#171;&#160;financement et de&#160;&#187;.</p>",
    "exposeSommaire": "<p style=\"text-align: justify;\">A l&#8217;occasion des discussions sur la mission relative au panier de soin en &#233;tablissement pour personnes en situation de handicap avec l&#8217;administration centrale, il a &#233;t&#233; pr&#233;cis&#233; aux acteurs participants</p><p style=\"text-align: justify;\">Que le forfait sant&#233; financerait d&#233;sormais uniquement&#160;:</p><p style=\"text-align: justify;\">-&#160; Ce qui rel&#232;ve de la coordination de la pr&#233;vention et des soins</p><p style=\"text-align: justify;\">-&#160; Ce qui rel&#232;ve des activit&#233;s de nursing</p><p style=\"text-align: justify;\">-&#160; Ce qui rel&#232;ve de la d&#233;ficience et de l&#8217;accompagnement &#224; l&#8217;autonomie, en fonction du plateau technique de l&#8217;ESMS</p><p style=\"text-align: justify;\">Ce qui rel&#232;ve de la maladie (soins m&#233;dicaux) effectu&#233;s en dehors de l&#8217;ESMS basculerait ainsi en int&#233;gralit&#233; sur la carte vitale de la personne.</p><p style=\"text-align: justify;\">Il a &#233;t&#233; affirm&#233; que l&#8217;&#233;tablissement conserverait le surplus des sommes qui auraient pu &#234;tre utilis&#233;es pour financer des soins m&#233;dicaux (consultations de sp&#233;cialistes par exemple, d&#233;sormais financ&#233; via la carte vitale) mais devrait red&#233;ployer ce surplus autrement. L&#8217;enjeu &#233;tant que l&#8217;&#233;tablissement r&#233;interroge son projet d&#8217;&#233;tablissement et pense diff&#233;remment la question de la coordination ou de la pr&#233;vention.</p><p style=\"text-align: justify;\">Le pr&#233;sent amendement a ainsi vocation &#224; pr&#233;ciser que le sujet du montant du forfait sant&#233; sera int&#233;gr&#233; au projet de texte et que les pr&#233;cisions &#233;voqu&#233;es ci-dessus seront bien act&#233;es par d&#233;cret.</p>",
    "annexeExposeSommaire": {
      "@xmlns:xsi": "http://www.w3.org/2001/XMLSchema-instance",
      "@xsi:nil": "true"
    },
    "cartoucheDelaiDepotDepasse": "Sous réserve de son traitement par les services de l'Assemblée nationale et de sa recevabilité",
    "avantAppel": {
      "@xmlns:xsi": "http://www.w3.org/2001/XMLSchema-instance",
      "@xsi:nil": "true"
    }
  },
  "representations": {
    "representation": {
      "nom": "PDF",
      "typeMime": {
        "type": "application",
        "subType": "PDF"
      },
      "statutRepresentation": {
        "verbatim": "true",
        "canonique": "true",
        "officielle": "true",
        "transcription": "false",
        "enregistrement": "false"
      },
      "repSource": {
        "@xmlns:xsi": "http://www.w3.org/2001/XMLSchema-instance",
        "@xsi:nil": "true"
      },
      "offset": {
        "@xmlns:xsi": "http://www.w3.org/2001/XMLSchema-instance",
        "@xsi:nil": "true"
      },
      "contenu": {
        "documentURI": "/15/amendements/2416/AN/67.pdf"
      },
      "dateDispoRepresentation": {
        "@xmlns:xsi": "http://www.w3.org/2001/XMLSchema-instance",
        "@xsi:nil": "true"
      }
    }
  },
  "seanceDiscussion": {
    "@xmlns:xsi": "http://www.w3.org/2001/XMLSchema-instance",
    "@xsi:nil": "true"
  },
  "sort": {
    "@xmlns:xsi": "http://www.w3.org/2001/XMLSchema-instance",
    "@xsi:nil": "true"
  },
  "dateDepot": "2019-11-20T01:00:00.000+01:00",
  "dateDistribution": "2019-11-21T01:00:00.000+01:00",
  "article99": "0",
  "loiReference": {
    "codeLoi": {
      "@xmlns:xsi": "http://www.w3.org/2001/XMLSchema-instance",
      "@xsi:nil": "true"
    },
    "divisionCodeLoi": {
      "@xmlns:xsi": "http://www.w3.org/2001/XMLSchema-instance",
      "@xsi:nil": "true"
    }
  }
}