{
  "@xmlns": "http://schemas.assemblee-nationale.fr/referentiel",
  "uid": "AMANR5L15SEA717460BTC1019P0D1N146",
  "identifiant": {
    "legislature": "15",
    "numero": "146",
    "numRect": "0",
    "saisine": {
      "refTexteLegislatif": "PRJLANR5L15BTC1019",
      "numeroPartiePLF": "0",
      "organeExamen": "PO717460",
      "mentionSecondeDeliberation": "0"
    }
  },
  "numeroLong": "146",
  "etapeTexte": "1ère lecture (1ère assemblée saisie)",
  "triAmendement": "adi",
  "cardinaliteAmdtMultiples": "1",
  "amendementParent": {
    "@xmlns:xsi": "http://www.w3.org/2001/XMLSchema-instance",
    "@xsi:nil": "true"
  },
  "etat": "Discuté",
  "signataires": {
    "auteur": {
      "typeAuteur": "Depute",
      "acteurRef": "PA719318",
      "organeRef": {
        "@xmlns:xsi": "http://www.w3.org/2001/XMLSchema-instance",
        "@xsi:nil": "true"
      },
      "groupePolitiqueRef": "PO730934"
    },
    "cosignataires": {
      "acteurRef": "PA719318"
    },
    "texteAffichable": "Mme&#160;Anthoine"
  },
  "pointeurFragmentTexte": {
    "missionVisee": {
      "@xmlns:xsi": "http://www.w3.org/2001/XMLSchema-instance",
      "@xsi:nil": "true"
    },
    "division": {
      "titre": "Article 11",
      "articleDesignationCourte": "ART. 11",
      "type": "ARTICLE",
      "avant_A_Apres": "A",
      "divisionRattachee": "ARTICLE 11",
      "articleAdditionnel": {
        "@xmlns:xsi": "http://www.w3.org/2001/XMLSchema-instance",
        "@xsi:nil": "true"
      },
      "chapitreAdditionnel": {
        "@xmlns:xsi": "http://www.w3.org/2001/XMLSchema-instance",
        "@xsi:nil": "true"
      },
      "urlDivisionTexteVise": "/15/textes/1019.asp#D_Article_11"
    },
    "alinea": {
      "@xmlns:xsi": "http://www.w3.org/2001/XMLSchema-instance",
      "@xsi:nil": "true"
    }
  },
  "corps": {
    "dispositif": "<p>Supprimer cet article.</p>",
    "exposeSommaire": "<p style=\"text-align: justify;\">La cr&#233;ation sur simple d&#233;claration d&#8217;activit&#233; des CFA a pour cons&#233;quence d&#8217;enlever aux r&#233;gions la ma&#238;trise sur ce sujet. On sort ainsi d&#8217;un mode administr&#233;, ce qui pourrait avoir de graves cons&#233;quences.</p><p style=\"text-align: justify;\">On sort d&#8217;une logique administr&#233;e pour passer &#224; une logique de march&#233;. En effet, en faisant le choix, par ailleurs dans le texte, de financer l&#8217;apprentissage au contrat, le Gouvernement expose les territoires &#224; un risque quant au choix d&#8217;installation des CFA.</p><p style=\"text-align: justify;\">On s&#8217;expose alors &#224; un risque majeur, celui de voir les CFA urbains ou concentr&#233;s sur des m&#233;tiers plus rentables se d&#233;velopper au d&#233;triment des espaces ruraux ou des m&#233;tiers dont le co&#251;t de formation est plus important, qui seraient ainsi exclus de l&#8217;offre d&#8217;apprentissage.</p><p style=\"text-align: justify;\">Cela va profond&#233;ment d&#233;savantager les territoires ruraux et p&#233;riurbains.</p><p style=\"text-align: justify;\">Les premi&#232;res victimes seront les jeunes de ces territoires qui souffriront du d&#233;ficit d&#8217;offre de formation &#224; proximit&#233;. Ils subissent d&#233;j&#224; un taux de ch&#244;mage plus &#233;lev&#233; et des perspectives professionnelles &#233;troites.</p><p style=\"text-align: justify;\">On devrait au contraire, par une politique coordonn&#233;e et administr&#233;e au niveau r&#233;gional s&#8217;assurer de la ma&#238;trise des implantations d&#8217;offre de formation d&#8217;apprentissage correspondant aux besoins des territoires plut&#244;t que de lib&#233;raliser cette activit&#233; qui vise &#224; corriger les d&#233;fauts du march&#233;.</p><p style=\"text-align: justify;\">En effet, les entreprises des territoires ruraux et p&#233;riurbains seront aussi p&#233;nalis&#233;es puisqu&#8217;elles ne trouveront plus sur place la main-d&#8217;&#339;uvre dont elles ont besoin. Ce sera pr&#233;judiciable &#224; l&#8217;activit&#233; &#233;conomique.</p><p style=\"text-align: justify;\">De nombreux bassins d&#8217;emploi seront appauvris en comp&#233;tences et en entreprises, accroissant ainsi le ch&#244;mage de masse que connaissent encore de nombreux territoires. Toujours les m&#234;mes, les territoires ruraux.</p><p style=\"text-align: justify;\">Pour toutes ces raisons, le pr&#233;sent amendement vise &#224; emp&#234;cher cette lib&#233;ralisation de l&#8217;implantation des CFA en supprimant l&#8217;article&#160;11 du projet de loi.</p>",
    "annexeExposeSommaire": {
      "@xmlns:xsi": "http://www.w3.org/2001/XMLSchema-instance",
      "@xsi:nil": "true"
    }
  },
  "representations": {
    "representation": {
      "nom": "PDF",
      "typeMime": {
        "type": "application",
        "subType": "PDF"
      },
      "statutRepresentation": {
        "verbatim": "true",
        "canonique": "true",
        "officielle": "true",
        "transcription": "false",
        "enregistrement": "false"
      },
      "repSource": {
        "@xmlns:xsi": "http://www.w3.org/2001/XMLSchema-instance",
        "@xsi:nil": "true"
      },
      "offset": {
        "@xmlns:xsi": "http://www.w3.org/2001/XMLSchema-instance",
        "@xsi:nil": "true"
      },
      "contenu": {
        "documentURI": "/15/amendements/1019/AN/146.pdf"
      },
      "dateDispoRepresentation": {
        "@xmlns:xsi": "http://www.w3.org/2001/XMLSchema-instance",
        "@xsi:nil": "true"
      }
    }
  },
  "seanceDiscussion": "RUANR5L15S2018IDS21103",
  "sort": {
    "dateSaisie": "2018-06-14T23:59:59.000+02:00",
    "sortEnSeance": "Non soutenu"
  },
  "dateDepot": "2018-06-05T02:00:00.000+02:00",
  "dateDistribution": "2018-06-11T02:00:00.000+02:00",
  "article99": "0",
  "loiReference": {
    "codeLoi": {
      "@xmlns:xsi": "http://www.w3.org/2001/XMLSchema-instance",
      "@xsi:nil": "true"
    },
    "divisionCodeLoi": {
      "@xmlns:xsi": "http://www.w3.org/2001/XMLSchema-instance",
      "@xsi:nil": "true"
    }
  }
}