{
  "@xmlns": "http://schemas.assemblee-nationale.fr/referentiel",
  "uid": "AMANR5L15SEA717460BTC1924P0D1N897",
  "identifiant": {
    "legislature": "15",
    "numero": "897",
    "numRect": "0",
    "saisine": {
      "refTexteLegislatif": "PRJLANR5L15BTC1924",
      "numeroPartiePLF": "0",
      "organeExamen": "PO717460",
      "mentionSecondeDeliberation": "0"
    }
  },
  "numeroLong": "897",
  "etapeTexte": "1ère lecture (1ère assemblée saisie)",
  "triAmendement": "abaaaaaaaaaaaaaaaaaaaaaaaaaaaaaaaaaaaaaaaaaaaaaaaaie",
  "cardinaliteAmdtMultiples": "1",
  "amendementParent": {
    "@xmlns:xsi": "http://www.w3.org/2001/XMLSchema-instance",
    "@xsi:nil": "true"
  },
  "etat": "Discuté",
  "signataires": {
    "auteur": {
      "typeAuteur": "Depute",
      "acteurRef": "PA721860",
      "organeRef": {
        "@xmlns:xsi": "http://www.w3.org/2001/XMLSchema-instance",
        "@xsi:nil": "true"
      },
      "groupePolitiqueRef": "PO730964"
    },
    "cosignataires": {
      "acteurRef": [
        "PA718756",
        "PA607155",
        "PA721860",
        "PA718802",
        "PA719186",
        "PA720538",
        "PA721784",
        "PA334116",
        "PA718728",
        "PA719480",
        "PA722366",
        "PA718744",
        "PA721916",
        "PA718710",
        "PA719396",
        "PA719972",
        "PA722070"
      ]
    },
    "texteAffichable": "M.&#160;Cesarini,  Mme&#160;Gomez-Bassac, M.&#160;Larsonneur, M.&#160;Fugit, Mme&#160;Vanceunebrock-Mialon, M.&#160;Daniel, M.&#160;Gaillard, Mme&#160;Jacqueline&#160;Maquet, M.&#160;Perea, Mme&#160;Khattabi, Mme&#160;Sarles, Mme&#160;Pouzyreff, Mme&#160;De Temmerman, Mme&#160;Pascale&#160;Boyer, Mme&#160;Bagarry, Mme&#160;Bono-Vandorme et M.&#160;Henriet"
  },
  "pointeurFragmentTexte": {
    "missionVisee": {
      "@xmlns:xsi": "http://www.w3.org/2001/XMLSchema-instance",
      "@xsi:nil": "true"
    },
    "division": {
      "titre": "Article PREMIER",
      "articleDesignationCourte": "ART. PREMIER",
      "type": "ARTICLE",
      "avant_A_Apres": "A",
      "divisionRattachee": "ARTICLE PREMIER",
      "articleAdditionnel": {
        "@xmlns:xsi": "http://www.w3.org/2001/XMLSchema-instance",
        "@xsi:nil": "true"
      },
      "chapitreAdditionnel": {
        "@xmlns:xsi": "http://www.w3.org/2001/XMLSchema-instance",
        "@xsi:nil": "true"
      },
      "urlDivisionTexteVise": "/15/textes/1924.asp#D_Article_1er"
    },
    "alinea": {
      "avant_A_Apres": {
        "@xmlns:xsi": "http://www.w3.org/2001/XMLSchema-instance",
        "@xsi:nil": "true"
      },
      "numero": "2",
      "alineaDesignation": {
        "@xmlns:xsi": "http://www.w3.org/2001/XMLSchema-instance",
        "@xsi:nil": "true"
      }
    }
  },
  "corps": {
    "dispositif": "<p style=\"text-align: justify;\">&#192; la fin de l&#8217;alin&#233;a&#160;2, substituer aux mots&#160;:</p><p style=\"text-align: justify;\">&#171;&#160;dont la liste est &#233;tablie par d&#233;cret en Conseil d&#8217;&#201;tat.&#160;&#187;,</p><p style=\"text-align: justify;\">les mots&#160;:</p><p style=\"text-align: justify;\">&#171;&#160;relatives &#224; leur carri&#232;re.&#160;&#187;</p>",
    "exposeSommaire": "<p style=\"text-align: justify;\">Les CAP, instances paritaires permettent de juger de la conformit&#233; les d&#233;cisions individuelles relatives &#224; la carri&#232;re des fonctionnaires. En limitant &#224; une liste fix&#233;e par d&#233;cret en Conseil d&#8217;&#201;tat les moments o&#249; les CAP se tiendront, il sera alors tentant pour les les pouvoirs publics de r&#233;duire le nombre de cas o&#249; il sera fait appel au CAP. Un dialogue de gestion n&#8217;a pas la finesse des CAP qui permettent de juger la situation au cas par cas des fonctionnaires. Ces CAP permettent souvent de corriger des erreurs sans qu&#8217;il y ait besoin d&#8217;un recours syst&#233;matique &#224; la voie des recours. Se limiter &#224; un simple dialogue de gestion, risque tr&#232;s rapidement d&#8217;aboutir &#224; une multiplication des recours individuels.&#160;</p>",
    "annexeExposeSommaire": {
      "@xmlns:xsi": "http://www.w3.org/2001/XMLSchema-instance",
      "@xsi:nil": "true"
    },
    "cartoucheDelaiDepotDepasse": {
      "@xmlns:xsi": "http://www.w3.org/2001/XMLSchema-instance",
      "@xsi:nil": "true"
    }
  },
  "representations": {
    "representation": {
      "nom": "PDF",
      "typeMime": {
        "type": "application",
        "subType": "PDF"
      },
      "statutRepresentation": {
        "verbatim": "true",
        "canonique": "true",
        "officielle": "true",
        "transcription": "false",
        "enregistrement": "false"
      },
      "repSource": {
        "@xmlns:xsi": "http://www.w3.org/2001/XMLSchema-instance",
        "@xsi:nil": "true"
      },
      "offset": {
        "@xmlns:xsi": "http://www.w3.org/2001/XMLSchema-instance",
        "@xsi:nil": "true"
      },
      "contenu": {
        "documentURI": "/15/amendements/1924/AN/897.pdf"
      },
      "dateDispoRepresentation": {
        "@xmlns:xsi": "http://www.w3.org/2001/XMLSchema-instance",
        "@xsi:nil": "true"
      }
    }
  },
  "seanceDiscussion": {
    "@xmlns:xsi": "http://www.w3.org/2001/XMLSchema-instance",
    "@xsi:nil": "true"
  },
  "sort": {
    "dateSaisie": "2019-05-14T18:54:24.000+02:00",
    "sortEnSeance": "Non soutenu"
  },
  "dateDepot": "2019-05-09T02:00:00.000+02:00",
  "dateDistribution": "2019-05-10T02:00:00.000+02:00",
  "article99": "0",
  "loiReference": {
    "codeLoi": {
      "@xmlns:xsi": "http://www.w3.org/2001/XMLSchema-instance",
      "@xsi:nil": "true"
    },
    "divisionCodeLoi": {
      "@xmlns:xsi": "http://www.w3.org/2001/XMLSchema-instance",
      "@xsi:nil": "true"
    }
  }
}