{
  "@xmlns": "http://schemas.assemblee-nationale.fr/referentiel",
  "uid": "AMANR5L15SEA717460B1255P2D1N2133",
  "identifiant": {
    "legislature": "15",
    "numero": "2133",
    "numRect": "0",
    "saisine": {
      "refTexteLegislatif": "PRJLANR5L15B1255",
      "numeroPartiePLF": "2",
      "organeExamen": "PO717460",
      "mentionSecondeDeliberation": "1"
    }
  },
  "numeroLong": "II-2133",
  "etapeTexte": "1ère lecture (1ère assemblée saisie)",
  "triAmendement": "ilaaaaaaaaaaaaaaaaaaaaaaaaaaaaaaaaaaaaaaaaaaaaaaaamg",
  "cardinaliteAmdtMultiples": "1",
  "amendementParent": {
    "@xmlns:xsi": "http://www.w3.org/2001/XMLSchema-instance",
    "@xsi:nil": "true"
  },
  "etat": "Discuté",
  "signataires": {
    "auteur": {
      "typeAuteur": "Depute",
      "acteurRef": "PA718720",
      "organeRef": {
        "@xmlns:xsi": "http://www.w3.org/2001/XMLSchema-instance",
        "@xsi:nil": "true"
      },
      "groupePolitiqueRef": "PO730940"
    },
    "cosignataires": {
      "acteurRef": [
        "PA722110",
        "PA721270",
        "PA718926",
        "PA610667",
        "PA721012",
        "PA720692",
        "PA722202",
        "PA335612",
        "PA267306",
        "PA610654",
        "PA718720",
        "PA721118",
        "PA721896",
        "PA441",
        "PA720546",
        "PA689"
      ]
    },
    "texteAffichable": "M.&#160;Dufr&#232;gne,  M.&#160;Fabien&#160;Roussel, Mme&#160;Bello, M.&#160;Brotherson, M.&#160;Bruneel, Mme&#160;Buffet, M.&#160;Chassaigne, M.&#160;Dharr&#233;ville, Mme&#160;Faucillon, M.&#160;Jumel, Mme&#160;K&#233;clard-Mond&#233;sir, M.&#160;Lecoq, M.&#160;Nilor, M.&#160;Peu, M.&#160;Serville et M.&#160;Wulfranc"
  },
  "pointeurFragmentTexte": {
    "missionVisee": {
      "@xmlns:xsi": "http://www.w3.org/2001/XMLSchema-instance",
      "@xsi:nil": "true"
    },
    "division": {
      "titre": "Article 65",
      "articleDesignationCourte": "ART. 65",
      "type": "ARTICLE",
      "avant_A_Apres": "A",
      "divisionRattachee": "ARTICLE 65",
      "articleAdditionnel": {
        "@xmlns:xsi": "http://www.w3.org/2001/XMLSchema-instance",
        "@xsi:nil": "true"
      },
      "chapitreAdditionnel": {
        "@xmlns:xsi": "http://www.w3.org/2001/XMLSchema-instance",
        "@xsi:nil": "true"
      },
      "urlDivisionTexteVise": "/15/textes/1255C.asp#D_Article_65"
    },
    "alinea": {
      "avant_A_Apres": {
        "@xmlns:xsi": "http://www.w3.org/2001/XMLSchema-instance",
        "@xsi:nil": "true"
      },
      "numero": "1",
      "alineaDesignation": {
        "@xmlns:xsi": "http://www.w3.org/2001/XMLSchema-instance",
        "@xsi:nil": "true"
      }
    }
  },
  "corps": {
    "dispositif": "<p style=\"text-align: justify;\">Supprimer l'alin&#233;a 1.</p>",
    "exposeSommaire": "<p style=\"text-align: justify;\">L&#8217;article 65 du PLF 2019 met en &#339;uvre la d&#233;sindexation des prestations sociales. Celles-ci ne seront revaloris&#233;es que de 0,3 % en 2019 et 2020 quand l&#8217;inflation est estim&#233;e &#224; 1,3 %, ce qui se traduira m&#233;caniquement par une baisse de pouvoir d&#8217;achat pour les m&#233;nages.</p><p style=\"text-align: justify;\">Le premier alin&#233;a du pr&#233;sent article pr&#233;voit le quasi gel des allocations logement, engendrant une &#233;conomie pour l&#8217;&#201;tat de 100 millions d&#8217;euros en 2019, port&#233;e &#224; 400 millions d&#8217;euros en 2020.</p><p style=\"text-align: justify;\">Apr&#232;s la r&#233;duction de 5 euros des APL d&#233;cid&#233;e brutalement par le Gouvernement, il s&#8217;agit d&#8217;une nouvelle attaque contre les aides au logement qui sont essentielles pour nombre de nos concitoyens. C&#8217;est pourquoi nous demandons la suppression de cette disposition.</p>",
    "annexeExposeSommaire": {
      "@xmlns:xsi": "http://www.w3.org/2001/XMLSchema-instance",
      "@xsi:nil": "true"
    },
    "cartoucheDelaiDepotDepasse": {
      "@xmlns:xsi": "http://www.w3.org/2001/XMLSchema-instance",
      "@xsi:nil": "true"
    }
  },
  "representations": {
    "representation": {
      "nom": "PDF",
      "typeMime": {
        "type": "application",
        "subType": "PDF"
      },
      "statutRepresentation": {
        "verbatim": "true",
        "canonique": "true",
        "officielle": "true",
        "transcription": "false",
        "enregistrement": "false"
      },
      "repSource": {
        "@xmlns:xsi": "http://www.w3.org/2001/XMLSchema-instance",
        "@xsi:nil": "true"
      },
      "offset": {
        "@xmlns:xsi": "http://www.w3.org/2001/XMLSchema-instance",
        "@xsi:nil": "true"
      },
      "contenu": {
        "documentURI": "/15/amendements/1255C/AN/2133.pdf"
      },
      "dateDispoRepresentation": {
        "@xmlns:xsi": "http://www.w3.org/2001/XMLSchema-instance",
        "@xsi:nil": "true"
      }
    }
  },
  "seanceDiscussion": "RUANR5L15S2019IDS21345",
  "sort": {
    "dateSaisie": "2018-11-16T20:31:42.000+01:00",
    "sortEnSeance": "Rejeté"
  },
  "dateDepot": "2018-11-12T01:00:00.000+01:00",
  "dateDistribution": "2018-11-15T01:00:00.000+01:00",
  "article99": "0",
  "loiReference": {
    "codeLoi": {
      "@xmlns:xsi": "http://www.w3.org/2001/XMLSchema-instance",
      "@xsi:nil": "true"
    },
    "divisionCodeLoi": {
      "@xmlns:xsi": "http://www.w3.org/2001/XMLSchema-instance",
      "@xsi:nil": "true"
    }
  }
}