{
  "@xmlns": "http://schemas.assemblee-nationale.fr/referentiel",
  "uid": "AMANR5L15SEA717460BTC1547P0D1N141",
  "identifiant": {
    "legislature": "15",
    "numero": "141",
    "numRect": "0",
    "saisine": {
      "refTexteLegislatif": "PRJLANR5L15BTC1547",
      "numeroPartiePLF": "0",
      "organeExamen": "PO717460",
      "mentionSecondeDeliberation": "0"
    }
  },
  "numeroLong": "141",
  "etapeTexte": "1ère lecture (1ère assemblée saisie)",
  "triAmendement": "eaaaaaaaaaaaaaaaaaaaaaaaaaaaaaaaaaaaaaaaaaaaaaaaaazw",
  "cardinaliteAmdtMultiples": "1",
  "amendementParent": {
    "@xmlns:xsi": "http://www.w3.org/2001/XMLSchema-instance",
    "@xsi:nil": "true"
  },
  "etat": "Irrecevable",
  "signataires": {
    "auteur": {
      "typeAuteur": "Depute",
      "acteurRef": "PA721062",
      "organeRef": {
        "@xmlns:xsi": "http://www.w3.org/2001/XMLSchema-instance",
        "@xsi:nil": "true"
      },
      "groupePolitiqueRef": "PO730958"
    },
    "cosignataires": {
      "acteurRef": [
        "PA719676",
        "PA720286",
        "PA720430",
        "PA718868",
        "PA588884",
        "PA720846",
        "PA721210",
        "PA720892",
        "PA721202",
        "PA722142",
        "PA721226",
        "PA719578",
        "PA721062",
        "PA2150",
        "PA718860",
        "PA720422",
        "PA721960"
      ]
    },
    "texteAffichable": "M.&#160;Ratenon,  Mme&#160;Autain, M.&#160;Bernalicis, M.&#160;Coquerel, M.&#160;Corbi&#232;re, Mme&#160;Fiat, M.&#160;Lachaud, M.&#160;Larive, M.&#160;M&#233;lenchon, Mme&#160;Obono, Mme&#160;Panot, M.&#160;Prud&apos;homme, M.&#160;Quatennens, Mme&#160;Ressiguier, Mme&#160;Rubin, M.&#160;Ruffin et Mme&#160;Taurine"
  },
  "pointeurFragmentTexte": {
    "missionVisee": {
      "@xmlns:xsi": "http://www.w3.org/2001/XMLSchema-instance",
      "@xsi:nil": "true"
    },
    "division": {
      "titre": "Article 2",
      "articleDesignationCourte": "APRÈS ART. 2",
      "type": "ARTICLE",
      "avant_A_Apres": "Après",
      "divisionRattachee": "APRÈS L'ARTICLE 2, insérer l'article suivant:",
      "articleAdditionnel": "1",
      "chapitreAdditionnel": {
        "@xmlns:xsi": "http://www.w3.org/2001/XMLSchema-instance",
        "@xsi:nil": "true"
      },
      "urlDivisionTexteVise": "/15/textes/1547.asp#D_Article_2"
    },
    "alinea": {
      "@xmlns:xsi": "http://www.w3.org/2001/XMLSchema-instance",
      "@xsi:nil": "true"
    }
  },
  "corps": {
    "dispositif": "<p>I.&#160;&#8211;&#160;&#192; titre exp&#233;rimental et jusqu&#8217;au 31&#160;d&#233;cembre&#160;2020, un dispositif d&#8217;exon&#233;ration de cotisations, nomm&#233; &#171;&#160;&#171;&#160;Objectif 32h&#160;&#187;&#160;&#187;, est institu&#233;. Il est mis en &#339;uvre au b&#233;n&#233;fice des entreprises situ&#233;es sur le territoire national qui embauchent, en contrat &#224; dur&#233;e d&#233;termin&#233;e, un salari&#233; pour une dur&#233;e de 32 heures, pay&#233;es 35 heures, dans des territoires dont la liste est fix&#233;e par arr&#234;t&#233; conjoint des ministres charg&#233;s de l&#8217;emploi, de sant&#233; et du budget.</p><p>Les conditions de mise en &#339;uvre de ce dispositif sont d&#233;finies par d&#233;cret.</p><p>II.&#160;&#8211;&#160;Le I entre en vigueur le 1er&#160;janvier&#160;2019.</p><p>III.&#160;&#8211;&#160;Le Gouvernement remet au Parlement un rapport d&#8217;&#233;valuation de l&#8217;exp&#233;rimentation au plus tard le 15&#160;septembre&#160;2020.</p><p>IV.&#160;&#8211;&#160;La perte de recettes pour les organismes de s&#233;curit&#233; sociale est compens&#233;e &#224; due concurrence par la majoration des droits mentionn&#233;s aux articles 575 et 575 A du code g&#233;n&#233;ral des imp&#244;ts.</p>",
    "exposeSommaire": "<p>En 2014, le rapport de la commission d&#8217;enqu&#234;te sur l&#8217;impact soci&#233;tal, social, &#233;conomique et financier de la r&#233;duction progressive du temps de travail &#233;tablissait un bilan de la derni&#232;re r&#233;duction du temps de travail, de 39 &#224; 35h. Plusieurs effets ont &#233;t&#233; relev&#233;s. Des effets tr&#232;s positifs sur le niveau de l&#8217;emploi, avec 350 000 emplois cr&#233;&#233;s.</p><p>&#8220;Les comptes des entreprises n&#8217;ont pas &#233;t&#233; d&#233;grad&#233;s par les 35 heures&#8221;</p><p>&#8220;La r&#233;duction du temps de travail a eu un co&#251;t mod&#233;r&#233; pour les finances publiques, compens&#233; par des recettes suppl&#233;mentaires et de moindres d&#233;penses dentransfert&#8221;</p><p>&#8220;La r&#233;duction du temps de travail a fait na&#238;tre un sentiment g&#233;n&#233;ral d&#8217;am&#233;lioration des conditions de vie, sans remettre en cause la valeur accord&#233;e au travail&#8221;</p><p>&#8220;La famille a &#233;t&#233; la principale b&#233;n&#233;ficiaire de la r&#233;duction du temps de travail, entra&#238;nant m&#234;me un d&#233;but de r&#233;allocation des temps de travail entre les hommes et les femmes&#8221;. Pour r&#233;sumer, le passage aux 35h n&#8217;a pas eu d&#8217;effets symboliques n&#233;fastes, n&#8217;a pas pes&#233; sur les finances publiques et a cr&#233;&#233; des emplois. Autrement dit, cette mesure se situe aux antipodes de la pr&#233;sente proposition de loi, qui co&#251;tera plus cher et d&#233;truira des emplois. A l&#8217;aune de ce rapport&#160;et des &#233;tudes conduites depuis, notamment un rapport de l&#8217;IGAS publi&#233; en 2016, on peut dire que le passage aux 35h est la seule politique de r&#233;duction du ch&#244;mage r&#233;ellement efficace survenue au cours des vingt derni&#232;res ann&#233;es. Au-del&#224; des simples consid&#233;rations macro-&#233;conomiques, cette r&#233;forme a eu des effets positifs sur la soci&#233;t&#233; fran&#231;aise, et sur ses familles. Plut&#244;t que de vouloir r&#233;introduire une mesure qui va &#224; l&#8217;encontre du partage du travail, les d&#233;put&#233;.e.s de la France Insoumise souhaitent reprendre &#224; leur compte la seule politique qui a cr&#233;&#233; de l&#8217;emploi, en l&#8217;&#233;tendant.</p><p>Le partage du temps de travail doit donc &#234;tre un levier permettant l&#8217;acc&#232;s du plus grand nombre &#224; l&#8217;emploi mais il r&#233;pond aussi &#224; la question de la place du travail dans la vie d&#8217;un individu.<br /> Les gains de productivit&#233; sont tels que deux salari&#233;s produisent aujourd&#8217;hui en moyenne plus que trois salari&#233;s au d&#233;but des ann&#233;es 1980. L&#8217;augmentation de la productivit&#233; ne doit pas inciter &#224; une course &#224; la production.<br /> Quel serait l&#8217;int&#233;r&#234;t de la recherche d&#8217;une production illimit&#233;e alors que les besoins seraient d&#233;j&#224; satisfaits&#160;?<br /> Comment r&#233;pondre au d&#233;fi &#233;cologique en favorisant une production illimit&#233;e alors que nos ressources sont limit&#233;es&#160;?<br /> Par cet amendement, nous souhaitons instaurer une exp&#233;rimentation intitul&#233;e &#171;&#160;&#171;&#160;Objectif 32h&#160;&#187;&#160;&#187; et qui consistera en l&#8217;exon&#233;ration de cotisations pour les salari&#233;s qui ont sign&#233; un contrat aux 32h pay&#233;es 35h. L&#8217;exp&#233;rimentation permettra d&#8217;&#233;tudier l&#8217;impact d&#8217;une telle mesure sur la productivit&#233; de l&#8217;entreprise, la sant&#233; des salari&#233;s et le bonheur au travail, ainsi que l&#8217;effet sur les besoins en recrutement.</p>",
    "annexeExposeSommaire": {
      "@xmlns:xsi": "http://www.w3.org/2001/XMLSchema-instance",
      "@xsi:nil": "true"
    },
    "cartoucheDelaiDepotDepasse": {
      "@xmlns:xsi": "http://www.w3.org/2001/XMLSchema-instance",
      "@xsi:nil": "true"
    }
  },
  "representations": {
    "representation": {
      "nom": "PDF",
      "typeMime": {
        "type": "application",
        "subType": "PDF"
      },
      "statutRepresentation": {
        "verbatim": "true",
        "canonique": "true",
        "officielle": "true",
        "transcription": "false",
        "enregistrement": "false"
      },
      "repSource": {
        "@xmlns:xsi": "http://www.w3.org/2001/XMLSchema-instance",
        "@xsi:nil": "true"
      },
      "offset": {
        "@xmlns:xsi": "http://www.w3.org/2001/XMLSchema-instance",
        "@xsi:nil": "true"
      },
      "contenu": {
        "documentURI": "/15/amendements/1547/AN/141.pdf"
      },
      "dateDispoRepresentation": {
        "@xmlns:xsi": "http://www.w3.org/2001/XMLSchema-instance",
        "@xsi:nil": "true"
      }
    }
  },
  "seanceDiscussion": {
    "@xmlns:xsi": "http://www.w3.org/2001/XMLSchema-instance",
    "@xsi:nil": "true"
  },
  "sort": {
    "@xmlns:xsi": "http://www.w3.org/2001/XMLSchema-instance",
    "@xsi:nil": "true"
  },
  "dateDepot": "2018-12-20T01:00:00.000+01:00",
  "dateDistribution": "2018-12-20T01:00:00.000+01:00",
  "article99": "0",
  "loiReference": {
    "codeLoi": {
      "@xmlns:xsi": "http://www.w3.org/2001/XMLSchema-instance",
      "@xsi:nil": "true"
    },
    "divisionCodeLoi": {
      "@xmlns:xsi": "http://www.w3.org/2001/XMLSchema-instance",
      "@xsi:nil": "true"
    }
  }
}