{
  "@xmlns": "http://schemas.assemblee-nationale.fr/referentiel",
  "uid": "AMANR5L15SEA717460BTC2243P0D1N432",
  "identifiant": {
    "legislature": "15",
    "numero": "432",
    "numRect": "0",
    "saisine": {
      "refTexteLegislatif": "PRJLANR5L15BTC2243",
      "numeroPartiePLF": "0",
      "organeExamen": "PO717460",
      "mentionSecondeDeliberation": "0"
    }
  },
  "numeroLong": "432",
  "etapeTexte": "1ère lecture (1ère assemblée saisie)",
  "triAmendement": "auaaaaaaaaaaaaaaaaaaaaaaaaaaaaaaaaaaaaaaaaaaaaaaaadddi",
  "cardinaliteAmdtMultiples": "1",
  "amendementParent": {
    "@xmlns:xsi": "http://www.w3.org/2001/XMLSchema-instance",
    "@xsi:nil": "true"
  },
  "etat": "Discuté",
  "signataires": {
    "auteur": {
      "typeAuteur": "Depute",
      "acteurRef": "PA608416",
      "organeRef": {
        "@xmlns:xsi": "http://www.w3.org/2001/XMLSchema-instance",
        "@xsi:nil": "true"
      },
      "groupePolitiqueRef": "PO730934"
    },
    "cosignataires": {
      "acteurRef": [
        "PA266776",
        "PA608416"
      ]
    },
    "texteAffichable": "M.&#160;Hetzel et M.&#160;Reiss"
  },
  "pointeurFragmentTexte": {
    "missionVisee": {
      "@xmlns:xsi": "http://www.w3.org/2001/XMLSchema-instance",
      "@xsi:nil": "true"
    },
    "division": {
      "titre": "Article 4",
      "articleDesignationCourte": "ART. 4",
      "type": "ARTICLE",
      "avant_A_Apres": "A",
      "divisionRattachee": "ARTICLE 4",
      "articleAdditionnel": {
        "@xmlns:xsi": "http://www.w3.org/2001/XMLSchema-instance",
        "@xsi:nil": "true"
      },
      "chapitreAdditionnel": {
        "@xmlns:xsi": "http://www.w3.org/2001/XMLSchema-instance",
        "@xsi:nil": "true"
      },
      "urlDivisionTexteVise": "/15/textes/2243.asp#D_Article_4"
    },
    "alinea": {
      "avant_A_Apres": "Apres",
      "numero": "18",
      "alineaDesignation": {
        "@xmlns:xsi": "http://www.w3.org/2001/XMLSchema-instance",
        "@xsi:nil": "true"
      }
    }
  },
  "corps": {
    "dispositif": "<p>Apr&#232;s l&#8217;alin&#233;a&#160;18, ins&#233;rer les deux alin&#233;as suivants&#160;:</p><p style=\"text-align: justify;\">&#171;&#160;Ce consentement a une dur&#233;e de validit&#233; de trois ans.</p><p style=\"text-align: justify;\">&#171;&#160;Chaque ann&#233;e, pendant la dur&#233;e de validit&#233;, les deux membres du couple doivent confirmer au notaire, avec copie au m&#233;decin traitant de l&#8217;&#233;quipe clinicobiologique pluridisciplinaire du centre d&#8217;assistance m&#233;dicale &#224; la procr&#233;ation, qu&#8217;ils maintiennent leur volont&#233; de devenir les parents de l&#8217;enfant issu de l&#8217;assistance m&#233;dicale &#224; la procr&#233;ation.&#160;&#187;</p>",
    "exposeSommaire": "<p>En mati&#232;re d&#8217;adoption, le titulaire d&#8217;un agr&#233;ment doit confirmer, tous les ans, qu&#8217;il maintient son projet d&#8217;adoption. Il parait opportun de pr&#233;voir la m&#234;me disposition pour les couples ayant sign&#233; un consentement.</p><p style=\"text-align: justify;\">D&#232;s lors que le Gouvernement a entendu instituer un mode de filiation fond&#233; sur la seule volont&#233; concordante des membres d&#8217;un couple, il est permis d&#8217;exprimer des inqui&#233;tudes li&#233;es au fait que cette volont&#233; d&#8217;avoir un enfant est potentiellement fluctuante.</p><p style=\"text-align: justify;\">&#160;S&#8217;y ajoute qu&#8217;un couple n&#8217;est pas non plus &#224; l&#8217;abri d&#8217;une d&#233;sunion, et ce d&#8217;autant que ces parcours d&#8217;AMP, dont la r&#233;ussite est au demeurant limit&#233;e (environ 10&#160;% pour une ins&#233;mination artificielle et environ 20&#160;% pour une f&#233;condation in vitro), sont r&#233;put&#233;s &#233;prouvants pour les couples.</p><p style=\"text-align: justify;\">&#160;Prenons l&#8217;exemple d&#8217;un couple, non mari&#233;es, qui aurait &#224; un instant t sign&#233; un consentement devant notaire et qui se s&#233;parerait en cours de proc&#233;dure d&#8217;assistance &#171;&#160;m&#233;dicale&#160;&#187; &#224; la procr&#233;ation&#160;&#8211;&#160;laquelle risque, d&#8217;ailleurs, d&#8217;&#234;tre d&#8217;autant plus longue que les d&#233;lais d&#8217;attente pour obtenir les spermatozo&#239;des des rares &#171;&#160;tiers donneur&#160;&#187; le seront&#160;: Comment le m&#233;decin traitant et comment le notaire auront-ils connaissance de cette s&#233;paration, remettant en cause la commune volont&#233;&#160;?</p><p style=\"text-align: justify;\">Cette s&#233;paration a, pourtant, des cons&#233;quences graves sur le lien de filiation de l&#8217;&#233;ventuel enfant &#224; na&#238;tre&#160;: il sera possiblement l&#8217;enfant des deux femmes ou celui d&#8217;une seule, si celle-ci a continu&#233; son parcours d&#8217;AMP en d&#233;pit de leur s&#233;paration.</p><p style=\"text-align: justify;\">&#160;C&#8217;est pourquoi il nous para&#238;t n&#233;cessaire de donner &#224; ce consentement une dur&#233;e de validit&#233; et de pr&#233;voir &#233;galement que cette volont&#233; est, annuellement, confirm&#233;e.</p>",
    "annexeExposeSommaire": {
      "@xmlns:xsi": "http://www.w3.org/2001/XMLSchema-instance",
      "@xsi:nil": "true"
    },
    "cartoucheDelaiDepotDepasse": {
      "@xmlns:xsi": "http://www.w3.org/2001/XMLSchema-instance",
      "@xsi:nil": "true"
    },
    "avantAppel": {
      "@xmlns:xsi": "http://www.w3.org/2001/XMLSchema-instance",
      "@xsi:nil": "true"
    }
  },
  "representations": {
    "representation": {
      "nom": "PDF",
      "typeMime": {
        "type": "application",
        "subType": "PDF"
      },
      "statutRepresentation": {
        "verbatim": "true",
        "canonique": "true",
        "officielle": "true",
        "transcription": "false",
        "enregistrement": "false"
      },
      "repSource": {
        "@xmlns:xsi": "http://www.w3.org/2001/XMLSchema-instance",
        "@xsi:nil": "true"
      },
      "offset": {
        "@xmlns:xsi": "http://www.w3.org/2001/XMLSchema-instance",
        "@xsi:nil": "true"
      },
      "contenu": {
        "documentURI": "/15/amendements/2243/AN/432.pdf"
      },
      "dateDispoRepresentation": {
        "@xmlns:xsi": "http://www.w3.org/2001/XMLSchema-instance",
        "@xsi:nil": "true"
      }
    }
  },
  "seanceDiscussion": "RUANR5L15S2020IDS21845",
  "sort": {
    "dateSaisie": "2019-10-03T17:41:37.000+02:00",
    "sortEnSeance": "Rejeté"
  },
  "dateDepot": "2019-09-16T02:00:00.000+02:00",
  "dateDistribution": "2019-09-25T02:00:00.000+02:00",
  "article99": "0",
  "loiReference": {
    "codeLoi": {
      "@xmlns:xsi": "http://www.w3.org/2001/XMLSchema-instance",
      "@xsi:nil": "true"
    },
    "divisionCodeLoi": {
      "@xmlns:xsi": "http://www.w3.org/2001/XMLSchema-instance",
      "@xsi:nil": "true"
    }
  }
}