{
  "@xmlns": "http://schemas.assemblee-nationale.fr/referentiel",
  "uid": "AMANR5L15PO59048B2400P0D1N52",
  "identifiant": {
    "legislature": "15",
    "numero": "52",
    "numRect": "0",
    "saisine": {
      "refTexteLegislatif": "PRJLANR5L15B2400",
      "numeroPartiePLF": "0",
      "organeExamen": "PO59048",
      "mentionSecondeDeliberation": "0"
    }
  },
  "numeroLong": "CF52",
  "etapeTexte": "1ère lecture (1ère assemblée saisie)",
  "triAmendement": "acaaaaaaaaaaaaaaaaaaaaaaaaaaaaaaaaaaaaaaaaaaaaaaaabe",
  "cardinaliteAmdtMultiples": "1",
  "amendementParent": {
    "@xmlns:xsi": "http://www.w3.org/2001/XMLSchema-instance",
    "@xsi:nil": "true"
  },
  "etat": "Discuté",
  "signataires": {
    "auteur": {
      "typeAuteur": "Depute",
      "acteurRef": "PA332523",
      "organeRef": {
        "@xmlns:xsi": "http://www.w3.org/2001/XMLSchema-instance",
        "@xsi:nil": "true"
      },
      "groupePolitiqueRef": "PO730934"
    },
    "cosignataires": {
      "acteurRef": "PA332523"
    },
    "texteAffichable": "Mme&#160;Dalloz"
  },
  "pointeurFragmentTexte": {
    "missionVisee": {
      "@xmlns:xsi": "http://www.w3.org/2001/XMLSchema-instance",
      "@xsi:nil": "true"
    },
    "division": {
      "titre": "Article liminaire",
      "articleDesignationCourte": "ART. LIMINAIRE",
      "type": "ARTICLE",
      "avant_A_Apres": "A",
      "divisionRattachee": "ARTICLE LIMINAIRE",
      "articleAdditionnel": {
        "@xmlns:xsi": "http://www.w3.org/2001/XMLSchema-instance",
        "@xsi:nil": "true"
      },
      "chapitreAdditionnel": {
        "@xmlns:xsi": "http://www.w3.org/2001/XMLSchema-instance",
        "@xsi:nil": "true"
      },
      "urlDivisionTexteVise": "/15/textes/2400.asp#D_Article_liminaire"
    },
    "alinea": {
      "@xmlns:xsi": "http://www.w3.org/2001/XMLSchema-instance",
      "@xsi:nil": "true"
    }
  },
  "corps": {
    "dispositif": "<p style=\"text-align: justify;\">I.&#160;&#8211;&#160;&#192; la deuxi&#232;me ligne de la derni&#232;re colonne du tableau de l&#8217;alin&#233;a&#160;2, substituer au nombre&#160;:</p><p style=\"text-align: justify;\">&#171;&#160;&#8211;&#160;2,2&#160;&#187;,</p><p style=\"text-align: justify;\">le nombre&#160;:</p><p style=\"text-align: justify;\">&#171;&#160;&#8211;&#160;1,9&#160;&#187;</p><p style=\"text-align: justify;\">II.&#160;&#8211;&#160;En cons&#233;quence, &#224; la derni&#232;re ligne de la m&#234;me colonne du m&#234;me tableau, substituer au nombre&#160;: </p><p style=\"text-align: justify;\">&#171;&#160;&#8211;&#160;3,1&#160;&#187;,</p><p style=\"text-align: justify;\">le nombre&#160;: </p><p style=\"text-align: justify;\">&#171;&#160;&#8211;&#160;2,8&#160;&#187;.</p>",
    "exposeSommaire": "<p style=\"text-align: justify;\">Cet amendement vise &#224; alerter le Gouvernement sur le non-respect de la trajectoire de r&#233;duction du d&#233;ficit structurel.</p><p style=\"text-align: justify;\">Le PLFR 2019 pr&#233;voit un solde structurel pour 2019 &#224; -2,2&#160;% du PIB alors qu&#8217;il &#233;tait fix&#233; &#224; -1,9&#160;% du PIB dans la loi de programmation 2018&#8209;2022.</p><p style=\"text-align: justify;\">Ce choix pose un probl&#232;me de coh&#233;rence et affaiblit la port&#233;e de l&#8217;exercice de programmation pluriannuelle</p>",
    "annexeExposeSommaire": {
      "@xmlns:xsi": "http://www.w3.org/2001/XMLSchema-instance",
      "@xsi:nil": "true"
    },
    "cartoucheDelaiDepotDepasse": {
      "@xmlns:xsi": "http://www.w3.org/2001/XMLSchema-instance",
      "@xsi:nil": "true"
    },
    "avantAppel": {
      "@xmlns:xsi": "http://www.w3.org/2001/XMLSchema-instance",
      "@xsi:nil": "true"
    }
  },
  "representations": {
    "representation": {
      "nom": "PDF",
      "typeMime": {
        "type": "application",
        "subType": "PDF"
      },
      "statutRepresentation": {
        "verbatim": "true",
        "canonique": "true",
        "officielle": "true",
        "transcription": "false",
        "enregistrement": "false"
      },
      "repSource": {
        "@xmlns:xsi": "http://www.w3.org/2001/XMLSchema-instance",
        "@xsi:nil": "true"
      },
      "offset": {
        "@xmlns:xsi": "http://www.w3.org/2001/XMLSchema-instance",
        "@xsi:nil": "true"
      },
      "contenu": {
        "documentURI": "/15/amendements/2400/CION_FIN/CF52.pdf"
      },
      "dateDispoRepresentation": {
        "@xmlns:xsi": "http://www.w3.org/2001/XMLSchema-instance",
        "@xsi:nil": "true"
      }
    }
  },
  "seanceDiscussion": {
    "@xmlns:xsi": "http://www.w3.org/2001/XMLSchema-instance",
    "@xsi:nil": "true"
  },
  "sort": {
    "dateSaisie": "2019-11-12T09:33:30.000+01:00",
    "sortEnSeance": "Non soutenu"
  },
  "dateDepot": "2019-11-08T01:00:00.000+01:00",
  "dateDistribution": "2019-11-12T01:00:00.000+01:00",
  "article99": "0",
  "loiReference": {
    "codeLoi": {
      "@xmlns:xsi": "http://www.w3.org/2001/XMLSchema-instance",
      "@xsi:nil": "true"
    },
    "divisionCodeLoi": {
      "@xmlns:xsi": "http://www.w3.org/2001/XMLSchema-instance",
      "@xsi:nil": "true"
    }
  }
}