{
  "@xmlns": "http://schemas.assemblee-nationale.fr/referentiel",
  "uid": "AMANR5L15PO419610B2274P0D1N42",
  "identifiant": {
    "legislature": "15",
    "numero": "42",
    "numRect": "0",
    "saisine": {
      "refTexteLegislatif": "PRJLANR5L15B2274",
      "numeroPartiePLF": "0",
      "organeExamen": "PO419610",
      "mentionSecondeDeliberation": "0"
    }
  },
  "numeroLong": "CE42",
  "etapeTexte": "1ère lecture (2ème assemblée saisie)",
  "triAmendement": "ofaaaaaaaaaaaaaaaaaaaaaaaaaaaaaaaaaaaaaaaaaaaaaaaapki",
  "cardinaliteAmdtMultiples": "1",
  "amendementParent": {
    "@xmlns:xsi": "http://www.w3.org/2001/XMLSchema-instance",
    "@xsi:nil": "true"
  },
  "etat": "Discuté",
  "signataires": {
    "auteur": {
      "typeAuteur": "Depute",
      "acteurRef": "PA607090",
      "organeRef": {
        "@xmlns:xsi": "http://www.w3.org/2001/XMLSchema-instance",
        "@xsi:nil": "true"
      },
      "groupePolitiqueRef": "PO730934"
    },
    "cosignataires": {
      "acteurRef": [
        "PA267204",
        "PA267429",
        "PA607090",
        "PA722390",
        "PA719318",
        "PA266808",
        "PA334654",
        "PA346218"
      ]
    },
    "texteAffichable": "M.&#160;Jean-Pierre&#160;Vigier,  Mme&#160;Anthoine, M.&#160;Cinieri, M.&#160;Masson, M.&#160;Rolland, M.&#160;Sermier, M.&#160;Straumann et Mme&#160;Corneloup"
  },
  "pointeurFragmentTexte": {
    "missionVisee": {
      "@xmlns:xsi": "http://www.w3.org/2001/XMLSchema-instance",
      "@xsi:nil": "true"
    },
    "division": {
      "titre": "Article 12 F",
      "articleDesignationCourte": "ART. 12 F",
      "type": "ARTICLE",
      "avant_A_Apres": "A",
      "divisionRattachee": "ARTICLE 12 F",
      "articleAdditionnel": {
        "@xmlns:xsi": "http://www.w3.org/2001/XMLSchema-instance",
        "@xsi:nil": "true"
      },
      "chapitreAdditionnel": {
        "@xmlns:xsi": "http://www.w3.org/2001/XMLSchema-instance",
        "@xsi:nil": "true"
      },
      "urlDivisionTexteVise": "/15/textes/2274.asp#D_Article_12_F"
    },
    "alinea": {
      "avant_A_Apres": {
        "@xmlns:xsi": "http://www.w3.org/2001/XMLSchema-instance",
        "@xsi:nil": "true"
      },
      "numero": "2",
      "alineaDesignation": {
        "@xmlns:xsi": "http://www.w3.org/2001/XMLSchema-instance",
        "@xsi:nil": "true"
      }
    }
  },
  "corps": {
    "dispositif": "<p>Substituer &#224; l&#8217;alin&#233;a&#160;2 l&#8217;alin&#233;a suivant&#160;:</p><p style=\"text-align: justify;\">&#171;&#160;<i>Art.&#160;L.&#160;211-1-1</i>.&#160;&#8211;&#160;Le dernier d&#233;tenteur d&#8217;un v&#233;hicule vis&#233; au&#160;15&#176;&#160;de l&#8217;article L.&#160;541&#8209;10&#8209;1 du code de l&#8217;environnement est tenu de soumettre, lors de la d&#233;claration de cessation de l&#8217;assurance, un certificat de destruction du v&#233;hicule &#233;mis de mani&#232;re gracieuse par un centre agr&#233;&#233;. Les modalit&#233;s d&#8217;application de cette obligation sont d&#233;finies par voie r&#233;glementaire.&#160;&#187;</p>",
    "exposeSommaire": "<p style=\"text-align: justify;\">Les v&#233;hicules techniquement ou &#233;conomiquement irr&#233;parables ne repr&#233;sentent que 5&#160;000 v&#233;hicules, alors que le nombre de v&#233;hicules faisant l&#8217;objet d&#8217;une fili&#232;re ill&#233;gale est estim&#233; &#224; 500&#160;000.</p><p style=\"text-align: justify;\">Le pr&#233;sent amendement vise donc &#224; ne pas limiter les mesures de lutte contre la fili&#232;re ill&#233;gale de v&#233;hicules hors d&#8217;usage (VHU) aux v&#233;hicules techniquement ou &#233;conomiquement irr&#233;parables mais &#224; l&#8217;ensemble des VHU.</p>",
    "annexeExposeSommaire": {
      "@xmlns:xsi": "http://www.w3.org/2001/XMLSchema-instance",
      "@xsi:nil": "true"
    },
    "cartoucheDelaiDepotDepasse": {
      "@xmlns:xsi": "http://www.w3.org/2001/XMLSchema-instance",
      "@xsi:nil": "true"
    },
    "avantAppel": {
      "@xmlns:xsi": "http://www.w3.org/2001/XMLSchema-instance",
      "@xsi:nil": "true"
    }
  },
  "representations": {
    "representation": {
      "nom": "PDF",
      "typeMime": {
        "type": "application",
        "subType": "PDF"
      },
      "statutRepresentation": {
        "verbatim": "true",
        "canonique": "true",
        "officielle": "true",
        "transcription": "false",
        "enregistrement": "false"
      },
      "repSource": {
        "@xmlns:xsi": "http://www.w3.org/2001/XMLSchema-instance",
        "@xsi:nil": "true"
      },
      "offset": {
        "@xmlns:xsi": "http://www.w3.org/2001/XMLSchema-instance",
        "@xsi:nil": "true"
      },
      "contenu": {
        "documentURI": "/15/amendements/2274/CION-ECO/CE42.pdf"
      },
      "dateDispoRepresentation": {
        "@xmlns:xsi": "http://www.w3.org/2001/XMLSchema-instance",
        "@xsi:nil": "true"
      }
    }
  },
  "seanceDiscussion": {
    "@xmlns:xsi": "http://www.w3.org/2001/XMLSchema-instance",
    "@xsi:nil": "true"
  },
  "sort": {
    "dateSaisie": "2019-11-20T00:41:51.000+01:00",
    "sortEnSeance": "Retiré"
  },
  "dateDepot": "2019-11-12T01:00:00.000+01:00",
  "dateDistribution": "2019-11-19T01:00:00.000+01:00",
  "article99": "0",
  "loiReference": {
    "codeLoi": {
      "@xmlns:xsi": "http://www.w3.org/2001/XMLSchema-instance",
      "@xsi:nil": "true"
    },
    "divisionCodeLoi": {
      "@xmlns:xsi": "http://www.w3.org/2001/XMLSchema-instance",
      "@xsi:nil": "true"
    }
  }
}