{
  "@xmlns": "http://schemas.assemblee-nationale.fr/referentiel",
  "uid": "AMANR5L15PO420120B1681P0D1N1319",
  "identifiant": {
    "legislature": "15",
    "numero": "1319",
    "numRect": "0",
    "saisine": {
      "refTexteLegislatif": "PRJLANR5L15B1681",
      "numeroPartiePLF": "0",
      "organeExamen": "PO420120",
      "mentionSecondeDeliberation": "0"
    }
  },
  "numeroLong": "AS1319",
  "etapeTexte": "1ère lecture (1ère assemblée saisie)",
  "triAmendement": "esaaaaaaaaaaaaaaaaaaaaaaaaaaaaaaaaaaaaaaaaaaaaaaaagk",
  "cardinaliteAmdtMultiples": "1",
  "amendementParent": {
    "@xmlns:xsi": "http://www.w3.org/2001/XMLSchema-instance",
    "@xsi:nil": "true"
  },
  "etat": "Irrecevable",
  "signataires": {
    "auteur": {
      "typeAuteur": "Depute",
      "acteurRef": "PA719440",
      "organeRef": {
        "@xmlns:xsi": "http://www.w3.org/2001/XMLSchema-instance",
        "@xsi:nil": "true"
      },
      "groupePolitiqueRef": "PO730964"
    },
    "cosignataires": {
      "acteurRef": [
        "PA722312",
        "PA722038",
        "PA606202",
        "PA721600",
        "PA721876",
        "PA719790",
        "PA719480",
        "PA722000",
        "PA719972",
        "PA720242",
        "PA721844",
        "PA721776",
        "PA718728",
        "PA721522",
        "PA721024",
        "PA719326",
        "PA722170",
        "PA719294",
        "PA719154",
        "PA721398",
        "PA720030",
        "PA720854",
        "PA702054",
        "PA720814",
        "PA719440"
      ]
    },
    "texteAffichable": "M.&#160;Cellier,  Mme&#160;Abba, M.&#160;Damien&#160;Adam, M.&#160;Baich&#232;re, M.&#160;Batut, Mme&#160;Beaudouin-Hubiere, Mme&#160;Bessot Ballot, M.&#160;Buchou, M.&#160;Cazenove, M.&#160;Chalumeau, M.&#160;Claireaux, Mme&#160;Clapot, Mme&#160;Degois, Mme&#160;Fran&#231;oise&#160;Dumas, M.&#160;Freschi, M.&#160;Gaillard, Mme&#160;Genetet, Mme&#160;Gipson, M.&#160;Martin, M.&#160;Morenas, Mme&#160;Piron, Mme&#160;Rossi, Mme&#160;Sarles, M.&#160;Test&#233; et Mme&#160;Vanceunebrock-Mialon"
  },
  "pointeurFragmentTexte": {
    "missionVisee": {
      "@xmlns:xsi": "http://www.w3.org/2001/XMLSchema-instance",
      "@xsi:nil": "true"
    },
    "division": {
      "titre": "Article 13",
      "articleDesignationCourte": "APRÈS ART. 13",
      "type": "ARTICLE",
      "avant_A_Apres": "Après",
      "divisionRattachee": "APRÈS L'ARTICLE 13, insérer l'article suivant:",
      "articleAdditionnel": "1",
      "chapitreAdditionnel": {
        "@xmlns:xsi": "http://www.w3.org/2001/XMLSchema-instance",
        "@xsi:nil": "true"
      },
      "urlDivisionTexteVise": "/15/textes/1681.asp#D_Article_13"
    },
    "alinea": {
      "@xmlns:xsi": "http://www.w3.org/2001/XMLSchema-instance",
      "@xsi:nil": "true"
    }
  },
  "corps": {
    "dispositif": "<p style=\"text-align: justify;\">I.&#160;&#8211;&#160;Apr&#232;s l&#8217;article L.&#160;162&#8209;14&#8209;1&#8209;2 du code de la s&#233;curit&#233; sociale, il est ins&#233;r&#233; un article L.&#160;162&#8209;14&#8209;1&#8209;3&#160;ainsi&#160;r&#233;dig&#233;&#160;:</p><p style=\"text-align: justify;\">&#171;&#160;<i>Art.&#160;L.&#160;162&#8209;14&#8209;1&#8209;3</i> &#8211;&#160;Il est cr&#233;&#233; un t&#233;l&#233;service permettant aux professionnels de sant&#233; lib&#233;raux ou aux centres de sant&#233; mentionn&#233;s &#224; l&#8217;article L.&#160;6323&#8209;1 du code de la sant&#233; publique de d&#233;poser un seul dossier en vue d&#8217;obtenir les aides &#224; l&#8217;installation dans les zones d&#233;finies &#224; l&#8217;article L.&#160;1434&#8209;4 du m&#234;me code, mentionn&#233;es au 4&#176; de l&#8217;article&#160;L.&#160;162&#8209;14&#8209;1 du pr&#233;sent code .&#160;</p><p style=\"text-align: justify;\">&#171;&#160;Un&#160;d&#233;cret en Conseil d&#8217;&#201;tat fixe les modalit&#233;s&#160;de mise en &#339;uvre et d&#8217;exploitation de ce service, apr&#232;s avis de la Commission nationale de l&#8217;informatique et des libert&#233;s, d&#233;finit les conditions du d&#233;p&#244;t du dossier et pr&#233;cise les modalit&#233;s de v&#233;rification de ce dernier ainsi que les conditions d&#8217;application du premier alin&#233;a.&#160;&#187;</p><p style=\"text-align: justify;\">II.&#160;&#8211;&#160;Les charges pour l&#8217;&#201;tat sont compens&#233;es &#224; due concurrence par la cr&#233;ation de taxes additionnelles aux droits pr&#233;vus aux articles&#160;575 et 575&#160;A du code g&#233;n&#233;ral des imp&#244;ts.</p><p style=\"text-align: justify;\">III.&#160;&#8211;&#160;Les charges pour les organismes de s&#233;curit&#233; sociale sont compens&#233;es &#224; due concurrence par la majoration des droits pr&#233;vus aux articles&#160;575 et&#160;575&#160;A du code g&#233;n&#233;ral des imp&#244;ts.</p><p style=\"text-align: justify;\">&#160;</p>",
    "exposeSommaire": "<p>Afin d&#8217;inciter les m&#233;decins &#224; s&#8217;installer dans les zones caract&#233;ris&#233;es par une offre de soins insuffisante ou par des difficult&#233;s dans l'acc&#232;s aux soins, de nombreuses aides existent aujourd&#8217;hui.&#160;</p><p>Au regard de la multiplicit&#233; de ces aides et des acteurs, les professionnels de sant&#233; lib&#233;raux et les centres de sant&#233; mentionn&#233;s &#224; l'article L. 6323-1 du code de la sant&#233; publique souhaitant b&#233;n&#233;ficier d'une aide &#224; l'installation peuvent s'y perdre et se d&#233;courager.</p><p>Ainsi, cet amendement vise &#224; cr&#233;er un t&#233;l&#233;service qui permettrait aux professionnels de sant&#233; lib&#233;raux et aux centres de sant&#233; mentionn&#233;s &#224; l'article L. 6323-1 du code de la sant&#233; publique de d&#233;poser un seul dossier en vue&#160;d'obtenir une aide &#224; l'installation mentionn&#233;e &#224;&#160;l'article&#160;L. 162-14-1 du code de la s&#233;curit&#233; sociale.</p>",
    "annexeExposeSommaire": {
      "@xmlns:xsi": "http://www.w3.org/2001/XMLSchema-instance",
      "@xsi:nil": "true"
    },
    "cartoucheDelaiDepotDepasse": {
      "@xmlns:xsi": "http://www.w3.org/2001/XMLSchema-instance",
      "@xsi:nil": "true"
    }
  },
  "representations": {
    "representation": {
      "nom": "PDF",
      "typeMime": {
        "type": "application",
        "subType": "PDF"
      },
      "statutRepresentation": {
        "verbatim": "true",
        "canonique": "true",
        "officielle": "true",
        "transcription": "false",
        "enregistrement": "false"
      },
      "repSource": {
        "@xmlns:xsi": "http://www.w3.org/2001/XMLSchema-instance",
        "@xsi:nil": "true"
      },
      "offset": {
        "@xmlns:xsi": "http://www.w3.org/2001/XMLSchema-instance",
        "@xsi:nil": "true"
      },
      "contenu": {
        "documentURI": "/15/amendements/1681/CION-SOC/AS1319.pdf"
      },
      "dateDispoRepresentation": {
        "@xmlns:xsi": "http://www.w3.org/2001/XMLSchema-instance",
        "@xsi:nil": "true"
      }
    }
  },
  "seanceDiscussion": {
    "@xmlns:xsi": "http://www.w3.org/2001/XMLSchema-instance",
    "@xsi:nil": "true"
  },
  "sort": {
    "@xmlns:xsi": "http://www.w3.org/2001/XMLSchema-instance",
    "@xsi:nil": "true"
  },
  "dateDepot": "2019-03-08T01:00:00.000+01:00",
  "dateDistribution": "2019-03-10T01:00:00.000+01:00",
  "article99": "0",
  "loiReference": {
    "codeLoi": "sécurité sociale",
    "divisionCodeLoi": "L162-14-1-3"
  }
}