{
  "@xmlns": "http://schemas.assemblee-nationale.fr/referentiel",
  "uid": "AMANR5L15PO419610B0235P2D1N17",
  "identifiant": {
    "legislature": "15",
    "numero": "17",
    "numRect": "0",
    "saisine": {
      "refTexteLegislatif": "PRJLANR5L15B0235",
      "numeroPartiePLF": "2",
      "organeExamen": "PO419610",
      "mentionSecondeDeliberation": "0"
    }
  },
  "numeroLong": "II-CE17",
  "etapeTexte": "1ère lecture (1ère assemblée saisie)",
  "triAmendement": "bv",
  "cardinaliteAmdtMultiples": "1",
  "amendementParent": {
    "@xmlns:xsi": "http://www.w3.org/2001/XMLSchema-instance",
    "@xsi:nil": "true"
  },
  "etat": "Discuté",
  "signataires": {
    "auteur": {
      "typeAuteur": "Depute",
      "acteurRef": "PA266808",
      "organeRef": {
        "@xmlns:xsi": "http://www.w3.org/2001/XMLSchema-instance",
        "@xsi:nil": "true"
      },
      "groupePolitiqueRef": "PO730934"
    },
    "cosignataires": {
      "acteurRef": "PA266808"
    },
    "texteAffichable": "M.&#160;Rolland"
  },
  "pointeurFragmentTexte": {
    "missionVisee": {
      "idMissionAN": "26",
      "libelleMission": "Relations avec les collectivités territoriales",
      "codeMissionPLF": "B",
      "libelleMissionPLF": "Répartition, par mission et programme, des crédits du budget général"
    },
    "division": {
      "titre": "Article 61",
      "articleDesignationCourte": "ART. 61",
      "type": "ARTICLE",
      "avant_A_Apres": "A",
      "divisionRattachee": "ARTICLE 61",
      "articleAdditionnel": {
        "@xmlns:xsi": "http://www.w3.org/2001/XMLSchema-instance",
        "@xsi:nil": "true"
      },
      "chapitreAdditionnel": {
        "@xmlns:xsi": "http://www.w3.org/2001/XMLSchema-instance",
        "@xsi:nil": "true"
      },
      "urlDivisionTexteVise": "/15/textes/0235C.asp#D_Article_61"
    },
    "alinea": {
      "avant_A_Apres": "Apres",
      "numero": "3",
      "alineaDesignation": {
        "@xmlns:xsi": "http://www.w3.org/2001/XMLSchema-instance",
        "@xsi:nil": "true"
      }
    }
  },
  "corps": {
    "dispositif": "<p>Apr&#232;s l&#8217;alin&#233;a&#160;3, ins&#233;rer les trois alin&#233;as suivants&#160;:</p><p>&#171;&#160;1&#176; <i>bis</i> Le I de l&#8217;article L.&#160;2336&#8209;2 est ainsi modifi&#233;&#160;:</p><p>&#171;&#160;<i>a)</i> Le 1&#176; est compl&#233;t&#233; par les mots&#160;: &#171;&#160;duquel est d&#233;duit le produit de la taxe sur les remont&#233;es m&#233;caniques&#160;&#187; ;</p><p>&#171;&#160;<i>b)</i> Le d&#233;but du 2&#176; est ainsi r&#233;dig&#233;&#160;:&#171;&#160;&#192; l&#8217;exclusion des communes ayant la double caract&#233;ristique d&#8217;&#234;tre en zone de montagne et en zone de revitalisation rurale, la... <i>(le reste sans changement)</i>&#160;&#187;.</p>",
    "exposeSommaire": "<p style=\"text-align: justify;\">Il convient de prendre en compte la sp&#233;cificit&#233; des communes et des ensembles intercommunaux des territoires touristiques de Montagne.</p><p style=\"text-align: justify;\">A la fois, pour tenir compte de la n&#233;cessit&#233; de r&#233;investir les recettes fiscales issues de l&#8217;&#233;conomie locale dans l&#8217;outil productif, pour veiller &#224; son entretien et son renouvellement, dans le cadre d&#8217;un march&#233; mondial d&#233;sormais tr&#232;s concurrentiel, et ceci &#224; travers la d&#233;duction des recettes fiscales de l&#8217;&#233;quivalent de la taxe sur les remont&#233;es m&#233;caniques dont le montant est a minima syst&#233;matiquement r&#233;investi pour les &#233;quipements touristiques et les infrastructures supports, pris en charge par la commune ou l&#8217;EPCI.</p><p style=\"text-align: justify;\">Mais aussi pour exon&#233;rer du calcul les recettes &#233;conomiques CVAE et IFER pour l&#8217;ensemble des communes de montagne et situ&#233;es en zone de revitalisation rurale. Ceci pour bien signifier que l&#8217;objectif n&#8217;est pas de remettre en cause l&#8217;&#233;conomie de ces territoires en tension.</p>",
    "annexeExposeSommaire": {
      "@xmlns:xsi": "http://www.w3.org/2001/XMLSchema-instance",
      "@xsi:nil": "true"
    }
  },
  "representations": {
    "representation": {
      "nom": "PDF",
      "typeMime": {
        "type": "application",
        "subType": "PDF"
      },
      "statutRepresentation": {
        "verbatim": "true",
        "canonique": "true",
        "officielle": "true",
        "transcription": "false",
        "enregistrement": "false"
      },
      "repSource": {
        "@xmlns:xsi": "http://www.w3.org/2001/XMLSchema-instance",
        "@xsi:nil": "true"
      },
      "offset": {
        "@xmlns:xsi": "http://www.w3.org/2001/XMLSchema-instance",
        "@xsi:nil": "true"
      },
      "contenu": {
        "documentURI": "/15/amendements/0235C/CION_TOUTE/CE17.pdf"
      },
      "dateDispoRepresentation": {
        "@xmlns:xsi": "http://www.w3.org/2001/XMLSchema-instance",
        "@xsi:nil": "true"
      }
    }
  },
  "seanceDiscussion": {
    "@xmlns:xsi": "http://www.w3.org/2001/XMLSchema-instance",
    "@xsi:nil": "true"
  },
  "sort": {
    "dateSaisie": "2017-11-09T18:42:14.000+01:00",
    "sortEnSeance": "Non soutenu"
  },
  "dateDepot": "2017-10-19T02:00:00.000+02:00",
  "dateDistribution": "2017-11-09T01:00:00.000+01:00",
  "article99": "0",
  "loiReference": {
    "codeLoi": {
      "@xmlns:xsi": "http://www.w3.org/2001/XMLSchema-instance",
      "@xsi:nil": "true"
    },
    "divisionCodeLoi": {
      "@xmlns:xsi": "http://www.w3.org/2001/XMLSchema-instance",
      "@xsi:nil": "true"
    }
  }
}