{
  "@xmlns": "http://schemas.assemblee-nationale.fr/referentiel",
  "uid": "AMANR5L15PO744107B0424P0D1N327",
  "identifiant": {
    "legislature": "15",
    "numero": "327",
    "numRect": "0",
    "saisine": {
      "refTexteLegislatif": "PRJLANR5L15B0424",
      "numeroPartiePLF": "0",
      "organeExamen": "PO744107",
      "mentionSecondeDeliberation": "0"
    }
  },
  "numeroLong": "327",
  "etapeTexte": "1ère lecture (1ère assemblée saisie)",
  "triAmendement": "esf",
  "cardinaliteAmdtMultiples": "1",
  "amendementParent": {
    "@xmlns:xsi": "http://www.w3.org/2001/XMLSchema-instance",
    "@xsi:nil": "true"
  },
  "etat": "Discuté",
  "signataires": {
    "auteur": {
      "typeAuteur": "Depute",
      "acteurRef": "PA721486",
      "organeRef": {
        "@xmlns:xsi": "http://www.w3.org/2001/XMLSchema-instance",
        "@xsi:nil": "true"
      },
      "groupePolitiqueRef": "PO744425"
    },
    "cosignataires": {
      "acteurRef": [
        "PA721486",
        "PA2952"
      ]
    },
    "texteAffichable": "M.&#160;Naegelen et M.&#160;Warsmann"
  },
  "pointeurFragmentTexte": {
    "missionVisee": {
      "@xmlns:xsi": "http://www.w3.org/2001/XMLSchema-instance",
      "@xsi:nil": "true"
    },
    "division": {
      "titre": "Article 2",
      "articleDesignationCourte": "ART. 2",
      "type": "ARTICLE",
      "avant_A_Apres": "A",
      "divisionRattachee": "ARTICLE 2",
      "articleAdditionnel": {
        "@xmlns:xsi": "http://www.w3.org/2001/XMLSchema-instance",
        "@xsi:nil": "true"
      },
      "chapitreAdditionnel": {
        "@xmlns:xsi": "http://www.w3.org/2001/XMLSchema-instance",
        "@xsi:nil": "true"
      },
      "urlDivisionTexteVise": "/15/textes/0424.asp#D_Article_2"
    },
    "alinea": {
      "avant_A_Apres": {
        "@xmlns:xsi": "http://www.w3.org/2001/XMLSchema-instance",
        "@xsi:nil": "true"
      },
      "numero": "8",
      "alineaDesignation": {
        "@xmlns:xsi": "http://www.w3.org/2001/XMLSchema-instance",
        "@xsi:nil": "true"
      }
    }
  },
  "corps": {
    "dispositif": "<p style=\"text-align: justify;\">&#192; la fin de l&#8217;alin&#233;a&#160;8, apr&#232;s le mot&#160;:</p><p style=\"text-align: justify;\">&#171;&#160;ou&#160;&#187;,</p><p style=\"text-align: justify;\">ins&#233;rer les mots&#160;:</p><p style=\"text-align: justify;\">&#171;&#160;dont le non-respect emporte une atteinte directe et imm&#233;diate &#224;&#160;&#187;.</p>",
    "exposeSommaire": "<p style=\"text-align: justify;\">La notion de pr&#233;servation de l&#8217;environnement est extr&#234;mement large et est susceptible de recouvrir des r&#232;gles dont le non-respect, du fait d&#8217;une omission de bonne foi, n&#8217;engage pas de fa&#231;on directe et imm&#233;diate la pr&#233;servation de l&#8217;environnement. Il est donc propos&#233; de pr&#233;ciser le p&#233;rim&#232;tre d&#8217;exclusion du droit &#224; l&#8217;erreur pour en tenir compte.</p><p style=\"text-align: justify;\">En effet, si aucune intention volontaire de nuire &#224; l&#8217;environnement et en l&#8217;absence d&#8217;effets directs et imm&#233;diats, le droit &#224; l&#8217;erreur doit pouvoir tout de m&#234;me s&#8217;appliquer.</p>",
    "annexeExposeSommaire": {
      "@xmlns:xsi": "http://www.w3.org/2001/XMLSchema-instance",
      "@xsi:nil": "true"
    }
  },
  "representations": {
    "representation": {
      "nom": "PDF",
      "typeMime": {
        "type": "application",
        "subType": "PDF"
      },
      "statutRepresentation": {
        "verbatim": "true",
        "canonique": "true",
        "officielle": "true",
        "transcription": "false",
        "enregistrement": "false"
      },
      "repSource": {
        "@xmlns:xsi": "http://www.w3.org/2001/XMLSchema-instance",
        "@xsi:nil": "true"
      },
      "offset": {
        "@xmlns:xsi": "http://www.w3.org/2001/XMLSchema-instance",
        "@xsi:nil": "true"
      },
      "contenu": {
        "documentURI": "/15/amendements/0424/CSCONF/327.pdf"
      },
      "dateDispoRepresentation": {
        "@xmlns:xsi": "http://www.w3.org/2001/XMLSchema-instance",
        "@xsi:nil": "true"
      }
    }
  },
  "seanceDiscussion": {
    "@xmlns:xsi": "http://www.w3.org/2001/XMLSchema-instance",
    "@xsi:nil": "true"
  },
  "sort": {
    "dateSaisie": "2018-01-15T18:39:19.000+01:00",
    "sortEnSeance": "Retiré"
  },
  "dateDepot": "2018-01-10T01:00:00.000+01:00",
  "dateDistribution": "2018-01-15T01:00:00.000+01:00",
  "article99": "0",
  "loiReference": {
    "codeLoi": {
      "@xmlns:xsi": "http://www.w3.org/2001/XMLSchema-instance",
      "@xsi:nil": "true"
    },
    "divisionCodeLoi": {
      "@xmlns:xsi": "http://www.w3.org/2001/XMLSchema-instance",
      "@xsi:nil": "true"
    }
  }
}