{
  "@xmlns": "http://schemas.assemblee-nationale.fr/referentiel",
  "uid": "AMANR5L15SEA717460BTC0971P0D1N1593",
  "identifiant": {
    "legislature": "15",
    "numero": "1593",
    "numRect": "0",
    "saisine": {
      "refTexteLegislatif": "PRJLANR5L15BTC0971",
      "numeroPartiePLF": "0",
      "organeExamen": "PO717460",
      "mentionSecondeDeliberation": "0"
    }
  },
  "numeroLong": "1593",
  "etapeTexte": "1ère lecture (1ère assemblée saisie)",
  "triAmendement": "adx",
  "cardinaliteAmdtMultiples": "1",
  "amendementParent": {
    "@xmlns:xsi": "http://www.w3.org/2001/XMLSchema-instance",
    "@xsi:nil": "true"
  },
  "etat": "Discuté",
  "signataires": {
    "auteur": {
      "typeAuteur": "Depute",
      "acteurRef": "PA719882",
      "organeRef": {
        "@xmlns:xsi": "http://www.w3.org/2001/XMLSchema-instance",
        "@xsi:nil": "true"
      },
      "groupePolitiqueRef": "PO730964"
    },
    "cosignataires": {
      "acteurRef": [
        "PA720576",
        "PA721434",
        "PA720414",
        "PA720538",
        "PA718876",
        "PA718962",
        "PA719882",
        "PA720944"
      ]
    },
    "texteAffichable": "Mme&#160;Meynier-Millefert,  M.&#160;Zulesi, M.&#160;Bois, Mme&#160;Park, Mme&#160;Lardet, Mme&#160;De Temmerman, M.&#160;Perrot et M.&#160;Besson-Moreau"
  },
  "pointeurFragmentTexte": {
    "missionVisee": {
      "@xmlns:xsi": "http://www.w3.org/2001/XMLSchema-instance",
      "@xsi:nil": "true"
    },
    "division": {
      "titre": "Article 55",
      "articleDesignationCourte": "APRÈS ART. 55",
      "type": "ARTICLE",
      "avant_A_Apres": "Après",
      "divisionRattachee": "APRÈS L'ARTICLE 55, insérer l'article suivant:",
      "articleAdditionnel": "1",
      "chapitreAdditionnel": {
        "@xmlns:xsi": "http://www.w3.org/2001/XMLSchema-instance",
        "@xsi:nil": "true"
      },
      "urlDivisionTexteVise": "/15/textes/0971.asp#D_Article_55"
    },
    "alinea": {
      "@xmlns:xsi": "http://www.w3.org/2001/XMLSchema-instance",
      "@xsi:nil": "true"
    }
  },
  "corps": {
    "dispositif": "<p style=\"text-align: justify;\">L&#8217;article L.&#160;442&#8209;1 du code de la construction et de l&#8217;habitation est compl&#233;t&#233; par une phrase ainsi r&#233;dig&#233;e&#160;:</p><p style=\"text-align: justify;\">&#171;&#160;Cette d&#233;rogation est de droit en cas de r&#233;novation d&#8217;un montant sup&#233;rieur &#224; 450&#160;&#8364; par m&#232;tre carr&#233;, comportant un volet &#233;nerg&#233;tique permettant d&#8217;atteindre une consommation d&#8217;&#233;nergie inf&#233;rieure &#224; 230 KWh/m<sup>2</sup>, ou une mise en accessibilit&#233; du b&#226;timent, dans la limite des plafonds de loyer de base au m&#232;tre carr&#233; aff&#233;rents aux constructions r&#233;alis&#233;es par les organismes d&#8217;habitations &#224; loyer mod&#233;r&#233; de l&#8217;ann&#233;e de r&#233;alisation des travaux&#160;.&#187;</p>",
    "exposeSommaire": "<p style=\"text-align: justify;\">Actuellement, les bailleurs sociaux ont engag&#233; un programme ambitieux de travaux de r&#233;habilitation thermique, encourag&#233;s par la Caisse des d&#233;p&#244;ts gr&#226;ce aux &#233;co-pr&#234;ts et aux pr&#234;ts de haut de bilan. La Caisse des d&#233;p&#244;ts accorde 16&#160;000&#160;euros d&#8217;&#233;co-pr&#234;t par logement, quelle qu&#8217;en soit la surface.</p><p style=\"text-align: justify;\">De nombreux bailleurs s&#8217;engagent &#233;galement, dans le cadre de leurs plans de r&#233;habilitation, &#224; rendre accessibles les logements quand cela est techniquement possible.</p><p style=\"text-align: justify;\">Or, la situation financi&#232;re des bailleurs du fait de la r&#233;duction de loyer de solidarit&#233; (pr&#233;vu &#224; hauteur de - 1,5&#160;Md&#8364; sur un autofinancement de 2,4 Md&#8364;) a un impact sur les programmes d&#8217;investissements, et la r&#233;glementation HLM est actuellement trop lourde pour permettre d&#8217;ajuster la politique des loyers en cas de gros travaux, m&#234;me avec l&#8217;accord des locataires.</p><p style=\"text-align: justify;\">Or, dans beaucoup de cas, ces travaux sont majeurs&#160;: un investissement de 30&#160;000&#160;&#8364;/logement permet au b&#226;timent de &#171;&#160;repartir&#160;&#187; pour une seconde vie. Or, les politiques de loyer, li&#233;es &#224; la date de construction de l&#8217;immeuble, permettent peu de marge de man&#339;uvre. Les aides sont faites &#224; travers des pr&#234;ts bonifi&#233;s, qu&#8217;il faut rembourser, et avec des niveaux de loyers &#224; 3 ou 4&#160;&#8364;/m2, auxquels s&#8217;ajoutent la RLS, les plans de financements sont d&#233;ficitaires. Cela compromet la r&#233;alisation des op&#233;rations.</p><p style=\"text-align: justify;\">Aujourd&#8217;hui, il est possible pour le bailleur social qui engage des travaux importants d&#8217;&#233;conomie d&#8217;&#233;nergie de relever l&#233;g&#232;rement le quittancement de deux fa&#231;ons&#160;:</p><p style=\"text-align: justify;\">- La 3<sup>&#232;me</sup> ligne sur quittance limit&#233;e &#224; 50&#160;% de l&#8217;&#233;conomie de charges pr&#233;vue</p><p style=\"text-align: justify;\">- Un accord collectif, si 50&#160;% des locataire sont d&#8217;accord, portant sur un compl&#233;ment de loyer.</p><p style=\"text-align: justify;\">Dans le cas des loyers HLM, les nouveaux loyers n&#233;goci&#233;s dans le cadre de l&#8217;accord ne peuvent pas exc&#233;der les loyers plafonds pr&#233;vus par la convention de conventionnement (convention APL&#160;d&#8217;origine).</p><p style=\"text-align: justify;\">Une d&#233;rogation est aujourd&#8217;hui possible, si l&#8217;autorit&#233; administrative l&#8217;autorise, conform&#233;ment &#224; l&#8217;article L 442&#8209;1 du code de la construction et de l&#8217;habitat.</p><p style=\"text-align: justify;\">Le pr&#233;sent amendement vise &#224; cette d&#233;rogation automatique d&#232;s que des montants d&#8217;investissements sont sup&#233;rieurs &#224; 30&#160;000&#160;&#8364;, qui correspond &#224; une remise &#224; neuf du logement. Cette d&#233;rogation reste dans la limite des prix de base au m&#232;tre carr&#233; aff&#233;rents aux diff&#233;rentes cat&#233;gories de construction r&#233;alis&#233;es par les organismes d&#8217;habitations &#224; loyer mod&#233;r&#233; de l&#8217;ann&#233;e de r&#233;alisation des travaux.</p><p style=\"text-align: justify;\">En aucun cas, les loyers ne pourront d&#233;passer les plafonds des logements neufs, et le reste de l&#8217;article reste applicable&#160;: la hausse est plafonn&#233;e &#224; 5&#160;% par an sauf accord des locataires.</p>",
    "annexeExposeSommaire": {
      "@xmlns:xsi": "http://www.w3.org/2001/XMLSchema-instance",
      "@xsi:nil": "true"
    }
  },
  "representations": {
    "representation": {
      "nom": "PDF",
      "typeMime": {
        "type": "application",
        "subType": "PDF"
      },
      "statutRepresentation": {
        "verbatim": "true",
        "canonique": "true",
        "officielle": "true",
        "transcription": "false",
        "enregistrement": "false"
      },
      "repSource": {
        "@xmlns:xsi": "http://www.w3.org/2001/XMLSchema-instance",
        "@xsi:nil": "true"
      },
      "offset": {
        "@xmlns:xsi": "http://www.w3.org/2001/XMLSchema-instance",
        "@xsi:nil": "true"
      },
      "contenu": {
        "documentURI": "/15/amendements/0971/AN/1593.pdf"
      },
      "dateDispoRepresentation": {
        "@xmlns:xsi": "http://www.w3.org/2001/XMLSchema-instance",
        "@xsi:nil": "true"
      }
    }
  },
  "seanceDiscussion": "RUANR5L15S2018IDS21138",
  "sort": {
    "dateSaisie": "2018-06-08T19:21:37.000+02:00",
    "sortEnSeance": "Rejeté"
  },
  "dateDepot": "2018-05-25T02:00:00.000+02:00",
  "dateDistribution": "2018-06-01T02:00:00.000+02:00",
  "article99": "0",
  "loiReference": {
    "codeLoi": "c construction et de l'habitation",
    "divisionCodeLoi": "L442-1"
  }
}