{
  "@xmlns": "http://schemas.assemblee-nationale.fr/referentiel",
  "uid": "AMANR5L15SEA717460B2272P2D1N2526",
  "identifiant": {
    "legislature": "15",
    "numero": "2526",
    "numRect": "1",
    "saisine": {
      "refTexteLegislatif": "PRJLANR5L15B2272",
      "numeroPartiePLF": "2",
      "organeExamen": "PO717460",
      "mentionSecondeDeliberation": "1"
    }
  },
  "numeroLong": "II-2526 (Rect)",
  "etapeTexte": "1ère lecture (1ère assemblée saisie)",
  "triAmendement": "esaaaaaaaaaaaaaaaaaaaaaaaaaaaaaaaaaaaaaaaaaaaaaaaax",
  "cardinaliteAmdtMultiples": "1",
  "amendementParent": {
    "@xmlns:xsi": "http://www.w3.org/2001/XMLSchema-instance",
    "@xsi:nil": "true"
  },
  "etat": "Discuté",
  "signataires": {
    "auteur": {
      "typeAuteur": "Rapporteur",
      "acteurRef": "PA267336",
      "organeRef": "PO59048",
      "groupePolitiqueRef": "PO730964"
    },
    "cosignataires": {
      "acteurRef": "PA267336"
    },
    "texteAffichable": "M.&#160;Giraud, rapporteur g&#233;n&#233;ral au nom de la commission des finances"
  },
  "pointeurFragmentTexte": {
    "missionVisee": {
      "@xmlns:xsi": "http://www.w3.org/2001/XMLSchema-instance",
      "@xsi:nil": "true"
    },
    "division": {
      "titre": "Article 49",
      "articleDesignationCourte": "APRÈS ART. 49",
      "type": "ARTICLE",
      "avant_A_Apres": "Après",
      "divisionRattachee": "APRÈS L'ARTICLE 49, insérer l'article suivant:",
      "articleAdditionnel": "1",
      "chapitreAdditionnel": {
        "@xmlns:xsi": "http://www.w3.org/2001/XMLSchema-instance",
        "@xsi:nil": "true"
      },
      "urlDivisionTexteVise": "/15/textes/2272C.asp#D_Article_49"
    },
    "alinea": {
      "@xmlns:xsi": "http://www.w3.org/2001/XMLSchema-instance",
      "@xsi:nil": "true"
    }
  },
  "corps": {
    "dispositif": "<p>Le Gouvernement remet au Parlement, avant le 30 septembre 2021, un rapport sur&#160;:</p><p style=\"text-align: justify;\">1&#176;&#160;Les modalit&#233;s de prise en compte des d&#233;penses de fonctionnement mentionn&#233;es au 3&#176;&#160;du <i>c</i> et au 3&#176;&#160;du <i>h</i> du II de l&#8217;article&#160;244 <i>quater</i> B du code g&#233;n&#233;ral des imp&#244;ts, pr&#233;cisant le co&#251;t global et le co&#251;t m&#233;dian et moyen par entreprise exposant ces d&#233;penses et faisant &#233;tat des pistes d&#8217;&#233;volutions envisageables, notamment &#224; travers un abaissement du taux pr&#233;vu au 3&#176;&#160;du <i>c</i> pr&#233;cit&#233; et un alignement des modalit&#233;s pr&#233;vues au 3&#176;&#160;du <i>h</i> pr&#233;cit&#233; sur celles pr&#233;vues au <i>c</i> et au 3&#176;&#160;du <i>k</i> du II du m&#234;me article&#160;244&#160;<i>quater</i>&#160;B, dans leur r&#233;daction r&#233;sultant de la pr&#233;sente loi de finances&#160;;</p><p style=\"text-align: justify;\">2&#176;&#160;Les &#233;volutions susceptibles d&#8217;&#234;tre apport&#233;es au champ des d&#233;penses retenues dans l&#8217;assiette du cr&#233;dit d&#8217;imp&#244;t pour d&#233;penses de recherche, particuli&#232;rement s&#8217;agissant de celles pr&#233;vues aux <i>e</i>, <i>e</i> <i>bis</i>, <i>f</i>, <i>g</i> et <i>j</i>, aux 4&#176;&#160;et 5&#176;&#160;du <i>h</i> et aux 4&#176;&#160;et 5&#176;&#160;du <i>k</i> du II de l&#8217;article&#160;244 <i>quater</i> B du code g&#233;n&#233;ral des imp&#244;ts, notamment &#224; travers leur cantonnement &#224; certaines cat&#233;gories d&#8217;entreprises ou, le cas &#233;ch&#233;ant, &#224; leur prise en compte pour la moiti&#233; de leur montant effectif.</p><p style=\"text-align: justify;\">Ce rapport pr&#233;sente &#233;galement, pour chacun des sujets sur lesquels il porte, l&#8217;impact &#233;conomique des &#233;volutions envisag&#233;es pour les entreprises et les secteurs d&#8217;activit&#233; concern&#233;s et l&#8217;impact sur le montant des cr&#233;ances fiscales et le co&#251;t budg&#233;taire annuel du cr&#233;dit d&#8217;imp&#244;t pour d&#233;penses de recherche.</p>",
    "exposeSommaire": "<p>Le pr&#233;sent amendement pr&#233;voit la remise d&#8217;un rapport au Parlement sur certains aspects particuliers du cr&#233;dit d&#8217;imp&#244;t recherche (CIR) qui paraissent pouvoir faire l&#8217;objet d&#8217;&#233;volutions futures&#160;:</p><p style=\"text-align: justify;\">&#8211; le niveau de prise en compte, au titre des d&#233;penses de fonctionnement, des r&#233;mun&#233;rations vers&#233;es aux jeunes docteurs, qui conduit, en le combinant avec la prise en compte &#224; hauteur de 200&#160;% de ces r&#233;mun&#233;rations au titre des d&#233;penses de personnel, &#224; ce que le soutien fiscal soit de 120&#160;% de ces r&#233;mun&#233;rations&#160;;</p><p style=\"text-align: justify;\">&#8211; le forfait de d&#233;penses de fonctionnement pr&#233;vu dans le cadre du cr&#233;dit d&#8217;imp&#244;t collection, qui n&#8217;a pas &#233;volu&#233; depuis la mise en place de cet outil malgr&#233; les modifications apport&#233;es au forfait de d&#233;penses de fonctionnement du reste du CIR&#160;;</p><p style=\"text-align: justify;\">&#8211; l&#8217;inclusion dans l&#8217;assiette du CIR, du cr&#233;dit d&#8217;imp&#244;t innovation (CII) et du cr&#233;dit d&#8217;imp&#244;t collection, de d&#233;penses qui ne rel&#232;vent pas stricto sensu de la R&amp;amp;D au sens du Manuel de Frascati&#160;: d&#233;penses de propri&#233;t&#233; intellectuelle, d&#233;penses de veille technologique et d&#233;penses de normalisation. Le principe de l&#8217;inclusion de ces d&#233;penses dans l&#8217;assiette de ces outils se pose, mais des am&#233;nagements autres qu&#8217;une suppression sont envisageables, tels que leur cantonnement &#224; certaines entreprises - par exemple les PME - ou leur prise en compte pour la moiti&#233; de leur montant, ce qui est d&#233;j&#224; le cas pour les d&#233;penses de normalisation.</p><p style=\"text-align: justify;\">Les informations qui figureront dans ce rapport, notamment l&#8217;impact des pistes qu&#8217;il devra explorer, constitueront un pr&#233;cieux outil d&#8217;aide &#224; la d&#233;cision pour le Parlement, tout particuli&#232;rement s&#8217;agissant du CII et du cr&#233;dit d&#8217;imp&#244;t collection, dans le cadre de l&#8217;&#233;ventuelle reconduction de ces deux outils que l&#8217;article&#160;7 du pr&#233;sent projet de loi de finances pr&#233;voit de borner dans le temps jusqu&#8217;au 31 d&#233;cembre 2022.</p>",
    "annexeExposeSommaire": {
      "@xmlns:xsi": "http://www.w3.org/2001/XMLSchema-instance",
      "@xsi:nil": "true"
    },
    "cartoucheDelaiDepotDepasse": {
      "@xmlns:xsi": "http://www.w3.org/2001/XMLSchema-instance",
      "@xsi:nil": "true"
    },
    "avantAppel": {
      "@xmlns:xsi": "http://www.w3.org/2001/XMLSchema-instance",
      "@xsi:nil": "true"
    }
  },
  "representations": {
    "representation": {
      "nom": "PDF",
      "typeMime": {
        "type": "application",
        "subType": "PDF"
      },
      "statutRepresentation": {
        "verbatim": "true",
        "canonique": "true",
        "officielle": "true",
        "transcription": "false",
        "enregistrement": "false"
      },
      "repSource": {
        "@xmlns:xsi": "http://www.w3.org/2001/XMLSchema-instance",
        "@xsi:nil": "true"
      },
      "offset": {
        "@xmlns:xsi": "http://www.w3.org/2001/XMLSchema-instance",
        "@xsi:nil": "true"
      },
      "contenu": {
        "documentURI": "/15/amendements/2272C/AN/2526.pdf"
      },
      "dateDispoRepresentation": {
        "@xmlns:xsi": "http://www.w3.org/2001/XMLSchema-instance",
        "@xsi:nil": "true"
      }
    }
  },
  "seanceDiscussion": "RUANR5L15S2020IDS21924",
  "sort": {
    "dateSaisie": "2019-11-15T11:32:27.000+01:00",
    "sortEnSeance": "Adopté"
  },
  "dateDepot": "2019-11-08T01:00:00.000+01:00",
  "dateDistribution": "2019-11-13T01:00:00.000+01:00",
  "article99": "0",
  "loiReference": {
    "codeLoi": {
      "@xmlns:xsi": "http://www.w3.org/2001/XMLSchema-instance",
      "@xsi:nil": "true"
    },
    "divisionCodeLoi": {
      "@xmlns:xsi": "http://www.w3.org/2001/XMLSchema-instance",
      "@xsi:nil": "true"
    }
  }
}