{
  "@xmlns": "http://schemas.assemblee-nationale.fr/referentiel",
  "uid": "AMANR5L15SEA717460BTC0902P0D1N385",
  "identifiant": {
    "legislature": "15",
    "numero": "385",
    "numRect": "0",
    "saisine": {
      "refTexteLegislatif": "PRJLANR5L15BTC0902",
      "numeroPartiePLF": "0",
      "organeExamen": "PO717460",
      "mentionSecondeDeliberation": "0"
    }
  },
  "numeroLong": "385",
  "etapeTexte": "1ère lecture (1ère assemblée saisie)",
  "triAmendement": "bzbi",
  "cardinaliteAmdtMultiples": "1",
  "amendementParent": {
    "@xmlns:xsi": "http://www.w3.org/2001/XMLSchema-instance",
    "@xsi:nil": "true"
  },
  "etat": "Discuté",
  "signataires": {
    "auteur": {
      "typeAuteur": "Depute",
      "acteurRef": "PA605518",
      "organeRef": {
        "@xmlns:xsi": "http://www.w3.org/2001/XMLSchema-instance",
        "@xsi:nil": "true"
      },
      "groupePolitiqueRef": "PO730964"
    },
    "cosignataires": {
      "acteurRef": [
        "PA605518",
        "PA720996"
      ]
    },
    "texteAffichable": "M.&#160;Fran&#231;ois-Michel&#160;Lambert et M.&#160;El Guerrab"
  },
  "pointeurFragmentTexte": {
    "missionVisee": {
      "@xmlns:xsi": "http://www.w3.org/2001/XMLSchema-instance",
      "@xsi:nil": "true"
    },
    "division": {
      "titre": "Article PREMIER",
      "articleDesignationCourte": "ART. PREMIER",
      "type": "ARTICLE",
      "avant_A_Apres": "A",
      "divisionRattachee": "ARTICLE PREMIER",
      "articleAdditionnel": {
        "@xmlns:xsi": "http://www.w3.org/2001/XMLSchema-instance",
        "@xsi:nil": "true"
      },
      "chapitreAdditionnel": {
        "@xmlns:xsi": "http://www.w3.org/2001/XMLSchema-instance",
        "@xsi:nil": "true"
      },
      "urlDivisionTexteVise": "/15/textes/0902.asp#D_Article_1er"
    },
    "alinea": {
      "avant_A_Apres": "A",
      "numero": "16",
      "alineaDesignation": "Alinéa 16"
    }
  },
  "corps": {
    "dispositif": "<p style=\"text-align: justify;\">Apr&#232;s l&#8217;alin&#233;a&#160;16, ins&#233;rer l&#8217;alin&#233;a suivant&#160;:</p><p style=\"text-align: justify;\">&#171;&#160;Ils ne peuvent comporter des normes de calibrage abusives, qui ne se justifieraient pas au regard des obligations r&#233;glementaires en vigueur et des contraintes techniques de production.&#160;&#187;</p>",
    "exposeSommaire": "<p style=\"text-align: justify;\">Le calibrage des fruits et l&#233;gumes a &#233;t&#233; impos&#233;, &#224; l&#8217;origine, par une r&#233;glementation&#160;europ&#233;enne pour faciliter la transparence des &#233;changes commerciaux entre les &#201;tats membres. Ces normes de qualit&#233;, qui &#233;taient initialement appliqu&#233;es &#224; 26 produits, ont &#233;t&#233; supprim&#233;es en 2009, sauf pour 10 types de fruits et l&#233;gumes (agrumes, fraises, kiwis, p&#234;ches et nectarines, poires, poivrons, pommes, raisins, salades et tomates). Cependant, en France et dans d&#8217;autres pays&#160;europ&#233;ens, de nombreux professionnels de l&#8217;alimentation continuent de les inclure dans leurs cahiers des charges, bien qu&#8217;il n&#8217;y ait plus d&#8217;obligation pour 16 d&#8217;entre eux. Des normes de calibrage sont aussi appliqu&#233;es sur d&#8217;autres cat&#233;gories de produits alimentaires comme les c&#233;r&#233;ales, le poisson ou encore les &#339;ufs.</p><p style=\"text-align: justify;\">Si ces normes peuvent, dans une certaine mesure, favoriser la commercialisation de produits sains et loyaux, force est de constater qu&#8217;elles sont bien souvent utilis&#233;es de mani&#232;re abusives et qu&#8217;elles g&#233;n&#232;rent aujourd&#8217;hui beaucoup de gaspillage alimentaire. &#192; titre d&#8217;exemple, les normes de calibrage auxquelles les producteurs sont soumis dans leurs relations contractuelles avec leurs clients conduisent &#224; de nombreux &#233;carts de tri et &#224; des retours de livraisons. Les produits jug&#233;s &#171;&#160;non conformes&#160;&#187; (trop gros ou trop petits, de formes diff&#233;rentes, avec quelques t&#226;ches&#8230;) sont ainsi mis de c&#244;t&#233; par les producteurs ou bien renvoy&#233;s par les agr&#233;eurs en charge de leur contr&#244;le.&#160;</p><p style=\"text-align: justify;\">Il est donc n&#233;cessaire d&#8217;aller vers un assouplissement de ces normes de calibrage dans les cahiers des charges conclus entre les professionnels de l&#8217;alimentation, et plus particuli&#232;rement dans ceux qui sont soumis aux producteurs. Pour y contribuer, cet amendement propose de mettre fin aux exigences de calibrage abusives pr&#233;sentes dans les contrats de vente des produits agricoles. La notion de &#171;&#160;norme abusive&#160;&#187; se d&#233;finit ici en s&#8217;inspirant du vocabulaire utilis&#233; &#224; l&#8217;article. L.&#160;212&#8209;1 du code de la consommation sur les clauses abusives avec la notion de d&#233;s&#233;quilibre entre le vendeur et le consommateur, ici entre l&#8217;acheteur et le producteur.</p>",
    "annexeExposeSommaire": {
      "@xmlns:xsi": "http://www.w3.org/2001/XMLSchema-instance",
      "@xsi:nil": "true"
    }
  },
  "representations": {
    "representation": {
      "nom": "PDF",
      "typeMime": {
        "type": "application",
        "subType": "PDF"
      },
      "statutRepresentation": {
        "verbatim": "true",
        "canonique": "true",
        "officielle": "true",
        "transcription": "false",
        "enregistrement": "false"
      },
      "repSource": {
        "@xmlns:xsi": "http://www.w3.org/2001/XMLSchema-instance",
        "@xsi:nil": "true"
      },
      "offset": {
        "@xmlns:xsi": "http://www.w3.org/2001/XMLSchema-instance",
        "@xsi:nil": "true"
      },
      "contenu": {
        "documentURI": "/15/amendements/0902/AN/385.pdf"
      },
      "dateDispoRepresentation": {
        "@xmlns:xsi": "http://www.w3.org/2001/XMLSchema-instance",
        "@xsi:nil": "true"
      }
    }
  },
  "seanceDiscussion": "RUANR5L15S2018IDS21050",
  "sort": {
    "dateSaisie": "2018-05-23T23:03:28.000+02:00",
    "sortEnSeance": "Rejeté"
  },
  "dateDepot": "2018-05-11T02:00:00.000+02:00",
  "dateDistribution": "2018-05-18T02:00:00.000+02:00",
  "article99": "0",
  "loiReference": {
    "codeLoi": {
      "@xmlns:xsi": "http://www.w3.org/2001/XMLSchema-instance",
      "@xsi:nil": "true"
    },
    "divisionCodeLoi": {
      "@xmlns:xsi": "http://www.w3.org/2001/XMLSchema-instance",
      "@xsi:nil": "true"
    }
  }
}