{
  "@xmlns": "http://schemas.assemblee-nationale.fr/referentiel",
  "uid": "AMANR5L15PO419604B2272P2D1N22",
  "identifiant": {
    "legislature": "15",
    "numero": "22",
    "numRect": "0",
    "saisine": {
      "refTexteLegislatif": "PRJLANR5L15B2272",
      "numeroPartiePLF": "2",
      "organeExamen": "PO419604",
      "mentionSecondeDeliberation": "0"
    }
  },
  "numeroLong": "II-AC22",
  "etapeTexte": "1ère lecture (1ère assemblée saisie)",
  "triAmendement": "abeaaaaaaaaaaaaaaaaaaaaaaaaaaaaaaaaaaaaaaaaaaaaaaaos",
  "cardinaliteAmdtMultiples": "1",
  "amendementParent": {
    "@xmlns:xsi": "http://www.w3.org/2001/XMLSchema-instance",
    "@xsi:nil": "true"
  },
  "etat": "Discuté",
  "signataires": {
    "auteur": {
      "typeAuteur": "Depute",
      "acteurRef": "PA719350",
      "organeRef": {
        "@xmlns:xsi": "http://www.w3.org/2001/XMLSchema-instance",
        "@xsi:nil": "true"
      },
      "groupePolitiqueRef": "PO730964"
    },
    "cosignataires": {
      "acteurRef": [
        "PA720054",
        "PA719154",
        "PA718744",
        "PA721644",
        "PA718756",
        "PA702054",
        "PA720074",
        "PA721522",
        "PA606639",
        "PA721800",
        "PA719952",
        "PA719350",
        "PA720814",
        "PA719512",
        "PA722000",
        "PA719540",
        "PA720190",
        "PA721278"
      ]
    },
    "texteAffichable": "Mme&#160;Tamarelle-Verhaeghe,  M.&#160;Anato, Mme&#160;Bagarry, M.&#160;Batut, Mme&#160;Bono-Vandorme, M.&#160;Buchou, M.&#160;Claireaux, M.&#160;Haury, M.&#160;Kokouendo, M.&#160;Martin, M.&#160;Matras, M.&#160;Mis, M.&#160;Sorre, Mme&#160;Toutut-Picard, M.&#160;Vignal, Mme&#160;Vignon, M.&#160;Cazenove et Mme&#160;Janvier"
  },
  "pointeurFragmentTexte": {
    "missionVisee": {
      "idMissionAN": "813",
      "libelleMission": "Enseignement scolaire",
      "codeMissionPLF": "B",
      "libelleMissionPLF": "Répartition, par mission et programme, des crédits du budget général"
    },
    "division": {
      "titre": "ÉTAT B",
      "articleDesignationCourte": "ART. 38",
      "type": "ANNEXE",
      "avant_A_Apres": "A",
      "divisionRattachee": "ARTICLE 38",
      "articleAdditionnel": {
        "@xmlns:xsi": "http://www.w3.org/2001/XMLSchema-instance",
        "@xsi:nil": "true"
      },
      "chapitreAdditionnel": {
        "@xmlns:xsi": "http://www.w3.org/2001/XMLSchema-instance",
        "@xsi:nil": "true"
      },
      "urlDivisionTexteVise": "/15/textes/2272C.asp#D_ETAT_B"
    },
    "alinea": {
      "@xmlns:xsi": "http://www.w3.org/2001/XMLSchema-instance",
      "@xsi:nil": "true"
    }
  },
  "corps": {
    "exposeSommaire": "<p>Le pr&#233;sent amendement vise &#224; am&#233;liorer la situation de la m&#233;decine scolaire, en crise depuis de nombreuses ann&#233;es. &#160;</p><p>Depuis plusieurs ann&#233;es, l&#8217;Acad&#233;mie de m&#233;decine, le Haut Conseil de la sant&#233; publique, la Cour des comptes et derni&#232;rement le Conseil &#233;conomique et social environnemental se sont alarm&#233;s de la forte baisse du nombre de m&#233;decins scolaires en France, ne permettant pas &#224; ces derniers de remplir l&#8217;ensemble de leurs missions.</p><p>Ces missions, d&#233;finies par la circulaire n&#176; 2015-118 du 10 novembre 2015 sont larges tant&#160;sur le suivi individualis&#233; des &#233;l&#232;ves (bilan de la sixi&#232;me ann&#233;e, visite m&#233;dicale pr&#233;alable &#224; l&#8217;affectation de l&#8217;&#233;l&#232;ve mineur aux travaux r&#233;glement&#233;s, analyse dans la scolarisation des &#233;l&#232;ves ayant des troubles de sant&#233;, des &#233;l&#232;ves en situation de handicap, des &#233;l&#232;ves ayant des troubles des apprentissages, participation &#224; la protection de l&#8217;enfance...) que sur la promotion de la sant&#233; (&#233;ducation &#224; la sant&#233;, environnement scolaire, formation des personnels, recueil de donn&#233;es de sant&#233;...).</p><p>Parall&#232;lement au nombre grandissant de missions, le nombre de m&#233;decins scolaires baisse fortement. Lors de l&#8217;examen du projet de loi de finances pour 2017, l&#8217;avis de la commission de la culture, de l&#8217;&#233;ducation et de la communication du S&#233;nat notait une baisse des effectifs de l&#8217;ordre de 20&#160;% depuis 2008,&#160;avec des disparit&#233;s territoriales tr&#232;s fortes. Aussi, quand certains m&#233;decins scolaires ont en charge 2&#160;000 &#233;l&#232;ves, d&#8217;autres en ont 46&#160;000. Souffrant de conditions mat&#233;rielles insuffisantes, ce sont aussi les m&#233;decins les moins bien r&#233;mun&#233;r&#233;s de la fonction publique. Pire, les syndicats font remonter le fait que dans certaines acad&#233;mies les fonds que les rectorats re&#231;oivent pour les primes (IFSE/CIA) pour des postes demeurant vacants sont utilis&#233;s pour d&#8217;autres cat&#233;gories professionnelles.&#160;</p><p>Il existe donc une tension forte entre le nombre de missions attribu&#233;es aux m&#233;decins scolaires, leur d&#233;mographie et les moyens qui leurs sont allou&#233;s.</p><p>Pourtant, les m&#233;decins scolaires ont un r&#244;le central dans la &#171;&#160;r&#233;volution de la pr&#233;vention&#160;&#187; que nous appelons de nos v&#339;ux. Le manque de m&#233;decins scolaires a par exemple des effets r&#233;els sur le suivi des enfants et des adolescents et le d&#233;pistage de certains troubles.</p><p>Si la question de la situation de la m&#233;decine scolaire appelle &#224; une r&#233;forme organisationnelle et des missions pour notamment renforcer l&#8217;attractivit&#233; du m&#233;tier, il faut n&#233;cessairement renforcer les moyens allou&#233;s. L&#8217;attractivit&#233; est une question de reconnaissance professionnelle et de r&#233;mun&#233;ration mais aussi de conditions mat&#233;rielles. Aussi de nouveaux moyens pourraient &#234;tre affect&#233;s aux d&#233;partements souffrant le plus d&#8217;une baisse de la d&#233;mographie des m&#233;decins scolaires et o&#249; les territoires &#224; couvrir sont les plus grands.</p><p>&#160;La m&#233;decine scolaire a su s&#8217;adapter aux probl&#232;mes croissants auxquels sont confront&#233;s les enfants et les adolescents, qui sont la cible prioritaire de notre politique de pr&#233;vention. Or, la pr&#233;vention est le socle-m&#234;me de notre strat&#233;gie nationale de sant&#233;. Elle ne pourra &#234;tre aboutie sans une m&#233;decine scolaire attractive, &#224; la gouvernance locale et nationale enti&#232;rement r&#233;nov&#233;e, sans &#233;quipes territoriales, sans coop&#233;ration nationale entre les minist&#232;res, sans se poser la n&#233;cessaire question des conditions de travail des m&#233;decins scolaires, sans se poser la n&#233;cessaire question des risques psychosociaux qu&#8217;on leur fait porter. Sans m&#233;decine scolaire r&#233;nov&#233;e, nous ne pourrons relever le d&#233;fi de la r&#233;sorption des in&#233;galit&#233;s territoriales et sociales de sant&#233;.</p><p>Ainsi, le pr&#233;sent amendement propose d&#8217;abonder l&#8217;action n&#176;02 &#171;&#160;sant&#233; scolaire&#160;&#187; du programme n&#176;230 &#171;&#160;Vie de l&#8217;&#233;l&#232;ve&#160;&#187; de 250&#160;000 euros et de diminuer de 250&#160;000 euros les cr&#233;dits de l&#8217;action n&#176;08 &#171;&#160;Logistique, syst&#232;me d&#8217;information, immobilier&#160;&#187; du programme n&#176;214 &#171;&#160;Soutien de la politique de l'&#233;ducation nationale&#160;&#187;.&#160;</p>",
    "annexeExposeSommaire": {
      "@xmlns:xsi": "http://www.w3.org/2001/XMLSchema-instance",
      "@xsi:nil": "true"
    },
    "cartoucheDelaiDepotDepasse": {
      "@xmlns:xsi": "http://www.w3.org/2001/XMLSchema-instance",
      "@xsi:nil": "true"
    },
    "avantAppel": {
      "@xmlns:xsi": "http://www.w3.org/2001/XMLSchema-instance",
      "@xsi:nil": "true"
    },
    "dispositifAmdtCredit": {
      "listeProgrammes": {
        "programme": [
          {
            "libelle": "Enseignement scolaire public du premier degré",
            "id": "64102",
            "AE": {
              "montantPositif": "0",
              "montantNegatif": "0"
            },
            "CP": {
              "montantPositif": "0",
              "montantNegatif": "0"
            },
            "action": "modification",
            "lignesCredits": null
          },
          {
            "libelle": "Enseignement scolaire public du second degré",
            "id": "64103",
            "AE": {
              "montantPositif": "0",
              "montantNegatif": "0"
            },
            "CP": {
              "montantPositif": "0",
              "montantNegatif": "0"
            },
            "action": "modification",
            "lignesCredits": null
          },
          {
            "libelle": "Vie de l'élève",
            "id": "64104",
            "AE": {
              "montantPositif": "250000",
              "montantNegatif": "0"
            },
            "CP": {
              "montantPositif": "250000",
              "montantNegatif": "0"
            },
            "action": "modification",
            "lignesCredits": null
          },
          {
            "libelle": "Enseignement privé du premier et du second degrés",
            "id": "64105",
            "AE": {
              "montantPositif": "0",
              "montantNegatif": "0"
            },
            "CP": {
              "montantPositif": "0",
              "montantNegatif": "0"
            },
            "action": "modification",
            "lignesCredits": null
          },
          {
            "libelle": "Soutien de la politique de l'éducation nationale",
            "id": "64106",
            "AE": {
              "montantPositif": "0",
              "montantNegatif": "250000"
            },
            "CP": {
              "montantPositif": "0",
              "montantNegatif": "250000"
            },
            "action": "modification",
            "lignesCredits": null
          },
          {
            "libelle": "Enseignement technique agricole",
            "id": "64107",
            "AE": {
              "montantPositif": "0",
              "montantNegatif": "0"
            },
            "CP": {
              "montantPositif": "0",
              "montantNegatif": "0"
            },
            "action": "modification",
            "lignesCredits": null
          }
        ]
      },
      "totalAE": {
        "montantPositif": "250000",
        "montantNegatif": "250000",
        "solde": "0"
      },
      "totalCP": {
        "montantPositif": "250000",
        "montantNegatif": "250000",
        "solde": "0"
      }
    }
  },
  "representations": {
    "representation": {
      "nom": "PDF",
      "typeMime": {
        "type": "application",
        "subType": "PDF"
      },
      "statutRepresentation": {
        "verbatim": "true",
        "canonique": "true",
        "officielle": "true",
        "transcription": "false",
        "enregistrement": "false"
      },
      "repSource": {
        "@xmlns:xsi": "http://www.w3.org/2001/XMLSchema-instance",
        "@xsi:nil": "true"
      },
      "offset": {
        "@xmlns:xsi": "http://www.w3.org/2001/XMLSchema-instance",
        "@xsi:nil": "true"
      },
      "contenu": {
        "documentURI": "/15/amendements/2272C/CION-CEDU/AC22.pdf"
      },
      "dateDispoRepresentation": {
        "@xmlns:xsi": "http://www.w3.org/2001/XMLSchema-instance",
        "@xsi:nil": "true"
      }
    }
  },
  "seanceDiscussion": {
    "@xmlns:xsi": "http://www.w3.org/2001/XMLSchema-instance",
    "@xsi:nil": "true"
  },
  "sort": {
    "dateSaisie": "2019-10-23T18:23:39.000+02:00",
    "sortEnSeance": "Rejeté"
  },
  "dateDepot": "2019-10-18T02:00:00.000+02:00",
  "dateDistribution": "2019-10-22T02:00:00.000+02:00",
  "article99": "0",
  "loiReference": {
    "codeLoi": {
      "@xmlns:xsi": "http://www.w3.org/2001/XMLSchema-instance",
      "@xsi:nil": "true"
    },
    "divisionCodeLoi": {
      "@xmlns:xsi": "http://www.w3.org/2001/XMLSchema-instance",
      "@xsi:nil": "true"
    }
  }
}