{
  "@xmlns": "http://schemas.assemblee-nationale.fr/referentiel",
  "uid": "AMANR5L15SEA717460BTC1019P0D1N1018",
  "identifiant": {
    "legislature": "15",
    "numero": "1018",
    "numRect": "0",
    "saisine": {
      "refTexteLegislatif": "PRJLANR5L15BTC1019",
      "numeroPartiePLF": "0",
      "organeExamen": "PO717460",
      "mentionSecondeDeliberation": "1"
    }
  },
  "numeroLong": "1018",
  "etapeTexte": "1ère lecture (1ère assemblée saisie)",
  "triAmendement": "f",
  "cardinaliteAmdtMultiples": "1",
  "amendementParent": {
    "@xmlns:xsi": "http://www.w3.org/2001/XMLSchema-instance",
    "@xsi:nil": "true"
  },
  "etat": "Discuté",
  "signataires": {
    "auteur": {
      "typeAuteur": "Depute",
      "acteurRef": "PA605036",
      "organeRef": {
        "@xmlns:xsi": "http://www.w3.org/2001/XMLSchema-instance",
        "@xsi:nil": "true"
      },
      "groupePolitiqueRef": "PO730934"
    },
    "cosignataires": {
      "acteurRef": [
        "PA721968",
        "PA721678",
        "PA267450",
        "PA718838",
        "PA720100",
        "PA1874",
        "PA330240",
        "PA2792",
        "PA340853",
        "PA346218",
        "PA642847",
        "PA607090",
        "PA718850",
        "PA608416",
        "PA721046",
        "PA267735",
        "PA2377",
        "PA266793",
        "PA267378",
        "PA267429",
        "PA720684",
        "PA767",
        "PA718784",
        "PA605036",
        "PA643134",
        "PA608016"
      ]
    },
    "texteAffichable": "M.&#160;Abad,  M.&#160;Le Fur, M.&#160;Brun, M.&#160;Cattin, M.&#160;Pradi&#233;, M.&#160;R&#233;mi&#160;Delatte, M.&#160;Pauget, M.&#160;Perrut, Mme&#160;Levy, M.&#160;Hetzel, M.&#160;Masson, M.&#160;Jean-Pierre&#160;Vigier, M.&#160;Leclerc, M.&#160;Cordier, M.&#160;Cinieri, M.&#160;Bony, M.&#160;Reda, M.&#160;de Ganay, M.&#160;Pierre-Henri&#160;Dumont, M.&#160;Vialay, Mme&#160;Louwagie, M.&#160;Ciotti, Mme&#160;Valentin, Mme&#160;Bassire, M.&#160;Taugourdeau et M.&#160;Bazin"
  },
  "pointeurFragmentTexte": {
    "missionVisee": {
      "@xmlns:xsi": "http://www.w3.org/2001/XMLSchema-instance",
      "@xsi:nil": "true"
    },
    "division": {
      "titre": "Article 43",
      "articleDesignationCourte": "APRÈS ART. 43",
      "type": "ARTICLE",
      "avant_A_Apres": "Après",
      "divisionRattachee": "APRÈS L'ARTICLE 43, insérer l'article suivant:",
      "articleAdditionnel": "1",
      "chapitreAdditionnel": {
        "@xmlns:xsi": "http://www.w3.org/2001/XMLSchema-instance",
        "@xsi:nil": "true"
      },
      "urlDivisionTexteVise": "/15/textes/1019.asp#D_Article_43"
    },
    "alinea": {
      "@xmlns:xsi": "http://www.w3.org/2001/XMLSchema-instance",
      "@xsi:nil": "true"
    }
  },
  "corps": {
    "dispositif": "<p style=\"text-align: justify;\">Dans un d&#233;lai de six mois &#224; compter de la promulgation de la pr&#233;sente loi, le Gouvernement remet au Parlement un rapport sur les difficult&#233;s rencontr&#233;es par les entreprises adapt&#233;es, notamment les surco&#251;ts sociaux li&#233;s &#224; l&#8217;embauche de personnes en situation de handicap de plus de cinquante ans en reconversion professionnelle. Des solutions peuvent &#234;tre pr&#233;sent&#233;es pour rem&#233;dier &#224; la situation.</p>",
    "exposeSommaire": "<p style=\"text-align: justify;\">Les Entreprises Adapt&#233;es sont un mod&#232;le d&#8217;entreprise inclusive. Elles apportent une r&#233;ponse au d&#233;fi social de l&#8217;emploi des PSH&#160;fortement touch&#233;s par le ch&#244;mage (le double de la population totale). Elles r&#233;pondent aux besoins singuliers des PSH&#160;: adaptent le contexte et l&#8217;environnement de travail en fonction des situations sp&#233;cifiques li&#233;es au handicap de leurs salari&#233;s&#160;;</p><p style=\"text-align: justify;\">En outre, elles permettent chaque ann&#233;e &#224; des milliers de salari&#233;s de rejoindre le monde ordinaire classique&#160;du travail dans la perspective de la r&#233;alisation de leur projet professionnel. Elles offrent la possibilit&#233; &#224; leurs salari&#233;s d&#8217;&#339;uvrer en milieu ordinaire par un contrat de travail durable de droit commun&#160;pour ceux qui ne peuvent pas ou pourront plus tardivement rejoindre le milieu classique&#160;: public vieillissant (38&#160;% de leur effectif), souvent licenci&#233; pour inaptitude dans un pr&#233;c&#233;dent m&#233;tier, de retrouver un nouvel emploi. Enfin elles cr&#233;ent des emplois direct non d&#233;localisables.</p><p style=\"text-align: justify;\">La diversit&#233; des silhouettes humaines, des comp&#233;tences humaines, m&#233;ritent d&#8217;&#234;tre prise en compte. Les Entreprises Adapt&#233;es fa&#231;onnent leurs activit&#233;s &#224; la propre mesure de chacun pour qu&#8217;ils puissent pleinement se r&#233;aliser. Ce mod&#232;le fonctionne depuis plus de 30 ans.</p><p style=\"text-align: justify;\">Pourtant les entreprises adapt&#233;es sont confront&#233;es &#224; des coupes budg&#233;taires importantes&#160;: Une baisse importante de leurs cr&#233;dits initialement pr&#233;vue dans le projet de loi de finances (PLF) pour 2018&#160;: leur subvention sp&#233;cifique va chuter de 18&#160;% &#224; partir du 1<sup>er</sup> janvier 2019. Huit millions d&#8217;euros manquaient pour financer les 1000 nouvelles aides aux postes pr&#233;vues par le contrat de d&#233;veloppement responsable et performant sign&#233; en 2017.</p><p style=\"text-align: justify;\">Notons &#233;galement que les entreprises adapt&#233;es, par l&#8217;embauche de nombreuses personnes en situation de handicap de plus de cinquante ans.</p><p style=\"text-align: justify;\">Avec la concentration d&#8217;une forte proportion de public &#224; risque (80&#160;% de personnes en situation de handicap), les entreprises adapt&#233;es subissent une vague d&#8217;inaptitudes relatives &#224; ces emplois de personnels dont la carri&#232;re pr&#233;c&#233;dente est la cause de leur incapacit&#233; &#224; travailler jusqu&#8217;&#224; l&#8217;&#226;ge de la retraite. D&#232;s lors, tous les co&#251;ts du traitement social de ces situations augmentent exponentiellement et, &#224; titre d&#8217;exemple, plusieurs entreprises adapt&#233;es se sont vu &#234;tre radi&#233;s ces derni&#232;res ann&#233;es de leur r&#233;gime de pr&#233;voyance (pour certaines, deuxi&#232;me radiation en quatre ans).</p><p style=\"text-align: justify;\">L&#8217;ensemble des surco&#251;ts li&#233;s au traitement social de la situation (compl&#233;mentaire sant&#233;, pr&#233;voyance, taux AT-MP, indemnit&#233;s d&#8217;inaptitude, absent&#233;isme suppl&#233;mentaire, &#8230;) repr&#233;sentent des proportions importantes que les aides de l&#8217;&#201;tat ne permettent plus de couvrir. Il y a une dizaine d&#8217;ann&#233;e la totalit&#233; de l&#8217;aide per&#231;ue (AAP) &#233;tait affect&#233;e &#224; la compensation du handicap, aujourd&#8217;hui plus de la moiti&#233; est consomm&#233;e par des charges externes li&#233;s aux surcouts sociaux.</p><p style=\"text-align: justify;\">C&#8217;est pourquoi il est propos&#233; qu&#8217;un rapport soit rendu concernant difficult&#233;s rencontr&#233;es par les entreprises adapt&#233;es, notamment les surcouts sociaux li&#233;s &#224; l&#8217;embauche de personnes en situation de handicap de plus de cinquante ans en reconversion professionnelle. En outre, l&#8217;impact des baisses de subventions concernant leur financement devrait &#234;tre &#233;tudi&#233;.</p>",
    "annexeExposeSommaire": {
      "@xmlns:xsi": "http://www.w3.org/2001/XMLSchema-instance",
      "@xsi:nil": "true"
    }
  },
  "representations": {
    "representation": {
      "nom": "PDF",
      "typeMime": {
        "type": "application",
        "subType": "PDF"
      },
      "statutRepresentation": {
        "verbatim": "true",
        "canonique": "true",
        "officielle": "true",
        "transcription": "false",
        "enregistrement": "false"
      },
      "repSource": {
        "@xmlns:xsi": "http://www.w3.org/2001/XMLSchema-instance",
        "@xsi:nil": "true"
      },
      "offset": {
        "@xmlns:xsi": "http://www.w3.org/2001/XMLSchema-instance",
        "@xsi:nil": "true"
      },
      "contenu": {
        "documentURI": "/15/amendements/1019/AN/1018.pdf"
      },
      "dateDispoRepresentation": {
        "@xmlns:xsi": "http://www.w3.org/2001/XMLSchema-instance",
        "@xsi:nil": "true"
      }
    }
  },
  "seanceDiscussion": "RUANR5L15S2018IDS21106",
  "sort": {
    "dateSaisie": "2018-06-16T01:39:56.000+02:00",
    "sortEnSeance": "Rejeté"
  },
  "dateDepot": "2018-06-07T02:00:00.000+02:00",
  "dateDistribution": "2018-06-12T02:00:00.000+02:00",
  "article99": "0",
  "loiReference": {
    "codeLoi": {
      "@xmlns:xsi": "http://www.w3.org/2001/XMLSchema-instance",
      "@xsi:nil": "true"
    },
    "divisionCodeLoi": {
      "@xmlns:xsi": "http://www.w3.org/2001/XMLSchema-instance",
      "@xsi:nil": "true"
    }
  }
}