{
  "@xmlns": "http://schemas.assemblee-nationale.fr/referentiel",
  "uid": "AMANR5L15SEA717460B1490P0D1N199",
  "identifiant": {
    "legislature": "15",
    "numero": "199",
    "numRect": "0",
    "saisine": {
      "refTexteLegislatif": "PRJLANR5L15B1490",
      "numeroPartiePLF": "0",
      "organeExamen": "PO717460",
      "mentionSecondeDeliberation": "0"
    }
  },
  "numeroLong": "199",
  "etapeTexte": "Nouvelle Lecture",
  "triAmendement": "ebaaaaaaaaaaaaaaaaaaaaaaaaaaaaaaaaaaaaaaaaaaaaaaaaqbc",
  "cardinaliteAmdtMultiples": "1",
  "amendementParent": {
    "@xmlns:xsi": "http://www.w3.org/2001/XMLSchema-instance",
    "@xsi:nil": "true"
  },
  "etat": "Discuté",
  "signataires": {
    "auteur": {
      "typeAuteur": "Depute",
      "acteurRef": "PA342415",
      "organeRef": {
        "@xmlns:xsi": "http://www.w3.org/2001/XMLSchema-instance",
        "@xsi:nil": "true"
      },
      "groupePolitiqueRef": "PO758835"
    },
    "cosignataires": {
      "acteurRef": [
        "PA719930",
        "PA1198",
        "PA1008",
        "PA332614",
        "PA608741",
        "PA609332",
        "PA605069",
        "PA335054",
        "PA429893",
        "PA643145",
        "PA337483",
        "PA608695",
        "PA720988",
        "PA333285",
        "PA1592",
        "PA333818",
        "PA609590",
        "PA342415",
        "PA642764",
        "PA335532",
        "PA340357",
        "PA267233",
        "PA608172",
        "PA607553",
        "PA340343",
        "PA610681",
        "PA508",
        "PA1809",
        "PA608011"
      ]
    },
    "texteAffichable": "Mme&#160;Battistel,  Mme&#160;Pires Beaune, M.&#160;Jean-Louis&#160;Bricout, Mme&#160;Rabault, M.&#160;Aviragnet, Mme&#160;Bareigts, Mme&#160;Bi&#233;mouret, M.&#160;Bouillon, M.&#160;Carvounas, M.&#160;Alain&#160;David, Mme&#160;Laurence&#160;Dumont, M.&#160;Faure, M.&#160;Garot, M.&#160;David&#160;Habib, M.&#160;Hutin, M.&#160;Juanico, Mme&#160;Karamanli, M.&#160;J&#233;r&#244;me&#160;Lambert, M.&#160;Letchimy, Mme&#160;Manin, Mme&#160;Pau-Langevin, M.&#160;Potier, M.&#160;Pueyo, M.&#160;Saulignac, Mme&#160;Tolmont, Mme&#160;Untermaier, Mme&#160;Vainqueur-Christophe, M.&#160;Vallaud, Mme&#160;Victory et les membres du groupe Socialistes et apparent&#233;s"
  },
  "pointeurFragmentTexte": {
    "missionVisee": {
      "idMissionAN": "703",
      "libelleMission": "Conseil et contrôle de l'État",
      "codeMissionPLF": "B",
      "libelleMissionPLF": "Répartition, par mission et programme, des crédits du budget général"
    },
    "division": {
      "titre": "ÉTAT B",
      "articleDesignationCourte": "ART. 39",
      "type": "ANNEXE",
      "avant_A_Apres": "A",
      "divisionRattachee": "ARTICLE 39",
      "articleAdditionnel": {
        "@xmlns:xsi": "http://www.w3.org/2001/XMLSchema-instance",
        "@xsi:nil": "true"
      },
      "chapitreAdditionnel": {
        "@xmlns:xsi": "http://www.w3.org/2001/XMLSchema-instance",
        "@xsi:nil": "true"
      },
      "urlDivisionTexteVise": "/15/textes/1490.asp#D_Etat_B"
    },
    "alinea": {
      "@xmlns:xsi": "http://www.w3.org/2001/XMLSchema-instance",
      "@xsi:nil": "true"
    }
  },
  "corps": {
    "exposeSommaire": "<p style=\"text-align: justify;\">Le groupe &#171;&#160;Socialistes et apparent&#233;s&#160;&#187; entend, par cet amendement, augmenter de 6 millions le budget de la Cour nationale du droit d&#8217;asile afin de permettre la cr&#233;ation de postes au sein de cette juridiction (ce qui correspondrait &#224; environ 100 rapporteurs suppl&#233;mentaires).</p><p style=\"text-align: justify;\">Cette augmentation de moyens apparait d&#8217;autant plus n&#233;cessaire que la r&#233;cente loi relative &#224; l&#8217;asile et l&#8217;immigration a r&#233;duit les d&#233;lais de jugement devant la CNDA, mettant sous pression les personnels charg&#233;s de pr&#233;parer les d&#233;cisions.</p><p style=\"text-align: justify;\">Le droit &#224; un jugement &#233;quitable impose que les dossiers des demandeurs d&#8217;asile soient trait&#233;s s&#233;rieusement ce que le racourcissement des d&#233;lais est d&#233;j&#224; venu en partie compromettre. Tel est le sens de cet amendement qui vise &#224; compenser par la cr&#233;ation de poste de &#171;&#160;rapporteurs&#160;&#187; des d&#233;lais qui sont pour ces derniers intenables.</p><p style=\"text-align: justify;\">Aussi cet amendement propose t-il d&#8217;augmenter de 6 millions le programme 165 et en particulier l&#8217;action &#171;&#160;Cour nationale du droit d&#8217;asile&#160;&#187; et de baisser corr&#233;lativement le programme 164 et en particulier l&#8217;action &#171;&#160;pilotage et soutien des juridictions financi&#232;res&#160;&#187;.</p>",
    "annexeExposeSommaire": {
      "@xmlns:xsi": "http://www.w3.org/2001/XMLSchema-instance",
      "@xsi:nil": "true"
    },
    "cartoucheDelaiDepotDepasse": {
      "@xmlns:xsi": "http://www.w3.org/2001/XMLSchema-instance",
      "@xsi:nil": "true"
    },
    "dispositifAmdtCredit": {
      "listeProgrammes": {
        "programme": [
          {
            "libelle": "Conseil d'État et autres juridictions administratives",
            "id": "54129",
            "AE": {
              "montantPositif": "6000000",
              "montantNegatif": "0"
            },
            "CP": {
              "montantPositif": "6000000",
              "montantNegatif": "0"
            },
            "action": "modification",
            "lignesCredits": null
          },
          {
            "libelle": "Conseil économique, social et environnemental",
            "id": "54130",
            "AE": {
              "montantPositif": "0",
              "montantNegatif": "0"
            },
            "CP": {
              "montantPositif": "0",
              "montantNegatif": "0"
            },
            "action": "modification",
            "lignesCredits": null
          },
          {
            "libelle": "Cour des comptes et autres juridictions financières",
            "id": "54131",
            "AE": {
              "montantPositif": "0",
              "montantNegatif": "6000000"
            },
            "CP": {
              "montantPositif": "0",
              "montantNegatif": "6000000"
            },
            "action": "modification",
            "lignesCredits": null
          },
          {
            "libelle": "Haut Conseil des finances publiques",
            "id": "54132",
            "AE": {
              "montantPositif": "0",
              "montantNegatif": "0"
            },
            "CP": {
              "montantPositif": "0",
              "montantNegatif": "0"
            },
            "action": "modification",
            "lignesCredits": null
          }
        ]
      },
      "totalAE": {
        "montantPositif": "6000000",
        "montantNegatif": "6000000",
        "solde": "0"
      },
      "totalCP": {
        "montantPositif": "6000000",
        "montantNegatif": "6000000",
        "solde": "0"
      }
    }
  },
  "representations": {
    "representation": {
      "nom": "PDF",
      "typeMime": {
        "type": "application",
        "subType": "PDF"
      },
      "statutRepresentation": {
        "verbatim": "true",
        "canonique": "true",
        "officielle": "true",
        "transcription": "false",
        "enregistrement": "false"
      },
      "repSource": {
        "@xmlns:xsi": "http://www.w3.org/2001/XMLSchema-instance",
        "@xsi:nil": "true"
      },
      "offset": {
        "@xmlns:xsi": "http://www.w3.org/2001/XMLSchema-instance",
        "@xsi:nil": "true"
      },
      "contenu": {
        "documentURI": "/15/amendements/1490/AN/199.pdf"
      },
      "dateDispoRepresentation": {
        "@xmlns:xsi": "http://www.w3.org/2001/XMLSchema-instance",
        "@xsi:nil": "true"
      }
    }
  },
  "seanceDiscussion": "RUANR5L15S2019IDS21433",
  "sort": {
    "dateSaisie": "2018-12-19T01:35:58.000+01:00",
    "sortEnSeance": "Rejeté"
  },
  "dateDepot": "2018-12-13T01:00:00.000+01:00",
  "dateDistribution": "2018-12-17T01:00:00.000+01:00",
  "article99": "0",
  "loiReference": {
    "codeLoi": {
      "@xmlns:xsi": "http://www.w3.org/2001/XMLSchema-instance",
      "@xsi:nil": "true"
    },
    "divisionCodeLoi": {
      "@xmlns:xsi": "http://www.w3.org/2001/XMLSchema-instance",
      "@xsi:nil": "true"
    }
  }
}