{
  "@xmlns": "http://schemas.assemblee-nationale.fr/referentiel",
  "uid": "AMANR5L15SEA717460B2272P1D1N399",
  "identifiant": {
    "legislature": "15",
    "numero": "399",
    "numRect": "0",
    "saisine": {
      "refTexteLegislatif": "PRJLANR5L15B2272",
      "numeroPartiePLF": "1",
      "organeExamen": "PO717460",
      "mentionSecondeDeliberation": "1"
    }
  },
  "numeroLong": "I-399",
  "etapeTexte": "1ère lecture (1ère assemblée saisie)",
  "triAmendement": "jdaaaaaaaaaaaaaaaaaaaaaaaaaaaaaaaaaaaaaaaaaaaaaaaas",
  "cardinaliteAmdtMultiples": "1",
  "amendementParent": {
    "@xmlns:xsi": "http://www.w3.org/2001/XMLSchema-instance",
    "@xsi:nil": "true"
  },
  "etat": "Discuté",
  "signataires": {
    "auteur": {
      "typeAuteur": "Depute",
      "acteurRef": "PA720230",
      "organeRef": {
        "@xmlns:xsi": "http://www.w3.org/2001/XMLSchema-instance",
        "@xsi:nil": "true"
      },
      "groupePolitiqueRef": "PO767217"
    },
    "cosignataires": {
      "acteurRef": [
        "PA721632",
        "PA719806",
        "PA720696",
        "PA268019",
        "PA702052",
        "PA267355",
        "PA267585",
        "PA721486",
        "PA712014",
        "PA342601",
        "PA267780",
        "PA720230",
        "PA642935",
        "PA721110",
        "PA267241",
        "PA642868",
        "PA331567"
      ]
    },
    "texteAffichable": "Mme&#160;Magnier,  Mme&#160;Auconie, M.&#160;Becht, M.&#160;Brindeau, M.&#160;Christophe, Mme&#160;de La Raudi&#232;re, M.&#160;Demilly, Mme&#160;Descamps, Mme&#160;Firmin Le Bodo, M.&#160;Herth, M.&#160;Lagarde, M.&#160;Ledoux, Mme&#160;Lemoine, M.&#160;Naegelen, Mme&#160;Sage, Mme&#160;Sanquer et M.&#160;Vercamer"
  },
  "pointeurFragmentTexte": {
    "missionVisee": {
      "@xmlns:xsi": "http://www.w3.org/2001/XMLSchema-instance",
      "@xsi:nil": "true"
    },
    "division": {
      "titre": "Article 26",
      "articleDesignationCourte": "APRÈS ART. 26",
      "type": "ARTICLE",
      "avant_A_Apres": "Après",
      "divisionRattachee": "APRÈS L'ARTICLE 26, insérer l'article suivant:",
      "articleAdditionnel": "1",
      "chapitreAdditionnel": {
        "@xmlns:xsi": "http://www.w3.org/2001/XMLSchema-instance",
        "@xsi:nil": "true"
      },
      "urlDivisionTexteVise": "/15/textes/2272A.asp#D_Article_26"
    },
    "alinea": {
      "@xmlns:xsi": "http://www.w3.org/2001/XMLSchema-instance",
      "@xsi:nil": "true"
    }
  },
  "corps": {
    "dispositif": "<p style=\"text-align: justify;\">I.&#160;&#8211;&#160;L&#8217;article L.&#160;1615&#8209;2 du code g&#233;n&#233;ral des collectivit&#233;s territoriales est compl&#233;t&#233; par un alin&#233;a ainsi r&#233;dig&#233;&#160;:</p><p style=\"text-align: justify;\">&#171;&#160;Les collectivit&#233;s territoriales et leurs groupements qui prennent en location, pour une dur&#233;e de deux ans ou plus, le mat&#233;riel informatique et num&#233;rique mis &#224; disposition du public dans les &#233;tablissements dont elles assurent la gestion b&#233;n&#233;ficient &#233;galement des attributions du Fonds de compensation pour la taxe sur la valeur ajout&#233;e au titre de la fraction des loyers correspondant &#224; l&#8217;investissement r&#233;alis&#233; par le loueur. Ce montant leur est communiqu&#233; par le loueur et ne peut exc&#233;der, hors taxe sur la valeur ajout&#233;e, la dotation aux amortissements pratiqu&#233;e par ce dernier au titre de la p&#233;riode couverte par le loyer.&#160;&#187;</p><p style=\"text-align: justify;\">II.&#160;&#8211;&#160;La perte de recettes pour l&#8217;&#201;tat est compens&#233;e &#224; due concurrence par la cr&#233;ation d&#8217;une taxe additionnelle aux droits mentionn&#233;s aux articles 575 et 575 A du code g&#233;n&#233;ral des imp&#244;ts.</p>",
    "exposeSommaire": "<p style=\"text-align: justify;\">La transformation num&#233;rique de notre Pays est en marche. Pour autant, cette transformation ne se fera pas de la m&#234;me fa&#231;on sur l&#8217;ensemble des territoires et n&#233;cessite l&#8217;intervention des communes et intercommunalit&#233;s.</p><p style=\"text-align: justify;\">Celles-ci adaptent en effet leurs services publics avec les nouveaux outils num&#233;riques mais vont &#233;galement devoir proposer un accompagnement aux personnes les plus &#233;loign&#233;es de ces nouveaux outils.</p><p style=\"text-align: justify;\">Pour autant, il semble aujourd&#8217;hui pertinent de favoriser la LLD de ces mat&#233;riels, plut&#244;t que l&#8217;investissement, compte tenu de l&#8217;&#233;volution extr&#234;mement rapide des tablettes, tableaux num&#233;riques, vid&#233;oprojecteurs interactifs&#8230; Nous devons donc adapter nos outils de soutien aux collectivit&#233;s &#224; ces &#233;volutions. C&#8217;est pourquoi il est propos&#233; de faire b&#233;n&#233;ficier aux communes et EPCI du FCTVA pour la location longue dur&#233;e, minimum deux ans, des &#233;quipements num&#233;riques qu&#8217;elles mettraient &#224; disposition du public, dans les &#233;coles, biblioth&#232;ques, mus&#233;es ou tout simplement en mairie pour un acc&#232;s au service public en ligne.</p><p style=\"text-align: justify;\">Cela permettrait en outre de mettre en place un m&#233;canisme d&#8217;incitation pour que les collectivit&#233;s territoriales sortent de la logique de l&#8217;achat qu&#8217;elles privil&#233;gient traditionnellement pour ce mat&#233;riel num&#233;rique qui devient rapidement obsol&#232;te.</p>",
    "annexeExposeSommaire": {
      "@xmlns:xsi": "http://www.w3.org/2001/XMLSchema-instance",
      "@xsi:nil": "true"
    },
    "cartoucheDelaiDepotDepasse": {
      "@xmlns:xsi": "http://www.w3.org/2001/XMLSchema-instance",
      "@xsi:nil": "true"
    },
    "avantAppel": {
      "@xmlns:xsi": "http://www.w3.org/2001/XMLSchema-instance",
      "@xsi:nil": "true"
    }
  },
  "representations": {
    "representation": {
      "nom": "PDF",
      "typeMime": {
        "type": "application",
        "subType": "PDF"
      },
      "statutRepresentation": {
        "verbatim": "true",
        "canonique": "true",
        "officielle": "true",
        "transcription": "false",
        "enregistrement": "false"
      },
      "repSource": {
        "@xmlns:xsi": "http://www.w3.org/2001/XMLSchema-instance",
        "@xsi:nil": "true"
      },
      "offset": {
        "@xmlns:xsi": "http://www.w3.org/2001/XMLSchema-instance",
        "@xsi:nil": "true"
      },
      "contenu": {
        "documentURI": "/15/amendements/2272A/AN/399.pdf"
      },
      "dateDispoRepresentation": {
        "@xmlns:xsi": "http://www.w3.org/2001/XMLSchema-instance",
        "@xsi:nil": "true"
      }
    }
  },
  "seanceDiscussion": "RUANR5L15S2020IDS21886",
  "sort": {
    "dateSaisie": "2019-10-22T02:01:10.000+02:00",
    "sortEnSeance": "Rejeté"
  },
  "dateDepot": "2019-10-08T02:00:00.000+02:00",
  "dateDistribution": "2019-10-21T02:00:00.000+02:00",
  "article99": "0",
  "loiReference": {
    "codeLoi": "CGCT",
    "divisionCodeLoi": "L1615-2"
  }
}