{
  "@xmlns": "http://schemas.assemblee-nationale.fr/referentiel",
  "uid": "AMANR5L15SEA717460BTC1767P0D1N1483",
  "identifiant": {
    "legislature": "15",
    "numero": "1483",
    "numRect": "0",
    "saisine": {
      "refTexteLegislatif": "PRJLANR5L15BTC1767",
      "numeroPartiePLF": "0",
      "organeExamen": "PO717460",
      "mentionSecondeDeliberation": "0"
    }
  },
  "numeroLong": "1483",
  "etapeTexte": "1ère lecture (1ère assemblée saisie)",
  "triAmendement": "eeaaaaaaaaaaaaaaaaaaaaaaaaaaaaaaaaaaaaaaaaaaaaaaaaajs",
  "cardinaliteAmdtMultiples": "1",
  "amendementParent": {
    "@xmlns:xsi": "http://www.w3.org/2001/XMLSchema-instance",
    "@xsi:nil": "true"
  },
  "etat": "Discuté",
  "signataires": {
    "auteur": {
      "typeAuteur": "Depute",
      "acteurRef": "PA720422",
      "organeRef": {
        "@xmlns:xsi": "http://www.w3.org/2001/XMLSchema-instance",
        "@xsi:nil": "true"
      },
      "groupePolitiqueRef": "PO730958"
    },
    "cosignataires": {
      "acteurRef": [
        "PA719578",
        "PA720892",
        "PA718860",
        "PA719676",
        "PA722142",
        "PA718868",
        "PA721210",
        "PA721960",
        "PA721202",
        "PA720422",
        "PA720430",
        "PA721226",
        "PA721062",
        "PA588884",
        "PA720286",
        "PA2150",
        "PA720846"
      ]
    },
    "texteAffichable": "M.&#160;Quatennens,  Mme&#160;Autain, M.&#160;Bernalicis, M.&#160;Coquerel, M.&#160;Corbi&#232;re, Mme&#160;Fiat, M.&#160;Lachaud, M.&#160;Larive, M.&#160;M&#233;lenchon, Mme&#160;Obono, Mme&#160;Panot, M.&#160;Prud&apos;homme, M.&#160;Ratenon, Mme&#160;Ressiguier, Mme&#160;Rubin, M.&#160;Ruffin et Mme&#160;Taurine"
  },
  "pointeurFragmentTexte": {
    "missionVisee": {
      "@xmlns:xsi": "http://www.w3.org/2001/XMLSchema-instance",
      "@xsi:nil": "true"
    },
    "division": {
      "titre": "Article 10",
      "articleDesignationCourte": "ART. 10",
      "type": "ARTICLE",
      "avant_A_Apres": "A",
      "divisionRattachee": "ARTICLE 10",
      "articleAdditionnel": {
        "@xmlns:xsi": "http://www.w3.org/2001/XMLSchema-instance",
        "@xsi:nil": "true"
      },
      "chapitreAdditionnel": {
        "@xmlns:xsi": "http://www.w3.org/2001/XMLSchema-instance",
        "@xsi:nil": "true"
      },
      "urlDivisionTexteVise": "/15/textes/1767.asp#D_Article_10"
    },
    "alinea": {
      "@xmlns:xsi": "http://www.w3.org/2001/XMLSchema-instance",
      "@xsi:nil": "true"
    }
  },
  "corps": {
    "dispositif": "<p>Supprimer cet article.</p>",
    "exposeSommaire": "<p style=\"text-align: justify;\">Depuis les ann&#233;es 1980, l&#8217;ind&#233;pendance des h&#244;pitaux est toujours plus remise en cause. Les &#171;&#160;Groupements Hospitaliers de Territoire&#160;&#187; institu&#233;s par la loi de janvier 2016 ont modifi&#233; la gouvernance des h&#244;pitaux. Ils ont &#233;t&#233; les fers de lance des regroupements hospitaliers et de la r&#233;duction du nombre de structures hospitali&#232;res. </p><p style=\"text-align: justify;\">Dans un contexte d&#8217;aust&#233;rit&#233; et sous couvert de bonne gestion, ils sont les acteurs centraux des fermetures de lits et de services et des suppressions de postes. Dans la continuit&#233; de cette loi, cet article rend obligatoire les commissions m&#233;dicales de groupements hospitaliers de territoire, force la mutualisation de la comp&#233;tence de gestion des ressources humaines et ouvre droit &#224; d&#8217;autres mutualisations de fonctions (tr&#233;sorerie, programme d&#8217;investissement, etc&#8230;) et m&#234;me &#224; la fusion d&#8217;instances repr&#233;sentatives ou consultatives, ce qui demain deviendra certainement contraignant. Si le &#171;&#160;laisser-faire&#160;&#187; et la &#171;&#160;confiance&#160;&#187; guident la politique du Gouvernement dans des domaines o&#249; nous aurions pourtant cruellement besoin d&#8217;une r&#233;gulation forte, ce m&#234;me Gouvernement sait se rendre autoritaire et arbitraire s&#8217;agissant du service public hospitalier. En for&#231;ant les h&#244;pitaux &#224; d&#233;laisser toujours plus leurs pouvoirs aux mains des GHT, la concentration des pouvoirs se poursuit. Apr&#232;s les fonctions h&#244;teli&#232;res et les m&#233;dicaments les GHT vont d&#233;sormais d&#233;terminer le projet m&#233;dical de l&#8217;ensemble des &#233;tablissements concern&#233;s et g&#233;rer directement les personnels m&#233;dicaux. </p><p style=\"text-align: justify;\">&#192; cette vision exclusivement comptable les GHT ajoute une lourdeur et une complexit&#233; de gestion dont le co&#251;t engendr&#233; (notamment par tous les cabinets de consultants priv&#233;s intervenus dans le processus) n&#8217;est pas en capacit&#233; de r&#233;pondre aux objectifs du Gouvernement.</p><p style=\"text-align: justify;\">Si quelques rares groupements hospitaliers de territoire ont su mettre en place une gestion coh&#233;rente, c&#8217;est loin d&#8217;&#234;tre le cas dans la plupart des territoires car l&#8217;hyper administration n&#8217;a jamais &#233;t&#233; efficace. Cette mesure est extr&#234;mement grave dans la mesure o&#249; elle acte la &#64257;n de l&#8217;autonomie de gestion des h&#244;pitaux publics dans une perspective centralisatrice dont les cons&#233;quences pour les personnels et les patients seront consid&#233;rables. Il convient &#224; tout prix de laisser aux structures hospitali&#232;res le choix de mutualiser ou non certaines de leurs fonctions au sein des groupements hospitaliers de territoire et ne pas imposer des regroupements ou des mutualisations totalement d&#233;connect&#233;s des r&#233;alit&#233;s. </p><p style=\"text-align: justify;\">Par cons&#233;quent, la France Insoumise ne peut qu&#8217;&#234;tre oppos&#233;e &#224; cet article et en demande la suppression.</p>",
    "annexeExposeSommaire": {
      "@xmlns:xsi": "http://www.w3.org/2001/XMLSchema-instance",
      "@xsi:nil": "true"
    },
    "cartoucheDelaiDepotDepasse": {
      "@xmlns:xsi": "http://www.w3.org/2001/XMLSchema-instance",
      "@xsi:nil": "true"
    }
  },
  "representations": {
    "representation": {
      "nom": "PDF",
      "typeMime": {
        "type": "application",
        "subType": "PDF"
      },
      "statutRepresentation": {
        "verbatim": "true",
        "canonique": "true",
        "officielle": "true",
        "transcription": "false",
        "enregistrement": "false"
      },
      "repSource": {
        "@xmlns:xsi": "http://www.w3.org/2001/XMLSchema-instance",
        "@xsi:nil": "true"
      },
      "offset": {
        "@xmlns:xsi": "http://www.w3.org/2001/XMLSchema-instance",
        "@xsi:nil": "true"
      },
      "contenu": {
        "documentURI": "/15/amendements/1767/AN/1483.pdf"
      },
      "dateDispoRepresentation": {
        "@xmlns:xsi": "http://www.w3.org/2001/XMLSchema-instance",
        "@xsi:nil": "true"
      }
    }
  },
  "seanceDiscussion": "RUANR5L15S2019IDS21566",
  "sort": {
    "dateSaisie": "2019-03-22T15:29:13.000+01:00",
    "sortEnSeance": "Rejeté"
  },
  "dateDepot": "2019-03-15T01:00:00.000+01:00",
  "dateDistribution": "2019-03-18T01:00:00.000+01:00",
  "article99": "0",
  "loiReference": {
    "codeLoi": {
      "@xmlns:xsi": "http://www.w3.org/2001/XMLSchema-instance",
      "@xsi:nil": "true"
    },
    "divisionCodeLoi": {
      "@xmlns:xsi": "http://www.w3.org/2001/XMLSchema-instance",
      "@xsi:nil": "true"
    }
  }
}