{
  "@xmlns": "http://schemas.assemblee-nationale.fr/referentiel",
  "uid": "AMANR5L15SEA717460B1490P0D1N447",
  "identifiant": {
    "legislature": "15",
    "numero": "447",
    "numRect": "0",
    "saisine": {
      "refTexteLegislatif": "PRJLANR5L15B1490",
      "numeroPartiePLF": "0",
      "organeExamen": "PO717460",
      "mentionSecondeDeliberation": "0"
    }
  },
  "numeroLong": "447",
  "etapeTexte": "Nouvelle Lecture",
  "triAmendement": "aagaaaaaaaaaaaaaacaaaaaaaaaaaaaaaaaaaaaaaaaaaaaaaas",
  "cardinaliteAmdtMultiples": "1",
  "amendementParent": {
    "@xmlns:xsi": "http://www.w3.org/2001/XMLSchema-instance",
    "@xsi:nil": "true"
  },
  "etat": "Discuté",
  "signataires": {
    "auteur": {
      "typeAuteur": "Depute",
      "acteurRef": "PA718720",
      "organeRef": {
        "@xmlns:xsi": "http://www.w3.org/2001/XMLSchema-instance",
        "@xsi:nil": "true"
      },
      "groupePolitiqueRef": "PO730940"
    },
    "cosignataires": {
      "acteurRef": [
        "PA267306",
        "PA610667",
        "PA721012",
        "PA610654",
        "PA721118",
        "PA720692",
        "PA718926",
        "PA722110",
        "PA335612",
        "PA722202",
        "PA721270",
        "PA689",
        "PA720546",
        "PA441",
        "PA718720",
        "PA721896"
      ]
    },
    "texteAffichable": "M.&#160;Dufr&#232;gne,  M.&#160;Fabien&#160;Roussel, M.&#160;Peu, Mme&#160;Bello, M.&#160;Brotherson, M.&#160;Bruneel, Mme&#160;Buffet, M.&#160;Chassaigne, M.&#160;Dharr&#233;ville, Mme&#160;Faucillon, M.&#160;Jumel, Mme&#160;K&#233;clard-Mond&#233;sir, M.&#160;Lecoq, M.&#160;Nilor, M.&#160;Serville et M.&#160;Wulfranc"
  },
  "pointeurFragmentTexte": {
    "missionVisee": {
      "@xmlns:xsi": "http://www.w3.org/2001/XMLSchema-instance",
      "@xsi:nil": "true"
    },
    "division": {
      "titre": "Article 16 quater",
      "articleDesignationCourte": "ART. 16 QUATER",
      "type": "ARTICLE",
      "avant_A_Apres": "A",
      "divisionRattachee": "ARTICLE 16 QUATER",
      "articleAdditionnel": {
        "@xmlns:xsi": "http://www.w3.org/2001/XMLSchema-instance",
        "@xsi:nil": "true"
      },
      "chapitreAdditionnel": {
        "@xmlns:xsi": "http://www.w3.org/2001/XMLSchema-instance",
        "@xsi:nil": "true"
      },
      "urlDivisionTexteVise": "/15/textes/1490.asp#D_Article_16_quater"
    },
    "alinea": {
      "@xmlns:xsi": "http://www.w3.org/2001/XMLSchema-instance",
      "@xsi:nil": "true"
    }
  },
  "corps": {
    "dispositif": "<p>R&#233;diger ainsi cet article :</p><p>&#171;&#160;I.&#160;&#8211;&#160;Les articles du code g&#233;n&#233;ral des imp&#244;ts modifi&#233;s par les articles 28 et 29 de la loi n&#176;&#160;2017&#8209;1837 du 30 d&#233;cembre 2017 de finances pour 2018 sont r&#233;tablis dans leur r&#233;daction ant&#233;rieure &#224; la publication de la loi n&#176;&#160;2017&#8209;1837 du 30 d&#233;cembre 2017 de finances pour 2018.</p><p>&#171;&#160;II.&#160;&#8211;&#160;Les articles du code mon&#233;taire et financier modifi&#233;s par l&#8217;article de la loi n&#176;&#160;2017&#8209;1837 du 30 d&#233;cembre 2017 de finances pour 2018 sont r&#233;tablis dans leur r&#233;daction ant&#233;rieure &#224; la publication de la loi n&#176;&#160;2017&#8209;1837 du 30 d&#233;cembre 2017 de finances pour 2018.</p><p>&#171;&#160;III.&#160;&#8211;&#160;Les articles du code de la construction et de l&#8217;habitation modifi&#233;s par l&#8217;article de la loi n&#176; 2017&#8209;1837 du 30 d&#233;cembre 2017 de finances pour 2018 sont r&#233;tablis dans leur r&#233;daction ant&#233;rieure &#224; la publication de la loi n&#176;&#160;2017&#8209;1837 du 30 d&#233;cembre 2017 de finances pour 2018.</p><p>&#171;&#160;IV.&#160;&#8211;&#160;Les articles du code de la s&#233;curit&#233; sociale modifi&#233;s par l&#8217;article de la loi n&#176;&#160;2017&#8209;1837 du 30 d&#233;cembre 2017 de finances pour 2018 sont r&#233;tablis dans leur r&#233;daction ant&#233;rieure &#224; la publication de la loi n&#176; 2017&#8209;1837 du 30 d&#233;cembre 2017 de finances pour 2018.</p><p>&#171;&#160;V.&#160;&#8211;&#160;Les articles du livre des proc&#233;dures fiscales modifi&#233;s par l&#8217;article de la loi n&#176;&#160;2017&#8209;1837 du 30 d&#233;cembre 2017 de finances pour 2018 sont r&#233;tablis dans leur r&#233;daction ant&#233;rieure &#224; la publication de la loi n&#176; 2017&#8209;1837 du 30 d&#233;cembre 2017 de finances pour 2018.</p><p>&#171;&#160;VI.&#160;&#8211;&#160;Les articles 28 et 29 de la loi n&#176; 2017&#8209;1837 du 30 d&#233;cembre 2017 de finances pour 2018 sont abrog&#233;s.&#160;&#187;</p>",
    "exposeSommaire": "<p style=\"text-align: justify;\">Le pr&#233;sent amendement propose la suppression du pr&#233;l&#232;vement forfaitaire unique &#224; 30%. Dispositif entr&#233; en vigueur cette ann&#233;e, il a mis un terme &#224; la progressivit&#233; de notre fiscalit&#233; sur les revenus du capital, b&#233;n&#233;ficiant ainsi aux plus riches contribuables de notre pays. L'ex&#233;cutif cherche des ressources budg&#233;taires pour financer les mesures annonc&#233;es par le Pr&#233;sident de la R&#233;publique. Voil&#224; un gisement potentiel de l'ordre de 2 milliards d'euros, qui prendrait en compte l'imp&#233;rieuse n&#233;cessit&#233; de justice sociale pour p&#233;renniser notre pacte r&#233;publicain. Notons que le S&#233;nat a renforc&#233; le dispositif, avec l'appui du Gouvernement, en vue d'&#233;tendre le PFU aux sorties anticip&#233;es du PEA.</p>",
    "annexeExposeSommaire": {
      "@xmlns:xsi": "http://www.w3.org/2001/XMLSchema-instance",
      "@xsi:nil": "true"
    },
    "cartoucheDelaiDepotDepasse": {
      "@xmlns:xsi": "http://www.w3.org/2001/XMLSchema-instance",
      "@xsi:nil": "true"
    }
  },
  "representations": {
    "representation": {
      "nom": "PDF",
      "typeMime": {
        "type": "application",
        "subType": "PDF"
      },
      "statutRepresentation": {
        "verbatim": "true",
        "canonique": "true",
        "officielle": "true",
        "transcription": "false",
        "enregistrement": "false"
      },
      "repSource": {
        "@xmlns:xsi": "http://www.w3.org/2001/XMLSchema-instance",
        "@xsi:nil": "true"
      },
      "offset": {
        "@xmlns:xsi": "http://www.w3.org/2001/XMLSchema-instance",
        "@xsi:nil": "true"
      },
      "contenu": {
        "documentURI": "/15/amendements/1490/AN/447.pdf"
      },
      "dateDispoRepresentation": {
        "@xmlns:xsi": "http://www.w3.org/2001/XMLSchema-instance",
        "@xsi:nil": "true"
      }
    }
  },
  "seanceDiscussion": "RUANR5L15S2019IDS21431",
  "sort": {
    "dateSaisie": "2018-12-17T23:20:38.000+01:00",
    "sortEnSeance": "Rejeté"
  },
  "dateDepot": "2018-12-14T01:00:00.000+01:00",
  "dateDistribution": "2018-12-17T01:00:00.000+01:00",
  "article99": "0",
  "loiReference": {
    "codeLoi": {
      "@xmlns:xsi": "http://www.w3.org/2001/XMLSchema-instance",
      "@xsi:nil": "true"
    },
    "divisionCodeLoi": {
      "@xmlns:xsi": "http://www.w3.org/2001/XMLSchema-instance",
      "@xsi:nil": "true"
    }
  }
}