{
  "@xmlns": "http://schemas.assemblee-nationale.fr/referentiel",
  "uid": "AMANR5L15PO59048B1255P1D1N149",
  "identifiant": {
    "legislature": "15",
    "numero": "149",
    "numRect": "0",
    "saisine": {
      "refTexteLegislatif": "PRJLANR5L15B1255",
      "numeroPartiePLF": "1",
      "organeExamen": "PO59048",
      "mentionSecondeDeliberation": "0"
    }
  },
  "numeroLong": "I-CF149",
  "etapeTexte": "1ère lecture (1ère assemblée saisie)",
  "triAmendement": "kaaaaaaaaaaaaaaaaaaaaaaaaaaaaaaaaaaaaaaaaaaaaaaaaanbdddddhzzzzzskk",
  "cardinaliteAmdtMultiples": "1",
  "amendementParent": {
    "@xmlns:xsi": "http://www.w3.org/2001/XMLSchema-instance",
    "@xsi:nil": "true"
  },
  "etat": "Discuté",
  "signataires": {
    "auteur": {
      "typeAuteur": "Depute",
      "acteurRef": "PA720230",
      "organeRef": {
        "@xmlns:xsi": "http://www.w3.org/2001/XMLSchema-instance",
        "@xsi:nil": "true"
      },
      "groupePolitiqueRef": "PO744425"
    },
    "cosignataires": {
      "acteurRef": [
        "PA942",
        "PA331582",
        "PA712014",
        "PA720230"
      ]
    },
    "texteAffichable": "Mme&#160;Magnier,  M.&#160;Charles&#160;de Courson, M.&#160;Ledoux et M.&#160;Philippe&#160;Vigier"
  },
  "pointeurFragmentTexte": {
    "missionVisee": {
      "@xmlns:xsi": "http://www.w3.org/2001/XMLSchema-instance",
      "@xsi:nil": "true"
    },
    "division": {
      "titre": "Article 29",
      "articleDesignationCourte": "ART. 29",
      "type": "ARTICLE",
      "avant_A_Apres": "A",
      "divisionRattachee": "ARTICLE 29",
      "articleAdditionnel": {
        "@xmlns:xsi": "http://www.w3.org/2001/XMLSchema-instance",
        "@xsi:nil": "true"
      },
      "chapitreAdditionnel": {
        "@xmlns:xsi": "http://www.w3.org/2001/XMLSchema-instance",
        "@xsi:nil": "true"
      },
      "urlDivisionTexteVise": "/15/textes/1255A.asp#D_Article_29"
    },
    "alinea": {
      "avant_A_Apres": {
        "@xmlns:xsi": "http://www.w3.org/2001/XMLSchema-instance",
        "@xsi:nil": "true"
      },
      "numero": "26",
      "alineaDesignation": {
        "@xmlns:xsi": "http://www.w3.org/2001/XMLSchema-instance",
        "@xsi:nil": "true"
      }
    }
  },
  "corps": {
    "dispositif": "<p style=\"text-align: justify;\">I.&#160;&#8211;&#160;&#192; la fin de l&#8217;alin&#233;a&#160;26, substituer au nombre&#160;:</p><p style=\"text-align: justify;\">&#171;&#160;349&#160;000&#160;&#187;</p><p style=\"text-align: justify;\">le nombre&#160;:</p><p style=\"text-align: justify;\">&#171;&#160;449&#160;000&#160;&#187;.</p><p style=\"text-align: justify;\">II.&#160;&#8211;&#160;&#192; la fin de l&#8217;alin&#233;a&#160;68, substituer au montant&#160;:</p><p style=\"text-align: justify;\">&#171;&#160;449 millions d&#8217;euros&#160;&#187; </p><p style=\"text-align: justify;\">le montant&#160;:</p><p style=\"text-align: justify;\">&#171;&#160;549 millions d&#8217;euros&#160;&#187;.</p><p style=\"text-align: justify;\">III.&#160;&#8211;&#160;Compl&#233;ter cet article par l&#8217;alin&#233;a suivant&#160;:</p><p style=\"text-align: justify;\">&#171;&#160;La perte &#233;ventuelle de recettes pour l&#8217;&#201;tat est compens&#233;e &#224; due concurrence par la cr&#233;ation d&#8217;une taxe additionnelle aux droits vis&#233;s aux articles 575 et 575 A du code g&#233;n&#233;ral des imp&#244;ts.&#160;&#187;</p>",
    "exposeSommaire": "<p style=\"text-align: justify;\">Le projet de loi de Finances pour 2019 pr&#233;voit &#224; son article&#160;29 (alin&#233;as 26 et 68) une baisse de taxe affect&#233;e aux CCI de 100 millions d&#8217;euros en 2019 et de 200 millions d&#8217;euros &#224; partir de 2020.</p><p style=\"text-align: justify;\">Contraires aux engagements gouvernementaux pris devant l&#8217;Assembl&#233;e nationale et le S&#233;nat l&#8217;an dernier &#224; l&#8217;occasion de l&#8217;examen de loi de finances pour 2018 (qui avait d&#233;j&#224; amput&#233; le budget des CCI de 150 millions d&#8217;euros), ces 2 nouvelles baisses aggraveront encore la situation financi&#232;re du r&#233;seau des CCI et conduiront in&#233;vitablement &#224; un affaiblissement de l&#8217;accompagnement de proximit&#233; de nos entreprises et de nos territoires.</p><p style=\"text-align: justify;\">Par ailleurs, ces deux nouvelles baisses sont en contradiction avec les objectifs de la future Loi PACTE qui vise &#224; faire grandir les entreprises et &#224; plus de performance dans leur accompagnement. Or, cet article&#160;29 revient &#224; priver les TPE/PME de l&#8217;effet redistributif de la taxe affect&#233;e. Actuellement, la taxe pay&#233;e par les grandes entreprises permet d&#8217;offrir des services aux plus petites, pour les emmener sur le chemin des &#171;&#160;premiers de cord&#233;e&#160;&#187;.</p><p style=\"text-align: justify;\">C&#8217;est pourquoi cet amendement pr&#233;voit de diminuer par deux la baisse de la taxe affect&#233;e aux CCI et d&#8217;augmenter le plafond du produit de cette taxe &#224; 549 000 en 2019.</p>",
    "annexeExposeSommaire": {
      "@xmlns:xsi": "http://www.w3.org/2001/XMLSchema-instance",
      "@xsi:nil": "true"
    }
  },
  "representations": {
    "representation": {
      "nom": "PDF",
      "typeMime": {
        "type": "application",
        "subType": "PDF"
      },
      "statutRepresentation": {
        "verbatim": "true",
        "canonique": "true",
        "officielle": "true",
        "transcription": "false",
        "enregistrement": "false"
      },
      "repSource": {
        "@xmlns:xsi": "http://www.w3.org/2001/XMLSchema-instance",
        "@xsi:nil": "true"
      },
      "offset": {
        "@xmlns:xsi": "http://www.w3.org/2001/XMLSchema-instance",
        "@xsi:nil": "true"
      },
      "contenu": {
        "documentURI": "/15/amendements/1255A/CION_FIN/CF149.pdf"
      },
      "dateDispoRepresentation": {
        "@xmlns:xsi": "http://www.w3.org/2001/XMLSchema-instance",
        "@xsi:nil": "true"
      }
    }
  },
  "seanceDiscussion": {
    "@xmlns:xsi": "http://www.w3.org/2001/XMLSchema-instance",
    "@xsi:nil": "true"
  },
  "sort": {
    "dateSaisie": "2018-10-11T12:37:25.000+02:00",
    "sortEnSeance": "Rejeté"
  },
  "dateDepot": "2018-10-03T02:00:00.000+02:00",
  "dateDistribution": "2018-10-09T02:00:00.000+02:00",
  "article99": "0",
  "loiReference": {
    "codeLoi": "R 26 &amp; 68",
    "divisionCodeLoi": {
      "@xmlns:xsi": "http://www.w3.org/2001/XMLSchema-instance",
      "@xsi:nil": "true"
    }
  }
}