{
  "@xmlns": "http://schemas.assemblee-nationale.fr/referentiel",
  "uid": "AMANR5L15SEA717460BTC1237P0D1N1672",
  "identifiant": {
    "legislature": "15",
    "numero": "1672",
    "numRect": "0",
    "saisine": {
      "refTexteLegislatif": "PRJLANR5L15BTC1237",
      "numeroPartiePLF": "0",
      "organeExamen": "PO717460",
      "mentionSecondeDeliberation": "0"
    }
  },
  "numeroLong": "1672",
  "etapeTexte": "1ère lecture (1ère assemblée saisie)",
  "triAmendement": "bpaaaaaaaaaaaaaaaaaaaaaaaaaaaaaaaaaaaaaaaaaaaaaaaahef",
  "cardinaliteAmdtMultiples": "1",
  "amendementParent": {
    "@xmlns:xsi": "http://www.w3.org/2001/XMLSchema-instance",
    "@xsi:nil": "true"
  },
  "etat": "Discuté",
  "signataires": {
    "auteur": {
      "typeAuteur": "Depute",
      "acteurRef": "PA718926",
      "organeRef": {
        "@xmlns:xsi": "http://www.w3.org/2001/XMLSchema-instance",
        "@xsi:nil": "true"
      },
      "groupePolitiqueRef": "PO730940"
    },
    "cosignataires": {
      "acteurRef": [
        "PA267306",
        "PA722202",
        "PA441",
        "PA689",
        "PA721118",
        "PA718926",
        "PA721270",
        "PA722110",
        "PA720692",
        "PA720546",
        "PA721896",
        "PA610654",
        "PA721012",
        "PA718720",
        "PA335612",
        "PA610667"
      ]
    },
    "texteAffichable": "M.&#160;Dharr&#233;ville,  M.&#160;Jumel, M.&#160;Peu, Mme&#160;Bello, M.&#160;Brotherson, M.&#160;Bruneel, Mme&#160;Buffet, M.&#160;Chassaigne, M.&#160;Dufr&#232;gne, Mme&#160;Faucillon, Mme&#160;K&#233;clard-Mond&#233;sir, M.&#160;Lecoq, M.&#160;Nilor, M.&#160;Fabien&#160;Roussel, M.&#160;Serville et M.&#160;Wulfranc"
  },
  "pointeurFragmentTexte": {
    "missionVisee": {
      "@xmlns:xsi": "http://www.w3.org/2001/XMLSchema-instance",
      "@xsi:nil": "true"
    },
    "division": {
      "titre": "Article 19 ter",
      "articleDesignationCourte": "APRÈS ART. 19 TER",
      "type": "ARTICLE",
      "avant_A_Apres": "Après",
      "divisionRattachee": "APRÈS L'ARTICLE 19 TER, insérer l'article suivant:",
      "articleAdditionnel": "1",
      "chapitreAdditionnel": {
        "@xmlns:xsi": "http://www.w3.org/2001/XMLSchema-instance",
        "@xsi:nil": "true"
      },
      "urlDivisionTexteVise": "/15/textes/1237.asp#D_Article_19_ter"
    },
    "alinea": {
      "@xmlns:xsi": "http://www.w3.org/2001/XMLSchema-instance",
      "@xsi:nil": "true"
    }
  },
  "corps": {
    "dispositif": "<p style=\"text-align: justify;\">L&#8217;article L.&#160;2332&#8209;1 du code du travail est compl&#233;t&#233; par six alin&#233;as ainsi r&#233;dig&#233;s&#160;:</p><p style=\"text-align: justify;\">&#171;&#160;Lorsque des entreprises sous-traitantes sont int&#233;gr&#233;es dans le comit&#233; de groupe, celui-ci est inform&#233; lors de chacune de ses r&#233;unions&#160;:</p><p style=\"text-align: justify;\">&#171;&#160;&#8211;&#160;de la r&#233;alisation des contrats en cours et ceux &#224; venir, notamment de leur contenu pr&#233;cis et de leur dur&#233;e&#160;;</p><p style=\"text-align: justify;\">&#171;&#160;&#8211;&#160;des projections d&#8217;activit&#233;&#160;;</p><p style=\"text-align: justify;\">&#171;&#160;&#8211;&#160;des effectifs au travers d&#8217;une analyse quantitative et qualitative par m&#233;tier&#160;;</p><p style=\"text-align: justify;\">&#171;&#160;&#8211;&#160;des besoins en qualifications et comp&#233;tences, ainsi que des plans de formation ou de recrutement envisag&#233;s&#160;;</p><p style=\"text-align: justify;\">&#171;&#160;&#8211;&#160;des &#233;volutions technologiques aux fins d&#8217;anticipation de la transformation des proc&#233;d&#233;s et processus de production.&#160;&#187;</p>",
    "exposeSommaire": "<p style=\"text-align: justify;\">Cet amendement, issu des propositions faites par les salari&#233;s de l&#8217;entreprise de GM&amp;amp;S, pr&#233;voit les modalit&#233;s d&#8217;int&#233;gration des entreprises sous-traitantes dans le comit&#233; de groupe et fixe les informations que l'employeur donneur d'ordre doit leur d&#233;livrer.</p>",
    "annexeExposeSommaire": {
      "@xmlns:xsi": "http://www.w3.org/2001/XMLSchema-instance",
      "@xsi:nil": "true"
    }
  },
  "representations": {
    "representation": {
      "nom": "PDF",
      "typeMime": {
        "type": "application",
        "subType": "PDF"
      },
      "statutRepresentation": {
        "verbatim": "true",
        "canonique": "true",
        "officielle": "true",
        "transcription": "false",
        "enregistrement": "false"
      },
      "repSource": {
        "@xmlns:xsi": "http://www.w3.org/2001/XMLSchema-instance",
        "@xsi:nil": "true"
      },
      "offset": {
        "@xmlns:xsi": "http://www.w3.org/2001/XMLSchema-instance",
        "@xsi:nil": "true"
      },
      "contenu": {
        "documentURI": "/15/amendements/1237/AN/1672.pdf"
      },
      "dateDispoRepresentation": {
        "@xmlns:xsi": "http://www.w3.org/2001/XMLSchema-instance",
        "@xsi:nil": "true"
      }
    }
  },
  "seanceDiscussion": "RUANR5L15S2018IDS21254",
  "sort": {
    "dateSaisie": "2018-09-28T15:55:50.000+02:00",
    "sortEnSeance": "Rejeté"
  },
  "dateDepot": "2018-09-21T02:00:00.000+02:00",
  "dateDistribution": "2018-09-24T02:00:00.000+02:00",
  "article99": "0",
  "loiReference": {
    "codeLoi": "c travail",
    "divisionCodeLoi": "L2332-1"
  }
}