{
  "@xmlns": "http://schemas.assemblee-nationale.fr/referentiel",
  "uid": "AMANR5L15SEA717460BTC1019P0D1N1556",
  "identifiant": {
    "legislature": "15",
    "numero": "1556",
    "numRect": "0",
    "saisine": {
      "refTexteLegislatif": "PRJLANR5L15BTC1019",
      "numeroPartiePLF": "0",
      "organeExamen": "PO717460",
      "mentionSecondeDeliberation": "0"
    }
  },
  "numeroLong": "1556",
  "etapeTexte": "1ère lecture (1ère assemblée saisie)",
  "triAmendement": "mu",
  "cardinaliteAmdtMultiples": "1",
  "amendementParent": {
    "@xmlns:xsi": "http://www.w3.org/2001/XMLSchema-instance",
    "@xsi:nil": "true"
  },
  "etat": "Discuté",
  "signataires": {
    "auteur": {
      "typeAuteur": "Depute",
      "acteurRef": "PA720870",
      "organeRef": {
        "@xmlns:xsi": "http://www.w3.org/2001/XMLSchema-instance",
        "@xsi:nil": "true"
      },
      "groupePolitiqueRef": "PO730964"
    },
    "cosignataires": {
      "acteurRef": "PA720870"
    },
    "texteAffichable": "M.&#160;Mbaye"
  },
  "pointeurFragmentTexte": {
    "missionVisee": {
      "@xmlns:xsi": "http://www.w3.org/2001/XMLSchema-instance",
      "@xsi:nil": "true"
    },
    "division": {
      "titre": "Article 7",
      "articleDesignationCourte": "ART. 7",
      "type": "ARTICLE",
      "avant_A_Apres": "A",
      "divisionRattachee": "ARTICLE 7",
      "articleAdditionnel": {
        "@xmlns:xsi": "http://www.w3.org/2001/XMLSchema-instance",
        "@xsi:nil": "true"
      },
      "chapitreAdditionnel": {
        "@xmlns:xsi": "http://www.w3.org/2001/XMLSchema-instance",
        "@xsi:nil": "true"
      },
      "urlDivisionTexteVise": "/15/textes/1019.asp#D_Article_7"
    },
    "alinea": {
      "avant_A_Apres": {
        "@xmlns:xsi": "http://www.w3.org/2001/XMLSchema-instance",
        "@xsi:nil": "true"
      },
      "numero": "11",
      "alineaDesignation": {
        "@xmlns:xsi": "http://www.w3.org/2001/XMLSchema-instance",
        "@xsi:nil": "true"
      }
    }
  },
  "corps": {
    "dispositif": "<p style=\"text-align: justify;\">I.&#160;&#8211;&#160;Apr&#232;s le mot </p><p style=\"text-align: justify;\">&#171;&#160;peuvent&#160;&#187;,</p><p style=\"text-align: justify;\">r&#233;diger ainsi la fin de la seconde phrase de l&#8217;alin&#233;a&#160;11&#160;:</p><p style=\"text-align: justify;\">&#171;&#160;coop&#233;rer avec les op&#233;rateurs de comp&#233;tences dans le cadre de la mission d&#233;finie au m&#234;me article&#160;L.&#160;6224&#8209;1&#160;;&#160;&#187;.</p><p style=\"text-align: justify;\">II.&#160;&#8211;&#160;En cons&#233;quence, &#224; l&#8217;alin&#233;a&#160;20, apr&#232;s le mot&#160;:</p><p style=\"text-align: justify;\">&#171;&#160;comp&#233;tences&#160;&#187;,</p><p style=\"text-align: justify;\">ins&#233;rer les mots&#160;:</p><p style=\"text-align: justify;\">&#171;&#160;et d&#8217;une chambre consulaire&#160;&#187;.</p>",
    "exposeSommaire": "<p style=\"text-align: justify;\">Le pr&#233;sent amendement vise &#224; modifier la r&#233;daction des alin&#233;as 11 et 20 de l&#8217;article&#160;7, et a pour objectif d&#8217;associer l&#8217;expertise des chambres consulaires aux missions d&#233;volues aux op&#233;rateurs de comp&#233;tences lorsque celles-ci concernent l&#8217;examen des contrats d&#8217;apprentissage.</p><p style=\"text-align: justify;\">En effet, le pr&#233;sent projet de loi pr&#233;voit la suppression de la proc&#233;dure d&#8217;enregistrement, par les chambres consulaires, des contrats d&#8217;apprentissage au profit d&#8217;une simple proc&#233;dure de d&#233;p&#244;t aupr&#232;s des op&#233;rateurs de comp&#233;tence, &#224; l&#8217;instar de ce qui se pratique d&#233;j&#224; en mati&#232;re de contrat de professionnalisation. Il s&#8217;agit d&#8217;un des points du texte visant &#224; all&#233;ger les proc&#233;dures, et ainsi inciter les entreprises &#224; avoir davantage recours &#224; ce type de contrat.</p><p style=\"text-align: justify;\">La proc&#233;dure d&#8217;enregistrement pr&#233;vu par le droit positif permet aux chambres consulaires de refuser les contrats comportant des erreurs. En effet, les contrats d&#8217;apprentissage sont souvent &#233;tablis entre des jeunes de moins de 18 ans&#160;&#8211;&#160;51,2&#160;% des nouvelles entr&#233;es en apprentissage&#160;&#8211;&#160;et des entreprises de taille modeste&#160;&#8211;&#160;70&#160;% des entreprises ayant recours &#224; des apprentis disposent de moins de 50 salari&#233;s. Le seul r&#233;seau des chambres de commerce rel&#232;ve que pr&#232;s de 40&#160;% des contrats lui &#233;tant soumis pour enregistrement comportent des erreurs, potentiellement sources de contentieux.</p><p style=\"text-align: justify;\">Les chambres consulaires, charg&#233;es de l&#8217;enregistrement des contrats d&#8217;apprentissage en droit positif, disposent, de fait, d&#8217;une exp&#233;rience certaine en mati&#232;re d&#8217;examen de ces contrats. A ce titre, il appara&#238;t opportun de les associer &#224; cette nouvelle proc&#233;dure de constitue le d&#233;p&#244;t des contrats d&#8217;apprentissage.</p><p style=\"text-align: justify;\">Pour ce faire, le pr&#233;sent amendement propose, d&#8217;une part, de modifier la r&#233;daction de l&#8217;alin&#233;a&#160;11. En effet, celle-ci pr&#233;voit que les chambres consulaires peuvent &#171;&#160;&#234;tre charg&#233;es par les op&#233;rateurs de comp&#233;tences de participer&#160;&#187; &#224; la mission de d&#233;p&#244;t des contrats d&#8217;apprentissage. Cette r&#233;daction implique que les op&#233;rateurs de comp&#233;tences doivent activement d&#233;l&#233;guer cette mission &#224; une chambre consulaire afin qu&#8217;elle en soit charg&#233;e.</p><p style=\"text-align: justify;\">La r&#233;daction propos&#233;e par cet amendement vise &#224; permettre une coop&#233;ration ponctuelle entre les chambres consulaires et les op&#233;rateurs de comp&#233;tences, afin celles-ci puissent contribuer, de leur propre initiative, &#224; la mission de d&#233;p&#244;t des contrats d&#8217;apprentissage.</p><p style=\"text-align: justify;\">D&#8217;autre part, et afin de compl&#233;ter la premi&#232;re modification propos&#233;e, cet amendement sugg&#232;re l&#8217;adoption d&#8217;un d&#233;p&#244;t simple aupr&#232;s des chambres consulaires, en parall&#232;le de celui s&#8217;effectuant aupr&#232;s des op&#233;rateurs de comp&#233;tences. Ce d&#233;p&#244;t permettrait aux chambres consulaires de prendre connaissance du contenu des contrats d&#8217;apprentissage, et ainsi effectuer, le cas &#233;ch&#233;ant, leur mission de coop&#233;ration/conseil aupr&#232;s des op&#233;rateurs de comp&#233;tences.</p><p style=\"text-align: justify;\">La combinaison de ces deux modifications permettrait aux chambres consulaires de faire b&#233;n&#233;ficier les op&#233;rateurs de comp&#233;tences de leur expertise, sans faire obstacle &#224; la fluidit&#233; recherch&#233;e par le texte.</p><p style=\"text-align: justify;\"><br />&#160;</p><p style=\"text-align: justify;\">&#160;</p>",
    "annexeExposeSommaire": {
      "@xmlns:xsi": "http://www.w3.org/2001/XMLSchema-instance",
      "@xsi:nil": "true"
    }
  },
  "representations": {
    "representation": {
      "nom": "PDF",
      "typeMime": {
        "type": "application",
        "subType": "PDF"
      },
      "statutRepresentation": {
        "verbatim": "true",
        "canonique": "true",
        "officielle": "true",
        "transcription": "false",
        "enregistrement": "false"
      },
      "repSource": {
        "@xmlns:xsi": "http://www.w3.org/2001/XMLSchema-instance",
        "@xsi:nil": "true"
      },
      "offset": {
        "@xmlns:xsi": "http://www.w3.org/2001/XMLSchema-instance",
        "@xsi:nil": "true"
      },
      "contenu": {
        "documentURI": "/15/amendements/1019/AN/1556.pdf"
      },
      "dateDispoRepresentation": {
        "@xmlns:xsi": "http://www.w3.org/2001/XMLSchema-instance",
        "@xsi:nil": "true"
      }
    }
  },
  "seanceDiscussion": "RUANR5L15S2018IDS21102",
  "sort": {
    "dateSaisie": "2018-06-14T16:08:10.000+02:00",
    "sortEnSeance": "Rejeté"
  },
  "dateDepot": "2018-06-07T02:00:00.000+02:00",
  "dateDistribution": "2018-06-11T02:00:00.000+02:00",
  "article99": "0",
  "loiReference": {
    "codeLoi": {
      "@xmlns:xsi": "http://www.w3.org/2001/XMLSchema-instance",
      "@xsi:nil": "true"
    },
    "divisionCodeLoi": {
      "@xmlns:xsi": "http://www.w3.org/2001/XMLSchema-instance",
      "@xsi:nil": "true"
    }
  }
}