{
  "@xmlns": "http://schemas.assemblee-nationale.fr/referentiel",
  "uid": "AMANR5L15PO59048B1255P2D1N671",
  "identifiant": {
    "legislature": "15",
    "numero": "671",
    "numRect": "0",
    "saisine": {
      "refTexteLegislatif": "PRJLANR5L15B1255",
      "numeroPartiePLF": "2",
      "organeExamen": "PO59048",
      "mentionSecondeDeliberation": "0"
    }
  },
  "numeroLong": "II-CF671",
  "etapeTexte": "1ère lecture (1ère assemblée saisie)",
  "triAmendement": "aoiaaaaaaaaaaaaaaaaaaaaaaaaaaaaaaaaaaaaaaaaaaaaaaabbo",
  "cardinaliteAmdtMultiples": "1",
  "amendementParent": {
    "@xmlns:xsi": "http://www.w3.org/2001/XMLSchema-instance",
    "@xsi:nil": "true"
  },
  "etat": "Discuté",
  "signataires": {
    "auteur": {
      "typeAuteur": "Depute",
      "acteurRef": "PA405480",
      "organeRef": {
        "@xmlns:xsi": "http://www.w3.org/2001/XMLSchema-instance",
        "@xsi:nil": "true"
      },
      "groupePolitiqueRef": "PO759900"
    },
    "cosignataires": {
      "acteurRef": [
        "PA605694",
        "PA405480",
        "PA720996",
        "PA608292",
        "PA719146",
        "PA719138",
        "PA336175",
        "PA719286"
      ]
    },
    "texteAffichable": "M.&#160;Pupponi,  M.&#160;Castellani, M.&#160;Acquaviva, Mme&#160;Pinel, M.&#160;Colombani, Mme&#160;Dubi&#233;, M.&#160;El Guerrab et M.&#160;Falorni"
  },
  "pointeurFragmentTexte": {
    "missionVisee": {
      "idMissionAN": "396",
      "libelleMission": "Cohésion des territoires",
      "codeMissionPLF": "B",
      "libelleMissionPLF": "Répartition, par mission et programme, des crédits du budget général"
    },
    "division": {
      "titre": "Article 74",
      "articleDesignationCourte": "APRÈS ART. 74",
      "type": "ARTICLE",
      "avant_A_Apres": "Après",
      "divisionRattachee": "APRÈS L'ARTICLE 74, insérer l'article suivant:",
      "articleAdditionnel": "1",
      "chapitreAdditionnel": {
        "@xmlns:xsi": "http://www.w3.org/2001/XMLSchema-instance",
        "@xsi:nil": "true"
      },
      "urlDivisionTexteVise": "/15/textes/1255C.asp#D_Article_74"
    },
    "alinea": {
      "@xmlns:xsi": "http://www.w3.org/2001/XMLSchema-instance",
      "@xsi:nil": "true"
    }
  },
  "corps": {
    "dispositif": "<p style=\"text-align: justify;\">L&#8217;article L.&#160;351&#8209;3 du code de la construction et de l&#8217;habitation est compl&#233;t&#233; par un alin&#233;a ainsi r&#233;dig&#233;&#160;:</p><p style=\"text-align: justify;\">&#171;&#160;Le montant de l&#8217;aide personnalis&#233;e au logement est fix&#233; de mani&#232;re &#224; ce que le reste &#224; charge de loyer acquitt&#233; par le locataire ne puisse &#234;tre inf&#233;rieur &#224; 10&#160;% du montant total du loyer de son logement.&#160;&#187;</p>",
    "exposeSommaire": "<p style=\"text-align: justify;\">Le pr&#233;sent amendement propose des mesures alternatives afin d&#8217;une part, de mettre en place une r&#233;forme des APL et d&#8217;autre part, de r&#233;duire les d&#233;penses de l&#8217;&#201;tat en mati&#232;re de politique du logement.</p><p style=\"text-align: justify;\">Aujourd&#8217;hui, du fait du forfait pour charges et du mode de calcul des APL, pr&#232;s de 30&#160;% des b&#233;n&#233;ficiaires se retrouvent avec un reste &#224; charge de loyer nul ou quasi nul. Cette situation se retrouve essentiellement dans certaines zones d&#233;tendues o&#249; le niveau des loyers demeure comparativement assez faible. Il appara&#238;t injuste qu&#8217;il puisse exister sur le territoire national de forts &#233;carts de reste &#224; charge de loyers &#224; situations et revenus &#233;gaux. Il n&#8217;est pas non plus souhaitable qu&#8217;alors que certains m&#233;nages peinent &#224; assumer leurs loyers, des m&#233;nages &#224; situation identique b&#233;n&#233;ficient d&#8217;une gratuit&#233; de fait.</p><p style=\"text-align: justify;\">Le pr&#233;sent amendement propose donc de substituer &#224; la r&#233;forme propos&#233;e par le gouvernement et qui aura un impact tr&#232;s n&#233;gatif sur le cadre de vie des locataires, les capacit&#233;s financi&#232;res des bailleurs sociaux et l&#8217;activit&#233; &#233;conomique, un dispositif de reste &#224; charge de loyer dans le parc social.</p><p style=\"text-align: justify;\">Il propose que ce reste &#224; charge de loyer soit fix&#233; &#224; 10&#160;% du montant total de loyer.</p>",
    "annexeExposeSommaire": {
      "@xmlns:xsi": "http://www.w3.org/2001/XMLSchema-instance",
      "@xsi:nil": "true"
    }
  },
  "representations": {
    "representation": {
      "nom": "PDF",
      "typeMime": {
        "type": "application",
        "subType": "PDF"
      },
      "statutRepresentation": {
        "verbatim": "true",
        "canonique": "true",
        "officielle": "true",
        "transcription": "false",
        "enregistrement": "false"
      },
      "repSource": {
        "@xmlns:xsi": "http://www.w3.org/2001/XMLSchema-instance",
        "@xsi:nil": "true"
      },
      "offset": {
        "@xmlns:xsi": "http://www.w3.org/2001/XMLSchema-instance",
        "@xsi:nil": "true"
      },
      "contenu": {
        "documentURI": "/15/amendements/1255C/CION_FIN/CF671.pdf"
      },
      "dateDispoRepresentation": {
        "@xmlns:xsi": "http://www.w3.org/2001/XMLSchema-instance",
        "@xsi:nil": "true"
      }
    }
  },
  "seanceDiscussion": {
    "@xmlns:xsi": "http://www.w3.org/2001/XMLSchema-instance",
    "@xsi:nil": "true"
  },
  "sort": {
    "dateSaisie": "2018-10-30T19:19:29.000+01:00",
    "sortEnSeance": "Rejeté"
  },
  "dateDepot": "2018-10-25T02:00:00.000+02:00",
  "dateDistribution": "2018-10-29T01:00:00.000+01:00",
  "article99": "0",
  "loiReference": {
    "codeLoi": "construction et habitation",
    "divisionCodeLoi": "L 351-3"
  }
}