{
  "@xmlns": "http://schemas.assemblee-nationale.fr/referentiel",
  "uid": "AMANR5L15PO420120B1561P0D1N21",
  "identifiant": {
    "legislature": "15",
    "numero": "21",
    "numRect": "0",
    "saisine": {
      "refTexteLegislatif": "PIONANR5L15B1561",
      "numeroPartiePLF": "0",
      "organeExamen": "PO420120",
      "mentionSecondeDeliberation": "0"
    }
  },
  "numeroLong": "AS21",
  "etapeTexte": "1ère lecture (1ère assemblée saisie)",
  "triAmendement": "oaaaaaaaaaaaaaaaaaaaaaaaaaaaaaaaaaaaaaaaaaaaaaaaaacu",
  "cardinaliteAmdtMultiples": "1",
  "amendementParent": {
    "@xmlns:xsi": "http://www.w3.org/2001/XMLSchema-instance",
    "@xsi:nil": "true"
  },
  "etat": "Discuté",
  "signataires": {
    "auteur": {
      "typeAuteur": "Depute",
      "acteurRef": "PA610681",
      "organeRef": {
        "@xmlns:xsi": "http://www.w3.org/2001/XMLSchema-instance",
        "@xsi:nil": "true"
      },
      "groupePolitiqueRef": "PO758835"
    },
    "cosignataires": {
      "acteurRef": [
        "PA1592",
        "PA605069",
        "PA1809",
        "PA720988",
        "PA609590",
        "PA719930",
        "PA610681",
        "PA608011",
        "PA608741",
        "PA332614",
        "PA608172",
        "PA342415",
        "PA642764",
        "PA333818",
        "PA333285",
        "PA1008",
        "PA340357",
        "PA340343",
        "PA335054",
        "PA337483",
        "PA607553",
        "PA508",
        "PA643145",
        "PA1198",
        "PA335532",
        "PA608695",
        "PA429893",
        "PA609332",
        "PA267233"
      ]
    },
    "texteAffichable": "Mme&#160;Bareigts,  M.&#160;Aviragnet, Mme&#160;Bi&#233;mouret, M.&#160;Vallaud, Mme&#160;Battistel, M.&#160;Bouillon, M.&#160;Jean-Louis&#160;Bricout, M.&#160;Carvounas, M.&#160;Alain&#160;David, Mme&#160;Laurence&#160;Dumont, M.&#160;Faure, M.&#160;Garot, M.&#160;David&#160;Habib, M.&#160;Hutin, M.&#160;Juanico, Mme&#160;Karamanli, M.&#160;J&#233;r&#244;me&#160;Lambert, M.&#160;Letchimy, Mme&#160;Manin, Mme&#160;Pau-Langevin, Mme&#160;Pires Beaune, M.&#160;Potier, M.&#160;Pueyo, Mme&#160;Rabault, M.&#160;Saulignac, Mme&#160;Tolmont, Mme&#160;Untermaier, Mme&#160;Vainqueur-Christophe et Mme&#160;Victory"
  },
  "pointeurFragmentTexte": {
    "missionVisee": {
      "@xmlns:xsi": "http://www.w3.org/2001/XMLSchema-instance",
      "@xsi:nil": "true"
    },
    "division": {
      "titre": "Article 4",
      "articleDesignationCourte": "APRÈS ART. 4",
      "type": "ARTICLE",
      "avant_A_Apres": "Après",
      "divisionRattachee": "APRÈS L'ARTICLE 4, insérer l'article suivant:",
      "articleAdditionnel": "1",
      "chapitreAdditionnel": {
        "@xmlns:xsi": "http://www.w3.org/2001/XMLSchema-instance",
        "@xsi:nil": "true"
      },
      "urlDivisionTexteVise": "/15/textes/1561.asp#D_Article_4"
    },
    "alinea": {
      "@xmlns:xsi": "http://www.w3.org/2001/XMLSchema-instance",
      "@xsi:nil": "true"
    }
  },
  "corps": {
    "dispositif": "<p>&#192; la troisi&#232;me phrase du&#160;deuxi&#232;me alin&#233;a de l&#8217;article L.&#160;2325&#8209;1 du code de la sant&#233; publique, apr&#232;s le mot&#160;:&#160;&#171;&#160;cours&#160;&#187;, sont ins&#233;r&#233;s les mots&#160;:&#160;&#171;&#160;de la troisi&#232;me ann&#233;e,&#160;&#187;.</p>",
    "exposeSommaire": "<p>L'article 2325-1 du code de la sant&#233; publique modifi&#233; par la loi n&#176;2007-293 du 5 mars 2007 pr&#233;voit que \"tous les enfants sont obligatoirement soumis &#224; une visite m&#233;dicale au cours de laquelle un bilan de leur &#233;tat de sant&#233; physique et psychologique est r&#233;alis&#233;\" &#224; diff&#233;rents &#226;ges &#224; partir de 6 ans.</p><p>Le rapport d'information n&#176;1234 intitul&#233; \"B&#226;tir une politique de pr&#233;vention sant&#233; en faveur de la jeunesse\" pr&#233;sent&#233; en septembre dernier pr&#233;conise un suivi individuel et d&#233;finit des rendes-vous m&#233;dicaux obligatoires (8e jour, 9 mois, 3 ans, 6 ans,...) comprenant des visites m&#233;dicales notamment durant le parcours scolaire de chaque &#233;l&#232;ve.&#160;</p><p>L'ob&#233;sit&#233; grandissante dans notre soci&#233;t&#233; concerne &#233;galement de plus en plus les enfants et de plus en plus jeunes. Cet amendement vise &#224; pr&#233;voir une visite obligatoire de sant&#233; pour les enfants au cours de leur troisi&#232;me ann&#233;e afin de lutter&#160;contre l'ob&#233;sit&#233; pr&#233;coce et r&#233;duire de mani&#232;re significative les risques potentiels de chaque enfant.&#160;</p>",
    "annexeExposeSommaire": {
      "@xmlns:xsi": "http://www.w3.org/2001/XMLSchema-instance",
      "@xsi:nil": "true"
    },
    "cartoucheDelaiDepotDepasse": {
      "@xmlns:xsi": "http://www.w3.org/2001/XMLSchema-instance",
      "@xsi:nil": "true"
    }
  },
  "representations": {
    "representation": {
      "nom": "PDF",
      "typeMime": {
        "type": "application",
        "subType": "PDF"
      },
      "statutRepresentation": {
        "verbatim": "true",
        "canonique": "true",
        "officielle": "true",
        "transcription": "false",
        "enregistrement": "false"
      },
      "repSource": {
        "@xmlns:xsi": "http://www.w3.org/2001/XMLSchema-instance",
        "@xsi:nil": "true"
      },
      "offset": {
        "@xmlns:xsi": "http://www.w3.org/2001/XMLSchema-instance",
        "@xsi:nil": "true"
      },
      "contenu": {
        "documentURI": "/15/amendements/1561/CION-SOC/AS21.pdf"
      },
      "dateDispoRepresentation": {
        "@xmlns:xsi": "http://www.w3.org/2001/XMLSchema-instance",
        "@xsi:nil": "true"
      }
    }
  },
  "seanceDiscussion": {
    "@xmlns:xsi": "http://www.w3.org/2001/XMLSchema-instance",
    "@xsi:nil": "true"
  },
  "sort": {
    "dateSaisie": "2019-02-13T11:24:04.000+01:00",
    "sortEnSeance": "Retiré"
  },
  "dateDepot": "2019-02-09T01:00:00.000+01:00",
  "dateDistribution": "2019-02-12T01:00:00.000+01:00",
  "article99": "0",
  "loiReference": {
    "codeLoi": "santé publique",
    "divisionCodeLoi": "L2325-1"
  }
}