{
  "xsiType": "reunionInitParlementaire_type",
  "uid": "RUANR5L15S2020IDF0143814",
  "timestampDebut": "2019-11-26T14:30:00.000+01:00",
  "timestampFin": "2019-11-26T15:30:00.000+01:00",
  "lieu": {
    "code": "SALREU023",
    "libelleCourt": "Salle 7426",
    "libelleLong": "Salle 7426, 101, rue de l'Université"
  },
  "cycleDeVie": {
    "etat": "Confirmé",
    "chrono": {
      "creation": "2019-11-18T10:20:46.000+01:00"
    }
  },
  "demandeurs": {
    "acteurs": [
      {
        "nom": "M. Christophe BOUILLON",
        "acteurRef": "PA267233"
      }
    ]
  },
  "typeReunion": "DEP"
}