{
  "xsiType": "reunionInitParlementaire_type",
  "uid": "RUANR5L15S2017IDF0096854",
  "timestampDebut": "2017-09-25T14:30:00.000+02:00",
  "timestampFin": "2017-09-25T15:30:00.000+02:00",
  "lieu": {
    "code": "SALREU028",
    "libelleCourt": "Salle Colbert",
    "libelleLong": "Salle Colbert , Palais Bourbon"
  },
  "cycleDeVie": {
    "etat": "Confirmé",
    "chrono": {
      "creation": "2017-09-22T14:31:48.000+02:00"
    }
  },
  "demandeurs": {
    "organe": {
      "nom": "GROUPE LA RÉPUBLIQUE EN MARCHE",
      "organeRef": "PO730964"
    }
  },
  "organeReuniRef": "PO730964",
  "typeReunion": "GP"
}