{
  "xsiType": "reunionInitParlementaire_type",
  "uid": "RUANR5L15S2018IDF0105804",
  "timestampDebut": "2018-03-13T11:00:00.000+01:00",
  "timestampFin": "2018-03-13T15:00:00.000+01:00",
  "lieu": {
    "code": "SALREU021",
    "libelleCourt": "Salle 7207",
    "libelleLong": "Salle 7207, 101, rue de l'Université"
  },
  "cycleDeVie": {
    "etat": "Confirmé",
    "chrono": {
      "creation": "2018-02-14T15:42:50.000+01:00"
    }
  },
  "demandeurs": {
    "acteurs": [
      {
        "nom": "M. Stéphane VIRY",
        "acteurRef": "PA721474"
      }
    ]
  },
  "typeReunion": "DEP"
}