{
  "xsiType": "reunionInitParlementaire_type",
  "uid": "RUANR5L15S2018IDF0115256",
  "timestampDebut": "2018-07-12T09:00:00.000+02:00",
  "timestampFin": "2018-07-12T10:30:00.000+02:00",
  "lieu": {
    "code": "SALREU022",
    "libelleCourt": "Salle 7326",
    "libelleLong": "Salle 7326, 101, rue de l'Université"
  },
  "cycleDeVie": {
    "etat": "Confirmé",
    "chrono": {
      "creation": "2018-07-09T11:02:32.000+02:00"
    }
  },
  "demandeurs": {
    "acteurs": [
      {
        "nom": "M. Gilles LURTON",
        "acteurRef": "PA606712"
      }
    ]
  },
  "typeReunion": "DEP"
}