{
  "xsiType": "reunionInitParlementaire_type",
  "uid": "RUANR5L15S2019IDF0125363",
  "timestampDebut": "2019-01-29T18:00:00.000+01:00",
  "timestampFin": "2019-01-29T20:00:00.000+01:00",
  "lieu": {
    "code": "SALREU013",
    "libelleCourt": "Salle N° 3",
    "libelleLong": "Salle N° 3, 3, rue Aristide Briand"
  },
  "cycleDeVie": {
    "etat": "Confirmé",
    "chrono": {
      "creation": "2019-01-17T11:51:46.000+01:00"
    }
  },
  "demandeurs": {
    "acteurs": [
      {
        "nom": "Mme Clémentine AUTAIN",
        "acteurRef": "PA588884"
      }
    ]
  },
  "typeReunion": "DEP"
}