{
  "xsiType": "reunionInitParlementaire_type",
  "uid": "RUANR5L15S2017IDF0095540",
  "timestampDebut": "2017-09-06T10:00:00.000+02:00",
  "timestampFin": "2017-09-06T11:00:00.000+02:00",
  "lieu": {
    "code": "SALREU010",
    "libelleCourt": "Salle N° 1",
    "libelleLong": "Salle N° 1, 3, rue Aristide Briand"
  },
  "cycleDeVie": {
    "etat": "Confirmé",
    "chrono": {
      "creation": "2017-09-04T10:27:51.000+02:00"
    }
  },
  "demandeurs": {
    "acteurs": [
      {
        "nom": "Mme Frédérique DUMAS",
        "acteurRef": "PA721194"
      }
    ]
  },
  "typeReunion": "DEP"
}