{
  "xsiType": "reunionInitParlementaire_type",
  "uid": "RUANR5L15S2020IDF0142399",
  "timestampDebut": "2019-10-24T08:00:00.000+02:00",
  "timestampFin": "2019-10-24T09:30:00.000+02:00",
  "lieu": {
    "code": "SALREU006",
    "libelleCourt": "3ème Bureau",
    "libelleLong": "3ème Bureau, Palais Bourbon"
  },
  "cycleDeVie": {
    "etat": "Confirmé",
    "chrono": {
      "creation": "2019-10-18T16:58:14.000+02:00"
    }
  },
  "demandeurs": {
    "acteurs": [
      {
        "nom": "Mme Stéphanie KERBARH",
        "acteurRef": "PA721514"
      }
    ]
  },
  "typeReunion": "DEP"
}