{
  "xsiType": "reunionInitParlementaire_type",
  "uid": "RUANR5L15S2019IDF0140230",
  "timestampDebut": "2019-09-23T16:30:00.000+02:00",
  "timestampFin": "2019-09-23T18:30:00.000+02:00",
  "lieu": {
    "code": "SALREU018",
    "libelleCourt": "Salon Mansart",
    "libelleLong": "Salon Mansart, 101, rue de l'Université"
  },
  "cycleDeVie": {
    "etat": "Confirmé",
    "chrono": {
      "creation": "2019-09-17T16:39:32.000+02:00"
    }
  },
  "demandeurs": {
    "acteurs": [
      {
        "nom": "M. Buon TAN",
        "acteurRef": "PA721690"
      }
    ]
  },
  "typeReunion": "DEP"
}