{
  "xsiType": "reunionInitParlementaire_type",
  "uid": "RUANR5L15S2019IDF0119987",
  "timestampDebut": "2018-11-22T09:00:00.000+01:00",
  "timestampFin": "2018-11-22T19:00:00.000+01:00",
  "lieu": {
    "code": "SALREU016",
    "libelleCourt": "Salon Gabriel",
    "libelleLong": "Salon Gabriel, 101, rue de l'Université"
  },
  "cycleDeVie": {
    "etat": "Confirmé",
    "chrono": {
      "creation": "2018-10-03T10:44:47.000+02:00"
    }
  },
  "demandeurs": {
    "acteurs": [
      {
        "nom": "M. Raphaël GAUVAIN",
        "acteurRef": "PA721364"
      }
    ]
  },
  "typeReunion": "DEP"
}