{
  "xsiType": "reunionCommission_type",
  "uid": "RUANR5L15S2018IDC429326",
  "timestampDebut": "2018-05-16T16:30:00.000+02:00",
  "lieu": {
    "libelleLong": "salle 6242 (Lois)"
  },
  "cycleDeVie": {
    "etat": "Confirmé",
    "chrono": {
      "creation": "2018-05-03T00:00:00.000+02:00"
    }
  },
  "organeReuniRef": "PO750141",
  "participants": {},
  "ouverturePresse": false,
  "odj": {
    "convocationOdj": [
      "Audition de M. Rémy Heitz, directeur des affaires criminelles et des grâces (DACG) au ministère de la justice (non ouverte à la presse)"
    ],
    "resumeOdj": [
      "audition de M. Rémy Heitz, directeur des affaires criminelles et des grâces (DACG) au ministère de la justice (non ouverte à la presse)."
    ]
  },
  "formatReunion": "Ordinaire",
  "infosReunionsInternationale": {
    "estReunionInternationale": false
  },
  "captationVideo": false
}