{
  "xsiType": "reunionInitParlementaire_type",
  "uid": "RUANR5L15S2018IDF0097695",
  "timestampDebut": "2017-10-16T19:30:00.000+02:00",
  "timestampFin": "2017-10-16T22:30:00.000+02:00",
  "lieu": {
    "code": "SALREU006",
    "libelleCourt": "3ème Bureau",
    "libelleLong": "3ème Bureau, Palais Bourbon"
  },
  "cycleDeVie": {
    "etat": "Confirmé",
    "chrono": {
      "creation": "2017-10-02T15:29:16.000+02:00"
    }
  },
  "demandeurs": {
    "acteurs": [
      {
        "nom": "Mme Paula FORTEZA",
        "acteurRef": "PA721142"
      }
    ]
  },
  "typeReunion": "DEP"
}