{
  "xsiType": "reunionInitParlementaire_type",
  "uid": "RUANR5L15S2018IDF0112988",
  "timestampDebut": "2018-06-06T14:00:00.000+02:00",
  "timestampFin": "2018-06-06T15:00:00.000+02:00",
  "lieu": {
    "code": "SALREU021",
    "libelleCourt": "Salle 7207",
    "libelleLong": "Salle 7207, 101, rue de l'Université"
  },
  "cycleDeVie": {
    "etat": "Confirmé",
    "chrono": {
      "creation": "2018-06-05T12:48:26.000+02:00"
    }
  },
  "demandeurs": {
    "acteurs": [
      {
        "nom": "Mme Célia DE LAVERGNE",
        "acteurRef": "PA719310"
      }
    ]
  },
  "typeReunion": "DEP"
}