{
  "xsiType": "seance_type",
  "uid": "RUSNR5L15S2018IDS21006",
  "timestampDebut": "2018-04-11T14:30:00.000+02:00",
  "lieu": {
    "code": "S",
    "libelleLong": "Sénat"
  },
  "cycleDeVie": {
    "etat": "Confirmé",
    "chrono": {
      "creation": "2018-03-22T00:00:00.000+01:00"
    }
  },
  "organeReuniRef": "PO78718",
  "sessionRef": "SCR5A2018O1",
  "ouverturePresse": true,
  "odj": {
    "pointsOdj": [
      {
        "xsiType": "podjSeanceConfPres_type",
        "uid": "RUSNR5L15S2018IDS21006PT35795",
        "cycleDeVie": {
          "etat": "Confirmé",
          "chrono": {
            "creation": "2018-03-22T00:00:00.000+01:00"
          }
        },
        "objet": "Discussion des conclusions de la commission mixte paritaire sur le projet de loi ratifiant l'ordonnance n° 2016-131 du 10 février 2016 portant réforme du droit des contrats, du régime général et de la preuve des obligations (texte de la commission, n° 353, 2017-2018)",
        "dossiersLegislatifsRefs": [
          "DLR5L14N35818"
        ],
        "typePointOdj": "Discussion",
        "comiteSecret": false,
        "natureTravauxOdj": "ODJPR",
        "dateConfPres": "2018-02-21T01:00:00.000+01:00"
      },
      {
        "xsiType": "podjSeanceConfPres_type",
        "uid": "RUSNR5L15S2018IDS21006PT35796",
        "cycleDeVie": {
          "etat": "Confirmé",
          "chrono": {
            "creation": "2018-03-22T00:00:00.000+01:00"
          }
        },
        "objet": "Suite de la discussion du projet de loi, adopté par l'Assemblée nationale après engagement de la procédure accélérée, relatif à l'élection des représentants au Parlement européen (n° 314, 2017-2018)",
        "dossiersLegislatifsRefs": [
          "DLR5L15N36254"
        ],
        "typePointOdj": "Suite de la discussion",
        "comiteSecret": false,
        "natureTravauxOdj": "ODJPR",
        "dateConfPres": "2018-02-21T01:00:00.000+01:00"
      }
    ]
  },
  "compteRenduRef": "CRSSNR5S2018IDS20180411",
  "identifiants": {
    "numSeanceJo": "76",
    "idJo": "20180076",
    "quantieme": "Unique",
    "dateSeance": "2018-04-11T02:00:00.000+02:00"
  },
  "captationVideo": true
}