{
  "xsiType": "seance_type",
  "uid": "RUANR5L15S2018IDS21248",
  "timestampDebut": "2018-09-26T15:00:00.000+02:00",
  "timestampFin": "2018-09-26T20:05:00.000+02:00",
  "lieu": {
    "code": "AN",
    "libelleLong": "Assemblée nationale"
  },
  "cycleDeVie": {
    "etat": "Confirmé",
    "chrono": {
      "creation": "2018-09-10T00:00:00.000+02:00"
    }
  },
  "organeReuniRef": "PO717460",
  "sessionRef": "SCR5A2018E2",
  "ouverturePresse": true,
  "odj": {
    "pointsOdj": [
      {
        "xsiType": "podjSeanceConfPres_type",
        "uid": "RUANR5L15S2018IDS21248PT36302",
        "cycleDeVie": {
          "etat": "Confirmé",
          "chrono": {
            "creation": "2018-09-10T00:00:00.000+02:00"
          }
        },
        "objet": "Questions au Gouvernement",
        "typePointOdj": "Questions au Gouvernement",
        "comiteSecret": false,
        "natureTravauxOdj": "ODJPR"
      },
      {
        "xsiType": "podjSeanceConfPres_type",
        "uid": "RUANR5L15S2018IDS21248PT36305",
        "cycleDeVie": {
          "etat": "Confirmé",
          "chrono": {
            "creation": "2018-09-11T00:00:00.000+02:00"
          }
        },
        "objet": "Explications de vote et vote par scrutin public sur le projet de loi relatif à la lutte contre la fraude",
        "dossiersLegislatifsRefs": [
          "DLR5L15N36530"
        ],
        "typePointOdj": "Explications de vote et vote par scrutin public",
        "comiteSecret": false,
        "natureTravauxOdj": "ODJPR"
      },
      {
        "xsiType": "podjSeanceConfPres_type",
        "uid": "RUANR5L15S2018IDS21248PT36289",
        "cycleDeVie": {
          "etat": "Confirmé",
          "chrono": {
            "creation": "2018-09-10T00:00:00.000+02:00"
          }
        },
        "objet": "Discussion du projet de loi, adopté par le Sénat, autorisant l'approbation de la convention sur le transfèrement des personnes condamnées entre le Gouvernement de la République française et le Gouvernement de la République du Pérou",
        "procedure": "procédure d'examen simplifiée-Article 103",
        "dossiersLegislatifsRefs": [
          "DLR5L14N35562"
        ],
        "typePointOdj": "Discussion",
        "comiteSecret": false,
        "natureTravauxOdj": "ODJPR"
      },
      {
        "xsiType": "podjSeanceConfPres_type",
        "uid": "RUANR5L15S2018IDS21248PT36290",
        "cycleDeVie": {
          "etat": "Confirmé",
          "chrono": {
            "creation": "2018-09-10T00:00:00.000+02:00"
          }
        },
        "objet": "Discussion du projet de loi, adopté par le Sénat, autorisant l'approbation de l'accord entre le Gouvernement de la République française et le Gouvernement de la République du Congo relatif à l'activité professionnelle salariée des personnes à charge des agents des missions officielles de chaque État dans l'autre, de l'accord entre le Gouvernement de la République française et le Gouvernement de la République d'Équateur sur l'emploi salarié des personnes à charge des membres des missions officielles, et de l'accord entre le Gouvernement de la République française et le Gouvernement de la République du Pérou relatif à l'activité rémunérée des membres des familles des agents des missions officielles de chaque État dans l'autre",
        "procedure": "procédure d'examen simplifiée-Article 103",
        "dossiersLegislatifsRefs": [
          "DLR5L15N36123"
        ],
        "typePointOdj": "Discussion",
        "comiteSecret": false,
        "natureTravauxOdj": "ODJPR"
      },
      {
        "xsiType": "podjSeanceConfPres_type",
        "uid": "RUANR5L15S2018IDS21248PT36292",
        "cycleDeVie": {
          "etat": "Confirmé",
          "chrono": {
            "creation": "2018-09-10T00:00:00.000+02:00"
          }
        },
        "objet": "Discussion du projet de loi, adopté par le Sénat, autorisant la ratification de l'accord instituant la Fondation internationale UE-ALC",
        "procedure": "procédure d'examen simplifiée-Article 103",
        "dossiersLegislatifsRefs": [
          "DLR5L15N36319"
        ],
        "typePointOdj": "Discussion",
        "comiteSecret": false,
        "natureTravauxOdj": "ODJPR"
      },
      {
        "xsiType": "podjSeanceConfPres_type",
        "uid": "RUANR5L15S2018IDS21248PT36291",
        "cycleDeVie": {
          "etat": "Confirmé",
          "chrono": {
            "creation": "2018-09-10T00:00:00.000+02:00"
          }
        },
        "objet": "Discussion du projet de loi autorisant la ratification de l’accord de dialogue politique et de coopération entre l’Union européenne et ses États membres, d’une part, et la République de Cuba, d’autre part",
        "dossiersLegislatifsRefs": [
          "DLR5L15N36449"
        ],
        "typePointOdj": "Discussion",
        "comiteSecret": false,
        "natureTravauxOdj": "ODJPR"
      },
      {
        "xsiType": "podjSeanceConfPres_type",
        "uid": "RUANR5L15S2018IDS21248PT36293",
        "cycleDeVie": {
          "etat": "Supprimé",
          "chrono": {
            "creation": "2018-09-10T00:00:00.000+02:00",
            "cloture": "2018-09-11T00:00:00.000+02:00"
          }
        },
        "objet": "Suite de la discussion du projet de loi relatif à la croissance et la transformation des entreprises",
        "typePointOdj": "Suite de la discussion",
        "comiteSecret": false,
        "natureTravauxOdj": "ODJPR"
      },
      {
        "xsiType": "podjSeanceConfPres_type",
        "uid": "RUANR5L15S2018IDS21248PT36306",
        "cycleDeVie": {
          "etat": "Confirmé",
          "chrono": {
            "creation": "2018-09-11T00:00:00.000+02:00"
          }
        },
        "objet": "Suite de la discussion du projet de loi relatif à la croissance et la transformation des entreprises",
        "dossiersLegislatifsRefs": [
          "DLR5L15N36728"
        ],
        "typePointOdj": "Suite de la discussion",
        "comiteSecret": false,
        "natureTravauxOdj": "ODJPR"
      }
    ]
  },
  "compteRenduRef": "CRSANR5L15S2018E2N016",
  "identifiants": {
    "numSeanceJo": "16",
    "idJo": "20182016",
    "quantieme": "Première",
    "dateSeance": "2018-09-26T02:00:00.000+02:00"
  },
  "captationVideo": true
}