{
  "xsiType": "reunionInitParlementaire_type",
  "uid": "RUANR5L15S2019IDF0133037",
  "timestampDebut": "2019-05-07T10:00:00.000+02:00",
  "timestampFin": "2019-05-07T11:00:00.000+02:00",
  "lieu": {
    "code": "SALREU002",
    "libelleCourt": "Salle 7070",
    "libelleLong": "Salle 7070, 103, rue de l'Université"
  },
  "cycleDeVie": {
    "etat": "Confirmé",
    "chrono": {
      "creation": "2019-05-02T11:44:43.000+02:00"
    }
  },
  "demandeurs": {
    "acteurs": [
      {
        "nom": "M. Buon TAN",
        "acteurRef": "PA721690"
      }
    ]
  },
  "typeReunion": "DEP"
}