{
  "xsiType": "reunionInitParlementaire_type",
  "uid": "RUANR5L15S2018IDF0108876",
  "timestampDebut": "2018-04-03T09:30:00.000+02:00",
  "timestampFin": "2018-04-03T11:30:00.000+02:00",
  "lieu": {
    "code": "SALREU028",
    "libelleCourt": "Salle Colbert",
    "libelleLong": "Salle Colbert , Palais Bourbon"
  },
  "cycleDeVie": {
    "etat": "Confirmé",
    "chrono": {
      "creation": "2018-03-29T16:27:05.000+02:00"
    }
  },
  "demandeurs": {
    "acteurs": [
      {
        "nom": "Mme Catherine OSSON",
        "acteurRef": "PA720492"
      },
      {
        "nom": "Mme Aina KURIC",
        "acteurRef": "PA720214"
      }
    ]
  },
  "typeReunion": "DEP"
}