{
  "xsiType": "reunionInitParlementaire_type",
  "uid": "RUANR5L15S2018IDF0105629",
  "timestampDebut": "2018-03-10T09:30:00.000+01:00",
  "timestampFin": "2018-03-10T13:00:00.000+01:00",
  "lieu": {
    "code": "SALREU029",
    "libelleCourt": "Salon Mars III",
    "libelleLong": "Salon Mars III, 101, rue de l'Université"
  },
  "cycleDeVie": {
    "etat": "Confirmé",
    "chrono": {
      "creation": "2018-02-12T16:05:31.000+01:00"
    }
  },
  "demandeurs": {
    "acteurs": [
      {
        "nom": "M. Philippe FOLLIOT",
        "acteurRef": "PA267673"
      }
    ]
  },
  "typeReunion": "DEP"
}