{
  "xsiType": "reunionInitParlementaire_type",
  "uid": "RUANR5L15S2019IDF0134926",
  "timestampDebut": "2019-06-04T09:00:00.000+02:00",
  "timestampFin": "2019-06-04T10:00:00.000+02:00",
  "lieu": {
    "code": "SALREU017",
    "libelleCourt": "Salon Visconti",
    "libelleLong": "Salon Visconti, 101, rue de l'Université"
  },
  "cycleDeVie": {
    "etat": "Annulé",
    "chrono": {
      "creation": "2019-06-03T16:23:16.000+02:00",
      "cloture": "2019-06-03T16:36:20.000+02:00"
    }
  },
  "demandeurs": {
    "acteurs": [
      {
        "nom": "Mme Céline CALVEZ",
        "acteurRef": "PA721750"
      }
    ]
  },
  "typeReunion": "DEP"
}