{
  "xsiType": "reunionCommission_type",
  "uid": "RUANR5L15S2019IDC433305",
  "timestampDebut": "2019-07-03T15:00:00.000+02:00",
  "lieu": {
    "libelleLong": "salle de réunion de la commission"
  },
  "cycleDeVie": {
    "etat": "Confirmé",
    "chrono": {
      "creation": "2019-06-28T00:00:00.000+02:00"
    }
  },
  "organeReuniRef": "PO420120",
  "participants": {},
  "ouverturePresse": false,
  "odj": {
    "convocationOdj": [
      "Entretien de Mme Brigitte Bourguignon, présidente de la commission, et de députés membres de la commission avec une délégation de parlementaires sud-coréens conduite par M. Chung Sye Kyun, président du groupe d’amitié Corée du Sud - France, accueillie à l'Assemblée nationale par le groupe d’amitié France-Corée du Sud, présidé par M. Joachim Son-Forget"
    ],
    "resumeOdj": [
      "Entretien de Mme Brigitte Bourguignon, présidente de la commission, et de députés membres de la commission avec une délégation de parlementaires sud-coréens conduite par M. Chung Sye Kyun, président du groupe d’amitié Corée du Sud - France, accueillie à l'Assemblée nationale par le groupe d’amitié France-Corée du Sud, présidé par M. Joachim Son-Forget"
    ]
  },
  "formatReunion": "AuditionParPresidentCommission",
  "infosReunionsInternationale": {
    "estReunionInternationale": true,
    "listePays": [
      "GOP756470"
    ],
    "informationsComplementaires": "Tiennot Sciberras - 34208"
  },
  "captationVideo": false
}