{
  "xsiType": "seance_type",
  "uid": "RUANR5L15S2018IDS21062",
  "timestampDebut": "2018-05-30T21:30:00.000+02:00",
  "lieu": {
    "code": "AN",
    "libelleLong": "Assemblée nationale"
  },
  "cycleDeVie": {
    "etat": "Confirmé",
    "chrono": {
      "creation": "2018-04-13T00:00:00.000+02:00"
    }
  },
  "organeReuniRef": "PO717460",
  "sessionRef": "SCR5A2018O1",
  "ouverturePresse": true,
  "odj": {
    "pointsOdj": [
      {
        "xsiType": "podjSeanceConfPres_type",
        "uid": "RUANR5L15S2018IDS21062PT35895",
        "cycleDeVie": {
          "etat": "Supprimé",
          "chrono": {
            "creation": "2018-04-16T00:00:00.000+02:00",
            "cloture": "2018-05-15T00:00:00.000+02:00"
          }
        },
        "objet": "Suite de la discussion du projet de loi portant évolution du logement, de l’aménagement et du numérique",
        "typePointOdj": "Suite de la discussion",
        "comiteSecret": false,
        "natureTravauxOdj": "ODJPR"
      },
      {
        "xsiType": "podjSeanceConfPres_type",
        "uid": "RUANR5L15S2018IDS21062PT35953",
        "cycleDeVie": {
          "etat": "Confirmé",
          "chrono": {
            "creation": "2018-05-15T00:00:00.000+02:00"
          }
        },
        "objet": "Suite de la discussion du projet de loi portant évolution du logement, de l’aménagement et du numérique",
        "dossiersLegislatifsRefs": [
          "DLR5L15N36537"
        ],
        "typePointOdj": "Suite de la discussion",
        "comiteSecret": false,
        "natureTravauxOdj": "ODJPR"
      }
    ]
  },
  "compteRenduRef": "CRSANR5L15S2018O1N238",
  "identifiants": {
    "numSeanceJo": "238",
    "idJo": "20180238",
    "quantieme": "Deuxième",
    "dateSeance": "2018-05-30T02:00:00.000+02:00"
  },
  "captationVideo": true
}