{
  "xsiType": "reunionInitParlementaire_type",
  "uid": "RUANR5L15S2019IDF0121633",
  "timestampDebut": "2018-11-08T08:30:00.000+01:00",
  "timestampFin": "2018-11-08T09:30:00.000+01:00",
  "lieu": {
    "code": "SALREU049",
    "libelleCourt": "Salle 6822",
    "libelleLong": "Salle 6822, Palais Bourbon"
  },
  "cycleDeVie": {
    "etat": "Confirmé",
    "chrono": {
      "creation": "2018-10-30T16:19:50.000+01:00"
    }
  },
  "demandeurs": {
    "acteurs": [
      {
        "nom": "Mme Delphine BAGARRY",
        "acteurRef": "PA718744"
      }
    ]
  },
  "typeReunion": "DEP"
}