{
  "xsiType": "reunionInitParlementaire_type",
  "uid": "RUANR5L15S2019IDF0135869",
  "timestampDebut": "2019-06-26T20:00:00.000+02:00",
  "timestampFin": "2019-06-26T21:30:00.000+02:00",
  "lieu": {
    "code": "SALREU016",
    "libelleCourt": "Salon Gabriel",
    "libelleLong": "Salon Gabriel, 101, rue de l'Université"
  },
  "cycleDeVie": {
    "etat": "Confirmé",
    "chrono": {
      "creation": "2019-06-19T10:35:49.000+02:00"
    }
  },
  "demandeurs": {
    "acteurs": [
      {
        "nom": "Mme Delphine BATHO",
        "acteurRef": "PA335999"
      }
    ]
  },
  "typeReunion": "DEP"
}