{
  "xsiType": "reunionInitParlementaire_type",
  "uid": "RUANR5L15S2019IDF0122099",
  "timestampDebut": "2018-11-26T19:00:00.000+01:00",
  "timestampFin": "2018-11-26T20:00:00.000+01:00",
  "lieu": {
    "code": "SALREU013",
    "libelleCourt": "Salle N° 3",
    "libelleLong": "Salle N° 3, 3, rue Aristide Briand"
  },
  "cycleDeVie": {
    "etat": "Confirmé",
    "chrono": {
      "creation": "2018-11-09T12:59:54.000+01:00"
    }
  },
  "demandeurs": {
    "organe": {
      "nom": "Groupe d'amitié France-Guinée",
      "organeRef": "PO733327"
    }
  },
  "organeReuniRef": "PO733327",
  "typeReunion": "GA"
}