{
  "xsiType": "reunionCommission_type",
  "uid": "RUANR5L15S2018IDC430106",
  "timestampDebut": "2018-07-18T17:30:00.000+02:00",
  "timestampFin": "2018-07-18T18:00:00.000+02:00",
  "lieu": {
    "libelleLong": "salle 6238 (Affaires culturelles)"
  },
  "cycleDeVie": {
    "etat": "Confirmé",
    "chrono": {
      "creation": "2018-07-16T00:00:00.000+02:00"
    }
  },
  "organeReuniRef": "PO758043",
  "participants": {
    "participantsInternes": [
      {
        "acteurRef": "PA722190",
        "presence": "présent"
      },
      {
        "acteurRef": "PA720256",
        "presence": "présent"
      },
      {
        "acteurRef": "PA703532",
        "presence": "présent"
      },
      {
        "acteurRef": "PA736216",
        "presence": "présent"
      },
      {
        "acteurRef": "PA721328",
        "presence": "présent"
      },
      {
        "acteurRef": "PA719170",
        "presence": "excusé"
      },
      {
        "acteurRef": "PA736192",
        "presence": "absent"
      },
      {
        "acteurRef": "PA720696",
        "presence": "présent"
      },
      {
        "acteurRef": "PA331381",
        "presence": "présent"
      },
      {
        "acteurRef": "PA608416",
        "presence": "présent"
      },
      {
        "acteurRef": "PA703529",
        "presence": "présent"
      },
      {
        "acteurRef": "PA703526",
        "presence": "absent"
      },
      {
        "acteurRef": "PA415453",
        "presence": "présent"
      },
      {
        "acteurRef": "PA415449",
        "presence": "présent"
      },
      {
        "acteurRef": "PA429888",
        "presence": "absent"
      },
      {
        "acteurRef": "PA736243",
        "presence": "absent"
      },
      {
        "acteurRef": "PA343988",
        "presence": "absent"
      },
      {
        "acteurRef": "PA335532",
        "presence": "présent"
      },
      {
        "acteurRef": "PA736200",
        "presence": "présent"
      },
      {
        "acteurRef": "PA736166",
        "presence": "absent"
      },
      {
        "acteurRef": "PA718944",
        "presence": "présent"
      },
      {
        "acteurRef": "PA266776",
        "presence": "présent"
      },
      {
        "acteurRef": "PA720066",
        "presence": "absent"
      },
      {
        "acteurRef": "PA718902",
        "presence": "présent"
      },
      {
        "acteurRef": "PA301592",
        "presence": "absent"
      },
      {
        "acteurRef": "PA720190",
        "presence": "absent"
      },
      {
        "acteurRef": "PA720754",
        "presence": "présent"
      }
    ]
  },
  "ouverturePresse": false,
  "odj": {
    "convocationOdj": [
      "nomination du bureau ;",
      "nomination des rapporteurs ;",
      "examen des dispositions restant en discussion de la proposition de loi."
    ],
    "resumeOdj": [
      "nomination du bureau ;",
      "nomination des rapporteurs ;",
      "examen des dispositions restant en discussion de la proposition de loi."
    ]
  },
  "formatReunion": "Ordinaire",
  "infosReunionsInternationale": {
    "estReunionInternationale": false
  },
  "captationVideo": false
}