{
  "xsiType": "reunionInitParlementaire_type",
  "uid": "RUANR5L15S2018IDF0108103",
  "timestampDebut": "2018-03-20T17:30:00.000+01:00",
  "timestampFin": "2018-03-20T20:00:00.000+01:00",
  "lieu": {
    "code": "SALREU026",
    "libelleCourt": "9ème Bureau",
    "libelleLong": "9ème Bureau, Palais Bourbon"
  },
  "cycleDeVie": {
    "etat": "Confirmé",
    "chrono": {
      "creation": "2018-03-20T15:54:58.000+01:00"
    }
  },
  "demandeurs": {
    "acteurs": [
      {
        "nom": "M. Jean-Paul DUFRÈGNE",
        "acteurRef": "PA718720"
      }
    ]
  },
  "typeReunion": "DEP"
}