{
  "xsiType": "reunionCommission_type",
  "uid": "RUANR5L15S2018IDC428495",
  "timestampDebut": "2018-02-08T15:30:00.000+01:00",
  "timestampFin": "2018-02-08T16:55:00.000+01:00",
  "lieu": {
    "libelleLong": "6e Bureau"
  },
  "cycleDeVie": {
    "etat": "Confirmé",
    "chrono": {
      "creation": "2018-02-02T00:00:00.000+01:00"
    }
  },
  "organeReuniRef": "PO740454",
  "participants": {
    "participantsInternes": [
      {
        "acteurRef": "PA719318",
        "presence": "absent"
      },
      {
        "acteurRef": "PA335999",
        "presence": "excusé"
      },
      {
        "acteurRef": "PA719488",
        "presence": "absent"
      },
      {
        "acteurRef": "PA720162",
        "presence": "absent"
      },
      {
        "acteurRef": "PA719740",
        "presence": "absent"
      },
      {
        "acteurRef": "PA719258",
        "presence": "absent"
      },
      {
        "acteurRef": "PA267355",
        "presence": "absent"
      },
      {
        "acteurRef": "PA719230",
        "presence": "absent"
      },
      {
        "acteurRef": "PA340853",
        "presence": "absent"
      },
      {
        "acteurRef": "PA719412",
        "presence": "absent"
      },
      {
        "acteurRef": "PA719154",
        "presence": "présent"
      },
      {
        "acteurRef": "PA2155",
        "presence": "présent"
      },
      {
        "acteurRef": "PA719456",
        "presence": "absent"
      },
      {
        "acteurRef": "PA719242",
        "presence": "absent"
      },
      {
        "acteurRef": "PA720278",
        "presence": "absent"
      },
      {
        "acteurRef": "PA720892",
        "presence": "absent"
      },
      {
        "acteurRef": "PA2377",
        "presence": "absent"
      },
      {
        "acteurRef": "PA718930",
        "presence": "absent"
      },
      {
        "acteurRef": "PA719350",
        "presence": "absent"
      },
      {
        "acteurRef": "PA719540",
        "presence": "présent"
      },
      {
        "acteurRef": "PA722268",
        "presence": "absent"
      },
      {
        "acteurRef": "PA722110",
        "presence": "absent"
      }
    ]
  },
  "ouverturePresse": true,
  "odj": {
    "convocationOdj": [
      "Audition de Mme Marine Tondelier, déléguée générale d'Atmo France, de M. Gérard Bacles, président référent agriculture et pesticides d'Atmo France et président d'Atmo Nouvelle Aquitaine, de M. Patrice Colin, directeur référent pesticide d'Atmo France et directeur de Lig'AIR, de M. Joseph Kleinpeter, directeur référent santé d'Atmo France et directeur d'Atmo Grand-Est, et de Mme Dominique Tilak, directrice référente santé d’Atmo France et directrice d’Atmo Occitanie ; et de  Mme Hélène Soubelet, directrice de la Fondation pour la recherche sur la biodiversité"
    ],
    "resumeOdj": [
      "audition de Mme Marine Tondelier, déléguée générale d'Atmo France, de M. Gérard Bacles, président référent agriculture et pesticides d'Atmo France et président d'Atmo Nouvelle Aquitaine, de M. Patrice Colin, directeur référent pesticide d'Atmo France et directeur de Lig'AIR, de M. Joseph Kleinpeter, directeur référent santé d'Atmo France et directeur d'Atmo Grand-Est, et de Mme Dominique Tilak, directrice référente santé d’Atmo France et directrice d’Atmo Occitanie ; et de  Mme Hélène Soubelet, directrice de la Fondation pour la recherche sur la biodiversité."
    ]
  },
  "formatReunion": "Ordinaire",
  "infosReunionsInternationale": {
    "estReunionInternationale": false
  },
  "captationVideo": false
}