{
  "xsiType": "reunionCommission_type",
  "uid": "RUANR5L15S2018IDC429812",
  "timestampDebut": "2018-06-19T09:00:00.000+02:00",
  "timestampFin": "2018-06-19T11:00:00.000+02:00",
  "lieu": {
    "libelleLong": "salle 4325 (33 rue Saint-Dominique)"
  },
  "cycleDeVie": {
    "etat": "Confirmé",
    "chrono": {
      "creation": "2018-06-13T00:00:00.000+02:00"
    }
  },
  "organeReuniRef": "PO675659",
  "participants": {},
  "ouverturePresse": true,
  "odj": {
    "convocationOdj": [
      "Examen du rapport sur la lutte contre les discriminations anti LGBT dans les Outre-mer (MM. Raphaël GERARD et Gabriel SERVILLE, Mme Laurence VANCEUNEBROCK-MIALON, rapporteurs)."
    ],
    "resumeOdj": [
      "examen du rapport sur la lutte contre les discriminations anti LGBT dans les outre-mer (MM. Raphaël Gérard et Gabriel Serville, Mme Laurence Vanceunebrock-Mialon, rapporteurs)."
    ]
  },
  "formatReunion": "Ordinaire",
  "infosReunionsInternationale": {
    "estReunionInternationale": false
  },
  "captationVideo": false
}