{
  "xsiType": "reunionCommission_type",
  "uid": "RUANR5L15S2018IDC428734",
  "timestampDebut": "2018-03-06T08:50:00.000+01:00",
  "timestampFin": "2018-03-06T10:40:00.000+01:00",
  "lieu": {
    "libelleLong": "salle Lamartine"
  },
  "cycleDeVie": {
    "etat": "Confirmé",
    "chrono": {
      "creation": "2018-03-01T00:00:00.000+01:00"
    }
  },
  "organeReuniRef": "PO734671",
  "participants": {
    "participantsInternes": [
      {
        "acteurRef": "PA267042",
        "presence": "excusé"
      },
      {
        "acteurRef": "PA332614",
        "presence": "excusé"
      },
      {
        "acteurRef": "PA718868",
        "presence": "présent"
      },
      {
        "acteurRef": "PA606712",
        "presence": "présent"
      },
      {
        "acteurRef": "PA334116",
        "presence": "présent"
      },
      {
        "acteurRef": "PA720728",
        "presence": "présent"
      },
      {
        "acteurRef": "PA721270",
        "presence": "absent"
      },
      {
        "acteurRef": "PA718910",
        "presence": "excusé"
      },
      {
        "acteurRef": "PA2792",
        "presence": "excusé"
      },
      {
        "acteurRef": "PA720394",
        "presence": "excusé"
      }
    ]
  },
  "ouverturePresse": true,
  "odj": {
    "convocationOdj": [
      "Dans le cadre des travaux du groupe sur la prise en compte du handicap dans le fonctionnement de l’Assemblée nationale :À 8 heures 45 :Table-ronde consacrée aux organisations syndicales représentant les collaborateurs de députés :– Confédération française démocratique du travail – Syndicat des mouvements et associations de l’Assemblée nationale (CFDT-SMA) ;– Confédération française des travailleurs chrétiens (CFTC) - Parlement – Syndicat national des collaborateurs parlementaires-Force ouvrière (SNCP-FO) – Syndicat Solidaires-Assemblée nationaleÀ 10 heures :Table-ronde consacrée aux associations de collaborateurs parlementaires présentes à l’Assemblée nationale :– Association française des collaborateurs parlementaires (AFCP) ;– Association des collaborateurs démocrates (CoDem)."
    ],
    "resumeOdj": [
      "Dans le cadre des travaux du groupe sur la prise en compte du handicap dans le fonctionnement de l’Assemblée nationale :- à 8 h 45 : table-ronde consacrée aux organisations syndicales représentant les collaborateurs de députés :- Confédération française démocratique du travail – Syndicat des mouvements et associations de l’Assemblée nationale (CFDT-SMA) ;- Confédération française des travailleurs chrétiens (CFTC) - Parlement ;- Syndicat national des collaborateurs parlementaires-Force ouvrière (SNCP-FO) ;- Syndicat Solidaires-Assemblée nationale.- à 10 heures : table-ronde consacrée aux associations de collaborateurs parlementaires présentes à l’Assemblée nationale :- Association française des collaborateurs parlementaires (AFCP) ;- Association des collaborateurs démocrates (CoDem)."
    ]
  },
  "compteRenduRef": "CRCANR5L15S2018PO734671N003",
  "formatReunion": "Ordinaire",
  "infosReunionsInternationale": {
    "estReunionInternationale": false
  },
  "captationVideo": false
}