{
  "xsiType": "reunionInitParlementaire_type",
  "uid": "RUANR5L15S2019IDF0115055",
  "timestampDebut": "2018-10-09T14:00:00.000+02:00",
  "timestampFin": "2018-10-09T17:00:00.000+02:00",
  "lieu": {
    "code": "SALREU029",
    "libelleCourt": "Salon Mars III",
    "libelleLong": "Salon Mars III, 101, rue de l'Université"
  },
  "cycleDeVie": {
    "etat": "Annulé",
    "chrono": {
      "creation": "2018-07-04T18:14:01.000+02:00",
      "cloture": "2018-10-04T17:46:53.000+02:00"
    }
  },
  "demandeurs": {
    "acteurs": [
      {
        "nom": "M. Gérard CHERPION",
        "acteurRef": "PA856"
      }
    ]
  },
  "typeReunion": "DEP"
}