{
  "xsiType": "reunionCommission_type",
  "uid": "RUANR5L15S2018IDC428171",
  "timestampDebut": "2018-01-24T16:15:00.000+01:00",
  "timestampFin": "2018-01-24T18:05:00.000+01:00",
  "lieu": {
    "libelleLong": "salle 6350 (Finances)"
  },
  "cycleDeVie": {
    "etat": "Confirmé",
    "chrono": {
      "creation": "2017-12-20T00:00:00.000+01:00"
    }
  },
  "organeReuniRef": "PO59048",
  "participants": {
    "participantsInternes": [
      {
        "acteurRef": "PA718954",
        "presence": "présent"
      },
      {
        "acteurRef": "PA605963",
        "presence": "présent"
      },
      {
        "acteurRef": "PA609726",
        "presence": "absent"
      },
      {
        "acteurRef": "PA721836",
        "presence": "absent"
      },
      {
        "acteurRef": "PA720430",
        "presence": "absent"
      },
      {
        "acteurRef": "PA721410",
        "presence": "présent"
      },
      {
        "acteurRef": "PA721608",
        "presence": "absent"
      },
      {
        "acteurRef": "PA605069",
        "presence": "excusé"
      },
      {
        "acteurRef": "PA720298",
        "presence": "absent"
      },
      {
        "acteurRef": "PA746",
        "presence": "présent"
      },
      {
        "acteurRef": "PA719138",
        "presence": "présent"
      },
      {
        "acteurRef": "PA720520",
        "presence": "absent"
      },
      {
        "acteurRef": "PA719472",
        "presence": "absent"
      },
      {
        "acteurRef": "PA719250",
        "presence": "absent"
      },
      {
        "acteurRef": "PA718850",
        "presence": "présent"
      },
      {
        "acteurRef": "PA923",
        "presence": "absent"
      },
      {
        "acteurRef": "PA942",
        "presence": "présent"
      },
      {
        "acteurRef": "PA332523",
        "presence": "excusé"
      },
      {
        "acteurRef": "PA720268",
        "presence": "absent"
      },
      {
        "acteurRef": "PA719710",
        "presence": "absent"
      },
      {
        "acteurRef": "PA718720",
        "presence": "présent"
      },
      {
        "acteurRef": "PA643175",
        "presence": "absent"
      },
      {
        "acteurRef": "PA720002",
        "presence": "présent"
      },
      {
        "acteurRef": "PA607193",
        "presence": "absent"
      },
      {
        "acteurRef": "PA1327",
        "presence": "absent"
      },
      {
        "acteurRef": "PA719480",
        "presence": "absent"
      },
      {
        "acteurRef": "PA267336",
        "presence": "présent"
      },
      {
        "acteurRef": "PA720560",
        "presence": "absent"
      },
      {
        "acteurRef": "PA720790",
        "presence": "présent"
      },
      {
        "acteurRef": "PA721764",
        "presence": "absent"
      },
      {
        "acteurRef": "PA721498",
        "presence": "absent"
      },
      {
        "acteurRef": "PA722054",
        "presence": "présent"
      },
      {
        "acteurRef": "PA608416",
        "presence": "absent"
      },
      {
        "acteurRef": "PA721150",
        "presence": "présent"
      },
      {
        "acteurRef": "PA719060",
        "presence": "absent"
      },
      {
        "acteurRef": "PA719778",
        "presence": "présent"
      },
      {
        "acteurRef": "PA720214",
        "presence": "absent"
      },
      {
        "acteurRef": "PA719798",
        "presence": "absent"
      },
      {
        "acteurRef": "PA609245",
        "presence": "absent"
      },
      {
        "acteurRef": "PA718978",
        "presence": "absent"
      },
      {
        "acteurRef": "PA1838",
        "presence": "absent"
      },
      {
        "acteurRef": "PA720022",
        "presence": "absent"
      },
      {
        "acteurRef": "PA712014",
        "presence": "absent"
      },
      {
        "acteurRef": "PA1874",
        "presence": "excusé"
      },
      {
        "acteurRef": "PA721466",
        "presence": "absent"
      },
      {
        "acteurRef": "PA719006",
        "presence": "absent"
      },
      {
        "acteurRef": "PA608016",
        "presence": "absent"
      },
      {
        "acteurRef": "PA722244",
        "presence": "absent"
      },
      {
        "acteurRef": "PA720230",
        "presence": "présent"
      },
      {
        "acteurRef": "PA720728",
        "presence": "présent"
      },
      {
        "acteurRef": "PA721418",
        "presence": "absent"
      },
      {
        "acteurRef": "PA721670",
        "presence": "présent"
      },
      {
        "acteurRef": "PA719850",
        "presence": "absent"
      },
      {
        "acteurRef": "PA720492",
        "presence": "présent"
      },
      {
        "acteurRef": "PA720402",
        "presence": "présent"
      },
      {
        "acteurRef": "PA721636",
        "presence": "absent"
      },
      {
        "acteurRef": "PA607595",
        "presence": "présent"
      },
      {
        "acteurRef": "PA721568",
        "presence": "absent"
      },
      {
        "acteurRef": "PA718736",
        "presence": "absent"
      },
      {
        "acteurRef": "PA336175",
        "presence": "absent"
      },
      {
        "acteurRef": "PA608172",
        "presence": "présent"
      },
      {
        "acteurRef": "PA405480",
        "presence": "présent"
      },
      {
        "acteurRef": "PA609590",
        "presence": "absent"
      },
      {
        "acteurRef": "PA719676",
        "presence": "absent"
      },
      {
        "acteurRef": "PA721458",
        "presence": "absent"
      },
      {
        "acteurRef": "PA720692",
        "presence": "absent"
      },
      {
        "acteurRef": "PA720878",
        "presence": "absent"
      },
      {
        "acteurRef": "PA722078",
        "presence": "absent"
      },
      {
        "acteurRef": "PA720960",
        "presence": "absent"
      },
      {
        "acteurRef": "PA719592",
        "presence": "absent"
      },
      {
        "acteurRef": "PA721542",
        "presence": "excusé"
      },
      {
        "acteurRef": "PA607090",
        "presence": "présent"
      },
      {
        "acteurRef": "PA331582",
        "presence": "absent"
      },
      {
        "acteurRef": "PA2960",
        "presence": "présent"
      }
    ]
  },
  "ouverturePresse": true,
  "odj": {
    "convocationOdj": [
      "–  Audition de M. Bruno PARENT, directeur général des finances publiques, et Mme Maïté GABET, cheffe du service du contrôle fiscal sur la question du contrôle fiscal"
    ],
    "resumeOdj": [
      "audition de M. Bruno Parent, directeur général des finances publiques, et Mme Maïté Gabet, cheffe du service du contrôle fiscal sur la question du contrôle fiscal."
    ]
  },
  "compteRenduRef": "CRCANR5L15S2018PO59048N064",
  "formatReunion": "Ordinaire",
  "infosReunionsInternationale": {
    "estReunionInternationale": false
  },
  "captationVideo": false
}