{
  "xsiType": "reunionInitParlementaire_type",
  "uid": "RUANR5L15S2018IDF0107405",
  "timestampDebut": "2018-03-20T17:30:00.000+01:00",
  "timestampFin": "2018-03-20T18:30:00.000+01:00",
  "lieu": {
    "code": "SALREU006",
    "libelleCourt": "3ème Bureau",
    "libelleLong": "3ème Bureau, Palais Bourbon"
  },
  "cycleDeVie": {
    "etat": "Confirmé",
    "chrono": {
      "creation": "2018-03-12T12:22:15.000+01:00"
    }
  },
  "demandeurs": {
    "organe": {
      "nom": "Groupe d'amitié France-Argentine",
      "organeRef": "PO732974"
    }
  },
  "organeReuniRef": "PO732974",
  "typeReunion": "GA"
}