{
  "xsiType": "reunionInitParlementaire_type",
  "uid": "RUANR5L15S2018IDF0097825",
  "timestampDebut": "2017-10-26T14:30:00.000+02:00",
  "timestampFin": "2017-10-26T16:00:00.000+02:00",
  "lieu": {
    "code": "SALREU008",
    "libelleCourt": "5ème Bureau",
    "libelleLong": "5ème Bureau, Palais Bourbon"
  },
  "cycleDeVie": {
    "etat": "Confirmé",
    "chrono": {
      "creation": "2017-10-03T11:31:22.000+02:00"
    }
  },
  "demandeurs": {
    "acteurs": [
      {
        "nom": "Mme Brigitte LISO",
        "acteurRef": "PA720446"
      }
    ]
  },
  "typeReunion": "DEP"
}