{
  "xsiType": "reunionInitParlementaire_type",
  "uid": "RUANR5L15S2018IDF0105236",
  "timestampDebut": "2018-02-16T09:30:00.000+01:00",
  "timestampFin": "2018-02-16T10:30:00.000+01:00",
  "lieu": {
    "code": "SALREU004",
    "libelleCourt": "1er Bureau",
    "libelleLong": "1er Bureau, Palais Bourbon"
  },
  "cycleDeVie": {
    "etat": "Annulé",
    "chrono": {
      "creation": "2018-02-06T16:25:55.000+01:00",
      "cloture": "2018-02-14T12:21:13.000+01:00"
    }
  },
  "demandeurs": {
    "organe": {
      "nom": "Groupe d'amitié France-Etats-Unis",
      "organeRef": "PO733567"
    }
  },
  "organeReuniRef": "PO733567",
  "typeReunion": "GA"
}