{
  "xsiType": "reunionInitParlementaire_type",
  "uid": "RUANR5L15S2019IDF0127706",
  "timestampDebut": "2019-02-26T17:00:00.000+01:00",
  "timestampFin": "2019-02-26T19:00:00.000+01:00",
  "lieu": {
    "code": "SALREU022",
    "libelleCourt": "Salle 7326",
    "libelleLong": "Salle 7326, 101, rue de l'Université"
  },
  "cycleDeVie": {
    "etat": "Confirmé",
    "chrono": {
      "creation": "2019-02-14T17:42:53.000+01:00"
    }
  },
  "demandeurs": {
    "acteurs": [
      {
        "nom": "M. Stéphane TRAVERT",
        "acteurRef": "PA607395"
      }
    ]
  },
  "typeReunion": "DEP"
}