{
  "xsiType": "reunionInitParlementaire_type",
  "uid": "RUANR5L15S2018IDF0110602",
  "timestampDebut": "2018-05-09T16:30:00.000+02:00",
  "timestampFin": "2018-05-09T18:30:00.000+02:00",
  "lieu": {
    "code": "SALREU048",
    "libelleCourt": "Salle 6809",
    "libelleLong": "Salle 6809, Palais Bourbon"
  },
  "cycleDeVie": {
    "etat": "Confirmé",
    "chrono": {
      "creation": "2018-04-24T11:10:36.000+02:00"
    }
  },
  "demandeurs": {
    "acteurs": [
      {
        "nom": "M. Jacques SAVATIER",
        "acteurRef": "PA722078"
      }
    ]
  },
  "typeReunion": "DEP"
}