{
  "xsiType": "reunionInitParlementaire_type",
  "uid": "RUANR5L15S2019IDF0125377",
  "timestampDebut": "2019-02-12T17:00:00.000+01:00",
  "timestampFin": "2019-02-12T19:00:00.000+01:00",
  "lieu": {
    "code": "SALREU038",
    "libelleCourt": "Salle 6549",
    "libelleLong": "Salle 6549, Palais Bourbon"
  },
  "cycleDeVie": {
    "etat": "Confirmé",
    "chrono": {
      "creation": "2019-01-17T12:41:56.000+01:00"
    }
  },
  "demandeurs": {
    "acteurs": [
      {
        "nom": "M. Stéphane PEU",
        "acteurRef": "PA721270"
      }
    ]
  },
  "typeReunion": "DEP"
}