{
  "xsiType": "reunionCommission_type",
  "uid": "RUANR5L15S2018IDC428355",
  "timestampDebut": "2018-02-07T16:35:00.000+01:00",
  "timestampFin": "2018-02-07T18:00:00.000+01:00",
  "lieu": {
    "libelleLong": "salle de la commission des Finances"
  },
  "cycleDeVie": {
    "etat": "Confirmé",
    "chrono": {
      "creation": "2018-01-24T00:00:00.000+01:00"
    }
  },
  "organeReuniRef": "PO744127",
  "participants": {
    "participantsInternes": [
      {
        "acteurRef": "PA605036",
        "presence": "absent"
      },
      {
        "acteurRef": "PA605963",
        "presence": "présent"
      },
      {
        "acteurRef": "PA642847",
        "presence": "présent"
      },
      {
        "acteurRef": "PA718990",
        "presence": "présent"
      },
      {
        "acteurRef": "PA721328",
        "presence": "présent"
      },
      {
        "acteurRef": "PA719472",
        "presence": "présent"
      },
      {
        "acteurRef": "PA721860",
        "presence": "présent"
      },
      {
        "acteurRef": "PA719748",
        "presence": "présent"
      },
      {
        "acteurRef": "PA642868",
        "presence": "présent"
      },
      {
        "acteurRef": "PA719756",
        "presence": "présent"
      },
      {
        "acteurRef": "PA942",
        "presence": "présent"
      },
      {
        "acteurRef": "PA643175",
        "presence": "présent"
      },
      {
        "acteurRef": "PA719938",
        "presence": "présent"
      },
      {
        "acteurRef": "PA719480",
        "presence": "absent"
      },
      {
        "acteurRef": "PA720170",
        "presence": "absent"
      },
      {
        "acteurRef": "PA722054",
        "presence": "présent"
      },
      {
        "acteurRef": "PA719060",
        "presence": "présent"
      },
      {
        "acteurRef": "PA722202",
        "presence": "absent"
      },
      {
        "acteurRef": "PA719994",
        "presence": "présent"
      },
      {
        "acteurRef": "PA609245",
        "presence": "présent"
      },
      {
        "acteurRef": "PA722228",
        "presence": "présent"
      },
      {
        "acteurRef": "PA719404",
        "presence": "présent"
      },
      {
        "acteurRef": "PA608016",
        "presence": "présent"
      },
      {
        "acteurRef": "PA721530",
        "presence": "excusé"
      },
      {
        "acteurRef": "PA719154",
        "presence": "absent"
      },
      {
        "acteurRef": "PA720728",
        "presence": "présent"
      },
      {
        "acteurRef": "PA719130",
        "presence": "présent"
      },
      {
        "acteurRef": "PA2377",
        "presence": "absent"
      },
      {
        "acteurRef": "PA608172",
        "presence": "présent"
      },
      {
        "acteurRef": "PA719600",
        "presence": "présent"
      },
      {
        "acteurRef": "PA720100",
        "presence": "absent"
      },
      {
        "acteurRef": "PA722398",
        "presence": "absent"
      },
      {
        "acteurRef": "PA340343",
        "presence": "absent"
      },
      {
        "acteurRef": "PA718860",
        "presence": "absent"
      },
      {
        "acteurRef": "PA709315",
        "presence": "présent"
      },
      {
        "acteurRef": "PA722102",
        "presence": "présent"
      },
      {
        "acteurRef": "PA721262",
        "presence": "absent"
      }
    ]
  },
  "ouverturePresse": true,
  "odj": {
    "convocationOdj": [
      "Audition de M. Dominique Bussereau, président de l’Assemblée des départements de France.Création de deux missions flash portant sur :• l’expérimentation et la différenciation territoriale ;• l’autonomie financière des collectivités territoriales."
    ],
    "resumeOdj": [
      "audition de M. Dominique Bussereau, président de l’Assemblée des départements de France ;",
      "création de deux missions flash portant sur :",
      "l’expérimentation et la différenciation territoriale ;",
      "l’autonomie financière des collectivités territoriales."
    ]
  },
  "compteRenduRef": "CRCANR5L15S2018PO744127N003",
  "formatReunion": "Ordinaire",
  "infosReunionsInternationale": {
    "estReunionInternationale": false
  },
  "captationVideo": false
}