{
  "xsiType": "reunionInitParlementaire_type",
  "uid": "RUANR5L15S2019IDF0138455",
  "timestampDebut": "2019-09-25T16:30:00.000+02:00",
  "timestampFin": "2019-09-25T19:30:00.000+02:00",
  "lieu": {
    "code": "SALREU042",
    "libelleCourt": "Salle 6566",
    "libelleLong": "Salle 6566, Palais Bourbon"
  },
  "cycleDeVie": {
    "etat": "Confirmé",
    "chrono": {
      "creation": "2019-08-19T16:02:57.000+02:00"
    }
  },
  "demandeurs": {
    "acteurs": [
      {
        "nom": "M. Aurélien PRADIÉ",
        "acteurRef": "PA720100"
      }
    ]
  },
  "typeReunion": "DEP"
}