{
  "xsiType": "reunionInitParlementaire_type",
  "uid": "RUANR5L15S2019IDF0129099",
  "timestampDebut": "2019-04-02T17:00:00.000+02:00",
  "timestampFin": "2019-04-02T18:30:00.000+02:00",
  "lieu": {
    "code": "SALREU022",
    "libelleCourt": "Salle 7326",
    "libelleLong": "Salle 7326, 101, rue de l'Université"
  },
  "cycleDeVie": {
    "etat": "Annulé",
    "chrono": {
      "creation": "2019-03-05T17:34:32.000+01:00",
      "cloture": "2019-03-28T12:09:56.000+01:00"
    }
  },
  "demandeurs": {
    "acteurs": [
      {
        "nom": "M. Nicolas TURQUOIS",
        "acteurRef": "PA722162"
      }
    ]
  },
  "typeReunion": "DEP"
}