{
  "xsiType": "reunionInitParlementaire_type",
  "uid": "RUANR5L15S2019IDF0138817",
  "timestampDebut": "2019-09-03T16:00:00.000+02:00",
  "timestampFin": "2019-09-03T17:00:00.000+02:00",
  "lieu": {
    "code": "SALREU006",
    "libelleCourt": "3ème Bureau",
    "libelleLong": "3ème Bureau, Palais Bourbon"
  },
  "cycleDeVie": {
    "etat": "Confirmé",
    "chrono": {
      "creation": "2019-09-02T11:58:36.000+02:00"
    }
  },
  "demandeurs": {
    "acteurs": [
      {
        "nom": "M. Jean-Louis TOURAINE",
        "acteurRef": "PA334768"
      }
    ]
  },
  "typeReunion": "DEP"
}