{
  "xsiType": "reunionInitParlementaire_type",
  "uid": "RUANR5L15S2017IDF0095552",
  "timestampDebut": "2017-09-07T16:30:00.000+02:00",
  "timestampFin": "2017-09-07T17:30:00.000+02:00",
  "lieu": {
    "code": "SALREU013",
    "libelleCourt": "Salle N° 3",
    "libelleLong": "Salle N° 3, 3, rue Aristide Briand"
  },
  "cycleDeVie": {
    "etat": "Confirmé",
    "chrono": {
      "creation": "2017-09-04T11:38:13.000+02:00"
    }
  },
  "demandeurs": {
    "acteurs": [
      {
        "nom": "Mme Frédérique DUMAS",
        "acteurRef": "PA721194"
      }
    ]
  },
  "typeReunion": "DEP"
}