{
  "xsiType": "reunionInitParlementaire_type",
  "uid": "RUANR5L15S2018IDF0113099",
  "timestampDebut": "2018-06-26T17:00:00.000+02:00",
  "timestampFin": "2018-06-26T18:00:00.000+02:00",
  "lieu": {
    "code": "SALREU006",
    "libelleCourt": "3ème Bureau",
    "libelleLong": "3ème Bureau, Palais Bourbon"
  },
  "cycleDeVie": {
    "etat": "Confirmé",
    "chrono": {
      "creation": "2018-06-06T14:24:19.000+02:00"
    }
  },
  "demandeurs": {
    "acteurs": [
      {
        "nom": "M. Jean-Louis TOURAINE",
        "acteurRef": "PA334768"
      }
    ]
  },
  "typeReunion": "DEP"
}