{
  "xsiType": "reunionInitParlementaire_type",
  "uid": "RUANR5L15S2019IDF0118732",
  "timestampDebut": "2018-10-02T16:00:00.000+02:00",
  "timestampFin": "2018-10-02T17:00:00.000+02:00",
  "lieu": {
    "code": "SALREU004",
    "libelleCourt": "1er Bureau",
    "libelleLong": "1er Bureau, Palais Bourbon"
  },
  "cycleDeVie": {
    "etat": "Confirmé",
    "chrono": {
      "creation": "2018-09-17T16:06:28.000+02:00"
    }
  },
  "demandeurs": {
    "acteurs": [
      {
        "nom": "M. Francis VERCAMER",
        "acteurRef": "PA267585"
      }
    ]
  },
  "typeReunion": "DEP"
}