{
  "xsiType": "reunionInitParlementaire_type",
  "uid": "RUANR5L15S2019IDF0127118",
  "timestampDebut": "2019-03-06T13:45:00.000+01:00",
  "timestampFin": "2019-03-06T15:00:00.000+01:00",
  "lieu": {
    "code": "SALREU021",
    "libelleCourt": "Salle 7207",
    "libelleLong": "Salle 7207, 101, rue de l'Université"
  },
  "cycleDeVie": {
    "etat": "Annulé",
    "chrono": {
      "creation": "2019-02-07T13:56:46.000+01:00",
      "cloture": "2019-03-01T16:22:06.000+01:00"
    }
  },
  "demandeurs": {
    "acteurs": [
      {
        "nom": "M. Paul CHRISTOPHE",
        "acteurRef": "PA642868"
      }
    ]
  },
  "typeReunion": "DEP"
}