{
  "xsiType": "reunionInitParlementaire_type",
  "uid": "RUANR5L15S2019IDF0131798",
  "timestampDebut": "2019-04-11T09:00:00.000+02:00",
  "timestampFin": "2019-04-11T10:00:00.000+02:00",
  "lieu": {
    "code": "SALREU023",
    "libelleCourt": "Salle 7426",
    "libelleLong": "Salle 7426, 101, rue de l'Université"
  },
  "cycleDeVie": {
    "etat": "Confirmé",
    "chrono": {
      "creation": "2019-04-05T16:52:35.000+02:00"
    }
  },
  "demandeurs": {
    "acteurs": [
      {
        "nom": "Mme Anissa KHEDHER",
        "acteurRef": "PA722300"
      }
    ]
  },
  "typeReunion": "DEP"
}