{
  "xsiType": "reunionInitParlementaire_type",
  "uid": "RUANR5L15S2019IDF0113544",
  "timestampDebut": "2018-10-15T12:00:00.000+02:00",
  "timestampFin": "2018-10-15T20:00:00.000+02:00",
  "lieu": {
    "code": "SALREU003",
    "libelleCourt": "Salle Victor Hugo",
    "libelleLong": "Salle Victor Hugo, 101, rue de l'Université"
  },
  "cycleDeVie": {
    "etat": "Annulé",
    "chrono": {
      "creation": "2018-06-12T18:39:40.000+02:00",
      "cloture": "2018-09-24T08:59:56.000+02:00"
    }
  },
  "demandeurs": {
    "acteurs": [
      {
        "nom": "M. Olivier FALORNI",
        "acteurRef": "PA605694"
      }
    ]
  },
  "typeReunion": "DEP"
}