{
  "xsiType": "reunionInitParlementaire_type",
  "uid": "RUANR5L15S2018IDF0112670",
  "timestampDebut": "2018-06-19T14:15:00.000+02:00",
  "timestampFin": "2018-06-19T15:15:00.000+02:00",
  "lieu": {
    "code": "SALREU023",
    "libelleCourt": "Salle 7426",
    "libelleLong": "Salle 7426, 101, rue de l'Université"
  },
  "cycleDeVie": {
    "etat": "Annulé",
    "chrono": {
      "creation": "2018-05-31T09:51:37.000+02:00",
      "cloture": "2018-06-18T14:23:07.000+02:00"
    }
  },
  "demandeurs": {
    "acteurs": [
      {
        "nom": "M. Jean-François ELIAOU",
        "acteurRef": "PA719692"
      }
    ]
  },
  "typeReunion": "DEP"
}