{
  "xsiType": "reunionCommission_type",
  "uid": "RUANR5L15S2019IDC430540",
  "timestampDebut": "2018-10-31T09:30:00.000+01:00",
  "timestampFin": "2018-10-31T12:50:00.000+01:00",
  "lieu": {
    "libelleLong": "salle 6241 (Affaires économiques)"
  },
  "cycleDeVie": {
    "etat": "Confirmé",
    "chrono": {
      "creation": "2018-10-04T00:00:00.000+02:00"
    }
  },
  "organeReuniRef": "PO419610",
  "participants": {
    "participantsInternes": [
      {
        "acteurRef": "PA722038",
        "presence": "présent"
      },
      {
        "acteurRef": "PA721278",
        "presence": "présent"
      },
      {
        "acteurRef": "PA335999",
        "presence": "absent"
      },
      {
        "acteurRef": "PA342415",
        "presence": "présent"
      },
      {
        "acteurRef": "PA722170",
        "presence": "présent"
      },
      {
        "acteurRef": "PA720362",
        "presence": "présent"
      },
      {
        "acteurRef": "PA332228",
        "presence": "présent"
      },
      {
        "acteurRef": "PA718876",
        "presence": "excusé"
      },
      {
        "acteurRef": "PA722312",
        "presence": "présent"
      },
      {
        "acteurRef": "PA718990",
        "presence": "présent"
      },
      {
        "acteurRef": "PA608641",
        "presence": "présent"
      },
      {
        "acteurRef": "PA720162",
        "presence": "présent"
      },
      {
        "acteurRef": "PA642695",
        "presence": "absent"
      },
      {
        "acteurRef": "PA336316",
        "presence": "excusé"
      },
      {
        "acteurRef": "PA720546",
        "presence": "présent"
      },
      {
        "acteurRef": "PA720116",
        "presence": "présent"
      },
      {
        "acteurRef": "PA767",
        "presence": "présent"
      },
      {
        "acteurRef": "PA720814",
        "presence": "présent"
      },
      {
        "acteurRef": "PA719440",
        "presence": "absent"
      },
      {
        "acteurRef": "PA267429",
        "presence": "présent"
      },
      {
        "acteurRef": "PA721808",
        "presence": "présent"
      },
      {
        "acteurRef": "PA607155",
        "presence": "présent"
      },
      {
        "acteurRef": "PA267450",
        "presence": "présent"
      },
      {
        "acteurRef": "PA719258",
        "presence": "présent"
      },
      {
        "acteurRef": "PA719830",
        "presence": "présent"
      },
      {
        "acteurRef": "PA720598",
        "presence": "présent"
      },
      {
        "acteurRef": "PA720386",
        "presence": "présent"
      },
      {
        "acteurRef": "PA712015",
        "presence": "excusé"
      },
      {
        "acteurRef": "PA721718",
        "presence": "présent"
      },
      {
        "acteurRef": "PA719660",
        "presence": "excusé"
      },
      {
        "acteurRef": "PA720664",
        "presence": "présent"
      },
      {
        "acteurRef": "PA334149",
        "presence": "présent"
      },
      {
        "acteurRef": "PA719960",
        "presence": "excusé"
      },
      {
        "acteurRef": "PA719652",
        "presence": "présent"
      },
      {
        "acteurRef": "PA722094",
        "presence": "présent"
      },
      {
        "acteurRef": "PA267355",
        "presence": "présent"
      },
      {
        "acteurRef": "PA719700",
        "presence": "absent"
      },
      {
        "acteurRef": "PA722202",
        "presence": "présent"
      },
      {
        "acteurRef": "PA719372",
        "presence": "présent"
      },
      {
        "acteurRef": "PA719504",
        "presence": "excusé"
      },
      {
        "acteurRef": "PA331567",
        "presence": "absent"
      },
      {
        "acteurRef": "PA719310",
        "presence": "excusé"
      },
      {
        "acteurRef": "PA721852",
        "presence": "présent"
      },
      {
        "acteurRef": "PA340853",
        "presence": "absent"
      },
      {
        "acteurRef": "PA719388",
        "presence": "présent"
      },
      {
        "acteurRef": "PA721134",
        "presence": "excusé"
      },
      {
        "acteurRef": "PA337483",
        "presence": "présent"
      },
      {
        "acteurRef": "PA719858",
        "presence": "présent"
      },
      {
        "acteurRef": "PA720378",
        "presence": "présent"
      },
      {
        "acteurRef": "PA719154",
        "presence": "absent"
      },
      {
        "acteurRef": "PA720976",
        "presence": "excusé"
      },
      {
        "acteurRef": "PA719338",
        "presence": "présent"
      },
      {
        "acteurRef": "PA720630",
        "presence": "présent"
      },
      {
        "acteurRef": "PA607619",
        "presence": "présent"
      },
      {
        "acteurRef": "PA719242",
        "presence": "présent"
      },
      {
        "acteurRef": "PA719520",
        "presence": "présent"
      },
      {
        "acteurRef": "PA720644",
        "presence": "présent"
      },
      {
        "acteurRef": "PA719364",
        "presence": "excusé"
      },
      {
        "acteurRef": "PA720108",
        "presence": "présent"
      },
      {
        "acteurRef": "PA720606",
        "presence": "présent"
      },
      {
        "acteurRef": "PA718784",
        "presence": "présent"
      },
      {
        "acteurRef": "PA718930",
        "presence": "présent"
      },
      {
        "acteurRef": "PA607553",
        "presence": "présent"
      },
      {
        "acteurRef": "PA720590",
        "presence": "présent"
      },
      {
        "acteurRef": "PA720092",
        "presence": "présent"
      },
      {
        "acteurRef": "PA266808",
        "presence": "présent"
      },
      {
        "acteurRef": "PA722142",
        "presence": "absent"
      },
      {
        "acteurRef": "PA720780",
        "presence": "présent"
      },
      {
        "acteurRef": "PA719420",
        "presence": "présent"
      },
      {
        "acteurRef": "PA334654",
        "presence": "présent"
      },
      {
        "acteurRef": "PA2792",
        "presence": "absent"
      },
      {
        "acteurRef": "PA718860",
        "presence": "présent"
      },
      {
        "acteurRef": "PA720014",
        "presence": "absent"
      },
      {
        "acteurRef": "PA608741",
        "presence": "absent"
      },
      {
        "acteurRef": "PA722162",
        "presence": "présent"
      },
      {
        "acteurRef": "PA709315",
        "presence": "présent"
      },
      {
        "acteurRef": "PA421348",
        "presence": "présent"
      }
    ]
  },
  "ouverturePresse": true,
  "odj": {
    "convocationOdj": [
      "Projet de loi de finances pour 2019 (n° 1255) :- mission « Écologie, développement et mobilité durables » :  . Énergie (Mme Marie-Noëlle Battistel, rapporteure pour avis).  . Économie sociale et solidaire (M. Yves Blein, rapporteur pour avis).- mission « Recherche et enseignement supérieur » :  . Grands organismes de recherche (M. Richard Lioger, rapporteur pour avis).- mission « Action extérieure de l’État » :  . Tourisme (M. Éric Pauget, rapporteur pour avis).- mission « Economie » (suite) :  . Industrie (Mme Bénédicte Taurine, rapporteure pour avis)."
    ],
    "resumeOdj": [
      "- projet de loi de finances pour 2019 (n° 1255) :- mission « Écologie, développement et mobilité durables » :- Énergie (Mme Marie-Noëlle Battistel, rapporteure pour avis) ;- Économie sociale et solidaire (M. Yves Blein, rapporteur pour avis) ;- mission « Recherche et enseignement supérieur » :- Grands organismes de recherche (M. Richard Lioger, rapporteur pour avis) ;- mission « Action extérieure de l’État » :- Tourisme (M. Éric Pauget, rapporteur pour avis).- mission « Economie » (suite) :  . Industrie (Mme Bénédicte Taurine, rapporteure pour avis)."
    ],
    "pointsOdj": [
      {
        "xsiType": "podjReunion_type",
        "uid": "RUANR5L15S2019IDC430540PT26035",
        "cycleDeVie": {
          "etat": "Eventuel",
          "chrono": {
            "creation": "2018-10-04T00:00:00.000+02:00"
          }
        },
        "objet": "Examen du texte",
        "dossiersLegislatifsRefs": [
          "DLR5L15N36733"
        ],
        "typePointOdj": "Examen",
        "comiteSecret": false
      }
    ]
  },
  "compteRenduRef": "CRCANR5L15S2019PO419610N007",
  "formatReunion": "Ordinaire",
  "infosReunionsInternationale": {
    "estReunionInternationale": false
  },
  "captationVideo": false
}