{
  "xsiType": "reunionCommission_type",
  "uid": "RUANR5L15S2020IDC433971",
  "timestampDebut": "2019-10-17T09:00:00.000+02:00",
  "lieu": {
    "libelleLong": "salle du CEC"
  },
  "cycleDeVie": {
    "etat": "Confirmé",
    "chrono": {
      "creation": "2019-10-15T00:00:00.000+02:00"
    }
  },
  "organeReuniRef": "PO760976",
  "participants": {
    "participantsInternes": [
      {
        "acteurRef": "PA721718",
        "presence": "présent"
      },
      {
        "acteurRef": "PA720684",
        "presence": "présent"
      }
    ]
  },
  "ouverturePresse": false,
  "odj": {
    "convocationOdj": [
      "Audition commune de M. Lionel Ragot, professeur d'économie à l'université de Paris Nanterre, conseiller scientifique au CEPII et de Mme Amélie Verdier, directrice du budget, ministère de l'action et des comptes publics."
    ],
    "resumeOdj": [
      "audition commune de M. Lionel Ragot, professeur d'économie à l'université de Paris Nanterre, conseiller scientifique au CEPII et de Mme Amélie Verdier, directrice du budget, ministère de l'action et des comptes publics."
    ]
  },
  "formatReunion": "Ordinaire",
  "infosReunionsInternationale": {
    "estReunionInternationale": false
  },
  "captationVideo": false
}