{
  "xsiType": "reunionInitParlementaire_type",
  "uid": "RUANR5L15S2019IDF0131939",
  "timestampDebut": "2019-06-18T10:15:00.000+02:00",
  "timestampFin": "2019-06-18T12:30:00.000+02:00",
  "lieu": {
    "code": "SALREU008",
    "libelleCourt": "5ème Bureau",
    "libelleLong": "5ème Bureau, Palais Bourbon"
  },
  "cycleDeVie": {
    "etat": "Confirmé",
    "chrono": {
      "creation": "2019-04-08T18:16:30.000+02:00"
    }
  },
  "demandeurs": {
    "organe": {
      "nom": "GROUPE LIBERTÉS ET TERRITOIRES",
      "organeRef": "PO759900"
    }
  },
  "organeReuniRef": "PO759900",
  "typeReunion": "GP"
}