{
  "xsiType": "reunionInitParlementaire_type",
  "uid": "RUANR5L15S2018IDF0103171",
  "timestampDebut": "2018-01-24T16:00:00.000+01:00",
  "timestampFin": "2018-01-24T17:30:00.000+01:00",
  "lieu": {
    "code": "SALREU048",
    "libelleCourt": "Salle 6809",
    "libelleLong": "Salle 6809, Palais Bourbon"
  },
  "cycleDeVie": {
    "etat": "Confirmé",
    "chrono": {
      "creation": "2018-01-04T17:16:18.000+01:00"
    }
  },
  "demandeurs": {
    "acteurs": [
      {
        "nom": "Mme Laurence MAILLART-MÉHAIGNERIE",
        "acteurRef": "PA719718"
      }
    ]
  },
  "typeReunion": "DEP"
}