{
  "xsiType": "reunionCommission_type",
  "uid": "RUANR5L15S2019IDC430651",
  "timestampDebut": "2018-10-30T10:30:00.000+01:00",
  "timestampFin": "2018-10-30T11:45:00.000+01:00",
  "lieu": {
    "libelleLong": "salle 6351 (Affaires sociales)"
  },
  "cycleDeVie": {
    "etat": "Confirmé",
    "chrono": {
      "creation": "2018-10-19T00:00:00.000+02:00"
    }
  },
  "organeReuniRef": "PO757118",
  "participants": {
    "participantsInternes": [
      {
        "acteurRef": "PA719318",
        "presence": "absent"
      },
      {
        "acteurRef": "PA642764",
        "presence": "absent"
      },
      {
        "acteurRef": "PA642847",
        "presence": "présent"
      },
      {
        "acteurRef": "PA719488",
        "presence": "présent"
      },
      {
        "acteurRef": "PA508",
        "presence": "absent"
      },
      {
        "acteurRef": "PA721608",
        "presence": "absent"
      },
      {
        "acteurRef": "PA330008",
        "presence": "absent"
      },
      {
        "acteurRef": "PA721336",
        "presence": "présent"
      },
      {
        "acteurRef": "PA689",
        "presence": "absent"
      },
      {
        "acteurRef": "PA721166",
        "presence": "absent"
      },
      {
        "acteurRef": "PA719790",
        "presence": "absent"
      },
      {
        "acteurRef": "PA722126",
        "presence": "absent"
      },
      {
        "acteurRef": "PA942",
        "presence": "absent"
      },
      {
        "acteurRef": "PA720154",
        "presence": "excusé"
      },
      {
        "acteurRef": "PA720996",
        "presence": "absent"
      },
      {
        "acteurRef": "PA719692",
        "presence": "absent"
      },
      {
        "acteurRef": "PA721564",
        "presence": "absent"
      },
      {
        "acteurRef": "PA267780",
        "presence": "absent"
      },
      {
        "acteurRef": "PA718706",
        "presence": "présent"
      },
      {
        "acteurRef": "PA721384",
        "presence": "absent"
      },
      {
        "acteurRef": "PA721992",
        "presence": "absent"
      },
      {
        "acteurRef": "PA267318",
        "presence": "absent"
      },
      {
        "acteurRef": "PA608416",
        "presence": "absent"
      },
      {
        "acteurRef": "PA720074",
        "presence": "présent"
      },
      {
        "acteurRef": "PA720446",
        "presence": "absent"
      },
      {
        "acteurRef": "PA720870",
        "presence": "excusé"
      },
      {
        "acteurRef": "PA719072",
        "presence": "absent"
      },
      {
        "acteurRef": "PA721960",
        "presence": "absent"
      },
      {
        "acteurRef": "PA267260",
        "presence": "absent"
      },
      {
        "acteurRef": "PA721286",
        "presence": "présent"
      },
      {
        "acteurRef": "PA718810",
        "presence": "absent"
      },
      {
        "acteurRef": "PA722022",
        "presence": "présent"
      },
      {
        "acteurRef": "PA719350",
        "presence": "présent"
      },
      {
        "acteurRef": "PA720568",
        "presence": "absent"
      },
      {
        "acteurRef": "PA334768",
        "presence": "présent"
      },
      {
        "acteurRef": "PA718728",
        "presence": "absent"
      },
      {
        "acteurRef": "PA722102",
        "presence": "présent"
      }
    ]
  },
  "ouverturePresse": true,
  "odj": {
    "convocationOdj": [
      "– Audition de M. Jean-Louis Mandel, professeur honoraire au collège de France, titulaire de la chaire Génétique humaine"
    ],
    "resumeOdj": [
      "audition de M. Jean-Louis Mandel, professeur honoraire au collège de France, titulaire de la chaire Génétique humaine."
    ]
  },
  "compteRenduRef": "CRCANR5L15S2019PO757118N053",
  "formatReunion": "Ordinaire",
  "infosReunionsInternationale": {
    "estReunionInternationale": false
  },
  "captationVideo": false
}