{
  "xsiType": "reunionInitParlementaire_type",
  "uid": "RUANR5L15S2019IDF0132241",
  "timestampDebut": "2019-05-14T11:00:00.000+02:00",
  "timestampFin": "2019-05-14T13:00:00.000+02:00",
  "lieu": {
    "code": "SALREU013",
    "libelleCourt": "Salle N° 3",
    "libelleLong": "Salle N° 3, 3, rue Aristide Briand"
  },
  "cycleDeVie": {
    "etat": "Confirmé",
    "chrono": {
      "creation": "2019-04-12T11:14:37.000+02:00"
    }
  },
  "demandeurs": {
    "acteurs": [
      {
        "nom": "M. Olivier MARLEIX",
        "acteurRef": "PA606098"
      }
    ]
  },
  "typeReunion": "DEP"
}