{
  "xsiType": "reunionCommission_type",
  "uid": "RUANR5L15S2018IDC429615",
  "timestampDebut": "2018-06-05T14:00:00.000+02:00",
  "lieu": {
    "libelleLong": "salle 6822 (126 rue de l'Université 6ème étage)"
  },
  "cycleDeVie": {
    "etat": "Confirmé",
    "chrono": {
      "creation": "2018-05-25T00:00:00.000+02:00"
    }
  },
  "organeReuniRef": "PO744338",
  "participants": {},
  "ouverturePresse": false,
  "odj": {
    "convocationOdj": [
      "– Entretien avec M. Matthew Lodge, ministre plénipotentiaire à l’ambassade du Royaume-Uni en France et ambassadeur auprès de l’UNESCO."
    ],
    "resumeOdj": [
      "entretien avec M. Matthew Lodge, ministre plénipotentiaire à l’ambassade du Royaume-Uni en France et ambassadeur auprès de l’UNESCO."
    ]
  },
  "formatReunion": "Ordinaire",
  "infosReunionsInternationale": {
    "estReunionInternationale": false
  },
  "captationVideo": false
}