{
  "xsiType": "reunionCommission_type",
  "uid": "RUANR5L15S2019IDC432292",
  "timestampDebut": "2019-04-17T12:00:00.000+02:00",
  "cycleDeVie": {
    "etat": "Confirmé",
    "chrono": {
      "creation": "2019-04-08T00:00:00.000+02:00"
    }
  },
  "organeReuniRef": "PO59047",
  "participants": {},
  "ouverturePresse": false,
  "odj": {
    "convocationOdj": [
      "Entretien de Mme Marielle de Sarnez, présidente, avec M. Zohrab Mnatasakanian, ministre des affaires étrangères de la République d'Arménie."
    ],
    "resumeOdj": [
      "entretien de Mme Marielle de Sarnez, présidente, avec M. Zohrab Mnatasakanian, ministre des affaires étrangères de la République d'Arménie."
    ]
  },
  "formatReunion": "Ordinaire",
  "infosReunionsInternationale": {
    "estReunionInternationale": true,
    "listePays": [
      "GOP756481"
    ],
    "informationsComplementaires": "bureau 4211 - Didier Le Bot – 34205"
  },
  "captationVideo": false
}