{
  "xsiType": "reunionInitParlementaire_type",
  "uid": "RUANR5L15S2019IDF0133779",
  "timestampDebut": "2019-05-23T14:00:00.000+02:00",
  "timestampFin": "2019-05-23T15:00:00.000+02:00",
  "lieu": {
    "code": "SALREU013",
    "libelleCourt": "Salle N° 3",
    "libelleLong": "Salle N° 3, 3, rue Aristide Briand"
  },
  "cycleDeVie": {
    "etat": "Confirmé",
    "chrono": {
      "creation": "2019-05-14T15:33:57.000+02:00"
    }
  },
  "demandeurs": {
    "acteurs": [
      {
        "nom": "Mme Bénédicte PEYROL",
        "acteurRef": "PA718736"
      }
    ]
  },
  "typeReunion": "DEP"
}