{
  "xsiType": "reunionCommission_type",
  "uid": "RUANR5L15S2018IDC429894",
  "timestampDebut": "2018-06-27T18:00:00.000+02:00",
  "lieu": {
    "libelleLong": "(salle n° 3, 3 rue Aristide Briand) :"
  },
  "cycleDeVie": {
    "etat": "Confirmé",
    "chrono": {
      "creation": "2018-06-20T00:00:00.000+02:00"
    }
  },
  "organeReuniRef": "PO738799",
  "participants": {},
  "ouverturePresse": false,
  "odj": {
    "convocationOdj": [
      "Audition de M. Jean-Paul Delahaye, inspecteur général honoraire de l'éducation nationale, ancien directeur général de l'enseignement scolaire."
    ],
    "resumeOdj": [
      "audition de M. Jean-Paul Delahaye, inspecteur général honoraire de l'éducation nationale, ancien directeur général de l'enseignement scolaire."
    ]
  },
  "formatReunion": "Ordinaire",
  "infosReunionsInternationale": {
    "estReunionInternationale": false
  },
  "captationVideo": false
}