{
  "xsiType": "reunionCommission_type",
  "uid": "RUANR5L15S2018IDC427552",
  "timestampDebut": "2017-11-08T16:15:00.000+01:00",
  "timestampFin": "2017-11-08T20:00:00.000+01:00",
  "lieu": {
    "libelleLong": "salle 6351 (Affaires sociales)"
  },
  "cycleDeVie": {
    "etat": "Confirmé",
    "chrono": {
      "creation": "2017-10-12T00:00:00.000+02:00"
    }
  },
  "organeReuniRef": "PO420120",
  "participants": {
    "participantsInternes": [
      {
        "acteurRef": "PA642764",
        "presence": "présent"
      },
      {
        "acteurRef": "PA718744",
        "presence": "présent"
      },
      {
        "acteurRef": "PA610681",
        "presence": "présent"
      },
      {
        "acteurRef": "PA642847",
        "presence": "présent"
      },
      {
        "acteurRef": "PA720362",
        "presence": "absent"
      },
      {
        "acteurRef": "PA720968",
        "presence": "excusé"
      },
      {
        "acteurRef": "PA720822",
        "presence": "absent"
      },
      {
        "acteurRef": "PA719980",
        "presence": "présent"
      },
      {
        "acteurRef": "PA608083",
        "presence": "présent"
      },
      {
        "acteurRef": "PA713448",
        "presence": "absent"
      },
      {
        "acteurRef": "PA721336",
        "presence": "absent"
      },
      {
        "acteurRef": "PA720468",
        "presence": "absent"
      },
      {
        "acteurRef": "PA856",
        "presence": "présent"
      },
      {
        "acteurRef": "PA722126",
        "presence": "présent"
      },
      {
        "acteurRef": "PA719756",
        "presence": "présent"
      },
      {
        "acteurRef": "PA722390",
        "presence": "absent"
      },
      {
        "acteurRef": "PA720932",
        "presence": "présent"
      },
      {
        "acteurRef": "PA718694",
        "presence": "présent"
      },
      {
        "acteurRef": "PA718926",
        "presence": "présent"
      },
      {
        "acteurRef": "PA267289",
        "presence": "absent"
      },
      {
        "acteurRef": "PA608292",
        "presence": "absent"
      },
      {
        "acteurRef": "PA720046",
        "presence": "présent"
      },
      {
        "acteurRef": "PA720924",
        "presence": "absent"
      },
      {
        "acteurRef": "PA719570",
        "presence": "présent"
      },
      {
        "acteurRef": "PA720286",
        "presence": "présent"
      },
      {
        "acteurRef": "PA267780",
        "presence": "absent"
      },
      {
        "acteurRef": "PA718706",
        "presence": "absent"
      },
      {
        "acteurRef": "PA721246",
        "presence": "présent"
      },
      {
        "acteurRef": "PA721992",
        "presence": "présent"
      },
      {
        "acteurRef": "PA720170",
        "presence": "absent"
      },
      {
        "acteurRef": "PA722062",
        "presence": "présent"
      },
      {
        "acteurRef": "PA267318",
        "presence": "absent"
      },
      {
        "acteurRef": "PA721126",
        "presence": "excusé"
      },
      {
        "acteurRef": "PA720326",
        "presence": "absent"
      },
      {
        "acteurRef": "PA331835",
        "presence": "absent"
      },
      {
        "acteurRef": "PA722374",
        "presence": "absent"
      },
      {
        "acteurRef": "PA720074",
        "presence": "présent"
      },
      {
        "acteurRef": "PA719186",
        "presence": "présent"
      },
      {
        "acteurRef": "PA719842",
        "presence": "présent"
      },
      {
        "acteurRef": "PA720916",
        "presence": "absent"
      },
      {
        "acteurRef": "PA720480",
        "presence": "absent"
      },
      {
        "acteurRef": "PA267378",
        "presence": "absent"
      },
      {
        "acteurRef": "PA608016",
        "presence": "présent"
      },
      {
        "acteurRef": "PA606712",
        "presence": "présent"
      },
      {
        "acteurRef": "PA717379",
        "presence": "présent"
      },
      {
        "acteurRef": "PA719072",
        "presence": "présent"
      },
      {
        "acteurRef": "PA720738",
        "presence": "présent"
      },
      {
        "acteurRef": "PA610654",
        "presence": "excusé"
      },
      {
        "acteurRef": "PA2377",
        "presence": "présent"
      },
      {
        "acteurRef": "PA720500",
        "presence": "présent"
      },
      {
        "acteurRef": "PA721710",
        "presence": "présent"
      },
      {
        "acteurRef": "PA720512",
        "presence": "présent"
      },
      {
        "acteurRef": "PA718910",
        "presence": "présent"
      },
      {
        "acteurRef": "PA720422",
        "presence": "présent"
      },
      {
        "acteurRef": "PA721286",
        "presence": "absent"
      },
      {
        "acteurRef": "PA721070",
        "presence": "présent"
      },
      {
        "acteurRef": "PA721062",
        "presence": "présent"
      },
      {
        "acteurRef": "PA718810",
        "presence": "présent"
      },
      {
        "acteurRef": "PA722022",
        "presence": "présent"
      },
      {
        "acteurRef": "PA721110",
        "presence": "excusé"
      },
      {
        "acteurRef": "PA720952",
        "presence": "présent"
      },
      {
        "acteurRef": "PA719350",
        "presence": "absent"
      },
      {
        "acteurRef": "PA722086",
        "presence": "présent"
      },
      {
        "acteurRef": "PA334768",
        "presence": "absent"
      },
      {
        "acteurRef": "PA719540",
        "presence": "absent"
      },
      {
        "acteurRef": "PA643145",
        "presence": "présent"
      },
      {
        "acteurRef": "PA643134",
        "presence": "absent"
      },
      {
        "acteurRef": "PA719930",
        "presence": "présent"
      },
      {
        "acteurRef": "PA721924",
        "presence": "présent"
      },
      {
        "acteurRef": "PA642788",
        "presence": "présent"
      },
      {
        "acteurRef": "PA267585",
        "presence": "présent"
      },
      {
        "acteurRef": "PA722102",
        "presence": "présent"
      },
      {
        "acteurRef": "PA719512",
        "presence": "absent"
      },
      {
        "acteurRef": "PA721474",
        "presence": "présent"
      },
      {
        "acteurRef": "PA722268",
        "presence": "présent"
      }
    ]
  },
  "ouverturePresse": true,
  "odj": {
    "convocationOdj": [
      "– Suite de l’examen des articles sur le projet de loi ratifiant diverses ordonnances prises sur le fondement de la loi n° 2017-1340 du 15 septembre 2017 d’habilitation à prendre les mesures pour le renforcement du dialogue social (n° 237) (M. Laurent Pietraszewski, rapporteur)"
    ],
    "resumeOdj": [
      "examen des articles sur le projet de loi ratifiant diverses ordonnances prises sur le fondement de la loi n° 2017-1340 du 15 septembre 2017 d’habilitation à prendre les mesures pour le renforcement du dialogue social (n° 237) (suite)."
    ],
    "pointsOdj": [
      {
        "xsiType": "podjReunion_type",
        "uid": "RUANR5L15S2018IDC427552PT25117",
        "cycleDeVie": {
          "etat": "Eventuel",
          "chrono": {
            "creation": "2017-10-12T00:00:00.000+02:00"
          }
        },
        "objet": "Examen du texte",
        "dossiersLegislatifsRefs": [
          "DLR5L15N35986"
        ],
        "typePointOdj": "Examen",
        "comiteSecret": false
      }
    ]
  },
  "compteRenduRef": "CRCANR5L15S2018PO420120N020",
  "formatReunion": "Ordinaire",
  "infosReunionsInternationale": {
    "estReunionInternationale": false
  },
  "captationVideo": false
}