{
  "xsiType": "reunionInitParlementaire_type",
  "uid": "RUANR5L15S2018IDF0101590",
  "timestampDebut": "2017-12-12T13:45:00.000+01:00",
  "timestampFin": "2017-12-12T15:00:00.000+01:00",
  "lieu": {
    "code": "SALREU007",
    "libelleCourt": "4ème Bureau",
    "libelleLong": "4ème Bureau, Palais Bourbon"
  },
  "cycleDeVie": {
    "etat": "Confirmé",
    "chrono": {
      "creation": "2017-11-29T15:24:11.000+01:00"
    }
  },
  "demandeurs": {
    "acteurs": [
      {
        "nom": "Mme Mireille CLAPOT",
        "acteurRef": "PA719294"
      }
    ]
  },
  "typeReunion": "DEP"
}