{
  "xsiType": "reunionCommission_type",
  "uid": "RUANR5L15S2019IDC430175",
  "timestampDebut": "2018-10-18T09:00:00.000+02:00",
  "timestampFin": "2018-10-18T11:45:00.000+02:00",
  "lieu": {
    "libelleLong": "salle 4123 (33 rue Saint-Dominique)"
  },
  "cycleDeVie": {
    "etat": "Confirmé",
    "chrono": {
      "creation": "2018-07-26T00:00:00.000+02:00"
    }
  },
  "organeReuniRef": "PO59046",
  "participants": {
    "participantsInternes": [
      {
        "acteurRef": "PA605036",
        "presence": "absent"
      },
      {
        "acteurRef": "PA720798",
        "presence": "absent"
      },
      {
        "acteurRef": "PA606675",
        "presence": "excusé"
      },
      {
        "acteurRef": "PA721158",
        "presence": "absent"
      },
      {
        "acteurRef": "PA719100",
        "presence": "absent"
      },
      {
        "acteurRef": "PA719770",
        "presence": "excusé"
      },
      {
        "acteurRef": "PA721776",
        "presence": "absent"
      },
      {
        "acteurRef": "PA721522",
        "presence": "présent"
      },
      {
        "acteurRef": "PA642847",
        "presence": "présent"
      },
      {
        "acteurRef": "PA642935",
        "presence": "absent"
      },
      {
        "acteurRef": "PA719910",
        "presence": "absent"
      },
      {
        "acteurRef": "PA719024",
        "presence": "présent"
      },
      {
        "acteurRef": "PA718756",
        "presence": "absent"
      },
      {
        "acteurRef": "PA755549",
        "presence": "excusé"
      },
      {
        "acteurRef": "PA672",
        "presence": "présent"
      },
      {
        "acteurRef": "PA720622",
        "presence": "présent"
      },
      {
        "acteurRef": "PA429893",
        "presence": "excusé"
      },
      {
        "acteurRef": "PA719790",
        "presence": "absent"
      },
      {
        "acteurRef": "PA267306",
        "presence": "présent"
      },
      {
        "acteurRef": "PA606212",
        "presence": "absent"
      },
      {
        "acteurRef": "PA721210",
        "presence": "excusé"
      },
      {
        "acteurRef": "PA719266",
        "presence": "présent"
      },
      {
        "acteurRef": "PA342935",
        "presence": "présent"
      },
      {
        "acteurRef": "PA606202",
        "presence": "excusé"
      },
      {
        "acteurRef": "PA609332",
        "presence": "excusé"
      },
      {
        "acteurRef": "PA267042",
        "presence": "excusé"
      },
      {
        "acteurRef": "PA606171",
        "presence": "excusé"
      },
      {
        "acteurRef": "PA643103",
        "presence": "absent"
      },
      {
        "acteurRef": "PA719938",
        "presence": "excusé"
      },
      {
        "acteurRef": "PA722134",
        "presence": "excusé"
      },
      {
        "acteurRef": "PA267673",
        "presence": "absent"
      },
      {
        "acteurRef": "PA721384",
        "presence": "absent"
      },
      {
        "acteurRef": "PA266774",
        "presence": "absent"
      },
      {
        "acteurRef": "PA267735",
        "presence": "absent"
      },
      {
        "acteurRef": "PA722358",
        "presence": "absent"
      },
      {
        "acteurRef": "PA719326",
        "presence": "absent"
      },
      {
        "acteurRef": "PA719330",
        "presence": "absent"
      },
      {
        "acteurRef": "PA721792",
        "presence": "absent"
      },
      {
        "acteurRef": "PA720354",
        "presence": "présent"
      },
      {
        "acteurRef": "PA721012",
        "presence": "excusé"
      },
      {
        "acteurRef": "PA719052",
        "presence": "présent"
      },
      {
        "acteurRef": "PA722300",
        "presence": "présent"
      },
      {
        "acteurRef": "PA720846",
        "presence": "absent"
      },
      {
        "acteurRef": "PA268019",
        "presence": "excusé"
      },
      {
        "acteurRef": "PA719918",
        "presence": "présent"
      },
      {
        "acteurRef": "PA721434",
        "presence": "absent"
      },
      {
        "acteurRef": "PA267785",
        "presence": "absent"
      },
      {
        "acteurRef": "PA719396",
        "presence": "présent"
      },
      {
        "acteurRef": "PA719404",
        "presence": "absent"
      },
      {
        "acteurRef": "PA721466",
        "presence": "excusé"
      },
      {
        "acteurRef": "PA722320",
        "presence": "présent"
      },
      {
        "acteurRef": "PA721946",
        "presence": "excusé"
      },
      {
        "acteurRef": "PA2086",
        "presence": "excusé"
      },
      {
        "acteurRef": "PA721726",
        "presence": "excusé"
      },
      {
        "acteurRef": "PA721734",
        "presence": "absent"
      },
      {
        "acteurRef": "PA719668",
        "presence": "présent"
      },
      {
        "acteurRef": "PA720720",
        "presence": "absent"
      },
      {
        "acteurRef": "PA721916",
        "presence": "absent"
      },
      {
        "acteurRef": "PA608011",
        "presence": "présent"
      },
      {
        "acteurRef": "PA335758",
        "presence": "absent"
      },
      {
        "acteurRef": "PA343493",
        "presence": "présent"
      },
      {
        "acteurRef": "PA346876",
        "presence": "absent"
      },
      {
        "acteurRef": "PA643089",
        "presence": "présent"
      },
      {
        "acteurRef": "PA719822",
        "presence": "excusé"
      },
      {
        "acteurRef": "PA718780",
        "presence": "absent"
      },
      {
        "acteurRef": "PA720394",
        "presence": "excusé"
      },
      {
        "acteurRef": "PA718682",
        "presence": "absent"
      },
      {
        "acteurRef": "PA718768",
        "presence": "excusé"
      },
      {
        "acteurRef": "PA334843",
        "presence": "présent"
      },
      {
        "acteurRef": "PA1012",
        "presence": "présent"
      }
    ]
  },
  "ouverturePresse": true,
  "odj": {
    "convocationOdj": [
      "Audition, ouverte à la presse, de représentants de syndicats des personnels civils de la défense, sur le projet de loi de finances pour 2019 ;"
    ],
    "resumeOdj": [
      "audition, ouverte à la presse, de représentants de syndicats des personnels civils de la défense, sur le projet de loi de finances pour 2019."
    ]
  },
  "compteRenduRef": "CRCANR5L15S2019PO59046N014",
  "formatReunion": "Ordinaire",
  "infosReunionsInternationale": {
    "estReunionInternationale": false
  },
  "captationVideo": false
}