{
  "xsiType": "reunionCommission_type",
  "uid": "RUANR5L15S2019IDC432799",
  "timestampDebut": "2019-05-29T09:30:00.000+02:00",
  "timestampFin": "2019-05-29T10:25:00.000+02:00",
  "lieu": {
    "libelleLong": "salle 6351 (Affaires sociales)"
  },
  "cycleDeVie": {
    "etat": "Confirmé",
    "chrono": {
      "creation": "2019-05-17T00:00:00.000+02:00"
    }
  },
  "organeReuniRef": "PO420120",
  "participants": {
    "participantsInternes": [
      {
        "acteurRef": "PA718744",
        "presence": "présent"
      },
      {
        "acteurRef": "PA610681",
        "presence": "présent"
      },
      {
        "acteurRef": "PA642847",
        "presence": "présent"
      },
      {
        "acteurRef": "PA720362",
        "presence": "présent"
      },
      {
        "acteurRef": "PA720968",
        "presence": "présent"
      },
      {
        "acteurRef": "PA719980",
        "presence": "présent"
      },
      {
        "acteurRef": "PA608083",
        "presence": "présent"
      },
      {
        "acteurRef": "PA713448",
        "presence": "absent"
      },
      {
        "acteurRef": "PA721336",
        "presence": "présent"
      },
      {
        "acteurRef": "PA720468",
        "presence": "présent"
      },
      {
        "acteurRef": "PA856",
        "presence": "présent"
      },
      {
        "acteurRef": "PA722126",
        "presence": "présent"
      },
      {
        "acteurRef": "PA642868",
        "presence": "présent"
      },
      {
        "acteurRef": "PA267429",
        "presence": "présent"
      },
      {
        "acteurRef": "PA719756",
        "presence": "présent"
      },
      {
        "acteurRef": "PA722390",
        "presence": "présent"
      },
      {
        "acteurRef": "PA720932",
        "presence": "présent"
      },
      {
        "acteurRef": "PA718694",
        "presence": "présent"
      },
      {
        "acteurRef": "PA718926",
        "presence": "présent"
      },
      {
        "acteurRef": "PA267289",
        "presence": "présent"
      },
      {
        "acteurRef": "PA608292",
        "presence": "présent"
      },
      {
        "acteurRef": "PA720046",
        "presence": "présent"
      },
      {
        "acteurRef": "PA720924",
        "presence": "excusé"
      },
      {
        "acteurRef": "PA719570",
        "presence": "présent"
      },
      {
        "acteurRef": "PA720286",
        "presence": "absent"
      },
      {
        "acteurRef": "PA267780",
        "presence": "excusé"
      },
      {
        "acteurRef": "PA718706",
        "presence": "présent"
      },
      {
        "acteurRef": "PA721246",
        "presence": "présent"
      },
      {
        "acteurRef": "PA720170",
        "presence": "présent"
      },
      {
        "acteurRef": "PA267318",
        "presence": "présent"
      },
      {
        "acteurRef": "PA721126",
        "presence": "excusé"
      },
      {
        "acteurRef": "PA720326",
        "presence": "présent"
      },
      {
        "acteurRef": "PA331835",
        "presence": "présent"
      },
      {
        "acteurRef": "PA722374",
        "presence": "présent"
      },
      {
        "acteurRef": "PA720074",
        "presence": "présent"
      },
      {
        "acteurRef": "PA719186",
        "presence": "présent"
      },
      {
        "acteurRef": "PA719842",
        "presence": "présent"
      },
      {
        "acteurRef": "PA720916",
        "presence": "présent"
      },
      {
        "acteurRef": "PA720480",
        "presence": "excusé"
      },
      {
        "acteurRef": "PA337483",
        "presence": "présent"
      },
      {
        "acteurRef": "PA267378",
        "presence": "excusé"
      },
      {
        "acteurRef": "PA719858",
        "presence": "présent"
      },
      {
        "acteurRef": "PA606712",
        "presence": "présent"
      },
      {
        "acteurRef": "PA717379",
        "presence": "présent"
      },
      {
        "acteurRef": "PA719072",
        "presence": "présent"
      },
      {
        "acteurRef": "PA720738",
        "presence": "absent"
      },
      {
        "acteurRef": "PA721418",
        "presence": "absent"
      },
      {
        "acteurRef": "PA610654",
        "presence": "excusé"
      },
      {
        "acteurRef": "PA2377",
        "presence": "présent"
      },
      {
        "acteurRef": "PA721710",
        "presence": "présent"
      },
      {
        "acteurRef": "PA720512",
        "presence": "présent"
      },
      {
        "acteurRef": "PA718910",
        "presence": "présent"
      },
      {
        "acteurRef": "PA720422",
        "presence": "absent"
      },
      {
        "acteurRef": "PA721286",
        "presence": "présent"
      },
      {
        "acteurRef": "PA721070",
        "presence": "excusé"
      },
      {
        "acteurRef": "PA721062",
        "presence": "excusé"
      },
      {
        "acteurRef": "PA720066",
        "presence": "présent"
      },
      {
        "acteurRef": "PA718810",
        "presence": "présent"
      },
      {
        "acteurRef": "PA722022",
        "presence": "absent"
      },
      {
        "acteurRef": "PA721110",
        "presence": "présent"
      },
      {
        "acteurRef": "PA720952",
        "presence": "excusé"
      },
      {
        "acteurRef": "PA719350",
        "presence": "absent"
      },
      {
        "acteurRef": "PA334768",
        "presence": "présent"
      },
      {
        "acteurRef": "PA719540",
        "presence": "absent"
      },
      {
        "acteurRef": "PA643145",
        "presence": "présent"
      },
      {
        "acteurRef": "PA643134",
        "presence": "présent"
      },
      {
        "acteurRef": "PA719930",
        "presence": "présent"
      },
      {
        "acteurRef": "PA718728",
        "presence": "présent"
      },
      {
        "acteurRef": "PA721924",
        "presence": "présent"
      },
      {
        "acteurRef": "PA642788",
        "presence": "présent"
      },
      {
        "acteurRef": "PA267585",
        "presence": "absent"
      },
      {
        "acteurRef": "PA722102",
        "presence": "présent"
      },
      {
        "acteurRef": "PA719512",
        "presence": "présent"
      },
      {
        "acteurRef": "PA721474",
        "presence": "excusé"
      },
      {
        "acteurRef": "PA722268",
        "presence": "absent"
      }
    ]
  },
  "ouverturePresse": true,
  "odj": {
    "convocationOdj": [
      "Désignation d’un rapporteur sur la proposition de loi de Mme Josiane Corneloup visant à développer l’accueil familial des personnes âgées et handicapées (n° 1191)",
      "Examen, en application de l'article 140 alinéa 2 du Règlement, de la proposition de résolution tendant à la création d’une commission d’enquête sur l’impact économique, sanitaire et environnemental de l’utilisation du chlordécone et du paraquat comme insecticides agricoles dans les territoires de Guadeloupe et de Martinique, sur les responsabilités publiques et privées dans la prolongation de leur autorisation et évaluant la nécessité et les modalités d’une indemnisation des préjudices des victimes et de ces territoires (n° 1941) (M. Serge Letchimy, rapporteur)",
      "Examen, sur le rapport de Mme Brigitte Bourguignon, présidente, en application de l’article 148 du Règlement, de diverses pétitions"
    ],
    "resumeOdj": [
      "impact de l’utilisation du Chlordécone et du Paraquat comme insecticides agricoles dans les territoires de Guadeloupe et de Martinique (examen de la proposition de résolution) (n° 1941) (M. Serge Letchimy, rapporteur) ;",
      "examen, sur le rapport de Mme Brigitte Bourguignon, présidente, en application de l’article 148 du Règlement, de diverses pétitions ;",
      "désignation d'un rapporteur."
    ],
    "pointsOdj": [
      {
        "xsiType": "podjReunion_type",
        "uid": "RUANR5L15S2019IDC432799PT26632",
        "cycleDeVie": {
          "etat": "Confirmé",
          "chrono": {
            "creation": "2019-05-17T00:00:00.000+02:00"
          }
        },
        "objet": "Examen de la proposition de résolution",
        "dossiersLegislatifsRefs": [
          "DLR5L15N37466"
        ],
        "typePointOdj": "Examen",
        "comiteSecret": false
      },
      {
        "xsiType": "podjReunion_type",
        "uid": "RUANR5L15S2019IDC432799PT26648",
        "cycleDeVie": {
          "etat": "Confirmé",
          "chrono": {
            "creation": "2019-05-29T00:00:00.000+02:00"
          }
        },
        "objet": "Nomination rapporteur",
        "dossiersLegislatifsRefs": [
          "DLR5L15N36770"
        ],
        "typePointOdj": "Nomination rapporteur",
        "comiteSecret": false
      }
    ]
  },
  "compteRenduRef": "CRCANR5L15S2019PO420120N068",
  "formatReunion": "Ordinaire",
  "infosReunionsInternationale": {
    "estReunionInternationale": false
  },
  "captationVideo": false
}