{
  "xsiType": "reunionInitParlementaire_type",
  "uid": "RUANR5L15S2020IDF0139865",
  "timestampDebut": "2019-12-11T09:00:00.000+01:00",
  "timestampFin": "2019-12-11T13:00:00.000+01:00",
  "lieu": {
    "code": "SALREU011",
    "libelleCourt": "Salle N° 2",
    "libelleLong": "Salle N° 2, 3, rue Aristide Briand"
  },
  "cycleDeVie": {
    "etat": "Confirmé",
    "chrono": {
      "creation": "2019-09-12T14:17:32.000+02:00"
    }
  },
  "demandeurs": {
    "acteurs": [
      {
        "nom": "Mme Marine LE PEN",
        "acteurRef": "PA720614"
      }
    ]
  },
  "typeReunion": "DEP"
}