{
  "xsiType": "seance_type",
  "uid": "RUANR5L15S2018IDS21077",
  "timestampDebut": "2018-04-21T21:30:00.000+02:00",
  "lieu": {
    "code": "AN",
    "libelleLong": "Assemblée nationale"
  },
  "cycleDeVie": {
    "etat": "Confirmé",
    "chrono": {
      "creation": "2018-04-19T00:00:00.000+02:00"
    }
  },
  "organeReuniRef": "PO717460",
  "sessionRef": "SCR5A2018O1",
  "ouverturePresse": true,
  "odj": {
    "pointsOdj": [
      {
        "xsiType": "podjSeanceConfPres_type",
        "uid": "RUANR5L15S2018IDS21077PT35914",
        "cycleDeVie": {
          "etat": "Confirmé",
          "chrono": {
            "creation": "2018-04-19T00:00:00.000+02:00"
          }
        },
        "objet": "Suite de la discussion du projet de loi pour une immigration maîtrisée et un droit d'asile effectif",
        "dossiersLegislatifsRefs": [
          "DLR5L15N36410"
        ],
        "typePointOdj": "Suite de la discussion",
        "comiteSecret": false,
        "natureTravauxOdj": "ODJPR",
        "dateLettreMinistre": "2018-04-21T02:00:00.000+02:00"
      }
    ]
  },
  "compteRenduRef": "CRSANR5L15S2018O1N204",
  "identifiants": {
    "numSeanceJo": "204",
    "idJo": "20180204",
    "quantieme": "Troisième",
    "dateSeance": "2018-04-21T02:00:00.000+02:00"
  },
  "captationVideo": true
}