{
  "xsiType": "reunionInitParlementaire_type",
  "uid": "RUANR5L15S2020IDF0142400",
  "timestampDebut": "2019-10-22T14:00:00.000+02:00",
  "timestampFin": "2019-10-22T15:00:00.000+02:00",
  "lieu": {
    "code": "SALREU002",
    "libelleCourt": "Salle 7070",
    "libelleLong": "Salle 7070, 103, rue de l'Université"
  },
  "cycleDeVie": {
    "etat": "Confirmé",
    "chrono": {
      "creation": "2019-10-18T17:08:47.000+02:00"
    }
  },
  "demandeurs": {
    "acteurs": [
      {
        "nom": "Mme Bénédicte TAURINE",
        "acteurRef": "PA718860"
      }
    ]
  },
  "typeReunion": "DEP"
}