{
  "xsiType": "reunionInitParlementaire_type",
  "uid": "RUANR5L15S2018IDF0109838",
  "timestampDebut": "2018-06-05T17:00:00.000+02:00",
  "timestampFin": "2018-06-05T19:00:00.000+02:00",
  "lieu": {
    "code": "SALREU048",
    "libelleCourt": "Salle 6809",
    "libelleLong": "Salle 6809, Palais Bourbon"
  },
  "cycleDeVie": {
    "etat": "Annulé",
    "chrono": {
      "creation": "2018-04-12T09:35:32.000+02:00",
      "cloture": "2018-04-12T14:54:13.000+02:00"
    }
  },
  "demandeurs": {
    "acteurs": [
      {
        "nom": "Mme Émilie BONNIVARD",
        "acteurRef": "PA721410"
      }
    ]
  },
  "typeReunion": "DEP"
}