{
  "xsiType": "reunionCommission_type",
  "uid": "RUANR5L15S2018IDC428902",
  "timestampDebut": "2018-04-05T10:05:00.000+02:00",
  "timestampFin": "2018-04-05T11:10:00.000+02:00",
  "lieu": {
    "libelleLong": "salle 6350"
  },
  "cycleDeVie": {
    "etat": "Confirmé",
    "chrono": {
      "creation": "2018-03-16T00:00:00.000+01:00"
    }
  },
  "organeReuniRef": "PO744127",
  "participants": {
    "participantsInternes": [
      {
        "acteurRef": "PA605036",
        "presence": "absent"
      },
      {
        "acteurRef": "PA642847",
        "presence": "présent"
      },
      {
        "acteurRef": "PA718990",
        "presence": "absent"
      },
      {
        "acteurRef": "PA721328",
        "presence": "absent"
      },
      {
        "acteurRef": "PA719472",
        "presence": "présent"
      },
      {
        "acteurRef": "PA721860",
        "presence": "absent"
      },
      {
        "acteurRef": "PA719748",
        "presence": "présent"
      },
      {
        "acteurRef": "PA642868",
        "presence": "excusé"
      },
      {
        "acteurRef": "PA719756",
        "presence": "présent"
      },
      {
        "acteurRef": "PA942",
        "presence": "absent"
      },
      {
        "acteurRef": "PA643175",
        "presence": "présent"
      },
      {
        "acteurRef": "PA719938",
        "presence": "absent"
      },
      {
        "acteurRef": "PA719480",
        "presence": "excusé"
      },
      {
        "acteurRef": "PA720170",
        "presence": "absent"
      },
      {
        "acteurRef": "PA722054",
        "presence": "absent"
      },
      {
        "acteurRef": "PA719060",
        "presence": "absent"
      },
      {
        "acteurRef": "PA722202",
        "presence": "absent"
      },
      {
        "acteurRef": "PA719994",
        "presence": "absent"
      },
      {
        "acteurRef": "PA609245",
        "presence": "absent"
      },
      {
        "acteurRef": "PA722228",
        "presence": "absent"
      },
      {
        "acteurRef": "PA719404",
        "presence": "présent"
      },
      {
        "acteurRef": "PA608016",
        "presence": "présent"
      },
      {
        "acteurRef": "PA721530",
        "presence": "absent"
      },
      {
        "acteurRef": "PA719154",
        "presence": "absent"
      },
      {
        "acteurRef": "PA720728",
        "presence": "présent"
      },
      {
        "acteurRef": "PA719130",
        "presence": "absent"
      },
      {
        "acteurRef": "PA2377",
        "presence": "absent"
      },
      {
        "acteurRef": "PA608172",
        "presence": "présent"
      },
      {
        "acteurRef": "PA719600",
        "presence": "présent"
      },
      {
        "acteurRef": "PA720100",
        "presence": "absent"
      },
      {
        "acteurRef": "PA722398",
        "presence": "absent"
      },
      {
        "acteurRef": "PA340343",
        "presence": "absent"
      },
      {
        "acteurRef": "PA718860",
        "presence": "absent"
      },
      {
        "acteurRef": "PA709315",
        "presence": "absent"
      },
      {
        "acteurRef": "PA722102",
        "presence": "absent"
      },
      {
        "acteurRef": "PA721262",
        "presence": "absent"
      }
    ]
  },
  "ouverturePresse": true,
  "odj": {
    "convocationOdj": [
      "Audition de M. Olivier Dussopt, secrétaire d’État auprès du ministre de l’Action et des comptes publics."
    ],
    "resumeOdj": [
      "audition de M. Olivier Dussopt, secrétaire d’État auprès du ministre de l’action et des comptes publics."
    ]
  },
  "compteRenduRef": "CRCANR5L15S2018PO744127N009",
  "formatReunion": "Ordinaire",
  "infosReunionsInternationale": {
    "estReunionInternationale": false
  },
  "captationVideo": false
}