{
  "xsiType": "reunionInitParlementaire_type",
  "uid": "RUANR5L15S2018IDF0106597",
  "timestampDebut": "2018-03-13T09:30:00.000+01:00",
  "timestampFin": "2018-03-13T11:00:00.000+01:00",
  "lieu": {
    "code": "SALREU045",
    "libelleCourt": "Sully 3",
    "libelleLong": "Sully 3, Palais Bourbon"
  },
  "cycleDeVie": {
    "etat": "Confirmé",
    "chrono": {
      "creation": "2018-02-26T12:35:08.000+01:00"
    }
  },
  "demandeurs": {
    "acteurs": [
      {
        "nom": "M. Jean-François PARIGI",
        "acteurRef": "PA721636"
      }
    ]
  },
  "typeReunion": "DEP"
}