{
  "xsiType": "reunionInitParlementaire_type",
  "uid": "RUANR5L15S2018IDF0104048",
  "timestampDebut": "2018-02-08T14:00:00.000+01:00",
  "timestampFin": "2018-02-08T15:30:00.000+01:00",
  "lieu": {
    "code": "SALREU023",
    "libelleCourt": "Salle 7426",
    "libelleLong": "Salle 7426, 101, rue de l'Université"
  },
  "cycleDeVie": {
    "etat": "Annulé",
    "chrono": {
      "creation": "2018-01-19T19:14:43.000+01:00",
      "cloture": "2018-02-06T09:37:14.000+01:00"
    }
  },
  "demandeurs": {
    "acteurs": [
      {
        "nom": "Mme Sandra MARSAUD",
        "acteurRef": "PA719080"
      }
    ]
  },
  "typeReunion": "DEP"
}