{
  "xsiType": "reunionCommission_type",
  "uid": "RUANR5L15S2018IDC428214",
  "timestampDebut": "2018-01-16T17:10:00.000+01:00",
  "timestampFin": "2018-01-16T18:55:00.000+01:00",
  "lieu": {
    "libelleLong": "salle 4123 (33 rue Saint-Dominique)"
  },
  "cycleDeVie": {
    "etat": "Confirmé",
    "chrono": {
      "creation": "2018-01-10T00:00:00.000+01:00"
    }
  },
  "organeReuniRef": "PO201269",
  "participants": {
    "participantsInternes": [
      {
        "acteurRef": "PA719318",
        "presence": "absent"
      },
      {
        "acteurRef": "PA719806",
        "presence": "excusé"
      },
      {
        "acteurRef": "PA719558",
        "presence": "absent"
      },
      {
        "acteurRef": "PA342415",
        "presence": "présent"
      },
      {
        "acteurRef": "PA720210",
        "presence": "absent"
      },
      {
        "acteurRef": "PA441",
        "presence": "absent"
      },
      {
        "acteurRef": "PA330684",
        "presence": "absent"
      },
      {
        "acteurRef": "PA719496",
        "presence": "présent"
      },
      {
        "acteurRef": "PA721750",
        "presence": "absent"
      },
      {
        "acteurRef": "PA429893",
        "presence": "absent"
      },
      {
        "acteurRef": "PA719448",
        "presence": "absent"
      },
      {
        "acteurRef": "PA719624",
        "presence": "absent"
      },
      {
        "acteurRef": "PA608826",
        "presence": "absent"
      },
      {
        "acteurRef": "PA721742",
        "presence": "excusé"
      },
      {
        "acteurRef": "PA721384",
        "presence": "absent"
      },
      {
        "acteurRef": "PA720806",
        "presence": "absent"
      },
      {
        "acteurRef": "PA605991",
        "presence": "excusé"
      },
      {
        "acteurRef": "PA721296",
        "presence": "absent"
      },
      {
        "acteurRef": "PA722054",
        "presence": "absent"
      },
      {
        "acteurRef": "PA267801",
        "presence": "absent"
      },
      {
        "acteurRef": "PA720202",
        "presence": "absent"
      },
      {
        "acteurRef": "PA719842",
        "presence": "absent"
      },
      {
        "acteurRef": "PA720916",
        "presence": "absent"
      },
      {
        "acteurRef": "PA720342",
        "presence": "excusé"
      },
      {
        "acteurRef": "PA334116",
        "presence": "absent"
      },
      {
        "acteurRef": "PA721656",
        "presence": "présent"
      },
      {
        "acteurRef": "PA719520",
        "presence": "absent"
      },
      {
        "acteurRef": "PA719632",
        "presence": "absent"
      },
      {
        "acteurRef": "PA718736",
        "presence": "absent"
      },
      {
        "acteurRef": "PA720720",
        "presence": "excusé"
      },
      {
        "acteurRef": "PA720552",
        "presence": "absent"
      },
      {
        "acteurRef": "PA722252",
        "presence": "présent"
      },
      {
        "acteurRef": "PA722022",
        "presence": "absent"
      },
      {
        "acteurRef": "PA718860",
        "presence": "absent"
      },
      {
        "acteurRef": "PA718780",
        "presence": "présent"
      },
      {
        "acteurRef": "PA721474",
        "presence": "absent"
      }
    ]
  },
  "ouverturePresse": true,
  "odj": {
    "convocationOdj": [
      "Audition, sur la prise en charge médicale des victimes de viol, de :- M. Gérard Lopez, psychiatre, président de l’Institut de victimologie, vice-président du Conseil national professionnel de médecine légale et expertise médicale ;- Mme Muriel Salmona, psychiatre spécialisée en psychotraumatologie et victimologie, présidente de l'association Mémoire traumatique et victimologie ;- M. Gilles Lazimi, médecin généraliste au centre municipal de santé de Romainville, maître de conférences en médecine générale à l’Université Pierre et Marie Curie, membre du Haut Conseil à l'égalité entre les femmes et les hommes (HCE) et auteur de nombreux travaux de recherche sur les violences sexuelles."
    ],
    "resumeOdj": [
      "audition, sur la prise en charge médicale des victimes de viol, de :",
      "M. Gérard Lopez, psychiatre, président de l’Institut de victimologie, vice-président du Conseil national professionnel de médecine légale et expertise médicale ;",
      "Mme Muriel Salmona, psychiatre spécialisée en psychotraumatologie et victimologie, présidente de l'association Mémoire traumatique et victimologie ;",
      "M. Gilles Lazimi, médecin généraliste au centre municipal de santé de Romainville, maître de conférences en médecine générale à l’Université Pierre et Marie Curie, membre du Haut Conseil à l'égalité entre les femmes et les hommes (HCE) et auteur de nombreux travaux de recherche sur les violences sexuelles."
    ]
  },
  "compteRenduRef": "CRCANR5L15S2018PO201269N013",
  "formatReunion": "Ordinaire",
  "infosReunionsInternationale": {
    "estReunionInternationale": false
  },
  "captationVideo": false
}