{
  "xsiType": "reunionInitParlementaire_type",
  "uid": "RUANR5L15S2020IDF0140918",
  "timestampDebut": "2019-10-08T14:30:00.000+02:00",
  "timestampFin": "2019-10-08T15:30:00.000+02:00",
  "lieu": {
    "code": "SALREU046",
    "libelleCourt": "Sully 1",
    "libelleLong": "Sully 1, Palais Bourbon"
  },
  "cycleDeVie": {
    "etat": "Confirmé",
    "chrono": {
      "creation": "2019-09-25T17:41:56.000+02:00"
    }
  },
  "demandeurs": {
    "organe": {
      "nom": "GROUPE UDI ET INDÉPENDANTS",
      "organeRef": "PO765636"
    }
  },
  "organeReuniRef": "PO765636",
  "typeReunion": "GP"
}