{
  "xsiType": "seance_type",
  "uid": "RUANR5L15S2018IDS20990",
  "timestampDebut": "2018-04-09T21:30:00.000+02:00",
  "timestampFin": "2018-04-10T00:45:00.000+02:00",
  "lieu": {
    "code": "AN",
    "libelleLong": "Assemblée nationale"
  },
  "cycleDeVie": {
    "etat": "Confirmé",
    "chrono": {
      "creation": "2018-03-16T00:00:00.000+01:00"
    }
  },
  "organeReuniRef": "PO717460",
  "sessionRef": "SCR5A2018O1",
  "ouverturePresse": true,
  "odj": {
    "pointsOdj": [
      {
        "xsiType": "podjSeanceConfPres_type",
        "uid": "RUANR5L15S2018IDS20990PT35765",
        "cycleDeVie": {
          "etat": "Confirmé",
          "chrono": {
            "creation": "2018-03-16T00:00:00.000+01:00"
          }
        },
        "objet": "Suite de la discussion du projet de loi pour un nouveau pacte ferroviaire",
        "dossiersLegislatifsRefs": [
          "DLR5L15N36460"
        ],
        "typePointOdj": "Suite de la discussion",
        "comiteSecret": false,
        "natureTravauxOdj": "ODJPR"
      }
    ]
  },
  "compteRenduRef": "CRSANR5L15S2018O1N182",
  "identifiants": {
    "numSeanceJo": "182",
    "idJo": "20180182",
    "quantieme": "Deuxième",
    "dateSeance": "2018-04-09T02:00:00.000+02:00"
  },
  "captationVideo": true
}