{
  "xsiType": "reunionInitParlementaire_type",
  "uid": "RUANR5L15S2018IDF0112949",
  "timestampDebut": "2018-06-28T14:00:00.000+02:00",
  "timestampFin": "2018-06-28T18:00:00.000+02:00",
  "lieu": {
    "code": "SALREU004",
    "libelleCourt": "1er Bureau",
    "libelleLong": "1er Bureau, Palais Bourbon"
  },
  "cycleDeVie": {
    "etat": "Annulé",
    "chrono": {
      "creation": "2018-06-05T09:22:04.000+02:00",
      "cloture": "2018-06-28T14:24:56.000+02:00"
    }
  },
  "demandeurs": {
    "acteurs": [
      {
        "nom": "Mme Danièle OBONO",
        "acteurRef": "PA721960"
      }
    ]
  },
  "typeReunion": "DEP"
}