{
  "xsiType": "reunionInitParlementaire_type",
  "uid": "RUANR5L15S2018IDF0116597",
  "timestampDebut": "2018-09-17T15:30:00.000+02:00",
  "timestampFin": "2018-09-17T17:30:00.000+02:00",
  "lieu": {
    "code": "SALREU013",
    "libelleCourt": "Salle N° 3",
    "libelleLong": "Salle N° 3, 3, rue Aristide Briand"
  },
  "cycleDeVie": {
    "etat": "Confirmé",
    "chrono": {
      "creation": "2018-08-08T15:54:05.000+02:00"
    }
  },
  "demandeurs": {
    "acteurs": [
      {
        "nom": "Mme Frédérique DUMAS",
        "acteurRef": "PA721194"
      }
    ]
  },
  "typeReunion": "DEP"
}