{
  "xsiType": "reunionInitParlementaire_type",
  "uid": "RUANR5L15S2019IDF0125448",
  "timestampDebut": "2019-01-23T18:00:00.000+01:00",
  "timestampFin": "2019-01-23T19:00:00.000+01:00",
  "lieu": {
    "code": "SALREU049",
    "libelleCourt": "Salle 6822",
    "libelleLong": "Salle 6822, Palais Bourbon"
  },
  "cycleDeVie": {
    "etat": "Annulé",
    "chrono": {
      "creation": "2019-01-17T18:39:22.000+01:00",
      "cloture": "2019-01-22T15:38:34.000+01:00"
    }
  },
  "demandeurs": {
    "acteurs": [
      {
        "nom": "M. Jean-Marc ZULESI",
        "acteurRef": "PA718962"
      }
    ]
  },
  "typeReunion": "DEP"
}