{
  "xsiType": "reunionInitParlementaire_type",
  "uid": "RUANR5L15S2018IDF0105904",
  "timestampDebut": "2018-03-07T11:00:00.000+01:00",
  "timestampFin": "2018-03-07T13:00:00.000+01:00",
  "lieu": {
    "code": "SALREU010",
    "libelleCourt": "Salle N° 1",
    "libelleLong": "Salle N° 1, 3, rue Aristide Briand"
  },
  "cycleDeVie": {
    "etat": "Confirmé",
    "chrono": {
      "creation": "2018-02-15T15:31:55.000+01:00"
    }
  },
  "demandeurs": {
    "acteurs": [
      {
        "nom": "M. Pierre-Yves BOURNAZEL",
        "acteurRef": "PA722030"
      }
    ]
  },
  "typeReunion": "DEP"
}