{
  "xsiType": "reunionInitParlementaire_type",
  "uid": "RUANR5L15S2018IDF0106113",
  "timestampDebut": "2018-02-20T10:45:00.000+01:00",
  "timestampFin": "2018-02-20T13:30:00.000+01:00",
  "lieu": {
    "code": "SALREU026",
    "libelleCourt": "9ème Bureau",
    "libelleLong": "9ème Bureau, Palais Bourbon"
  },
  "cycleDeVie": {
    "etat": "Confirmé",
    "chrono": {
      "creation": "2018-02-19T11:44:53.000+01:00"
    }
  },
  "demandeurs": {
    "acteurs": [
      {
        "nom": "M. Olivier FAURE",
        "acteurRef": "PA609332"
      }
    ]
  },
  "typeReunion": "DEP"
}