{
  "xsiType": "reunionCommission_type",
  "uid": "RUANR5L15S2019IDC431701",
  "timestampDebut": "2019-03-20T17:00:00.000+01:00",
  "lieu": {},
  "cycleDeVie": {
    "etat": "Supprimé",
    "chrono": {
      "creation": "2019-02-21T00:00:00.000+01:00",
      "cloture": "2019-03-07T00:00:00.000+01:00"
    }
  },
  "organeReuniRef": "PO59047",
  "participants": {},
  "ouverturePresse": true,
  "odj": {
    "convocationOdj": [
      "Audition, ouverte à la presse, de M. Jean-Yves Le Drian, Ministre de l'Europe et des Affaires étrangères."
    ],
    "resumeOdj": [
      "audition, ouverte à la presse, de M. Jean-Yves Le Drian, Ministre de l'Europe et des Affaires étrangères."
    ]
  },
  "formatReunion": "Ordinaire",
  "infosReunionsInternationale": {
    "estReunionInternationale": false
  },
  "captationVideo": false
}