{
  "xsiType": "reunionInitParlementaire_type",
  "uid": "RUANR5L15S2018IDF0099815",
  "timestampDebut": "2017-11-13T18:00:00.000+01:00",
  "timestampFin": "2017-11-13T21:00:00.000+01:00",
  "lieu": {
    "code": "SALREU012",
    "libelleCourt": "Salle N° 23",
    "libelleLong": "Salle N° 23, 3, rue Aristide Briand"
  },
  "cycleDeVie": {
    "etat": "Confirmé",
    "chrono": {
      "creation": "2017-11-06T16:58:19.000+01:00"
    }
  },
  "demandeurs": {
    "acteurs": [
      {
        "nom": "M. Régis JUANICO",
        "acteurRef": "PA332614"
      }
    ]
  },
  "typeReunion": "DEP"
}