{
  "xsiType": "reunionInitParlementaire_type",
  "uid": "RUANR5L15S2019IDF0130876",
  "timestampDebut": "2019-04-11T10:00:00.000+02:00",
  "timestampFin": "2019-04-11T11:00:00.000+02:00",
  "lieu": {
    "code": "SALREU022",
    "libelleCourt": "Salle 7326",
    "libelleLong": "Salle 7326, 101, rue de l'Université"
  },
  "cycleDeVie": {
    "etat": "Annulé",
    "chrono": {
      "creation": "2019-03-26T14:22:23.000+01:00",
      "cloture": "2019-04-03T16:41:33.000+02:00"
    }
  },
  "demandeurs": {
    "acteurs": [
      {
        "nom": "Mme Sandrine MÖRCH",
        "acteurRef": "PA719456"
      }
    ]
  },
  "typeReunion": "DEP"
}