{
  "xsiType": "reunionInitParlementaire_type",
  "uid": "RUANR5L15S2018IDF0097748",
  "timestampDebut": "2018-05-15T10:00:00.000+02:00",
  "timestampFin": "2018-05-15T12:00:00.000+02:00",
  "lieu": {
    "code": "SALREU005",
    "libelleCourt": "2ème Bureau",
    "libelleLong": "2ème Bureau, Palais Bourbon"
  },
  "cycleDeVie": {
    "etat": "Confirmé",
    "chrono": {
      "creation": "2017-10-02T17:34:01.000+02:00"
    }
  },
  "demandeurs": {
    "acteurs": [
      {
        "nom": "M. André CHASSAIGNE",
        "acteurRef": "PA267306"
      }
    ]
  },
  "typeReunion": "DEP"
}