{
  "xsiType": "reunionInitParlementaire_type",
  "uid": "RUANR5L15S2020IDF0141433",
  "timestampDebut": "2019-10-21T14:00:00.000+02:00",
  "timestampFin": "2019-10-21T18:00:00.000+02:00",
  "lieu": {
    "code": "SALREU022",
    "libelleCourt": "Salle 7326",
    "libelleLong": "Salle 7326, 101, rue de l'Université"
  },
  "cycleDeVie": {
    "etat": "Confirmé",
    "chrono": {
      "creation": "2019-10-03T15:33:35.000+02:00"
    }
  },
  "demandeurs": {
    "acteurs": [
      {
        "nom": "Mme Sarah EL HAÏRY",
        "acteurRef": "PA720002"
      }
    ]
  },
  "typeReunion": "DEP"
}