{
  "xsiType": "seance_type",
  "uid": "RUANR5L15S2019IDS21666",
  "timestampDebut": "2019-05-27T16:00:00.000+02:00",
  "timestampFin": "2019-05-27T20:00:00.000+02:00",
  "lieu": {
    "code": "AN",
    "libelleLong": "Assemblée nationale"
  },
  "cycleDeVie": {
    "etat": "Confirmé",
    "chrono": {
      "creation": "2019-05-06T00:00:00.000+02:00"
    }
  },
  "organeReuniRef": "PO717460",
  "sessionRef": "SCR5A2019O1",
  "ouverturePresse": true,
  "odj": {
    "pointsOdj": [
      {
        "xsiType": "podjSeanceConfPres_type",
        "uid": "RUANR5L15S2019IDS21666PT37264",
        "cycleDeVie": {
          "etat": "Confirmé",
          "chrono": {
            "creation": "2019-05-06T00:00:00.000+02:00"
          }
        },
        "objet": "Discussion de la proposition de résolution tendant à modifier le Règlement de l’Assemblée nationale",
        "dossiersLegislatifsRefs": [
          "DLR5L15N37446"
        ],
        "typePointOdj": "Discussion",
        "comiteSecret": false,
        "natureTravauxOdj": "ODJPR"
      },
      {
        "xsiType": "podjSeanceConfPres_type",
        "uid": "RUANR5L15S2019IDS21666PT37307",
        "cycleDeVie": {
          "etat": "Supprimé",
          "chrono": {
            "creation": "2019-05-20T00:00:00.000+02:00",
            "cloture": "2019-05-20T00:00:00.000+02:00"
          }
        },
        "objet": "Discussion de la proposition de résolution visant à lutter contre l'antisémitisme",
        "typePointOdj": "Discussion",
        "comiteSecret": false,
        "natureTravauxOdj": "ODJPR"
      }
    ]
  },
  "compteRenduRef": "CRSANR5L15S2019O1N248",
  "identifiants": {
    "numSeanceJo": "248",
    "idJo": "20190248",
    "quantieme": "Première",
    "dateSeance": "2019-05-27T02:00:00.000+02:00"
  },
  "captationVideo": true
}