{
  "xsiType": "reunionInitParlementaire_type",
  "uid": "RUANR5L15S2020IDF0142639",
  "timestampDebut": "2019-11-26T14:00:00.000+01:00",
  "timestampFin": "2019-11-26T15:00:00.000+01:00",
  "lieu": {
    "code": "SALREU002",
    "libelleCourt": "Salle 7070",
    "libelleLong": "Salle 7070, 103, rue de l'Université"
  },
  "cycleDeVie": {
    "etat": "Confirmé",
    "chrono": {
      "creation": "2019-10-23T18:25:19.000+02:00"
    }
  },
  "demandeurs": {
    "acteurs": [
      {
        "nom": "Mme Cécile UNTERMAIER",
        "acteurRef": "PA608695"
      }
    ]
  },
  "typeReunion": "DEP"
}