{
  "xsiType": "reunionInitParlementaire_type",
  "uid": "RUANR5L15S2020IDF0142543",
  "timestampDebut": "2019-10-22T16:30:00.000+02:00",
  "timestampFin": "2019-10-22T17:30:00.000+02:00",
  "lieu": {
    "code": "SALREU023",
    "libelleCourt": "Salle 7426",
    "libelleLong": "Salle 7426, 101, rue de l'Université"
  },
  "cycleDeVie": {
    "etat": "Confirmé",
    "chrono": {
      "creation": "2019-10-22T16:26:02.000+02:00"
    }
  },
  "demandeurs": {
    "acteurs": [
      {
        "nom": "M. Stanislas GUERINI",
        "acteurRef": "PA721498"
      }
    ]
  },
  "typeReunion": "DEP"
}