{
  "xsiType": "reunionCommission_type",
  "uid": "RUANR5L15S2019IDC432730",
  "timestampDebut": "2019-05-29T09:30:00.000+02:00",
  "lieu": {},
  "cycleDeVie": {
    "etat": "Supprimé",
    "chrono": {
      "creation": "2019-05-15T00:00:00.000+02:00",
      "cloture": "2019-05-23T00:00:00.000+02:00"
    }
  },
  "organeReuniRef": "PO59047",
  "participants": {},
  "ouverturePresse": false,
  "odj": {
    "convocationOdj": [
      "Compte rendu, ouvert à la presse, de la mission en Érythrée et Éthiopie, du 21 au 25 février 2019, d'une délégation de la commission des affaires étrangères, conduite par Mme Marielle de Sarnez et composée de Mme Annie Chapelier et M. Didier Quentin."
    ],
    "resumeOdj": [
      "compte rendu, ouvert à la presse, de la mission en Érythrée et Éthiopie, du 21 au 25 février 2019, d'une délégation de la commission des affaires étrangères, conduite par Mme Marielle de Sarnez et composée de Mme Annie Chapelier et M. Didier Quentin."
    ]
  },
  "formatReunion": "Ordinaire",
  "infosReunionsInternationale": {
    "estReunionInternationale": false
  },
  "captationVideo": false
}