{
  "xsiType": "reunionCommission_type",
  "uid": "RUANR5L15S2018IDC429047",
  "timestampDebut": "2018-04-05T14:15:00.000+02:00",
  "timestampFin": "2018-04-05T17:15:00.000+02:00",
  "lieu": {
    "libelleLong": "salle 6350 (Finances)"
  },
  "cycleDeVie": {
    "etat": "Confirmé",
    "chrono": {
      "creation": "2018-03-29T00:00:00.000+02:00"
    }
  },
  "organeReuniRef": "PO746398",
  "participants": {
    "participantsInternes": [
      {
        "acteurRef": "PA718954",
        "presence": "absent"
      },
      {
        "acteurRef": "PA605963",
        "presence": "absent"
      },
      {
        "acteurRef": "PA721836",
        "presence": "absent"
      },
      {
        "acteurRef": "PA267233",
        "presence": "absent"
      },
      {
        "acteurRef": "PA721202",
        "presence": "absent"
      },
      {
        "acteurRef": "PA923",
        "presence": "absent"
      },
      {
        "acteurRef": "PA267450",
        "presence": "absent"
      },
      {
        "acteurRef": "PA718720",
        "presence": "excusé"
      },
      {
        "acteurRef": "PA267336",
        "presence": "excusé"
      },
      {
        "acteurRef": "PA720560",
        "presence": "absent"
      },
      {
        "acteurRef": "PA722054",
        "presence": "absent"
      },
      {
        "acteurRef": "PA718794",
        "presence": "présent"
      },
      {
        "acteurRef": "PA608416",
        "presence": "présent"
      },
      {
        "acteurRef": "PA719778",
        "presence": "absent"
      },
      {
        "acteurRef": "PA719006",
        "presence": "présent"
      },
      {
        "acteurRef": "PA720230",
        "presence": "absent"
      },
      {
        "acteurRef": "PA721670",
        "presence": "présent"
      },
      {
        "acteurRef": "PA721636",
        "presence": "absent"
      },
      {
        "acteurRef": "PA718736",
        "presence": "absent"
      },
      {
        "acteurRef": "PA609590",
        "presence": "absent"
      },
      {
        "acteurRef": "PA719592",
        "presence": "absent"
      },
      {
        "acteurRef": "PA2960",
        "presence": "absent"
      }
    ]
  },
  "ouverturePresse": true,
  "odj": {
    "convocationOdj": [
      "Auditions, ouvertes à la presse, de la Mission d’évaluation et de contrôle sur le l’évaluation du financement public de la recherche dans les universités (Mme Danièle HÉRIN, M. Patrick HETZEL et Mme Amélie de MONTCHALIN, rapporteurs) :– à 14 heures 15 : audition du Haut conseil de la recherche et de l’enseignement supérieur (HCERES), M. Michel COSNARD, président.– à 15 heures : audition de M. Christian CHARDONNET, directeur de recherche au CNRS Laboratoire de Physique des Lasers Université Paris 13.– à 16 heures : audition de M. Hervé DOLE, professeur à l’Institut d’Astrophysique Spatiale à l’université Paris Sud et CNRS et de Mme Valérie MASSON-DELMOTTE, paléoclimatologue au Laboratoire des Sciences du Climat et de l’Environnement (CEA-CNRS-UVSQ/IPSL), Université Paris Saclay."
    ],
    "resumeOdj": [
      "auditions, ouvertes à la presse, de la Mission d’évaluation et de contrôle sur le l’évaluation du financement public de la recherche dans les universités (Mme Danièle Hérin, M. Patrick Hetzel et Mme Amélie de Montchalin, rapporteurs) :",
      "à 14 heures 15 : audition du Haut conseil de la recherche et de l’enseignement supérieur (HCERES), M. Michel Cosnard, président.",
      "à 15 heures : audition de M. Christian Chardonnet, directeur de recherche au CNRS Laboratoire de Physique des Lasers Université Paris 13.",
      "à 16 heures : audition de M. Hervé Dole, professeur à l’Institut d’Astrophysique Spatiale à l’université Paris Sud et CNRS et de Mme Valérie Masson-Delmotte, paléoclimatologue au Laboratoire des Sciences du Climat et de l’Environnement (CEA-CNRS-UVSQ/IPSL), Université Paris Saclay."
    ]
  },
  "formatReunion": "Ordinaire",
  "infosReunionsInternationale": {
    "estReunionInternationale": false
  },
  "captationVideo": false
}