{
  "xsiType": "reunionCommission_type",
  "uid": "RUANR5L15S2019IDC431759",
  "timestampDebut": "2019-03-07T10:30:00.000+01:00",
  "timestampFin": "2019-03-07T11:30:00.000+01:00",
  "lieu": {
    "libelleLong": "Salle 4204 - 33 rue Saint-Dominique"
  },
  "cycleDeVie": {
    "etat": "Confirmé",
    "chrono": {
      "creation": "2019-02-26T00:00:00.000+01:00"
    }
  },
  "organeReuniRef": "PO760024",
  "participants": {},
  "ouverturePresse": false,
  "odj": {
    "convocationOdj": [
      "Audition de M. Pierre Razoux, directeur de recherche à l’Institut de Recherche Stratégique de l'École Militaire (IRSEM)."
    ],
    "resumeOdj": [
      "audition de M. Pierre Razoux, directeur de recherche à l’Institut de Recherche Stratégique de l'École Militaire (IRSEM)."
    ]
  },
  "formatReunion": "Ordinaire",
  "infosReunionsInternationale": {
    "estReunionInternationale": false
  },
  "captationVideo": false
}