{
  "xsiType": "reunionCommission_type",
  "uid": "RUANR5L15S2019IDC432264",
  "timestampDebut": "2019-04-30T18:40:00.000+02:00",
  "timestampFin": "2019-04-30T19:50:00.000+02:00",
  "lieu": {
    "libelleLong": "salle 4123 (33 rue Saint-Dominique)"
  },
  "cycleDeVie": {
    "etat": "Confirmé",
    "chrono": {
      "creation": "2019-04-05T00:00:00.000+02:00"
    }
  },
  "organeReuniRef": "PO762987",
  "participants": {
    "participantsInternes": [
      {
        "acteurRef": "PA721278",
        "presence": "absent"
      },
      {
        "acteurRef": "PA720256",
        "presence": "présent"
      },
      {
        "acteurRef": "PA267233",
        "presence": "excusé"
      },
      {
        "acteurRef": "PA719032",
        "presence": "présent"
      },
      {
        "acteurRef": "PA721336",
        "presence": "présent"
      },
      {
        "acteurRef": "PA721352",
        "presence": "présent"
      },
      {
        "acteurRef": "PA267429",
        "presence": "absent"
      },
      {
        "acteurRef": "PA718694",
        "presence": "absent"
      },
      {
        "acteurRef": "PA720696",
        "presence": "absent"
      },
      {
        "acteurRef": "PA719162",
        "presence": "présent"
      },
      {
        "acteurRef": "PA342935",
        "presence": "présent"
      },
      {
        "acteurRef": "PA720924",
        "presence": "absent"
      },
      {
        "acteurRef": "PA267780",
        "presence": "présent"
      },
      {
        "acteurRef": "PA718706",
        "presence": "excusé"
      },
      {
        "acteurRef": "PA719480",
        "presence": "présent"
      },
      {
        "acteurRef": "PA331835",
        "presence": "absent"
      },
      {
        "acteurRef": "PA722202",
        "presence": "présent"
      },
      {
        "acteurRef": "PA722300",
        "presence": "absent"
      },
      {
        "acteurRef": "PA720630",
        "presence": "absent"
      },
      {
        "acteurRef": "PA720492",
        "presence": "absent"
      },
      {
        "acteurRef": "PA333421",
        "presence": "absent"
      },
      {
        "acteurRef": "PA721844",
        "presence": "présent"
      },
      {
        "acteurRef": "PA720100",
        "presence": "absent"
      },
      {
        "acteurRef": "PA720900",
        "presence": "absent"
      },
      {
        "acteurRef": "PA718810",
        "presence": "absent"
      },
      {
        "acteurRef": "PA721226",
        "presence": "absent"
      },
      {
        "acteurRef": "PA719972",
        "presence": "présent"
      },
      {
        "acteurRef": "PA267794",
        "presence": "absent"
      },
      {
        "acteurRef": "PA608741",
        "presence": "absent"
      },
      {
        "acteurRef": "PA606639",
        "presence": "absent"
      }
    ]
  },
  "ouverturePresse": true,
  "odj": {
    "convocationOdj": [
      "– Audition, ouverte à la presse, réunissant :•\tM. Jean-François Texier, adjoint à la médiatrice de l’Éducation nationale et de l’Enseignement supérieur et Mme Colette Damiot-Marcou, chargée de mission•\tM. Philippe Vendrix, président de la commission Vie étudiante et vie de campus de la Conférence des présidents d’université (CPU)"
    ],
    "resumeOdj": [
      "audition, ouverte à la presse, réunissant :",
      "M. Jean-François Texier, adjoint à la médiatrice de l’Éducation nationale et de l’Enseignement supérieur et Mme Colette Damiot-Marcou, chargée de mission ;",
      "M. Philippe Vendrix, président de la commission Vie étudiante et vie de campus de la Conférence des présidents d’université (CPU)."
    ]
  },
  "compteRenduRef": "CRCANR5L15S2019PO762987N011",
  "formatReunion": "Ordinaire",
  "infosReunionsInternationale": {
    "estReunionInternationale": false
  },
  "captationVideo": false
}