{
  "xsiType": "reunionCommission_type",
  "uid": "RUANR5L15S2020IDC434267",
  "timestampDebut": "2019-11-26T09:30:00.000+01:00",
  "lieu": {
    "libelleLong": "4e Bureau"
  },
  "cycleDeVie": {
    "etat": "Confirmé",
    "chrono": {
      "creation": "2019-11-14T00:00:00.000+01:00"
    }
  },
  "organeReuniRef": "PO765498",
  "participants": {},
  "ouverturePresse": false,
  "odj": {
    "convocationOdj": [
      "– Adoption du rapport (à huis clos)"
    ],
    "resumeOdj": [
      "adoption du rapport (à huis clos)."
    ]
  },
  "formatReunion": "Ordinaire",
  "infosReunionsInternationale": {
    "estReunionInternationale": false
  },
  "captationVideo": false
}