{
  "xsiType": "reunionInitParlementaire_type",
  "uid": "RUANR5L15S2018IDF0118853",
  "timestampDebut": "2018-09-26T15:00:00.000+02:00",
  "timestampFin": "2018-09-26T16:00:00.000+02:00",
  "lieu": {
    "code": "SALREU020",
    "libelleCourt": "Salon Mars II",
    "libelleLong": "Salon Mars II, 101, rue de l'Université"
  },
  "cycleDeVie": {
    "etat": "Annulé",
    "chrono": {
      "creation": "2018-09-18T16:52:19.000+02:00",
      "cloture": "2018-09-25T16:57:46.000+02:00"
    }
  },
  "demandeurs": {
    "acteurs": [
      {
        "nom": "M. Laurent SAINT-MARTIN",
        "acteurRef": "PA720878"
      }
    ]
  },
  "typeReunion": "DEP"
}