{
  "xsiType": "reunionInitParlementaire_type",
  "uid": "RUANR5L15S2020IDF0141370",
  "timestampDebut": "2019-10-09T08:30:00.000+02:00",
  "timestampFin": "2019-10-09T09:30:00.000+02:00",
  "lieu": {
    "code": "SALREU039",
    "libelleCourt": "Salle 6550",
    "libelleLong": "Salle 6550, Palais Bourbon"
  },
  "cycleDeVie": {
    "etat": "Confirmé",
    "chrono": {
      "creation": "2019-10-03T09:38:12.000+02:00"
    }
  },
  "demandeurs": {
    "acteurs": [
      {
        "nom": "M. Jean-René CAZENEUVE",
        "acteurRef": "PA719472"
      },
      {
        "nom": "M. Christophe JERRETIE",
        "acteurRef": "PA719060"
      }
    ]
  },
  "typeReunion": "DEP"
}