{
  "xsiType": "reunionInitParlementaire_type",
  "uid": "RUANR5L15S2019IDF0128983",
  "timestampDebut": "2019-03-06T14:00:00.000+01:00",
  "timestampFin": "2019-03-06T15:45:00.000+01:00",
  "lieu": {
    "code": "SALREU021",
    "libelleCourt": "Salle 7207",
    "libelleLong": "Salle 7207, 101, rue de l'Université"
  },
  "cycleDeVie": {
    "etat": "Confirmé",
    "chrono": {
      "creation": "2019-03-04T18:42:58.000+01:00"
    }
  },
  "demandeurs": {
    "acteurs": [
      {
        "nom": "Mme Valérie GOMEZ-BASSAC",
        "acteurRef": "PA721784"
      }
    ]
  },
  "typeReunion": "DEP"
}