{
  "xsiType": "reunionInitParlementaire_type",
  "uid": "RUANR5L15S2019IDF0134147",
  "timestampDebut": "2019-06-05T16:00:00.000+02:00",
  "timestampFin": "2019-06-05T17:30:00.000+02:00",
  "lieu": {
    "code": "SALREU002",
    "libelleCourt": "Salle 7070",
    "libelleLong": "Salle 7070, 103, rue de l'Université"
  },
  "cycleDeVie": {
    "etat": "Confirmé",
    "chrono": {
      "creation": "2019-05-20T15:52:03.000+02:00"
    }
  },
  "demandeurs": {
    "acteurs": [
      {
        "nom": "Mme Caroline JANVIER",
        "acteurRef": "PA720074"
      }
    ]
  },
  "typeReunion": "DEP"
}