{
  "xsiType": "reunionInitParlementaire_type",
  "uid": "RUANR5L15S2019IDF0124904",
  "timestampDebut": "2019-02-06T13:45:00.000+01:00",
  "timestampFin": "2019-02-06T14:45:00.000+01:00",
  "lieu": {
    "code": "SALREU013",
    "libelleCourt": "Salle N° 3",
    "libelleLong": "Salle N° 3, 3, rue Aristide Briand"
  },
  "cycleDeVie": {
    "etat": "Confirmé",
    "chrono": {
      "creation": "2019-01-11T11:45:45.000+01:00"
    }
  },
  "demandeurs": {
    "acteurs": [
      {
        "nom": "Mme Sophie PANONACLE",
        "acteurRef": "PA719632"
      }
    ]
  },
  "typeReunion": "DEP"
}