{
  "xsiType": "reunionInitParlementaire_type",
  "uid": "RUANR5L15S2018IDF0105461",
  "timestampDebut": "2018-02-14T13:00:00.000+01:00",
  "timestampFin": "2018-02-14T15:00:00.000+01:00",
  "lieu": {
    "code": "SALREU012",
    "libelleCourt": "Salle N° 23",
    "libelleLong": "Salle N° 23, 3, rue Aristide Briand"
  },
  "cycleDeVie": {
    "etat": "Confirmé",
    "chrono": {
      "creation": "2018-02-09T10:02:26.000+01:00"
    }
  },
  "demandeurs": {
    "acteurs": [
      {
        "nom": "M. François RUFFIN",
        "acteurRef": "PA722142"
      }
    ]
  },
  "typeReunion": "DEP"
}