{
  "xsiType": "reunionInitParlementaire_type",
  "uid": "RUANR5L15S2018IDF0111919",
  "timestampDebut": "2018-05-22T10:30:00.000+02:00",
  "timestampFin": "2018-05-22T12:00:00.000+02:00",
  "lieu": {
    "code": "SALREU033",
    "libelleCourt": "6ème Bureau",
    "libelleLong": "6ème Bureau, Palais Bourbon"
  },
  "cycleDeVie": {
    "etat": "Confirmé",
    "chrono": {
      "creation": "2018-05-22T09:54:46.000+02:00"
    }
  },
  "demandeurs": {
    "acteurs": [
      {
        "nom": "M. Louis ALIOT",
        "acteurRef": "PA720798"
      }
    ]
  },
  "typeReunion": "DEP"
}