{
  "xsiType": "reunionInitParlementaire_type",
  "uid": "RUANR5L15S2018IDF0115606",
  "timestampDebut": "2018-07-25T08:15:00.000+02:00",
  "timestampFin": "2018-07-25T09:30:00.000+02:00",
  "lieu": {
    "code": "SALREU019",
    "libelleCourt": "Salon Mars I",
    "libelleLong": "Salon Mars I, 101, rue de l'Université"
  },
  "cycleDeVie": {
    "etat": "Confirmé",
    "chrono": {
      "creation": "2018-07-12T14:59:07.000+02:00"
    }
  },
  "demandeurs": {
    "acteurs": [
      {
        "nom": "M. François-Michel LAMBERT",
        "acteurRef": "PA605518"
      }
    ]
  },
  "typeReunion": "DEP"
}