{
  "xsiType": "reunionInitParlementaire_type",
  "uid": "RUANR5L15S2018IDF0109112",
  "timestampDebut": "2018-04-13T14:00:00.000+02:00",
  "timestampFin": "2018-04-13T15:30:00.000+02:00",
  "lieu": {
    "code": "SALREU009",
    "libelleCourt": "8ème Bureau",
    "libelleLong": "8ème Bureau, Palais Bourbon"
  },
  "cycleDeVie": {
    "etat": "Confirmé",
    "chrono": {
      "creation": "2018-04-04T09:25:31.000+02:00"
    }
  },
  "demandeurs": {
    "acteurs": [
      {
        "nom": "Mme Bénédicte TAURINE",
        "acteurRef": "PA718860"
      }
    ]
  },
  "typeReunion": "DEP"
}