{
  "xsiType": "seance_type",
  "uid": "RUSNR5L15S2019IDS21872",
  "timestampDebut": "2019-09-27T09:00:00.000+02:00",
  "timestampFin": "2019-09-27T18:15:00.000+02:00",
  "lieu": {
    "code": "S",
    "libelleLong": "Sénat"
  },
  "cycleDeVie": {
    "etat": "Confirmé",
    "chrono": {
      "creation": "2019-09-27T00:00:00.000+02:00"
    }
  },
  "organeReuniRef": "PO78718",
  "sessionRef": "SCR5A2019E2",
  "ouverturePresse": true,
  "odj": {
    "pointsOdj": [
      {
        "xsiType": "podjSeanceConfPres_type",
        "uid": "RUSNR5L15S2019IDS21872PT37706",
        "cycleDeVie": {
          "etat": "Confirmé",
          "chrono": {
            "creation": "2019-09-27T00:00:00.000+02:00"
          }
        },
        "objet": "Suite de la discussion du projet de loi sur l'économie circulaire",
        "dossiersLegislatifsRefs": [
          "DLR5L15N37641"
        ],
        "typePointOdj": "Suite de la discussion",
        "comiteSecret": false,
        "natureTravauxOdj": "ODJPR"
      }
    ]
  },
  "compteRenduRef": "CRSSNR5S2019IDS20190927",
  "identifiants": {
    "numSeanceJo": "4",
    "idJo": "20192004",
    "quantieme": "Unique",
    "dateSeance": "2019-09-27T02:00:00.000+02:00"
  },
  "captationVideo": true
}