{
  "xsiType": "reunionInitParlementaire_type",
  "uid": "RUANR5L15S2019IDF0137104",
  "timestampDebut": "2019-09-18T16:30:00.000+02:00",
  "timestampFin": "2019-09-18T19:30:00.000+02:00",
  "lieu": {
    "code": "SALREU016",
    "libelleCourt": "Salon Gabriel",
    "libelleLong": "Salon Gabriel, 101, rue de l'Université"
  },
  "cycleDeVie": {
    "etat": "Annulé",
    "chrono": {
      "creation": "2019-07-09T10:23:48.000+02:00",
      "cloture": "2019-09-16T15:43:37.000+02:00"
    }
  },
  "demandeurs": {
    "acteurs": [
      {
        "nom": "M. François CORNUT-GENTILLE",
        "acteurRef": "PA923"
      }
    ]
  },
  "typeReunion": "DEP"
}