{
  "xsiType": "reunionInitParlementaire_type",
  "uid": "RUANR5L15S2017IDF0096866",
  "timestampDebut": "2017-09-27T08:00:00.000+02:00",
  "timestampFin": "2017-09-27T09:00:00.000+02:00",
  "lieu": {
    "code": "SALREU006",
    "libelleCourt": "3ème Bureau",
    "libelleLong": "3ème Bureau, Palais Bourbon"
  },
  "cycleDeVie": {
    "etat": "Confirmé",
    "chrono": {
      "creation": "2017-09-22T15:27:32.000+02:00"
    }
  },
  "demandeurs": {
    "acteurs": [
      {
        "nom": "M. Thomas MESNIER",
        "acteurRef": "PA719072"
      }
    ]
  },
  "typeReunion": "DEP"
}