{
  "xsiType": "reunionCommission_type",
  "uid": "RUANR5L15S2019IDC433357",
  "timestampDebut": "2019-09-11T09:30:00.000+02:00",
  "timestampFin": "2019-09-11T11:00:00.000+02:00",
  "lieu": {
    "libelleLong": "salle de la commission des Finances"
  },
  "cycleDeVie": {
    "etat": "Confirmé",
    "chrono": {
      "creation": "2019-07-04T00:00:00.000+02:00"
    }
  },
  "organeReuniRef": "PO59048",
  "participants": {
    "participantsInternes": [
      {
        "acteurRef": "PA605036",
        "presence": "absent"
      },
      {
        "acteurRef": "PA718954",
        "presence": "présent"
      },
      {
        "acteurRef": "PA605963",
        "presence": "présent"
      },
      {
        "acteurRef": "PA606675",
        "presence": "présent"
      },
      {
        "acteurRef": "PA609726",
        "presence": "présent"
      },
      {
        "acteurRef": "PA721836",
        "presence": "excusé"
      },
      {
        "acteurRef": "PA721410",
        "presence": "présent"
      },
      {
        "acteurRef": "PA721608",
        "presence": "excusé"
      },
      {
        "acteurRef": "PA605069",
        "presence": "présent"
      },
      {
        "acteurRef": "PA718838",
        "presence": "absent"
      },
      {
        "acteurRef": "PA720298",
        "presence": "présent"
      },
      {
        "acteurRef": "PA746",
        "presence": "présent"
      },
      {
        "acteurRef": "PA719138",
        "presence": "présent"
      },
      {
        "acteurRef": "PA720520",
        "presence": "absent"
      },
      {
        "acteurRef": "PA719472",
        "presence": "présent"
      },
      {
        "acteurRef": "PA719250",
        "presence": "présent"
      },
      {
        "acteurRef": "PA760658",
        "presence": "absent"
      },
      {
        "acteurRef": "PA721202",
        "presence": "absent"
      },
      {
        "acteurRef": "PA923",
        "presence": "absent"
      },
      {
        "acteurRef": "PA942",
        "presence": "présent"
      },
      {
        "acteurRef": "PA332523",
        "presence": "présent"
      },
      {
        "acteurRef": "PA720268",
        "presence": "présent"
      },
      {
        "acteurRef": "PA719710",
        "presence": "présent"
      },
      {
        "acteurRef": "PA722382",
        "presence": "présent"
      },
      {
        "acteurRef": "PA718720",
        "presence": "présent"
      },
      {
        "acteurRef": "PA643175",
        "presence": "présent"
      },
      {
        "acteurRef": "PA720996",
        "presence": "excusé"
      },
      {
        "acteurRef": "PA720002",
        "presence": "présent"
      },
      {
        "acteurRef": "PA607193",
        "presence": "présent"
      },
      {
        "acteurRef": "PA1327",
        "presence": "absent"
      },
      {
        "acteurRef": "PA719480",
        "presence": "présent"
      },
      {
        "acteurRef": "PA267336",
        "presence": "présent"
      },
      {
        "acteurRef": "PA720560",
        "presence": "absent"
      },
      {
        "acteurRef": "PA720790",
        "presence": "présent"
      },
      {
        "acteurRef": "PA721764",
        "presence": "présent"
      },
      {
        "acteurRef": "PA722054",
        "presence": "présent"
      },
      {
        "acteurRef": "PA608416",
        "presence": "absent"
      },
      {
        "acteurRef": "PA721150",
        "presence": "présent"
      },
      {
        "acteurRef": "PA719060",
        "presence": "présent"
      },
      {
        "acteurRef": "PA719778",
        "presence": "présent"
      },
      {
        "acteurRef": "PA719798",
        "presence": "présent"
      },
      {
        "acteurRef": "PA718978",
        "presence": "absent"
      },
      {
        "acteurRef": "PA720022",
        "presence": "présent"
      },
      {
        "acteurRef": "PA712014",
        "presence": "présent"
      },
      {
        "acteurRef": "PA1874",
        "presence": "présent"
      },
      {
        "acteurRef": "PA721632",
        "presence": "présent"
      },
      {
        "acteurRef": "PA719006",
        "presence": "présent"
      },
      {
        "acteurRef": "PA608016",
        "presence": "présent"
      },
      {
        "acteurRef": "PA722244",
        "presence": "présent"
      },
      {
        "acteurRef": "PA720230",
        "presence": "excusé"
      },
      {
        "acteurRef": "PA720728",
        "presence": "présent"
      },
      {
        "acteurRef": "PA719850",
        "presence": "présent"
      },
      {
        "acteurRef": "PA720492",
        "presence": "présent"
      },
      {
        "acteurRef": "PA720402",
        "presence": "présent"
      },
      {
        "acteurRef": "PA721636",
        "presence": "absent"
      },
      {
        "acteurRef": "PA607595",
        "presence": "absent"
      },
      {
        "acteurRef": "PA720500",
        "presence": "absent"
      },
      {
        "acteurRef": "PA718736",
        "presence": "présent"
      },
      {
        "acteurRef": "PA336175",
        "presence": "absent"
      },
      {
        "acteurRef": "PA608172",
        "presence": "présent"
      },
      {
        "acteurRef": "PA720590",
        "presence": "présent"
      },
      {
        "acteurRef": "PA405480",
        "presence": "excusé"
      },
      {
        "acteurRef": "PA609590",
        "presence": "excusé"
      },
      {
        "acteurRef": "PA721458",
        "presence": "absent"
      },
      {
        "acteurRef": "PA720692",
        "presence": "absent"
      },
      {
        "acteurRef": "PA721226",
        "presence": "absent"
      },
      {
        "acteurRef": "PA720878",
        "presence": "présent"
      },
      {
        "acteurRef": "PA722078",
        "presence": "présent"
      },
      {
        "acteurRef": "PA720960",
        "presence": "excusé"
      },
      {
        "acteurRef": "PA719592",
        "presence": "excusé"
      },
      {
        "acteurRef": "PA721542",
        "presence": "présent"
      },
      {
        "acteurRef": "PA331582",
        "presence": "excusé"
      },
      {
        "acteurRef": "PA2960",
        "presence": "présent"
      }
    ]
  },
  "ouverturePresse": true,
  "odj": {
    "convocationOdj": [
      "–  Examen du rapport de la mission d’information sur la mise en œuvre de la loi organique relative aux lois de finances (M. Laurent SAINT-MARTIN, rapporteur)"
    ],
    "resumeOdj": [
      "examen du rapport de la mission d’information sur la mise en œuvre de la loi organique relative aux lois de finances (M. Laurent Saint-Martin, rapporteur)."
    ],
    "pointsOdj": [
      {
        "xsiType": "podjReunion_type",
        "uid": "RUANR5L15S2019IDC433357PT26816",
        "cycleDeVie": {
          "etat": "Confirmé",
          "chrono": {
            "creation": "2019-09-11T00:00:00.000+02:00"
          }
        },
        "objet": "Nomination d'un rapporteur spécial",
        "dossiersLegislatifsRefs": [
          "DLR5L15N37615"
        ],
        "typePointOdj": "Nomination rapporteur",
        "comiteSecret": false
      }
    ]
  },
  "compteRenduRef": "CRCANR5L15S2019PO59048N100",
  "formatReunion": "Ordinaire",
  "infosReunionsInternationale": {
    "estReunionInternationale": false
  },
  "captationVideo": true
}