{
  "xsiType": "reunionInitParlementaire_type",
  "uid": "RUANR5L15S2017IDF0093625",
  "timestampDebut": "2017-09-12T10:00:00.000+02:00",
  "timestampFin": "2017-09-12T12:00:00.000+02:00",
  "lieu": {
    "code": "SALREU011",
    "libelleCourt": "Salle N° 2",
    "libelleLong": "Salle N° 2, 3, rue Aristide Briand"
  },
  "cycleDeVie": {
    "etat": "Confirmé",
    "chrono": {
      "creation": "2017-07-06T16:05:29.000+02:00"
    }
  },
  "demandeurs": {
    "acteurs": [
      {
        "nom": "Mme Marine LE PEN",
        "acteurRef": "PA720614"
      }
    ]
  },
  "typeReunion": "DEP"
}