{
  "xsiType": "reunionInitParlementaire_type",
  "uid": "RUANR5L15S2019IDF0139049",
  "timestampDebut": "2019-09-11T08:30:00.000+02:00",
  "timestampFin": "2019-09-11T09:30:00.000+02:00",
  "lieu": {
    "code": "SALREU017",
    "libelleCourt": "Salon Visconti",
    "libelleLong": "Salon Visconti, 101, rue de l'Université"
  },
  "cycleDeVie": {
    "etat": "Annulé",
    "chrono": {
      "creation": "2019-09-04T16:18:34.000+02:00",
      "cloture": "2019-09-05T15:53:31.000+02:00"
    }
  },
  "demandeurs": {
    "acteurs": [
      {
        "nom": "M. Jean-François ELIAOU",
        "acteurRef": "PA719692"
      }
    ]
  },
  "typeReunion": "DEP"
}