{
  "xsiType": "reunionInitParlementaire_type",
  "uid": "RUANR5L15S2019IDF0120448",
  "timestampDebut": "2018-10-11T15:00:00.000+02:00",
  "timestampFin": "2018-10-11T16:00:00.000+02:00",
  "lieu": {
    "code": "SALREU045",
    "libelleCourt": "Sully 3",
    "libelleLong": "Sully 3, Palais Bourbon"
  },
  "cycleDeVie": {
    "etat": "Confirmé",
    "chrono": {
      "creation": "2018-10-11T09:08:19.000+02:00"
    }
  },
  "demandeurs": {
    "acteurs": [
      {
        "nom": "Mme Marie GUÉVENOUX",
        "acteurRef": "PA721880"
      }
    ]
  },
  "typeReunion": "DEP"
}