{
  "xsiType": "reunionInitParlementaire_type",
  "uid": "RUANR5L15S2018IDF0103999",
  "timestampDebut": "2018-02-15T09:00:00.000+01:00",
  "timestampFin": "2018-02-15T13:30:00.000+01:00",
  "lieu": {
    "code": "SALREU028",
    "libelleCourt": "Salle Colbert",
    "libelleLong": "Salle Colbert , Palais Bourbon"
  },
  "cycleDeVie": {
    "etat": "Confirmé",
    "chrono": {
      "creation": "2018-01-19T14:02:28.000+01:00"
    }
  },
  "demandeurs": {
    "acteurs": [
      {
        "nom": "M. Pacôme RUPIN",
        "acteurRef": "PA721616"
      }
    ]
  },
  "typeReunion": "DEP"
}