{
  "xsiType": "reunionInitParlementaire_type",
  "uid": "RUANR5L15S2019IDF0135940",
  "timestampDebut": "2019-06-24T17:00:00.000+02:00",
  "timestampFin": "2019-06-24T20:00:00.000+02:00",
  "lieu": {
    "code": "SALREU027",
    "libelleCourt": "Salle 6217",
    "libelleLong": "Salle 6217, Palais Bourbon"
  },
  "cycleDeVie": {
    "etat": "Confirmé",
    "chrono": {
      "creation": "2019-06-20T09:45:33.000+02:00"
    }
  },
  "demandeurs": {
    "acteurs": [
      {
        "nom": "M. Julien AUBERT",
        "acteurRef": "PA609726"
      }
    ]
  },
  "typeReunion": "DEP"
}