{
  "xsiType": "reunionInitParlementaire_type",
  "uid": "RUANR5L15S2019IDF0131435",
  "timestampDebut": "2019-06-14T10:00:00.000+02:00",
  "timestampFin": "2019-06-14T13:00:00.000+02:00",
  "lieu": {
    "code": "SALREU003",
    "libelleCourt": "Salle Victor Hugo",
    "libelleLong": "Salle Victor Hugo, 101, rue de l'Université"
  },
  "cycleDeVie": {
    "etat": "Confirmé",
    "chrono": {
      "creation": "2019-04-02T15:30:44.000+02:00"
    }
  },
  "demandeurs": {
    "acteurs": [
      {
        "nom": "Mme Samantha CAZEBONNE",
        "acteurRef": "PA721166"
      }
    ]
  },
  "typeReunion": "DEP"
}