{
  "xsiType": "reunionInitParlementaire_type",
  "uid": "RUANR5L15S2018IDF0096259",
  "timestampDebut": "2017-10-05T09:00:00.000+02:00",
  "timestampFin": "2017-10-05T13:00:00.000+02:00",
  "lieu": {
    "code": "SALREU019",
    "libelleCourt": "Salon Mars I",
    "libelleLong": "Salon Mars I, 101, rue de l'Université"
  },
  "cycleDeVie": {
    "etat": "Confirmé",
    "chrono": {
      "creation": "2017-09-13T18:03:59.000+02:00"
    }
  },
  "demandeurs": {
    "organe": {
      "nom": "GROUPE LA RÉPUBLIQUE EN MARCHE",
      "organeRef": "PO730964"
    }
  },
  "organeReuniRef": "PO730964",
  "typeReunion": "GP"
}