{
  "xsiType": "reunionInitParlementaire_type",
  "uid": "RUANR5L15S2019IDF0124357",
  "timestampDebut": "2019-01-23T11:15:00.000+01:00",
  "timestampFin": "2019-01-23T12:15:00.000+01:00",
  "lieu": {
    "code": "SALREU012",
    "libelleCourt": "Salle N° 23",
    "libelleLong": "Salle N° 23, 3, rue Aristide Briand"
  },
  "cycleDeVie": {
    "etat": "Confirmé",
    "chrono": {
      "creation": "2018-12-21T16:10:31.000+01:00"
    }
  },
  "demandeurs": {
    "organe": {
      "nom": "GROUPE LA RÉPUBLIQUE EN MARCHE",
      "organeRef": "PO730964"
    }
  },
  "organeReuniRef": "PO730964",
  "typeReunion": "GP"
}