{
  "xsiType": "reunionInitParlementaire_type",
  "uid": "RUANR5L15S2018IDF0107709",
  "timestampDebut": "2018-04-18T14:00:00.000+02:00",
  "timestampFin": "2018-04-18T15:00:00.000+02:00",
  "lieu": {
    "code": "SALREU017",
    "libelleCourt": "Salon Visconti",
    "libelleLong": "Salon Visconti, 101, rue de l'Université"
  },
  "cycleDeVie": {
    "etat": "Annulé",
    "chrono": {
      "creation": "2018-03-14T15:16:57.000+01:00",
      "cloture": "2018-04-13T10:32:17.000+02:00"
    }
  },
  "demandeurs": {
    "acteurs": [
      {
        "nom": "Mme Monique IBORRA",
        "acteurRef": "PA331835"
      }
    ]
  },
  "typeReunion": "DEP"
}