{
  "xsiType": "reunionInitParlementaire_type",
  "uid": "RUANR5L15S2018IDF0110150",
  "timestampDebut": "2018-06-14T11:00:00.000+02:00",
  "timestampFin": "2018-06-14T13:00:00.000+02:00",
  "lieu": {
    "code": "SALREU048",
    "libelleCourt": "Salle 6809",
    "libelleLong": "Salle 6809, Palais Bourbon"
  },
  "cycleDeVie": {
    "etat": "Confirmé",
    "chrono": {
      "creation": "2018-04-17T11:59:44.000+02:00"
    }
  },
  "demandeurs": {
    "acteurs": [
      {
        "nom": "Mme Stéphanie KERBARH",
        "acteurRef": "PA721514"
      },
      {
        "nom": "Mme Bénédicte PEYROL",
        "acteurRef": "PA718736"
      }
    ]
  },
  "typeReunion": "DEP"
}