{
  "xsiType": "reunionInitParlementaire_type",
  "uid": "RUANR5L15S2020IDF0141157",
  "timestampDebut": "2019-10-10T15:00:00.000+02:00",
  "timestampFin": "2019-10-10T19:00:00.000+02:00",
  "lieu": {
    "code": "SALREU015",
    "libelleCourt": "Salle 7044",
    "libelleLong": "Salle 7044, 103, rue de l'Université"
  },
  "cycleDeVie": {
    "etat": "Annulé",
    "chrono": {
      "creation": "2019-09-30T17:55:18.000+02:00",
      "cloture": "2019-10-08T17:34:15.000+02:00"
    }
  },
  "demandeurs": {
    "acteurs": [
      {
        "nom": "M. Dimitri HOUBRON",
        "acteurRef": "PA720454"
      }
    ]
  },
  "typeReunion": "DEP"
}