{
  "xsiType": "reunionInitParlementaire_type",
  "uid": "RUANR5L15S2017IDF0094912",
  "timestampDebut": "2017-09-09T13:00:00.000+02:00",
  "timestampFin": "2017-09-09T17:00:00.000+02:00",
  "lieu": {
    "code": "SALREU026",
    "libelleCourt": "9ème Bureau",
    "libelleLong": "9ème Bureau, Palais Bourbon"
  },
  "cycleDeVie": {
    "etat": "Confirmé",
    "chrono": {
      "creation": "2017-07-31T14:28:23.000+02:00"
    }
  },
  "demandeurs": {
    "acteurs": [
      {
        "nom": "Mme George PAU-LANGEVIN",
        "acteurRef": "PA335532"
      }
    ]
  },
  "typeReunion": "DEP"
}