{
  "xsiType": "reunionInitParlementaire_type",
  "uid": "RUANR5L15S2017IDF0095976",
  "timestampDebut": "2017-09-12T09:30:00.000+02:00",
  "timestampFin": "2017-09-12T10:30:00.000+02:00",
  "lieu": {
    "code": "SALREU022",
    "libelleCourt": "Salle 7326",
    "libelleLong": "Salle 7326, 101, rue de l'Université"
  },
  "cycleDeVie": {
    "etat": "Confirmé",
    "chrono": {
      "creation": "2017-09-08T16:22:59.000+02:00"
    }
  },
  "demandeurs": {
    "acteurs": [
      {
        "nom": "M. Jean-Charles COLAS-ROY",
        "acteurRef": "PA719740"
      }
    ]
  },
  "typeReunion": "DEP"
}