{
  "xsiType": "reunionInitParlementaire_type",
  "uid": "RUANR5L15S2020IDF0143775",
  "timestampDebut": "2019-11-19T10:00:00.000+01:00",
  "timestampFin": "2019-11-19T13:00:00.000+01:00",
  "lieu": {
    "code": "SALREU041",
    "libelleCourt": "Sully 5",
    "libelleLong": "Sully 5, Palais Bourbon"
  },
  "cycleDeVie": {
    "etat": "Confirmé",
    "chrono": {
      "creation": "2019-11-15T14:43:11.000+01:00"
    }
  },
  "demandeurs": {
    "acteurs": [
      {
        "nom": "M. Jean-Luc WARSMANN",
        "acteurRef": "PA2952"
      }
    ]
  },
  "typeReunion": "DEP"
}