{
  "xsiType": "reunionInitParlementaire_type",
  "uid": "RUANR5L15S2018IDF0113038",
  "timestampDebut": "2018-06-12T13:30:00.000+02:00",
  "timestampFin": "2018-06-12T15:00:00.000+02:00",
  "lieu": {
    "code": "SALREU046",
    "libelleCourt": "Sully 1",
    "libelleLong": "Sully 1, Palais Bourbon"
  },
  "cycleDeVie": {
    "etat": "Confirmé",
    "chrono": {
      "creation": "2018-06-05T19:32:59.000+02:00"
    }
  },
  "demandeurs": {
    "acteurs": [
      {
        "nom": "M. Ugo BERNALICIS",
        "acteurRef": "PA720430"
      }
    ]
  },
  "typeReunion": "DEP"
}