{
  "xsiType": "reunionCommission_type",
  "uid": "RUANR5L15S2018IDC427843",
  "timestampDebut": "2017-12-05T21:20:00.000+01:00",
  "timestampFin": "2017-12-05T23:25:00.000+01:00",
  "lieu": {
    "libelleLong": "salle 6238 (Affaires culturelles)"
  },
  "cycleDeVie": {
    "etat": "Confirmé",
    "chrono": {
      "creation": "2017-11-16T00:00:00.000+01:00"
    }
  },
  "organeReuniRef": "PO419604",
  "participants": {
    "participantsInternes": [
      {
        "acteurRef": "PA719146",
        "presence": "absent"
      },
      {
        "acteurRef": "PA721036",
        "presence": "excusé"
      },
      {
        "acteurRef": "PA724827",
        "presence": "excusé"
      },
      {
        "acteurRef": "PA720124",
        "presence": "absent"
      },
      {
        "acteurRef": "PA719318",
        "presence": "absent"
      },
      {
        "acteurRef": "PA722190",
        "presence": "présent"
      },
      {
        "acteurRef": "PA720256",
        "presence": "présent"
      },
      {
        "acteurRef": "PA642847",
        "presence": "présent"
      },
      {
        "acteurRef": "PA718884",
        "presence": "présent"
      },
      {
        "acteurRef": "PA722046",
        "presence": "absent"
      },
      {
        "acteurRef": "PA719488",
        "presence": "présent"
      },
      {
        "acteurRef": "PA508",
        "presence": "absent"
      },
      {
        "acteurRef": "PA720576",
        "presence": "présent"
      },
      {
        "acteurRef": "PA722030",
        "presence": "absent"
      },
      {
        "acteurRef": "PA223837",
        "presence": "excusé"
      },
      {
        "acteurRef": "PA721328",
        "presence": "présent"
      },
      {
        "acteurRef": "PA689",
        "presence": "absent"
      },
      {
        "acteurRef": "PA721750",
        "presence": "présent"
      },
      {
        "acteurRef": "PA721352",
        "presence": "absent"
      },
      {
        "acteurRef": "PA721218",
        "presence": "présent"
      },
      {
        "acteurRef": "PA719170",
        "presence": "présent"
      },
      {
        "acteurRef": "PA702054",
        "presence": "excusé"
      },
      {
        "acteurRef": "PA719756",
        "presence": "présent"
      },
      {
        "acteurRef": "PA719814",
        "presence": "présent"
      },
      {
        "acteurRef": "PA719118",
        "presence": "absent"
      },
      {
        "acteurRef": "PA720696",
        "presence": "présent"
      },
      {
        "acteurRef": "PA719162",
        "presence": "présent"
      },
      {
        "acteurRef": "PA608826",
        "presence": "présent"
      },
      {
        "acteurRef": "PA721194",
        "presence": "présent"
      },
      {
        "acteurRef": "PA719044",
        "presence": "absent"
      },
      {
        "acteurRef": "PA721896",
        "presence": "présent"
      },
      {
        "acteurRef": "PA720030",
        "presence": "excusé"
      },
      {
        "acteurRef": "PA722366",
        "presence": "présent"
      },
      {
        "acteurRef": "PA720198",
        "presence": "présent"
      },
      {
        "acteurRef": "PA720178",
        "presence": "absent"
      },
      {
        "acteurRef": "PA267324",
        "presence": "absent"
      },
      {
        "acteurRef": "PA605991",
        "presence": "absent"
      },
      {
        "acteurRef": "PA719108",
        "presence": "présent"
      },
      {
        "acteurRef": "PA721784",
        "presence": "absent"
      },
      {
        "acteurRef": "PA722070",
        "presence": "absent"
      },
      {
        "acteurRef": "PA718794",
        "presence": "absent"
      },
      {
        "acteurRef": "PA608416",
        "presence": "présent"
      },
      {
        "acteurRef": "PA332614",
        "presence": "présent"
      },
      {
        "acteurRef": "PA719230",
        "presence": "absent"
      },
      {
        "acteurRef": "PA721506",
        "presence": "absent"
      },
      {
        "acteurRef": "PA643205",
        "presence": "présent"
      },
      {
        "acteurRef": "PA718868",
        "presence": "présent"
      },
      {
        "acteurRef": "PA719728",
        "presence": "présent"
      },
      {
        "acteurRef": "PA345722",
        "presence": "absent"
      },
      {
        "acteurRef": "PA720446",
        "presence": "présent"
      },
      {
        "acteurRef": "PA720988",
        "presence": "excusé"
      },
      {
        "acteurRef": "PA719640",
        "presence": "présent"
      },
      {
        "acteurRef": "PA719272",
        "presence": "absent"
      },
      {
        "acteurRef": "PA720630",
        "presence": "absent"
      },
      {
        "acteurRef": "PA719456",
        "presence": "absent"
      },
      {
        "acteurRef": "PA719364",
        "presence": "absent"
      },
      {
        "acteurRef": "PA335532",
        "presence": "présent"
      },
      {
        "acteurRef": "PA719946",
        "presence": "absent"
      },
      {
        "acteurRef": "PA721234",
        "presence": "présent"
      },
      {
        "acteurRef": "PA721844",
        "presence": "présent"
      },
      {
        "acteurRef": "PA718944",
        "presence": "présent"
      },
      {
        "acteurRef": "PA721888",
        "presence": "absent"
      },
      {
        "acteurRef": "PA266776",
        "presence": "absent"
      },
      {
        "acteurRef": "PA335758",
        "presence": "excusé"
      },
      {
        "acteurRef": "PA720900",
        "presence": "présent"
      },
      {
        "acteurRef": "PA720066",
        "presence": "présent"
      },
      {
        "acteurRef": "PA722252",
        "presence": "présent"
      },
      {
        "acteurRef": "PA718902",
        "presence": "présent"
      },
      {
        "acteurRef": "PA721226",
        "presence": "présent"
      },
      {
        "acteurRef": "PA720190",
        "presence": "excusé"
      },
      {
        "acteurRef": "PA720754",
        "presence": "présent"
      },
      {
        "acteurRef": "PA720854",
        "presence": "présent"
      },
      {
        "acteurRef": "PA720568",
        "presence": "absent"
      },
      {
        "acteurRef": "PA606639",
        "presence": "excusé"
      },
      {
        "acteurRef": "PA267330",
        "presence": "absent"
      }
    ]
  },
  "ouverturePresse": true,
  "odj": {
    "convocationOdj": [
      "– Suite de l'examen du projet de loi relatif à l’orientation et à la réussite des étudiants (n°391)"
    ],
    "resumeOdj": [
      "orientation et réussite des étudiants (rapport) (n° 391) (suite rapport)."
    ],
    "pointsOdj": [
      {
        "xsiType": "podjReunion_type",
        "uid": "RUANR5L15S2018IDC427843PT25258",
        "cycleDeVie": {
          "etat": "Eventuel",
          "chrono": {
            "creation": "2017-11-22T00:00:00.000+01:00"
          }
        },
        "objet": "Examen du texte",
        "dossiersLegislatifsRefs": [
          "DLR5L15N36143"
        ],
        "typePointOdj": "Examen",
        "comiteSecret": false
      }
    ]
  },
  "compteRenduRef": "CRCANR5L15S2018PO419604N017",
  "formatReunion": "Ordinaire",
  "infosReunionsInternationale": {
    "estReunionInternationale": false
  },
  "captationVideo": false
}