{
  "xsiType": "reunionInitParlementaire_type",
  "uid": "RUANR5L15S2018IDF0115830",
  "timestampDebut": "2018-07-25T10:00:00.000+02:00",
  "timestampFin": "2018-07-25T11:00:00.000+02:00",
  "lieu": {
    "code": "SALREU008",
    "libelleCourt": "5ème Bureau",
    "libelleLong": "5ème Bureau, Palais Bourbon"
  },
  "cycleDeVie": {
    "etat": "Confirmé",
    "chrono": {
      "creation": "2018-07-18T11:07:02.000+02:00"
    }
  },
  "demandeurs": {
    "acteurs": [
      {
        "nom": "Mme Yolaine DE COURSON",
        "acteurRef": "PA719194"
      }
    ]
  },
  "typeReunion": "DEP"
}