{
  "xsiType": "reunionCommission_type",
  "uid": "RUANR5L15S2019IDC431267",
  "timestampDebut": "2019-01-23T17:30:00.000+01:00",
  "lieu": {
    "libelleLong": "salle Lamartine"
  },
  "cycleDeVie": {
    "etat": "Confirmé",
    "chrono": {
      "creation": "2019-01-18T00:00:00.000+01:00"
    }
  },
  "organeReuniRef": "PO59047",
  "participants": {},
  "ouverturePresse": false,
  "odj": {
    "convocationOdj": [
      "Table ronde sur l’Irak réunissant Mme Vian Dakhil, ancienne députée au Conseil des représentants d’Irak, lauréate du prix Bruno Kreisky,  Mme Élise Boghossian, présidente fondatrice de EliseCare, M. Ahmad Hassan Jarjisse, chef du département de français de l’Université de Mossoul  et M. Fahad Sabah Mansoor Al-Gburi, co-fondateur du “Book Forum\"."
    ],
    "resumeOdj": [
      "Table ronde sur l’Irak réunissant Mme Vian Dakhil, ancienne députée au Conseil des représentants d’Irak, lauréate du prix Bruno Kreisky,  Mme Élise Boghossian, présidente fondatrice de EliseCare, M. Ahmad Hassan Jarjisse, chef du département de français de l’Université de Mossoul  et M. Fahad Sabah Manssor Al-Gburi, co-fondateur du “Book Forum\"."
    ]
  },
  "formatReunion": "Ordinaire",
  "infosReunionsInternationale": {
    "estReunionInternationale": true,
    "listePays": [
      "GOP756443"
    ],
    "informationsComplementaires": "Didier Le Bot - 34205"
  },
  "captationVideo": false
}