{
  "xsiType": "reunionInitParlementaire_type",
  "uid": "RUANR5L15S2018IDF0117020",
  "timestampDebut": "2018-09-18T10:00:00.000+02:00",
  "timestampFin": "2018-09-18T11:00:00.000+02:00",
  "lieu": {
    "code": "SALREU018",
    "libelleCourt": "Salon Mansart",
    "libelleLong": "Salon Mansart, 101, rue de l'Université"
  },
  "cycleDeVie": {
    "etat": "Confirmé",
    "chrono": {
      "creation": "2018-09-03T11:49:34.000+02:00"
    }
  },
  "demandeurs": {
    "acteurs": [
      {
        "nom": "M. Olivier SERVA",
        "acteurRef": "PA720960"
      }
    ]
  },
  "typeReunion": "DEP"
}