{
  "xsiType": "reunionInitParlementaire_type",
  "uid": "RUANR5L15S2018IDF0113539",
  "timestampDebut": "2018-06-18T14:15:00.000+02:00",
  "timestampFin": "2018-06-18T16:15:00.000+02:00",
  "lieu": {
    "code": "SALREU002",
    "libelleCourt": "Salle 7070",
    "libelleLong": "Salle 7070, 103, rue de l'Université"
  },
  "cycleDeVie": {
    "etat": "Confirmé",
    "chrono": {
      "creation": "2018-06-12T18:23:41.000+02:00"
    }
  },
  "demandeurs": {
    "acteurs": [
      {
        "nom": "M. Richard FERRAND",
        "acteurRef": "PA606171"
      }
    ]
  },
  "typeReunion": "DEP"
}