{
  "xsiType": "reunionInitParlementaire_type",
  "uid": "RUANR5L15S2019IDF0133667",
  "timestampDebut": "2019-05-16T18:30:00.000+02:00",
  "timestampFin": "2019-05-16T19:30:00.000+02:00",
  "lieu": {
    "code": "SALREU006",
    "libelleCourt": "3ème Bureau",
    "libelleLong": "3ème Bureau, Palais Bourbon"
  },
  "cycleDeVie": {
    "etat": "Annulé",
    "chrono": {
      "creation": "2019-05-13T15:36:47.000+02:00",
      "cloture": "2019-05-16T11:39:42.000+02:00"
    }
  },
  "demandeurs": {
    "acteurs": [
      {
        "nom": "M. Cédric ROUSSEL",
        "acteurRef": "PA718902"
      }
    ]
  },
  "typeReunion": "DEP"
}