{
  "xsiType": "reunionCommission_type",
  "uid": "RUANR5L15S2018IDC427528",
  "timestampDebut": "2017-10-25T09:30:00.000+02:00",
  "timestampFin": "2017-10-25T11:40:00.000+02:00",
  "lieu": {
    "libelleLong": "salle 6238 (Affaires culturelles)"
  },
  "cycleDeVie": {
    "etat": "Confirmé",
    "chrono": {
      "creation": "2017-10-12T00:00:00.000+02:00"
    }
  },
  "organeReuniRef": "PO419604",
  "participants": {
    "participantsInternes": [
      {
        "acteurRef": "PA719146",
        "presence": "absent"
      },
      {
        "acteurRef": "PA721036",
        "presence": "excusé"
      },
      {
        "acteurRef": "PA724827",
        "presence": "excusé"
      },
      {
        "acteurRef": "PA720124",
        "presence": "présent"
      },
      {
        "acteurRef": "PA719318",
        "presence": "présent"
      },
      {
        "acteurRef": "PA722190",
        "presence": "présent"
      },
      {
        "acteurRef": "PA720256",
        "presence": "présent"
      },
      {
        "acteurRef": "PA718884",
        "presence": "présent"
      },
      {
        "acteurRef": "PA722046",
        "presence": "présent"
      },
      {
        "acteurRef": "PA719488",
        "presence": "présent"
      },
      {
        "acteurRef": "PA508",
        "presence": "absent"
      },
      {
        "acteurRef": "PA720576",
        "presence": "présent"
      },
      {
        "acteurRef": "PA722030",
        "presence": "présent"
      },
      {
        "acteurRef": "PA223837",
        "presence": "absent"
      },
      {
        "acteurRef": "PA721328",
        "presence": "présent"
      },
      {
        "acteurRef": "PA689",
        "presence": "absent"
      },
      {
        "acteurRef": "PA721750",
        "presence": "présent"
      },
      {
        "acteurRef": "PA721352",
        "presence": "présent"
      },
      {
        "acteurRef": "PA721218",
        "presence": "présent"
      },
      {
        "acteurRef": "PA719170",
        "presence": "présent"
      },
      {
        "acteurRef": "PA702054",
        "presence": "excusé"
      },
      {
        "acteurRef": "PA719814",
        "presence": "présent"
      },
      {
        "acteurRef": "PA719118",
        "presence": "excusé"
      },
      {
        "acteurRef": "PA720696",
        "presence": "absent"
      },
      {
        "acteurRef": "PA719162",
        "presence": "présent"
      },
      {
        "acteurRef": "PA608826",
        "presence": "présent"
      },
      {
        "acteurRef": "PA721194",
        "presence": "présent"
      },
      {
        "acteurRef": "PA719044",
        "presence": "absent"
      },
      {
        "acteurRef": "PA721896",
        "presence": "présent"
      },
      {
        "acteurRef": "PA720030",
        "presence": "présent"
      },
      {
        "acteurRef": "PA720198",
        "presence": "présent"
      },
      {
        "acteurRef": "PA720178",
        "presence": "présent"
      },
      {
        "acteurRef": "PA267324",
        "presence": "absent"
      },
      {
        "acteurRef": "PA605991",
        "presence": "présent"
      },
      {
        "acteurRef": "PA719108",
        "presence": "absent"
      },
      {
        "acteurRef": "PA721784",
        "presence": "absent"
      },
      {
        "acteurRef": "PA722070",
        "presence": "présent"
      },
      {
        "acteurRef": "PA718794",
        "presence": "présent"
      },
      {
        "acteurRef": "PA332614",
        "presence": "absent"
      },
      {
        "acteurRef": "PA719230",
        "presence": "présent"
      },
      {
        "acteurRef": "PA721506",
        "presence": "excusé"
      },
      {
        "acteurRef": "PA643205",
        "presence": "présent"
      },
      {
        "acteurRef": "PA718868",
        "presence": "présent"
      },
      {
        "acteurRef": "PA719728",
        "presence": "présent"
      },
      {
        "acteurRef": "PA345722",
        "presence": "présent"
      },
      {
        "acteurRef": "PA720446",
        "presence": "présent"
      },
      {
        "acteurRef": "PA720988",
        "presence": "excusé"
      },
      {
        "acteurRef": "PA719640",
        "presence": "présent"
      },
      {
        "acteurRef": "PA719272",
        "presence": "présent"
      },
      {
        "acteurRef": "PA720630",
        "presence": "présent"
      },
      {
        "acteurRef": "PA719456",
        "presence": "présent"
      },
      {
        "acteurRef": "PA719364",
        "presence": "absent"
      },
      {
        "acteurRef": "PA335532",
        "presence": "absent"
      },
      {
        "acteurRef": "PA719946",
        "presence": "présent"
      },
      {
        "acteurRef": "PA721234",
        "presence": "présent"
      },
      {
        "acteurRef": "PA721844",
        "presence": "présent"
      },
      {
        "acteurRef": "PA718944",
        "presence": "absent"
      },
      {
        "acteurRef": "PA721888",
        "presence": "présent"
      },
      {
        "acteurRef": "PA266776",
        "presence": "absent"
      },
      {
        "acteurRef": "PA335758",
        "presence": "excusé"
      },
      {
        "acteurRef": "PA720900",
        "presence": "excusé"
      },
      {
        "acteurRef": "PA720066",
        "presence": "absent"
      },
      {
        "acteurRef": "PA722252",
        "presence": "excusé"
      },
      {
        "acteurRef": "PA718902",
        "presence": "excusé"
      },
      {
        "acteurRef": "PA721226",
        "presence": "absent"
      },
      {
        "acteurRef": "PA346876",
        "presence": "excusé"
      },
      {
        "acteurRef": "PA720190",
        "presence": "présent"
      },
      {
        "acteurRef": "PA720754",
        "presence": "présent"
      },
      {
        "acteurRef": "PA720854",
        "presence": "présent"
      },
      {
        "acteurRef": "PA720568",
        "presence": "présent"
      },
      {
        "acteurRef": "PA606639",
        "presence": "présent"
      }
    ]
  },
  "ouverturePresse": true,
  "odj": {
    "convocationOdj": [
      "– Audition de M. Pierre Sirinelli, Professeur de droit à l’Université Paris I, sur les droits d’auteur et les droits voisins dans l’Europe numérique"
    ],
    "resumeOdj": [
      "audition de M. Pierre Sirinelli, Professeur de droit à l’Université Paris I, sur les droits d’auteur et les droits voisins dans l’Europe numérique."
    ]
  },
  "compteRenduRef": "CRCANR5L15S2018PO419604N005",
  "formatReunion": "Ordinaire",
  "infosReunionsInternationale": {
    "estReunionInternationale": false
  },
  "captationVideo": false
}