{
  "xsiType": "reunionInitParlementaire_type",
  "uid": "RUANR5L15S2018IDF0106180",
  "timestampDebut": "2018-03-12T10:00:00.000+01:00",
  "timestampFin": "2018-03-12T13:00:00.000+01:00",
  "lieu": {
    "code": "SALREU029",
    "libelleCourt": "Salon Mars III",
    "libelleLong": "Salon Mars III, 101, rue de l'Université"
  },
  "cycleDeVie": {
    "etat": "Annulé",
    "chrono": {
      "creation": "2018-02-19T17:19:33.000+01:00",
      "cloture": "2018-02-21T13:58:52.000+01:00"
    }
  },
  "demandeurs": {
    "acteurs": [
      {
        "nom": "Mme Elsa FAUCILLON",
        "acteurRef": "PA721896"
      }
    ]
  },
  "typeReunion": "DEP"
}