{
  "xsiType": "seance_type",
  "uid": "RUSNR5L15S2018IDS21040",
  "timestampDebut": "2018-05-16T14:30:00.000+02:00",
  "timestampFin": "2018-05-17T00:40:00.000+02:00",
  "lieu": {
    "code": "S",
    "libelleLong": "Sénat"
  },
  "cycleDeVie": {
    "etat": "Confirmé",
    "chrono": {
      "creation": "2018-04-11T00:00:00.000+02:00"
    }
  },
  "organeReuniRef": "PO78718",
  "sessionRef": "SCR5A2018O1",
  "ouverturePresse": true,
  "odj": {
    "pointsOdj": [
      {
        "xsiType": "podjSeanceConfPres_type",
        "uid": "RUSNR5L15S2018IDS21040PT35857",
        "cycleDeVie": {
          "etat": "Confirmé",
          "chrono": {
            "creation": "2018-04-11T00:00:00.000+02:00"
          }
        },
        "objet": "Discussion de la proposition de loi visant à instaurer un régime transitoire d'indemnisation pour les interdictions d'habitation résultant d'un risque de recul du trait de côte, présentée par Mmes Françoise CARTRON, Laurence HARRIBEY et M. Philippe MADRELLE (n° 307, 2017&#8209;2018)",
        "dossiersLegislatifsRefs": [
          "DLR5L15N36551"
        ],
        "typePointOdj": "Discussion",
        "comiteSecret": false,
        "natureTravauxOdj": "ODJSN",
        "dateConfPres": "2018-04-04T02:00:00.000+02:00"
      },
      {
        "xsiType": "podjSeanceConfPres_type",
        "uid": "RUSNR5L15S2018IDS21040PT35858",
        "cycleDeVie": {
          "etat": "Confirmé",
          "chrono": {
            "creation": "2018-04-11T00:00:00.000+02:00"
          }
        },
        "objet": "Discussion de la proposition de loi renforçant l'efficacité des poursuites contre les auteurs d'infractions financières et supprimant le « verrou de Bercy », présentée par Mme Marie&#8209;Pierre de la GONTRIE et plusieurs de ses collègues (n° 376, 2017&#8209;2018)",
        "dossiersLegislatifsRefs": [
          "DLR5L15N36555"
        ],
        "typePointOdj": "Discussion",
        "comiteSecret": false,
        "natureTravauxOdj": "ODJSN",
        "dateConfPres": "2018-04-04T02:00:00.000+02:00"
      },
      {
        "xsiType": "podjSeanceConfPres_type",
        "uid": "RUSNR5L15S2018IDS21040PT35859",
        "cycleDeVie": {
          "etat": "Confirmé",
          "chrono": {
            "creation": "2018-04-11T00:00:00.000+02:00"
          }
        },
        "objet": "Suite de la discussion de la proposition de loi, adoptée par l'Assemblée nationale, visant à assurer la revalorisation des pensions de retraite agricoles en France continentale et dans les outre-mer (texte de la commission, n° 316, 2017&#8209;2018)",
        "dossiersLegislatifsRefs": [
          "DLR5L14N35468"
        ],
        "typePointOdj": "Suite de la discussion",
        "comiteSecret": false,
        "natureTravauxOdj": "ODJSN",
        "dateConfPres": "2018-04-04T02:00:00.000+02:00"
      }
    ]
  },
  "compteRenduRef": "CRSSNR5S2018IDS20180516",
  "identifiants": {
    "numSeanceJo": "83",
    "idJo": "20180083",
    "quantieme": "Unique",
    "dateSeance": "2018-05-16T02:00:00.000+02:00"
  },
  "captationVideo": true
}