{
  "xsiType": "reunionInitParlementaire_type",
  "uid": "RUANR5L15S2019IDF0121498",
  "timestampDebut": "2018-11-14T09:00:00.000+01:00",
  "timestampFin": "2018-11-14T09:45:00.000+01:00",
  "lieu": {
    "code": "SALREU049",
    "libelleCourt": "Salle 6822",
    "libelleLong": "Salle 6822, Palais Bourbon"
  },
  "cycleDeVie": {
    "etat": "Annulé",
    "chrono": {
      "creation": "2018-10-29T10:36:14.000+01:00",
      "cloture": "2018-11-08T10:06:47.000+01:00"
    }
  },
  "demandeurs": {
    "acteurs": [
      {
        "nom": "M. Alexandre HOLROYD",
        "acteurRef": "PA721150"
      }
    ]
  },
  "typeReunion": "DEP"
}