{
  "xsiType": "reunionInitParlementaire_type",
  "uid": "RUANR5L15S2019IDF0127331",
  "timestampDebut": "2019-04-04T09:30:00.000+02:00",
  "timestampFin": "2019-04-04T11:30:00.000+02:00",
  "lieu": {
    "code": "SALREU023",
    "libelleCourt": "Salle 7426",
    "libelleLong": "Salle 7426, 101, rue de l'Université"
  },
  "cycleDeVie": {
    "etat": "Confirmé",
    "chrono": {
      "creation": "2019-02-11T15:53:50.000+01:00"
    }
  },
  "demandeurs": {
    "acteurs": [
      {
        "nom": "Mme Pascale BOYER",
        "acteurRef": "PA718710"
      }
    ]
  },
  "typeReunion": "DEP"
}