{
  "xsiType": "reunionInitParlementaire_type",
  "uid": "RUANR5L15S2019IDF0117747",
  "timestampDebut": "2018-12-11T14:00:00.000+01:00",
  "timestampFin": "2018-12-11T15:00:00.000+01:00",
  "lieu": {
    "code": "SALREU025",
    "libelleCourt": "7ème Bureau",
    "libelleLong": "7ème Bureau, Palais Bourbon"
  },
  "cycleDeVie": {
    "etat": "Confirmé",
    "chrono": {
      "creation": "2018-09-06T15:45:23.000+02:00"
    }
  },
  "demandeurs": {
    "organe": {
      "nom": "GROUPE DU MOUVEMENT DÉMOCRATE ET APPARENTÉS",
      "organeRef": "PO730970"
    }
  },
  "organeReuniRef": "PO730970",
  "typeReunion": "GP"
}