{
  "xsiType": "reunionInitParlementaire_type",
  "uid": "RUANR5L15S2020IDF0138248",
  "timestampDebut": "2019-12-19T09:00:00.000+01:00",
  "timestampFin": "2019-12-19T13:00:00.000+01:00",
  "lieu": {
    "code": "SALREU003",
    "libelleCourt": "Salle Victor Hugo",
    "libelleLong": "Salle Victor Hugo, 101, rue de l'Université"
  },
  "cycleDeVie": {
    "etat": "Confirmé",
    "chrono": {
      "creation": "2019-07-31T12:14:57.000+02:00"
    }
  },
  "demandeurs": {
    "acteurs": [
      {
        "nom": "Mme Béatrice DESCAMPS",
        "acteurRef": "PA720696"
      }
    ]
  },
  "typeReunion": "DEP"
}