{
  "xsiType": "reunionInitParlementaire_type",
  "uid": "RUANR5L15S2020IDF0143889",
  "timestampDebut": "2019-12-10T10:00:00.000+01:00",
  "timestampFin": "2019-12-10T13:00:00.000+01:00",
  "lieu": {
    "code": "SALREU041",
    "libelleCourt": "Sully 5",
    "libelleLong": "Sully 5, Palais Bourbon"
  },
  "cycleDeVie": {
    "etat": "Confirmé",
    "chrono": {
      "creation": "2019-11-19T10:04:07.000+01:00"
    }
  },
  "demandeurs": {
    "acteurs": [
      {
        "nom": "Mme Naïma MOUTCHOU",
        "acteurRef": "PA720908"
      }
    ]
  },
  "typeReunion": "DEP"
}