{
  "xsiType": "reunionCommission_type",
  "uid": "RUANR5L15S2018IDC429650",
  "timestampDebut": "2018-06-01T21:15:00.000+02:00",
  "lieu": {
    "libelleLong": "salle 6351 (Affaires sociales)"
  },
  "cycleDeVie": {
    "etat": "Annulé",
    "chrono": {
      "creation": "2018-05-30T00:00:00.000+02:00",
      "cloture": "2018-06-01T00:00:00.000+02:00"
    }
  },
  "organeReuniRef": "PO420120",
  "participants": {},
  "ouverturePresse": false,
  "odj": {
    "convocationOdj": [
      "– Suite de l’examen des articles du projet de loi pour la liberté de choisir son avenir professionnel (n° 904) (Mmes Nathalie Elimas, Catherine Fabre et M. Aurélien Taché, rapporteurs)"
    ],
    "resumeOdj": [
      "– suite de l’examen des articles du projet de loi pour la liberté de choisir son avenir professionnel (n° 904) (Mmes Nathalie Elimas, Catherine Fabre et M. Aurélien Taché, rapporteurs)."
    ],
    "pointsOdj": [
      {
        "xsiType": "podjReunion_type",
        "uid": "RUANR5L15S2018IDC429650PT25745",
        "cycleDeVie": {
          "etat": "Annulé",
          "chrono": {
            "creation": "2018-05-30T00:00:00.000+02:00",
            "cloture": "2018-06-01T00:00:00.000+02:00"
          }
        },
        "objet": "Examen du texte",
        "typePointOdj": "Examen",
        "comiteSecret": false
      }
    ]
  },
  "formatReunion": "Ordinaire",
  "infosReunionsInternationale": {
    "estReunionInternationale": false
  },
  "captationVideo": false
}