{
  "xsiType": "reunionInitParlementaire_type",
  "uid": "RUANR5L15S2019IDF0127670",
  "timestampDebut": "2019-02-21T10:30:00.000+01:00",
  "timestampFin": "2019-02-21T11:30:00.000+01:00",
  "lieu": {
    "code": "SALREU023",
    "libelleCourt": "Salle 7426",
    "libelleLong": "Salle 7426, 101, rue de l'Université"
  },
  "cycleDeVie": {
    "etat": "Confirmé",
    "chrono": {
      "creation": "2019-02-14T15:55:38.000+01:00"
    }
  },
  "demandeurs": {
    "acteurs": [
      {
        "nom": "Mme Sira SYLLA",
        "acteurRef": "PA722118"
      }
    ]
  },
  "typeReunion": "DEP"
}