{
  "xsiType": "reunionInitParlementaire_type",
  "uid": "RUANR5L15S2019IDF0123774",
  "timestampDebut": "2019-01-29T16:00:00.000+01:00",
  "timestampFin": "2019-01-29T17:00:00.000+01:00",
  "lieu": {
    "code": "SALREU048",
    "libelleCourt": "Salle 6809",
    "libelleLong": "Salle 6809, Palais Bourbon"
  },
  "cycleDeVie": {
    "etat": "Annulé",
    "chrono": {
      "creation": "2018-12-12T11:15:06.000+01:00",
      "cloture": "2019-01-09T12:12:36.000+01:00"
    }
  },
  "demandeurs": {
    "acteurs": [
      {
        "nom": "Mme Marie-Pierre RIXAIN",
        "acteurRef": "PA722252"
      }
    ]
  },
  "typeReunion": "DEP"
}