{
  "xsiType": "reunionCommission_type",
  "uid": "RUANR5L15S2019IDC430722",
  "timestampDebut": "2018-11-09T09:00:00.000+01:00",
  "timestampFin": "2018-11-09T09:45:00.000+01:00",
  "lieu": {
    "libelleLong": "salle 6350 (Finances)"
  },
  "cycleDeVie": {
    "etat": "Confirmé",
    "chrono": {
      "creation": "2018-10-31T00:00:00.000+01:00"
    }
  },
  "organeReuniRef": "PO59048",
  "participants": {
    "participantsInternes": [
      {
        "acteurRef": "PA718954",
        "presence": "présent"
      },
      {
        "acteurRef": "PA605963",
        "presence": "absent"
      },
      {
        "acteurRef": "PA609726",
        "presence": "absent"
      },
      {
        "acteurRef": "PA721836",
        "presence": "absent"
      },
      {
        "acteurRef": "PA721410",
        "presence": "absent"
      },
      {
        "acteurRef": "PA721608",
        "presence": "présent"
      },
      {
        "acteurRef": "PA605069",
        "presence": "absent"
      },
      {
        "acteurRef": "PA720298",
        "presence": "présent"
      },
      {
        "acteurRef": "PA746",
        "presence": "absent"
      },
      {
        "acteurRef": "PA719138",
        "presence": "absent"
      },
      {
        "acteurRef": "PA720520",
        "presence": "absent"
      },
      {
        "acteurRef": "PA719472",
        "presence": "absent"
      },
      {
        "acteurRef": "PA719250",
        "presence": "absent"
      },
      {
        "acteurRef": "PA721202",
        "presence": "absent"
      },
      {
        "acteurRef": "PA923",
        "presence": "absent"
      },
      {
        "acteurRef": "PA942",
        "presence": "absent"
      },
      {
        "acteurRef": "PA332523",
        "presence": "absent"
      },
      {
        "acteurRef": "PA720268",
        "presence": "absent"
      },
      {
        "acteurRef": "PA719710",
        "presence": "absent"
      },
      {
        "acteurRef": "PA722382",
        "presence": "absent"
      },
      {
        "acteurRef": "PA718720",
        "presence": "absent"
      },
      {
        "acteurRef": "PA643175",
        "presence": "absent"
      },
      {
        "acteurRef": "PA720996",
        "presence": "absent"
      },
      {
        "acteurRef": "PA607193",
        "presence": "absent"
      },
      {
        "acteurRef": "PA721742",
        "presence": "absent"
      },
      {
        "acteurRef": "PA1327",
        "presence": "absent"
      },
      {
        "acteurRef": "PA719480",
        "presence": "absent"
      },
      {
        "acteurRef": "PA267336",
        "presence": "présent"
      },
      {
        "acteurRef": "PA720560",
        "presence": "absent"
      },
      {
        "acteurRef": "PA720790",
        "presence": "absent"
      },
      {
        "acteurRef": "PA721764",
        "presence": "absent"
      },
      {
        "acteurRef": "PA721498",
        "presence": "excusé"
      },
      {
        "acteurRef": "PA722054",
        "presence": "absent"
      },
      {
        "acteurRef": "PA608416",
        "presence": "absent"
      },
      {
        "acteurRef": "PA721150",
        "presence": "présent"
      },
      {
        "acteurRef": "PA719060",
        "presence": "absent"
      },
      {
        "acteurRef": "PA719778",
        "presence": "présent"
      },
      {
        "acteurRef": "PA719798",
        "presence": "absent"
      },
      {
        "acteurRef": "PA720846",
        "presence": "présent"
      },
      {
        "acteurRef": "PA609245",
        "presence": "absent"
      },
      {
        "acteurRef": "PA718978",
        "presence": "absent"
      },
      {
        "acteurRef": "PA720022",
        "presence": "absent"
      },
      {
        "acteurRef": "PA712014",
        "presence": "absent"
      },
      {
        "acteurRef": "PA1874",
        "presence": "excusé"
      },
      {
        "acteurRef": "PA719006",
        "presence": "présent"
      },
      {
        "acteurRef": "PA608016",
        "presence": "présent"
      },
      {
        "acteurRef": "PA722244",
        "presence": "absent"
      },
      {
        "acteurRef": "PA720230",
        "presence": "présent"
      },
      {
        "acteurRef": "PA720728",
        "presence": "absent"
      },
      {
        "acteurRef": "PA721670",
        "presence": "présent"
      },
      {
        "acteurRef": "PA719850",
        "presence": "présent"
      },
      {
        "acteurRef": "PA720492",
        "presence": "absent"
      },
      {
        "acteurRef": "PA720402",
        "presence": "présent"
      },
      {
        "acteurRef": "PA721636",
        "presence": "absent"
      },
      {
        "acteurRef": "PA607595",
        "presence": "absent"
      },
      {
        "acteurRef": "PA721568",
        "presence": "absent"
      },
      {
        "acteurRef": "PA720500",
        "presence": "absent"
      },
      {
        "acteurRef": "PA718736",
        "presence": "présent"
      },
      {
        "acteurRef": "PA336175",
        "presence": "absent"
      },
      {
        "acteurRef": "PA608172",
        "presence": "présent"
      },
      {
        "acteurRef": "PA405480",
        "presence": "absent"
      },
      {
        "acteurRef": "PA609590",
        "presence": "excusé"
      },
      {
        "acteurRef": "PA721458",
        "presence": "absent"
      },
      {
        "acteurRef": "PA720692",
        "presence": "absent"
      },
      {
        "acteurRef": "PA721226",
        "presence": "absent"
      },
      {
        "acteurRef": "PA720878",
        "presence": "absent"
      },
      {
        "acteurRef": "PA722078",
        "presence": "absent"
      },
      {
        "acteurRef": "PA720960",
        "presence": "excusé"
      },
      {
        "acteurRef": "PA719592",
        "presence": "excusé"
      },
      {
        "acteurRef": "PA721542",
        "presence": "absent"
      },
      {
        "acteurRef": "PA607090",
        "presence": "absent"
      },
      {
        "acteurRef": "PA331582",
        "presence": "excusé"
      },
      {
        "acteurRef": "PA2960",
        "presence": "présent"
      }
    ]
  },
  "ouverturePresse": false,
  "odj": {
    "convocationOdj": [
      "Examen du projet de loi de finances rectificatives pour 2018 (n°1371) ( M. Joël Giraud, rapporteur général)"
    ],
    "resumeOdj": [
      "examen du projet de loi de finances rectificatives pour 2018 (n° 1371) ( M. Joël Giraud, rapporteur général)."
    ],
    "pointsOdj": [
      {
        "xsiType": "podjReunion_type",
        "uid": "RUANR5L15S2019IDC430722PT26131",
        "cycleDeVie": {
          "etat": "Confirmé",
          "chrono": {
            "creation": "2018-11-08T00:00:00.000+01:00"
          }
        },
        "objet": "PLFR 2018",
        "dossiersLegislatifsRefs": [
          "DLR5L15N36985"
        ],
        "typePointOdj": "Examen",
        "comiteSecret": false
      }
    ]
  },
  "compteRenduRef": "CRCANR5L15S2019PO59048N033",
  "formatReunion": "Ordinaire",
  "infosReunionsInternationale": {
    "estReunionInternationale": false
  },
  "captationVideo": false
}