{
  "xsiType": "reunionInitParlementaire_type",
  "uid": "RUANR5L15S2018IDF0110666",
  "timestampDebut": "2018-05-03T09:00:00.000+02:00",
  "timestampFin": "2018-05-03T10:00:00.000+02:00",
  "lieu": {
    "code": "SALREU016",
    "libelleCourt": "Salon Gabriel",
    "libelleLong": "Salon Gabriel, 101, rue de l'Université"
  },
  "cycleDeVie": {
    "etat": "Confirmé",
    "chrono": {
      "creation": "2018-04-25T10:23:17.000+02:00"
    }
  },
  "demandeurs": {
    "acteurs": [
      {
        "nom": "Mme Barbara POMPILI",
        "acteurRef": "PA609520"
      }
    ]
  },
  "typeReunion": "DEP"
}