{
  "xsiType": "reunionInitParlementaire_type",
  "uid": "RUANR5L15S2019IDF0121530",
  "timestampDebut": "2018-11-08T09:30:00.000+01:00",
  "timestampFin": "2018-11-08T12:30:00.000+01:00",
  "lieu": {
    "code": "SALREU022",
    "libelleCourt": "Salle 7326",
    "libelleLong": "Salle 7326, 101, rue de l'Université"
  },
  "cycleDeVie": {
    "etat": "Confirmé",
    "chrono": {
      "creation": "2018-10-29T12:54:02.000+01:00"
    }
  },
  "demandeurs": {
    "acteurs": [
      {
        "nom": "M. Frédéric PETIT",
        "acteurRef": "PA721182"
      }
    ]
  },
  "typeReunion": "DEP"
}