{
  "xsiType": "reunionInitParlementaire_type",
  "uid": "RUANR5L15S2020IDF0139305",
  "timestampDebut": "2019-10-03T09:30:00.000+02:00",
  "timestampFin": "2019-10-03T12:30:00.000+02:00",
  "lieu": {
    "code": "SALREU049",
    "libelleCourt": "Salle 6822",
    "libelleLong": "Salle 6822, Palais Bourbon"
  },
  "cycleDeVie": {
    "etat": "Annulé",
    "chrono": {
      "creation": "2019-09-09T11:09:47.000+02:00",
      "cloture": "2019-09-12T12:07:11.000+02:00"
    }
  },
  "demandeurs": {
    "acteurs": [
      {
        "nom": "Mme Sarah EL HAÏRY",
        "acteurRef": "PA720002"
      }
    ]
  },
  "typeReunion": "DEP"
}