{
  "xsiType": "reunionInitParlementaire_type",
  "uid": "RUANR5L15S2018IDFL430580",
  "timestampDebut": "2018-05-16T08:30:00.000+02:00",
  "lieu": {
    "libelleLong": "salon Gabriel"
  },
  "cycleDeVie": {
    "etat": "Confirmé",
    "chrono": {
      "creation": "2018-10-10T00:00:00.000+02:00"
    }
  },
  "organeReuniRef": "PO746857",
  "typeReunion": "GE",
  "odj": {
    "convocationOdj": [
      "Audition de M. François Brottes, président du directoire de Réseau de Transport d'Electricité (RTE)"
    ]
  }
}