{
  "xsiType": "reunionInitParlementaire_type",
  "uid": "RUANR5L15S2019IDF0134697",
  "timestampDebut": "2019-07-18T09:00:00.000+02:00",
  "timestampFin": "2019-07-18T11:30:00.000+02:00",
  "lieu": {
    "code": "SALREU039",
    "libelleCourt": "Salle 6550",
    "libelleLong": "Salle 6550, Palais Bourbon"
  },
  "cycleDeVie": {
    "etat": "Confirmé",
    "chrono": {
      "creation": "2019-05-28T17:51:24.000+02:00"
    }
  },
  "demandeurs": {
    "acteurs": [
      {
        "nom": "Mme Laurence DUMONT",
        "acteurRef": "PA1198"
      }
    ]
  },
  "typeReunion": "DEP"
}