{
  "xsiType": "reunionInitParlementaire_type",
  "uid": "RUANR5L15S2019IDF0115524",
  "timestampDebut": "2018-10-02T09:00:00.000+02:00",
  "timestampFin": "2018-10-02T11:00:00.000+02:00",
  "lieu": {
    "code": "SALREU006",
    "libelleCourt": "3ème Bureau",
    "libelleLong": "3ème Bureau, Palais Bourbon"
  },
  "cycleDeVie": {
    "etat": "Confirmé",
    "chrono": {
      "creation": "2018-07-11T16:46:55.000+02:00"
    }
  },
  "demandeurs": {
    "acteurs": [
      {
        "nom": "Mme Brigitte KUSTER",
        "acteurRef": "PA721506"
      }
    ]
  },
  "typeReunion": "DEP"
}