{
  "xsiType": "reunionInitParlementaire_type",
  "uid": "RUANR5L15S2020IDF0141334",
  "timestampDebut": "2019-10-03T09:00:00.000+02:00",
  "timestampFin": "2019-10-03T10:00:00.000+02:00",
  "lieu": {
    "code": "SALREU021",
    "libelleCourt": "Salle 7207",
    "libelleLong": "Salle 7207, 101, rue de l'Université"
  },
  "cycleDeVie": {
    "etat": "Confirmé",
    "chrono": {
      "creation": "2019-10-02T17:00:24.000+02:00"
    }
  },
  "demandeurs": {
    "acteurs": [
      {
        "nom": "Mme Bénédicte PEYROL",
        "acteurRef": "PA718736"
      }
    ]
  },
  "typeReunion": "DEP"
}