{
  "xsiType": "reunionInitParlementaire_type",
  "uid": "RUANR5L15S2018IDF0106757",
  "timestampDebut": "2018-04-19T15:00:00.000+02:00",
  "timestampFin": "2018-04-19T16:00:00.000+02:00",
  "lieu": {
    "code": "SALREU028",
    "libelleCourt": "Salle Colbert",
    "libelleLong": "Salle Colbert , Palais Bourbon"
  },
  "cycleDeVie": {
    "etat": "Confirmé",
    "chrono": {
      "creation": "2018-02-28T11:08:40.000+01:00"
    }
  },
  "typeReunion": "GP"
}