{
  "xsiType": "reunionInitParlementaire_type",
  "uid": "RUANR5L15S2019IDF0123302",
  "timestampDebut": "2018-12-12T11:30:00.000+01:00",
  "timestampFin": "2018-12-12T12:30:00.000+01:00",
  "lieu": {
    "code": "SALREU018",
    "libelleCourt": "Salon Mansart",
    "libelleLong": "Salon Mansart, 101, rue de l'Université"
  },
  "cycleDeVie": {
    "etat": "Confirmé",
    "chrono": {
      "creation": "2018-12-03T14:23:20.000+01:00"
    }
  },
  "demandeurs": {
    "acteurs": [
      {
        "nom": "Mme Cathy RACON-BOUZON",
        "acteurRef": "PA718944"
      }
    ]
  },
  "typeReunion": "DEP"
}