{
  "xsiType": "reunionInitParlementaire_type",
  "uid": "RUANR5L15S2020IDF0142356",
  "timestampDebut": "2019-10-21T16:30:00.000+02:00",
  "timestampFin": "2019-10-21T17:30:00.000+02:00",
  "lieu": {
    "code": "SALREU021",
    "libelleCourt": "Salle 7207",
    "libelleLong": "Salle 7207, 101, rue de l'Université"
  },
  "cycleDeVie": {
    "etat": "Confirmé",
    "chrono": {
      "creation": "2019-10-18T09:46:16.000+02:00"
    }
  },
  "demandeurs": {
    "acteurs": [
      {
        "nom": "Mme Maina SAGE",
        "acteurRef": "PA702052"
      }
    ]
  },
  "typeReunion": "DEP"
}