{
  "xsiType": "reunionInitParlementaire_type",
  "uid": "RUANR5L15S2017IDF0095135",
  "timestampDebut": "2017-09-26T14:00:00.000+02:00",
  "timestampFin": "2017-09-26T18:00:00.000+02:00",
  "lieu": {
    "code": "SALREU039",
    "libelleCourt": "Salle 6550",
    "libelleLong": "Salle 6550, Palais Bourbon"
  },
  "cycleDeVie": {
    "etat": "Confirmé",
    "chrono": {
      "creation": "2017-08-03T15:08:03.000+02:00"
    }
  },
  "demandeurs": {
    "acteurs": [
      {
        "nom": "M. Stéphane VIRY",
        "acteurRef": "PA721474"
      }
    ]
  },
  "typeReunion": "DEP"
}