{
  "xsiType": "reunionInitParlementaire_type",
  "uid": "RUANR5L15S2018IDFL430532",
  "timestampDebut": "2018-06-06T17:30:00.000+02:00",
  "lieu": {
    "libelleLong": "salle 6566 (Lois)"
  },
  "cycleDeVie": {
    "etat": "Confirmé",
    "chrono": {
      "creation": "2018-10-04T00:00:00.000+02:00"
    }
  },
  "organeReuniRef": "PO746679",
  "typeReunion": "GE",
  "odj": {
    "convocationOdj": [
      "Audition de la Coordination des chrétiens d’Orient en danger (CHREDO) présidée par M. Patrick Karam."
    ]
  }
}