{
  "xsiType": "reunionInitParlementaire_type",
  "uid": "RUANR5L15S2019IDF0124520",
  "timestampDebut": "2019-01-08T15:15:00.000+01:00",
  "timestampFin": "2019-01-08T16:30:00.000+01:00",
  "lieu": {
    "code": "SALREU048",
    "libelleCourt": "Salle 6809",
    "libelleLong": "Salle 6809, Palais Bourbon"
  },
  "cycleDeVie": {
    "etat": "Confirmé",
    "chrono": {
      "creation": "2019-01-08T12:30:46.000+01:00"
    }
  },
  "demandeurs": {
    "acteurs": [
      {
        "nom": "M. Damien PICHEREAU",
        "acteurRef": "PA721372"
      }
    ]
  },
  "typeReunion": "DEP"
}