{
  "xsiType": "reunionCommission_type",
  "uid": "RUANR5L15S2018IDC427497",
  "timestampDebut": "2017-11-23T10:30:00.000+01:00",
  "lieu": {
    "libelleLong": "salle 4013 (33 rue Saint-Dominique)"
  },
  "cycleDeVie": {
    "etat": "Supprimé",
    "chrono": {
      "creation": "2017-10-06T00:00:00.000+02:00",
      "cloture": "2017-10-27T00:00:00.000+02:00"
    }
  },
  "organeReuniRef": "PO734965",
  "participants": {},
  "ouverturePresse": false,
  "odj": {
    "convocationOdj": [
      "Audition du Général d’armée André Lanata, chef d’état-major de l’armée de l’air ;"
    ],
    "resumeOdj": [
      "Audition du Général d’armée André Lanata, chef d’état-major de l’armée de l’air."
    ]
  },
  "formatReunion": "Ordinaire",
  "infosReunionsInternationale": {
    "estReunionInternationale": false
  },
  "captationVideo": false
}