{
  "xsiType": "reunionInitParlementaire_type",
  "uid": "RUANR5L15S2019IDF0129330",
  "timestampDebut": "2019-03-27T18:00:00.000+01:00",
  "timestampFin": "2019-03-27T20:00:00.000+01:00",
  "lieu": {
    "code": "SALREU018",
    "libelleCourt": "Salon Mansart",
    "libelleLong": "Salon Mansart, 101, rue de l'Université"
  },
  "cycleDeVie": {
    "etat": "Confirmé",
    "chrono": {
      "creation": "2019-03-07T15:40:52.000+01:00"
    }
  },
  "demandeurs": {
    "acteurs": [
      {
        "nom": "M. Florent BOUDIÉ",
        "acteurRef": "PA606507"
      }
    ]
  },
  "typeReunion": "DEP"
}