{
  "xsiType": "reunionInitParlementaire_type",
  "uid": "RUANR5L15S2018IDF0108980",
  "timestampDebut": "2018-05-15T17:30:00.000+02:00",
  "timestampFin": "2018-05-15T18:30:00.000+02:00",
  "lieu": {
    "code": "SALREU039",
    "libelleCourt": "Salle 6550",
    "libelleLong": "Salle 6550, Palais Bourbon"
  },
  "cycleDeVie": {
    "etat": "Confirmé",
    "chrono": {
      "creation": null
    }
  },
  "demandeurs": {
    "acteurs": [
      {
        "nom": "M. Julien AUBERT",
        "acteurRef": "PA609726"
      }
    ]
  },
  "typeReunion": "DEP"
}