{
  "xsiType": "reunionInitParlementaire_type",
  "uid": "RUANR5L15S2018IDF0105693",
  "timestampDebut": "2018-02-14T14:00:00.000+01:00",
  "timestampFin": "2018-02-14T15:30:00.000+01:00",
  "lieu": {
    "code": "SALREU002",
    "libelleCourt": "Salle 7070",
    "libelleLong": "Salle 7070, 103, rue de l'Université"
  },
  "cycleDeVie": {
    "etat": "Confirmé",
    "chrono": {
      "creation": "2018-02-13T15:14:38.000+01:00"
    }
  },
  "demandeurs": {
    "acteurs": [
      {
        "nom": "Mme Nicole TRISSE",
        "acteurRef": "PA720394"
      }
    ]
  },
  "typeReunion": "DEP"
}