{
  "xsiType": "reunionInitParlementaire_type",
  "uid": "RUANR5L15S2019IDF0133859",
  "timestampDebut": "2019-06-26T14:00:00.000+02:00",
  "timestampFin": "2019-06-26T15:00:00.000+02:00",
  "lieu": {
    "code": "SALREU033",
    "libelleCourt": "6ème Bureau",
    "libelleLong": "6ème Bureau, Palais Bourbon"
  },
  "cycleDeVie": {
    "etat": "Confirmé",
    "chrono": {
      "creation": "2019-05-15T12:05:34.000+02:00"
    }
  },
  "demandeurs": {
    "acteurs": [
      {
        "nom": "M. Marc DELATTE",
        "acteurRef": "PA718694"
      },
      {
        "nom": "Mme Nadia RAMASSAMY",
        "acteurRef": "PA721070"
      }
    ]
  },
  "typeReunion": "DEP"
}