{
  "xsiType": "reunionInitParlementaire_type",
  "uid": "RUANR5L15S2018IDF0096140",
  "timestampDebut": "2017-10-16T14:00:00.000+02:00",
  "timestampFin": "2017-10-16T16:30:00.000+02:00",
  "lieu": {
    "code": "SALREU049",
    "libelleCourt": "Salle 6822",
    "libelleLong": "Salle 6822, Palais Bourbon"
  },
  "cycleDeVie": {
    "etat": "Confirmé",
    "chrono": {
      "creation": "2017-09-12T17:38:51.000+02:00"
    }
  },
  "demandeurs": {
    "acteurs": [
      {
        "nom": "Mme Constance LE GRIP",
        "acteurRef": "PA345722"
      }
    ]
  },
  "typeReunion": "DEP"
}