{
  "xsiType": "reunionInitParlementaire_type",
  "uid": "RUANR5L15S2018IDF0098361",
  "timestampDebut": "2017-10-17T08:30:00.000+02:00",
  "timestampFin": "2017-10-17T10:30:00.000+02:00",
  "lieu": {
    "code": "SALREU046",
    "libelleCourt": "Sully 1",
    "libelleLong": "Sully 1, Palais Bourbon"
  },
  "cycleDeVie": {
    "etat": "Confirmé",
    "chrono": {
      "creation": "2017-10-10T18:27:41.000+02:00"
    }
  },
  "demandeurs": {
    "acteurs": [
      {
        "nom": "M. Damien ADAM",
        "acteurRef": "PA722038"
      }
    ]
  },
  "typeReunion": "DEP"
}