{
  "xsiType": "reunionInitParlementaire_type",
  "uid": "RUANR5L15S2019IDF0137587",
  "timestampDebut": "2019-07-24T14:00:00.000+02:00",
  "timestampFin": "2019-07-24T15:00:00.000+02:00",
  "lieu": {
    "code": "SALREU025",
    "libelleCourt": "7ème Bureau",
    "libelleLong": "7ème Bureau, Palais Bourbon"
  },
  "cycleDeVie": {
    "etat": "Confirmé",
    "chrono": {
      "creation": "2019-07-17T15:20:40.000+02:00"
    }
  },
  "demandeurs": {
    "acteurs": [
      {
        "nom": "M. Mohamed LAQHILA",
        "acteurRef": "PA718978"
      }
    ]
  },
  "typeReunion": "DEP"
}