{
  "xsiType": "reunionInitParlementaire_type",
  "uid": "RUANR5L15S2019IDF0136863",
  "timestampDebut": "2019-07-23T15:00:00.000+02:00",
  "timestampFin": "2019-07-23T16:00:00.000+02:00",
  "lieu": {
    "code": "SALREU048",
    "libelleCourt": "Salle 6809",
    "libelleLong": "Salle 6809, Palais Bourbon"
  },
  "cycleDeVie": {
    "etat": "Confirmé",
    "chrono": {
      "creation": "2019-07-04T12:28:28.000+02:00"
    }
  },
  "demandeurs": {
    "acteurs": [
      {
        "nom": "M. Jean-Luc FUGIT",
        "acteurRef": "PA722366"
      }
    ]
  },
  "typeReunion": "DEP"
}