{
  "xsiType": "seance_type",
  "uid": "RUANR5L15S2018IDS21168",
  "timestampDebut": "2018-07-16T21:30:00.000+02:00",
  "timestampFin": "2018-07-17T01:35:00.000+02:00",
  "lieu": {
    "code": "AN",
    "libelleLong": "Assemblée nationale"
  },
  "cycleDeVie": {
    "etat": "Confirmé",
    "chrono": {
      "creation": "2018-06-18T00:00:00.000+02:00"
    }
  },
  "organeReuniRef": "PO717460",
  "sessionRef": "SCR5A2018E1",
  "ouverturePresse": true,
  "odj": {
    "pointsOdj": [
      {
        "xsiType": "podjSeanceConfPres_type",
        "uid": "RUANR5L15S2018IDS21168PT36135",
        "cycleDeVie": {
          "etat": "Confirmé",
          "chrono": {
            "creation": "2018-06-18T00:00:00.000+02:00"
          }
        },
        "objet": "Suite de la discussion du projet de loi constitutionnelle pour une démocratie plus représentative, responsable et efficace",
        "dossiersLegislatifsRefs": [
          "DLR5L15N36615"
        ],
        "typePointOdj": "Suite de la discussion",
        "comiteSecret": false,
        "natureTravauxOdj": "ODJPR"
      }
    ]
  },
  "compteRenduRef": "CRSANR5L15S2018E1N017",
  "identifiants": {
    "numSeanceJo": "17",
    "idJo": "20181017",
    "quantieme": "Deuxième",
    "dateSeance": "2018-07-16T02:00:00.000+02:00"
  },
  "captationVideo": true
}