{
  "xsiType": "reunionInitParlementaire_type",
  "uid": "RUANR5L15S2020IDF0140529",
  "timestampDebut": "2019-10-22T09:30:00.000+02:00",
  "timestampFin": "2019-10-22T10:30:00.000+02:00",
  "lieu": {
    "code": "SALREU018",
    "libelleCourt": "Salon Mansart",
    "libelleLong": "Salon Mansart, 101, rue de l'Université"
  },
  "cycleDeVie": {
    "etat": "Confirmé",
    "chrono": {
      "creation": "2019-09-20T10:35:54.000+02:00"
    }
  },
  "demandeurs": {
    "acteurs": [
      {
        "nom": "M. Francis CHOUAT",
        "acteurRef": "PA760658"
      },
      {
        "nom": "M. Benjamin DIRX",
        "acteurRef": "PA722382"
      }
    ]
  },
  "typeReunion": "DEP"
}