{
  "xsiType": "reunionInitParlementaire_type",
  "uid": "RUANR5L15S2018IDF0098003",
  "timestampDebut": "2017-10-12T09:30:00.000+02:00",
  "timestampFin": "2017-10-12T11:00:00.000+02:00",
  "lieu": {
    "code": "SALREU005",
    "libelleCourt": "2ème Bureau",
    "libelleLong": "2ème Bureau, Palais Bourbon"
  },
  "cycleDeVie": {
    "etat": "Confirmé",
    "chrono": {
      "creation": "2017-10-05T11:00:08.000+02:00"
    }
  },
  "demandeurs": {
    "acteurs": [
      {
        "nom": "Mme Valérie RABAULT",
        "acteurRef": "PA609590"
      }
    ]
  },
  "typeReunion": "DEP"
}