{
  "xsiType": "reunionInitParlementaire_type",
  "uid": "RUANR5L15S2019IDF0135840",
  "timestampDebut": "2019-06-25T17:30:00.000+02:00",
  "timestampFin": "2019-06-25T19:00:00.000+02:00",
  "lieu": {
    "code": "SALREU002",
    "libelleCourt": "Salle 7070",
    "libelleLong": "Salle 7070, 103, rue de l'Université"
  },
  "cycleDeVie": {
    "etat": "Annulé",
    "chrono": {
      "creation": "2019-06-18T16:32:19.000+02:00",
      "cloture": "2019-06-18T16:35:25.000+02:00"
    }
  },
  "demandeurs": {
    "acteurs": [
      {
        "nom": "Mme Pascale FONTENEL-PERSONNE",
        "acteurRef": "PA721384"
      }
    ]
  },
  "typeReunion": "DEP"
}