{
  "xsiType": "reunionInitParlementaire_type",
  "uid": "RUANR5L15S2020IDF0137614",
  "timestampDebut": "2019-10-22T14:00:00.000+02:00",
  "timestampFin": "2019-10-22T15:00:00.000+02:00",
  "lieu": {
    "code": "SALREU006",
    "libelleCourt": "3ème Bureau",
    "libelleLong": "3ème Bureau, Palais Bourbon"
  },
  "cycleDeVie": {
    "etat": "Confirmé",
    "chrono": {
      "creation": "2019-07-17T16:23:23.000+02:00"
    }
  },
  "demandeurs": {
    "organe": {
      "nom": "GROUPE DU MOUVEMENT DÉMOCRATE ET APPARENTÉS",
      "organeRef": "PO730970"
    }
  },
  "organeReuniRef": "PO730970",
  "typeReunion": "GP"
}