{
  "xsiType": "reunionCommission_type",
  "uid": "RUANR5L15S2019IDC432706",
  "timestampDebut": "2019-06-07T09:00:00.000+02:00",
  "lieu": {
    "libelleLong": "Salle Lamartine"
  },
  "cycleDeVie": {
    "etat": "Confirmé",
    "chrono": {
      "creation": "2019-05-13T00:00:00.000+02:00"
    }
  },
  "organeReuniRef": "PO733297",
  "participants": {},
  "ouverturePresse": false,
  "odj": {
    "convocationOdj": [
      "Colloque sur les droits des femmes en Azerbaïdjan, à l’invitation de M. Pierre-Alain Raphan, président du groupe d’amitié France-Azerbaïdjan, avec notamment Mme Marie-Pierre Rixain, présidente de la délégation aux droits des femmes et à l’égalité des chances entre les hommes et les femmes, Mme Hijran Huseynova, présidente du Comité d’État pour la famille, les femmes et les enfants de la République d’Azerbaïdjan, et Son Exc.M. Rahman Mustafayev, ambassadeur de la République d’Azerbaïdjan en France"
    ],
    "resumeOdj": [
      "Colloque sur les droits des femmes en Azerbaïdjan, à l’invitation de M. Pierre-Alain Raphan, président du groupe d’amitié France-Azerbaïdjan, avec notamment Mme Marie-Pierre Rixain, présidente de la délégation aux droits des femmes et à l’égalité des chances entre les hommes et les femmes, Mme Hijran Huseynova, présidente du Comité d’État pour la famille, les femmes et les enfants de la République d’Azerbaïdjan, et Son Exc.M. Rahman Mustafayev, ambassadeur de la République d’Azerbaïdjan en France"
    ]
  },
  "formatReunion": "Ordinaire",
  "infosReunionsInternationale": {
    "estReunionInternationale": true,
    "listePays": [
      "GOP756482"
    ],
    "informationsComplementaires": "Damien Cesselin - 39709"
  },
  "captationVideo": false
}