{
  "xsiType": "reunionInitParlementaire_type",
  "uid": "RUANR5L15S2020IDF0137908",
  "timestampDebut": "2019-10-15T18:00:00.000+02:00",
  "timestampFin": "2019-10-15T20:30:00.000+02:00",
  "lieu": {
    "code": "SALREU007",
    "libelleCourt": "4ème Bureau",
    "libelleLong": "4ème Bureau, Palais Bourbon"
  },
  "cycleDeVie": {
    "etat": "Confirmé",
    "chrono": {
      "creation": "2019-07-23T11:22:10.000+02:00"
    }
  },
  "demandeurs": {
    "acteurs": [
      {
        "nom": "M. Benoit SIMIAN",
        "acteurRef": "PA719592"
      }
    ]
  },
  "typeReunion": "DEP"
}