{
  "xsiType": "reunionCommission_type",
  "uid": "RUANR5L15S2018IDC427883",
  "timestampDebut": "2017-12-20T09:30:00.000+01:00",
  "lieu": {
    "libelleLong": "salle Lamartine"
  },
  "cycleDeVie": {
    "etat": "Supprimé",
    "chrono": {
      "creation": "2017-11-17T00:00:00.000+01:00",
      "cloture": "2017-11-24T00:00:00.000+01:00"
    }
  },
  "organeReuniRef": "PO59047",
  "participants": {},
  "ouverturePresse": false,
  "odj": {
    "convocationOdj": [
      "– Audition, à huis clos, de M. Pascal Teixeira Da Silva, ambassadeur chargé des migrations."
    ],
    "resumeOdj": [
      "audition, à huis clos, de M. Pascal Teixeira Da Silva, ambassadeur chargé des migrations."
    ]
  },
  "formatReunion": "Ordinaire",
  "infosReunionsInternationale": {
    "estReunionInternationale": false
  },
  "captationVideo": false
}