{
  "xsiType": "reunionCommission_type",
  "uid": "RUANR5L15S2019IDC431411",
  "timestampDebut": "2019-03-12T16:35:00.000+01:00",
  "timestampFin": "2019-03-12T20:10:00.000+01:00",
  "lieu": {
    "libelleLong": "salle 6351 (Affaires sociales)"
  },
  "cycleDeVie": {
    "etat": "Confirmé",
    "chrono": {
      "creation": "2019-01-31T00:00:00.000+01:00"
    }
  },
  "organeReuniRef": "PO420120",
  "participants": {
    "participantsInternes": [
      {
        "acteurRef": "PA642764",
        "presence": "présent"
      },
      {
        "acteurRef": "PA718744",
        "presence": "présent"
      },
      {
        "acteurRef": "PA610681",
        "presence": "présent"
      },
      {
        "acteurRef": "PA642847",
        "presence": "présent"
      },
      {
        "acteurRef": "PA720362",
        "presence": "présent"
      },
      {
        "acteurRef": "PA720968",
        "presence": "présent"
      },
      {
        "acteurRef": "PA719488",
        "presence": "présent"
      },
      {
        "acteurRef": "PA508",
        "presence": "présent"
      },
      {
        "acteurRef": "PA719980",
        "presence": "présent"
      },
      {
        "acteurRef": "PA608083",
        "presence": "présent"
      },
      {
        "acteurRef": "PA713448",
        "presence": "présent"
      },
      {
        "acteurRef": "PA721336",
        "presence": "excusé"
      },
      {
        "acteurRef": "PA720546",
        "presence": "présent"
      },
      {
        "acteurRef": "PA719440",
        "presence": "présent"
      },
      {
        "acteurRef": "PA719448",
        "presence": "présent"
      },
      {
        "acteurRef": "PA720468",
        "presence": "présent"
      },
      {
        "acteurRef": "PA856",
        "presence": "présent"
      },
      {
        "acteurRef": "PA722126",
        "presence": "absent"
      },
      {
        "acteurRef": "PA642868",
        "presence": "présent"
      },
      {
        "acteurRef": "PA719756",
        "presence": "excusé"
      },
      {
        "acteurRef": "PA722390",
        "presence": "présent"
      },
      {
        "acteurRef": "PA607155",
        "presence": "présent"
      },
      {
        "acteurRef": "PA720932",
        "presence": "présent"
      },
      {
        "acteurRef": "PA718694",
        "presence": "présent"
      },
      {
        "acteurRef": "PA718926",
        "presence": "présent"
      },
      {
        "acteurRef": "PA712015",
        "presence": "présent"
      },
      {
        "acteurRef": "PA267289",
        "presence": "présent"
      },
      {
        "acteurRef": "PA608292",
        "presence": "présent"
      },
      {
        "acteurRef": "PA720046",
        "presence": "présent"
      },
      {
        "acteurRef": "PA606202",
        "presence": "présent"
      },
      {
        "acteurRef": "PA720924",
        "presence": "présent"
      },
      {
        "acteurRef": "PA719570",
        "presence": "présent"
      },
      {
        "acteurRef": "PA720286",
        "presence": "présent"
      },
      {
        "acteurRef": "PA267780",
        "presence": "présent"
      },
      {
        "acteurRef": "PA718706",
        "presence": "présent"
      },
      {
        "acteurRef": "PA720030",
        "presence": "présent"
      },
      {
        "acteurRef": "PA721246",
        "presence": "présent"
      },
      {
        "acteurRef": "PA333285",
        "presence": "présent"
      },
      {
        "acteurRef": "PA721024",
        "presence": "présent"
      },
      {
        "acteurRef": "PA720170",
        "presence": "excusé"
      },
      {
        "acteurRef": "PA267318",
        "presence": "présent"
      },
      {
        "acteurRef": "PA721126",
        "presence": "excusé"
      },
      {
        "acteurRef": "PA720326",
        "presence": "présent"
      },
      {
        "acteurRef": "PA331835",
        "presence": "présent"
      },
      {
        "acteurRef": "PA722374",
        "presence": "présent"
      },
      {
        "acteurRef": "PA720074",
        "presence": "présent"
      },
      {
        "acteurRef": "PA719186",
        "presence": "présent"
      },
      {
        "acteurRef": "PA719842",
        "presence": "absent"
      },
      {
        "acteurRef": "PA720916",
        "presence": "présent"
      },
      {
        "acteurRef": "PA719728",
        "presence": "présent"
      },
      {
        "acteurRef": "PA720480",
        "presence": "présent"
      },
      {
        "acteurRef": "PA267378",
        "presence": "absent"
      },
      {
        "acteurRef": "PA719858",
        "presence": "présent"
      },
      {
        "acteurRef": "PA606712",
        "presence": "présent"
      },
      {
        "acteurRef": "PA717379",
        "presence": "présent"
      },
      {
        "acteurRef": "PA719072",
        "presence": "présent"
      },
      {
        "acteurRef": "PA720738",
        "presence": "absent"
      },
      {
        "acteurRef": "PA721418",
        "presence": "absent"
      },
      {
        "acteurRef": "PA2377",
        "presence": "présent"
      },
      {
        "acteurRef": "PA721710",
        "presence": "absent"
      },
      {
        "acteurRef": "PA720512",
        "presence": "présent"
      },
      {
        "acteurRef": "PA718910",
        "presence": "présent"
      },
      {
        "acteurRef": "PA720422",
        "presence": "excusé"
      },
      {
        "acteurRef": "PA721286",
        "presence": "présent"
      },
      {
        "acteurRef": "PA721070",
        "presence": "présent"
      },
      {
        "acteurRef": "PA721062",
        "presence": "présent"
      },
      {
        "acteurRef": "PA720066",
        "presence": "présent"
      },
      {
        "acteurRef": "PA718810",
        "presence": "présent"
      },
      {
        "acteurRef": "PA266808",
        "presence": "présent"
      },
      {
        "acteurRef": "PA722022",
        "presence": "absent"
      },
      {
        "acteurRef": "PA721110",
        "presence": "excusé"
      },
      {
        "acteurRef": "PA719972",
        "presence": "présent"
      },
      {
        "acteurRef": "PA720952",
        "presence": "présent"
      },
      {
        "acteurRef": "PA719350",
        "presence": "présent"
      },
      {
        "acteurRef": "PA334768",
        "presence": "présent"
      },
      {
        "acteurRef": "PA719540",
        "presence": "présent"
      },
      {
        "acteurRef": "PA643134",
        "presence": "présent"
      },
      {
        "acteurRef": "PA719930",
        "presence": "excusé"
      },
      {
        "acteurRef": "PA718728",
        "presence": "présent"
      },
      {
        "acteurRef": "PA721924",
        "presence": "présent"
      },
      {
        "acteurRef": "PA642788",
        "presence": "présent"
      },
      {
        "acteurRef": "PA267585",
        "presence": "absent"
      },
      {
        "acteurRef": "PA722102",
        "presence": "présent"
      },
      {
        "acteurRef": "PA331582",
        "presence": "présent"
      },
      {
        "acteurRef": "PA719512",
        "presence": "présent"
      },
      {
        "acteurRef": "PA721474",
        "presence": "absent"
      },
      {
        "acteurRef": "PA722268",
        "presence": "absent"
      }
    ]
  },
  "ouverturePresse": true,
  "odj": {
    "convocationOdj": [
      "– Examen des articles du projet de loi relatif à l’organisation et à la transformation du système de santé (n° 1681) (Mme Stéphanie Rist, rapporteure sur la première partie du texte, M. Thomas Mesnier, rapporteur général et rapporteur sur les autres dispositions)"
    ],
    "resumeOdj": [
      "organisation et transformation du système de santé (n°1681) (rapport)."
    ],
    "pointsOdj": [
      {
        "xsiType": "podjReunion_type",
        "uid": "RUANR5L15S2019IDC431411PT26395",
        "cycleDeVie": {
          "etat": "Confirmé",
          "chrono": {
            "creation": "2019-02-14T00:00:00.000+01:00"
          }
        },
        "objet": "Examen du texte (articles 1 à après 3)",
        "dossiersLegislatifsRefs": [
          "DLR5L15N37234"
        ],
        "typePointOdj": "Examen",
        "comiteSecret": false
      }
    ]
  },
  "compteRenduRef": "CRCANR5L15S2019PO420120N050",
  "formatReunion": "Ordinaire",
  "infosReunionsInternationale": {
    "estReunionInternationale": false
  },
  "captationVideo": false
}