{
  "xsiType": "reunionInitParlementaire_type",
  "uid": "RUANR5L15S2019IDF0140055",
  "timestampDebut": "2019-09-19T10:30:00.000+02:00",
  "timestampFin": "2019-09-19T17:30:00.000+02:00",
  "lieu": {
    "code": "SALREU022",
    "libelleCourt": "Salle 7326",
    "libelleLong": "Salle 7326, 101, rue de l'Université"
  },
  "cycleDeVie": {
    "etat": "Confirmé",
    "chrono": {
      "creation": "2019-09-16T11:32:02.000+02:00"
    }
  },
  "demandeurs": {
    "acteurs": [
      {
        "nom": "Mme Dominique DAVID",
        "acteurRef": "PA719710"
      }
    ]
  },
  "typeReunion": "DEP"
}