{
  "xsiType": "reunionInitParlementaire_type",
  "uid": "RUANR5L15S2020IDF0139482",
  "timestampDebut": "2019-12-03T14:00:00.000+01:00",
  "timestampFin": "2019-12-03T15:00:00.000+01:00",
  "lieu": {
    "code": "SALREU048",
    "libelleCourt": "Salle 6809",
    "libelleLong": "Salle 6809, Palais Bourbon"
  },
  "cycleDeVie": {
    "etat": "Confirmé",
    "chrono": {
      "creation": "2019-09-10T13:46:03.000+02:00"
    }
  },
  "demandeurs": {
    "organe": {
      "nom": "GROUPE DU MOUVEMENT DÉMOCRATE ET APPARENTÉS",
      "organeRef": "PO730970"
    }
  },
  "organeReuniRef": "PO730970",
  "typeReunion": "GP"
}