{
  "xsiType": "reunionInitParlementaire_type",
  "uid": "RUANR5L15S2019IDF0124102",
  "timestampDebut": "2018-12-19T12:15:00.000+01:00",
  "timestampFin": "2018-12-19T13:30:00.000+01:00",
  "lieu": {
    "code": "SALREU048",
    "libelleCourt": "Salle 6809",
    "libelleLong": "Salle 6809, Palais Bourbon"
  },
  "cycleDeVie": {
    "etat": "Confirmé",
    "chrono": {
      "creation": "2018-12-18T16:54:54.000+01:00"
    }
  },
  "demandeurs": {
    "acteurs": [
      {
        "nom": "M. Yves BLEIN",
        "acteurRef": "PA608641"
      }
    ]
  },
  "typeReunion": "DEP"
}