{
  "xsiType": "reunionInitParlementaire_type",
  "uid": "RUANR5L15S2019IDF0135463",
  "timestampDebut": "2019-07-10T17:00:00.000+02:00",
  "timestampFin": "2019-07-10T20:00:00.000+02:00",
  "lieu": {
    "code": "SALREU002",
    "libelleCourt": "Salle 7070",
    "libelleLong": "Salle 7070, 103, rue de l'Université"
  },
  "cycleDeVie": {
    "etat": "Annulé",
    "chrono": {
      "creation": "2019-06-12T15:36:45.000+02:00",
      "cloture": "2019-06-21T14:42:55.000+02:00"
    }
  },
  "demandeurs": {
    "acteurs": [
      {
        "nom": "Mme Josette MANIN",
        "acteurRef": "PA720988"
      },
      {
        "nom": "Mme Danièle HÉRIN",
        "acteurRef": "PA718794"
      }
    ]
  },
  "typeReunion": "DEP"
}