{
  "xsiType": "reunionInitParlementaire_type",
  "uid": "RUANR5L15S2018IDF0099152",
  "timestampDebut": "2017-11-02T11:00:00.000+01:00",
  "timestampFin": "2017-11-02T12:00:00.000+01:00",
  "lieu": {
    "code": "SALREU048",
    "libelleCourt": "Salle 6809",
    "libelleLong": "Salle 6809, Palais Bourbon"
  },
  "cycleDeVie": {
    "etat": "Confirmé",
    "chrono": {
      "creation": "2017-10-23T16:44:41.000+02:00"
    }
  },
  "demandeurs": {
    "acteurs": [
      {
        "nom": "Mme Charlotte LECOCQ",
        "acteurRef": "PA720480"
      }
    ]
  },
  "typeReunion": "DEP"
}