{
  "xsiType": "reunionInitParlementaire_type",
  "uid": "RUANR5L15S2018IDF0103142",
  "timestampDebut": "2018-01-03T16:30:00.000+01:00",
  "timestampFin": "2018-01-03T18:00:00.000+01:00",
  "lieu": {
    "code": "SALREU048",
    "libelleCourt": "Salle 6809",
    "libelleLong": "Salle 6809, Palais Bourbon"
  },
  "cycleDeVie": {
    "etat": "Confirmé",
    "chrono": {
      "creation": "2018-01-03T11:21:07.000+01:00"
    }
  },
  "demandeurs": {
    "acteurs": [
      {
        "nom": "M. Guillaume GAROT",
        "acteurRef": "PA333285"
      }
    ]
  },
  "typeReunion": "DEP"
}