{
  "xsiType": "reunionInitParlementaire_type",
  "uid": "RUANR5L15S2019IDF0136553",
  "timestampDebut": "2019-07-16T15:00:00.000+02:00",
  "timestampFin": "2019-07-16T19:00:00.000+02:00",
  "lieu": {
    "code": "SALREU022",
    "libelleCourt": "Salle 7326",
    "libelleLong": "Salle 7326, 101, rue de l'Université"
  },
  "cycleDeVie": {
    "etat": "Confirmé",
    "chrono": {
      "creation": "2019-06-28T15:40:41.000+02:00"
    }
  },
  "demandeurs": {
    "acteurs": [
      {
        "nom": "M. Jean-Luc FUGIT",
        "acteurRef": "PA722366"
      }
    ]
  },
  "typeReunion": "DEP"
}