{
  "xsiType": "reunionInitParlementaire_type",
  "uid": "RUANR5L15S2018IDF0098696",
  "timestampDebut": "2017-10-17T17:00:00.000+02:00",
  "timestampFin": "2017-10-17T18:00:00.000+02:00",
  "lieu": {
    "code": "SALREU002",
    "libelleCourt": "Salle 7070",
    "libelleLong": "Salle 7070, 103, rue de l'Université"
  },
  "cycleDeVie": {
    "etat": "Confirmé",
    "chrono": {
      "creation": "2017-10-16T15:21:45.000+02:00"
    }
  },
  "demandeurs": {
    "acteurs": [
      {
        "nom": "Mme Huguette BELLO",
        "acteurRef": "PA441"
      }
    ]
  },
  "typeReunion": "DEP"
}