{
  "xsiType": "reunionInitParlementaire_type",
  "uid": "RUANR5L15S2018IDF0108638",
  "timestampDebut": "2018-05-24T11:00:00.000+02:00",
  "timestampFin": "2018-05-24T12:00:00.000+02:00",
  "lieu": {
    "code": "SALREU010",
    "libelleCourt": "Salle N° 1",
    "libelleLong": "Salle N° 1, 3, rue Aristide Briand"
  },
  "cycleDeVie": {
    "etat": "Annulé",
    "chrono": {
      "creation": "2018-03-27T15:36:53.000+02:00",
      "cloture": "2018-05-22T08:47:21.000+02:00"
    }
  },
  "demandeurs": {
    "acteurs": [
      {
        "nom": "M. Joaquim PUEYO",
        "acteurRef": "PA608011"
      }
    ]
  },
  "typeReunion": "DEP"
}