{
  "xsiType": "reunionInitParlementaire_type",
  "uid": "RUANR5L15S2018IDFL430525",
  "timestampDebut": "2018-03-15T09:30:00.000+01:00",
  "lieu": {
    "libelleLong": "Cour nationale du droit d'asile"
  },
  "cycleDeVie": {
    "etat": "Confirmé",
    "chrono": {
      "creation": "2018-10-03T00:00:00.000+02:00"
    }
  },
  "organeReuniRef": "PO746748",
  "typeReunion": "GE",
  "odj": {
    "convocationOdj": [
      "Visite de la Cour nationale du droit d'asile à Montreuil (93). Observation d'audiences publiques. Entretien avec Mme Michèle de Segonzac, présidente de la Cour, et les équipes de la CNDA."
    ]
  }
}