{
  "xsiType": "reunionInitParlementaire_type",
  "uid": "RUANR5L15S2018IDF0108064",
  "timestampDebut": "2018-03-29T14:00:00.000+02:00",
  "timestampFin": "2018-03-29T15:30:00.000+02:00",
  "lieu": {
    "code": "SALREU044",
    "libelleCourt": "Sully 2",
    "libelleLong": "Sully 2, Palais Bourbon"
  },
  "cycleDeVie": {
    "etat": "Confirmé",
    "chrono": {
      "creation": "2018-03-20T11:10:20.000+01:00"
    }
  },
  "demandeurs": {
    "acteurs": [
      {
        "nom": "M. Mustapha LAABID",
        "acteurRef": "PA719842"
      }
    ]
  },
  "typeReunion": "DEP"
}