{
  "xsiType": "reunionInitParlementaire_type",
  "uid": "RUANR5L15S2018IDF0104711",
  "timestampDebut": "2018-09-20T14:15:00.000+02:00",
  "timestampFin": "2018-09-20T18:15:00.000+02:00",
  "lieu": {
    "code": "SALREU007",
    "libelleCourt": "4ème Bureau",
    "libelleLong": "4ème Bureau, Palais Bourbon"
  },
  "cycleDeVie": {
    "etat": "Confirmé",
    "chrono": {
      "creation": "2018-01-30T15:58:38.000+01:00"
    }
  },
  "demandeurs": {
    "acteurs": [
      {
        "nom": "M. Jean-Paul MATTEI",
        "acteurRef": "PA720728"
      }
    ]
  },
  "typeReunion": "DEP"
}