{
  "xsiType": "reunionInitParlementaire_type",
  "uid": "RUANR5L15S2019IDF0127558",
  "timestampDebut": "2019-03-06T11:45:00.000+01:00",
  "timestampFin": "2019-03-06T12:45:00.000+01:00",
  "lieu": {
    "code": "SALREU021",
    "libelleCourt": "Salle 7207",
    "libelleLong": "Salle 7207, 101, rue de l'Université"
  },
  "cycleDeVie": {
    "etat": "Confirmé",
    "chrono": {
      "creation": "2019-02-13T16:20:27.000+01:00"
    }
  },
  "demandeurs": {
    "acteurs": [
      {
        "nom": "Mme Mireille CLAPOT",
        "acteurRef": "PA719294"
      }
    ]
  },
  "typeReunion": "DEP"
}