{
  "xsiType": "reunionInitParlementaire_type",
  "uid": "RUANR5L15S2019IDF0139580",
  "timestampDebut": "2019-09-23T09:00:00.000+02:00",
  "timestampFin": "2019-09-23T12:00:00.000+02:00",
  "lieu": {
    "code": "SALREU014",
    "libelleCourt": "Salle 7042",
    "libelleLong": "Salle 7042, 103, rue de l'Université"
  },
  "cycleDeVie": {
    "etat": "Confirmé",
    "chrono": {
      "creation": "2019-09-11T09:13:41.000+02:00"
    }
  },
  "demandeurs": {
    "acteurs": [
      {
        "nom": "Mme Danièle HÉRIN",
        "acteurRef": "PA718794"
      }
    ]
  },
  "typeReunion": "DEP"
}