{
  "xsiType": "reunionInitParlementaire_type",
  "uid": "RUANR5L15S2019IDF0134258",
  "timestampDebut": "2019-05-28T16:30:00.000+02:00",
  "timestampFin": "2019-05-28T18:00:00.000+02:00",
  "lieu": {
    "code": "SALREU002",
    "libelleCourt": "Salle 7070",
    "libelleLong": "Salle 7070, 103, rue de l'Université"
  },
  "cycleDeVie": {
    "etat": "Confirmé",
    "chrono": {
      "creation": "2019-05-22T09:49:55.000+02:00"
    }
  },
  "demandeurs": {
    "acteurs": [
      {
        "nom": "M. Christophe BOUILLON",
        "acteurRef": "PA267233"
      }
    ]
  },
  "typeReunion": "DEP"
}