{
  "xsiType": "reunionCommission_type",
  "uid": "RUANR5L15S2018IDC427759",
  "timestampDebut": "2017-11-22T10:00:00.000+01:00",
  "lieu": {
    "libelleLong": "salle 6242 (Lois)"
  },
  "cycleDeVie": {
    "etat": "Supprimé",
    "chrono": {
      "creation": "2017-11-09T00:00:00.000+01:00",
      "cloture": "2017-11-16T00:00:00.000+01:00"
    }
  },
  "organeReuniRef": "PO59051",
  "participants": {},
  "ouverturePresse": false,
  "odj": {
    "convocationOdj": [
      "Examen de la proposition de loi relative à l'exercice des compétences des collectivités territoriales dans le domaine de la gestion des milieux aquatiques et de la prévention des inondations (n° 310) (Mme Élodie Jacquier-Laforge, rapporteure) ;Examen de la proposition de loi relative à la garde alternée des enfants (n° 307) (M. Vincent Bru, rapporteur)."
    ],
    "resumeOdj": [
      "compétences collectivités territoriales milieux aquatiques et prévention des inondations (n° 310) (première lecture) ;",
      "garde alternée (n° 307) (première lecture)."
    ]
  },
  "formatReunion": "Ordinaire",
  "infosReunionsInternationale": {
    "estReunionInternationale": false
  },
  "captationVideo": false
}