{
  "xsiType": "reunionInitParlementaire_type",
  "uid": "RUANR5L15S2018IDF0100661",
  "timestampDebut": "2018-01-16T17:00:00.000+01:00",
  "timestampFin": "2018-01-16T18:00:00.000+01:00",
  "lieu": {
    "code": "SALREU028",
    "libelleCourt": "Salle Colbert",
    "libelleLong": "Salle Colbert , Palais Bourbon"
  },
  "cycleDeVie": {
    "etat": "Annulé",
    "chrono": {
      "creation": "2017-11-15T18:18:47.000+01:00",
      "cloture": "2018-01-10T15:51:52.000+01:00"
    }
  },
  "demandeurs": {
    "organe": {
      "nom": "GROUPE LA RÉPUBLIQUE EN MARCHE",
      "organeRef": "PO730964"
    }
  },
  "organeReuniRef": "PO730964",
  "typeReunion": "GP"
}