{
  "xsiType": "reunionInitParlementaire_type",
  "uid": "RUANR5L15S2018IDF0100994",
  "timestampDebut": "2017-11-21T09:00:00.000+01:00",
  "timestampFin": "2017-11-21T10:30:00.000+01:00",
  "lieu": {
    "code": "SALREU023",
    "libelleCourt": "Salle 7426",
    "libelleLong": "Salle 7426, 101, rue de l'Université"
  },
  "cycleDeVie": {
    "etat": "Confirmé",
    "chrono": {
      "creation": "2017-11-20T11:04:27.000+01:00"
    }
  },
  "demandeurs": {
    "acteurs": [
      {
        "nom": "Mme George PAU-LANGEVIN",
        "acteurRef": "PA335532"
      }
    ]
  },
  "typeReunion": "DEP"
}