{
  "xsiType": "reunionInitParlementaire_type",
  "uid": "RUANR5L15S2019IDF0136128",
  "timestampDebut": "2019-07-17T14:00:00.000+02:00",
  "timestampFin": "2019-07-17T15:00:00.000+02:00",
  "lieu": {
    "code": "SALREU006",
    "libelleCourt": "3ème Bureau",
    "libelleLong": "3ème Bureau, Palais Bourbon"
  },
  "cycleDeVie": {
    "etat": "Confirmé",
    "chrono": {
      "creation": "2019-06-24T12:35:20.000+02:00"
    }
  },
  "demandeurs": {
    "organe": {
      "nom": "GROUPE LA RÉPUBLIQUE EN MARCHE",
      "organeRef": "PO730964"
    }
  },
  "organeReuniRef": "PO730964",
  "typeReunion": "GP"
}