{
  "xsiType": "reunionInitParlementaire_type",
  "uid": "RUANR5L15S2018IDF0103213",
  "timestampDebut": "2018-01-17T08:30:00.000+01:00",
  "timestampFin": "2018-01-17T11:00:00.000+01:00",
  "lieu": {
    "code": "SALREU017",
    "libelleCourt": "Salon Visconti",
    "libelleLong": "Salon Visconti, 101, rue de l'Université"
  },
  "cycleDeVie": {
    "etat": "Confirmé",
    "chrono": {
      "creation": "2018-01-08T16:28:07.000+01:00"
    }
  },
  "demandeurs": {
    "acteurs": [
      {
        "nom": "M. Éric CIOTTI",
        "acteurRef": "PA330240"
      }
    ]
  },
  "typeReunion": "DEP"
}