{
  "xsiType": "reunionInitParlementaire_type",
  "uid": "RUANR5L15S2018IDF0104162",
  "timestampDebut": "2018-05-17T15:00:00.000+02:00",
  "timestampFin": "2018-05-17T21:00:00.000+02:00",
  "lieu": {
    "code": "SALREU003",
    "libelleCourt": "Salle Victor Hugo",
    "libelleLong": "Salle Victor Hugo, 101, rue de l'Université"
  },
  "cycleDeVie": {
    "etat": "Annulé",
    "chrono": {
      "creation": "2018-01-22T17:59:39.000+01:00",
      "cloture": "2018-04-12T16:15:45.000+02:00"
    }
  },
  "demandeurs": {
    "acteurs": [
      {
        "nom": "Mme Barbara POMPILI",
        "acteurRef": "PA609520"
      }
    ]
  },
  "typeReunion": "DEP"
}