{
  "xsiType": "reunionCommission_type",
  "uid": "RUANR5L15S2020IDC434313",
  "timestampDebut": "2019-12-05T08:45:00.000+01:00",
  "lieu": {
    "libelleLong": "salle 6241 (Affaires économiques)"
  },
  "cycleDeVie": {
    "etat": "Eventuel",
    "chrono": {
      "creation": "2019-11-20T00:00:00.000+01:00"
    }
  },
  "organeReuniRef": "PO419610",
  "participants": {},
  "ouverturePresse": true,
  "odj": {
    "convocationOdj": [
      "Éventuellement, examen, en application de l’article 88 du Règlement, des amendements restant en discussion sur la proposition de loi portant création d’une prime pour le climat et de lutte contre la précarité énergétique (n° 2352) (M. Boris Vallaud, rapporteur)."
    ],
    "resumeOdj": [
      "éventuellement, examen, en application de l’article 88 du Règlement, des amendements restant en discussion sur la proposition de loi portant création d’une prime pour le climat et de lutte contre la précarité énergétique (n° 2352) (M. Boris Vallaud, rapporteur)."
    ],
    "pointsOdj": [
      {
        "xsiType": "podjReunion_type",
        "uid": "RUANR5L15S2020IDC434313PT27026",
        "cycleDeVie": {
          "etat": "Eventuel",
          "chrono": {
            "creation": "2019-11-20T00:00:00.000+01:00"
          }
        },
        "objet": "Examen du texte",
        "dossiersLegislatifsRefs": [
          "DLR5L15N37880"
        ],
        "typePointOdj": "Examen",
        "comiteSecret": false
      }
    ]
  },
  "formatReunion": "Ordinaire",
  "infosReunionsInternationale": {
    "estReunionInternationale": false
  },
  "captationVideo": true
}