{
  "xsiType": "reunionInitParlementaire_type",
  "uid": "RUANR5L15S2018IDF0114458",
  "timestampDebut": "2018-07-04T14:30:00.000+02:00",
  "timestampFin": "2018-07-04T16:00:00.000+02:00",
  "lieu": {
    "code": "SALREU017",
    "libelleCourt": "Salon Visconti",
    "libelleLong": "Salon Visconti, 101, rue de l'Université"
  },
  "cycleDeVie": {
    "etat": "Confirmé",
    "chrono": {
      "creation": "2018-06-28T13:00:25.000+02:00"
    }
  },
  "demandeurs": {
    "acteurs": [
      {
        "nom": "M. Aurélien TACHÉ",
        "acteurRef": "PA720952"
      }
    ]
  },
  "typeReunion": "DEP"
}