{
  "xsiType": "reunionInitParlementaire_type",
  "uid": "RUANR5L15S2019IDF0130349",
  "timestampDebut": "2019-04-03T11:30:00.000+02:00",
  "timestampFin": "2019-04-03T12:30:00.000+02:00",
  "lieu": {
    "code": "SALREU023",
    "libelleCourt": "Salle 7426",
    "libelleLong": "Salle 7426, 101, rue de l'Université"
  },
  "cycleDeVie": {
    "etat": "Annulé",
    "chrono": {
      "creation": "2019-03-20T09:25:17.000+01:00",
      "cloture": "2019-03-20T15:43:21.000+01:00"
    }
  },
  "demandeurs": {
    "acteurs": [
      {
        "nom": "Mme Véronique LOUWAGIE",
        "acteurRef": "PA608016"
      }
    ]
  },
  "typeReunion": "DEP"
}