{
  "xsiType": "reunionInitParlementaire_type",
  "uid": "RUANR5L15S2019IDF0131227",
  "timestampDebut": "2019-04-09T13:00:00.000+02:00",
  "timestampFin": "2019-04-09T14:00:00.000+02:00",
  "lieu": {
    "code": "SALREU021",
    "libelleCourt": "Salle 7207",
    "libelleLong": "Salle 7207, 101, rue de l'Université"
  },
  "cycleDeVie": {
    "etat": "Confirmé",
    "chrono": {
      "creation": "2019-03-29T15:33:19.000+01:00"
    }
  },
  "demandeurs": {
    "acteurs": [
      {
        "nom": "M. Anthony CELLIER",
        "acteurRef": "PA719440"
      }
    ]
  },
  "typeReunion": "DEP"
}