{
  "xsiType": "reunionInitParlementaire_type",
  "uid": "RUANR5L15S2019IDF0134655",
  "timestampDebut": "2019-06-04T16:00:00.000+02:00",
  "timestampFin": "2019-06-04T17:00:00.000+02:00",
  "lieu": {
    "code": "SALREU021",
    "libelleCourt": "Salle 7207",
    "libelleLong": "Salle 7207, 101, rue de l'Université"
  },
  "cycleDeVie": {
    "etat": "Confirmé",
    "chrono": {
      "creation": "2019-05-28T13:33:20.000+02:00"
    }
  },
  "demandeurs": {
    "acteurs": [
      {
        "nom": "Mme Barbara BESSOT BALLOT",
        "acteurRef": "PA722312"
      }
    ]
  },
  "typeReunion": "DEP"
}