{
  "xsiType": "reunionCommission_type",
  "uid": "RUANR5L15S2020IDC433653",
  "timestampDebut": "2019-10-01T18:30:00.000+02:00",
  "timestampFin": "2019-10-01T19:15:00.000+02:00",
  "lieu": {
    "libelleLong": "salle 6242 (Affaires culturelles)"
  },
  "cycleDeVie": {
    "etat": "Confirmé",
    "chrono": {
      "creation": "2019-09-11T00:00:00.000+02:00"
    }
  },
  "organeReuniRef": "PO419604",
  "participants": {
    "participantsInternes": [
      {
        "acteurRef": "PA719318",
        "presence": "présent"
      },
      {
        "acteurRef": "PA721674",
        "presence": "présent"
      },
      {
        "acteurRef": "PA720256",
        "presence": "présent"
      },
      {
        "acteurRef": "PA718884",
        "presence": "présent"
      },
      {
        "acteurRef": "PA722046",
        "presence": "présent"
      },
      {
        "acteurRef": "PA719488",
        "presence": "présent"
      },
      {
        "acteurRef": "PA720822",
        "presence": "présent"
      },
      {
        "acteurRef": "PA720576",
        "presence": "excusé"
      },
      {
        "acteurRef": "PA721816",
        "presence": "présent"
      },
      {
        "acteurRef": "PA722030",
        "presence": "absent"
      },
      {
        "acteurRef": "PA719032",
        "presence": "absent"
      },
      {
        "acteurRef": "PA223837",
        "presence": "absent"
      },
      {
        "acteurRef": "PA721328",
        "presence": "absent"
      },
      {
        "acteurRef": "PA689",
        "presence": "excusé"
      },
      {
        "acteurRef": "PA721750",
        "presence": "présent"
      },
      {
        "acteurRef": "PA721352",
        "presence": "présent"
      },
      {
        "acteurRef": "PA721218",
        "presence": "présent"
      },
      {
        "acteurRef": "PA719170",
        "presence": "présent"
      },
      {
        "acteurRef": "PA702054",
        "presence": "présent"
      },
      {
        "acteurRef": "PA719814",
        "presence": "présent"
      },
      {
        "acteurRef": "PA719118",
        "presence": "présent"
      },
      {
        "acteurRef": "PA720696",
        "presence": "présent"
      },
      {
        "acteurRef": "PA719162",
        "presence": "présent"
      },
      {
        "acteurRef": "PA608826",
        "presence": "présent"
      },
      {
        "acteurRef": "PA721896",
        "presence": "excusé"
      },
      {
        "acteurRef": "PA720030",
        "presence": "présent"
      },
      {
        "acteurRef": "PA722284",
        "presence": "présent"
      },
      {
        "acteurRef": "PA720178",
        "presence": "présent"
      },
      {
        "acteurRef": "PA267324",
        "presence": "présent"
      },
      {
        "acteurRef": "PA605991",
        "presence": "excusé"
      },
      {
        "acteurRef": "PA719108",
        "presence": "présent"
      },
      {
        "acteurRef": "PA721784",
        "presence": "présent"
      },
      {
        "acteurRef": "PA722062",
        "presence": "absent"
      },
      {
        "acteurRef": "PA722070",
        "presence": "présent"
      },
      {
        "acteurRef": "PA718794",
        "presence": "absent"
      },
      {
        "acteurRef": "PA720038",
        "presence": "absent"
      },
      {
        "acteurRef": "PA332614",
        "presence": "présent"
      },
      {
        "acteurRef": "PA719230",
        "presence": "présent"
      },
      {
        "acteurRef": "PA721506",
        "presence": "présent"
      },
      {
        "acteurRef": "PA643205",
        "presence": "absent"
      },
      {
        "acteurRef": "PA718868",
        "presence": "présent"
      },
      {
        "acteurRef": "PA719728",
        "presence": "absent"
      },
      {
        "acteurRef": "PA345722",
        "presence": "absent"
      },
      {
        "acteurRef": "PA720988",
        "presence": "présent"
      },
      {
        "acteurRef": "PA719640",
        "presence": "présent"
      },
      {
        "acteurRef": "PA719272",
        "presence": "présent"
      },
      {
        "acteurRef": "PA720630",
        "presence": "présent"
      },
      {
        "acteurRef": "PA719456",
        "presence": "présent"
      },
      {
        "acteurRef": "PA721656",
        "presence": "excusé"
      },
      {
        "acteurRef": "PA719464",
        "presence": "absent"
      },
      {
        "acteurRef": "PA333421",
        "presence": "présent"
      },
      {
        "acteurRef": "PA719946",
        "presence": "absent"
      },
      {
        "acteurRef": "PA722090",
        "presence": "présent"
      },
      {
        "acteurRef": "PA721234",
        "presence": "présent"
      },
      {
        "acteurRef": "PA721844",
        "presence": "présent"
      },
      {
        "acteurRef": "PA719600",
        "presence": "présent"
      },
      {
        "acteurRef": "PA722194",
        "presence": "présent"
      },
      {
        "acteurRef": "PA718944",
        "presence": "présent"
      },
      {
        "acteurRef": "PA721888",
        "presence": "absent"
      },
      {
        "acteurRef": "PA266776",
        "presence": "absent"
      },
      {
        "acteurRef": "PA719676",
        "presence": "absent"
      },
      {
        "acteurRef": "PA720900",
        "presence": "présent"
      },
      {
        "acteurRef": "PA722252",
        "presence": "absent"
      },
      {
        "acteurRef": "PA718902",
        "presence": "absent"
      },
      {
        "acteurRef": "PA720190",
        "presence": "présent"
      },
      {
        "acteurRef": "PA720754",
        "presence": "présent"
      },
      {
        "acteurRef": "PA720854",
        "presence": "présent"
      },
      {
        "acteurRef": "PA720568",
        "presence": "présent"
      },
      {
        "acteurRef": "PA608741",
        "presence": "présent"
      },
      {
        "acteurRef": "PA340357",
        "presence": "absent"
      },
      {
        "acteurRef": "PA606639",
        "presence": "absent"
      },
      {
        "acteurRef": "PA722260",
        "presence": "absent"
      },
      {
        "acteurRef": "PA267330",
        "presence": "absent"
      }
    ]
  },
  "ouverturePresse": false,
  "odj": {
    "convocationOdj": [
      "– Élection des membres du Bureau de la Commission"
    ],
    "resumeOdj": [
      "élection des membres du bureau de la commission."
    ]
  },
  "compteRenduRef": "CRCANR5L15S2020PO419604N001",
  "formatReunion": "Ordinaire",
  "infosReunionsInternationale": {
    "estReunionInternationale": false
  },
  "captationVideo": false
}