{
  "xsiType": "reunionInitParlementaire_type",
  "uid": "RUANR5L15S2018IDF0104565",
  "timestampDebut": "2018-02-07T14:00:00.000+01:00",
  "timestampFin": "2018-02-07T18:00:00.000+01:00",
  "lieu": {
    "code": "SALREU032",
    "libelleCourt": "Sully 4",
    "libelleLong": "Sully 4, Palais Bourbon"
  },
  "cycleDeVie": {
    "etat": "Confirmé",
    "chrono": {
      "creation": "2018-01-29T13:16:42.000+01:00"
    }
  },
  "demandeurs": {
    "acteurs": [
      {
        "nom": "M. Fabien ROUSSEL",
        "acteurRef": "PA720692"
      }
    ]
  },
  "typeReunion": "DEP"
}