{
  "xsiType": "reunionInitParlementaire_type",
  "uid": "RUANR5L15S2019IDF0128602",
  "timestampDebut": "2019-04-04T14:00:00.000+02:00",
  "timestampFin": "2019-04-04T18:00:00.000+02:00",
  "lieu": {
    "code": "SALREU048",
    "libelleCourt": "Salle 6809",
    "libelleLong": "Salle 6809, Palais Bourbon"
  },
  "cycleDeVie": {
    "etat": "Confirmé",
    "chrono": {
      "creation": "2019-02-25T10:29:04.000+01:00"
    }
  },
  "demandeurs": {
    "acteurs": [
      {
        "nom": "M. Daniel LABARONNE",
        "acteurRef": "PA719798"
      }
    ]
  },
  "typeReunion": "DEP"
}