{
  "xsiType": "reunionInitParlementaire_type",
  "uid": "RUANR5L15S2019IDF0139566",
  "timestampDebut": "2019-09-24T08:30:00.000+02:00",
  "timestampFin": "2019-09-24T10:00:00.000+02:00",
  "lieu": {
    "code": "SALREU012",
    "libelleCourt": "Salle N° 23",
    "libelleLong": "Salle N° 23, 3, rue Aristide Briand"
  },
  "cycleDeVie": {
    "etat": "Confirmé",
    "chrono": {
      "creation": "2019-09-11T08:25:32.000+02:00"
    }
  },
  "demandeurs": {
    "acteurs": [
      {
        "nom": "M. Jean-François CESARINI",
        "acteurRef": "PA721860"
      }
    ]
  },
  "typeReunion": "DEP"
}