{
  "xsiType": "reunionInitParlementaire_type",
  "uid": "RUANR5L15S2018IDF0107624",
  "timestampDebut": "2018-04-03T16:15:00.000+02:00",
  "timestampFin": "2018-04-03T17:15:00.000+02:00",
  "lieu": {
    "code": "SALREU007",
    "libelleCourt": "4ème Bureau",
    "libelleLong": "4ème Bureau, Palais Bourbon"
  },
  "cycleDeVie": {
    "etat": "Confirmé",
    "chrono": {
      "creation": "2018-03-13T19:46:11.000+01:00"
    }
  },
  "demandeurs": {
    "acteurs": [
      {
        "nom": "Mme Monique LIMON",
        "acteurRef": "PA719858"
      }
    ]
  },
  "typeReunion": "DEP"
}