{
  "xsiType": "reunionInitParlementaire_type",
  "uid": "RUANR5L15S2019IDF0121279",
  "timestampDebut": "2018-11-08T15:30:00.000+01:00",
  "timestampFin": "2018-11-08T16:30:00.000+01:00",
  "lieu": {
    "code": "SALREU022",
    "libelleCourt": "Salle 7326",
    "libelleLong": "Salle 7326, 101, rue de l'Université"
  },
  "cycleDeVie": {
    "etat": "Confirmé",
    "chrono": {
      "creation": "2018-10-24T11:20:37.000+02:00"
    }
  },
  "demandeurs": {
    "acteurs": [
      {
        "nom": "M. Thomas MESNIER",
        "acteurRef": "PA719072"
      }
    ]
  },
  "typeReunion": "DEP"
}