{
  "xsiType": "reunionInitParlementaire_type",
  "uid": "RUANR5L15S2018IDF0107144",
  "timestampDebut": "2018-05-29T10:00:00.000+02:00",
  "timestampFin": "2018-05-29T12:00:00.000+02:00",
  "lieu": {
    "code": "SALREU012",
    "libelleCourt": "Salle N° 23",
    "libelleLong": "Salle N° 23, 3, rue Aristide Briand"
  },
  "cycleDeVie": {
    "etat": "Confirmé",
    "chrono": {
      "creation": "2018-03-07T15:06:23.000+01:00"
    }
  },
  "demandeurs": {
    "acteurs": [
      {
        "nom": "M. Emmanuel MAQUET",
        "acteurRef": "PA346054"
      }
    ]
  },
  "typeReunion": "DEP"
}