{
  "xsiType": "reunionInitParlementaire_type",
  "uid": "RUANR5L15S2019IDF0135756",
  "timestampDebut": "2019-06-18T08:30:00.000+02:00",
  "timestampFin": "2019-06-18T09:30:00.000+02:00",
  "lieu": {
    "code": "SALREU048",
    "libelleCourt": "Salle 6809",
    "libelleLong": "Salle 6809, Palais Bourbon"
  },
  "cycleDeVie": {
    "etat": "Confirmé",
    "chrono": {
      "creation": "2019-06-17T16:57:55.000+02:00"
    }
  },
  "demandeurs": {
    "acteurs": [
      {
        "nom": "Mme Claire PITOLLAT",
        "acteurRef": "PA718910"
      }
    ]
  },
  "typeReunion": "DEP"
}