{
  "xsiType": "reunionInitParlementaire_type",
  "uid": "RUANR5L15S2017IDF0096932",
  "timestampDebut": "2017-09-27T09:30:00.000+02:00",
  "timestampFin": "2017-09-27T11:00:00.000+02:00",
  "lieu": {
    "code": "SALREU002",
    "libelleCourt": "Salle 7070",
    "libelleLong": "Salle 7070, 103, rue de l'Université"
  },
  "cycleDeVie": {
    "etat": "Confirmé",
    "chrono": {
      "creation": "2017-09-25T10:12:03.000+02:00"
    }
  },
  "demandeurs": {
    "acteurs": [
      {
        "nom": "M. Joaquim PUEYO",
        "acteurRef": "PA608011"
      }
    ]
  },
  "typeReunion": "DEP"
}