{
  "xsiType": "reunionInitParlementaire_type",
  "uid": "RUANR5L15S2019IDF0129444",
  "timestampDebut": "2019-03-12T10:30:00.000+01:00",
  "timestampFin": "2019-03-12T11:30:00.000+01:00",
  "lieu": {
    "code": "SALREU002",
    "libelleCourt": "Salle 7070",
    "libelleLong": "Salle 7070, 103, rue de l'Université"
  },
  "cycleDeVie": {
    "etat": "Confirmé",
    "chrono": {
      "creation": "2019-03-08T16:52:53.000+01:00"
    }
  },
  "demandeurs": {
    "acteurs": [
      {
        "nom": "M. Dominique DA SILVA",
        "acteurRef": "PA720932"
      }
    ]
  },
  "typeReunion": "DEP"
}