{
  "xsiType": "reunionInitParlementaire_type",
  "uid": "RUANR5L15S2018IDF0111103",
  "timestampDebut": "2018-06-13T18:30:00.000+02:00",
  "timestampFin": "2018-06-13T19:30:00.000+02:00",
  "lieu": {
    "code": "SALREU022",
    "libelleCourt": "Salle 7326",
    "libelleLong": "Salle 7326, 101, rue de l'Université"
  },
  "cycleDeVie": {
    "etat": "Confirmé",
    "chrono": {
      "creation": null
    }
  },
  "demandeurs": {
    "acteurs": [
      {
        "nom": "M. Dominique POTIER",
        "acteurRef": "PA607553"
      }
    ]
  },
  "typeReunion": "DEP"
}