{
  "xsiType": "reunionInitParlementaire_type",
  "uid": "RUANR5L15S2019IDF0121087",
  "timestampDebut": "2018-11-06T18:00:00.000+01:00",
  "timestampFin": "2018-11-06T20:00:00.000+01:00",
  "lieu": {
    "code": "SALREU017",
    "libelleCourt": "Salon Visconti",
    "libelleLong": "Salon Visconti, 101, rue de l'Université"
  },
  "cycleDeVie": {
    "etat": "Confirmé",
    "chrono": {
      "creation": "2018-10-19T13:06:58.000+02:00"
    }
  },
  "demandeurs": {
    "acteurs": [
      {
        "nom": "M. Michel LARIVE",
        "acteurRef": "PA718868"
      }
    ]
  },
  "typeReunion": "DEP"
}