{
  "xsiType": "reunionInitParlementaire_type",
  "uid": "RUANR5L15S2018IDF0115532",
  "timestampDebut": "2018-09-11T14:00:00.000+02:00",
  "timestampFin": "2018-09-11T15:00:00.000+02:00",
  "lieu": {
    "code": "SALREU038",
    "libelleCourt": "Salle 6549",
    "libelleLong": "Salle 6549, Palais Bourbon"
  },
  "cycleDeVie": {
    "etat": "Confirmé",
    "chrono": {
      "creation": "2018-07-11T17:25:21.000+02:00"
    }
  },
  "demandeurs": {
    "acteurs": [
      {
        "nom": "Mme Cécile UNTERMAIER",
        "acteurRef": "PA608695"
      },
      {
        "nom": "M. Jean TERLIER",
        "acteurRef": "PA721584"
      }
    ]
  },
  "typeReunion": "DEP"
}