{
  "xsiType": "reunionInitParlementaire_type",
  "uid": "RUANR5L15S2019IDF0121754",
  "timestampDebut": "2018-12-18T15:00:00.000+01:00",
  "timestampFin": "2018-12-18T17:00:00.000+01:00",
  "lieu": {
    "code": "SALREU008",
    "libelleCourt": "5ème Bureau",
    "libelleLong": "5ème Bureau, Palais Bourbon"
  },
  "cycleDeVie": {
    "etat": "Confirmé",
    "chrono": {
      "creation": "2018-11-02T18:33:31.000+01:00"
    }
  },
  "demandeurs": {
    "acteurs": [
      {
        "nom": "M. Philippe BOLO",
        "acteurRef": "PA720162"
      }
    ]
  },
  "typeReunion": "DEP"
}