{
  "xsiType": "reunionInitParlementaire_type",
  "uid": "RUANR5L15S2019IDF0126009",
  "timestampDebut": "2019-02-07T14:00:00.000+01:00",
  "timestampFin": "2019-02-07T18:30:00.000+01:00",
  "lieu": {
    "code": "SALREU033",
    "libelleCourt": "6ème Bureau",
    "libelleLong": "6ème Bureau, Palais Bourbon"
  },
  "cycleDeVie": {
    "etat": "Confirmé",
    "chrono": {
      "creation": "2019-01-25T10:01:12.000+01:00"
    }
  },
  "demandeurs": {
    "acteurs": [
      {
        "nom": "M. Loïc PRUD'HOMME",
        "acteurRef": "PA719578"
      }
    ]
  },
  "typeReunion": "DEP"
}