{
  "xsiType": "reunionInitParlementaire_type",
  "uid": "RUANR5L15S2019IDF0127046",
  "timestampDebut": "2019-02-06T19:00:00.000+01:00",
  "timestampFin": "2019-02-06T20:00:00.000+01:00",
  "lieu": {
    "code": "SALREU007",
    "libelleCourt": "4ème Bureau",
    "libelleLong": "4ème Bureau, Palais Bourbon"
  },
  "cycleDeVie": {
    "etat": "Confirmé",
    "chrono": {
      "creation": "2019-02-06T17:25:20.000+01:00"
    }
  },
  "demandeurs": {
    "acteurs": [
      {
        "nom": "M. Jean-Baptiste DJEBBARI",
        "acteurRef": "PA722236"
      }
    ]
  },
  "typeReunion": "DEP"
}