{
  "xsiType": "reunionCommission_type",
  "uid": "RUANR5L15S2018IDC429606",
  "timestampDebut": "2018-06-14T10:45:00.000+02:00",
  "timestampFin": "2018-06-14T11:45:00.000+02:00",
  "lieu": {
    "libelleLong": "salle 6242 (Lois)"
  },
  "cycleDeVie": {
    "etat": "Confirmé",
    "chrono": {
      "creation": "2018-05-25T00:00:00.000+02:00"
    }
  },
  "organeReuniRef": "PO751337",
  "participants": {
    "participantsInternes": [
      {
        "acteurRef": "PA606675",
        "presence": "absent"
      },
      {
        "acteurRef": "PA720256",
        "presence": "présent"
      },
      {
        "acteurRef": "PA332228",
        "presence": "absent"
      },
      {
        "acteurRef": "PA718876",
        "presence": "présent"
      },
      {
        "acteurRef": "PA722126",
        "presence": "absent"
      },
      {
        "acteurRef": "PA721210",
        "presence": "absent"
      },
      {
        "acteurRef": "PA720862",
        "presence": "absent"
      },
      {
        "acteurRef": "PA720438",
        "presence": "absent"
      },
      {
        "acteurRef": "PA267780",
        "presence": "absent"
      },
      {
        "acteurRef": "PA719326",
        "presence": "présent"
      },
      {
        "acteurRef": "PA333818",
        "presence": "présent"
      },
      {
        "acteurRef": "PA720074",
        "presence": "absent"
      },
      {
        "acteurRef": "PA722202",
        "presence": "absent"
      },
      {
        "acteurRef": "PA721434",
        "presence": "absent"
      },
      {
        "acteurRef": "PA720022",
        "presence": "présent"
      },
      {
        "acteurRef": "PA722228",
        "presence": "présent"
      },
      {
        "acteurRef": "PA340853",
        "presence": "absent"
      },
      {
        "acteurRef": "PA1874",
        "presence": "absent"
      },
      {
        "acteurRef": "PA719404",
        "presence": "présent"
      },
      {
        "acteurRef": "PA719718",
        "presence": "présent"
      },
      {
        "acteurRef": "PA719338",
        "presence": "absent"
      },
      {
        "acteurRef": "PA719952",
        "presence": "absent"
      },
      {
        "acteurRef": "PA720644",
        "presence": "absent"
      },
      {
        "acteurRef": "PA720100",
        "presence": "absent"
      },
      {
        "acteurRef": "PA643127",
        "presence": "absent"
      },
      {
        "acteurRef": "PA720092",
        "presence": "absent"
      },
      {
        "acteurRef": "PA722078",
        "presence": "présent"
      },
      {
        "acteurRef": "PA718682",
        "presence": "absent"
      },
      {
        "acteurRef": "PA719930",
        "presence": "absent"
      },
      {
        "acteurRef": "PA709315",
        "presence": "excusé"
      }
    ]
  },
  "ouverturePresse": true,
  "odj": {
    "convocationOdj": [
      "Audition, ouverte à la presse, de M. Bruno Le Maire, ministre de l'Économie et des finances"
    ],
    "resumeOdj": [
      "audition, ouverte à la presse, de M. Bruno Le Maire, ministre de l'économie et des finances."
    ]
  },
  "compteRenduRef": "CRCANR5L15S2018PO751337N028",
  "formatReunion": "Ordinaire",
  "infosReunionsInternationale": {
    "estReunionInternationale": false
  },
  "captationVideo": false
}