{
  "xsiType": "reunionInitParlementaire_type",
  "uid": "RUANR5L15S2019IDF0138300",
  "timestampDebut": "2019-09-26T14:00:00.000+02:00",
  "timestampFin": "2019-09-26T17:00:00.000+02:00",
  "lieu": {
    "code": "SALREU012",
    "libelleCourt": "Salle N° 23",
    "libelleLong": "Salle N° 23, 3, rue Aristide Briand"
  },
  "cycleDeVie": {
    "etat": "Confirmé",
    "chrono": {
      "creation": "2019-08-01T14:55:32.000+02:00"
    }
  },
  "demandeurs": {
    "acteurs": [
      {
        "nom": "Mme Cécile RILHAC",
        "acteurRef": "PA720900"
      }
    ]
  },
  "typeReunion": "DEP"
}