{
  "xsiType": "reunionInitParlementaire_type",
  "uid": "RUANR5L15S2019IDF0126940",
  "timestampDebut": "2019-03-05T17:00:00.000+01:00",
  "timestampFin": "2019-03-05T21:00:00.000+01:00",
  "lieu": {
    "code": "SALREU021",
    "libelleCourt": "Salle 7207",
    "libelleLong": "Salle 7207, 101, rue de l'Université"
  },
  "cycleDeVie": {
    "etat": "Annulé",
    "chrono": {
      "creation": "2019-02-06T11:08:41.000+01:00",
      "cloture": "2019-02-12T17:54:29.000+01:00"
    }
  },
  "demandeurs": {
    "acteurs": [
      {
        "nom": "M. André VILLIERS",
        "acteurRef": "PA421348"
      }
    ]
  },
  "typeReunion": "DEP"
}