{
  "xsiType": "reunionInitParlementaire_type",
  "uid": "RUANR5L15S2018IDF0110949",
  "timestampDebut": "2018-05-09T14:00:00.000+02:00",
  "timestampFin": "2018-05-09T15:00:00.000+02:00",
  "lieu": {
    "code": "SALREU023",
    "libelleCourt": "Salle 7426",
    "libelleLong": "Salle 7426, 101, rue de l'Université"
  },
  "cycleDeVie": {
    "etat": "Confirmé",
    "chrono": {
      "creation": "2018-05-03T09:16:33.000+02:00"
    }
  },
  "demandeurs": {
    "acteurs": [
      {
        "nom": "M. Alain RAMADIER",
        "acteurRef": "PA721286"
      }
    ]
  },
  "typeReunion": "DEP"
}