{
  "xsiType": "reunionInitParlementaire_type",
  "uid": "RUANR5L15S2018IDF0097783",
  "timestampDebut": "2018-04-10T12:00:00.000+02:00",
  "timestampFin": "2018-04-10T13:00:00.000+02:00",
  "lieu": {
    "code": "SALREU005",
    "libelleCourt": "2ème Bureau",
    "libelleLong": "2ème Bureau, Palais Bourbon"
  },
  "cycleDeVie": {
    "etat": "Confirmé",
    "chrono": {
      "creation": "2017-10-02T17:37:19.000+02:00"
    }
  },
  "demandeurs": {
    "organe": {
      "nom": "GROUPE GAUCHE DÉMOCRATE ET RÉPUBLICAINE",
      "organeRef": "PO730940"
    }
  },
  "organeReuniRef": "PO730940",
  "typeReunion": "GP"
}