{
  "xsiType": "reunionInitParlementaire_type",
  "uid": "RUANR5L15S2019IDF0134305",
  "timestampDebut": "2019-05-28T13:00:00.000+02:00",
  "timestampFin": "2019-05-28T14:00:00.000+02:00",
  "lieu": {
    "code": "SALREU013",
    "libelleCourt": "Salle N° 3",
    "libelleLong": "Salle N° 3, 3, rue Aristide Briand"
  },
  "cycleDeVie": {
    "etat": "Confirmé",
    "chrono": {
      "creation": "2019-05-22T14:19:46.000+02:00"
    }
  },
  "demandeurs": {
    "acteurs": [
      {
        "nom": "M. Damien ADAM",
        "acteurRef": "PA722038"
      }
    ]
  },
  "typeReunion": "DEP"
}