{
  "xsiType": "reunionInitParlementaire_type",
  "uid": "RUANR5L15S2018IDF0109265",
  "timestampDebut": "2018-04-10T13:00:00.000+02:00",
  "timestampFin": "2018-04-10T14:00:00.000+02:00",
  "lieu": {
    "code": "SALREU007",
    "libelleCourt": "4ème Bureau",
    "libelleLong": "4ème Bureau, Palais Bourbon"
  },
  "cycleDeVie": {
    "etat": "Annulé",
    "chrono": {
      "creation": "2018-04-05T11:08:18.000+02:00",
      "cloture": "2018-04-05T17:23:14.000+02:00"
    }
  },
  "demandeurs": {
    "acteurs": [
      {
        "nom": "Mme Pascale FONTENEL-PERSONNE",
        "acteurRef": "PA721384"
      }
    ]
  },
  "typeReunion": "DEP"
}