{
  "xsiType": "reunionInitParlementaire_type",
  "uid": "RUANR5L15S2018IDF0115773",
  "timestampDebut": "2018-07-20T09:00:00.000+02:00",
  "timestampFin": "2018-07-20T10:00:00.000+02:00",
  "lieu": {
    "code": "SALREU022",
    "libelleCourt": "Salle 7326",
    "libelleLong": "Salle 7326, 101, rue de l'Université"
  },
  "cycleDeVie": {
    "etat": "Confirmé",
    "chrono": {
      "creation": "2018-07-17T11:03:33.000+02:00"
    }
  },
  "demandeurs": {
    "acteurs": [
      {
        "nom": "M. François RUFFIN",
        "acteurRef": "PA722142"
      }
    ]
  },
  "typeReunion": "DEP"
}