{
  "xsiType": "reunionInitParlementaire_type",
  "uid": "RUANR5L15S2019IDF0113173",
  "timestampDebut": "2018-10-04T08:30:00.000+02:00",
  "timestampFin": "2018-10-04T13:30:00.000+02:00",
  "lieu": {
    "code": "SALREU003",
    "libelleCourt": "Salle Victor Hugo",
    "libelleLong": "Salle Victor Hugo, 101, rue de l'Université"
  },
  "cycleDeVie": {
    "etat": "Confirmé",
    "chrono": {
      "creation": "2018-06-07T11:33:32.000+02:00"
    }
  },
  "demandeurs": {
    "acteurs": [
      {
        "nom": "Mme Monique IBORRA",
        "acteurRef": "PA331835"
      }
    ]
  },
  "typeReunion": "DEP"
}