{
  "xsiType": "reunionInitParlementaire_type",
  "uid": "RUANR5L15S2019IDF0131908",
  "timestampDebut": "2019-05-07T08:00:00.000+02:00",
  "timestampFin": "2019-05-07T10:00:00.000+02:00",
  "lieu": {
    "code": "SALREU006",
    "libelleCourt": "3ème Bureau",
    "libelleLong": "3ème Bureau, Palais Bourbon"
  },
  "cycleDeVie": {
    "etat": "Confirmé",
    "chrono": {
      "creation": "2019-04-08T16:04:19.000+02:00"
    }
  },
  "demandeurs": {
    "acteurs": [
      {
        "nom": "M. Marc LE FUR",
        "acteurRef": "PA1874"
      }
    ]
  },
  "typeReunion": "DEP"
}