{
  "xsiType": "reunionInitParlementaire_type",
  "uid": "RUANR5L15S2017IDF0093241",
  "timestampDebut": "2017-06-28T08:00:00.000+02:00",
  "timestampFin": "2017-06-28T19:00:00.000+02:00",
  "lieu": {
    "code": "SALREU023",
    "libelleCourt": "Salle 7426",
    "libelleLong": "Salle 7426, 101, rue de l'Université"
  },
  "cycleDeVie": {
    "etat": "Confirmé",
    "chrono": {
      "creation": null
    }
  },
  "demandeurs": {
    "acteurs": [
      {
        "nom": "M. Frédéric PETIT",
        "acteurRef": "PA721182"
      }
    ]
  },
  "typeReunion": "DEP"
}