{
  "xsiType": "reunionInitParlementaire_type",
  "uid": "RUANR5L15S2020IDF0143106",
  "timestampDebut": "2019-11-19T14:00:00.000+01:00",
  "timestampFin": "2019-11-19T19:00:00.000+01:00",
  "lieu": {
    "code": "SALREU017",
    "libelleCourt": "Salon Visconti",
    "libelleLong": "Salon Visconti, 101, rue de l'Université"
  },
  "cycleDeVie": {
    "etat": "Confirmé",
    "chrono": {
      "creation": "2019-11-04T12:52:48.000+01:00"
    }
  },
  "demandeurs": {
    "acteurs": [
      {
        "nom": "M. Guillaume GAROT",
        "acteurRef": "PA333285"
      }
    ]
  },
  "typeReunion": "DEP"
}