{
  "xsiType": "reunionInitParlementaire_type",
  "uid": "RUANR5L15S2019IDF0128746",
  "timestampDebut": "2019-03-12T13:30:00.000+01:00",
  "timestampFin": "2019-03-12T15:00:00.000+01:00",
  "lieu": {
    "code": "SALREU002",
    "libelleCourt": "Salle 7070",
    "libelleLong": "Salle 7070, 103, rue de l'Université"
  },
  "cycleDeVie": {
    "etat": "Confirmé",
    "chrono": {
      "creation": "2019-02-27T12:37:42.000+01:00"
    }
  },
  "demandeurs": {
    "acteurs": [
      {
        "nom": "M. Anthony CELLIER",
        "acteurRef": "PA719440"
      }
    ]
  },
  "typeReunion": "DEP"
}