{
  "xsiType": "reunionCommission_type",
  "uid": "RUANR5L15S2019IDC433413",
  "timestampDebut": "2019-07-16T14:00:00.000+02:00",
  "lieu": {
    "libelleLong": "salle 6550 - 126 rue de l'Université"
  },
  "cycleDeVie": {
    "etat": "Confirmé",
    "chrono": {
      "creation": "2019-07-11T00:00:00.000+02:00"
    }
  },
  "organeReuniRef": "PO733667",
  "participants": {},
  "ouverturePresse": false,
  "odj": {
    "convocationOdj": [
      "Présentation, par le président du groupe d’amitié France-Tchad, M. Thibault Bazin, du rapport de la mission effectuée au Tchad par une délégation du groupe d’amitié, du 10 au 13 avril 2019"
    ],
    "resumeOdj": [
      "Présentation, par le président du groupe d’amitié France-Tchad, M. Thibault Bazin, du rapport de la mission effectuée au Tchad par une délégation du groupe d’amitié, du 10 au 13 avril 2019"
    ]
  },
  "formatReunion": "Ordinaire",
  "infosReunionsInternationale": {
    "estReunionInternationale": true,
    "listePays": [
      "GOP756533"
    ],
    "informationsComplementaires": "Camille d’Ollone - 39704"
  },
  "captationVideo": false
}