{
  "xsiType": "reunionCommission_type",
  "uid": "RUANR5L15S2019IDC431454",
  "timestampDebut": "2019-02-05T18:00:00.000+01:00",
  "lieu": {
    "libelleLong": "salle 6549 (2e étage)"
  },
  "cycleDeVie": {
    "etat": "Supprimé",
    "chrono": {
      "creation": "2019-02-01T00:00:00.000+01:00",
      "cloture": "2019-02-05T00:00:00.000+01:00"
    }
  },
  "organeReuniRef": "PO759869",
  "participants": {},
  "ouverturePresse": true,
  "odj": {
    "convocationOdj": [
      "Audition de Mme Cécile Tagliana, adjointe au directeur général de la cohésion sociale et cheffe du service des politiques sociales et médico-sociales du ministère des solidarités et de la santé, et de Mme Isabelle Grimault, sous-directrice de l’enfance et de la famille."
    ],
    "resumeOdj": [
      "audition de Mme Cécile Tagliana, adjointe au directeur général de la cohésion sociale et cheffe du service des politiques sociales et médico-sociales du ministère des solidarités et de la santé, et de Mme Isabelle Grimault, sous-directrice de l’enfance et de la famille."
    ]
  },
  "formatReunion": "Ordinaire",
  "infosReunionsInternationale": {
    "estReunionInternationale": false
  },
  "captationVideo": false
}