{
  "xsiType": "reunionInitParlementaire_type",
  "uid": "RUANR5L15S2019IDF0120080",
  "timestampDebut": "2018-10-17T14:00:00.000+02:00",
  "timestampFin": "2018-10-17T15:00:00.000+02:00",
  "lieu": {
    "code": "SALREU023",
    "libelleCourt": "Salle 7426",
    "libelleLong": "Salle 7426, 101, rue de l'Université"
  },
  "cycleDeVie": {
    "etat": "Confirmé",
    "chrono": {
      "creation": "2018-10-03T17:28:18.000+02:00"
    }
  },
  "demandeurs": {
    "acteurs": [
      {
        "nom": "M. Jean-Carles GRELIER",
        "acteurRef": "PA267318"
      }
    ]
  },
  "typeReunion": "DEP"
}