{
  "xsiType": "reunionInitParlementaire_type",
  "uid": "RUANR5L15S2019IDF0135081",
  "timestampDebut": "2019-07-04T14:00:00.000+02:00",
  "timestampFin": "2019-07-04T15:30:00.000+02:00",
  "lieu": {
    "code": "SALREU017",
    "libelleCourt": "Salon Visconti",
    "libelleLong": "Salon Visconti, 101, rue de l'Université"
  },
  "cycleDeVie": {
    "etat": "Confirmé",
    "chrono": {
      "creation": "2019-06-05T14:13:04.000+02:00"
    }
  },
  "demandeurs": {
    "acteurs": [
      {
        "nom": "M. Lionel CAUSSE",
        "acteurRef": "PA719922"
      }
    ]
  },
  "typeReunion": "DEP"
}