{
  "xsiType": "reunionInitParlementaire_type",
  "uid": "RUANR5L15S2018IDF0105175",
  "timestampDebut": "2018-02-20T16:30:00.000+01:00",
  "timestampFin": "2018-02-20T19:00:00.000+01:00",
  "lieu": {
    "code": "SALREU017",
    "libelleCourt": "Salon Visconti",
    "libelleLong": "Salon Visconti, 101, rue de l'Université"
  },
  "cycleDeVie": {
    "etat": "Confirmé",
    "chrono": {
      "creation": "2018-02-06T10:10:55.000+01:00"
    }
  },
  "demandeurs": {
    "acteurs": [
      {
        "nom": "Mme Valérie LACROUTE",
        "acteurRef": "PA609245"
      }
    ]
  },
  "typeReunion": "DEP"
}