{
  "xsiType": "reunionInitParlementaire_type",
  "uid": "RUANR5L15S2019IDF0128767",
  "timestampDebut": "2019-03-19T17:30:00.000+01:00",
  "timestampFin": "2019-03-19T19:30:00.000+01:00",
  "lieu": {
    "code": "SALREU021",
    "libelleCourt": "Salle 7207",
    "libelleLong": "Salle 7207, 101, rue de l'Université"
  },
  "cycleDeVie": {
    "etat": "Confirmé",
    "chrono": {
      "creation": "2019-02-27T15:06:09.000+01:00"
    }
  },
  "demandeurs": {
    "acteurs": [
      {
        "nom": "Mme Émilie CHALAS",
        "acteurRef": "PA719748"
      }
    ]
  },
  "typeReunion": "DEP"
}