{
  "xsiType": "reunionInitParlementaire_type",
  "uid": "RUANR5L15S2018IDF0100429",
  "timestampDebut": "2017-11-22T11:00:00.000+01:00",
  "timestampFin": "2017-11-22T12:00:00.000+01:00",
  "lieu": {
    "code": "SALREU021",
    "libelleCourt": "Salle 7207",
    "libelleLong": "Salle 7207, 101, rue de l'Université"
  },
  "cycleDeVie": {
    "etat": "Confirmé",
    "chrono": {
      "creation": "2017-11-15T15:21:28.000+01:00"
    }
  },
  "demandeurs": {
    "acteurs": [
      {
        "nom": "M. Régis JUANICO",
        "acteurRef": "PA332614"
      }
    ]
  },
  "typeReunion": "DEP"
}