{
  "xsiType": "reunionInitParlementaire_type",
  "uid": "RUANR5L15S2018IDF0118637",
  "timestampDebut": "2018-09-20T11:00:00.000+02:00",
  "timestampFin": "2018-09-20T13:00:00.000+02:00",
  "lieu": {
    "code": "SALREU005",
    "libelleCourt": "2ème Bureau",
    "libelleLong": "2ème Bureau, Palais Bourbon"
  },
  "cycleDeVie": {
    "etat": "Confirmé",
    "chrono": {
      "creation": "2018-09-14T17:17:55.000+02:00"
    }
  },
  "demandeurs": {
    "organe": {
      "nom": "Groupe d'amitié France-Corée du Sud",
      "organeRef": "PO733157"
    }
  },
  "organeReuniRef": "PO733157",
  "typeReunion": "GA"
}