{
  "xsiType": "reunionInitParlementaire_type",
  "uid": "RUANR5L15S2019IDF0137867",
  "timestampDebut": "2019-09-17T17:00:00.000+02:00",
  "timestampFin": "2019-09-17T18:00:00.000+02:00",
  "lieu": {
    "code": "SALREU023",
    "libelleCourt": "Salle 7426",
    "libelleLong": "Salle 7426, 101, rue de l'Université"
  },
  "cycleDeVie": {
    "etat": "Confirmé",
    "chrono": {
      "creation": "2019-07-22T15:51:41.000+02:00"
    }
  },
  "demandeurs": {
    "acteurs": [
      {
        "nom": "Mme Marie-Ange MAGNE",
        "acteurRef": "PA722244"
      }
    ]
  },
  "typeReunion": "DEP"
}