{
  "xsiType": "reunionCommission_type",
  "uid": "RUANR5L15S2019IDC431270",
  "timestampDebut": "2019-01-31T11:00:00.000+01:00",
  "lieu": {
    "libelleLong": "4013 (33, rue Saint-Dominique)"
  },
  "cycleDeVie": {
    "etat": "Confirmé",
    "chrono": {
      "creation": "2019-01-18T00:00:00.000+01:00"
    }
  },
  "organeReuniRef": "PO756121",
  "participants": {},
  "ouverturePresse": false,
  "odj": {
    "convocationOdj": [
      "Audition de M. Jacques Bessy, Président de l’Adefdromil - Aide aux Victimes, et de Maître Elodie Maumont."
    ],
    "resumeOdj": [
      "audition de M. Jacques Bessy, Président de l’Adefdromil - Aide aux Victimes, et de Maître Elodie Maumont."
    ]
  },
  "formatReunion": "Ordinaire",
  "infosReunionsInternationale": {
    "estReunionInternationale": false
  },
  "captationVideo": false
}