{
  "xsiType": "reunionInitParlementaire_type",
  "uid": "RUANR5L15S2019IDF0128594",
  "timestampDebut": "2019-03-28T09:00:00.000+01:00",
  "timestampFin": "2019-03-28T12:00:00.000+01:00",
  "lieu": {
    "code": "SALREU012",
    "libelleCourt": "Salle N° 23",
    "libelleLong": "Salle N° 23, 3, rue Aristide Briand"
  },
  "cycleDeVie": {
    "etat": "Confirmé",
    "chrono": {
      "creation": "2019-02-25T11:22:15.000+01:00"
    }
  },
  "demandeurs": {
    "acteurs": [
      {
        "nom": "M. Daniel LABARONNE",
        "acteurRef": "PA719798"
      }
    ]
  },
  "typeReunion": "DEP"
}