{
  "xsiType": "reunionCommission_type",
  "uid": "RUANR5L15S2020IDC433991",
  "timestampDebut": "2019-11-12T18:10:00.000+01:00",
  "timestampFin": "2019-11-12T19:10:00.000+01:00",
  "lieu": {
    "libelleLong": "salle 6237"
  },
  "cycleDeVie": {
    "etat": "Confirmé",
    "chrono": {
      "creation": "2019-10-17T00:00:00.000+02:00"
    }
  },
  "organeReuniRef": "PO766497",
  "participants": {
    "participantsInternes": [
      {
        "acteurRef": "PA719146",
        "presence": "absent"
      },
      {
        "acteurRef": "PA721836",
        "presence": "présent"
      },
      {
        "acteurRef": "PA722170",
        "presence": "absent"
      },
      {
        "acteurRef": "PA720430",
        "presence": "absent"
      },
      {
        "acteurRef": "PA719218",
        "presence": "absent"
      },
      {
        "acteurRef": "PA720162",
        "presence": "absent"
      },
      {
        "acteurRef": "PA342601",
        "presence": "absent"
      },
      {
        "acteurRef": "PA607155",
        "presence": "absent"
      },
      {
        "acteurRef": "PA720862",
        "presence": "présent"
      },
      {
        "acteurRef": "PA721142",
        "presence": "absent"
      },
      {
        "acteurRef": "PA1498",
        "presence": "absent"
      },
      {
        "acteurRef": "PA266797",
        "presence": "absent"
      },
      {
        "acteurRef": "PA719330",
        "presence": "présent"
      },
      {
        "acteurRef": "PA721764",
        "presence": "absent"
      },
      {
        "acteurRef": "PA721792",
        "presence": "absent"
      },
      {
        "acteurRef": "PA331835",
        "presence": "absent"
      },
      {
        "acteurRef": "PA332614",
        "presence": "présent"
      },
      {
        "acteurRef": "PA720022",
        "presence": "présent"
      },
      {
        "acteurRef": "PA719850",
        "presence": "présent"
      },
      {
        "acteurRef": "PA721270",
        "presence": "absent"
      },
      {
        "acteurRef": "PA720878",
        "presence": "présent"
      },
      {
        "acteurRef": "PA719350",
        "presence": "présent"
      },
      {
        "acteurRef": "PA721690",
        "presence": "absent"
      },
      {
        "acteurRef": "PA722336",
        "presence": "présent"
      },
      {
        "acteurRef": "PA608695",
        "presence": "présent"
      },
      {
        "acteurRef": "PA718768",
        "presence": "présent"
      },
      {
        "acteurRef": "PA1012",
        "presence": "excusé"
      },
      {
        "acteurRef": "PA719512",
        "presence": "présent"
      },
      {
        "acteurRef": "PA267330",
        "presence": "absent"
      }
    ]
  },
  "ouverturePresse": true,
  "odj": {
    "convocationOdj": [
      "Audition de M. Alain Espinasse, directeur de la modernisation et de l’administration territoriale."
    ],
    "resumeOdj": [
      "audition de M. Alain Espinasse, directeur de la modernisation et de l’administration territoriale."
    ]
  },
  "compteRenduRef": "CRCANR5L15S2020PO766497N006",
  "formatReunion": "Ordinaire",
  "infosReunionsInternationale": {
    "estReunionInternationale": false
  },
  "captationVideo": true
}