{
  "xsiType": "reunionInitParlementaire_type",
  "uid": "RUANR5L15S2019IDF0128737",
  "timestampDebut": "2019-03-05T15:00:00.000+01:00",
  "timestampFin": "2019-03-05T16:30:00.000+01:00",
  "lieu": {
    "code": "SALREU006",
    "libelleCourt": "3ème Bureau",
    "libelleLong": "3ème Bureau, Palais Bourbon"
  },
  "cycleDeVie": {
    "etat": "Confirmé",
    "chrono": {
      "creation": "2019-02-27T11:31:13.000+01:00"
    }
  },
  "demandeurs": {
    "acteurs": [
      {
        "nom": "Mme Frédérique LARDET",
        "acteurRef": "PA721434"
      }
    ]
  },
  "typeReunion": "DEP"
}