{
  "xsiType": "reunionInitParlementaire_type",
  "uid": "RUANR5L15S2019IDF0132171",
  "timestampDebut": "2019-05-09T14:00:00.000+02:00",
  "timestampFin": "2019-05-09T15:00:00.000+02:00",
  "lieu": {
    "code": "SALREU049",
    "libelleCourt": "Salle 6822",
    "libelleLong": "Salle 6822, Palais Bourbon"
  },
  "cycleDeVie": {
    "etat": "Confirmé",
    "chrono": {
      "creation": "2019-04-11T11:37:17.000+02:00"
    }
  },
  "demandeurs": {
    "acteurs": [
      {
        "nom": "M. Stéphane BUCHOU",
        "acteurRef": "PA722000"
      }
    ]
  },
  "typeReunion": "DEP"
}