{
  "xsiType": "seance_type",
  "uid": "RUANR5L15S2018IDS20759",
  "timestampDebut": "2017-11-14T21:30:00.000+01:00",
  "timestampFin": "2017-11-15T01:15:00.000+01:00",
  "lieu": {
    "code": "AN",
    "libelleLong": "Assemblée nationale"
  },
  "cycleDeVie": {
    "etat": "Confirmé",
    "chrono": {
      "creation": "2017-10-18T00:00:00.000+02:00"
    }
  },
  "organeReuniRef": "PO717460",
  "sessionRef": "SCR5A2018O1",
  "ouverturePresse": true,
  "odj": {
    "pointsOdj": [
      {
        "xsiType": "podjSeanceConfPres_type",
        "uid": "RUANR5L15S2018IDS20759PT35299",
        "cycleDeVie": {
          "etat": "Confirmé",
          "chrono": {
            "creation": "2017-11-13T00:00:00.000+01:00"
          }
        },
        "objet": "Lecture définitive du projet de loi de finances rectificative pour 2017 (1)",
        "dossiersLegislatifsRefs": [
          "DLR5L15N36107"
        ],
        "typePointOdj": "Discussion",
        "comiteSecret": false,
        "natureTravauxOdj": "ODJPR"
      },
      {
        "xsiType": "podjSeanceConfPres_type",
        "uid": "RUANR5L15S2018IDS20759PT35217",
        "cycleDeVie": {
          "etat": "Confirmé",
          "chrono": {
            "creation": "2017-10-18T00:00:00.000+02:00"
          }
        },
        "objet": "Suite de la discussion du projet de loi de finances pour 2018 (seconde partie)",
        "dossiersLegislatifsRefs": [
          "DLR5L15N35854"
        ],
        "typePointOdj": "Suite de la discussion",
        "comiteSecret": false,
        "natureTravauxOdj": "ODJPR"
      }
    ]
  },
  "compteRenduRef": "CRSANR5L15S2018O1N054",
  "identifiants": {
    "numSeanceJo": "54",
    "idJo": "20180054",
    "quantieme": "Deuxième",
    "dateSeance": "2017-11-14T01:00:00.000+01:00"
  },
  "captationVideo": true
}