{
  "xsiType": "reunionInitParlementaire_type",
  "uid": "RUANR5L15S2019IDF0132135",
  "timestampDebut": "2019-04-24T14:30:00.000+02:00",
  "timestampFin": "2019-04-24T18:30:00.000+02:00",
  "lieu": {
    "code": "SALREU006",
    "libelleCourt": "3ème Bureau",
    "libelleLong": "3ème Bureau, Palais Bourbon"
  },
  "cycleDeVie": {
    "etat": "Confirmé",
    "chrono": {
      "creation": "2019-04-11T08:57:44.000+02:00"
    }
  },
  "demandeurs": {
    "acteurs": [
      {
        "nom": "M. Philippe LATOMBE",
        "acteurRef": "PA721984"
      }
    ]
  },
  "typeReunion": "DEP"
}