{
  "xsiType": "reunionInitParlementaire_type",
  "uid": "RUANR5L15S2019IDF0131371",
  "timestampDebut": "2019-04-10T09:30:00.000+02:00",
  "timestampFin": "2019-04-10T11:00:00.000+02:00",
  "lieu": {
    "code": "SALREU023",
    "libelleCourt": "Salle 7426",
    "libelleLong": "Salle 7426, 101, rue de l'Université"
  },
  "cycleDeVie": {
    "etat": "Confirmé",
    "chrono": {
      "creation": "2019-04-02T10:19:34.000+02:00"
    }
  },
  "demandeurs": {
    "acteurs": [
      {
        "nom": "Mme Pascale FONTENEL-PERSONNE",
        "acteurRef": "PA721384"
      }
    ]
  },
  "typeReunion": "DEP"
}