{
  "xsiType": "reunionInitParlementaire_type",
  "uid": "RUANR5L15S2020IDF0143510",
  "timestampDebut": "2019-11-13T18:30:00.000+01:00",
  "timestampFin": "2019-11-13T19:30:00.000+01:00",
  "lieu": {
    "code": "SALREU021",
    "libelleCourt": "Salle 7207",
    "libelleLong": "Salle 7207, 101, rue de l'Université"
  },
  "cycleDeVie": {
    "etat": "Confirmé",
    "chrono": {
      "creation": "2019-11-12T09:26:55.000+01:00"
    }
  },
  "demandeurs": {
    "acteurs": [
      {
        "nom": "Mme Danielle BRULEBOIS",
        "acteurRef": "PA719890"
      }
    ]
  },
  "typeReunion": "DEP"
}