{
  "xsiType": "reunionInitParlementaire_type",
  "uid": "RUANR5L15S2018IDF0111001",
  "timestampDebut": "2018-05-16T09:00:00.000+02:00",
  "timestampFin": "2018-05-16T12:30:00.000+02:00",
  "lieu": {
    "code": "SALREU045",
    "libelleCourt": "Sully 3",
    "libelleLong": "Sully 3, Palais Bourbon"
  },
  "cycleDeVie": {
    "etat": "Confirmé",
    "chrono": {
      "creation": "2018-05-03T17:17:46.000+02:00"
    }
  },
  "demandeurs": {
    "acteurs": [
      {
        "nom": "Mme Catherine OSSON",
        "acteurRef": "PA720492"
      }
    ]
  },
  "typeReunion": "DEP"
}