{
  "xsiType": "reunionInitParlementaire_type",
  "uid": "RUANR5L15S2018IDF0112855",
  "timestampDebut": "2018-06-12T11:00:00.000+02:00",
  "timestampFin": "2018-06-12T12:45:00.000+02:00",
  "lieu": {
    "code": "SALREU033",
    "libelleCourt": "6ème Bureau",
    "libelleLong": "6ème Bureau, Palais Bourbon"
  },
  "cycleDeVie": {
    "etat": "Confirmé",
    "chrono": {
      "creation": "2018-06-02T11:09:50.000+02:00"
    }
  },
  "demandeurs": {
    "acteurs": [
      {
        "nom": "M. Olivier VÉRAN",
        "acteurRef": "PA642788"
      }
    ]
  },
  "typeReunion": "DEP"
}