{
  "xsiType": "reunionInitParlementaire_type",
  "uid": "RUANR5L15S2019IDF0136452",
  "timestampDebut": "2019-07-04T14:00:00.000+02:00",
  "timestampFin": "2019-07-04T15:30:00.000+02:00",
  "lieu": {
    "code": "SALREU049",
    "libelleCourt": "Salle 6822",
    "libelleLong": "Salle 6822, Palais Bourbon"
  },
  "cycleDeVie": {
    "etat": "Confirmé",
    "chrono": {
      "creation": "2019-06-27T13:46:45.000+02:00"
    }
  },
  "demandeurs": {
    "acteurs": [
      {
        "nom": "Mme Zivka PARK",
        "acteurRef": "PA720944"
      }
    ]
  },
  "typeReunion": "DEP"
}