{
  "xsiType": "reunionInitParlementaire_type",
  "uid": "RUANR5L15S2019IDF0131958",
  "timestampDebut": "2019-04-15T17:00:00.000+02:00",
  "timestampFin": "2019-04-15T18:00:00.000+02:00",
  "lieu": {
    "code": "SALREU049",
    "libelleCourt": "Salle 6822",
    "libelleLong": "Salle 6822, Palais Bourbon"
  },
  "cycleDeVie": {
    "etat": "Confirmé",
    "chrono": {
      "creation": "2019-04-08T18:49:59.000+02:00"
    }
  },
  "demandeurs": {
    "acteurs": [
      {
        "nom": "Mme Nadia HAI",
        "acteurRef": "PA722054"
      }
    ]
  },
  "typeReunion": "DEP"
}