{
  "xsiType": "reunionInitParlementaire_type",
  "uid": "RUANR5L15S2020IDF0141703",
  "timestampDebut": "2019-10-14T14:00:00.000+02:00",
  "timestampFin": "2019-10-14T15:00:00.000+02:00",
  "lieu": {
    "code": "SALREU049",
    "libelleCourt": "Salle 6822",
    "libelleLong": "Salle 6822, Palais Bourbon"
  },
  "cycleDeVie": {
    "etat": "Confirmé",
    "chrono": {
      "creation": "2019-10-08T15:53:19.000+02:00"
    }
  },
  "demandeurs": {
    "acteurs": [
      {
        "nom": "Mme Sabine RUBIN",
        "acteurRef": "PA721226"
      }
    ]
  },
  "typeReunion": "DEP"
}