{
  "xsiType": "reunionInitParlementaire_type",
  "uid": "RUANR5L15S2019IDF0120839",
  "timestampDebut": "2018-10-16T14:30:00.000+02:00",
  "timestampFin": "2018-10-16T15:00:00.000+02:00",
  "lieu": {
    "code": "SALREU044",
    "libelleCourt": "Sully 2",
    "libelleLong": "Sully 2, Palais Bourbon"
  },
  "cycleDeVie": {
    "etat": "Confirmé",
    "chrono": {
      "creation": "2018-10-16T11:35:09.000+02:00"
    }
  },
  "demandeurs": {
    "acteurs": [
      {
        "nom": "M. Alain DAVID",
        "acteurRef": "PA1008"
      }
    ]
  },
  "typeReunion": "DEP"
}