{
  "xsiType": "reunionCommission_type",
  "uid": "RUANR5L15S2019IDC430693",
  "timestampDebut": "2018-10-31T16:15:00.000+01:00",
  "lieu": {
    "libelleLong": "salle du CEC"
  },
  "cycleDeVie": {
    "etat": "Confirmé",
    "chrono": {
      "creation": "2018-10-26T00:00:00.000+02:00"
    }
  },
  "organeReuniRef": "PO759174",
  "participants": {},
  "ouverturePresse": false,
  "odj": {
    "convocationOdj": [
      "Audition de M. Charles Duchaine, directeur de l'Agence française anticorruption (AFA)."
    ],
    "resumeOdj": [
      "audition de M. Charles Duchaine, directeur de l'Agence française anticorruption (AFA)."
    ]
  },
  "formatReunion": "Ordinaire",
  "infosReunionsInternationale": {
    "estReunionInternationale": false
  },
  "captationVideo": false
}