{
  "xsiType": "reunionInitParlementaire_type",
  "uid": "RUANR5L15S2018IDF0101354",
  "timestampDebut": "2017-12-07T14:00:00.000+01:00",
  "timestampFin": "2017-12-07T15:30:00.000+01:00",
  "lieu": {
    "code": "SALREU049",
    "libelleCourt": "Salle 6822",
    "libelleLong": "Salle 6822, Palais Bourbon"
  },
  "cycleDeVie": {
    "etat": "Confirmé",
    "chrono": {
      "creation": "2017-11-24T10:20:05.000+01:00"
    }
  },
  "demandeurs": {
    "acteurs": [
      {
        "nom": "M. Jean-Carles GRELIER",
        "acteurRef": "PA267318"
      }
    ]
  },
  "typeReunion": "DEP"
}