{
  "xsiType": "reunionInitParlementaire_type",
  "uid": "RUANR5L15S2019IDF0129085",
  "timestampDebut": "2019-04-02T14:00:00.000+02:00",
  "timestampFin": "2019-04-02T15:00:00.000+02:00",
  "lieu": {
    "code": "SALREU017",
    "libelleCourt": "Salon Visconti",
    "libelleLong": "Salon Visconti, 101, rue de l'Université"
  },
  "cycleDeVie": {
    "etat": "Confirmé",
    "chrono": {
      "creation": "2019-03-05T15:39:48.000+01:00"
    }
  },
  "demandeurs": {
    "acteurs": [
      {
        "nom": "M. Thomas GASSILLOUD",
        "acteurRef": "PA722358"
      }
    ]
  },
  "typeReunion": "DEP"
}