{
  "xsiType": "reunionCommission_type",
  "uid": "RUANR5L15S2018IDC427738",
  "timestampDebut": "2017-11-09T10:30:00.000+01:00",
  "lieu": {
    "libelleLong": "salle 6238 (Affaires culturelles)"
  },
  "cycleDeVie": {
    "etat": "Confirmé",
    "chrono": {
      "creation": "2017-11-06T00:00:00.000+01:00"
    }
  },
  "organeReuniRef": "PO738117",
  "participants": {},
  "ouverturePresse": true,
  "odj": {
    "convocationOdj": [
      "Audition de M. Fernand Gontier, directeur central de la police aux frontières, et de Mme Brigitte Lafourcade, directrice centrale adjointe"
    ],
    "resumeOdj": [
      "audition de M. Fernand Gontier, directeur central de la police aux frontières, et de Mme Brigitte Lafourcade, directrice centrale adjointe."
    ]
  },
  "formatReunion": "Ordinaire",
  "infosReunionsInternationale": {
    "estReunionInternationale": false
  },
  "captationVideo": false
}