{
  "xsiType": "reunionInitParlementaire_type",
  "uid": "RUANR5L15S2020IDF0142761",
  "timestampDebut": "2019-10-29T18:00:00.000+01:00",
  "timestampFin": "2019-10-29T19:15:00.000+01:00",
  "lieu": {
    "code": "SALREU048",
    "libelleCourt": "Salle 6809",
    "libelleLong": "Salle 6809, Palais Bourbon"
  },
  "cycleDeVie": {
    "etat": "Confirmé",
    "chrono": {
      "creation": "2019-10-25T16:49:46.000+02:00"
    }
  },
  "demandeurs": {
    "acteurs": [
      {
        "nom": "Mme Yolaine DE COURSON",
        "acteurRef": "PA719194"
      }
    ]
  },
  "typeReunion": "DEP"
}