{
  "xsiType": "reunionInitParlementaire_type",
  "uid": "RUANR5L15S2019IDF0135817",
  "timestampDebut": "2019-06-25T19:00:00.000+02:00",
  "timestampFin": "2019-06-25T20:00:00.000+02:00",
  "lieu": {
    "code": "SALREU016",
    "libelleCourt": "Salon Gabriel",
    "libelleLong": "Salon Gabriel, 101, rue de l'Université"
  },
  "cycleDeVie": {
    "etat": "Confirmé",
    "chrono": {
      "creation": "2019-06-18T12:45:38.000+02:00"
    }
  },
  "demandeurs": {
    "acteurs": [
      {
        "nom": "Mme Cathy RACON-BOUZON",
        "acteurRef": "PA718944"
      }
    ]
  },
  "typeReunion": "DEP"
}