{
  "xsiType": "reunionInitParlementaire_type",
  "uid": "RUANR5L15S2018IDF0102230",
  "timestampDebut": "2017-12-19T14:30:00.000+01:00",
  "timestampFin": "2017-12-19T15:30:00.000+01:00",
  "lieu": {
    "code": "SALREU044",
    "libelleCourt": "Sully 2",
    "libelleLong": "Sully 2, Palais Bourbon"
  },
  "cycleDeVie": {
    "etat": "Confirmé",
    "chrono": {
      "creation": "2017-12-13T10:51:12.000+01:00"
    }
  },
  "demandeurs": {
    "acteurs": [
      {
        "nom": "M. Jacques MAIRE",
        "acteurRef": "PA722178"
      }
    ]
  },
  "typeReunion": "DEP"
}