{
  "xsiType": "reunionInitParlementaire_type",
  "uid": "RUANR5L15S2018IDF0104723",
  "timestampDebut": "2018-04-04T16:30:00.000+02:00",
  "timestampFin": "2018-04-04T17:15:00.000+02:00",
  "lieu": {
    "code": "SALREU028",
    "libelleCourt": "Salle Colbert",
    "libelleLong": "Salle Colbert , Palais Bourbon"
  },
  "cycleDeVie": {
    "etat": "Confirmé",
    "chrono": {
      "creation": "2018-01-30T17:21:15.000+01:00"
    }
  },
  "demandeurs": {
    "acteurs": [
      {
        "nom": "Mme Frédérique TUFFNELL",
        "acteurRef": "PA719092"
      }
    ]
  },
  "typeReunion": "DEP"
}