{
  "xsiType": "reunionInitParlementaire_type",
  "uid": "RUANR5L15S2018IDF0116344",
  "timestampDebut": "2018-08-02T17:00:00.000+02:00",
  "timestampFin": "2018-08-02T20:00:00.000+02:00",
  "lieu": {
    "code": "SALREU049",
    "libelleCourt": "Salle 6822",
    "libelleLong": "Salle 6822, Palais Bourbon"
  },
  "cycleDeVie": {
    "etat": "Confirmé",
    "chrono": {
      "creation": "2018-07-27T10:52:19.000+02:00"
    }
  },
  "demandeurs": {
    "acteurs": [
      {
        "nom": "M. Jean-Noël BARROT",
        "acteurRef": "PA721836"
      }
    ]
  },
  "typeReunion": "DEP"
}