{
  "xsiType": "reunionInitParlementaire_type",
  "uid": "RUANR5L15S2019IDF0136314",
  "timestampDebut": "2019-06-26T17:00:00.000+02:00",
  "timestampFin": "2019-06-26T18:00:00.000+02:00",
  "lieu": {
    "code": "SALREU022",
    "libelleCourt": "Salle 7326",
    "libelleLong": "Salle 7326, 101, rue de l'Université"
  },
  "cycleDeVie": {
    "etat": "Confirmé",
    "chrono": {
      "creation": "2019-06-26T12:39:45.000+02:00"
    }
  },
  "demandeurs": {
    "acteurs": [
      {
        "nom": "M. Jean François MBAYE",
        "acteurRef": "PA720870"
      }
    ]
  },
  "typeReunion": "DEP"
}