{
  "xsiType": "reunionInitParlementaire_type",
  "uid": "RUANR5L15S2018IDF0101959",
  "timestampDebut": "2017-12-19T16:00:00.000+01:00",
  "timestampFin": "2017-12-19T20:00:00.000+01:00",
  "lieu": {
    "code": "SALREU038",
    "libelleCourt": "Salle 6549",
    "libelleLong": "Salle 6549, Palais Bourbon"
  },
  "cycleDeVie": {
    "etat": "Confirmé",
    "chrono": {
      "creation": "2017-12-06T13:16:55.000+01:00"
    }
  },
  "demandeurs": {
    "acteurs": [
      {
        "nom": "M. Pierre DHARRÉVILLE",
        "acteurRef": "PA718926"
      }
    ]
  },
  "typeReunion": "DEP"
}