{
  "xsiType": "reunionInitParlementaire_type",
  "uid": "RUANR5L15S2018IDF0105397",
  "timestampDebut": "2018-09-27T13:00:00.000+02:00",
  "timestampFin": "2018-09-27T18:00:00.000+02:00",
  "lieu": {
    "code": "SALREU028",
    "libelleCourt": "Salle Colbert",
    "libelleLong": "Salle Colbert , Palais Bourbon"
  },
  "cycleDeVie": {
    "etat": "Confirmé",
    "chrono": {
      "creation": "2018-02-08T11:56:06.000+01:00"
    }
  },
  "demandeurs": {
    "acteurs": [
      {
        "nom": "M. Jean-Louis TOURAINE",
        "acteurRef": "PA334768"
      }
    ]
  },
  "typeReunion": "DEP"
}