{
  "xsiType": "reunionInitParlementaire_type",
  "uid": "RUANR5L15S2019IDF0121169",
  "timestampDebut": "2018-11-20T09:00:00.000+01:00",
  "timestampFin": "2018-11-20T11:00:00.000+01:00",
  "lieu": {
    "code": "SALREU012",
    "libelleCourt": "Salle N° 23",
    "libelleLong": "Salle N° 23, 3, rue Aristide Briand"
  },
  "cycleDeVie": {
    "etat": "Confirmé",
    "chrono": {
      "creation": "2018-10-22T16:07:41.000+02:00"
    }
  },
  "demandeurs": {
    "acteurs": [
      {
        "nom": "M. Florent BOUDIÉ",
        "acteurRef": "PA606507"
      }
    ]
  },
  "typeReunion": "DEP"
}