{
  "xsiType": "reunionInitParlementaire_type",
  "uid": "RUANR5L15S2020IDF0142383",
  "timestampDebut": "2019-11-05T14:00:00.000+01:00",
  "timestampFin": "2019-11-05T15:00:00.000+01:00",
  "lieu": {
    "code": "SALREU016",
    "libelleCourt": "Salon Gabriel",
    "libelleLong": "Salon Gabriel, 101, rue de l'Université"
  },
  "cycleDeVie": {
    "etat": "Confirmé",
    "chrono": {
      "creation": "2019-10-18T17:01:14.000+02:00"
    }
  },
  "demandeurs": {
    "acteurs": [
      {
        "nom": "M. Arnaud VIALA",
        "acteurRef": "PA709315"
      }
    ]
  },
  "typeReunion": "DEP"
}