{
  "xsiType": "seance_type",
  "uid": "RUSNR5L15S2019IDS21477",
  "timestampDebut": "2019-01-16T14:30:00.000+01:00",
  "timestampFin": "2019-01-16T19:25:00.000+01:00",
  "lieu": {
    "code": "S",
    "libelleLong": "Sénat"
  },
  "cycleDeVie": {
    "etat": "Confirmé",
    "chrono": {
      "creation": "2018-12-19T00:00:00.000+01:00"
    }
  },
  "organeReuniRef": "PO78718",
  "sessionRef": "SCR5A2019O1",
  "ouverturePresse": true,
  "odj": {},
  "compteRenduRef": "CRSSNR5S2019IDS20190116",
  "identifiants": {
    "numSeanceJo": "48",
    "idJo": "20190048",
    "quantieme": "Unique",
    "dateSeance": "2019-01-16T01:00:00.000+01:00"
  },
  "captationVideo": true
}