{
  "xsiType": "reunionCommission_type",
  "uid": "RUANR5L15S2019IDC433176",
  "timestampDebut": "2019-07-03T16:15:00.000+02:00",
  "lieu": {
    "libelleLong": "salle 5178 - 1er étage de la vice-présidence"
  },
  "cycleDeVie": {
    "etat": "Confirmé",
    "chrono": {
      "creation": "2019-06-19T00:00:00.000+02:00"
    }
  },
  "organeReuniRef": "PO732735",
  "participants": {},
  "ouverturePresse": false,
  "odj": {
    "convocationOdj": [
      "Réunion du Bureau chargée des activités internationales"
    ],
    "resumeOdj": [
      "Réunion du Bureau chargée des activités internationales"
    ]
  },
  "formatReunion": "Ordinaire",
  "infosReunionsInternationale": {
    "estReunionInternationale": false
  },
  "captationVideo": false
}