{
  "xsiType": "reunionInitParlementaire_type",
  "uid": "RUANR5L15S2019IDF0136134",
  "timestampDebut": "2019-07-03T11:30:00.000+02:00",
  "timestampFin": "2019-07-03T12:30:00.000+02:00",
  "lieu": {
    "code": "SALREU048",
    "libelleCourt": "Salle 6809",
    "libelleLong": "Salle 6809, Palais Bourbon"
  },
  "cycleDeVie": {
    "etat": "Confirmé",
    "chrono": {
      "creation": "2019-06-24T14:23:45.000+02:00"
    }
  },
  "demandeurs": {
    "acteurs": [
      {
        "nom": "M. Cédric ROUSSEL",
        "acteurRef": "PA718902"
      }
    ]
  },
  "typeReunion": "DEP"
}