{
  "xsiType": "reunionInitParlementaire_type",
  "uid": "RUANR5L15S2020IDF0142444",
  "timestampDebut": "2019-10-23T11:30:00.000+02:00",
  "timestampFin": "2019-10-23T12:30:00.000+02:00",
  "lieu": {
    "code": "SALREU045",
    "libelleCourt": "Sully 3",
    "libelleLong": "Sully 3, Palais Bourbon"
  },
  "cycleDeVie": {
    "etat": "Confirmé",
    "chrono": {
      "creation": "2019-10-21T14:49:09.000+02:00"
    }
  },
  "demandeurs": {
    "acteurs": [
      {
        "nom": "M. Erwan BALANANT",
        "acteurRef": "PA719558"
      }
    ]
  },
  "typeReunion": "DEP"
}