{
  "xsiType": "reunionCommission_type",
  "uid": "RUANR5L15S2019IDC430548",
  "timestampDebut": "2018-10-11T14:00:00.000+02:00",
  "lieu": {
    "libelleLong": "6e Bureau"
  },
  "cycleDeVie": {
    "etat": "Confirmé",
    "chrono": {
      "creation": "2018-10-05T00:00:00.000+02:00"
    }
  },
  "organeReuniRef": "PO759174",
  "participants": {},
  "ouverturePresse": true,
  "odj": {
    "convocationOdj": [
      "Table ronde, ouverte à la presse, \" L'efficacité de la lutte contre la délinquance financière menée par l'État : diversité des acteurs, moyens déployés, portée des sanctions \", avec :",
      "M. Éric Alt, vice-président d'Anticor, accompagné de Mme Beverly Zehia, juriste ;",
      "M. Dominique Plihon, porte-parole d'Attac ;",
      "Mme Manon Aubry, responsable de plaidoyer Justice fiscale & inégalités d'Oxfam France ;",
      "Mme Laura Rousseau, responsable du pôle Flux financiers illicites de Sherpa ;",
      "Mme Elsa Foucraut, responsable du plaidoyer vie publique de Transparency International."
    ],
    "resumeOdj": [
      "table ronde, ouverte à la presse, \" L'efficacité de la lutte contre la délinquance financière menée par l'État : diversité des acteurs, moyens déployés, portée des sanctions \", avec :",
      "M. Éric Alt, vice-président d'Anticor, accompagné de Mme Beverly Zehia, juriste ;",
      "M. Dominique Plihon, porte-parole d'Attac ;",
      "Mme Manon Aubry, responsable de plaidoyer Justice fiscale & inégalités d'Oxfam France ;",
      "Mme Laura Rousseau, responsable du pôle Flux financiers illicites de Sherpa ;",
      "Mme Elsa Foucraut, responsable du plaidoyer vie publique de Transparency International."
    ]
  },
  "formatReunion": "Ordinaire",
  "infosReunionsInternationale": {
    "estReunionInternationale": false
  },
  "captationVideo": false
}