{
  "xsiType": "reunionInitParlementaire_type",
  "uid": "RUANR5L15S2019IDF0137312",
  "timestampDebut": "2019-07-11T15:30:00.000+02:00",
  "timestampFin": "2019-07-11T16:30:00.000+02:00",
  "lieu": {
    "code": "SALREU048",
    "libelleCourt": "Salle 6809",
    "libelleLong": "Salle 6809, Palais Bourbon"
  },
  "cycleDeVie": {
    "etat": "Confirmé",
    "chrono": {
      "creation": "2019-07-11T14:29:13.000+02:00"
    }
  },
  "demandeurs": {
    "acteurs": [
      {
        "nom": "M. Daniel FASQUELLE",
        "acteurRef": "PA334149"
      }
    ]
  },
  "typeReunion": "DEP"
}