{
  "xsiType": "seance_type",
  "uid": "RUANR5L15S2019IDS21317",
  "timestampDebut": "2018-10-30T15:00:00.000+01:00",
  "lieu": {
    "code": "AN",
    "libelleLong": "Assemblée nationale"
  },
  "cycleDeVie": {
    "etat": "Supprimé",
    "chrono": {
      "creation": "2018-10-02T00:00:00.000+02:00",
      "cloture": "2018-10-02T00:00:00.000+02:00"
    }
  },
  "organeReuniRef": "PO717460",
  "sessionRef": "SCR5A2019O1",
  "ouverturePresse": true,
  "odj": {
    "pointsOdj": [
      {
        "xsiType": "podjSeanceConfPres_type",
        "uid": "RUANR5L15S2019IDS21317PT36410",
        "cycleDeVie": {
          "etat": "Supprimé",
          "chrono": {
            "creation": "2018-10-02T00:00:00.000+02:00",
            "cloture": "2018-10-02T00:00:00.000+02:00"
          }
        },
        "objet": "Suite de la discussion du projet de loi de finances pour 2019 (seconde partie)",
        "typePointOdj": "Suite de la discussion",
        "comiteSecret": false,
        "natureTravauxOdj": "ODJPR"
      }
    ]
  },
  "identifiants": {
    "quantieme": "Première",
    "dateSeance": "2018-10-30T01:00:00.000+01:00"
  },
  "captationVideo": true
}