{
  "xsiType": "reunionInitParlementaire_type",
  "uid": "RUANR5L15S2020IDF0141923",
  "timestampDebut": "2019-12-11T08:30:00.000+01:00",
  "timestampFin": "2019-12-11T13:00:00.000+01:00",
  "lieu": {
    "code": "SALREU003",
    "libelleCourt": "Salle Victor Hugo",
    "libelleLong": "Salle Victor Hugo, 101, rue de l'Université"
  },
  "cycleDeVie": {
    "etat": "Confirmé",
    "chrono": {
      "creation": "2019-10-11T10:43:59.000+02:00"
    }
  },
  "demandeurs": {
    "acteurs": [
      {
        "nom": "M. Jean-Baptiste MOREAU",
        "acteurRef": "PA719242"
      }
    ]
  },
  "typeReunion": "DEP"
}