{
  "xsiType": "reunionInitParlementaire_type",
  "uid": "RUANR5L15S2019IDF0134444",
  "timestampDebut": "2019-06-13T14:30:00.000+02:00",
  "timestampFin": "2019-06-13T16:00:00.000+02:00",
  "lieu": {
    "code": "SALREU048",
    "libelleCourt": "Salle 6809",
    "libelleLong": "Salle 6809, Palais Bourbon"
  },
  "cycleDeVie": {
    "etat": "Confirmé",
    "chrono": {
      "creation": "2019-05-23T16:44:54.000+02:00"
    }
  },
  "demandeurs": {
    "acteurs": [
      {
        "nom": "M. Mustapha LAABID",
        "acteurRef": "PA719842"
      }
    ]
  },
  "typeReunion": "DEP"
}