{
  "xsiType": "reunionInitParlementaire_type",
  "uid": "RUANR5L15S2018IDF0116373",
  "timestampDebut": "2018-08-01T16:00:00.000+02:00",
  "timestampFin": "2018-08-01T17:00:00.000+02:00",
  "lieu": {
    "code": "SALREU008",
    "libelleCourt": "5ème Bureau",
    "libelleLong": "5ème Bureau, Palais Bourbon"
  },
  "cycleDeVie": {
    "etat": "Confirmé",
    "chrono": {
      "creation": "2018-07-27T15:16:04.000+02:00"
    }
  },
  "demandeurs": {
    "acteurs": [
      {
        "nom": "M. Pascal BOIS",
        "acteurRef": "PA720576"
      }
    ]
  },
  "typeReunion": "DEP"
}