{
  "xsiType": "reunionInitParlementaire_type",
  "uid": "RUANR5L15S2019IDF0136691",
  "timestampDebut": "2019-07-04T14:30:00.000+02:00",
  "timestampFin": "2019-07-04T14:45:00.000+02:00",
  "lieu": {
    "code": "SALREU029",
    "libelleCourt": "Salon Mars III",
    "libelleLong": "Salon Mars III, 101, rue de l'Université"
  },
  "cycleDeVie": {
    "etat": "Annulé",
    "chrono": {
      "creation": "2019-07-02T16:38:18.000+02:00",
      "cloture": "2019-07-04T10:02:28.000+02:00"
    }
  },
  "demandeurs": {
    "acteurs": [
      {
        "nom": "M. Olivier SERVA",
        "acteurRef": "PA720960"
      }
    ]
  },
  "typeReunion": "DEP"
}