{
  "xsiType": "reunionInitParlementaire_type",
  "uid": "RUANR5L15S2020IDF0139993",
  "timestampDebut": "2019-10-02T16:30:00.000+02:00",
  "timestampFin": "2019-10-02T19:30:00.000+02:00",
  "lieu": {
    "code": "SALREU014",
    "libelleCourt": "Salle 7042",
    "libelleLong": "Salle 7042, 103, rue de l'Université"
  },
  "cycleDeVie": {
    "etat": "Confirmé",
    "chrono": {
      "creation": "2019-09-13T13:08:44.000+02:00"
    }
  },
  "demandeurs": {
    "acteurs": [
      {
        "nom": "M. Jean-Louis MASSON",
        "acteurRef": "PA346218"
      }
    ]
  },
  "typeReunion": "DEP"
}