{
  "xsiType": "reunionInitParlementaire_type",
  "uid": "RUANR5L15S2018IDF0113901",
  "timestampDebut": "2018-06-20T17:30:00.000+02:00",
  "timestampFin": "2018-06-20T18:30:00.000+02:00",
  "lieu": {
    "code": "SALREU021",
    "libelleCourt": "Salle 7207",
    "libelleLong": "Salle 7207, 101, rue de l'Université"
  },
  "cycleDeVie": {
    "etat": "Confirmé",
    "chrono": {
      "creation": "2018-06-18T12:54:24.000+02:00"
    }
  },
  "demandeurs": {
    "acteurs": [
      {
        "nom": "Mme Frédérique LARDET",
        "acteurRef": "PA721434"
      }
    ]
  },
  "typeReunion": "DEP"
}