{
  "xsiType": "reunionInitParlementaire_type",
  "uid": "RUANR5L15S2018IDF0110848",
  "timestampDebut": "2018-05-22T09:30:00.000+02:00",
  "timestampFin": "2018-05-22T10:30:00.000+02:00",
  "lieu": {
    "code": "SALREU010",
    "libelleCourt": "Salle N° 1",
    "libelleLong": "Salle N° 1, 3, rue Aristide Briand"
  },
  "cycleDeVie": {
    "etat": "Confirmé",
    "chrono": {
      "creation": "2018-04-27T18:10:15.000+02:00"
    }
  },
  "demandeurs": {
    "acteurs": [
      {
        "nom": "Mme Sophie PANONACLE",
        "acteurRef": "PA719632"
      }
    ]
  },
  "typeReunion": "DEP"
}