{
  "xsiType": "reunionInitParlementaire_type",
  "uid": "RUANR5L15S2019IDF0114842",
  "timestampDebut": "2018-11-20T09:30:00.000+01:00",
  "timestampFin": "2018-11-20T12:00:00.000+01:00",
  "lieu": {
    "code": "SALREU022",
    "libelleCourt": "Salle 7326",
    "libelleLong": "Salle 7326, 101, rue de l'Université"
  },
  "cycleDeVie": {
    "etat": "Confirmé",
    "chrono": {
      "creation": "2018-07-03T16:44:03.000+02:00"
    }
  },
  "demandeurs": {
    "organe": {
      "nom": "GROUPE LA FRANCE INSOUMISE",
      "organeRef": "PO730958"
    }
  },
  "organeReuniRef": "PO730958",
  "typeReunion": "GP"
}