{
  "xsiType": "reunionInitParlementaire_type",
  "uid": "RUANR5L15S2019IDF0136026",
  "timestampDebut": "2019-07-03T08:00:00.000+02:00",
  "timestampFin": "2019-07-03T09:00:00.000+02:00",
  "lieu": {
    "code": "SALREU019",
    "libelleCourt": "Salon Mars I",
    "libelleLong": "Salon Mars I, 101, rue de l'Université"
  },
  "cycleDeVie": {
    "etat": "Confirmé",
    "chrono": {
      "creation": null
    }
  },
  "demandeurs": {
    "acteurs": [
      {
        "nom": "M. Dominique POTIER",
        "acteurRef": "PA607553"
      }
    ]
  },
  "typeReunion": "DEP"
}