{
  "xsiType": "reunionInitParlementaire_type",
  "uid": "RUANR5L15S2019IDF0131317",
  "timestampDebut": "2019-04-11T11:30:00.000+02:00",
  "timestampFin": "2019-04-11T12:30:00.000+02:00",
  "lieu": {
    "code": "SALREU017",
    "libelleCourt": "Salon Visconti",
    "libelleLong": "Salon Visconti, 101, rue de l'Université"
  },
  "cycleDeVie": {
    "etat": "Confirmé",
    "chrono": {
      "creation": "2019-04-01T15:36:25.000+02:00"
    }
  },
  "demandeurs": {
    "acteurs": [
      {
        "nom": "M. Yannick HAURY",
        "acteurRef": "PA720054"
      }
    ]
  },
  "typeReunion": "DEP"
}