{
  "xsiType": "reunionCommission_type",
  "uid": "RUANR5L15S2019IDC432245",
  "timestampDebut": "2019-05-07T16:30:00.000+02:00",
  "lieu": {
    "libelleLong": "salle 6242 (Lois)"
  },
  "cycleDeVie": {
    "etat": "Supprimé",
    "chrono": {
      "creation": "2019-04-04T00:00:00.000+02:00",
      "cloture": "2019-04-11T00:00:00.000+02:00"
    }
  },
  "organeReuniRef": "PO59051",
  "participants": {},
  "ouverturePresse": false,
  "odj": {
    "convocationOdj": [
      "Examen pour avis du projet de loi, adopté par le Sénat, d’orientation des mobilités (n° 1831) (M. Guillaume Vuilletet, rapporteur)"
    ],
    "resumeOdj": [
      "examen pour avis du projet de loi, adopté par le Sénat, d’orientation des mobilités (n° 1831)"
    ]
  },
  "formatReunion": "Ordinaire",
  "infosReunionsInternationale": {
    "estReunionInternationale": false
  },
  "captationVideo": false
}