{
  "xsiType": "reunionInitParlementaire_type",
  "uid": "RUANR5L15S2017IDF0094351",
  "timestampDebut": "2017-07-20T11:00:00.000+02:00",
  "timestampFin": "2017-07-20T12:30:00.000+02:00",
  "lieu": {
    "code": "SALREU013",
    "libelleCourt": "Salle N° 3",
    "libelleLong": "Salle N° 3, 3, rue Aristide Briand"
  },
  "cycleDeVie": {
    "etat": "Confirmé",
    "chrono": {
      "creation": "2017-07-19T12:12:10.000+02:00"
    }
  },
  "demandeurs": {
    "acteurs": [
      {
        "nom": "M. Ludovic PAJOT",
        "acteurRef": "PA720606"
      }
    ]
  },
  "typeReunion": "DEP"
}