{
  "xsiType": "seance_type",
  "uid": "RUANR5L15S2017IDS20605",
  "timestampDebut": "2017-07-06T09:30:00.000+02:00",
  "timestampFin": "2017-07-06T13:10:00.000+02:00",
  "lieu": {
    "code": "AN",
    "libelleLong": "Assemblée nationale"
  },
  "cycleDeVie": {
    "etat": "Confirmé",
    "chrono": {
      "creation": "2017-06-28T00:00:00.000+02:00"
    }
  },
  "organeReuniRef": "PO717460",
  "sessionRef": "SCR5A2017E1",
  "ouverturePresse": true,
  "odj": {
    "pointsOdj": [
      {
        "xsiType": "podjSeanceConfPres_type",
        "uid": "RUANR5L15S2017IDS20605PT34918",
        "cycleDeVie": {
          "etat": "Confirmé",
          "chrono": {
            "creation": "2017-06-28T00:00:00.000+02:00"
          }
        },
        "objet": "Discussion du projet de loi , adopté, par le Sénat après engagement de la procédure accélérée, prorogeant l'application de la loi n° 55-385 du 3 avril 1955 relative à l'état d'urgence",
        "dossiersLegislatifsRefs": [
          "DLR5L15N35829"
        ],
        "typePointOdj": "Discussion",
        "comiteSecret": false,
        "natureTravauxOdj": "ODJPR"
      }
    ]
  },
  "compteRenduRef": "CRSANR5L15S2017E1N003",
  "identifiants": {
    "numSeanceJo": "3",
    "idJo": "20171003",
    "quantieme": "Première",
    "dateSeance": "2017-07-06T02:00:00.000+02:00"
  },
  "captationVideo": true
}