{
  "xsiType": "reunionCommission_type",
  "uid": "RUANR5L15S2018IDC428139",
  "timestampDebut": "2017-12-19T17:25:00.000+01:00",
  "timestampFin": "2017-12-19T19:05:00.000+01:00",
  "lieu": {
    "libelleLong": "salle 4223 - 33 rue Saint-Dominique, 2ème étage"
  },
  "cycleDeVie": {
    "etat": "Confirmé",
    "chrono": {
      "creation": "2017-12-15T00:00:00.000+01:00"
    }
  },
  "organeReuniRef": "PO59047",
  "participants": {
    "participantsInternes": [
      {
        "acteurRef": "PA588884",
        "presence": "excusé"
      },
      {
        "acteurRef": "PA642724",
        "presence": "absent"
      },
      {
        "acteurRef": "PA719218",
        "presence": "absent"
      },
      {
        "acteurRef": "PA721344",
        "presence": "absent"
      },
      {
        "acteurRef": "PA719032",
        "presence": "présent"
      },
      {
        "acteurRef": "PA330684",
        "presence": "absent"
      },
      {
        "acteurRef": "PA721118",
        "presence": "excusé"
      },
      {
        "acteurRef": "PA719496",
        "presence": "présent"
      },
      {
        "acteurRef": "PA721166",
        "presence": "absent"
      },
      {
        "acteurRef": "PA719448",
        "presence": "présent"
      },
      {
        "acteurRef": "PA719294",
        "presence": "présent"
      },
      {
        "acteurRef": "PA718850",
        "presence": "absent"
      },
      {
        "acteurRef": "PA998",
        "presence": "absent"
      },
      {
        "acteurRef": "PA1008",
        "presence": "présent"
      },
      {
        "acteurRef": "PA1029",
        "presence": "absent"
      },
      {
        "acteurRef": "PA720862",
        "presence": "absent"
      },
      {
        "acteurRef": "PA720438",
        "presence": "présent"
      },
      {
        "acteurRef": "PA722382",
        "presence": "absent"
      },
      {
        "acteurRef": "PA1198",
        "presence": "excusé"
      },
      {
        "acteurRef": "PA720684",
        "presence": "présent"
      },
      {
        "acteurRef": "PA1206",
        "presence": "absent"
      },
      {
        "acteurRef": "PA1276",
        "presence": "présent"
      },
      {
        "acteurRef": "PA722284",
        "presence": "absent"
      },
      {
        "acteurRef": "PA720806",
        "presence": "présent"
      },
      {
        "acteurRef": "PA721024",
        "presence": "excusé"
      },
      {
        "acteurRef": "PA720222",
        "presence": "excusé"
      },
      {
        "acteurRef": "PA718674",
        "presence": "présent"
      },
      {
        "acteurRef": "PA1498",
        "presence": "absent"
      },
      {
        "acteurRef": "PA610775",
        "presence": "excusé"
      },
      {
        "acteurRef": "PA695100",
        "presence": "excusé"
      },
      {
        "acteurRef": "PA1630",
        "presence": "absent"
      },
      {
        "acteurRef": "PA333818",
        "presence": "présent"
      },
      {
        "acteurRef": "PA267801",
        "presence": "absent"
      },
      {
        "acteurRef": "PA719210",
        "presence": "présent"
      },
      {
        "acteurRef": "PA722344",
        "presence": "excusé"
      },
      {
        "acteurRef": "PA721644",
        "presence": "présent"
      },
      {
        "acteurRef": "PA720202",
        "presence": "absent"
      },
      {
        "acteurRef": "PA721004",
        "presence": "excusé"
      },
      {
        "acteurRef": "PA1809",
        "presence": "excusé"
      },
      {
        "acteurRef": "PA335612",
        "presence": "présent"
      },
      {
        "acteurRef": "PA722008",
        "presence": "absent"
      },
      {
        "acteurRef": "PA721450",
        "presence": "absent"
      },
      {
        "acteurRef": "PA720342",
        "presence": "excusé"
      },
      {
        "acteurRef": "PA720614",
        "presence": "excusé"
      },
      {
        "acteurRef": "PA1960",
        "presence": "excusé"
      },
      {
        "acteurRef": "PA722178",
        "presence": "présent"
      },
      {
        "acteurRef": "PA334116",
        "presence": "excusé"
      },
      {
        "acteurRef": "PA720146",
        "presence": "présent"
      },
      {
        "acteurRef": "PA720870",
        "presence": "présent"
      },
      {
        "acteurRef": "PA2150",
        "presence": "excusé"
      },
      {
        "acteurRef": "PA720370",
        "presence": "absent"
      },
      {
        "acteurRef": "PA719130",
        "presence": "présent"
      },
      {
        "acteurRef": "PA719464",
        "presence": "absent"
      },
      {
        "acteurRef": "PA721486",
        "presence": "absent"
      },
      {
        "acteurRef": "PA721956",
        "presence": "présent"
      },
      {
        "acteurRef": "PA721182",
        "presence": "présent"
      },
      {
        "acteurRef": "PA267260",
        "presence": "présent"
      },
      {
        "acteurRef": "PA719528",
        "presence": "absent"
      },
      {
        "acteurRef": "PA2492",
        "presence": "présent"
      },
      {
        "acteurRef": "PA720552",
        "presence": "absent"
      },
      {
        "acteurRef": "PA2529",
        "presence": "absent"
      },
      {
        "acteurRef": "PA721824",
        "presence": "excusé"
      },
      {
        "acteurRef": "PA330788",
        "presence": "absent"
      },
      {
        "acteurRef": "PA720138",
        "presence": "excusé"
      },
      {
        "acteurRef": "PA717151",
        "presence": "présent"
      },
      {
        "acteurRef": "PA721174",
        "presence": "absent"
      },
      {
        "acteurRef": "PA722118",
        "presence": "présent"
      },
      {
        "acteurRef": "PA267794",
        "presence": "excusé"
      },
      {
        "acteurRef": "PA721690",
        "presence": "excusé"
      },
      {
        "acteurRef": "PA719550",
        "presence": "présent"
      },
      {
        "acteurRef": "PA2796",
        "presence": "absent"
      },
      {
        "acteurRef": "PA720830",
        "presence": "présent"
      },
      {
        "acteurRef": "PA720746",
        "presence": "excusé"
      }
    ]
  },
  "ouverturePresse": true,
  "odj": {
    "convocationOdj": [
      "Audition, ouverte à la presse, de M. Laurent Bonnefoy, chercheur CNRS au CERI-Sciences Po., de Mme Liny Suharlim, directrice Pays Yémen de l'ONG ACTED, et de Mme Rasha Mohamed, chercheuse Yémen, Amnesty International, sur la situation au Yémen.",
      "Nomination de rapporteurs sur les projets de loi suivants :",
      "·projet de loi autorisant la ratification du protocole n° 16 à la convention de sauvegarde des droits de l'homme et des libertés fondamentales (sous réserve de son dépôt) ;",
      "·projet de loi autorisant l'approbation de l'accord entre le Gouvernement de la République française et le Gouvernement de la Principauté d'Andorre concernant l'amélioration de la viabilité des routes nationales 20, 320 et 22 entre Tarascon-sur-Ariège et la frontière franco-andorrane (sous réserve de son dépôt) ;",
      "·projet de loi autorisant l'approbation de l'accord-cadre sur la coopération sanitaire transfrontalière entre le Gouvernement de la République française et le Conseil fédéral suisse et de l'accord-cadre entre le Gouvernement de la République française et le Gouvernement du Grand-Duché de Luxembourg sur la coopération sanitaire transfrontalière (n° 390) ;",
      "·projet de loi autorisant l'approbation de la convention d'extradition entre le Gouvernement de la République française et le Gouvernement du Royaume du Cambodge (n° 323) ;",
      "·projet de loi, adopté par le Sénat, autorisant la ratification de l'accord de transport aérien entre les États-Unis d'Amérique, premièrement, l'Union européenne et ses États membres, deuxièmement, l'Islande, troisièmement, et le Royaume de Norvège, quatrièmement (n° 375) ;",
      "·projet de loi, adopté par le Sénat, autorisant la ratification de l'accord euro-méditerranéen relatif aux services aériens entre l'Union européenne et ses Etats membres, d'une part, et le Gouvernement de l'Etat d'Israël, d'autre part (n° 374) ;",
      "·projet de loi, adopté par le Sénat, autorisant l'approbation de la convention d'extradition signée le 2 mai 2007 entre le Gouvernement de la République française et le Gouvernement de l'État des Émirats arabes unis (n° 162) ;",
      "·projet de loi, adopté par le Sénat, autorisant l'approbation de la convention d'entraide judiciaire en matière pénale entre le Gouvernement de la République française et le Gouvernement de l'Union des Comores (n° 163)."
    ],
    "resumeOdj": [
      "audition, ouverte à la presse, de M. Laurent Bonnefoy, chercheur CNRS au CERI-Sciences Po., de Mme Liny Suharlim, directrice Pays Yémen de l'ONG ACTED, et de Mme Rasha Mohamed, chercheuse Yémen, Amnesty International, sur la situation au Yémen.",
      "nomination de rapporteurs sur les projets de loi suivants :",
      "projet de loi autorisant la ratification du protocole n° 16 à la convention de sauvegarde des droits de l'homme et des libertés fondamentales (sous réserve de son dépôt) ;",
      "projet de loi autorisant l'approbation de l'accord entre le Gouvernement de la République française et le Gouvernement de la Principauté d'Andorre concernant l'amélioration de la viabilité des routes nationales 20, 320 et 22 entre Tarascon-sur-Ariège et la frontière franco-andorrane (sous réserve de son dépôt) ;",
      "coopération sanitaire transfrontalière Suisse Luxembourg (n°390) (première lecture) ;",
      "convention d'extradition Cambodge (n°323) (première lecture) ;",
      "transports aériens entre les les USA, l'UE, l'Islande et la Norvège (n°375) (première lecture) ;",
      "services aériens entre l'UE et Israël (n°374) (première lecture) ;",
      "convention d'extradition avec les Émirats arabes unis (n°162) (première lecture) ;",
      "convention d'entraide judiciaire en matière pénale avec les Comores (n°163) (première lecture)."
    ],
    "pointsOdj": [
      {
        "xsiType": "podjReunion_type",
        "uid": "RUANR5L15S2018IDC428139PT25328",
        "cycleDeVie": {
          "etat": "Confirmé",
          "chrono": {
            "creation": "2017-12-15T00:00:00.000+01:00"
          }
        },
        "objet": "Nomination d'un rapporteur",
        "dossiersLegislatifsRefs": [
          "DLR5L15N36142"
        ],
        "typePointOdj": "Nomination rapporteur",
        "comiteSecret": false
      },
      {
        "xsiType": "podjReunion_type",
        "uid": "RUANR5L15S2018IDC428139PT25329",
        "cycleDeVie": {
          "etat": "Confirmé",
          "chrono": {
            "creation": "2017-12-15T00:00:00.000+01:00"
          }
        },
        "objet": "Nomination d'un rapporteur",
        "dossiersLegislatifsRefs": [
          "DLR5L15N36077"
        ],
        "typePointOdj": "Nomination rapporteur",
        "comiteSecret": false
      },
      {
        "xsiType": "podjReunion_type",
        "uid": "RUANR5L15S2018IDC428139PT25330",
        "cycleDeVie": {
          "etat": "Confirmé",
          "chrono": {
            "creation": "2017-12-15T00:00:00.000+01:00"
          }
        },
        "objet": "Nomination rapporteur",
        "dossiersLegislatifsRefs": [
          "DLR5L14N35235"
        ],
        "typePointOdj": "Nomination rapporteur",
        "comiteSecret": false
      },
      {
        "xsiType": "podjReunion_type",
        "uid": "RUANR5L15S2018IDC428139PT25331",
        "cycleDeVie": {
          "etat": "Confirmé",
          "chrono": {
            "creation": "2017-12-15T00:00:00.000+01:00"
          }
        },
        "objet": "Nomination d'un rapporteur",
        "dossiersLegislatifsRefs": [
          "DLR5L14N35233"
        ],
        "typePointOdj": "Nomination rapporteur",
        "comiteSecret": false
      },
      {
        "xsiType": "podjReunion_type",
        "uid": "RUANR5L15S2018IDC428139PT25332",
        "cycleDeVie": {
          "etat": "Confirmé",
          "chrono": {
            "creation": "2017-12-15T00:00:00.000+01:00"
          }
        },
        "objet": "Nomination d'un rapporteur",
        "dossiersLegislatifsRefs": [
          "DLR5L14N33962"
        ],
        "typePointOdj": "Nomination rapporteur",
        "comiteSecret": false
      },
      {
        "xsiType": "podjReunion_type",
        "uid": "RUANR5L15S2018IDC428139PT25333",
        "cycleDeVie": {
          "etat": "Confirmé",
          "chrono": {
            "creation": "2017-12-15T00:00:00.000+01:00"
          }
        },
        "objet": "Nomination d'un rapporteur",
        "dossiersLegislatifsRefs": [
          "DLR5L14N33686"
        ],
        "typePointOdj": "Nomination rapporteur",
        "comiteSecret": false
      },
      {
        "xsiType": "podjReunion_type",
        "uid": "RUANR5L15S2018IDC428139PT25385",
        "cycleDeVie": {
          "etat": "Confirmé",
          "chrono": {
            "creation": "2018-01-11T00:00:00.000+01:00"
          }
        },
        "objet": "Nomination d'un rapporteur",
        "dossiersLegislatifsRefs": [
          "DLR5L15N36240"
        ],
        "typePointOdj": "Nomination rapporteur",
        "comiteSecret": false
      },
      {
        "xsiType": "podjReunion_type",
        "uid": "RUANR5L15S2018IDC428139PT25394",
        "cycleDeVie": {
          "etat": "Confirmé",
          "chrono": {
            "creation": "2018-01-11T00:00:00.000+01:00"
          }
        },
        "objet": "Nomination d'un rapporteur",
        "dossiersLegislatifsRefs": [
          "DLR5L15N36239"
        ],
        "typePointOdj": "Nomination rapporteur",
        "comiteSecret": false
      }
    ]
  },
  "compteRenduRef": "CRCANR5L15S2018PO59047N032",
  "formatReunion": "Ordinaire",
  "infosReunionsInternationale": {
    "estReunionInternationale": false
  },
  "captationVideo": false
}