{
  "xsiType": "reunionInitParlementaire_type",
  "uid": "RUANR5L15S2018IDF0114189",
  "timestampDebut": "2018-06-27T15:30:00.000+02:00",
  "timestampFin": "2018-06-27T16:30:00.000+02:00",
  "lieu": {
    "code": "SALREU007",
    "libelleCourt": "4ème Bureau",
    "libelleLong": "4ème Bureau, Palais Bourbon"
  },
  "cycleDeVie": {
    "etat": "Annulé",
    "chrono": {
      "creation": "2018-06-25T10:06:04.000+02:00",
      "cloture": "2018-06-25T18:56:04.000+02:00"
    }
  },
  "demandeurs": {
    "acteurs": [
      {
        "nom": "Mme Olivia GREGOIRE",
        "acteurRef": "PA721764"
      }
    ]
  },
  "typeReunion": "DEP"
}