{
  "xsiType": "reunionInitParlementaire_type",
  "uid": "RUANR5L15S2019IDF0119159",
  "timestampDebut": "2018-10-24T08:00:00.000+02:00",
  "timestampFin": "2018-10-24T09:00:00.000+02:00",
  "lieu": {
    "code": "SALREU017",
    "libelleCourt": "Salon Visconti",
    "libelleLong": "Salon Visconti, 101, rue de l'Université"
  },
  "cycleDeVie": {
    "etat": "Confirmé",
    "chrono": {
      "creation": "2018-09-21T15:11:43.000+02:00"
    }
  },
  "demandeurs": {
    "acteurs": [
      {
        "nom": "M. Benoit SIMIAN",
        "acteurRef": "PA719592"
      }
    ]
  },
  "typeReunion": "DEP"
}