{
  "xsiType": "reunionInitParlementaire_type",
  "uid": "RUANR5L15S2019IDF0140553",
  "timestampDebut": "2019-09-27T10:00:00.000+02:00",
  "timestampFin": "2019-09-27T12:00:00.000+02:00",
  "lieu": {
    "code": "SALREU017",
    "libelleCourt": "Salon Visconti",
    "libelleLong": "Salon Visconti, 101, rue de l'Université"
  },
  "cycleDeVie": {
    "etat": "Confirmé",
    "chrono": {
      "creation": "2019-09-20T15:49:05.000+02:00"
    }
  },
  "demandeurs": {
    "acteurs": [
      {
        "nom": "Mme Marie-Christine VERDIER-JOUCLAS",
        "acteurRef": "PA721542"
      }
    ]
  },
  "typeReunion": "DEP"
}