{
  "xsiType": "reunionInitParlementaire_type",
  "uid": "RUANR5L15S2018IDFL431090",
  "timestampDebut": "2018-06-20T13:30:00.000+02:00",
  "lieu": {
    "libelleLong": "salle 6566 (Lois)"
  },
  "cycleDeVie": {
    "etat": "Confirmé",
    "chrono": {
      "creation": "2018-12-19T00:00:00.000+01:00"
    }
  },
  "organeReuniRef": "PO747027",
  "typeReunion": "GE",
  "odj": {
    "convocationOdj": [
      "Présentation de la situation des langues régionales en Outre-mer par Madame Maïna Sage et Monsieur Gabriel Serville ;Place des langues régionales dans la prochaine réforme constitutionnelle ;Audition des représentants des associations membres de la FLAREP(Fédération pour les langues régionales dans l'enseignement public) : rapide tour de table sur leurs réalités territoriales et échanges concernant les enjeux actuels"
    ]
  }
}