{
  "xsiType": "reunionInitParlementaire_type",
  "uid": "RUANR5L15S2018IDF0103322",
  "timestampDebut": "2018-01-23T14:00:00.000+01:00",
  "timestampFin": "2018-01-23T15:00:00.000+01:00",
  "lieu": {
    "code": "SALREU022",
    "libelleCourt": "Salle 7326",
    "libelleLong": "Salle 7326, 101, rue de l'Université"
  },
  "cycleDeVie": {
    "etat": "Confirmé",
    "chrono": {
      "creation": "2018-01-10T15:04:22.000+01:00"
    }
  },
  "demandeurs": {
    "acteurs": [
      {
        "nom": "M. Philippe LATOMBE",
        "acteurRef": "PA721984"
      }
    ]
  },
  "typeReunion": "DEP"
}