{
  "xsiType": "reunionCommission_type",
  "uid": "RUANR5L15S2019IDC431163",
  "timestampDebut": "2019-01-30T09:40:00.000+01:00",
  "timestampFin": "2019-01-30T11:15:00.000+01:00",
  "lieu": {
    "libelleLong": "salle 4223 (33 rue Saint-Dominique, 2ème étage)"
  },
  "cycleDeVie": {
    "etat": "Confirmé",
    "chrono": {
      "creation": "2019-01-11T00:00:00.000+01:00"
    }
  },
  "organeReuniRef": "PO59047",
  "participants": {
    "participantsInternes": [
      {
        "acteurRef": "PA721036",
        "presence": "excusé"
      },
      {
        "acteurRef": "PA721158",
        "presence": "présent"
      },
      {
        "acteurRef": "PA642724",
        "presence": "présent"
      },
      {
        "acteurRef": "PA441",
        "presence": "excusé"
      },
      {
        "acteurRef": "PA719218",
        "presence": "présent"
      },
      {
        "acteurRef": "PA330684",
        "presence": "absent"
      },
      {
        "acteurRef": "PA342601",
        "presence": "présent"
      },
      {
        "acteurRef": "PA719496",
        "presence": "présent"
      },
      {
        "acteurRef": "PA721166",
        "presence": "présent"
      },
      {
        "acteurRef": "PA719448",
        "presence": "présent"
      },
      {
        "acteurRef": "PA719294",
        "presence": "présent"
      },
      {
        "acteurRef": "PA336439",
        "presence": "excusé"
      },
      {
        "acteurRef": "PA718850",
        "presence": "présent"
      },
      {
        "acteurRef": "PA998",
        "presence": "excusé"
      },
      {
        "acteurRef": "PA1008",
        "presence": "présent"
      },
      {
        "acteurRef": "PA1029",
        "presence": "présent"
      },
      {
        "acteurRef": "PA720862",
        "presence": "présent"
      },
      {
        "acteurRef": "PA720438",
        "presence": "excusé"
      },
      {
        "acteurRef": "PA1198",
        "presence": "excusé"
      },
      {
        "acteurRef": "PA720684",
        "presence": "absent"
      },
      {
        "acteurRef": "PA1206",
        "presence": "excusé"
      },
      {
        "acteurRef": "PA1276",
        "presence": "présent"
      },
      {
        "acteurRef": "PA722284",
        "presence": "présent"
      },
      {
        "acteurRef": "PA267324",
        "presence": "présent"
      },
      {
        "acteurRef": "PA721024",
        "presence": "excusé"
      },
      {
        "acteurRef": "PA720222",
        "presence": "présent"
      },
      {
        "acteurRef": "PA718674",
        "presence": "présent"
      },
      {
        "acteurRef": "PA1498",
        "presence": "présent"
      },
      {
        "acteurRef": "PA610775",
        "presence": "excusé"
      },
      {
        "acteurRef": "PA695100",
        "presence": "excusé"
      },
      {
        "acteurRef": "PA1630",
        "presence": "présent"
      },
      {
        "acteurRef": "PA333818",
        "presence": "présent"
      },
      {
        "acteurRef": "PA719210",
        "presence": "présent"
      },
      {
        "acteurRef": "PA722344",
        "presence": "présent"
      },
      {
        "acteurRef": "PA721644",
        "presence": "présent"
      },
      {
        "acteurRef": "PA720202",
        "presence": "présent"
      },
      {
        "acteurRef": "PA720214",
        "presence": "présent"
      },
      {
        "acteurRef": "PA721004",
        "presence": "excusé"
      },
      {
        "acteurRef": "PA1809",
        "presence": "présent"
      },
      {
        "acteurRef": "PA1838",
        "presence": "présent"
      },
      {
        "acteurRef": "PA719664",
        "presence": "excusé"
      },
      {
        "acteurRef": "PA335612",
        "presence": "présent"
      },
      {
        "acteurRef": "PA722008",
        "presence": "présent"
      },
      {
        "acteurRef": "PA721450",
        "presence": "présent"
      },
      {
        "acteurRef": "PA720342",
        "presence": "présent"
      },
      {
        "acteurRef": "PA720614",
        "presence": "excusé"
      },
      {
        "acteurRef": "PA722178",
        "presence": "présent"
      },
      {
        "acteurRef": "PA334116",
        "presence": "présent"
      },
      {
        "acteurRef": "PA720146",
        "presence": "présent"
      },
      {
        "acteurRef": "PA720870",
        "presence": "présent"
      },
      {
        "acteurRef": "PA720370",
        "presence": "excusé"
      },
      {
        "acteurRef": "PA719130",
        "presence": "présent"
      },
      {
        "acteurRef": "PA721486",
        "presence": "absent"
      },
      {
        "acteurRef": "PA721956",
        "presence": "présent"
      },
      {
        "acteurRef": "PA721182",
        "presence": "excusé"
      },
      {
        "acteurRef": "PA267260",
        "presence": "présent"
      },
      {
        "acteurRef": "PA719528",
        "presence": "présent"
      },
      {
        "acteurRef": "PA720422",
        "presence": "absent"
      },
      {
        "acteurRef": "PA2492",
        "presence": "excusé"
      },
      {
        "acteurRef": "PA720552",
        "presence": "présent"
      },
      {
        "acteurRef": "PA2529",
        "presence": "présent"
      },
      {
        "acteurRef": "PA721824",
        "presence": "excusé"
      },
      {
        "acteurRef": "PA719676",
        "presence": "absent"
      },
      {
        "acteurRef": "PA330788",
        "presence": "présent"
      },
      {
        "acteurRef": "PA343493",
        "presence": "présent"
      },
      {
        "acteurRef": "PA720138",
        "presence": "présent"
      },
      {
        "acteurRef": "PA717151",
        "presence": "présent"
      },
      {
        "acteurRef": "PA721174",
        "presence": "présent"
      },
      {
        "acteurRef": "PA722118",
        "presence": "présent"
      },
      {
        "acteurRef": "PA267794",
        "presence": "présent"
      },
      {
        "acteurRef": "PA721690",
        "presence": "présent"
      },
      {
        "acteurRef": "PA719550",
        "presence": "présent"
      },
      {
        "acteurRef": "PA2796",
        "presence": "présent"
      },
      {
        "acteurRef": "PA720830",
        "presence": "excusé"
      },
      {
        "acteurRef": "PA720394",
        "presence": "présent"
      },
      {
        "acteurRef": "PA720746",
        "presence": "excusé"
      }
    ]
  },
  "ouverturePresse": true,
  "odj": {
    "convocationOdj": [
      "Compte rendu, ouvert à la presse, de la mission au Liban, du 25 au 28 octobre 2018, d'une délégation conjointe des commissions chargées des Affaires étrangères de l'Assemblée nationale et du Sénat, conduite par Mme Marielle de Sarnez et M. Christian Cambon, et composée pour l'Assemblée nationale de Mme Samantha Cazebonne, MM. Claude Goasguen, et Joachim Son-Forget."
    ],
    "resumeOdj": [
      "compte rendu, ouvert à la presse, de la mission au Liban, du 25 au 28 octobre 2018, d'une délégation conjointe des commissions chargées des Affaires étrangères de l'Assemblée nationale et du Sénat, conduite par Mme Marielle de Sarnez et M. Christian Cambon, et composée pour l'Assemblée nationale de Mme Samantha Cazebonne, MM. Claude Goasguen, et Joachim Son-Forget."
    ]
  },
  "compteRenduRef": "CRCANR5L15S2019PO59047N037",
  "formatReunion": "Ordinaire",
  "infosReunionsInternationale": {
    "estReunionInternationale": false
  },
  "captationVideo": false
}