{
  "xsiType": "reunionInitParlementaire_type",
  "uid": "RUANR5L15S2019IDF0131146",
  "timestampDebut": "2019-04-02T09:30:00.000+02:00",
  "timestampFin": "2019-04-02T12:30:00.000+02:00",
  "lieu": {
    "code": "SALREU038",
    "libelleCourt": "Salle 6549",
    "libelleLong": "Salle 6549, Palais Bourbon"
  },
  "cycleDeVie": {
    "etat": "Annulé",
    "chrono": {
      "creation": "2019-03-28T16:25:32.000+01:00",
      "cloture": null
    }
  },
  "demandeurs": {
    "acteurs": [
      {
        "nom": "Mme Bérangère ABBA",
        "acteurRef": "PA720242"
      }
    ]
  },
  "typeReunion": "DEP"
}