{
  "xsiType": "reunionInitParlementaire_type",
  "uid": "RUANR5L15S2019IDF0132375",
  "timestampDebut": "2019-04-16T17:45:00.000+02:00",
  "timestampFin": "2019-04-16T19:00:00.000+02:00",
  "lieu": {
    "code": "SALREU010",
    "libelleCourt": "Salle N° 1",
    "libelleLong": "Salle N° 1, 3, rue Aristide Briand"
  },
  "cycleDeVie": {
    "etat": "Confirmé",
    "chrono": {
      "creation": "2019-04-16T15:30:21.000+02:00"
    }
  },
  "demandeurs": {
    "acteurs": [
      {
        "nom": "M. Buon TAN",
        "acteurRef": "PA721690"
      }
    ]
  },
  "typeReunion": "DEP"
}