{
  "xsiType": "reunionInitParlementaire_type",
  "uid": "RUANR5L15S2018IDF0109922",
  "timestampDebut": "2018-04-24T09:00:00.000+02:00",
  "timestampFin": "2018-04-24T13:00:00.000+02:00",
  "lieu": {
    "code": "SALREU008",
    "libelleCourt": "5ème Bureau",
    "libelleLong": "5ème Bureau, Palais Bourbon"
  },
  "cycleDeVie": {
    "etat": "Confirmé",
    "chrono": {
      "creation": "2018-04-12T16:14:59.000+02:00"
    }
  },
  "demandeurs": {
    "acteurs": [
      {
        "nom": "M. Aurélien TACHÉ",
        "acteurRef": "PA720952"
      }
    ]
  },
  "typeReunion": "DEP"
}