{
  "xsiType": "reunionInitParlementaire_type",
  "uid": "RUANR5L15S2020IDF0142905",
  "timestampDebut": "2019-12-19T14:00:00.000+01:00",
  "timestampFin": "2019-12-19T17:00:00.000+01:00",
  "lieu": {
    "code": "SALREU029",
    "libelleCourt": "Salon Mars III",
    "libelleLong": "Salon Mars III, 101, rue de l'Université"
  },
  "cycleDeVie": {
    "etat": "Confirmé",
    "chrono": {
      "creation": "2019-10-30T10:22:10.000+01:00"
    }
  },
  "demandeurs": {
    "acteurs": [
      {
        "nom": "Mme Stéphanie RIST",
        "acteurRef": "PA720066"
      }
    ]
  },
  "typeReunion": "DEP"
}