{
  "xsiType": "reunionInitParlementaire_type",
  "uid": "RUANR5L15S2019IDF0134534",
  "timestampDebut": "2019-06-04T11:00:00.000+02:00",
  "timestampFin": "2019-06-04T12:30:00.000+02:00",
  "lieu": {
    "code": "SALREU049",
    "libelleCourt": "Salle 6822",
    "libelleLong": "Salle 6822, Palais Bourbon"
  },
  "cycleDeVie": {
    "etat": "Confirmé",
    "chrono": {
      "creation": "2019-05-24T17:47:21.000+02:00"
    }
  },
  "demandeurs": {
    "acteurs": [
      {
        "nom": "Mme Annie CHAPELIER",
        "acteurRef": "PA719448"
      }
    ]
  },
  "typeReunion": "DEP"
}