{
  "xsiType": "reunionCommission_type",
  "uid": "RUANR5L15S2019IDC431025",
  "timestampDebut": "2018-12-12T17:15:00.000+01:00",
  "lieu": {
    "libelleLong": "salle du CEC"
  },
  "cycleDeVie": {
    "etat": "Confirmé",
    "chrono": {
      "creation": "2018-12-07T00:00:00.000+01:00"
    }
  },
  "organeReuniRef": "PO759174",
  "participants": {},
  "ouverturePresse": false,
  "odj": {
    "convocationOdj": [
      "Audition de M. Benoît de la Chapelle Bizot, directeur général délégué de la Fédération bancaire française (FBF), accompagné de M. Christian Lothion, directeur sécurité, M. Nicolas Bodilis-Reguer, directeur relations institutionnelles, Mme Judith Azevedo, chargée de mission juridique et conformité, et Mme Christelle Gourlet, chargée de mission au département numérique et moyens de paiement."
    ],
    "resumeOdj": [
      "audition de M. Benoît de la Chapelle Bizot, directeur général délégué de la Fédération bancaire française (FBF), accompagné de M. Christian Lothion, directeur sécurité, M. Nicolas Bodilis-Reguer, directeur relations institutionnelles, Mme Judith Azevedo, chargée de mission juridique et conformité, et Mme Christelle Gourlet, chargée de mission au département numérique et moyens de paiement."
    ]
  },
  "formatReunion": "Ordinaire",
  "infosReunionsInternationale": {
    "estReunionInternationale": false
  },
  "captationVideo": false
}