{
  "xsiType": "reunionInitParlementaire_type",
  "uid": "RUANR5L15S2018IDF0111397",
  "timestampDebut": "2018-05-29T18:30:00.000+02:00",
  "timestampFin": "2018-05-29T19:30:00.000+02:00",
  "lieu": {
    "code": "SALREU021",
    "libelleCourt": "Salle 7207",
    "libelleLong": "Salle 7207, 101, rue de l'Université"
  },
  "cycleDeVie": {
    "etat": "Confirmé",
    "chrono": {
      "creation": "2018-05-14T15:13:34.000+02:00"
    }
  },
  "demandeurs": {
    "acteurs": [
      {
        "nom": "Mme Perrine GOULET",
        "acteurRef": "PA720560"
      }
    ]
  },
  "typeReunion": "DEP"
}