{
  "xsiType": "reunionInitParlementaire_type",
  "uid": "RUANR5L15S2018IDF0098349",
  "timestampDebut": "2017-10-18T10:00:00.000+02:00",
  "timestampFin": "2017-10-18T11:00:00.000+02:00",
  "lieu": {
    "code": "SALREU022",
    "libelleCourt": "Salle 7326",
    "libelleLong": "Salle 7326, 101, rue de l'Université"
  },
  "cycleDeVie": {
    "etat": "Confirmé",
    "chrono": {
      "creation": "2017-10-10T17:27:45.000+02:00"
    }
  },
  "demandeurs": {
    "acteurs": [
      {
        "nom": "M. François CORMIER-BOULIGEON",
        "acteurRef": "PA719118"
      }
    ]
  },
  "typeReunion": "DEP"
}