{
  "xsiType": "reunionCommission_type",
  "uid": "RUANR5L15S2018IDC428324",
  "timestampDebut": "2018-02-13T16:30:00.000+01:00",
  "lieu": {
    "libelleLong": "salle 4325 (33 rue Saint-Dominique)"
  },
  "cycleDeVie": {
    "etat": "Annulé",
    "chrono": {
      "creation": "2018-01-19T00:00:00.000+01:00",
      "cloture": "2018-02-12T00:00:00.000+01:00"
    }
  },
  "organeReuniRef": "PO415287",
  "participants": {},
  "ouverturePresse": true,
  "odj": {
    "convocationOdj": [
      "Audition de M. Dimitris Avramopoulos, commissaire européen à la Migration, aux Affaires intérieures et à la Citoyenneté ;",
      "Communication des référentes de la commission des lois sur la réunion interparlementaire organisée à Bruxelles le 24 janvier 2018 sur les voies légales des migrations dans l'Union européenne."
    ],
    "resumeOdj": [
      "audition de M. Dimitris Avramopoulos, commissaire européen à la Migration, aux Affaires intérieures et à la Citoyenneté ;",
      "réunion interparlementaire organisée à Bruxelles le 24 janvier 2018 sur les voies légales des migrations dans l'Union européenne (communication)."
    ]
  },
  "formatReunion": "Ordinaire",
  "infosReunionsInternationale": {
    "estReunionInternationale": false
  },
  "captationVideo": false
}