{
  "xsiType": "reunionCommission_type",
  "uid": "RUANR5L15S2018IDC427824",
  "timestampDebut": "2017-11-16T15:05:00.000+01:00",
  "timestampFin": "2017-11-16T15:50:00.000+01:00",
  "lieu": {
    "libelleLong": "6e Bureau"
  },
  "cycleDeVie": {
    "etat": "Confirmé",
    "chrono": {
      "creation": "2017-11-14T00:00:00.000+01:00"
    }
  },
  "organeReuniRef": "PO742273",
  "participants": {
    "participantsInternes": [
      {
        "acteurRef": "PA722038",
        "presence": "présent"
      },
      {
        "acteurRef": "PA335999",
        "presence": "présent"
      },
      {
        "acteurRef": "PA342415",
        "presence": "excusé"
      },
      {
        "acteurRef": "PA718756",
        "presence": "excusé"
      },
      {
        "acteurRef": "PA642695",
        "presence": "présent"
      },
      {
        "acteurRef": "PA721816",
        "presence": "présent"
      },
      {
        "acteurRef": "PA720520",
        "presence": "présent"
      },
      {
        "acteurRef": "PA721808",
        "presence": "absent"
      },
      {
        "acteurRef": "PA719710",
        "presence": "présent"
      },
      {
        "acteurRef": "PA712015",
        "presence": "absent"
      },
      {
        "acteurRef": "PA720046",
        "presence": "présent"
      },
      {
        "acteurRef": "PA720652",
        "presence": "présent"
      },
      {
        "acteurRef": "PA720002",
        "presence": "absent"
      },
      {
        "acteurRef": "PA334149",
        "presence": "excusé"
      },
      {
        "acteurRef": "PA720222",
        "presence": "présent"
      },
      {
        "acteurRef": "PA718674",
        "presence": "absent"
      },
      {
        "acteurRef": "PA719372",
        "presence": "présent"
      },
      {
        "acteurRef": "PA721514",
        "presence": "présent"
      },
      {
        "acteurRef": "PA719052",
        "presence": "présent"
      },
      {
        "acteurRef": "PA720846",
        "presence": "présent"
      },
      {
        "acteurRef": "PA331567",
        "presence": "présent"
      },
      {
        "acteurRef": "PA721134",
        "presence": "présent"
      },
      {
        "acteurRef": "PA606098",
        "presence": "présent"
      },
      {
        "acteurRef": "PA607595",
        "presence": "présent"
      },
      {
        "acteurRef": "PA721916",
        "presence": "présent"
      },
      {
        "acteurRef": "PA266776",
        "presence": "excusé"
      },
      {
        "acteurRef": "PA720692",
        "presence": "excusé"
      },
      {
        "acteurRef": "PA720780",
        "presence": "excusé"
      },
      {
        "acteurRef": "PA719420",
        "presence": "présent"
      },
      {
        "acteurRef": "PA267330",
        "presence": "absent"
      }
    ]
  },
  "ouverturePresse": false,
  "odj": {
    "convocationOdj": [
      "Nomination du Bureau ;",
      "Désignation du rapporteur ;",
      "Échange de vues sur l'organisation des travaux de la commission."
    ],
    "resumeOdj": [
      "nomination du Bureau ;",
      "désignation du rapporteur ;",
      "échange de vues sur l'organisation des travaux de la commission."
    ],
    "pointsOdj": [
      {
        "xsiType": "podjReunion_type",
        "uid": "RUANR5L15S2018IDC427824PT25243",
        "cycleDeVie": {
          "etat": "Confirmé",
          "chrono": {
            "creation": "2017-11-17T00:00:00.000+01:00"
          }
        },
        "objet": "- nomination du Bureau ;- désignation du rapporteur ;- échange de vues sur l'organisation des travaux de la commission.",
        "dossiersLegislatifsRefs": [
          "DLR5L15N36104"
        ],
        "typePointOdj": "Nomination bureau",
        "comiteSecret": false
      }
    ]
  },
  "compteRenduRef": "CRCANR5L15S2018PO742273N001",
  "formatReunion": "Ordinaire",
  "infosReunionsInternationale": {
    "estReunionInternationale": false
  },
  "captationVideo": false
}