{
  "xsiType": "reunionInitParlementaire_type",
  "uid": "RUANR5L15S2018IDF0106723",
  "timestampDebut": "2018-03-14T16:00:00.000+01:00",
  "timestampFin": "2018-03-14T17:30:00.000+01:00",
  "lieu": {
    "code": "SALREU013",
    "libelleCourt": "Salle N° 3",
    "libelleLong": "Salle N° 3, 3, rue Aristide Briand"
  },
  "cycleDeVie": {
    "etat": "Annulé",
    "chrono": {
      "creation": "2018-02-28T09:09:25.000+01:00",
      "cloture": "2018-03-08T09:22:07.000+01:00"
    }
  },
  "demandeurs": {
    "acteurs": [
      {
        "nom": "M. Arnaud VIALA",
        "acteurRef": "PA709315"
      }
    ]
  },
  "typeReunion": "DEP"
}