{
  "xsiType": "reunionInitParlementaire_type",
  "uid": "RUANR5L15S2017IDF0095001",
  "timestampDebut": "2017-09-06T14:00:00.000+02:00",
  "timestampFin": "2017-09-06T15:00:00.000+02:00",
  "lieu": {
    "code": "SALREU048",
    "libelleCourt": "Salle 6809",
    "libelleLong": "Salle 6809, Palais Bourbon"
  },
  "cycleDeVie": {
    "etat": "Confirmé",
    "chrono": {
      "creation": "2017-08-01T18:08:05.000+02:00"
    }
  },
  "demandeurs": {
    "acteurs": [
      {
        "nom": "Mme Cendra MOTIN",
        "acteurRef": "PA719850"
      }
    ]
  },
  "typeReunion": "DEP"
}