{
  "xsiType": "reunionInitParlementaire_type",
  "uid": "RUANR5L15S2018IDF0102262",
  "timestampDebut": "2018-01-16T08:00:00.000+01:00",
  "timestampFin": "2018-01-16T13:00:00.000+01:00",
  "lieu": {
    "code": "SALREU018",
    "libelleCourt": "Salon Mansart",
    "libelleLong": "Salon Mansart, 101, rue de l'Université"
  },
  "cycleDeVie": {
    "etat": "Annulé",
    "chrono": {
      "creation": "2017-12-13T12:13:18.000+01:00",
      "cloture": "2017-12-21T11:00:54.000+01:00"
    }
  },
  "demandeurs": {
    "acteurs": [
      {
        "nom": "M. Richard FERRAND",
        "acteurRef": "PA606171"
      }
    ]
  },
  "typeReunion": "DEP"
}