{
  "xsiType": "reunionInitParlementaire_type",
  "uid": "RUANR5L15S2020IDF0142700",
  "timestampDebut": "2019-11-04T10:30:00.000+01:00",
  "timestampFin": "2019-11-04T11:30:00.000+01:00",
  "lieu": {
    "code": "SALREU013",
    "libelleCourt": "Salle N° 3",
    "libelleLong": "Salle N° 3, 3, rue Aristide Briand"
  },
  "cycleDeVie": {
    "etat": "Confirmé",
    "chrono": {
      "creation": "2019-10-24T16:49:10.000+02:00"
    }
  },
  "demandeurs": {
    "acteurs": [
      {
        "nom": "M. Jimmy PAHUN",
        "acteurRef": "PA720334"
      }
    ]
  },
  "typeReunion": "DEP"
}