{
  "xsiType": "reunionInitParlementaire_type",
  "uid": "RUANR5L15S2019IDF0133337",
  "timestampDebut": "2019-05-28T16:30:00.000+02:00",
  "timestampFin": "2019-05-28T18:30:00.000+02:00",
  "lieu": {
    "code": "SALREU022",
    "libelleCourt": "Salle 7326",
    "libelleLong": "Salle 7326, 101, rue de l'Université"
  },
  "cycleDeVie": {
    "etat": "Confirmé",
    "chrono": {
      "creation": "2019-05-07T11:40:57.000+02:00"
    }
  },
  "demandeurs": {
    "acteurs": [
      {
        "nom": "M. Yves BLEIN",
        "acteurRef": "PA608641"
      }
    ]
  },
  "typeReunion": "DEP"
}