{
  "xsiType": "reunionCommission_type",
  "uid": "RUANR5L15S2018IDC428325",
  "timestampDebut": "2018-02-06T09:15:00.000+01:00",
  "lieu": {
    "libelleLong": "salle 4203 (33 rue Saint-Dominique)"
  },
  "cycleDeVie": {
    "etat": "Confirmé",
    "chrono": {
      "creation": "2018-01-22T00:00:00.000+01:00"
    }
  },
  "organeReuniRef": "PO744338",
  "participants": {},
  "ouverturePresse": false,
  "odj": {
    "convocationOdj": [
      "– Audition de M. Nicolas Roche, directeur des affaires stratégiques, de sécurité et du désarmement au ministère de l’Europe et des Affaires étrangères."
    ],
    "resumeOdj": [
      "audition de M. Nicolas Roche, directeur des affaires stratégiques, de sécurité et du désarmement au ministère de l’Europe et des Affaires étrangères."
    ]
  },
  "formatReunion": "Ordinaire",
  "infosReunionsInternationale": {
    "estReunionInternationale": false
  },
  "captationVideo": false
}