{
  "xsiType": "reunionInitParlementaire_type",
  "uid": "RUANR5L15S2019IDF0119605",
  "timestampDebut": "2018-10-08T15:00:00.000+02:00",
  "timestampFin": "2018-10-08T18:00:00.000+02:00",
  "lieu": {
    "code": "SALREU032",
    "libelleCourt": "Sully 4",
    "libelleLong": "Sully 4, Palais Bourbon"
  },
  "cycleDeVie": {
    "etat": "Confirmé",
    "chrono": {
      "creation": "2018-09-27T18:45:16.000+02:00"
    }
  },
  "demandeurs": {
    "acteurs": [
      {
        "nom": "Mme Constance LE GRIP",
        "acteurRef": "PA345722"
      }
    ]
  },
  "typeReunion": "DEP"
}