{
  "xsiType": "reunionInitParlementaire_type",
  "uid": "RUANR5L15S2018IDF0108929",
  "timestampDebut": "2018-04-04T10:30:00.000+02:00",
  "timestampFin": "2018-04-04T11:00:00.000+02:00",
  "lieu": {
    "code": "SALREU008",
    "libelleCourt": "5ème Bureau",
    "libelleLong": "5ème Bureau, Palais Bourbon"
  },
  "cycleDeVie": {
    "etat": "Confirmé",
    "chrono": {
      "creation": "2018-03-30T11:13:22.000+02:00"
    }
  },
  "demandeurs": {
    "acteurs": [
      {
        "nom": "M. Jérôme NURY",
        "acteurRef": "PA720644"
      }
    ]
  },
  "typeReunion": "DEP"
}