{
  "xsiType": "reunionCommission_type",
  "uid": "RUANR5L15S2018IDC428564",
  "timestampDebut": "2018-02-14T09:30:00.000+01:00",
  "timestampFin": "2018-02-14T12:00:00.000+01:00",
  "lieu": {
    "libelleLong": "salle 4223 (33 rue Saint-Dominique)"
  },
  "cycleDeVie": {
    "etat": "Confirmé",
    "chrono": {
      "creation": "2018-02-09T00:00:00.000+01:00"
    }
  },
  "organeReuniRef": "PO59047",
  "participants": {
    "participantsInternes": [
      {
        "acteurRef": "PA588884",
        "presence": "présent"
      },
      {
        "acteurRef": "PA642724",
        "presence": "présent"
      },
      {
        "acteurRef": "PA719218",
        "presence": "présent"
      },
      {
        "acteurRef": "PA721344",
        "presence": "absent"
      },
      {
        "acteurRef": "PA719032",
        "presence": "présent"
      },
      {
        "acteurRef": "PA330684",
        "presence": "présent"
      },
      {
        "acteurRef": "PA721118",
        "presence": "excusé"
      },
      {
        "acteurRef": "PA719496",
        "presence": "présent"
      },
      {
        "acteurRef": "PA719448",
        "presence": "présent"
      },
      {
        "acteurRef": "PA267429",
        "presence": "présent"
      },
      {
        "acteurRef": "PA719294",
        "presence": "présent"
      },
      {
        "acteurRef": "PA718850",
        "presence": "présent"
      },
      {
        "acteurRef": "PA998",
        "presence": "présent"
      },
      {
        "acteurRef": "PA1008",
        "presence": "présent"
      },
      {
        "acteurRef": "PA1029",
        "presence": "présent"
      },
      {
        "acteurRef": "PA720862",
        "presence": "absent"
      },
      {
        "acteurRef": "PA720438",
        "presence": "présent"
      },
      {
        "acteurRef": "PA722382",
        "presence": "présent"
      },
      {
        "acteurRef": "PA720046",
        "presence": "présent"
      },
      {
        "acteurRef": "PA1198",
        "presence": "présent"
      },
      {
        "acteurRef": "PA720684",
        "presence": "présent"
      },
      {
        "acteurRef": "PA1206",
        "presence": "présent"
      },
      {
        "acteurRef": "PA1276",
        "presence": "présent"
      },
      {
        "acteurRef": "PA722284",
        "presence": "présent"
      },
      {
        "acteurRef": "PA720806",
        "presence": "présent"
      },
      {
        "acteurRef": "PA721024",
        "presence": "absent"
      },
      {
        "acteurRef": "PA720222",
        "presence": "présent"
      },
      {
        "acteurRef": "PA718674",
        "presence": "présent"
      },
      {
        "acteurRef": "PA1498",
        "presence": "présent"
      },
      {
        "acteurRef": "PA610775",
        "presence": "absent"
      },
      {
        "acteurRef": "PA721296",
        "presence": "présent"
      },
      {
        "acteurRef": "PA722062",
        "presence": "présent"
      },
      {
        "acteurRef": "PA695100",
        "presence": "absent"
      },
      {
        "acteurRef": "PA1630",
        "presence": "présent"
      },
      {
        "acteurRef": "PA333818",
        "presence": "excusé"
      },
      {
        "acteurRef": "PA267801",
        "presence": "absent"
      },
      {
        "acteurRef": "PA719210",
        "presence": "présent"
      },
      {
        "acteurRef": "PA722344",
        "presence": "présent"
      },
      {
        "acteurRef": "PA721644",
        "presence": "présent"
      },
      {
        "acteurRef": "PA720202",
        "presence": "présent"
      },
      {
        "acteurRef": "PA721004",
        "presence": "excusé"
      },
      {
        "acteurRef": "PA1809",
        "presence": "présent"
      },
      {
        "acteurRef": "PA335612",
        "presence": "présent"
      },
      {
        "acteurRef": "PA722008",
        "presence": "présent"
      },
      {
        "acteurRef": "PA719388",
        "presence": "présent"
      },
      {
        "acteurRef": "PA721450",
        "presence": "présent"
      },
      {
        "acteurRef": "PA720342",
        "presence": "présent"
      },
      {
        "acteurRef": "PA720614",
        "presence": "présent"
      },
      {
        "acteurRef": "PA1960",
        "presence": "excusé"
      },
      {
        "acteurRef": "PA722178",
        "presence": "présent"
      },
      {
        "acteurRef": "PA334116",
        "presence": "présent"
      },
      {
        "acteurRef": "PA720146",
        "presence": "absent"
      },
      {
        "acteurRef": "PA720870",
        "presence": "absent"
      },
      {
        "acteurRef": "PA2150",
        "presence": "présent"
      },
      {
        "acteurRef": "PA720370",
        "presence": "absent"
      },
      {
        "acteurRef": "PA719130",
        "presence": "présent"
      },
      {
        "acteurRef": "PA719464",
        "presence": "présent"
      },
      {
        "acteurRef": "PA721486",
        "presence": "présent"
      },
      {
        "acteurRef": "PA721956",
        "presence": "présent"
      },
      {
        "acteurRef": "PA721182",
        "presence": "présent"
      },
      {
        "acteurRef": "PA267260",
        "presence": "présent"
      },
      {
        "acteurRef": "PA719528",
        "presence": "présent"
      },
      {
        "acteurRef": "PA2492",
        "presence": "présent"
      },
      {
        "acteurRef": "PA720552",
        "presence": "présent"
      },
      {
        "acteurRef": "PA2529",
        "presence": "présent"
      },
      {
        "acteurRef": "PA721824",
        "presence": "excusé"
      },
      {
        "acteurRef": "PA330788",
        "presence": "présent"
      },
      {
        "acteurRef": "PA720138",
        "presence": "présent"
      },
      {
        "acteurRef": "PA717151",
        "presence": "présent"
      },
      {
        "acteurRef": "PA722118",
        "presence": "présent"
      },
      {
        "acteurRef": "PA267794",
        "presence": "excusé"
      },
      {
        "acteurRef": "PA721690",
        "presence": "présent"
      },
      {
        "acteurRef": "PA719550",
        "presence": "présent"
      },
      {
        "acteurRef": "PA2796",
        "presence": "présent"
      },
      {
        "acteurRef": "PA720830",
        "presence": "absent"
      },
      {
        "acteurRef": "PA720746",
        "presence": "présent"
      }
    ]
  },
  "ouverturePresse": true,
  "odj": {
    "convocationOdj": [
      "– Audition, ouverte à la presse, de M. Pascal Brice, directeur général de l’Office Français de Protection des Réfugiés et Apatrides (OFPRA)."
    ],
    "resumeOdj": [
      "– audition, ouverte à la presse, de M. Pascal Brice, directeur général de l’Office français de protection des réfugiés et apatrides (OFPRA)."
    ]
  },
  "compteRenduRef": "CRCANR5L15S2018PO59047N042",
  "formatReunion": "Ordinaire",
  "infosReunionsInternationale": {
    "estReunionInternationale": false
  },
  "captationVideo": false
}