{
  "xsiType": "reunionInitParlementaire_type",
  "uid": "RUANR5L15S2019IDFL430814",
  "timestampDebut": "2018-10-24T11:15:00.000+02:00",
  "lieu": {
    "libelleLong": "Salon Mars III (101 Rue de l'Université)"
  },
  "cycleDeVie": {
    "etat": "Confirmé",
    "chrono": {
      "creation": "2018-11-15T00:00:00.000+01:00"
    }
  },
  "organeReuniRef": "PO746880",
  "typeReunion": "GE",
  "odj": {
    "convocationOdj": [
      "Mesures en faveur des collectivités territoriales dans le projet de loi de finances 2019Intervenant: M Jean-René CAZENEUVE"
    ]
  }
}