{
  "xsiType": "reunionInitParlementaire_type",
  "uid": "RUANR5L15S2019IDF0120327",
  "timestampDebut": "2018-10-24T17:00:00.000+02:00",
  "timestampFin": "2018-10-24T18:30:00.000+02:00",
  "lieu": {
    "code": "SALREU048",
    "libelleCourt": "Salle 6809",
    "libelleLong": "Salle 6809, Palais Bourbon"
  },
  "cycleDeVie": {
    "etat": "Confirmé",
    "chrono": {
      "creation": "2018-10-09T13:02:59.000+02:00"
    }
  },
  "demandeurs": {
    "acteurs": [
      {
        "nom": "M. Aurélien TACHÉ",
        "acteurRef": "PA720952"
      }
    ]
  },
  "typeReunion": "DEP"
}