{
  "xsiType": "reunionCommission_type",
  "uid": "RUANR5L15S2018IDC428144",
  "timestampDebut": "2018-02-07T09:30:00.000+01:00",
  "lieu": {
    "libelleLong": "salle 4223 (33 rue Saint-Dominique)"
  },
  "cycleDeVie": {
    "etat": "Supprimé",
    "chrono": {
      "creation": "2017-12-15T00:00:00.000+01:00",
      "cloture": "2018-01-12T00:00:00.000+01:00"
    }
  },
  "organeReuniRef": "PO59047",
  "participants": {},
  "ouverturePresse": false,
  "odj": {
    "convocationOdj": [
      "– Examen de conventions."
    ],
    "resumeOdj": [
      "examen de conventions."
    ]
  },
  "formatReunion": "Ordinaire",
  "infosReunionsInternationale": {
    "estReunionInternationale": false
  },
  "captationVideo": false
}