{
  "xsiType": "seance_type",
  "uid": "RUSNR5L15S2019IDS21480",
  "timestampDebut": "2019-01-23T14:30:00.000+01:00",
  "timestampFin": "2019-01-23T17:35:00.000+01:00",
  "lieu": {
    "code": "S",
    "libelleLong": "Sénat"
  },
  "cycleDeVie": {
    "etat": "Confirmé",
    "chrono": {
      "creation": "2018-12-21T00:00:00.000+01:00"
    }
  },
  "organeReuniRef": "PO78718",
  "sessionRef": "SCR5A2019O1",
  "ouverturePresse": true,
  "odj": {
    "pointsOdj": [
      {
        "xsiType": "podjSeanceConfPres_type",
        "uid": "RUSNR5L15S2019IDS21480PT36830",
        "cycleDeVie": {
          "etat": "Confirmé",
          "chrono": {
            "creation": "2019-01-04T00:00:00.000+01:00"
          }
        },
        "objet": "Discussion de la roposition de loi relative à l'aménagement du permis à points dans la perspective de l'abaissement de la limitation de vitesse à 80 km/h sur le réseau secondaire, présentée par Mme Sylvie GOY-CHAVENT et plusieurs de ses collègues (n° 392, 2017&#8209;2018)",
        "dossiersLegislatifsRefs": [
          "DLR5L15N37123"
        ],
        "typePointOdj": "Discussion",
        "comiteSecret": false,
        "natureTravauxOdj": "ODJSN",
        "dateConfPres": "2018-12-18T01:00:00.000+01:00"
      },
      {
        "xsiType": "podjSeanceConfPres_type",
        "uid": "RUSNR5L15S2019IDS21480PT36831",
        "cycleDeVie": {
          "etat": "Confirmé",
          "chrono": {
            "creation": "2019-01-04T00:00:00.000+01:00"
          }
        },
        "objet": "Explications de vote et vote par scrutin public sur la proposition de loi, adoptée par l'Assemblée nationale, visant à améliorer la santé visuelle des personnes âgées en perte d'autonomie (n° 185, 2018&#8209;2019)",
        "dossiersLegislatifsRefs": [
          "DLR5L15N36922"
        ],
        "typePointOdj": "Explications de vote et vote par scrutin public",
        "comiteSecret": false,
        "natureTravauxOdj": "ODJSN",
        "dateConfPres": "2018-12-18T01:00:00.000+01:00"
      }
    ]
  },
  "compteRenduRef": "CRSSNR5S2019IDS20190123",
  "identifiants": {
    "numSeanceJo": "51",
    "idJo": "20190051",
    "quantieme": "Unique",
    "dateSeance": "2019-01-23T01:00:00.000+01:00"
  },
  "captationVideo": true
}