{
  "xsiType": "reunionInitParlementaire_type",
  "uid": "RUANR5L15S2018IDF0109307",
  "timestampDebut": "2018-04-06T13:30:00.000+02:00",
  "timestampFin": "2018-04-06T16:00:00.000+02:00",
  "lieu": {
    "code": "SALREU023",
    "libelleCourt": "Salle 7426",
    "libelleLong": "Salle 7426, 101, rue de l'Université"
  },
  "cycleDeVie": {
    "etat": "Confirmé",
    "chrono": {
      "creation": "2018-04-05T15:48:46.000+02:00"
    }
  },
  "demandeurs": {
    "acteurs": [
      {
        "nom": "M. Olivier SERVA",
        "acteurRef": "PA720960"
      }
    ]
  },
  "typeReunion": "DEP"
}