{
  "xsiType": "reunionCommission_type",
  "uid": "RUANR5L15S2019IDC431577",
  "timestampDebut": "2019-02-20T00:00:00.000+01:00",
  "timestampFin": "2019-02-22T23:59:59.000+01:00",
  "lieu": {
    "libelleLong": "Vienne"
  },
  "cycleDeVie": {
    "etat": "Confirmé",
    "chrono": {
      "creation": "2019-02-14T00:00:00.000+01:00"
    }
  },
  "organeReuniRef": "PO58976",
  "participants": {},
  "ouverturePresse": false,
  "odj": {
    "convocationOdj": [
      "Participation de Mme Sereine Mauborgne, présidente de la délégation française à l’AP OSCE, accompagnée de Mme Aude Bono-Vandorme et de MM. Stéphane Demilly, François Jolivet, Didier Paris, Frédéric Petit et Guy Teissier, membres de la délégation, à la réunion d’hiver de l’AP OSCE à Vienne."
    ],
    "resumeOdj": [
      "Participation de Mme Sereine Mauborgne, présidente de la délégation française à l’AP OSCE, accompagnée de Mme Aude Bono-Vandorme et de MM. Stéphane Demilly, François Jolivet, Didier Paris, Frédéric Petit et Guy Teissier, membres de la délégation, à la réunion d’hiver de l’AP OSCE à Vienne."
    ]
  },
  "formatReunion": "Ordinaire",
  "infosReunionsInternationale": {
    "estReunionInternationale": true,
    "listePays": [
      "GOP756402"
    ],
    "informationsComplementaires": "(Anne-Cécile Blauwblomme – 34380 ; Marie-Pierre Besnault – 34361)"
  },
  "captationVideo": false
}