{
  "xsiType": "reunionCommission_type",
  "uid": "RUANR5L15S2019IDC431939",
  "timestampDebut": "2019-04-30T17:45:00.000+02:00",
  "lieu": {
    "libelleLong": "salon Visconti (32 rue Saint-Dominique)"
  },
  "cycleDeVie": {
    "etat": "Annulé",
    "chrono": {
      "creation": "2019-03-14T00:00:00.000+01:00",
      "cloture": "2019-04-04T00:00:00.000+02:00"
    }
  },
  "organeReuniRef": "PO760931",
  "participants": {},
  "ouverturePresse": false,
  "odj": {
    "convocationOdj": [
      "– Audition en cours de confirmation."
    ],
    "resumeOdj": [
      "– audition en cours de confirmation."
    ]
  },
  "formatReunion": "Ordinaire",
  "infosReunionsInternationale": {
    "estReunionInternationale": false
  },
  "captationVideo": false
}