{
  "xsiType": "seance_type",
  "uid": "RUSNR5L15S2018IDS20928",
  "timestampDebut": "2018-02-13T09:30:00.000+01:00",
  "timestampFin": "2018-02-13T16:25:00.000+01:00",
  "lieu": {
    "code": "S",
    "libelleLong": "Sénat"
  },
  "cycleDeVie": {
    "etat": "Confirmé",
    "chrono": {
      "creation": "2018-02-02T00:00:00.000+01:00"
    }
  },
  "organeReuniRef": "PO78718",
  "sessionRef": "SCR5A2018O1",
  "ouverturePresse": true,
  "odj": {
    "pointsOdj": [
      {
        "xsiType": "podjSeanceConfPres_type",
        "uid": "RUSNR5L15S2018IDS20928PT35614",
        "cycleDeVie": {
          "etat": "Confirmé",
          "chrono": {
            "creation": "2018-02-02T00:00:00.000+01:00"
          }
        },
        "objet": "Discussion du projet de loi organique relatif à l'organisation de la consultation sur l'accession à la pleine souveraineté de la Nouvelle-Calédonie (procédure accélérée) (n° 152, 2017-2018)",
        "dossiersLegislatifsRefs": [
          "DLR5L15N36333"
        ],
        "typePointOdj": "Discussion",
        "comiteSecret": false,
        "natureTravauxOdj": "ODJPR",
        "dateConfPres": "2018-01-31T01:00:00.000+01:00"
      },
      {
        "xsiType": "podjSeanceConfPres_type",
        "uid": "RUSNR5L15S2018IDS20928PT36849",
        "cycleDeVie": {
          "etat": "Supprimé",
          "chrono": {
            "creation": "2019-01-07T00:00:00.000+01:00",
            "cloture": "2019-01-07T00:00:00.000+01:00"
          }
        },
        "objet": "Discussion du projet de loi portant diverses dispositions institutionnelles en Polynésie française (procédure accélérée) (n° 199, 2018-2019)",
        "typePointOdj": "Discussion",
        "comiteSecret": false,
        "natureTravauxOdj": "ODJPR",
        "dateConfPres": "2018-12-18T01:00:00.000+01:00"
      }
    ]
  },
  "compteRenduRef": "CRSSNR5S2018IDS20180213",
  "identifiants": {
    "numSeanceJo": "54",
    "idJo": "20180054",
    "quantieme": "Unique",
    "dateSeance": "2018-02-13T01:00:00.000+01:00"
  },
  "captationVideo": true
}