{
  "xsiType": "reunionInitParlementaire_type",
  "uid": "RUANR5L15S2018IDF0108683",
  "timestampDebut": "2018-05-22T13:30:00.000+02:00",
  "timestampFin": "2018-05-22T14:30:00.000+02:00",
  "lieu": {
    "code": "SALREU039",
    "libelleCourt": "Salle 6550",
    "libelleLong": "Salle 6550, Palais Bourbon"
  },
  "cycleDeVie": {
    "etat": "Confirmé",
    "chrono": {
      "creation": "2018-03-27T18:27:21.000+02:00"
    }
  },
  "demandeurs": {
    "acteurs": [
      {
        "nom": "M. Olivier DAMAISIN",
        "acteurRef": "PA720268"
      }
    ]
  },
  "typeReunion": "DEP"
}