{
  "xsiType": "reunionInitParlementaire_type",
  "uid": "RUANR5L15S2018IDF0109660",
  "timestampDebut": "2018-05-02T14:30:00.000+02:00",
  "timestampFin": "2018-05-02T16:00:00.000+02:00",
  "lieu": {
    "code": "SALREU038",
    "libelleCourt": "Salle 6549",
    "libelleLong": "Salle 6549, Palais Bourbon"
  },
  "cycleDeVie": {
    "etat": "Confirmé",
    "chrono": {
      "creation": "2018-04-10T16:12:57.000+02:00"
    }
  },
  "demandeurs": {
    "acteurs": [
      {
        "nom": "M. Philippe BERTA",
        "acteurRef": "PA719488"
      }
    ]
  },
  "typeReunion": "DEP"
}