{
  "xsiType": "reunionInitParlementaire_type",
  "uid": "RUANR5L15S2019IDF0136663",
  "timestampDebut": "2019-07-16T18:00:00.000+02:00",
  "timestampFin": "2019-07-16T19:00:00.000+02:00",
  "lieu": {
    "code": "SALREU013",
    "libelleCourt": "Salle N° 3",
    "libelleLong": "Salle N° 3, 3, rue Aristide Briand"
  },
  "cycleDeVie": {
    "etat": "Annulé",
    "chrono": {
      "creation": "2019-07-02T11:48:49.000+02:00",
      "cloture": "2019-07-12T11:14:57.000+02:00"
    }
  },
  "demandeurs": {
    "acteurs": [
      {
        "nom": "M. Pacôme RUPIN",
        "acteurRef": "PA721616"
      }
    ]
  },
  "typeReunion": "DEP"
}