{
  "xsiType": "reunionCommission_type",
  "uid": "RUANR5L15S2019IDC432242",
  "timestampDebut": "2019-05-02T21:00:00.000+02:00",
  "lieu": {
    "libelleLong": "salle 6242 (Lois)"
  },
  "cycleDeVie": {
    "etat": "Supprimé",
    "chrono": {
      "creation": "2019-04-04T00:00:00.000+02:00",
      "cloture": "2019-04-11T00:00:00.000+02:00"
    }
  },
  "organeReuniRef": "PO59051",
  "participants": {},
  "ouverturePresse": true,
  "odj": {
    "convocationOdj": [
      "Suite de l'ordre du jour de l'après-midi."
    ],
    "resumeOdj": [
      "suite de l'ordre du jour de l'après-midi."
    ]
  },
  "formatReunion": "Ordinaire",
  "infosReunionsInternationale": {
    "estReunionInternationale": false
  },
  "captationVideo": false
}