{
  "xsiType": "reunionInitParlementaire_type",
  "uid": "RUANR5L15S2017IDF0095818",
  "timestampDebut": "2017-09-14T09:00:00.000+02:00",
  "timestampFin": "2017-09-14T11:00:00.000+02:00",
  "lieu": {
    "code": "SALREU019",
    "libelleCourt": "Salon Mars I",
    "libelleLong": "Salon Mars I, 101, rue de l'Université"
  },
  "cycleDeVie": {
    "etat": "Annulé",
    "chrono": {
      "creation": "2017-09-07T10:01:58.000+02:00",
      "cloture": "2017-09-12T13:34:30.000+02:00"
    }
  },
  "demandeurs": {
    "organe": {
      "nom": "Groupe d'amitié France-Turquie",
      "organeRef": "PO733187"
    }
  },
  "organeReuniRef": "PO733187",
  "typeReunion": "GA"
}