{
  "xsiType": "reunionInitParlementaire_type",
  "uid": "RUANR5L15S2018IDF0099618",
  "timestampDebut": "2017-11-07T18:00:00.000+01:00",
  "timestampFin": "2017-11-07T19:00:00.000+01:00",
  "lieu": {
    "code": "SALREU017",
    "libelleCourt": "Salon Visconti",
    "libelleLong": "Salon Visconti, 101, rue de l'Université"
  },
  "cycleDeVie": {
    "etat": "Confirmé",
    "chrono": {
      "creation": "2017-11-02T09:31:47.000+01:00"
    }
  },
  "demandeurs": {
    "acteurs": [
      {
        "nom": "M. Anthony CELLIER",
        "acteurRef": "PA719440"
      }
    ]
  },
  "typeReunion": "DEP"
}