{
  "xsiType": "reunionInitParlementaire_type",
  "uid": "RUANR5L15S2018IDF0098659",
  "timestampDebut": "2017-10-18T08:00:00.000+02:00",
  "timestampFin": "2017-10-18T09:00:00.000+02:00",
  "lieu": {
    "code": "SALREU049",
    "libelleCourt": "Salle 6822",
    "libelleLong": "Salle 6822, Palais Bourbon"
  },
  "cycleDeVie": {
    "etat": "Confirmé",
    "chrono": {
      "creation": "2017-10-16T09:42:17.000+02:00"
    }
  },
  "demandeurs": {
    "acteurs": [
      {
        "nom": "M. Jacques MARILOSSIAN",
        "acteurRef": "PA721946"
      }
    ]
  },
  "typeReunion": "DEP"
}