{
  "xsiType": "reunionInitParlementaire_type",
  "uid": "RUANR5L15S2020IDF0141303",
  "timestampDebut": "2019-10-02T14:00:00.000+02:00",
  "timestampFin": "2019-10-02T14:30:00.000+02:00",
  "lieu": {
    "code": "SALREU019",
    "libelleCourt": "Salon Mars I",
    "libelleLong": "Salon Mars I, 101, rue de l'Université"
  },
  "cycleDeVie": {
    "etat": "Confirmé",
    "chrono": {
      "creation": "2019-10-02T13:57:52.000+02:00"
    }
  },
  "demandeurs": {
    "acteurs": [
      {
        "nom": "M. Stanislas GUERINI",
        "acteurRef": "PA721498"
      }
    ]
  },
  "typeReunion": "DEP"
}