{
  "xsiType": "reunionInitParlementaire_type",
  "uid": "RUANR5L15S2018IDF0097235",
  "timestampDebut": "2018-04-12T14:00:00.000+02:00",
  "timestampFin": "2018-04-12T15:00:00.000+02:00",
  "lieu": {
    "code": "SALREU026",
    "libelleCourt": "9ème Bureau",
    "libelleLong": "9ème Bureau, Palais Bourbon"
  },
  "cycleDeVie": {
    "etat": "Confirmé",
    "chrono": {
      "creation": "2017-09-27T17:47:02.000+02:00"
    }
  },
  "demandeurs": {
    "organe": {
      "nom": "GROUPE NOUVELLE GAUCHE",
      "organeRef": "PO730946"
    }
  },
  "organeReuniRef": "PO730946",
  "typeReunion": "GP"
}