{
  "xsiType": "reunionInitParlementaire_type",
  "uid": "RUANR5L15S2019IDF0126951",
  "timestampDebut": "2019-03-20T16:30:00.000+01:00",
  "timestampFin": "2019-03-20T19:00:00.000+01:00",
  "lieu": {
    "code": "SALREU049",
    "libelleCourt": "Salle 6822",
    "libelleLong": "Salle 6822, Palais Bourbon"
  },
  "cycleDeVie": {
    "etat": "Confirmé",
    "chrono": {
      "creation": "2019-02-06T11:34:19.000+01:00"
    }
  },
  "demandeurs": {
    "acteurs": [
      {
        "nom": "M. Fabien ROUSSEL",
        "acteurRef": "PA720692"
      }
    ]
  },
  "typeReunion": "DEP"
}