{
  "xsiType": "reunionInitParlementaire_type",
  "uid": "RUANR5L15S2018IDF0103064",
  "timestampDebut": "2018-01-16T16:30:00.000+01:00",
  "timestampFin": "2018-01-16T18:00:00.000+01:00",
  "lieu": {
    "code": "SALREU016",
    "libelleCourt": "Salon Gabriel",
    "libelleLong": "Salon Gabriel, 101, rue de l'Université"
  },
  "cycleDeVie": {
    "etat": "Confirmé",
    "chrono": {
      "creation": "2017-12-22T16:42:13.000+01:00"
    }
  },
  "demandeurs": {
    "acteurs": [
      {
        "nom": "M. Thomas MESNIER",
        "acteurRef": "PA719072"
      }
    ]
  },
  "typeReunion": "DEP"
}