{
  "xsiType": "reunionInitParlementaire_type",
  "uid": "RUANR5L15S2018IDF0106764",
  "timestampDebut": "2018-02-28T12:15:00.000+01:00",
  "timestampFin": "2018-02-28T14:00:00.000+01:00",
  "lieu": {
    "code": "SALREU049",
    "libelleCourt": "Salle 6822",
    "libelleLong": "Salle 6822, Palais Bourbon"
  },
  "cycleDeVie": {
    "etat": "Confirmé",
    "chrono": {
      "creation": "2018-02-28T12:21:19.000+01:00"
    }
  },
  "demandeurs": {
    "acteurs": [
      {
        "nom": "Mme Naïma MOUTCHOU",
        "acteurRef": "PA720908"
      }
    ]
  },
  "typeReunion": "DEP"
}