{
  "xsiType": "reunionCommission_type",
  "uid": "RUANR5L15S2018IDC428708",
  "timestampDebut": "2018-03-15T10:30:00.000+01:00",
  "timestampFin": "2018-03-15T13:05:00.000+01:00",
  "lieu": {
    "libelleLong": "salle 6237 (Développement durable)"
  },
  "cycleDeVie": {
    "etat": "Confirmé",
    "chrono": {
      "creation": "2018-02-23T00:00:00.000+01:00"
    }
  },
  "organeReuniRef": "PO748336",
  "participants": {},
  "ouverturePresse": true,
  "odj": {
    "convocationOdj": [
      "Audition de M. Dominique Minière, directeur du parc nucléaire et thermique d'EDF;"
    ],
    "resumeOdj": [
      "audition de M. Dominique Minière, directeur du parc nucléaire et thermique d'EDF."
    ]
  },
  "compteRenduRef": "CRCANR5L15S2018PO748336N014",
  "formatReunion": "Ordinaire",
  "infosReunionsInternationale": {
    "estReunionInternationale": false
  },
  "captationVideo": false
}