{
  "xsiType": "reunionInitParlementaire_type",
  "uid": "RUANR5L15S2019IDF0134790",
  "timestampDebut": "2019-07-10T16:00:00.000+02:00",
  "timestampFin": "2019-07-10T17:00:00.000+02:00",
  "lieu": {
    "code": "SALREU049",
    "libelleCourt": "Salle 6822",
    "libelleLong": "Salle 6822, Palais Bourbon"
  },
  "cycleDeVie": {
    "etat": "Annulé",
    "chrono": {
      "creation": "2019-05-29T18:54:24.000+02:00",
      "cloture": "2019-07-10T15:40:53.000+02:00"
    }
  },
  "demandeurs": {
    "acteurs": [
      {
        "nom": "Mme Célia DE LAVERGNE",
        "acteurRef": "PA719310"
      }
    ]
  },
  "typeReunion": "DEP"
}