{
  "xsiType": "reunionCommission_type",
  "uid": "RUANR5L15S2019IDC431800",
  "timestampDebut": "2019-03-19T16:30:00.000+01:00",
  "lieu": {
    "libelleLong": "salle 6242 (Lois)"
  },
  "cycleDeVie": {
    "etat": "Supprimé",
    "chrono": {
      "creation": "2019-03-05T00:00:00.000+01:00",
      "cloture": "2019-03-12T00:00:00.000+01:00"
    }
  },
  "organeReuniRef": "PO59051",
  "participants": {},
  "ouverturePresse": false,
  "odj": {
    "convocationOdj": [
      "– Séance de sensibilisation aux risques numériques"
    ],
    "resumeOdj": [
      "séance de sensibilisation aux risques numériques."
    ]
  },
  "formatReunion": "Ordinaire",
  "infosReunionsInternationale": {
    "estReunionInternationale": false
  },
  "captationVideo": false
}