{
  "xsiType": "reunionInitParlementaire_type",
  "uid": "RUANR5L15S2018IDF0106250",
  "timestampDebut": "2018-03-15T09:00:00.000+01:00",
  "timestampFin": "2018-03-15T12:00:00.000+01:00",
  "lieu": {
    "code": "SALREU018",
    "libelleCourt": "Salon Mansart",
    "libelleLong": "Salon Mansart, 101, rue de l'Université"
  },
  "cycleDeVie": {
    "etat": "Confirmé",
    "chrono": {
      "creation": "2018-02-20T15:35:33.000+01:00"
    }
  },
  "demandeurs": {
    "acteurs": [
      {
        "nom": "Mme Élise FAJGELES",
        "acteurRef": "PA721564"
      }
    ]
  },
  "typeReunion": "DEP"
}