{
  "xsiType": "reunionCommission_type",
  "uid": "RUANR5L15S2020IDC433856",
  "timestampDebut": "2019-10-22T21:00:00.000+02:00",
  "timestampFin": "2019-10-22T23:30:00.000+02:00",
  "lieu": {
    "libelleLong": "salle 6350 (Finances)"
  },
  "cycleDeVie": {
    "etat": "Confirmé",
    "chrono": {
      "creation": "2019-10-03T00:00:00.000+02:00"
    }
  },
  "organeReuniRef": "PO59048",
  "participants": {
    "participantsInternes": [
      {
        "acteurRef": "PA605036",
        "presence": "absent"
      },
      {
        "acteurRef": "PA718954",
        "presence": "présent"
      },
      {
        "acteurRef": "PA605963",
        "presence": "absent"
      },
      {
        "acteurRef": "PA606675",
        "presence": "excusé"
      },
      {
        "acteurRef": "PA609726",
        "presence": "absent"
      },
      {
        "acteurRef": "PA721836",
        "presence": "absent"
      },
      {
        "acteurRef": "PA721410",
        "presence": "absent"
      },
      {
        "acteurRef": "PA642695",
        "presence": "présent"
      },
      {
        "acteurRef": "PA605069",
        "presence": "absent"
      },
      {
        "acteurRef": "PA718838",
        "presence": "absent"
      },
      {
        "acteurRef": "PA720298",
        "presence": "absent"
      },
      {
        "acteurRef": "PA746",
        "presence": "absent"
      },
      {
        "acteurRef": "PA719138",
        "presence": "présent"
      },
      {
        "acteurRef": "PA720520",
        "presence": "présent"
      },
      {
        "acteurRef": "PA719472",
        "presence": "absent"
      },
      {
        "acteurRef": "PA719250",
        "presence": "absent"
      },
      {
        "acteurRef": "PA760658",
        "presence": "présent"
      },
      {
        "acteurRef": "PA721202",
        "presence": "absent"
      },
      {
        "acteurRef": "PA923",
        "presence": "absent"
      },
      {
        "acteurRef": "PA942",
        "presence": "présent"
      },
      {
        "acteurRef": "PA332523",
        "presence": "absent"
      },
      {
        "acteurRef": "PA720268",
        "presence": "absent"
      },
      {
        "acteurRef": "PA719710",
        "presence": "absent"
      },
      {
        "acteurRef": "PA722382",
        "presence": "absent"
      },
      {
        "acteurRef": "PA718720",
        "presence": "présent"
      },
      {
        "acteurRef": "PA643175",
        "presence": "absent"
      },
      {
        "acteurRef": "PA720652",
        "presence": "présent"
      },
      {
        "acteurRef": "PA720002",
        "presence": "présent"
      },
      {
        "acteurRef": "PA1327",
        "presence": "absent"
      },
      {
        "acteurRef": "PA719480",
        "presence": "présent"
      },
      {
        "acteurRef": "PA267336",
        "presence": "excusé"
      },
      {
        "acteurRef": "PA720560",
        "presence": "absent"
      },
      {
        "acteurRef": "PA720790",
        "presence": "absent"
      },
      {
        "acteurRef": "PA721764",
        "presence": "absent"
      },
      {
        "acteurRef": "PA1592",
        "presence": "excusé"
      },
      {
        "acteurRef": "PA722054",
        "presence": "absent"
      },
      {
        "acteurRef": "PA718794",
        "presence": "présent"
      },
      {
        "acteurRef": "PA608416",
        "presence": "absent"
      },
      {
        "acteurRef": "PA721150",
        "presence": "présent"
      },
      {
        "acteurRef": "PA722374",
        "presence": "présent"
      },
      {
        "acteurRef": "PA719060",
        "presence": "absent"
      },
      {
        "acteurRef": "PA719778",
        "presence": "absent"
      },
      {
        "acteurRef": "PA719798",
        "presence": "présent"
      },
      {
        "acteurRef": "PA718978",
        "presence": "présent"
      },
      {
        "acteurRef": "PA1838",
        "presence": "absent"
      },
      {
        "acteurRef": "PA720022",
        "presence": "présent"
      },
      {
        "acteurRef": "PA712014",
        "presence": "absent"
      },
      {
        "acteurRef": "PA1874",
        "presence": "excusé"
      },
      {
        "acteurRef": "PA721632",
        "presence": "présent"
      },
      {
        "acteurRef": "PA720614",
        "presence": "absent"
      },
      {
        "acteurRef": "PA719006",
        "presence": "absent"
      },
      {
        "acteurRef": "PA608016",
        "presence": "absent"
      },
      {
        "acteurRef": "PA722244",
        "presence": "absent"
      },
      {
        "acteurRef": "PA720230",
        "presence": "présent"
      },
      {
        "acteurRef": "PA346218",
        "presence": "présent"
      },
      {
        "acteurRef": "PA720728",
        "presence": "présent"
      },
      {
        "acteurRef": "PA719850",
        "presence": "présent"
      },
      {
        "acteurRef": "PA720278",
        "presence": "présent"
      },
      {
        "acteurRef": "PA720492",
        "presence": "présent"
      },
      {
        "acteurRef": "PA720402",
        "presence": "absent"
      },
      {
        "acteurRef": "PA607595",
        "presence": "absent"
      },
      {
        "acteurRef": "PA720500",
        "presence": "absent"
      },
      {
        "acteurRef": "PA718736",
        "presence": "absent"
      },
      {
        "acteurRef": "PA608172",
        "presence": "absent"
      },
      {
        "acteurRef": "PA720590",
        "presence": "absent"
      },
      {
        "acteurRef": "PA405480",
        "presence": "absent"
      },
      {
        "acteurRef": "PA609590",
        "presence": "excusé"
      },
      {
        "acteurRef": "PA721678",
        "presence": "absent"
      },
      {
        "acteurRef": "PA721458",
        "presence": "absent"
      },
      {
        "acteurRef": "PA720692",
        "presence": "absent"
      },
      {
        "acteurRef": "PA721226",
        "presence": "présent"
      },
      {
        "acteurRef": "PA720878",
        "presence": "présent"
      },
      {
        "acteurRef": "PA722078",
        "presence": "absent"
      },
      {
        "acteurRef": "PA720960",
        "presence": "excusé"
      },
      {
        "acteurRef": "PA719592",
        "presence": "absent"
      },
      {
        "acteurRef": "PA719350",
        "presence": "présent"
      },
      {
        "acteurRef": "PA721542",
        "presence": "présent"
      },
      {
        "acteurRef": "PA340357",
        "presence": "présent"
      },
      {
        "acteurRef": "PA2960",
        "presence": "présent"
      }
    ]
  },
  "ouverturePresse": true,
  "odj": {
    "convocationOdj": [
      "–  Suite de l’examen de la seconde partie du projet de loi de finances pour 2020 (n° 2272) ; examen et vote sur les crédits des missions : –  Recherche et enseignement supérieur :–  Recherche (MM. Francis CHOUAT et Benjamin DIRX, rapporteurs spéciaux)–  Enseignement supérieur et vie étudiante (M. Fabrice LE VIGOUREUX, rapporteur spécial)–  Enseignement scolaire (Mme Catherine OSSON, rapporteure spéciale)–  Travail et emploi, et sur les articles 79 et 80, rattachés (Mme Marie-Christine VERDIER-JOUCLAS, rapporteure spéciale)"
    ],
    "resumeOdj": [
      "suite de l’examen de la seconde partie du projet de loi de finances pour 2020 (n° 2272) ; examen et vote sur les crédits des missions :",
      "recherche et enseignement supérieur :",
      "recherche (MM. Francis Chouat et Benjamin Dirx, rapporteurs spéciaux) ;",
      "enseignement supérieur et vie étudiante (M. Fabrice Le Vigoureux, rapporteur spécial) ;",
      "enseignement scolaire (Mme Catherine Osson, rapporteure spéciale) ;",
      "travail et emploi, et sur les articles 79 et 80, rattachés (Mme Marie-Christine Verdier-Jouclas, rapporteure spéciale)."
    ],
    "pointsOdj": [
      {
        "xsiType": "podjReunion_type",
        "uid": "RUANR5L15S2020IDC433856PT26859",
        "cycleDeVie": {
          "etat": "Eventuel",
          "chrono": {
            "creation": "2019-10-03T00:00:00.000+02:00"
          }
        },
        "objet": "Examen du texte",
        "dossiersLegislatifsRefs": [
          "DLR5L15N37615"
        ],
        "typePointOdj": "Examen",
        "comiteSecret": false
      }
    ]
  },
  "compteRenduRef": "CRCANR5L15S2020PO59048N015",
  "formatReunion": "Ordinaire",
  "infosReunionsInternationale": {
    "estReunionInternationale": false
  },
  "captationVideo": true
}