{
  "xsiType": "reunionInitParlementaire_type",
  "uid": "RUANR5L15S2018IDF0101937",
  "timestampDebut": "2017-12-12T16:15:00.000+01:00",
  "timestampFin": "2017-12-12T19:00:00.000+01:00",
  "lieu": {
    "code": "SALREU017",
    "libelleCourt": "Salon Visconti",
    "libelleLong": "Salon Visconti, 101, rue de l'Université"
  },
  "cycleDeVie": {
    "etat": "Annulé",
    "chrono": {
      "creation": "2017-12-06T12:15:03.000+01:00",
      "cloture": "2017-12-06T18:01:39.000+01:00"
    }
  },
  "demandeurs": {
    "acteurs": [
      {
        "nom": "Mme Catherine FABRE",
        "acteurRef": "PA719570"
      }
    ]
  },
  "typeReunion": "DEP"
}