{
  "xsiType": "reunionInitParlementaire_type",
  "uid": "RUANR5L15S2019IDF0123550",
  "timestampDebut": "2018-12-13T17:30:00.000+01:00",
  "timestampFin": "2018-12-13T19:00:00.000+01:00",
  "lieu": {
    "code": "SALREU021",
    "libelleCourt": "Salle 7207",
    "libelleLong": "Salle 7207, 101, rue de l'Université"
  },
  "cycleDeVie": {
    "etat": "Confirmé",
    "chrono": {
      "creation": "2018-12-07T13:14:07.000+01:00"
    }
  },
  "demandeurs": {
    "acteurs": [
      {
        "nom": "M. Loïc PRUD'HOMME",
        "acteurRef": "PA719578"
      }
    ]
  },
  "typeReunion": "DEP"
}