{
  "xsiType": "reunionInitParlementaire_type",
  "uid": "RUANR5L15S2020IDF0143120",
  "timestampDebut": "2019-11-13T17:00:00.000+01:00",
  "timestampFin": "2019-11-13T18:00:00.000+01:00",
  "lieu": {
    "code": "SALREU015",
    "libelleCourt": "Salle 7044",
    "libelleLong": "Salle 7044, 103, rue de l'Université"
  },
  "cycleDeVie": {
    "etat": "Confirmé",
    "chrono": {
      "creation": "2019-11-04T15:02:26.000+01:00"
    }
  },
  "demandeurs": {
    "organe": {
      "nom": "GROUPE LA RÉPUBLIQUE EN MARCHE",
      "organeRef": "PO730964"
    }
  },
  "organeReuniRef": "PO730964",
  "typeReunion": "GP"
}