{
  "xsiType": "reunionInitParlementaire_type",
  "uid": "RUANR5L15S2018IDF0107233",
  "timestampDebut": "2018-03-13T14:15:00.000+01:00",
  "timestampFin": "2018-03-13T15:00:00.000+01:00",
  "lieu": {
    "code": "SALREU027",
    "libelleCourt": "Salle 6217",
    "libelleLong": "Salle 6217, Palais Bourbon"
  },
  "cycleDeVie": {
    "etat": "Confirmé",
    "chrono": {
      "creation": "2018-03-08T15:36:19.000+01:00"
    }
  },
  "demandeurs": {
    "acteurs": [
      {
        "nom": "M. Charles DE LA VERPILLIÈRE",
        "acteurRef": "PA1012"
      }
    ]
  },
  "typeReunion": "DEP"
}