{
  "xsiType": "reunionInitParlementaire_type",
  "uid": "RUANR5L15S2019IDF0134322",
  "timestampDebut": "2019-06-18T15:30:00.000+02:00",
  "timestampFin": "2019-06-18T16:30:00.000+02:00",
  "lieu": {
    "code": "SALREU021",
    "libelleCourt": "Salle 7207",
    "libelleLong": "Salle 7207, 101, rue de l'Université"
  },
  "cycleDeVie": {
    "etat": "Confirmé",
    "chrono": {
      "creation": "2019-05-22T16:17:17.000+02:00"
    }
  },
  "demandeurs": {
    "acteurs": [
      {
        "nom": "Mme Typhanie DEGOIS",
        "acteurRef": "PA721398"
      }
    ]
  },
  "typeReunion": "DEP"
}