{
  "xsiType": "reunionInitParlementaire_type",
  "uid": "RUANR5L15S2018IDF0114488",
  "timestampDebut": "2018-09-19T16:00:00.000+02:00",
  "timestampFin": "2018-09-19T21:00:00.000+02:00",
  "lieu": {
    "code": "SALREU029",
    "libelleCourt": "Salon Mars III",
    "libelleLong": "Salon Mars III, 101, rue de l'Université"
  },
  "cycleDeVie": {
    "etat": "Confirmé",
    "chrono": {
      "creation": "2018-06-28T16:52:48.000+02:00"
    }
  },
  "demandeurs": {
    "acteurs": [
      {
        "nom": "M. Jean-Carles GRELIER",
        "acteurRef": "PA267318"
      }
    ]
  },
  "typeReunion": "DEP"
}