{
  "xsiType": "reunionInitParlementaire_type",
  "uid": "RUANR5L15S2019IDF0136154",
  "timestampDebut": "2019-09-17T09:00:00.000+02:00",
  "timestampFin": "2019-09-17T11:00:00.000+02:00",
  "lieu": {
    "code": "SALREU013",
    "libelleCourt": "Salle N° 3",
    "libelleLong": "Salle N° 3, 3, rue Aristide Briand"
  },
  "cycleDeVie": {
    "etat": "Confirmé",
    "chrono": {
      "creation": "2019-06-25T09:09:20.000+02:00"
    }
  },
  "demandeurs": {
    "acteurs": [
      {
        "nom": "M. Jimmy PAHUN",
        "acteurRef": "PA720334"
      }
    ]
  },
  "typeReunion": "DEP"
}