{
  "xsiType": "reunionInitParlementaire_type",
  "uid": "RUANR5L15S2019IDF0139832",
  "timestampDebut": "2019-09-18T15:30:00.000+02:00",
  "timestampFin": "2019-09-18T16:30:00.000+02:00",
  "lieu": {
    "code": "SALREU011",
    "libelleCourt": "Salle N° 2",
    "libelleLong": "Salle N° 2, 3, rue Aristide Briand"
  },
  "cycleDeVie": {
    "etat": "Confirmé",
    "chrono": {
      "creation": "2019-09-12T12:35:21.000+02:00"
    }
  },
  "demandeurs": {
    "acteurs": [
      {
        "nom": "Mme Marine LE PEN",
        "acteurRef": "PA720614"
      }
    ]
  },
  "typeReunion": "DEP"
}