{
  "xsiType": "reunionInitParlementaire_type",
  "uid": "RUANR5L15S2018IDF0109788",
  "timestampDebut": "2018-04-19T14:00:00.000+02:00",
  "timestampFin": "2018-04-19T15:00:00.000+02:00",
  "lieu": {
    "code": "SALREU022",
    "libelleCourt": "Salle 7326",
    "libelleLong": "Salle 7326, 101, rue de l'Université"
  },
  "cycleDeVie": {
    "etat": "Confirmé",
    "chrono": {
      "creation": "2018-04-11T16:28:46.000+02:00"
    }
  },
  "demandeurs": {
    "acteurs": [
      {
        "nom": "M. Raphaël SCHELLENBERGER",
        "acteurRef": "PA721314"
      }
    ]
  },
  "typeReunion": "DEP"
}