{
  "xsiType": "reunionInitParlementaire_type",
  "uid": "RUANR5L15S2019IDF0120396",
  "timestampDebut": "2018-12-18T10:00:00.000+01:00",
  "timestampFin": "2018-12-18T12:30:00.000+01:00",
  "lieu": {
    "code": "SALREU008",
    "libelleCourt": "5ème Bureau",
    "libelleLong": "5ème Bureau, Palais Bourbon"
  },
  "cycleDeVie": {
    "etat": "Confirmé",
    "chrono": {
      "creation": "2018-10-10T12:59:43.000+02:00"
    }
  },
  "demandeurs": {
    "acteurs": [
      {
        "nom": "Mme Cécile RILHAC",
        "acteurRef": "PA720900"
      }
    ]
  },
  "typeReunion": "DEP"
}