{
  "xsiType": "reunionInitParlementaire_type",
  "uid": "RUANR5L15S2018IDF0098935",
  "timestampDebut": "2017-11-08T14:15:00.000+01:00",
  "timestampFin": "2017-11-08T15:00:00.000+01:00",
  "lieu": {
    "code": "SALREU023",
    "libelleCourt": "Salle 7426",
    "libelleLong": "Salle 7426, 101, rue de l'Université"
  },
  "cycleDeVie": {
    "etat": "Confirmé",
    "chrono": {
      "creation": "2017-10-18T19:44:52.000+02:00"
    }
  },
  "demandeurs": {
    "acteurs": [
      {
        "nom": "M. Jean-François ELIAOU",
        "acteurRef": "PA719692"
      }
    ]
  },
  "typeReunion": "DEP"
}