{
  "xsiType": "reunionInitParlementaire_type",
  "uid": "RUANR5L15S2020IDF0138706",
  "timestampDebut": "2019-11-21T08:00:00.000+01:00",
  "timestampFin": "2019-11-21T09:00:00.000+01:00",
  "lieu": {
    "code": "SALREU019",
    "libelleCourt": "Salon Mars I",
    "libelleLong": "Salon Mars I, 101, rue de l'Université"
  },
  "cycleDeVie": {
    "etat": "Confirmé",
    "chrono": {
      "creation": "2019-08-29T13:16:43.000+02:00"
    }
  },
  "demandeurs": {
    "acteurs": [
      {
        "nom": "Mme Valérie GOMEZ-BASSAC",
        "acteurRef": "PA721784"
      }
    ]
  },
  "typeReunion": "DEP"
}