{
  "xsiType": "reunionInitParlementaire_type",
  "uid": "RUANR5L15S2019IDF0130522",
  "timestampDebut": "2019-04-02T12:45:00.000+02:00",
  "timestampFin": "2019-04-02T14:45:00.000+02:00",
  "lieu": {
    "code": "SALREU002",
    "libelleCourt": "Salle 7070",
    "libelleLong": "Salle 7070, 103, rue de l'Université"
  },
  "cycleDeVie": {
    "etat": "Confirmé",
    "chrono": {
      "creation": "2019-03-21T10:31:47.000+01:00"
    }
  },
  "demandeurs": {
    "acteurs": [
      {
        "nom": "M. Hervé BERVILLE",
        "acteurRef": "PA719218"
      }
    ]
  },
  "typeReunion": "DEP"
}