{
  "xsiType": "reunionCommission_type",
  "uid": "RUANR5L15S2019IDC430896",
  "timestampDebut": "2019-02-07T11:05:00.000+01:00",
  "timestampFin": "2019-02-07T12:30:00.000+01:00",
  "lieu": {
    "libelleLong": "salle 6237 (Développement durable)"
  },
  "cycleDeVie": {
    "etat": "Confirmé",
    "chrono": {
      "creation": "2018-11-22T00:00:00.000+01:00"
    }
  },
  "organeReuniRef": "PO757231",
  "participants": {
    "participantsInternes": [
      {
        "acteurRef": "PA605963",
        "presence": "absent"
      },
      {
        "acteurRef": "PA721046",
        "presence": "excusé"
      },
      {
        "acteurRef": "PA342415",
        "presence": "absent"
      },
      {
        "acteurRef": "PA720162",
        "presence": "absent"
      },
      {
        "acteurRef": "PA267233",
        "presence": "excusé"
      },
      {
        "acteurRef": "PA267766",
        "presence": "absent"
      },
      {
        "acteurRef": "PA720116",
        "presence": "absent"
      },
      {
        "acteurRef": "PA722000",
        "presence": "absent"
      },
      {
        "acteurRef": "PA719138",
        "presence": "absent"
      },
      {
        "acteurRef": "PA720520",
        "presence": "absent"
      },
      {
        "acteurRef": "PA719440",
        "presence": "absent"
      },
      {
        "acteurRef": "PA719740",
        "presence": "absent"
      },
      {
        "acteurRef": "PA330909",
        "presence": "absent"
      },
      {
        "acteurRef": "PA720538",
        "presence": "présent"
      },
      {
        "acteurRef": "PA712015",
        "presence": "absent"
      },
      {
        "acteurRef": "PA720652",
        "presence": "présent"
      },
      {
        "acteurRef": "PA722366",
        "presence": "absent"
      },
      {
        "acteurRef": "PA719060",
        "presence": "absent"
      },
      {
        "acteurRef": "PA719310",
        "presence": "absent"
      },
      {
        "acteurRef": "PA719882",
        "presence": "excusé"
      },
      {
        "acteurRef": "PA720738",
        "presence": "absent"
      },
      {
        "acteurRef": "PA721876",
        "presence": "absent"
      },
      {
        "acteurRef": "PA720892",
        "presence": "absent"
      },
      {
        "acteurRef": "PA721426",
        "presence": "présent"
      },
      {
        "acteurRef": "PA702052",
        "presence": "absent"
      },
      {
        "acteurRef": "PA719972",
        "presence": "présent"
      },
      {
        "acteurRef": "PA720014",
        "presence": "absent"
      },
      {
        "acteurRef": "PA720394",
        "presence": "absent"
      },
      {
        "acteurRef": "PA722110",
        "presence": "absent"
      }
    ]
  },
  "ouverturePresse": true,
  "odj": {
    "convocationOdj": [
      "Audition, en table ronde, ouverte à la presse : transition énergétique dans le transport aérien– Mme Nathalie Simmenauer, directrice développement durable Air France et M. Laurent Timsit, directeur affaires internationales et institutionnelles Air France et Air France KLM ;– Mme Lorelei Limousin, responsable des politiques climat-transports de Réseau action climat (RAC) ;– M. Stéphane Cueille, président du Comité de pilotage (Copil) du CORAC (Conseil pour la recherche aéronautique civile) et Mme Anne Bondiou-Clergerie, directrice recherche & développement, Espace et environnement du Groupement des industries françaises aéronautiques et spatiales (GIFAS).– des représentants de la Direction générale de l’aviation civile (DGAC)."
    ],
    "resumeOdj": [
      "audition, en table ronde, ouverte à la presse : transition énergétique dans le transport aérien :",
      "Mme Nathalie Simmenauer, directrice développement durable Air France et M. Laurent Timsit, directeur affaires internationales et institutionnelles Air France et Air France KLM ;",
      "Mme Lorelei Limousin, responsable des politiques climat-transports de Réseau action climat (RAC) ;",
      "M. Stéphane Cueille, président du Comité de pilotage (Copil) du CORAC (Conseil pour la recherche aéronautique civile) et Mme Anne Bondiou-Clergerie, directrice recherche & développement, Espace et environnement du Groupement des industries françaises aéronautiques et spatiales (GIFAS) ;",
      "des représentants de la Direction générale de l’aviation civile (DGAC)."
    ]
  },
  "compteRenduRef": "CRCANR5L15S2019PO757231N019",
  "formatReunion": "Ordinaire",
  "infosReunionsInternationale": {
    "estReunionInternationale": false
  },
  "captationVideo": false
}