{
  "xsiType": "reunionInitParlementaire_type",
  "uid": "RUANR5L15S2020IDF0143309",
  "timestampDebut": "2019-11-12T15:00:00.000+01:00",
  "timestampFin": "2019-11-12T16:30:00.000+01:00",
  "lieu": {
    "code": "SALREU010",
    "libelleCourt": "Salle N° 1",
    "libelleLong": "Salle N° 1, 3, rue Aristide Briand"
  },
  "cycleDeVie": {
    "etat": "Confirmé",
    "chrono": {
      "creation": "2019-11-06T15:31:12.000+01:00"
    }
  },
  "demandeurs": {
    "acteurs": [
      {
        "nom": "Mme Cécile RILHAC",
        "acteurRef": "PA720900"
      }
    ]
  },
  "typeReunion": "DEP"
}