{
  "xsiType": "reunionCommission_type",
  "uid": "RUANR5L15S2018IDC429001",
  "timestampDebut": "2018-04-10T18:30:00.000+02:00",
  "timestampFin": "2018-04-10T19:45:00.000+02:00",
  "lieu": {
    "libelleLong": "Salle 1 - 95 RU"
  },
  "cycleDeVie": {
    "etat": "Confirmé",
    "chrono": {
      "creation": "2018-03-26T00:00:00.000+02:00"
    }
  },
  "organeReuniRef": "PO740575",
  "participants": {},
  "ouverturePresse": false,
  "odj": {
    "convocationOdj": [
      "Audition de M. Denis Naas, membre du Conseil d’Administration de la FNSEA."
    ],
    "resumeOdj": [
      "audition de M. Denis Naas, membre du conseil d’administration de la FNSEA."
    ]
  },
  "formatReunion": "Ordinaire",
  "infosReunionsInternationale": {
    "estReunionInternationale": false
  },
  "captationVideo": false
}