{
  "xsiType": "reunionCommission_type",
  "uid": "RUANR5L15S2019IDC430739",
  "timestampDebut": "2018-12-20T11:00:00.000+01:00",
  "lieu": {
    "libelleLong": "salle 4013 (33 rue Saint-Dominique)"
  },
  "cycleDeVie": {
    "etat": "Supprimé",
    "chrono": {
      "creation": "2018-11-02T00:00:00.000+01:00",
      "cloture": "2018-12-07T00:00:00.000+01:00"
    }
  },
  "organeReuniRef": "PO756121",
  "participants": {},
  "ouverturePresse": false,
  "odj": {
    "convocationOdj": [
      "Audition du vice-amiral d'escadre Philippe Hello, directeur des ressources humaines du ministère des Armées, et du contre-amiral Anne de Clauzade de Mazieux, chargée de mission \"Labellisation Diversité\"."
    ],
    "resumeOdj": [
      "audition du vice-amiral d'escadre Philippe Hello, directeur des ressources humaines du ministère des Armées, et du contre-amiral Anne de Clauzade de Mazieux, chargée de mission \"Labellisation Diversité\"."
    ]
  },
  "formatReunion": "Ordinaire",
  "infosReunionsInternationale": {
    "estReunionInternationale": false
  },
  "captationVideo": false
}