{
  "xsiType": "reunionInitParlementaire_type",
  "uid": "RUANR5L15S2018IDF0117989",
  "timestampDebut": "2018-09-19T11:00:00.000+02:00",
  "timestampFin": "2018-09-19T12:00:00.000+02:00",
  "lieu": {
    "code": "SALREU012",
    "libelleCourt": "Salle N° 23",
    "libelleLong": "Salle N° 23, 3, rue Aristide Briand"
  },
  "cycleDeVie": {
    "etat": "Confirmé",
    "chrono": {
      "creation": "2018-09-10T11:28:18.000+02:00"
    }
  },
  "demandeurs": {
    "acteurs": [
      {
        "nom": "M. Didier BAICHÈRE",
        "acteurRef": "PA721776"
      }
    ]
  },
  "typeReunion": "DEP"
}