{
  "xsiType": "reunionInitParlementaire_type",
  "uid": "RUANR5L15S2017IDF0095071",
  "timestampDebut": "2017-09-18T14:00:00.000+02:00",
  "timestampFin": "2017-09-18T18:00:00.000+02:00",
  "lieu": {
    "code": "SALREU019",
    "libelleCourt": "Salon Mars I",
    "libelleLong": "Salon Mars I, 101, rue de l'Université"
  },
  "cycleDeVie": {
    "etat": "Annulé",
    "chrono": {
      "creation": "2017-08-02T17:21:19.000+02:00",
      "cloture": "2017-09-14T15:51:27.000+02:00"
    }
  },
  "demandeurs": {
    "acteurs": [
      {
        "nom": "M. Rémy REBEYROTTE",
        "acteurRef": "PA722398"
      }
    ]
  },
  "typeReunion": "DEP"
}