{
  "xsiType": "reunionInitParlementaire_type",
  "uid": "RUANR5L15S2019IDF0129224",
  "timestampDebut": "2019-04-10T16:30:00.000+02:00",
  "timestampFin": "2019-04-10T19:00:00.000+02:00",
  "lieu": {
    "code": "SALREU039",
    "libelleCourt": "Salle 6550",
    "libelleLong": "Salle 6550, Palais Bourbon"
  },
  "cycleDeVie": {
    "etat": "Confirmé",
    "chrono": {
      "creation": "2019-03-06T16:10:58.000+01:00"
    }
  },
  "demandeurs": {
    "acteurs": [
      {
        "nom": "Mme Perrine GOULET",
        "acteurRef": "PA720560"
      }
    ]
  },
  "typeReunion": "DEP"
}