{
  "xsiType": "reunionInitParlementaire_type",
  "uid": "RUANR5L15S2019IDF0138081",
  "timestampDebut": "2019-07-30T10:00:00.000+02:00",
  "timestampFin": "2019-07-30T14:00:00.000+02:00",
  "lieu": {
    "code": "SALREU012",
    "libelleCourt": "Salle N° 23",
    "libelleLong": "Salle N° 23, 3, rue Aristide Briand"
  },
  "cycleDeVie": {
    "etat": "Confirmé",
    "chrono": {
      "creation": "2019-07-26T09:44:37.000+02:00"
    }
  },
  "demandeurs": {
    "acteurs": [
      {
        "nom": "M. Jean LASSALLE",
        "acteurRef": "PA1838"
      }
    ]
  },
  "typeReunion": "DEP"
}