{
  "xsiType": "reunionCommission_type",
  "uid": "RUANR5L15S2018IDC428656",
  "timestampDebut": "2018-03-29T11:30:00.000+02:00",
  "timestampFin": "2018-03-29T12:40:00.000+02:00",
  "lieu": {
    "libelleLong": "salle 6566 (Lois)"
  },
  "cycleDeVie": {
    "etat": "Confirmé",
    "chrono": {
      "creation": "2018-02-21T00:00:00.000+01:00"
    }
  },
  "organeReuniRef": "PO742386",
  "participants": {
    "participantsInternes": [
      {
        "acteurRef": "PA330008",
        "presence": "excusé"
      },
      {
        "acteurRef": "PA267766",
        "presence": "absent"
      },
      {
        "acteurRef": "PA722000",
        "presence": "présent"
      },
      {
        "acteurRef": "PA721860",
        "presence": "excusé"
      },
      {
        "acteurRef": "PA719748",
        "presence": "absent"
      },
      {
        "acteurRef": "PA330909",
        "presence": "absent"
      },
      {
        "acteurRef": "PA719060",
        "presence": "présent"
      },
      {
        "acteurRef": "PA719994",
        "presence": "absent"
      },
      {
        "acteurRef": "PA722228",
        "presence": "présent"
      },
      {
        "acteurRef": "PA721530",
        "presence": "absent"
      },
      {
        "acteurRef": "PA720892",
        "presence": "absent"
      },
      {
        "acteurRef": "PA719202",
        "presence": "absent"
      },
      {
        "acteurRef": "PA722398",
        "presence": "absent"
      },
      {
        "acteurRef": "PA721426",
        "presence": "absent"
      },
      {
        "acteurRef": "PA340343",
        "presence": "absent"
      },
      {
        "acteurRef": "PA610667",
        "presence": "excusé"
      },
      {
        "acteurRef": "PA718860",
        "presence": "présent"
      },
      {
        "acteurRef": "PA722336",
        "presence": "présent"
      },
      {
        "acteurRef": "PA709315",
        "presence": "présent"
      },
      {
        "acteurRef": "PA721262",
        "presence": "présent"
      }
    ]
  },
  "ouverturePresse": true,
  "odj": {
    "convocationOdj": [
      "Audition, ouverte à la presse, de M. Benoist Apparu, ancien ministre du Logement, Maire de Châlons-en-Champagne et Président du Directoire INLI, Groupe ActionLogement"
    ],
    "resumeOdj": [
      "audition, ouverte à la presse, de M. Benoist Apparu, ancien ministre du logement, Maire de Châlons-en-Champagne et Président du Directoire INLI, Groupe ActionLogement."
    ]
  },
  "formatReunion": "Ordinaire",
  "infosReunionsInternationale": {
    "estReunionInternationale": false
  },
  "captationVideo": false
}