{
  "xsiType": "reunionInitParlementaire_type",
  "uid": "RUANR5L15S2019IDF0138376",
  "timestampDebut": "2019-09-30T16:00:00.000+02:00",
  "timestampFin": "2019-09-30T19:00:00.000+02:00",
  "lieu": {
    "code": "SALREU001",
    "libelleCourt": "Salle Lamartine",
    "libelleLong": "Salle Lamartine, 101, rue de l'Université"
  },
  "cycleDeVie": {
    "etat": "Annulé",
    "chrono": {
      "creation": "2019-08-08T16:08:27.000+02:00",
      "cloture": "2019-09-27T17:49:37.000+02:00"
    }
  },
  "demandeurs": {
    "acteurs": [
      {
        "nom": "M. Stéphane VIRY",
        "acteurRef": "PA721474"
      },
      {
        "nom": "Mme Nathalie ELIMAS",
        "acteurRef": "PA720924"
      }
    ]
  },
  "typeReunion": "DEP"
}