{
  "xsiType": "reunionInitParlementaire_type",
  "uid": "RUANR5L15S2019IDF0137061",
  "timestampDebut": "2019-07-17T11:30:00.000+02:00",
  "timestampFin": "2019-07-17T12:30:00.000+02:00",
  "lieu": {
    "code": "SALREU006",
    "libelleCourt": "3ème Bureau",
    "libelleLong": "3ème Bureau, Palais Bourbon"
  },
  "cycleDeVie": {
    "etat": "Confirmé",
    "chrono": {
      "creation": "2019-07-08T15:55:21.000+02:00"
    }
  },
  "demandeurs": {
    "acteurs": [
      {
        "nom": "M. Raphaël GÉRARD",
        "acteurRef": "PA719108"
      }
    ]
  },
  "typeReunion": "DEP"
}