{
  "xsiType": "reunionInitParlementaire_type",
  "uid": "RUANR5L15S2018IDF0102866",
  "timestampDebut": "2018-06-26T11:15:00.000+02:00",
  "timestampFin": "2018-06-26T12:30:00.000+02:00",
  "lieu": {
    "code": "SALREU027",
    "libelleCourt": "Salle 6217",
    "libelleLong": "Salle 6217, Palais Bourbon"
  },
  "cycleDeVie": {
    "etat": "Confirmé",
    "chrono": {
      "creation": "2017-12-20T15:17:58.000+01:00"
    }
  },
  "demandeurs": {
    "organe": {
      "nom": "GROUPE LES RÉPUBLICAINS",
      "organeRef": "PO730934"
    }
  },
  "organeReuniRef": "PO730934",
  "typeReunion": "GP"
}