{
  "xsiType": "reunionInitParlementaire_type",
  "uid": "RUANR5L15S2019IDF0122346",
  "timestampDebut": "2018-11-14T16:30:00.000+01:00",
  "timestampFin": "2018-11-14T18:00:00.000+01:00",
  "lieu": {
    "code": "SALREU017",
    "libelleCourt": "Salon Visconti",
    "libelleLong": "Salon Visconti, 101, rue de l'Université"
  },
  "cycleDeVie": {
    "etat": "Confirmé",
    "chrono": {
      "creation": "2018-11-13T17:46:18.000+01:00"
    }
  },
  "demandeurs": {
    "acteurs": [
      {
        "nom": "Mme Emmanuelle FONTAINE-DOMEIZEL",
        "acteurRef": "PA718706"
      }
    ]
  },
  "typeReunion": "DEP"
}