{
  "xsiType": "reunionInitParlementaire_type",
  "uid": "RUANR5L15S2018IDF0116438",
  "timestampDebut": "2018-08-01T10:00:00.000+02:00",
  "timestampFin": "2018-08-01T12:00:00.000+02:00",
  "lieu": {
    "code": "SALREU007",
    "libelleCourt": "4ème Bureau",
    "libelleLong": "4ème Bureau, Palais Bourbon"
  },
  "cycleDeVie": {
    "etat": "Confirmé",
    "chrono": {
      "creation": "2018-07-31T12:02:25.000+02:00"
    }
  },
  "demandeurs": {
    "acteurs": [
      {
        "nom": "Mme Olga GIVERNET",
        "acteurRef": "PA718674"
      }
    ]
  },
  "typeReunion": "DEP"
}