{
  "xsiType": "reunionCommission_type",
  "uid": "RUANR5L15S2018IDC430227",
  "timestampDebut": "2018-09-05T16:30:00.000+02:00",
  "lieu": {
    "libelleLong": "salle 6242 (Lois)"
  },
  "cycleDeVie": {
    "etat": "Confirmé",
    "chrono": {
      "creation": "2018-09-03T00:00:00.000+02:00"
    }
  },
  "organeReuniRef": "PO750141",
  "participants": {},
  "ouverturePresse": true,
  "odj": {
    "convocationOdj": [
      "Table ronde d’avocats :- Conseil national des barreaux (CNB), représenté par Mme Sophie Ferry-Bouillon, membre de la commission « Libertés et droits de l’homme », et par M. Étienne Papin, avocat ;- Barreau de Paris, représenté par MM. Basile Ader, vice-bâtonnier, et Emmanuel Daoud, membre du Conseil de l’Ordre ;- Conférence des bâtonniers, représentée par M. Stéphane Campana."
    ],
    "resumeOdj": [
      "table ronde d’avocats :",
      "Conseil national des barreaux (CNB), représenté par Mme Sophie Ferry-Bouillon, membre de la commission « Libertés et droits de l’homme », et par M. Étienne Papin, avocat ;",
      "Barreau de Paris, représenté par MM. Basile Ader, vice-bâtonnier, et Emmanuel Daoud, membre du Conseil de l’Ordre ;",
      "Conférence des bâtonniers, représentée par M. Stéphane Campana."
    ]
  },
  "formatReunion": "Ordinaire",
  "infosReunionsInternationale": {
    "estReunionInternationale": false
  },
  "captationVideo": false
}