{
  "xsiType": "reunionCommission_type",
  "uid": "RUANR5L15S2018IDC427247",
  "timestampDebut": "2017-10-25T09:30:00.000+02:00",
  "lieu": {
    "libelleLong": "lieu à préciser ultérieurement"
  },
  "cycleDeVie": {
    "etat": "Supprimé",
    "chrono": {
      "creation": "2017-09-08T00:00:00.000+02:00",
      "cloture": "2017-10-05T00:00:00.000+02:00"
    }
  },
  "organeReuniRef": "PO59047",
  "participants": {},
  "ouverturePresse": false,
  "odj": {
    "convocationOdj": [
      "– Présentation des avis budgétaires de la Commission des affaires étrangères sur le projet de loi de finances 2018."
    ],
    "resumeOdj": [
      "– Présentation des avis budgétaires de la Commission des affaires étrangères sur le projet de loi de finances 2018."
    ]
  },
  "formatReunion": "Ordinaire",
  "infosReunionsInternationale": {
    "estReunionInternationale": false
  },
  "captationVideo": false
}