{
  "xsiType": "reunionInitParlementaire_type",
  "uid": "RUANR5L15S2018IDF0118344",
  "timestampDebut": "2018-09-18T16:00:00.000+02:00",
  "timestampFin": "2018-09-18T17:00:00.000+02:00",
  "lieu": {
    "code": "SALREU021",
    "libelleCourt": "Salle 7207",
    "libelleLong": "Salle 7207, 101, rue de l'Université"
  },
  "cycleDeVie": {
    "etat": "Confirmé",
    "chrono": {
      "creation": "2018-09-12T17:57:29.000+02:00"
    }
  },
  "demandeurs": {
    "acteurs": [
      {
        "nom": "Mme Constance LE GRIP",
        "acteurRef": "PA345722"
      }
    ]
  },
  "typeReunion": "DEP"
}