{
  "xsiType": "reunionInitParlementaire_type",
  "uid": "RUANR5L15S2019IDF0130380",
  "timestampDebut": "2019-04-11T08:30:00.000+02:00",
  "timestampFin": "2019-04-11T09:30:00.000+02:00",
  "lieu": {
    "code": "SALREU022",
    "libelleCourt": "Salle 7326",
    "libelleLong": "Salle 7326, 101, rue de l'Université"
  },
  "cycleDeVie": {
    "etat": "Confirmé",
    "chrono": {
      "creation": "2019-03-20T10:36:35.000+01:00"
    }
  },
  "demandeurs": {
    "acteurs": [
      {
        "nom": "Mme Anne-France BRUNET",
        "acteurRef": "PA720116"
      }
    ]
  },
  "typeReunion": "DEP"
}