{
  "xsiType": "reunionInitParlementaire_type",
  "uid": "RUANR5L15S2018IDF0114104",
  "timestampDebut": "2018-06-21T16:30:00.000+02:00",
  "timestampFin": "2018-06-21T17:30:00.000+02:00",
  "lieu": {
    "code": "SALREU021",
    "libelleCourt": "Salle 7207",
    "libelleLong": "Salle 7207, 101, rue de l'Université"
  },
  "cycleDeVie": {
    "etat": "Confirmé",
    "chrono": {
      "creation": "2018-06-21T15:24:41.000+02:00"
    }
  },
  "demandeurs": {
    "acteurs": [
      {
        "nom": "M. François CORMIER-BOULIGEON",
        "acteurRef": "PA719118"
      }
    ]
  },
  "typeReunion": "DEP"
}