{
  "xsiType": "reunionInitParlementaire_type",
  "uid": "RUANR5L15S2018IDF0116546",
  "timestampDebut": "2018-09-20T10:00:00.000+02:00",
  "timestampFin": "2018-09-20T12:30:00.000+02:00",
  "lieu": {
    "code": "SALREU023",
    "libelleCourt": "Salle 7426",
    "libelleLong": "Salle 7426, 101, rue de l'Université"
  },
  "cycleDeVie": {
    "etat": "Confirmé",
    "chrono": {
      "creation": "2018-08-02T11:09:37.000+02:00"
    }
  },
  "demandeurs": {
    "acteurs": [
      {
        "nom": "M. François CORMIER-BOULIGEON",
        "acteurRef": "PA719118"
      }
    ]
  },
  "typeReunion": "DEP"
}