{
  "xsiType": "reunionInitParlementaire_type",
  "uid": "RUANR5L15S2018IDF0109987",
  "timestampDebut": "2018-04-20T14:00:00.000+02:00",
  "timestampFin": "2018-04-20T17:00:00.000+02:00",
  "lieu": {
    "code": "SALREU009",
    "libelleCourt": "8ème Bureau",
    "libelleLong": "8ème Bureau, Palais Bourbon"
  },
  "cycleDeVie": {
    "etat": "Confirmé",
    "chrono": {
      "creation": "2018-04-13T14:42:11.000+02:00"
    }
  },
  "demandeurs": {
    "organe": {
      "nom": "GROUPE LA FRANCE INSOUMISE",
      "organeRef": "PO730958"
    }
  },
  "organeReuniRef": "PO730958",
  "typeReunion": "GP"
}