{
  "xsiType": "reunionInitParlementaire_type",
  "uid": "RUANR5L15S2019IDF0134699",
  "timestampDebut": "2019-06-13T14:00:00.000+02:00",
  "timestampFin": "2019-06-13T16:00:00.000+02:00",
  "lieu": {
    "code": "SALREU013",
    "libelleCourt": "Salle N° 3",
    "libelleLong": "Salle N° 3, 3, rue Aristide Briand"
  },
  "cycleDeVie": {
    "etat": "Confirmé",
    "chrono": {
      "creation": "2019-05-28T18:33:37.000+02:00"
    }
  },
  "demandeurs": {
    "acteurs": [
      {
        "nom": "M. Rodrigue KOKOUENDO",
        "acteurRef": "PA721644"
      }
    ]
  },
  "typeReunion": "DEP"
}