{
  "xsiType": "reunionInitParlementaire_type",
  "uid": "RUANR5L15S2018IDF0107502",
  "timestampDebut": "2018-03-22T09:30:00.000+01:00",
  "timestampFin": "2018-03-22T16:00:00.000+01:00",
  "lieu": {
    "code": "SALREU041",
    "libelleCourt": "Sully 5",
    "libelleLong": "Sully 5, Palais Bourbon"
  },
  "cycleDeVie": {
    "etat": "Confirmé",
    "chrono": {
      "creation": "2018-03-13T11:01:17.000+01:00"
    }
  },
  "demandeurs": {
    "acteurs": [
      {
        "nom": "M. Jean LASSALLE",
        "acteurRef": "PA1838"
      }
    ]
  },
  "typeReunion": "DEP"
}