{
  "xsiType": "reunionCommission_type",
  "uid": "RUANR5L15S2018IDC430016",
  "timestampDebut": "2018-06-30T09:30:00.000+02:00",
  "lieu": {
    "libelleLong": "salle Lamartine - 1er sous-sol du 101, rue de l'Université)"
  },
  "cycleDeVie": {
    "etat": "Supprimé",
    "chrono": {
      "creation": "2018-06-29T00:00:00.000+02:00",
      "cloture": "2018-06-29T00:00:00.000+02:00"
    }
  },
  "organeReuniRef": "PO59051",
  "participants": {},
  "ouverturePresse": false,
  "odj": {
    "convocationOdj": [
      "Eventuellement, suite de l'ordre du jour de la veille"
    ],
    "resumeOdj": [
      "démocratie plus représentative, responsable et efficace (n° 911) (première lecture) (suite)."
    ]
  },
  "formatReunion": "Ordinaire",
  "infosReunionsInternationale": {
    "estReunionInternationale": false
  },
  "captationVideo": false
}