{
  "xsiType": "reunionInitParlementaire_type",
  "uid": "RUANR5L15S2019IDF0120526",
  "timestampDebut": "2018-10-18T14:00:00.000+02:00",
  "timestampFin": "2018-10-18T15:00:00.000+02:00",
  "lieu": {
    "code": "SALREU042",
    "libelleCourt": "Salle 6566",
    "libelleLong": "Salle 6566, Palais Bourbon"
  },
  "cycleDeVie": {
    "etat": "Confirmé",
    "chrono": {
      "creation": "2018-10-11T16:23:13.000+02:00"
    }
  },
  "demandeurs": {
    "acteurs": [
      {
        "nom": "Mme Lise MAGNIER",
        "acteurRef": "PA720230"
      }
    ]
  },
  "typeReunion": "DEP"
}