{
  "xsiType": "reunionInitParlementaire_type",
  "uid": "RUANR5L15S2019IDF0129054",
  "timestampDebut": "2019-03-12T09:00:00.000+01:00",
  "timestampFin": "2019-03-12T11:30:00.000+01:00",
  "lieu": {
    "code": "SALREU019",
    "libelleCourt": "Salon Mars I",
    "libelleLong": "Salon Mars I, 101, rue de l'Université"
  },
  "cycleDeVie": {
    "etat": "Confirmé",
    "chrono": {
      "creation": "2019-03-05T13:49:49.000+01:00"
    }
  },
  "demandeurs": {
    "acteurs": [
      {
        "nom": "M. Fabien MATRAS",
        "acteurRef": "PA721800"
      }
    ]
  },
  "typeReunion": "DEP"
}