{
  "xsiType": "seance_type",
  "uid": "RUANR5L15S2018IDS20886",
  "timestampDebut": "2018-01-30T15:00:00.000+01:00",
  "timestampFin": "2018-01-30T16:45:00.000+01:00",
  "lieu": {
    "code": "AN",
    "libelleLong": "Assemblée nationale"
  },
  "cycleDeVie": {
    "etat": "Confirmé",
    "chrono": {
      "creation": "2018-01-11T00:00:00.000+01:00"
    }
  },
  "organeReuniRef": "PO717460",
  "sessionRef": "SCR5A2018O1",
  "ouverturePresse": true,
  "odj": {
    "pointsOdj": [
      {
        "xsiType": "podjSeanceConfPres_type",
        "uid": "RUANR5L15S2018IDS20886PT35477",
        "cycleDeVie": {
          "etat": "Confirmé",
          "chrono": {
            "creation": "2018-01-11T00:00:00.000+01:00"
          }
        },
        "objet": "Questions au Gouvernement",
        "typePointOdj": "Questions au Gouvernement",
        "comiteSecret": false,
        "natureTravauxOdj": "ODJPR"
      },
      {
        "xsiType": "podjSeanceConfPres_type",
        "uid": "RUANR5L15S2018IDS20886PT35488",
        "cycleDeVie": {
          "etat": "Confirmé",
          "chrono": {
            "creation": "2018-01-12T00:00:00.000+01:00"
          }
        },
        "objet": "Explications de vote et vote par scrutin public sur le projet de loi pour un État au service d'une société de confiance",
        "dossiersLegislatifsRefs": [
          "DLR5L15N36159"
        ],
        "typePointOdj": "Explications de vote et vote par scrutin public",
        "comiteSecret": false,
        "natureTravauxOdj": "ODJPR"
      },
      {
        "xsiType": "podjSeanceConfPres_type",
        "uid": "RUANR5L15S2018IDS20886PT35607",
        "cycleDeVie": {
          "etat": "Supprimé",
          "chrono": {
            "creation": "2018-01-29T00:00:00.000+01:00",
            "cloture": "2018-01-30T00:00:00.000+01:00"
          }
        },
        "objet": "Fixation de l'ordre du jour",
        "typePointOdj": "Fixation de l'ordre du jour",
        "comiteSecret": false,
        "natureTravauxOdj": "ODJPR"
      }
    ]
  },
  "compteRenduRef": "CRSANR5L15S2018O1N127",
  "identifiants": {
    "numSeanceJo": "127",
    "idJo": "20180127",
    "quantieme": "Deuxième",
    "dateSeance": "2018-01-30T01:00:00.000+01:00"
  },
  "captationVideo": true
}