{
  "xsiType": "reunionCommission_type",
  "uid": "RUANR5L15S2019IDC432963",
  "timestampDebut": "2019-06-05T11:25:00.000+02:00",
  "timestampFin": "2019-06-05T12:50:00.000+02:00",
  "lieu": {
    "libelleLong": "salle 6242 (Lois)"
  },
  "cycleDeVie": {
    "etat": "Confirmé",
    "chrono": {
      "creation": "2019-05-29T00:00:00.000+02:00"
    }
  },
  "organeReuniRef": "PO59051",
  "participants": {
    "participantsInternes": [
      {
        "acteurRef": "PA719866",
        "presence": "présent"
      },
      {
        "acteurRef": "PA719146",
        "presence": "présent"
      },
      {
        "acteurRef": "PA721158",
        "presence": "présent"
      },
      {
        "acteurRef": "PA721624",
        "presence": "présent"
      },
      {
        "acteurRef": "PA719558",
        "presence": "présent"
      },
      {
        "acteurRef": "PA441",
        "presence": "excusé"
      },
      {
        "acteurRef": "PA720430",
        "presence": "absent"
      },
      {
        "acteurRef": "PA606507",
        "presence": "présent"
      },
      {
        "acteurRef": "PA721908",
        "presence": "présent"
      },
      {
        "acteurRef": "PA330008",
        "presence": "présent"
      },
      {
        "acteurRef": "PA720772",
        "presence": "présent"
      },
      {
        "acteurRef": "PA719748",
        "presence": "présent"
      },
      {
        "acteurRef": "PA267429",
        "presence": "présent"
      },
      {
        "acteurRef": "PA330240",
        "presence": "présent"
      },
      {
        "acteurRef": "PA718850",
        "presence": "présent"
      },
      {
        "acteurRef": "PA267440",
        "presence": "absent"
      },
      {
        "acteurRef": "PA719684",
        "presence": "présent"
      },
      {
        "acteurRef": "PA720154",
        "presence": "présent"
      },
      {
        "acteurRef": "PA721094",
        "presence": "excusé"
      },
      {
        "acteurRef": "PA719692",
        "presence": "excusé"
      },
      {
        "acteurRef": "PA719616",
        "presence": "présent"
      },
      {
        "acteurRef": "PA721702",
        "presence": "absent"
      },
      {
        "acteurRef": "PA721742",
        "presence": "présent"
      },
      {
        "acteurRef": "PA721142",
        "presence": "excusé"
      },
      {
        "acteurRef": "PA721364",
        "presence": "présent"
      },
      {
        "acteurRef": "PA266797",
        "presence": "excusé"
      },
      {
        "acteurRef": "PA721296",
        "presence": "présent"
      },
      {
        "acteurRef": "PA721792",
        "presence": "présent"
      },
      {
        "acteurRef": "PA721880",
        "presence": "présent"
      },
      {
        "acteurRef": "PA720454",
        "presence": "absent"
      },
      {
        "acteurRef": "PA722150",
        "presence": "présent"
      },
      {
        "acteurRef": "PA267200",
        "presence": "excusé"
      },
      {
        "acteurRef": "PA719874",
        "presence": "présent"
      },
      {
        "acteurRef": "PA267901",
        "presence": "excusé"
      },
      {
        "acteurRef": "PA719994",
        "presence": "absent"
      },
      {
        "acteurRef": "PA335054",
        "presence": "présent"
      },
      {
        "acteurRef": "PA267785",
        "presence": "présent"
      },
      {
        "acteurRef": "PA721984",
        "presence": "présent"
      },
      {
        "acteurRef": "PA721932",
        "presence": "présent"
      },
      {
        "acteurRef": "PA718918",
        "presence": "présent"
      },
      {
        "acteurRef": "PA606098",
        "presence": "présent"
      },
      {
        "acteurRef": "PA346218",
        "presence": "présent"
      },
      {
        "acteurRef": "PA721800",
        "presence": "présent"
      },
      {
        "acteurRef": "PA677483",
        "presence": "présent"
      },
      {
        "acteurRef": "PA719608",
        "presence": "présent"
      },
      {
        "acteurRef": "PA720370",
        "presence": "présent"
      },
      {
        "acteurRef": "PA719952",
        "presence": "présent"
      },
      {
        "acteurRef": "PA607619",
        "presence": "présent"
      },
      {
        "acteurRef": "PA266788",
        "presence": "présent"
      },
      {
        "acteurRef": "PA720908",
        "presence": "présent"
      },
      {
        "acteurRef": "PA721960",
        "presence": "présent"
      },
      {
        "acteurRef": "PA719202",
        "presence": "présent"
      },
      {
        "acteurRef": "PA335532",
        "presence": "présent"
      },
      {
        "acteurRef": "PA721568",
        "presence": "présent"
      },
      {
        "acteurRef": "PA721270",
        "presence": "présent"
      },
      {
        "acteurRef": "PA2449",
        "presence": "présent"
      },
      {
        "acteurRef": "PA720100",
        "presence": "absent"
      },
      {
        "acteurRef": "PA643127",
        "presence": "présent"
      },
      {
        "acteurRef": "PA722398",
        "presence": "présent"
      },
      {
        "acteurRef": "PA721678",
        "presence": "présent"
      },
      {
        "acteurRef": "PA722292",
        "presence": "présent"
      },
      {
        "acteurRef": "PA721616",
        "presence": "présent"
      },
      {
        "acteurRef": "PA702052",
        "presence": "excusé"
      },
      {
        "acteurRef": "PA340343",
        "presence": "présent"
      },
      {
        "acteurRef": "PA721314",
        "presence": "présent"
      },
      {
        "acteurRef": "PA721584",
        "presence": "présent"
      },
      {
        "acteurRef": "PA719302",
        "presence": "absent"
      },
      {
        "acteurRef": "PA2828",
        "presence": "absent"
      },
      {
        "acteurRef": "PA608695",
        "presence": "présent"
      },
      {
        "acteurRef": "PA709315",
        "presence": "présent"
      },
      {
        "acteurRef": "PA720704",
        "presence": "présent"
      },
      {
        "acteurRef": "PA721262",
        "presence": "présent"
      },
      {
        "acteurRef": "PA2952",
        "presence": "présent"
      },
      {
        "acteurRef": "PA720318",
        "presence": "absent"
      }
    ]
  },
  "ouverturePresse": false,
  "odj": {
    "convocationOdj": [
      "Audition de M. Cédric O, Secrétaire d'État auprès du ministre de l’Économie et des Finances et du ministre de l’Action et des Comptes publics, chargé du Numérique."
    ],
    "resumeOdj": [
      "audition de M. Cédric O, secrétaire d'État auprès du ministre de l’économie et des finances et du ministre de l’action et des comptes publics, chargé du numérique."
    ]
  },
  "compteRenduRef": "CRCANR5L15S2019PO59051N082",
  "formatReunion": "Ordinaire",
  "infosReunionsInternationale": {
    "estReunionInternationale": false
  },
  "captationVideo": false
}