{
  "xsiType": "reunionCommission_type",
  "uid": "RUANR5L15S2019IDC431452",
  "timestampDebut": "2019-02-05T15:00:00.000+01:00",
  "lieu": {
    "libelleLong": "salle 6549 (2e étage)"
  },
  "cycleDeVie": {
    "etat": "Confirmé",
    "chrono": {
      "creation": "2019-02-01T00:00:00.000+01:00"
    }
  },
  "organeReuniRef": "PO759869",
  "participants": {},
  "ouverturePresse": true,
  "odj": {
    "convocationOdj": [
      "Audition de représentants du ministère de l’intérieur."
    ],
    "resumeOdj": [
      "audition de représentants du ministère de l’intérieur."
    ]
  },
  "formatReunion": "Ordinaire",
  "infosReunionsInternationale": {
    "estReunionInternationale": false
  },
  "captationVideo": false
}