{
  "xsiType": "reunionInitParlementaire_type",
  "uid": "RUANR5L15S2019IDF0133971",
  "timestampDebut": "2019-07-11T10:00:00.000+02:00",
  "timestampFin": "2019-07-11T20:00:00.000+02:00",
  "lieu": {
    "code": "SALREU022",
    "libelleCourt": "Salle 7326",
    "libelleLong": "Salle 7326, 101, rue de l'Université"
  },
  "cycleDeVie": {
    "etat": "Confirmé",
    "chrono": {
      "creation": "2019-05-16T13:48:31.000+02:00"
    }
  },
  "demandeurs": {
    "acteurs": [
      {
        "nom": "M. Patrice ANATO",
        "acteurRef": "PA721278"
      }
    ]
  },
  "typeReunion": "DEP"
}