{
  "xsiType": "reunionInitParlementaire_type",
  "uid": "RUANR5L15S2019IDF0122839",
  "timestampDebut": "2018-12-20T09:00:00.000+01:00",
  "timestampFin": "2018-12-20T13:00:00.000+01:00",
  "lieu": {
    "code": "SALREU016",
    "libelleCourt": "Salon Gabriel",
    "libelleLong": "Salon Gabriel, 101, rue de l'Université"
  },
  "cycleDeVie": {
    "etat": "Confirmé",
    "chrono": {
      "creation": "2018-11-22T14:09:11.000+01:00"
    }
  },
  "demandeurs": {
    "acteurs": [
      {
        "nom": "Mme Christine HENNION",
        "acteurRef": "PA722094"
      }
    ]
  },
  "typeReunion": "DEP"
}