{
  "xsiType": "reunionInitParlementaire_type",
  "uid": "RUANR5L15S2019IDF0127444",
  "timestampDebut": "2019-04-10T17:00:00.000+02:00",
  "timestampFin": "2019-04-10T18:00:00.000+02:00",
  "lieu": {
    "code": "SALREU038",
    "libelleCourt": "Salle 6549",
    "libelleLong": "Salle 6549, Palais Bourbon"
  },
  "cycleDeVie": {
    "etat": "Confirmé",
    "chrono": {
      "creation": "2019-02-12T16:19:32.000+01:00"
    }
  },
  "demandeurs": {
    "acteurs": [
      {
        "nom": "M. Éric DIARD",
        "acteurRef": "PA267440"
      },
      {
        "nom": "M. Éric POULLIAT",
        "acteurRef": "PA719600"
      }
    ]
  },
  "typeReunion": "DEP"
}