{
  "xsiType": "reunionInitParlementaire_type",
  "uid": "RUANR5L15S2018IDF0111545",
  "timestampDebut": "2018-05-30T14:00:00.000+02:00",
  "timestampFin": "2018-05-30T18:30:00.000+02:00",
  "lieu": {
    "code": "SALREU044",
    "libelleCourt": "Sully 2",
    "libelleLong": "Sully 2, Palais Bourbon"
  },
  "cycleDeVie": {
    "etat": "Confirmé",
    "chrono": {
      "creation": "2018-05-15T17:32:37.000+02:00"
    }
  },
  "demandeurs": {
    "acteurs": [
      {
        "nom": "Mme Anne-Laure CATTELOT",
        "acteurRef": "PA720520"
      }
    ]
  },
  "typeReunion": "DEP"
}