{
  "xsiType": "reunionInitParlementaire_type",
  "uid": "RUANR5L15S2019IDF0134900",
  "timestampDebut": "2019-07-23T18:00:00.000+02:00",
  "timestampFin": "2019-07-23T19:30:00.000+02:00",
  "lieu": {
    "code": "SALREU049",
    "libelleCourt": "Salle 6822",
    "libelleLong": "Salle 6822, Palais Bourbon"
  },
  "cycleDeVie": {
    "etat": "Confirmé",
    "chrono": {
      "creation": "2019-06-03T14:13:34.000+02:00"
    }
  },
  "demandeurs": {
    "acteurs": [
      {
        "nom": "Mme Émilie CARIOU",
        "acteurRef": "PA720298"
      }
    ]
  },
  "typeReunion": "DEP"
}