{
  "xsiType": "reunionInitParlementaire_type",
  "uid": "RUANR5L15S2018IDF0113347",
  "timestampDebut": "2018-07-03T16:00:00.000+02:00",
  "timestampFin": "2018-07-03T19:00:00.000+02:00",
  "lieu": {
    "code": "SALREU010",
    "libelleCourt": "Salle N° 1",
    "libelleLong": "Salle N° 1, 3, rue Aristide Briand"
  },
  "cycleDeVie": {
    "etat": "Confirmé",
    "chrono": {
      "creation": "2018-06-08T16:19:44.000+02:00"
    }
  },
  "demandeurs": {
    "acteurs": [
      {
        "nom": "M. Pascal BOIS",
        "acteurRef": "PA720576"
      },
      {
        "nom": "Mme Émilie CARIOU",
        "acteurRef": "PA720298"
      }
    ]
  },
  "typeReunion": "DEP"
}