{
  "xsiType": "reunionInitParlementaire_type",
  "uid": "RUANR5L15S2019IDF0122740",
  "timestampDebut": "2018-11-29T10:00:00.000+01:00",
  "timestampFin": "2018-11-29T12:30:00.000+01:00",
  "lieu": {
    "code": "SALREU023",
    "libelleCourt": "Salle 7426",
    "libelleLong": "Salle 7426, 101, rue de l'Université"
  },
  "cycleDeVie": {
    "etat": "Confirmé",
    "chrono": {
      "creation": "2018-11-21T10:55:49.000+01:00"
    }
  },
  "demandeurs": {
    "acteurs": [
      {
        "nom": "Mme Samantha CAZEBONNE",
        "acteurRef": "PA721166"
      }
    ]
  },
  "typeReunion": "DEP"
}