{
  "xsiType": "reunionCommission_type",
  "uid": "RUANR5L15S2019IDC430505",
  "timestampDebut": "2018-10-02T17:00:00.000+02:00",
  "timestampFin": "2018-10-02T18:00:00.000+02:00",
  "lieu": {
    "libelleLong": "salle 4204 (33 rue Saint-Dominique)"
  },
  "cycleDeVie": {
    "etat": "Confirmé",
    "chrono": {
      "creation": "2018-10-02T00:00:00.000+02:00"
    }
  },
  "organeReuniRef": "PO744312",
  "participants": {},
  "ouverturePresse": false,
  "odj": {
    "convocationOdj": [
      "Audition de M. Bertrand Commelin, secrétaire général de la Fondation Alliance française et M. Pierre Buhler, président de l’Institut français."
    ],
    "resumeOdj": [
      "audition de M. Bertrand Commelin, secrétaire général de la Fondation Alliance française et M. Pierre Buhler, président de l’Institut français."
    ]
  },
  "formatReunion": "Ordinaire",
  "infosReunionsInternationale": {
    "estReunionInternationale": false
  },
  "captationVideo": false
}