{
  "xsiType": "reunionCommission_type",
  "uid": "RUANR5L15S2019IDC432042",
  "timestampDebut": "2019-05-15T10:00:00.000+02:00",
  "lieu": {
    "libelleLong": "salle 6241 (Affaires économiques)"
  },
  "cycleDeVie": {
    "etat": "Supprimé",
    "chrono": {
      "creation": "2019-03-21T00:00:00.000+01:00",
      "cloture": "2019-05-15T00:00:00.000+02:00"
    }
  },
  "organeReuniRef": "PO419610",
  "participants": {},
  "ouverturePresse": true,
  "odj": {
    "convocationOdj": [
      "Table ronde sur les défis économiques en Europe, réunissant M. Michel Aglietta, conseiller au Centre d’études prospectives et d’informations internationales (CEPII), M. Michel Didier, président de Rexecode, et M. Jean-Pisani-Ferry, professeur d’économie à Sciences-Po."
    ],
    "resumeOdj": [
      "table ronde sur les défis économiques en Europe, réunissant M. Michel Aglietta, conseiller au Centre d’études prospectives et d’informations internationales (CEPII), M. Michel Didier, président de Rexecode, et M. Jean-Pisani-Ferry, professeur d’économie à Sciences-Po."
    ]
  },
  "formatReunion": "Ordinaire",
  "infosReunionsInternationale": {
    "estReunionInternationale": false
  },
  "captationVideo": false
}