{
  "xsiType": "reunionInitParlementaire_type",
  "uid": "RUANR5L15S2019IDF0136975",
  "timestampDebut": "2019-07-29T13:30:00.000+02:00",
  "timestampFin": "2019-07-29T16:30:00.000+02:00",
  "lieu": {
    "code": "SALREU017",
    "libelleCourt": "Salon Visconti",
    "libelleLong": "Salon Visconti, 101, rue de l'Université"
  },
  "cycleDeVie": {
    "etat": "Confirmé",
    "chrono": {
      "creation": "2019-07-05T14:29:43.000+02:00"
    }
  },
  "demandeurs": {
    "acteurs": [
      {
        "nom": "M. Pierre-Alain RAPHAN",
        "acteurRef": "PA721888"
      }
    ]
  },
  "typeReunion": "DEP"
}