{
  "xsiType": "reunionInitParlementaire_type",
  "uid": "RUANR5L15S2019IDF0132634",
  "timestampDebut": "2019-05-14T09:00:00.000+02:00",
  "timestampFin": "2019-05-14T10:00:00.000+02:00",
  "lieu": {
    "code": "SALREU006",
    "libelleCourt": "3ème Bureau",
    "libelleLong": "3ème Bureau, Palais Bourbon"
  },
  "cycleDeVie": {
    "etat": "Annulé",
    "chrono": {
      "creation": "2019-04-24T11:58:45.000+02:00",
      "cloture": "2019-04-29T16:25:02.000+02:00"
    }
  },
  "demandeurs": {
    "acteurs": [
      {
        "nom": "Mme Béatrice PIRON",
        "acteurRef": "PA721844"
      }
    ]
  },
  "typeReunion": "DEP"
}