{
  "xsiType": "reunionInitParlementaire_type",
  "uid": "RUANR5L15S2020IDF0143661",
  "timestampDebut": "2019-11-14T11:30:00.000+01:00",
  "timestampFin": "2019-11-14T12:30:00.000+01:00",
  "lieu": {
    "code": "SALREU027",
    "libelleCourt": "Salle 6217",
    "libelleLong": "Salle 6217, Palais Bourbon"
  },
  "cycleDeVie": {
    "etat": "Confirmé",
    "chrono": {
      "creation": "2019-11-13T18:06:11.000+01:00"
    }
  },
  "demandeurs": {
    "acteurs": [
      {
        "nom": "M. Damien ABAD",
        "acteurRef": "PA605036"
      }
    ]
  },
  "typeReunion": "DEP"
}