{
  "xsiType": "seance_type",
  "uid": "RUANR5L15S2019IDS21627",
  "timestampDebut": "2019-05-17T09:30:00.000+02:00",
  "timestampFin": "2019-05-17T13:00:00.000+02:00",
  "lieu": {
    "code": "AN",
    "libelleLong": "Assemblée nationale"
  },
  "cycleDeVie": {
    "etat": "Confirmé",
    "chrono": {
      "creation": "2019-04-08T00:00:00.000+02:00"
    }
  },
  "organeReuniRef": "PO717460",
  "sessionRef": "SCR5A2019O1",
  "ouverturePresse": true,
  "odj": {
    "pointsOdj": [
      {
        "xsiType": "podjSeanceConfPres_type",
        "uid": "RUANR5L15S2019IDS21627PT37203",
        "cycleDeVie": {
          "etat": "Confirmé",
          "chrono": {
            "creation": "2019-04-08T00:00:00.000+02:00"
          }
        },
        "objet": "Suite de la discussion du projet de loi de transformation de la fonction publique",
        "dossiersLegislatifsRefs": [
          "DLR5L15N37357"
        ],
        "typePointOdj": "Suite de la discussion",
        "comiteSecret": false,
        "natureTravauxOdj": "ODJPR"
      }
    ]
  },
  "compteRenduRef": "CRSANR5L15S2019O1N237",
  "identifiants": {
    "numSeanceJo": "237",
    "idJo": "20190237",
    "quantieme": "Première",
    "dateSeance": "2019-05-17T02:00:00.000+02:00"
  },
  "captationVideo": true
}