{
  "xsiType": "reunionInitParlementaire_type",
  "uid": "RUANR5L15S2020IDF0141882",
  "timestampDebut": "2019-11-20T08:30:00.000+01:00",
  "timestampFin": "2019-11-20T09:30:00.000+01:00",
  "lieu": {
    "code": "SALREU006",
    "libelleCourt": "3ème Bureau",
    "libelleLong": "3ème Bureau, Palais Bourbon"
  },
  "cycleDeVie": {
    "etat": "Annulé",
    "chrono": {
      "creation": "2019-10-10T15:53:34.000+02:00",
      "cloture": "2019-11-06T16:34:01.000+01:00"
    }
  },
  "demandeurs": {
    "acteurs": [
      {
        "nom": "M. Bruno STUDER",
        "acteurRef": "PA720754"
      }
    ]
  },
  "typeReunion": "DEP"
}