{
  "xsiType": "reunionInitParlementaire_type",
  "uid": "RUANR5L15S2018IDF0112655",
  "timestampDebut": "2018-06-19T14:00:00.000+02:00",
  "timestampFin": "2018-06-19T15:00:00.000+02:00",
  "lieu": {
    "code": "SALREU045",
    "libelleCourt": "Sully 3",
    "libelleLong": "Sully 3, Palais Bourbon"
  },
  "cycleDeVie": {
    "etat": "Confirmé",
    "chrono": {
      "creation": "2018-05-30T18:32:36.000+02:00"
    }
  },
  "demandeurs": {
    "acteurs": [
      {
        "nom": "Mme Jennifer DE TEMMERMAN",
        "acteurRef": "PA720538"
      }
    ]
  },
  "typeReunion": "DEP"
}