{
  "xsiType": "reunionInitParlementaire_type",
  "uid": "RUANR5L15S2019IDF0136498",
  "timestampDebut": "2019-06-28T12:00:00.000+02:00",
  "timestampFin": "2019-06-28T15:00:00.000+02:00",
  "lieu": {
    "code": "SALREU017",
    "libelleCourt": "Salon Visconti",
    "libelleLong": "Salon Visconti, 101, rue de l'Université"
  },
  "cycleDeVie": {
    "etat": "Confirmé",
    "chrono": {
      "creation": "2019-06-28T09:51:13.000+02:00"
    }
  },
  "demandeurs": {
    "acteurs": [
      {
        "nom": "M. Daniel FASQUELLE",
        "acteurRef": "PA334149"
      }
    ]
  },
  "typeReunion": "DEP"
}