{
  "xsiType": "reunionInitParlementaire_type",
  "uid": "RUANR5L15S2019IDF0121231",
  "timestampDebut": "2018-10-24T13:00:00.000+02:00",
  "timestampFin": "2018-10-24T15:00:00.000+02:00",
  "lieu": {
    "code": "SALREU002",
    "libelleCourt": "Salle 7070",
    "libelleLong": "Salle 7070, 103, rue de l'Université"
  },
  "cycleDeVie": {
    "etat": "Confirmé",
    "chrono": {
      "creation": "2018-10-23T13:28:24.000+02:00"
    }
  },
  "demandeurs": {
    "acteurs": [
      {
        "nom": "M. François RUFFIN",
        "acteurRef": "PA722142"
      }
    ]
  },
  "typeReunion": "DEP"
}