{
  "xsiType": "reunionInitParlementaire_type",
  "uid": "RUANR5L15S2018IDF0113512",
  "timestampDebut": "2018-06-20T15:00:00.000+02:00",
  "timestampFin": "2018-06-20T16:30:00.000+02:00",
  "lieu": {
    "code": "SALREU045",
    "libelleCourt": "Sully 3",
    "libelleLong": "Sully 3, Palais Bourbon"
  },
  "cycleDeVie": {
    "etat": "Confirmé",
    "chrono": {
      "creation": "2018-06-12T17:27:08.000+02:00"
    }
  },
  "demandeurs": {
    "acteurs": [
      {
        "nom": "Mme Valéria FAURE-MUNTIAN",
        "acteurRef": "PA719960"
      }
    ]
  },
  "typeReunion": "DEP"
}