{
  "xsiType": "reunionCommission_type",
  "uid": "RUANR5L15S2019IDC432557",
  "timestampDebut": "2019-05-09T10:15:00.000+02:00",
  "lieu": {
    "libelleLong": "salle 6566 (Lois)"
  },
  "cycleDeVie": {
    "etat": "Confirmé",
    "chrono": {
      "creation": "2019-05-03T00:00:00.000+02:00"
    }
  },
  "organeReuniRef": "PO762272",
  "participants": {},
  "ouverturePresse": false,
  "odj": {
    "convocationOdj": [
      "Audition de M. Peter Debrine, responsable de projet au sein de l’unité de la nature, du tourisme durable et de la mobilisation à l’Unesco"
    ],
    "resumeOdj": [
      "audition de M. Peter Debrine, responsable de projet au sein de l’unité de la nature, du tourisme durable et de la mobilisation à l’Unesco."
    ]
  },
  "formatReunion": "Ordinaire",
  "infosReunionsInternationale": {
    "estReunionInternationale": false
  },
  "captationVideo": false
}