{
  "xsiType": "reunionCommission_type",
  "uid": "RUANR5L15S2019IDC431706",
  "timestampDebut": "2019-04-09T18:00:00.000+02:00",
  "lieu": {
    "libelleLong": "salon Visconti (32 rue Saint-Dominique)"
  },
  "cycleDeVie": {
    "etat": "Supprimé",
    "chrono": {
      "creation": "2019-02-21T00:00:00.000+01:00",
      "cloture": "2019-04-04T00:00:00.000+02:00"
    }
  },
  "organeReuniRef": "PO760931",
  "participants": {},
  "ouverturePresse": false,
  "odj": {
    "convocationOdj": [
      "Audition de M. Philippe Portier, secrétaire national en charge de l’industrie de la CFDT, et de M. Augustin Bourguignat, secrétaire confédéral en charge des politiques industrielles, accompagnés de Mme Caroline Werkoff, secrétaire confédérale en charge des relations avec le Parlement."
    ],
    "resumeOdj": [
      "audition de M. Philippe Portier, secrétaire national en charge de l’industrie de la CFDT, et de M. Augustin Bourguignat, secrétaire confédéral en charge des politiques industrielles, accompagnés de Mme Caroline Werkoff, secrétaire confédérale en charge des relations avec le Parlement."
    ]
  },
  "formatReunion": "Ordinaire",
  "infosReunionsInternationale": {
    "estReunionInternationale": false
  },
  "captationVideo": false
}