{
  "xsiType": "reunionCommission_type",
  "uid": "RUANR5L15S2019IDC433283",
  "timestampDebut": "2019-07-11T15:25:00.000+02:00",
  "timestampFin": "2019-07-11T17:20:00.000+02:00",
  "lieu": {
    "libelleLong": "salle 6351 (Affaires sociales)"
  },
  "cycleDeVie": {
    "etat": "Confirmé",
    "chrono": {
      "creation": "2019-06-27T00:00:00.000+02:00"
    }
  },
  "organeReuniRef": "PO765498",
  "participants": {
    "participantsInternes": [
      {
        "acteurRef": "PA721036",
        "presence": "absent"
      },
      {
        "acteurRef": "PA724827",
        "presence": "absent"
      },
      {
        "acteurRef": "PA720968",
        "presence": "présent"
      },
      {
        "acteurRef": "PA719448",
        "presence": "présent"
      },
      {
        "acteurRef": "PA719170",
        "presence": "absent"
      },
      {
        "acteurRef": "PA719108",
        "presence": "absent"
      },
      {
        "acteurRef": "PA721126",
        "presence": "absent"
      },
      {
        "acteurRef": "PA722344",
        "presence": "absent"
      },
      {
        "acteurRef": "PA720022",
        "presence": "absent"
      },
      {
        "acteurRef": "PA720480",
        "presence": "absent"
      },
      {
        "acteurRef": "PA337483",
        "presence": "présent"
      },
      {
        "acteurRef": "PA608016",
        "presence": "absent"
      },
      {
        "acteurRef": "PA719080",
        "presence": "absent"
      },
      {
        "acteurRef": "PA719154",
        "presence": "absent"
      },
      {
        "acteurRef": "PA677483",
        "presence": "absent"
      },
      {
        "acteurRef": "PA610654",
        "presence": "absent"
      },
      {
        "acteurRef": "PA720892",
        "presence": "absent"
      },
      {
        "acteurRef": "PA721234",
        "presence": "absent"
      },
      {
        "acteurRef": "PA405480",
        "presence": "absent"
      },
      {
        "acteurRef": "PA720900",
        "presence": "présent"
      },
      {
        "acteurRef": "PA721110",
        "presence": "absent"
      },
      {
        "acteurRef": "PA720960",
        "presence": "absent"
      },
      {
        "acteurRef": "PA719540",
        "presence": "absent"
      },
      {
        "acteurRef": "PA643145",
        "presence": "présent"
      },
      {
        "acteurRef": "PA718728",
        "presence": "absent"
      },
      {
        "acteurRef": "PA721262",
        "presence": "absent"
      }
    ]
  },
  "ouverturePresse": true,
  "odj": {
    "convocationOdj": [
      "– Audition, ouverte à la presse, du Pr Jérôme Salomon, directeur général, la Direction générale de la santé (DGS), Ministère des Solidarités et de la Santé , Mme Joëlle Carmes, sous-directrice de la sous-direction Prévention des risques liés à l’environnement et à l’alimentation, Mme Barbara Lefèvre, chargée de dossier au Bureau Alimentation et nutrition en charge du plan Chlordécone et des produits phytosanitaires, et M. François Klein, chef de la Mission Outre-Mer"
    ],
    "resumeOdj": [
      "audition, ouverte à la presse, du Pr Jérôme Salomon, directeur général, la direction générale de la santé (DGS), ministère des solidarités et de la santé, Mme Joëlle Carmes, sous-directrice de la sous-direction Prévention des risques liés à l’environnement et à l’alimentation, Mme Barbara Lefèvre, chargée de dossier au Bureau Alimentation et nutrition en charge du plan Chlordécone et des produits phytosanitaires, et M. François Klein, chef de la Mission Outre-Mer."
    ]
  },
  "compteRenduRef": "CRCANR5L15S2019PO765498N019",
  "formatReunion": "Ordinaire",
  "infosReunionsInternationale": {
    "estReunionInternationale": false
  },
  "captationVideo": true
}