{
  "xsiType": "reunionCommission_type",
  "uid": "RUANR5L15S2018IDC430307",
  "timestampDebut": "2018-09-27T09:00:00.000+02:00",
  "timestampFin": "2018-09-27T11:35:00.000+02:00",
  "lieu": {
    "libelleLong": "salle Lamartine"
  },
  "cycleDeVie": {
    "etat": "Confirmé",
    "chrono": {
      "creation": "2018-09-20T00:00:00.000+02:00"
    }
  },
  "organeReuniRef": "PO273589",
  "participants": {
    "participantsInternes": [
      {
        "acteurRef": "PA703519",
        "presence": "absent"
      },
      {
        "acteurRef": "PA609726",
        "presence": "excusé"
      },
      {
        "acteurRef": "PA721776",
        "presence": "excusé"
      },
      {
        "acteurRef": "PA513",
        "presence": "présent"
      },
      {
        "acteurRef": "PA720162",
        "presence": "présent"
      },
      {
        "acteurRef": "PA267233",
        "presence": "excusé"
      },
      {
        "acteurRef": "PA720298",
        "presence": "absent"
      },
      {
        "acteurRef": "PA944",
        "presence": "absent"
      },
      {
        "acteurRef": "PA736160",
        "presence": "absent"
      },
      {
        "acteurRef": "PA719692",
        "presence": "absent"
      },
      {
        "acteurRef": "PA719960",
        "presence": "excusé"
      },
      {
        "acteurRef": "PA722366",
        "presence": "présent"
      },
      {
        "acteurRef": "PA267735",
        "presence": "excusé"
      },
      {
        "acteurRef": "PA722358",
        "presence": "excusé"
      },
      {
        "acteurRef": "PA721024",
        "presence": "présent"
      },
      {
        "acteurRef": "PA736168",
        "presence": "excusé"
      },
      {
        "acteurRef": "PA722070",
        "presence": "présent"
      },
      {
        "acteurRef": "PA267355",
        "presence": "absent"
      },
      {
        "acteurRef": "PA608416",
        "presence": "excusé"
      },
      {
        "acteurRef": "PA736232",
        "presence": "absent"
      },
      {
        "acteurRef": "PA736225",
        "presence": "absent"
      },
      {
        "acteurRef": "PA303992",
        "presence": "absent"
      },
      {
        "acteurRef": "PA736246",
        "presence": "excusé"
      },
      {
        "acteurRef": "PA335612",
        "presence": "absent"
      },
      {
        "acteurRef": "PA736186",
        "presence": "présent"
      },
      {
        "acteurRef": "PA1993",
        "presence": "absent"
      },
      {
        "acteurRef": "PA415484",
        "presence": "absent"
      },
      {
        "acteurRef": "PA703480",
        "presence": "absent"
      },
      {
        "acteurRef": "PA736243",
        "presence": "excusé"
      },
      {
        "acteurRef": "PA736200",
        "presence": "présent"
      },
      {
        "acteurRef": "PA736209",
        "presence": "présent"
      },
      {
        "acteurRef": "PA304086",
        "presence": "excusé"
      },
      {
        "acteurRef": "PA719578",
        "presence": "absent"
      },
      {
        "acteurRef": "PA227094",
        "presence": "présent"
      },
      {
        "acteurRef": "PA720014",
        "presence": "présent"
      },
      {
        "acteurRef": "PA722260",
        "presence": "présent"
      }
    ]
  },
  "ouverturePresse": true,
  "odj": {
    "convocationOdj": [
      "Audition, ouverte à la presse, de M. Étienne Crépon, président du Centre scientifique et technique du bâtiment (CSTB) sur son rapport d'activité 2017, en application de l’article L.142-1 du code de la construction et de l'habitation ;",
      "Examen d’une note méthodologique sur le rapport consacré aux scénarios technologiques à envisager pour atteindre l’objectif d’un arrêt de la commercialisation des véhicules thermiques en 2040 (M. Stéphane Piednoir et Mme Huguette Tiegna, rapporteurs) ;",
      "A 10h30, présentation, ouverte à la presse, de la note de M. Cédric Villani, premier vice-président, en réponse à la demande de la présidente de la commission des Lois de l’Assemblée nationale, en appui à sa mission d’information flash chargée d’étudier les incidences d’une évolution du mode de scrutin des députés."
    ],
    "resumeOdj": [
      "audition, ouverte à la presse, de M. Étienne Crépon, président du Centre scientifique et technique du bâtiment (CSTB) sur son rapport d'activité 2017, en application de l’article L.142-1 du code de la construction et de l'habitation ;",
      "examen d’une note méthodologique sur le rapport consacré aux scénarios technologiques à envisager pour atteindre l’objectif d’un arrêt de la commercialisation des véhicules thermiques en 2040 (M. Stéphane Piednoir et Mme Huguette Tiegna, rapporteurs) ;",
      "A 10h30, présentation, ouverte à la presse, de la note de M. Cédric Villani, premier vice-président, en réponse à la demande de la présidente de la commission des Lois de l’Assemblée nationale, en appui à sa mission d’information flash chargée d’étudier les incidences d’une évolution du mode de scrutin des députés."
    ]
  },
  "compteRenduRef": "CRCANR5L15S2018PO273589N022",
  "formatReunion": "Ordinaire",
  "infosReunionsInternationale": {
    "estReunionInternationale": false
  },
  "captationVideo": false
}