{
  "xsiType": "reunionCommission_type",
  "uid": "RUANR5L15S2019IDC431871",
  "timestampDebut": "2019-03-12T18:30:00.000+01:00",
  "lieu": {
    "libelleLong": "salle 6549 (2e étage)"
  },
  "cycleDeVie": {
    "etat": "Confirmé",
    "chrono": {
      "creation": "2019-03-08T00:00:00.000+01:00"
    }
  },
  "organeReuniRef": "PO759296",
  "participants": {},
  "ouverturePresse": false,
  "odj": {
    "convocationOdj": [
      "Audition de Mme Sylvie Escalon, adjointe au sous-directeur de la régulation de l’offre de soins à la direction générale de l’offre de soins (DGOS) du ministère des solidarités et de la santé, de Mme Maud Soulier, adjointe au sous-directeur des ressources humaines du système de santé, et de Mme Corinne Pasquay, chargée de mission radicalisation auprès du secrétariat général du ministère."
    ],
    "resumeOdj": [
      "audition, non ouverte à la presse, de Mme Sylvie Escalon, adjointe au sous-directeur de la régulation de l’offre de soins à la direction générale de l’offre de soins (DGOS) du ministère des solidarités et de la santé, de Mme Maud Soulier, adjointe au sous-directeur des ressources humaines du système de santé, et de Mme Corinne Pasquay, chargée de mission radicalisation auprès du secrétariat général du ministère."
    ]
  },
  "formatReunion": "Ordinaire",
  "infosReunionsInternationale": {
    "estReunionInternationale": false
  },
  "captationVideo": false
}