{
  "xsiType": "reunionInitParlementaire_type",
  "uid": "RUANR5L15S2018IDF0111418",
  "timestampDebut": "2018-05-22T14:00:00.000+02:00",
  "timestampFin": "2018-05-22T15:00:00.000+02:00",
  "lieu": {
    "code": "SALREU017",
    "libelleCourt": "Salon Visconti",
    "libelleLong": "Salon Visconti, 101, rue de l'Université"
  },
  "cycleDeVie": {
    "etat": "Confirmé",
    "chrono": {
      "creation": "2018-05-14T16:22:29.000+02:00"
    }
  },
  "demandeurs": {
    "acteurs": [
      {
        "nom": "Mme Stella DUPONT",
        "acteurRef": "PA643175"
      }
    ]
  },
  "typeReunion": "DEP"
}