{
  "xsiType": "reunionInitParlementaire_type",
  "uid": "RUANR5L15S2017IDF0095710",
  "timestampDebut": "2017-09-19T09:00:00.000+02:00",
  "timestampFin": "2017-09-19T12:00:00.000+02:00",
  "lieu": {
    "code": "SALREU017",
    "libelleCourt": "Salon Visconti",
    "libelleLong": "Salon Visconti, 101, rue de l'Université"
  },
  "cycleDeVie": {
    "etat": "Confirmé",
    "chrono": {
      "creation": "2017-09-05T17:15:06.000+02:00"
    }
  },
  "demandeurs": {
    "acteurs": [
      {
        "nom": "M. Éric CIOTTI",
        "acteurRef": "PA330240"
      }
    ]
  },
  "typeReunion": "DEP"
}