{
  "xsiType": "reunionInitParlementaire_type",
  "uid": "RUANR5L15S2018IDF0100938",
  "timestampDebut": "2017-11-27T14:00:00.000+01:00",
  "timestampFin": "2017-11-27T16:00:00.000+01:00",
  "lieu": {
    "code": "SALREU046",
    "libelleCourt": "Sully 1",
    "libelleLong": "Sully 1, Palais Bourbon"
  },
  "cycleDeVie": {
    "etat": "Annulé",
    "chrono": {
      "creation": "2017-11-17T15:45:42.000+01:00",
      "cloture": "2017-11-23T09:44:02.000+01:00"
    }
  },
  "demandeurs": {
    "acteurs": [
      {
        "nom": "Mme Anne-Laurence PETEL",
        "acteurRef": "PA718930"
      }
    ]
  },
  "typeReunion": "DEP"
}