{
  "xsiType": "reunionCommission_type",
  "uid": "RUANR5L15S2019IDC432306",
  "timestampDebut": "2019-05-17T14:50:00.000+02:00",
  "timestampFin": "2019-05-17T19:45:00.000+02:00",
  "lieu": {
    "libelleLong": "6e Bureau"
  },
  "cycleDeVie": {
    "etat": "Confirmé",
    "chrono": {
      "creation": "2019-04-11T00:00:00.000+02:00"
    }
  },
  "organeReuniRef": "PO419865",
  "participants": {
    "participantsInternes": [
      {
        "acteurRef": "PA720242",
        "presence": "présent"
      },
      {
        "acteurRef": "PA722038",
        "presence": "présent"
      },
      {
        "acteurRef": "PA720310",
        "presence": "absent"
      },
      {
        "acteurRef": "PA719806",
        "presence": "excusé"
      },
      {
        "acteurRef": "PA721046",
        "presence": "excusé"
      },
      {
        "acteurRef": "PA720210",
        "presence": "absent"
      },
      {
        "acteurRef": "PA508",
        "presence": "absent"
      },
      {
        "acteurRef": "PA266793",
        "presence": "absent"
      },
      {
        "acteurRef": "PA267233",
        "presence": "absent"
      },
      {
        "acteurRef": "PA718710",
        "presence": "présent"
      },
      {
        "acteurRef": "PA267766",
        "presence": "excusé"
      },
      {
        "acteurRef": "PA719890",
        "presence": "présent"
      },
      {
        "acteurRef": "PA722000",
        "presence": "absent"
      },
      {
        "acteurRef": "PA719922",
        "presence": "excusé"
      },
      {
        "acteurRef": "PA721860",
        "presence": "absent"
      },
      {
        "acteurRef": "PA719740",
        "presence": "présent"
      },
      {
        "acteurRef": "PA719286",
        "presence": "absent"
      },
      {
        "acteurRef": "PA719624",
        "presence": "présent"
      },
      {
        "acteurRef": "PA719194",
        "presence": "absent"
      },
      {
        "acteurRef": "PA267241",
        "presence": "absent"
      },
      {
        "acteurRef": "PA330909",
        "presence": "absent"
      },
      {
        "acteurRef": "PA720538",
        "presence": "absent"
      },
      {
        "acteurRef": "PA722236",
        "presence": "présent"
      },
      {
        "acteurRef": "PA721718",
        "presence": "présent"
      },
      {
        "acteurRef": "PA718894",
        "presence": "absent"
      },
      {
        "acteurRef": "PA720652",
        "presence": "présent"
      },
      {
        "acteurRef": "PA605694",
        "presence": "absent"
      },
      {
        "acteurRef": "PA722366",
        "presence": "présent"
      },
      {
        "acteurRef": "PA721992",
        "presence": "absent"
      },
      {
        "acteurRef": "PA333285",
        "presence": "absent"
      },
      {
        "acteurRef": "PA720806",
        "presence": "absent"
      },
      {
        "acteurRef": "PA720054",
        "presence": "absent"
      },
      {
        "acteurRef": "PA720038",
        "presence": "absent"
      },
      {
        "acteurRef": "PA721514",
        "presence": "absent"
      },
      {
        "acteurRef": "PA605084",
        "presence": "excusé"
      },
      {
        "acteurRef": "PA609245",
        "presence": "absent"
      },
      {
        "acteurRef": "PA605518",
        "presence": "absent"
      },
      {
        "acteurRef": "PA267785",
        "presence": "présent"
      },
      {
        "acteurRef": "PA720764",
        "presence": "absent"
      },
      {
        "acteurRef": "PA722228",
        "presence": "absent"
      },
      {
        "acteurRef": "PA719412",
        "presence": "absent"
      },
      {
        "acteurRef": "PA721054",
        "presence": "excusé"
      },
      {
        "acteurRef": "PA721530",
        "presence": "absent"
      },
      {
        "acteurRef": "PA717379",
        "presence": "présent"
      },
      {
        "acteurRef": "PA719718",
        "presence": "absent"
      },
      {
        "acteurRef": "PA346054",
        "presence": "absent"
      },
      {
        "acteurRef": "PA719080",
        "presence": "absent"
      },
      {
        "acteurRef": "PA2155",
        "presence": "présent"
      },
      {
        "acteurRef": "PA719882",
        "presence": "absent"
      },
      {
        "acteurRef": "PA721976",
        "presence": "absent"
      },
      {
        "acteurRef": "PA721876",
        "presence": "absent"
      },
      {
        "acteurRef": "PA719464",
        "presence": "absent"
      },
      {
        "acteurRef": "PA720278",
        "presence": "présent"
      },
      {
        "acteurRef": "PA720334",
        "presence": "absent"
      },
      {
        "acteurRef": "PA333421",
        "presence": "présent"
      },
      {
        "acteurRef": "PA719632",
        "presence": "présent"
      },
      {
        "acteurRef": "PA720892",
        "presence": "absent"
      },
      {
        "acteurRef": "PA720944",
        "presence": "présent"
      },
      {
        "acteurRef": "PA718802",
        "presence": "présent"
      },
      {
        "acteurRef": "PA720414",
        "presence": "présent"
      },
      {
        "acteurRef": "PA721372",
        "presence": "présent"
      },
      {
        "acteurRef": "PA609520",
        "presence": "présent"
      },
      {
        "acteurRef": "PA759192",
        "presence": "excusé"
      },
      {
        "acteurRef": "PA719578",
        "presence": "absent"
      },
      {
        "acteurRef": "PA721426",
        "presence": "présent"
      },
      {
        "acteurRef": "PA721600",
        "presence": "présent"
      },
      {
        "acteurRef": "PA721616",
        "presence": "présent"
      },
      {
        "acteurRef": "PA267527",
        "presence": "absent"
      },
      {
        "acteurRef": "PA719972",
        "presence": "absent"
      },
      {
        "acteurRef": "PA267204",
        "presence": "présent"
      },
      {
        "acteurRef": "PA610667",
        "presence": "excusé"
      },
      {
        "acteurRef": "PA722336",
        "presence": "absent"
      },
      {
        "acteurRef": "PA719092",
        "presence": "absent"
      },
      {
        "acteurRef": "PA720586",
        "presence": "absent"
      },
      {
        "acteurRef": "PA721968",
        "presence": "absent"
      },
      {
        "acteurRef": "PA607090",
        "presence": "absent"
      },
      {
        "acteurRef": "PA722110",
        "presence": "absent"
      },
      {
        "acteurRef": "PA718962",
        "presence": "présent"
      }
    ]
  },
  "ouverturePresse": true,
  "odj": {
    "convocationOdj": [
      "– suite de l’examen du projet de loi, adopté par le Sénat après engagement de la procédure accélérée, d’orientation des mobilités (n° 1831)."
    ],
    "resumeOdj": [
      "suite de l’examen du projet de loi, adopté par le Sénat après engagement de la procédure accélérée, d’orientation des mobilités (n° 1831)."
    ],
    "pointsOdj": [
      {
        "xsiType": "podjReunion_type",
        "uid": "RUANR5L15S2019IDC432306PT26530",
        "cycleDeVie": {
          "etat": "Eventuel",
          "chrono": {
            "creation": "2019-04-11T00:00:00.000+02:00"
          }
        },
        "objet": "Examen du texte",
        "dossiersLegislatifsRefs": [
          "DLR5L15N37029"
        ],
        "typePointOdj": "Examen",
        "comiteSecret": false
      }
    ]
  },
  "compteRenduRef": "CRCANR5L15S2019PO419865N057",
  "formatReunion": "Ordinaire",
  "infosReunionsInternationale": {
    "estReunionInternationale": false
  },
  "captationVideo": false
}