{
  "xsiType": "reunionInitParlementaire_type",
  "uid": "RUANR5L15S2018IDF0100936",
  "timestampDebut": "2017-12-12T09:00:00.000+01:00",
  "timestampFin": "2017-12-12T12:00:00.000+01:00",
  "lieu": {
    "code": "SALREU013",
    "libelleCourt": "Salle N° 3",
    "libelleLong": "Salle N° 3, 3, rue Aristide Briand"
  },
  "cycleDeVie": {
    "etat": "Annulé",
    "chrono": {
      "creation": "2017-11-17T15:21:05.000+01:00",
      "cloture": "2017-11-30T18:13:29.000+01:00"
    }
  },
  "demandeurs": {
    "acteurs": [
      {
        "nom": "M. Damien PICHEREAU",
        "acteurRef": "PA721372"
      }
    ]
  },
  "typeReunion": "DEP"
}