{
  "xsiType": "reunionInitParlementaire_type",
  "uid": "RUANR5L15S2019IDF0126067",
  "timestampDebut": "2019-03-05T14:00:00.000+01:00",
  "timestampFin": "2019-03-05T15:00:00.000+01:00",
  "lieu": {
    "code": "SALREU006",
    "libelleCourt": "3ème Bureau",
    "libelleLong": "3ème Bureau, Palais Bourbon"
  },
  "cycleDeVie": {
    "etat": "Confirmé",
    "chrono": {
      "creation": "2019-01-25T16:18:37.000+01:00"
    }
  },
  "demandeurs": {
    "organe": {
      "nom": "GROUPE SOCIALISTES ET APPARENTÉS",
      "organeRef": "PO758835"
    }
  },
  "organeReuniRef": "PO758835",
  "typeReunion": "GP"
}