{
  "xsiType": "reunionInitParlementaire_type",
  "uid": "RUANR5L15S2018IDF0097835",
  "timestampDebut": "2017-10-09T15:00:00.000+02:00",
  "timestampFin": "2017-10-09T17:00:00.000+02:00",
  "lieu": {
    "code": "SALREU013",
    "libelleCourt": "Salle N° 3",
    "libelleLong": "Salle N° 3, 3, rue Aristide Briand"
  },
  "cycleDeVie": {
    "etat": "Confirmé",
    "chrono": {
      "creation": "2017-10-03T12:30:28.000+02:00"
    }
  },
  "demandeurs": {
    "acteurs": [
      {
        "nom": "M. Guillaume GOUFFIER-CHA",
        "acteurRef": "PA721296"
      }
    ]
  },
  "typeReunion": "DEP"
}