{
  "xsiType": "reunionInitParlementaire_type",
  "uid": "RUANR5L15S2019IDF0138893",
  "timestampDebut": "2019-09-17T17:30:00.000+02:00",
  "timestampFin": "2019-09-17T18:30:00.000+02:00",
  "lieu": {
    "code": "SALREU008",
    "libelleCourt": "5ème Bureau",
    "libelleLong": "5ème Bureau, Palais Bourbon"
  },
  "cycleDeVie": {
    "etat": "Confirmé",
    "chrono": {
      "creation": "2019-09-03T11:02:06.000+02:00"
    }
  },
  "demandeurs": {
    "organe": {
      "nom": "GROUPE LIBERTÉS ET TERRITOIRES",
      "organeRef": "PO759900"
    }
  },
  "organeReuniRef": "PO759900",
  "typeReunion": "GP"
}