{
  "xsiType": "reunionInitParlementaire_type",
  "uid": "RUANR5L15S2018IDF0114996",
  "timestampDebut": "2018-07-05T10:00:00.000+02:00",
  "timestampFin": "2018-07-05T12:00:00.000+02:00",
  "lieu": {
    "code": "SALREU039",
    "libelleCourt": "Salle 6550",
    "libelleLong": "Salle 6550, Palais Bourbon"
  },
  "cycleDeVie": {
    "etat": "Confirmé",
    "chrono": {
      "creation": "2018-07-04T12:02:39.000+02:00"
    }
  },
  "demandeurs": {
    "acteurs": [
      {
        "nom": "Mme Élise FAJGELES",
        "acteurRef": "PA721564"
      }
    ]
  },
  "typeReunion": "DEP"
}