{
  "xsiType": "reunionInitParlementaire_type",
  "uid": "RUANR5L15S2018IDF0097590",
  "timestampDebut": "2017-10-04T15:30:00.000+02:00",
  "timestampFin": "2017-10-04T17:00:00.000+02:00",
  "lieu": {
    "code": "SALREU026",
    "libelleCourt": "9ème Bureau",
    "libelleLong": "9ème Bureau, Palais Bourbon"
  },
  "cycleDeVie": {
    "etat": "Confirmé",
    "chrono": {
      "creation": "2017-09-29T15:45:41.000+02:00"
    }
  },
  "demandeurs": {
    "acteurs": [
      {
        "nom": "M. Christophe BOUILLON",
        "acteurRef": "PA267233"
      }
    ]
  },
  "typeReunion": "DEP"
}