{
  "xsiType": "reunionInitParlementaire_type",
  "uid": "RUANR5L15S2018IDF0108097",
  "timestampDebut": "2018-03-27T12:30:00.000+02:00",
  "timestampFin": "2018-03-27T14:00:00.000+02:00",
  "lieu": {
    "code": "SALREU017",
    "libelleCourt": "Salon Visconti",
    "libelleLong": "Salon Visconti, 101, rue de l'Université"
  },
  "cycleDeVie": {
    "etat": "Confirmé",
    "chrono": {
      "creation": "2018-03-20T14:09:01.000+01:00"
    }
  },
  "demandeurs": {
    "acteurs": [
      {
        "nom": "Mme Liliana TANGUY",
        "acteurRef": "PA719550"
      }
    ]
  },
  "typeReunion": "DEP"
}