{
  "xsiType": "reunionInitParlementaire_type",
  "uid": "RUANR5L15S2018IDF0116406",
  "timestampDebut": "2018-07-30T11:00:00.000+02:00",
  "timestampFin": "2018-07-30T12:30:00.000+02:00",
  "lieu": {
    "code": "SALREU013",
    "libelleCourt": "Salle N° 3",
    "libelleLong": "Salle N° 3, 3, rue Aristide Briand"
  },
  "cycleDeVie": {
    "etat": "Confirmé",
    "chrono": {
      "creation": "2018-07-30T10:35:33.000+02:00"
    }
  },
  "demandeurs": {
    "acteurs": [
      {
        "nom": "Mme Amélia LAKRAFI",
        "acteurRef": "PA721004"
      }
    ]
  },
  "typeReunion": "DEP"
}