{
  "xsiType": "reunionInitParlementaire_type",
  "uid": "RUANR5L15S2020IDF0142020",
  "timestampDebut": "2019-10-22T17:00:00.000+02:00",
  "timestampFin": "2019-10-22T18:00:00.000+02:00",
  "lieu": {
    "code": "SALREU022",
    "libelleCourt": "Salle 7326",
    "libelleLong": "Salle 7326, 101, rue de l'Université"
  },
  "cycleDeVie": {
    "etat": "Confirmé",
    "chrono": {
      "creation": "2019-10-14T15:12:05.000+02:00"
    }
  },
  "demandeurs": {
    "acteurs": [
      {
        "nom": "Mme Bénédicte TAURINE",
        "acteurRef": "PA718860"
      }
    ]
  },
  "typeReunion": "DEP"
}