{
  "xsiType": "reunionInitParlementaire_type",
  "uid": "RUANR5L15S2019IDF0131540",
  "timestampDebut": "2019-05-16T09:00:00.000+02:00",
  "timestampFin": "2019-05-16T18:00:00.000+02:00",
  "lieu": {
    "code": "SALREU025",
    "libelleCourt": "7ème Bureau",
    "libelleLong": "7ème Bureau, Palais Bourbon"
  },
  "cycleDeVie": {
    "etat": "Annulé",
    "chrono": {
      "creation": "2019-04-03T16:36:26.000+02:00",
      "cloture": "2019-04-24T14:51:31.000+02:00"
    }
  },
  "demandeurs": {
    "acteurs": [
      {
        "nom": "M. Sylvain WASERMAN",
        "acteurRef": "PA720746"
      }
    ]
  },
  "typeReunion": "DEP"
}