{
  "xsiType": "reunionInitParlementaire_type",
  "uid": "RUANR5L15S2019IDF0137794",
  "timestampDebut": "2019-07-23T14:15:00.000+02:00",
  "timestampFin": "2019-07-23T15:00:00.000+02:00",
  "lieu": {
    "code": "SALREU027",
    "libelleCourt": "Salle 6217",
    "libelleLong": "Salle 6217, Palais Bourbon"
  },
  "cycleDeVie": {
    "etat": "Confirmé",
    "chrono": {
      "creation": "2019-07-19T14:29:29.000+02:00"
    }
  },
  "demandeurs": {
    "acteurs": [
      {
        "nom": "M. Christian JACOB",
        "acteurRef": "PA1695"
      }
    ]
  },
  "typeReunion": "DEP"
}