{
  "xsiType": "reunionInitParlementaire_type",
  "uid": "RUANR5L15S2018IDF0097994",
  "timestampDebut": "2017-10-05T15:00:00.000+02:00",
  "timestampFin": "2017-10-05T16:00:00.000+02:00",
  "lieu": {
    "code": "SALREU049",
    "libelleCourt": "Salle 6822",
    "libelleLong": "Salle 6822, Palais Bourbon"
  },
  "cycleDeVie": {
    "etat": "Confirmé",
    "chrono": {
      "creation": "2017-10-05T09:32:17.000+02:00"
    }
  },
  "demandeurs": {
    "acteurs": [
      {
        "nom": "M. Gabriel ATTAL",
        "acteurRef": "PA722190"
      }
    ]
  },
  "typeReunion": "DEP"
}