{
  "xsiType": "reunionInitParlementaire_type",
  "uid": "RUANR5L15S2018IDF0116547",
  "timestampDebut": "2018-09-05T14:00:00.000+02:00",
  "timestampFin": "2018-09-05T15:00:00.000+02:00",
  "lieu": {
    "code": "SALREU017",
    "libelleCourt": "Salon Visconti",
    "libelleLong": "Salon Visconti, 101, rue de l'Université"
  },
  "cycleDeVie": {
    "etat": "Confirmé",
    "chrono": {
      "creation": "2018-08-02T11:10:34.000+02:00"
    }
  },
  "demandeurs": {
    "acteurs": [
      {
        "nom": "M. Mustapha LAABID",
        "acteurRef": "PA719842"
      }
    ]
  },
  "typeReunion": "DEP"
}