{
  "xsiType": "reunionInitParlementaire_type",
  "uid": "RUANR5L15S2018IDF0110789",
  "timestampDebut": "2018-06-05T14:00:00.000+02:00",
  "timestampFin": "2018-06-05T15:00:00.000+02:00",
  "lieu": {
    "code": "SALREU021",
    "libelleCourt": "Salle 7207",
    "libelleLong": "Salle 7207, 101, rue de l'Université"
  },
  "cycleDeVie": {
    "etat": "Confirmé",
    "chrono": {
      "creation": "2018-04-26T17:21:03.000+02:00"
    }
  },
  "demandeurs": {
    "acteurs": [
      {
        "nom": "M. Jean-Carles GRELIER",
        "acteurRef": "PA267318"
      }
    ]
  },
  "typeReunion": "DEP"
}