{
  "xsiType": "reunionCommission_type",
  "uid": "RUANR5L15S2018IDC429232",
  "timestampDebut": "2018-05-30T09:30:00.000+02:00",
  "timestampFin": "2018-05-30T12:20:00.000+02:00",
  "lieu": {
    "libelleLong": "salle 6238 (Affaires culturelles)"
  },
  "cycleDeVie": {
    "etat": "Confirmé",
    "chrono": {
      "creation": "2018-04-19T00:00:00.000+02:00"
    }
  },
  "organeReuniRef": "PO419604",
  "participants": {
    "participantsInternes": [
      {
        "acteurRef": "PA719146",
        "presence": "présent"
      },
      {
        "acteurRef": "PA721036",
        "presence": "excusé"
      },
      {
        "acteurRef": "PA724827",
        "presence": "excusé"
      },
      {
        "acteurRef": "PA720124",
        "presence": "présent"
      },
      {
        "acteurRef": "PA719318",
        "presence": "présent"
      },
      {
        "acteurRef": "PA722190",
        "presence": "présent"
      },
      {
        "acteurRef": "PA720256",
        "presence": "présent"
      },
      {
        "acteurRef": "PA718884",
        "presence": "présent"
      },
      {
        "acteurRef": "PA722046",
        "presence": "présent"
      },
      {
        "acteurRef": "PA719488",
        "presence": "présent"
      },
      {
        "acteurRef": "PA720576",
        "presence": "présent"
      },
      {
        "acteurRef": "PA722030",
        "presence": "présent"
      },
      {
        "acteurRef": "PA713448",
        "presence": "présent"
      },
      {
        "acteurRef": "PA223837",
        "presence": "présent"
      },
      {
        "acteurRef": "PA721328",
        "presence": "présent"
      },
      {
        "acteurRef": "PA689",
        "presence": "présent"
      },
      {
        "acteurRef": "PA721750",
        "presence": "présent"
      },
      {
        "acteurRef": "PA721352",
        "presence": "absent"
      },
      {
        "acteurRef": "PA721218",
        "presence": "présent"
      },
      {
        "acteurRef": "PA719170",
        "presence": "présent"
      },
      {
        "acteurRef": "PA702054",
        "presence": "excusé"
      },
      {
        "acteurRef": "PA719814",
        "presence": "présent"
      },
      {
        "acteurRef": "PA721210",
        "presence": "présent"
      },
      {
        "acteurRef": "PA719118",
        "presence": "présent"
      },
      {
        "acteurRef": "PA720696",
        "presence": "présent"
      },
      {
        "acteurRef": "PA719162",
        "presence": "présent"
      },
      {
        "acteurRef": "PA608826",
        "presence": "présent"
      },
      {
        "acteurRef": "PA721194",
        "presence": "présent"
      },
      {
        "acteurRef": "PA719044",
        "presence": "présent"
      },
      {
        "acteurRef": "PA721896",
        "presence": "présent"
      },
      {
        "acteurRef": "PA719960",
        "presence": "présent"
      },
      {
        "acteurRef": "PA720030",
        "presence": "absent"
      },
      {
        "acteurRef": "PA720198",
        "presence": "présent"
      },
      {
        "acteurRef": "PA720178",
        "presence": "présent"
      },
      {
        "acteurRef": "PA267324",
        "presence": "présent"
      },
      {
        "acteurRef": "PA605991",
        "presence": "présent"
      },
      {
        "acteurRef": "PA719108",
        "presence": "présent"
      },
      {
        "acteurRef": "PA721784",
        "presence": "présent"
      },
      {
        "acteurRef": "PA722070",
        "presence": "présent"
      },
      {
        "acteurRef": "PA718794",
        "presence": "présent"
      },
      {
        "acteurRef": "PA332614",
        "presence": "présent"
      },
      {
        "acteurRef": "PA719230",
        "presence": "présent"
      },
      {
        "acteurRef": "PA721506",
        "presence": "présent"
      },
      {
        "acteurRef": "PA643205",
        "presence": "absent"
      },
      {
        "acteurRef": "PA331567",
        "presence": "présent"
      },
      {
        "acteurRef": "PA718868",
        "presence": "présent"
      },
      {
        "acteurRef": "PA719728",
        "presence": "présent"
      },
      {
        "acteurRef": "PA345722",
        "presence": "présent"
      },
      {
        "acteurRef": "PA720446",
        "presence": "présent"
      },
      {
        "acteurRef": "PA720988",
        "presence": "présent"
      },
      {
        "acteurRef": "PA719640",
        "presence": "présent"
      },
      {
        "acteurRef": "PA719272",
        "presence": "présent"
      },
      {
        "acteurRef": "PA720630",
        "presence": "présent"
      },
      {
        "acteurRef": "PA719456",
        "presence": "excusé"
      },
      {
        "acteurRef": "PA720908",
        "presence": "présent"
      },
      {
        "acteurRef": "PA721656",
        "presence": "présent"
      },
      {
        "acteurRef": "PA335532",
        "presence": "présent"
      },
      {
        "acteurRef": "PA719946",
        "presence": "présent"
      },
      {
        "acteurRef": "PA721234",
        "presence": "présent"
      },
      {
        "acteurRef": "PA721844",
        "presence": "présent"
      },
      {
        "acteurRef": "PA718944",
        "presence": "présent"
      },
      {
        "acteurRef": "PA721888",
        "presence": "présent"
      },
      {
        "acteurRef": "PA266776",
        "presence": "excusé"
      },
      {
        "acteurRef": "PA335758",
        "presence": "excusé"
      },
      {
        "acteurRef": "PA720900",
        "presence": "présent"
      },
      {
        "acteurRef": "PA720066",
        "presence": "excusé"
      },
      {
        "acteurRef": "PA722252",
        "presence": "excusé"
      },
      {
        "acteurRef": "PA718902",
        "presence": "présent"
      },
      {
        "acteurRef": "PA721226",
        "presence": "absent"
      },
      {
        "acteurRef": "PA720190",
        "presence": "présent"
      },
      {
        "acteurRef": "PA720754",
        "presence": "présent"
      },
      {
        "acteurRef": "PA720854",
        "presence": "présent"
      },
      {
        "acteurRef": "PA720568",
        "presence": "présent"
      },
      {
        "acteurRef": "PA340357",
        "presence": "absent"
      },
      {
        "acteurRef": "PA606639",
        "presence": "excusé"
      },
      {
        "acteurRef": "PA2952",
        "presence": "présent"
      }
    ]
  },
  "ouverturePresse": true,
  "odj": {
    "convocationOdj": [
      "Examen de la proposition de loi de M. Richard Ferrand relative à la lutte contre les fausses informations (n° 799) (M. Bruno Studer, rapporteur)",
      "Désignation de deux rapporteurs, en application de l’article 145-7 du Règlement, pour une mission d’évaluation de la loi n° 2015-1541 du 27 novembre 2015 visant à protéger les sportifs de haut niveau et professionnels et à sécuriser leur situation juridique et sociale"
    ],
    "resumeOdj": [
      "fausses informations (n° 799) (première lecture) (rapport) ;",
      "désignation de rapporteurs."
    ],
    "pointsOdj": [
      {
        "xsiType": "podjReunion_type",
        "uid": "RUANR5L15S2018IDC429232PT25638",
        "cycleDeVie": {
          "etat": "Eventuel",
          "chrono": {
            "creation": "2018-04-19T00:00:00.000+02:00"
          }
        },
        "objet": "Examen du texte",
        "dossiersLegislatifsRefs": [
          "DLR5L15N36488"
        ],
        "typePointOdj": "Examen",
        "comiteSecret": false
      },
      {
        "xsiType": "podjReunion_type",
        "uid": "RUANR5L15S2018IDC429232PT25639",
        "cycleDeVie": {
          "etat": "Supprimé",
          "chrono": {
            "creation": "2018-04-19T00:00:00.000+02:00",
            "cloture": "2018-04-20T00:00:00.000+02:00"
          }
        },
        "objet": "Examen du texte",
        "typePointOdj": "Examen",
        "comiteSecret": false
      }
    ]
  },
  "compteRenduRef": "CRCANR5L15S2018PO419604N047",
  "formatReunion": "Ordinaire",
  "infosReunionsInternationale": {
    "estReunionInternationale": false
  },
  "captationVideo": false
}