{
  "xsiType": "reunionInitParlementaire_type",
  "uid": "RUANR5L15S2019IDF0121974",
  "timestampDebut": "2018-12-04T14:00:00.000+01:00",
  "timestampFin": "2018-12-04T15:00:00.000+01:00",
  "lieu": {
    "code": "SALREU023",
    "libelleCourt": "Salle 7426",
    "libelleLong": "Salle 7426, 101, rue de l'Université"
  },
  "cycleDeVie": {
    "etat": "Confirmé",
    "chrono": {
      "creation": "2018-11-07T16:33:54.000+01:00"
    }
  },
  "demandeurs": {
    "acteurs": [
      {
        "nom": "M. Hervé BERVILLE",
        "acteurRef": "PA719218"
      }
    ]
  },
  "typeReunion": "DEP"
}