{
  "xsiType": "reunionInitParlementaire_type",
  "uid": "RUANR5L15S2019IDF0130508",
  "timestampDebut": "2019-04-23T12:00:00.000+02:00",
  "timestampFin": "2019-04-23T13:30:00.000+02:00",
  "lieu": {
    "code": "SALREU048",
    "libelleCourt": "Salle 6809",
    "libelleLong": "Salle 6809, Palais Bourbon"
  },
  "cycleDeVie": {
    "etat": "Confirmé",
    "chrono": {
      "creation": "2019-03-21T08:58:21.000+01:00"
    }
  },
  "demandeurs": {
    "acteurs": [
      {
        "nom": "M. Yves BLEIN",
        "acteurRef": "PA608641"
      }
    ]
  },
  "typeReunion": "DEP"
}