{
  "xsiType": "reunionInitParlementaire_type",
  "uid": "RUANR5L15S2018IDF0111737",
  "timestampDebut": "2018-06-05T15:00:00.000+02:00",
  "timestampFin": "2018-06-05T16:30:00.000+02:00",
  "lieu": {
    "code": "SALREU022",
    "libelleCourt": "Salle 7326",
    "libelleLong": "Salle 7326, 101, rue de l'Université"
  },
  "cycleDeVie": {
    "etat": "Confirmé",
    "chrono": {
      "creation": "2018-05-17T10:41:13.000+02:00"
    }
  },
  "demandeurs": {
    "acteurs": [
      {
        "nom": "Mme Perrine GOULET",
        "acteurRef": "PA720560"
      }
    ]
  },
  "typeReunion": "DEP"
}