{
  "xsiType": "reunionInitParlementaire_type",
  "uid": "RUANR5L15S2018IDF0112237",
  "timestampDebut": "2018-06-13T14:00:00.000+02:00",
  "timestampFin": "2018-06-13T15:00:00.000+02:00",
  "lieu": {
    "code": "SALREU007",
    "libelleCourt": "4ème Bureau",
    "libelleLong": "4ème Bureau, Palais Bourbon"
  },
  "cycleDeVie": {
    "etat": "Confirmé",
    "chrono": {
      "creation": "2018-05-24T11:14:07.000+02:00"
    }
  },
  "demandeurs": {
    "acteurs": [
      {
        "nom": "M. Paul-André COLOMBANI",
        "acteurRef": "PA719286"
      }
    ]
  },
  "typeReunion": "DEP"
}