{
  "xsiType": "reunionCommission_type",
  "uid": "RUANR5L15S2019IDC430889",
  "timestampDebut": "2018-12-11T17:05:00.000+01:00",
  "timestampFin": "2018-12-11T19:00:00.000+01:00",
  "lieu": {
    "libelleLong": "salle 4223 (33 rue Saint-Dominique, 2ème étage)"
  },
  "cycleDeVie": {
    "etat": "Confirmé",
    "chrono": {
      "creation": "2018-11-22T00:00:00.000+01:00"
    }
  },
  "organeReuniRef": "PO59047",
  "participants": {
    "participantsInternes": [
      {
        "acteurRef": "PA721036",
        "presence": "excusé"
      },
      {
        "acteurRef": "PA588884",
        "presence": "absent"
      },
      {
        "acteurRef": "PA642724",
        "presence": "absent"
      },
      {
        "acteurRef": "PA719218",
        "presence": "absent"
      },
      {
        "acteurRef": "PA330684",
        "presence": "absent"
      },
      {
        "acteurRef": "PA721118",
        "presence": "excusé"
      },
      {
        "acteurRef": "PA719496",
        "presence": "absent"
      },
      {
        "acteurRef": "PA721166",
        "presence": "absent"
      },
      {
        "acteurRef": "PA719448",
        "presence": "présent"
      },
      {
        "acteurRef": "PA719294",
        "presence": "présent"
      },
      {
        "acteurRef": "PA336439",
        "presence": "absent"
      },
      {
        "acteurRef": "PA718850",
        "presence": "absent"
      },
      {
        "acteurRef": "PA998",
        "presence": "absent"
      },
      {
        "acteurRef": "PA1008",
        "presence": "présent"
      },
      {
        "acteurRef": "PA1029",
        "presence": "présent"
      },
      {
        "acteurRef": "PA720862",
        "presence": "absent"
      },
      {
        "acteurRef": "PA720438",
        "presence": "absent"
      },
      {
        "acteurRef": "PA1198",
        "presence": "excusé"
      },
      {
        "acteurRef": "PA720684",
        "presence": "absent"
      },
      {
        "acteurRef": "PA1206",
        "presence": "absent"
      },
      {
        "acteurRef": "PA1276",
        "presence": "présent"
      },
      {
        "acteurRef": "PA722284",
        "presence": "absent"
      },
      {
        "acteurRef": "PA720222",
        "presence": "présent"
      },
      {
        "acteurRef": "PA718674",
        "presence": "absent"
      },
      {
        "acteurRef": "PA1498",
        "presence": "absent"
      },
      {
        "acteurRef": "PA610775",
        "presence": "excusé"
      },
      {
        "acteurRef": "PA695100",
        "presence": "présent"
      },
      {
        "acteurRef": "PA1630",
        "presence": "absent"
      },
      {
        "acteurRef": "PA333818",
        "presence": "présent"
      },
      {
        "acteurRef": "PA719210",
        "presence": "présent"
      },
      {
        "acteurRef": "PA722344",
        "presence": "présent"
      },
      {
        "acteurRef": "PA721644",
        "presence": "absent"
      },
      {
        "acteurRef": "PA720202",
        "presence": "excusé"
      },
      {
        "acteurRef": "PA720214",
        "presence": "absent"
      },
      {
        "acteurRef": "PA721004",
        "presence": "excusé"
      },
      {
        "acteurRef": "PA1809",
        "presence": "absent"
      },
      {
        "acteurRef": "PA1838",
        "presence": "absent"
      },
      {
        "acteurRef": "PA719664",
        "presence": "absent"
      },
      {
        "acteurRef": "PA335612",
        "presence": "présent"
      },
      {
        "acteurRef": "PA722008",
        "presence": "absent"
      },
      {
        "acteurRef": "PA721450",
        "presence": "absent"
      },
      {
        "acteurRef": "PA720342",
        "presence": "absent"
      },
      {
        "acteurRef": "PA720614",
        "presence": "excusé"
      },
      {
        "acteurRef": "PA1960",
        "presence": "présent"
      },
      {
        "acteurRef": "PA722178",
        "presence": "absent"
      },
      {
        "acteurRef": "PA334116",
        "presence": "absent"
      },
      {
        "acteurRef": "PA720146",
        "presence": "présent"
      },
      {
        "acteurRef": "PA720870",
        "presence": "présent"
      },
      {
        "acteurRef": "PA2150",
        "presence": "excusé"
      },
      {
        "acteurRef": "PA720370",
        "presence": "absent"
      },
      {
        "acteurRef": "PA719130",
        "presence": "présent"
      },
      {
        "acteurRef": "PA721734",
        "presence": "présent"
      },
      {
        "acteurRef": "PA719464",
        "presence": "présent"
      },
      {
        "acteurRef": "PA721486",
        "presence": "absent"
      },
      {
        "acteurRef": "PA721956",
        "presence": "présent"
      },
      {
        "acteurRef": "PA721182",
        "presence": "présent"
      },
      {
        "acteurRef": "PA721710",
        "presence": "absent"
      },
      {
        "acteurRef": "PA267260",
        "presence": "absent"
      },
      {
        "acteurRef": "PA719528",
        "presence": "absent"
      },
      {
        "acteurRef": "PA2492",
        "presence": "présent"
      },
      {
        "acteurRef": "PA720552",
        "presence": "absent"
      },
      {
        "acteurRef": "PA2529",
        "presence": "excusé"
      },
      {
        "acteurRef": "PA721824",
        "presence": "excusé"
      },
      {
        "acteurRef": "PA330788",
        "presence": "excusé"
      },
      {
        "acteurRef": "PA720138",
        "presence": "absent"
      },
      {
        "acteurRef": "PA717151",
        "presence": "présent"
      },
      {
        "acteurRef": "PA721174",
        "presence": "absent"
      },
      {
        "acteurRef": "PA722118",
        "presence": "absent"
      },
      {
        "acteurRef": "PA267794",
        "presence": "excusé"
      },
      {
        "acteurRef": "PA721690",
        "presence": "absent"
      },
      {
        "acteurRef": "PA719550",
        "presence": "absent"
      },
      {
        "acteurRef": "PA2796",
        "presence": "absent"
      },
      {
        "acteurRef": "PA720830",
        "presence": "absent"
      },
      {
        "acteurRef": "PA720746",
        "presence": "excusé"
      }
    ]
  },
  "ouverturePresse": true,
  "odj": {
    "convocationOdj": [
      "Audition, ouverte à la presse, de M. Georges Malbrunot, journaliste au Figaro spécialiste du Moyen-Orient, sur \" L'Arabie saoudite et son environnement régional \"."
    ],
    "resumeOdj": [
      "audition, ouverte à la presse, de M. Georges Malbrunot, sur \" L'Arabie saoudite et son environnement régional \"."
    ]
  },
  "compteRenduRef": "CRCANR5L15S2019PO59047N026",
  "formatReunion": "Ordinaire",
  "infosReunionsInternationale": {
    "estReunionInternationale": false
  },
  "captationVideo": false
}