{
  "xsiType": "reunionInitParlementaire_type",
  "uid": "RUANR5L15S2019IDF0120019",
  "timestampDebut": "2018-11-06T09:00:00.000+01:00",
  "timestampFin": "2018-11-06T12:00:00.000+01:00",
  "lieu": {
    "code": "SALREU017",
    "libelleCourt": "Salon Visconti",
    "libelleLong": "Salon Visconti, 101, rue de l'Université"
  },
  "cycleDeVie": {
    "etat": "Confirmé",
    "chrono": {
      "creation": "2018-10-03T12:52:25.000+02:00"
    }
  },
  "demandeurs": {
    "acteurs": [
      {
        "nom": "Mme Françoise DUMAS",
        "acteurRef": "PA606202"
      },
      {
        "nom": "M. Stanislas GUERINI",
        "acteurRef": "PA721498"
      }
    ]
  },
  "typeReunion": "DEP"
}