{
  "xsiType": "reunionCommission_type",
  "uid": "RUANR5L15S2019IDC433472",
  "timestampDebut": "2019-07-22T15:00:00.000+02:00",
  "lieu": {
    "libelleLong": "salle 7070 – rez-de-chaussée, 101, rue de l’Université"
  },
  "cycleDeVie": {
    "etat": "Confirmé",
    "chrono": {
      "creation": "2019-07-19T00:00:00.000+02:00"
    }
  },
  "organeReuniRef": "PO762778",
  "participants": {},
  "ouverturePresse": false,
  "odj": {
    "convocationOdj": [
      "Audition de M. le général de division aérienne Hervé Bertrand, chef de la division EMPLOI et de M. le capitaine de vaisseau Cyrille de Cerval."
    ],
    "resumeOdj": [
      "audition de M. le général de division aérienne Hervé Bertrand, chef de la division EMPLOI et de M. le capitaine de vaisseau Cyrille de Cerval."
    ]
  },
  "formatReunion": "Ordinaire",
  "infosReunionsInternationale": {
    "estReunionInternationale": false
  },
  "captationVideo": false
}