{
  "xsiType": "reunionInitParlementaire_type",
  "uid": "RUANR5L15S2019IDF0138110",
  "timestampDebut": "2019-09-03T15:00:00.000+02:00",
  "timestampFin": "2019-09-03T16:30:00.000+02:00",
  "lieu": {
    "code": "SALREU016",
    "libelleCourt": "Salon Gabriel",
    "libelleLong": "Salon Gabriel, 101, rue de l'Université"
  },
  "cycleDeVie": {
    "etat": "Annulé",
    "chrono": {
      "creation": "2019-07-26T11:47:53.000+02:00",
      "cloture": "2019-07-29T09:53:34.000+02:00"
    }
  },
  "demandeurs": {
    "acteurs": [
      {
        "nom": "M. Yannick KERLOGOT",
        "acteurRef": "PA719230"
      }
    ]
  },
  "typeReunion": "DEP"
}