{
  "xsiType": "reunionInitParlementaire_type",
  "uid": "RUANR5L15S2018IDF0101556",
  "timestampDebut": "2017-12-04T09:00:00.000+01:00",
  "timestampFin": "2017-12-04T11:00:00.000+01:00",
  "lieu": {
    "code": "SALREU049",
    "libelleCourt": "Salle 6822",
    "libelleLong": "Salle 6822, Palais Bourbon"
  },
  "cycleDeVie": {
    "etat": "Confirmé",
    "chrono": {
      "creation": "2017-11-29T10:00:19.000+01:00"
    }
  },
  "demandeurs": {
    "acteurs": [
      {
        "nom": "Mme George PAU-LANGEVIN",
        "acteurRef": "PA335532"
      }
    ]
  },
  "typeReunion": "DEP"
}