{
  "xsiType": "reunionInitParlementaire_type",
  "uid": "RUANR5L15S2018IDF0096471",
  "timestampDebut": "2017-10-05T19:00:00.000+02:00",
  "timestampFin": "2017-10-05T22:00:00.000+02:00",
  "lieu": {
    "code": "SALREU029",
    "libelleCourt": "Salon Mars III",
    "libelleLong": "Salon Mars III, 101, rue de l'Université"
  },
  "cycleDeVie": {
    "etat": "Confirmé",
    "chrono": {
      "creation": "2017-09-18T09:11:56.000+02:00"
    }
  },
  "demandeurs": {
    "acteurs": [
      {
        "nom": "M. Yves JÉGO",
        "acteurRef": "PA267801"
      }
    ]
  },
  "typeReunion": "DEP"
}