{
  "xsiType": "reunionCommission_type",
  "uid": "RUANR5L15S2019IDC431555",
  "timestampDebut": "2019-02-19T17:30:00.000+01:00",
  "lieu": {
    "libelleLong": "salle 6549 (2e étage)"
  },
  "cycleDeVie": {
    "etat": "Confirmé",
    "chrono": {
      "creation": "2019-02-11T00:00:00.000+01:00"
    }
  },
  "organeReuniRef": "PO762207",
  "participants": {},
  "ouverturePresse": false,
  "odj": {
    "convocationOdj": [
      "Audition de Mme Cécile Tagliana, adjointe du directeur général de la cohésion sociale (DGCS) et cheffe de service des politiques sociales et médico-sociales."
    ],
    "resumeOdj": [
      "audition de Mme Cécile Tagliana, adjointe du directeur général de la cohésion sociale (DGCS) et cheffe de service des politiques sociales et médico-sociales."
    ]
  },
  "formatReunion": "Ordinaire",
  "infosReunionsInternationale": {
    "estReunionInternationale": false
  },
  "captationVideo": false
}