{
  "xsiType": "reunionCommission_type",
  "uid": "RUANR5L15S2018IDC428094",
  "timestampDebut": "2017-12-14T08:00:00.000+01:00",
  "lieu": {
    "libelleLong": "salle 4204 - 33 rue Saint-Dominique, 2ème étage"
  },
  "cycleDeVie": {
    "etat": "Confirmé",
    "chrono": {
      "creation": "2017-12-08T00:00:00.000+01:00"
    }
  },
  "organeReuniRef": "PO744338",
  "participants": {},
  "ouverturePresse": false,
  "odj": {
    "convocationOdj": [
      "Venue d'une délégation autour du Secrétaire exécutif de l'OTICE, M. Lassina Zerbo, accompagné de M. Patrick Grenard, Directeur de l'administration, Mme Marion Berrens, coordination and liaison officer du Secrétaire exécutif, S.E. Jean-Louis Falconi, ambassadeur, représentant permanent de la France auprès des Nations unies à Vienne (DFRA Vienne) et M. Romain Le Floch', rédacteur,  sous-direction des affaires stratégiques, de sécurité et de désarmement (MEAE)."
    ],
    "resumeOdj": [
      "Venue d'une délégation autour du Secrétaire exécutif de l'OTICE, M. Lassina Zerbo, accompagné de M. Patrick Grenard, Directeur de l'administration, Mme Marion Berrens, coordination and liaison officer du Secrétaire exécutif, S.E. Jean-Louis Falconi, ambassadeur, représentant permanent de la France auprès des Nations unies à Vienne (DFRA Vienne) et M. Romain Le Floch', rédacteur,  sous-direction des affaires stratégiques, de sécurité et de désarmement (MEAE)."
    ]
  },
  "formatReunion": "Ordinaire",
  "infosReunionsInternationale": {
    "estReunionInternationale": false
  },
  "captationVideo": false
}