{
  "xsiType": "reunionInitParlementaire_type",
  "uid": "RUANR5L15S2019IDF0132187",
  "timestampDebut": "2019-05-24T18:00:00.000+02:00",
  "timestampFin": "2019-05-24T20:00:00.000+02:00",
  "lieu": {
    "code": "SALREU048",
    "libelleCourt": "Salle 6809",
    "libelleLong": "Salle 6809, Palais Bourbon"
  },
  "cycleDeVie": {
    "etat": "Confirmé",
    "chrono": {
      "creation": "2019-04-11T15:26:39.000+02:00"
    }
  },
  "demandeurs": {
    "acteurs": [
      {
        "nom": "M. Yves BLEIN",
        "acteurRef": "PA608641"
      }
    ]
  },
  "typeReunion": "DEP"
}