{
  "xsiType": "reunionInitParlementaire_type",
  "uid": "RUANR5L15S2019IDF0120500",
  "timestampDebut": "2019-02-19T09:30:00.000+01:00",
  "timestampFin": "2019-02-19T10:30:00.000+01:00",
  "lieu": {
    "code": "SALREU007",
    "libelleCourt": "4ème Bureau",
    "libelleLong": "4ème Bureau, Palais Bourbon"
  },
  "cycleDeVie": {
    "etat": "Annulé",
    "chrono": {
      "creation": "2018-10-11T12:55:15.000+02:00",
      "cloture": "2019-02-06T15:21:56.000+01:00"
    }
  },
  "demandeurs": {
    "acteurs": [
      {
        "nom": "Mme Amélie DE MONTCHALIN",
        "acteurRef": "PA721670"
      }
    ]
  },
  "typeReunion": "DEP"
}