{
  "xsiType": "reunionInitParlementaire_type",
  "uid": "RUANR5L15S2019IDF0129861",
  "timestampDebut": "2019-06-12T08:00:00.000+02:00",
  "timestampFin": "2019-06-12T09:15:00.000+02:00",
  "lieu": {
    "code": "SALREU019",
    "libelleCourt": "Salon Mars I",
    "libelleLong": "Salon Mars I, 101, rue de l'Université"
  },
  "cycleDeVie": {
    "etat": "Confirmé",
    "chrono": {
      "creation": "2019-03-13T16:25:42.000+01:00"
    }
  },
  "demandeurs": {
    "acteurs": [
      {
        "nom": "M. Sylvain WASERMAN",
        "acteurRef": "PA720746"
      }
    ]
  },
  "typeReunion": "DEP"
}