{
  "xsiType": "reunionCommission_type",
  "uid": "RUANR5L15S2018IDC428639",
  "timestampDebut": "2018-03-07T17:30:00.000+01:00",
  "lieu": {
    "libelleLong": "salle 4204, 33 rue Saint-Dominique"
  },
  "cycleDeVie": {
    "etat": "Confirmé",
    "chrono": {
      "creation": "2018-02-16T00:00:00.000+01:00"
    }
  },
  "organeReuniRef": "PO744207",
  "participants": {},
  "ouverturePresse": false,
  "odj": {
    "convocationOdj": [
      "– Audition de M. Serge Michailof, chercheur associé à l’IRIS et de M. Olivier Lafourcade, président du conseil d'administration d'I&P Développement"
    ],
    "resumeOdj": [
      "audition de M. Serge Michailof, chercheur associé à l’IRIS et de M. Olivier Lafourcade, président du conseil d'administration d'I&P Développement."
    ]
  },
  "formatReunion": "Ordinaire",
  "infosReunionsInternationale": {
    "estReunionInternationale": false
  },
  "captationVideo": false
}