{
  "xsiType": "reunionInitParlementaire_type",
  "uid": "RUANR5L15S2018IDF0112826",
  "timestampDebut": "2018-06-15T10:00:00.000+02:00",
  "timestampFin": "2018-06-15T17:00:00.000+02:00",
  "lieu": {
    "code": "SALREU012",
    "libelleCourt": "Salle N° 23",
    "libelleLong": "Salle N° 23, 3, rue Aristide Briand"
  },
  "cycleDeVie": {
    "etat": "Confirmé",
    "chrono": {
      "creation": "2018-06-01T16:32:29.000+02:00"
    }
  },
  "demandeurs": {
    "acteurs": [
      {
        "nom": "Mme Aurore BERGÉ",
        "acteurRef": "PA722046"
      }
    ]
  },
  "typeReunion": "DEP"
}