{
  "xsiType": "reunionCommission_type",
  "uid": "RUANR5L15S2020IDC434051",
  "timestampDebut": "2019-10-24T09:15:00.000+02:00",
  "lieu": {
    "libelleLong": "salle 6566 (Lois)"
  },
  "cycleDeVie": {
    "etat": "Confirmé",
    "chrono": {
      "creation": "2019-10-18T00:00:00.000+02:00"
    }
  },
  "organeReuniRef": "PO765565",
  "participants": {},
  "ouverturePresse": false,
  "odj": {
    "convocationOdj": [
      "Audition de M. Jérôme Moisant, secrétaire national Unité-SGP Police, et de M. Yann Bastière, référent national judiciaire."
    ],
    "resumeOdj": [
      "audition, à huis clos, de M. Jérôme Moisant, secrétaire national Unité-SGP Police, et de M. Yann Bastière, référent national judiciaire."
    ]
  },
  "formatReunion": "Ordinaire",
  "infosReunionsInternationale": {
    "estReunionInternationale": false
  },
  "captationVideo": false
}