{
  "xsiType": "reunionCommission_type",
  "uid": "RUANR5L15S2018IDC427451",
  "timestampDebut": "2017-10-11T11:00:00.000+02:00",
  "lieu": {
    "libelleLong": "salle Lamartine"
  },
  "cycleDeVie": {
    "etat": "Supprimé",
    "chrono": {
      "creation": "2017-10-05T00:00:00.000+02:00",
      "cloture": "2017-10-12T00:00:00.000+02:00"
    }
  },
  "organeReuniRef": "PO59047",
  "participants": {},
  "ouverturePresse": false,
  "odj": {
    "convocationOdj": [
      "Premier échange de vues, à huis clos, sur les avis budgétaires (suite des travaux du mercredi 4 octobre 2017)."
    ],
    "resumeOdj": [
      "premier échange de vues, à huis clos, sur les avis budgétaires (suite des travaux du mercredi 4 octobre 2017)."
    ]
  },
  "formatReunion": "Ordinaire",
  "infosReunionsInternationale": {
    "estReunionInternationale": false
  },
  "captationVideo": false
}