{
  "xsiType": "reunionInitParlementaire_type",
  "uid": "RUANR5L15S2019IDF0132115",
  "timestampDebut": "2019-05-21T17:00:00.000+02:00",
  "timestampFin": "2019-05-21T19:00:00.000+02:00",
  "lieu": {
    "code": "SALREU008",
    "libelleCourt": "5ème Bureau",
    "libelleLong": "5ème Bureau, Palais Bourbon"
  },
  "cycleDeVie": {
    "etat": "Confirmé",
    "chrono": {
      "creation": "2019-04-10T17:36:45.000+02:00"
    }
  },
  "demandeurs": {
    "acteurs": [
      {
        "nom": "M. Jean-Félix ACQUAVIVA",
        "acteurRef": "PA719146"
      }
    ]
  },
  "typeReunion": "DEP"
}