{
  "xsiType": "reunionInitParlementaire_type",
  "uid": "RUANR5L15S2019IDF0121858",
  "timestampDebut": "2018-12-20T14:00:00.000+01:00",
  "timestampFin": "2018-12-20T16:30:00.000+01:00",
  "lieu": {
    "code": "SALREU016",
    "libelleCourt": "Salon Gabriel",
    "libelleLong": "Salon Gabriel, 101, rue de l'Université"
  },
  "cycleDeVie": {
    "etat": "Confirmé",
    "chrono": {
      "creation": "2018-11-06T11:44:59.000+01:00"
    }
  },
  "demandeurs": {
    "organe": {
      "nom": "Groupe d'amitié France-Bangladesh",
      "organeRef": "PO733252"
    }
  },
  "organeReuniRef": "PO733252",
  "typeReunion": "GA"
}