{
  "xsiType": "reunionInitParlementaire_type",
  "uid": "RUANR5L15S2019IDF0119223",
  "timestampDebut": "2018-10-17T17:00:00.000+02:00",
  "timestampFin": "2018-10-17T19:00:00.000+02:00",
  "lieu": {
    "code": "SALREU006",
    "libelleCourt": "3ème Bureau",
    "libelleLong": "3ème Bureau, Palais Bourbon"
  },
  "cycleDeVie": {
    "etat": "Annulé",
    "chrono": {
      "creation": "2018-09-24T11:07:43.000+02:00",
      "cloture": "2018-10-12T10:12:12.000+02:00"
    }
  },
  "demandeurs": {
    "acteurs": [
      {
        "nom": "Mme Pascale FONTENEL-PERSONNE",
        "acteurRef": "PA721384"
      }
    ]
  },
  "typeReunion": "DEP"
}