{
  "xsiType": "seance_type",
  "uid": "RUANR5L15S2018IDS20869",
  "timestampDebut": "2018-01-25T21:30:00.000+01:00",
  "lieu": {
    "code": "AN",
    "libelleLong": "Assemblée nationale"
  },
  "cycleDeVie": {
    "etat": "Supprimé",
    "chrono": {
      "creation": "2017-12-15T00:00:00.000+01:00",
      "cloture": "2018-01-25T00:00:00.000+01:00"
    }
  },
  "organeReuniRef": "PO717460",
  "sessionRef": "SCR5A2018O1",
  "ouverturePresse": true,
  "odj": {
    "pointsOdj": [
      {
        "xsiType": "podjSeanceConfPres_type",
        "uid": "RUANR5L15S2018IDS20869PT35450",
        "cycleDeVie": {
          "etat": "Supprimé",
          "chrono": {
            "creation": "2017-12-18T00:00:00.000+01:00",
            "cloture": "2018-01-25T00:00:00.000+01:00"
          }
        },
        "objet": "Suite de la discussion du projet de loi pour un État au service d’une société de confiance",
        "typePointOdj": "Suite de la discussion",
        "comiteSecret": false,
        "natureTravauxOdj": "ODJPR"
      }
    ]
  },
  "identifiants": {
    "quantieme": "Troisième",
    "dateSeance": "2018-01-25T01:00:00.000+01:00"
  },
  "captationVideo": true
}