{
  "xsiType": "reunionInitParlementaire_type",
  "uid": "RUANR5L15S2018IDF0102487",
  "timestampDebut": "2017-12-19T14:00:00.000+01:00",
  "timestampFin": "2017-12-19T15:30:00.000+01:00",
  "lieu": {
    "code": "SALREU046",
    "libelleCourt": "Sully 1",
    "libelleLong": "Sully 1, Palais Bourbon"
  },
  "cycleDeVie": {
    "etat": "Confirmé",
    "chrono": {
      "creation": "2017-12-15T15:29:31.000+01:00"
    }
  },
  "demandeurs": {
    "acteurs": [
      {
        "nom": "Mme Monica MICHEL",
        "acteurRef": "PA719130"
      }
    ]
  },
  "typeReunion": "DEP"
}