{
  "xsiType": "reunionInitParlementaire_type",
  "uid": "RUANR5L15S2018IDF0113767",
  "timestampDebut": "2018-06-22T18:00:00.000+02:00",
  "timestampFin": "2018-06-22T20:00:00.000+02:00",
  "lieu": {
    "code": "SALREU029",
    "libelleCourt": "Salon Mars III",
    "libelleLong": "Salon Mars III, 101, rue de l'Université"
  },
  "cycleDeVie": {
    "etat": "Annulé",
    "chrono": {
      "creation": "2018-06-15T14:00:31.000+02:00",
      "cloture": "2018-06-18T10:45:03.000+02:00"
    }
  },
  "demandeurs": {
    "acteurs": [
      {
        "nom": "M. Christophe AREND",
        "acteurRef": "PA720310"
      }
    ]
  },
  "typeReunion": "DEP"
}