{
  "xsiType": "reunionInitParlementaire_type",
  "uid": "RUANR5L15S2019IDF0118072",
  "timestampDebut": "2018-11-08T08:00:00.000+01:00",
  "timestampFin": "2018-11-09T00:00:00.000+01:00",
  "lieu": {
    "code": "SALREU044",
    "libelleCourt": "Sully 2",
    "libelleLong": "Sully 2, Palais Bourbon"
  },
  "cycleDeVie": {
    "etat": "Annulé",
    "chrono": {
      "creation": "2018-09-10T16:09:53.000+02:00",
      "cloture": "2018-11-07T12:03:29.000+01:00"
    }
  },
  "demandeurs": {
    "organe": {
      "nom": "GROUPE LA FRANCE INSOUMISE",
      "organeRef": "PO730958"
    }
  },
  "organeReuniRef": "PO730958",
  "typeReunion": "GP"
}