{
  "xsiType": "reunionInitParlementaire_type",
  "uid": "RUANR5L15S2018IDF0111803",
  "timestampDebut": "2018-05-18T08:00:00.000+02:00",
  "timestampFin": "2018-05-18T15:00:00.000+02:00",
  "lieu": {
    "code": "SALREU020",
    "libelleCourt": "Salon Mars II",
    "libelleLong": "Salon Mars II, 101, rue de l'Université"
  },
  "cycleDeVie": {
    "etat": "Confirmé",
    "chrono": {
      "creation": "2018-05-17T18:32:03.000+02:00"
    }
  },
  "demandeurs": {
    "acteurs": [
      {
        "nom": "M. Jean-Noël BARROT",
        "acteurRef": "PA721836"
      }
    ]
  },
  "typeReunion": "DEP"
}