{
  "xsiType": "reunionCommission_type",
  "uid": "RUANR5L15S2020IDC433908",
  "timestampDebut": "2019-10-29T17:00:00.000+01:00",
  "timestampFin": "2019-10-29T19:30:00.000+01:00",
  "lieu": {
    "libelleLong": "salle Lamartine"
  },
  "cycleDeVie": {
    "etat": "Confirmé",
    "chrono": {
      "creation": "2019-10-07T00:00:00.000+02:00"
    }
  },
  "organeReuniRef": "PO273589",
  "participants": {
    "participantsInternes": [
      {
        "acteurRef": "PA703519",
        "presence": "absent"
      },
      {
        "acteurRef": "PA609726",
        "presence": "absent"
      },
      {
        "acteurRef": "PA721776",
        "presence": "absent"
      },
      {
        "acteurRef": "PA513",
        "presence": "absent"
      },
      {
        "acteurRef": "PA720162",
        "presence": "présent"
      },
      {
        "acteurRef": "PA267233",
        "presence": "excusé"
      },
      {
        "acteurRef": "PA720298",
        "presence": "absent"
      },
      {
        "acteurRef": "PA944",
        "presence": "absent"
      },
      {
        "acteurRef": "PA736192",
        "presence": "excusé"
      },
      {
        "acteurRef": "PA736160",
        "presence": "absent"
      },
      {
        "acteurRef": "PA719692",
        "presence": "présent"
      },
      {
        "acteurRef": "PA719960",
        "presence": "absent"
      },
      {
        "acteurRef": "PA722366",
        "presence": "présent"
      },
      {
        "acteurRef": "PA267735",
        "presence": "excusé"
      },
      {
        "acteurRef": "PA722358",
        "presence": "absent"
      },
      {
        "acteurRef": "PA721024",
        "presence": "absent"
      },
      {
        "acteurRef": "PA736168",
        "presence": "absent"
      },
      {
        "acteurRef": "PA722070",
        "presence": "absent"
      },
      {
        "acteurRef": "PA267355",
        "presence": "excusé"
      },
      {
        "acteurRef": "PA608416",
        "presence": "excusé"
      },
      {
        "acteurRef": "PA736232",
        "presence": "absent"
      },
      {
        "acteurRef": "PA736225",
        "presence": "absent"
      },
      {
        "acteurRef": "PA736246",
        "presence": "absent"
      },
      {
        "acteurRef": "PA335612",
        "presence": "absent"
      },
      {
        "acteurRef": "PA736186",
        "presence": "absent"
      },
      {
        "acteurRef": "PA1993",
        "presence": "présent"
      },
      {
        "acteurRef": "PA415484",
        "presence": "excusé"
      },
      {
        "acteurRef": "PA703480",
        "presence": "absent"
      },
      {
        "acteurRef": "PA736243",
        "presence": "absent"
      },
      {
        "acteurRef": "PA736200",
        "presence": "absent"
      },
      {
        "acteurRef": "PA736209",
        "presence": "absent"
      },
      {
        "acteurRef": "PA304086",
        "presence": "présent"
      },
      {
        "acteurRef": "PA719578",
        "presence": "absent"
      },
      {
        "acteurRef": "PA227094",
        "presence": "absent"
      },
      {
        "acteurRef": "PA720014",
        "presence": "excusé"
      },
      {
        "acteurRef": "PA722260",
        "presence": "absent"
      }
    ]
  },
  "ouverturePresse": true,
  "odj": {
    "convocationOdj": [
      "Audition publique sur les enjeux du conseil ministériel de l’Agence spatiale européenne (ESA) les 27 et 28 novembre 2019 à Séville (Espagne)."
    ],
    "resumeOdj": [
      "audition publique sur les enjeux du conseil ministériel de l’Agence spatiale européenne (ESA) les 27 et 28 novembre 2019 à Séville (Espagne)."
    ]
  },
  "compteRenduRef": "CRCANR5L15S2020PO273589N055",
  "formatReunion": "Ordinaire",
  "infosReunionsInternationale": {
    "estReunionInternationale": false
  },
  "captationVideo": true
}