{
  "xsiType": "reunionInitParlementaire_type",
  "uid": "RUANR5L15S2020IDF0141776",
  "timestampDebut": "2019-12-11T08:15:00.000+01:00",
  "timestampFin": "2019-12-11T09:30:00.000+01:00",
  "lieu": {
    "code": "SALREU013",
    "libelleCourt": "Salle N° 3",
    "libelleLong": "Salle N° 3, 3, rue Aristide Briand"
  },
  "cycleDeVie": {
    "etat": "Confirmé",
    "chrono": {
      "creation": "2019-10-09T11:42:58.000+02:00"
    }
  },
  "demandeurs": {
    "acteurs": [
      {
        "nom": "M. Olivier BECHT",
        "acteurRef": "PA642935"
      }
    ]
  },
  "typeReunion": "DEP"
}