{
  "xsiType": "reunionInitParlementaire_type",
  "uid": "RUANR5L15S2019IDF0137403",
  "timestampDebut": "2019-07-24T11:00:00.000+02:00",
  "timestampFin": "2019-07-24T12:00:00.000+02:00",
  "lieu": {
    "code": "SALREU016",
    "libelleCourt": "Salon Gabriel",
    "libelleLong": "Salon Gabriel, 101, rue de l'Université"
  },
  "cycleDeVie": {
    "etat": "Confirmé",
    "chrono": {
      "creation": "2019-07-12T16:54:12.000+02:00"
    }
  },
  "demandeurs": {
    "acteurs": [
      {
        "nom": "M. Paul CHRISTOPHE",
        "acteurRef": "PA642868"
      }
    ]
  },
  "typeReunion": "DEP"
}