{
  "xsiType": "reunionInitParlementaire_type",
  "uid": "RUANR5L15S2017IDF0093506",
  "timestampDebut": "2017-09-19T10:15:00.000+02:00",
  "timestampFin": "2017-09-19T10:45:00.000+02:00",
  "lieu": {
    "code": "SALREU027",
    "libelleCourt": "Salle 6217",
    "libelleLong": "Salle 6217, Palais Bourbon"
  },
  "cycleDeVie": {
    "etat": "Annulé",
    "chrono": {
      "creation": "2017-07-06T11:32:40.000+02:00",
      "cloture": "2017-09-08T15:54:17.000+02:00"
    }
  },
  "demandeurs": {
    "acteurs": [
      {
        "nom": "M. Christian JACOB",
        "acteurRef": "PA1695"
      }
    ]
  },
  "typeReunion": "DEP"
}