{
  "xsiType": "seance_type",
  "uid": "RUANR5L15S2019IDS21731",
  "timestampDebut": "2019-06-25T15:00:00.000+02:00",
  "timestampFin": "2019-06-25T20:00:00.000+02:00",
  "lieu": {
    "code": "AN",
    "libelleLong": "Assemblée nationale"
  },
  "cycleDeVie": {
    "etat": "Confirmé",
    "chrono": {
      "creation": "2019-06-03T00:00:00.000+02:00"
    }
  },
  "organeReuniRef": "PO717460",
  "sessionRef": "SCR5A2019O1",
  "ouverturePresse": true,
  "odj": {
    "pointsOdj": [
      {
        "xsiType": "podjSeanceConfPres_type",
        "uid": "RUANR5L15S2019IDS21731PT37399",
        "cycleDeVie": {
          "etat": "Confirmé",
          "chrono": {
            "creation": "2019-06-03T00:00:00.000+02:00"
          }
        },
        "objet": "Questions au Gouvernement",
        "typePointOdj": "Questions au Gouvernement",
        "comiteSecret": false,
        "natureTravauxOdj": "ODJPR",
        "dateConfPres": "2019-06-25T02:00:00.000+02:00"
      },
      {
        "xsiType": "podjSeanceConfPres_type",
        "uid": "RUANR5L15S2019IDS21731PT37400",
        "cycleDeVie": {
          "etat": "Confirmé",
          "chrono": {
            "creation": "2019-06-03T00:00:00.000+02:00"
          }
        },
        "objet": "Suite de la discussion du projet de loi, adopté par le Sénat après engagement de la procédure accélérée, relatif aux compétences de la Collectivité européenne d'Alsace",
        "dossiersLegislatifsRefs": [
          "DLR5L15N37289"
        ],
        "typePointOdj": "Suite de la discussion",
        "comiteSecret": false,
        "natureTravauxOdj": "ODJPR"
      },
      {
        "xsiType": "podjSeanceConfPres_type",
        "uid": "RUANR5L15S2019IDS21731PT37401",
        "cycleDeVie": {
          "etat": "Supprimé",
          "chrono": {
            "creation": "2019-06-03T00:00:00.000+02:00",
            "cloture": "2019-06-26T00:00:00.000+02:00"
          }
        },
        "objet": "Discussion du projet de loi relatif à l'énergie et au climat",
        "typePointOdj": "Discussion",
        "comiteSecret": false,
        "natureTravauxOdj": "ODJPR"
      },
      {
        "xsiType": "podjSeanceConfPres_type",
        "uid": "RUANR5L15S2019IDS21731PT37429",
        "cycleDeVie": {
          "etat": "Supprimé",
          "chrono": {
            "creation": "2019-06-11T00:00:00.000+02:00",
            "cloture": "2019-06-25T00:00:00.000+02:00"
          }
        },
        "objet": "ou vote par scrutin public sur ce projet de loi",
        "typePointOdj": "Explications de vote et vote par scrutin public",
        "comiteSecret": false,
        "natureTravauxOdj": "ODJPR"
      },
      {
        "xsiType": "podjSeanceConfPres_type",
        "uid": "RUANR5L15S2019IDS21731PT37420",
        "cycleDeVie": {
          "etat": "Supprimé",
          "chrono": {
            "creation": "2019-06-03T00:00:00.000+02:00",
            "cloture": "2019-06-07T00:00:00.000+02:00"
          }
        },
        "objet": "Explications de vote et vote par scrutin public, adopté par le Sénat après engagement de la procédure accélérée, relatif aux compétences de la Collectivité européenne d'Alsace",
        "typePointOdj": "Explications de vote et vote par scrutin public",
        "comiteSecret": false,
        "natureTravauxOdj": "ODJPR"
      }
    ]
  },
  "compteRenduRef": "CRSANR5L15S2019O1N288",
  "identifiants": {
    "numSeanceJo": "288",
    "idJo": "20190288",
    "quantieme": "Première",
    "dateSeance": "2019-06-25T02:00:00.000+02:00"
  },
  "captationVideo": true
}