{
  "xsiType": "reunionCommission_type",
  "uid": "RUANR5L15S2020IDC434016",
  "timestampDebut": "2019-10-24T09:00:00.000+02:00",
  "lieu": {
    "libelleLong": "salle du CEC"
  },
  "cycleDeVie": {
    "etat": "Confirmé",
    "chrono": {
      "creation": "2019-10-18T00:00:00.000+02:00"
    }
  },
  "organeReuniRef": "PO760976",
  "participants": {
    "participantsInternes": [
      {
        "acteurRef": "PA721718",
        "presence": "présent"
      },
      {
        "acteurRef": "PA720684",
        "presence": "présent"
      }
    ]
  },
  "ouverturePresse": false,
  "odj": {
    "convocationOdj": [
      "- Table ronde sur le thème : \" Améliorer l'insertion professionnelle des immigrés \", avec : Mme Agnès Fontana, directrice de l'accueil, de l'accompagnement des étrangers et de la nationalité, direction générale des étrangers en France (DGEF), ministère de l'intérieur ; M. Alain Régnier, préfet, délégué interministériel chargé de l'accueil et de l'intégration des réfugiés (DiAir), ministère de l'intérieur ; M. Didier Leschi, directeur général de l'office français de l'immigration et de l'intégration (OFII), ministère de l'intérieur ; M. Pierre Henry, directeur général de France terre d'asile."
    ],
    "resumeOdj": [
      "table ronde sur le thème : \" Améliorer l'insertion professionnelle des immigrés \", avec :",
      "Mme Agnès Fontana, directrice de l'accueil, de l'accompagnement des étrangers et de la nationalité, direction générale des étrangers en France (DGEF), ministère de l'intérieur ;",
      "M. Alain Régnier, préfet, délégué interministériel chargé de l'accueil et de l'intégration des réfugiés (DiAir), ministère de l'intérieur ;",
      "M. Didier Leschi, directeur général de l'office français de l'immigration et de l'intégration (OFII), ministère de l'intérieur ;",
      "M. Pierre Henry, directeur général de France terre d'asile."
    ]
  },
  "formatReunion": "Ordinaire",
  "infosReunionsInternationale": {
    "estReunionInternationale": false
  },
  "captationVideo": false
}