{
  "xsiType": "reunionInitParlementaire_type",
  "uid": "RUANR5L15S2019IDF0123092",
  "timestampDebut": "2018-12-05T15:00:00.000+01:00",
  "timestampFin": "2018-12-05T17:00:00.000+01:00",
  "lieu": {
    "code": "SALREU023",
    "libelleCourt": "Salle 7426",
    "libelleLong": "Salle 7426, 101, rue de l'Université"
  },
  "cycleDeVie": {
    "etat": "Confirmé",
    "chrono": {
      "creation": "2018-11-27T17:32:28.000+01:00"
    }
  },
  "demandeurs": {
    "acteurs": [
      {
        "nom": "Mme Sabine THILLAYE",
        "acteurRef": "PA719822"
      }
    ]
  },
  "typeReunion": "DEP"
}