{
  "xsiType": "reunionInitParlementaire_type",
  "uid": "RUANR5L15S2020IDF0141890",
  "timestampDebut": "2019-11-07T11:00:00.000+01:00",
  "timestampFin": "2019-11-07T13:00:00.000+01:00",
  "lieu": {
    "code": "SALREU023",
    "libelleCourt": "Salle 7426",
    "libelleLong": "Salle 7426, 101, rue de l'Université"
  },
  "cycleDeVie": {
    "etat": "Annulé",
    "chrono": {
      "creation": "2019-10-10T16:30:20.000+02:00",
      "cloture": "2019-10-31T10:55:34.000+01:00"
    }
  },
  "demandeurs": {
    "acteurs": [
      {
        "nom": "Mme Pascale BOYER",
        "acteurRef": "PA718710"
      }
    ]
  },
  "typeReunion": "DEP"
}