{
  "xsiType": "reunionInitParlementaire_type",
  "uid": "RUANR5L15S2018IDF0109451",
  "timestampDebut": "2018-04-25T16:30:00.000+02:00",
  "timestampFin": "2018-04-25T19:00:00.000+02:00",
  "lieu": {
    "code": "SALREU049",
    "libelleCourt": "Salle 6822",
    "libelleLong": "Salle 6822, Palais Bourbon"
  },
  "cycleDeVie": {
    "etat": "Confirmé",
    "chrono": {
      "creation": "2018-04-06T16:25:51.000+02:00"
    }
  },
  "demandeurs": {
    "acteurs": [
      {
        "nom": "M. Pierre PERSON",
        "acteurRef": "PA721568"
      }
    ]
  },
  "typeReunion": "DEP"
}