{
  "xsiType": "reunionInitParlementaire_type",
  "uid": "RUANR5L15S2020IDF0136874",
  "timestampDebut": "2019-10-18T08:00:00.000+02:00",
  "timestampFin": "2019-10-18T17:30:00.000+02:00",
  "lieu": {
    "code": "SALREU003",
    "libelleCourt": "Salle Victor Hugo",
    "libelleLong": "Salle Victor Hugo, 101, rue de l'Université"
  },
  "cycleDeVie": {
    "etat": "Annulé",
    "chrono": {
      "creation": "2019-07-04T15:04:25.000+02:00",
      "cloture": "2019-09-19T15:44:40.000+02:00"
    }
  },
  "demandeurs": {
    "acteurs": [
      {
        "nom": "M. Jérôme LAMBERT",
        "acteurRef": "PA1809"
      }
    ]
  },
  "typeReunion": "DEP"
}