{
  "xsiType": "reunionCommission_type",
  "uid": "RUANR5L15S2019IDC433007",
  "timestampDebut": "2019-06-19T13:30:00.000+02:00",
  "lieu": {
    "libelleLong": "salle 4123 (33 rue Saint-Dominique)"
  },
  "cycleDeVie": {
    "etat": "Supprimé",
    "chrono": {
      "creation": "2019-06-06T00:00:00.000+02:00",
      "cloture": "2019-06-13T00:00:00.000+02:00"
    }
  },
  "organeReuniRef": "PO744127",
  "participants": {},
  "ouverturePresse": true,
  "odj": {
    "convocationOdj": [
      "—  Discussion des propositions qui pourraient être formulées dans le cadre de la discussion du projet de loi constitutionnelle « pour le renouveau de la vie démocratique » (sous réserve de son dépôt).—  Nomination de rapporteurs sur :- le projet de loi constitutionnelle « pour le renouveau de la vie démocratique » (sous réserve de son dépôt) ;- le projet de loi « relatif à l’accompagnement de l’engagement des élus locaux » (sous réserve de son dépôt)."
    ],
    "resumeOdj": [
      "discussion des propositions qui pourraient être formulées dans le cadre de la discussion du projet de loi constitutionnelle « pour le renouveau de la vie démocratique » (sous réserve de son dépôt).",
      "nomination de rapporteurs sur :",
      "le projet de loi constitutionnelle « pour le renouveau de la vie démocratique » (sous réserve de son dépôt) ;",
      "le projet de loi « relatif à l’accompagnement de l’engagement des élus locaux » (sous réserve de son dépôt)."
    ]
  },
  "formatReunion": "Ordinaire",
  "infosReunionsInternationale": {
    "estReunionInternationale": false
  },
  "captationVideo": true
}