{
  "xsiType": "reunionCommission_type",
  "uid": "RUANR5L15S2018IDC427492",
  "timestampDebut": "2017-12-07T09:30:00.000+01:00",
  "lieu": {
    "libelleLong": "salle 4013 (33 rue Saint-Dominique)"
  },
  "cycleDeVie": {
    "etat": "Confirmé",
    "chrono": {
      "creation": "2017-10-06T00:00:00.000+02:00"
    }
  },
  "organeReuniRef": "PO734965",
  "participants": {},
  "ouverturePresse": false,
  "odj": {
    "convocationOdj": [
      "Audition de M. Jean-Paul Bodin, secrétaire général pour l’administration ;"
    ],
    "resumeOdj": [
      "Audition de M. Jean-Paul Bodin, secrétaire général pour l’administration."
    ]
  },
  "formatReunion": "Ordinaire",
  "infosReunionsInternationale": {
    "estReunionInternationale": false
  },
  "captationVideo": false
}