{
  "xsiType": "reunionInitParlementaire_type",
  "uid": "RUANR5L15S2020IDF0140724",
  "timestampDebut": "2019-10-02T18:00:00.000+02:00",
  "timestampFin": "2019-10-02T19:00:00.000+02:00",
  "lieu": {
    "code": "SALREU023",
    "libelleCourt": "Salle 7426",
    "libelleLong": "Salle 7426, 101, rue de l'Université"
  },
  "cycleDeVie": {
    "etat": "Confirmé",
    "chrono": {
      "creation": "2019-09-24T10:25:58.000+02:00"
    }
  },
  "demandeurs": {
    "acteurs": [
      {
        "nom": "M. Jean-René CAZENEUVE",
        "acteurRef": "PA719472"
      }
    ]
  },
  "typeReunion": "DEP"
}