{
  "xsiType": "reunionInitParlementaire_type",
  "uid": "RUANR5L15S2019IDF0139133",
  "timestampDebut": "2019-09-10T10:00:00.000+02:00",
  "timestampFin": "2019-09-10T11:00:00.000+02:00",
  "lieu": {
    "code": "SALREU022",
    "libelleCourt": "Salle 7326",
    "libelleLong": "Salle 7326, 101, rue de l'Université"
  },
  "cycleDeVie": {
    "etat": "Confirmé",
    "chrono": {
      "creation": "2019-09-05T14:50:46.000+02:00"
    }
  },
  "demandeurs": {
    "acteurs": [
      {
        "nom": "Mme Olivia GREGOIRE",
        "acteurRef": "PA721764"
      }
    ]
  },
  "typeReunion": "DEP"
}