{
  "xsiType": "reunionCommission_type",
  "uid": "RUANR5L15S2019IDC431410",
  "timestampDebut": "2019-01-23T17:30:00.000+01:00",
  "timestampFin": "2019-01-23T18:30:00.000+01:00",
  "lieu": {
    "libelleLong": "salle 6549 (2e étage)"
  },
  "cycleDeVie": {
    "etat": "Confirmé",
    "chrono": {
      "creation": "2019-01-31T00:00:00.000+01:00"
    }
  },
  "organeReuniRef": "PO760588",
  "participants": {},
  "ouverturePresse": false,
  "odj": {
    "convocationOdj": [
      "Audition, non ouverte à la presse, de Mme Brigitte Plateau, directrice générale à la Direction générale de l’enseignement supérieur et de l’insertion professionnelle (DGESIP), de M. Eric Piozin, chef de service de la stratégie de contractualisation, du financement et de l'immobilier,  de M. Yves Guillotin, conseiller de sites et d’établissements à la Mission Expertise Conseil, et de M. Olivier Ladaique, adjoint au chef du département de la réglementation"
    ],
    "resumeOdj": [
      "audition, non ouverte à la presse, de Mme Brigitte Plateau, directrice générale à la Direction générale de l’enseignement supérieur et de l’insertion professionnelle (DGESIP), de M. Eric Piozin, chef de service de la stratégie de contractualisation, du financement et de l'immobilier,  de M. Yves Guillotin, conseiller de sites et d’établissements à la Mission Expertise Conseil, et de M. Olivier Ladaique, adjoint au chef du département de la réglementation."
    ]
  },
  "formatReunion": "Ordinaire",
  "infosReunionsInternationale": {
    "estReunionInternationale": false
  },
  "captationVideo": false
}