{
  "xsiType": "reunionCommission_type",
  "uid": "RUANR5L15S2019IDC431044",
  "timestampDebut": "2018-12-18T17:00:00.000+01:00",
  "lieu": {
    "libelleLong": "salle 6237 (Développement durable)"
  },
  "cycleDeVie": {
    "etat": "Confirmé",
    "chrono": {
      "creation": "2018-12-11T00:00:00.000+01:00"
    }
  },
  "organeReuniRef": "PO758945",
  "participants": {},
  "ouverturePresse": false,
  "odj": {
    "convocationOdj": [
      "Audition de M. Jérôme Mousset, chef du service forêt, alimentation et bioéconomie et de M. Bruno Gagnepain, ingénieur sur les biocarburants, de l'ADEME"
    ],
    "resumeOdj": [
      "audition de l'ADEME."
    ]
  },
  "formatReunion": "Ordinaire",
  "infosReunionsInternationale": {
    "estReunionInternationale": false
  },
  "captationVideo": false
}