{
  "xsiType": "reunionInitParlementaire_type",
  "uid": "RUANR5L15S2019IDF0135866",
  "timestampDebut": "2019-07-10T10:30:00.000+02:00",
  "timestampFin": "2019-07-10T12:30:00.000+02:00",
  "lieu": {
    "code": "SALREU006",
    "libelleCourt": "3ème Bureau",
    "libelleLong": "3ème Bureau, Palais Bourbon"
  },
  "cycleDeVie": {
    "etat": "Confirmé",
    "chrono": {
      "creation": "2019-06-19T10:20:05.000+02:00"
    }
  },
  "demandeurs": {
    "acteurs": [
      {
        "nom": "M. Julien AUBERT",
        "acteurRef": "PA609726"
      }
    ]
  },
  "typeReunion": "DEP"
}