{
  "xsiType": "reunionInitParlementaire_type",
  "uid": "RUANR5L15S2019IDF0131064",
  "timestampDebut": "2019-04-11T11:30:00.000+02:00",
  "timestampFin": "2019-04-11T13:00:00.000+02:00",
  "lieu": {
    "code": "SALREU012",
    "libelleCourt": "Salle N° 23",
    "libelleLong": "Salle N° 23, 3, rue Aristide Briand"
  },
  "cycleDeVie": {
    "etat": "Confirmé",
    "chrono": {
      "creation": "2019-03-28T09:19:30.000+01:00"
    }
  },
  "demandeurs": {
    "acteurs": [
      {
        "nom": "Mme Cathy RACON-BOUZON",
        "acteurRef": "PA718944"
      }
    ]
  },
  "typeReunion": "DEP"
}