{
  "xsiType": "reunionInitParlementaire_type",
  "uid": "RUANR5L15S2019IDF0137347",
  "timestampDebut": "2019-09-18T18:00:00.000+02:00",
  "timestampFin": "2019-09-18T21:00:00.000+02:00",
  "lieu": {
    "code": "SALREU029",
    "libelleCourt": "Salon Mars III",
    "libelleLong": "Salon Mars III, 101, rue de l'Université"
  },
  "cycleDeVie": {
    "etat": "Confirmé",
    "chrono": {
      "creation": "2019-07-11T16:56:47.000+02:00"
    }
  },
  "demandeurs": {
    "acteurs": [
      {
        "nom": "Mme Laurence VANCEUNEBROCK-MIALON",
        "acteurRef": "PA718728"
      }
    ]
  },
  "typeReunion": "DEP"
}