{
  "xsiType": "reunionInitParlementaire_type",
  "uid": "RUANR5L15S2019IDF0137942",
  "timestampDebut": "2019-09-11T12:30:00.000+02:00",
  "timestampFin": "2019-09-11T14:00:00.000+02:00",
  "lieu": {
    "code": "SALREU016",
    "libelleCourt": "Salon Gabriel",
    "libelleLong": "Salon Gabriel, 101, rue de l'Université"
  },
  "cycleDeVie": {
    "etat": "Confirmé",
    "chrono": {
      "creation": "2019-07-23T14:23:21.000+02:00"
    }
  },
  "demandeurs": {
    "acteurs": [
      {
        "nom": "M. Pierre PERSON",
        "acteurRef": "PA721568"
      }
    ]
  },
  "typeReunion": "DEP"
}