{
  "xsiType": "reunionInitParlementaire_type",
  "uid": "RUANR5L15S2020IDF0142293",
  "timestampDebut": "2019-10-22T10:00:00.000+02:00",
  "timestampFin": "2019-10-22T11:00:00.000+02:00",
  "lieu": {
    "code": "SALREU032",
    "libelleCourt": "Sully 4",
    "libelleLong": "Sully 4, Palais Bourbon"
  },
  "cycleDeVie": {
    "etat": "Confirmé",
    "chrono": {
      "creation": "2019-10-17T14:34:45.000+02:00"
    }
  },
  "demandeurs": {
    "acteurs": [
      {
        "nom": "M. Vincent DESCOEUR",
        "acteurRef": "PA330909"
      }
    ]
  },
  "typeReunion": "DEP"
}