{
  "xsiType": "reunionInitParlementaire_type",
  "uid": "RUANR5L15S2019IDF0131765",
  "timestampDebut": "2019-04-29T11:00:00.000+02:00",
  "timestampFin": "2019-04-29T12:00:00.000+02:00",
  "lieu": {
    "code": "SALREU039",
    "libelleCourt": "Salle 6550",
    "libelleLong": "Salle 6550, Palais Bourbon"
  },
  "cycleDeVie": {
    "etat": "Confirmé",
    "chrono": {
      "creation": "2019-04-05T14:52:06.000+02:00"
    }
  },
  "demandeurs": {
    "acteurs": [
      {
        "nom": "M. Nicolas FORISSIER",
        "acteurRef": "PA1327"
      }
    ]
  },
  "typeReunion": "DEP"
}