{
  "xsiType": "reunionInitParlementaire_type",
  "uid": "RUANR5L15S2018IDF0098005",
  "timestampDebut": "2017-10-10T08:00:00.000+02:00",
  "timestampFin": "2017-10-10T09:30:00.000+02:00",
  "lieu": {
    "code": "SALREU017",
    "libelleCourt": "Salon Visconti",
    "libelleLong": "Salon Visconti, 101, rue de l'Université"
  },
  "cycleDeVie": {
    "etat": "Confirmé",
    "chrono": {
      "creation": "2017-10-05T11:06:32.000+02:00"
    }
  },
  "demandeurs": {
    "acteurs": [
      {
        "nom": "Mme Pascale FONTENEL-PERSONNE",
        "acteurRef": "PA721384"
      }
    ]
  },
  "typeReunion": "DEP"
}