{
  "xsiType": "reunionInitParlementaire_type",
  "uid": "RUANR5L15S2018IDF0096956",
  "timestampDebut": "2017-10-19T08:30:00.000+02:00",
  "timestampFin": "2017-10-19T10:00:00.000+02:00",
  "lieu": {
    "code": "SALREU019",
    "libelleCourt": "Salon Mars I",
    "libelleLong": "Salon Mars I, 101, rue de l'Université"
  },
  "cycleDeVie": {
    "etat": "Confirmé",
    "chrono": {
      "creation": "2017-09-25T14:14:55.000+02:00"
    }
  },
  "demandeurs": {
    "acteurs": [
      {
        "nom": "M. Pierre-Yves BOURNAZEL",
        "acteurRef": "PA722030"
      }
    ]
  },
  "typeReunion": "DEP"
}