{
  "xsiType": "reunionInitParlementaire_type",
  "uid": "RUANR5L15S2019IDF0119869",
  "timestampDebut": "2018-10-23T14:30:00.000+02:00",
  "timestampFin": "2018-10-23T15:00:00.000+02:00",
  "lieu": {
    "code": "SALREU032",
    "libelleCourt": "Sully 4",
    "libelleLong": "Sully 4, Palais Bourbon"
  },
  "cycleDeVie": {
    "etat": "Confirmé",
    "chrono": {
      "creation": "2018-10-02T10:19:56.000+02:00"
    }
  },
  "demandeurs": {
    "organe": {
      "nom": "GROUPE SOCIALISTES ET APPARENTÉS",
      "organeRef": "PO758835"
    }
  },
  "organeReuniRef": "PO758835",
  "typeReunion": "GP"
}