{
  "xsiType": "reunionInitParlementaire_type",
  "uid": "RUANR5L15S2018IDF0100274",
  "timestampDebut": "2017-11-24T12:00:00.000+01:00",
  "timestampFin": "2017-11-24T13:00:00.000+01:00",
  "lieu": {
    "code": "SALREU006",
    "libelleCourt": "3ème Bureau",
    "libelleLong": "3ème Bureau, Palais Bourbon"
  },
  "cycleDeVie": {
    "etat": "Confirmé",
    "chrono": {
      "creation": "2017-11-13T15:50:25.000+01:00"
    }
  },
  "demandeurs": {
    "acteurs": [
      {
        "nom": "M. Grégory BESSON-MOREAU",
        "acteurRef": "PA718876"
      }
    ]
  },
  "typeReunion": "DEP"
}