{
  "xsiType": "reunionInitParlementaire_type",
  "uid": "RUANR5L15S2017IDF0093852",
  "timestampDebut": "2017-07-17T10:00:00.000+02:00",
  "timestampFin": "2017-07-17T11:30:00.000+02:00",
  "lieu": {
    "code": "SALREU005",
    "libelleCourt": "2ème Bureau",
    "libelleLong": "2ème Bureau, Palais Bourbon"
  },
  "cycleDeVie": {
    "etat": "Confirmé",
    "chrono": {
      "creation": "2017-07-11T15:50:53.000+02:00"
    }
  },
  "demandeurs": {
    "acteurs": [
      {
        "nom": "M. Buon TAN",
        "acteurRef": "PA721690"
      }
    ]
  },
  "typeReunion": "DEP"
}