{
  "xsiType": "reunionInitParlementaire_type",
  "uid": "RUANR5L15S2019IDF0122539",
  "timestampDebut": "2018-11-22T11:00:00.000+01:00",
  "timestampFin": "2018-11-22T12:00:00.000+01:00",
  "lieu": {
    "code": "SALREU038",
    "libelleCourt": "Salle 6549",
    "libelleLong": "Salle 6549, Palais Bourbon"
  },
  "cycleDeVie": {
    "etat": "Confirmé",
    "chrono": {
      "creation": "2018-11-16T11:06:21.000+01:00"
    }
  },
  "demandeurs": {
    "acteurs": [
      {
        "nom": "Mme Brigitte BOURGUIGNON",
        "acteurRef": "PA608083"
      }
    ]
  },
  "typeReunion": "DEP"
}