{
  "xsiType": "reunionInitParlementaire_type",
  "uid": "RUANR5L15S2018IDF0109890",
  "timestampDebut": "2018-04-12T18:00:00.000+02:00",
  "timestampFin": "2018-04-12T19:00:00.000+02:00",
  "lieu": {
    "code": "SALREU022",
    "libelleCourt": "Salle 7326",
    "libelleLong": "Salle 7326, 101, rue de l'Université"
  },
  "cycleDeVie": {
    "etat": "Confirmé",
    "chrono": {
      "creation": "2018-04-12T11:54:53.000+02:00"
    }
  },
  "demandeurs": {
    "acteurs": [
      {
        "nom": "Mme Laure DE LA RAUDIÈRE",
        "acteurRef": "PA331567"
      }
    ]
  },
  "typeReunion": "DEP"
}