{
  "xsiType": "reunionInitParlementaire_type",
  "uid": "RUANR5L15S2018IDF0095278",
  "timestampDebut": "2017-10-10T14:15:00.000+02:00",
  "timestampFin": "2017-10-10T15:00:00.000+02:00",
  "lieu": {
    "code": "SALREU013",
    "libelleCourt": "Salle N° 3",
    "libelleLong": "Salle N° 3, 3, rue Aristide Briand"
  },
  "cycleDeVie": {
    "etat": "Annulé",
    "chrono": {
      "creation": "2017-08-09T10:27:46.000+02:00",
      "cloture": "2017-09-20T15:52:34.000+02:00"
    }
  },
  "demandeurs": {
    "acteurs": [
      {
        "nom": "M. Stanislas GUERINI",
        "acteurRef": "PA721498"
      }
    ]
  },
  "typeReunion": "DEP"
}