{
  "xsiType": "reunionInitParlementaire_type",
  "uid": "RUANR5L15S2019IDF0137125",
  "timestampDebut": "2019-07-16T18:30:00.000+02:00",
  "timestampFin": "2019-07-16T20:00:00.000+02:00",
  "lieu": {
    "code": "SALREU012",
    "libelleCourt": "Salle N° 23",
    "libelleLong": "Salle N° 23, 3, rue Aristide Briand"
  },
  "cycleDeVie": {
    "etat": "Annulé",
    "chrono": {
      "creation": "2019-07-09T11:43:40.000+02:00",
      "cloture": "2019-07-12T11:49:27.000+02:00"
    }
  },
  "demandeurs": {
    "acteurs": [
      {
        "nom": "M. Pieyre-Alexandre ANGLADE",
        "acteurRef": "PA721158"
      }
    ]
  },
  "typeReunion": "DEP"
}