{
  "xsiType": "reunionInitParlementaire_type",
  "uid": "RUANR5L15S2019IDF0120139",
  "timestampDebut": "2018-10-15T17:00:00.000+02:00",
  "timestampFin": "2018-10-15T20:00:00.000+02:00",
  "lieu": {
    "code": "SALREU002",
    "libelleCourt": "Salle 7070",
    "libelleLong": "Salle 7070, 103, rue de l'Université"
  },
  "cycleDeVie": {
    "etat": "Annulé",
    "chrono": {
      "creation": "2018-10-04T12:51:30.000+02:00",
      "cloture": "2018-10-04T16:57:24.000+02:00"
    }
  },
  "demandeurs": {
    "acteurs": [
      {
        "nom": "M. Julien AUBERT",
        "acteurRef": "PA609726"
      }
    ]
  },
  "typeReunion": "DEP"
}