{
  "xsiType": "reunionInitParlementaire_type",
  "uid": "RUANR5L15S2018IDF0117076",
  "timestampDebut": "2018-09-27T15:30:00.000+02:00",
  "timestampFin": "2018-09-27T16:30:00.000+02:00",
  "lieu": {
    "code": "SALREU049",
    "libelleCourt": "Salle 6822",
    "libelleLong": "Salle 6822, Palais Bourbon"
  },
  "cycleDeVie": {
    "etat": "Confirmé",
    "chrono": {
      "creation": "2018-09-03T17:31:23.000+02:00"
    }
  },
  "demandeurs": {
    "acteurs": [
      {
        "nom": "M. Thomas MESNIER",
        "acteurRef": "PA719072"
      }
    ]
  },
  "typeReunion": "DEP"
}