{
  "xsiType": "reunionInitParlementaire_type",
  "uid": "RUANR5L15S2020IDF0138182",
  "timestampDebut": "2020-06-04T08:30:00.000+02:00",
  "timestampFin": "2020-06-04T13:00:00.000+02:00",
  "lieu": {
    "code": "SALREU003",
    "libelleCourt": "Salle Victor Hugo",
    "libelleLong": "Salle Victor Hugo, 101, rue de l'Université"
  },
  "cycleDeVie": {
    "etat": "Confirmé",
    "chrono": {
      "creation": "2019-07-29T15:53:55.000+02:00"
    }
  },
  "demandeurs": {
    "acteurs": [
      {
        "nom": "M. Olivier DASSAULT",
        "acteurRef": "PA998"
      }
    ]
  },
  "typeReunion": "DEP"
}