{
  "xsiType": "reunionInitParlementaire_type",
  "uid": "RUANR5L15S2020IDF0143038",
  "timestampDebut": "2019-11-05T17:00:00.000+01:00",
  "timestampFin": "2019-11-05T18:00:00.000+01:00",
  "lieu": {
    "code": "SALREU017",
    "libelleCourt": "Salon Visconti",
    "libelleLong": "Salon Visconti, 101, rue de l'Université"
  },
  "cycleDeVie": {
    "etat": "Confirmé",
    "chrono": {
      "creation": "2019-10-31T15:53:05.000+01:00"
    }
  },
  "demandeurs": {
    "acteurs": [
      {
        "nom": "M. Guillaume LARRIVÉ",
        "acteurRef": "PA267785"
      }
    ]
  },
  "typeReunion": "DEP"
}