{
  "xsiType": "reunionInitParlementaire_type",
  "uid": "RUANR5L15S2018IDF0103421",
  "timestampDebut": "2018-02-07T12:00:00.000+01:00",
  "timestampFin": "2018-02-07T12:30:00.000+01:00",
  "lieu": {
    "code": "SALREU022",
    "libelleCourt": "Salle 7326",
    "libelleLong": "Salle 7326, 101, rue de l'Université"
  },
  "cycleDeVie": {
    "etat": "Confirmé",
    "chrono": {
      "creation": "2018-01-11T15:15:47.000+01:00"
    }
  },
  "demandeurs": {
    "acteurs": [
      {
        "nom": "Mme Véronique LOUWAGIE",
        "acteurRef": "PA608016"
      }
    ]
  },
  "typeReunion": "DEP"
}