{
  "xsiType": "reunionInitParlementaire_type",
  "uid": "RUANR5L15S2019IDF0130290",
  "timestampDebut": "2019-04-03T16:00:00.000+02:00",
  "timestampFin": "2019-04-03T17:00:00.000+02:00",
  "lieu": {
    "code": "SALREU007",
    "libelleCourt": "4ème Bureau",
    "libelleLong": "4ème Bureau, Palais Bourbon"
  },
  "cycleDeVie": {
    "etat": "Confirmé",
    "chrono": {
      "creation": "2019-03-19T14:49:17.000+01:00"
    }
  },
  "demandeurs": {
    "acteurs": [
      {
        "nom": "M. Thomas GASSILLOUD",
        "acteurRef": "PA722358"
      }
    ]
  },
  "typeReunion": "DEP"
}