{
  "xsiType": "reunionInitParlementaire_type",
  "uid": "RUANR5L15S2018IDF0109817",
  "timestampDebut": "2018-06-06T14:00:00.000+02:00",
  "timestampFin": "2018-06-06T15:00:00.000+02:00",
  "lieu": {
    "code": "SALREU038",
    "libelleCourt": "Salle 6549",
    "libelleLong": "Salle 6549, Palais Bourbon"
  },
  "cycleDeVie": {
    "etat": "Confirmé",
    "chrono": {
      "creation": "2018-04-11T19:36:06.000+02:00"
    }
  },
  "demandeurs": {
    "acteurs": [
      {
        "nom": "Mme Émilie BONNIVARD",
        "acteurRef": "PA721410"
      }
    ]
  },
  "typeReunion": "DEP"
}