{
  "xsiType": "reunionCommission_type",
  "uid": "RUANR5L15S2019IDC431679",
  "timestampDebut": "2019-03-05T21:30:00.000+01:00",
  "timestampFin": "2019-03-06T01:00:00.000+01:00",
  "lieu": {
    "libelleLong": "salle 6241 (Affaires économiques)"
  },
  "cycleDeVie": {
    "etat": "Confirmé",
    "chrono": {
      "creation": "2019-02-20T00:00:00.000+01:00"
    }
  },
  "organeReuniRef": "PO757134",
  "participants": {
    "participantsInternes": [
      {
        "acteurRef": "PA605963",
        "presence": "présent"
      },
      {
        "acteurRef": "PA721278",
        "presence": "présent"
      },
      {
        "acteurRef": "PA721776",
        "presence": "absent"
      },
      {
        "acteurRef": "PA721836",
        "presence": "présent"
      },
      {
        "acteurRef": "PA342415",
        "presence": "présent"
      },
      {
        "acteurRef": "PA722170",
        "presence": "présent"
      },
      {
        "acteurRef": "PA332228",
        "presence": "absent"
      },
      {
        "acteurRef": "PA719218",
        "presence": "présent"
      },
      {
        "acteurRef": "PA722312",
        "presence": "présent"
      },
      {
        "acteurRef": "PA720162",
        "presence": "présent"
      },
      {
        "acteurRef": "PA721344",
        "presence": "absent"
      },
      {
        "acteurRef": "PA642695",
        "presence": "présent"
      },
      {
        "acteurRef": "PA721816",
        "presence": "présent"
      },
      {
        "acteurRef": "PA605069",
        "presence": "présent"
      },
      {
        "acteurRef": "PA719890",
        "presence": "présent"
      },
      {
        "acteurRef": "PA720116",
        "presence": "absent"
      },
      {
        "acteurRef": "PA746",
        "presence": "absent"
      },
      {
        "acteurRef": "PA720814",
        "presence": "présent"
      },
      {
        "acteurRef": "PA719440",
        "presence": "présent"
      },
      {
        "acteurRef": "PA719250",
        "presence": "présent"
      },
      {
        "acteurRef": "PA642868",
        "presence": "absent"
      },
      {
        "acteurRef": "PA719740",
        "presence": "présent"
      },
      {
        "acteurRef": "PA942",
        "presence": "présent"
      },
      {
        "acteurRef": "PA721808",
        "presence": "absent"
      },
      {
        "acteurRef": "PA330909",
        "presence": "présent"
      },
      {
        "acteurRef": "PA718926",
        "presence": "présent"
      },
      {
        "acteurRef": "PA719684",
        "presence": "présent"
      },
      {
        "acteurRef": "PA720996",
        "presence": "absent"
      },
      {
        "acteurRef": "PA334149",
        "presence": "présent"
      },
      {
        "acteurRef": "PA719960",
        "presence": "excusé"
      },
      {
        "acteurRef": "PA1327",
        "presence": "absent"
      },
      {
        "acteurRef": "PA720222",
        "presence": "excusé"
      },
      {
        "acteurRef": "PA718674",
        "presence": "présent"
      },
      {
        "acteurRef": "PA721784",
        "presence": "absent"
      },
      {
        "acteurRef": "PA721764",
        "presence": "présent"
      },
      {
        "acteurRef": "PA721498",
        "presence": "absent"
      },
      {
        "acteurRef": "PA721126",
        "presence": "absent"
      },
      {
        "acteurRef": "PA722054",
        "presence": "présent"
      },
      {
        "acteurRef": "PA719874",
        "presence": "absent"
      },
      {
        "acteurRef": "PA719778",
        "presence": "absent"
      },
      {
        "acteurRef": "PA332614",
        "presence": "présent"
      },
      {
        "acteurRef": "PA722202",
        "presence": "absent"
      },
      {
        "acteurRef": "PA719372",
        "presence": "absent"
      },
      {
        "acteurRef": "PA719186",
        "presence": "présent"
      },
      {
        "acteurRef": "PA718978",
        "presence": "présent"
      },
      {
        "acteurRef": "PA331567",
        "presence": "présent"
      },
      {
        "acteurRef": "PA720022",
        "presence": "présent"
      },
      {
        "acteurRef": "PA719310",
        "presence": "présent"
      },
      {
        "acteurRef": "PA721852",
        "presence": "présent"
      },
      {
        "acteurRef": "PA722228",
        "presence": "présent"
      },
      {
        "acteurRef": "PA721134",
        "presence": "présent"
      },
      {
        "acteurRef": "PA608016",
        "presence": "présent"
      },
      {
        "acteurRef": "PA346054",
        "presence": "présent"
      },
      {
        "acteurRef": "PA720146",
        "presence": "présent"
      },
      {
        "acteurRef": "PA346218",
        "presence": "présent"
      },
      {
        "acteurRef": "PA720728",
        "presence": "présent"
      },
      {
        "acteurRef": "PA719338",
        "presence": "présent"
      },
      {
        "acteurRef": "PA719668",
        "presence": "présent"
      },
      {
        "acteurRef": "PA719952",
        "presence": "absent"
      },
      {
        "acteurRef": "PA719850",
        "presence": "présent"
      },
      {
        "acteurRef": "PA720108",
        "presence": "présent"
      },
      {
        "acteurRef": "PA720414",
        "presence": "présent"
      },
      {
        "acteurRef": "PA718930",
        "presence": "présent"
      },
      {
        "acteurRef": "PA720512",
        "presence": "absent"
      },
      {
        "acteurRef": "PA607553",
        "presence": "présent"
      },
      {
        "acteurRef": "PA720590",
        "presence": "présent"
      },
      {
        "acteurRef": "PA720422",
        "presence": "absent"
      },
      {
        "acteurRef": "PA266808",
        "presence": "présent"
      },
      {
        "acteurRef": "PA722142",
        "presence": "absent"
      },
      {
        "acteurRef": "PA267527",
        "presence": "absent"
      },
      {
        "acteurRef": "PA720878",
        "presence": "absent"
      },
      {
        "acteurRef": "PA722078",
        "presence": "présent"
      },
      {
        "acteurRef": "PA719420",
        "presence": "présent"
      },
      {
        "acteurRef": "PA2792",
        "presence": "présent"
      },
      {
        "acteurRef": "PA719930",
        "presence": "présent"
      },
      {
        "acteurRef": "PA721542",
        "presence": "excusé"
      },
      {
        "acteurRef": "PA709315",
        "presence": "présent"
      },
      {
        "acteurRef": "PA721474",
        "presence": "absent"
      },
      {
        "acteurRef": "PA720746",
        "presence": "absent"
      },
      {
        "acteurRef": "PA2960",
        "presence": "absent"
      },
      {
        "acteurRef": "PA718962",
        "presence": "présent"
      }
    ]
  },
  "ouverturePresse": false,
  "odj": {
    "convocationOdj": [
      "• Examen, en nouvelle lecture, du projet de loi relatif à la croissance et la transformation des entreprises (n° 1673) (M. Roland Lescure, rapporteur général, Mmes Coralie Dubost et Marie Lebec, MM. Jean-Noël Barrot et  Denis Sommer, rapporteurs thématiques)"
    ],
    "resumeOdj": [
      "examen, en nouvelle lecture, du projet de loi relatif à la croissance et la transformation des entreprises (n° 1673) (M. Roland Lescure, rapporteur général, Mmes Coralie Dubost et Marie Lebec, MM. Jean-Noël Barrot et  Denis Sommer, rapporteurs thématiques)."
    ],
    "pointsOdj": [
      {
        "xsiType": "podjReunion_type",
        "uid": "RUANR5L15S2019IDC431679PT26418",
        "cycleDeVie": {
          "etat": "Confirmé",
          "chrono": {
            "creation": "2019-02-20T00:00:00.000+01:00"
          }
        },
        "objet": "Examen du texte",
        "dossiersLegislatifsRefs": [
          "DLR5L15N36728"
        ],
        "typePointOdj": "Examen",
        "comiteSecret": false
      }
    ]
  },
  "compteRenduRef": "CRCANR5L15S2019PO757134N027",
  "formatReunion": "Ordinaire",
  "infosReunionsInternationale": {
    "estReunionInternationale": false
  },
  "captationVideo": false
}