{
  "xsiType": "reunionInitParlementaire_type",
  "uid": "RUANR5L15S2018IDF0107352",
  "timestampDebut": "2018-03-26T10:45:00.000+02:00",
  "timestampFin": "2018-03-26T11:30:00.000+02:00",
  "lieu": {
    "code": "SALREU013",
    "libelleCourt": "Salle N° 3",
    "libelleLong": "Salle N° 3, 3, rue Aristide Briand"
  },
  "cycleDeVie": {
    "etat": "Confirmé",
    "chrono": {
      "creation": "2018-03-12T08:04:55.000+01:00"
    }
  },
  "demandeurs": {
    "acteurs": [
      {
        "nom": "Mme Sophie PANONACLE",
        "acteurRef": "PA719632"
      }
    ]
  },
  "typeReunion": "DEP"
}