{
  "xsiType": "reunionInitParlementaire_type",
  "uid": "RUANR5L15S2020IDF0141447",
  "timestampDebut": "2019-10-30T14:30:00.000+01:00",
  "timestampFin": "2019-10-30T16:30:00.000+01:00",
  "lieu": {
    "code": "SALREU023",
    "libelleCourt": "Salle 7426",
    "libelleLong": "Salle 7426, 101, rue de l'Université"
  },
  "cycleDeVie": {
    "etat": "Annulé",
    "chrono": {
      "creation": "2019-10-03T16:45:31.000+02:00",
      "cloture": "2019-10-24T10:14:38.000+02:00"
    }
  },
  "demandeurs": {
    "acteurs": [
      {
        "nom": "M. Yannick HAURY",
        "acteurRef": "PA720054"
      }
    ]
  },
  "typeReunion": "DEP"
}