{
  "xsiType": "reunionCommission_type",
  "uid": "RUANR5L15S2020IDC434091",
  "timestampDebut": "2019-10-31T12:00:00.000+01:00",
  "lieu": {
    "libelleLong": "6e Bureau (Lois)"
  },
  "cycleDeVie": {
    "etat": "Confirmé",
    "chrono": {
      "creation": "2019-10-25T00:00:00.000+02:00"
    }
  },
  "organeReuniRef": "PO764414",
  "participants": {},
  "ouverturePresse": true,
  "odj": {
    "convocationOdj": [
      "Audition de M. François Orlandi, ancien président du conseil départemental de Haute-Corse"
    ],
    "resumeOdj": [
      "audition de M. François Orlandi, ancien président du conseil départemental de Haute-Corse"
    ]
  },
  "formatReunion": "Ordinaire",
  "infosReunionsInternationale": {
    "estReunionInternationale": false
  },
  "captationVideo": true
}