{
  "xsiType": "reunionCommission_type",
  "uid": "RUANR5L15S2019IDC433385",
  "timestampDebut": "2019-09-24T09:30:00.000+02:00",
  "lieu": {
    "libelleLong": "4016"
  },
  "cycleDeVie": {
    "etat": "Confirmé",
    "chrono": {
      "creation": "2019-07-05T00:00:00.000+02:00"
    }
  },
  "organeReuniRef": "PO762504",
  "participants": {},
  "ouverturePresse": false,
  "odj": {
    "convocationOdj": [
      "Audition de M. Jacques Perget, contrôleur général des armées."
    ],
    "resumeOdj": [
      "audition de M. Jacques Perget, contrôleur général des armées."
    ]
  },
  "formatReunion": "Ordinaire",
  "infosReunionsInternationale": {
    "estReunionInternationale": false
  },
  "captationVideo": false
}