{
  "xsiType": "reunionInitParlementaire_type",
  "uid": "RUANR5L15S2019IDF0140501",
  "timestampDebut": "2019-09-24T18:30:00.000+02:00",
  "timestampFin": "2019-09-24T20:00:00.000+02:00",
  "lieu": {
    "code": "SALREU044",
    "libelleCourt": "Sully 2",
    "libelleLong": "Sully 2, Palais Bourbon"
  },
  "cycleDeVie": {
    "etat": "Confirmé",
    "chrono": {
      "creation": "2019-09-19T17:37:17.000+02:00"
    }
  },
  "demandeurs": {
    "acteurs": [
      {
        "nom": "M. Patrice ANATO",
        "acteurRef": "PA721278"
      }
    ]
  },
  "typeReunion": "DEP"
}