{
  "xsiType": "reunionInitParlementaire_type",
  "uid": "RUANR5L15S2019IDF0120032",
  "timestampDebut": "2018-10-10T12:00:00.000+02:00",
  "timestampFin": "2018-10-10T13:00:00.000+02:00",
  "lieu": {
    "code": "SALREU049",
    "libelleCourt": "Salle 6822",
    "libelleLong": "Salle 6822, Palais Bourbon"
  },
  "cycleDeVie": {
    "etat": "Confirmé",
    "chrono": {
      "creation": null
    }
  },
  "demandeurs": {
    "acteurs": [
      {
        "nom": "M. Guillaume GAROT",
        "acteurRef": "PA333285"
      }
    ]
  },
  "typeReunion": "DEP"
}