{
  "xsiType": "reunionInitParlementaire_type",
  "uid": "RUANR5L15S2018IDF0106870",
  "timestampDebut": "2018-03-29T18:30:00.000+02:00",
  "timestampFin": "2018-03-29T20:30:00.000+02:00",
  "lieu": {
    "code": "SALREU006",
    "libelleCourt": "3ème Bureau",
    "libelleLong": "3ème Bureau, Palais Bourbon"
  },
  "cycleDeVie": {
    "etat": "Confirmé",
    "chrono": {
      "creation": "2018-03-05T10:19:15.000+01:00"
    }
  },
  "demandeurs": {
    "acteurs": [
      {
        "nom": "M. Pierre-Yves BOURNAZEL",
        "acteurRef": "PA722030"
      }
    ]
  },
  "typeReunion": "DEP"
}