{
  "xsiType": "reunionInitParlementaire_type",
  "uid": "RUANR5L15S2018IDF0115669",
  "timestampDebut": "2018-07-18T17:00:00.000+02:00",
  "timestampFin": "2018-07-18T19:00:00.000+02:00",
  "lieu": {
    "code": "SALREU023",
    "libelleCourt": "Salle 7426",
    "libelleLong": "Salle 7426, 101, rue de l'Université"
  },
  "cycleDeVie": {
    "etat": "Confirmé",
    "chrono": {
      "creation": "2018-07-13T13:14:36.000+02:00"
    }
  },
  "demandeurs": {
    "acteurs": [
      {
        "nom": "M. Jean-Michel FAUVERGUE",
        "acteurRef": "PA721702"
      }
    ]
  },
  "typeReunion": "DEP"
}