{
  "xsiType": "reunionInitParlementaire_type",
  "uid": "RUANR5L15S2020IDF0142554",
  "timestampDebut": "2019-10-23T14:00:00.000+02:00",
  "timestampFin": "2019-10-23T15:00:00.000+02:00",
  "lieu": {
    "code": "SALREU048",
    "libelleCourt": "Salle 6809",
    "libelleLong": "Salle 6809, Palais Bourbon"
  },
  "cycleDeVie": {
    "etat": "Confirmé",
    "chrono": {
      "creation": "2019-10-22T17:46:14.000+02:00"
    }
  },
  "demandeurs": {
    "acteurs": [
      {
        "nom": "Mme Stella DUPONT",
        "acteurRef": "PA643175"
      }
    ]
  },
  "typeReunion": "DEP"
}