{
  "xsiType": "reunionInitParlementaire_type",
  "uid": "RUANR5L15S2018IDF0112361",
  "timestampDebut": "2018-06-20T11:00:00.000+02:00",
  "timestampFin": "2018-06-20T12:30:00.000+02:00",
  "lieu": {
    "code": "SALREU029",
    "libelleCourt": "Salon Mars III",
    "libelleLong": "Salon Mars III, 101, rue de l'Université"
  },
  "cycleDeVie": {
    "etat": "Confirmé",
    "chrono": {
      "creation": "2018-05-25T14:09:37.000+02:00"
    }
  },
  "demandeurs": {
    "acteurs": [
      {
        "nom": "M. Pierre DHARRÉVILLE",
        "acteurRef": "PA718926"
      }
    ]
  },
  "typeReunion": "DEP"
}