{
  "xsiType": "reunionInitParlementaire_type",
  "uid": "RUANR5L15S2018IDF0103970",
  "timestampDebut": "2018-01-31T12:00:00.000+01:00",
  "timestampFin": "2018-01-31T13:30:00.000+01:00",
  "lieu": {
    "code": "SALREU013",
    "libelleCourt": "Salle N° 3",
    "libelleLong": "Salle N° 3, 3, rue Aristide Briand"
  },
  "cycleDeVie": {
    "etat": "Confirmé",
    "chrono": {
      "creation": "2018-01-18T16:58:28.000+01:00"
    }
  },
  "demandeurs": {
    "acteurs": [
      {
        "nom": "M. Jimmy PAHUN",
        "acteurRef": "PA720334"
      }
    ]
  },
  "typeReunion": "DEP"
}