{
  "xsiType": "reunionInitParlementaire_type",
  "uid": "RUANR5L15S2019IDF0124568",
  "timestampDebut": "2019-01-16T10:00:00.000+01:00",
  "timestampFin": "2019-01-16T11:30:00.000+01:00",
  "lieu": {
    "code": "SALREU049",
    "libelleCourt": "Salle 6822",
    "libelleLong": "Salle 6822, Palais Bourbon"
  },
  "cycleDeVie": {
    "etat": "Confirmé",
    "chrono": {
      "creation": "2019-01-09T09:54:59.000+01:00"
    }
  },
  "demandeurs": {
    "acteurs": [
      {
        "nom": "M. Régis JUANICO",
        "acteurRef": "PA332614"
      }
    ]
  },
  "typeReunion": "DEP"
}