{
  "xsiType": "reunionInitParlementaire_type",
  "uid": "RUANR5L15S2020IDF0143116",
  "timestampDebut": "2019-12-18T13:30:00.000+01:00",
  "timestampFin": "2019-12-18T15:30:00.000+01:00",
  "lieu": {
    "code": "SALREU002",
    "libelleCourt": "Salle 7070",
    "libelleLong": "Salle 7070, 103, rue de l'Université"
  },
  "cycleDeVie": {
    "etat": "Confirmé",
    "chrono": {
      "creation": "2019-11-04T14:34:56.000+01:00"
    }
  },
  "demandeurs": {
    "acteurs": [
      {
        "nom": "Mme Monique IBORRA",
        "acteurRef": "PA331835"
      }
    ]
  },
  "typeReunion": "DEP"
}