{
  "xsiType": "reunionInitParlementaire_type",
  "uid": "RUANR5L15S2019IDF0137791",
  "timestampDebut": "2019-07-24T10:30:00.000+02:00",
  "timestampFin": "2019-07-24T11:30:00.000+02:00",
  "lieu": {
    "code": "SALREU013",
    "libelleCourt": "Salle N° 3",
    "libelleLong": "Salle N° 3, 3, rue Aristide Briand"
  },
  "cycleDeVie": {
    "etat": "Confirmé",
    "chrono": {
      "creation": "2019-07-19T14:11:56.000+02:00"
    }
  },
  "demandeurs": {
    "acteurs": [
      {
        "nom": "M. Michel VIALAY",
        "acteurRef": "PA721968"
      }
    ]
  },
  "typeReunion": "DEP"
}