{
  "xsiType": "reunionInitParlementaire_type",
  "uid": "RUANR5L15S2019IDF0135314",
  "timestampDebut": "2019-06-17T20:00:00.000+02:00",
  "timestampFin": "2019-06-18T00:00:00.000+02:00",
  "lieu": {
    "code": "SALREU042",
    "libelleCourt": "Salle 6566",
    "libelleLong": "Salle 6566, Palais Bourbon"
  },
  "cycleDeVie": {
    "etat": "Confirmé",
    "chrono": {
      "creation": "2019-06-11T10:53:51.000+02:00"
    }
  },
  "demandeurs": {
    "acteurs": [
      {
        "nom": "M. Rémy REBEYROTTE",
        "acteurRef": "PA722398"
      }
    ]
  },
  "typeReunion": "DEP"
}