{
  "xsiType": "reunionCommission_type",
  "uid": "RUANR5L15S2018IDC429303",
  "timestampDebut": "2018-05-30T10:00:00.000+02:00",
  "lieu": {
    "libelleLong": "salle 6241 (Affaires économiques)"
  },
  "cycleDeVie": {
    "etat": "Supprimé",
    "chrono": {
      "creation": "2018-04-25T00:00:00.000+02:00",
      "cloture": "2018-05-23T00:00:00.000+02:00"
    }
  },
  "organeReuniRef": "PO419610",
  "participants": {},
  "ouverturePresse": true,
  "odj": {
    "convocationOdj": [
      "Communication de Mme Marie-Noëlle Battistel sur les concessions hydro-électriques."
    ],
    "resumeOdj": [
      "communication de Mme Marie-Noëlle Battistel sur les concessions hydro-électriques."
    ]
  },
  "formatReunion": "Ordinaire",
  "infosReunionsInternationale": {
    "estReunionInternationale": false
  },
  "captationVideo": false
}