{
  "xsiType": "reunionInitParlementaire_type",
  "uid": "RUANR5L15S2019IDF0121346",
  "timestampDebut": "2019-03-05T12:30:00.000+01:00",
  "timestampFin": "2019-03-05T14:00:00.000+01:00",
  "lieu": {
    "code": "SALREU017",
    "libelleCourt": "Salon Visconti",
    "libelleLong": "Salon Visconti, 101, rue de l'Université"
  },
  "cycleDeVie": {
    "etat": "Confirmé",
    "chrono": {
      "creation": "2018-10-25T10:52:50.000+02:00"
    }
  },
  "demandeurs": {
    "acteurs": [
      {
        "nom": "M. Charles DE COURSON",
        "acteurRef": "PA942"
      }
    ]
  },
  "typeReunion": "DEP"
}