{
  "xsiType": "reunionCommission_type",
  "uid": "RUANR5L15S2019IDC432180",
  "timestampDebut": "2019-04-11T13:00:00.000+02:00",
  "lieu": {
    "libelleLong": "Petit Hôtel"
  },
  "cycleDeVie": {
    "etat": "Confirmé",
    "chrono": {
      "creation": "2019-04-02T00:00:00.000+02:00"
    }
  },
  "organeReuniRef": "PO733112",
  "participants": {},
  "ouverturePresse": false,
  "odj": {
    "convocationOdj": [
      "Déjeuner d’échanges autour des questions de coopération régionale offert par le groupe d'amitié France-Seychelles, présidé par Mme Monica Michel, en l’honneur de Son Exc. M. Louis-Sylvestre Radegonde, ambassadeur des Seychelles"
    ],
    "resumeOdj": [
      "Déjeuner d’échanges autour des questions de coopération régionale offert par le groupe d'amitié France-Seychelles, présidé par Mme Monica Michel, en l’honneur de Son Exc. M. Louis-Sylvestre Radegonde, ambassadeur des Seychelles"
    ]
  },
  "formatReunion": "Ordinaire",
  "infosReunionsInternationale": {
    "estReunionInternationale": true,
    "listePays": [
      "GOP756551"
    ],
    "informationsComplementaires": "Karine Depincé - 38308"
  },
  "captationVideo": false
}