{
  "xsiType": "reunionInitParlementaire_type",
  "uid": "RUANR5L15S2017IDF0093329",
  "timestampDebut": "2017-07-19T08:30:00.000+02:00",
  "timestampFin": "2017-07-19T09:30:00.000+02:00",
  "lieu": {
    "code": "SALREU029",
    "libelleCourt": "Salon Mars III",
    "libelleLong": "Salon Mars III, 101, rue de l'Université"
  },
  "cycleDeVie": {
    "etat": "Confirmé",
    "chrono": {
      "creation": "2017-06-29T10:53:43.000+02:00"
    }
  },
  "demandeurs": {
    "acteurs": [
      {
        "nom": "M. Richard FERRAND",
        "acteurRef": "PA606171"
      }
    ]
  },
  "typeReunion": "DEP"
}