{
  "xsiType": "reunionInitParlementaire_type",
  "uid": "RUANR5L15S2019IDF0132859",
  "timestampDebut": "2019-05-09T09:00:00.000+02:00",
  "timestampFin": "2019-05-09T10:00:00.000+02:00",
  "lieu": {
    "code": "SALREU010",
    "libelleCourt": "Salle N° 1",
    "libelleLong": "Salle N° 1, 3, rue Aristide Briand"
  },
  "cycleDeVie": {
    "etat": "Annulé",
    "chrono": {
      "creation": "2019-04-29T16:17:27.000+02:00",
      "cloture": "2019-05-03T09:30:49.000+02:00"
    }
  },
  "demandeurs": {
    "acteurs": [
      {
        "nom": "M. François-Michel LAMBERT",
        "acteurRef": "PA605518"
      }
    ]
  },
  "typeReunion": "DEP"
}