{
  "xsiType": "reunionInitParlementaire_type",
  "uid": "RUANR5L15S2019IDF0128923",
  "timestampDebut": "2019-04-02T10:00:00.000+02:00",
  "timestampFin": "2019-04-02T11:15:00.000+02:00",
  "lieu": {
    "code": "SALREU029",
    "libelleCourt": "Salon Mars III",
    "libelleLong": "Salon Mars III, 101, rue de l'Université"
  },
  "cycleDeVie": {
    "etat": "Confirmé",
    "chrono": {
      "creation": "2019-03-04T12:44:33.000+01:00"
    }
  },
  "demandeurs": {
    "acteurs": [
      {
        "nom": "M. Stéphane VIRY",
        "acteurRef": "PA721474"
      }
    ]
  },
  "typeReunion": "DEP"
}