{
  "xsiType": "reunionInitParlementaire_type",
  "uid": "RUANR5L15S2018IDF0102586",
  "timestampDebut": "2017-12-21T14:00:00.000+01:00",
  "timestampFin": "2017-12-21T15:00:00.000+01:00",
  "lieu": {
    "code": "SALREU025",
    "libelleCourt": "7ème Bureau",
    "libelleLong": "7ème Bureau, Palais Bourbon"
  },
  "cycleDeVie": {
    "etat": "Confirmé",
    "chrono": {
      "creation": "2017-12-18T14:43:01.000+01:00"
    }
  },
  "demandeurs": {
    "acteurs": [
      {
        "nom": "Mme Josy POUEYTO",
        "acteurRef": "PA720720"
      }
    ]
  },
  "typeReunion": "DEP"
}