{
  "xsiType": "reunionInitParlementaire_type",
  "uid": "RUANR5L15S2019IDF0133626",
  "timestampDebut": "2019-07-12T09:30:00.000+02:00",
  "timestampFin": "2019-07-12T17:00:00.000+02:00",
  "lieu": {
    "code": "SALREU006",
    "libelleCourt": "3ème Bureau",
    "libelleLong": "3ème Bureau, Palais Bourbon"
  },
  "cycleDeVie": {
    "etat": "Confirmé",
    "chrono": {
      "creation": "2019-05-13T11:21:11.000+02:00"
    }
  },
  "demandeurs": {
    "acteurs": [
      {
        "nom": "Mme Paula FORTEZA",
        "acteurRef": "PA721142"
      }
    ]
  },
  "typeReunion": "DEP"
}