{
  "xsiType": "reunionInitParlementaire_type",
  "uid": "RUANR5L15S2019IDF0120330",
  "timestampDebut": "2018-10-24T18:30:00.000+02:00",
  "timestampFin": "2018-10-24T20:00:00.000+02:00",
  "lieu": {
    "code": "SALREU006",
    "libelleCourt": "3ème Bureau",
    "libelleLong": "3ème Bureau, Palais Bourbon"
  },
  "cycleDeVie": {
    "etat": "Confirmé",
    "chrono": {
      "creation": "2018-10-09T14:13:19.000+02:00"
    }
  },
  "demandeurs": {
    "acteurs": [
      {
        "nom": "M. Guillaume GAROT",
        "acteurRef": "PA333285"
      }
    ]
  },
  "typeReunion": "DEP"
}