{
  "xsiType": "reunionCommission_type",
  "uid": "RUANR5L15S2018IDC428293",
  "timestampDebut": "2018-02-01T09:00:00.000+01:00",
  "timestampFin": "2018-02-01T10:30:00.000+01:00",
  "lieu": {
    "libelleLong": "6e Bureau"
  },
  "cycleDeVie": {
    "etat": "Confirmé",
    "chrono": {
      "creation": "2018-01-18T00:00:00.000+01:00"
    }
  },
  "organeReuniRef": "PO740454",
  "participants": {
    "participantsInternes": [
      {
        "acteurRef": "PA719318",
        "presence": "absent"
      },
      {
        "acteurRef": "PA335999",
        "presence": "présent"
      },
      {
        "acteurRef": "PA719488",
        "presence": "présent"
      },
      {
        "acteurRef": "PA720162",
        "presence": "absent"
      },
      {
        "acteurRef": "PA719740",
        "presence": "absent"
      },
      {
        "acteurRef": "PA719258",
        "presence": "absent"
      },
      {
        "acteurRef": "PA267355",
        "presence": "présent"
      },
      {
        "acteurRef": "PA719230",
        "presence": "présent"
      },
      {
        "acteurRef": "PA340853",
        "presence": "absent"
      },
      {
        "acteurRef": "PA719412",
        "presence": "présent"
      },
      {
        "acteurRef": "PA719154",
        "presence": "présent"
      },
      {
        "acteurRef": "PA2155",
        "presence": "présent"
      },
      {
        "acteurRef": "PA719456",
        "presence": "absent"
      },
      {
        "acteurRef": "PA719242",
        "presence": "absent"
      },
      {
        "acteurRef": "PA720278",
        "presence": "absent"
      },
      {
        "acteurRef": "PA720892",
        "presence": "absent"
      },
      {
        "acteurRef": "PA2377",
        "presence": "absent"
      },
      {
        "acteurRef": "PA718930",
        "presence": "absent"
      },
      {
        "acteurRef": "PA719350",
        "presence": "absent"
      },
      {
        "acteurRef": "PA719540",
        "presence": "présent"
      },
      {
        "acteurRef": "PA722268",
        "presence": "absent"
      },
      {
        "acteurRef": "PA722110",
        "presence": "absent"
      }
    ]
  },
  "ouverturePresse": true,
  "odj": {
    "convocationOdj": [
      "Audition, en table ronde, de Mme Carmen Etcheverry, chargée de mission du réseau agriculture, de Mme Claudine Joly, référente pesticides, et de Mme Charlotte Lepitre, coordinatrice du réseau santé-environnement de France nature environnement ; de M. François Veillerette, directeur, et de Mme Nadine Lauverjat, coordinatrice de l’association Générations futures ; de Mme Marie-Monique Robin, journaliste, auteure du livre « Le Roundup face à ses juges »."
    ],
    "resumeOdj": [
      "audition, en table ronde, de Mme Carmen Etcheverry, chargée de mission du réseau agriculture, de Mme Claudine Joly, référente pesticides, et de Mme Charlotte Lepitre, coordinatrice du réseau santé-environnement de France nature environnement ; de M. François Veillerette, directeur, et de Mme Nadine Lauverjat, coordinatrice de l’association Générations futures ; de Mme Marie-Monique Robin, journaliste, auteure du livre « Le Roundup face à ses juges »."
    ]
  },
  "formatReunion": "Ordinaire",
  "infosReunionsInternationale": {
    "estReunionInternationale": false
  },
  "captationVideo": false
}