{
  "xsiType": "reunionInitParlementaire_type",
  "uid": "RUANR5L15S2019IDF0131898",
  "timestampDebut": "2019-05-07T14:00:00.000+02:00",
  "timestampFin": "2019-05-07T16:00:00.000+02:00",
  "lieu": {
    "code": "SALREU021",
    "libelleCourt": "Salle 7207",
    "libelleLong": "Salle 7207, 101, rue de l'Université"
  },
  "cycleDeVie": {
    "etat": "Confirmé",
    "chrono": {
      "creation": "2019-04-08T15:15:05.000+02:00"
    }
  },
  "demandeurs": {
    "acteurs": [
      {
        "nom": "Mme Émilie BONNIVARD",
        "acteurRef": "PA721410"
      }
    ]
  },
  "typeReunion": "DEP"
}