{
  "xsiType": "reunionInitParlementaire_type",
  "uid": "RUANR5L15S2018IDF0098199",
  "timestampDebut": "2017-12-06T14:00:00.000+01:00",
  "timestampFin": "2017-12-06T15:30:00.000+01:00",
  "lieu": {
    "code": "SALREU023",
    "libelleCourt": "Salle 7426",
    "libelleLong": "Salle 7426, 101, rue de l'Université"
  },
  "cycleDeVie": {
    "etat": "Confirmé",
    "chrono": {
      "creation": "2017-10-09T12:18:11.000+02:00"
    }
  },
  "demandeurs": {
    "acteurs": [
      {
        "nom": "M. Anthony CELLIER",
        "acteurRef": "PA719440"
      }
    ]
  },
  "typeReunion": "DEP"
}