{
  "xsiType": "reunionInitParlementaire_type",
  "uid": "RUANR5L15S2019IDF0131132",
  "timestampDebut": "2019-04-23T17:00:00.000+02:00",
  "timestampFin": "2019-04-23T18:30:00.000+02:00",
  "lieu": {
    "code": "SALREU042",
    "libelleCourt": "Salle 6566",
    "libelleLong": "Salle 6566, Palais Bourbon"
  },
  "cycleDeVie": {
    "etat": "Confirmé",
    "chrono": {
      "creation": "2019-03-28T15:23:19.000+01:00"
    }
  },
  "demandeurs": {
    "acteurs": [
      {
        "nom": "Mme Dominique DAVID",
        "acteurRef": "PA719710"
      }
    ]
  },
  "typeReunion": "DEP"
}