{
  "xsiType": "reunionInitParlementaire_type",
  "uid": "RUANR5L15S2020IDF0141426",
  "timestampDebut": "2019-10-03T17:30:00.000+02:00",
  "timestampFin": "2019-10-03T18:00:00.000+02:00",
  "lieu": {
    "code": "SALREU023",
    "libelleCourt": "Salle 7426",
    "libelleLong": "Salle 7426, 101, rue de l'Université"
  },
  "cycleDeVie": {
    "etat": "Confirmé",
    "chrono": {
      "creation": "2019-10-03T14:55:19.000+02:00"
    }
  },
  "demandeurs": {
    "acteurs": [
      {
        "nom": "Mme Bérangère ABBA",
        "acteurRef": "PA720242"
      }
    ]
  },
  "typeReunion": "DEP"
}