{
  "xsiType": "reunionInitParlementaire_type",
  "uid": "RUANR5L15S2018IDF0095128",
  "timestampDebut": "2017-10-02T11:00:00.000+02:00",
  "timestampFin": "2017-10-02T12:00:00.000+02:00",
  "lieu": {
    "code": "SALREU006",
    "libelleCourt": "3ème Bureau",
    "libelleLong": "3ème Bureau, Palais Bourbon"
  },
  "cycleDeVie": {
    "etat": "Annulé",
    "chrono": {
      "creation": "2017-08-03T11:52:14.000+02:00",
      "cloture": "2017-09-26T16:26:12.000+02:00"
    }
  },
  "demandeurs": {
    "acteurs": [
      {
        "nom": "M. Laurent SAINT-MARTIN",
        "acteurRef": "PA720878"
      }
    ]
  },
  "typeReunion": "DEP"
}