{
  "xsiType": "reunionCommission_type",
  "uid": "RUANR5L15S2018IDC427760",
  "timestampDebut": "2017-11-22T16:30:00.000+01:00",
  "timestampFin": "2017-11-22T18:45:00.000+01:00",
  "lieu": {
    "libelleLong": "salle 6237 (Développement durable)"
  },
  "cycleDeVie": {
    "etat": "Confirmé",
    "chrono": {
      "creation": "2017-11-09T00:00:00.000+01:00"
    }
  },
  "organeReuniRef": "PO419865",
  "participants": {
    "participantsInternes": [
      {
        "acteurRef": "PA720242",
        "presence": "excusé"
      },
      {
        "acteurRef": "PA720310",
        "presence": "présent"
      },
      {
        "acteurRef": "PA609726",
        "presence": "présent"
      },
      {
        "acteurRef": "PA719806",
        "presence": "absent"
      },
      {
        "acteurRef": "PA721046",
        "presence": "présent"
      },
      {
        "acteurRef": "PA335999",
        "presence": "présent"
      },
      {
        "acteurRef": "PA720210",
        "presence": "présent"
      },
      {
        "acteurRef": "PA266793",
        "presence": "présent"
      },
      {
        "acteurRef": "PA267233",
        "presence": "présent"
      },
      {
        "acteurRef": "PA718710",
        "presence": "absent"
      },
      {
        "acteurRef": "PA267766",
        "presence": "présent"
      },
      {
        "acteurRef": "PA719890",
        "presence": "présent"
      },
      {
        "acteurRef": "PA718838",
        "presence": "présent"
      },
      {
        "acteurRef": "PA722000",
        "presence": "absent"
      },
      {
        "acteurRef": "PA719922",
        "presence": "présent"
      },
      {
        "acteurRef": "PA721860",
        "presence": "absent"
      },
      {
        "acteurRef": "PA719740",
        "presence": "présent"
      },
      {
        "acteurRef": "PA719286",
        "presence": "absent"
      },
      {
        "acteurRef": "PA719624",
        "presence": "absent"
      },
      {
        "acteurRef": "PA719194",
        "presence": "présent"
      },
      {
        "acteurRef": "PA330909",
        "presence": "présent"
      },
      {
        "acteurRef": "PA720538",
        "presence": "présent"
      },
      {
        "acteurRef": "PA722236",
        "presence": "présent"
      },
      {
        "acteurRef": "PA718894",
        "presence": "absent"
      },
      {
        "acteurRef": "PA720652",
        "presence": "présent"
      },
      {
        "acteurRef": "PA605694",
        "presence": "absent"
      },
      {
        "acteurRef": "PA722366",
        "presence": "absent"
      },
      {
        "acteurRef": "PA720054",
        "presence": "absent"
      },
      {
        "acteurRef": "PA720038",
        "presence": "absent"
      },
      {
        "acteurRef": "PA721514",
        "presence": "présent"
      },
      {
        "acteurRef": "PA605084",
        "presence": "excusé"
      },
      {
        "acteurRef": "PA605518",
        "presence": "excusé"
      },
      {
        "acteurRef": "PA720764",
        "presence": "présent"
      },
      {
        "acteurRef": "PA719310",
        "presence": "présent"
      },
      {
        "acteurRef": "PA722228",
        "presence": "présent"
      },
      {
        "acteurRef": "PA719412",
        "presence": "présent"
      },
      {
        "acteurRef": "PA588886",
        "presence": "absent"
      },
      {
        "acteurRef": "PA721054",
        "presence": "présent"
      },
      {
        "acteurRef": "PA721530",
        "presence": "présent"
      },
      {
        "acteurRef": "PA719718",
        "presence": "présent"
      },
      {
        "acteurRef": "PA346054",
        "presence": "absent"
      },
      {
        "acteurRef": "PA719080",
        "presence": "présent"
      },
      {
        "acteurRef": "PA2155",
        "presence": "présent"
      },
      {
        "acteurRef": "PA719882",
        "presence": "absent"
      },
      {
        "acteurRef": "PA721976",
        "presence": "présent"
      },
      {
        "acteurRef": "PA721876",
        "presence": "présent"
      },
      {
        "acteurRef": "PA720278",
        "presence": "présent"
      },
      {
        "acteurRef": "PA720334",
        "presence": "présent"
      },
      {
        "acteurRef": "PA720606",
        "presence": "présent"
      },
      {
        "acteurRef": "PA333421",
        "presence": "absent"
      },
      {
        "acteurRef": "PA719632",
        "presence": "absent"
      },
      {
        "acteurRef": "PA720892",
        "presence": "présent"
      },
      {
        "acteurRef": "PA720944",
        "presence": "présent"
      },
      {
        "acteurRef": "PA718802",
        "presence": "présent"
      },
      {
        "acteurRef": "PA720414",
        "presence": "présent"
      },
      {
        "acteurRef": "PA721372",
        "presence": "présent"
      },
      {
        "acteurRef": "PA609520",
        "presence": "présent"
      },
      {
        "acteurRef": "PA719578",
        "presence": "présent"
      },
      {
        "acteurRef": "PA721426",
        "presence": "présent"
      },
      {
        "acteurRef": "PA610733",
        "presence": "excusé"
      },
      {
        "acteurRef": "PA721600",
        "presence": "excusé"
      },
      {
        "acteurRef": "PA267527",
        "presence": "présent"
      },
      {
        "acteurRef": "PA719972",
        "presence": "présent"
      },
      {
        "acteurRef": "PA340343",
        "presence": "présent"
      },
      {
        "acteurRef": "PA267204",
        "presence": "présent"
      },
      {
        "acteurRef": "PA610667",
        "presence": "excusé"
      },
      {
        "acteurRef": "PA722336",
        "presence": "présent"
      },
      {
        "acteurRef": "PA719092",
        "presence": "présent"
      },
      {
        "acteurRef": "PA718728",
        "presence": "présent"
      },
      {
        "acteurRef": "PA720586",
        "presence": "présent"
      },
      {
        "acteurRef": "PA721968",
        "presence": "absent"
      },
      {
        "acteurRef": "PA331582",
        "presence": "absent"
      },
      {
        "acteurRef": "PA722110",
        "presence": "absent"
      },
      {
        "acteurRef": "PA718962",
        "presence": "présent"
      }
    ]
  },
  "ouverturePresse": true,
  "odj": {
    "convocationOdj": [
      "Examen, en nouvelle lecture du projet de loi mettant fin à la recherche ainsi qu'à l'exploitation des hydrocarbures conventionnels et non conventionnels et portant diverses dispositions relatives à l'énergie et à l'environnement (n° 370) (M. Jean-Charles Colas-Roy, rapporteur)"
    ],
    "resumeOdj": [
      "examen, en nouvelle lecture du projet de loi mettant fin à la recherche ainsi qu'à l'exploitation des hydrocarbures conventionnels et non conventionnels et portant diverses dispositions relatives à l'énergie et à l'environnement (n° 370)."
    ],
    "pointsOdj": [
      {
        "xsiType": "podjReunion_type",
        "uid": "RUANR5L15S2018IDC427760PT25245",
        "cycleDeVie": {
          "etat": "Annulé",
          "chrono": {
            "creation": "2017-11-17T00:00:00.000+01:00",
            "cloture": "2017-11-17T00:00:00.000+01:00"
          }
        },
        "objet": "Examen du texte (éventuellement) (nouvelle lecture)",
        "typePointOdj": "Examen",
        "comiteSecret": false
      },
      {
        "xsiType": "podjReunion_type",
        "uid": "RUANR5L15S2018IDC427760PT25253",
        "cycleDeVie": {
          "etat": "Confirmé",
          "chrono": {
            "creation": "2017-11-21T00:00:00.000+01:00"
          }
        },
        "objet": "Examen du texte",
        "dossiersLegislatifsRefs": [
          "DLR5L15N35929"
        ],
        "typePointOdj": "Rapport",
        "comiteSecret": false
      }
    ]
  },
  "compteRenduRef": "CRCANR5L15S2018PO419865N014",
  "formatReunion": "Ordinaire",
  "infosReunionsInternationale": {
    "estReunionInternationale": false
  },
  "captationVideo": false
}