{
  "xsiType": "reunionInitParlementaire_type",
  "uid": "RUANR5L15S2019IDF0121714",
  "timestampDebut": "2018-11-12T14:30:00.000+01:00",
  "timestampFin": "2018-11-12T15:30:00.000+01:00",
  "lieu": {
    "code": "SALREU048",
    "libelleCourt": "Salle 6809",
    "libelleLong": "Salle 6809, Palais Bourbon"
  },
  "cycleDeVie": {
    "etat": "Confirmé",
    "chrono": {
      "creation": "2018-10-31T15:06:10.000+01:00"
    }
  },
  "demandeurs": {
    "acteurs": [
      {
        "nom": "Mme Olivia GREGOIRE",
        "acteurRef": "PA721764"
      }
    ]
  },
  "typeReunion": "DEP"
}