{
  "xsiType": "seance_type",
  "uid": "RUANR5L15S2019IDS21566",
  "timestampDebut": "2019-03-22T15:00:00.000+01:00",
  "timestampFin": "2019-03-22T20:05:00.000+01:00",
  "lieu": {
    "code": "AN",
    "libelleLong": "Assemblée nationale"
  },
  "cycleDeVie": {
    "etat": "Confirmé",
    "chrono": {
      "creation": "2019-02-18T00:00:00.000+01:00"
    }
  },
  "organeReuniRef": "PO717460",
  "sessionRef": "SCR5A2019O1",
  "ouverturePresse": true,
  "odj": {
    "pointsOdj": [
      {
        "xsiType": "podjSeanceConfPres_type",
        "uid": "RUANR5L15S2019IDS21566PT37050",
        "cycleDeVie": {
          "etat": "Confirmé",
          "chrono": {
            "creation": "2019-02-18T00:00:00.000+01:00"
          }
        },
        "objet": "Suite de la discussion du projet de loi relatif à l'organisation et à la transformation du système de santé",
        "dossiersLegislatifsRefs": [
          "DLR5L15N37234"
        ],
        "typePointOdj": "Suite de la discussion",
        "comiteSecret": false,
        "natureTravauxOdj": "ODJPR"
      }
    ]
  },
  "compteRenduRef": "CRSANR5L15S2019O1N193",
  "identifiants": {
    "numSeanceJo": "193",
    "idJo": "20190193",
    "quantieme": "Deuxième",
    "dateSeance": "2019-03-22T01:00:00.000+01:00"
  },
  "captationVideo": true
}