{
  "xsiType": "seance_type",
  "uid": "RUANR5L15S2019IDS21800",
  "timestampDebut": "2019-07-18T21:30:00.000+02:00",
  "lieu": {
    "code": "AN",
    "libelleLong": "Assemblée nationale"
  },
  "cycleDeVie": {
    "etat": "Supprimé",
    "chrono": {
      "creation": "2019-07-08T00:00:00.000+02:00",
      "cloture": "2019-07-18T00:00:00.000+02:00"
    }
  },
  "organeReuniRef": "PO717460",
  "sessionRef": "SCR5A2019E1",
  "ouverturePresse": true,
  "odj": {
    "pointsOdj": [
      {
        "xsiType": "podjSeanceConfPres_type",
        "uid": "RUANR5L15S2019IDS21800PT37589",
        "cycleDeVie": {
          "etat": "Supprimé",
          "chrono": {
            "creation": "2019-07-08T00:00:00.000+02:00",
            "cloture": "2019-07-18T00:00:00.000+02:00"
          }
        },
        "objet": "Suite de la discussion de la proposition de loi, adoptée par le Sénat, visant à permettre aux conseillers de la métropole de Lyon de participer aux prochaines élections sénatoriales",
        "procedure": "procédure d'examen simplifiée-Article 103",
        "typePointOdj": "Suite de la discussion",
        "comiteSecret": false,
        "natureTravauxOdj": "ODJPR"
      },
      {
        "xsiType": "podjSeanceConfPres_type",
        "uid": "RUANR5L15S2019IDS21800PT37590",
        "cycleDeVie": {
          "etat": "Supprimé",
          "chrono": {
            "creation": "2019-07-08T00:00:00.000+02:00",
            "cloture": "2019-07-18T00:00:00.000+02:00"
          }
        },
        "objet": "Suite de la discussion, sur le rapport de la commission mixte paritaire, du projet de loi de transformation de la fonction publique",
        "typePointOdj": "Suite de la discussion",
        "comiteSecret": false,
        "natureTravauxOdj": "ODJPR"
      },
      {
        "xsiType": "podjSeanceConfPres_type",
        "uid": "RUANR5L15S2019IDS21800PT37591",
        "cycleDeVie": {
          "etat": "Supprimé",
          "chrono": {
            "creation": "2019-07-08T00:00:00.000+02:00",
            "cloture": "2019-07-18T00:00:00.000+02:00"
          }
        },
        "objet": "Suite de la discussion sur le rapport de la commission mixte paritaire de la proposition de loi visant à préserver les intérêts de la défense et de la sécurité nationale de la France dans le cadre de l'exploitation des réseaux radioélectriques mobiles",
        "typePointOdj": "Suite de la discussion",
        "comiteSecret": false,
        "natureTravauxOdj": "ODJPR"
      },
      {
        "xsiType": "podjSeanceConfPres_type",
        "uid": "RUANR5L15S2019IDS21800PT37592",
        "cycleDeVie": {
          "etat": "Supprimé",
          "chrono": {
            "creation": "2019-07-08T00:00:00.000+02:00",
            "cloture": "2019-07-18T00:00:00.000+02:00"
          }
        },
        "objet": "Suite de la discussion, en nouvelle lecture, du projet de loi de règlement du budget et d'approbation des comptes de l'année 2018",
        "typePointOdj": "Suite de la discussion",
        "comiteSecret": false,
        "natureTravauxOdj": "ODJPR"
      }
    ]
  },
  "identifiants": {
    "quantieme": "Troisième",
    "dateSeance": "2019-07-18T02:00:00.000+02:00"
  },
  "captationVideo": true
}