{
  "xsiType": "reunionCommission_type",
  "uid": "RUANR5L15S2018IDC427595",
  "timestampDebut": "2017-10-19T11:15:00.000+02:00",
  "lieu": {
    "libelleLong": "(salle du CEC, Petit Hôtel, escalier M, 2ème étage) :"
  },
  "cycleDeVie": {
    "etat": "Confirmé",
    "chrono": {
      "creation": "2017-10-17T00:00:00.000+02:00"
    }
  },
  "organeReuniRef": "PO738797",
  "participants": {},
  "ouverturePresse": false,
  "odj": {
    "convocationOdj": [
      "Échange de vues sur l'organisation des travaux."
    ],
    "resumeOdj": [
      "échange de vues sur l'organisation des travaux."
    ]
  },
  "formatReunion": "Ordinaire",
  "infosReunionsInternationale": {
    "estReunionInternationale": false
  },
  "captationVideo": false
}