{
  "xsiType": "reunionInitParlementaire_type",
  "uid": "RUANR5L15S2019IDF0133396",
  "timestampDebut": "2019-05-21T17:00:00.000+02:00",
  "timestampFin": "2019-05-21T19:30:00.000+02:00",
  "lieu": {
    "code": "SALREU020",
    "libelleCourt": "Salon Mars II",
    "libelleLong": "Salon Mars II, 101, rue de l'Université"
  },
  "cycleDeVie": {
    "etat": "Confirmé",
    "chrono": {
      "creation": "2019-05-09T10:06:09.000+02:00"
    }
  },
  "demandeurs": {
    "acteurs": [
      {
        "nom": "M. Brahim HAMMOUCHE",
        "acteurRef": "PA720326"
      }
    ]
  },
  "typeReunion": "DEP"
}