{
  "xsiType": "reunionInitParlementaire_type",
  "uid": "RUANR5L15S2018IDF0116135",
  "timestampDebut": "2018-07-24T18:00:00.000+02:00",
  "timestampFin": "2018-07-24T19:30:00.000+02:00",
  "lieu": {
    "code": "SALREU048",
    "libelleCourt": "Salle 6809",
    "libelleLong": "Salle 6809, Palais Bourbon"
  },
  "cycleDeVie": {
    "etat": "Confirmé",
    "chrono": {
      "creation": "2018-07-24T11:27:17.000+02:00"
    }
  },
  "demandeurs": {
    "acteurs": [
      {
        "nom": "M. Benoit SIMIAN",
        "acteurRef": "PA719592"
      }
    ]
  },
  "typeReunion": "DEP"
}