{
  "xsiType": "reunionCommission_type",
  "uid": "RUANR5L15S2020IDC434235",
  "timestampDebut": "2019-11-14T09:00:00.000+01:00",
  "lieu": {
    "libelleLong": "6e Bureau (Lois)"
  },
  "cycleDeVie": {
    "etat": "Confirmé",
    "chrono": {
      "creation": "2019-11-08T00:00:00.000+01:00"
    }
  },
  "organeReuniRef": "PO764414",
  "participants": {},
  "ouverturePresse": true,
  "odj": {
    "convocationOdj": [
      "Audition de M. Jean-Guy Talamoni, président de l’Assemblée de Corse, accompagné de M. Sébastien Quenot, directeur de cabinet."
    ],
    "resumeOdj": [
      "audition de M. Jean-Guy Talamoni, président de l’Assemblée de Corse, accompagné de M. Sébastien Quenot, directeur de cabinet."
    ]
  },
  "formatReunion": "Ordinaire",
  "infosReunionsInternationale": {
    "estReunionInternationale": false
  },
  "captationVideo": true
}