{
  "xsiType": "reunionInitParlementaire_type",
  "uid": "RUANR5L15S2018IDF0116072",
  "timestampDebut": "2018-07-24T15:30:00.000+02:00",
  "timestampFin": "2018-07-24T16:30:00.000+02:00",
  "lieu": {
    "code": "SALREU048",
    "libelleCourt": "Salle 6809",
    "libelleLong": "Salle 6809, Palais Bourbon"
  },
  "cycleDeVie": {
    "etat": "Confirmé",
    "chrono": {
      "creation": "2018-07-23T11:52:39.000+02:00"
    }
  },
  "demandeurs": {
    "acteurs": [
      {
        "nom": "M. Denis SOMMER",
        "acteurRef": "PA719420"
      }
    ]
  },
  "typeReunion": "DEP"
}