{
  "xsiType": "reunionInitParlementaire_type",
  "uid": "RUANR5L15S2019IDF0122982",
  "timestampDebut": "2019-02-12T10:30:00.000+01:00",
  "timestampFin": "2019-02-12T12:30:00.000+01:00",
  "lieu": {
    "code": "SALREU008",
    "libelleCourt": "5ème Bureau",
    "libelleLong": "5ème Bureau, Palais Bourbon"
  },
  "cycleDeVie": {
    "etat": "Confirmé",
    "chrono": {
      "creation": "2018-11-26T11:26:46.000+01:00"
    }
  },
  "demandeurs": {
    "organe": {
      "nom": "GROUPE LIBERTÉS ET TERRITOIRES",
      "organeRef": "PO759900"
    }
  },
  "organeReuniRef": "PO759900",
  "typeReunion": "GP"
}