{
  "xsiType": "reunionInitParlementaire_type",
  "uid": "RUANR5L15S2019IDF0131495",
  "timestampDebut": "2019-05-15T17:30:00.000+02:00",
  "timestampFin": "2019-05-15T19:00:00.000+02:00",
  "lieu": {
    "code": "SALREU006",
    "libelleCourt": "3ème Bureau",
    "libelleLong": "3ème Bureau, Palais Bourbon"
  },
  "cycleDeVie": {
    "etat": "Confirmé",
    "chrono": {
      "creation": "2019-04-03T10:37:25.000+02:00"
    }
  },
  "demandeurs": {
    "acteurs": [
      {
        "nom": "Mme Marie-Christine VERDIER-JOUCLAS",
        "acteurRef": "PA721542"
      }
    ]
  },
  "typeReunion": "DEP"
}