{
  "xsiType": "reunionInitParlementaire_type",
  "uid": "RUANR5L15S2018IDF0095231",
  "timestampDebut": "2017-10-04T14:00:00.000+02:00",
  "timestampFin": "2017-10-04T15:00:00.000+02:00",
  "lieu": {
    "code": "SALREU039",
    "libelleCourt": "Salle 6550",
    "libelleLong": "Salle 6550, Palais Bourbon"
  },
  "cycleDeVie": {
    "etat": "Confirmé",
    "chrono": {
      "creation": "2017-08-07T13:29:37.000+02:00"
    }
  },
  "demandeurs": {
    "acteurs": [
      {
        "nom": "M. Mohamed LAQHILA",
        "acteurRef": "PA718978"
      }
    ]
  },
  "typeReunion": "DEP"
}