{
  "xsiType": "reunionInitParlementaire_type",
  "uid": "RUANR5L15S2018IDF0098197",
  "timestampDebut": "2017-10-18T14:00:00.000+02:00",
  "timestampFin": "2017-10-18T15:00:00.000+02:00",
  "lieu": {
    "code": "SALREU016",
    "libelleCourt": "Salon Gabriel",
    "libelleLong": "Salon Gabriel, 101, rue de l'Université"
  },
  "cycleDeVie": {
    "etat": "Confirmé",
    "chrono": {
      "creation": "2017-10-09T10:15:40.000+02:00"
    }
  },
  "demandeurs": {
    "acteurs": [
      {
        "nom": "M. Philippe BERTA",
        "acteurRef": "PA719488"
      }
    ]
  },
  "typeReunion": "DEP"
}