{
  "xsiType": "reunionInitParlementaire_type",
  "uid": "RUANR5L15S2018IDF0111461",
  "timestampDebut": "2018-05-30T11:30:00.000+02:00",
  "timestampFin": "2018-05-30T12:30:00.000+02:00",
  "lieu": {
    "code": "SALREU022",
    "libelleCourt": "Salle 7326",
    "libelleLong": "Salle 7326, 101, rue de l'Université"
  },
  "cycleDeVie": {
    "etat": "Confirmé",
    "chrono": {
      "creation": "2018-05-15T10:10:36.000+02:00"
    }
  },
  "demandeurs": {
    "acteurs": [
      {
        "nom": "M. Pierre CABARÉ",
        "acteurRef": "PA719496"
      }
    ]
  },
  "typeReunion": "DEP"
}