{
  "xsiType": "reunionInitParlementaire_type",
  "uid": "RUANR5L15S2019IDFL431671",
  "timestampDebut": "2019-03-19T17:30:00.000+01:00",
  "lieu": {
    "libelleLong": "salle 1 (3 rue Aristide Briand)"
  },
  "cycleDeVie": {
    "etat": "Confirmé",
    "chrono": {
      "creation": "2019-02-19T00:00:00.000+01:00"
    }
  },
  "organeReuniRef": "PO746624",
  "typeReunion": "GE",
  "odj": {
    "convocationOdj": [
      "Audition de représentants de l’Association de défense des victimes de l’amiante Meurthe-et-Moselle (ADEVA 54), de la Coordination des associations des victimes de l’amiante et de maladies professionnelles (CAVAM) et du Collectif des amiantés du secteur de Mimizan (Landes)"
    ]
  }
}