{
  "xsiType": "reunionInitParlementaire_type",
  "uid": "RUANR5L15S2019IDF0127176",
  "timestampDebut": "2019-05-01T08:30:00.000+02:00",
  "timestampFin": "2019-05-01T10:00:00.000+02:00",
  "lieu": {
    "code": "SALREU018",
    "libelleCourt": "Salon Mansart",
    "libelleLong": "Salon Mansart, 101, rue de l'Université"
  },
  "cycleDeVie": {
    "etat": "Confirmé",
    "chrono": {
      "creation": "2019-02-07T17:27:44.000+01:00"
    }
  },
  "demandeurs": {
    "acteurs": [
      {
        "nom": "Mme Sonia KRIMI",
        "acteurRef": "PA720202"
      }
    ]
  },
  "typeReunion": "DEP"
}