{
  "xsiType": "reunionCommission_type",
  "uid": "RUANR5L15S2019IDC432530",
  "timestampDebut": "2019-05-09T09:15:00.000+02:00",
  "timestampFin": "2019-05-09T10:30:00.000+02:00",
  "lieu": {
    "libelleLong": "salle 6351 (Affaires sociales)"
  },
  "cycleDeVie": {
    "etat": "Confirmé",
    "chrono": {
      "creation": "2019-05-03T00:00:00.000+02:00"
    }
  },
  "organeReuniRef": "PO762996",
  "participants": {
    "participantsInternes": [
      {
        "acteurRef": "PA718744",
        "presence": "présent"
      },
      {
        "acteurRef": "PA508",
        "presence": "absent"
      },
      {
        "acteurRef": "PA719922",
        "presence": "absent"
      },
      {
        "acteurRef": "PA722126",
        "presence": "présent"
      },
      {
        "acteurRef": "PA642868",
        "presence": "présent"
      },
      {
        "acteurRef": "PA720268",
        "presence": "absent"
      },
      {
        "acteurRef": "PA608292",
        "presence": "excusé"
      },
      {
        "acteurRef": "PA606202",
        "presence": "excusé"
      },
      {
        "acteurRef": "PA720924",
        "presence": "absent"
      },
      {
        "acteurRef": "PA719044",
        "presence": "absent"
      },
      {
        "acteurRef": "PA721896",
        "presence": "absent"
      },
      {
        "acteurRef": "PA718706",
        "presence": "absent"
      },
      {
        "acteurRef": "PA720560",
        "presence": "présent"
      },
      {
        "acteurRef": "PA719858",
        "presence": "absent"
      },
      {
        "acteurRef": "PA606712",
        "presence": "absent"
      },
      {
        "acteurRef": "PA606098",
        "presence": "absent"
      },
      {
        "acteurRef": "PA2086",
        "presence": "absent"
      },
      {
        "acteurRef": "PA719456",
        "presence": "présent"
      },
      {
        "acteurRef": "PA720892",
        "presence": "absent"
      },
      {
        "acteurRef": "PA722090",
        "presence": "présent"
      },
      {
        "acteurRef": "PA722194",
        "presence": "présent"
      },
      {
        "acteurRef": "PA721286",
        "presence": "présent"
      },
      {
        "acteurRef": "PA721584",
        "presence": "absent"
      }
    ]
  },
  "ouverturePresse": true,
  "odj": {
    "convocationOdj": [
      "– Audition, ouverte à la presse, de M. Jean-Paul Raymond, président de l’Association des directeurs d’action sociale et santé des départements et métropoles (ANDASS), et M. Roland Giraud, délégué au développement des partenariats"
    ],
    "resumeOdj": [
      "– audition, ouverte à la presse, de M. Jean-Paul Raymond, président de l’Association des directeurs d’action sociale et santé des départements et métropoles (ANDASS), et M. Roland Giraud, délégué au développement des partenariats."
    ]
  },
  "compteRenduRef": "CRCANR5L15S2019PO762996N013",
  "formatReunion": "Ordinaire",
  "infosReunionsInternationale": {
    "estReunionInternationale": false
  },
  "captationVideo": false
}