{
  "xsiType": "reunionInitParlementaire_type",
  "uid": "RUANR5L15S2019IDF0124460",
  "timestampDebut": "2019-01-17T13:45:00.000+01:00",
  "timestampFin": "2019-01-17T15:00:00.000+01:00",
  "lieu": {
    "code": "SALREU023",
    "libelleCourt": "Salle 7426",
    "libelleLong": "Salle 7426, 101, rue de l'Université"
  },
  "cycleDeVie": {
    "etat": "Confirmé",
    "chrono": {
      "creation": "2019-01-07T10:38:36.000+01:00"
    }
  },
  "demandeurs": {
    "acteurs": [
      {
        "nom": "M. Patrice ANATO",
        "acteurRef": "PA721278"
      },
      {
        "nom": "Mme Danièle OBONO",
        "acteurRef": "PA721960"
      }
    ]
  },
  "typeReunion": "DEP"
}