{
  "xsiType": "reunionCommission_type",
  "uid": "RUANR5L15S2019IDC431407",
  "timestampDebut": "2019-03-05T16:30:00.000+01:00",
  "timestampFin": "2019-03-05T19:30:00.000+01:00",
  "lieu": {
    "libelleLong": "salle 6351 (Affaires sociales)"
  },
  "cycleDeVie": {
    "etat": "Confirmé",
    "chrono": {
      "creation": "2019-01-31T00:00:00.000+01:00"
    }
  },
  "organeReuniRef": "PO420120",
  "participants": {
    "participantsInternes": [
      {
        "acteurRef": "PA642764",
        "presence": "présent"
      },
      {
        "acteurRef": "PA718744",
        "presence": "excusé"
      },
      {
        "acteurRef": "PA610681",
        "presence": "présent"
      },
      {
        "acteurRef": "PA720362",
        "presence": "présent"
      },
      {
        "acteurRef": "PA720968",
        "presence": "excusé"
      },
      {
        "acteurRef": "PA719488",
        "presence": "présent"
      },
      {
        "acteurRef": "PA508",
        "presence": "présent"
      },
      {
        "acteurRef": "PA721410",
        "presence": "présent"
      },
      {
        "acteurRef": "PA719980",
        "presence": "absent"
      },
      {
        "acteurRef": "PA608083",
        "presence": "présent"
      },
      {
        "acteurRef": "PA713448",
        "presence": "absent"
      },
      {
        "acteurRef": "PA721336",
        "presence": "présent"
      },
      {
        "acteurRef": "PA720546",
        "presence": "présent"
      },
      {
        "acteurRef": "PA720468",
        "presence": "absent"
      },
      {
        "acteurRef": "PA856",
        "presence": "présent"
      },
      {
        "acteurRef": "PA722126",
        "presence": "absent"
      },
      {
        "acteurRef": "PA642868",
        "presence": "présent"
      },
      {
        "acteurRef": "PA267429",
        "presence": "présent"
      },
      {
        "acteurRef": "PA719756",
        "presence": "absent"
      },
      {
        "acteurRef": "PA718850",
        "presence": "présent"
      },
      {
        "acteurRef": "PA722390",
        "presence": "présent"
      },
      {
        "acteurRef": "PA720932",
        "presence": "absent"
      },
      {
        "acteurRef": "PA718694",
        "presence": "présent"
      },
      {
        "acteurRef": "PA718926",
        "presence": "présent"
      },
      {
        "acteurRef": "PA267289",
        "presence": "présent"
      },
      {
        "acteurRef": "PA608292",
        "presence": "présent"
      },
      {
        "acteurRef": "PA720046",
        "presence": "présent"
      },
      {
        "acteurRef": "PA720924",
        "presence": "excusé"
      },
      {
        "acteurRef": "PA719570",
        "presence": "présent"
      },
      {
        "acteurRef": "PA720286",
        "presence": "présent"
      },
      {
        "acteurRef": "PA267780",
        "presence": "présent"
      },
      {
        "acteurRef": "PA718706",
        "presence": "absent"
      },
      {
        "acteurRef": "PA721246",
        "presence": "présent"
      },
      {
        "acteurRef": "PA720170",
        "presence": "excusé"
      },
      {
        "acteurRef": "PA267318",
        "presence": "présent"
      },
      {
        "acteurRef": "PA721126",
        "presence": "excusé"
      },
      {
        "acteurRef": "PA720326",
        "presence": "absent"
      },
      {
        "acteurRef": "PA331835",
        "presence": "excusé"
      },
      {
        "acteurRef": "PA722374",
        "presence": "présent"
      },
      {
        "acteurRef": "PA720074",
        "presence": "excusé"
      },
      {
        "acteurRef": "PA719186",
        "presence": "présent"
      },
      {
        "acteurRef": "PA719842",
        "presence": "présent"
      },
      {
        "acteurRef": "PA720916",
        "presence": "absent"
      },
      {
        "acteurRef": "PA719728",
        "presence": "présent"
      },
      {
        "acteurRef": "PA720480",
        "presence": "absent"
      },
      {
        "acteurRef": "PA722320",
        "presence": "présent"
      },
      {
        "acteurRef": "PA267378",
        "presence": "présent"
      },
      {
        "acteurRef": "PA719858",
        "presence": "présent"
      },
      {
        "acteurRef": "PA606712",
        "presence": "présent"
      },
      {
        "acteurRef": "PA717379",
        "presence": "présent"
      },
      {
        "acteurRef": "PA719072",
        "presence": "présent"
      },
      {
        "acteurRef": "PA720738",
        "presence": "absent"
      },
      {
        "acteurRef": "PA721418",
        "presence": "absent"
      },
      {
        "acteurRef": "PA2377",
        "presence": "présent"
      },
      {
        "acteurRef": "PA721710",
        "presence": "présent"
      },
      {
        "acteurRef": "PA720512",
        "presence": "présent"
      },
      {
        "acteurRef": "PA718910",
        "presence": "absent"
      },
      {
        "acteurRef": "PA267260",
        "presence": "présent"
      },
      {
        "acteurRef": "PA720422",
        "presence": "présent"
      },
      {
        "acteurRef": "PA721286",
        "presence": "présent"
      },
      {
        "acteurRef": "PA721070",
        "presence": "excusé"
      },
      {
        "acteurRef": "PA721062",
        "presence": "présent"
      },
      {
        "acteurRef": "PA720066",
        "presence": "présent"
      },
      {
        "acteurRef": "PA718810",
        "presence": "absent"
      },
      {
        "acteurRef": "PA722022",
        "presence": "absent"
      },
      {
        "acteurRef": "PA721110",
        "presence": "excusé"
      },
      {
        "acteurRef": "PA720952",
        "presence": "absent"
      },
      {
        "acteurRef": "PA719350",
        "presence": "présent"
      },
      {
        "acteurRef": "PA334768",
        "presence": "excusé"
      },
      {
        "acteurRef": "PA719540",
        "presence": "présent"
      },
      {
        "acteurRef": "PA643134",
        "presence": "absent"
      },
      {
        "acteurRef": "PA719930",
        "presence": "excusé"
      },
      {
        "acteurRef": "PA718728",
        "presence": "présent"
      },
      {
        "acteurRef": "PA721924",
        "presence": "présent"
      },
      {
        "acteurRef": "PA642788",
        "presence": "présent"
      },
      {
        "acteurRef": "PA267585",
        "presence": "présent"
      },
      {
        "acteurRef": "PA722102",
        "presence": "présent"
      },
      {
        "acteurRef": "PA719512",
        "presence": "absent"
      },
      {
        "acteurRef": "PA721474",
        "presence": "présent"
      },
      {
        "acteurRef": "PA722268",
        "presence": "absent"
      }
    ]
  },
  "ouverturePresse": true,
  "odj": {
    "convocationOdj": [
      "– Audition de Mmes Agnès Buzyn, ministre des solidarités et de la santé, et de Frédérique Vidal, ministre de l’enseignement supérieur, de la recherche et de l’innovation, puis discussion générale sur le projet de loi relatif à l’organisation et à la transformation du système de santé (n° 1681) (Mme Stéphanie Rist, rapporteure sur la première partie du texte, M. Thomas Mesnier, rapporteur général et rapporteur sur les autres dispositions)"
    ],
    "resumeOdj": [
      "audition de Mmes Agnès Buzyn, ministre des solidarités et de la santé, et de Frédérique Vidal, ministre de l’enseignement supérieur, de la recherche et de l’innovation, puis discussion générale sur le projet de loi relatif à l’organisation et à la transformation du système de santé (n° 1681)."
    ],
    "pointsOdj": [
      {
        "xsiType": "podjReunion_type",
        "uid": "RUANR5L15S2019IDC431407PT26394",
        "cycleDeVie": {
          "etat": "Confirmé",
          "chrono": {
            "creation": "2019-02-14T00:00:00.000+01:00"
          }
        },
        "objet": "Audition ministre et discussion générale",
        "dossiersLegislatifsRefs": [
          "DLR5L15N37234"
        ],
        "typePointOdj": "Audition ministre",
        "comiteSecret": false
      }
    ]
  },
  "compteRenduRef": "CRCANR5L15S2019PO420120N047",
  "formatReunion": "Ordinaire",
  "infosReunionsInternationale": {
    "estReunionInternationale": false
  },
  "captationVideo": false
}