{
  "xsiType": "reunionInitParlementaire_type",
  "uid": "RUANR5L15S2018IDF0109804",
  "timestampDebut": "2018-04-19T14:00:00.000+02:00",
  "timestampFin": "2018-04-19T19:00:00.000+02:00",
  "lieu": {
    "code": "SALREU005",
    "libelleCourt": "2ème Bureau",
    "libelleLong": "2ème Bureau, Palais Bourbon"
  },
  "cycleDeVie": {
    "etat": "Confirmé",
    "chrono": {
      "creation": "2018-04-11T18:28:22.000+02:00"
    }
  },
  "demandeurs": {
    "acteurs": [
      {
        "nom": "Mme Alexandra LOUIS",
        "acteurRef": "PA718918"
      }
    ]
  },
  "typeReunion": "DEP"
}