{
  "xsiType": "reunionInitParlementaire_type",
  "uid": "RUANR5L15S2019IDF0117360",
  "timestampDebut": "2019-05-08T09:30:00.000+02:00",
  "timestampFin": "2019-05-08T13:00:00.000+02:00",
  "lieu": {
    "code": "SALREU011",
    "libelleCourt": "Salle N° 2",
    "libelleLong": "Salle N° 2, 3, rue Aristide Briand"
  },
  "cycleDeVie": {
    "etat": "Confirmé",
    "chrono": {
      "creation": "2018-09-05T10:39:35.000+02:00"
    }
  },
  "demandeurs": {
    "acteurs": [
      {
        "nom": "Mme Marine LE PEN",
        "acteurRef": "PA720614"
      }
    ]
  },
  "typeReunion": "DEP"
}