{
  "xsiType": "reunionInitParlementaire_type",
  "uid": "RUANR5L15S2018IDF0113375",
  "timestampDebut": "2018-06-27T09:00:00.000+02:00",
  "timestampFin": "2018-06-27T13:00:00.000+02:00",
  "lieu": {
    "code": "SALREU010",
    "libelleCourt": "Salle N° 1",
    "libelleLong": "Salle N° 1, 3, rue Aristide Briand"
  },
  "cycleDeVie": {
    "etat": "Confirmé",
    "chrono": {
      "creation": "2018-06-11T08:52:44.000+02:00"
    }
  },
  "demandeurs": {
    "acteurs": [
      {
        "nom": "Mme Ericka BAREIGTS",
        "acteurRef": "PA610681"
      },
      {
        "nom": "M. Cyrille ISAAC-SIBILLE",
        "acteurRef": "PA722374"
      }
    ]
  },
  "typeReunion": "DEP"
}