{
  "xsiType": "reunionInitParlementaire_type",
  "uid": "RUANR5L15S2019IDF0118879",
  "timestampDebut": "2018-10-31T14:00:00.000+01:00",
  "timestampFin": "2018-10-31T15:00:00.000+01:00",
  "lieu": {
    "code": "SALREU021",
    "libelleCourt": "Salle 7207",
    "libelleLong": "Salle 7207, 101, rue de l'Université"
  },
  "cycleDeVie": {
    "etat": "Confirmé",
    "chrono": {
      "creation": "2018-09-19T10:01:37.000+02:00"
    }
  },
  "demandeurs": {
    "acteurs": [
      {
        "nom": "Mme Typhanie DEGOIS",
        "acteurRef": "PA721398"
      }
    ]
  },
  "typeReunion": "DEP"
}