{
  "xsiType": "reunionInitParlementaire_type",
  "uid": "RUANR5L15S2019IDF0124614",
  "timestampDebut": "2019-01-14T18:00:00.000+01:00",
  "timestampFin": "2019-01-14T19:30:00.000+01:00",
  "lieu": {
    "code": "SALREU021",
    "libelleCourt": "Salle 7207",
    "libelleLong": "Salle 7207, 101, rue de l'Université"
  },
  "cycleDeVie": {
    "etat": "Annulé",
    "chrono": {
      "creation": "2019-01-09T15:41:23.000+01:00",
      "cloture": "2019-01-14T14:19:57.000+01:00"
    }
  },
  "demandeurs": {
    "acteurs": [
      {
        "nom": "Mme Justine BENIN",
        "acteurRef": "PA720968"
      }
    ]
  },
  "typeReunion": "DEP"
}