{
  "xsiType": "reunionCommission_type",
  "uid": "RUANR5L15S2018IDC429004",
  "timestampDebut": "2018-03-29T09:30:00.000+02:00",
  "timestampFin": "2018-03-29T10:25:00.000+02:00",
  "lieu": {
    "libelleLong": "Salle n° 3 (95 rue de l'Université)"
  },
  "cycleDeVie": {
    "etat": "Confirmé",
    "chrono": {
      "creation": "2018-03-26T00:00:00.000+02:00"
    }
  },
  "organeReuniRef": "PO749043",
  "participants": {},
  "ouverturePresse": true,
  "odj": {
    "convocationOdj": [
      "Audition, ouverte à la presse, de M. François Beaupere, président de la Chambre d’agriculture du Maine-et-Loire, de Mme Carole Robert, juriste Service territoires et forêts et de M. Justin Lallouet coordinateur, Affaires publiques, France, Europe, international, Direction relations publiques et communication de l’Assemblée permanente des Chambres d’agriculture."
    ],
    "resumeOdj": [
      "audition, ouverte à la presse, de M. François Beaupere, président de la Chambre d’agriculture du Maine-et-Loire, de Mme Carole Robert, juriste Service territoires et forêts et de M. Justin Lallouet coordinateur, Affaires publiques, France, Europe, international, Direction relations publiques et communication de l’Assemblée permanente des Chambres d’agriculture."
    ]
  },
  "formatReunion": "Ordinaire",
  "infosReunionsInternationale": {
    "estReunionInternationale": false
  },
  "captationVideo": false
}