{
  "xsiType": "reunionInitParlementaire_type",
  "uid": "RUANR5L15S2017IDF0097541",
  "timestampDebut": "2017-09-30T08:00:00.000+02:00",
  "timestampFin": "2017-09-30T13:00:00.000+02:00",
  "lieu": {
    "code": "SALREU018",
    "libelleCourt": "Salon Mansart",
    "libelleLong": "Salon Mansart, 101, rue de l'Université"
  },
  "cycleDeVie": {
    "etat": "Confirmé",
    "chrono": {
      "creation": "2017-09-28T19:42:15.000+02:00"
    }
  },
  "demandeurs": {
    "acteurs": [
      {
        "nom": "M. Olivier FAURE",
        "acteurRef": "PA609332"
      }
    ]
  },
  "typeReunion": "DEP"
}