{
  "xsiType": "reunionInitParlementaire_type",
  "uid": "RUANR5L15S2018IDF0109435",
  "timestampDebut": "2018-04-17T11:30:00.000+02:00",
  "timestampFin": "2018-04-17T12:30:00.000+02:00",
  "lieu": {
    "code": "SALREU013",
    "libelleCourt": "Salle N° 3",
    "libelleLong": "Salle N° 3, 3, rue Aristide Briand"
  },
  "cycleDeVie": {
    "etat": "Confirmé",
    "chrono": {
      "creation": "2018-04-06T14:57:32.000+02:00"
    }
  },
  "demandeurs": {
    "acteurs": [
      {
        "nom": "Mme Sandrine JOSSO",
        "acteurRef": "PA720038"
      }
    ]
  },
  "typeReunion": "DEP"
}