{
  "xsiType": "reunionInitParlementaire_type",
  "uid": "RUANR5L15S2019IDF0124911",
  "timestampDebut": "2019-03-27T13:45:00.000+01:00",
  "timestampFin": "2019-03-27T14:45:00.000+01:00",
  "lieu": {
    "code": "SALREU013",
    "libelleCourt": "Salle N° 3",
    "libelleLong": "Salle N° 3, 3, rue Aristide Briand"
  },
  "cycleDeVie": {
    "etat": "Annulé",
    "chrono": {
      "creation": "2019-01-11T11:46:14.000+01:00",
      "cloture": "2019-03-21T16:11:27.000+01:00"
    }
  },
  "demandeurs": {
    "acteurs": [
      {
        "nom": "Mme Sophie PANONACLE",
        "acteurRef": "PA719632"
      }
    ]
  },
  "typeReunion": "DEP"
}