{
  "xsiType": "reunionCommission_type",
  "uid": "RUANR5L15S2018IDC429379",
  "timestampDebut": "2018-05-30T09:30:00.000+02:00",
  "timestampFin": "2018-05-30T12:05:00.000+02:00",
  "lieu": {
    "libelleLong": "salle 4223 (33 rue Saint-Dominique)"
  },
  "cycleDeVie": {
    "etat": "Confirmé",
    "chrono": {
      "creation": "2018-05-09T00:00:00.000+02:00"
    }
  },
  "organeReuniRef": "PO59047",
  "participants": {
    "participantsInternes": [
      {
        "acteurRef": "PA588884",
        "presence": "excusé"
      },
      {
        "acteurRef": "PA642724",
        "presence": "présent"
      },
      {
        "acteurRef": "PA719218",
        "presence": "excusé"
      },
      {
        "acteurRef": "PA721344",
        "presence": "présent"
      },
      {
        "acteurRef": "PA719032",
        "presence": "présent"
      },
      {
        "acteurRef": "PA330684",
        "presence": "présent"
      },
      {
        "acteurRef": "PA721118",
        "presence": "excusé"
      },
      {
        "acteurRef": "PA719496",
        "presence": "présent"
      },
      {
        "acteurRef": "PA721166",
        "presence": "présent"
      },
      {
        "acteurRef": "PA719448",
        "presence": "présent"
      },
      {
        "acteurRef": "PA719294",
        "presence": "présent"
      },
      {
        "acteurRef": "PA718850",
        "presence": "présent"
      },
      {
        "acteurRef": "PA998",
        "presence": "excusé"
      },
      {
        "acteurRef": "PA1008",
        "presence": "présent"
      },
      {
        "acteurRef": "PA1029",
        "presence": "présent"
      },
      {
        "acteurRef": "PA720862",
        "presence": "absent"
      },
      {
        "acteurRef": "PA720438",
        "presence": "présent"
      },
      {
        "acteurRef": "PA722382",
        "presence": "présent"
      },
      {
        "acteurRef": "PA1198",
        "presence": "excusé"
      },
      {
        "acteurRef": "PA720684",
        "presence": "présent"
      },
      {
        "acteurRef": "PA1206",
        "presence": "présent"
      },
      {
        "acteurRef": "PA1276",
        "presence": "présent"
      },
      {
        "acteurRef": "PA722284",
        "presence": "présent"
      },
      {
        "acteurRef": "PA720806",
        "presence": "présent"
      },
      {
        "acteurRef": "PA721024",
        "presence": "excusé"
      },
      {
        "acteurRef": "PA720222",
        "presence": "présent"
      },
      {
        "acteurRef": "PA718674",
        "presence": "présent"
      },
      {
        "acteurRef": "PA1498",
        "presence": "présent"
      },
      {
        "acteurRef": "PA610775",
        "presence": "excusé"
      },
      {
        "acteurRef": "PA695100",
        "presence": "présent"
      },
      {
        "acteurRef": "PA1630",
        "presence": "présent"
      },
      {
        "acteurRef": "PA333818",
        "presence": "présent"
      },
      {
        "acteurRef": "PA267801",
        "presence": "excusé"
      },
      {
        "acteurRef": "PA719210",
        "presence": "excusé"
      },
      {
        "acteurRef": "PA722344",
        "presence": "présent"
      },
      {
        "acteurRef": "PA721644",
        "presence": "présent"
      },
      {
        "acteurRef": "PA720202",
        "presence": "présent"
      },
      {
        "acteurRef": "PA720214",
        "presence": "présent"
      },
      {
        "acteurRef": "PA721004",
        "presence": "excusé"
      },
      {
        "acteurRef": "PA1809",
        "presence": "présent"
      },
      {
        "acteurRef": "PA335612",
        "presence": "présent"
      },
      {
        "acteurRef": "PA722008",
        "presence": "absent"
      },
      {
        "acteurRef": "PA721450",
        "presence": "présent"
      },
      {
        "acteurRef": "PA720342",
        "presence": "présent"
      },
      {
        "acteurRef": "PA720614",
        "presence": "excusé"
      },
      {
        "acteurRef": "PA1960",
        "presence": "présent"
      },
      {
        "acteurRef": "PA722178",
        "presence": "excusé"
      },
      {
        "acteurRef": "PA334116",
        "presence": "présent"
      },
      {
        "acteurRef": "PA720146",
        "presence": "présent"
      },
      {
        "acteurRef": "PA720870",
        "presence": "présent"
      },
      {
        "acteurRef": "PA2150",
        "presence": "présent"
      },
      {
        "acteurRef": "PA720370",
        "presence": "présent"
      },
      {
        "acteurRef": "PA719130",
        "presence": "présent"
      },
      {
        "acteurRef": "PA719464",
        "presence": "présent"
      },
      {
        "acteurRef": "PA721486",
        "presence": "excusé"
      },
      {
        "acteurRef": "PA721956",
        "presence": "présent"
      },
      {
        "acteurRef": "PA721182",
        "presence": "présent"
      },
      {
        "acteurRef": "PA267260",
        "presence": "présent"
      },
      {
        "acteurRef": "PA719528",
        "presence": "présent"
      },
      {
        "acteurRef": "PA2492",
        "presence": "présent"
      },
      {
        "acteurRef": "PA720552",
        "presence": "présent"
      },
      {
        "acteurRef": "PA2529",
        "presence": "absent"
      },
      {
        "acteurRef": "PA721824",
        "presence": "excusé"
      },
      {
        "acteurRef": "PA330788",
        "presence": "excusé"
      },
      {
        "acteurRef": "PA720138",
        "presence": "présent"
      },
      {
        "acteurRef": "PA717151",
        "presence": "présent"
      },
      {
        "acteurRef": "PA721174",
        "presence": "excusé"
      },
      {
        "acteurRef": "PA722118",
        "presence": "présent"
      },
      {
        "acteurRef": "PA267794",
        "presence": "absent"
      },
      {
        "acteurRef": "PA721690",
        "presence": "présent"
      },
      {
        "acteurRef": "PA719550",
        "presence": "présent"
      },
      {
        "acteurRef": "PA2796",
        "presence": "présent"
      },
      {
        "acteurRef": "PA720830",
        "presence": "présent"
      },
      {
        "acteurRef": "PA720746",
        "presence": "excusé"
      }
    ]
  },
  "ouverturePresse": false,
  "odj": {
    "convocationOdj": [
      "– Examen, ouvert à la presse, et vote sur les projets de loi suivants :• Projet de loi autorisant l'approbation du protocole entre la France et la Bosnie-Herzégovine portant sur l'application de l'accord du 18 septembre 2007 entre la Communauté européenne et la Bosnie-Herzégovine concernant la réadmission des personnes en séjour irrégulier (n° 321) – Mme Liliana Tanguy, rapporteure ;• Projet de loi autorisant l'approbation de l'accord entre la France et la Bosnie-Herzégovine relatif à la mobilité des jeunes (n° 322) –  M. Frédéric Petit, rapporteur ;• Projet de loi, adopté par le Sénat, autorisant l'approbation de la convention d'entraide judiciaire en matière pénale et de la convention d'extradition entre la France et Sainte-Lucie (n° 528) – M. Guy Teissier, rapporteur ;• Projet de loi autorisant l'approbation de l'accord entre la France et le Chili relatif à l'emploi rémunéré des personnes à charge des agents des missions officielles de chaque État dans l'autre et de l'accord entre la France et la Bolivie relatif à l'emploi salarié des membres des familles des agents des missions officielles de chaque État dans l'autre (n° 599) – M. Jean-Paul Lecoq, rapporteur ;• Projet de loi autorisant la ratification de l’accord de partenariat sur les relations et la coopération entre l’Union européenne et ses États membres, d’une part, et la Nouvelle-Zélande, d’autre part (n° 615) – Mme Olga Givernet, rapporteure."
    ],
    "resumeOdj": [
      "examen, ouvert à la presse, et vote sur les projets de loi suivants :",
      "application de l'accord UE-Bosnie-Herzégovine sur la réadmission des personnes en séjour irrégulier (n° 321) – Mme Liliana Tanguy, rapporteure ;",
      "accord avec la Bosnie-Herzégovine sur la mobilité des jeunes (n° 322) –  M. Frédéric Petit, rapporteur ;",
      "conventions d'entraide judiciaire et d'extradition avec Sainte-Lucie (n° 528) – M. Guy Teissier, rapporteur ;",
      "accord avec le Chili et la Bolivie sur l'emploi rémunéré des agents des missions (n° 599) – M. Jean-Paul Lecoq, rapporteur ;",
      "accord de coopération entre l’Union européenne et la Nouvelle-Zélande (n° 615) – Mme Olga Givernet, rapporteure."
    ],
    "pointsOdj": [
      {
        "xsiType": "podjReunion_type",
        "uid": "RUANR5L15S2018IDC429379PT25737",
        "cycleDeVie": {
          "etat": "Confirmé",
          "chrono": {
            "creation": "2018-05-28T00:00:00.000+02:00"
          }
        },
        "objet": "Examen",
        "dossiersLegislatifsRefs": [
          "DLR5L15N36080"
        ],
        "typePointOdj": "Examen",
        "comiteSecret": false
      },
      {
        "xsiType": "podjReunion_type",
        "uid": "RUANR5L15S2018IDC429379PT25738",
        "cycleDeVie": {
          "etat": "Confirmé",
          "chrono": {
            "creation": "2018-05-28T00:00:00.000+02:00"
          }
        },
        "objet": "Examen",
        "dossiersLegislatifsRefs": [
          "DLR5L15N36079"
        ],
        "typePointOdj": "Examen",
        "comiteSecret": false
      },
      {
        "xsiType": "podjReunion_type",
        "uid": "RUANR5L15S2018IDC429379PT25739",
        "cycleDeVie": {
          "etat": "Confirmé",
          "chrono": {
            "creation": "2018-05-28T00:00:00.000+02:00"
          }
        },
        "objet": "Examen",
        "dossiersLegislatifsRefs": [
          "DLR5L14N35819"
        ],
        "typePointOdj": "Examen",
        "comiteSecret": false
      },
      {
        "xsiType": "podjReunion_type",
        "uid": "RUANR5L15S2018IDC429379PT25740",
        "cycleDeVie": {
          "etat": "Confirmé",
          "chrono": {
            "creation": "2018-05-28T00:00:00.000+02:00"
          }
        },
        "objet": "Examen",
        "dossiersLegislatifsRefs": [
          "DLR5L14N35418"
        ],
        "typePointOdj": "Examen",
        "comiteSecret": false
      },
      {
        "xsiType": "podjReunion_type",
        "uid": "RUANR5L15S2018IDC429379PT25741",
        "cycleDeVie": {
          "etat": "Confirmé",
          "chrono": {
            "creation": "2018-05-28T00:00:00.000+02:00"
          }
        },
        "objet": "Examen",
        "dossiersLegislatifsRefs": [
          "DLR5L15N36332"
        ],
        "typePointOdj": "Examen",
        "comiteSecret": false
      }
    ]
  },
  "compteRenduRef": "CRCANR5L15S2018PO59047N067",
  "formatReunion": "Ordinaire",
  "infosReunionsInternationale": {
    "estReunionInternationale": false
  },
  "captationVideo": false
}