{
  "xsiType": "reunionInitParlementaire_type",
  "uid": "RUANR5L15S2017IDF0096588",
  "timestampDebut": "2017-09-21T11:15:00.000+02:00",
  "timestampFin": "2017-09-21T12:00:00.000+02:00",
  "lieu": {
    "code": "SALREU013",
    "libelleCourt": "Salle N° 3",
    "libelleLong": "Salle N° 3, 3, rue Aristide Briand"
  },
  "cycleDeVie": {
    "etat": "Confirmé",
    "chrono": {
      "creation": "2017-09-19T12:24:12.000+02:00"
    }
  },
  "demandeurs": {
    "acteurs": [
      {
        "nom": "M. Olivier VÉRAN",
        "acteurRef": "PA642788"
      }
    ]
  },
  "typeReunion": "DEP"
}