{
  "xsiType": "reunionInitParlementaire_type",
  "uid": "RUANR5L15S2018IDF0107023",
  "timestampDebut": "2018-04-09T09:00:00.000+02:00",
  "timestampFin": "2018-04-09T11:00:00.000+02:00",
  "lieu": {
    "code": "SALREU029",
    "libelleCourt": "Salon Mars III",
    "libelleLong": "Salon Mars III, 101, rue de l'Université"
  },
  "cycleDeVie": {
    "etat": "Confirmé",
    "chrono": {
      "creation": "2018-03-06T14:23:26.000+01:00"
    }
  },
  "demandeurs": {
    "acteurs": [
      {
        "nom": "Mme Sophie PANONACLE",
        "acteurRef": "PA719632"
      }
    ]
  },
  "typeReunion": "DEP"
}