{
  "xsiType": "reunionCommission_type",
  "uid": "RUANR5L15S2018IDC428070",
  "timestampDebut": "2018-01-17T10:30:00.000+01:00",
  "timestampFin": "2018-01-17T12:30:00.000+01:00",
  "lieu": {
    "libelleLong": "salle 6237 (Développement durable)"
  },
  "cycleDeVie": {
    "etat": "Confirmé",
    "chrono": {
      "creation": "2017-12-07T00:00:00.000+01:00"
    }
  },
  "organeReuniRef": "PO419865",
  "participants": {
    "participantsInternes": [
      {
        "acteurRef": "PA720242",
        "presence": "présent"
      },
      {
        "acteurRef": "PA720310",
        "presence": "présent"
      },
      {
        "acteurRef": "PA719806",
        "presence": "présent"
      },
      {
        "acteurRef": "PA721046",
        "presence": "présent"
      },
      {
        "acteurRef": "PA720210",
        "presence": "excusé"
      },
      {
        "acteurRef": "PA266793",
        "presence": "présent"
      },
      {
        "acteurRef": "PA267233",
        "presence": "présent"
      },
      {
        "acteurRef": "PA718710",
        "presence": "présent"
      },
      {
        "acteurRef": "PA267766",
        "presence": "présent"
      },
      {
        "acteurRef": "PA719890",
        "presence": "présent"
      },
      {
        "acteurRef": "PA718838",
        "presence": "excusé"
      },
      {
        "acteurRef": "PA722000",
        "presence": "présent"
      },
      {
        "acteurRef": "PA719922",
        "presence": "présent"
      },
      {
        "acteurRef": "PA721860",
        "presence": "présent"
      },
      {
        "acteurRef": "PA719740",
        "presence": "excusé"
      },
      {
        "acteurRef": "PA719286",
        "presence": "excusé"
      },
      {
        "acteurRef": "PA719624",
        "presence": "présent"
      },
      {
        "acteurRef": "PA719194",
        "presence": "présent"
      },
      {
        "acteurRef": "PA330909",
        "presence": "présent"
      },
      {
        "acteurRef": "PA720538",
        "presence": "présent"
      },
      {
        "acteurRef": "PA722236",
        "presence": "présent"
      },
      {
        "acteurRef": "PA718894",
        "presence": "présent"
      },
      {
        "acteurRef": "PA720652",
        "presence": "présent"
      },
      {
        "acteurRef": "PA605694",
        "presence": "présent"
      },
      {
        "acteurRef": "PA722366",
        "presence": "présent"
      },
      {
        "acteurRef": "PA720054",
        "presence": "présent"
      },
      {
        "acteurRef": "PA720038",
        "presence": "présent"
      },
      {
        "acteurRef": "PA721514",
        "presence": "absent"
      },
      {
        "acteurRef": "PA605084",
        "presence": "présent"
      },
      {
        "acteurRef": "PA605518",
        "presence": "absent"
      },
      {
        "acteurRef": "PA720764",
        "presence": "absent"
      },
      {
        "acteurRef": "PA722228",
        "presence": "présent"
      },
      {
        "acteurRef": "PA719412",
        "presence": "présent"
      },
      {
        "acteurRef": "PA588886",
        "presence": "présent"
      },
      {
        "acteurRef": "PA721054",
        "presence": "excusé"
      },
      {
        "acteurRef": "PA721530",
        "presence": "présent"
      },
      {
        "acteurRef": "PA719718",
        "presence": "présent"
      },
      {
        "acteurRef": "PA346054",
        "presence": "présent"
      },
      {
        "acteurRef": "PA719080",
        "presence": "présent"
      },
      {
        "acteurRef": "PA2155",
        "presence": "présent"
      },
      {
        "acteurRef": "PA719882",
        "presence": "présent"
      },
      {
        "acteurRef": "PA721976",
        "presence": "présent"
      },
      {
        "acteurRef": "PA721876",
        "presence": "présent"
      },
      {
        "acteurRef": "PA720278",
        "presence": "présent"
      },
      {
        "acteurRef": "PA720334",
        "presence": "présent"
      },
      {
        "acteurRef": "PA720606",
        "presence": "présent"
      },
      {
        "acteurRef": "PA333421",
        "presence": "présent"
      },
      {
        "acteurRef": "PA719632",
        "presence": "présent"
      },
      {
        "acteurRef": "PA720892",
        "presence": "absent"
      },
      {
        "acteurRef": "PA720944",
        "presence": "présent"
      },
      {
        "acteurRef": "PA718802",
        "presence": "présent"
      },
      {
        "acteurRef": "PA720414",
        "presence": "présent"
      },
      {
        "acteurRef": "PA721372",
        "presence": "excusé"
      },
      {
        "acteurRef": "PA693008",
        "presence": "présent"
      },
      {
        "acteurRef": "PA609520",
        "presence": "présent"
      },
      {
        "acteurRef": "PA719578",
        "presence": "présent"
      },
      {
        "acteurRef": "PA721426",
        "presence": "présent"
      },
      {
        "acteurRef": "PA610733",
        "presence": "excusé"
      },
      {
        "acteurRef": "PA721600",
        "presence": "excusé"
      },
      {
        "acteurRef": "PA267527",
        "presence": "présent"
      },
      {
        "acteurRef": "PA719972",
        "presence": "présent"
      },
      {
        "acteurRef": "PA267204",
        "presence": "présent"
      },
      {
        "acteurRef": "PA610667",
        "presence": "présent"
      },
      {
        "acteurRef": "PA722336",
        "presence": "présent"
      },
      {
        "acteurRef": "PA719092",
        "presence": "présent"
      },
      {
        "acteurRef": "PA643145",
        "presence": "absent"
      },
      {
        "acteurRef": "PA718728",
        "presence": "absent"
      },
      {
        "acteurRef": "PA720586",
        "presence": "présent"
      },
      {
        "acteurRef": "PA721968",
        "presence": "présent"
      },
      {
        "acteurRef": "PA722110",
        "presence": "présent"
      },
      {
        "acteurRef": "PA718962",
        "presence": "présent"
      }
    ]
  },
  "ouverturePresse": true,
  "odj": {
    "convocationOdj": [
      "Audition de M. Philippe Martin, Président du Conseil d’administration de l’Agence française pour la biodiversité, et de M. Christophe Aubel, Secrétaire général."
    ],
    "resumeOdj": [
      "audition de M. Philippe Martin, Président du Conseil d’administration de l’Agence française pour la biodiversité, et de M. Christophe Aubel, Secrétaire général."
    ],
    "pointsOdj": [
      {
        "xsiType": "podjReunion_type",
        "uid": "RUANR5L15S2018IDC428070PT25370",
        "cycleDeVie": {
          "etat": "Annulé",
          "chrono": {
            "creation": "2018-01-10T00:00:00.000+01:00",
            "cloture": "2018-01-10T00:00:00.000+01:00"
          }
        },
        "objet": "Nomination d'un rapporteur",
        "typePointOdj": "Nomination rapporteur",
        "comiteSecret": false
      }
    ]
  },
  "compteRenduRef": "CRCANR5L15S2018PO419865N025",
  "formatReunion": "Ordinaire",
  "infosReunionsInternationale": {
    "estReunionInternationale": false
  },
  "captationVideo": false
}