{
  "xsiType": "reunionInitParlementaire_type",
  "uid": "RUANR5L15S2018IDF0114793",
  "timestampDebut": "2018-09-04T09:00:00.000+02:00",
  "timestampFin": "2018-09-04T12:00:00.000+02:00",
  "lieu": {
    "code": "SALREU046",
    "libelleCourt": "Sully 1",
    "libelleLong": "Sully 1, Palais Bourbon"
  },
  "cycleDeVie": {
    "etat": "Confirmé",
    "chrono": {
      "creation": "2018-07-03T15:36:50.000+02:00"
    }
  },
  "demandeurs": {
    "organe": {
      "nom": "GROUPE LA FRANCE INSOUMISE",
      "organeRef": "PO730958"
    }
  },
  "organeReuniRef": "PO730958",
  "typeReunion": "GP"
}