{
  "xsiType": "reunionCommission_type",
  "uid": "RUANR5L15S2019IDC431816",
  "timestampDebut": "2019-03-28T11:00:00.000+01:00",
  "lieu": {},
  "cycleDeVie": {
    "etat": "Supprimé",
    "chrono": {
      "creation": "2019-03-07T00:00:00.000+01:00",
      "cloture": "2019-03-08T00:00:00.000+01:00"
    }
  },
  "organeReuniRef": "PO420375",
  "participants": {},
  "ouverturePresse": true,
  "odj": {
    "convocationOdj": [
      "Évaluation de la lutte contre la délinquance financière : examen du rapport (MM. Ugo Bernalicis et Jacques Maire, rapporteurs)."
    ],
    "resumeOdj": [
      "évaluation de la lutte contre la délinquance financière : examen du rapport (MM. Ugo Bernalicis et Jacques Maire, rapporteurs)."
    ]
  },
  "formatReunion": "Ordinaire",
  "infosReunionsInternationale": {
    "estReunionInternationale": false
  },
  "captationVideo": false
}