{
  "xsiType": "reunionInitParlementaire_type",
  "uid": "RUANR5L15S2018IDF0112285",
  "timestampDebut": "2018-06-26T16:00:00.000+02:00",
  "timestampFin": "2018-06-26T17:00:00.000+02:00",
  "lieu": {
    "code": "SALREU013",
    "libelleCourt": "Salle N° 3",
    "libelleLong": "Salle N° 3, 3, rue Aristide Briand"
  },
  "cycleDeVie": {
    "etat": "Confirmé",
    "chrono": {
      "creation": "2018-05-24T16:39:03.000+02:00"
    }
  },
  "demandeurs": {
    "acteurs": [
      {
        "nom": "M. Guy TEISSIER",
        "acteurRef": "PA2796"
      }
    ]
  },
  "typeReunion": "DEP"
}