{
  "xsiType": "reunionCommission_type",
  "uid": "RUANR5L15S2018IDC429546",
  "timestampDebut": "2018-06-05T17:00:00.000+02:00",
  "lieu": {
    "libelleLong": "salle 4204 (33 rue Saint-Dominique)"
  },
  "cycleDeVie": {
    "etat": "Supprimé",
    "chrono": {
      "creation": "2018-05-22T00:00:00.000+02:00",
      "cloture": "2018-05-31T00:00:00.000+02:00"
    }
  },
  "organeReuniRef": "PO744234",
  "participants": {},
  "ouverturePresse": false,
  "odj": {
    "convocationOdj": [
      "– Audition de M. Guillaume Klossa, Fondateur du Think tank Europanova."
    ],
    "resumeOdj": [
      "audition de M. Guillaume Klossa, Fondateur du Think tank Europanova."
    ]
  },
  "formatReunion": "Ordinaire",
  "infosReunionsInternationale": {
    "estReunionInternationale": false
  },
  "captationVideo": false
}