{
  "xsiType": "reunionInitParlementaire_type",
  "uid": "RUANR5L15S2019IDF0128565",
  "timestampDebut": "2019-02-28T10:30:00.000+01:00",
  "timestampFin": "2019-02-28T12:00:00.000+01:00",
  "lieu": {
    "code": "SALREU022",
    "libelleCourt": "Salle 7326",
    "libelleLong": "Salle 7326, 101, rue de l'Université"
  },
  "cycleDeVie": {
    "etat": "Confirmé",
    "chrono": {
      "creation": "2019-02-25T09:28:10.000+01:00"
    }
  },
  "demandeurs": {
    "acteurs": [
      {
        "nom": "M. Loïc DOMBREVAL",
        "acteurRef": "PA718894"
      }
    ]
  },
  "typeReunion": "DEP"
}