{
  "xsiType": "reunionInitParlementaire_type",
  "uid": "RUANR5L15S2018IDF0098185",
  "timestampDebut": "2017-10-12T14:00:00.000+02:00",
  "timestampFin": "2017-10-12T19:00:00.000+02:00",
  "lieu": {
    "code": "SALREU009",
    "libelleCourt": "8ème Bureau",
    "libelleLong": "8ème Bureau, Palais Bourbon"
  },
  "cycleDeVie": {
    "etat": "Confirmé",
    "chrono": {
      "creation": "2017-10-06T19:37:26.000+02:00"
    }
  },
  "demandeurs": {
    "organe": {
      "nom": "GROUPE LA FRANCE INSOUMISE",
      "organeRef": "PO730958"
    }
  },
  "organeReuniRef": "PO730958",
  "typeReunion": "GP"
}