{
  "xsiType": "reunionInitParlementaire_type",
  "uid": "RUANR5L15S2018IDF0096004",
  "timestampDebut": "2017-10-05T09:00:00.000+02:00",
  "timestampFin": "2017-10-05T18:00:00.000+02:00",
  "lieu": {
    "code": "SALREU018",
    "libelleCourt": "Salon Mansart",
    "libelleLong": "Salon Mansart, 101, rue de l'Université"
  },
  "cycleDeVie": {
    "etat": "Confirmé",
    "chrono": {
      "creation": "2017-09-11T12:38:18.000+02:00"
    }
  },
  "demandeurs": {
    "acteurs": [
      {
        "nom": "Mme Marie-Ange MAGNE",
        "acteurRef": "PA722244"
      }
    ]
  },
  "typeReunion": "DEP"
}