{
  "xsiType": "reunionInitParlementaire_type",
  "uid": "RUANR5L15S2018IDF0098036",
  "timestampDebut": "2018-01-31T14:00:00.000+01:00",
  "timestampFin": "2018-01-31T19:30:00.000+01:00",
  "lieu": {
    "code": "SALREU011",
    "libelleCourt": "Salle N° 2",
    "libelleLong": "Salle N° 2, 3, rue Aristide Briand"
  },
  "cycleDeVie": {
    "etat": "Confirmé",
    "chrono": {
      "creation": "2017-10-05T15:07:48.000+02:00"
    }
  },
  "demandeurs": {
    "acteurs": [
      {
        "nom": "Mme Marine LE PEN",
        "acteurRef": "PA720614"
      }
    ]
  },
  "typeReunion": "DEP"
}