{
  "xsiType": "reunionInitParlementaire_type",
  "uid": "RUANR5L15S2018IDF0106414",
  "timestampDebut": "2018-05-22T17:00:00.000+02:00",
  "timestampFin": "2018-05-22T19:00:00.000+02:00",
  "lieu": {
    "code": "SALREU048",
    "libelleCourt": "Salle 6809",
    "libelleLong": "Salle 6809, Palais Bourbon"
  },
  "cycleDeVie": {
    "etat": "Confirmé",
    "chrono": {
      "creation": "2018-02-22T11:42:45.000+01:00"
    }
  },
  "demandeurs": {
    "acteurs": [
      {
        "nom": "M. Pierre PERSON",
        "acteurRef": "PA721568"
      }
    ]
  },
  "typeReunion": "DEP"
}