{
  "xsiType": "reunionInitParlementaire_type",
  "uid": "RUANR5L15S2019IDF0119390",
  "timestampDebut": "2018-10-05T10:00:00.000+02:00",
  "timestampFin": "2018-10-05T11:00:00.000+02:00",
  "lieu": {
    "code": "SALREU008",
    "libelleCourt": "5ème Bureau",
    "libelleLong": "5ème Bureau, Palais Bourbon"
  },
  "cycleDeVie": {
    "etat": "Confirmé",
    "chrono": {
      "creation": "2018-09-25T17:10:51.000+02:00"
    }
  },
  "demandeurs": {
    "acteurs": [
      {
        "nom": "M. Florent BOUDIÉ",
        "acteurRef": "PA606507"
      }
    ]
  },
  "typeReunion": "DEP"
}