{
  "xsiType": "reunionInitParlementaire_type",
  "uid": "RUANR5L15S2019IDF0138918",
  "timestampDebut": "2019-09-10T09:00:00.000+02:00",
  "timestampFin": "2019-09-10T10:30:00.000+02:00",
  "lieu": {
    "code": "SALREU021",
    "libelleCourt": "Salle 7207",
    "libelleLong": "Salle 7207, 101, rue de l'Université"
  },
  "cycleDeVie": {
    "etat": "Confirmé",
    "chrono": {
      "creation": "2019-09-03T14:16:33.000+02:00"
    }
  },
  "demandeurs": {
    "acteurs": [
      {
        "nom": "Mme Charlotte LECOCQ",
        "acteurRef": "PA720480"
      }
    ]
  },
  "typeReunion": "DEP"
}