{
  "@xmlns": "http://schemas.assemblee-nationale.fr/referentiel",
  "@xmlns:xsi": "http://www.w3.org/2001/XMLSchema-instance",
  "@xsi:type": "reunionInitParlementaire_type",
  "uid": "RUANR5L15S2018IDF0101088",
  "timeStampDebut": "2017-11-29T14:30:00.000+01:00",
  "timeStampFin": "2017-11-29T16:30:00.000+01:00",
  "lieu": {
    "code": "SALREU020",
    "libelleCourt": "Salon Mars II",
    "libelleLong": "Salon Mars II, 101, rue de l'Université"
  },
  "cycleDeVie": {
    "etat": "Confirmé",
    "chrono": {
      "creation": "2017-11-21T17:07:45.000+01:00",
      "cloture": null
    }
  },
  "demandeurs": {
    "acteur": {
      "nom": "M. Napole POLUTELE",
      "acteurRef": "PA693008"
    }
  },
  "organeReuniRef": null,
  "typeReunion": "DEP"
}