{
  "@xmlns": "http://schemas.assemblee-nationale.fr/referentiel",
  "@xmlns:xsi": "http://www.w3.org/2001/XMLSchema-instance",
  "@xsi:type": "reunionInitParlementaire_type",
  "uid": "RUANR5L15S2018IDF0096905",
  "timeStampDebut": "2017-10-16T15:00:00.000+02:00",
  "timeStampFin": "2017-10-16T18:00:00.000+02:00",
  "lieu": {
    "code": "SALREU007",
    "libelleCourt": "4ème Bureau",
    "libelleLong": "4ème Bureau, Palais Bourbon"
  },
  "cycleDeVie": {
    "etat": "Annulé",
    "chrono": {
      "creation": "2017-09-22T16:52:58.000+02:00",
      "cloture": "2017-09-25T13:06:39.000+02:00"
    }
  },
  "demandeurs": {
    "acteur": {
      "nom": "M. François CORNUT-GENTILLE",
      "acteurRef": "PA923"
    }
  },
  "organeReuniRef": null,
  "typeReunion": "DEP"
}