{
  "@xmlns": "http://schemas.assemblee-nationale.fr/referentiel",
  "@xmlns:xsi": "http://www.w3.org/2001/XMLSchema-instance",
  "@xsi:type": "reunionCommission_type",
  "uid": "RUANR5L15S2018IDC427545",
  "timeStampDebut": "2017-10-18T16:10:00.000+02:00",
  "timeStampFin": "2017-10-18T17:25:00.000+02:00",
  "lieu": {
    "libelleLong": "salle 6238 (Affaires culturelles)"
  },
  "cycleDeVie": {
    "etat": "Confirmé",
    "chrono": {
      "creation": "2017-10-12T00:00:00.000+02:00",
      "cloture": null
    }
  },
  "organeReuniRef": "PO734758",
  "demandeur": null,
  "participants": {
    "participantsInternes": {
      "participantInterne": [
        {
          "acteurRef": "PA720430",
          "presence": "absent"
        },
        {
          "acteurRef": "PA719748",
          "presence": "absent"
        },
        {
          "acteurRef": "PA719616",
          "presence": "présent"
        },
        {
          "acteurRef": "PA721142",
          "presence": "absent"
        },
        {
          "acteurRef": "PA267200",
          "presence": "présent"
        },
        {
          "acteurRef": "PA721984",
          "presence": "absent"
        },
        {
          "acteurRef": "PA606098",
          "presence": "présent"
        },
        {
          "acteurRef": "PA346218",
          "presence": "absent"
        },
        {
          "acteurRef": "PA721800",
          "presence": "présent"
        },
        {
          "acteurRef": "PA719952",
          "presence": "absent"
        },
        {
          "acteurRef": "PA607619",
          "presence": "absent"
        },
        {
          "acteurRef": "PA266788",
          "presence": "absent"
        },
        {
          "acteurRef": "PA719202",
          "presence": "absent"
        },
        {
          "acteurRef": "PA721270",
          "presence": "absent"
        },
        {
          "acteurRef": "PA719600",
          "presence": "absent"
        },
        {
          "acteurRef": "PA643127",
          "presence": "absent"
        },
        {
          "acteurRef": "PA721584",
          "presence": "absent"
        },
        {
          "acteurRef": "PA608695",
          "presence": "absent"
        }
      ]
    },
    "personnesAuditionnees": null
  },
  "sessionRef": null,
  "ouverturePresse": "true",
  "captationVideo": "false",
  "ODJ": {
    "convocationODJ": {
      "item": "Audition de M. Bernard Pêcheur, conseiller d’État, président adjoint de la section des finances du Conseil d’État."
    },
    "resumeODJ": {
      "item": "audition de M. Bernard Pêcheur, conseiller d’État, président adjoint de la section des finances du Conseil d’État."
    },
    "pointsODJ": null
  },
  "compteRenduRef": null,
  "formatReunion": "Ordinaire",
  "infosReunionsInternationale": {
    "estReunionInternationale": "false",
    "listePays": null,
    "informationsComplementaires": null
  }
}