{
  "@xmlns": "http://schemas.assemblee-nationale.fr/referentiel",
  "@xmlns:xsi": "http://www.w3.org/2001/XMLSchema-instance",
  "@xsi:type": "reunionInitParlementaire_type",
  "uid": "RUANR5L15S2020IDF0139601",
  "timeStampDebut": "2019-10-15T17:00:00.000+02:00",
  "timeStampFin": "2019-10-15T20:00:00.000+02:00",
  "lieu": {
    "code": "SALREU002",
    "libelleCourt": "Salle 7070",
    "libelleLong": "Salle 7070, 103, rue de l'Université"
  },
  "cycleDeVie": {
    "etat": "Annulé",
    "chrono": {
      "creation": "2019-09-11T11:14:17.000+02:00",
      "cloture": "2019-09-11T11:57:44.000+02:00"
    }
  },
  "demandeurs": {
    "acteur": {
      "nom": "Mme Josette MANIN",
      "acteurRef": "PA720988"
    }
  },
  "organeReuniRef": null,
  "typeReunion": "DEP"
}