{
  "@xmlns": "http://schemas.assemblee-nationale.fr/referentiel",
  "@xmlns:xsi": "http://www.w3.org/2001/XMLSchema-instance",
  "@xsi:type": "reunionInitParlementaire_type",
  "uid": "RUANR5L15S2018IDF0115079",
  "timeStampDebut": "2018-07-17T10:00:00.000+02:00",
  "timeStampFin": "2018-07-17T12:00:00.000+02:00",
  "lieu": {
    "code": "SALREU032",
    "libelleCourt": "Sully 4",
    "libelleLong": "Sully 4, Palais Bourbon"
  },
  "cycleDeVie": {
    "etat": "Confirmé",
    "chrono": {
      "creation": "2018-07-04T20:12:57.000+02:00",
      "cloture": null
    }
  },
  "demandeurs": {
    "acteur": {
      "nom": "M. Romain GRAU",
      "acteurRef": "PA720790"
    }
  },
  "organeReuniRef": null,
  "typeReunion": "DEP"
}