{
  "@xmlns": "http://schemas.assemblee-nationale.fr/referentiel",
  "@xmlns:xsi": "http://www.w3.org/2001/XMLSchema-instance",
  "@xsi:type": "reunionInitParlementaire_type",
  "uid": "RUANR5L15S2018IDF0107270",
  "timeStampDebut": "2018-04-19T08:30:00.000+02:00",
  "timeStampFin": "2018-04-19T13:00:00.000+02:00",
  "lieu": {
    "code": "SALREU006",
    "libelleCourt": "3ème Bureau",
    "libelleLong": "3ème Bureau, Palais Bourbon"
  },
  "cycleDeVie": {
    "etat": "Confirmé",
    "chrono": {
      "creation": "2018-03-09T009:32.000+02:00",
      "cloture": null
    }
  },
  "demandeurs": {
    "acteur": [
      {
        "nom": "Mme Sandrine MÖRCH",
        "acteurRef": "PA719456"
      },
      {
        "nom": "Mme Michèle VICTORY",
        "acteurRef": "PA340357"
      }
    ]
  },
  "organeReuniRef": null,
  "typeReunion": "DEP"
}