{
  "@xmlns": "http://schemas.assemblee-nationale.fr/referentiel",
  "@xmlns:xsi": "http://www.w3.org/2001/XMLSchema-instance",
  "@xsi:type": "reunionCommission_type",
  "uid": "RUANR5L15S2018IDC428206",
  "timeStampDebut": "2018-01-23T09:00:00.000+01:00",
  "timeStampFin": "2018-01-23T10:00:00.000+01:00",
  "lieu": {
    "libelleLong": "salle 6350 (Finances)"
  },
  "cycleDeVie": {
    "etat": "Confirmé",
    "chrono": {
      "creation": "2018-01-10T00:00:00.000+01:00",
      "cloture": null
    }
  },
  "organeReuniRef": "PO738944",
  "demandeur": null,
  "participants": {
    "participantsInternes": {
      "participantInterne": [
        {
          "acteurRef": "PA606507",
          "presence": "absent"
        },
        {
          "acteurRef": "PA721608",
          "presence": "absent"
        },
        {
          "acteurRef": "PA720298",
          "presence": "présent"
        },
        {
          "acteurRef": "PA721202",
          "presence": "absent"
        },
        {
          "acteurRef": "PA942",
          "presence": "présent"
        },
        {
          "acteurRef": "PA332523",
          "presence": "absent"
        },
        {
          "acteurRef": "PA267440",
          "presence": "présent"
        },
        {
          "acteurRef": "PA267336",
          "presence": "excusé"
        },
        {
          "acteurRef": "PA722054",
          "presence": "absent"
        },
        {
          "acteurRef": "PA719994",
          "presence": "absent"
        },
        {
          "acteurRef": "PA719798",
          "presence": "présent"
        },
        {
          "acteurRef": "PA608016",
          "presence": "absent"
        },
        {
          "acteurRef": "PA720908",
          "presence": "absent"
        },
        {
          "acteurRef": "PA718736",
          "presence": "présent"
        },
        {
          "acteurRef": "PA722398",
          "presence": "absent"
        },
        {
          "acteurRef": "PA720692",
          "presence": "absent"
        },
        {
          "acteurRef": "PA721314",
          "presence": "absent"
        },
        {
          "acteurRef": "PA608695",
          "presence": "absent"
        },
        {
          "acteurRef": "PA722260",
          "presence": "absent"
        }
      ]
    },
    "personnesAuditionnees": null
  },
  "sessionRef": null,
  "ouverturePresse": "true",
  "captationVideo": "false",
  "ODJ": {
    "convocationODJ": {
      "item": "–  Table ronde réunissant Mme Isabelle GORCE, présidente du tribunal de grande instance de Marseille, M. Jean-Michel HAYAT, président du tribunal de grande instance de Paris et M. Ollivier JOULIN, président du tribunal de grande instance de Rennes."
    },
    "resumeODJ": {
      "item": "table ronde réunissant Mme Isabelle Gorce, présidente du tribunal de grande instance de Marseille, M. Jean-Michel Hayat, président du tribunal de grande instance de Paris et M. Ollivier Joulinj, président du tribunal de grande instance de Rennes."
    },
    "pointsODJ": null
  },
  "compteRenduRef": null,
  "formatReunion": "Ordinaire",
  "infosReunionsInternationale": {
    "estReunionInternationale": "false",
    "listePays": null,
    "informationsComplementaires": null
  }
}