{
  "@xmlns": "http://schemas.assemblee-nationale.fr/referentiel",
  "@xmlns:xsi": "http://www.w3.org/2001/XMLSchema-instance",
  "@xsi:type": "reunionInitParlementaire_type",
  "uid": "RUANR5L15S2019IDF0127991",
  "timeStampDebut": "2019-03-19T16:30:00.000+01:00",
  "timeStampFin": "2019-03-19T17:30:00.000+01:00",
  "lieu": {
    "code": "SALREU029",
    "libelleCourt": "Salon Mars III",
    "libelleLong": "Salon Mars III, 101, rue de l'Université"
  },
  "cycleDeVie": {
    "etat": "Annulé",
    "chrono": {
      "creation": "2019-02-19T17:23:28.000+01:00",
      "cloture": "2019-03-05T11:31:41.000+01:00"
    }
  },
  "demandeurs": {
    "acteur": {
      "nom": "Mme Laurence MAILLART-MÉHAIGNERIE",
      "acteurRef": "PA719718"
    }
  },
  "organeReuniRef": null,
  "typeReunion": "DEP"
}