{
  "@xmlns": "http://schemas.assemblee-nationale.fr/referentiel",
  "@xmlns:xsi": "http://www.w3.org/2001/XMLSchema-instance",
  "@xsi:type": "reunionInitParlementaire_type",
  "uid": "RUANR5L15S2019IDF0127221",
  "timeStampDebut": "2019-02-25T14:00:00.000+01:00",
  "timeStampFin": "2019-02-25T17:00:00.000+01:00",
  "lieu": {
    "code": "SALREU039",
    "libelleCourt": "Salle 6550",
    "libelleLong": "Salle 6550, Palais Bourbon"
  },
  "cycleDeVie": {
    "etat": "Confirmé",
    "chrono": {
      "creation": "2019-02-08T15:01:59.000+01:00",
      "cloture": null
    }
  },
  "demandeurs": {
    "acteur": [
      {
        "nom": "M. Thomas MESNIER",
        "acteurRef": "PA719072"
      },
      {
        "nom": "Mme Stéphanie RIST",
        "acteurRef": "PA720066"
      }
    ]
  },
  "organeReuniRef": null,
  "typeReunion": "DEP"
}