{
  "@xmlns": "http://schemas.assemblee-nationale.fr/referentiel",
  "@xmlns:xsi": "http://www.w3.org/2001/XMLSchema-instance",
  "@xsi:type": "reunionInitParlementaire_type",
  "uid": "RUANR5L15S2020IDF0141489",
  "timeStampDebut": "2019-10-10T14:30:00.000+02:00",
  "timeStampFin": "2019-10-10T15:30:00.000+02:00",
  "lieu": {
    "code": "SALREU045",
    "libelleCourt": "Sully 3",
    "libelleLong": "Sully 3, Palais Bourbon"
  },
  "cycleDeVie": {
    "etat": "Annulé",
    "chrono": {
      "creation": "2019-10-04T10:37:18.000+02:00",
      "cloture": "2019-10-07T13:40:49.000+02:00"
    }
  },
  "demandeurs": {
    "acteur": {
      "nom": "M. Jean-François ELIAOU",
      "acteurRef": "PA719692"
    }
  },
  "organeReuniRef": null,
  "typeReunion": "DEP"
}