{
  "@xmlns": "http://schemas.assemblee-nationale.fr/referentiel",
  "@xmlns:xsi": "http://www.w3.org/2001/XMLSchema-instance",
  "@xsi:type": "reunionCommission_type",
  "uid": "RUANR5L15S2019IDC432065",
  "timeStampDebut": "2019-03-28T09:00:00.000+01:00",
  "lieu": {
    "libelleLong": "salle 6241 (Affaires économiques)"
  },
  "cycleDeVie": {
    "etat": "Confirmé",
    "chrono": {
      "creation": "2019-03-22T00:00:00.000+01:00",
      "cloture": null
    }
  },
  "organeReuniRef": "PO762272",
  "demandeur": null,
  "participants": {
    "participantsInternes": null,
    "personnesAuditionnees": null
  },
  "sessionRef": null,
  "ouverturePresse": "false",
  "captationVideo": "false",
  "ODJ": {
    "convocationODJ": {
      "item": "-\tTable ronde sur l’organisation et la mise en œuvre territoriale de la compétence « tourisme » en présence de :        - M.  Philippe Sueur, président de l’Association nationale des élus des territoires touristiques (ANETT) et maire d’Enghien-les-Bains, Mme Géraldine Leduc, directrice générale et de M. Simon Lebeau, chargé de mission,        - M. Philippe Sueur représentera également l’Association des maires de France (AMF). Pour l’AMF seront présentes : Mme Annick Pillevesse, responsable du service juridique, Mme Marion Didier, conseillère technique tourisme et Mme Charlotte de Fontaines, chargée des relations avec le Parlement.        - Mme Frédérique Lardet, vice-présidente de l’Association des élus de montagne (ANEM) et de M. François Bonneville, chargé de mission,        - M. Gérard Ruiz, inspecteur général honoraire de l’environnement, administrateur de l’Association des élus du littoral (ANEL), président de la commission « Coopérations internationales »."
    },
    "resumeODJ": {
      "item": "table ronde sur l’organisation et la mise en œuvre territoriale de la compétence « tourisme »."
    },
    "pointsODJ": null
  },
  "compteRenduRef": null,
  "formatReunion": "Ordinaire",
  "infosReunionsInternationale": {
    "estReunionInternationale": "false",
    "listePays": null,
    "informationsComplementaires": null
  }
}