{
  "@xmlns": "http://schemas.assemblee-nationale.fr/referentiel",
  "@xmlns:xsi": "http://www.w3.org/2001/XMLSchema-instance",
  "@xsi:type": "reunionCommission_type",
  "uid": "RUANR5L15S2018IDC429753",
  "timeStampDebut": "2018-06-11T15:30:00.000+02:00",
  "timeStampFin": "2018-06-11T16:45:00.000+02:00",
  "lieu": {
    "libelleLong": "salle 6350 (Finances)"
  },
  "cycleDeVie": {
    "etat": "Confirmé",
    "chrono": {
      "creation": "2018-06-07T00:00:00.000+02:00",
      "cloture": null
    }
  },
  "organeReuniRef": "PO751879",
  "demandeur": null,
  "participants": {
    "participantsInternes": null,
    "personnesAuditionnees": null
  },
  "sessionRef": null,
  "ouverturePresse": "true",
  "captationVideo": "false",
  "ODJ": {
    "convocationODJ": {
      "item": "– audition commune de la Fédération bancaire française : M. Benoît de la Chapelle Bizot, directeur général délégué, M. Nicolas Bodilis-Reguer, directeur des affaires institutionnelles, et M. Olivier Mittelette, directeur « Banque d’investissement et de marchés », et de BNP Paribas : M. Philippe Denis, responsable du Blockchain Lab de CIB et M. Philippe-Olivier Rousseau, directeur des affaires publiques, et Mme Virginie Vignon-Priam, responsable juridique adjoint technologie de l’information et propriété intellectuelle (IT/IP)"
    },
    "resumeODJ": {
      "item": "audition, ouverte à la presse, commune de la Fédération bancaire française : M. Benoît de la Chapelle Bizot, directeur général délégué, M. Nicolas Bodilis-Reguer, directeur des affaires institutionnelles, et M. Olivier Mittelette, directeur « Banque d’investissement et de marchés », et de BNP Paribas : M. Philippe Denis, responsable du Blockchain Lab de CIB et M. Philippe-Olivier Rousseau, directeur des affaires publiques, et Mme Virginie Vignon-Priam, responsable juridique adjoint technologie de l’information et propriété intellectuelle (IT/IP)."
    },
    "pointsODJ": null
  },
  "compteRenduRef": null,
  "formatReunion": "Ordinaire",
  "infosReunionsInternationale": {
    "estReunionInternationale": "false",
    "listePays": null,
    "informationsComplementaires": null
  }
}