{
  "@xmlns": "http://schemas.assemblee-nationale.fr/referentiel",
  "@xmlns:xsi": "http://www.w3.org/2001/XMLSchema-instance",
  "@xsi:type": "reunionInitParlementaire_type",
  "uid": "RUANR5L15S2019IDF0124224",
  "timeStampDebut": "2019-02-28T10:30:00.000+01:00",
  "timeStampFin": "2019-02-28T12:00:00.000+01:00",
  "lieu": {
    "code": "SALREU011",
    "libelleCourt": "Salle N° 2",
    "libelleLong": "Salle N° 2, 3, rue Aristide Briand"
  },
  "cycleDeVie": {
    "etat": "Annulé",
    "chrono": {
      "creation": "2018-12-20T12:56:09.000+01:00",
      "cloture": "2019-02-22T14:46:28.000+01:00"
    }
  },
  "demandeurs": {
    "acteur": {
      "nom": "M. Stanislas GUERINI",
      "acteurRef": "PA721498"
    }
  },
  "organeReuniRef": null,
  "typeReunion": "DEP"
}