{
  "@xmlns": "http://schemas.assemblee-nationale.fr/referentiel",
  "@xmlns:xsi": "http://www.w3.org/2001/XMLSchema-instance",
  "@xsi:type": "reunionCommission_type",
  "uid": "RUANR5L15S2019IDC431301",
  "timeStampDebut": "2019-02-19T18:00:00.000+01:00",
  "lieu": {
    "libelleLong": "salon Visconti (32 rue Saint-Dominique)"
  },
  "cycleDeVie": {
    "etat": "Confirmé",
    "chrono": {
      "creation": "2019-01-24T00:00:00.000+01:00",
      "cloture": null
    }
  },
  "organeReuniRef": "PO760931",
  "demandeur": null,
  "participants": {
    "participantsInternes": null,
    "personnesAuditionnees": null
  },
  "sessionRef": null,
  "ouverturePresse": "false",
  "captationVideo": "false",
  "ODJ": {
    "convocationODJ": {
      "item": "Audition de Maître Geoffroy de Raincourt, avocat associé chez Fidere Avocats, accompagné de M. Bernard Danthez, ancien directeur des ressources humaines de France Alcatel-Lucent Entreprise, et actuellement consultant en ressources humaines auprès du cabinet Fidere, et de Maître Grégoire de Courson, avocat, collaborateur chez BrL avocats accompagné de Me Jean d’Aleman, avocat, associé au sein du Cabinet BrL avocats."
    },
    "resumeODJ": {
      "item": "Audition de Maître Geoffroy de Raincourt, avocat associé chez Fidere Avocats, accompagné de M. Bernard Danthez, ancien directeur des ressources humaines de France Alcatel-Lucent Entreprise, et actuellement consultant en ressources humaines auprès du cabinet Fidere, et de Maître Grégoire de Courson, avocat, collaborateur chez BrL avocats accompagné de Me Jean d’Aleman, avocat, associé au sein du Cabinet BrL avocats."
    },
    "pointsODJ": null
  },
  "compteRenduRef": null,
  "formatReunion": "Ordinaire",
  "infosReunionsInternationale": {
    "estReunionInternationale": "false",
    "listePays": null,
    "informationsComplementaires": null
  }
}