{
  "@xmlns": "http://schemas.assemblee-nationale.fr/referentiel",
  "@xmlns:xsi": "http://www.w3.org/2001/XMLSchema-instance",
  "@xsi:type": "reunionInitParlementaire_type",
  "uid": "RUANR5L15S2019IDF0121679",
  "timeStampDebut": "2018-11-15T15:00:00.000+01:00",
  "timeStampFin": "2018-11-15T15:30:00.000+01:00",
  "lieu": {
    "code": "SALREU003",
    "libelleCourt": "Salle Victor Hugo",
    "libelleLong": "Salle Victor Hugo, 101, rue de l'Université"
  },
  "cycleDeVie": {
    "etat": "Confirmé",
    "chrono": {
      "creation": "2018-10-31T11:07:47.000+01:00",
      "cloture": null
    }
  },
  "demandeurs": {
    "acteur": {
      "nom": "M. Denis MASSÉGLIA",
      "acteurRef": "PA720146"
    }
  },
  "organeReuniRef": null,
  "typeReunion": "DEP"
}