{
  "@xmlns": "http://schemas.assemblee-nationale.fr/referentiel",
  "@xmlns:xsi": "http://www.w3.org/2001/XMLSchema-instance",
  "@xsi:type": "reunionInitParlementaire_type",
  "uid": "RUANR5L15S2018IDF0111484",
  "timeStampDebut": "2018-06-07T10:00:00.000+02:00",
  "timeStampFin": "2018-06-07T17:00:00.000+02:00",
  "lieu": {
    "code": "SALREU018",
    "libelleCourt": "Salon Mansart",
    "libelleLong": "Salon Mansart, 101, rue de l'Université"
  },
  "cycleDeVie": {
    "etat": "Annulé",
    "chrono": {
      "creation": "2018-05-15T12:09:33.000+02:00",
      "cloture": "2018-05-18T14:58:53.000+02:00"
    }
  },
  "demandeurs": {
    "acteur": {
      "nom": "M. Yves JÉGO",
      "acteurRef": "PA267801"
    }
  },
  "organeReuniRef": null,
  "typeReunion": "DEP"
}