{
  "@xmlns": "http://schemas.assemblee-nationale.fr/referentiel",
  "@xmlns:xsi": "http://www.w3.org/2001/XMLSchema-instance",
  "@xsi:type": "reunionCommission_type",
  "uid": "RUANR5L15S2017IDC427075",
  "timeStampDebut": "2017-07-07T09:30:00.000+02:00",
  "lieu": {
    "libelleLong": "salle 6351 (Affaires sociales)"
  },
  "cycleDeVie": {
    "etat": "Annulé",
    "chrono": {
      "creation": "2017-06-30T00:00:00.000+02:00",
      "cloture": "2017-07-06T00:00:00.000+02:00"
    }
  },
  "organeReuniRef": "PO420120",
  "demandeur": null,
  "participants": {
    "participantsInternes": null,
    "personnesAuditionnees": null
  },
  "sessionRef": null,
  "ouverturePresse": "true",
  "captationVideo": "false",
  "ODJ": {
    "convocationODJ": {
      "item": "Suite de l'examen des articles du projet de loi d'habilitation à prendre par ordonnances les mesures pour le renforcement du dialogue social (n° 4)"
    },
    "resumeODJ": {
      "item": "renforcement du dialogue social  (n°4) (première lecture) (rapport) (éventuellement)."
    },
    "pointsODJ": {
      "pointODJ": {
        "@xsi:type": "podjReunion_type",
        "uid": "RUANR5L15S2017IDC427075PT24849",
        "cycleDeVie": {
          "etat": "Annulé",
          "chrono": {
            "creation": "2017-06-30T00:00:00.000+02:00",
            "cloture": "2017-07-06T00:00:00.000+02:00"
          }
        },
        "objet": "Examen du texte",
        "demandeurPoint": null,
        "procedure": null,
        "dossiersLegislatifsRefs": null,
        "typePointODJ": "Examen",
        "comiteSecret": "false",
        "textesAssocies": null
      }
    }
  },
  "compteRenduRef": null,
  "formatReunion": "Ordinaire",
  "infosReunionsInternationale": {
    "estReunionInternationale": "false",
    "listePays": null,
    "informationsComplementaires": null
  }
}