{
  "@xmlns": "http://schemas.assemblee-nationale.fr/referentiel",
  "@xmlns:xsi": "http://www.w3.org/2001/XMLSchema-instance",
  "@xsi:type": "reunionInitParlementaire_type",
  "uid": "RUANR5L15S2018IDF0118863",
  "timeStampDebut": "2018-09-26T14:00:00.000+02:00",
  "timeStampFin": "2018-09-26T18:00:00.000+02:00",
  "lieu": {
    "code": "SALREU011",
    "libelleCourt": "Salle N° 2",
    "libelleLong": "Salle N° 2, 3, rue Aristide Briand"
  },
  "cycleDeVie": {
    "etat": "Annulé",
    "chrono": {
      "creation": "2018-09-18T19:35:49.000+02:00",
      "cloture": "2018-09-25T15:56:57.000+02:00"
    }
  },
  "demandeurs": {
    "acteur": {
      "nom": "Mme Marine LE PEN",
      "acteurRef": "PA720614"
    }
  },
  "organeReuniRef": null,
  "typeReunion": "DEP"
}