{
  "@xmlns": "http://schemas.assemblee-nationale.fr/referentiel",
  "@xmlns:xsi": "http://www.w3.org/2001/XMLSchema-instance",
  "@xsi:type": "reunionCommission_type",
  "uid": "RUANR5L15S2018IDC428104",
  "timeStampDebut": "2018-02-06T16:15:00.000+01:00",
  "lieu": {
    "libelleLong": "salle 4013 (33 rue Saint-Dominique)"
  },
  "cycleDeVie": {
    "etat": "Confirmé",
    "chrono": {
      "creation": "2017-12-08T00:00:00.000+01:00",
      "cloture": null
    }
  },
  "organeReuniRef": "PO743823",
  "demandeur": null,
  "participants": {
    "participantsInternes": null,
    "personnesAuditionnees": null
  },
  "sessionRef": null,
  "ouverturePresse": "false",
  "captationVideo": "false",
  "ODJ": {
    "convocationODJ": {
      "item": "Direction générale des systèmes d’information et de communication du ministère des Armées (DGSIC) :– Audition du Vice-amiral d'escadre Arnaud Coustillière, directeur général."
    },
    "resumeODJ": {
      "item": [
        "Direction générale des systèmes d’information et de communication du ministère des Armées (DGSIC) :",
        "audition du vice-amiral d'escadre Arnaud Coustillière, directeur général."
      ]
    },
    "pointsODJ": null
  },
  "compteRenduRef": null,
  "formatReunion": "Ordinaire",
  "infosReunionsInternationale": {
    "estReunionInternationale": "false",
    "listePays": null,
    "informationsComplementaires": null
  }
}