{
  "@xmlns": "http://schemas.assemblee-nationale.fr/referentiel",
  "@xmlns:xsi": "http://www.w3.org/2001/XMLSchema-instance",
  "@xsi:type": "reunionInitParlementaire_type",
  "uid": "RUANR5L15S2019IDF0122813",
  "timeStampDebut": "2018-12-06T09:30:00.000+01:00",
  "timeStampFin": "2018-12-06T10:30:00.000+01:00",
  "lieu": {
    "code": "SALREU038",
    "libelleCourt": "Salle 6549",
    "libelleLong": "Salle 6549, Palais Bourbon"
  },
  "cycleDeVie": {
    "etat": "Confirmé",
    "chrono": {
      "creation": "2018-11-22T09:28:04.000+01:00",
      "cloture": null
    }
  },
  "demandeurs": {
    "acteur": [
      {
        "nom": "M. Maxime MINOT",
        "acteurRef": "PA720630"
      },
      {
        "nom": "M. Bertrand SORRE",
        "acteurRef": "PA720190"
      }
    ]
  },
  "organeReuniRef": null,
  "typeReunion": "DEP"
}