{
  "@xmlns": "http://schemas.assemblee-nationale.fr/referentiel",
  "@xmlns:xsi": "http://www.w3.org/2001/XMLSchema-instance",
  "@xsi:type": "reunionCommission_type",
  "uid": "RUANR5L15S2018IDC429090",
  "timeStampDebut": "2018-04-12T14:00:00.000+02:00",
  "timeStampFin": "2018-04-12T17:35:00.000+02:00",
  "lieu": {
    "libelleLong": "salle 6350"
  },
  "cycleDeVie": {
    "etat": "Confirmé",
    "chrono": {
      "creation": "2018-04-05T00:00:00.000+02:00",
      "cloture": null
    }
  },
  "organeReuniRef": "PO746398",
  "demandeur": null,
  "participants": {
    "participantsInternes": {
      "participantInterne": [
        {
          "acteurRef": "PA718954",
          "presence": "absent"
        },
        {
          "acteurRef": "PA605963",
          "presence": "présent"
        },
        {
          "acteurRef": "PA721836",
          "presence": "absent"
        },
        {
          "acteurRef": "PA267233",
          "presence": "présent"
        },
        {
          "acteurRef": "PA721202",
          "presence": "absent"
        },
        {
          "acteurRef": "PA923",
          "presence": "absent"
        },
        {
          "acteurRef": "PA267450",
          "presence": "absent"
        },
        {
          "acteurRef": "PA718720",
          "presence": "absent"
        },
        {
          "acteurRef": "PA267336",
          "presence": "absent"
        },
        {
          "acteurRef": "PA720560",
          "presence": "absent"
        },
        {
          "acteurRef": "PA722054",
          "presence": "absent"
        },
        {
          "acteurRef": "PA718794",
          "presence": "absent"
        },
        {
          "acteurRef": "PA608416",
          "presence": "absent"
        },
        {
          "acteurRef": "PA719778",
          "presence": "absent"
        },
        {
          "acteurRef": "PA720230",
          "presence": "absent"
        },
        {
          "acteurRef": "PA721670",
          "presence": "absent"
        },
        {
          "acteurRef": "PA721636",
          "presence": "absent"
        },
        {
          "acteurRef": "PA718736",
          "presence": "présent"
        },
        {
          "acteurRef": "PA609590",
          "presence": "absent"
        },
        {
          "acteurRef": "PA719592",
          "presence": "absent"
        },
        {
          "acteurRef": "PA2960",
          "presence": "absent"
        }
      ]
    },
    "personnesAuditionnees": null
  },
  "sessionRef": null,
  "ouverturePresse": "true",
  "captationVideo": "false",
  "ODJ": {
    "convocationODJ": {
      "item": "Auditions, ouvertes à la presse, de la Mission d’évaluation et de contrôle sur l’orientation de l’investissement privé dans la transition écologique (Mme Bénédicte PEYROL et M. Christophe BOUILLON, rapporteurs).À 14 heures- Audition commune de membres des groupes d’experts établis par la commission européenne et le comité de stabilité financière du G7 : Mme Anne-CatherineHUSSON-TRAORE, directrice générale de Novethic, M. Pascal CANFIN, directeur général de WWF France, M. Pierre DUCRET, président de l’association européenne des investisseurs de long terme – conseiller climat du groupe Caisse des dépôts, et M. Éric DUGELAY, associé de Deloitte et responsable des activités en développement durable ;À 15 heures- Audition de l’Agence de l’environnement et de la maîtrise de l’énergie (ADEME) :Mme Fantine LEFÈVRE, directrice des investissements d’avenir et Mme Marie-Christine PRÉMARTIN, directrice exécutive des programmes ;À 16 heures- Audition de représentants du Ministère de la transition écologique et solidaire : Commissariat général au développement durable (CGDD), Direction générale de l’énergie et du climat (DGEC), Direction générale de l’Aménagement du logement et de la nature (DGALN) et Comité pour l’économie verte (CEV)."
    },
    "resumeODJ": {
      "item": [
        "auditions, ouvertes à la presse, de la Mission d’évaluation et de contrôle sur l’orientation de l’investissement privé dans la transition écologique (Mme Bénédicte Peyrol et M. Christophe Bouillon, rapporteurs) :",
        "à 14 heures : audition commune de membres des groupes d’experts établis par la commission européenne et le comité de stabilité financière du G7 : Mme Anne-Catherine Husson-Traore, directrice générale de Novethic, M. Pascal Canfin, directeur général de WWF France, M. Pierre Ducret, président de l’association européenne des investisseurs de long terme – conseiller climat du groupe Caisse des dépôts, et M. Éric Dugelay, associé de Deloitte et responsable des activités en développement durable ;",
        "à 15 heures : audition de l’Agence de l’environnement et de la maîtrise de l’énergie (ADEME) :Mme Fantine Lefèvre, directrice des investissements d’avenir et Mme Marie-Christine Prémartin, directrice exécutive des programmes ;",
        "à 16 heures : audition de représentants du Ministère de la transition écologique et solidaire : Commissariat général au développement durable (CGDD), Direction générale de l’énergie et du climat (DGEC), Direction générale de l’Aménagement du logement et de la nature (DGALN) et Comité pour l’économie verte (CEV)."
      ]
    },
    "pointsODJ": null
  },
  "compteRenduRef": null,
  "formatReunion": "Ordinaire",
  "infosReunionsInternationale": {
    "estReunionInternationale": "false",
    "listePays": null,
    "informationsComplementaires": null
  }
}