{
  "@xmlns": "http://schemas.assemblee-nationale.fr/referentiel",
  "@xmlns:xsi": "http://www.w3.org/2001/XMLSchema-instance",
  "@xsi:type": "reunionCommission_type",
  "uid": "RUANR5L15S2018IDC428216",
  "timeStampDebut": "2018-01-24T17:10:00.000+01:00",
  "timeStampFin": "2018-01-24T18:55:00.000+01:00",
  "lieu": {
    "libelleLong": "salle 4123 (33 rue Saint-Dominique)"
  },
  "cycleDeVie": {
    "etat": "Confirmé",
    "chrono": {
      "creation": "2018-01-10T00:00:00.000+01:00",
      "cloture": null
    }
  },
  "organeReuniRef": "PO201269",
  "demandeur": null,
  "participants": {
    "participantsInternes": {
      "participantInterne": [
        {
          "acteurRef": "PA719318",
          "presence": "présent"
        },
        {
          "acteurRef": "PA719806",
          "presence": "excusé"
        },
        {
          "acteurRef": "PA719558",
          "presence": "absent"
        },
        {
          "acteurRef": "PA342415",
          "presence": "absent"
        },
        {
          "acteurRef": "PA720210",
          "presence": "absent"
        },
        {
          "acteurRef": "PA441",
          "presence": "absent"
        },
        {
          "acteurRef": "PA330684",
          "presence": "absent"
        },
        {
          "acteurRef": "PA719496",
          "presence": "absent"
        },
        {
          "acteurRef": "PA721750",
          "presence": "présent"
        },
        {
          "acteurRef": "PA429893",
          "presence": "absent"
        },
        {
          "acteurRef": "PA719448",
          "presence": "absent"
        },
        {
          "acteurRef": "PA719624",
          "presence": "absent"
        },
        {
          "acteurRef": "PA608826",
          "presence": "absent"
        },
        {
          "acteurRef": "PA721742",
          "presence": "présent"
        },
        {
          "acteurRef": "PA721384",
          "presence": "absent"
        },
        {
          "acteurRef": "PA720806",
          "presence": "absent"
        },
        {
          "acteurRef": "PA605991",
          "presence": "excusé"
        },
        {
          "acteurRef": "PA721296",
          "presence": "absent"
        },
        {
          "acteurRef": "PA722054",
          "presence": "absent"
        },
        {
          "acteurRef": "PA267801",
          "presence": "absent"
        },
        {
          "acteurRef": "PA720202",
          "presence": "absent"
        },
        {
          "acteurRef": "PA719842",
          "presence": "absent"
        },
        {
          "acteurRef": "PA720916",
          "presence": "absent"
        },
        {
          "acteurRef": "PA720342",
          "presence": "excusé"
        },
        {
          "acteurRef": "PA334116",
          "presence": "absent"
        },
        {
          "acteurRef": "PA721656",
          "presence": "absent"
        },
        {
          "acteurRef": "PA719520",
          "presence": "absent"
        },
        {
          "acteurRef": "PA719632",
          "presence": "absent"
        },
        {
          "acteurRef": "PA718736",
          "presence": "absent"
        },
        {
          "acteurRef": "PA720720",
          "presence": "absent"
        },
        {
          "acteurRef": "PA720552",
          "presence": "absent"
        },
        {
          "acteurRef": "PA722252",
          "presence": "présent"
        },
        {
          "acteurRef": "PA722022",
          "presence": "absent"
        },
        {
          "acteurRef": "PA718860",
          "presence": "absent"
        },
        {
          "acteurRef": "PA718780",
          "presence": "absent"
        },
        {
          "acteurRef": "PA721474",
          "presence": "présent"
        }
      ]
    },
    "personnesAuditionnees": null
  },
  "sessionRef": null,
  "ouverturePresse": "true",
  "captationVideo": "false",
  "ODJ": {
    "convocationODJ": {
      "item": "Audition, ouverte à la presse, sur les femmes et les sciences, de :- Mme Sylvaine Turck-Chieze, présidente de l’association « Femmes et sciences » ;- Mme Claudine Hermman, présidente de la Plateforme européenne des femmes scientifiques (EPWS) ;- Mme Dipty Chander, présidente de l’association E-mma France, Technical account manager, Microsoft France ;- Mme Aurélie Jean, développeur  informatique à Bloomberg."
    },
    "resumeODJ": {
      "item": [
        "audition, ouverte à la presse, sur les femmes et les sciences, de :",
        "Mme Sylvaine Turck-Chieze, présidente de l’association « Femmes et sciences » ;",
        "Mme Claudine Hermman, présidente de la Plateforme européenne des femmes scientifiques (EPWS) ;",
        "Mme Dipty Chander, présidente de l’association E-mma France, Technical account manager, Microsoft France ;",
        "Mme Aurélie Jean, développeur  informatique à Bloomberg."
      ]
    },
    "pointsODJ": null
  },
  "compteRenduRef": "CRCANR5L15S2018PO201269N015",
  "formatReunion": "Ordinaire",
  "infosReunionsInternationale": {
    "estReunionInternationale": "false",
    "listePays": null,
    "informationsComplementaires": null
  }
}