{
  "@xmlns": "http://schemas.assemblee-nationale.fr/referentiel",
  "@xmlns:xsi": "http://www.w3.org/2001/XMLSchema-instance",
  "@xsi:type": "reunionInitParlementaire_type",
  "uid": "RUANR5L15S2019IDF0129844",
  "timeStampDebut": "2019-03-19T16:00:00.000+01:00",
  "timeStampFin": "2019-03-19T17:00:00.000+01:00",
  "lieu": {
    "code": "SALREU007",
    "libelleCourt": "4ème Bureau",
    "libelleLong": "4ème Bureau, Palais Bourbon"
  },
  "cycleDeVie": {
    "etat": "Confirmé",
    "chrono": {
      "creation": "2019-03-13T0016:10.000+01:00",
      "cloture": null
    }
  },
  "demandeurs": {
    "acteur": {
      "nom": "Mme Émilie CARIOU",
      "acteurRef": "PA720298"
    }
  },
  "organeReuniRef": null,
  "typeReunion": "DEP"
}