{
  "@xmlns": "http://schemas.assemblee-nationale.fr/referentiel",
  "@xmlns:xsi": "http://www.w3.org/2001/XMLSchema-instance",
  "@xsi:type": "reunionInitParlementaire_type",
  "uid": "RUANR5L15S2019IDF0119587",
  "timeStampDebut": "2018-10-02T18:30:00.000+02:00",
  "timeStampFin": "2018-10-02T20:00:00.000+02:00",
  "lieu": {
    "code": "SALREU042",
    "libelleCourt": "Salle 6566",
    "libelleLong": "Salle 6566, Palais Bourbon"
  },
  "cycleDeVie": {
    "etat": "Confirmé",
    "chrono": {
      "creation": "2018-09-27T15:15:47.000+02:00",
      "cloture": null
    }
  },
  "demandeurs": {
    "acteur": {
      "nom": "M. Saïd AHAMADA",
      "acteurRef": "PA718954"
    }
  },
  "organeReuniRef": null,
  "typeReunion": "DEP"
}