{
  "@xmlns": "http://schemas.assemblee-nationale.fr/referentiel",
  "@xmlns:xsi": "http://www.w3.org/2001/XMLSchema-instance",
  "@xsi:type": "reunionInitParlementaire_type",
  "uid": "RUANR5L15S2020IDF0140883",
  "timeStampDebut": "2019-12-18T10:00:00.000+01:00",
  "timeStampFin": "2019-12-18T18:00:00.000+01:00",
  "lieu": {
    "code": "SALREU029",
    "libelleCourt": "Salon Mars III",
    "libelleLong": "Salon Mars III, 101, rue de l'Université"
  },
  "cycleDeVie": {
    "etat": "Confirmé",
    "chrono": {
      "creation": "2019-09-25T15:54:03.000+01:00",
      "cloture": null
    }
  },
  "demandeurs": {
    "acteur": {
      "nom": "Mme Danièle OBONO",
      "acteurRef": "PA721960"
    }
  },
  "organeReuniRef": null,
  "typeReunion": "DEP"
}