{
  "@xmlns": "http://schemas.assemblee-nationale.fr/referentiel",
  "@xmlns:xsi": "http://www.w3.org/2001/XMLSchema-instance",
  "@xsi:type": "reunionInitParlementaire_type",
  "uid": "RUANR5L15S2019IDFL431005",
  "timeStampDebut": "2018-11-13T12:00:00.000+01:00",
  "lieu": {
    "libelleLong": "Salle 6822 (Palais-Bourbon, 3e étage)"
  },
  "cycleDeVie": {
    "etat": "Confirmé",
    "chrono": {
      "creation": "2018-12-04T00:00:00.000+01:00",
      "cloture": null
    }
  },
  "organeReuniRef": "PO747072",
  "typeReunion": "GE",
  "demandeur": null,
  "participants": null,
  "ODJ": {
    "convocationODJ": {
      "item": "Réunion du bureau du groupe d'études"
    },
    "resumeODJ": null
  }
}