{
  "@xmlns": "http://schemas.assemblee-nationale.fr/referentiel",
  "@xmlns:xsi": "http://www.w3.org/2001/XMLSchema-instance",
  "@xsi:type": "reunionCommission_type",
  "uid": "RUANR5L15S2019IDC433030",
  "timeStampDebut": "2019-06-18T14:00:00.000+02:00",
  "lieu": {
    "libelleLong": "salle 7426"
  },
  "cycleDeVie": {
    "etat": "Confirmé",
    "chrono": {
      "creation": "2019-06-07T00:00:00.000+02:00",
      "cloture": null
    }
  },
  "organeReuniRef": "PO734671",
  "demandeur": null,
  "participants": {
    "participantsInternes": {
      "participantInterne": [
        {
          "acteurRef": "PA608292",
          "presence": "présent"
        },
        {
          "acteurRef": "PA332614",
          "presence": "présent"
        },
        {
          "acteurRef": "PA718868",
          "presence": "présent"
        },
        {
          "acteurRef": "PA606712",
          "presence": "absent"
        },
        {
          "acteurRef": "PA334116",
          "presence": "absent"
        },
        {
          "acteurRef": "PA720728",
          "presence": "présent"
        },
        {
          "acteurRef": "PA721270",
          "presence": "absent"
        },
        {
          "acteurRef": "PA718910",
          "presence": "présent"
        },
        {
          "acteurRef": "PA2792",
          "presence": "absent"
        },
        {
          "acteurRef": "PA720394",
          "presence": "excusé"
        }
      ]
    },
    "personnesAuditionnees": null
  },
  "sessionRef": null,
  "ouverturePresse": "false",
  "captationVideo": "false",
  "ODJ": {
    "convocationODJ": {
      "item": "Présentation et discussion du projet de rapport du groupe de travail"
    },
    "resumeODJ": {
      "item": "présentation et discussion du projet de rapport du groupe de travail."
    },
    "pointsODJ": null
  },
  "compteRenduRef": null,
  "formatReunion": "Ordinaire",
  "infosReunionsInternationale": {
    "estReunionInternationale": "false",
    "listePays": null,
    "informationsComplementaires": null
  }
}