{
  "@xmlns": "http://schemas.assemblee-nationale.fr/referentiel",
  "@xmlns:xsi": "http://www.w3.org/2001/XMLSchema-instance",
  "@xsi:type": "reunionInitParlementaire_type",
  "uid": "RUANR5L15S2018IDF0101987",
  "timeStampDebut": "2018-06-11T08:00:00.000+02:00",
  "timeStampFin": "2018-06-11T20:00:00.000+02:00",
  "lieu": {
    "code": "SALREU003",
    "libelleCourt": "Salle Victor Hugo",
    "libelleLong": "Salle Victor Hugo, 101, rue de l'Université"
  },
  "cycleDeVie": {
    "etat": "Annulé",
    "chrono": {
      "creation": "2017-12-06T17:32:43.000+02:00",
      "cloture": "2018-06-07T17:44:28.000+02:00"
    }
  },
  "demandeurs": {
    "acteur": {
      "nom": "M. Daniel FASQUELLE",
      "acteurRef": "PA334149"
    }
  },
  "organeReuniRef": null,
  "typeReunion": "DEP"
}