{
  "@xmlns": "http://schemas.assemblee-nationale.fr/referentiel",
  "@xmlns:xsi": "http://www.w3.org/2001/XMLSchema-instance",
  "@xsi:type": "reunionInitParlementaire_type",
  "uid": "RUANR5L15S2019IDF0127517",
  "timeStampDebut": "2019-06-05T17:00:00.000+02:00",
  "timeStampFin": "2019-06-05T21:00:00.000+02:00",
  "lieu": {
    "code": "SALREU028",
    "libelleCourt": "Salle Colbert",
    "libelleLong": "Salle Colbert , Palais Bourbon"
  },
  "cycleDeVie": {
    "etat": "Annulé",
    "chrono": {
      "creation": "2019-02-13T14:39:04.000+02:00",
      "cloture": "2019-03-13T15:12:35.000+02:00"
    }
  },
  "demandeurs": {
    "acteur": {
      "nom": "M. Bruno STUDER",
      "acteurRef": "PA720754"
    }
  },
  "organeReuniRef": null,
  "typeReunion": "DEP"
}