{
  "@xmlns": "http://schemas.assemblee-nationale.fr/referentiel",
  "@xmlns:xsi": "http://www.w3.org/2001/XMLSchema-instance",
  "@xsi:type": "reunionInitParlementaire_type",
  "uid": "RUANR5L15S2019IDF0105256",
  "timeStampDebut": "2018-12-01T09:00:00.000+01:00",
  "timeStampFin": "2018-12-01T17:00:00.000+01:00",
  "lieu": {
    "code": "SALREU028",
    "libelleCourt": "Salle Colbert",
    "libelleLong": "Salle Colbert , Palais Bourbon"
  },
  "cycleDeVie": {
    "etat": "Annulé",
    "chrono": {
      "creation": "2018-02-07T09:47:04.000+01:00",
      "cloture": "2018-02-07T09:49:36.000+01:00"
    }
  },
  "demandeurs": {
    "acteur": {
      "nom": "M. Sébastien NADOT",
      "acteurRef": "PA719464"
    }
  },
  "organeReuniRef": null,
  "typeReunion": "DEP"
}