{
  "@xmlns": "http://schemas.assemblee-nationale.fr/referentiel",
  "@xmlns:xsi": "http://www.w3.org/2001/XMLSchema-instance",
  "@xsi:type": "reunionCommission_type",
  "uid": "RUANR5L15S2018IDC427708",
  "timeStampDebut": "2017-11-09T10:00:00.000+01:00",
  "timeStampFin": "2017-11-09T11:00:00.000+01:00",
  "lieu": {
    "libelleLong": "6e Bureau"
  },
  "cycleDeVie": {
    "etat": "Confirmé",
    "chrono": {
      "creation": "2017-11-02T00:00:00.000+01:00",
      "cloture": null
    }
  },
  "organeReuniRef": "PO740454",
  "demandeur": null,
  "participants": {
    "participantsInternes": {
      "participantInterne": [
        {
          "acteurRef": "PA719318",
          "presence": "présent"
        },
        {
          "acteurRef": "PA335999",
          "presence": "présent"
        },
        {
          "acteurRef": "PA719488",
          "presence": "présent"
        },
        {
          "acteurRef": "PA720162",
          "presence": "présent"
        },
        {
          "acteurRef": "PA719740",
          "presence": "présent"
        },
        {
          "acteurRef": "PA719258",
          "presence": "présent"
        },
        {
          "acteurRef": "PA267355",
          "presence": "excusé"
        },
        {
          "acteurRef": "PA719230",
          "presence": "présent"
        },
        {
          "acteurRef": "PA340853",
          "presence": "excusé"
        },
        {
          "acteurRef": "PA719412",
          "presence": "présent"
        },
        {
          "acteurRef": "PA719154",
          "presence": "présent"
        },
        {
          "acteurRef": "PA2155",
          "presence": "présent"
        },
        {
          "acteurRef": "PA719456",
          "presence": "présent"
        },
        {
          "acteurRef": "PA719242",
          "presence": "présent"
        },
        {
          "acteurRef": "PA720278",
          "presence": "présent"
        },
        {
          "acteurRef": "PA720892",
          "presence": "absent"
        },
        {
          "acteurRef": "PA2377",
          "presence": "présent"
        },
        {
          "acteurRef": "PA718930",
          "presence": "présent"
        },
        {
          "acteurRef": "PA719350",
          "presence": "présent"
        },
        {
          "acteurRef": "PA719540",
          "presence": "présent"
        },
        {
          "acteurRef": "PA722268",
          "presence": "absent"
        },
        {
          "acteurRef": "PA722110",
          "presence": "présent"
        }
      ]
    },
    "personnesAuditionnees": null
  },
  "sessionRef": null,
  "ouverturePresse": "false",
  "captationVideo": "false",
  "ODJ": {
    "convocationODJ": {
      "item": "– Réunion des membres de la mission"
    },
    "resumeODJ": {
      "item": "réunion des membres de la mission."
    },
    "pointsODJ": null
  },
  "compteRenduRef": null,
  "formatReunion": "Ordinaire",
  "infosReunionsInternationale": {
    "estReunionInternationale": "false",
    "listePays": null,
    "informationsComplementaires": null
  }
}