{
  "@xmlns": "http://schemas.assemblee-nationale.fr/referentiel",
  "@xmlns:xsi": "http://www.w3.org/2001/XMLSchema-instance",
  "@xsi:type": "reunionInitParlementaire_type",
  "uid": "RUANR5L15S2018IDF0098126",
  "timeStampDebut": "2017-10-16T14:00:00.000+02:00",
  "timeStampFin": "2017-10-16T19:00:00.000+02:00",
  "lieu": {
    "code": "SALREU041",
    "libelleCourt": "Sully 5",
    "libelleLong": "Sully 5, Palais Bourbon"
  },
  "cycleDeVie": {
    "etat": "Confirmé",
    "chrono": {
      "creation": "2017-10-06T10:49:57.000+02:00",
      "cloture": null
    }
  },
  "demandeurs": {
    "acteur": {
      "nom": "Mme Valérie LACROUTE",
      "acteurRef": "PA609245"
    }
  },
  "organeReuniRef": null,
  "typeReunion": "DEP"
}