{
  "@xmlns": "http://schemas.assemblee-nationale.fr/referentiel",
  "@xmlns:xsi": "http://www.w3.org/2001/XMLSchema-instance",
  "@xsi:type": "reunionInitParlementaire_type",
  "uid": "RUANR5L15S2018IDF0109694",
  "timeStampDebut": "2018-04-13T16:00:00.000+02:00",
  "timeStampFin": "2018-04-13T18:00:00.000+02:00",
  "lieu": {
    "code": "SALREU006",
    "libelleCourt": "3ème Bureau",
    "libelleLong": "3ème Bureau, Palais Bourbon"
  },
  "cycleDeVie": {
    "etat": "Annulé",
    "chrono": {
      "creation": "2018-04-11T10:27:38.000+02:00",
      "cloture": "2018-04-12T10:55:14.000+02:00"
    }
  },
  "demandeurs": {
    "acteur": {
      "nom": "Mme Naïma MOUTCHOU",
      "acteurRef": "PA720908"
    }
  },
  "organeReuniRef": null,
  "typeReunion": "DEP"
}