{
  "@xmlns": "http://schemas.assemblee-nationale.fr/referentiel",
  "@xmlns:xsi": "http://www.w3.org/2001/XMLSchema-instance",
  "@xsi:type": "reunionInitParlementaire_type",
  "uid": "RUANR5L15S2019IDF0124204",
  "timeStampDebut": "2019-01-16T12:30:00.000+01:00",
  "timeStampFin": "2019-01-16T14:00:00.000+01:00",
  "lieu": {
    "code": "SALREU012",
    "libelleCourt": "Salle N° 23",
    "libelleLong": "Salle N° 23, 3, rue Aristide Briand"
  },
  "cycleDeVie": {
    "etat": "Annulé",
    "chrono": {
      "creation": "2018-12-20T10:04:53.000+01:00",
      "cloture": "2019-01-15T13:25:03.000+01:00"
    }
  },
  "demandeurs": {
    "acteur": {
      "nom": "M. Alexandre HOLROYD",
      "acteurRef": "PA721150"
    }
  },
  "organeReuniRef": null,
  "typeReunion": "DEP"
}