{
  "@xmlns": "http://schemas.assemblee-nationale.fr/referentiel",
  "@xmlns:xsi": "http://www.w3.org/2001/XMLSchema-instance",
  "@xsi:type": "reunionInitParlementaire_type",
  "uid": "RUANR5L15S2019IDF0131646",
  "timeStampDebut": "2019-04-10T16:30:00.000+02:00",
  "timeStampFin": "2019-04-10T18:00:00.000+02:00",
  "lieu": {
    "code": "SALREU010",
    "libelleCourt": "Salle N° 1",
    "libelleLong": "Salle N° 1, 3, rue Aristide Briand"
  },
  "cycleDeVie": {
    "etat": "Confirmé",
    "chrono": {
      "creation": "2019-04-04T13:38:11.000+02:00",
      "cloture": null
    }
  },
  "demandeurs": {
    "acteur": {
      "nom": "Mme Pascale FONTENEL-PERSONNE",
      "acteurRef": "PA721384"
    }
  },
  "organeReuniRef": null,
  "typeReunion": "DEP"
}