{
  "@xmlns": "http://schemas.assemblee-nationale.fr/referentiel",
  "@xmlns:xsi": "http://www.w3.org/2001/XMLSchema-instance",
  "@xsi:type": "reunionInitParlementaire_type",
  "uid": "RUANR5L15S2017IDF0095256",
  "timeStampDebut": "2017-09-04T10:00:00.000+02:00",
  "timeStampFin": "2017-09-04T12:00:00.000+02:00",
  "lieu": {
    "code": "SALREU049",
    "libelleCourt": "Salle 6822",
    "libelleLong": "Salle 6822, Palais Bourbon"
  },
  "cycleDeVie": {
    "etat": "Annulé",
    "chrono": {
      "creation": "2017-08-08T10:12:08.000+02:00",
      "cloture": "2017-08-29T12:03:05.000+02:00"
    }
  },
  "demandeurs": {
    "acteur": {
      "nom": "M. Gilles CARREZ",
      "acteurRef": "PA746"
    }
  },
  "organeReuniRef": null,
  "typeReunion": "DEP"
}