{
  "@xmlns": "http://schemas.assemblee-nationale.fr/referentiel",
  "@xmlns:xsi": "http://www.w3.org/2001/XMLSchema-instance",
  "@xsi:type": "reunionInitParlementaire_type",
  "uid": "RUANR5L15S2018IDF0099159",
  "timeStampDebut": "2017-11-08T19:00:00.000+01:00",
  "timeStampFin": "2017-11-08T20:30:00.000+01:00",
  "lieu": {
    "code": "SALREU008",
    "libelleCourt": "5ème Bureau",
    "libelleLong": "5ème Bureau, Palais Bourbon"
  },
  "cycleDeVie": {
    "etat": "Annulé",
    "chrono": {
      "creation": "2017-10-23T16:12:11.000+01:00",
      "cloture": "2017-10-25T19:02:29.000+01:00"
    }
  },
  "demandeurs": {
    "acteur": {
      "nom": "M. Franck RIESTER",
      "acteurRef": "PA335758"
    }
  },
  "organeReuniRef": null,
  "typeReunion": "DEP"
}