{
  "@xmlns": "http://schemas.assemblee-nationale.fr/referentiel",
  "@xmlns:xsi": "http://www.w3.org/2001/XMLSchema-instance",
  "@xsi:type": "reunionCommission_type",
  "uid": "RUANR5L15S2019IDC431186",
  "timeStampDebut": "2019-01-15T14:00:00.000+01:00",
  "lieu": {
    "libelleLong": "salle 23 (3 rue Aristide Briand)"
  },
  "cycleDeVie": {
    "etat": "Confirmé",
    "chrono": {
      "creation": "2019-01-11T00:00:00.000+01:00",
      "cloture": null
    }
  },
  "organeReuniRef": "PO759869",
  "demandeur": null,
  "participants": {
    "participantsInternes": null,
    "personnesAuditionnees": null
  },
  "sessionRef": null,
  "ouverturePresse": "true",
  "captationVideo": "false",
  "ODJ": {
    "convocationODJ": {
      "item": "Table ronde des organisations d’avocats :- Mme Charlotte Robbe, membre de la commission famille du Barreau de Paris et experte auprès du Conseil national des Barreaux ;- Mme Herveline Rideau de Longcamp, membre du Conseil de l’Ordre et responsable de l’antenne des majeurs vulnérables du Barreau de Paris ;- M. Valéry Montourcy, référent du pôle « tutelle » de l’antenne des majeurs vulnérables du Barreau de Paris ;- M. Thierry Rouziès, avocat spécialisé en droit des mesures de protection judiciaire ;- Mme Anita Tanaskovic, juriste au Conseil national des Barreaux."
    },
    "resumeODJ": {
      "item": [
        "table ronde des organisations d’avocats :",
        "Mme Charlotte Robbe, membre de la commission famille du Barreau de Paris et experte auprès du Conseil national des Barreaux ;",
        "Mme Herveline Rideau de Longcamp, membre du Conseil de l’Ordre et responsable de l’antenne des majeurs vulnérables du Barreau de Paris ;",
        "M. Valéry Montourcy, référent du pôle « tutelle » de l’antenne des majeurs vulnérables du Barreau de Paris ;",
        "M. Thierry Rouziès, avocat spécialisé en droit des mesures de protection judiciaire ;",
        "Mme Anita Tanaskovic, juriste au Conseil national des Barreaux."
      ]
    },
    "pointsODJ": null
  },
  "compteRenduRef": null,
  "formatReunion": "Ordinaire",
  "infosReunionsInternationale": {
    "estReunionInternationale": "false",
    "listePays": null,
    "informationsComplementaires": null
  }
}