{
  "@xmlns": "http://schemas.assemblee-nationale.fr/referentiel",
  "@xmlns:xsi": "http://www.w3.org/2001/XMLSchema-instance",
  "@xsi:type": "reunionInitParlementaire_type",
  "uid": "RUANR5L15S2020IDF0143856",
  "timeStampDebut": "2019-11-19T16:00:00.000+01:00",
  "timeStampFin": "2019-11-19T18:00:00.000+01:00",
  "lieu": {
    "code": "SALREU015",
    "libelleCourt": "Salle 7044",
    "libelleLong": "Salle 7044, 103, rue de l'Université"
  },
  "cycleDeVie": {
    "etat": "Confirmé",
    "chrono": {
      "creation": "2019-11-18T15:39:16.000+01:00",
      "cloture": null
    }
  },
  "demandeurs": {
    "acteur": {
      "nom": "Mme Stéphanie KERBARH",
      "acteurRef": "PA721514"
    }
  },
  "organeReuniRef": null,
  "typeReunion": "DEP"
}