{
  "@xmlns": "http://schemas.assemblee-nationale.fr/referentiel",
  "@xmlns:xsi": "http://www.w3.org/2001/XMLSchema-instance",
  "@xsi:type": "reunionInitParlementaire_type",
  "uid": "RUANR5L15S2020IDF0143374",
  "timeStampDebut": "2019-11-19T09:00:00.000+01:00",
  "timeStampFin": "2019-11-19T10:30:00.000+01:00",
  "lieu": {
    "code": "SALREU020",
    "libelleCourt": "Salon Mars II",
    "libelleLong": "Salon Mars II, 101, rue de l'Université"
  },
  "cycleDeVie": {
    "etat": "Annulé",
    "chrono": {
      "creation": "2019-11-07T12:26:37.000+01:00",
      "cloture": "2019-11-18T11:09:37.000+01:00"
    }
  },
  "demandeurs": {
    "acteur": {
      "nom": "Mme Émilie GUEREL",
      "acteurRef": "PA721792"
    }
  },
  "organeReuniRef": null,
  "typeReunion": "DEP"
}