{
  "@xmlns": "http://schemas.assemblee-nationale.fr/referentiel",
  "@xmlns:xsi": "http://www.w3.org/2001/XMLSchema-instance",
  "@xsi:type": "reunionInitParlementaire_type",
  "uid": "RUANR5L15S2019IDF0122881",
  "timeStampDebut": "2019-02-07T17:00:00.000+01:00",
  "timeStampFin": "2019-02-07T22:00:00.000+01:00",
  "lieu": {
    "code": "SALREU003",
    "libelleCourt": "Salle Victor Hugo",
    "libelleLong": "Salle Victor Hugo, 101, rue de l'Université"
  },
  "cycleDeVie": {
    "etat": "Annulé",
    "chrono": {
      "creation": "2018-11-22T18:18:22.000+01:00",
      "cloture": "2018-12-07T17:01:57.000+01:00"
    }
  },
  "demandeurs": {
    "acteur": {
      "nom": "M. Max MATHIASIN",
      "acteurRef": "PA720976"
    }
  },
  "organeReuniRef": null,
  "typeReunion": "DEP"
}