{
  "@xmlns": "http://schemas.assemblee-nationale.fr/referentiel",
  "@xmlns:xsi": "http://www.w3.org/2001/XMLSchema-instance",
  "@xsi:type": "reunionInitParlementaire_type",
  "uid": "RUANR5L15S2019IDF0123452",
  "timeStampDebut": "2018-12-06T14:00:00.000+01:00",
  "timeStampFin": "2018-12-06T15:00:00.000+01:00",
  "lieu": {
    "code": "SALREU011",
    "libelleCourt": "Salle N° 2",
    "libelleLong": "Salle N° 2, 3, rue Aristide Briand"
  },
  "cycleDeVie": {
    "etat": "Confirmé",
    "chrono": {
      "creation": "2018-12-05T20:11:48.000+01:00",
      "cloture": null
    }
  },
  "demandeurs": {
    "acteur": {
      "nom": "M. Buon TAN",
      "acteurRef": "PA721690"
    }
  },
  "organeReuniRef": null,
  "typeReunion": "DEP"
}