{
  "@xmlns": "http://schemas.assemblee-nationale.fr/referentiel",
  "@xmlns:xsi": "http://www.w3.org/2001/XMLSchema-instance",
  "@xsi:type": "reunionInitParlementaire_type",
  "uid": "RUANR5L15S2020IDF0141233",
  "timeStampDebut": "2019-10-09T14:00:00.000+02:00",
  "timeStampFin": "2019-10-09T16:00:00.000+02:00",
  "lieu": {
    "code": "SALREU025",
    "libelleCourt": "7ème Bureau",
    "libelleLong": "7ème Bureau, Palais Bourbon"
  },
  "cycleDeVie": {
    "etat": "Confirmé",
    "chrono": {
      "creation": "2019-10-01T16:47:43.000+02:00",
      "cloture": null
    }
  },
  "demandeurs": {
    "acteur": {
      "nom": "M. Joël AVIRAGNET",
      "acteurRef": "PA642764"
    }
  },
  "organeReuniRef": null,
  "typeReunion": "DEP"
}