{
  "@xmlns": "http://schemas.assemblee-nationale.fr/referentiel",
  "@xmlns:xsi": "http://www.w3.org/2001/XMLSchema-instance",
  "@xsi:type": "reunionInitParlementaire_type",
  "uid": "RUANR5L15S2019IDF0122811",
  "timeStampDebut": "2018-12-05T11:30:00.000+01:00",
  "timeStampFin": "2018-12-05T12:30:00.000+01:00",
  "lieu": {
    "code": "SALREU018",
    "libelleCourt": "Salon Mansart",
    "libelleLong": "Salon Mansart, 101, rue de l'Université"
  },
  "cycleDeVie": {
    "etat": "Confirmé",
    "chrono": {
      "creation": "2018-11-22T09:22:35.000+01:00",
      "cloture": null
    }
  },
  "demandeurs": {
    "acteur": [
      {
        "nom": "M. Maxime MINOT",
        "acteurRef": "PA720630"
      },
      {
        "nom": "M. Bertrand SORRE",
        "acteurRef": "PA720190"
      }
    ]
  },
  "organeReuniRef": null,
  "typeReunion": "DEP"
}