{
  "@xmlns": "http://schemas.assemblee-nationale.fr/referentiel",
  "@xmlns:xsi": "http://www.w3.org/2001/XMLSchema-instance",
  "@xsi:type": "reunionInitParlementaire_type",
  "uid": "RUANR5L15S2019IDF0134652",
  "timeStampDebut": "2019-06-25T11:00:00.000+02:00",
  "timeStampFin": "2019-06-25T12:00:00.000+02:00",
  "lieu": {
    "code": "SALREU006",
    "libelleCourt": "3ème Bureau",
    "libelleLong": "3ème Bureau, Palais Bourbon"
  },
  "cycleDeVie": {
    "etat": "Annulé",
    "chrono": {
      "creation": "2019-05-28T12:48:22.000+02:00",
      "cloture": "2019-05-28T14:43:04.000+02:00"
    }
  },
  "demandeurs": {
    "acteur": {
      "nom": "Mme Marianne DUBOIS",
      "acteurRef": "PA342935"
    }
  },
  "organeReuniRef": null,
  "typeReunion": "DEP"
}