{
  "@xmlns": "http://schemas.assemblee-nationale.fr/referentiel",
  "@xmlns:xsi": "http://www.w3.org/2001/XMLSchema-instance",
  "@xsi:type": "reunionCommission_type",
  "uid": "RUANR5L15S2017IDC427156",
  "timeStampDebut": "2017-08-01T15:00:00.000+02:00",
  "timeStampFin": "2017-08-01T17:45:00.000+02:00",
  "lieu": {
    "libelleLong": "salle 6237 (Développement durable)"
  },
  "cycleDeVie": {
    "etat": "Confirmé",
    "chrono": {
      "creation": "2017-07-20T00:00:00.000+02:00",
      "cloture": null
    }
  },
  "organeReuniRef": "PO419865",
  "demandeur": null,
  "participants": {
    "participantsInternes": {
      "participantInterne": [
        {
          "acteurRef": "PA720242",
          "presence": "présent"
        },
        {
          "acteurRef": "PA720310",
          "presence": "présent"
        },
        {
          "acteurRef": "PA719806",
          "presence": "présent"
        },
        {
          "acteurRef": "PA721046",
          "presence": "présent"
        },
        {
          "acteurRef": "PA720210",
          "presence": "présent"
        },
        {
          "acteurRef": "PA266793",
          "presence": "absent"
        },
        {
          "acteurRef": "PA267233",
          "presence": "présent"
        },
        {
          "acteurRef": "PA718710",
          "presence": "présent"
        },
        {
          "acteurRef": "PA267766",
          "presence": "présent"
        },
        {
          "acteurRef": "PA719890",
          "presence": "présent"
        },
        {
          "acteurRef": "PA718838",
          "presence": "présent"
        },
        {
          "acteurRef": "PA722000",
          "presence": "présent"
        },
        {
          "acteurRef": "PA719922",
          "presence": "présent"
        },
        {
          "acteurRef": "PA721860",
          "presence": "présent"
        },
        {
          "acteurRef": "PA719740",
          "presence": "présent"
        },
        {
          "acteurRef": "PA719286",
          "presence": "présent"
        },
        {
          "acteurRef": "PA719624",
          "presence": "présent"
        },
        {
          "acteurRef": "PA719194",
          "presence": "absent"
        },
        {
          "acteurRef": "PA330909",
          "presence": "présent"
        },
        {
          "acteurRef": "PA720538",
          "presence": "présent"
        },
        {
          "acteurRef": "PA722236",
          "presence": "absent"
        },
        {
          "acteurRef": "PA718894",
          "presence": "présent"
        },
        {
          "acteurRef": "PA720652",
          "presence": "absent"
        },
        {
          "acteurRef": "PA605694",
          "presence": "excusé"
        },
        {
          "acteurRef": "PA722366",
          "presence": "absent"
        },
        {
          "acteurRef": "PA333285",
          "presence": "absent"
        },
        {
          "acteurRef": "PA720054",
          "presence": "présent"
        },
        {
          "acteurRef": "PA720038",
          "presence": "absent"
        },
        {
          "acteurRef": "PA721514",
          "presence": "présent"
        },
        {
          "acteurRef": "PA605084",
          "presence": "présent"
        },
        {
          "acteurRef": "PA605518",
          "presence": "absent"
        },
        {
          "acteurRef": "PA720764",
          "presence": "absent"
        },
        {
          "acteurRef": "PA722228",
          "presence": "présent"
        },
        {
          "acteurRef": "PA719412",
          "presence": "présent"
        },
        {
          "acteurRef": "PA588886",
          "presence": "présent"
        },
        {
          "acteurRef": "PA721054",
          "presence": "excusé"
        },
        {
          "acteurRef": "PA721530",
          "presence": "présent"
        },
        {
          "acteurRef": "PA719718",
          "presence": "présent"
        },
        {
          "acteurRef": "PA346054",
          "presence": "présent"
        },
        {
          "acteurRef": "PA719080",
          "presence": "absent"
        },
        {
          "acteurRef": "PA2155",
          "presence": "présent"
        },
        {
          "acteurRef": "PA719882",
          "presence": "présent"
        },
        {
          "acteurRef": "PA721976",
          "presence": "présent"
        },
        {
          "acteurRef": "PA721876",
          "presence": "présent"
        },
        {
          "acteurRef": "PA721254",
          "presence": "présent"
        },
        {
          "acteurRef": "PA720278",
          "presence": "présent"
        },
        {
          "acteurRef": "PA720334",
          "presence": "présent"
        },
        {
          "acteurRef": "PA720606",
          "presence": "absent"
        },
        {
          "acteurRef": "PA333421",
          "presence": "excusé"
        },
        {
          "acteurRef": "PA719632",
          "presence": "présent"
        },
        {
          "acteurRef": "PA720892",
          "presence": "absent"
        },
        {
          "acteurRef": "PA720944",
          "presence": "présent"
        },
        {
          "acteurRef": "PA718802",
          "presence": "présent"
        },
        {
          "acteurRef": "PA720414",
          "presence": "présent"
        },
        {
          "acteurRef": "PA721372",
          "presence": "présent"
        },
        {
          "acteurRef": "PA693008",
          "presence": "absent"
        },
        {
          "acteurRef": "PA609520",
          "presence": "présent"
        },
        {
          "acteurRef": "PA719578",
          "presence": "présent"
        },
        {
          "acteurRef": "PA721426",
          "presence": "présent"
        },
        {
          "acteurRef": "PA610733",
          "presence": "absent"
        },
        {
          "acteurRef": "PA721600",
          "presence": "présent"
        },
        {
          "acteurRef": "PA267527",
          "presence": "excusé"
        },
        {
          "acteurRef": "PA719972",
          "presence": "présent"
        },
        {
          "acteurRef": "PA340343",
          "presence": "absent"
        },
        {
          "acteurRef": "PA267204",
          "presence": "présent"
        },
        {
          "acteurRef": "PA610667",
          "presence": "absent"
        },
        {
          "acteurRef": "PA719592",
          "presence": "présent"
        },
        {
          "acteurRef": "PA722336",
          "presence": "présent"
        },
        {
          "acteurRef": "PA719092",
          "presence": "absent"
        },
        {
          "acteurRef": "PA718728",
          "presence": "présent"
        },
        {
          "acteurRef": "PA720586",
          "presence": "présent"
        },
        {
          "acteurRef": "PA721968",
          "presence": "présent"
        },
        {
          "acteurRef": "PA607090",
          "presence": "présent"
        },
        {
          "acteurRef": "PA722110",
          "presence": "présent"
        },
        {
          "acteurRef": "PA718962",
          "presence": "présent"
        }
      ]
    },
    "personnesAuditionnees": null
  },
  "sessionRef": null,
  "ouverturePresse": "true",
  "captationVideo": "false",
  "ODJ": {
    "convocationODJ": {
      "item": "Audition de M. Philippe Duron, président de l’Agence de financement des infrastructures de transport de France (AFITF)."
    },
    "resumeODJ": {
      "item": "audition de M. Philippe Duron, président de l’Agence de financement des infrastructures de transport de France (AFITF)."
    },
    "pointsODJ": null
  },
  "compteRenduRef": "CRCANR5L15S2017PO419865N009",
  "formatReunion": "Ordinaire",
  "infosReunionsInternationale": {
    "estReunionInternationale": "false",
    "listePays": null,
    "informationsComplementaires": null
  }
}