{
  "@xmlns": "http://schemas.assemblee-nationale.fr/referentiel",
  "@xmlns:xsi": "http://www.w3.org/2001/XMLSchema-instance",
  "@xsi:type": "seance_type",
  "uid": "RUANR5L15S2018IDS21130",
  "timeStampDebut": "2018-06-26T21:30:00.000+02:00",
  "timeStampFin": "2018-06-27T01:50:00.000+02:00",
  "lieu": {
    "code": "AN",
    "libelleLong": "Assemblée nationale"
  },
  "cycleDeVie": {
    "etat": "Confirmé",
    "chrono": {
      "creation": "2018-06-01T00:00:00.000+02:00",
      "cloture": null
    }
  },
  "organeReuniRef": "PO717460",
  "demandeur": null,
  "participants": null,
  "sessionRef": "SCR5A2018O1",
  "ouverturePresse": "true",
  "captationVideo": "true",
  "ODJ": {
    "convocationODJ": null,
    "resumeODJ": null,
    "pointsODJ": {
      "pointODJ": [
        {
          "@xsi:type": "podjSeanceConfPres_type",
          "uid": "RUANR5L15S2018IDS21130PT36028",
          "cycleDeVie": {
            "etat": "Supprimé",
            "chrono": {
              "creation": "2018-06-03T00:00:00.000+02:00",
              "cloture": "2018-06-25T00:00:00.000+02:00"
            }
          },
          "objet": "Suite de la nouvelle lecture du projet de loi, modifié par le Sénat, renforçant l'efficacité de l'administration pour une relation de confiance avec le public",
          "demandeurPoint": null,
          "procedure": null,
          "dossiersLegislatifsRefs": null,
          "typePointODJ": "Suite de la discussion",
          "comiteSecret": "false",
          "textesAssocies": null,
          "natureTravauxODJ": "ODJPR"
        },
        {
          "@xsi:type": "podjSeanceConfPres_type",
          "uid": "RUANR5L15S2018IDS21130PT36181",
          "cycleDeVie": {
            "etat": "Supprimé",
            "chrono": {
              "creation": "2018-06-25T00:00:00.000+02:00",
              "cloture": "2018-06-25T00:00:00.000+02:00"
            }
          },
          "objet": "Suite de la nouvelle lecture du projet de loi pour un État au service d'une société de confiance",
          "demandeurPoint": null,
          "procedure": null,
          "dossiersLegislatifsRefs": null,
          "typePointODJ": "Suite de la discussion",
          "comiteSecret": "false",
          "textesAssocies": null,
          "natureTravauxODJ": "ODJPR"
        },
        {
          "@xsi:type": "podjSeanceConfPres_type",
          "uid": "RUANR5L15S2018IDS21130PT36182",
          "cycleDeVie": {
            "etat": "Confirmé",
            "chrono": {
              "creation": "2018-06-25T00:00:00.000+02:00",
              "cloture": null
            }
          },
          "objet": "Suite de la nouvelle lecture du projet de loi, modifié par le Sénat, pour un État au service d'une société de confiance",
          "demandeurPoint": null,
          "procedure": null,
          "dossiersLegislatifsRefs": {
            "dossierRef": "DLR5L15N36159"
          },
          "typePointODJ": "Suite de la discussion",
          "comiteSecret": "false",
          "textesAssocies": null,
          "natureTravauxODJ": "ODJPR"
        }
      ]
    }
  },
  "compteRenduRef": "CRSANR5L15S2018O1N287",
  "identifiants": {
    "numSeanceJO": "287",
    "idJO": "20180287",
    "quantieme": "Deuxième",
    "DateSeance": "2018-06-26+02:00"
  }
}