{
  "@xmlns": "http://schemas.assemblee-nationale.fr/referentiel",
  "@xmlns:xsi": "http://www.w3.org/2001/XMLSchema-instance",
  "@xsi:type": "reunionInitParlementaire_type",
  "uid": "RUANR5L15S2018IDF0116477",
  "timeStampDebut": "2018-09-12T19:00:00.000+02:00",
  "timeStampFin": "2018-09-12T21:00:00.000+02:00",
  "lieu": {
    "code": "SALREU020",
    "libelleCourt": "Salon Mars II",
    "libelleLong": "Salon Mars II, 101, rue de l'Université"
  },
  "cycleDeVie": {
    "etat": "Confirmé",
    "chrono": {
      "creation": "2018-08-01T14:37:12.000+02:00",
      "cloture": null
    }
  },
  "demandeurs": {
    "acteur": {
      "nom": "M. Lionel CAUSSE",
      "acteurRef": "PA719922"
    }
  },
  "organeReuniRef": null,
  "typeReunion": "DEP"
}