{
  "@xmlns": "http://schemas.assemblee-nationale.fr/referentiel",
  "@xmlns:xsi": "http://www.w3.org/2001/XMLSchema-instance",
  "@xsi:type": "reunionCommission_type",
  "uid": "RUANR5L15S2019IDC432344",
  "timeStampDebut": "2019-05-28T17:35:00.000+02:00",
  "timeStampFin": "2019-05-28T19:05:00.000+02:00",
  "lieu": {
    "libelleLong": "salle de la commission (3e étage, 33 rue Saint Dominique)"
  },
  "cycleDeVie": {
    "etat": "Confirmé",
    "chrono": {
      "creation": "2019-04-12T00:00:00.000+02:00",
      "cloture": null
    }
  },
  "organeReuniRef": "PO415287",
  "demandeur": null,
  "participants": {
    "participantsInternes": {
      "participantInterne": [
        {
          "acteurRef": "PA605036",
          "presence": "absent"
        },
        {
          "acteurRef": "PA721278",
          "presence": "absent"
        },
        {
          "acteurRef": "PA721158",
          "presence": "présent"
        },
        {
          "acteurRef": "PA718756",
          "presence": "présent"
        },
        {
          "acteurRef": "PA642695",
          "presence": "absent"
        },
        {
          "acteurRef": "PA721608",
          "presence": "absent"
        },
        {
          "acteurRef": "PA720772",
          "presence": "absent"
        },
        {
          "acteurRef": "PA719170",
          "presence": "absent"
        },
        {
          "acteurRef": "PA267306",
          "presence": "présent"
        },
        {
          "acteurRef": "PA719194",
          "presence": "absent"
        },
        {
          "acteurRef": "PA1029",
          "presence": "excusé"
        },
        {
          "acteurRef": "PA721398",
          "presence": "présent"
        },
        {
          "acteurRef": "PA720598",
          "presence": "présent"
        },
        {
          "acteurRef": "PA722382",
          "presence": "absent"
        },
        {
          "acteurRef": "PA719684",
          "presence": "absent"
        },
        {
          "acteurRef": "PA606202",
          "presence": "absent"
        },
        {
          "acteurRef": "PA721194",
          "presence": "absent"
        },
        {
          "acteurRef": "PA720684",
          "presence": "absent"
        },
        {
          "acteurRef": "PA720030",
          "presence": "absent"
        },
        {
          "acteurRef": "PA722284",
          "presence": "absent"
        },
        {
          "acteurRef": "PA721784",
          "presence": "absent"
        },
        {
          "acteurRef": "PA720170",
          "presence": "présent"
        },
        {
          "acteurRef": "PA722094",
          "presence": "présent"
        },
        {
          "acteurRef": "PA1630",
          "presence": "excusé"
        },
        {
          "acteurRef": "PA721150",
          "presence": "absent"
        },
        {
          "acteurRef": "PA720074",
          "presence": "présent"
        },
        {
          "acteurRef": "PA719060",
          "presence": "absent"
        },
        {
          "acteurRef": "PA335054",
          "presence": "excusé"
        },
        {
          "acteurRef": "PA1809",
          "presence": "absent"
        },
        {
          "acteurRef": "PA722228",
          "presence": "absent"
        },
        {
          "acteurRef": "PA345722",
          "presence": "absent"
        },
        {
          "acteurRef": "PA720342",
          "presence": "excusé"
        },
        {
          "acteurRef": "PA721946",
          "presence": "présent"
        },
        {
          "acteurRef": "PA720370",
          "presence": "présent"
        },
        {
          "acteurRef": "PA720738",
          "presence": "absent"
        },
        {
          "acteurRef": "PA721486",
          "presence": "absent"
        },
        {
          "acteurRef": "PA721960",
          "presence": "absent"
        },
        {
          "acteurRef": "PA720402",
          "presence": "absent"
        },
        {
          "acteurRef": "PA721372",
          "presence": "présent"
        },
        {
          "acteurRef": "PA2449",
          "presence": "présent"
        },
        {
          "acteurRef": "PA608011",
          "presence": "présent"
        },
        {
          "acteurRef": "PA2492",
          "presence": "absent"
        },
        {
          "acteurRef": "PA702052",
          "presence": "absent"
        },
        {
          "acteurRef": "PA721314",
          "presence": "absent"
        },
        {
          "acteurRef": "PA719592",
          "presence": "absent"
        },
        {
          "acteurRef": "PA334654",
          "presence": "absent"
        },
        {
          "acteurRef": "PA267794",
          "presence": "absent"
        },
        {
          "acteurRef": "PA719550",
          "presence": "excusé"
        },
        {
          "acteurRef": "PA719822",
          "presence": "présent"
        }
      ]
    },
    "personnesAuditionnees": null
  },
  "sessionRef": null,
  "ouverturePresse": "true",
  "captationVideo": "false",
  "ODJ": {
    "convocationODJ": {
      "item": [
        "Table ronde sur le résultat des élections européennes en présence de M. Jean-Dominique Giuliani, président de la Fondation Robert Schuman, de Mme Clémentine Forissier, rédactrice en chef du magazine Contexte, de M. Nicolas Sauger, professeur associé à Sciences Po et de Mme Sylvie Strudel, professeure à l’Université Panthéon-Assas (Paris II) ;",
        "Examen de textes soumis à l’Assemblée nationale en application des articles 88-4 de la Constitution."
      ]
    },
    "resumeODJ": {
      "item": [
        "table ronde sur le résultat des élections européennes ;",
        "examen de textes soumis à l’Assemblée nationale en application des articles 88-4 de la Constitution."
      ]
    },
    "pointsODJ": null
  },
  "compteRenduRef": "CRCANR5L15S2019PO415287N0092",
  "formatReunion": "Ordinaire",
  "infosReunionsInternationale": {
    "estReunionInternationale": "false",
    "listePays": null,
    "informationsComplementaires": null
  }
}