{
  "@xmlns": "http://schemas.assemblee-nationale.fr/referentiel",
  "@xmlns:xsi": "http://www.w3.org/2001/XMLSchema-instance",
  "@xsi:type": "seance_type",
  "uid": "RUANR5L15S2019IDS21820",
  "timeStampDebut": "2019-09-20T09:00:00.000+02:00",
  "lieu": {
    "code": "AN",
    "libelleLong": "Assemblée nationale"
  },
  "cycleDeVie": {
    "etat": "Supprimé",
    "chrono": {
      "creation": "2019-08-23T00:00:00.000+02:00",
      "cloture": "2019-09-02T00:00:00.000+02:00"
    }
  },
  "organeReuniRef": "PO717460",
  "demandeur": null,
  "participants": null,
  "sessionRef": "SCR5A2019E2",
  "ouverturePresse": "true",
  "captationVideo": "true",
  "ODJ": {
    "convocationODJ": null,
    "resumeODJ": null,
    "pointsODJ": null
  },
  "compteRenduRef": null,
  "identifiants": {
    "numSeanceJO": null,
    "idJO": null,
    "quantieme": "Première",
    "DateSeance": "2019-09-20+02:00"
  }
}