{
  "@xmlns": "http://schemas.assemblee-nationale.fr/referentiel",
  "@xmlns:xsi": "http://www.w3.org/2001/XMLSchema-instance",
  "@xsi:type": "reunionInitParlementaire_type",
  "uid": "RUANR5L15S2019IDF0118417",
  "timeStampDebut": "2018-10-09T16:30:00.000+02:00",
  "timeStampFin": "2018-10-09T19:00:00.000+02:00",
  "lieu": {
    "code": "SALREU041",
    "libelleCourt": "Sully 5",
    "libelleLong": "Sully 5, Palais Bourbon"
  },
  "cycleDeVie": {
    "etat": "Annulé",
    "chrono": {
      "creation": "2018-09-13T13:37:33.000+02:00",
      "cloture": "2018-09-13T14:18:23.000+02:00"
    }
  },
  "demandeurs": {
    "acteur": {
      "nom": "Mme Florence LASSERRE-DAVID",
      "acteurRef": "PA720764"
    }
  },
  "organeReuniRef": null,
  "typeReunion": "DEP"
}