{
  "@xmlns": "http://schemas.assemblee-nationale.fr/referentiel",
  "@xmlns:xsi": "http://www.w3.org/2001/XMLSchema-instance",
  "@xsi:type": "reunionCommission_type",
  "uid": "RUANR5L15S2018IDC427399",
  "timeStampDebut": "2017-10-31T21:00:00.000+01:00",
  "lieu": {
    "libelleLong": "salle Victor Hugo"
  },
  "cycleDeVie": {
    "etat": "Supprimé",
    "chrono": {
      "creation": "2017-10-04T00:00:00.000+02:00",
      "cloture": "2017-12-01T00:00:00.000+01:00"
    }
  },
  "organeReuniRef": "PO59048",
  "demandeur": null,
  "participants": {
    "participantsInternes": null,
    "personnesAuditionnees": null
  },
  "sessionRef": null,
  "ouverturePresse": "true",
  "captationVideo": "false",
  "ODJ": {
    "convocationODJ": {
      "item": "–  éventuellement, à l'issue de la commission élargie, suite de l’examen de la seconde partie du projet de loi de finances pour 2018 (n° 235) ; Examen et vote sur les crédits de la mission Écologie, développement et mobilité durables et sur les articles 53 et 54, rattachés :–  Paysage, eau et biodiversité ; Prévention des risques ; Expertise, information géographique et météorologie ; Conduite et pilotage des politiques de l’écologie, du développement et de la mobilité durables (M. Éric COQUEREL, rapporteur spécial)– Affaires maritimes (M. Saïd AHAMADA, rapporteur spécial)– Énergie, climat et après-mines ; Service public de l’énergie et comptes spéciaux Financement des aides aux collectivités pour l’électrification rurale et Transition énergétique (M. Julien AUBERT, rapporteur spécial)–  Infrastructures et services de transports ; comptes spéciaux Aides à l’acquisition de véhicules propres ; Services nationaux de transport conventionnés de voyageurs et budget annexe Contrôle et exploitation aériens (Mme Anne-Laure CATTELOT et M. Benoît SIMIAN, rapporteur spécial)"
    },
    "resumeODJ": {
      "item": [
        "éventuellement, projet de loi de finances pour 2018 (n° 235) (seconde partie) :",
        "éventuellement, à l'issue de la commission élargie : examen et vote sur les crédits de la mission Écologie, développement et mobilité durables et sur les articles 53 et 54, rattachés."
      ]
    },
    "pointsODJ": {
      "pointODJ": {
        "@xsi:type": "podjReunion_type",
        "uid": "RUANR5L15S2018IDC427399PT25038",
        "cycleDeVie": {
          "etat": "Supprimé",
          "chrono": {
            "creation": "2017-10-04T00:00:00.000+02:00",
            "cloture": "2017-12-01T00:00:00.000+01:00"
          }
        },
        "objet": "Examen du texte",
        "demandeurPoint": null,
        "procedure": null,
        "dossiersLegislatifsRefs": null,
        "typePointODJ": "Examen",
        "comiteSecret": "false",
        "textesAssocies": null
      }
    }
  },
  "compteRenduRef": null,
  "formatReunion": "Ordinaire",
  "infosReunionsInternationale": {
    "estReunionInternationale": "false",
    "listePays": null,
    "informationsComplementaires": null
  }
}