{
  "@xmlns": "http://schemas.assemblee-nationale.fr/referentiel",
  "@xmlns:xsi": "http://www.w3.org/2001/XMLSchema-instance",
  "@xsi:type": "reunionCommission_type",
  "uid": "RUANR5L15S2018IDC427599",
  "timeStampDebut": "2017-12-21T09:30:00.000+01:00",
  "lieu": {
    "libelleLong": "salle 4013 (33 rue Saint-Dominique)"
  },
  "cycleDeVie": {
    "etat": "Confirmé",
    "chrono": {
      "creation": "2017-10-17T00:00:00.000+02:00",
      "cloture": null
    }
  },
  "organeReuniRef": "PO734965",
  "demandeur": null,
  "participants": {
    "participantsInternes": null,
    "personnesAuditionnees": null
  },
  "sessionRef": null,
  "ouverturePresse": "false",
  "captationVideo": "false",
  "ODJ": {
    "convocationODJ": {
      "item": "Audition de M. Hervé Guillou, président du GICAN, de M. Fabien Menant, directeur des affaires publiques et européennes et directeur de cabinet de M. Guillou (NAVAL GROUP), de M. François Lambert, délégué général du GICAN, et de M. Hervé Croce, responsable des relations institutionnelles et des affaires de défense du GICAN ;"
    },
    "resumeODJ": {
      "item": "audition de M. Hervé Guillou, président du GICAN, de M. Fabien Menant, directeur des affaires publiques et européennes et directeur de cabinet de M. Guillou (NAVAL GROUP), de M. François Lambert, délégué général du GICAN, et de M. Hervé Croce, responsable des relations institutionnelles et des affaires de défense du GICAN."
    },
    "pointsODJ": null
  },
  "compteRenduRef": null,
  "formatReunion": "Ordinaire",
  "infosReunionsInternationale": {
    "estReunionInternationale": "false",
    "listePays": null,
    "informationsComplementaires": null
  }
}