{
  "@xmlns": "http://schemas.assemblee-nationale.fr/referentiel",
  "@xmlns:xsi": "http://www.w3.org/2001/XMLSchema-instance",
  "@xsi:type": "reunionCommission_type",
  "uid": "RUANR5L15S2020IDC433849",
  "timeStampDebut": "2019-10-09T12:00:00.000+02:00",
  "timeStampFin": "2019-10-09T13:00:00.000+02:00",
  "lieu": {
    "libelleLong": "salle 6238 (Développement durable)"
  },
  "cycleDeVie": {
    "etat": "Confirmé",
    "chrono": {
      "creation": "2019-10-02T00:00:00.000+02:00",
      "cloture": null
    }
  },
  "organeReuniRef": "PO767069",
  "demandeur": null,
  "participants": {
    "participantsInternes": null,
    "personnesAuditionnees": null
  },
  "sessionRef": null,
  "ouverturePresse": "false",
  "captationVideo": "false",
  "ODJ": {
    "convocationODJ": {
      "item": [
        "Réunion constitutive de la mission ;",
        "Désignation du bureau ;",
        "Échange de vues des membres et programme de travail."
      ]
    },
    "resumeODJ": {
      "item": [
        "réunion constitutive de la mission ;",
        "désignation du bureau ;",
        "échange de vues des membres et programme de travail."
      ]
    },
    "pointsODJ": null
  },
  "compteRenduRef": null,
  "formatReunion": "Ordinaire",
  "infosReunionsInternationale": {
    "estReunionInternationale": "false",
    "listePays": null,
    "informationsComplementaires": null
  }
}