{
  "@xmlns": "http://schemas.assemblee-nationale.fr/referentiel",
  "@xmlns:xsi": "http://www.w3.org/2001/XMLSchema-instance",
  "@xsi:type": "reunionCommission_type",
  "uid": "RUANR5L15S2018IDC427584",
  "timeStampDebut": "2017-10-30T18:10:00.000+01:00",
  "timeStampFin": "2017-10-30T18:15:00.000+01:00",
  "lieu": {
    "libelleLong": "salle Lamartine"
  },
  "cycleDeVie": {
    "etat": "Confirmé",
    "chrono": {
      "creation": "2017-10-16T00:00:00.000+02:00",
      "cloture": null
    }
  },
  "organeReuniRef": "PO59047",
  "demandeur": null,
  "participants": {
    "participantsInternes": {
      "participantInterne": [
        {
          "acteurRef": "PA588884",
          "presence": "excusé"
        },
        {
          "acteurRef": "PA642724",
          "presence": "absent"
        },
        {
          "acteurRef": "PA719218",
          "presence": "absent"
        },
        {
          "acteurRef": "PA721344",
          "presence": "absent"
        },
        {
          "acteurRef": "PA719032",
          "presence": "présent"
        },
        {
          "acteurRef": "PA330684",
          "presence": "absent"
        },
        {
          "acteurRef": "PA721118",
          "presence": "excusé"
        },
        {
          "acteurRef": "PA719496",
          "presence": "absent"
        },
        {
          "acteurRef": "PA721166",
          "presence": "présent"
        },
        {
          "acteurRef": "PA719448",
          "presence": "absent"
        },
        {
          "acteurRef": "PA719294",
          "presence": "absent"
        },
        {
          "acteurRef": "PA718850",
          "presence": "excusé"
        },
        {
          "acteurRef": "PA998",
          "presence": "absent"
        },
        {
          "acteurRef": "PA1008",
          "presence": "absent"
        },
        {
          "acteurRef": "PA1029",
          "presence": "absent"
        },
        {
          "acteurRef": "PA720862",
          "presence": "absent"
        },
        {
          "acteurRef": "PA720438",
          "presence": "absent"
        },
        {
          "acteurRef": "PA722382",
          "presence": "absent"
        },
        {
          "acteurRef": "PA1198",
          "presence": "excusé"
        },
        {
          "acteurRef": "PA720684",
          "presence": "présent"
        },
        {
          "acteurRef": "PA1206",
          "presence": "absent"
        },
        {
          "acteurRef": "PA1276",
          "presence": "excusé"
        },
        {
          "acteurRef": "PA722284",
          "presence": "absent"
        },
        {
          "acteurRef": "PA720806",
          "presence": "absent"
        },
        {
          "acteurRef": "PA721024",
          "presence": "présent"
        },
        {
          "acteurRef": "PA720222",
          "presence": "absent"
        },
        {
          "acteurRef": "PA718674",
          "presence": "absent"
        },
        {
          "acteurRef": "PA1498",
          "presence": "absent"
        },
        {
          "acteurRef": "PA610775",
          "presence": "excusé"
        },
        {
          "acteurRef": "PA695100",
          "presence": "excusé"
        },
        {
          "acteurRef": "PA1630",
          "presence": "absent"
        },
        {
          "acteurRef": "PA333818",
          "presence": "absent"
        },
        {
          "acteurRef": "PA267801",
          "presence": "excusé"
        },
        {
          "acteurRef": "PA719210",
          "presence": "excusé"
        },
        {
          "acteurRef": "PA722344",
          "presence": "présent"
        },
        {
          "acteurRef": "PA721644",
          "presence": "absent"
        },
        {
          "acteurRef": "PA720202",
          "presence": "présent"
        },
        {
          "acteurRef": "PA721004",
          "presence": "excusé"
        },
        {
          "acteurRef": "PA1809",
          "presence": "absent"
        },
        {
          "acteurRef": "PA335612",
          "presence": "absent"
        },
        {
          "acteurRef": "PA722008",
          "presence": "présent"
        },
        {
          "acteurRef": "PA721450",
          "presence": "absent"
        },
        {
          "acteurRef": "PA720342",
          "presence": "absent"
        },
        {
          "acteurRef": "PA720614",
          "presence": "excusé"
        },
        {
          "acteurRef": "PA1960",
          "presence": "excusé"
        },
        {
          "acteurRef": "PA722178",
          "presence": "excusé"
        },
        {
          "acteurRef": "PA334116",
          "presence": "absent"
        },
        {
          "acteurRef": "PA720146",
          "presence": "absent"
        },
        {
          "acteurRef": "PA720870",
          "presence": "présent"
        },
        {
          "acteurRef": "PA2150",
          "presence": "excusé"
        },
        {
          "acteurRef": "PA720370",
          "presence": "absent"
        },
        {
          "acteurRef": "PA719130",
          "presence": "absent"
        },
        {
          "acteurRef": "PA719464",
          "presence": "absent"
        },
        {
          "acteurRef": "PA721486",
          "presence": "absent"
        },
        {
          "acteurRef": "PA721956",
          "presence": "présent"
        },
        {
          "acteurRef": "PA721182",
          "presence": "excusé"
        },
        {
          "acteurRef": "PA267260",
          "presence": "absent"
        },
        {
          "acteurRef": "PA719528",
          "presence": "présent"
        },
        {
          "acteurRef": "PA2492",
          "presence": "absent"
        },
        {
          "acteurRef": "PA720552",
          "presence": "présent"
        },
        {
          "acteurRef": "PA2529",
          "presence": "absent"
        },
        {
          "acteurRef": "PA721824",
          "presence": "excusé"
        },
        {
          "acteurRef": "PA330788",
          "presence": "absent"
        },
        {
          "acteurRef": "PA720138",
          "presence": "présent"
        },
        {
          "acteurRef": "PA717151",
          "presence": "présent"
        },
        {
          "acteurRef": "PA721174",
          "presence": "excusé"
        },
        {
          "acteurRef": "PA722118",
          "presence": "absent"
        },
        {
          "acteurRef": "PA267794",
          "presence": "absent"
        },
        {
          "acteurRef": "PA721690",
          "presence": "absent"
        },
        {
          "acteurRef": "PA719550",
          "presence": "absent"
        },
        {
          "acteurRef": "PA2796",
          "presence": "absent"
        },
        {
          "acteurRef": "PA720830",
          "presence": "absent"
        },
        {
          "acteurRef": "PA720746",
          "presence": "excusé"
        }
      ]
    },
    "personnesAuditionnees": null
  },
  "sessionRef": null,
  "ouverturePresse": "false",
  "captationVideo": "false",
  "ODJ": {
    "convocationODJ": {
      "item": [
        "Projet de loi de Finances 2018 (n° 235)",
        "vote à l'issue de la commission élargie Mission Immigration, asile et intégration (M. Pierre-Henri Dumont, rapporteur pour avis)."
      ]
    },
    "resumeODJ": {
      "item": "- projet de loi de Finances 2018 (n° 235) : - vote à l'issue de la commission élargie Mission Immigration, asile et intégration (M. Pierre-Henri Dumont, rapporteur pour avis)."
    },
    "pointsODJ": {
      "pointODJ": {
        "@xsi:type": "podjReunion_type",
        "uid": "RUANR5L15S2018IDC427584PT25129",
        "cycleDeVie": {
          "etat": "Eventuel",
          "chrono": {
            "creation": "2017-10-16T00:00:00.000+02:00",
            "cloture": null
          }
        },
        "objet": "Vote à l'issue de la commission élargie Immigration, asile et intégration",
        "demandeurPoint": null,
        "procedure": null,
        "dossiersLegislatifsRefs": {
          "dossierRef": "DLR5L15N35854"
        },
        "typePointODJ": "Examen",
        "comiteSecret": "false",
        "textesAssocies": null
      }
    }
  },
  "compteRenduRef": "CRCANR5L15S2018PO59047N015",
  "formatReunion": "Ordinaire",
  "infosReunionsInternationale": {
    "estReunionInternationale": "false",
    "listePays": null,
    "informationsComplementaires": null
  }
}