{
  "@xmlns": "http://schemas.assemblee-nationale.fr/referentiel",
  "@xmlns:xsi": "http://www.w3.org/2001/XMLSchema-instance",
  "@xsi:type": "reunionInitParlementaire_type",
  "uid": "RUANR5L15S2019IDF0136649",
  "timeStampDebut": "2019-07-24T14:00:00.000+02:00",
  "timeStampFin": "2019-07-24T15:30:00.000+02:00",
  "lieu": {
    "code": "SALREU023",
    "libelleCourt": "Salle 7426",
    "libelleLong": "Salle 7426, 101, rue de l'Université"
  },
  "cycleDeVie": {
    "etat": "Annulé",
    "chrono": {
      "creation": "2019-07-02T10:10:56.000+02:00",
      "cloture": "2019-07-19T15:05:05.000+02:00"
    }
  },
  "demandeurs": {
    "acteur": {
      "nom": "Mme Annie CHAPELIER",
      "acteurRef": "PA719448"
    }
  },
  "organeReuniRef": null,
  "typeReunion": "DEP"
}