{
  "@xmlns": "http://schemas.assemblee-nationale.fr/referentiel",
  "@xmlns:xsi": "http://www.w3.org/2001/XMLSchema-instance",
  "@xsi:type": "reunionCommission_type",
  "uid": "RUANR5L15S2019IDC430905",
  "timeStampDebut": "2019-03-07T09:00:00.000+01:00",
  "timeStampFin": "2019-03-07T09:40:00.000+01:00",
  "lieu": {
    "libelleLong": "salle 6237 (Développement durable)"
  },
  "cycleDeVie": {
    "etat": "Confirmé",
    "chrono": {
      "creation": "2018-11-22T00:00:00.000+01:00",
      "cloture": null
    }
  },
  "organeReuniRef": "PO757231",
  "demandeur": null,
  "participants": {
    "participantsInternes": {
      "participantInterne": [
        {
          "acteurRef": "PA605963",
          "presence": "absent"
        },
        {
          "acteurRef": "PA721046",
          "presence": "absent"
        },
        {
          "acteurRef": "PA342415",
          "presence": "présent"
        },
        {
          "acteurRef": "PA720162",
          "presence": "absent"
        },
        {
          "acteurRef": "PA267233",
          "presence": "excusé"
        },
        {
          "acteurRef": "PA267766",
          "presence": "absent"
        },
        {
          "acteurRef": "PA720116",
          "presence": "absent"
        },
        {
          "acteurRef": "PA722000",
          "presence": "absent"
        },
        {
          "acteurRef": "PA719138",
          "presence": "absent"
        },
        {
          "acteurRef": "PA720520",
          "presence": "absent"
        },
        {
          "acteurRef": "PA719440",
          "presence": "absent"
        },
        {
          "acteurRef": "PA719740",
          "presence": "absent"
        },
        {
          "acteurRef": "PA330909",
          "presence": "absent"
        },
        {
          "acteurRef": "PA720538",
          "presence": "présent"
        },
        {
          "acteurRef": "PA712015",
          "presence": "présent"
        },
        {
          "acteurRef": "PA720652",
          "presence": "présent"
        },
        {
          "acteurRef": "PA722366",
          "presence": "absent"
        },
        {
          "acteurRef": "PA719060",
          "presence": "excusé"
        },
        {
          "acteurRef": "PA719310",
          "presence": "absent"
        },
        {
          "acteurRef": "PA719882",
          "presence": "absent"
        },
        {
          "acteurRef": "PA720738",
          "presence": "absent"
        },
        {
          "acteurRef": "PA721876",
          "presence": "absent"
        },
        {
          "acteurRef": "PA720892",
          "presence": "absent"
        },
        {
          "acteurRef": "PA721426",
          "presence": "absent"
        },
        {
          "acteurRef": "PA702052",
          "presence": "absent"
        },
        {
          "acteurRef": "PA719972",
          "presence": "présent"
        },
        {
          "acteurRef": "PA720014",
          "presence": "absent"
        },
        {
          "acteurRef": "PA720394",
          "presence": "absent"
        },
        {
          "acteurRef": "PA722110",
          "presence": "absent"
        }
      ]
    },
    "personnesAuditionnees": null
  },
  "sessionRef": null,
  "ouverturePresse": "false",
  "captationVideo": "false",
  "ODJ": {
    "convocationODJ": {
      "item": "Réunion préparatoire"
    },
    "resumeODJ": {
      "item": "réunion préparatoire."
    },
    "pointsODJ": null
  },
  "compteRenduRef": null,
  "formatReunion": "Ordinaire",
  "infosReunionsInternationale": {
    "estReunionInternationale": "false",
    "listePays": null,
    "informationsComplementaires": null
  }
}