{
  "@xmlns": "http://schemas.assemblee-nationale.fr/referentiel",
  "@xmlns:xsi": "http://www.w3.org/2001/XMLSchema-instance",
  "@xsi:type": "reunionInitParlementaire_type",
  "uid": "RUANR5L15S2019IDF0129320",
  "timeStampDebut": "2019-03-20T18:15:00.000+01:00",
  "timeStampFin": "2019-03-20T19:15:00.000+01:00",
  "lieu": {
    "code": "SALREU021",
    "libelleCourt": "Salle 7207",
    "libelleLong": "Salle 7207, 101, rue de l'Université"
  },
  "cycleDeVie": {
    "etat": "Confirmé",
    "chrono": {
      "creation": "2019-03-07T15:07:33.000+01:00",
      "cloture": null
    }
  },
  "demandeurs": {
    "acteur": {
      "nom": "Mme Valérie GOMEZ-BASSAC",
      "acteurRef": "PA721784"
    }
  },
  "organeReuniRef": null,
  "typeReunion": "DEP"
}