{
  "@xmlns": "http://schemas.assemblee-nationale.fr/referentiel",
  "@xmlns:xsi": "http://www.w3.org/2001/XMLSchema-instance",
  "@xsi:type": "reunionInitParlementaire_type",
  "uid": "RUANR5L15S2017IDF0093312",
  "timeStampDebut": "2017-07-05T08:30:00.000+02:00",
  "timeStampFin": "2017-07-05T11:00:00.000+02:00",
  "lieu": {
    "code": "SALREU014",
    "libelleCourt": "Salle 7042",
    "libelleLong": "Salle 7042, 103, rue de l'Université"
  },
  "cycleDeVie": {
    "etat": "Annulé",
    "chrono": {
      "creation": "2017-06-29T09:49:59.000+02:00",
      "cloture": "2017-06-29T13:20:06.000+02:00"
    }
  },
  "demandeurs": {
    "acteur": {
      "nom": "M. Dominique POTIER",
      "acteurRef": "PA607553"
    }
  },
  "organeReuniRef": null,
  "typeReunion": "DEP"
}