{
  "@xmlns": "http://schemas.assemblee-nationale.fr/referentiel",
  "@xmlns:xsi": "http://www.w3.org/2001/XMLSchema-instance",
  "@xsi:type": "reunionInitParlementaire_type",
  "uid": "RUANR5L15S2019IDF0119691",
  "timeStampDebut": "2018-10-17T16:00:00.000+02:00",
  "timeStampFin": "2018-10-17T18:00:00.000+02:00",
  "lieu": {
    "code": "SALREU048",
    "libelleCourt": "Salle 6809",
    "libelleLong": "Salle 6809, Palais Bourbon"
  },
  "cycleDeVie": {
    "etat": "Confirmé",
    "chrono": {
      "creation": "2018-09-28T15:59:59.000+02:00",
      "cloture": null
    }
  },
  "demandeurs": {
    "acteur": {
      "nom": "Mme Élodie JACQUIER-LAFORGE",
      "acteurRef": "PA719874"
    }
  },
  "organeReuniRef": null,
  "typeReunion": "DEP"
}