{
  "@xmlns": "http://schemas.assemblee-nationale.fr/referentiel",
  "@xmlns:xsi": "http://www.w3.org/2001/XMLSchema-instance",
  "@xsi:type": "reunionCommission_type",
  "uid": "RUANR5L15S2019IDC431602",
  "timeStampDebut": "2019-02-21T11:30:00.000+01:00",
  "lieu": {
    "libelleLong": "salle 6566 (Lois)"
  },
  "cycleDeVie": {
    "etat": "Confirmé",
    "chrono": {
      "creation": "2019-02-14T00:00:00.000+01:00",
      "cloture": null
    }
  },
  "organeReuniRef": "PO760031",
  "demandeur": null,
  "participants": {
    "participantsInternes": null,
    "personnesAuditionnees": null
  },
  "sessionRef": null,
  "ouverturePresse": "false",
  "captationVideo": "false",
  "ODJ": {
    "convocationODJ": {
      "item": "Audition de Mme Samia Melhem, responsable de la politique des technologies de l'information et de la communication de la Banque mondiale et Mme Vyjayanti Desai, gestionnaire du programme ID4D."
    },
    "resumeODJ": {
      "item": "Audition de Mme Samia Melhem, responsable de la politique des technologies de l'information et de la communication de la Banque mondiale et Mme Vyjayanti Desai, gestionnaire du programme ID4D."
    },
    "pointsODJ": null
  },
  "compteRenduRef": null,
  "formatReunion": "Ordinaire",
  "infosReunionsInternationale": {
    "estReunionInternationale": "false",
    "listePays": null,
    "informationsComplementaires": null
  }
}