{
  "@xmlns": "http://schemas.assemblee-nationale.fr/referentiel",
  "@xmlns:xsi": "http://www.w3.org/2001/XMLSchema-instance",
  "@xsi:type": "reunionCommission_type",
  "uid": "RUANR5L15S2018IDC428722",
  "timeStampDebut": "2018-03-08T10:00:00.000+01:00",
  "lieu": {
    "libelleLong": "salle 6351 (Affaires sociales)"
  },
  "cycleDeVie": {
    "etat": "Confirmé",
    "chrono": {
      "creation": "2018-02-28T00:00:00.000+01:00",
      "cloture": null
    }
  },
  "organeReuniRef": "PO748305",
  "demandeur": null,
  "participants": {
    "participantsInternes": null,
    "personnesAuditionnees": {
      "personneAuditionnee": [
        null,
        null,
        null
      ]
    }
  },
  "sessionRef": null,
  "ouverturePresse": "true",
  "captationVideo": "false",
  "ODJ": {
    "convocationODJ": {
      "item": "– Audition de M. Yves Bigot, directeur général, de M. Thomas Derobe, secrétaire général et de Mme Hélène Zemmour, directrice du numérique, du groupe TV5 Monde."
    },
    "resumeODJ": {
      "item": "audition de M. Yves Bigot, directeur général, de M. Thomas Derobe, secrétaire général et de Mme Hélène Zemmour, directrice du numérique, du groupe TV5 Monde."
    },
    "pointsODJ": null
  },
  "compteRenduRef": null,
  "formatReunion": "Ordinaire",
  "infosReunionsInternationale": {
    "estReunionInternationale": "false",
    "listePays": null,
    "informationsComplementaires": null
  }
}