{
  "@xmlns": "http://schemas.assemblee-nationale.fr/referentiel",
  "@xmlns:xsi": "http://www.w3.org/2001/XMLSchema-instance",
  "@xsi:type": "reunionInitParlementaire_type",
  "uid": "RUANR5L15S2019IDF0133903",
  "timeStampDebut": "2019-06-05T16:00:00.000+02:00",
  "timeStampFin": "2019-06-05T17:30:00.000+02:00",
  "lieu": {
    "code": "SALREU020",
    "libelleCourt": "Salon Mars II",
    "libelleLong": "Salon Mars II, 101, rue de l'Université"
  },
  "cycleDeVie": {
    "etat": "Annulé",
    "chrono": {
      "creation": "2019-05-15T16:57:55.000+02:00",
      "cloture": "2019-05-31T09:50:07.000+02:00"
    }
  },
  "demandeurs": {
    "acteur": {
      "nom": "Mme Cécile RILHAC",
      "acteurRef": "PA720900"
    }
  },
  "organeReuniRef": null,
  "typeReunion": "DEP"
}