{
  "@xmlns": "http://schemas.assemblee-nationale.fr/referentiel",
  "@xmlns:xsi": "http://www.w3.org/2001/XMLSchema-instance",
  "@xsi:type": "reunionInitParlementaire_type",
  "uid": "RUANR5L15S2018IDF0099975",
  "timeStampDebut": "2017-11-08T19:30:00.000+01:00",
  "timeStampFin": "2017-11-08T21:00:00.000+01:00",
  "lieu": {
    "code": "SALREU004",
    "libelleCourt": "1er Bureau",
    "libelleLong": "1er Bureau, Palais Bourbon"
  },
  "cycleDeVie": {
    "etat": "Confirmé",
    "chrono": {
      "creation": "2017-11-08T16:42:38.000+01:00",
      "cloture": null
    }
  },
  "demandeurs": {
    "organe": {
      "nom": "GROUPE LES CONSTRUCTIFS : RÉPUBLICAINS, UDI, INDÉPENDANTS",
      "organeRef": "PO730952"
    }
  },
  "organeReuniRef": "PO730952",
  "typeReunion": "GP"
}