{
  "@xmlns": "http://schemas.assemblee-nationale.fr/referentiel",
  "@xmlns:xsi": "http://www.w3.org/2001/XMLSchema-instance",
  "@xsi:type": "reunionInitParlementaire_type",
  "uid": "RUANR5L15S2019IDF0137962",
  "timeStampDebut": "2019-09-03T09:00:00.000+02:00",
  "timeStampFin": "2019-09-03T10:30:00.000+02:00",
  "lieu": {
    "code": "SALREU039",
    "libelleCourt": "Salle 6550",
    "libelleLong": "Salle 6550, Palais Bourbon"
  },
  "cycleDeVie": {
    "etat": "Confirmé",
    "chrono": {
      "creation": "2019-07-23T16:32:10.000+02:00",
      "cloture": null
    }
  },
  "demandeurs": {
    "acteur": [
      {
        "nom": "Mme Laurence VANCEUNEBROCK-MIALON",
        "acteurRef": "PA718728"
      },
      {
        "nom": "M. Bastien LACHAUD",
        "acteurRef": "PA720846"
      }
    ]
  },
  "organeReuniRef": null,
  "typeReunion": "DEP"
}