{
  "@xmlns": "http://schemas.assemblee-nationale.fr/referentiel",
  "@xmlns:xsi": "http://www.w3.org/2001/XMLSchema-instance",
  "@xsi:type": "reunionInitParlementaire_type",
  "uid": "RUANR5L15S2018IDF0114264",
  "timeStampDebut": "2018-07-10T19:00:00.000+02:00",
  "timeStampFin": "2018-07-10T21:30:00.000+02:00",
  "lieu": {
    "code": "SALREU016",
    "libelleCourt": "Salon Gabriel",
    "libelleLong": "Salon Gabriel, 101, rue de l'Université"
  },
  "cycleDeVie": {
    "etat": "Annulé",
    "chrono": {
      "creation": "2018-06-26T12:21:52.000+02:00",
      "cloture": "2018-07-10T11:00:05.000+02:00"
    }
  },
  "demandeurs": {
    "acteur": {
      "nom": "M. Philippe GOMÈS",
      "acteurRef": "PA610775"
    }
  },
  "organeReuniRef": null,
  "typeReunion": "DEP"
}