{
  "@xmlns": "http://schemas.assemblee-nationale.fr/referentiel",
  "@xmlns:xsi": "http://www.w3.org/2001/XMLSchema-instance",
  "@xsi:type": "reunionCommission_type",
  "uid": "RUANR5L15S2019IDC433635",
  "timeStampDebut": "2019-09-24T17:00:00.000+02:00",
  "lieu": {
    "libelleLong": "Salle Victor Hugo"
  },
  "cycleDeVie": {
    "etat": "Confirmé",
    "chrono": {
      "creation": "2019-09-11T00:00:00.000+02:00",
      "cloture": null
    }
  },
  "organeReuniRef": "PO733612",
  "demandeur": null,
  "participants": {
    "participantsInternes": null,
    "personnesAuditionnees": null
  },
  "sessionRef": null,
  "ouverturePresse": "false",
  "captationVideo": "false",
  "ODJ": {
    "convocationODJ": {
      "item": "Colloque organisé par le groupe d'amitié France-Pakistan, présidé par M. Jean-Bernard Sempastous, sur la situation au Cachemire, en présence de MM. Jean-Luc Racine, Shahzamane Haque et Olivier Guillard, chercheurs, de Mme Maryse Artiguelong, vice-présidente de la Ligue des droits de l’homme, et de M. Sardar Muhammad Masood Khan, président de la région Azad-Jammu-Cachemire"
    },
    "resumeODJ": {
      "item": "Colloque organisé par le groupe d'amitié France-Pakistan, présidé par M. Jean-Bernard Sempastous, sur la situation au Cachemire, en présence de MM. Jean-Luc Racine, Shahzamane Haque et Olivier Guillard, chercheurs, de Mme Maryse Artiguelong, vice-présidente de la Ligue des droits de l’homme, et de M. Sardar Muhammad Masood Khan, président de la région Azad-Jammu-Cachemire"
    },
    "pointsODJ": null
  },
  "compteRenduRef": null,
  "formatReunion": "Ordinaire",
  "infosReunionsInternationale": {
    "estReunionInternationale": "true",
    "listePays": {
      "paysRef": "GOP756450"
    },
    "informationsComplementaires": "Alexandre Michel - 39707"
  }
}