{
  "@xmlns": "http://schemas.assemblee-nationale.fr/referentiel",
  "@xmlns:xsi": "http://www.w3.org/2001/XMLSchema-instance",
  "@xsi:type": "seance_type",
  "uid": "RUANR5L15S2018IDS20869",
  "timeStampDebut": "2018-01-25T21:30:00.000+01:00",
  "lieu": {
    "code": "AN",
    "libelleLong": "Assemblée nationale"
  },
  "cycleDeVie": {
    "etat": "Supprimé",
    "chrono": {
      "creation": "2017-12-15T00:00:00.000+01:00",
      "cloture": "2018-01-25T00:00:00.000+01:00"
    }
  },
  "organeReuniRef": "PO717460",
  "demandeur": null,
  "participants": null,
  "sessionRef": "SCR5A2018O1",
  "ouverturePresse": "true",
  "captationVideo": "true",
  "ODJ": {
    "convocationODJ": null,
    "resumeODJ": null,
    "pointsODJ": {
      "pointODJ": {
        "@xsi:type": "podjSeanceConfPres_type",
        "uid": "RUANR5L15S2018IDS20869PT35450",
        "cycleDeVie": {
          "etat": "Supprimé",
          "chrono": {
            "creation": "2017-12-18T00:00:00.000+01:00",
            "cloture": "2018-01-25T00:00:00.000+01:00"
          }
        },
        "objet": "Suite de la discussion du projet de loi pour un État au service d’une société de confiance",
        "demandeurPoint": null,
        "procedure": null,
        "dossiersLegislatifsRefs": null,
        "typePointODJ": "Suite de la discussion",
        "comiteSecret": "false",
        "textesAssocies": null,
        "natureTravauxODJ": "ODJPR"
      }
    }
  },
  "compteRenduRef": null,
  "identifiants": {
    "numSeanceJO": null,
    "idJO": null,
    "quantieme": "Troisième",
    "DateSeance": "2018-01-25+01:00"
  }
}