{
  "@xmlns": "http://schemas.assemblee-nationale.fr/referentiel",
  "@xmlns:xsi": "http://www.w3.org/2001/XMLSchema-instance",
  "@xsi:type": "reunionCommission_type",
  "uid": "RUANR5L15S2019IDC430737",
  "timeStampDebut": "2018-12-06T09:30:00.000+01:00",
  "lieu": {
    "libelleLong": "salle 4013 (33 rue Saint-Dominique)"
  },
  "cycleDeVie": {
    "etat": "Confirmé",
    "chrono": {
      "creation": "2018-11-02T00:00:00.000+01:00",
      "cloture": null
    }
  },
  "organeReuniRef": "PO756121",
  "demandeur": null,
  "participants": {
    "participantsInternes": null,
    "personnesAuditionnees": null
  },
  "sessionRef": null,
  "ouverturePresse": "false",
  "captationVideo": "false",
  "ODJ": {
    "convocationODJ": {
      "item": "Audition de AIDES, association de lutte contre le sida et les hépatites en France : . Laurent Pallot, secrétaire général de l'association AIDES, M. Enzo Poultreniez, responsable Plaidoyer et Revendications, association AIDES, et Mme Chloé Le Gouëz, chargée de mission Plaidoyer Accès aux droits, association AIDES"
    },
    "resumeODJ": {
      "item": "audition de AIDES, association de lutte contre le sida et les hépatites en France : . Laurent Pallot, secrétaire général de l'association AIDES, M. Enzo Poultreniez, responsable Plaidoyer et Revendications, association AIDES, et Mme Chloé Le Gouëz, chargée de mission Plaidoyer Accès aux droits, association AIDES."
    },
    "pointsODJ": null
  },
  "compteRenduRef": null,
  "formatReunion": "Ordinaire",
  "infosReunionsInternationale": {
    "estReunionInternationale": "false",
    "listePays": null,
    "informationsComplementaires": null
  }
}