{
  "@xmlns": "http://schemas.assemblee-nationale.fr/referentiel",
  "@xmlns:xsi": "http://www.w3.org/2001/XMLSchema-instance",
  "@xsi:type": "reunionInitParlementaire_type",
  "uid": "RUANR5L15S2018IDF0114247",
  "timeStampDebut": "2018-07-03T16:00:00.000+02:00",
  "timeStampFin": "2018-07-03T17:00:00.000+02:00",
  "lieu": {
    "code": "SALREU038",
    "libelleCourt": "Salle 6549",
    "libelleLong": "Salle 6549, Palais Bourbon"
  },
  "cycleDeVie": {
    "etat": "Confirmé",
    "chrono": {
      "creation": "2018-06-26T08:53:34.000+02:00",
      "cloture": null
    }
  },
  "demandeurs": {
    "acteur": [
      {
        "nom": "M. Gilles LURTON",
        "acteurRef": "PA606712"
      },
      {
        "nom": "Mme Fadila KHATTABI",
        "acteurRef": "PA719186"
      }
    ]
  },
  "organeReuniRef": null,
  "typeReunion": "DEP"
}