{
  "@xmlns": "http://schemas.assemblee-nationale.fr/referentiel",
  "@xmlns:xsi": "http://www.w3.org/2001/XMLSchema-instance",
  "@xsi:type": "reunionInitParlementaire_type",
  "uid": "RUANR5L15S2017IDF0095883",
  "timeStampDebut": "2017-09-15T16:00:00.000+02:00",
  "timeStampFin": "2017-09-15T17:00:00.000+02:00",
  "lieu": {
    "code": "SALREU007",
    "libelleCourt": "4ème Bureau",
    "libelleLong": "4ème Bureau, Palais Bourbon"
  },
  "cycleDeVie": {
    "etat": "Confirmé",
    "chrono": {
      "creation": "2017-09-07T17:58:46.000+02:00",
      "cloture": null
    }
  },
  "demandeurs": {
    "acteur": {
      "nom": "Mme Olivia GREGOIRE",
      "acteurRef": "PA721764"
    }
  },
  "organeReuniRef": null,
  "typeReunion": "DEP"
}