{
  "@xmlns": "http://schemas.assemblee-nationale.fr/referentiel",
  "@xmlns:xsi": "http://www.w3.org/2001/XMLSchema-instance",
  "@xsi:type": "reunionInitParlementaire_type",
  "uid": "RUANR5L15S2019IDF0119739",
  "timeStampDebut": "2018-10-18T14:30:00.000+02:00",
  "timeStampFin": "2018-10-18T18:00:00.000+02:00",
  "lieu": {
    "code": "SALREU022",
    "libelleCourt": "Salle 7326",
    "libelleLong": "Salle 7326, 101, rue de l'Université"
  },
  "cycleDeVie": {
    "etat": "Confirmé",
    "chrono": {
      "creation": "2018-10-01T10:36:18.000+02:00",
      "cloture": null
    }
  },
  "demandeurs": {
    "acteur": {
      "nom": "M. François CORMIER-BOULIGEON",
      "acteurRef": "PA719118"
    }
  },
  "organeReuniRef": null,
  "typeReunion": "DEP"
}