{
  "@xmlns": "http://schemas.assemblee-nationale.fr/referentiel",
  "@xmlns:xsi": "http://www.w3.org/2001/XMLSchema-instance",
  "@xsi:type": "reunionCommission_type",
  "uid": "RUANR5L15S2018IDC429126",
  "timeStampDebut": "2018-04-17T10:35:00.000+02:00",
  "timeStampFin": "2018-04-17T11:55:00.000+02:00",
  "lieu": {
    "libelleLong": "salle 6242 (Lois)"
  },
  "cycleDeVie": {
    "etat": "Confirmé",
    "chrono": {
      "creation": "2018-04-06T00:00:00.000+02:00",
      "cloture": null
    }
  },
  "organeReuniRef": "PO201269",
  "demandeur": null,
  "participants": {
    "participantsInternes": {
      "participantInterne": [
        {
          "acteurRef": "PA719318",
          "presence": "présent"
        },
        {
          "acteurRef": "PA719806",
          "presence": "présent"
        },
        {
          "acteurRef": "PA719558",
          "presence": "présent"
        },
        {
          "acteurRef": "PA342415",
          "presence": "excusé"
        },
        {
          "acteurRef": "PA720210",
          "presence": "absent"
        },
        {
          "acteurRef": "PA441",
          "presence": "présent"
        },
        {
          "acteurRef": "PA330684",
          "presence": "présent"
        },
        {
          "acteurRef": "PA719496",
          "presence": "présent"
        },
        {
          "acteurRef": "PA721750",
          "presence": "absent"
        },
        {
          "acteurRef": "PA429893",
          "presence": "absent"
        },
        {
          "acteurRef": "PA719448",
          "presence": "présent"
        },
        {
          "acteurRef": "PA267429",
          "presence": "présent"
        },
        {
          "acteurRef": "PA719624",
          "presence": "présent"
        },
        {
          "acteurRef": "PA608826",
          "presence": "absent"
        },
        {
          "acteurRef": "PA721742",
          "presence": "absent"
        },
        {
          "acteurRef": "PA721384",
          "presence": "présent"
        },
        {
          "acteurRef": "PA720806",
          "presence": "présent"
        },
        {
          "acteurRef": "PA605991",
          "presence": "absent"
        },
        {
          "acteurRef": "PA721296",
          "presence": "présent"
        },
        {
          "acteurRef": "PA722054",
          "presence": "présent"
        },
        {
          "acteurRef": "PA267801",
          "presence": "absent"
        },
        {
          "acteurRef": "PA720202",
          "presence": "absent"
        },
        {
          "acteurRef": "PA719842",
          "presence": "présent"
        },
        {
          "acteurRef": "PA720916",
          "presence": "absent"
        },
        {
          "acteurRef": "PA720342",
          "presence": "présent"
        },
        {
          "acteurRef": "PA334116",
          "presence": "absent"
        },
        {
          "acteurRef": "PA721656",
          "presence": "excusé"
        },
        {
          "acteurRef": "PA719520",
          "presence": "absent"
        },
        {
          "acteurRef": "PA719632",
          "presence": "présent"
        },
        {
          "acteurRef": "PA718736",
          "presence": "absent"
        },
        {
          "acteurRef": "PA720720",
          "presence": "absent"
        },
        {
          "acteurRef": "PA720552",
          "presence": "présent"
        },
        {
          "acteurRef": "PA722252",
          "presence": "présent"
        },
        {
          "acteurRef": "PA722022",
          "presence": "présent"
        },
        {
          "acteurRef": "PA718860",
          "presence": "présent"
        },
        {
          "acteurRef": "PA718780",
          "presence": "absent"
        },
        {
          "acteurRef": "PA721474",
          "presence": "absent"
        }
      ]
    },
    "personnesAuditionnees": null
  },
  "sessionRef": null,
  "ouverturePresse": "true",
  "captationVideo": "false",
  "ODJ": {
    "convocationODJ": {
      "item": "Audition, ouverte à la presse, de Mme Marlène Schiappa, Secrétaire d’État auprès du Premier ministre, chargée de l’Égalité entre les femmes et les hommes, sur le projet de loi renforçant la lutte contre les violences sexuelles et sexistes (Mme Marie-Pierre Rixain et M. Erwan Balanant, co rapporteurs)."
    },
    "resumeODJ": {
      "item": "audition, ouverte à la presse, de Mme Marlène Schiappa, Secrétaire d’État auprès du Premier ministre, chargée de l’Égalité entre les femmes et les hommes, sur le projet de loi renforçant la lutte contre les violences sexuelles et sexistes (Mme Marie-Pierre Rixain et M. Erwan Balanant, co rapporteurs)."
    },
    "pointsODJ": {
      "pointODJ": {
        "@xsi:type": "podjReunion_type",
        "uid": "RUANR5L15S2018IDC429126PT25615",
        "cycleDeVie": {
          "etat": "Eventuel",
          "chrono": {
            "creation": "2018-04-06T00:00:00.000+02:00",
            "cloture": null
          }
        },
        "objet": "Audition de Mme Marlène Schiappa, Secrétaire d'État auprès du Premier ministre, chargée de l'Égalité entre les femmes et les hommes",
        "demandeurPoint": null,
        "procedure": null,
        "dossiersLegislatifsRefs": {
          "dossierRef": "DLR5L15N36496"
        },
        "typePointODJ": "Audition",
        "comiteSecret": "false",
        "textesAssocies": null
      }
    }
  },
  "compteRenduRef": "CRCANR5L15S2018PO201269N029",
  "formatReunion": "Ordinaire",
  "infosReunionsInternationale": {
    "estReunionInternationale": "false",
    "listePays": null,
    "informationsComplementaires": null
  }
}