{
  "@xmlns": "http://schemas.assemblee-nationale.fr/referentiel",
  "@xmlns:xsi": "http://www.w3.org/2001/XMLSchema-instance",
  "@xsi:type": "reunionInitParlementaire_type",
  "uid": "RUANR5L15S2018IDF0113378",
  "timeStampDebut": "2018-07-04T17:00:00.000+02:00",
  "timeStampFin": "2018-07-04T18:00:00.000+02:00",
  "lieu": {
    "code": "SALREU012",
    "libelleCourt": "Salle N° 23",
    "libelleLong": "Salle N° 23, 3, rue Aristide Briand"
  },
  "cycleDeVie": {
    "etat": "Confirmé",
    "chrono": {
      "creation": "2018-06-11T09:14:04.000+02:00",
      "cloture": null
    }
  },
  "demandeurs": {
    "organe": {
      "nom": "Groupe d'amitié France-Ukraine",
      "organeRef": "PO733312"
    }
  },
  "organeReuniRef": "PO733312",
  "typeReunion": "GA"
}