{
  "@xmlns": "http://schemas.assemblee-nationale.fr/referentiel",
  "@xmlns:xsi": "http://www.w3.org/2001/XMLSchema-instance",
  "@xsi:type": "reunionInitParlementaire_type",
  "uid": "RUANR5L15S2018IDF0097103",
  "timeStampDebut": "2017-10-02T14:00:00.000+02:00",
  "timeStampFin": "2017-10-02T19:00:00.000+02:00",
  "lieu": {
    "code": "SALREU038",
    "libelleCourt": "Salle 6549",
    "libelleLong": "Salle 6549, Palais Bourbon"
  },
  "cycleDeVie": {
    "etat": "Confirmé",
    "chrono": {
      "creation": "2017-09-26T16:41:12.000+02:00",
      "cloture": null
    }
  },
  "demandeurs": {
    "acteur": {
      "nom": "Mme Élodie JACQUIER-LAFORGE",
      "acteurRef": "PA719874"
    }
  },
  "organeReuniRef": null,
  "typeReunion": "DEP"
}