{
  "@xmlns": "http://schemas.assemblee-nationale.fr/referentiel",
  "@xmlns:xsi": "http://www.w3.org/2001/XMLSchema-instance",
  "@xsi:type": "reunionInitParlementaire_type",
  "uid": "RUANR5L15S2019IDF0115540",
  "timeStampDebut": "2018-10-09T14:00:00.000+02:00",
  "timeStampFin": "2018-10-09T15:00:00.000+02:00",
  "lieu": {
    "code": "SALREU038",
    "libelleCourt": "Salle 6549",
    "libelleLong": "Salle 6549, Palais Bourbon"
  },
  "cycleDeVie": {
    "etat": "Confirmé",
    "chrono": {
      "creation": "2018-07-11T17:29:04.000+02:00",
      "cloture": null
    }
  },
  "demandeurs": {
    "acteur": [
      {
        "nom": "Mme Cécile UNTERMAIER",
        "acteurRef": "PA608695"
      },
      {
        "nom": "M. Jean TERLIER",
        "acteurRef": "PA721584"
      }
    ]
  },
  "organeReuniRef": null,
  "typeReunion": "DEP"
}