{
  "@xmlns": "http://schemas.assemblee-nationale.fr/referentiel",
  "@xmlns:xsi": "http://www.w3.org/2001/XMLSchema-instance",
  "@xsi:type": "reunionInitParlementaire_type",
  "uid": "RUANR5L15S2019IDF0123201",
  "timeStampDebut": "2018-12-04T11:30:00.000+01:00",
  "timeStampFin": "2018-12-04T13:00:00.000+01:00",
  "lieu": {
    "code": "SALREU048",
    "libelleCourt": "Salle 6809",
    "libelleLong": "Salle 6809, Palais Bourbon"
  },
  "cycleDeVie": {
    "etat": "Confirmé",
    "chrono": {
      "creation": "2018-11-29T15:19:19.000+01:00",
      "cloture": null
    }
  },
  "demandeurs": {
    "acteur": {
      "nom": "Mme Nadia RAMASSAMY",
      "acteurRef": "PA721070"
    }
  },
  "organeReuniRef": null,
  "typeReunion": "DEP"
}