{
  "@xmlns": "http://schemas.assemblee-nationale.fr/referentiel",
  "@xmlns:xsi": "http://www.w3.org/2001/XMLSchema-instance",
  "@xsi:type": "reunionCommission_type",
  "uid": "RUANR5L15S2018IDC427726",
  "timeStampDebut": "2017-12-14T14:30:00.000+01:00",
  "lieu": {
    "libelleLong": "salle 4013 (33 rue Saint-Dominique)"
  },
  "cycleDeVie": {
    "etat": "Confirmé",
    "chrono": {
      "creation": "2017-11-03T00:00:00.000+01:00",
      "cloture": null
    }
  },
  "organeReuniRef": "PO734965",
  "demandeur": null,
  "participants": {
    "participantsInternes": null,
    "personnesAuditionnees": null
  },
  "sessionRef": null,
  "ouverturePresse": "false",
  "captationVideo": "false",
  "ODJ": {
    "convocationODJ": {
      "item": "Audition de M. Christophe Fournier, directeur des plans des programmes et du budget et directeur des plans des programmes et du budget , et de l'IGA Eveline Spina ;"
    },
    "resumeODJ": {
      "item": "audition de M. Christophe Fournier, directeur des plans des programmes et du budget et directeur des plans des programmes et du budget , et de l'IGA Eveline Spina ;"
    },
    "pointsODJ": null
  },
  "compteRenduRef": null,
  "formatReunion": "Ordinaire",
  "infosReunionsInternationale": {
    "estReunionInternationale": "false",
    "listePays": null,
    "informationsComplementaires": null
  }
}