{
  "@xmlns": "http://schemas.assemblee-nationale.fr/referentiel",
  "@xmlns:xsi": "http://www.w3.org/2001/XMLSchema-instance",
  "@xsi:type": "reunionCommission_type",
  "uid": "RUANR5L15S2018IDC427603",
  "timeStampDebut": "2017-10-18T17:00:00.000+02:00",
  "timeStampFin": "2017-10-18T19:30:00.000+02:00",
  "lieu": {
    "libelleLong": "salle 6242 (Lois)"
  },
  "cycleDeVie": {
    "etat": "Confirmé",
    "chrono": {
      "creation": "2017-10-17T00:00:00.000+02:00",
      "cloture": null
    }
  },
  "organeReuniRef": "PO59051",
  "demandeur": null,
  "participants": {
    "participantsInternes": {
      "participantInterne": [
        {
          "acteurRef": "PA719866",
          "presence": "présent"
        },
        {
          "acteurRef": "PA721624",
          "presence": "présent"
        },
        {
          "acteurRef": "PA719558",
          "presence": "présent"
        },
        {
          "acteurRef": "PA441",
          "presence": "excusé"
        },
        {
          "acteurRef": "PA720430",
          "presence": "présent"
        },
        {
          "acteurRef": "PA606507",
          "presence": "présent"
        },
        {
          "acteurRef": "PA721908",
          "presence": "présent"
        },
        {
          "acteurRef": "PA330008",
          "presence": "absent"
        },
        {
          "acteurRef": "PA330008",
          "presence": "présent"
        },
        {
          "acteurRef": "PA720772",
          "presence": "présent"
        },
        {
          "acteurRef": "PA719748",
          "presence": "absent"
        },
        {
          "acteurRef": "PA330240",
          "presence": "absent"
        },
        {
          "acteurRef": "PA336439",
          "presence": "présent"
        },
        {
          "acteurRef": "PA606212",
          "presence": "absent"
        },
        {
          "acteurRef": "PA721398",
          "presence": "présent"
        },
        {
          "acteurRef": "PA267440",
          "presence": "présent"
        },
        {
          "acteurRef": "PA719684",
          "presence": "présent"
        },
        {
          "acteurRef": "PA720154",
          "presence": "présent"
        },
        {
          "acteurRef": "PA721094",
          "presence": "excusé"
        },
        {
          "acteurRef": "PA330357",
          "presence": "présent"
        },
        {
          "acteurRef": "PA719616",
          "presence": "présent"
        },
        {
          "acteurRef": "PA721564",
          "presence": "présent"
        },
        {
          "acteurRef": "PA721702",
          "presence": "présent"
        },
        {
          "acteurRef": "PA721742",
          "presence": "présent"
        },
        {
          "acteurRef": "PA721142",
          "presence": "présent"
        },
        {
          "acteurRef": "PA721364",
          "presence": "présent"
        },
        {
          "acteurRef": "PA266797",
          "presence": "absent"
        },
        {
          "acteurRef": "PA721880",
          "presence": "excusé"
        },
        {
          "acteurRef": "PA1592",
          "presence": "présent"
        },
        {
          "acteurRef": "PA720454",
          "presence": "présent"
        },
        {
          "acteurRef": "PA722150",
          "presence": "présent"
        },
        {
          "acteurRef": "PA267200",
          "presence": "absent"
        },
        {
          "acteurRef": "PA719874",
          "presence": "présent"
        },
        {
          "acteurRef": "PA267901",
          "presence": "excusé"
        },
        {
          "acteurRef": "PA719994",
          "presence": "absent"
        },
        {
          "acteurRef": "PA335054",
          "presence": "absent"
        },
        {
          "acteurRef": "PA267785",
          "presence": "excusé"
        },
        {
          "acteurRef": "PA721984",
          "presence": "excusé"
        },
        {
          "acteurRef": "PA721932",
          "presence": "présent"
        },
        {
          "acteurRef": "PA718918",
          "presence": "présent"
        },
        {
          "acteurRef": "PA606098",
          "presence": "excusé"
        },
        {
          "acteurRef": "PA346218",
          "presence": "présent"
        },
        {
          "acteurRef": "PA721800",
          "presence": "excusé"
        },
        {
          "acteurRef": "PA677483",
          "presence": "présent"
        },
        {
          "acteurRef": "PA719952",
          "presence": "présent"
        },
        {
          "acteurRef": "PA607619",
          "presence": "présent"
        },
        {
          "acteurRef": "PA266788",
          "presence": "absent"
        },
        {
          "acteurRef": "PA720908",
          "presence": "présent"
        },
        {
          "acteurRef": "PA721960",
          "presence": "présent"
        },
        {
          "acteurRef": "PA719202",
          "presence": "présent"
        },
        {
          "acteurRef": "PA721270",
          "presence": "présent"
        },
        {
          "acteurRef": "PA2449",
          "presence": "présent"
        },
        {
          "acteurRef": "PA719600",
          "presence": "présent"
        },
        {
          "acteurRef": "PA720100",
          "presence": "présent"
        },
        {
          "acteurRef": "PA643127",
          "presence": "présent"
        },
        {
          "acteurRef": "PA722398",
          "presence": "présent"
        },
        {
          "acteurRef": "PA721678",
          "presence": "présent"
        },
        {
          "acteurRef": "PA722292",
          "presence": "présent"
        },
        {
          "acteurRef": "PA332747",
          "presence": "excusé"
        },
        {
          "acteurRef": "PA721616",
          "presence": "présent"
        },
        {
          "acteurRef": "PA702052",
          "presence": "excusé"
        },
        {
          "acteurRef": "PA721314",
          "presence": "présent"
        },
        {
          "acteurRef": "PA334654",
          "presence": "présent"
        },
        {
          "acteurRef": "PA721584",
          "presence": "présent"
        },
        {
          "acteurRef": "PA719302",
          "presence": "absent"
        },
        {
          "acteurRef": "PA2828",
          "presence": "présent"
        },
        {
          "acteurRef": "PA608695",
          "presence": "présent"
        },
        {
          "acteurRef": "PA267622",
          "presence": "présent"
        },
        {
          "acteurRef": "PA709315",
          "presence": "présent"
        },
        {
          "acteurRef": "PA720704",
          "presence": "présent"
        },
        {
          "acteurRef": "PA722260",
          "presence": "absent"
        },
        {
          "acteurRef": "PA721262",
          "presence": "présent"
        },
        {
          "acteurRef": "PA2952",
          "presence": "présent"
        },
        {
          "acteurRef": "PA720318",
          "presence": "présent"
        },
        {
          "acteurRef": "PA267330",
          "presence": "présent"
        }
      ]
    },
    "personnesAuditionnees": null
  },
  "sessionRef": null,
  "ouverturePresse": "true",
  "captationVideo": "false",
  "ODJ": {
    "convocationODJ": {
      "item": [
        "Audition de Mme Nicole Belloubet, Garde des Sceaux, ministre de la Justice ;",
        "Nomination d'un rapporteur sur les pétitions ;",
        "Nomination de deux membres de la Commission supérieure de codification ;",
        "Proposition de nomination au comité chargé d'assister la plate-forme nationale des interceptions judiciaires ;",
        "Désignation de membres de la commission des Lois pour participer à une étude du Comité d'évaluation et de contrôle des politiques publiques sur \" L'action de l'État dans l'exercice de ses missions régaliennes en Seine-Saint-Denis \" ;",
        "Création d’une mission d’information pour une nouvelle étape de la décentralisation en faveur des pôles de développement territoriaux."
      ]
    },
    "resumeODJ": {
      "item": [
        "audition de Mme Nicole Belloubet, Garde des Sceaux, ministre de la Justice ;",
        "nomination d'un rapporteur sur les pétitions ;",
        "nomination de deux membres de la Commission supérieure de codification ;",
        "proposition de nomination au comité chargé d'assister la plate-forme nationale des interceptions judiciaires ;",
        "désignation de membres de la commission des Lois pour participer à une étude du Comité d'évaluation et de contrôle des politiques publiques sur \" L'action de l'État dans l'exercice de ses missions régaliennes en Seine-Saint-Denis \" ;",
        "création d’une mission d’information pour une nouvelle étape de la décentralisation en faveur des pôles de développement territoriaux."
      ]
    },
    "pointsODJ": null
  },
  "compteRenduRef": "CRCANR5L15S2018PO59051N005",
  "formatReunion": "Ordinaire",
  "infosReunionsInternationale": {
    "estReunionInternationale": "false",
    "listePays": null,
    "informationsComplementaires": null
  }
}