{
  "@xmlns": "http://schemas.assemblee-nationale.fr/referentiel",
  "@xmlns:xsi": "http://www.w3.org/2001/XMLSchema-instance",
  "@xsi:type": "reunionInitParlementaire_type",
  "uid": "RUANR5L15S2019IDF0129545",
  "timeStampDebut": "2019-05-21T09:00:00.000+02:00",
  "timeStampFin": "2019-05-21T12:00:00.000+02:00",
  "lieu": {
    "code": "SALREU016",
    "libelleCourt": "Salon Gabriel",
    "libelleLong": "Salon Gabriel, 101, rue de l'Université"
  },
  "cycleDeVie": {
    "etat": "Confirmé",
    "chrono": {
      "creation": "2019-03-11T0014:35.000+02:00",
      "cloture": null
    }
  },
  "demandeurs": {
    "organe": {
      "nom": "GROUPE LA FRANCE INSOUMISE",
      "organeRef": "PO730958"
    }
  },
  "organeReuniRef": "PO730958",
  "typeReunion": "GP"
}