{
  "@xmlns": "http://schemas.assemblee-nationale.fr/referentiel",
  "@xmlns:xsi": "http://www.w3.org/2001/XMLSchema-instance",
  "@xsi:type": "reunionInitParlementaire_type",
  "uid": "RUANR5L15S2018IDF0104912",
  "timeStampDebut": "2018-03-08T10:30:00.000+01:00",
  "timeStampFin": "2018-03-08T12:00:00.000+01:00",
  "lieu": {
    "code": "SALREU007",
    "libelleCourt": "4ème Bureau",
    "libelleLong": "4ème Bureau, Palais Bourbon"
  },
  "cycleDeVie": {
    "etat": "Annulé",
    "chrono": {
      "creation": "2018-02-01T12:08:06.000+01:00",
      "cloture": "2018-02-12T13:36:17.000+01:00"
    }
  },
  "demandeurs": {
    "acteur": {
      "nom": "Mme Fabienne COLBOC",
      "acteurRef": "PA719814"
    }
  },
  "organeReuniRef": null,
  "typeReunion": "DEP"
}