{
  "@xmlns": "http://schemas.assemblee-nationale.fr/referentiel",
  "@xmlns:xsi": "http://www.w3.org/2001/XMLSchema-instance",
  "@xsi:type": "reunionCommission_type",
  "uid": "RUANR5L15S2018IDC428147",
  "timeStampDebut": "2018-01-10T12:50:00.000+01:00",
  "timeStampFin": "2018-01-10T13:55:00.000+01:00",
  "lieu": {
    "libelleLong": "salle 6237"
  },
  "cycleDeVie": {
    "etat": "Confirmé",
    "chrono": {
      "creation": "2017-12-15T00:00:00.000+01:00",
      "cloture": null
    }
  },
  "organeReuniRef": "PO744107",
  "demandeur": null,
  "participants": {
    "participantsInternes": {
      "participantInterne": [
        {
          "acteurRef": "PA609726",
          "presence": "excusé"
        },
        {
          "acteurRef": "PA722170",
          "presence": "présent"
        },
        {
          "acteurRef": "PA720430",
          "presence": "présent"
        },
        {
          "acteurRef": "PA718876",
          "presence": "absent"
        },
        {
          "acteurRef": "PA608641",
          "presence": "absent"
        },
        {
          "acteurRef": "PA642695",
          "presence": "absent"
        },
        {
          "acteurRef": "PA718838",
          "presence": "absent"
        },
        {
          "acteurRef": "PA720546",
          "presence": "absent"
        },
        {
          "acteurRef": "PA720520",
          "presence": "présent"
        },
        {
          "acteurRef": "PA721860",
          "presence": "absent"
        },
        {
          "acteurRef": "PA719740",
          "presence": "absent"
        },
        {
          "acteurRef": "PA607155",
          "presence": "présent"
        },
        {
          "acteurRef": "PA720932",
          "presence": "présent"
        },
        {
          "acteurRef": "PA721398",
          "presence": "absent"
        },
        {
          "acteurRef": "PA712015",
          "presence": "absent"
        },
        {
          "acteurRef": "PA608292",
          "presence": "présent"
        },
        {
          "acteurRef": "PA607193",
          "presence": "présent"
        },
        {
          "acteurRef": "PA722284",
          "presence": "absent"
        },
        {
          "acteurRef": "PA1498",
          "presence": "absent"
        },
        {
          "acteurRef": "PA266797",
          "presence": "excusé"
        },
        {
          "acteurRef": "PA720170",
          "presence": "absent"
        },
        {
          "acteurRef": "PA721498",
          "presence": "présent"
        },
        {
          "acteurRef": "PA719652",
          "presence": "présent"
        },
        {
          "acteurRef": "PA718794",
          "presence": "présent"
        },
        {
          "acteurRef": "PA719874",
          "presence": "présent"
        },
        {
          "acteurRef": "PA335054",
          "presence": "excusé"
        },
        {
          "acteurRef": "PA721514",
          "presence": "absent"
        },
        {
          "acteurRef": "PA718978",
          "presence": "présent"
        },
        {
          "acteurRef": "PA331567",
          "presence": "absent"
        },
        {
          "acteurRef": "PA720764",
          "presence": "présent"
        },
        {
          "acteurRef": "PA719728",
          "presence": "présent"
        },
        {
          "acteurRef": "PA712014",
          "presence": "absent"
        },
        {
          "acteurRef": "PA720342",
          "presence": "excusé"
        },
        {
          "acteurRef": "PA719858",
          "presence": "excusé"
        },
        {
          "acteurRef": "PA608016",
          "presence": "absent"
        },
        {
          "acteurRef": "PA346054",
          "presence": "présent"
        },
        {
          "acteurRef": "PA721726",
          "presence": "excusé"
        },
        {
          "acteurRef": "PA677483",
          "presence": "présent"
        },
        {
          "acteurRef": "PA719130",
          "presence": "présent"
        },
        {
          "acteurRef": "PA721976",
          "presence": "présent"
        },
        {
          "acteurRef": "PA719456",
          "presence": "présent"
        },
        {
          "acteurRef": "PA719242",
          "presence": "absent"
        },
        {
          "acteurRef": "PA719850",
          "presence": "présent"
        },
        {
          "acteurRef": "PA721486",
          "presence": "absent"
        },
        {
          "acteurRef": "PA718784",
          "presence": "absent"
        },
        {
          "acteurRef": "PA607595",
          "presence": "absent"
        },
        {
          "acteurRef": "PA721270",
          "presence": "absent"
        },
        {
          "acteurRef": "PA720512",
          "presence": "absent"
        },
        {
          "acteurRef": "PA720590",
          "presence": "présent"
        },
        {
          "acteurRef": "PA643127",
          "presence": "excusé"
        },
        {
          "acteurRef": "PA609590",
          "presence": "présent"
        },
        {
          "acteurRef": "PA721678",
          "presence": "absent"
        },
        {
          "acteurRef": "PA266776",
          "presence": "excusé"
        },
        {
          "acteurRef": "PA720066",
          "presence": "absent"
        },
        {
          "acteurRef": "PA718902",
          "presence": "présent"
        },
        {
          "acteurRef": "PA721226",
          "presence": "absent"
        },
        {
          "acteurRef": "PA720878",
          "presence": "présent"
        },
        {
          "acteurRef": "PA720960",
          "presence": "excusé"
        },
        {
          "acteurRef": "PA334654",
          "presence": "présent"
        },
        {
          "acteurRef": "PA722118",
          "presence": "absent"
        },
        {
          "acteurRef": "PA721690",
          "presence": "absent"
        },
        {
          "acteurRef": "PA722086",
          "presence": "absent"
        },
        {
          "acteurRef": "PA2792",
          "presence": "absent"
        },
        {
          "acteurRef": "PA721584",
          "presence": "absent"
        },
        {
          "acteurRef": "PA719302",
          "presence": "excusé"
        },
        {
          "acteurRef": "PA720014",
          "presence": "absent"
        },
        {
          "acteurRef": "PA718682",
          "presence": "présent"
        },
        {
          "acteurRef": "PA722162",
          "presence": "absent"
        },
        {
          "acteurRef": "PA608695",
          "presence": "absent"
        },
        {
          "acteurRef": "PA719930",
          "presence": "absent"
        },
        {
          "acteurRef": "PA709315",
          "presence": "présent"
        },
        {
          "acteurRef": "PA2952",
          "presence": "absent"
        }
      ]
    },
    "personnesAuditionnees": null
  },
  "sessionRef": null,
  "ouverturePresse": "true",
  "captationVideo": "false",
  "ODJ": {
    "convocationODJ": {
      "item": "Audition de M. Thomas Cazenave, délégué interministériel à la transformation publique"
    },
    "resumeODJ": {
      "item": "audition de M. Thomas Cazenave, délégué interministériel à la transformation publique."
    },
    "pointsODJ": null
  },
  "compteRenduRef": "CRCANR5L15S2018PO744107N007",
  "formatReunion": "Ordinaire",
  "infosReunionsInternationale": {
    "estReunionInternationale": "false",
    "listePays": null,
    "informationsComplementaires": null
  }
}