{
  "@xmlns": "http://schemas.assemblee-nationale.fr/referentiel",
  "@xmlns:xsi": "http://www.w3.org/2001/XMLSchema-instance",
  "@xsi:type": "reunionInitParlementaire_type",
  "uid": "RUANR5L15S2019IDF0133668",
  "timeStampDebut": "2019-06-13T14:00:00.000+02:00",
  "timeStampFin": "2019-06-13T16:00:00.000+02:00",
  "lieu": {
    "code": "SALREU049",
    "libelleCourt": "Salle 6822",
    "libelleLong": "Salle 6822, Palais Bourbon"
  },
  "cycleDeVie": {
    "etat": "Confirmé",
    "chrono": {
      "creation": "2019-05-13T15:39:45.000+02:00",
      "cloture": null
    }
  },
  "demandeurs": {
    "acteur": {
      "nom": "M. Laurent SAINT-MARTIN",
      "acteurRef": "PA720878"
    }
  },
  "organeReuniRef": null,
  "typeReunion": "DEP"
}