{
  "@xmlns": "http://schemas.assemblee-nationale.fr/referentiel",
  "@xmlns:xsi": "http://www.w3.org/2001/XMLSchema-instance",
  "@xsi:type": "reunionInitParlementaire_type",
  "uid": "RUANR5L15S2019IDF0138922",
  "timeStampDebut": "2019-09-24T14:00:00.000+02:00",
  "timeStampFin": "2019-09-24T15:00:00.000+02:00",
  "lieu": {
    "code": "SALREU032",
    "libelleCourt": "Sully 4",
    "libelleLong": "Sully 4, Palais Bourbon"
  },
  "cycleDeVie": {
    "etat": "Confirmé",
    "chrono": {
      "creation": "2019-09-03T14:28:28.000+02:00",
      "cloture": null
    }
  },
  "demandeurs": {
    "acteur": {
      "nom": "M. Arnaud VIALA",
      "acteurRef": "PA709315"
    }
  },
  "organeReuniRef": null,
  "typeReunion": "DEP"
}