{
  "@xmlns": "http://schemas.assemblee-nationale.fr/referentiel",
  "@xmlns:xsi": "http://www.w3.org/2001/XMLSchema-instance",
  "@xsi:type": "reunionInitParlementaire_type",
  "uid": "RUANR5L15S2019IDF0131952",
  "timeStampDebut": "2019-05-13T08:00:00.000+02:00",
  "timeStampFin": "2019-05-13T12:00:00.000+02:00",
  "lieu": {
    "code": "SALREU039",
    "libelleCourt": "Salle 6550",
    "libelleLong": "Salle 6550, Palais Bourbon"
  },
  "cycleDeVie": {
    "etat": "Annulé",
    "chrono": {
      "creation": "2019-04-08T18:31:14.000+02:00",
      "cloture": "2019-04-29T15:05:57.000+02:00"
    }
  },
  "demandeurs": {
    "acteur": {
      "nom": "M. Laurent SAINT-MARTIN",
      "acteurRef": "PA720878"
    }
  },
  "organeReuniRef": null,
  "typeReunion": "DEP"
}