{
  "@xmlns": "http://schemas.assemblee-nationale.fr/referentiel",
  "@xmlns:xsi": "http://www.w3.org/2001/XMLSchema-instance",
  "@xsi:type": "reunionCommission_type",
  "uid": "RUANR5L15S2020IDC434031",
  "timeStampDebut": "2019-10-29T20:00:00.000+01:00",
  "lieu": {
    "libelleLong": "Hôtel de la Questure"
  },
  "cycleDeVie": {
    "etat": "Confirmé",
    "chrono": {
      "creation": "2019-10-18T00:00:00.000+02:00",
      "cloture": null
    }
  },
  "organeReuniRef": "PO733617",
  "demandeur": null,
  "participants": {
    "participantsInternes": null,
    "personnesAuditionnees": null
  },
  "sessionRef": null,
  "ouverturePresse": "false",
  "captationVideo": "false",
  "ODJ": {
    "convocationODJ": {
      "item": "Réception, par le groupe d'amitié France-Inde, présidé par Mme Céline Calvez, de son Exc. M. Vinay Mohan Kwatra, ambassadeur d’Inde en France, à l’occasion de Diwali, la fête des lumières"
    },
    "resumeODJ": {
      "item": "Réception, par le groupe d'amitié France-Inde, présidé par Mme Céline Calvez, de son Exc. M. Vinay Mohan Kwatra, ambassadeur d’Inde en France, à l’occasion de Diwali, la fête des lumières"
    },
    "pointsODJ": null
  },
  "compteRenduRef": null,
  "formatReunion": "Ordinaire",
  "infosReunionsInternationale": {
    "estReunionInternationale": "true",
    "listePays": {
      "paysRef": "GOP756459"
    },
    "informationsComplementaires": "Laure Bazin-38721"
  }
}