{
  "@xmlns": "http://schemas.assemblee-nationale.fr/referentiel",
  "@xmlns:xsi": "http://www.w3.org/2001/XMLSchema-instance",
  "@xsi:type": "seance_type",
  "uid": "RUSNR5L15S2019IDS21361",
  "timeStampDebut": "2018-11-16T09:30:00.000+01:00",
  "timeStampFin": "2018-11-16T19:20:00.000+01:00",
  "lieu": {
    "code": "S",
    "libelleLong": "Sénat"
  },
  "cycleDeVie": {
    "etat": "Confirmé",
    "chrono": {
      "creation": "2018-10-18T00:00:00.000+02:00",
      "cloture": null
    }
  },
  "organeReuniRef": "PO78718",
  "demandeur": null,
  "participants": null,
  "sessionRef": "SCR5A2019O1",
  "ouverturePresse": "true",
  "captationVideo": "true",
  "ODJ": {
    "convocationODJ": null,
    "resumeODJ": null,
    "pointsODJ": {
      "pointODJ": {
        "@xsi:type": "podjSeanceConfPres_type",
        "uid": "RUSNR5L15S2019IDS21361PT36489",
        "cycleDeVie": {
          "etat": "Confirmé",
          "chrono": {
            "creation": "2018-10-18T00:00:00.000+02:00",
            "cloture": null
          }
        },
        "objet": "Suite de la discussion du projet de loi de financement de la sécurité sociale pour 2019",
        "demandeurPoint": null,
        "procedure": null,
        "dossiersLegislatifsRefs": {
          "dossierRef": "DLR5L15N36892"
        },
        "typePointODJ": "Suite de la discussion",
        "comiteSecret": "false",
        "textesAssocies": null,
        "natureTravauxODJ": "ODJPR",
        "dateConfPres": "2018-10-17+02:00"
      }
    }
  },
  "compteRenduRef": "CRSSNR5S2019IDS20181116",
  "identifiants": {
    "numSeanceJO": "20",
    "idJO": "20190020",
    "quantieme": "Unique",
    "DateSeance": "2018-11-16+01:00"
  }
}