{
  "@xmlns": "http://schemas.assemblee-nationale.fr/referentiel",
  "@xmlns:xsi": "http://www.w3.org/2001/XMLSchema-instance",
  "@xsi:type": "reunionInitParlementaire_type",
  "uid": "RUANR5L15S2018IDF0107408",
  "timeStampDebut": "2018-03-14T16:00:00.000+01:00",
  "timeStampFin": "2018-03-14T17:30:00.000+01:00",
  "lieu": {
    "code": "SALREU032",
    "libelleCourt": "Sully 4",
    "libelleLong": "Sully 4, Palais Bourbon"
  },
  "cycleDeVie": {
    "etat": "Confirmé",
    "chrono": {
      "creation": "2018-03-12T12:38:36.000+01:00",
      "cloture": null
    }
  },
  "demandeurs": {
    "acteur": {
      "nom": "Mme Anne-Laurence PETEL",
      "acteurRef": "PA718930"
    }
  },
  "organeReuniRef": null,
  "typeReunion": "DEP"
}