{
  "@xmlns": "http://schemas.assemblee-nationale.fr/referentiel",
  "@xmlns:xsi": "http://www.w3.org/2001/XMLSchema-instance",
  "@xsi:type": "reunionCommission_type",
  "uid": "RUANR5L15S2019IDC431964",
  "timeStampDebut": "2019-03-20T11:00:00.000+01:00",
  "lieu": {
    "libelleLong": "salle 6549 (2e étage)"
  },
  "cycleDeVie": {
    "etat": "Confirmé",
    "chrono": {
      "creation": "2019-03-15T00:00:00.000+01:00",
      "cloture": null
    }
  },
  "organeReuniRef": "PO762272",
  "demandeur": null,
  "participants": {
    "participantsInternes": null,
    "personnesAuditionnees": null
  },
  "sessionRef": null,
  "ouverturePresse": "false",
  "captationVideo": "false",
  "ODJ": {
    "convocationODJ": {
      "item": "Audition de M. Antoine Solanet, directeur affaires sociales, emploi et formation, à l’Alliance du Commerce, accompagné de M. Guillaume Simonin, responsable des affaires économiques"
    },
    "resumeODJ": {
      "item": "audition de M. Antoine Solanet, directeur affaires sociales, emploi et formation, à l’Alliance du Commerce, accompagné de M. Guillaume Simonin, responsable des affaires économiques."
    },
    "pointsODJ": null
  },
  "compteRenduRef": null,
  "formatReunion": "Ordinaire",
  "infosReunionsInternationale": {
    "estReunionInternationale": "false",
    "listePays": null,
    "informationsComplementaires": null
  }
}