{
  "@xmlns": "http://schemas.assemblee-nationale.fr/referentiel",
  "@xmlns:xsi": "http://www.w3.org/2001/XMLSchema-instance",
  "@xsi:type": "reunionCommission_type",
  "uid": "RUANR5L15S2020IDC433403",
  "timeStampDebut": "2019-10-02T10:00:00.000+02:00",
  "timeStampFin": "2019-10-02T12:00:00.000+02:00",
  "lieu": {
    "libelleLong": "salle 6241 (Affaires économiques)"
  },
  "cycleDeVie": {
    "etat": "Confirmé",
    "chrono": {
      "creation": "2019-07-09T00:00:00.000+02:00",
      "cloture": null
    }
  },
  "organeReuniRef": "PO419610",
  "demandeur": null,
  "participants": {
    "participantsInternes": {
      "participantInterne": [
        {
          "acteurRef": "PA722038",
          "presence": "présent"
        },
        {
          "acteurRef": "PA721278",
          "presence": "absent"
        },
        {
          "acteurRef": "PA335999",
          "presence": "absent"
        },
        {
          "acteurRef": "PA342415",
          "presence": "présent"
        },
        {
          "acteurRef": "PA722170",
          "presence": "présent"
        },
        {
          "acteurRef": "PA332228",
          "presence": "présent"
        },
        {
          "acteurRef": "PA718876",
          "presence": "présent"
        },
        {
          "acteurRef": "PA722312",
          "presence": "présent"
        },
        {
          "acteurRef": "PA718990",
          "presence": "présent"
        },
        {
          "acteurRef": "PA720162",
          "presence": "présent"
        },
        {
          "acteurRef": "PA721344",
          "presence": "absent"
        },
        {
          "acteurRef": "PA642695",
          "presence": "présent"
        },
        {
          "acteurRef": "PA720546",
          "presence": "présent"
        },
        {
          "acteurRef": "PA720116",
          "presence": "présent"
        },
        {
          "acteurRef": "PA767",
          "presence": "présent"
        },
        {
          "acteurRef": "PA720814",
          "presence": "absent"
        },
        {
          "acteurRef": "PA719440",
          "presence": "présent"
        },
        {
          "acteurRef": "PA267429",
          "presence": "excusé"
        },
        {
          "acteurRef": "PA721808",
          "presence": "présent"
        },
        {
          "acteurRef": "PA607155",
          "presence": "présent"
        },
        {
          "acteurRef": "PA721398",
          "presence": "absent"
        },
        {
          "acteurRef": "PA267450",
          "presence": "présent"
        },
        {
          "acteurRef": "PA719258",
          "presence": "absent"
        },
        {
          "acteurRef": "PA719830",
          "presence": "absent"
        },
        {
          "acteurRef": "PA720598",
          "presence": "présent"
        },
        {
          "acteurRef": "PA720862",
          "presence": "présent"
        },
        {
          "acteurRef": "PA720386",
          "presence": "présent"
        },
        {
          "acteurRef": "PA712015",
          "presence": "présent"
        },
        {
          "acteurRef": "PA721718",
          "presence": "présent"
        },
        {
          "acteurRef": "PA720664",
          "presence": "excusé"
        },
        {
          "acteurRef": "PA605694",
          "presence": "présent"
        },
        {
          "acteurRef": "PA334149",
          "presence": "présent"
        },
        {
          "acteurRef": "PA719960",
          "presence": "présent"
        },
        {
          "acteurRef": "PA720806",
          "presence": "présent"
        },
        {
          "acteurRef": "PA722094",
          "presence": "présent"
        },
        {
          "acteurRef": "PA267355",
          "presence": "présent"
        },
        {
          "acteurRef": "PA719700",
          "presence": "présent"
        },
        {
          "acteurRef": "PA722202",
          "presence": "absent"
        },
        {
          "acteurRef": "PA719372",
          "presence": "présent"
        },
        {
          "acteurRef": "PA719504",
          "presence": "présent"
        },
        {
          "acteurRef": "PA331567",
          "presence": "présent"
        },
        {
          "acteurRef": "PA721434",
          "presence": "présent"
        },
        {
          "acteurRef": "PA719310",
          "presence": "présent"
        },
        {
          "acteurRef": "PA721852",
          "presence": "présent"
        },
        {
          "acteurRef": "PA340853",
          "presence": "présent"
        },
        {
          "acteurRef": "PA719388",
          "presence": "présent"
        },
        {
          "acteurRef": "PA721134",
          "presence": "présent"
        },
        {
          "acteurRef": "PA337483",
          "presence": "excusé"
        },
        {
          "acteurRef": "PA720378",
          "presence": "présent"
        },
        {
          "acteurRef": "PA334116",
          "presence": "absent"
        },
        {
          "acteurRef": "PA719154",
          "presence": "présent"
        },
        {
          "acteurRef": "PA720976",
          "presence": "présent"
        },
        {
          "acteurRef": "PA719338",
          "presence": "absent"
        },
        {
          "acteurRef": "PA720630",
          "presence": "présent"
        },
        {
          "acteurRef": "PA719242",
          "presence": "absent"
        },
        {
          "acteurRef": "PA719520",
          "presence": "présent"
        },
        {
          "acteurRef": "PA720644",
          "presence": "présent"
        },
        {
          "acteurRef": "PA718784",
          "presence": "présent"
        },
        {
          "acteurRef": "PA718930",
          "presence": "présent"
        },
        {
          "acteurRef": "PA336175",
          "presence": "présent"
        },
        {
          "acteurRef": "PA607553",
          "presence": "excusé"
        },
        {
          "acteurRef": "PA720092",
          "presence": "présent"
        },
        {
          "acteurRef": "PA266808",
          "presence": "présent"
        },
        {
          "acteurRef": "PA722142",
          "presence": "présent"
        },
        {
          "acteurRef": "PA720780",
          "presence": "présent"
        },
        {
          "acteurRef": "PA719420",
          "presence": "présent"
        },
        {
          "acteurRef": "PA334654",
          "presence": "présent"
        },
        {
          "acteurRef": "PA2792",
          "presence": "présent"
        },
        {
          "acteurRef": "PA718860",
          "presence": "présent"
        },
        {
          "acteurRef": "PA720014",
          "presence": "absent"
        },
        {
          "acteurRef": "PA722162",
          "presence": "présent"
        },
        {
          "acteurRef": "PA607090",
          "presence": "présent"
        },
        {
          "acteurRef": "PA421348",
          "presence": "présent"
        },
        {
          "acteurRef": "PA2952",
          "presence": "présent"
        }
      ]
    },
    "personnesAuditionnees": null
  },
  "sessionRef": null,
  "ouverturePresse": "true",
  "captationVideo": "true",
  "ODJ": {
    "convocationODJ": {
      "item": "Audition de M. Guillaume Boudy, secrétaire général à l’investissement, sur le suivi du Grand plan d’investissement."
    },
    "resumeODJ": {
      "item": "audition de M. Guillaume Boudy, secrétaire général à l’investissement, sur le suivi du Grand plan d’investissement."
    },
    "pointsODJ": null
  },
  "compteRenduRef": null,
  "formatReunion": "Ordinaire",
  "infosReunionsInternationale": {
    "estReunionInternationale": "false",
    "listePays": null,
    "informationsComplementaires": null
  }
}