{
  "@xmlns": "http://schemas.assemblee-nationale.fr/referentiel",
  "@xmlns:xsi": "http://www.w3.org/2001/XMLSchema-instance",
  "@xsi:type": "reunionInitParlementaire_type",
  "uid": "RUANR5L15S2018IDF0111885",
  "timeStampDebut": "2018-05-23T16:00:00.000+02:00",
  "timeStampFin": "2018-05-23T17:00:00.000+02:00",
  "lieu": {
    "code": "SALREU041",
    "libelleCourt": "Sully 5",
    "libelleLong": "Sully 5, Palais Bourbon"
  },
  "cycleDeVie": {
    "etat": "Confirmé",
    "chrono": {
      "creation": "2018-05-18T15:03:17.000+02:00",
      "cloture": null
    }
  },
  "demandeurs": {
    "acteur": {
      "nom": "Mme Sophie PANONACLE",
      "acteurRef": "PA719632"
    }
  },
  "organeReuniRef": null,
  "typeReunion": "DEP"
}