{
  "@xmlns": "http://schemas.assemblee-nationale.fr/referentiel",
  "@xmlns:xsi": "http://www.w3.org/2001/XMLSchema-instance",
  "@xsi:type": "reunionCommission_type",
  "uid": "RUANR5L15S2019IDC431783",
  "timeStampDebut": "2019-03-21T09:00:00.000+01:00",
  "lieu": {
    "libelleLong": "salle n° 3 (95, rue de l'Université)"
  },
  "cycleDeVie": {
    "etat": "Confirmé",
    "chrono": {
      "creation": "2019-03-01T00:00:00.000+01:00",
      "cloture": null
    }
  },
  "organeReuniRef": "PO762272",
  "demandeur": null,
  "participants": {
    "participantsInternes": null,
    "personnesAuditionnees": null
  },
  "sessionRef": null,
  "ouverturePresse": "false",
  "captationVideo": "false",
  "ODJ": {
    "convocationODJ": {
      "item": "Audition de M. Nicolas Dayot, président de la Fédération nationale de l'hôtellerie de plein air (FNHPA), accompagné de M. Nicolas Bouvier, chargé des relations extérieures."
    },
    "resumeODJ": {
      "item": "audition de M. Nicolas Dayot, président de la Fédération nationale de l'hôtellerie de plein air (FNHPA), accompagné de M. Nicolas Bouvier, chargé des relations extérieures."
    },
    "pointsODJ": null
  },
  "compteRenduRef": null,
  "formatReunion": "Ordinaire",
  "infosReunionsInternationale": {
    "estReunionInternationale": "false",
    "listePays": null,
    "informationsComplementaires": null
  }
}