{
  "@xmlns": "http://schemas.assemblee-nationale.fr/referentiel",
  "@xmlns:xsi": "http://www.w3.org/2001/XMLSchema-instance",
  "@xsi:type": "reunionInitParlementaire_type",
  "uid": "RUANR5L15S2018IDF0108634",
  "timeStampDebut": "2018-03-27T16:00:00.000+02:00",
  "timeStampFin": "2018-03-27T16:30:00.000+02:00",
  "lieu": {
    "code": "SALREU044",
    "libelleCourt": "Sully 2",
    "libelleLong": "Sully 2, Palais Bourbon"
  },
  "cycleDeVie": {
    "etat": "Annulé",
    "chrono": {
      "creation": "2018-03-27T14:55:17.000+02:00",
      "cloture": "2018-03-27T15:29:38.000+02:00"
    }
  },
  "demandeurs": {
    "acteur": {
      "nom": "Mme Célia DE LAVERGNE",
      "acteurRef": "PA719310"
    }
  },
  "organeReuniRef": null,
  "typeReunion": "DEP"
}