{
  "@xmlns": "http://schemas.assemblee-nationale.fr/referentiel",
  "@xmlns:xsi": "http://www.w3.org/2001/XMLSchema-instance",
  "@xsi:type": "reunionInitParlementaire_type",
  "uid": "RUANR5L15S2018IDF0112071",
  "timeStampDebut": "2018-06-05T11:00:00.000+02:00",
  "timeStampFin": "2018-06-05T12:30:00.000+02:00",
  "lieu": {
    "code": "SALREU029",
    "libelleCourt": "Salon Mars III",
    "libelleLong": "Salon Mars III, 101, rue de l'Université"
  },
  "cycleDeVie": {
    "etat": "Confirmé",
    "chrono": {
      "creation": "2018-05-22T16:52:18.000+02:00",
      "cloture": null
    }
  },
  "demandeurs": {
    "acteur": {
      "nom": "Mme Audrey DUFEU SCHUBERT",
      "acteurRef": "PA720046"
    }
  },
  "organeReuniRef": null,
  "typeReunion": "DEP"
}