{
  "@xmlns": "http://schemas.assemblee-nationale.fr/referentiel",
  "@xmlns:xsi": "http://www.w3.org/2001/XMLSchema-instance",
  "@xsi:type": "reunionInitParlementaire_type",
  "uid": "RUANR5L15S2019IDF0136260",
  "timeStampDebut": "2019-09-19T11:00:00.000+02:00",
  "timeStampFin": "2019-09-19T13:00:00.000+02:00",
  "lieu": {
    "code": "SALREU016",
    "libelleCourt": "Salon Gabriel",
    "libelleLong": "Salon Gabriel, 101, rue de l'Université"
  },
  "cycleDeVie": {
    "etat": "Annulé",
    "chrono": {
      "creation": "2019-06-26T09:14:34.000+02:00",
      "cloture": "2019-07-19T09:54:53.000+02:00"
    }
  },
  "demandeurs": {
    "acteur": {
      "nom": "Mme Sylvie CHARRIÈRE",
      "acteurRef": "PA721218"
    }
  },
  "organeReuniRef": null,
  "typeReunion": "DEP"
}