{
  "@xmlns": "http://schemas.assemblee-nationale.fr/referentiel",
  "@xmlns:xsi": "http://www.w3.org/2001/XMLSchema-instance",
  "@xsi:type": "reunionInitParlementaire_type",
  "uid": "RUANR5L15S2019IDF0129880",
  "timeStampDebut": "2019-03-26T08:30:00.000+01:00",
  "timeStampFin": "2019-03-26T09:30:00.000+01:00",
  "lieu": {
    "code": "SALREU049",
    "libelleCourt": "Salle 6822",
    "libelleLong": "Salle 6822, Palais Bourbon"
  },
  "cycleDeVie": {
    "etat": "Annulé",
    "chrono": {
      "creation": "2019-03-14T10:02:24.000+01:00",
      "cloture": "2019-03-25T10:20:28.000+01:00"
    }
  },
  "demandeurs": {
    "acteur": {
      "nom": "Mme Anne-France BRUNET",
      "acteurRef": "PA720116"
    }
  },
  "organeReuniRef": null,
  "typeReunion": "DEP"
}