{
  "@xmlns": "http://schemas.assemblee-nationale.fr/referentiel",
  "@xmlns:xsi": "http://www.w3.org/2001/XMLSchema-instance",
  "@xsi:type": "reunionCommission_type",
  "uid": "RUANR5L15S2020IDC434215",
  "timeStampDebut": "2019-11-27T09:30:00.000+01:00",
  "lieu": {
    "libelleLong": "Salle 4325 (33 rue Saint Domonique)"
  },
  "cycleDeVie": {
    "etat": "Eventuel",
    "chrono": {
      "creation": "2019-11-07T00:00:00.000+01:00",
      "cloture": null
    }
  },
  "organeReuniRef": "PO415287",
  "demandeur": null,
  "participants": {
    "participantsInternes": null,
    "personnesAuditionnees": null
  },
  "sessionRef": null,
  "ouverturePresse": "true",
  "captationVideo": "true",
  "ODJ": {
    "convocationODJ": {
      "item": "Audition commune avec la commission des finances de M. Pierre Moscovici, commissaire européen aux Affaires économiques et financières, fiscalité et douanes."
    },
    "resumeODJ": {
      "item": "M. Pierre Moscovici, commissaire européen aux Affaires économiques et financières, fiscalité et douanes (audition)"
    },
    "pointsODJ": null
  },
  "compteRenduRef": null,
  "formatReunion": "Ordinaire",
  "infosReunionsInternationale": {
    "estReunionInternationale": "false",
    "listePays": null,
    "informationsComplementaires": null
  }
}