{
  "@xmlns": "http://schemas.assemblee-nationale.fr/referentiel",
  "@xmlns:xsi": "http://www.w3.org/2001/XMLSchema-instance",
  "@xsi:type": "reunionInitParlementaire_type",
  "uid": "RUANR5L15S2019IDF0124192",
  "timeStampDebut": "2019-03-20T08:30:00.000+01:00",
  "timeStampFin": "2019-03-20T09:30:00.000+01:00",
  "lieu": {
    "code": "SALREU017",
    "libelleCourt": "Salon Visconti",
    "libelleLong": "Salon Visconti, 101, rue de l'Université"
  },
  "cycleDeVie": {
    "etat": "Annulé",
    "chrono": {
      "creation": "2018-12-19T17:54:26.000+01:00",
      "cloture": "2019-03-15T12:13:10.000+01:00"
    }
  },
  "demandeurs": {
    "acteur": {
      "nom": "Mme Céline CALVEZ",
      "acteurRef": "PA721750"
    }
  },
  "organeReuniRef": null,
  "typeReunion": "DEP"
}