{
  "@xmlns": "http://schemas.assemblee-nationale.fr/referentiel",
  "@xmlns:xsi": "http://www.w3.org/2001/XMLSchema-instance",
  "@xsi:type": "reunionInitParlementaire_type",
  "uid": "RUANR5L15S2019IDF0131928",
  "timeStampDebut": "2019-05-22T16:00:00.000+02:00",
  "timeStampFin": "2019-05-22T18:00:00.000+02:00",
  "lieu": {
    "code": "SALREU039",
    "libelleCourt": "Salle 6550",
    "libelleLong": "Salle 6550, Palais Bourbon"
  },
  "cycleDeVie": {
    "etat": "Confirmé",
    "chrono": {
      "creation": "2019-04-08T17:34:35.000+02:00",
      "cloture": null
    }
  },
  "demandeurs": {
    "acteur": [
      {
        "nom": "Mme Emmanuelle ANTHOINE",
        "acteurRef": "PA719318"
      },
      {
        "nom": "M. Raphaël GÉRARD",
        "acteurRef": "PA719108"
      }
    ]
  },
  "organeReuniRef": null,
  "typeReunion": "DEP"
}