{
  "@xmlns": "http://schemas.assemblee-nationale.fr/referentiel",
  "@xmlns:xsi": "http://www.w3.org/2001/XMLSchema-instance",
  "@xsi:type": "reunionInitParlementaire_type",
  "uid": "RUANR5L15S2018IDF0110327",
  "timeStampDebut": "2018-05-16T16:00:00.000+02:00",
  "timeStampFin": "2018-05-16T18:00:00.000+02:00",
  "lieu": {
    "code": "SALREU046",
    "libelleCourt": "Sully 1",
    "libelleLong": "Sully 1, Palais Bourbon"
  },
  "cycleDeVie": {
    "etat": "Annulé",
    "chrono": {
      "creation": "2018-04-18T18:10:32.000+02:00",
      "cloture": "2018-05-16T11:00:17.000+02:00"
    }
  },
  "demandeurs": {
    "acteur": {
      "nom": "M. Adrien TAQUET",
      "acteurRef": "PA722086"
    }
  },
  "organeReuniRef": null,
  "typeReunion": "DEP"
}