{
  "@xmlns": "http://schemas.assemblee-nationale.fr/referentiel",
  "@xmlns:xsi": "http://www.w3.org/2001/XMLSchema-instance",
  "@xsi:type": "reunionCommission_type",
  "uid": "RUANR5L15S2018IDC429870",
  "timeStampDebut": "2018-06-26T10:00:00.000+02:00",
  "lieu": {
    "libelleLong": "salle 4013 (33 rue Saint-Dominique)"
  },
  "cycleDeVie": {
    "etat": "Confirmé",
    "chrono": {
      "creation": "2018-06-15T00:00:00.000+02:00",
      "cloture": null
    }
  },
  "organeReuniRef": "PO756124",
  "demandeur": null,
  "participants": {
    "participantsInternes": null,
    "personnesAuditionnees": null
  },
  "sessionRef": null,
  "ouverturePresse": "false",
  "captationVideo": "false",
  "ODJ": {
    "convocationODJ": {
      "item": "Audition de  M. l’ingénieur général de l’armement Bertrand Le Meur, directeur adjoint des affaires internationales, stratégiques et technologiques au Secrétariat général de la défense et de la sécurité nationale, et de M. l’ingénieur en chef de l’armement Matthieu Fossat, adjoint au sous-directeur exportation des matériels de guerre."
    },
    "resumeODJ": {
      "item": "audition de  M. l’ingénieur général de l’armement Bertrand Le Meur, directeur adjoint des affaires internationales, stratégiques et technologiques au Secrétariat général de la défense et de la sécurité nationale, et de M. l’ingénieur en chef de l’armement Matthieu Fossat, adjoint au sous-directeur exportation des matériels de guerre."
    },
    "pointsODJ": null
  },
  "compteRenduRef": null,
  "formatReunion": "Ordinaire",
  "infosReunionsInternationale": {
    "estReunionInternationale": "false",
    "listePays": null,
    "informationsComplementaires": null
  }
}