{
  "@xmlns": "http://schemas.assemblee-nationale.fr/referentiel",
  "@xmlns:xsi": "http://www.w3.org/2001/XMLSchema-instance",
  "@xsi:type": "seance_type",
  "uid": "RUANR5L15S2018IDS21204",
  "timeStampDebut": "2018-07-26T16:00:00.000+02:00",
  "timeStampFin": "2018-07-26T20:00:00.000+02:00",
  "lieu": {
    "code": "AN",
    "libelleLong": "Assemblée nationale"
  },
  "cycleDeVie": {
    "etat": "Confirmé",
    "chrono": {
      "creation": "2018-07-02T00:00:00.000+02:00",
      "cloture": null
    }
  },
  "organeReuniRef": "PO717460",
  "demandeur": null,
  "participants": null,
  "sessionRef": "SCR5A2018E1",
  "ouverturePresse": "true",
  "captationVideo": "true",
  "ODJ": {
    "convocationODJ": null,
    "resumeODJ": null,
    "pointsODJ": {
      "pointODJ": {
        "@xsi:type": "podjSeanceConfPres_type",
        "uid": "RUANR5L15S2018IDS21204PT36207",
        "cycleDeVie": {
          "etat": "Confirmé",
          "chrono": {
            "creation": "2018-07-02T00:00:00.000+02:00",
            "cloture": null
          }
        },
        "objet": "Suite de la discussion, en nouvelle lecture, du projet de loi pour une immigration maîtrisée, un droit d'asile effectif et une intégration réussie",
        "demandeurPoint": null,
        "procedure": null,
        "dossiersLegislatifsRefs": {
          "dossierRef": "DLR5L15N36410"
        },
        "typePointODJ": "Suite de la discussion",
        "comiteSecret": "false",
        "textesAssocies": null,
        "natureTravauxODJ": "ODJPR"
      }
    }
  },
  "compteRenduRef": "CRSANR5L15S2018E1N039",
  "identifiants": {
    "numSeanceJO": "39",
    "idJO": "20181039",
    "quantieme": "Deuxième",
    "DateSeance": "2018-07-26+02:00"
  }
}