{
  "@xmlns": "http://schemas.assemblee-nationale.fr/referentiel",
  "@xmlns:xsi": "http://www.w3.org/2001/XMLSchema-instance",
  "@xsi:type": "reunionInitParlementaire_type",
  "uid": "RUANR5L15S2019IDF0119913",
  "timeStampDebut": "2018-10-16T11:00:00.000+02:00",
  "timeStampFin": "2018-10-16T12:30:00.000+02:00",
  "lieu": {
    "code": "SALREU019",
    "libelleCourt": "Salon Mars I",
    "libelleLong": "Salon Mars I, 101, rue de l'Université"
  },
  "cycleDeVie": {
    "etat": "Confirmé",
    "chrono": {
      "creation": "2018-10-02T14:28:59.000+02:00",
      "cloture": null
    }
  },
  "demandeurs": {
    "acteur": {
      "nom": "M. Nicolas DUPONT-AIGNAN",
      "acteurRef": "PA1206"
    }
  },
  "organeReuniRef": null,
  "typeReunion": "DEP"
}