{
  "@xmlns": "http://schemas.assemblee-nationale.fr/referentiel",
  "@xmlns:xsi": "http://www.w3.org/2001/XMLSchema-instance",
  "@xsi:type": "reunionInitParlementaire_type",
  "uid": "RUANR5L15S2019IDF0132007",
  "timeStampDebut": "2019-04-16T11:30:00.000+02:00",
  "timeStampFin": "2019-04-16T12:30:00.000+02:00",
  "lieu": {
    "code": "SALREU049",
    "libelleCourt": "Salle 6822",
    "libelleLong": "Salle 6822, Palais Bourbon"
  },
  "cycleDeVie": {
    "etat": "Confirmé",
    "chrono": {
      "creation": "2019-04-09T16:10:56.000+02:00",
      "cloture": null
    }
  },
  "demandeurs": {
    "acteur": {
      "nom": "M. Grégory BESSON-MOREAU",
      "acteurRef": "PA718876"
    }
  },
  "organeReuniRef": null,
  "typeReunion": "DEP"
}