{
  "@xmlns": "http://schemas.assemblee-nationale.fr/referentiel",
  "@xmlns:xsi": "http://www.w3.org/2001/XMLSchema-instance",
  "@xsi:type": "reunionCommission_type",
  "uid": "RUANR5L15S2018IDC427903",
  "timeStampDebut": "2017-11-23T10:00:00.000+01:00",
  "timeStampFin": "2017-11-23T11:00:00.000+01:00",
  "lieu": {
    "libelleLong": "salle 6351 (Affaires sociales)"
  },
  "cycleDeVie": {
    "etat": "Confirmé",
    "chrono": {
      "creation": "2017-11-21T00:00:00.000+01:00",
      "cloture": null
    }
  },
  "organeReuniRef": "PO743158",
  "demandeur": null,
  "participants": {
    "participantsInternes": {
      "participantInterne": [
        {
          "acteurRef": "PA721036",
          "presence": "absent"
        },
        {
          "acteurRef": "PA719806",
          "presence": "absent"
        },
        {
          "acteurRef": "PA642724",
          "presence": "absent"
        },
        {
          "acteurRef": "PA720968",
          "presence": "présent"
        },
        {
          "acteurRef": "PA267233",
          "presence": "absent"
        },
        {
          "acteurRef": "PA719032",
          "presence": "présent"
        },
        {
          "acteurRef": "PA721118",
          "presence": "absent"
        },
        {
          "acteurRef": "PA719922",
          "presence": "présent"
        },
        {
          "acteurRef": "PA702054",
          "presence": "absent"
        },
        {
          "acteurRef": "PA719692",
          "presence": "absent"
        },
        {
          "acteurRef": "PA719616",
          "presence": "absent"
        },
        {
          "acteurRef": "PA721126",
          "presence": "excusé"
        },
        {
          "acteurRef": "PA720054",
          "presence": "présent"
        },
        {
          "acteurRef": "PA720038",
          "presence": "absent"
        },
        {
          "acteurRef": "PA267901",
          "presence": "absent"
        },
        {
          "acteurRef": "PA605518",
          "presence": "présent"
        },
        {
          "acteurRef": "PA721054",
          "presence": "présent"
        },
        {
          "acteurRef": "PA346054",
          "presence": "excusé"
        },
        {
          "acteurRef": "PA721734",
          "presence": "présent"
        },
        {
          "acteurRef": "PA719632",
          "presence": "présent"
        },
        {
          "acteurRef": "PA718784",
          "presence": "présent"
        },
        {
          "acteurRef": "PA609520",
          "presence": "excusé"
        },
        {
          "acteurRef": "PA643127",
          "presence": "absent"
        },
        {
          "acteurRef": "PA721062",
          "presence": "présent"
        },
        {
          "acteurRef": "PA721824",
          "presence": "absent"
        },
        {
          "acteurRef": "PA702052",
          "presence": "présent"
        },
        {
          "acteurRef": "PA720960",
          "presence": "absent"
        },
        {
          "acteurRef": "PA719092",
          "presence": "absent"
        },
        {
          "acteurRef": "PA643145",
          "presence": "présent"
        }
      ]
    },
    "personnesAuditionnees": null
  },
  "sessionRef": null,
  "ouverturePresse": "false",
  "captationVideo": "false",
  "ODJ": {
    "convocationODJ": {
      "item": "– Nomination du Bureau– Désignation du rapporteur– Échange de vues sur le programme de la mission"
    },
    "resumeODJ": {
      "item": [
        "nomination du Bureau ;",
        "désignation du rapporteur ;",
        "échange de vues sur le programme de la mission."
      ]
    },
    "pointsODJ": {
      "pointODJ": {
        "@xsi:type": "podjReunion_type",
        "uid": "RUANR5L15S2018IDC427903PT25311",
        "cycleDeVie": {
          "etat": "Confirmé",
          "chrono": {
            "creation": "2017-12-11T00:00:00.000+01:00",
            "cloture": null
          }
        },
        "objet": "Nomination du Bureau et désignation du rapporteur",
        "demandeurPoint": null,
        "procedure": null,
        "dossiersLegislatifsRefs": {
          "dossierRef": "DLR5L15N36128"
        },
        "typePointODJ": "Nomination bureau",
        "comiteSecret": "false",
        "textesAssocies": null
      }
    }
  },
  "compteRenduRef": "CRCANR5L15S2018PO743158N001",
  "formatReunion": "Ordinaire",
  "infosReunionsInternationale": {
    "estReunionInternationale": "false",
    "listePays": null,
    "informationsComplementaires": null
  }
}