{
  "@xmlns": "http://schemas.assemblee-nationale.fr/referentiel",
  "@xmlns:xsi": "http://www.w3.org/2001/XMLSchema-instance",
  "@xsi:type": "reunionCommission_type",
  "uid": "RUANR5L15S2020IDC433823",
  "timeStampDebut": "2019-10-01T17:00:00.000+02:00",
  "lieu": {
    "libelleLong": "6628"
  },
  "cycleDeVie": {
    "etat": "Confirmé",
    "chrono": {
      "creation": "2019-09-27T00:00:00.000+02:00",
      "cloture": null
    }
  },
  "organeReuniRef": "PO766309",
  "demandeur": null,
  "participants": {
    "participantsInternes": null,
    "personnesAuditionnees": null
  },
  "sessionRef": null,
  "ouverturePresse": "true",
  "captationVideo": "false",
  "ODJ": {
    "convocationODJ": {
      "item": "Audition de Mme Joëlle Simon, directrice générale adjointe du MEDEF en charge des affaires juridiques, éthiques et de gouvernance des entreprises, et de M. Jules Guillaud, chargé de mission"
    },
    "resumeODJ": {
      "item": "audition de Mme Joëlle Simon, directrice générale adjointe du MEDEF en charge des affaires juridiques, éthiques et de gouvernance des entreprises, et de M. Jules Guillaud, chargé de mission."
    },
    "pointsODJ": null
  },
  "compteRenduRef": null,
  "formatReunion": "Ordinaire",
  "infosReunionsInternationale": {
    "estReunionInternationale": "false",
    "listePays": null,
    "informationsComplementaires": null
  }
}