{
  "@xmlns": "http://schemas.assemblee-nationale.fr/referentiel",
  "@xmlns:xsi": "http://www.w3.org/2001/XMLSchema-instance",
  "@xsi:type": "reunionCommission_type",
  "uid": "RUANR5L15S2018IDC428572",
  "timeStampDebut": "2018-02-13T17:30:00.000+01:00",
  "lieu": {
    "libelleLong": "Salle 4204 (33 rue Saint-Dominique - 2ème étage)"
  },
  "cycleDeVie": {
    "etat": "Confirmé",
    "chrono": {
      "creation": "2018-02-12T00:00:00.000+01:00",
      "cloture": null
    }
  },
  "organeReuniRef": "PO743895",
  "demandeur": null,
  "participants": {
    "participantsInternes": null,
    "personnesAuditionnees": null
  },
  "sessionRef": null,
  "ouverturePresse": "false",
  "captationVideo": "false",
  "ODJ": {
    "convocationODJ": {
      "item": "– Audition de M. Sébastien Mosneron-Dupin, directeur général d’Expertise France et de M. Rémy Rioux, directeur général de l’Agence française de développement (AFD)."
    },
    "resumeODJ": {
      "item": "audition de M. Sébastien Mosneron-Dupin, directeur général d’Expertise France et de M. Rémy Rioux, directeur général de l’Agence française de développement (AFD)."
    },
    "pointsODJ": null
  },
  "compteRenduRef": null,
  "formatReunion": "Ordinaire",
  "infosReunionsInternationale": {
    "estReunionInternationale": "false",
    "listePays": null,
    "informationsComplementaires": null
  }
}