{
  "@xmlns": "http://schemas.assemblee-nationale.fr/referentiel",
  "@xmlns:xsi": "http://www.w3.org/2001/XMLSchema-instance",
  "@xsi:type": "reunionInitParlementaire_type",
  "uid": "RUANR5L15S2018IDF0101592",
  "timeStampDebut": "2018-02-21T09:00:00.000+01:00",
  "timeStampFin": "2018-02-21T12:00:00.000+01:00",
  "lieu": {
    "code": "SALREU017",
    "libelleCourt": "Salon Visconti",
    "libelleLong": "Salon Visconti, 101, rue de l'Université"
  },
  "cycleDeVie": {
    "etat": "Annulé",
    "chrono": {
      "creation": "2017-11-29T15:27:04.000+01:00",
      "cloture": "2017-12-14T13:01:50.000+01:00"
    }
  },
  "demandeurs": {
    "acteur": {
      "nom": "M. Mustapha LAABID",
      "acteurRef": "PA719842"
    }
  },
  "organeReuniRef": null,
  "typeReunion": "DEP"
}