{
  "@xmlns": "http://schemas.assemblee-nationale.fr/referentiel",
  "@xmlns:xsi": "http://www.w3.org/2001/XMLSchema-instance",
  "@xsi:type": "reunionInitParlementaire_type",
  "uid": "RUANR5L15S2020IDF0140533",
  "timeStampDebut": "2019-10-09T14:30:00.000+02:00",
  "timeStampFin": "2019-10-09T15:00:00.000+02:00",
  "lieu": {
    "code": "SALREU045",
    "libelleCourt": "Sully 3",
    "libelleLong": "Sully 3, Palais Bourbon"
  },
  "cycleDeVie": {
    "etat": "Confirmé",
    "chrono": {
      "creation": "2019-09-20T10:45:15.000+02:00",
      "cloture": null
    }
  },
  "demandeurs": {
    "acteur": {
      "nom": "M. Laurent SAINT-MARTIN",
      "acteurRef": "PA720878"
    }
  },
  "organeReuniRef": null,
  "typeReunion": "DEP"
}