{
  "@xmlns": "http://schemas.assemblee-nationale.fr/referentiel",
  "@xmlns:xsi": "http://www.w3.org/2001/XMLSchema-instance",
  "@xsi:type": "reunionInitParlementaire_type",
  "uid": "RUANR5L15S2020IDF0139679",
  "timeStampDebut": "2019-10-03T10:00:00.000+02:00",
  "timeStampFin": "2019-10-03T12:00:00.000+02:00",
  "lieu": {
    "code": "SALREU014",
    "libelleCourt": "Salle 7042",
    "libelleLong": "Salle 7042, 103, rue de l'Université"
  },
  "cycleDeVie": {
    "etat": "Confirmé",
    "chrono": {
      "creation": "2019-09-11T16:16:17.000+02:00",
      "cloture": null
    }
  },
  "demandeurs": {
    "acteur": {
      "nom": "Mme Nadia HAI",
      "acteurRef": "PA722054"
    }
  },
  "organeReuniRef": null,
  "typeReunion": "DEP"
}