{
  "@xmlns": "http://schemas.assemblee-nationale.fr/referentiel",
  "@xmlns:xsi": "http://www.w3.org/2001/XMLSchema-instance",
  "@xsi:type": "reunionInitParlementaire_type",
  "uid": "RUANR5L15S2018IDF0106963",
  "timeStampDebut": "2018-03-20T09:30:00.000+01:00",
  "timeStampFin": "2018-03-20T10:30:00.000+01:00",
  "lieu": {
    "code": "SALREU045",
    "libelleCourt": "Sully 3",
    "libelleLong": "Sully 3, Palais Bourbon"
  },
  "cycleDeVie": {
    "etat": "Confirmé",
    "chrono": {
      "creation": "2018-03-05T16:52:04.000+01:00",
      "cloture": null
    }
  },
  "demandeurs": {
    "acteur": {
      "nom": "Mme Olivia GREGOIRE",
      "acteurRef": "PA721764"
    }
  },
  "organeReuniRef": null,
  "typeReunion": "DEP"
}