{
  "@xmlns": "http://schemas.assemblee-nationale.fr/referentiel",
  "@xmlns:xsi": "http://www.w3.org/2001/XMLSchema-instance",
  "@xsi:type": "seance_type",
  "uid": "RUANR5L15S2017IDS20619",
  "timeStampDebut": "2017-07-18T15:00:00.000+02:00",
  "timeStampFin": "2017-07-18T19:50:00.000+02:00",
  "lieu": {
    "code": "AN",
    "libelleLong": "Assemblée nationale"
  },
  "cycleDeVie": {
    "etat": "Confirmé",
    "chrono": {
      "creation": "2017-06-28T00:00:00.000+02:00",
      "cloture": null
    }
  },
  "organeReuniRef": "PO717460",
  "demandeur": null,
  "participants": null,
  "sessionRef": "SCR5A2017E1",
  "ouverturePresse": "true",
  "captationVideo": "true",
  "ODJ": {
    "convocationODJ": null,
    "resumeODJ": null,
    "pointsODJ": {
      "pointODJ": [
        {
          "@xsi:type": "podjSeanceConfPres_type",
          "uid": "RUANR5L15S2017IDS20619PT34932",
          "cycleDeVie": {
            "etat": "Confirmé",
            "chrono": {
              "creation": "2017-06-28T00:00:00.000+02:00",
              "cloture": null
            }
          },
          "objet": "Discussion du projet de loi de règlement du budget et d'approbation des comptes de l'année 2016",
          "demandeurPoint": null,
          "procedure": null,
          "dossiersLegislatifsRefs": {
            "dossierRef": "DLR5L15N35837"
          },
          "typePointODJ": "Discussion",
          "comiteSecret": "false",
          "textesAssocies": null,
          "natureTravauxODJ": "ODJPR"
        },
        {
          "@xsi:type": "podjSeanceConfPres_type",
          "uid": "RUANR5L15S2017IDS20619PT34933",
          "cycleDeVie": {
            "etat": "Confirmé",
            "chrono": {
              "creation": "2017-06-28T00:00:00.000+02:00",
              "cloture": null
            }
          },
          "objet": "Discussion du projet de loi ratifiant les ordonnances n° 2016-1058 du 3 août 2016 relative à la modification des règles applicables à l'évaluation environnementale des projets, plans et programmes et n° 2016-1060 du 3 août 2016 portant réforme des procédures destinées à assurer l'information et la participation du public à l'élaboration de certaines décisions susceptibles d'avoir une incidence sur l'environnement",
          "demandeurPoint": null,
          "procedure": null,
          "dossiersLegislatifsRefs": {
            "dossierRef": "DLR5L15N35843"
          },
          "typePointODJ": "Discussion",
          "comiteSecret": "false",
          "textesAssocies": null,
          "natureTravauxODJ": "ODJPR"
        }
      ]
    }
  },
  "compteRenduRef": "CRSANR5L15S2017E1N013",
  "identifiants": {
    "numSeanceJO": "13",
    "idJO": "20171013",
    "quantieme": "Première",
    "DateSeance": "2017-07-18+02:00"
  }
}