{
  "@xmlns": "http://schemas.assemblee-nationale.fr/referentiel",
  "@xmlns:xsi": "http://www.w3.org/2001/XMLSchema-instance",
  "@xsi:type": "reunionCommission_type",
  "uid": "RUANR5L15S2018IDC429278",
  "timeStampDebut": "2018-05-31T14:15:00.000+02:00",
  "timeStampFin": "2018-05-31T20:00:00.000+02:00",
  "lieu": {
    "libelleLong": "salle 6351 (Affaires sociales)"
  },
  "cycleDeVie": {
    "etat": "Confirmé",
    "chrono": {
      "creation": "2018-04-19T00:00:00.000+02:00",
      "cloture": null
    }
  },
  "organeReuniRef": "PO420120",
  "demandeur": null,
  "participants": {
    "participantsInternes": {
      "participantInterne": [
        {
          "acteurRef": "PA642764",
          "presence": "présent"
        },
        {
          "acteurRef": "PA718744",
          "presence": "présent"
        },
        {
          "acteurRef": "PA721776",
          "presence": "présent"
        },
        {
          "acteurRef": "PA610681",
          "presence": "présent"
        },
        {
          "acteurRef": "PA720362",
          "presence": "absent"
        },
        {
          "acteurRef": "PA720968",
          "presence": "présent"
        },
        {
          "acteurRef": "PA722312",
          "presence": "présent"
        },
        {
          "acteurRef": "PA508",
          "presence": "présent"
        },
        {
          "acteurRef": "PA720822",
          "presence": "absent"
        },
        {
          "acteurRef": "PA719980",
          "presence": "absent"
        },
        {
          "acteurRef": "PA608083",
          "presence": "présent"
        },
        {
          "acteurRef": "PA721336",
          "presence": "absent"
        },
        {
          "acteurRef": "PA721218",
          "presence": "présent"
        },
        {
          "acteurRef": "PA720468",
          "presence": "absent"
        },
        {
          "acteurRef": "PA856",
          "presence": "présent"
        },
        {
          "acteurRef": "PA722126",
          "presence": "absent"
        },
        {
          "acteurRef": "PA642868",
          "presence": "présent"
        },
        {
          "acteurRef": "PA719756",
          "presence": "présent"
        },
        {
          "acteurRef": "PA719814",
          "presence": "présent"
        },
        {
          "acteurRef": "PA722390",
          "presence": "absent"
        },
        {
          "acteurRef": "PA720932",
          "presence": "présent"
        },
        {
          "acteurRef": "PA718694",
          "presence": "absent"
        },
        {
          "acteurRef": "PA718926",
          "presence": "présent"
        },
        {
          "acteurRef": "PA267289",
          "presence": "absent"
        },
        {
          "acteurRef": "PA608292",
          "presence": "excusé"
        },
        {
          "acteurRef": "PA720046",
          "presence": "présent"
        },
        {
          "acteurRef": "PA720002",
          "presence": "présent"
        },
        {
          "acteurRef": "PA720924",
          "presence": "absent"
        },
        {
          "acteurRef": "PA719570",
          "presence": "présent"
        },
        {
          "acteurRef": "PA720286",
          "presence": "absent"
        },
        {
          "acteurRef": "PA267780",
          "presence": "présent"
        },
        {
          "acteurRef": "PA718706",
          "presence": "présent"
        },
        {
          "acteurRef": "PA721246",
          "presence": "présent"
        },
        {
          "acteurRef": "PA721992",
          "presence": "présent"
        },
        {
          "acteurRef": "PA720170",
          "presence": "présent"
        },
        {
          "acteurRef": "PA722062",
          "presence": "présent"
        },
        {
          "acteurRef": "PA267318",
          "presence": "absent"
        },
        {
          "acteurRef": "PA721126",
          "presence": "excusé"
        },
        {
          "acteurRef": "PA720326",
          "presence": "absent"
        },
        {
          "acteurRef": "PA331835",
          "presence": "présent"
        },
        {
          "acteurRef": "PA722374",
          "presence": "présent"
        },
        {
          "acteurRef": "PA720074",
          "presence": "absent"
        },
        {
          "acteurRef": "PA719186",
          "presence": "présent"
        },
        {
          "acteurRef": "PA719842",
          "presence": "présent"
        },
        {
          "acteurRef": "PA720916",
          "presence": "absent"
        },
        {
          "acteurRef": "PA719728",
          "presence": "présent"
        },
        {
          "acteurRef": "PA720480",
          "presence": "présent"
        },
        {
          "acteurRef": "PA267378",
          "presence": "absent"
        },
        {
          "acteurRef": "PA606712",
          "presence": "présent"
        },
        {
          "acteurRef": "PA717379",
          "presence": "présent"
        },
        {
          "acteurRef": "PA720988",
          "presence": "présent"
        },
        {
          "acteurRef": "PA719338",
          "presence": "présent"
        },
        {
          "acteurRef": "PA719072",
          "presence": "présent"
        },
        {
          "acteurRef": "PA720738",
          "presence": "présent"
        },
        {
          "acteurRef": "PA610654",
          "presence": "excusé"
        },
        {
          "acteurRef": "PA2377",
          "presence": "absent"
        },
        {
          "acteurRef": "PA720500",
          "presence": "présent"
        },
        {
          "acteurRef": "PA721710",
          "presence": "présent"
        },
        {
          "acteurRef": "PA720512",
          "presence": "présent"
        },
        {
          "acteurRef": "PA718910",
          "presence": "présent"
        },
        {
          "acteurRef": "PA720422",
          "presence": "présent"
        },
        {
          "acteurRef": "PA721286",
          "presence": "absent"
        },
        {
          "acteurRef": "PA721070",
          "presence": "excusé"
        },
        {
          "acteurRef": "PA721062",
          "presence": "présent"
        },
        {
          "acteurRef": "PA718810",
          "presence": "présent"
        },
        {
          "acteurRef": "PA722022",
          "presence": "présent"
        },
        {
          "acteurRef": "PA721110",
          "presence": "excusé"
        },
        {
          "acteurRef": "PA719420",
          "presence": "présent"
        },
        {
          "acteurRef": "PA720952",
          "presence": "présent"
        },
        {
          "acteurRef": "PA719350",
          "presence": "présent"
        },
        {
          "acteurRef": "PA722086",
          "presence": "présent"
        },
        {
          "acteurRef": "PA334768",
          "presence": "absent"
        },
        {
          "acteurRef": "PA719540",
          "presence": "présent"
        },
        {
          "acteurRef": "PA643145",
          "presence": "présent"
        },
        {
          "acteurRef": "PA643134",
          "presence": "absent"
        },
        {
          "acteurRef": "PA719930",
          "presence": "présent"
        },
        {
          "acteurRef": "PA721924",
          "presence": "présent"
        },
        {
          "acteurRef": "PA642788",
          "presence": "absent"
        },
        {
          "acteurRef": "PA267585",
          "presence": "absent"
        },
        {
          "acteurRef": "PA722102",
          "presence": "absent"
        },
        {
          "acteurRef": "PA719512",
          "presence": "présent"
        },
        {
          "acteurRef": "PA721474",
          "presence": "présent"
        },
        {
          "acteurRef": "PA722268",
          "presence": "présent"
        }
      ]
    },
    "personnesAuditionnees": null
  },
  "sessionRef": null,
  "ouverturePresse": "true",
  "captationVideo": "false",
  "ODJ": {
    "convocationODJ": {
      "item": [
        "Suite de l'examen des articles du projet de loi pour la liberté de choisir son avenir professionnel (n°904) (Mmes Nathalie Elimas, Catherine Fabre et M. Aurélien Taché, rapporteurs)",
        "Désignation d’un rapporteur pour avis sur le projet de loi constitutionnelle pour une démocratie plus représentative, responsable et efficace (n° 911)"
      ]
    },
    "resumeODJ": {
      "item": [
        "pour la liberté de choisir son avenir professionnel (suite rapport) (n°904) (Mmes Nathalie Elimas, Catherine Fabre et M. Aurélien Taché, rapporteurs)",
        "désignation d'un rapporteur"
      ]
    },
    "pointsODJ": {
      "pointODJ": [
        {
          "@xsi:type": "podjReunion_type",
          "uid": "RUANR5L15S2018IDC429278PT25679",
          "cycleDeVie": {
            "etat": "Supprimé",
            "chrono": {
              "creation": "2018-05-09T00:00:00.000+02:00",
              "cloture": "2018-06-11T00:00:00.000+02:00"
            }
          },
          "objet": "Examen du texte",
          "demandeurPoint": null,
          "procedure": null,
          "dossiersLegislatifsRefs": null,
          "typePointODJ": "Examen",
          "comiteSecret": "false",
          "textesAssocies": null
        },
        {
          "@xsi:type": "podjReunion_type",
          "uid": "RUANR5L15S2018IDC429278PT25794",
          "cycleDeVie": {
            "etat": "Confirmé",
            "chrono": {
              "creation": "2018-06-11T00:00:00.000+02:00",
              "cloture": null
            }
          },
          "objet": "Examen du texte",
          "demandeurPoint": null,
          "procedure": null,
          "dossiersLegislatifsRefs": {
            "dossierRef": "DLR5L15N36601"
          },
          "typePointODJ": "Examen",
          "comiteSecret": "false",
          "textesAssocies": null
        },
        {
          "@xsi:type": "podjReunion_type",
          "uid": "RUANR5L15S2018IDC429278PT25795",
          "cycleDeVie": {
            "etat": "Confirmé",
            "chrono": {
              "creation": "2018-06-11T00:00:00.000+02:00",
              "cloture": null
            }
          },
          "objet": "Désignation du rapporteur pour avis",
          "demandeurPoint": null,
          "procedure": null,
          "dossiersLegislatifsRefs": {
            "dossierRef": "DLR5L15N36615"
          },
          "typePointODJ": "Nomination rapporteur pour avis",
          "comiteSecret": "false",
          "textesAssocies": null
        }
      ]
    }
  },
  "compteRenduRef": "CRCANR5L15S2018PO420120N076",
  "formatReunion": "Ordinaire",
  "infosReunionsInternationale": {
    "estReunionInternationale": "false",
    "listePays": null,
    "informationsComplementaires": null
  }
}