{
  "@xmlns": "http://schemas.assemblee-nationale.fr/referentiel",
  "@xmlns:xsi": "http://www.w3.org/2001/XMLSchema-instance",
  "@xsi:type": "seance_type",
  "uid": "RUANR5L15S2018IDS21254",
  "timeStampDebut": "2018-09-28T15:00:00.000+02:00",
  "timeStampFin": "2018-09-28T20:00:00.000+02:00",
  "lieu": {
    "code": "AN",
    "libelleLong": "Assemblée nationale"
  },
  "cycleDeVie": {
    "etat": "Confirmé",
    "chrono": {
      "creation": "2018-09-10T00:00:00.000+02:00",
      "cloture": null
    }
  },
  "organeReuniRef": "PO717460",
  "demandeur": null,
  "participants": null,
  "sessionRef": "SCR5A2018E2",
  "ouverturePresse": "true",
  "captationVideo": "true",
  "ODJ": {
    "convocationODJ": null,
    "resumeODJ": null,
    "pointsODJ": {
      "pointODJ": [
        {
          "@xsi:type": "podjSeanceConfPres_type",
          "uid": "RUANR5L15S2018IDS21254PT36300",
          "cycleDeVie": {
            "etat": "Supprimé",
            "chrono": {
              "creation": "2018-09-10T00:00:00.000+02:00",
              "cloture": "2018-09-11T00:00:00.000+02:00"
            }
          },
          "objet": "Suite de la discussion du projet de loi relatif à la croissance et la transformation des entreprises",
          "demandeurPoint": null,
          "procedure": null,
          "dossiersLegislatifsRefs": null,
          "typePointODJ": "Suite de la discussion",
          "comiteSecret": "false",
          "textesAssocies": null,
          "natureTravauxODJ": "ODJPR"
        },
        {
          "@xsi:type": "podjSeanceConfPres_type",
          "uid": "RUANR5L15S2018IDS21254PT36312",
          "cycleDeVie": {
            "etat": "Confirmé",
            "chrono": {
              "creation": "2018-09-11T00:00:00.000+02:00",
              "cloture": null
            }
          },
          "objet": "Suite de la discussion du projet de loi relatif à la croissance et la transformation des entreprises",
          "demandeurPoint": null,
          "procedure": null,
          "dossiersLegislatifsRefs": {
            "dossierRef": "DLR5L15N36728"
          },
          "typePointODJ": "Suite de la discussion",
          "comiteSecret": "false",
          "textesAssocies": null,
          "natureTravauxODJ": "ODJPR"
        }
      ]
    }
  },
  "compteRenduRef": "CRSANR5L15S2018E2N022",
  "identifiants": {
    "numSeanceJO": "22",
    "idJO": "20182022",
    "quantieme": "Deuxième",
    "DateSeance": "2018-09-28+02:00"
  }
}