{
  "@xmlns": "http://schemas.assemblee-nationale.fr/referentiel",
  "@xmlns:xsi": "http://www.w3.org/2001/XMLSchema-instance",
  "@xsi:type": "reunionCommission_type",
  "uid": "RUANR5L15S2018IDC429533",
  "timeStampDebut": "2018-05-24T09:30:00.000+02:00",
  "timeStampFin": "2018-05-24T10:10:00.000+02:00",
  "lieu": {
    "libelleLong": "salle 6242 (Lois)"
  },
  "cycleDeVie": {
    "etat": "Confirmé",
    "chrono": {
      "creation": "2018-05-18T00:00:00.000+02:00",
      "cloture": null
    }
  },
  "organeReuniRef": "PO734685",
  "demandeur": null,
  "participants": {
    "participantsInternes": {
      "participantInterne": [
        {
          "acteurRef": "PA721836",
          "presence": "présent"
        },
        {
          "acteurRef": "PA722170",
          "presence": "excusé"
        },
        {
          "acteurRef": "PA722046",
          "presence": "absent"
        },
        {
          "acteurRef": "PA642868",
          "presence": "absent"
        },
        {
          "acteurRef": "PA923",
          "presence": "présent"
        },
        {
          "acteurRef": "PA718720",
          "presence": "absent"
        },
        {
          "acteurRef": "PA719692",
          "presence": "présent"
        },
        {
          "acteurRef": "PA332614",
          "presence": "excusé"
        },
        {
          "acteurRef": "PA722142",
          "presence": "absent"
        },
        {
          "acteurRef": "PA709315",
          "presence": "excusé"
        }
      ]
    },
    "personnesAuditionnees": null
  },
  "sessionRef": null,
  "ouverturePresse": "false",
  "captationVideo": "false",
  "ODJ": {
    "convocationODJ": {
      "item": "Présentation du rapport (M. Jean-François Eliaou, rapporteur)."
    },
    "resumeODJ": {
      "item": "présentation du rapport (M. Jean-François Eliaou, rapporteur)."
    },
    "pointsODJ": null
  },
  "compteRenduRef": null,
  "formatReunion": "Ordinaire",
  "infosReunionsInternationale": {
    "estReunionInternationale": "false",
    "listePays": null,
    "informationsComplementaires": null
  }
}