{
  "@xmlns": "http://schemas.assemblee-nationale.fr/referentiel",
  "@xmlns:xsi": "http://www.w3.org/2001/XMLSchema-instance",
  "@xsi:type": "reunionInitParlementaire_type",
  "uid": "RUANR5L15S2019IDF0137489",
  "timeStampDebut": "2019-07-30T13:30:00.000+02:00",
  "timeStampFin": "2019-07-30T14:30:00.000+02:00",
  "lieu": {
    "code": "SALREU021",
    "libelleCourt": "Salle 7207",
    "libelleLong": "Salle 7207, 101, rue de l'Université"
  },
  "cycleDeVie": {
    "etat": "Annulé",
    "chrono": {
      "creation": "2019-07-16T10:52:07.000+02:00",
      "cloture": "2019-07-24T09:19:38.000+02:00"
    }
  },
  "demandeurs": {
    "acteur": {
      "nom": "Mme Cécile UNTERMAIER",
      "acteurRef": "PA608695"
    }
  },
  "organeReuniRef": null,
  "typeReunion": "DEP"
}