{
  "@xmlns": "http://schemas.assemblee-nationale.fr/referentiel",
  "@xmlns:xsi": "http://www.w3.org/2001/XMLSchema-instance",
  "@xsi:type": "reunionInitParlementaire_type",
  "uid": "RUANR5L15S2019IDF0138102",
  "timeStampDebut": "2019-09-05T14:00:00.000+02:00",
  "timeStampFin": "2019-09-05T16:00:00.000+02:00",
  "lieu": {
    "code": "SALREU017",
    "libelleCourt": "Salon Visconti",
    "libelleLong": "Salon Visconti, 101, rue de l'Université"
  },
  "cycleDeVie": {
    "etat": "Confirmé",
    "chrono": {
      "creation": "2019-07-26T10:32:04.000+02:00",
      "cloture": null
    }
  },
  "demandeurs": {
    "acteur": {
      "nom": "Mme Laure DE LA RAUDIÈRE",
      "acteurRef": "PA331567"
    }
  },
  "organeReuniRef": null,
  "typeReunion": "DEP"
}