{
  "@xmlns": "http://schemas.assemblee-nationale.fr/referentiel",
  "@xmlns:xsi": "http://www.w3.org/2001/XMLSchema-instance",
  "@xsi:type": "reunionInitParlementaire_type",
  "uid": "RUANR5L15S2018IDF0103434",
  "timeStampDebut": "2018-01-17T16:30:00.000+01:00",
  "timeStampFin": "2018-01-17T17:30:00.000+01:00",
  "lieu": {
    "code": "SALREU002",
    "libelleCourt": "Salle 7070",
    "libelleLong": "Salle 7070, 103, rue de l'Université"
  },
  "cycleDeVie": {
    "etat": "Confirmé",
    "chrono": {
      "creation": "2018-01-11T16:09:40.000+01:00",
      "cloture": null
    }
  },
  "demandeurs": {
    "acteur": {
      "nom": "M. Christophe AREND",
      "acteurRef": "PA720310"
    }
  },
  "organeReuniRef": null,
  "typeReunion": "DEP"
}