{
  "@xmlns": "http://schemas.assemblee-nationale.fr/referentiel",
  "@xmlns:xsi": "http://www.w3.org/2001/XMLSchema-instance",
  "@xsi:type": "reunionCommission_type",
  "uid": "RUANR5L15S2019IDC430832",
  "timeStampDebut": "2018-11-22T15:00:00.000+01:00",
  "lieu": {
    "libelleLong": "salle du CEC"
  },
  "cycleDeVie": {
    "etat": "Confirmé",
    "chrono": {
      "creation": "2018-11-16T00:00:00.000+01:00",
      "cloture": null
    }
  },
  "organeReuniRef": "PO759174",
  "demandeur": null,
  "participants": {
    "participantsInternes": null,
    "personnesAuditionnees": {
      "personneAuditionnee": null
    }
  },
  "sessionRef": null,
  "ouverturePresse": "false",
  "captationVideo": "false",
  "ODJ": {
    "convocationODJ": {
      "item": "Audition de M. Bastien Llorca, sous-directeur du contrôle fiscal à la direction générale des finances publiques (DGFiP), accompagné de M. Olivier Vizet, chef du bureau de l’action pénale."
    },
    "resumeODJ": {
      "item": "audition de M. Bastien Llorca, sous-directeur du contrôle fiscal à la direction générale des finances publiques (DGFiP), accompagné de M. Olivier Vizet, chef du bureau de l’action pénale."
    },
    "pointsODJ": null
  },
  "compteRenduRef": null,
  "formatReunion": "Ordinaire",
  "infosReunionsInternationale": {
    "estReunionInternationale": "false",
    "listePays": null,
    "informationsComplementaires": null
  }
}