{
  "@xmlns": "http://schemas.assemblee-nationale.fr/referentiel",
  "@xmlns:xsi": "http://www.w3.org/2001/XMLSchema-instance",
  "@xsi:type": "reunionInitParlementaire_type",
  "uid": "RUANR5L15S2019IDF0119961",
  "timeStampDebut": "2018-11-23T12:30:00.000+01:00",
  "timeStampFin": "2018-11-23T18:30:00.000+01:00",
  "lieu": {
    "code": "SALREU003",
    "libelleCourt": "Salle Victor Hugo",
    "libelleLong": "Salle Victor Hugo, 101, rue de l'Université"
  },
  "cycleDeVie": {
    "etat": "Annulé",
    "chrono": {
      "creation": "2018-10-02T17:50:29.000+01:00",
      "cloture": "2018-10-18T16:41:02.000+01:00"
    }
  },
  "demandeurs": {
    "acteur": {
      "nom": "M. Pacôme RUPIN",
      "acteurRef": "PA721616"
    }
  },
  "organeReuniRef": null,
  "typeReunion": "DEP"
}