{
  "@xmlns": "http://schemas.assemblee-nationale.fr/referentiel",
  "@xmlns:xsi": "http://www.w3.org/2001/XMLSchema-instance",
  "@xsi:type": "reunionInitParlementaire_type",
  "uid": "RUANR5L15S2020IDF0143855",
  "timeStampDebut": "2019-11-20T18:00:00.000+01:00",
  "timeStampFin": "2019-11-20T19:30:00.000+01:00",
  "lieu": {
    "code": "SALREU012",
    "libelleCourt": "Salle N° 23",
    "libelleLong": "Salle N° 23, 3, rue Aristide Briand"
  },
  "cycleDeVie": {
    "etat": "Confirmé",
    "chrono": {
      "creation": "2019-11-18T15:34:46.000+01:00",
      "cloture": null
    }
  },
  "demandeurs": {
    "acteur": {
      "nom": "M. Cyrille ISAAC-SIBILLE",
      "acteurRef": "PA722374"
    }
  },
  "organeReuniRef": null,
  "typeReunion": "DEP"
}