{
  "@xmlns": "http://schemas.assemblee-nationale.fr/referentiel",
  "@xmlns:xsi": "http://www.w3.org/2001/XMLSchema-instance",
  "@xsi:type": "reunionCommission_type",
  "uid": "RUANR5L15S2018IDC428402",
  "timeStampDebut": "2018-01-30T16:15:00.000+01:00",
  "lieu": {
    "libelleLong": "salle 4013 (33 rue Saint-Dominique)"
  },
  "cycleDeVie": {
    "etat": "Confirmé",
    "chrono": {
      "creation": "2018-01-26T00:00:00.000+01:00",
      "cloture": null
    }
  },
  "organeReuniRef": "PO743823",
  "demandeur": null,
  "participants": {
    "participantsInternes": null,
    "personnesAuditionnees": null
  },
  "sessionRef": null,
  "ouverturePresse": "false",
  "captationVideo": "false",
  "ODJ": {
    "convocationODJ": {
      "item": "Audition du général de corps d'armée Jean-François Hogard, directeur du Renseignement et de la Sécurité de la Défense ;"
    },
    "resumeODJ": {
      "item": "audition du général de corps d'armée Jean-François Hogard, directeur du Renseignement et de la Sécurité de la Défense ;"
    },
    "pointsODJ": null
  },
  "compteRenduRef": null,
  "formatReunion": "Ordinaire",
  "infosReunionsInternationale": {
    "estReunionInternationale": "false",
    "listePays": null,
    "informationsComplementaires": null
  }
}