{
  "@xmlns": "http://schemas.assemblee-nationale.fr/referentiel",
  "@xmlns:xsi": "http://www.w3.org/2001/XMLSchema-instance",
  "@xsi:type": "reunionCommission_type",
  "uid": "RUANR5L15S2018IDC429578",
  "timeStampDebut": "2018-05-31T09:15:00.000+02:00",
  "timeStampFin": "2018-05-31T10:30:00.000+02:00",
  "lieu": {
    "libelleLong": "9e Bureau"
  },
  "cycleDeVie": {
    "etat": "Confirmé",
    "chrono": {
      "creation": "2018-05-24T00:00:00.000+02:00",
      "cloture": null
    }
  },
  "organeReuniRef": "PO751920",
  "demandeur": null,
  "participants": {
    "participantsInternes": null,
    "personnesAuditionnees": null
  },
  "sessionRef": null,
  "ouverturePresse": "false",
  "captationVideo": "false",
  "ODJ": {
    "convocationODJ": {
      "item": "– Table ronde ONG : Audition de Mme Lison REHBINDER (CCFD), Mme Eva JOLY et M. Gabriel ZUCMAN (ICRICT), et Mme Manon AUBRY (Oxfam)"
    },
    "resumeODJ": {
      "item": "– table ronde ONG : audition de Mme Lison Rehbinder (CCFD), Mme Eva Joly et M. Gabriel Zucman (ICRICT), et Mme Manon Aubry (Oxfam)."
    },
    "pointsODJ": null
  },
  "compteRenduRef": null,
  "formatReunion": "Ordinaire",
  "infosReunionsInternationale": {
    "estReunionInternationale": "false",
    "listePays": null,
    "informationsComplementaires": null
  }
}