{
  "@xmlns": "http://schemas.assemblee-nationale.fr/referentiel",
  "@xmlns:xsi": "http://www.w3.org/2001/XMLSchema-instance",
  "@xsi:type": "seance_type",
  "uid": "RUSNR5L15S2018IDS21179",
  "timeStampDebut": "2018-07-05T10:30:00.000+02:00",
  "timeStampFin": "2018-07-05T18:55:00.000+02:00",
  "lieu": {
    "code": "S",
    "libelleLong": "Sénat"
  },
  "cycleDeVie": {
    "etat": "Confirmé",
    "chrono": {
      "creation": "2018-06-22T00:00:00.000+02:00",
      "cloture": null
    }
  },
  "organeReuniRef": "PO78718",
  "demandeur": null,
  "participants": null,
  "sessionRef": "SCR5A2018E1",
  "ouverturePresse": "true",
  "captationVideo": "true",
  "ODJ": {
    "convocationODJ": null,
    "resumeODJ": null,
    "pointsODJ": {
      "pointODJ": {
        "@xsi:type": "podjSeanceConfPres_type",
        "uid": "RUSNR5L15S2018IDS21179PT36161",
        "cycleDeVie": {
          "etat": "Confirmé",
          "chrono": {
            "creation": "2018-06-22T00:00:00.000+02:00",
            "cloture": null
          }
        },
        "objet": "Suite de la discussion du projet de loi, adopté par l'Assemblée nationale après engagement de la procédure accélérée, renforçant la lutte contre les violences sexuelles et sexistes (texte de la commission, n° 590, 2017-2018)",
        "demandeurPoint": null,
        "procedure": null,
        "dossiersLegislatifsRefs": {
          "dossierRef": "DLR5L15N36496"
        },
        "typePointODJ": "Suite de la discussion",
        "comiteSecret": "false",
        "textesAssocies": null,
        "natureTravauxODJ": "ODJPR",
        "dateConfPres": "2018-06-20+02:00"
      }
    }
  },
  "compteRenduRef": "CRSSNR5S2018IDS20180705",
  "identifiants": {
    "numSeanceJO": "4",
    "idJO": "20181004",
    "quantieme": "Unique",
    "DateSeance": "2018-07-05+02:00"
  }
}