{
  "@xmlns": "http://schemas.assemblee-nationale.fr/referentiel",
  "@xmlns:xsi": "http://www.w3.org/2001/XMLSchema-instance",
  "@xsi:type": "reunionCommission_type",
  "uid": "RUANR5L15S2019IDC431151",
  "timeStampDebut": "2019-01-29T21:05:00.000+01:00",
  "timeStampFin": "2019-01-30T01:00:00.000+01:00",
  "lieu": {
    "libelleLong": "salle 6238 (Affaires culturelles)"
  },
  "cycleDeVie": {
    "etat": "Confirmé",
    "chrono": {
      "creation": "2019-01-10T00:00:00.000+01:00",
      "cloture": null
    }
  },
  "organeReuniRef": "PO419604",
  "demandeur": null,
  "participants": {
    "participantsInternes": {
      "participantInterne": [
        {
          "acteurRef": "PA720124",
          "presence": "absent"
        },
        {
          "acteurRef": "PA719318",
          "presence": "présent"
        },
        {
          "acteurRef": "PA720256",
          "presence": "présent"
        },
        {
          "acteurRef": "PA718884",
          "presence": "présent"
        },
        {
          "acteurRef": "PA718884",
          "presence": "présent"
        },
        {
          "acteurRef": "PA722046",
          "presence": "présent"
        },
        {
          "acteurRef": "PA719488",
          "presence": "présent"
        },
        {
          "acteurRef": "PA720822",
          "presence": "absent"
        },
        {
          "acteurRef": "PA720576",
          "presence": "présent"
        },
        {
          "acteurRef": "PA721816",
          "presence": "absent"
        },
        {
          "acteurRef": "PA722030",
          "presence": "absent"
        },
        {
          "acteurRef": "PA719032",
          "presence": "présent"
        },
        {
          "acteurRef": "PA330008",
          "presence": "présent"
        },
        {
          "acteurRef": "PA223837",
          "presence": "absent"
        },
        {
          "acteurRef": "PA721328",
          "presence": "présent"
        },
        {
          "acteurRef": "PA719890",
          "presence": "présent"
        },
        {
          "acteurRef": "PA721750",
          "presence": "présent"
        },
        {
          "acteurRef": "PA719138",
          "presence": "présent"
        },
        {
          "acteurRef": "PA721352",
          "presence": "absent"
        },
        {
          "acteurRef": "PA721860",
          "presence": "présent"
        },
        {
          "acteurRef": "PA721218",
          "presence": "présent"
        },
        {
          "acteurRef": "PA719170",
          "presence": "présent"
        },
        {
          "acteurRef": "PA760658",
          "presence": "absent"
        },
        {
          "acteurRef": "PA702054",
          "presence": "présent"
        },
        {
          "acteurRef": "PA719814",
          "presence": "absent"
        },
        {
          "acteurRef": "PA719118",
          "presence": "absent"
        },
        {
          "acteurRef": "PA942",
          "presence": "présent"
        },
        {
          "acteurRef": "PA720696",
          "presence": "présent"
        },
        {
          "acteurRef": "PA718926",
          "presence": "absent"
        },
        {
          "acteurRef": "PA719162",
          "presence": "présent"
        },
        {
          "acteurRef": "PA608826",
          "presence": "absent"
        },
        {
          "acteurRef": "PA721194",
          "presence": "absent"
        },
        {
          "acteurRef": "PA721094",
          "presence": "absent"
        },
        {
          "acteurRef": "PA719044",
          "presence": "présent"
        },
        {
          "acteurRef": "PA721896",
          "presence": "présent"
        },
        {
          "acteurRef": "PA720030",
          "presence": "présent"
        },
        {
          "acteurRef": "PA720178",
          "presence": "absent"
        },
        {
          "acteurRef": "PA267324",
          "presence": "absent"
        },
        {
          "acteurRef": "PA605991",
          "presence": "présent"
        },
        {
          "acteurRef": "PA719108",
          "presence": "présent"
        },
        {
          "acteurRef": "PA721784",
          "presence": "absent"
        },
        {
          "acteurRef": "PA722062",
          "presence": "présent"
        },
        {
          "acteurRef": "PA722070",
          "presence": "absent"
        },
        {
          "acteurRef": "PA718794",
          "presence": "absent"
        },
        {
          "acteurRef": "PA608416",
          "presence": "présent"
        },
        {
          "acteurRef": "PA722374",
          "presence": "présent"
        },
        {
          "acteurRef": "PA332614",
          "presence": "présent"
        },
        {
          "acteurRef": "PA719230",
          "presence": "présent"
        },
        {
          "acteurRef": "PA721506",
          "presence": "présent"
        },
        {
          "acteurRef": "PA643205",
          "presence": "présent"
        },
        {
          "acteurRef": "PA718868",
          "presence": "présent"
        },
        {
          "acteurRef": "PA719728",
          "presence": "présent"
        },
        {
          "acteurRef": "PA345722",
          "presence": "absent"
        },
        {
          "acteurRef": "PA720446",
          "presence": "présent"
        },
        {
          "acteurRef": "PA720988",
          "presence": "présent"
        },
        {
          "acteurRef": "PA719640",
          "presence": "présent"
        },
        {
          "acteurRef": "PA719272",
          "presence": "présent"
        },
        {
          "acteurRef": "PA720630",
          "presence": "présent"
        },
        {
          "acteurRef": "PA607619",
          "presence": "présent"
        },
        {
          "acteurRef": "PA719456",
          "presence": "présent"
        },
        {
          "acteurRef": "PA721656",
          "presence": "absent"
        },
        {
          "acteurRef": "PA335532",
          "presence": "présent"
        },
        {
          "acteurRef": "PA721234",
          "presence": "présent"
        },
        {
          "acteurRef": "PA721844",
          "presence": "présent"
        },
        {
          "acteurRef": "PA721916",
          "presence": "présent"
        },
        {
          "acteurRef": "PA720100",
          "presence": "présent"
        },
        {
          "acteurRef": "PA722194",
          "presence": "présent"
        },
        {
          "acteurRef": "PA405480",
          "presence": "présent"
        },
        {
          "acteurRef": "PA718944",
          "presence": "présent"
        },
        {
          "acteurRef": "PA721888",
          "presence": "absent"
        },
        {
          "acteurRef": "PA266776",
          "presence": "présent"
        },
        {
          "acteurRef": "PA719676",
          "presence": "absent"
        },
        {
          "acteurRef": "PA720900",
          "presence": "présent"
        },
        {
          "acteurRef": "PA722252",
          "presence": "absent"
        },
        {
          "acteurRef": "PA718902",
          "presence": "absent"
        },
        {
          "acteurRef": "PA720190",
          "presence": "absent"
        },
        {
          "acteurRef": "PA720754",
          "presence": "présent"
        },
        {
          "acteurRef": "PA719350",
          "presence": "présent"
        },
        {
          "acteurRef": "PA720854",
          "presence": "présent"
        },
        {
          "acteurRef": "PA720568",
          "presence": "présent"
        },
        {
          "acteurRef": "PA608741",
          "presence": "présent"
        },
        {
          "acteurRef": "PA340357",
          "presence": "présent"
        },
        {
          "acteurRef": "PA722102",
          "presence": "présent"
        },
        {
          "acteurRef": "PA606639",
          "presence": "absent"
        },
        {
          "acteurRef": "PA722260",
          "presence": "absent"
        }
      ]
    },
    "personnesAuditionnees": null
  },
  "sessionRef": null,
  "ouverturePresse": "true",
  "captationVideo": "false",
  "ODJ": {
    "convocationODJ": {
      "item": "– Examen des articles du projet de loi sur l’école de la confiance (n° 1481) (Mmes Fannette Charvier et Anne-Christine Lang, rapporteures)"
    },
    "resumeODJ": {
      "item": "école de la confiance (n° 1481) (Mmes Fannette Charvier et Anne-Christine Lang, rapporteures) (première lecture)."
    },
    "pointsODJ": {
      "pointODJ": {
        "@xsi:type": "podjReunion_type",
        "uid": "RUANR5L15S2019IDC431151PT26292",
        "cycleDeVie": {
          "etat": "Eventuel",
          "chrono": {
            "creation": "2019-01-10T00:00:00.000+01:00",
            "cloture": null
          }
        },
        "objet": "Examen du texte",
        "demandeurPoint": null,
        "procedure": null,
        "dossiersLegislatifsRefs": {
          "dossierRef": "DLR5L15N37055"
        },
        "typePointODJ": "Examen",
        "comiteSecret": "false",
        "textesAssocies": null
      }
    }
  },
  "compteRenduRef": "CRCANR5L15S2019PO419604N028",
  "formatReunion": "Ordinaire",
  "infosReunionsInternationale": {
    "estReunionInternationale": "false",
    "listePays": null,
    "informationsComplementaires": null
  }
}