{
  "@xmlns": "http://schemas.assemblee-nationale.fr/referentiel",
  "@xmlns:xsi": "http://www.w3.org/2001/XMLSchema-instance",
  "@xsi:type": "reunionInitParlementaire_type",
  "uid": "RUANR5L15S2018IDF0112372",
  "timeStampDebut": "2018-07-05T14:30:00.000+02:00",
  "timeStampFin": "2018-07-05T15:30:00.000+02:00",
  "lieu": {
    "code": "SALREU049",
    "libelleCourt": "Salle 6822",
    "libelleLong": "Salle 6822, Palais Bourbon"
  },
  "cycleDeVie": {
    "etat": "Confirmé",
    "chrono": {
      "creation": "2018-05-25T15:02:57.000+02:00",
      "cloture": null
    }
  },
  "demandeurs": {
    "acteur": {
      "nom": "M. Philippe CHALUMEAU",
      "acteurRef": "PA719790"
    }
  },
  "organeReuniRef": null,
  "typeReunion": "DEP"
}