{
  "@xmlns": "http://schemas.assemblee-nationale.fr/referentiel",
  "@xmlns:xsi": "http://www.w3.org/2001/XMLSchema-instance",
  "@xsi:type": "reunionInitParlementaire_type",
  "uid": "RUANR5L15S2018IDF0099897",
  "timeStampDebut": "2017-12-07T10:00:00.000+01:00",
  "timeStampFin": "2017-12-07T12:00:00.000+01:00",
  "lieu": {
    "code": "SALREU016",
    "libelleCourt": "Salon Gabriel",
    "libelleLong": "Salon Gabriel, 101, rue de l'Université"
  },
  "cycleDeVie": {
    "etat": "Confirmé",
    "chrono": {
      "creation": "2017-11-07T18:25:12.000+01:00",
      "cloture": null
    }
  },
  "demandeurs": {
    "acteur": {
      "nom": "M. Hubert JULIEN-LAFERRIERE",
      "acteurRef": "PA722344"
    }
  },
  "organeReuniRef": null,
  "typeReunion": "DEP"
}