{
  "@xmlns": "http://schemas.assemblee-nationale.fr/referentiel",
  "@xmlns:xsi": "http://www.w3.org/2001/XMLSchema-instance",
  "@xsi:type": "reunionCommission_type",
  "uid": "RUANR5L15S2018IDC429582",
  "timeStampDebut": "2018-05-30T11:15:00.000+02:00",
  "timeStampFin": "2018-05-30T12:45:00.000+02:00",
  "lieu": {
    "libelleLong": "6e Bureau"
  },
  "cycleDeVie": {
    "etat": "Confirmé",
    "chrono": {
      "creation": "2018-05-24T00:00:00.000+02:00",
      "cloture": null
    }
  },
  "organeReuniRef": "PO754360",
  "demandeur": null,
  "participants": {
    "participantsInternes": {
      "participantInterne": [
        {
          "acteurRef": "PA609726",
          "presence": "excusé"
        },
        {
          "acteurRef": "PA642764",
          "presence": "absent"
        },
        {
          "acteurRef": "PA722312",
          "presence": "absent"
        },
        {
          "acteurRef": "PA718990",
          "presence": "absent"
        },
        {
          "acteurRef": "PA267233",
          "presence": "excusé"
        },
        {
          "acteurRef": "PA721336",
          "presence": "présent"
        },
        {
          "acteurRef": "PA767",
          "presence": "absent"
        },
        {
          "acteurRef": "PA719170",
          "presence": "absent"
        },
        {
          "acteurRef": "PA267306",
          "presence": "absent"
        },
        {
          "acteurRef": "PA721808",
          "presence": "présent"
        },
        {
          "acteurRef": "PA720696",
          "presence": "absent"
        },
        {
          "acteurRef": "PA720862",
          "presence": "absent"
        },
        {
          "acteurRef": "PA1276",
          "presence": "absent"
        },
        {
          "acteurRef": "PA1327",
          "presence": "absent"
        },
        {
          "acteurRef": "PA722366",
          "presence": "présent"
        },
        {
          "acteurRef": "PA720038",
          "presence": "présent"
        },
        {
          "acteurRef": "PA722344",
          "presence": "absent"
        },
        {
          "acteurRef": "PA720022",
          "presence": "absent"
        },
        {
          "acteurRef": "PA720916",
          "presence": "absent"
        },
        {
          "acteurRef": "PA719412",
          "presence": "présent"
        },
        {
          "acteurRef": "PA719858",
          "presence": "absent"
        },
        {
          "acteurRef": "PA720944",
          "presence": "présent"
        },
        {
          "acteurRef": "PA718910",
          "presence": "absent"
        },
        {
          "acteurRef": "PA267260",
          "presence": "absent"
        },
        {
          "acteurRef": "PA719578",
          "presence": "présent"
        },
        {
          "acteurRef": "PA720092",
          "presence": "absent"
        },
        {
          "acteurRef": "PA719972",
          "presence": "absent"
        },
        {
          "acteurRef": "PA719540",
          "presence": "présent"
        },
        {
          "acteurRef": "PA720586",
          "presence": "présent"
        }
      ]
    },
    "personnesAuditionnees": null
  },
  "sessionRef": null,
  "ouverturePresse": "true",
  "captationVideo": "false",
  "ODJ": {
    "convocationODJ": {
      "item": "– Audition, ouverte à la presse, de Mme Karine Jacquemart, directrice générale de Foodwatch France."
    },
    "resumeODJ": {
      "item": "audition, ouverte à la presse, de Mme Karine Jacquemart, directrice générale de Foodwatch France."
    },
    "pointsODJ": null
  },
  "compteRenduRef": "CRCANR5L15S2018PO754360N006",
  "formatReunion": "Ordinaire",
  "infosReunionsInternationale": {
    "estReunionInternationale": "false",
    "listePays": null,
    "informationsComplementaires": null
  }
}