{
  "@xmlns": "http://schemas.assemblee-nationale.fr/referentiel",
  "@xmlns:xsi": "http://www.w3.org/2001/XMLSchema-instance",
  "@xsi:type": "seance_type",
  "uid": "RUANR5L15S2018IDS21056",
  "timeStampDebut": "2018-05-25T21:30:00.000+02:00",
  "timeStampFin": "2018-05-26T01:00:00.000+02:00",
  "lieu": {
    "code": "AN",
    "libelleLong": "Assemblée nationale"
  },
  "cycleDeVie": {
    "etat": "Confirmé",
    "chrono": {
      "creation": "2018-04-13T00:00:00.000+02:00",
      "cloture": null
    }
  },
  "organeReuniRef": "PO717460",
  "demandeur": null,
  "participants": null,
  "sessionRef": "SCR5A2018O1",
  "ouverturePresse": "true",
  "captationVideo": "true",
  "ODJ": {
    "convocationODJ": null,
    "resumeODJ": null,
    "pointsODJ": {
      "pointODJ": {
        "@xsi:type": "podjSeanceConfPres_type",
        "uid": "RUANR5L15S2018IDS21056PT35885",
        "cycleDeVie": {
          "etat": "Confirmé",
          "chrono": {
            "creation": "2018-04-13T00:00:00.000+02:00",
            "cloture": null
          }
        },
        "objet": "Suite de la discussion du projet de loi pour l’équilibre des relations commerciales dans le secteur agricole et alimentaire et une alimentation saine et durable",
        "demandeurPoint": null,
        "procedure": null,
        "dossiersLegislatifsRefs": {
          "dossierRef": "DLR5L15N36336"
        },
        "typePointODJ": "Suite de la discussion",
        "comiteSecret": "false",
        "textesAssocies": null,
        "natureTravauxODJ": "ODJPR"
      }
    }
  },
  "compteRenduRef": "CRSANR5L15S2018O1N226",
  "identifiants": {
    "numSeanceJO": "226",
    "idJO": "20180226",
    "quantieme": "Troisième",
    "DateSeance": "2018-05-25+02:00"
  }
}