{
  "@xmlns": "http://schemas.assemblee-nationale.fr/referentiel",
  "@xmlns:xsi": "http://www.w3.org/2001/XMLSchema-instance",
  "@xsi:type": "reunionCommission_type",
  "uid": "RUANR5L15S2019IDC432812",
  "timeStampDebut": "2019-05-21T14:00:00.000+02:00",
  "lieu": {
    "libelleLong": "33 rue Saint-Dominique - Salle 4016"
  },
  "cycleDeVie": {
    "etat": "Confirmé",
    "chrono": {
      "creation": "2019-05-21T00:00:00.000+02:00",
      "cloture": null
    }
  },
  "organeReuniRef": "PO761047",
  "demandeur": null,
  "participants": {
    "participantsInternes": null,
    "personnesAuditionnees": null
  },
  "sessionRef": null,
  "ouverturePresse": "false",
  "captationVideo": "false",
  "ODJ": {
    "convocationODJ": {
      "item": "Audition de M. Luis Vassy, directeur adjoint du cabinet du Ministre de l’Europe et des Affaires étrangères et de M. Martin Briens, directeur du cabinet de la Ministre des Armées et Mme Animya T’chandy, conseillère parlementaire."
    },
    "resumeODJ": {
      "item": "audition de M. Luis Vassy, directeur adjoint du cabinet du ministre de l’Europe et des Affaires étrangères et de M. Martin Briens, directeur du cabinet de la ministre des Armées et Mme Animya T’chandy, conseillère parlementaire"
    },
    "pointsODJ": null
  },
  "compteRenduRef": null,
  "formatReunion": "Ordinaire",
  "infosReunionsInternationale": {
    "estReunionInternationale": "false",
    "listePays": null,
    "informationsComplementaires": null
  }
}