{
  "@xmlns": "http://schemas.assemblee-nationale.fr/referentiel",
  "@xmlns:xsi": "http://www.w3.org/2001/XMLSchema-instance",
  "@xsi:type": "seance_type",
  "uid": "RUANR5L15S2020IDS21926",
  "timeStampDebut": "2019-11-15T21:30:00.000+01:00",
  "lieu": {
    "code": "AN",
    "libelleLong": "Assemblée nationale"
  },
  "cycleDeVie": {
    "etat": "Supprimé",
    "chrono": {
      "creation": "2019-10-07T00:00:00.000+02:00",
      "cloture": "2019-11-15T00:00:00.000+01:00"
    }
  },
  "organeReuniRef": "PO717460",
  "demandeur": null,
  "participants": null,
  "sessionRef": "SCR5A2020O1",
  "ouverturePresse": "true",
  "captationVideo": "true",
  "ODJ": {
    "convocationODJ": null,
    "resumeODJ": null,
    "pointsODJ": {
      "pointODJ": {
        "@xsi:type": "podjSeanceConfPres_type",
        "uid": "RUANR5L15S2020IDS21926PT37764",
        "cycleDeVie": {
          "etat": "Supprimé",
          "chrono": {
            "creation": "2019-10-07T00:00:00.000+02:00",
            "cloture": "2019-11-15T00:00:00.000+01:00"
          }
        },
        "objet": "Suite de la discussion du projet de loi de finances pour 2020 (seconde partie)",
        "demandeurPoint": null,
        "procedure": null,
        "dossiersLegislatifsRefs": null,
        "typePointODJ": "Suite de la discussion",
        "comiteSecret": "false",
        "textesAssocies": null,
        "natureTravauxODJ": "ODJPR"
      }
    }
  },
  "compteRenduRef": "CRSANR5L15S2020O1N073",
  "identifiants": {
    "numSeanceJO": "73",
    "idJO": "20200073",
    "quantieme": "Troisième",
    "DateSeance": "2019-11-15+01:00"
  }
}