{
  "@xmlns": "http://schemas.assemblee-nationale.fr/referentiel",
  "@xmlns:xsi": "http://www.w3.org/2001/XMLSchema-instance",
  "@xsi:type": "reunionCommission_type",
  "uid": "RUANR5L15S2018IDC429664",
  "timeStampDebut": "2018-06-07T08:30:00.000+02:00",
  "timeStampFin": "2018-06-07T10:50:00.000+02:00",
  "lieu": {
    "libelleLong": "salle 4223 (33 rue Saint-Dominique)"
  },
  "cycleDeVie": {
    "etat": "Confirmé",
    "chrono": {
      "creation": "2018-05-31T00:00:00.000+02:00",
      "cloture": null
    }
  },
  "organeReuniRef": "PO756284",
  "demandeur": null,
  "participants": {
    "participantsInternes": {
      "participantInterne": [
        {
          "acteurRef": "PA429891",
          "presence": "absent"
        },
        {
          "acteurRef": "PA722030",
          "presence": "absent"
        },
        {
          "acteurRef": "PA703513",
          "presence": "absent"
        },
        {
          "acteurRef": "PA905",
          "presence": "absent"
        },
        {
          "acteurRef": "PA718926",
          "presence": "présent"
        },
        {
          "acteurRef": "PA703538",
          "presence": "absent"
        },
        {
          "acteurRef": "PA719692",
          "presence": "présent"
        },
        {
          "acteurRef": "PA721142",
          "presence": "présent"
        },
        {
          "acteurRef": "PA415454",
          "presence": "absent"
        },
        {
          "acteurRef": "PA267200",
          "presence": "excusé"
        },
        {
          "acteurRef": "PA415476",
          "presence": "absent"
        },
        {
          "acteurRef": "PA703536",
          "presence": "absent"
        },
        {
          "acteurRef": "PA736229",
          "presence": "absent"
        },
        {
          "acteurRef": "PA720846",
          "presence": "présent"
        },
        {
          "acteurRef": "PA721984",
          "presence": "présent"
        },
        {
          "acteurRef": "PA719952",
          "presence": "présent"
        },
        {
          "acteurRef": "PA304017",
          "presence": "absent"
        },
        {
          "acteurRef": "PA2337",
          "presence": "absent"
        },
        {
          "acteurRef": "PA608695",
          "presence": "présent"
        }
      ]
    },
    "personnesAuditionnees": null
  },
  "sessionRef": null,
  "ouverturePresse": "false",
  "captationVideo": "false",
  "ODJ": {
    "convocationODJ": {
      "item": "Á 8 heures 30 :Audition, ouverte à la presse, de M. Jacky Richard, vice-président de la section du rapport et des études du Conseil d’État et de M. Laurent Cytermann, maître des requêtes au Conseil d’État.Á 9 heures 30 :Réunion de travail à huis clos"
    },
    "resumeODJ": {
      "item": [
        "à 8 heures 30 : audition de M. Jacky Richard, vice-président de la section du rapport et des études du Conseil d’État et de M. Laurent Cytermann, maître des requêtes au Conseil d’État.",
        "à 9 heures 30 : réunion de travail à huis clos."
      ]
    },
    "pointsODJ": null
  },
  "compteRenduRef": null,
  "formatReunion": "Ordinaire",
  "infosReunionsInternationale": {
    "estReunionInternationale": "false",
    "listePays": null,
    "informationsComplementaires": null
  }
}