{
  "@xmlns": "http://schemas.assemblee-nationale.fr/referentiel",
  "@xmlns:xsi": "http://www.w3.org/2001/XMLSchema-instance",
  "@xsi:type": "reunionInitParlementaire_type",
  "uid": "RUANR5L15S2019IDF0135571",
  "timeStampDebut": "2019-06-19T19:30:00.000+02:00",
  "timeStampFin": "2019-06-19T20:00:00.000+02:00",
  "lieu": {
    "code": "SALREU028",
    "libelleCourt": "Salle Colbert",
    "libelleLong": "Salle Colbert , Palais Bourbon"
  },
  "cycleDeVie": {
    "etat": "Confirmé",
    "chrono": {
      "creation": "2019-06-13T15:12:40.000+02:00",
      "cloture": null
    }
  },
  "demandeurs": {
    "acteur": {
      "nom": "M. Benoit SIMIAN",
      "acteurRef": "PA719592"
    }
  },
  "organeReuniRef": null,
  "typeReunion": "DEP"
}