{
  "@xmlns": "http://schemas.assemblee-nationale.fr/referentiel",
  "@xmlns:xsi": "http://www.w3.org/2001/XMLSchema-instance",
  "@xsi:type": "reunionCommission_type",
  "uid": "RUANR5L15S2020IDC433813",
  "timeStampDebut": "2019-10-10T14:30:00.000+02:00",
  "timeStampFin": "2019-10-10T16:45:00.000+02:00",
  "lieu": {
    "libelleLong": "salle de la commission des Finances"
  },
  "cycleDeVie": {
    "etat": "Confirmé",
    "chrono": {
      "creation": "2019-09-27T00:00:00.000+02:00",
      "cloture": null
    }
  },
  "organeReuniRef": "PO59048",
  "demandeur": null,
  "participants": {
    "participantsInternes": {
      "participantInterne": [
        {
          "acteurRef": "PA605036",
          "presence": "présent"
        },
        {
          "acteurRef": "PA718954",
          "presence": "présent"
        },
        {
          "acteurRef": "PA606675",
          "presence": "absent"
        },
        {
          "acteurRef": "PA609726",
          "presence": "absent"
        },
        {
          "acteurRef": "PA721836",
          "presence": "absent"
        },
        {
          "acteurRef": "PA721410",
          "presence": "présent"
        },
        {
          "acteurRef": "PA642695",
          "presence": "présent"
        },
        {
          "acteurRef": "PA605069",
          "presence": "absent"
        },
        {
          "acteurRef": "PA718838",
          "presence": "présent"
        },
        {
          "acteurRef": "PA720298",
          "presence": "présent"
        },
        {
          "acteurRef": "PA746",
          "presence": "absent"
        },
        {
          "acteurRef": "PA719138",
          "presence": "présent"
        },
        {
          "acteurRef": "PA720520",
          "presence": "absent"
        },
        {
          "acteurRef": "PA719922",
          "presence": "présent"
        },
        {
          "acteurRef": "PA719472",
          "presence": "présent"
        },
        {
          "acteurRef": "PA719250",
          "presence": "absent"
        },
        {
          "acteurRef": "PA760658",
          "presence": "absent"
        },
        {
          "acteurRef": "PA721202",
          "presence": "présent"
        },
        {
          "acteurRef": "PA923",
          "presence": "absent"
        },
        {
          "acteurRef": "PA942",
          "presence": "absent"
        },
        {
          "acteurRef": "PA332523",
          "presence": "présent"
        },
        {
          "acteurRef": "PA720268",
          "presence": "absent"
        },
        {
          "acteurRef": "PA719710",
          "presence": "absent"
        },
        {
          "acteurRef": "PA722382",
          "presence": "absent"
        },
        {
          "acteurRef": "PA718720",
          "presence": "présent"
        },
        {
          "acteurRef": "PA643175",
          "presence": "présent"
        },
        {
          "acteurRef": "PA720652",
          "presence": "présent"
        },
        {
          "acteurRef": "PA720002",
          "presence": "absent"
        },
        {
          "acteurRef": "PA607193",
          "presence": "absent"
        },
        {
          "acteurRef": "PA1327",
          "presence": "absent"
        },
        {
          "acteurRef": "PA720030",
          "presence": "présent"
        },
        {
          "acteurRef": "PA719480",
          "presence": "absent"
        },
        {
          "acteurRef": "PA267336",
          "presence": "présent"
        },
        {
          "acteurRef": "PA720560",
          "presence": "présent"
        },
        {
          "acteurRef": "PA720790",
          "presence": "absent"
        },
        {
          "acteurRef": "PA721764",
          "presence": "présent"
        },
        {
          "acteurRef": "PA1592",
          "presence": "excusé"
        },
        {
          "acteurRef": "PA722054",
          "presence": "présent"
        },
        {
          "acteurRef": "PA608416",
          "presence": "absent"
        },
        {
          "acteurRef": "PA721150",
          "presence": "excusé"
        },
        {
          "acteurRef": "PA719060",
          "presence": "présent"
        },
        {
          "acteurRef": "PA719778",
          "presence": "absent"
        },
        {
          "acteurRef": "PA719798",
          "presence": "absent"
        },
        {
          "acteurRef": "PA718978",
          "presence": "absent"
        },
        {
          "acteurRef": "PA1838",
          "presence": "absent"
        },
        {
          "acteurRef": "PA720022",
          "presence": "absent"
        },
        {
          "acteurRef": "PA712014",
          "presence": "absent"
        },
        {
          "acteurRef": "PA1874",
          "presence": "excusé"
        },
        {
          "acteurRef": "PA721632",
          "presence": "absent"
        },
        {
          "acteurRef": "PA720614",
          "presence": "absent"
        },
        {
          "acteurRef": "PA719006",
          "presence": "absent"
        },
        {
          "acteurRef": "PA608016",
          "presence": "présent"
        },
        {
          "acteurRef": "PA722244",
          "presence": "présent"
        },
        {
          "acteurRef": "PA720230",
          "presence": "présent"
        },
        {
          "acteurRef": "PA720728",
          "presence": "présent"
        },
        {
          "acteurRef": "PA721726",
          "presence": "présent"
        },
        {
          "acteurRef": "PA719242",
          "presence": "présent"
        },
        {
          "acteurRef": "PA719850",
          "presence": "absent"
        },
        {
          "acteurRef": "PA720492",
          "presence": "présent"
        },
        {
          "acteurRef": "PA720402",
          "presence": "présent"
        },
        {
          "acteurRef": "PA721636",
          "presence": "absent"
        },
        {
          "acteurRef": "PA607595",
          "presence": "absent"
        },
        {
          "acteurRef": "PA720500",
          "presence": "absent"
        },
        {
          "acteurRef": "PA718736",
          "presence": "présent"
        },
        {
          "acteurRef": "PA608172",
          "presence": "présent"
        },
        {
          "acteurRef": "PA720590",
          "presence": "absent"
        },
        {
          "acteurRef": "PA405480",
          "presence": "absent"
        },
        {
          "acteurRef": "PA609590",
          "presence": "présent"
        },
        {
          "acteurRef": "PA721458",
          "presence": "présent"
        },
        {
          "acteurRef": "PA720692",
          "presence": "présent"
        },
        {
          "acteurRef": "PA721226",
          "presence": "absent"
        },
        {
          "acteurRef": "PA720878",
          "presence": "présent"
        },
        {
          "acteurRef": "PA722078",
          "presence": "absent"
        },
        {
          "acteurRef": "PA720960",
          "presence": "excusé"
        },
        {
          "acteurRef": "PA719592",
          "presence": "absent"
        },
        {
          "acteurRef": "PA721542",
          "presence": "présent"
        },
        {
          "acteurRef": "PA2960",
          "presence": "présent"
        },
        {
          "acteurRef": "PA718962",
          "presence": "présent"
        }
      ]
    },
    "personnesAuditionnees": null
  },
  "sessionRef": null,
  "ouverturePresse": "true",
  "captationVideo": "true",
  "ODJ": {
    "convocationODJ": {
      "item": "–  Suite de l'examen de la première partie du projet de loi de finances pour 2020 (n°2272) (M. Joël GIRAUD, rapporteur général)"
    },
    "resumeODJ": {
      "item": "suite de l'examen de la première partie du projet de loi de finances pour 2020 (n°2272) (M. Joël Giraud, rapporteur général)."
    },
    "pointsODJ": {
      "pointODJ": {
        "@xsi:type": "podjReunion_type",
        "uid": "RUANR5L15S2020IDC433813PT26843",
        "cycleDeVie": {
          "etat": "Eventuel",
          "chrono": {
            "creation": "2019-09-27T00:00:00.000+02:00",
            "cloture": null
          }
        },
        "objet": "Examen du texte",
        "demandeurPoint": null,
        "procedure": null,
        "dossiersLegislatifsRefs": {
          "dossierRef": "DLR5L15N37615"
        },
        "typePointODJ": "Examen",
        "comiteSecret": "false",
        "textesAssocies": null
      }
    }
  },
  "compteRenduRef": "CRCANR5L15S2020PO59048N011",
  "formatReunion": "Ordinaire",
  "infosReunionsInternationale": {
    "estReunionInternationale": "false",
    "listePays": null,
    "informationsComplementaires": null
  }
}