{
  "@xmlns": "http://schemas.assemblee-nationale.fr/referentiel",
  "@xmlns:xsi": "http://www.w3.org/2001/XMLSchema-instance",
  "@xsi:type": "reunionInitParlementaire_type",
  "uid": "RUANR5L15S2018IDF0113041",
  "timeStampDebut": "2018-06-27T13:30:00.000+02:00",
  "timeStampFin": "2018-06-27T15:00:00.000+02:00",
  "lieu": {
    "code": "SALREU046",
    "libelleCourt": "Sully 1",
    "libelleLong": "Sully 1, Palais Bourbon"
  },
  "cycleDeVie": {
    "etat": "Confirmé",
    "chrono": {
      "creation": "2018-06-05T19:36:56.000+02:00",
      "cloture": null
    }
  },
  "demandeurs": {
    "acteur": {
      "nom": "M. Ugo BERNALICIS",
      "acteurRef": "PA720430"
    }
  },
  "organeReuniRef": null,
  "typeReunion": "DEP"
}