{
  "@xmlns": "http://schemas.assemblee-nationale.fr/referentiel",
  "@xmlns:xsi": "http://www.w3.org/2001/XMLSchema-instance",
  "@xsi:type": "reunionCommission_type",
  "uid": "RUANR5L15S2019IDC430654",
  "timeStampDebut": "2018-10-23T14:00:00.000+02:00",
  "lieu": {
    "libelleLong": "salle 6549 (2e étage)"
  },
  "cycleDeVie": {
    "etat": "Confirmé",
    "chrono": {
      "creation": "2018-10-19T00:00:00.000+02:00",
      "cloture": null
    }
  },
  "organeReuniRef": "PO754002",
  "demandeur": null,
  "participants": {
    "participantsInternes": null,
    "personnesAuditionnees": null
  },
  "sessionRef": null,
  "ouverturePresse": "true",
  "captationVideo": "false",
  "ODJ": {
    "convocationODJ": {
      "item": "Audition de M. Jean-Michel Rapinat, directeur délégué chargé des politiques sociales de l’Association des départements de France, et de Mme Ann-Gaëlle Werner-Bernard, conseillère chargée des relations avec le Parlement."
    },
    "resumeODJ": {
      "item": "audition de M. Jean-Michel Rapinat, directeur délégué chargé des politiques sociales de l’Association des départements de France, et de Mme Ann-Gaëlle Werner-Bernard, conseillère chargée des relations avec le Parlement."
    },
    "pointsODJ": null
  },
  "compteRenduRef": null,
  "formatReunion": "Ordinaire",
  "infosReunionsInternationale": {
    "estReunionInternationale": "false",
    "listePays": null,
    "informationsComplementaires": null
  }
}