{
  "@xmlns": "http://schemas.assemblee-nationale.fr/referentiel",
  "@xmlns:xsi": "http://www.w3.org/2001/XMLSchema-instance",
  "@xsi:type": "reunionInitParlementaire_type",
  "uid": "RUANR5L15S2018IDF0106606",
  "timeStampDebut": "2018-03-07T13:00:00.000+01:00",
  "timeStampFin": "2018-03-07T14:00:00.000+01:00",
  "lieu": {
    "code": "SALREU048",
    "libelleCourt": "Salle 6809",
    "libelleLong": "Salle 6809, Palais Bourbon"
  },
  "cycleDeVie": {
    "etat": "Confirmé",
    "chrono": {
      "creation": "2018-02-26T13:05:08.000+01:00",
      "cloture": null
    }
  },
  "demandeurs": {
    "acteur": {
      "nom": "Mme Sophie BEAUDOUIN-HUBIERE",
      "acteurRef": "PA722170"
    }
  },
  "organeReuniRef": null,
  "typeReunion": "DEP"
}