{
  "@xmlns": "http://schemas.assemblee-nationale.fr/referentiel",
  "@xmlns:xsi": "http://www.w3.org/2001/XMLSchema-instance",
  "@xsi:type": "reunionInitParlementaire_type",
  "uid": "RUANR5L15S2019IDF0131391",
  "timeStampDebut": "2019-04-03T14:00:00.000+02:00",
  "timeStampFin": "2019-04-03T15:00:00.000+02:00",
  "lieu": {
    "code": "SALREU023",
    "libelleCourt": "Salle 7426",
    "libelleLong": "Salle 7426, 101, rue de l'Université"
  },
  "cycleDeVie": {
    "etat": "Confirmé",
    "chrono": {
      "creation": "2019-04-02T11:57:49.000+02:00",
      "cloture": null
    }
  },
  "demandeurs": {
    "acteur": {
      "nom": "M. Jean-François ELIAOU",
      "acteurRef": "PA719692"
    }
  },
  "organeReuniRef": null,
  "typeReunion": "DEP"
}