{
  "@xmlns": "http://schemas.assemblee-nationale.fr/referentiel",
  "@xmlns:xsi": "http://www.w3.org/2001/XMLSchema-instance",
  "@xsi:type": "reunionInitParlementaire_type",
  "uid": "RUANR5L15S2018IDF0102761",
  "timeStampDebut": "2017-12-20T18:30:00.000+01:00",
  "timeStampFin": "2017-12-20T20:30:00.000+01:00",
  "lieu": {
    "code": "SALREU012",
    "libelleCourt": "Salle N° 23",
    "libelleLong": "Salle N° 23, 3, rue Aristide Briand"
  },
  "cycleDeVie": {
    "etat": "Confirmé",
    "chrono": {
      "creation": "2017-12-20T13:27:58.000+01:00",
      "cloture": null
    }
  },
  "demandeurs": {
    "acteur": {
      "nom": "Mme Valérie RABAULT",
      "acteurRef": "PA609590"
    }
  },
  "organeReuniRef": null,
  "typeReunion": "DEP"
}