{
  "@xmlns": "http://schemas.assemblee-nationale.fr/referentiel",
  "@xmlns:xsi": "http://www.w3.org/2001/XMLSchema-instance",
  "@xsi:type": "reunionInitParlementaire_type",
  "uid": "RUANR5L15S2019IDF0122951",
  "timeStampDebut": "2018-12-05T13:00:00.000+01:00",
  "timeStampFin": "2018-12-05T15:00:00.000+01:00",
  "lieu": {
    "code": "SALREU019",
    "libelleCourt": "Salon Mars I",
    "libelleLong": "Salon Mars I, 101, rue de l'Université"
  },
  "cycleDeVie": {
    "etat": "Confirmé",
    "chrono": {
      "creation": "2018-11-23T21:54:08.000+01:00",
      "cloture": null
    }
  },
  "demandeurs": {
    "organe": {
      "nom": "Groupe d'amitié France-Erythrée",
      "organeRef": "PO733377"
    }
  },
  "organeReuniRef": "PO733377",
  "typeReunion": "GA"
}