{
  "@xmlns": "http://schemas.assemblee-nationale.fr/referentiel",
  "@xmlns:xsi": "http://www.w3.org/2001/XMLSchema-instance",
  "@xsi:type": "reunionCommission_type",
  "uid": "RUANR5L15S2020IDC434116",
  "timeStampDebut": "2020-01-22T09:30:00.000+01:00",
  "lieu": {
    "libelleLong": "salle 6242 (Affaires culturelles)"
  },
  "cycleDeVie": {
    "etat": "Eventuel",
    "chrono": {
      "creation": "2019-10-29T00:00:00.000+01:00",
      "cloture": null
    }
  },
  "organeReuniRef": "PO675659",
  "demandeur": null,
  "participants": {
    "participantsInternes": null,
    "personnesAuditionnees": null
  },
  "sessionRef": null,
  "ouverturePresse": "true",
  "captationVideo": "true",
  "ODJ": {
    "convocationODJ": {
      "item": "Réunion commune avec la commission des affaires culturelles et de l’éducation :- présentation du rapport sur l’évaluation de la loi du 25 juin 2015 portant transformation de l’université des Antilles (M. Max Mathiasin, rapporteur pour la Délégation aux outre-mer)."
    },
    "resumeODJ": {
      "item": [
        "réunion commune avec la commission des affaires culturelles et de l’éducation :",
        "présentation du rapport sur l’évaluation de la loi du 25 juin 2015 portant transformation de l’université des Antilles (M. Max Mathiasin, rapporteur pour la délégation aux outre-mer)."
      ]
    },
    "pointsODJ": {
      "pointODJ": {
        "@xsi:type": "podjReunion_type",
        "uid": "RUANR5L15S2020IDC434116PT26929",
        "cycleDeVie": {
          "etat": "Eventuel",
          "chrono": {
            "creation": "2019-10-29T00:00:00.000+01:00",
            "cloture": null
          }
        },
        "objet": "Examen du texte",
        "demandeurPoint": null,
        "procedure": null,
        "dossiersLegislatifsRefs": {
          "dossierRef": "DLR5L15N37530"
        },
        "typePointODJ": "Examen",
        "comiteSecret": "false",
        "textesAssocies": null
      }
    }
  },
  "compteRenduRef": null,
  "formatReunion": "Ordinaire",
  "infosReunionsInternationale": {
    "estReunionInternationale": "false",
    "listePays": null,
    "informationsComplementaires": null
  }
}