{
  "@xmlns": "http://schemas.assemblee-nationale.fr/referentiel",
  "@xmlns:xsi": "http://www.w3.org/2001/XMLSchema-instance",
  "@xsi:type": "reunionInitParlementaire_type",
  "uid": "RUANR5L15S2018IDF0113961",
  "timeStampDebut": "2018-06-26T13:30:00.000+02:00",
  "timeStampFin": "2018-06-26T15:30:00.000+02:00",
  "lieu": {
    "code": "SALREU018",
    "libelleCourt": "Salon Mansart",
    "libelleLong": "Salon Mansart, 101, rue de l'Université"
  },
  "cycleDeVie": {
    "etat": "Confirmé",
    "chrono": {
      "creation": "2018-06-19T13:42:48.000+02:00",
      "cloture": null
    }
  },
  "demandeurs": {
    "acteur": {
      "nom": "M. Sébastien NADOT",
      "acteurRef": "PA719464"
    }
  },
  "organeReuniRef": null,
  "typeReunion": "DEP"
}