{
  "@xmlns": "http://schemas.assemblee-nationale.fr/referentiel",
  "@xmlns:xsi": "http://www.w3.org/2001/XMLSchema-instance",
  "@xsi:type": "reunionInitParlementaire_type",
  "uid": "RUANR5L15S2019IDF0123920",
  "timeStampDebut": "2019-02-05T09:30:00.000+01:00",
  "timeStampFin": "2019-02-05T11:30:00.000+01:00",
  "lieu": {
    "code": "SALREU018",
    "libelleCourt": "Salon Mansart",
    "libelleLong": "Salon Mansart, 101, rue de l'Université"
  },
  "cycleDeVie": {
    "etat": "Confirmé",
    "chrono": {
      "creation": "2018-12-14T09:39:28.000+01:00",
      "cloture": null
    }
  },
  "demandeurs": {
    "acteur": [
      {
        "nom": "Mme Anissa KHEDHER",
        "acteurRef": "PA722300"
      },
      {
        "nom": "Mme Laurence TRASTOUR-ISNART",
        "acteurRef": "PA718780"
      }
    ]
  },
  "organeReuniRef": null,
  "typeReunion": "DEP"
}