{
  "@xmlns": "http://schemas.assemblee-nationale.fr/referentiel",
  "@xmlns:xsi": "http://www.w3.org/2001/XMLSchema-instance",
  "@xsi:type": "reunionInitParlementaire_type",
  "uid": "RUANR5L15S2020IDF0143088",
  "timeStampDebut": "2019-11-13T16:30:00.000+01:00",
  "timeStampFin": "2019-11-13T17:30:00.000+01:00",
  "lieu": {
    "code": "SALREU046",
    "libelleCourt": "Sully 1",
    "libelleLong": "Sully 1, Palais Bourbon"
  },
  "cycleDeVie": {
    "etat": "Confirmé",
    "chrono": {
      "creation": "2019-11-04T11:19:13.000+01:00",
      "cloture": null
    }
  },
  "demandeurs": {
    "acteur": {
      "nom": "Mme Laurence MAILLART-MÉHAIGNERIE",
      "acteurRef": "PA719718"
    }
  },
  "organeReuniRef": null,
  "typeReunion": "DEP"
}