{
  "@xmlns": "http://schemas.assemblee-nationale.fr/referentiel",
  "@xmlns:xsi": "http://www.w3.org/2001/XMLSchema-instance",
  "@xsi:type": "reunionInitParlementaire_type",
  "uid": "RUANR5L15S2018IDF0112495",
  "timeStampDebut": "2018-06-18T16:00:00.000+02:00",
  "timeStampFin": "2018-06-18T17:30:00.000+02:00",
  "lieu": {
    "code": "SALREU022",
    "libelleCourt": "Salle 7326",
    "libelleLong": "Salle 7326, 101, rue de l'Université"
  },
  "cycleDeVie": {
    "etat": "Confirmé",
    "chrono": {
      "creation": "2018-05-29T11:17:05.000+02:00",
      "cloture": null
    }
  },
  "demandeurs": {
    "acteur": {
      "nom": "Mme Maina SAGE",
      "acteurRef": "PA702052"
    }
  },
  "organeReuniRef": null,
  "typeReunion": "DEP"
}