{
  "@xmlns": "http://schemas.assemblee-nationale.fr/referentiel",
  "@xmlns:xsi": "http://www.w3.org/2001/XMLSchema-instance",
  "@xsi:type": "reunionInitParlementaire_type",
  "uid": "RUANR5L15S2017IDF0095133",
  "timeStampDebut": "2017-09-13T14:00:00.000+02:00",
  "timeStampFin": "2017-09-13T18:00:00.000+02:00",
  "lieu": {
    "code": "SALREU019",
    "libelleCourt": "Salon Mars I",
    "libelleLong": "Salon Mars I, 101, rue de l'Université"
  },
  "cycleDeVie": {
    "etat": "Confirmé",
    "chrono": {
      "creation": "2017-08-03T15:06:03.000+02:00",
      "cloture": null
    }
  },
  "demandeurs": {
    "acteur": {
      "nom": "M. Stéphane VIRY",
      "acteurRef": "PA721474"
    }
  },
  "organeReuniRef": null,
  "typeReunion": "DEP"
}