{
  "@xmlns": "http://schemas.assemblee-nationale.fr/referentiel",
  "@xmlns:xsi": "http://www.w3.org/2001/XMLSchema-instance",
  "@xsi:type": "reunionInitParlementaire_type",
  "uid": "RUANR5L15S2018IDF0102274",
  "timeStampDebut": "2018-01-15T08:00:00.000+01:00",
  "timeStampFin": "2018-01-15T21:00:00.000+01:00",
  "lieu": {
    "code": "SALREU005",
    "libelleCourt": "2ème Bureau",
    "libelleLong": "2ème Bureau, Palais Bourbon"
  },
  "cycleDeVie": {
    "etat": "Annulé",
    "chrono": {
      "creation": "2017-12-13T12:22:57.000+01:00",
      "cloture": "2017-12-21T11:03:26.000+01:00"
    }
  },
  "demandeurs": {
    "acteur": {
      "nom": "M. Richard FERRAND",
      "acteurRef": "PA606171"
    }
  },
  "organeReuniRef": null,
  "typeReunion": "DEP"
}