{
  "@xmlns": "http://schemas.assemblee-nationale.fr/referentiel",
  "@xmlns:xsi": "http://www.w3.org/2001/XMLSchema-instance",
  "@xsi:type": "reunionInitParlementaire_type",
  "uid": "RUANR5L15S2019IDF0132621",
  "timeStampDebut": "2019-05-29T16:30:00.000+02:00",
  "timeStampFin": "2019-05-29T19:00:00.000+02:00",
  "lieu": {
    "code": "SALREU016",
    "libelleCourt": "Salon Gabriel",
    "libelleLong": "Salon Gabriel, 101, rue de l'Université"
  },
  "cycleDeVie": {
    "etat": "Confirmé",
    "chrono": {
      "creation": "2019-04-24T10:18:50.000+02:00",
      "cloture": null
    }
  },
  "demandeurs": {
    "acteur": {
      "nom": "M. François CORMIER-BOULIGEON",
      "acteurRef": "PA719118"
    }
  },
  "organeReuniRef": null,
  "typeReunion": "DEP"
}