{
  "@xmlns": "http://schemas.assemblee-nationale.fr/referentiel",
  "@xmlns:xsi": "http://www.w3.org/2001/XMLSchema-instance",
  "@xsi:type": "reunionInitParlementaire_type",
  "uid": "RUANR5L15S2019IDF0129324",
  "timeStampDebut": "2019-03-12T13:45:00.000+01:00",
  "timeStampFin": "2019-03-12T14:45:00.000+01:00",
  "lieu": {
    "code": "SALREU033",
    "libelleCourt": "6ème Bureau",
    "libelleLong": "6ème Bureau, Palais Bourbon"
  },
  "cycleDeVie": {
    "etat": "Confirmé",
    "chrono": {
      "creation": "2019-03-07T15:21:17.000+01:00",
      "cloture": null
    }
  },
  "demandeurs": {
    "acteur": {
      "nom": "M. Pierre CORDIER",
      "acteurRef": "PA718850"
    }
  },
  "organeReuniRef": null,
  "typeReunion": "DEP"
}