{
  "@xmlns": "http://schemas.assemblee-nationale.fr/referentiel",
  "@xmlns:xsi": "http://www.w3.org/2001/XMLSchema-instance",
  "@xsi:type": "reunionInitParlementaire_type",
  "uid": "RUANR5L15S2020IDF0138308",
  "timeStampDebut": "2019-10-02T11:00:00.000+02:00",
  "timeStampFin": "2019-10-02T12:30:00.000+02:00",
  "lieu": {
    "code": "SALREU006",
    "libelleCourt": "3ème Bureau",
    "libelleLong": "3ème Bureau, Palais Bourbon"
  },
  "cycleDeVie": {
    "etat": "Confirmé",
    "chrono": {
      "creation": "2019-08-02T10:23:49.000+02:00",
      "cloture": null
    }
  },
  "demandeurs": {
    "acteur": {
      "nom": "M. Jean-Noël BARROT",
      "acteurRef": "PA721836"
    }
  },
  "organeReuniRef": null,
  "typeReunion": "DEP"
}