{
  "@xmlns": "http://schemas.assemblee-nationale.fr/referentiel",
  "@xmlns:xsi": "http://www.w3.org/2001/XMLSchema-instance",
  "@xsi:type": "reunionInitParlementaire_type",
  "uid": "RUANR5L15S2018IDF0111919",
  "timeStampDebut": "2018-05-22T10:30:00.000+02:00",
  "timeStampFin": "2018-05-22T12:00:00.000+02:00",
  "lieu": {
    "code": "SALREU033",
    "libelleCourt": "6ème Bureau",
    "libelleLong": "6ème Bureau, Palais Bourbon"
  },
  "cycleDeVie": {
    "etat": "Confirmé",
    "chrono": {
      "creation": "2018-05-22T09:54:46.000+02:00",
      "cloture": null
    }
  },
  "demandeurs": {
    "acteur": {
      "nom": "M. Louis ALIOT",
      "acteurRef": "PA720798"
    }
  },
  "organeReuniRef": null,
  "typeReunion": "DEP"
}