{
  "@xmlns": "http://schemas.assemblee-nationale.fr/referentiel",
  "@xmlns:xsi": "http://www.w3.org/2001/XMLSchema-instance",
  "@xsi:type": "reunionInitParlementaire_type",
  "uid": "RUANR5L15S2018IDF0100544",
  "timeStampDebut": "2018-05-09T16:00:00.000+02:00",
  "timeStampFin": "2018-05-09T17:00:00.000+02:00",
  "lieu": {
    "code": "SALREU028",
    "libelleCourt": "Salle Colbert",
    "libelleLong": "Salle Colbert , Palais Bourbon"
  },
  "cycleDeVie": {
    "etat": "Confirmé",
    "chrono": {
      "creation": "2017-11-15T17:39:11.000+02:00",
      "cloture": null
    }
  },
  "demandeurs": null,
  "organeReuniRef": null,
  "typeReunion": "GP"
}