{
  "@xmlns": "http://schemas.assemblee-nationale.fr/referentiel",
  "@xmlns:xsi": "http://www.w3.org/2001/XMLSchema-instance",
  "@xsi:type": "reunionInitParlementaire_type",
  "uid": "RUANR5L15S2018IDF0117086",
  "timeStampDebut": "2018-09-19T14:00:00.000+02:00",
  "timeStampFin": "2018-09-19T16:00:00.000+02:00",
  "lieu": {
    "code": "SALREU046",
    "libelleCourt": "Sully 1",
    "libelleLong": "Sully 1, Palais Bourbon"
  },
  "cycleDeVie": {
    "etat": "Confirmé",
    "chrono": {
      "creation": "2018-09-04T08:59:16.000+02:00",
      "cloture": null
    }
  },
  "demandeurs": {
    "acteur": {
      "nom": "M. Michel LARIVE",
      "acteurRef": "PA718868"
    }
  },
  "organeReuniRef": null,
  "typeReunion": "DEP"
}