{
  "@xmlns": "http://schemas.assemblee-nationale.fr/referentiel",
  "@xmlns:xsi": "http://www.w3.org/2001/XMLSchema-instance",
  "@xsi:type": "reunionCommission_type",
  "uid": "RUANR5L15S2019IDC433094",
  "timeStampDebut": "2019-06-18T16:15:00.000+02:00",
  "timeStampFin": "2019-06-18T18:30:00.000+02:00",
  "lieu": {
    "libelleLong": "salle 6566 (Lois)"
  },
  "cycleDeVie": {
    "etat": "Confirmé",
    "chrono": {
      "creation": "2019-06-13T00:00:00.000+02:00",
      "cloture": null
    }
  },
  "organeReuniRef": "PO762383",
  "demandeur": null,
  "participants": {
    "participantsInternes": {
      "participantInterne": [
        {
          "acteurRef": "PA718744",
          "presence": "excusé"
        },
        {
          "acteurRef": "PA720210",
          "presence": "absent"
        },
        {
          "acteurRef": "PA508",
          "presence": "absent"
        },
        {
          "acteurRef": "PA719286",
          "presence": "absent"
        },
        {
          "acteurRef": "PA720286",
          "presence": "absent"
        },
        {
          "acteurRef": "PA267780",
          "presence": "absent"
        },
        {
          "acteurRef": "PA722366",
          "presence": "absent"
        },
        {
          "acteurRef": "PA721246",
          "presence": "absent"
        },
        {
          "acteurRef": "PA721992",
          "presence": "absent"
        },
        {
          "acteurRef": "PA720054",
          "presence": "absent"
        },
        {
          "acteurRef": "PA722374",
          "presence": "absent"
        },
        {
          "acteurRef": "PA720038",
          "presence": "excusé"
        },
        {
          "acteurRef": "PA718910",
          "presence": "présent"
        },
        {
          "acteurRef": "PA721600",
          "presence": "présent"
        },
        {
          "acteurRef": "PA719972",
          "presence": "absent"
        },
        {
          "acteurRef": "PA719540",
          "presence": "absent"
        },
        {
          "acteurRef": "PA643134",
          "presence": "absent"
        },
        {
          "acteurRef": "PA721968",
          "presence": "présent"
        },
        {
          "acteurRef": "PA722268",
          "presence": "excusé"
        },
        {
          "acteurRef": "PA722110",
          "presence": "absent"
        }
      ]
    },
    "personnesAuditionnees": null
  },
  "sessionRef": null,
  "ouverturePresse": "false",
  "captationVideo": "false",
  "ODJ": {
    "convocationODJ": {
      "item": "– à 16 heures 15 : Audition de M. Robert Barouki, chef de service de biochimie à l’hôpital Necker enfants malades, directeur d’une unité Inserm de toxicologie, et de Mme Karine Audouze, bio-informaticienne, enseignante-chercheuse à l’Université de Paris et dans une unité Inserm, coordinatrice du projet européen Oberon, co-coordinatrice du cluster européen Eurion.– à 17 heures 30 : Audition du docteur Gregory Lemkine, directeur du Laboratoire Watchfrog."
    },
    "resumeODJ": {
      "item": [
        "à 16 h 15 : audition de M. Robert Barouki, chef de service de biochimie à l’hôpital Necker enfants malades, directeur d’une unité Inserm de toxicologie, et de Mme Karine Audouze, bio-informaticienne, enseignante-chercheuse à l’Université de Paris et dans une unité Inserm, coordinatrice du projet européen Oberon, co-coordinatrice du cluster européen Eurion ;",
        "à 17 h 30 : audition du docteur Gregory Lemkine, directeur du Laboratoire Watchfrog."
      ]
    },
    "pointsODJ": null
  },
  "compteRenduRef": null,
  "formatReunion": "Ordinaire",
  "infosReunionsInternationale": {
    "estReunionInternationale": "false",
    "listePays": null,
    "informationsComplementaires": null
  }
}