{
  "@xmlns": "http://schemas.assemblee-nationale.fr/referentiel",
  "@xmlns:xsi": "http://www.w3.org/2001/XMLSchema-instance",
  "@xsi:type": "reunionCommission_type",
  "uid": "RUANR5L15S2019IDC433521",
  "timeStampDebut": "2019-08-27T17:20:00.000+02:00",
  "timeStampFin": "2019-08-27T18:20:00.000+02:00",
  "lieu": {
    "libelleLong": "salle Lamartine"
  },
  "cycleDeVie": {
    "etat": "Confirmé",
    "chrono": {
      "creation": "2019-08-23T00:00:00.000+02:00",
      "cloture": null
    }
  },
  "organeReuniRef": "PO766718",
  "demandeur": null,
  "participants": {
    "participantsInternes": {
      "participantInterne": [
        {
          "acteurRef": "PA642764",
          "presence": "absent"
        },
        {
          "acteurRef": "PA721776",
          "presence": "absent"
        },
        {
          "acteurRef": "PA342415",
          "presence": "absent"
        },
        {
          "acteurRef": "PA642847",
          "presence": "présent"
        },
        {
          "acteurRef": "PA720210",
          "presence": "excusé"
        },
        {
          "acteurRef": "PA642935",
          "presence": "absent"
        },
        {
          "acteurRef": "PA722046",
          "presence": "absent"
        },
        {
          "acteurRef": "PA719488",
          "presence": "présent"
        },
        {
          "acteurRef": "PA330684",
          "presence": "absent"
        },
        {
          "acteurRef": "PA713448",
          "presence": "absent"
        },
        {
          "acteurRef": "PA330008",
          "presence": "présent"
        },
        {
          "acteurRef": "PA342601",
          "presence": "absent"
        },
        {
          "acteurRef": "PA720116",
          "presence": "absent"
        },
        {
          "acteurRef": "PA719496",
          "presence": "présent"
        },
        {
          "acteurRef": "PA722126",
          "presence": "absent"
        },
        {
          "acteurRef": "PA760658",
          "presence": "présent"
        },
        {
          "acteurRef": "PA722390",
          "presence": "absent"
        },
        {
          "acteurRef": "PA719624",
          "presence": "absent"
        },
        {
          "acteurRef": "PA718694",
          "presence": "présent"
        },
        {
          "acteurRef": "PA718926",
          "presence": "absent"
        },
        {
          "acteurRef": "PA719684",
          "presence": "absent"
        },
        {
          "acteurRef": "PA720154",
          "presence": "présent"
        },
        {
          "acteurRef": "PA720684",
          "presence": "absent"
        },
        {
          "acteurRef": "PA719692",
          "presence": "présent"
        },
        {
          "acteurRef": "PA720924",
          "presence": "absent"
        },
        {
          "acteurRef": "PA721896",
          "presence": "absent"
        },
        {
          "acteurRef": "PA267780",
          "presence": "absent"
        },
        {
          "acteurRef": "PA718706",
          "presence": "présent"
        },
        {
          "acteurRef": "PA721142",
          "presence": "absent"
        },
        {
          "acteurRef": "PA722284",
          "presence": "présent"
        },
        {
          "acteurRef": "PA605991",
          "presence": "présent"
        },
        {
          "acteurRef": "PA719108",
          "presence": "présent"
        },
        {
          "acteurRef": "PA266797",
          "presence": "excusé"
        },
        {
          "acteurRef": "PA721296",
          "presence": "absent"
        },
        {
          "acteurRef": "PA720326",
          "presence": "absent"
        },
        {
          "acteurRef": "PA608416",
          "presence": "absent"
        },
        {
          "acteurRef": "PA722374",
          "presence": "absent"
        },
        {
          "acteurRef": "PA720074",
          "presence": "absent"
        },
        {
          "acteurRef": "PA720846",
          "presence": "présent"
        },
        {
          "acteurRef": "PA643205",
          "presence": "absent"
        },
        {
          "acteurRef": "PA721852",
          "presence": "absent"
        },
        {
          "acteurRef": "PA719858",
          "presence": "présent"
        },
        {
          "acteurRef": "PA720446",
          "presence": "présent"
        },
        {
          "acteurRef": "PA721946",
          "presence": "présent"
        },
        {
          "acteurRef": "PA719154",
          "presence": "présent"
        },
        {
          "acteurRef": "PA721726",
          "presence": "présent"
        },
        {
          "acteurRef": "PA719608",
          "presence": "absent"
        },
        {
          "acteurRef": "PA719072",
          "presence": "absent"
        },
        {
          "acteurRef": "PA720630",
          "presence": "présent"
        },
        {
          "acteurRef": "PA721960",
          "presence": "présent"
        },
        {
          "acteurRef": "PA720278",
          "presence": "absent"
        },
        {
          "acteurRef": "PA335532",
          "presence": "absent"
        },
        {
          "acteurRef": "PA722090",
          "presence": "présent"
        },
        {
          "acteurRef": "PA336175",
          "presence": "absent"
        },
        {
          "acteurRef": "PA718910",
          "presence": "présent"
        },
        {
          "acteurRef": "PA2449",
          "presence": "présent"
        },
        {
          "acteurRef": "PA722194",
          "presence": "absent"
        },
        {
          "acteurRef": "PA721286",
          "presence": "absent"
        },
        {
          "acteurRef": "PA721888",
          "presence": "présent"
        },
        {
          "acteurRef": "PA722252",
          "presence": "absent"
        },
        {
          "acteurRef": "PA722022",
          "presence": "présent"
        },
        {
          "acteurRef": "PA721600",
          "presence": "absent"
        },
        {
          "acteurRef": "PA340343",
          "presence": "absent"
        },
        {
          "acteurRef": "PA719350",
          "presence": "présent"
        },
        {
          "acteurRef": "PA334768",
          "presence": "présent"
        },
        {
          "acteurRef": "PA718728",
          "presence": "absent"
        },
        {
          "acteurRef": "PA720586",
          "presence": "absent"
        },
        {
          "acteurRef": "PA721924",
          "presence": "présent"
        },
        {
          "acteurRef": "PA642788",
          "presence": "absent"
        },
        {
          "acteurRef": "PA331582",
          "presence": "présent"
        },
        {
          "acteurRef": "PA721262",
          "presence": "absent"
        },
        {
          "acteurRef": "PA722268",
          "presence": "absent"
        }
      ]
    },
    "personnesAuditionnees": null
  },
  "sessionRef": null,
  "ouverturePresse": "true",
  "captationVideo": "true",
  "ODJ": {
    "convocationODJ": {
      "item": "– Audition de Mme Catherine Dupré Goudable, directrice de l’Espace de réflexion éthique Occitanie, et du Pr Jacques Lagarrigue, vice-président du Conseil d’orientation, et de représentants de l’Espace régional de réflexion éthique région PACA Corse"
    },
    "resumeODJ": {
      "item": "projet de loi bioéthique (n° 2187) (audition de Mme Catherine Dupré Goudable, directrice de l’Espace de réflexion éthique Occitanie, du Pr Jacques Lagarrigue, vice-président du Conseil d’orientation, et de représentants de l’Espace régional de réflexion éthique région PACA Corse)."
    },
    "pointsODJ": {
      "pointODJ": {
        "@xsi:type": "podjReunion_type",
        "uid": "RUANR5L15S2019IDC433521PT26781",
        "cycleDeVie": {
          "etat": "Confirmé",
          "chrono": {
            "creation": "2019-08-23T00:00:00.000+02:00",
            "cloture": null
          }
        },
        "objet": "Audition,ouverte à la presse, de Mme Catherine Dupré Goudable, directrice de l’Espace de réflexion éthique Occitanie, et du Pr Jacques Lagarrigue, vice-président du Conseil d’orientation",
        "demandeurPoint": null,
        "procedure": null,
        "dossiersLegislatifsRefs": {
          "dossierRef": "DLR5L15N37672"
        },
        "typePointODJ": "Audition ouverte à la presse",
        "comiteSecret": "false",
        "textesAssocies": null
      }
    }
  },
  "compteRenduRef": "CRCANR5L15S2019PO766718N005",
  "formatReunion": "Ordinaire",
  "infosReunionsInternationale": {
    "estReunionInternationale": "false",
    "listePays": null,
    "informationsComplementaires": null
  }
}