{
  "@xmlns": "http://schemas.assemblee-nationale.fr/referentiel",
  "@xmlns:xsi": "http://www.w3.org/2001/XMLSchema-instance",
  "@xsi:type": "reunionInitParlementaire_type",
  "uid": "RUANR5L15S2018IDF0105844",
  "timeStampDebut": "2018-02-15T14:00:00.000+01:00",
  "timeStampFin": "2018-02-15T15:00:00.000+01:00",
  "lieu": {
    "code": "SALREU007",
    "libelleCourt": "4ème Bureau",
    "libelleLong": "4ème Bureau, Palais Bourbon"
  },
  "cycleDeVie": {
    "etat": "Confirmé",
    "chrono": {
      "creation": "2018-02-14T18:34:43.000+01:00",
      "cloture": null
    }
  },
  "demandeurs": {
    "organe": {
      "nom": "GROUPE NOUVELLE GAUCHE",
      "organeRef": "PO730946"
    }
  },
  "organeReuniRef": "PO730946",
  "typeReunion": "GP"
}