{
  "@xmlns": "http://schemas.assemblee-nationale.fr/referentiel",
  "@xmlns:xsi": "http://www.w3.org/2001/XMLSchema-instance",
  "@xsi:type": "reunionInitParlementaire_type",
  "uid": "RUANR5L15S2020IDF0143452",
  "timeStampDebut": "2019-12-05T11:00:00.000+01:00",
  "timeStampFin": "2019-12-05T12:00:00.000+01:00",
  "lieu": {
    "code": "SALREU022",
    "libelleCourt": "Salle 7326",
    "libelleLong": "Salle 7326, 101, rue de l'Université"
  },
  "cycleDeVie": {
    "etat": "Confirmé",
    "chrono": {
      "creation": "2019-11-08T11:41:36.000+01:00",
      "cloture": null
    }
  },
  "demandeurs": {
    "acteur": {
      "nom": "Mme Caroline JANVIER",
      "acteurRef": "PA720074"
    }
  },
  "organeReuniRef": null,
  "typeReunion": "DEP"
}