{
  "@xmlns": "http://schemas.assemblee-nationale.fr/referentiel",
  "@xmlns:xsi": "http://www.w3.org/2001/XMLSchema-instance",
  "@xsi:type": "reunionInitParlementaire_type",
  "uid": "RUANR5L15S2019IDF0124641",
  "timeStampDebut": "2019-01-17T10:00:00.000+01:00",
  "timeStampFin": "2019-01-17T11:30:00.000+01:00",
  "lieu": {
    "code": "SALREU010",
    "libelleCourt": "Salle N° 1",
    "libelleLong": "Salle N° 1, 3, rue Aristide Briand"
  },
  "cycleDeVie": {
    "etat": "Confirmé",
    "chrono": {
      "creation": "2019-01-10T09:51:34.000+01:00",
      "cloture": null
    }
  },
  "demandeurs": {
    "acteur": {
      "nom": "M. François-Michel LAMBERT",
      "acteurRef": "PA605518"
    }
  },
  "organeReuniRef": null,
  "typeReunion": "DEP"
}