{
  "@xmlns": "http://schemas.assemblee-nationale.fr/referentiel",
  "@xmlns:xsi": "http://www.w3.org/2001/XMLSchema-instance",
  "@xsi:type": "reunionInitParlementaire_type",
  "uid": "RUANR5L15S2018IDF0106156",
  "timeStampDebut": "2018-03-13T20:00:00.000+01:00",
  "timeStampFin": "2018-03-13T21:30:00.000+01:00",
  "lieu": {
    "code": "SALREU029",
    "libelleCourt": "Salon Mars III",
    "libelleLong": "Salon Mars III, 101, rue de l'Université"
  },
  "cycleDeVie": {
    "etat": "Confirmé",
    "chrono": {
      "creation": "2018-02-19T16:05:30.000+01:00",
      "cloture": null
    }
  },
  "demandeurs": {
    "acteur": {
      "nom": "Mme Pascale FONTENEL-PERSONNE",
      "acteurRef": "PA721384"
    }
  },
  "organeReuniRef": null,
  "typeReunion": "DEP"
}