{
  "@xmlns": "http://schemas.assemblee-nationale.fr/referentiel",
  "@xmlns:xsi": "http://www.w3.org/2001/XMLSchema-instance",
  "@xsi:type": "reunionInitParlementaire_type",
  "uid": "RUANR5L15S2019IDF0131587",
  "timeStampDebut": "2019-04-30T13:00:00.000+02:00",
  "timeStampFin": "2019-04-30T15:00:00.000+02:00",
  "lieu": {
    "code": "SALREU022",
    "libelleCourt": "Salle 7326",
    "libelleLong": "Salle 7326, 101, rue de l'Université"
  },
  "cycleDeVie": {
    "etat": "Confirmé",
    "chrono": {
      "creation": "2019-04-04T09:56:59.000+02:00",
      "cloture": null
    }
  },
  "demandeurs": {
    "acteur": {
      "nom": "M. Anthony CELLIER",
      "acteurRef": "PA719440"
    }
  },
  "organeReuniRef": null,
  "typeReunion": "DEP"
}