{
  "@xmlns": "http://schemas.assemblee-nationale.fr/referentiel",
  "@xmlns:xsi": "http://www.w3.org/2001/XMLSchema-instance",
  "@xsi:type": "reunionInitParlementaire_type",
  "uid": "RUANR5L15S2020IDF0142126",
  "timeStampDebut": "2019-11-27T12:00:00.000+01:00",
  "timeStampFin": "2019-11-27T14:00:00.000+01:00",
  "lieu": {
    "code": "SALREU004",
    "libelleCourt": "1er Bureau",
    "libelleLong": "1er Bureau, Palais Bourbon"
  },
  "cycleDeVie": {
    "etat": "Confirmé",
    "chrono": {
      "creation": "2019-10-15T15:58:26.000+01:00",
      "cloture": null
    }
  },
  "demandeurs": {
    "acteur": {
      "nom": "M. Vincent LEDOUX",
      "acteurRef": "PA712014"
    }
  },
  "organeReuniRef": null,
  "typeReunion": "DEP"
}