{
  "@xmlns": "http://schemas.assemblee-nationale.fr/referentiel",
  "@xmlns:xsi": "http://www.w3.org/2001/XMLSchema-instance",
  "@xsi:type": "reunionCommission_type",
  "uid": "RUANR5L15S2019IDC433147",
  "timeStampDebut": "2019-06-27T10:00:00.000+02:00",
  "timeStampFin": "2019-06-27T12:00:00.000+02:00",
  "lieu": {
    "libelleLong": "Sénat - salle de la commission des affaires étrangères"
  },
  "cycleDeVie": {
    "etat": "Confirmé",
    "chrono": {
      "creation": "2019-06-14T00:00:00.000+02:00",
      "cloture": null
    }
  },
  "organeReuniRef": "PO206064",
  "demandeur": null,
  "participants": {
    "participantsInternes": null,
    "personnesAuditionnees": null
  },
  "sessionRef": null,
  "ouverturePresse": "false",
  "captationVideo": "false",
  "ODJ": {
    "convocationODJ": {
      "item": "Réunion, au Sénat, des groupes français et britannique de l'UIP à l'occasion de la célébration des 130 ans de l'UIP."
    },
    "resumeODJ": {
      "item": "Réunion, au Sénat, des groupes français et britannique de l'UIP à l'occasion de la célébration des 130 ans de l'UIP."
    },
    "pointsODJ": null
  },
  "compteRenduRef": null,
  "formatReunion": "Ordinaire",
  "infosReunionsInternationale": {
    "estReunionInternationale": "true",
    "listePays": {
      "paysRef": "GOP760995"
    },
    "informationsComplementaires": "Didier Eifermann - 34378"
  }
}