{
  "@xmlns": "http://schemas.assemblee-nationale.fr/referentiel",
  "@xmlns:xsi": "http://www.w3.org/2001/XMLSchema-instance",
  "@xsi:type": "reunionInitParlementaire_type",
  "uid": "RUANR5L15S2019IDF0140034",
  "timeStampDebut": "2019-09-16T10:00:00.000+02:00",
  "timeStampFin": "2019-09-16T13:00:00.000+02:00",
  "lieu": {
    "code": "SALREU026",
    "libelleCourt": "9ème Bureau",
    "libelleLong": "9ème Bureau, Palais Bourbon"
  },
  "cycleDeVie": {
    "etat": "Confirmé",
    "chrono": {
      "creation": "2019-09-16T09:51:56.000+02:00",
      "cloture": null
    }
  },
  "demandeurs": {
    "organe": {
      "nom": "GROUPE SOCIALISTES ET APPARENTÉS",
      "organeRef": "PO758835"
    }
  },
  "organeReuniRef": "PO758835",
  "typeReunion": "GP"
}