{
  "@xmlns": "http://schemas.assemblee-nationale.fr/referentiel",
  "@xmlns:xsi": "http://www.w3.org/2001/XMLSchema-instance",
  "@xsi:type": "reunionCommission_type",
  "uid": "RUANR5L15S2018IDC428473",
  "timeStampDebut": "2018-02-20T16:15:00.000+01:00",
  "lieu": {
    "libelleLong": "salle 4204 (33, rue  Saint-Dominique)"
  },
  "cycleDeVie": {
    "etat": "Confirmé",
    "chrono": {
      "creation": "2018-02-02T00:00:00.000+01:00",
      "cloture": null
    }
  },
  "organeReuniRef": "PO744181",
  "demandeur": null,
  "participants": {
    "participantsInternes": null,
    "personnesAuditionnees": null
  },
  "sessionRef": null,
  "ouverturePresse": "false",
  "captationVideo": "false",
  "ODJ": {
    "convocationODJ": {
      "item": "– Audition de M. Jean de Croone, directeur adjoint de l’Immigration, à la Direction des étrangers en France au ministère de l’Intérieur."
    },
    "resumeODJ": {
      "item": "audition de M. Jean de Croone, directeur adjoint de l’Immigration, à la Direction des étrangers en France au ministère de l’Intérieur."
    },
    "pointsODJ": null
  },
  "compteRenduRef": null,
  "formatReunion": "Ordinaire",
  "infosReunionsInternationale": {
    "estReunionInternationale": "false",
    "listePays": null,
    "informationsComplementaires": null
  }
}