{
  "@xmlns": "http://schemas.assemblee-nationale.fr/referentiel",
  "@xmlns:xsi": "http://www.w3.org/2001/XMLSchema-instance",
  "@xsi:type": "seance_type",
  "uid": "RUANR5L15S2018IDS21052",
  "timeStampDebut": "2018-05-24T15:00:00.000+02:00",
  "timeStampFin": "2018-05-24T20:00:00.000+02:00",
  "lieu": {
    "code": "AN",
    "libelleLong": "Assemblée nationale"
  },
  "cycleDeVie": {
    "etat": "Confirmé",
    "chrono": {
      "creation": "2018-04-13T00:00:00.000+02:00",
      "cloture": null
    }
  },
  "organeReuniRef": "PO717460",
  "demandeur": null,
  "participants": null,
  "sessionRef": "SCR5A2018O1",
  "ouverturePresse": "true",
  "captationVideo": "true",
  "ODJ": {
    "convocationODJ": null,
    "resumeODJ": null,
    "pointsODJ": {
      "pointODJ": [
        {
          "@xsi:type": "podjSeanceConfPres_type",
          "uid": "RUANR5L15S2018IDS21052PT35879",
          "cycleDeVie": {
            "etat": "Supprimé",
            "chrono": {
              "creation": "2018-04-13T00:00:00.000+02:00",
              "cloture": "2018-05-15T00:00:00.000+02:00"
            }
          },
          "objet": "Suite de la lecture définitive du projet de loi, modifié par le Sénat, relatif à l'élection des représentants au Parlement européen",
          "demandeurPoint": null,
          "procedure": null,
          "dossiersLegislatifsRefs": null,
          "typePointODJ": "Suite de la discussion",
          "comiteSecret": "false",
          "textesAssocies": null,
          "natureTravauxODJ": "ODJPR"
        },
        {
          "@xsi:type": "podjSeanceConfPres_type",
          "uid": "RUANR5L15S2018IDS21052PT35880",
          "cycleDeVie": {
            "etat": "Confirmé",
            "chrono": {
              "creation": "2018-04-13T00:00:00.000+02:00",
              "cloture": null
            }
          },
          "objet": "Suite de la discussion du projet de loi pour l’équilibre des relations commerciales dans le secteur agricole et alimentaire et une alimentation saine et durable",
          "demandeurPoint": null,
          "procedure": null,
          "dossiersLegislatifsRefs": {
            "dossierRef": "DLR5L15N36336"
          },
          "typePointODJ": "Suite de la discussion",
          "comiteSecret": "false",
          "textesAssocies": null,
          "natureTravauxODJ": "ODJPR"
        }
      ]
    }
  },
  "compteRenduRef": "CRSANR5L15S2018O1N222",
  "identifiants": {
    "numSeanceJO": "222",
    "idJO": "20180222",
    "quantieme": "Deuxième",
    "DateSeance": "2018-05-24+02:00"
  }
}