{
  "@xmlns": "http://schemas.assemblee-nationale.fr/referentiel",
  "@xmlns:xsi": "http://www.w3.org/2001/XMLSchema-instance",
  "@xsi:type": "reunionInitParlementaire_type",
  "uid": "RUANR5L15S2018IDF0096191",
  "timeStampDebut": "2017-10-31T09:00:00.000+01:00",
  "timeStampFin": "2017-10-31T13:00:00.000+01:00",
  "lieu": {
    "code": "SALREU016",
    "libelleCourt": "Salon Gabriel",
    "libelleLong": "Salon Gabriel, 101, rue de l'Université"
  },
  "cycleDeVie": {
    "etat": "Confirmé",
    "chrono": {
      "creation": "2017-09-13T14:38:25.000+01:00",
      "cloture": null
    }
  },
  "demandeurs": {
    "acteur": [
      {
        "nom": "Mme Marianne DUBOIS",
        "acteurRef": "PA342935"
      },
      {
        "nom": "Mme Émilie GUEREL",
        "acteurRef": "PA721792"
      }
    ]
  },
  "organeReuniRef": null,
  "typeReunion": "DEP"
}