{
  "@xmlns": "http://schemas.assemblee-nationale.fr/referentiel",
  "@xmlns:xsi": "http://www.w3.org/2001/XMLSchema-instance",
  "@xsi:type": "reunionCommission_type",
  "uid": "RUANR5L15S2018IDC429583",
  "timeStampDebut": "2018-06-05T09:30:00.000+02:00",
  "lieu": {
    "libelleLong": "Salle de la commission"
  },
  "cycleDeVie": {
    "etat": "Supprimé",
    "chrono": {
      "creation": "2018-05-24T00:00:00.000+02:00",
      "cloture": "2018-06-04T00:00:00.000+02:00"
    }
  },
  "organeReuniRef": "PO201269",
  "demandeur": null,
  "participants": {
    "participantsInternes": null,
    "personnesAuditionnees": null
  },
  "sessionRef": null,
  "ouverturePresse": "false",
  "captationVideo": "false",
  "ODJ": {
    "convocationODJ": {
      "item": "Auditions sur le projet de loi constitutionnelle pour une démocratie plus représentative, responsable et efficace (n° 911)."
    },
    "resumeODJ": {
      "item": "auditions sur le projet de loi constitutionnelle pour une démocratie plus représentative, responsable et efficace (n° 911)."
    },
    "pointsODJ": {
      "pointODJ": {
        "@xsi:type": "podjReunion_type",
        "uid": "RUANR5L15S2018IDC429583PT25727",
        "cycleDeVie": {
          "etat": "Supprimé",
          "chrono": {
            "creation": "2018-05-24T00:00:00.000+02:00",
            "cloture": "2018-06-04T00:00:00.000+02:00"
          }
        },
        "objet": "Examen du texte",
        "demandeurPoint": null,
        "procedure": null,
        "dossiersLegislatifsRefs": null,
        "typePointODJ": "Examen",
        "comiteSecret": "false",
        "textesAssocies": null
      }
    }
  },
  "compteRenduRef": null,
  "formatReunion": "Ordinaire",
  "infosReunionsInternationale": {
    "estReunionInternationale": "false",
    "listePays": null,
    "informationsComplementaires": null
  }
}