{
  "@xmlns": "http://schemas.assemblee-nationale.fr/referentiel",
  "@xmlns:xsi": "http://www.w3.org/2001/XMLSchema-instance",
  "@xsi:type": "reunionInitParlementaire_type",
  "uid": "RUANR5L15S2018IDF0113629",
  "timeStampDebut": "2018-07-05T09:00:00.000+02:00",
  "timeStampFin": "2018-07-05T11:00:00.000+02:00",
  "lieu": {
    "code": "SALREU013",
    "libelleCourt": "Salle N° 3",
    "libelleLong": "Salle N° 3, 3, rue Aristide Briand"
  },
  "cycleDeVie": {
    "etat": "Annulé",
    "chrono": {
      "creation": "2018-06-14T09:13:43.000+02:00",
      "cloture": "2018-07-04T10:30:02.000+02:00"
    }
  },
  "demandeurs": {
    "acteur": {
      "nom": "M. Jean-Louis MASSON",
      "acteurRef": "PA346218"
    }
  },
  "organeReuniRef": null,
  "typeReunion": "DEP"
}