{
  "@xmlns": "http://schemas.assemblee-nationale.fr/referentiel",
  "@xmlns:xsi": "http://www.w3.org/2001/XMLSchema-instance",
  "@xsi:type": "reunionCommission_type",
  "uid": "RUANR5L15S2018IDC428900",
  "timeStampDebut": "2018-03-21T09:00:00.000+01:00",
  "timeStampFin": "2018-03-21T10:55:00.000+01:00",
  "lieu": {
    "libelleLong": "salle 6350 (Finances)"
  },
  "cycleDeVie": {
    "etat": "Confirmé",
    "chrono": {
      "creation": "2018-03-16T00:00:00.000+01:00",
      "cloture": null
    }
  },
  "organeReuniRef": "PO744127",
  "demandeur": null,
  "participants": {
    "participantsInternes": {
      "participantInterne": [
        {
          "acteurRef": "PA605036",
          "presence": "absent"
        },
        {
          "acteurRef": "PA718954",
          "presence": "présent"
        },
        {
          "acteurRef": "PA605963",
          "presence": "présent"
        },
        {
          "acteurRef": "PA609726",
          "presence": "présent"
        },
        {
          "acteurRef": "PA721836",
          "presence": "présent"
        },
        {
          "acteurRef": "PA642847",
          "presence": "absent"
        },
        {
          "acteurRef": "PA642847",
          "presence": "présent"
        },
        {
          "acteurRef": "PA718990",
          "presence": "absent"
        },
        {
          "acteurRef": "PA721608",
          "presence": "présent"
        },
        {
          "acteurRef": "PA605069",
          "presence": "présent"
        },
        {
          "acteurRef": "PA721328",
          "presence": "présent"
        },
        {
          "acteurRef": "PA720298",
          "presence": "présent"
        },
        {
          "acteurRef": "PA719472",
          "presence": "présent"
        },
        {
          "acteurRef": "PA721860",
          "presence": "absent"
        },
        {
          "acteurRef": "PA719748",
          "presence": "absent"
        },
        {
          "acteurRef": "PA719250",
          "presence": "présent"
        },
        {
          "acteurRef": "PA642868",
          "presence": "présent"
        },
        {
          "acteurRef": "PA719756",
          "presence": "absent"
        },
        {
          "acteurRef": "PA718850",
          "presence": "présent"
        },
        {
          "acteurRef": "PA923",
          "presence": "présent"
        },
        {
          "acteurRef": "PA942",
          "presence": "présent"
        },
        {
          "acteurRef": "PA332523",
          "presence": "présent"
        },
        {
          "acteurRef": "PA720268",
          "presence": "présent"
        },
        {
          "acteurRef": "PA719710",
          "presence": "présent"
        },
        {
          "acteurRef": "PA718720",
          "presence": "présent"
        },
        {
          "acteurRef": "PA643175",
          "presence": "présent"
        },
        {
          "acteurRef": "PA720002",
          "presence": "présent"
        },
        {
          "acteurRef": "PA607193",
          "presence": "présent"
        },
        {
          "acteurRef": "PA719938",
          "presence": "présent"
        },
        {
          "acteurRef": "PA1327",
          "presence": "présent"
        },
        {
          "acteurRef": "PA719480",
          "presence": "présent"
        },
        {
          "acteurRef": "PA719480",
          "presence": "absent"
        },
        {
          "acteurRef": "PA267336",
          "presence": "présent"
        },
        {
          "acteurRef": "PA720560",
          "presence": "présent"
        },
        {
          "acteurRef": "PA720170",
          "presence": "présent"
        },
        {
          "acteurRef": "PA721498",
          "presence": "présent"
        },
        {
          "acteurRef": "PA722054",
          "presence": "présent"
        },
        {
          "acteurRef": "PA722374",
          "presence": "présent"
        },
        {
          "acteurRef": "PA719060",
          "presence": "présent"
        },
        {
          "acteurRef": "PA719778",
          "presence": "présent"
        },
        {
          "acteurRef": "PA722202",
          "presence": "absent"
        },
        {
          "acteurRef": "PA719994",
          "presence": "absent"
        },
        {
          "acteurRef": "PA719798",
          "presence": "présent"
        },
        {
          "acteurRef": "PA609245",
          "presence": "présent"
        },
        {
          "acteurRef": "PA718978",
          "presence": "présent"
        },
        {
          "acteurRef": "PA1838",
          "presence": "présent"
        },
        {
          "acteurRef": "PA720022",
          "presence": "présent"
        },
        {
          "acteurRef": "PA722228",
          "presence": "présent"
        },
        {
          "acteurRef": "PA1874",
          "presence": "présent"
        },
        {
          "acteurRef": "PA719404",
          "presence": "présent"
        },
        {
          "acteurRef": "PA721466",
          "presence": "présent"
        },
        {
          "acteurRef": "PA719006",
          "presence": "présent"
        },
        {
          "acteurRef": "PA608016",
          "presence": "présent"
        },
        {
          "acteurRef": "PA721530",
          "presence": "absent"
        },
        {
          "acteurRef": "PA722244",
          "presence": "présent"
        },
        {
          "acteurRef": "PA720230",
          "presence": "présent"
        },
        {
          "acteurRef": "PA719154",
          "presence": "absent"
        },
        {
          "acteurRef": "PA720728",
          "presence": "présent"
        },
        {
          "acteurRef": "PA719130",
          "presence": "absent"
        },
        {
          "acteurRef": "PA721670",
          "presence": "présent"
        },
        {
          "acteurRef": "PA720492",
          "presence": "présent"
        },
        {
          "acteurRef": "PA720402",
          "presence": "présent"
        },
        {
          "acteurRef": "PA721636",
          "presence": "présent"
        },
        {
          "acteurRef": "PA607595",
          "presence": "présent"
        },
        {
          "acteurRef": "PA2377",
          "presence": "absent"
        },
        {
          "acteurRef": "PA721568",
          "presence": "présent"
        },
        {
          "acteurRef": "PA336175",
          "presence": "présent"
        },
        {
          "acteurRef": "PA608172",
          "presence": "présent"
        },
        {
          "acteurRef": "PA719600",
          "presence": "absent"
        },
        {
          "acteurRef": "PA720100",
          "presence": "absent"
        },
        {
          "acteurRef": "PA405480",
          "presence": "présent"
        },
        {
          "acteurRef": "PA722398",
          "presence": "absent"
        },
        {
          "acteurRef": "PA721458",
          "presence": "présent"
        },
        {
          "acteurRef": "PA720878",
          "presence": "présent"
        },
        {
          "acteurRef": "PA340343",
          "presence": "absent"
        },
        {
          "acteurRef": "PA722078",
          "presence": "présent"
        },
        {
          "acteurRef": "PA719592",
          "presence": "présent"
        },
        {
          "acteurRef": "PA718860",
          "presence": "présent"
        },
        {
          "acteurRef": "PA709315",
          "presence": "absent"
        },
        {
          "acteurRef": "PA722102",
          "presence": "présent"
        },
        {
          "acteurRef": "PA607090",
          "presence": "présent"
        },
        {
          "acteurRef": "PA331582",
          "presence": "présent"
        },
        {
          "acteurRef": "PA721262",
          "presence": "absent"
        },
        {
          "acteurRef": "PA2960",
          "presence": "présent"
        }
      ]
    },
    "personnesAuditionnees": null
  },
  "sessionRef": null,
  "ouverturePresse": "true",
  "captationVideo": "false",
  "ODJ": {
    "convocationODJ": {
      "item": "Audition, conjointe avec la commission des Finances, de MM. Alain Richard et Dominique Bur, co-présidents de la mission sur les relations financières État-collectivités territoriales et la refonte de la fiscalité locale"
    },
    "resumeODJ": {
      "item": "audition, ouverte à la presse, conjointe avec la commission des Finances, de MM. Alain Richard et Dominique Bur, co-présidents de la mission sur les relations financières État-collectivités territoriales et la refonte de la fiscalité locale"
    },
    "pointsODJ": null
  },
  "compteRenduRef": "CRCANR5L15S2018PO744127N007",
  "formatReunion": "Ordinaire",
  "infosReunionsInternationale": {
    "estReunionInternationale": "false",
    "listePays": null,
    "informationsComplementaires": null
  }
}