{
  "@xmlns": "http://schemas.assemblee-nationale.fr/referentiel",
  "@xmlns:xsi": "http://www.w3.org/2001/XMLSchema-instance",
  "@xsi:type": "reunionInitParlementaire_type",
  "uid": "RUANR5L15S2018IDFL430531",
  "timeStampDebut": "2018-05-16T14:00:00.000+02:00",
  "lieu": {
    "libelleLong": "salle 6549 (2e étage)"
  },
  "cycleDeVie": {
    "etat": "Confirmé",
    "chrono": {
      "creation": "2018-10-04T00:00:00.000+02:00",
      "cloture": null
    }
  },
  "organeReuniRef": "PO746679",
  "typeReunion": "GE",
  "demandeur": null,
  "participants": null,
  "ODJ": {
    "convocationODJ": {
      "item": "Audition de Mgr Gollnisch, directeur général de l'Œuvre d'Orient, et de Mgr Mirkis, archevêque chaldéen de Kirkourk"
    },
    "resumeODJ": null
  }
}