{
  "@xmlns": "http://schemas.assemblee-nationale.fr/referentiel",
  "@xmlns:xsi": "http://www.w3.org/2001/XMLSchema-instance",
  "@xsi:type": "reunionCommission_type",
  "uid": "RUANR5L15S2020IDC433792",
  "timeStampDebut": "2019-10-01T14:05:00.000+02:00",
  "timeStampFin": "2019-10-01T15:00:00.000+02:00",
  "lieu": {
    "libelleLong": "salle 6238 (Développement durable)"
  },
  "cycleDeVie": {
    "etat": "Confirmé",
    "chrono": {
      "creation": "2019-09-26T00:00:00.000+02:00",
      "cloture": null
    }
  },
  "organeReuniRef": "PO201269",
  "demandeur": null,
  "participants": {
    "participantsInternes": {
      "participantInterne": [
        {
          "acteurRef": "PA719318",
          "presence": "présent"
        },
        {
          "acteurRef": "PA719806",
          "presence": "excusé"
        },
        {
          "acteurRef": "PA719558",
          "presence": "absent"
        },
        {
          "acteurRef": "PA342415",
          "presence": "absent"
        },
        {
          "acteurRef": "PA720210",
          "presence": "absent"
        },
        {
          "acteurRef": "PA441",
          "presence": "absent"
        },
        {
          "acteurRef": "PA330684",
          "presence": "présent"
        },
        {
          "acteurRef": "PA719496",
          "presence": "absent"
        },
        {
          "acteurRef": "PA721750",
          "presence": "absent"
        },
        {
          "acteurRef": "PA429893",
          "presence": "absent"
        },
        {
          "acteurRef": "PA719448",
          "presence": "absent"
        },
        {
          "acteurRef": "PA722126",
          "presence": "absent"
        },
        {
          "acteurRef": "PA719624",
          "presence": "présent"
        },
        {
          "acteurRef": "PA608826",
          "presence": "absent"
        },
        {
          "acteurRef": "PA721094",
          "presence": "absent"
        },
        {
          "acteurRef": "PA721742",
          "presence": "absent"
        },
        {
          "acteurRef": "PA720806",
          "presence": "absent"
        },
        {
          "acteurRef": "PA605991",
          "presence": "absent"
        },
        {
          "acteurRef": "PA721296",
          "presence": "absent"
        },
        {
          "acteurRef": "PA722054",
          "presence": "absent"
        },
        {
          "acteurRef": "PA720202",
          "presence": "absent"
        },
        {
          "acteurRef": "PA719842",
          "presence": "présent"
        },
        {
          "acteurRef": "PA720916",
          "presence": "présent"
        },
        {
          "acteurRef": "PA719728",
          "presence": "absent"
        },
        {
          "acteurRef": "PA720342",
          "presence": "présent"
        },
        {
          "acteurRef": "PA719072",
          "presence": "présent"
        },
        {
          "acteurRef": "PA721656",
          "presence": "excusé"
        },
        {
          "acteurRef": "PA719520",
          "presence": "absent"
        },
        {
          "acteurRef": "PA719632",
          "presence": "présent"
        },
        {
          "acteurRef": "PA720720",
          "presence": "absent"
        },
        {
          "acteurRef": "PA720100",
          "presence": "présent"
        },
        {
          "acteurRef": "PA720552",
          "presence": "excusé"
        },
        {
          "acteurRef": "PA722252",
          "presence": "présent"
        },
        {
          "acteurRef": "PA722022",
          "presence": "absent"
        },
        {
          "acteurRef": "PA719350",
          "presence": "présent"
        },
        {
          "acteurRef": "PA718860",
          "presence": "absent"
        },
        {
          "acteurRef": "PA718780",
          "presence": "présent"
        },
        {
          "acteurRef": "PA721474",
          "presence": "présent"
        }
      ]
    },
    "personnesAuditionnees": null
  },
  "sessionRef": null,
  "ouverturePresse": "true",
  "captationVideo": "true",
  "ODJ": {
    "convocationODJ": {
      "item": "Examen, ouvert à la presse, du rapport sur la proposition de loi relative aux violences au sein des couples et aux incidences de ces dernières sur les enfants (n° 2200) et la proposition de loi visant à agir contre les violences faites aux femmes (n° 2201) (Mme Fiona Lazaar, rapporteure)."
    },
    "resumeODJ": {
      "item": "examen, ouvert à la presse, du rapport sur la proposition de loi relative aux violences au sein des couples et aux incidences de ces dernières sur les enfants (n° 2200) et la proposition de loi visant à agir contre les violences faites aux femmes (n° 2201) (Mme Fiona Lazaar, rapporteure)."
    },
    "pointsODJ": {
      "pointODJ": [
        {
          "@xsi:type": "podjReunion_type",
          "uid": "RUANR5L15S2020IDC433792PT26828",
          "cycleDeVie": {
            "etat": "Confirmé",
            "chrono": {
              "creation": "2019-09-26T00:00:00.000+02:00",
              "cloture": null
            }
          },
          "objet": "Examen du texte",
          "demandeurPoint": null,
          "procedure": null,
          "dossiersLegislatifsRefs": {
            "dossierRef": "DLR5L15N37695"
          },
          "typePointODJ": "Examen",
          "comiteSecret": "false",
          "textesAssocies": null
        },
        {
          "@xsi:type": "podjReunion_type",
          "uid": "RUANR5L15S2020IDC433792PT26829",
          "cycleDeVie": {
            "etat": "Confirmé",
            "chrono": {
              "creation": "2019-09-26T00:00:00.000+02:00",
              "cloture": null
            }
          },
          "objet": "Examen du texte",
          "demandeurPoint": null,
          "procedure": null,
          "dossiersLegislatifsRefs": {
            "dossierRef": "DLR5L15N37702"
          },
          "typePointODJ": "Examen",
          "comiteSecret": "false",
          "textesAssocies": null
        }
      ]
    }
  },
  "compteRenduRef": null,
  "formatReunion": "Ordinaire",
  "infosReunionsInternationale": {
    "estReunionInternationale": "false",
    "listePays": null,
    "informationsComplementaires": null
  }
}