{
  "@xmlns": "http://schemas.assemblee-nationale.fr/referentiel",
  "@xmlns:xsi": "http://www.w3.org/2001/XMLSchema-instance",
  "@xsi:type": "seance_type",
  "uid": "RUANR5L15S2019IDS21715",
  "timeStampDebut": "2019-06-18T15:00:00.000+02:00",
  "timeStampFin": "2019-06-18T20:15:00.000+02:00",
  "lieu": {
    "code": "AN",
    "libelleLong": "Assemblée nationale"
  },
  "cycleDeVie": {
    "etat": "Confirmé",
    "chrono": {
      "creation": "2019-05-27T00:00:00.000+02:00",
      "cloture": null
    }
  },
  "organeReuniRef": "PO717460",
  "demandeur": null,
  "participants": null,
  "sessionRef": "SCR5A2019O1",
  "ouverturePresse": "true",
  "captationVideo": "true",
  "ODJ": {
    "convocationODJ": null,
    "resumeODJ": null,
    "pointsODJ": {
      "pointODJ": [
        {
          "@xsi:type": "podjSeanceConfPres_type",
          "uid": "RUANR5L15S2019IDS21715PT37384",
          "cycleDeVie": {
            "etat": "Confirmé",
            "chrono": {
              "creation": "2019-05-27T00:00:00.000+02:00",
              "cloture": null
            }
          },
          "objet": "Questions au Gouvernement",
          "demandeurPoint": null,
          "procedure": null,
          "dossiersLegislatifsRefs": null,
          "typePointODJ": "Questions au Gouvernement",
          "comiteSecret": "false",
          "textesAssocies": null,
          "natureTravauxODJ": "ODJPR"
        },
        {
          "@xsi:type": "podjSeanceConfPres_type",
          "uid": "RUANR5L15S2019IDS21715PT37419",
          "cycleDeVie": {
            "etat": "Confirmé",
            "chrono": {
              "creation": "2019-06-03T00:00:00.000+02:00",
              "cloture": null
            }
          },
          "objet": "Explications de vote et vote par scrutin public du projet de loi, adopté par le Sénat, après engagement de la procédure accélérée, d'orientation des mobilités",
          "demandeurPoint": null,
          "procedure": null,
          "dossiersLegislatifsRefs": {
            "dossierRef": "DLR5L15N37029"
          },
          "typePointODJ": "Explications de vote et vote par scrutin public",
          "comiteSecret": "false",
          "textesAssocies": null,
          "natureTravauxODJ": "ODJPR"
        },
        {
          "@xsi:type": "podjSeanceConfPres_type",
          "uid": "RUANR5L15S2019IDS21715PT37360",
          "cycleDeVie": {
            "etat": "Confirmé",
            "chrono": {
              "creation": "2019-05-27T00:00:00.000+02:00",
              "cloture": null
            }
          },
          "objet": "Discussion de la proposition de résolution, déposée en application de l’article 34-1 de la Constitution, relative à la couverture numérique du territoire",
          "demandeurPoint": null,
          "procedure": null,
          "dossiersLegislatifsRefs": {
            "dossierRef": "DLR5L15N37528"
          },
          "typePointODJ": "Discussion",
          "comiteSecret": "false",
          "textesAssocies": null,
          "natureTravauxODJ": "ODJPR"
        },
        {
          "@xsi:type": "podjSeanceConfPres_type",
          "uid": "RUANR5L15S2019IDS21715PT37361",
          "cycleDeVie": {
            "etat": "Confirmé",
            "chrono": {
              "creation": "2019-05-27T00:00:00.000+02:00",
              "cloture": null
            }
          },
          "objet": "Discussion de la proposition de résolution, déposée en application de l’article 34-1 de la Constitution, visant à rationaliser les agences publiques et les instances consultatives nationales",
          "demandeurPoint": null,
          "procedure": null,
          "dossiersLegislatifsRefs": {
            "dossierRef": "DLR5L15N37519"
          },
          "typePointODJ": "Discussion",
          "comiteSecret": "false",
          "textesAssocies": null,
          "natureTravauxODJ": "ODJPR"
        }
      ]
    }
  },
  "compteRenduRef": "CRSANR5L15S2019O1N279",
  "identifiants": {
    "numSeanceJO": "279",
    "idJO": "20190279",
    "quantieme": "Deuxième",
    "DateSeance": "2019-06-18+02:00"
  }
}