{
  "@xmlns": "http://schemas.assemblee-nationale.fr/referentiel",
  "@xmlns:xsi": "http://www.w3.org/2001/XMLSchema-instance",
  "@xsi:type": "reunionCommission_type",
  "uid": "RUANR5L15S2020IDC433935",
  "timeStampDebut": "2019-11-05T21:05:00.000+01:00",
  "timeStampFin": "2019-11-05T23:25:00.000+01:00",
  "lieu": {
    "libelleLong": "6e Bureau (Lois)"
  },
  "cycleDeVie": {
    "etat": "Confirmé",
    "chrono": {
      "creation": "2019-10-10T00:00:00.000+02:00",
      "cloture": null
    }
  },
  "organeReuniRef": "PO59051",
  "demandeur": null,
  "participants": {
    "participantsInternes": {
      "participantInterne": [
        {
          "acteurRef": "PA719866",
          "presence": "absent"
        },
        {
          "acteurRef": "PA719146",
          "presence": "présent"
        },
        {
          "acteurRef": "PA721158",
          "presence": "absent"
        },
        {
          "acteurRef": "PA721624",
          "presence": "absent"
        },
        {
          "acteurRef": "PA719558",
          "presence": "présent"
        },
        {
          "acteurRef": "PA342415",
          "presence": "présent"
        },
        {
          "acteurRef": "PA719942",
          "presence": "présent"
        },
        {
          "acteurRef": "PA441",
          "presence": "excusé"
        },
        {
          "acteurRef": "PA720430",
          "presence": "absent"
        },
        {
          "acteurRef": "PA718990",
          "presence": "présent"
        },
        {
          "acteurRef": "PA606507",
          "presence": "absent"
        },
        {
          "acteurRef": "PA721908",
          "presence": "présent"
        },
        {
          "acteurRef": "PA330008",
          "presence": "présent"
        },
        {
          "acteurRef": "PA342601",
          "presence": "présent"
        },
        {
          "acteurRef": "PA720772",
          "presence": "présent"
        },
        {
          "acteurRef": "PA719472",
          "presence": "présent"
        },
        {
          "acteurRef": "PA719748",
          "presence": "absent"
        },
        {
          "acteurRef": "PA267306",
          "presence": "présent"
        },
        {
          "acteurRef": "PA267429",
          "presence": "présent"
        },
        {
          "acteurRef": "PA330240",
          "presence": "excusé"
        },
        {
          "acteurRef": "PA942",
          "presence": "présent"
        },
        {
          "acteurRef": "PA719194",
          "presence": "présent"
        },
        {
          "acteurRef": "PA267440",
          "presence": "absent"
        },
        {
          "acteurRef": "PA719684",
          "presence": "absent"
        },
        {
          "acteurRef": "PA720154",
          "presence": "présent"
        },
        {
          "acteurRef": "PA721094",
          "presence": "excusé"
        },
        {
          "acteurRef": "PA720002",
          "presence": "absent"
        },
        {
          "acteurRef": "PA719692",
          "presence": "présent"
        },
        {
          "acteurRef": "PA719616",
          "presence": "présent"
        },
        {
          "acteurRef": "PA334149",
          "presence": "présent"
        },
        {
          "acteurRef": "PA719960",
          "presence": "présent"
        },
        {
          "acteurRef": "PA721702",
          "presence": "absent"
        },
        {
          "acteurRef": "PA721742",
          "presence": "présent"
        },
        {
          "acteurRef": "PA721142",
          "presence": "excusé"
        },
        {
          "acteurRef": "PA721364",
          "presence": "absent"
        },
        {
          "acteurRef": "PA266797",
          "presence": "présent"
        },
        {
          "acteurRef": "PA721296",
          "presence": "présent"
        },
        {
          "acteurRef": "PA721792",
          "presence": "absent"
        },
        {
          "acteurRef": "PA721880",
          "presence": "absent"
        },
        {
          "acteurRef": "PA720454",
          "presence": "présent"
        },
        {
          "acteurRef": "PA722150",
          "presence": "présent"
        },
        {
          "acteurRef": "PA267200",
          "presence": "absent"
        },
        {
          "acteurRef": "PA719874",
          "presence": "présent"
        },
        {
          "acteurRef": "PA267901",
          "presence": "excusé"
        },
        {
          "acteurRef": "PA719994",
          "presence": "présent"
        },
        {
          "acteurRef": "PA335054",
          "presence": "absent"
        },
        {
          "acteurRef": "PA267785",
          "presence": "absent"
        },
        {
          "acteurRef": "PA721984",
          "presence": "absent"
        },
        {
          "acteurRef": "PA722228",
          "presence": "présent"
        },
        {
          "acteurRef": "PA340853",
          "presence": "présent"
        },
        {
          "acteurRef": "PA719404",
          "presence": "présent"
        },
        {
          "acteurRef": "PA721932",
          "presence": "présent"
        },
        {
          "acteurRef": "PA718918",
          "presence": "absent"
        },
        {
          "acteurRef": "PA606098",
          "presence": "absent"
        },
        {
          "acteurRef": "PA719154",
          "presence": "présent"
        },
        {
          "acteurRef": "PA346218",
          "presence": "présent"
        },
        {
          "acteurRef": "PA721800",
          "presence": "absent"
        },
        {
          "acteurRef": "PA677483",
          "presence": "présent"
        },
        {
          "acteurRef": "PA719608",
          "presence": "présent"
        },
        {
          "acteurRef": "PA720370",
          "presence": "absent"
        },
        {
          "acteurRef": "PA719952",
          "presence": "absent"
        },
        {
          "acteurRef": "PA607619",
          "presence": "absent"
        },
        {
          "acteurRef": "PA266788",
          "presence": "présent"
        },
        {
          "acteurRef": "PA720908",
          "presence": "absent"
        },
        {
          "acteurRef": "PA721960",
          "presence": "présent"
        },
        {
          "acteurRef": "PA720108",
          "presence": "présent"
        },
        {
          "acteurRef": "PA719202",
          "presence": "présent"
        },
        {
          "acteurRef": "PA335532",
          "presence": "absent"
        },
        {
          "acteurRef": "PA721568",
          "presence": "absent"
        },
        {
          "acteurRef": "PA721270",
          "presence": "présent"
        },
        {
          "acteurRef": "PA608172",
          "presence": "présent"
        },
        {
          "acteurRef": "PA2449",
          "presence": "présent"
        },
        {
          "acteurRef": "PA719600",
          "presence": "présent"
        },
        {
          "acteurRef": "PA720100",
          "presence": "absent"
        },
        {
          "acteurRef": "PA405480",
          "presence": "présent"
        },
        {
          "acteurRef": "PA643127",
          "presence": "présent"
        },
        {
          "acteurRef": "PA722398",
          "presence": "présent"
        },
        {
          "acteurRef": "PA721678",
          "presence": "présent"
        },
        {
          "acteurRef": "PA722292",
          "presence": "absent"
        },
        {
          "acteurRef": "PA721616",
          "presence": "absent"
        },
        {
          "acteurRef": "PA267527",
          "presence": "présent"
        },
        {
          "acteurRef": "PA702052",
          "presence": "excusé"
        },
        {
          "acteurRef": "PA340343",
          "presence": "absent"
        },
        {
          "acteurRef": "PA748954",
          "presence": "absent"
        },
        {
          "acteurRef": "PA721314",
          "presence": "présent"
        },
        {
          "acteurRef": "PA718860",
          "presence": "présent"
        },
        {
          "acteurRef": "PA721584",
          "presence": "présent"
        },
        {
          "acteurRef": "PA720568",
          "presence": "présent"
        },
        {
          "acteurRef": "PA719302",
          "presence": "absent"
        },
        {
          "acteurRef": "PA2828",
          "presence": "absent"
        },
        {
          "acteurRef": "PA608695",
          "presence": "présent"
        },
        {
          "acteurRef": "PA709315",
          "presence": "présent"
        },
        {
          "acteurRef": "PA721262",
          "presence": "absent"
        },
        {
          "acteurRef": "PA720318",
          "presence": "absent"
        }
      ]
    },
    "personnesAuditionnees": null
  },
  "sessionRef": null,
  "ouverturePresse": "true",
  "captationVideo": "true",
  "ODJ": {
    "convocationODJ": {
      "item": "Audition de Mme Jacqueline Gourault, ministre de la cohésion des territoires et des relations avec les collectivités territoriales, et de M. Sébastien Lecornu, ministre auprès de la ministre de la cohésion des territoires chargé des collectivités territoriales, et discussion générale sur le projet de loi relatif à l’engagement dans la vie locale et à la proximité de l’action publique (n° 2357) (M. Bruno Questel, rapporteur)."
    },
    "resumeODJ": {
      "item": "audition de Mme Jacqueline Gourault, ministre de la cohésion des territoires et des relations avec les collectivités territoriales, et de M. Sébastien Lecornu, ministre auprès de la ministre de la cohésion des territoires chargé des collectivités territoriales, et discussion générale sur le projet de loi relatif à l’engagement dans la vie locale et à la proximité de l’action publique (n° Sénat 677, sous réserve de sa transmission)."
    },
    "pointsODJ": {
      "pointODJ": {
        "@xsi:type": "podjReunion_type",
        "uid": "RUANR5L15S2020IDC433935PT26933",
        "cycleDeVie": {
          "etat": "Confirmé",
          "chrono": {
            "creation": "2019-10-31T00:00:00.000+01:00",
            "cloture": null
          }
        },
        "objet": "Examen",
        "demandeurPoint": null,
        "procedure": null,
        "dossiersLegislatifsRefs": {
          "dossierRef": "DLR5L15N37659"
        },
        "typePointODJ": "Examen",
        "comiteSecret": "false",
        "textesAssocies": null
      }
    }
  },
  "compteRenduRef": "CRCANR5L15S2020PO59051N016",
  "formatReunion": "Ordinaire",
  "infosReunionsInternationale": {
    "estReunionInternationale": "false",
    "listePays": null,
    "informationsComplementaires": null
  }
}