{
  "@xmlns": "http://schemas.assemblee-nationale.fr/referentiel",
  "@xmlns:xsi": "http://www.w3.org/2001/XMLSchema-instance",
  "@xsi:type": "reunionCommission_type",
  "uid": "RUANR5L15S2018IDC429352",
  "timeStampDebut": "2018-05-16T17:45:00.000+02:00",
  "timeStampFin": "2018-05-16T19:20:00.000+02:00",
  "lieu": {
    "libelleLong": "salle Lamartine"
  },
  "cycleDeVie": {
    "etat": "Confirmé",
    "chrono": {
      "creation": "2018-05-07T00:00:00.000+02:00",
      "cloture": null
    }
  },
  "organeReuniRef": "PO751337",
  "demandeur": null,
  "participants": {
    "participantsInternes": {
      "participantInterne": [
        {
          "acteurRef": "PA606675",
          "presence": "absent"
        },
        {
          "acteurRef": "PA720256",
          "presence": "absent"
        },
        {
          "acteurRef": "PA332228",
          "presence": "absent"
        },
        {
          "acteurRef": "PA718876",
          "presence": "présent"
        },
        {
          "acteurRef": "PA722126",
          "presence": "présent"
        },
        {
          "acteurRef": "PA721210",
          "presence": "absent"
        },
        {
          "acteurRef": "PA720862",
          "presence": "absent"
        },
        {
          "acteurRef": "PA720438",
          "presence": "absent"
        },
        {
          "acteurRef": "PA267780",
          "presence": "présent"
        },
        {
          "acteurRef": "PA719326",
          "presence": "présent"
        },
        {
          "acteurRef": "PA333818",
          "presence": "présent"
        },
        {
          "acteurRef": "PA720074",
          "presence": "présent"
        },
        {
          "acteurRef": "PA722202",
          "presence": "absent"
        },
        {
          "acteurRef": "PA721434",
          "presence": "absent"
        },
        {
          "acteurRef": "PA720022",
          "presence": "présent"
        },
        {
          "acteurRef": "PA722228",
          "presence": "absent"
        },
        {
          "acteurRef": "PA340853",
          "presence": "absent"
        },
        {
          "acteurRef": "PA1874",
          "presence": "présent"
        },
        {
          "acteurRef": "PA719404",
          "presence": "présent"
        },
        {
          "acteurRef": "PA719718",
          "presence": "absent"
        },
        {
          "acteurRef": "PA719338",
          "presence": "absent"
        },
        {
          "acteurRef": "PA719952",
          "presence": "absent"
        },
        {
          "acteurRef": "PA720644",
          "presence": "absent"
        },
        {
          "acteurRef": "PA720100",
          "presence": "absent"
        },
        {
          "acteurRef": "PA643127",
          "presence": "absent"
        },
        {
          "acteurRef": "PA720092",
          "presence": "présent"
        },
        {
          "acteurRef": "PA722078",
          "presence": "absent"
        },
        {
          "acteurRef": "PA718682",
          "presence": "absent"
        },
        {
          "acteurRef": "PA719930",
          "presence": "absent"
        },
        {
          "acteurRef": "PA709315",
          "presence": "présent"
        }
      ]
    },
    "personnesAuditionnees": null
  },
  "sessionRef": null,
  "ouverturePresse": "true",
  "captationVideo": "false",
  "ODJ": {
    "convocationODJ": {
      "item": "Audition, ouverte à la presse, de M. Michel-Edouard Leclerc, président-directeur général E. Leclerc SC Galec, de M. Sébastien Chellet, directeur général du Galec, de M. Alexandre Tuaillon, chargé de mission auprès du président, de M. Stephan Arino, directeur qualité & développement durable, et de M. Aristide Luneau, conseil pour Leclerc."
    },
    "resumeODJ": {
      "item": "audition, ouverte à la presse, de M. Michel-Edouard Leclerc, président-directeur général E. Leclerc SC Galec, de M. Sébastien Chellet, directeur général du Galec, de M. Alexandre Tuaillon, chargé de mission auprès du président, de M. Stephan Arino, directeur qualité & développement durable, et de M. Aristide Luneau, conseil pour Leclerc."
    },
    "pointsODJ": null
  },
  "compteRenduRef": "CRCANR5L15S2018PO751337N015",
  "formatReunion": "Ordinaire",
  "infosReunionsInternationale": {
    "estReunionInternationale": "false",
    "listePays": null,
    "informationsComplementaires": null
  }
}