{
  "@xmlns": "http://schemas.assemblee-nationale.fr/referentiel",
  "@xmlns:xsi": "http://www.w3.org/2001/XMLSchema-instance",
  "@xsi:type": "reunionCommission_type",
  "uid": "RUANR5L15S2019IDC431499",
  "timeStampDebut": "2019-03-20T17:30:00.000+01:00",
  "lieu": {
    "libelleLong": "salon Gabriel (32 rue Saint-Dominique)"
  },
  "cycleDeVie": {
    "etat": "Confirmé",
    "chrono": {
      "creation": "2019-02-07T00:00:00.000+01:00",
      "cloture": null
    }
  },
  "organeReuniRef": "PO760931",
  "demandeur": null,
  "participants": {
    "participantsInternes": null,
    "personnesAuditionnees": null
  },
  "sessionRef": null,
  "ouverturePresse": "false",
  "captationVideo": "false",
  "ODJ": {
    "convocationODJ": {
      "item": "Audition de Mme Anne Guérin, directrice exécutive de Bpifrance, en charge du financement et du réseau, et de M. Guillaume Mortelier, directeur exécutif en charge de l’accompagnement, accompagnés de M. Jean-Baptiste Marin-Lamellet, responsable des relations institutionnelles."
    },
    "resumeODJ": {
      "item": "audition de Mme Anne Guérin, directrice exécutive de Bpifrance, en charge du financement et du réseau, et de M. Guillaume Mortelier, directeur exécutif en charge de l’accompagnement, accompagnés de M. Jean-Baptiste Marin-Lamellet, responsable des relations institutionnelles."
    },
    "pointsODJ": null
  },
  "compteRenduRef": null,
  "formatReunion": "Ordinaire",
  "infosReunionsInternationale": {
    "estReunionInternationale": "false",
    "listePays": null,
    "informationsComplementaires": null
  }
}