{
  "@xmlns": "http://schemas.assemblee-nationale.fr/referentiel",
  "@xmlns:xsi": "http://www.w3.org/2001/XMLSchema-instance",
  "@xsi:type": "reunionCommission_type",
  "uid": "RUANR5L15S2018IDC429058",
  "timeStampDebut": "2018-05-23T18:00:00.000+02:00",
  "timeStampFin": "2018-05-23T19:00:00.000+02:00",
  "lieu": {
    "libelleLong": "salle 6550 (2e étage)"
  },
  "cycleDeVie": {
    "etat": "Confirmé",
    "chrono": {
      "creation": "2018-03-30T00:00:00.000+02:00",
      "cloture": null
    }
  },
  "organeReuniRef": "PO751879",
  "demandeur": null,
  "participants": {
    "participantsInternes": null,
    "personnesAuditionnees": null
  },
  "sessionRef": null,
  "ouverturePresse": "true",
  "captationVideo": "false",
  "ODJ": {
    "convocationODJ": {
      "item": "Audition de M. Bruno Dalles, directeur de Tracfin"
    },
    "resumeODJ": {
      "item": "audition de M. Bruno Dalles, directeur de Tracfin"
    },
    "pointsODJ": null
  },
  "compteRenduRef": null,
  "formatReunion": "Ordinaire",
  "infosReunionsInternationale": {
    "estReunionInternationale": "false",
    "listePays": null,
    "informationsComplementaires": null
  }
}