{
  "@xmlns": "http://schemas.assemblee-nationale.fr/referentiel",
  "@xmlns:xsi": "http://www.w3.org/2001/XMLSchema-instance",
  "@xsi:type": "reunionCommission_type",
  "uid": "RUANR5L15S2018IDC429036",
  "timeStampDebut": "2018-04-05T14:00:00.000+02:00",
  "timeStampFin": "2018-04-05T15:25:00.000+02:00",
  "lieu": {
    "libelleLong": "salle 4123 (33 rue Saint-Dominique)"
  },
  "cycleDeVie": {
    "etat": "Confirmé",
    "chrono": {
      "creation": "2018-03-29T00:00:00.000+02:00",
      "cloture": null
    }
  },
  "organeReuniRef": "PO734678",
  "demandeur": null,
  "participants": {
    "participantsInternes": {
      "participantInterne": [
        {
          "acteurRef": "PA721158",
          "presence": "présent"
        },
        {
          "acteurRef": "PA335999",
          "presence": "présent"
        },
        {
          "acteurRef": "PA689",
          "presence": "présent"
        },
        {
          "acteurRef": "PA336439",
          "presence": "présent"
        },
        {
          "acteurRef": "PA266797",
          "presence": "présent"
        },
        {
          "acteurRef": "PA721226",
          "presence": "présent"
        },
        {
          "acteurRef": "PA717151",
          "presence": "présent"
        },
        {
          "acteurRef": "PA748954",
          "presence": "présent"
        },
        {
          "acteurRef": "PA719350",
          "presence": "présent"
        },
        {
          "acteurRef": "PA2952",
          "presence": "présent"
        }
      ]
    },
    "personnesAuditionnees": null
  },
  "sessionRef": null,
  "ouverturePresse": "false",
  "captationVideo": "false",
  "ODJ": {
    "convocationODJ": {
      "item": "Table ronde réunissant les présidents des commissions permanentes de l’Assemblée nationale"
    },
    "resumeODJ": {
      "item": "table ronde réunissant les présidents des commissions permanentes de l'Assemblée nationale."
    },
    "pointsODJ": null
  },
  "compteRenduRef": "CRCANR5L15S2018PO734678N009",
  "formatReunion": "Ordinaire",
  "infosReunionsInternationale": {
    "estReunionInternationale": "false",
    "listePays": null,
    "informationsComplementaires": null
  }
}