{
  "@xmlns": "http://schemas.assemblee-nationale.fr/referentiel",
  "@xmlns:xsi": "http://www.w3.org/2001/XMLSchema-instance",
  "@xsi:type": "reunionInitParlementaire_type",
  "uid": "RUANR5L15S2019IDF0140578",
  "timeStampDebut": "2019-09-25T10:00:00.000+02:00",
  "timeStampFin": "2019-09-25T11:00:00.000+02:00",
  "lieu": {
    "code": "SALREU002",
    "libelleCourt": "Salle 7070",
    "libelleLong": "Salle 7070, 103, rue de l'Université"
  },
  "cycleDeVie": {
    "etat": "Confirmé",
    "chrono": {
      "creation": "2019-09-20T17:33:30.000+02:00",
      "cloture": null
    }
  },
  "demandeurs": {
    "acteur": {
      "nom": "Mme Marie-Noëlle BATTISTEL",
      "acteurRef": "PA342415"
    }
  },
  "organeReuniRef": null,
  "typeReunion": "DEP"
}