{
  "@xmlns": "http://schemas.assemblee-nationale.fr/referentiel",
  "@xmlns:xsi": "http://www.w3.org/2001/XMLSchema-instance",
  "@xsi:type": "reunionInitParlementaire_type",
  "uid": "RUANR5L15S2020IDF0142728",
  "timeStampDebut": "2019-11-06T14:00:00.000+01:00",
  "timeStampFin": "2019-11-06T17:30:00.000+01:00",
  "lieu": {
    "code": "SALREU038",
    "libelleCourt": "Salle 6549",
    "libelleLong": "Salle 6549, Palais Bourbon"
  },
  "cycleDeVie": {
    "etat": "Confirmé",
    "chrono": {
      "creation": "2019-10-24T18:06:42.000+01:00",
      "cloture": null
    }
  },
  "demandeurs": {
    "acteur": [
      {
        "nom": "Mme Véronique RIOTTON",
        "acteurRef": "PA721426"
      },
      {
        "nom": "Mme Stéphanie KERBARH",
        "acteurRef": "PA721514"
      }
    ]
  },
  "organeReuniRef": null,
  "typeReunion": "DEP"
}