{
  "@xmlns": "http://schemas.assemblee-nationale.fr/referentiel",
  "@xmlns:xsi": "http://www.w3.org/2001/XMLSchema-instance",
  "@xsi:type": "reunionCommission_type",
  "uid": "RUANR5L15S2019IDC433382",
  "timeStampDebut": "2019-07-09T14:00:00.000+02:00",
  "timeStampFin": "2019-07-09T15:30:00.000+02:00",
  "lieu": {
    "libelleLong": "salle 6351 (Affaires sociales)"
  },
  "cycleDeVie": {
    "etat": "Confirmé",
    "chrono": {
      "creation": "2019-07-05T00:00:00.000+02:00",
      "cloture": null
    }
  },
  "organeReuniRef": "PO732866",
  "demandeur": null,
  "participants": {
    "participantsInternes": {
      "participantInterne": [
        {
          "acteurRef": "PA718744",
          "presence": "excusé"
        },
        {
          "acteurRef": "PA719980",
          "presence": "absent"
        },
        {
          "acteurRef": "PA718694",
          "presence": "absent"
        },
        {
          "acteurRef": "PA718926",
          "presence": "absent"
        },
        {
          "acteurRef": "PA720046",
          "presence": "absent"
        },
        {
          "acteurRef": "PA720286",
          "presence": "excusé"
        },
        {
          "acteurRef": "PA267780",
          "presence": "absent"
        },
        {
          "acteurRef": "PA267318",
          "presence": "absent"
        },
        {
          "acteurRef": "PA722374",
          "presence": "présent"
        },
        {
          "acteurRef": "PA606712",
          "presence": "excusé"
        },
        {
          "acteurRef": "PA721070",
          "presence": "absent"
        },
        {
          "acteurRef": "PA719540",
          "presence": "absent"
        },
        {
          "acteurRef": "PA719930",
          "presence": "absent"
        },
        {
          "acteurRef": "PA642788",
          "presence": "absent"
        },
        {
          "acteurRef": "PA722102",
          "presence": "excusé"
        },
        {
          "acteurRef": "PA721474",
          "presence": "absent"
        }
      ]
    },
    "personnesAuditionnees": null
  },
  "sessionRef": null,
  "ouverturePresse": "true",
  "captationVideo": "true",
  "ODJ": {
    "convocationODJ": {
      "item": "Le dossier médical partagé et les données numériques de santé (M. Cyrille Isaac-Sibille, rapporteur)– Audition de M. Jean Lessi, secrétaire général de la Commission nationale de l’informatique et des libertés (CNIL), M. Erik Boucher de Crèvecoeur, ingénieur expert au sein de la direction des technologies et de l’innovation de la CNIL, Mme Alexandra Doré, juriste au service de la santé, et Mme Tiphaine Havel, conseillère pour les questions institutionnelles et parlementaires."
    },
    "resumeODJ": {
      "item": "Le dossier médical partagé et les données numériques de santé (M. Cyrille Isaac-Sibille, rapporteur) : audition de M. Jean Lessi, secrétaire général de la Commission nationale de l’informatique et des libertés (CNIL), M. Erik Boucher de Crèvecoeur, ingénieur expert au sein de la direction des technologies et de l’innovation de la CNIL, Mme Alexandra Doré, juriste au service de la santé, et Mme Tiphaine Havel, conseillère pour les questions institutionnelles et parlementaires."
    },
    "pointsODJ": null
  },
  "compteRenduRef": "CRCANR5L15S2019PO732866N030",
  "formatReunion": "Ordinaire",
  "infosReunionsInternationale": {
    "estReunionInternationale": "false",
    "listePays": null,
    "informationsComplementaires": null
  }
}