{
  "@xmlns": "http://schemas.assemblee-nationale.fr/referentiel",
  "@xmlns:xsi": "http://www.w3.org/2001/XMLSchema-instance",
  "@xsi:type": "reunionInitParlementaire_type",
  "uid": "RUANR5L15S2019IDF0129119",
  "timeStampDebut": "2019-04-03T14:00:00.000+02:00",
  "timeStampFin": "2019-04-03T17:00:00.000+02:00",
  "lieu": {
    "code": "SALREU016",
    "libelleCourt": "Salon Gabriel",
    "libelleLong": "Salon Gabriel, 101, rue de l'Université"
  },
  "cycleDeVie": {
    "etat": "Annulé",
    "chrono": {
      "creation": "2019-03-06T10:10:57.000+02:00",
      "cloture": "2019-04-01T11:20:16.000+02:00"
    }
  },
  "demandeurs": {
    "acteur": {
      "nom": "Mme Gisèle BIÉMOURET",
      "acteurRef": "PA508"
    }
  },
  "organeReuniRef": null,
  "typeReunion": "DEP"
}