{
  "@xmlns": "http://schemas.assemblee-nationale.fr/referentiel",
  "@xmlns:xsi": "http://www.w3.org/2001/XMLSchema-instance",
  "@xsi:type": "reunionInitParlementaire_type",
  "uid": "RUANR5L15S2019IDF0128811",
  "timeStampDebut": "2019-03-27T14:00:00.000+01:00",
  "timeStampFin": "2019-03-27T15:00:00.000+01:00",
  "lieu": {
    "code": "SALREU039",
    "libelleCourt": "Salle 6550",
    "libelleLong": "Salle 6550, Palais Bourbon"
  },
  "cycleDeVie": {
    "etat": "Confirmé",
    "chrono": {
      "creation": "2019-02-28T12:47:33.000+01:00",
      "cloture": null
    }
  },
  "demandeurs": {
    "acteur": {
      "nom": "M. François CORNUT-GENTILLE",
      "acteurRef": "PA923"
    }
  },
  "organeReuniRef": null,
  "typeReunion": "DEP"
}