{
  "@xmlns": "http://schemas.assemblee-nationale.fr/referentiel",
  "@xmlns:xsi": "http://www.w3.org/2001/XMLSchema-instance",
  "@xsi:type": "reunionCommission_type",
  "uid": "RUANR5L15S2019IDC431936",
  "timeStampDebut": "2019-03-18T17:00:00.000+01:00",
  "timeStampFin": "2019-03-18T18:00:00.000+01:00",
  "lieu": {
    "libelleLong": "salle 6549 (2e étage)"
  },
  "cycleDeVie": {
    "etat": "Confirmé",
    "chrono": {
      "creation": "2019-03-14T00:00:00.000+01:00",
      "cloture": null
    }
  },
  "organeReuniRef": "PO760588",
  "demandeur": null,
  "participants": {
    "participantsInternes": null,
    "personnesAuditionnees": null
  },
  "sessionRef": null,
  "ouverturePresse": "false",
  "captationVideo": "false",
  "ODJ": {
    "convocationODJ": {
      "item": "Audition, non ouverte à la presse, de Mme Monique Ronzeau, chargée de mission d’inspection générale, et de Mme Isabelle Roussel, inspectrice générale honoraire, auteures d’un rapport portant sur l’université des Antilles"
    },
    "resumeODJ": {
      "item": "audition, non ouverte à la presse, de Mme Monique Ronzeau, chargée de mission d’inspection générale, et de Mme Isabelle Roussel, inspectrice générale honoraire, auteures d’un rapport portant sur l’université des Antilles."
    },
    "pointsODJ": null
  },
  "compteRenduRef": null,
  "formatReunion": "Ordinaire",
  "infosReunionsInternationale": {
    "estReunionInternationale": "false",
    "listePays": null,
    "informationsComplementaires": null
  }
}