{
  "@xmlns": "http://schemas.assemblee-nationale.fr/referentiel",
  "@xmlns:xsi": "http://www.w3.org/2001/XMLSchema-instance",
  "@xsi:type": "reunionInitParlementaire_type",
  "uid": "RUANR5L15S2019IDF0121110",
  "timeStampDebut": "2018-10-25T11:00:00.000+02:00",
  "timeStampFin": "2018-10-25T13:00:00.000+02:00",
  "lieu": {
    "code": "SALREU012",
    "libelleCourt": "Salle N° 23",
    "libelleLong": "Salle N° 23, 3, rue Aristide Briand"
  },
  "cycleDeVie": {
    "etat": "Annulé",
    "chrono": {
      "creation": "2018-10-19T15:45:49.000+02:00",
      "cloture": "2018-10-23T11:24:27.000+02:00"
    }
  },
  "demandeurs": {
    "acteur": [
      {
        "nom": "M. Grégory GALBADON",
        "acteurRef": "PA720198"
      },
      {
        "nom": "M. Maxime MINOT",
        "acteurRef": "PA720630"
      }
    ]
  },
  "organeReuniRef": null,
  "typeReunion": "DEP"
}