{
  "@xmlns": "http://schemas.assemblee-nationale.fr/referentiel",
  "@xmlns:xsi": "http://www.w3.org/2001/XMLSchema-instance",
  "@xsi:type": "reunionInitParlementaire_type",
  "uid": "RUANR5L15S2019IDF0120356",
  "timeStampDebut": "2018-12-15T09:00:00.000+01:00",
  "timeStampFin": "2018-12-15T17:00:00.000+01:00",
  "lieu": {
    "code": "SALREU008",
    "libelleCourt": "5ème Bureau",
    "libelleLong": "5ème Bureau, Palais Bourbon"
  },
  "cycleDeVie": {
    "etat": "Annulé",
    "chrono": {
      "creation": "2018-10-09T16:12:51.000+01:00",
      "cloture": "2018-12-11T09:37:18.000+01:00"
    }
  },
  "demandeurs": {
    "acteur": {
      "nom": "Mme Delphine BATHO",
      "acteurRef": "PA335999"
    }
  },
  "organeReuniRef": null,
  "typeReunion": "DEP"
}