{
  "@xmlns": "http://schemas.assemblee-nationale.fr/referentiel",
  "@xmlns:xsi": "http://www.w3.org/2001/XMLSchema-instance",
  "@xsi:type": "reunionCommission_type",
  "uid": "RUANR5L15S2018IDC428535",
  "timeStampDebut": "2018-02-14T14:05:00.000+01:00",
  "timeStampFin": "2018-02-14T15:00:00.000+01:00",
  "lieu": {
    "libelleLong": "salle 6351 (1er étage du Palais Bourbon)"
  },
  "cycleDeVie": {
    "etat": "Confirmé",
    "chrono": {
      "creation": "2018-02-09T00:00:00.000+01:00",
      "cloture": null
    }
  },
  "organeReuniRef": "PO748027",
  "demandeur": null,
  "participants": {
    "participantsInternes": {
      "participantInterne": [
        {
          "acteurRef": "PA718744",
          "presence": "présent"
        },
        {
          "acteurRef": "PA720362",
          "presence": "présent"
        },
        {
          "acteurRef": "PA718990",
          "presence": "excusé"
        },
        {
          "acteurRef": "PA719980",
          "presence": "présent"
        },
        {
          "acteurRef": "PA719032",
          "presence": "présent"
        },
        {
          "acteurRef": "PA719890",
          "presence": "présent"
        },
        {
          "acteurRef": "PA719448",
          "presence": "absent"
        },
        {
          "acteurRef": "PA721210",
          "presence": "excusé"
        },
        {
          "acteurRef": "PA722390",
          "presence": "présent"
        },
        {
          "acteurRef": "PA718926",
          "presence": "présent"
        },
        {
          "acteurRef": "PA720924",
          "presence": "présent"
        },
        {
          "acteurRef": "PA267780",
          "presence": "absent"
        },
        {
          "acteurRef": "PA720326",
          "presence": "présent"
        },
        {
          "acteurRef": "PA720038",
          "presence": "présent"
        },
        {
          "acteurRef": "PA332614",
          "presence": "excusé"
        },
        {
          "acteurRef": "PA719798",
          "presence": "absent"
        },
        {
          "acteurRef": "PA720480",
          "presence": "présent"
        },
        {
          "acteurRef": "PA719388",
          "presence": "présent"
        },
        {
          "acteurRef": "PA267378",
          "presence": "présent"
        },
        {
          "acteurRef": "PA719338",
          "presence": "présent"
        },
        {
          "acteurRef": "PA720500",
          "presence": "présent"
        },
        {
          "acteurRef": "PA720512",
          "presence": "présent"
        },
        {
          "acteurRef": "PA2449",
          "presence": "absent"
        },
        {
          "acteurRef": "PA721286",
          "presence": "excusé"
        },
        {
          "acteurRef": "PA266776",
          "presence": "présent"
        },
        {
          "acteurRef": "PA720066",
          "presence": "excusé"
        },
        {
          "acteurRef": "PA718682",
          "presence": "absent"
        },
        {
          "acteurRef": "PA643145",
          "presence": "absent"
        },
        {
          "acteurRef": "PA267585",
          "presence": "absent"
        },
        {
          "acteurRef": "PA721474",
          "presence": "présent"
        }
      ]
    },
    "personnesAuditionnees": null
  },
  "sessionRef": null,
  "ouverturePresse": "false",
  "captationVideo": "false",
  "ODJ": {
    "convocationODJ": {
      "item": [
        "nomination du bureau ;",
        "désignation du rapporteur ;",
        "échange de vues sur l’organisation des travaux de la commission."
      ]
    },
    "resumeODJ": {
      "item": [
        "nomination du bureau ;",
        "désignation du rapporteur ;",
        "échange de vues sur l’organisation des travaux de la commission."
      ]
    },
    "pointsODJ": {
      "pointODJ": {
        "@xsi:type": "podjReunion_type",
        "uid": "RUANR5L15S2018IDC428535PT25888",
        "cycleDeVie": {
          "etat": "Confirmé",
          "chrono": {
            "creation": "2018-07-19T00:00:00.000+02:00",
            "cloture": null
          }
        },
        "objet": "Nomination du rapporteur",
        "demandeurPoint": null,
        "procedure": null,
        "dossiersLegislatifsRefs": {
          "dossierRef": "DLR5L15N36307"
        },
        "typePointODJ": "Nomination rapporteur",
        "comiteSecret": "false",
        "textesAssocies": null
      }
    }
  },
  "compteRenduRef": null,
  "formatReunion": "Ordinaire",
  "infosReunionsInternationale": {
    "estReunionInternationale": "false",
    "listePays": null,
    "informationsComplementaires": null
  }
}