{
  "@xmlns": "http://schemas.assemblee-nationale.fr/referentiel",
  "@xmlns:xsi": "http://www.w3.org/2001/XMLSchema-instance",
  "@xsi:type": "reunionInitParlementaire_type",
  "uid": "RUANR5L15S2018IDF0111724",
  "timeStampDebut": "2018-09-21T09:00:00.000+02:00",
  "timeStampFin": "2018-09-21T18:00:00.000+02:00",
  "lieu": {
    "code": "SALREU004",
    "libelleCourt": "1er Bureau",
    "libelleLong": "1er Bureau, Palais Bourbon"
  },
  "cycleDeVie": {
    "etat": "Annulé",
    "chrono": {
      "creation": "2018-05-17T08:50:28.000+02:00",
      "cloture": "2018-07-10T13:49:42.000+02:00"
    }
  },
  "demandeurs": {
    "acteur": {
      "nom": "M. Hugues RENSON",
      "acteurRef": "PA721824"
    }
  },
  "organeReuniRef": null,
  "typeReunion": "DEP"
}