{
  "@xmlns": "http://schemas.assemblee-nationale.fr/referentiel",
  "@xmlns:xsi": "http://www.w3.org/2001/XMLSchema-instance",
  "@xsi:type": "reunionCommission_type",
  "uid": "RUANR5L15S2019IDC433551",
  "timeStampDebut": "2019-09-10T21:00:00.000+02:00",
  "timeStampFin": "2019-09-11T01:10:00.000+02:00",
  "lieu": {
    "libelleLong": "salle 6351 (Affaires sociales)"
  },
  "cycleDeVie": {
    "etat": "Confirmé",
    "chrono": {
      "creation": "2019-08-23T00:00:00.000+02:00",
      "cloture": null
    }
  },
  "organeReuniRef": "PO766718",
  "demandeur": null,
  "participants": {
    "participantsInternes": {
      "participantInterne": [
        {
          "acteurRef": "PA642764",
          "presence": "absent"
        },
        {
          "acteurRef": "PA721776",
          "presence": "présent"
        },
        {
          "acteurRef": "PA719558",
          "presence": "présent"
        },
        {
          "acteurRef": "PA720256",
          "presence": "présent"
        },
        {
          "acteurRef": "PA342415",
          "presence": "présent"
        },
        {
          "acteurRef": "PA642847",
          "presence": "présent"
        },
        {
          "acteurRef": "PA720210",
          "presence": "absent"
        },
        {
          "acteurRef": "PA642935",
          "presence": "absent"
        },
        {
          "acteurRef": "PA722046",
          "presence": "présent"
        },
        {
          "acteurRef": "PA720430",
          "presence": "présent"
        },
        {
          "acteurRef": "PA719488",
          "presence": "présent"
        },
        {
          "acteurRef": "PA330684",
          "presence": "absent"
        },
        {
          "acteurRef": "PA713448",
          "presence": "présent"
        },
        {
          "acteurRef": "PA330008",
          "presence": "présent"
        },
        {
          "acteurRef": "PA342601",
          "presence": "présent"
        },
        {
          "acteurRef": "PA720116",
          "presence": "absent"
        },
        {
          "acteurRef": "PA719496",
          "presence": "présent"
        },
        {
          "acteurRef": "PA722126",
          "presence": "présent"
        },
        {
          "acteurRef": "PA760658",
          "presence": "absent"
        },
        {
          "acteurRef": "PA722390",
          "presence": "absent"
        },
        {
          "acteurRef": "PA719624",
          "presence": "absent"
        },
        {
          "acteurRef": "PA942",
          "presence": "présent"
        },
        {
          "acteurRef": "PA718694",
          "presence": "présent"
        },
        {
          "acteurRef": "PA718926",
          "presence": "présent"
        },
        {
          "acteurRef": "PA720386",
          "presence": "présent"
        },
        {
          "acteurRef": "PA719684",
          "presence": "présent"
        },
        {
          "acteurRef": "PA720154",
          "presence": "présent"
        },
        {
          "acteurRef": "PA720684",
          "presence": "absent"
        },
        {
          "acteurRef": "PA719692",
          "presence": "présent"
        },
        {
          "acteurRef": "PA720924",
          "presence": "absent"
        },
        {
          "acteurRef": "PA721896",
          "presence": "présent"
        },
        {
          "acteurRef": "PA267042",
          "presence": "présent"
        },
        {
          "acteurRef": "PA720286",
          "presence": "présent"
        },
        {
          "acteurRef": "PA267780",
          "presence": "présent"
        },
        {
          "acteurRef": "PA718706",
          "presence": "présent"
        },
        {
          "acteurRef": "PA721142",
          "presence": "absent"
        },
        {
          "acteurRef": "PA722284",
          "presence": "présent"
        },
        {
          "acteurRef": "PA605991",
          "presence": "présent"
        },
        {
          "acteurRef": "PA719108",
          "presence": "présent"
        },
        {
          "acteurRef": "PA266797",
          "presence": "absent"
        },
        {
          "acteurRef": "PA721296",
          "presence": "absent"
        },
        {
          "acteurRef": "PA720326",
          "presence": "absent"
        },
        {
          "acteurRef": "PA608416",
          "presence": "présent"
        },
        {
          "acteurRef": "PA722374",
          "presence": "absent"
        },
        {
          "acteurRef": "PA720074",
          "presence": "absent"
        },
        {
          "acteurRef": "PA720846",
          "presence": "excusé"
        },
        {
          "acteurRef": "PA643205",
          "presence": "présent"
        },
        {
          "acteurRef": "PA721852",
          "presence": "présent"
        },
        {
          "acteurRef": "PA719858",
          "presence": "présent"
        },
        {
          "acteurRef": "PA720446",
          "presence": "absent"
        },
        {
          "acteurRef": "PA721932",
          "presence": "présent"
        },
        {
          "acteurRef": "PA606712",
          "presence": "présent"
        },
        {
          "acteurRef": "PA721946",
          "presence": "présent"
        },
        {
          "acteurRef": "PA719154",
          "presence": "présent"
        },
        {
          "acteurRef": "PA721726",
          "presence": "présent"
        },
        {
          "acteurRef": "PA719608",
          "presence": "présent"
        },
        {
          "acteurRef": "PA719072",
          "presence": "absent"
        },
        {
          "acteurRef": "PA720630",
          "presence": "présent"
        },
        {
          "acteurRef": "PA721960",
          "presence": "absent"
        },
        {
          "acteurRef": "PA720278",
          "presence": "présent"
        },
        {
          "acteurRef": "PA335532",
          "presence": "absent"
        },
        {
          "acteurRef": "PA722090",
          "presence": "présent"
        },
        {
          "acteurRef": "PA336175",
          "presence": "présent"
        },
        {
          "acteurRef": "PA721844",
          "presence": "présent"
        },
        {
          "acteurRef": "PA718910",
          "presence": "présent"
        },
        {
          "acteurRef": "PA2449",
          "presence": "absent"
        },
        {
          "acteurRef": "PA722194",
          "presence": "absent"
        },
        {
          "acteurRef": "PA721286",
          "presence": "présent"
        },
        {
          "acteurRef": "PA721888",
          "presence": "présent"
        },
        {
          "acteurRef": "PA722252",
          "presence": "absent"
        },
        {
          "acteurRef": "PA722022",
          "presence": "présent"
        },
        {
          "acteurRef": "PA721600",
          "presence": "présent"
        },
        {
          "acteurRef": "PA340343",
          "presence": "présent"
        },
        {
          "acteurRef": "PA719350",
          "presence": "présent"
        },
        {
          "acteurRef": "PA720568",
          "presence": "présent"
        },
        {
          "acteurRef": "PA334768",
          "presence": "présent"
        },
        {
          "acteurRef": "PA718728",
          "presence": "présent"
        },
        {
          "acteurRef": "PA720586",
          "presence": "présent"
        },
        {
          "acteurRef": "PA721924",
          "presence": "présent"
        },
        {
          "acteurRef": "PA642788",
          "presence": "présent"
        },
        {
          "acteurRef": "PA709315",
          "presence": "présent"
        },
        {
          "acteurRef": "PA331582",
          "presence": "présent"
        },
        {
          "acteurRef": "PA721262",
          "presence": "absent"
        },
        {
          "acteurRef": "PA722268",
          "presence": "présent"
        }
      ]
    },
    "personnesAuditionnees": null
  },
  "sessionRef": null,
  "ouverturePresse": "true",
  "captationVideo": "true",
  "ODJ": {
    "convocationODJ": {
      "item": "– Suite de l’examen des articles du projet de loi relatif à la bioéthique (n° 2187) (M. Jean-Louis Touraine, rapporteur des articles 1 et 2, Mme Coralie Dubost, rapporteure des articles 3 et 4, M. Hervé Saulignac, rapporteur du titre II, M. Philippe Berta, rapporteur des titres III et IV, M. Jean-François Eliaou, rapporteur du titre V et Mme Laetitia Romeiro Dias, rapporteure des titres VI et VII)"
    },
    "resumeODJ": {
      "item": "projet de loi bioéthique (n° 2187) (rapport) (suite)."
    },
    "pointsODJ": {
      "pointODJ": {
        "@xsi:type": "podjReunion_type",
        "uid": "RUANR5L15S2019IDC433551PT26769",
        "cycleDeVie": {
          "etat": "Confirmé",
          "chrono": {
            "creation": "2019-08-23T00:00:00.000+02:00",
            "cloture": null
          }
        },
        "objet": "Examen du texte (suite)",
        "demandeurPoint": null,
        "procedure": null,
        "dossiersLegislatifsRefs": {
          "dossierRef": "DLR5L15N37672"
        },
        "typePointODJ": "Examen",
        "comiteSecret": "false",
        "textesAssocies": null
      }
    }
  },
  "compteRenduRef": "CRCANR5L15S2019PO766718N035",
  "formatReunion": "Ordinaire",
  "infosReunionsInternationale": {
    "estReunionInternationale": "false",
    "listePays": null,
    "informationsComplementaires": null
  }
}