{
  "@xmlns": "http://schemas.assemblee-nationale.fr/referentiel",
  "@xmlns:xsi": "http://www.w3.org/2001/XMLSchema-instance",
  "@xsi:type": "reunionInitParlementaire_type",
  "uid": "RUANR5L15S2019IDF0119545",
  "timeStampDebut": "2018-10-15T14:00:00.000+02:00",
  "timeStampFin": "2018-10-15T15:30:00.000+02:00",
  "lieu": {
    "code": "SALREU039",
    "libelleCourt": "Salle 6550",
    "libelleLong": "Salle 6550, Palais Bourbon"
  },
  "cycleDeVie": {
    "etat": "Confirmé",
    "chrono": {
      "creation": "2018-09-27T09:43:26.000+02:00",
      "cloture": null
    }
  },
  "demandeurs": {
    "acteur": [
      {
        "nom": "M. Jean-René CAZENEUVE",
        "acteurRef": "PA719472"
      },
      {
        "nom": "M. Christophe JERRETIE",
        "acteurRef": "PA719060"
      }
    ]
  },
  "organeReuniRef": null,
  "typeReunion": "DEP"
}