{
  "@xmlns": "http://schemas.assemblee-nationale.fr/referentiel",
  "@xmlns:xsi": "http://www.w3.org/2001/XMLSchema-instance",
  "@xsi:type": "reunionInitParlementaire_type",
  "uid": "RUANR5L15S2018IDF0115976",
  "timeStampDebut": "2018-09-05T13:00:00.000+02:00",
  "timeStampFin": "2018-09-05T18:00:00.000+02:00",
  "lieu": {
    "code": "SALREU038",
    "libelleCourt": "Salle 6549",
    "libelleLong": "Salle 6549, Palais Bourbon"
  },
  "cycleDeVie": {
    "etat": "Confirmé",
    "chrono": {
      "creation": "2018-07-20T08:58:30.000+02:00",
      "cloture": null
    }
  },
  "demandeurs": {
    "acteur": [
      {
        "nom": "Mme Bénédicte PEYROL",
        "acteurRef": "PA718736"
      },
      {
        "nom": "Mme Dominique DAVID",
        "acteurRef": "PA719710"
      }
    ]
  },
  "organeReuniRef": null,
  "typeReunion": "DEP"
}