{
  "@xmlns": "http://schemas.assemblee-nationale.fr/referentiel",
  "@xmlns:xsi": "http://www.w3.org/2001/XMLSchema-instance",
  "@xsi:type": "reunionInitParlementaire_type",
  "uid": "RUANR5L15S2019IDF0120411",
  "timeStampDebut": "2018-10-23T16:30:00.000+02:00",
  "timeStampFin": "2018-10-23T18:00:00.000+02:00",
  "lieu": {
    "code": "SALREU013",
    "libelleCourt": "Salle N° 3",
    "libelleLong": "Salle N° 3, 3, rue Aristide Briand"
  },
  "cycleDeVie": {
    "etat": "Annulé",
    "chrono": {
      "creation": "2018-10-10T14:40:08.000+02:00",
      "cloture": "2018-10-22T11:21:47.000+02:00"
    }
  },
  "demandeurs": {
    "acteur": {
      "nom": "Mme Florence LASSERRE-DAVID",
      "acteurRef": "PA720764"
    }
  },
  "organeReuniRef": null,
  "typeReunion": "DEP"
}