{
  "@xmlns": "http://schemas.assemblee-nationale.fr/referentiel",
  "@xmlns:xsi": "http://www.w3.org/2001/XMLSchema-instance",
  "@xsi:type": "reunionInitParlementaire_type",
  "uid": "RUANR5L15S2018IDF0102178",
  "timeStampDebut": "2017-12-22T17:00:00.000+01:00",
  "timeStampFin": "2017-12-22T18:30:00.000+01:00",
  "lieu": {
    "code": "SALREU048",
    "libelleCourt": "Salle 6809",
    "libelleLong": "Salle 6809, Palais Bourbon"
  },
  "cycleDeVie": {
    "etat": "Confirmé",
    "chrono": {
      "creation": "2017-12-12T11:22:07.000+01:00",
      "cloture": null
    }
  },
  "demandeurs": {
    "acteur": {
      "nom": "M. Aurélien TACHÉ",
      "acteurRef": "PA720952"
    }
  },
  "organeReuniRef": null,
  "typeReunion": "DEP"
}