{
  "@xmlns": "http://schemas.assemblee-nationale.fr/referentiel",
  "@xmlns:xsi": "http://www.w3.org/2001/XMLSchema-instance",
  "@xsi:type": "reunionCommission_type",
  "uid": "RUANR5L15S2018IDC427966",
  "timeStampDebut": "2017-12-14T11:20:00.000+01:00",
  "timeStampFin": "2017-12-14T13:15:00.000+01:00",
  "lieu": {
    "libelleLong": "6e Bureau"
  },
  "cycleDeVie": {
    "etat": "Confirmé",
    "chrono": {
      "creation": "2017-11-24T00:00:00.000+01:00",
      "cloture": null
    }
  },
  "organeReuniRef": "PO742273",
  "demandeur": null,
  "participants": {
    "participantsInternes": {
      "participantInterne": [
        {
          "acteurRef": "PA722038",
          "presence": "absent"
        },
        {
          "acteurRef": "PA335999",
          "presence": "présent"
        },
        {
          "acteurRef": "PA342415",
          "presence": "absent"
        },
        {
          "acteurRef": "PA718756",
          "presence": "absent"
        },
        {
          "acteurRef": "PA642695",
          "presence": "absent"
        },
        {
          "acteurRef": "PA720520",
          "presence": "présent"
        },
        {
          "acteurRef": "PA721808",
          "presence": "absent"
        },
        {
          "acteurRef": "PA719710",
          "presence": "présent"
        },
        {
          "acteurRef": "PA712015",
          "presence": "absent"
        },
        {
          "acteurRef": "PA720046",
          "presence": "absent"
        },
        {
          "acteurRef": "PA720652",
          "presence": "absent"
        },
        {
          "acteurRef": "PA720002",
          "presence": "présent"
        },
        {
          "acteurRef": "PA334149",
          "presence": "absent"
        },
        {
          "acteurRef": "PA720222",
          "presence": "excusé"
        },
        {
          "acteurRef": "PA718674",
          "presence": "absent"
        },
        {
          "acteurRef": "PA719372",
          "presence": "présent"
        },
        {
          "acteurRef": "PA721514",
          "presence": "absent"
        },
        {
          "acteurRef": "PA719052",
          "presence": "absent"
        },
        {
          "acteurRef": "PA720846",
          "presence": "présent"
        },
        {
          "acteurRef": "PA331567",
          "presence": "absent"
        },
        {
          "acteurRef": "PA721134",
          "presence": "absent"
        },
        {
          "acteurRef": "PA606098",
          "presence": "présent"
        },
        {
          "acteurRef": "PA607595",
          "presence": "présent"
        },
        {
          "acteurRef": "PA721916",
          "presence": "présent"
        },
        {
          "acteurRef": "PA266776",
          "presence": "présent"
        },
        {
          "acteurRef": "PA720692",
          "presence": "présent"
        },
        {
          "acteurRef": "PA720780",
          "presence": "absent"
        },
        {
          "acteurRef": "PA719420",
          "presence": "présent"
        },
        {
          "acteurRef": "PA267330",
          "presence": "absent"
        }
      ]
    },
    "personnesAuditionnees": null
  },
  "sessionRef": null,
  "ouverturePresse": "true",
  "captationVideo": "false",
  "ODJ": {
    "convocationODJ": {
      "item": "Audition, ouverte à la presse, de M. Henri Poupart-Lafarge, président-directeur général d’Alstom, de M. Philippe Delleur, vice-président affaires publiques, de Mme Emmanuelle Chatelain, vice-présidente communication et de M. Damien Cabarrus, responsable affaires publiques France."
    },
    "resumeODJ": {
      "item": "audition, ouverte à la presse, de M. Henri Poupart-Lafarge, président-directeur général d’Alstom, de M. Philippe Delleur, vice-président affaires publiques, de Mme Emmanuelle Chatelain, vice-présidente communication et de M. Damien Cabarrus, responsable affaires publiques France."
    },
    "pointsODJ": {
      "pointODJ": {
        "@xsi:type": "podjReunion_type",
        "uid": "RUANR5L15S2018IDC427966PT25349",
        "cycleDeVie": {
          "etat": "Confirmé",
          "chrono": {
            "creation": "2017-12-20T00:00:00.000+01:00",
            "cloture": null
          }
        },
        "objet": "- Audition, ouverte à la presse, de M. Henri Poupart-Lafarge, président-directeur général d’Alstom, de M. Philippe Delleur, vice-président affaires publiques, de Mme Emmanuelle Chatelain, vice-présidente communication et de M. Damien Cabarrus, responsable affaires publiques France.",
        "demandeurPoint": null,
        "procedure": null,
        "dossiersLegislatifsRefs": {
          "dossierRef": "DLR5L15N36104"
        },
        "typePointODJ": "Audition",
        "comiteSecret": "false",
        "textesAssocies": null
      }
    }
  },
  "compteRenduRef": "CRCANR5L15S2018PO742273N010",
  "formatReunion": "Ordinaire",
  "infosReunionsInternationale": {
    "estReunionInternationale": "false",
    "listePays": null,
    "informationsComplementaires": null
  }
}