{
  "@xmlns": "http://schemas.assemblee-nationale.fr/referentiel",
  "@xmlns:xsi": "http://www.w3.org/2001/XMLSchema-instance",
  "@xsi:type": "reunionCommission_type",
  "uid": "RUANR5L15S2019IDC433191",
  "timeStampDebut": "2019-07-03T21:30:00.000+02:00",
  "lieu": {
    "libelleLong": "salle 6237 (Développement durable)"
  },
  "cycleDeVie": {
    "etat": "Supprimé",
    "chrono": {
      "creation": "2019-06-20T00:00:00.000+02:00",
      "cloture": "2019-06-27T00:00:00.000+02:00"
    }
  },
  "organeReuniRef": "PO419865",
  "demandeur": null,
  "participants": {
    "participantsInternes": null,
    "personnesAuditionnees": null
  },
  "sessionRef": null,
  "ouverturePresse": "true",
  "captationVideo": "true",
  "ODJ": {
    "convocationODJ": {
      "item": "– Éventuellement, en cas d’échec de la commission mixte paritaire, examen, en nouvelle lecture, du projet de loi, modifié par le Sénat, portant création de l’Office français de la biodiversité et de la chasse, modifiant les missions des fédérations des chasseurs et renforçant la police de l’environnement (n° 1875) (Mme Barbara Pompili, rapporteure)."
    },
    "resumeODJ": {
      "item": "éventuellement, en cas d’échec de la commission mixte paritaire, examen, en nouvelle lecture, du projet de loi, modifié par le Sénat, portant création de l’Office français de la biodiversité et de la chasse, modifiant les missions des fédérations des chasseurs et renforçant la police de l’environnement (n° 1875) (Mme Barbara Pompili, rapporteure)."
    },
    "pointsODJ": {
      "pointODJ": {
        "@xsi:type": "podjReunion_type",
        "uid": "RUANR5L15S2019IDC433191PT26698",
        "cycleDeVie": {
          "etat": "Supprimé",
          "chrono": {
            "creation": "2019-06-20T00:00:00.000+02:00",
            "cloture": "2019-06-27T00:00:00.000+02:00"
          }
        },
        "objet": "Examen du texte",
        "demandeurPoint": null,
        "procedure": null,
        "dossiersLegislatifsRefs": null,
        "typePointODJ": "Examen",
        "comiteSecret": "false",
        "textesAssocies": null
      }
    }
  },
  "compteRenduRef": null,
  "formatReunion": "Ordinaire",
  "infosReunionsInternationale": {
    "estReunionInternationale": "false",
    "listePays": null,
    "informationsComplementaires": null
  }
}