{
  "@xmlns": "http://schemas.assemblee-nationale.fr/referentiel",
  "@xmlns:xsi": "http://www.w3.org/2001/XMLSchema-instance",
  "@xsi:type": "reunionInitParlementaire_type",
  "uid": "RUANR5L15S2019IDF0128134",
  "timeStampDebut": "2019-02-28T09:00:00.000+01:00",
  "timeStampFin": "2019-02-28T14:00:00.000+01:00",
  "lieu": {
    "code": "SALREU021",
    "libelleCourt": "Salle 7207",
    "libelleLong": "Salle 7207, 101, rue de l'Université"
  },
  "cycleDeVie": {
    "etat": "Annulé",
    "chrono": {
      "creation": "2019-02-21T10:56:45.000+01:00",
      "cloture": "2019-02-27T12:18:36.000+01:00"
    }
  },
  "demandeurs": {
    "acteur": {
      "nom": "M. Raphaël GAUVAIN",
      "acteurRef": "PA721364"
    }
  },
  "organeReuniRef": null,
  "typeReunion": "DEP"
}