{
  "@xmlns": "http://schemas.assemblee-nationale.fr/referentiel",
  "@xmlns:xsi": "http://www.w3.org/2001/XMLSchema-instance",
  "@xsi:type": "seance_type",
  "uid": "RUSNR5L15S2019IDS21528",
  "timeStampDebut": "2019-03-06T14:30:00.000+01:00",
  "timeStampFin": "2019-03-06T21:10:00.000+01:00",
  "lieu": {
    "code": "S",
    "libelleLong": "Sénat"
  },
  "cycleDeVie": {
    "etat": "Confirmé",
    "chrono": {
      "creation": "2019-02-05T00:00:00.000+01:00",
      "cloture": null
    }
  },
  "organeReuniRef": "PO78718",
  "demandeur": null,
  "participants": null,
  "sessionRef": "SCR5A2019O1",
  "ouverturePresse": "true",
  "captationVideo": "true",
  "ODJ": {
    "convocationODJ": null,
    "resumeODJ": null,
    "pointsODJ": {
      "pointODJ": [
        {
          "@xsi:type": "podjSeanceConfPres_type",
          "uid": "RUSNR5L15S2019IDS21528PT36973",
          "cycleDeVie": {
            "etat": "Confirmé",
            "chrono": {
              "creation": "2019-02-05T00:00:00.000+01:00",
              "cloture": null
            }
          },
          "objet": "Discussion de la proposition de loi, adoptée par l'Assemblée nationale, en faveur de l'engagement associatif (n° 486, 2017-2018)",
          "demandeurPoint": null,
          "procedure": null,
          "dossiersLegislatifsRefs": {
            "dossierRef": "DLR5L15N36532"
          },
          "typePointODJ": "Discussion",
          "comiteSecret": "false",
          "textesAssocies": null,
          "natureTravauxODJ": "ODJSN",
          "dateConfPres": "2019-03-06+01:00"
        },
        {
          "@xsi:type": "podjSeanceConfPres_type",
          "uid": "RUSNR5L15S2019IDS21528PT36974",
          "cycleDeVie": {
            "etat": "Confirmé",
            "chrono": {
              "creation": "2019-02-05T00:00:00.000+01:00",
              "cloture": null
            }
          },
          "objet": "Discussion de la proposition de loi, adoptée par l'Assemblée nationale, pour la protection des activités agricoles et des cultures marines en zone littorale (n° 169, 2018-2019)",
          "demandeurPoint": null,
          "procedure": null,
          "dossiersLegislatifsRefs": {
            "dossierRef": "DLR5L15N36917"
          },
          "typePointODJ": "Discussion",
          "comiteSecret": "false",
          "textesAssocies": null,
          "natureTravauxODJ": "ODJPR",
          "dateConfPres": "2019-01-23+01:00"
        },
        {
          "@xsi:type": "podjSeanceConfPres_type",
          "uid": "RUSNR5L15S2019IDS21528PT36976",
          "cycleDeVie": {
            "etat": "Confirmé",
            "chrono": {
              "creation": "2019-02-07T00:00:00.000+01:00",
              "cloture": null
            }
          },
          "objet": "Explications de vote puis vote sur la proposition de loi relative au renforcement de la sécurité des sapeurs-pompiers, présentée par M. Patrick KANNER et les membres du groupe socialiste et républicain (n° 91, 2018-2019)",
          "demandeurPoint": null,
          "procedure": null,
          "dossiersLegislatifsRefs": {
            "dossierRef": "DLR5L15N37225"
          },
          "typePointODJ": "Explications de vote et vote par scrutin public",
          "comiteSecret": "false",
          "textesAssocies": null,
          "natureTravauxODJ": "ODJSN",
          "dateConfPres": "2019-01-23+01:00"
        },
        {
          "@xsi:type": "podjSeanceConfPres_type",
          "uid": "RUSNR5L15S2019IDS21528PT36975",
          "cycleDeVie": {
            "etat": "Confirmé",
            "chrono": {
              "creation": "2019-02-05T00:00:00.000+01:00",
              "cloture": null
            }
          },
          "objet": "Discussion de la proposition de loi visant à lutter contre toutes les violences éducatives ordinaires, présentée par Mme Laurence ROSSIGNOL et les membres du groupe socialiste et républicain (n° 261, 2018-2019)",
          "demandeurPoint": null,
          "procedure": null,
          "dossiersLegislatifsRefs": {
            "dossierRef": "DLR5L15N37226"
          },
          "typePointODJ": "Discussion",
          "comiteSecret": "false",
          "textesAssocies": null,
          "natureTravauxODJ": "ODJSN",
          "dateConfPres": "2019-01-23+01:00"
        }
      ]
    }
  },
  "compteRenduRef": "CRSSNR5S2019IDS20190306",
  "identifiants": {
    "numSeanceJO": "66",
    "idJO": "20190066",
    "quantieme": "Unique",
    "DateSeance": "2019-03-06+01:00"
  }
}