{
  "@xmlns": "http://schemas.assemblee-nationale.fr/referentiel",
  "@xmlns:xsi": "http://www.w3.org/2001/XMLSchema-instance",
  "@xsi:type": "reunionInitParlementaire_type",
  "uid": "RUANR5L15S2018IDF0105283",
  "timeStampDebut": "2018-02-21T10:30:00.000+01:00",
  "timeStampFin": "2018-02-21T12:00:00.000+01:00",
  "lieu": {
    "code": "SALREU006",
    "libelleCourt": "3ème Bureau",
    "libelleLong": "3ème Bureau, Palais Bourbon"
  },
  "cycleDeVie": {
    "etat": "Annulé",
    "chrono": {
      "creation": "2018-02-07T12:07:40.000+01:00",
      "cloture": "2018-02-09T11:54:16.000+01:00"
    }
  },
  "demandeurs": {
    "acteur": {
      "nom": "M. Jacques KRABAL",
      "acteurRef": "PA605084"
    }
  },
  "organeReuniRef": null,
  "typeReunion": "DEP"
}