{
  "@xmlns": "http://schemas.assemblee-nationale.fr/referentiel",
  "@xmlns:xsi": "http://www.w3.org/2001/XMLSchema-instance",
  "@xsi:type": "reunionCommission_type",
  "uid": "RUANR5L15S2019IDC431327",
  "timeStampDebut": "2019-04-11T11:00:00.000+02:00",
  "lieu": {
    "libelleLong": "Salle de la commission"
  },
  "cycleDeVie": {
    "etat": "Annulé",
    "chrono": {
      "creation": "2019-01-24T00:00:00.000+01:00",
      "cloture": "2019-02-01T00:00:00.000+01:00"
    }
  },
  "organeReuniRef": "PO757231",
  "demandeur": null,
  "participants": {
    "participantsInternes": null,
    "personnesAuditionnees": null
  },
  "sessionRef": null,
  "ouverturePresse": "true",
  "captationVideo": "false",
  "ODJ": {
    "convocationODJ": {
      "item": "Audition, en table ronde, ouverte à la presse : (thématique en cours de confirmation)"
    },
    "resumeODJ": {
      "item": "– audition, en table ronde, ouverte à la presse : (thématique en cours de confirmation)"
    },
    "pointsODJ": null
  },
  "compteRenduRef": null,
  "formatReunion": "Ordinaire",
  "infosReunionsInternationale": {
    "estReunionInternationale": "false",
    "listePays": null,
    "informationsComplementaires": null
  }
}