{
  "@xmlns": "http://schemas.assemblee-nationale.fr/referentiel",
  "@xmlns:xsi": "http://www.w3.org/2001/XMLSchema-instance",
  "@xsi:type": "reunionInitParlementaire_type",
  "uid": "RUANR5L15S2019IDF0124767",
  "timeStampDebut": "2019-05-21T10:30:00.000+02:00",
  "timeStampFin": "2019-05-21T10:45:00.000+02:00",
  "lieu": {
    "code": "SALREU027",
    "libelleCourt": "Salle 6217",
    "libelleLong": "Salle 6217, Palais Bourbon"
  },
  "cycleDeVie": {
    "etat": "Confirmé",
    "chrono": {
      "creation": "2019-01-11T0011:29.000+02:00",
      "cloture": null
    }
  },
  "demandeurs": {
    "acteur": {
      "nom": "M. Christian JACOB",
      "acteurRef": "PA1695"
    }
  },
  "organeReuniRef": null,
  "typeReunion": "DEP"
}