{
  "@xmlns": "http://schemas.assemblee-nationale.fr/referentiel",
  "@xmlns:xsi": "http://www.w3.org/2001/XMLSchema-instance",
  "@xsi:type": "reunionInitParlementaire_type",
  "uid": "RUANR5L15S2018IDF0107881",
  "timeStampDebut": "2018-03-29T16:00:00.000+02:00",
  "timeStampFin": "2018-03-29T17:00:00.000+02:00",
  "lieu": {
    "code": "SALREU048",
    "libelleCourt": "Salle 6809",
    "libelleLong": "Salle 6809, Palais Bourbon"
  },
  "cycleDeVie": {
    "etat": "Confirmé",
    "chrono": {
      "creation": "2018-03-16T12:10:51.000+02:00",
      "cloture": null
    }
  },
  "demandeurs": {
    "acteur": {
      "nom": "Mme Amélie DE MONTCHALIN",
      "acteurRef": "PA721670"
    }
  },
  "organeReuniRef": null,
  "typeReunion": "DEP"
}