{
  "@xmlns": "http://schemas.assemblee-nationale.fr/referentiel",
  "@xmlns:xsi": "http://www.w3.org/2001/XMLSchema-instance",
  "@xsi:type": "reunionCommission_type",
  "uid": "RUANR5L15S2020IDC433872",
  "timeStampDebut": "2019-10-10T17:00:00.000+02:00",
  "timeStampFin": "2019-10-10T18:40:00.000+02:00",
  "lieu": {
    "libelleLong": "salle 6237"
  },
  "cycleDeVie": {
    "etat": "Confirmé",
    "chrono": {
      "creation": "2019-10-03T00:00:00.000+02:00",
      "cloture": null
    }
  },
  "organeReuniRef": "PO757572",
  "demandeur": null,
  "participants": {
    "participantsInternes": {
      "participantInterne": [
        {
          "acteurRef": "PA266793",
          "presence": "absent"
        },
        {
          "acteurRef": "PA642868",
          "presence": "absent"
        },
        {
          "acteurRef": "PA722390",
          "presence": "absent"
        },
        {
          "acteurRef": "PA719624",
          "presence": "absent"
        },
        {
          "acteurRef": "PA719258",
          "presence": "absent"
        },
        {
          "acteurRef": "PA712015",
          "presence": "excusé"
        },
        {
          "acteurRef": "PA722366",
          "presence": "présent"
        },
        {
          "acteurRef": "PA267355",
          "presence": "absent"
        },
        {
          "acteurRef": "PA719700",
          "presence": "absent"
        },
        {
          "acteurRef": "PA331835",
          "presence": "absent"
        },
        {
          "acteurRef": "PA722202",
          "presence": "absent"
        },
        {
          "acteurRef": "PA719412",
          "presence": "absent"
        },
        {
          "acteurRef": "PA719858",
          "presence": "absent"
        },
        {
          "acteurRef": "PA606712",
          "presence": "absent"
        },
        {
          "acteurRef": "PA719718",
          "presence": "présent"
        },
        {
          "acteurRef": "PA719154",
          "presence": "absent"
        },
        {
          "acteurRef": "PA720738",
          "presence": "absent"
        },
        {
          "acteurRef": "PA719242",
          "presence": "présent"
        },
        {
          "acteurRef": "PA720278",
          "presence": "absent"
        },
        {
          "acteurRef": "PA607553",
          "presence": "absent"
        },
        {
          "acteurRef": "PA719578",
          "presence": "absent"
        },
        {
          "acteurRef": "PA718810",
          "presence": "absent"
        },
        {
          "acteurRef": "PA719540",
          "presence": "absent"
        },
        {
          "acteurRef": "PA722162",
          "presence": "absent"
        },
        {
          "acteurRef": "PA721924",
          "presence": "absent"
        }
      ]
    },
    "personnesAuditionnees": null
  },
  "sessionRef": null,
  "ouverturePresse": "false",
  "captationVideo": "false",
  "ODJ": {
    "convocationODJ": {
      "item": "Entretien avec Mme Marie Montpetit, députée de Maurice-Richard, vice-présidente de la Commission de l’agriculture, des pêcheries, de l’énergie et des ressources naturelles (CAPERN) de l’Assemblée nationale du Québec, M. Éric Girard, député de Lac-Saint-Jean et membre de la CAPERN, M. Sylvain Roy, député de Bonaventure et membre de la CAPERN, M. Patrick Giasson, conseiller en diplomatie parlementaire, et M. Mathieu Leblanc, conseiller en recherche."
    },
    "resumeODJ": {
      "item": "entretien avec Mme Marie Montpetit, députée de Maurice-Richard, vice-présidente de la Commission de l’agriculture, des pêcheries, de l’énergie et des ressources naturelles (CAPERN) de l’Assemblée nationale du Québec, M. Éric Girard, député de Lac-Saint-Jean et membre de la CAPERN, M. Sylvain Roy, député de Bonaventure et membre de la CAPERN, M. Patrick Giasson, conseiller en diplomatie parlementaire, et M. Mathieu Leblanc, conseiller en recherche."
    },
    "pointsODJ": null
  },
  "compteRenduRef": null,
  "formatReunion": "Ordinaire",
  "infosReunionsInternationale": {
    "estReunionInternationale": "false",
    "listePays": null,
    "informationsComplementaires": null
  }
}