{
  "@xmlns": "http://schemas.assemblee-nationale.fr/referentiel",
  "@xmlns:xsi": "http://www.w3.org/2001/XMLSchema-instance",
  "@xsi:type": "reunionInitParlementaire_type",
  "uid": "RUANR5L15S2019IDF0124821",
  "timeStampDebut": "2019-06-04T10:45:00.000+02:00",
  "timeStampFin": "2019-06-04T11:15:00.000+02:00",
  "lieu": {
    "code": "SALREU027",
    "libelleCourt": "Salle 6217",
    "libelleLong": "Salle 6217, Palais Bourbon"
  },
  "cycleDeVie": {
    "etat": "Confirmé",
    "chrono": {
      "creation": "2019-01-11T11:34:29.000+02:00",
      "cloture": null
    }
  },
  "demandeurs": {
    "organe": {
      "nom": "GROUPE LES RÉPUBLICAINS",
      "organeRef": "PO730934"
    }
  },
  "organeReuniRef": "PO730934",
  "typeReunion": "GP"
}