{
  "@xmlns": "http://schemas.assemblee-nationale.fr/referentiel",
  "@xmlns:xsi": "http://www.w3.org/2001/XMLSchema-instance",
  "@xsi:type": "reunionInitParlementaire_type",
  "uid": "RUANR5L15S2018IDF0104988",
  "timeStampDebut": "2018-02-21T09:00:00.000+01:00",
  "timeStampFin": "2018-02-21T09:30:00.000+01:00",
  "lieu": {
    "code": "SALREU039",
    "libelleCourt": "Salle 6550",
    "libelleLong": "Salle 6550, Palais Bourbon"
  },
  "cycleDeVie": {
    "etat": "Confirmé",
    "chrono": {
      "creation": "2018-02-01T17:55:28.000+01:00",
      "cloture": null
    }
  },
  "demandeurs": {
    "acteur": {
      "nom": "M. Éric WOERTH",
      "acteurRef": "PA2960"
    }
  },
  "organeReuniRef": null,
  "typeReunion": "DEP"
}