{
  "@xmlns": "http://schemas.assemblee-nationale.fr/referentiel",
  "@xmlns:xsi": "http://www.w3.org/2001/XMLSchema-instance",
  "@xsi:type": "reunionInitParlementaire_type",
  "uid": "RUANR5L15S2020IDF0141278",
  "timeStampDebut": "2019-10-17T15:30:00.000+02:00",
  "timeStampFin": "2019-10-17T17:30:00.000+02:00",
  "lieu": {
    "code": "SALREU020",
    "libelleCourt": "Salon Mars II",
    "libelleLong": "Salon Mars II, 101, rue de l'Université"
  },
  "cycleDeVie": {
    "etat": "Confirmé",
    "chrono": {
      "creation": "2019-10-02T10:49:39.000+02:00",
      "cloture": null
    }
  },
  "demandeurs": {
    "acteur": {
      "nom": "M. Jacques SAVATIER",
      "acteurRef": "PA722078"
    }
  },
  "organeReuniRef": null,
  "typeReunion": "DEP"
}