{
  "@xmlns": "http://schemas.assemblee-nationale.fr/referentiel",
  "@xmlns:xsi": "http://www.w3.org/2001/XMLSchema-instance",
  "@xsi:type": "reunionCommission_type",
  "uid": "RUANR5L15S2018IDC427682",
  "timeStampDebut": "2017-11-08T10:10:00.000+01:00",
  "timeStampFin": "2017-11-08T12:35:00.000+01:00",
  "lieu": {
    "libelleLong": "salle 6242 (Lois)"
  },
  "cycleDeVie": {
    "etat": "Confirmé",
    "chrono": {
      "creation": "2017-10-27T00:00:00.000+02:00",
      "cloture": null
    }
  },
  "organeReuniRef": "PO59051",
  "demandeur": null,
  "participants": {
    "participantsInternes": {
      "participantInterne": [
        {
          "acteurRef": "PA719866",
          "presence": "présent"
        },
        {
          "acteurRef": "PA721624",
          "presence": "absent"
        },
        {
          "acteurRef": "PA719558",
          "presence": "présent"
        },
        {
          "acteurRef": "PA441",
          "presence": "présent"
        },
        {
          "acteurRef": "PA720430",
          "presence": "présent"
        },
        {
          "acteurRef": "PA606507",
          "presence": "présent"
        },
        {
          "acteurRef": "PA721908",
          "presence": "présent"
        },
        {
          "acteurRef": "PA330008",
          "presence": "présent"
        },
        {
          "acteurRef": "PA720772",
          "presence": "présent"
        },
        {
          "acteurRef": "PA719748",
          "presence": "absent"
        },
        {
          "acteurRef": "PA330240",
          "presence": "présent"
        },
        {
          "acteurRef": "PA336439",
          "presence": "excusé"
        },
        {
          "acteurRef": "PA606212",
          "presence": "absent"
        },
        {
          "acteurRef": "PA721398",
          "presence": "présent"
        },
        {
          "acteurRef": "PA267440",
          "presence": "présent"
        },
        {
          "acteurRef": "PA719684",
          "presence": "absent"
        },
        {
          "acteurRef": "PA720154",
          "presence": "présent"
        },
        {
          "acteurRef": "PA721094",
          "presence": "présent"
        },
        {
          "acteurRef": "PA330357",
          "presence": "présent"
        },
        {
          "acteurRef": "PA719616",
          "presence": "présent"
        },
        {
          "acteurRef": "PA721564",
          "presence": "présent"
        },
        {
          "acteurRef": "PA721702",
          "presence": "présent"
        },
        {
          "acteurRef": "PA721742",
          "presence": "présent"
        },
        {
          "acteurRef": "PA721142",
          "presence": "présent"
        },
        {
          "acteurRef": "PA721364",
          "presence": "présent"
        },
        {
          "acteurRef": "PA266797",
          "presence": "présent"
        },
        {
          "acteurRef": "PA721880",
          "presence": "excusé"
        },
        {
          "acteurRef": "PA1592",
          "presence": "présent"
        },
        {
          "acteurRef": "PA720454",
          "presence": "présent"
        },
        {
          "acteurRef": "PA722150",
          "presence": "excusé"
        },
        {
          "acteurRef": "PA267200",
          "presence": "présent"
        },
        {
          "acteurRef": "PA719874",
          "presence": "présent"
        },
        {
          "acteurRef": "PA267901",
          "presence": "présent"
        },
        {
          "acteurRef": "PA719994",
          "presence": "présent"
        },
        {
          "acteurRef": "PA335054",
          "presence": "présent"
        },
        {
          "acteurRef": "PA267785",
          "presence": "présent"
        },
        {
          "acteurRef": "PA721984",
          "presence": "présent"
        },
        {
          "acteurRef": "PA721932",
          "presence": "présent"
        },
        {
          "acteurRef": "PA718918",
          "presence": "présent"
        },
        {
          "acteurRef": "PA606098",
          "presence": "présent"
        },
        {
          "acteurRef": "PA346218",
          "presence": "présent"
        },
        {
          "acteurRef": "PA721800",
          "presence": "absent"
        },
        {
          "acteurRef": "PA677483",
          "presence": "présent"
        },
        {
          "acteurRef": "PA719952",
          "presence": "présent"
        },
        {
          "acteurRef": "PA607619",
          "presence": "présent"
        },
        {
          "acteurRef": "PA266788",
          "presence": "présent"
        },
        {
          "acteurRef": "PA720908",
          "presence": "présent"
        },
        {
          "acteurRef": "PA721960",
          "presence": "présent"
        },
        {
          "acteurRef": "PA719202",
          "presence": "présent"
        },
        {
          "acteurRef": "PA721270",
          "presence": "absent"
        },
        {
          "acteurRef": "PA2449",
          "presence": "présent"
        },
        {
          "acteurRef": "PA719600",
          "presence": "présent"
        },
        {
          "acteurRef": "PA720100",
          "presence": "présent"
        },
        {
          "acteurRef": "PA643127",
          "presence": "présent"
        },
        {
          "acteurRef": "PA722398",
          "presence": "excusé"
        },
        {
          "acteurRef": "PA721678",
          "presence": "présent"
        },
        {
          "acteurRef": "PA722292",
          "presence": "présent"
        },
        {
          "acteurRef": "PA332747",
          "presence": "excusé"
        },
        {
          "acteurRef": "PA721616",
          "presence": "présent"
        },
        {
          "acteurRef": "PA702052",
          "presence": "présent"
        },
        {
          "acteurRef": "PA721314",
          "presence": "présent"
        },
        {
          "acteurRef": "PA334654",
          "presence": "présent"
        },
        {
          "acteurRef": "PA721584",
          "presence": "présent"
        },
        {
          "acteurRef": "PA719302",
          "presence": "présent"
        },
        {
          "acteurRef": "PA2828",
          "presence": "présent"
        },
        {
          "acteurRef": "PA608695",
          "presence": "présent"
        },
        {
          "acteurRef": "PA267622",
          "presence": "présent"
        },
        {
          "acteurRef": "PA709315",
          "presence": "présent"
        },
        {
          "acteurRef": "PA720704",
          "presence": "présent"
        },
        {
          "acteurRef": "PA722260",
          "presence": "absent"
        },
        {
          "acteurRef": "PA721262",
          "presence": "excusé"
        },
        {
          "acteurRef": "PA2952",
          "presence": "présent"
        },
        {
          "acteurRef": "PA720318",
          "presence": "absent"
        },
        {
          "acteurRef": "PA267330",
          "presence": "présent"
        }
      ]
    },
    "personnesAuditionnees": null
  },
  "sessionRef": null,
  "ouverturePresse": "false",
  "captationVideo": "false",
  "ODJ": {
    "convocationODJ": {
      "item": "Échange de vues sur les visites de prisons opérées par les membres de la commission des Lois ;Communication de Mme Marietta Karamanli, référente de la commission des Lois auprès de la commission des Affaires européennes, sur Europol ;Organisation du contrôle de l’application de la loi n° 2017-1510 du 30 octobre 2017 renforçant la sécurité intérieure et la lutte contre le terrorisme ;Point sur les nominations de membres de la commission des Lois dans les organismes extraparlementaires relevant du champ de compétences de la commission ;Nomination de rapporteurs sur :– le projet de loi, adopté par le Sénat, ratifiant l'ordonnance n° 2016-131 du 10 février 2016 portant réforme du droit des contrats, du régime général et de la preuve des obligations (n° 315) ;– la proposition de loi relative à la garde alternée des enfants (n° 307) ;– la proposition de loi relative à l’exercice des compétences des collectivités territoriales dans le domaine de la gestion des milieux aquatiques et de la prévention des inondations (n° 310).Nomination des membres de la mission d’information, commune avec la commission du Développement durable, pour une nouvelle étape de la décentralisation en faveur des pôles de développement territoriaux."
    },
    "resumeODJ": {
      "item": "- échange de vues sur les visites de prisons opérées par les membres de la commission des Lois ;- communication de Mme Marietta Karamanli, référente de la commission des Lois auprès de la commission des Affaires européennes, sur Europol ;- organisation du contrôle de l’application de la loi n° 2017-1510 du 30 octobre 2017 renforçant la sécurité intérieure et la lutte contre le terrorisme ;- point sur les nominations de membres de la commission des Lois dans les organismes extraparlementaires relevant du champ de compétences de la commission ;- nomination de rapporteurs sur :  - le projet de loi, adopté par le Sénat, ratifiant l'ordonnance n° 2016-131 du 10 février 2016 portant réforme du droit des contrats, du régime général et de la preuve des obligations (n° 315) ;  - la proposition de loi relative à la garde alternée des enfants (n° 307) ;  - la proposition de loi relative à l’exercice des compétences des collectivités territoriales dans le domaine de la gestion des milieux aquatiques et de la prévention des inondations (n° 310) ;- nomination des membres de la mission d’information, commune avec la commission du Développement durable, pour une nouvelle étape de la décentralisation en faveur des pôles de développement territoriaux."
    },
    "pointsODJ": null
  },
  "compteRenduRef": "CRCANR5L15S2018PO59051N012",
  "formatReunion": "Ordinaire",
  "infosReunionsInternationale": {
    "estReunionInternationale": "false",
    "listePays": null,
    "informationsComplementaires": null
  }
}