{
  "@xmlns": "http://schemas.assemblee-nationale.fr/referentiel",
  "@xmlns:xsi": "http://www.w3.org/2001/XMLSchema-instance",
  "@xsi:type": "reunionInitParlementaire_type",
  "uid": "RUANR5L15S2018IDF0108259",
  "timeStampDebut": "2018-07-05T09:00:00.000+02:00",
  "timeStampFin": "2018-07-05T14:00:00.000+02:00",
  "lieu": {
    "code": "SALREU003",
    "libelleCourt": "Salle Victor Hugo",
    "libelleLong": "Salle Victor Hugo, 101, rue de l'Université"
  },
  "cycleDeVie": {
    "etat": "Annulé",
    "chrono": {
      "creation": "2018-03-21T17:44:10.000+02:00",
      "cloture": "2018-04-16T11:41:37.000+02:00"
    }
  },
  "demandeurs": {
    "acteur": {
      "nom": "M. André CHASSAIGNE",
      "acteurRef": "PA267306"
    }
  },
  "organeReuniRef": null,
  "typeReunion": "DEP"
}