{
  "@xmlns": "http://schemas.assemblee-nationale.fr/referentiel",
  "@xmlns:xsi": "http://www.w3.org/2001/XMLSchema-instance",
  "@xsi:type": "reunionInitParlementaire_type",
  "uid": "RUANR5L15S2019IDF0124319",
  "timeStampDebut": "2019-02-19T18:00:00.000+01:00",
  "timeStampFin": "2019-02-19T20:00:00.000+01:00",
  "lieu": {
    "code": "SALREU019",
    "libelleCourt": "Salon Mars I",
    "libelleLong": "Salon Mars I, 101, rue de l'Université"
  },
  "cycleDeVie": {
    "etat": "Confirmé",
    "chrono": {
      "creation": "2018-12-21T12:52:43.000+01:00",
      "cloture": null
    }
  },
  "demandeurs": {
    "acteur": [
      {
        "nom": "Mme Valérie LACROUTE",
        "acteurRef": "PA609245"
      },
      {
        "nom": "M. Benoit SIMIAN",
        "acteurRef": "PA719592"
      }
    ]
  },
  "organeReuniRef": null,
  "typeReunion": "DEP"
}