{
  "@xmlns": "http://schemas.assemblee-nationale.fr/referentiel",
  "@xmlns:xsi": "http://www.w3.org/2001/XMLSchema-instance",
  "@xsi:type": "reunionCommission_type",
  "uid": "RUANR5L15S2018IDC429649",
  "timeStampDebut": "2018-06-06T17:15:00.000+02:00",
  "timeStampFin": "2018-06-06T18:00:00.000+02:00",
  "lieu": {
    "libelleLong": "salle 6242 (Lois)"
  },
  "cycleDeVie": {
    "etat": "Confirmé",
    "chrono": {
      "creation": "2018-05-30T00:00:00.000+02:00",
      "cloture": null
    }
  },
  "organeReuniRef": "PO754002",
  "demandeur": null,
  "participants": {
    "participantsInternes": {
      "participantInterne": [
        {
          "acteurRef": "PA719866",
          "presence": "absent"
        },
        {
          "acteurRef": "PA720430",
          "presence": "absent"
        },
        {
          "acteurRef": "PA689",
          "presence": "absent"
        },
        {
          "acteurRef": "PA721094",
          "presence": "absent"
        },
        {
          "acteurRef": "PA721742",
          "presence": "absent"
        },
        {
          "acteurRef": "PA720454",
          "presence": "absent"
        },
        {
          "acteurRef": "PA719994",
          "presence": "présent"
        },
        {
          "acteurRef": "PA718918",
          "presence": "absent"
        },
        {
          "acteurRef": "PA677483",
          "presence": "absent"
        },
        {
          "acteurRef": "PA720908",
          "presence": "absent"
        },
        {
          "acteurRef": "PA719202",
          "presence": "absent"
        },
        {
          "acteurRef": "PA719600",
          "presence": "absent"
        },
        {
          "acteurRef": "PA722398",
          "presence": "présent"
        },
        {
          "acteurRef": "PA721584",
          "presence": "présent"
        },
        {
          "acteurRef": "PA608695",
          "presence": "présent"
        }
      ]
    },
    "personnesAuditionnees": null
  },
  "sessionRef": null,
  "ouverturePresse": "false",
  "captationVideo": "false",
  "ODJ": {
    "convocationODJ": {
      "item": "Réunion constitutive."
    },
    "resumeODJ": {
      "item": "réunion constitutive."
    },
    "pointsODJ": null
  },
  "compteRenduRef": null,
  "formatReunion": "Ordinaire",
  "infosReunionsInternationale": {
    "estReunionInternationale": "false",
    "listePays": null,
    "informationsComplementaires": null
  }
}