{
  "@xmlns": "http://schemas.assemblee-nationale.fr/referentiel",
  "@xmlns:xsi": "http://www.w3.org/2001/XMLSchema-instance",
  "@xsi:type": "reunionCommission_type",
  "uid": "RUANR5L15S2018IDC429904",
  "timeStampDebut": "2018-06-28T09:15:00.000+02:00",
  "timeStampFin": "2018-06-28T09:20:00.000+02:00",
  "lieu": {
    "libelleLong": "salle 6241 (Affaires économiques)"
  },
  "cycleDeVie": {
    "etat": "Confirmé",
    "chrono": {
      "creation": "2018-06-21T00:00:00.000+02:00",
      "cloture": null
    }
  },
  "organeReuniRef": "PO419610",
  "demandeur": null,
  "participants": {
    "participantsInternes": {
      "participantInterne": [
        {
          "acteurRef": "PA722038",
          "presence": "absent"
        },
        {
          "acteurRef": "PA721278",
          "presence": "présent"
        },
        {
          "acteurRef": "PA342415",
          "presence": "présent"
        },
        {
          "acteurRef": "PA722170",
          "presence": "absent"
        },
        {
          "acteurRef": "PA332228",
          "presence": "absent"
        },
        {
          "acteurRef": "PA718876",
          "presence": "absent"
        },
        {
          "acteurRef": "PA722312",
          "presence": "absent"
        },
        {
          "acteurRef": "PA718990",
          "presence": "absent"
        },
        {
          "acteurRef": "PA608641",
          "presence": "absent"
        },
        {
          "acteurRef": "PA720162",
          "presence": "excusé"
        },
        {
          "acteurRef": "PA642695",
          "presence": "absent"
        },
        {
          "acteurRef": "PA336316",
          "presence": "absent"
        },
        {
          "acteurRef": "PA720546",
          "presence": "absent"
        },
        {
          "acteurRef": "PA720116",
          "presence": "absent"
        },
        {
          "acteurRef": "PA767",
          "presence": "absent"
        },
        {
          "acteurRef": "PA720814",
          "presence": "absent"
        },
        {
          "acteurRef": "PA719440",
          "presence": "absent"
        },
        {
          "acteurRef": "PA267429",
          "presence": "absent"
        },
        {
          "acteurRef": "PA721808",
          "presence": "absent"
        },
        {
          "acteurRef": "PA607155",
          "presence": "absent"
        },
        {
          "acteurRef": "PA267450",
          "presence": "absent"
        },
        {
          "acteurRef": "PA719258",
          "presence": "absent"
        },
        {
          "acteurRef": "PA719830",
          "presence": "absent"
        },
        {
          "acteurRef": "PA720598",
          "presence": "absent"
        },
        {
          "acteurRef": "PA720386",
          "presence": "absent"
        },
        {
          "acteurRef": "PA712015",
          "presence": "absent"
        },
        {
          "acteurRef": "PA721718",
          "presence": "absent"
        },
        {
          "acteurRef": "PA719660",
          "presence": "absent"
        },
        {
          "acteurRef": "PA720664",
          "presence": "absent"
        },
        {
          "acteurRef": "PA334149",
          "presence": "absent"
        },
        {
          "acteurRef": "PA719960",
          "presence": "absent"
        },
        {
          "acteurRef": "PA719652",
          "presence": "présent"
        },
        {
          "acteurRef": "PA722094",
          "presence": "absent"
        },
        {
          "acteurRef": "PA267355",
          "presence": "absent"
        },
        {
          "acteurRef": "PA719700",
          "presence": "excusé"
        },
        {
          "acteurRef": "PA719372",
          "presence": "absent"
        },
        {
          "acteurRef": "PA719504",
          "presence": "absent"
        },
        {
          "acteurRef": "PA331567",
          "presence": "excusé"
        },
        {
          "acteurRef": "PA719310",
          "presence": "présent"
        },
        {
          "acteurRef": "PA721852",
          "presence": "excusé"
        },
        {
          "acteurRef": "PA340853",
          "presence": "absent"
        },
        {
          "acteurRef": "PA719388",
          "presence": "absent"
        },
        {
          "acteurRef": "PA721134",
          "presence": "absent"
        },
        {
          "acteurRef": "PA337483",
          "presence": "absent"
        },
        {
          "acteurRef": "PA719858",
          "presence": "absent"
        },
        {
          "acteurRef": "PA720378",
          "presence": "absent"
        },
        {
          "acteurRef": "PA719154",
          "presence": "absent"
        },
        {
          "acteurRef": "PA720976",
          "presence": "absent"
        },
        {
          "acteurRef": "PA719338",
          "presence": "absent"
        },
        {
          "acteurRef": "PA719608",
          "presence": "excusé"
        },
        {
          "acteurRef": "PA719242",
          "presence": "absent"
        },
        {
          "acteurRef": "PA719520",
          "presence": "absent"
        },
        {
          "acteurRef": "PA720644",
          "presence": "absent"
        },
        {
          "acteurRef": "PA719364",
          "presence": "excusé"
        },
        {
          "acteurRef": "PA720108",
          "presence": "absent"
        },
        {
          "acteurRef": "PA718784",
          "presence": "absent"
        },
        {
          "acteurRef": "PA718930",
          "presence": "absent"
        },
        {
          "acteurRef": "PA721270",
          "presence": "absent"
        },
        {
          "acteurRef": "PA607553",
          "presence": "absent"
        },
        {
          "acteurRef": "PA720590",
          "presence": "absent"
        },
        {
          "acteurRef": "PA720092",
          "presence": "absent"
        },
        {
          "acteurRef": "PA266808",
          "presence": "absent"
        },
        {
          "acteurRef": "PA722142",
          "presence": "absent"
        },
        {
          "acteurRef": "PA720780",
          "presence": "présent"
        },
        {
          "acteurRef": "PA719420",
          "presence": "absent"
        },
        {
          "acteurRef": "PA334654",
          "presence": "absent"
        },
        {
          "acteurRef": "PA2792",
          "presence": "excusé"
        },
        {
          "acteurRef": "PA718860",
          "presence": "excusé"
        },
        {
          "acteurRef": "PA720014",
          "presence": "absent"
        },
        {
          "acteurRef": "PA722162",
          "presence": "absent"
        },
        {
          "acteurRef": "PA421348",
          "presence": "absent"
        }
      ]
    },
    "personnesAuditionnees": null
  },
  "sessionRef": null,
  "ouverturePresse": "false",
  "captationVideo": "false",
  "ODJ": {
    "convocationODJ": {
      "item": "Examen en application de l’article 88 du Règlement des amendements restant en discussion sur la proposition de résolution européenne relative à une agriculture durable pour l’Union européenne (n° 1094) (M. Jean-Bernard Sempastous, rapporteur)."
    },
    "resumeODJ": {
      "item": "proposition de résolution européenne relative à une agriculture durable pour l’Union européenne (n° 1094) (amendements, art. 88)."
    },
    "pointsODJ": {
      "pointODJ": {
        "@xsi:type": "podjReunion_type",
        "uid": "RUANR5L15S2018IDC429904PT25838",
        "cycleDeVie": {
          "etat": "Confirmé",
          "chrono": {
            "creation": "2018-06-21T00:00:00.000+02:00",
            "cloture": null
          }
        },
        "objet": "Examen du texte",
        "demandeurPoint": null,
        "procedure": null,
        "dossiersLegislatifsRefs": {
          "dossierRef": "DLR5L15N36671"
        },
        "typePointODJ": "Examen",
        "comiteSecret": "false",
        "textesAssocies": null
      }
    }
  },
  "compteRenduRef": "CRCANR5L15S2018PO419610N099",
  "formatReunion": "Ordinaire",
  "infosReunionsInternationale": {
    "estReunionInternationale": "false",
    "listePays": null,
    "informationsComplementaires": null
  }
}