{
  "@xmlns": "http://schemas.assemblee-nationale.fr/referentiel",
  "@xmlns:xsi": "http://www.w3.org/2001/XMLSchema-instance",
  "@xsi:type": "reunionCommission_type",
  "uid": "RUANR5L15S2019IDC430505",
  "timeStampDebut": "2018-10-02T17:00:00.000+02:00",
  "timeStampFin": "2018-10-02T18:00:00.000+02:00",
  "lieu": {
    "libelleLong": "salle 4204 (33 rue Saint-Dominique)"
  },
  "cycleDeVie": {
    "etat": "Confirmé",
    "chrono": {
      "creation": "2018-10-02T00:00:00.000+02:00",
      "cloture": null
    }
  },
  "organeReuniRef": "PO744312",
  "demandeur": null,
  "participants": {
    "participantsInternes": null,
    "personnesAuditionnees": null
  },
  "sessionRef": null,
  "ouverturePresse": "false",
  "captationVideo": "false",
  "ODJ": {
    "convocationODJ": {
      "item": "Audition de M. Bertrand Commelin, secrétaire général de la Fondation Alliance française et M. Pierre Buhler, président de l’Institut français."
    },
    "resumeODJ": {
      "item": "audition de M. Bertrand Commelin, secrétaire général de la Fondation Alliance française et M. Pierre Buhler, président de l’Institut français."
    },
    "pointsODJ": null
  },
  "compteRenduRef": null,
  "formatReunion": "Ordinaire",
  "infosReunionsInternationale": {
    "estReunionInternationale": "false",
    "listePays": null,
    "informationsComplementaires": null
  }
}