{
  "@xmlns": "http://schemas.assemblee-nationale.fr/referentiel",
  "@xmlns:xsi": "http://www.w3.org/2001/XMLSchema-instance",
  "@xsi:type": "seance_type",
  "uid": "RUANR5L15S2018IDS20971",
  "timeStampDebut": "2018-03-27T09:30:00.000+02:00",
  "timeStampFin": "2018-03-27T13:05:00.000+02:00",
  "lieu": {
    "code": "AN",
    "libelleLong": "Assemblée nationale"
  },
  "cycleDeVie": {
    "etat": "Confirmé",
    "chrono": {
      "creation": "2018-03-05T00:00:00.000+01:00",
      "cloture": null
    }
  },
  "organeReuniRef": "PO717460",
  "demandeur": null,
  "participants": null,
  "sessionRef": "SCR5A2018O1",
  "ouverturePresse": "true",
  "captationVideo": "true",
  "ODJ": {
    "convocationODJ": null,
    "resumeODJ": null,
    "pointsODJ": {
      "pointODJ": {
        "@xsi:type": "podjSeanceConfPres_type",
        "uid": "RUANR5L15S2018IDS20971PT35708",
        "cycleDeVie": {
          "etat": "Confirmé",
          "chrono": {
            "creation": "2018-03-05T00:00:00.000+01:00",
            "cloture": null
          }
        },
        "objet": "Questions orales sans débat",
        "demandeurPoint": null,
        "procedure": null,
        "dossiersLegislatifsRefs": null,
        "typePointODJ": "Questions orales sans débat",
        "comiteSecret": "false",
        "textesAssocies": null,
        "natureTravauxODJ": "ODJPR",
        "dateConfPres": "2018-03-27+02:00"
      }
    }
  },
  "compteRenduRef": "CRSANR5L15S2018O1N167",
  "identifiants": {
    "numSeanceJO": "167",
    "idJO": "20180167",
    "quantieme": "Première",
    "DateSeance": "2018-03-27+02:00"
  }
}