{
  "@xmlns": "http://schemas.assemblee-nationale.fr/referentiel",
  "@xmlns:xsi": "http://www.w3.org/2001/XMLSchema-instance",
  "@xsi:type": "reunionInitParlementaire_type",
  "uid": "RUANR5L15S2018IDF0096065",
  "timeStampDebut": "2017-10-13T14:00:00.000+02:00",
  "timeStampFin": "2017-10-13T18:00:00.000+02:00",
  "lieu": {
    "code": "SALREU017",
    "libelleCourt": "Salon Visconti",
    "libelleLong": "Salon Visconti, 101, rue de l'Université"
  },
  "cycleDeVie": {
    "etat": "Annulé",
    "chrono": {
      "creation": "2017-09-11T17:54:03.000+02:00",
      "cloture": "2017-10-06T12:41:42.000+02:00"
    }
  },
  "demandeurs": {
    "acteur": {
      "nom": "Mme Émilie CHALAS",
      "acteurRef": "PA719748"
    }
  },
  "organeReuniRef": null,
  "typeReunion": "DEP"
}