{
  "@xmlns": "http://schemas.assemblee-nationale.fr/referentiel",
  "@xmlns:xsi": "http://www.w3.org/2001/XMLSchema-instance",
  "@xsi:type": "reunionInitParlementaire_type",
  "uid": "RUANR5L15S2019IDF0133482",
  "timeStampDebut": "2019-05-14T14:30:00.000+02:00",
  "timeStampFin": "2019-05-14T15:00:00.000+02:00",
  "lieu": {
    "code": "SALREU027",
    "libelleCourt": "Salle 6217",
    "libelleLong": "Salle 6217, Palais Bourbon"
  },
  "cycleDeVie": {
    "etat": "Annulé",
    "chrono": {
      "creation": "2019-05-09T16:46:51.000+02:00",
      "cloture": "2019-05-13T11:57:04.000+02:00"
    }
  },
  "demandeurs": {
    "acteur": {
      "nom": "M. Bernard PERRUT",
      "acteurRef": "PA2377"
    }
  },
  "organeReuniRef": null,
  "typeReunion": "DEP"
}