{
  "@xmlns": "http://schemas.assemblee-nationale.fr/referentiel",
  "@xmlns:xsi": "http://www.w3.org/2001/XMLSchema-instance",
  "@xsi:type": "reunionInitParlementaire_type",
  "uid": "RUANR5L15S2019IDF0129897",
  "timeStampDebut": "2019-03-19T13:00:00.000+01:00",
  "timeStampFin": "2019-03-19T14:00:00.000+01:00",
  "lieu": {
    "code": "SALREU007",
    "libelleCourt": "4ème Bureau",
    "libelleLong": "4ème Bureau, Palais Bourbon"
  },
  "cycleDeVie": {
    "etat": "Annulé",
    "chrono": {
      "creation": "2019-03-14T10:48:05.000+01:00",
      "cloture": "2019-03-18T09:44:17.000+01:00"
    }
  },
  "demandeurs": {
    "acteur": {
      "nom": "M. Christophe AREND",
      "acteurRef": "PA720310"
    }
  },
  "organeReuniRef": null,
  "typeReunion": "DEP"
}