{
  "@xmlns": "http://schemas.assemblee-nationale.fr/referentiel",
  "@xmlns:xsi": "http://www.w3.org/2001/XMLSchema-instance",
  "@xsi:type": "reunionInitParlementaire_type",
  "uid": "RUANR5L15S2019IDF0128408",
  "timeStampDebut": "2019-03-19T14:00:00.000+01:00",
  "timeStampFin": "2019-03-19T15:00:00.000+01:00",
  "lieu": {
    "code": "SALREU017",
    "libelleCourt": "Salon Visconti",
    "libelleLong": "Salon Visconti, 101, rue de l'Université"
  },
  "cycleDeVie": {
    "etat": "Confirmé",
    "chrono": {
      "creation": "2019-02-21T15:20:24.000+01:00",
      "cloture": null
    }
  },
  "demandeurs": {
    "acteur": {
      "nom": "Mme Carole GRANDJEAN",
      "acteurRef": "PA720170"
    }
  },
  "organeReuniRef": null,
  "typeReunion": "DEP"
}