{
  "@xmlns": "http://schemas.assemblee-nationale.fr/referentiel",
  "@xmlns:xsi": "http://www.w3.org/2001/XMLSchema-instance",
  "@xsi:type": "reunionInitParlementaire_type",
  "uid": "RUANR5L15S2019IDF0138578",
  "timeStampDebut": "2019-08-28T11:45:00.000+02:00",
  "timeStampFin": "2019-08-28T12:45:00.000+02:00",
  "lieu": {
    "code": "SALREU042",
    "libelleCourt": "Salle 6566",
    "libelleLong": "Salle 6566, Palais Bourbon"
  },
  "cycleDeVie": {
    "etat": "Confirmé",
    "chrono": {
      "creation": "2019-08-27T14:46:17.000+02:00",
      "cloture": null
    }
  },
  "demandeurs": {
    "acteur": {
      "nom": "Mme Coralie DUBOST",
      "acteurRef": "PA719684"
    }
  },
  "organeReuniRef": null,
  "typeReunion": "DEP"
}