{
  "@xmlns": "http://schemas.assemblee-nationale.fr/referentiel",
  "@xmlns:xsi": "http://www.w3.org/2001/XMLSchema-instance",
  "@xsi:type": "reunionInitParlementaire_type",
  "uid": "RUANR5L15S2018IDF0114072",
  "timeStampDebut": "2018-07-05T09:30:00.000+02:00",
  "timeStampFin": "2018-07-05T13:00:00.000+02:00",
  "lieu": {
    "code": "SALREU010",
    "libelleCourt": "Salle N° 1",
    "libelleLong": "Salle N° 1, 3, rue Aristide Briand"
  },
  "cycleDeVie": {
    "etat": "Confirmé",
    "chrono": {
      "creation": "2018-06-21T09:37:15.000+02:00",
      "cloture": null
    }
  },
  "demandeurs": {
    "acteur": {
      "nom": "Mme Brigitte BOURGUIGNON",
      "acteurRef": "PA608083"
    }
  },
  "organeReuniRef": null,
  "typeReunion": "DEP"
}