{
  "@xmlns": "http://schemas.assemblee-nationale.fr/referentiel",
  "@xmlns:xsi": "http://www.w3.org/2001/XMLSchema-instance",
  "@xsi:type": "reunionInitParlementaire_type",
  "uid": "RUANR5L15S2019IDF0130258",
  "timeStampDebut": "2019-05-07T08:00:00.000+02:00",
  "timeStampFin": "2019-05-07T10:30:00.000+02:00",
  "lieu": {
    "code": "SALREU039",
    "libelleCourt": "Salle 6550",
    "libelleLong": "Salle 6550, Palais Bourbon"
  },
  "cycleDeVie": {
    "etat": "Confirmé",
    "chrono": {
      "creation": "2019-03-19T14:14:17.000+02:00",
      "cloture": null
    }
  },
  "demandeurs": {
    "acteur": {
      "nom": "M. Jean-Noël BARROT",
      "acteurRef": "PA721836"
    }
  },
  "organeReuniRef": null,
  "typeReunion": "DEP"
}