{
  "@xmlns": "http://schemas.assemblee-nationale.fr/referentiel",
  "@xmlns:xsi": "http://www.w3.org/2001/XMLSchema-instance",
  "@xsi:type": "reunionInitParlementaire_type",
  "uid": "RUANR5L15S2019IDF0125379",
  "timeStampDebut": "2019-02-18T14:00:00.000+01:00",
  "timeStampFin": "2019-02-18T19:00:00.000+01:00",
  "lieu": {
    "code": "SALREU038",
    "libelleCourt": "Salle 6549",
    "libelleLong": "Salle 6549, Palais Bourbon"
  },
  "cycleDeVie": {
    "etat": "Confirmé",
    "chrono": {
      "creation": "2019-01-17T12:44:55.000+01:00",
      "cloture": null
    }
  },
  "demandeurs": {
    "acteur": [
      {
        "nom": "Mme Danièle HÉRIN",
        "acteurRef": "PA718794"
      },
      {
        "nom": "Mme Josette MANIN",
        "acteurRef": "PA720988"
      }
    ]
  },
  "organeReuniRef": null,
  "typeReunion": "DEP"
}