{
  "@xmlns": "http://schemas.assemblee-nationale.fr/referentiel",
  "@xmlns:xsi": "http://www.w3.org/2001/XMLSchema-instance",
  "@xsi:type": "reunionInitParlementaire_type",
  "uid": "RUANR5L15S2018IDF0101008",
  "timeStampDebut": "2017-11-21T11:00:00.000+01:00",
  "timeStampFin": "2017-11-21T12:00:00.000+01:00",
  "lieu": {
    "code": "SALREU017",
    "libelleCourt": "Salon Visconti",
    "libelleLong": "Salon Visconti, 101, rue de l'Université"
  },
  "cycleDeVie": {
    "etat": "Confirmé",
    "chrono": {
      "creation": "2017-11-20T12:26:12.000+01:00",
      "cloture": null
    }
  },
  "demandeurs": {
    "organe": {
      "nom": "GROUPE DU MOUVEMENT DÉMOCRATE ET APPARENTÉS",
      "organeRef": "PO730970"
    }
  },
  "organeReuniRef": "PO730970",
  "typeReunion": "GP"
}