{
  "@xmlns": "http://schemas.assemblee-nationale.fr/referentiel",
  "@xmlns:xsi": "http://www.w3.org/2001/XMLSchema-instance",
  "@xsi:type": "reunionInitParlementaire_type",
  "uid": "RUANR5L15S2017IDF0095988",
  "timeStampDebut": "2017-09-12T10:30:00.000+02:00",
  "timeStampFin": "2017-09-12T12:00:00.000+02:00",
  "lieu": {
    "code": "SALREU022",
    "libelleCourt": "Salle 7326",
    "libelleLong": "Salle 7326, 101, rue de l'Université"
  },
  "cycleDeVie": {
    "etat": "Confirmé",
    "chrono": {
      "creation": "2017-09-11T11:34:20.000+02:00",
      "cloture": null
    }
  },
  "demandeurs": {
    "acteur": {
      "nom": "Mme Isabelle VALENTIN",
      "acteurRef": "PA643134"
    }
  },
  "organeReuniRef": null,
  "typeReunion": "DEP"
}