{
  "@xmlns": "http://schemas.assemblee-nationale.fr/referentiel",
  "@xmlns:xsi": "http://www.w3.org/2001/XMLSchema-instance",
  "@xsi:type": "reunionCommission_type",
  "uid": "RUANR5L15S2018IDC430222",
  "timeStampDebut": "2018-09-13T10:15:00.000+02:00",
  "timeStampFin": "2018-09-13T11:35:00.000+02:00",
  "lieu": {
    "libelleLong": "salle 6238 (Affaires culturelles)"
  },
  "cycleDeVie": {
    "etat": "Confirmé",
    "chrono": {
      "creation": "2018-08-31T00:00:00.000+02:00",
      "cloture": null
    }
  },
  "organeReuniRef": "PO757118",
  "demandeur": null,
  "participants": {
    "participantsInternes": {
      "participantInterne": [
        {
          "acteurRef": "PA719318",
          "presence": "présent"
        },
        {
          "acteurRef": "PA642764",
          "presence": "présent"
        },
        {
          "acteurRef": "PA642847",
          "presence": "présent"
        },
        {
          "acteurRef": "PA719488",
          "presence": "absent"
        },
        {
          "acteurRef": "PA508",
          "presence": "excusé"
        },
        {
          "acteurRef": "PA721608",
          "presence": "absent"
        },
        {
          "acteurRef": "PA330008",
          "presence": "excusé"
        },
        {
          "acteurRef": "PA721336",
          "presence": "présent"
        },
        {
          "acteurRef": "PA689",
          "presence": "présent"
        },
        {
          "acteurRef": "PA721166",
          "presence": "présent"
        },
        {
          "acteurRef": "PA719790",
          "presence": "absent"
        },
        {
          "acteurRef": "PA722126",
          "presence": "présent"
        },
        {
          "acteurRef": "PA942",
          "presence": "absent"
        },
        {
          "acteurRef": "PA720154",
          "presence": "absent"
        },
        {
          "acteurRef": "PA720996",
          "presence": "absent"
        },
        {
          "acteurRef": "PA719692",
          "presence": "absent"
        },
        {
          "acteurRef": "PA721564",
          "presence": "présent"
        },
        {
          "acteurRef": "PA267780",
          "presence": "absent"
        },
        {
          "acteurRef": "PA718706",
          "presence": "absent"
        },
        {
          "acteurRef": "PA721384",
          "presence": "absent"
        },
        {
          "acteurRef": "PA721992",
          "presence": "absent"
        },
        {
          "acteurRef": "PA267318",
          "presence": "présent"
        },
        {
          "acteurRef": "PA608416",
          "presence": "absent"
        },
        {
          "acteurRef": "PA720074",
          "presence": "présent"
        },
        {
          "acteurRef": "PA720446",
          "presence": "absent"
        },
        {
          "acteurRef": "PA720870",
          "presence": "absent"
        },
        {
          "acteurRef": "PA719072",
          "presence": "absent"
        },
        {
          "acteurRef": "PA721960",
          "presence": "absent"
        },
        {
          "acteurRef": "PA267260",
          "presence": "présent"
        },
        {
          "acteurRef": "PA721286",
          "presence": "absent"
        },
        {
          "acteurRef": "PA718810",
          "presence": "présent"
        },
        {
          "acteurRef": "PA722022",
          "presence": "présent"
        },
        {
          "acteurRef": "PA719350",
          "presence": "absent"
        },
        {
          "acteurRef": "PA720568",
          "presence": "absent"
        },
        {
          "acteurRef": "PA334768",
          "presence": "présent"
        },
        {
          "acteurRef": "PA718728",
          "presence": "présent"
        },
        {
          "acteurRef": "PA722102",
          "presence": "présent"
        }
      ]
    },
    "personnesAuditionnees": null
  },
  "sessionRef": null,
  "ouverturePresse": "true",
  "captationVideo": "false",
  "ODJ": {
    "convocationODJ": {
      "item": "– Audition de Mme Françoise Dumont, présidente d’honneur de la Ligue des Droits de l’Homme, M. Philippe Laville, membre du Comité central et co-responsable du groupe de travail « Santé-bioéthique », et Mme Tatiana Gründler, membre du groupe de travail « Santé-bioéthique »"
    },
    "resumeODJ": {
      "item": "audition de Mme Françoise Dumont, présidente d’honneur de la Ligue des Droits de l’Homme, M. Philippe Laville, membre du Comité central et co-responsable du groupe de travail « Santé-bioéthique », et Mme Tatiana Gründler, membre du groupe de travail « Santé-bioéthique »."
    },
    "pointsODJ": null
  },
  "compteRenduRef": "CRCANR5L15S2018PO757118N009",
  "formatReunion": "Ordinaire",
  "infosReunionsInternationale": {
    "estReunionInternationale": "false",
    "listePays": null,
    "informationsComplementaires": null
  }
}