{
  "@xmlns": "http://schemas.assemblee-nationale.fr/referentiel",
  "@xmlns:xsi": "http://www.w3.org/2001/XMLSchema-instance",
  "@xsi:type": "reunionInitParlementaire_type",
  "uid": "RUANR5L15S2018IDF0118006",
  "timeStampDebut": "2018-09-14T08:00:00.000+02:00",
  "timeStampFin": "2018-09-14T24:00:00.000+02:00",
  "lieu": {
    "code": "SALREU046",
    "libelleCourt": "Sully 1",
    "libelleLong": "Sully 1, Palais Bourbon"
  },
  "cycleDeVie": {
    "etat": "Confirmé",
    "chrono": {
      "creation": "2018-09-10T12:51:45.000+02:00",
      "cloture": null
    }
  },
  "demandeurs": {
    "organe": {
      "nom": "GROUPE LA FRANCE INSOUMISE",
      "organeRef": "PO730958"
    }
  },
  "organeReuniRef": "PO730958",
  "typeReunion": "GP"
}