{
  "@xmlns": "http://schemas.assemblee-nationale.fr/referentiel",
  "@xmlns:xsi": "http://www.w3.org/2001/XMLSchema-instance",
  "@xsi:type": "reunionInitParlementaire_type",
  "uid": "RUANR5L15S2018IDF0116073",
  "timeStampDebut": "2018-07-25T14:00:00.000+02:00",
  "timeStampFin": "2018-07-25T15:30:00.000+02:00",
  "lieu": {
    "code": "SALREU012",
    "libelleCourt": "Salle N° 23",
    "libelleLong": "Salle N° 23, 3, rue Aristide Briand"
  },
  "cycleDeVie": {
    "etat": "Confirmé",
    "chrono": {
      "creation": "2018-07-23T11:55:16.000+02:00",
      "cloture": null
    }
  },
  "demandeurs": {
    "acteur": {
      "nom": "M. Denis SOMMER",
      "acteurRef": "PA719420"
    }
  },
  "organeReuniRef": null,
  "typeReunion": "DEP"
}