{
  "@xmlns": "http://schemas.assemblee-nationale.fr/referentiel",
  "@xmlns:xsi": "http://www.w3.org/2001/XMLSchema-instance",
  "@xsi:type": "reunionInitParlementaire_type",
  "uid": "RUANR5L15S2017IDF0093573",
  "timeStampDebut": "2017-07-12T16:00:00.000+02:00",
  "timeStampFin": "2017-07-12T17:00:00.000+02:00",
  "lieu": {
    "code": "SALREU007",
    "libelleCourt": "4ème Bureau",
    "libelleLong": "4ème Bureau, Palais Bourbon"
  },
  "cycleDeVie": {
    "etat": "Annulé",
    "chrono": {
      "creation": "2017-07-06T14:33:25.000+02:00",
      "cloture": "2017-07-12T12:14:34.000+02:00"
    }
  },
  "demandeurs": {
    "acteur": {
      "nom": "M. Olivier DUSSOPT",
      "acteurRef": "PA330357"
    }
  },
  "organeReuniRef": null,
  "typeReunion": "DEP"
}