{
  "@xmlns": "http://schemas.assemblee-nationale.fr/referentiel",
  "@xmlns:xsi": "http://www.w3.org/2001/XMLSchema-instance",
  "@xsi:type": "reunionInitParlementaire_type",
  "uid": "RUANR5L15S2018IDF0099100",
  "timeStampDebut": "2017-11-28T16:00:00.000+01:00",
  "timeStampFin": "2017-11-28T18:00:00.000+01:00",
  "lieu": {
    "code": "SALREU006",
    "libelleCourt": "3ème Bureau",
    "libelleLong": "3ème Bureau, Palais Bourbon"
  },
  "cycleDeVie": {
    "etat": "Confirmé",
    "chrono": {
      "creation": "2017-10-20T17:29:39.000+01:00",
      "cloture": null
    }
  },
  "demandeurs": {
    "acteur": [
      {
        "nom": "Mme Aurore BERGÉ",
        "acteurRef": "PA722046"
      },
      {
        "nom": "Mme Béatrice DESCAMPS",
        "acteurRef": "PA720696"
      }
    ]
  },
  "organeReuniRef": null,
  "typeReunion": "DEP"
}