{
  "@xmlns": "http://schemas.assemblee-nationale.fr/referentiel",
  "@xmlns:xsi": "http://www.w3.org/2001/XMLSchema-instance",
  "@xsi:type": "reunionInitParlementaire_type",
  "uid": "RUANR5L15S2019IDFL431865",
  "timeStampDebut": "2019-04-09T13:30:00.000+02:00",
  "lieu": {
    "libelleLong": "salle 6550 (2e étage)"
  },
  "cycleDeVie": {
    "etat": "Confirmé",
    "chrono": {
      "creation": "2019-03-08T00:00:00.000+01:00",
      "cloture": null
    }
  },
  "organeReuniRef": "PO746748",
  "typeReunion": "GE",
  "demandeur": null,
  "participants": null,
  "ODJ": {
    "convocationODJ": {
      "item": "Débat sur le thème : « Accueil et hébergement des migrants : centres ouverts ou fermés ? »"
    },
    "resumeODJ": null
  }
}