{
  "@xmlns": "http://schemas.assemblee-nationale.fr/referentiel",
  "@xmlns:xsi": "http://www.w3.org/2001/XMLSchema-instance",
  "@xsi:type": "reunionInitParlementaire_type",
  "uid": "RUANR5L15S2018IDF0103169",
  "timeStampDebut": "2018-01-24T16:30:00.000+01:00",
  "timeStampFin": "2018-01-24T18:00:00.000+01:00",
  "lieu": {
    "code": "SALREU023",
    "libelleCourt": "Salle 7426",
    "libelleLong": "Salle 7426, 101, rue de l'Université"
  },
  "cycleDeVie": {
    "etat": "Confirmé",
    "chrono": {
      "creation": "2018-01-04T15:31:37.000+01:00",
      "cloture": null
    }
  },
  "demandeurs": {
    "acteur": {
      "nom": "Mme Cathy RACON-BOUZON",
      "acteurRef": "PA718944"
    }
  },
  "organeReuniRef": null,
  "typeReunion": "DEP"
}