{
  "@xmlns": "http://schemas.assemblee-nationale.fr/referentiel",
  "@xmlns:xsi": "http://www.w3.org/2001/XMLSchema-instance",
  "@xsi:type": "reunionInitParlementaire_type",
  "uid": "RUANR5L15S2019IDF0122762",
  "timeStampDebut": "2018-11-28T14:00:00.000+01:00",
  "timeStampFin": "2018-11-28T15:00:00.000+01:00",
  "lieu": {
    "code": "SALREU010",
    "libelleCourt": "Salle N° 1",
    "libelleLong": "Salle N° 1, 3, rue Aristide Briand"
  },
  "cycleDeVie": {
    "etat": "Annulé",
    "chrono": {
      "creation": "2018-11-21T14:36:04.000+01:00",
      "cloture": "2018-11-21T16:56:25.000+01:00"
    }
  },
  "demandeurs": {
    "acteur": {
      "nom": "M. Pacôme RUPIN",
      "acteurRef": "PA721616"
    }
  },
  "organeReuniRef": null,
  "typeReunion": "DEP"
}