{
  "@xmlns": "http://schemas.assemblee-nationale.fr/referentiel",
  "@xmlns:xsi": "http://www.w3.org/2001/XMLSchema-instance",
  "@xsi:type": "reunionInitParlementaire_type",
  "uid": "RUANR5L15S2018IDF0110151",
  "timeStampDebut": "2018-05-30T17:00:00.000+02:00",
  "timeStampFin": "2018-05-30T18:00:00.000+02:00",
  "lieu": {
    "code": "SALREU021",
    "libelleCourt": "Salle 7207",
    "libelleLong": "Salle 7207, 101, rue de l'Université"
  },
  "cycleDeVie": {
    "etat": "Annulé",
    "chrono": {
      "creation": "2018-04-17T12:04:52.000+02:00",
      "cloture": "2018-05-15T17:12:42.000+02:00"
    }
  },
  "demandeurs": {
    "acteur": {
      "nom": "M. Hervé PELLOIS",
      "acteurRef": "PA607595"
    }
  },
  "organeReuniRef": null,
  "typeReunion": "DEP"
}