{
  "@xmlns": "http://schemas.assemblee-nationale.fr/referentiel",
  "@xmlns:xsi": "http://www.w3.org/2001/XMLSchema-instance",
  "@xsi:type": "reunionInitParlementaire_type",
  "uid": "RUANR5L15S2019IDF0123554",
  "timeStampDebut": "2018-12-21T09:30:00.000+01:00",
  "timeStampFin": "2018-12-21T17:00:00.000+01:00",
  "lieu": {
    "code": "SALREU007",
    "libelleCourt": "4ème Bureau",
    "libelleLong": "4ème Bureau, Palais Bourbon"
  },
  "cycleDeVie": {
    "etat": "Annulé",
    "chrono": {
      "creation": "2018-12-07T15:01:52.000+01:00",
      "cloture": "2018-12-17T13:25:57.000+01:00"
    }
  },
  "demandeurs": {
    "acteur": {
      "nom": "Mme Paula FORTEZA",
      "acteurRef": "PA721142"
    }
  },
  "organeReuniRef": null,
  "typeReunion": "DEP"
}