{
  "@xmlns": "http://schemas.assemblee-nationale.fr/referentiel",
  "@xmlns:xsi": "http://www.w3.org/2001/XMLSchema-instance",
  "@xsi:type": "seance_type",
  "uid": "RUSNR5L15S2018IDS21147",
  "timeStampDebut": "2018-06-21T10:30:00.000+02:00",
  "lieu": {
    "code": "S",
    "libelleLong": "Sénat"
  },
  "cycleDeVie": {
    "etat": "Confirmé",
    "chrono": {
      "creation": "2018-06-08T00:00:00.000+02:00",
      "cloture": null
    }
  },
  "organeReuniRef": "PO78718",
  "demandeur": null,
  "participants": null,
  "sessionRef": "SCR5A2018O1",
  "ouverturePresse": "true",
  "captationVideo": "true",
  "ODJ": {
    "convocationODJ": null,
    "resumeODJ": null,
    "pointsODJ": {
      "pointODJ": [
        {
          "@xsi:type": "podjSeanceConfPres_type",
          "uid": "RUSNR5L15S2018IDS21147PT36068",
          "cycleDeVie": {
            "etat": "Confirmé",
            "chrono": {
              "creation": "2018-06-08T00:00:00.000+02:00",
              "cloture": null
            }
          },
          "objet": "Discussion des conclusions de la commission mixte paritaire sur la proposition de loi relative à la protection du secret des affaires (procédure accélérée) (texte de la commission, n° 506, 2017-2018)",
          "demandeurPoint": null,
          "procedure": null,
          "dossiersLegislatifsRefs": {
            "dossierRef": "DLR5L15N36388"
          },
          "typePointODJ": "Discussion",
          "comiteSecret": "false",
          "textesAssocies": null,
          "natureTravauxODJ": "ODJPR",
          "dateConfPres": "2018-05-16+02:00",
          "dateLettreMinistre": "2018-05-24+02:00"
        },
        {
          "@xsi:type": "podjSeanceConfPres_type",
          "uid": "RUSNR5L15S2018IDS21147PT36067",
          "cycleDeVie": {
            "etat": "Confirmé",
            "chrono": {
              "creation": "2018-06-08T00:00:00.000+02:00",
              "cloture": null
            }
          },
          "objet": "Suite de la discussion du projet de loi, adopté par l'Assemblée nationale après engagement de la procédure accélérée, pour une immigration maîtrisée, un droit d'asile effectif et une intégration réussie (texte de la commission, n° 553, 2017&#8209;2018)",
          "demandeurPoint": null,
          "procedure": null,
          "dossiersLegislatifsRefs": {
            "dossierRef": "DLR5L15N36410"
          },
          "typePointODJ": "Suite de la discussion",
          "comiteSecret": "false",
          "textesAssocies": null,
          "natureTravauxODJ": "ODJPR",
          "dateConfPres": "2018-05-16+02:00",
          "dateLettreMinistre": "2018-05-24+02:00"
        }
      ]
    }
  },
  "compteRenduRef": "CRSSNR5S2018IDS20180621",
  "identifiants": {
    "numSeanceJO": "99",
    "idJO": "20180099",
    "quantieme": "Unique",
    "DateSeance": "2018-06-21+02:00"
  }
}