{
  "@xmlns": "http://schemas.assemblee-nationale.fr/referentiel",
  "@xmlns:xsi": "http://www.w3.org/2001/XMLSchema-instance",
  "@xsi:type": "reunionCommission_type",
  "uid": "RUANR5L15S2019IDC431361",
  "timeStampDebut": "2019-01-29T14:00:00.000+01:00",
  "lieu": {
    "libelleLong": "salle 6550 (2e étage)"
  },
  "cycleDeVie": {
    "etat": "Confirmé",
    "chrono": {
      "creation": "2019-01-25T00:00:00.000+01:00",
      "cloture": null
    }
  },
  "organeReuniRef": "PO754002",
  "demandeur": null,
  "participants": {
    "participantsInternes": null,
    "personnesAuditionnees": null
  },
  "sessionRef": null,
  "ouverturePresse": "false",
  "captationVideo": "false",
  "ODJ": {
    "convocationODJ": {
      "item": "Audition de Mme Dominique Attias, avocate, M. Olivier Peyroux, sociologue, et M. Jean-Pierre Rosenczveig, magistrat, chercheur et auteur sur la justice des mineurs."
    },
    "resumeODJ": {
      "item": "audition de Mme Dominique Attias, avocate, M. Olivier Peyroux, sociologue, et M. Jean-Pierre Rosenczveig, magistrat, chercheur et auteur sur la justice des mineurs."
    },
    "pointsODJ": null
  },
  "compteRenduRef": null,
  "formatReunion": "Ordinaire",
  "infosReunionsInternationale": {
    "estReunionInternationale": "false",
    "listePays": null,
    "informationsComplementaires": null
  }
}