{
  "@xmlns": "http://schemas.assemblee-nationale.fr/referentiel",
  "@xmlns:xsi": "http://www.w3.org/2001/XMLSchema-instance",
  "@xsi:type": "reunionCommission_type",
  "uid": "RUANR5L15S2019IDC433105",
  "timeStampDebut": "2019-06-20T10:30:00.000+02:00",
  "lieu": {
    "libelleLong": "Sénat, salle n° 213, 2e étage aile est (salle de la commission des affaires sociales)"
  },
  "cycleDeVie": {
    "etat": "Supprimé",
    "chrono": {
      "creation": "2019-06-13T00:00:00.000+02:00",
      "cloture": "2019-06-13T00:00:00.000+02:00"
    }
  },
  "organeReuniRef": "PO765701",
  "demandeur": null,
  "participants": {
    "participantsInternes": null,
    "personnesAuditionnees": null
  },
  "sessionRef": null,
  "ouverturePresse": "false",
  "captationVideo": "false",
  "ODJ": {
    "convocationODJ": {
      "item": [
        "nomination du bureau ;",
        "nomination des rapporteurs ;",
        "examen des dispositions restant en discussion du projet de loi"
      ]
    },
    "resumeODJ": {
      "item": [
        "nomination du bureau ;",
        "nomination des rapporteurs ;",
        "examen des dispositions restant en discussion du projet de loi"
      ]
    },
    "pointsODJ": null
  },
  "compteRenduRef": null,
  "formatReunion": "Ordinaire",
  "infosReunionsInternationale": {
    "estReunionInternationale": "false",
    "listePays": null,
    "informationsComplementaires": null
  }
}