{
  "@xmlns": "http://schemas.assemblee-nationale.fr/referentiel",
  "@xmlns:xsi": "http://www.w3.org/2001/XMLSchema-instance",
  "@xsi:type": "seance_type",
  "uid": "RUANR5L15S2019IDS21261",
  "timeStampDebut": "2018-10-04T09:30:00.000+02:00",
  "timeStampFin": "2018-10-04T13:05:00.000+02:00",
  "lieu": {
    "code": "AN",
    "libelleLong": "Assemblée nationale"
  },
  "cycleDeVie": {
    "etat": "Confirmé",
    "chrono": {
      "creation": "2018-09-17T00:00:00.000+02:00",
      "cloture": null
    }
  },
  "organeReuniRef": "PO717460",
  "demandeur": null,
  "participants": null,
  "sessionRef": "SCR5A2019O1",
  "ouverturePresse": "true",
  "captationVideo": "true",
  "ODJ": {
    "convocationODJ": null,
    "resumeODJ": null,
    "pointsODJ": {
      "pointODJ": {
        "@xsi:type": "podjSeanceConfPres_type",
        "uid": "RUANR5L15S2019IDS21261PT36325",
        "cycleDeVie": {
          "etat": "Confirmé",
          "chrono": {
            "creation": "2018-09-17T00:00:00.000+02:00",
            "cloture": null
          }
        },
        "objet": "Suite de la discussion du projet de loi relatif à la croissance et la transformation des entreprises",
        "demandeurPoint": null,
        "procedure": null,
        "dossiersLegislatifsRefs": {
          "dossierRef": "DLR5L15N36728"
        },
        "typePointODJ": "Suite de la discussion",
        "comiteSecret": "false",
        "textesAssocies": null,
        "natureTravauxODJ": "ODJPR"
      }
    }
  },
  "compteRenduRef": "CRSANR5L15S2019O1N006",
  "identifiants": {
    "numSeanceJO": "6",
    "idJO": "20190006",
    "quantieme": "Première",
    "DateSeance": "2018-10-04+02:00"
  }
}