{
  "@xmlns": "http://schemas.assemblee-nationale.fr/referentiel",
  "@xmlns:xsi": "http://www.w3.org/2001/XMLSchema-instance",
  "@xsi:type": "seance_type",
  "uid": "RUANR5L15S2019IDS21581",
  "timeStampDebut": "2019-03-28T21:30:00.000+01:00",
  "lieu": {
    "code": "AN",
    "libelleLong": "Assemblée nationale"
  },
  "cycleDeVie": {
    "etat": "Supprimé",
    "chrono": {
      "creation": "2019-03-01T00:00:00.000+01:00",
      "cloture": "2019-03-29T00:00:00.000+01:00"
    }
  },
  "organeReuniRef": "PO717460",
  "demandeur": null,
  "participants": null,
  "sessionRef": "SCR5A2019O1",
  "ouverturePresse": "true",
  "captationVideo": "true",
  "ODJ": {
    "convocationODJ": null,
    "resumeODJ": null,
    "pointsODJ": {
      "pointODJ": [
        {
          "@xsi:type": "podjSeanceConfPres_type",
          "uid": "RUANR5L15S2019IDS21581PT37087",
          "cycleDeVie": {
            "etat": "Supprimé",
            "chrono": {
              "creation": "2019-03-04T00:00:00.000+01:00",
              "cloture": "2019-03-04T00:00:00.000+01:00"
            }
          },
          "objet": "Suite de la discussion de la proposition de loi de simplification, de clarification et d'actualisation du droit des sociétés",
          "demandeurPoint": null,
          "procedure": null,
          "dossiersLegislatifsRefs": null,
          "typePointODJ": "Suite de la discussion",
          "comiteSecret": "false",
          "textesAssocies": null,
          "natureTravauxODJ": "ODJPR"
        },
        {
          "@xsi:type": "podjSeanceConfPres_type",
          "uid": "RUANR5L15S2019IDS21581PT37100",
          "cycleDeVie": {
            "etat": "Supprimé",
            "chrono": {
              "creation": "2019-03-04T00:00:00.000+01:00",
              "cloture": "2019-03-04T00:00:00.000+01:00"
            }
          },
          "objet": "Suite de la discussion de la proposition de résolution tendant à la création d’une commission d’enquête sur la situation et les pratiques de la grande distribution et de leurs groupements dans leurs relations commerciales avec les fournisseurs",
          "demandeurPoint": null,
          "procedure": null,
          "dossiersLegislatifsRefs": null,
          "typePointODJ": "Suite de la discussion",
          "comiteSecret": "false",
          "textesAssocies": null,
          "natureTravauxODJ": "ODJPR"
        },
        {
          "@xsi:type": "podjSeanceConfPres_type",
          "uid": "RUANR5L15S2019IDS21581PT37103",
          "cycleDeVie": {
            "etat": "Supprimé",
            "chrono": {
              "creation": "2019-03-04T00:00:00.000+01:00",
              "cloture": "2019-03-29T00:00:00.000+01:00"
            }
          },
          "objet": "Suite de la discussion de la proposition de loi relative au droit de résiliation sans frais de contrats de complémentaire santé",
          "demandeurPoint": null,
          "procedure": null,
          "dossiersLegislatifsRefs": null,
          "typePointODJ": "Suite de la discussion",
          "comiteSecret": "false",
          "textesAssocies": null,
          "natureTravauxODJ": "ODJPR"
        },
        {
          "@xsi:type": "podjSeanceConfPres_type",
          "uid": "RUANR5L15S2019IDS21581PT37101",
          "cycleDeVie": {
            "etat": "Supprimé",
            "chrono": {
              "creation": "2019-03-04T00:00:00.000+01:00",
              "cloture": "2019-03-04T00:00:00.000+01:00"
            }
          },
          "objet": "Suite de la discussion de la proposition de loi relative à la représentation des personnels administratifs, techniques et spécialisés au sein des conseils d'administration des services départementaux d'incendie et de secours",
          "demandeurPoint": null,
          "procedure": "procédure d'examen simplifiée-Article 103",
          "dossiersLegislatifsRefs": null,
          "typePointODJ": "Suite de la discussion",
          "comiteSecret": "false",
          "textesAssocies": null,
          "natureTravauxODJ": "ODJPR"
        },
        {
          "@xsi:type": "podjSeanceConfPres_type",
          "uid": "RUANR5L15S2019IDS21581PT37104",
          "cycleDeVie": {
            "etat": "Supprimé",
            "chrono": {
              "creation": "2019-03-04T00:00:00.000+01:00",
              "cloture": "2019-03-29T00:00:00.000+01:00"
            }
          },
          "objet": "Suite de la discussion de la proposition de loi de simplification, de clarification et d'actualisation du droit des sociétés",
          "demandeurPoint": null,
          "procedure": null,
          "dossiersLegislatifsRefs": null,
          "typePointODJ": "Suite de la discussion",
          "comiteSecret": "false",
          "textesAssocies": null,
          "natureTravauxODJ": "ODJPR"
        },
        {
          "@xsi:type": "podjSeanceConfPres_type",
          "uid": "RUANR5L15S2019IDS21581PT37102",
          "cycleDeVie": {
            "etat": "Supprimé",
            "chrono": {
              "creation": "2019-03-04T00:00:00.000+01:00",
              "cloture": "2019-03-04T00:00:00.000+01:00"
            }
          },
          "objet": "Suite de la discussion de la proposition de loi visant à améliorer la trésorerie des associations",
          "demandeurPoint": null,
          "procedure": null,
          "dossiersLegislatifsRefs": null,
          "typePointODJ": "Suite de la discussion",
          "comiteSecret": "false",
          "textesAssocies": null,
          "natureTravauxODJ": "ODJPR"
        }
      ]
    }
  },
  "compteRenduRef": "CRSANR5L15S2019O1N201",
  "identifiants": {
    "numSeanceJO": "201",
    "idJO": "20190201",
    "quantieme": "Troisième",
    "DateSeance": "2019-03-28+01:00"
  }
}