{
  "@xmlns": "http://schemas.assemblee-nationale.fr/referentiel",
  "@xmlns:xsi": "http://www.w3.org/2001/XMLSchema-instance",
  "@xsi:type": "reunionCommission_type",
  "uid": "RUANR5L15S2019IDC432451",
  "timeStampDebut": "2019-07-03T16:30:00.000+02:00",
  "timeStampFin": "2019-07-03T18:30:00.000+02:00",
  "lieu": {
    "libelleLong": "salle 6350 (Finances)"
  },
  "cycleDeVie": {
    "etat": "Confirmé",
    "chrono": {
      "creation": "2019-04-24T00:00:00.000+02:00",
      "cloture": null
    }
  },
  "organeReuniRef": "PO59048",
  "demandeur": null,
  "participants": {
    "participantsInternes": {
      "participantInterne": [
        {
          "acteurRef": "PA605036",
          "presence": "excusé"
        },
        {
          "acteurRef": "PA718954",
          "presence": "absent"
        },
        {
          "acteurRef": "PA605963",
          "presence": "absent"
        },
        {
          "acteurRef": "PA606675",
          "presence": "absent"
        },
        {
          "acteurRef": "PA609726",
          "presence": "absent"
        },
        {
          "acteurRef": "PA721836",
          "presence": "absent"
        },
        {
          "acteurRef": "PA721410",
          "presence": "absent"
        },
        {
          "acteurRef": "PA721608",
          "presence": "excusé"
        },
        {
          "acteurRef": "PA605069",
          "presence": "présent"
        },
        {
          "acteurRef": "PA718838",
          "presence": "absent"
        },
        {
          "acteurRef": "PA720298",
          "presence": "présent"
        },
        {
          "acteurRef": "PA746",
          "presence": "absent"
        },
        {
          "acteurRef": "PA719138",
          "presence": "absent"
        },
        {
          "acteurRef": "PA720520",
          "presence": "absent"
        },
        {
          "acteurRef": "PA719472",
          "presence": "absent"
        },
        {
          "acteurRef": "PA719250",
          "presence": "présent"
        },
        {
          "acteurRef": "PA760658",
          "presence": "absent"
        },
        {
          "acteurRef": "PA721202",
          "presence": "présent"
        },
        {
          "acteurRef": "PA923",
          "presence": "absent"
        },
        {
          "acteurRef": "PA942",
          "presence": "présent"
        },
        {
          "acteurRef": "PA332523",
          "presence": "présent"
        },
        {
          "acteurRef": "PA720268",
          "presence": "absent"
        },
        {
          "acteurRef": "PA719710",
          "presence": "absent"
        },
        {
          "acteurRef": "PA722382",
          "presence": "présent"
        },
        {
          "acteurRef": "PA718720",
          "presence": "présent"
        },
        {
          "acteurRef": "PA643175",
          "presence": "absent"
        },
        {
          "acteurRef": "PA720996",
          "presence": "excusé"
        },
        {
          "acteurRef": "PA720002",
          "presence": "présent"
        },
        {
          "acteurRef": "PA607193",
          "presence": "absent"
        },
        {
          "acteurRef": "PA1327",
          "presence": "absent"
        },
        {
          "acteurRef": "PA719480",
          "presence": "absent"
        },
        {
          "acteurRef": "PA267336",
          "presence": "présent"
        },
        {
          "acteurRef": "PA720560",
          "presence": "absent"
        },
        {
          "acteurRef": "PA720790",
          "presence": "absent"
        },
        {
          "acteurRef": "PA721764",
          "presence": "absent"
        },
        {
          "acteurRef": "PA722054",
          "presence": "absent"
        },
        {
          "acteurRef": "PA608416",
          "presence": "absent"
        },
        {
          "acteurRef": "PA721150",
          "presence": "présent"
        },
        {
          "acteurRef": "PA719060",
          "presence": "absent"
        },
        {
          "acteurRef": "PA719778",
          "presence": "absent"
        },
        {
          "acteurRef": "PA719798",
          "presence": "excusé"
        },
        {
          "acteurRef": "PA718978",
          "presence": "absent"
        },
        {
          "acteurRef": "PA720022",
          "presence": "présent"
        },
        {
          "acteurRef": "PA712014",
          "presence": "absent"
        },
        {
          "acteurRef": "PA1874",
          "presence": "absent"
        },
        {
          "acteurRef": "PA722320",
          "presence": "présent"
        },
        {
          "acteurRef": "PA721632",
          "presence": "absent"
        },
        {
          "acteurRef": "PA719006",
          "presence": "présent"
        },
        {
          "acteurRef": "PA608016",
          "presence": "présent"
        },
        {
          "acteurRef": "PA722244",
          "presence": "absent"
        },
        {
          "acteurRef": "PA720230",
          "presence": "absent"
        },
        {
          "acteurRef": "PA720728",
          "presence": "excusé"
        },
        {
          "acteurRef": "PA719850",
          "presence": "absent"
        },
        {
          "acteurRef": "PA720492",
          "presence": "absent"
        },
        {
          "acteurRef": "PA720402",
          "presence": "absent"
        },
        {
          "acteurRef": "PA721636",
          "presence": "absent"
        },
        {
          "acteurRef": "PA335532",
          "presence": "absent"
        },
        {
          "acteurRef": "PA607595",
          "presence": "présent"
        },
        {
          "acteurRef": "PA720500",
          "presence": "absent"
        },
        {
          "acteurRef": "PA718736",
          "presence": "absent"
        },
        {
          "acteurRef": "PA336175",
          "presence": "absent"
        },
        {
          "acteurRef": "PA608172",
          "presence": "présent"
        },
        {
          "acteurRef": "PA720590",
          "presence": "présent"
        },
        {
          "acteurRef": "PA405480",
          "presence": "absent"
        },
        {
          "acteurRef": "PA609590",
          "presence": "absent"
        },
        {
          "acteurRef": "PA721458",
          "presence": "absent"
        },
        {
          "acteurRef": "PA720692",
          "presence": "absent"
        },
        {
          "acteurRef": "PA721226",
          "presence": "absent"
        },
        {
          "acteurRef": "PA720878",
          "presence": "absent"
        },
        {
          "acteurRef": "PA722078",
          "presence": "absent"
        },
        {
          "acteurRef": "PA720960",
          "presence": "absent"
        },
        {
          "acteurRef": "PA719592",
          "presence": "absent"
        },
        {
          "acteurRef": "PA721542",
          "presence": "présent"
        },
        {
          "acteurRef": "PA331582",
          "presence": "absent"
        },
        {
          "acteurRef": "PA2960",
          "presence": "présent"
        }
      ]
    },
    "personnesAuditionnees": null
  },
  "sessionRef": null,
  "ouverturePresse": "true",
  "captationVideo": "true",
  "ODJ": {
    "convocationODJ": {
      "item": "–  Audition de M. François VILLEROY DE GALHAU, gouverneur, sur le rapport annuel de la Banque de France"
    },
    "resumeODJ": {
      "item": "audition de M. François Villeroy de Galhau, gouverneur, sur le rapport annuel de la Banque de France."
    },
    "pointsODJ": null
  },
  "compteRenduRef": "CRCANR5L15S2019PO59048N095",
  "formatReunion": "Ordinaire",
  "infosReunionsInternationale": {
    "estReunionInternationale": "false",
    "listePays": null,
    "informationsComplementaires": null
  }
}