{
  "@xmlns": "http://schemas.assemblee-nationale.fr/referentiel",
  "@xmlns:xsi": "http://www.w3.org/2001/XMLSchema-instance",
  "@xsi:type": "reunionInitParlementaire_type",
  "uid": "RUANR5L15S2019IDF0125226",
  "timeStampDebut": "2019-02-06T14:00:00.000+01:00",
  "timeStampFin": "2019-02-06T15:00:00.000+01:00",
  "lieu": {
    "code": "SALREU048",
    "libelleCourt": "Salle 6809",
    "libelleLong": "Salle 6809, Palais Bourbon"
  },
  "cycleDeVie": {
    "etat": "Confirmé",
    "chrono": {
      "creation": "2019-01-16T09:37:33.000+01:00",
      "cloture": null
    }
  },
  "demandeurs": {
    "organe": {
      "nom": "GROUPE SOCIALISTES ET APPARENTÉS",
      "organeRef": "PO758835"
    }
  },
  "organeReuniRef": "PO758835",
  "typeReunion": "GP"
}