{
  "@xmlns": "http://schemas.assemblee-nationale.fr/referentiel",
  "@xmlns:xsi": "http://www.w3.org/2001/XMLSchema-instance",
  "@xsi:type": "reunionInitParlementaire_type",
  "uid": "RUANR5L15S2020IDF0143105",
  "timeStampDebut": "2019-11-19T09:00:00.000+01:00",
  "timeStampFin": "2019-11-19T12:30:00.000+01:00",
  "lieu": {
    "code": "SALREU014",
    "libelleCourt": "Salle 7042",
    "libelleLong": "Salle 7042, 103, rue de l'Université"
  },
  "cycleDeVie": {
    "etat": "Confirmé",
    "chrono": {
      "creation": "2019-11-04T12:50:19.000+01:00",
      "cloture": null
    }
  },
  "demandeurs": {
    "acteur": {
      "nom": "M. Guillaume GAROT",
      "acteurRef": "PA333285"
    }
  },
  "organeReuniRef": null,
  "typeReunion": "DEP"
}