{
  "@xmlns": "http://schemas.assemblee-nationale.fr/referentiel",
  "@xmlns:xsi": "http://www.w3.org/2001/XMLSchema-instance",
  "@xsi:type": "reunionInitParlementaire_type",
  "uid": "RUANR5L15S2018IDF0108064",
  "timeStampDebut": "2018-03-29T14:00:00.000+02:00",
  "timeStampFin": "2018-03-29T15:30:00.000+02:00",
  "lieu": {
    "code": "SALREU044",
    "libelleCourt": "Sully 2",
    "libelleLong": "Sully 2, Palais Bourbon"
  },
  "cycleDeVie": {
    "etat": "Confirmé",
    "chrono": {
      "creation": "2018-03-20T12:10:20.000+02:00",
      "cloture": null
    }
  },
  "demandeurs": {
    "acteur": {
      "nom": "M. Mustapha LAABID",
      "acteurRef": "PA719842"
    }
  },
  "organeReuniRef": null,
  "typeReunion": "DEP"
}