{
  "@xmlns": "http://schemas.assemblee-nationale.fr/referentiel",
  "@xmlns:xsi": "http://www.w3.org/2001/XMLSchema-instance",
  "@xsi:type": "reunionInitParlementaire_type",
  "uid": "RUANR5L15S2018IDF0109384",
  "timeStampDebut": "2018-06-05T16:00:00.000+02:00",
  "timeStampFin": "2018-06-05T18:00:00.000+02:00",
  "lieu": {
    "code": "SALREU010",
    "libelleCourt": "Salle N° 1",
    "libelleLong": "Salle N° 1, 3, rue Aristide Briand"
  },
  "cycleDeVie": {
    "etat": "Annulé",
    "chrono": {
      "creation": "2018-04-06T10:54:36.000+02:00",
      "cloture": "2018-05-31T15:06:18.000+02:00"
    }
  },
  "demandeurs": {
    "organe": {
      "nom": "Groupe d'amitié France-Canada",
      "organeRef": "PO733322"
    }
  },
  "organeReuniRef": "PO733322",
  "typeReunion": "GA"
}