{
  "@xmlns": "http://schemas.assemblee-nationale.fr/referentiel",
  "@xmlns:xsi": "http://www.w3.org/2001/XMLSchema-instance",
  "@xsi:type": "reunionCommission_type",
  "uid": "RUANR5L15S2018IDC428881",
  "timeStampDebut": "2018-03-22T14:30:00.000+01:00",
  "timeStampFin": "2018-03-22T15:30:00.000+01:00",
  "lieu": {
    "libelleLong": "salle 6237 (Développement durable)"
  },
  "cycleDeVie": {
    "etat": "Confirmé",
    "chrono": {
      "creation": "2018-03-15T00:00:00.000+01:00",
      "cloture": null
    }
  },
  "organeReuniRef": "PO748336",
  "demandeur": null,
  "participants": {
    "participantsInternes": null,
    "personnesAuditionnees": null
  },
  "sessionRef": null,
  "ouverturePresse": "true",
  "captationVideo": "false",
  "ODJ": {
    "convocationODJ": {
      "item": "Audition de M. Eric Guéret et Mme Laure Noualhat, journalistes, réalisateurs du documentaire « Sécurité nucléaire : le grand mensonge »"
    },
    "resumeODJ": {
      "item": "audition de M. Eric Guéret et Mme Laure Noualhat, journalistes, réalisateurs du documentaire « Sécurité nucléaire : le grand mensonge »"
    },
    "pointsODJ": null
  },
  "compteRenduRef": "CRCANR5L15S2018PO748336N019",
  "formatReunion": "Ordinaire",
  "infosReunionsInternationale": {
    "estReunionInternationale": "false",
    "listePays": null,
    "informationsComplementaires": null
  }
}