{
  "@xmlns": "http://schemas.assemblee-nationale.fr/referentiel",
  "@xmlns:xsi": "http://www.w3.org/2001/XMLSchema-instance",
  "@xsi:type": "reunionInitParlementaire_type",
  "uid": "RUANR5L15S2019IDF0122926",
  "timeStampDebut": "2018-11-26T14:00:00.000+01:00",
  "timeStampFin": "2018-11-26T19:00:00.000+01:00",
  "lieu": {
    "code": "SALREU027",
    "libelleCourt": "Salle 6217",
    "libelleLong": "Salle 6217, Palais Bourbon"
  },
  "cycleDeVie": {
    "etat": "Confirmé",
    "chrono": {
      "creation": "2018-11-23T11:20:56.000+01:00",
      "cloture": null
    }
  },
  "demandeurs": {
    "acteur": {
      "nom": "M. Julien AUBERT",
      "acteurRef": "PA609726"
    }
  },
  "organeReuniRef": null,
  "typeReunion": "DEP"
}