{
  "@xmlns": "http://schemas.assemblee-nationale.fr/referentiel",
  "@xmlns:xsi": "http://www.w3.org/2001/XMLSchema-instance",
  "@xsi:type": "reunionCommission_type",
  "uid": "RUANR5L15S2018IDC428871",
  "timeStampDebut": "2018-04-18T16:30:00.000+02:00",
  "lieu": {
    "libelleLong": "salle 6238 (Affaires culturelles)"
  },
  "cycleDeVie": {
    "etat": "Annulé",
    "chrono": {
      "creation": "2018-03-15T00:00:00.000+01:00",
      "cloture": "2018-03-22T00:00:00.000+01:00"
    }
  },
  "organeReuniRef": "PO419604",
  "demandeur": null,
  "participants": {
    "participantsInternes": null,
    "personnesAuditionnees": null
  },
  "sessionRef": null,
  "ouverturePresse": "true",
  "captationVideo": "false",
  "ODJ": {
    "convocationODJ": {
      "item": "– Audition de M. Stéphane Travert, ministre de l’agriculture et de l’alimentation, sur l’enseignement agricole secondaire et supérieur"
    },
    "resumeODJ": {
      "item": "audition de M. Stéphane Travert, ministre de l’agriculture et de l’alimentation, sur l’enseignement agricole secondaire et supérieur."
    },
    "pointsODJ": null
  },
  "compteRenduRef": null,
  "formatReunion": "Ordinaire",
  "infosReunionsInternationale": {
    "estReunionInternationale": "false",
    "listePays": null,
    "informationsComplementaires": null
  }
}