{
  "@xmlns": "http://schemas.assemblee-nationale.fr/referentiel",
  "@xmlns:xsi": "http://www.w3.org/2001/XMLSchema-instance",
  "@xsi:type": "reunionCommission_type",
  "uid": "RUANR5L15S2018IDC428101",
  "timeStampDebut": "2017-12-19T18:15:00.000+01:00",
  "lieu": {
    "libelleLong": "Salle 4016"
  },
  "cycleDeVie": {
    "etat": "Confirmé",
    "chrono": {
      "creation": "2017-12-08T00:00:00.000+01:00",
      "cloture": null
    }
  },
  "organeReuniRef": "PO743823",
  "demandeur": null,
  "participants": {
    "participantsInternes": null,
    "personnesAuditionnees": null
  },
  "sessionRef": null,
  "ouverturePresse": "false",
  "captationVideo": "false",
  "ODJ": {
    "convocationODJ": {
      "item": "Direction générale de la gendarmerie nationale :– Audition du Colonel Éric Freyssinet, Chef de la Mission numérique de la gendarmerie nationale (MNGN)."
    },
    "resumeODJ": {
      "item": [
        "Direction générale de la gendarmerie nationale :",
        "audition du Colonel Éric Freyssinet, Chef de la Mission numérique de la gendarmerie nationale (MNGN)."
      ]
    },
    "pointsODJ": null
  },
  "compteRenduRef": null,
  "formatReunion": "Ordinaire",
  "infosReunionsInternationale": {
    "estReunionInternationale": "false",
    "listePays": null,
    "informationsComplementaires": null
  }
}