{
  "@xmlns": "http://schemas.assemblee-nationale.fr/referentiel",
  "@xmlns:xsi": "http://www.w3.org/2001/XMLSchema-instance",
  "@xsi:type": "reunionInitParlementaire_type",
  "uid": "RUANR5L15S2020IDF0140084",
  "timeStampDebut": "2019-10-09T18:00:00.000+02:00",
  "timeStampFin": "2019-10-09T19:00:00.000+02:00",
  "lieu": {
    "code": "SALREU023",
    "libelleCourt": "Salle 7426",
    "libelleLong": "Salle 7426, 101, rue de l'Université"
  },
  "cycleDeVie": {
    "etat": "Annulé",
    "chrono": {
      "creation": "2019-09-16T14:06:30.000+02:00",
      "cloture": "2019-09-25T11:49:03.000+02:00"
    }
  },
  "demandeurs": {
    "acteur": {
      "nom": "M. Mohamed LAQHILA",
      "acteurRef": "PA718978"
    }
  },
  "organeReuniRef": null,
  "typeReunion": "DEP"
}