{
  "@xmlns": "http://schemas.assemblee-nationale.fr/referentiel",
  "@xmlns:xsi": "http://www.w3.org/2001/XMLSchema-instance",
  "@xsi:type": "reunionInitParlementaire_type",
  "uid": "RUANR5L15S2018IDF0116483",
  "timeStampDebut": "2018-09-06T15:00:00.000+02:00",
  "timeStampFin": "2018-09-06T18:00:00.000+02:00",
  "lieu": {
    "code": "SALREU023",
    "libelleCourt": "Salle 7426",
    "libelleLong": "Salle 7426, 101, rue de l'Université"
  },
  "cycleDeVie": {
    "etat": "Confirmé",
    "chrono": {
      "creation": "2018-08-01T14:58:04.000+02:00",
      "cloture": null
    }
  },
  "demandeurs": {
    "acteur": {
      "nom": "Mme Samantha CAZEBONNE",
      "acteurRef": "PA721166"
    }
  },
  "organeReuniRef": null,
  "typeReunion": "DEP"
}