{
  "@xmlns": "http://schemas.assemblee-nationale.fr/referentiel",
  "@xmlns:xsi": "http://www.w3.org/2001/XMLSchema-instance",
  "@xsi:type": "reunionInitParlementaire_type",
  "uid": "RUANR5L15S2018IDF0115019",
  "timeStampDebut": "2018-07-11T15:00:00.000+02:00",
  "timeStampFin": "2018-07-11T16:30:00.000+02:00",
  "lieu": {
    "code": "SALREU018",
    "libelleCourt": "Salon Mansart",
    "libelleLong": "Salon Mansart, 101, rue de l'Université"
  },
  "cycleDeVie": {
    "etat": "Confirmé",
    "chrono": {
      "creation": "2018-07-04T14:56:03.000+02:00",
      "cloture": null
    }
  },
  "demandeurs": {
    "acteur": {
      "nom": "M. Didier QUENTIN",
      "acteurRef": "PA2492"
    }
  },
  "organeReuniRef": null,
  "typeReunion": "DEP"
}