{
  "@xmlns": "http://schemas.assemblee-nationale.fr/referentiel",
  "@xmlns:xsi": "http://www.w3.org/2001/XMLSchema-instance",
  "@xsi:type": "reunionCommission_type",
  "uid": "RUANR5L15S2019IDC430596",
  "timeStampDebut": "2018-10-18T14:00:00.000+02:00",
  "lieu": {
    "libelleLong": "(6ème Bureau)"
  },
  "cycleDeVie": {
    "etat": "Confirmé",
    "chrono": {
      "creation": "2018-10-12T00:00:00.000+02:00",
      "cloture": null
    }
  },
  "organeReuniRef": "PO759174",
  "demandeur": null,
  "participants": {
    "participantsInternes": null,
    "personnesAuditionnees": {
      "personneAuditionnee": [
        null,
        null
      ]
    }
  },
  "sessionRef": null,
  "ouverturePresse": "true",
  "captationVideo": "false",
  "ODJ": {
    "convocationODJ": {
      "item": [
        "Audition commune, ouverte à la presse, sur le thème : \" L'efficacité de la lutte contre la délinquance financière menée par l'État : diversité des acteurs, moyens déployés, portée des sanctions \", de :",
        "M. Jacques Rigaudiat, économiste, Fondation Copernic ;",
        "M. Damien Falco, enseignant chercheur à la faculté de droit de l'université Toulouse Capitole."
      ]
    },
    "resumeODJ": {
      "item": [
        "audition commune, ouverte à la presse, sur le thème : \" L'efficacité de la lutte contre la délinquance financière menée par l'État : diversité des acteurs, moyens déployés, portée des sanctions \", de :",
        "M. Jacques Rigaudiat, économiste, Fondation Copernic ;",
        "M. Damien Falco, enseignant chercheur à la faculté de droit de l'université Toulouse Capitole."
      ]
    },
    "pointsODJ": null
  },
  "compteRenduRef": null,
  "formatReunion": "Ordinaire",
  "infosReunionsInternationale": {
    "estReunionInternationale": "false",
    "listePays": null,
    "informationsComplementaires": null
  }
}