{
  "@xmlns": "http://schemas.assemblee-nationale.fr/referentiel",
  "@xmlns:xsi": "http://www.w3.org/2001/XMLSchema-instance",
  "@xsi:type": "reunionInitParlementaire_type",
  "uid": "RUANR5L15S2017IDF0093402",
  "timeStampDebut": "2017-07-05T08:00:00.000+02:00",
  "timeStampFin": "2017-07-05T19:00:00.000+02:00",
  "lieu": {
    "code": "SALREU014",
    "libelleCourt": "Salle 7042",
    "libelleLong": "Salle 7042, 103, rue de l'Université"
  },
  "cycleDeVie": {
    "etat": "Confirmé",
    "chrono": {
      "creation": "2017-07-03T12:10:15.000+02:00",
      "cloture": null
    }
  },
  "demandeurs": {
    "acteur": {
      "nom": "M. Frédéric PETIT",
      "acteurRef": "PA721182"
    }
  },
  "organeReuniRef": null,
  "typeReunion": "DEP"
}