{
  "@xmlns": "http://schemas.assemblee-nationale.fr/referentiel",
  "@xmlns:xsi": "http://www.w3.org/2001/XMLSchema-instance",
  "@xsi:type": "reunionInitParlementaire_type",
  "uid": "RUANR5L15S2019IDF0124596",
  "timeStampDebut": "2019-02-07T12:15:00.000+01:00",
  "timeStampFin": "2019-02-07T18:00:00.000+01:00",
  "lieu": {
    "code": "SALREU028",
    "libelleCourt": "Salle Colbert",
    "libelleLong": "Salle Colbert , Palais Bourbon"
  },
  "cycleDeVie": {
    "etat": "Confirmé",
    "chrono": {
      "creation": "2019-01-09T12:14:02.000+01:00",
      "cloture": null
    }
  },
  "demandeurs": {
    "acteur": {
      "nom": "Mme Amélia LAKRAFI",
      "acteurRef": "PA721004"
    }
  },
  "organeReuniRef": null,
  "typeReunion": "DEP"
}