{
  "@xmlns": "http://schemas.assemblee-nationale.fr/referentiel",
  "@xmlns:xsi": "http://www.w3.org/2001/XMLSchema-instance",
  "@xsi:type": "reunionInitParlementaire_type",
  "uid": "RUANR5L15S2019IDF0119051",
  "timeStampDebut": "2018-10-18T09:30:00.000+02:00",
  "timeStampFin": "2018-10-18T12:30:00.000+02:00",
  "lieu": {
    "code": "SALREU010",
    "libelleCourt": "Salle N° 1",
    "libelleLong": "Salle N° 1, 3, rue Aristide Briand"
  },
  "cycleDeVie": {
    "etat": "Confirmé",
    "chrono": {
      "creation": "2018-09-20T14:47:32.000+02:00",
      "cloture": null
    }
  },
  "demandeurs": {
    "acteur": {
      "nom": "Mme Laetitia AVIA",
      "acteurRef": "PA721624"
    }
  },
  "organeReuniRef": null,
  "typeReunion": "DEP"
}