{
  "@xmlns": "http://schemas.assemblee-nationale.fr/referentiel",
  "@xmlns:xsi": "http://www.w3.org/2001/XMLSchema-instance",
  "@xsi:type": "reunionInitParlementaire_type",
  "uid": "RUANR5L15S2020IDF0143249",
  "timeStampDebut": "2019-11-25T13:00:00.000+01:00",
  "timeStampFin": "2019-11-25T17:00:00.000+01:00",
  "lieu": {
    "code": "SALREU028",
    "libelleCourt": "Salle Colbert",
    "libelleLong": "Salle Colbert , Palais Bourbon"
  },
  "cycleDeVie": {
    "etat": "Confirmé",
    "chrono": {
      "creation": "2019-11-06T10:07:31.000+01:00",
      "cloture": null
    }
  },
  "demandeurs": {
    "acteur": {
      "nom": "Mme Danièle HÉRIN",
      "acteurRef": "PA718794"
    }
  },
  "organeReuniRef": null,
  "typeReunion": "DEP"
}