{
  "@xmlns": "http://schemas.assemblee-nationale.fr/referentiel",
  "@xmlns:xsi": "http://www.w3.org/2001/XMLSchema-instance",
  "@xsi:type": "reunionInitParlementaire_type",
  "uid": "RUANR5L15S2019IDF0126612",
  "timeStampDebut": "2019-02-19T16:30:00.000+01:00",
  "timeStampFin": "2019-02-19T19:00:00.000+01:00",
  "lieu": {
    "code": "SALREU022",
    "libelleCourt": "Salle 7326",
    "libelleLong": "Salle 7326, 101, rue de l'Université"
  },
  "cycleDeVie": {
    "etat": "Confirmé",
    "chrono": {
      "creation": "2019-02-01T18:06:57.000+01:00",
      "cloture": null
    }
  },
  "demandeurs": {
    "acteur": {
      "nom": "M. Fabrice LE VIGOUREUX",
      "acteurRef": "PA719006"
    }
  },
  "organeReuniRef": null,
  "typeReunion": "DEP"
}