{
  "@xmlns": "http://schemas.assemblee-nationale.fr/referentiel",
  "@xmlns:xsi": "http://www.w3.org/2001/XMLSchema-instance",
  "@xsi:type": "reunionInitParlementaire_type",
  "uid": "RUANR5L15S2019IDF0125757",
  "timeStampDebut": "2019-02-05T10:00:00.000+01:00",
  "timeStampFin": "2019-02-05T11:00:00.000+01:00",
  "lieu": {
    "code": "SALREU017",
    "libelleCourt": "Salon Visconti",
    "libelleLong": "Salon Visconti, 101, rue de l'Université"
  },
  "cycleDeVie": {
    "etat": "Confirmé",
    "chrono": {
      "creation": "2019-01-22T17:53:57.000+01:00",
      "cloture": null
    }
  },
  "demandeurs": {
    "acteur": {
      "nom": "M. Stéphane VIRY",
      "acteurRef": "PA721474"
    }
  },
  "organeReuniRef": null,
  "typeReunion": "DEP"
}