{
  "@xmlns": "http://schemas.assemblee-nationale.fr/referentiel",
  "@xmlns:xsi": "http://www.w3.org/2001/XMLSchema-instance",
  "@xsi:type": "seance_type",
  "uid": "RUANR5L15S2018IDS21152",
  "timeStampDebut": "2018-07-03T21:30:00.000+02:00",
  "timeStampFin": "2018-07-04T01:05:00.000+02:00",
  "lieu": {
    "code": "AN",
    "libelleLong": "Assemblée nationale"
  },
  "cycleDeVie": {
    "etat": "Confirmé",
    "chrono": {
      "creation": "2018-06-18T00:00:00.000+02:00",
      "cloture": null
    }
  },
  "organeReuniRef": "PO717460",
  "demandeur": null,
  "participants": null,
  "sessionRef": "SCR5A2018E1",
  "ouverturePresse": "true",
  "captationVideo": "true",
  "ODJ": {
    "convocationODJ": null,
    "resumeODJ": null,
    "pointsODJ": {
      "pointODJ": [
        {
          "@xsi:type": "podjSeanceConfPres_type",
          "uid": "RUANR5L15S2018IDS21152PT36101",
          "cycleDeVie": {
            "etat": "Confirmé",
            "chrono": {
              "creation": "2018-06-18T00:00:00.000+02:00",
              "cloture": null
            }
          },
          "objet": "Suite de la discussion de la proposition de loi relative à la lutte contre les fausses informations",
          "demandeurPoint": null,
          "procedure": null,
          "dossiersLegislatifsRefs": {
            "dossierRef": "DLR5L15N36488"
          },
          "typePointODJ": "Suite de la discussion",
          "comiteSecret": "false",
          "textesAssocies": null,
          "natureTravauxODJ": "ODJPR"
        },
        {
          "@xsi:type": "podjSeanceConfPres_type",
          "uid": "RUANR5L15S2018IDS21152PT36102",
          "cycleDeVie": {
            "etat": "Confirmé",
            "chrono": {
              "creation": "2018-06-18T00:00:00.000+02:00",
              "cloture": null
            }
          },
          "objet": "Suite de la discussion de la proposition de loi organique relative à la lutte contre les fausses informations",
          "demandeurPoint": null,
          "procedure": null,
          "dossiersLegislatifsRefs": {
            "dossierRef": "DLR5L15N36468"
          },
          "typePointODJ": "Suite de la discussion",
          "comiteSecret": "false",
          "textesAssocies": null,
          "natureTravauxODJ": "ODJPR"
        }
      ]
    }
  },
  "compteRenduRef": "CRSANR5L15S2018E1N002",
  "identifiants": {
    "numSeanceJO": "2",
    "idJO": "20181002",
    "quantieme": "Deuxième",
    "DateSeance": "2018-07-03+02:00"
  }
}