{
  "@xmlns": "http://schemas.assemblee-nationale.fr/referentiel",
  "@xmlns:xsi": "http://www.w3.org/2001/XMLSchema-instance",
  "@xsi:type": "reunionInitParlementaire_type",
  "uid": "RUANR5L15S2018IDF0102783",
  "timeStampDebut": "2018-05-08T10:30:00.000+02:00",
  "timeStampFin": "2018-05-08T12:15:00.000+02:00",
  "lieu": {
    "code": "SALREU004",
    "libelleCourt": "1er Bureau",
    "libelleLong": "1er Bureau, Palais Bourbon"
  },
  "cycleDeVie": {
    "etat": "Confirmé",
    "chrono": {
      "creation": "2017-12-20T15:43:49.000+02:00",
      "cloture": null
    }
  },
  "demandeurs": {
    "organe": {
      "nom": "GROUPE UDI, AGIR ET INDÉPENDANTS",
      "organeRef": "PO744425"
    }
  },
  "organeReuniRef": "PO744425",
  "typeReunion": "GP"
}