{
  "@xmlns": "http://schemas.assemblee-nationale.fr/referentiel",
  "@xmlns:xsi": "http://www.w3.org/2001/XMLSchema-instance",
  "@xsi:type": "reunionInitParlementaire_type",
  "uid": "RUANR5L15S2018IDF0099379",
  "timeStampDebut": "2017-11-22T17:30:00.000+01:00",
  "timeStampFin": "2017-11-22T19:00:00.000+01:00",
  "lieu": {
    "code": "SALREU010",
    "libelleCourt": "Salle N° 1",
    "libelleLong": "Salle N° 1, 3, rue Aristide Briand"
  },
  "cycleDeVie": {
    "etat": "Confirmé",
    "chrono": {
      "creation": "2017-10-27T10:28:18.000+01:00",
      "cloture": null
    }
  },
  "demandeurs": {
    "organe": {
      "nom": "Groupe d'amitié France-Qatar",
      "organeRef": "PO733632"
    }
  },
  "organeReuniRef": "PO733632",
  "typeReunion": "GA"
}