{
  "@xmlns": "http://schemas.assemblee-nationale.fr/referentiel",
  "@xmlns:xsi": "http://www.w3.org/2001/XMLSchema-instance",
  "@xsi:type": "reunionInitParlementaire_type",
  "uid": "RUANR5L15S2018IDF0098205",
  "timeStampDebut": "2017-10-18T08:00:00.000+02:00",
  "timeStampFin": "2017-10-18T09:00:00.000+02:00",
  "lieu": {
    "code": "SALREU006",
    "libelleCourt": "3ème Bureau",
    "libelleLong": "3ème Bureau, Palais Bourbon"
  },
  "cycleDeVie": {
    "etat": "Confirmé",
    "chrono": {
      "creation": "2017-10-09T12:36:54.000+02:00",
      "cloture": null
    }
  },
  "demandeurs": {
    "acteur": {
      "nom": "M. Thierry MICHELS",
      "acteurRef": "PA720738"
    }
  },
  "organeReuniRef": null,
  "typeReunion": "DEP"
}