{
  "@xmlns": "http://schemas.assemblee-nationale.fr/referentiel",
  "@xmlns:xsi": "http://www.w3.org/2001/XMLSchema-instance",
  "@xsi:type": "reunionInitParlementaire_type",
  "uid": "RUANR5L15S2020IDF0142204",
  "timeStampDebut": "2019-11-19T14:15:00.000+01:00",
  "timeStampFin": "2019-11-19T15:00:00.000+01:00",
  "lieu": {
    "code": "SALREU023",
    "libelleCourt": "Salle 7426",
    "libelleLong": "Salle 7426, 101, rue de l'Université"
  },
  "cycleDeVie": {
    "etat": "Annulé",
    "chrono": {
      "creation": "2019-10-16T15:54:51.000+01:00",
      "cloture": "2019-11-19T11:36:35.000+01:00"
    }
  },
  "demandeurs": {
    "acteur": {
      "nom": "Mme Laure DE LA RAUDIÈRE",
      "acteurRef": "PA331567"
    }
  },
  "organeReuniRef": null,
  "typeReunion": "DEP"
}