{
  "@xmlns": "http://schemas.assemblee-nationale.fr/referentiel",
  "@xmlns:xsi": "http://www.w3.org/2001/XMLSchema-instance",
  "@xsi:type": "reunionCommission_type",
  "uid": "RUANR5L15S2019IDC432435",
  "timeStampDebut": "2019-04-30T16:15:00.000+02:00",
  "timeStampFin": "2019-04-30T17:55:00.000+02:00",
  "lieu": {
    "libelleLong": "salle 4325 (33 rue Saint-Dominique)"
  },
  "cycleDeVie": {
    "etat": "Confirmé",
    "chrono": {
      "creation": "2019-04-19T00:00:00.000+02:00",
      "cloture": null
    }
  },
  "organeReuniRef": "PO732866",
  "demandeur": null,
  "participants": {
    "participantsInternes": {
      "participantInterne": [
        {
          "acteurRef": "PA718744",
          "presence": "absent"
        },
        {
          "acteurRef": "PA719980",
          "presence": "absent"
        },
        {
          "acteurRef": "PA718694",
          "presence": "absent"
        },
        {
          "acteurRef": "PA718926",
          "presence": "absent"
        },
        {
          "acteurRef": "PA720046",
          "presence": "absent"
        },
        {
          "acteurRef": "PA720286",
          "presence": "absent"
        },
        {
          "acteurRef": "PA267780",
          "presence": "absent"
        },
        {
          "acteurRef": "PA267318",
          "presence": "absent"
        },
        {
          "acteurRef": "PA722374",
          "presence": "présent"
        },
        {
          "acteurRef": "PA606712",
          "presence": "présent"
        },
        {
          "acteurRef": "PA721070",
          "presence": "absent"
        },
        {
          "acteurRef": "PA719540",
          "presence": "absent"
        },
        {
          "acteurRef": "PA719930",
          "presence": "absent"
        },
        {
          "acteurRef": "PA642788",
          "presence": "absent"
        },
        {
          "acteurRef": "PA722102",
          "presence": "excusé"
        },
        {
          "acteurRef": "PA721474",
          "presence": "présent"
        }
      ]
    },
    "personnesAuditionnees": null
  },
  "sessionRef": null,
  "ouverturePresse": "true",
  "captationVideo": "false",
  "ODJ": {
    "convocationODJ": {
      "item": "Le dossier médical partagé et les données numériques de santé (M. Cyrille Isaac-Sibille, rapporteur)– Audition de Mme Pascale Sauvage, directrice de l’Agence nationale des systèmes d’information partagés de santé (ASIP Santé)."
    },
    "resumeODJ": {
      "item": "Le dossier médical partagé et les données numériques de santé (M. Cyrille Isaac-Sibille, rapporteur) : audition de Mme Pascale Sauvage, directrice de l’Agence nationale des systèmes d’information partagés de santé (ASIP Santé)."
    },
    "pointsODJ": null
  },
  "compteRenduRef": "CRCANR5L15S2019PO732866N002",
  "formatReunion": "Ordinaire",
  "infosReunionsInternationale": {
    "estReunionInternationale": "false",
    "listePays": null,
    "informationsComplementaires": null
  }
}