{
  "@xmlns": "http://schemas.assemblee-nationale.fr/referentiel",
  "@xmlns:xsi": "http://www.w3.org/2001/XMLSchema-instance",
  "@xsi:type": "reunionInitParlementaire_type",
  "uid": "RUANR5L15S2019IDF0134598",
  "timeStampDebut": "2019-06-05T08:00:00.000+02:00",
  "timeStampFin": "2019-06-05T09:30:00.000+02:00",
  "lieu": {
    "code": "SALREU021",
    "libelleCourt": "Salle 7207",
    "libelleLong": "Salle 7207, 101, rue de l'Université"
  },
  "cycleDeVie": {
    "etat": "Confirmé",
    "chrono": {
      "creation": "2019-05-27T16:14:08.000+02:00",
      "cloture": null
    }
  },
  "demandeurs": {
    "acteur": {
      "nom": "M. Cédric ROUSSEL",
      "acteurRef": "PA718902"
    }
  },
  "organeReuniRef": null,
  "typeReunion": "DEP"
}