{
  "@xmlns": "http://schemas.assemblee-nationale.fr/referentiel",
  "@xmlns:xsi": "http://www.w3.org/2001/XMLSchema-instance",
  "@xsi:type": "reunionInitParlementaire_type",
  "uid": "RUANR5L15S2018IDF0107030",
  "timeStampDebut": "2018-03-13T16:00:00.000+01:00",
  "timeStampFin": "2018-03-13T17:00:00.000+01:00",
  "lieu": {
    "code": "SALREU041",
    "libelleCourt": "Sully 5",
    "libelleLong": "Sully 5, Palais Bourbon"
  },
  "cycleDeVie": {
    "etat": "Annulé",
    "chrono": {
      "creation": "2018-03-06T15:56:18.000+01:00",
      "cloture": "2018-03-08T11:56:43.000+01:00"
    }
  },
  "demandeurs": {
    "acteur": {
      "nom": "Mme Élodie JACQUIER-LAFORGE",
      "acteurRef": "PA719874"
    }
  },
  "organeReuniRef": null,
  "typeReunion": "DEP"
}