{
  "@xmlns": "http://schemas.assemblee-nationale.fr/referentiel",
  "@xmlns:xsi": "http://www.w3.org/2001/XMLSchema-instance",
  "@xsi:type": "reunionCommission_type",
  "uid": "RUANR5L15S2018IDC428011",
  "timeStampDebut": "2018-01-10T14:30:00.000+01:00",
  "lieu": {
    "libelleLong": "salle 4013 (33 rue Saint-Dominique)"
  },
  "cycleDeVie": {
    "etat": "Confirmé",
    "chrono": {
      "creation": "2017-12-01T00:00:00.000+01:00",
      "cloture": null
    }
  },
  "organeReuniRef": "PO734965",
  "demandeur": null,
  "participants": {
    "participantsInternes": null,
    "personnesAuditionnees": null
  },
  "sessionRef": null,
  "ouverturePresse": "false",
  "captationVideo": "false",
  "ODJ": {
    "convocationODJ": {
      "item": "Audition de M. Bruno Bordone, chef du service des synthèses et du pilotage budgétaire, de M. Christophe Mauriet, directeur des affaires financières, et  Mme Evelyne Satonnet, sous-directrice de la prospective et de l’analyse des coûts."
    },
    "resumeODJ": {
      "item": "audition de M. Bruno Bordone, chef du service des synthèses et du pilotage budgétaire, de M. Christophe Mauriet, directeur des affaires financières, et  Mme Evelyne Satonnet, sous-directrice de la prospective et de l’analyse des coûts."
    },
    "pointsODJ": null
  },
  "compteRenduRef": null,
  "formatReunion": "Ordinaire",
  "infosReunionsInternationale": {
    "estReunionInternationale": "false",
    "listePays": null,
    "informationsComplementaires": null
  }
}