{
  "@xmlns": "http://schemas.assemblee-nationale.fr/referentiel",
  "@xmlns:xsi": "http://www.w3.org/2001/XMLSchema-instance",
  "@xsi:type": "reunionCommission_type",
  "uid": "RUANR5L15S2018IDC429470",
  "timeStampDebut": "2018-06-14T09:00:00.000+02:00",
  "timeStampFin": "2018-06-14T11:00:00.000+02:00",
  "lieu": {
    "libelleLong": "salle 6237 (Développement durable)"
  },
  "cycleDeVie": {
    "etat": "Confirmé",
    "chrono": {
      "creation": "2018-05-17T00:00:00.000+02:00",
      "cloture": null
    }
  },
  "organeReuniRef": "PO748336",
  "demandeur": null,
  "participants": {
    "participantsInternes": null,
    "personnesAuditionnees": null
  },
  "sessionRef": null,
  "ouverturePresse": "true",
  "captationVideo": "false",
  "ODJ": {
    "convocationODJ": {
      "item": "Table ronde avec des représentants syndicaux"
    },
    "resumeODJ": {
      "item": "table ronde avec des représentants syndicaux."
    },
    "pointsODJ": null
  },
  "compteRenduRef": "CRCANR5L15S2018PO748336N042",
  "formatReunion": "Ordinaire",
  "infosReunionsInternationale": {
    "estReunionInternationale": "false",
    "listePays": null,
    "informationsComplementaires": null
  }
}