{
  "@xmlns": "http://schemas.assemblee-nationale.fr/referentiel",
  "@xmlns:xsi": "http://www.w3.org/2001/XMLSchema-instance",
  "@xsi:type": "reunionInitParlementaire_type",
  "uid": "RUANR5L15S2019IDF0136830",
  "timeStampDebut": "2019-07-04T11:00:00.000+02:00",
  "timeStampFin": "2019-07-04T12:30:00.000+02:00",
  "lieu": {
    "code": "SALREU021",
    "libelleCourt": "Salle 7207",
    "libelleLong": "Salle 7207, 101, rue de l'Université"
  },
  "cycleDeVie": {
    "etat": "Confirmé",
    "chrono": {
      "creation": "2019-07-04T10:05:28.000+02:00",
      "cloture": null
    }
  },
  "demandeurs": {
    "acteur": {
      "nom": "Mme Isabelle FLORENNES",
      "acteurRef": "PA721742"
    }
  },
  "organeReuniRef": null,
  "typeReunion": "DEP"
}