{
  "@xmlns": "http://schemas.assemblee-nationale.fr/referentiel",
  "@xmlns:xsi": "http://www.w3.org/2001/XMLSchema-instance",
  "@xsi:type": "reunionInitParlementaire_type",
  "uid": "RUANR5L15S2018IDF0103540",
  "timeStampDebut": "2018-01-25T15:00:00.000+01:00",
  "timeStampFin": "2018-01-25T17:30:00.000+01:00",
  "lieu": {
    "code": "SALREU020",
    "libelleCourt": "Salon Mars II",
    "libelleLong": "Salon Mars II, 101, rue de l'Université"
  },
  "cycleDeVie": {
    "etat": "Confirmé",
    "chrono": {
      "creation": "2018-01-12T18:48:34.000+01:00",
      "cloture": null
    }
  },
  "demandeurs": {
    "acteur": {
      "nom": "M. Pierre-Yves BOURNAZEL",
      "acteurRef": "PA722030"
    }
  },
  "organeReuniRef": null,
  "typeReunion": "DEP"
}