{
  "@xmlns": "http://schemas.assemblee-nationale.fr/referentiel",
  "@xmlns:xsi": "http://www.w3.org/2001/XMLSchema-instance",
  "@xsi:type": "reunionInitParlementaire_type",
  "uid": "RUANR5L15S2019IDF0122376",
  "timeStampDebut": "2018-12-05T14:00:00.000+01:00",
  "timeStampFin": "2018-12-05T15:00:00.000+01:00",
  "lieu": {
    "code": "SALREU022",
    "libelleCourt": "Salle 7326",
    "libelleLong": "Salle 7326, 101, rue de l'Université"
  },
  "cycleDeVie": {
    "etat": "Annulé",
    "chrono": {
      "creation": "2018-11-14T10:49:25.000+01:00",
      "cloture": "2018-11-29T11:29:04.000+01:00"
    }
  },
  "demandeurs": {
    "acteur": {
      "nom": "Mme Nadia HAI",
      "acteurRef": "PA722054"
    }
  },
  "organeReuniRef": null,
  "typeReunion": "DEP"
}