{
  "@xmlns": "http://schemas.assemblee-nationale.fr/referentiel",
  "@xmlns:xsi": "http://www.w3.org/2001/XMLSchema-instance",
  "@xsi:type": "reunionInitParlementaire_type",
  "uid": "RUANR5L15S2017IDF0096168",
  "timeStampDebut": "2017-09-28T14:00:00.000+02:00",
  "timeStampFin": "2017-09-28T15:00:00.000+02:00",
  "lieu": {
    "code": "SALREU006",
    "libelleCourt": "3ème Bureau",
    "libelleLong": "3ème Bureau, Palais Bourbon"
  },
  "cycleDeVie": {
    "etat": "Confirmé",
    "chrono": {
      "creation": "2017-09-13T10:49:27.000+02:00",
      "cloture": null
    }
  },
  "demandeurs": {
    "acteur": {
      "nom": "Mme Corinne VIGNON",
      "acteurRef": "PA719512"
    }
  },
  "organeReuniRef": null,
  "typeReunion": "DEP"
}