{
  "@xmlns": "http://schemas.assemblee-nationale.fr/referentiel",
  "@xmlns:xsi": "http://www.w3.org/2001/XMLSchema-instance",
  "@xsi:type": "reunionInitParlementaire_type",
  "uid": "RUANR5L15S2018IDF0117924",
  "timeStampDebut": "2018-09-12T08:30:00.000+02:00",
  "timeStampFin": "2018-09-12T10:00:00.000+02:00",
  "lieu": {
    "code": "SALREU038",
    "libelleCourt": "Salle 6549",
    "libelleLong": "Salle 6549, Palais Bourbon"
  },
  "cycleDeVie": {
    "etat": "Confirmé",
    "chrono": {
      "creation": "2018-09-07T15:08:34.000+02:00",
      "cloture": null
    }
  },
  "demandeurs": {
    "acteur": {
      "nom": "Mme Bénédicte PEYROL",
      "acteurRef": "PA718736"
    }
  },
  "organeReuniRef": null,
  "typeReunion": "DEP"
}