{
  "@xmlns": "http://schemas.assemblee-nationale.fr/referentiel",
  "@xmlns:xsi": "http://www.w3.org/2001/XMLSchema-instance",
  "@xsi:type": "reunionInitParlementaire_type",
  "uid": "RUANR5L15S2019IDF0127010",
  "timeStampDebut": "2019-03-26T08:30:00.000+01:00",
  "timeStampFin": "2019-03-26T10:00:00.000+01:00",
  "lieu": {
    "code": "SALREU006",
    "libelleCourt": "3ème Bureau",
    "libelleLong": "3ème Bureau, Palais Bourbon"
  },
  "cycleDeVie": {
    "etat": "Annulé",
    "chrono": {
      "creation": "2019-02-06T15:48:07.000+01:00",
      "cloture": "2019-03-22T12:54:13.000+01:00"
    }
  },
  "demandeurs": {
    "acteur": {
      "nom": "M. Jean-Carles GRELIER",
      "acteurRef": "PA267318"
    }
  },
  "organeReuniRef": null,
  "typeReunion": "DEP"
}