{
  "@xmlns": "http://schemas.assemblee-nationale.fr/referentiel",
  "@xmlns:xsi": "http://www.w3.org/2001/XMLSchema-instance",
  "@xsi:type": "reunionInitParlementaire_type",
  "uid": "RUANR5L15S2019IDF0128445",
  "timeStampDebut": "2019-03-05T16:00:00.000+01:00",
  "timeStampFin": "2019-03-05T17:00:00.000+01:00",
  "lieu": {
    "code": "SALREU020",
    "libelleCourt": "Salon Mars II",
    "libelleLong": "Salon Mars II, 101, rue de l'Université"
  },
  "cycleDeVie": {
    "etat": "Confirmé",
    "chrono": {
      "creation": "2019-02-22T09:16:58.000+01:00",
      "cloture": null
    }
  },
  "demandeurs": {
    "acteur": {
      "nom": "Mme Christine PIRES BEAUNE",
      "acteurRef": "PA608172"
    }
  },
  "organeReuniRef": null,
  "typeReunion": "DEP"
}