{
  "@xmlns": "http://schemas.assemblee-nationale.fr/referentiel",
  "@xmlns:xsi": "http://www.w3.org/2001/XMLSchema-instance",
  "@xsi:type": "reunionInitParlementaire_type",
  "uid": "RUANR5L15S2018IDF0107461",
  "timeStampDebut": "2018-04-04T16:30:00.000+02:00",
  "timeStampFin": "2018-04-04T17:30:00.000+02:00",
  "lieu": {
    "code": "SALREU017",
    "libelleCourt": "Salon Visconti",
    "libelleLong": "Salon Visconti, 101, rue de l'Université"
  },
  "cycleDeVie": {
    "etat": "Confirmé",
    "chrono": {
      "creation": "2018-03-12T17:00:56.000+02:00",
      "cloture": null
    }
  },
  "demandeurs": {
    "acteur": [
      {
        "nom": "Mme Catherine OSSON",
        "acteurRef": "PA720492"
      },
      {
        "nom": "Mme Aina KURIC",
        "acteurRef": "PA720214"
      }
    ]
  },
  "organeReuniRef": null,
  "typeReunion": "DEP"
}