{
  "@xmlns": "http://schemas.assemblee-nationale.fr/referentiel",
  "@xmlns:xsi": "http://www.w3.org/2001/XMLSchema-instance",
  "@xsi:type": "reunionCommission_type",
  "uid": "RUANR5L15S2019IDC431125",
  "timeStampDebut": "2019-01-16T08:00:00.000+01:00",
  "lieu": {
    "libelleLong": "ambassade d’Autriche, 6 rue Fabert, Paris 7e"
  },
  "cycleDeVie": {
    "etat": "Confirmé",
    "chrono": {
      "creation": "2019-01-08T00:00:00.000+01:00",
      "cloture": null
    }
  },
  "organeReuniRef": "PO733262",
  "demandeur": null,
  "participants": {
    "participantsInternes": null,
    "personnesAuditionnees": null
  },
  "sessionRef": null,
  "ouverturePresse": "false",
  "captationVideo": "false",
  "ODJ": {
    "convocationODJ": {
      "item": "Petit déjeuner offert par Son Exc. M. Michael Linhart, ambassadeur d’Autriche en France, en l’honneur des membres du groupe d’amitié France-Autriche, présidé par M. Sylvain Waserman"
    },
    "resumeODJ": {
      "item": "Petit déjeuner offert par Son Exc. M. Michael Linhart, ambassadeur d’Autriche en France, en l’honneur des membres du groupe d’amitié France-Autriche, présidé par M. Sylvain Waserman"
    },
    "pointsODJ": null
  },
  "compteRenduRef": null,
  "formatReunion": "Ordinaire",
  "infosReunionsInternationale": {
    "estReunionInternationale": "true",
    "listePays": {
      "paysRef": "GOP756402"
    },
    "informationsComplementaires": "Valérie Checketts – 34379"
  }
}