{
  "@xmlns": "http://schemas.assemblee-nationale.fr/referentiel",
  "@xmlns:xsi": "http://www.w3.org/2001/XMLSchema-instance",
  "@xsi:type": "reunionCommission_type",
  "uid": "RUANR5L15S2020IDC434342",
  "timeStampDebut": "2019-12-16T15:45:00.000+01:00",
  "lieu": {
    "libelleLong": "salle 6350 (Finances)"
  },
  "cycleDeVie": {
    "etat": "Eventuel",
    "chrono": {
      "creation": "2019-11-21T00:00:00.000+01:00",
      "cloture": null
    }
  },
  "organeReuniRef": "PO59048",
  "demandeur": null,
  "participants": {
    "participantsInternes": null,
    "personnesAuditionnees": null
  },
  "sessionRef": null,
  "ouverturePresse": "true",
  "captationVideo": "true",
  "ODJ": {
    "convocationODJ": {
      "item": "Éventuellement, examen, en nouvelle lecture, en application de l’article 88 du Règlement, des amendements au projet de loi de finances pour 2020 (M. Joël GIRAUD, rapporteur général)"
    },
    "resumeODJ": {
      "item": "éventuellement, examen, en nouvelle lecture, en application de l’article 88 du Règlement, des amendements au projet de loi de finances pour 2020 (M. Joël Giraud, rapporteur général)."
    },
    "pointsODJ": null
  },
  "compteRenduRef": null,
  "formatReunion": "Ordinaire",
  "infosReunionsInternationale": {
    "estReunionInternationale": "false",
    "listePays": null,
    "informationsComplementaires": null
  }
}