{
  "@xmlns": "http://schemas.assemblee-nationale.fr/referentiel",
  "@xmlns:xsi": "http://www.w3.org/2001/XMLSchema-instance",
  "@xsi:type": "reunionCommission_type",
  "uid": "RUANR5L15S2018IDC428059",
  "timeStampDebut": "2017-12-20T17:00:00.000+01:00",
  "lieu": {
    "libelleLong": "salle 4204 - 33 rue Saint-Dominique, 2ème étage"
  },
  "cycleDeVie": {
    "etat": "Confirmé",
    "chrono": {
      "creation": "2017-12-06T00:00:00.000+01:00",
      "cloture": null
    }
  },
  "organeReuniRef": "PO744155",
  "demandeur": null,
  "participants": {
    "participantsInternes": null,
    "personnesAuditionnees": null
  },
  "sessionRef": null,
  "ouverturePresse": "false",
  "captationVideo": "false",
  "ODJ": {
    "convocationODJ": {
      "item": "Audition de S.E.M. Serge Segura, Ambassadeur chargé des océans."
    },
    "resumeODJ": {
      "item": "audition de S.E.M. Serge Segura, Ambassadeur chargé des océans."
    },
    "pointsODJ": null
  },
  "compteRenduRef": null,
  "formatReunion": "Ordinaire",
  "infosReunionsInternationale": {
    "estReunionInternationale": "false",
    "listePays": null,
    "informationsComplementaires": null
  }
}