{
  "uid": "RUANR5L15S2018IDF0104344",
  "timestampDebut": "2018-01-30T09:00:00.000+01:00",
  "timestampFin": "2018-01-30T10:00:00.000+01:00",
  "lieu": {
    "code": "SALREU016",
    "libelleCourt": "Salon Gabriel",
    "libelleLong": "Salon Gabriel, 101, rue de l'Université"
  },
  "cycleDeVie": {
    "etat": "Confirmé",
    "chrono": {
      "creation": "2018-01-24T18:22:52.000+01:00"
    }
  },
  "demandeurs": {
    "acteurs": [
      {
        "nom": "M. Julien DIVE",
        "acteurRef": "PA712015"
      }
    ]
  },
  "typeReunion": "DEP"
}