{
  "uid": "RUANR5L14S2018IDF0099480",
  "timestampDebut": "2017-11-15T08:00:00.000+01:00",
  "timestampFin": "2017-11-15T10:00:00.000+01:00",
  "lieu": {
    "code": "SALREU008",
    "libelleCourt": "5ème Bureau",
    "libelleLong": "5ème Bureau, Palais Bourbon"
  },
  "cycleDeVie": {
    "etat": "Confirmé",
    "chrono": {
      "creation": "2017-10-30T16:19:49.000+01:00"
    }
  },
  "demandeurs": {
    "acteurs": [
      {
        "nom": "M. Sylvain MAILLARD",
        "acteurRef": "PA717379"
      }
    ]
  },
  "typeReunion": "DEP"
}