{
  "uid": "RUANR5L15S2018IDF0106865",
  "timestampDebut": "2018-03-09T11:00:00.000+01:00",
  "timestampFin": "2018-03-09T12:30:00.000+01:00",
  "lieu": {
    "code": "SALREU022",
    "libelleCourt": "Salle 7326",
    "libelleLong": "Salle 7326, 101, rue de l'Université"
  },
  "cycleDeVie": {
    "etat": "Confirmé",
    "chrono": {
      "creation": "2018-03-05T10:12:44.000+01:00"
    }
  },
  "demandeurs": {
    "acteurs": [
      {
        "nom": "Mme Huguette BELLO",
        "acteurRef": "PA441"
      }
    ]
  },
  "typeReunion": "DEP"
}