{
  "uid": "RUANR5L15S2018IDC427355",
  "timestampDebut": "2017-10-05T12:15:00.000+02:00",
  "timestampFin": "2017-10-05T13:15:00.000+02:00",
  "lieu": {
    "libelleLong": "salle 6242 (Lois)"
  },
  "cycleDeVie": {
    "etat": "Confirmé",
    "chrono": {
      "creation": "2017-09-29T00:00:00.000+02:00"
    }
  },
  "organeReuniRef": "PO734519",
  "participants": {
    "participantsInternes": [
      {
        "acteurRef": "PA719600",
        "presence": "présent"
      },
      {
        "acteurRef": "PA721678",
        "presence": "présent"
      }
    ]
  },
  "ouverturePresse": true,
  "odj": {
    "convocationOdj": [
      "Audition de Mme Ruth Dreifuss, présidente de la Commission globale de politique en matière de drogues, de M. Michel Kazatchkine, membre, et de M. Khalid Tinasti, secrétaire exécutif."
    ],
    "resumeOdj": [
      "audition de Mme Ruth Dreifuss, présidente de la Commission globale de politique en matière de drogues, de M. Michel Kazatchkine et de M. Khalid Tinasti."
    ]
  }
}