{
  "uid": "RUANR5L14S2018IDF0098153",
  "timestampDebut": "2017-10-18T15:00:00.000+02:00",
  "timestampFin": "2017-10-18T17:00:00.000+02:00",
  "lieu": {
    "code": "SALREU016",
    "libelleCourt": "Salon Gabriel",
    "libelleLong": "Salon Gabriel, 101, rue de l'Université"
  },
  "cycleDeVie": {
    "etat": "Confirmé",
    "chrono": {
      "creation": "2017-10-06T14:07:27.000+02:00"
    }
  },
  "demandeurs": {
    "acteurs": [
      {
        "nom": "Mme Émilie CHALAS",
        "acteurRef": "PA719748"
      }
    ]
  },
  "typeReunion": "DEP"
}