{
  "uid": "RUANR5L14S2018IDF0102458",
  "timestampDebut": "2017-12-19T18:00:00.000+01:00",
  "timestampFin": "2017-12-19T19:00:00.000+01:00",
  "lieu": {
    "code": "SALREU046",
    "libelleCourt": "Sully 1",
    "libelleLong": "Sully 1, Palais Bourbon"
  },
  "cycleDeVie": {
    "etat": "Confirmé",
    "chrono": {
      "creation": "2017-12-14T18:22:26.000+01:00"
    }
  },
  "demandeurs": {
    "acteurs": [
      {
        "nom": "M. Matthieu ORPHELIN",
        "acteurRef": "PA720278"
      }
    ]
  },
  "typeReunion": "DEP"
}