{
  "uid": "RUANR5L15S2018IDC428138",
  "timestampDebut": "2018-01-25T10:00:00.000+01:00",
  "lieu": {
    "libelleLong": "salle 4013 (33 rue Saint-Dominique)"
  },
  "cycleDeVie": {
    "etat": "Confirmé",
    "chrono": {
      "creation": "2017-12-15T00:00:00.000+01:00"
    }
  },
  "organeReuniRef": "PO743795",
  "participants": {},
  "ouverturePresse": false,
  "odj": {
    "convocationOdj": [
      "Audition du général de corps aérien Jean-François Ferlet, direction du renseignement militaire ;"
    ],
    "resumeOdj": [
      "audition du général de corps aérien Jean-François Ferlet, direction du renseignement militaire."
    ]
  }
}