{
  "uid": "RUANR5L15S2018IDF0103245",
  "timestampDebut": "2018-02-01T14:00:00.000+01:00",
  "timestampFin": "2018-02-01T17:00:00.000+01:00",
  "lieu": {
    "code": "SALREU008",
    "libelleCourt": "5ème Bureau",
    "libelleLong": "5ème Bureau, Palais Bourbon"
  },
  "cycleDeVie": {
    "etat": "Confirmé",
    "chrono": {
      "creation": "2018-01-09T14:51:23.000+01:00"
    }
  },
  "demandeurs": {
    "acteurs": [
      {
        "nom": "M. Didier QUENTIN",
        "acteurRef": "PA2492"
      }
    ]
  },
  "typeReunion": "DEP"
}