{
  "uid": "RUANR5L14S2018IDF0101550",
  "timestampDebut": "2017-11-29T14:30:00.000+01:00",
  "timestampFin": "2017-11-29T15:00:00.000+01:00",
  "lieu": {
    "code": "SALREU017",
    "libelleCourt": "Salon Visconti",
    "libelleLong": "Salon Visconti, 101, rue de l'Université"
  },
  "cycleDeVie": {
    "etat": "Confirmé",
    "chrono": {
      "creation": "2017-11-28T19:51:54.000+01:00"
    }
  },
  "demandeurs": {
    "acteurs": [
      {
        "nom": "M. Franck RIESTER",
        "acteurRef": "PA335758"
      }
    ]
  },
  "typeReunion": "DEP"
}