{
  "uid": "RUANR5L15S2018IDC427675",
  "timestampDebut": "2017-11-09T09:35:00.000+01:00",
  "timestampFin": "2017-11-09T11:30:00.000+01:00",
  "lieu": {
    "libelleLong": "salle de la commission  (3e étage, 33 rue Saint-Dominique)"
  },
  "cycleDeVie": {
    "etat": "Confirmé",
    "chrono": {
      "creation": "2017-10-26T00:00:00.000+02:00"
    }
  },
  "organeReuniRef": "PO415287",
  "participants": {
    "participantsInternes": [
      {
        "acteurRef": "PA605036",
        "presence": "absent"
      },
      {
        "acteurRef": "PA721278",
        "presence": "présent"
      },
      {
        "acteurRef": "PA721158",
        "presence": "présent"
      },
      {
        "acteurRef": "PA719806",
        "presence": "présent"
      },
      {
        "acteurRef": "PA718756",
        "presence": "absent"
      },
      {
        "acteurRef": "PA642695",
        "presence": "présent"
      },
      {
        "acteurRef": "PA721608",
        "presence": "présent"
      },
      {
        "acteurRef": "PA720772",
        "presence": "présent"
      },
      {
        "acteurRef": "PA719170",
        "presence": "absent"
      },
      {
        "acteurRef": "PA267306",
        "presence": "présent"
      },
      {
        "acteurRef": "PA719194",
        "presence": "absent"
      },
      {
        "acteurRef": "PA1029",
        "presence": "absent"
      },
      {
        "acteurRef": "PA721398",
        "presence": "présent"
      },
      {
        "acteurRef": "PA720598",
        "presence": "présent"
      },
      {
        "acteurRef": "PA722382",
        "presence": "présent"
      },
      {
        "acteurRef": "PA719684",
        "presence": "absent"
      },
      {
        "acteurRef": "PA606202",
        "presence": "excusé"
      },
      {
        "acteurRef": "PA720684",
        "presence": "absent"
      },
      {
        "acteurRef": "PA720030",
        "presence": "absent"
      },
      {
        "acteurRef": "PA722284",
        "presence": "absent"
      },
      {
        "acteurRef": "PA721784",
        "presence": "absent"
      },
      {
        "acteurRef": "PA720170",
        "presence": "absent"
      },
      {
        "acteurRef": "PA722094",
        "presence": "présent"
      },
      {
        "acteurRef": "PA1630",
        "presence": "absent"
      },
      {
        "acteurRef": "PA721150",
        "presence": "absent"
      },
      {
        "acteurRef": "PA719060",
        "presence": "absent"
      },
      {
        "acteurRef": "PA335054",
        "presence": "excusé"
      },
      {
        "acteurRef": "PA1809",
        "presence": "présent"
      },
      {
        "acteurRef": "PA722228",
        "presence": "absent"
      },
      {
        "acteurRef": "PA1874",
        "presence": "absent"
      },
      {
        "acteurRef": "PA345722",
        "presence": "absent"
      },
      {
        "acteurRef": "PA720342",
        "presence": "excusé"
      },
      {
        "acteurRef": "PA720370",
        "presence": "présent"
      },
      {
        "acteurRef": "PA720738",
        "presence": "présent"
      },
      {
        "acteurRef": "PA721486",
        "presence": "présent"
      },
      {
        "acteurRef": "PA721960",
        "presence": "présent"
      },
      {
        "acteurRef": "PA720500",
        "presence": "présent"
      },
      {
        "acteurRef": "PA721372",
        "presence": "présent"
      },
      {
        "acteurRef": "PA2449",
        "presence": "absent"
      },
      {
        "acteurRef": "PA608011",
        "presence": "présent"
      },
      {
        "acteurRef": "PA2492",
        "presence": "absent"
      },
      {
        "acteurRef": "PA702052",
        "presence": "absent"
      },
      {
        "acteurRef": "PA719592",
        "presence": "présent"
      },
      {
        "acteurRef": "PA334654",
        "presence": "absent"
      },
      {
        "acteurRef": "PA267794",
        "presence": "absent"
      },
      {
        "acteurRef": "PA719550",
        "presence": "présent"
      },
      {
        "acteurRef": "PA719822",
        "presence": "présent"
      },
      {
        "acteurRef": "PA719302",
        "presence": "absent"
      }
    ]
  },
  "ouverturePresse": true,
  "odj": {
    "convocationOdj": [
      "Audition de MM. Guillaume Pepy, président du directoire de SNCF et président-directeur général de SNCF Mobilités, et Patrick Jeantet, président délégué du directoire de SNCF et président-directeur général de SNCF réseau ;",
      "Communication des référents de la commission des affaires économiques sur l'ouverture des négociations des accords de libre-échange avec l'Australie et la Nouvelle Zélande ;",
      "Nomination d'un référent ;",
      "Examen de textes soumis à l'Assemblée nationale en application de l'article 88-4 de la Constitution ;",
      "Examen de textes soumis à l'Assemblée nationale en application de l'article 88-6 de la Constitution."
    ],
    "resumeOdj": [
      "audition de MM. Guillaume Pepy, président du directoire de SNCF et président-directeur général de SNCF Mobilités, et Patrick Jeantet, président délégué du directoire de SNCF et président-directeur général de SNCF réseau ;",
      "communication des référents de la commission des affaires économiques sur l'ouverture des négociations des accords de libre-échange avec l'Australie et la Nouvelle Zélande ;",
      "nomination d'un référent ;",
      "examen de textes européens en application des articles 88-4 et 88-6 de la Constitution."
    ]
  },
  "compteRenduRef": "CRCANR5L15S2018PO415287N0014"
}