{
  "uid": "RUANR5L15S2018IDS20825",
  "timestampDebut": "2017-12-08T21:30:00.000+01:00",
  "lieu": {
    "code": "AN",
    "libelleLong": "Assemblée nationale"
  },
  "cycleDeVie": {
    "etat": "Supprimé",
    "chrono": {
      "creation": "2017-11-13T00:00:00.000+01:00",
      "cloture": "2017-12-08T00:00:00.000+01:00"
    }
  },
  "organeReuniRef": "PO717460",
  "sessionRef": "SCR5A2018O1",
  "ouverturePresse": true,
  "odj": {
    "pointsOdj": [
      {
        "xsiType": "podjSeanceConfPres_type",
        "uid": "RUANR5L15S2018IDS20825PT35326",
        "cycleDeVie": {
          "etat": "Supprimé",
          "chrono": {
            "creation": "2017-11-13T00:00:00.000+01:00",
            "cloture": "2017-12-08T00:00:00.000+01:00"
          }
        },
        "objet": "Suite de la discussion du projet de loi de finances rectificative pour 2017 (2)",
        "typePointOdj": "Suite de la discussion",
        "comiteSecret": false,
        "natureTravauxOdj": "ODJPR"
      }
    ]
  },
  "identifiants": {
    "quantieme": "Troisième",
    "dateSeance": "2017-12-08T01:00:00.000+01:00"
  }
}