{
  "uid": "RUANR5L14S2018IDF0102295",
  "timestampDebut": "2017-12-18T10:00:00.000+01:00",
  "timestampFin": "2017-12-18T12:30:00.000+01:00",
  "lieu": {
    "code": "SALREU023",
    "libelleCourt": "Salle 7426",
    "libelleLong": "Salle 7426, 101, rue de l'Université"
  },
  "cycleDeVie": {
    "etat": "Confirmé",
    "chrono": {
      "creation": "2017-12-13T14:23:13.000+01:00"
    }
  },
  "demandeurs": {
    "acteurs": [
      {
        "nom": "Mme Bénédicte TAURINE",
        "acteurRef": "PA718860"
      }
    ]
  },
  "typeReunion": "DEP"
}