{
  "uid": "RUANR5L15S2018IDC428092",
  "timestampDebut": "2017-12-13T11:00:00.000+01:00",
  "lieu": {
    "libelleLong": "salle 4204 - 33 rue Saint-Dominique, 2ème étage"
  },
  "cycleDeVie": {
    "etat": "Confirmé",
    "chrono": {
      "creation": "2017-12-08T00:00:00.000+01:00"
    }
  },
  "organeReuniRef": "PO744338",
  "participants": {},
  "ouverturePresse": false,
  "odj": {
    "convocationOdj": [
      "Audition de M. Jean-Marie Collin, expert pour la Campagne internationale pour abolir les armes nucléaires (ICAN), vice-président des Initiatives pour le Désarmement Nucléaire (IDN)."
    ],
    "resumeOdj": [
      "Audition de M. Jean-Marie Collin, expert pour la Campagne internationale pour abolir les armes nucléaires (ICAN), vice-président des Initiatives pour le Désarmement Nucléaire (IDN)."
    ]
  }
}