{
  "uid": "RUANR5L14S2018IDF0096061",
  "timestampDebut": "2017-10-13T09:30:00.000+02:00",
  "timestampFin": "2017-10-13T12:30:00.000+02:00",
  "lieu": {
    "code": "SALREU017",
    "libelleCourt": "Salon Visconti",
    "libelleLong": "Salon Visconti, 101, rue de l'Université"
  },
  "cycleDeVie": {
    "etat": "Confirmé",
    "chrono": {
      "creation": "2017-09-11T17:51:52.000+02:00"
    }
  },
  "demandeurs": {
    "acteurs": [
      {
        "nom": "Mme Émilie CHALAS",
        "acteurRef": "PA719748"
      }
    ]
  },
  "typeReunion": "DEP"
}