{
  "uid": "RUANR5L14S2018IDF0096613",
  "timestampDebut": "2018-02-08T18:00:00.000+01:00",
  "timestampFin": "2018-02-08T22:00:00.000+01:00",
  "lieu": {
    "code": "SALREU003",
    "libelleCourt": "Salle Victor Hugo",
    "libelleLong": "Salle Victor Hugo, 101, rue de l'Université"
  },
  "cycleDeVie": {
    "etat": "Confirmé",
    "chrono": {
      "creation": "2017-09-19T16:58:09.000+02:00"
    }
  },
  "demandeurs": {
    "acteurs": [
      {
        "nom": "Mme Naïma MOUTCHOU",
        "acteurRef": "PA720908"
      }
    ]
  },
  "typeReunion": "DEP"
}