{
  "uid": "RUANR5L15S2018IDC428526",
  "timestampDebut": "2018-02-22T09:00:00.000+01:00",
  "timestampFin": "2018-02-22T10:15:00.000+01:00",
  "lieu": {
    "libelleLong": "salle 6237 (Développement durable)"
  },
  "cycleDeVie": {
    "etat": "Confirmé",
    "chrono": {
      "creation": "2018-02-08T00:00:00.000+01:00"
    }
  },
  "organeReuniRef": "PO748336",
  "participants": {
    "participantsInternes": [
      {
        "acteurRef": "PA720242",
        "presence": "présent"
      },
      {
        "acteurRef": "PA609726",
        "presence": "présent"
      },
      {
        "acteurRef": "PA721522",
        "presence": "présent"
      },
      {
        "acteurRef": "PA720162",
        "presence": "absent"
      },
      {
        "acteurRef": "PA267233",
        "presence": "excusé"
      },
      {
        "acteurRef": "PA718838",
        "presence": "présent"
      },
      {
        "acteurRef": "PA720298",
        "presence": "présent"
      },
      {
        "acteurRef": "PA719440",
        "presence": "excusé"
      },
      {
        "acteurRef": "PA642868",
        "presence": "absent"
      },
      {
        "acteurRef": "PA718850",
        "presence": "absent"
      },
      {
        "acteurRef": "PA942",
        "presence": "absent"
      },
      {
        "acteurRef": "PA720198",
        "presence": "absent"
      },
      {
        "acteurRef": "PA267735",
        "presence": "absent"
      },
      {
        "acteurRef": "PA720560",
        "presence": "absent"
      },
      {
        "acteurRef": "PA720202",
        "presence": "présent"
      },
      {
        "acteurRef": "PA719310",
        "presence": "présent"
      },
      {
        "acteurRef": "PA719412",
        "presence": "présent"
      },
      {
        "acteurRef": "PA721876",
        "presence": "présent"
      },
      {
        "acteurRef": "PA720334",
        "presence": "présent"
      },
      {
        "acteurRef": "PA720892",
        "presence": "absent"
      },
      {
        "acteurRef": "PA720414",
        "presence": "absent"
      },
      {
        "acteurRef": "PA718910",
        "presence": "présent"
      },
      {
        "acteurRef": "PA609520",
        "presence": "absent"
      },
      {
        "acteurRef": "PA2449",
        "presence": "absent"
      },
      {
        "acteurRef": "PA721916",
        "presence": "excusé"
      },
      {
        "acteurRef": "PA720552",
        "presence": "absent"
      },
      {
        "acteurRef": "PA340343",
        "presence": "présent"
      },
      {
        "acteurRef": "PA721314",
        "presence": "absent"
      },
      {
        "acteurRef": "PA722110",
        "presence": "absent"
      },
      {
        "acteurRef": "PA718962",
        "presence": "absent"
      }
    ]
  },
  "ouverturePresse": true,
  "odj": {
    "convocationOdj": [
      "– Audition de M. Jean-Christophe Niel directeur général de l’Institut de radioprotection et de sûreté nucléaire (IRSN) ;"
    ],
    "resumeOdj": [
      "audition de M. Jean-Christophe Niel, directeur général de l’Institut de radioprotection et de sûreté nucléaire (IRSN)."
    ]
  }
}