{
  "uid": "RUANR5L14S2018IDF0100913",
  "timestampDebut": "2017-12-06T13:30:00.000+01:00",
  "timestampFin": "2017-12-06T15:00:00.000+01:00",
  "lieu": {
    "code": "SALREU005",
    "libelleCourt": "2ème Bureau",
    "libelleLong": "2ème Bureau, Palais Bourbon"
  },
  "cycleDeVie": {
    "etat": "Confirmé",
    "chrono": {
      "creation": "2017-11-17T12:35:33.000+01:00"
    }
  },
  "demandeurs": {
    "acteurs": [
      {
        "nom": "M. André CHASSAIGNE",
        "acteurRef": "PA267306"
      }
    ]
  },
  "typeReunion": "DEP"
}