{
  "uid": "RUANR5L15S2018IDC428106",
  "timestampDebut": "2017-12-19T17:30:00.000+01:00",
  "lieu": {
    "libelleLong": "salle 4013 (33 rue Saint-Dominique)"
  },
  "cycleDeVie": {
    "etat": "Confirmé",
    "chrono": {
      "creation": "2017-12-08T00:00:00.000+01:00"
    }
  },
  "organeReuniRef": "PO743795",
  "participants": {},
  "ouverturePresse": false,
  "odj": {
    "convocationOdj": [
      "Audition du Général Bernard Barrera, sous-chef plans et programmes de l’état-major de l’armée de terre."
    ],
    "resumeOdj": [
      "audition du Général Bernard Barrera, sous-chef plans et programmes de l’état-major de l’armée de terre."
    ]
  }
}