{
  "uid": "RUANR5L14S2017IDF0093466",
  "timestampDebut": "2017-07-11T13:30:00.000+02:00",
  "timestampFin": "2017-07-11T15:00:00.000+02:00",
  "lieu": {
    "code": "SALREU010",
    "libelleCourt": "Salle N° 1",
    "libelleLong": "Salle N° 1, 3, rue Aristide Briand"
  },
  "cycleDeVie": {
    "etat": "Confirmé",
    "chrono": {
      "creation": "2017-07-05T12:17:15.000+02:00"
    }
  },
  "demandeurs": {
    "acteurs": [
      {
        "nom": "Mme Cécile UNTERMAIER",
        "acteurRef": "PA608695"
      }
    ]
  },
  "typeReunion": "DEP"
}