{
  "uid": "RUANR5L14S2018IDF0100396",
  "timestampDebut": "2018-02-15T12:30:00.000+01:00",
  "timestampFin": "2018-02-15T18:00:00.000+01:00",
  "lieu": {
    "code": "SALREU003",
    "libelleCourt": "Salle Victor Hugo",
    "libelleLong": "Salle Victor Hugo, 101, rue de l'Université"
  },
  "cycleDeVie": {
    "etat": "Confirmé",
    "chrono": {
      "creation": "2017-11-15T10:02:14.000+01:00"
    }
  },
  "demandeurs": {
    "acteurs": [
      {
        "nom": "M. Patrick MIGNOLA",
        "acteurRef": "PA721418"
      }
    ]
  },
  "typeReunion": "DEP"
}