{
  "uid": "RUANR5L14S2018IDF0098207",
  "timestampDebut": "2017-10-10T14:45:00.000+02:00",
  "timestampFin": "2017-10-10T16:15:00.000+02:00",
  "lieu": {
    "code": "SALREU022",
    "libelleCourt": "Salle 7326",
    "libelleLong": "Salle 7326, 101, rue de l'Université"
  },
  "cycleDeVie": {
    "etat": "Annulé",
    "chrono": {
      "creation": "2017-10-09T14:03:48.000+02:00",
      "cloture": "2017-10-09T14:35:01.000+02:00"
    }
  },
  "demandeurs": {
    "acteurs": [
      {
        "nom": "Mme Danièle HÉRIN",
        "acteurRef": "PA718794"
      }
    ]
  },
  "typeReunion": "DEP"
}