{
  "uid": "RUANR5L15S2017IDS20661",
  "timestampDebut": "2017-07-28T09:30:00.000+02:00",
  "timestampFin": "2017-07-28T13:35:00.000+02:00",
  "lieu": {
    "code": "AN",
    "libelleLong": "Assemblée nationale"
  },
  "cycleDeVie": {
    "etat": "Confirmé",
    "chrono": {
      "creation": "2017-07-24T00:00:00.000+02:00"
    }
  },
  "organeReuniRef": "PO717460",
  "sessionRef": "SCR5A2017E1",
  "ouverturePresse": true,
  "odj": {
    "pointsOdj": [
      {
        "xsiType": "podjSeanceConfPres_type",
        "uid": "RUANR5L15S2017IDS20661PT35041",
        "cycleDeVie": {
          "etat": "Supprimé",
          "chrono": {
            "creation": "2017-07-24T00:00:00.000+02:00",
            "cloture": "2017-07-24T00:00:00.000+02:00"
          }
        },
        "objet": "Éventuellement, suite de la discussion, soit sur le rapport de la commission mixte paritaire, soit en nouvelle lecture, du projet de loi de règlement du budget et d’approbation des comptes de l'année 2016",
        "typePointOdj": "Suite de la discussion",
        "comiteSecret": false,
        "natureTravauxOdj": "ODJPR"
      },
      {
        "xsiType": "podjSeanceConfPres_type",
        "uid": "RUANR5L15S2017IDS20661PT35042",
        "cycleDeVie": {
          "etat": "Eventuel",
          "chrono": {
            "creation": "2017-07-24T00:00:00.000+02:00"
          }
        },
        "objet": "Suite de la discussion du projet de loi, adopté par le Sénat après engagement de la procédure accélérée, pour la confiance dans la vie publique",
        "dossiersLegislatifsRefs": [
          "DLR5L14N35825"
        ],
        "typePointOdj": "Suite de la discussion",
        "comiteSecret": false,
        "natureTravauxOdj": "ODJPR"
      },
      {
        "xsiType": "podjSeanceConfPres_type",
        "uid": "RUANR5L15S2017IDS20661PT35043",
        "cycleDeVie": {
          "etat": "Eventuel",
          "chrono": {
            "creation": "2017-07-24T00:00:00.000+02:00"
          }
        },
        "objet": "Suite de la discussion du projet de loi organique, adopté par le Sénat après engagement de la procédure accélérée, pour la confiance dans la vie publique",
        "typePointOdj": "Suite de la discussion",
        "comiteSecret": false,
        "natureTravauxOdj": "ODJPR"
      }
    ]
  },
  "compteRenduRef": "CRSANR5L15S2017E1N026",
  "identifiants": {
    "numSeanceJo": "26",
    "idJo": "20171026",
    "quantieme": "Première",
    "dateSeance": "2017-07-28T02:00:00.000+02:00"
  }
}