{
  "uid": "RUANR5L14S2018IDF0101893",
  "timestampDebut": "2018-02-28T11:00:00.000+01:00",
  "timestampFin": "2018-02-28T14:30:00.000+01:00",
  "lieu": {
    "code": "SALREU007",
    "libelleCourt": "4ème Bureau",
    "libelleLong": "4ème Bureau, Palais Bourbon"
  },
  "cycleDeVie": {
    "etat": "Confirmé",
    "chrono": {
      "creation": "2017-12-05T12:25:13.000+01:00"
    }
  },
  "demandeurs": {
    "acteurs": [
      {
        "nom": "Mme Aurore BERGÉ",
        "acteurRef": "PA722046"
      }
    ]
  },
  "typeReunion": "DEP"
}