{
  "uid": "RUANR5L14S2018IDF0098994",
  "timestampDebut": "2017-10-26T15:30:00.000+02:00",
  "timestampFin": "2017-10-26T17:00:00.000+02:00",
  "lieu": {
    "code": "SALREU020",
    "libelleCourt": "Salon Mars II",
    "libelleLong": "Salon Mars II, 101, rue de l'Université"
  },
  "cycleDeVie": {
    "etat": "Confirmé",
    "chrono": {
      "creation": "2017-10-19T15:35:33.000+02:00"
    }
  },
  "demandeurs": {
    "acteurs": [
      {
        "nom": "M. Vincent BRU",
        "acteurRef": "PA720772"
      },
      {
        "nom": "M. Patrice ANATO",
        "acteurRef": "PA721278"
      }
    ]
  },
  "typeReunion": "DEP"
}