{
  "uid": "RUANR5L14S2018IDF0097977",
  "timestampDebut": "2017-10-10T12:00:00.000+02:00",
  "timestampFin": "2017-10-10T13:30:00.000+02:00",
  "lieu": {
    "code": "SALREU011",
    "libelleCourt": "Salle N° 2",
    "libelleLong": "Salle N° 2, 3, rue Aristide Briand"
  },
  "cycleDeVie": {
    "etat": "Confirmé",
    "chrono": {
      "creation": "2017-10-04T18:58:12.000+02:00"
    }
  },
  "demandeurs": {
    "acteurs": [
      {
        "nom": "M. Sébastien CHENU",
        "acteurRef": "PA720468"
      }
    ]
  },
  "typeReunion": "DEP"
}