{
  "uid": "RUANR5L14S2018IDF0101379",
  "timestampDebut": "2017-11-29T14:00:00.000+01:00",
  "timestampFin": "2017-11-29T15:00:00.000+01:00",
  "lieu": {
    "code": "SALREU012",
    "libelleCourt": "Salle N° 23",
    "libelleLong": "Salle N° 23, 3, rue Aristide Briand"
  },
  "cycleDeVie": {
    "etat": "Confirmé",
    "chrono": {
      "creation": "2017-11-24T14:52:42.000+01:00"
    }
  },
  "demandeurs": {
    "acteurs": [
      {
        "nom": "Mme Cécile UNTERMAIER",
        "acteurRef": "PA608695"
      },
      {
        "nom": "M. François RUFFIN",
        "acteurRef": "PA722142"
      }
    ]
  },
  "typeReunion": "DEP"
}