{
  "uid": "RUANR5L15S2018IDF0103490",
  "timestampDebut": "2018-01-17T11:00:00.000+01:00",
  "timestampFin": "2018-01-17T12:00:00.000+01:00",
  "lieu": {
    "code": "SALREU021",
    "libelleCourt": "Salle 7207",
    "libelleLong": "Salle 7207, 101, rue de l'Université"
  },
  "cycleDeVie": {
    "etat": "Confirmé",
    "chrono": {
      "creation": "2018-01-12T09:07:24.000+01:00"
    }
  },
  "demandeurs": {
    "acteurs": [
      {
        "nom": "Mme Christine PIRES BEAUNE",
        "acteurRef": "PA608172"
      }
    ]
  },
  "typeReunion": "DEP"
}