{
  "uid": "RUANR5L14S2018IDF0102761",
  "timestampDebut": "2017-12-20T18:30:00.000+01:00",
  "timestampFin": "2017-12-20T20:30:00.000+01:00",
  "lieu": {
    "code": "SALREU012",
    "libelleCourt": "Salle N° 23",
    "libelleLong": "Salle N° 23, 3, rue Aristide Briand"
  },
  "cycleDeVie": {
    "etat": "Confirmé",
    "chrono": {
      "creation": "2017-12-20T13:27:58.000+01:00"
    }
  },
  "demandeurs": {
    "acteurs": [
      {
        "nom": "Mme Valérie RABAULT",
        "acteurRef": "PA609590"
      }
    ]
  },
  "typeReunion": "DEP"
}