{
  "uid": "RUANR5L14S2017IDF0094733",
  "timestampDebut": "2017-09-12T14:30:00.000+02:00",
  "timestampFin": "2017-09-12T15:30:00.000+02:00",
  "lieu": {
    "code": "SALREU007",
    "libelleCourt": "4ème Bureau",
    "libelleLong": "4ème Bureau, Palais Bourbon"
  },
  "cycleDeVie": {
    "etat": "Annulé",
    "chrono": {
      "creation": "2017-07-25T18:15:56.000+02:00",
      "cloture": "2017-09-11T11:16:57.000+02:00"
    }
  },
  "demandeurs": {
    "acteurs": [
      {
        "nom": "M. Yves JÉGO",
        "acteurRef": "PA267801"
      }
    ]
  },
  "typeReunion": "DEP"
}