{
  "uid": "RUANR5L15S2018IDF0105867",
  "timestampDebut": "2018-03-13T18:00:00.000+01:00",
  "timestampFin": "2018-03-13T19:00:00.000+01:00",
  "lieu": {
    "code": "SALREU013",
    "libelleCourt": "Salle N° 3",
    "libelleLong": "Salle N° 3, 3, rue Aristide Briand"
  },
  "cycleDeVie": {
    "etat": "Annulé",
    "chrono": {
      "creation": "2018-02-15T11:11:06.000+01:00",
      "cloture": "2018-03-07T19:32:01.000+01:00"
    }
  },
  "demandeurs": {
    "acteurs": [
      {
        "nom": "Mme Laurence MAILLART-MÉHAIGNERIE",
        "acteurRef": "PA719718"
      }
    ]
  },
  "typeReunion": "DEP"
}