{
  "uid": "RUANR5L14S2017IDF0095219",
  "timestampDebut": "2017-09-12T15:00:00.000+02:00",
  "timestampFin": "2017-09-12T16:30:00.000+02:00",
  "lieu": {
    "code": "SALREU018",
    "libelleCourt": "Salon Mansart",
    "libelleLong": "Salon Mansart, 101, rue de l'Université"
  },
  "cycleDeVie": {
    "etat": "Annulé",
    "chrono": {
      "creation": "2017-08-07T11:50:03.000+02:00",
      "cloture": "2017-09-06T18:45:19.000+02:00"
    }
  },
  "demandeurs": {
    "acteurs": [
      {
        "nom": "M. Stanislas GUERINI",
        "acteurRef": "PA721498"
      }
    ]
  },
  "typeReunion": "DEP"
}