{
  "uid": "RUANR5L14S2018IDF0101800",
  "timestampDebut": "2017-12-06T19:00:00.000+01:00",
  "timestampFin": "2017-12-06T21:00:00.000+01:00",
  "lieu": {
    "code": "SALREU018",
    "libelleCourt": "Salon Mansart",
    "libelleLong": "Salon Mansart, 101, rue de l'Université"
  },
  "cycleDeVie": {
    "etat": "Confirmé",
    "chrono": {
      "creation": "2017-12-04T15:02:03.000+01:00"
    }
  },
  "demandeurs": {
    "acteurs": [
      {
        "nom": "M. Éric BOTHOREL",
        "acteurRef": "PA642695"
      }
    ]
  },
  "typeReunion": "DEP"
}