{
  "uid": "RUANR5L14S2018IDF0094589",
  "timestampDebut": "2017-11-28T14:00:00.000+01:00",
  "timestampFin": "2017-11-28T15:00:00.000+01:00",
  "lieu": {
    "code": "SALREU003",
    "libelleCourt": "Salle Victor Hugo",
    "libelleLong": "Salle Victor Hugo, 101, rue de l'Université"
  },
  "cycleDeVie": {
    "etat": "Confirmé",
    "chrono": {
      "creation": "2017-07-24T15:40:57.000+02:00"
    }
  },
  "demandeurs": {
    "acteurs": [
      {
        "nom": "Mme Amélie DE MONTCHALIN",
        "acteurRef": "PA721670"
      }
    ]
  },
  "typeReunion": "DEP"
}