{
  "uid": "RUANR5L14S2018IDF0093508",
  "timestampDebut": "2017-10-03T09:30:00.000+02:00",
  "timestampFin": "2017-10-03T10:45:00.000+02:00",
  "lieu": {
    "code": "SALREU027",
    "libelleCourt": "Salle 6217",
    "libelleLong": "Salle 6217, Palais Bourbon"
  },
  "cycleDeVie": {
    "etat": "Confirmé",
    "chrono": {
      "creation": "2017-07-06T11:32:45.000+02:00"
    }
  },
  "demandeurs": {
    "acteurs": [
      {
        "nom": "M. Christian JACOB",
        "acteurRef": "PA1695"
      }
    ]
  },
  "typeReunion": "DEP"
}