{
  "uid": "RUANR5L15S2018IDF0104910",
  "timestampDebut": "2018-02-21T16:00:00.000+01:00",
  "timestampFin": "2018-02-21T19:00:00.000+01:00",
  "lieu": {
    "code": "SALREU022",
    "libelleCourt": "Salle 7326",
    "libelleLong": "Salle 7326, 101, rue de l'Université"
  },
  "cycleDeVie": {
    "etat": "Confirmé",
    "chrono": {
      "creation": "2018-02-01T11:59:03.000+01:00"
    }
  },
  "demandeurs": {
    "acteurs": [
      {
        "nom": "M. Luc CARVOUNAS",
        "acteurRef": "PA429893"
      }
    ]
  },
  "typeReunion": "DEP"
}