{
  "uid": "RUANR5L15S2018IDC427742",
  "timestampDebut": "2017-11-16T13:00:00.000+01:00",
  "timestampFin": "2017-11-16T15:05:00.000+01:00",
  "lieu": {
    "libelleLong": "salle 4223 (33 rue Saint-Dominique)"
  },
  "cycleDeVie": {
    "etat": "Confirmé",
    "chrono": {
      "creation": "2017-11-06T00:00:00.000+01:00"
    }
  },
  "organeReuniRef": "PO734671",
  "participants": {
    "participantsInternes": [
      {
        "acteurRef": "PA330357",
        "presence": "excusé"
      },
      {
        "acteurRef": "PA267042",
        "presence": "excusé"
      },
      {
        "acteurRef": "PA605991",
        "presence": "excusé"
      },
      {
        "acteurRef": "PA718868",
        "presence": "présent"
      },
      {
        "acteurRef": "PA606712",
        "presence": "présent"
      },
      {
        "acteurRef": "PA334116",
        "presence": "présent"
      },
      {
        "acteurRef": "PA720728",
        "presence": "excusé"
      },
      {
        "acteurRef": "PA721270",
        "presence": "excusé"
      },
      {
        "acteurRef": "PA718910",
        "presence": "excusé"
      },
      {
        "acteurRef": "PA720394",
        "presence": "présent"
      }
    ]
  },
  "ouverturePresse": false,
  "odj": {
    "convocationOdj": [
      "À 13 heures\n– Synthèse des contributions déposées sur le site de l’Assemblée nationale et des contributions directement transmises au groupe de travail\nÀ 13 heures 45\n– Audition de M. Mickaël LEVY et Mme Trixie MEYSSONNIER, Secrétaires généraux du Syndicat national des collaborateurs parlementaires – Force ouvrière (SNCP-FO)\nÀ 14 heures 30\n– Audition de Mme Florence FAYE, Secrétaire générale, et Mme Astrid MORNE, Secrétaire générale adjointe, du syndicat Union nationale des syndicats autonomes - Union syndicale des collaborateurs parlementaires (UNSA-USCP)"
    ],
    "resumeOdj": [
      "à 13 heures : synthèse des contributions déposées sur le site de l’Assemblée nationale et des contributions directement transmises au groupe de travail ;",
      "à 13 heures 45  : audition de M. Mickaël Levy et Mme Trixie Meyssonnier, Secrétaires généraux du Syndicat national des collaborateurs parlementaires – Force ouvrière (SNCP-FO) ;",
      "à 14 heures 30 : audition de Mme Florence Faye, Secrétaire générale, et Mme Astrid Morne, Secrétaire générale adjointe, du syndicat Union nationale des syndicats autonomes – Union syndicale des collaborateurs parlementaires (UNSA-USCP)."
    ]
  }
}