{
  "uid": "RUANR5L14S2018IDF0100040",
  "timestampDebut": "2017-11-09T20:00:00.000+01:00",
  "timestampFin": "2017-11-09T21:00:00.000+01:00",
  "lieu": {
    "code": "SALREU006",
    "libelleCourt": "3ème Bureau",
    "libelleLong": "3ème Bureau, Palais Bourbon"
  },
  "cycleDeVie": {
    "etat": "Confirmé",
    "chrono": {
      "creation": "2017-11-09T14:43:46.000+01:00"
    }
  },
  "demandeurs": {
    "acteurs": [
      {
        "nom": "Mme Carole BUREAU-BONNARD",
        "acteurRef": "PA720622"
      }
    ]
  },
  "typeReunion": "DEP"
}