{
  "uid": "RUANR5L14S2018IDF0095235",
  "timestampDebut": "2017-10-03T14:00:00.000+02:00",
  "timestampFin": "2017-10-03T18:30:00.000+02:00",
  "lieu": {
    "code": "SALREU016",
    "libelleCourt": "Salon Gabriel",
    "libelleLong": "Salon Gabriel, 101, rue de l'Université"
  },
  "cycleDeVie": {
    "etat": "Confirmé",
    "chrono": {
      "creation": "2017-08-07T14:31:11.000+02:00"
    }
  },
  "demandeurs": {
    "acteurs": [
      {
        "nom": "M. Mohamed LAQHILA",
        "acteurRef": "PA718978"
      }
    ]
  },
  "typeReunion": "DEP"
}