{
  "uid": "RUANR5L14S2018IDF0099685",
  "timestampDebut": "2017-11-15T11:00:00.000+01:00",
  "timestampFin": "2017-11-15T12:00:00.000+01:00",
  "lieu": {
    "code": "SALREU013",
    "libelleCourt": "Salle N° 3",
    "libelleLong": "Salle N° 3, 3, rue Aristide Briand"
  },
  "cycleDeVie": {
    "etat": "Confirmé",
    "chrono": {
      "creation": "2017-11-02T17:32:45.000+01:00"
    }
  },
  "demandeurs": {
    "acteurs": [
      {
        "nom": "Mme Michèle DE VAUCOULEURS",
        "acteurRef": "PA721924"
      }
    ]
  },
  "typeReunion": "DEP"
}