{
  "uid": "RUANR5L14S2017IDF0095989",
  "timestampDebut": "2017-09-19T14:45:00.000+02:00",
  "timestampFin": "2017-09-19T16:00:00.000+02:00",
  "lieu": {
    "code": "SALREU048",
    "libelleCourt": "Salle 6809",
    "libelleLong": "Salle 6809, Palais Bourbon"
  },
  "cycleDeVie": {
    "etat": "Confirmé",
    "chrono": {
      "creation": "2017-09-11T11:36:04.000+02:00"
    }
  },
  "demandeurs": {
    "acteurs": [
      {
        "nom": "Mme Isabelle VALENTIN",
        "acteurRef": "PA643134"
      }
    ]
  },
  "typeReunion": "DEP"
}