{
  "uid": "RUANR5L14S2018IDF0102603",
  "timestampDebut": "2018-01-30T20:00:00.000+01:00",
  "timestampFin": "2018-01-30T22:30:00.000+01:00",
  "lieu": {
    "code": "SALREU007",
    "libelleCourt": "4ème Bureau",
    "libelleLong": "4ème Bureau, Palais Bourbon"
  },
  "cycleDeVie": {
    "etat": "Confirmé",
    "chrono": {
      "creation": "2017-12-18T16:23:59.000+01:00"
    }
  },
  "demandeurs": {
    "acteurs": [
      {
        "nom": "Mme Yaël BRAUN-PIVET",
        "acteurRef": "PA721908"
      }
    ]
  },
  "typeReunion": "DEP"
}