{
  "uid": "RUANR5L15S2018IDF0106792",
  "timestampDebut": "2018-03-05T18:30:00.000+01:00",
  "timestampFin": "2018-03-05T20:00:00.000+01:00",
  "lieu": {
    "code": "SALREU013",
    "libelleCourt": "Salle N° 3",
    "libelleLong": "Salle N° 3, 3, rue Aristide Briand"
  },
  "cycleDeVie": {
    "etat": "Confirmé",
    "chrono": {
      "creation": "2018-02-28T18:10:27.000+01:00"
    }
  },
  "demandeurs": {
    "acteurs": [
      {
        "nom": "M. Guillaume LARRIVÉ",
        "acteurRef": "PA267785"
      }
    ]
  },
  "typeReunion": "DEP"
}