{
  "uid": "RUANR5L14S2017IDF0096327",
  "timestampDebut": "2017-09-19T09:00:00.000+02:00",
  "timestampFin": "2017-09-19T12:00:00.000+02:00",
  "lieu": {
    "code": "SALREU007",
    "libelleCourt": "4ème Bureau",
    "libelleLong": "4ème Bureau, Palais Bourbon"
  },
  "cycleDeVie": {
    "etat": "Confirmé",
    "chrono": {
      "creation": "2017-09-14T13:47:16.000+02:00"
    }
  },
  "demandeurs": {
    "acteurs": [
      {
        "nom": "M. Jacques SAVATIER",
        "acteurRef": "PA722078"
      }
    ]
  },
  "typeReunion": "DEP"
}