{
  "uid": "RUANR5L14S2018IDF0098807",
  "timestampDebut": "2017-12-06T09:30:00.000+01:00",
  "timestampFin": "2017-12-06T10:30:00.000+01:00",
  "lieu": {
    "code": "SALREU013",
    "libelleCourt": "Salle N° 3",
    "libelleLong": "Salle N° 3, 3, rue Aristide Briand"
  },
  "cycleDeVie": {
    "etat": "Confirmé",
    "chrono": {
      "creation": "2017-10-17T16:49:33.000+02:00"
    }
  },
  "demandeurs": {
    "acteurs": [
      {
        "nom": "Mme Frédérique DUMAS",
        "acteurRef": "PA721194"
      }
    ]
  },
  "typeReunion": "DEP"
}