{
  "uid": "RUANR5L14S2018IDF0103001",
  "timestampDebut": "2018-01-18T15:00:00.000+01:00",
  "timestampFin": "2018-01-18T16:00:00.000+01:00",
  "lieu": {
    "code": "SALREU006",
    "libelleCourt": "3ème Bureau",
    "libelleLong": "3ème Bureau, Palais Bourbon"
  },
  "cycleDeVie": {
    "etat": "Confirmé",
    "chrono": {
      "creation": "2017-12-21T12:33:12.000+01:00"
    }
  },
  "demandeurs": {
    "acteurs": [
      {
        "nom": "Mme Nicole TRISSE",
        "acteurRef": "PA720394"
      }
    ]
  },
  "typeReunion": "DEP"
}