{
  "uid": "RUANR5L14S2018IDF0096380",
  "timestampDebut": "2017-10-03T16:30:00.000+02:00",
  "timestampFin": "2017-10-03T18:00:00.000+02:00",
  "lieu": {
    "code": "SALREU042",
    "libelleCourt": "Salle 6566",
    "libelleLong": "Salle 6566, Palais Bourbon"
  },
  "cycleDeVie": {
    "etat": "Confirmé",
    "chrono": {
      "creation": "2017-09-14T18:12:39.000+02:00"
    }
  },
  "demandeurs": {
    "acteurs": [
      {
        "nom": "M. Laurent PIETRASZEWSKI",
        "acteurRef": "PA720512"
      }
    ]
  },
  "typeReunion": "DEP"
}