{
  "uid": "RUANR5L15S2018IDF0104773",
  "timestampDebut": "2018-05-05T09:00:00.000+02:00",
  "timestampFin": "2018-05-05T17:00:00.000+02:00",
  "lieu": {
    "code": "SALREU003",
    "libelleCourt": "Salle Victor Hugo",
    "libelleLong": "Salle Victor Hugo, 101, rue de l'Université"
  },
  "cycleDeVie": {
    "etat": "Annulé",
    "chrono": {
      "creation": "2018-01-31T10:27:14.000+01:00",
      "cloture": "2018-01-31T10:33:42.000+01:00"
    }
  },
  "demandeurs": {
    "acteurs": [
      {
        "nom": "M. Boris VALLAUD",
        "acteurRef": "PA719930"
      }
    ]
  },
  "typeReunion": "DEP"
}