{
  "uid": "RUANR5L14S2018IDF0097594",
  "timestampDebut": "2017-10-24T16:15:00.000+02:00",
  "timestampFin": "2017-10-24T19:00:00.000+02:00",
  "lieu": {
    "code": "SALREU038",
    "libelleCourt": "Salle 6549",
    "libelleLong": "Salle 6549, Palais Bourbon"
  },
  "cycleDeVie": {
    "etat": "Confirmé",
    "chrono": {
      "creation": "2017-09-29T16:14:58.000+02:00"
    }
  },
  "demandeurs": {
    "acteurs": [
      {
        "nom": "M. Philippe CHASSAING",
        "acteurRef": "PA719250"
      }
    ]
  },
  "typeReunion": "DEP"
}