{
  "uid": "RUANR5L15S2018IDF0106930",
  "timestampDebut": "2018-03-20T14:00:00.000+01:00",
  "timestampFin": "2018-03-20T15:00:00.000+01:00",
  "lieu": {
    "code": "SALREU041",
    "libelleCourt": "Sully 5",
    "libelleLong": "Sully 5, Palais Bourbon"
  },
  "cycleDeVie": {
    "etat": "Confirmé",
    "chrono": {
      "creation": "2018-03-05T15:21:48.000+01:00"
    }
  },
  "demandeurs": {
    "organe": {
      "nom": "Groupe d'amitié France-Haïti",
      "organeRef": "PO733592"
    }
  },
  "organeReuniRef": "PO733592",
  "typeReunion": "GA"
}