{
  "uid": "RUANR5L14S2018IDF0100967",
  "timestampDebut": "2017-12-06T15:00:00.000+01:00",
  "timestampFin": "2017-12-06T19:00:00.000+01:00",
  "lieu": {
    "code": "SALREU008",
    "libelleCourt": "5ème Bureau",
    "libelleLong": "5ème Bureau, Palais Bourbon"
  },
  "cycleDeVie": {
    "etat": "Confirmé",
    "chrono": {
      "creation": "2017-11-17T19:14:47.000+01:00"
    }
  },
  "demandeurs": {
    "acteurs": [
      {
        "nom": "M. Jean-Baptiste DJEBBARI",
        "acteurRef": "PA722236"
      }
    ]
  },
  "typeReunion": "DEP"
}