{
  "uid": "RUANR5L14S2017IDF0094556",
  "timestampDebut": "2017-07-24T17:00:00.000+02:00",
  "timestampFin": "2017-07-24T19:00:00.000+02:00",
  "lieu": {
    "code": "SALREU008",
    "libelleCourt": "5ème Bureau",
    "libelleLong": "5ème Bureau, Palais Bourbon"
  },
  "cycleDeVie": {
    "etat": "Confirmé",
    "chrono": {
      "creation": "2017-07-24T11:26:19.000+02:00"
    }
  },
  "demandeurs": {
    "acteurs": [
      {
        "nom": "M. Charles DE COURSON",
        "acteurRef": "PA942"
      }
    ]
  },
  "typeReunion": "DEP"
}