{
  "uid": "RUANR5L14S2018IDF0096326",
  "timestampDebut": "2017-10-11T16:00:00.000+02:00",
  "timestampFin": "2017-10-11T19:00:00.000+02:00",
  "lieu": {
    "code": "SALREU016",
    "libelleCourt": "Salon Gabriel",
    "libelleLong": "Salon Gabriel, 101, rue de l'Université"
  },
  "cycleDeVie": {
    "etat": "Confirmé",
    "chrono": {
      "creation": "2017-09-14T13:42:56.000+02:00"
    }
  },
  "demandeurs": {
    "acteurs": [
      {
        "nom": "M. Damien PICHEREAU",
        "acteurRef": "PA721372"
      }
    ]
  },
  "typeReunion": "DEP"
}