{
  "uid": "RUANR5L15S2017IDC427120",
  "timestampDebut": "2017-07-19T09:30:00.000+02:00",
  "lieu": {
    "libelleLong": "salle de la commission n° 6351, 1er étage du Palais-Bourbon"
  },
  "cycleDeVie": {
    "etat": "Annulé",
    "chrono": {
      "creation": "2017-07-07T00:00:00.000+02:00",
      "cloture": "2017-07-13T00:00:00.000+02:00"
    }
  },
  "organeReuniRef": "PO420120",
  "participants": {},
  "ouverturePresse": false,
  "odj": {
    "convocationOdj": [
      "Rapport sur l'application de la loi n° 2016-1827 du 23 décembre 2016 de financement de la sécurité sociale pour 2017"
    ],
    "resumeOdj": [
      "modernisation de notre système de santé (n° 6) (première lecture) (amendements, art. 88);",
      "profession de physicien médical et qualifications professionnelles dans le domaine de la santé (n° 7) (première lecture) (amendements, art. 88);",
      "adaptation des dispositions législatives relatives au fonctionnement des ordres des professions de santé (n° 8) (première lecture) (amendements, art. 88)."
    ]
  }
}