{
  "uid": "RUANR5L15S2018IDC427913",
  "timestampDebut": "2017-11-29T10:45:00.000+01:00",
  "timestampFin": "2017-11-29T12:05:00.000+01:00",
  "lieu": {
    "libelleLong": "salle 4223 (33 rue Saint-Dominique)"
  },
  "cycleDeVie": {
    "etat": "Confirmé",
    "chrono": {
      "creation": "2017-11-22T00:00:00.000+01:00"
    }
  },
  "organeReuniRef": "PO734699",
  "participants": {
    "participantsInternes": [
      {
        "acteurRef": "PA720430",
        "presence": "absent"
      },
      {
        "acteurRef": "PA720162",
        "presence": "absent"
      },
      {
        "acteurRef": "PA721118",
        "presence": "absent"
      },
      {
        "acteurRef": "PA719830",
        "presence": "présent"
      },
      {
        "acteurRef": "PA721142",
        "presence": "présent"
      },
      {
        "acteurRef": "PA722062",
        "presence": "absent"
      },
      {
        "acteurRef": "PA331567",
        "presence": "absent"
      },
      {
        "acteurRef": "PA608016",
        "presence": "absent"
      },
      {
        "acteurRef": "PA719946",
        "presence": "absent"
      },
      {
        "acteurRef": "PA608695",
        "presence": "présent"
      }
    ]
  },
  "ouverturePresse": true,
  "odj": {
    "convocationOdj": [
      "À 10 heures 45 :\n– Audition de M. Dominique Bourg, Professeur à l’Université de Lausanne"
    ],
    "resumeOdj": [
      "à 10 heures 45 :\n– audition de M. Dominique Bourg, Professeur à l’Université de Lausanne"
    ]
  }
}