{
  "uid": "RUANR5L14S2018IDF0102695",
  "timestampDebut": "2018-01-30T10:00:00.000+01:00",
  "timestampFin": "2018-01-30T11:00:00.000+01:00",
  "lieu": {
    "code": "SALREU022",
    "libelleCourt": "Salle 7326",
    "libelleLong": "Salle 7326, 101, rue de l'Université"
  },
  "cycleDeVie": {
    "etat": "Confirmé",
    "chrono": {
      "creation": "2017-12-19T14:56:12.000+01:00"
    }
  },
  "demandeurs": {
    "acteurs": [
      {
        "nom": "M. Didier BAICHÈRE",
        "acteurRef": "PA721776"
      }
    ]
  },
  "typeReunion": "DEP"
}