{
  "uid": "RUANR5L15S2017IDS20617",
  "timestampDebut": "2017-07-17T21:30:00.000+02:00",
  "lieu": {
    "code": "AN",
    "libelleLong": "Assemblée nationale"
  },
  "cycleDeVie": {
    "etat": "Supprimé",
    "chrono": {
      "creation": "2017-06-28T00:00:00.000+02:00",
      "cloture": "2017-07-21T00:00:00.000+02:00"
    }
  },
  "organeReuniRef": "PO717460",
  "sessionRef": "SCR5A2017O1",
  "ouverturePresse": true,
  "odj": {
    "pointsOdj": [
      {
        "xsiType": "podjSeanceConfPres_type",
        "uid": "RUANR5L15S2017IDS20617PT34931",
        "cycleDeVie": {
          "etat": "Supprimé",
          "chrono": {
            "creation": "2017-06-28T00:00:00.000+02:00",
            "cloture": "2017-07-21T00:00:00.000+02:00"
          }
        },
        "objet": "Éventuellement, suite de la discussion du projet de loi d'habilitation à prendre par ordonnances les mesures pour le renforcement du dialogue social",
        "typePointOdj": "Suite de la discussion",
        "comiteSecret": false,
        "natureTravauxOdj": "ODJPR"
      }
    ]
  },
  "identifiants": {
    "quantieme": "Deuxième",
    "dateSeance": "2017-07-17T02:00:00.000+02:00"
  }
}