{
  "uid": "RUANR5L14S2017IDF0095392",
  "timestampDebut": "2017-09-20T14:00:00.000+02:00",
  "timestampFin": "2017-09-20T15:00:00.000+02:00",
  "lieu": {
    "code": "SALREU020",
    "libelleCourt": "Salon Mars II",
    "libelleLong": "Salon Mars II, 101, rue de l'Université"
  },
  "cycleDeVie": {
    "etat": "Confirmé",
    "chrono": {
      "creation": "2017-08-28T16:27:55.000+02:00"
    }
  },
  "demandeurs": {
    "acteurs": [
      {
        "nom": "M. Francis VERCAMER",
        "acteurRef": "PA267585"
      }
    ]
  },
  "typeReunion": "DEP"
}