{
  "uid": "RUANR5L15S2018IDF0107017",
  "timestampDebut": "2018-03-29T14:00:00.000+02:00",
  "timestampFin": "2018-03-29T15:30:00.000+02:00",
  "lieu": {
    "code": "SALREU021",
    "libelleCourt": "Salle 7207",
    "libelleLong": "Salle 7207, 101, rue de l'Université"
  },
  "cycleDeVie": {
    "etat": "Confirmé",
    "chrono": {
      "creation": "2018-03-06T14:16:02.000+01:00"
    }
  },
  "demandeurs": {
    "acteurs": [
      {
        "nom": "M. Jean-Carles GRELIER",
        "acteurRef": "PA267318"
      }
    ]
  },
  "typeReunion": "DEP"
}