{
  "uid": "RUANR5L14S2017IDF0095442",
  "timestampDebut": "2017-09-13T11:00:00.000+02:00",
  "timestampFin": "2017-09-13T12:00:00.000+02:00",
  "lieu": {
    "code": "SALREU021",
    "libelleCourt": "Salle 7207",
    "libelleLong": "Salle 7207, 101, rue de l'Université"
  },
  "cycleDeVie": {
    "etat": "Confirmé",
    "chrono": {
      "creation": "2017-08-30T16:13:24.000+02:00"
    }
  },
  "demandeurs": {
    "acteurs": [
      {
        "nom": "M. Didier BAICHÈRE",
        "acteurRef": "PA721776"
      }
    ]
  },
  "typeReunion": "DEP"
}