{
  "uid": "RUANR5L15S2018IDF0104900",
  "timestampDebut": "2018-02-06T08:00:00.000+01:00",
  "timestampFin": "2018-02-06T09:00:00.000+01:00",
  "lieu": {
    "code": "SALREU007",
    "libelleCourt": "4ème Bureau",
    "libelleLong": "4ème Bureau, Palais Bourbon"
  },
  "cycleDeVie": {
    "etat": "Confirmé",
    "chrono": {
      "creation": "2018-02-01T11:03:51.000+01:00"
    }
  },
  "demandeurs": {
    "acteurs": [
      {
        "nom": "Mme Annie CHAPELIER",
        "acteurRef": "PA719448"
      }
    ]
  },
  "typeReunion": "DEP"
}