{
  "uid": "RUANR5L15S2018IDC427715",
  "timestampDebut": "2017-11-09T14:00:00.000+01:00",
  "lieu": {
    "libelleLong": "salle 4123 (33 rue Saint-Dominique)"
  },
  "cycleDeVie": {
    "etat": "Confirmé",
    "chrono": {
      "creation": "2017-11-03T00:00:00.000+01:00"
    }
  },
  "organeReuniRef": "PO734678",
  "participants": {
    "participantsInternes": [
      {
        "acteurRef": "PA605036",
        "presence": "absent"
      },
      {
        "acteurRef": "PA721158",
        "presence": "présent"
      },
      {
        "acteurRef": "PA335999",
        "presence": "présent"
      },
      {
        "acteurRef": "PA689",
        "presence": "absent"
      },
      {
        "acteurRef": "PA336439",
        "presence": "présent"
      },
      {
        "acteurRef": "PA721202",
        "presence": "absent"
      },
      {
        "acteurRef": "PA1874",
        "presence": "présent"
      },
      {
        "acteurRef": "PA721226",
        "presence": "présent"
      },
      {
        "acteurRef": "PA717151",
        "presence": "absent"
      },
      {
        "acteurRef": "PA719350",
        "presence": "présent"
      },
      {
        "acteurRef": "PA2952",
        "presence": "présent"
      },
      {
        "acteurRef": "PA720746",
        "presence": "présent"
      }
    ]
  },
  "ouverturePresse": true,
  "odj": {
    "convocationOdj": [
      "— Table ronde, ouverte à la presse : « Un nouveau regard sur le Parlement »\n- M. Bertrand-Léo Combrade, maître de conférences en droit public à l’Université de Picardie Jules Verne, chercheur associé à l’Université Paris I Panthéon Sorbonne, auteur d’une thèse sur « L’obligation d’étude d’impact des projets de loi » ;\n- M. Alexis Fourmont, docteur en droit public de l'Université Panthéon-Assas , auteur d’une thèse sur « L’opposition parlementaire en droit constitutionnel allemand et français » ;\n- Mme Audrey de Montis, maître de conférences à l’Université de Rennes I, auteure d’une thèse sur « La rénovation de la séance publique du Parlement français ; étude sur l’efficacité politique de la réforme constitutionnelle du 23 juillet 2008 » ;\n- M. Basile Ridard, docteur de l’Université Paris I Panthéon-Sorbonne, enseignant contractuel à l’Université de Picardie Jules Verne, auteur d’une thèse sur « L’encadrement du temps parlementaire dans la procédure législative. Étude comparée : Allemagne, Espagne, France, Royaume-Uni »."
    ],
    "resumeOdj": [
      "table ronde, ouverte à la presse : « Un nouveau regard sur le Parlement » :",
      "M. Bertrand-Léo Combrade, maître de conférences en droit public à l’Université de Picardie Jules Verne, chercheur associé à l’Université Paris I Panthéon Sorbonne, auteur d’une thèse sur « L’obligation d’étude d’impact des projets de loi » ;",
      "M. Alexis Fourmont, docteur en droit public de l'Université Panthéon-Assas , auteur d’une thèse sur « L’opposition parlementaire en droit constitutionnel allemand et français » ;",
      "Mme Audrey de Montis, maître de conférences à l’Université de Rennes I, auteure d’une thèse sur « La rénovation de la séance publique du Parlement français ; étude sur l’efficacité politique de la réforme constitutionnelle du 23 juillet 2008 » ;",
      "M. Basile Ridard, docteur de l’Université Paris I Panthéon-Sorbonne, enseignant contractuel à l’Université de Picardie Jules Verne, auteur d’une thèse sur « L’encadrement du temps parlementaire dans la procédure législative. Étude comparée : Allemagne, Espagne, France, Royaume-Uni »."
    ]
  }
}