{
  "uid": "RUANR5L15S2018IDF0105179",
  "timestampDebut": "2018-02-14T16:15:00.000+01:00",
  "timestampFin": "2018-02-14T17:15:00.000+01:00",
  "lieu": {
    "code": "SALREU023",
    "libelleCourt": "Salle 7426",
    "libelleLong": "Salle 7426, 101, rue de l'Université"
  },
  "cycleDeVie": {
    "etat": "Confirmé",
    "chrono": {
      "creation": "2018-02-06T10:46:22.000+01:00"
    }
  },
  "demandeurs": {
    "acteurs": [
      {
        "nom": "M. Guy TEISSIER",
        "acteurRef": "PA2796"
      }
    ]
  },
  "typeReunion": "DEP"
}