{
  "uid": "RUANR5L15S2018IDF0104472",
  "timestampDebut": "2018-02-01T17:00:00.000+01:00",
  "timestampFin": "2018-02-01T18:00:00.000+01:00",
  "lieu": {
    "code": "SALREU013",
    "libelleCourt": "Salle N° 3",
    "libelleLong": "Salle N° 3, 3, rue Aristide Briand"
  },
  "cycleDeVie": {
    "etat": "Confirmé",
    "chrono": {
      "creation": "2018-01-26T16:34:11.000+01:00"
    }
  },
  "demandeurs": {
    "acteurs": [
      {
        "nom": "M. Sylvain MAILLARD",
        "acteurRef": "PA717379"
      }
    ]
  },
  "typeReunion": "DEP"
}