{
  "uid": "RUANR5L15S2018IDF0105411",
  "timestampDebut": "2018-02-20T16:30:00.000+01:00",
  "timestampFin": "2018-02-20T17:30:00.000+01:00",
  "lieu": {
    "code": "SALREU018",
    "libelleCourt": "Salon Mansart",
    "libelleLong": "Salon Mansart, 101, rue de l'Université"
  },
  "cycleDeVie": {
    "etat": "Confirmé",
    "chrono": {
      "creation": "2018-02-08T15:08:39.000+01:00"
    }
  },
  "demandeurs": {
    "acteurs": [
      {
        "nom": "M. Olivier FAURE",
        "acteurRef": "PA609332"
      }
    ]
  },
  "typeReunion": "DEP"
}