{
  "uid": "RUANR5L14S2018IDF0098504",
  "timestampDebut": "2017-10-17T18:00:00.000+02:00",
  "timestampFin": "2017-10-17T20:30:00.000+02:00",
  "lieu": {
    "code": "SALREU021",
    "libelleCourt": "Salle 7207",
    "libelleLong": "Salle 7207, 101, rue de l'Université"
  },
  "cycleDeVie": {
    "etat": "Confirmé",
    "chrono": {
      "creation": "2017-10-12T12:34:16.000+02:00"
    }
  },
  "demandeurs": {
    "acteurs": [
      {
        "nom": "Mme Véronique RIOTTON",
        "acteurRef": "PA721426"
      }
    ]
  },
  "typeReunion": "DEP"
}