{
  "uid": "RUANR5L15S2018IDF0100503",
  "timestampDebut": "2018-01-24T08:30:00.000+01:00",
  "timestampFin": "2018-01-24T09:30:00.000+01:00",
  "lieu": {
    "code": "SALREU028",
    "libelleCourt": "Salle Colbert",
    "libelleLong": "Salle Colbert , Palais Bourbon"
  },
  "cycleDeVie": {
    "etat": "Annulé",
    "chrono": {
      "creation": "2017-11-15T17:35:01.000+01:00",
      "cloture": "2018-01-18T17:00:26.000+01:00"
    }
  },
  "demandeurs": {
    "organe": {
      "nom": "GROUPE LA RÉPUBLIQUE EN MARCHE",
      "organeRef": "PO730964"
    }
  },
  "organeReuniRef": "PO730964",
  "typeReunion": "GP"
}