{
  "uid": "RUANR5L14S2017IDF0094737",
  "timestampDebut": "2017-07-31T18:00:00.000+02:00",
  "timestampFin": "2017-07-31T20:00:00.000+02:00",
  "lieu": {
    "code": "SALREU029",
    "libelleCourt": "Salon Mars III",
    "libelleLong": "Salon Mars III, 101, rue de l'Université"
  },
  "cycleDeVie": {
    "etat": "Annulé",
    "chrono": {
      "creation": "2017-07-26T09:24:21.000+02:00",
      "cloture": "2017-07-26T15:45:47.000+02:00"
    }
  },
  "demandeurs": {
    "acteurs": [
      {
        "nom": "M. Bastien LACHAUD",
        "acteurRef": "PA720846"
      }
    ]
  },
  "typeReunion": "DEP"
}