{
  "uid": "RUANR5L15S2018IDF0104329",
  "timestampDebut": "2018-01-31T16:00:00.000+01:00",
  "timestampFin": "2018-01-31T17:30:00.000+01:00",
  "lieu": {
    "code": "SALREU010",
    "libelleCourt": "Salle N° 1",
    "libelleLong": "Salle N° 1, 3, rue Aristide Briand"
  },
  "cycleDeVie": {
    "etat": "Confirmé",
    "chrono": {
      "creation": "2018-01-24T16:05:55.000+01:00"
    }
  },
  "demandeurs": {
    "acteurs": [
      {
        "nom": "Mme Dominique DAVID",
        "acteurRef": "PA719710"
      }
    ]
  },
  "typeReunion": "DEP"
}