{
  "uid": "RUANR5L15S2018IDF0105425",
  "timestampDebut": "2018-02-13T14:30:00.000+01:00",
  "timestampFin": "2018-02-13T16:00:00.000+01:00",
  "lieu": {
    "code": "SALREU049",
    "libelleCourt": "Salle 6822",
    "libelleLong": "Salle 6822, Palais Bourbon"
  },
  "cycleDeVie": {
    "etat": "Confirmé",
    "chrono": {
      "creation": "2018-02-08T15:37:21.000+01:00"
    }
  },
  "demandeurs": {
    "acteurs": [
      {
        "nom": "Mme Sandrine MÖRCH",
        "acteurRef": "PA719456"
      }
    ]
  },
  "typeReunion": "DEP"
}