{
  "uid": "RUANR5L14S2018IDF0097103",
  "timestampDebut": "2017-10-02T14:00:00.000+02:00",
  "timestampFin": "2017-10-02T19:00:00.000+02:00",
  "lieu": {
    "code": "SALREU038",
    "libelleCourt": "Salle 6549",
    "libelleLong": "Salle 6549, Palais Bourbon"
  },
  "cycleDeVie": {
    "etat": "Confirmé",
    "chrono": {
      "creation": "2017-09-26T16:41:12.000+02:00"
    }
  },
  "demandeurs": {
    "acteurs": [
      {
        "nom": "Mme Élodie JACQUIER-LAFORGE",
        "acteurRef": "PA719874"
      }
    ]
  },
  "typeReunion": "DEP"
}