{
  "uid": "RUANR5L15S2018IDC427508",
  "timestampDebut": "2017-10-12T10:00:00.000+02:00",
  "lieu": {
    "libelleLong": "1er Bureau"
  },
  "cycleDeVie": {
    "etat": "Confirmé",
    "chrono": {
      "creation": "2017-10-06T00:00:00.000+02:00"
    }
  },
  "organeReuniRef": "PO734806",
  "participants": {},
  "ouverturePresse": false,
  "odj": {
    "convocationOdj": [
      "Audition, non ouverte à la presse, de M. Fabien Raynaud, conseiller d’État, président de chambre à la section du contentieux, ancien président du groupe de travail du Conseil d’État sur la transposition des directives."
    ],
    "resumeOdj": [
      "audition, non ouverte à la presse, de M. Fabien Raynaud, conseiller d’État, président de chambre à la section du contentieux, ancien président du groupe de travail du Conseil d’État sur la transposition des directives."
    ]
  }
}