{
  "uid": "RUANR5L14S2018IDF0101438",
  "timestampDebut": "2018-01-18T08:30:00.000+01:00",
  "timestampFin": "2018-01-18T19:00:00.000+01:00",
  "lieu": {
    "code": "SALREU007",
    "libelleCourt": "4ème Bureau",
    "libelleLong": "4ème Bureau, Palais Bourbon"
  },
  "cycleDeVie": {
    "etat": "Confirmé",
    "chrono": {
      "creation": "2017-11-27T15:33:08.000+01:00"
    }
  },
  "demandeurs": {
    "acteurs": [
      {
        "nom": "M. Loïc KERVRAN",
        "acteurRef": "PA719052"
      }
    ]
  },
  "typeReunion": "DEP"
}