{
  "uid": "RUANR5L14S2017IDF0095789",
  "timestampDebut": "2017-09-21T10:30:00.000+02:00",
  "timestampFin": "2017-09-21T12:00:00.000+02:00",
  "lieu": {
    "code": "SALREU023",
    "libelleCourt": "Salle 7426",
    "libelleLong": "Salle 7426, 101, rue de l'Université"
  },
  "cycleDeVie": {
    "etat": "Confirmé",
    "chrono": {
      "creation": "2017-09-06T16:12:53.000+02:00"
    }
  },
  "demandeurs": {
    "acteurs": [
      {
        "nom": "M. Guillaume GAROT",
        "acteurRef": "PA333285"
      }
    ]
  },
  "typeReunion": "DEP"
}