{
  "uid": "RUANR5L14S2018IDF0102785",
  "timestampDebut": "2018-05-22T10:30:00.000+02:00",
  "timestampFin": "2018-05-22T12:15:00.000+02:00",
  "lieu": {
    "code": "SALREU004",
    "libelleCourt": "1er Bureau",
    "libelleLong": "1er Bureau, Palais Bourbon"
  },
  "cycleDeVie": {
    "etat": "Confirmé",
    "chrono": {
      "creation": "2017-12-20T14:43:54.000+01:00"
    }
  },
  "demandeurs": {
    "organe": {
      "nom": "GROUPE UDI, AGIR ET INDÉPENDANTS",
      "organeRef": "PO744425"
    }
  },
  "organeReuniRef": "PO744425",
  "typeReunion": "GP"
}