{
  "uid": "RUANR5L15S2018IDF0106340",
  "timestampDebut": "2018-03-14T16:30:00.000+01:00",
  "timestampFin": "2018-03-14T18:30:00.000+01:00",
  "lieu": {
    "code": "SALREU016",
    "libelleCourt": "Salon Gabriel",
    "libelleLong": "Salon Gabriel, 101, rue de l'Université"
  },
  "cycleDeVie": {
    "etat": "Confirmé",
    "chrono": {
      "creation": "2018-02-21T14:57:43.000+01:00"
    }
  },
  "demandeurs": {
    "acteurs": [
      {
        "nom": "Mme Valérie LACROUTE",
        "acteurRef": "PA609245"
      }
    ]
  },
  "typeReunion": "DEP"
}