{
  "uid": "RUANR5L15S2018IDC428586",
  "timestampDebut": "2018-03-07T17:30:00.000+01:00",
  "lieu": {
    "libelleLong": "salle 4203 (33, rue Saint-Dominique - 2ème étage)"
  },
  "cycleDeVie": {
    "etat": "Confirmé",
    "chrono": {
      "creation": "2018-02-12T00:00:00.000+01:00"
    }
  },
  "organeReuniRef": "PO744155",
  "participants": {},
  "ouverturePresse": false,
  "odj": {
    "convocationOdj": [
      "– Audition de l’Amiral Hervé de Bonnaventure, directeur général adjoint des relations internationales et de la stratégie du ministère des armées."
    ],
    "resumeOdj": [
      "audition de l’Amiral Hervé de Bonnaventure, directeur général adjoint des relations internationales et de la stratégie du ministère des armées."
    ]
  }
}