{
  "uid": "RUANR5L15S2018IDF0103962",
  "timestampDebut": "2018-01-18T15:30:00.000+01:00",
  "timestampFin": "2018-01-18T17:00:00.000+01:00",
  "lieu": {
    "code": "SALREU004",
    "libelleCourt": "1er Bureau",
    "libelleLong": "1er Bureau, Palais Bourbon"
  },
  "cycleDeVie": {
    "etat": "Confirmé",
    "chrono": {
      "creation": "2018-01-18T15:44:49.000+01:00"
    }
  },
  "demandeurs": {
    "acteurs": [
      {
        "nom": "M. Florian BACHELIER",
        "acteurRef": "PA719770"
      }
    ]
  },
  "typeReunion": "DEP"
}