{
  "uid": "RUANR5L15S2018IDC428460",
  "timestampDebut": "2018-02-21T13:40:00.000+01:00",
  "timestampFin": "2018-02-21T14:45:00.000+01:00",
  "lieu": {
    "libelleLong": "salle 6350 (Finances)"
  },
  "cycleDeVie": {
    "etat": "Confirmé",
    "chrono": {
      "creation": "2018-02-01T00:00:00.000+01:00"
    }
  },
  "organeReuniRef": "PO59048",
  "participants": {
    "participantsInternes": [
      {
        "acteurRef": "PA718954",
        "presence": "absent"
      },
      {
        "acteurRef": "PA605963",
        "presence": "présent"
      },
      {
        "acteurRef": "PA609726",
        "presence": "présent"
      },
      {
        "acteurRef": "PA721836",
        "presence": "absent"
      },
      {
        "acteurRef": "PA721410",
        "presence": "absent"
      },
      {
        "acteurRef": "PA721608",
        "presence": "absent"
      },
      {
        "acteurRef": "PA605069",
        "presence": "présent"
      },
      {
        "acteurRef": "PA720298",
        "presence": "présent"
      },
      {
        "acteurRef": "PA746",
        "presence": "absent"
      },
      {
        "acteurRef": "PA719138",
        "presence": "absent"
      },
      {
        "acteurRef": "PA720520",
        "presence": "présent"
      },
      {
        "acteurRef": "PA719472",
        "presence": "présent"
      },
      {
        "acteurRef": "PA719250",
        "presence": "présent"
      },
      {
        "acteurRef": "PA721202",
        "presence": "absent"
      },
      {
        "acteurRef": "PA718850",
        "presence": "présent"
      },
      {
        "acteurRef": "PA923",
        "presence": "présent"
      },
      {
        "acteurRef": "PA942",
        "presence": "présent"
      },
      {
        "acteurRef": "PA332523",
        "presence": "présent"
      },
      {
        "acteurRef": "PA720268",
        "presence": "présent"
      },
      {
        "acteurRef": "PA719710",
        "presence": "présent"
      },
      {
        "acteurRef": "PA718720",
        "presence": "présent"
      },
      {
        "acteurRef": "PA643175",
        "presence": "présent"
      },
      {
        "acteurRef": "PA720002",
        "presence": "absent"
      },
      {
        "acteurRef": "PA607193",
        "presence": "excusé"
      },
      {
        "acteurRef": "PA1327",
        "presence": "excusé"
      },
      {
        "acteurRef": "PA719480",
        "presence": "présent"
      },
      {
        "acteurRef": "PA267336",
        "presence": "présent"
      },
      {
        "acteurRef": "PA720560",
        "presence": "présent"
      },
      {
        "acteurRef": "PA720790",
        "presence": "présent"
      },
      {
        "acteurRef": "PA721764",
        "presence": "présent"
      },
      {
        "acteurRef": "PA721498",
        "presence": "présent"
      },
      {
        "acteurRef": "PA722054",
        "presence": "présent"
      },
      {
        "acteurRef": "PA608416",
        "presence": "présent"
      },
      {
        "acteurRef": "PA721150",
        "presence": "excusé"
      },
      {
        "acteurRef": "PA719060",
        "presence": "présent"
      },
      {
        "acteurRef": "PA719778",
        "presence": "excusé"
      },
      {
        "acteurRef": "PA720214",
        "presence": "absent"
      },
      {
        "acteurRef": "PA719798",
        "presence": "présent"
      },
      {
        "acteurRef": "PA609245",
        "presence": "absent"
      },
      {
        "acteurRef": "PA718978",
        "presence": "présent"
      },
      {
        "acteurRef": "PA1838",
        "presence": "absent"
      },
      {
        "acteurRef": "PA720022",
        "presence": "présent"
      },
      {
        "acteurRef": "PA712014",
        "presence": "absent"
      },
      {
        "acteurRef": "PA1874",
        "presence": "excusé"
      },
      {
        "acteurRef": "PA721466",
        "presence": "présent"
      },
      {
        "acteurRef": "PA719006",
        "presence": "présent"
      },
      {
        "acteurRef": "PA608016",
        "presence": "présent"
      },
      {
        "acteurRef": "PA722244",
        "presence": "présent"
      },
      {
        "acteurRef": "PA720230",
        "presence": "présent"
      },
      {
        "acteurRef": "PA720728",
        "presence": "absent"
      },
      {
        "acteurRef": "PA721418",
        "presence": "absent"
      },
      {
        "acteurRef": "PA721670",
        "presence": "présent"
      },
      {
        "acteurRef": "PA719850",
        "presence": "présent"
      },
      {
        "acteurRef": "PA720492",
        "presence": "présent"
      },
      {
        "acteurRef": "PA720402",
        "presence": "présent"
      },
      {
        "acteurRef": "PA721636",
        "presence": "présent"
      },
      {
        "acteurRef": "PA607595",
        "presence": "présent"
      },
      {
        "acteurRef": "PA721568",
        "presence": "absent"
      },
      {
        "acteurRef": "PA718736",
        "presence": "présent"
      },
      {
        "acteurRef": "PA336175",
        "presence": "absent"
      },
      {
        "acteurRef": "PA608172",
        "presence": "présent"
      },
      {
        "acteurRef": "PA405480",
        "presence": "absent"
      },
      {
        "acteurRef": "PA609590",
        "presence": "présent"
      },
      {
        "acteurRef": "PA719676",
        "presence": "absent"
      },
      {
        "acteurRef": "PA721458",
        "presence": "présent"
      },
      {
        "acteurRef": "PA720692",
        "presence": "absent"
      },
      {
        "acteurRef": "PA720878",
        "presence": "présent"
      },
      {
        "acteurRef": "PA722078",
        "presence": "absent"
      },
      {
        "acteurRef": "PA720960",
        "presence": "excusé"
      },
      {
        "acteurRef": "PA610667",
        "presence": "présent"
      },
      {
        "acteurRef": "PA719592",
        "presence": "absent"
      },
      {
        "acteurRef": "PA721542",
        "presence": "présent"
      },
      {
        "acteurRef": "PA607090",
        "presence": "présent"
      },
      {
        "acteurRef": "PA331582",
        "presence": "présent"
      },
      {
        "acteurRef": "PA2960",
        "presence": "présent"
      }
    ],
    "personnesAuditionnees": [
      {
        "xsiType": "IdActeur_type",
        "uid": "PA607846",
        "ident": {
          "civ": "M.",
          "prenom": "Gérald",
          "nom": "Darmanin",
          "alpha": "Darmanin"
        },
        "dateNais": "1982-10-11T01:00:00.000+01:00"
      }
    ]
  },
  "ouverturePresse": false,
  "odj": {
    "convocationOdj": [
      "–  Audition de M. Gérald DARMANIN, ministre de l’action et des comptes publics, sur les résultats de l’exercice 2017"
    ],
    "resumeOdj": [
      "audition de M. Gérald Darmanin, ministre de l’action et des comptes publics, sur les résultats de l’exercice 2017."
    ]
  },
  "compteRenduRef": "CRCANR5L15S2018PO59048N072"
}