{
  "uid": "RUANR5L14S2018IDF0095315",
  "timestampDebut": "2017-10-03T19:00:00.000+02:00",
  "timestampFin": "2017-10-03T20:30:00.000+02:00",
  "lieu": {
    "code": "SALREU008",
    "libelleCourt": "5ème Bureau",
    "libelleLong": "5ème Bureau, Palais Bourbon"
  },
  "cycleDeVie": {
    "etat": "Confirmé",
    "chrono": {
      "creation": "2017-08-11T14:43:17.000+02:00"
    }
  },
  "demandeurs": {
    "acteurs": [
      {
        "nom": "M. Jean-François ELIAOU",
        "acteurRef": "PA719692"
      }
    ]
  },
  "typeReunion": "DEP"
}