{
  "uid": "RUANR5L14S2017IDF0094394",
  "timestampDebut": "2017-07-26T19:00:00.000+02:00",
  "timestampFin": "2017-07-26T21:00:00.000+02:00",
  "lieu": {
    "code": "SALREU029",
    "libelleCourt": "Salon Mars III",
    "libelleLong": "Salon Mars III, 101, rue de l'Université"
  },
  "cycleDeVie": {
    "etat": "Annulé",
    "chrono": {
      "creation": "2017-07-19T18:17:16.000+02:00",
      "cloture": "2017-07-20T10:38:12.000+02:00"
    }
  },
  "demandeurs": {
    "organe": {
      "nom": "GROUPE LA RÉPUBLIQUE EN MARCHE",
      "organeRef": "PO730964"
    }
  },
  "organeReuniRef": "PO730964",
  "typeReunion": "GP"
}