{
  "uid": "RUANR5L14S2017IDF0094389",
  "timestampDebut": "2017-08-01T18:00:00.000+02:00",
  "timestampFin": "2017-08-01T20:00:00.000+02:00",
  "lieu": {
    "code": "SALREU008",
    "libelleCourt": "5ème Bureau",
    "libelleLong": "5ème Bureau, Palais Bourbon"
  },
  "cycleDeVie": {
    "etat": "Confirmé",
    "chrono": {
      "creation": "2017-07-19T17:46:48.000+02:00"
    }
  },
  "demandeurs": {
    "acteurs": [
      {
        "nom": "M. Philippe CHALUMEAU",
        "acteurRef": "PA719790"
      }
    ]
  },
  "typeReunion": "DEP"
}