{
  "uid": "RUANR5L14S2018IDF0101218",
  "timestampDebut": "2017-11-29T08:30:00.000+01:00",
  "timestampFin": "2017-11-29T10:00:00.000+01:00",
  "lieu": {
    "code": "SALREU039",
    "libelleCourt": "Salle 6550",
    "libelleLong": "Salle 6550, Palais Bourbon"
  },
  "cycleDeVie": {
    "etat": "Annulé",
    "chrono": {
      "creation": "2017-11-23T09:05:39.000+01:00",
      "cloture": "2017-11-23T10:58:46.000+01:00"
    }
  },
  "demandeurs": {
    "acteurs": [
      {
        "nom": "Mme Aude AMADOU",
        "acteurRef": "PA720124"
      }
    ]
  },
  "typeReunion": "DEP"
}