{
  "uid": "RUANR5L14S2018IDF0098934",
  "timestampDebut": "2017-11-07T19:00:00.000+01:00",
  "timestampFin": "2017-11-07T20:00:00.000+01:00",
  "lieu": {
    "code": "SALREU004",
    "libelleCourt": "1er Bureau",
    "libelleLong": "1er Bureau, Palais Bourbon"
  },
  "cycleDeVie": {
    "etat": "Confirmé",
    "chrono": {
      "creation": "2017-10-18T19:43:24.000+02:00"
    }
  },
  "demandeurs": {
    "acteurs": [
      {
        "nom": "M. Jean-François ELIAOU",
        "acteurRef": "PA719692"
      }
    ]
  },
  "typeReunion": "DEP"
}