{
  "uid": "RUANR5L14S2018IDF0099131",
  "timestampDebut": "2017-11-09T18:00:00.000+01:00",
  "timestampFin": "2017-11-09T19:00:00.000+01:00",
  "lieu": {
    "code": "SALREU013",
    "libelleCourt": "Salle N° 3",
    "libelleLong": "Salle N° 3, 3, rue Aristide Briand"
  },
  "cycleDeVie": {
    "etat": "Confirmé",
    "chrono": {
      "creation": "2017-10-23T13:24:52.000+02:00"
    }
  },
  "demandeurs": {
    "acteurs": [
      {
        "nom": "Mme Yolaine DE COURSON",
        "acteurRef": "PA719194"
      }
    ]
  },
  "typeReunion": "DEP"
}