{
  "uid": "RUANR5L15S2018IDC428268",
  "timestampDebut": "2018-01-17T16:30:00.000+01:00",
  "lieu": {
    "libelleLong": "salle 4013 - 33 rue Saint-Dominique, rez-de-chaussée"
  },
  "cycleDeVie": {
    "etat": "Confirmé",
    "chrono": {
      "creation": "2018-01-15T00:00:00.000+01:00"
    }
  },
  "organeReuniRef": "PO744338",
  "participants": {},
  "ouverturePresse": false,
  "odj": {
    "convocationOdj": [
      "Audition de M. Paul Quilès, président des Initiatives pour le désarmement nucléaire (IDN), ancien ministre."
    ],
    "resumeOdj": [
      "audition de M. Paul Quilès, président des Initiatives pour le désarmement nucléaire (IDN), ancien ministre."
    ]
  }
}