{
  "uid": "RUANR5L14S2017IDF0093494",
  "timestampDebut": "2017-07-12T16:00:00.000+02:00",
  "timestampFin": "2017-07-12T17:00:00.000+02:00",
  "lieu": {
    "code": "SALREU008",
    "libelleCourt": "5ème Bureau",
    "libelleLong": "5ème Bureau, Palais Bourbon"
  },
  "cycleDeVie": {
    "etat": "Confirmé",
    "chrono": {
      "creation": "2017-07-06T11:11:18.000+02:00"
    }
  },
  "demandeurs": {
    "acteurs": [
      {
        "nom": "M. Dominique POTIER",
        "acteurRef": "PA607553"
      }
    ]
  },
  "typeReunion": "DEP"
}