{
  "uid": "RUANR5L15S2018IDC427761",
  "timestampDebut": "2017-11-14T09:00:00.000+01:00",
  "lieu": {
    "libelleLong": "6ème Bureau"
  },
  "cycleDeVie": {
    "etat": "Confirmé",
    "chrono": {
      "creation": "2017-11-09T00:00:00.000+01:00"
    }
  },
  "organeReuniRef": "PO738793",
  "participants": {
    "personnesAuditionnees": [
      {
        "xsiType": "IdPersonneExterne_type",
        "uid": "PE2412",
        "ident": {
          "civ": "Mme",
          "prenom": "Danièle",
          "nom": "Lamarque"
        },
        "dateNais": "1953-01-22T01:00:00.000+01:00"
      },
      {
        "xsiType": "IdPersonneExterne_type",
        "uid": "PE2411",
        "ident": {
          "civ": "M.",
          "prenom": "Bruno",
          "nom": "Palier"
        },
        "dateNais": "1966-03-23T01:00:00.000+01:00"
      },
      {
        "xsiType": "IdPersonneExterne_type",
        "uid": "PE2413",
        "ident": {
          "civ": "Mme",
          "prenom": "Delphine",
          "nom": "Corlay"
        },
        "dateNais": "1978-02-24T01:00:00.000+01:00"
      },
      {
        "xsiType": "IdPersonneExterne_type",
        "uid": "PE2414",
        "ident": {
          "civ": "M.",
          "prenom": "François",
          "nom": "de Dorlodot"
        },
        "dateNais": "1971-04-14T01:00:00.000+01:00"
      },
      {
        "xsiType": "IdPersonneExterne_type",
        "uid": "PE2415",
        "ident": {
          "civ": "M.",
          "prenom": "Jean-Michel",
          "nom": "Fourniau"
        },
        "dateNais": "1953-07-26T01:00:00.000+01:00"
      }
    ]
  },
  "ouverturePresse": true,
  "odj": {
    "convocationOdj": [
      "Table ronde, ouverte à la presse, sur les principes et les acteurs de l'évaluation des politiques publiques, en présence :",
      "·Mme Danièle Lamarque, membre de la Cour des comptes européenne, chargée du contrôle qualité de l'audit ;",
      "·M. Bruno Palier, professeur à l'Institut d'études politiques de Paris (Laboratoire interdisciplinaire d'évaluation des politiques publiques - LIEPP) ;",
      "·Mme Delphine Corlay, inspectrice des affaires sociales, secrétaire générale déléguée du Comité interministériel du handicap, en charge du plan autisme et des autres plans d'actions interministériels ;",
      "·M. François de Dorlodot, responsable du département secteur public KPMG en France ;",
      "·M. Jean-Michel Fourniau, chercheur à l'IFSTTAR, membre de Démocratie et participation."
    ],
    "resumeOdj": [
      "table ronde, ouverte à la presse, sur les principes et les acteurs de l'évaluation des politiques publiques, en présence :",
      "Mme Danièle Lamarque, membre de la Cour des comptes européenne, chargée du contrôle qualité de l'audit ;",
      "M. Bruno Palier, professeur à l'Institut d'études politiques de Paris (Laboratoire interdisciplinaire d'évaluation des politiques publiques - LIEPP) ;",
      "Mme Delphine Corlay, inspectrice des affaires sociales, secrétaire générale déléguée du Comité interministériel du handicap, en charge du plan autisme et des autres plans d'actions interministériels ;",
      "M. François de Dorlodot, responsable du département secteur public KPMG en France ;",
      "M. Jean-Michel Fourniau, chercheur à l'IFSTTAR, membre de Démocratie et participation."
    ]
  }
}