{
  "uid": "RUANR5L14S2018IDF0103021",
  "timestampDebut": "2018-01-18T15:15:00.000+01:00",
  "timestampFin": "2018-01-18T16:30:00.000+01:00",
  "lieu": {
    "code": "SALREU022",
    "libelleCourt": "Salle 7326",
    "libelleLong": "Salle 7326, 101, rue de l'Université"
  },
  "cycleDeVie": {
    "etat": "Confirmé",
    "chrono": {
      "creation": "2017-12-21T17:03:17.000+01:00"
    }
  },
  "demandeurs": {
    "acteurs": [
      {
        "nom": "Mme Véronique HAMMERER",
        "acteurRef": "PA719652"
      }
    ]
  },
  "typeReunion": "DEP"
}