{
  "uid": "RUANR5L14S2018IDF0101357",
  "timestampDebut": "2017-11-24T11:30:00.000+01:00",
  "timestampFin": "2017-11-24T12:30:00.000+01:00",
  "lieu": {
    "code": "SALREU004",
    "libelleCourt": "1er Bureau",
    "libelleLong": "1er Bureau, Palais Bourbon"
  },
  "cycleDeVie": {
    "etat": "Confirmé",
    "chrono": {
      "creation": "2017-11-24T10:57:21.000+01:00"
    }
  },
  "demandeurs": {
    "acteurs": [
      {
        "nom": "Mme Aurore BERGÉ",
        "acteurRef": "PA722046"
      }
    ]
  },
  "typeReunion": "DEP"
}