{
  "uid": "RUANR5L15S2018IDF0103581",
  "timestampDebut": "2018-01-16T16:00:00.000+01:00",
  "timestampFin": "2018-01-16T18:00:00.000+01:00",
  "lieu": {
    "code": "SALREU018",
    "libelleCourt": "Salon Mansart",
    "libelleLong": "Salon Mansart, 101, rue de l'Université"
  },
  "cycleDeVie": {
    "etat": "Confirmé",
    "chrono": {
      "creation": "2018-01-15T15:01:03.000+01:00"
    }
  },
  "demandeurs": {
    "acteurs": [
      {
        "nom": "Mme Samantha CAZEBONNE",
        "acteurRef": "PA721166"
      }
    ]
  },
  "typeReunion": "DEP"
}