{
  "uid": "RUANR5L15S2018IDF0106017",
  "timestampDebut": "2018-02-26T16:00:00.000+01:00",
  "timestampFin": "2018-02-26T17:30:00.000+01:00",
  "lieu": {
    "code": "SALREU013",
    "libelleCourt": "Salle N° 3",
    "libelleLong": "Salle N° 3, 3, rue Aristide Briand"
  },
  "cycleDeVie": {
    "etat": "Annulé",
    "chrono": {
      "creation": "2018-02-16T15:26:04.000+01:00",
      "cloture": "2018-02-22T10:13:54.000+01:00"
    }
  },
  "demandeurs": {
    "acteurs": [
      {
        "nom": "M. Stanislas GUERINI",
        "acteurRef": "PA721498"
      }
    ]
  },
  "typeReunion": "DEP"
}