{
  "uid": "RUANR5L14S2018IDF0099312",
  "timestampDebut": "2017-10-26T11:30:00.000+02:00",
  "timestampFin": "2017-10-26T13:30:00.000+02:00",
  "lieu": {
    "code": "SALREU020",
    "libelleCourt": "Salon Mars II",
    "libelleLong": "Salon Mars II, 101, rue de l'Université"
  },
  "cycleDeVie": {
    "etat": "Confirmé",
    "chrono": {
      "creation": "2017-10-25T17:50:57.000+02:00"
    }
  },
  "demandeurs": {
    "acteurs": [
      {
        "nom": "M. François JOLIVET",
        "acteurRef": "PA719778"
      }
    ]
  },
  "typeReunion": "DEP"
}