{
  "uid": "RUANR5L14S2018IDF0097815",
  "timestampDebut": "2017-10-04T16:30:00.000+02:00",
  "timestampFin": "2017-10-04T18:00:00.000+02:00",
  "lieu": {
    "code": "SALREU044",
    "libelleCourt": "Sully 2",
    "libelleLong": "Sully 2, Palais Bourbon"
  },
  "cycleDeVie": {
    "etat": "Confirmé",
    "chrono": {
      "creation": "2017-10-03T09:33:48.000+02:00"
    }
  },
  "demandeurs": {
    "acteurs": [
      {
        "nom": "Mme Perrine GOULET",
        "acteurRef": "PA720560"
      }
    ]
  },
  "typeReunion": "DEP"
}