{
  "uid": "RUANR5L14S2018IDF0095461",
  "timestampDebut": "2017-10-02T14:00:00.000+02:00",
  "timestampFin": "2017-10-02T20:00:00.000+02:00",
  "lieu": {
    "code": "SALREU017",
    "libelleCourt": "Salon Visconti",
    "libelleLong": "Salon Visconti, 101, rue de l'Université"
  },
  "cycleDeVie": {
    "etat": "Confirmé",
    "chrono": {
      "creation": "2017-08-30T18:18:45.000+02:00"
    }
  },
  "demandeurs": {
    "acteurs": [
      {
        "nom": "M. Paul CHRISTOPHE",
        "acteurRef": "PA642868"
      }
    ]
  },
  "typeReunion": "DEP"
}