{
  "uid": "RUANR5L14S2018IDF0097705",
  "timestampDebut": "2017-10-25T14:00:00.000+02:00",
  "timestampFin": "2017-10-25T15:00:00.000+02:00",
  "lieu": {
    "code": "SALREU020",
    "libelleCourt": "Salon Mars II",
    "libelleLong": "Salon Mars II, 101, rue de l'Université"
  },
  "cycleDeVie": {
    "etat": "Annulé",
    "chrono": {
      "creation": "2017-10-02T16:07:27.000+02:00",
      "cloture": "2017-10-23T15:20:01.000+02:00"
    }
  },
  "demandeurs": {
    "acteurs": [
      {
        "nom": "M. Jacques MAIRE",
        "acteurRef": "PA722178"
      }
    ]
  },
  "typeReunion": "DEP"
}