{
  "uid": "RUANR5L15S2018IDC428658",
  "timestampDebut": "2018-02-22T09:30:00.000+01:00",
  "lieu": {
    "libelleLong": "salle 4203 (33 rue Saint-Dominique)"
  },
  "cycleDeVie": {
    "etat": "Confirmé",
    "chrono": {
      "creation": "2018-02-21T00:00:00.000+01:00"
    }
  },
  "organeReuniRef": "PO744312",
  "participants": {},
  "ouverturePresse": false,
  "odj": {
    "convocationOdj": [
      "– Table ronde sur la promotion du Cinéma, en présence de : \n– M. Serge Toubiana, président d’Ubifrance et M. Frédéric Bereyziat, directeur Général Adjoint,\n– Mme Anne Tallineau, directrice générale déléguée de l’Institut Français, \n– M. Xavier Lardoux, directeur du Cinéma du CNC (centre national du cinéma et de l’image animée), \n– Mme Marguerite Hitier, responsable du pôle des médias et du cinéma à la Direction de la culture, de l’enseignement, de la recherche et du réseau au Ministère de l’Europe et des Affaires étrangères."
    ],
    "resumeOdj": [
      "table ronde sur la promotion du cinéma, en présence de :",
      "M. Serge Toubiana, président d’Ubifrance et M. Frédéric Bereyziat, directeur général adjoint ;",
      "Mme Anne Tallineau, directrice générale déléguée de l’Institut Français ;",
      "M. Xavier Lardoux, directeur du cinéma du CNC (centre national du cinéma et de l’image animée) ;",
      "Mme Marguerite Hitier, responsable du pôle des médias et du cinéma à la direction de la culture, de l’enseignement, de la recherche et du réseau au ministère de l’Europe et des Affaires étrangères."
    ]
  }
}