{
  "uid": "RUANR5L14S2017IDF0093750",
  "timestampDebut": "2017-07-10T15:00:00.000+02:00",
  "timestampFin": "2017-07-10T16:00:00.000+02:00",
  "lieu": {
    "code": "SALREU010",
    "libelleCourt": "Salle N° 1",
    "libelleLong": "Salle N° 1, 3, rue Aristide Briand"
  },
  "cycleDeVie": {
    "etat": "Confirmé",
    "chrono": {
      "creation": "2017-07-07T17:07:08.000+02:00"
    }
  },
  "demandeurs": {
    "acteurs": [
      {
        "nom": "M. Pierre DHARRÉVILLE",
        "acteurRef": "PA718926"
      }
    ]
  },
  "typeReunion": "DEP"
}