{
  "uid": "RUANR5L14S2017IDF0095900",
  "timestampDebut": "2017-09-26T14:00:00.000+02:00",
  "timestampFin": "2017-09-26T15:00:00.000+02:00",
  "lieu": {
    "code": "SALREU008",
    "libelleCourt": "5ème Bureau",
    "libelleLong": "5ème Bureau, Palais Bourbon"
  },
  "cycleDeVie": {
    "etat": "Confirmé",
    "chrono": {
      "creation": "2017-09-08T10:41:12.000+02:00"
    }
  },
  "demandeurs": {
    "acteurs": [
      {
        "nom": "M. Saïd AHAMADA",
        "acteurRef": "PA718954"
      }
    ]
  },
  "typeReunion": "DEP"
}