{
  "uid": "RUANR5L14S2018IDF0099676",
  "timestampDebut": "2017-11-14T14:00:00.000+01:00",
  "timestampFin": "2017-11-14T15:00:00.000+01:00",
  "lieu": {
    "code": "SALREU018",
    "libelleCourt": "Salon Mansart",
    "libelleLong": "Salon Mansart, 101, rue de l'Université"
  },
  "cycleDeVie": {
    "etat": "Confirmé",
    "chrono": {
      "creation": "2017-11-02T16:25:36.000+01:00"
    }
  },
  "demandeurs": {
    "acteurs": [
      {
        "nom": "M. Christophe BOUILLON",
        "acteurRef": "PA267233"
      }
    ]
  },
  "typeReunion": "DEP"
}