{
  "uid": "RUANR5L14S2018IDF0100422",
  "timestampDebut": "2017-11-16T16:30:00.000+01:00",
  "timestampFin": "2017-11-16T17:30:00.000+01:00",
  "lieu": {
    "code": "SALREU008",
    "libelleCourt": "5ème Bureau",
    "libelleLong": "5ème Bureau, Palais Bourbon"
  },
  "cycleDeVie": {
    "etat": "Annulé",
    "chrono": {
      "creation": "2017-11-15T14:21:28.000+01:00",
      "cloture": "2017-11-16T12:29:19.000+01:00"
    }
  },
  "demandeurs": {
    "organe": {
      "nom": "GROUPE LA RÉPUBLIQUE EN MARCHE",
      "organeRef": "PO730964"
    }
  },
  "organeReuniRef": "PO730964",
  "typeReunion": "GP"
}