{
  "uid": "RUANR5L14S2017IDF0093875",
  "timestampDebut": "2017-07-19T14:00:00.000+02:00",
  "timestampFin": "2017-07-19T15:00:00.000+02:00",
  "lieu": {
    "code": "SALREU049",
    "libelleCourt": "Salle 6822",
    "libelleLong": "Salle 6822, Palais Bourbon"
  },
  "cycleDeVie": {
    "etat": "Confirmé",
    "chrono": {
      "creation": "2017-07-12T11:24:18.000+02:00"
    }
  },
  "demandeurs": {
    "acteurs": [
      {
        "nom": "M. Yves BLEIN",
        "acteurRef": "PA608641"
      }
    ]
  },
  "typeReunion": "DEP"
}