{
  "uid": "RUANR5L14S2017IDF0097258",
  "timestampDebut": "2017-09-28T16:00:00.000+02:00",
  "timestampFin": "2017-09-28T17:00:00.000+02:00",
  "lieu": {
    "code": "SALREU012",
    "libelleCourt": "Salle N° 23",
    "libelleLong": "Salle N° 23, 3, rue Aristide Briand"
  },
  "cycleDeVie": {
    "etat": "Confirmé",
    "chrono": {
      "creation": "2017-09-27T18:40:33.000+02:00"
    }
  },
  "demandeurs": {
    "acteurs": [
      {
        "nom": "M. Laurent SAINT-MARTIN",
        "acteurRef": "PA720878"
      }
    ]
  },
  "typeReunion": "DEP"
}