{
  "uid": "RUANR5L15S2018IDC428227",
  "timestampDebut": "2018-01-18T14:00:00.000+01:00",
  "lieu": {
    "libelleLong": "salle 6550 (2e étage)"
  },
  "cycleDeVie": {
    "etat": "Confirmé",
    "chrono": {
      "creation": "2018-01-11T00:00:00.000+01:00"
    }
  },
  "organeReuniRef": "PO738797",
  "participants": {
    "personnesAuditionnees": [
      {
        "xsiType": "IdPersonneExterne_type",
        "uid": "PE2494",
        "ident": {
          "civ": "M.",
          "prenom": "Philippe",
          "nom": "GALLI"
        },
        "dateNais": "1956-07-08T01:00:00.000+01:00"
      }
    ]
  },
  "ouverturePresse": false,
  "odj": {
    "convocationOdj": [
      "Audition de M. Philippe Galli, membre du Conseil supérieur de l'appui territorial et de l'évaluation (CASTE), ancien préfet de Seine-Saint-Denis."
    ],
    "resumeOdj": [
      "audition de M. Philippe Galli, membre du Conseil supérieur de l'appui territorial et de l'évaluation (CASTE), ancien préfet de Seine-Saint-Denis."
    ]
  }
}