{
  "uid": "RUANR5L14S2017IDF0094525",
  "timestampDebut": "2017-09-05T09:30:00.000+02:00",
  "timestampFin": "2017-09-05T10:30:00.000+02:00",
  "lieu": {
    "code": "SALREU025",
    "libelleCourt": "7ème Bureau",
    "libelleLong": "7ème Bureau, Palais Bourbon"
  },
  "cycleDeVie": {
    "etat": "Annulé",
    "chrono": {
      "creation": "2017-07-21T18:10:24.000+02:00",
      "cloture": "2017-08-02T18:43:14.000+02:00"
    }
  },
  "demandeurs": {
    "organe": {
      "nom": "GROUPE DU MOUVEMENT DÉMOCRATE ET APPARENTÉS",
      "organeRef": "PO730970"
    }
  },
  "organeReuniRef": "PO730970",
  "typeReunion": "GP"
}