{
  "uid": "RUANR5L14S2017IDF0093282",
  "timestampDebut": "2017-06-28T11:30:00.000+02:00",
  "timestampFin": "2017-06-28T13:00:00.000+02:00",
  "lieu": {
    "code": "SALREU015",
    "libelleCourt": "Salle 7044",
    "libelleLong": "Salle 7044, 103, rue de l'Université"
  },
  "cycleDeVie": {
    "etat": "Confirmé",
    "chrono": {
      "creation": "2017-06-28T10:03:06.000+02:00"
    }
  },
  "demandeurs": {
    "acteurs": [
      {
        "nom": "M. Richard FERRAND",
        "acteurRef": "PA606171"
      }
    ]
  },
  "typeReunion": "DEP"
}