{
  "uid": "RUANR5L14S2018IDF0099748",
  "timestampDebut": "2017-11-06T10:30:00.000+01:00",
  "timestampFin": "2017-11-06T12:30:00.000+01:00",
  "lieu": {
    "code": "SALREU049",
    "libelleCourt": "Salle 6822",
    "libelleLong": "Salle 6822, Palais Bourbon"
  },
  "cycleDeVie": {
    "etat": "Confirmé",
    "chrono": {
      "creation": "2017-11-06T09:14:12.000+01:00"
    }
  },
  "demandeurs": {
    "acteurs": [
      {
        "nom": "M. Boris VALLAUD",
        "acteurRef": "PA719930"
      }
    ]
  },
  "typeReunion": "DEP"
}