{
  "uid": "RUANR5L15S2018IDC427968",
  "timestampDebut": "2017-11-28T09:35:00.000+01:00",
  "timestampFin": "2017-11-28T10:35:00.000+01:00",
  "lieu": {
    "libelleLong": "salle de la commission des Finances"
  },
  "cycleDeVie": {
    "etat": "Confirmé",
    "chrono": {
      "creation": "2017-11-24T00:00:00.000+01:00"
    }
  },
  "organeReuniRef": "PO201269",
  "participants": {
    "participantsInternes": [
      {
        "acteurRef": "PA719318",
        "presence": "absent"
      },
      {
        "acteurRef": "PA719806",
        "presence": "absent"
      },
      {
        "acteurRef": "PA719558",
        "presence": "absent"
      },
      {
        "acteurRef": "PA342415",
        "presence": "absent"
      },
      {
        "acteurRef": "PA720210",
        "presence": "absent"
      },
      {
        "acteurRef": "PA441",
        "presence": "absent"
      },
      {
        "acteurRef": "PA330684",
        "presence": "excusé"
      },
      {
        "acteurRef": "PA719496",
        "presence": "présent"
      },
      {
        "acteurRef": "PA721750",
        "presence": "présent"
      },
      {
        "acteurRef": "PA429893",
        "presence": "absent"
      },
      {
        "acteurRef": "PA719448",
        "presence": "absent"
      },
      {
        "acteurRef": "PA719624",
        "presence": "absent"
      },
      {
        "acteurRef": "PA608826",
        "presence": "présent"
      },
      {
        "acteurRef": "PA721742",
        "presence": "excusé"
      },
      {
        "acteurRef": "PA721384",
        "presence": "absent"
      },
      {
        "acteurRef": "PA720806",
        "presence": "absent"
      },
      {
        "acteurRef": "PA605991",
        "presence": "excusé"
      },
      {
        "acteurRef": "PA721296",
        "presence": "présent"
      },
      {
        "acteurRef": "PA722054",
        "presence": "présent"
      },
      {
        "acteurRef": "PA267801",
        "presence": "absent"
      },
      {
        "acteurRef": "PA720202",
        "presence": "absent"
      },
      {
        "acteurRef": "PA719842",
        "presence": "présent"
      },
      {
        "acteurRef": "PA720916",
        "presence": "présent"
      },
      {
        "acteurRef": "PA720342",
        "presence": "excusé"
      },
      {
        "acteurRef": "PA334116",
        "presence": "absent"
      },
      {
        "acteurRef": "PA721656",
        "presence": "absent"
      },
      {
        "acteurRef": "PA719520",
        "presence": "absent"
      },
      {
        "acteurRef": "PA719632",
        "presence": "présent"
      },
      {
        "acteurRef": "PA718736",
        "presence": "absent"
      },
      {
        "acteurRef": "PA720720",
        "presence": "absent"
      },
      {
        "acteurRef": "PA720552",
        "presence": "absent"
      },
      {
        "acteurRef": "PA722252",
        "presence": "absent"
      },
      {
        "acteurRef": "PA722022",
        "presence": "absent"
      },
      {
        "acteurRef": "PA718860",
        "presence": "absent"
      },
      {
        "acteurRef": "PA718780",
        "presence": "absent"
      },
      {
        "acteurRef": "PA721474",
        "presence": "présent"
      }
    ]
  },
  "ouverturePresse": true,
  "odj": {
    "convocationOdj": [
      "Nomination d’un corapporteur d’information sur les femmes et les sciences.",
      "Audition, sur les femmes et les sciences, de Mme Aline Aubertin, présidente de l’association Femmes ingénieures et de Mme Véronique Chauveau, vice-présidente de l’association Femmes et mathématiques."
    ],
    "resumeOdj": [
      "nomination d’un corapporteur d’information sur les femmes et les sciences ;",
      "audition, sur les femmes et les sciences, de Mme Aline Aubertin, présidente de l’association Femmes ingénieures et de Mme Véronique Chauveau, vice-présidente de l’association Femmes et mathématiques."
    ]
  },
  "compteRenduRef": "CRCANR5L15S2018PO201269N009"
}