{
  "uid": "RUANR5L14S2018IDF0101564",
  "timestampDebut": "2017-11-30T12:00:00.000+01:00",
  "timestampFin": "2017-11-30T13:00:00.000+01:00",
  "lieu": {
    "code": "SALREU045",
    "libelleCourt": "Sully 3",
    "libelleLong": "Sully 3, Palais Bourbon"
  },
  "cycleDeVie": {
    "etat": "Confirmé",
    "chrono": {
      "creation": "2017-11-29T11:08:21.000+01:00"
    }
  },
  "demandeurs": {
    "acteurs": [
      {
        "nom": "Mme Olivia GREGOIRE",
        "acteurRef": "PA721764"
      }
    ]
  },
  "typeReunion": "DEP"
}