{
  "uid": "RUANR5L14S2018IDF0101586",
  "timestampDebut": "2017-11-29T16:00:00.000+01:00",
  "timestampFin": "2017-11-29T17:00:00.000+01:00",
  "lieu": {
    "code": "SALREU010",
    "libelleCourt": "Salle N° 1",
    "libelleLong": "Salle N° 1, 3, rue Aristide Briand"
  },
  "cycleDeVie": {
    "etat": "Confirmé",
    "chrono": {
      "creation": "2017-11-29T15:12:24.000+01:00"
    }
  },
  "demandeurs": {
    "acteurs": [
      {
        "nom": "Mme Valérie LACROUTE",
        "acteurRef": "PA609245"
      }
    ]
  },
  "typeReunion": "DEP"
}