{
  "uid": "RUANR5L15S2018IDF0103535",
  "timestampDebut": "2018-01-16T12:00:00.000+01:00",
  "timestampFin": "2018-01-16T13:30:00.000+01:00",
  "lieu": {
    "code": "SALREU008",
    "libelleCourt": "5ème Bureau",
    "libelleLong": "5ème Bureau, Palais Bourbon"
  },
  "cycleDeVie": {
    "etat": "Confirmé",
    "chrono": {
      "creation": "2018-01-12T17:46:42.000+01:00"
    }
  },
  "demandeurs": {
    "acteurs": [
      {
        "nom": "M. Nicolas FORISSIER",
        "acteurRef": "PA1327"
      }
    ]
  },
  "typeReunion": "DEP"
}