{
  "uid": "RUANR5L14S2018IDF0102269",
  "timestampDebut": "2018-01-16T08:00:00.000+01:00",
  "timestampFin": "2018-01-16T13:00:00.000+01:00",
  "lieu": {
    "code": "SALREU045",
    "libelleCourt": "Sully 3",
    "libelleLong": "Sully 3, Palais Bourbon"
  },
  "cycleDeVie": {
    "etat": "Annulé",
    "chrono": {
      "creation": "2017-12-13T12:18:56.000+01:00",
      "cloture": "2017-12-21T11:05:25.000+01:00"
    }
  },
  "demandeurs": {
    "acteurs": [
      {
        "nom": "M. Richard FERRAND",
        "acteurRef": "PA606171"
      }
    ]
  },
  "typeReunion": "DEP"
}