{
  "uid": "RUANR5L14S2018IDF0100315",
  "timestampDebut": "2017-11-15T09:30:00.000+01:00",
  "timestampFin": "2017-11-15T11:00:00.000+01:00",
  "lieu": {
    "code": "SALREU049",
    "libelleCourt": "Salle 6822",
    "libelleLong": "Salle 6822, Palais Bourbon"
  },
  "cycleDeVie": {
    "etat": "Confirmé",
    "chrono": {
      "creation": "2017-11-14T09:10:55.000+01:00"
    }
  },
  "demandeurs": {
    "acteurs": [
      {
        "nom": "M. Damien ADAM",
        "acteurRef": "PA722038"
      }
    ]
  },
  "typeReunion": "DEP"
}