{
  "uid": "RUANR5L15S2018IDF0105464",
  "timestampDebut": "2018-03-29T08:30:00.000+02:00",
  "timestampFin": "2018-03-29T10:30:00.000+02:00",
  "lieu": {
    "code": "SALREU005",
    "libelleCourt": "2ème Bureau",
    "libelleLong": "2ème Bureau, Palais Bourbon"
  },
  "cycleDeVie": {
    "etat": "Confirmé",
    "chrono": {
      "creation": "2018-02-09T09:14:52.000+01:00"
    }
  },
  "demandeurs": {
    "acteurs": [
      {
        "nom": "M. Patrice VERCHÈRE",
        "acteurRef": "PA334843"
      }
    ]
  },
  "typeReunion": "DEP"
}