{
  "uid": "RUANR5L14S2018IDF0096954",
  "timestampDebut": "2017-10-10T14:30:00.000+02:00",
  "timestampFin": "2017-10-10T16:30:00.000+02:00",
  "lieu": {
    "code": "SALREU038",
    "libelleCourt": "Salle 6549",
    "libelleLong": "Salle 6549, Palais Bourbon"
  },
  "cycleDeVie": {
    "etat": "Confirmé",
    "chrono": {
      "creation": "2017-09-25T13:47:49.000+02:00"
    }
  },
  "demandeurs": {
    "acteurs": [
      {
        "nom": "M. Julien AUBERT",
        "acteurRef": "PA609726"
      }
    ]
  },
  "typeReunion": "DEP"
}