{
  "uid": "RUANR5L15S2018IDC428154",
  "timestampDebut": "2018-02-08T14:00:00.000+01:00",
  "lieu": {
    "libelleLong": "salle 4013 (33 rue Saint-Dominique)"
  },
  "cycleDeVie": {
    "etat": "Supprimé",
    "chrono": {
      "creation": "2017-12-15T00:00:00.000+01:00",
      "cloture": "2018-01-26T00:00:00.000+01:00"
    }
  },
  "organeReuniRef": "PO743823",
  "participants": {},
  "ouverturePresse": false,
  "odj": {
    "convocationOdj": [
      "Audition de M. l’ingénieur général de l’armement Guillaume Poupard, directeur général de l’ANSSI."
    ],
    "resumeOdj": [
      "audition de M. l’ingénieur général de l’armement Guillaume Poupard, directeur général de l’ANSSI."
    ]
  }
}