{
  "uid": "RUANR5L14S2018IDF0097903",
  "timestampDebut": "2017-10-24T14:00:00.000+02:00",
  "timestampFin": "2017-10-24T16:00:00.000+02:00",
  "lieu": {
    "code": "SALREU038",
    "libelleCourt": "Salle 6549",
    "libelleLong": "Salle 6549, Palais Bourbon"
  },
  "cycleDeVie": {
    "etat": "Confirmé",
    "chrono": {
      "creation": "2017-10-04T12:23:34.000+02:00"
    }
  },
  "demandeurs": {
    "acteurs": [
      {
        "nom": "M. Jean-Pierre DOOR",
        "acteurRef": "PA267289"
      }
    ]
  },
  "typeReunion": "DEP"
}