{
  "uid": "RUANR5L14S2017IDF0096328",
  "timestampDebut": "2017-09-19T14:00:00.000+02:00",
  "timestampFin": "2017-09-19T15:00:00.000+02:00",
  "lieu": {
    "code": "SALREU016",
    "libelleCourt": "Salon Gabriel",
    "libelleLong": "Salon Gabriel, 101, rue de l'Université"
  },
  "cycleDeVie": {
    "etat": "Confirmé",
    "chrono": {
      "creation": "2017-09-14T13:51:33.000+02:00"
    }
  },
  "demandeurs": {
    "acteurs": [
      {
        "nom": "M. Jacques SAVATIER",
        "acteurRef": "PA722078"
      }
    ]
  },
  "typeReunion": "DEP"
}