{
  "uid": "RUANR5L15S2018IDC428155",
  "timestampDebut": "2017-12-19T20:30:00.000+01:00",
  "timestampFin": "2017-12-19T20:45:00.000+01:00",
  "lieu": {
    "libelleLong": "Sénat"
  },
  "cycleDeVie": {
    "etat": "Confirmé",
    "chrono": {
      "creation": "2017-12-15T00:00:00.000+01:00"
    }
  },
  "organeReuniRef": "PO746520",
  "participants": {
    "participantsInternes": [
      {
        "acteurRef": "PA429858",
        "presence": "présent"
      },
      {
        "acteurRef": "PA342415",
        "presence": "présent"
      },
      {
        "acteurRef": "PA703522",
        "presence": "absent"
      },
      {
        "acteurRef": "PA721908",
        "presence": "présent"
      },
      {
        "acteurRef": "PA719890",
        "presence": "absent"
      },
      {
        "acteurRef": "PA736190",
        "presence": "absent"
      },
      {
        "acteurRef": "PA304071",
        "presence": "absent"
      },
      {
        "acteurRef": "PA267340",
        "presence": "présent"
      },
      {
        "acteurRef": "PA703494",
        "presence": "présent"
      },
      {
        "acteurRef": "PA720154",
        "presence": "présent"
      },
      {
        "acteurRef": "PA643175",
        "presence": "présent"
      },
      {
        "acteurRef": "PA703538",
        "presence": "présent"
      },
      {
        "acteurRef": "PA719692",
        "presence": "présent"
      },
      {
        "acteurRef": "PA415454",
        "presence": "absent"
      },
      {
        "acteurRef": "PA266795",
        "presence": "présent"
      },
      {
        "acteurRef": "PA642756",
        "presence": "absent"
      },
      {
        "acteurRef": "PA719874",
        "presence": "présent"
      },
      {
        "acteurRef": "PA736205",
        "presence": "absent"
      },
      {
        "acteurRef": "PA719994",
        "presence": "présent"
      },
      {
        "acteurRef": "PA736229",
        "presence": "présent"
      },
      {
        "acteurRef": "PA722228",
        "presence": "présent"
      },
      {
        "acteurRef": "PA429832",
        "presence": "absent"
      },
      {
        "acteurRef": "PA266788",
        "presence": "absent"
      },
      {
        "acteurRef": "PA2552",
        "presence": "présent"
      },
      {
        "acteurRef": "PA721314",
        "presence": "présent"
      },
      {
        "acteurRef": "PA709315",
        "presence": "présent"
      },
      {
        "acteurRef": "PA720318",
        "presence": "présent"
      }
    ]
  },
  "ouverturePresse": false,
  "odj": {
    "convocationOdj": [
      "Nomination du Bureau ;",
      "Nomination des rapporteurs ;",
      "Examen des dispositions restant en discussion de la proposition de loi."
    ],
    "resumeOdj": [
      "Nomination du Bureau ;",
      "Nomination des rapporteurs ;",
      "Examen des dispositions restant en discussion de la proposition de loi."
    ]
  }
}