{
  "uid": "RUANR5L15S2018IDC428761",
  "timestampDebut": "2018-03-21T09:30:00.000+01:00",
  "lieu": {
    "libelleLong": "salle 6237 (Développement durable)"
  },
  "cycleDeVie": {
    "etat": "Eventuel",
    "chrono": {
      "creation": "2018-03-08T00:00:00.000+01:00"
    }
  },
  "organeReuniRef": "PO419865",
  "participants": {},
  "ouverturePresse": false,
  "odj": {
    "convocationOdj": [
      "– En application de l’article 13 de la Constitution, audition de M. Gilles Leblanc, dont la nomination est proposée par M. le Président de la République à la fonction de président de l’Autorité de contrôle des nuisances sonores aéroportuaires (ACNUSA) ;"
    ],
    "resumeOdj": [
      "en application de l’article 13 de la Constitution, audition de M. Gilles Leblanc, dont la nomination est proposée par M. le Président de la République à la fonction de président de l’Autorité de contrôle des nuisances sonores aéroportuaires (ACNUSA)."
    ]
  }
}