{
  "uid": "RUANR5L14S2018IDF0099276",
  "timestampDebut": "2017-10-30T15:00:00.000+01:00",
  "timestampFin": "2017-10-30T16:00:00.000+01:00",
  "lieu": {
    "code": "SALREU011",
    "libelleCourt": "Salle N° 2",
    "libelleLong": "Salle N° 2, 3, rue Aristide Briand"
  },
  "cycleDeVie": {
    "etat": "Annulé",
    "chrono": {
      "creation": "2017-10-25T14:48:16.000+02:00",
      "cloture": null
    }
  },
  "demandeurs": {
    "acteurs": [
      {
        "nom": "M. Stéphane VIRY",
        "acteurRef": "PA721474"
      }
    ]
  },
  "typeReunion": "DEP"
}