{
  "uid": "RUANR5L14S2017IDF0094739",
  "timestampDebut": "2017-09-21T10:00:00.000+02:00",
  "timestampFin": "2017-09-21T12:30:00.000+02:00",
  "lieu": {
    "code": "SALREU004",
    "libelleCourt": "1er Bureau",
    "libelleLong": "1er Bureau, Palais Bourbon"
  },
  "cycleDeVie": {
    "etat": "Confirmé",
    "chrono": {
      "creation": "2017-07-26T10:19:04.000+02:00",
      "cloture": "2017-08-22T12:06:15.000+02:00"
    }
  },
  "demandeurs": {
    "acteurs": [
      {
        "nom": "M. Patrick VIGNAL",
        "acteurRef": "PA606639"
      }
    ]
  },
  "typeReunion": "DEP"
}