{
  "uid": "RUANR5L15S2018IDF0106987",
  "timestampDebut": "2018-03-14T12:30:00.000+01:00",
  "timestampFin": "2018-03-14T14:00:00.000+01:00",
  "lieu": {
    "code": "SALREU020",
    "libelleCourt": "Salon Mars II",
    "libelleLong": "Salon Mars II, 101, rue de l'Université"
  },
  "cycleDeVie": {
    "etat": "Confirmé",
    "chrono": {
      "creation": "2018-03-06T11:31:39.000+01:00"
    }
  },
  "demandeurs": {
    "acteurs": [
      {
        "nom": "M. Arnaud VIALA",
        "acteurRef": "PA709315"
      }
    ]
  },
  "typeReunion": "DEP"
}