{
  "uid": "RUANR5L14S2017IDF0096439",
  "timestampDebut": "2017-09-29T09:00:00.000+02:00",
  "timestampFin": "2017-09-29T13:00:00.000+02:00",
  "lieu": {
    "code": "SALREU029",
    "libelleCourt": "Salon Mars III",
    "libelleLong": "Salon Mars III, 101, rue de l'Université"
  },
  "cycleDeVie": {
    "etat": "Annulé",
    "chrono": {
      "creation": "2017-09-15T15:41:06.000+02:00",
      "cloture": "2017-09-28T19:43:42.000+02:00"
    }
  },
  "demandeurs": {
    "acteurs": [
      {
        "nom": "M. Olivier FAURE",
        "acteurRef": "PA609332"
      }
    ]
  },
  "typeReunion": "DEP"
}