{
  "uid": "RUANR5L15S2018IDF0104527",
  "timestampDebut": "2018-02-15T10:00:00.000+01:00",
  "timestampFin": "2018-02-15T12:00:00.000+01:00",
  "lieu": {
    "code": "SALREU013",
    "libelleCourt": "Salle N° 3",
    "libelleLong": "Salle N° 3, 3, rue Aristide Briand"
  },
  "cycleDeVie": {
    "etat": "Confirmé",
    "chrono": {
      "creation": "2018-01-29T11:25:02.000+01:00"
    }
  },
  "demandeurs": {
    "acteurs": [
      {
        "nom": "Mme Marie-George BUFFET",
        "acteurRef": "PA689"
      },
      {
        "nom": "M. Pierre-Alain RAPHAN",
        "acteurRef": "PA721888"
      }
    ]
  },
  "typeReunion": "DEP"
}