{
  "uid": "RUANR5L14S2017IDF0095250",
  "timestampDebut": "2017-09-26T09:00:00.000+02:00",
  "timestampFin": "2017-09-26T12:00:00.000+02:00",
  "lieu": {
    "code": "SALREU021",
    "libelleCourt": "Salle 7207",
    "libelleLong": "Salle 7207, 101, rue de l'Université"
  },
  "cycleDeVie": {
    "etat": "Confirmé",
    "chrono": {
      "creation": "2017-08-08T10:04:06.000+02:00"
    }
  },
  "demandeurs": {
    "acteurs": [
      {
        "nom": "Mme Bénédicte PEYROL",
        "acteurRef": "PA718736"
      },
      {
        "nom": "Mme Dominique DAVID",
        "acteurRef": "PA719710"
      }
    ]
  },
  "typeReunion": "DEP"
}