{
  "uid": "RUANR5L14S2018IDF0094913",
  "timestampDebut": "2017-12-02T13:00:00.000+01:00",
  "timestampFin": "2017-12-02T17:00:00.000+01:00",
  "lieu": {
    "code": "SALREU026",
    "libelleCourt": "9ème Bureau",
    "libelleLong": "9ème Bureau, Palais Bourbon"
  },
  "cycleDeVie": {
    "etat": "Confirmé",
    "chrono": {
      "creation": "2017-07-31T15:31:17.000+02:00"
    }
  },
  "demandeurs": {
    "acteurs": [
      {
        "nom": "Mme George PAU-LANGEVIN",
        "acteurRef": "PA335532"
      }
    ]
  },
  "typeReunion": "DEP"
}