{
  "uid": "RUANR5L14S2018IDF0094612",
  "timestampDebut": "2017-12-13T08:00:00.000+01:00",
  "timestampFin": "2017-12-13T10:00:00.000+01:00",
  "lieu": {
    "code": "SALREU008",
    "libelleCourt": "5ème Bureau",
    "libelleLong": "5ème Bureau, Palais Bourbon"
  },
  "cycleDeVie": {
    "etat": "Confirmé",
    "chrono": {
      "creation": "2017-07-24T15:44:24.000+02:00"
    }
  },
  "demandeurs": {
    "organe": {
      "nom": "GROUPE LA RÉPUBLIQUE EN MARCHE",
      "organeRef": "PO730964"
    }
  },
  "organeReuniRef": "PO730964",
  "typeReunion": "GP"
}