{
  "uid": "RUANR5L14S2018IDF0101203",
  "timestampDebut": "2017-11-28T11:00:00.000+01:00",
  "timestampFin": "2017-11-28T13:00:00.000+01:00",
  "lieu": {
    "code": "SALREU007",
    "libelleCourt": "4ème Bureau",
    "libelleLong": "4ème Bureau, Palais Bourbon"
  },
  "cycleDeVie": {
    "etat": "Confirmé",
    "chrono": {
      "creation": "2017-11-22T18:21:23.000+01:00"
    }
  },
  "demandeurs": {
    "acteurs": [
      {
        "nom": "M. Christophe NAEGELEN",
        "acteurRef": "PA721486"
      }
    ]
  },
  "typeReunion": "DEP"
}