{
  "uid": "RUANR5L15S2018IDF0104314",
  "timestampDebut": "2018-01-25T08:30:00.000+01:00",
  "timestampFin": "2018-01-25T09:30:00.000+01:00",
  "lieu": {
    "code": "SALREU019",
    "libelleCourt": "Salon Mars I",
    "libelleLong": "Salon Mars I, 101, rue de l'Université"
  },
  "cycleDeVie": {
    "etat": "Confirmé",
    "chrono": {
      "creation": "2018-01-24T14:52:32.000+01:00"
    }
  },
  "demandeurs": {
    "acteurs": [
      {
        "nom": "Mme Christelle DUBOS",
        "acteurRef": "PA719660"
      }
    ]
  },
  "typeReunion": "DEP"
}