{
  "uid": "RUANR5L15S2018IDF0102518",
  "timestampDebut": "2018-02-06T09:00:00.000+01:00",
  "timestampFin": "2018-02-06T11:00:00.000+01:00",
  "lieu": {
    "code": "SALREU019",
    "libelleCourt": "Salon Mars I",
    "libelleLong": "Salon Mars I, 101, rue de l'Université"
  },
  "cycleDeVie": {
    "etat": "Confirmé",
    "chrono": {
      "creation": "2017-12-15T19:08:12.000+01:00"
    }
  },
  "demandeurs": {
    "organe": {
      "nom": "GROUPE LA RÉPUBLIQUE EN MARCHE",
      "organeRef": "PO730964"
    }
  },
  "organeReuniRef": "PO730964",
  "typeReunion": "GP"
}