{
  "uid": "RUANR5L14S2018IDF0101708",
  "timestampDebut": "2017-12-07T18:00:00.000+01:00",
  "timestampFin": "2017-12-07T20:00:00.000+01:00",
  "lieu": {
    "code": "SALREU010",
    "libelleCourt": "Salle N° 1",
    "libelleLong": "Salle N° 1, 3, rue Aristide Briand"
  },
  "cycleDeVie": {
    "etat": "Confirmé",
    "chrono": {
      "creation": "2017-11-30T18:40:16.000+01:00"
    }
  },
  "demandeurs": {
    "acteurs": [
      {
        "nom": "M. Dominique POTIER",
        "acteurRef": "PA607553"
      }
    ]
  },
  "typeReunion": "DEP"
}