{
  "uid": "RUANR5L14S2018IDF0100838",
  "timestampDebut": "2017-12-05T19:30:00.000+01:00",
  "timestampFin": "2017-12-05T21:00:00.000+01:00",
  "lieu": {
    "code": "SALREU028",
    "libelleCourt": "Salle Colbert",
    "libelleLong": "Salle Colbert , Palais Bourbon"
  },
  "cycleDeVie": {
    "etat": "Annulé",
    "chrono": {
      "creation": "2017-11-16T12:32:21.000+01:00",
      "cloture": "2017-11-30T09:52:48.000+01:00"
    }
  },
  "demandeurs": {
    "organe": {
      "nom": "GROUPE LA RÉPUBLIQUE EN MARCHE",
      "organeRef": "PO730964"
    }
  },
  "organeReuniRef": "PO730964",
  "typeReunion": "GP"
}