{
  "uid": "RUANR5L15S2018IDF0102883",
  "timestampDebut": "2018-02-20T11:00:00.000+01:00",
  "timestampFin": "2018-02-20T13:00:00.000+01:00",
  "lieu": {
    "code": "SALREU003",
    "libelleCourt": "Salle Victor Hugo",
    "libelleLong": "Salle Victor Hugo, 101, rue de l'Université"
  },
  "cycleDeVie": {
    "etat": "Confirmé",
    "chrono": {
      "creation": "2017-12-20T17:16:54.000+01:00"
    }
  },
  "demandeurs": {
    "organe": {
      "nom": "GROUPE LA RÉPUBLIQUE EN MARCHE",
      "organeRef": "PO730964"
    }
  },
  "organeReuniRef": "PO730964",
  "typeReunion": "GP"
}