{
  "uid": "RUANR5L15S2018IDC427566",
  "timestampDebut": "2017-10-17T09:30:00.000+02:00",
  "timestampFin": "2017-10-17T11:00:00.000+02:00",
  "lieu": {
    "libelleLong": "salle 6242 (Lois)"
  },
  "cycleDeVie": {
    "etat": "Confirmé",
    "chrono": {
      "creation": "2017-10-13T00:00:00.000+02:00"
    }
  },
  "organeReuniRef": "PO201269",
  "participants": {
    "participantsInternes": [
      {
        "acteurRef": "PA719318",
        "presence": "absent"
      },
      {
        "acteurRef": "PA719806",
        "presence": "absent"
      },
      {
        "acteurRef": "PA719558",
        "presence": "absent"
      },
      {
        "acteurRef": "PA342415",
        "presence": "absent"
      },
      {
        "acteurRef": "PA720210",
        "presence": "absent"
      },
      {
        "acteurRef": "PA330684",
        "presence": "absent"
      },
      {
        "acteurRef": "PA689",
        "presence": "absent"
      },
      {
        "acteurRef": "PA719496",
        "presence": "absent"
      },
      {
        "acteurRef": "PA721750",
        "presence": "présent"
      },
      {
        "acteurRef": "PA429893",
        "presence": "absent"
      },
      {
        "acteurRef": "PA719448",
        "presence": "absent"
      },
      {
        "acteurRef": "PA719624",
        "presence": "présent"
      },
      {
        "acteurRef": "PA608826",
        "presence": "absent"
      },
      {
        "acteurRef": "PA721742",
        "presence": "présent"
      },
      {
        "acteurRef": "PA721384",
        "presence": "absent"
      },
      {
        "acteurRef": "PA720806",
        "presence": "absent"
      },
      {
        "acteurRef": "PA605991",
        "presence": "absent"
      },
      {
        "acteurRef": "PA721296",
        "presence": "absent"
      },
      {
        "acteurRef": "PA722054",
        "presence": "absent"
      },
      {
        "acteurRef": "PA267801",
        "presence": "absent"
      },
      {
        "acteurRef": "PA720202",
        "presence": "absent"
      },
      {
        "acteurRef": "PA719842",
        "presence": "présent"
      },
      {
        "acteurRef": "PA720916",
        "presence": "présent"
      },
      {
        "acteurRef": "PA720342",
        "presence": "présent"
      },
      {
        "acteurRef": "PA334116",
        "presence": "absent"
      },
      {
        "acteurRef": "PA721656",
        "presence": "présent"
      },
      {
        "acteurRef": "PA719520",
        "presence": "absent"
      },
      {
        "acteurRef": "PA719632",
        "presence": "présent"
      },
      {
        "acteurRef": "PA718736",
        "presence": "absent"
      },
      {
        "acteurRef": "PA720720",
        "presence": "excusé"
      },
      {
        "acteurRef": "PA720552",
        "presence": "présent"
      },
      {
        "acteurRef": "PA722252",
        "presence": "présent"
      },
      {
        "acteurRef": "PA722022",
        "presence": "absent"
      },
      {
        "acteurRef": "PA718860",
        "presence": "absent"
      },
      {
        "acteurRef": "PA718780",
        "presence": "absent"
      },
      {
        "acteurRef": "PA721474",
        "presence": "présent"
      }
    ]
  },
  "ouverturePresse": true,
  "odj": {
    "convocationOdj": [
      "Audition, ouverte à la presse, de Mme Michèle Loup, vice-présidente de la Fédération nationale Solidarité femmes (FNSF), réseau d’associations spécialisées dans l’accueil, l’accompagnement et l’hébergement des femmes victimes de violences, et de Mme Françoise Brié, directrice générale de la FNSF et membre du Haut Conseil à l’égalité entre les femmes et les hommes (HCE)."
    ],
    "resumeOdj": [
      "audition, ouverte à la presse, de Mme Michèle Loup, vice-présidente de la Fédération nationale Solidarité femmes (FNSF) et de Mme Françoise Brié, directrice générale de la FNSF et membre du Haut Conseil à l’égalité entre les femmes et les hommes (HCE)."
    ]
  },
  "compteRenduRef": "CRCANR5L15S2018PO201269N003"
}