{
  "uid": "RUANR5L15S2018IDF0106556",
  "timestampDebut": "2018-04-10T17:00:00.000+02:00",
  "timestampFin": "2018-04-10T19:00:00.000+02:00",
  "lieu": {
    "code": "SALREU008",
    "libelleCourt": "5ème Bureau",
    "libelleLong": "5ème Bureau, Palais Bourbon"
  },
  "cycleDeVie": {
    "etat": "Confirmé",
    "chrono": {
      "creation": "2018-02-23T16:34:23.000+01:00"
    }
  },
  "demandeurs": {
    "organe": {
      "nom": "GROUPE LA RÉPUBLIQUE EN MARCHE",
      "organeRef": "PO730964"
    }
  },
  "organeReuniRef": "PO730964",
  "typeReunion": "GP"
}