{
  "uid": "RUANR5L14S2018IDF0101742",
  "timestampDebut": "2017-12-12T08:30:00.000+01:00",
  "timestampFin": "2017-12-12T10:30:00.000+01:00",
  "lieu": {
    "code": "SALREU006",
    "libelleCourt": "3ème Bureau",
    "libelleLong": "3ème Bureau, Palais Bourbon"
  },
  "cycleDeVie": {
    "etat": "Confirmé",
    "chrono": {
      "creation": "2017-12-01T13:30:37.000+01:00"
    }
  },
  "demandeurs": {
    "acteurs": [
      {
        "nom": "M. Dominique POTIER",
        "acteurRef": "PA607553"
      }
    ]
  },
  "typeReunion": "DEP"
}