{
  "uid": "RUANR5L14S2018IDF0101623",
  "timestampDebut": "2017-12-06T14:00:00.000+01:00",
  "timestampFin": "2017-12-06T15:00:00.000+01:00",
  "lieu": {
    "code": "SALREU004",
    "libelleCourt": "1er Bureau",
    "libelleLong": "1er Bureau, Palais Bourbon"
  },
  "cycleDeVie": {
    "etat": "Confirmé",
    "chrono": {
      "creation": "2017-11-29T17:21:28.000+01:00"
    }
  },
  "demandeurs": {
    "organe": {
      "nom": "GROUPE UDI, AGIR ET INDÉPENDANTS",
      "organeRef": "PO744425"
    }
  },
  "organeReuniRef": "PO744425",
  "typeReunion": "GP"
}