{
  "uid": "RUANR5L14S2018IDF0099215",
  "timestampDebut": "2017-11-22T09:30:00.000+01:00",
  "timestampFin": "2017-11-22T10:30:00.000+01:00",
  "lieu": {
    "code": "SALREU010",
    "libelleCourt": "Salle N° 1",
    "libelleLong": "Salle N° 1, 3, rue Aristide Briand"
  },
  "cycleDeVie": {
    "etat": "Annulé",
    "chrono": {
      "creation": "2017-10-24T19:19:18.000+02:00",
      "cloture": "2017-11-21T15:42:19.000+01:00"
    }
  },
  "demandeurs": {
    "acteurs": [
      {
        "nom": "Mme Frédérique DUMAS",
        "acteurRef": "PA721194"
      }
    ]
  },
  "typeReunion": "DEP"
}