{
  "uid": "RUANR5L15S2018IDF0106138",
  "timestampDebut": "2018-03-14T09:00:00.000+01:00",
  "timestampFin": "2018-03-14T10:00:00.000+01:00",
  "lieu": {
    "code": "SALREU021",
    "libelleCourt": "Salle 7207",
    "libelleLong": "Salle 7207, 101, rue de l'Université"
  },
  "cycleDeVie": {
    "etat": "Confirmé",
    "chrono": {
      "creation": "2018-02-19T14:34:40.000+01:00"
    }
  },
  "demandeurs": {
    "acteurs": [
      {
        "nom": "M. Didier BAICHÈRE",
        "acteurRef": "PA721776"
      }
    ]
  },
  "typeReunion": "DEP"
}