{
  "uid": "RUANR5L14S2018IDF0102103",
  "timestampDebut": "2017-12-13T11:30:00.000+01:00",
  "timestampFin": "2017-12-13T12:30:00.000+01:00",
  "lieu": {
    "code": "SALREU012",
    "libelleCourt": "Salle N° 23",
    "libelleLong": "Salle N° 23, 3, rue Aristide Briand"
  },
  "cycleDeVie": {
    "etat": "Confirmé",
    "chrono": {
      "creation": "2017-12-08T15:17:35.000+01:00"
    }
  },
  "demandeurs": {
    "acteurs": [
      {
        "nom": "Mme Amal-Amélia LAKRAFI",
        "acteurRef": "PA721004"
      }
    ]
  },
  "typeReunion": "DEP"
}