{
  "uid": "RUANR5L15S2018IDC427740",
  "timestampDebut": "2017-11-16T10:30:00.000+01:00",
  "lieu": {
    "libelleLong": "salle 6238 (Affaires culturelles)"
  },
  "cycleDeVie": {
    "etat": "Confirmé",
    "chrono": {
      "creation": "2017-11-06T00:00:00.000+01:00"
    }
  },
  "organeReuniRef": "PO738117",
  "participants": {},
  "ouverturePresse": true,
  "odj": {
    "convocationOdj": [
      "Audition de M. Julien Gentile, chef de l’Office central pour la répression de l’immigration irrégulière et de l’emploi d’étrangers sans titre (OCRIEST)"
    ],
    "resumeOdj": [
      "audition de M. Julien Gentile, chef de l’Office central pour la répression de l’immigration irrégulière et de l’emploi d’étrangers sans titre (OCRIEST)."
    ]
  }
}