{
  "uid": "RUANR5L14S2018IDF0100306",
  "timestampDebut": "2017-12-13T11:30:00.000+01:00",
  "timestampFin": "2017-12-13T12:30:00.000+01:00",
  "lieu": {
    "code": "SALREU048",
    "libelleCourt": "Salle 6809",
    "libelleLong": "Salle 6809, Palais Bourbon"
  },
  "cycleDeVie": {
    "etat": "Confirmé",
    "chrono": {
      "creation": "2017-11-13T19:09:01.000+01:00"
    }
  },
  "demandeurs": {
    "acteurs": [
      {
        "nom": "Mme Constance LE GRIP",
        "acteurRef": "PA345722"
      }
    ]
  },
  "typeReunion": "DEP"
}