{
  "uid": "RUANR5L14S2017IDF0093419",
  "timestampDebut": "2017-07-11T10:00:00.000+02:00",
  "timestampFin": "2017-07-11T15:00:00.000+02:00",
  "lieu": {
    "code": "SALREU029",
    "libelleCourt": "Salon Mars III",
    "libelleLong": "Salon Mars III, 101, rue de l'Université"
  },
  "cycleDeVie": {
    "etat": "Annulé",
    "chrono": {
      "creation": "2017-07-04T09:46:24.000+02:00",
      "cloture": "2017-07-10T10:36:51.000+02:00"
    }
  },
  "demandeurs": {
    "organe": {
      "nom": "GROUPE LA RÉPUBLIQUE EN MARCHE",
      "organeRef": "PO730964"
    }
  },
  "organeReuniRef": "PO730964",
  "typeReunion": "GP"
}