{
  "uid": "RUANR5L14S2018IDF0101037",
  "timestampDebut": "2017-12-19T08:00:00.000+01:00",
  "timestampFin": "2017-12-19T10:00:00.000+01:00",
  "lieu": {
    "code": "SALREU019",
    "libelleCourt": "Salon Mars I",
    "libelleLong": "Salon Mars I, 101, rue de l'Université"
  },
  "cycleDeVie": {
    "etat": "Confirmé",
    "chrono": {
      "creation": "2017-11-20T18:28:24.000+01:00"
    }
  },
  "demandeurs": {
    "organe": {
      "nom": "Groupe d'amitié France-Iran",
      "organeRef": "PO733202"
    }
  },
  "organeReuniRef": "PO733202",
  "typeReunion": "GA"
}