{
  "uid": "RUANR5L15S2018IDF0103286",
  "timestampDebut": "2018-01-23T14:00:00.000+01:00",
  "timestampFin": "2018-01-23T15:00:00.000+01:00",
  "lieu": {
    "code": "SALREU042",
    "libelleCourt": "Salle 6566",
    "libelleLong": "Salle 6566, Palais Bourbon"
  },
  "cycleDeVie": {
    "etat": "Confirmé",
    "chrono": {
      "creation": "2018-01-09T18:04:22.000+01:00"
    }
  },
  "demandeurs": {
    "acteurs": [
      {
        "nom": "M. Éric WOERTH",
        "acteurRef": "PA2960"
      }
    ]
  },
  "typeReunion": "DEP"
}