{
  "uid": "RUANR5L14S2017IDF0094311",
  "timestampDebut": "2017-07-27T09:00:00.000+02:00",
  "timestampFin": "2017-07-27T20:00:00.000+02:00",
  "lieu": {
    "code": "SALREU042",
    "libelleCourt": "Salle 6566",
    "libelleLong": "Salle 6566, Palais Bourbon"
  },
  "cycleDeVie": {
    "etat": "Confirmé",
    "chrono": {
      "creation": "2017-07-18T14:12:06.000+02:00"
    }
  },
  "demandeurs": {
    "acteurs": [
      {
        "nom": "M. Raphaël GAUVAIN",
        "acteurRef": "PA721364"
      }
    ]
  },
  "typeReunion": "DEP"
}