{
  "uid": "RUSNR5L15S2018IDS20806",
  "timestampDebut": "2017-12-05T09:30:00.000+01:00",
  "timestampFin": "2017-12-05T23:25:00.000+01:00",
  "lieu": {
    "code": "S",
    "libelleLong": "Sénat"
  },
  "cycleDeVie": {
    "etat": "Confirmé",
    "chrono": {
      "creation": "2017-11-08T00:00:00.000+01:00"
    }
  },
  "organeReuniRef": "PO78718",
  "sessionRef": "SCR5A2018O1",
  "ouverturePresse": true,
  "odj": {
    "pointsOdj": [
      {
        "xsiType": "podjSeanceConfPres_type",
        "uid": "RUSNR5L15S2018IDS20806PT35290",
        "cycleDeVie": {
          "etat": "Confirmé",
          "chrono": {
            "creation": "2017-11-08T00:00:00.000+01:00"
          }
        },
        "objet": "Suite de la discussion du projet de loi de finances pour 2018",
        "dossiersLegislatifsRefs": [
          "DLR5L15N35854"
        ],
        "typePointOdj": "Suite de la discussion",
        "comiteSecret": false,
        "natureTravauxOdj": "ODJPR",
        "dateConfPres": "2017-10-24T02:00:00.000+02:00"
      }
    ]
  },
  "compteRenduRef": "CRSSNR5S2018IDS20171205",
  "identifiants": {
    "numSeanceJo": "31",
    "idJo": "20180031",
    "quantieme": "Unique",
    "dateSeance": "2017-12-05T01:00:00.000+01:00"
  }
}