{
  "uid": "RUANR5L14S2017IDF0094489",
  "timestampDebut": "2017-07-25T15:30:00.000+02:00",
  "timestampFin": "2017-07-25T17:00:00.000+02:00",
  "lieu": {
    "code": "SALREU022",
    "libelleCourt": "Salle 7326",
    "libelleLong": "Salle 7326, 101, rue de l'Université"
  },
  "cycleDeVie": {
    "etat": "Annulé",
    "chrono": {
      "creation": "2017-07-21T16:24:26.000+02:00",
      "cloture": "2017-07-24T11:31:55.000+02:00"
    }
  },
  "demandeurs": {
    "acteurs": [
      {
        "nom": "Mme Anne BLANC",
        "acteurRef": "PA718990"
      }
    ]
  },
  "typeReunion": "DEP"
}