{
  "uid": "RUANR5L14S2017IDF0095473",
  "timestampDebut": "2017-09-01T10:00:00.000+02:00",
  "timestampFin": "2017-09-01T11:30:00.000+02:00",
  "lieu": {
    "code": "SALREU013",
    "libelleCourt": "Salle N° 3",
    "libelleLong": "Salle N° 3, 3, rue Aristide Briand"
  },
  "cycleDeVie": {
    "etat": "Confirmé",
    "chrono": {
      "creation": "2017-08-30T18:45:47.000+02:00"
    }
  },
  "demandeurs": {
    "acteurs": [
      {
        "nom": "M. Buon TAN",
        "acteurRef": "PA721690"
      }
    ]
  },
  "typeReunion": "DEP"
}