{
  "uid": "RUANR5L14S2017IDF0093173",
  "timestampDebut": "2017-06-26T10:45:00.000+02:00",
  "timestampFin": "2017-06-26T20:00:00.000+02:00",
  "lieu": {
    "code": "SALREU048",
    "libelleCourt": "Salle 6809",
    "libelleLong": "Salle 6809, Palais Bourbon"
  },
  "cycleDeVie": {
    "etat": "Confirmé",
    "chrono": {
      "creation": "2017-06-26T11:48:58.000+02:00"
    }
  },
  "demandeurs": {
    "acteurs": [
      {
        "nom": "M. Richard FERRAND",
        "acteurRef": "PA606171"
      }
    ]
  },
  "typeReunion": "DEP"
}