{
  "uid": "RUANR5L14S2018IDF0099304",
  "timestampDebut": "2017-10-31T08:30:00.000+01:00",
  "timestampFin": "2017-10-31T09:30:00.000+01:00",
  "lieu": {
    "code": "SALREU028",
    "libelleCourt": "Salle Colbert",
    "libelleLong": "Salle Colbert , Palais Bourbon"
  },
  "cycleDeVie": {
    "etat": "Annulé",
    "chrono": {
      "creation": "2017-10-25T17:54:32.000+02:00",
      "cloture": "2017-10-26T09:13:02.000+02:00"
    }
  },
  "demandeurs": {
    "organe": {
      "nom": "GROUPE LA RÉPUBLIQUE EN MARCHE",
      "organeRef": "PO730964"
    }
  },
  "organeReuniRef": "PO730964",
  "typeReunion": "GP"
}