{
  "uid": "RUANR5L15S2018IDC427572",
  "timestampDebut": "2017-10-19T14:00:00.000+02:00",
  "lieu": {
    "libelleLong": "salle du CEC (Petit Hôtel, escalier M, 2ème étage)"
  },
  "cycleDeVie": {
    "etat": "Supprimé",
    "chrono": {
      "creation": "2017-10-13T00:00:00.000+02:00",
      "cloture": "2017-10-17T00:00:00.000+02:00"
    }
  },
  "organeReuniRef": "PO738797",
  "participants": {},
  "ouverturePresse": false,
  "odj": {
    "convocationOdj": [
      "Échange de vues sur l'organisation des travaux."
    ],
    "resumeOdj": [
      "échange de vues sur l'organisation des travaux."
    ]
  }
}