{
  "uid": "RUANR5L14S2018IDF0101095",
  "timestampDebut": "2017-12-12T16:00:00.000+01:00",
  "timestampFin": "2017-12-12T18:00:00.000+01:00",
  "lieu": {
    "code": "SALREU039",
    "libelleCourt": "Salle 6550",
    "libelleLong": "Salle 6550, Palais Bourbon"
  },
  "cycleDeVie": {
    "etat": "Confirmé",
    "chrono": {
      "creation": "2017-11-21T17:26:09.000+01:00"
    }
  },
  "demandeurs": {
    "acteurs": [
      {
        "nom": "Mme Aurore BERGÉ",
        "acteurRef": "PA722046"
      },
      {
        "nom": "Mme Béatrice DESCAMPS",
        "acteurRef": "PA720696"
      }
    ]
  },
  "typeReunion": "DEP"
}