{
  "uid": "RUANR5L15S2018IDF0103925",
  "timestampDebut": "2018-02-07T09:00:00.000+01:00",
  "timestampFin": "2018-02-07T10:30:00.000+01:00",
  "lieu": {
    "code": "SALREU045",
    "libelleCourt": "Sully 3",
    "libelleLong": "Sully 3, Palais Bourbon"
  },
  "cycleDeVie": {
    "etat": "Confirmé",
    "chrono": {
      "creation": "2018-01-18T15:03:18.000+01:00"
    }
  },
  "demandeurs": {
    "acteurs": [
      {
        "nom": "Mme Émilie CARIOU",
        "acteurRef": "PA720298"
      }
    ]
  },
  "typeReunion": "DEP"
}