{
  "uid": "RUANR5L14S2018IDF0101433",
  "timestampDebut": "2017-11-28T08:30:00.000+01:00",
  "timestampFin": "2017-11-28T10:00:00.000+01:00",
  "lieu": {
    "code": "SALREU010",
    "libelleCourt": "Salle N° 1",
    "libelleLong": "Salle N° 1, 3, rue Aristide Briand"
  },
  "cycleDeVie": {
    "etat": "Confirmé",
    "chrono": {
      "creation": null
    }
  },
  "demandeurs": {
    "acteurs": [
      {
        "nom": "M. Philippe VIGIER",
        "acteurRef": "PA331582"
      }
    ]
  },
  "typeReunion": "DEP"
}