{
  "uid": "RUANR5L14S2018IDF0100356",
  "timestampDebut": "2017-11-29T17:00:00.000+01:00",
  "timestampFin": "2017-11-29T18:00:00.000+01:00",
  "lieu": {
    "code": "SALREU049",
    "libelleCourt": "Salle 6822",
    "libelleLong": "Salle 6822, Palais Bourbon"
  },
  "cycleDeVie": {
    "etat": "Annulé",
    "chrono": {
      "creation": "2017-11-14T17:31:57.000+01:00",
      "cloture": "2017-11-16T10:18:40.000+01:00"
    }
  },
  "demandeurs": {
    "acteurs": [
      {
        "nom": "Mme Brigitte KUSTER",
        "acteurRef": "PA721506"
      }
    ]
  },
  "typeReunion": "DEP"
}