{
  "uid": "RUANR5L14S2018IDF0097223",
  "timestampDebut": "2018-01-18T10:30:00.000+01:00",
  "timestampFin": "2018-01-18T13:00:00.000+01:00",
  "lieu": {
    "code": "SALREU026",
    "libelleCourt": "9ème Bureau",
    "libelleLong": "9ème Bureau, Palais Bourbon"
  },
  "cycleDeVie": {
    "etat": "Confirmé",
    "chrono": {
      "creation": "2017-09-27T18:46:33.000+02:00"
    }
  },
  "demandeurs": {
    "organe": {
      "nom": "GROUPE NOUVELLE GAUCHE",
      "organeRef": "PO730946"
    }
  },
  "organeReuniRef": "PO730946",
  "typeReunion": "GP"
}