{
  "uid": "RUANR5L14S2018IDF0102462",
  "timestampDebut": "2018-01-25T09:30:00.000+01:00",
  "timestampFin": "2018-01-25T11:30:00.000+01:00",
  "lieu": {
    "code": "SALREU016",
    "libelleCourt": "Salon Gabriel",
    "libelleLong": "Salon Gabriel, 101, rue de l'Université"
  },
  "cycleDeVie": {
    "etat": "Confirmé",
    "chrono": {
      "creation": "2017-12-14T20:01:16.000+01:00"
    }
  },
  "demandeurs": {
    "acteurs": [
      {
        "nom": "M. Joël GIRAUD",
        "acteurRef": "PA267336"
      }
    ]
  },
  "typeReunion": "DEP"
}