{
  "uid": "RUANR5L14S2017IDF0095317",
  "timestampDebut": "2017-09-05T10:30:00.000+02:00",
  "timestampFin": "2017-09-05T12:00:00.000+02:00",
  "lieu": {
    "code": "SALREU016",
    "libelleCourt": "Salon Gabriel",
    "libelleLong": "Salon Gabriel, 101, rue de l'Université"
  },
  "cycleDeVie": {
    "etat": "Confirmé",
    "chrono": {
      "creation": "2017-08-11T15:46:11.000+02:00"
    }
  },
  "demandeurs": {
    "acteurs": [
      {
        "nom": "M. Frédéric DESCROZAILLE",
        "acteurRef": "PA720862"
      }
    ]
  },
  "typeReunion": "DEP"
}