{
  "uid": "RUANR5L14S2018IDF0098467",
  "timestampDebut": "2017-10-19T11:00:00.000+02:00",
  "timestampFin": "2017-10-19T12:00:00.000+02:00",
  "lieu": {
    "code": "SALREU048",
    "libelleCourt": "Salle 6809",
    "libelleLong": "Salle 6809, Palais Bourbon"
  },
  "cycleDeVie": {
    "etat": "Confirmé",
    "chrono": {
      "creation": "2017-10-11T17:55:50.000+02:00"
    }
  },
  "demandeurs": {
    "acteurs": [
      {
        "nom": "Mme Mireille CLAPOT",
        "acteurRef": "PA719294"
      }
    ]
  },
  "typeReunion": "DEP"
}