{
  "uid": "RUANR5L14S2018IDF0094777",
  "timestampDebut": "2017-10-17T09:00:00.000+02:00",
  "timestampFin": "2017-10-17T11:00:00.000+02:00",
  "lieu": {
    "code": "SALREU006",
    "libelleCourt": "3ème Bureau",
    "libelleLong": "3ème Bureau, Palais Bourbon"
  },
  "cycleDeVie": {
    "etat": "Confirmé",
    "chrono": {
      "creation": "2017-07-26T19:54:13.000+02:00"
    }
  },
  "demandeurs": {
    "acteurs": [
      {
        "nom": "Mme Olivia GREGOIRE",
        "acteurRef": "PA721764"
      },
      {
        "nom": "M. Xavier ROSEREN",
        "acteurRef": "PA721458"
      }
    ]
  },
  "typeReunion": "DEP"
}