{
  "uid": "RUANR5L15S2018IDF0106667",
  "timestampDebut": "2018-03-13T15:00:00.000+01:00",
  "timestampFin": "2018-03-13T16:00:00.000+01:00",
  "lieu": {
    "code": "SALREU022",
    "libelleCourt": "Salle 7326",
    "libelleLong": "Salle 7326, 101, rue de l'Université"
  },
  "cycleDeVie": {
    "etat": "Annulé",
    "chrono": {
      "creation": "2018-02-27T09:46:53.000+01:00",
      "cloture": "2018-03-05T15:34:01.000+01:00"
    }
  },
  "demandeurs": {
    "organe": {
      "nom": "Groupe d'amitié France-Ukraine",
      "organeRef": "PO733312"
    }
  },
  "organeReuniRef": "PO733312",
  "typeReunion": "GA"
}