{
  "uid": "RUSNR5L15S2018IDS20827",
  "timestampDebut": "2017-12-18T15:00:00.000+01:00",
  "timestampFin": "2017-12-18T21:05:00.000+01:00",
  "lieu": {
    "code": "S",
    "libelleLong": "Sénat"
  },
  "cycleDeVie": {
    "etat": "Confirmé",
    "chrono": {
      "creation": "2017-11-14T00:00:00.000+01:00"
    }
  },
  "organeReuniRef": "PO78718",
  "sessionRef": "SCR5A2018O1",
  "ouverturePresse": true,
  "odj": {
    "pointsOdj": [
      {
        "xsiType": "podjSeanceConfPres_type",
        "uid": "RUSNR5L15S2018IDS20827PT35411",
        "cycleDeVie": {
          "etat": "Confirmé",
          "chrono": {
            "creation": "2017-12-14T00:00:00.000+01:00"
          }
        },
        "objet": "Discussion des conclusions de la commission mixte paritaire sur le projet de loi ratifiant l'ordonnance n° 2017-717 du 3 mai 2017 portant création de l'établissement public Paris La Défense (n° 145, 2017-2018)",
        "dossiersLegislatifsRefs": [
          "DLR5L14N35814"
        ],
        "typePointOdj": "Discussion",
        "comiteSecret": false,
        "natureTravauxOdj": "ODJPR",
        "dateConfPres": "2017-12-13T01:00:00.000+01:00"
      },
      {
        "xsiType": "podjSeanceConfPres_type",
        "uid": "RUSNR5L15S2018IDS20827PT35329",
        "cycleDeVie": {
          "etat": "Confirmé",
          "chrono": {
            "creation": "2017-11-14T00:00:00.000+01:00"
          }
        },
        "objet": "Discussion en nouvelle lecture du projet de loi mettant fin à la recherche ainsi qu'à l'exploitation des hydrocarbures et portant diverses dispositions relatives à l'énergie et à l'environnement",
        "dossiersLegislatifsRefs": [
          "DLR5L15N35929"
        ],
        "typePointOdj": "Discussion",
        "comiteSecret": false,
        "natureTravauxOdj": "ODJPR",
        "dateConfPres": "2017-11-08T01:00:00.000+01:00"
      },
      {
        "xsiType": "podjSeanceConfPres_type",
        "uid": "RUSNR5L15S2018IDS20827PT35330",
        "cycleDeVie": {
          "etat": "Supprimé",
          "chrono": {
            "creation": "2017-11-14T00:00:00.000+01:00",
            "cloture": "2017-12-14T00:00:00.000+01:00"
          }
        },
        "objet": "Discussion du projet de loi portant diverses dispositions d'adaptation au droit de l'Union européenne dans le domaine de la sécurité",
        "typePointOdj": "Discussion",
        "comiteSecret": false,
        "natureTravauxOdj": "ODJPR",
        "dateConfPres": "2017-11-08T01:00:00.000+01:00"
      },
      {
        "xsiType": "podjSeanceConfPres_type",
        "uid": "RUSNR5L15S2018IDS20827PT35412",
        "cycleDeVie": {
          "etat": "Confirmé",
          "chrono": {
            "creation": "2017-12-14T00:00:00.000+01:00"
          }
        },
        "objet": "Discussion de la proposition de loi, adoptée par l'Assemblée nationale après engagement de la procédure accélérée, relative à l'exercice des compétences des collectivités territoriales dans le domaine de la gestion des milieux aquatiques et de la prévention des inondations (texte de la commission, n° 164, 2017-2018)",
        "dossiersLegislatifsRefs": [
          "DLR5L15N36047"
        ],
        "typePointOdj": "Discussion",
        "comiteSecret": false,
        "natureTravauxOdj": "ODJPR",
        "dateConfPres": "2017-12-13T01:00:00.000+01:00"
      }
    ]
  },
  "compteRenduRef": "CRSSNR5S2018IDS20171218",
  "identifiants": {
    "numSeanceJo": "40",
    "idJo": "20180040",
    "quantieme": "Unique",
    "dateSeance": "2017-12-18T01:00:00.000+01:00"
  }
}