{
  "uid": "RUANR5L14S2018IDF0098880",
  "timestampDebut": "2017-11-06T18:00:00.000+01:00",
  "timestampFin": "2017-11-06T20:00:00.000+01:00",
  "lieu": {
    "code": "SALREU006",
    "libelleCourt": "3ème Bureau",
    "libelleLong": "3ème Bureau, Palais Bourbon"
  },
  "cycleDeVie": {
    "etat": "Confirmé",
    "chrono": {
      "creation": "2017-10-18T15:15:51.000+02:00"
    }
  },
  "demandeurs": {
    "acteurs": [
      {
        "nom": "M. Christophe BLANCHET",
        "acteurRef": "PA719024"
      }
    ]
  },
  "typeReunion": "DEP"
}