{
  "uid": "RUANR5L14S2017IDF0096638",
  "timestampDebut": "2017-09-27T16:00:00.000+02:00",
  "timestampFin": "2017-09-27T17:00:00.000+02:00",
  "lieu": {
    "code": "SALREU022",
    "libelleCourt": "Salle 7326",
    "libelleLong": "Salle 7326, 101, rue de l'Université"
  },
  "cycleDeVie": {
    "etat": "Confirmé",
    "chrono": {
      "creation": "2017-09-19T18:39:35.000+02:00"
    }
  },
  "demandeurs": {
    "acteurs": [
      {
        "nom": "Mme Annie GENEVARD",
        "acteurRef": "PA605991"
      }
    ]
  },
  "typeReunion": "DEP"
}