{
  "uid": "RUANR5L14S2017IDF0095726",
  "timestampDebut": "2017-09-06T09:30:00.000+02:00",
  "timestampFin": "2017-09-06T12:30:00.000+02:00",
  "lieu": {
    "code": "SALREU012",
    "libelleCourt": "Salle N° 23",
    "libelleLong": "Salle N° 23, 3, rue Aristide Briand"
  },
  "cycleDeVie": {
    "etat": "Confirmé",
    "chrono": {
      "creation": "2017-09-06T09:39:17.000+02:00"
    }
  },
  "demandeurs": {
    "acteurs": [
      {
        "nom": "Mme Valérie PETIT",
        "acteurRef": "PA720500"
      }
    ]
  },
  "typeReunion": "DEP"
}