{
  "uid": "RUANR5L14S2018IDF0099527",
  "timestampDebut": "2017-11-22T16:15:00.000+01:00",
  "timestampFin": "2017-11-22T17:15:00.000+01:00",
  "lieu": {
    "code": "SALREU012",
    "libelleCourt": "Salle N° 23",
    "libelleLong": "Salle N° 23, 3, rue Aristide Briand"
  },
  "cycleDeVie": {
    "etat": "Confirmé",
    "chrono": {
      "creation": "2017-10-31T13:10:23.000+01:00"
    }
  },
  "demandeurs": {
    "organe": {
      "nom": "Groupe d'amitié France-Thaïlande",
      "organeRef": "PO733127"
    }
  },
  "organeReuniRef": "PO733127",
  "typeReunion": "GA"
}