{
  "uid": "RUANR5L15S2018IDC427971",
  "timestampDebut": "2017-11-30T10:30:00.000+01:00",
  "timestampFin": "2017-11-30T11:40:00.000+01:00",
  "lieu": {
    "libelleLong": "salle 6237 (Développement durable)"
  },
  "cycleDeVie": {
    "etat": "Confirmé",
    "chrono": {
      "creation": "2017-11-24T00:00:00.000+01:00"
    }
  },
  "organeReuniRef": "PO742386",
  "participants": {
    "participantsInternes": [
      {
        "acteurRef": "PA330008",
        "presence": "absent"
      },
      {
        "acteurRef": "PA267766",
        "presence": "présent"
      },
      {
        "acteurRef": "PA722000",
        "presence": "excusé"
      },
      {
        "acteurRef": "PA721860",
        "presence": "présent"
      },
      {
        "acteurRef": "PA719748",
        "presence": "excusé"
      },
      {
        "acteurRef": "PA942",
        "presence": "présent"
      },
      {
        "acteurRef": "PA330909",
        "presence": "présent"
      },
      {
        "acteurRef": "PA719060",
        "presence": "présent"
      },
      {
        "acteurRef": "PA719994",
        "presence": "absent"
      },
      {
        "acteurRef": "PA722228",
        "presence": "absent"
      },
      {
        "acteurRef": "PA721530",
        "presence": "absent"
      },
      {
        "acteurRef": "PA719718",
        "presence": "présent"
      },
      {
        "acteurRef": "PA720892",
        "presence": "absent"
      },
      {
        "acteurRef": "PA719202",
        "presence": "absent"
      },
      {
        "acteurRef": "PA722398",
        "presence": "absent"
      },
      {
        "acteurRef": "PA721426",
        "presence": "présent"
      },
      {
        "acteurRef": "PA719972",
        "presence": "présent"
      },
      {
        "acteurRef": "PA340343",
        "presence": "absent"
      },
      {
        "acteurRef": "PA610667",
        "presence": "présent"
      },
      {
        "acteurRef": "PA722336",
        "presence": "présent"
      },
      {
        "acteurRef": "PA720586",
        "presence": "présent"
      },
      {
        "acteurRef": "PA709315",
        "presence": "présent"
      },
      {
        "acteurRef": "PA721262",
        "presence": "présent"
      }
    ]
  },
  "ouverturePresse": true,
  "odj": {
    "convocationOdj": [
      "audition de M. Frédéric Santamaria, maître de conférences HDR, Aménagement de l’espace et urbanisme, Université Paris Diderot."
    ],
    "resumeOdj": [
      "audition de M. Frédéric Santamaria, maître de conférences HDR, Aménagement de l’espace et urbanisme, Université Paris Diderot."
    ]
  }
}