{
  "uid": "RUANR5L15S2018IDC427473",
  "timestampDebut": "2017-10-10T21:15:00.000+02:00",
  "timestampFin": "2017-10-10T21:20:00.000+02:00",
  "lieu": {
    "libelleLong": "salle 6242 (Lois)"
  },
  "cycleDeVie": {
    "etat": "Confirmé",
    "chrono": {
      "creation": "2017-10-05T00:00:00.000+02:00"
    }
  },
  "organeReuniRef": "PO59051",
  "participants": {
    "participantsInternes": [
      {
        "acteurRef": "PA719866",
        "presence": "absent"
      },
      {
        "acteurRef": "PA721624",
        "presence": "absent"
      },
      {
        "acteurRef": "PA719558",
        "presence": "présent"
      },
      {
        "acteurRef": "PA441",
        "presence": "excusé"
      },
      {
        "acteurRef": "PA720430",
        "presence": "absent"
      },
      {
        "acteurRef": "PA606507",
        "presence": "absent"
      },
      {
        "acteurRef": "PA721908",
        "presence": "présent"
      },
      {
        "acteurRef": "PA330008",
        "presence": "absent"
      },
      {
        "acteurRef": "PA720772",
        "presence": "présent"
      },
      {
        "acteurRef": "PA718838",
        "presence": "absent"
      },
      {
        "acteurRef": "PA719748",
        "presence": "absent"
      },
      {
        "acteurRef": "PA330240",
        "presence": "présent"
      },
      {
        "acteurRef": "PA336439",
        "presence": "absent"
      },
      {
        "acteurRef": "PA606212",
        "presence": "absent"
      },
      {
        "acteurRef": "PA721398",
        "presence": "absent"
      },
      {
        "acteurRef": "PA267440",
        "presence": "absent"
      },
      {
        "acteurRef": "PA719684",
        "presence": "absent"
      },
      {
        "acteurRef": "PA720154",
        "presence": "absent"
      },
      {
        "acteurRef": "PA721094",
        "presence": "excusé"
      },
      {
        "acteurRef": "PA330357",
        "presence": "absent"
      },
      {
        "acteurRef": "PA719616",
        "presence": "absent"
      },
      {
        "acteurRef": "PA721564",
        "presence": "excusé"
      },
      {
        "acteurRef": "PA721702",
        "presence": "absent"
      },
      {
        "acteurRef": "PA721742",
        "presence": "absent"
      },
      {
        "acteurRef": "PA721142",
        "presence": "excusé"
      },
      {
        "acteurRef": "PA721364",
        "presence": "absent"
      },
      {
        "acteurRef": "PA266797",
        "presence": "absent"
      },
      {
        "acteurRef": "PA721880",
        "presence": "excusé"
      },
      {
        "acteurRef": "PA1592",
        "presence": "absent"
      },
      {
        "acteurRef": "PA720454",
        "presence": "absent"
      },
      {
        "acteurRef": "PA722150",
        "presence": "excusé"
      },
      {
        "acteurRef": "PA267200",
        "presence": "absent"
      },
      {
        "acteurRef": "PA719874",
        "presence": "absent"
      },
      {
        "acteurRef": "PA267901",
        "presence": "excusé"
      },
      {
        "acteurRef": "PA719994",
        "presence": "présent"
      },
      {
        "acteurRef": "PA335054",
        "presence": "absent"
      },
      {
        "acteurRef": "PA267785",
        "presence": "présent"
      },
      {
        "acteurRef": "PA721984",
        "presence": "présent"
      },
      {
        "acteurRef": "PA721932",
        "presence": "absent"
      },
      {
        "acteurRef": "PA718918",
        "presence": "absent"
      },
      {
        "acteurRef": "PA606098",
        "presence": "absent"
      },
      {
        "acteurRef": "PA721800",
        "presence": "absent"
      },
      {
        "acteurRef": "PA677483",
        "presence": "absent"
      },
      {
        "acteurRef": "PA719952",
        "presence": "absent"
      },
      {
        "acteurRef": "PA607619",
        "presence": "absent"
      },
      {
        "acteurRef": "PA266788",
        "presence": "absent"
      },
      {
        "acteurRef": "PA720908",
        "presence": "présent"
      },
      {
        "acteurRef": "PA721960",
        "presence": "absent"
      },
      {
        "acteurRef": "PA719202",
        "presence": "présent"
      },
      {
        "acteurRef": "PA721270",
        "presence": "absent"
      },
      {
        "acteurRef": "PA2449",
        "presence": "absent"
      },
      {
        "acteurRef": "PA719600",
        "presence": "absent"
      },
      {
        "acteurRef": "PA720100",
        "presence": "absent"
      },
      {
        "acteurRef": "PA643127",
        "presence": "absent"
      },
      {
        "acteurRef": "PA722398",
        "presence": "présent"
      },
      {
        "acteurRef": "PA721678",
        "presence": "absent"
      },
      {
        "acteurRef": "PA722292",
        "presence": "absent"
      },
      {
        "acteurRef": "PA332747",
        "presence": "excusé"
      },
      {
        "acteurRef": "PA721616",
        "presence": "absent"
      },
      {
        "acteurRef": "PA702052",
        "presence": "excusé"
      },
      {
        "acteurRef": "PA721314",
        "presence": "absent"
      },
      {
        "acteurRef": "PA334654",
        "presence": "absent"
      },
      {
        "acteurRef": "PA721584",
        "presence": "absent"
      },
      {
        "acteurRef": "PA719302",
        "presence": "absent"
      },
      {
        "acteurRef": "PA2828",
        "presence": "absent"
      },
      {
        "acteurRef": "PA608695",
        "presence": "absent"
      },
      {
        "acteurRef": "PA267622",
        "presence": "absent"
      },
      {
        "acteurRef": "PA720704",
        "presence": "présent"
      },
      {
        "acteurRef": "PA722260",
        "presence": "absent"
      },
      {
        "acteurRef": "PA721262",
        "presence": "excusé"
      },
      {
        "acteurRef": "PA2952",
        "presence": "absent"
      },
      {
        "acteurRef": "PA720318",
        "presence": "absent"
      },
      {
        "acteurRef": "PA267330",
        "presence": "absent"
      }
    ]
  },
  "ouverturePresse": false,
  "odj": {
    "convocationOdj": [
      "Examen, en application de l'article 88 du Règlement, des amendements à la proposition de résolution tendant à modifier le Règlement de l'Assemblée nationale (texte de la commission n° 259) (Mme Yaël Braun-Pivet, rapporteure)."
    ],
    "resumeOdj": [
      "proposition de résolution tendant à modifier le Règlement de l'Assemblée nationale (texte de la commission n° 259) (amendements, art. 88)."
    ]
  },
  "compteRenduRef": "CRCANR5L15S2018PO59051N003"
}