{
  "uid": "RUANR5L14S2018IDF0099223",
  "timestampDebut": "2017-11-09T14:00:00.000+01:00",
  "timestampFin": "2017-11-09T15:30:00.000+01:00",
  "lieu": {
    "code": "SALREU028",
    "libelleCourt": "Salle Colbert",
    "libelleLong": "Salle Colbert , Palais Bourbon"
  },
  "cycleDeVie": {
    "etat": "Confirmé",
    "chrono": {
      "creation": "2017-10-24T19:52:55.000+02:00"
    }
  },
  "demandeurs": {
    "acteurs": [
      {
        "nom": "Mme Amélie DE MONTCHALIN",
        "acteurRef": "PA721670"
      }
    ]
  },
  "typeReunion": "DEP"
}