{
  "uid": "RUANR5L14S2017IDF0093454",
  "timestampDebut": "2017-07-05T08:00:00.000+02:00",
  "timestampFin": "2017-07-05T19:00:00.000+02:00",
  "lieu": {
    "code": "SALREU022",
    "libelleCourt": "Salle 7326",
    "libelleLong": "Salle 7326, 101, rue de l'Université"
  },
  "cycleDeVie": {
    "etat": "Confirmé",
    "chrono": {
      "creation": "2017-07-05T09:09:01.000+02:00"
    }
  },
  "demandeurs": {
    "acteurs": [
      {
        "nom": "Mme Emmanuelle MÉNARD",
        "acteurRef": "PA719608"
      }
    ]
  },
  "typeReunion": "DEP"
}