{
  "uid": "RUANR5L14S2018IDF0097264",
  "timestampDebut": "2017-10-04T13:30:00.000+02:00",
  "timestampFin": "2017-10-04T14:15:00.000+02:00",
  "lieu": {
    "code": "SALREU006",
    "libelleCourt": "3ème Bureau",
    "libelleLong": "3ème Bureau, Palais Bourbon"
  },
  "cycleDeVie": {
    "etat": "Confirmé",
    "chrono": {
      "creation": "2017-09-27T19:41:26.000+02:00"
    }
  },
  "demandeurs": {
    "acteurs": [
      {
        "nom": "M. Michel VIALAY",
        "acteurRef": "PA721968"
      }
    ]
  },
  "typeReunion": "DEP"
}