{
  "uid": "RUANR5L14S2017IDF0095833",
  "timestampDebut": "2017-09-07T15:00:00.000+02:00",
  "timestampFin": "2017-09-07T17:00:00.000+02:00",
  "lieu": {
    "code": "SALREU011",
    "libelleCourt": "Salle N° 2",
    "libelleLong": "Salle N° 2, 3, rue Aristide Briand"
  },
  "cycleDeVie": {
    "etat": "Confirmé",
    "chrono": {
      "creation": "2017-09-07T11:51:01.000+02:00"
    }
  },
  "demandeurs": {
    "acteurs": [
      {
        "nom": "Mme Aurore BERGÉ",
        "acteurRef": "PA722046"
      }
    ]
  },
  "typeReunion": "DEP"
}