{
  "uid": "RUANR5L15S2018IDC427530",
  "timestampDebut": "2017-10-19T15:30:00.000+02:00",
  "lieu": {
    "libelleLong": "salle 6238 (Affaires culturelles)"
  },
  "cycleDeVie": {
    "etat": "Confirmé",
    "chrono": {
      "creation": "2017-10-12T00:00:00.000+02:00"
    }
  },
  "organeReuniRef": "PO734692",
  "participants": {},
  "ouverturePresse": true,
  "odj": {
    "convocationOdj": [
      "Audition de Mme Magalie MARAIS, Professeur assistant en management et organisation, Business School de Montpellier"
    ],
    "resumeOdj": [
      "audition de Mme Magalie Marais, Professeur assistant en management et organisation, Business School de Montpellier."
    ]
  }
}