{
  "uid": "RUANR5L15S2018IDF0106199",
  "timestampDebut": "2018-03-07T16:30:00.000+01:00",
  "timestampFin": "2018-03-07T18:00:00.000+01:00",
  "lieu": {
    "code": "SALREU021",
    "libelleCourt": "Salle 7207",
    "libelleLong": "Salle 7207, 101, rue de l'Université"
  },
  "cycleDeVie": {
    "etat": "Confirmé",
    "chrono": {
      "creation": "2018-02-20T09:25:20.000+01:00"
    }
  },
  "demandeurs": {
    "acteurs": [
      {
        "nom": "Mme Michèle VICTORY",
        "acteurRef": "PA340357"
      }
    ]
  },
  "typeReunion": "DEP"
}