{
  "uid": "RUANR5L14S2018IDF0101955",
  "timestampDebut": "2017-12-13T10:00:00.000+01:00",
  "timestampFin": "2017-12-13T14:00:00.000+01:00",
  "lieu": {
    "code": "SALREU042",
    "libelleCourt": "Salle 6566",
    "libelleLong": "Salle 6566, Palais Bourbon"
  },
  "cycleDeVie": {
    "etat": "Confirmé",
    "chrono": {
      "creation": "2017-12-06T13:09:17.000+01:00"
    }
  },
  "demandeurs": {
    "acteurs": [
      {
        "nom": "M. Pierre DHARRÉVILLE",
        "acteurRef": "PA718926"
      }
    ]
  },
  "typeReunion": "DEP"
}