{
  "uid": "RUANR5L14S2018IDF0101210",
  "timestampDebut": "2017-12-19T09:00:00.000+01:00",
  "timestampFin": "2017-12-19T10:00:00.000+01:00",
  "lieu": {
    "code": "SALREU006",
    "libelleCourt": "3ème Bureau",
    "libelleLong": "3ème Bureau, Palais Bourbon"
  },
  "cycleDeVie": {
    "etat": "Confirmé",
    "chrono": {
      "creation": "2017-11-22T18:39:26.000+01:00"
    }
  },
  "demandeurs": {
    "organe": {
      "nom": "Groupe d'amitié France-Irak",
      "organeRef": "PO733547"
    }
  },
  "organeReuniRef": "PO733547",
  "typeReunion": "GA"
}