{
  "uid": "RUANR5L15S2018IDF0105460",
  "timestampDebut": "2018-02-14T16:00:00.000+01:00",
  "timestampFin": "2018-02-14T16:45:00.000+01:00",
  "lieu": {
    "code": "SALREU017",
    "libelleCourt": "Salon Visconti",
    "libelleLong": "Salon Visconti, 101, rue de l'Université"
  },
  "cycleDeVie": {
    "etat": "Annulé",
    "chrono": {
      "creation": "2018-02-09T09:24:50.000+01:00",
      "cloture": "2018-02-12T11:31:45.000+01:00"
    }
  },
  "demandeurs": {
    "acteurs": [
      {
        "nom": "M. Thibault BAZIN",
        "acteurRef": "PA642847"
      }
    ]
  },
  "typeReunion": "DEP"
}