{
  "uid": "RUANR5L14S2017IDF0094495",
  "timestampDebut": "2017-07-27T11:00:00.000+02:00",
  "timestampFin": "2017-07-27T12:00:00.000+02:00",
  "lieu": {
    "code": "SALREU049",
    "libelleCourt": "Salle 6822",
    "libelleLong": "Salle 6822, Palais Bourbon"
  },
  "cycleDeVie": {
    "etat": "Confirmé",
    "chrono": {
      "creation": "2017-07-21T17:45:19.000+02:00"
    }
  },
  "demandeurs": {
    "acteurs": [
      {
        "nom": "Mme Amélie DE MONTCHALIN",
        "acteurRef": "PA721670"
      }
    ]
  },
  "typeReunion": "DEP"
}