{
  "uid": "RUANR5L14S2018IDF0098370",
  "timestampDebut": "2017-10-25T08:30:00.000+02:00",
  "timestampFin": "2017-10-25T09:30:00.000+02:00",
  "lieu": {
    "code": "SALREU008",
    "libelleCourt": "5ème Bureau",
    "libelleLong": "5ème Bureau, Palais Bourbon"
  },
  "cycleDeVie": {
    "etat": "Confirmé",
    "chrono": {
      "creation": "2017-10-10T19:42:34.000+02:00"
    }
  },
  "demandeurs": {
    "organe": {
      "nom": "Groupe d'amitié France-Allemagne",
      "organeRef": "PO733607"
    }
  },
  "organeReuniRef": "PO733607",
  "typeReunion": "GA"
}