{
  "uid": "RUANR5L14S2018IDF0094717",
  "timestampDebut": "2017-11-23T08:00:00.000+01:00",
  "timestampFin": "2017-11-23T12:30:00.000+01:00",
  "lieu": {
    "code": "SALREU029",
    "libelleCourt": "Salon Mars III",
    "libelleLong": "Salon Mars III, 101, rue de l'Université"
  },
  "cycleDeVie": {
    "etat": "Confirmé",
    "chrono": {
      "creation": "2017-07-25T13:01:57.000+02:00"
    }
  },
  "demandeurs": {
    "acteurs": [
      {
        "nom": "M. Fabien ROUSSEL",
        "acteurRef": "PA720692"
      }
    ]
  },
  "typeReunion": "DEP"
}