{
  "uid": "RUANR5L15S2018IDF0105850",
  "timestampDebut": "2018-02-21T18:30:00.000+01:00",
  "timestampFin": "2018-02-21T19:30:00.000+01:00",
  "lieu": {
    "code": "SALREU012",
    "libelleCourt": "Salle N° 23",
    "libelleLong": "Salle N° 23, 3, rue Aristide Briand"
  },
  "cycleDeVie": {
    "etat": "Annulé",
    "chrono": {
      "creation": "2018-02-14T18:53:52.000+01:00",
      "cloture": "2018-02-19T17:47:35.000+01:00"
    }
  },
  "demandeurs": {
    "organe": {
      "nom": "GROUPE LA RÉPUBLIQUE EN MARCHE",
      "organeRef": "PO730964"
    }
  },
  "organeReuniRef": "PO730964",
  "typeReunion": "GP"
}