{
  "uid": "RUANR5L14S2018IDF0100941",
  "timestampDebut": "2017-12-13T10:00:00.000+01:00",
  "timestampFin": "2017-12-13T13:00:00.000+01:00",
  "lieu": {
    "code": "SALREU001",
    "libelleCourt": "Salle Lamartine",
    "libelleLong": "Salle Lamartine, 101, rue de l'Université"
  },
  "cycleDeVie": {
    "etat": "Confirmé",
    "chrono": {
      "creation": "2017-11-17T16:35:45.000+01:00"
    }
  },
  "demandeurs": {
    "acteurs": [
      {
        "nom": "M. François DE RUGY",
        "acteurRef": "PA332747"
      }
    ]
  },
  "typeReunion": "DEP"
}