{
  "uid": "RUANR5L15S2018IDF0105235",
  "timestampDebut": "2018-02-21T17:00:00.000+01:00",
  "timestampFin": "2018-02-21T18:30:00.000+01:00",
  "lieu": {
    "code": "SALREU017",
    "libelleCourt": "Salon Visconti",
    "libelleLong": "Salon Visconti, 101, rue de l'Université"
  },
  "cycleDeVie": {
    "etat": "Confirmé",
    "chrono": {
      "creation": "2018-02-06T16:25:25.000+01:00"
    }
  },
  "demandeurs": {
    "organe": {
      "nom": "Groupe d'amitié France-Burkina Faso",
      "organeRef": "PO733232"
    }
  },
  "organeReuniRef": "PO733232",
  "typeReunion": "GA"
}