{
  "uid": "RUANR5L14S2017IDF0094992",
  "timestampDebut": "2017-08-01T16:00:00.000+02:00",
  "timestampFin": "2017-08-01T17:00:00.000+02:00",
  "lieu": {
    "code": "SALREU023",
    "libelleCourt": "Salle 7426",
    "libelleLong": "Salle 7426, 101, rue de l'Université"
  },
  "cycleDeVie": {
    "etat": "Confirmé",
    "chrono": {
      "creation": "2017-08-01T15:24:27.000+02:00"
    }
  },
  "demandeurs": {
    "acteurs": [
      {
        "nom": "M. Jean-Charles LARSONNEUR",
        "acteurRef": "PA719396"
      }
    ]
  },
  "typeReunion": "DEP"
}