{
  "uid": "RUANR5L15S2018IDF0104482",
  "timestampDebut": "2018-01-30T11:15:00.000+01:00",
  "timestampFin": "2018-01-30T12:00:00.000+01:00",
  "lieu": {
    "code": "SALREU022",
    "libelleCourt": "Salle 7326",
    "libelleLong": "Salle 7326, 101, rue de l'Université"
  },
  "cycleDeVie": {
    "etat": "Confirmé",
    "chrono": {
      "creation": "2018-01-26T16:58:56.000+01:00"
    }
  },
  "demandeurs": {
    "acteurs": [
      {
        "nom": "Mme Bénédicte PEYROL",
        "acteurRef": "PA718736"
      }
    ]
  },
  "typeReunion": "DEP"
}