{
  "uid": "RUANR5L14S2017IDF0095991",
  "timestampDebut": "2017-09-30T10:00:00.000+02:00",
  "timestampFin": "2017-09-30T12:30:00.000+02:00",
  "lieu": {
    "code": "SALREU004",
    "libelleCourt": "1er Bureau",
    "libelleLong": "1er Bureau, Palais Bourbon"
  },
  "cycleDeVie": {
    "etat": "Confirmé",
    "chrono": {
      "creation": "2017-09-11T11:45:10.000+02:00"
    }
  },
  "demandeurs": {
    "acteurs": [
      {
        "nom": "M. Régis JUANICO",
        "acteurRef": "PA332614"
      }
    ]
  },
  "typeReunion": "DEP"
}