{
  "uid": "RUANR5L15S2018IDC428420",
  "timestampDebut": "2018-02-20T17:15:00.000+01:00",
  "timestampFin": "2018-02-20T19:30:00.000+01:00",
  "lieu": {
    "libelleLong": "6e Bureau"
  },
  "cycleDeVie": {
    "etat": "Confirmé",
    "chrono": {
      "creation": "2018-01-31T00:00:00.000+01:00"
    }
  },
  "organeReuniRef": "PO419610",
  "participants": {
    "participantsInternes": [
      {
        "acteurRef": "PA722038",
        "presence": "présent"
      },
      {
        "acteurRef": "PA721278",
        "presence": "absent"
      },
      {
        "acteurRef": "PA335999",
        "presence": "absent"
      },
      {
        "acteurRef": "PA342415",
        "presence": "présent"
      },
      {
        "acteurRef": "PA642847",
        "presence": "présent"
      },
      {
        "acteurRef": "PA722170",
        "presence": "présent"
      },
      {
        "acteurRef": "PA332228",
        "presence": "présent"
      },
      {
        "acteurRef": "PA718876",
        "presence": "excusé"
      },
      {
        "acteurRef": "PA722312",
        "presence": "présent"
      },
      {
        "acteurRef": "PA718990",
        "presence": "absent"
      },
      {
        "acteurRef": "PA608641",
        "presence": "absent"
      },
      {
        "acteurRef": "PA720162",
        "presence": "absent"
      },
      {
        "acteurRef": "PA642695",
        "presence": "présent"
      },
      {
        "acteurRef": "PA336316",
        "presence": "présent"
      },
      {
        "acteurRef": "PA605069",
        "presence": "présent"
      },
      {
        "acteurRef": "PA720116",
        "presence": "présent"
      },
      {
        "acteurRef": "PA767",
        "presence": "absent"
      },
      {
        "acteurRef": "PA720814",
        "presence": "absent"
      },
      {
        "acteurRef": "PA719440",
        "presence": "présent"
      },
      {
        "acteurRef": "PA267429",
        "presence": "présent"
      },
      {
        "acteurRef": "PA721808",
        "presence": "présent"
      },
      {
        "acteurRef": "PA607155",
        "presence": "présent"
      },
      {
        "acteurRef": "PA267450",
        "presence": "présent"
      },
      {
        "acteurRef": "PA719258",
        "presence": "absent"
      },
      {
        "acteurRef": "PA719830",
        "presence": "présent"
      },
      {
        "acteurRef": "PA720598",
        "presence": "absent"
      },
      {
        "acteurRef": "PA720386",
        "presence": "absent"
      },
      {
        "acteurRef": "PA712015",
        "presence": "absent"
      },
      {
        "acteurRef": "PA721718",
        "presence": "absent"
      },
      {
        "acteurRef": "PA719660",
        "presence": "présent"
      },
      {
        "acteurRef": "PA720664",
        "presence": "excusé"
      },
      {
        "acteurRef": "PA334149",
        "presence": "présent"
      },
      {
        "acteurRef": "PA719960",
        "presence": "absent"
      },
      {
        "acteurRef": "PA719652",
        "presence": "présent"
      },
      {
        "acteurRef": "PA722094",
        "presence": "absent"
      },
      {
        "acteurRef": "PA267355",
        "presence": "absent"
      },
      {
        "acteurRef": "PA719700",
        "presence": "absent"
      },
      {
        "acteurRef": "PA722202",
        "presence": "présent"
      },
      {
        "acteurRef": "PA719372",
        "presence": "absent"
      },
      {
        "acteurRef": "PA719504",
        "presence": "présent"
      },
      {
        "acteurRef": "PA331567",
        "presence": "absent"
      },
      {
        "acteurRef": "PA719310",
        "presence": "présent"
      },
      {
        "acteurRef": "PA721852",
        "presence": "absent"
      },
      {
        "acteurRef": "PA340853",
        "presence": "présent"
      },
      {
        "acteurRef": "PA721134",
        "presence": "présent"
      },
      {
        "acteurRef": "PA719858",
        "presence": "absent"
      },
      {
        "acteurRef": "PA720378",
        "presence": "présent"
      },
      {
        "acteurRef": "PA719154",
        "presence": "absent"
      },
      {
        "acteurRef": "PA720976",
        "presence": "absent"
      },
      {
        "acteurRef": "PA719338",
        "presence": "absent"
      },
      {
        "acteurRef": "PA719608",
        "presence": "présent"
      },
      {
        "acteurRef": "PA719242",
        "presence": "présent"
      },
      {
        "acteurRef": "PA719520",
        "presence": "présent"
      },
      {
        "acteurRef": "PA720644",
        "presence": "absent"
      },
      {
        "acteurRef": "PA719364",
        "presence": "présent"
      },
      {
        "acteurRef": "PA720108",
        "presence": "présent"
      },
      {
        "acteurRef": "PA718784",
        "presence": "absent"
      },
      {
        "acteurRef": "PA718930",
        "presence": "présent"
      },
      {
        "acteurRef": "PA721270",
        "presence": "présent"
      },
      {
        "acteurRef": "PA607553",
        "presence": "présent"
      },
      {
        "acteurRef": "PA720590",
        "presence": "présent"
      },
      {
        "acteurRef": "PA720092",
        "presence": "excusé"
      },
      {
        "acteurRef": "PA721678",
        "presence": "présent"
      },
      {
        "acteurRef": "PA266808",
        "presence": "présent"
      },
      {
        "acteurRef": "PA722142",
        "presence": "présent"
      },
      {
        "acteurRef": "PA720780",
        "presence": "absent"
      },
      {
        "acteurRef": "PA719420",
        "presence": "présent"
      },
      {
        "acteurRef": "PA721174",
        "presence": "excusé"
      },
      {
        "acteurRef": "PA334654",
        "presence": "présent"
      },
      {
        "acteurRef": "PA2792",
        "presence": "absent"
      },
      {
        "acteurRef": "PA718860",
        "presence": "présent"
      },
      {
        "acteurRef": "PA720014",
        "presence": "absent"
      },
      {
        "acteurRef": "PA722162",
        "presence": "absent"
      },
      {
        "acteurRef": "PA421348",
        "presence": "présent"
      },
      {
        "acteurRef": "PA722110",
        "presence": "présent"
      }
    ]
  },
  "ouverturePresse": true,
  "odj": {
    "convocationOdj": [
      "Examen de la proposition de loi visant à lutter contre les marchands de sommeil (n° 587) (M. Hubert Wulfranc, rapporteur)."
    ],
    "resumeOdj": [
      "proposition de loi visant à lutter contre les marchands de sommeil (n° 587) (rapport)."
    ],
    "pointsOdj": [
      {
        "xsiType": "podjReunion_type",
        "uid": "RUANR5L15S2018IDC428420PT25432",
        "cycleDeVie": {
          "etat": "Confirmé",
          "chrono": {
            "creation": "2018-01-31T00:00:00.000+01:00"
          }
        },
        "objet": "Examen du texte",
        "dossiersLegislatifsRefs": [
          "DLR5L15N36298"
        ],
        "typePointOdj": "Examen",
        "comiteSecret": false
      }
    ]
  },
  "compteRenduRef": "CRCANR5L15S2018PO419610N042"
}