{
  "uid": "RUANR5L14S2018IDF0101638",
  "timestampDebut": "2017-12-06T08:15:00.000+01:00",
  "timestampFin": "2017-12-06T09:45:00.000+01:00",
  "lieu": {
    "code": "SALREU022",
    "libelleCourt": "Salle 7326",
    "libelleLong": "Salle 7326, 101, rue de l'Université"
  },
  "cycleDeVie": {
    "etat": "Annulé",
    "chrono": {
      "creation": "2017-11-30T09:15:17.000+01:00",
      "cloture": "2017-12-05T11:32:02.000+01:00"
    }
  },
  "demandeurs": {
    "acteurs": [
      {
        "nom": "Mme Célia DE LAVERGNE",
        "acteurRef": "PA719310"
      }
    ]
  },
  "typeReunion": "DEP"
}