{
  "uid": "RUANR5L15S2018IDF0106093",
  "timestampDebut": "2018-03-15T08:00:00.000+01:00",
  "timestampFin": "2018-03-15T16:30:00.000+01:00",
  "lieu": {
    "code": "SALREU013",
    "libelleCourt": "Salle N° 3",
    "libelleLong": "Salle N° 3, 3, rue Aristide Briand"
  },
  "cycleDeVie": {
    "etat": "Confirmé",
    "chrono": {
      "creation": "2018-02-19T10:23:25.000+01:00"
    }
  },
  "demandeurs": {
    "acteurs": [
      {
        "nom": "M. Laurent PIETRASZEWSKI",
        "acteurRef": "PA720512"
      }
    ]
  },
  "typeReunion": "DEP"
}