{
  "uid": "RUANR5L15S2018IDC427563",
  "timestampDebut": "2017-10-26T11:45:00.000+02:00",
  "timestampFin": "2017-10-26T12:00:00.000+02:00",
  "lieu": {
    "libelleLong": "salle Lamartine"
  },
  "cycleDeVie": {
    "etat": "Confirmé",
    "chrono": {
      "creation": "2017-10-12T00:00:00.000+02:00"
    }
  },
  "organeReuniRef": "PO419610",
  "participants": {
    "participantsInternes": [
      {
        "acteurRef": "PA722038",
        "presence": "absent"
      },
      {
        "acteurRef": "PA721278",
        "presence": "absent"
      },
      {
        "acteurRef": "PA335999",
        "presence": "absent"
      },
      {
        "acteurRef": "PA342415",
        "presence": "présent"
      },
      {
        "acteurRef": "PA722170",
        "presence": "présent"
      },
      {
        "acteurRef": "PA332228",
        "presence": "absent"
      },
      {
        "acteurRef": "PA718876",
        "presence": "absent"
      },
      {
        "acteurRef": "PA722312",
        "presence": "absent"
      },
      {
        "acteurRef": "PA718990",
        "presence": "absent"
      },
      {
        "acteurRef": "PA608641",
        "presence": "absent"
      },
      {
        "acteurRef": "PA720162",
        "presence": "absent"
      },
      {
        "acteurRef": "PA642695",
        "presence": "absent"
      },
      {
        "acteurRef": "PA336316",
        "presence": "absent"
      },
      {
        "acteurRef": "PA720546",
        "presence": "absent"
      },
      {
        "acteurRef": "PA767",
        "presence": "absent"
      },
      {
        "acteurRef": "PA720814",
        "presence": "absent"
      },
      {
        "acteurRef": "PA719440",
        "presence": "présent"
      },
      {
        "acteurRef": "PA642868",
        "presence": "absent"
      },
      {
        "acteurRef": "PA267429",
        "presence": "absent"
      },
      {
        "acteurRef": "PA721808",
        "presence": "présent"
      },
      {
        "acteurRef": "PA607155",
        "presence": "absent"
      },
      {
        "acteurRef": "PA267450",
        "presence": "absent"
      },
      {
        "acteurRef": "PA719258",
        "presence": "présent"
      },
      {
        "acteurRef": "PA719830",
        "presence": "présent"
      },
      {
        "acteurRef": "PA720598",
        "presence": "absent"
      },
      {
        "acteurRef": "PA720386",
        "presence": "absent"
      },
      {
        "acteurRef": "PA712015",
        "presence": "absent"
      },
      {
        "acteurRef": "PA721718",
        "presence": "absent"
      },
      {
        "acteurRef": "PA719660",
        "presence": "absent"
      },
      {
        "acteurRef": "PA607193",
        "presence": "absent"
      },
      {
        "acteurRef": "PA720664",
        "presence": "absent"
      },
      {
        "acteurRef": "PA334149",
        "presence": "absent"
      },
      {
        "acteurRef": "PA719960",
        "presence": "absent"
      },
      {
        "acteurRef": "PA721384",
        "presence": "absent"
      },
      {
        "acteurRef": "PA719652",
        "presence": "absent"
      },
      {
        "acteurRef": "PA722094",
        "presence": "absent"
      },
      {
        "acteurRef": "PA267355",
        "presence": "présent"
      },
      {
        "acteurRef": "PA719700",
        "presence": "présent"
      },
      {
        "acteurRef": "PA722202",
        "presence": "absent"
      },
      {
        "acteurRef": "PA719372",
        "presence": "absent"
      },
      {
        "acteurRef": "PA719504",
        "presence": "absent"
      },
      {
        "acteurRef": "PA331567",
        "presence": "absent"
      },
      {
        "acteurRef": "PA719310",
        "presence": "absent"
      },
      {
        "acteurRef": "PA721852",
        "presence": "absent"
      },
      {
        "acteurRef": "PA340853",
        "presence": "absent"
      },
      {
        "acteurRef": "PA719388",
        "presence": "absent"
      },
      {
        "acteurRef": "PA721134",
        "presence": "présent"
      },
      {
        "acteurRef": "PA337483",
        "presence": "absent"
      },
      {
        "acteurRef": "PA719858",
        "presence": "présent"
      },
      {
        "acteurRef": "PA720378",
        "presence": "absent"
      },
      {
        "acteurRef": "PA719154",
        "presence": "présent"
      },
      {
        "acteurRef": "PA720976",
        "presence": "présent"
      },
      {
        "acteurRef": "PA719338",
        "presence": "absent"
      },
      {
        "acteurRef": "PA719608",
        "presence": "absent"
      },
      {
        "acteurRef": "PA719242",
        "presence": "présent"
      },
      {
        "acteurRef": "PA719520",
        "presence": "absent"
      },
      {
        "acteurRef": "PA720644",
        "presence": "absent"
      },
      {
        "acteurRef": "PA720108",
        "presence": "absent"
      },
      {
        "acteurRef": "PA718784",
        "presence": "absent"
      },
      {
        "acteurRef": "PA718930",
        "presence": "présent"
      },
      {
        "acteurRef": "PA607553",
        "presence": "absent"
      },
      {
        "acteurRef": "PA720590",
        "presence": "absent"
      },
      {
        "acteurRef": "PA720092",
        "presence": "absent"
      },
      {
        "acteurRef": "PA266808",
        "presence": "absent"
      },
      {
        "acteurRef": "PA722142",
        "presence": "absent"
      },
      {
        "acteurRef": "PA720780",
        "presence": "présent"
      },
      {
        "acteurRef": "PA719420",
        "presence": "absent"
      },
      {
        "acteurRef": "PA334654",
        "presence": "absent"
      },
      {
        "acteurRef": "PA2792",
        "presence": "absent"
      },
      {
        "acteurRef": "PA718860",
        "presence": "présent"
      },
      {
        "acteurRef": "PA720014",
        "presence": "absent"
      },
      {
        "acteurRef": "PA722162",
        "presence": "présent"
      },
      {
        "acteurRef": "PA421348",
        "presence": "absent"
      }
    ]
  },
  "ouverturePresse": false,
  "odj": {
    "convocationOdj": [
      "Vote sur les crédits de la mission « Agriculture, alimentation, forêt et affaires rurales», à l’issue de la commission élargie"
    ],
    "resumeOdj": [
      "vote sur les crédits de la mission « Agriculture, alimentation, forêt et affaires rurales», à l’issue de la commission élargie."
    ],
    "pointsOdj": [
      {
        "xsiType": "podjReunion_type",
        "uid": "RUANR5L15S2018IDC427563PT25124",
        "cycleDeVie": {
          "etat": "Confirmé",
          "chrono": {
            "creation": "2017-10-12T00:00:00.000+02:00"
          }
        },
        "objet": "Vote sur les crédits de la mission « Agriculture, alimentation, forêt et affaires rurales», à l’issue de la commission élargie",
        "dossiersLegislatifsRefs": [
          "DLR5L15N35854"
        ],
        "typePointOdj": "Examen",
        "comiteSecret": false
      }
    ]
  }
}