{
  "uid": "RUANR5L14S2018IDF0097775",
  "timestampDebut": "2018-02-13T12:00:00.000+01:00",
  "timestampFin": "2018-02-13T13:00:00.000+01:00",
  "lieu": {
    "code": "SALREU005",
    "libelleCourt": "2ème Bureau",
    "libelleLong": "2ème Bureau, Palais Bourbon"
  },
  "cycleDeVie": {
    "etat": "Confirmé",
    "chrono": {
      "creation": "2017-10-02T18:37:01.000+02:00"
    }
  },
  "demandeurs": {
    "organe": {
      "nom": "GROUPE GAUCHE DÉMOCRATE ET RÉPUBLICAINE",
      "organeRef": "PO730940"
    }
  },
  "organeReuniRef": "PO730940",
  "typeReunion": "GP"
}