{
  "uid": "RUANR5L15S2018IDC428675",
  "timestampDebut": "2018-03-14T16:30:00.000+01:00",
  "lieu": {
    "libelleLong": "salle 6351 (Affaires sociales)"
  },
  "cycleDeVie": {
    "etat": "Eventuel",
    "chrono": {
      "creation": "2018-02-22T00:00:00.000+01:00"
    }
  },
  "organeReuniRef": "PO732866",
  "participants": {},
  "ouverturePresse": true,
  "odj": {
    "convocationOdj": [
      "À 16 heures 30 \n– Table ronde des représentants de groupements d’achats"
    ],
    "resumeOdj": [
      "à 16 heures 30 : table ronde des représentants de groupements d’achats"
    ]
  }
}