{
  "uid": "RUANR5L15S2018IDF0106705",
  "timestampDebut": "2018-03-05T14:00:00.000+01:00",
  "timestampFin": "2018-03-05T18:00:00.000+01:00",
  "lieu": {
    "code": "SALREU009",
    "libelleCourt": "8ème Bureau",
    "libelleLong": "8ème Bureau, Palais Bourbon"
  },
  "cycleDeVie": {
    "etat": "Confirmé",
    "chrono": {
      "creation": "2018-02-27T16:44:41.000+01:00"
    }
  },
  "demandeurs": {
    "organe": {
      "nom": "GROUPE LA FRANCE INSOUMISE",
      "organeRef": "PO730958"
    }
  },
  "organeReuniRef": "PO730958",
  "typeReunion": "GP"
}