{
  "uid": "RUANR5L14S2018IDF0098844",
  "timestampDebut": "2017-10-24T17:00:00.000+02:00",
  "timestampFin": "2017-10-24T19:30:00.000+02:00",
  "lieu": {
    "code": "SALREU048",
    "libelleCourt": "Salle 6809",
    "libelleLong": "Salle 6809, Palais Bourbon"
  },
  "cycleDeVie": {
    "etat": "Confirmé",
    "chrono": {
      "creation": "2017-10-18T09:45:44.000+02:00"
    }
  },
  "demandeurs": {
    "acteurs": [
      {
        "nom": "M. Guillaume PELTIER",
        "acteurRef": "PA719946"
      }
    ]
  },
  "typeReunion": "DEP"
}