{
  "uid": "RUANR5L15S2018IDF0104679",
  "timestampDebut": "2018-02-13T09:00:00.000+01:00",
  "timestampFin": "2018-02-13T11:00:00.000+01:00",
  "lieu": {
    "code": "SALREU045",
    "libelleCourt": "Sully 3",
    "libelleLong": "Sully 3, Palais Bourbon"
  },
  "cycleDeVie": {
    "etat": "Confirmé",
    "chrono": {
      "creation": "2018-01-30T15:29:52.000+01:00"
    }
  },
  "demandeurs": {
    "acteurs": [
      {
        "nom": "M. Jean-Noël BARROT",
        "acteurRef": "PA721836"
      }
    ]
  },
  "typeReunion": "DEP"
}