{
  "uid": "RUANR5L15S2018IDS20964",
  "timestampDebut": "2018-03-27T15:00:00.000+02:00",
  "lieu": {
    "code": "AN",
    "libelleLong": "Assemblée nationale"
  },
  "cycleDeVie": {
    "etat": "Confirmé",
    "chrono": {
      "creation": "2018-03-05T00:00:00.000+01:00"
    }
  },
  "organeReuniRef": "PO717460",
  "sessionRef": "SCR5A2018O1",
  "ouverturePresse": true,
  "odj": {
    "pointsOdj": [
      {
        "xsiType": "podjSeanceConfPres_type",
        "uid": "RUANR5L15S2018IDS20964PT35706",
        "cycleDeVie": {
          "etat": "Confirmé",
          "chrono": {
            "creation": "2018-03-05T00:00:00.000+01:00"
          }
        },
        "objet": "Questions au Gouvernement",
        "typePointOdj": "Questions au Gouvernement",
        "comiteSecret": false,
        "natureTravauxOdj": "ODJPR"
      },
      {
        "xsiType": "podjSeanceConfPres_type",
        "uid": "RUANR5L15S2018IDS20964PT35723",
        "cycleDeVie": {
          "etat": "Confirmé",
          "chrono": {
            "creation": "2018-03-05T00:00:00.000+01:00"
          }
        },
        "objet": "Explications de vote et vote par scrutin public du projet de loi relatif à la programmation militaire pour les années 2019 à 2025 et portant diverses dispositions intéressant la défense",
        "dossiersLegislatifsRefs": [
          "DLR5L15N36362"
        ],
        "typePointOdj": "Explications de vote et vote par scrutin public",
        "comiteSecret": false,
        "natureTravauxOdj": "ODJPR"
      },
      {
        "xsiType": "podjSeanceConfPres_type",
        "uid": "RUANR5L15S2018IDS20964PT35707",
        "cycleDeVie": {
          "etat": "Confirmé",
          "chrono": {
            "creation": "2018-03-05T00:00:00.000+01:00"
          }
        },
        "objet": "Discussion de la proposition de loi portant transposition de la directive du Parlement européen et du Conseil sur la protection des savoir-faire et des informations commerciales non divulgués contre l’obtention, l’utilisation et la divulgation illicites",
        "dossiersLegislatifsRefs": [
          "DLR5L15N36388"
        ],
        "typePointOdj": "Discussion",
        "comiteSecret": false,
        "natureTravauxOdj": "ODJPR"
      }
    ]
  },
  "identifiants": {
    "quantieme": "Deuxième",
    "dateSeance": "2018-03-27T02:00:00.000+02:00"
  }
}