{
  "uid": "RUANR5L14S2018IDF0101882",
  "timestampDebut": "2018-01-18T17:00:00.000+01:00",
  "timestampFin": "2018-01-18T19:00:00.000+01:00",
  "lieu": {
    "code": "SALREU016",
    "libelleCourt": "Salon Gabriel",
    "libelleLong": "Salon Gabriel, 101, rue de l'Université"
  },
  "cycleDeVie": {
    "etat": "Confirmé",
    "chrono": {
      "creation": "2017-12-05T11:04:06.000+01:00"
    }
  },
  "demandeurs": {
    "organe": {
      "nom": "Groupe d'amitié France-Bruneï Malaisie",
      "organeRef": "PO733683"
    }
  },
  "organeReuniRef": "PO733683",
  "typeReunion": "GA"
}