{
  "uid": "RUANR5L15S2018IDF0100726",
  "timestampDebut": "2018-05-02T14:00:00.000+02:00",
  "timestampFin": "2018-05-02T15:00:00.000+02:00",
  "lieu": {
    "code": "SALREU029",
    "libelleCourt": "Salon Mars III",
    "libelleLong": "Salon Mars III, 101, rue de l'Université"
  },
  "cycleDeVie": {
    "etat": "Annulé",
    "chrono": {
      "creation": "2017-11-15T17:33:52.000+01:00",
      "cloture": "2018-02-22T16:20:38.000+01:00"
    }
  },
  "demandeurs": {
    "organe": {
      "nom": "GROUPE LA RÉPUBLIQUE EN MARCHE",
      "organeRef": "PO730964"
    }
  },
  "organeReuniRef": "PO730964",
  "typeReunion": "GP"
}