{
  "uid": "RUANR5L15S2018IDC427924",
  "timestampDebut": "2017-12-06T11:15:00.000+01:00",
  "timestampFin": "2017-12-06T12:45:00.000+01:00",
  "lieu": {
    "libelleLong": "salle 6237 (Développement durable)"
  },
  "cycleDeVie": {
    "etat": "Confirmé",
    "chrono": {
      "creation": "2017-11-23T00:00:00.000+01:00"
    }
  },
  "organeReuniRef": "PO419865",
  "participants": {
    "participantsInternes": [
      {
        "acteurRef": "PA720242",
        "presence": "excusé"
      },
      {
        "acteurRef": "PA605963",
        "presence": "présent"
      },
      {
        "acteurRef": "PA720310",
        "presence": "présent"
      },
      {
        "acteurRef": "PA719806",
        "presence": "présent"
      },
      {
        "acteurRef": "PA721046",
        "presence": "excusé"
      },
      {
        "acteurRef": "PA720210",
        "presence": "présent"
      },
      {
        "acteurRef": "PA266793",
        "presence": "présent"
      },
      {
        "acteurRef": "PA267233",
        "presence": "excusé"
      },
      {
        "acteurRef": "PA718710",
        "presence": "présent"
      },
      {
        "acteurRef": "PA267766",
        "presence": "présent"
      },
      {
        "acteurRef": "PA719890",
        "presence": "présent"
      },
      {
        "acteurRef": "PA718838",
        "presence": "excusé"
      },
      {
        "acteurRef": "PA722000",
        "presence": "présent"
      },
      {
        "acteurRef": "PA719922",
        "presence": "présent"
      },
      {
        "acteurRef": "PA721860",
        "presence": "absent"
      },
      {
        "acteurRef": "PA719740",
        "presence": "présent"
      },
      {
        "acteurRef": "PA719286",
        "presence": "présent"
      },
      {
        "acteurRef": "PA718850",
        "presence": "présent"
      },
      {
        "acteurRef": "PA719624",
        "presence": "présent"
      },
      {
        "acteurRef": "PA719194",
        "presence": "présent"
      },
      {
        "acteurRef": "PA607155",
        "presence": "présent"
      },
      {
        "acteurRef": "PA330909",
        "presence": "présent"
      },
      {
        "acteurRef": "PA720538",
        "presence": "excusé"
      },
      {
        "acteurRef": "PA722236",
        "presence": "présent"
      },
      {
        "acteurRef": "PA718894",
        "presence": "présent"
      },
      {
        "acteurRef": "PA720652",
        "presence": "présent"
      },
      {
        "acteurRef": "PA605694",
        "presence": "présent"
      },
      {
        "acteurRef": "PA722366",
        "presence": "présent"
      },
      {
        "acteurRef": "PA333285",
        "presence": "excusé"
      },
      {
        "acteurRef": "PA720054",
        "presence": "présent"
      },
      {
        "acteurRef": "PA720038",
        "presence": "présent"
      },
      {
        "acteurRef": "PA721514",
        "presence": "excusé"
      },
      {
        "acteurRef": "PA605084",
        "presence": "absent"
      },
      {
        "acteurRef": "PA605518",
        "presence": "présent"
      },
      {
        "acteurRef": "PA720764",
        "presence": "présent"
      },
      {
        "acteurRef": "PA722228",
        "presence": "présent"
      },
      {
        "acteurRef": "PA719412",
        "presence": "présent"
      },
      {
        "acteurRef": "PA588886",
        "presence": "présent"
      },
      {
        "acteurRef": "PA721054",
        "presence": "excusé"
      },
      {
        "acteurRef": "PA721530",
        "presence": "excusé"
      },
      {
        "acteurRef": "PA719718",
        "presence": "présent"
      },
      {
        "acteurRef": "PA346054",
        "presence": "absent"
      },
      {
        "acteurRef": "PA719080",
        "presence": "présent"
      },
      {
        "acteurRef": "PA2155",
        "presence": "présent"
      },
      {
        "acteurRef": "PA719882",
        "presence": "présent"
      },
      {
        "acteurRef": "PA721976",
        "presence": "présent"
      },
      {
        "acteurRef": "PA719242",
        "presence": "présent"
      },
      {
        "acteurRef": "PA721876",
        "presence": "présent"
      },
      {
        "acteurRef": "PA720278",
        "presence": "présent"
      },
      {
        "acteurRef": "PA720334",
        "presence": "présent"
      },
      {
        "acteurRef": "PA720606",
        "presence": "présent"
      },
      {
        "acteurRef": "PA333421",
        "presence": "excusé"
      },
      {
        "acteurRef": "PA719632",
        "presence": "présent"
      },
      {
        "acteurRef": "PA720892",
        "presence": "absent"
      },
      {
        "acteurRef": "PA720944",
        "presence": "présent"
      },
      {
        "acteurRef": "PA718802",
        "presence": "présent"
      },
      {
        "acteurRef": "PA720414",
        "presence": "présent"
      },
      {
        "acteurRef": "PA721372",
        "presence": "absent"
      },
      {
        "acteurRef": "PA609520",
        "presence": "présent"
      },
      {
        "acteurRef": "PA607553",
        "presence": "présent"
      },
      {
        "acteurRef": "PA719578",
        "presence": "présent"
      },
      {
        "acteurRef": "PA721426",
        "presence": "présent"
      },
      {
        "acteurRef": "PA610733",
        "presence": "excusé"
      },
      {
        "acteurRef": "PA721600",
        "presence": "excusé"
      },
      {
        "acteurRef": "PA267527",
        "presence": "excusé"
      },
      {
        "acteurRef": "PA719972",
        "presence": "absent"
      },
      {
        "acteurRef": "PA340343",
        "presence": "présent"
      },
      {
        "acteurRef": "PA267204",
        "presence": "présent"
      },
      {
        "acteurRef": "PA610667",
        "presence": "excusé"
      },
      {
        "acteurRef": "PA722336",
        "presence": "présent"
      },
      {
        "acteurRef": "PA719092",
        "presence": "présent"
      },
      {
        "acteurRef": "PA718728",
        "presence": "présent"
      },
      {
        "acteurRef": "PA720586",
        "presence": "présent"
      },
      {
        "acteurRef": "PA721968",
        "presence": "absent"
      },
      {
        "acteurRef": "PA331582",
        "presence": "présent"
      },
      {
        "acteurRef": "PA722110",
        "presence": "absent"
      },
      {
        "acteurRef": "PA718962",
        "presence": "présent"
      }
    ]
  },
  "ouverturePresse": true,
  "odj": {
    "convocationOdj": [
      "Audition de M. Emmanuel Hyest, Président de la Fédération nationale des SAFER sur l’artificialisation des sols"
    ],
    "resumeOdj": [
      "audition de M. Emmanuel Hyest, Président de la Fédération nationale des SAFER sur l’artificialisation des sols."
    ]
  },
  "compteRenduRef": "CRCANR5L15S2018PO419865N019"
}