{
  "uid": "RUANR5L15S2018IDC428196",
  "timestampDebut": "2018-01-23T16:35:00.000+01:00",
  "timestampFin": "2018-01-23T18:35:00.000+01:00",
  "lieu": {
    "libelleLong": "salle 6351 (Affaires sociales)"
  },
  "cycleDeVie": {
    "etat": "Confirmé",
    "chrono": {
      "creation": "2018-01-03T00:00:00.000+01:00"
    }
  },
  "organeReuniRef": "PO420120",
  "participants": {
    "participantsInternes": [
      {
        "acteurRef": "PA718744",
        "presence": "présent"
      },
      {
        "acteurRef": "PA610681",
        "presence": "excusé"
      },
      {
        "acteurRef": "PA720362",
        "presence": "présent"
      },
      {
        "acteurRef": "PA720968",
        "presence": "présent"
      },
      {
        "acteurRef": "PA508",
        "presence": "excusé"
      },
      {
        "acteurRef": "PA720822",
        "presence": "présent"
      },
      {
        "acteurRef": "PA719980",
        "presence": "absent"
      },
      {
        "acteurRef": "PA608083",
        "presence": "présent"
      },
      {
        "acteurRef": "PA713448",
        "presence": "absent"
      },
      {
        "acteurRef": "PA721336",
        "presence": "présent"
      },
      {
        "acteurRef": "PA720468",
        "presence": "présent"
      },
      {
        "acteurRef": "PA856",
        "presence": "présent"
      },
      {
        "acteurRef": "PA722126",
        "presence": "absent"
      },
      {
        "acteurRef": "PA267429",
        "presence": "présent"
      },
      {
        "acteurRef": "PA719756",
        "presence": "absent"
      },
      {
        "acteurRef": "PA722390",
        "presence": "présent"
      },
      {
        "acteurRef": "PA720932",
        "presence": "absent"
      },
      {
        "acteurRef": "PA718694",
        "presence": "présent"
      },
      {
        "acteurRef": "PA718926",
        "presence": "présent"
      },
      {
        "acteurRef": "PA608292",
        "presence": "absent"
      },
      {
        "acteurRef": "PA720046",
        "presence": "absent"
      },
      {
        "acteurRef": "PA720924",
        "presence": "présent"
      },
      {
        "acteurRef": "PA719570",
        "presence": "absent"
      },
      {
        "acteurRef": "PA720286",
        "presence": "absent"
      },
      {
        "acteurRef": "PA267780",
        "presence": "présent"
      },
      {
        "acteurRef": "PA718706",
        "presence": "excusé"
      },
      {
        "acteurRef": "PA721246",
        "presence": "présent"
      },
      {
        "acteurRef": "PA721992",
        "presence": "présent"
      },
      {
        "acteurRef": "PA720170",
        "presence": "absent"
      },
      {
        "acteurRef": "PA722062",
        "presence": "absent"
      },
      {
        "acteurRef": "PA267318",
        "presence": "absent"
      },
      {
        "acteurRef": "PA721126",
        "presence": "présent"
      },
      {
        "acteurRef": "PA720326",
        "presence": "présent"
      },
      {
        "acteurRef": "PA331835",
        "presence": "absent"
      },
      {
        "acteurRef": "PA722374",
        "presence": "absent"
      },
      {
        "acteurRef": "PA720074",
        "presence": "présent"
      },
      {
        "acteurRef": "PA719186",
        "presence": "absent"
      },
      {
        "acteurRef": "PA719842",
        "presence": "présent"
      },
      {
        "acteurRef": "PA720916",
        "presence": "présent"
      },
      {
        "acteurRef": "PA720480",
        "presence": "présent"
      },
      {
        "acteurRef": "PA267378",
        "presence": "absent"
      },
      {
        "acteurRef": "PA721054",
        "presence": "présent"
      },
      {
        "acteurRef": "PA606712",
        "presence": "présent"
      },
      {
        "acteurRef": "PA717379",
        "presence": "absent"
      },
      {
        "acteurRef": "PA719072",
        "presence": "absent"
      },
      {
        "acteurRef": "PA720738",
        "presence": "absent"
      },
      {
        "acteurRef": "PA610654",
        "presence": "excusé"
      },
      {
        "acteurRef": "PA2377",
        "presence": "présent"
      },
      {
        "acteurRef": "PA720500",
        "presence": "absent"
      },
      {
        "acteurRef": "PA721710",
        "presence": "présent"
      },
      {
        "acteurRef": "PA720512",
        "presence": "présent"
      },
      {
        "acteurRef": "PA718910",
        "presence": "présent"
      },
      {
        "acteurRef": "PA720422",
        "presence": "présent"
      },
      {
        "acteurRef": "PA721286",
        "presence": "absent"
      },
      {
        "acteurRef": "PA721070",
        "presence": "présent"
      },
      {
        "acteurRef": "PA721062",
        "presence": "absent"
      },
      {
        "acteurRef": "PA718810",
        "presence": "absent"
      },
      {
        "acteurRef": "PA722022",
        "presence": "absent"
      },
      {
        "acteurRef": "PA722142",
        "presence": "absent"
      },
      {
        "acteurRef": "PA721110",
        "presence": "excusé"
      },
      {
        "acteurRef": "PA720952",
        "presence": "absent"
      },
      {
        "acteurRef": "PA719350",
        "presence": "présent"
      },
      {
        "acteurRef": "PA722086",
        "presence": "absent"
      },
      {
        "acteurRef": "PA334768",
        "presence": "présent"
      },
      {
        "acteurRef": "PA719540",
        "presence": "présent"
      },
      {
        "acteurRef": "PA643145",
        "presence": "excusé"
      },
      {
        "acteurRef": "PA643134",
        "presence": "présent"
      },
      {
        "acteurRef": "PA719930",
        "presence": "absent"
      },
      {
        "acteurRef": "PA721924",
        "presence": "absent"
      },
      {
        "acteurRef": "PA642788",
        "presence": "absent"
      },
      {
        "acteurRef": "PA267585",
        "presence": "absent"
      },
      {
        "acteurRef": "PA722102",
        "presence": "présent"
      },
      {
        "acteurRef": "PA719512",
        "presence": "présent"
      },
      {
        "acteurRef": "PA721474",
        "presence": "présent"
      },
      {
        "acteurRef": "PA722268",
        "presence": "absent"
      }
    ]
  },
  "ouverturePresse": true,
  "odj": {
    "convocationOdj": [
      "Examen, pour avis, des articles 7, 9, et 13 du projet de loi relatif à la protection des données personnelles (n° 490) (Mme Albane Gaillot, rapporteure)",
      "Communication de M. Pierre Dharréville, rapporteur, sur les conclusions de la mission flash relative aux aidants familiaux"
    ],
    "resumeOdj": [
      "protection des données personnelles (n° 490) (rapport) ;",
      "mission flash relative aux aidants familiaux."
    ],
    "pointsOdj": [
      {
        "xsiType": "podjReunion_type",
        "uid": "RUANR5L15S2018IDC428196PT25417",
        "cycleDeVie": {
          "etat": "Eventuel",
          "chrono": {
            "creation": "2018-01-19T00:00:00.000+01:00"
          }
        },
        "objet": "Examen du texte",
        "dossiersLegislatifsRefs": [
          "DLR5L15N36220"
        ],
        "typePointOdj": "Examen",
        "comiteSecret": false
      }
    ]
  },
  "compteRenduRef": "CRCANR5L15S2018PO420120N039"
}