{
  "uid": "RUANR5L15S2018IDF0104108",
  "timestampDebut": "2018-02-13T16:00:00.000+01:00",
  "timestampFin": "2018-02-13T19:30:00.000+01:00",
  "lieu": {
    "code": "SALREU012",
    "libelleCourt": "Salle N° 23",
    "libelleLong": "Salle N° 23, 3, rue Aristide Briand"
  },
  "cycleDeVie": {
    "etat": "Confirmé",
    "chrono": {
      "creation": "2018-01-22T15:50:45.000+01:00"
    }
  },
  "demandeurs": {
    "acteurs": [
      {
        "nom": "M. Fabien GOUTTEFARDE",
        "acteurRef": "PA719330"
      }
    ]
  },
  "typeReunion": "DEP"
}