{
  "uid": "RUANR5L14S2018IDF0101402",
  "timestampDebut": "2017-11-28T14:00:00.000+01:00",
  "timestampFin": "2017-11-28T15:00:00.000+01:00",
  "lieu": {
    "code": "SALREU041",
    "libelleCourt": "Sully 5",
    "libelleLong": "Sully 5, Palais Bourbon"
  },
  "cycleDeVie": {
    "etat": "Confirmé",
    "chrono": {
      "creation": "2017-11-27T10:11:24.000+01:00"
    }
  },
  "demandeurs": {
    "organe": {
      "nom": "GROUPE DU MOUVEMENT DÉMOCRATE ET APPARENTÉS",
      "organeRef": "PO730970"
    }
  },
  "organeReuniRef": "PO730970",
  "typeReunion": "GP"
}