{
  "uid": "RUANR5L15S2018IDF0105161",
  "timestampDebut": "2018-03-28T08:15:00.000+02:00",
  "timestampFin": "2018-03-28T09:45:00.000+02:00",
  "lieu": {
    "code": "SALREU010",
    "libelleCourt": "Salle N° 1",
    "libelleLong": "Salle N° 1, 3, rue Aristide Briand"
  },
  "cycleDeVie": {
    "etat": "Confirmé",
    "chrono": {
      "creation": "2018-02-05T17:51:27.000+01:00"
    }
  },
  "demandeurs": {
    "acteurs": [
      {
        "nom": "Mme Constance LE GRIP",
        "acteurRef": "PA345722"
      }
    ]
  },
  "typeReunion": "DEP"
}