{
  "uid": "RUANR5L15S2018IDF0100678",
  "timestampDebut": "2018-05-15T17:00:00.000+02:00",
  "timestampFin": "2018-05-15T18:00:00.000+02:00",
  "lieu": {
    "code": "SALREU028",
    "libelleCourt": "Salle Colbert",
    "libelleLong": "Salle Colbert , Palais Bourbon"
  },
  "cycleDeVie": {
    "etat": "Annulé",
    "chrono": {
      "creation": "2017-11-15T17:21:56.000+01:00",
      "cloture": "2018-02-22T16:14:57.000+01:00"
    }
  },
  "demandeurs": {
    "organe": {
      "nom": "GROUPE LA RÉPUBLIQUE EN MARCHE",
      "organeRef": "PO730964"
    }
  },
  "organeReuniRef": "PO730964",
  "typeReunion": "GP"
}