{
  "uid": "RUANR5L14S2017IDF0094865",
  "timestampDebut": "2017-08-01T18:30:00.000+02:00",
  "timestampFin": "2017-08-01T20:00:00.000+02:00",
  "lieu": {
    "code": "SALREU019",
    "libelleCourt": "Salon Mars I",
    "libelleLong": "Salon Mars I, 101, rue de l'Université"
  },
  "cycleDeVie": {
    "etat": "Annulé",
    "chrono": {
      "creation": "2017-07-28T14:48:21.000+02:00",
      "cloture": "2017-07-28T15:14:34.000+02:00"
    }
  },
  "demandeurs": {
    "acteurs": [
      {
        "nom": "M. Denis SOMMER",
        "acteurRef": "PA719420"
      }
    ]
  },
  "typeReunion": "DEP"
}