{
  "uid": "RUANR5L14S2017IDF0096374",
  "timestampDebut": "2017-09-27T16:30:00.000+02:00",
  "timestampFin": "2017-09-27T18:00:00.000+02:00",
  "lieu": {
    "code": "SALREU012",
    "libelleCourt": "Salle N° 23",
    "libelleLong": "Salle N° 23, 3, rue Aristide Briand"
  },
  "cycleDeVie": {
    "etat": "Annulé",
    "chrono": {
      "creation": "2017-09-14T18:04:39.000+02:00",
      "cloture": "2017-09-15T18:17:08.000+02:00"
    }
  },
  "demandeurs": {
    "acteurs": [
      {
        "nom": "M. Laurent PIETRASZEWSKI",
        "acteurRef": "PA720512"
      }
    ]
  },
  "typeReunion": "DEP"
}