{
  "uid": "RUANR5L15S2018IDF0106182",
  "timestampDebut": "2018-02-28T14:30:00.000+01:00",
  "timestampFin": "2018-02-28T18:00:00.000+01:00",
  "lieu": {
    "code": "SALREU006",
    "libelleCourt": "3ème Bureau",
    "libelleLong": "3ème Bureau, Palais Bourbon"
  },
  "cycleDeVie": {
    "etat": "Confirmé",
    "chrono": {
      "creation": "2018-02-19T17:26:33.000+01:00"
    }
  },
  "demandeurs": {
    "acteurs": [
      {
        "nom": "M. Thomas MESNIER",
        "acteurRef": "PA719072"
      }
    ]
  },
  "typeReunion": "DEP"
}