{
  "uid": "RUANR5L14S2018IDF0099681",
  "timestampDebut": "2017-11-09T18:00:00.000+01:00",
  "timestampFin": "2017-11-09T19:30:00.000+01:00",
  "lieu": {
    "code": "SALREU004",
    "libelleCourt": "1er Bureau",
    "libelleLong": "1er Bureau, Palais Bourbon"
  },
  "cycleDeVie": {
    "etat": "Confirmé",
    "chrono": {
      "creation": "2017-11-02T17:07:40.000+01:00"
    }
  },
  "demandeurs": {
    "acteurs": [
      {
        "nom": "Mme Zivka PARK",
        "acteurRef": "PA720944"
      }
    ]
  },
  "typeReunion": "DEP"
}