{
  "uid": "RUANR5L14S2017IDF0096156",
  "timestampDebut": "2017-09-13T09:00:00.000+02:00",
  "timestampFin": "2017-09-13T09:45:00.000+02:00",
  "lieu": {
    "code": "SALREU025",
    "libelleCourt": "7ème Bureau",
    "libelleLong": "7ème Bureau, Palais Bourbon"
  },
  "cycleDeVie": {
    "etat": "Confirmé",
    "chrono": {
      "creation": "2017-09-13T09:06:35.000+02:00"
    }
  },
  "demandeurs": {
    "acteurs": [
      {
        "nom": "Mme Valérie OPPELT",
        "acteurRef": "PA720108"
      }
    ]
  },
  "typeReunion": "DEP"
}