{
  "uid": "RUANR5L15S2018IDC427954",
  "timestampDebut": "2017-11-29T16:40:00.000+01:00",
  "timestampFin": "2017-11-29T18:20:00.000+01:00",
  "lieu": {
    "libelleLong": "salle 6549 (2e étage)"
  },
  "cycleDeVie": {
    "etat": "Confirmé",
    "chrono": {
      "creation": "2017-11-24T00:00:00.000+01:00"
    }
  },
  "organeReuniRef": "PO675659",
  "participants": {
    "participantsInternes": [
      {
        "acteurRef": "PA721036",
        "presence": "absent"
      },
      {
        "acteurRef": "PA724827",
        "presence": "présent"
      },
      {
        "acteurRef": "PA610634",
        "presence": "absent"
      },
      {
        "acteurRef": "PA610681",
        "presence": "présent"
      },
      {
        "acteurRef": "PA721046",
        "presence": "excusé"
      },
      {
        "acteurRef": "PA441",
        "presence": "absent"
      },
      {
        "acteurRef": "PA720968",
        "presence": "absent"
      },
      {
        "acteurRef": "PA721118",
        "presence": "absent"
      },
      {
        "acteurRef": "PA267306",
        "presence": "absent"
      },
      {
        "acteurRef": "PA702054",
        "presence": "absent"
      },
      {
        "acteurRef": "PA606202",
        "presence": "présent"
      },
      {
        "acteurRef": "PA721094",
        "presence": "absent"
      },
      {
        "acteurRef": "PA607193",
        "presence": "excusé"
      },
      {
        "acteurRef": "PA721702",
        "presence": "absent"
      },
      {
        "acteurRef": "PA266774",
        "presence": "excusé"
      },
      {
        "acteurRef": "PA719108",
        "presence": "présent"
      },
      {
        "acteurRef": "PA610775",
        "presence": "absent"
      },
      {
        "acteurRef": "PA266797",
        "presence": "excusé"
      },
      {
        "acteurRef": "PA721126",
        "presence": "absent"
      },
      {
        "acteurRef": "PA720038",
        "presence": "présent"
      },
      {
        "acteurRef": "PA722344",
        "presence": "excusé"
      },
      {
        "acteurRef": "PA267901",
        "presence": "excusé"
      },
      {
        "acteurRef": "PA721644",
        "presence": "excusé"
      },
      {
        "acteurRef": "PA268019",
        "presence": "absent"
      },
      {
        "acteurRef": "PA605518",
        "presence": "absent"
      },
      {
        "acteurRef": "PA718978",
        "presence": "excusé"
      },
      {
        "acteurRef": "PA721852",
        "presence": "absent"
      },
      {
        "acteurRef": "PA720480",
        "presence": "absent"
      },
      {
        "acteurRef": "PA337483",
        "presence": "absent"
      },
      {
        "acteurRef": "PA721054",
        "presence": "absent"
      },
      {
        "acteurRef": "PA720988",
        "presence": "absent"
      },
      {
        "acteurRef": "PA720976",
        "presence": "excusé"
      },
      {
        "acteurRef": "PA719130",
        "presence": "absent"
      },
      {
        "acteurRef": "PA610654",
        "presence": "absent"
      },
      {
        "acteurRef": "PA721960",
        "presence": "présent"
      },
      {
        "acteurRef": "PA335532",
        "presence": "présent"
      },
      {
        "acteurRef": "PA721234",
        "presence": "présent"
      },
      {
        "acteurRef": "PA693008",
        "presence": "absent"
      },
      {
        "acteurRef": "PA2492",
        "presence": "présent"
      },
      {
        "acteurRef": "PA721286",
        "presence": "absent"
      },
      {
        "acteurRef": "PA721070",
        "presence": "absent"
      },
      {
        "acteurRef": "PA721888",
        "presence": "absent"
      },
      {
        "acteurRef": "PA721062",
        "presence": "présent"
      },
      {
        "acteurRef": "PA721824",
        "presence": "excusé"
      },
      {
        "acteurRef": "PA720900",
        "presence": "présent"
      },
      {
        "acteurRef": "PA610733",
        "presence": "présent"
      },
      {
        "acteurRef": "PA702052",
        "presence": "absent"
      },
      {
        "acteurRef": "PA721110",
        "presence": "absent"
      },
      {
        "acteurRef": "PA720960",
        "presence": "présent"
      },
      {
        "acteurRef": "PA610667",
        "presence": "excusé"
      },
      {
        "acteurRef": "PA718780",
        "presence": "excusé"
      },
      {
        "acteurRef": "PA643145",
        "presence": "absent"
      },
      {
        "acteurRef": "PA718728",
        "presence": "présent"
      },
      {
        "acteurRef": "PA331582",
        "presence": "absent"
      }
    ]
  },
  "ouverturePresse": true,
  "odj": {
    "convocationOdj": [
      "Audition de M. Jean-Marc AYRAULT, ancien Premier ministre, président de la Mission de la mémoire pour l'esclavage, des traites et de leurs abolitions, sur le projet de Fondation pour la mémoire de l’esclavage ;\nPoint sur les décisions concernant les moyens pour la délégation et des demandes liées aux conditions matérielles des députés ultramarins ;\nRetour sur le colloque « La France géant des mers – Les outre-mer au défi de la croissance bleue » du 23 novembre 2017 ;\nNomination de référents de la Délégation dans les commissions permanentes ;\nQuestions diverses."
    ],
    "resumeOdj": [
      "audition de M. Jean-Marc AYRAULT, ancien Premier ministre, président de la Mission de la mémoire pour l'esclavage, des traites et de leurs abolitions, sur le projet de Fondation pour la mémoire de l’esclavage ;",
      "point sur les décisions concernant les moyens pour la délégation et des demandes liées aux conditions matérielles des députés ultramarins ;",
      "retour sur le colloque « La France géant des mers – Les outre-mer au défi de la croissance bleue » du 23 novembre 2017 ;",
      "nomination de référents de la Délégation dans les commissions permanentes ;",
      "questions diverses."
    ]
  }
}