{
  "uid": "RUANR5L14S2018IDF0097109",
  "timestampDebut": "2017-11-16T10:00:00.000+01:00",
  "timestampFin": "2017-11-16T12:00:00.000+01:00",
  "lieu": {
    "code": "SALREU007",
    "libelleCourt": "4ème Bureau",
    "libelleLong": "4ème Bureau, Palais Bourbon"
  },
  "cycleDeVie": {
    "etat": "Confirmé",
    "chrono": {
      "creation": "2017-09-26T18:35:13.000+02:00"
    }
  },
  "demandeurs": {
    "acteurs": [
      {
        "nom": "M. Thierry SOLÈRE",
        "acteurRef": "PA346876"
      }
    ]
  },
  "typeReunion": "DEP"
}