{
  "uid": "RUANR5L14S2018IDF0102294",
  "timestampDebut": "2018-01-10T14:00:00.000+01:00",
  "timestampFin": "2018-01-10T15:00:00.000+01:00",
  "lieu": {
    "code": "SALREU006",
    "libelleCourt": "3ème Bureau",
    "libelleLong": "3ème Bureau, Palais Bourbon"
  },
  "cycleDeVie": {
    "etat": "Confirmé",
    "chrono": {
      "creation": "2017-12-13T14:05:12.000+01:00"
    }
  },
  "demandeurs": {
    "acteurs": [
      {
        "nom": "M. Christophe EUZET",
        "acteurRef": "PA719616"
      }
    ]
  },
  "typeReunion": "DEP"
}