{
  "uid": "RUANR5L14S2017IDF0093853",
  "timestampDebut": "2017-07-12T15:00:00.000+02:00",
  "timestampFin": "2017-07-12T16:30:00.000+02:00",
  "lieu": {
    "code": "SALREU023",
    "libelleCourt": "Salle 7426",
    "libelleLong": "Salle 7426, 101, rue de l'Université"
  },
  "cycleDeVie": {
    "etat": "Confirmé",
    "chrono": {
      "creation": "2017-07-11T15:52:47.000+02:00"
    }
  },
  "demandeurs": {
    "acteurs": [
      {
        "nom": "M. Jean-René CAZENEUVE",
        "acteurRef": "PA719472"
      }
    ]
  },
  "typeReunion": "DEP"
}