{
  "uid": "RUANR5L15S2018IDF0103612",
  "timestampDebut": "2018-01-17T11:30:00.000+01:00",
  "timestampFin": "2018-01-17T12:30:00.000+01:00",
  "lieu": {
    "code": "SALREU023",
    "libelleCourt": "Salle 7426",
    "libelleLong": "Salle 7426, 101, rue de l'Université"
  },
  "cycleDeVie": {
    "etat": "Confirmé",
    "chrono": {
      "creation": "2018-01-15T17:12:27.000+01:00"
    }
  },
  "demandeurs": {
    "acteurs": [
      {
        "nom": "M. Serge LETCHIMY",
        "acteurRef": "PA337483"
      }
    ]
  },
  "typeReunion": "DEP"
}