{
  "uid": "RUANR5L15S2018IDC427697",
  "timestampDebut": "2017-11-02T13:20:00.000+01:00",
  "timestampFin": "2017-11-02T14:30:00.000+01:00",
  "lieu": {
    "libelleLong": "salle 6350 (Finances)"
  },
  "cycleDeVie": {
    "etat": "Confirmé",
    "chrono": {
      "creation": "2017-10-30T00:00:00.000+01:00"
    }
  },
  "organeReuniRef": "PO59048",
  "participants": {
    "participantsInternes": [
      {
        "acteurRef": "PA718954",
        "presence": "absent"
      },
      {
        "acteurRef": "PA605963",
        "presence": "présent"
      },
      {
        "acteurRef": "PA609726",
        "presence": "absent"
      },
      {
        "acteurRef": "PA721836",
        "presence": "absent"
      },
      {
        "acteurRef": "PA721410",
        "presence": "présent"
      },
      {
        "acteurRef": "PA721608",
        "presence": "excusé"
      },
      {
        "acteurRef": "PA605069",
        "presence": "présent"
      },
      {
        "acteurRef": "PA720298",
        "presence": "présent"
      },
      {
        "acteurRef": "PA746",
        "presence": "présent"
      },
      {
        "acteurRef": "PA719138",
        "presence": "absent"
      },
      {
        "acteurRef": "PA720520",
        "presence": "absent"
      },
      {
        "acteurRef": "PA719472",
        "presence": "présent"
      },
      {
        "acteurRef": "PA719250",
        "presence": "absent"
      },
      {
        "acteurRef": "PA721202",
        "presence": "présent"
      },
      {
        "acteurRef": "PA923",
        "presence": "absent"
      },
      {
        "acteurRef": "PA942",
        "presence": "absent"
      },
      {
        "acteurRef": "PA332523",
        "presence": "absent"
      },
      {
        "acteurRef": "PA720268",
        "presence": "absent"
      },
      {
        "acteurRef": "PA719710",
        "presence": "présent"
      },
      {
        "acteurRef": "PA718720",
        "presence": "absent"
      },
      {
        "acteurRef": "PA643175",
        "presence": "absent"
      },
      {
        "acteurRef": "PA720002",
        "presence": "présent"
      },
      {
        "acteurRef": "PA1327",
        "presence": "absent"
      },
      {
        "acteurRef": "PA719480",
        "presence": "présent"
      },
      {
        "acteurRef": "PA267336",
        "presence": "présent"
      },
      {
        "acteurRef": "PA720560",
        "presence": "présent"
      },
      {
        "acteurRef": "PA720790",
        "presence": "présent"
      },
      {
        "acteurRef": "PA721764",
        "presence": "absent"
      },
      {
        "acteurRef": "PA721498",
        "presence": "présent"
      },
      {
        "acteurRef": "PA722054",
        "presence": "présent"
      },
      {
        "acteurRef": "PA608416",
        "presence": "absent"
      },
      {
        "acteurRef": "PA721150",
        "presence": "absent"
      },
      {
        "acteurRef": "PA719060",
        "presence": "présent"
      },
      {
        "acteurRef": "PA719778",
        "presence": "excusé"
      },
      {
        "acteurRef": "PA720214",
        "presence": "absent"
      },
      {
        "acteurRef": "PA719798",
        "presence": "présent"
      },
      {
        "acteurRef": "PA609245",
        "presence": "absent"
      },
      {
        "acteurRef": "PA718978",
        "presence": "présent"
      },
      {
        "acteurRef": "PA1838",
        "presence": "absent"
      },
      {
        "acteurRef": "PA720022",
        "presence": "présent"
      },
      {
        "acteurRef": "PA712014",
        "presence": "présent"
      },
      {
        "acteurRef": "PA1874",
        "presence": "absent"
      },
      {
        "acteurRef": "PA721466",
        "presence": "présent"
      },
      {
        "acteurRef": "PA719006",
        "presence": "présent"
      },
      {
        "acteurRef": "PA608016",
        "presence": "absent"
      },
      {
        "acteurRef": "PA722244",
        "presence": "absent"
      },
      {
        "acteurRef": "PA720230",
        "presence": "présent"
      },
      {
        "acteurRef": "PA720728",
        "presence": "présent"
      },
      {
        "acteurRef": "PA721418",
        "presence": "absent"
      },
      {
        "acteurRef": "PA721670",
        "presence": "présent"
      },
      {
        "acteurRef": "PA719850",
        "presence": "présent"
      },
      {
        "acteurRef": "PA721656",
        "presence": "absent"
      },
      {
        "acteurRef": "PA720492",
        "presence": "présent"
      },
      {
        "acteurRef": "PA720402",
        "presence": "absent"
      },
      {
        "acteurRef": "PA721636",
        "presence": "absent"
      },
      {
        "acteurRef": "PA607595",
        "presence": "présent"
      },
      {
        "acteurRef": "PA721568",
        "presence": "présent"
      },
      {
        "acteurRef": "PA718736",
        "presence": "présent"
      },
      {
        "acteurRef": "PA336175",
        "presence": "absent"
      },
      {
        "acteurRef": "PA608172",
        "presence": "absent"
      },
      {
        "acteurRef": "PA405480",
        "presence": "absent"
      },
      {
        "acteurRef": "PA609590",
        "presence": "présent"
      },
      {
        "acteurRef": "PA719676",
        "presence": "absent"
      },
      {
        "acteurRef": "PA721458",
        "presence": "présent"
      },
      {
        "acteurRef": "PA720692",
        "presence": "présent"
      },
      {
        "acteurRef": "PA720878",
        "presence": "présent"
      },
      {
        "acteurRef": "PA722078",
        "presence": "présent"
      },
      {
        "acteurRef": "PA720960",
        "presence": "excusé"
      },
      {
        "acteurRef": "PA719592",
        "presence": "absent"
      },
      {
        "acteurRef": "PA721542",
        "presence": "présent"
      },
      {
        "acteurRef": "PA607090",
        "presence": "absent"
      },
      {
        "acteurRef": "PA331582",
        "presence": "présent"
      },
      {
        "acteurRef": "PA2960",
        "presence": "excusé"
      }
    ],
    "personnesAuditionnees": [
      {
        "xsiType": "IdActeur_type",
        "uid": "PA331481",
        "ident": {
          "civ": "M.",
          "prenom": "Bruno",
          "nom": "Le Maire",
          "alpha": "LeMaire"
        },
        "dateNais": "1969-04-15T01:00:00.000+01:00"
      }
    ]
  },
  "ouverturePresse": true,
  "odj": {
    "convocationOdj": [
      "– Audition de M. Bruno LE MAIRE, ministre de l’économie et des finances, sur le projet de loi de finances rectificative pour 2017 (n° 363)"
    ],
    "resumeOdj": [
      "audition de M. Bruno Le Maire, ministre de l’économie et des finances, sur le projet de loi de finances rectificative pour 2017 (n° 363)."
    ],
    "pointsOdj": [
      {
        "xsiType": "podjReunion_type",
        "uid": "RUANR5L15S2018IDC427697PT25189",
        "cycleDeVie": {
          "etat": "Confirmé",
          "chrono": {
            "creation": "2017-11-03T00:00:00.000+01:00"
          }
        },
        "objet": "de M. Bruno Le Maire, ministre de l'économie et des finances",
        "dossiersLegislatifsRefs": [
          "DLR5L15N36107"
        ],
        "typePointOdj": "Audition",
        "comiteSecret": false
      }
    ]
  },
  "compteRenduRef": "CRCANR5L15S2018PO59048N029"
}