{
  "uid": "RUANR5L15S2018IDC428222",
  "timestampDebut": "2018-01-17T18:05:00.000+01:00",
  "timestampFin": "2018-01-17T19:00:00.000+01:00",
  "lieu": {
    "libelleLong": "salle 6237 (Développement durable)"
  },
  "cycleDeVie": {
    "etat": "Confirmé",
    "chrono": {
      "creation": "2018-01-11T00:00:00.000+01:00"
    }
  },
  "organeReuniRef": "PO743158",
  "participants": {
    "participantsInternes": [
      {
        "acteurRef": "PA642724",
        "presence": "absent"
      },
      {
        "acteurRef": "PA720968",
        "presence": "absent"
      },
      {
        "acteurRef": "PA267233",
        "presence": "absent"
      },
      {
        "acteurRef": "PA719032",
        "presence": "présent"
      },
      {
        "acteurRef": "PA721118",
        "presence": "absent"
      },
      {
        "acteurRef": "PA719922",
        "presence": "absent"
      },
      {
        "acteurRef": "PA702054",
        "presence": "absent"
      },
      {
        "acteurRef": "PA719692",
        "presence": "absent"
      },
      {
        "acteurRef": "PA719616",
        "presence": "absent"
      },
      {
        "acteurRef": "PA610775",
        "presence": "excusé"
      },
      {
        "acteurRef": "PA721126",
        "presence": "présent"
      },
      {
        "acteurRef": "PA720054",
        "presence": "présent"
      },
      {
        "acteurRef": "PA720038",
        "presence": "présent"
      },
      {
        "acteurRef": "PA267901",
        "presence": "absent"
      },
      {
        "acteurRef": "PA605518",
        "presence": "absent"
      },
      {
        "acteurRef": "PA721054",
        "presence": "présent"
      },
      {
        "acteurRef": "PA346054",
        "presence": "absent"
      },
      {
        "acteurRef": "PA721734",
        "presence": "présent"
      },
      {
        "acteurRef": "PA720334",
        "presence": "présent"
      },
      {
        "acteurRef": "PA719632",
        "presence": "présent"
      },
      {
        "acteurRef": "PA718784",
        "presence": "absent"
      },
      {
        "acteurRef": "PA609520",
        "presence": "absent"
      },
      {
        "acteurRef": "PA643127",
        "presence": "absent"
      },
      {
        "acteurRef": "PA721062",
        "presence": "absent"
      },
      {
        "acteurRef": "PA721824",
        "presence": "absent"
      },
      {
        "acteurRef": "PA702052",
        "presence": "présent"
      },
      {
        "acteurRef": "PA720960",
        "presence": "présent"
      },
      {
        "acteurRef": "PA719092",
        "presence": "présent"
      },
      {
        "acteurRef": "PA643145",
        "presence": "absent"
      }
    ]
  },
  "ouverturePresse": true,
  "odj": {
    "convocationOdj": [
      "Audition, ouverte à la presse, de Mme Françoise Gaill, présidente du conseil stratégique et scientifique de la Flotte océanographique française, coordonnatrice du conseil scientifique de la Plateforme océan et climat."
    ],
    "resumeOdj": [
      "audition, ouverte à la presse, de Mme Françoise Gaill, présidente du conseil stratégique et scientifique de la Flotte océanographique française, coordonnatrice du conseil scientifique de la Plateforme océan et climat."
    ],
    "pointsOdj": [
      {
        "xsiType": "podjReunion_type",
        "uid": "RUANR5L15S2018IDC428222PT25375",
        "cycleDeVie": {
          "etat": "Confirmé",
          "chrono": {
            "creation": "2018-01-11T00:00:00.000+01:00"
          }
        },
        "objet": "Audition, ouverte à la presse, de Mme Françoise Gaill, présidente du conseil stratégique et scientifique de la Flotte océanographique française, coordonnatrice du conseil scientifique de la Plateforme océan et climat.",
        "dossiersLegislatifsRefs": [
          "DLR5L15N36128"
        ],
        "typePointOdj": "Audition",
        "comiteSecret": false
      }
    ]
  }
}