{
  "uid": "RUANR5L14S2017IDF0095220",
  "timestampDebut": "2017-09-05T11:00:00.000+02:00",
  "timestampFin": "2017-09-05T12:30:00.000+02:00",
  "lieu": {
    "code": "SALREU049",
    "libelleCourt": "Salle 6822",
    "libelleLong": "Salle 6822, Palais Bourbon"
  },
  "cycleDeVie": {
    "etat": "Confirmé",
    "chrono": {
      "creation": "2017-08-07T11:51:54.000+02:00",
      "cloture": "2017-08-29T15:34:42.000+02:00"
    }
  },
  "demandeurs": {
    "acteurs": [
      {
        "nom": "M. Gilles CARREZ",
        "acteurRef": "PA746"
      }
    ]
  },
  "typeReunion": "DEP"
}