{
  "uid": "RUANR5L14S2018IDF0100747",
  "timestampDebut": "2018-01-30T10:00:00.000+01:00",
  "timestampFin": "2018-01-30T11:00:00.000+01:00",
  "lieu": {
    "code": "SALREU025",
    "libelleCourt": "7ème Bureau",
    "libelleLong": "7ème Bureau, Palais Bourbon"
  },
  "cycleDeVie": {
    "etat": "Confirmé",
    "chrono": {
      "creation": "2017-11-15T20:59:53.000+01:00"
    }
  },
  "demandeurs": {
    "organe": {
      "nom": "GROUPE DU MOUVEMENT DÉMOCRATE ET APPARENTÉS",
      "organeRef": "PO730970"
    }
  },
  "organeReuniRef": "PO730970",
  "typeReunion": "GP"
}