{
  "uid": "RUANR5L14S2017IDF0095781",
  "timestampDebut": "2017-09-27T14:00:00.000+02:00",
  "timestampFin": "2017-09-27T16:00:00.000+02:00",
  "lieu": {
    "code": "SALREU008",
    "libelleCourt": "5ème Bureau",
    "libelleLong": "5ème Bureau, Palais Bourbon"
  },
  "cycleDeVie": {
    "etat": "Annulé",
    "chrono": {
      "creation": "2017-09-06T14:33:15.000+02:00",
      "cloture": "2017-09-25T09:54:54.000+02:00"
    }
  },
  "demandeurs": {
    "acteurs": [
      {
        "nom": "M. Jean-Luc WARSMANN",
        "acteurRef": "PA2952"
      }
    ]
  },
  "typeReunion": "DEP"
}