{
  "uid": "RUANR5L14S2018IDF0100882",
  "timestampDebut": "2017-11-23T09:00:00.000+01:00",
  "timestampFin": "2017-11-23T11:00:00.000+01:00",
  "lieu": {
    "code": "SALREU032",
    "libelleCourt": "Sully 4",
    "libelleLong": "Sully 4, Palais Bourbon"
  },
  "cycleDeVie": {
    "etat": "Confirmé",
    "chrono": {
      "creation": "2017-11-17T09:22:17.000+01:00"
    }
  },
  "demandeurs": {
    "organe": {
      "nom": "GROUPE LA RÉPUBLIQUE EN MARCHE",
      "organeRef": "PO730964"
    }
  },
  "organeReuniRef": "PO730964",
  "typeReunion": "GP"
}