{
  "uid": "RUANR5L14S2018IDF0098511",
  "timestampDebut": "2017-12-12T09:30:00.000+01:00",
  "timestampFin": "2017-12-12T11:00:00.000+01:00",
  "lieu": {
    "code": "SALREU029",
    "libelleCourt": "Salon Mars III",
    "libelleLong": "Salon Mars III, 101, rue de l'Université"
  },
  "cycleDeVie": {
    "etat": "Confirmé",
    "chrono": {
      "creation": "2017-10-12T15:53:29.000+02:00"
    }
  },
  "demandeurs": {
    "acteurs": [
      {
        "nom": "M. Christophe BOUILLON",
        "acteurRef": "PA267233"
      }
    ]
  },
  "typeReunion": "DEP"
}