{
  "uid": "RUANR5L15S2018IDC427698",
  "timestampDebut": "2017-11-03T12:00:00.000+01:00",
  "timestampFin": "2017-11-03T13:20:00.000+01:00",
  "lieu": {
    "libelleLong": "salle de la commission des Finances"
  },
  "cycleDeVie": {
    "etat": "Confirmé",
    "chrono": {
      "creation": "2017-10-30T00:00:00.000+01:00"
    }
  },
  "organeReuniRef": "PO59048",
  "participants": {
    "participantsInternes": [
      {
        "acteurRef": "PA718954",
        "presence": "absent"
      },
      {
        "acteurRef": "PA605963",
        "presence": "absent"
      },
      {
        "acteurRef": "PA609726",
        "presence": "absent"
      },
      {
        "acteurRef": "PA721836",
        "presence": "présent"
      },
      {
        "acteurRef": "PA721410",
        "presence": "absent"
      },
      {
        "acteurRef": "PA721608",
        "presence": "excusé"
      },
      {
        "acteurRef": "PA605069",
        "presence": "excusé"
      },
      {
        "acteurRef": "PA720298",
        "presence": "présent"
      },
      {
        "acteurRef": "PA746",
        "presence": "présent"
      },
      {
        "acteurRef": "PA719138",
        "presence": "absent"
      },
      {
        "acteurRef": "PA720520",
        "presence": "absent"
      },
      {
        "acteurRef": "PA719472",
        "presence": "présent"
      },
      {
        "acteurRef": "PA719250",
        "presence": "absent"
      },
      {
        "acteurRef": "PA721202",
        "presence": "présent"
      },
      {
        "acteurRef": "PA923",
        "presence": "absent"
      },
      {
        "acteurRef": "PA942",
        "presence": "absent"
      },
      {
        "acteurRef": "PA332523",
        "presence": "présent"
      },
      {
        "acteurRef": "PA720268",
        "presence": "absent"
      },
      {
        "acteurRef": "PA719710",
        "presence": "présent"
      },
      {
        "acteurRef": "PA718720",
        "presence": "absent"
      },
      {
        "acteurRef": "PA643175",
        "presence": "présent"
      },
      {
        "acteurRef": "PA720002",
        "presence": "absent"
      },
      {
        "acteurRef": "PA1327",
        "presence": "absent"
      },
      {
        "acteurRef": "PA719480",
        "presence": "absent"
      },
      {
        "acteurRef": "PA267336",
        "presence": "présent"
      },
      {
        "acteurRef": "PA720560",
        "presence": "absent"
      },
      {
        "acteurRef": "PA720790",
        "presence": "absent"
      },
      {
        "acteurRef": "PA721764",
        "presence": "présent"
      },
      {
        "acteurRef": "PA721498",
        "presence": "absent"
      },
      {
        "acteurRef": "PA722054",
        "presence": "absent"
      },
      {
        "acteurRef": "PA608416",
        "presence": "présent"
      },
      {
        "acteurRef": "PA721150",
        "presence": "absent"
      },
      {
        "acteurRef": "PA719060",
        "presence": "absent"
      },
      {
        "acteurRef": "PA719778",
        "presence": "excusé"
      },
      {
        "acteurRef": "PA720214",
        "presence": "absent"
      },
      {
        "acteurRef": "PA719798",
        "presence": "absent"
      },
      {
        "acteurRef": "PA609245",
        "presence": "absent"
      },
      {
        "acteurRef": "PA718978",
        "presence": "présent"
      },
      {
        "acteurRef": "PA1838",
        "presence": "absent"
      },
      {
        "acteurRef": "PA720022",
        "presence": "présent"
      },
      {
        "acteurRef": "PA712014",
        "presence": "absent"
      },
      {
        "acteurRef": "PA1874",
        "presence": "absent"
      },
      {
        "acteurRef": "PA721466",
        "presence": "absent"
      },
      {
        "acteurRef": "PA719006",
        "presence": "présent"
      },
      {
        "acteurRef": "PA608016",
        "presence": "excusé"
      },
      {
        "acteurRef": "PA722244",
        "presence": "absent"
      },
      {
        "acteurRef": "PA720230",
        "presence": "présent"
      },
      {
        "acteurRef": "PA720728",
        "presence": "absent"
      },
      {
        "acteurRef": "PA721418",
        "presence": "absent"
      },
      {
        "acteurRef": "PA721670",
        "presence": "présent"
      },
      {
        "acteurRef": "PA719850",
        "presence": "présent"
      },
      {
        "acteurRef": "PA721656",
        "presence": "absent"
      },
      {
        "acteurRef": "PA720492",
        "presence": "présent"
      },
      {
        "acteurRef": "PA720402",
        "presence": "absent"
      },
      {
        "acteurRef": "PA721636",
        "presence": "absent"
      },
      {
        "acteurRef": "PA607595",
        "presence": "absent"
      },
      {
        "acteurRef": "PA721568",
        "presence": "absent"
      },
      {
        "acteurRef": "PA718736",
        "presence": "absent"
      },
      {
        "acteurRef": "PA336175",
        "presence": "absent"
      },
      {
        "acteurRef": "PA608172",
        "presence": "absent"
      },
      {
        "acteurRef": "PA405480",
        "presence": "présent"
      },
      {
        "acteurRef": "PA609590",
        "presence": "absent"
      },
      {
        "acteurRef": "PA719676",
        "presence": "absent"
      },
      {
        "acteurRef": "PA721458",
        "presence": "absent"
      },
      {
        "acteurRef": "PA720692",
        "presence": "présent"
      },
      {
        "acteurRef": "PA720878",
        "presence": "présent"
      },
      {
        "acteurRef": "PA722078",
        "presence": "absent"
      },
      {
        "acteurRef": "PA720960",
        "presence": "excusé"
      },
      {
        "acteurRef": "PA719592",
        "presence": "absent"
      },
      {
        "acteurRef": "PA721542",
        "presence": "présent"
      },
      {
        "acteurRef": "PA607090",
        "presence": "absent"
      },
      {
        "acteurRef": "PA331582",
        "presence": "absent"
      },
      {
        "acteurRef": "PA2960",
        "presence": "excusé"
      }
    ]
  },
  "ouverturePresse": true,
  "odj": {
    "convocationOdj": [
      "–  examen du projet de loi de finances rectificative pour 2017 (n° 363) (M. Joël GIRAUD, rapporteur général)"
    ],
    "resumeOdj": [
      "projet de loi de finances rectificative pour 2017 (rapport)"
    ],
    "pointsOdj": [
      {
        "xsiType": "podjReunion_type",
        "uid": "RUANR5L15S2018IDC427698PT25190",
        "cycleDeVie": {
          "etat": "Confirmé",
          "chrono": {
            "creation": "2017-11-03T00:00:00.000+01:00"
          }
        },
        "objet": "du projet de loi de finances rectificative pour 2017",
        "dossiersLegislatifsRefs": [
          "DLR5L15N36107"
        ],
        "typePointOdj": "Examen",
        "comiteSecret": false
      }
    ]
  },
  "compteRenduRef": "CRCANR5L15S2018PO59048N033"
}