{
  "uid": "RUANR5L15S2018IDF0105196",
  "timestampDebut": "2018-02-13T17:00:00.000+01:00",
  "timestampFin": "2018-02-13T18:30:00.000+01:00",
  "lieu": {
    "code": "SALREU023",
    "libelleCourt": "Salle 7426",
    "libelleLong": "Salle 7426, 101, rue de l'Université"
  },
  "cycleDeVie": {
    "etat": "Confirmé",
    "chrono": {
      "creation": "2018-02-06T13:48:07.000+01:00"
    }
  },
  "demandeurs": {
    "acteurs": [
      {
        "nom": "Mme Bérangère ABBA",
        "acteurRef": "PA720242"
      }
    ]
  },
  "typeReunion": "DEP"
}