{
  "uid": "RUANR5L14S2018IDF0098127",
  "timestampDebut": "2017-10-25T09:30:00.000+02:00",
  "timestampFin": "2017-10-25T12:30:00.000+02:00",
  "lieu": {
    "code": "SALREU007",
    "libelleCourt": "4ème Bureau",
    "libelleLong": "4ème Bureau, Palais Bourbon"
  },
  "cycleDeVie": {
    "etat": "Confirmé",
    "chrono": {
      "creation": "2017-10-06T10:50:59.000+02:00"
    }
  },
  "demandeurs": {
    "acteurs": [
      {
        "nom": "Mme Valérie LACROUTE",
        "acteurRef": "PA609245"
      }
    ]
  },
  "typeReunion": "DEP"
}