{
  "uid": "RUANR5L14S2017IDF0096577",
  "timestampDebut": "2017-09-19T10:00:00.000+02:00",
  "timestampFin": "2017-09-19T13:00:00.000+02:00",
  "lieu": {
    "code": "SALREU005",
    "libelleCourt": "2ème Bureau",
    "libelleLong": "2ème Bureau, Palais Bourbon"
  },
  "cycleDeVie": {
    "etat": "Confirmé",
    "chrono": {
      "creation": "2017-09-19T10:30:30.000+02:00"
    }
  },
  "demandeurs": {
    "organe": {
      "nom": "GROUPE GAUCHE DÉMOCRATE ET RÉPUBLICAINE",
      "organeRef": "PO730940"
    }
  },
  "organeReuniRef": "PO730940",
  "typeReunion": "GP"
}