{
  "uid": "RUANR5L15S2018IDC427469",
  "timestampDebut": "2017-10-24T17:30:00.000+02:00",
  "timestampFin": "2017-10-24T18:30:00.000+02:00",
  "lieu": {
    "libelleLong": "salle 4223 (33 rue Saint-Dominique)"
  },
  "cycleDeVie": {
    "etat": "Confirmé",
    "chrono": {
      "creation": "2017-10-05T00:00:00.000+02:00"
    }
  },
  "organeReuniRef": "PO59047",
  "participants": {
    "participantsInternes": [
      {
        "acteurRef": "PA588884",
        "presence": "présent"
      },
      {
        "acteurRef": "PA642724",
        "presence": "présent"
      },
      {
        "acteurRef": "PA719218",
        "presence": "présent"
      },
      {
        "acteurRef": "PA721344",
        "presence": "présent"
      },
      {
        "acteurRef": "PA719032",
        "presence": "présent"
      },
      {
        "acteurRef": "PA330684",
        "presence": "présent"
      },
      {
        "acteurRef": "PA721118",
        "presence": "excusé"
      },
      {
        "acteurRef": "PA719496",
        "presence": "présent"
      },
      {
        "acteurRef": "PA721166",
        "presence": "présent"
      },
      {
        "acteurRef": "PA719448",
        "presence": "présent"
      },
      {
        "acteurRef": "PA719294",
        "presence": "présent"
      },
      {
        "acteurRef": "PA718850",
        "presence": "présent"
      },
      {
        "acteurRef": "PA998",
        "presence": "excusé"
      },
      {
        "acteurRef": "PA1008",
        "presence": "présent"
      },
      {
        "acteurRef": "PA1029",
        "presence": "présent"
      },
      {
        "acteurRef": "PA720862",
        "presence": "présent"
      },
      {
        "acteurRef": "PA720438",
        "presence": "présent"
      },
      {
        "acteurRef": "PA722382",
        "presence": "présent"
      },
      {
        "acteurRef": "PA1198",
        "presence": "présent"
      },
      {
        "acteurRef": "PA720684",
        "presence": "présent"
      },
      {
        "acteurRef": "PA1206",
        "presence": "présent"
      },
      {
        "acteurRef": "PA1276",
        "presence": "présent"
      },
      {
        "acteurRef": "PA722284",
        "presence": "présent"
      },
      {
        "acteurRef": "PA720806",
        "presence": "présent"
      },
      {
        "acteurRef": "PA721024",
        "presence": "présent"
      },
      {
        "acteurRef": "PA720222",
        "presence": "présent"
      },
      {
        "acteurRef": "PA718674",
        "presence": "présent"
      },
      {
        "acteurRef": "PA1498",
        "presence": "présent"
      },
      {
        "acteurRef": "PA610775",
        "presence": "excusé"
      },
      {
        "acteurRef": "PA695100",
        "presence": "excusé"
      },
      {
        "acteurRef": "PA1630",
        "presence": "présent"
      },
      {
        "acteurRef": "PA333818",
        "presence": "présent"
      },
      {
        "acteurRef": "PA267801",
        "presence": "excusé"
      },
      {
        "acteurRef": "PA719210",
        "presence": "présent"
      },
      {
        "acteurRef": "PA722344",
        "presence": "présent"
      },
      {
        "acteurRef": "PA721644",
        "presence": "présent"
      },
      {
        "acteurRef": "PA720202",
        "presence": "présent"
      },
      {
        "acteurRef": "PA721004",
        "presence": "présent"
      },
      {
        "acteurRef": "PA1809",
        "presence": "présent"
      },
      {
        "acteurRef": "PA335612",
        "presence": "présent"
      },
      {
        "acteurRef": "PA722008",
        "presence": "présent"
      },
      {
        "acteurRef": "PA721450",
        "presence": "présent"
      },
      {
        "acteurRef": "PA720342",
        "presence": "présent"
      },
      {
        "acteurRef": "PA720614",
        "presence": "présent"
      },
      {
        "acteurRef": "PA1960",
        "presence": "présent"
      },
      {
        "acteurRef": "PA722178",
        "presence": "présent"
      },
      {
        "acteurRef": "PA334116",
        "presence": "présent"
      },
      {
        "acteurRef": "PA720146",
        "presence": "présent"
      },
      {
        "acteurRef": "PA720870",
        "presence": "présent"
      },
      {
        "acteurRef": "PA2150",
        "presence": "présent"
      },
      {
        "acteurRef": "PA720370",
        "presence": "présent"
      },
      {
        "acteurRef": "PA719130",
        "presence": "présent"
      },
      {
        "acteurRef": "PA719464",
        "presence": "présent"
      },
      {
        "acteurRef": "PA721486",
        "presence": "présent"
      },
      {
        "acteurRef": "PA721956",
        "presence": "présent"
      },
      {
        "acteurRef": "PA721182",
        "presence": "présent"
      },
      {
        "acteurRef": "PA267260",
        "presence": "présent"
      },
      {
        "acteurRef": "PA719528",
        "presence": "présent"
      },
      {
        "acteurRef": "PA2492",
        "presence": "présent"
      },
      {
        "acteurRef": "PA720552",
        "presence": "présent"
      },
      {
        "acteurRef": "PA2529",
        "presence": "présent"
      },
      {
        "acteurRef": "PA721824",
        "presence": "excusé"
      },
      {
        "acteurRef": "PA330788",
        "presence": "présent"
      },
      {
        "acteurRef": "PA720138",
        "presence": "présent"
      },
      {
        "acteurRef": "PA717151",
        "presence": "présent"
      },
      {
        "acteurRef": "PA721174",
        "presence": "excusé"
      },
      {
        "acteurRef": "PA722118",
        "presence": "présent"
      },
      {
        "acteurRef": "PA267794",
        "presence": "absent"
      },
      {
        "acteurRef": "PA721690",
        "presence": "présent"
      },
      {
        "acteurRef": "PA719550",
        "presence": "présent"
      },
      {
        "acteurRef": "PA2796",
        "presence": "absent"
      },
      {
        "acteurRef": "PA720830",
        "presence": "présent"
      },
      {
        "acteurRef": "PA720746",
        "presence": "présent"
      }
    ]
  },
  "ouverturePresse": false,
  "odj": {
    "convocationOdj": [
      "– Organisation, à huis clos, des futurs travaux de la commission. \n– nomination de rapporteurs sur des missions d’information, \n– nomination de rapporteurs pour des groupes de suivi géographiques,\n– nomination de rapporteurs pour les organismes contribuant à l’action extérieure de la France.\n– Nomination de rapporteurs sur les projets de loi suivants :\n•Projet de loi, adopté par le Sénat, autorisant l'approbation de la convention d'extradition entre le Gouvernement de la République française et le Gouvernement de la République du Costa Rica (n° 159) ; \n•Projet de loi, adopté par le Sénat, autorisant l'approbation de la convention d'entraide judiciaire en matière pénale entre le Gouvernement de la République française et le Gouvernement de la République du Costa Rica (n° 160) ; \n•projet de loi autorisant l’approbation de l’accord entre le Gouvernement de la République française et le Gouvernement de la Principauté d’Andorre relatif à la coopération technique et à l’assistance mutuelle en matière de sécurité civile (n° 167) ; \n•Projet de loi autorisant l’approbation de l’accord entre le Gouvernement de la République française et le Gouvernement de la Principauté d’Andorre relatif à la coopération transfrontalière en matière policière et douanière (n° 168) ; \n•Projet de loi autorisant l’approbation de l’amendement au protocole de Montréal du 16 septembre 1987 relatif à des substances qui appauvrissent la couche d'ozone (n° 270) ; \n•Projet de loi autorisant l'approbation de l'accord entre le Gouvernement de la République française et le Conseil fédéral suisse relatif à la fiscalité applicable dans l'enceinte de l'aéroport de Bâle-Mulhouse (sous réserve de son dépôt à l’Assemblée)."
    ],
    "resumeOdj": [
      "organisation, à huis clos, des futurs travaux de la commission :",
      "nomination de rapporteurs sur des missions d’information ;",
      "nomination de rapporteurs pour des groupes de suivi géographiques ;",
      "nomination de rapporteurs pour les organismes contribuant à l’action extérieure de la France ;",
      "nomination de rapporteurs sur les projets de loi."
    ],
    "pointsOdj": [
      {
        "xsiType": "podjReunion_type",
        "uid": "RUANR5L15S2018IDC427469PT25178",
        "cycleDeVie": {
          "etat": "Confirmé",
          "chrono": {
            "creation": "2017-10-26T00:00:00.000+02:00"
          }
        },
        "objet": "Nomination rapporteur",
        "dossiersLegislatifsRefs": [
          "DLR5L14N33602"
        ],
        "typePointOdj": "Nomination rapporteur",
        "comiteSecret": false
      },
      {
        "xsiType": "podjReunion_type",
        "uid": "RUANR5L15S2018IDC427469PT25179",
        "cycleDeVie": {
          "etat": "Confirmé",
          "chrono": {
            "creation": "2017-10-26T00:00:00.000+02:00"
          }
        },
        "objet": "Nomination rapporteur",
        "dossiersLegislatifsRefs": [
          "DLR5L14N33604"
        ],
        "typePointOdj": "Nomination rapporteur",
        "comiteSecret": false
      },
      {
        "xsiType": "podjReunion_type",
        "uid": "RUANR5L15S2018IDC427469PT25180",
        "cycleDeVie": {
          "etat": "Confirmé",
          "chrono": {
            "creation": "2017-10-26T00:00:00.000+02:00"
          }
        },
        "objet": "Nomination rapporteur",
        "dossiersLegislatifsRefs": [
          "DLR5L15N35949"
        ],
        "typePointOdj": "Nomination rapporteur",
        "comiteSecret": false
      },
      {
        "xsiType": "podjReunion_type",
        "uid": "RUANR5L15S2018IDC427469PT25181",
        "cycleDeVie": {
          "etat": "Confirmé",
          "chrono": {
            "creation": "2017-10-26T00:00:00.000+02:00"
          }
        },
        "objet": "Nomination rapporteur",
        "dossiersLegislatifsRefs": [
          "DLR5L15N35950"
        ],
        "typePointOdj": "Nomination rapporteur",
        "comiteSecret": false
      },
      {
        "xsiType": "podjReunion_type",
        "uid": "RUANR5L15S2018IDC427469PT25182",
        "cycleDeVie": {
          "etat": "Confirmé",
          "chrono": {
            "creation": "2017-10-26T00:00:00.000+02:00"
          }
        },
        "objet": "Nomination rapporteur",
        "dossiersLegislatifsRefs": [
          "DLR5L15N36031"
        ],
        "typePointOdj": "Nomination rapporteur",
        "comiteSecret": false
      },
      {
        "xsiType": "podjReunion_type",
        "uid": "RUANR5L15S2018IDC427469PT25183",
        "cycleDeVie": {
          "etat": "Confirmé",
          "chrono": {
            "creation": "2017-10-26T00:00:00.000+02:00"
          }
        },
        "objet": "Nomination rapporteur",
        "typePointOdj": "Nomination rapporteur",
        "comiteSecret": false
      }
    ]
  },
  "compteRenduRef": "CRCANR5L15S2018PO59047N010"
}