{
  "uid": "RUANR5L14S2017IDF0096118",
  "timestampDebut": "2017-09-13T18:00:00.000+02:00",
  "timestampFin": "2017-09-13T19:00:00.000+02:00",
  "lieu": {
    "code": "SALREU022",
    "libelleCourt": "Salle 7326",
    "libelleLong": "Salle 7326, 101, rue de l'Université"
  },
  "cycleDeVie": {
    "etat": "Confirmé",
    "chrono": {
      "creation": "2017-09-12T13:05:22.000+02:00"
    }
  },
  "demandeurs": {
    "acteurs": [
      {
        "nom": "Mme Laure DE LA RAUDIÈRE",
        "acteurRef": "PA331567"
      }
    ]
  },
  "typeReunion": "DEP"
}