{
  "uid": "RUANR5L15S2018IDF0104028",
  "timestampDebut": "2018-02-21T11:00:00.000+01:00",
  "timestampFin": "2018-02-21T13:00:00.000+01:00",
  "lieu": {
    "code": "SALREU012",
    "libelleCourt": "Salle N° 23",
    "libelleLong": "Salle N° 23, 3, rue Aristide Briand"
  },
  "cycleDeVie": {
    "etat": "Confirmé",
    "chrono": {
      "creation": "2018-01-19T17:08:14.000+01:00"
    }
  },
  "demandeurs": {
    "acteurs": [
      {
        "nom": "M. Nicolas DUPONT-AIGNAN",
        "acteurRef": "PA1206"
      }
    ]
  },
  "typeReunion": "DEP"
}