{
  "uid": "RUANR5L14S2017IDF0093670",
  "timestampDebut": "2017-09-05T10:30:00.000+02:00",
  "timestampFin": "2017-09-05T13:00:00.000+02:00",
  "lieu": {
    "code": "SALREU026",
    "libelleCourt": "9ème Bureau",
    "libelleLong": "9ème Bureau, Palais Bourbon"
  },
  "cycleDeVie": {
    "etat": "Confirmé",
    "chrono": {
      "creation": "2017-07-07T11:05:15.000+02:00"
    }
  },
  "demandeurs": {
    "organe": {
      "nom": "GROUPE NOUVELLE GAUCHE",
      "organeRef": "PO730946"
    }
  },
  "organeReuniRef": "PO730946",
  "typeReunion": "GP"
}