{
  "uid": "RUANR5L14S2018IDF0101726",
  "timestampDebut": "2017-12-07T10:30:00.000+01:00",
  "timestampFin": "2017-12-07T11:30:00.000+01:00",
  "lieu": {
    "code": "SALREU049",
    "libelleCourt": "Salle 6822",
    "libelleLong": "Salle 6822, Palais Bourbon"
  },
  "cycleDeVie": {
    "etat": "Confirmé",
    "chrono": {
      "creation": "2017-12-01T10:48:46.000+01:00"
    }
  },
  "demandeurs": {
    "acteurs": [
      {
        "nom": "Mme Anne-Laure CATTELOT",
        "acteurRef": "PA720520"
      }
    ]
  },
  "typeReunion": "DEP"
}