{
  "uid": "RUANR5L14S2018IDF0099203",
  "timestampDebut": "2017-10-31T18:00:00.000+01:00",
  "timestampFin": "2017-10-31T20:00:00.000+01:00",
  "lieu": {
    "code": "SALREU003",
    "libelleCourt": "Salle Victor Hugo",
    "libelleLong": "Salle Victor Hugo, 101, rue de l'Université"
  },
  "cycleDeVie": {
    "etat": "Annulé",
    "chrono": {
      "creation": "2017-10-24T16:30:07.000+02:00",
      "cloture": "2017-10-25T11:10:19.000+02:00"
    }
  },
  "demandeurs": {
    "organe": {
      "nom": "GROUPE LA RÉPUBLIQUE EN MARCHE",
      "organeRef": "PO730964"
    }
  },
  "organeReuniRef": "PO730964",
  "typeReunion": "GP"
}