{
  "uid": "RUANR5L14S2017IDF0095390",
  "timestampDebut": "2017-08-31T15:00:00.000+02:00",
  "timestampFin": "2017-08-31T17:00:00.000+02:00",
  "lieu": {
    "code": "SALREU011",
    "libelleCourt": "Salle N° 2",
    "libelleLong": "Salle N° 2, 3, rue Aristide Briand"
  },
  "cycleDeVie": {
    "etat": "Confirmé",
    "chrono": {
      "creation": "2017-08-28T15:00:16.000+02:00"
    }
  },
  "demandeurs": {
    "acteurs": [
      {
        "nom": "M. Sylvain MAILLARD",
        "acteurRef": "PA717379"
      }
    ]
  },
  "typeReunion": "DEP"
}