{
  "uid": "RUANR5L14S2017IDF0093102",
  "timestampDebut": "2017-06-21T15:00:00.000+02:00",
  "timestampFin": "2017-06-21T16:00:00.000+02:00",
  "lieu": {
    "code": "SALREU013",
    "libelleCourt": "Salle N° 3",
    "libelleLong": "Salle N° 3, 3, rue Aristide Briand"
  },
  "cycleDeVie": {
    "etat": "Confirmé",
    "chrono": {
      "creation": "2017-06-21T10:07:13.000+02:00"
    }
  },
  "demandeurs": {
    "acteurs": [
      {
        "nom": "M. Dino CINIERI",
        "acteurRef": "PA267429"
      }
    ]
  },
  "typeReunion": "DEP"
}