{
  "uid": "RUANR5L15S2018IDS20772",
  "timestampDebut": "2017-11-20T16:00:00.000+01:00",
  "timestampFin": "2017-11-20T20:45:00.000+01:00",
  "lieu": {
    "code": "AN",
    "libelleLong": "Assemblée nationale"
  },
  "cycleDeVie": {
    "etat": "Confirmé",
    "chrono": {
      "creation": "2017-10-30T00:00:00.000+01:00"
    }
  },
  "organeReuniRef": "PO717460",
  "sessionRef": "SCR5A2018O1",
  "ouverturePresse": true,
  "odj": {
    "pointsOdj": [
      {
        "xsiType": "podjSeanceConfPres_type",
        "uid": "RUANR5L15S2018IDS20772PT35234",
        "cycleDeVie": {
          "etat": "Confirmé",
          "chrono": {
            "creation": "2017-10-30T00:00:00.000+01:00"
          }
        },
        "objet": "Suite de la discussion du projet de loi de finances pour 2018 (seconde partie)",
        "dossiersLegislatifsRefs": [
          "DLR5L15N35854"
        ],
        "typePointOdj": "Suite de la discussion",
        "comiteSecret": false,
        "natureTravauxOdj": "ODJPR"
      }
    ]
  },
  "compteRenduRef": "CRSANR5L15S2018O1N063",
  "identifiants": {
    "numSeanceJo": "63",
    "idJo": "20180063",
    "quantieme": "Unique",
    "dateSeance": "2017-11-20T01:00:00.000+01:00"
  }
}