{
  "uid": "RUANR5L15S2018IDC427335",
  "timestampDebut": "2017-10-31T16:30:00.000+01:00",
  "lieu": {
    "libelleLong": "salle 4325 (33 rue Saint-Dominique)"
  },
  "cycleDeVie": {
    "etat": "Supprimé",
    "chrono": {
      "creation": "2017-09-28T00:00:00.000+02:00",
      "cloture": "2017-10-13T00:00:00.000+02:00"
    }
  },
  "organeReuniRef": "PO415287",
  "participants": {
    "personnesAuditionnees": [
      {
        "xsiType": "IdActeur_type",
        "uid": "PA906",
        "ident": {
          "civ": "M.",
          "prenom": "Gérard",
          "nom": "Collomb",
          "alpha": "COLLOMB GERARD"
        },
        "dateNais": "1947-06-20T01:00:00.000+01:00"
      }
    ]
  },
  "ouverturePresse": true,
  "odj": {
    "convocationOdj": [
      "Audition conjointe avec la commission des affaires européennes du Sénat et la délégation française au Parlement européen de M. Gérard Collomb, ministre de l’Intérieur, sur les modalités d’élection des membres français du Parlement européen."
    ],
    "resumeOdj": [
      "audition, conjointe avec la commission des affaires européennes du Sénat, de la délégation française au Parlement européen, de M. Gérard Collomb, ministre de l'intérieur, sur les modalités d’élection des membres français du Parlement européen."
    ]
  }
}