{
  "uid": "RUANR5L14S2018IDF0098817",
  "timestampDebut": "2017-10-25T16:00:00.000+02:00",
  "timestampFin": "2017-10-25T18:00:00.000+02:00",
  "lieu": {
    "code": "SALREU046",
    "libelleCourt": "Sully 1",
    "libelleLong": "Sully 1, Palais Bourbon"
  },
  "cycleDeVie": {
    "etat": "Confirmé",
    "chrono": {
      "creation": "2017-10-17T16:46:55.000+02:00"
    }
  },
  "demandeurs": {
    "acteurs": [
      {
        "nom": "Mme Monica MICHEL",
        "acteurRef": "PA719130"
      }
    ]
  },
  "typeReunion": "DEP"
}