{
  "uid": "RUANR5L15S2017IDC427101",
  "timestampDebut": "2017-07-26T09:30:00.000+02:00",
  "timestampFin": "2017-07-26T12:00:00.000+02:00",
  "lieu": {
    "libelleLong": "salle 6238 (Affaires culturelles)"
  },
  "cycleDeVie": {
    "etat": "Confirmé",
    "chrono": {
      "creation": "2017-07-06T00:00:00.000+02:00"
    }
  },
  "organeReuniRef": "PO419604",
  "participants": {
    "participantsInternes": [
      {
        "acteurRef": "PA719146",
        "presence": "présent"
      },
      {
        "acteurRef": "PA721036",
        "presence": "présent"
      },
      {
        "acteurRef": "PA724827",
        "presence": "excusé"
      },
      {
        "acteurRef": "PA720124",
        "presence": "présent"
      },
      {
        "acteurRef": "PA719318",
        "presence": "présent"
      },
      {
        "acteurRef": "PA722190",
        "presence": "présent"
      },
      {
        "acteurRef": "PA720256",
        "presence": "présent"
      },
      {
        "acteurRef": "PA718884",
        "presence": "présent"
      },
      {
        "acteurRef": "PA722046",
        "presence": "présent"
      },
      {
        "acteurRef": "PA719488",
        "presence": "présent"
      },
      {
        "acteurRef": "PA508",
        "presence": "présent"
      },
      {
        "acteurRef": "PA720576",
        "presence": "présent"
      },
      {
        "acteurRef": "PA722030",
        "presence": "présent"
      },
      {
        "acteurRef": "PA223837",
        "presence": "absent"
      },
      {
        "acteurRef": "PA721328",
        "presence": "absent"
      },
      {
        "acteurRef": "PA689",
        "presence": "absent"
      },
      {
        "acteurRef": "PA721750",
        "presence": "présent"
      },
      {
        "acteurRef": "PA721352",
        "presence": "présent"
      },
      {
        "acteurRef": "PA721218",
        "presence": "présent"
      },
      {
        "acteurRef": "PA719170",
        "presence": "présent"
      },
      {
        "acteurRef": "PA702054",
        "presence": "absent"
      },
      {
        "acteurRef": "PA719814",
        "presence": "présent"
      },
      {
        "acteurRef": "PA719118",
        "presence": "absent"
      },
      {
        "acteurRef": "PA720696",
        "presence": "présent"
      },
      {
        "acteurRef": "PA719162",
        "presence": "présent"
      },
      {
        "acteurRef": "PA608826",
        "presence": "présent"
      },
      {
        "acteurRef": "PA721194",
        "presence": "présent"
      },
      {
        "acteurRef": "PA719044",
        "presence": "absent"
      },
      {
        "acteurRef": "PA721896",
        "presence": "présent"
      },
      {
        "acteurRef": "PA720030",
        "presence": "présent"
      },
      {
        "acteurRef": "PA720198",
        "presence": "présent"
      },
      {
        "acteurRef": "PA720178",
        "presence": "présent"
      },
      {
        "acteurRef": "PA267324",
        "presence": "présent"
      },
      {
        "acteurRef": "PA605991",
        "presence": "présent"
      },
      {
        "acteurRef": "PA719108",
        "presence": "présent"
      },
      {
        "acteurRef": "PA721784",
        "presence": "absent"
      },
      {
        "acteurRef": "PA722070",
        "presence": "présent"
      },
      {
        "acteurRef": "PA718794",
        "presence": "absent"
      },
      {
        "acteurRef": "PA332614",
        "presence": "absent"
      },
      {
        "acteurRef": "PA719230",
        "presence": "présent"
      },
      {
        "acteurRef": "PA721506",
        "presence": "présent"
      },
      {
        "acteurRef": "PA643205",
        "presence": "présent"
      },
      {
        "acteurRef": "PA718868",
        "presence": "présent"
      },
      {
        "acteurRef": "PA719728",
        "presence": "absent"
      },
      {
        "acteurRef": "PA345722",
        "presence": "présent"
      },
      {
        "acteurRef": "PA720446",
        "presence": "présent"
      },
      {
        "acteurRef": "PA720988",
        "presence": "excusé"
      },
      {
        "acteurRef": "PA719640",
        "presence": "présent"
      },
      {
        "acteurRef": "PA719272",
        "presence": "présent"
      },
      {
        "acteurRef": "PA720630",
        "presence": "présent"
      },
      {
        "acteurRef": "PA719456",
        "presence": "présent"
      },
      {
        "acteurRef": "PA719364",
        "presence": "absent"
      },
      {
        "acteurRef": "PA335532",
        "presence": "présent"
      },
      {
        "acteurRef": "PA719946",
        "presence": "absent"
      },
      {
        "acteurRef": "PA721234",
        "presence": "présent"
      },
      {
        "acteurRef": "PA721844",
        "presence": "présent"
      },
      {
        "acteurRef": "PA718944",
        "presence": "présent"
      },
      {
        "acteurRef": "PA721888",
        "presence": "présent"
      },
      {
        "acteurRef": "PA266776",
        "presence": "présent"
      },
      {
        "acteurRef": "PA335758",
        "presence": "excusé"
      },
      {
        "acteurRef": "PA720900",
        "presence": "absent"
      },
      {
        "acteurRef": "PA720066",
        "presence": "présent"
      },
      {
        "acteurRef": "PA722252",
        "presence": "présent"
      },
      {
        "acteurRef": "PA718902",
        "presence": "présent"
      },
      {
        "acteurRef": "PA721226",
        "presence": "présent"
      },
      {
        "acteurRef": "PA346876",
        "presence": "excusé"
      },
      {
        "acteurRef": "PA720190",
        "presence": "présent"
      },
      {
        "acteurRef": "PA720754",
        "presence": "présent"
      },
      {
        "acteurRef": "PA720854",
        "presence": "excusé"
      },
      {
        "acteurRef": "PA720568",
        "presence": "présent"
      },
      {
        "acteurRef": "PA606639",
        "presence": "excusé"
      }
    ],
    "personnesAuditionnees": [
      {
        "xsiType": "IdPersonneExterne_type",
        "uid": "PE1755",
        "ident": {
          "civ": "M.",
          "prenom": "Mathieu",
          "nom": "Gallet"
        },
        "dateNais": "1977-01-08T01:00:00.000+01:00"
      }
    ]
  },
  "ouverturePresse": true,
  "odj": {
    "convocationOdj": [
      "Désignation des rapporteurs pour avis sur le projet de loi de finances pour 2018",
      "Audition de M. Mathieu Gallet, Président de Radio France, sur l'exécution du contrat d'objectifs et de moyens de la société en 2016"
    ],
    "resumeOdj": [
      "audition de M. Mathieu Gallet, Président de Radio France, sur l'exécution du contrat d'objectifs et de moyens de la société en 2016 ;",
      "nomination rapporteurs pour avis."
    ],
    "pointsOdj": [
      {
        "xsiType": "podjReunion_type",
        "uid": "RUANR5L15S2017IDC427101PT25096",
        "cycleDeVie": {
          "etat": "Confirmé",
          "chrono": {
            "creation": "2017-10-09T00:00:00.000+02:00"
          }
        },
        "objet": "Nomination rapporteurs pour avis",
        "dossiersLegislatifsRefs": [
          "DLR5L15N35854"
        ],
        "typePointOdj": "Nomination rapporteur pour avis",
        "comiteSecret": false
      }
    ]
  },
  "compteRenduRef": "CRCANR5L15S2017PO419604N007"
}