{
  "uid": "RUANR5L14S2017IDF0095128",
  "timestampDebut": "2017-09-08T10:00:00.000+02:00",
  "timestampFin": "2017-09-08T11:30:00.000+02:00",
  "lieu": {
    "code": "SALREU048",
    "libelleCourt": "Salle 6809",
    "libelleLong": "Salle 6809, Palais Bourbon"
  },
  "cycleDeVie": {
    "etat": "Confirmé",
    "chrono": {
      "creation": "2017-08-03T11:52:14.000+02:00"
    }
  },
  "demandeurs": {
    "acteurs": [
      {
        "nom": "M. Laurent SAINT-MARTIN",
        "acteurRef": "PA720878"
      }
    ]
  },
  "typeReunion": "DEP"
}