{
  "uid": "RUANR5L14S2018IDF0101926",
  "timestampDebut": "2017-12-06T16:00:00.000+01:00",
  "timestampFin": "2017-12-06T17:15:00.000+01:00",
  "lieu": {
    "code": "SALREU041",
    "libelleCourt": "Sully 5",
    "libelleLong": "Sully 5, Palais Bourbon"
  },
  "cycleDeVie": {
    "etat": "Confirmé",
    "chrono": {
      "creation": "2017-12-06T10:21:42.000+01:00"
    }
  },
  "demandeurs": {
    "acteurs": [
      {
        "nom": "M. Gabriel ATTAL",
        "acteurRef": "PA722190"
      }
    ]
  },
  "typeReunion": "DEP"
}