{
  "uid": "RUANR5L15S2018IDS20777",
  "timestampDebut": "2017-11-22T21:30:00.000+01:00",
  "timestampFin": "2017-11-23T00:55:00.000+01:00",
  "lieu": {
    "code": "AN",
    "libelleLong": "Assemblée nationale"
  },
  "cycleDeVie": {
    "etat": "Confirmé",
    "chrono": {
      "creation": "2017-10-30T00:00:00.000+01:00"
    }
  },
  "organeReuniRef": "PO717460",
  "sessionRef": "SCR5A2018O1",
  "ouverturePresse": true,
  "odj": {
    "pointsOdj": [
      {
        "xsiType": "podjSeanceConfPres_type",
        "uid": "RUANR5L15S2018IDS20777PT35241",
        "cycleDeVie": {
          "etat": "Confirmé",
          "chrono": {
            "creation": "2017-10-30T00:00:00.000+01:00"
          }
        },
        "objet": "Suite de la discussion du projet de loi ratifiant diverses ordonnances prises sur le fondement de la loi n° 2017-1340 du 15 septembre 2017 d'habilitation à prendre les mesures pour le renforcement du dialogue social",
        "dossiersLegislatifsRefs": [
          "DLR5L15N35986"
        ],
        "typePointOdj": "Suite de la discussion",
        "comiteSecret": false,
        "natureTravauxOdj": "ODJPR"
      }
    ]
  },
  "compteRenduRef": "CRSANR5L15S2018O1N067",
  "identifiants": {
    "numSeanceJo": "67",
    "idJo": "20180067",
    "quantieme": "Deuxième",
    "dateSeance": "2017-11-22T01:00:00.000+01:00"
  }
}