{
  "uid": "RUANR5L15S2018IDF0103694",
  "timestampDebut": "2018-02-01T09:00:00.000+01:00",
  "timestampFin": "2018-02-01T10:00:00.000+01:00",
  "lieu": {
    "code": "SALREU048",
    "libelleCourt": "Salle 6809",
    "libelleLong": "Salle 6809, Palais Bourbon"
  },
  "cycleDeVie": {
    "etat": "Confirmé",
    "chrono": {
      "creation": "2018-01-16T19:28:15.000+01:00"
    }
  },
  "demandeurs": {
    "acteurs": [
      {
        "nom": "M. Jacques MAIRE",
        "acteurRef": "PA722178"
      },
      {
        "nom": "M. Sylvain WASERMAN",
        "acteurRef": "PA720746"
      }
    ]
  },
  "typeReunion": "DEP"
}