{
  "uid": "RUANR5L14S2017IDF0096948",
  "timestampDebut": "2017-09-30T08:30:00.000+02:00",
  "timestampFin": "2017-09-30T12:00:00.000+02:00",
  "lieu": {
    "code": "SALREU029",
    "libelleCourt": "Salon Mars III",
    "libelleLong": "Salon Mars III, 101, rue de l'Université"
  },
  "cycleDeVie": {
    "etat": "Confirmé",
    "chrono": {
      "creation": "2017-09-25T12:29:26.000+02:00"
    }
  },
  "demandeurs": {
    "acteurs": [
      {
        "nom": "M. Stéphane LE FOLL",
        "acteurRef": "PA588886"
      }
    ]
  },
  "typeReunion": "DEP"
}