{
  "uid": "RUANR5L15S2018IDF0106613",
  "timestampDebut": "2018-03-13T09:00:00.000+01:00",
  "timestampFin": "2018-03-13T11:00:00.000+01:00",
  "lieu": {
    "code": "SALREU016",
    "libelleCourt": "Salon Gabriel",
    "libelleLong": "Salon Gabriel, 101, rue de l'Université"
  },
  "cycleDeVie": {
    "etat": "Confirmé",
    "chrono": {
      "creation": "2018-02-26T14:20:21.000+01:00"
    }
  },
  "demandeurs": {
    "acteurs": [
      {
        "nom": "Mme Bénédicte PEYROL",
        "acteurRef": "PA718736"
      }
    ]
  },
  "typeReunion": "DEP"
}