{
  "uid": "RUANR5L14S2018IDF0099820",
  "timestampDebut": "2017-11-22T17:00:00.000+01:00",
  "timestampFin": "2017-11-22T18:00:00.000+01:00",
  "lieu": {
    "code": "SALREU018",
    "libelleCourt": "Salon Mansart",
    "libelleLong": "Salon Mansart, 101, rue de l'Université"
  },
  "cycleDeVie": {
    "etat": "Confirmé",
    "chrono": {
      "creation": "2017-11-06T17:11:29.000+01:00"
    }
  },
  "demandeurs": {
    "acteurs": [
      {
        "nom": "M. Mohamed LAQHILA",
        "acteurRef": "PA718978"
      }
    ]
  },
  "typeReunion": "DEP"
}