{
  "uid": "RUANR5L15S2018IDS20713",
  "timestampDebut": "2017-10-27T09:30:00.000+02:00",
  "timestampFin": "2017-10-27T13:25:00.000+02:00",
  "lieu": {
    "code": "AN",
    "libelleLong": "Assemblée nationale"
  },
  "cycleDeVie": {
    "etat": "Confirmé",
    "chrono": {
      "creation": "2017-09-29T00:00:00.000+02:00"
    }
  },
  "organeReuniRef": "PO717460",
  "sessionRef": "SCR5A2018O1",
  "ouverturePresse": true,
  "odj": {
    "pointsOdj": [
      {
        "xsiType": "podjSeanceConfPres_type",
        "uid": "RUANR5L15S2018IDS20713PT35152",
        "cycleDeVie": {
          "etat": "Confirmé",
          "chrono": {
            "creation": "2017-09-29T00:00:00.000+02:00"
          }
        },
        "objet": "Suite de la discussion du projet de loi de financement de la sécurité sociale pour 2018",
        "dossiersLegislatifsRefs": [
          "DLR5L15N36030"
        ],
        "typePointOdj": "Suite de la discussion",
        "comiteSecret": false,
        "natureTravauxOdj": "ODJPR"
      }
    ]
  },
  "compteRenduRef": "CRSANR5L15S2018O1N031",
  "identifiants": {
    "numSeanceJo": "31",
    "idJo": "20180031",
    "quantieme": "Première",
    "dateSeance": "2017-10-27T02:00:00.000+02:00"
  }
}