{
  "uid": "RUANR5L14S2018IDF0096797",
  "timestampDebut": "2017-10-04T09:30:00.000+02:00",
  "timestampFin": "2017-10-04T12:30:00.000+02:00",
  "lieu": {
    "code": "SALREU008",
    "libelleCourt": "5ème Bureau",
    "libelleLong": "5ème Bureau, Palais Bourbon"
  },
  "cycleDeVie": {
    "etat": "Confirmé",
    "chrono": {
      "creation": "2017-09-21T16:11:14.000+02:00"
    }
  },
  "demandeurs": {
    "acteurs": [
      {
        "nom": "M. Bruno QUESTEL",
        "acteurRef": "PA643127"
      }
    ]
  },
  "typeReunion": "DEP"
}