{
  "uid": "RUANR5L15S2018IDF0103787",
  "timestampDebut": "2018-01-23T16:00:00.000+01:00",
  "timestampFin": "2018-01-23T17:30:00.000+01:00",
  "lieu": {
    "code": "SALREU045",
    "libelleCourt": "Sully 3",
    "libelleLong": "Sully 3, Palais Bourbon"
  },
  "cycleDeVie": {
    "etat": "Confirmé",
    "chrono": {
      "creation": "2018-01-17T11:23:56.000+01:00"
    }
  },
  "demandeurs": {
    "acteurs": [
      {
        "nom": "M. Guillaume PELTIER",
        "acteurRef": "PA719946"
      }
    ]
  },
  "typeReunion": "DEP"
}