{
  "uid": "RUANR5L14S2018IDF0098096",
  "timestampDebut": "2017-10-24T17:00:00.000+02:00",
  "timestampFin": "2017-10-24T18:30:00.000+02:00",
  "lieu": {
    "code": "SALREU019",
    "libelleCourt": "Salon Mars I",
    "libelleLong": "Salon Mars I, 101, rue de l'Université"
  },
  "cycleDeVie": {
    "etat": "Confirmé",
    "chrono": {
      "creation": "2017-10-05T17:12:40.000+02:00"
    }
  },
  "demandeurs": {
    "acteurs": [
      {
        "nom": "M. Paul MOLAC",
        "acteurRef": "PA607619"
      }
    ]
  },
  "typeReunion": "DEP"
}