{
  "uid": "RUANR5L14S2018IDF0096444",
  "timestampDebut": "2017-10-05T14:30:00.000+02:00",
  "timestampFin": "2017-10-05T15:30:00.000+02:00",
  "lieu": {
    "code": "SALREU016",
    "libelleCourt": "Salon Gabriel",
    "libelleLong": "Salon Gabriel, 101, rue de l'Université"
  },
  "cycleDeVie": {
    "etat": "Confirmé",
    "chrono": {
      "creation": "2017-09-15T16:07:04.000+02:00"
    }
  },
  "demandeurs": {
    "acteurs": [
      {
        "nom": "M. François JOLIVET",
        "acteurRef": "PA719778"
      }
    ]
  },
  "typeReunion": "DEP"
}