{
  "uid": "RUANR5L15S2018IDC427685",
  "timestampDebut": "2017-11-09T17:15:00.000+01:00",
  "timestampFin": "2017-11-09T17:40:00.000+01:00",
  "lieu": {
    "libelleLong": "salle Lamartine"
  },
  "cycleDeVie": {
    "etat": "Confirmé",
    "chrono": {
      "creation": "2017-10-27T00:00:00.000+02:00"
    }
  },
  "organeReuniRef": "PO59051",
  "participants": {
    "participantsInternes": [
      {
        "acteurRef": "PA719866",
        "presence": "présent"
      },
      {
        "acteurRef": "PA721624",
        "presence": "absent"
      },
      {
        "acteurRef": "PA719558",
        "presence": "absent"
      },
      {
        "acteurRef": "PA441",
        "presence": "excusé"
      },
      {
        "acteurRef": "PA720430",
        "presence": "absent"
      },
      {
        "acteurRef": "PA606507",
        "presence": "présent"
      },
      {
        "acteurRef": "PA721908",
        "presence": "présent"
      },
      {
        "acteurRef": "PA330008",
        "presence": "absent"
      },
      {
        "acteurRef": "PA720772",
        "presence": "absent"
      },
      {
        "acteurRef": "PA719748",
        "presence": "absent"
      },
      {
        "acteurRef": "PA330240",
        "presence": "absent"
      },
      {
        "acteurRef": "PA336439",
        "presence": "absent"
      },
      {
        "acteurRef": "PA606212",
        "presence": "excusé"
      },
      {
        "acteurRef": "PA721398",
        "presence": "absent"
      },
      {
        "acteurRef": "PA267440",
        "presence": "absent"
      },
      {
        "acteurRef": "PA719684",
        "presence": "absent"
      },
      {
        "acteurRef": "PA720154",
        "presence": "absent"
      },
      {
        "acteurRef": "PA721094",
        "presence": "excusé"
      },
      {
        "acteurRef": "PA330357",
        "presence": "présent"
      },
      {
        "acteurRef": "PA719616",
        "presence": "absent"
      },
      {
        "acteurRef": "PA721564",
        "presence": "présent"
      },
      {
        "acteurRef": "PA721702",
        "presence": "absent"
      },
      {
        "acteurRef": "PA721742",
        "presence": "absent"
      },
      {
        "acteurRef": "PA721142",
        "presence": "excusé"
      },
      {
        "acteurRef": "PA721364",
        "presence": "présent"
      },
      {
        "acteurRef": "PA266797",
        "presence": "absent"
      },
      {
        "acteurRef": "PA721880",
        "presence": "présent"
      },
      {
        "acteurRef": "PA1592",
        "presence": "absent"
      },
      {
        "acteurRef": "PA720454",
        "presence": "absent"
      },
      {
        "acteurRef": "PA722150",
        "presence": "excusé"
      },
      {
        "acteurRef": "PA267200",
        "presence": "absent"
      },
      {
        "acteurRef": "PA719874",
        "presence": "présent"
      },
      {
        "acteurRef": "PA267901",
        "presence": "excusé"
      },
      {
        "acteurRef": "PA719994",
        "presence": "présent"
      },
      {
        "acteurRef": "PA335054",
        "presence": "absent"
      },
      {
        "acteurRef": "PA267785",
        "presence": "présent"
      },
      {
        "acteurRef": "PA721984",
        "presence": "présent"
      },
      {
        "acteurRef": "PA721932",
        "presence": "absent"
      },
      {
        "acteurRef": "PA718918",
        "presence": "absent"
      },
      {
        "acteurRef": "PA606098",
        "presence": "absent"
      },
      {
        "acteurRef": "PA346218",
        "presence": "absent"
      },
      {
        "acteurRef": "PA721800",
        "presence": "absent"
      },
      {
        "acteurRef": "PA677483",
        "presence": "absent"
      },
      {
        "acteurRef": "PA719952",
        "presence": "absent"
      },
      {
        "acteurRef": "PA607619",
        "presence": "présent"
      },
      {
        "acteurRef": "PA266788",
        "presence": "présent"
      },
      {
        "acteurRef": "PA720908",
        "presence": "présent"
      },
      {
        "acteurRef": "PA721960",
        "presence": "absent"
      },
      {
        "acteurRef": "PA720402",
        "presence": "présent"
      },
      {
        "acteurRef": "PA719202",
        "presence": "absent"
      },
      {
        "acteurRef": "PA721270",
        "presence": "absent"
      },
      {
        "acteurRef": "PA2449",
        "presence": "absent"
      },
      {
        "acteurRef": "PA719600",
        "presence": "absent"
      },
      {
        "acteurRef": "PA720100",
        "presence": "présent"
      },
      {
        "acteurRef": "PA643127",
        "presence": "absent"
      },
      {
        "acteurRef": "PA722398",
        "presence": "présent"
      },
      {
        "acteurRef": "PA721678",
        "presence": "absent"
      },
      {
        "acteurRef": "PA722292",
        "presence": "présent"
      },
      {
        "acteurRef": "PA332747",
        "presence": "excusé"
      },
      {
        "acteurRef": "PA721616",
        "presence": "présent"
      },
      {
        "acteurRef": "PA702052",
        "presence": "excusé"
      },
      {
        "acteurRef": "PA721314",
        "presence": "absent"
      },
      {
        "acteurRef": "PA721584",
        "presence": "absent"
      },
      {
        "acteurRef": "PA719302",
        "presence": "absent"
      },
      {
        "acteurRef": "PA2828",
        "presence": "absent"
      },
      {
        "acteurRef": "PA608695",
        "presence": "absent"
      },
      {
        "acteurRef": "PA267622",
        "presence": "absent"
      },
      {
        "acteurRef": "PA709315",
        "presence": "absent"
      },
      {
        "acteurRef": "PA720704",
        "presence": "absent"
      },
      {
        "acteurRef": "PA722260",
        "presence": "absent"
      },
      {
        "acteurRef": "PA721262",
        "presence": "présent"
      },
      {
        "acteurRef": "PA2952",
        "presence": "absent"
      },
      {
        "acteurRef": "PA720318",
        "presence": "absent"
      },
      {
        "acteurRef": "PA267330",
        "presence": "absent"
      }
    ]
  },
  "ouverturePresse": false,
  "odj": {
    "convocationOdj": [
      "A l'issue de la commission élargie, vote sur les crédits de la mission « Relations avec les collectivités territoriales » (M. Paul Molac, rapporteur pour avis) et avis sur ces crédits."
    ],
    "resumeOdj": [
      "à l'issue de la commission élargie, vote sur les crédits de la mission « Relations avec les collectivités territoriales »"
    ],
    "pointsOdj": [
      {
        "xsiType": "podjReunion_type",
        "uid": "RUANR5L15S2018IDC427685PT25187",
        "cycleDeVie": {
          "etat": "Confirmé",
          "chrono": {
            "creation": "2017-11-02T00:00:00.000+01:00"
          }
        },
        "objet": "A l'issue de la commission élargie, vote sur les crédits de la mission « Relations avec les collectivités territoriales »",
        "dossiersLegislatifsRefs": [
          "DLR5L15N35854"
        ],
        "typePointOdj": "Examen",
        "comiteSecret": false
      }
    ]
  },
  "compteRenduRef": "CRCANR5L15S2018PO59051N013"
}