{
  "uid": "RUANR5L14S2018IDF0099491",
  "timestampDebut": "2017-11-14T12:30:00.000+01:00",
  "timestampFin": "2017-11-14T13:45:00.000+01:00",
  "lieu": {
    "code": "SALREU017",
    "libelleCourt": "Salon Visconti",
    "libelleLong": "Salon Visconti, 101, rue de l'Université"
  },
  "cycleDeVie": {
    "etat": "Confirmé",
    "chrono": {
      "creation": "2017-10-30T17:15:58.000+01:00"
    }
  },
  "demandeurs": {
    "acteurs": [
      {
        "nom": "M. Daniel FASQUELLE",
        "acteurRef": "PA334149"
      }
    ]
  },
  "typeReunion": "DEP"
}