{
  "uid": "RUANR5L14S2018IDF0100743",
  "timestampDebut": "2017-11-29T11:00:00.000+01:00",
  "timestampFin": "2017-11-29T12:00:00.000+01:00",
  "lieu": {
    "code": "SALREU028",
    "libelleCourt": "Salle Colbert",
    "libelleLong": "Salle Colbert , Palais Bourbon"
  },
  "cycleDeVie": {
    "etat": "Annulé",
    "chrono": {
      "creation": "2017-11-15T20:13:46.000+01:00",
      "cloture": "2017-11-27T13:57:36.000+01:00"
    }
  },
  "demandeurs": {
    "organe": {
      "nom": "GROUPE LA RÉPUBLIQUE EN MARCHE",
      "organeRef": "PO730964"
    }
  },
  "organeReuniRef": "PO730964",
  "typeReunion": "GP"
}