{
  "uid": "RUANR5L15S2017IDS20627",
  "timestampDebut": "2017-07-25T15:00:00.000+02:00",
  "timestampFin": "2017-07-25T20:15:00.000+02:00",
  "lieu": {
    "code": "AN",
    "libelleLong": "Assemblée nationale"
  },
  "cycleDeVie": {
    "etat": "Confirmé",
    "chrono": {
      "creation": "2017-06-28T00:00:00.000+02:00"
    }
  },
  "organeReuniRef": "PO717460",
  "sessionRef": "SCR5A2017E1",
  "ouverturePresse": true,
  "odj": {
    "pointsOdj": [
      {
        "xsiType": "podjSeanceConfPres_type",
        "uid": "RUANR5L15S2017IDS20627PT34950",
        "cycleDeVie": {
          "etat": "Supprimé",
          "chrono": {
            "creation": "2017-06-28T00:00:00.000+02:00",
            "cloture": "2017-07-24T00:00:00.000+02:00"
          }
        },
        "objet": "Éventuellement, discussion, soit sur le rapport de la commission mixte paritaire, soit en nouvelle lecture, du projet de loi de règlement du budget et d’approbation des comptes de l'année 2016",
        "typePointOdj": "Discussion",
        "comiteSecret": false,
        "natureTravauxOdj": "ODJPR",
        "dateConfPres": "2017-07-25T02:00:00.000+02:00"
      },
      {
        "xsiType": "podjSeanceConfPres_type",
        "uid": "RUANR5L15S2017IDS20627PT35029",
        "cycleDeVie": {
          "etat": "Confirmé",
          "chrono": {
            "creation": "2017-07-19T00:00:00.000+02:00"
          }
        },
        "objet": "Suite de la discussion du projet de loi, adopté par le Sénat après engagement de la procédure accélérée, pour la confiance dans la vie publique",
        "dossiersLegislatifsRefs": [
          "DLR5L14N35825"
        ],
        "typePointOdj": "Suite de la discussion",
        "comiteSecret": false,
        "natureTravauxOdj": "ODJPR",
        "dateConfPres": "2017-07-25T02:00:00.000+02:00"
      },
      {
        "xsiType": "podjSeanceConfPres_type",
        "uid": "RUANR5L15S2017IDS20627PT34951",
        "cycleDeVie": {
          "etat": "Supprimé",
          "chrono": {
            "creation": "2017-06-28T00:00:00.000+02:00",
            "cloture": "2017-07-19T00:00:00.000+02:00"
          }
        },
        "objet": "Suite de la discussion du projet de loi, adopté par le Sénat après engagement de la procédure accélérée, pour la régulation de la vie publique",
        "typePointOdj": "Suite de la discussion",
        "comiteSecret": false,
        "natureTravauxOdj": "ODJPR"
      },
      {
        "xsiType": "podjSeanceConfPres_type",
        "uid": "RUANR5L15S2017IDS20627PT35030",
        "cycleDeVie": {
          "etat": "Confirmé",
          "chrono": {
            "creation": "2017-07-19T00:00:00.000+02:00"
          }
        },
        "objet": "Suite de la discussion du projet de loi organique, adopté par le Sénat après engagement de la procédure accélérée, pour la confiance dans la vie publique",
        "typePointOdj": "Suite de la discussion",
        "comiteSecret": false,
        "natureTravauxOdj": "ODJPR"
      },
      {
        "xsiType": "podjSeanceConfPres_type",
        "uid": "RUANR5L15S2017IDS20627PT34952",
        "cycleDeVie": {
          "etat": "Supprimé",
          "chrono": {
            "creation": "2017-06-28T00:00:00.000+02:00",
            "cloture": "2017-07-19T00:00:00.000+02:00"
          }
        },
        "objet": "Suite de la discussion du projet de loi organique, adopté par le Sénat après engagement de la procédure accélérée, pour la régulation de la vie publique",
        "typePointOdj": "Suite de la discussion",
        "comiteSecret": false,
        "natureTravauxOdj": "ODJPR"
      }
    ]
  },
  "compteRenduRef": "CRSANR5L15S2017E1N019",
  "identifiants": {
    "numSeanceJo": "19",
    "idJo": "20171019",
    "quantieme": "Première",
    "dateSeance": "2017-07-25T02:00:00.000+02:00"
  }
}