{
  "uid": "RUANR5L15S2018IDF0106305",
  "timestampDebut": "2018-03-06T09:30:00.000+01:00",
  "timestampFin": "2018-03-06T10:30:00.000+01:00",
  "lieu": {
    "code": "SALREU023",
    "libelleCourt": "Salle 7426",
    "libelleLong": "Salle 7426, 101, rue de l'Université"
  },
  "cycleDeVie": {
    "etat": "Confirmé",
    "chrono": {
      "creation": "2018-02-21T12:01:49.000+01:00"
    }
  },
  "demandeurs": {
    "acteurs": [
      {
        "nom": "M. Pacôme RUPIN",
        "acteurRef": "PA721616"
      }
    ]
  },
  "typeReunion": "DEP"
}