{
  "uid": "RUANR5L15S2018IDS20765",
  "timestampDebut": "2017-11-17T09:30:00.000+01:00",
  "timestampFin": "2017-11-17T12:55:00.000+01:00",
  "lieu": {
    "code": "AN",
    "libelleLong": "Assemblée nationale"
  },
  "cycleDeVie": {
    "etat": "Confirmé",
    "chrono": {
      "creation": "2017-10-18T00:00:00.000+02:00"
    }
  },
  "organeReuniRef": "PO717460",
  "sessionRef": "SCR5A2018O1",
  "ouverturePresse": true,
  "odj": {
    "pointsOdj": [
      {
        "xsiType": "podjSeanceConfPres_type",
        "uid": "RUANR5L15S2018IDS20765PT35224",
        "cycleDeVie": {
          "etat": "Confirmé",
          "chrono": {
            "creation": "2017-10-18T00:00:00.000+02:00"
          }
        },
        "objet": "Suite de la discussion du projet de loi de finances pour 2018 (seconde partie)",
        "dossiersLegislatifsRefs": [
          "DLR5L15N35854"
        ],
        "typePointOdj": "Suite de la discussion",
        "comiteSecret": false,
        "natureTravauxOdj": "ODJPR"
      }
    ]
  },
  "compteRenduRef": "CRSANR5L15S2018O1N060",
  "identifiants": {
    "numSeanceJo": "60",
    "idJo": "20180060",
    "quantieme": "Première",
    "dateSeance": "2017-11-17T01:00:00.000+01:00"
  }
}