{
  "uid": "RUANR5L15S2018IDF0105268",
  "timestampDebut": "2018-03-22T09:30:00.000+01:00",
  "timestampFin": "2018-03-22T13:00:00.000+01:00",
  "lieu": {
    "code": "SALREU011",
    "libelleCourt": "Salle N° 2",
    "libelleLong": "Salle N° 2, 3, rue Aristide Briand"
  },
  "cycleDeVie": {
    "etat": "Confirmé",
    "chrono": {
      "creation": "2018-02-07T10:58:13.000+01:00"
    }
  },
  "demandeurs": {
    "acteurs": [
      {
        "nom": "Mme Frédérique DUMAS",
        "acteurRef": "PA721194"
      }
    ]
  },
  "typeReunion": "DEP"
}