{
  "uid": "RUANR5L14S2017IDF0096057",
  "timestampDebut": "2017-09-28T08:00:00.000+02:00",
  "timestampFin": "2017-09-28T10:30:00.000+02:00",
  "lieu": {
    "code": "SALREU039",
    "libelleCourt": "Salle 6550",
    "libelleLong": "Salle 6550, Palais Bourbon"
  },
  "cycleDeVie": {
    "etat": "Confirmé",
    "chrono": {
      "creation": "2017-09-11T17:48:18.000+02:00"
    }
  },
  "demandeurs": {
    "acteurs": [
      {
        "nom": "M. Vincent LEDOUX",
        "acteurRef": "PA712014"
      }
    ]
  },
  "typeReunion": "DEP"
}