{
  "uid": "RUANR5L14S2018IDF0098387",
  "timestampDebut": "2017-10-18T17:00:00.000+02:00",
  "timestampFin": "2017-10-18T18:30:00.000+02:00",
  "lieu": {
    "code": "SALREU021",
    "libelleCourt": "Salle 7207",
    "libelleLong": "Salle 7207, 101, rue de l'Université"
  },
  "cycleDeVie": {
    "etat": "Confirmé",
    "chrono": {
      "creation": "2017-10-11T10:52:58.000+02:00"
    }
  },
  "demandeurs": {
    "acteurs": [
      {
        "nom": "M. Damien PICHEREAU",
        "acteurRef": "PA721372"
      }
    ]
  },
  "typeReunion": "DEP"
}