{
  "uid": "RUANR5L14S2018IDF0101575",
  "timestampDebut": "2017-12-05T14:15:00.000+01:00",
  "timestampFin": "2017-12-05T14:45:00.000+01:00",
  "lieu": {
    "code": "SALREU013",
    "libelleCourt": "Salle N° 3",
    "libelleLong": "Salle N° 3, 3, rue Aristide Briand"
  },
  "cycleDeVie": {
    "etat": "Confirmé",
    "chrono": {
      "creation": "2017-11-29T11:51:39.000+01:00"
    }
  },
  "demandeurs": {
    "acteurs": [
      {
        "nom": "Mme Cécile UNTERMAIER",
        "acteurRef": "PA608695"
      }
    ]
  },
  "typeReunion": "DEP"
}