{
  "uid": "RUANR5L15S2018IDC428689",
  "timestampDebut": "2018-04-04T16:15:00.000+02:00",
  "lieu": {
    "libelleLong": "Salle de la commission"
  },
  "cycleDeVie": {
    "etat": "Eventuel",
    "chrono": {
      "creation": "2018-02-23T00:00:00.000+01:00"
    }
  },
  "organeReuniRef": "PO742273",
  "participants": {},
  "ouverturePresse": false,
  "odj": {
    "convocationOdj": [
      "– Présentation des résultats des enquêtes de terrain."
    ],
    "resumeOdj": [
      "présentation des résultats des enquêtes de terrain."
    ]
  }
}