{
  "uid": "RUANR5L14S2018IDF0101413",
  "timestampDebut": "2017-11-28T14:30:00.000+01:00",
  "timestampFin": "2017-11-28T15:30:00.000+01:00",
  "lieu": {
    "code": "SALREU004",
    "libelleCourt": "1er Bureau",
    "libelleLong": "1er Bureau, Palais Bourbon"
  },
  "cycleDeVie": {
    "etat": "Confirmé",
    "chrono": {
      "creation": "2017-11-27T11:56:10.000+01:00"
    }
  },
  "demandeurs": {
    "acteurs": [
      {
        "nom": "Mme Catherine KAMOWSKI",
        "acteurRef": "PA719994"
      }
    ]
  },
  "typeReunion": "DEP"
}