{
  "uid": "RUANR5L15S2018IDC427463",
  "timestampDebut": "2017-11-28T16:30:00.000+01:00",
  "lieu": {
    "libelleLong": "salle de la commission"
  },
  "cycleDeVie": {
    "etat": "Supprimé",
    "chrono": {
      "creation": "2017-10-05T00:00:00.000+02:00",
      "cloture": "2017-11-09T00:00:00.000+01:00"
    }
  },
  "organeReuniRef": "PO59047",
  "participants": {},
  "ouverturePresse": false,
  "odj": {
    "convocationOdj": [
      "– Audition, à huis clos, de Mme Florence Parly, ministre des Armées."
    ],
    "resumeOdj": [
      "audition, à huis clos, de Mme Florence Parly, ministre des armées."
    ]
  }
}