{
  "uid": "RUANR5L15S2018IDC428528",
  "timestampDebut": "2018-03-08T10:00:00.000+01:00",
  "lieu": {
    "libelleLong": "salle 6237 (Développement durable)"
  },
  "cycleDeVie": {
    "etat": "Annulé",
    "chrono": {
      "creation": "2018-02-08T00:00:00.000+01:00",
      "cloture": "2018-02-23T00:00:00.000+01:00"
    }
  },
  "organeReuniRef": "PO748336",
  "participants": {},
  "ouverturePresse": true,
  "odj": {
    "convocationOdj": [
      "– Audition de Roland Desbordes, président de la Commission de recherche et d’information indépendantes sur la radioactivité (CRIIRAD) ;"
    ],
    "resumeOdj": [
      "audition de Roland Desbordes, président de la Commission de recherche et d’information indépendantes sur la radioactivité (CRIIRAD)."
    ]
  }
}