{
  "uid": "RUANR5L14S2017IDF0093892",
  "timestampDebut": "2017-08-01T10:30:00.000+02:00",
  "timestampFin": "2017-08-01T12:15:00.000+02:00",
  "lieu": {
    "code": "SALREU004",
    "libelleCourt": "1er Bureau",
    "libelleLong": "1er Bureau, Palais Bourbon"
  },
  "cycleDeVie": {
    "etat": "Confirmé",
    "chrono": {
      "creation": "2017-07-12T15:54:02.000+02:00"
    }
  },
  "demandeurs": {
    "organe": {
      "nom": "GROUPE LES CONSTRUCTIFS : RÉPUBLICAINS, UDI, INDÉPENDANTS",
      "organeRef": "PO730952"
    }
  },
  "organeReuniRef": "PO730952",
  "typeReunion": "GP"
}