{
  "uid": "RUANR5L14S2018IDF0096751",
  "timestampDebut": "2017-10-03T16:00:00.000+02:00",
  "timestampFin": "2017-10-03T16:45:00.000+02:00",
  "lieu": {
    "code": "SALREU007",
    "libelleCourt": "4ème Bureau",
    "libelleLong": "4ème Bureau, Palais Bourbon"
  },
  "cycleDeVie": {
    "etat": "Confirmé",
    "chrono": {
      "creation": "2017-09-21T09:37:42.000+02:00"
    }
  },
  "demandeurs": {
    "acteurs": [
      {
        "nom": "M. Éric ALAUZET",
        "acteurRef": "PA605963"
      }
    ]
  },
  "typeReunion": "DEP"
}