{
  "uid": "RUANR5L14S2018IDF0102457",
  "timestampDebut": "2017-12-20T10:00:00.000+01:00",
  "timestampFin": "2017-12-20T11:00:00.000+01:00",
  "lieu": {
    "code": "SALREU028",
    "libelleCourt": "Salle Colbert",
    "libelleLong": "Salle Colbert , Palais Bourbon"
  },
  "cycleDeVie": {
    "etat": "Confirmé",
    "chrono": {
      "creation": "2017-12-14T17:57:33.000+01:00"
    }
  },
  "demandeurs": {
    "acteurs": [
      {
        "nom": "Mme Laetitia AVIA",
        "acteurRef": "PA721624"
      }
    ]
  },
  "typeReunion": "DEP"
}