{
  "uid": "RUANR5L14S2018IDF0101977",
  "timestampDebut": "2017-12-07T17:00:00.000+01:00",
  "timestampFin": "2017-12-07T18:30:00.000+01:00",
  "lieu": {
    "code": "SALREU021",
    "libelleCourt": "Salle 7207",
    "libelleLong": "Salle 7207, 101, rue de l'Université"
  },
  "cycleDeVie": {
    "etat": "Confirmé",
    "chrono": {
      "creation": "2017-12-06T15:01:23.000+01:00"
    }
  },
  "demandeurs": {
    "acteurs": [
      {
        "nom": "Mme Marie LEBEC",
        "acteurRef": "PA721852"
      }
    ]
  },
  "typeReunion": "DEP"
}