{
  "uid": "RUANR5L15S2018IDF0104655",
  "timestampDebut": "2018-02-13T12:30:00.000+01:00",
  "timestampFin": "2018-02-13T13:30:00.000+01:00",
  "lieu": {
    "code": "SALREU016",
    "libelleCourt": "Salon Gabriel",
    "libelleLong": "Salon Gabriel, 101, rue de l'Université"
  },
  "cycleDeVie": {
    "etat": "Confirmé",
    "chrono": {
      "creation": "2018-01-30T13:26:58.000+01:00"
    }
  },
  "demandeurs": {
    "acteurs": [
      {
        "nom": "M. Matthieu ORPHELIN",
        "acteurRef": "PA720278"
      }
    ]
  },
  "typeReunion": "DEP"
}