{
  "uid": "RUANR5L14S2018IDF0102126",
  "timestampDebut": "2017-12-11T16:30:00.000+01:00",
  "timestampFin": "2017-12-11T17:30:00.000+01:00",
  "lieu": {
    "code": "SALREU013",
    "libelleCourt": "Salle N° 3",
    "libelleLong": "Salle N° 3, 3, rue Aristide Briand"
  },
  "cycleDeVie": {
    "etat": "Confirmé",
    "chrono": {
      "creation": "2017-12-11T10:32:39.000+01:00"
    }
  },
  "demandeurs": {
    "acteurs": [
      {
        "nom": "M. Rodrigue KOKOUENDO",
        "acteurRef": "PA721644"
      }
    ]
  },
  "typeReunion": "DEP"
}