{
  "uid": "RUANR5L15S2018IDC427180",
  "timestampDebut": "2017-10-03T17:00:00.000+02:00",
  "timestampFin": "2017-10-03T19:20:00.000+02:00",
  "lieu": {
    "libelleLong": "salle 4123 (33 rue Saint-Dominique)"
  },
  "cycleDeVie": {
    "etat": "Confirmé",
    "chrono": {
      "creation": "2017-07-27T00:00:00.000+02:00"
    }
  },
  "organeReuniRef": "PO59046",
  "participants": {
    "participantsInternes": [
      {
        "acteurRef": "PA605036",
        "presence": "excusé"
      },
      {
        "acteurRef": "PA720798",
        "presence": "présent"
      },
      {
        "acteurRef": "PA606675",
        "presence": "présent"
      },
      {
        "acteurRef": "PA721158",
        "presence": "présent"
      },
      {
        "acteurRef": "PA719100",
        "presence": "présent"
      },
      {
        "acteurRef": "PA610634",
        "presence": "excusé"
      },
      {
        "acteurRef": "PA719770",
        "presence": "excusé"
      },
      {
        "acteurRef": "PA721776",
        "presence": "excusé"
      },
      {
        "acteurRef": "PA721522",
        "presence": "présent"
      },
      {
        "acteurRef": "PA642847",
        "presence": "présent"
      },
      {
        "acteurRef": "PA642935",
        "presence": "présent"
      },
      {
        "acteurRef": "PA719024",
        "presence": "présent"
      },
      {
        "acteurRef": "PA718756",
        "presence": "absent"
      },
      {
        "acteurRef": "PA721816",
        "presence": "présent"
      },
      {
        "acteurRef": "PA672",
        "presence": "présent"
      },
      {
        "acteurRef": "PA720116",
        "presence": "présent"
      },
      {
        "acteurRef": "PA720622",
        "presence": "présent"
      },
      {
        "acteurRef": "PA429893",
        "presence": "présent"
      },
      {
        "acteurRef": "PA719790",
        "presence": "présent"
      },
      {
        "acteurRef": "PA267306",
        "presence": "présent"
      },
      {
        "acteurRef": "PA721210",
        "presence": "présent"
      },
      {
        "acteurRef": "PA719266",
        "presence": "présent"
      },
      {
        "acteurRef": "PA267241",
        "presence": "absent"
      },
      {
        "acteurRef": "PA342935",
        "presence": "présent"
      },
      {
        "acteurRef": "PA606202",
        "presence": "présent"
      },
      {
        "acteurRef": "PA720996",
        "presence": "excusé"
      },
      {
        "acteurRef": "PA719692",
        "presence": "présent"
      },
      {
        "acteurRef": "PA609332",
        "presence": "excusé"
      },
      {
        "acteurRef": "PA267042",
        "presence": "présent"
      },
      {
        "acteurRef": "PA606171",
        "presence": "excusé"
      },
      {
        "acteurRef": "PA643103",
        "presence": "présent"
      },
      {
        "acteurRef": "PA719938",
        "presence": "présent"
      },
      {
        "acteurRef": "PA722134",
        "presence": "présent"
      },
      {
        "acteurRef": "PA267673",
        "presence": "présent"
      },
      {
        "acteurRef": "PA266774",
        "presence": "absent"
      },
      {
        "acteurRef": "PA267735",
        "presence": "présent"
      },
      {
        "acteurRef": "PA722358",
        "presence": "présent"
      },
      {
        "acteurRef": "PA719326",
        "presence": "présent"
      },
      {
        "acteurRef": "PA721296",
        "presence": "présent"
      },
      {
        "acteurRef": "PA719330",
        "presence": "présent"
      },
      {
        "acteurRef": "PA721792",
        "presence": "présent"
      },
      {
        "acteurRef": "PA1695",
        "presence": "excusé"
      },
      {
        "acteurRef": "PA720354",
        "presence": "présent"
      },
      {
        "acteurRef": "PA719052",
        "presence": "présent"
      },
      {
        "acteurRef": "PA722300",
        "presence": "présent"
      },
      {
        "acteurRef": "PA720846",
        "presence": "présent"
      },
      {
        "acteurRef": "PA268019",
        "presence": "présent"
      },
      {
        "acteurRef": "PA719918",
        "presence": "présent"
      },
      {
        "acteurRef": "PA721434",
        "presence": "présent"
      },
      {
        "acteurRef": "PA719396",
        "presence": "présent"
      },
      {
        "acteurRef": "PA719404",
        "presence": "présent"
      },
      {
        "acteurRef": "PA722320",
        "presence": "présent"
      },
      {
        "acteurRef": "PA721946",
        "presence": "présent"
      },
      {
        "acteurRef": "PA2086",
        "presence": "absent"
      },
      {
        "acteurRef": "PA721726",
        "presence": "excusé"
      },
      {
        "acteurRef": "PA721734",
        "presence": "présent"
      },
      {
        "acteurRef": "PA719668",
        "presence": "présent"
      },
      {
        "acteurRef": "PA721656",
        "presence": "absent"
      },
      {
        "acteurRef": "PA720720",
        "presence": "présent"
      },
      {
        "acteurRef": "PA719600",
        "presence": "présent"
      },
      {
        "acteurRef": "PA721916",
        "presence": "présent"
      },
      {
        "acteurRef": "PA608011",
        "presence": "présent"
      },
      {
        "acteurRef": "PA343493",
        "presence": "présent"
      },
      {
        "acteurRef": "PA719822",
        "presence": "excusé"
      },
      {
        "acteurRef": "PA718780",
        "presence": "présent"
      },
      {
        "acteurRef": "PA720394",
        "presence": "présent"
      },
      {
        "acteurRef": "PA718682",
        "presence": "présent"
      },
      {
        "acteurRef": "PA718768",
        "presence": "présent"
      },
      {
        "acteurRef": "PA334843",
        "presence": "présent"
      },
      {
        "acteurRef": "PA1012",
        "presence": "présent"
      }
    ]
  },
  "ouverturePresse": false,
  "odj": {
    "convocationOdj": [
      "– Audition de Mme Florence Parly, ministre des Armées, sur le projet de loi de finances pour 2018"
    ],
    "resumeOdj": [
      "audition de Mme Florence Parly, ministre des armées, sur le projet de loi de finances pour 2018."
    ]
  },
  "compteRenduRef": "CRCANR5L15S2018PO59046N001"
}