{
  "uid": "RUANR5L14S2018IDF0097173",
  "timestampDebut": "2017-10-02T10:00:00.000+02:00",
  "timestampFin": "2017-10-02T11:00:00.000+02:00",
  "lieu": {
    "code": "SALREU045",
    "libelleCourt": "Sully 3",
    "libelleLong": "Sully 3, Palais Bourbon"
  },
  "cycleDeVie": {
    "etat": "Confirmé",
    "chrono": {
      "creation": "2017-09-27T13:05:59.000+02:00"
    }
  },
  "demandeurs": {
    "acteurs": [
      {
        "nom": "Mme Olivia GREGOIRE",
        "acteurRef": "PA721764"
      }
    ]
  },
  "typeReunion": "DEP"
}