{
  "uid": "RUANR5L15S2018IDS20815",
  "timestampDebut": "2017-12-05T15:00:00.000+01:00",
  "timestampFin": "2017-12-05T19:55:00.000+01:00",
  "lieu": {
    "code": "AN",
    "libelleLong": "Assemblée nationale"
  },
  "cycleDeVie": {
    "etat": "Confirmé",
    "chrono": {
      "creation": "2017-11-13T00:00:00.000+01:00"
    }
  },
  "organeReuniRef": "PO717460",
  "sessionRef": "SCR5A2018O1",
  "ouverturePresse": true,
  "odj": {
    "pointsOdj": [
      {
        "xsiType": "podjSeanceConfPres_type",
        "uid": "RUANR5L15S2018IDS20815PT35298",
        "cycleDeVie": {
          "etat": "Confirmé",
          "chrono": {
            "creation": "2017-11-13T00:00:00.000+01:00"
          }
        },
        "objet": "Questions au Gouvernement",
        "typePointOdj": "Questions au Gouvernement",
        "comiteSecret": false,
        "natureTravauxOdj": "ODJPR",
        "dateConfPres": "2017-11-14T01:00:00.000+01:00"
      },
      {
        "xsiType": "podjSeanceConfPres_type",
        "uid": "RUANR5L15S2018IDS20815PT35303",
        "cycleDeVie": {
          "etat": "Confirmé",
          "chrono": {
            "creation": "2017-11-13T00:00:00.000+01:00"
          }
        },
        "objet": "Suite de la discussion du projet de loi de finances rectificative pour 2017",
        "dossiersLegislatifsRefs": [
          "DLR5L15N36131"
        ],
        "typePointOdj": "Suite de la discussion",
        "comiteSecret": false,
        "natureTravauxOdj": "ODJPR"
      }
    ]
  },
  "compteRenduRef": "CRSANR5L15S2018O1N083",
  "identifiants": {
    "numSeanceJo": "83",
    "idJo": "20180083",
    "quantieme": "Première",
    "dateSeance": "2017-12-05T01:00:00.000+01:00"
  }
}