{
  "uid": "RUANR5L14S2018IDF0100904",
  "timestampDebut": "2017-11-21T10:00:00.000+01:00",
  "timestampFin": "2017-11-21T11:00:00.000+01:00",
  "lieu": {
    "code": "SALREU002",
    "libelleCourt": "Salle 7070",
    "libelleLong": "Salle 7070, 103, rue de l'Université"
  },
  "cycleDeVie": {
    "etat": "Confirmé",
    "chrono": {
      "creation": "2017-11-17T11:21:08.000+01:00"
    }
  },
  "demandeurs": {
    "acteurs": [
      {
        "nom": "M. Jacques MAIRE",
        "acteurRef": "PA722178"
      }
    ]
  },
  "typeReunion": "DEP"
}