{
  "uid": "RUANR5L15S2018IDC428036",
  "timestampDebut": "2018-01-23T09:30:00.000+01:00",
  "lieu": {
    "libelleLong": "salon Visconti (101 rue de l'Université)"
  },
  "cycleDeVie": {
    "etat": "Supprimé",
    "chrono": {
      "creation": "2017-12-01T00:00:00.000+01:00",
      "cloture": "2017-12-08T00:00:00.000+01:00"
    }
  },
  "organeReuniRef": "PO743946",
  "participants": {},
  "ouverturePresse": false,
  "odj": {
    "convocationOdj": [
      "Audition de M. Roland Heguy, président de l’Union des Métiers et des Industries de l'Hôtellerie (UMIH)."
    ],
    "resumeOdj": [
      "audition de M. Roland Heguy, président de l’Union des Métiers et des Industries de l'Hôtellerie (UMIH)."
    ]
  }
}