{
  "uid": "RUANR5L15S2018IDF0105893",
  "timestampDebut": "2018-03-20T17:30:00.000+01:00",
  "timestampFin": "2018-03-20T20:30:00.000+01:00",
  "lieu": {
    "code": "SALREU012",
    "libelleCourt": "Salle N° 23",
    "libelleLong": "Salle N° 23, 3, rue Aristide Briand"
  },
  "cycleDeVie": {
    "etat": "Confirmé",
    "chrono": {
      "creation": "2018-02-15T14:35:39.000+01:00"
    }
  },
  "demandeurs": {
    "organe": {
      "nom": "Groupe d'études CONDITIONS D'ACCUEIL DES MIGRANTS",
      "organeRef": "PO746748"
    }
  },
  "organeReuniRef": "PO746748",
  "typeReunion": "GE"
}