{
  "uid": "RUANR5L14S2018IDF0097687",
  "timestampDebut": "2017-10-04T17:30:00.000+02:00",
  "timestampFin": "2017-10-04T19:30:00.000+02:00",
  "lieu": {
    "code": "SALREU046",
    "libelleCourt": "Sully 1",
    "libelleLong": "Sully 1, Palais Bourbon"
  },
  "cycleDeVie": {
    "etat": "Confirmé",
    "chrono": {
      "creation": "2017-10-02T14:46:08.000+02:00"
    }
  },
  "demandeurs": {
    "acteurs": [
      {
        "nom": "Mme Anne-Laure CATTELOT",
        "acteurRef": "PA720520"
      }
    ]
  },
  "typeReunion": "DEP"
}