{
  "uid": "RUANR5L14S2018IDF0098082",
  "timestampDebut": "2017-10-16T16:00:00.000+02:00",
  "timestampFin": "2017-10-16T18:00:00.000+02:00",
  "lieu": {
    "code": "SALREU006",
    "libelleCourt": "3ème Bureau",
    "libelleLong": "3ème Bureau, Palais Bourbon"
  },
  "cycleDeVie": {
    "etat": "Annulé",
    "chrono": {
      "creation": "2017-10-05T16:02:45.000+02:00",
      "cloture": "2017-10-10T09:57:45.000+02:00"
    }
  },
  "demandeurs": {
    "acteurs": [
      {
        "nom": "Mme Huguette BELLO",
        "acteurRef": "PA441"
      }
    ]
  },
  "typeReunion": "DEP"
}