{
  "uid": "RUANR5L15S2018IDC428428",
  "timestampDebut": "2018-02-14T14:00:00.000+01:00",
  "lieu": {
    "libelleLong": "salle 6350 (Finances)"
  },
  "cycleDeVie": {
    "etat": "Supprimé",
    "chrono": {
      "creation": "2018-01-31T00:00:00.000+01:00",
      "cloture": "2018-02-13T00:00:00.000+01:00"
    }
  },
  "organeReuniRef": "PO738944",
  "participants": {},
  "ouverturePresse": true,
  "odj": {
    "convocationOdj": [
      "Audition de Mme Bénédicte de PERTHUIS, vice-présidente du Tribunal de grande instance de Paris et Présidente des 11ème et 32ème chambres correctionnelles."
    ],
    "resumeOdj": [
      "audition de Mme Bénédicte de Perthuis, vice-présidente du Tribunal de grande instance de Paris et Présidente des 11ème et 32ème chambres correctionnelles."
    ]
  }
}