{
  "uid": "RUANR5L14S2018IDF0101848",
  "timestampDebut": "2017-12-07T11:00:00.000+01:00",
  "timestampFin": "2017-12-07T15:00:00.000+01:00",
  "lieu": {
    "code": "SALREU017",
    "libelleCourt": "Salon Visconti",
    "libelleLong": "Salon Visconti, 101, rue de l'Université"
  },
  "cycleDeVie": {
    "etat": "Confirmé",
    "chrono": {
      "creation": "2017-12-04T18:53:21.000+01:00"
    }
  },
  "demandeurs": {
    "acteurs": [
      {
        "nom": "Mme Marietta KARAMANLI",
        "acteurRef": "PA335054"
      }
    ]
  },
  "typeReunion": "DEP"
}