{
  "uid": "RUANR5L14S2017IDF0093530",
  "timestampDebut": "2017-09-12T10:45:00.000+02:00",
  "timestampFin": "2017-09-12T11:15:00.000+02:00",
  "lieu": {
    "code": "SALREU027",
    "libelleCourt": "Salle 6217",
    "libelleLong": "Salle 6217, Palais Bourbon"
  },
  "cycleDeVie": {
    "etat": "Annulé",
    "chrono": {
      "creation": "2017-07-06T11:37:30.000+02:00",
      "cloture": "2017-09-07T18:10:20.000+02:00"
    }
  },
  "demandeurs": {
    "organe": {
      "nom": "GROUPE LES RÉPUBLICAINS",
      "organeRef": "PO730934"
    }
  },
  "organeReuniRef": "PO730934",
  "typeReunion": "GP"
}