{
  "uid": "RUANR5L14S2017IDF0093197",
  "timestampDebut": "2017-06-30T08:00:00.000+02:00",
  "timestampFin": "2017-06-30T22:00:00.000+02:00",
  "lieu": {
    "code": "SALREU028",
    "libelleCourt": "Salle Colbert",
    "libelleLong": "Salle Colbert , Palais Bourbon"
  },
  "cycleDeVie": {
    "etat": "Confirmé",
    "chrono": {
      "creation": "2017-06-26T16:49:55.000+02:00"
    }
  },
  "typeReunion": "GP"
}