{
  "uid": "RUANR5L14S2018IDF0100210",
  "timestampDebut": "2018-01-24T14:00:00.000+01:00",
  "timestampFin": "2018-01-24T15:00:00.000+01:00",
  "lieu": {
    "code": "SALREU008",
    "libelleCourt": "5ème Bureau",
    "libelleLong": "5ème Bureau, Palais Bourbon"
  },
  "cycleDeVie": {
    "etat": "Confirmé",
    "chrono": {
      "creation": "2017-11-13T11:53:23.000+01:00"
    }
  },
  "demandeurs": {
    "acteurs": [
      {
        "nom": "M. Ludovic MENDES",
        "acteurRef": "PA720370"
      }
    ]
  },
  "typeReunion": "DEP"
}