{
  "uid": "RUANR5L14S2017IDF0096448",
  "timestampDebut": "2017-09-28T10:00:00.000+02:00",
  "timestampFin": "2017-09-28T13:00:00.000+02:00",
  "lieu": {
    "code": "SALREU049",
    "libelleCourt": "Salle 6822",
    "libelleLong": "Salle 6822, Palais Bourbon"
  },
  "cycleDeVie": {
    "etat": "Annulé",
    "chrono": {
      "creation": "2017-09-15T16:23:14.000+02:00",
      "cloture": "2017-09-22T10:56:19.000+02:00"
    }
  },
  "demandeurs": {
    "acteurs": [
      {
        "nom": "Mme Laurence GAYTE",
        "acteurRef": "PA720806"
      }
    ]
  },
  "typeReunion": "DEP"
}