{
  "uid": "RUANR5L15S2018IDF0104240",
  "timestampDebut": "2018-04-20T09:00:00.000+02:00",
  "timestampFin": "2018-04-20T13:00:00.000+02:00",
  "lieu": {
    "code": "SALREU028",
    "libelleCourt": "Salle Colbert",
    "libelleLong": "Salle Colbert , Palais Bourbon"
  },
  "cycleDeVie": {
    "etat": "Confirmé",
    "chrono": {
      "creation": "2018-01-23T16:29:36.000+01:00"
    }
  },
  "demandeurs": {
    "acteurs": [
      {
        "nom": "M. Jean-Louis TOURAINE",
        "acteurRef": "PA334768"
      }
    ]
  },
  "typeReunion": "DEP"
}