{
  "uid": "RUANR5L14S2018IDF0099397",
  "timestampDebut": "2017-11-14T14:00:00.000+01:00",
  "timestampFin": "2017-11-14T15:00:00.000+01:00",
  "lieu": {
    "code": "SALREU021",
    "libelleCourt": "Salle 7207",
    "libelleLong": "Salle 7207, 101, rue de l'Université"
  },
  "cycleDeVie": {
    "etat": "Confirmé",
    "chrono": {
      "creation": "2017-10-27T15:26:17.000+02:00"
    }
  },
  "demandeurs": {
    "acteurs": [
      {
        "nom": "Mme Cécile UNTERMAIER",
        "acteurRef": "PA608695"
      }
    ]
  },
  "typeReunion": "DEP"
}