{
  "uid": "RUANR5L14S2018IDF0095743",
  "timestampDebut": "2017-10-11T16:30:00.000+02:00",
  "timestampFin": "2017-10-11T19:30:00.000+02:00",
  "lieu": {
    "code": "SALREU039",
    "libelleCourt": "Salle 6550",
    "libelleLong": "Salle 6550, Palais Bourbon"
  },
  "cycleDeVie": {
    "etat": "Confirmé",
    "chrono": {
      "creation": "2017-09-06T11:04:27.000+02:00"
    }
  },
  "demandeurs": {
    "acteurs": [
      {
        "nom": "M. Marc LE FUR",
        "acteurRef": "PA1874"
      }
    ]
  },
  "typeReunion": "DEP"
}