{
  "uid": "RUANR5L14S2018IDF0100467",
  "timestampDebut": "2018-05-26T09:00:00.000+02:00",
  "timestampFin": "2018-05-26T17:00:00.000+02:00",
  "lieu": {
    "code": "SALREU003",
    "libelleCourt": "Salle Victor Hugo",
    "libelleLong": "Salle Victor Hugo, 101, rue de l'Université"
  },
  "cycleDeVie": {
    "etat": "Confirmé",
    "chrono": {
      "creation": "2017-11-15T15:22:08.000+01:00"
    }
  },
  "demandeurs": {
    "acteurs": [
      {
        "nom": "M. Boris VALLAUD",
        "acteurRef": "PA719930"
      }
    ]
  },
  "typeReunion": "DEP"
}