{
  "uid": "RUANR5L14S2018IDF0097585",
  "timestampDebut": "2017-11-07T16:15:00.000+01:00",
  "timestampFin": "2017-11-07T18:15:00.000+01:00",
  "lieu": {
    "code": "SALREU042",
    "libelleCourt": "Salle 6566",
    "libelleLong": "Salle 6566, Palais Bourbon"
  },
  "cycleDeVie": {
    "etat": "Confirmé",
    "chrono": {
      "creation": "2017-09-29T16:29:36.000+02:00"
    }
  },
  "demandeurs": {
    "organe": {
      "nom": "Groupe d'amitié France-Côte d'Ivoire",
      "organeRef": "PO733652"
    }
  },
  "organeReuniRef": "PO733652",
  "typeReunion": "GA"
}