{
  "uid": "RUANR5L15S2018IDC427407",
  "timestampDebut": "2017-11-07T18:40:00.000+01:00",
  "timestampFin": "2017-11-07T18:45:00.000+01:00",
  "lieu": {
    "libelleLong": "salle Lamartine"
  },
  "cycleDeVie": {
    "etat": "Confirmé",
    "chrono": {
      "creation": "2017-10-04T00:00:00.000+02:00"
    }
  },
  "organeReuniRef": "PO59048",
  "participants": {
    "participantsInternes": [
      {
        "acteurRef": "PA718954",
        "presence": "absent"
      },
      {
        "acteurRef": "PA605963",
        "presence": "absent"
      },
      {
        "acteurRef": "PA609726",
        "presence": "absent"
      },
      {
        "acteurRef": "PA721836",
        "presence": "absent"
      },
      {
        "acteurRef": "PA721410",
        "presence": "absent"
      },
      {
        "acteurRef": "PA721608",
        "presence": "absent"
      },
      {
        "acteurRef": "PA605069",
        "presence": "présent"
      },
      {
        "acteurRef": "PA720298",
        "presence": "présent"
      },
      {
        "acteurRef": "PA746",
        "presence": "absent"
      },
      {
        "acteurRef": "PA719138",
        "presence": "présent"
      },
      {
        "acteurRef": "PA720520",
        "presence": "absent"
      },
      {
        "acteurRef": "PA719472",
        "presence": "absent"
      },
      {
        "acteurRef": "PA719250",
        "presence": "absent"
      },
      {
        "acteurRef": "PA721202",
        "presence": "absent"
      },
      {
        "acteurRef": "PA923",
        "presence": "absent"
      },
      {
        "acteurRef": "PA942",
        "presence": "absent"
      },
      {
        "acteurRef": "PA332523",
        "presence": "absent"
      },
      {
        "acteurRef": "PA720268",
        "presence": "absent"
      },
      {
        "acteurRef": "PA719710",
        "presence": "absent"
      },
      {
        "acteurRef": "PA718720",
        "presence": "absent"
      },
      {
        "acteurRef": "PA643175",
        "presence": "absent"
      },
      {
        "acteurRef": "PA720002",
        "presence": "absent"
      },
      {
        "acteurRef": "PA1327",
        "presence": "absent"
      },
      {
        "acteurRef": "PA719480",
        "presence": "présent"
      },
      {
        "acteurRef": "PA267336",
        "presence": "excusé"
      },
      {
        "acteurRef": "PA720560",
        "presence": "absent"
      },
      {
        "acteurRef": "PA720790",
        "presence": "absent"
      },
      {
        "acteurRef": "PA721764",
        "presence": "absent"
      },
      {
        "acteurRef": "PA721498",
        "presence": "absent"
      },
      {
        "acteurRef": "PA722054",
        "presence": "absent"
      },
      {
        "acteurRef": "PA608416",
        "presence": "absent"
      },
      {
        "acteurRef": "PA721150",
        "presence": "absent"
      },
      {
        "acteurRef": "PA719060",
        "presence": "absent"
      },
      {
        "acteurRef": "PA719778",
        "presence": "absent"
      },
      {
        "acteurRef": "PA720214",
        "presence": "absent"
      },
      {
        "acteurRef": "PA719798",
        "presence": "présent"
      },
      {
        "acteurRef": "PA609245",
        "presence": "absent"
      },
      {
        "acteurRef": "PA718978",
        "presence": "absent"
      },
      {
        "acteurRef": "PA1838",
        "presence": "absent"
      },
      {
        "acteurRef": "PA720022",
        "presence": "absent"
      },
      {
        "acteurRef": "PA712014",
        "presence": "absent"
      },
      {
        "acteurRef": "PA1874",
        "presence": "absent"
      },
      {
        "acteurRef": "PA721466",
        "presence": "absent"
      },
      {
        "acteurRef": "PA719006",
        "presence": "absent"
      },
      {
        "acteurRef": "PA608016",
        "presence": "absent"
      },
      {
        "acteurRef": "PA722244",
        "presence": "présent"
      },
      {
        "acteurRef": "PA720230",
        "presence": "absent"
      },
      {
        "acteurRef": "PA720728",
        "presence": "absent"
      },
      {
        "acteurRef": "PA721418",
        "presence": "absent"
      },
      {
        "acteurRef": "PA721670",
        "presence": "absent"
      },
      {
        "acteurRef": "PA719850",
        "presence": "excusé"
      },
      {
        "acteurRef": "PA721656",
        "presence": "absent"
      },
      {
        "acteurRef": "PA720492",
        "presence": "absent"
      },
      {
        "acteurRef": "PA720402",
        "presence": "absent"
      },
      {
        "acteurRef": "PA721636",
        "presence": "absent"
      },
      {
        "acteurRef": "PA607595",
        "presence": "présent"
      },
      {
        "acteurRef": "PA721568",
        "presence": "absent"
      },
      {
        "acteurRef": "PA718736",
        "presence": "absent"
      },
      {
        "acteurRef": "PA336175",
        "presence": "absent"
      },
      {
        "acteurRef": "PA608172",
        "presence": "absent"
      },
      {
        "acteurRef": "PA405480",
        "presence": "absent"
      },
      {
        "acteurRef": "PA609590",
        "presence": "absent"
      },
      {
        "acteurRef": "PA719676",
        "presence": "absent"
      },
      {
        "acteurRef": "PA721458",
        "presence": "absent"
      },
      {
        "acteurRef": "PA720692",
        "presence": "absent"
      },
      {
        "acteurRef": "PA720878",
        "presence": "absent"
      },
      {
        "acteurRef": "PA722078",
        "presence": "absent"
      },
      {
        "acteurRef": "PA720960",
        "presence": "excusé"
      },
      {
        "acteurRef": "PA719592",
        "presence": "absent"
      },
      {
        "acteurRef": "PA721542",
        "presence": "absent"
      },
      {
        "acteurRef": "PA607090",
        "presence": "absent"
      },
      {
        "acteurRef": "PA331582",
        "presence": "absent"
      },
      {
        "acteurRef": "PA2960",
        "presence": "excusé"
      }
    ]
  },
  "ouverturePresse": true,
  "odj": {
    "convocationOdj": [
      "–  à l'issue de la commission élargie, suite de l’examen de la seconde partie du projet de loi de finances pour 2018 (n° 235) ; Examen et vote sur les crédits de la mission Médias, livre et industries culturelles et sur le compte spécial Avances à l’audiovisuel public (Mme Marie-Ange MAGNE, rapporteure spéciale)"
    ],
    "resumeOdj": [
      "projet de loi de finances pour 2018 (n° 235) (seconde partie) :",
      "à l'issue de la commission élargie : examen et vote sur les crédits de la mission Médias, livre et industries culturelles et sur le compte spécial Avances à l’audiovisuel public."
    ],
    "pointsOdj": [
      {
        "xsiType": "podjReunion_type",
        "uid": "RUANR5L15S2018IDC427407PT25046",
        "cycleDeVie": {
          "etat": "Eventuel",
          "chrono": {
            "creation": "2017-10-04T00:00:00.000+02:00"
          }
        },
        "objet": "Examen du texte",
        "dossiersLegislatifsRefs": [
          "DLR5L15N35854"
        ],
        "typePointOdj": "Examen",
        "comiteSecret": false
      }
    ]
  },
  "compteRenduRef": "CRCANR5L15S2018PO59048N038"
}