{
  "uid": "RUANR5L15S2018IDF0104864",
  "timestampDebut": "2018-04-17T16:00:00.000+02:00",
  "timestampFin": "2018-04-17T17:00:00.000+02:00",
  "lieu": {
    "code": "SALREU016",
    "libelleCourt": "Salon Gabriel",
    "libelleLong": "Salon Gabriel, 101, rue de l'Université"
  },
  "cycleDeVie": {
    "etat": "Annulé",
    "chrono": {
      "creation": "2018-01-31T18:40:16.000+01:00",
      "cloture": "2018-02-21T17:34:01.000+01:00"
    }
  },
  "demandeurs": {
    "organe": {
      "nom": "GROUPE LA RÉPUBLIQUE EN MARCHE",
      "organeRef": "PO730964"
    }
  },
  "organeReuniRef": "PO730964",
  "typeReunion": "GP"
}