{
  "uid": "RUANR5L14S2018IDF0097584",
  "timestampDebut": "2017-10-13T10:00:00.000+02:00",
  "timestampFin": "2017-10-13T13:00:00.000+02:00",
  "lieu": {
    "code": "SALREU039",
    "libelleCourt": "Salle 6550",
    "libelleLong": "Salle 6550, Palais Bourbon"
  },
  "cycleDeVie": {
    "etat": "Confirmé",
    "chrono": {
      "creation": "2017-09-29T15:27:33.000+02:00"
    }
  },
  "demandeurs": {
    "acteurs": [
      {
        "nom": "M. Bruno QUESTEL",
        "acteurRef": "PA643127"
      }
    ]
  },
  "typeReunion": "DEP"
}