{
  "uid": "RUANR5L15S2018IDC428053",
  "timestampDebut": "2018-01-16T16:30:00.000+01:00",
  "lieu": {
    "libelleLong": "salle Lamartine"
  },
  "cycleDeVie": {
    "etat": "Supprimé",
    "chrono": {
      "creation": "2017-12-06T00:00:00.000+01:00",
      "cloture": "2017-12-14T00:00:00.000+01:00"
    }
  },
  "organeReuniRef": "PO419610",
  "participants": {},
  "ouverturePresse": true,
  "odj": {
    "convocationOdj": [
      "Table ronde, conjointe avec la commission des affaires sociales, sur l’aide alimentaire (aval)."
    ],
    "resumeOdj": [
      "table ronde, conjointe avec la commission des affaires sociales, sur l’aide alimentaire (aval)."
    ]
  }
}