{
  "uid": "RUANR5L15S2018IDC428383",
  "timestampDebut": "2018-02-14T09:30:00.000+01:00",
  "timestampFin": "2018-02-14T11:30:00.000+01:00",
  "lieu": {
    "libelleLong": "salle 6238 (Affaires culturelles)"
  },
  "cycleDeVie": {
    "etat": "Confirmé",
    "chrono": {
      "creation": "2018-01-25T00:00:00.000+01:00"
    }
  },
  "organeReuniRef": "PO419604",
  "participants": {
    "participantsInternes": [
      {
        "acteurRef": "PA719146",
        "presence": "présent"
      },
      {
        "acteurRef": "PA720124",
        "presence": "présent"
      },
      {
        "acteurRef": "PA719318",
        "presence": "présent"
      },
      {
        "acteurRef": "PA722190",
        "presence": "présent"
      },
      {
        "acteurRef": "PA720256",
        "presence": "présent"
      },
      {
        "acteurRef": "PA718884",
        "presence": "présent"
      },
      {
        "acteurRef": "PA722046",
        "presence": "présent"
      },
      {
        "acteurRef": "PA719488",
        "presence": "présent"
      },
      {
        "acteurRef": "PA720576",
        "presence": "présent"
      },
      {
        "acteurRef": "PA722030",
        "presence": "présent"
      },
      {
        "acteurRef": "PA713448",
        "presence": "absent"
      },
      {
        "acteurRef": "PA223837",
        "presence": "excusé"
      },
      {
        "acteurRef": "PA721328",
        "presence": "présent"
      },
      {
        "acteurRef": "PA689",
        "presence": "présent"
      },
      {
        "acteurRef": "PA721750",
        "presence": "présent"
      },
      {
        "acteurRef": "PA721352",
        "presence": "présent"
      },
      {
        "acteurRef": "PA721218",
        "presence": "absent"
      },
      {
        "acteurRef": "PA719170",
        "presence": "présent"
      },
      {
        "acteurRef": "PA267429",
        "presence": "présent"
      },
      {
        "acteurRef": "PA702054",
        "presence": "présent"
      },
      {
        "acteurRef": "PA719814",
        "presence": "présent"
      },
      {
        "acteurRef": "PA719118",
        "presence": "présent"
      },
      {
        "acteurRef": "PA720696",
        "presence": "présent"
      },
      {
        "acteurRef": "PA719162",
        "presence": "présent"
      },
      {
        "acteurRef": "PA608826",
        "presence": "présent"
      },
      {
        "acteurRef": "PA721194",
        "presence": "présent"
      },
      {
        "acteurRef": "PA719044",
        "presence": "présent"
      },
      {
        "acteurRef": "PA721896",
        "presence": "présent"
      },
      {
        "acteurRef": "PA720030",
        "presence": "excusé"
      },
      {
        "acteurRef": "PA720198",
        "presence": "présent"
      },
      {
        "acteurRef": "PA720178",
        "presence": "présent"
      },
      {
        "acteurRef": "PA267324",
        "presence": "présent"
      },
      {
        "acteurRef": "PA605991",
        "presence": "présent"
      },
      {
        "acteurRef": "PA719108",
        "presence": "présent"
      },
      {
        "acteurRef": "PA721784",
        "presence": "présent"
      },
      {
        "acteurRef": "PA722070",
        "presence": "présent"
      },
      {
        "acteurRef": "PA718794",
        "presence": "présent"
      },
      {
        "acteurRef": "PA332614",
        "presence": "absent"
      },
      {
        "acteurRef": "PA719230",
        "presence": "présent"
      },
      {
        "acteurRef": "PA721506",
        "presence": "présent"
      },
      {
        "acteurRef": "PA643205",
        "presence": "présent"
      },
      {
        "acteurRef": "PA718868",
        "presence": "présent"
      },
      {
        "acteurRef": "PA719728",
        "presence": "présent"
      },
      {
        "acteurRef": "PA345722",
        "presence": "présent"
      },
      {
        "acteurRef": "PA720446",
        "presence": "présent"
      },
      {
        "acteurRef": "PA720988",
        "presence": "présent"
      },
      {
        "acteurRef": "PA719640",
        "presence": "présent"
      },
      {
        "acteurRef": "PA719272",
        "presence": "présent"
      },
      {
        "acteurRef": "PA720630",
        "presence": "présent"
      },
      {
        "acteurRef": "PA719456",
        "presence": "excusé"
      },
      {
        "acteurRef": "PA721656",
        "presence": "présent"
      },
      {
        "acteurRef": "PA335532",
        "presence": "présent"
      },
      {
        "acteurRef": "PA719946",
        "presence": "présent"
      },
      {
        "acteurRef": "PA721234",
        "presence": "présent"
      },
      {
        "acteurRef": "PA721844",
        "presence": "présent"
      },
      {
        "acteurRef": "PA718944",
        "presence": "présent"
      },
      {
        "acteurRef": "PA721888",
        "presence": "présent"
      },
      {
        "acteurRef": "PA266776",
        "presence": "présent"
      },
      {
        "acteurRef": "PA335758",
        "presence": "excusé"
      },
      {
        "acteurRef": "PA720900",
        "presence": "présent"
      },
      {
        "acteurRef": "PA720066",
        "presence": "excusé"
      },
      {
        "acteurRef": "PA722252",
        "presence": "excusé"
      },
      {
        "acteurRef": "PA718902",
        "presence": "présent"
      },
      {
        "acteurRef": "PA721226",
        "presence": "présent"
      },
      {
        "acteurRef": "PA720190",
        "presence": "présent"
      },
      {
        "acteurRef": "PA720754",
        "presence": "présent"
      },
      {
        "acteurRef": "PA720854",
        "presence": "présent"
      },
      {
        "acteurRef": "PA720568",
        "presence": "présent"
      },
      {
        "acteurRef": "PA340357",
        "presence": "présent"
      },
      {
        "acteurRef": "PA606639",
        "presence": "présent"
      }
    ],
    "personnesAuditionnees": [
      {
        "xsiType": "IdPersonneExterne_type",
        "uid": "PE2526",
        "ident": {
          "civ": "M.",
          "prenom": "René",
          "nom": "Bonnell"
        },
        "dateNais": null
      }
    ]
  },
  "ouverturePresse": true,
  "odj": {
    "convocationOdj": [
      "– Remplacement d'un membre de la commission siégeant au Conseil supérieur des programmes\n– Audition de M. René Bonnell sur son rapport relatif à la situation économique de l’association pour le soutien au théâtre privé"
    ],
    "resumeOdj": [
      "désignation d'un candidat à un organisme extra-parlementaire ;",
      "audition de M. René Bonnell sur son rapport relatif à la situation économique de l’association pour le soutien au théâtre privé."
    ]
  },
  "compteRenduRef": "CRCANR5L15S2018PO419604N028"
}