{
  "uid": "RUANR5L15S2018IDF0105852",
  "timestampDebut": "2018-02-20T14:00:00.000+01:00",
  "timestampFin": "2018-02-20T15:00:00.000+01:00",
  "lieu": {
    "code": "SALREU032",
    "libelleCourt": "Sully 4",
    "libelleLong": "Sully 4, Palais Bourbon"
  },
  "cycleDeVie": {
    "etat": "Confirmé",
    "chrono": {
      "creation": "2018-02-14T19:13:39.000+01:00"
    }
  },
  "demandeurs": {
    "acteurs": [
      {
        "nom": "Mme Ericka BAREIGTS",
        "acteurRef": "PA610681"
      }
    ]
  },
  "typeReunion": "DEP"
}