{
  "uid": "RUANR5L14S2018IDF0101087",
  "timestampDebut": "2017-11-21T17:00:00.000+01:00",
  "timestampFin": "2017-11-21T21:00:00.000+01:00",
  "lieu": {
    "code": "SALREU049",
    "libelleCourt": "Salle 6822",
    "libelleLong": "Salle 6822, Palais Bourbon"
  },
  "cycleDeVie": {
    "etat": "Confirmé",
    "chrono": {
      "creation": "2017-11-21T16:51:09.000+01:00"
    }
  },
  "demandeurs": {
    "acteurs": [
      {
        "nom": "M. Nicolas FORISSIER",
        "acteurRef": "PA1327"
      }
    ]
  },
  "typeReunion": "DEP"
}