{
  "uid": "RUANR5L14S2018IDF0097931",
  "timestampDebut": "2017-10-11T14:00:00.000+02:00",
  "timestampFin": "2017-10-11T15:00:00.000+02:00",
  "lieu": {
    "code": "SALREU044",
    "libelleCourt": "Sully 2",
    "libelleLong": "Sully 2, Palais Bourbon"
  },
  "cycleDeVie": {
    "etat": "Confirmé",
    "chrono": {
      "creation": "2017-10-04T15:13:26.000+02:00"
    }
  },
  "demandeurs": {
    "acteurs": [
      {
        "nom": "Mme Albane GAILLOT",
        "acteurRef": "PA721246"
      }
    ]
  },
  "typeReunion": "DEP"
}