{
  "uid": "RUANR5L14S2018IDF0096333",
  "timestampDebut": "2017-10-17T10:00:00.000+02:00",
  "timestampFin": "2017-10-17T12:00:00.000+02:00",
  "lieu": {
    "code": "SALREU017",
    "libelleCourt": "Salon Visconti",
    "libelleLong": "Salon Visconti, 101, rue de l'Université"
  },
  "cycleDeVie": {
    "etat": "Confirmé",
    "chrono": {
      "creation": "2017-09-14T14:17:08.000+02:00"
    }
  },
  "demandeurs": {
    "acteurs": [
      {
        "nom": "M. Jean-René CAZENEUVE",
        "acteurRef": "PA719472"
      },
      {
        "nom": "M. Christophe JERRETIE",
        "acteurRef": "PA719060"
      }
    ]
  },
  "typeReunion": "DEP"
}