{
  "uid": "RUANR5L14S2018IDF0094515",
  "timestampDebut": "2017-11-28T13:45:00.000+01:00",
  "timestampFin": "2017-11-28T14:45:00.000+01:00",
  "lieu": {
    "code": "SALREU048",
    "libelleCourt": "Salle 6809",
    "libelleLong": "Salle 6809, Palais Bourbon"
  },
  "cycleDeVie": {
    "etat": "Annulé",
    "chrono": {
      "creation": "2017-07-21T19:04:22.000+02:00",
      "cloture": "2017-10-11T15:49:34.000+02:00"
    }
  },
  "demandeurs": {
    "organe": {
      "nom": "GROUPE DU MOUVEMENT DÉMOCRATE ET APPARENTÉS",
      "organeRef": "PO730970"
    }
  },
  "organeReuniRef": "PO730970",
  "typeReunion": "GP"
}