{
  "uid": "RUANR5L14S2018IDF0103009",
  "timestampDebut": "2018-01-16T10:00:00.000+01:00",
  "timestampFin": "2018-01-16T11:00:00.000+01:00",
  "lieu": {
    "code": "SALREU028",
    "libelleCourt": "Salle Colbert",
    "libelleLong": "Salle Colbert , Palais Bourbon"
  },
  "cycleDeVie": {
    "etat": "Confirmé",
    "chrono": {
      "creation": "2017-12-21T15:47:43.000+01:00"
    }
  },
  "demandeurs": {
    "acteurs": [
      {
        "nom": "M. Jacques KRABAL",
        "acteurRef": "PA605084"
      }
    ]
  },
  "typeReunion": "DEP"
}