{
  "uid": "RUANR5L15S2018IDF0107166",
  "timestampDebut": "2018-03-13T10:30:00.000+01:00",
  "timestampFin": "2018-03-13T11:30:00.000+01:00",
  "lieu": {
    "code": "SALREU022",
    "libelleCourt": "Salle 7326",
    "libelleLong": "Salle 7326, 101, rue de l'Université"
  },
  "cycleDeVie": {
    "etat": "Confirmé",
    "chrono": {
      "creation": "2018-03-07T18:56:57.000+01:00"
    }
  },
  "demandeurs": {
    "acteurs": [
      {
        "nom": "M. Didier BAICHÈRE",
        "acteurRef": "PA721776"
      }
    ]
  },
  "typeReunion": "DEP"
}