{
  "uid": "RUANR5L14S2018IDF0102183",
  "timestampDebut": "2017-12-12T18:00:00.000+01:00",
  "timestampFin": "2017-12-12T19:00:00.000+01:00",
  "lieu": {
    "code": "SALREU017",
    "libelleCourt": "Salon Visconti",
    "libelleLong": "Salon Visconti, 101, rue de l'Université"
  },
  "cycleDeVie": {
    "etat": "Confirmé",
    "chrono": {
      "creation": "2017-12-12T13:00:43.000+01:00"
    }
  },
  "demandeurs": {
    "acteurs": [
      {
        "nom": "M. Daniel FASQUELLE",
        "acteurRef": "PA334149"
      }
    ]
  },
  "typeReunion": "DEP"
}