{
  "uid": "RUANR5L14S2018IDF0101612",
  "timestampDebut": "2018-01-31T08:45:00.000+01:00",
  "timestampFin": "2018-01-31T09:30:00.000+01:00",
  "lieu": {
    "code": "SALREU019",
    "libelleCourt": "Salon Mars I",
    "libelleLong": "Salon Mars I, 101, rue de l'Université"
  },
  "cycleDeVie": {
    "etat": "Confirmé",
    "chrono": {
      "creation": "2017-11-29T16:26:27.000+01:00"
    }
  },
  "demandeurs": {
    "acteurs": [
      {
        "nom": "M. Yannick HAURY",
        "acteurRef": "PA720054"
      }
    ]
  },
  "typeReunion": "DEP"
}