{
  "uid": "RUANR5L14S2018IDF0099042",
  "timestampDebut": "2017-10-20T11:00:00.000+02:00",
  "timestampFin": "2017-10-20T18:30:00.000+02:00",
  "lieu": {
    "code": "SALREU023",
    "libelleCourt": "Salle 7426",
    "libelleLong": "Salle 7426, 101, rue de l'Université"
  },
  "cycleDeVie": {
    "etat": "Confirmé",
    "chrono": {
      "creation": "2017-10-20T10:35:20.000+02:00"
    }
  },
  "demandeurs": {
    "acteurs": [
      {
        "nom": "Mme Paula FORTEZA",
        "acteurRef": "PA721142"
      }
    ]
  },
  "typeReunion": "DEP"
}