{
  "uid": "RUANR5L15S2018IDF0102799",
  "timestampDebut": "2018-02-27T10:15:00.000+01:00",
  "timestampFin": "2018-02-27T10:45:00.000+01:00",
  "lieu": {
    "code": "SALREU027",
    "libelleCourt": "Salle 6217",
    "libelleLong": "Salle 6217, Palais Bourbon"
  },
  "cycleDeVie": {
    "etat": "Confirmé",
    "chrono": {
      "creation": "2017-12-20T16:11:10.000+01:00"
    }
  },
  "demandeurs": {
    "acteurs": [
      {
        "nom": "M. Christian JACOB",
        "acteurRef": "PA1695"
      }
    ]
  },
  "typeReunion": "DEP"
}