{
  "uid": "RUANR5L15S2018IDF0105755",
  "timestampDebut": "2018-02-21T10:00:00.000+01:00",
  "timestampFin": "2018-02-21T12:30:00.000+01:00",
  "lieu": {
    "code": "SALREU032",
    "libelleCourt": "Sully 4",
    "libelleLong": "Sully 4, Palais Bourbon"
  },
  "cycleDeVie": {
    "etat": "Confirmé",
    "chrono": {
      "creation": "2018-02-14T09:37:56.000+01:00"
    }
  },
  "demandeurs": {
    "acteurs": [
      {
        "nom": "M. Patrick VIGNAL",
        "acteurRef": "PA606639"
      }
    ]
  },
  "typeReunion": "DEP"
}