{
  "uid": "RUANR5L14S2018IDF0098998",
  "timestampDebut": "2018-01-16T14:00:00.000+01:00",
  "timestampFin": "2018-01-16T15:00:00.000+01:00",
  "lieu": {
    "code": "SALREU022",
    "libelleCourt": "Salle 7326",
    "libelleLong": "Salle 7326, 101, rue de l'Université"
  },
  "cycleDeVie": {
    "etat": "Confirmé",
    "chrono": {
      "creation": "2017-10-19T16:47:10.000+02:00"
    }
  },
  "demandeurs": {
    "acteurs": [
      {
        "nom": "Mme Mireille CLAPOT",
        "acteurRef": "PA719294"
      }
    ]
  },
  "typeReunion": "DEP"
}