{
  "uid": "RUANR5L15S2018IDF0105480",
  "timestampDebut": "2018-02-12T15:30:00.000+01:00",
  "timestampFin": "2018-02-12T17:30:00.000+01:00",
  "lieu": {
    "code": "SALREU048",
    "libelleCourt": "Salle 6809",
    "libelleLong": "Salle 6809, Palais Bourbon"
  },
  "cycleDeVie": {
    "etat": "Confirmé",
    "chrono": {
      "creation": "2018-02-09T12:17:45.000+01:00"
    }
  },
  "demandeurs": {
    "acteurs": [
      {
        "nom": "M. Franck RIESTER",
        "acteurRef": "PA335758"
      }
    ]
  },
  "typeReunion": "DEP"
}