{
  "uid": "RUANR5L15S2018IDF0105913",
  "timestampDebut": "2018-04-05T10:00:00.000+02:00",
  "timestampFin": "2018-04-05T13:00:00.000+02:00",
  "lieu": {
    "code": "SALREU038",
    "libelleCourt": "Salle 6549",
    "libelleLong": "Salle 6549, Palais Bourbon"
  },
  "cycleDeVie": {
    "etat": "Confirmé",
    "chrono": {
      "creation": "2018-02-15T14:32:42.000+01:00"
    }
  },
  "demandeurs": {
    "acteurs": [
      {
        "nom": "M. Pierre-Yves BOURNAZEL",
        "acteurRef": "PA722030"
      }
    ]
  },
  "typeReunion": "DEP"
}