{
  "uid": "RUANR5L14S2018IDF0099256",
  "timestampDebut": "2017-11-23T09:00:00.000+01:00",
  "timestampFin": "2017-11-23T13:00:00.000+01:00",
  "lieu": {
    "code": "SALREU017",
    "libelleCourt": "Salon Visconti",
    "libelleLong": "Salon Visconti, 101, rue de l'Université"
  },
  "cycleDeVie": {
    "etat": "Confirmé",
    "chrono": {
      "creation": "2017-10-25T11:59:07.000+02:00"
    }
  },
  "demandeurs": {
    "acteurs": [
      {
        "nom": "Mme Monique IBORRA",
        "acteurRef": "PA331835"
      }
    ]
  },
  "typeReunion": "DEP"
}