{
  "uid": "RUANR5L14S2017IDF0093353",
  "timestampDebut": "2017-07-04T12:00:00.000+02:00",
  "timestampFin": "2017-07-04T15:00:00.000+02:00",
  "lieu": {
    "code": "SALREU042",
    "libelleCourt": "Salle 6566",
    "libelleLong": "Salle 6566, Palais Bourbon"
  },
  "cycleDeVie": {
    "etat": "Confirmé",
    "chrono": {
      "creation": "2017-06-30T09:55:16.000+02:00"
    }
  },
  "demandeurs": {
    "acteurs": [
      {
        "nom": "Mme Yaël BRAUN-PIVET",
        "acteurRef": "PA721908"
      }
    ]
  },
  "typeReunion": "DEP"
}