{
  "uid": "RUANR5L14S2018IDF0099999",
  "timestampDebut": "2017-11-21T18:00:00.000+01:00",
  "timestampFin": "2017-11-21T19:30:00.000+01:00",
  "lieu": {
    "code": "SALREU007",
    "libelleCourt": "4ème Bureau",
    "libelleLong": "4ème Bureau, Palais Bourbon"
  },
  "cycleDeVie": {
    "etat": "Confirmé",
    "chrono": {
      "creation": "2017-11-08T18:23:56.000+01:00"
    }
  },
  "demandeurs": {
    "organe": {
      "nom": "Groupe d'amitié France-Arabie Saoudite",
      "organeRef": "PO733482"
    }
  },
  "organeReuniRef": "PO733482",
  "typeReunion": "GA"
}