{
  "uid": "RUANR5L15S2018IDF0106133",
  "timestampDebut": "2018-02-24T09:00:00.000+01:00",
  "timestampFin": "2018-02-24T13:00:00.000+01:00",
  "lieu": {
    "code": "SALREU016",
    "libelleCourt": "Salon Gabriel",
    "libelleLong": "Salon Gabriel, 101, rue de l'Université"
  },
  "cycleDeVie": {
    "etat": "Confirmé",
    "chrono": {
      "creation": "2018-02-19T14:02:32.000+01:00"
    }
  },
  "demandeurs": {
    "acteurs": [
      {
        "nom": "Mme Bénédicte TAURINE",
        "acteurRef": "PA718860"
      }
    ]
  },
  "typeReunion": "DEP"
}