{
  "uid": "RUANR5L15S2018IDS20862",
  "timestampDebut": "2018-01-18T21:30:00.000+01:00",
  "timestampFin": "2018-01-18T23:35:00.000+01:00",
  "lieu": {
    "code": "AN",
    "libelleLong": "Assemblée nationale"
  },
  "cycleDeVie": {
    "etat": "Confirmé",
    "chrono": {
      "creation": "2017-12-15T00:00:00.000+01:00"
    }
  },
  "organeReuniRef": "PO717460",
  "sessionRef": "SCR5A2018O1",
  "ouverturePresse": true,
  "odj": {
    "pointsOdj": [
      {
        "xsiType": "podjSeanceConfPres_type",
        "uid": "RUANR5L15S2018IDS20862PT35437",
        "cycleDeVie": {
          "etat": "Confirmé",
          "chrono": {
            "creation": "2017-12-18T00:00:00.000+01:00"
          }
        },
        "objet": "Suite de la discussion de la proposition de loi visant à lutter contre la désertification médicale",
        "typePointOdj": "Suite de la discussion",
        "comiteSecret": false,
        "natureTravauxOdj": "ODJPR"
      },
      {
        "xsiType": "podjSeanceConfPres_type",
        "uid": "RUANR5L15S2018IDS20862PT35438",
        "cycleDeVie": {
          "etat": "Confirmé",
          "chrono": {
            "creation": "2017-12-18T00:00:00.000+01:00"
          }
        },
        "objet": "Suite de la discussion de la proposition de loi sur l'entreprise nouvelle et les nouvelles gouvernances",
        "typePointOdj": "Suite de la discussion",
        "comiteSecret": false,
        "natureTravauxOdj": "ODJPR"
      },
      {
        "xsiType": "podjSeanceConfPres_type",
        "uid": "RUANR5L15S2018IDS20862PT35439",
        "cycleDeVie": {
          "etat": "Confirmé",
          "chrono": {
            "creation": "2017-12-18T00:00:00.000+01:00"
          }
        },
        "objet": "Suite de la discussion de la proposition de loi, modifiée par le Sénat, relative aux modalités de dépôt de candidature aux élections",
        "typePointOdj": "Suite de la discussion",
        "comiteSecret": false,
        "natureTravauxOdj": "ODJPR"
      },
      {
        "xsiType": "podjSeanceConfPres_type",
        "uid": "RUANR5L15S2018IDS20862PT35440",
        "cycleDeVie": {
          "etat": "Confirmé",
          "chrono": {
            "creation": "2017-12-18T00:00:00.000+01:00"
          }
        },
        "objet": "Suite de la discussion de la proposition visant à faciliter la sortie de l'indivision successorale et à relancer la politique du logement en outre-mer",
        "dossiersLegislatifsRefs": [
          "DLR5L15N36209"
        ],
        "typePointOdj": "Suite de la discussion",
        "comiteSecret": false,
        "natureTravauxOdj": "ODJPR"
      }
    ]
  },
  "compteRenduRef": "CRSANR5L15S2018O1N117",
  "identifiants": {
    "numSeanceJo": "117",
    "idJo": "20180117",
    "quantieme": "Troisième",
    "dateSeance": "2018-01-18T01:00:00.000+01:00"
  }
}