{
  "uid": "RUANR5L14S2018IDF0100204",
  "timestampDebut": "2018-05-30T08:00:00.000+02:00",
  "timestampFin": "2018-05-30T10:00:00.000+02:00",
  "lieu": {
    "code": "SALREU008",
    "libelleCourt": "5ème Bureau",
    "libelleLong": "5ème Bureau, Palais Bourbon"
  },
  "cycleDeVie": {
    "etat": "Confirmé",
    "chrono": {
      "creation": "2017-11-13T10:50:05.000+01:00"
    }
  },
  "demandeurs": {
    "acteurs": [
      {
        "nom": "M. Philippe CHALUMEAU",
        "acteurRef": "PA719790"
      }
    ]
  },
  "typeReunion": "DEP"
}