{
  "uid": "RUANR5L14S2017IDF0094369",
  "timestampDebut": "2017-08-15T14:00:00.000+02:00",
  "timestampFin": "2017-08-15T15:00:00.000+02:00",
  "lieu": {
    "code": "SALREU028",
    "libelleCourt": "Salle Colbert",
    "libelleLong": "Salle Colbert , Palais Bourbon"
  },
  "cycleDeVie": {
    "etat": "Annulé",
    "chrono": {
      "creation": "2017-07-19T16:46:58.000+02:00",
      "cloture": "2017-08-03T09:19:34.000+02:00"
    }
  },
  "demandeurs": {
    "organe": {
      "nom": "GROUPE LA RÉPUBLIQUE EN MARCHE",
      "organeRef": "PO730964"
    }
  },
  "organeReuniRef": "PO730964",
  "typeReunion": "GP"
}