{
  "uid": "RUANR5L15S2018IDC428054",
  "timestampDebut": "2018-01-17T09:30:00.000+01:00",
  "timestampFin": "2018-01-17T12:30:00.000+01:00",
  "lieu": {
    "libelleLong": "salle Lamartine"
  },
  "cycleDeVie": {
    "etat": "Confirmé",
    "chrono": {
      "creation": "2017-12-06T00:00:00.000+01:00"
    }
  },
  "organeReuniRef": "PO419610",
  "participants": {
    "participantsInternes": [
      {
        "acteurRef": "PA722038",
        "presence": "présent"
      },
      {
        "acteurRef": "PA721278",
        "presence": "absent"
      },
      {
        "acteurRef": "PA335999",
        "presence": "présent"
      },
      {
        "acteurRef": "PA342415",
        "presence": "présent"
      },
      {
        "acteurRef": "PA722170",
        "presence": "excusé"
      },
      {
        "acteurRef": "PA332228",
        "presence": "présent"
      },
      {
        "acteurRef": "PA718876",
        "presence": "excusé"
      },
      {
        "acteurRef": "PA722312",
        "presence": "présent"
      },
      {
        "acteurRef": "PA718990",
        "presence": "présent"
      },
      {
        "acteurRef": "PA608641",
        "presence": "absent"
      },
      {
        "acteurRef": "PA720162",
        "presence": "présent"
      },
      {
        "acteurRef": "PA642695",
        "presence": "absent"
      },
      {
        "acteurRef": "PA336316",
        "presence": "excusé"
      },
      {
        "acteurRef": "PA721608",
        "presence": "présent"
      },
      {
        "acteurRef": "PA720546",
        "presence": "présent"
      },
      {
        "acteurRef": "PA767",
        "presence": "présent"
      },
      {
        "acteurRef": "PA720814",
        "presence": "présent"
      },
      {
        "acteurRef": "PA719440",
        "presence": "présent"
      },
      {
        "acteurRef": "PA642868",
        "presence": "présent"
      },
      {
        "acteurRef": "PA267429",
        "presence": "présent"
      },
      {
        "acteurRef": "PA721808",
        "presence": "présent"
      },
      {
        "acteurRef": "PA607155",
        "presence": "présent"
      },
      {
        "acteurRef": "PA267450",
        "presence": "présent"
      },
      {
        "acteurRef": "PA719258",
        "presence": "présent"
      },
      {
        "acteurRef": "PA719830",
        "presence": "présent"
      },
      {
        "acteurRef": "PA720598",
        "presence": "présent"
      },
      {
        "acteurRef": "PA720386",
        "presence": "présent"
      },
      {
        "acteurRef": "PA712015",
        "presence": "présent"
      },
      {
        "acteurRef": "PA721718",
        "presence": "absent"
      },
      {
        "acteurRef": "PA719660",
        "presence": "présent"
      },
      {
        "acteurRef": "PA607193",
        "presence": "absent"
      },
      {
        "acteurRef": "PA720664",
        "presence": "absent"
      },
      {
        "acteurRef": "PA334149",
        "presence": "présent"
      },
      {
        "acteurRef": "PA719960",
        "presence": "présent"
      },
      {
        "acteurRef": "PA721384",
        "presence": "présent"
      },
      {
        "acteurRef": "PA1592",
        "presence": "absent"
      },
      {
        "acteurRef": "PA719652",
        "presence": "excusé"
      },
      {
        "acteurRef": "PA722094",
        "presence": "présent"
      },
      {
        "acteurRef": "PA267355",
        "presence": "présent"
      },
      {
        "acteurRef": "PA719700",
        "presence": "présent"
      },
      {
        "acteurRef": "PA722202",
        "presence": "présent"
      },
      {
        "acteurRef": "PA719372",
        "presence": "présent"
      },
      {
        "acteurRef": "PA719504",
        "presence": "présent"
      },
      {
        "acteurRef": "PA331567",
        "presence": "absent"
      },
      {
        "acteurRef": "PA1838",
        "presence": "présent"
      },
      {
        "acteurRef": "PA719310",
        "presence": "présent"
      },
      {
        "acteurRef": "PA721852",
        "presence": "présent"
      },
      {
        "acteurRef": "PA340853",
        "presence": "présent"
      },
      {
        "acteurRef": "PA719388",
        "presence": "présent"
      },
      {
        "acteurRef": "PA720342",
        "presence": "présent"
      },
      {
        "acteurRef": "PA721134",
        "presence": "présent"
      },
      {
        "acteurRef": "PA719858",
        "presence": "excusé"
      },
      {
        "acteurRef": "PA720378",
        "presence": "présent"
      },
      {
        "acteurRef": "PA719154",
        "presence": "présent"
      },
      {
        "acteurRef": "PA720976",
        "presence": "présent"
      },
      {
        "acteurRef": "PA719338",
        "presence": "présent"
      },
      {
        "acteurRef": "PA719608",
        "presence": "présent"
      },
      {
        "acteurRef": "PA719242",
        "presence": "absent"
      },
      {
        "acteurRef": "PA719520",
        "presence": "absent"
      },
      {
        "acteurRef": "PA720644",
        "presence": "présent"
      },
      {
        "acteurRef": "PA720108",
        "presence": "présent"
      },
      {
        "acteurRef": "PA718784",
        "presence": "présent"
      },
      {
        "acteurRef": "PA718930",
        "presence": "présent"
      },
      {
        "acteurRef": "PA607553",
        "presence": "présent"
      },
      {
        "acteurRef": "PA720590",
        "presence": "excusé"
      },
      {
        "acteurRef": "PA720092",
        "presence": "présent"
      },
      {
        "acteurRef": "PA266808",
        "presence": "présent"
      },
      {
        "acteurRef": "PA722142",
        "presence": "présent"
      },
      {
        "acteurRef": "PA340343",
        "presence": "présent"
      },
      {
        "acteurRef": "PA720780",
        "presence": "présent"
      },
      {
        "acteurRef": "PA719420",
        "presence": "présent"
      },
      {
        "acteurRef": "PA334654",
        "presence": "présent"
      },
      {
        "acteurRef": "PA2792",
        "presence": "présent"
      },
      {
        "acteurRef": "PA718860",
        "presence": "présent"
      },
      {
        "acteurRef": "PA720014",
        "presence": "présent"
      },
      {
        "acteurRef": "PA722162",
        "presence": "absent"
      },
      {
        "acteurRef": "PA421348",
        "presence": "présent"
      },
      {
        "acteurRef": "PA2960",
        "presence": "présent"
      }
    ],
    "personnesAuditionnees": [
      {
        "xsiType": "IdPersonneExterne_type",
        "uid": "PE133",
        "ident": {
          "civ": "M.",
          "prenom": "Carlos",
          "nom": "Ghosn"
        },
        "dateNais": null
      }
    ]
  },
  "ouverturePresse": true,
  "odj": {
    "convocationOdj": [
      "Audition, conjointe avec la commission des finances, de M. Carlos Ghosn, président-directeur général de Renault."
    ],
    "resumeOdj": [
      "audition, conjointe avec la commission des finances, de M. Carlos Ghosn, président-directeur général de Renault."
    ]
  },
  "compteRenduRef": "CRCANR5L15S2018PO419610N032"
}