{
  "uid": "RUANR5L15S2018IDF0105291",
  "timestampDebut": "2018-04-18T16:00:00.000+02:00",
  "timestampFin": "2018-04-18T17:00:00.000+02:00",
  "lieu": {
    "code": "SALREU008",
    "libelleCourt": "5ème Bureau",
    "libelleLong": "5ème Bureau, Palais Bourbon"
  },
  "cycleDeVie": {
    "etat": "Confirmé",
    "chrono": {
      "creation": "2018-02-07T11:54:07.000+01:00"
    }
  },
  "demandeurs": {
    "acteurs": [
      {
        "nom": "Mme Valérie GOMEZ-BASSAC",
        "acteurRef": "PA721784"
      }
    ]
  },
  "typeReunion": "DEP"
}