{
  "uid": "RUANR5L15S2018IDF0103844",
  "timestampDebut": "2018-01-30T17:15:00.000+01:00",
  "timestampFin": "2018-01-30T18:00:00.000+01:00",
  "lieu": {
    "code": "SALREU006",
    "libelleCourt": "3ème Bureau",
    "libelleLong": "3ème Bureau, Palais Bourbon"
  },
  "cycleDeVie": {
    "etat": "Confirmé",
    "chrono": {
      "creation": "2018-01-17T15:48:08.000+01:00"
    }
  },
  "demandeurs": {
    "acteurs": [
      {
        "nom": "Mme Annie CHAPELIER",
        "acteurRef": "PA719448"
      }
    ]
  },
  "typeReunion": "DEP"
}