{
  "uid": "RUANR5L15S2018IDF0106729",
  "timestampDebut": "2018-03-07T18:00:00.000+01:00",
  "timestampFin": "2018-03-07T19:00:00.000+01:00",
  "lieu": {
    "code": "SALREU049",
    "libelleCourt": "Salle 6822",
    "libelleLong": "Salle 6822, Palais Bourbon"
  },
  "cycleDeVie": {
    "etat": "Confirmé",
    "chrono": {
      "creation": "2018-02-28T10:18:58.000+01:00"
    }
  },
  "demandeurs": {
    "acteurs": [
      {
        "nom": "M. Sylvain MAILLARD",
        "acteurRef": "PA717379"
      }
    ]
  },
  "typeReunion": "DEP"
}