{
  "uid": "RUANR5L15S2018IDF0104535",
  "timestampDebut": "2018-01-30T11:30:00.000+01:00",
  "timestampFin": "2018-01-30T14:00:00.000+01:00",
  "lieu": {
    "code": "SALREU006",
    "libelleCourt": "3ème Bureau",
    "libelleLong": "3ème Bureau, Palais Bourbon"
  },
  "cycleDeVie": {
    "etat": "Confirmé",
    "chrono": {
      "creation": "2018-01-29T11:40:31.000+01:00"
    }
  },
  "demandeurs": {
    "acteurs": [
      {
        "nom": "M. Robin REDA",
        "acteurRef": "PA721678"
      }
    ]
  },
  "typeReunion": "DEP"
}