{
  "uid": "RUANR5L14S2018IDF0098338",
  "timestampDebut": "2017-11-09T14:00:00.000+01:00",
  "timestampFin": "2017-11-09T16:00:00.000+01:00",
  "lieu": {
    "code": "SALREU008",
    "libelleCourt": "5ème Bureau",
    "libelleLong": "5ème Bureau, Palais Bourbon"
  },
  "cycleDeVie": {
    "etat": "Confirmé",
    "chrono": {
      "creation": "2017-10-10T17:46:23.000+02:00"
    }
  },
  "demandeurs": {
    "acteurs": [
      {
        "nom": "M. Frédéric DESCROZAILLE",
        "acteurRef": "PA720862"
      }
    ]
  },
  "typeReunion": "DEP"
}