{
  "uid": "RUANR5L14S2018IDF0102835",
  "timestampDebut": "2018-05-15T10:45:00.000+02:00",
  "timestampFin": "2018-05-15T11:15:00.000+02:00",
  "lieu": {
    "code": "SALREU027",
    "libelleCourt": "Salle 6217",
    "libelleLong": "Salle 6217, Palais Bourbon"
  },
  "cycleDeVie": {
    "etat": "Confirmé",
    "chrono": {
      "creation": "2017-12-20T15:14:21.000+01:00"
    }
  },
  "demandeurs": {
    "organe": {
      "nom": "GROUPE LES RÉPUBLICAINS",
      "organeRef": "PO730934"
    }
  },
  "organeReuniRef": "PO730934",
  "typeReunion": "GP"
}