{
  "uid": "RUANR5L14S2018IDF0100045",
  "timestampDebut": "2017-11-15T16:15:00.000+01:00",
  "timestampFin": "2017-11-15T17:15:00.000+01:00",
  "lieu": {
    "code": "SALREU028",
    "libelleCourt": "Salle Colbert",
    "libelleLong": "Salle Colbert , Palais Bourbon"
  },
  "cycleDeVie": {
    "etat": "Confirmé",
    "chrono": {
      "creation": "2017-11-09T14:55:07.000+01:00"
    }
  },
  "demandeurs": {
    "acteurs": [
      {
        "nom": "Mme Caroline ABADIE",
        "acteurRef": "PA719866"
      }
    ]
  },
  "typeReunion": "DEP"
}