{
  "uid": "RUANR5L15S2017IDC427127",
  "timestampDebut": "2017-07-18T17:10:00.000+02:00",
  "timestampFin": "2017-07-18T18:35:00.000+02:00",
  "lieu": {
    "libelleLong": "salle 6566 (Lois)"
  },
  "cycleDeVie": {
    "etat": "Confirmé",
    "chrono": {
      "creation": "2017-07-11T00:00:00.000+02:00"
    }
  },
  "organeReuniRef": "PO675659",
  "participants": {
    "participantsInternes": [
      {
        "acteurRef": "PA721036",
        "presence": "absent"
      },
      {
        "acteurRef": "PA724827",
        "presence": "présent"
      },
      {
        "acteurRef": "PA610634",
        "presence": "présent"
      },
      {
        "acteurRef": "PA610681",
        "presence": "présent"
      },
      {
        "acteurRef": "PA721046",
        "presence": "absent"
      },
      {
        "acteurRef": "PA441",
        "presence": "absent"
      },
      {
        "acteurRef": "PA720968",
        "presence": "présent"
      },
      {
        "acteurRef": "PA721118",
        "presence": "absent"
      },
      {
        "acteurRef": "PA267306",
        "presence": "présent"
      },
      {
        "acteurRef": "PA606202",
        "presence": "présent"
      },
      {
        "acteurRef": "PA721094",
        "presence": "absent"
      },
      {
        "acteurRef": "PA607193",
        "presence": "présent"
      },
      {
        "acteurRef": "PA721702",
        "presence": "présent"
      },
      {
        "acteurRef": "PA266774",
        "presence": "présent"
      },
      {
        "acteurRef": "PA719108",
        "presence": "présent"
      },
      {
        "acteurRef": "PA337633",
        "presence": "absent"
      },
      {
        "acteurRef": "PA610775",
        "presence": "présent"
      },
      {
        "acteurRef": "PA266797",
        "presence": "présent"
      },
      {
        "acteurRef": "PA721126",
        "presence": "présent"
      },
      {
        "acteurRef": "PA720354",
        "presence": "présent"
      },
      {
        "acteurRef": "PA720038",
        "presence": "présent"
      },
      {
        "acteurRef": "PA722344",
        "presence": "présent"
      },
      {
        "acteurRef": "PA267901",
        "presence": "absent"
      },
      {
        "acteurRef": "PA721644",
        "presence": "présent"
      },
      {
        "acteurRef": "PA268019",
        "presence": "absent"
      },
      {
        "acteurRef": "PA605518",
        "presence": "absent"
      },
      {
        "acteurRef": "PA718978",
        "presence": "présent"
      },
      {
        "acteurRef": "PA721852",
        "presence": "présent"
      },
      {
        "acteurRef": "PA720480",
        "presence": "présent"
      },
      {
        "acteurRef": "PA337483",
        "presence": "absent"
      },
      {
        "acteurRef": "PA721054",
        "presence": "présent"
      },
      {
        "acteurRef": "PA720988",
        "presence": "présent"
      },
      {
        "acteurRef": "PA720976",
        "presence": "présent"
      },
      {
        "acteurRef": "PA719130",
        "presence": "présent"
      },
      {
        "acteurRef": "PA610654",
        "presence": "présent"
      },
      {
        "acteurRef": "PA721960",
        "presence": "présent"
      },
      {
        "acteurRef": "PA335532",
        "presence": "absent"
      },
      {
        "acteurRef": "PA721234",
        "presence": "présent"
      },
      {
        "acteurRef": "PA693008",
        "presence": "absent"
      },
      {
        "acteurRef": "PA2492",
        "presence": "présent"
      },
      {
        "acteurRef": "PA721286",
        "presence": "présent"
      },
      {
        "acteurRef": "PA721070",
        "presence": "présent"
      },
      {
        "acteurRef": "PA721888",
        "presence": "présent"
      },
      {
        "acteurRef": "PA721062",
        "presence": "présent"
      },
      {
        "acteurRef": "PA721824",
        "presence": "absent"
      },
      {
        "acteurRef": "PA720900",
        "presence": "présent"
      },
      {
        "acteurRef": "PA610733",
        "presence": "présent"
      },
      {
        "acteurRef": "PA702052",
        "presence": "présent"
      },
      {
        "acteurRef": "PA721110",
        "presence": "absent"
      },
      {
        "acteurRef": "PA720960",
        "presence": "présent"
      },
      {
        "acteurRef": "PA610667",
        "presence": "absent"
      },
      {
        "acteurRef": "PA718780",
        "presence": "présent"
      },
      {
        "acteurRef": "PA643145",
        "presence": "présent"
      },
      {
        "acteurRef": "PA331582",
        "presence": "présent"
      }
    ]
  },
  "ouverturePresse": false,
  "odj": {
    "convocationOdj": [
      "élection du Bureau."
    ],
    "resumeOdj": [
      "élection du Bureau."
    ]
  }
}