{
  "uid": "RUANR5L14S2018IDF0102251",
  "timestampDebut": "2017-12-20T12:30:00.000+01:00",
  "timestampFin": "2017-12-20T15:00:00.000+01:00",
  "lieu": {
    "code": "SALREU021",
    "libelleCourt": "Salle 7207",
    "libelleLong": "Salle 7207, 101, rue de l'Université"
  },
  "cycleDeVie": {
    "etat": "Confirmé",
    "chrono": {
      "creation": "2017-12-13T11:56:34.000+01:00",
      "cloture": "2017-12-18T18:50:03.000+01:00"
    }
  },
  "demandeurs": {
    "acteurs": [
      {
        "nom": "Mme Laetitia AVIA",
        "acteurRef": "PA721624"
      }
    ]
  },
  "typeReunion": "DEP"
}