{
  "uid": "RUANR5L15S2018IDF0106178",
  "timestampDebut": "2018-02-23T15:00:00.000+01:00",
  "timestampFin": "2018-02-23T17:00:00.000+01:00",
  "lieu": {
    "code": "SALREU021",
    "libelleCourt": "Salle 7207",
    "libelleLong": "Salle 7207, 101, rue de l'Université"
  },
  "cycleDeVie": {
    "etat": "Confirmé",
    "chrono": {
      "creation": "2018-02-19T17:11:47.000+01:00"
    }
  },
  "demandeurs": {
    "acteurs": [
      {
        "nom": "M. Michel LARIVE",
        "acteurRef": "PA718868"
      }
    ]
  },
  "typeReunion": "DEP"
}