{
  "uid": "RUANR5L14S2017IDF0094577",
  "timestampDebut": "2017-09-12T14:00:00.000+02:00",
  "timestampFin": "2017-09-12T15:00:00.000+02:00",
  "lieu": {
    "code": "SALREU003",
    "libelleCourt": "Salle Victor Hugo",
    "libelleLong": "Salle Victor Hugo, 101, rue de l'Université"
  },
  "cycleDeVie": {
    "etat": "Confirmé",
    "chrono": {
      "creation": "2017-07-24T14:40:17.000+02:00"
    }
  },
  "demandeurs": {
    "acteurs": [
      {
        "nom": "Mme Amélie DE MONTCHALIN",
        "acteurRef": "PA721670"
      }
    ]
  },
  "typeReunion": "DEP"
}