{
  "uid": "RUANR5L14S2018IDF0099636",
  "timestampDebut": "2017-11-07T17:00:00.000+01:00",
  "timestampFin": "2017-11-07T18:30:00.000+01:00",
  "lieu": {
    "code": "SALREU041",
    "libelleCourt": "Sully 5",
    "libelleLong": "Sully 5, Palais Bourbon"
  },
  "cycleDeVie": {
    "etat": "Confirmé",
    "chrono": {
      "creation": "2017-11-02T11:12:24.000+01:00"
    }
  },
  "demandeurs": {
    "organe": {
      "nom": "Groupe d'amitié France-Guinée",
      "organeRef": "PO733327"
    }
  },
  "organeReuniRef": "PO733327",
  "typeReunion": "GA"
}