{
  "uid": "RUANR5L14S2018IDF0098093",
  "timestampDebut": "2017-10-10T12:00:00.000+02:00",
  "timestampFin": "2017-10-10T13:00:00.000+02:00",
  "lieu": {
    "code": "SALREU049",
    "libelleCourt": "Salle 6822",
    "libelleLong": "Salle 6822, Palais Bourbon"
  },
  "cycleDeVie": {
    "etat": "Confirmé",
    "chrono": {
      "creation": "2017-10-05T17:04:32.000+02:00"
    }
  },
  "demandeurs": {
    "acteurs": [
      {
        "nom": "M. Jacques MARILOSSIAN",
        "acteurRef": "PA721946"
      }
    ]
  },
  "typeReunion": "DEP"
}