{
  "uid": "RUANR5L14S2017IDF0095158",
  "timestampDebut": "2017-09-28T14:00:00.000+02:00",
  "timestampFin": "2017-09-28T17:00:00.000+02:00",
  "lieu": {
    "code": "SALREU021",
    "libelleCourt": "Salle 7207",
    "libelleLong": "Salle 7207, 101, rue de l'Université"
  },
  "cycleDeVie": {
    "etat": "Confirmé",
    "chrono": {
      "creation": "2017-08-03T16:17:27.000+02:00"
    }
  },
  "demandeurs": {
    "acteurs": [
      {
        "nom": "Mme Perrine GOULET",
        "acteurRef": "PA720560"
      }
    ]
  },
  "typeReunion": "DEP"
}