{
  "uid": "RUANR5L15S2017IDS20655",
  "timestampDebut": "2017-08-02T15:00:00.000+02:00",
  "timestampFin": "2017-08-02T18:55:00.000+02:00",
  "lieu": {
    "code": "AN",
    "libelleLong": "Assemblée nationale"
  },
  "cycleDeVie": {
    "etat": "Confirmé",
    "chrono": {
      "creation": "2017-07-10T00:00:00.000+02:00"
    }
  },
  "organeReuniRef": "PO717460",
  "sessionRef": "SCR5A2017E1",
  "ouverturePresse": true,
  "odj": {
    "pointsOdj": [
      {
        "xsiType": "podjSeanceConfPres_type",
        "uid": "RUANR5L15S2017IDS20655PT35020",
        "cycleDeVie": {
          "etat": "Confirmé",
          "chrono": {
            "creation": "2017-07-10T00:00:00.000+02:00"
          }
        },
        "objet": "Questions au Gouvernement",
        "typePointOdj": "Questions au Gouvernement",
        "comiteSecret": false,
        "natureTravauxOdj": "ODJPR"
      },
      {
        "xsiType": "podjSeanceConfPres_type",
        "uid": "RUANR5L15S2017IDS20655PT35006",
        "cycleDeVie": {
          "etat": "Confirmé",
          "chrono": {
            "creation": "2017-07-10T00:00:00.000+02:00"
          }
        },
        "objet": "Discussion du projet de loi autorisant l’approbation de la convention d’entraide judiciaire en matière pénale entre le Gouvernement de la République française et le Gouvernement de la République algérienne démocratique et populaire",
        "procedure": "procédure d'examen simplifiée-Article 103",
        "dossiersLegislatifsRefs": [
          "DLR5L15N35842"
        ],
        "typePointOdj": "Discussion",
        "comiteSecret": false,
        "natureTravauxOdj": "ODJPR"
      },
      {
        "xsiType": "podjSeanceConfPres_type",
        "uid": "RUANR5L15S2017IDS20655PT35005",
        "cycleDeVie": {
          "etat": "Supprimé",
          "chrono": {
            "creation": "2017-07-10T00:00:00.000+02:00",
            "cloture": "2017-07-24T00:00:00.000+02:00"
          }
        },
        "objet": "Discussion du projet de loi autorisant l'approbation du protocole annexe à la convention générale entre le Gouvernement de la République française et le Gouvernement de la République algérienne démocratique et populaire sur la sécurité sociale du 1er octobre 1980 relatif aux soins de santé programmés dispensés en France aux ressortissants algériens assurés sociaux et démunis non assurés sociaux résident en Algérie",
        "procedure": "procédure d'examen simplifiée-Article 103",
        "typePointOdj": "Discussion",
        "comiteSecret": false,
        "natureTravauxOdj": "ODJPR"
      },
      {
        "xsiType": "podjSeanceConfPres_type",
        "uid": "RUANR5L15S2017IDS20655PT35007",
        "cycleDeVie": {
          "etat": "Confirmé",
          "chrono": {
            "creation": "2017-07-10T00:00:00.000+02:00"
          }
        },
        "objet": "Discussion du projet de loi, adopté par le Sénat, autorisant l'approbation de l'accord entre le Gouvernement de la République française et le Gouvernement de la République algérienne démocratique et populaire relatif aux échanges de jeunes actifs",
        "procedure": "procédure d'examen simplifiée-Article 103",
        "dossiersLegislatifsRefs": [
          "DLR5L14N35343"
        ],
        "typePointOdj": "Discussion",
        "comiteSecret": false,
        "natureTravauxOdj": "ODJPR"
      },
      {
        "xsiType": "podjSeanceConfPres_type",
        "uid": "RUANR5L15S2017IDS20655PT35008",
        "cycleDeVie": {
          "etat": "Confirmé",
          "chrono": {
            "creation": "2017-07-10T00:00:00.000+02:00"
          }
        },
        "objet": "Discussion du projet de loi, adopté par le Sénat, autorisant la ratification du protocole additionnel à la convention du Conseil de l'Europe pour la prévention du terrorisme",
        "procedure": "procédure d'examen simplifiée-Article 103",
        "dossiersLegislatifsRefs": [
          "DLR5L14N35271"
        ],
        "typePointOdj": "Discussion",
        "comiteSecret": false,
        "natureTravauxOdj": "ODJPR"
      },
      {
        "xsiType": "podjSeanceConfPres_type",
        "uid": "RUANR5L15S2017IDS20655PT35004",
        "cycleDeVie": {
          "etat": "Confirmé",
          "chrono": {
            "creation": "2017-07-10T00:00:00.000+02:00"
          }
        },
        "objet": "Discussion du projet de loi autorisant la ratification du protocole relatif à la convention pour la répression d’actes illicites contre la sécurité de la navigation maritime et du protocole relatif au protocole pour la répression d’actes illicites contre la sécurité des plates-formes fixes situées sur le plateau continental",
        "dossiersLegislatifsRefs": [
          "DLR5L15N35845"
        ],
        "typePointOdj": "Discussion",
        "comiteSecret": false,
        "natureTravauxOdj": "ODJPR"
      },
      {
        "xsiType": "podjSeanceConfPres_type",
        "uid": "RUANR5L15S2017IDS20655PT35009",
        "cycleDeVie": {
          "etat": "Supprimé",
          "chrono": {
            "creation": "2017-07-10T00:00:00.000+02:00",
            "cloture": "2017-08-01T00:00:00.000+02:00"
          }
        },
        "objet": "Éventuellement, suite de la discussion sur le rapport de la commission mixte paritaire du projet de loi d'habilitation à prendre par ordonnances les mesures pour le renforcement du dialogue social",
        "typePointOdj": "Suite de la discussion",
        "comiteSecret": false,
        "natureTravauxOdj": "ODJPR"
      },
      {
        "xsiType": "podjSeanceConfPres_type",
        "uid": "RUANR5L15S2017IDS20655PT35011",
        "cycleDeVie": {
          "etat": "Confirmé",
          "chrono": {
            "creation": "2017-07-10T00:00:00.000+02:00"
          }
        },
        "objet": "Discussion, en deuxième lecture, du projet de loi, modifié par le Sénat, ratifiant l'ordonnance n° 2016-1360 du 13 octobre 2016 modifiant la partie législative du code des juridictions financières",
        "dossiersLegislatifsRefs": [
          "DLR5L14N35489"
        ],
        "typePointOdj": "Discussion",
        "comiteSecret": false,
        "natureTravauxOdj": "ODJPR"
      },
      {
        "xsiType": "podjSeanceConfPres_type",
        "uid": "RUANR5L15S2017IDS20655PT35010",
        "cycleDeVie": {
          "etat": "Supprimé",
          "chrono": {
            "creation": "2017-07-10T00:00:00.000+02:00",
            "cloture": "2017-07-10T00:00:00.000+02:00"
          }
        },
        "objet": "Discussion, en deuxième lecture, du projet de loi ratifiant l'ordonnance n°2016-1360 du 13 octobre 2016 modifiant la partie législative du code des juridictions financières",
        "typePointOdj": "Discussion",
        "comiteSecret": false,
        "natureTravauxOdj": "ODJPR"
      }
    ]
  },
  "compteRenduRef": "CRSANR5L15S2017E1N030",
  "identifiants": {
    "numSeanceJo": "30",
    "idJo": "20171030",
    "quantieme": "Unique",
    "dateSeance": "2017-08-02T02:00:00.000+02:00"
  }
}