{
  "uid": "RUANR5L15S2018IDF0104143",
  "timestampDebut": "2018-06-26T17:30:00.000+02:00",
  "timestampFin": "2018-06-26T19:00:00.000+02:00",
  "lieu": {
    "code": "SALREU025",
    "libelleCourt": "7ème Bureau",
    "libelleLong": "7ème Bureau, Palais Bourbon"
  },
  "cycleDeVie": {
    "etat": "Confirmé",
    "chrono": {
      "creation": "2018-01-22T16:33:08.000+01:00"
    }
  },
  "demandeurs": {
    "organe": {
      "nom": "GROUPE DU MOUVEMENT DÉMOCRATE ET APPARENTÉS",
      "organeRef": "PO730970"
    }
  },
  "organeReuniRef": "PO730970",
  "typeReunion": "GP"
}