{
  "uid": "RUANR5L15S2018IDF0105248",
  "timestampDebut": "2018-02-20T18:30:00.000+01:00",
  "timestampFin": "2018-02-20T20:00:00.000+01:00",
  "lieu": {
    "code": "SALREU016",
    "libelleCourt": "Salon Gabriel",
    "libelleLong": "Salon Gabriel, 101, rue de l'Université"
  },
  "cycleDeVie": {
    "etat": "Annulé",
    "chrono": {
      "creation": "2018-02-06T17:51:04.000+01:00",
      "cloture": "2018-02-19T17:50:55.000+01:00"
    }
  },
  "demandeurs": {
    "acteurs": [
      {
        "nom": "M. Jean-Claude LECLABART",
        "acteurRef": "PA722228"
      }
    ]
  },
  "typeReunion": "DEP"
}