{
  "uid": "RUANR5L14S2018IDF0099766",
  "timestampDebut": "2017-11-17T09:30:00.000+01:00",
  "timestampFin": "2017-11-17T17:00:00.000+01:00",
  "lieu": {
    "code": "SALREU002",
    "libelleCourt": "Salle 7070",
    "libelleLong": "Salle 7070, 103, rue de l'Université"
  },
  "cycleDeVie": {
    "etat": "Confirmé",
    "chrono": {
      "creation": "2017-11-06T11:42:07.000+01:00"
    }
  },
  "demandeurs": {
    "acteurs": [
      {
        "nom": "Mme Yolaine DE COURSON",
        "acteurRef": "PA719194"
      }
    ]
  },
  "typeReunion": "DEP"
}