{
  "uid": "RUANR5L15S2018IDF0105324",
  "timestampDebut": "2018-02-09T14:00:00.000+01:00",
  "timestampFin": "2018-02-09T20:00:00.000+01:00",
  "lieu": {
    "code": "SALREU049",
    "libelleCourt": "Salle 6822",
    "libelleLong": "Salle 6822, Palais Bourbon"
  },
  "cycleDeVie": {
    "etat": "Confirmé",
    "chrono": {
      "creation": "2018-02-07T16:39:22.000+01:00"
    }
  },
  "demandeurs": {
    "acteurs": [
      {
        "nom": "M. Aurélien TACHÉ",
        "acteurRef": "PA720952"
      }
    ]
  },
  "typeReunion": "DEP"
}