{
  "uid": "RUANR5L14S2018IDF0103033",
  "timestampDebut": "2018-01-10T14:00:00.000+01:00",
  "timestampFin": "2018-01-10T15:00:00.000+01:00",
  "lieu": {
    "code": "SALREU007",
    "libelleCourt": "4ème Bureau",
    "libelleLong": "4ème Bureau, Palais Bourbon"
  },
  "cycleDeVie": {
    "etat": "Confirmé",
    "chrono": {
      "creation": "2017-12-21T19:47:58.000+01:00"
    }
  },
  "demandeurs": {
    "acteurs": [
      {
        "nom": "M. Jean-Michel MIS",
        "acteurRef": "PA719952"
      }
    ]
  },
  "typeReunion": "DEP"
}