{
  "uid": "RUANR5L14S2018IDF0102109",
  "timestampDebut": "2018-03-15T13:00:00.000+01:00",
  "timestampFin": "2018-03-15T19:00:00.000+01:00",
  "lieu": {
    "code": "SALREU028",
    "libelleCourt": "Salle Colbert",
    "libelleLong": "Salle Colbert , Palais Bourbon"
  },
  "cycleDeVie": {
    "etat": "Confirmé",
    "chrono": {
      "creation": "2017-12-08T17:13:10.000+01:00"
    }
  },
  "demandeurs": {
    "acteurs": [
      {
        "nom": "M. Hugues RENSON",
        "acteurRef": "PA721824"
      }
    ]
  },
  "typeReunion": "DEP"
}