{
  "uid": "RUANR5L15S2018IDF0103155",
  "timestampDebut": "2018-01-18T15:30:00.000+01:00",
  "timestampFin": "2018-01-18T17:30:00.000+01:00",
  "lieu": {
    "code": "SALREU022",
    "libelleCourt": "Salle 7326",
    "libelleLong": "Salle 7326, 101, rue de l'Université"
  },
  "cycleDeVie": {
    "etat": "Confirmé",
    "chrono": {
      "creation": "2018-01-04T11:09:02.000+01:00"
    }
  },
  "demandeurs": {
    "acteurs": [
      {
        "nom": "M. Joachim SON-FORGET",
        "acteurRef": "PA721174"
      }
    ]
  },
  "typeReunion": "DEP"
}