{
  "uid": "RUANR5L15S2017IDS20656",
  "timestampDebut": "2017-08-02T21:30:00.000+02:00",
  "lieu": {
    "code": "AN",
    "libelleLong": "Assemblée nationale"
  },
  "cycleDeVie": {
    "etat": "Supprimé",
    "chrono": {
      "creation": "2017-07-10T00:00:00.000+02:00",
      "cloture": "2017-08-03T00:00:00.000+02:00"
    }
  },
  "organeReuniRef": "PO717460",
  "sessionRef": "SCR5A2017E1",
  "ouverturePresse": true,
  "odj": {
    "pointsOdj": [
      {
        "xsiType": "podjSeanceConfPres_type",
        "uid": "RUANR5L15S2017IDS20656PT35054",
        "cycleDeVie": {
          "etat": "Supprimé",
          "chrono": {
            "creation": "2017-08-01T00:00:00.000+02:00",
            "cloture": "2017-08-03T00:00:00.000+02:00"
          }
        },
        "objet": "Suite de la discussion du projet de loi autorisant la ratification du protocole relatif à la convention pour la répression d’actes illicites contre la sécurité de la navigation maritime et du protocole relatif au protocole pour la répression d’actes illicites contre la sécurité des plates-formes fixes situées sur le plateau continental",
        "typePointOdj": "Suite de la discussion",
        "comiteSecret": false,
        "natureTravauxOdj": "ODJPR"
      },
      {
        "xsiType": "podjSeanceConfPres_type",
        "uid": "RUANR5L15S2017IDS20656PT35012",
        "cycleDeVie": {
          "etat": "Supprimé",
          "chrono": {
            "creation": "2017-07-10T00:00:00.000+02:00",
            "cloture": "2017-08-01T00:00:00.000+02:00"
          }
        },
        "objet": "Éventuellement, suite de la discussion, soit sur le rapport de la commission mixte paritaire, soit en nouvelle lecture, du projet de loi d'habilitation à prendre par ordonnances les mesures pour le renforcement du dialogue social",
        "typePointOdj": "Suite de la discussion",
        "comiteSecret": false,
        "natureTravauxOdj": "ODJPR"
      },
      {
        "xsiType": "podjSeanceConfPres_type",
        "uid": "RUANR5L15S2017IDS20656PT35013",
        "cycleDeVie": {
          "etat": "Supprimé",
          "chrono": {
            "creation": "2017-07-10T00:00:00.000+02:00",
            "cloture": "2017-08-03T00:00:00.000+02:00"
          }
        },
        "objet": "Suite de la discussion, en deuxième lecture, du projet de loi, modifié par le Sénat, ratifiant l'ordonnance n° 2016-1360 du 13 octobre 2016 modifiant la partie législative du code des juridictions financières",
        "typePointOdj": "Suite de la discussion",
        "comiteSecret": false,
        "natureTravauxOdj": "ODJPR"
      }
    ]
  },
  "identifiants": {
    "quantieme": "Deuxième",
    "dateSeance": "2017-08-02T02:00:00.000+02:00"
  }
}