{
  "uid": "RUANR5L15S2018IDF0104297",
  "timestampDebut": "2018-02-07T14:00:00.000+01:00",
  "timestampFin": "2018-02-07T15:00:00.000+01:00",
  "lieu": {
    "code": "SALREU013",
    "libelleCourt": "Salle N° 3",
    "libelleLong": "Salle N° 3, 3, rue Aristide Briand"
  },
  "cycleDeVie": {
    "etat": "Confirmé",
    "chrono": {
      "creation": "2018-01-24T12:21:06.000+01:00"
    }
  },
  "demandeurs": {
    "acteurs": [
      {
        "nom": "Mme Sabine RUBIN",
        "acteurRef": "PA721226"
      }
    ]
  },
  "typeReunion": "DEP"
}