{
  "uid": "RUANR5L15S2018IDF0104730",
  "timestampDebut": "2018-01-31T14:00:00.000+01:00",
  "timestampFin": "2018-01-31T15:00:00.000+01:00",
  "lieu": {
    "code": "SALREU032",
    "libelleCourt": "Sully 4",
    "libelleLong": "Sully 4, Palais Bourbon"
  },
  "cycleDeVie": {
    "etat": "Confirmé",
    "chrono": {
      "creation": "2018-01-30T18:43:19.000+01:00"
    }
  },
  "demandeurs": {
    "acteurs": [
      {
        "nom": "Mme Monica MICHEL",
        "acteurRef": "PA719130"
      }
    ]
  },
  "typeReunion": "DEP"
}