{
  "uid": "RUANR5L14S2018IDF0102728",
  "timestampDebut": "2018-02-01T09:00:00.000+01:00",
  "timestampFin": "2018-02-01T10:30:00.000+01:00",
  "lieu": {
    "code": "SALREU013",
    "libelleCourt": "Salle N° 3",
    "libelleLong": "Salle N° 3, 3, rue Aristide Briand"
  },
  "cycleDeVie": {
    "etat": "Confirmé",
    "chrono": {
      "creation": "2017-12-19T20:21:56.000+01:00"
    }
  },
  "demandeurs": {
    "acteurs": [
      {
        "nom": "M. Adrien TAQUET",
        "acteurRef": "PA722086"
      }
    ]
  },
  "typeReunion": "DEP"
}