{
  "uid": "RUANR5L15S2018IDF0106694",
  "timestampDebut": "2018-03-06T18:30:00.000+01:00",
  "timestampFin": "2018-03-06T19:30:00.000+01:00",
  "lieu": {
    "code": "SALREU022",
    "libelleCourt": "Salle 7326",
    "libelleLong": "Salle 7326, 101, rue de l'Université"
  },
  "cycleDeVie": {
    "etat": "Confirmé",
    "chrono": {
      "creation": "2018-02-27T15:24:09.000+01:00"
    }
  },
  "demandeurs": {
    "acteurs": [
      {
        "nom": "M. Aurélien TACHÉ",
        "acteurRef": "PA720952"
      }
    ]
  },
  "typeReunion": "DEP"
}