{
  "uid": "RUANR5L14S2017IDF0095630",
  "timestampDebut": "2017-09-13T08:00:00.000+02:00",
  "timestampFin": "2017-09-13T09:00:00.000+02:00",
  "lieu": {
    "code": "SALREU039",
    "libelleCourt": "Salle 6550",
    "libelleLong": "Salle 6550, Palais Bourbon"
  },
  "cycleDeVie": {
    "etat": "Confirmé",
    "chrono": {
      "creation": "2017-09-04T16:17:15.000+02:00"
    }
  },
  "demandeurs": {
    "acteurs": [
      {
        "nom": "M. Éric WOERTH",
        "acteurRef": "PA2960"
      }
    ]
  },
  "typeReunion": "DEP"
}