{
  "uid": "RUANR5L15S2018IDC428629",
  "timestampDebut": "2018-03-08T10:00:00.000+01:00",
  "lieu": {
    "libelleLong": "salle 6237 (Développement durable)"
  },
  "cycleDeVie": {
    "etat": "Confirmé",
    "chrono": {
      "creation": "2018-02-16T00:00:00.000+01:00"
    }
  },
  "organeReuniRef": "PO748336",
  "participants": {},
  "ouverturePresse": true,
  "odj": {
    "convocationOdj": [
      "Audition de M. Pierre-Marie Abadie, directeur de l’agence nationale pour la gestion des déchets radioactifs (ANDRA) ;"
    ],
    "resumeOdj": [
      "audition de M. Pierre-Marie Abadie, directeur de l’agence nationale pour la gestion des déchets radioactifs (ANDRA)."
    ]
  }
}