{
  "uid": "RUANR5L14S2018IDF0100090",
  "timestampDebut": "2017-12-20T15:30:00.000+01:00",
  "timestampFin": "2017-12-20T16:30:00.000+01:00",
  "lieu": {
    "code": "SALREU028",
    "libelleCourt": "Salle Colbert",
    "libelleLong": "Salle Colbert , Palais Bourbon"
  },
  "cycleDeVie": {
    "etat": "Confirmé",
    "chrono": {
      "creation": "2017-11-09T18:59:58.000+01:00"
    }
  },
  "demandeurs": {
    "acteurs": [
      {
        "nom": "Mme Annaïg LE MEUR",
        "acteurRef": "PA719388"
      }
    ]
  },
  "typeReunion": "DEP"
}