{
  "uid": "RUANR5L14S2017IDF0095301",
  "timestampDebut": "2017-09-20T14:00:00.000+02:00",
  "timestampFin": "2017-09-20T18:00:00.000+02:00",
  "lieu": {
    "code": "SALREU019",
    "libelleCourt": "Salon Mars I",
    "libelleLong": "Salon Mars I, 101, rue de l'Université"
  },
  "cycleDeVie": {
    "etat": "Confirmé",
    "chrono": {
      "creation": "2017-08-10T12:07:41.000+02:00"
    }
  },
  "demandeurs": {
    "acteurs": [
      {
        "nom": "M. Rémy REBEYROTTE",
        "acteurRef": "PA722398"
      }
    ]
  },
  "typeReunion": "DEP"
}