{
  "uid": "RUANR5L14S2018IDF0101070",
  "timestampDebut": "2017-11-28T09:00:00.000+01:00",
  "timestampFin": "2017-11-28T11:30:00.000+01:00",
  "lieu": {
    "code": "SALREU032",
    "libelleCourt": "Sully 4",
    "libelleLong": "Sully 4, Palais Bourbon"
  },
  "cycleDeVie": {
    "etat": "Confirmé",
    "chrono": {
      "creation": "2017-11-21T14:26:33.000+01:00"
    }
  },
  "demandeurs": {
    "acteurs": [
      {
        "nom": "M. Christophe NAEGELEN",
        "acteurRef": "PA721486"
      }
    ]
  },
  "typeReunion": "DEP"
}