{
  "uid": "RUANR5L15S2018IDC428581",
  "timestampDebut": "2018-03-13T18:00:00.000+01:00",
  "lieu": {
    "libelleLong": "salle 4204 (33, rue Saint-Dominique - 2ème étage)"
  },
  "cycleDeVie": {
    "etat": "Eventuel",
    "chrono": {
      "creation": "2018-02-12T00:00:00.000+01:00"
    }
  },
  "organeReuniRef": "PO744364",
  "participants": {},
  "ouverturePresse": false,
  "odj": {
    "convocationOdj": [
      "– Audition de M. David Levaï, Directeur du Programme Climat par intérim à l’Institut du Développement Durable et des Relations Internationales (IDDRI)."
    ],
    "resumeOdj": [
      "audition de M. David Levaï, Directeur du Programme Climat par intérim à l’Institut du Développement Durable et des Relations Internationales (IDDRI)."
    ]
  }
}