{
  "uid": "RUANR5L14S2018IDF0102206",
  "timestampDebut": "2018-01-17T09:00:00.000+01:00",
  "timestampFin": "2018-01-17T19:00:00.000+01:00",
  "lieu": {
    "code": "SALREU016",
    "libelleCourt": "Salon Gabriel",
    "libelleLong": "Salon Gabriel, 101, rue de l'Université"
  },
  "cycleDeVie": {
    "etat": "Confirmé",
    "chrono": {
      "creation": "2017-12-12T17:21:22.000+01:00"
    }
  },
  "demandeurs": {
    "acteurs": [
      {
        "nom": "Mme Emmanuelle MÉNARD",
        "acteurRef": "PA719608"
      }
    ]
  },
  "typeReunion": "DEP"
}