{
  "uid": "RUANR5L15S2018IDC427546",
  "timestampDebut": "2017-10-31T13:30:00.000+01:00",
  "timestampFin": "2017-10-31T14:25:00.000+01:00",
  "lieu": {
    "libelleLong": "salle 6351 (Affaires sociales)"
  },
  "cycleDeVie": {
    "etat": "Confirmé",
    "chrono": {
      "creation": "2017-10-12T00:00:00.000+02:00"
    }
  },
  "organeReuniRef": "PO420120",
  "participants": {
    "participantsInternes": [
      {
        "acteurRef": "PA642764",
        "presence": "absent"
      },
      {
        "acteurRef": "PA718744",
        "presence": "absent"
      },
      {
        "acteurRef": "PA610681",
        "presence": "excusé"
      },
      {
        "acteurRef": "PA720362",
        "presence": "absent"
      },
      {
        "acteurRef": "PA720968",
        "presence": "excusé"
      },
      {
        "acteurRef": "PA720822",
        "presence": "absent"
      },
      {
        "acteurRef": "PA719980",
        "presence": "absent"
      },
      {
        "acteurRef": "PA608083",
        "presence": "présent"
      },
      {
        "acteurRef": "PA713448",
        "presence": "absent"
      },
      {
        "acteurRef": "PA721336",
        "presence": "absent"
      },
      {
        "acteurRef": "PA720468",
        "presence": "absent"
      },
      {
        "acteurRef": "PA856",
        "presence": "présent"
      },
      {
        "acteurRef": "PA722126",
        "presence": "absent"
      },
      {
        "acteurRef": "PA719756",
        "presence": "absent"
      },
      {
        "acteurRef": "PA722390",
        "presence": "présent"
      },
      {
        "acteurRef": "PA720932",
        "presence": "absent"
      },
      {
        "acteurRef": "PA718694",
        "presence": "absent"
      },
      {
        "acteurRef": "PA718926",
        "presence": "absent"
      },
      {
        "acteurRef": "PA267289",
        "presence": "présent"
      },
      {
        "acteurRef": "PA608292",
        "presence": "présent"
      },
      {
        "acteurRef": "PA720046",
        "presence": "absent"
      },
      {
        "acteurRef": "PA720924",
        "presence": "absent"
      },
      {
        "acteurRef": "PA719570",
        "presence": "absent"
      },
      {
        "acteurRef": "PA720286",
        "presence": "absent"
      },
      {
        "acteurRef": "PA267780",
        "presence": "absent"
      },
      {
        "acteurRef": "PA718706",
        "presence": "absent"
      },
      {
        "acteurRef": "PA721246",
        "presence": "présent"
      },
      {
        "acteurRef": "PA721992",
        "presence": "présent"
      },
      {
        "acteurRef": "PA720170",
        "presence": "absent"
      },
      {
        "acteurRef": "PA722062",
        "presence": "présent"
      },
      {
        "acteurRef": "PA267318",
        "presence": "absent"
      },
      {
        "acteurRef": "PA721126",
        "presence": "excusé"
      },
      {
        "acteurRef": "PA720326",
        "presence": "présent"
      },
      {
        "acteurRef": "PA331835",
        "presence": "absent"
      },
      {
        "acteurRef": "PA722374",
        "presence": "absent"
      },
      {
        "acteurRef": "PA720074",
        "presence": "absent"
      },
      {
        "acteurRef": "PA719186",
        "presence": "absent"
      },
      {
        "acteurRef": "PA719842",
        "presence": "absent"
      },
      {
        "acteurRef": "PA720916",
        "presence": "absent"
      },
      {
        "acteurRef": "PA720480",
        "presence": "absent"
      },
      {
        "acteurRef": "PA267378",
        "presence": "absent"
      },
      {
        "acteurRef": "PA606712",
        "presence": "présent"
      },
      {
        "acteurRef": "PA717379",
        "presence": "présent"
      },
      {
        "acteurRef": "PA719072",
        "presence": "présent"
      },
      {
        "acteurRef": "PA720738",
        "presence": "absent"
      },
      {
        "acteurRef": "PA610654",
        "presence": "excusé"
      },
      {
        "acteurRef": "PA2377",
        "presence": "présent"
      },
      {
        "acteurRef": "PA720500",
        "presence": "absent"
      },
      {
        "acteurRef": "PA721710",
        "presence": "présent"
      },
      {
        "acteurRef": "PA720512",
        "presence": "absent"
      },
      {
        "acteurRef": "PA718910",
        "presence": "absent"
      },
      {
        "acteurRef": "PA720422",
        "presence": "absent"
      },
      {
        "acteurRef": "PA609590",
        "presence": "présent"
      },
      {
        "acteurRef": "PA721286",
        "presence": "excusé"
      },
      {
        "acteurRef": "PA721070",
        "presence": "excusé"
      },
      {
        "acteurRef": "PA721062",
        "presence": "présent"
      },
      {
        "acteurRef": "PA718810",
        "presence": "absent"
      },
      {
        "acteurRef": "PA722022",
        "presence": "absent"
      },
      {
        "acteurRef": "PA721110",
        "presence": "excusé"
      },
      {
        "acteurRef": "PA720952",
        "presence": "absent"
      },
      {
        "acteurRef": "PA719350",
        "presence": "absent"
      },
      {
        "acteurRef": "PA722086",
        "presence": "absent"
      },
      {
        "acteurRef": "PA334768",
        "presence": "présent"
      },
      {
        "acteurRef": "PA719540",
        "presence": "absent"
      },
      {
        "acteurRef": "PA643145",
        "presence": "excusé"
      },
      {
        "acteurRef": "PA643134",
        "presence": "présent"
      },
      {
        "acteurRef": "PA719930",
        "presence": "présent"
      },
      {
        "acteurRef": "PA721924",
        "presence": "absent"
      },
      {
        "acteurRef": "PA642788",
        "presence": "présent"
      },
      {
        "acteurRef": "PA267585",
        "presence": "absent"
      },
      {
        "acteurRef": "PA722102",
        "presence": "absent"
      },
      {
        "acteurRef": "PA719512",
        "presence": "présent"
      },
      {
        "acteurRef": "PA721474",
        "presence": "absent"
      },
      {
        "acteurRef": "PA722268",
        "presence": "absent"
      }
    ]
  },
  "ouverturePresse": true,
  "odj": {
    "convocationOdj": [
      "– Communication de M. Jean-Pierre Door, rapporteur, sur la mission « flash » relative au Lévothyrox"
    ],
    "resumeOdj": [
      "communication sur la mission « flash » relative au Lévothyrox (rapport)."
    ]
  },
  "compteRenduRef": "CRCANR5L15S2018PO420120N012"
}