{
  "uid": "RUANR5L15S2018IDC428272",
  "timestampDebut": "2018-01-25T11:30:00.000+01:00",
  "timestampFin": "2018-01-25T12:45:00.000+01:00",
  "lieu": {
    "libelleLong": "salle 6242 (Lois)"
  },
  "cycleDeVie": {
    "etat": "Confirmé",
    "chrono": {
      "creation": "2018-01-15T00:00:00.000+01:00"
    }
  },
  "organeReuniRef": "PO734384",
  "participants": {
    "participantsInternes": [
      {
        "acteurRef": "PA721624",
        "presence": "absent"
      },
      {
        "acteurRef": "PA721908",
        "presence": "excusé"
      },
      {
        "acteurRef": "PA721118",
        "presence": "absent"
      },
      {
        "acteurRef": "PA721094",
        "presence": "absent"
      },
      {
        "acteurRef": "PA721564",
        "presence": "absent"
      },
      {
        "acteurRef": "PA720222",
        "presence": "absent"
      },
      {
        "acteurRef": "PA610775",
        "presence": "présent"
      },
      {
        "acteurRef": "PA266797",
        "presence": "absent"
      },
      {
        "acteurRef": "PA1592",
        "presence": "présent"
      },
      {
        "acteurRef": "PA722150",
        "presence": "absent"
      },
      {
        "acteurRef": "PA1695",
        "presence": "présent"
      },
      {
        "acteurRef": "PA720908",
        "presence": "excusé"
      },
      {
        "acteurRef": "PA2492",
        "presence": "présent"
      },
      {
        "acteurRef": "PA610733",
        "presence": "absent"
      },
      {
        "acteurRef": "PA720960",
        "presence": "absent"
      },
      {
        "acteurRef": "PA267622",
        "presence": "présent"
      },
      {
        "acteurRef": "PA722260",
        "presence": "absent"
      },
      {
        "acteurRef": "PA720318",
        "presence": "présent"
      }
    ]
  },
  "ouverturePresse": false,
  "odj": {
    "convocationOdj": [
      "Audition de MM. Ferdinand MÉLIN-SOUCRAMANIEN, professeur de droit public à l’Université de Bordeaux, et Jean COURTIAL, conseiller d'État, auteurs du rapport sur l’avenir institutionnel de la Nouvelle-Calédonie remis au Premier ministre en octobre 2013."
    ],
    "resumeOdj": [
      "audition de MM. Ferdinand Mélin-Soucramanien, professeur de droit public à l’Université de Bordeaux, et Jean Courtial, conseiller d'État, auteurs du rapport sur l’avenir institutionnel de la Nouvelle-Calédonie remis au Premier ministre en octobre 2013."
    ]
  }
}