{
  "uid": "RUANR5L15S2017IDC427053",
  "timestampDebut": "2017-06-29T10:30:00.000+02:00",
  "timestampFin": "2017-06-29T12:15:00.000+02:00",
  "lieu": {
    "libelleLong": "6e Bureau"
  },
  "cycleDeVie": {
    "etat": "Confirmé",
    "chrono": {
      "creation": "2017-06-29T00:00:00.000+02:00"
    }
  },
  "organeReuniRef": "PO419610",
  "participants": {
    "participantsInternes": [
      {
        "acteurRef": "PA722038",
        "presence": "présent"
      },
      {
        "acteurRef": "PA721278",
        "presence": "présent"
      },
      {
        "acteurRef": "PA335999",
        "presence": "présent"
      },
      {
        "acteurRef": "PA342415",
        "presence": "présent"
      },
      {
        "acteurRef": "PA722170",
        "presence": "présent"
      },
      {
        "acteurRef": "PA332228",
        "presence": "présent"
      },
      {
        "acteurRef": "PA718876",
        "presence": "présent"
      },
      {
        "acteurRef": "PA722312",
        "presence": "présent"
      },
      {
        "acteurRef": "PA718990",
        "presence": "présent"
      },
      {
        "acteurRef": "PA608641",
        "presence": "présent"
      },
      {
        "acteurRef": "PA720162",
        "presence": "présent"
      },
      {
        "acteurRef": "PA642695",
        "presence": "présent"
      },
      {
        "acteurRef": "PA336316",
        "presence": "présent"
      },
      {
        "acteurRef": "PA720546",
        "presence": "présent"
      },
      {
        "acteurRef": "PA767",
        "presence": "présent"
      },
      {
        "acteurRef": "PA720814",
        "presence": "présent"
      },
      {
        "acteurRef": "PA719440",
        "presence": "présent"
      },
      {
        "acteurRef": "PA642868",
        "presence": "présent"
      },
      {
        "acteurRef": "PA267429",
        "presence": "absent"
      },
      {
        "acteurRef": "PA721808",
        "presence": "présent"
      },
      {
        "acteurRef": "PA607155",
        "presence": "présent"
      },
      {
        "acteurRef": "PA267450",
        "presence": "absent"
      },
      {
        "acteurRef": "PA719258",
        "presence": "présent"
      },
      {
        "acteurRef": "PA719830",
        "presence": "présent"
      },
      {
        "acteurRef": "PA720598",
        "presence": "présent"
      },
      {
        "acteurRef": "PA720386",
        "presence": "présent"
      },
      {
        "acteurRef": "PA712015",
        "presence": "présent"
      },
      {
        "acteurRef": "PA721718",
        "presence": "présent"
      },
      {
        "acteurRef": "PA719660",
        "presence": "présent"
      },
      {
        "acteurRef": "PA607193",
        "presence": "présent"
      },
      {
        "acteurRef": "PA720664",
        "presence": "présent"
      },
      {
        "acteurRef": "PA334149",
        "presence": "présent"
      },
      {
        "acteurRef": "PA719960",
        "presence": "présent"
      },
      {
        "acteurRef": "PA721384",
        "presence": "présent"
      },
      {
        "acteurRef": "PA719652",
        "presence": "présent"
      },
      {
        "acteurRef": "PA722094",
        "presence": "présent"
      },
      {
        "acteurRef": "PA267355",
        "presence": "présent"
      },
      {
        "acteurRef": "PA719700",
        "presence": "excusé"
      },
      {
        "acteurRef": "PA722202",
        "presence": "présent"
      },
      {
        "acteurRef": "PA719372",
        "presence": "présent"
      },
      {
        "acteurRef": "PA719504",
        "presence": "présent"
      },
      {
        "acteurRef": "PA331567",
        "presence": "présent"
      },
      {
        "acteurRef": "PA719310",
        "presence": "présent"
      },
      {
        "acteurRef": "PA721852",
        "presence": "présent"
      },
      {
        "acteurRef": "PA340853",
        "presence": "présent"
      },
      {
        "acteurRef": "PA719388",
        "presence": "présent"
      },
      {
        "acteurRef": "PA721134",
        "presence": "présent"
      },
      {
        "acteurRef": "PA337483",
        "presence": "absent"
      },
      {
        "acteurRef": "PA719858",
        "presence": "présent"
      },
      {
        "acteurRef": "PA720378",
        "presence": "présent"
      },
      {
        "acteurRef": "PA719154",
        "presence": "présent"
      },
      {
        "acteurRef": "PA720976",
        "presence": "absent"
      },
      {
        "acteurRef": "PA719338",
        "presence": "présent"
      },
      {
        "acteurRef": "PA719608",
        "presence": "présent"
      },
      {
        "acteurRef": "PA719242",
        "presence": "présent"
      },
      {
        "acteurRef": "PA719520",
        "presence": "présent"
      },
      {
        "acteurRef": "PA720644",
        "presence": "présent"
      },
      {
        "acteurRef": "PA720108",
        "presence": "présent"
      },
      {
        "acteurRef": "PA718784",
        "presence": "présent"
      },
      {
        "acteurRef": "PA718930",
        "presence": "présent"
      },
      {
        "acteurRef": "PA607553",
        "presence": "présent"
      },
      {
        "acteurRef": "PA720590",
        "presence": "présent"
      },
      {
        "acteurRef": "PA720092",
        "presence": "présent"
      },
      {
        "acteurRef": "PA266808",
        "presence": "présent"
      },
      {
        "acteurRef": "PA722142",
        "presence": "présent"
      },
      {
        "acteurRef": "PA720780",
        "presence": "présent"
      },
      {
        "acteurRef": "PA719420",
        "presence": "présent"
      },
      {
        "acteurRef": "PA334654",
        "presence": "absent"
      },
      {
        "acteurRef": "PA2792",
        "presence": "présent"
      },
      {
        "acteurRef": "PA718860",
        "presence": "présent"
      },
      {
        "acteurRef": "PA720014",
        "presence": "présent"
      },
      {
        "acteurRef": "PA722162",
        "presence": "présent"
      },
      {
        "acteurRef": "PA421348",
        "presence": "présent"
      }
    ]
  },
  "ouverturePresse": false,
  "odj": {
    "resumeOdj": [
      "élection du bureau."
    ]
  },
  "compteRenduRef": "CRCANR5L15S2017PO419610N001"
}