{
  "uid": "RUANR5L15S2017IDC427177",
  "timestampDebut": "2017-09-20T11:05:00.000+02:00",
  "timestampFin": "2017-09-20T12:50:00.000+02:00",
  "lieu": {
    "libelleLong": "salle 6350 (Finances)"
  },
  "cycleDeVie": {
    "etat": "Confirmé",
    "chrono": {
      "creation": "2017-07-27T00:00:00.000+02:00"
    }
  },
  "organeReuniRef": "PO59048",
  "participants": {
    "participantsInternes": [
      {
        "acteurRef": "PA718954",
        "presence": "présent"
      },
      {
        "acteurRef": "PA605963",
        "presence": "présent"
      },
      {
        "acteurRef": "PA609726",
        "presence": "absent"
      },
      {
        "acteurRef": "PA721836",
        "presence": "excusé"
      },
      {
        "acteurRef": "PA721410",
        "presence": "absent"
      },
      {
        "acteurRef": "PA721608",
        "presence": "absent"
      },
      {
        "acteurRef": "PA605069",
        "presence": "présent"
      },
      {
        "acteurRef": "PA720298",
        "presence": "présent"
      },
      {
        "acteurRef": "PA746",
        "presence": "présent"
      },
      {
        "acteurRef": "PA719138",
        "presence": "présent"
      },
      {
        "acteurRef": "PA720520",
        "presence": "présent"
      },
      {
        "acteurRef": "PA719472",
        "presence": "absent"
      },
      {
        "acteurRef": "PA719250",
        "presence": "présent"
      },
      {
        "acteurRef": "PA721202",
        "presence": "excusé"
      },
      {
        "acteurRef": "PA923",
        "presence": "absent"
      },
      {
        "acteurRef": "PA942",
        "presence": "présent"
      },
      {
        "acteurRef": "PA332523",
        "presence": "absent"
      },
      {
        "acteurRef": "PA720268",
        "presence": "présent"
      },
      {
        "acteurRef": "PA719710",
        "presence": "présent"
      },
      {
        "acteurRef": "PA718720",
        "presence": "présent"
      },
      {
        "acteurRef": "PA643175",
        "presence": "présent"
      },
      {
        "acteurRef": "PA720002",
        "presence": "présent"
      },
      {
        "acteurRef": "PA1327",
        "presence": "absent"
      },
      {
        "acteurRef": "PA719480",
        "presence": "présent"
      },
      {
        "acteurRef": "PA267336",
        "presence": "excusé"
      },
      {
        "acteurRef": "PA720560",
        "presence": "absent"
      },
      {
        "acteurRef": "PA720790",
        "presence": "présent"
      },
      {
        "acteurRef": "PA721764",
        "presence": "absent"
      },
      {
        "acteurRef": "PA721498",
        "presence": "présent"
      },
      {
        "acteurRef": "PA722054",
        "presence": "présent"
      },
      {
        "acteurRef": "PA608416",
        "presence": "absent"
      },
      {
        "acteurRef": "PA721150",
        "presence": "présent"
      },
      {
        "acteurRef": "PA719060",
        "presence": "présent"
      },
      {
        "acteurRef": "PA719778",
        "presence": "excusé"
      },
      {
        "acteurRef": "PA332614",
        "presence": "présent"
      },
      {
        "acteurRef": "PA720214",
        "presence": "absent"
      },
      {
        "acteurRef": "PA719798",
        "presence": "présent"
      },
      {
        "acteurRef": "PA609245",
        "presence": "absent"
      },
      {
        "acteurRef": "PA718978",
        "presence": "présent"
      },
      {
        "acteurRef": "PA1838",
        "presence": "excusé"
      },
      {
        "acteurRef": "PA720022",
        "presence": "présent"
      },
      {
        "acteurRef": "PA712014",
        "presence": "absent"
      },
      {
        "acteurRef": "PA1874",
        "presence": "absent"
      },
      {
        "acteurRef": "PA721466",
        "presence": "présent"
      },
      {
        "acteurRef": "PA719006",
        "presence": "présent"
      },
      {
        "acteurRef": "PA608016",
        "presence": "présent"
      },
      {
        "acteurRef": "PA722244",
        "presence": "présent"
      },
      {
        "acteurRef": "PA720230",
        "presence": "absent"
      },
      {
        "acteurRef": "PA721946",
        "presence": "présent"
      },
      {
        "acteurRef": "PA720728",
        "presence": "présent"
      },
      {
        "acteurRef": "PA721418",
        "presence": "absent"
      },
      {
        "acteurRef": "PA721670",
        "presence": "présent"
      },
      {
        "acteurRef": "PA719850",
        "presence": "excusé"
      },
      {
        "acteurRef": "PA720492",
        "presence": "présent"
      },
      {
        "acteurRef": "PA720402",
        "presence": "présent"
      },
      {
        "acteurRef": "PA721636",
        "presence": "excusé"
      },
      {
        "acteurRef": "PA607595",
        "presence": "présent"
      },
      {
        "acteurRef": "PA721568",
        "presence": "présent"
      },
      {
        "acteurRef": "PA718736",
        "presence": "présent"
      },
      {
        "acteurRef": "PA336175",
        "presence": "absent"
      },
      {
        "acteurRef": "PA608172",
        "presence": "présent"
      },
      {
        "acteurRef": "PA405480",
        "presence": "présent"
      },
      {
        "acteurRef": "PA609590",
        "presence": "excusé"
      },
      {
        "acteurRef": "PA719676",
        "presence": "excusé"
      },
      {
        "acteurRef": "PA721458",
        "presence": "présent"
      },
      {
        "acteurRef": "PA720692",
        "presence": "absent"
      },
      {
        "acteurRef": "PA720878",
        "presence": "présent"
      },
      {
        "acteurRef": "PA722078",
        "presence": "absent"
      },
      {
        "acteurRef": "PA720960",
        "presence": "excusé"
      },
      {
        "acteurRef": "PA719592",
        "presence": "présent"
      },
      {
        "acteurRef": "PA721542",
        "presence": "absent"
      },
      {
        "acteurRef": "PA607090",
        "presence": "présent"
      },
      {
        "acteurRef": "PA331582",
        "presence": "absent"
      },
      {
        "acteurRef": "PA2960",
        "presence": "présent"
      }
    ],
    "personnesAuditionnees": [
      {
        "xsiType": "IdPersonneExterne_type",
        "uid": "PE448",
        "ident": {
          "civ": "M.",
          "prenom": "Anthony",
          "nom": "Requin"
        },
        "dateNais": "1970-07-24T01:00:00.000+01:00"
      }
    ]
  },
  "ouverturePresse": true,
  "odj": {
    "convocationOdj": [
      "–  Audition de M. Anthony REQUIN, directeur général de l’Agence France Trésor"
    ],
    "resumeOdj": [
      "audition de M. Anthony Requin, directeur général de l’Agence France Trésor."
    ]
  },
  "compteRenduRef": "CRCANR5L15S2017PO59048N016"
}