{
  "uid": "RUANR5L15S2018IDS20756",
  "timestampDebut": "2017-11-13T15:00:00.000+01:00",
  "timestampFin": "2017-11-13T20:40:00.000+01:00",
  "lieu": {
    "code": "AN",
    "libelleLong": "Assemblée nationale"
  },
  "cycleDeVie": {
    "etat": "Confirmé",
    "chrono": {
      "creation": "2017-10-18T00:00:00.000+02:00"
    }
  },
  "organeReuniRef": "PO717460",
  "sessionRef": "SCR5A2018O1",
  "ouverturePresse": true,
  "odj": {
    "pointsOdj": [
      {
        "xsiType": "podjSeanceConfPres_type",
        "uid": "RUANR5L15S2018IDS20756PT35255",
        "cycleDeVie": {
          "etat": "Confirmé",
          "chrono": {
            "creation": "2017-11-06T00:00:00.000+01:00"
          }
        },
        "objet": "Discussion, en nouvelle lecture, du projet de loi de finances rectificative pour 2017",
        "dossiersLegislatifsRefs": [
          "DLR5L15N36107"
        ],
        "typePointOdj": "Discussion",
        "comiteSecret": false,
        "natureTravauxOdj": "ODJPR"
      },
      {
        "xsiType": "podjSeanceConfPres_type",
        "uid": "RUANR5L15S2018IDS20756PT35213",
        "cycleDeVie": {
          "etat": "Confirmé",
          "chrono": {
            "creation": "2017-10-18T00:00:00.000+02:00"
          }
        },
        "objet": "Suite de la discussion du projet de loi de finances pour 2018 (seconde partie)",
        "dossiersLegislatifsRefs": [
          "DLR5L15N35854"
        ],
        "typePointOdj": "Suite de la discussion",
        "comiteSecret": false,
        "natureTravauxOdj": "ODJPR",
        "dateConfPres": "2017-10-24T02:00:00.000+02:00"
      }
    ]
  },
  "compteRenduRef": "CRSANR5L15S2018O1N051",
  "identifiants": {
    "numSeanceJo": "51",
    "idJo": "20180051",
    "quantieme": "Première",
    "dateSeance": "2017-11-13T01:00:00.000+01:00"
  }
}