{
  "uid": "RUANR5L14S2018IDF0101144",
  "timestampDebut": "2017-12-13T18:30:00.000+01:00",
  "timestampFin": "2017-12-13T20:00:00.000+01:00",
  "lieu": {
    "code": "SALREU006",
    "libelleCourt": "3ème Bureau",
    "libelleLong": "3ème Bureau, Palais Bourbon"
  },
  "cycleDeVie": {
    "etat": "Annulé",
    "chrono": {
      "creation": "2017-11-22T10:55:25.000+01:00",
      "cloture": "2017-12-08T17:44:13.000+01:00"
    }
  },
  "demandeurs": {
    "organe": {
      "nom": "Groupe d'amitié France-Tunisie",
      "organeRef": "PO733452"
    }
  },
  "organeReuniRef": "PO733452",
  "typeReunion": "GA"
}