{
  "uid": "RUANR5L14S2018IDF0100180",
  "timestampDebut": "2017-11-15T17:30:00.000+01:00",
  "timestampFin": "2017-11-15T18:30:00.000+01:00",
  "lieu": {
    "code": "SALREU016",
    "libelleCourt": "Salon Gabriel",
    "libelleLong": "Salon Gabriel, 101, rue de l'Université"
  },
  "cycleDeVie": {
    "etat": "Confirmé",
    "chrono": {
      "creation": "2017-11-13T11:24:45.000+01:00"
    }
  },
  "demandeurs": {
    "acteurs": [
      {
        "nom": "M. François CORNUT-GENTILLE",
        "acteurRef": "PA923"
      }
    ]
  },
  "typeReunion": "DEP"
}