{
  "uid": "RUANR5L14S2018IDF0096847",
  "timestampDebut": "2017-12-07T14:00:00.000+01:00",
  "timestampFin": "2017-12-07T15:30:00.000+01:00",
  "lieu": {
    "code": "SALREU021",
    "libelleCourt": "Salle 7207",
    "libelleLong": "Salle 7207, 101, rue de l'Université"
  },
  "cycleDeVie": {
    "etat": "Confirmé",
    "chrono": {
      "creation": "2017-09-22T15:13:17.000+02:00"
    }
  },
  "demandeurs": {
    "acteurs": [
      {
        "nom": "Mme Laure DE LA RAUDIÈRE",
        "acteurRef": "PA331567"
      }
    ]
  },
  "typeReunion": "DEP"
}