{
  "uid": "RUANR5L14S2018IDF0099118",
  "timestampDebut": "2017-10-23T15:30:00.000+02:00",
  "timestampFin": "2017-10-23T16:30:00.000+02:00",
  "lieu": {
    "code": "SALREU022",
    "libelleCourt": "Salle 7326",
    "libelleLong": "Salle 7326, 101, rue de l'Université"
  },
  "cycleDeVie": {
    "etat": "Confirmé",
    "chrono": {
      "creation": "2017-10-23T09:07:26.000+02:00"
    }
  },
  "demandeurs": {
    "acteurs": [
      {
        "nom": "M. Hervé PELLOIS",
        "acteurRef": "PA607595"
      }
    ]
  },
  "typeReunion": "DEP"
}