{
  "uid": "RUANR5L14S2018IDF0100844",
  "timestampDebut": "2017-11-28T14:00:00.000+01:00",
  "timestampFin": "2017-11-28T15:00:00.000+01:00",
  "lieu": {
    "code": "SALREU022",
    "libelleCourt": "Salle 7326",
    "libelleLong": "Salle 7326, 101, rue de l'Université"
  },
  "cycleDeVie": {
    "etat": "Confirmé",
    "chrono": {
      "creation": "2017-11-16T14:09:11.000+01:00"
    }
  },
  "demandeurs": {
    "acteurs": [
      {
        "nom": "M. Xavier ROSEREN",
        "acteurRef": "PA721458"
      }
    ]
  },
  "typeReunion": "DEP"
}