{
  "uid": "RUANR5L15S2018IDC428760",
  "timestampDebut": "2018-03-20T17:30:00.000+01:00",
  "lieu": {
    "libelleLong": "salle 6237 (Développement durable)"
  },
  "cycleDeVie": {
    "etat": "Eventuel",
    "chrono": {
      "creation": "2018-03-08T00:00:00.000+01:00"
    }
  },
  "organeReuniRef": "PO419865",
  "participants": {},
  "ouverturePresse": false,
  "odj": {
    "convocationOdj": [
      "– Audition de M. Bruno Gazeau, président de la Fédération nationale des associations d’usagers des transports (FNAUT), et de M. Jean Lenoir, vice-président ;"
    ],
    "resumeOdj": [
      "audition de M. Bruno Gazeau, président de la Fédération nationale des associations d’usagers des transports (FNAUT), et de M. Jean Lenoir, vice-président."
    ]
  }
}