{
  "uid": "RUANR5L15S2018IDS20845",
  "timestampDebut": "2017-12-01T21:30:00.000+01:00",
  "lieu": {
    "code": "AN",
    "libelleLong": "Assemblée nationale"
  },
  "cycleDeVie": {
    "etat": "Supprimé",
    "chrono": {
      "creation": "2017-11-20T00:00:00.000+01:00",
      "cloture": "2017-12-01T00:00:00.000+01:00"
    }
  },
  "organeReuniRef": "PO717460",
  "sessionRef": "SCR5A2018O1",
  "ouverturePresse": true,
  "odj": {
    "pointsOdj": [
      {
        "xsiType": "podjSeanceConfPres_type",
        "uid": "RUANR5L15S2018IDS20845PT35344",
        "cycleDeVie": {
          "etat": "Supprimé",
          "chrono": {
            "creation": "2017-11-20T00:00:00.000+01:00",
            "cloture": "2017-12-01T00:00:00.000+01:00"
          }
        },
        "objet": "Suite de la discussion, en nouvelle lecture, du projet de loi mettant fin à la recherche ainsi qu'à l'exploitation des hydrocarbures conventionnels et non conventionnels et portant diverses dispositions relatives à l'environnement",
        "typePointOdj": "Suite de la discussion",
        "comiteSecret": false,
        "natureTravauxOdj": "ODJPR"
      }
    ]
  },
  "identifiants": {
    "quantieme": "Troisième",
    "dateSeance": "2017-12-01T01:00:00.000+01:00"
  }
}