{
  "uid": "RUANR5L15S2018IDC428466",
  "timestampDebut": "2018-02-06T14:50:00.000+01:00",
  "timestampFin": "2018-02-06T14:55:00.000+01:00",
  "lieu": {
    "libelleLong": "salle 6242 (Lois)"
  },
  "cycleDeVie": {
    "etat": "Confirmé",
    "chrono": {
      "creation": "2018-02-01T00:00:00.000+01:00"
    }
  },
  "organeReuniRef": "PO59051",
  "participants": {
    "participantsInternes": [
      {
        "acteurRef": "PA719866",
        "presence": "absent"
      },
      {
        "acteurRef": "PA721624",
        "presence": "présent"
      },
      {
        "acteurRef": "PA719558",
        "presence": "absent"
      },
      {
        "acteurRef": "PA441",
        "presence": "excusé"
      },
      {
        "acteurRef": "PA720430",
        "presence": "absent"
      },
      {
        "acteurRef": "PA606507",
        "presence": "absent"
      },
      {
        "acteurRef": "PA721908",
        "presence": "présent"
      },
      {
        "acteurRef": "PA330008",
        "presence": "présent"
      },
      {
        "acteurRef": "PA720772",
        "presence": "absent"
      },
      {
        "acteurRef": "PA719748",
        "presence": "absent"
      },
      {
        "acteurRef": "PA330240",
        "presence": "excusé"
      },
      {
        "acteurRef": "PA336439",
        "presence": "absent"
      },
      {
        "acteurRef": "PA606212",
        "presence": "absent"
      },
      {
        "acteurRef": "PA721398",
        "presence": "absent"
      },
      {
        "acteurRef": "PA267440",
        "presence": "absent"
      },
      {
        "acteurRef": "PA719684",
        "presence": "absent"
      },
      {
        "acteurRef": "PA720154",
        "presence": "absent"
      },
      {
        "acteurRef": "PA721094",
        "presence": "excusé"
      },
      {
        "acteurRef": "PA719692",
        "presence": "absent"
      },
      {
        "acteurRef": "PA719616",
        "presence": "absent"
      },
      {
        "acteurRef": "PA721564",
        "presence": "absent"
      },
      {
        "acteurRef": "PA721702",
        "presence": "absent"
      },
      {
        "acteurRef": "PA721742",
        "presence": "absent"
      },
      {
        "acteurRef": "PA721142",
        "presence": "présent"
      },
      {
        "acteurRef": "PA721364",
        "presence": "absent"
      },
      {
        "acteurRef": "PA266797",
        "presence": "absent"
      },
      {
        "acteurRef": "PA721880",
        "presence": "excusé"
      },
      {
        "acteurRef": "PA1592",
        "presence": "absent"
      },
      {
        "acteurRef": "PA720454",
        "presence": "absent"
      },
      {
        "acteurRef": "PA722150",
        "presence": "absent"
      },
      {
        "acteurRef": "PA267200",
        "presence": "absent"
      },
      {
        "acteurRef": "PA719874",
        "presence": "absent"
      },
      {
        "acteurRef": "PA267901",
        "presence": "excusé"
      },
      {
        "acteurRef": "PA719994",
        "presence": "absent"
      },
      {
        "acteurRef": "PA335054",
        "presence": "absent"
      },
      {
        "acteurRef": "PA267785",
        "presence": "absent"
      },
      {
        "acteurRef": "PA721984",
        "presence": "absent"
      },
      {
        "acteurRef": "PA721932",
        "presence": "absent"
      },
      {
        "acteurRef": "PA718918",
        "presence": "absent"
      },
      {
        "acteurRef": "PA606098",
        "presence": "absent"
      },
      {
        "acteurRef": "PA346218",
        "presence": "absent"
      },
      {
        "acteurRef": "PA721800",
        "presence": "absent"
      },
      {
        "acteurRef": "PA677483",
        "presence": "présent"
      },
      {
        "acteurRef": "PA719952",
        "presence": "absent"
      },
      {
        "acteurRef": "PA607619",
        "presence": "absent"
      },
      {
        "acteurRef": "PA266788",
        "presence": "absent"
      },
      {
        "acteurRef": "PA720908",
        "presence": "absent"
      },
      {
        "acteurRef": "PA721960",
        "presence": "absent"
      },
      {
        "acteurRef": "PA719202",
        "presence": "excusé"
      },
      {
        "acteurRef": "PA721270",
        "presence": "absent"
      },
      {
        "acteurRef": "PA2449",
        "presence": "absent"
      },
      {
        "acteurRef": "PA719600",
        "presence": "absent"
      },
      {
        "acteurRef": "PA720100",
        "presence": "absent"
      },
      {
        "acteurRef": "PA643127",
        "presence": "absent"
      },
      {
        "acteurRef": "PA722398",
        "presence": "excusé"
      },
      {
        "acteurRef": "PA721678",
        "presence": "absent"
      },
      {
        "acteurRef": "PA722292",
        "presence": "absent"
      },
      {
        "acteurRef": "PA721616",
        "presence": "absent"
      },
      {
        "acteurRef": "PA702052",
        "presence": "excusé"
      },
      {
        "acteurRef": "PA340343",
        "presence": "excusé"
      },
      {
        "acteurRef": "PA721314",
        "presence": "absent"
      },
      {
        "acteurRef": "PA721584",
        "presence": "absent"
      },
      {
        "acteurRef": "PA719302",
        "presence": "absent"
      },
      {
        "acteurRef": "PA2828",
        "presence": "absent"
      },
      {
        "acteurRef": "PA608695",
        "presence": "absent"
      },
      {
        "acteurRef": "PA267622",
        "presence": "absent"
      },
      {
        "acteurRef": "PA709315",
        "presence": "excusé"
      },
      {
        "acteurRef": "PA720704",
        "presence": "absent"
      },
      {
        "acteurRef": "PA722260",
        "presence": "absent"
      },
      {
        "acteurRef": "PA721262",
        "presence": "excusé"
      },
      {
        "acteurRef": "PA2952",
        "presence": "présent"
      },
      {
        "acteurRef": "PA720318",
        "presence": "absent"
      },
      {
        "acteurRef": "PA267330",
        "presence": "absent"
      }
    ]
  },
  "ouverturePresse": false,
  "odj": {
    "convocationOdj": [
      "Examen, en application de l'article 88 du Règlement, des amendements à la proposition de loi relative à la protection des données personnelles (texte de la commission n° 592) (Mme Paula Forteza, rapporteure)."
    ],
    "resumeOdj": [
      "protection des données personnelles (texte de la commission n° 592) (amendements, art. 88)."
    ],
    "pointsOdj": [
      {
        "xsiType": "podjReunion_type",
        "uid": "RUANR5L15S2018IDC428466PT25440",
        "cycleDeVie": {
          "etat": "Confirmé",
          "chrono": {
            "creation": "2018-02-01T00:00:00.000+01:00"
          }
        },
        "objet": "Examen des amendements (art. 88)",
        "dossiersLegislatifsRefs": [
          "DLR5L15N36220"
        ],
        "typePointOdj": "Amendements (Art. 88)",
        "comiteSecret": false
      }
    ]
  },
  "compteRenduRef": "CRCANR5L15S2018PO59051N041"
}