{
  "uid": "RUANR5L14S2018IDF0099279",
  "timestampDebut": "2017-10-25T14:45:00.000+02:00",
  "timestampFin": "2017-10-25T15:30:00.000+02:00",
  "lieu": {
    "code": "SALREU020",
    "libelleCourt": "Salon Mars II",
    "libelleLong": "Salon Mars II, 101, rue de l'Université"
  },
  "cycleDeVie": {
    "etat": "Confirmé",
    "chrono": {
      "creation": "2017-10-25T14:03:11.000+02:00"
    }
  },
  "demandeurs": {
    "acteurs": [
      {
        "nom": "M. Jean François MBAYE",
        "acteurRef": "PA720870"
      }
    ]
  },
  "typeReunion": "DEP"
}