{
  "uid": "RUANR5L15S2018IDF0105781",
  "timestampDebut": "2018-03-19T14:30:00.000+01:00",
  "timestampFin": "2018-03-19T16:30:00.000+01:00",
  "lieu": {
    "code": "SALREU011",
    "libelleCourt": "Salle N° 2",
    "libelleLong": "Salle N° 2, 3, rue Aristide Briand"
  },
  "cycleDeVie": {
    "etat": "Confirmé",
    "chrono": {
      "creation": "2018-02-14T13:09:53.000+01:00"
    }
  },
  "demandeurs": {
    "acteurs": [
      {
        "nom": "Mme Amal-Amélia LAKRAFI",
        "acteurRef": "PA721004"
      }
    ]
  },
  "typeReunion": "DEP"
}