{
  "uid": "RUANR5L14S2018IDF0101069",
  "timestampDebut": "2017-11-22T14:00:00.000+01:00",
  "timestampFin": "2017-11-22T15:00:00.000+01:00",
  "lieu": {
    "code": "SALREU044",
    "libelleCourt": "Sully 2",
    "libelleLong": "Sully 2, Palais Bourbon"
  },
  "cycleDeVie": {
    "etat": "Confirmé",
    "chrono": {
      "creation": "2017-11-21T13:57:10.000+01:00"
    }
  },
  "demandeurs": {
    "acteurs": [
      {
        "nom": "Mme Anne-Laure CATTELOT",
        "acteurRef": "PA720520"
      }
    ]
  },
  "typeReunion": "DEP"
}