{
  "uid": "RUANR5L14S2017IDF0093107",
  "timestampDebut": "2017-07-05T10:00:00.000+02:00",
  "timestampFin": "2017-07-05T12:00:00.000+02:00",
  "lieu": {
    "code": "SALREU029",
    "libelleCourt": "Salon Mars III",
    "libelleLong": "Salon Mars III, 101, rue de l'Université"
  },
  "cycleDeVie": {
    "etat": "Confirmé",
    "chrono": {
      "creation": "2017-06-21T14:39:26.000+02:00"
    }
  },
  "demandeurs": {
    "acteurs": [
      {
        "nom": "M. Fabien ROUSSEL",
        "acteurRef": "PA720692"
      }
    ]
  },
  "typeReunion": "DEP"
}