{
  "uid": "RUANR5L14S2017IDF0095479",
  "timeStampDebut": "2017-09-13T09:45:00.000+02:00",
  "timeStampFin": "2017-09-13T16:00:00.000+02:00",
  "lieu": {
    "code": "SALREU006",
    "libelleCourt": "3ème Bureau",
    "libelleLong": "3ème Bureau, Palais Bourbon"
  },
  "cycleDeVie": {
    "etat": "Confirmé",
    "chrono": {
      "creation": "2017-08-31T11:23:13.000+02:00",
      "cloture": null
    }
  },
  "demandeurs": {
    "acteur": {
      "nom": "Mme Barbara POMPILI",
      "acteurRef": "PA609520"
    }
  },
  "organeReuniRef": null,
  "typeReunion": "DEP",
  "@xmlns:xsi": "http://www.w3.org/2001/XMLSchema-instance"
}