{
  "uid": "RUANR5L15S2017IDS20608",
  "timeStampDebut": "2017-07-10T16:00:00.000+02:00",
  "timeStampFin": "2017-07-10T20:05:00.000+02:00",
  "lieu": {
    "code": "AN",
    "libelleLong": "Assemblée nationale"
  },
  "cycleDeVie": {
    "etat": "Confirmé",
    "chrono": {
      "creation": "2017-06-28T00:00:00.000+02:00",
      "cloture": null
    }
  },
  "organeReuniRef": "PO717460",
  "@xmlns:xsi": "http://www.w3.org/2001/XMLSchema-instance",
  "demandeur": null,
  "participants": null,
  "sessionRef": "SCR5A2017E1",
  "ouverturePresse": "true",
  "ODJ": {
    "convocationODJ": null,
    "resumeODJ": null,
    "pointsODJ": {
      "pointODJ": {
        "@xsi:type": "podjSeanceConfPres_type",
        "uid": "RUANR5L15S2017IDS20608PT34921",
        "cycleDeVie": {
          "etat": "Confirmé",
          "chrono": {
            "creation": "2017-06-28T00:00:00.000+02:00",
            "cloture": null
          }
        },
        "objet": "Discussion du projet de loi d'habilitation à prendre par ordonnances les mesures pour le renforcement du dialogue social",
        "demandeurPoint": null,
        "procedure": null,
        "dossiersLegislatifsRefs": {
          "dossierRef": "DLR5L15N35836"
        },
        "typePointODJ": "Discussion",
        "comiteSecret": "false",
        "textesAssocies": null,
        "natureTravauxODJ": "ODJPR",
        "dateConfPres": "2017-06-29+02:00"
      }
    }
  },
  "compteRenduRef": "CRSANR5L15S2017E1N005",
  "identifiants": {
    "numSeanceJO": "5",
    "idJO": "20171005",
    "quantieme": "Première",
    "DateSeance": "2017-07-10+02:00"
  }
}