{
  "uid": "RUANR5L14S2018IDF0098388",
  "timeStampDebut": "2017-10-24T17:00:00.000+02:00",
  "timeStampFin": "2017-10-24T18:00:00.000+02:00",
  "lieu": {
    "code": "SALREU018",
    "libelleCourt": "Salon Mansart",
    "libelleLong": "Salon Mansart, 101, rue de l'Université"
  },
  "cycleDeVie": {
    "etat": "Confirmé",
    "chrono": {
      "creation": "2017-10-11T10:55:12.000+02:00",
      "cloture": null
    }
  },
  "demandeurs": {
    "organe": {
      "nom": "Groupe d'amitié France-Tunisie",
      "organeRef": "PO733452"
    }
  },
  "organeReuniRef": "PO733452",
  "typeReunion": "GA",
  "@xmlns:xsi": "http://www.w3.org/2001/XMLSchema-instance"
}