{
  "uid": "RUANR5L15S2018IDS20789",
  "timeStampDebut": "2017-11-29T15:00:00.000+01:00",
  "timeStampFin": "2017-11-29T20:00:00.000+01:00",
  "lieu": {
    "code": "AN",
    "libelleLong": "Assemblée nationale"
  },
  "cycleDeVie": {
    "etat": "Confirmé",
    "chrono": {
      "creation": "2017-11-03T00:00:00.000+01:00",
      "cloture": null
    }
  },
  "organeReuniRef": "PO717460",
  "@xmlns:xsi": "http://www.w3.org/2001/XMLSchema-instance",
  "demandeur": null,
  "participants": null,
  "sessionRef": "SCR5A2018O1",
  "ouverturePresse": "true",
  "ODJ": {
    "convocationODJ": null,
    "resumeODJ": null,
    "pointsODJ": {
      "pointODJ": [
        {
          "@xsi:type": "podjSeanceConfPres_type",
          "uid": "RUANR5L15S2018IDS20789PT35254",
          "cycleDeVie": {
            "etat": "Confirmé",
            "chrono": {
              "creation": "2017-11-03T00:00:00.000+01:00",
              "cloture": null
            }
          },
          "objet": "Questions au Gouvernement",
          "demandeurPoint": null,
          "procedure": null,
          "dossiersLegislatifsRefs": null,
          "typePointODJ": "Questions au Gouvernement",
          "comiteSecret": "false",
          "textesAssocies": null,
          "natureTravauxODJ": "ODJPR"
        },
        {
          "@xsi:type": "podjSeanceConfPres_type",
          "uid": "RUANR5L15S2018IDS20789PT35275",
          "cycleDeVie": {
            "etat": "Confirmé",
            "chrono": {
              "creation": "2017-11-06T00:00:00.000+01:00",
              "cloture": null
            }
          },
          "objet": "Suite de la discussion, en nouvelle lecture, du projet de loi de financement de la sécurité sociale pour 2018",
          "demandeurPoint": null,
          "procedure": null,
          "dossiersLegislatifsRefs": {
            "dossierRef": "DLR5L15N36030"
          },
          "typePointODJ": "Suite de la discussion",
          "comiteSecret": "false",
          "textesAssocies": null,
          "natureTravauxODJ": "ODJPR"
        },
        {
          "@xsi:type": "podjSeanceConfPres_type",
          "uid": "RUANR5L15S2018IDS20789PT35263",
          "cycleDeVie": {
            "etat": "Confirmé",
            "chrono": {
              "creation": "2017-11-06T00:00:00.000+01:00",
              "cloture": null
            }
          },
          "objet": "Discussion, en nouvelle lecture, du projet de loi mettant fin à la recherche ainsi qu'à l'exploitation des hydrocarbures conventionnels et non conventionnels et portant diverses dispositions relatives à l'environnement",
          "demandeurPoint": null,
          "procedure": null,
          "dossiersLegislatifsRefs": null,
          "typePointODJ": "Discussion",
          "comiteSecret": "false",
          "textesAssocies": null,
          "natureTravauxODJ": "ODJPR"
        }
      ]
    }
  },
  "compteRenduRef": "CRSANR5L15S2018O1N075",
  "identifiants": {
    "numSeanceJO": "75",
    "idJO": "20180075",
    "quantieme": "Première",
    "DateSeance": "2017-11-29+01:00"
  }
}