{
  "uid": "RUANR5L15S2018IDC428660",
  "timeStampDebut": "2018-03-28T09:30:00.000+02:00",
  "lieu": {
    "libelleLong": "6e Bureau"
  },
  "cycleDeVie": {
    "etat": "Eventuel",
    "chrono": {
      "creation": "2018-02-22T00:00:00.000+01:00",
      "cloture": null
    }
  },
  "organeReuniRef": "PO419610",
  "@xmlns:xsi": "http://www.w3.org/2001/XMLSchema-instance",
  "demandeur": null,
  "participants": {
    "participantsInternes": null,
    "personnesAuditionnees": null
  },
  "sessionRef": null,
  "ouverturePresse": "true",
  "ODJ": {
    "convocationODJ": {
      "item": "Audition de M. Carlos Tavares, président du directoire du groupe PSA."
    },
    "resumeODJ": {
      "item": "audition de M. Carlos Tavares, président du directoire du groupe PSA."
    },
    "pointsODJ": {
      "pointODJ": {
        "@xsi:type": "podjReunion_type",
        "uid": "RUANR5L15S2018IDC428660PT25492",
        "cycleDeVie": {
          "etat": "Eventuel",
          "chrono": {
            "creation": "2018-02-28T00:00:00.000+01:00",
            "cloture": null
          }
        },
        "objet": "examen du texte",
        "demandeurPoint": null,
        "procedure": null,
        "dossiersLegislatifsRefs": {
          "dossierRef": "DLR5L15N36336"
        },
        "typePointODJ": "Examen",
        "comiteSecret": "false",
        "textesAssocies": null
      }
    }
  },
  "compteRenduRef": null
}