{
  "uid": "RUANR5L15S2018IDF0104085",
  "timeStampDebut": "2018-01-22T15:00:00.000+01:00",
  "timeStampFin": "2018-01-22T16:00:00.000+01:00",
  "lieu": {
    "code": "SALREU013",
    "libelleCourt": "Salle N° 3",
    "libelleLong": "Salle N° 3, 3, rue Aristide Briand"
  },
  "cycleDeVie": {
    "etat": "Confirmé",
    "chrono": {
      "creation": "2018-01-22T11:46:25.000+01:00",
      "cloture": null
    }
  },
  "demandeurs": {
    "organe": {
      "nom": "Groupe d'amitié France-Israël",
      "organeRef": "PO733382"
    }
  },
  "organeReuniRef": "PO733382",
  "typeReunion": "GA",
  "@xmlns:xsi": "http://www.w3.org/2001/XMLSchema-instance"
}