{
  "uid": "RUANR5L14S2018IDF0099412",
  "timeStampDebut": "2017-11-08T17:00:00.000+01:00",
  "timeStampFin": "2017-11-08T18:30:00.000+01:00",
  "lieu": {
    "code": "SALREU010",
    "libelleCourt": "Salle N° 1",
    "libelleLong": "Salle N° 1, 3, rue Aristide Briand"
  },
  "cycleDeVie": {
    "etat": "Annulé",
    "chrono": {
      "creation": "2017-10-27T17:05:52.000+01:00",
      "cloture": "2017-10-30T14:50:45.000+01:00"
    }
  },
  "demandeurs": {
    "acteur": {
      "nom": "M. Nicolas TURQUOIS",
      "acteurRef": "PA722162"
    }
  },
  "organeReuniRef": null,
  "typeReunion": "DEP",
  "@xmlns:xsi": "http://www.w3.org/2001/XMLSchema-instance"
}