{
  "uid": "RUANR5L15S2018IDF0098629",
  "timeStampDebut": "2018-06-12T08:30:00.000+02:00",
  "timeStampFin": "2018-06-12T14:00:00.000+02:00",
  "lieu": {
    "code": "SALREU009",
    "libelleCourt": "8ème Bureau",
    "libelleLong": "8ème Bureau, Palais Bourbon"
  },
  "cycleDeVie": {
    "etat": "Confirmé",
    "chrono": {
      "creation": "2017-10-13T15:11:30.000+02:00",
      "cloture": null
    }
  },
  "demandeurs": {
    "organe": {
      "nom": "GROUPE LA FRANCE INSOUMISE",
      "organeRef": "PO730958"
    }
  },
  "organeReuniRef": "PO730958",
  "typeReunion": "GP",
  "@xmlns:xsi": "http://www.w3.org/2001/XMLSchema-instance"
}