{
  "uid": "RUANR5L15S2018IDF0106314",
  "timeStampDebut": "2018-03-28T18:00:00.000+02:00",
  "timeStampFin": "2018-03-28T19:00:00.000+02:00",
  "lieu": {
    "code": "SALREU022",
    "libelleCourt": "Salle 7326",
    "libelleLong": "Salle 7326, 101, rue de l'Université"
  },
  "cycleDeVie": {
    "etat": "Confirmé",
    "chrono": {
      "creation": "2018-02-21T13:47:05.000+02:00",
      "cloture": null
    }
  },
  "demandeurs": {
    "acteur": {
      "nom": "M. Raphaël GÉRARD",
      "acteurRef": "PA719108"
    }
  },
  "organeReuniRef": null,
  "typeReunion": "DEP",
  "@xmlns:xsi": "http://www.w3.org/2001/XMLSchema-instance"
}