{
  "uid": "RUANR5L14S2018IDF0094986",
  "timeStampDebut": "2017-10-05T14:00:00.000+02:00",
  "timeStampFin": "2017-10-05T18:00:00.000+02:00",
  "lieu": {
    "code": "SALREU048",
    "libelleCourt": "Salle 6809",
    "libelleLong": "Salle 6809, Palais Bourbon"
  },
  "cycleDeVie": {
    "etat": "Confirmé",
    "chrono": {
      "creation": "2017-08-01T15:13:47.000+02:00",
      "cloture": null
    }
  },
  "demandeurs": {
    "acteur": {
      "nom": "Mme Amélie DE MONTCHALIN",
      "acteurRef": "PA721670"
    }
  },
  "organeReuniRef": null,
  "typeReunion": "DEP",
  "@xmlns:xsi": "http://www.w3.org/2001/XMLSchema-instance"
}