{
  "uid": "RUSNR5L15S2017IDS20716",
  "timeStampDebut": "2017-10-02T15:00:00.000+02:00",
  "timeStampFin": "2017-10-02T17:40:00.000+02:00",
  "lieu": {
    "code": "S",
    "libelleLong": "Sénat"
  },
  "cycleDeVie": {
    "etat": "Confirmé",
    "chrono": {
      "creation": "2017-10-04T00:00:00.000+02:00",
      "cloture": null
    }
  },
  "organeReuniRef": "PO78718",
  "@xmlns:xsi": "http://www.w3.org/2001/XMLSchema-instance",
  "demandeur": null,
  "participants": null,
  "sessionRef": "SCR5A2017I3",
  "ouverturePresse": "true",
  "ODJ": {
    "convocationODJ": null,
    "resumeODJ": null,
    "pointsODJ": null
  },
  "compteRenduRef": "CRSSNR5S2017IDS20171002",
  "identifiants": {
    "numSeanceJO": "1",
    "idJO": null,
    "quantieme": "Unique",
    "DateSeance": "2017-10-02+02:00"
  }
}