{
  "uid": "RUANR5L14S2018IDF0101432",
  "timeStampDebut": "2018-01-30T12:00:00.000+01:00",
  "timeStampFin": "2018-01-30T13:00:00.000+01:00",
  "lieu": {
    "code": "SALREU007",
    "libelleCourt": "4ème Bureau",
    "libelleLong": "4ème Bureau, Palais Bourbon"
  },
  "cycleDeVie": {
    "etat": "Confirmé",
    "chrono": {
      "creation": "2017-11-27T14:59:18.000+01:00",
      "cloture": null
    }
  },
  "demandeurs": {
    "organe": {
      "nom": "Groupe d'amitié France-Monaco",
      "organeRef": "PO733437"
    }
  },
  "organeReuniRef": "PO733437",
  "typeReunion": "GA",
  "@xmlns:xsi": "http://www.w3.org/2001/XMLSchema-instance"
}