{
  "uid": "RUANR5L14S2017IDF0094740",
  "timeStampDebut": "2017-09-21T14:00:00.000+02:00",
  "timeStampFin": "2017-09-21T16:30:00.000+02:00",
  "lieu": {
    "code": "SALREU006",
    "libelleCourt": "3ème Bureau",
    "libelleLong": "3ème Bureau, Palais Bourbon"
  },
  "cycleDeVie": {
    "etat": "Confirmé",
    "chrono": {
      "creation": "2017-07-26T10:22:49.000+02:00",
      "cloture": "2017-09-19T18:17:22.000+02:00"
    }
  },
  "demandeurs": {
    "acteur": {
      "nom": "M. Patrick VIGNAL",
      "acteurRef": "PA606639"
    }
  },
  "organeReuniRef": null,
  "typeReunion": "DEP",
  "@xmlns:xsi": "http://www.w3.org/2001/XMLSchema-instance"
}