{
  "uid": "RUANR5L15S2018IDF0104243",
  "timeStampDebut": "2018-02-14T14:00:00.000+01:00",
  "timeStampFin": "2018-02-14T20:00:00.000+01:00",
  "lieu": {
    "code": "SALREU042",
    "libelleCourt": "Salle 6566",
    "libelleLong": "Salle 6566, Palais Bourbon"
  },
  "cycleDeVie": {
    "etat": "Confirmé",
    "chrono": {
      "creation": "2018-01-23T17:30:55.000+01:00",
      "cloture": null
    }
  },
  "demandeurs": {
    "acteur": {
      "nom": "Mme Yaël BRAUN-PIVET",
      "acteurRef": "PA721908"
    }
  },
  "organeReuniRef": null,
  "typeReunion": "DEP",
  "@xmlns:xsi": "http://www.w3.org/2001/XMLSchema-instance"
}