{
  "uid": "RUANR5L14S2018IDF0102719",
  "timeStampDebut": "2017-12-21T11:00:00.000+01:00",
  "timeStampFin": "2017-12-21T12:30:00.000+01:00",
  "lieu": {
    "code": "SALREU049",
    "libelleCourt": "Salle 6822",
    "libelleLong": "Salle 6822, Palais Bourbon"
  },
  "cycleDeVie": {
    "etat": "Confirmé",
    "chrono": {
      "creation": "2017-12-19T19:31:29.000+01:00",
      "cloture": null
    }
  },
  "demandeurs": {
    "acteur": {
      "nom": "Mme Sophie BEAUDOUIN-HUBIERE",
      "acteurRef": "PA722170"
    }
  },
  "organeReuniRef": null,
  "typeReunion": "DEP",
  "@xmlns:xsi": "http://www.w3.org/2001/XMLSchema-instance"
}