{
  "uid": "RUANR5L15S2018IDC428515",
  "timeStampDebut": "2018-02-22T16:00:00.000+01:00",
  "timeStampFin": "2018-02-22T17:00:00.000+01:00",
  "lieu": {
    "libelleLong": "salle 6238 (Affaires culturelles)"
  },
  "cycleDeVie": {
    "etat": "Confirmé",
    "chrono": {
      "creation": "2018-02-08T00:00:00.000+01:00",
      "cloture": null
    }
  },
  "organeReuniRef": "PO740454",
  "@xmlns:xsi": "http://www.w3.org/2001/XMLSchema-instance",
  "demandeur": null,
  "participants": {
    "participantsInternes": {
      "participantInterne": [
        {
          "acteurRef": "PA719318",
          "presence": "absent"
        },
        {
          "acteurRef": "PA335999",
          "presence": "absent"
        },
        {
          "acteurRef": "PA719488",
          "presence": "absent"
        },
        {
          "acteurRef": "PA720162",
          "presence": "excusé"
        },
        {
          "acteurRef": "PA719740",
          "presence": "absent"
        },
        {
          "acteurRef": "PA719258",
          "presence": "absent"
        },
        {
          "acteurRef": "PA267355",
          "presence": "absent"
        },
        {
          "acteurRef": "PA719230",
          "presence": "absent"
        },
        {
          "acteurRef": "PA340853",
          "presence": "absent"
        },
        {
          "acteurRef": "PA719412",
          "presence": "présent"
        },
        {
          "acteurRef": "PA719154",
          "presence": "présent"
        },
        {
          "acteurRef": "PA2155",
          "presence": "présent"
        },
        {
          "acteurRef": "PA719456",
          "presence": "absent"
        },
        {
          "acteurRef": "PA719242",
          "presence": "absent"
        },
        {
          "acteurRef": "PA720278",
          "presence": "absent"
        },
        {
          "acteurRef": "PA720892",
          "presence": "absent"
        },
        {
          "acteurRef": "PA2377",
          "presence": "absent"
        },
        {
          "acteurRef": "PA718930",
          "presence": "absent"
        },
        {
          "acteurRef": "PA719350",
          "presence": "excusé"
        },
        {
          "acteurRef": "PA719540",
          "presence": "présent"
        },
        {
          "acteurRef": "PA722268",
          "presence": "absent"
        },
        {
          "acteurRef": "PA722110",
          "presence": "absent"
        }
      ]
    },
    "personnesAuditionnees": null
  },
  "sessionRef": null,
  "ouverturePresse": "true",
  "ODJ": {
    "convocationODJ": {
      "item": "Audition de Mme Eugénia Pommaret, directrice générale et de Mme Delphine Guey, directrice de la communication et des affaires publiques de l’Union pour la protection des plantes (UIPP)."
    },
    "resumeODJ": {
      "item": "audition de Mme Eugénia Pommaret, directrice générale et de Mme Delphine Guey, directrice de la communication et des affaires publiques de l’Union pour la protection des plantes (UIPP)."
    },
    "pointsODJ": null
  },
  "compteRenduRef": null
}