{
  "uid": "RUANR5L14S2018IDF0102268",
  "timeStampDebut": "2018-01-16T08:00:00.000+01:00",
  "timeStampFin": "2018-01-16T13:00:00.000+01:00",
  "lieu": {
    "code": "SALREU044",
    "libelleCourt": "Sully 2",
    "libelleLong": "Sully 2, Palais Bourbon"
  },
  "cycleDeVie": {
    "etat": "Annulé",
    "chrono": {
      "creation": "2017-12-13T12:18:27.000+01:00",
      "cloture": "2017-12-21T11:04:53.000+01:00"
    }
  },
  "demandeurs": {
    "acteur": {
      "nom": "M. Richard FERRAND",
      "acteurRef": "PA606171"
    }
  },
  "organeReuniRef": null,
  "typeReunion": "DEP",
  "@xmlns:xsi": "http://www.w3.org/2001/XMLSchema-instance"
}