{
  "uid": "RUANR5L15S2018IDF0105239",
  "timeStampDebut": "2018-02-22T12:00:00.000+01:00",
  "timeStampFin": "2018-02-22T13:00:00.000+01:00",
  "lieu": {
    "code": "SALREU008",
    "libelleCourt": "5ème Bureau",
    "libelleLong": "5ème Bureau, Palais Bourbon"
  },
  "cycleDeVie": {
    "etat": "Confirmé",
    "chrono": {
      "creation": "2018-02-06T16:43:32.000+01:00",
      "cloture": null
    }
  },
  "demandeurs": {
    "organe": {
      "nom": "Groupe d'amitié France-Kazakhstan",
      "organeRef": "PO733502"
    }
  },
  "organeReuniRef": "PO733502",
  "typeReunion": "GA",
  "@xmlns:xsi": "http://www.w3.org/2001/XMLSchema-instance"
}