{
  "uid": "RUANR5L14S2017IDF0094283",
  "timeStampDebut": "2017-07-18T10:00:00.000+02:00",
  "timeStampFin": "2017-07-18T11:00:00.000+02:00",
  "lieu": {
    "code": "SALREU013",
    "libelleCourt": "Salle N° 3",
    "libelleLong": "Salle N° 3, 3, rue Aristide Briand"
  },
  "cycleDeVie": {
    "etat": "Confirmé",
    "chrono": {
      "creation": "2017-07-18T09:17:12.000+02:00",
      "cloture": null
    }
  },
  "demandeurs": {
    "acteur": {
      "nom": "M. Julien DIVE",
      "acteurRef": "PA712015"
    }
  },
  "organeReuniRef": null,
  "typeReunion": "DEP",
  "@xmlns:xsi": "http://www.w3.org/2001/XMLSchema-instance"
}