{
  "uid": "RUANR5L14S2017IDF0095460",
  "timeStampDebut": "2017-09-25T14:00:00.000+02:00",
  "timeStampFin": "2017-09-25T19:00:00.000+02:00",
  "lieu": {
    "code": "SALREU017",
    "libelleCourt": "Salon Visconti",
    "libelleLong": "Salon Visconti, 101, rue de l'Université"
  },
  "cycleDeVie": {
    "etat": "Confirmé",
    "chrono": {
      "creation": "2017-08-30T18:16:14.000+02:00",
      "cloture": null
    }
  },
  "demandeurs": {
    "acteur": {
      "nom": "M. Paul CHRISTOPHE",
      "acteurRef": "PA642868"
    }
  },
  "organeReuniRef": null,
  "typeReunion": "DEP",
  "@xmlns:xsi": "http://www.w3.org/2001/XMLSchema-instance"
}