{
  "uid": "RUANR5L15S2018IDF0104556",
  "timeStampDebut": "2018-02-06T10:15:00.000+01:00",
  "timeStampFin": "2018-02-06T11:15:00.000+01:00",
  "lieu": {
    "code": "SALREU049",
    "libelleCourt": "Salle 6822",
    "libelleLong": "Salle 6822, Palais Bourbon"
  },
  "cycleDeVie": {
    "etat": "Confirmé",
    "chrono": {
      "creation": "2018-01-29T12:54:37.000+01:00",
      "cloture": null
    }
  },
  "demandeurs": {
    "acteur": {
      "nom": "M. Alexandre HOLROYD",
      "acteurRef": "PA721150"
    }
  },
  "organeReuniRef": null,
  "typeReunion": "DEP",
  "@xmlns:xsi": "http://www.w3.org/2001/XMLSchema-instance"
}