{
  "uid": "RUANR5L15S2018IDC427733",
  "timeStampDebut": "2017-11-09T10:00:00.000+01:00",
  "timeStampFin": "2017-11-09T11:05:00.000+01:00",
  "lieu": {
    "libelleLong": "salle 4123 (33 rue Saint-Dominique)"
  },
  "cycleDeVie": {
    "etat": "Confirmé",
    "chrono": {
      "creation": "2017-11-03T00:00:00.000+01:00",
      "cloture": null
    }
  },
  "organeReuniRef": "PO734685",
  "@xmlns:xsi": "http://www.w3.org/2001/XMLSchema-instance",
  "demandeur": null,
  "participants": {
    "participantsInternes": {
      "participantInterne": [
        {
          "acteurRef": "PA721836",
          "presence": "présent"
        },
        {
          "acteurRef": "PA722170",
          "presence": "absent"
        },
        {
          "acteurRef": "PA722046",
          "presence": "absent"
        },
        {
          "acteurRef": "PA642868",
          "presence": "absent"
        },
        {
          "acteurRef": "PA923",
          "presence": "absent"
        },
        {
          "acteurRef": "PA718720",
          "presence": "absent"
        },
        {
          "acteurRef": "PA719692",
          "presence": "présent"
        },
        {
          "acteurRef": "PA332614",
          "presence": "présent"
        },
        {
          "acteurRef": "PA722142",
          "presence": "absent"
        },
        {
          "acteurRef": "PA709315",
          "presence": "absent"
        }
      ]
    },
    "personnesAuditionnees": null
  },
  "sessionRef": null,
  "ouverturePresse": "true",
  "ODJ": {
    "convocationODJ": {
      "item": "Audition de M. Patrick Bernasconi, président du Conseil économique, social et environnemental, accompagné de M. Vincent Le Roux, directeur de cabinet et de Mme Catherine Lopez, conseillère chargée des relations institutionnelles."
    },
    "resumeODJ": {
      "item": "audition de M. Patrick Bernasconi, président du Conseil économique, social et environnemental, accompagné de M. Vincent Le Roux, directeur de cabinet et de Mme Catherine Lopez, conseillère chargée des relations institutionnelles."
    },
    "pointsODJ": null
  },
  "compteRenduRef": null
}