{
  "uid": "RUANR5L15S2018IDF0105830",
  "timeStampDebut": "2018-02-20T14:45:00.000+01:00",
  "timeStampFin": "2018-02-20T17:30:00.000+01:00",
  "lieu": {
    "code": "SALREU021",
    "libelleCourt": "Salle 7207",
    "libelleLong": "Salle 7207, 101, rue de l'Université"
  },
  "cycleDeVie": {
    "etat": "Confirmé",
    "chrono": {
      "creation": "2018-02-14T16:50:23.000+01:00",
      "cloture": null
    }
  },
  "demandeurs": {
    "acteur": {
      "nom": "Mme Laetitia SAINT-PAUL",
      "acteurRef": "PA720138"
    }
  },
  "organeReuniRef": null,
  "typeReunion": "DEP",
  "@xmlns:xsi": "http://www.w3.org/2001/XMLSchema-instance"
}