{
  "uid": "RUANR5L15S2018IDF0103615",
  "timeStampDebut": "2018-01-19T10:30:00.000+01:00",
  "timeStampFin": "2018-01-19T11:00:00.000+01:00",
  "lieu": {
    "code": "SALREU017",
    "libelleCourt": "Salon Visconti",
    "libelleLong": "Salon Visconti, 101, rue de l'Université"
  },
  "cycleDeVie": {
    "etat": "Confirmé",
    "chrono": {
      "creation": "2018-01-15T17:34:15.000+01:00",
      "cloture": null
    }
  },
  "demandeurs": {
    "acteur": {
      "nom": "M. Loïc KERVRAN",
      "acteurRef": "PA719052"
    }
  },
  "organeReuniRef": null,
  "typeReunion": "DEP",
  "@xmlns:xsi": "http://www.w3.org/2001/XMLSchema-instance"
}