{
  "uid": "RUANR5L14S2018IDF0097924",
  "timeStampDebut": "2017-10-10T14:00:00.000+02:00",
  "timeStampFin": "2017-10-10T15:00:00.000+02:00",
  "lieu": {
    "code": "SALREU046",
    "libelleCourt": "Sully 1",
    "libelleLong": "Sully 1, Palais Bourbon"
  },
  "cycleDeVie": {
    "etat": "Annulé",
    "chrono": {
      "creation": "2017-10-04T14:08:01.000+02:00",
      "cloture": "2017-10-05T08:36:25.000+02:00"
    }
  },
  "demandeurs": {
    "organe": {
      "nom": "GROUPE LES CONSTRUCTIFS : RÉPUBLICAINS, UDI, INDÉPENDANTS",
      "organeRef": "PO730952"
    }
  },
  "organeReuniRef": "PO730952",
  "typeReunion": "GP"
}