{
  "uid": "RUANR5L14S2017IDF0095876",
  "timeStampDebut": "2017-09-07T18:00:00.000+02:00",
  "timeStampFin": "2017-09-07T19:00:00.000+02:00",
  "lieu": {
    "code": "SALREU048",
    "libelleCourt": "Salle 6809",
    "libelleLong": "Salle 6809, Palais Bourbon"
  },
  "cycleDeVie": {
    "etat": "Confirmé",
    "chrono": {
      "creation": "2017-09-07T17:24:40.000+02:00",
      "cloture": null
    }
  },
  "demandeurs": null,
  "organeReuniRef": null,
  "typeReunion": "HÉ Aurélien",
  "@xmlns:xsi": "http://www.w3.org/2001/XMLSchema-instance"
}