{
  "uid": "RUANR5L14S2017IDF0095954",
  "timeStampDebut": "2017-09-14T10:00:00.000+02:00",
  "timeStampFin": "2017-09-14T11:30:00.000+02:00",
  "lieu": {
    "code": "SALREU020",
    "libelleCourt": "Salon Mars II",
    "libelleLong": "Salon Mars II, 101, rue de l'Université"
  },
  "cycleDeVie": {
    "etat": "Confirmé",
    "chrono": {
      "creation": "2017-09-08T15:33:52.000+02:00",
      "cloture": null
    }
  },
  "demandeurs": {
    "acteur": {
      "nom": "Mme Bérangère COUILLARD",
      "acteurRef": "PA719624"
    }
  },
  "organeReuniRef": null,
  "typeReunion": "DEP",
  "@xmlns:xsi": "http://www.w3.org/2001/XMLSchema-instance"
}