{
  "uid": "RUANR5L15S2018IDC427889",
  "timeStampDebut": "2017-11-29T17:00:00.000+01:00",
  "lieu": {
    "libelleLong": "salle 4325 (33 rue Saint-Dominique)"
  },
  "cycleDeVie": {
    "etat": "Confirmé",
    "chrono": {
      "creation": "2017-11-17T00:00:00.000+01:00",
      "cloture": null
    }
  },
  "organeReuniRef": "PO738117",
  "@xmlns:xsi": "http://www.w3.org/2001/XMLSchema-instance",
  "demandeur": null,
  "participants": {
    "participantsInternes": null,
    "personnesAuditionnees": null
  },
  "sessionRef": null,
  "ouverturePresse": "true",
  "ODJ": {
    "convocationODJ": {
      "item": "Audition de M. Didier Leschi, directeur général de l’Office français de l’immigration et de l’intégration (OFII)."
    },
    "resumeODJ": {
      "item": "audition de M. Didier Leschi, directeur général de l’Office français de l’immigration et de l’intégration (OFII)."
    },
    "pointsODJ": null
  },
  "compteRenduRef": null
}