{
  "uid": "RUANR5L14S2018IDF0100222",
  "timeStampDebut": "2018-04-18T14:00:00.000+02:00",
  "timeStampFin": "2018-04-18T15:00:00.000+02:00",
  "lieu": {
    "code": "SALREU008",
    "libelleCourt": "5ème Bureau",
    "libelleLong": "5ème Bureau, Palais Bourbon"
  },
  "cycleDeVie": {
    "etat": "Confirmé",
    "chrono": {
      "creation": "2017-11-13T11:54:41.000+02:00",
      "cloture": null
    }
  },
  "demandeurs": {
    "acteur": {
      "nom": "M. Ludovic MENDES",
      "acteurRef": "PA720370"
    }
  },
  "organeReuniRef": null,
  "typeReunion": "DEP",
  "@xmlns:xsi": "http://www.w3.org/2001/XMLSchema-instance"
}