{
  "uid": "RUANR5L15S2018IDF0105681",
  "timeStampDebut": "2018-03-07T12:00:00.000+01:00",
  "timeStampFin": "2018-03-07T13:00:00.000+01:00",
  "lieu": {
    "code": "SALREU008",
    "libelleCourt": "5ème Bureau",
    "libelleLong": "5ème Bureau, Palais Bourbon"
  },
  "cycleDeVie": {
    "etat": "Confirmé",
    "chrono": {
      "creation": "2018-02-13T14:22:24.000+01:00",
      "cloture": null
    }
  },
  "demandeurs": {
    "acteur": {
      "nom": "Mme Michèle TABAROT",
      "acteurRef": "PA267794"
    }
  },
  "organeReuniRef": null,
  "typeReunion": "DEP",
  "@xmlns:xsi": "http://www.w3.org/2001/XMLSchema-instance"
}