{
  "uid": "RUANR5L15S2018IDF0104560",
  "timeStampDebut": "2018-03-19T14:00:00.000+01:00",
  "timeStampFin": "2018-03-19T16:00:00.000+01:00",
  "lieu": {
    "code": "SALREU007",
    "libelleCourt": "4ème Bureau",
    "libelleLong": "4ème Bureau, Palais Bourbon"
  },
  "cycleDeVie": {
    "etat": "Confirmé",
    "chrono": {
      "creation": "2018-01-29T13:07:58.000+01:00",
      "cloture": null
    }
  },
  "demandeurs": {
    "acteur": {
      "nom": "M. Éric ALAUZET",
      "acteurRef": "PA605963"
    }
  },
  "organeReuniRef": null,
  "typeReunion": "DEP",
  "@xmlns:xsi": "http://www.w3.org/2001/XMLSchema-instance"
}