{
  "uid": "RUANR5L15S2018IDF0103566",
  "timeStampDebut": "2018-01-17T11:00:00.000+01:00",
  "timeStampFin": "2018-01-17T13:00:00.000+01:00",
  "lieu": {
    "code": "SALREU038",
    "libelleCourt": "Salle 6549",
    "libelleLong": "Salle 6549, Palais Bourbon"
  },
  "cycleDeVie": {
    "etat": "Confirmé",
    "chrono": {
      "creation": "2018-01-15T12:23:56.000+01:00",
      "cloture": null
    }
  },
  "demandeurs": {
    "acteur": {
      "nom": "Mme Béatrice DESCAMPS",
      "acteurRef": "PA720696"
    }
  },
  "organeReuniRef": null,
  "typeReunion": "DEP",
  "@xmlns:xsi": "http://www.w3.org/2001/XMLSchema-instance"
}