{
  "uid": "RUANR5L15S2017IDS20618",
  "timeStampDebut": "2017-07-18T21:30:00.000+02:00",
  "timeStampFin": "2017-07-19T01:20:00.000+02:00",
  "lieu": {
    "code": "AN",
    "libelleLong": "Assemblée nationale"
  },
  "cycleDeVie": {
    "etat": "Confirmé",
    "chrono": {
      "creation": "2017-06-28T00:00:00.000+02:00",
      "cloture": null
    }
  },
  "organeReuniRef": "PO717460",
  "@xmlns:xsi": "http://www.w3.org/2001/XMLSchema-instance",
  "demandeur": null,
  "participants": null,
  "sessionRef": "SCR5A2017E1",
  "ouverturePresse": "true",
  "ODJ": {
    "convocationODJ": null,
    "resumeODJ": null,
    "pointsODJ": {
      "pointODJ": [
        {
          "@xsi:type": "podjSeanceConfPres_type",
          "uid": "RUANR5L15S2017IDS20618PT34934",
          "cycleDeVie": {
            "etat": "Confirmé",
            "chrono": {
              "creation": "2017-06-28T00:00:00.000+02:00",
              "cloture": null
            }
          },
          "objet": "Suite de la discussion du projet de loi de règlement du budget et d'approbation des comptes de l'année 2016",
          "demandeurPoint": null,
          "procedure": null,
          "dossiersLegislatifsRefs": {
            "dossierRef": "DLR5L15N35837"
          },
          "typePointODJ": "Suite de la discussion",
          "comiteSecret": "false",
          "textesAssocies": null,
          "natureTravauxODJ": "ODJPR"
        },
        {
          "@xsi:type": "podjSeanceConfPres_type",
          "uid": "RUANR5L15S2017IDS20618PT34945",
          "cycleDeVie": {
            "etat": "Confirmé",
            "chrono": {
              "creation": "2017-06-28T00:00:00.000+02:00",
              "cloture": null
            }
          },
          "objet": "Suite de la discussion du projet de loi ratifiant les ordonnances n° 2016-1058 du 3 août 2016 relative à la modification des règles applicables à l'évaluation environnementale des projets, plans et programmes et n° 2016-1060 du 3 août 2016 portant réforme des procédures destinées à assurer l'information et la participation du public à l'élaboration de certaines décisions susceptibles d'avoir une incidence sur l'environnement",
          "demandeurPoint": null,
          "procedure": null,
          "dossiersLegislatifsRefs": {
            "dossierRef": "DLR5L15N35843"
          },
          "typePointODJ": "Suite de la discussion",
          "comiteSecret": "false",
          "textesAssocies": null,
          "natureTravauxODJ": "ODJPR"
        }
      ]
    }
  },
  "compteRenduRef": "CRSANR5L15S2017E1N014",
  "identifiants": {
    "numSeanceJO": "14",
    "idJO": "20171014",
    "quantieme": "Deuxième",
    "DateSeance": "2017-07-18+02:00"
  }
}