{
  "uid": "RUANR5L14S2017IDF0094706",
  "timeStampDebut": "2017-07-26T16:15:00.000+02:00",
  "timeStampFin": "2017-07-26T18:00:00.000+02:00",
  "lieu": {
    "code": "SALREU048",
    "libelleCourt": "Salle 6809",
    "libelleLong": "Salle 6809, Palais Bourbon"
  },
  "cycleDeVie": {
    "etat": "Confirmé",
    "chrono": {
      "creation": "2017-07-25T10:47:04.000+02:00",
      "cloture": null
    }
  },
  "demandeurs": {
    "acteur": {
      "nom": "M. Gilles CARREZ",
      "acteurRef": "PA746"
    }
  },
  "organeReuniRef": null,
  "typeReunion": "DEP",
  "@xmlns:xsi": "http://www.w3.org/2001/XMLSchema-instance"
}