{
  "uid": "RUANR5L14S2017IDF0096286",
  "timeStampDebut": "2017-09-25T14:00:00.000+02:00",
  "timeStampFin": "2017-09-25T18:00:00.000+02:00",
  "lieu": {
    "code": "SALREU039",
    "libelleCourt": "Salle 6550",
    "libelleLong": "Salle 6550, Palais Bourbon"
  },
  "cycleDeVie": {
    "etat": "Annulé",
    "chrono": {
      "creation": "2017-09-14T10:15:33.000+02:00",
      "cloture": "2017-09-14T11:02:40.000+02:00"
    }
  },
  "demandeurs": {
    "acteur": {
      "nom": "Mme Catherine OSSON",
      "acteurRef": "PA720492"
    }
  },
  "organeReuniRef": null,
  "typeReunion": "DEP",
  "@xmlns:xsi": "http://www.w3.org/2001/XMLSchema-instance"
}