{
  "uid": "RUANR5L14S2017IDF0096803",
  "timeStampDebut": "2017-09-27T10:00:00.000+02:00",
  "timeStampFin": "2017-09-27T12:00:00.000+02:00",
  "lieu": {
    "code": "SALREU018",
    "libelleCourt": "Salon Mansart",
    "libelleLong": "Salon Mansart, 101, rue de l'Université"
  },
  "cycleDeVie": {
    "etat": "Confirmé",
    "chrono": {
      "creation": "2017-09-21T19:37:17.000+02:00",
      "cloture": null
    }
  },
  "demandeurs": {
    "acteur": {
      "nom": "M. Stéphane VIRY",
      "acteurRef": "PA721474"
    }
  },
  "organeReuniRef": null,
  "typeReunion": "DEP",
  "@xmlns:xsi": "http://www.w3.org/2001/XMLSchema-instance"
}