{
  "uid": "RUANR5L14S2018IDF0099982",
  "timeStampDebut": "2017-12-07T10:00:00.000+01:00",
  "timeStampFin": "2017-12-07T11:00:00.000+01:00",
  "lieu": {
    "code": "SALREU018",
    "libelleCourt": "Salon Mansart",
    "libelleLong": "Salon Mansart, 101, rue de l'Université"
  },
  "cycleDeVie": {
    "etat": "Confirmé",
    "chrono": {
      "creation": "2017-11-08T17:13:21.000+01:00",
      "cloture": null
    }
  },
  "demandeurs": {
    "organe": {
      "nom": "Groupe d'amitié France-Koweit",
      "organeRef": "PO733407"
    }
  },
  "organeReuniRef": "PO733407",
  "typeReunion": "GA",
  "@xmlns:xsi": "http://www.w3.org/2001/XMLSchema-instance"
}