{
  "uid": "RUANR5L14S2018IDF0102576",
  "timeStampDebut": "2018-01-18T14:30:00.000+01:00",
  "timeStampFin": "2018-01-18T16:00:00.000+01:00",
  "lieu": {
    "code": "SALREU021",
    "libelleCourt": "Salle 7207",
    "libelleLong": "Salle 7207, 101, rue de l'Université"
  },
  "cycleDeVie": {
    "etat": "Confirmé",
    "chrono": {
      "creation": "2017-12-18T12:35:18.000+01:00",
      "cloture": null
    }
  },
  "demandeurs": {
    "acteur": {
      "nom": "Mme Christelle DUBOS",
      "acteurRef": "PA719660"
    }
  },
  "organeReuniRef": null,
  "typeReunion": "DEP",
  "@xmlns:xsi": "http://www.w3.org/2001/XMLSchema-instance"
}