{
  "uid": "RUANR5L14S2017IDF0094766",
  "timeStampDebut": "2017-09-14T09:00:00.000+02:00",
  "timeStampFin": "2017-09-14T12:00:00.000+02:00",
  "lieu": {
    "code": "SALREU006",
    "libelleCourt": "3ème Bureau",
    "libelleLong": "3ème Bureau, Palais Bourbon"
  },
  "cycleDeVie": {
    "etat": "Confirmé",
    "chrono": {
      "creation": "2017-07-26T16:21:34.000+02:00",
      "cloture": null
    }
  },
  "demandeurs": {
    "acteur": [
      {
        "nom": "Mme Marie-Christine VERDIER-JOUCLAS",
        "acteurRef": "PA721542"
      },
      {
        "nom": "M. Gilles LE GENDRE",
        "acteurRef": "PA721466"
      }
    ]
  },
  "organeReuniRef": null,
  "typeReunion": "DEP",
  "@xmlns:xsi": "http://www.w3.org/2001/XMLSchema-instance"
}