{
  "uid": "RUANR5L14S2018IDF0101221",
  "timeStampDebut": "2017-12-05T09:00:00.000+01:00",
  "timeStampFin": "2017-12-05T11:30:00.000+01:00",
  "lieu": {
    "code": "SALREU042",
    "libelleCourt": "Salle 6566",
    "libelleLong": "Salle 6566, Palais Bourbon"
  },
  "cycleDeVie": {
    "etat": "Confirmé",
    "chrono": {
      "creation": "2017-11-23T09:07:45.000+01:00",
      "cloture": null
    }
  },
  "demandeurs": {
    "acteur": {
      "nom": "Mme Aude AMADOU",
      "acteurRef": "PA720124"
    }
  },
  "organeReuniRef": null,
  "typeReunion": "DEP",
  "@xmlns:xsi": "http://www.w3.org/2001/XMLSchema-instance"
}