{
  "uid": "RUANR5L14S2017IDF0093175",
  "timeStampDebut": "2017-06-26T12:00:00.000+02:00",
  "timeStampFin": "2017-06-26T14:00:00.000+02:00",
  "lieu": {
    "code": "SALREU023",
    "libelleCourt": "Salle 7426",
    "libelleLong": "Salle 7426, 101, rue de l'Université"
  },
  "cycleDeVie": {
    "etat": "Confirmé",
    "chrono": {
      "creation": "2017-06-26T12:05:24.000+02:00",
      "cloture": null
    }
  },
  "demandeurs": {
    "acteur": {
      "nom": "Mme Élisabeth TOUTUT-PICARD",
      "acteurRef": "PA719540"
    }
  },
  "organeReuniRef": null,
  "typeReunion": "DEP",
  "@xmlns:xsi": "http://www.w3.org/2001/XMLSchema-instance"
}