{
  "uid": "RUANR5L14S2018IDF0102869",
  "timeStampDebut": "2018-01-23T16:15:00.000+01:00",
  "timeStampFin": "2018-01-23T17:15:00.000+01:00",
  "lieu": {
    "code": "SALREU022",
    "libelleCourt": "Salle 7326",
    "libelleLong": "Salle 7326, 101, rue de l'Université"
  },
  "cycleDeVie": {
    "etat": "Confirmé",
    "chrono": {
      "creation": "2017-12-20T16:26:52.000+01:00",
      "cloture": null
    }
  },
  "demandeurs": {
    "acteur": {
      "nom": "Mme Véronique LOUWAGIE",
      "acteurRef": "PA608016"
    }
  },
  "organeReuniRef": null,
  "typeReunion": "DEP",
  "@xmlns:xsi": "http://www.w3.org/2001/XMLSchema-instance"
}