{
  "uid": "RUANR5L15S2018IDC427346",
  "timeStampDebut": "2017-10-17T14:45:00.000+02:00",
  "lieu": {
    "libelleLong": "salle 6350 ( Finances)"
  },
  "cycleDeVie": {
    "etat": "Supprimé",
    "chrono": {
      "creation": "2017-09-28T00:00:00.000+02:00",
      "cloture": "2017-10-04T00:00:00.000+02:00"
    }
  },
  "organeReuniRef": "PO59048",
  "@xmlns:xsi": "http://www.w3.org/2001/XMLSchema-instance",
  "demandeur": null,
  "participants": {
    "participantsInternes": null,
    "personnesAuditionnees": null
  },
  "sessionRef": null,
  "ouverturePresse": "false",
  "ODJ": {
    "convocationODJ": {
      "item": "–  Examen, en application de l’article 88 du Règlement, des amendements au projet de loi de programmation des finances publiques pour les années 2018 à 2022 (n° 234) et à la première partie du projet de loi de finances pour 2018 (n° 235) (M. Joël GIRAUD, rapporteur général)"
    },
    "resumeODJ": {
      "item": [
        "programmation des finances publiques 2018- 2022 (n° 234) (amendements, art. 88) ;",
        "loi de finances 2018 (1ère partie) (n° 235) (amendements, art. 88)."
      ]
    },
    "pointsODJ": null
  },
  "compteRenduRef": null
}