{
  "uid": "RUANR5L15S2018IDS20926",
  "timeStampDebut": "2018-02-22T21:30:00.000+01:00",
  "lieu": {
    "code": "AN",
    "libelleLong": "Assemblée nationale"
  },
  "cycleDeVie": {
    "etat": "Supprimé",
    "chrono": {
      "creation": "2018-01-26T00:00:00.000+01:00",
      "cloture": "2018-01-26T00:00:00.000+01:00"
    }
  },
  "organeReuniRef": "PO717460",
  "@xmlns:xsi": "http://www.w3.org/2001/XMLSchema-instance",
  "demandeur": null,
  "participants": null,
  "sessionRef": "SCR5A2018O1",
  "ouverturePresse": "true",
  "ODJ": {
    "convocationODJ": null,
    "resumeODJ": null,
    "pointsODJ": null
  },
  "compteRenduRef": null,
  "identifiants": {
    "numSeanceJO": null,
    "idJO": null,
    "quantieme": "Troisième",
    "DateSeance": "2018-02-22+01:00"
  }
}