{
  "uid": "RUANR5L15S2018IDC427705",
  "timeStampDebut": "2017-11-22T09:30:00.000+01:00",
  "timeStampFin": "2017-11-22T11:15:00.000+01:00",
  "lieu": {
    "libelleLong": "salle 4123 (33 rue Saint-Dominique)"
  },
  "cycleDeVie": {
    "etat": "Confirmé",
    "chrono": {
      "creation": "2017-11-02T00:00:00.000+01:00",
      "cloture": null
    }
  },
  "organeReuniRef": "PO59046",
  "@xmlns:xsi": "http://www.w3.org/2001/XMLSchema-instance",
  "demandeur": null,
  "participants": {
    "participantsInternes": {
      "participantInterne": [
        {
          "acteurRef": "PA605036",
          "presence": "présent"
        },
        {
          "acteurRef": "PA720798",
          "presence": "présent"
        },
        {
          "acteurRef": "PA606675",
          "presence": "absent"
        },
        {
          "acteurRef": "PA721158",
          "presence": "excusé"
        },
        {
          "acteurRef": "PA719100",
          "presence": "présent"
        },
        {
          "acteurRef": "PA610634",
          "presence": "excusé"
        },
        {
          "acteurRef": "PA719770",
          "presence": "excusé"
        },
        {
          "acteurRef": "PA721776",
          "presence": "présent"
        },
        {
          "acteurRef": "PA721522",
          "presence": "présent"
        },
        {
          "acteurRef": "PA642847",
          "presence": "présent"
        },
        {
          "acteurRef": "PA642935",
          "presence": "excusé"
        },
        {
          "acteurRef": "PA719024",
          "presence": "présent"
        },
        {
          "acteurRef": "PA718756",
          "presence": "présent"
        },
        {
          "acteurRef": "PA721816",
          "presence": "absent"
        },
        {
          "acteurRef": "PA672",
          "presence": "présent"
        },
        {
          "acteurRef": "PA720116",
          "presence": "absent"
        },
        {
          "acteurRef": "PA720622",
          "presence": "présent"
        },
        {
          "acteurRef": "PA429893",
          "presence": "excusé"
        },
        {
          "acteurRef": "PA719790",
          "presence": "présent"
        },
        {
          "acteurRef": "PA267306",
          "presence": "présent"
        },
        {
          "acteurRef": "PA267429",
          "presence": "présent"
        },
        {
          "acteurRef": "PA721210",
          "presence": "présent"
        },
        {
          "acteurRef": "PA719266",
          "presence": "présent"
        },
        {
          "acteurRef": "PA267241",
          "presence": "présent"
        },
        {
          "acteurRef": "PA342935",
          "presence": "excusé"
        },
        {
          "acteurRef": "PA606202",
          "presence": "présent"
        },
        {
          "acteurRef": "PA720996",
          "presence": "présent"
        },
        {
          "acteurRef": "PA719692",
          "presence": "excusé"
        },
        {
          "acteurRef": "PA609332",
          "presence": "excusé"
        },
        {
          "acteurRef": "PA267042",
          "presence": "présent"
        },
        {
          "acteurRef": "PA606171",
          "presence": "excusé"
        },
        {
          "acteurRef": "PA643103",
          "presence": "présent"
        },
        {
          "acteurRef": "PA719938",
          "presence": "présent"
        },
        {
          "acteurRef": "PA722134",
          "presence": "présent"
        },
        {
          "acteurRef": "PA267673",
          "presence": "présent"
        },
        {
          "acteurRef": "PA266774",
          "presence": "présent"
        },
        {
          "acteurRef": "PA267735",
          "presence": "présent"
        },
        {
          "acteurRef": "PA722358",
          "presence": "absent"
        },
        {
          "acteurRef": "PA719326",
          "presence": "présent"
        },
        {
          "acteurRef": "PA721296",
          "presence": "excusé"
        },
        {
          "acteurRef": "PA719330",
          "presence": "présent"
        },
        {
          "acteurRef": "PA721792",
          "presence": "excusé"
        },
        {
          "acteurRef": "PA1695",
          "presence": "excusé"
        },
        {
          "acteurRef": "PA720354",
          "presence": "absent"
        },
        {
          "acteurRef": "PA719052",
          "presence": "présent"
        },
        {
          "acteurRef": "PA722300",
          "presence": "présent"
        },
        {
          "acteurRef": "PA720846",
          "presence": "présent"
        },
        {
          "acteurRef": "PA268019",
          "presence": "présent"
        },
        {
          "acteurRef": "PA719918",
          "presence": "excusé"
        },
        {
          "acteurRef": "PA721434",
          "presence": "présent"
        },
        {
          "acteurRef": "PA719396",
          "presence": "présent"
        },
        {
          "acteurRef": "PA719404",
          "presence": "présent"
        },
        {
          "acteurRef": "PA722320",
          "presence": "présent"
        },
        {
          "acteurRef": "PA721946",
          "presence": "présent"
        },
        {
          "acteurRef": "PA2086",
          "presence": "excusé"
        },
        {
          "acteurRef": "PA721726",
          "presence": "présent"
        },
        {
          "acteurRef": "PA721734",
          "presence": "présent"
        },
        {
          "acteurRef": "PA719668",
          "presence": "excusé"
        },
        {
          "acteurRef": "PA720720",
          "presence": "présent"
        },
        {
          "acteurRef": "PA721916",
          "presence": "présent"
        },
        {
          "acteurRef": "PA608011",
          "presence": "présent"
        },
        {
          "acteurRef": "PA343493",
          "presence": "excusé"
        },
        {
          "acteurRef": "PA719822",
          "presence": "présent"
        },
        {
          "acteurRef": "PA718780",
          "presence": "présent"
        },
        {
          "acteurRef": "PA720394",
          "presence": "présent"
        },
        {
          "acteurRef": "PA718682",
          "presence": "présent"
        },
        {
          "acteurRef": "PA718768",
          "presence": "présent"
        },
        {
          "acteurRef": "PA334843",
          "presence": "absent"
        },
        {
          "acteurRef": "PA1012",
          "presence": "présent"
        }
      ]
    },
    "personnesAuditionnees": null
  },
  "sessionRef": null,
  "ouverturePresse": "false",
  "ODJ": {
    "convocationODJ": {
      "item": [
        "Audition de Mme l’ingénieure générale de l’armement Caroline Gervais, sur l’état d’avancement du projet Source Solde ;",
        "Désignation de rapporteurs et de membres de missions d’information."
      ]
    },
    "resumeODJ": {
      "item": [
        "audition de Mme l’ingénieure générale de l’armement Caroline Gervais, sur l’état d’avancement du projet Source Solde ;",
        "désignation de rapporteurs et de membres de missions d’information."
      ]
    },
    "pointsODJ": null
  },
  "compteRenduRef": "CRCANR5L15S2018PO59046N018"
}