{
  "uid": "RUANR5L15S2018IDF0106566",
  "timeStampDebut": "2018-04-03T08:30:00.000+02:00",
  "timeStampFin": "2018-04-03T12:30:00.000+02:00",
  "lieu": {
    "code": "SALREU032",
    "libelleCourt": "Sully 4",
    "libelleLong": "Sully 4, Palais Bourbon"
  },
  "cycleDeVie": {
    "etat": "Confirmé",
    "chrono": {
      "creation": "2018-02-23T18:19:43.000+02:00",
      "cloture": null
    }
  },
  "demandeurs": {
    "acteur": {
      "nom": "Mme Marie-Noëlle BATTISTEL",
      "acteurRef": "PA342415"
    }
  },
  "organeReuniRef": null,
  "typeReunion": "DEP",
  "@xmlns:xsi": "http://www.w3.org/2001/XMLSchema-instance"
}