{
  "uid": "RUANR5L14S2018IDF0097951",
  "timeStampDebut": "2017-10-20T08:00:00.000+02:00",
  "timeStampFin": "2017-10-20T20:30:00.000+02:00",
  "lieu": {
    "code": "SALREU001",
    "libelleCourt": "Salle Lamartine",
    "libelleLong": "Salle Lamartine, 101, rue de l'Université"
  },
  "cycleDeVie": {
    "etat": "Confirmé",
    "chrono": {
      "creation": "2017-10-04T16:04:35.000+02:00",
      "cloture": null
    }
  },
  "demandeurs": {
    "acteur": {
      "nom": "Mme Bérengère POLETTI",
      "acteurRef": "PA267260"
    }
  },
  "organeReuniRef": null,
  "typeReunion": "DEP",
  "@xmlns:xsi": "http://www.w3.org/2001/XMLSchema-instance"
}