{
  "uid": "RUANR5L14S2017IDF0096677",
  "timeStampDebut": "2017-09-26T15:00:00.000+02:00",
  "timeStampFin": "2017-09-26T16:00:00.000+02:00",
  "lieu": {
    "code": "SALREU008",
    "libelleCourt": "5ème Bureau",
    "libelleLong": "5ème Bureau, Palais Bourbon"
  },
  "cycleDeVie": {
    "etat": "Confirmé",
    "chrono": {
      "creation": "2017-09-20T15:05:17.000+02:00",
      "cloture": null
    }
  },
  "demandeurs": {
    "acteur": {
      "nom": "Mme Marie-Christine DALLOZ",
      "acteurRef": "PA332523"
    }
  },
  "organeReuniRef": null,
  "typeReunion": "DEP",
  "@xmlns:xsi": "http://www.w3.org/2001/XMLSchema-instance"
}