{
  "uid": "RUANR5L15S2018IDF0096613",
  "timeStampDebut": "2018-02-08T18:00:00.000+01:00",
  "timeStampFin": "2018-02-08T22:00:00.000+01:00",
  "lieu": {
    "code": "SALREU003",
    "libelleCourt": "Salle Victor Hugo",
    "libelleLong": "Salle Victor Hugo, 101, rue de l'Université"
  },
  "cycleDeVie": {
    "etat": "Confirmé",
    "chrono": {
      "creation": "2017-09-19T15:58:09.000+01:00",
      "cloture": null
    }
  },
  "demandeurs": {
    "acteur": {
      "nom": "Mme Naïma MOUTCHOU",
      "acteurRef": "PA720908"
    }
  },
  "organeReuniRef": null,
  "typeReunion": "DEP",
  "@xmlns:xsi": "http://www.w3.org/2001/XMLSchema-instance"
}