{
  "uid": "RUANR5L15S2018IDF0102932",
  "timeStampDebut": "2018-01-17T17:00:00.000+01:00",
  "timeStampFin": "2018-01-17T19:30:00.000+01:00",
  "lieu": {
    "code": "SALREU022",
    "libelleCourt": "Salle 7326",
    "libelleLong": "Salle 7326, 101, rue de l'Université"
  },
  "cycleDeVie": {
    "etat": "Annulé",
    "chrono": {
      "creation": "2017-12-20T18:30:43.000+01:00",
      "cloture": "2018-01-15T11:07:29.000+01:00"
    }
  },
  "demandeurs": {
    "acteur": {
      "nom": "M. Michel LARIVE",
      "acteurRef": "PA718868"
    }
  },
  "organeReuniRef": null,
  "typeReunion": "DEP",
  "@xmlns:xsi": "http://www.w3.org/2001/XMLSchema-instance"
}