{
  "uid": "RUANR5L14S2018IDF0098350",
  "timeStampDebut": "2017-10-16T19:00:00.000+02:00",
  "timeStampFin": "2017-10-16T21:00:00.000+02:00",
  "lieu": {
    "code": "SALREU012",
    "libelleCourt": "Salle N° 23",
    "libelleLong": "Salle N° 23, 3, rue Aristide Briand"
  },
  "cycleDeVie": {
    "etat": "Confirmé",
    "chrono": {
      "creation": "2017-10-10T17:34:46.000+02:00",
      "cloture": null
    }
  },
  "demandeurs": {
    "acteur": {
      "nom": "M. Régis JUANICO",
      "acteurRef": "PA332614"
    }
  },
  "organeReuniRef": null,
  "typeReunion": "DEP",
  "@xmlns:xsi": "http://www.w3.org/2001/XMLSchema-instance"
}