{
  "uid": "RUANR5L15S2018IDC427548",
  "timeStampDebut": "2017-11-06T15:05:00.000+01:00",
  "timeStampFin": "2017-11-06T17:00:00.000+01:00",
  "lieu": {
    "libelleLong": "salle 6351 (Affaires sociales)"
  },
  "cycleDeVie": {
    "etat": "Confirmé",
    "chrono": {
      "creation": "2017-10-12T00:00:00.000+02:00",
      "cloture": null
    }
  },
  "organeReuniRef": "PO420120",
  "@xmlns:xsi": "http://www.w3.org/2001/XMLSchema-instance",
  "demandeur": null,
  "participants": {
    "participantsInternes": {
      "participantInterne": [
        {
          "acteurRef": "PA642764",
          "presence": "absent"
        },
        {
          "acteurRef": "PA718744",
          "presence": "absent"
        },
        {
          "acteurRef": "PA610681",
          "presence": "excusé"
        },
        {
          "acteurRef": "PA720362",
          "presence": "absent"
        },
        {
          "acteurRef": "PA720968",
          "presence": "excusé"
        },
        {
          "acteurRef": "PA720822",
          "presence": "absent"
        },
        {
          "acteurRef": "PA719980",
          "presence": "absent"
        },
        {
          "acteurRef": "PA608083",
          "presence": "présent"
        },
        {
          "acteurRef": "PA713448",
          "presence": "absent"
        },
        {
          "acteurRef": "PA721336",
          "presence": "absent"
        },
        {
          "acteurRef": "PA720468",
          "presence": "absent"
        },
        {
          "acteurRef": "PA856",
          "presence": "absent"
        },
        {
          "acteurRef": "PA722126",
          "presence": "présent"
        },
        {
          "acteurRef": "PA719756",
          "presence": "absent"
        },
        {
          "acteurRef": "PA722390",
          "presence": "absent"
        },
        {
          "acteurRef": "PA720932",
          "presence": "présent"
        },
        {
          "acteurRef": "PA718694",
          "presence": "présent"
        },
        {
          "acteurRef": "PA718926",
          "presence": "présent"
        },
        {
          "acteurRef": "PA267289",
          "presence": "absent"
        },
        {
          "acteurRef": "PA608292",
          "presence": "excusé"
        },
        {
          "acteurRef": "PA720046",
          "presence": "absent"
        },
        {
          "acteurRef": "PA720924",
          "presence": "absent"
        },
        {
          "acteurRef": "PA719570",
          "presence": "absent"
        },
        {
          "acteurRef": "PA720286",
          "presence": "absent"
        },
        {
          "acteurRef": "PA267780",
          "presence": "absent"
        },
        {
          "acteurRef": "PA718706",
          "presence": "présent"
        },
        {
          "acteurRef": "PA721246",
          "presence": "présent"
        },
        {
          "acteurRef": "PA721992",
          "presence": "absent"
        },
        {
          "acteurRef": "PA720170",
          "presence": "absent"
        },
        {
          "acteurRef": "PA722062",
          "presence": "absent"
        },
        {
          "acteurRef": "PA267318",
          "presence": "absent"
        },
        {
          "acteurRef": "PA721126",
          "presence": "excusé"
        },
        {
          "acteurRef": "PA720326",
          "presence": "absent"
        },
        {
          "acteurRef": "PA331835",
          "presence": "absent"
        },
        {
          "acteurRef": "PA722374",
          "presence": "absent"
        },
        {
          "acteurRef": "PA720074",
          "presence": "absent"
        },
        {
          "acteurRef": "PA719186",
          "presence": "absent"
        },
        {
          "acteurRef": "PA719842",
          "presence": "absent"
        },
        {
          "acteurRef": "PA720916",
          "presence": "absent"
        },
        {
          "acteurRef": "PA720480",
          "presence": "absent"
        },
        {
          "acteurRef": "PA267378",
          "presence": "absent"
        },
        {
          "acteurRef": "PA606712",
          "presence": "absent"
        },
        {
          "acteurRef": "PA717379",
          "presence": "absent"
        },
        {
          "acteurRef": "PA719072",
          "presence": "absent"
        },
        {
          "acteurRef": "PA720738",
          "presence": "absent"
        },
        {
          "acteurRef": "PA610654",
          "presence": "excusé"
        },
        {
          "acteurRef": "PA2377",
          "presence": "absent"
        },
        {
          "acteurRef": "PA720500",
          "presence": "présent"
        },
        {
          "acteurRef": "PA721710",
          "presence": "présent"
        },
        {
          "acteurRef": "PA720512",
          "presence": "présent"
        },
        {
          "acteurRef": "PA718910",
          "presence": "absent"
        },
        {
          "acteurRef": "PA720422",
          "presence": "absent"
        },
        {
          "acteurRef": "PA721286",
          "presence": "présent"
        },
        {
          "acteurRef": "PA721070",
          "presence": "excusé"
        },
        {
          "acteurRef": "PA721062",
          "presence": "absent"
        },
        {
          "acteurRef": "PA718810",
          "presence": "absent"
        },
        {
          "acteurRef": "PA722022",
          "presence": "absent"
        },
        {
          "acteurRef": "PA721110",
          "presence": "excusé"
        },
        {
          "acteurRef": "PA720952",
          "presence": "absent"
        },
        {
          "acteurRef": "PA719350",
          "presence": "absent"
        },
        {
          "acteurRef": "PA722086",
          "presence": "absent"
        },
        {
          "acteurRef": "PA334768",
          "presence": "absent"
        },
        {
          "acteurRef": "PA719540",
          "presence": "absent"
        },
        {
          "acteurRef": "PA643145",
          "presence": "excusé"
        },
        {
          "acteurRef": "PA643134",
          "presence": "absent"
        },
        {
          "acteurRef": "PA719930",
          "presence": "présent"
        },
        {
          "acteurRef": "PA721924",
          "presence": "présent"
        },
        {
          "acteurRef": "PA642788",
          "presence": "absent"
        },
        {
          "acteurRef": "PA267585",
          "presence": "absent"
        },
        {
          "acteurRef": "PA722102",
          "presence": "absent"
        },
        {
          "acteurRef": "PA719512",
          "presence": "absent"
        },
        {
          "acteurRef": "PA721474",
          "presence": "présent"
        },
        {
          "acteurRef": "PA722268",
          "presence": "absent"
        }
      ]
    },
    "personnesAuditionnees": {
      "personneAuditionnee": [
        {
          "uid": {
            "@xsi:type": "IdPersonneExterne_type",
            "#text": "PE2393"
          },
          "ident": {
            "civ": "M.",
            "prenom": "Fabrice",
            "nom": "ANGEI"
          },
          "dateNais": "1959-11-12T01:00:00.000+01:00"
        },
        {
          "uid": {
            "@xsi:type": "IdPersonneExterne_type",
            "#text": "PE2394"
          },
          "ident": {
            "civ": "Mme",
            "prenom": "Véronique",
            "nom": "DESCACQ"
          },
          "dateNais": "1962-02-27T01:00:00.000+01:00"
        },
        {
          "uid": {
            "@xsi:type": "IdPersonneExterne_type",
            "#text": "PE2395"
          },
          "ident": {
            "civ": "Mme",
            "prenom": "Caroline",
            "nom": "Werkoff"
          },
          "dateNais": "1972-06-11T01:00:00.000+01:00"
        },
        {
          "uid": {
            "@xsi:type": "IdPersonneExterne_type",
            "#text": "PE2400"
          },
          "ident": {
            "civ": "M.",
            "prenom": "Michel",
            "nom": "Beaugas"
          },
          "dateNais": "1960-03-08T01:00:00.000+01:00"
        },
        {
          "uid": {
            "@xsi:type": "IdPersonneExterne_type",
            "#text": "PE2401"
          },
          "ident": {
            "civ": "Mme",
            "prenom": "Djamila",
            "nom": "Mones"
          },
          "dateNais": "1990-06-26T02:00:00.000+02:00"
        },
        {
          "uid": {
            "@xsi:type": "IdPersonneExterne_type",
            "#text": "PE2396"
          },
          "ident": {
            "civ": "M.",
            "prenom": "Gilles",
            "nom": "LECUELLE"
          },
          "dateNais": "1962-10-24T01:00:00.000+01:00"
        },
        {
          "uid": {
            "@xsi:type": "IdPersonneExterne_type",
            "#text": "PE2397"
          },
          "ident": {
            "civ": "Mme",
            "prenom": "Aurélie",
            "nom": "CEA"
          },
          "dateNais": "1986-06-16T02:00:00.000+02:00"
        },
        {
          "uid": {
            "@xsi:type": "IdPersonneExterne_type",
            "#text": "PE2398"
          },
          "ident": {
            "civ": "M.",
            "prenom": "Pierre",
            "nom": "JARDON"
          },
          "dateNais": "1981-08-04T02:00:00.000+02:00"
        },
        {
          "uid": {
            "@xsi:type": "IdPersonneExterne_type",
            "#text": "PE2399"
          },
          "ident": {
            "civ": "M.",
            "prenom": "Michel",
            "nom": "Charbonnier"
          },
          "dateNais": "1962-06-25T01:00:00.000+01:00"
        }
      ]
    }
  },
  "sessionRef": null,
  "ouverturePresse": "true",
  "ODJ": {
    "convocationODJ": {
      "item": "– Audition des organisations représentatives des salariés sur le projet de loi ratifiant diverses ordonnances prises sur le fondement de la loi n° 2017-1340 du 15 septembre 2017 d’habilitation à prendre les mesures pour le renforcement du dialogue social (n° 237) (M. Laurent Pietraszewski, rapporteur)"
    },
    "resumeODJ": {
      "item": "audition des organisations représentatives des salariés sur le projet de loi ratifiant diverses ordonnances prises sur le fondement de la loi n° 2017-1340 du 15 septembre 2017 d’habilitation à prendre les mesures pour le renforcement du dialogue social (n° 237)."
    },
    "pointsODJ": {
      "pointODJ": {
        "@xsi:type": "podjReunion_type",
        "uid": "RUANR5L15S2018IDC427548PT25113",
        "cycleDeVie": {
          "etat": "Eventuel",
          "chrono": {
            "creation": "2017-10-12T00:00:00.000+02:00",
            "cloture": null
          }
        },
        "objet": "Audition des organisations représentatives des salariés",
        "demandeurPoint": null,
        "procedure": null,
        "dossiersLegislatifsRefs": {
          "dossierRef": "DLR5L15N35986"
        },
        "typePointODJ": "Examen",
        "comiteSecret": "false",
        "textesAssocies": null
      }
    }
  },
  "compteRenduRef": "CRCANR5L15S2018PO420120N016"
}