{
  "uid": "RUANR5L14S2018IDF0099178",
  "timeStampDebut": "2017-11-06T16:00:00.000+01:00",
  "timeStampFin": "2017-11-06T17:30:00.000+01:00",
  "lieu": {
    "code": "SALREU003",
    "libelleCourt": "Salle Victor Hugo",
    "libelleLong": "Salle Victor Hugo, 101, rue de l'Université"
  },
  "cycleDeVie": {
    "etat": "Confirmé",
    "chrono": {
      "creation": "2017-10-23T18:53:33.000+01:00",
      "cloture": null
    }
  },
  "demandeurs": {
    "organe": {
      "nom": "GROUPE LA RÉPUBLIQUE EN MARCHE",
      "organeRef": "PO730964"
    }
  },
  "organeReuniRef": "PO730964",
  "typeReunion": "GP",
  "@xmlns:xsi": "http://www.w3.org/2001/XMLSchema-instance"
}