{
  "uid": "RUANR5L14S2018IDF0098846",
  "timeStampDebut": "2017-10-26T10:00:00.000+02:00",
  "timeStampFin": "2017-10-26T12:00:00.000+02:00",
  "lieu": {
    "code": "SALREU046",
    "libelleCourt": "Sully 1",
    "libelleLong": "Sully 1, Palais Bourbon"
  },
  "cycleDeVie": {
    "etat": "Confirmé",
    "chrono": {
      "creation": "2017-10-18T09:47:36.000+02:00",
      "cloture": null
    }
  },
  "demandeurs": {
    "acteur": {
      "nom": "M. Damien ADAM",
      "acteurRef": "PA722038"
    }
  },
  "organeReuniRef": null,
  "typeReunion": "DEP",
  "@xmlns:xsi": "http://www.w3.org/2001/XMLSchema-instance"
}