{
  "uid": "RUANR5L15S2018IDF0106823",
  "timeStampDebut": "2018-03-29T14:00:00.000+02:00",
  "timeStampFin": "2018-03-29T15:00:00.000+02:00",
  "lieu": {
    "code": "SALREU013",
    "libelleCourt": "Salle N° 3",
    "libelleLong": "Salle N° 3, 3, rue Aristide Briand"
  },
  "cycleDeVie": {
    "etat": "Confirmé",
    "chrono": {
      "creation": "2018-03-01T16:09:43.000+02:00",
      "cloture": null
    }
  },
  "demandeurs": {
    "acteur": {
      "nom": "Mme Michèle DE VAUCOULEURS",
      "acteurRef": "PA721924"
    }
  },
  "organeReuniRef": null,
  "typeReunion": "DEP",
  "@xmlns:xsi": "http://www.w3.org/2001/XMLSchema-instance"
}