{
  "uid": "RUANR5L14S2018IDF0099229",
  "timeStampDebut": "2017-11-29T19:30:00.000+01:00",
  "timeStampFin": "2017-11-29T21:00:00.000+01:00",
  "lieu": {
    "code": "SALREU028",
    "libelleCourt": "Salle Colbert",
    "libelleLong": "Salle Colbert , Palais Bourbon"
  },
  "cycleDeVie": {
    "etat": "Confirmé",
    "chrono": {
      "creation": "2017-10-24T18:55:39.000+01:00",
      "cloture": null
    }
  },
  "demandeurs": {
    "organe": {
      "nom": "GROUPE LA RÉPUBLIQUE EN MARCHE",
      "organeRef": "PO730964"
    }
  },
  "organeReuniRef": "PO730964",
  "typeReunion": "GP",
  "@xmlns:xsi": "http://www.w3.org/2001/XMLSchema-instance"
}