{
  "uid": "RUANR5L14S2017IDF0095155",
  "timeStampDebut": "2017-09-20T14:00:00.000+02:00",
  "timeStampFin": "2017-09-20T17:00:00.000+02:00",
  "lieu": {
    "code": "SALREU021",
    "libelleCourt": "Salle 7207",
    "libelleLong": "Salle 7207, 101, rue de l'Université"
  },
  "cycleDeVie": {
    "etat": "Confirmé",
    "chrono": {
      "creation": "2017-08-03T16:17:16.000+02:00",
      "cloture": null
    }
  },
  "demandeurs": {
    "acteur": {
      "nom": "Mme Perrine GOULET",
      "acteurRef": "PA720560"
    }
  },
  "organeReuniRef": null,
  "typeReunion": "DEP",
  "@xmlns:xsi": "http://www.w3.org/2001/XMLSchema-instance"
}