{
  "uid": "RUANR5L14S2018IDF0100819",
  "timeStampDebut": "2017-11-29T18:00:00.000+01:00",
  "timeStampFin": "2017-11-29T19:00:00.000+01:00",
  "lieu": {
    "code": "SALREU013",
    "libelleCourt": "Salle N° 3",
    "libelleLong": "Salle N° 3, 3, rue Aristide Briand"
  },
  "cycleDeVie": {
    "etat": "Confirmé",
    "chrono": {
      "creation": "2017-11-16T10:56:10.000+01:00",
      "cloture": null
    }
  },
  "demandeurs": {
    "acteur": {
      "nom": "Mme Aurore BERGÉ",
      "acteurRef": "PA722046"
    }
  },
  "organeReuniRef": null,
  "typeReunion": "DEP",
  "@xmlns:xsi": "http://www.w3.org/2001/XMLSchema-instance"
}