{
  "uid": "RUANR5L15S2018IDF0105959",
  "timeStampDebut": "2018-03-20T16:00:00.000+01:00",
  "timeStampFin": "2018-03-20T18:00:00.000+01:00",
  "lieu": {
    "code": "SALREU017",
    "libelleCourt": "Salon Visconti",
    "libelleLong": "Salon Visconti, 101, rue de l'Université"
  },
  "cycleDeVie": {
    "etat": "Confirmé",
    "chrono": {
      "creation": "2018-02-16T09:54:18.000+01:00",
      "cloture": null
    }
  },
  "demandeurs": {
    "organe": {
      "nom": "Groupe d'études L'INDUSTRIE AGRO-ALIMENTAIRE FACE AUX ENJEUX DE L'ALIMENTATION",
      "organeRef": "PO747037"
    }
  },
  "organeReuniRef": "PO747037",
  "typeReunion": "GE",
  "@xmlns:xsi": "http://www.w3.org/2001/XMLSchema-instance"
}