{
  "uid": "RUANR5L14S2018IDF0101556",
  "timeStampDebut": "2017-12-04T09:00:00.000+01:00",
  "timeStampFin": "2017-12-04T11:00:00.000+01:00",
  "lieu": {
    "code": "SALREU049",
    "libelleCourt": "Salle 6822",
    "libelleLong": "Salle 6822, Palais Bourbon"
  },
  "cycleDeVie": {
    "etat": "Confirmé",
    "chrono": {
      "creation": "2017-11-29T10:00:19.000+01:00",
      "cloture": null
    }
  },
  "demandeurs": {
    "acteur": {
      "nom": "Mme George PAU-LANGEVIN",
      "acteurRef": "PA335532"
    }
  },
  "organeReuniRef": null,
  "typeReunion": "DEP",
  "@xmlns:xsi": "http://www.w3.org/2001/XMLSchema-instance"
}