{
  "uid": "RUANR5L14S2018IDF0095207",
  "timeStampDebut": "2017-10-17T13:30:00.000+02:00",
  "timeStampFin": "2017-10-17T17:15:00.000+02:00",
  "lieu": {
    "code": "SALREU049",
    "libelleCourt": "Salle 6822",
    "libelleLong": "Salle 6822, Palais Bourbon"
  },
  "cycleDeVie": {
    "etat": "Annulé",
    "chrono": {
      "creation": "2017-08-04T16:54:34.000+02:00",
      "cloture": "2017-10-13T12:14:26.000+02:00"
    }
  },
  "demandeurs": {
    "acteur": [
      {
        "nom": "M. Pierre HENRIET",
        "acteurRef": "PA722070"
      },
      {
        "nom": "Mme Danièle HÉRIN",
        "acteurRef": "PA718794"
      }
    ]
  },
  "organeReuniRef": null,
  "typeReunion": "DEP",
  "@xmlns:xsi": "http://www.w3.org/2001/XMLSchema-instance"
}