{
  "uid": "RUANR5L14S2017IDF0095374",
  "timeStampDebut": "2017-09-05T17:00:00.000+02:00",
  "timeStampFin": "2017-09-05T18:00:00.000+02:00",
  "lieu": {
    "code": "SALREU008",
    "libelleCourt": "5ème Bureau",
    "libelleLong": "5ème Bureau, Palais Bourbon"
  },
  "cycleDeVie": {
    "etat": "Confirmé",
    "chrono": {
      "creation": "2017-08-25T16:34:32.000+02:00",
      "cloture": null
    }
  },
  "demandeurs": {
    "acteur": {
      "nom": "Mme George PAU-LANGEVIN",
      "acteurRef": "PA335532"
    }
  },
  "organeReuniRef": null,
  "typeReunion": "DEP",
  "@xmlns:xsi": "http://www.w3.org/2001/XMLSchema-instance"
}