{
  "uid": "RUANR5L14S2018IDF0097052",
  "timeStampDebut": "2017-10-05T14:15:00.000+02:00",
  "timeStampFin": "2017-10-05T15:15:00.000+02:00",
  "lieu": {
    "code": "SALREU007",
    "libelleCourt": "4ème Bureau",
    "libelleLong": "4ème Bureau, Palais Bourbon"
  },
  "cycleDeVie": {
    "etat": "Confirmé",
    "chrono": {
      "creation": "2017-09-26T11:26:19.000+02:00",
      "cloture": null
    }
  },
  "demandeurs": {
    "acteur": {
      "nom": "M. Daniel LABARONNE",
      "acteurRef": "PA719798"
    }
  },
  "organeReuniRef": null,
  "typeReunion": "DEP",
  "@xmlns:xsi": "http://www.w3.org/2001/XMLSchema-instance"
}