{
  "uid": "RUANR5L14S2017IDF0093328",
  "timeStampDebut": "2017-07-12T08:30:00.000+02:00",
  "timeStampFin": "2017-07-12T09:30:00.000+02:00",
  "lieu": {
    "code": "SALREU029",
    "libelleCourt": "Salon Mars III",
    "libelleLong": "Salon Mars III, 101, rue de l'Université"
  },
  "cycleDeVie": {
    "etat": "Confirmé",
    "chrono": {
      "creation": "2017-06-29T10:53:41.000+02:00",
      "cloture": null
    }
  },
  "demandeurs": {
    "acteur": {
      "nom": "M. Richard FERRAND",
      "acteurRef": "PA606171"
    }
  },
  "organeReuniRef": null,
  "typeReunion": "DEP",
  "@xmlns:xsi": "http://www.w3.org/2001/XMLSchema-instance"
}