{
  "uid": "RUANR5L14S2018IDF0095120",
  "timeStampDebut": "2017-10-05T10:00:00.000+02:00",
  "timeStampFin": "2017-10-05T12:00:00.000+02:00",
  "lieu": {
    "code": "SALREU039",
    "libelleCourt": "Salle 6550",
    "libelleLong": "Salle 6550, Palais Bourbon"
  },
  "cycleDeVie": {
    "etat": "Confirmé",
    "chrono": {
      "creation": "2017-08-03T10:55:02.000+02:00",
      "cloture": null
    }
  },
  "demandeurs": {
    "acteur": {
      "nom": "Mme Marie-Christine VERDIER-JOUCLAS",
      "acteurRef": "PA721542"
    }
  },
  "organeReuniRef": null,
  "typeReunion": "DEP",
  "@xmlns:xsi": "http://www.w3.org/2001/XMLSchema-instance"
}