{
  "uid": "RUANR5L15S2018IDF0106279",
  "timeStampDebut": "2018-04-03T10:00:00.000+02:00",
  "timeStampFin": "2018-04-03T11:00:00.000+02:00",
  "lieu": {
    "code": "SALREU045",
    "libelleCourt": "Sully 3",
    "libelleLong": "Sully 3, Palais Bourbon"
  },
  "cycleDeVie": {
    "etat": "Confirmé",
    "chrono": {
      "creation": "2018-02-20T18:47:53.000+02:00",
      "cloture": null
    }
  },
  "demandeurs": {
    "acteur": {
      "nom": "M. Thierry MICHELS",
      "acteurRef": "PA720738"
    }
  },
  "organeReuniRef": null,
  "typeReunion": "DEP",
  "@xmlns:xsi": "http://www.w3.org/2001/XMLSchema-instance"
}