{
  "uid": "RUANR5L14S2018IDF0095428",
  "timeStampDebut": "2017-11-28T17:30:00.000+01:00",
  "timeStampFin": "2017-11-28T20:00:00.000+01:00",
  "lieu": {
    "code": "SALREU008",
    "libelleCourt": "5ème Bureau",
    "libelleLong": "5ème Bureau, Palais Bourbon"
  },
  "cycleDeVie": {
    "etat": "Annulé",
    "chrono": {
      "creation": "2017-08-30T10:08:30.000+01:00",
      "cloture": "2017-10-06T10:48:16.000+01:00"
    }
  },
  "demandeurs": {
    "acteur": {
      "nom": "Mme Valérie LACROUTE",
      "acteurRef": "PA609245"
    }
  },
  "organeReuniRef": null,
  "typeReunion": "DEP",
  "@xmlns:xsi": "http://www.w3.org/2001/XMLSchema-instance"
}