{
  "uid": "RUANR5L14S2018IDF0099431",
  "timeStampDebut": "2017-10-31T14:00:00.000+01:00",
  "timeStampFin": "2017-10-31T15:00:00.000+01:00",
  "lieu": {
    "code": "SALREU032",
    "libelleCourt": "Sully 4",
    "libelleLong": "Sully 4, Palais Bourbon"
  },
  "cycleDeVie": {
    "etat": "Annulé",
    "chrono": {
      "creation": "2017-10-30T10:27:56.000+01:00",
      "cloture": "2017-10-30T14:51:44.000+01:00"
    }
  },
  "demandeurs": {
    "organe": {
      "nom": "GROUPE LA RÉPUBLIQUE EN MARCHE",
      "organeRef": "PO730964"
    }
  },
  "organeReuniRef": "PO730964",
  "typeReunion": "GP"
}