{
  "uid": "RUANR5L15S2018IDC428166",
  "timeStampDebut": "2018-01-16T13:30:00.000+01:00",
  "timeStampFin": "2018-01-16T15:05:00.000+01:00",
  "lieu": {
    "libelleLong": "6e Bureau"
  },
  "cycleDeVie": {
    "etat": "Confirmé",
    "chrono": {
      "creation": "2017-12-19T00:00:00.000+01:00",
      "cloture": null
    }
  },
  "organeReuniRef": "PO740454",
  "@xmlns:xsi": "http://www.w3.org/2001/XMLSchema-instance",
  "demandeur": null,
  "participants": {
    "participantsInternes": {
      "participantInterne": [
        {
          "acteurRef": "PA719318",
          "presence": "absent"
        },
        {
          "acteurRef": "PA335999",
          "presence": "absent"
        },
        {
          "acteurRef": "PA719488",
          "presence": "présent"
        },
        {
          "acteurRef": "PA720162",
          "presence": "absent"
        },
        {
          "acteurRef": "PA719740",
          "presence": "absent"
        },
        {
          "acteurRef": "PA719258",
          "presence": "présent"
        },
        {
          "acteurRef": "PA267355",
          "presence": "présent"
        },
        {
          "acteurRef": "PA719230",
          "presence": "présent"
        },
        {
          "acteurRef": "PA340853",
          "presence": "absent"
        },
        {
          "acteurRef": "PA719412",
          "presence": "absent"
        },
        {
          "acteurRef": "PA719154",
          "presence": "présent"
        },
        {
          "acteurRef": "PA2155",
          "presence": "présent"
        },
        {
          "acteurRef": "PA719456",
          "presence": "absent"
        },
        {
          "acteurRef": "PA719242",
          "presence": "absent"
        },
        {
          "acteurRef": "PA720278",
          "presence": "présent"
        },
        {
          "acteurRef": "PA720892",
          "presence": "absent"
        },
        {
          "acteurRef": "PA2377",
          "presence": "absent"
        },
        {
          "acteurRef": "PA718930",
          "presence": "présent"
        },
        {
          "acteurRef": "PA719350",
          "presence": "absent"
        },
        {
          "acteurRef": "PA719540",
          "presence": "présent"
        },
        {
          "acteurRef": "PA722268",
          "presence": "absent"
        },
        {
          "acteurRef": "PA722110",
          "presence": "absent"
        }
      ]
    },
    "personnesAuditionnees": null
  },
  "sessionRef": null,
  "ouverturePresse": "true",
  "ODJ": {
    "convocationODJ": {
      "item": "Audition de Mme Céline Imart, vice-présidente en charge de l’environnement et de Mme Claire Cannesson, responsable du service communication et des affaires publiques des Jeunes agriculteurs (JA)"
    },
    "resumeODJ": {
      "item": "audition de Mme Céline Imart, vice-présidente en charge de l’environnement et de Mme Claire Cannesson, responsable du service communication et des affaires publiques des Jeunes agriculteurs (JA)."
    },
    "pointsODJ": null
  },
  "compteRenduRef": null
}