{
  "uid": "RUANR5L15S2018IDF0106891",
  "timeStampDebut": "2018-03-12T15:30:00.000+01:00",
  "timeStampFin": "2018-03-12T18:30:00.000+01:00",
  "lieu": {
    "code": "SALREU011",
    "libelleCourt": "Salle N° 2",
    "libelleLong": "Salle N° 2, 3, rue Aristide Briand"
  },
  "cycleDeVie": {
    "etat": "Confirmé",
    "chrono": {
      "creation": "2018-03-05T12:45:07.000+01:00",
      "cloture": null
    }
  },
  "demandeurs": {
    "acteur": {
      "nom": "M. Pierre-Alain RAPHAN",
      "acteurRef": "PA721888"
    }
  },
  "organeReuniRef": null,
  "typeReunion": "DEP",
  "@xmlns:xsi": "http://www.w3.org/2001/XMLSchema-instance"
}