{
  "uid": "RUANR5L14S2018IDF0099395",
  "timeStampDebut": "2017-10-31T16:30:00.000+01:00",
  "timeStampFin": "2017-10-31T17:30:00.000+01:00",
  "lieu": {
    "code": "SALREU023",
    "libelleCourt": "Salle 7426",
    "libelleLong": "Salle 7426, 101, rue de l'Université"
  },
  "cycleDeVie": {
    "etat": "Confirmé",
    "chrono": {
      "creation": "2017-10-27T13:00:14.000+01:00",
      "cloture": null
    }
  },
  "demandeurs": {
    "acteur": {
      "nom": "M. Jean-Charles LARSONNEUR",
      "acteurRef": "PA719396"
    }
  },
  "organeReuniRef": null,
  "typeReunion": "DEP",
  "@xmlns:xsi": "http://www.w3.org/2001/XMLSchema-instance"
}