{
  "uid": "RUANR5L14S2018IDF0101448",
  "timeStampDebut": "2017-11-29T11:30:00.000+01:00",
  "timeStampFin": "2017-11-29T12:30:00.000+01:00",
  "lieu": {
    "code": "SALREU017",
    "libelleCourt": "Salon Visconti",
    "libelleLong": "Salon Visconti, 101, rue de l'Université"
  },
  "cycleDeVie": {
    "etat": "Confirmé",
    "chrono": {
      "creation": "2017-11-27T17:32:23.000+01:00",
      "cloture": null
    }
  },
  "demandeurs": {
    "acteur": {
      "nom": "M. Régis JUANICO",
      "acteurRef": "PA332614"
    }
  },
  "organeReuniRef": null,
  "typeReunion": "DEP",
  "@xmlns:xsi": "http://www.w3.org/2001/XMLSchema-instance"
}