{
  "uid": "RUANR5L14S2017IDF0093669",
  "timeStampDebut": "2017-08-29T10:30:00.000+02:00",
  "timeStampFin": "2017-08-29T13:00:00.000+02:00",
  "lieu": {
    "code": "SALREU026",
    "libelleCourt": "9ème Bureau",
    "libelleLong": "9ème Bureau, Palais Bourbon"
  },
  "cycleDeVie": {
    "etat": "Confirmé",
    "chrono": {
      "creation": "2017-07-07T11:05:11.000+02:00",
      "cloture": null
    }
  },
  "demandeurs": {
    "organe": {
      "nom": "GROUPE NOUVELLE GAUCHE",
      "organeRef": "PO730946"
    }
  },
  "organeReuniRef": "PO730946",
  "typeReunion": "GP",
  "@xmlns:xsi": "http://www.w3.org/2001/XMLSchema-instance"
}