{
  "uid": "RUANR5L14S2018IDF0095845",
  "timeStampDebut": "2017-10-25T08:00:00.000+02:00",
  "timeStampFin": "2017-10-25T11:00:00.000+02:00",
  "lieu": {
    "code": "SALREU029",
    "libelleCourt": "Salon Mars III",
    "libelleLong": "Salon Mars III, 101, rue de l'Université"
  },
  "cycleDeVie": {
    "etat": "Confirmé",
    "chrono": {
      "creation": "2017-09-07T14:40:08.000+02:00",
      "cloture": null
    }
  },
  "demandeurs": {
    "acteur": {
      "nom": "M. Bertrand PANCHER",
      "acteurRef": "PA333421"
    }
  },
  "organeReuniRef": null,
  "typeReunion": "DEP",
  "@xmlns:xsi": "http://www.w3.org/2001/XMLSchema-instance"
}