{
  "uid": "RUANR5L15S2018IDC428563",
  "timeStampDebut": "2018-02-13T17:30:00.000+01:00",
  "timeStampFin": "2018-02-13T19:30:00.000+01:00",
  "lieu": {
    "libelleLong": "salle 4223 - 33, rue Saint-Dominique, 2ème étage"
  },
  "cycleDeVie": {
    "etat": "Confirmé",
    "chrono": {
      "creation": "2018-02-09T00:00:00.000+01:00",
      "cloture": null
    }
  },
  "organeReuniRef": "PO59047",
  "@xmlns:xsi": "http://www.w3.org/2001/XMLSchema-instance",
  "demandeur": null,
  "participants": {
    "participantsInternes": {
      "participantInterne": [
        {
          "acteurRef": "PA588884",
          "presence": "excusé"
        },
        {
          "acteurRef": "PA642724",
          "presence": "absent"
        },
        {
          "acteurRef": "PA719218",
          "presence": "absent"
        },
        {
          "acteurRef": "PA721344",
          "presence": "présent"
        },
        {
          "acteurRef": "PA719032",
          "presence": "présent"
        },
        {
          "acteurRef": "PA330684",
          "presence": "absent"
        },
        {
          "acteurRef": "PA721118",
          "presence": "présent"
        },
        {
          "acteurRef": "PA719496",
          "presence": "absent"
        },
        {
          "acteurRef": "PA719448",
          "presence": "absent"
        },
        {
          "acteurRef": "PA719294",
          "presence": "présent"
        },
        {
          "acteurRef": "PA718850",
          "presence": "présent"
        },
        {
          "acteurRef": "PA998",
          "presence": "absent"
        },
        {
          "acteurRef": "PA1008",
          "presence": "présent"
        },
        {
          "acteurRef": "PA1029",
          "presence": "absent"
        },
        {
          "acteurRef": "PA720862",
          "presence": "présent"
        },
        {
          "acteurRef": "PA720438",
          "presence": "présent"
        },
        {
          "acteurRef": "PA722382",
          "presence": "présent"
        },
        {
          "acteurRef": "PA1198",
          "presence": "excusé"
        },
        {
          "acteurRef": "PA720684",
          "presence": "absent"
        },
        {
          "acteurRef": "PA1206",
          "presence": "absent"
        },
        {
          "acteurRef": "PA1276",
          "presence": "présent"
        },
        {
          "acteurRef": "PA722284",
          "presence": "absent"
        },
        {
          "acteurRef": "PA720806",
          "presence": "absent"
        },
        {
          "acteurRef": "PA721024",
          "presence": "excusé"
        },
        {
          "acteurRef": "PA720222",
          "presence": "présent"
        },
        {
          "acteurRef": "PA718674",
          "presence": "absent"
        },
        {
          "acteurRef": "PA1498",
          "presence": "absent"
        },
        {
          "acteurRef": "PA610775",
          "presence": "excusé"
        },
        {
          "acteurRef": "PA695100",
          "presence": "excusé"
        },
        {
          "acteurRef": "PA1630",
          "presence": "absent"
        },
        {
          "acteurRef": "PA333818",
          "presence": "excusé"
        },
        {
          "acteurRef": "PA267801",
          "presence": "absent"
        },
        {
          "acteurRef": "PA719210",
          "presence": "excusé"
        },
        {
          "acteurRef": "PA722344",
          "presence": "excusé"
        },
        {
          "acteurRef": "PA721644",
          "presence": "présent"
        },
        {
          "acteurRef": "PA720202",
          "presence": "présent"
        },
        {
          "acteurRef": "PA721004",
          "presence": "excusé"
        },
        {
          "acteurRef": "PA1809",
          "presence": "présent"
        },
        {
          "acteurRef": "PA335612",
          "presence": "excusé"
        },
        {
          "acteurRef": "PA722008",
          "presence": "absent"
        },
        {
          "acteurRef": "PA719388",
          "presence": "présent"
        },
        {
          "acteurRef": "PA721450",
          "presence": "absent"
        },
        {
          "acteurRef": "PA720342",
          "presence": "présent"
        },
        {
          "acteurRef": "PA720614",
          "presence": "excusé"
        },
        {
          "acteurRef": "PA1960",
          "presence": "excusé"
        },
        {
          "acteurRef": "PA721054",
          "presence": "présent"
        },
        {
          "acteurRef": "PA722178",
          "presence": "présent"
        },
        {
          "acteurRef": "PA334116",
          "presence": "absent"
        },
        {
          "acteurRef": "PA720146",
          "presence": "absent"
        },
        {
          "acteurRef": "PA720870",
          "presence": "présent"
        },
        {
          "acteurRef": "PA2150",
          "presence": "excusé"
        },
        {
          "acteurRef": "PA720370",
          "presence": "absent"
        },
        {
          "acteurRef": "PA719130",
          "presence": "absent"
        },
        {
          "acteurRef": "PA721734",
          "presence": "présent"
        },
        {
          "acteurRef": "PA719464",
          "presence": "absent"
        },
        {
          "acteurRef": "PA721486",
          "presence": "présent"
        },
        {
          "acteurRef": "PA721956",
          "presence": "absent"
        },
        {
          "acteurRef": "PA721182",
          "presence": "présent"
        },
        {
          "acteurRef": "PA267260",
          "presence": "présent"
        },
        {
          "acteurRef": "PA719528",
          "presence": "absent"
        },
        {
          "acteurRef": "PA2492",
          "presence": "présent"
        },
        {
          "acteurRef": "PA720552",
          "presence": "absent"
        },
        {
          "acteurRef": "PA2529",
          "presence": "absent"
        },
        {
          "acteurRef": "PA721824",
          "presence": "excusé"
        },
        {
          "acteurRef": "PA330788",
          "presence": "absent"
        },
        {
          "acteurRef": "PA720138",
          "presence": "absent"
        },
        {
          "acteurRef": "PA717151",
          "presence": "absent"
        },
        {
          "acteurRef": "PA722118",
          "presence": "présent"
        },
        {
          "acteurRef": "PA267794",
          "presence": "excusé"
        },
        {
          "acteurRef": "PA721690",
          "presence": "excusé"
        },
        {
          "acteurRef": "PA719550",
          "presence": "absent"
        },
        {
          "acteurRef": "PA2796",
          "presence": "absent"
        },
        {
          "acteurRef": "PA720830",
          "presence": "absent"
        },
        {
          "acteurRef": "PA720746",
          "presence": "excusé"
        }
      ]
    },
    "personnesAuditionnees": null
  },
  "sessionRef": null,
  "ouverturePresse": "false",
  "ODJ": {
    "convocationODJ": {
      "item": [
        "Compte-rendu, ouvert à la presse, de la mission au Mali, du 28 au 30 décembre 2017, d'une délégation de la commission des Affaires étrangères, composée de la présidente Mme Marielle de Sarnez, de M. Didier Quentin et de M. Benjamin Dirx ;",
        "Compte-rendu, ouvert à la presse, de la mission au Bangladesh (Situation des réfugiés Rohingyas), du 27 au 29 décembre 2017, d'une délégation de la commission des Affaires étrangères, composée de M. Jean-François Mbaye et de M. Christophe Naegelen."
      ]
    },
    "resumeODJ": {
      "item": [
        "compte-rendu, ouvert à la presse, de la mission au Mali, du 28 au 30 décembre 2017, d'une délégation de la commission des affaires étrangères, composée de la présidente Mme Marielle de Sarnez, de M. Didier Quentin et de M. Benjamin Dirx ;",
        "compte-rendu, ouvert à la presse, de la mission au Bangladesh (situation des réfugiés Rohingyas), du 27 au 29 décembre 2017, d'une délégation de la commission des affaires étrangères, composée de M. Jean-François Mbaye et de M. Christophe Naegelen."
      ]
    },
    "pointsODJ": null
  },
  "compteRenduRef": null
}