{
  "uid": "RUANR5L14S2017IDF0096649",
  "timeStampDebut": "2017-09-27T16:30:00.000+02:00",
  "timeStampFin": "2017-09-27T18:30:00.000+02:00",
  "lieu": {
    "code": "SALREU008",
    "libelleCourt": "5ème Bureau",
    "libelleLong": "5ème Bureau, Palais Bourbon"
  },
  "cycleDeVie": {
    "etat": "Confirmé",
    "chrono": {
      "creation": "2017-09-20T10:24:57.000+02:00",
      "cloture": null
    }
  },
  "demandeurs": {
    "acteur": {
      "nom": "M. Hervé PELLOIS",
      "acteurRef": "PA607595"
    }
  },
  "organeReuniRef": null,
  "typeReunion": "DEP",
  "@xmlns:xsi": "http://www.w3.org/2001/XMLSchema-instance"
}