{
  "uid": "RUANR5L14S2017IDF0095525",
  "timeStampDebut": "2017-09-26T17:00:00.000+02:00",
  "timeStampFin": "2017-09-26T19:00:00.000+02:00",
  "lieu": {
    "code": "SALREU019",
    "libelleCourt": "Salon Mars I",
    "libelleLong": "Salon Mars I, 101, rue de l'Université"
  },
  "cycleDeVie": {
    "etat": "Annulé",
    "chrono": {
      "creation": "2017-09-01T18:08:45.000+02:00",
      "cloture": "2017-09-18T18:43:01.000+02:00"
    }
  },
  "demandeurs": {
    "acteur": [
      {
        "nom": "Mme Sophie PANONACLE",
        "acteurRef": "PA719632"
      },
      {
        "nom": "Mme Sophie AUCONIE",
        "acteurRef": "PA719806"
      }
    ]
  },
  "organeReuniRef": null,
  "typeReunion": "DEP",
  "@xmlns:xsi": "http://www.w3.org/2001/XMLSchema-instance"
}