{
  "uid": "RUANR5L14S2017IDF0095137",
  "timeStampDebut": "2017-09-14T13:30:00.000+02:00",
  "timeStampFin": "2017-09-14T16:30:00.000+02:00",
  "lieu": {
    "code": "SALREU012",
    "libelleCourt": "Salle N° 23",
    "libelleLong": "Salle N° 23, 3, rue Aristide Briand"
  },
  "cycleDeVie": {
    "etat": "Confirmé",
    "chrono": {
      "creation": "2017-08-03T15:18:45.000+02:00",
      "cloture": null
    }
  },
  "demandeurs": {
    "acteur": {
      "nom": "M. Damien PICHEREAU",
      "acteurRef": "PA721372"
    }
  },
  "organeReuniRef": null,
  "typeReunion": "DEP",
  "@xmlns:xsi": "http://www.w3.org/2001/XMLSchema-instance"
}