{
  "uid": "RUANR5L15S2018IDC427929",
  "timeStampDebut": "2017-12-06T10:00:00.000+01:00",
  "lieu": {
    "libelleLong": "salle 6242 (Lois)"
  },
  "cycleDeVie": {
    "etat": "Supprimé",
    "chrono": {
      "creation": "2017-11-23T00:00:00.000+01:00",
      "cloture": "2017-11-30T00:00:00.000+01:00"
    }
  },
  "organeReuniRef": "PO59051",
  "@xmlns:xsi": "http://www.w3.org/2001/XMLSchema-instance",
  "demandeur": null,
  "participants": {
    "participantsInternes": null,
    "personnesAuditionnees": null
  },
  "sessionRef": null,
  "ouverturePresse": "false",
  "ODJ": {
    "convocationODJ": {
      "item": [
        "Examen pour avis du projet de loi relatif à l’organisation des jeux Olympiques et Paralympiques 2024 (n° 383) (M. Stéphane Mazars, rapporteur).",
        "Examen du rapport de la mission d’information relative à l’application d’une procédure d’amende forfaitaire au délit d’usage illicite de stupéfiants (MM. Éric Poulliat et Robin Reda, rapporteurs)."
      ]
    },
    "resumeODJ": {
      "item": [
        "examen pour avis du projet de loi relatif à l’organisation des jeux Olympiques et Paralympiques 2024 (n° 383) ;",
        "examen du rapport de la mission d’information relative à l’application d’une procédure d’amende forfaitaire au délit d’usage illicite de stupéfiants."
      ]
    },
    "pointsODJ": null
  },
  "compteRenduRef": null
}