{
  "uid": "RUANR5L15S2018IDF0104733",
  "timeStampDebut": "2018-02-06T14:00:00.000+01:00",
  "timeStampFin": "2018-02-06T15:00:00.000+01:00",
  "lieu": {
    "code": "SALREU004",
    "libelleCourt": "1er Bureau",
    "libelleLong": "1er Bureau, Palais Bourbon"
  },
  "cycleDeVie": {
    "etat": "Confirmé",
    "chrono": {
      "creation": "2018-01-30T19:15:36.000+01:00",
      "cloture": null
    }
  },
  "demandeurs": {
    "organe": {
      "nom": "GROUPE UDI, AGIR ET INDÉPENDANTS",
      "organeRef": "PO744425"
    }
  },
  "organeReuniRef": "PO744425",
  "typeReunion": "GP",
  "@xmlns:xsi": "http://www.w3.org/2001/XMLSchema-instance"
}