{
  "uid": "RUANR5L15S2017IDC427311",
  "timeStampDebut": "2017-09-28T17:00:00.000+02:00",
  "lieu": {
    "libelleLong": "salle 4325 (33 rue Saint-Dominique)"
  },
  "cycleDeVie": {
    "etat": "Confirmé",
    "chrono": {
      "creation": "2017-09-26T00:00:00.000+02:00",
      "cloture": null
    }
  },
  "organeReuniRef": "PO734692",
  "@xmlns:xsi": "http://www.w3.org/2001/XMLSchema-instance",
  "demandeur": null,
  "participants": {
    "participantsInternes": null,
    "personnesAuditionnees": null
  },
  "sessionRef": null,
  "ouverturePresse": "true",
  "ODJ": {
    "convocationODJ": {
      "item": [
        "Présentation de la méthodologie définie par le Bureau",
        "Définition du programme du groupe de travail",
        "Échanges de vues"
      ]
    },
    "resumeODJ": {
      "item": [
        "présentation de la méthodologie définie par le Bureau ;",
        "définition du programme du groupe de travail ;",
        "échanges de vues."
      ]
    },
    "pointsODJ": null
  },
  "compteRenduRef": null
}