{
  "uid": "RUANR5L15S2018IDF0107006",
  "timeStampDebut": "2018-03-16T14:00:00.000+01:00",
  "timeStampFin": "2018-03-16T18:00:00.000+01:00",
  "lieu": {
    "code": "SALREU023",
    "libelleCourt": "Salle 7426",
    "libelleLong": "Salle 7426, 101, rue de l'Université"
  },
  "cycleDeVie": {
    "etat": "Confirmé",
    "chrono": {
      "creation": "2018-03-06T15:09:49.000+01:00",
      "cloture": null
    }
  },
  "demandeurs": {
    "acteur": {
      "nom": "Mme Anne GENETET",
      "acteurRef": "PA721024"
    }
  },
  "organeReuniRef": null,
  "typeReunion": "DEP",
  "@xmlns:xsi": "http://www.w3.org/2001/XMLSchema-instance"
}