{
  "uid": "RUANR5L15S2018IDC427867",
  "timeStampDebut": "2017-11-22T17:05:00.000+01:00",
  "timeStampFin": "2017-11-22T18:10:00.000+01:00",
  "lieu": {
    "libelleLong": "salle 6549 (2e étage)"
  },
  "cycleDeVie": {
    "etat": "Confirmé",
    "chrono": {
      "creation": "2017-11-16T00:00:00.000+01:00",
      "cloture": null
    }
  },
  "organeReuniRef": "PO734758",
  "@xmlns:xsi": "http://www.w3.org/2001/XMLSchema-instance",
  "demandeur": null,
  "participants": {
    "participantsInternes": {
      "participantInterne": [
        {
          "acteurRef": "PA720430",
          "presence": "absent"
        },
        {
          "acteurRef": "PA719748",
          "presence": "absent"
        },
        {
          "acteurRef": "PA719616",
          "presence": "absent"
        },
        {
          "acteurRef": "PA721142",
          "presence": "absent"
        },
        {
          "acteurRef": "PA267200",
          "presence": "absent"
        },
        {
          "acteurRef": "PA721984",
          "presence": "absent"
        },
        {
          "acteurRef": "PA606098",
          "presence": "présent"
        },
        {
          "acteurRef": "PA346218",
          "presence": "absent"
        },
        {
          "acteurRef": "PA721800",
          "presence": "présent"
        },
        {
          "acteurRef": "PA719952",
          "presence": "absent"
        },
        {
          "acteurRef": "PA607619",
          "presence": "absent"
        },
        {
          "acteurRef": "PA266788",
          "presence": "absent"
        },
        {
          "acteurRef": "PA719202",
          "presence": "absent"
        },
        {
          "acteurRef": "PA721270",
          "presence": "absent"
        },
        {
          "acteurRef": "PA719600",
          "presence": "absent"
        },
        {
          "acteurRef": "PA643127",
          "presence": "absent"
        },
        {
          "acteurRef": "PA721584",
          "presence": "absent"
        },
        {
          "acteurRef": "PA608695",
          "presence": "absent"
        }
      ]
    },
    "personnesAuditionnees": null
  },
  "sessionRef": null,
  "ouverturePresse": "false",
  "ODJ": {
    "convocationODJ": {
      "item": "Audition de M. Jean-Louis Nadal, président de la Haute Autorité pour la transparence de la vie publique, accompagné de M. David Ginocchi, responsable du pôle juridique et de Mme Élodie Cuercq, cheffe du pôle communication et relations institutionnelles."
    },
    "resumeODJ": {
      "item": "audition, non ouverte à la presse, de M. Jean-Louis Nadal, président de la Haute Autorité pour la transparence de la vie publique, accompagné de M. David Ginocchi, responsable du pôle juridique et de Mme Élodie Cuercq, cheffe du pôle communication et relations institutionnelles."
    },
    "pointsODJ": null
  },
  "compteRenduRef": null
}