{
  "uid": "RUANR5L15S2018IDC427452",
  "timeStampDebut": "2017-10-26T15:00:00.000+02:00",
  "timeStampFin": "2017-10-26T17:15:00.000+02:00",
  "lieu": {
    "libelleLong": "salle Lamartine"
  },
  "cycleDeVie": {
    "etat": "Confirmé",
    "chrono": {
      "creation": "2017-10-05T00:00:00.000+02:00",
      "cloture": null
    }
  },
  "organeReuniRef": "PO59047",
  "@xmlns:xsi": "http://www.w3.org/2001/XMLSchema-instance",
  "demandeur": null,
  "participants": {
    "participantsInternes": {
      "participantInterne": [
        {
          "acteurRef": "PA588884",
          "presence": "présent"
        },
        {
          "acteurRef": "PA642724",
          "presence": "absent"
        },
        {
          "acteurRef": "PA719218",
          "presence": "présent"
        },
        {
          "acteurRef": "PA721344",
          "presence": "absent"
        },
        {
          "acteurRef": "PA719032",
          "presence": "présent"
        },
        {
          "acteurRef": "PA330684",
          "presence": "absent"
        },
        {
          "acteurRef": "PA721118",
          "presence": "excusé"
        },
        {
          "acteurRef": "PA719496",
          "presence": "présent"
        },
        {
          "acteurRef": "PA721166",
          "presence": "absent"
        },
        {
          "acteurRef": "PA719448",
          "presence": "absent"
        },
        {
          "acteurRef": "PA719294",
          "presence": "excusé"
        },
        {
          "acteurRef": "PA718850",
          "presence": "présent"
        },
        {
          "acteurRef": "PA998",
          "presence": "absent"
        },
        {
          "acteurRef": "PA1008",
          "presence": "présent"
        },
        {
          "acteurRef": "PA1029",
          "presence": "absent"
        },
        {
          "acteurRef": "PA720862",
          "presence": "absent"
        },
        {
          "acteurRef": "PA720438",
          "presence": "absent"
        },
        {
          "acteurRef": "PA722382",
          "presence": "absent"
        },
        {
          "acteurRef": "PA1198",
          "presence": "excusé"
        },
        {
          "acteurRef": "PA720684",
          "presence": "absent"
        },
        {
          "acteurRef": "PA1206",
          "presence": "absent"
        },
        {
          "acteurRef": "PA1276",
          "presence": "excusé"
        },
        {
          "acteurRef": "PA722284",
          "presence": "présent"
        },
        {
          "acteurRef": "PA720806",
          "presence": "absent"
        },
        {
          "acteurRef": "PA721024",
          "presence": "présent"
        },
        {
          "acteurRef": "PA720222",
          "presence": "absent"
        },
        {
          "acteurRef": "PA718674",
          "presence": "absent"
        },
        {
          "acteurRef": "PA1498",
          "presence": "absent"
        },
        {
          "acteurRef": "PA610775",
          "presence": "présent"
        },
        {
          "acteurRef": "PA695100",
          "presence": "présent"
        },
        {
          "acteurRef": "PA1630",
          "presence": "présent"
        },
        {
          "acteurRef": "PA333818",
          "presence": "absent"
        },
        {
          "acteurRef": "PA267801",
          "presence": "excusé"
        },
        {
          "acteurRef": "PA719210",
          "presence": "absent"
        },
        {
          "acteurRef": "PA722344",
          "presence": "absent"
        },
        {
          "acteurRef": "PA721644",
          "presence": "présent"
        },
        {
          "acteurRef": "PA720202",
          "presence": "présent"
        },
        {
          "acteurRef": "PA721004",
          "presence": "présent"
        },
        {
          "acteurRef": "PA1809",
          "presence": "absent"
        },
        {
          "acteurRef": "PA335612",
          "presence": "présent"
        },
        {
          "acteurRef": "PA722008",
          "presence": "présent"
        },
        {
          "acteurRef": "PA721450",
          "presence": "présent"
        },
        {
          "acteurRef": "PA720342",
          "presence": "présent"
        },
        {
          "acteurRef": "PA720614",
          "presence": "excusé"
        },
        {
          "acteurRef": "PA1960",
          "presence": "excusé"
        },
        {
          "acteurRef": "PA722178",
          "presence": "présent"
        },
        {
          "acteurRef": "PA334116",
          "presence": "absent"
        },
        {
          "acteurRef": "PA720146",
          "presence": "absent"
        },
        {
          "acteurRef": "PA720870",
          "presence": "présent"
        },
        {
          "acteurRef": "PA2150",
          "presence": "excusé"
        },
        {
          "acteurRef": "PA720370",
          "presence": "absent"
        },
        {
          "acteurRef": "PA719130",
          "presence": "absent"
        },
        {
          "acteurRef": "PA719464",
          "presence": "absent"
        },
        {
          "acteurRef": "PA721486",
          "presence": "absent"
        },
        {
          "acteurRef": "PA721956",
          "presence": "absent"
        },
        {
          "acteurRef": "PA721182",
          "presence": "présent"
        },
        {
          "acteurRef": "PA267260",
          "presence": "absent"
        },
        {
          "acteurRef": "PA719528",
          "presence": "absent"
        },
        {
          "acteurRef": "PA2492",
          "presence": "absent"
        },
        {
          "acteurRef": "PA720552",
          "presence": "absent"
        },
        {
          "acteurRef": "PA2529",
          "presence": "absent"
        },
        {
          "acteurRef": "PA721824",
          "presence": "excusé"
        },
        {
          "acteurRef": "PA330788",
          "presence": "absent"
        },
        {
          "acteurRef": "PA720138",
          "presence": "absent"
        },
        {
          "acteurRef": "PA717151",
          "presence": "présent"
        },
        {
          "acteurRef": "PA721174",
          "presence": "excusé"
        },
        {
          "acteurRef": "PA722118",
          "presence": "absent"
        },
        {
          "acteurRef": "PA267794",
          "presence": "absent"
        },
        {
          "acteurRef": "PA721690",
          "presence": "absent"
        },
        {
          "acteurRef": "PA719550",
          "presence": "présent"
        },
        {
          "acteurRef": "PA2796",
          "presence": "absent"
        },
        {
          "acteurRef": "PA720830",
          "presence": "présent"
        },
        {
          "acteurRef": "PA720746",
          "presence": "présent"
        }
      ]
    },
    "personnesAuditionnees": null
  },
  "sessionRef": null,
  "ouverturePresse": "false",
  "ODJ": {
    "convocationODJ": {
      "item": "Commission élargie - Action extérieure de l'Etat."
    },
    "resumeODJ": {
      "item": "Commission élargie - Action extérieure de l'Etat."
    },
    "pointsODJ": null
  },
  "compteRenduRef": null
}