{
  "uid": "RUANR5L15S2018IDF0105102",
  "timeStampDebut": "2018-02-21T18:30:00.000+01:00",
  "timeStampFin": "2018-02-21T19:30:00.000+01:00",
  "lieu": {
    "code": "SALREU021",
    "libelleCourt": "Salle 7207",
    "libelleLong": "Salle 7207, 101, rue de l'Université"
  },
  "cycleDeVie": {
    "etat": "Confirmé",
    "chrono": {
      "creation": "2018-02-05T10:40:48.000+01:00",
      "cloture": null
    }
  },
  "demandeurs": {
    "acteur": {
      "nom": "M. Thierry MICHELS",
      "acteurRef": "PA720738"
    }
  },
  "organeReuniRef": null,
  "typeReunion": "DEP",
  "@xmlns:xsi": "http://www.w3.org/2001/XMLSchema-instance"
}