{
  "uid": "RUANR5L14S2018IDF0097907",
  "timeStampDebut": "2017-10-09T15:00:00.000+02:00",
  "timeStampFin": "2017-10-09T16:00:00.000+02:00",
  "lieu": {
    "code": "SALREU022",
    "libelleCourt": "Salle 7326",
    "libelleLong": "Salle 7326, 101, rue de l'Université"
  },
  "cycleDeVie": {
    "etat": "Confirmé",
    "chrono": {
      "creation": "2017-10-04T12:28:54.000+02:00",
      "cloture": null
    }
  },
  "demandeurs": {
    "acteur": {
      "nom": "Mme Olivia GREGOIRE",
      "acteurRef": "PA721764"
    }
  },
  "organeReuniRef": null,
  "typeReunion": "DEP",
  "@xmlns:xsi": "http://www.w3.org/2001/XMLSchema-instance"
}