{
  "uid": "RUANR5L14S2017IDF0095136",
  "timeStampDebut": "2017-09-14T09:30:00.000+02:00",
  "timeStampFin": "2017-09-14T11:30:00.000+02:00",
  "lieu": {
    "code": "SALREU013",
    "libelleCourt": "Salle N° 3",
    "libelleLong": "Salle N° 3, 3, rue Aristide Briand"
  },
  "cycleDeVie": {
    "etat": "Annulé",
    "chrono": {
      "creation": "2017-08-03T15:16:52.000+02:00",
      "cloture": "2017-09-12T17:55:06.000+02:00"
    }
  },
  "demandeurs": {
    "acteur": {
      "nom": "M. Damien PICHEREAU",
      "acteurRef": "PA721372"
    }
  },
  "organeReuniRef": null,
  "typeReunion": "DEP",
  "@xmlns:xsi": "http://www.w3.org/2001/XMLSchema-instance"
}