{
  "uid": "RUANR5L14S2018IDF0099814",
  "timeStampDebut": "2017-11-21T14:00:00.000+01:00",
  "timeStampFin": "2017-11-21T15:00:00.000+01:00",
  "lieu": {
    "code": "SALREU042",
    "libelleCourt": "Salle 6566",
    "libelleLong": "Salle 6566, Palais Bourbon"
  },
  "cycleDeVie": {
    "etat": "Confirmé",
    "chrono": {
      "creation": "2017-11-06T16:56:05.000+01:00",
      "cloture": null
    }
  },
  "demandeurs": {
    "organe": {
      "nom": "Groupe d'amitié France-Israël",
      "organeRef": "PO733382"
    }
  },
  "organeReuniRef": "PO733382",
  "typeReunion": "GA",
  "@xmlns:xsi": "http://www.w3.org/2001/XMLSchema-instance"
}