{
  "uid": "RUANR5L15S2018IDF0104272",
  "timeStampDebut": "2018-01-29T15:00:00.000+01:00",
  "timeStampFin": "2018-01-29T16:30:00.000+01:00",
  "lieu": {
    "code": "SALREU010",
    "libelleCourt": "Salle N° 1",
    "libelleLong": "Salle N° 1, 3, rue Aristide Briand"
  },
  "cycleDeVie": {
    "etat": "Confirmé",
    "chrono": {
      "creation": "2018-01-24T09:38:26.000+01:00",
      "cloture": null
    }
  },
  "demandeurs": {
    "acteur": {
      "nom": "Mme Frédérique DUMAS",
      "acteurRef": "PA721194"
    }
  },
  "organeReuniRef": null,
  "typeReunion": "DEP",
  "@xmlns:xsi": "http://www.w3.org/2001/XMLSchema-instance"
}