{
  "uid": "RUANR5L15S2018IDF0106887",
  "timeStampDebut": "2018-03-21T14:00:00.000+01:00",
  "timeStampFin": "2018-03-21T15:00:00.000+01:00",
  "lieu": {
    "code": "SALREU049",
    "libelleCourt": "Salle 6822",
    "libelleLong": "Salle 6822, Palais Bourbon"
  },
  "cycleDeVie": {
    "etat": "Confirmé",
    "chrono": {
      "creation": "2018-03-05T12:18:31.000+01:00",
      "cloture": null
    }
  },
  "demandeurs": {
    "acteur": {
      "nom": "M. Jean-Luc FUGIT",
      "acteurRef": "PA722366"
    }
  },
  "organeReuniRef": null,
  "typeReunion": "DEP",
  "@xmlns:xsi": "http://www.w3.org/2001/XMLSchema-instance"
}