{
  "uid": "RUANR5L14S2018IDF0101954",
  "timeStampDebut": "2017-12-12T16:00:00.000+01:00",
  "timeStampFin": "2017-12-12T18:30:00.000+01:00",
  "lieu": {
    "code": "SALREU032",
    "libelleCourt": "Sully 4",
    "libelleLong": "Sully 4, Palais Bourbon"
  },
  "cycleDeVie": {
    "etat": "Confirmé",
    "chrono": {
      "creation": "2017-12-06T13:07:19.000+01:00",
      "cloture": null
    }
  },
  "demandeurs": {
    "acteur": {
      "nom": "M. Pierre DHARRÉVILLE",
      "acteurRef": "PA718926"
    }
  },
  "organeReuniRef": null,
  "typeReunion": "DEP",
  "@xmlns:xsi": "http://www.w3.org/2001/XMLSchema-instance"
}