{
  "uid": "RUANR5L15S2018IDF0103715",
  "timeStampDebut": "2018-01-24T11:00:00.000+01:00",
  "timeStampFin": "2018-01-24T12:30:00.000+01:00",
  "lieu": {
    "code": "SALREU022",
    "libelleCourt": "Salle 7326",
    "libelleLong": "Salle 7326, 101, rue de l'Université"
  },
  "cycleDeVie": {
    "etat": "Confirmé",
    "chrono": {
      "creation": "2018-01-17T10:25:09.000+01:00",
      "cloture": null
    }
  },
  "demandeurs": {
    "acteur": {
      "nom": "M. François CORNUT-GENTILLE",
      "acteurRef": "PA923"
    }
  },
  "organeReuniRef": null,
  "typeReunion": "DEP",
  "@xmlns:xsi": "http://www.w3.org/2001/XMLSchema-instance"
}