{
  "uid": "RUANR5L15S2018IDC428336",
  "timeStampDebut": "2018-01-25T09:40:00.000+01:00",
  "timeStampFin": "2018-01-25T11:05:00.000+01:00",
  "lieu": {
    "libelleLong": "salle Lamartine"
  },
  "cycleDeVie": {
    "etat": "Confirmé",
    "chrono": {
      "creation": "2018-01-22T00:00:00.000+01:00",
      "cloture": null
    }
  },
  "organeReuniRef": "PO742273",
  "@xmlns:xsi": "http://www.w3.org/2001/XMLSchema-instance",
  "demandeur": null,
  "participants": {
    "participantsInternes": {
      "participantInterne": [
        {
          "acteurRef": "PA722038",
          "presence": "absent"
        },
        {
          "acteurRef": "PA335999",
          "presence": "absent"
        },
        {
          "acteurRef": "PA342415",
          "presence": "absent"
        },
        {
          "acteurRef": "PA718756",
          "presence": "absent"
        },
        {
          "acteurRef": "PA642695",
          "presence": "absent"
        },
        {
          "acteurRef": "PA720520",
          "presence": "absent"
        },
        {
          "acteurRef": "PA721808",
          "presence": "absent"
        },
        {
          "acteurRef": "PA719710",
          "presence": "absent"
        },
        {
          "acteurRef": "PA712015",
          "presence": "absent"
        },
        {
          "acteurRef": "PA720046",
          "presence": "absent"
        },
        {
          "acteurRef": "PA720652",
          "presence": "excusé"
        },
        {
          "acteurRef": "PA720002",
          "presence": "présent"
        },
        {
          "acteurRef": "PA334149",
          "presence": "absent"
        },
        {
          "acteurRef": "PA720222",
          "presence": "absent"
        },
        {
          "acteurRef": "PA718674",
          "presence": "absent"
        },
        {
          "acteurRef": "PA719372",
          "presence": "présent"
        },
        {
          "acteurRef": "PA721514",
          "presence": "absent"
        },
        {
          "acteurRef": "PA719052",
          "presence": "absent"
        },
        {
          "acteurRef": "PA720846",
          "presence": "présent"
        },
        {
          "acteurRef": "PA331567",
          "presence": "absent"
        },
        {
          "acteurRef": "PA721134",
          "presence": "absent"
        },
        {
          "acteurRef": "PA606098",
          "presence": "présent"
        },
        {
          "acteurRef": "PA607595",
          "presence": "absent"
        },
        {
          "acteurRef": "PA721916",
          "presence": "absent"
        },
        {
          "acteurRef": "PA266776",
          "presence": "excusé"
        },
        {
          "acteurRef": "PA720692",
          "presence": "absent"
        },
        {
          "acteurRef": "PA720780",
          "presence": "absent"
        },
        {
          "acteurRef": "PA719420",
          "presence": "présent"
        },
        {
          "acteurRef": "PA267330",
          "presence": "absent"
        }
      ]
    },
    "personnesAuditionnees": null
  },
  "sessionRef": null,
  "ouverturePresse": "true",
  "ODJ": {
    "convocationODJ": {
      "item": "Audition, ouverte à la presse, de M. Régis Turrini, secrétaire général de SFR et ancien directeur de l’Agence des participations de l’État."
    },
    "resumeODJ": {
      "item": "audition, ouverte à la presse, de M. Régis Turrini, secrétaire général de SFR et ancien directeur de l’Agence des participations de l’État."
    },
    "pointsODJ": null
  },
  "compteRenduRef": "CRCANR5L15S2018PO742273N015"
}