{
  "uid": "RUANR5L14S2017IDF0093880",
  "timeStampDebut": "2017-07-19T11:00:00.000+02:00",
  "timeStampFin": "2017-07-19T12:00:00.000+02:00",
  "lieu": {
    "code": "SALREU021",
    "libelleCourt": "Salle 7207",
    "libelleLong": "Salle 7207, 101, rue de l'Université"
  },
  "cycleDeVie": {
    "etat": "Confirmé",
    "chrono": {
      "creation": "2017-07-12T14:47:36.000+02:00",
      "cloture": null
    }
  },
  "demandeurs": {
    "acteur": {
      "nom": "M. Michel LAUZZANA",
      "acteurRef": "PA720022"
    }
  },
  "organeReuniRef": null,
  "typeReunion": "DEP",
  "@xmlns:xsi": "http://www.w3.org/2001/XMLSchema-instance"
}