{
  "uid": "RUANR5L14S2018IDF0101742",
  "timeStampDebut": "2017-12-12T08:30:00.000+01:00",
  "timeStampFin": "2017-12-12T10:30:00.000+01:00",
  "lieu": {
    "code": "SALREU006",
    "libelleCourt": "3ème Bureau",
    "libelleLong": "3ème Bureau, Palais Bourbon"
  },
  "cycleDeVie": {
    "etat": "Confirmé",
    "chrono": {
      "creation": "2017-12-01T13:30:37.000+01:00",
      "cloture": null
    }
  },
  "demandeurs": {
    "acteur": {
      "nom": "M. Dominique POTIER",
      "acteurRef": "PA607553"
    }
  },
  "organeReuniRef": null,
  "typeReunion": "DEP",
  "@xmlns:xsi": "http://www.w3.org/2001/XMLSchema-instance"
}