{
  "uid": "RUANR5L15S2018IDF0105224",
  "timeStampDebut": "2018-03-28T13:30:00.000+02:00",
  "timeStampFin": "2018-03-28T15:00:00.000+02:00",
  "lieu": {
    "code": "SALREU006",
    "libelleCourt": "3ème Bureau",
    "libelleLong": "3ème Bureau, Palais Bourbon"
  },
  "cycleDeVie": {
    "etat": "Annulé",
    "chrono": {
      "creation": "2018-02-06T15:54:46.000+02:00",
      "cloture": "2018-03-05T16:20:55.000+02:00"
    }
  },
  "demandeurs": {
    "acteur": {
      "nom": "Mme Annaïg LE MEUR",
      "acteurRef": "PA719388"
    }
  },
  "organeReuniRef": null,
  "typeReunion": "DEP",
  "@xmlns:xsi": "http://www.w3.org/2001/XMLSchema-instance"
}