{
  "uid": "RUANR5L15S2018IDF0105863",
  "timeStampDebut": "2018-03-14T12:00:00.000+01:00",
  "timeStampFin": "2018-03-14T13:00:00.000+01:00",
  "lieu": {
    "code": "SALREU048",
    "libelleCourt": "Salle 6809",
    "libelleLong": "Salle 6809, Palais Bourbon"
  },
  "cycleDeVie": {
    "etat": "Confirmé",
    "chrono": {
      "creation": "2018-02-15T10:57:20.000+01:00",
      "cloture": null
    }
  },
  "demandeurs": {
    "acteur": {
      "nom": "M. Guillaume GAROT",
      "acteurRef": "PA333285"
    }
  },
  "organeReuniRef": null,
  "typeReunion": "DEP",
  "@xmlns:xsi": "http://www.w3.org/2001/XMLSchema-instance"
}