{
  "uid": "RUANR5L15S2018IDF0103912",
  "timeStampDebut": "2018-01-22T08:30:00.000+01:00",
  "timeStampFin": "2018-01-22T14:00:00.000+01:00",
  "lieu": {
    "code": "SALREU016",
    "libelleCourt": "Salon Gabriel",
    "libelleLong": "Salon Gabriel, 101, rue de l'Université"
  },
  "cycleDeVie": {
    "etat": "Confirmé",
    "chrono": {
      "creation": "2018-01-18T11:48:15.000+01:00",
      "cloture": null
    }
  },
  "demandeurs": {
    "acteur": {
      "nom": "Mme Amélie DE MONTCHALIN",
      "acteurRef": "PA721670"
    }
  },
  "organeReuniRef": null,
  "typeReunion": "DEP",
  "@xmlns:xsi": "http://www.w3.org/2001/XMLSchema-instance"
}