{
  "uid": "RUANR5L15S2018IDC428533",
  "timeStampDebut": "2018-02-20T10:30:00.000+01:00",
  "timeStampFin": "2018-02-20T12:05:00.000+01:00",
  "lieu": {
    "libelleLong": "salle 6350 (Finances)"
  },
  "cycleDeVie": {
    "etat": "Confirmé",
    "chrono": {
      "creation": "2018-02-08T00:00:00.000+01:00",
      "cloture": null
    }
  },
  "organeReuniRef": "PO738944",
  "@xmlns:xsi": "http://www.w3.org/2001/XMLSchema-instance",
  "demandeur": null,
  "participants": {
    "participantsInternes": {
      "participantInterne": [
        {
          "acteurRef": "PA605963",
          "presence": "présent"
        },
        {
          "acteurRef": "PA606507",
          "presence": "absent"
        },
        {
          "acteurRef": "PA721608",
          "presence": "présent"
        },
        {
          "acteurRef": "PA720298",
          "presence": "présent"
        },
        {
          "acteurRef": "PA721202",
          "presence": "présent"
        },
        {
          "acteurRef": "PA942",
          "presence": "présent"
        },
        {
          "acteurRef": "PA332523",
          "presence": "absent"
        },
        {
          "acteurRef": "PA267440",
          "presence": "présent"
        },
        {
          "acteurRef": "PA267336",
          "presence": "excusé"
        },
        {
          "acteurRef": "PA722054",
          "presence": "absent"
        },
        {
          "acteurRef": "PA719994",
          "presence": "absent"
        },
        {
          "acteurRef": "PA719798",
          "presence": "présent"
        },
        {
          "acteurRef": "PA608016",
          "presence": "absent"
        },
        {
          "acteurRef": "PA720728",
          "presence": "présent"
        },
        {
          "acteurRef": "PA721418",
          "presence": "présent"
        },
        {
          "acteurRef": "PA720908",
          "presence": "absent"
        },
        {
          "acteurRef": "PA718736",
          "presence": "absent"
        },
        {
          "acteurRef": "PA722398",
          "presence": "absent"
        },
        {
          "acteurRef": "PA720692",
          "presence": "absent"
        },
        {
          "acteurRef": "PA720878",
          "presence": "présent"
        },
        {
          "acteurRef": "PA721314",
          "presence": "absent"
        },
        {
          "acteurRef": "PA608695",
          "presence": "absent"
        },
        {
          "acteurRef": "PA722260",
          "presence": "absent"
        }
      ]
    },
    "personnesAuditionnees": null
  },
  "sessionRef": null,
  "ouverturePresse": "true",
  "ODJ": {
    "convocationODJ": {
      "item": "Table ronde des organisations d’avocats : M. Marc BORNHAUSER, président de l’Institut des Avocats Conseils Fiscaux accompagné de Mme Eva OBADIA, avocat fiscaliste, président de la sous-commission fiscale contrôle et procédure auprès de l’Ordre des avocats de Paris, M. Jacques TAQUET, fiscaliste et membre de la commission « Droit et entreprise », du Conseil national des Barreaux, M. Philippe ROCHMANN, avocat fiscaliste et Mme Laurence DUPUIS, juriste"
    },
    "resumeODJ": {
      "item": "table ronde des organisations d’avocats : M. Marc Bornhauser, président de l’Institut des Avocats Conseils Fiscaux accompagné de Mme Eva Obadia, avocat fiscaliste, président de la sous-commission fiscale contrôle et procédure auprès de l’Ordre des avocats de Paris, M. Jacques Taquet, fiscaliste et membre de la commission « Droit et entreprise », du Conseil national des Barreaux, M. Philippe Rochmann, avocat fiscaliste et Mme Laurence Dupuis, juriste."
    },
    "pointsODJ": null
  },
  "compteRenduRef": null
}