{
  "uid": "RUANR5L15S2018IDF0102799",
  "timeStampDebut": "2018-02-27T10:15:00.000+01:00",
  "timeStampFin": "2018-02-27T10:45:00.000+01:00",
  "lieu": {
    "code": "SALREU027",
    "libelleCourt": "Salle 6217",
    "libelleLong": "Salle 6217, Palais Bourbon"
  },
  "cycleDeVie": {
    "etat": "Confirmé",
    "chrono": {
      "creation": "2017-12-20T16:11:10.000+01:00",
      "cloture": null
    }
  },
  "demandeurs": {
    "acteur": {
      "nom": "M. Christian JACOB",
      "acteurRef": "PA1695"
    }
  },
  "organeReuniRef": null,
  "typeReunion": "DEP",
  "@xmlns:xsi": "http://www.w3.org/2001/XMLSchema-instance"
}