{
  "uid": "RUANR5L15S2018IDF0106697",
  "timeStampDebut": "2018-03-07T09:30:00.000+01:00",
  "timeStampFin": "2018-03-07T11:30:00.000+01:00",
  "lieu": {
    "code": "SALREU006",
    "libelleCourt": "3ème Bureau",
    "libelleLong": "3ème Bureau, Palais Bourbon"
  },
  "cycleDeVie": {
    "etat": "Confirmé",
    "chrono": {
      "creation": "2018-02-27T15:40:37.000+01:00",
      "cloture": null
    }
  },
  "demandeurs": {
    "acteur": {
      "nom": "M. Michel VIALAY",
      "acteurRef": "PA721968"
    }
  },
  "organeReuniRef": null,
  "typeReunion": "DEP",
  "@xmlns:xsi": "http://www.w3.org/2001/XMLSchema-instance"
}