{
  "uid": "RUANR5L14S2018IDF0096304",
  "timeStampDebut": "2017-10-03T13:30:00.000+02:00",
  "timeStampFin": "2017-10-03T14:30:00.000+02:00",
  "lieu": {
    "code": "SALREU038",
    "libelleCourt": "Salle 6549",
    "libelleLong": "Salle 6549, Palais Bourbon"
  },
  "cycleDeVie": {
    "etat": "Confirmé",
    "chrono": {
      "creation": "2017-09-14T11:02:50.000+02:00",
      "cloture": null
    }
  },
  "demandeurs": {
    "acteur": {
      "nom": "M. Marc LE FUR",
      "acteurRef": "PA1874"
    }
  },
  "organeReuniRef": null,
  "typeReunion": "DEP",
  "@xmlns:xsi": "http://www.w3.org/2001/XMLSchema-instance"
}