{
  "uid": "RUANR5L14S2018IDF0101587",
  "timeStampDebut": "2017-12-06T16:30:00.000+01:00",
  "timeStampFin": "2017-12-06T18:00:00.000+01:00",
  "lieu": {
    "code": "SALREU006",
    "libelleCourt": "3ème Bureau",
    "libelleLong": "3ème Bureau, Palais Bourbon"
  },
  "cycleDeVie": {
    "etat": "Annulé",
    "chrono": {
      "creation": "2017-11-29T15:15:28.000+01:00",
      "cloture": "2017-12-04T19:00:23.000+01:00"
    }
  },
  "demandeurs": {
    "acteur": {
      "nom": "Mme Monique IBORRA",
      "acteurRef": "PA331835"
    }
  },
  "organeReuniRef": null,
  "typeReunion": "DEP",
  "@xmlns:xsi": "http://www.w3.org/2001/XMLSchema-instance"
}