{
  "uid": "RUANR5L15S2018IDF0103394",
  "timeStampDebut": "2018-01-12T09:00:00.000+01:00",
  "timeStampFin": "2018-01-12T10:00:00.000+01:00",
  "lieu": {
    "code": "SALREU046",
    "libelleCourt": "Sully 1",
    "libelleLong": "Sully 1, Palais Bourbon"
  },
  "cycleDeVie": {
    "etat": "Confirmé",
    "chrono": {
      "creation": "2018-01-11T11:22:03.000+01:00",
      "cloture": null
    }
  },
  "demandeurs": {
    "acteur": {
      "nom": "M. Guillaume VUILLETET",
      "acteurRef": "PA721262"
    }
  },
  "organeReuniRef": null,
  "typeReunion": "DEP",
  "@xmlns:xsi": "http://www.w3.org/2001/XMLSchema-instance"
}