{
  "uid": "RUANR5L14S2018IDF0097731",
  "timeStampDebut": "2018-01-16T10:00:00.000+01:00",
  "timeStampFin": "2018-01-16T12:00:00.000+01:00",
  "lieu": {
    "code": "SALREU005",
    "libelleCourt": "2ème Bureau",
    "libelleLong": "2ème Bureau, Palais Bourbon"
  },
  "cycleDeVie": {
    "etat": "Confirmé",
    "chrono": {
      "creation": "2017-10-02T17:33:21.000+01:00",
      "cloture": null
    }
  },
  "demandeurs": {
    "acteur": {
      "nom": "M. André CHASSAIGNE",
      "acteurRef": "PA267306"
    }
  },
  "organeReuniRef": null,
  "typeReunion": "DEP",
  "@xmlns:xsi": "http://www.w3.org/2001/XMLSchema-instance"
}