{
  "uid": "RUANR5L15S2018IDC427277",
  "timeStampDebut": "2017-10-20T09:30:00.000+02:00",
  "lieu": {
    "libelleLong": "salle 6351 (Affaires sociales)"
  },
  "cycleDeVie": {
    "etat": "Annulé",
    "chrono": {
      "creation": "2017-09-19T00:00:00.000+02:00",
      "cloture": "2017-10-18T00:00:00.000+02:00"
    }
  },
  "organeReuniRef": "PO420120",
  "@xmlns:xsi": "http://www.w3.org/2001/XMLSchema-instance",
  "demandeur": null,
  "participants": {
    "participantsInternes": null,
    "personnesAuditionnees": null
  },
  "sessionRef": null,
  "ouverturePresse": "true",
  "ODJ": {
    "convocationODJ": {
      "item": "- Suite de l'examen des articles du projet de loi de financement de la sécurité sociale pour 2018 (n°269) (M. Olivier Véran, rapporteur général)"
    },
    "resumeODJ": {
      "item": "éventuellement : loi de financement de la sécurité sociale pour 2018 (n°269) (suite) (rapport)."
    },
    "pointsODJ": null
  },
  "compteRenduRef": null
}