{
  "uid": "RUANR5L14S2018IDF0095174",
  "timeStampDebut": "2017-10-02T09:00:00.000+02:00",
  "timeStampFin": "2017-10-02T12:30:00.000+02:00",
  "lieu": {
    "code": "SALREU048",
    "libelleCourt": "Salle 6809",
    "libelleLong": "Salle 6809, Palais Bourbon"
  },
  "cycleDeVie": {
    "etat": "Confirmé",
    "chrono": {
      "creation": "2017-08-04T09:55:01.000+02:00",
      "cloture": null
    }
  },
  "demandeurs": {
    "acteur": {
      "nom": "M. Pierre-Yves BOURNAZEL",
      "acteurRef": "PA722030"
    }
  },
  "organeReuniRef": null,
  "typeReunion": "DEP",
  "@xmlns:xsi": "http://www.w3.org/2001/XMLSchema-instance"
}