{
  "uid": "RUANR5L14S2018IDF0103097",
  "timeStampDebut": "2018-01-04T10:00:00.000+01:00",
  "timeStampFin": "2018-01-04T18:00:00.000+01:00",
  "lieu": {
    "code": "SALREU011",
    "libelleCourt": "Salle N° 2",
    "libelleLong": "Salle N° 2, 3, rue Aristide Briand"
  },
  "cycleDeVie": {
    "etat": "Confirmé",
    "chrono": {
      "creation": "2017-12-26T17:47:34.000+01:00",
      "cloture": null
    }
  },
  "demandeurs": {
    "acteur": {
      "nom": "M. Pierre-Alain RAPHAN",
      "acteurRef": "PA721888"
    }
  },
  "organeReuniRef": null,
  "typeReunion": "DEP",
  "@xmlns:xsi": "http://www.w3.org/2001/XMLSchema-instance"
}