{
  "uid": "RUANR5L14S2018IDF0098838",
  "timeStampDebut": "2017-10-31T12:00:00.000+01:00",
  "timeStampFin": "2017-10-31T13:00:00.000+01:00",
  "lieu": {
    "code": "SALREU008",
    "libelleCourt": "5ème Bureau",
    "libelleLong": "5ème Bureau, Palais Bourbon"
  },
  "cycleDeVie": {
    "etat": "Annulé",
    "chrono": {
      "creation": "2017-10-17T18:26:52.000+01:00",
      "cloture": "2017-10-27T18:18:18.000+01:00"
    }
  },
  "demandeurs": {
    "acteur": {
      "nom": "Mme Michèle TABAROT",
      "acteurRef": "PA267794"
    }
  },
  "organeReuniRef": null,
  "typeReunion": "DEP",
  "@xmlns:xsi": "http://www.w3.org/2001/XMLSchema-instance"
}