{
  "uid": "RUANR5L15S2018IDC428622",
  "timeStampDebut": "2018-02-22T11:00:00.000+01:00",
  "lieu": {
    "libelleLong": "salle 6238 (Affaires culturelles)"
  },
  "cycleDeVie": {
    "etat": "Confirmé",
    "chrono": {
      "creation": "2018-02-16T00:00:00.000+01:00",
      "cloture": null
    }
  },
  "organeReuniRef": "PO746694",
  "@xmlns:xsi": "http://www.w3.org/2001/XMLSchema-instance",
  "demandeur": null,
  "participants": {
    "participantsInternes": null,
    "personnesAuditionnees": {
      "personneAuditionnee": [
        {
          "uid": {
            "@xsi:type": "IdPersonneExterne_type",
            "#text": "PE2576"
          },
          "ident": {
            "civ": "Mme",
            "prenom": "Liliane",
            "nom": "Moyano"
          },
          "dateNais": null
        },
        {
          "uid": {
            "@xsi:type": "IdPersonneExterne_type",
            "#text": "PE2577"
          },
          "ident": {
            "civ": "M.",
            "prenom": "Vincent",
            "nom": "Goutines"
          },
          "dateNais": null
        },
        {
          "uid": {
            "@xsi:type": "IdPersonneExterne_type",
            "#text": "PE2578"
          },
          "ident": {
            "civ": "M.",
            "prenom": "Christophe",
            "nom": "Abraham"
          },
          "dateNais": null
        },
        {
          "uid": {
            "@xsi:type": "IdPersonneExterne_type",
            "#text": "PE2579"
          },
          "ident": {
            "civ": "M.",
            "prenom": "Laurent",
            "nom": "Zamecskowski"
          },
          "dateNais": null
        },
        {
          "uid": {
            "@xsi:type": "IdPersonneExterne_type",
            "#text": "PE2580"
          },
          "ident": {
            "civ": "Mme",
            "prenom": "Patricia",
            "nom": "Lazzaro"
          },
          "dateNais": null
        },
        {
          "uid": {
            "@xsi:type": "IdPersonneExterne_type",
            "#text": "PE2581"
          },
          "ident": {
            "civ": "M.",
            "prenom": "François",
            "nom": "Lasne"
          },
          "dateNais": null
        }
      ]
    }
  },
  "sessionRef": null,
  "ouverturePresse": "true",
  "ODJ": {
    "convocationODJ": {
      "item": "Table ronde :\n- Fédération des conseils de parents d’élèves (FCPE) – Mme Liliana Moyano, présidente\n- Association de parents d'élèves de l'enseignement libre (APEL) – M. Vincent Goutines, membre du bureau national, et M. Christophe Abraham, chargé des relations avec le Parlement\n- Fédération des parents d’élèves de l’enseignement public (PEEP) – M. Laurent Zameczkowski, Mme Patricia Lazzaro, et M. François Lasne, administrateurs"
    },
    "resumeODJ": {
      "item": [
        "table ronde :",
        "Fédération des conseils de parents d’élèves (FCPE) – Mme Liliana Moyano, présidente ;",
        "Association de parents d'élèves de l'enseignement libre (APEL) – M. Vincent Goutines, membre du bureau national, et M. Christophe Abraham, chargé des relations avec le Parlement ;",
        "Fédération des parents d’élèves de l’enseignement public (PEEP) – M. Laurent Zameczkowski, Mme Patricia Lazzaro, et M. François Lasne, administrateurs."
      ]
    },
    "pointsODJ": null
  },
  "compteRenduRef": null
}