{
  "uid": "RUANR5L15S2018IDF0106598",
  "timeStampDebut": "2018-03-27T16:00:00.000+02:00",
  "timeStampFin": "2018-03-27T17:15:00.000+02:00",
  "lieu": {
    "code": "SALREU048",
    "libelleCourt": "Salle 6809",
    "libelleLong": "Salle 6809, Palais Bourbon"
  },
  "cycleDeVie": {
    "etat": "Confirmé",
    "chrono": {
      "creation": "2018-02-26T12:48:17.000+02:00",
      "cloture": null
    }
  },
  "demandeurs": {
    "acteur": [
      {
        "nom": "Mme Nadia HAI",
        "acteurRef": "PA722054"
      },
      {
        "nom": "M. Romain GRAU",
        "acteurRef": "PA720790"
      }
    ]
  },
  "organeReuniRef": null,
  "typeReunion": "DEP",
  "@xmlns:xsi": "http://www.w3.org/2001/XMLSchema-instance"
}