{
  "uid": "RUANR5L14S2018IDF0102934",
  "timeStampDebut": "2018-01-11T15:00:00.000+01:00",
  "timeStampFin": "2018-01-11T18:00:00.000+01:00",
  "lieu": {
    "code": "SALREU029",
    "libelleCourt": "Salon Mars III",
    "libelleLong": "Salon Mars III, 101, rue de l'Université"
  },
  "cycleDeVie": {
    "etat": "Confirmé",
    "chrono": {
      "creation": "2017-12-20T18:51:13.000+01:00",
      "cloture": null
    }
  },
  "demandeurs": {
    "acteur": {
      "nom": "Mme Sylvie CHARRIÈRE",
      "acteurRef": "PA721218"
    }
  },
  "organeReuniRef": null,
  "typeReunion": "DEP",
  "@xmlns:xsi": "http://www.w3.org/2001/XMLSchema-instance"
}