{
  "uid": "RUANR5L14S2017IDF0093413",
  "timeStampDebut": "2017-07-04T10:30:00.000+02:00",
  "timeStampFin": "2017-07-04T13:00:00.000+02:00",
  "lieu": {
    "code": "SALREU005",
    "libelleCourt": "2ème Bureau",
    "libelleLong": "2ème Bureau, Palais Bourbon"
  },
  "cycleDeVie": {
    "etat": "Confirmé",
    "chrono": {
      "creation": "2017-07-04T09:16:16.000+02:00",
      "cloture": null
    }
  },
  "demandeurs": {
    "organe": {
      "nom": "GROUPE GAUCHE DÉMOCRATE ET RÉPUBLICAINE",
      "organeRef": "PO730940"
    }
  },
  "organeReuniRef": "PO730940",
  "typeReunion": "GP",
  "@xmlns:xsi": "http://www.w3.org/2001/XMLSchema-instance"
}