{
  "uid": "RUANR5L15S2018IDC428257",
  "timeStampDebut": "2018-02-07T12:45:00.000+01:00",
  "lieu": {
    "libelleLong": "salle 4204 (33 rue Saint-Dominique)"
  },
  "cycleDeVie": {
    "etat": "Confirmé",
    "chrono": {
      "creation": "2018-01-12T00:00:00.000+01:00",
      "cloture": null
    }
  },
  "organeReuniRef": "PO743902",
  "@xmlns:xsi": "http://www.w3.org/2001/XMLSchema-instance",
  "demandeur": null,
  "participants": {
    "participantsInternes": null,
    "personnesAuditionnees": null
  },
  "sessionRef": null,
  "ouverturePresse": "false",
  "ODJ": {
    "convocationODJ": {
      "item": "– Audition de M. Christophe Lecourtier, directeur général de Business France, accompagné de M. François Raffray, chef du département relations institutionnelles."
    },
    "resumeODJ": {
      "item": "audition de M. Christophe Lecourtier, directeur général de Business France, accompagné de M. François Raffray, chef du département relations institutionnelles."
    },
    "pointsODJ": null
  },
  "compteRenduRef": null
}