{
  "uid": "RUANR5L15S2018IDC428393",
  "timeStampDebut": "2018-03-14T13:00:00.000+01:00",
  "lieu": {
    "libelleLong": "salle 4204 (33 rue Saint-Dominique)"
  },
  "cycleDeVie": {
    "etat": "Eventuel",
    "chrono": {
      "creation": "2018-01-25T00:00:00.000+01:00",
      "cloture": null
    }
  },
  "organeReuniRef": "PO743902",
  "@xmlns:xsi": "http://www.w3.org/2001/XMLSchema-instance",
  "demandeur": null,
  "participants": {
    "participantsInternes": null,
    "personnesAuditionnees": null
  },
  "sessionRef": null,
  "ouverturePresse": "false",
  "ODJ": {
    "convocationODJ": {
      "item": "– Audition de M. Emmanuel Picot, chargé de la politique d’export à la chambre de commerce et d’industrie du Maine-et-Loire."
    },
    "resumeODJ": {
      "item": "– audition de M. Emmanuel Picot, chargé de la politique d’export à la chambre de commerce et d’industrie du Maine-et-Loire."
    },
    "pointsODJ": null
  },
  "compteRenduRef": null
}