{
  "uid": "RUANR5L15S2018IDC427855",
  "timeStampDebut": "2017-12-20T11:35:00.000+01:00",
  "timeStampFin": "2017-12-20T11:50:00.000+01:00",
  "lieu": {
    "libelleLong": "salle 6238 (Affaires culturelles)"
  },
  "cycleDeVie": {
    "etat": "Confirmé",
    "chrono": {
      "creation": "2017-11-16T00:00:00.000+01:00",
      "cloture": null
    }
  },
  "organeReuniRef": "PO419604",
  "@xmlns:xsi": "http://www.w3.org/2001/XMLSchema-instance",
  "demandeur": null,
  "participants": {
    "participantsInternes": {
      "participantInterne": [
        {
          "acteurRef": "PA719146",
          "presence": "excusé"
        },
        {
          "acteurRef": "PA724827",
          "presence": "excusé"
        },
        {
          "acteurRef": "PA720124",
          "presence": "présent"
        },
        {
          "acteurRef": "PA719318",
          "presence": "présent"
        },
        {
          "acteurRef": "PA722190",
          "presence": "présent"
        },
        {
          "acteurRef": "PA720256",
          "presence": "présent"
        },
        {
          "acteurRef": "PA718884",
          "presence": "excusé"
        },
        {
          "acteurRef": "PA722046",
          "presence": "excusé"
        },
        {
          "acteurRef": "PA719488",
          "presence": "présent"
        },
        {
          "acteurRef": "PA508",
          "presence": "absent"
        },
        {
          "acteurRef": "PA720576",
          "presence": "absent"
        },
        {
          "acteurRef": "PA722030",
          "presence": "présent"
        },
        {
          "acteurRef": "PA223837",
          "presence": "excusé"
        },
        {
          "acteurRef": "PA721328",
          "presence": "absent"
        },
        {
          "acteurRef": "PA689",
          "presence": "excusé"
        },
        {
          "acteurRef": "PA721750",
          "presence": "absent"
        },
        {
          "acteurRef": "PA721352",
          "presence": "absent"
        },
        {
          "acteurRef": "PA721218",
          "presence": "absent"
        },
        {
          "acteurRef": "PA719170",
          "presence": "absent"
        },
        {
          "acteurRef": "PA702054",
          "presence": "excusé"
        },
        {
          "acteurRef": "PA719814",
          "presence": "absent"
        },
        {
          "acteurRef": "PA719118",
          "presence": "présent"
        },
        {
          "acteurRef": "PA720696",
          "presence": "présent"
        },
        {
          "acteurRef": "PA719162",
          "presence": "présent"
        },
        {
          "acteurRef": "PA608826",
          "presence": "absent"
        },
        {
          "acteurRef": "PA721194",
          "presence": "présent"
        },
        {
          "acteurRef": "PA719044",
          "presence": "présent"
        },
        {
          "acteurRef": "PA721896",
          "presence": "présent"
        },
        {
          "acteurRef": "PA720030",
          "presence": "excusé"
        },
        {
          "acteurRef": "PA720198",
          "presence": "présent"
        },
        {
          "acteurRef": "PA720178",
          "presence": "présent"
        },
        {
          "acteurRef": "PA267324",
          "presence": "excusé"
        },
        {
          "acteurRef": "PA605991",
          "presence": "absent"
        },
        {
          "acteurRef": "PA719108",
          "presence": "absent"
        },
        {
          "acteurRef": "PA721784",
          "presence": "absent"
        },
        {
          "acteurRef": "PA722070",
          "presence": "absent"
        },
        {
          "acteurRef": "PA718794",
          "presence": "absent"
        },
        {
          "acteurRef": "PA608416",
          "presence": "présent"
        },
        {
          "acteurRef": "PA332614",
          "presence": "présent"
        },
        {
          "acteurRef": "PA719230",
          "presence": "présent"
        },
        {
          "acteurRef": "PA721506",
          "presence": "présent"
        },
        {
          "acteurRef": "PA643205",
          "presence": "absent"
        },
        {
          "acteurRef": "PA718868",
          "presence": "présent"
        },
        {
          "acteurRef": "PA719728",
          "presence": "présent"
        },
        {
          "acteurRef": "PA345722",
          "presence": "présent"
        },
        {
          "acteurRef": "PA720446",
          "presence": "présent"
        },
        {
          "acteurRef": "PA720988",
          "presence": "excusé"
        },
        {
          "acteurRef": "PA719640",
          "presence": "excusé"
        },
        {
          "acteurRef": "PA719272",
          "presence": "excusé"
        },
        {
          "acteurRef": "PA720630",
          "presence": "présent"
        },
        {
          "acteurRef": "PA719456",
          "presence": "absent"
        },
        {
          "acteurRef": "PA719364",
          "presence": "présent"
        },
        {
          "acteurRef": "PA335532",
          "presence": "absent"
        },
        {
          "acteurRef": "PA719946",
          "presence": "excusé"
        },
        {
          "acteurRef": "PA721234",
          "presence": "excusé"
        },
        {
          "acteurRef": "PA721844",
          "presence": "absent"
        },
        {
          "acteurRef": "PA718944",
          "presence": "présent"
        },
        {
          "acteurRef": "PA721888",
          "presence": "présent"
        },
        {
          "acteurRef": "PA266776",
          "presence": "présent"
        },
        {
          "acteurRef": "PA335758",
          "presence": "excusé"
        },
        {
          "acteurRef": "PA720900",
          "presence": "présent"
        },
        {
          "acteurRef": "PA720066",
          "presence": "absent"
        },
        {
          "acteurRef": "PA722252",
          "presence": "absent"
        },
        {
          "acteurRef": "PA718902",
          "presence": "absent"
        },
        {
          "acteurRef": "PA721226",
          "presence": "absent"
        },
        {
          "acteurRef": "PA720190",
          "presence": "présent"
        },
        {
          "acteurRef": "PA720754",
          "presence": "présent"
        },
        {
          "acteurRef": "PA720854",
          "presence": "présent"
        },
        {
          "acteurRef": "PA720568",
          "presence": "présent"
        },
        {
          "acteurRef": "PA606639",
          "presence": "absent"
        }
      ]
    },
    "personnesAuditionnees": null
  },
  "sessionRef": null,
  "ouverturePresse": "true",
  "ODJ": {
    "convocationODJ": {
      "item": "– Désignation des membres de la mission d’information sur l’école dans la société du numérique\n– Examen, en application de l’article 88 du Règlement, des amendements au projet de loi relatif à l’organisation des Jeux Olympiques et Paralympiques de 2024 (n° 383)"
    },
    "resumeODJ": {
      "item": [
        "désignation des membres de la mission d’information sur l’école dans la société du numérique ;",
        "organisation des Jeux Olympiques et Paralympiques de 2024 (n° 383) (amendements, art 88)."
      ]
    },
    "pointsODJ": {
      "pointODJ": {
        "@xsi:type": "podjReunion_type",
        "uid": "RUANR5L15S2018IDC427855PT25227",
        "cycleDeVie": {
          "etat": "Eventuel",
          "chrono": {
            "creation": "2017-11-16T00:00:00.000+01:00",
            "cloture": null
          }
        },
        "objet": "Examen des amendements (art. 88)",
        "demandeurPoint": null,
        "procedure": null,
        "dossiersLegislatifsRefs": {
          "dossierRef": "DLR5L15N36130"
        },
        "typePointODJ": "Amendements (Art. 88)",
        "comiteSecret": "false",
        "textesAssocies": null
      }
    }
  },
  "compteRenduRef": "CRCANR5L15S2018PO419604N021"
}