{
  "uid": "RUANR5L15S2018IDC427535",
  "timeStampDebut": "2017-10-31T17:00:00.000+01:00",
  "timeStampFin": "2017-11-01T00:00:00.000+01:00",
  "lieu": {
    "libelleLong": "salle Victor Hugo"
  },
  "cycleDeVie": {
    "etat": "Confirmé",
    "chrono": {
      "creation": "2017-10-12T00:00:00.000+02:00",
      "cloture": null
    }
  },
  "organeReuniRef": "PO419865",
  "@xmlns:xsi": "http://www.w3.org/2001/XMLSchema-instance",
  "demandeur": null,
  "participants": {
    "participantsInternes": {
      "participantInterne": [
        {
          "acteurRef": "PA720242",
          "presence": "excusé"
        },
        {
          "acteurRef": "PA720310",
          "presence": "absent"
        },
        {
          "acteurRef": "PA719806",
          "presence": "absent"
        },
        {
          "acteurRef": "PA721046",
          "presence": "absent"
        },
        {
          "acteurRef": "PA720210",
          "presence": "présent"
        },
        {
          "acteurRef": "PA266793",
          "presence": "absent"
        },
        {
          "acteurRef": "PA267233",
          "presence": "présent"
        },
        {
          "acteurRef": "PA718710",
          "presence": "présent"
        },
        {
          "acteurRef": "PA267766",
          "presence": "présent"
        },
        {
          "acteurRef": "PA719890",
          "presence": "présent"
        },
        {
          "acteurRef": "PA718838",
          "presence": "présent"
        },
        {
          "acteurRef": "PA722000",
          "presence": "présent"
        },
        {
          "acteurRef": "PA719922",
          "presence": "présent"
        },
        {
          "acteurRef": "PA721860",
          "presence": "absent"
        },
        {
          "acteurRef": "PA719740",
          "presence": "présent"
        },
        {
          "acteurRef": "PA719286",
          "presence": "absent"
        },
        {
          "acteurRef": "PA719624",
          "presence": "absent"
        },
        {
          "acteurRef": "PA719194",
          "presence": "présent"
        },
        {
          "acteurRef": "PA330909",
          "presence": "excusé"
        },
        {
          "acteurRef": "PA720538",
          "presence": "présent"
        },
        {
          "acteurRef": "PA722236",
          "presence": "présent"
        },
        {
          "acteurRef": "PA718894",
          "presence": "absent"
        },
        {
          "acteurRef": "PA720652",
          "presence": "absent"
        },
        {
          "acteurRef": "PA605694",
          "presence": "excusé"
        },
        {
          "acteurRef": "PA722366",
          "presence": "excusé"
        },
        {
          "acteurRef": "PA333285",
          "presence": "absent"
        },
        {
          "acteurRef": "PA720054",
          "presence": "présent"
        },
        {
          "acteurRef": "PA720038",
          "presence": "absent"
        },
        {
          "acteurRef": "PA721514",
          "presence": "présent"
        },
        {
          "acteurRef": "PA605084",
          "presence": "absent"
        },
        {
          "acteurRef": "PA605518",
          "presence": "absent"
        },
        {
          "acteurRef": "PA720764",
          "presence": "absent"
        },
        {
          "acteurRef": "PA722228",
          "presence": "absent"
        },
        {
          "acteurRef": "PA719412",
          "presence": "présent"
        },
        {
          "acteurRef": "PA588886",
          "presence": "présent"
        },
        {
          "acteurRef": "PA721054",
          "presence": "absent"
        },
        {
          "acteurRef": "PA721530",
          "presence": "présent"
        },
        {
          "acteurRef": "PA719718",
          "presence": "présent"
        },
        {
          "acteurRef": "PA346054",
          "presence": "absent"
        },
        {
          "acteurRef": "PA719080",
          "presence": "présent"
        },
        {
          "acteurRef": "PA2155",
          "presence": "absent"
        },
        {
          "acteurRef": "PA719882",
          "presence": "excusé"
        },
        {
          "acteurRef": "PA721976",
          "presence": "présent"
        },
        {
          "acteurRef": "PA266788",
          "presence": "présent"
        },
        {
          "acteurRef": "PA721876",
          "presence": "présent"
        },
        {
          "acteurRef": "PA721254",
          "presence": "présent"
        },
        {
          "acteurRef": "PA720278",
          "presence": "présent"
        },
        {
          "acteurRef": "PA720334",
          "presence": "présent"
        },
        {
          "acteurRef": "PA720606",
          "presence": "présent"
        },
        {
          "acteurRef": "PA333421",
          "presence": "présent"
        },
        {
          "acteurRef": "PA719632",
          "presence": "excusé"
        },
        {
          "acteurRef": "PA720892",
          "presence": "présent"
        },
        {
          "acteurRef": "PA720944",
          "presence": "présent"
        },
        {
          "acteurRef": "PA718802",
          "presence": "présent"
        },
        {
          "acteurRef": "PA720414",
          "presence": "présent"
        },
        {
          "acteurRef": "PA721372",
          "presence": "présent"
        },
        {
          "acteurRef": "PA693008",
          "presence": "présent"
        },
        {
          "acteurRef": "PA609520",
          "presence": "présent"
        },
        {
          "acteurRef": "PA719578",
          "presence": "présent"
        },
        {
          "acteurRef": "PA266776",
          "presence": "présent"
        },
        {
          "acteurRef": "PA721426",
          "presence": "présent"
        },
        {
          "acteurRef": "PA610733",
          "presence": "absent"
        },
        {
          "acteurRef": "PA721600",
          "presence": "présent"
        },
        {
          "acteurRef": "PA267527",
          "presence": "excusé"
        },
        {
          "acteurRef": "PA702052",
          "presence": "présent"
        },
        {
          "acteurRef": "PA719972",
          "presence": "présent"
        },
        {
          "acteurRef": "PA340343",
          "presence": "présent"
        },
        {
          "acteurRef": "PA267204",
          "presence": "présent"
        },
        {
          "acteurRef": "PA610667",
          "presence": "absent"
        },
        {
          "acteurRef": "PA722336",
          "presence": "présent"
        },
        {
          "acteurRef": "PA719092",
          "presence": "absent"
        },
        {
          "acteurRef": "PA718728",
          "presence": "présent"
        },
        {
          "acteurRef": "PA720586",
          "presence": "absent"
        },
        {
          "acteurRef": "PA721968",
          "presence": "présent"
        },
        {
          "acteurRef": "PA722110",
          "presence": "présent"
        },
        {
          "acteurRef": "PA718962",
          "presence": "présent"
        }
      ]
    },
    "personnesAuditionnees": null
  },
  "sessionRef": null,
  "ouverturePresse": "false",
  "ODJ": {
    "convocationODJ": {
      "item": "Projet de loi de finances pour 2018 (n° 235) : mission « Écologie, développement et mobilité durables » :\n. Transports terrestres et fluviaux (M. Damien Pichereau, rapporteur pour avis),\n. Transports aériens (Mme Zivka Park, rapporteure pour avis),\n. Affaires maritimes (M. Jimmy Pahun, rapporteur pour avis),\n. Protection de l’environnement et prévention des risques (M. Fabrice Brun, rapporteur pour avis),\n. Paysages, eau et biodiversité (M. Yannick Haury, rapporteur pour avis),\n. Transition écologique (Mme Jennifer de Temmerman, rapporteure pour avis),\n. Politiques de développement durable (M. Christophe Bouillon, rapporteur pour avis)."
    },
    "resumeODJ": {
      "item": [
        "projet de loi de finances pour 2018 (n° 235) : mission « Écologie, développement et mobilité durables » :",
        "Transports terrestres et fluviaux (M. Damien Pichereau, rapporteur pour avis) ;",
        "Transports aériens (Mme Zivka Park, rapporteure pour avis) ;",
        "Affaires maritimes (M. Jimmy Pahun, rapporteur pour avis) ;",
        "Protection de l’environnement et prévention des risques (M. Fabrice Brun, rapporteur pour avis) ;",
        "Paysages, eau et biodiversité (M. Yannick Haury, rapporteur pour avis) ;",
        "Transition écologique (Mme Jennifer de Temmerman, rapporteure pour avis) ;",
        "Politiques de développement durable (M. Christophe Bouillon, rapporteur pour avis)."
      ]
    },
    "pointsODJ": {
      "pointODJ": {
        "@xsi:type": "podjReunion_type",
        "uid": "RUANR5L15S2018IDC427535PT25105",
        "cycleDeVie": {
          "etat": "Eventuel",
          "chrono": {
            "creation": "2017-10-12T00:00:00.000+02:00",
            "cloture": null
          }
        },
        "objet": "Examen de la mission « Écologie, développement et mobilité durables »",
        "demandeurPoint": null,
        "procedure": null,
        "dossiersLegislatifsRefs": {
          "dossierRef": "DLR5L15N35854"
        },
        "typePointODJ": "Examen",
        "comiteSecret": "false",
        "textesAssocies": null
      }
    }
  },
  "compteRenduRef": null
}