{
  "uid": "RUANR5L15S2018IDF0100714",
  "timeStampDebut": "2018-02-07T14:00:00.000+01:00",
  "timeStampFin": "2018-02-07T15:00:00.000+01:00",
  "lieu": {
    "code": "SALREU029",
    "libelleCourt": "Salon Mars III",
    "libelleLong": "Salon Mars III, 101, rue de l'Université"
  },
  "cycleDeVie": {
    "etat": "Annulé",
    "chrono": {
      "creation": "2017-11-15T18:32:44.000+01:00",
      "cloture": "2018-02-07T14:33:27.000+01:00"
    }
  },
  "demandeurs": {
    "organe": {
      "nom": "GROUPE LA RÉPUBLIQUE EN MARCHE",
      "organeRef": "PO730964"
    }
  },
  "organeReuniRef": "PO730964",
  "typeReunion": "GP"
}