{
  "uid": "RUANR5L15S2018IDF0102864",
  "timeStampDebut": "2018-06-12T11:15:00.000+02:00",
  "timeStampFin": "2018-06-12T12:30:00.000+02:00",
  "lieu": {
    "code": "SALREU027",
    "libelleCourt": "Salle 6217",
    "libelleLong": "Salle 6217, Palais Bourbon"
  },
  "cycleDeVie": {
    "etat": "Confirmé",
    "chrono": {
      "creation": "2017-12-20T16:17:53.000+02:00",
      "cloture": null
    }
  },
  "demandeurs": {
    "organe": {
      "nom": "GROUPE LES RÉPUBLICAINS",
      "organeRef": "PO730934"
    }
  },
  "organeReuniRef": "PO730934",
  "typeReunion": "GP",
  "@xmlns:xsi": "http://www.w3.org/2001/XMLSchema-instance"
}