{
  "uid": "RUANR5L15S2018IDF0105193",
  "timeStampDebut": "2018-02-20T12:00:00.000+01:00",
  "timeStampFin": "2018-02-20T13:00:00.000+01:00",
  "lieu": {
    "code": "SALREU008",
    "libelleCourt": "5ème Bureau",
    "libelleLong": "5ème Bureau, Palais Bourbon"
  },
  "cycleDeVie": {
    "etat": "Confirmé",
    "chrono": {
      "creation": "2018-02-06T12:52:15.000+01:00",
      "cloture": "2018-02-12T13:18:52.000+01:00"
    }
  },
  "demandeurs": {
    "acteur": {
      "nom": "Mme Michèle TABAROT",
      "acteurRef": "PA267794"
    }
  },
  "organeReuniRef": null,
  "typeReunion": "DEP",
  "@xmlns:xsi": "http://www.w3.org/2001/XMLSchema-instance"
}