{
  "uid": "RUANR5L15S2018IDC428308",
  "timeStampDebut": "2018-01-31T10:00:00.000+01:00",
  "timeStampFin": "2018-01-31T11:45:00.000+01:00",
  "lieu": {
    "libelleLong": "salle 6351 (Affaires sociales)"
  },
  "cycleDeVie": {
    "etat": "Confirmé",
    "chrono": {
      "creation": "2018-01-19T00:00:00.000+01:00",
      "cloture": null
    }
  },
  "organeReuniRef": "PO420120",
  "@xmlns:xsi": "http://www.w3.org/2001/XMLSchema-instance",
  "demandeur": null,
  "participants": {
    "participantsInternes": {
      "participantInterne": [
        {
          "acteurRef": "PA718744",
          "presence": "présent"
        },
        {
          "acteurRef": "PA610681",
          "presence": "présent"
        },
        {
          "acteurRef": "PA642847",
          "presence": "présent"
        },
        {
          "acteurRef": "PA720362",
          "presence": "présent"
        },
        {
          "acteurRef": "PA441",
          "presence": "absent"
        },
        {
          "acteurRef": "PA720968",
          "presence": "excusé"
        },
        {
          "acteurRef": "PA508",
          "presence": "présent"
        },
        {
          "acteurRef": "PA720822",
          "presence": "présent"
        },
        {
          "acteurRef": "PA719980",
          "presence": "présent"
        },
        {
          "acteurRef": "PA608083",
          "presence": "présent"
        },
        {
          "acteurRef": "PA721336",
          "presence": "présent"
        },
        {
          "acteurRef": "PA720468",
          "presence": "présent"
        },
        {
          "acteurRef": "PA856",
          "presence": "présent"
        },
        {
          "acteurRef": "PA722126",
          "presence": "absent"
        },
        {
          "acteurRef": "PA719756",
          "presence": "présent"
        },
        {
          "acteurRef": "PA722390",
          "presence": "présent"
        },
        {
          "acteurRef": "PA720932",
          "presence": "présent"
        },
        {
          "acteurRef": "PA718694",
          "presence": "présent"
        },
        {
          "acteurRef": "PA718926",
          "presence": "présent"
        },
        {
          "acteurRef": "PA608292",
          "presence": "présent"
        },
        {
          "acteurRef": "PA720046",
          "presence": "absent"
        },
        {
          "acteurRef": "PA720924",
          "presence": "excusé"
        },
        {
          "acteurRef": "PA719570",
          "presence": "présent"
        },
        {
          "acteurRef": "PA720286",
          "presence": "présent"
        },
        {
          "acteurRef": "PA267780",
          "presence": "présent"
        },
        {
          "acteurRef": "PA718706",
          "presence": "présent"
        },
        {
          "acteurRef": "PA721246",
          "presence": "présent"
        },
        {
          "acteurRef": "PA721992",
          "presence": "présent"
        },
        {
          "acteurRef": "PA720170",
          "presence": "présent"
        },
        {
          "acteurRef": "PA722062",
          "presence": "présent"
        },
        {
          "acteurRef": "PA267318",
          "presence": "présent"
        },
        {
          "acteurRef": "PA721126",
          "presence": "présent"
        },
        {
          "acteurRef": "PA720326",
          "presence": "présent"
        },
        {
          "acteurRef": "PA331835",
          "presence": "absent"
        },
        {
          "acteurRef": "PA722374",
          "presence": "présent"
        },
        {
          "acteurRef": "PA720074",
          "presence": "présent"
        },
        {
          "acteurRef": "PA719186",
          "presence": "présent"
        },
        {
          "acteurRef": "PA719842",
          "presence": "présent"
        },
        {
          "acteurRef": "PA720916",
          "presence": "absent"
        },
        {
          "acteurRef": "PA720480",
          "presence": "présent"
        },
        {
          "acteurRef": "PA267378",
          "presence": "présent"
        },
        {
          "acteurRef": "PA606712",
          "presence": "présent"
        },
        {
          "acteurRef": "PA717379",
          "presence": "présent"
        },
        {
          "acteurRef": "PA719072",
          "presence": "présent"
        },
        {
          "acteurRef": "PA720738",
          "presence": "présent"
        },
        {
          "acteurRef": "PA2377",
          "presence": "présent"
        },
        {
          "acteurRef": "PA720500",
          "presence": "présent"
        },
        {
          "acteurRef": "PA721710",
          "presence": "présent"
        },
        {
          "acteurRef": "PA720512",
          "presence": "présent"
        },
        {
          "acteurRef": "PA718910",
          "presence": "présent"
        },
        {
          "acteurRef": "PA720422",
          "presence": "présent"
        },
        {
          "acteurRef": "PA721286",
          "presence": "présent"
        },
        {
          "acteurRef": "PA721070",
          "presence": "excusé"
        },
        {
          "acteurRef": "PA721062",
          "presence": "présent"
        },
        {
          "acteurRef": "PA718810",
          "presence": "présent"
        },
        {
          "acteurRef": "PA722022",
          "presence": "présent"
        },
        {
          "acteurRef": "PA722142",
          "presence": "absent"
        },
        {
          "acteurRef": "PA721110",
          "presence": "excusé"
        },
        {
          "acteurRef": "PA720952",
          "presence": "excusé"
        },
        {
          "acteurRef": "PA719350",
          "presence": "présent"
        },
        {
          "acteurRef": "PA722086",
          "presence": "absent"
        },
        {
          "acteurRef": "PA334768",
          "presence": "présent"
        },
        {
          "acteurRef": "PA719540",
          "presence": "présent"
        },
        {
          "acteurRef": "PA643145",
          "presence": "présent"
        },
        {
          "acteurRef": "PA643134",
          "presence": "présent"
        },
        {
          "acteurRef": "PA719930",
          "presence": "présent"
        },
        {
          "acteurRef": "PA721924",
          "presence": "présent"
        },
        {
          "acteurRef": "PA642788",
          "presence": "absent"
        },
        {
          "acteurRef": "PA267585",
          "presence": "absent"
        },
        {
          "acteurRef": "PA722102",
          "presence": "présent"
        },
        {
          "acteurRef": "PA719512",
          "presence": "excusé"
        },
        {
          "acteurRef": "PA721474",
          "presence": "présent"
        },
        {
          "acteurRef": "PA722268",
          "presence": "présent"
        }
      ]
    },
    "personnesAuditionnees": null
  },
  "sessionRef": null,
  "ouverturePresse": "true",
  "ODJ": {
    "convocationODJ": {
      "item": "- Désignation de rapporteurs sur :\n• la proposition de loi de Mme Marie-Georges Buffet, Huguette Bello et plusieurs de leurs collègues visant à lutter contre la précarité professionnelle des femmes (n° 586)\n• la proposition de loi de M. Pierre Dharréville et plusieurs de ses collègues pour une reconnaissance sociale des aidants (n° 589)\n- Communication de M. Belkhir Belhaddad, rapporteur, sur les conclusions de la mission flash relative à la prescription d'activités physiques à des fins thérapeutiques, dite \" sport sur ordonnance \""
    },
    "resumeODJ": {
      "item": [
        "désignation de rapporteurs ;",
        "communication sur les conclusions de la mission flash relative à la prescription d'activités physiques à des fins thérapeutiques, dite \" sport sur ordonnance \"."
      ]
    },
    "pointsODJ": null
  },
  "compteRenduRef": "CRCANR5L15S2018PO420120N042"
}