{
  "uid": "RUANR5L15S2018IDC428091",
  "timeStampDebut": "2017-12-12T09:15:00.000+01:00",
  "lieu": {
    "libelleLong": "salle 4204 - 33 rue Saint-Dominique, 2ème étage"
  },
  "cycleDeVie": {
    "etat": "Confirmé",
    "chrono": {
      "creation": "2017-12-08T00:00:00.000+01:00",
      "cloture": null
    }
  },
  "organeReuniRef": "PO744338",
  "@xmlns:xsi": "http://www.w3.org/2001/XMLSchema-instance",
  "demandeur": null,
  "participants": {
    "participantsInternes": null,
    "personnesAuditionnees": null
  },
  "sessionRef": null,
  "ouverturePresse": "false",
  "ODJ": {
    "convocationODJ": {
      "item": "Audition de M. Bruno Tertrais, directeur adjoint de la Fondation pour la recherche stratégique."
    },
    "resumeODJ": {
      "item": "Audition de M. Bruno Tertrais, directeur adjoint de la Fondation pour la recherche stratégique."
    },
    "pointsODJ": null
  },
  "compteRenduRef": null
}