{
  "uid": "RUANR5L14S2018IDF0098512",
  "timeStampDebut": "2017-10-25T11:00:00.000+02:00",
  "timeStampFin": "2017-10-25T12:00:00.000+02:00",
  "lieu": {
    "code": "SALREU039",
    "libelleCourt": "Salle 6550",
    "libelleLong": "Salle 6550, Palais Bourbon"
  },
  "cycleDeVie": {
    "etat": "Confirmé",
    "chrono": {
      "creation": "2017-10-12T15:14:56.000+02:00",
      "cloture": null
    }
  },
  "demandeurs": {
    "acteur": {
      "nom": "M. Nicolas FORISSIER",
      "acteurRef": "PA1327"
    }
  },
  "organeReuniRef": null,
  "typeReunion": "DEP",
  "@xmlns:xsi": "http://www.w3.org/2001/XMLSchema-instance"
}