{
  "uid": "RUANR5L15S2018IDF0105240",
  "timeStampDebut": "2018-03-08T08:30:00.000+01:00",
  "timeStampFin": "2018-03-08T10:30:00.000+01:00",
  "lieu": {
    "code": "SALREU029",
    "libelleCourt": "Salon Mars III",
    "libelleLong": "Salon Mars III, 101, rue de l'Université"
  },
  "cycleDeVie": {
    "etat": "Confirmé",
    "chrono": {
      "creation": "2018-02-06T16:54:18.000+01:00",
      "cloture": null
    }
  },
  "demandeurs": {
    "acteur": {
      "nom": "M. Dominique DA SILVA",
      "acteurRef": "PA720932"
    }
  },
  "organeReuniRef": null,
  "typeReunion": "DEP",
  "@xmlns:xsi": "http://www.w3.org/2001/XMLSchema-instance"
}