{
  "uid": "RUANR5L14S2018IDF0099345",
  "timeStampDebut": "2017-10-31T14:30:00.000+01:00",
  "timeStampFin": "2017-10-31T15:30:00.000+01:00",
  "lieu": {
    "code": "SALREU032",
    "libelleCourt": "Sully 4",
    "libelleLong": "Sully 4, Palais Bourbon"
  },
  "cycleDeVie": {
    "etat": "Annulé",
    "chrono": {
      "creation": "2017-10-26T15:23:02.000+01:00",
      "cloture": "2017-10-26T19:21:39.000+01:00"
    }
  },
  "demandeurs": {
    "acteur": {
      "nom": "Mme Valérie LACROUTE",
      "acteurRef": "PA609245"
    }
  },
  "organeReuniRef": null,
  "typeReunion": "DEP",
  "@xmlns:xsi": "http://www.w3.org/2001/XMLSchema-instance"
}