{
  "uid": "RUANR5L15S2018IDF0105367",
  "timeStampDebut": "2018-02-21T17:00:00.000+01:00",
  "timeStampFin": "2018-02-21T18:30:00.000+01:00",
  "lieu": {
    "code": "SALREU018",
    "libelleCourt": "Salon Mansart",
    "libelleLong": "Salon Mansart, 101, rue de l'Université"
  },
  "cycleDeVie": {
    "etat": "Confirmé",
    "chrono": {
      "creation": "2018-02-08T10:02:37.000+01:00",
      "cloture": null
    }
  },
  "demandeurs": {
    "organe": {
      "nom": "Groupe d'amitié France-Tunisie",
      "organeRef": "PO733452"
    }
  },
  "organeReuniRef": "PO733452",
  "typeReunion": "GA",
  "@xmlns:xsi": "http://www.w3.org/2001/XMLSchema-instance"
}