{
  "uid": "RUANR5L14S2018IDF0097458",
  "timeStampDebut": "2017-10-05T09:00:00.000+02:00",
  "timeStampFin": "2017-10-05T12:00:00.000+02:00",
  "lieu": {
    "code": "SALREU032",
    "libelleCourt": "Sully 4",
    "libelleLong": "Sully 4, Palais Bourbon"
  },
  "cycleDeVie": {
    "etat": "Confirmé",
    "chrono": {
      "creation": "2017-09-28T10:38:57.000+02:00",
      "cloture": null
    }
  },
  "demandeurs": {
    "acteur": {
      "nom": "M. Hervé PELLOIS",
      "acteurRef": "PA607595"
    }
  },
  "organeReuniRef": null,
  "typeReunion": "DEP",
  "@xmlns:xsi": "http://www.w3.org/2001/XMLSchema-instance"
}