{
  "uid": "RUANR5L14S2018IDF0101251",
  "timeStampDebut": "2017-11-29T11:00:00.000+01:00",
  "timeStampFin": "2017-11-29T12:30:00.000+01:00",
  "lieu": {
    "code": "SALREU049",
    "libelleCourt": "Salle 6822",
    "libelleLong": "Salle 6822, Palais Bourbon"
  },
  "cycleDeVie": {
    "etat": "Confirmé",
    "chrono": {
      "creation": "2017-11-23T13:35:41.000+01:00",
      "cloture": null
    }
  },
  "demandeurs": {
    "acteur": {
      "nom": "M. Aurélien TACHÉ",
      "acteurRef": "PA720952"
    }
  },
  "organeReuniRef": null,
  "typeReunion": "DEP",
  "@xmlns:xsi": "http://www.w3.org/2001/XMLSchema-instance"
}