{
  "uid": "RUANR5L14S2017IDF0093362",
  "timeStampDebut": "2017-07-04T17:30:00.000+02:00",
  "timeStampFin": "2017-07-04T20:00:00.000+02:00",
  "lieu": {
    "code": "SALREU014",
    "libelleCourt": "Salle 7042",
    "libelleLong": "Salle 7042, 103, rue de l'Université"
  },
  "cycleDeVie": {
    "etat": "Confirmé",
    "chrono": {
      "creation": "2017-06-30T12:00:30.000+02:00",
      "cloture": null
    }
  },
  "demandeurs": {
    "acteur": {
      "nom": "Mme Huguette BELLO",
      "acteurRef": "PA441"
    }
  },
  "organeReuniRef": null,
  "typeReunion": "DEP",
  "@xmlns:xsi": "http://www.w3.org/2001/XMLSchema-instance"
}