{
  "uid": "RUANR5L15S2018IDF0104863",
  "timeStampDebut": "2018-04-10T16:00:00.000+02:00",
  "timeStampFin": "2018-04-10T17:00:00.000+02:00",
  "lieu": {
    "code": "SALREU016",
    "libelleCourt": "Salon Gabriel",
    "libelleLong": "Salon Gabriel, 101, rue de l'Université"
  },
  "cycleDeVie": {
    "etat": "Annulé",
    "chrono": {
      "creation": "2018-01-31T19:40:13.000+02:00",
      "cloture": "2018-02-21T18:33:42.000+02:00"
    }
  },
  "demandeurs": {
    "organe": {
      "nom": "GROUPE LA RÉPUBLIQUE EN MARCHE",
      "organeRef": "PO730964"
    }
  },
  "organeReuniRef": "PO730964",
  "typeReunion": "GP"
}