{
  "uid": "RUANR5L15S2018IDC427236",
  "timeStampDebut": "2017-10-18T09:30:00.000+02:00",
  "lieu": {
    "libelleLong": "lieu à préciser ultérieurement"
  },
  "cycleDeVie": {
    "etat": "Supprimé",
    "chrono": {
      "creation": "2017-09-07T00:00:00.000+02:00",
      "cloture": "2017-10-05T00:00:00.000+02:00"
    }
  },
  "organeReuniRef": "PO59047",
  "@xmlns:xsi": "http://www.w3.org/2001/XMLSchema-instance",
  "demandeur": null,
  "participants": {
    "participantsInternes": null,
    "personnesAuditionnees": null
  },
  "sessionRef": null,
  "ouverturePresse": "false",
  "ODJ": {
    "convocationODJ": {
      "item": "– Présentation de l’avis sur le prélèvement européen et vote sur l’article du PLF 2018 relatif au prélèvement sur recettes au profit de l’Union européenne."
    },
    "resumeODJ": {
      "item": "– Présentation de l’avis sur le prélèvement européen et vote sur l’article du PLF 2018 relatif au prélèvement sur recettes au profit de l’Union européenne."
    },
    "pointsODJ": null
  },
  "compteRenduRef": null
}