{
  "uid": "RUANR5L15S2018IDF0104222",
  "timeStampDebut": "2018-01-29T15:00:00.000+01:00",
  "timeStampFin": "2018-01-29T16:00:00.000+01:00",
  "lieu": {
    "code": "SALREU018",
    "libelleCourt": "Salon Mansart",
    "libelleLong": "Salon Mansart, 101, rue de l'Université"
  },
  "cycleDeVie": {
    "etat": "Confirmé",
    "chrono": {
      "creation": "2018-01-23T14:55:35.000+01:00",
      "cloture": null
    }
  },
  "demandeurs": {
    "acteur": {
      "nom": "Mme Samantha CAZEBONNE",
      "acteurRef": "PA721166"
    }
  },
  "organeReuniRef": null,
  "typeReunion": "DEP",
  "@xmlns:xsi": "http://www.w3.org/2001/XMLSchema-instance"
}