{
  "uid": "RUANR5L15S2018IDF0105891",
  "timeStampDebut": "2018-03-13T17:30:00.000+01:00",
  "timeStampFin": "2018-03-13T20:30:00.000+01:00",
  "lieu": {
    "code": "SALREU012",
    "libelleCourt": "Salle N° 23",
    "libelleLong": "Salle N° 23, 3, rue Aristide Briand"
  },
  "cycleDeVie": {
    "etat": "Confirmé",
    "chrono": {
      "creation": "2018-02-15T14:33:36.000+01:00",
      "cloture": null
    }
  },
  "demandeurs": {
    "organe": {
      "nom": "Groupe d'études CONDITIONS D'ACCUEIL DES MIGRANTS",
      "organeRef": "PO746748"
    }
  },
  "organeReuniRef": "PO746748",
  "typeReunion": "GE",
  "@xmlns:xsi": "http://www.w3.org/2001/XMLSchema-instance"
}