{
  "uid": "RUANR5L15S2018IDC427885",
  "timeStampDebut": "2017-11-29T13:30:00.000+01:00",
  "timeStampFin": "2017-11-29T16:05:00.000+01:00",
  "lieu": {
    "libelleLong": "6e Bureau"
  },
  "cycleDeVie": {
    "etat": "Confirmé",
    "chrono": {
      "creation": "2017-11-17T00:00:00.000+01:00",
      "cloture": null
    }
  },
  "organeReuniRef": "PO740454",
  "@xmlns:xsi": "http://www.w3.org/2001/XMLSchema-instance",
  "demandeur": null,
  "participants": {
    "participantsInternes": {
      "participantInterne": [
        {
          "acteurRef": "PA719318",
          "presence": "absent"
        },
        {
          "acteurRef": "PA335999",
          "presence": "présent"
        },
        {
          "acteurRef": "PA719488",
          "presence": "présent"
        },
        {
          "acteurRef": "PA720162",
          "presence": "présent"
        },
        {
          "acteurRef": "PA719740",
          "presence": "absent"
        },
        {
          "acteurRef": "PA719258",
          "presence": "présent"
        },
        {
          "acteurRef": "PA267355",
          "presence": "présent"
        },
        {
          "acteurRef": "PA719230",
          "presence": "absent"
        },
        {
          "acteurRef": "PA340853",
          "presence": "absent"
        },
        {
          "acteurRef": "PA719412",
          "presence": "présent"
        },
        {
          "acteurRef": "PA719154",
          "presence": "présent"
        },
        {
          "acteurRef": "PA2155",
          "presence": "absent"
        },
        {
          "acteurRef": "PA719456",
          "presence": "présent"
        },
        {
          "acteurRef": "PA719242",
          "presence": "absent"
        },
        {
          "acteurRef": "PA720278",
          "presence": "absent"
        },
        {
          "acteurRef": "PA720892",
          "presence": "absent"
        },
        {
          "acteurRef": "PA2377",
          "presence": "absent"
        },
        {
          "acteurRef": "PA718930",
          "presence": "absent"
        },
        {
          "acteurRef": "PA719350",
          "presence": "présent"
        },
        {
          "acteurRef": "PA719540",
          "presence": "présent"
        },
        {
          "acteurRef": "PA722268",
          "presence": "absent"
        },
        {
          "acteurRef": "PA722110",
          "presence": "absent"
        }
      ]
    },
    "personnesAuditionnees": null
  },
  "sessionRef": null,
  "ouverturePresse": "true",
  "ODJ": {
    "convocationODJ": {
      "item": "audition de Mme Anne-Claire Amprou, directrice générale adjointe de la santé, de Mme Magali Naviner, cheffe du bureau alimentation et nutrition, de Mme Barbara Lefèvre, chargée des dossiers chlordécone, polychlorobiphényls et phytosanitaires, de Mme Caroline Paul, cheffe du bureau environnement extérieur et produits chimiques et de M. Alban Robin, chef du bureau qualité des eaux à la direction générale de la santé du ministère des solidarités et de la santé"
    },
    "resumeODJ": {
      "item": "audition de Mme Anne-Claire Amprou, directrice générale adjointe de la santé, de Mme Magali Naviner, cheffe du bureau alimentation et nutrition, de Mme Barbara Lefèvre, chargée des dossiers chlordécone, polychlorobiphényls et phytosanitaires, de Mme Caroline Paul, cheffe du bureau environnement extérieur et produits chimiques et de M. Alban Robin, chef du bureau qualité des eaux à la direction générale de la santé du ministère des solidarités et de la santé."
    },
    "pointsODJ": {
      "pointODJ": {
        "@xsi:type": "podjReunion_type",
        "uid": "RUANR5L15S2018IDC427885PT25251",
        "cycleDeVie": {
          "etat": "Confirmé",
          "chrono": {
            "creation": "2017-11-21T00:00:00.000+01:00",
            "cloture": null
          }
        },
        "objet": "– Audition de Mme Anne-Claire Amprou, directrice générale adjointe de la santé, Mme Magali Naviner, cheffe du bureau alimentation et nutrition, Mme Barbara Lefevre, chargée des dossiers chlordécone, PCB, phytosanitaires, Mme Caroline Paul, cheffe du bureau environnement extérieur et produits chimiques, et M. Alban Robin, chef du bureau qualité des eaux de la direction générale de la santé",
        "demandeurPoint": null,
        "procedure": null,
        "dossiersLegislatifsRefs": {
          "dossierRef": "DLR5L15N36059"
        },
        "typePointODJ": "Audition",
        "comiteSecret": "false",
        "textesAssocies": null
      }
    }
  },
  "compteRenduRef": null
}