{
  "uid": "RUANR5L14S2017IDF0097255",
  "timeStampDebut": "2017-09-28T12:00:00.000+02:00",
  "timeStampFin": "2017-09-28T13:00:00.000+02:00",
  "lieu": {
    "code": "SALREU008",
    "libelleCourt": "5ème Bureau",
    "libelleLong": "5ème Bureau, Palais Bourbon"
  },
  "cycleDeVie": {
    "etat": "Confirmé",
    "chrono": {
      "creation": "2017-09-27T18:17:50.000+02:00",
      "cloture": null
    }
  },
  "demandeurs": {
    "organe": {
      "nom": "GROUPE LES CONSTRUCTIFS : RÉPUBLICAINS, UDI, INDÉPENDANTS",
      "organeRef": "PO730952"
    }
  },
  "organeReuniRef": "PO730952",
  "typeReunion": "GP",
  "@xmlns:xsi": "http://www.w3.org/2001/XMLSchema-instance"
}