{
  "uid": "RUANR5L15S2018IDC428358",
  "timeStampDebut": "2018-02-14T16:30:00.000+01:00",
  "timeStampFin": "2018-02-14T18:25:00.000+01:00",
  "lieu": {
    "libelleLong": "salle 6237 (Développement durable)"
  },
  "cycleDeVie": {
    "etat": "Confirmé",
    "chrono": {
      "creation": "2018-01-25T00:00:00.000+01:00",
      "cloture": null
    }
  },
  "organeReuniRef": "PO419865",
  "@xmlns:xsi": "http://www.w3.org/2001/XMLSchema-instance",
  "demandeur": null,
  "participants": {
    "participantsInternes": {
      "participantInterne": [
        {
          "acteurRef": "PA720242",
          "presence": "présent"
        },
        {
          "acteurRef": "PA720310",
          "presence": "présent"
        },
        {
          "acteurRef": "PA719806",
          "presence": "excusé"
        },
        {
          "acteurRef": "PA721046",
          "presence": "excusé"
        },
        {
          "acteurRef": "PA720210",
          "presence": "absent"
        },
        {
          "acteurRef": "PA266793",
          "presence": "absent"
        },
        {
          "acteurRef": "PA267233",
          "presence": "présent"
        },
        {
          "acteurRef": "PA718710",
          "presence": "présent"
        },
        {
          "acteurRef": "PA267766",
          "presence": "absent"
        },
        {
          "acteurRef": "PA719890",
          "presence": "présent"
        },
        {
          "acteurRef": "PA718838",
          "presence": "absent"
        },
        {
          "acteurRef": "PA722000",
          "presence": "présent"
        },
        {
          "acteurRef": "PA719922",
          "presence": "présent"
        },
        {
          "acteurRef": "PA721860",
          "presence": "présent"
        },
        {
          "acteurRef": "PA719740",
          "presence": "absent"
        },
        {
          "acteurRef": "PA719286",
          "presence": "présent"
        },
        {
          "acteurRef": "PA719624",
          "presence": "absent"
        },
        {
          "acteurRef": "PA719194",
          "presence": "absent"
        },
        {
          "acteurRef": "PA330909",
          "presence": "absent"
        },
        {
          "acteurRef": "PA720538",
          "presence": "excusé"
        },
        {
          "acteurRef": "PA722236",
          "presence": "présent"
        },
        {
          "acteurRef": "PA718894",
          "presence": "présent"
        },
        {
          "acteurRef": "PA720652",
          "presence": "absent"
        },
        {
          "acteurRef": "PA605694",
          "presence": "absent"
        },
        {
          "acteurRef": "PA722366",
          "presence": "absent"
        },
        {
          "acteurRef": "PA333285",
          "presence": "absent"
        },
        {
          "acteurRef": "PA720054",
          "presence": "présent"
        },
        {
          "acteurRef": "PA720038",
          "presence": "présent"
        },
        {
          "acteurRef": "PA721514",
          "presence": "présent"
        },
        {
          "acteurRef": "PA605084",
          "presence": "absent"
        },
        {
          "acteurRef": "PA605518",
          "presence": "présent"
        },
        {
          "acteurRef": "PA720764",
          "presence": "absent"
        },
        {
          "acteurRef": "PA722228",
          "presence": "présent"
        },
        {
          "acteurRef": "PA719412",
          "presence": "présent"
        },
        {
          "acteurRef": "PA588886",
          "presence": "absent"
        },
        {
          "acteurRef": "PA721054",
          "presence": "présent"
        },
        {
          "acteurRef": "PA721530",
          "presence": "absent"
        },
        {
          "acteurRef": "PA719718",
          "presence": "présent"
        },
        {
          "acteurRef": "PA346054",
          "presence": "absent"
        },
        {
          "acteurRef": "PA719080",
          "presence": "présent"
        },
        {
          "acteurRef": "PA2155",
          "presence": "présent"
        },
        {
          "acteurRef": "PA719882",
          "presence": "excusé"
        },
        {
          "acteurRef": "PA720738",
          "presence": "présent"
        },
        {
          "acteurRef": "PA721976",
          "presence": "présent"
        },
        {
          "acteurRef": "PA721876",
          "presence": "présent"
        },
        {
          "acteurRef": "PA720278",
          "presence": "absent"
        },
        {
          "acteurRef": "PA720334",
          "presence": "présent"
        },
        {
          "acteurRef": "PA720606",
          "presence": "absent"
        },
        {
          "acteurRef": "PA333421",
          "presence": "absent"
        },
        {
          "acteurRef": "PA719632",
          "presence": "absent"
        },
        {
          "acteurRef": "PA720892",
          "presence": "excusé"
        },
        {
          "acteurRef": "PA720944",
          "presence": "absent"
        },
        {
          "acteurRef": "PA718802",
          "presence": "absent"
        },
        {
          "acteurRef": "PA720414",
          "presence": "absent"
        },
        {
          "acteurRef": "PA721372",
          "presence": "présent"
        },
        {
          "acteurRef": "PA609520",
          "presence": "présent"
        },
        {
          "acteurRef": "PA719578",
          "presence": "présent"
        },
        {
          "acteurRef": "PA721426",
          "presence": "présent"
        },
        {
          "acteurRef": "PA610733",
          "presence": "excusé"
        },
        {
          "acteurRef": "PA721600",
          "presence": "présent"
        },
        {
          "acteurRef": "PA267527",
          "presence": "présent"
        },
        {
          "acteurRef": "PA719972",
          "presence": "absent"
        },
        {
          "acteurRef": "PA267204",
          "presence": "présent"
        },
        {
          "acteurRef": "PA610667",
          "presence": "excusé"
        },
        {
          "acteurRef": "PA722336",
          "presence": "absent"
        },
        {
          "acteurRef": "PA719092",
          "presence": "présent"
        },
        {
          "acteurRef": "PA718728",
          "presence": "absent"
        },
        {
          "acteurRef": "PA720586",
          "presence": "absent"
        },
        {
          "acteurRef": "PA721968",
          "presence": "absent"
        },
        {
          "acteurRef": "PA607090",
          "presence": "présent"
        },
        {
          "acteurRef": "PA722110",
          "presence": "absent"
        },
        {
          "acteurRef": "PA718962",
          "presence": "présent"
        }
      ]
    },
    "personnesAuditionnees": null
  },
  "sessionRef": null,
  "ouverturePresse": "true",
  "ODJ": {
    "convocationODJ": {
      "item": "– Nomination de rapporteurs :\n. sur la proposition de résolution européenne de de M. Damien Pichereau sur le premier paquet Mobilité (n° 658) ;\n. sur la proposition de résolution européenne de de M. Thierry Michels sur la transition énergétique dans l'Union européenne (n° 597) ;\n. sur le projet de loi pour l’équilibre des relations commerciales dans le secteur agricole et alimentaire et une alimentation saine et durable (n° 627) (avis) ;\n– Audition de M. Yann Marteil, directeur général de MOBIVIA, président exécutif de VIA ID, incubateur de start-ups dans le domaine des mobilités innovantes, ainsi que de représentants de ces start-ups."
    },
    "resumeODJ": {
      "item": [
        "nomination de rapporteurs;",
        "audition de M. Yann Marteil, directeur général de MOBIVIA, président exécutif de VIA-ID, incubateur de start-ups dans le domaine des mobilités innovantes, ainsi que de représentants de ces start-ups."
      ]
    },
    "pointsODJ": {
      "pointODJ": [
        {
          "@xsi:type": "podjReunion_type",
          "uid": "RUANR5L15S2018IDC428358PT25454",
          "cycleDeVie": {
            "etat": "Confirmé",
            "chrono": {
              "creation": "2018-02-08T00:00:00.000+01:00",
              "cloture": null
            }
          },
          "objet": "Nomination d'un rapporteur",
          "demandeurPoint": null,
          "procedure": null,
          "dossiersLegislatifsRefs": null,
          "typePointODJ": "Nomination rapporteur",
          "comiteSecret": "false",
          "textesAssocies": null
        },
        {
          "@xsi:type": "podjReunion_type",
          "uid": "RUANR5L15S2018IDC428358PT25455",
          "cycleDeVie": {
            "etat": "Confirmé",
            "chrono": {
              "creation": "2018-02-08T00:00:00.000+01:00",
              "cloture": null
            }
          },
          "objet": "Nomination d'un rapporteur",
          "demandeurPoint": null,
          "procedure": null,
          "dossiersLegislatifsRefs": null,
          "typePointODJ": "Nomination rapporteur",
          "comiteSecret": "false",
          "textesAssocies": null
        },
        {
          "@xsi:type": "podjReunion_type",
          "uid": "RUANR5L15S2018IDC428358PT25458",
          "cycleDeVie": {
            "etat": "Confirmé",
            "chrono": {
              "creation": "2018-02-08T00:00:00.000+01:00",
              "cloture": null
            }
          },
          "objet": "Nomination d'un rapporteur pour avis",
          "demandeurPoint": null,
          "procedure": null,
          "dossiersLegislatifsRefs": null,
          "typePointODJ": "Nomination rapporteur pour avis",
          "comiteSecret": "false",
          "textesAssocies": null
        }
      ]
    }
  },
  "compteRenduRef": "CRCANR5L15S2018PO419865N034"
}