{
  "uid": "RUANR5L15S2018IDF0095981",
  "timeStampDebut": "2018-04-14T09:00:00.000+02:00",
  "timeStampFin": "2018-04-14T17:00:00.000+02:00",
  "lieu": {
    "code": "SALREU003",
    "libelleCourt": "Salle Victor Hugo",
    "libelleLong": "Salle Victor Hugo, 101, rue de l'Université"
  },
  "cycleDeVie": {
    "etat": "Confirmé",
    "chrono": {
      "creation": "2017-09-08T17:18:38.000+02:00",
      "cloture": null
    }
  },
  "demandeurs": {
    "acteur": {
      "nom": "M. Nicolas DUPONT-AIGNAN",
      "acteurRef": "PA1206"
    }
  },
  "organeReuniRef": null,
  "typeReunion": "DEP",
  "@xmlns:xsi": "http://www.w3.org/2001/XMLSchema-instance"
}