{
  "uid": "RUANR5L15S2018IDS20763",
  "timeStampDebut": "2017-11-16T15:00:00.000+01:00",
  "timeStampFin": "2017-11-16T20:05:00.000+01:00",
  "lieu": {
    "code": "AN",
    "libelleLong": "Assemblée nationale"
  },
  "cycleDeVie": {
    "etat": "Confirmé",
    "chrono": {
      "creation": "2017-10-18T00:00:00.000+02:00",
      "cloture": null
    }
  },
  "organeReuniRef": "PO717460",
  "@xmlns:xsi": "http://www.w3.org/2001/XMLSchema-instance",
  "demandeur": null,
  "participants": null,
  "sessionRef": "SCR5A2018O1",
  "ouverturePresse": "true",
  "ODJ": {
    "convocationODJ": null,
    "resumeODJ": null,
    "pointsODJ": {
      "pointODJ": {
        "@xsi:type": "podjSeanceConfPres_type",
        "uid": "RUANR5L15S2018IDS20763PT35222",
        "cycleDeVie": {
          "etat": "Confirmé",
          "chrono": {
            "creation": "2017-10-18T00:00:00.000+02:00",
            "cloture": null
          }
        },
        "objet": "Suite de la discussion du projet de loi de finances pour 2018 (seconde partie)",
        "demandeurPoint": null,
        "procedure": null,
        "dossiersLegislatifsRefs": {
          "dossierRef": "DLR5L15N35854"
        },
        "typePointODJ": "Suite de la discussion",
        "comiteSecret": "false",
        "textesAssocies": null,
        "natureTravauxODJ": "ODJPR"
      }
    }
  },
  "compteRenduRef": "CRSANR5L15S2018O1N058",
  "identifiants": {
    "numSeanceJO": "58",
    "idJO": "20180058",
    "quantieme": "Deuxième",
    "DateSeance": "2017-11-16+01:00"
  }
}