{
  "uid": "RUANR5L14S2018IDF0099268",
  "timeStampDebut": "2017-11-07T09:30:00.000+01:00",
  "timeStampFin": "2017-11-07T10:30:00.000+01:00",
  "lieu": {
    "code": "SALREU023",
    "libelleCourt": "Salle 7426",
    "libelleLong": "Salle 7426, 101, rue de l'Université"
  },
  "cycleDeVie": {
    "etat": "Confirmé",
    "chrono": {
      "creation": "2017-10-25T11:55:30.000+01:00",
      "cloture": null
    }
  },
  "demandeurs": {
    "acteur": {
      "nom": "M. Thomas MESNIER",
      "acteurRef": "PA719072"
    }
  },
  "organeReuniRef": null,
  "typeReunion": "DEP",
  "@xmlns:xsi": "http://www.w3.org/2001/XMLSchema-instance"
}