{
  "uid": "RUANR5L14S2018IDF0098716",
  "timeStampDebut": "2017-10-24T16:00:00.000+02:00",
  "timeStampFin": "2017-10-24T17:00:00.000+02:00",
  "lieu": {
    "code": "SALREU045",
    "libelleCourt": "Sully 3",
    "libelleLong": "Sully 3, Palais Bourbon"
  },
  "cycleDeVie": {
    "etat": "Confirmé",
    "chrono": {
      "creation": "2017-10-16T18:25:42.000+02:00",
      "cloture": null
    }
  },
  "demandeurs": {
    "acteur": {
      "nom": "M. Frédéric DESCROZAILLE",
      "acteurRef": "PA720862"
    }
  },
  "organeReuniRef": null,
  "typeReunion": "DEP",
  "@xmlns:xsi": "http://www.w3.org/2001/XMLSchema-instance"
}