{
  "uid": "RUANR5L15S2017IDC427199",
  "timeStampDebut": "2017-09-14T16:00:00.000+02:00",
  "lieu": {
    "libelleLong": "salle Lamartine"
  },
  "cycleDeVie": {
    "etat": "Annulé",
    "chrono": {
      "creation": "2017-08-03T00:00:00.000+02:00",
      "cloture": "2017-09-11T00:00:00.000+02:00"
    }
  },
  "organeReuniRef": "PO419865",
  "@xmlns:xsi": "http://www.w3.org/2001/XMLSchema-instance",
  "demandeur": null,
  "participants": {
    "participantsInternes": null,
    "personnesAuditionnees": null
  },
  "sessionRef": null,
  "ouverturePresse": "true",
  "ODJ": {
    "convocationODJ": {
      "item": "– Nomination d’un rapporteur sur le projet de loi mettant fin à la recherche ainsi qu’à l’exploitation des hydrocarbures conventionnels et non conventionnels et portant diverses dispositions relatives à l’énergie et à l’environnement (n°155) ;\n– Audition de M. Nicolas Hulot, ministre d’État, ministre en charge de la transition écologique et solidaire sur ce projet de loi."
    },
    "resumeODJ": {
      "item": [
        "nomination d'un rapporteur ;",
        "audition de M. Nicolas Hulot, ministre d'État, ministre en charge de la transition écologique et solidaire."
      ]
    },
    "pointsODJ": {
      "pointODJ": {
        "@xsi:type": "podjReunion_type",
        "uid": "RUANR5L15S2017IDC427199PT24963",
        "cycleDeVie": {
          "etat": "Annulé",
          "chrono": {
            "creation": "2017-09-08T00:00:00.000+02:00",
            "cloture": "2017-09-11T00:00:00.000+02:00"
          }
        },
        "objet": "Nomination d'un rapporteur",
        "demandeurPoint": null,
        "procedure": null,
        "dossiersLegislatifsRefs": null,
        "typePointODJ": "Nomination rapporteur",
        "comiteSecret": "false",
        "textesAssocies": null
      }
    }
  },
  "compteRenduRef": "CRCANR5L15S2017PO419865N010"
}