{
  "uid": "RUANR5L14S2017IDF0094541",
  "timeStampDebut": "2017-07-26T08:00:00.000+02:00",
  "timeStampFin": "2017-07-26T09:00:00.000+02:00",
  "lieu": {
    "code": "SALREU007",
    "libelleCourt": "4ème Bureau",
    "libelleLong": "4ème Bureau, Palais Bourbon"
  },
  "cycleDeVie": {
    "etat": "Confirmé",
    "chrono": {
      "creation": "2017-07-21T19:26:37.000+02:00",
      "cloture": null
    }
  },
  "demandeurs": {
    "organe": {
      "nom": "GROUPE LA RÉPUBLIQUE EN MARCHE",
      "organeRef": "PO730964"
    }
  },
  "organeReuniRef": "PO730964",
  "typeReunion": "GP",
  "@xmlns:xsi": "http://www.w3.org/2001/XMLSchema-instance"
}