{
  "uid": "RUANR5L14S2017IDF0093756",
  "timeStampDebut": "2017-07-11T09:00:00.000+02:00",
  "timeStampFin": "2017-07-11T10:00:00.000+02:00",
  "lieu": {
    "code": "SALREU028",
    "libelleCourt": "Salle Colbert",
    "libelleLong": "Salle Colbert , Palais Bourbon"
  },
  "cycleDeVie": {
    "etat": "Confirmé",
    "chrono": {
      "creation": "2017-07-07T17:23:44.000+02:00",
      "cloture": null
    }
  },
  "demandeurs": {
    "organe": {
      "nom": "GROUPE LA RÉPUBLIQUE EN MARCHE",
      "organeRef": "PO730964"
    }
  },
  "organeReuniRef": "PO730964",
  "typeReunion": "GP",
  "@xmlns:xsi": "http://www.w3.org/2001/XMLSchema-instance"
}