{
  "uid": "RUANR5L14S2018IDF0097820",
  "timeStampDebut": "2017-10-10T14:00:00.000+02:00",
  "timeStampFin": "2017-10-10T15:00:00.000+02:00",
  "lieu": {
    "code": "SALREU018",
    "libelleCourt": "Salon Mansart",
    "libelleLong": "Salon Mansart, 101, rue de l'Université"
  },
  "cycleDeVie": {
    "etat": "Confirmé",
    "chrono": {
      "creation": "2017-10-03T10:50:45.000+02:00",
      "cloture": null
    }
  },
  "demandeurs": {
    "acteur": {
      "nom": "M. Julien DIVE",
      "acteurRef": "PA712015"
    }
  },
  "organeReuniRef": null,
  "typeReunion": "DEP",
  "@xmlns:xsi": "http://www.w3.org/2001/XMLSchema-instance"
}