{
  "uid": "RUANR5L14S2018IDF0096519",
  "timeStampDebut": "2017-10-03T09:00:00.000+02:00",
  "timeStampFin": "2017-10-03T10:00:00.000+02:00",
  "lieu": {
    "code": "SALREU021",
    "libelleCourt": "Salle 7207",
    "libelleLong": "Salle 7207, 101, rue de l'Université"
  },
  "cycleDeVie": {
    "etat": "Annulé",
    "chrono": {
      "creation": "2017-09-18T14:15:38.000+02:00",
      "cloture": "2017-10-02T17:26:32.000+02:00"
    }
  },
  "demandeurs": {
    "acteur": {
      "nom": "M. Jacques MAIRE",
      "acteurRef": "PA722178"
    }
  },
  "organeReuniRef": null,
  "typeReunion": "DEP",
  "@xmlns:xsi": "http://www.w3.org/2001/XMLSchema-instance"
}