{
  "uid": "RUANR5L15S2018IDF0106563",
  "timeStampDebut": "2018-03-20T09:30:00.000+01:00",
  "timeStampFin": "2018-03-20T12:30:00.000+01:00",
  "lieu": {
    "code": "SALREU017",
    "libelleCourt": "Salon Visconti",
    "libelleLong": "Salon Visconti, 101, rue de l'Université"
  },
  "cycleDeVie": {
    "etat": "Confirmé",
    "chrono": {
      "creation": "2018-02-23T18:01:55.000+01:00",
      "cloture": null
    }
  },
  "demandeurs": {
    "acteur": {
      "nom": "Mme Fiona LAZAAR",
      "acteurRef": "PA720916"
    }
  },
  "organeReuniRef": null,
  "typeReunion": "DEP",
  "@xmlns:xsi": "http://www.w3.org/2001/XMLSchema-instance"
}