{
  "uid": "RUANR5L15S2018IDF0106288",
  "timeStampDebut": "2018-03-27T18:00:00.000+02:00",
  "timeStampFin": "2018-03-27T20:00:00.000+02:00",
  "lieu": {
    "code": "SALREU016",
    "libelleCourt": "Salon Gabriel",
    "libelleLong": "Salon Gabriel, 101, rue de l'Université"
  },
  "cycleDeVie": {
    "etat": "Confirmé",
    "chrono": {
      "creation": "2018-02-21T10:06:07.000+02:00",
      "cloture": null
    }
  },
  "demandeurs": {
    "acteur": {
      "nom": "Mme Isabelle RAUCH",
      "acteurRef": "PA720552"
    }
  },
  "organeReuniRef": null,
  "typeReunion": "DEP",
  "@xmlns:xsi": "http://www.w3.org/2001/XMLSchema-instance"
}