{
  "uid": "RUANR5L15S2018IDC428223",
  "timeStampDebut": "2018-01-18T09:00:00.000+01:00",
  "timeStampFin": "2018-01-18T10:00:00.000+01:00",
  "lieu": {
    "libelleLong": "salle 6237 (Développement durable)"
  },
  "cycleDeVie": {
    "etat": "Confirmé",
    "chrono": {
      "creation": "2018-01-11T00:00:00.000+01:00",
      "cloture": null
    }
  },
  "organeReuniRef": "PO743158",
  "@xmlns:xsi": "http://www.w3.org/2001/XMLSchema-instance",
  "demandeur": null,
  "participants": {
    "participantsInternes": {
      "participantInterne": [
        {
          "acteurRef": "PA719806",
          "presence": "présent"
        },
        {
          "acteurRef": "PA642724",
          "presence": "absent"
        },
        {
          "acteurRef": "PA720968",
          "presence": "présent"
        },
        {
          "acteurRef": "PA267233",
          "presence": "absent"
        },
        {
          "acteurRef": "PA719032",
          "presence": "présent"
        },
        {
          "acteurRef": "PA721118",
          "presence": "absent"
        },
        {
          "acteurRef": "PA719922",
          "presence": "présent"
        },
        {
          "acteurRef": "PA702054",
          "presence": "présent"
        },
        {
          "acteurRef": "PA719692",
          "presence": "absent"
        },
        {
          "acteurRef": "PA719616",
          "presence": "absent"
        },
        {
          "acteurRef": "PA610775",
          "presence": "excusé"
        },
        {
          "acteurRef": "PA721126",
          "presence": "présent"
        },
        {
          "acteurRef": "PA720054",
          "presence": "présent"
        },
        {
          "acteurRef": "PA720038",
          "presence": "présent"
        },
        {
          "acteurRef": "PA267901",
          "presence": "absent"
        },
        {
          "acteurRef": "PA605518",
          "presence": "absent"
        },
        {
          "acteurRef": "PA721054",
          "presence": "absent"
        },
        {
          "acteurRef": "PA346054",
          "presence": "absent"
        },
        {
          "acteurRef": "PA721734",
          "presence": "absent"
        },
        {
          "acteurRef": "PA719632",
          "presence": "présent"
        },
        {
          "acteurRef": "PA718784",
          "presence": "absent"
        },
        {
          "acteurRef": "PA609520",
          "presence": "absent"
        },
        {
          "acteurRef": "PA643127",
          "presence": "absent"
        },
        {
          "acteurRef": "PA721062",
          "presence": "présent"
        },
        {
          "acteurRef": "PA721824",
          "presence": "présent"
        },
        {
          "acteurRef": "PA702052",
          "presence": "présent"
        },
        {
          "acteurRef": "PA720960",
          "presence": "absent"
        },
        {
          "acteurRef": "PA719092",
          "presence": "absent"
        },
        {
          "acteurRef": "PA643145",
          "presence": "absent"
        }
      ]
    },
    "personnesAuditionnees": null
  },
  "sessionRef": null,
  "ouverturePresse": "true",
  "ODJ": {
    "convocationODJ": {
      "item": "Audition, ouverte à la presse, de M. Marc Pontaud, directeur, et de M. David Salas, chef du groupe de météorologie de grande échelle et climat du Centre national de recherche météorologique (CNRM)."
    },
    "resumeODJ": {
      "item": "audition, ouverte à la presse, de représentants de Météo France, avec la participation de M. Marc Pontaud, directeur, de M. David Salas, chef du groupe de météorologie de grande échelle et climat du Centre national de recherche météorologique (CNRM) et de M. Fabrice Chauvin, chercheur au CNRM, Météo France."
    },
    "pointsODJ": {
      "pointODJ": {
        "@xsi:type": "podjReunion_type",
        "uid": "RUANR5L15S2018IDC428223PT25376",
        "cycleDeVie": {
          "etat": "Confirmé",
          "chrono": {
            "creation": "2018-01-11T00:00:00.000+01:00",
            "cloture": null
          }
        },
        "objet": "Audition, ouverte à la presse, de M. Marc Pontaud, directeur, et de M. David Salas, chef du groupe de météorologie de grande échelle et climat du Centre national de recherche météorologique (CNRM).",
        "demandeurPoint": null,
        "procedure": null,
        "dossiersLegislatifsRefs": {
          "dossierRef": "DLR5L15N36128"
        },
        "typePointODJ": "Audition",
        "comiteSecret": "false",
        "textesAssocies": null
      }
    }
  },
  "compteRenduRef": "CRCANR5L15S2018PO743158N004"
}