{
  "uid": "RUANR5L15S2018IDF0104251",
  "timeStampDebut": "2018-01-30T14:00:00.000+01:00",
  "timeStampFin": "2018-01-30T15:00:00.000+01:00",
  "lieu": {
    "code": "SALREU012",
    "libelleCourt": "Salle N° 23",
    "libelleLong": "Salle N° 23, 3, rue Aristide Briand"
  },
  "cycleDeVie": {
    "etat": "Confirmé",
    "chrono": {
      "creation": "2018-01-23T17:44:14.000+01:00",
      "cloture": null
    }
  },
  "demandeurs": {
    "organe": {
      "nom": "Groupe d'amitié France-Bielorussie",
      "organeRef": "PO732919"
    }
  },
  "organeReuniRef": "PO732919",
  "typeReunion": "GA",
  "@xmlns:xsi": "http://www.w3.org/2001/XMLSchema-instance"
}