{
  "uid": "RUANR5L15S2018IDF0103282",
  "timeStampDebut": "2018-02-21T09:30:00.000+01:00",
  "timeStampFin": "2018-02-21T17:00:00.000+01:00",
  "lieu": {
    "code": "SALREU028",
    "libelleCourt": "Salle Colbert",
    "libelleLong": "Salle Colbert , Palais Bourbon"
  },
  "cycleDeVie": {
    "etat": "Confirmé",
    "chrono": {
      "creation": "2018-01-09T17:50:04.000+01:00",
      "cloture": null
    }
  },
  "demandeurs": {
    "acteur": {
      "nom": "M. Mustapha LAABID",
      "acteurRef": "PA719842"
    }
  },
  "organeReuniRef": null,
  "typeReunion": "DEP",
  "@xmlns:xsi": "http://www.w3.org/2001/XMLSchema-instance"
}