{
  "uid": "RUANR5L14S2017IDF0095952",
  "timeStampDebut": "2017-09-26T09:00:00.000+02:00",
  "timeStampFin": "2017-09-26T11:00:00.000+02:00",
  "lieu": {
    "code": "SALREU008",
    "libelleCourt": "5ème Bureau",
    "libelleLong": "5ème Bureau, Palais Bourbon"
  },
  "cycleDeVie": {
    "etat": "Confirmé",
    "chrono": {
      "creation": "2017-09-08T15:28:28.000+02:00",
      "cloture": null
    }
  },
  "demandeurs": {
    "acteur": {
      "nom": "M. Gérard MENUEL",
      "acteurRef": "PA2155"
    }
  },
  "organeReuniRef": null,
  "typeReunion": "DEP",
  "@xmlns:xsi": "http://www.w3.org/2001/XMLSchema-instance"
}