{
  "uid": "RUANR5L15S2018IDF0104898",
  "timeStampDebut": "2018-02-15T13:30:00.000+01:00",
  "timeStampFin": "2018-02-15T15:00:00.000+01:00",
  "lieu": {
    "code": "SALREU005",
    "libelleCourt": "2ème Bureau",
    "libelleLong": "2ème Bureau, Palais Bourbon"
  },
  "cycleDeVie": {
    "etat": "Annulé",
    "chrono": {
      "creation": "2018-02-01T10:56:54.000+01:00",
      "cloture": "2018-02-09T09:27:04.000+01:00"
    }
  },
  "demandeurs": {
    "acteur": {
      "nom": "M. Saïd AHAMADA",
      "acteurRef": "PA718954"
    }
  },
  "organeReuniRef": null,
  "typeReunion": "DEP",
  "@xmlns:xsi": "http://www.w3.org/2001/XMLSchema-instance"
}