{
  "uid": "RUANR5L15S2018IDS20759",
  "timeStampDebut": "2017-11-14T21:30:00.000+01:00",
  "timeStampFin": "2017-11-15T01:15:00.000+01:00",
  "lieu": {
    "code": "AN",
    "libelleLong": "Assemblée nationale"
  },
  "cycleDeVie": {
    "etat": "Confirmé",
    "chrono": {
      "creation": "2017-10-18T00:00:00.000+02:00",
      "cloture": null
    }
  },
  "organeReuniRef": "PO717460",
  "@xmlns:xsi": "http://www.w3.org/2001/XMLSchema-instance",
  "demandeur": null,
  "participants": null,
  "sessionRef": "SCR5A2018O1",
  "ouverturePresse": "true",
  "ODJ": {
    "convocationODJ": null,
    "resumeODJ": null,
    "pointsODJ": {
      "pointODJ": [
        {
          "@xsi:type": "podjSeanceConfPres_type",
          "uid": "RUANR5L15S2018IDS20759PT35299",
          "cycleDeVie": {
            "etat": "Confirmé",
            "chrono": {
              "creation": "2017-11-13T00:00:00.000+01:00",
              "cloture": null
            }
          },
          "objet": "Lecture définitive du projet de loi de finances rectificative pour 2017 (1)",
          "demandeurPoint": null,
          "procedure": null,
          "dossiersLegislatifsRefs": {
            "dossierRef": "DLR5L15N36107"
          },
          "typePointODJ": "Discussion",
          "comiteSecret": "false",
          "textesAssocies": null,
          "natureTravauxODJ": "ODJPR"
        },
        {
          "@xsi:type": "podjSeanceConfPres_type",
          "uid": "RUANR5L15S2018IDS20759PT35217",
          "cycleDeVie": {
            "etat": "Confirmé",
            "chrono": {
              "creation": "2017-10-18T00:00:00.000+02:00",
              "cloture": null
            }
          },
          "objet": "Suite de la discussion du projet de loi de finances pour 2018 (seconde partie)",
          "demandeurPoint": null,
          "procedure": null,
          "dossiersLegislatifsRefs": {
            "dossierRef": "DLR5L15N35854"
          },
          "typePointODJ": "Suite de la discussion",
          "comiteSecret": "false",
          "textesAssocies": null,
          "natureTravauxODJ": "ODJPR"
        }
      ]
    }
  },
  "compteRenduRef": "CRSANR5L15S2018O1N054",
  "identifiants": {
    "numSeanceJO": "54",
    "idJO": "20180054",
    "quantieme": "Deuxième",
    "DateSeance": "2017-11-14+01:00"
  }
}