{
  "uid": "RUANR5L15S2018IDF0105375",
  "timeStampDebut": "2018-02-13T16:30:00.000+01:00",
  "timeStampFin": "2018-02-13T18:00:00.000+01:00",
  "lieu": {
    "code": "SALREU021",
    "libelleCourt": "Salle 7207",
    "libelleLong": "Salle 7207, 101, rue de l'Université"
  },
  "cycleDeVie": {
    "etat": "Confirmé",
    "chrono": {
      "creation": "2018-02-08T10:38:56.000+01:00",
      "cloture": null
    }
  },
  "demandeurs": {
    "acteur": {
      "nom": "M. Alain PEREA",
      "acteurRef": "PA718802"
    }
  },
  "organeReuniRef": null,
  "typeReunion": "DEP",
  "@xmlns:xsi": "http://www.w3.org/2001/XMLSchema-instance"
}