{
  "uid": "RUANR5L14S2017IDF0094838",
  "timeStampDebut": "2017-09-21T14:00:00.000+02:00",
  "timeStampFin": "2017-09-21T18:00:00.000+02:00",
  "lieu": {
    "code": "SALREU016",
    "libelleCourt": "Salon Gabriel",
    "libelleLong": "Salon Gabriel, 101, rue de l'Université"
  },
  "cycleDeVie": {
    "etat": "Confirmé",
    "chrono": {
      "creation": "2017-07-27T19:04:08.000+02:00",
      "cloture": null
    }
  },
  "demandeurs": {
    "acteur": {
      "nom": "M. Philippe MICHEL-KLEISBAUER",
      "acteurRef": "PA721734"
    }
  },
  "organeReuniRef": null,
  "typeReunion": "DEP",
  "@xmlns:xsi": "http://www.w3.org/2001/XMLSchema-instance"
}