{
  "uid": "RUANR5L15S2018IDF0104325",
  "timeStampDebut": "2018-01-31T16:30:00.000+01:00",
  "timeStampFin": "2018-01-31T17:30:00.000+01:00",
  "lieu": {
    "code": "SALREU049",
    "libelleCourt": "Salle 6822",
    "libelleLong": "Salle 6822, Palais Bourbon"
  },
  "cycleDeVie": {
    "etat": "Confirmé",
    "chrono": {
      "creation": "2018-01-24T15:59:28.000+01:00",
      "cloture": null
    }
  },
  "demandeurs": {
    "acteur": {
      "nom": "M. Grégory BESSON-MOREAU",
      "acteurRef": "PA718876"
    }
  },
  "organeReuniRef": null,
  "typeReunion": "DEP",
  "@xmlns:xsi": "http://www.w3.org/2001/XMLSchema-instance"
}