{
  "uid": "RUANR5L15S2018IDF0105511",
  "timeStampDebut": "2018-02-15T09:30:00.000+01:00",
  "timeStampFin": "2018-02-15T12:00:00.000+01:00",
  "lieu": {
    "code": "SALREU045",
    "libelleCourt": "Sully 3",
    "libelleLong": "Sully 3, Palais Bourbon"
  },
  "cycleDeVie": {
    "etat": "Confirmé",
    "chrono": {
      "creation": "2018-02-09T16:05:51.000+01:00",
      "cloture": null
    }
  },
  "demandeurs": {
    "acteur": {
      "nom": "M. Damien ADAM",
      "acteurRef": "PA722038"
    }
  },
  "organeReuniRef": null,
  "typeReunion": "DEP",
  "@xmlns:xsi": "http://www.w3.org/2001/XMLSchema-instance"
}