{
  "uid": "RUANR5L15S2018IDC427808",
  "timeStampDebut": "2017-11-21T14:30:00.000+01:00",
  "timeStampFin": "2017-11-21T14:35:00.000+01:00",
  "lieu": {
    "libelleLong": "salle 6351 (Affaires sociales)"
  },
  "cycleDeVie": {
    "etat": "Confirmé",
    "chrono": {
      "creation": "2017-11-10T00:00:00.000+01:00",
      "cloture": null
    }
  },
  "organeReuniRef": "PO420120",
  "@xmlns:xsi": "http://www.w3.org/2001/XMLSchema-instance",
  "demandeur": null,
  "participants": {
    "participantsInternes": {
      "participantInterne": [
        {
          "acteurRef": "PA642764",
          "presence": "absent"
        },
        {
          "acteurRef": "PA718744",
          "presence": "absent"
        },
        {
          "acteurRef": "PA610681",
          "presence": "excusé"
        },
        {
          "acteurRef": "PA720362",
          "presence": "absent"
        },
        {
          "acteurRef": "PA720968",
          "presence": "excusé"
        },
        {
          "acteurRef": "PA720822",
          "presence": "présent"
        },
        {
          "acteurRef": "PA719980",
          "presence": "absent"
        },
        {
          "acteurRef": "PA608083",
          "presence": "présent"
        },
        {
          "acteurRef": "PA721336",
          "presence": "présent"
        },
        {
          "acteurRef": "PA720468",
          "presence": "présent"
        },
        {
          "acteurRef": "PA856",
          "presence": "présent"
        },
        {
          "acteurRef": "PA722126",
          "presence": "absent"
        },
        {
          "acteurRef": "PA642868",
          "presence": "absent"
        },
        {
          "acteurRef": "PA719756",
          "presence": "présent"
        },
        {
          "acteurRef": "PA722390",
          "presence": "absent"
        },
        {
          "acteurRef": "PA720932",
          "presence": "absent"
        },
        {
          "acteurRef": "PA718694",
          "presence": "présent"
        },
        {
          "acteurRef": "PA718926",
          "presence": "absent"
        },
        {
          "acteurRef": "PA267289",
          "presence": "absent"
        },
        {
          "acteurRef": "PA608292",
          "presence": "absent"
        },
        {
          "acteurRef": "PA720046",
          "presence": "absent"
        },
        {
          "acteurRef": "PA720924",
          "presence": "absent"
        },
        {
          "acteurRef": "PA719570",
          "presence": "présent"
        },
        {
          "acteurRef": "PA720286",
          "presence": "absent"
        },
        {
          "acteurRef": "PA267780",
          "presence": "absent"
        },
        {
          "acteurRef": "PA718706",
          "presence": "présent"
        },
        {
          "acteurRef": "PA721246",
          "presence": "absent"
        },
        {
          "acteurRef": "PA721992",
          "presence": "absent"
        },
        {
          "acteurRef": "PA720170",
          "presence": "absent"
        },
        {
          "acteurRef": "PA722062",
          "presence": "présent"
        },
        {
          "acteurRef": "PA267318",
          "presence": "présent"
        },
        {
          "acteurRef": "PA721126",
          "presence": "excusé"
        },
        {
          "acteurRef": "PA720326",
          "presence": "absent"
        },
        {
          "acteurRef": "PA331835",
          "presence": "absent"
        },
        {
          "acteurRef": "PA722374",
          "presence": "absent"
        },
        {
          "acteurRef": "PA720074",
          "presence": "absent"
        },
        {
          "acteurRef": "PA719186",
          "presence": "présent"
        },
        {
          "acteurRef": "PA719842",
          "presence": "absent"
        },
        {
          "acteurRef": "PA720916",
          "presence": "absent"
        },
        {
          "acteurRef": "PA720480",
          "presence": "absent"
        },
        {
          "acteurRef": "PA267378",
          "presence": "absent"
        },
        {
          "acteurRef": "PA606712",
          "presence": "absent"
        },
        {
          "acteurRef": "PA717379",
          "presence": "absent"
        },
        {
          "acteurRef": "PA719072",
          "presence": "absent"
        },
        {
          "acteurRef": "PA720738",
          "presence": "présent"
        },
        {
          "acteurRef": "PA721486",
          "presence": "présent"
        },
        {
          "acteurRef": "PA610654",
          "presence": "excusé"
        },
        {
          "acteurRef": "PA2377",
          "presence": "absent"
        },
        {
          "acteurRef": "PA720500",
          "presence": "absent"
        },
        {
          "acteurRef": "PA721710",
          "presence": "absent"
        },
        {
          "acteurRef": "PA720512",
          "presence": "présent"
        },
        {
          "acteurRef": "PA718910",
          "presence": "absent"
        },
        {
          "acteurRef": "PA720422",
          "presence": "absent"
        },
        {
          "acteurRef": "PA721286",
          "presence": "absent"
        },
        {
          "acteurRef": "PA721070",
          "presence": "excusé"
        },
        {
          "acteurRef": "PA721062",
          "presence": "excusé"
        },
        {
          "acteurRef": "PA718810",
          "presence": "présent"
        },
        {
          "acteurRef": "PA722022",
          "presence": "absent"
        },
        {
          "acteurRef": "PA720952",
          "presence": "présent"
        },
        {
          "acteurRef": "PA719350",
          "presence": "absent"
        },
        {
          "acteurRef": "PA722086",
          "presence": "absent"
        },
        {
          "acteurRef": "PA334768",
          "presence": "absent"
        },
        {
          "acteurRef": "PA719540",
          "presence": "absent"
        },
        {
          "acteurRef": "PA643145",
          "presence": "excusé"
        },
        {
          "acteurRef": "PA643134",
          "presence": "absent"
        },
        {
          "acteurRef": "PA719930",
          "presence": "absent"
        },
        {
          "acteurRef": "PA721924",
          "presence": "absent"
        },
        {
          "acteurRef": "PA642788",
          "presence": "absent"
        },
        {
          "acteurRef": "PA267585",
          "presence": "absent"
        },
        {
          "acteurRef": "PA722102",
          "presence": "absent"
        },
        {
          "acteurRef": "PA719512",
          "presence": "présent"
        },
        {
          "acteurRef": "PA721474",
          "presence": "présent"
        },
        {
          "acteurRef": "PA722268",
          "presence": "absent"
        }
      ]
    },
    "personnesAuditionnees": null
  },
  "sessionRef": null,
  "ouverturePresse": "true",
  "ODJ": {
    "convocationODJ": {
      "item": [
        "Examen, en application de l'article 88 du Règlement, des amendements sur le projet de loi de ratification de diverses ordonnances prises sur le fondement de la loi n° 2017-1340 du 15 septembre 2017 d'habilitation à prendre par ordonnances les mesures pour le renforcement du dialogue social (n° 369) (M. Laurent Pietraszewski, rapporteur)",
        "désignation d'un rapporteur au nom de la commission saisie pour avis sur le projet de loi relatif à l'orientation et à la réussite des étudiants (sous réserve de son dépôt)"
      ]
    },
    "resumeODJ": {
      "item": [
        "ratification de diverses ordonnances prises sur le fondement de la loi n° 2017–1340 du 15 septembre 2017 d’habilitation à prendre par ordonnances les mesures pour le renforcement du dialogue social (n° 369) (amendements, art. 88) ;",
        "désignation d'un rapporteur (sous réserve de son dépôt)."
      ]
    },
    "pointsODJ": {
      "pointODJ": [
        {
          "@xsi:type": "podjReunion_type",
          "uid": "RUANR5L15S2018IDC427808PT25228",
          "cycleDeVie": {
            "etat": "Confirmé",
            "chrono": {
              "creation": "2017-11-16T00:00:00.000+01:00",
              "cloture": null
            }
          },
          "objet": "Examen des amendements (art. 88)",
          "demandeurPoint": null,
          "procedure": null,
          "dossiersLegislatifsRefs": {
            "dossierRef": "DLR5L15N35986"
          },
          "typePointODJ": "Amendements (Art. 88)",
          "comiteSecret": "false",
          "textesAssocies": null
        },
        {
          "@xsi:type": "podjReunion_type",
          "uid": "RUANR5L15S2018IDC427808PT25268",
          "cycleDeVie": {
            "etat": "Confirmé",
            "chrono": {
              "creation": "2017-11-23T00:00:00.000+01:00",
              "cloture": null
            }
          },
          "objet": "Nomination de la rapporteure pour avis",
          "demandeurPoint": null,
          "procedure": null,
          "dossiersLegislatifsRefs": {
            "dossierRef": "DLR5L15N36143"
          },
          "typePointODJ": "Nomination rapporteur",
          "comiteSecret": "false",
          "textesAssocies": null
        }
      ]
    }
  },
  "compteRenduRef": "CRCANR5L15S2018PO420120N024"
}