{
  "uid": "RUANR5L14S2018IDF0096089",
  "timeStampDebut": "2017-10-03T09:30:00.000+02:00",
  "timeStampFin": "2017-10-03T10:30:00.000+02:00",
  "lieu": {
    "code": "SALREU039",
    "libelleCourt": "Salle 6550",
    "libelleLong": "Salle 6550, Palais Bourbon"
  },
  "cycleDeVie": {
    "etat": "Confirmé",
    "chrono": {
      "creation": "2017-09-12T10:34:08.000+02:00",
      "cloture": null
    }
  },
  "demandeurs": {
    "acteur": [
      {
        "nom": "M. Romain GRAU",
        "acteurRef": "PA720790"
      },
      {
        "nom": "Mme Nadia HAI",
        "acteurRef": "PA722054"
      }
    ]
  },
  "organeReuniRef": null,
  "typeReunion": "DEP",
  "@xmlns:xsi": "http://www.w3.org/2001/XMLSchema-instance"
}