{
  "uid": "RUANR5L15S2018IDF0107106",
  "timeStampDebut": "2018-03-20T16:30:00.000+01:00",
  "timeStampFin": "2018-03-20T17:00:00.000+01:00",
  "lieu": {
    "code": "SALREU016",
    "libelleCourt": "Salon Gabriel",
    "libelleLong": "Salon Gabriel, 101, rue de l'Université"
  },
  "cycleDeVie": {
    "etat": "Confirmé",
    "chrono": {
      "creation": "2018-03-07T11:58:47.000+01:00",
      "cloture": null
    }
  },
  "demandeurs": {
    "organe": {
      "nom": "Groupe d'études",
      "organeRef": "PO746639"
    }
  },
  "organeReuniRef": "PO746639",
  "typeReunion": "GE",
  "@xmlns:xsi": "http://www.w3.org/2001/XMLSchema-instance"
}