{
  "uid": "RUANR5L14S2018IDF0099246",
  "timeStampDebut": "2017-11-07T17:00:00.000+01:00",
  "timeStampFin": "2017-11-07T18:00:00.000+01:00",
  "lieu": {
    "code": "SALREU013",
    "libelleCourt": "Salle N° 3",
    "libelleLong": "Salle N° 3, 3, rue Aristide Briand"
  },
  "cycleDeVie": {
    "etat": "Annulé",
    "chrono": {
      "creation": "2017-10-25T10:02:32.000+01:00",
      "cloture": "2017-11-03T11:42:07.000+01:00"
    }
  },
  "demandeurs": {
    "acteur": {
      "nom": "M. Régis JUANICO",
      "acteurRef": "PA332614"
    }
  },
  "organeReuniRef": null,
  "typeReunion": "DEP",
  "@xmlns:xsi": "http://www.w3.org/2001/XMLSchema-instance"
}