{
  "uid": "RUANR5L15S2018IDF0105573",
  "timeStampDebut": "2018-03-07T09:00:00.000+01:00",
  "timeStampFin": "2018-03-07T11:00:00.000+01:00",
  "lieu": {
    "code": "SALREU023",
    "libelleCourt": "Salle 7426",
    "libelleLong": "Salle 7426, 101, rue de l'Université"
  },
  "cycleDeVie": {
    "etat": "Confirmé",
    "chrono": {
      "creation": "2018-02-12T11:25:29.000+01:00",
      "cloture": null
    }
  },
  "demandeurs": {
    "acteur": {
      "nom": "M. Christophe LEJEUNE",
      "acteurRef": "PA722320"
    }
  },
  "organeReuniRef": null,
  "typeReunion": "DEP",
  "@xmlns:xsi": "http://www.w3.org/2001/XMLSchema-instance"
}