{
  "uid": "RUANR5L14S2018IDF0099949",
  "timeStampDebut": "2017-11-27T15:00:00.000+01:00",
  "timeStampFin": "2017-11-27T17:00:00.000+01:00",
  "lieu": {
    "code": "SALREU048",
    "libelleCourt": "Salle 6809",
    "libelleLong": "Salle 6809, Palais Bourbon"
  },
  "cycleDeVie": {
    "etat": "Annulé",
    "chrono": {
      "creation": "2017-11-08T12:57:05.000+01:00",
      "cloture": "2017-11-27T09:45:56.000+01:00"
    }
  },
  "demandeurs": {
    "acteur": {
      "nom": "Mme Amélie DE MONTCHALIN",
      "acteurRef": "PA721670"
    }
  },
  "organeReuniRef": null,
  "typeReunion": "DEP",
  "@xmlns:xsi": "http://www.w3.org/2001/XMLSchema-instance"
}