{
  "uid": "RUANR5L15S2018IDF0103448",
  "timeStampDebut": "2018-03-08T10:00:00.000+01:00",
  "timeStampFin": "2018-03-08T12:00:00.000+01:00",
  "lieu": {
    "code": "SALREU038",
    "libelleCourt": "Salle 6549",
    "libelleLong": "Salle 6549, Palais Bourbon"
  },
  "cycleDeVie": {
    "etat": "Confirmé",
    "chrono": {
      "creation": "2018-01-11T17:33:03.000+01:00",
      "cloture": null
    }
  },
  "demandeurs": {
    "acteur": [
      {
        "nom": "M. Yannick KERLOGOT",
        "acteurRef": "PA719230"
      },
      {
        "nom": "M. Michel LARIVE",
        "acteurRef": "PA718868"
      }
    ]
  },
  "organeReuniRef": null,
  "typeReunion": "DEP",
  "@xmlns:xsi": "http://www.w3.org/2001/XMLSchema-instance"
}