{
  "uid": "RUANR5L14S2017IDF0093303",
  "timeStampDebut": "2017-07-12T12:00:00.000+02:00",
  "timeStampFin": "2017-07-12T14:30:00.000+02:00",
  "lieu": {
    "code": "SALREU016",
    "libelleCourt": "Salon Gabriel",
    "libelleLong": "Salon Gabriel, 101, rue de l'Université"
  },
  "cycleDeVie": {
    "etat": "Confirmé",
    "chrono": {
      "creation": "2017-06-28T16:01:39.000+02:00",
      "cloture": null
    }
  },
  "demandeurs": {
    "acteur": {
      "nom": "M. Bertrand PANCHER",
      "acteurRef": "PA333421"
    }
  },
  "organeReuniRef": null,
  "typeReunion": "DEP",
  "@xmlns:xsi": "http://www.w3.org/2001/XMLSchema-instance"
}