{
  "uid": "RUANR5L14S2017IDF0093501",
  "timeStampDebut": "2017-08-15T10:15:00.000+02:00",
  "timeStampFin": "2017-08-15T10:45:00.000+02:00",
  "lieu": {
    "code": "SALREU027",
    "libelleCourt": "Salle 6217",
    "libelleLong": "Salle 6217, Palais Bourbon"
  },
  "cycleDeVie": {
    "etat": "Confirmé",
    "chrono": {
      "creation": "2017-07-06T11:32:25.000+02:00",
      "cloture": null
    }
  },
  "demandeurs": {
    "acteur": {
      "nom": "M. Christian JACOB",
      "acteurRef": "PA1695"
    }
  },
  "organeReuniRef": null,
  "typeReunion": "DEP",
  "@xmlns:xsi": "http://www.w3.org/2001/XMLSchema-instance"
}