{
  "uid": "RUANR5L15S2018IDF0106266",
  "timeStampDebut": "2018-03-06T09:00:00.000+01:00",
  "timeStampFin": "2018-03-06T10:00:00.000+01:00",
  "lieu": {
    "code": "SALREU020",
    "libelleCourt": "Salon Mars II",
    "libelleLong": "Salon Mars II, 101, rue de l'Université"
  },
  "cycleDeVie": {
    "etat": "Annulé",
    "chrono": {
      "creation": "2018-02-20T17:35:39.000+01:00",
      "cloture": "2018-02-26T17:54:19.000+01:00"
    }
  },
  "demandeurs": {
    "acteur": {
      "nom": "M. Didier MARTIN",
      "acteurRef": "PA719154"
    }
  },
  "organeReuniRef": null,
  "typeReunion": "DEP",
  "@xmlns:xsi": "http://www.w3.org/2001/XMLSchema-instance"
}