{
  "uid": "RUANR5L15S2018IDF0107088",
  "timeStampDebut": "2018-04-03T18:00:00.000+02:00",
  "timeStampFin": "2018-04-03T19:00:00.000+02:00",
  "lieu": {
    "code": "SALREU019",
    "libelleCourt": "Salon Mars I",
    "libelleLong": "Salon Mars I, 101, rue de l'Université"
  },
  "cycleDeVie": {
    "etat": "Confirmé",
    "chrono": {
      "creation": "2018-03-07T09:19:39.000+02:00",
      "cloture": null
    }
  },
  "demandeurs": {
    "organe": {
      "nom": "Groupe d'études MALADIES ORPHELINES",
      "organeRef": "PO747062"
    }
  },
  "organeReuniRef": "PO747062",
  "typeReunion": "GE",
  "@xmlns:xsi": "http://www.w3.org/2001/XMLSchema-instance"
}