{
  "uid": "RUANR5L14S2018IDF0103012",
  "timeStampDebut": "2018-01-09T15:00:00.000+01:00",
  "timeStampFin": "2018-01-09T17:00:00.000+01:00",
  "lieu": {
    "code": "SALREU007",
    "libelleCourt": "4ème Bureau",
    "libelleLong": "4ème Bureau, Palais Bourbon"
  },
  "cycleDeVie": {
    "etat": "Confirmé",
    "chrono": {
      "creation": "2017-12-21T16:42:31.000+01:00",
      "cloture": null
    }
  },
  "demandeurs": {
    "acteur": {
      "nom": "M. Boris VALLAUD",
      "acteurRef": "PA719930"
    }
  },
  "organeReuniRef": null,
  "typeReunion": "DEP",
  "@xmlns:xsi": "http://www.w3.org/2001/XMLSchema-instance"
}