{
  "uid": "RUANR5L14S2018IDF0096656",
  "timeStampDebut": "2017-11-02T09:00:00.000+01:00",
  "timeStampFin": "2017-11-02T18:00:00.000+01:00",
  "lieu": {
    "code": "SALREU004",
    "libelleCourt": "1er Bureau",
    "libelleLong": "1er Bureau, Palais Bourbon"
  },
  "cycleDeVie": {
    "etat": "Confirmé",
    "chrono": {
      "creation": "2017-09-20T11:09:11.000+01:00",
      "cloture": null
    }
  },
  "demandeurs": {
    "acteur": {
      "nom": "M. Fabien ROUSSEL",
      "acteurRef": "PA720692"
    }
  },
  "organeReuniRef": null,
  "typeReunion": "DEP",
  "@xmlns:xsi": "http://www.w3.org/2001/XMLSchema-instance"
}