{
  "uid": "RUANR5L14S2018IDF0099529",
  "timeStampDebut": "2017-11-30T10:00:00.000+01:00",
  "timeStampFin": "2017-11-30T11:00:00.000+01:00",
  "lieu": {
    "code": "SALREU004",
    "libelleCourt": "1er Bureau",
    "libelleLong": "1er Bureau, Palais Bourbon"
  },
  "cycleDeVie": {
    "etat": "Confirmé",
    "chrono": {
      "creation": "2017-10-31T13:18:04.000+01:00",
      "cloture": null
    }
  },
  "demandeurs": {
    "organe": {
      "nom": "Groupe d'amitié France-Algérie",
      "organeRef": "PO733472"
    }
  },
  "organeReuniRef": "PO733472",
  "typeReunion": "GA",
  "@xmlns:xsi": "http://www.w3.org/2001/XMLSchema-instance"
}