{
  "uid": "RUANR5L15S2018IDC428537",
  "timeStampDebut": "2018-02-14T17:15:00.000+01:00",
  "lieu": {
    "libelleLong": "salle 6549 (2e étage)"
  },
  "cycleDeVie": {
    "etat": "Confirmé",
    "chrono": {
      "creation": "2018-02-09T00:00:00.000+01:00",
      "cloture": null
    }
  },
  "organeReuniRef": "PO738795",
  "@xmlns:xsi": "http://www.w3.org/2001/XMLSchema-instance",
  "demandeur": null,
  "participants": {
    "participantsInternes": null,
    "personnesAuditionnees": {
      "personneAuditionnee": [
        {
          "uid": {
            "@xsi:type": "IdPersonneExterne_type",
            "#text": "PE2569"
          },
          "ident": {
            "civ": "M.",
            "prenom": "Simon",
            "nom": "Kieffer"
          },
          "dateNais": "1975-04-11T01:00:00.000+01:00"
        },
        {
          "uid": {
            "@xsi:type": "IdPersonneExterne_type",
            "#text": "PE2570"
          },
          "ident": {
            "civ": "Mme",
            "prenom": "Anne",
            "nom": "Véber"
          },
          "dateNais": "1972-05-03T01:00:00.000+01:00"
        },
        {
          "uid": {
            "@xsi:type": "IdPersonneExterne_type",
            "#text": "PE2547"
          },
          "ident": {
            "civ": "Mme",
            "prenom": "Garménick",
            "nom": "Leblanc"
          },
          "dateNais": "1968-09-21T01:00:00.000+01:00"
        },
        {
          "uid": {
            "@xsi:type": "IdPersonneExterne_type",
            "#text": "PE2548"
          },
          "ident": {
            "civ": "M.",
            "prenom": "Pierre",
            "nom": "Gabach"
          },
          "dateNais": "1956-02-12T01:00:00.000+01:00"
        },
        {
          "uid": {
            "@xsi:type": "IdPersonneExterne_type",
            "#text": "PE2549"
          },
          "ident": {
            "civ": "Mme",
            "prenom": "Laurence",
            "nom": "Locca"
          },
          "dateNais": "1973-11-02T01:00:00.000+01:00"
        },
        {
          "uid": {
            "@xsi:type": "IdPersonneExterne_type",
            "#text": "PE2550"
          },
          "ident": {
            "civ": "M.",
            "prenom": "Antoine",
            "nom": "Rosier"
          },
          "dateNais": "1961-08-16T01:00:00.000+01:00"
        },
        {
          "uid": {
            "@xsi:type": "IdPersonneExterne_type",
            "#text": "PE2551"
          },
          "ident": {
            "civ": "M.",
            "prenom": "Jérôme",
            "nom": "Dupont"
          },
          "dateNais": "1979-12-02T01:00:00.000+01:00"
        },
        {
          "uid": {
            "@xsi:type": "IdPersonneExterne_type",
            "#text": "PE2552"
          },
          "ident": {
            "civ": "Mme",
            "prenom": "Danièle",
            "nom": "Langloys"
          },
          "dateNais": "1949-09-05T01:00:00.000+01:00"
        }
      ]
    }
  },
  "sessionRef": null,
  "ouverturePresse": "false",
  "ODJ": {
    "convocationODJ": {
      "item": [
        "Table ronde sur les méthodes d'intervention, les traitements et la prise en charge, avec :",
        "·M. Simon Kieffer, directeur des établissements et services médico-sociaux de la Caisse nationale de solidarité pour l’autonomie (CNSA), accompagné de Mme Anne Véber, chargée de mission autisme ;",
        "·Mme Garménick Leblanc, coordinatrice de la cellule médico-sociale, et M. Pierre Gabach, responsable du département des prestations et des maladies chroniques, direction déléguée à la gestion et à l'organisation des soins (DDGOS) de la Caisse nationale d'assurance maladie (CNAM) ;",
        "·Mme Laurence Locca, adjointe à la directrice de l'autonomie à l'Agence régionale de santé (ARS) de Normandie, M. Antoine Rosier, médecin coordonnateur du Centre de ressources pour l'autisme de Haute-Normandie (CRAHN), et M. Jérôme Dupont, pilote régional autisme ;",
        "·Mme Danièle Langloys, présidente d'Autisme France."
      ]
    },
    "resumeODJ": {
      "item": [
        "table ronde sur les méthodes d'intervention, les traitements et la prise en charge, avec :",
        "·M. Simon Kieffer, directeur des établissements et services médico-sociaux de la Caisse nationale de solidarité pour l’autonomie (CNSA), accompagné de Mme Anne Véber, chargée de mission autisme ;",
        "·Mme Garménick Leblanc, coordinatrice de la cellule médico-sociale, et M. Pierre Gabach, responsable du département des prestations et des maladies chroniques, direction déléguée à la gestion et à l'organisation des soins (DDGOS) de la Caisse nationale d'assurance maladie (CNAM) ;",
        "·Mme Laurence Locca, adjointe à la directrice de l'autonomie à l'Agence régionale de santé (ARS) de Normandie, M. Antoine Rosier, médecin coordonnateur du Centre de ressources pour l'autisme de Haute-Normandie (CRAHN), et M. Jérôme Dupont, pilote régional autisme ;",
        "·Mme Danièle Langloys, présidente d'Autisme France."
      ]
    },
    "pointsODJ": null
  },
  "compteRenduRef": null
}