{
  "uid": "RUANR5L15S2018IDF0104230",
  "timeStampDebut": "2018-02-13T17:00:00.000+01:00",
  "timeStampFin": "2018-02-13T18:00:00.000+01:00",
  "lieu": {
    "code": "SALREU045",
    "libelleCourt": "Sully 3",
    "libelleLong": "Sully 3, Palais Bourbon"
  },
  "cycleDeVie": {
    "etat": "Confirmé",
    "chrono": {
      "creation": "2018-01-23T15:25:38.000+01:00",
      "cloture": null
    }
  },
  "demandeurs": {
    "acteur": {
      "nom": "M. Sylvain MAILLARD",
      "acteurRef": "PA717379"
    }
  },
  "organeReuniRef": null,
  "typeReunion": "DEP",
  "@xmlns:xsi": "http://www.w3.org/2001/XMLSchema-instance"
}