{
  "uid": "RUANR5L15S2018IDF0106657",
  "timeStampDebut": "2018-03-05T09:15:00.000+01:00",
  "timeStampFin": "2018-03-05T10:30:00.000+01:00",
  "lieu": {
    "code": "SALREU029",
    "libelleCourt": "Salon Mars III",
    "libelleLong": "Salon Mars III, 101, rue de l'Université"
  },
  "cycleDeVie": {
    "etat": "Confirmé",
    "chrono": {
      "creation": "2018-02-26T18:08:02.000+01:00",
      "cloture": null
    }
  },
  "demandeurs": {
    "acteur": {
      "nom": "Mme Amal-Amélia LAKRAFI",
      "acteurRef": "PA721004"
    }
  },
  "organeReuniRef": null,
  "typeReunion": "DEP",
  "@xmlns:xsi": "http://www.w3.org/2001/XMLSchema-instance"
}