{
  "uid": "RUANR5L15S2018IDF0104688",
  "timeStampDebut": "2018-02-09T15:30:00.000+01:00",
  "timeStampFin": "2018-02-09T17:30:00.000+01:00",
  "lieu": {
    "code": "SALREU013",
    "libelleCourt": "Salle N° 3",
    "libelleLong": "Salle N° 3, 3, rue Aristide Briand"
  },
  "cycleDeVie": {
    "etat": "Confirmé",
    "chrono": {
      "creation": "2018-01-30T15:56:55.000+01:00",
      "cloture": null
    }
  },
  "demandeurs": {
    "acteur": {
      "nom": "Mme Frédérique DUMAS",
      "acteurRef": "PA721194"
    }
  },
  "organeReuniRef": null,
  "typeReunion": "DEP",
  "@xmlns:xsi": "http://www.w3.org/2001/XMLSchema-instance"
}