{
  "uid": "RUANR5L14S2017IDF0095897",
  "timeStampDebut": "2017-09-25T08:30:00.000+02:00",
  "timeStampFin": "2017-09-25T12:00:00.000+02:00",
  "lieu": {
    "code": "SALREU016",
    "libelleCourt": "Salon Gabriel",
    "libelleLong": "Salon Gabriel, 101, rue de l'Université"
  },
  "cycleDeVie": {
    "etat": "Confirmé",
    "chrono": {
      "creation": "2017-09-08T10:38:54.000+02:00",
      "cloture": null
    }
  },
  "demandeurs": {
    "acteur": {
      "nom": "M. Saïd AHAMADA",
      "acteurRef": "PA718954"
    }
  },
  "organeReuniRef": null,
  "typeReunion": "DEP",
  "@xmlns:xsi": "http://www.w3.org/2001/XMLSchema-instance"
}