{
  "uid": "RUANR5L15S2018IDF0105887",
  "timeStampDebut": "2018-03-07T14:00:00.000+01:00",
  "timeStampFin": "2018-03-07T15:00:00.000+01:00",
  "lieu": {
    "code": "SALREU045",
    "libelleCourt": "Sully 3",
    "libelleLong": "Sully 3, Palais Bourbon"
  },
  "cycleDeVie": {
    "etat": "Confirmé",
    "chrono": {
      "creation": "2018-02-15T14:17:14.000+01:00",
      "cloture": null
    }
  },
  "demandeurs": {
    "acteur": {
      "nom": "Mme Véronique RIOTTON",
      "acteurRef": "PA721426"
    }
  },
  "organeReuniRef": null,
  "typeReunion": "DEP",
  "@xmlns:xsi": "http://www.w3.org/2001/XMLSchema-instance"
}