{
  "uid": "RUANR5L15S2018IDC428283",
  "timeStampDebut": "2018-02-08T09:30:00.000+01:00",
  "lieu": {
    "libelleLong": "salle 4203 (33 rue Saint-Dominique)"
  },
  "cycleDeVie": {
    "etat": "Confirmé",
    "chrono": {
      "creation": "2018-01-16T00:00:00.000+01:00",
      "cloture": null
    }
  },
  "organeReuniRef": "PO744207",
  "@xmlns:xsi": "http://www.w3.org/2001/XMLSchema-instance",
  "demandeur": null,
  "participants": {
    "participantsInternes": null,
    "personnesAuditionnees": null
  },
  "sessionRef": null,
  "ouverturePresse": "false",
  "ODJ": {
    "convocationODJ": {
      "item": "– Audition de M. François Légué, sous-directeur du développement à la Direction du développement durable, au Ministère de l’Europe et des affaires étrangères."
    },
    "resumeODJ": {
      "item": "audition de M. François Légué, sous-directeur du développement à la direction du développement durable, au ministère de l’Europe et des affaires étrangères."
    },
    "pointsODJ": null
  },
  "compteRenduRef": null
}