{
  "uid": "RUANR5L15S2018IDF0106184",
  "timeStampDebut": "2018-02-20T18:00:00.000+01:00",
  "timeStampFin": "2018-02-20T19:30:00.000+01:00",
  "lieu": {
    "code": "SALREU044",
    "libelleCourt": "Sully 2",
    "libelleLong": "Sully 2, Palais Bourbon"
  },
  "cycleDeVie": {
    "etat": "Confirmé",
    "chrono": {
      "creation": "2018-02-19T17:46:45.000+01:00",
      "cloture": null
    }
  },
  "demandeurs": {
    "acteur": {
      "nom": "M. Jean-Claude LECLABART",
      "acteurRef": "PA722228"
    }
  },
  "organeReuniRef": null,
  "typeReunion": "DEP",
  "@xmlns:xsi": "http://www.w3.org/2001/XMLSchema-instance"
}