{
  "uid": "RUANR5L14S2018IDF0097138",
  "timeStampDebut": "2017-10-03T18:30:00.000+02:00",
  "timeStampFin": "2017-10-03T20:00:00.000+02:00",
  "lieu": {
    "code": "SALREU016",
    "libelleCourt": "Salon Gabriel",
    "libelleLong": "Salon Gabriel, 101, rue de l'Université"
  },
  "cycleDeVie": {
    "etat": "Confirmé",
    "chrono": {
      "creation": "2017-09-27T11:07:25.000+02:00",
      "cloture": null
    }
  },
  "demandeurs": {
    "acteur": {
      "nom": "M. Arnaud VIALA",
      "acteurRef": "PA709315"
    }
  },
  "organeReuniRef": null,
  "typeReunion": "DEP",
  "@xmlns:xsi": "http://www.w3.org/2001/XMLSchema-instance"
}