{
  "uid": "RUANR5L14S2018IDF0098081",
  "timeStampDebut": "2017-10-11T14:00:00.000+02:00",
  "timeStampFin": "2017-10-11T15:00:00.000+02:00",
  "lieu": {
    "code": "SALREU038",
    "libelleCourt": "Salle 6549",
    "libelleLong": "Salle 6549, Palais Bourbon"
  },
  "cycleDeVie": {
    "etat": "Confirmé",
    "chrono": {
      "creation": "2017-10-05T16:00:25.000+02:00",
      "cloture": null
    }
  },
  "demandeurs": {
    "acteur": {
      "nom": "Mme Marie-Ange MAGNE",
      "acteurRef": "PA722244"
    }
  },
  "organeReuniRef": null,
  "typeReunion": "DEP",
  "@xmlns:xsi": "http://www.w3.org/2001/XMLSchema-instance"
}