{
  "uid": "RUANR5L14S2018IDF0101349",
  "timeStampDebut": "2017-11-30T11:00:00.000+01:00",
  "timeStampFin": "2017-11-30T12:00:00.000+01:00",
  "lieu": {
    "code": "SALREU021",
    "libelleCourt": "Salle 7207",
    "libelleLong": "Salle 7207, 101, rue de l'Université"
  },
  "cycleDeVie": {
    "etat": "Confirmé",
    "chrono": {
      "creation": "2017-11-24T09:14:53.000+01:00",
      "cloture": null
    }
  },
  "demandeurs": {
    "acteur": {
      "nom": "M. Jean-Luc LAGLEIZE",
      "acteurRef": "PA719504"
    }
  },
  "organeReuniRef": null,
  "typeReunion": "DEP",
  "@xmlns:xsi": "http://www.w3.org/2001/XMLSchema-instance"
}