{
  "uid": "RUANR5L14S2017IDF0094363",
  "timeStampDebut": "2017-07-26T12:15:00.000+02:00",
  "timeStampFin": "2017-07-26T13:30:00.000+02:00",
  "lieu": {
    "code": "SALREU007",
    "libelleCourt": "4ème Bureau",
    "libelleLong": "4ème Bureau, Palais Bourbon"
  },
  "cycleDeVie": {
    "etat": "Annulé",
    "chrono": {
      "creation": "2017-07-19T15:59:02.000+02:00",
      "cloture": "2017-07-25T15:59:10.000+02:00"
    }
  },
  "demandeurs": {
    "acteur": {
      "nom": "M. Jacques SAVATIER",
      "acteurRef": "PA722078"
    }
  },
  "organeReuniRef": null,
  "typeReunion": "DEP",
  "@xmlns:xsi": "http://www.w3.org/2001/XMLSchema-instance"
}