{
  "uid": "RUANR5L14S2018IDF0094681",
  "timeStampDebut": "2017-12-20T14:00:00.000+01:00",
  "timeStampFin": "2017-12-20T15:00:00.000+01:00",
  "lieu": {
    "code": "SALREU028",
    "libelleCourt": "Salle Colbert",
    "libelleLong": "Salle Colbert , Palais Bourbon"
  },
  "cycleDeVie": {
    "etat": "Annulé",
    "chrono": {
      "creation": "2017-07-24T14:57:37.000+01:00",
      "cloture": "2017-12-14T18:00:35.000+01:00"
    }
  },
  "demandeurs": {
    "organe": {
      "nom": "GROUPE LA RÉPUBLIQUE EN MARCHE",
      "organeRef": "PO730964"
    }
  },
  "organeReuniRef": "PO730964",
  "typeReunion": "GP"
}