{
  "uid": "RUANR5L14S2018IDF0101331",
  "timeStampDebut": "2017-12-13T08:30:00.000+01:00",
  "timeStampFin": "2017-12-13T10:30:00.000+01:00",
  "lieu": {
    "code": "SALREU013",
    "libelleCourt": "Salle N° 3",
    "libelleLong": "Salle N° 3, 3, rue Aristide Briand"
  },
  "cycleDeVie": {
    "etat": "Confirmé",
    "chrono": {
      "creation": "2017-11-23T16:58:36.000+01:00",
      "cloture": null
    }
  },
  "demandeurs": {
    "organe": {
      "nom": "Groupe d'amitié France-Moldavie",
      "organeRef": "PO733587"
    }
  },
  "organeReuniRef": "PO733587",
  "typeReunion": "GA",
  "@xmlns:xsi": "http://www.w3.org/2001/XMLSchema-instance"
}