{
  "uid": "RUANR5L14S2018IDF0093545",
  "timeStampDebut": "2017-12-26T10:45:00.000+01:00",
  "timeStampFin": "2017-12-26T11:15:00.000+01:00",
  "lieu": {
    "code": "SALREU027",
    "libelleCourt": "Salle 6217",
    "libelleLong": "Salle 6217, Palais Bourbon"
  },
  "cycleDeVie": {
    "etat": "Annulé",
    "chrono": {
      "creation": "2017-07-06T11:38:31.000+01:00",
      "cloture": "2017-12-20T16:03:32.000+01:00"
    }
  },
  "demandeurs": {
    "organe": {
      "nom": "GROUPE LES RÉPUBLICAINS",
      "organeRef": "PO730934"
    }
  },
  "organeReuniRef": "PO730934",
  "typeReunion": "GP"
}