{
  "uid": "RUANR5L15S2018IDC428112",
  "timeStampDebut": "2017-12-20T11:00:00.000+01:00",
  "lieu": {
    "libelleLong": "salle 6350"
  },
  "cycleDeVie": {
    "etat": "Supprimé",
    "chrono": {
      "creation": "2017-12-11T00:00:00.000+01:00",
      "cloture": "2017-12-15T00:00:00.000+01:00"
    }
  },
  "organeReuniRef": "PO744107",
  "@xmlns:xsi": "http://www.w3.org/2001/XMLSchema-instance",
  "demandeur": null,
  "participants": {
    "participantsInternes": null,
    "personnesAuditionnees": null
  },
  "sessionRef": null,
  "ouverturePresse": "true",
  "ODJ": {
    "convocationODJ": {
      "item": "Audition, ouverte à la presse, de M. Bruno Parent, directeur général de la Direction générale des Finances publiques (DGFip) (à confirmer)"
    },
    "resumeODJ": {
      "item": "audition, ouverte à la presse, de M. Bruno Parent, directeur général de la Direction générale des Finances publiques (DGFip) (à confirmer)."
    },
    "pointsODJ": {
      "pointODJ": {
        "@xsi:type": "podjReunion_type",
        "uid": "RUANR5L15S2018IDC428112PT25319",
        "cycleDeVie": {
          "etat": "Supprimé",
          "chrono": {
            "creation": "2017-12-13T00:00:00.000+01:00",
            "cloture": "2017-12-15T00:00:00.000+01:00"
          }
        },
        "objet": "Audition, ouverte à la presse, de M. Bruno Parent, directeur général de la Direction générale des Finances publiques (DGFip) (à confirmer)",
        "demandeurPoint": null,
        "procedure": null,
        "dossiersLegislatifsRefs": null,
        "typePointODJ": "Audition",
        "comiteSecret": "false",
        "textesAssocies": null
      }
    }
  },
  "compteRenduRef": null
}