{
  "uid": "RUANR5L14S2018IDF0101539",
  "timeStampDebut": "2017-12-14T08:00:00.000+01:00",
  "timeStampFin": "2017-12-14T10:00:00.000+01:00",
  "lieu": {
    "code": "SALREU007",
    "libelleCourt": "4ème Bureau",
    "libelleLong": "4ème Bureau, Palais Bourbon"
  },
  "cycleDeVie": {
    "etat": "Annulé",
    "chrono": {
      "creation": "2017-11-28T17:21:09.000+01:00",
      "cloture": "2017-12-08T11:55:33.000+01:00"
    }
  },
  "demandeurs": {
    "acteur": {
      "nom": "Mme Barbara POMPILI",
      "acteurRef": "PA609520"
    }
  },
  "organeReuniRef": null,
  "typeReunion": "DEP",
  "@xmlns:xsi": "http://www.w3.org/2001/XMLSchema-instance"
}