{
  "uid": "RUANR5L15S2018IDF0104478",
  "timeStampDebut": "2018-01-30T11:00:00.000+01:00",
  "timeStampFin": "2018-01-30T12:00:00.000+01:00",
  "lieu": {
    "code": "SALREU038",
    "libelleCourt": "Salle 6549",
    "libelleLong": "Salle 6549, Palais Bourbon"
  },
  "cycleDeVie": {
    "etat": "Confirmé",
    "chrono": {
      "creation": "2018-01-26T16:52:35.000+01:00",
      "cloture": null
    }
  },
  "demandeurs": {
    "acteur": {
      "nom": "M. Christophe EUZET",
      "acteurRef": "PA719616"
    }
  },
  "organeReuniRef": null,
  "typeReunion": "DEP",
  "@xmlns:xsi": "http://www.w3.org/2001/XMLSchema-instance"
}