{
  "uid": "RUANR5L15S2018IDF0102255",
  "timeStampDebut": "2018-01-31T11:30:00.000+01:00",
  "timeStampFin": "2018-01-31T13:00:00.000+01:00",
  "lieu": {
    "code": "SALREU008",
    "libelleCourt": "5ème Bureau",
    "libelleLong": "5ème Bureau, Palais Bourbon"
  },
  "cycleDeVie": {
    "etat": "Confirmé",
    "chrono": {
      "creation": "2017-12-13T12:05:30.000+01:00",
      "cloture": null
    }
  },
  "demandeurs": {
    "acteur": {
      "nom": "M. Florent BOUDIÉ",
      "acteurRef": "PA606507"
    }
  },
  "organeReuniRef": null,
  "typeReunion": "DEP",
  "@xmlns:xsi": "http://www.w3.org/2001/XMLSchema-instance"
}