{
  "uid": "RUANR5L14S2017IDF0093447",
  "timeStampDebut": "2017-07-12T17:00:00.000+02:00",
  "timeStampFin": "2017-07-12T20:00:00.000+02:00",
  "lieu": {
    "code": "SALREU039",
    "libelleCourt": "Salle 6550",
    "libelleLong": "Salle 6550, Palais Bourbon"
  },
  "cycleDeVie": {
    "etat": "Confirmé",
    "chrono": {
      "creation": "2017-07-04T16:23:03.000+02:00",
      "cloture": null
    }
  },
  "demandeurs": {
    "acteur": {
      "nom": "Mme Yaël BRAUN-PIVET",
      "acteurRef": "PA721908"
    }
  },
  "organeReuniRef": null,
  "typeReunion": "DEP",
  "@xmlns:xsi": "http://www.w3.org/2001/XMLSchema-instance"
}