{
  "uid": "RUANR5L14S2018IDF0097836",
  "timeStampDebut": "2017-10-26T15:00:00.000+02:00",
  "timeStampFin": "2017-10-26T16:00:00.000+02:00",
  "lieu": {
    "code": "SALREU049",
    "libelleCourt": "Salle 6822",
    "libelleLong": "Salle 6822, Palais Bourbon"
  },
  "cycleDeVie": {
    "etat": "Confirmé",
    "chrono": {
      "creation": "2017-10-03T12:32:04.000+02:00",
      "cloture": null
    }
  },
  "demandeurs": {
    "acteur": {
      "nom": "Mme Constance LE GRIP",
      "acteurRef": "PA345722"
    }
  },
  "organeReuniRef": null,
  "typeReunion": "DEP",
  "@xmlns:xsi": "http://www.w3.org/2001/XMLSchema-instance"
}