{
  "uid": "RUANR5L14S2017IDF0094290",
  "timeStampDebut": "2017-07-26T16:30:00.000+02:00",
  "timeStampFin": "2017-07-26T20:00:00.000+02:00",
  "lieu": {
    "code": "SALREU007",
    "libelleCourt": "4ème Bureau",
    "libelleLong": "4ème Bureau, Palais Bourbon"
  },
  "cycleDeVie": {
    "etat": "Confirmé",
    "chrono": {
      "creation": "2017-07-18T10:39:54.000+02:00",
      "cloture": null
    }
  },
  "demandeurs": {
    "acteur": {
      "nom": "Mme Carole BUREAU-BONNARD",
      "acteurRef": "PA720622"
    }
  },
  "organeReuniRef": null,
  "typeReunion": "DEP",
  "@xmlns:xsi": "http://www.w3.org/2001/XMLSchema-instance"
}