{
  "uid": "RUANR5L15S2018IDC427841",
  "timeStampDebut": "2017-11-29T16:30:00.000+01:00",
  "timeStampFin": "2017-11-29T18:00:00.000+01:00",
  "lieu": {
    "libelleLong": "6e Bureau"
  },
  "cycleDeVie": {
    "etat": "Confirmé",
    "chrono": {
      "creation": "2017-11-16T00:00:00.000+01:00",
      "cloture": null
    }
  },
  "organeReuniRef": "PO419610",
  "@xmlns:xsi": "http://www.w3.org/2001/XMLSchema-instance",
  "demandeur": null,
  "participants": {
    "participantsInternes": {
      "participantInterne": [
        {
          "acteurRef": "PA722038",
          "presence": "absent"
        },
        {
          "acteurRef": "PA721278",
          "presence": "absent"
        },
        {
          "acteurRef": "PA335999",
          "presence": "absent"
        },
        {
          "acteurRef": "PA342415",
          "presence": "absent"
        },
        {
          "acteurRef": "PA722170",
          "presence": "présent"
        },
        {
          "acteurRef": "PA332228",
          "presence": "absent"
        },
        {
          "acteurRef": "PA718876",
          "presence": "absent"
        },
        {
          "acteurRef": "PA722312",
          "presence": "présent"
        },
        {
          "acteurRef": "PA718990",
          "presence": "présent"
        },
        {
          "acteurRef": "PA608641",
          "presence": "présent"
        },
        {
          "acteurRef": "PA720162",
          "presence": "absent"
        },
        {
          "acteurRef": "PA642695",
          "presence": "absent"
        },
        {
          "acteurRef": "PA336316",
          "presence": "excusé"
        },
        {
          "acteurRef": "PA720546",
          "presence": "absent"
        },
        {
          "acteurRef": "PA767",
          "presence": "absent"
        },
        {
          "acteurRef": "PA720814",
          "presence": "présent"
        },
        {
          "acteurRef": "PA719440",
          "presence": "absent"
        },
        {
          "acteurRef": "PA267429",
          "presence": "excusé"
        },
        {
          "acteurRef": "PA721808",
          "presence": "présent"
        },
        {
          "acteurRef": "PA607155",
          "presence": "absent"
        },
        {
          "acteurRef": "PA267450",
          "presence": "présent"
        },
        {
          "acteurRef": "PA719258",
          "presence": "absent"
        },
        {
          "acteurRef": "PA719830",
          "presence": "absent"
        },
        {
          "acteurRef": "PA720598",
          "presence": "présent"
        },
        {
          "acteurRef": "PA720386",
          "presence": "absent"
        },
        {
          "acteurRef": "PA712015",
          "presence": "absent"
        },
        {
          "acteurRef": "PA721718",
          "presence": "absent"
        },
        {
          "acteurRef": "PA719660",
          "presence": "présent"
        },
        {
          "acteurRef": "PA607193",
          "presence": "excusé"
        },
        {
          "acteurRef": "PA720664",
          "presence": "absent"
        },
        {
          "acteurRef": "PA334149",
          "presence": "absent"
        },
        {
          "acteurRef": "PA719960",
          "presence": "excusé"
        },
        {
          "acteurRef": "PA721384",
          "presence": "absent"
        },
        {
          "acteurRef": "PA719652",
          "presence": "présent"
        },
        {
          "acteurRef": "PA722094",
          "presence": "absent"
        },
        {
          "acteurRef": "PA267355",
          "presence": "absent"
        },
        {
          "acteurRef": "PA719700",
          "presence": "absent"
        },
        {
          "acteurRef": "PA722202",
          "presence": "absent"
        },
        {
          "acteurRef": "PA719372",
          "presence": "absent"
        },
        {
          "acteurRef": "PA719504",
          "presence": "absent"
        },
        {
          "acteurRef": "PA331567",
          "presence": "absent"
        },
        {
          "acteurRef": "PA719310",
          "presence": "absent"
        },
        {
          "acteurRef": "PA721852",
          "presence": "absent"
        },
        {
          "acteurRef": "PA340853",
          "presence": "excusé"
        },
        {
          "acteurRef": "PA719388",
          "presence": "absent"
        },
        {
          "acteurRef": "PA721134",
          "presence": "présent"
        },
        {
          "acteurRef": "PA337483",
          "presence": "absent"
        },
        {
          "acteurRef": "PA719858",
          "presence": "présent"
        },
        {
          "acteurRef": "PA720378",
          "presence": "présent"
        },
        {
          "acteurRef": "PA719154",
          "presence": "présent"
        },
        {
          "acteurRef": "PA720976",
          "presence": "absent"
        },
        {
          "acteurRef": "PA719338",
          "presence": "absent"
        },
        {
          "acteurRef": "PA719608",
          "presence": "excusé"
        },
        {
          "acteurRef": "PA719242",
          "presence": "absent"
        },
        {
          "acteurRef": "PA719520",
          "presence": "présent"
        },
        {
          "acteurRef": "PA720644",
          "presence": "absent"
        },
        {
          "acteurRef": "PA720108",
          "presence": "absent"
        },
        {
          "acteurRef": "PA718784",
          "presence": "présent"
        },
        {
          "acteurRef": "PA718930",
          "presence": "présent"
        },
        {
          "acteurRef": "PA607553",
          "presence": "présent"
        },
        {
          "acteurRef": "PA720590",
          "presence": "absent"
        },
        {
          "acteurRef": "PA720092",
          "presence": "absent"
        },
        {
          "acteurRef": "PA266808",
          "presence": "absent"
        },
        {
          "acteurRef": "PA722142",
          "presence": "absent"
        },
        {
          "acteurRef": "PA721110",
          "presence": "absent"
        },
        {
          "acteurRef": "PA720780",
          "presence": "absent"
        },
        {
          "acteurRef": "PA719420",
          "presence": "absent"
        },
        {
          "acteurRef": "PA334654",
          "presence": "absent"
        },
        {
          "acteurRef": "PA2792",
          "presence": "excusé"
        },
        {
          "acteurRef": "PA718860",
          "presence": "excusé"
        },
        {
          "acteurRef": "PA720014",
          "presence": "absent"
        },
        {
          "acteurRef": "PA722162",
          "presence": "absent"
        },
        {
          "acteurRef": "PA421348",
          "presence": "absent"
        }
      ]
    },
    "personnesAuditionnees": null
  },
  "sessionRef": null,
  "ouverturePresse": "true",
  "ODJ": {
    "convocationODJ": {
      "item": "Audition de M. Christophe Itier, Haut-Commissaire à l’économie sociale et solidaire (ESS)"
    },
    "resumeODJ": {
      "item": "audition de M. Christophe Itier, Haut-Commissaire à l’économie sociale et solidaire (ESS)"
    },
    "pointsODJ": null
  },
  "compteRenduRef": "CRCANR5L15S2018PO419610N026"
}