{
  "uid": "RUANR5L15S2018IDF0103663",
  "timeStampDebut": "2018-02-06T17:00:00.000+01:00",
  "timeStampFin": "2018-02-06T18:30:00.000+01:00",
  "lieu": {
    "code": "SALREU016",
    "libelleCourt": "Salon Gabriel",
    "libelleLong": "Salon Gabriel, 101, rue de l'Université"
  },
  "cycleDeVie": {
    "etat": "Confirmé",
    "chrono": {
      "creation": "2018-01-16T15:02:10.000+01:00",
      "cloture": null
    }
  },
  "demandeurs": {
    "acteur": {
      "nom": "Mme Marie LEBEC",
      "acteurRef": "PA721852"
    }
  },
  "organeReuniRef": null,
  "typeReunion": "DEP",
  "@xmlns:xsi": "http://www.w3.org/2001/XMLSchema-instance"
}