{
  "uid": "RUANR5L14S2017IDF0094895",
  "timeStampDebut": "2017-07-31T13:00:00.000+02:00",
  "timeStampFin": "2017-07-31T18:00:00.000+02:00",
  "lieu": {
    "code": "SALREU042",
    "libelleCourt": "Salle 6566",
    "libelleLong": "Salle 6566, Palais Bourbon"
  },
  "cycleDeVie": {
    "etat": "Confirmé",
    "chrono": {
      "creation": "2017-07-31T11:23:23.000+02:00",
      "cloture": null
    }
  },
  "demandeurs": {
    "acteur": {
      "nom": "Mme Yaël BRAUN-PIVET",
      "acteurRef": "PA721908"
    }
  },
  "organeReuniRef": null,
  "typeReunion": "DEP",
  "@xmlns:xsi": "http://www.w3.org/2001/XMLSchema-instance"
}