{
  "uid": "RUANR5L15S2019IDF0105968",
  "timeStampDebut": "2018-11-29T09:00:00.000+01:00",
  "timeStampFin": "2018-11-29T17:00:00.000+01:00",
  "lieu": {
    "code": "SALREU004",
    "libelleCourt": "1er Bureau",
    "libelleLong": "1er Bureau, Palais Bourbon"
  },
  "cycleDeVie": {
    "etat": "Confirmé",
    "chrono": {
      "creation": "2018-02-16T10:44:02.000+01:00",
      "cloture": null
    }
  },
  "demandeurs": {
    "acteur": {
      "nom": "M. Sébastien NADOT",
      "acteurRef": "PA719464"
    }
  },
  "organeReuniRef": null,
  "typeReunion": "DEP",
  "@xmlns:xsi": "http://www.w3.org/2001/XMLSchema-instance"
}