{
  "uid": "RUANR5L14S2018IDF0098129",
  "timeStampDebut": "2017-10-26T09:30:00.000+02:00",
  "timeStampFin": "2017-10-26T12:30:00.000+02:00",
  "lieu": {
    "code": "SALREU041",
    "libelleCourt": "Sully 5",
    "libelleLong": "Sully 5, Palais Bourbon"
  },
  "cycleDeVie": {
    "etat": "Confirmé",
    "chrono": {
      "creation": "2017-10-06T10:52:41.000+02:00",
      "cloture": null
    }
  },
  "demandeurs": {
    "acteur": {
      "nom": "Mme Valérie LACROUTE",
      "acteurRef": "PA609245"
    }
  },
  "organeReuniRef": null,
  "typeReunion": "DEP",
  "@xmlns:xsi": "http://www.w3.org/2001/XMLSchema-instance"
}