{
  "uid": "RUANR5L15S2018IDF0105333",
  "timeStampDebut": "2018-03-08T09:00:00.000+01:00",
  "timeStampFin": "2018-03-08T12:00:00.000+01:00",
  "lieu": {
    "code": "SALREU012",
    "libelleCourt": "Salle N° 23",
    "libelleLong": "Salle N° 23, 3, rue Aristide Briand"
  },
  "cycleDeVie": {
    "etat": "Annulé",
    "chrono": {
      "creation": "2018-02-07T17:20:55.000+01:00",
      "cloture": "2018-02-15T0011:53.000+01:00"
    }
  },
  "demandeurs": {
    "acteur": {
      "nom": "M. Olivier VÉRAN",
      "acteurRef": "PA642788"
    }
  },
  "organeReuniRef": null,
  "typeReunion": "DEP",
  "@xmlns:xsi": "http://www.w3.org/2001/XMLSchema-instance"
}