{
  "uid": "RUANR5L14S2018IDF0098115",
  "timeStampDebut": "2017-11-07T16:15:00.000+01:00",
  "timeStampFin": "2017-11-07T18:15:00.000+01:00",
  "lieu": {
    "code": "SALREU015",
    "libelleCourt": "Salle 7044",
    "libelleLong": "Salle 7044, 103, rue de l'Université"
  },
  "cycleDeVie": {
    "etat": "Annulé",
    "chrono": {
      "creation": "2017-10-06T09:18:06.000+01:00",
      "cloture": "2017-11-03T10:56:55.000+01:00"
    }
  },
  "demandeurs": {
    "organe": {
      "nom": "Groupe d'amitié France-Estonie",
      "organeRef": "PO732969"
    }
  },
  "organeReuniRef": "PO732969",
  "typeReunion": "GA"
}