{
  "uid": "RUANR5L14S2018IDF0094510",
  "timeStampDebut": "2017-10-24T13:45:00.000+02:00",
  "timeStampFin": "2017-10-24T14:45:00.000+02:00",
  "lieu": {
    "code": "SALREU048",
    "libelleCourt": "Salle 6809",
    "libelleLong": "Salle 6809, Palais Bourbon"
  },
  "cycleDeVie": {
    "etat": "Annulé",
    "chrono": {
      "creation": "2017-07-21T18:04:09.000+02:00",
      "cloture": "2017-10-11T14:52:33.000+02:00"
    }
  },
  "demandeurs": {
    "organe": {
      "nom": "GROUPE DU MOUVEMENT DÉMOCRATE ET APPARENTÉS",
      "organeRef": "PO730970"
    }
  },
  "organeReuniRef": "PO730970",
  "typeReunion": "GP"
}