{
  "uid": "PO307800",
  "codeType": "ORGEXTPARL",
  "libelle": "Conseil d'administration de l'Institut national des hautes études de la sécurité et de la justice",
  "libelleEdition": "du conseil d'administration de l'Institut national des hautes études de sécurité et de justice",
  "libelleAbrege": "Hautes études de sécurité",
  "libelleAbrev": "202",
  "viMoDe": {},
  "regimeJuridique": "Article D. 123-18 du code de la sécurité intérieure",
  "siteInternet": "https://inhesj.fr/"
}