{
  "uid": "PO422492",
  "codeType": "CNPS",
  "libelle": "Commission spéciale chargée d'examiner la proposition de loi renforçant la protection des victimes et la prévention et la répression des violences faites aux femmes",
  "libelleEdition": "de la commission spéciale chargée d'examiner la proposition de loi renforçant la protection des victimes et la prévention et la répression des violences faites aux femmes",
  "libelleAbrege": "Commission spéciale violence faites aux femmes",
  "libelleAbrev": "CSFEMMES",
  "viMoDe": {
    "dateDebut": "2009-12-08T01:00:00.000+01:00",
    "dateFin": "2010-07-06T02:00:00.000+02:00"
  },
  "regime": "5ème République",
  "legislature": "13",
  "secretariat": {}
}