{
  "uid": "PO733452",
  "codeType": "GA",
  "libelle": "France-Tunisie",
  "libelleEdition": "de France-Tunisie",
  "libelleAbrege": "Tunisie",
  "libelleAbrev": "TUN",
  "viMoDe": {
    "dateAgrement": "2017-07-19T02:00:00.000+02:00"
  },
  "regime": "5ème République",
  "legislature": "15",
  "secretariat": {
    "secretaire01": "Mme Sylvie Malgouyard"
  },
  "listePays": [
    "GOP756540"
  ]
}