{
  "uid": "PO733282",
  "codeType": "GA",
  "libelle": "France-Guinée équatoriale",
  "libelleEdition": "de France-Guinée équatoriale",
  "libelleAbrege": "Guinée équatoriale",
  "libelleAbrev": "GUINEQ",
  "viMoDe": {
    "dateAgrement": "2017-07-19T02:00:00.000+02:00"
  },
  "regime": "5ème République",
  "legislature": "15",
  "secretariat": {
    "secretaire01": "M. Serge Ezdra"
  },
  "listePays": [
    "GOP756505"
  ]
}