{
  "uid": "PA2964",
  "etatCivil": {
    "ident": {
      "civ": "M.",
      "prenom": "Gaël",
      "nom": "Yanno",
      "alpha": "Yanno"
    },
    "infoNaissance": {
      "dateNais": "1961-07-02T01:00:00.000+01:00",
      "villeNais": "Nouméa",
      "depNais": "Nouvelle-Calédonie",
      "paysNais": "France"
    }
  },
  "profession": {
    "libelleCourant": "Commissaire aux comptes",
    "socProcInsee": {
      "catSocPro": "Professions libérales et assimilés",
      "famSocPro": "Cadres et professions intellectuelles supérieures"
    }
  },
  "adresses": [
    {
      "xsiType": "AdressePostale_Type",
      "uid": "AD387153",
      "type": "0",
      "typeLibelle": "Adresse officielle",
      "poids": "1",
      "intitule": "Assemblée nationale,",
      "numeroRue": "126",
      "nomRue": "Rue de l'Université,",
      "codePostal": "75355",
      "ville": "Paris 07 SP"
    },
    {
      "xsiType": "AdressePostale_Type",
      "uid": "AD389414",
      "type": "2",
      "typeLibelle": "Adresse publiée de circonscription",
      "poids": "21",
      "intitule": "Permanence parlementaire",
      "numeroRue": "13",
      "nomRue": "Rue de Sébastopol",
      "complementAdresse": "BP 306",
      "codePostal": "98845",
      "ville": "Nouméa cedex"
    },
    {
      "xsiType": "AdressePostale_Type",
      "uid": "AD389417",
      "type": "2",
      "typeLibelle": "Adresse publiée de circonscription",
      "poids": "22",
      "intitule": "Hôtel de ville",
      "numeroRue": "16",
      "nomRue": "Rue du général Mangin",
      "complementAdresse": "BP K1",
      "codePostal": "98849",
      "ville": "Nouméa cedex"
    },
    {
      "xsiType": "AdresseMail_Type",
      "uid": "AD391979",
      "type": "15",
      "typeLibelle": "Mèl",
      "valElec": "gyanno@assemblee-nationale.fr"
    }
  ],
  "mandats": [
    {
      "uid": "PM386575",
      "acteurRef": "PA2964",
      "legislature": "13",
      "typeOrgane": "ASSEMBLEE",
      "dateDebut": "2007-06-20T02:00:00.000+02:00",
      "dateFin": "2012-06-19T02:00:00.000+02:00",
      "preseance": "50",
      "nominPrincipale": "1",
      "infosQualite": {
        "codeQualite": "membre",
        "libQualite": "membre",
        "libQualiteSex": "membre"
      },
      "organesRefs": [
        "PO384266"
      ],
      "suppleant": {
        "dateDebut": "2007-06-20T02:00:00.000+02:00",
        "dateFin": "2012-06-19T02:00:00.000+02:00",
        "suppleantRef": "PA347588"
      },
      "election": {
        "lieu": {
          "region": "Nouvelle-Calédonie",
          "regionType": "Collectivités d'outre-mer et Nouvelle-Calédonie",
          "departement": "Nouvelle-Calédonie",
          "numDepartement": "988",
          "numCirco": "1"
        },
        "causeMandat": "élections générales",
        "refCirconscription": "PO384842"
      },
      "mandature": {
        "datePriseFonction": "2007-06-20T02:00:00.000+02:00",
        "causeFin": "Fin de législature",
        "premiereElection": "0"
      }
    },
    {
      "uid": "PM387732",
      "acteurRef": "PA2964",
      "legislature": "13",
      "typeOrgane": "GP",
      "dateDebut": "2007-06-20T02:00:00.000+02:00",
      "dateFin": "2007-06-26T02:00:00.000+02:00",
      "preseance": "28",
      "nominPrincipale": "1",
      "infosQualite": {
        "codeQualite": "Député non-inscrit",
        "libQualite": "Député non-inscrit",
        "libQualiteSex": "Député non-inscrit"
      },
      "organesRefs": [
        "PO387155"
      ]
    },
    {
      "uid": "PM390007",
      "acteurRef": "PA2964",
      "legislature": "13",
      "typeOrgane": "GP",
      "dateDebut": "2007-06-27T02:00:00.000+02:00",
      "datePublication": "2007-06-27T02:00:00.000+02:00",
      "dateFin": "2012-06-19T02:00:00.000+02:00",
      "preseance": "20",
      "nominPrincipale": "1",
      "infosQualite": {
        "codeQualite": "Membre",
        "libQualite": "Membre du",
        "libQualiteSex": "Membre du"
      },
      "organesRefs": [
        "PO389395"
      ]
    },
    {
      "uid": "PM390870",
      "acteurRef": "PA2964",
      "legislature": "13",
      "typeOrgane": "COMPER",
      "dateDebut": "2007-06-27T02:00:00.000+02:00",
      "datePublication": "2007-06-28T02:00:00.000+02:00",
      "dateFin": "2010-01-19T01:00:00.000+01:00",
      "preseance": "32",
      "nominPrincipale": "1",
      "infosQualite": {
        "codeQualite": "Membre",
        "libQualite": "Membre",
        "libQualiteSex": "Membre"
      },
      "organesRefs": [
        "PO59048"
      ]
    },
    {
      "uid": "PM402448",
      "acteurRef": "PA2964",
      "legislature": "13",
      "typeOrgane": "GA",
      "dateDebut": "2007-11-06T01:00:00.000+01:00",
      "dateFin": "2012-06-19T02:00:00.000+02:00",
      "preseance": "20",
      "nominPrincipale": "1",
      "infosQualite": {
        "codeQualite": "Membre",
        "libQualite": "Membre",
        "libQualiteSex": "Membre"
      },
      "organesRefs": [
        "PO392704"
      ]
    },
    {
      "uid": "PM402449",
      "acteurRef": "PA2964",
      "legislature": "13",
      "typeOrgane": "GA",
      "dateDebut": "2007-11-06T01:00:00.000+01:00",
      "dateFin": "2012-06-19T02:00:00.000+02:00",
      "preseance": "20",
      "nominPrincipale": "1",
      "infosQualite": {
        "codeQualite": "Membre",
        "libQualite": "Membre",
        "libQualiteSex": "Membre"
      },
      "organesRefs": [
        "PO393085"
      ]
    },
    {
      "uid": "PM402450",
      "acteurRef": "PA2964",
      "legislature": "13",
      "typeOrgane": "GA",
      "dateDebut": "2007-11-06T01:00:00.000+01:00",
      "dateFin": "2012-06-19T02:00:00.000+02:00",
      "preseance": "20",
      "nominPrincipale": "1",
      "infosQualite": {
        "codeQualite": "Membre",
        "libQualite": "Membre",
        "libQualiteSex": "Membre"
      },
      "organesRefs": [
        "PO393268"
      ]
    },
    {
      "uid": "PM402451",
      "acteurRef": "PA2964",
      "legislature": "13",
      "typeOrgane": "GA",
      "dateDebut": "2007-11-06T01:00:00.000+01:00",
      "dateFin": "2012-06-19T02:00:00.000+02:00",
      "preseance": "20",
      "nominPrincipale": "1",
      "infosQualite": {
        "codeQualite": "Membre",
        "libQualite": "Membre",
        "libQualiteSex": "Membre"
      },
      "organesRefs": [
        "PO393493"
      ]
    },
    {
      "uid": "PM406564",
      "acteurRef": "PA2964",
      "legislature": "13",
      "typeOrgane": "GE",
      "dateDebut": "2008-01-15T01:00:00.000+01:00",
      "dateFin": "2012-06-19T02:00:00.000+02:00",
      "preseance": "20",
      "nominPrincipale": "1",
      "infosQualite": {
        "codeQualite": "Membre",
        "libQualite": "Membre",
        "libQualiteSex": "Membre"
      },
      "organesRefs": [
        "PO402943"
      ]
    },
    {
      "uid": "PM408190",
      "acteurRef": "PA2964",
      "legislature": "13",
      "typeOrgane": "GE",
      "dateDebut": "2008-01-17T01:00:00.000+01:00",
      "dateFin": "2012-06-19T02:00:00.000+02:00",
      "preseance": "20",
      "nominPrincipale": "1",
      "infosQualite": {
        "codeQualite": "Membre",
        "libQualite": "Membre",
        "libQualiteSex": "Membre"
      },
      "organesRefs": [
        "PO403075"
      ]
    },
    {
      "uid": "PM409496",
      "acteurRef": "PA2964",
      "legislature": "13",
      "typeOrgane": "GE",
      "dateDebut": "2008-01-09T01:00:00.000+01:00",
      "dateFin": "2012-06-19T02:00:00.000+02:00",
      "preseance": "20",
      "nominPrincipale": "1",
      "infosQualite": {
        "codeQualite": "Membre",
        "libQualite": "Membre",
        "libQualiteSex": "Membre"
      },
      "organesRefs": [
        "PO403069"
      ]
    },
    {
      "uid": "PM409579",
      "acteurRef": "PA2964",
      "legislature": "13",
      "typeOrgane": "GE",
      "dateDebut": "2008-02-22T01:00:00.000+01:00",
      "dateFin": "2012-06-19T02:00:00.000+02:00",
      "preseance": "20",
      "nominPrincipale": "1",
      "infosQualite": {
        "codeQualite": "Membre",
        "libQualite": "Membre",
        "libQualiteSex": "Membre"
      },
      "organesRefs": [
        "PO403166"
      ]
    },
    {
      "uid": "PM412469",
      "acteurRef": "PA2964",
      "legislature": "13",
      "typeOrgane": "GE",
      "dateDebut": "2008-02-05T01:00:00.000+01:00",
      "dateFin": "2012-06-19T02:00:00.000+02:00",
      "preseance": "20",
      "nominPrincipale": "1",
      "infosQualite": {
        "codeQualite": "Membre",
        "libQualite": "Membre",
        "libQualiteSex": "Membre"
      },
      "organesRefs": [
        "PO403172"
      ]
    },
    {
      "uid": "PM416468",
      "acteurRef": "PA2964",
      "legislature": "13",
      "typeOrgane": "CNPS",
      "dateDebut": "2008-10-28T01:00:00.000+01:00",
      "datePublication": "2008-10-29T01:00:00.000+01:00",
      "dateFin": "2009-07-01T02:00:00.000+02:00",
      "preseance": "20",
      "nominPrincipale": "1",
      "infosQualite": {
        "codeQualite": "Membre",
        "libQualite": "Membre",
        "libQualiteSex": "Membre"
      },
      "organesRefs": [
        "PO416249"
      ]
    },
    {
      "uid": "PM419206",
      "acteurRef": "PA2964",
      "legislature": "13",
      "typeOrgane": "CMP",
      "dateDebut": "2009-04-29T02:00:00.000+02:00",
      "datePublication": "2009-04-30T02:00:00.000+02:00",
      "dateFin": "2009-05-14T02:00:00.000+02:00",
      "preseance": "20",
      "nominPrincipale": "1",
      "infosQualite": {
        "codeQualite": "Titulaire",
        "libQualite": "Membre titulaire",
        "libQualiteSex": "Membre titulaire"
      },
      "organesRefs": [
        "PO419120"
      ]
    },
    {
      "uid": "PM421256",
      "acteurRef": "PA2964",
      "legislature": "13",
      "typeOrgane": "CMP",
      "dateDebut": "2009-07-21T02:00:00.000+02:00",
      "datePublication": "2009-07-22T02:00:00.000+02:00",
      "dateFin": "2009-09-01T02:00:00.000+02:00",
      "preseance": "20",
      "nominPrincipale": "1",
      "infosQualite": {
        "codeQualite": "Titulaire",
        "libQualite": "Membre titulaire",
        "libQualiteSex": "Membre titulaire"
      },
      "organesRefs": [
        "PO421243"
      ]
    },
    {
      "uid": "PM421283",
      "acteurRef": "PA2964",
      "legislature": "13",
      "typeOrgane": "CMP",
      "dateDebut": "2009-07-21T02:00:00.000+02:00",
      "datePublication": "2009-07-22T02:00:00.000+02:00",
      "dateFin": "2009-09-01T02:00:00.000+02:00",
      "preseance": "20",
      "nominPrincipale": "1",
      "infosQualite": {
        "codeQualite": "Titulaire",
        "libQualite": "Membre titulaire",
        "libQualiteSex": "Membre titulaire"
      },
      "organesRefs": [
        "PO421237"
      ]
    },
    {
      "uid": "PM422823",
      "acteurRef": "PA2964",
      "legislature": "13",
      "typeOrgane": "COMPER",
      "dateDebut": "2010-01-20T01:00:00.000+01:00",
      "datePublication": "2010-01-20T01:00:00.000+01:00",
      "dateFin": "2010-01-20T01:00:00.000+01:00",
      "preseance": "32",
      "nominPrincipale": "1",
      "infosQualite": {
        "codeQualite": "Membre",
        "libQualite": "Membre",
        "libQualiteSex": "Membre"
      },
      "organesRefs": [
        "PO420120"
      ]
    },
    {
      "uid": "PM422834",
      "acteurRef": "PA2964",
      "legislature": "13",
      "typeOrgane": "COMPER",
      "dateDebut": "2010-01-21T01:00:00.000+01:00",
      "datePublication": "2010-01-21T01:00:00.000+01:00",
      "dateFin": "2010-05-04T02:00:00.000+02:00",
      "preseance": "32",
      "nominPrincipale": "1",
      "infosQualite": {
        "codeQualite": "Membre",
        "libQualite": "Membre",
        "libQualiteSex": "Membre"
      },
      "organesRefs": [
        "PO59048"
      ]
    },
    {
      "uid": "PM423875",
      "acteurRef": "PA2964",
      "legislature": "13",
      "typeOrgane": "COMPER",
      "dateDebut": "2010-05-05T02:00:00.000+02:00",
      "datePublication": "2010-05-05T02:00:00.000+02:00",
      "dateFin": "2010-05-06T02:00:00.000+02:00",
      "preseance": "32",
      "nominPrincipale": "1",
      "infosQualite": {
        "codeQualite": "Membre",
        "libQualite": "Membre",
        "libQualiteSex": "Membre"
      },
      "organesRefs": [
        "PO59046"
      ]
    },
    {
      "uid": "PM423921",
      "acteurRef": "PA2964",
      "legislature": "13",
      "typeOrgane": "COMPER",
      "dateDebut": "2010-05-07T02:00:00.000+02:00",
      "datePublication": "2010-05-07T02:00:00.000+02:00",
      "dateFin": "2012-02-24T01:00:00.000+01:00",
      "preseance": "32",
      "nominPrincipale": "1",
      "infosQualite": {
        "codeQualite": "Membre",
        "libQualite": "Membre",
        "libQualiteSex": "Membre"
      },
      "organesRefs": [
        "PO59048"
      ]
    },
    {
      "uid": "PM425997",
      "acteurRef": "PA2964",
      "legislature": "13",
      "typeOrgane": "ORGEXTPARL",
      "dateDebut": "2010-11-23T01:00:00.000+01:00",
      "datePublication": "2010-12-07T01:00:00.000+01:00",
      "dateFin": "2012-06-19T02:00:00.000+02:00",
      "preseance": "20",
      "nominPrincipale": "1",
      "infosQualite": {
        "codeQualite": "Titulaire",
        "libQualite": "Membre titulaire",
        "libQualiteSex": "Membre titulaire"
      },
      "organesRefs": [
        "PO425985"
      ]
    },
    {
      "uid": "PM515628",
      "acteurRef": "PA2964",
      "legislature": "13",
      "typeOrgane": "COMPER",
      "dateDebut": "2012-02-25T01:00:00.000+01:00",
      "datePublication": "2012-02-25T01:00:00.000+01:00",
      "dateFin": "2012-03-01T01:00:00.000+01:00",
      "preseance": "32",
      "nominPrincipale": "1",
      "infosQualite": {
        "codeQualite": "Membre",
        "libQualite": "Membre",
        "libQualiteSex": "Membre"
      },
      "organesRefs": [
        "PO419604"
      ]
    },
    {
      "uid": "PM521391",
      "acteurRef": "PA2964",
      "legislature": "13",
      "typeOrgane": "COMPER",
      "dateDebut": "2012-03-02T01:00:00.000+01:00",
      "datePublication": "2012-03-02T01:00:00.000+01:00",
      "dateFin": "2012-06-19T02:00:00.000+02:00",
      "preseance": "32",
      "nominPrincipale": "1",
      "infosQualite": {
        "codeQualite": "Membre",
        "libQualite": "Membre",
        "libQualiteSex": "Membre"
      },
      "organesRefs": [
        "PO59048"
      ]
    }
  ]
}