{
  "uid": "PA337483",
  "etatCivil": {
    "ident": {
      "civ": "M.",
      "prenom": "Serge",
      "nom": "Letchimy",
      "alpha": "Letchimy",
      "trigramme": "SLE"
    },
    "infoNaissance": {
      "dateNais": "1953-01-13T01:00:00.000+01:00",
      "villeNais": "Gros Morne",
      "depNais": "Martinique",
      "paysNais": "France"
    }
  },
  "profession": {
    "libelleCourant": "Urbaniste",
    "socProcInsee": {
      "catSocPro": "Cadres d'entreprise",
      "famSocPro": "Cadres et professions intellectuelles supérieures"
    }
  },
  "uriHatvp": "https://www.hatvp.fr/pages_nominatives/letchimy-serge",
  "adresses": [
    {
      "xsiType": "AdressePostale_Type",
      "uid": "AD387139",
      "type": "0",
      "typeLibelle": "Adresse officielle",
      "poids": "1",
      "intitule": "Assemblée nationale,",
      "numeroRue": "126",
      "nomRue": "Rue de l'Université,",
      "codePostal": "75355",
      "ville": "Paris 07 SP"
    },
    {
      "xsiType": "AdresseMail_Type",
      "uid": "AD392078",
      "type": "15",
      "typeLibelle": "Mèl",
      "valElec": "serge.letchimy@assemblee-nationale.fr"
    }
  ],
  "mandats": [
    {
      "uid": "PM386365",
      "acteurRef": "PA337483",
      "legislature": "13",
      "typeOrgane": "ASSEMBLEE",
      "dateDebut": "2007-06-20T02:00:00.000+02:00",
      "dateFin": "2012-06-19T02:00:00.000+02:00",
      "preseance": "50",
      "nominPrincipale": "1",
      "infosQualite": {
        "codeQualite": "membre",
        "libQualite": "membre",
        "libQualiteSex": "membre"
      },
      "organesRefs": [
        "PO384266"
      ],
      "suppleant": {
        "dateDebut": "2007-06-20T02:00:00.000+02:00",
        "dateFin": "2012-06-19T02:00:00.000+02:00",
        "suppleantRef": "PA347477"
      },
      "election": {
        "lieu": {
          "region": "Martinique",
          "regionType": "Dom",
          "departement": "Martinique",
          "numDepartement": "972",
          "numCirco": "3"
        },
        "causeMandat": "élections générales",
        "refCirconscription": "PO384828"
      },
      "mandature": {
        "datePriseFonction": "2007-06-20T02:00:00.000+02:00",
        "causeFin": "Fin de législature",
        "premiereElection": "0",
        "placeHemicycle": "501"
      }
    },
    {
      "uid": "PM387718",
      "acteurRef": "PA337483",
      "legislature": "13",
      "typeOrgane": "GP",
      "dateDebut": "2007-06-20T02:00:00.000+02:00",
      "dateFin": "2007-06-26T02:00:00.000+02:00",
      "preseance": "28",
      "nominPrincipale": "1",
      "infosQualite": {
        "codeQualite": "Député non-inscrit",
        "libQualite": "Député non-inscrit",
        "libQualiteSex": "Député non-inscrit"
      },
      "organesRefs": [
        "PO387155"
      ]
    },
    {
      "uid": "PM390021",
      "acteurRef": "PA337483",
      "legislature": "13",
      "typeOrgane": "GP",
      "dateDebut": "2007-06-27T02:00:00.000+02:00",
      "datePublication": "2007-06-27T02:00:00.000+02:00",
      "dateFin": "2012-06-19T02:00:00.000+02:00",
      "preseance": "24",
      "nominPrincipale": "1",
      "infosQualite": {
        "codeQualite": "Membre apparenté",
        "libQualite": "Apparenté au",
        "libQualiteSex": "Apparenté au"
      },
      "organesRefs": [
        "PO389507"
      ]
    },
    {
      "uid": "PM390610",
      "acteurRef": "PA337483",
      "legislature": "13",
      "typeOrgane": "COMPER",
      "dateDebut": "2007-06-27T02:00:00.000+02:00",
      "datePublication": "2007-06-28T02:00:00.000+02:00",
      "dateFin": "2009-06-30T02:00:00.000+02:00",
      "preseance": "32",
      "nominPrincipale": "1",
      "infosQualite": {
        "codeQualite": "Membre",
        "libQualite": "Membre",
        "libQualiteSex": "Membre"
      },
      "organesRefs": [
        "PO277060"
      ]
    },
    {
      "uid": "PM393576",
      "acteurRef": "PA337483",
      "legislature": "13",
      "typeOrgane": "CNPS",
      "dateDebut": "2007-07-24T02:00:00.000+02:00",
      "datePublication": "2007-07-24T02:00:00.000+02:00",
      "dateFin": "2007-08-02T02:00:00.000+02:00",
      "preseance": "20",
      "nominPrincipale": "1",
      "infosQualite": {
        "codeQualite": "Membre",
        "libQualite": "Membre",
        "libQualiteSex": "Membre"
      },
      "organesRefs": [
        "PO392640"
      ]
    },
    {
      "uid": "PM403906",
      "acteurRef": "PA337483",
      "legislature": "13",
      "typeOrgane": "GA",
      "dateDebut": "2007-11-21T01:00:00.000+01:00",
      "dateFin": "2012-06-19T02:00:00.000+02:00",
      "preseance": "20",
      "nominPrincipale": "1",
      "infosQualite": {
        "codeQualite": "Membre",
        "libQualite": "Membre",
        "libQualiteSex": "Membre"
      },
      "organesRefs": [
        "PO392785"
      ]
    },
    {
      "uid": "PM403907",
      "acteurRef": "PA337483",
      "legislature": "13",
      "typeOrgane": "GA",
      "dateDebut": "2007-11-21T01:00:00.000+01:00",
      "dateFin": "2012-06-19T02:00:00.000+02:00",
      "preseance": "20",
      "nominPrincipale": "1",
      "infosQualite": {
        "codeQualite": "Membre",
        "libQualite": "Membre",
        "libQualiteSex": "Membre"
      },
      "organesRefs": [
        "PO392910"
      ]
    },
    {
      "uid": "PM403908",
      "acteurRef": "PA337483",
      "legislature": "13",
      "typeOrgane": "GA",
      "dateDebut": "2007-11-21T01:00:00.000+01:00",
      "dateFin": "2012-06-19T02:00:00.000+02:00",
      "preseance": "20",
      "nominPrincipale": "1",
      "infosQualite": {
        "codeQualite": "Membre",
        "libQualite": "Membre",
        "libQualiteSex": "Membre"
      },
      "organesRefs": [
        "PO393080"
      ]
    },
    {
      "uid": "PM404068",
      "acteurRef": "PA337483",
      "legislature": "13",
      "typeOrgane": "GA",
      "dateDebut": "2007-11-23T01:00:00.000+01:00",
      "dateFin": "2012-06-19T02:00:00.000+02:00",
      "preseance": "20",
      "nominPrincipale": "1",
      "infosQualite": {
        "codeQualite": "Membre",
        "libQualite": "Membre",
        "libQualiteSex": "Membre"
      },
      "organesRefs": [
        "PO392885"
      ]
    },
    {
      "uid": "PM404071",
      "acteurRef": "PA337483",
      "legislature": "13",
      "typeOrgane": "GA",
      "dateDebut": "2007-11-23T01:00:00.000+01:00",
      "dateFin": "2012-06-19T02:00:00.000+02:00",
      "preseance": "8",
      "nominPrincipale": "1",
      "infosQualite": {
        "codeQualite": "Vice-Président",
        "libQualite": "Vice-Président",
        "libQualiteSex": "Vice-Président"
      },
      "organesRefs": [
        "PO392910"
      ]
    },
    {
      "uid": "PM405430",
      "acteurRef": "PA337483",
      "legislature": "13",
      "typeOrgane": "GA",
      "dateDebut": "2007-12-04T01:00:00.000+01:00",
      "dateFin": "2012-06-19T02:00:00.000+02:00",
      "preseance": "20",
      "nominPrincipale": "0",
      "infosQualite": {
        "codeQualite": "Membre",
        "libQualite": "Membre",
        "libQualiteSex": "Membre"
      },
      "organesRefs": [
        "PO392975"
      ]
    },
    {
      "uid": "PM405431",
      "acteurRef": "PA337483",
      "legislature": "13",
      "typeOrgane": "GA",
      "dateDebut": "2007-12-04T01:00:00.000+01:00",
      "dateFin": "2012-06-19T02:00:00.000+02:00",
      "preseance": "8",
      "nominPrincipale": "1",
      "infosQualite": {
        "codeQualite": "Vice-Président",
        "libQualite": "Vice-Président",
        "libQualiteSex": "Vice-Président"
      },
      "organesRefs": [
        "PO392975"
      ]
    },
    {
      "uid": "PM407632",
      "acteurRef": "PA337483",
      "legislature": "13",
      "typeOrgane": "GA",
      "dateDebut": "2008-01-24T01:00:00.000+01:00",
      "dateFin": "2012-06-19T02:00:00.000+02:00",
      "preseance": "20",
      "nominPrincipale": "1",
      "infosQualite": {
        "codeQualite": "Membre",
        "libQualite": "Membre",
        "libQualiteSex": "Membre"
      },
      "organesRefs": [
        "PO393040"
      ]
    },
    {
      "uid": "PM411232",
      "acteurRef": "PA337483",
      "legislature": "13",
      "typeOrgane": "GA",
      "dateDebut": "2008-03-26T01:00:00.000+01:00",
      "dateFin": "2012-06-19T02:00:00.000+02:00",
      "preseance": "8",
      "nominPrincipale": "1",
      "infosQualite": {
        "codeQualite": "Vice-Président",
        "libQualite": "Vice-Président",
        "libQualiteSex": "Vice-Président"
      },
      "organesRefs": [
        "PO392885"
      ]
    },
    {
      "uid": "PM418863",
      "acteurRef": "PA337483",
      "legislature": "13",
      "typeOrgane": "GE",
      "dateDebut": "2009-03-03T01:00:00.000+01:00",
      "dateFin": "2012-06-19T02:00:00.000+02:00",
      "preseance": "20",
      "nominPrincipale": "1",
      "infosQualite": {
        "codeQualite": "Membre",
        "libQualite": "Membre",
        "libQualiteSex": "Membre"
      },
      "organesRefs": [
        "PO416217"
      ]
    },
    {
      "uid": "PM420637",
      "acteurRef": "PA337483",
      "legislature": "13",
      "typeOrgane": "COMPER",
      "dateDebut": "2009-07-01T02:00:00.000+02:00",
      "datePublication": "2009-07-01T02:00:00.000+02:00",
      "dateFin": "2011-02-01T01:00:00.000+01:00",
      "preseance": "32",
      "nominPrincipale": "1",
      "infosQualite": {
        "codeQualite": "Membre",
        "libQualite": "Membre",
        "libQualiteSex": "Membre"
      },
      "organesRefs": [
        "PO419610"
      ]
    },
    {
      "uid": "PM426005",
      "acteurRef": "PA337483",
      "legislature": "13",
      "typeOrgane": "ORGEXTPARL",
      "dateDebut": "2010-11-23T01:00:00.000+01:00",
      "datePublication": "2010-12-07T01:00:00.000+01:00",
      "dateFin": "2012-06-19T02:00:00.000+02:00",
      "preseance": "30",
      "nominPrincipale": "1",
      "infosQualite": {
        "codeQualite": "Suppléant",
        "libQualite": "Membre suppléant",
        "libQualiteSex": "Membre suppléant"
      },
      "organesRefs": [
        "PO425985"
      ]
    },
    {
      "uid": "PM426874",
      "acteurRef": "PA337483",
      "legislature": "13",
      "typeOrgane": "COMPER",
      "dateDebut": "2011-02-02T01:00:00.000+01:00",
      "datePublication": "2011-02-02T01:00:00.000+01:00",
      "dateFin": "2011-02-18T01:00:00.000+01:00",
      "preseance": "32",
      "nominPrincipale": "1",
      "infosQualite": {
        "codeQualite": "Membre",
        "libQualite": "Membre",
        "libQualiteSex": "Membre"
      },
      "organesRefs": [
        "PO420120"
      ]
    },
    {
      "uid": "PM427433",
      "acteurRef": "PA337483",
      "legislature": "13",
      "typeOrgane": "COMPER",
      "dateDebut": "2011-02-19T01:00:00.000+01:00",
      "datePublication": "2011-02-19T01:00:00.000+01:00",
      "dateFin": "2011-06-20T02:00:00.000+02:00",
      "preseance": "32",
      "nominPrincipale": "1",
      "infosQualite": {
        "codeQualite": "Membre",
        "libQualite": "Membre",
        "libQualiteSex": "Membre"
      },
      "organesRefs": [
        "PO419610"
      ]
    },
    {
      "uid": "PM428990",
      "acteurRef": "PA337483",
      "legislature": "13",
      "typeOrgane": "COMPER",
      "dateDebut": "2011-06-21T02:00:00.000+02:00",
      "datePublication": "2011-06-21T02:00:00.000+02:00",
      "dateFin": "2011-06-30T02:00:00.000+02:00",
      "preseance": "32",
      "nominPrincipale": "1",
      "infosQualite": {
        "codeQualite": "Membre",
        "libQualite": "Membre",
        "libQualiteSex": "Membre"
      },
      "organesRefs": [
        "PO59051"
      ]
    },
    {
      "uid": "PM429176",
      "acteurRef": "PA337483",
      "legislature": "13",
      "typeOrgane": "COMPER",
      "dateDebut": "2011-07-01T02:00:00.000+02:00",
      "datePublication": "2011-07-01T02:00:00.000+02:00",
      "dateFin": "2011-12-06T01:00:00.000+01:00",
      "preseance": "32",
      "nominPrincipale": "1",
      "infosQualite": {
        "codeQualite": "Membre",
        "libQualite": "Membre",
        "libQualiteSex": "Membre"
      },
      "organesRefs": [
        "PO419610"
      ]
    },
    {
      "uid": "PM429253",
      "acteurRef": "PA337483",
      "legislature": "13",
      "typeOrgane": "CMP",
      "dateDebut": "2011-07-01T02:00:00.000+02:00",
      "datePublication": "2011-07-02T02:00:00.000+02:00",
      "dateFin": "2011-07-25T02:00:00.000+02:00",
      "preseance": "28",
      "nominPrincipale": "1",
      "infosQualite": {
        "codeQualite": "Suppléant",
        "libQualite": "Membre suppléant",
        "libQualiteSex": "Membre suppléant"
      },
      "organesRefs": [
        "PO429163"
      ]
    },
    {
      "uid": "PM429278",
      "acteurRef": "PA337483",
      "legislature": "13",
      "typeOrgane": "CMP",
      "dateDebut": "2011-07-01T02:00:00.000+02:00",
      "datePublication": "2011-07-02T02:00:00.000+02:00",
      "dateFin": "2011-07-25T02:00:00.000+02:00",
      "preseance": "28",
      "nominPrincipale": "1",
      "infosQualite": {
        "codeQualite": "Suppléant",
        "libQualite": "Membre suppléant",
        "libQualiteSex": "Membre suppléant"
      },
      "organesRefs": [
        "PO429180"
      ]
    },
    {
      "uid": "PM429311",
      "acteurRef": "PA337483",
      "legislature": "13",
      "typeOrgane": "CMP",
      "dateDebut": "2011-07-01T02:00:00.000+02:00",
      "datePublication": "2011-07-01T02:00:00.000+02:00",
      "dateFin": "2011-07-25T02:00:00.000+02:00",
      "preseance": "28",
      "nominPrincipale": "1",
      "infosQualite": {
        "codeQualite": "Suppléant",
        "libQualite": "Membre suppléant",
        "libQualiteSex": "Membre suppléant"
      },
      "organesRefs": [
        "PO429207"
      ]
    },
    {
      "uid": "PM439327",
      "acteurRef": "PA337483",
      "legislature": "13",
      "typeOrgane": "COMPER",
      "dateDebut": "2011-12-07T01:00:00.000+01:00",
      "datePublication": "2011-12-07T01:00:00.000+01:00",
      "dateFin": "2011-12-07T01:00:00.000+01:00",
      "preseance": "32",
      "nominPrincipale": "1",
      "infosQualite": {
        "codeQualite": "Membre",
        "libQualite": "Membre",
        "libQualiteSex": "Membre"
      },
      "organesRefs": [
        "PO419865"
      ]
    },
    {
      "uid": "PM440488",
      "acteurRef": "PA337483",
      "legislature": "13",
      "typeOrgane": "COMPER",
      "dateDebut": "2011-12-08T01:00:00.000+01:00",
      "datePublication": "2011-12-08T01:00:00.000+01:00",
      "dateFin": "2012-03-02T01:00:00.000+01:00",
      "preseance": "32",
      "nominPrincipale": "1",
      "infosQualite": {
        "codeQualite": "Membre",
        "libQualite": "Membre",
        "libQualiteSex": "Membre"
      },
      "organesRefs": [
        "PO419610"
      ]
    },
    {
      "uid": "PM491666",
      "acteurRef": "PA337483",
      "legislature": "13",
      "typeOrgane": "CMP",
      "dateDebut": "2012-01-30T01:00:00.000+01:00",
      "datePublication": "2012-01-31T01:00:00.000+01:00",
      "dateFin": "2012-02-13T01:00:00.000+01:00",
      "preseance": "20",
      "nominPrincipale": "1",
      "infosQualite": {
        "codeQualite": "Titulaire",
        "libQualite": "Membre titulaire",
        "libQualiteSex": "Membre titulaire"
      },
      "organesRefs": [
        "PO489394"
      ]
    },
    {
      "uid": "PM522544",
      "acteurRef": "PA337483",
      "legislature": "13",
      "typeOrgane": "COMPER",
      "dateDebut": "2012-03-03T01:00:00.000+01:00",
      "datePublication": "2012-03-03T01:00:00.000+01:00",
      "dateFin": "2012-03-07T01:00:00.000+01:00",
      "preseance": "32",
      "nominPrincipale": "1",
      "infosQualite": {
        "codeQualite": "Membre",
        "libQualite": "Membre",
        "libQualiteSex": "Membre"
      },
      "organesRefs": [
        "PO419865"
      ]
    },
    {
      "uid": "PM528216",
      "acteurRef": "PA337483",
      "legislature": "13",
      "typeOrgane": "COMPER",
      "dateDebut": "2012-03-09T01:00:00.000+01:00",
      "datePublication": "2012-03-09T01:00:00.000+01:00",
      "dateFin": "2012-06-19T02:00:00.000+02:00",
      "preseance": "32",
      "nominPrincipale": "1",
      "infosQualite": {
        "codeQualite": "Membre",
        "libQualite": "Membre",
        "libQualiteSex": "Membre"
      },
      "organesRefs": [
        "PO419610"
      ]
    },
    {
      "uid": "PM645265",
      "acteurRef": "PA337483",
      "legislature": "14",
      "typeOrgane": "ASSEMBLEE",
      "dateDebut": "2012-06-20T02:00:00.000+02:00",
      "dateFin": "2017-06-20T02:00:00.000+02:00",
      "preseance": "50",
      "nominPrincipale": "1",
      "infosQualite": {
        "codeQualite": "membre",
        "libQualite": "membre",
        "libQualiteSex": "membre"
      },
      "organesRefs": [
        "PO644420"
      ],
      "suppleant": {
        "dateDebut": "2012-06-20T02:00:00.000+02:00",
        "dateFin": "2017-06-20T02:00:00.000+02:00",
        "suppleantRef": "PA643153"
      },
      "election": {
        "lieu": {
          "region": "Martinique",
          "regionType": "Dom",
          "departement": "Martinique",
          "numDepartement": "972",
          "numCirco": "3"
        },
        "causeMandat": "élections générales",
        "refCirconscription": "PO644982"
      },
      "mandature": {
        "datePriseFonction": "2012-06-20T02:00:00.000+02:00",
        "causeFin": "Fin de législature",
        "premiereElection": "1",
        "placeHemicycle": "501"
      }
    },
    {
      "uid": "PM656318",
      "acteurRef": "PA337483",
      "legislature": "14",
      "typeOrgane": "GP",
      "dateDebut": "2012-06-26T02:00:00.000+02:00",
      "dateFin": "2016-05-24T02:00:00.000+02:00",
      "preseance": "24",
      "nominPrincipale": "1",
      "infosQualite": {
        "codeQualite": "Membre apparenté",
        "libQualite": "Apparenté au",
        "libQualiteSex": "Apparenté au"
      },
      "organesRefs": [
        "PO656002"
      ]
    },
    {
      "uid": "PM657560",
      "acteurRef": "PA337483",
      "legislature": "14",
      "typeOrgane": "COMPER",
      "dateDebut": "2012-06-28T02:00:00.000+02:00",
      "datePublication": "2012-06-28T02:00:00.000+02:00",
      "dateFin": "2014-02-11T01:00:00.000+01:00",
      "preseance": "32",
      "nominPrincipale": "1",
      "infosQualite": {
        "codeQualite": "Membre",
        "libQualite": "Membre",
        "libQualiteSex": "Membre"
      },
      "organesRefs": [
        "PO419610"
      ]
    },
    {
      "uid": "PM663991",
      "acteurRef": "PA337483",
      "legislature": "14",
      "typeOrgane": "DELEG",
      "dateDebut": "2012-07-04T02:00:00.000+02:00",
      "datePublication": "2012-07-04T02:00:00.000+02:00",
      "dateFin": "2014-10-27T01:00:00.000+01:00",
      "preseance": "20",
      "nominPrincipale": "1",
      "infosQualite": {
        "codeQualite": "Membre",
        "libQualite": "Membre",
        "libQualiteSex": "Membre"
      },
      "organesRefs": [
        "PO201269"
      ]
    },
    {
      "uid": "PM676999",
      "acteurRef": "PA337483",
      "legislature": "14",
      "typeOrgane": "DELEG",
      "dateDebut": "2012-07-25T02:00:00.000+02:00",
      "datePublication": "2012-07-25T02:00:00.000+02:00",
      "dateFin": "2017-06-20T02:00:00.000+02:00",
      "preseance": "20",
      "nominPrincipale": "0",
      "infosQualite": {
        "codeQualite": "Membre",
        "libQualite": "Membre",
        "libQualiteSex": "Membre"
      },
      "organesRefs": [
        "PO675659"
      ]
    },
    {
      "uid": "PM677052",
      "acteurRef": "PA337483",
      "legislature": "14",
      "typeOrgane": "DELEG",
      "dateDebut": "2012-07-25T02:00:00.000+02:00",
      "datePublication": "2012-07-25T02:00:00.000+02:00",
      "dateFin": "2017-06-20T02:00:00.000+02:00",
      "preseance": "21",
      "nominPrincipale": "0",
      "infosQualite": {
        "codeQualite": "Membre de droit",
        "libQualite": "Membre de droit",
        "libQualiteSex": "Membre de droit"
      },
      "organesRefs": [
        "PO675659"
      ]
    },
    {
      "uid": "PM677342",
      "acteurRef": "PA337483",
      "legislature": "14",
      "typeOrgane": "DELEG",
      "dateDebut": "2012-07-25T02:00:00.000+02:00",
      "datePublication": "2012-07-26T02:00:00.000+02:00",
      "dateFin": "2017-06-20T02:00:00.000+02:00",
      "preseance": "8",
      "nominPrincipale": "1",
      "infosQualite": {
        "codeQualite": "Vice-Président",
        "libQualite": "Vice-Président",
        "libQualiteSex": "Vice-Président"
      },
      "organesRefs": [
        "PO675659"
      ]
    },
    {
      "uid": "PM678634",
      "acteurRef": "PA337483",
      "legislature": "14",
      "typeOrgane": "GA",
      "dateDebut": "2012-09-26T02:00:00.000+02:00",
      "dateFin": "2017-06-20T02:00:00.000+02:00",
      "preseance": "20",
      "nominPrincipale": "0",
      "infosQualite": {
        "codeQualite": "Membre",
        "libQualite": "Membre",
        "libQualiteSex": "Membre"
      },
      "organesRefs": [
        "PO675740"
      ]
    },
    {
      "uid": "PM678635",
      "acteurRef": "PA337483",
      "legislature": "14",
      "typeOrgane": "GA",
      "dateDebut": "2012-09-26T02:00:00.000+02:00",
      "dateFin": "2017-06-20T02:00:00.000+02:00",
      "preseance": "1",
      "nominPrincipale": "1",
      "infosQualite": {
        "codeQualite": "Président",
        "libQualite": "Président",
        "libQualiteSex": "Président"
      },
      "organesRefs": [
        "PO675740"
      ]
    },
    {
      "uid": "PM682724",
      "acteurRef": "PA337483",
      "legislature": "14",
      "typeOrgane": "CMP",
      "dateDebut": "2012-10-18T02:00:00.000+02:00",
      "datePublication": "2012-10-24T02:00:00.000+02:00",
      "dateFin": "2012-11-15T01:00:00.000+01:00",
      "preseance": "20",
      "nominPrincipale": "1",
      "infosQualite": {
        "codeQualite": "Titulaire",
        "libQualite": "Membre titulaire",
        "libQualiteSex": "Membre titulaire"
      },
      "organesRefs": [
        "PO679789"
      ]
    },
    {
      "uid": "PM684784",
      "acteurRef": "PA337483",
      "legislature": "14",
      "typeOrgane": "MINISTERE",
      "dateDebut": "2012-11-12T01:00:00.000+01:00",
      "datePublication": "2012-11-13T01:00:00.000+01:00",
      "dateFin": "2013-05-11T02:00:00.000+02:00",
      "preseance": "1",
      "nominPrincipale": "1",
      "infosQualite": {
        "codeQualite": "en mission",
        "libQualite": "en mission",
        "libQualiteSex": "en mission"
      },
      "organesRefs": [
        "PO653326"
      ],
      "libelle": "Modalités d'une meilleure utilisation de l'article 349 du traité sur le fonctionnement de l'Union européenne"
    },
    {
      "uid": "PM685895",
      "acteurRef": "PA337483",
      "typeOrgane": "PARPOL",
      "dateDebut": "2012-12-01T01:00:00.000+01:00",
      "dateFin": "2017-06-20T02:00:00.000+02:00",
      "preseance": "5",
      "nominPrincipale": "1",
      "infosQualite": {
        "codeQualite": "Membre",
        "libQualite": "Membre",
        "libQualiteSex": "Membre"
      },
      "organesRefs": [
        "PO685893"
      ]
    },
    {
      "uid": "PM691746",
      "acteurRef": "PA337483",
      "legislature": "14",
      "typeOrgane": "GE",
      "dateDebut": "2013-02-19T01:00:00.000+01:00",
      "dateFin": "2017-06-20T02:00:00.000+02:00",
      "preseance": "20",
      "nominPrincipale": "1",
      "infosQualite": {
        "codeQualite": "Membre",
        "libQualite": "Membre",
        "libQualiteSex": "Membre"
      },
      "organesRefs": [
        "PO687381"
      ]
    },
    {
      "uid": "PM692581",
      "acteurRef": "PA337483",
      "legislature": "14",
      "typeOrgane": "GE",
      "dateDebut": "2013-03-05T01:00:00.000+01:00",
      "dateFin": "2017-06-20T02:00:00.000+02:00",
      "preseance": "20",
      "nominPrincipale": "1",
      "infosQualite": {
        "codeQualite": "Membre",
        "libQualite": "Membre",
        "libQualiteSex": "Membre"
      },
      "organesRefs": [
        "PO686301"
      ]
    },
    {
      "uid": "PM698320",
      "acteurRef": "PA337483",
      "legislature": "14",
      "typeOrgane": "GE",
      "dateDebut": "2013-11-06T01:00:00.000+01:00",
      "dateFin": "2017-06-20T02:00:00.000+02:00",
      "preseance": "20",
      "nominPrincipale": "1",
      "infosQualite": {
        "codeQualite": "Membre",
        "libQualite": "Membre",
        "libQualiteSex": "Membre"
      },
      "organesRefs": [
        "PO686406"
      ]
    },
    {
      "uid": "PM700080",
      "acteurRef": "PA337483",
      "legislature": "14",
      "typeOrgane": "COMPER",
      "dateDebut": "2014-02-12T01:00:00.000+01:00",
      "datePublication": "2014-02-13T01:00:00.000+01:00",
      "dateFin": "2014-02-12T01:00:00.000+01:00",
      "preseance": "32",
      "nominPrincipale": "1",
      "infosQualite": {
        "codeQualite": "Membre",
        "libQualite": "Membre",
        "libQualiteSex": "Membre"
      },
      "organesRefs": [
        "PO420120"
      ]
    },
    {
      "uid": "PM700127",
      "acteurRef": "PA337483",
      "legislature": "14",
      "typeOrgane": "COMPER",
      "dateDebut": "2014-02-13T01:00:00.000+01:00",
      "datePublication": "2014-02-13T01:00:00.000+01:00",
      "dateFin": "2014-06-23T02:00:00.000+02:00",
      "preseance": "32",
      "nominPrincipale": "1",
      "infosQualite": {
        "codeQualite": "Membre",
        "libQualite": "Membre",
        "libQualiteSex": "Membre"
      },
      "organesRefs": [
        "PO419610"
      ]
    },
    {
      "uid": "PM701944",
      "acteurRef": "PA337483",
      "legislature": "14",
      "typeOrgane": "COMPER",
      "dateDebut": "2014-06-24T02:00:00.000+02:00",
      "datePublication": "2014-06-24T02:00:00.000+02:00",
      "dateFin": "2014-06-26T02:00:00.000+02:00",
      "preseance": "32",
      "nominPrincipale": "1",
      "infosQualite": {
        "codeQualite": "Membre",
        "libQualite": "Membre",
        "libQualiteSex": "Membre"
      },
      "organesRefs": [
        "PO419865"
      ]
    },
    {
      "uid": "PM702044",
      "acteurRef": "PA337483",
      "legislature": "14",
      "typeOrgane": "COMPER",
      "dateDebut": "2014-06-27T02:00:00.000+02:00",
      "datePublication": "2014-06-27T02:00:00.000+02:00",
      "dateFin": "2015-07-06T02:00:00.000+02:00",
      "preseance": "32",
      "nominPrincipale": "1",
      "infosQualite": {
        "codeQualite": "Membre",
        "libQualite": "Membre",
        "libQualiteSex": "Membre"
      },
      "organesRefs": [
        "PO419610"
      ]
    },
    {
      "uid": "PM703051",
      "acteurRef": "PA337483",
      "legislature": "14",
      "typeOrgane": "CNPS",
      "dateDebut": "2014-09-02T02:00:00.000+02:00",
      "datePublication": "2014-09-03T02:00:00.000+02:00",
      "dateFin": "2015-08-18T02:00:00.000+02:00",
      "preseance": "20",
      "nominPrincipale": "1",
      "infosQualite": {
        "codeQualite": "Membre",
        "libQualite": "Membre",
        "libQualiteSex": "Membre"
      },
      "organesRefs": [
        "PO702808"
      ]
    },
    {
      "uid": "PM708858",
      "acteurRef": "PA337483",
      "legislature": "14",
      "typeOrgane": "COMPER",
      "dateDebut": "2015-07-07T02:00:00.000+02:00",
      "datePublication": "2015-07-07T02:00:00.000+02:00",
      "dateFin": "2015-07-07T02:00:00.000+02:00",
      "preseance": "32",
      "nominPrincipale": "1",
      "infosQualite": {
        "codeQualite": "Membre",
        "libQualite": "Membre",
        "libQualiteSex": "Membre"
      },
      "organesRefs": [
        "PO59051"
      ]
    },
    {
      "uid": "PM708861",
      "acteurRef": "PA337483",
      "legislature": "14",
      "typeOrgane": "COMPER",
      "dateDebut": "2015-07-08T02:00:00.000+02:00",
      "datePublication": "2015-07-08T02:00:00.000+02:00",
      "dateFin": "2015-11-09T01:00:00.000+01:00",
      "preseance": "32",
      "nominPrincipale": "1",
      "infosQualite": {
        "codeQualite": "Membre",
        "libQualite": "Membre",
        "libQualiteSex": "Membre"
      },
      "organesRefs": [
        "PO419610"
      ]
    },
    {
      "uid": "PM710022",
      "acteurRef": "PA337483",
      "legislature": "14",
      "typeOrgane": "COMPER",
      "dateDebut": "2015-11-10T01:00:00.000+01:00",
      "datePublication": "2015-11-10T01:00:00.000+01:00",
      "dateFin": "2015-11-10T01:00:00.000+01:00",
      "preseance": "32",
      "nominPrincipale": "1",
      "infosQualite": {
        "codeQualite": "Membre",
        "libQualite": "Membre",
        "libQualiteSex": "Membre"
      },
      "organesRefs": [
        "PO59051"
      ]
    },
    {
      "uid": "PM710041",
      "acteurRef": "PA337483",
      "legislature": "14",
      "typeOrgane": "COMPER",
      "dateDebut": "2015-11-11T01:00:00.000+01:00",
      "datePublication": "2015-11-11T01:00:00.000+01:00",
      "dateFin": "2015-11-16T01:00:00.000+01:00",
      "preseance": "32",
      "nominPrincipale": "1",
      "infosQualite": {
        "codeQualite": "Membre",
        "libQualite": "Membre",
        "libQualiteSex": "Membre"
      },
      "organesRefs": [
        "PO419610"
      ]
    },
    {
      "uid": "PM710157",
      "acteurRef": "PA337483",
      "legislature": "14",
      "typeOrgane": "COMPER",
      "dateDebut": "2015-11-17T01:00:00.000+01:00",
      "datePublication": "2015-11-17T01:00:00.000+01:00",
      "dateFin": "2015-11-17T01:00:00.000+01:00",
      "preseance": "32",
      "nominPrincipale": "1",
      "infosQualite": {
        "codeQualite": "Membre",
        "libQualite": "Membre",
        "libQualiteSex": "Membre"
      },
      "organesRefs": [
        "PO59051"
      ]
    },
    {
      "uid": "PM710207",
      "acteurRef": "PA337483",
      "legislature": "14",
      "typeOrgane": "COMPER",
      "dateDebut": "2015-11-18T01:00:00.000+01:00",
      "datePublication": "2015-11-18T01:00:00.000+01:00",
      "dateFin": "2016-03-01T01:00:00.000+01:00",
      "preseance": "32",
      "nominPrincipale": "1",
      "infosQualite": {
        "codeQualite": "Membre",
        "libQualite": "Membre",
        "libQualiteSex": "Membre"
      },
      "organesRefs": [
        "PO419610"
      ]
    },
    {
      "uid": "PM711685",
      "acteurRef": "PA337483",
      "legislature": "14",
      "typeOrgane": "COMPER",
      "dateDebut": "2016-03-02T01:00:00.000+01:00",
      "datePublication": "2016-03-02T01:00:00.000+01:00",
      "dateFin": "2016-03-02T01:00:00.000+01:00",
      "preseance": "32",
      "nominPrincipale": "1",
      "infosQualite": {
        "codeQualite": "Membre",
        "libQualite": "Membre",
        "libQualiteSex": "Membre"
      },
      "organesRefs": [
        "PO59051"
      ]
    },
    {
      "uid": "PM711697",
      "acteurRef": "PA337483",
      "legislature": "14",
      "typeOrgane": "COMPER",
      "dateDebut": "2016-03-03T01:00:00.000+01:00",
      "datePublication": "2016-03-03T01:00:00.000+01:00",
      "dateFin": "2016-03-15T01:00:00.000+01:00",
      "preseance": "32",
      "nominPrincipale": "1",
      "infosQualite": {
        "codeQualite": "Membre",
        "libQualite": "Membre",
        "libQualiteSex": "Membre"
      },
      "organesRefs": [
        "PO419610"
      ]
    },
    {
      "uid": "PM711912",
      "acteurRef": "PA337483",
      "legislature": "14",
      "typeOrgane": "COMPER",
      "dateDebut": "2016-03-16T01:00:00.000+01:00",
      "datePublication": "2016-03-16T01:00:00.000+01:00",
      "dateFin": "2016-03-24T01:00:00.000+01:00",
      "preseance": "32",
      "nominPrincipale": "1",
      "infosQualite": {
        "codeQualite": "Membre",
        "libQualite": "Membre",
        "libQualiteSex": "Membre"
      },
      "organesRefs": [
        "PO59051"
      ]
    },
    {
      "uid": "PM712120",
      "acteurRef": "PA337483",
      "legislature": "14",
      "typeOrgane": "COMPER",
      "dateDebut": "2016-03-25T01:00:00.000+01:00",
      "datePublication": "2016-03-25T01:00:00.000+01:00",
      "dateFin": "2016-03-24T01:00:00.000+01:00",
      "preseance": "32",
      "nominPrincipale": "1",
      "infosQualite": {
        "codeQualite": "Membre",
        "libQualite": "Membre",
        "libQualiteSex": "Membre"
      },
      "organesRefs": [
        "PO59051"
      ]
    },
    {
      "uid": "PM712124",
      "acteurRef": "PA337483",
      "legislature": "14",
      "typeOrgane": "COMPER",
      "dateDebut": "2016-03-25T01:00:00.000+01:00",
      "datePublication": "2016-03-25T01:00:00.000+01:00",
      "dateFin": "2016-07-12T02:00:00.000+02:00",
      "preseance": "32",
      "nominPrincipale": "1",
      "infosQualite": {
        "codeQualite": "Membre",
        "libQualite": "Membre",
        "libQualiteSex": "Membre"
      },
      "organesRefs": [
        "PO419610"
      ]
    },
    {
      "uid": "PM712718",
      "acteurRef": "PA337483",
      "legislature": "14",
      "typeOrgane": "CNPS",
      "dateDebut": "2016-05-05T02:00:00.000+02:00",
      "datePublication": "2016-05-05T02:00:00.000+02:00",
      "dateFin": "2017-02-20T01:00:00.000+01:00",
      "preseance": "20",
      "nominPrincipale": "1",
      "infosQualite": {
        "codeQualite": "Membre",
        "libQualite": "Membre",
        "libQualiteSex": "Membre"
      },
      "organesRefs": [
        "PO712376"
      ]
    },
    {
      "uid": "PM713367",
      "acteurRef": "PA337483",
      "legislature": "14",
      "typeOrgane": "GP",
      "dateDebut": "2016-05-25T02:00:00.000+02:00",
      "dateFin": "2017-06-20T02:00:00.000+02:00",
      "preseance": "24",
      "nominPrincipale": "1",
      "infosQualite": {
        "codeQualite": "Membre apparenté",
        "libQualite": "Apparenté au",
        "libQualiteSex": "Apparenté au"
      },
      "organesRefs": [
        "PO713077"
      ]
    },
    {
      "uid": "PM714321",
      "acteurRef": "PA337483",
      "legislature": "14",
      "typeOrgane": "COMPER",
      "dateDebut": "2016-07-13T02:00:00.000+02:00",
      "datePublication": "2016-07-13T02:00:00.000+02:00",
      "dateFin": "2016-07-13T02:00:00.000+02:00",
      "preseance": "32",
      "nominPrincipale": "1",
      "infosQualite": {
        "codeQualite": "Membre",
        "libQualite": "Membre",
        "libQualiteSex": "Membre"
      },
      "organesRefs": [
        "PO419604"
      ]
    },
    {
      "uid": "PM714365",
      "acteurRef": "PA337483",
      "legislature": "14",
      "typeOrgane": "COMPER",
      "dateDebut": "2016-07-14T02:00:00.000+02:00",
      "datePublication": "2016-07-14T02:00:00.000+02:00",
      "dateFin": "2017-06-20T02:00:00.000+02:00",
      "preseance": "32",
      "nominPrincipale": "1",
      "infosQualite": {
        "codeQualite": "Membre",
        "libQualite": "Membre",
        "libQualiteSex": "Membre"
      },
      "organesRefs": [
        "PO419610"
      ]
    },
    {
      "uid": "PM716702",
      "acteurRef": "PA337483",
      "legislature": "14",
      "typeOrgane": "CMP",
      "dateDebut": "2017-01-31T01:00:00.000+01:00",
      "datePublication": "2017-02-01T01:00:00.000+01:00",
      "dateFin": "2017-02-02T01:00:00.000+01:00",
      "preseance": "28",
      "nominPrincipale": "1",
      "infosQualite": {
        "codeQualite": "Suppléant",
        "libQualite": "Membre suppléant",
        "libQualiteSex": "Membre suppléant"
      },
      "organesRefs": [
        "PO716574"
      ]
    },
    {
      "uid": "PM723140",
      "acteurRef": "PA337483",
      "legislature": "15",
      "typeOrgane": "ASSEMBLEE",
      "dateDebut": "2017-06-18T02:00:00.000+02:00",
      "preseance": "50",
      "nominPrincipale": "1",
      "infosQualite": {
        "codeQualite": "membre",
        "libQualite": "membre",
        "libQualiteSex": "membre"
      },
      "organesRefs": [
        "PO717460"
      ],
      "suppleant": {
        "dateDebut": "2017-06-18T02:00:00.000+02:00",
        "suppleantRef": "PA721016"
      },
      "election": {
        "lieu": {
          "region": "Martinique",
          "regionType": "Dom",
          "departement": "Martinique",
          "numDepartement": "972",
          "numCirco": "3"
        },
        "causeMandat": "élections générales",
        "refCirconscription": "PO718536"
      },
      "mandature": {
        "datePriseFonction": "2017-06-21T02:00:00.000+02:00",
        "premiereElection": "1",
        "placeHemicycle": "501"
      },
      "collaborateurs": [
        {
          "qualite": "M.",
          "prenom": "Willy",
          "nom": "Beauvallet"
        },
        {
          "qualite": "Mme",
          "prenom": "Marie-Michèle",
          "nom": "Appoline-Darsières"
        },
        {
          "qualite": "M.",
          "prenom": "Mathieu",
          "nom": "Cordemy"
        },
        {
          "qualite": "M.",
          "prenom": "Gilles",
          "nom": "Delbois"
        },
        {
          "qualite": "Mme",
          "prenom": "Émilie Léa Marion",
          "nom": "Collas"
        }
      ]
    },
    {
      "uid": "PM724611",
      "acteurRef": "PA337483",
      "legislature": "15",
      "typeOrgane": "GP",
      "dateDebut": "2017-06-21T02:00:00.000+02:00",
      "dateFin": "2017-06-26T02:00:00.000+02:00",
      "preseance": "28",
      "nominPrincipale": "1",
      "infosQualite": {
        "codeQualite": "Député non-inscrit",
        "libQualite": "Député non-inscrit",
        "libQualiteSex": "Député non-inscrit"
      },
      "organesRefs": [
        "PO723569"
      ]
    },
    {
      "uid": "PM731511",
      "acteurRef": "PA337483",
      "legislature": "15",
      "typeOrgane": "GP",
      "dateDebut": "2017-06-27T02:00:00.000+02:00",
      "datePublication": "2017-06-28T02:00:00.000+02:00",
      "dateFin": "2018-09-11T02:00:00.000+02:00",
      "preseance": "24",
      "nominPrincipale": "1",
      "infosQualite": {
        "codeQualite": "Membre apparenté",
        "libQualite": "Apparenté au",
        "libQualiteSex": "Apparenté au"
      },
      "organesRefs": [
        "PO730946"
      ]
    },
    {
      "uid": "PM731899",
      "acteurRef": "PA337483",
      "legislature": "15",
      "typeOrgane": "COMPER",
      "dateDebut": "2017-06-29T02:00:00.000+02:00",
      "datePublication": "2017-06-29T02:00:00.000+02:00",
      "dateFin": "2017-12-12T01:00:00.000+01:00",
      "preseance": "32",
      "nominPrincipale": "1",
      "infosQualite": {
        "codeQualite": "Membre",
        "libQualite": "Membre",
        "libQualiteSex": "Membre"
      },
      "organesRefs": [
        "PO419610"
      ]
    },
    {
      "uid": "PM732535",
      "acteurRef": "PA337483",
      "legislature": "15",
      "typeOrgane": "DELEG",
      "dateDebut": "2017-07-12T02:00:00.000+02:00",
      "datePublication": "2017-07-12T02:00:00.000+02:00",
      "preseance": "20",
      "nominPrincipale": "1",
      "infosQualite": {
        "codeQualite": "Membre",
        "libQualite": "Membre",
        "libQualiteSex": "Membre"
      },
      "organesRefs": [
        "PO675659"
      ]
    },
    {
      "uid": "PM735067",
      "acteurRef": "PA337483",
      "legislature": "15",
      "typeOrgane": "ORGEXTPARL",
      "dateDebut": "2017-09-20T02:00:00.000+02:00",
      "datePublication": "2017-09-21T02:00:00.000+02:00",
      "preseance": "30",
      "nominPrincipale": "1",
      "infosQualite": {
        "codeQualite": "Suppléant",
        "libQualite": "Membre suppléant",
        "libQualiteSex": "Membre suppléant"
      },
      "organesRefs": [
        "PO60266"
      ]
    },
    {
      "uid": "PM737681",
      "acteurRef": "PA337483",
      "legislature": "15",
      "typeOrgane": "ORGEXTPARL",
      "dateDebut": "2017-10-04T02:00:00.000+02:00",
      "datePublication": "2017-10-05T02:00:00.000+02:00",
      "preseance": "20",
      "nominPrincipale": "1",
      "infosQualite": {
        "codeQualite": "Titulaire",
        "libQualite": "Membre titulaire",
        "libQualiteSex": "Membre titulaire"
      },
      "organesRefs": [
        "PO717440"
      ]
    },
    {
      "uid": "PM739025",
      "acteurRef": "PA337483",
      "legislature": "15",
      "typeOrgane": "GA",
      "dateDebut": "2017-10-11T02:00:00.000+02:00",
      "preseance": "20",
      "nominPrincipale": "1",
      "infosQualite": {
        "codeQualite": "Membre",
        "libQualite": "Membre",
        "libQualiteSex": "Membre"
      },
      "organesRefs": [
        "PO733467"
      ]
    },
    {
      "uid": "PM739026",
      "acteurRef": "PA337483",
      "legislature": "15",
      "typeOrgane": "GA",
      "dateDebut": "2017-10-11T02:00:00.000+02:00",
      "preseance": "20",
      "nominPrincipale": "1",
      "infosQualite": {
        "codeQualite": "Membre",
        "libQualite": "Membre",
        "libQualiteSex": "Membre"
      },
      "organesRefs": [
        "PO733522"
      ]
    },
    {
      "uid": "PM740754",
      "acteurRef": "PA337483",
      "legislature": "15",
      "typeOrgane": "ORGEXTPARL",
      "dateDebut": "2017-10-23T02:00:00.000+02:00",
      "datePublication": "2017-10-24T02:00:00.000+02:00",
      "preseance": "30",
      "nominPrincipale": "1",
      "infosQualite": {
        "codeQualite": "Suppléant",
        "libQualite": "Membre suppléant",
        "libQualiteSex": "Membre suppléant"
      },
      "organesRefs": [
        "PO425985"
      ]
    },
    {
      "uid": "PM742124",
      "acteurRef": "PA337483",
      "legislature": "15",
      "typeOrgane": "ORGAINT",
      "dateDebut": "2017-10-27T02:00:00.000+02:00",
      "datePublication": "2017-10-28T02:00:00.000+02:00",
      "preseance": "42",
      "nominPrincipale": "1",
      "infosQualite": {
        "codeQualite": "Membre",
        "libQualite": "Membre",
        "libQualiteSex": "Membre"
      },
      "organesRefs": [
        "PO201115"
      ]
    },
    {
      "uid": "PM742551",
      "acteurRef": "PA337483",
      "legislature": "15",
      "typeOrgane": "GEVI",
      "dateDebut": "2017-11-06T01:00:00.000+01:00",
      "dateFin": "2017-11-07T01:00:00.000+01:00",
      "preseance": "20",
      "nominPrincipale": "1",
      "infosQualite": {
        "codeQualite": "Membre",
        "libQualite": "Membre",
        "libQualiteSex": "Membre"
      },
      "organesRefs": [
        "PO733688"
      ]
    },
    {
      "uid": "PM743870",
      "acteurRef": "PA337483",
      "legislature": "15",
      "typeOrgane": "GEVI",
      "dateDebut": "2017-11-08T01:00:00.000+01:00",
      "preseance": "20",
      "nominPrincipale": "1",
      "infosQualite": {
        "codeQualite": "Membre",
        "libQualite": "Membre",
        "libQualiteSex": "Membre"
      },
      "organesRefs": [
        "PO743840"
      ]
    },
    {
      "uid": "PM745904",
      "acteurRef": "PA337483",
      "typeOrgane": "PARPOL",
      "dateDebut": "2017-12-01T01:00:00.000+01:00",
      "preseance": "5",
      "nominPrincipale": "1",
      "infosQualite": {
        "codeQualite": "Membre",
        "libQualite": "Membre",
        "libQualiteSex": "Membre"
      },
      "organesRefs": [
        "PO685893"
      ]
    },
    {
      "uid": "PM746331",
      "acteurRef": "PA337483",
      "legislature": "15",
      "typeOrgane": "COMPER",
      "dateDebut": "2017-12-13T01:00:00.000+01:00",
      "datePublication": "2017-12-13T01:00:00.000+01:00",
      "dateFin": "2017-12-14T01:00:00.000+01:00",
      "preseance": "32",
      "nominPrincipale": "1",
      "infosQualite": {
        "codeQualite": "Membre",
        "libQualite": "Membre",
        "libQualiteSex": "Membre"
      },
      "organesRefs": [
        "PO59051"
      ]
    },
    {
      "uid": "PM746439",
      "acteurRef": "PA337483",
      "legislature": "15",
      "typeOrgane": "COMPER",
      "dateDebut": "2017-12-15T01:00:00.000+01:00",
      "datePublication": "2017-12-15T01:00:00.000+01:00",
      "dateFin": "2018-01-10T01:00:00.000+01:00",
      "preseance": "32",
      "nominPrincipale": "1",
      "infosQualite": {
        "codeQualite": "Membre",
        "libQualite": "Membre",
        "libQualiteSex": "Membre"
      },
      "organesRefs": [
        "PO419610"
      ]
    },
    {
      "uid": "PM747578",
      "acteurRef": "PA337483",
      "legislature": "15",
      "typeOrgane": "COMPER",
      "dateDebut": "2018-01-10T01:00:00.000+01:00",
      "datePublication": "2018-01-10T01:00:00.000+01:00",
      "dateFin": "2018-01-18T01:00:00.000+01:00",
      "preseance": "32",
      "nominPrincipale": "1",
      "infosQualite": {
        "codeQualite": "Membre",
        "libQualite": "Membre",
        "libQualiteSex": "Membre"
      },
      "organesRefs": [
        "PO59051"
      ]
    },
    {
      "uid": "PM747743",
      "acteurRef": "PA337483",
      "legislature": "15",
      "typeOrgane": "COMPER",
      "dateDebut": "2018-01-19T01:00:00.000+01:00",
      "datePublication": "2018-01-19T01:00:00.000+01:00",
      "dateFin": "2018-02-19T01:00:00.000+01:00",
      "preseance": "32",
      "nominPrincipale": "1",
      "infosQualite": {
        "codeQualite": "Membre",
        "libQualite": "Membre",
        "libQualiteSex": "Membre"
      },
      "organesRefs": [
        "PO419610"
      ]
    },
    {
      "uid": "PM748535",
      "acteurRef": "PA337483",
      "legislature": "15",
      "typeOrgane": "GE",
      "dateDebut": "2018-02-01T01:00:00.000+01:00",
      "preseance": "20",
      "nominPrincipale": "0",
      "infosQualite": {
        "codeQualite": "Membre",
        "libQualite": "Membre",
        "libQualiteSex": "Membre"
      },
      "organesRefs": [
        "PO747251"
      ]
    },
    {
      "uid": "PM748537",
      "acteurRef": "PA337483",
      "legislature": "15",
      "typeOrgane": "GE",
      "dateDebut": "2018-02-01T01:00:00.000+01:00",
      "preseance": "4",
      "nominPrincipale": "1",
      "infosQualite": {
        "codeQualite": "Co-Président",
        "libQualite": "Co-Président",
        "libQualiteSex": "Co-Président"
      },
      "organesRefs": [
        "PO747251"
      ]
    },
    {
      "uid": "PM751049",
      "acteurRef": "PA337483",
      "legislature": "15",
      "typeOrgane": "COMPER",
      "dateDebut": "2018-02-20T01:00:00.000+01:00",
      "datePublication": "2018-02-20T01:00:00.000+01:00",
      "dateFin": "2018-02-20T01:00:00.000+01:00",
      "preseance": "32",
      "nominPrincipale": "1",
      "infosQualite": {
        "codeQualite": "Membre",
        "libQualite": "Membre",
        "libQualiteSex": "Membre"
      },
      "organesRefs": [
        "PO59048"
      ]
    },
    {
      "uid": "PM751230",
      "acteurRef": "PA337483",
      "legislature": "15",
      "typeOrgane": "COMPER",
      "dateDebut": "2018-02-21T01:00:00.000+01:00",
      "datePublication": "2018-02-21T01:00:00.000+01:00",
      "dateFin": "2018-11-27T01:00:00.000+01:00",
      "preseance": "32",
      "nominPrincipale": "1",
      "infosQualite": {
        "codeQualite": "Membre",
        "libQualite": "Membre",
        "libQualiteSex": "Membre"
      },
      "organesRefs": [
        "PO419610"
      ]
    },
    {
      "uid": "PM753069",
      "acteurRef": "PA337483",
      "legislature": "15",
      "typeOrgane": "GE",
      "dateDebut": "2018-03-08T01:00:00.000+01:00",
      "preseance": "20",
      "nominPrincipale": "0",
      "infosQualite": {
        "codeQualite": "Membre",
        "libQualite": "Membre",
        "libQualiteSex": "Membre"
      },
      "organesRefs": [
        "PO747027"
      ]
    },
    {
      "uid": "PM754076",
      "acteurRef": "PA337483",
      "legislature": "15",
      "typeOrgane": "GE",
      "dateDebut": "2018-03-21T01:00:00.000+01:00",
      "preseance": "8",
      "nominPrincipale": "1",
      "infosQualite": {
        "codeQualite": "Vice-Président",
        "libQualite": "Vice-Président",
        "libQualiteSex": "Vice-Président"
      },
      "organesRefs": [
        "PO747027"
      ]
    },
    {
      "uid": "PM758868",
      "acteurRef": "PA337483",
      "legislature": "15",
      "typeOrgane": "GP",
      "dateDebut": "2018-09-12T02:00:00.000+02:00",
      "preseance": "24",
      "nominPrincipale": "1",
      "infosQualite": {
        "codeQualite": "Membre apparenté",
        "libQualite": "Apparenté au",
        "libQualiteSex": "Apparenté au"
      },
      "organesRefs": [
        "PO758835"
      ]
    },
    {
      "uid": "PM758922",
      "acteurRef": "PA337483",
      "legislature": "15",
      "typeOrgane": "CMP",
      "dateDebut": "2018-09-13T02:00:00.000+02:00",
      "datePublication": "2018-09-14T02:00:00.000+02:00",
      "dateFin": "2018-09-17T02:00:00.000+02:00",
      "preseance": "28",
      "nominPrincipale": "1",
      "infosQualite": {
        "codeQualite": "Suppléant",
        "libQualite": "Membre suppléant",
        "libQualiteSex": "Membre suppléant"
      },
      "organesRefs": [
        "PO758352"
      ]
    },
    {
      "uid": "PM760697",
      "acteurRef": "PA337483",
      "legislature": "15",
      "typeOrgane": "COMPER",
      "dateDebut": "2018-11-28T01:00:00.000+01:00",
      "datePublication": "2018-11-28T01:00:00.000+01:00",
      "dateFin": "2018-12-05T01:00:00.000+01:00",
      "preseance": "32",
      "nominPrincipale": "1",
      "infosQualite": {
        "codeQualite": "Membre",
        "libQualite": "Membre",
        "libQualiteSex": "Membre"
      },
      "organesRefs": [
        "PO59051"
      ]
    },
    {
      "uid": "PM760819",
      "acteurRef": "PA337483",
      "legislature": "15",
      "typeOrgane": "COMPER",
      "dateDebut": "2018-12-06T01:00:00.000+01:00",
      "datePublication": "2018-12-06T01:00:00.000+01:00",
      "dateFin": "2018-12-10T01:00:00.000+01:00",
      "preseance": "32",
      "nominPrincipale": "1",
      "infosQualite": {
        "codeQualite": "Membre",
        "libQualite": "Membre",
        "libQualiteSex": "Membre"
      },
      "organesRefs": [
        "PO419610"
      ]
    },
    {
      "uid": "PM760900",
      "acteurRef": "PA337483",
      "legislature": "15",
      "typeOrgane": "COMPER",
      "dateDebut": "2018-12-11T01:00:00.000+01:00",
      "datePublication": "2018-12-11T01:00:00.000+01:00",
      "dateFin": "2018-12-12T01:00:00.000+01:00",
      "preseance": "32",
      "nominPrincipale": "1",
      "infosQualite": {
        "codeQualite": "Membre",
        "libQualite": "Membre",
        "libQualiteSex": "Membre"
      },
      "organesRefs": [
        "PO59051"
      ]
    },
    {
      "uid": "PM760964",
      "acteurRef": "PA337483",
      "legislature": "15",
      "typeOrgane": "COMPER",
      "dateDebut": "2018-12-13T01:00:00.000+01:00",
      "datePublication": "2018-12-13T01:00:00.000+01:00",
      "preseance": "32",
      "nominPrincipale": "1",
      "infosQualite": {
        "codeQualite": "Membre",
        "libQualite": "Membre",
        "libQualiteSex": "Membre"
      },
      "organesRefs": [
        "PO419610"
      ]
    }
  ]
}