{
  "uid": "PA1353",
  "etatCivil": {
    "ident": {
      "civ": "M.",
      "prenom": "Michel",
      "nom": "Françaix",
      "alpha": "Francaix"
    },
    "infoNaissance": {
      "dateNais": "1943-05-28T02:00:00.000+02:00",
      "villeNais": "Paris",
      "depNais": "Paris"
    }
  },
  "profession": {
    "libelleCourant": "Consultant en communication",
    "socProcInsee": {
      "catSocPro": "Cadres d'entreprise",
      "famSocPro": "Cadres et professions intellectuelles supérieures"
    }
  },
  "adresses": [
    {
      "xsiType": "AdressePostale_Type",
      "uid": "AD45394",
      "type": "2",
      "typeLibelle": "Adresse publiée de circonscription",
      "poids": "22",
      "intitule": "Hôtel de Ville,",
      "nomRue": "Place de la Mairie,",
      "complementAdresse": "BP 10110",
      "codePostal": "60230",
      "ville": "Chambly Cedex"
    },
    {
      "xsiType": "AdresseTelephonique_Type",
      "uid": "AD48006",
      "type": "11",
      "typeLibelle": "Téléphone",
      "poids": "22",
      "adresseDeRattachement": "AD45394",
      "valElec": "01 39 37 44 13"
    },
    {
      "xsiType": "AdresseTelephonique_Type",
      "uid": "AD49656",
      "type": "12",
      "typeLibelle": "Télécopie",
      "poids": "22",
      "adresseDeRattachement": "AD45394",
      "valElec": "01 72 72 96 12"
    },
    {
      "xsiType": "AdressePostale_Type",
      "uid": "AD386880",
      "type": "0",
      "typeLibelle": "Adresse officielle",
      "poids": "1",
      "intitule": "Assemblée nationale,",
      "numeroRue": "126",
      "nomRue": "Rue de l'Université,",
      "codePostal": "75355",
      "ville": "Paris 07 SP"
    },
    {
      "xsiType": "AdresseMail_Type",
      "uid": "AD391706",
      "type": "15",
      "typeLibelle": "Mèl",
      "valElec": "mfrancaix@assemblee-nationale.fr"
    },
    {
      "xsiType": "AdresseMail_Type",
      "uid": "AD645883",
      "type": "15",
      "typeLibelle": "Mèl",
      "valElec": "michel.francaix@ville-chambly.fr"
    }
  ],
  "mandats": [
    {
      "uid": "PM386221",
      "acteurRef": "PA1353",
      "legislature": "13",
      "typeOrgane": "ASSEMBLEE",
      "dateDebut": "2007-06-20T02:00:00.000+02:00",
      "dateFin": "2012-06-19T02:00:00.000+02:00",
      "preseance": "50",
      "nominPrincipale": "1",
      "infosQualite": {
        "codeQualite": "membre",
        "libQualite": "membre",
        "libQualiteSex": "membre"
      },
      "organesRefs": [
        "PO384266"
      ],
      "suppleant": {
        "dateDebut": "2007-06-20T02:00:00.000+02:00",
        "dateFin": "2012-06-19T02:00:00.000+02:00",
        "suppleantRef": "PA267948"
      },
      "election": {
        "lieu": {
          "region": "Hauts-de-France",
          "regionType": "Métropolitain",
          "departement": "Oise",
          "numDepartement": "60",
          "numCirco": "3"
        },
        "causeMandat": "élections générales",
        "refCirconscription": "PO384569"
      },
      "mandature": {
        "datePriseFonction": "2007-06-20T02:00:00.000+02:00",
        "causeFin": "Fin de législature",
        "premiereElection": "1"
      }
    },
    {
      "uid": "PM387459",
      "acteurRef": "PA1353",
      "legislature": "13",
      "typeOrgane": "GP",
      "dateDebut": "2007-06-20T02:00:00.000+02:00",
      "dateFin": "2007-06-26T02:00:00.000+02:00",
      "preseance": "28",
      "nominPrincipale": "1",
      "infosQualite": {
        "codeQualite": "Député non-inscrit",
        "libQualite": "Député non-inscrit",
        "libQualiteSex": "Député non-inscrit"
      },
      "organesRefs": [
        "PO387155"
      ]
    },
    {
      "uid": "PM390153",
      "acteurRef": "PA1353",
      "legislature": "13",
      "typeOrgane": "GP",
      "dateDebut": "2007-06-27T02:00:00.000+02:00",
      "datePublication": "2007-06-27T02:00:00.000+02:00",
      "dateFin": "2012-06-19T02:00:00.000+02:00",
      "preseance": "20",
      "nominPrincipale": "1",
      "infosQualite": {
        "codeQualite": "Membre",
        "libQualite": "Membre du",
        "libQualiteSex": "Membre du"
      },
      "organesRefs": [
        "PO389507"
      ]
    },
    {
      "uid": "PM390486",
      "acteurRef": "PA1353",
      "legislature": "13",
      "typeOrgane": "COMPER",
      "dateDebut": "2007-06-27T02:00:00.000+02:00",
      "datePublication": "2007-06-28T02:00:00.000+02:00",
      "dateFin": "2009-06-30T02:00:00.000+02:00",
      "preseance": "32",
      "nominPrincipale": "1",
      "infosQualite": {
        "codeQualite": "Membre",
        "libQualite": "Membre",
        "libQualiteSex": "Membre"
      },
      "organesRefs": [
        "PO59045"
      ]
    },
    {
      "uid": "PM393557",
      "acteurRef": "PA1353",
      "legislature": "13",
      "typeOrgane": "CNPS",
      "dateDebut": "2007-07-24T02:00:00.000+02:00",
      "datePublication": "2007-07-24T02:00:00.000+02:00",
      "dateFin": "2007-08-02T02:00:00.000+02:00",
      "preseance": "20",
      "nominPrincipale": "1",
      "infosQualite": {
        "codeQualite": "Membre",
        "libQualite": "Membre",
        "libQualiteSex": "Membre"
      },
      "organesRefs": [
        "PO392640"
      ]
    },
    {
      "uid": "PM394544",
      "acteurRef": "PA1353",
      "legislature": "13",
      "typeOrgane": "ORGEXTPARL",
      "dateDebut": "2007-08-01T02:00:00.000+02:00",
      "datePublication": "2007-08-02T02:00:00.000+02:00",
      "dateFin": "2012-05-14T02:00:00.000+02:00",
      "preseance": "20",
      "nominPrincipale": "1",
      "infosQualite": {
        "codeQualite": "Titulaire",
        "libQualite": "Membre titulaire",
        "libQualiteSex": "Membre titulaire"
      },
      "organesRefs": [
        "PO60272"
      ]
    },
    {
      "uid": "PM395340",
      "acteurRef": "PA1353",
      "legislature": "13",
      "typeOrgane": "GA",
      "dateDebut": "2007-09-07T02:00:00.000+02:00",
      "dateFin": "2012-06-19T02:00:00.000+02:00",
      "preseance": "20",
      "nominPrincipale": "1",
      "infosQualite": {
        "codeQualite": "Membre",
        "libQualite": "Membre",
        "libQualiteSex": "Membre"
      },
      "organesRefs": [
        "PO393438"
      ]
    },
    {
      "uid": "PM398302",
      "acteurRef": "PA1353",
      "legislature": "13",
      "typeOrgane": "GA",
      "dateDebut": "2007-10-11T02:00:00.000+02:00",
      "dateFin": "2012-06-19T02:00:00.000+02:00",
      "preseance": "20",
      "nominPrincipale": "0",
      "infosQualite": {
        "codeQualite": "Membre",
        "libQualite": "Membre",
        "libQualiteSex": "Membre"
      },
      "organesRefs": [
        "PO392975"
      ]
    },
    {
      "uid": "PM398311",
      "acteurRef": "PA1353",
      "legislature": "13",
      "typeOrgane": "GA",
      "dateDebut": "2007-10-11T02:00:00.000+02:00",
      "dateFin": "2012-06-19T02:00:00.000+02:00",
      "preseance": "1",
      "nominPrincipale": "1",
      "infosQualite": {
        "codeQualite": "Président",
        "libQualite": "Président",
        "libQualiteSex": "Président"
      },
      "organesRefs": [
        "PO392975"
      ]
    },
    {
      "uid": "PM401590",
      "acteurRef": "PA1353",
      "legislature": "13",
      "typeOrgane": "GA",
      "dateDebut": "2007-10-26T02:00:00.000+02:00",
      "dateFin": "2012-06-19T02:00:00.000+02:00",
      "preseance": "20",
      "nominPrincipale": "1",
      "infosQualite": {
        "codeQualite": "Membre",
        "libQualite": "Membre",
        "libQualiteSex": "Membre"
      },
      "organesRefs": [
        "PO393253"
      ]
    },
    {
      "uid": "PM401593",
      "acteurRef": "PA1353",
      "legislature": "13",
      "typeOrgane": "GA",
      "dateDebut": "2007-10-26T02:00:00.000+02:00",
      "dateFin": "2012-06-19T02:00:00.000+02:00",
      "preseance": "20",
      "nominPrincipale": "1",
      "infosQualite": {
        "codeQualite": "Membre",
        "libQualite": "Membre",
        "libQualiteSex": "Membre"
      },
      "organesRefs": [
        "PO393363"
      ]
    },
    {
      "uid": "PM401916",
      "acteurRef": "PA1353",
      "legislature": "13",
      "typeOrgane": "GA",
      "dateDebut": "2007-10-29T01:00:00.000+01:00",
      "dateFin": "2012-06-19T02:00:00.000+02:00",
      "preseance": "20",
      "nominPrincipale": "1",
      "infosQualite": {
        "codeQualite": "Membre",
        "libQualite": "Membre",
        "libQualiteSex": "Membre"
      },
      "organesRefs": [
        "PO393182"
      ]
    },
    {
      "uid": "PM403367",
      "acteurRef": "PA1353",
      "legislature": "13",
      "typeOrgane": "ORGAINT",
      "dateDebut": "2007-11-08T01:00:00.000+01:00",
      "datePublication": "2007-11-09T01:00:00.000+01:00",
      "dateFin": "2012-06-19T02:00:00.000+02:00",
      "preseance": "42",
      "nominPrincipale": "1",
      "infosQualite": {
        "codeQualite": "Membre",
        "libQualite": "Membre",
        "libQualiteSex": "Membre"
      },
      "organesRefs": [
        "PO201115"
      ]
    },
    {
      "uid": "PM404003",
      "acteurRef": "PA1353",
      "legislature": "13",
      "typeOrgane": "GE",
      "dateDebut": "2007-10-31T01:00:00.000+01:00",
      "dateFin": "2012-06-19T02:00:00.000+02:00",
      "preseance": "20",
      "nominPrincipale": "0",
      "infosQualite": {
        "codeQualite": "Membre",
        "libQualite": "Membre",
        "libQualiteSex": "Membre"
      },
      "organesRefs": [
        "PO403166"
      ]
    },
    {
      "uid": "PM404004",
      "acteurRef": "PA1353",
      "legislature": "13",
      "typeOrgane": "GE",
      "dateDebut": "2007-10-31T01:00:00.000+01:00",
      "dateFin": "2012-06-19T02:00:00.000+02:00",
      "preseance": "4",
      "nominPrincipale": "1",
      "infosQualite": {
        "codeQualite": "Co-Président",
        "libQualite": "Co-Président",
        "libQualiteSex": "Co-Président"
      },
      "organesRefs": [
        "PO403166"
      ]
    },
    {
      "uid": "PM404433",
      "acteurRef": "PA1353",
      "legislature": "13",
      "typeOrgane": "GA",
      "dateDebut": "2007-11-28T01:00:00.000+01:00",
      "dateFin": "2012-06-19T02:00:00.000+02:00",
      "preseance": "8",
      "nominPrincipale": "1",
      "infosQualite": {
        "codeQualite": "Vice-Président",
        "libQualite": "Vice-Président",
        "libQualiteSex": "Vice-Président"
      },
      "organesRefs": [
        "PO393363"
      ]
    },
    {
      "uid": "PM406354",
      "acteurRef": "PA1353",
      "legislature": "13",
      "typeOrgane": "GE",
      "dateDebut": "2008-01-11T01:00:00.000+01:00",
      "dateFin": "2012-06-19T02:00:00.000+02:00",
      "preseance": "20",
      "nominPrincipale": "1",
      "infosQualite": {
        "codeQualite": "Membre",
        "libQualite": "Membre",
        "libQualiteSex": "Membre"
      },
      "organesRefs": [
        "PO402776"
      ]
    },
    {
      "uid": "PM407436",
      "acteurRef": "PA1353",
      "legislature": "13",
      "typeOrgane": "GA",
      "dateDebut": "2007-12-11T01:00:00.000+01:00",
      "dateFin": "2012-06-19T02:00:00.000+02:00",
      "preseance": "8",
      "nominPrincipale": "1",
      "infosQualite": {
        "codeQualite": "Vice-Président",
        "libQualite": "Vice-Président",
        "libQualiteSex": "Vice-Président"
      },
      "organesRefs": [
        "PO393253"
      ]
    },
    {
      "uid": "PM408472",
      "acteurRef": "PA1353",
      "legislature": "13",
      "typeOrgane": "GE",
      "dateDebut": "2008-02-05T01:00:00.000+01:00",
      "dateFin": "2012-06-19T02:00:00.000+02:00",
      "preseance": "20",
      "nominPrincipale": "1",
      "infosQualite": {
        "codeQualite": "Membre",
        "libQualite": "Membre",
        "libQualiteSex": "Membre"
      },
      "organesRefs": [
        "PO403244"
      ]
    },
    {
      "uid": "PM408701",
      "acteurRef": "PA1353",
      "legislature": "13",
      "typeOrgane": "GE",
      "dateDebut": "2008-02-07T01:00:00.000+01:00",
      "dateFin": "2012-06-19T02:00:00.000+02:00",
      "preseance": "20",
      "nominPrincipale": "1",
      "infosQualite": {
        "codeQualite": "Membre",
        "libQualite": "Membre",
        "libQualiteSex": "Membre"
      },
      "organesRefs": [
        "PO403009"
      ]
    },
    {
      "uid": "PM411646",
      "acteurRef": "PA1353",
      "legislature": "13",
      "typeOrgane": "GE",
      "dateDebut": "2008-03-31T02:00:00.000+02:00",
      "dateFin": "2012-06-19T02:00:00.000+02:00",
      "preseance": "20",
      "nominPrincipale": "1",
      "infosQualite": {
        "codeQualite": "Membre",
        "libQualite": "Membre",
        "libQualiteSex": "Membre"
      },
      "organesRefs": [
        "PO402882"
      ]
    },
    {
      "uid": "PM413213",
      "acteurRef": "PA1353",
      "legislature": "13",
      "typeOrgane": "GE",
      "dateDebut": "2008-04-30T02:00:00.000+02:00",
      "dateFin": "2012-06-19T02:00:00.000+02:00",
      "preseance": "8",
      "nominPrincipale": "1",
      "infosQualite": {
        "codeQualite": "Vice-Président",
        "libQualite": "Vice-Président",
        "libQualiteSex": "Vice-Président"
      },
      "organesRefs": [
        "PO402882"
      ]
    },
    {
      "uid": "PM413713",
      "acteurRef": "PA1353",
      "legislature": "13",
      "typeOrgane": "GE",
      "dateDebut": "2008-06-11T02:00:00.000+02:00",
      "dateFin": "2012-06-19T02:00:00.000+02:00",
      "preseance": "12",
      "nominPrincipale": "1",
      "infosQualite": {
        "codeQualite": "Secrétaire",
        "libQualite": "Secrétaire",
        "libQualiteSex": "Secrétaire"
      },
      "organesRefs": [
        "PO403009"
      ]
    },
    {
      "uid": "PM416421",
      "acteurRef": "PA1353",
      "legislature": "13",
      "typeOrgane": "CNPS",
      "dateDebut": "2008-10-28T01:00:00.000+01:00",
      "datePublication": "2008-10-29T01:00:00.000+01:00",
      "dateFin": "2009-07-01T02:00:00.000+02:00",
      "preseance": "20",
      "nominPrincipale": "1",
      "infosQualite": {
        "codeQualite": "Membre",
        "libQualite": "Membre",
        "libQualiteSex": "Membre"
      },
      "organesRefs": [
        "PO416249"
      ]
    },
    {
      "uid": "PM418200",
      "acteurRef": "PA1353",
      "legislature": "13",
      "typeOrgane": "CMP",
      "dateDebut": "2009-01-21T01:00:00.000+01:00",
      "datePublication": "2009-01-22T01:00:00.000+01:00",
      "dateFin": "2009-02-17T01:00:00.000+01:00",
      "preseance": "20",
      "nominPrincipale": "1",
      "infosQualite": {
        "codeQualite": "Titulaire",
        "libQualite": "Membre titulaire",
        "libQualiteSex": "Membre titulaire"
      },
      "organesRefs": [
        "PO418192"
      ]
    },
    {
      "uid": "PM420683",
      "acteurRef": "PA1353",
      "legislature": "13",
      "typeOrgane": "COMPER",
      "dateDebut": "2009-07-01T02:00:00.000+02:00",
      "datePublication": "2009-07-01T02:00:00.000+02:00",
      "dateFin": "2012-06-19T02:00:00.000+02:00",
      "preseance": "32",
      "nominPrincipale": "1",
      "infosQualite": {
        "codeQualite": "Membre",
        "libQualite": "Membre",
        "libQualiteSex": "Membre"
      },
      "organesRefs": [
        "PO419604"
      ]
    },
    {
      "uid": "PM421545",
      "acteurRef": "PA1353",
      "legislature": "13",
      "typeOrgane": "CMP",
      "dateDebut": "2009-09-15T02:00:00.000+02:00",
      "datePublication": "2009-09-17T02:00:00.000+02:00",
      "dateFin": "2009-10-26T01:00:00.000+01:00",
      "preseance": "28",
      "nominPrincipale": "1",
      "infosQualite": {
        "codeQualite": "Suppléant",
        "libQualite": "Membre suppléant",
        "libQualiteSex": "Membre suppléant"
      },
      "organesRefs": [
        "PO421509"
      ]
    },
    {
      "uid": "PM427132",
      "acteurRef": "PA1353",
      "legislature": "13",
      "typeOrgane": "MISINFOCOM",
      "dateDebut": "2011-02-10T01:00:00.000+01:00",
      "datePublication": "2011-02-10T01:00:00.000+01:00",
      "dateFin": "2012-03-07T01:00:00.000+01:00",
      "preseance": "20",
      "nominPrincipale": "1",
      "infosQualite": {
        "codeQualite": "Membre",
        "libQualite": "Membre",
        "libQualiteSex": "Membre"
      },
      "organesRefs": [
        "PO427123"
      ]
    },
    {
      "uid": "PM428054",
      "acteurRef": "PA1353",
      "legislature": "13",
      "typeOrgane": "CMP",
      "dateDebut": "2011-04-14T02:00:00.000+02:00",
      "datePublication": "2011-04-15T02:00:00.000+02:00",
      "dateFin": "2011-05-18T02:00:00.000+02:00",
      "preseance": "28",
      "nominPrincipale": "1",
      "infosQualite": {
        "codeQualite": "Suppléant",
        "libQualite": "Membre suppléant",
        "libQualiteSex": "Membre suppléant"
      },
      "organesRefs": [
        "PO428028"
      ]
    },
    {
      "uid": "PM446227",
      "acteurRef": "PA1353",
      "legislature": "13",
      "typeOrgane": "CNPE",
      "dateDebut": "2011-12-13T01:00:00.000+01:00",
      "datePublication": "2011-12-14T01:00:00.000+01:00",
      "dateFin": "2012-03-07T01:00:00.000+01:00",
      "preseance": "20",
      "nominPrincipale": "1",
      "infosQualite": {
        "codeQualite": "Membre",
        "libQualite": "Membre",
        "libQualiteSex": "Membre"
      },
      "organesRefs": [
        "PO446215"
      ]
    },
    {
      "uid": "PM488253",
      "acteurRef": "PA1353",
      "legislature": "13",
      "typeOrgane": "CMP",
      "dateDebut": "2012-01-26T01:00:00.000+01:00",
      "datePublication": "2012-01-27T01:00:00.000+01:00",
      "dateFin": "2012-02-22T01:00:00.000+01:00",
      "preseance": "28",
      "nominPrincipale": "1",
      "infosQualite": {
        "codeQualite": "Suppléant",
        "libQualite": "Membre suppléant",
        "libQualiteSex": "Membre suppléant"
      },
      "organesRefs": [
        "PO482573"
      ]
    },
    {
      "uid": "PM645038",
      "acteurRef": "PA1353",
      "legislature": "14",
      "typeOrgane": "ASSEMBLEE",
      "dateDebut": "2012-06-20T02:00:00.000+02:00",
      "dateFin": "2017-06-20T02:00:00.000+02:00",
      "preseance": "50",
      "nominPrincipale": "1",
      "infosQualite": {
        "codeQualite": "membre",
        "libQualite": "membre",
        "libQualiteSex": "membre"
      },
      "organesRefs": [
        "PO644420"
      ],
      "suppleant": {
        "dateDebut": "2012-06-20T02:00:00.000+02:00",
        "dateFin": "2017-06-20T02:00:00.000+02:00",
        "suppleantRef": "PA267948"
      },
      "election": {
        "lieu": {
          "region": "Hauts-de-France",
          "regionType": "Métropolitain",
          "departement": "Oise",
          "numDepartement": "60",
          "numCirco": "3"
        },
        "causeMandat": "élections générales",
        "refCirconscription": "PO644723"
      },
      "mandature": {
        "datePriseFonction": "2012-06-20T02:00:00.000+02:00",
        "causeFin": "Fin de législature",
        "premiereElection": "1"
      }
    },
    {
      "uid": "PM656148",
      "acteurRef": "PA1353",
      "legislature": "14",
      "typeOrgane": "GP",
      "dateDebut": "2012-06-26T02:00:00.000+02:00",
      "datePublication": "2012-06-27T02:00:00.000+02:00",
      "dateFin": "2016-05-24T02:00:00.000+02:00",
      "preseance": "20",
      "nominPrincipale": "1",
      "infosQualite": {
        "codeQualite": "Membre",
        "libQualite": "Membre du",
        "libQualiteSex": "Membre du"
      },
      "organesRefs": [
        "PO656002"
      ]
    },
    {
      "uid": "PM657600",
      "acteurRef": "PA1353",
      "legislature": "14",
      "typeOrgane": "COMPER",
      "dateDebut": "2012-06-28T02:00:00.000+02:00",
      "datePublication": "2012-06-28T02:00:00.000+02:00",
      "dateFin": "2017-06-20T02:00:00.000+02:00",
      "preseance": "32",
      "nominPrincipale": "1",
      "infosQualite": {
        "codeQualite": "Membre",
        "libQualite": "Membre",
        "libQualiteSex": "Membre"
      },
      "organesRefs": [
        "PO419604"
      ]
    },
    {
      "uid": "PM677471",
      "acteurRef": "PA1353",
      "legislature": "14",
      "typeOrgane": "ORGEXTPARL",
      "dateDebut": "2012-07-25T02:00:00.000+02:00",
      "datePublication": "2012-07-27T02:00:00.000+02:00",
      "dateFin": "2017-06-20T02:00:00.000+02:00",
      "preseance": "20",
      "nominPrincipale": "1",
      "infosQualite": {
        "codeQualite": "Titulaire",
        "libQualite": "Membre titulaire",
        "libQualiteSex": "Membre titulaire"
      },
      "organesRefs": [
        "PO60239"
      ]
    },
    {
      "uid": "PM678652",
      "acteurRef": "PA1353",
      "legislature": "14",
      "typeOrgane": "GA",
      "dateDebut": "2012-09-26T02:00:00.000+02:00",
      "dateFin": "2017-06-20T02:00:00.000+02:00",
      "preseance": "20",
      "nominPrincipale": "0",
      "infosQualite": {
        "codeQualite": "Membre",
        "libQualite": "Membre",
        "libQualiteSex": "Membre"
      },
      "organesRefs": [
        "PO675785"
      ]
    },
    {
      "uid": "PM678653",
      "acteurRef": "PA1353",
      "legislature": "14",
      "typeOrgane": "GA",
      "dateDebut": "2012-09-26T02:00:00.000+02:00",
      "dateFin": "2017-06-20T02:00:00.000+02:00",
      "preseance": "1",
      "nominPrincipale": "1",
      "infosQualite": {
        "codeQualite": "Président",
        "libQualite": "Président",
        "libQualiteSex": "Président"
      },
      "organesRefs": [
        "PO675785"
      ]
    },
    {
      "uid": "PM682499",
      "acteurRef": "PA1353",
      "legislature": "14",
      "typeOrgane": "GA",
      "dateDebut": "2012-10-18T02:00:00.000+02:00",
      "dateFin": "2017-06-20T02:00:00.000+02:00",
      "preseance": "20",
      "nominPrincipale": "1",
      "infosQualite": {
        "codeQualite": "Membre",
        "libQualite": "Membre",
        "libQualiteSex": "Membre"
      },
      "organesRefs": [
        "PO675825"
      ]
    },
    {
      "uid": "PM682500",
      "acteurRef": "PA1353",
      "legislature": "14",
      "typeOrgane": "GA",
      "dateDebut": "2012-10-18T02:00:00.000+02:00",
      "dateFin": "2017-06-20T02:00:00.000+02:00",
      "preseance": "20",
      "nominPrincipale": "1",
      "infosQualite": {
        "codeQualite": "Membre",
        "libQualite": "Membre",
        "libQualiteSex": "Membre"
      },
      "organesRefs": [
        "PO675810"
      ]
    },
    {
      "uid": "PM684845",
      "acteurRef": "PA1353",
      "legislature": "14",
      "typeOrgane": "GA",
      "dateDebut": "2012-11-21T01:00:00.000+01:00",
      "dateFin": "2017-06-20T02:00:00.000+02:00",
      "preseance": "8",
      "nominPrincipale": "1",
      "infosQualite": {
        "codeQualite": "Vice-Président",
        "libQualite": "Vice-Président",
        "libQualiteSex": "Vice-Président"
      },
      "organesRefs": [
        "PO675825"
      ]
    },
    {
      "uid": "PM685746",
      "acteurRef": "PA1353",
      "typeOrgane": "PARPOL",
      "dateDebut": "2012-12-01T01:00:00.000+01:00",
      "dateFin": "2017-06-20T02:00:00.000+02:00",
      "preseance": "5",
      "nominPrincipale": "1",
      "infosQualite": {
        "codeQualite": "Membre",
        "libQualite": "Membre",
        "libQualiteSex": "Membre"
      },
      "organesRefs": [
        "PO684932"
      ]
    },
    {
      "uid": "PM686421",
      "acteurRef": "PA1353",
      "legislature": "14",
      "typeOrgane": "GE",
      "dateDebut": "2012-12-12T01:00:00.000+01:00",
      "dateFin": "2017-06-20T02:00:00.000+02:00",
      "preseance": "20",
      "nominPrincipale": "0",
      "infosQualite": {
        "codeQualite": "Membre",
        "libQualite": "Membre",
        "libQualiteSex": "Membre"
      },
      "organesRefs": [
        "PO686415"
      ]
    },
    {
      "uid": "PM686422",
      "acteurRef": "PA1353",
      "legislature": "14",
      "typeOrgane": "GE",
      "dateDebut": "2012-12-12T01:00:00.000+01:00",
      "dateFin": "2017-06-20T02:00:00.000+02:00",
      "preseance": "1",
      "nominPrincipale": "1",
      "infosQualite": {
        "codeQualite": "Président",
        "libQualite": "Président",
        "libQualiteSex": "Président"
      },
      "organesRefs": [
        "PO686415"
      ]
    },
    {
      "uid": "PM688223",
      "acteurRef": "PA1353",
      "legislature": "14",
      "typeOrgane": "GE",
      "dateDebut": "2013-01-18T01:00:00.000+01:00",
      "dateFin": "2017-06-20T02:00:00.000+02:00",
      "preseance": "20",
      "nominPrincipale": "1",
      "infosQualite": {
        "codeQualite": "Membre",
        "libQualite": "Membre",
        "libQualiteSex": "Membre"
      },
      "organesRefs": [
        "PO687403"
      ]
    },
    {
      "uid": "PM689321",
      "acteurRef": "PA1353",
      "legislature": "14",
      "typeOrgane": "GE",
      "dateDebut": "2013-01-29T01:00:00.000+01:00",
      "dateFin": "2017-06-20T02:00:00.000+02:00",
      "preseance": "20",
      "nominPrincipale": "1",
      "infosQualite": {
        "codeQualite": "Membre",
        "libQualite": "Membre",
        "libQualiteSex": "Membre"
      },
      "organesRefs": [
        "PO687087"
      ]
    },
    {
      "uid": "PM689440",
      "acteurRef": "PA1353",
      "legislature": "14",
      "typeOrgane": "GE",
      "dateDebut": "2013-01-30T01:00:00.000+01:00",
      "dateFin": "2017-06-20T02:00:00.000+02:00",
      "preseance": "20",
      "nominPrincipale": "1",
      "infosQualite": {
        "codeQualite": "Membre",
        "libQualite": "Membre",
        "libQualiteSex": "Membre"
      },
      "organesRefs": [
        "PO686853"
      ]
    },
    {
      "uid": "PM690364",
      "acteurRef": "PA1353",
      "legislature": "14",
      "typeOrgane": "GE",
      "dateDebut": "2013-02-05T01:00:00.000+01:00",
      "dateFin": "2017-06-20T02:00:00.000+02:00",
      "preseance": "8",
      "nominPrincipale": "1",
      "infosQualite": {
        "codeQualite": "Vice-Président",
        "libQualite": "Vice-Président",
        "libQualiteSex": "Vice-Président"
      },
      "organesRefs": [
        "PO687087"
      ]
    },
    {
      "uid": "PM693037",
      "acteurRef": "PA1353",
      "legislature": "14",
      "typeOrgane": "GE",
      "dateDebut": "2013-03-26T01:00:00.000+01:00",
      "dateFin": "2017-06-20T02:00:00.000+02:00",
      "preseance": "8",
      "nominPrincipale": "1",
      "infosQualite": {
        "codeQualite": "Vice-Président",
        "libQualite": "Vice-Président",
        "libQualiteSex": "Vice-Président"
      },
      "organesRefs": [
        "PO686853"
      ]
    },
    {
      "uid": "PM697714",
      "acteurRef": "PA1353",
      "legislature": "14",
      "typeOrgane": "CMP",
      "dateDebut": "2013-10-10T02:00:00.000+02:00",
      "datePublication": "2013-10-11T02:00:00.000+02:00",
      "dateFin": "2013-10-31T01:00:00.000+01:00",
      "preseance": "28",
      "nominPrincipale": "1",
      "infosQualite": {
        "codeQualite": "Suppléant",
        "libQualite": "Membre suppléant",
        "libQualiteSex": "Membre suppléant"
      },
      "organesRefs": [
        "PO697334"
      ]
    },
    {
      "uid": "PM697744",
      "acteurRef": "PA1353",
      "legislature": "14",
      "typeOrgane": "CMP",
      "dateDebut": "2013-10-10T02:00:00.000+02:00",
      "datePublication": "2013-10-11T02:00:00.000+02:00",
      "dateFin": "2013-10-31T01:00:00.000+01:00",
      "preseance": "28",
      "nominPrincipale": "1",
      "infosQualite": {
        "codeQualite": "Suppléant",
        "libQualite": "Membre suppléant",
        "libQualiteSex": "Membre suppléant"
      },
      "organesRefs": [
        "PO697328"
      ]
    },
    {
      "uid": "PM706360",
      "acteurRef": "PA1353",
      "legislature": "14",
      "typeOrgane": "CMP",
      "dateDebut": "2015-02-17T01:00:00.000+01:00",
      "datePublication": "2015-02-18T01:00:00.000+01:00",
      "dateFin": "2015-04-02T02:00:00.000+02:00",
      "preseance": "16",
      "nominPrincipale": "1",
      "infosQualite": {
        "codeQualite": "Rapporteur",
        "libQualite": "Rapporteur",
        "libQualiteSex": "Rapporteur"
      },
      "organesRefs": [
        "PO706223"
      ]
    },
    {
      "uid": "PM707393",
      "acteurRef": "PA1353",
      "legislature": "14",
      "typeOrgane": "MISINFO",
      "dateDebut": "2015-01-13T01:00:00.000+01:00",
      "dateFin": "2015-07-15T02:00:00.000+02:00",
      "preseance": "10",
      "nominPrincipale": "1",
      "infosQualite": {
        "codeQualite": "Membre",
        "libQualite": "Membre",
        "libQualiteSex": "Membre"
      },
      "organesRefs": [
        "PO707374"
      ]
    },
    {
      "uid": "PM709208",
      "acteurRef": "PA1353",
      "legislature": "14",
      "typeOrgane": "ORGEXTPARL",
      "dateDebut": "2015-07-16T02:00:00.000+02:00",
      "datePublication": "2015-07-16T02:00:00.000+02:00",
      "dateFin": "2017-06-20T02:00:00.000+02:00",
      "preseance": "20",
      "nominPrincipale": "1",
      "infosQualite": {
        "codeQualite": "Titulaire",
        "libQualite": "Membre titulaire",
        "libQualiteSex": "Membre titulaire"
      },
      "organesRefs": [
        "PO709206"
      ]
    },
    {
      "uid": "PM709329",
      "acteurRef": "PA1353",
      "legislature": "14",
      "typeOrgane": "CMP",
      "dateDebut": "2015-09-10T02:00:00.000+02:00",
      "datePublication": "2015-09-15T02:00:00.000+02:00",
      "dateFin": "2015-10-07T02:00:00.000+02:00",
      "preseance": "28",
      "nominPrincipale": "1",
      "infosQualite": {
        "codeQualite": "Suppléant",
        "libQualite": "Membre suppléant",
        "libQualiteSex": "Membre suppléant"
      },
      "organesRefs": [
        "PO709113"
      ]
    },
    {
      "uid": "PM711250",
      "acteurRef": "PA1353",
      "legislature": "14",
      "typeOrgane": "MISINFO",
      "dateDebut": "2016-01-20T01:00:00.000+01:00",
      "dateFin": "2016-11-16T01:00:00.000+01:00",
      "preseance": "10",
      "nominPrincipale": "1",
      "infosQualite": {
        "codeQualite": "Membre",
        "libQualite": "Membre",
        "libQualiteSex": "Membre"
      },
      "organesRefs": [
        "PO711240"
      ]
    },
    {
      "uid": "PM712415",
      "acteurRef": "PA1353",
      "legislature": "14",
      "typeOrgane": "GE",
      "dateDebut": "2016-04-25T02:00:00.000+02:00",
      "dateFin": "2017-06-20T02:00:00.000+02:00",
      "preseance": "20",
      "nominPrincipale": "1",
      "infosQualite": {
        "codeQualite": "Membre",
        "libQualite": "Membre",
        "libQualiteSex": "Membre"
      },
      "organesRefs": [
        "PO712100"
      ]
    },
    {
      "uid": "PM713211",
      "acteurRef": "PA1353",
      "legislature": "14",
      "typeOrgane": "GP",
      "dateDebut": "2016-05-25T02:00:00.000+02:00",
      "dateFin": "2017-06-20T02:00:00.000+02:00",
      "preseance": "20",
      "nominPrincipale": "1",
      "infosQualite": {
        "codeQualite": "Membre",
        "libQualite": "Membre du",
        "libQualiteSex": "Membre du"
      },
      "organesRefs": [
        "PO713077"
      ]
    },
    {
      "uid": "PM713508",
      "acteurRef": "PA1353",
      "legislature": "14",
      "typeOrgane": "GE",
      "dateDebut": "2016-05-31T02:00:00.000+02:00",
      "dateFin": "2017-06-20T02:00:00.000+02:00",
      "preseance": "20",
      "nominPrincipale": "1",
      "infosQualite": {
        "codeQualite": "Membre",
        "libQualite": "Membre",
        "libQualiteSex": "Membre"
      },
      "organesRefs": [
        "PO712794"
      ]
    },
    {
      "uid": "PM713599",
      "acteurRef": "PA1353",
      "legislature": "14",
      "typeOrgane": "CMP",
      "dateDebut": "2016-06-07T02:00:00.000+02:00",
      "datePublication": "2016-06-09T02:00:00.000+02:00",
      "dateFin": "2016-06-22T02:00:00.000+02:00",
      "preseance": "20",
      "nominPrincipale": "1",
      "infosQualite": {
        "codeQualite": "Titulaire",
        "libQualite": "Membre titulaire",
        "libQualiteSex": "Membre titulaire"
      },
      "organesRefs": [
        "PO713436"
      ]
    },
    {
      "uid": "PM713854",
      "acteurRef": "PA1353",
      "legislature": "14",
      "typeOrgane": "CNPE",
      "dateDebut": "2016-06-17T02:00:00.000+02:00",
      "datePublication": "2016-06-18T02:00:00.000+02:00",
      "dateFin": "2016-12-20T01:00:00.000+01:00",
      "preseance": "20",
      "nominPrincipale": "1",
      "infosQualite": {
        "codeQualite": "Membre",
        "libQualite": "Membre",
        "libQualiteSex": "Membre"
      },
      "organesRefs": [
        "PO713684"
      ]
    },
    {
      "uid": "PM713899",
      "acteurRef": "PA1353",
      "legislature": "14",
      "typeOrgane": "CNPE",
      "dateDebut": "2016-06-21T02:00:00.000+02:00",
      "datePublication": "2016-06-22T02:00:00.000+02:00",
      "dateFin": "2016-12-20T01:00:00.000+01:00",
      "preseance": "8",
      "nominPrincipale": "1",
      "infosQualite": {
        "codeQualite": "Vice-Président",
        "libQualite": "Vice-Président",
        "libQualiteSex": "Vice-Président"
      },
      "organesRefs": [
        "PO713684"
      ]
    }
  ]
}