{
  "uid": "PO732866",
  "codeType": "MISINFO",
  "libelle": "Mission d'évaluation et de contrôle des lois de financement de la sécurité sociale",
  "libelleEdition": "de la mission d'évaluation et de contrôle des lois de financement de la sécurité sociale",
  "libelleAbrege": "MEC sécurité sociale",
  "libelleAbrev": "MECSS",
  "viMoDe": {
    "dateDebut": "2017-07-19T02:00:00.000+02:00"
  },
  "regime": "5ème République",
  "legislature": "15",
  "secretariat": {}
}