{
  "uid": "PO733267",
  "codeType": "GA",
  "libelle": "France-Bénin",
  "libelleEdition": "de France-Bénin",
  "libelleAbrege": "Bénin",
  "libelleAbrev": "BEN",
  "viMoDe": {
    "dateAgrement": "2017-07-19T02:00:00.000+02:00"
  },
  "regime": "5ème République",
  "legislature": "15",
  "secretariat": {
    "secretaire01": "Mme Sandra Calixte"
  },
  "listePays": [
    "GOP756516"
  ]
}