{
  "uid": "PO426618",
  "codeType": "MISINFOPRE",
  "libelle": "Mission d'information sur la compétitivité de l'économie française et le financement de la protection sociale",
  "libelleEdition": "de la mission d'information sur la compétitivité de l'économie française et le financement de la protection sociale",
  "libelleAbrege": "Compétitivité économie",
  "libelleAbrev": "COMPETITIV",
  "viMoDe": {
    "dateDebut": "2011-01-11T01:00:00.000+01:00",
    "dateFin": "2011-11-09T01:00:00.000+01:00"
  },
  "regime": "5ème République",
  "legislature": "13",
  "secretariat": {}
}