{
  "uid": "PO419592",
  "codeType": "MINISTERE",
  "libelle": "Secrétariat d'Etat au logement et à l'urbanisme",
  "libelleEdition": "chargé du logement et de l'urbanisme",
  "libelleAbrege": "Logement et urbanisme",
  "libelleAbrev": "LOG",
  "viMoDe": {
    "dateDebut": "2009-06-23T02:00:00.000+02:00",
    "dateFin": "2010-11-13T01:00:00.000+01:00"
  },
  "organeParentRef": "PO384206"
}