{
  "uid": "PO716998",
  "codeType": "ORGEXTPARL",
  "libelle": "Comité stratégique de l’établissement public société canal seine-nord europe",
  "libelleEdition": "du comité stratégique de l’établissement public société canal seine-nord europe",
  "libelleAbrege": "Comité stratégique Canal Seine-Nord Europe",
  "libelleAbrev": "359",
  "viMoDe": {
    "dateDebut": "2016-04-21T02:00:00.000+02:00"
  },
  "regime": "5ème République",
  "regimeJuridique": "Article 4 de l'ordonnance n° 2016-489 du 21 avril 2016",
  "siteInternet": "https://www.canal-seine-nord-europe.fr/Acteurs/La-Societe-du-Canal-Seine-Nord-Europe"
}