{
  "uid": "PA267358",
  "etatCivil": {
    "ident": {
      "civ": "M.",
      "prenom": "Jean-Louis",
      "nom": "Christ",
      "alpha": "Christ"
    },
    "infoNaissance": {
      "dateNais": "1951-01-24T01:00:00.000+01:00",
      "villeNais": "Ribeauvillé",
      "depNais": "Haut-Rhin",
      "paysNais": "France"
    }
  },
  "profession": {
    "libelleCourant": "Chef d'entreprise",
    "socProcInsee": {
      "catSocPro": "Chefs d'entreprise de 10 salariés ou plus",
      "famSocPro": "Artisans, commerçants et chefs d'entreprise"
    }
  },
  "adresses": [
    {
      "xsiType": "AdressePostale_Type",
      "uid": "AD12030",
      "type": "2",
      "typeLibelle": "Adresse publiée de circonscription",
      "poids": "23",
      "intitule": "Mairie,",
      "nomRue": "Place de l'Hôtel de Ville,",
      "codePostal": "68150",
      "ville": "Ribeauvillé"
    },
    {
      "xsiType": "AdresseTelephonique_Type",
      "uid": "AD12032",
      "type": "11",
      "typeLibelle": "Téléphone",
      "poids": "23",
      "adresseDeRattachement": "AD12030",
      "valElec": "03 89 73 20 00"
    },
    {
      "xsiType": "AdressePostale_Type",
      "uid": "AD274839",
      "type": "2",
      "typeLibelle": "Adresse publiée de circonscription",
      "poids": "22",
      "intitule": "Permanence parlementaire,",
      "numeroRue": "10",
      "nomRue": "Grand'Rue,",
      "codePostal": "68230",
      "ville": "Turckheim"
    },
    {
      "xsiType": "AdresseTelephonique_Type",
      "uid": "AD288168",
      "type": "12",
      "typeLibelle": "Télécopie",
      "poids": "23",
      "adresseDeRattachement": "AD12030",
      "valElec": "03 89 73 37 18"
    },
    {
      "xsiType": "AdresseTelephonique_Type",
      "uid": "AD288169",
      "type": "11",
      "typeLibelle": "Téléphone",
      "poids": "22",
      "adresseDeRattachement": "AD274839",
      "valElec": "03 89 27 29 64"
    },
    {
      "xsiType": "AdresseTelephonique_Type",
      "uid": "AD288170",
      "type": "12",
      "typeLibelle": "Télécopie",
      "poids": "22",
      "adresseDeRattachement": "AD274839",
      "valElec": "03 89 27 16 73"
    },
    {
      "xsiType": "AdresseMail_Type",
      "uid": "AD288249",
      "type": "15",
      "typeLibelle": "Mèl",
      "valElec": "christjl@wanadoo.fr"
    },
    {
      "xsiType": "AdressePostale_Type",
      "uid": "AD386931",
      "type": "0",
      "typeLibelle": "Adresse officielle",
      "poids": "1",
      "intitule": "Assemblée nationale,",
      "numeroRue": "126",
      "nomRue": "Rue de l'Université,",
      "codePostal": "75355",
      "ville": "Paris 07 SP"
    },
    {
      "xsiType": "AdresseMail_Type",
      "uid": "AD391915",
      "type": "15",
      "typeLibelle": "Mèl",
      "valElec": "jlchrist@assemblee-nationale.fr"
    }
  ],
  "mandats": [
    {
      "uid": "PM386118",
      "acteurRef": "PA267358",
      "legislature": "13",
      "typeOrgane": "ASSEMBLEE",
      "dateDebut": "2007-06-20T02:00:00.000+02:00",
      "dateFin": "2012-06-19T02:00:00.000+02:00",
      "preseance": "50",
      "nominPrincipale": "1",
      "infosQualite": {
        "codeQualite": "membre",
        "libQualite": "membre",
        "libQualiteSex": "membre"
      },
      "organesRefs": [
        "PO384266"
      ],
      "suppleant": {
        "dateDebut": "2007-06-20T02:00:00.000+02:00",
        "dateFin": "2012-06-19T02:00:00.000+02:00",
        "suppleantRef": "PA767"
      },
      "election": {
        "lieu": {
          "region": "Grand Est",
          "regionType": "Métropolitain",
          "departement": "Haut-Rhin",
          "numDepartement": "68",
          "numCirco": "2"
        },
        "causeMandat": "élections générales",
        "refCirconscription": "PO384620"
      },
      "mandature": {
        "datePriseFonction": "2007-06-20T02:00:00.000+02:00",
        "causeFin": "Fin de législature",
        "premiereElection": "1"
      }
    },
    {
      "uid": "PM387510",
      "acteurRef": "PA267358",
      "legislature": "13",
      "typeOrgane": "GP",
      "dateDebut": "2007-06-20T02:00:00.000+02:00",
      "dateFin": "2007-06-26T02:00:00.000+02:00",
      "preseance": "28",
      "nominPrincipale": "1",
      "infosQualite": {
        "codeQualite": "Député non-inscrit",
        "libQualite": "Député non-inscrit",
        "libQualiteSex": "Député non-inscrit"
      },
      "organesRefs": [
        "PO387155"
      ]
    },
    {
      "uid": "PM389752",
      "acteurRef": "PA267358",
      "legislature": "13",
      "typeOrgane": "GP",
      "dateDebut": "2007-06-27T02:00:00.000+02:00",
      "datePublication": "2007-06-27T02:00:00.000+02:00",
      "dateFin": "2012-06-19T02:00:00.000+02:00",
      "preseance": "20",
      "nominPrincipale": "1",
      "infosQualite": {
        "codeQualite": "Membre",
        "libQualite": "Membre du",
        "libQualiteSex": "Membre du"
      },
      "organesRefs": [
        "PO389395"
      ]
    },
    {
      "uid": "PM390679",
      "acteurRef": "PA267358",
      "legislature": "13",
      "typeOrgane": "COMPER",
      "dateDebut": "2007-06-27T02:00:00.000+02:00",
      "datePublication": "2007-06-28T02:00:00.000+02:00",
      "dateFin": "2010-01-19T01:00:00.000+01:00",
      "preseance": "32",
      "nominPrincipale": "1",
      "infosQualite": {
        "codeQualite": "Membre",
        "libQualite": "Membre",
        "libQualiteSex": "Membre"
      },
      "organesRefs": [
        "PO59047"
      ]
    },
    {
      "uid": "PM394615",
      "acteurRef": "PA267358",
      "legislature": "13",
      "typeOrgane": "ORGEXTPARL",
      "dateDebut": "2007-08-01T02:00:00.000+02:00",
      "datePublication": "2007-08-02T02:00:00.000+02:00",
      "dateFin": "2010-08-01T02:00:00.000+02:00",
      "preseance": "20",
      "nominPrincipale": "1",
      "infosQualite": {
        "codeQualite": "Titulaire",
        "libQualite": "Membre titulaire",
        "libQualiteSex": "Membre titulaire"
      },
      "organesRefs": [
        "PO276701"
      ]
    },
    {
      "uid": "PM395692",
      "acteurRef": "PA267358",
      "legislature": "13",
      "typeOrgane": "GA",
      "dateDebut": "2007-09-27T02:00:00.000+02:00",
      "dateFin": "2012-06-19T02:00:00.000+02:00",
      "preseance": "20",
      "nominPrincipale": "0",
      "infosQualite": {
        "codeQualite": "Membre",
        "libQualite": "Membre",
        "libQualiteSex": "Membre"
      },
      "organesRefs": [
        "PO393278"
      ]
    },
    {
      "uid": "PM395693",
      "acteurRef": "PA267358",
      "legislature": "13",
      "typeOrgane": "GA",
      "dateDebut": "2007-09-27T02:00:00.000+02:00",
      "dateFin": "2012-06-19T02:00:00.000+02:00",
      "preseance": "1",
      "nominPrincipale": "1",
      "infosQualite": {
        "codeQualite": "Président",
        "libQualite": "Président",
        "libQualiteSex": "Président"
      },
      "organesRefs": [
        "PO393278"
      ]
    },
    {
      "uid": "PM397814",
      "acteurRef": "PA267358",
      "legislature": "13",
      "typeOrgane": "GA",
      "dateDebut": "2007-10-10T02:00:00.000+02:00",
      "dateFin": "2012-06-19T02:00:00.000+02:00",
      "preseance": "20",
      "nominPrincipale": "1",
      "infosQualite": {
        "codeQualite": "Membre",
        "libQualite": "Membre",
        "libQualiteSex": "Membre"
      },
      "organesRefs": [
        "PO392800"
      ]
    },
    {
      "uid": "PM397815",
      "acteurRef": "PA267358",
      "legislature": "13",
      "typeOrgane": "GA",
      "dateDebut": "2007-10-10T02:00:00.000+02:00",
      "dateFin": "2012-06-19T02:00:00.000+02:00",
      "preseance": "20",
      "nominPrincipale": "1",
      "infosQualite": {
        "codeQualite": "Membre",
        "libQualite": "Membre",
        "libQualiteSex": "Membre"
      },
      "organesRefs": [
        "PO392860"
      ]
    },
    {
      "uid": "PM397816",
      "acteurRef": "PA267358",
      "legislature": "13",
      "typeOrgane": "GA",
      "dateDebut": "2007-10-10T02:00:00.000+02:00",
      "dateFin": "2012-06-19T02:00:00.000+02:00",
      "preseance": "20",
      "nominPrincipale": "1",
      "infosQualite": {
        "codeQualite": "Membre",
        "libQualite": "Membre",
        "libQualiteSex": "Membre"
      },
      "organesRefs": [
        "PO392915"
      ]
    },
    {
      "uid": "PM397817",
      "acteurRef": "PA267358",
      "legislature": "13",
      "typeOrgane": "GA",
      "dateDebut": "2007-10-10T02:00:00.000+02:00",
      "dateFin": "2012-06-19T02:00:00.000+02:00",
      "preseance": "20",
      "nominPrincipale": "1",
      "infosQualite": {
        "codeQualite": "Membre",
        "libQualite": "Membre",
        "libQualiteSex": "Membre"
      },
      "organesRefs": [
        "PO393025"
      ]
    },
    {
      "uid": "PM397818",
      "acteurRef": "PA267358",
      "legislature": "13",
      "typeOrgane": "GA",
      "dateDebut": "2007-10-10T02:00:00.000+02:00",
      "dateFin": "2012-06-19T02:00:00.000+02:00",
      "preseance": "20",
      "nominPrincipale": "1",
      "infosQualite": {
        "codeQualite": "Membre",
        "libQualite": "Membre",
        "libQualiteSex": "Membre"
      },
      "organesRefs": [
        "PO393192"
      ]
    },
    {
      "uid": "PM397819",
      "acteurRef": "PA267358",
      "legislature": "13",
      "typeOrgane": "GA",
      "dateDebut": "2007-10-10T02:00:00.000+02:00",
      "dateFin": "2012-06-19T02:00:00.000+02:00",
      "preseance": "20",
      "nominPrincipale": "1",
      "infosQualite": {
        "codeQualite": "Membre",
        "libQualite": "Membre",
        "libQualiteSex": "Membre"
      },
      "organesRefs": [
        "PO393398"
      ]
    },
    {
      "uid": "PM407374",
      "acteurRef": "PA267358",
      "legislature": "13",
      "typeOrgane": "GE",
      "dateDebut": "2008-01-20T01:00:00.000+01:00",
      "dateFin": "2012-06-19T02:00:00.000+02:00",
      "preseance": "20",
      "nominPrincipale": "1",
      "infosQualite": {
        "codeQualite": "Membre",
        "libQualite": "Membre",
        "libQualiteSex": "Membre"
      },
      "organesRefs": [
        "PO403129"
      ]
    },
    {
      "uid": "PM408777",
      "acteurRef": "PA267358",
      "legislature": "13",
      "typeOrgane": "GE",
      "dateDebut": "2008-02-11T01:00:00.000+01:00",
      "dateFin": "2012-06-19T02:00:00.000+02:00",
      "preseance": "20",
      "nominPrincipale": "1",
      "infosQualite": {
        "codeQualite": "Membre",
        "libQualite": "Membre",
        "libQualiteSex": "Membre"
      },
      "organesRefs": [
        "PO403099"
      ]
    },
    {
      "uid": "PM409308",
      "acteurRef": "PA267358",
      "legislature": "13",
      "typeOrgane": "GE",
      "dateDebut": "2008-02-14T01:00:00.000+01:00",
      "dateFin": "2012-06-19T02:00:00.000+02:00",
      "preseance": "20",
      "nominPrincipale": "1",
      "infosQualite": {
        "codeQualite": "Membre",
        "libQualite": "Membre",
        "libQualiteSex": "Membre"
      },
      "organesRefs": [
        "PO402869"
      ]
    },
    {
      "uid": "PM409371",
      "acteurRef": "PA267358",
      "legislature": "13",
      "typeOrgane": "GE",
      "dateDebut": "2008-02-18T01:00:00.000+01:00",
      "dateFin": "2012-06-19T02:00:00.000+02:00",
      "preseance": "20",
      "nominPrincipale": "1",
      "infosQualite": {
        "codeQualite": "Membre",
        "libQualite": "Membre",
        "libQualiteSex": "Membre"
      },
      "organesRefs": [
        "PO402770"
      ]
    },
    {
      "uid": "PM410298",
      "acteurRef": "PA267358",
      "legislature": "13",
      "typeOrgane": "GE",
      "dateDebut": "2008-02-05T01:00:00.000+01:00",
      "dateFin": "2012-06-19T02:00:00.000+02:00",
      "preseance": "20",
      "nominPrincipale": "1",
      "infosQualite": {
        "codeQualite": "Membre",
        "libQualite": "Membre",
        "libQualiteSex": "Membre"
      },
      "organesRefs": [
        "PO403319"
      ]
    },
    {
      "uid": "PM422819",
      "acteurRef": "PA267358",
      "legislature": "13",
      "typeOrgane": "COMPER",
      "dateDebut": "2010-01-20T01:00:00.000+01:00",
      "datePublication": "2010-01-20T01:00:00.000+01:00",
      "dateFin": "2010-01-20T01:00:00.000+01:00",
      "preseance": "32",
      "nominPrincipale": "1",
      "infosQualite": {
        "codeQualite": "Membre",
        "libQualite": "Membre",
        "libQualiteSex": "Membre"
      },
      "organesRefs": [
        "PO59048"
      ]
    },
    {
      "uid": "PM422835",
      "acteurRef": "PA267358",
      "legislature": "13",
      "typeOrgane": "COMPER",
      "dateDebut": "2010-01-21T01:00:00.000+01:00",
      "datePublication": "2010-01-21T01:00:00.000+01:00",
      "dateFin": "2012-06-19T02:00:00.000+02:00",
      "preseance": "32",
      "nominPrincipale": "1",
      "infosQualite": {
        "codeQualite": "Membre",
        "libQualite": "Membre",
        "libQualiteSex": "Membre"
      },
      "organesRefs": [
        "PO59047"
      ]
    },
    {
      "uid": "PM423008",
      "acteurRef": "PA267358",
      "legislature": "13",
      "typeOrgane": "GA",
      "dateDebut": "2010-02-16T01:00:00.000+01:00",
      "dateFin": "2012-06-19T02:00:00.000+02:00",
      "preseance": "20",
      "nominPrincipale": "1",
      "infosQualite": {
        "codeQualite": "Membre",
        "libQualite": "Membre",
        "libQualiteSex": "Membre"
      },
      "organesRefs": [
        "PO392865"
      ]
    },
    {
      "uid": "PM425542",
      "acteurRef": "PA267358",
      "legislature": "13",
      "typeOrgane": "GE",
      "dateDebut": "2010-10-15T02:00:00.000+02:00",
      "dateFin": "2012-06-19T02:00:00.000+02:00",
      "preseance": "20",
      "nominPrincipale": "1",
      "infosQualite": {
        "codeQualite": "Membre",
        "libQualite": "Membre",
        "libQualiteSex": "Membre"
      },
      "organesRefs": [
        "PO403154"
      ]
    },
    {
      "uid": "PM426602",
      "acteurRef": "PA267358",
      "legislature": "13",
      "typeOrgane": "ORGEXTPARL",
      "dateDebut": "2011-01-14T01:00:00.000+01:00",
      "datePublication": "2011-01-15T01:00:00.000+01:00",
      "dateFin": "2012-06-19T02:00:00.000+02:00",
      "preseance": "20",
      "nominPrincipale": "1",
      "infosQualite": {
        "codeQualite": "Titulaire",
        "libQualite": "Membre titulaire",
        "libQualiteSex": "Membre titulaire"
      },
      "organesRefs": [
        "PO276701"
      ]
    },
    {
      "uid": "PM427131",
      "acteurRef": "PA267358",
      "legislature": "13",
      "typeOrgane": "MISINFOCOM",
      "dateDebut": "2011-02-10T01:00:00.000+01:00",
      "datePublication": "2011-02-10T01:00:00.000+01:00",
      "dateFin": "2012-03-07T01:00:00.000+01:00",
      "preseance": "20",
      "nominPrincipale": "1",
      "infosQualite": {
        "codeQualite": "Membre",
        "libQualite": "Membre",
        "libQualiteSex": "Membre"
      },
      "organesRefs": [
        "PO427123"
      ]
    },
    {
      "uid": "PM440474",
      "acteurRef": "PA267358",
      "legislature": "13",
      "typeOrgane": "GE",
      "dateDebut": "2011-12-07T01:00:00.000+01:00",
      "dateFin": "2012-06-19T02:00:00.000+02:00",
      "preseance": "20",
      "nominPrincipale": "0",
      "infosQualite": {
        "codeQualite": "Membre",
        "libQualite": "Membre",
        "libQualiteSex": "Membre"
      },
      "organesRefs": [
        "PO429727"
      ]
    },
    {
      "uid": "PM447426",
      "acteurRef": "PA267358",
      "legislature": "13",
      "typeOrgane": "GE",
      "dateDebut": "2011-11-14T01:00:00.000+01:00",
      "dateFin": "2012-06-19T02:00:00.000+02:00",
      "preseance": "8",
      "nominPrincipale": "1",
      "infosQualite": {
        "codeQualite": "Vice-Président",
        "libQualite": "Vice-Président",
        "libQualiteSex": "Vice-Président"
      },
      "organesRefs": [
        "PO429727"
      ]
    },
    {
      "uid": "PM645602",
      "acteurRef": "PA267358",
      "legislature": "14",
      "typeOrgane": "ASSEMBLEE",
      "dateDebut": "2012-06-20T02:00:00.000+02:00",
      "dateFin": "2017-06-20T02:00:00.000+02:00",
      "preseance": "50",
      "nominPrincipale": "1",
      "infosQualite": {
        "codeQualite": "membre",
        "libQualite": "membre",
        "libQualiteSex": "membre"
      },
      "organesRefs": [
        "PO644420"
      ],
      "suppleant": {
        "dateDebut": "2012-06-20T02:00:00.000+02:00",
        "dateFin": "2017-06-20T02:00:00.000+02:00",
        "suppleantRef": "PA767"
      },
      "election": {
        "lieu": {
          "region": "Grand Est",
          "regionType": "Métropolitain",
          "departement": "Haut-Rhin",
          "numDepartement": "68",
          "numCirco": "2"
        },
        "causeMandat": "élections générales",
        "refCirconscription": "PO644774"
      },
      "mandature": {
        "datePriseFonction": "2012-06-20T02:00:00.000+02:00",
        "causeFin": "Fin de législature",
        "premiereElection": "1"
      }
    },
    {
      "uid": "PM656352",
      "acteurRef": "PA267358",
      "legislature": "14",
      "typeOrgane": "GP",
      "dateDebut": "2012-06-26T02:00:00.000+02:00",
      "datePublication": "2012-06-27T02:00:00.000+02:00",
      "dateFin": "2012-11-27T01:00:00.000+01:00",
      "preseance": "20",
      "nominPrincipale": "1",
      "infosQualite": {
        "codeQualite": "Membre",
        "libQualite": "Membre du",
        "libQualiteSex": "Membre du"
      },
      "organesRefs": [
        "PO656006"
      ]
    },
    {
      "uid": "PM657124",
      "acteurRef": "PA267358",
      "legislature": "14",
      "typeOrgane": "COMPER",
      "dateDebut": "2012-06-28T02:00:00.000+02:00",
      "datePublication": "2012-06-28T02:00:00.000+02:00",
      "dateFin": "2017-06-20T02:00:00.000+02:00",
      "preseance": "32",
      "nominPrincipale": "1",
      "infosQualite": {
        "codeQualite": "Membre",
        "libQualite": "Membre",
        "libQualiteSex": "Membre"
      },
      "organesRefs": [
        "PO59047"
      ]
    },
    {
      "uid": "PM677937",
      "acteurRef": "PA267358",
      "legislature": "14",
      "typeOrgane": "API",
      "dateDebut": "2012-07-31T02:00:00.000+02:00",
      "dateFin": "2017-06-20T02:00:00.000+02:00",
      "preseance": "20",
      "nominPrincipale": "1",
      "infosQualite": {
        "codeQualite": "Membre",
        "libQualite": "Membre",
        "libQualiteSex": "Membre"
      },
      "organesRefs": [
        "PO206064"
      ]
    },
    {
      "uid": "PM682130",
      "acteurRef": "PA267358",
      "legislature": "14",
      "typeOrgane": "GA",
      "dateDebut": "2012-10-16T02:00:00.000+02:00",
      "dateFin": "2017-06-20T02:00:00.000+02:00",
      "preseance": "20",
      "nominPrincipale": "1",
      "infosQualite": {
        "codeQualite": "Membre",
        "libQualite": "Membre",
        "libQualiteSex": "Membre"
      },
      "organesRefs": [
        "PO675730"
      ]
    },
    {
      "uid": "PM682131",
      "acteurRef": "PA267358",
      "legislature": "14",
      "typeOrgane": "GA",
      "dateDebut": "2012-10-16T02:00:00.000+02:00",
      "dateFin": "2017-06-20T02:00:00.000+02:00",
      "preseance": "20",
      "nominPrincipale": "1",
      "infosQualite": {
        "codeQualite": "Membre",
        "libQualite": "Membre",
        "libQualiteSex": "Membre"
      },
      "organesRefs": [
        "PO675798"
      ]
    },
    {
      "uid": "PM682132",
      "acteurRef": "PA267358",
      "legislature": "14",
      "typeOrgane": "GA",
      "dateDebut": "2012-10-16T02:00:00.000+02:00",
      "dateFin": "2017-06-20T02:00:00.000+02:00",
      "preseance": "20",
      "nominPrincipale": "1",
      "infosQualite": {
        "codeQualite": "Membre",
        "libQualite": "Membre",
        "libQualiteSex": "Membre"
      },
      "organesRefs": [
        "PO675712"
      ]
    },
    {
      "uid": "PM682133",
      "acteurRef": "PA267358",
      "legislature": "14",
      "typeOrgane": "GA",
      "dateDebut": "2012-10-16T02:00:00.000+02:00",
      "dateFin": "2017-06-20T02:00:00.000+02:00",
      "preseance": "20",
      "nominPrincipale": "1",
      "infosQualite": {
        "codeQualite": "Membre",
        "libQualite": "Membre",
        "libQualiteSex": "Membre"
      },
      "organesRefs": [
        "PO675721"
      ]
    },
    {
      "uid": "PM682134",
      "acteurRef": "PA267358",
      "legislature": "14",
      "typeOrgane": "GA",
      "dateDebut": "2012-10-16T02:00:00.000+02:00",
      "dateFin": "2017-06-20T02:00:00.000+02:00",
      "preseance": "20",
      "nominPrincipale": "1",
      "infosQualite": {
        "codeQualite": "Membre",
        "libQualite": "Membre",
        "libQualiteSex": "Membre"
      },
      "organesRefs": [
        "PO675848"
      ]
    },
    {
      "uid": "PM682135",
      "acteurRef": "PA267358",
      "legislature": "14",
      "typeOrgane": "GA",
      "dateDebut": "2012-10-16T02:00:00.000+02:00",
      "dateFin": "2017-06-20T02:00:00.000+02:00",
      "preseance": "20",
      "nominPrincipale": "1",
      "infosQualite": {
        "codeQualite": "Membre",
        "libQualite": "Membre",
        "libQualiteSex": "Membre"
      },
      "organesRefs": [
        "PO675693"
      ]
    },
    {
      "uid": "PM682136",
      "acteurRef": "PA267358",
      "legislature": "14",
      "typeOrgane": "GA",
      "dateDebut": "2012-10-16T02:00:00.000+02:00",
      "dateFin": "2017-06-20T02:00:00.000+02:00",
      "preseance": "20",
      "nominPrincipale": "1",
      "infosQualite": {
        "codeQualite": "Membre",
        "libQualite": "Membre",
        "libQualiteSex": "Membre"
      },
      "organesRefs": [
        "PO675825"
      ]
    },
    {
      "uid": "PM682137",
      "acteurRef": "PA267358",
      "legislature": "14",
      "typeOrgane": "GA",
      "dateDebut": "2012-10-16T02:00:00.000+02:00",
      "dateFin": "2017-06-20T02:00:00.000+02:00",
      "preseance": "20",
      "nominPrincipale": "1",
      "infosQualite": {
        "codeQualite": "Membre",
        "libQualite": "Membre",
        "libQualiteSex": "Membre"
      },
      "organesRefs": [
        "PO675686"
      ]
    },
    {
      "uid": "PM682138",
      "acteurRef": "PA267358",
      "legislature": "14",
      "typeOrgane": "GA",
      "dateDebut": "2012-10-16T02:00:00.000+02:00",
      "dateFin": "2017-06-20T02:00:00.000+02:00",
      "preseance": "20",
      "nominPrincipale": "1",
      "infosQualite": {
        "codeQualite": "Membre",
        "libQualite": "Membre",
        "libQualiteSex": "Membre"
      },
      "organesRefs": [
        "PO675821"
      ]
    },
    {
      "uid": "PM682139",
      "acteurRef": "PA267358",
      "legislature": "14",
      "typeOrgane": "GA",
      "dateDebut": "2012-10-16T02:00:00.000+02:00",
      "dateFin": "2017-06-20T02:00:00.000+02:00",
      "preseance": "20",
      "nominPrincipale": "1",
      "infosQualite": {
        "codeQualite": "Membre",
        "libQualite": "Membre",
        "libQualiteSex": "Membre"
      },
      "organesRefs": [
        "PO675768"
      ]
    },
    {
      "uid": "PM682140",
      "acteurRef": "PA267358",
      "legislature": "14",
      "typeOrgane": "GA",
      "dateDebut": "2012-10-16T02:00:00.000+02:00",
      "dateFin": "2017-06-20T02:00:00.000+02:00",
      "preseance": "20",
      "nominPrincipale": "1",
      "infosQualite": {
        "codeQualite": "Membre",
        "libQualite": "Membre",
        "libQualiteSex": "Membre"
      },
      "organesRefs": [
        "PO675719"
      ]
    },
    {
      "uid": "PM682141",
      "acteurRef": "PA267358",
      "legislature": "14",
      "typeOrgane": "GA",
      "dateDebut": "2012-10-16T02:00:00.000+02:00",
      "dateFin": "2017-06-20T02:00:00.000+02:00",
      "preseance": "20",
      "nominPrincipale": "1",
      "infosQualite": {
        "codeQualite": "Membre",
        "libQualite": "Membre",
        "libQualiteSex": "Membre"
      },
      "organesRefs": [
        "PO675841"
      ]
    },
    {
      "uid": "PM682142",
      "acteurRef": "PA267358",
      "legislature": "14",
      "typeOrgane": "GA",
      "dateDebut": "2012-10-16T02:00:00.000+02:00",
      "dateFin": "2017-06-20T02:00:00.000+02:00",
      "preseance": "20",
      "nominPrincipale": "1",
      "infosQualite": {
        "codeQualite": "Membre",
        "libQualite": "Membre",
        "libQualiteSex": "Membre"
      },
      "organesRefs": [
        "PO675772"
      ]
    },
    {
      "uid": "PM682143",
      "acteurRef": "PA267358",
      "legislature": "14",
      "typeOrgane": "GA",
      "dateDebut": "2012-10-16T02:00:00.000+02:00",
      "dateFin": "2017-06-20T02:00:00.000+02:00",
      "preseance": "20",
      "nominPrincipale": "1",
      "infosQualite": {
        "codeQualite": "Membre",
        "libQualite": "Membre",
        "libQualiteSex": "Membre"
      },
      "organesRefs": [
        "PO675759"
      ]
    },
    {
      "uid": "PM682144",
      "acteurRef": "PA267358",
      "legislature": "14",
      "typeOrgane": "GA",
      "dateDebut": "2012-10-16T02:00:00.000+02:00",
      "dateFin": "2017-06-20T02:00:00.000+02:00",
      "preseance": "20",
      "nominPrincipale": "1",
      "infosQualite": {
        "codeQualite": "Membre",
        "libQualite": "Membre",
        "libQualiteSex": "Membre"
      },
      "organesRefs": [
        "PO675810"
      ]
    },
    {
      "uid": "PM682145",
      "acteurRef": "PA267358",
      "legislature": "14",
      "typeOrgane": "GA",
      "dateDebut": "2012-10-16T02:00:00.000+02:00",
      "dateFin": "2017-06-20T02:00:00.000+02:00",
      "preseance": "20",
      "nominPrincipale": "1",
      "infosQualite": {
        "codeQualite": "Membre",
        "libQualite": "Membre",
        "libQualiteSex": "Membre"
      },
      "organesRefs": [
        "PO675683"
      ]
    },
    {
      "uid": "PM682146",
      "acteurRef": "PA267358",
      "legislature": "14",
      "typeOrgane": "GA",
      "dateDebut": "2012-10-16T02:00:00.000+02:00",
      "dateFin": "2017-06-20T02:00:00.000+02:00",
      "preseance": "20",
      "nominPrincipale": "1",
      "infosQualite": {
        "codeQualite": "Membre",
        "libQualite": "Membre",
        "libQualiteSex": "Membre"
      },
      "organesRefs": [
        "PO675774"
      ]
    },
    {
      "uid": "PM682147",
      "acteurRef": "PA267358",
      "legislature": "14",
      "typeOrgane": "GA",
      "dateDebut": "2012-10-16T02:00:00.000+02:00",
      "dateFin": "2017-06-20T02:00:00.000+02:00",
      "preseance": "20",
      "nominPrincipale": "1",
      "infosQualite": {
        "codeQualite": "Membre",
        "libQualite": "Membre",
        "libQualiteSex": "Membre"
      },
      "organesRefs": [
        "PO675781"
      ]
    },
    {
      "uid": "PM684842",
      "acteurRef": "PA267358",
      "legislature": "14",
      "typeOrgane": "GA",
      "dateDebut": "2012-11-21T01:00:00.000+01:00",
      "dateFin": "2017-06-20T02:00:00.000+02:00",
      "preseance": "8",
      "nominPrincipale": "1",
      "infosQualite": {
        "codeQualite": "Vice-Président",
        "libQualite": "Vice-Président",
        "libQualiteSex": "Vice-Président"
      },
      "organesRefs": [
        "PO675825"
      ]
    },
    {
      "uid": "PM684976",
      "acteurRef": "PA267358",
      "legislature": "14",
      "typeOrgane": "GP",
      "dateDebut": "2012-11-27T01:00:00.000+01:00",
      "datePublication": "2012-11-28T01:00:00.000+01:00",
      "dateFin": "2013-01-15T01:00:00.000+01:00",
      "preseance": "20",
      "nominPrincipale": "1",
      "infosQualite": {
        "codeQualite": "Membre",
        "libQualite": "Membre du",
        "libQualiteSex": "Membre du"
      },
      "organesRefs": [
        "PO684957"
      ]
    },
    {
      "uid": "PM685070",
      "acteurRef": "PA267358",
      "legislature": "14",
      "typeOrgane": "GA",
      "dateDebut": "2012-11-27T01:00:00.000+01:00",
      "dateFin": "2017-06-20T02:00:00.000+02:00",
      "preseance": "8",
      "nominPrincipale": "1",
      "infosQualite": {
        "codeQualite": "Vice-Président",
        "libQualite": "Vice-Président",
        "libQualiteSex": "Vice-Président"
      },
      "organesRefs": [
        "PO675810"
      ]
    },
    {
      "uid": "PM685449",
      "acteurRef": "PA267358",
      "typeOrgane": "PARPOL",
      "dateDebut": "2012-12-01T01:00:00.000+01:00",
      "dateFin": "2015-11-30T01:00:00.000+01:00",
      "preseance": "5",
      "nominPrincipale": "1",
      "infosQualite": {
        "codeQualite": "Membre",
        "libQualite": "Membre",
        "libQualiteSex": "Membre"
      },
      "organesRefs": [
        "PO684942"
      ]
    },
    {
      "uid": "PM687942",
      "acteurRef": "PA267358",
      "legislature": "14",
      "typeOrgane": "GP",
      "dateDebut": "2013-01-16T01:00:00.000+01:00",
      "datePublication": "2013-01-16T01:00:00.000+01:00",
      "dateFin": "2015-06-01T02:00:00.000+02:00",
      "preseance": "20",
      "nominPrincipale": "1",
      "infosQualite": {
        "codeQualite": "Membre",
        "libQualite": "Membre du",
        "libQualiteSex": "Membre du"
      },
      "organesRefs": [
        "PO656006"
      ]
    },
    {
      "uid": "PM688057",
      "acteurRef": "PA267358",
      "legislature": "14",
      "typeOrgane": "GE",
      "dateDebut": "2013-01-16T01:00:00.000+01:00",
      "dateFin": "2017-06-20T02:00:00.000+02:00",
      "preseance": "20",
      "nominPrincipale": "1",
      "infosQualite": {
        "codeQualite": "Membre",
        "libQualite": "Membre",
        "libQualiteSex": "Membre"
      },
      "organesRefs": [
        "PO686258"
      ]
    },
    {
      "uid": "PM688216",
      "acteurRef": "PA267358",
      "legislature": "14",
      "typeOrgane": "GE",
      "dateDebut": "2013-01-18T01:00:00.000+01:00",
      "dateFin": "2017-06-20T02:00:00.000+02:00",
      "preseance": "20",
      "nominPrincipale": "1",
      "infosQualite": {
        "codeQualite": "Membre",
        "libQualite": "Membre",
        "libQualiteSex": "Membre"
      },
      "organesRefs": [
        "PO687403"
      ]
    },
    {
      "uid": "PM688323",
      "acteurRef": "PA267358",
      "legislature": "14",
      "typeOrgane": "GE",
      "dateDebut": "2013-01-22T01:00:00.000+01:00",
      "dateFin": "2017-06-20T02:00:00.000+02:00",
      "preseance": "20",
      "nominPrincipale": "1",
      "infosQualite": {
        "codeQualite": "Membre",
        "libQualite": "Membre",
        "libQualiteSex": "Membre"
      },
      "organesRefs": [
        "PO686785"
      ]
    },
    {
      "uid": "PM688629",
      "acteurRef": "PA267358",
      "legislature": "14",
      "typeOrgane": "GE",
      "dateDebut": "2013-01-24T01:00:00.000+01:00",
      "dateFin": "2017-06-20T02:00:00.000+02:00",
      "preseance": "20",
      "nominPrincipale": "1",
      "infosQualite": {
        "codeQualite": "Membre",
        "libQualite": "Membre",
        "libQualiteSex": "Membre"
      },
      "organesRefs": [
        "PO686232"
      ]
    },
    {
      "uid": "PM689453",
      "acteurRef": "PA267358",
      "legislature": "14",
      "typeOrgane": "GE",
      "dateDebut": "2013-01-29T01:00:00.000+01:00",
      "dateFin": "2017-06-20T02:00:00.000+02:00",
      "preseance": "20",
      "nominPrincipale": "1",
      "infosQualite": {
        "codeQualite": "Membre",
        "libQualite": "Membre",
        "libQualiteSex": "Membre"
      },
      "organesRefs": [
        "PO687087"
      ]
    },
    {
      "uid": "PM689474",
      "acteurRef": "PA267358",
      "legislature": "14",
      "typeOrgane": "GE",
      "dateDebut": "2013-01-23T01:00:00.000+01:00",
      "dateFin": "2017-06-20T02:00:00.000+02:00",
      "preseance": "20",
      "nominPrincipale": "1",
      "infosQualite": {
        "codeQualite": "Membre",
        "libQualite": "Membre",
        "libQualiteSex": "Membre"
      },
      "organesRefs": [
        "PO687109"
      ]
    },
    {
      "uid": "PM689880",
      "acteurRef": "PA267358",
      "legislature": "14",
      "typeOrgane": "GE",
      "dateDebut": "2013-01-31T01:00:00.000+01:00",
      "dateFin": "2017-06-20T02:00:00.000+02:00",
      "preseance": "20",
      "nominPrincipale": "1",
      "infosQualite": {
        "codeQualite": "Membre",
        "libQualite": "Membre",
        "libQualiteSex": "Membre"
      },
      "organesRefs": [
        "PO686442"
      ]
    },
    {
      "uid": "PM690930",
      "acteurRef": "PA267358",
      "legislature": "14",
      "typeOrgane": "GE",
      "dateDebut": "2013-02-08T01:00:00.000+01:00",
      "dateFin": "2017-06-20T02:00:00.000+02:00",
      "preseance": "20",
      "nominPrincipale": "1",
      "infosQualite": {
        "codeQualite": "Membre",
        "libQualite": "Membre",
        "libQualiteSex": "Membre"
      },
      "organesRefs": [
        "PO686776"
      ]
    },
    {
      "uid": "PM691188",
      "acteurRef": "PA267358",
      "legislature": "14",
      "typeOrgane": "GE",
      "dateDebut": "2013-01-13T01:00:00.000+01:00",
      "dateFin": "2017-06-20T02:00:00.000+02:00",
      "preseance": "20",
      "nominPrincipale": "1",
      "infosQualite": {
        "codeQualite": "Membre",
        "libQualite": "Membre",
        "libQualiteSex": "Membre"
      },
      "organesRefs": [
        "PO687381"
      ]
    },
    {
      "uid": "PM691956",
      "acteurRef": "PA267358",
      "legislature": "14",
      "typeOrgane": "GE",
      "dateDebut": "2013-02-25T01:00:00.000+01:00",
      "dateFin": "2017-06-20T02:00:00.000+02:00",
      "preseance": "20",
      "nominPrincipale": "1",
      "infosQualite": {
        "codeQualite": "Membre",
        "libQualite": "Membre",
        "libQualiteSex": "Membre"
      },
      "organesRefs": [
        "PO687098"
      ]
    },
    {
      "uid": "PM692020",
      "acteurRef": "PA267358",
      "legislature": "14",
      "typeOrgane": "GE",
      "dateDebut": "2013-02-21T01:00:00.000+01:00",
      "dateFin": "2017-06-20T02:00:00.000+02:00",
      "preseance": "20",
      "nominPrincipale": "1",
      "infosQualite": {
        "codeQualite": "Membre",
        "libQualite": "Membre",
        "libQualiteSex": "Membre"
      },
      "organesRefs": [
        "PO687473"
      ]
    },
    {
      "uid": "PM692509",
      "acteurRef": "PA267358",
      "legislature": "14",
      "typeOrgane": "GE",
      "dateDebut": "2013-02-19T01:00:00.000+01:00",
      "dateFin": "2017-06-20T02:00:00.000+02:00",
      "preseance": "20",
      "nominPrincipale": "1",
      "infosQualite": {
        "codeQualite": "Membre",
        "libQualite": "Membre",
        "libQualiteSex": "Membre"
      },
      "organesRefs": [
        "PO686767"
      ]
    },
    {
      "uid": "PM692923",
      "acteurRef": "PA267358",
      "legislature": "14",
      "typeOrgane": "GE",
      "dateDebut": "2013-03-25T01:00:00.000+01:00",
      "dateFin": "2017-06-20T02:00:00.000+02:00",
      "preseance": "20",
      "nominPrincipale": "1",
      "infosQualite": {
        "codeQualite": "Membre",
        "libQualite": "Membre",
        "libQualiteSex": "Membre"
      },
      "organesRefs": [
        "PO689030"
      ]
    },
    {
      "uid": "PM693497",
      "acteurRef": "PA267358",
      "legislature": "14",
      "typeOrgane": "GE",
      "dateDebut": "2013-01-21T01:00:00.000+01:00",
      "dateFin": "2017-06-20T02:00:00.000+02:00",
      "preseance": "20",
      "nominPrincipale": "1",
      "infosQualite": {
        "codeQualite": "Membre",
        "libQualite": "Membre",
        "libQualiteSex": "Membre"
      },
      "organesRefs": [
        "PO686213"
      ]
    },
    {
      "uid": "PM694128",
      "acteurRef": "PA267358",
      "legislature": "14",
      "typeOrgane": "GE",
      "dateDebut": "2013-04-09T02:00:00.000+02:00",
      "dateFin": "2017-06-20T02:00:00.000+02:00",
      "preseance": "20",
      "nominPrincipale": "1",
      "infosQualite": {
        "codeQualite": "Membre",
        "libQualite": "Membre",
        "libQualiteSex": "Membre"
      },
      "organesRefs": [
        "PO689024"
      ]
    },
    {
      "uid": "PM694324",
      "acteurRef": "PA267358",
      "legislature": "14",
      "typeOrgane": "GE",
      "dateDebut": "2013-04-19T02:00:00.000+02:00",
      "dateFin": "2017-06-20T02:00:00.000+02:00",
      "preseance": "20",
      "nominPrincipale": "1",
      "infosQualite": {
        "codeQualite": "Membre",
        "libQualite": "Membre",
        "libQualiteSex": "Membre"
      },
      "organesRefs": [
        "PO689012"
      ]
    },
    {
      "uid": "PM695152",
      "acteurRef": "PA267358",
      "legislature": "14",
      "typeOrgane": "GE",
      "dateDebut": "2012-12-18T01:00:00.000+01:00",
      "dateFin": "2017-06-20T02:00:00.000+02:00",
      "preseance": "20",
      "nominPrincipale": "1",
      "infosQualite": {
        "codeQualite": "Membre",
        "libQualite": "Membre",
        "libQualiteSex": "Membre"
      },
      "organesRefs": [
        "PO686266"
      ]
    },
    {
      "uid": "PM696122",
      "acteurRef": "PA267358",
      "legislature": "14",
      "typeOrgane": "GE",
      "dateDebut": "2013-07-15T02:00:00.000+02:00",
      "dateFin": "2017-06-20T02:00:00.000+02:00",
      "preseance": "20",
      "nominPrincipale": "1",
      "infosQualite": {
        "codeQualite": "Membre",
        "libQualite": "Membre",
        "libQualiteSex": "Membre"
      },
      "organesRefs": [
        "PO694566"
      ]
    },
    {
      "uid": "PM696821",
      "acteurRef": "PA267358",
      "legislature": "14",
      "typeOrgane": "GE",
      "dateDebut": "2013-10-01T02:00:00.000+02:00",
      "dateFin": "2017-06-20T02:00:00.000+02:00",
      "preseance": "8",
      "nominPrincipale": "1",
      "infosQualite": {
        "codeQualite": "Vice-Président",
        "libQualite": "Vice-Président",
        "libQualiteSex": "Vice-Président"
      },
      "organesRefs": [
        "PO694584"
      ]
    },
    {
      "uid": "PM700419",
      "acteurRef": "PA267358",
      "legislature": "14",
      "typeOrgane": "ORGEXTPARL",
      "dateDebut": "2014-02-18T01:00:00.000+01:00",
      "datePublication": "2014-02-26T01:00:00.000+01:00",
      "dateFin": "2017-06-20T02:00:00.000+02:00",
      "preseance": "20",
      "nominPrincipale": "1",
      "infosQualite": {
        "codeQualite": "Titulaire",
        "libQualite": "Membre titulaire",
        "libQualiteSex": "Membre titulaire"
      },
      "organesRefs": [
        "PO429555"
      ]
    },
    {
      "uid": "PM707665",
      "acteurRef": "PA267358",
      "legislature": "14",
      "typeOrgane": "GE",
      "dateDebut": "2015-05-06T02:00:00.000+02:00",
      "dateFin": "2017-06-20T02:00:00.000+02:00",
      "preseance": "20",
      "nominPrincipale": "1",
      "infosQualite": {
        "codeQualite": "Membre",
        "libQualite": "Membre",
        "libQualiteSex": "Membre"
      },
      "organesRefs": [
        "PO705534"
      ]
    },
    {
      "uid": "PM708286",
      "acteurRef": "PA267358",
      "legislature": "14",
      "typeOrgane": "GP",
      "dateDebut": "2015-06-02T02:00:00.000+02:00",
      "datePublication": "2015-06-02T02:00:00.000+02:00",
      "dateFin": "2017-06-20T02:00:00.000+02:00",
      "preseance": "20",
      "nominPrincipale": "1",
      "infosQualite": {
        "codeQualite": "Membre",
        "libQualite": "Membre du",
        "libQualiteSex": "Membre du"
      },
      "organesRefs": [
        "PO707869"
      ]
    },
    {
      "uid": "PM710432",
      "acteurRef": "PA267358",
      "typeOrgane": "PARPOL",
      "dateDebut": "2015-12-01T01:00:00.000+01:00",
      "dateFin": "2017-06-20T02:00:00.000+02:00",
      "preseance": "5",
      "nominPrincipale": "1",
      "infosQualite": {
        "codeQualite": "Membre",
        "libQualite": "Membre",
        "libQualiteSex": "Membre"
      },
      "organesRefs": [
        "PO710396"
      ]
    },
    {
      "uid": "PM715000",
      "acteurRef": "PA267358",
      "legislature": "14",
      "typeOrgane": "GE",
      "dateDebut": "2016-10-26T02:00:00.000+02:00",
      "dateFin": "2017-06-20T02:00:00.000+02:00",
      "preseance": "20",
      "nominPrincipale": "1",
      "infosQualite": {
        "codeQualite": "Membre",
        "libQualite": "Membre",
        "libQualiteSex": "Membre"
      },
      "organesRefs": [
        "PO695581"
      ]
    }
  ]
}