{
  "uid": "PA721126",
  "etatCivil": {
    "ident": {
      "civ": "Mme",
      "prenom": "Claire",
      "nom": "Guion-Firmin",
      "alpha": "GuionFirmin",
      "trigramme": "CJV"
    },
    "infoNaissance": {
      "dateNais": "1957-09-06T01:00:00.000+01:00",
      "villeNais": "Saint-Martin",
      "depNais": "Saint-Barthélemy et Saint-Martin",
      "paysNais": "Saint-Martin"
    }
  },
  "profession": {
    "libelleCourant": "Directrice générale adjointe d'hôtel",
    "socProcInsee": {
      "catSocPro": "Cadres d'entreprise",
      "famSocPro": "Cadres et professions intellectuelles supérieures"
    }
  },
  "uriHatvp": "https://www.hatvp.fr/pages_nominatives/guion-firmin-claire",
  "adresses": [
    {
      "xsiType": "AdressePostale_Type",
      "uid": "AD721128",
      "type": "0",
      "typeLibelle": "Adresse officielle",
      "poids": "1",
      "intitule": "Assemblée nationale,",
      "numeroRue": "126",
      "nomRue": "Rue de l'Université,",
      "codePostal": "75355",
      "ville": "Paris 07 SP"
    },
    {
      "xsiType": "AdresseMail_Type",
      "uid": "AD728367",
      "type": "15",
      "typeLibelle": "Mèl",
      "valElec": "claire.javois@assemblee-nationale.fr"
    }
  ],
  "mandats": [
    {
      "uid": "PM723182",
      "acteurRef": "PA721126",
      "legislature": "15",
      "typeOrgane": "ASSEMBLEE",
      "dateDebut": "2017-06-18T02:00:00.000+02:00",
      "preseance": "50",
      "nominPrincipale": "1",
      "infosQualite": {
        "codeQualite": "membre",
        "libQualite": "membre",
        "libQualiteSex": "membre"
      },
      "organesRefs": [
        "PO717460"
      ],
      "suppleant": {
        "dateDebut": "2017-06-18T02:00:00.000+02:00",
        "suppleantRef": "PA721130"
      },
      "election": {
        "lieu": {
          "region": "Saint-Barthélemy et Saint-Martin",
          "regionType": "Collectivités d'outre-mer et Nouvelle-Calédonie",
          "departement": "Saint-Barthélemy et Saint-Martin",
          "numDepartement": "977",
          "numCirco": "1"
        },
        "causeMandat": "élections générales",
        "refCirconscription": "PO718576"
      },
      "mandature": {
        "datePriseFonction": "2017-06-21T02:00:00.000+02:00",
        "premiereElection": "0",
        "placeHemicycle": "040"
      },
      "collaborateurs": [
        {
          "qualite": "Mme",
          "prenom": "Christiane",
          "nom": "Carty"
        },
        {
          "qualite": "Mme",
          "prenom": "Jénovéfa",
          "nom": "Eche"
        }
      ]
    },
    {
      "uid": "PM724632",
      "acteurRef": "PA721126",
      "legislature": "15",
      "typeOrgane": "GP",
      "dateDebut": "2017-06-21T02:00:00.000+02:00",
      "dateFin": "2017-06-26T02:00:00.000+02:00",
      "preseance": "28",
      "nominPrincipale": "1",
      "infosQualite": {
        "codeQualite": "Député non-inscrit",
        "libQualite": "Député non-inscrit",
        "libQualiteSex": "Députée non-inscrite"
      },
      "organesRefs": [
        "PO723569"
      ]
    },
    {
      "uid": "PM731391",
      "acteurRef": "PA721126",
      "legislature": "15",
      "typeOrgane": "GP",
      "dateDebut": "2017-06-27T02:00:00.000+02:00",
      "datePublication": "2017-06-28T02:00:00.000+02:00",
      "preseance": "24",
      "nominPrincipale": "1",
      "infosQualite": {
        "codeQualite": "Membre apparenté",
        "libQualite": "Apparenté au",
        "libQualiteSex": "Apparentée au"
      },
      "organesRefs": [
        "PO730934"
      ]
    },
    {
      "uid": "PM731721",
      "acteurRef": "PA721126",
      "legislature": "15",
      "typeOrgane": "COMPER",
      "dateDebut": "2017-06-29T02:00:00.000+02:00",
      "datePublication": "2017-06-29T02:00:00.000+02:00",
      "preseance": "32",
      "nominPrincipale": "1",
      "infosQualite": {
        "codeQualite": "Membre",
        "libQualite": "Membre",
        "libQualiteSex": "Membre"
      },
      "organesRefs": [
        "PO420120"
      ]
    },
    {
      "uid": "PM732554",
      "acteurRef": "PA721126",
      "legislature": "15",
      "typeOrgane": "DELEG",
      "dateDebut": "2017-07-12T02:00:00.000+02:00",
      "datePublication": "2017-07-12T02:00:00.000+02:00",
      "preseance": "20",
      "nominPrincipale": "1",
      "infosQualite": {
        "codeQualite": "Membre",
        "libQualite": "Membre",
        "libQualiteSex": "Membre"
      },
      "organesRefs": [
        "PO675659"
      ]
    },
    {
      "uid": "PM739440",
      "acteurRef": "PA721126",
      "legislature": "15",
      "typeOrgane": "GEVI",
      "dateDebut": "2017-10-12T02:00:00.000+02:00",
      "dateFin": "2017-11-07T01:00:00.000+01:00",
      "preseance": "20",
      "nominPrincipale": "1",
      "infosQualite": {
        "codeQualite": "Membre",
        "libQualite": "Membre",
        "libQualiteSex": "Membre"
      },
      "organesRefs": [
        "PO733688"
      ]
    },
    {
      "uid": "PM739441",
      "acteurRef": "PA721126",
      "legislature": "15",
      "typeOrgane": "GA",
      "dateDebut": "2017-10-12T02:00:00.000+02:00",
      "preseance": "20",
      "nominPrincipale": "1",
      "infosQualite": {
        "codeQualite": "Membre",
        "libQualite": "Membre",
        "libQualiteSex": "Membre"
      },
      "organesRefs": [
        "PO733567"
      ]
    },
    {
      "uid": "PM740747",
      "acteurRef": "PA721126",
      "legislature": "15",
      "typeOrgane": "ORGEXTPARL",
      "dateDebut": "2017-10-23T02:00:00.000+02:00",
      "datePublication": "2017-10-24T02:00:00.000+02:00",
      "preseance": "20",
      "nominPrincipale": "1",
      "infosQualite": {
        "codeQualite": "Titulaire",
        "libQualite": "Membre titulaire",
        "libQualiteSex": "Membre titulaire"
      },
      "organesRefs": [
        "PO425985"
      ]
    },
    {
      "uid": "PM743658",
      "acteurRef": "PA721126",
      "legislature": "15",
      "typeOrgane": "MISINFOPRE",
      "dateDebut": "2017-11-22T01:00:00.000+01:00",
      "datePublication": "2017-11-22T01:00:00.000+01:00",
      "preseance": "20",
      "nominPrincipale": "0",
      "infosQualite": {
        "codeQualite": "Membre",
        "libQualite": "Membre",
        "libQualiteSex": "Membre"
      },
      "organesRefs": [
        "PO743158"
      ]
    },
    {
      "uid": "PM743877",
      "acteurRef": "PA721126",
      "legislature": "15",
      "typeOrgane": "GEVI",
      "dateDebut": "2017-11-08T01:00:00.000+01:00",
      "preseance": "20",
      "nominPrincipale": "1",
      "infosQualite": {
        "codeQualite": "Membre",
        "libQualite": "Membre",
        "libQualiteSex": "Membre"
      },
      "organesRefs": [
        "PO743840"
      ]
    },
    {
      "uid": "PM744035",
      "acteurRef": "PA721126",
      "legislature": "15",
      "typeOrgane": "MISINFOPRE",
      "dateDebut": "2017-11-24T01:00:00.000+01:00",
      "datePublication": "2017-11-24T01:00:00.000+01:00",
      "preseance": "4",
      "nominPrincipale": "1",
      "infosQualite": {
        "codeQualite": "Vice-Président",
        "libQualite": "Vice-Président",
        "libQualiteSex": "Vice-Présidente"
      },
      "organesRefs": [
        "PO743158"
      ]
    },
    {
      "uid": "PM745735",
      "acteurRef": "PA721126",
      "typeOrgane": "PARPOL",
      "dateDebut": "2017-12-01T01:00:00.000+01:00",
      "preseance": "5",
      "nominPrincipale": "1",
      "infosQualite": {
        "codeQualite": "Membre",
        "libQualite": "Membre",
        "libQualiteSex": "Membre"
      },
      "organesRefs": [
        "PO710396"
      ]
    },
    {
      "uid": "PM753705",
      "acteurRef": "PA721126",
      "legislature": "15",
      "typeOrgane": "GE",
      "dateDebut": "2018-03-15T01:00:00.000+01:00",
      "preseance": "20",
      "nominPrincipale": "1",
      "infosQualite": {
        "codeQualite": "Membre",
        "libQualite": "Membre",
        "libQualiteSex": "Membre"
      },
      "organesRefs": [
        "PO747042"
      ]
    },
    {
      "uid": "PM757329",
      "acteurRef": "PA721126",
      "legislature": "15",
      "typeOrgane": "CNPS",
      "dateDebut": "2018-06-27T02:00:00.000+02:00",
      "datePublication": "2018-06-28T02:00:00.000+02:00",
      "preseance": "20",
      "nominPrincipale": "0",
      "infosQualite": {
        "codeQualite": "Membre",
        "libQualite": "Membre",
        "libQualiteSex": "Membre"
      },
      "organesRefs": [
        "PO757134"
      ]
    },
    {
      "uid": "PM757529",
      "acteurRef": "PA721126",
      "legislature": "15",
      "typeOrgane": "CNPS",
      "dateDebut": "2018-07-03T02:00:00.000+02:00",
      "datePublication": "2018-07-04T02:00:00.000+02:00",
      "preseance": "14",
      "nominPrincipale": "1",
      "infosQualite": {
        "codeQualite": "Secrétaire",
        "libQualite": "Secrétaire",
        "libQualiteSex": "Secrétaire"
      },
      "organesRefs": [
        "PO757134"
      ]
    }
  ]
}