{
  "uid": "PO421509",
  "codeType": "CMP",
  "libelle": "Commission mixte paritaire chargée de proposer un texte sur les dispositions restant en discussion du projet de loi relatif à la protection pénale de la propriété littéraire et artistique sur internet",
  "libelleEdition": "du projet de loi relatif à la protection pénale de la propriété littéraire et artistique sur internet",
  "libelleAbrege": "Hadopi 2",
  "libelleAbrev": "498-08-09",
  "viMoDe": {
    "dateDebut": "2009-09-15T02:00:00.000+02:00",
    "dateFin": "2009-10-26T01:00:00.000+01:00"
  },
  "regime": "5ème République",
  "legislature": "13",
  "secretariat": {}
}