{
  "uid": "PA702052",
  "etatCivil": {
    "ident": {
      "civ": "Mme",
      "prenom": "Maina",
      "nom": "Sage",
      "alpha": "Sage",
      "trigramme": "MSA"
    },
    "infoNaissance": {
      "dateNais": "1975-05-10T01:00:00.000+01:00",
      "villeNais": "Papeete",
      "depNais": "Polynésie Française",
      "paysNais": "France"
    }
  },
  "profession": {
    "libelleCourant": "Consultant en communication",
    "socProcInsee": {
      "catSocPro": "Cadres d'entreprise",
      "famSocPro": "Cadres et professions intellectuelles supérieures"
    }
  },
  "uriHatvp": "https://www.hatvp.fr/pages_nominatives/sage-maina",
  "adresses": [
    {
      "xsiType": "AdressePostale_Type",
      "uid": "AD702271",
      "type": "2",
      "typeLibelle": "Adresse publiée de circonscription",
      "poids": "22",
      "intitule": "Permanence parlementaire",
      "numeroRue": "101",
      "nomRue": "Rue de l'Université",
      "codePostal": "75007",
      "ville": "Paris"
    },
    {
      "xsiType": "AdresseTelephonique_Type",
      "uid": "AD702272",
      "type": "11",
      "typeLibelle": "Téléphone",
      "poids": "22",
      "adresseDeRattachement": "AD702271",
      "valElec": "01 40 63 71 48"
    },
    {
      "xsiType": "AdressePostale_Type",
      "uid": "AD721104",
      "type": "0",
      "typeLibelle": "Adresse officielle",
      "poids": "1",
      "intitule": "Assemblée nationale,",
      "numeroRue": "126",
      "nomRue": "Rue de l'Université,",
      "codePostal": "75355",
      "ville": "Paris 07 SP"
    },
    {
      "xsiType": "AdresseSiteWeb_Type",
      "uid": "AD728642",
      "type": "25",
      "typeLibelle": "Facebook",
      "valElec": "MainaSageDeputee"
    },
    {
      "xsiType": "AdresseMail_Type",
      "uid": "AD728726",
      "type": "15",
      "typeLibelle": "Mèl",
      "valElec": "maina.sage@assemblee-nationale.fr"
    },
    {
      "xsiType": "AdresseSiteWeb_Type",
      "uid": "AD728898",
      "type": "22",
      "typeLibelle": "Site internet",
      "valElec": "www.msage-an.fr"
    },
    {
      "xsiType": "AdresseSiteWeb_Type",
      "uid": "AD728944",
      "type": "24",
      "typeLibelle": "Twitter",
      "valElec": "@MainaSage"
    }
  ],
  "mandats": [
    {
      "uid": "PM702062",
      "acteurRef": "PA702052",
      "legislature": "14",
      "typeOrgane": "ASSEMBLEE",
      "dateDebut": "2014-06-28T02:00:00.000+02:00",
      "dateFin": "2017-06-20T02:00:00.000+02:00",
      "preseance": "50",
      "nominPrincipale": "1",
      "infosQualite": {
        "codeQualite": "membre",
        "libQualite": "membre",
        "libQualiteSex": "membre"
      },
      "organesRefs": [
        "PO644420"
      ],
      "suppleant": {
        "dateDebut": "2014-06-28T02:00:00.000+02:00",
        "dateFin": "2017-06-20T02:00:00.000+02:00",
        "suppleantRef": "PA1373"
      },
      "election": {
        "lieu": {
          "region": "Polynésie française",
          "regionType": "Collectivités d'outre-mer et Nouvelle-Calédonie",
          "departement": "Polynésie Française",
          "numDepartement": "987",
          "numCirco": "1"
        },
        "causeMandat": "élection partielle, remplacement d'un député démissionnaire",
        "refCirconscription": "PO644994"
      },
      "mandature": {
        "datePriseFonction": "2014-06-30T02:00:00.000+02:00",
        "causeFin": "Fin de législature",
        "premiereElection": "0",
        "placeHemicycle": "132"
      }
    },
    {
      "uid": "PM702323",
      "acteurRef": "PA702052",
      "legislature": "14",
      "typeOrgane": "GP",
      "dateDebut": "2014-06-30T02:00:00.000+02:00",
      "datePublication": "2014-07-01T02:00:00.000+02:00",
      "dateFin": "2014-07-07T02:00:00.000+02:00",
      "preseance": "28",
      "nominPrincipale": "1",
      "infosQualite": {
        "codeQualite": "Député non-inscrit",
        "libQualite": "Député non-inscrit",
        "libQualiteSex": "Députée non-inscrite"
      },
      "organesRefs": [
        "PO645633"
      ]
    },
    {
      "uid": "PM702324",
      "acteurRef": "PA702052",
      "legislature": "14",
      "typeOrgane": "GP",
      "dateDebut": "2014-07-07T02:00:00.000+02:00",
      "datePublication": "2014-07-08T02:00:00.000+02:00",
      "dateFin": "2017-06-20T02:00:00.000+02:00",
      "preseance": "20",
      "nominPrincipale": "1",
      "infosQualite": {
        "codeQualite": "Membre",
        "libQualite": "Membre du",
        "libQualiteSex": "Membre du"
      },
      "organesRefs": [
        "PO656010"
      ]
    },
    {
      "uid": "PM702429",
      "acteurRef": "PA702052",
      "legislature": "14",
      "typeOrgane": "COMPER",
      "dateDebut": "2014-07-10T02:00:00.000+02:00",
      "datePublication": "2014-07-11T02:00:00.000+02:00",
      "dateFin": "2014-11-06T01:00:00.000+01:00",
      "preseance": "32",
      "nominPrincipale": "1",
      "infosQualite": {
        "codeQualite": "Membre",
        "libQualite": "Membre",
        "libQualiteSex": "Membre"
      },
      "organesRefs": [
        "PO59051"
      ]
    },
    {
      "uid": "PM702503",
      "acteurRef": "PA702052",
      "legislature": "14",
      "typeOrgane": "DELEG",
      "dateDebut": "2014-07-01T02:00:00.000+02:00",
      "datePublication": "2014-07-01T02:00:00.000+02:00",
      "dateFin": "2017-06-20T02:00:00.000+02:00",
      "preseance": "20",
      "nominPrincipale": "1",
      "infosQualite": {
        "codeQualite": "Membre",
        "libQualite": "Membre",
        "libQualiteSex": "Membre"
      },
      "organesRefs": [
        "PO675659"
      ]
    },
    {
      "uid": "PM702504",
      "acteurRef": "PA702052",
      "legislature": "14",
      "typeOrgane": "DELEG",
      "dateDebut": "2014-07-01T02:00:00.000+02:00",
      "datePublication": "2014-07-01T02:00:00.000+02:00",
      "dateFin": "2017-06-20T02:00:00.000+02:00",
      "preseance": "21",
      "nominPrincipale": "0",
      "infosQualite": {
        "codeQualite": "Membre de droit",
        "libQualite": "Membre de droit",
        "libQualiteSex": "Membre de droit"
      },
      "organesRefs": [
        "PO675659"
      ]
    },
    {
      "uid": "PM703121",
      "acteurRef": "PA702052",
      "legislature": "14",
      "typeOrgane": "DELEG",
      "dateDebut": "2014-09-10T02:00:00.000+02:00",
      "datePublication": "2014-09-10T02:00:00.000+02:00",
      "dateFin": "2017-06-20T02:00:00.000+02:00",
      "preseance": "20",
      "nominPrincipale": "1",
      "infosQualite": {
        "codeQualite": "Membre",
        "libQualite": "Membre",
        "libQualiteSex": "Membre"
      },
      "organesRefs": [
        "PO201269"
      ]
    },
    {
      "uid": "PM704550",
      "acteurRef": "PA702052",
      "legislature": "14",
      "typeOrgane": "COMPER",
      "dateDebut": "2014-11-07T01:00:00.000+01:00",
      "datePublication": "2014-11-07T01:00:00.000+01:00",
      "dateFin": "2014-11-13T01:00:00.000+01:00",
      "preseance": "32",
      "nominPrincipale": "1",
      "infosQualite": {
        "codeQualite": "Membre",
        "libQualite": "Membre",
        "libQualiteSex": "Membre"
      },
      "organesRefs": [
        "PO419604"
      ]
    },
    {
      "uid": "PM704587",
      "acteurRef": "PA702052",
      "legislature": "14",
      "typeOrgane": "COMPER",
      "dateDebut": "2014-11-13T01:00:00.000+01:00",
      "datePublication": "2014-11-13T01:00:00.000+01:00",
      "dateFin": "2014-11-26T01:00:00.000+01:00",
      "preseance": "32",
      "nominPrincipale": "1",
      "infosQualite": {
        "codeQualite": "Membre",
        "libQualite": "Membre",
        "libQualiteSex": "Membre"
      },
      "organesRefs": [
        "PO59051"
      ]
    },
    {
      "uid": "PM704750",
      "acteurRef": "PA702052",
      "legislature": "14",
      "typeOrgane": "COMPER",
      "dateDebut": "2014-11-27T01:00:00.000+01:00",
      "datePublication": "2014-11-27T01:00:00.000+01:00",
      "dateFin": "2014-11-27T01:00:00.000+01:00",
      "preseance": "32",
      "nominPrincipale": "1",
      "infosQualite": {
        "codeQualite": "Membre",
        "libQualite": "Membre",
        "libQualiteSex": "Membre"
      },
      "organesRefs": [
        "PO419604"
      ]
    },
    {
      "uid": "PM704792",
      "acteurRef": "PA702052",
      "legislature": "14",
      "typeOrgane": "COMPER",
      "dateDebut": "2014-11-28T01:00:00.000+01:00",
      "datePublication": "2014-11-28T01:00:00.000+01:00",
      "dateFin": "2015-03-28T01:00:00.000+01:00",
      "preseance": "32",
      "nominPrincipale": "1",
      "infosQualite": {
        "codeQualite": "Membre",
        "libQualite": "Membre",
        "libQualiteSex": "Membre"
      },
      "organesRefs": [
        "PO59051"
      ]
    },
    {
      "uid": "PM705100",
      "acteurRef": "PA702052",
      "typeOrgane": "PARPOL",
      "dateDebut": "2014-12-01T01:00:00.000+01:00",
      "dateFin": "2015-11-30T01:00:00.000+01:00",
      "preseance": "5",
      "nominPrincipale": "1",
      "infosQualite": {
        "codeQualite": "Membre",
        "libQualite": "Membre",
        "libQualiteSex": "Membre"
      },
      "organesRefs": [
        "PO686032"
      ]
    },
    {
      "uid": "PM706634",
      "acteurRef": "PA702052",
      "legislature": "14",
      "typeOrgane": "COMPER",
      "dateDebut": "2015-03-28T01:00:00.000+01:00",
      "datePublication": "2015-03-28T01:00:00.000+01:00",
      "dateFin": "2015-04-17T02:00:00.000+02:00",
      "preseance": "32",
      "nominPrincipale": "1",
      "infosQualite": {
        "codeQualite": "Membre",
        "libQualite": "Membre",
        "libQualiteSex": "Membre"
      },
      "organesRefs": [
        "PO420120"
      ]
    },
    {
      "uid": "PM707283",
      "acteurRef": "PA702052",
      "legislature": "14",
      "typeOrgane": "COMPER",
      "dateDebut": "2015-04-18T02:00:00.000+02:00",
      "datePublication": "2015-04-18T02:00:00.000+02:00",
      "dateFin": "2015-06-12T02:00:00.000+02:00",
      "preseance": "32",
      "nominPrincipale": "1",
      "infosQualite": {
        "codeQualite": "Membre",
        "libQualite": "Membre",
        "libQualiteSex": "Membre"
      },
      "organesRefs": [
        "PO59051"
      ]
    },
    {
      "uid": "PM708596",
      "acteurRef": "PA702052",
      "legislature": "14",
      "typeOrgane": "COMPER",
      "dateDebut": "2015-06-13T02:00:00.000+02:00",
      "datePublication": "2015-06-13T02:00:00.000+02:00",
      "dateFin": "2015-06-19T02:00:00.000+02:00",
      "preseance": "32",
      "nominPrincipale": "1",
      "infosQualite": {
        "codeQualite": "Membre",
        "libQualite": "Membre",
        "libQualiteSex": "Membre"
      },
      "organesRefs": [
        "PO420120"
      ]
    },
    {
      "uid": "PM708683",
      "acteurRef": "PA702052",
      "legislature": "14",
      "typeOrgane": "COMPER",
      "dateDebut": "2015-06-20T02:00:00.000+02:00",
      "datePublication": "2015-06-20T02:00:00.000+02:00",
      "dateFin": "2015-12-08T01:00:00.000+01:00",
      "preseance": "32",
      "nominPrincipale": "1",
      "infosQualite": {
        "codeQualite": "Membre",
        "libQualite": "Membre",
        "libQualiteSex": "Membre"
      },
      "organesRefs": [
        "PO59051"
      ]
    },
    {
      "uid": "PM709143",
      "acteurRef": "PA702052",
      "legislature": "14",
      "typeOrgane": "ORGEXTPARL",
      "dateDebut": "2015-07-31T02:00:00.000+02:00",
      "datePublication": "2015-07-31T02:00:00.000+02:00",
      "dateFin": "2017-06-20T02:00:00.000+02:00",
      "preseance": "20",
      "nominPrincipale": "1",
      "infosQualite": {
        "codeQualite": "Titulaire",
        "libQualite": "Membre titulaire",
        "libQualiteSex": "Membre titulaire"
      },
      "organesRefs": [
        "PO425985"
      ]
    },
    {
      "uid": "PM709454",
      "acteurRef": "PA702052",
      "legislature": "14",
      "typeOrgane": "CMP",
      "dateDebut": "2015-09-24T02:00:00.000+02:00",
      "datePublication": "2015-09-25T02:00:00.000+02:00",
      "dateFin": "2015-10-07T02:00:00.000+02:00",
      "preseance": "28",
      "nominPrincipale": "1",
      "infosQualite": {
        "codeQualite": "Suppléant",
        "libQualite": "Membre suppléant",
        "libQualiteSex": "Membre suppléante"
      },
      "organesRefs": [
        "PO709067"
      ]
    },
    {
      "uid": "PM710633",
      "acteurRef": "PA702052",
      "typeOrgane": "PARPOL",
      "dateDebut": "2015-12-01T01:00:00.000+01:00",
      "dateFin": "2016-11-30T01:00:00.000+01:00",
      "preseance": "5",
      "nominPrincipale": "1",
      "infosQualite": {
        "codeQualite": "Membre",
        "libQualite": "Membre",
        "libQualiteSex": "Membre"
      },
      "organesRefs": [
        "PO710630"
      ]
    },
    {
      "uid": "PM710666",
      "acteurRef": "PA702052",
      "legislature": "14",
      "typeOrgane": "COMPER",
      "dateDebut": "2015-12-09T01:00:00.000+01:00",
      "datePublication": "2015-12-09T01:00:00.000+01:00",
      "dateFin": "2016-01-08T01:00:00.000+01:00",
      "preseance": "32",
      "nominPrincipale": "1",
      "infosQualite": {
        "codeQualite": "Membre",
        "libQualite": "Membre",
        "libQualiteSex": "Membre"
      },
      "organesRefs": [
        "PO59048"
      ]
    },
    {
      "uid": "PM711076",
      "acteurRef": "PA702052",
      "legislature": "14",
      "typeOrgane": "COMPER",
      "dateDebut": "2016-01-09T01:00:00.000+01:00",
      "datePublication": "2016-01-09T01:00:00.000+01:00",
      "dateFin": "2016-03-22T01:00:00.000+01:00",
      "preseance": "32",
      "nominPrincipale": "1",
      "infosQualite": {
        "codeQualite": "Membre",
        "libQualite": "Membre",
        "libQualiteSex": "Membre"
      },
      "organesRefs": [
        "PO59051"
      ]
    },
    {
      "uid": "PM711434",
      "acteurRef": "PA702052",
      "legislature": "14",
      "typeOrgane": "CNPE",
      "dateDebut": "2016-02-04T01:00:00.000+01:00",
      "datePublication": "2016-02-05T01:00:00.000+01:00",
      "dateFin": "2016-07-13T02:00:00.000+02:00",
      "preseance": "20",
      "nominPrincipale": "1",
      "infosQualite": {
        "codeQualite": "Membre",
        "libQualite": "Membre",
        "libQualiteSex": "Membre"
      },
      "organesRefs": [
        "PO711267"
      ]
    },
    {
      "uid": "PM712045",
      "acteurRef": "PA702052",
      "legislature": "14",
      "typeOrgane": "COMPER",
      "dateDebut": "2016-03-23T01:00:00.000+01:00",
      "datePublication": "2016-03-23T01:00:00.000+01:00",
      "dateFin": "2016-04-08T02:00:00.000+02:00",
      "preseance": "32",
      "nominPrincipale": "1",
      "infosQualite": {
        "codeQualite": "Membre",
        "libQualite": "Membre",
        "libQualiteSex": "Membre"
      },
      "organesRefs": [
        "PO59047"
      ]
    },
    {
      "uid": "PM712351",
      "acteurRef": "PA702052",
      "legislature": "14",
      "typeOrgane": "COMPER",
      "dateDebut": "2016-04-09T02:00:00.000+02:00",
      "datePublication": "2016-04-09T02:00:00.000+02:00",
      "dateFin": "2016-12-05T01:00:00.000+01:00",
      "preseance": "32",
      "nominPrincipale": "1",
      "infosQualite": {
        "codeQualite": "Membre",
        "libQualite": "Membre",
        "libQualiteSex": "Membre"
      },
      "organesRefs": [
        "PO59051"
      ]
    },
    {
      "uid": "PM712421",
      "acteurRef": "PA702052",
      "legislature": "14",
      "typeOrgane": "GE",
      "dateDebut": "2016-04-25T02:00:00.000+02:00",
      "dateFin": "2017-06-20T02:00:00.000+02:00",
      "preseance": "20",
      "nominPrincipale": "1",
      "infosQualite": {
        "codeQualite": "Membre",
        "libQualite": "Membre",
        "libQualiteSex": "Membre"
      },
      "organesRefs": [
        "PO712100"
      ]
    },
    {
      "uid": "PM712486",
      "acteurRef": "PA702052",
      "legislature": "14",
      "typeOrgane": "GE",
      "dateDebut": "2016-04-26T02:00:00.000+02:00",
      "dateFin": "2017-06-20T02:00:00.000+02:00",
      "preseance": "12",
      "nominPrincipale": "1",
      "infosQualite": {
        "codeQualite": "Secrétaire",
        "libQualite": "Secrétaire",
        "libQualiteSex": "Secrétaire"
      },
      "organesRefs": [
        "PO712100"
      ]
    },
    {
      "uid": "PM713534",
      "acteurRef": "PA702052",
      "legislature": "14",
      "typeOrgane": "GE",
      "dateDebut": "2016-05-31T02:00:00.000+02:00",
      "dateFin": "2017-06-20T02:00:00.000+02:00",
      "preseance": "20",
      "nominPrincipale": "1",
      "infosQualite": {
        "codeQualite": "Membre",
        "libQualite": "Membre",
        "libQualiteSex": "Membre"
      },
      "organesRefs": [
        "PO712794"
      ]
    },
    {
      "uid": "PM715744",
      "acteurRef": "PA702052",
      "typeOrgane": "PARPOL",
      "dateDebut": "2016-12-01T01:00:00.000+01:00",
      "dateFin": "2017-06-20T02:00:00.000+02:00",
      "preseance": "5",
      "nominPrincipale": "1",
      "infosQualite": {
        "codeQualite": "Membre",
        "libQualite": "Membre",
        "libQualiteSex": "Membre"
      },
      "organesRefs": [
        "PO715738"
      ]
    },
    {
      "uid": "PM715751",
      "acteurRef": "PA702052",
      "legislature": "14",
      "typeOrgane": "COMPER",
      "dateDebut": "2016-12-06T01:00:00.000+01:00",
      "datePublication": "2016-12-06T01:00:00.000+01:00",
      "dateFin": "2016-12-08T01:00:00.000+01:00",
      "preseance": "32",
      "nominPrincipale": "1",
      "infosQualite": {
        "codeQualite": "Membre",
        "libQualite": "Membre",
        "libQualiteSex": "Membre"
      },
      "organesRefs": [
        "PO420120"
      ]
    },
    {
      "uid": "PM715962",
      "acteurRef": "PA702052",
      "legislature": "14",
      "typeOrgane": "COMPER",
      "dateDebut": "2016-12-09T01:00:00.000+01:00",
      "datePublication": "2016-12-09T01:00:00.000+01:00",
      "dateFin": "2017-01-30T01:00:00.000+01:00",
      "preseance": "32",
      "nominPrincipale": "1",
      "infosQualite": {
        "codeQualite": "Membre",
        "libQualite": "Membre",
        "libQualiteSex": "Membre"
      },
      "organesRefs": [
        "PO59051"
      ]
    },
    {
      "uid": "PM716667",
      "acteurRef": "PA702052",
      "legislature": "14",
      "typeOrgane": "COMPER",
      "dateDebut": "2017-01-31T01:00:00.000+01:00",
      "datePublication": "2017-01-31T01:00:00.000+01:00",
      "dateFin": "2017-02-01T01:00:00.000+01:00",
      "preseance": "32",
      "nominPrincipale": "1",
      "infosQualite": {
        "codeQualite": "Membre",
        "libQualite": "Membre",
        "libQualiteSex": "Membre"
      },
      "organesRefs": [
        "PO419610"
      ]
    },
    {
      "uid": "PM716720",
      "acteurRef": "PA702052",
      "legislature": "14",
      "typeOrgane": "COMPER",
      "dateDebut": "2017-02-02T01:00:00.000+01:00",
      "datePublication": "2017-02-02T01:00:00.000+01:00",
      "dateFin": "2017-06-20T02:00:00.000+02:00",
      "preseance": "32",
      "nominPrincipale": "1",
      "infosQualite": {
        "codeQualite": "Membre",
        "libQualite": "Membre",
        "libQualiteSex": "Membre"
      },
      "organesRefs": [
        "PO59051"
      ]
    },
    {
      "uid": "PM723172",
      "acteurRef": "PA702052",
      "legislature": "15",
      "typeOrgane": "ASSEMBLEE",
      "dateDebut": "2017-06-18T02:00:00.000+02:00",
      "preseance": "50",
      "nominPrincipale": "1",
      "infosQualite": {
        "codeQualite": "membre",
        "libQualite": "membre",
        "libQualiteSex": "membre"
      },
      "organesRefs": [
        "PO717460"
      ],
      "suppleant": {
        "dateDebut": "2017-06-18T02:00:00.000+02:00",
        "suppleantRef": "PA721106"
      },
      "election": {
        "lieu": {
          "region": "Polynésie française",
          "regionType": "Collectivités d'outre-mer et Nouvelle-Calédonie",
          "departement": "Polynésie Française",
          "numDepartement": "987",
          "numCirco": "1"
        },
        "causeMandat": "élections générales",
        "refCirconscription": "PO718560"
      },
      "mandature": {
        "datePriseFonction": "2017-06-21T02:00:00.000+02:00",
        "premiereElection": "1",
        "placeHemicycle": "132"
      },
      "collaborateurs": [
        {
          "qualite": "Mme",
          "prenom": "France",
          "nom": "Durocher"
        },
        {
          "qualite": "M.",
          "prenom": "Arthur",
          "nom": "Letourneulx"
        },
        {
          "qualite": "M.",
          "prenom": "Arnaud",
          "nom": "Busseuil"
        },
        {
          "qualite": "Mme",
          "prenom": "Violette",
          "nom": "Jaillot"
        }
      ]
    },
    {
      "uid": "PM724627",
      "acteurRef": "PA702052",
      "legislature": "15",
      "typeOrgane": "GP",
      "dateDebut": "2017-06-21T02:00:00.000+02:00",
      "dateFin": "2017-06-26T02:00:00.000+02:00",
      "preseance": "28",
      "nominPrincipale": "1",
      "infosQualite": {
        "codeQualite": "Député non-inscrit",
        "libQualite": "Député non-inscrit",
        "libQualiteSex": "Députée non-inscrite"
      },
      "organesRefs": [
        "PO723569"
      ]
    },
    {
      "uid": "PM731462",
      "acteurRef": "PA702052",
      "legislature": "15",
      "typeOrgane": "GP",
      "dateDebut": "2017-06-27T02:00:00.000+02:00",
      "datePublication": "2017-06-28T02:00:00.000+02:00",
      "dateFin": "2017-11-28T01:00:00.000+01:00",
      "preseance": "20",
      "nominPrincipale": "1",
      "infosQualite": {
        "codeQualite": "Membre",
        "libQualite": "Membre du",
        "libQualiteSex": "Membre du"
      },
      "organesRefs": [
        "PO730952"
      ]
    },
    {
      "uid": "PM731826",
      "acteurRef": "PA702052",
      "legislature": "15",
      "typeOrgane": "COMPER",
      "dateDebut": "2017-06-29T02:00:00.000+02:00",
      "datePublication": "2017-06-29T02:00:00.000+02:00",
      "preseance": "32",
      "nominPrincipale": "1",
      "infosQualite": {
        "codeQualite": "Membre",
        "libQualite": "Membre",
        "libQualiteSex": "Membre"
      },
      "organesRefs": [
        "PO59051"
      ]
    },
    {
      "uid": "PM732385",
      "acteurRef": "PA702052",
      "legislature": "15",
      "typeOrgane": "COMNL",
      "dateDebut": "2017-07-05T02:00:00.000+02:00",
      "datePublication": "2017-07-05T02:00:00.000+02:00",
      "preseance": "20",
      "nominPrincipale": "1",
      "infosQualite": {
        "codeQualite": "Membre",
        "libQualite": "Membre",
        "libQualiteSex": "Membre"
      },
      "organesRefs": [
        "PO415287"
      ]
    },
    {
      "uid": "PM732549",
      "acteurRef": "PA702052",
      "legislature": "15",
      "typeOrgane": "DELEG",
      "dateDebut": "2017-07-12T02:00:00.000+02:00",
      "datePublication": "2017-07-12T02:00:00.000+02:00",
      "preseance": "20",
      "nominPrincipale": "1",
      "infosQualite": {
        "codeQualite": "Membre",
        "libQualite": "Membre",
        "libQualiteSex": "Membre"
      },
      "organesRefs": [
        "PO675659"
      ]
    },
    {
      "uid": "PM735219",
      "acteurRef": "PA702052",
      "legislature": "15",
      "typeOrgane": "GEVI",
      "dateDebut": "2017-09-26T02:00:00.000+02:00",
      "dateFin": "2017-11-07T01:00:00.000+01:00",
      "preseance": "20",
      "nominPrincipale": "0",
      "infosQualite": {
        "codeQualite": "Membre",
        "libQualite": "Membre",
        "libQualiteSex": "Membre"
      },
      "organesRefs": [
        "PO733688"
      ]
    },
    {
      "uid": "PM735220",
      "acteurRef": "PA702052",
      "legislature": "15",
      "typeOrgane": "GEVI",
      "dateDebut": "2017-09-26T02:00:00.000+02:00",
      "dateFin": "2017-11-07T01:00:00.000+01:00",
      "preseance": "1",
      "nominPrincipale": "1",
      "infosQualite": {
        "codeQualite": "Président",
        "libQualite": "Président",
        "libQualiteSex": "Président"
      },
      "organesRefs": [
        "PO733688"
      ]
    },
    {
      "uid": "PM737682",
      "acteurRef": "PA702052",
      "legislature": "15",
      "typeOrgane": "ORGEXTPARL",
      "dateDebut": "2017-10-04T02:00:00.000+02:00",
      "datePublication": "2017-10-05T02:00:00.000+02:00",
      "preseance": "20",
      "nominPrincipale": "1",
      "infosQualite": {
        "codeQualite": "Titulaire",
        "libQualite": "Membre titulaire",
        "libQualiteSex": "Membre titulaire"
      },
      "organesRefs": [
        "PO717440"
      ]
    },
    {
      "uid": "PM738703",
      "acteurRef": "PA702052",
      "legislature": "15",
      "typeOrgane": "GA",
      "dateDebut": "2017-10-10T02:00:00.000+02:00",
      "preseance": "20",
      "nominPrincipale": "1",
      "infosQualite": {
        "codeQualite": "Membre",
        "libQualite": "Membre",
        "libQualiteSex": "Membre"
      },
      "organesRefs": [
        "PO732949"
      ]
    },
    {
      "uid": "PM738704",
      "acteurRef": "PA702052",
      "legislature": "15",
      "typeOrgane": "GA",
      "dateDebut": "2017-10-10T02:00:00.000+02:00",
      "preseance": "20",
      "nominPrincipale": "1",
      "infosQualite": {
        "codeQualite": "Membre",
        "libQualite": "Membre",
        "libQualiteSex": "Membre"
      },
      "organesRefs": [
        "PO732974"
      ]
    },
    {
      "uid": "PM738705",
      "acteurRef": "PA702052",
      "legislature": "15",
      "typeOrgane": "GA",
      "dateDebut": "2017-10-10T02:00:00.000+02:00",
      "preseance": "20",
      "nominPrincipale": "1",
      "infosQualite": {
        "codeQualite": "Membre",
        "libQualite": "Membre",
        "libQualiteSex": "Membre"
      },
      "organesRefs": [
        "PO733001"
      ]
    },
    {
      "uid": "PM738706",
      "acteurRef": "PA702052",
      "legislature": "15",
      "typeOrgane": "GA",
      "dateDebut": "2017-10-10T02:00:00.000+02:00",
      "preseance": "20",
      "nominPrincipale": "1",
      "infosQualite": {
        "codeQualite": "Membre",
        "libQualite": "Membre",
        "libQualiteSex": "Membre"
      },
      "organesRefs": [
        "PO733032"
      ]
    },
    {
      "uid": "PM738707",
      "acteurRef": "PA702052",
      "legislature": "15",
      "typeOrgane": "GA",
      "dateDebut": "2017-10-10T02:00:00.000+02:00",
      "preseance": "20",
      "nominPrincipale": "1",
      "infosQualite": {
        "codeQualite": "Membre",
        "libQualite": "Membre",
        "libQualiteSex": "Membre"
      },
      "organesRefs": [
        "PO733102"
      ]
    },
    {
      "uid": "PM738708",
      "acteurRef": "PA702052",
      "legislature": "15",
      "typeOrgane": "GA",
      "dateDebut": "2017-10-10T02:00:00.000+02:00",
      "preseance": "20",
      "nominPrincipale": "1",
      "infosQualite": {
        "codeQualite": "Membre",
        "libQualite": "Membre",
        "libQualiteSex": "Membre"
      },
      "organesRefs": [
        "PO733112"
      ]
    },
    {
      "uid": "PM738709",
      "acteurRef": "PA702052",
      "legislature": "15",
      "typeOrgane": "GA",
      "dateDebut": "2017-10-10T02:00:00.000+02:00",
      "preseance": "20",
      "nominPrincipale": "1",
      "infosQualite": {
        "codeQualite": "Membre",
        "libQualite": "Membre",
        "libQualiteSex": "Membre"
      },
      "organesRefs": [
        "PO733117"
      ]
    },
    {
      "uid": "PM738710",
      "acteurRef": "PA702052",
      "legislature": "15",
      "typeOrgane": "GA",
      "dateDebut": "2017-10-10T02:00:00.000+02:00",
      "preseance": "20",
      "nominPrincipale": "1",
      "infosQualite": {
        "codeQualite": "Membre",
        "libQualite": "Membre",
        "libQualiteSex": "Membre"
      },
      "organesRefs": [
        "PO733122"
      ]
    },
    {
      "uid": "PM738711",
      "acteurRef": "PA702052",
      "legislature": "15",
      "typeOrgane": "GA",
      "dateDebut": "2017-10-10T02:00:00.000+02:00",
      "preseance": "20",
      "nominPrincipale": "1",
      "infosQualite": {
        "codeQualite": "Membre",
        "libQualite": "Membre",
        "libQualiteSex": "Membre"
      },
      "organesRefs": [
        "PO733322"
      ]
    },
    {
      "uid": "PM738712",
      "acteurRef": "PA702052",
      "legislature": "15",
      "typeOrgane": "GA",
      "dateDebut": "2017-10-10T02:00:00.000+02:00",
      "preseance": "20",
      "nominPrincipale": "1",
      "infosQualite": {
        "codeQualite": "Membre",
        "libQualite": "Membre",
        "libQualiteSex": "Membre"
      },
      "organesRefs": [
        "PO733372"
      ]
    },
    {
      "uid": "PM738713",
      "acteurRef": "PA702052",
      "legislature": "15",
      "typeOrgane": "GA",
      "dateDebut": "2017-10-10T02:00:00.000+02:00",
      "dateFin": "2018-02-20T01:00:00.000+01:00",
      "preseance": "20",
      "nominPrincipale": "1",
      "infosQualite": {
        "codeQualite": "Membre",
        "libQualite": "Membre",
        "libQualiteSex": "Membre"
      },
      "organesRefs": [
        "PO733412"
      ]
    },
    {
      "uid": "PM738714",
      "acteurRef": "PA702052",
      "legislature": "15",
      "typeOrgane": "GA",
      "dateDebut": "2017-10-10T02:00:00.000+02:00",
      "preseance": "20",
      "nominPrincipale": "1",
      "infosQualite": {
        "codeQualite": "Membre",
        "libQualite": "Membre",
        "libQualiteSex": "Membre"
      },
      "organesRefs": [
        "PO733492"
      ]
    },
    {
      "uid": "PM738715",
      "acteurRef": "PA702052",
      "legislature": "15",
      "typeOrgane": "GA",
      "dateDebut": "2017-10-10T02:00:00.000+02:00",
      "preseance": "20",
      "nominPrincipale": "1",
      "infosQualite": {
        "codeQualite": "Membre",
        "libQualite": "Membre",
        "libQualiteSex": "Membre"
      },
      "organesRefs": [
        "PO733567"
      ]
    },
    {
      "uid": "PM738716",
      "acteurRef": "PA702052",
      "legislature": "15",
      "typeOrgane": "GA",
      "dateDebut": "2017-10-10T02:00:00.000+02:00",
      "preseance": "20",
      "nominPrincipale": "0",
      "infosQualite": {
        "codeQualite": "Membre",
        "libQualite": "Membre",
        "libQualiteSex": "Membre"
      },
      "organesRefs": [
        "PO733597"
      ]
    },
    {
      "uid": "PM738717",
      "acteurRef": "PA702052",
      "legislature": "15",
      "typeOrgane": "GA",
      "dateDebut": "2017-10-10T02:00:00.000+02:00",
      "preseance": "20",
      "nominPrincipale": "0",
      "infosQualite": {
        "codeQualite": "Membre",
        "libQualite": "Membre",
        "libQualiteSex": "Membre"
      },
      "organesRefs": [
        "PO733617"
      ]
    },
    {
      "uid": "PM738718",
      "acteurRef": "PA702052",
      "legislature": "15",
      "typeOrgane": "GA",
      "dateDebut": "2017-10-10T02:00:00.000+02:00",
      "preseance": "20",
      "nominPrincipale": "1",
      "infosQualite": {
        "codeQualite": "Membre",
        "libQualite": "Membre",
        "libQualiteSex": "Membre"
      },
      "organesRefs": [
        "PO733652"
      ]
    },
    {
      "uid": "PM738719",
      "acteurRef": "PA702052",
      "legislature": "15",
      "typeOrgane": "GA",
      "dateDebut": "2017-10-10T02:00:00.000+02:00",
      "preseance": "20",
      "nominPrincipale": "1",
      "infosQualite": {
        "codeQualite": "Membre",
        "libQualite": "Membre",
        "libQualiteSex": "Membre"
      },
      "organesRefs": [
        "PO733672"
      ]
    },
    {
      "uid": "PM738720",
      "acteurRef": "PA702052",
      "legislature": "15",
      "typeOrgane": "GA",
      "dateDebut": "2017-10-10T02:00:00.000+02:00",
      "preseance": "20",
      "nominPrincipale": "1",
      "infosQualite": {
        "codeQualite": "Membre",
        "libQualite": "Membre",
        "libQualiteSex": "Membre"
      },
      "organesRefs": [
        "PO733683"
      ]
    },
    {
      "uid": "PM739538",
      "acteurRef": "PA702052",
      "legislature": "15",
      "typeOrgane": "GA",
      "dateDebut": "2017-10-12T02:00:00.000+02:00",
      "preseance": "20",
      "nominPrincipale": "0",
      "infosQualite": {
        "codeQualite": "Membre",
        "libQualite": "Membre",
        "libQualiteSex": "Membre"
      },
      "organesRefs": [
        "PO733522"
      ]
    },
    {
      "uid": "PM741778",
      "acteurRef": "PA702052",
      "legislature": "15",
      "typeOrgane": "GA",
      "dateDebut": "2017-10-25T02:00:00.000+02:00",
      "preseance": "8",
      "nominPrincipale": "1",
      "infosQualite": {
        "codeQualite": "Vice-Président",
        "libQualite": "Vice-Président",
        "libQualiteSex": "Vice-Présidente"
      },
      "organesRefs": [
        "PO733597"
      ]
    },
    {
      "uid": "PM742256",
      "acteurRef": "PA702052",
      "legislature": "15",
      "typeOrgane": "GA",
      "dateDebut": "2017-10-31T01:00:00.000+01:00",
      "preseance": "8",
      "nominPrincipale": "1",
      "infosQualite": {
        "codeQualite": "Vice-Président",
        "libQualite": "Vice-Président",
        "libQualiteSex": "Vice-Présidente"
      },
      "organesRefs": [
        "PO733617"
      ]
    },
    {
      "uid": "PM742656",
      "acteurRef": "PA702052",
      "legislature": "15",
      "typeOrgane": "GA",
      "dateDebut": "2017-11-08T01:00:00.000+01:00",
      "preseance": "8",
      "nominPrincipale": "1",
      "infosQualite": {
        "codeQualite": "Vice-Président",
        "libQualite": "Vice-Président",
        "libQualiteSex": "Vice-Présidente"
      },
      "organesRefs": [
        "PO733522"
      ]
    },
    {
      "uid": "PM743656",
      "acteurRef": "PA702052",
      "legislature": "15",
      "typeOrgane": "MISINFOPRE",
      "dateDebut": "2017-11-22T01:00:00.000+01:00",
      "datePublication": "2017-11-22T01:00:00.000+01:00",
      "preseance": "20",
      "nominPrincipale": "0",
      "infosQualite": {
        "codeQualite": "Membre",
        "libQualite": "Membre",
        "libQualiteSex": "Membre"
      },
      "organesRefs": [
        "PO743158"
      ]
    },
    {
      "uid": "PM743732",
      "acteurRef": "PA702052",
      "legislature": "15",
      "typeOrgane": "ORGEXTPARL",
      "dateDebut": "2017-11-21T01:00:00.000+01:00",
      "datePublication": "2017-11-22T01:00:00.000+01:00",
      "preseance": "30",
      "nominPrincipale": "1",
      "infosQualite": {
        "codeQualite": "Suppléant",
        "libQualite": "Membre suppléant",
        "libQualiteSex": "Membre suppléante"
      },
      "organesRefs": [
        "PO429559"
      ]
    },
    {
      "uid": "PM743874",
      "acteurRef": "PA702052",
      "legislature": "15",
      "typeOrgane": "GEVI",
      "dateDebut": "2017-11-08T01:00:00.000+01:00",
      "preseance": "20",
      "nominPrincipale": "0",
      "infosQualite": {
        "codeQualite": "Membre",
        "libQualite": "Membre",
        "libQualiteSex": "Membre"
      },
      "organesRefs": [
        "PO743840"
      ]
    },
    {
      "uid": "PM743885",
      "acteurRef": "PA702052",
      "legislature": "15",
      "typeOrgane": "GEVI",
      "dateDebut": "2017-11-08T01:00:00.000+01:00",
      "preseance": "1",
      "nominPrincipale": "1",
      "infosQualite": {
        "codeQualite": "Président",
        "libQualite": "Président",
        "libQualiteSex": "Président"
      },
      "organesRefs": [
        "PO743840"
      ]
    },
    {
      "uid": "PM744032",
      "acteurRef": "PA702052",
      "legislature": "15",
      "typeOrgane": "MISINFOPRE",
      "dateDebut": "2017-11-24T01:00:00.000+01:00",
      "datePublication": "2017-11-24T01:00:00.000+01:00",
      "preseance": "1",
      "nominPrincipale": "1",
      "infosQualite": {
        "codeQualite": "Président",
        "libQualite": "Président",
        "libQualiteSex": "Présidente"
      },
      "organesRefs": [
        "PO743158"
      ]
    },
    {
      "uid": "PM744450",
      "acteurRef": "PA702052",
      "legislature": "15",
      "typeOrgane": "GP",
      "dateDebut": "2017-11-29T01:00:00.000+01:00",
      "preseance": "20",
      "nominPrincipale": "1",
      "infosQualite": {
        "codeQualite": "Membre",
        "libQualite": "Membre du",
        "libQualiteSex": "Membre du"
      },
      "organesRefs": [
        "PO744425"
      ]
    },
    {
      "uid": "PM745989",
      "acteurRef": "PA702052",
      "typeOrgane": "PARPOL",
      "dateDebut": "2017-12-01T01:00:00.000+01:00",
      "preseance": "5",
      "nominPrincipale": "1",
      "infosQualite": {
        "codeQualite": "Membre",
        "libQualite": "Membre",
        "libQualiteSex": "Membre"
      },
      "organesRefs": [
        "PO744860"
      ]
    },
    {
      "uid": "PM750319",
      "acteurRef": "PA702052",
      "legislature": "15",
      "typeOrgane": "GE",
      "dateDebut": "2018-02-14T01:00:00.000+01:00",
      "preseance": "20",
      "nominPrincipale": "0",
      "infosQualite": {
        "codeQualite": "Membre",
        "libQualite": "Membre",
        "libQualiteSex": "Membre"
      },
      "organesRefs": [
        "PO747027"
      ]
    },
    {
      "uid": "PM750548",
      "acteurRef": "PA702052",
      "legislature": "15",
      "typeOrgane": "GE",
      "dateDebut": "2018-02-12T01:00:00.000+01:00",
      "preseance": "20",
      "nominPrincipale": "1",
      "infosQualite": {
        "codeQualite": "Membre",
        "libQualite": "Membre",
        "libQualiteSex": "Membre"
      },
      "organesRefs": [
        "PO746977"
      ]
    },
    {
      "uid": "PM753704",
      "acteurRef": "PA702052",
      "legislature": "15",
      "typeOrgane": "GE",
      "dateDebut": "2018-03-15T01:00:00.000+01:00",
      "preseance": "20",
      "nominPrincipale": "1",
      "infosQualite": {
        "codeQualite": "Membre",
        "libQualite": "Membre",
        "libQualiteSex": "Membre"
      },
      "organesRefs": [
        "PO747042"
      ]
    },
    {
      "uid": "PM754077",
      "acteurRef": "PA702052",
      "legislature": "15",
      "typeOrgane": "GE",
      "dateDebut": "2018-03-21T01:00:00.000+01:00",
      "preseance": "8",
      "nominPrincipale": "1",
      "infosQualite": {
        "codeQualite": "Vice-Président",
        "libQualite": "Vice-Président",
        "libQualiteSex": "Vice-Présidente"
      },
      "organesRefs": [
        "PO747027"
      ]
    },
    {
      "uid": "PM754905",
      "acteurRef": "PA702052",
      "legislature": "15",
      "typeOrgane": "GE",
      "dateDebut": "2018-03-30T02:00:00.000+02:00",
      "preseance": "20",
      "nominPrincipale": "1",
      "infosQualite": {
        "codeQualite": "Membre",
        "libQualite": "Membre",
        "libQualiteSex": "Membre"
      },
      "organesRefs": [
        "PO746827"
      ]
    },
    {
      "uid": "PM757428",
      "acteurRef": "PA702052",
      "legislature": "15",
      "typeOrgane": "CMP",
      "dateDebut": "2018-06-28T02:00:00.000+02:00",
      "datePublication": "2018-06-29T02:00:00.000+02:00",
      "dateFin": "2018-07-13T02:00:00.000+02:00",
      "preseance": "28",
      "nominPrincipale": "1",
      "infosQualite": {
        "codeQualite": "Suppléant",
        "libQualite": "Membre suppléant",
        "libQualiteSex": "Membre suppléante"
      },
      "organesRefs": [
        "PO757402"
      ]
    },
    {
      "uid": "PM757642",
      "acteurRef": "PA702052",
      "legislature": "15",
      "typeOrgane": "MISINFOPRE",
      "dateDebut": "2018-07-05T02:00:00.000+02:00",
      "datePublication": "2018-07-06T02:00:00.000+02:00",
      "preseance": "20",
      "nominPrincipale": "1",
      "infosQualite": {
        "codeQualite": "Membre",
        "libQualite": "Membre",
        "libQualiteSex": "Membre"
      },
      "organesRefs": [
        "PO757231"
      ]
    },
    {
      "uid": "PM758322",
      "acteurRef": "PA702052",
      "legislature": "15",
      "typeOrgane": "GE",
      "dateDebut": "2018-07-23T02:00:00.000+02:00",
      "preseance": "20",
      "nominPrincipale": "1",
      "infosQualite": {
        "codeQualite": "Membre",
        "libQualite": "Membre",
        "libQualiteSex": "Membre"
      },
      "organesRefs": [
        "PO747281"
      ]
    }
  ]
}