{
  "uid": "PA720066",
  "etatCivil": {
    "ident": {
      "civ": "Mme",
      "prenom": "Stéphanie",
      "nom": "Rist",
      "alpha": "Rist",
      "trigramme": "SRI"
    },
    "infoNaissance": {
      "dateNais": "1973-08-06T01:00:00.000+01:00",
      "villeNais": "Athis-Mons",
      "depNais": "Essonne",
      "paysNais": "France"
    }
  },
  "profession": {
    "libelleCourant": "Médecin",
    "socProcInsee": {
      "catSocPro": "Cadres de la fonction publique, professions intellectuelles et  artistiques",
      "famSocPro": "Cadres et professions intellectuelles supérieures"
    }
  },
  "uriHatvp": "https://www.hatvp.fr/pages_nominatives/rist-stephanie",
  "adresses": [
    {
      "xsiType": "AdressePostale_Type",
      "uid": "AD720068",
      "type": "0",
      "typeLibelle": "Adresse officielle",
      "poids": "1",
      "intitule": "Assemblée nationale,",
      "numeroRue": "126",
      "nomRue": "Rue de l'Université,",
      "codePostal": "75355",
      "ville": "Paris 07 SP"
    },
    {
      "xsiType": "AdresseMail_Type",
      "uid": "AD728107",
      "type": "15",
      "typeLibelle": "Mèl",
      "valElec": "stephanie.rist@assemblee-nationale.fr"
    },
    {
      "xsiType": "AdresseSiteWeb_Type",
      "uid": "AD728668",
      "type": "22",
      "typeLibelle": "Site internet",
      "valElec": "stephanierist.en-marche.fr/"
    },
    {
      "xsiType": "AdresseMail_Type",
      "uid": "AD728750",
      "type": "15",
      "typeLibelle": "Mèl",
      "valElec": "stephanie.rist@en-marche.fr"
    },
    {
      "xsiType": "AdresseSiteWeb_Type",
      "uid": "AD729008",
      "type": "25",
      "typeLibelle": "Facebook",
      "valElec": "StephanieRistEnMarche"
    },
    {
      "xsiType": "AdresseSiteWeb_Type",
      "uid": "AD729112",
      "type": "24",
      "typeLibelle": "Twitter",
      "valElec": "@stephanie_rist"
    },
    {
      "xsiType": "AdressePostale_Type",
      "uid": "AD755494",
      "type": "2",
      "typeLibelle": "Adresse publiée de circonscription",
      "poids": "2",
      "intitule": "Permanence parlementaire",
      "numeroRue": "12",
      "nomRue": "Place Clovis",
      "codePostal": "45750",
      "ville": "Saint-Pryvé-Saint-Mesmin"
    },
    {
      "xsiType": "AdresseTelephonique_Type",
      "uid": "AD757789",
      "type": "11",
      "typeLibelle": "Téléphone",
      "poids": "1",
      "adresseDeRattachement": "AD720068",
      "valElec": "01.40.63.31.19"
    }
  ],
  "mandats": [
    {
      "uid": "PM722848",
      "acteurRef": "PA720066",
      "legislature": "15",
      "typeOrgane": "ASSEMBLEE",
      "dateDebut": "2017-06-18T02:00:00.000+02:00",
      "preseance": "50",
      "nominPrincipale": "1",
      "infosQualite": {
        "codeQualite": "membre",
        "libQualite": "membre",
        "libQualiteSex": "membre"
      },
      "organesRefs": [
        "PO717460"
      ],
      "suppleant": {
        "dateDebut": "2017-06-18T02:00:00.000+02:00",
        "suppleantRef": "PA720070"
      },
      "election": {
        "lieu": {
          "region": "Centre-Val de Loire",
          "regionType": "Métropolitain",
          "departement": "Loiret",
          "numDepartement": "45",
          "numCirco": "1"
        },
        "causeMandat": "élections générales",
        "refCirconscription": "PO717862"
      },
      "mandature": {
        "datePriseFonction": "2017-06-21T02:00:00.000+02:00",
        "premiereElection": "0",
        "placeHemicycle": "607"
      },
      "collaborateurs": [
        {
          "qualite": "M.",
          "prenom": "Stéphan",
          "nom": "Fautrat"
        },
        {
          "qualite": "Mme",
          "prenom": "Maïté",
          "nom": "Sève"
        },
        {
          "qualite": "Mme",
          "prenom": "Mathilde",
          "nom": "Boulanger"
        },
        {
          "qualite": "M.",
          "prenom": "Benjamin",
          "nom": "Bourdais"
        }
      ]
    },
    {
      "uid": "PM724465",
      "acteurRef": "PA720066",
      "legislature": "15",
      "typeOrgane": "GP",
      "dateDebut": "2017-06-21T02:00:00.000+02:00",
      "dateFin": "2017-06-26T02:00:00.000+02:00",
      "preseance": "28",
      "nominPrincipale": "1",
      "infosQualite": {
        "codeQualite": "Député non-inscrit",
        "libQualite": "Député non-inscrit",
        "libQualiteSex": "Députée non-inscrite"
      },
      "organesRefs": [
        "PO723569"
      ]
    },
    {
      "uid": "PM731107",
      "acteurRef": "PA720066",
      "legislature": "15",
      "typeOrgane": "GP",
      "dateDebut": "2017-06-27T02:00:00.000+02:00",
      "datePublication": "2017-06-28T02:00:00.000+02:00",
      "preseance": "20",
      "nominPrincipale": "1",
      "infosQualite": {
        "codeQualite": "Membre",
        "libQualite": "Membre du",
        "libQualiteSex": "Membre du"
      },
      "organesRefs": [
        "PO730964"
      ]
    },
    {
      "uid": "PM732186",
      "acteurRef": "PA720066",
      "legislature": "15",
      "typeOrgane": "COMPER",
      "dateDebut": "2017-06-29T02:00:00.000+02:00",
      "datePublication": "2017-06-29T02:00:00.000+02:00",
      "dateFin": "2018-08-03T02:00:00.000+02:00",
      "preseance": "32",
      "nominPrincipale": "1",
      "infosQualite": {
        "codeQualite": "Membre",
        "libQualite": "Membre",
        "libQualiteSex": "Membre"
      },
      "organesRefs": [
        "PO419604"
      ]
    },
    {
      "uid": "PM734412",
      "acteurRef": "PA720066",
      "legislature": "15",
      "typeOrgane": "API",
      "dateDebut": "2017-08-02T02:00:00.000+02:00",
      "datePublication": "2017-08-03T02:00:00.000+02:00",
      "dateFin": "2017-09-27T02:00:00.000+02:00",
      "preseance": "24",
      "nominPrincipale": "1",
      "infosQualite": {
        "codeQualite": "Suppléant",
        "libQualite": "Membre suppléant",
        "libQualiteSex": "Membre suppléante"
      },
      "organesRefs": [
        "PO304272"
      ]
    },
    {
      "uid": "PM735864",
      "acteurRef": "PA720066",
      "legislature": "15",
      "typeOrgane": "GEVI",
      "dateDebut": "2017-09-28T02:00:00.000+02:00",
      "preseance": "20",
      "nominPrincipale": "0",
      "infosQualite": {
        "codeQualite": "Membre",
        "libQualite": "Membre",
        "libQualiteSex": "Membre"
      },
      "organesRefs": [
        "PO733006"
      ]
    },
    {
      "uid": "PM744756",
      "acteurRef": "PA720066",
      "legislature": "15",
      "typeOrgane": "CNPS",
      "dateDebut": "2017-12-06T01:00:00.000+01:00",
      "datePublication": "2017-12-06T01:00:00.000+01:00",
      "dateFin": "2018-07-31T02:00:00.000+02:00",
      "preseance": "20",
      "nominPrincipale": "1",
      "infosQualite": {
        "codeQualite": "Membre",
        "libQualite": "Membre",
        "libQualiteSex": "Membre"
      },
      "organesRefs": [
        "PO744107"
      ]
    },
    {
      "uid": "PM745349",
      "acteurRef": "PA720066",
      "typeOrgane": "PARPOL",
      "dateDebut": "2017-12-01T01:00:00.000+01:00",
      "preseance": "5",
      "nominPrincipale": "1",
      "infosQualite": {
        "codeQualite": "Membre",
        "libQualite": "Membre",
        "libQualiteSex": "Membre"
      },
      "organesRefs": [
        "PO744854"
      ]
    },
    {
      "uid": "PM747948",
      "acteurRef": "PA720066",
      "legislature": "15",
      "typeOrgane": "ORGEXTPARL",
      "dateDebut": "2018-01-10T01:00:00.000+01:00",
      "datePublication": "2018-01-11T01:00:00.000+01:00",
      "preseance": "20",
      "nominPrincipale": "1",
      "infosQualite": {
        "codeQualite": "Titulaire",
        "libQualite": "Membre titulaire",
        "libQualiteSex": "Membre titulaire"
      },
      "organesRefs": [
        "PO717436"
      ]
    },
    {
      "uid": "PM748107",
      "acteurRef": "PA720066",
      "legislature": "15",
      "typeOrgane": "GEVI",
      "dateDebut": "2018-01-24T01:00:00.000+01:00",
      "preseance": "8",
      "nominPrincipale": "1",
      "infosQualite": {
        "codeQualite": "Vice-Président",
        "libQualite": "Vice-Président",
        "libQualiteSex": "Vice-Présidente"
      },
      "organesRefs": [
        "PO733006"
      ]
    },
    {
      "uid": "PM748315",
      "acteurRef": "PA720066",
      "legislature": "15",
      "typeOrgane": "MISINFO",
      "dateDebut": "2018-01-31T01:00:00.000+01:00",
      "dateFin": "2018-11-15T01:00:00.000+01:00",
      "preseance": "10",
      "nominPrincipale": "1",
      "infosQualite": {
        "codeQualite": "Membre",
        "libQualite": "Membre",
        "libQualiteSex": "Membre"
      },
      "organesRefs": [
        "PO748305"
      ]
    },
    {
      "uid": "PM748745",
      "acteurRef": "PA720066",
      "legislature": "15",
      "typeOrgane": "CNPE",
      "dateDebut": "2018-02-01T01:00:00.000+01:00",
      "datePublication": "2018-02-02T01:00:00.000+01:00",
      "dateFin": "2018-07-19T02:00:00.000+02:00",
      "preseance": "20",
      "nominPrincipale": "1",
      "infosQualite": {
        "codeQualite": "Membre",
        "libQualite": "Membre",
        "libQualiteSex": "Membre"
      },
      "organesRefs": [
        "PO748027"
      ]
    },
    {
      "uid": "PM752347",
      "acteurRef": "PA720066",
      "legislature": "15",
      "typeOrgane": "GE",
      "dateDebut": "2018-03-05T01:00:00.000+01:00",
      "preseance": "20",
      "nominPrincipale": "1",
      "infosQualite": {
        "codeQualite": "Membre",
        "libQualite": "Membre",
        "libQualiteSex": "Membre"
      },
      "organesRefs": [
        "PO747246"
      ]
    },
    {
      "uid": "PM753449",
      "acteurRef": "PA720066",
      "legislature": "15",
      "typeOrgane": "GE",
      "dateDebut": "2018-03-13T01:00:00.000+01:00",
      "preseance": "20",
      "nominPrincipale": "1",
      "infosQualite": {
        "codeQualite": "Membre",
        "libQualite": "Membre",
        "libQualiteSex": "Membre"
      },
      "organesRefs": [
        "PO747057"
      ]
    },
    {
      "uid": "PM753633",
      "acteurRef": "PA720066",
      "legislature": "15",
      "typeOrgane": "GE",
      "dateDebut": "2018-03-15T01:00:00.000+01:00",
      "preseance": "20",
      "nominPrincipale": "1",
      "infosQualite": {
        "codeQualite": "Membre",
        "libQualite": "Membre",
        "libQualiteSex": "Membre"
      },
      "organesRefs": [
        "PO746992"
      ]
    },
    {
      "uid": "PM754151",
      "acteurRef": "PA720066",
      "legislature": "15",
      "typeOrgane": "CNPE",
      "dateDebut": "2018-03-23T01:00:00.000+01:00",
      "datePublication": "2018-03-23T01:00:00.000+01:00",
      "dateFin": "2018-07-19T02:00:00.000+02:00",
      "preseance": "20",
      "nominPrincipale": "1",
      "infosQualite": {
        "codeQualite": "Membre",
        "libQualite": "Membre",
        "libQualiteSex": "Membre"
      },
      "organesRefs": [
        "PO753283"
      ]
    },
    {
      "uid": "PM754563",
      "acteurRef": "PA720066",
      "legislature": "15",
      "typeOrgane": "CNPE",
      "dateDebut": "2018-03-29T02:00:00.000+02:00",
      "datePublication": "2018-03-30T02:00:00.000+02:00",
      "dateFin": "2018-07-19T02:00:00.000+02:00",
      "preseance": "8",
      "nominPrincipale": "1",
      "infosQualite": {
        "codeQualite": "Vice-Président",
        "libQualite": "Vice-Président",
        "libQualiteSex": "Vice-Présidente"
      },
      "organesRefs": [
        "PO753283"
      ]
    },
    {
      "uid": "PM754590",
      "acteurRef": "PA720066",
      "legislature": "15",
      "typeOrgane": "GE",
      "dateDebut": "2018-03-30T02:00:00.000+02:00",
      "preseance": "20",
      "nominPrincipale": "1",
      "infosQualite": {
        "codeQualite": "Membre",
        "libQualite": "Membre",
        "libQualiteSex": "Membre"
      },
      "organesRefs": [
        "PO747180"
      ]
    },
    {
      "uid": "PM754938",
      "acteurRef": "PA720066",
      "legislature": "15",
      "typeOrgane": "GE",
      "dateDebut": "2018-03-27T02:00:00.000+02:00",
      "preseance": "20",
      "nominPrincipale": "1",
      "infosQualite": {
        "codeQualite": "Membre",
        "libQualite": "Membre",
        "libQualiteSex": "Membre"
      },
      "organesRefs": [
        "PO747062"
      ]
    },
    {
      "uid": "PM755367",
      "acteurRef": "PA720066",
      "legislature": "15",
      "typeOrgane": "GE",
      "dateDebut": "2018-04-11T02:00:00.000+02:00",
      "preseance": "20",
      "nominPrincipale": "1",
      "infosQualite": {
        "codeQualite": "Membre",
        "libQualite": "Membre",
        "libQualiteSex": "Membre"
      },
      "organesRefs": [
        "PO747052"
      ]
    },
    {
      "uid": "PM758081",
      "acteurRef": "PA720066",
      "legislature": "15",
      "typeOrgane": "CMP",
      "dateDebut": "2018-07-16T02:00:00.000+02:00",
      "datePublication": "2018-07-17T02:00:00.000+02:00",
      "dateFin": "2018-07-30T02:00:00.000+02:00",
      "preseance": "28",
      "nominPrincipale": "1",
      "infosQualite": {
        "codeQualite": "Suppléant",
        "libQualite": "Membre suppléant",
        "libQualiteSex": "Membre suppléante"
      },
      "organesRefs": [
        "PO758043"
      ]
    },
    {
      "uid": "PM758427",
      "acteurRef": "PA720066",
      "legislature": "15",
      "typeOrgane": "COMPER",
      "dateDebut": "2018-08-04T02:00:00.000+02:00",
      "datePublication": "2018-08-04T02:00:00.000+02:00",
      "dateFin": "2018-09-29T02:00:00.000+02:00",
      "preseance": "32",
      "nominPrincipale": "1",
      "infosQualite": {
        "codeQualite": "Membre",
        "libQualite": "Membre",
        "libQualiteSex": "Membre"
      },
      "organesRefs": [
        "PO420120"
      ]
    },
    {
      "uid": "PM759088",
      "acteurRef": "PA720066",
      "legislature": "15",
      "typeOrgane": "MINISTERE",
      "dateDebut": "2018-09-24T02:00:00.000+02:00",
      "datePublication": "2018-09-25T02:00:00.000+02:00",
      "dateFin": "2018-10-16T02:00:00.000+02:00",
      "preseance": "1",
      "nominPrincipale": "1",
      "infosQualite": {
        "codeQualite": "en mission",
        "libQualite": "en mission",
        "libQualiteSex": "en mission"
      },
      "organesRefs": [
        "PO729979",
        "PO729999"
      ],
      "libelle": "Le renforcement de l'accès à la santé pour les enfants de l'âge de 0 à 6 ans.",
      "missionSuivanteRef": "PM760055"
    },
    {
      "uid": "PM759132",
      "acteurRef": "PA720066",
      "legislature": "15",
      "typeOrgane": "COMPER",
      "dateDebut": "2018-09-30T02:00:00.000+02:00",
      "datePublication": "2018-09-30T02:00:00.000+02:00",
      "dateFin": "2018-10-02T02:00:00.000+02:00",
      "preseance": "32",
      "nominPrincipale": "1",
      "infosQualite": {
        "codeQualite": "Membre",
        "libQualite": "Membre",
        "libQualiteSex": "Membre"
      },
      "organesRefs": [
        "PO419604"
      ]
    },
    {
      "uid": "PM759252",
      "acteurRef": "PA720066",
      "legislature": "15",
      "typeOrgane": "COMPER",
      "dateDebut": "2018-10-03T02:00:00.000+02:00",
      "datePublication": "2018-10-03T02:00:00.000+02:00",
      "preseance": "32",
      "nominPrincipale": "1",
      "infosQualite": {
        "codeQualite": "Membre",
        "libQualite": "Membre",
        "libQualiteSex": "Membre"
      },
      "organesRefs": [
        "PO420120"
      ]
    },
    {
      "uid": "PM760055",
      "acteurRef": "PA720066",
      "legislature": "15",
      "typeOrgane": "MINISTERE",
      "dateDebut": "2018-10-17T02:00:00.000+02:00",
      "preseance": "1",
      "nominPrincipale": "1",
      "infosQualite": {
        "codeQualite": "en mission",
        "libQualite": "en mission",
        "libQualiteSex": "en mission"
      },
      "organesRefs": [
        "PO729979",
        "PO759773"
      ],
      "libelle": "Le renforcement de l'accès à la santé pour les enfants de l'âge de 0 à 6 ans.",
      "missionPrecedenteRef": "PM759088"
    }
  ]
}