{
  "uid": "PO710376",
  "codeType": "MISINFOPRE",
  "libelle": "Mission d'information sur les moyens de Daech",
  "libelleEdition": "de la mission d'information sur les moyens de Daech",
  "libelleAbrege": "Moyens de Daech",
  "libelleAbrev": "DAECH",
  "viMoDe": {
    "dateDebut": "2015-12-01T01:00:00.000+01:00",
    "dateFin": "2016-07-20T02:00:00.000+02:00"
  },
  "regime": "5ème République",
  "legislature": "14",
  "secretariat": {}
}