{
  "uid": "PO427547",
  "codeType": "MINISTERE",
  "libelle": "Ministère de la défense et des anciens combattants",
  "libelleEdition": "de la défense et des anciens combattants",
  "libelleAbrege": "Défense et anciens combattants",
  "libelleAbrev": "DEF",
  "viMoDe": {
    "dateDebut": "2011-02-27T01:00:00.000+01:00",
    "dateFin": "2012-05-10T02:00:00.000+02:00"
  },
  "organeParentRef": "PO425695"
}