{
  "uid": "PA599",
  "etatCivil": {
    "ident": {
      "civ": "M.",
      "prenom": "Jean-Michel",
      "nom": "Boucheron",
      "alpha": "Boucheron JMG"
    },
    "infoNaissance": {
      "dateNais": "1948-03-06T01:00:00.000+01:00",
      "villeNais": "Le Havre",
      "depNais": "Seine-Maritime"
    }
  },
  "profession": {
    "libelleCourant": "Assistant d'Université",
    "socProcInsee": {
      "catSocPro": "Cadres de la fonction publique, professions intellectuelles et  artistiques",
      "famSocPro": "Cadres et professions intellectuelles supérieures"
    }
  },
  "adresses": [
    {
      "xsiType": "AdressePostale_Type",
      "uid": "AD46038",
      "type": "2",
      "typeLibelle": "Adresse publiée de circonscription",
      "poids": "21",
      "numeroRue": "1",
      "nomRue": "Rue de Toulouse,",
      "codePostal": "35000",
      "ville": "Rennes"
    },
    {
      "xsiType": "AdresseTelephonique_Type",
      "uid": "AD47669",
      "type": "11",
      "typeLibelle": "Téléphone",
      "poids": "21",
      "adresseDeRattachement": "AD46038",
      "valElec": "02 99 79 54 52"
    },
    {
      "xsiType": "AdresseTelephonique_Type",
      "uid": "AD49445",
      "type": "12",
      "typeLibelle": "Télécopie",
      "poids": "21",
      "adresseDeRattachement": "AD46038",
      "valElec": "02 99 78 10 92"
    },
    {
      "xsiType": "AdresseSiteWeb_Type",
      "uid": "AD316614",
      "type": "22",
      "typeLibelle": "Site internet",
      "valElec": "www.jmboucheron.fr"
    },
    {
      "xsiType": "AdressePostale_Type",
      "uid": "AD386739",
      "type": "0",
      "typeLibelle": "Adresse officielle",
      "poids": "1",
      "intitule": "Assemblée nationale,",
      "numeroRue": "126",
      "nomRue": "Rue de l'Université,",
      "codePostal": "75355",
      "ville": "Paris 07 SP"
    },
    {
      "xsiType": "AdresseMail_Type",
      "uid": "AD391668",
      "type": "15",
      "typeLibelle": "Mèl",
      "valElec": "jmboucheron@assemblee-nationale.fr"
    }
  ],
  "mandats": [
    {
      "uid": "PM386062",
      "acteurRef": "PA599",
      "legislature": "13",
      "typeOrgane": "ASSEMBLEE",
      "dateDebut": "2007-06-20T02:00:00.000+02:00",
      "dateFin": "2012-06-19T02:00:00.000+02:00",
      "preseance": "50",
      "nominPrincipale": "1",
      "infosQualite": {
        "codeQualite": "membre",
        "libQualite": "membre",
        "libQualiteSex": "membre"
      },
      "organesRefs": [
        "PO384266"
      ],
      "suppleant": {
        "dateDebut": "2007-06-20T02:00:00.000+02:00",
        "dateFin": "2012-06-19T02:00:00.000+02:00",
        "suppleantRef": "PA1678"
      },
      "election": {
        "lieu": {
          "region": "Bretagne",
          "regionType": "Métropolitain",
          "departement": "Ille-et-Vilaine",
          "numDepartement": "35",
          "numCirco": "1"
        },
        "causeMandat": "élections générales",
        "refCirconscription": "PO384428"
      },
      "mandature": {
        "datePriseFonction": "2007-06-20T02:00:00.000+02:00",
        "causeFin": "Fin de législature",
        "premiereElection": "1"
      }
    },
    {
      "uid": "PM387318",
      "acteurRef": "PA599",
      "legislature": "13",
      "typeOrgane": "GP",
      "dateDebut": "2007-06-20T02:00:00.000+02:00",
      "dateFin": "2007-06-26T02:00:00.000+02:00",
      "preseance": "28",
      "nominPrincipale": "1",
      "infosQualite": {
        "codeQualite": "Député non-inscrit",
        "libQualite": "Député non-inscrit",
        "libQualiteSex": "Député non-inscrit"
      },
      "organesRefs": [
        "PO387155"
      ]
    },
    {
      "uid": "PM390059",
      "acteurRef": "PA599",
      "legislature": "13",
      "typeOrgane": "GP",
      "dateDebut": "2007-06-27T02:00:00.000+02:00",
      "datePublication": "2007-06-27T02:00:00.000+02:00",
      "dateFin": "2012-06-19T02:00:00.000+02:00",
      "preseance": "20",
      "nominPrincipale": "1",
      "infosQualite": {
        "codeQualite": "Membre",
        "libQualite": "Membre du",
        "libQualiteSex": "Membre du"
      },
      "organesRefs": [
        "PO389507"
      ]
    },
    {
      "uid": "PM390715",
      "acteurRef": "PA599",
      "legislature": "13",
      "typeOrgane": "COMPER",
      "dateDebut": "2007-06-27T02:00:00.000+02:00",
      "datePublication": "2007-06-28T02:00:00.000+02:00",
      "dateFin": "2012-06-19T02:00:00.000+02:00",
      "preseance": "32",
      "nominPrincipale": "1",
      "infosQualite": {
        "codeQualite": "Membre",
        "libQualite": "Membre",
        "libQualiteSex": "Membre"
      },
      "organesRefs": [
        "PO59047"
      ]
    },
    {
      "uid": "PM392414",
      "acteurRef": "PA599",
      "legislature": "13",
      "typeOrgane": "ORGEXTPARL",
      "dateDebut": "2007-07-10T02:00:00.000+02:00",
      "datePublication": "2007-07-12T02:00:00.000+02:00",
      "dateFin": "2012-06-19T02:00:00.000+02:00",
      "preseance": "20",
      "nominPrincipale": "1",
      "infosQualite": {
        "codeQualite": "Titulaire",
        "libQualite": "Membre titulaire",
        "libQualiteSex": "Membre titulaire"
      },
      "organesRefs": [
        "PO60297"
      ]
    },
    {
      "uid": "PM394124",
      "acteurRef": "PA599",
      "legislature": "13",
      "typeOrgane": "API",
      "dateDebut": "2007-07-19T02:00:00.000+02:00",
      "datePublication": "2007-07-19T02:00:00.000+02:00",
      "dateFin": "2012-06-19T02:00:00.000+02:00",
      "preseance": "20",
      "nominPrincipale": "1",
      "infosQualite": {
        "codeQualite": "Titulaire",
        "libQualite": "Membre titulaire",
        "libQualiteSex": "Membre titulaire"
      },
      "organesRefs": [
        "PO58974"
      ]
    },
    {
      "uid": "PM396592",
      "acteurRef": "PA599",
      "legislature": "13",
      "typeOrgane": "GA",
      "dateDebut": "2007-10-08T02:00:00.000+02:00",
      "dateFin": "2012-06-19T02:00:00.000+02:00",
      "preseance": "20",
      "nominPrincipale": "1",
      "infosQualite": {
        "codeQualite": "Membre",
        "libQualite": "Membre",
        "libQualiteSex": "Membre"
      },
      "organesRefs": [
        "PO392654"
      ]
    },
    {
      "uid": "PM396593",
      "acteurRef": "PA599",
      "legislature": "13",
      "typeOrgane": "GA",
      "dateDebut": "2007-10-08T02:00:00.000+02:00",
      "dateFin": "2012-06-19T02:00:00.000+02:00",
      "preseance": "20",
      "nominPrincipale": "1",
      "infosQualite": {
        "codeQualite": "Membre",
        "libQualite": "Membre",
        "libQualiteSex": "Membre"
      },
      "organesRefs": [
        "PO392669"
      ]
    },
    {
      "uid": "PM396594",
      "acteurRef": "PA599",
      "legislature": "13",
      "typeOrgane": "GA",
      "dateDebut": "2007-10-08T02:00:00.000+02:00",
      "dateFin": "2012-06-19T02:00:00.000+02:00",
      "preseance": "20",
      "nominPrincipale": "1",
      "infosQualite": {
        "codeQualite": "Membre",
        "libQualite": "Membre",
        "libQualiteSex": "Membre"
      },
      "organesRefs": [
        "PO392684"
      ]
    },
    {
      "uid": "PM396595",
      "acteurRef": "PA599",
      "legislature": "13",
      "typeOrgane": "GA",
      "dateDebut": "2007-10-08T02:00:00.000+02:00",
      "dateFin": "2012-06-19T02:00:00.000+02:00",
      "preseance": "20",
      "nominPrincipale": "1",
      "infosQualite": {
        "codeQualite": "Membre",
        "libQualite": "Membre",
        "libQualiteSex": "Membre"
      },
      "organesRefs": [
        "PO392689"
      ]
    },
    {
      "uid": "PM396596",
      "acteurRef": "PA599",
      "legislature": "13",
      "typeOrgane": "GA",
      "dateDebut": "2007-10-08T02:00:00.000+02:00",
      "dateFin": "2012-06-19T02:00:00.000+02:00",
      "preseance": "20",
      "nominPrincipale": "1",
      "infosQualite": {
        "codeQualite": "Membre",
        "libQualite": "Membre",
        "libQualiteSex": "Membre"
      },
      "organesRefs": [
        "PO392694"
      ]
    },
    {
      "uid": "PM396597",
      "acteurRef": "PA599",
      "legislature": "13",
      "typeOrgane": "GA",
      "dateDebut": "2007-10-08T02:00:00.000+02:00",
      "dateFin": "2012-06-19T02:00:00.000+02:00",
      "preseance": "20",
      "nominPrincipale": "1",
      "infosQualite": {
        "codeQualite": "Membre",
        "libQualite": "Membre",
        "libQualiteSex": "Membre"
      },
      "organesRefs": [
        "PO392699"
      ]
    },
    {
      "uid": "PM396598",
      "acteurRef": "PA599",
      "legislature": "13",
      "typeOrgane": "GA",
      "dateDebut": "2007-10-08T02:00:00.000+02:00",
      "dateFin": "2012-06-19T02:00:00.000+02:00",
      "preseance": "20",
      "nominPrincipale": "1",
      "infosQualite": {
        "codeQualite": "Membre",
        "libQualite": "Membre",
        "libQualiteSex": "Membre"
      },
      "organesRefs": [
        "PO392714"
      ]
    },
    {
      "uid": "PM396599",
      "acteurRef": "PA599",
      "legislature": "13",
      "typeOrgane": "GA",
      "dateDebut": "2007-10-08T02:00:00.000+02:00",
      "dateFin": "2012-06-19T02:00:00.000+02:00",
      "preseance": "20",
      "nominPrincipale": "1",
      "infosQualite": {
        "codeQualite": "Membre",
        "libQualite": "Membre",
        "libQualiteSex": "Membre"
      },
      "organesRefs": [
        "PO392719"
      ]
    },
    {
      "uid": "PM396600",
      "acteurRef": "PA599",
      "legislature": "13",
      "typeOrgane": "GA",
      "dateDebut": "2007-10-08T02:00:00.000+02:00",
      "dateFin": "2012-06-19T02:00:00.000+02:00",
      "preseance": "20",
      "nominPrincipale": "1",
      "infosQualite": {
        "codeQualite": "Membre",
        "libQualite": "Membre",
        "libQualiteSex": "Membre"
      },
      "organesRefs": [
        "PO392729"
      ]
    },
    {
      "uid": "PM396601",
      "acteurRef": "PA599",
      "legislature": "13",
      "typeOrgane": "GA",
      "dateDebut": "2007-10-08T02:00:00.000+02:00",
      "dateFin": "2012-06-19T02:00:00.000+02:00",
      "preseance": "20",
      "nominPrincipale": "1",
      "infosQualite": {
        "codeQualite": "Membre",
        "libQualite": "Membre",
        "libQualiteSex": "Membre"
      },
      "organesRefs": [
        "PO392770"
      ]
    },
    {
      "uid": "PM396602",
      "acteurRef": "PA599",
      "legislature": "13",
      "typeOrgane": "GA",
      "dateDebut": "2007-10-08T02:00:00.000+02:00",
      "dateFin": "2012-06-19T02:00:00.000+02:00",
      "preseance": "20",
      "nominPrincipale": "1",
      "infosQualite": {
        "codeQualite": "Membre",
        "libQualite": "Membre",
        "libQualiteSex": "Membre"
      },
      "organesRefs": [
        "PO392780"
      ]
    },
    {
      "uid": "PM396603",
      "acteurRef": "PA599",
      "legislature": "13",
      "typeOrgane": "GA",
      "dateDebut": "2007-10-08T02:00:00.000+02:00",
      "dateFin": "2012-06-19T02:00:00.000+02:00",
      "preseance": "20",
      "nominPrincipale": "1",
      "infosQualite": {
        "codeQualite": "Membre",
        "libQualite": "Membre",
        "libQualiteSex": "Membre"
      },
      "organesRefs": [
        "PO392785"
      ]
    },
    {
      "uid": "PM396604",
      "acteurRef": "PA599",
      "legislature": "13",
      "typeOrgane": "GA",
      "dateDebut": "2007-10-08T02:00:00.000+02:00",
      "dateFin": "2012-06-19T02:00:00.000+02:00",
      "preseance": "20",
      "nominPrincipale": "1",
      "infosQualite": {
        "codeQualite": "Membre",
        "libQualite": "Membre",
        "libQualiteSex": "Membre"
      },
      "organesRefs": [
        "PO392790"
      ]
    },
    {
      "uid": "PM396605",
      "acteurRef": "PA599",
      "legislature": "13",
      "typeOrgane": "GA",
      "dateDebut": "2007-10-08T02:00:00.000+02:00",
      "dateFin": "2012-06-19T02:00:00.000+02:00",
      "preseance": "20",
      "nominPrincipale": "1",
      "infosQualite": {
        "codeQualite": "Membre",
        "libQualite": "Membre",
        "libQualiteSex": "Membre"
      },
      "organesRefs": [
        "PO392795"
      ]
    },
    {
      "uid": "PM396606",
      "acteurRef": "PA599",
      "legislature": "13",
      "typeOrgane": "GA",
      "dateDebut": "2007-10-08T02:00:00.000+02:00",
      "dateFin": "2012-06-19T02:00:00.000+02:00",
      "preseance": "20",
      "nominPrincipale": "1",
      "infosQualite": {
        "codeQualite": "Membre",
        "libQualite": "Membre",
        "libQualiteSex": "Membre"
      },
      "organesRefs": [
        "PO392810"
      ]
    },
    {
      "uid": "PM396607",
      "acteurRef": "PA599",
      "legislature": "13",
      "typeOrgane": "GA",
      "dateDebut": "2007-10-08T02:00:00.000+02:00",
      "dateFin": "2012-06-19T02:00:00.000+02:00",
      "preseance": "20",
      "nominPrincipale": "1",
      "infosQualite": {
        "codeQualite": "Membre",
        "libQualite": "Membre",
        "libQualiteSex": "Membre"
      },
      "organesRefs": [
        "PO392815"
      ]
    },
    {
      "uid": "PM396608",
      "acteurRef": "PA599",
      "legislature": "13",
      "typeOrgane": "GA",
      "dateDebut": "2007-10-08T02:00:00.000+02:00",
      "dateFin": "2012-06-19T02:00:00.000+02:00",
      "preseance": "20",
      "nominPrincipale": "1",
      "infosQualite": {
        "codeQualite": "Membre",
        "libQualite": "Membre",
        "libQualiteSex": "Membre"
      },
      "organesRefs": [
        "PO392835"
      ]
    },
    {
      "uid": "PM396609",
      "acteurRef": "PA599",
      "legislature": "13",
      "typeOrgane": "GA",
      "dateDebut": "2007-10-08T02:00:00.000+02:00",
      "dateFin": "2012-06-19T02:00:00.000+02:00",
      "preseance": "20",
      "nominPrincipale": "1",
      "infosQualite": {
        "codeQualite": "Membre",
        "libQualite": "Membre",
        "libQualiteSex": "Membre"
      },
      "organesRefs": [
        "PO392840"
      ]
    },
    {
      "uid": "PM396610",
      "acteurRef": "PA599",
      "legislature": "13",
      "typeOrgane": "GA",
      "dateDebut": "2007-10-08T02:00:00.000+02:00",
      "dateFin": "2012-06-19T02:00:00.000+02:00",
      "preseance": "20",
      "nominPrincipale": "1",
      "infosQualite": {
        "codeQualite": "Membre",
        "libQualite": "Membre",
        "libQualiteSex": "Membre"
      },
      "organesRefs": [
        "PO392845"
      ]
    },
    {
      "uid": "PM396611",
      "acteurRef": "PA599",
      "legislature": "13",
      "typeOrgane": "GA",
      "dateDebut": "2007-10-08T02:00:00.000+02:00",
      "dateFin": "2012-06-19T02:00:00.000+02:00",
      "preseance": "20",
      "nominPrincipale": "1",
      "infosQualite": {
        "codeQualite": "Membre",
        "libQualite": "Membre",
        "libQualiteSex": "Membre"
      },
      "organesRefs": [
        "PO392850"
      ]
    },
    {
      "uid": "PM396612",
      "acteurRef": "PA599",
      "legislature": "13",
      "typeOrgane": "GA",
      "dateDebut": "2007-10-08T02:00:00.000+02:00",
      "dateFin": "2012-06-19T02:00:00.000+02:00",
      "preseance": "20",
      "nominPrincipale": "1",
      "infosQualite": {
        "codeQualite": "Membre",
        "libQualite": "Membre",
        "libQualiteSex": "Membre"
      },
      "organesRefs": [
        "PO392875"
      ]
    },
    {
      "uid": "PM396613",
      "acteurRef": "PA599",
      "legislature": "13",
      "typeOrgane": "GA",
      "dateDebut": "2007-10-08T02:00:00.000+02:00",
      "dateFin": "2012-06-19T02:00:00.000+02:00",
      "preseance": "20",
      "nominPrincipale": "1",
      "infosQualite": {
        "codeQualite": "Membre",
        "libQualite": "Membre",
        "libQualiteSex": "Membre"
      },
      "organesRefs": [
        "PO392895"
      ]
    },
    {
      "uid": "PM396614",
      "acteurRef": "PA599",
      "legislature": "13",
      "typeOrgane": "GA",
      "dateDebut": "2007-10-08T02:00:00.000+02:00",
      "dateFin": "2012-06-19T02:00:00.000+02:00",
      "preseance": "20",
      "nominPrincipale": "1",
      "infosQualite": {
        "codeQualite": "Membre",
        "libQualite": "Membre",
        "libQualiteSex": "Membre"
      },
      "organesRefs": [
        "PO392905"
      ]
    },
    {
      "uid": "PM396615",
      "acteurRef": "PA599",
      "legislature": "13",
      "typeOrgane": "GA",
      "dateDebut": "2007-10-08T02:00:00.000+02:00",
      "dateFin": "2012-06-19T02:00:00.000+02:00",
      "preseance": "20",
      "nominPrincipale": "1",
      "infosQualite": {
        "codeQualite": "Membre",
        "libQualite": "Membre",
        "libQualiteSex": "Membre"
      },
      "organesRefs": [
        "PO392915"
      ]
    },
    {
      "uid": "PM396616",
      "acteurRef": "PA599",
      "legislature": "13",
      "typeOrgane": "GA",
      "dateDebut": "2007-10-08T02:00:00.000+02:00",
      "dateFin": "2012-06-19T02:00:00.000+02:00",
      "preseance": "20",
      "nominPrincipale": "1",
      "infosQualite": {
        "codeQualite": "Membre",
        "libQualite": "Membre",
        "libQualiteSex": "Membre"
      },
      "organesRefs": [
        "PO392925"
      ]
    },
    {
      "uid": "PM396617",
      "acteurRef": "PA599",
      "legislature": "13",
      "typeOrgane": "GA",
      "dateDebut": "2007-10-08T02:00:00.000+02:00",
      "dateFin": "2012-06-19T02:00:00.000+02:00",
      "preseance": "20",
      "nominPrincipale": "1",
      "infosQualite": {
        "codeQualite": "Membre",
        "libQualite": "Membre",
        "libQualiteSex": "Membre"
      },
      "organesRefs": [
        "PO392930"
      ]
    },
    {
      "uid": "PM396618",
      "acteurRef": "PA599",
      "legislature": "13",
      "typeOrgane": "GA",
      "dateDebut": "2007-10-08T02:00:00.000+02:00",
      "dateFin": "2012-06-19T02:00:00.000+02:00",
      "preseance": "20",
      "nominPrincipale": "1",
      "infosQualite": {
        "codeQualite": "Membre",
        "libQualite": "Membre",
        "libQualiteSex": "Membre"
      },
      "organesRefs": [
        "PO392945"
      ]
    },
    {
      "uid": "PM396619",
      "acteurRef": "PA599",
      "legislature": "13",
      "typeOrgane": "GA",
      "dateDebut": "2007-10-08T02:00:00.000+02:00",
      "dateFin": "2012-06-19T02:00:00.000+02:00",
      "preseance": "20",
      "nominPrincipale": "1",
      "infosQualite": {
        "codeQualite": "Membre",
        "libQualite": "Membre",
        "libQualiteSex": "Membre"
      },
      "organesRefs": [
        "PO392950"
      ]
    },
    {
      "uid": "PM396620",
      "acteurRef": "PA599",
      "legislature": "13",
      "typeOrgane": "GA",
      "dateDebut": "2007-10-08T02:00:00.000+02:00",
      "dateFin": "2012-06-19T02:00:00.000+02:00",
      "preseance": "20",
      "nominPrincipale": "1",
      "infosQualite": {
        "codeQualite": "Membre",
        "libQualite": "Membre",
        "libQualiteSex": "Membre"
      },
      "organesRefs": [
        "PO392965"
      ]
    },
    {
      "uid": "PM396621",
      "acteurRef": "PA599",
      "legislature": "13",
      "typeOrgane": "GA",
      "dateDebut": "2007-10-08T02:00:00.000+02:00",
      "dateFin": "2012-06-19T02:00:00.000+02:00",
      "preseance": "20",
      "nominPrincipale": "1",
      "infosQualite": {
        "codeQualite": "Membre",
        "libQualite": "Membre",
        "libQualiteSex": "Membre"
      },
      "organesRefs": [
        "PO392970"
      ]
    },
    {
      "uid": "PM396622",
      "acteurRef": "PA599",
      "legislature": "13",
      "typeOrgane": "GA",
      "dateDebut": "2007-10-08T02:00:00.000+02:00",
      "dateFin": "2012-06-19T02:00:00.000+02:00",
      "preseance": "20",
      "nominPrincipale": "1",
      "infosQualite": {
        "codeQualite": "Membre",
        "libQualite": "Membre",
        "libQualiteSex": "Membre"
      },
      "organesRefs": [
        "PO392980"
      ]
    },
    {
      "uid": "PM396623",
      "acteurRef": "PA599",
      "legislature": "13",
      "typeOrgane": "GA",
      "dateDebut": "2007-10-08T02:00:00.000+02:00",
      "dateFin": "2012-06-19T02:00:00.000+02:00",
      "preseance": "20",
      "nominPrincipale": "1",
      "infosQualite": {
        "codeQualite": "Membre",
        "libQualite": "Membre",
        "libQualiteSex": "Membre"
      },
      "organesRefs": [
        "PO393000"
      ]
    },
    {
      "uid": "PM396624",
      "acteurRef": "PA599",
      "legislature": "13",
      "typeOrgane": "GA",
      "dateDebut": "2007-10-08T02:00:00.000+02:00",
      "dateFin": "2012-06-19T02:00:00.000+02:00",
      "preseance": "20",
      "nominPrincipale": "1",
      "infosQualite": {
        "codeQualite": "Membre",
        "libQualite": "Membre",
        "libQualiteSex": "Membre"
      },
      "organesRefs": [
        "PO393035"
      ]
    },
    {
      "uid": "PM396625",
      "acteurRef": "PA599",
      "legislature": "13",
      "typeOrgane": "GA",
      "dateDebut": "2007-10-08T02:00:00.000+02:00",
      "dateFin": "2012-06-19T02:00:00.000+02:00",
      "preseance": "20",
      "nominPrincipale": "1",
      "infosQualite": {
        "codeQualite": "Membre",
        "libQualite": "Membre",
        "libQualiteSex": "Membre"
      },
      "organesRefs": [
        "PO393040"
      ]
    },
    {
      "uid": "PM396626",
      "acteurRef": "PA599",
      "legislature": "13",
      "typeOrgane": "GA",
      "dateDebut": "2007-10-08T02:00:00.000+02:00",
      "dateFin": "2012-06-19T02:00:00.000+02:00",
      "preseance": "20",
      "nominPrincipale": "1",
      "infosQualite": {
        "codeQualite": "Membre",
        "libQualite": "Membre",
        "libQualiteSex": "Membre"
      },
      "organesRefs": [
        "PO393045"
      ]
    },
    {
      "uid": "PM396627",
      "acteurRef": "PA599",
      "legislature": "13",
      "typeOrgane": "GA",
      "dateDebut": "2007-10-08T02:00:00.000+02:00",
      "dateFin": "2012-06-19T02:00:00.000+02:00",
      "preseance": "20",
      "nominPrincipale": "1",
      "infosQualite": {
        "codeQualite": "Membre",
        "libQualite": "Membre",
        "libQualiteSex": "Membre"
      },
      "organesRefs": [
        "PO393050"
      ]
    },
    {
      "uid": "PM396628",
      "acteurRef": "PA599",
      "legislature": "13",
      "typeOrgane": "GA",
      "dateDebut": "2007-10-08T02:00:00.000+02:00",
      "dateFin": "2012-06-19T02:00:00.000+02:00",
      "preseance": "20",
      "nominPrincipale": "1",
      "infosQualite": {
        "codeQualite": "Membre",
        "libQualite": "Membre",
        "libQualiteSex": "Membre"
      },
      "organesRefs": [
        "PO393055"
      ]
    },
    {
      "uid": "PM396629",
      "acteurRef": "PA599",
      "legislature": "13",
      "typeOrgane": "GA",
      "dateDebut": "2007-10-08T02:00:00.000+02:00",
      "dateFin": "2012-06-19T02:00:00.000+02:00",
      "preseance": "20",
      "nominPrincipale": "1",
      "infosQualite": {
        "codeQualite": "Membre",
        "libQualite": "Membre",
        "libQualiteSex": "Membre"
      },
      "organesRefs": [
        "PO393070"
      ]
    },
    {
      "uid": "PM396630",
      "acteurRef": "PA599",
      "legislature": "13",
      "typeOrgane": "GA",
      "dateDebut": "2007-10-08T02:00:00.000+02:00",
      "dateFin": "2012-06-19T02:00:00.000+02:00",
      "preseance": "20",
      "nominPrincipale": "1",
      "infosQualite": {
        "codeQualite": "Membre",
        "libQualite": "Membre",
        "libQualiteSex": "Membre"
      },
      "organesRefs": [
        "PO393085"
      ]
    },
    {
      "uid": "PM396631",
      "acteurRef": "PA599",
      "legislature": "13",
      "typeOrgane": "GA",
      "dateDebut": "2007-10-08T02:00:00.000+02:00",
      "dateFin": "2012-06-19T02:00:00.000+02:00",
      "preseance": "20",
      "nominPrincipale": "1",
      "infosQualite": {
        "codeQualite": "Membre",
        "libQualite": "Membre",
        "libQualiteSex": "Membre"
      },
      "organesRefs": [
        "PO393090"
      ]
    },
    {
      "uid": "PM396632",
      "acteurRef": "PA599",
      "legislature": "13",
      "typeOrgane": "GA",
      "dateDebut": "2007-10-08T02:00:00.000+02:00",
      "dateFin": "2012-06-19T02:00:00.000+02:00",
      "preseance": "20",
      "nominPrincipale": "1",
      "infosQualite": {
        "codeQualite": "Membre",
        "libQualite": "Membre",
        "libQualiteSex": "Membre"
      },
      "organesRefs": [
        "PO393100"
      ]
    },
    {
      "uid": "PM396633",
      "acteurRef": "PA599",
      "legislature": "13",
      "typeOrgane": "GA",
      "dateDebut": "2007-10-08T02:00:00.000+02:00",
      "dateFin": "2012-06-19T02:00:00.000+02:00",
      "preseance": "20",
      "nominPrincipale": "1",
      "infosQualite": {
        "codeQualite": "Membre",
        "libQualite": "Membre",
        "libQualiteSex": "Membre"
      },
      "organesRefs": [
        "PO393115"
      ]
    },
    {
      "uid": "PM396634",
      "acteurRef": "PA599",
      "legislature": "13",
      "typeOrgane": "GA",
      "dateDebut": "2007-10-08T02:00:00.000+02:00",
      "dateFin": "2012-06-19T02:00:00.000+02:00",
      "preseance": "20",
      "nominPrincipale": "1",
      "infosQualite": {
        "codeQualite": "Membre",
        "libQualite": "Membre",
        "libQualiteSex": "Membre"
      },
      "organesRefs": [
        "PO393125"
      ]
    },
    {
      "uid": "PM396635",
      "acteurRef": "PA599",
      "legislature": "13",
      "typeOrgane": "GA",
      "dateDebut": "2007-10-08T02:00:00.000+02:00",
      "dateFin": "2012-06-19T02:00:00.000+02:00",
      "preseance": "20",
      "nominPrincipale": "1",
      "infosQualite": {
        "codeQualite": "Membre",
        "libQualite": "Membre",
        "libQualiteSex": "Membre"
      },
      "organesRefs": [
        "PO393130"
      ]
    },
    {
      "uid": "PM396636",
      "acteurRef": "PA599",
      "legislature": "13",
      "typeOrgane": "GA",
      "dateDebut": "2007-10-08T02:00:00.000+02:00",
      "dateFin": "2012-06-19T02:00:00.000+02:00",
      "preseance": "20",
      "nominPrincipale": "1",
      "infosQualite": {
        "codeQualite": "Membre",
        "libQualite": "Membre",
        "libQualiteSex": "Membre"
      },
      "organesRefs": [
        "PO393146"
      ]
    },
    {
      "uid": "PM396637",
      "acteurRef": "PA599",
      "legislature": "13",
      "typeOrgane": "GA",
      "dateDebut": "2007-10-08T02:00:00.000+02:00",
      "dateFin": "2012-06-19T02:00:00.000+02:00",
      "preseance": "20",
      "nominPrincipale": "1",
      "infosQualite": {
        "codeQualite": "Membre",
        "libQualite": "Membre",
        "libQualiteSex": "Membre"
      },
      "organesRefs": [
        "PO393161"
      ]
    },
    {
      "uid": "PM396638",
      "acteurRef": "PA599",
      "legislature": "13",
      "typeOrgane": "GA",
      "dateDebut": "2007-10-08T02:00:00.000+02:00",
      "dateFin": "2012-06-19T02:00:00.000+02:00",
      "preseance": "20",
      "nominPrincipale": "1",
      "infosQualite": {
        "codeQualite": "Membre",
        "libQualite": "Membre",
        "libQualiteSex": "Membre"
      },
      "organesRefs": [
        "PO393167"
      ]
    },
    {
      "uid": "PM396639",
      "acteurRef": "PA599",
      "legislature": "13",
      "typeOrgane": "GA",
      "dateDebut": "2007-10-08T02:00:00.000+02:00",
      "dateFin": "2012-06-19T02:00:00.000+02:00",
      "preseance": "20",
      "nominPrincipale": "1",
      "infosQualite": {
        "codeQualite": "Membre",
        "libQualite": "Membre",
        "libQualiteSex": "Membre"
      },
      "organesRefs": [
        "PO393187"
      ]
    },
    {
      "uid": "PM396640",
      "acteurRef": "PA599",
      "legislature": "13",
      "typeOrgane": "GA",
      "dateDebut": "2007-10-08T02:00:00.000+02:00",
      "dateFin": "2012-06-19T02:00:00.000+02:00",
      "preseance": "20",
      "nominPrincipale": "1",
      "infosQualite": {
        "codeQualite": "Membre",
        "libQualite": "Membre",
        "libQualiteSex": "Membre"
      },
      "organesRefs": [
        "PO393192"
      ]
    },
    {
      "uid": "PM396641",
      "acteurRef": "PA599",
      "legislature": "13",
      "typeOrgane": "GA",
      "dateDebut": "2007-10-08T02:00:00.000+02:00",
      "dateFin": "2012-06-19T02:00:00.000+02:00",
      "preseance": "20",
      "nominPrincipale": "1",
      "infosQualite": {
        "codeQualite": "Membre",
        "libQualite": "Membre",
        "libQualiteSex": "Membre"
      },
      "organesRefs": [
        "PO393202"
      ]
    },
    {
      "uid": "PM396642",
      "acteurRef": "PA599",
      "legislature": "13",
      "typeOrgane": "GA",
      "dateDebut": "2007-10-08T02:00:00.000+02:00",
      "dateFin": "2012-06-19T02:00:00.000+02:00",
      "preseance": "20",
      "nominPrincipale": "1",
      "infosQualite": {
        "codeQualite": "Membre",
        "libQualite": "Membre",
        "libQualiteSex": "Membre"
      },
      "organesRefs": [
        "PO393207"
      ]
    },
    {
      "uid": "PM396643",
      "acteurRef": "PA599",
      "legislature": "13",
      "typeOrgane": "GA",
      "dateDebut": "2007-10-08T02:00:00.000+02:00",
      "dateFin": "2012-06-19T02:00:00.000+02:00",
      "preseance": "20",
      "nominPrincipale": "1",
      "infosQualite": {
        "codeQualite": "Membre",
        "libQualite": "Membre",
        "libQualiteSex": "Membre"
      },
      "organesRefs": [
        "PO393212"
      ]
    },
    {
      "uid": "PM396644",
      "acteurRef": "PA599",
      "legislature": "13",
      "typeOrgane": "GA",
      "dateDebut": "2007-10-08T02:00:00.000+02:00",
      "dateFin": "2012-06-19T02:00:00.000+02:00",
      "preseance": "20",
      "nominPrincipale": "1",
      "infosQualite": {
        "codeQualite": "Membre",
        "libQualite": "Membre",
        "libQualiteSex": "Membre"
      },
      "organesRefs": [
        "PO393238"
      ]
    },
    {
      "uid": "PM396645",
      "acteurRef": "PA599",
      "legislature": "13",
      "typeOrgane": "GA",
      "dateDebut": "2007-10-08T02:00:00.000+02:00",
      "dateFin": "2012-06-19T02:00:00.000+02:00",
      "preseance": "20",
      "nominPrincipale": "1",
      "infosQualite": {
        "codeQualite": "Membre",
        "libQualite": "Membre",
        "libQualiteSex": "Membre"
      },
      "organesRefs": [
        "PO393273"
      ]
    },
    {
      "uid": "PM396646",
      "acteurRef": "PA599",
      "legislature": "13",
      "typeOrgane": "GA",
      "dateDebut": "2007-10-08T02:00:00.000+02:00",
      "dateFin": "2012-06-19T02:00:00.000+02:00",
      "preseance": "20",
      "nominPrincipale": "1",
      "infosQualite": {
        "codeQualite": "Membre",
        "libQualite": "Membre",
        "libQualiteSex": "Membre"
      },
      "organesRefs": [
        "PO393283"
      ]
    },
    {
      "uid": "PM396647",
      "acteurRef": "PA599",
      "legislature": "13",
      "typeOrgane": "GA",
      "dateDebut": "2007-10-08T02:00:00.000+02:00",
      "dateFin": "2012-06-19T02:00:00.000+02:00",
      "preseance": "20",
      "nominPrincipale": "1",
      "infosQualite": {
        "codeQualite": "Membre",
        "libQualite": "Membre",
        "libQualiteSex": "Membre"
      },
      "organesRefs": [
        "PO393288"
      ]
    },
    {
      "uid": "PM396648",
      "acteurRef": "PA599",
      "legislature": "13",
      "typeOrgane": "GA",
      "dateDebut": "2007-10-08T02:00:00.000+02:00",
      "dateFin": "2012-06-19T02:00:00.000+02:00",
      "preseance": "20",
      "nominPrincipale": "1",
      "infosQualite": {
        "codeQualite": "Membre",
        "libQualite": "Membre",
        "libQualiteSex": "Membre"
      },
      "organesRefs": [
        "PO393313"
      ]
    },
    {
      "uid": "PM396649",
      "acteurRef": "PA599",
      "legislature": "13",
      "typeOrgane": "GA",
      "dateDebut": "2007-10-08T02:00:00.000+02:00",
      "dateFin": "2012-06-19T02:00:00.000+02:00",
      "preseance": "20",
      "nominPrincipale": "1",
      "infosQualite": {
        "codeQualite": "Membre",
        "libQualite": "Membre",
        "libQualiteSex": "Membre"
      },
      "organesRefs": [
        "PO393318"
      ]
    },
    {
      "uid": "PM396650",
      "acteurRef": "PA599",
      "legislature": "13",
      "typeOrgane": "GA",
      "dateDebut": "2007-10-08T02:00:00.000+02:00",
      "dateFin": "2012-06-19T02:00:00.000+02:00",
      "preseance": "20",
      "nominPrincipale": "1",
      "infosQualite": {
        "codeQualite": "Membre",
        "libQualite": "Membre",
        "libQualiteSex": "Membre"
      },
      "organesRefs": [
        "PO393323"
      ]
    },
    {
      "uid": "PM396651",
      "acteurRef": "PA599",
      "legislature": "13",
      "typeOrgane": "GA",
      "dateDebut": "2007-10-08T02:00:00.000+02:00",
      "dateFin": "2012-06-19T02:00:00.000+02:00",
      "preseance": "20",
      "nominPrincipale": "1",
      "infosQualite": {
        "codeQualite": "Membre",
        "libQualite": "Membre",
        "libQualiteSex": "Membre"
      },
      "organesRefs": [
        "PO393333"
      ]
    },
    {
      "uid": "PM396652",
      "acteurRef": "PA599",
      "legislature": "13",
      "typeOrgane": "GA",
      "dateDebut": "2007-10-08T02:00:00.000+02:00",
      "dateFin": "2012-06-19T02:00:00.000+02:00",
      "preseance": "20",
      "nominPrincipale": "1",
      "infosQualite": {
        "codeQualite": "Membre",
        "libQualite": "Membre",
        "libQualiteSex": "Membre"
      },
      "organesRefs": [
        "PO393348"
      ]
    },
    {
      "uid": "PM396653",
      "acteurRef": "PA599",
      "legislature": "13",
      "typeOrgane": "GA",
      "dateDebut": "2007-10-08T02:00:00.000+02:00",
      "dateFin": "2012-06-19T02:00:00.000+02:00",
      "preseance": "20",
      "nominPrincipale": "1",
      "infosQualite": {
        "codeQualite": "Membre",
        "libQualite": "Membre",
        "libQualiteSex": "Membre"
      },
      "organesRefs": [
        "PO393363"
      ]
    },
    {
      "uid": "PM396654",
      "acteurRef": "PA599",
      "legislature": "13",
      "typeOrgane": "GA",
      "dateDebut": "2007-10-08T02:00:00.000+02:00",
      "dateFin": "2012-06-19T02:00:00.000+02:00",
      "preseance": "20",
      "nominPrincipale": "1",
      "infosQualite": {
        "codeQualite": "Membre",
        "libQualite": "Membre",
        "libQualiteSex": "Membre"
      },
      "organesRefs": [
        "PO393383"
      ]
    },
    {
      "uid": "PM396655",
      "acteurRef": "PA599",
      "legislature": "13",
      "typeOrgane": "GA",
      "dateDebut": "2007-10-08T02:00:00.000+02:00",
      "dateFin": "2012-06-19T02:00:00.000+02:00",
      "preseance": "20",
      "nominPrincipale": "1",
      "infosQualite": {
        "codeQualite": "Membre",
        "libQualite": "Membre",
        "libQualiteSex": "Membre"
      },
      "organesRefs": [
        "PO393423"
      ]
    },
    {
      "uid": "PM396656",
      "acteurRef": "PA599",
      "legislature": "13",
      "typeOrgane": "GA",
      "dateDebut": "2007-10-08T02:00:00.000+02:00",
      "dateFin": "2012-06-19T02:00:00.000+02:00",
      "preseance": "20",
      "nominPrincipale": "1",
      "infosQualite": {
        "codeQualite": "Membre",
        "libQualite": "Membre",
        "libQualiteSex": "Membre"
      },
      "organesRefs": [
        "PO393443"
      ]
    },
    {
      "uid": "PM396657",
      "acteurRef": "PA599",
      "legislature": "13",
      "typeOrgane": "GA",
      "dateDebut": "2007-10-08T02:00:00.000+02:00",
      "dateFin": "2012-06-19T02:00:00.000+02:00",
      "preseance": "20",
      "nominPrincipale": "1",
      "infosQualite": {
        "codeQualite": "Membre",
        "libQualite": "Membre",
        "libQualiteSex": "Membre"
      },
      "organesRefs": [
        "PO393448"
      ]
    },
    {
      "uid": "PM396658",
      "acteurRef": "PA599",
      "legislature": "13",
      "typeOrgane": "GA",
      "dateDebut": "2007-10-08T02:00:00.000+02:00",
      "dateFin": "2012-06-19T02:00:00.000+02:00",
      "preseance": "20",
      "nominPrincipale": "1",
      "infosQualite": {
        "codeQualite": "Membre",
        "libQualite": "Membre",
        "libQualiteSex": "Membre"
      },
      "organesRefs": [
        "PO393453"
      ]
    },
    {
      "uid": "PM396659",
      "acteurRef": "PA599",
      "legislature": "13",
      "typeOrgane": "GA",
      "dateDebut": "2007-10-08T02:00:00.000+02:00",
      "dateFin": "2012-06-19T02:00:00.000+02:00",
      "preseance": "20",
      "nominPrincipale": "1",
      "infosQualite": {
        "codeQualite": "Membre",
        "libQualite": "Membre",
        "libQualiteSex": "Membre"
      },
      "organesRefs": [
        "PO393468"
      ]
    },
    {
      "uid": "PM396660",
      "acteurRef": "PA599",
      "legislature": "13",
      "typeOrgane": "GA",
      "dateDebut": "2007-10-08T02:00:00.000+02:00",
      "dateFin": "2012-06-19T02:00:00.000+02:00",
      "preseance": "20",
      "nominPrincipale": "1",
      "infosQualite": {
        "codeQualite": "Membre",
        "libQualite": "Membre",
        "libQualiteSex": "Membre"
      },
      "organesRefs": [
        "PO393483"
      ]
    },
    {
      "uid": "PM396661",
      "acteurRef": "PA599",
      "legislature": "13",
      "typeOrgane": "GA",
      "dateDebut": "2007-10-08T02:00:00.000+02:00",
      "dateFin": "2012-06-19T02:00:00.000+02:00",
      "preseance": "20",
      "nominPrincipale": "1",
      "infosQualite": {
        "codeQualite": "Membre",
        "libQualite": "Membre",
        "libQualiteSex": "Membre"
      },
      "organesRefs": [
        "PO393503"
      ]
    },
    {
      "uid": "PM396662",
      "acteurRef": "PA599",
      "legislature": "13",
      "typeOrgane": "GA",
      "dateDebut": "2007-10-08T02:00:00.000+02:00",
      "dateFin": "2012-06-19T02:00:00.000+02:00",
      "preseance": "20",
      "nominPrincipale": "1",
      "infosQualite": {
        "codeQualite": "Membre",
        "libQualite": "Membre",
        "libQualiteSex": "Membre"
      },
      "organesRefs": [
        "PO393508"
      ]
    },
    {
      "uid": "PM396663",
      "acteurRef": "PA599",
      "legislature": "13",
      "typeOrgane": "GA",
      "dateDebut": "2007-10-08T02:00:00.000+02:00",
      "dateFin": "2012-06-19T02:00:00.000+02:00",
      "preseance": "20",
      "nominPrincipale": "1",
      "infosQualite": {
        "codeQualite": "Membre",
        "libQualite": "Membre",
        "libQualiteSex": "Membre"
      },
      "organesRefs": [
        "PO393513"
      ]
    },
    {
      "uid": "PM396664",
      "acteurRef": "PA599",
      "legislature": "13",
      "typeOrgane": "GEVI",
      "dateDebut": "2007-10-08T02:00:00.000+02:00",
      "dateFin": "2012-06-19T02:00:00.000+02:00",
      "preseance": "20",
      "nominPrincipale": "1",
      "infosQualite": {
        "codeQualite": "Membre",
        "libQualite": "Membre",
        "libQualiteSex": "Membre"
      },
      "organesRefs": [
        "PO392765"
      ]
    },
    {
      "uid": "PM396665",
      "acteurRef": "PA599",
      "legislature": "13",
      "typeOrgane": "GEVI",
      "dateDebut": "2007-10-08T02:00:00.000+02:00",
      "dateFin": "2012-06-19T02:00:00.000+02:00",
      "preseance": "20",
      "nominPrincipale": "1",
      "infosQualite": {
        "codeQualite": "Membre",
        "libQualite": "Membre",
        "libQualiteSex": "Membre"
      },
      "organesRefs": [
        "PO393141"
      ]
    },
    {
      "uid": "PM396666",
      "acteurRef": "PA599",
      "legislature": "13",
      "typeOrgane": "GEVI",
      "dateDebut": "2007-10-08T02:00:00.000+02:00",
      "dateFin": "2012-06-19T02:00:00.000+02:00",
      "preseance": "20",
      "nominPrincipale": "1",
      "infosQualite": {
        "codeQualite": "Membre",
        "libQualite": "Membre",
        "libQualiteSex": "Membre"
      },
      "organesRefs": [
        "PO393228"
      ]
    },
    {
      "uid": "PM396667",
      "acteurRef": "PA599",
      "legislature": "13",
      "typeOrgane": "GEVI",
      "dateDebut": "2007-10-08T02:00:00.000+02:00",
      "dateFin": "2012-06-19T02:00:00.000+02:00",
      "preseance": "20",
      "nominPrincipale": "1",
      "infosQualite": {
        "codeQualite": "Membre",
        "libQualite": "Membre",
        "libQualiteSex": "Membre"
      },
      "organesRefs": [
        "PO393433"
      ]
    },
    {
      "uid": "PM401283",
      "acteurRef": "PA599",
      "legislature": "13",
      "typeOrgane": "GA",
      "dateDebut": "2007-10-26T02:00:00.000+02:00",
      "dateFin": "2012-06-19T02:00:00.000+02:00",
      "preseance": "20",
      "nominPrincipale": "1",
      "infosQualite": {
        "codeQualite": "Membre",
        "libQualite": "Membre",
        "libQualiteSex": "Membre"
      },
      "organesRefs": [
        "PO393080"
      ]
    },
    {
      "uid": "PM401284",
      "acteurRef": "PA599",
      "legislature": "13",
      "typeOrgane": "GA",
      "dateDebut": "2007-10-26T02:00:00.000+02:00",
      "dateFin": "2012-06-19T02:00:00.000+02:00",
      "preseance": "20",
      "nominPrincipale": "1",
      "infosQualite": {
        "codeQualite": "Membre",
        "libQualite": "Membre",
        "libQualiteSex": "Membre"
      },
      "organesRefs": [
        "PO393105"
      ]
    },
    {
      "uid": "PM401285",
      "acteurRef": "PA599",
      "legislature": "13",
      "typeOrgane": "GA",
      "dateDebut": "2007-10-26T02:00:00.000+02:00",
      "dateFin": "2012-06-19T02:00:00.000+02:00",
      "preseance": "20",
      "nominPrincipale": "1",
      "infosQualite": {
        "codeQualite": "Membre",
        "libQualite": "Membre",
        "libQualiteSex": "Membre"
      },
      "organesRefs": [
        "PO393197"
      ]
    },
    {
      "uid": "PM401286",
      "acteurRef": "PA599",
      "legislature": "13",
      "typeOrgane": "GA",
      "dateDebut": "2007-10-26T02:00:00.000+02:00",
      "dateFin": "2012-06-19T02:00:00.000+02:00",
      "preseance": "20",
      "nominPrincipale": "1",
      "infosQualite": {
        "codeQualite": "Membre",
        "libQualite": "Membre",
        "libQualiteSex": "Membre"
      },
      "organesRefs": [
        "PO393253"
      ]
    },
    {
      "uid": "PM401287",
      "acteurRef": "PA599",
      "legislature": "13",
      "typeOrgane": "GA",
      "dateDebut": "2007-10-26T02:00:00.000+02:00",
      "dateFin": "2012-06-19T02:00:00.000+02:00",
      "preseance": "20",
      "nominPrincipale": "1",
      "infosQualite": {
        "codeQualite": "Membre",
        "libQualite": "Membre",
        "libQualiteSex": "Membre"
      },
      "organesRefs": [
        "PO393378"
      ]
    },
    {
      "uid": "PM401288",
      "acteurRef": "PA599",
      "legislature": "13",
      "typeOrgane": "GA",
      "dateDebut": "2007-10-26T02:00:00.000+02:00",
      "dateFin": "2012-06-19T02:00:00.000+02:00",
      "preseance": "20",
      "nominPrincipale": "1",
      "infosQualite": {
        "codeQualite": "Membre",
        "libQualite": "Membre",
        "libQualiteSex": "Membre"
      },
      "organesRefs": [
        "PO393478"
      ]
    },
    {
      "uid": "PM401395",
      "acteurRef": "PA599",
      "legislature": "13",
      "typeOrgane": "GEVI",
      "dateDebut": "2007-10-26T02:00:00.000+02:00",
      "dateFin": "2012-06-19T02:00:00.000+02:00",
      "preseance": "20",
      "nominPrincipale": "1",
      "infosQualite": {
        "codeQualite": "Membre",
        "libQualite": "Membre",
        "libQualiteSex": "Membre"
      },
      "organesRefs": [
        "PO392870"
      ]
    },
    {
      "uid": "PM402239",
      "acteurRef": "PA599",
      "legislature": "13",
      "typeOrgane": "OFFPAR",
      "dateDebut": "2007-10-30T01:00:00.000+01:00",
      "datePublication": "2007-10-31T01:00:00.000+01:00",
      "dateFin": "2012-06-19T02:00:00.000+02:00",
      "preseance": "24",
      "nominPrincipale": "1",
      "infosQualite": {
        "codeQualite": "Membre",
        "libQualite": "Membre",
        "libQualiteSex": "Membre"
      },
      "organesRefs": [
        "PO402232"
      ]
    },
    {
      "uid": "PM402612",
      "acteurRef": "PA599",
      "legislature": "13",
      "typeOrgane": "GA",
      "dateDebut": "2007-11-07T01:00:00.000+01:00",
      "dateFin": "2008-04-14T02:00:00.000+02:00",
      "preseance": "8",
      "nominPrincipale": "1",
      "infosQualite": {
        "codeQualite": "Vice-Président",
        "libQualite": "Vice-Président",
        "libQualiteSex": "Vice-Président"
      },
      "organesRefs": [
        "PO392925"
      ]
    },
    {
      "uid": "PM404030",
      "acteurRef": "PA599",
      "legislature": "13",
      "typeOrgane": "GA",
      "dateDebut": "2007-11-21T01:00:00.000+01:00",
      "dateFin": "2012-06-19T02:00:00.000+02:00",
      "preseance": "14",
      "nominPrincipale": "1",
      "infosQualite": {
        "codeQualite": "Secrétaire",
        "libQualite": "Secrétaire",
        "libQualiteSex": "Secrétaire"
      },
      "organesRefs": [
        "PO392835"
      ]
    },
    {
      "uid": "PM404458",
      "acteurRef": "PA599",
      "legislature": "13",
      "typeOrgane": "GA",
      "dateDebut": "2007-07-18T02:00:00.000+02:00",
      "dateFin": "2008-04-14T02:00:00.000+02:00",
      "preseance": "8",
      "nominPrincipale": "1",
      "infosQualite": {
        "codeQualite": "Vice-Président",
        "libQualite": "Vice-Président",
        "libQualiteSex": "Vice-Président"
      },
      "organesRefs": [
        "PO393212"
      ]
    },
    {
      "uid": "PM404549",
      "acteurRef": "PA599",
      "legislature": "13",
      "typeOrgane": "GA",
      "dateDebut": "2007-11-28T01:00:00.000+01:00",
      "dateFin": "2012-06-19T02:00:00.000+02:00",
      "preseance": "8",
      "nominPrincipale": "1",
      "infosQualite": {
        "codeQualite": "Vice-Président",
        "libQualite": "Vice-Président",
        "libQualiteSex": "Vice-Président"
      },
      "organesRefs": [
        "PO392714"
      ]
    },
    {
      "uid": "PM404894",
      "acteurRef": "PA599",
      "legislature": "13",
      "typeOrgane": "GA",
      "dateDebut": "2007-12-04T01:00:00.000+01:00",
      "dateFin": "2012-06-19T02:00:00.000+02:00",
      "preseance": "14",
      "nominPrincipale": "1",
      "infosQualite": {
        "codeQualite": "Secrétaire",
        "libQualite": "Secrétaire",
        "libQualiteSex": "Secrétaire"
      },
      "organesRefs": [
        "PO392905"
      ]
    },
    {
      "uid": "PM405293",
      "acteurRef": "PA599",
      "legislature": "13",
      "typeOrgane": "OFFPAR",
      "dateDebut": "2007-12-12T01:00:00.000+01:00",
      "datePublication": "2007-12-13T01:00:00.000+01:00",
      "dateFin": "2012-06-19T02:00:00.000+02:00",
      "preseance": "12",
      "nominPrincipale": "1",
      "infosQualite": {
        "codeQualite": "Membre nommé par le Président de l'Assemblée nationale",
        "libQualite": "Membre nommé par le Président de l'Assemblée nationale",
        "libQualiteSex": "Membre nommé par le Président de l'Assemblée nationale"
      },
      "organesRefs": [
        "PO402232"
      ]
    },
    {
      "uid": "PM405305",
      "acteurRef": "PA599",
      "legislature": "13",
      "typeOrgane": "OFFPAR",
      "dateDebut": "2007-12-13T01:00:00.000+01:00",
      "dateFin": "2008-12-31T01:00:00.000+01:00",
      "preseance": "10",
      "nominPrincipale": "1",
      "infosQualite": {
        "codeQualite": "Vice-Président",
        "libQualite": "Vice-Président",
        "libQualiteSex": "Vice-Président"
      },
      "organesRefs": [
        "PO402232"
      ]
    },
    {
      "uid": "PM405363",
      "acteurRef": "PA599",
      "legislature": "13",
      "typeOrgane": "GEVI",
      "dateDebut": "2007-12-11T01:00:00.000+01:00",
      "dateFin": "2012-06-19T02:00:00.000+02:00",
      "preseance": "8",
      "nominPrincipale": "1",
      "infosQualite": {
        "codeQualite": "Vice-Président",
        "libQualite": "Vice-Président",
        "libQualiteSex": "Vice-Président"
      },
      "organesRefs": [
        "PO392870"
      ]
    },
    {
      "uid": "PM405419",
      "acteurRef": "PA599",
      "legislature": "13",
      "typeOrgane": "GA",
      "dateDebut": "2007-11-28T01:00:00.000+01:00",
      "dateFin": "2012-06-19T02:00:00.000+02:00",
      "preseance": "8",
      "nominPrincipale": "1",
      "infosQualite": {
        "codeQualite": "Vice-Président",
        "libQualite": "Vice-Président",
        "libQualiteSex": "Vice-Président"
      },
      "organesRefs": [
        "PO393055"
      ]
    },
    {
      "uid": "PM405901",
      "acteurRef": "PA599",
      "legislature": "13",
      "typeOrgane": "GE",
      "dateDebut": "2007-12-20T01:00:00.000+01:00",
      "dateFin": "2012-06-19T02:00:00.000+02:00",
      "preseance": "20",
      "nominPrincipale": "1",
      "infosQualite": {
        "codeQualite": "Membre",
        "libQualite": "Membre",
        "libQualiteSex": "Membre"
      },
      "organesRefs": [
        "PO403141"
      ]
    },
    {
      "uid": "PM405986",
      "acteurRef": "PA599",
      "legislature": "13",
      "typeOrgane": "GE",
      "dateDebut": "2007-12-20T01:00:00.000+01:00",
      "dateFin": "2012-06-19T02:00:00.000+02:00",
      "preseance": "20",
      "nominPrincipale": "1",
      "infosQualite": {
        "codeQualite": "Membre",
        "libQualite": "Membre",
        "libQualiteSex": "Membre"
      },
      "organesRefs": [
        "PO402967"
      ]
    },
    {
      "uid": "PM406020",
      "acteurRef": "PA599",
      "legislature": "13",
      "typeOrgane": "GE",
      "dateDebut": "2007-12-21T01:00:00.000+01:00",
      "dateFin": "2012-06-19T02:00:00.000+02:00",
      "preseance": "20",
      "nominPrincipale": "1",
      "infosQualite": {
        "codeQualite": "Membre",
        "libQualite": "Membre",
        "libQualiteSex": "Membre"
      },
      "organesRefs": [
        "PO402721"
      ]
    },
    {
      "uid": "PM406405",
      "acteurRef": "PA599",
      "legislature": "13",
      "typeOrgane": "GE",
      "dateDebut": "2007-12-18T01:00:00.000+01:00",
      "dateFin": "2012-06-19T02:00:00.000+02:00",
      "preseance": "20",
      "nominPrincipale": "1",
      "infosQualite": {
        "codeQualite": "Membre",
        "libQualite": "Membre",
        "libQualiteSex": "Membre"
      },
      "organesRefs": [
        "PO403283"
      ]
    },
    {
      "uid": "PM406548",
      "acteurRef": "PA599",
      "legislature": "13",
      "typeOrgane": "GE",
      "dateDebut": "2008-01-15T01:00:00.000+01:00",
      "dateFin": "2012-06-19T02:00:00.000+02:00",
      "preseance": "20",
      "nominPrincipale": "1",
      "infosQualite": {
        "codeQualite": "Membre",
        "libQualite": "Membre",
        "libQualiteSex": "Membre"
      },
      "organesRefs": [
        "PO402943"
      ]
    },
    {
      "uid": "PM406998",
      "acteurRef": "PA599",
      "legislature": "13",
      "typeOrgane": "GA",
      "dateDebut": "2008-01-15T01:00:00.000+01:00",
      "dateFin": "2012-06-19T02:00:00.000+02:00",
      "preseance": "8",
      "nominPrincipale": "1",
      "infosQualite": {
        "codeQualite": "Vice-Président",
        "libQualite": "Vice-Président",
        "libQualiteSex": "Vice-Président"
      },
      "organesRefs": [
        "PO393283"
      ]
    },
    {
      "uid": "PM408687",
      "acteurRef": "PA599",
      "legislature": "13",
      "typeOrgane": "GE",
      "dateDebut": "2008-02-07T01:00:00.000+01:00",
      "dateFin": "2012-06-19T02:00:00.000+02:00",
      "preseance": "20",
      "nominPrincipale": "1",
      "infosQualite": {
        "codeQualite": "Membre",
        "libQualite": "Membre",
        "libQualiteSex": "Membre"
      },
      "organesRefs": [
        "PO403009"
      ]
    },
    {
      "uid": "PM408776",
      "acteurRef": "PA599",
      "legislature": "13",
      "typeOrgane": "GE",
      "dateDebut": "2008-02-11T01:00:00.000+01:00",
      "dateFin": "2012-06-19T02:00:00.000+02:00",
      "preseance": "20",
      "nominPrincipale": "1",
      "infosQualite": {
        "codeQualite": "Membre",
        "libQualite": "Membre",
        "libQualiteSex": "Membre"
      },
      "organesRefs": [
        "PO403099"
      ]
    },
    {
      "uid": "PM409534",
      "acteurRef": "PA599",
      "legislature": "13",
      "typeOrgane": "GE",
      "dateDebut": "2008-02-22T01:00:00.000+01:00",
      "dateFin": "2012-06-19T02:00:00.000+02:00",
      "preseance": "20",
      "nominPrincipale": "1",
      "infosQualite": {
        "codeQualite": "Membre",
        "libQualite": "Membre",
        "libQualiteSex": "Membre"
      },
      "organesRefs": [
        "PO403166"
      ]
    },
    {
      "uid": "PM411352",
      "acteurRef": "PA599",
      "legislature": "13",
      "typeOrgane": "GE",
      "dateDebut": "2008-03-31T02:00:00.000+02:00",
      "dateFin": "2012-06-19T02:00:00.000+02:00",
      "preseance": "20",
      "nominPrincipale": "1",
      "infosQualite": {
        "codeQualite": "Membre",
        "libQualite": "Membre",
        "libQualiteSex": "Membre"
      },
      "organesRefs": [
        "PO405831"
      ]
    },
    {
      "uid": "PM411631",
      "acteurRef": "PA599",
      "legislature": "13",
      "typeOrgane": "GE",
      "dateDebut": "2008-03-31T02:00:00.000+02:00",
      "dateFin": "2012-06-19T02:00:00.000+02:00",
      "preseance": "20",
      "nominPrincipale": "1",
      "infosQualite": {
        "codeQualite": "Membre",
        "libQualite": "Membre",
        "libQualiteSex": "Membre"
      },
      "organesRefs": [
        "PO402882"
      ]
    },
    {
      "uid": "PM412904",
      "acteurRef": "PA599",
      "legislature": "13",
      "typeOrgane": "GE",
      "dateDebut": "2008-04-09T02:00:00.000+02:00",
      "dateFin": "2012-06-19T02:00:00.000+02:00",
      "preseance": "20",
      "nominPrincipale": "1",
      "infosQualite": {
        "codeQualite": "Membre",
        "libQualite": "Membre",
        "libQualiteSex": "Membre"
      },
      "organesRefs": [
        "PO403154"
      ]
    },
    {
      "uid": "PM413063",
      "acteurRef": "PA599",
      "legislature": "13",
      "typeOrgane": "GE",
      "dateDebut": "2008-04-29T02:00:00.000+02:00",
      "dateFin": "2012-06-19T02:00:00.000+02:00",
      "preseance": "20",
      "nominPrincipale": "1",
      "infosQualite": {
        "codeQualite": "Membre",
        "libQualite": "Membre",
        "libQualiteSex": "Membre"
      },
      "organesRefs": [
        "PO402913"
      ]
    },
    {
      "uid": "PM414926",
      "acteurRef": "PA599",
      "legislature": "13",
      "typeOrgane": "GE",
      "dateDebut": "2007-10-31T01:00:00.000+01:00",
      "dateFin": "2012-06-19T02:00:00.000+02:00",
      "preseance": "20",
      "nominPrincipale": "1",
      "infosQualite": {
        "codeQualite": "Membre",
        "libQualite": "Membre",
        "libQualiteSex": "Membre"
      },
      "organesRefs": [
        "PO403021"
      ]
    },
    {
      "uid": "PM418811",
      "acteurRef": "PA599",
      "legislature": "13",
      "typeOrgane": "GE",
      "dateDebut": "2009-03-27T01:00:00.000+01:00",
      "dateFin": "2012-06-19T02:00:00.000+02:00",
      "preseance": "20",
      "nominPrincipale": "1",
      "infosQualite": {
        "codeQualite": "Membre",
        "libQualite": "Membre",
        "libQualiteSex": "Membre"
      },
      "organesRefs": [
        "PO417124"
      ]
    },
    {
      "uid": "PM422883",
      "acteurRef": "PA599",
      "legislature": "13",
      "typeOrgane": "OFFPAR",
      "dateDebut": "2010-01-01T01:00:00.000+01:00",
      "dateFin": "2012-06-19T02:00:00.000+02:00",
      "preseance": "10",
      "nominPrincipale": "1",
      "infosQualite": {
        "codeQualite": "Vice-Président",
        "libQualite": "Vice-Président",
        "libQualiteSex": "Vice-Président"
      },
      "organesRefs": [
        "PO402232"
      ]
    },
    {
      "uid": "PM424922",
      "acteurRef": "PA599",
      "legislature": "13",
      "typeOrgane": "GE",
      "dateDebut": "2010-07-27T02:00:00.000+02:00",
      "dateFin": "2012-06-19T02:00:00.000+02:00",
      "preseance": "20",
      "nominPrincipale": "1",
      "infosQualite": {
        "codeQualite": "Membre",
        "libQualite": "Membre",
        "libQualiteSex": "Membre"
      },
      "organesRefs": [
        "PO424325"
      ]
    },
    {
      "uid": "PM427149",
      "acteurRef": "PA599",
      "legislature": "13",
      "typeOrgane": "GE",
      "dateDebut": "2011-02-01T01:00:00.000+01:00",
      "dateFin": "2012-06-19T02:00:00.000+02:00",
      "preseance": "20",
      "nominPrincipale": "1",
      "infosQualite": {
        "codeQualite": "Membre",
        "libQualite": "Membre",
        "libQualiteSex": "Membre"
      },
      "organesRefs": [
        "PO425860"
      ]
    },
    {
      "uid": "PM427745",
      "acteurRef": "PA599",
      "legislature": "13",
      "typeOrgane": "GA",
      "dateDebut": "2011-03-10T01:00:00.000+01:00",
      "dateFin": "2012-06-19T02:00:00.000+02:00",
      "preseance": "8",
      "nominPrincipale": "1",
      "infosQualite": {
        "codeQualite": "Vice-Président",
        "libQualite": "Vice-Président",
        "libQualiteSex": "Vice-Président"
      },
      "organesRefs": [
        "PO393513"
      ]
    }
  ]
}