{
  "uid": "PO746669",
  "codeType": "GE",
  "libelle": "Chasse et territoires",
  "libelleEdition": "CHASSE ET TERRITOIRES",
  "libelleAbrege": "CHASSE ET TERRITOIRES",
  "libelleAbrev": "CHASSETERR",
  "viMoDe": {
    "dateAgrement": "2017-12-20T01:00:00.000+01:00"
  },
  "regime": "5ème République",
  "legislature": "15",
  "secretariat": {
    "secretaire01": "M. Axel Maybon"
  }
}