{
  "uid": "PA721158",
  "etatCivil": {
    "ident": {
      "civ": "M.",
      "prenom": "Pieyre-Alexandre",
      "nom": "Anglade",
      "alpha": "Anglade",
      "trigramme": "PAE"
    },
    "infoNaissance": {
      "dateNais": "1986-11-02T01:00:00.000+01:00",
      "villeNais": "Paris 16",
      "depNais": "Paris",
      "paysNais": "France"
    }
  },
  "profession": {
    "libelleCourant": "Agent contractuel au Parlement européen",
    "socProcInsee": {
      "catSocPro": "Cadres de la fonction publique, professions intellectuelles et  artistiques",
      "famSocPro": "Cadres et professions intellectuelles supérieures"
    }
  },
  "uriHatvp": "https://www.hatvp.fr/pages_nominatives/anglade-pieyre-alexandre",
  "adresses": [
    {
      "xsiType": "AdressePostale_Type",
      "uid": "AD721160",
      "type": "0",
      "typeLibelle": "Adresse officielle",
      "poids": "1",
      "intitule": "Assemblée nationale,",
      "numeroRue": "126",
      "nomRue": "Rue de l'Université,",
      "codePostal": "75355",
      "ville": "Paris 07 SP"
    },
    {
      "xsiType": "AdresseMail_Type",
      "uid": "AD728220",
      "type": "15",
      "typeLibelle": "Mèl",
      "valElec": "pieyre-alexandre.anglade@assemblee-nationale.fr"
    },
    {
      "xsiType": "AdresseTelephonique_Type",
      "uid": "AD757973",
      "type": "11",
      "typeLibelle": "Téléphone",
      "poids": "1",
      "adresseDeRattachement": "AD721160",
      "valElec": "01.40.63.66.80"
    }
  ],
  "mandats": [
    {
      "uid": "PM723190",
      "acteurRef": "PA721158",
      "legislature": "15",
      "typeOrgane": "ASSEMBLEE",
      "dateDebut": "2017-06-18T02:00:00.000+02:00",
      "preseance": "50",
      "nominPrincipale": "1",
      "infosQualite": {
        "codeQualite": "membre",
        "libQualite": "membre",
        "libQualiteSex": "membre"
      },
      "organesRefs": [
        "PO717460"
      ],
      "suppleant": {
        "dateDebut": "2017-06-18T02:00:00.000+02:00",
        "suppleantRef": "PA721162"
      },
      "election": {
        "lieu": {
          "region": "Français établis hors de France",
          "regionType": "Français établis hors de France",
          "departement": "Français établis hors de France",
          "numDepartement": "099",
          "numCirco": "4"
        },
        "causeMandat": "élections générales",
        "refCirconscription": "PO718582"
      },
      "mandature": {
        "datePriseFonction": "2017-06-21T02:00:00.000+02:00",
        "premiereElection": "0",
        "placeHemicycle": "227"
      },
      "collaborateurs": [
        {
          "qualite": "M.",
          "prenom": "Raphaël",
          "nom": "Dorgans"
        },
        {
          "qualite": "M.",
          "prenom": "Quentin",
          "nom": "Deleruelle"
        },
        {
          "qualite": "Mme",
          "prenom": "Fanny",
          "nom": "Devaux"
        }
      ]
    },
    {
      "uid": "PM724636",
      "acteurRef": "PA721158",
      "legislature": "15",
      "typeOrgane": "GP",
      "dateDebut": "2017-06-21T02:00:00.000+02:00",
      "dateFin": "2017-06-26T02:00:00.000+02:00",
      "preseance": "28",
      "nominPrincipale": "1",
      "infosQualite": {
        "codeQualite": "Député non-inscrit",
        "libQualite": "Député non-inscrit",
        "libQualiteSex": "Député non-inscrit"
      },
      "organesRefs": [
        "PO723569"
      ]
    },
    {
      "uid": "PM731181",
      "acteurRef": "PA721158",
      "legislature": "15",
      "typeOrgane": "GP",
      "dateDebut": "2017-06-27T02:00:00.000+02:00",
      "datePublication": "2017-06-28T02:00:00.000+02:00",
      "preseance": "20",
      "nominPrincipale": "1",
      "infosQualite": {
        "codeQualite": "Membre",
        "libQualite": "Membre du",
        "libQualiteSex": "Membre du"
      },
      "organesRefs": [
        "PO730964"
      ]
    },
    {
      "uid": "PM731966",
      "acteurRef": "PA721158",
      "legislature": "15",
      "typeOrgane": "COMPER",
      "dateDebut": "2017-06-29T02:00:00.000+02:00",
      "datePublication": "2017-06-29T02:00:00.000+02:00",
      "preseance": "32",
      "nominPrincipale": "1",
      "infosQualite": {
        "codeQualite": "Membre",
        "libQualite": "Membre",
        "libQualiteSex": "Membre"
      },
      "organesRefs": [
        "PO59046"
      ]
    },
    {
      "uid": "PM732361",
      "acteurRef": "PA721158",
      "legislature": "15",
      "typeOrgane": "COMNL",
      "dateDebut": "2017-07-05T02:00:00.000+02:00",
      "datePublication": "2017-07-05T02:00:00.000+02:00",
      "preseance": "20",
      "nominPrincipale": "0",
      "infosQualite": {
        "codeQualite": "Membre",
        "libQualite": "Membre",
        "libQualiteSex": "Membre"
      },
      "organesRefs": [
        "PO415287"
      ]
    },
    {
      "uid": "PM732411",
      "acteurRef": "PA721158",
      "legislature": "15",
      "typeOrgane": "COMNL",
      "dateDebut": "2017-07-06T02:00:00.000+02:00",
      "datePublication": "2017-07-06T02:00:00.000+02:00",
      "preseance": "8",
      "nominPrincipale": "1",
      "infosQualite": {
        "codeQualite": "Vice-Président",
        "libQualite": "Vice-Président",
        "libQualiteSex": "Vice-Président"
      },
      "organesRefs": [
        "PO415287"
      ]
    },
    {
      "uid": "PM734414",
      "acteurRef": "PA721158",
      "legislature": "15",
      "typeOrgane": "API",
      "dateDebut": "2017-08-02T02:00:00.000+02:00",
      "datePublication": "2017-08-03T02:00:00.000+02:00",
      "dateFin": "2018-12-18T01:00:00.000+01:00",
      "preseance": "24",
      "nominPrincipale": "1",
      "infosQualite": {
        "codeQualite": "Suppléant",
        "libQualite": "Membre suppléant",
        "libQualiteSex": "Membre suppléant"
      },
      "organesRefs": [
        "PO304272"
      ]
    },
    {
      "uid": "PM735266",
      "acteurRef": "PA721158",
      "legislature": "15",
      "typeOrgane": "GA",
      "dateDebut": "2017-09-26T02:00:00.000+02:00",
      "preseance": "20",
      "nominPrincipale": "0",
      "infosQualite": {
        "codeQualite": "Membre",
        "libQualite": "Membre",
        "libQualiteSex": "Membre"
      },
      "organesRefs": [
        "PO733637"
      ]
    },
    {
      "uid": "PM735267",
      "acteurRef": "PA721158",
      "legislature": "15",
      "typeOrgane": "GA",
      "dateDebut": "2017-09-26T02:00:00.000+02:00",
      "preseance": "1",
      "nominPrincipale": "1",
      "infosQualite": {
        "codeQualite": "Président",
        "libQualite": "Président",
        "libQualiteSex": "Président"
      },
      "organesRefs": [
        "PO733637"
      ]
    },
    {
      "uid": "PM737455",
      "acteurRef": "PA721158",
      "legislature": "15",
      "typeOrgane": "GA",
      "dateDebut": "2017-10-04T02:00:00.000+02:00",
      "preseance": "20",
      "nominPrincipale": "1",
      "infosQualite": {
        "codeQualite": "Membre",
        "libQualite": "Membre",
        "libQualiteSex": "Membre"
      },
      "organesRefs": [
        "PO732964"
      ]
    },
    {
      "uid": "PM737456",
      "acteurRef": "PA721158",
      "legislature": "15",
      "typeOrgane": "GA",
      "dateDebut": "2017-10-04T02:00:00.000+02:00",
      "preseance": "20",
      "nominPrincipale": "1",
      "infosQualite": {
        "codeQualite": "Membre",
        "libQualite": "Membre",
        "libQualiteSex": "Membre"
      },
      "organesRefs": [
        "PO733107"
      ]
    },
    {
      "uid": "PM737457",
      "acteurRef": "PA721158",
      "legislature": "15",
      "typeOrgane": "GA",
      "dateDebut": "2017-10-04T02:00:00.000+02:00",
      "preseance": "20",
      "nominPrincipale": "1",
      "infosQualite": {
        "codeQualite": "Membre",
        "libQualite": "Membre",
        "libQualiteSex": "Membre"
      },
      "organesRefs": [
        "PO733302"
      ]
    },
    {
      "uid": "PM737458",
      "acteurRef": "PA721158",
      "legislature": "15",
      "typeOrgane": "GA",
      "dateDebut": "2017-10-04T02:00:00.000+02:00",
      "preseance": "20",
      "nominPrincipale": "1",
      "infosQualite": {
        "codeQualite": "Membre",
        "libQualite": "Membre",
        "libQualiteSex": "Membre"
      },
      "organesRefs": [
        "PO733307"
      ]
    },
    {
      "uid": "PM737459",
      "acteurRef": "PA721158",
      "legislature": "15",
      "typeOrgane": "GA",
      "dateDebut": "2017-10-04T02:00:00.000+02:00",
      "preseance": "20",
      "nominPrincipale": "1",
      "infosQualite": {
        "codeQualite": "Membre",
        "libQualite": "Membre",
        "libQualiteSex": "Membre"
      },
      "organesRefs": [
        "PO733322"
      ]
    },
    {
      "uid": "PM737460",
      "acteurRef": "PA721158",
      "legislature": "15",
      "typeOrgane": "GA",
      "dateDebut": "2017-10-04T02:00:00.000+02:00",
      "preseance": "20",
      "nominPrincipale": "0",
      "infosQualite": {
        "codeQualite": "Membre",
        "libQualite": "Membre",
        "libQualiteSex": "Membre"
      },
      "organesRefs": [
        "PO733357"
      ]
    },
    {
      "uid": "PM737461",
      "acteurRef": "PA721158",
      "legislature": "15",
      "typeOrgane": "GA",
      "dateDebut": "2017-10-04T02:00:00.000+02:00",
      "preseance": "20",
      "nominPrincipale": "1",
      "infosQualite": {
        "codeQualite": "Membre",
        "libQualite": "Membre",
        "libQualiteSex": "Membre"
      },
      "organesRefs": [
        "PO733382"
      ]
    },
    {
      "uid": "PM737462",
      "acteurRef": "PA721158",
      "legislature": "15",
      "typeOrgane": "GA",
      "dateDebut": "2017-10-04T02:00:00.000+02:00",
      "preseance": "20",
      "nominPrincipale": "1",
      "infosQualite": {
        "codeQualite": "Membre",
        "libQualite": "Membre",
        "libQualiteSex": "Membre"
      },
      "organesRefs": [
        "PO733577"
      ]
    },
    {
      "uid": "PM737463",
      "acteurRef": "PA721158",
      "legislature": "15",
      "typeOrgane": "GA",
      "dateDebut": "2017-10-04T02:00:00.000+02:00",
      "preseance": "20",
      "nominPrincipale": "1",
      "infosQualite": {
        "codeQualite": "Membre",
        "libQualite": "Membre",
        "libQualiteSex": "Membre"
      },
      "organesRefs": [
        "PO733607"
      ]
    },
    {
      "uid": "PM737464",
      "acteurRef": "PA721158",
      "legislature": "15",
      "typeOrgane": "GA",
      "dateDebut": "2017-10-04T02:00:00.000+02:00",
      "preseance": "20",
      "nominPrincipale": "1",
      "infosQualite": {
        "codeQualite": "Membre",
        "libQualite": "Membre",
        "libQualiteSex": "Membre"
      },
      "organesRefs": [
        "PO733627"
      ]
    },
    {
      "uid": "PM742129",
      "acteurRef": "PA721158",
      "legislature": "15",
      "typeOrgane": "ORGAINT",
      "dateDebut": "2017-10-27T02:00:00.000+02:00",
      "datePublication": "2017-10-28T02:00:00.000+02:00",
      "preseance": "42",
      "nominPrincipale": "1",
      "infosQualite": {
        "codeQualite": "Membre",
        "libQualite": "Membre",
        "libQualiteSex": "Membre"
      },
      "organesRefs": [
        "PO201115"
      ]
    },
    {
      "uid": "PM743154",
      "acteurRef": "PA721158",
      "legislature": "15",
      "typeOrgane": "GA",
      "dateDebut": "2017-11-14T01:00:00.000+01:00",
      "preseance": "8",
      "nominPrincipale": "1",
      "infosQualite": {
        "codeQualite": "Vice-Président",
        "libQualite": "Vice-Président",
        "libQualiteSex": "Vice-Président"
      },
      "organesRefs": [
        "PO733357"
      ]
    },
    {
      "uid": "PM744838",
      "acteurRef": "PA721158",
      "legislature": "15",
      "typeOrgane": "MISINFOPRE",
      "dateDebut": "2017-12-07T01:00:00.000+01:00",
      "datePublication": "2017-12-07T01:00:00.000+01:00",
      "dateFin": "2018-11-20T01:00:00.000+01:00",
      "preseance": "20",
      "nominPrincipale": "1",
      "infosQualite": {
        "codeQualite": "Membre",
        "libQualite": "Membre",
        "libQualiteSex": "Membre"
      },
      "organesRefs": [
        "PO743664"
      ]
    },
    {
      "uid": "PM744935",
      "acteurRef": "PA721158",
      "typeOrgane": "PARPOL",
      "dateDebut": "2017-12-01T01:00:00.000+01:00",
      "preseance": "5",
      "nominPrincipale": "1",
      "infosQualite": {
        "codeQualite": "Membre",
        "libQualite": "Membre",
        "libQualiteSex": "Membre"
      },
      "organesRefs": [
        "PO744854"
      ]
    },
    {
      "uid": "PM746745",
      "acteurRef": "PA721158",
      "legislature": "15",
      "typeOrgane": "MISINFOPRE",
      "dateDebut": "2017-12-21T01:00:00.000+01:00",
      "datePublication": "2017-12-21T01:00:00.000+01:00",
      "dateFin": "2018-11-20T01:00:00.000+01:00",
      "preseance": "8",
      "nominPrincipale": "1",
      "infosQualite": {
        "codeQualite": "Secrétaire",
        "libQualite": "Secrétaire",
        "libQualiteSex": "Secrétaire"
      },
      "organesRefs": [
        "PO743664"
      ]
    },
    {
      "uid": "PM750379",
      "acteurRef": "PA721158",
      "legislature": "15",
      "typeOrgane": "GE",
      "dateDebut": "2018-02-14T01:00:00.000+01:00",
      "dateFin": "2018-09-19T02:00:00.000+02:00",
      "preseance": "20",
      "nominPrincipale": "1",
      "infosQualite": {
        "codeQualite": "Membre",
        "libQualite": "Membre",
        "libQualiteSex": "Membre"
      },
      "organesRefs": [
        "PO746885"
      ]
    },
    {
      "uid": "PM750552",
      "acteurRef": "PA721158",
      "legislature": "15",
      "typeOrgane": "GE",
      "dateDebut": "2018-02-12T01:00:00.000+01:00",
      "dateFin": "2018-09-19T02:00:00.000+02:00",
      "preseance": "20",
      "nominPrincipale": "1",
      "infosQualite": {
        "codeQualite": "Membre",
        "libQualite": "Membre",
        "libQualiteSex": "Membre"
      },
      "organesRefs": [
        "PO746857"
      ]
    },
    {
      "uid": "PM750847",
      "acteurRef": "PA721158",
      "legislature": "15",
      "typeOrgane": "GE",
      "dateDebut": "2018-02-19T01:00:00.000+01:00",
      "preseance": "20",
      "nominPrincipale": "1",
      "infosQualite": {
        "codeQualite": "Membre",
        "libQualite": "Membre",
        "libQualiteSex": "Membre"
      },
      "organesRefs": [
        "PO746768"
      ]
    },
    {
      "uid": "PM751015",
      "acteurRef": "PA721158",
      "legislature": "15",
      "typeOrgane": "GE",
      "dateDebut": "2018-02-19T01:00:00.000+01:00",
      "dateFin": "2018-09-24T02:00:00.000+02:00",
      "preseance": "20",
      "nominPrincipale": "1",
      "infosQualite": {
        "codeQualite": "Membre",
        "libQualite": "Membre",
        "libQualiteSex": "Membre"
      },
      "organesRefs": [
        "PO746880"
      ]
    },
    {
      "uid": "PM752531",
      "acteurRef": "PA721158",
      "legislature": "15",
      "typeOrgane": "GE",
      "dateDebut": "2018-02-14T01:00:00.000+01:00",
      "preseance": "20",
      "nominPrincipale": "1",
      "infosQualite": {
        "codeQualite": "Membre",
        "libQualite": "Membre",
        "libQualiteSex": "Membre"
      },
      "organesRefs": [
        "PO746763"
      ]
    },
    {
      "uid": "PM753494",
      "acteurRef": "PA721158",
      "legislature": "15",
      "typeOrgane": "GE",
      "dateDebut": "2018-03-14T01:00:00.000+01:00",
      "preseance": "20",
      "nominPrincipale": "0",
      "infosQualite": {
        "codeQualite": "Membre",
        "libQualite": "Membre",
        "libQualiteSex": "Membre"
      },
      "organesRefs": [
        "PO747225"
      ]
    },
    {
      "uid": "PM754238",
      "acteurRef": "PA721158",
      "legislature": "15",
      "typeOrgane": "GE",
      "dateDebut": "2018-03-21T01:00:00.000+01:00",
      "preseance": "8",
      "nominPrincipale": "1",
      "infosQualite": {
        "codeQualite": "Vice-Président",
        "libQualite": "Vice-Président",
        "libQualiteSex": "Vice-Président"
      },
      "organesRefs": [
        "PO747225"
      ]
    },
    {
      "uid": "PM755562",
      "acteurRef": "PA721158",
      "legislature": "15",
      "typeOrgane": "CMP",
      "dateDebut": "2018-04-18T02:00:00.000+02:00",
      "datePublication": "2018-04-18T02:00:00.000+02:00",
      "dateFin": "2018-05-23T02:00:00.000+02:00",
      "preseance": "20",
      "nominPrincipale": "1",
      "infosQualite": {
        "codeQualite": "Titulaire",
        "libQualite": "Membre titulaire",
        "libQualiteSex": "Membre titulaire"
      },
      "organesRefs": [
        "PO755391"
      ]
    },
    {
      "uid": "PM760245",
      "acteurRef": "PA721158",
      "legislature": "15",
      "typeOrgane": "CNPS",
      "dateDebut": "2018-11-13T01:00:00.000+01:00",
      "datePublication": "2018-11-14T01:00:00.000+01:00",
      "preseance": "20",
      "nominPrincipale": "1",
      "infosQualite": {
        "codeQualite": "Membre",
        "libQualite": "Membre",
        "libQualiteSex": "Membre"
      },
      "organesRefs": [
        "PO760148"
      ]
    }
  ]
}