{
  "uid": "PO410963",
  "codeType": "MINISTERE",
  "libelle": "Ministère de la santé, de la jeunesse, des sports et de la vie associative",
  "libelleEdition": "de la santé, de la jeunesse, des sports et de la vie associative",
  "libelleAbrege": "Santé, jeunesse, sports et vie associative",
  "libelleAbrev": "SAN",
  "viMoDe": {
    "dateDebut": "2008-03-18T01:00:00.000+01:00",
    "dateFin": "2009-01-12T01:00:00.000+01:00"
  },
  "organeParentRef": "PO384206"
}