{
  "uid": "PA720862",
  "etatCivil": {
    "ident": {
      "civ": "M.",
      "prenom": "Frédéric",
      "nom": "Descrozaille",
      "alpha": "Descrozaille",
      "trigramme": "FDE"
    },
    "infoNaissance": {
      "dateNais": "1967-04-16T01:00:00.000+01:00",
      "villeNais": "Neuilly-sur-Seine",
      "depNais": "Hauts-de-Seine",
      "paysNais": "France"
    }
  },
  "profession": {
    "libelleCourant": "Autre cadre (secteur privé)",
    "socProcInsee": {
      "catSocPro": "Cadres d'entreprise",
      "famSocPro": "Cadres et professions intellectuelles supérieures"
    }
  },
  "uriHatvp": "https://www.hatvp.fr/pages_nominatives/descrozaille-frederic",
  "adresses": [
    {
      "xsiType": "AdressePostale_Type",
      "uid": "AD720864",
      "type": "0",
      "typeLibelle": "Adresse officielle",
      "poids": "1",
      "intitule": "Assemblée nationale,",
      "numeroRue": "126",
      "nomRue": "Rue de l'Université,",
      "codePostal": "75355",
      "ville": "Paris 07 SP"
    },
    {
      "xsiType": "AdresseMail_Type",
      "uid": "AD728192",
      "type": "15",
      "typeLibelle": "Mèl",
      "valElec": "frederic.descrozaille@assemblee-nationale.fr"
    },
    {
      "xsiType": "AdresseSiteWeb_Type",
      "uid": "AD732889",
      "type": "24",
      "typeLibelle": "Twitter",
      "valElec": "@fdescrozaille"
    },
    {
      "xsiType": "AdresseSiteWeb_Type",
      "uid": "AD732891",
      "type": "25",
      "typeLibelle": "Facebook",
      "valElec": "fdescrozaille9401"
    },
    {
      "xsiType": "AdresseSiteWeb_Type",
      "uid": "AD732893",
      "type": "22",
      "typeLibelle": "Site internet",
      "valElec": "descrozaille.fr/"
    }
  ],
  "mandats": [
    {
      "uid": "PM723098",
      "acteurRef": "PA720862",
      "legislature": "15",
      "typeOrgane": "ASSEMBLEE",
      "dateDebut": "2017-06-18T02:00:00.000+02:00",
      "preseance": "50",
      "nominPrincipale": "1",
      "infosQualite": {
        "codeQualite": "membre",
        "libQualite": "membre",
        "libQualiteSex": "membre"
      },
      "organesRefs": [
        "PO717460"
      ],
      "suppleant": {
        "dateDebut": "2017-06-18T02:00:00.000+02:00",
        "suppleantRef": "PA720866"
      },
      "election": {
        "lieu": {
          "region": "Ile-de-France",
          "regionType": "Métropolitain",
          "departement": "Val-de-Marne",
          "numDepartement": "94",
          "numCirco": "1"
        },
        "causeMandat": "élections générales",
        "refCirconscription": "PO718450"
      },
      "mandature": {
        "datePriseFonction": "2017-06-21T02:00:00.000+02:00",
        "premiereElection": "0",
        "placeHemicycle": "467"
      },
      "collaborateurs": [
        {
          "qualite": "M.",
          "prenom": "Mehmet",
          "nom": "Ceylan"
        },
        {
          "qualite": "Mme",
          "prenom": "Khadija",
          "nom": "Chatouani"
        },
        {
          "qualite": "M.",
          "prenom": "Renan-Abhinav",
          "nom": "Moog"
        },
        {
          "qualite": "Mme",
          "prenom": "Véronique",
          "nom": "Guilbard"
        }
      ]
    },
    {
      "uid": "PM724590",
      "acteurRef": "PA720862",
      "legislature": "15",
      "typeOrgane": "GP",
      "dateDebut": "2017-06-21T02:00:00.000+02:00",
      "dateFin": "2017-06-26T02:00:00.000+02:00",
      "preseance": "28",
      "nominPrincipale": "1",
      "infosQualite": {
        "codeQualite": "Député non-inscrit",
        "libQualite": "Député non-inscrit",
        "libQualiteSex": "Député non-inscrit"
      },
      "organesRefs": [
        "PO723569"
      ]
    },
    {
      "uid": "PM731164",
      "acteurRef": "PA720862",
      "legislature": "15",
      "typeOrgane": "GP",
      "dateDebut": "2017-06-27T02:00:00.000+02:00",
      "datePublication": "2017-06-28T02:00:00.000+02:00",
      "preseance": "20",
      "nominPrincipale": "1",
      "infosQualite": {
        "codeQualite": "Membre",
        "libQualite": "Membre du",
        "libQualiteSex": "Membre du"
      },
      "organesRefs": [
        "PO730964"
      ]
    },
    {
      "uid": "PM732096",
      "acteurRef": "PA720862",
      "legislature": "15",
      "typeOrgane": "COMPER",
      "dateDebut": "2017-06-29T02:00:00.000+02:00",
      "datePublication": "2017-06-29T02:00:00.000+02:00",
      "preseance": "32",
      "nominPrincipale": "1",
      "infosQualite": {
        "codeQualite": "Membre",
        "libQualite": "Membre",
        "libQualiteSex": "Membre"
      },
      "organesRefs": [
        "PO59047"
      ]
    },
    {
      "uid": "PM732621",
      "acteurRef": "PA720862",
      "legislature": "15",
      "typeOrgane": "COMNL",
      "dateDebut": "2017-07-12T02:00:00.000+02:00",
      "datePublication": "2017-07-12T02:00:00.000+02:00",
      "preseance": "20",
      "nominPrincipale": "1",
      "infosQualite": {
        "codeQualite": "Membre",
        "libQualite": "Membre",
        "libQualiteSex": "Membre"
      },
      "organesRefs": [
        "PO420375"
      ]
    },
    {
      "uid": "PM735427",
      "acteurRef": "PA720862",
      "legislature": "15",
      "typeOrgane": "GA",
      "dateDebut": "2017-09-27T02:00:00.000+02:00",
      "dateFin": "2018-02-12T01:00:00.000+01:00",
      "preseance": "20",
      "nominPrincipale": "1",
      "infosQualite": {
        "codeQualite": "Membre",
        "libQualite": "Membre",
        "libQualiteSex": "Membre"
      },
      "organesRefs": [
        "PO733087"
      ]
    },
    {
      "uid": "PM735428",
      "acteurRef": "PA720862",
      "legislature": "15",
      "typeOrgane": "GA",
      "dateDebut": "2017-09-27T02:00:00.000+02:00",
      "preseance": "20",
      "nominPrincipale": "1",
      "infosQualite": {
        "codeQualite": "Membre",
        "libQualite": "Membre",
        "libQualiteSex": "Membre"
      },
      "organesRefs": [
        "PO733382"
      ]
    },
    {
      "uid": "PM738211",
      "acteurRef": "PA720862",
      "legislature": "15",
      "typeOrgane": "GA",
      "dateDebut": "2017-10-09T02:00:00.000+02:00",
      "preseance": "20",
      "nominPrincipale": "1",
      "infosQualite": {
        "codeQualite": "Membre",
        "libQualite": "Membre",
        "libQualiteSex": "Membre"
      },
      "organesRefs": [
        "PO732939"
      ]
    },
    {
      "uid": "PM745033",
      "acteurRef": "PA720862",
      "typeOrgane": "PARPOL",
      "dateDebut": "2017-12-01T01:00:00.000+01:00",
      "preseance": "5",
      "nominPrincipale": "1",
      "infosQualite": {
        "codeQualite": "Membre",
        "libQualite": "Membre",
        "libQualiteSex": "Membre"
      },
      "organesRefs": [
        "PO744854"
      ]
    },
    {
      "uid": "PM748601",
      "acteurRef": "PA720862",
      "legislature": "15",
      "typeOrgane": "GE",
      "dateDebut": "2018-02-01T01:00:00.000+01:00",
      "preseance": "20",
      "nominPrincipale": "0",
      "infosQualite": {
        "codeQualite": "Membre",
        "libQualite": "Membre",
        "libQualiteSex": "Membre"
      },
      "organesRefs": [
        "PO747037"
      ]
    },
    {
      "uid": "PM748602",
      "acteurRef": "PA720862",
      "legislature": "15",
      "typeOrgane": "GE",
      "dateDebut": "2018-02-01T01:00:00.000+01:00",
      "preseance": "4",
      "nominPrincipale": "1",
      "infosQualite": {
        "codeQualite": "Co-Président",
        "libQualite": "Co-Président",
        "libQualiteSex": "Co-Président"
      },
      "organesRefs": [
        "PO747037"
      ]
    },
    {
      "uid": "PM749078",
      "acteurRef": "PA720862",
      "legislature": "15",
      "typeOrgane": "GE",
      "dateDebut": "2018-02-28T01:00:00.000+01:00",
      "preseance": "20",
      "nominPrincipale": "1",
      "infosQualite": {
        "codeQualite": "Membre",
        "libQualite": "Membre",
        "libQualiteSex": "Membre"
      },
      "organesRefs": [
        "PO746674"
      ]
    },
    {
      "uid": "PM749308",
      "acteurRef": "PA720862",
      "legislature": "15",
      "typeOrgane": "GE",
      "dateDebut": "2018-02-09T01:00:00.000+01:00",
      "preseance": "20",
      "nominPrincipale": "1",
      "infosQualite": {
        "codeQualite": "Membre",
        "libQualite": "Membre",
        "libQualiteSex": "Membre"
      },
      "organesRefs": [
        "PO746735"
      ]
    },
    {
      "uid": "PM752940",
      "acteurRef": "PA720862",
      "legislature": "15",
      "typeOrgane": "CNPE",
      "dateDebut": "2018-03-09T01:00:00.000+01:00",
      "datePublication": "2018-03-09T01:00:00.000+01:00",
      "dateFin": "2018-07-19T02:00:00.000+02:00",
      "preseance": "20",
      "nominPrincipale": "1",
      "infosQualite": {
        "codeQualite": "Membre",
        "libQualite": "Membre",
        "libQualiteSex": "Membre"
      },
      "organesRefs": [
        "PO751337"
      ]
    },
    {
      "uid": "PM755442",
      "acteurRef": "PA720862",
      "legislature": "15",
      "typeOrgane": "CNPE",
      "dateDebut": "2018-04-14T02:00:00.000+02:00",
      "datePublication": "2018-04-14T02:00:00.000+02:00",
      "preseance": "20",
      "nominPrincipale": "1",
      "infosQualite": {
        "codeQualite": "Membre",
        "libQualite": "Membre",
        "libQualiteSex": "Membre"
      },
      "organesRefs": [
        "PO754360"
      ]
    }
  ]
}