{
  "uid": "PA2463",
  "etatCivil": {
    "ident": {
      "civ": "M.",
      "prenom": "Daniel",
      "nom": "Poulou",
      "alpha": "Poulou"
    },
    "infoNaissance": {
      "dateNais": "1943-07-28T02:00:00.000+02:00",
      "villeNais": "Biarritz",
      "depNais": "Pyrénées-Atlantiques"
    }
  },
  "profession": {
    "libelleCourant": "Directeur de société",
    "socProcInsee": {
      "catSocPro": "Cadres d'entreprise",
      "famSocPro": "Cadres et professions intellectuelles supérieures"
    }
  },
  "adresses": [
    {
      "xsiType": "AdressePostale_Type",
      "uid": "AD392608",
      "type": "0",
      "typeLibelle": "Adresse officielle",
      "poids": "1",
      "intitule": "Assemblée nationale,",
      "numeroRue": "126",
      "nomRue": "Rue de l'Université,",
      "codePostal": "75355",
      "ville": "Paris 07 SP"
    },
    {
      "xsiType": "AdressePostale_Type",
      "uid": "AD394969",
      "type": "2",
      "typeLibelle": "Adresse publiée de circonscription",
      "poids": "21",
      "intitule": "Immeuble le Boléro",
      "nomRue": "Quai Ravel",
      "codePostal": "64500",
      "ville": "Ciboure"
    },
    {
      "xsiType": "AdresseTelephonique_Type",
      "uid": "AD394970",
      "type": "11",
      "typeLibelle": "Téléphone",
      "poids": "21",
      "adresseDeRattachement": "AD394969",
      "valElec": "05 59 51 44 44"
    },
    {
      "xsiType": "AdresseTelephonique_Type",
      "uid": "AD394971",
      "type": "12",
      "typeLibelle": "Télécopie",
      "poids": "21",
      "adresseDeRattachement": "AD394969",
      "valElec": "05 59 51 44 45"
    },
    {
      "xsiType": "AdresseTelephonique_Type",
      "uid": "AD394972",
      "type": "11",
      "typeLibelle": "Téléphone",
      "poids": "1",
      "adresseDeRattachement": "AD392608",
      "valElec": "01 40 63 92 41"
    },
    {
      "xsiType": "AdresseTelephonique_Type",
      "uid": "AD394973",
      "type": "12",
      "typeLibelle": "Télécopie",
      "poids": "1",
      "adresseDeRattachement": "AD392608",
      "valElec": "01 40 63 92 81"
    },
    {
      "xsiType": "AdresseTelephonique_Type",
      "uid": "AD394984",
      "type": "11",
      "typeLibelle": "Téléphone",
      "poids": "1",
      "adresseDeRattachement": "AD392608",
      "valElec": "06 10 01 27 19"
    },
    {
      "xsiType": "AdresseMail_Type",
      "uid": "AD394985",
      "type": "15",
      "typeLibelle": "Mèl",
      "valElec": "dpoulou@assemblee-nationale.fr"
    }
  ],
  "mandats": [
    {
      "uid": "PM392581",
      "acteurRef": "PA2463",
      "legislature": "13",
      "typeOrgane": "ASSEMBLEE",
      "dateDebut": "2007-06-20T02:00:00.000+02:00",
      "dateFin": "2011-03-28T02:00:00.000+02:00",
      "preseance": "50",
      "nominPrincipale": "1",
      "infosQualite": {
        "codeQualite": "membre",
        "libQualite": "membre",
        "libQualiteSex": "membre"
      },
      "organesRefs": [
        "PO384266"
      ],
      "election": {
        "lieu": {
          "region": "Nouvelle-Aquitaine",
          "regionType": "Métropolitain",
          "departement": "Pyrénées-Atlantiques",
          "numDepartement": "64",
          "numCirco": "6"
        },
        "causeMandat": "remplacement d'un député nommé au Gouvernement",
        "refCirconscription": "PO384602"
      },
      "mandature": {
        "datePriseFonction": "2007-07-20T02:00:00.000+02:00",
        "causeFin": "Reprise de l'exercice du mandat d'un ancien membre du Gouvernement",
        "premiereElection": "1"
      }
    },
    {
      "uid": "PM392627",
      "acteurRef": "PA2463",
      "legislature": "13",
      "typeOrgane": "GP",
      "dateDebut": "2007-07-20T02:00:00.000+02:00",
      "datePublication": "2007-07-21T02:00:00.000+02:00",
      "dateFin": "2007-07-23T02:00:00.000+02:00",
      "preseance": "28",
      "nominPrincipale": "1",
      "infosQualite": {
        "codeQualite": "Député non-inscrit",
        "libQualite": "Député non-inscrit",
        "libQualiteSex": "Député non-inscrit"
      },
      "organesRefs": [
        "PO387155"
      ]
    },
    {
      "uid": "PM393609",
      "acteurRef": "PA2463",
      "legislature": "13",
      "typeOrgane": "GP",
      "dateDebut": "2007-07-24T02:00:00.000+02:00",
      "datePublication": "2007-07-24T02:00:00.000+02:00",
      "dateFin": "2011-03-27T01:00:00.000+01:00",
      "preseance": "20",
      "nominPrincipale": "1",
      "infosQualite": {
        "codeQualite": "Membre",
        "libQualite": "Membre du",
        "libQualiteSex": "Membre du"
      },
      "organesRefs": [
        "PO389395"
      ]
    },
    {
      "uid": "PM394019",
      "acteurRef": "PA2463",
      "legislature": "13",
      "typeOrgane": "COMPER",
      "dateDebut": "2007-07-27T02:00:00.000+02:00",
      "datePublication": "2007-07-28T02:00:00.000+02:00",
      "dateFin": "2009-06-30T02:00:00.000+02:00",
      "preseance": "32",
      "nominPrincipale": "1",
      "infosQualite": {
        "codeQualite": "Membre",
        "libQualite": "Membre",
        "libQualiteSex": "Membre"
      },
      "organesRefs": [
        "PO59045"
      ]
    },
    {
      "uid": "PM394528",
      "acteurRef": "PA2463",
      "legislature": "13",
      "typeOrgane": "ORGEXTPARL",
      "dateDebut": "2007-08-01T02:00:00.000+02:00",
      "datePublication": "2007-08-02T02:00:00.000+02:00",
      "dateFin": "2011-03-27T01:00:00.000+01:00",
      "preseance": "20",
      "nominPrincipale": "1",
      "infosQualite": {
        "codeQualite": "Titulaire",
        "libQualite": "Membre titulaire",
        "libQualiteSex": "Membre titulaire"
      },
      "organesRefs": [
        "PO60166"
      ]
    },
    {
      "uid": "PM399850",
      "acteurRef": "PA2463",
      "legislature": "13",
      "typeOrgane": "GA",
      "dateDebut": "2007-10-17T02:00:00.000+02:00",
      "dateFin": "2011-03-27T01:00:00.000+01:00",
      "preseance": "20",
      "nominPrincipale": "1",
      "infosQualite": {
        "codeQualite": "Membre",
        "libQualite": "Membre",
        "libQualiteSex": "Membre"
      },
      "organesRefs": [
        "PO392940"
      ]
    },
    {
      "uid": "PM399851",
      "acteurRef": "PA2463",
      "legislature": "13",
      "typeOrgane": "GA",
      "dateDebut": "2007-10-17T02:00:00.000+02:00",
      "dateFin": "2011-03-27T01:00:00.000+01:00",
      "preseance": "20",
      "nominPrincipale": "1",
      "infosQualite": {
        "codeQualite": "Membre",
        "libQualite": "Membre",
        "libQualiteSex": "Membre"
      },
      "organesRefs": [
        "PO393328"
      ]
    },
    {
      "uid": "PM399852",
      "acteurRef": "PA2463",
      "legislature": "13",
      "typeOrgane": "GA",
      "dateDebut": "2007-10-17T02:00:00.000+02:00",
      "dateFin": "2011-03-27T01:00:00.000+01:00",
      "preseance": "20",
      "nominPrincipale": "1",
      "infosQualite": {
        "codeQualite": "Membre",
        "libQualite": "Membre",
        "libQualiteSex": "Membre"
      },
      "organesRefs": [
        "PO393363"
      ]
    },
    {
      "uid": "PM405783",
      "acteurRef": "PA2463",
      "legislature": "13",
      "typeOrgane": "GA",
      "dateDebut": "2007-12-19T01:00:00.000+01:00",
      "dateFin": "2011-03-27T01:00:00.000+01:00",
      "preseance": "20",
      "nominPrincipale": "1",
      "infosQualite": {
        "codeQualite": "Membre",
        "libQualite": "Membre",
        "libQualiteSex": "Membre"
      },
      "organesRefs": [
        "PO393060"
      ]
    },
    {
      "uid": "PM409855",
      "acteurRef": "PA2463",
      "legislature": "13",
      "typeOrgane": "GE",
      "dateDebut": "2008-02-28T01:00:00.000+01:00",
      "dateFin": "2011-03-27T01:00:00.000+01:00",
      "preseance": "20",
      "nominPrincipale": "1",
      "infosQualite": {
        "codeQualite": "Membre",
        "libQualite": "Membre",
        "libQualiteSex": "Membre"
      },
      "organesRefs": [
        "PO402856"
      ]
    },
    {
      "uid": "PM414974",
      "acteurRef": "PA2463",
      "legislature": "13",
      "typeOrgane": "GE",
      "dateDebut": "2007-10-31T01:00:00.000+01:00",
      "dateFin": "2011-03-27T01:00:00.000+01:00",
      "preseance": "20",
      "nominPrincipale": "1",
      "infosQualite": {
        "codeQualite": "Membre",
        "libQualite": "Membre",
        "libQualiteSex": "Membre"
      },
      "organesRefs": [
        "PO403021"
      ]
    },
    {
      "uid": "PM420514",
      "acteurRef": "PA2463",
      "legislature": "13",
      "typeOrgane": "COMPER",
      "dateDebut": "2009-07-01T02:00:00.000+02:00",
      "datePublication": "2009-07-01T02:00:00.000+02:00",
      "dateFin": "2009-09-14T02:00:00.000+02:00",
      "preseance": "32",
      "nominPrincipale": "1",
      "infosQualite": {
        "codeQualite": "Membre",
        "libQualite": "Membre",
        "libQualiteSex": "Membre"
      },
      "organesRefs": [
        "PO420120"
      ]
    },
    {
      "uid": "PM421505",
      "acteurRef": "PA2463",
      "legislature": "13",
      "typeOrgane": "COMPER",
      "dateDebut": "2009-09-15T02:00:00.000+02:00",
      "datePublication": "2009-09-15T02:00:00.000+02:00",
      "dateFin": "2011-03-28T02:00:00.000+02:00",
      "preseance": "32",
      "nominPrincipale": "1",
      "infosQualite": {
        "codeQualite": "Membre",
        "libQualite": "Membre",
        "libQualiteSex": "Membre"
      },
      "organesRefs": [
        "PO59046"
      ]
    }
  ]
}