{
  "uid": "PO733212",
  "codeType": "GA",
  "libelle": "France-Malte",
  "libelleEdition": "de France-Malte",
  "libelleAbrege": "Malte",
  "libelleAbrev": "MALT",
  "viMoDe": {
    "dateAgrement": "2017-07-19T02:00:00.000+02:00"
  },
  "regime": "5ème République",
  "legislature": "15",
  "secretariat": {
    "secretaire01": "M. Roland Beaume"
  },
  "listePays": [
    "GOP756435"
  ]
}