{
  "uid": "PA605804",
  "etatCivil": {
    "ident": {
      "civ": "M.",
      "prenom": "Laurent",
      "nom": "Grandguillaume",
      "alpha": "Grandguillaume"
    },
    "infoNaissance": {
      "dateNais": "1978-01-20T01:00:00.000+01:00",
      "villeNais": "Besançon",
      "depNais": "Doubs",
      "paysNais": "France"
    }
  },
  "profession": {
    "libelleCourant": "Conseiller en formation",
    "socProcInsee": {
      "catSocPro": "Cadres d'entreprise",
      "famSocPro": "Cadres et professions intellectuelles supérieures"
    }
  },
  "adresses": [
    {
      "xsiType": "AdressePostale_Type",
      "uid": "AD650325",
      "type": "0",
      "typeLibelle": "Adresse officielle",
      "poids": "1",
      "intitule": "Assemblée nationale",
      "numeroRue": "126",
      "nomRue": "Rue de l'Université",
      "codePostal": "75355",
      "ville": "Paris 07 SP"
    },
    {
      "xsiType": "AdressePostale_Type",
      "uid": "AD650326",
      "type": "2",
      "typeLibelle": "Adresse publiée de circonscription",
      "poids": "22",
      "numeroRue": "6",
      "nomRue": "Rue Bénigné Frémyot",
      "codePostal": "21000",
      "ville": "Dijon"
    },
    {
      "xsiType": "AdresseTelephonique_Type",
      "uid": "AD678790",
      "type": "11",
      "typeLibelle": "Téléphone",
      "poids": "22",
      "adresseDeRattachement": "AD650326",
      "valElec": "03 80 56 81 19"
    },
    {
      "xsiType": "AdresseMail_Type",
      "uid": "AD716047",
      "type": "15",
      "typeLibelle": "Mèl",
      "valElec": "laurent-grandguillaume@orange.fr"
    },
    {
      "xsiType": "AdresseMail_Type",
      "uid": "AD716064",
      "type": "15",
      "typeLibelle": "Mèl",
      "valElec": "lgrandguillaume@assemblee-nationale.fr"
    }
  ],
  "mandats": [
    {
      "uid": "PM645450",
      "acteurRef": "PA605804",
      "legislature": "14",
      "typeOrgane": "ASSEMBLEE",
      "dateDebut": "2012-06-20T02:00:00.000+02:00",
      "dateFin": "2017-06-20T02:00:00.000+02:00",
      "preseance": "50",
      "nominPrincipale": "1",
      "infosQualite": {
        "codeQualite": "membre",
        "libQualite": "membre",
        "libQualiteSex": "membre"
      },
      "organesRefs": [
        "PO644420"
      ],
      "suppleant": {
        "dateDebut": "2012-06-20T02:00:00.000+02:00",
        "dateFin": "2017-06-20T02:00:00.000+02:00",
        "suppleantRef": "PA642704"
      },
      "election": {
        "lieu": {
          "region": "Bourgogne-Franche-Comté",
          "regionType": "Métropolitain",
          "departement": "Côte-d'Or",
          "numDepartement": "21",
          "numCirco": "1"
        },
        "causeMandat": "élections générales",
        "refCirconscription": "PO644507"
      },
      "mandature": {
        "datePriseFonction": "2012-06-20T02:00:00.000+02:00",
        "causeFin": "Fin de législature",
        "premiereElection": "0"
      }
    },
    {
      "uid": "PM656163",
      "acteurRef": "PA605804",
      "legislature": "14",
      "typeOrgane": "GP",
      "dateDebut": "2012-06-26T02:00:00.000+02:00",
      "datePublication": "2012-06-27T02:00:00.000+02:00",
      "dateFin": "2016-05-24T02:00:00.000+02:00",
      "preseance": "20",
      "nominPrincipale": "1",
      "infosQualite": {
        "codeQualite": "Membre",
        "libQualite": "Membre du",
        "libQualiteSex": "Membre du"
      },
      "organesRefs": [
        "PO656002"
      ]
    },
    {
      "uid": "PM657300",
      "acteurRef": "PA605804",
      "legislature": "14",
      "typeOrgane": "COMPER",
      "dateDebut": "2012-06-28T02:00:00.000+02:00",
      "datePublication": "2012-06-28T02:00:00.000+02:00",
      "dateFin": "2014-01-27T01:00:00.000+01:00",
      "preseance": "32",
      "nominPrincipale": "1",
      "infosQualite": {
        "codeQualite": "Membre",
        "libQualite": "Membre",
        "libQualiteSex": "Membre"
      },
      "organesRefs": [
        "PO59048"
      ]
    },
    {
      "uid": "PM677516",
      "acteurRef": "PA605804",
      "legislature": "14",
      "typeOrgane": "CMP",
      "dateDebut": "2012-07-30T02:00:00.000+02:00",
      "datePublication": "2012-07-31T02:00:00.000+02:00",
      "dateFin": "2012-07-30T02:00:00.000+02:00",
      "preseance": "28",
      "nominPrincipale": "1",
      "infosQualite": {
        "codeQualite": "Suppléant",
        "libQualite": "Membre suppléant",
        "libQualiteSex": "Membre suppléant"
      },
      "organesRefs": [
        "PO677474"
      ]
    },
    {
      "uid": "PM678199",
      "acteurRef": "PA605804",
      "legislature": "14",
      "typeOrgane": "MISINFOPRE",
      "dateDebut": "2012-09-20T02:00:00.000+02:00",
      "datePublication": "2012-09-21T02:00:00.000+02:00",
      "dateFin": "2013-03-27T01:00:00.000+01:00",
      "preseance": "20",
      "nominPrincipale": "1",
      "infosQualite": {
        "codeQualite": "Membre",
        "libQualite": "Membre",
        "libQualiteSex": "Membre"
      },
      "organesRefs": [
        "PO677887"
      ]
    },
    {
      "uid": "PM679094",
      "acteurRef": "PA605804",
      "legislature": "14",
      "typeOrgane": "ORGEXTPARL",
      "dateDebut": "2012-10-04T02:00:00.000+02:00",
      "datePublication": "2012-10-05T02:00:00.000+02:00",
      "dateFin": "2017-06-20T02:00:00.000+02:00",
      "preseance": "20",
      "nominPrincipale": "1",
      "infosQualite": {
        "codeQualite": "Titulaire",
        "libQualite": "Membre titulaire",
        "libQualiteSex": "Membre titulaire"
      },
      "organesRefs": [
        "PO303484"
      ]
    },
    {
      "uid": "PM681082",
      "acteurRef": "PA605804",
      "legislature": "14",
      "typeOrgane": "GA",
      "dateDebut": "2012-10-15T02:00:00.000+02:00",
      "dateFin": "2017-06-20T02:00:00.000+02:00",
      "preseance": "20",
      "nominPrincipale": "1",
      "infosQualite": {
        "codeQualite": "Membre",
        "libQualite": "Membre",
        "libQualiteSex": "Membre"
      },
      "organesRefs": [
        "PO675837"
      ]
    },
    {
      "uid": "PM681083",
      "acteurRef": "PA605804",
      "legislature": "14",
      "typeOrgane": "GA",
      "dateDebut": "2012-10-15T02:00:00.000+02:00",
      "dateFin": "2017-06-20T02:00:00.000+02:00",
      "preseance": "20",
      "nominPrincipale": "1",
      "infosQualite": {
        "codeQualite": "Membre",
        "libQualite": "Membre",
        "libQualiteSex": "Membre"
      },
      "organesRefs": [
        "PO675795"
      ]
    },
    {
      "uid": "PM681084",
      "acteurRef": "PA605804",
      "legislature": "14",
      "typeOrgane": "GA",
      "dateDebut": "2012-10-15T02:00:00.000+02:00",
      "dateFin": "2017-06-20T02:00:00.000+02:00",
      "preseance": "20",
      "nominPrincipale": "1",
      "infosQualite": {
        "codeQualite": "Membre",
        "libQualite": "Membre",
        "libQualiteSex": "Membre"
      },
      "organesRefs": [
        "PO675839"
      ]
    },
    {
      "uid": "PM681085",
      "acteurRef": "PA605804",
      "legislature": "14",
      "typeOrgane": "GA",
      "dateDebut": "2012-10-15T02:00:00.000+02:00",
      "dateFin": "2017-06-20T02:00:00.000+02:00",
      "preseance": "20",
      "nominPrincipale": "1",
      "infosQualite": {
        "codeQualite": "Membre",
        "libQualite": "Membre",
        "libQualiteSex": "Membre"
      },
      "organesRefs": [
        "PO675746"
      ]
    },
    {
      "uid": "PM681086",
      "acteurRef": "PA605804",
      "legislature": "14",
      "typeOrgane": "GA",
      "dateDebut": "2012-10-15T02:00:00.000+02:00",
      "dateFin": "2017-06-20T02:00:00.000+02:00",
      "preseance": "20",
      "nominPrincipale": "1",
      "infosQualite": {
        "codeQualite": "Membre",
        "libQualite": "Membre",
        "libQualiteSex": "Membre"
      },
      "organesRefs": [
        "PO675742"
      ]
    },
    {
      "uid": "PM681087",
      "acteurRef": "PA605804",
      "legislature": "14",
      "typeOrgane": "GA",
      "dateDebut": "2012-10-15T02:00:00.000+02:00",
      "dateFin": "2017-06-20T02:00:00.000+02:00",
      "preseance": "20",
      "nominPrincipale": "1",
      "infosQualite": {
        "codeQualite": "Membre",
        "libQualite": "Membre",
        "libQualiteSex": "Membre"
      },
      "organesRefs": [
        "PO675772"
      ]
    },
    {
      "uid": "PM681088",
      "acteurRef": "PA605804",
      "legislature": "14",
      "typeOrgane": "GA",
      "dateDebut": "2012-10-15T02:00:00.000+02:00",
      "dateFin": "2017-06-20T02:00:00.000+02:00",
      "preseance": "20",
      "nominPrincipale": "1",
      "infosQualite": {
        "codeQualite": "Membre",
        "libQualite": "Membre",
        "libQualiteSex": "Membre"
      },
      "organesRefs": [
        "PO675810"
      ]
    },
    {
      "uid": "PM681089",
      "acteurRef": "PA605804",
      "legislature": "14",
      "typeOrgane": "GA",
      "dateDebut": "2012-10-15T02:00:00.000+02:00",
      "dateFin": "2017-06-20T02:00:00.000+02:00",
      "preseance": "20",
      "nominPrincipale": "1",
      "infosQualite": {
        "codeQualite": "Membre",
        "libQualite": "Membre",
        "libQualiteSex": "Membre"
      },
      "organesRefs": [
        "PO675784"
      ]
    },
    {
      "uid": "PM684130",
      "acteurRef": "PA605804",
      "legislature": "14",
      "typeOrgane": "GA",
      "dateDebut": "2012-11-07T01:00:00.000+01:00",
      "dateFin": "2017-06-20T02:00:00.000+02:00",
      "preseance": "20",
      "nominPrincipale": "1",
      "infosQualite": {
        "codeQualite": "Membre",
        "libQualite": "Membre",
        "libQualiteSex": "Membre"
      },
      "organesRefs": [
        "PO675762"
      ]
    },
    {
      "uid": "PM685110",
      "acteurRef": "PA605804",
      "legislature": "14",
      "typeOrgane": "GA",
      "dateDebut": "2012-11-28T01:00:00.000+01:00",
      "dateFin": "2017-06-20T02:00:00.000+02:00",
      "preseance": "8",
      "nominPrincipale": "1",
      "infosQualite": {
        "codeQualite": "Vice-Président",
        "libQualite": "Vice-Président",
        "libQualiteSex": "Vice-Président"
      },
      "organesRefs": [
        "PO675837"
      ]
    },
    {
      "uid": "PM685763",
      "acteurRef": "PA605804",
      "typeOrgane": "PARPOL",
      "dateDebut": "2012-12-01T01:00:00.000+01:00",
      "dateFin": "2017-06-20T02:00:00.000+02:00",
      "preseance": "5",
      "nominPrincipale": "1",
      "infosQualite": {
        "codeQualite": "Membre",
        "libQualite": "Membre",
        "libQualiteSex": "Membre"
      },
      "organesRefs": [
        "PO684932"
      ]
    },
    {
      "uid": "PM686650",
      "acteurRef": "PA605804",
      "legislature": "14",
      "typeOrgane": "CMP",
      "dateDebut": "2012-12-12T01:00:00.000+01:00",
      "datePublication": "2012-12-13T01:00:00.000+01:00",
      "dateFin": "2012-12-20T01:00:00.000+01:00",
      "preseance": "28",
      "nominPrincipale": "1",
      "infosQualite": {
        "codeQualite": "Suppléant",
        "libQualite": "Membre suppléant",
        "libQualiteSex": "Membre suppléant"
      },
      "organesRefs": [
        "PO686310"
      ]
    },
    {
      "uid": "PM687784",
      "acteurRef": "PA605804",
      "legislature": "14",
      "typeOrgane": "GE",
      "dateDebut": "2013-01-15T01:00:00.000+01:00",
      "dateFin": "2017-06-20T02:00:00.000+02:00",
      "preseance": "20",
      "nominPrincipale": "1",
      "infosQualite": {
        "codeQualite": "Membre",
        "libQualite": "Membre",
        "libQualiteSex": "Membre"
      },
      "organesRefs": [
        "PO686415"
      ]
    },
    {
      "uid": "PM688100",
      "acteurRef": "PA605804",
      "legislature": "14",
      "typeOrgane": "GE",
      "dateDebut": "2013-01-17T01:00:00.000+01:00",
      "dateFin": "2017-06-20T02:00:00.000+02:00",
      "preseance": "20",
      "nominPrincipale": "1",
      "infosQualite": {
        "codeQualite": "Membre",
        "libQualite": "Membre",
        "libQualiteSex": "Membre"
      },
      "organesRefs": [
        "PO686785"
      ]
    },
    {
      "uid": "PM688408",
      "acteurRef": "PA605804",
      "legislature": "14",
      "typeOrgane": "MISINFO",
      "dateDebut": "2012-12-05T01:00:00.000+01:00",
      "datePublication": "2012-12-06T01:00:00.000+01:00",
      "dateFin": "2017-06-20T02:00:00.000+02:00",
      "preseance": "10",
      "nominPrincipale": "1",
      "infosQualite": {
        "codeQualite": "Membre",
        "libQualite": "Membre",
        "libQualiteSex": "Membre"
      },
      "organesRefs": [
        "PO683565"
      ]
    },
    {
      "uid": "PM688952",
      "acteurRef": "PA605804",
      "legislature": "14",
      "typeOrgane": "GE",
      "dateDebut": "2013-01-25T01:00:00.000+01:00",
      "dateFin": "2017-06-20T02:00:00.000+02:00",
      "preseance": "20",
      "nominPrincipale": "1",
      "infosQualite": {
        "codeQualite": "Membre",
        "libQualite": "Membre",
        "libQualiteSex": "Membre"
      },
      "organesRefs": [
        "PO686577"
      ]
    },
    {
      "uid": "PM689153",
      "acteurRef": "PA605804",
      "legislature": "14",
      "typeOrgane": "GE",
      "dateDebut": "2013-01-15T01:00:00.000+01:00",
      "dateFin": "2017-06-20T02:00:00.000+02:00",
      "preseance": "20",
      "nominPrincipale": "1",
      "infosQualite": {
        "codeQualite": "Membre",
        "libQualite": "Membre",
        "libQualiteSex": "Membre"
      },
      "organesRefs": [
        "PO686617"
      ]
    },
    {
      "uid": "PM689363",
      "acteurRef": "PA605804",
      "legislature": "14",
      "typeOrgane": "GE",
      "dateDebut": "2013-01-23T01:00:00.000+01:00",
      "dateFin": "2017-06-20T02:00:00.000+02:00",
      "preseance": "20",
      "nominPrincipale": "1",
      "infosQualite": {
        "codeQualite": "Membre",
        "libQualite": "Membre",
        "libQualiteSex": "Membre"
      },
      "organesRefs": [
        "PO687076"
      ]
    },
    {
      "uid": "PM689887",
      "acteurRef": "PA605804",
      "legislature": "14",
      "typeOrgane": "GE",
      "dateDebut": "2013-01-31T01:00:00.000+01:00",
      "dateFin": "2017-06-20T02:00:00.000+02:00",
      "preseance": "20",
      "nominPrincipale": "1",
      "infosQualite": {
        "codeQualite": "Membre",
        "libQualite": "Membre",
        "libQualiteSex": "Membre"
      },
      "organesRefs": [
        "PO686442"
      ]
    },
    {
      "uid": "PM690339",
      "acteurRef": "PA605804",
      "legislature": "14",
      "typeOrgane": "GE",
      "dateDebut": "2013-02-01T01:00:00.000+01:00",
      "dateFin": "2017-06-20T02:00:00.000+02:00",
      "preseance": "20",
      "nominPrincipale": "1",
      "infosQualite": {
        "codeQualite": "Membre",
        "libQualite": "Membre",
        "libQualiteSex": "Membre"
      },
      "organesRefs": [
        "PO686605"
      ]
    },
    {
      "uid": "PM691317",
      "acteurRef": "PA605804",
      "legislature": "14",
      "typeOrgane": "GE",
      "dateDebut": "2013-02-14T01:00:00.000+01:00",
      "dateFin": "2017-06-20T02:00:00.000+02:00",
      "preseance": "20",
      "nominPrincipale": "1",
      "infosQualite": {
        "codeQualite": "Membre",
        "libQualite": "Membre",
        "libQualiteSex": "Membre"
      },
      "organesRefs": [
        "PO686853"
      ]
    },
    {
      "uid": "PM691353",
      "acteurRef": "PA605804",
      "legislature": "14",
      "typeOrgane": "GE",
      "dateDebut": "2013-02-12T01:00:00.000+01:00",
      "dateFin": "2017-06-20T02:00:00.000+02:00",
      "preseance": "20",
      "nominPrincipale": "1",
      "infosQualite": {
        "codeQualite": "Membre",
        "libQualite": "Membre",
        "libQualiteSex": "Membre"
      },
      "organesRefs": [
        "PO687120"
      ]
    },
    {
      "uid": "PM692949",
      "acteurRef": "PA605804",
      "legislature": "14",
      "typeOrgane": "GE",
      "dateDebut": "2013-03-25T01:00:00.000+01:00",
      "dateFin": "2017-06-20T02:00:00.000+02:00",
      "preseance": "20",
      "nominPrincipale": "1",
      "infosQualite": {
        "codeQualite": "Membre",
        "libQualite": "Membre",
        "libQualiteSex": "Membre"
      },
      "organesRefs": [
        "PO689030"
      ]
    },
    {
      "uid": "PM693034",
      "acteurRef": "PA605804",
      "legislature": "14",
      "typeOrgane": "GE",
      "dateDebut": "2013-03-19T01:00:00.000+01:00",
      "dateFin": "2017-06-20T02:00:00.000+02:00",
      "preseance": "20",
      "nominPrincipale": "0",
      "infosQualite": {
        "codeQualite": "Membre",
        "libQualite": "Membre",
        "libQualiteSex": "Membre"
      },
      "organesRefs": [
        "PO686493"
      ]
    },
    {
      "uid": "PM693035",
      "acteurRef": "PA605804",
      "legislature": "14",
      "typeOrgane": "GE",
      "dateDebut": "2013-03-19T01:00:00.000+01:00",
      "dateFin": "2017-06-20T02:00:00.000+02:00",
      "preseance": "8",
      "nominPrincipale": "1",
      "infosQualite": {
        "codeQualite": "Vice-Président",
        "libQualite": "Vice-Président",
        "libQualiteSex": "Vice-Président"
      },
      "organesRefs": [
        "PO686493"
      ]
    },
    {
      "uid": "PM693038",
      "acteurRef": "PA605804",
      "legislature": "14",
      "typeOrgane": "GE",
      "dateDebut": "2013-03-26T01:00:00.000+01:00",
      "dateFin": "2017-06-20T02:00:00.000+02:00",
      "preseance": "8",
      "nominPrincipale": "1",
      "infosQualite": {
        "codeQualite": "Vice-Président",
        "libQualite": "Vice-Président",
        "libQualiteSex": "Vice-Président"
      },
      "organesRefs": [
        "PO686853"
      ]
    },
    {
      "uid": "PM693557",
      "acteurRef": "PA605804",
      "legislature": "14",
      "typeOrgane": "GE",
      "dateDebut": "2013-04-11T02:00:00.000+02:00",
      "dateFin": "2017-06-20T02:00:00.000+02:00",
      "preseance": "20",
      "nominPrincipale": "1",
      "infosQualite": {
        "codeQualite": "Membre",
        "libQualite": "Membre",
        "libQualiteSex": "Membre"
      },
      "organesRefs": [
        "PO686627"
      ]
    },
    {
      "uid": "PM693629",
      "acteurRef": "PA605804",
      "legislature": "14",
      "typeOrgane": "GE",
      "dateDebut": "2013-04-15T02:00:00.000+02:00",
      "dateFin": "2017-06-20T02:00:00.000+02:00",
      "preseance": "20",
      "nominPrincipale": "1",
      "infosQualite": {
        "codeQualite": "Membre",
        "libQualite": "Membre",
        "libQualiteSex": "Membre"
      },
      "organesRefs": [
        "PO692265"
      ]
    },
    {
      "uid": "PM693786",
      "acteurRef": "PA605804",
      "legislature": "14",
      "typeOrgane": "GE",
      "dateDebut": "2013-04-16T02:00:00.000+02:00",
      "dateFin": "2017-06-20T02:00:00.000+02:00",
      "preseance": "20",
      "nominPrincipale": "1",
      "infosQualite": {
        "codeQualite": "Membre",
        "libQualite": "Membre",
        "libQualiteSex": "Membre"
      },
      "organesRefs": [
        "PO689006"
      ]
    },
    {
      "uid": "PM693824",
      "acteurRef": "PA605804",
      "legislature": "14",
      "typeOrgane": "GE",
      "dateDebut": "2013-04-16T02:00:00.000+02:00",
      "dateFin": "2017-06-20T02:00:00.000+02:00",
      "preseance": "20",
      "nominPrincipale": "1",
      "infosQualite": {
        "codeQualite": "Membre",
        "libQualite": "Membre",
        "libQualiteSex": "Membre"
      },
      "organesRefs": [
        "PO689000"
      ]
    },
    {
      "uid": "PM694266",
      "acteurRef": "PA605804",
      "legislature": "14",
      "typeOrgane": "MINISTERE",
      "dateDebut": "2013-05-06T02:00:00.000+02:00",
      "datePublication": "2013-05-07T02:00:00.000+02:00",
      "dateFin": "2013-09-17T02:00:00.000+02:00",
      "preseance": "1",
      "nominPrincipale": "1",
      "infosQualite": {
        "codeQualite": "en mission",
        "libQualite": "en mission",
        "libQualiteSex": "en mission"
      },
      "organesRefs": [
        "PO653252",
        "PO653293",
        "PO653350"
      ],
      "libelle": "Régime fiscal et réglementaire des structures privées non lucratives"
    },
    {
      "uid": "PM695906",
      "acteurRef": "PA605804",
      "legislature": "14",
      "typeOrgane": "CMP",
      "dateDebut": "2013-07-10T02:00:00.000+02:00",
      "datePublication": "2013-07-13T02:00:00.000+02:00",
      "dateFin": "2013-07-16T02:00:00.000+02:00",
      "preseance": "28",
      "nominPrincipale": "1",
      "infosQualite": {
        "codeQualite": "Suppléant",
        "libQualite": "Membre suppléant",
        "libQualiteSex": "Membre suppléant"
      },
      "organesRefs": [
        "PO695808"
      ]
    },
    {
      "uid": "PM697197",
      "acteurRef": "PA605804",
      "legislature": "14",
      "typeOrgane": "MINISTERE",
      "dateDebut": "2013-09-20T02:00:00.000+02:00",
      "datePublication": "2013-09-21T02:00:00.000+02:00",
      "dateFin": "2014-01-20T01:00:00.000+01:00",
      "preseance": "1",
      "nominPrincipale": "1",
      "infosQualite": {
        "codeQualite": "en mission",
        "libQualite": "en mission",
        "libQualiteSex": "en mission"
      },
      "organesRefs": [
        "PO653265",
        "PO653335"
      ],
      "libelle": "Simplification et harmonisation des régimes de l'entrepreneuriat individuel"
    },
    {
      "uid": "PM699676",
      "acteurRef": "PA605804",
      "legislature": "14",
      "typeOrgane": "COMPER",
      "dateDebut": "2014-01-28T01:00:00.000+01:00",
      "datePublication": "2014-01-28T01:00:00.000+01:00",
      "dateFin": "2014-01-30T01:00:00.000+01:00",
      "preseance": "32",
      "nominPrincipale": "1",
      "infosQualite": {
        "codeQualite": "Membre",
        "libQualite": "Membre",
        "libQualiteSex": "Membre"
      },
      "organesRefs": [
        "PO419610"
      ]
    },
    {
      "uid": "PM699735",
      "acteurRef": "PA605804",
      "legislature": "14",
      "typeOrgane": "COMPER",
      "dateDebut": "2014-01-31T01:00:00.000+01:00",
      "datePublication": "2014-01-31T01:00:00.000+01:00",
      "dateFin": "2015-09-28T02:00:00.000+02:00",
      "preseance": "32",
      "nominPrincipale": "1",
      "infosQualite": {
        "codeQualite": "Membre",
        "libQualite": "Membre",
        "libQualiteSex": "Membre"
      },
      "organesRefs": [
        "PO59048"
      ]
    },
    {
      "uid": "PM701326",
      "acteurRef": "PA605804",
      "legislature": "14",
      "typeOrgane": "CMP",
      "dateDebut": "2014-05-13T02:00:00.000+02:00",
      "datePublication": "2014-05-15T02:00:00.000+02:00",
      "dateFin": "2014-06-10T02:00:00.000+02:00",
      "preseance": "20",
      "nominPrincipale": "1",
      "infosQualite": {
        "codeQualite": "Titulaire",
        "libQualite": "Membre titulaire",
        "libQualiteSex": "Membre titulaire"
      },
      "organesRefs": [
        "PO700965"
      ]
    },
    {
      "uid": "PM702137",
      "acteurRef": "PA605804",
      "legislature": "14",
      "typeOrgane": "CNPS",
      "dateDebut": "2014-07-03T02:00:00.000+02:00",
      "datePublication": "2014-07-03T02:00:00.000+02:00",
      "dateFin": "2014-12-19T01:00:00.000+01:00",
      "preseance": "20",
      "nominPrincipale": "1",
      "infosQualite": {
        "codeQualite": "Membre",
        "libQualite": "Membre",
        "libQualiteSex": "Membre"
      },
      "organesRefs": [
        "PO702090"
      ]
    },
    {
      "uid": "PM705214",
      "acteurRef": "PA605804",
      "legislature": "14",
      "typeOrgane": "MISINFOCOM",
      "dateDebut": "2014-12-03T01:00:00.000+01:00",
      "dateFin": "2015-09-30T02:00:00.000+02:00",
      "preseance": "20",
      "nominPrincipale": "1",
      "infosQualite": {
        "codeQualite": "Membre",
        "libQualite": "Membre",
        "libQualiteSex": "Membre"
      },
      "organesRefs": [
        "PO705203"
      ]
    },
    {
      "uid": "PM705444",
      "acteurRef": "PA605804",
      "legislature": "14",
      "typeOrgane": "CNPS",
      "dateDebut": "2014-12-13T01:00:00.000+01:00",
      "datePublication": "2014-12-13T01:00:00.000+01:00",
      "dateFin": "2015-08-07T02:00:00.000+02:00",
      "preseance": "20",
      "nominPrincipale": "1",
      "infosQualite": {
        "codeQualite": "Membre",
        "libQualite": "Membre",
        "libQualiteSex": "Membre"
      },
      "organesRefs": [
        "PO704848"
      ]
    },
    {
      "uid": "PM705493",
      "acteurRef": "PA605804",
      "legislature": "14",
      "typeOrgane": "CNPS",
      "dateDebut": "2014-12-16T01:00:00.000+01:00",
      "datePublication": "2014-12-17T01:00:00.000+01:00",
      "dateFin": "2015-08-07T02:00:00.000+02:00",
      "preseance": "16",
      "nominPrincipale": "1",
      "infosQualite": {
        "codeQualite": "Rapporteur thématique",
        "libQualite": "Rapporteur thématique",
        "libQualiteSex": "Rapporteur thématique"
      },
      "organesRefs": [
        "PO704848"
      ]
    },
    {
      "uid": "PM705977",
      "acteurRef": "PA605804",
      "legislature": "14",
      "typeOrgane": "GE",
      "dateDebut": "2015-01-27T01:00:00.000+01:00",
      "dateFin": "2017-06-20T02:00:00.000+02:00",
      "preseance": "20",
      "nominPrincipale": "1",
      "infosQualite": {
        "codeQualite": "Membre",
        "libQualite": "Membre",
        "libQualiteSex": "Membre"
      },
      "organesRefs": [
        "PO705526"
      ]
    },
    {
      "uid": "PM708414",
      "acteurRef": "PA605804",
      "legislature": "14",
      "typeOrgane": "CMP",
      "dateDebut": "2015-06-09T02:00:00.000+02:00",
      "datePublication": "2015-06-10T02:00:00.000+02:00",
      "dateFin": "2015-06-12T02:00:00.000+02:00",
      "preseance": "20",
      "nominPrincipale": "1",
      "infosQualite": {
        "codeQualite": "Titulaire",
        "libQualite": "Membre titulaire",
        "libQualiteSex": "Membre titulaire"
      },
      "organesRefs": [
        "PO708315"
      ]
    },
    {
      "uid": "PM709483",
      "acteurRef": "PA605804",
      "legislature": "14",
      "typeOrgane": "COMPER",
      "dateDebut": "2015-09-29T02:00:00.000+02:00",
      "datePublication": "2015-09-29T02:00:00.000+02:00",
      "dateFin": "2015-09-29T02:00:00.000+02:00",
      "preseance": "32",
      "nominPrincipale": "1",
      "infosQualite": {
        "codeQualite": "Membre",
        "libQualite": "Membre",
        "libQualiteSex": "Membre"
      },
      "organesRefs": [
        "PO59046"
      ]
    },
    {
      "uid": "PM709504",
      "acteurRef": "PA605804",
      "legislature": "14",
      "typeOrgane": "COMPER",
      "dateDebut": "2015-09-29T02:00:00.000+02:00",
      "datePublication": "2015-09-30T02:00:00.000+02:00",
      "dateFin": "2015-11-03T01:00:00.000+01:00",
      "preseance": "32",
      "nominPrincipale": "1",
      "infosQualite": {
        "codeQualite": "Membre",
        "libQualite": "Membre",
        "libQualiteSex": "Membre"
      },
      "organesRefs": [
        "PO59048"
      ]
    },
    {
      "uid": "PM709534",
      "acteurRef": "PA605804",
      "legislature": "14",
      "typeOrgane": "MISINFOCOM",
      "dateDebut": "2015-01-14T01:00:00.000+01:00",
      "datePublication": "2015-01-15T01:00:00.000+01:00",
      "dateFin": "2015-09-30T02:00:00.000+02:00",
      "preseance": "16",
      "nominPrincipale": "1",
      "infosQualite": {
        "codeQualite": "Rapporteur",
        "libQualite": "Rapporteur",
        "libQualiteSex": "Rapporteur"
      },
      "organesRefs": [
        "PO705203"
      ]
    },
    {
      "uid": "PM709696",
      "acteurRef": "PA605804",
      "legislature": "14",
      "typeOrgane": "MISINFOCOM",
      "dateDebut": "2015-10-15T02:00:00.000+02:00",
      "datePublication": "2015-10-15T02:00:00.000+02:00",
      "dateFin": "2017-02-20T01:00:00.000+01:00",
      "preseance": "20",
      "nominPrincipale": "1",
      "infosQualite": {
        "codeQualite": "Membre",
        "libQualite": "Membre",
        "libQualiteSex": "Membre"
      },
      "organesRefs": [
        "PO709614"
      ]
    },
    {
      "uid": "PM709900",
      "acteurRef": "PA605804",
      "legislature": "14",
      "typeOrgane": "COMPER",
      "dateDebut": "2015-11-04T01:00:00.000+01:00",
      "datePublication": "2015-11-04T01:00:00.000+01:00",
      "dateFin": "2015-12-09T01:00:00.000+01:00",
      "preseance": "32",
      "nominPrincipale": "1",
      "infosQualite": {
        "codeQualite": "Membre",
        "libQualite": "Membre",
        "libQualiteSex": "Membre"
      },
      "organesRefs": [
        "PO420120"
      ]
    },
    {
      "uid": "PM710714",
      "acteurRef": "PA605804",
      "legislature": "14",
      "typeOrgane": "COMPER",
      "dateDebut": "2015-12-10T01:00:00.000+01:00",
      "datePublication": "2015-12-10T01:00:00.000+01:00",
      "dateFin": "2016-06-21T02:00:00.000+02:00",
      "preseance": "32",
      "nominPrincipale": "1",
      "infosQualite": {
        "codeQualite": "Membre",
        "libQualite": "Membre",
        "libQualiteSex": "Membre"
      },
      "organesRefs": [
        "PO59048"
      ]
    },
    {
      "uid": "PM711293",
      "acteurRef": "PA605804",
      "legislature": "14",
      "typeOrgane": "CMP",
      "dateDebut": "2016-01-28T01:00:00.000+01:00",
      "datePublication": "2016-01-29T01:00:00.000+01:00",
      "dateFin": "2016-02-11T01:00:00.000+01:00",
      "preseance": "20",
      "nominPrincipale": "1",
      "infosQualite": {
        "codeQualite": "Titulaire",
        "libQualite": "Membre titulaire",
        "libQualiteSex": "Membre titulaire"
      },
      "organesRefs": [
        "PO711168"
      ]
    },
    {
      "uid": "PM711357",
      "acteurRef": "PA605804",
      "legislature": "14",
      "typeOrgane": "CMP",
      "dateDebut": "2016-02-02T01:00:00.000+01:00",
      "datePublication": "2016-02-03T01:00:00.000+01:00",
      "dateFin": "2016-02-11T01:00:00.000+01:00",
      "preseance": "16",
      "nominPrincipale": "1",
      "infosQualite": {
        "codeQualite": "Rapporteur",
        "libQualite": "Rapporteur",
        "libQualiteSex": "Rapporteur"
      },
      "organesRefs": [
        "PO711168"
      ]
    },
    {
      "uid": "PM711953",
      "acteurRef": "PA605804",
      "legislature": "14",
      "typeOrgane": "MINISTERE",
      "dateDebut": "2016-03-11T01:00:00.000+01:00",
      "datePublication": "2016-03-12T01:00:00.000+01:00",
      "dateFin": "2016-06-13T02:00:00.000+02:00",
      "preseance": "1",
      "nominPrincipale": "1",
      "infosQualite": {
        "codeQualite": "en mission",
        "libQualite": "en mission",
        "libQualiteSex": "en mission"
      },
      "organesRefs": [
        "PO702912",
        "PO711593"
      ],
      "libelle": "Les conditions d'exercice de l'activité de taxi, de voitures de transport avec chauffeur (VTC) et d'intermédiaires"
    },
    {
      "uid": "PM713227",
      "acteurRef": "PA605804",
      "legislature": "14",
      "typeOrgane": "GP",
      "dateDebut": "2016-05-25T02:00:00.000+02:00",
      "dateFin": "2017-06-20T02:00:00.000+02:00",
      "preseance": "20",
      "nominPrincipale": "1",
      "infosQualite": {
        "codeQualite": "Membre",
        "libQualite": "Membre du",
        "libQualiteSex": "Membre du"
      },
      "organesRefs": [
        "PO713077"
      ]
    },
    {
      "uid": "PM713891",
      "acteurRef": "PA605804",
      "legislature": "14",
      "typeOrgane": "COMPER",
      "dateDebut": "2016-06-22T02:00:00.000+02:00",
      "datePublication": "2016-06-22T02:00:00.000+02:00",
      "dateFin": "2016-07-07T02:00:00.000+02:00",
      "preseance": "32",
      "nominPrincipale": "1",
      "infosQualite": {
        "codeQualite": "Membre",
        "libQualite": "Membre",
        "libQualiteSex": "Membre"
      },
      "organesRefs": [
        "PO419865"
      ]
    },
    {
      "uid": "PM714184",
      "acteurRef": "PA605804",
      "legislature": "14",
      "typeOrgane": "COMPER",
      "dateDebut": "2016-07-08T02:00:00.000+02:00",
      "datePublication": "2016-07-08T02:00:00.000+02:00",
      "dateFin": "2016-07-18T02:00:00.000+02:00",
      "preseance": "32",
      "nominPrincipale": "1",
      "infosQualite": {
        "codeQualite": "Membre",
        "libQualite": "Membre",
        "libQualiteSex": "Membre"
      },
      "organesRefs": [
        "PO59048"
      ]
    },
    {
      "uid": "PM714448",
      "acteurRef": "PA605804",
      "legislature": "14",
      "typeOrgane": "COMPER",
      "dateDebut": "2016-07-19T02:00:00.000+02:00",
      "datePublication": "2016-07-19T02:00:00.000+02:00",
      "dateFin": "2016-07-20T02:00:00.000+02:00",
      "preseance": "32",
      "nominPrincipale": "1",
      "infosQualite": {
        "codeQualite": "Membre",
        "libQualite": "Membre",
        "libQualiteSex": "Membre"
      },
      "organesRefs": [
        "PO419865"
      ]
    },
    {
      "uid": "PM714510",
      "acteurRef": "PA605804",
      "legislature": "14",
      "typeOrgane": "COMPER",
      "dateDebut": "2016-07-21T02:00:00.000+02:00",
      "datePublication": "2016-07-21T02:00:00.000+02:00",
      "dateFin": "2017-06-20T02:00:00.000+02:00",
      "preseance": "32",
      "nominPrincipale": "1",
      "infosQualite": {
        "codeQualite": "Membre",
        "libQualite": "Membre",
        "libQualiteSex": "Membre"
      },
      "organesRefs": [
        "PO59048"
      ]
    },
    {
      "uid": "PM715579",
      "acteurRef": "PA605804",
      "legislature": "14",
      "typeOrgane": "CMP",
      "dateDebut": "2016-11-24T01:00:00.000+01:00",
      "datePublication": "2016-11-25T01:00:00.000+01:00",
      "dateFin": "2016-12-01T01:00:00.000+01:00",
      "preseance": "28",
      "nominPrincipale": "1",
      "infosQualite": {
        "codeQualite": "Suppléant",
        "libQualite": "Membre suppléant",
        "libQualiteSex": "Membre suppléant"
      },
      "organesRefs": [
        "PO715260"
      ]
    },
    {
      "uid": "PM715592",
      "acteurRef": "PA605804",
      "legislature": "14",
      "typeOrgane": "CMP",
      "dateDebut": "2016-11-24T01:00:00.000+01:00",
      "datePublication": "2016-11-25T01:00:00.000+01:00",
      "dateFin": "2016-12-01T01:00:00.000+01:00",
      "preseance": "20",
      "nominPrincipale": "1",
      "infosQualite": {
        "codeQualite": "Titulaire",
        "libQualite": "Membre titulaire",
        "libQualiteSex": "Membre titulaire"
      },
      "organesRefs": [
        "PO715055"
      ]
    },
    {
      "uid": "PM715664",
      "acteurRef": "PA605804",
      "legislature": "14",
      "typeOrgane": "CMP",
      "dateDebut": "2016-11-30T01:00:00.000+01:00",
      "datePublication": "2016-12-01T01:00:00.000+01:00",
      "dateFin": "2016-12-01T01:00:00.000+01:00",
      "preseance": "16",
      "nominPrincipale": "1",
      "infosQualite": {
        "codeQualite": "Rapporteur",
        "libQualite": "Rapporteur",
        "libQualiteSex": "Rapporteur"
      },
      "organesRefs": [
        "PO715055"
      ]
    }
  ]
}