{
  "uid": "PO702914",
  "codeType": "MINISTERE",
  "libelle": "Secrétariat d'État, auprès du ministre de l'éducation nationale, de l'enseignement supérieur et de la recherche, chargé de l'enseignement supérieur et de la recherche",
  "libelleEdition": ", auprès du ministre de l'éducation nationale, de l'enseignement supérieur et de la recherche, chargée de l'enseignement supérieur et de la recherche",
  "libelleAbrege": "Enseignement supérieur et recherche",
  "libelleAbrev": "ENS",
  "viMoDe": {
    "dateDebut": "2014-08-27T02:00:00.000+02:00",
    "dateFin": "2015-03-05T01:00:00.000+01:00"
  },
  "organeParentRef": "PO702883"
}