{
  "uid": "PO393095",
  "codeType": "GA",
  "libelle": "France-République du Kazakhstan",
  "libelleEdition": "de France-République du Kazakhstan",
  "libelleAbrege": "Kazakhstan",
  "libelleAbrev": "KAZ",
  "viMoDe": {
    "dateAgrement": "2007-07-18T02:00:00.000+02:00",
    "dateFin": "2012-06-19T02:00:00.000+02:00"
  },
  "regime": "5ème République",
  "legislature": "13",
  "secretariat": {}
}