{
  "uid": "PO403081",
  "codeType": "GE",
  "libelle": "Montagne",
  "libelleEdition": "sur la montagne",
  "libelleAbrege": "Montagne",
  "libelleAbrev": "MON",
  "viMoDe": {
    "dateAgrement": "2007-10-31T01:00:00.000+01:00",
    "dateFin": "2012-06-19T02:00:00.000+02:00"
  },
  "regime": "5ème République",
  "legislature": "13",
  "secretariat": {}
}