{
  "uid": "PO675685",
  "codeType": "GEVI",
  "libelle": "Groupe d'études à vocation internationale sur les questions de la République démocratique de Corée (Corée du Nord )",
  "libelleEdition": "de France-Groupe d'études à vocation internationale sur les questions de la République démocratique de Corée (Corée du Nord )",
  "libelleAbrege": "Corée du Nord",
  "libelleAbrev": "NK",
  "viMoDe": {
    "dateAgrement": "2012-07-18T02:00:00.000+02:00",
    "dateFin": "2017-06-20T02:00:00.000+02:00"
  },
  "regime": "5ème République",
  "legislature": "14",
  "secretariat": {}
}