{
  "uid": "PA2816",
  "etatCivil": {
    "ident": {
      "civ": "M.",
      "prenom": "Jean",
      "nom": "Tiberi",
      "alpha": "Tiberi"
    },
    "infoNaissance": {
      "dateNais": "1935-01-30T00:00:00.000+00:00",
      "villeNais": "Paris",
      "depNais": "Paris"
    }
  },
  "profession": {
    "libelleCourant": "Magistrat",
    "socProcInsee": {
      "catSocPro": "Cadres de la fonction publique, professions intellectuelles et  artistiques",
      "famSocPro": "Cadres et professions intellectuelles supérieures"
    }
  },
  "adresses": [
    {
      "xsiType": "AdressePostale_Type",
      "uid": "AD225046",
      "type": "2",
      "typeLibelle": "Adresse publiée de circonscription",
      "poids": "21",
      "intitule": "Mairie du 5ème arrondissement,",
      "numeroRue": "21",
      "nomRue": "Place du Panthéon,",
      "codePostal": "75005",
      "ville": "Paris"
    },
    {
      "xsiType": "AdresseTelephonique_Type",
      "uid": "AD225047",
      "type": "11",
      "typeLibelle": "Téléphone",
      "poids": "21",
      "adresseDeRattachement": "AD225046",
      "valElec": "01 56 81 75 05"
    },
    {
      "xsiType": "AdresseTelephonique_Type",
      "uid": "AD294638",
      "type": "12",
      "typeLibelle": "Télécopie",
      "poids": "21",
      "adresseDeRattachement": "AD225046",
      "valElec": "01 56 81 75 08"
    },
    {
      "xsiType": "AdressePostale_Type",
      "uid": "AD386974",
      "type": "0",
      "typeLibelle": "Adresse officielle",
      "poids": "1",
      "intitule": "Assemblée nationale,",
      "numeroRue": "126",
      "nomRue": "Rue de l'Université,",
      "codePostal": "75355",
      "ville": "Paris 07 SP"
    },
    {
      "xsiType": "AdresseMail_Type",
      "uid": "AD391959",
      "type": "15",
      "typeLibelle": "Mèl",
      "valElec": "jtiberi@assemblee-nationale.fr"
    },
    {
      "xsiType": "AdresseTelephonique_Type",
      "uid": "AD395163",
      "type": "11",
      "typeLibelle": "Téléphone",
      "poids": "1",
      "adresseDeRattachement": "AD386974",
      "valElec": "01 40 63 60 74"
    },
    {
      "xsiType": "AdresseTelephonique_Type",
      "uid": "AD395164",
      "type": "12",
      "typeLibelle": "Télécopie",
      "poids": "1",
      "adresseDeRattachement": "AD386974",
      "valElec": "01 40 63 95 59"
    }
  ],
  "mandats": [
    {
      "uid": "PM386538",
      "acteurRef": "PA2816",
      "legislature": "13",
      "typeOrgane": "ASSEMBLEE",
      "dateDebut": "2007-06-20T02:00:00.000+02:00",
      "dateFin": "2012-06-19T02:00:00.000+02:00",
      "preseance": "50",
      "nominPrincipale": "1",
      "infosQualite": {
        "codeQualite": "membre",
        "libQualite": "membre",
        "libQualiteSex": "membre"
      },
      "organesRefs": [
        "PO384266"
      ],
      "suppleant": {
        "dateDebut": "2007-06-20T02:00:00.000+02:00",
        "dateFin": "2012-06-19T02:00:00.000+02:00",
        "suppleantRef": "PA345229"
      },
      "election": {
        "lieu": {
          "region": "Ile-de-France",
          "regionType": "Métropolitain",
          "departement": "Paris",
          "numDepartement": "75",
          "numCirco": "2"
        },
        "causeMandat": "élections générales",
        "refCirconscription": "PO384663"
      },
      "mandature": {
        "datePriseFonction": "2007-06-20T02:00:00.000+02:00",
        "causeFin": "Fin de législature",
        "premiereElection": "1"
      }
    },
    {
      "uid": "PM387553",
      "acteurRef": "PA2816",
      "legislature": "13",
      "typeOrgane": "GP",
      "dateDebut": "2007-06-20T02:00:00.000+02:00",
      "dateFin": "2007-06-26T02:00:00.000+02:00",
      "preseance": "28",
      "nominPrincipale": "1",
      "infosQualite": {
        "codeQualite": "Député non-inscrit",
        "libQualite": "Député non-inscrit",
        "libQualiteSex": "Député non-inscrit"
      },
      "organesRefs": [
        "PO387155"
      ]
    },
    {
      "uid": "PM389989",
      "acteurRef": "PA2816",
      "legislature": "13",
      "typeOrgane": "GP",
      "dateDebut": "2007-06-27T02:00:00.000+02:00",
      "datePublication": "2007-06-27T02:00:00.000+02:00",
      "dateFin": "2012-06-19T02:00:00.000+02:00",
      "preseance": "20",
      "nominPrincipale": "1",
      "infosQualite": {
        "codeQualite": "Membre",
        "libQualite": "Membre du",
        "libQualiteSex": "Membre du"
      },
      "organesRefs": [
        "PO389395"
      ]
    },
    {
      "uid": "PM390909",
      "acteurRef": "PA2816",
      "legislature": "13",
      "typeOrgane": "COMPER",
      "dateDebut": "2007-06-27T02:00:00.000+02:00",
      "datePublication": "2007-06-28T02:00:00.000+02:00",
      "dateFin": "2012-06-19T02:00:00.000+02:00",
      "preseance": "32",
      "nominPrincipale": "1",
      "infosQualite": {
        "codeQualite": "Membre",
        "libQualite": "Membre",
        "libQualiteSex": "Membre"
      },
      "organesRefs": [
        "PO59051"
      ]
    },
    {
      "uid": "PM392560",
      "acteurRef": "PA2816",
      "legislature": "13",
      "typeOrgane": "CMP",
      "dateDebut": "2007-07-23T02:00:00.000+02:00",
      "datePublication": "2007-07-25T02:00:00.000+02:00",
      "dateFin": "2007-07-26T02:00:00.000+02:00",
      "preseance": "28",
      "nominPrincipale": "1",
      "infosQualite": {
        "codeQualite": "Suppléant",
        "libQualite": "Membre suppléant",
        "libQualiteSex": "Membre suppléant"
      },
      "organesRefs": [
        "PO392541"
      ]
    },
    {
      "uid": "PM406947",
      "acteurRef": "PA2816",
      "legislature": "13",
      "typeOrgane": "GE",
      "dateDebut": "2008-01-16T01:00:00.000+01:00",
      "dateFin": "2012-06-19T02:00:00.000+02:00",
      "preseance": "20",
      "nominPrincipale": "1",
      "infosQualite": {
        "codeQualite": "Membre",
        "libQualite": "Membre",
        "libQualiteSex": "Membre"
      },
      "organesRefs": [
        "PO402895"
      ]
    },
    {
      "uid": "PM407061",
      "acteurRef": "PA2816",
      "legislature": "13",
      "typeOrgane": "GE",
      "dateDebut": "2008-01-15T01:00:00.000+01:00",
      "dateFin": "2012-06-19T02:00:00.000+02:00",
      "preseance": "20",
      "nominPrincipale": "1",
      "infosQualite": {
        "codeQualite": "Membre",
        "libQualite": "Membre",
        "libQualiteSex": "Membre"
      },
      "organesRefs": [
        "PO403148"
      ]
    },
    {
      "uid": "PM407304",
      "acteurRef": "PA2816",
      "legislature": "13",
      "typeOrgane": "GE",
      "dateDebut": "2008-01-01T01:00:00.000+01:00",
      "dateFin": "2012-06-19T02:00:00.000+02:00",
      "preseance": "20",
      "nominPrincipale": "1",
      "infosQualite": {
        "codeQualite": "Membre",
        "libQualite": "Membre",
        "libQualiteSex": "Membre"
      },
      "organesRefs": [
        "PO402985"
      ]
    },
    {
      "uid": "PM408892",
      "acteurRef": "PA2816",
      "legislature": "13",
      "typeOrgane": "GE",
      "dateDebut": "2008-02-11T01:00:00.000+01:00",
      "dateFin": "2012-06-19T02:00:00.000+02:00",
      "preseance": "20",
      "nominPrincipale": "1",
      "infosQualite": {
        "codeQualite": "Membre",
        "libQualite": "Membre",
        "libQualiteSex": "Membre"
      },
      "organesRefs": [
        "PO403123"
      ]
    },
    {
      "uid": "PM412262",
      "acteurRef": "PA2816",
      "legislature": "13",
      "typeOrgane": "GE",
      "dateDebut": "2008-04-10T02:00:00.000+02:00",
      "dateFin": "2012-06-19T02:00:00.000+02:00",
      "preseance": "20",
      "nominPrincipale": "1",
      "infosQualite": {
        "codeQualite": "Membre",
        "libQualite": "Membre",
        "libQualiteSex": "Membre"
      },
      "organesRefs": [
        "PO403208"
      ]
    },
    {
      "uid": "PM421806",
      "acteurRef": "PA2816",
      "legislature": "13",
      "typeOrgane": "CMP",
      "dateDebut": "2009-09-22T02:00:00.000+02:00",
      "datePublication": "2009-10-01T02:00:00.000+02:00",
      "dateFin": "2009-10-26T01:00:00.000+01:00",
      "preseance": "28",
      "nominPrincipale": "1",
      "infosQualite": {
        "codeQualite": "Suppléant",
        "libQualite": "Membre suppléant",
        "libQualiteSex": "Membre suppléant"
      },
      "organesRefs": [
        "PO421626"
      ]
    },
    {
      "uid": "PM423086",
      "acteurRef": "PA2816",
      "legislature": "13",
      "typeOrgane": "CMP",
      "dateDebut": "2010-02-18T01:00:00.000+01:00",
      "datePublication": "2010-02-19T01:00:00.000+01:00",
      "dateFin": "2010-02-25T01:00:00.000+01:00",
      "preseance": "28",
      "nominPrincipale": "1",
      "infosQualite": {
        "codeQualite": "Suppléant",
        "libQualite": "Membre suppléant",
        "libQualiteSex": "Membre suppléant"
      },
      "organesRefs": [
        "PO423071"
      ]
    },
    {
      "uid": "PM424006",
      "acteurRef": "PA2816",
      "legislature": "13",
      "typeOrgane": "CMP",
      "dateDebut": "2010-05-12T02:00:00.000+02:00",
      "datePublication": "2010-05-13T02:00:00.000+02:00",
      "dateFin": "2010-06-16T02:00:00.000+02:00",
      "preseance": "28",
      "nominPrincipale": "1",
      "infosQualite": {
        "codeQualite": "Suppléant",
        "libQualite": "Membre suppléant",
        "libQualiteSex": "Membre suppléant"
      },
      "organesRefs": [
        "PO423925"
      ]
    },
    {
      "uid": "PM427619",
      "acteurRef": "PA2816",
      "legislature": "13",
      "typeOrgane": "CMP",
      "dateDebut": "2011-03-08T01:00:00.000+01:00",
      "datePublication": "2011-03-09T01:00:00.000+01:00",
      "dateFin": "2011-03-16T01:00:00.000+01:00",
      "preseance": "28",
      "nominPrincipale": "1",
      "infosQualite": {
        "codeQualite": "Suppléant",
        "libQualite": "Membre suppléant",
        "libQualiteSex": "Membre suppléant"
      },
      "organesRefs": [
        "PO427600"
      ]
    },
    {
      "uid": "PM427640",
      "acteurRef": "PA2816",
      "legislature": "13",
      "typeOrgane": "CMP",
      "dateDebut": "2011-03-08T01:00:00.000+01:00",
      "datePublication": "2011-03-09T01:00:00.000+01:00",
      "dateFin": "2011-03-16T01:00:00.000+01:00",
      "preseance": "28",
      "nominPrincipale": "1",
      "infosQualite": {
        "codeQualite": "Suppléant",
        "libQualite": "Membre suppléant",
        "libQualiteSex": "Membre suppléant"
      },
      "organesRefs": [
        "PO427594"
      ]
    },
    {
      "uid": "PM429055",
      "acteurRef": "PA2816",
      "legislature": "13",
      "typeOrgane": "CMP",
      "dateDebut": "2011-06-22T02:00:00.000+02:00",
      "datePublication": "2011-06-24T02:00:00.000+02:00",
      "dateFin": "2011-06-29T02:00:00.000+02:00",
      "preseance": "28",
      "nominPrincipale": "1",
      "infosQualite": {
        "codeQualite": "Suppléant",
        "libQualite": "Membre suppléant",
        "libQualiteSex": "Membre suppléant"
      },
      "organesRefs": [
        "PO428704"
      ]
    },
    {
      "uid": "PM429132",
      "acteurRef": "PA2816",
      "legislature": "13",
      "typeOrgane": "CMP",
      "dateDebut": "2011-06-28T02:00:00.000+02:00",
      "datePublication": "2011-06-29T02:00:00.000+02:00",
      "dateFin": "2011-06-29T02:00:00.000+02:00",
      "preseance": "28",
      "nominPrincipale": "1",
      "infosQualite": {
        "codeQualite": "Suppléant",
        "libQualite": "Membre suppléant",
        "libQualiteSex": "Membre suppléant"
      },
      "organesRefs": [
        "PO429117"
      ]
    },
    {
      "uid": "PM429367",
      "acteurRef": "PA2816",
      "legislature": "13",
      "typeOrgane": "CMP",
      "dateDebut": "2011-07-05T02:00:00.000+02:00",
      "datePublication": "2011-07-06T02:00:00.000+02:00",
      "dateFin": "2011-07-25T02:00:00.000+02:00",
      "preseance": "28",
      "nominPrincipale": "1",
      "infosQualite": {
        "codeQualite": "Suppléant",
        "libQualite": "Membre suppléant",
        "libQualiteSex": "Membre suppléant"
      },
      "organesRefs": [
        "PO429350"
      ]
    },
    {
      "uid": "PM430967",
      "acteurRef": "PA2816",
      "legislature": "13",
      "typeOrgane": "CMP",
      "dateDebut": "2011-11-04T01:00:00.000+01:00",
      "datePublication": "2011-11-05T01:00:00.000+01:00",
      "dateFin": "2011-11-10T01:00:00.000+01:00",
      "preseance": "28",
      "nominPrincipale": "1",
      "infosQualite": {
        "codeQualite": "Suppléant",
        "libQualite": "Membre suppléant",
        "libQualiteSex": "Membre suppléant"
      },
      "organesRefs": [
        "PO430883"
      ]
    }
  ]
}