{
  "uid": "PO714079",
  "codeType": "MISINFOPRE",
  "libelle": "Mission d'information sur les suites du référendum britannique et le suivi des négociations",
  "libelleEdition": "de la mission d'information sur les suites du référendum britannique et le suivi des négociations",
  "libelleAbrege": "Suites du référendum britannique",
  "libelleAbrev": "BREXIT",
  "viMoDe": {
    "dateDebut": "2016-07-05T02:00:00.000+02:00",
    "dateFin": "2017-02-20T01:00:00.000+01:00"
  },
  "regime": "5ème République",
  "legislature": "14",
  "secretariat": {}
}