{
  "uid": "PA720414",
  "etatCivil": {
    "ident": {
      "civ": "M.",
      "prenom": "Patrice",
      "nom": "Perrot",
      "alpha": "Perrot",
      "trigramme": "PPE"
    },
    "infoNaissance": {
      "dateNais": "1964-02-24T01:00:00.000+01:00",
      "villeNais": "Decize",
      "depNais": "Nièvre",
      "paysNais": "France"
    }
  },
  "profession": {
    "libelleCourant": "Industriel-Chef d'entreprise",
    "socProcInsee": {
      "catSocPro": "Chefs d'entreprise de 10 salariés ou plus",
      "famSocPro": "Artisans, commerçants et chefs d'entreprise"
    }
  },
  "uriHatvp": "https://www.hatvp.fr/pages_nominatives/perrot-patrice",
  "adresses": [
    {
      "xsiType": "AdressePostale_Type",
      "uid": "AD720416",
      "type": "0",
      "typeLibelle": "Adresse officielle",
      "poids": "1",
      "intitule": "Assemblée nationale,",
      "numeroRue": "126",
      "nomRue": "Rue de l'Université,",
      "codePostal": "75355",
      "ville": "Paris 07 SP"
    },
    {
      "xsiType": "AdresseMail_Type",
      "uid": "AD728144",
      "type": "15",
      "typeLibelle": "Mèl",
      "valElec": "patrice.perrot@assemblee-nationale.fr"
    },
    {
      "xsiType": "AdressePostale_Type",
      "uid": "AD734718",
      "type": "2",
      "typeLibelle": "Adresse publiée de circonscription",
      "poids": "22",
      "intitule": "Permanence parlementaire",
      "numeroRue": "12",
      "nomRue": "Route de La Machine",
      "codePostal": "58300",
      "ville": "Saint-Léger-des-Vignes"
    },
    {
      "xsiType": "AdresseTelephonique_Type",
      "uid": "AD734720",
      "type": "11",
      "typeLibelle": "Téléphone",
      "poids": "22",
      "adresseDeRattachement": "AD734718",
      "valElec": "03 86 30 69 20"
    },
    {
      "xsiType": "AdresseSiteWeb_Type",
      "uid": "AD734722",
      "type": "25",
      "typeLibelle": "Facebook",
      "valElec": "patriceperrotenmarche58"
    },
    {
      "xsiType": "AdresseTelephonique_Type",
      "uid": "AD757829",
      "type": "11",
      "typeLibelle": "Téléphone",
      "poids": "1",
      "adresseDeRattachement": "AD720416",
      "valElec": "01.40.63.76.09"
    }
  ],
  "mandats": [
    {
      "uid": "PM722958",
      "acteurRef": "PA720414",
      "legislature": "15",
      "typeOrgane": "ASSEMBLEE",
      "dateDebut": "2017-06-18T02:00:00.000+02:00",
      "preseance": "50",
      "nominPrincipale": "1",
      "infosQualite": {
        "codeQualite": "membre",
        "libQualite": "membre",
        "libQualiteSex": "membre"
      },
      "organesRefs": [
        "PO717460"
      ],
      "suppleant": {
        "dateDebut": "2017-06-18T02:00:00.000+02:00",
        "suppleantRef": "PA720418"
      },
      "election": {
        "lieu": {
          "region": "Bourgogne-Franche-Comté",
          "regionType": "Métropolitain",
          "departement": "Nièvre",
          "numDepartement": "58",
          "numCirco": "2"
        },
        "causeMandat": "élections générales",
        "refCirconscription": "PO718000"
      },
      "mandature": {
        "datePriseFonction": "2017-06-21T02:00:00.000+02:00",
        "premiereElection": "0",
        "placeHemicycle": "547"
      },
      "collaborateurs": [
        {
          "qualite": "Mme",
          "prenom": "Catherine",
          "nom": "Maligne"
        },
        {
          "qualite": "Mme",
          "prenom": "Delphine",
          "nom": "Fleury"
        },
        {
          "qualite": "Mme",
          "prenom": "Isabelle",
          "nom": "Maligne-Perruchot"
        }
      ]
    },
    {
      "uid": "PM724520",
      "acteurRef": "PA720414",
      "legislature": "15",
      "typeOrgane": "GP",
      "dateDebut": "2017-06-21T02:00:00.000+02:00",
      "dateFin": "2017-06-26T02:00:00.000+02:00",
      "preseance": "28",
      "nominPrincipale": "1",
      "infosQualite": {
        "codeQualite": "Député non-inscrit",
        "libQualite": "Député non-inscrit",
        "libQualiteSex": "Député non-inscrit"
      },
      "organesRefs": [
        "PO723569"
      ]
    },
    {
      "uid": "PM731137",
      "acteurRef": "PA720414",
      "legislature": "15",
      "typeOrgane": "GP",
      "dateDebut": "2017-06-27T02:00:00.000+02:00",
      "datePublication": "2017-06-28T02:00:00.000+02:00",
      "preseance": "20",
      "nominPrincipale": "1",
      "infosQualite": {
        "codeQualite": "Membre",
        "libQualite": "Membre du",
        "libQualiteSex": "Membre du"
      },
      "organesRefs": [
        "PO730964"
      ]
    },
    {
      "uid": "PM732081",
      "acteurRef": "PA720414",
      "legislature": "15",
      "typeOrgane": "COMPER",
      "dateDebut": "2017-06-29T02:00:00.000+02:00",
      "datePublication": "2017-06-29T02:00:00.000+02:00",
      "preseance": "32",
      "nominPrincipale": "1",
      "infosQualite": {
        "codeQualite": "Membre",
        "libQualite": "Membre",
        "libQualiteSex": "Membre"
      },
      "organesRefs": [
        "PO419865"
      ]
    },
    {
      "uid": "PM732618",
      "acteurRef": "PA720414",
      "legislature": "15",
      "typeOrgane": "COMNL",
      "dateDebut": "2017-07-12T02:00:00.000+02:00",
      "datePublication": "2017-07-12T02:00:00.000+02:00",
      "preseance": "20",
      "nominPrincipale": "1",
      "infosQualite": {
        "codeQualite": "Membre",
        "libQualite": "Membre",
        "libQualiteSex": "Membre"
      },
      "organesRefs": [
        "PO420375"
      ]
    },
    {
      "uid": "PM735654",
      "acteurRef": "PA720414",
      "legislature": "15",
      "typeOrgane": "GA",
      "dateDebut": "2017-09-28T02:00:00.000+02:00",
      "preseance": "20",
      "nominPrincipale": "1",
      "infosQualite": {
        "codeQualite": "Membre",
        "libQualite": "Membre",
        "libQualiteSex": "Membre"
      },
      "organesRefs": [
        "PO733057"
      ]
    },
    {
      "uid": "PM740609",
      "acteurRef": "PA720414",
      "legislature": "15",
      "typeOrgane": "MISINFO",
      "dateDebut": "2017-10-18T02:00:00.000+02:00",
      "dateFin": "2018-06-21T02:00:00.000+02:00",
      "preseance": "10",
      "nominPrincipale": "1",
      "infosQualite": {
        "codeQualite": "Membre",
        "libQualite": "Membre",
        "libQualiteSex": "Membre"
      },
      "organesRefs": [
        "PO740575"
      ]
    },
    {
      "uid": "PM745357",
      "acteurRef": "PA720414",
      "typeOrgane": "PARPOL",
      "dateDebut": "2017-12-01T01:00:00.000+01:00",
      "preseance": "5",
      "nominPrincipale": "1",
      "infosQualite": {
        "codeQualite": "Membre",
        "libQualite": "Membre",
        "libQualiteSex": "Membre"
      },
      "organesRefs": [
        "PO744854"
      ]
    },
    {
      "uid": "PM749006",
      "acteurRef": "PA720414",
      "legislature": "15",
      "typeOrgane": "GE",
      "dateDebut": "2018-02-28T01:00:00.000+01:00",
      "preseance": "20",
      "nominPrincipale": "1",
      "infosQualite": {
        "codeQualite": "Membre",
        "libQualite": "Membre",
        "libQualiteSex": "Membre"
      },
      "organesRefs": [
        "PO746674"
      ]
    },
    {
      "uid": "PM749026",
      "acteurRef": "PA720414",
      "legislature": "15",
      "typeOrgane": "CNPE",
      "dateDebut": "2018-02-08T01:00:00.000+01:00",
      "datePublication": "2018-02-08T01:00:00.000+01:00",
      "dateFin": "2018-06-28T02:00:00.000+02:00",
      "preseance": "20",
      "nominPrincipale": "1",
      "infosQualite": {
        "codeQualite": "Membre",
        "libQualite": "Membre",
        "libQualiteSex": "Membre"
      },
      "organesRefs": [
        "PO748336"
      ]
    },
    {
      "uid": "PM750723",
      "acteurRef": "PA720414",
      "legislature": "15",
      "typeOrgane": "GE",
      "dateDebut": "2018-02-16T01:00:00.000+01:00",
      "preseance": "20",
      "nominPrincipale": "1",
      "infosQualite": {
        "codeQualite": "Membre",
        "libQualite": "Membre",
        "libQualiteSex": "Membre"
      },
      "organesRefs": [
        "PO746847"
      ]
    },
    {
      "uid": "PM750877",
      "acteurRef": "PA720414",
      "legislature": "15",
      "typeOrgane": "GE",
      "dateDebut": "2018-02-20T01:00:00.000+01:00",
      "preseance": "20",
      "nominPrincipale": "1",
      "infosQualite": {
        "codeQualite": "Membre",
        "libQualite": "Membre",
        "libQualiteSex": "Membre"
      },
      "organesRefs": [
        "PO747099"
      ]
    },
    {
      "uid": "PM750996",
      "acteurRef": "PA720414",
      "legislature": "15",
      "typeOrgane": "GE",
      "dateDebut": "2018-02-19T01:00:00.000+01:00",
      "preseance": "20",
      "nominPrincipale": "1",
      "infosQualite": {
        "codeQualite": "Membre",
        "libQualite": "Membre",
        "libQualiteSex": "Membre"
      },
      "organesRefs": [
        "PO746880"
      ]
    },
    {
      "uid": "PM751707",
      "acteurRef": "PA720414",
      "legislature": "15",
      "typeOrgane": "GE",
      "dateDebut": "2018-02-22T01:00:00.000+01:00",
      "preseance": "20",
      "nominPrincipale": "1",
      "infosQualite": {
        "codeQualite": "Membre",
        "libQualite": "Membre",
        "libQualiteSex": "Membre"
      },
      "organesRefs": [
        "PO746669"
      ]
    },
    {
      "uid": "PM752380",
      "acteurRef": "PA720414",
      "legislature": "15",
      "typeOrgane": "GE",
      "dateDebut": "2018-03-05T01:00:00.000+01:00",
      "preseance": "20",
      "nominPrincipale": "0",
      "infosQualite": {
        "codeQualite": "Membre",
        "libQualite": "Membre",
        "libQualiteSex": "Membre"
      },
      "organesRefs": [
        "PO746930"
      ]
    },
    {
      "uid": "PM752608",
      "acteurRef": "PA720414",
      "legislature": "15",
      "typeOrgane": "GE",
      "dateDebut": "2018-03-06T01:00:00.000+01:00",
      "preseance": "20",
      "nominPrincipale": "1",
      "infosQualite": {
        "codeQualite": "Membre",
        "libQualite": "Membre",
        "libQualiteSex": "Membre"
      },
      "organesRefs": [
        "PO747165"
      ]
    },
    {
      "uid": "PM753056",
      "acteurRef": "PA720414",
      "legislature": "15",
      "typeOrgane": "GE",
      "dateDebut": "2018-03-08T01:00:00.000+01:00",
      "preseance": "20",
      "nominPrincipale": "1",
      "infosQualite": {
        "codeQualite": "Membre",
        "libQualite": "Membre",
        "libQualiteSex": "Membre"
      },
      "organesRefs": [
        "PO746811"
      ]
    },
    {
      "uid": "PM754878",
      "acteurRef": "PA720414",
      "legislature": "15",
      "typeOrgane": "GE",
      "dateDebut": "2018-03-02T01:00:00.000+01:00",
      "preseance": "20",
      "nominPrincipale": "1",
      "infosQualite": {
        "codeQualite": "Membre",
        "libQualite": "Membre",
        "libQualiteSex": "Membre"
      },
      "organesRefs": [
        "PO746852"
      ]
    },
    {
      "uid": "PM755267",
      "acteurRef": "PA720414",
      "legislature": "15",
      "typeOrgane": "GE",
      "dateDebut": "2018-04-04T02:00:00.000+02:00",
      "preseance": "8",
      "nominPrincipale": "1",
      "infosQualite": {
        "codeQualite": "Vice-Président",
        "libQualite": "Vice-Président",
        "libQualiteSex": "Vice-Président"
      },
      "organesRefs": [
        "PO746930"
      ]
    },
    {
      "uid": "PM757305",
      "acteurRef": "PA720414",
      "legislature": "15",
      "typeOrgane": "CNPS",
      "dateDebut": "2018-06-27T02:00:00.000+02:00",
      "datePublication": "2018-06-28T02:00:00.000+02:00",
      "preseance": "20",
      "nominPrincipale": "1",
      "infosQualite": {
        "codeQualite": "Membre",
        "libQualite": "Membre",
        "libQualiteSex": "Membre"
      },
      "organesRefs": [
        "PO757134"
      ]
    }
  ]
}