{
  "uid": "PO591256",
  "codeType": "MINISTERE",
  "libelle": "Ministère chargé des petites et moyennes entreprises, de l'innovation et de l'économie numérique",
  "libelleEdition": "Ministère chargé des petites et moyennes entreprises, de l'innovation et de l'économie numérique",
  "libelleAbrege": "Petites et moyennes entreprises, innovation et économie numérique",
  "libelleAbrev": "PIE",
  "viMoDe": {
    "dateDebut": "2012-05-17T02:00:00.000+02:00",
    "dateFin": "2012-06-18T02:00:00.000+02:00"
  },
  "organeParentRef": "PO590011"
}