{
  "uid": "PO746629",
  "codeType": "GE",
  "libelle": "Antisémitisme",
  "libelleEdition": "ANTISÉMITISME",
  "libelleAbrege": "ANTISÉMITISME",
  "libelleAbrev": "ANTISEMITI",
  "viMoDe": {
    "dateAgrement": "2017-12-20T01:00:00.000+01:00"
  },
  "regime": "5ème République",
  "legislature": "15",
  "secretariat": {
    "secretaire01": "M. Thomas Del Vecchio"
  }
}