{
  "uid": "PO60258",
  "codeType": "ORGEXTPARL",
  "libelle": "Commission nationale de contrôle des interceptions de sécurité",
  "libelleEdition": "de la Commission nationale de contrôle des interceptions de sécurité",
  "libelleAbrege": "Interceptions de sécurité",
  "libelleAbrev": "118",
  "viMoDe": {
    "dateDebut": "1991-07-10T02:00:00.000+02:00",
    "dateFin": "2017-05-29T02:00:00.000+02:00"
  },
  "regime": "5ème République",
  "regimeJuridique": "Article L.243-2 du code de la sécurité intérieure"
}