{
  "uid": "PA643211",
  "etatCivil": {
    "ident": {
      "civ": "M.",
      "prenom": "Franck",
      "nom": "Montaugé",
      "alpha": "MONTAUGE_Franck"
    },
    "infoNaissance": {
      "dateNais": "1961-09-14T01:00:00.000+01:00",
      "villeNais": "Condom",
      "depNais": "Gers",
      "paysNais": "France"
    }
  },
  "profession": {
    "libelleCourant": "Sans profession déclarée",
    "socProcInsee": {
      "catSocPro": "Sans profession déclarée",
      "famSocPro": "Sans profession déclarée"
    }
  },
  "adresses": [
    {
      "xsiType": "AdressePostale_Type",
      "uid": "AD696539",
      "type": "0",
      "typeLibelle": "Adresse officielle",
      "poids": "1",
      "intitule": "Assemblée nationale",
      "numeroRue": "126",
      "nomRue": "Rue de l'Université",
      "codePostal": "75355",
      "ville": "Paris 07 SP"
    },
    {
      "xsiType": "AdressePostale_Type",
      "uid": "AD696560",
      "type": "2",
      "typeLibelle": "Adresse publiée de circonscription",
      "poids": "22",
      "intitule": "Mairie d'Auch",
      "codePostal": "32000",
      "ville": "Auch"
    },
    {
      "xsiType": "AdresseTelephonique_Type",
      "uid": "AD696561",
      "type": "11",
      "typeLibelle": "Téléphone",
      "poids": "22",
      "adresseDeRattachement": "AD696560",
      "valElec": "05 62 61 65 60"
    },
    {
      "xsiType": "AdresseMail_Type",
      "uid": "AD696574",
      "type": "15",
      "typeLibelle": "Mèl",
      "valElec": "fmontauge@assemblee-nationale.fr"
    },
    {
      "xsiType": "AdresseSiteWeb_Type",
      "uid": "AD703724",
      "type": "23",
      "typeLibelle": "Url sénateur",
      "valElec": "https://www.senat.fr/senateur/montauge_franck14257w.html"
    }
  ],
  "mandats": [
    {
      "uid": "PM696535",
      "acteurRef": "PA643211",
      "legislature": "14",
      "typeOrgane": "ASSEMBLEE",
      "dateDebut": "2012-06-20T02:00:00.000+02:00",
      "dateFin": "2014-05-02T02:00:00.000+02:00",
      "preseance": "50",
      "nominPrincipale": "1",
      "infosQualite": {
        "codeQualite": "membre",
        "libQualite": "membre",
        "libQualiteSex": "membre"
      },
      "organesRefs": [
        "PO644420"
      ],
      "election": {
        "lieu": {
          "region": "Occitanie",
          "regionType": "Métropolitain",
          "departement": "Gers",
          "numDepartement": "32",
          "numCirco": "1"
        },
        "causeMandat": "remplacement d'un député nommé au Gouvernement",
        "refCirconscription": "PO644562"
      },
      "mandature": {
        "datePriseFonction": "2013-08-03T02:00:00.000+02:00",
        "causeFin": "Reprise de l'exercice du mandat d'un ancien membre du Gouvernement",
        "premiereElection": "0"
      }
    },
    {
      "uid": "PM696541",
      "acteurRef": "PA643211",
      "legislature": "14",
      "typeOrgane": "GP",
      "dateDebut": "2013-08-03T02:00:00.000+02:00",
      "datePublication": "2013-08-04T02:00:00.000+02:00",
      "dateFin": "2014-05-02T02:00:00.000+02:00",
      "preseance": "20",
      "nominPrincipale": "1",
      "infosQualite": {
        "codeQualite": "Membre",
        "libQualite": "Membre du",
        "libQualiteSex": "Membre du"
      },
      "organesRefs": [
        "PO656002"
      ]
    },
    {
      "uid": "PM696817",
      "acteurRef": "PA643211",
      "legislature": "14",
      "typeOrgane": "COMPER",
      "dateDebut": "2013-09-12T02:00:00.000+02:00",
      "datePublication": "2013-09-12T02:00:00.000+02:00",
      "dateFin": "2014-05-02T02:00:00.000+02:00",
      "preseance": "32",
      "nominPrincipale": "1",
      "infosQualite": {
        "codeQualite": "Membre",
        "libQualite": "Membre",
        "libQualiteSex": "Membre"
      },
      "organesRefs": [
        "PO419865"
      ]
    },
    {
      "uid": "PM698447",
      "acteurRef": "PA643211",
      "legislature": "14",
      "typeOrgane": "GE",
      "dateDebut": "2013-11-13T01:00:00.000+01:00",
      "dateFin": "2014-05-02T02:00:00.000+02:00",
      "preseance": "20",
      "nominPrincipale": "1",
      "infosQualite": {
        "codeQualite": "Membre",
        "libQualite": "Membre",
        "libQualiteSex": "Membre"
      },
      "organesRefs": [
        "PO686878"
      ]
    },
    {
      "uid": "PM703707",
      "acteurRef": "PA643211",
      "typeOrgane": "SENAT",
      "dateDebut": "2014-10-01T02:00:00.000+02:00",
      "preseance": "20",
      "nominPrincipale": "1",
      "infosQualite": {
        "codeQualite": "Sénateur",
        "libQualite": "SENATEUR",
        "libQualiteSex": "SENATEUR"
      },
      "organesRefs": [
        "PO78718"
      ],
      "election": {
        "lieu": {
          "numDepartement": "32"
        }
      },
      "mandature": {
        "premiereElection": "0"
      }
    },
    {
      "uid": "PM703884",
      "acteurRef": "PA643211",
      "typeOrgane": "GROUPESENAT",
      "dateDebut": "2014-10-07T02:00:00.000+02:00",
      "preseance": "4",
      "nominPrincipale": "1",
      "infosQualite": {
        "codeQualite": "Membre",
        "libQualite": "Membre",
        "libQualiteSex": "Membre"
      },
      "organesRefs": [
        "PO77710"
      ]
    },
    {
      "uid": "PM703968",
      "acteurRef": "PA643211",
      "typeOrgane": "COMSENAT",
      "dateDebut": "2014-10-08T02:00:00.000+02:00",
      "dateFin": "2017-10-04T02:00:00.000+02:00",
      "preseance": "10",
      "nominPrincipale": "1",
      "infosQualite": {
        "codeQualite": "Membre",
        "libQualite": "Membre",
        "libQualiteSex": "Membre"
      },
      "organesRefs": [
        "PO516753"
      ]
    },
    {
      "uid": "PM704823",
      "acteurRef": "PA643211",
      "typeOrgane": "PARPOL",
      "dateDebut": "2013-12-01T01:00:00.000+01:00",
      "dateFin": "2014-05-02T02:00:00.000+02:00",
      "preseance": "5",
      "nominPrincipale": "1",
      "infosQualite": {
        "codeQualite": "Membre",
        "libQualite": "Membre",
        "libQualiteSex": "Membre"
      },
      "organesRefs": [
        "PO684932"
      ]
    },
    {
      "uid": "PM704893",
      "acteurRef": "PA643211",
      "typeOrgane": "DELEGSENAT",
      "dateDebut": "2014-10-29T01:00:00.000+01:00",
      "preseance": "4",
      "nominPrincipale": "1",
      "infosQualite": {
        "codeQualite": "Membre",
        "libQualite": "Membre",
        "libQualiteSex": "Membre"
      },
      "organesRefs": [
        "PO420388"
      ]
    },
    {
      "uid": "PM706473",
      "acteurRef": "PA643211",
      "typeOrgane": "CMP",
      "dateDebut": "2015-03-04T01:00:00.000+01:00",
      "datePublication": "2015-03-07T01:00:00.000+01:00",
      "dateFin": "2015-05-25T02:00:00.000+02:00",
      "preseance": "20",
      "nominPrincipale": "1",
      "infosQualite": {
        "codeQualite": "Titulaire",
        "libQualite": "Membre titulaire",
        "libQualiteSex": "Membre titulaire"
      },
      "organesRefs": [
        "PO706437"
      ]
    },
    {
      "uid": "PM711918",
      "acteurRef": "PA643211",
      "typeOrgane": "OFFPAR",
      "dateDebut": "2016-03-16T01:00:00.000+01:00",
      "datePublication": "2016-03-16T01:00:00.000+01:00",
      "dateFin": "2017-09-24T02:00:00.000+02:00",
      "preseance": "24",
      "nominPrincipale": "1",
      "infosQualite": {
        "codeQualite": "Membre",
        "libQualite": "Membre",
        "libQualiteSex": "Membre"
      },
      "organesRefs": [
        "PO273589"
      ]
    },
    {
      "uid": "PM716654",
      "acteurRef": "PA643211",
      "typeOrgane": "CMP",
      "dateDebut": "2017-01-26T01:00:00.000+01:00",
      "datePublication": "2017-01-28T01:00:00.000+01:00",
      "dateFin": "2017-02-02T01:00:00.000+01:00",
      "preseance": "20",
      "nominPrincipale": "1",
      "infosQualite": {
        "codeQualite": "Titulaire",
        "libQualite": "Membre titulaire",
        "libQualiteSex": "Membre titulaire"
      },
      "organesRefs": [
        "PO716629"
      ]
    },
    {
      "uid": "PM716773",
      "acteurRef": "PA643211",
      "typeOrgane": "CMP",
      "dateDebut": "2017-02-08T01:00:00.000+01:00",
      "datePublication": "2017-02-09T01:00:00.000+01:00",
      "dateFin": "2017-02-14T01:00:00.000+01:00",
      "preseance": "20",
      "nominPrincipale": "1",
      "infosQualite": {
        "codeQualite": "Titulaire",
        "libQualite": "Membre titulaire",
        "libQualiteSex": "Membre titulaire"
      },
      "organesRefs": [
        "PO716753"
      ]
    },
    {
      "uid": "PM741252",
      "acteurRef": "PA643211",
      "typeOrgane": "COMSENAT",
      "dateDebut": "2017-10-05T02:00:00.000+02:00",
      "nominPrincipale": "1",
      "infosQualite": {
        "libQualite": "Vice-Président",
        "libQualiteSex": "Vice-Président"
      },
      "organesRefs": [
        "PO516753"
      ]
    },
    {
      "uid": "PM741498",
      "acteurRef": "PA643211",
      "typeOrgane": "DELEGSENAT",
      "dateDebut": "2017-10-18T02:00:00.000+02:00",
      "preseance": "4",
      "nominPrincipale": "1",
      "infosQualite": {
        "codeQualite": "Membre",
        "libQualite": "Membre",
        "libQualiteSex": "Membre"
      },
      "organesRefs": [
        "PO420387"
      ]
    },
    {
      "uid": "PM742802",
      "acteurRef": "PA643211",
      "typeOrgane": "OFFPAR",
      "dateDebut": "2017-11-09T01:00:00.000+01:00",
      "datePublication": "2017-11-10T01:00:00.000+01:00",
      "dateFin": "2017-11-28T01:00:00.000+01:00",
      "preseance": "24",
      "nominPrincipale": "1",
      "infosQualite": {
        "codeQualite": "Membre",
        "libQualite": "Membre",
        "libQualiteSex": "Membre"
      },
      "organesRefs": [
        "PO273589"
      ]
    },
    {
      "uid": "PM757613",
      "acteurRef": "PA643211",
      "typeOrgane": "CMP",
      "dateDebut": "2018-07-05T02:00:00.000+02:00",
      "datePublication": "2018-07-06T02:00:00.000+02:00",
      "preseance": "20",
      "nominPrincipale": "1",
      "infosQualite": {
        "codeQualite": "Titulaire",
        "libQualite": "Membre titulaire",
        "libQualiteSex": "Membre titulaire"
      },
      "organesRefs": [
        "PO757489"
      ]
    },
    {
      "uid": "PM759600",
      "acteurRef": "PA643211",
      "typeOrgane": "COMSPSENAT",
      "dateDebut": "2018-10-10T02:00:00.000+02:00",
      "nominPrincipale": "1",
      "infosQualite": {
        "libQualite": "Membre",
        "libQualiteSex": "Membre"
      },
      "organesRefs": [
        "PO759377"
      ]
    }
  ]
}