{
  "uid": "PO425714",
  "codeType": "MINISTERE",
  "libelle": "Secrétariat d'État auprès de la ministre de l'économie, des finances et de l'industrie, chargé du commerce extérieur",
  "libelleEdition": "auprès de la ministre de l'économie, des finances et de l'industrie, chargé du commerce extérieur",
  "libelleAbrege": "Commerce extérieur",
  "libelleAbrev": "CEX",
  "viMoDe": {
    "dateDebut": "2010-11-14T01:00:00.000+01:00",
    "dateFin": "2011-06-29T02:00:00.000+02:00"
  },
  "organeParentRef": "PO425695"
}