{
  "uid": "PO747119",
  "codeType": "GE",
  "libelle": "Peuple tamoul",
  "libelleEdition": "PEUPLE TAMOUL",
  "libelleAbrege": "PEUPLE TAMOUL",
  "libelleAbrev": "PEUPLETAMO",
  "viMoDe": {
    "dateAgrement": "2017-12-20T01:00:00.000+01:00"
  },
  "regime": "5ème République",
  "legislature": "15",
  "secretariat": {
    "secretaire01": "Mme Gabrielle Guerrero Jimenez"
  }
}