{
  "uid": "PO392498",
  "codeType": "MINISTERE",
  "libelle": "Secrétariat d'Etat à la défense, chargé des anciens combattants",
  "libelleEdition": "à la défense, chargé des anciens combattants",
  "libelleAbrege": "Anciens combattants",
  "libelleAbrev": "ACO",
  "viMoDe": {
    "dateDebut": "2007-07-07T02:00:00.000+02:00",
    "dateFin": "2008-03-17T01:00:00.000+01:00"
  },
  "organeParentRef": "PO384206"
}