{
  "uid": "PO709167",
  "codeType": "ORGEXTPARL",
  "libelle": "Observatoire de la récidive et de la désistance",
  "libelleEdition": "de l'Observatoire de la récidive et de la désistance",
  "libelleAbrege": "Récidive et désistance",
  "libelleAbrev": "324",
  "viMoDe": {
    "dateDebut": "2014-08-01T02:00:00.000+02:00"
  },
  "regime": "5ème République",
  "regimeJuridique": "Article 7 de la loi n° 2009-1436 du 24 novembre 2009",
  "nombreReunionsAnnuelles": "5"
}