{
  "uid": "PA610125",
  "etatCivil": {
    "ident": {
      "civ": "M.",
      "prenom": "Jean-Christophe",
      "nom": "Fromantin",
      "alpha": "Fromantin"
    },
    "infoNaissance": {
      "dateNais": "1962-08-30T01:00:00.000+01:00",
      "villeNais": "Nantes",
      "depNais": "Loire-Atlantique",
      "paysNais": "France"
    }
  },
  "profession": {
    "libelleCourant": "Industriel-Chef d'entreprise",
    "socProcInsee": {
      "catSocPro": "Cadres d'entreprise",
      "famSocPro": "Cadres et professions intellectuelles supérieures"
    }
  },
  "adresses": [
    {
      "xsiType": "AdressePostale_Type",
      "uid": "AD646002",
      "type": "0",
      "typeLibelle": "Adresse officielle",
      "poids": "1",
      "intitule": "Assemblée nationale",
      "numeroRue": "126",
      "nomRue": "Rue de l'université",
      "codePostal": "75355",
      "ville": "Paris 07 SP"
    },
    {
      "xsiType": "AdresseMail_Type",
      "uid": "AD648618",
      "type": "15",
      "typeLibelle": "Mèl",
      "valElec": "jcfromantin@assemblee-nationale.fr"
    }
  ],
  "mandats": [
    {
      "uid": "PM645088",
      "acteurRef": "PA610125",
      "legislature": "14",
      "typeOrgane": "ASSEMBLEE",
      "dateDebut": "2012-06-20T02:00:00.000+02:00",
      "dateFin": "2017-06-20T02:00:00.000+02:00",
      "preseance": "50",
      "nominPrincipale": "1",
      "infosQualite": {
        "codeQualite": "membre",
        "libQualite": "membre",
        "libQualiteSex": "membre"
      },
      "organesRefs": [
        "PO644420"
      ],
      "suppleant": {
        "dateDebut": "2012-06-20T02:00:00.000+02:00",
        "dateFin": "2017-06-20T02:00:00.000+02:00",
        "suppleantRef": "PA643046"
      },
      "election": {
        "lieu": {
          "region": "Ile-de-France",
          "regionType": "Métropolitain",
          "departement": "Hauts-de-Seine",
          "numDepartement": "92",
          "numCirco": "6"
        },
        "causeMandat": "élections générales",
        "refCirconscription": "PO644934"
      },
      "mandature": {
        "datePriseFonction": "2012-06-20T02:00:00.000+02:00",
        "causeFin": "Fin de législature",
        "premiereElection": "0"
      }
    },
    {
      "uid": "PM656538",
      "acteurRef": "PA610125",
      "legislature": "14",
      "typeOrgane": "GP",
      "dateDebut": "2012-06-26T02:00:00.000+02:00",
      "datePublication": "2012-06-27T02:00:00.000+02:00",
      "dateFin": "2015-12-07T01:00:00.000+01:00",
      "preseance": "20",
      "nominPrincipale": "1",
      "infosQualite": {
        "codeQualite": "Membre",
        "libQualite": "Membre du",
        "libQualiteSex": "Membre du"
      },
      "organesRefs": [
        "PO656010"
      ]
    },
    {
      "uid": "PM657045",
      "acteurRef": "PA610125",
      "legislature": "14",
      "typeOrgane": "COMPER",
      "dateDebut": "2012-06-28T02:00:00.000+02:00",
      "datePublication": "2012-06-28T02:00:00.000+02:00",
      "dateFin": "2014-11-06T01:00:00.000+01:00",
      "preseance": "32",
      "nominPrincipale": "1",
      "infosQualite": {
        "codeQualite": "Membre",
        "libQualite": "Membre",
        "libQualiteSex": "Membre"
      },
      "organesRefs": [
        "PO419865"
      ]
    },
    {
      "uid": "PM677148",
      "acteurRef": "PA610125",
      "legislature": "14",
      "typeOrgane": "COMNL",
      "dateDebut": "2012-07-25T02:00:00.000+02:00",
      "datePublication": "2012-07-25T02:00:00.000+02:00",
      "dateFin": "2017-06-20T02:00:00.000+02:00",
      "preseance": "20",
      "nominPrincipale": "1",
      "infosQualite": {
        "codeQualite": "Membre",
        "libQualite": "Membre",
        "libQualiteSex": "Membre"
      },
      "organesRefs": [
        "PO420375"
      ]
    },
    {
      "uid": "PM677388",
      "acteurRef": "PA610125",
      "legislature": "14",
      "typeOrgane": "ORGEXTPARL",
      "dateDebut": "2012-07-10T02:00:00.000+02:00",
      "datePublication": "2012-07-10T02:00:00.000+02:00",
      "dateFin": "2017-06-20T02:00:00.000+02:00",
      "preseance": "20",
      "nominPrincipale": "1",
      "infosQualite": {
        "codeQualite": "Titulaire",
        "libQualite": "Membre titulaire",
        "libQualiteSex": "Membre titulaire"
      },
      "organesRefs": [
        "PO215413"
      ]
    },
    {
      "uid": "PM677455",
      "acteurRef": "PA610125",
      "legislature": "14",
      "typeOrgane": "COMNL",
      "dateDebut": "2012-07-26T02:00:00.000+02:00",
      "datePublication": "2012-07-27T02:00:00.000+02:00",
      "dateFin": "2015-01-14T01:00:00.000+01:00",
      "preseance": "16",
      "nominPrincipale": "1",
      "infosQualite": {
        "codeQualite": "Secrétaire",
        "libQualite": "Secrétaire",
        "libQualiteSex": "Secrétaire"
      },
      "organesRefs": [
        "PO420375"
      ]
    },
    {
      "uid": "PM678845",
      "acteurRef": "PA610125",
      "legislature": "14",
      "typeOrgane": "CMP",
      "dateDebut": "2012-10-02T02:00:00.000+02:00",
      "datePublication": "2012-10-03T02:00:00.000+02:00",
      "dateFin": "2012-10-15T02:00:00.000+02:00",
      "preseance": "28",
      "nominPrincipale": "1",
      "infosQualite": {
        "codeQualite": "Suppléant",
        "libQualite": "Membre suppléant",
        "libQualiteSex": "Membre suppléant"
      },
      "organesRefs": [
        "PO678619"
      ]
    },
    {
      "uid": "PM681787",
      "acteurRef": "PA610125",
      "legislature": "14",
      "typeOrgane": "GA",
      "dateDebut": "2012-10-16T02:00:00.000+02:00",
      "dateFin": "2017-06-20T02:00:00.000+02:00",
      "preseance": "20",
      "nominPrincipale": "1",
      "infosQualite": {
        "codeQualite": "Membre",
        "libQualite": "Membre",
        "libQualiteSex": "Membre"
      },
      "organesRefs": [
        "PO675764"
      ]
    },
    {
      "uid": "PM681788",
      "acteurRef": "PA610125",
      "legislature": "14",
      "typeOrgane": "GA",
      "dateDebut": "2012-10-16T02:00:00.000+02:00",
      "dateFin": "2017-06-20T02:00:00.000+02:00",
      "preseance": "20",
      "nominPrincipale": "1",
      "infosQualite": {
        "codeQualite": "Membre",
        "libQualite": "Membre",
        "libQualiteSex": "Membre"
      },
      "organesRefs": [
        "PO675762"
      ]
    },
    {
      "uid": "PM684554",
      "acteurRef": "PA610125",
      "legislature": "14",
      "typeOrgane": "GA",
      "dateDebut": "2012-11-15T01:00:00.000+01:00",
      "dateFin": "2017-06-20T02:00:00.000+02:00",
      "preseance": "8",
      "nominPrincipale": "1",
      "infosQualite": {
        "codeQualite": "Vice-Président",
        "libQualite": "Vice-Président",
        "libQualiteSex": "Vice-Président"
      },
      "organesRefs": [
        "PO675764"
      ]
    },
    {
      "uid": "PM684792",
      "acteurRef": "PA610125",
      "legislature": "14",
      "typeOrgane": "GA",
      "dateDebut": "2012-11-20T01:00:00.000+01:00",
      "dateFin": "2017-06-20T02:00:00.000+02:00",
      "preseance": "8",
      "nominPrincipale": "1",
      "infosQualite": {
        "codeQualite": "Vice-Président",
        "libQualite": "Vice-Président",
        "libQualiteSex": "Vice-Président"
      },
      "organesRefs": [
        "PO675762"
      ]
    },
    {
      "uid": "PM686044",
      "acteurRef": "PA610125",
      "typeOrgane": "PARPOL",
      "dateDebut": "2012-12-01T01:00:00.000+01:00",
      "dateFin": "2014-11-30T01:00:00.000+01:00",
      "preseance": "5",
      "nominPrincipale": "1",
      "infosQualite": {
        "codeQualite": "Membre",
        "libQualite": "Membre",
        "libQualiteSex": "Membre"
      },
      "organesRefs": [
        "PO684940"
      ]
    },
    {
      "uid": "PM699431",
      "acteurRef": "PA610125",
      "legislature": "14",
      "typeOrgane": "MISINFOPRE",
      "dateDebut": "2014-01-14T01:00:00.000+01:00",
      "datePublication": "2014-01-15T01:00:00.000+01:00",
      "dateFin": "2014-10-28T01:00:00.000+01:00",
      "preseance": "20",
      "nominPrincipale": "1",
      "infosQualite": {
        "codeQualite": "Membre",
        "libQualite": "Membre",
        "libQualiteSex": "Membre"
      },
      "organesRefs": [
        "PO699419"
      ]
    },
    {
      "uid": "PM699741",
      "acteurRef": "PA610125",
      "legislature": "14",
      "typeOrgane": "MISINFOPRE",
      "dateDebut": "2014-01-22T01:00:00.000+01:00",
      "datePublication": "2014-01-23T01:00:00.000+01:00",
      "dateFin": "2014-10-28T01:00:00.000+01:00",
      "preseance": "1",
      "nominPrincipale": "1",
      "infosQualite": {
        "codeQualite": "Président",
        "libQualite": "Président",
        "libQualiteSex": "Président"
      },
      "organesRefs": [
        "PO699419"
      ]
    },
    {
      "uid": "PM701524",
      "acteurRef": "PA610125",
      "legislature": "14",
      "typeOrgane": "MISINFOPRE",
      "dateDebut": "2014-05-23T02:00:00.000+02:00",
      "datePublication": "2014-05-24T02:00:00.000+02:00",
      "dateFin": "2014-10-02T02:00:00.000+02:00",
      "preseance": "20",
      "nominPrincipale": "1",
      "infosQualite": {
        "codeQualite": "Membre",
        "libQualite": "Membre",
        "libQualiteSex": "Membre"
      },
      "organesRefs": [
        "PO701489"
      ]
    },
    {
      "uid": "PM702165",
      "acteurRef": "PA610125",
      "legislature": "14",
      "typeOrgane": "CNPS",
      "dateDebut": "2014-07-03T02:00:00.000+02:00",
      "datePublication": "2014-07-03T02:00:00.000+02:00",
      "dateFin": "2014-12-19T01:00:00.000+01:00",
      "preseance": "20",
      "nominPrincipale": "1",
      "infosQualite": {
        "codeQualite": "Membre",
        "libQualite": "Membre",
        "libQualiteSex": "Membre"
      },
      "organesRefs": [
        "PO702090"
      ]
    },
    {
      "uid": "PM703120",
      "acteurRef": "PA610125",
      "legislature": "14",
      "typeOrgane": "GE",
      "dateDebut": "2014-09-09T02:00:00.000+02:00",
      "dateFin": "2017-06-20T02:00:00.000+02:00",
      "preseance": "20",
      "nominPrincipale": "1",
      "infosQualite": {
        "codeQualite": "Membre",
        "libQualite": "Membre",
        "libQualiteSex": "Membre"
      },
      "organesRefs": [
        "PO702209"
      ]
    },
    {
      "uid": "PM703185",
      "acteurRef": "PA610125",
      "legislature": "14",
      "typeOrgane": "GE",
      "dateDebut": "2014-09-17T02:00:00.000+02:00",
      "dateFin": "2017-06-20T02:00:00.000+02:00",
      "preseance": "8",
      "nominPrincipale": "1",
      "infosQualite": {
        "codeQualite": "Vice-Président",
        "libQualite": "Vice-Président",
        "libQualiteSex": "Vice-Président"
      },
      "organesRefs": [
        "PO702209"
      ]
    },
    {
      "uid": "PM704553",
      "acteurRef": "PA610125",
      "legislature": "14",
      "typeOrgane": "COMPER",
      "dateDebut": "2014-11-07T01:00:00.000+01:00",
      "datePublication": "2014-11-07T01:00:00.000+01:00",
      "dateFin": "2014-11-10T01:00:00.000+01:00",
      "preseance": "32",
      "nominPrincipale": "1",
      "infosQualite": {
        "codeQualite": "Membre",
        "libQualite": "Membre",
        "libQualiteSex": "Membre"
      },
      "organesRefs": [
        "PO59051"
      ]
    },
    {
      "uid": "PM704581",
      "acteurRef": "PA610125",
      "legislature": "14",
      "typeOrgane": "COMPER",
      "dateDebut": "2014-11-11T01:00:00.000+01:00",
      "datePublication": "2014-11-11T01:00:00.000+01:00",
      "dateFin": "2014-11-13T01:00:00.000+01:00",
      "preseance": "32",
      "nominPrincipale": "1",
      "infosQualite": {
        "codeQualite": "Membre",
        "libQualite": "Membre",
        "libQualiteSex": "Membre"
      },
      "organesRefs": [
        "PO419865"
      ]
    },
    {
      "uid": "PM704586",
      "acteurRef": "PA610125",
      "legislature": "14",
      "typeOrgane": "COMPER",
      "dateDebut": "2014-11-13T01:00:00.000+01:00",
      "datePublication": "2014-11-13T01:00:00.000+01:00",
      "dateFin": "2014-11-27T01:00:00.000+01:00",
      "preseance": "32",
      "nominPrincipale": "1",
      "infosQualite": {
        "codeQualite": "Membre",
        "libQualite": "Membre",
        "libQualiteSex": "Membre"
      },
      "organesRefs": [
        "PO59051"
      ]
    },
    {
      "uid": "PM704797",
      "acteurRef": "PA610125",
      "legislature": "14",
      "typeOrgane": "COMPER",
      "dateDebut": "2014-11-28T01:00:00.000+01:00",
      "datePublication": "2014-11-28T01:00:00.000+01:00",
      "dateFin": "2015-12-08T01:00:00.000+01:00",
      "preseance": "32",
      "nominPrincipale": "1",
      "infosQualite": {
        "codeQualite": "Membre",
        "libQualite": "Membre",
        "libQualiteSex": "Membre"
      },
      "organesRefs": [
        "PO419865"
      ]
    },
    {
      "uid": "PM705095",
      "acteurRef": "PA610125",
      "typeOrgane": "PARPOL",
      "dateDebut": "2014-12-01T01:00:00.000+01:00",
      "dateFin": "2017-06-20T02:00:00.000+02:00",
      "preseance": "5",
      "nominPrincipale": "1",
      "infosQualite": {
        "codeQualite": "Membre",
        "libQualite": "Membre",
        "libQualiteSex": "Membre"
      },
      "organesRefs": [
        "PO685872"
      ]
    },
    {
      "uid": "PM705212",
      "acteurRef": "PA610125",
      "legislature": "14",
      "typeOrgane": "MISINFOCOM",
      "dateDebut": "2014-12-03T01:00:00.000+01:00",
      "dateFin": "2015-09-30T02:00:00.000+02:00",
      "preseance": "20",
      "nominPrincipale": "1",
      "infosQualite": {
        "codeQualite": "Membre",
        "libQualite": "Membre",
        "libQualiteSex": "Membre"
      },
      "organesRefs": [
        "PO705203"
      ]
    },
    {
      "uid": "PM705384",
      "acteurRef": "PA610125",
      "legislature": "14",
      "typeOrgane": "CNPS",
      "dateDebut": "2014-12-13T01:00:00.000+01:00",
      "datePublication": "2014-12-13T01:00:00.000+01:00",
      "dateFin": "2015-08-07T02:00:00.000+02:00",
      "preseance": "20",
      "nominPrincipale": "1",
      "infosQualite": {
        "codeQualite": "Membre",
        "libQualite": "Membre",
        "libQualiteSex": "Membre"
      },
      "organesRefs": [
        "PO704848"
      ]
    },
    {
      "uid": "PM706241",
      "acteurRef": "PA610125",
      "legislature": "14",
      "typeOrgane": "COMNL",
      "dateDebut": "2015-01-22T01:00:00.000+01:00",
      "datePublication": "2015-02-10T01:00:00.000+01:00",
      "dateFin": "2017-06-20T02:00:00.000+02:00",
      "preseance": "16",
      "nominPrincipale": "1",
      "infosQualite": {
        "codeQualite": "Secrétaire",
        "libQualite": "Secrétaire",
        "libQualiteSex": "Secrétaire"
      },
      "organesRefs": [
        "PO420375"
      ]
    },
    {
      "uid": "PM709685",
      "acteurRef": "PA610125",
      "legislature": "14",
      "typeOrgane": "MISINFOCOM",
      "dateDebut": "2015-10-15T02:00:00.000+02:00",
      "datePublication": "2015-10-15T02:00:00.000+02:00",
      "dateFin": "2017-02-20T01:00:00.000+01:00",
      "preseance": "20",
      "nominPrincipale": "1",
      "infosQualite": {
        "codeQualite": "Membre",
        "libQualite": "Membre",
        "libQualiteSex": "Membre"
      },
      "organesRefs": [
        "PO709614"
      ]
    },
    {
      "uid": "PM710662",
      "acteurRef": "PA610125",
      "legislature": "14",
      "typeOrgane": "GP",
      "dateDebut": "2015-12-08T01:00:00.000+01:00",
      "datePublication": "2015-12-08T01:00:00.000+01:00",
      "dateFin": "2017-06-20T02:00:00.000+02:00",
      "preseance": "28",
      "nominPrincipale": "1",
      "infosQualite": {
        "codeQualite": "Député non-inscrit",
        "libQualite": "Député non-inscrit",
        "libQualiteSex": "Député non-inscrit"
      },
      "organesRefs": [
        "PO645633"
      ]
    },
    {
      "uid": "PM710664",
      "acteurRef": "PA610125",
      "legislature": "14",
      "typeOrgane": "COMPER",
      "dateDebut": "2015-12-09T01:00:00.000+01:00",
      "datePublication": "2015-12-09T01:00:00.000+01:00",
      "dateFin": "2017-06-20T02:00:00.000+02:00",
      "preseance": "32",
      "nominPrincipale": "1",
      "infosQualite": {
        "codeQualite": "Membre",
        "libQualite": "Membre",
        "libQualiteSex": "Membre"
      },
      "organesRefs": [
        "PO59048"
      ]
    },
    {
      "uid": "PM712800",
      "acteurRef": "PA610125",
      "legislature": "14",
      "typeOrgane": "GE",
      "dateDebut": "2016-05-12T02:00:00.000+02:00",
      "dateFin": "2017-06-20T02:00:00.000+02:00",
      "preseance": "20",
      "nominPrincipale": "0",
      "infosQualite": {
        "codeQualite": "Membre",
        "libQualite": "Membre",
        "libQualiteSex": "Membre"
      },
      "organesRefs": [
        "PO712794"
      ]
    },
    {
      "uid": "PM712801",
      "acteurRef": "PA610125",
      "legislature": "14",
      "typeOrgane": "GE",
      "dateDebut": "2016-05-12T02:00:00.000+02:00",
      "dateFin": "2017-06-20T02:00:00.000+02:00",
      "preseance": "4",
      "nominPrincipale": "1",
      "infosQualite": {
        "codeQualite": "Co-Président",
        "libQualite": "Co-Président",
        "libQualiteSex": "Co-Président"
      },
      "organesRefs": [
        "PO712794"
      ]
    }
  ]
}