{
  "uid": "PO405441",
  "codeType": "CMP",
  "libelle": "Commission mixte paritaire chargée de proposer un texte sur les dispositions restant en discussion du projet de loi pour le développement de la concurrence au service des consommateurs",
  "libelleEdition": "chargée de proposer un texte sur les dispositions restant en discussion du projet de loi pour le développement de la concurrence au service des consommateurs",
  "libelleAbrege": "développement de la concurrence au service des consommateurs",
  "libelleAbrev": "351",
  "viMoDe": {
    "dateDebut": "2007-12-14T01:00:00.000+01:00",
    "dateFin": "2007-12-26T01:00:00.000+01:00"
  },
  "regime": "5ème République",
  "legislature": "13",
  "secretariat": {}
}