{
  "uid": "PA720438",
  "etatCivil": {
    "ident": {
      "civ": "M.",
      "prenom": "Christophe",
      "nom": "Di Pompeo",
      "alpha": "DiPompeo",
      "trigramme": "CDI"
    },
    "infoNaissance": {
      "dateNais": "1964-07-15T01:00:00.000+01:00",
      "villeNais": "Hautmont",
      "depNais": "Nord",
      "paysNais": "France"
    }
  },
  "profession": {
    "libelleCourant": "Professeur de faculté",
    "socProcInsee": {
      "catSocPro": "Cadres de la fonction publique, professions intellectuelles et  artistiques",
      "famSocPro": "Cadres et professions intellectuelles supérieures"
    }
  },
  "uriHatvp": "https://www.hatvp.fr/pages_nominatives/di-pompeo-christophe",
  "adresses": [
    {
      "xsiType": "AdressePostale_Type",
      "uid": "AD720440",
      "type": "0",
      "typeLibelle": "Adresse officielle",
      "poids": "1",
      "intitule": "Assemblée nationale,",
      "numeroRue": "126",
      "nomRue": "Rue de l'Université,",
      "codePostal": "75355",
      "ville": "Paris 07 SP"
    },
    {
      "xsiType": "AdresseMail_Type",
      "uid": "AD728147",
      "type": "15",
      "typeLibelle": "Mèl",
      "valElec": "christophe.dipompeo@assemblee-nationale.fr"
    },
    {
      "xsiType": "AdresseSiteWeb_Type",
      "uid": "AD728426",
      "type": "24",
      "typeLibelle": "Twitter",
      "valElec": "@DipompeoChrist"
    },
    {
      "xsiType": "AdresseMail_Type",
      "uid": "AD728946",
      "type": "15",
      "typeLibelle": "Mèl",
      "valElec": "Christophe@dipompeo.org"
    },
    {
      "xsiType": "AdresseTelephonique_Type",
      "uid": "AD757837",
      "type": "11",
      "typeLibelle": "Téléphone",
      "poids": "1",
      "adresseDeRattachement": "AD720440",
      "valElec": "07.69.94.98.90"
    }
  ],
  "mandats": [
    {
      "uid": "PM722964",
      "acteurRef": "PA720438",
      "legislature": "15",
      "typeOrgane": "ASSEMBLEE",
      "dateDebut": "2017-06-18T02:00:00.000+02:00",
      "preseance": "50",
      "nominPrincipale": "1",
      "infosQualite": {
        "codeQualite": "membre",
        "libQualite": "membre",
        "libQualiteSex": "membre"
      },
      "organesRefs": [
        "PO717460"
      ],
      "suppleant": {
        "dateDebut": "2017-06-18T02:00:00.000+02:00",
        "suppleantRef": "PA720442"
      },
      "election": {
        "lieu": {
          "region": "Hauts-de-France",
          "regionType": "Métropolitain",
          "departement": "Nord",
          "numDepartement": "59",
          "numCirco": "3"
        },
        "causeMandat": "élections générales",
        "refCirconscription": "PO717978"
      },
      "mandature": {
        "datePriseFonction": "2017-06-21T02:00:00.000+02:00",
        "premiereElection": "0",
        "placeHemicycle": "553"
      },
      "collaborateurs": [
        {
          "qualite": "M.",
          "prenom": "Rui",
          "nom": "Antunes"
        },
        {
          "qualite": "Mme",
          "prenom": "Layla",
          "nom": "Imoula"
        },
        {
          "qualite": "Mme",
          "prenom": "Joëlle",
          "nom": "Tornotti-Bouttefeux"
        },
        {
          "qualite": "Mme",
          "prenom": "Dey",
          "nom": "Muteba"
        },
        {
          "qualite": "Mme",
          "prenom": "Géraldine",
          "nom": "Geay"
        }
      ]
    },
    {
      "uid": "PM724523",
      "acteurRef": "PA720438",
      "legislature": "15",
      "typeOrgane": "GP",
      "dateDebut": "2017-06-21T02:00:00.000+02:00",
      "dateFin": "2017-06-26T02:00:00.000+02:00",
      "preseance": "28",
      "nominPrincipale": "1",
      "infosQualite": {
        "codeQualite": "Député non-inscrit",
        "libQualite": "Député non-inscrit",
        "libQualiteSex": "Député non-inscrit"
      },
      "organesRefs": [
        "PO723569"
      ]
    },
    {
      "uid": "PM731138",
      "acteurRef": "PA720438",
      "legislature": "15",
      "typeOrgane": "GP",
      "dateDebut": "2017-06-27T02:00:00.000+02:00",
      "datePublication": "2017-06-28T02:00:00.000+02:00",
      "preseance": "20",
      "nominPrincipale": "1",
      "infosQualite": {
        "codeQualite": "Membre",
        "libQualite": "Membre du",
        "libQualiteSex": "Membre du"
      },
      "organesRefs": [
        "PO730964"
      ]
    },
    {
      "uid": "PM732094",
      "acteurRef": "PA720438",
      "legislature": "15",
      "typeOrgane": "COMPER",
      "dateDebut": "2017-06-29T02:00:00.000+02:00",
      "datePublication": "2017-06-29T02:00:00.000+02:00",
      "preseance": "32",
      "nominPrincipale": "1",
      "infosQualite": {
        "codeQualite": "Membre",
        "libQualite": "Membre",
        "libQualiteSex": "Membre"
      },
      "organesRefs": [
        "PO59047"
      ]
    },
    {
      "uid": "PM735348",
      "acteurRef": "PA720438",
      "legislature": "15",
      "typeOrgane": "GA",
      "dateDebut": "2017-09-26T02:00:00.000+02:00",
      "preseance": "20",
      "nominPrincipale": "0",
      "infosQualite": {
        "codeQualite": "Membre",
        "libQualite": "Membre",
        "libQualiteSex": "Membre"
      },
      "organesRefs": [
        "PO733057"
      ]
    },
    {
      "uid": "PM735349",
      "acteurRef": "PA720438",
      "legislature": "15",
      "typeOrgane": "GA",
      "dateDebut": "2017-09-26T02:00:00.000+02:00",
      "preseance": "1",
      "nominPrincipale": "1",
      "infosQualite": {
        "codeQualite": "Président",
        "libQualite": "Président",
        "libQualiteSex": "Président"
      },
      "organesRefs": [
        "PO733057"
      ]
    },
    {
      "uid": "PM736746",
      "acteurRef": "PA720438",
      "legislature": "15",
      "typeOrgane": "GA",
      "dateDebut": "2017-10-02T02:00:00.000+02:00",
      "preseance": "20",
      "nominPrincipale": "1",
      "infosQualite": {
        "codeQualite": "Membre",
        "libQualite": "Membre",
        "libQualiteSex": "Membre"
      },
      "organesRefs": [
        "PO733117"
      ]
    },
    {
      "uid": "PM736747",
      "acteurRef": "PA720438",
      "legislature": "15",
      "typeOrgane": "GA",
      "dateDebut": "2017-10-02T02:00:00.000+02:00",
      "preseance": "20",
      "nominPrincipale": "1",
      "infosQualite": {
        "codeQualite": "Membre",
        "libQualite": "Membre",
        "libQualiteSex": "Membre"
      },
      "organesRefs": [
        "PO733307"
      ]
    },
    {
      "uid": "PM736748",
      "acteurRef": "PA720438",
      "legislature": "15",
      "typeOrgane": "GA",
      "dateDebut": "2017-10-02T02:00:00.000+02:00",
      "preseance": "20",
      "nominPrincipale": "0",
      "infosQualite": {
        "codeQualite": "Membre",
        "libQualite": "Membre",
        "libQualiteSex": "Membre"
      },
      "organesRefs": [
        "PO733342"
      ]
    },
    {
      "uid": "PM736749",
      "acteurRef": "PA720438",
      "legislature": "15",
      "typeOrgane": "GA",
      "dateDebut": "2017-10-02T02:00:00.000+02:00",
      "preseance": "20",
      "nominPrincipale": "0",
      "infosQualite": {
        "codeQualite": "Membre",
        "libQualite": "Membre",
        "libQualiteSex": "Membre"
      },
      "organesRefs": [
        "PO733407"
      ]
    },
    {
      "uid": "PM736750",
      "acteurRef": "PA720438",
      "legislature": "15",
      "typeOrgane": "GA",
      "dateDebut": "2017-10-02T02:00:00.000+02:00",
      "preseance": "20",
      "nominPrincipale": "1",
      "infosQualite": {
        "codeQualite": "Membre",
        "libQualite": "Membre",
        "libQualiteSex": "Membre"
      },
      "organesRefs": [
        "PO733472"
      ]
    },
    {
      "uid": "PM736751",
      "acteurRef": "PA720438",
      "legislature": "15",
      "typeOrgane": "GA",
      "dateDebut": "2017-10-02T02:00:00.000+02:00",
      "preseance": "20",
      "nominPrincipale": "1",
      "infosQualite": {
        "codeQualite": "Membre",
        "libQualite": "Membre",
        "libQualiteSex": "Membre"
      },
      "organesRefs": [
        "PO733567"
      ]
    },
    {
      "uid": "PM736752",
      "acteurRef": "PA720438",
      "legislature": "15",
      "typeOrgane": "GA",
      "dateDebut": "2017-10-02T02:00:00.000+02:00",
      "preseance": "20",
      "nominPrincipale": "1",
      "infosQualite": {
        "codeQualite": "Membre",
        "libQualite": "Membre",
        "libQualiteSex": "Membre"
      },
      "organesRefs": [
        "PO733597"
      ]
    },
    {
      "uid": "PM736753",
      "acteurRef": "PA720438",
      "legislature": "15",
      "typeOrgane": "GA",
      "dateDebut": "2017-10-02T02:00:00.000+02:00",
      "preseance": "20",
      "nominPrincipale": "1",
      "infosQualite": {
        "codeQualite": "Membre",
        "libQualite": "Membre",
        "libQualiteSex": "Membre"
      },
      "organesRefs": [
        "PO733637"
      ]
    },
    {
      "uid": "PM736754",
      "acteurRef": "PA720438",
      "legislature": "15",
      "typeOrgane": "GA",
      "dateDebut": "2017-10-02T02:00:00.000+02:00",
      "preseance": "20",
      "nominPrincipale": "1",
      "infosQualite": {
        "codeQualite": "Membre",
        "libQualite": "Membre",
        "libQualiteSex": "Membre"
      },
      "organesRefs": [
        "PO733647"
      ]
    },
    {
      "uid": "PM736755",
      "acteurRef": "PA720438",
      "legislature": "15",
      "typeOrgane": "GEVI",
      "dateDebut": "2017-10-02T02:00:00.000+02:00",
      "preseance": "20",
      "nominPrincipale": "0",
      "infosQualite": {
        "codeQualite": "Membre",
        "libQualite": "Membre",
        "libQualiteSex": "Membre"
      },
      "organesRefs": [
        "PO733217"
      ]
    },
    {
      "uid": "PM742627",
      "acteurRef": "PA720438",
      "legislature": "15",
      "typeOrgane": "GEVI",
      "dateDebut": "2017-11-08T01:00:00.000+01:00",
      "dateFin": "2017-11-08T01:00:00.000+01:00",
      "preseance": "8",
      "nominPrincipale": "1",
      "infosQualite": {
        "codeQualite": "Vice-Président",
        "libQualite": "Vice-Président",
        "libQualiteSex": "Vice-Président"
      },
      "organesRefs": [
        "PO733217"
      ]
    },
    {
      "uid": "PM742640",
      "acteurRef": "PA720438",
      "legislature": "15",
      "typeOrgane": "GEVI",
      "dateDebut": "2017-11-08T01:00:00.000+01:00",
      "preseance": "14",
      "nominPrincipale": "1",
      "infosQualite": {
        "codeQualite": "Secrétaire",
        "libQualite": "Secrétaire",
        "libQualiteSex": "Secrétaire"
      },
      "organesRefs": [
        "PO733217"
      ]
    },
    {
      "uid": "PM742927",
      "acteurRef": "PA720438",
      "legislature": "15",
      "typeOrgane": "GA",
      "dateDebut": "2017-11-09T01:00:00.000+01:00",
      "preseance": "14",
      "nominPrincipale": "1",
      "infosQualite": {
        "codeQualite": "Secrétaire",
        "libQualite": "Secrétaire",
        "libQualiteSex": "Secrétaire"
      },
      "organesRefs": [
        "PO733342"
      ]
    },
    {
      "uid": "PM745025",
      "acteurRef": "PA720438",
      "typeOrgane": "PARPOL",
      "dateDebut": "2017-12-01T01:00:00.000+01:00",
      "preseance": "5",
      "nominPrincipale": "1",
      "infosQualite": {
        "codeQualite": "Membre",
        "libQualite": "Membre",
        "libQualiteSex": "Membre"
      },
      "organesRefs": [
        "PO744854"
      ]
    },
    {
      "uid": "PM746128",
      "acteurRef": "PA720438",
      "legislature": "15",
      "typeOrgane": "GA",
      "dateDebut": "2017-12-07T01:00:00.000+01:00",
      "preseance": "14",
      "nominPrincipale": "1",
      "infosQualite": {
        "codeQualite": "Secrétaire",
        "libQualite": "Secrétaire",
        "libQualiteSex": "Secrétaire"
      },
      "organesRefs": [
        "PO733407"
      ]
    },
    {
      "uid": "PM748615",
      "acteurRef": "PA720438",
      "legislature": "15",
      "typeOrgane": "GE",
      "dateDebut": "2018-02-01T01:00:00.000+01:00",
      "preseance": "20",
      "nominPrincipale": "0",
      "infosQualite": {
        "codeQualite": "Membre",
        "libQualite": "Membre",
        "libQualiteSex": "Membre"
      },
      "organesRefs": [
        "PO747067"
      ]
    },
    {
      "uid": "PM748616",
      "acteurRef": "PA720438",
      "legislature": "15",
      "typeOrgane": "GE",
      "dateDebut": "2018-02-01T01:00:00.000+01:00",
      "preseance": "1",
      "nominPrincipale": "1",
      "infosQualite": {
        "codeQualite": "Président",
        "libQualite": "Président",
        "libQualiteSex": "Président"
      },
      "organesRefs": [
        "PO747067"
      ]
    },
    {
      "uid": "PM750816",
      "acteurRef": "PA720438",
      "legislature": "15",
      "typeOrgane": "GE",
      "dateDebut": "2018-02-14T01:00:00.000+01:00",
      "preseance": "20",
      "nominPrincipale": "1",
      "infosQualite": {
        "codeQualite": "Membre",
        "libQualite": "Membre",
        "libQualiteSex": "Membre"
      },
      "organesRefs": [
        "PO747190"
      ]
    },
    {
      "uid": "PM751508",
      "acteurRef": "PA720438",
      "legislature": "15",
      "typeOrgane": "GE",
      "dateDebut": "2018-02-21T01:00:00.000+01:00",
      "preseance": "20",
      "nominPrincipale": "1",
      "infosQualite": {
        "codeQualite": "Membre",
        "libQualite": "Membre",
        "libQualiteSex": "Membre"
      },
      "organesRefs": [
        "PO746837"
      ]
    },
    {
      "uid": "PM751769",
      "acteurRef": "PA720438",
      "legislature": "15",
      "typeOrgane": "GE",
      "dateDebut": "2018-02-22T01:00:00.000+01:00",
      "preseance": "20",
      "nominPrincipale": "1",
      "infosQualite": {
        "codeQualite": "Membre",
        "libQualite": "Membre",
        "libQualiteSex": "Membre"
      },
      "organesRefs": [
        "PO746920"
      ]
    },
    {
      "uid": "PM751969",
      "acteurRef": "PA720438",
      "legislature": "15",
      "typeOrgane": "GE",
      "dateDebut": "2018-02-23T01:00:00.000+01:00",
      "preseance": "20",
      "nominPrincipale": "1",
      "infosQualite": {
        "codeQualite": "Membre",
        "libQualite": "Membre",
        "libQualiteSex": "Membre"
      },
      "organesRefs": [
        "PO746925"
      ]
    },
    {
      "uid": "PM752511",
      "acteurRef": "PA720438",
      "legislature": "15",
      "typeOrgane": "GE",
      "dateDebut": "2018-02-16T01:00:00.000+01:00",
      "preseance": "20",
      "nominPrincipale": "1",
      "infosQualite": {
        "codeQualite": "Membre",
        "libQualite": "Membre",
        "libQualiteSex": "Membre"
      },
      "organesRefs": [
        "PO746763"
      ]
    },
    {
      "uid": "PM752859",
      "acteurRef": "PA720438",
      "legislature": "15",
      "typeOrgane": "GE",
      "dateDebut": "2018-03-08T01:00:00.000+01:00",
      "preseance": "20",
      "nominPrincipale": "1",
      "infosQualite": {
        "codeQualite": "Membre",
        "libQualite": "Membre",
        "libQualiteSex": "Membre"
      },
      "organesRefs": [
        "PO746791"
      ]
    },
    {
      "uid": "PM752937",
      "acteurRef": "PA720438",
      "legislature": "15",
      "typeOrgane": "CNPE",
      "dateDebut": "2018-03-09T01:00:00.000+01:00",
      "datePublication": "2018-03-09T01:00:00.000+01:00",
      "dateFin": "2018-07-19T02:00:00.000+02:00",
      "preseance": "20",
      "nominPrincipale": "1",
      "infosQualite": {
        "codeQualite": "Membre",
        "libQualite": "Membre",
        "libQualiteSex": "Membre"
      },
      "organesRefs": [
        "PO751337"
      ]
    },
    {
      "uid": "PM753241",
      "acteurRef": "PA720438",
      "legislature": "15",
      "typeOrgane": "GE",
      "dateDebut": "2018-03-09T01:00:00.000+01:00",
      "preseance": "20",
      "nominPrincipale": "1",
      "infosQualite": {
        "codeQualite": "Membre",
        "libQualite": "Membre",
        "libQualiteSex": "Membre"
      },
      "organesRefs": [
        "PO747135"
      ]
    },
    {
      "uid": "PM756994",
      "acteurRef": "PA720438",
      "legislature": "15",
      "typeOrgane": "ORGEXTPARL",
      "dateDebut": "2018-03-08T01:00:00.000+01:00",
      "datePublication": "2018-03-09T01:00:00.000+01:00",
      "preseance": "20",
      "nominPrincipale": "1",
      "infosQualite": {
        "codeQualite": "Titulaire",
        "libQualite": "Membre titulaire",
        "libQualiteSex": "Membre titulaire"
      },
      "organesRefs": [
        "PO756933"
      ]
    },
    {
      "uid": "PM761204",
      "acteurRef": "PA720438",
      "legislature": "15",
      "typeOrgane": "GEVI",
      "dateDebut": "2018-12-21T01:00:00.000+01:00",
      "preseance": "20",
      "nominPrincipale": "1",
      "infosQualite": {
        "codeQualite": "Membre",
        "libQualite": "Membre",
        "libQualiteSex": "Membre"
      },
      "organesRefs": [
        "PO733622"
      ]
    }
  ]
}