{
  "uid": "PO713391",
  "codeType": "CMP",
  "libelle": "Commission mixte paritaire chargée de proposer un texte sur les dispositions restant en discussion du projet de loi de modernisation de la justice du XXIème siècle",
  "libelleEdition": "de la commission mixte paritaire chargée de proposer un texte sur les dispositions restant en discussion du projet de loi de modernisation de la justice du XXIème siècle",
  "libelleAbrege": "Modernisation de la justice du XXIème siècle",
  "libelleAbrev": "3204",
  "viMoDe": {
    "dateDebut": "2016-05-24T02:00:00.000+02:00",
    "dateFin": "2016-06-29T02:00:00.000+02:00"
  },
  "regime": "5ème République",
  "legislature": "14",
  "secretariat": {}
}