{
  "uid": "PA643053",
  "etatCivil": {
    "ident": {
      "civ": "M.",
      "prenom": "Yannick",
      "nom": "Trigance",
      "alpha": "Trigance"
    },
    "infoNaissance": {
      "dateNais": "1962-07-13T01:00:00.000+01:00",
      "villeNais": "Boulogne-Billancourt",
      "depNais": "Hauts-de-Seine",
      "paysNais": "France"
    }
  },
  "profession": {
    "libelleCourant": "Directeur général adjoint de collectivité locale",
    "socProcInsee": {
      "catSocPro": "Cadres de la fonction publique, professions intellectuelles et  artistiques",
      "famSocPro": "Cadres et professions intellectuelles supérieures"
    }
  },
  "adresses": [
    {
      "xsiType": "AdressePostale_Type",
      "uid": "AD716366",
      "type": "0",
      "typeLibelle": "Adresse officielle",
      "poids": "1",
      "intitule": "Assemblée nationale",
      "numeroRue": "126",
      "nomRue": "Rue de l'Université,",
      "codePostal": "75355",
      "ville": "Paris 07 SP"
    },
    {
      "xsiType": "AdressePostale_Type",
      "uid": "AD716373",
      "type": "2",
      "typeLibelle": "Adresse publiée de circonscription",
      "poids": "22",
      "intitule": "Permanence parlementaire",
      "numeroRue": "19/21",
      "nomRue": "Avenue de la République",
      "codePostal": "93800",
      "ville": "Épinay-sur-Seine"
    },
    {
      "xsiType": "AdresseTelephonique_Type",
      "uid": "AD716375",
      "type": "11",
      "typeLibelle": "Téléphone",
      "poids": "22",
      "adresseDeRattachement": "AD716373",
      "valElec": "01 42 35 47 31"
    },
    {
      "xsiType": "AdressePostale_Type",
      "uid": "AD716377",
      "type": "2",
      "typeLibelle": "Adresse publiée de circonscription",
      "poids": "23",
      "intitule": "Permanence parlementaire",
      "numeroRue": "19",
      "nomRue": "Rue Charles Schmidt",
      "codePostal": "93400",
      "ville": "Saint-Ouen"
    },
    {
      "xsiType": "AdresseMail_Type",
      "uid": "AD716381",
      "type": "15",
      "typeLibelle": "Mèl",
      "valElec": "ytrigance@assemblee-nationale.fr"
    }
  ],
  "mandats": [
    {
      "uid": "PM716363",
      "acteurRef": "PA643053",
      "legislature": "14",
      "typeOrgane": "ASSEMBLEE",
      "dateDebut": "2012-06-20T02:00:00.000+02:00",
      "dateFin": "2017-04-21T02:00:00.000+02:00",
      "preseance": "50",
      "nominPrincipale": "1",
      "infosQualite": {
        "codeQualite": "membre",
        "libQualite": "membre",
        "libQualiteSex": "membre"
      },
      "organesRefs": [
        "PO644420"
      ],
      "election": {
        "lieu": {
          "region": "Ile-de-France",
          "regionType": "Métropolitain",
          "departement": "Seine-Saint-Denis",
          "numDepartement": "93",
          "numCirco": "1"
        },
        "causeMandat": "remplacement d'un député nommé au Gouvernement",
        "refCirconscription": "PO644942"
      },
      "mandature": {
        "datePriseFonction": "2017-01-07T01:00:00.000+01:00",
        "causeFin": "Reprise de l'exercice du mandat d'un ancien membre du Gouvernement",
        "premiereElection": "0"
      }
    },
    {
      "uid": "PM716364",
      "acteurRef": "PA643053",
      "legislature": "14",
      "typeOrgane": "GP",
      "dateDebut": "2017-01-07T01:00:00.000+01:00",
      "dateFin": "2017-01-09T01:00:00.000+01:00",
      "preseance": "28",
      "nominPrincipale": "1",
      "infosQualite": {
        "codeQualite": "Député non-inscrit",
        "libQualite": "Député non-inscrit",
        "libQualiteSex": "Député non-inscrit"
      },
      "organesRefs": [
        "PO645633"
      ]
    },
    {
      "uid": "PM716383",
      "acteurRef": "PA643053",
      "legislature": "14",
      "typeOrgane": "GP",
      "dateDebut": "2017-01-10T01:00:00.000+01:00",
      "datePublication": "2017-01-10T01:00:00.000+01:00",
      "dateFin": "2017-04-21T02:00:00.000+02:00",
      "preseance": "20",
      "nominPrincipale": "1",
      "infosQualite": {
        "codeQualite": "Membre",
        "libQualite": "Membre du",
        "libQualiteSex": "Membre du"
      },
      "organesRefs": [
        "PO713077"
      ]
    },
    {
      "uid": "PM716384",
      "acteurRef": "PA643053",
      "legislature": "14",
      "typeOrgane": "COMPER",
      "dateDebut": "2017-01-10T01:00:00.000+01:00",
      "datePublication": "2017-01-10T01:00:00.000+01:00",
      "dateFin": "2017-04-21T02:00:00.000+02:00",
      "preseance": "32",
      "nominPrincipale": "1",
      "infosQualite": {
        "codeQualite": "Membre",
        "libQualite": "Membre",
        "libQualiteSex": "Membre"
      },
      "organesRefs": [
        "PO419604"
      ]
    },
    {
      "uid": "PM716400",
      "acteurRef": "PA643053",
      "legislature": "14",
      "typeOrgane": "GE",
      "dateDebut": "2017-01-11T01:00:00.000+01:00",
      "dateFin": "2017-04-21T02:00:00.000+02:00",
      "preseance": "20",
      "nominPrincipale": "1",
      "infosQualite": {
        "codeQualite": "Membre",
        "libQualite": "Membre",
        "libQualiteSex": "Membre"
      },
      "organesRefs": [
        "PO686802"
      ]
    },
    {
      "uid": "PM716458",
      "acteurRef": "PA643053",
      "legislature": "14",
      "typeOrgane": "GE",
      "dateDebut": "2017-01-12T01:00:00.000+01:00",
      "dateFin": "2017-04-21T02:00:00.000+02:00",
      "preseance": "20",
      "nominPrincipale": "1",
      "infosQualite": {
        "codeQualite": "Membre",
        "libQualite": "Membre",
        "libQualiteSex": "Membre"
      },
      "organesRefs": [
        "PO712100"
      ]
    }
  ]
}