{
  "uid": "PA2473",
  "etatCivil": {
    "ident": {
      "civ": "M.",
      "prenom": "Jean-Luc",
      "nom": "Préel",
      "alpha": "Preel"
    },
    "infoNaissance": {
      "dateNais": "1940-10-30T02:00:00.000+02:00",
      "villeNais": "Caen",
      "depNais": "Calvados",
      "paysNais": "France"
    },
    "dateDeces": "2015-09-03T02:00:00.000+02:00"
  },
  "profession": {
    "libelleCourant": "Chef de service hospitalier",
    "socProcInsee": {
      "catSocPro": "Professions libérales et assimilés",
      "famSocPro": "Cadres et professions intellectuelles supérieures"
    }
  },
  "adresses": [
    {
      "xsiType": "AdressePostale_Type",
      "uid": "AD46824",
      "type": "2",
      "typeLibelle": "Adresse publiée de circonscription",
      "poids": "21",
      "numeroRue": "3",
      "nomRue": "Place Napoléon,",
      "codePostal": "85000",
      "ville": "La Roche-sur-Yon"
    },
    {
      "xsiType": "AdresseTelephonique_Type",
      "uid": "AD48368",
      "type": "11",
      "typeLibelle": "Téléphone",
      "poids": "21",
      "adresseDeRattachement": "AD46824",
      "valElec": "02 51 37 87 70"
    },
    {
      "xsiType": "AdresseTelephonique_Type",
      "uid": "AD49916",
      "type": "12",
      "typeLibelle": "Télécopie",
      "poids": "21",
      "adresseDeRattachement": "AD46824",
      "valElec": "02 51 62 74 34"
    },
    {
      "xsiType": "AdressePostale_Type",
      "uid": "AD387054",
      "type": "0",
      "typeLibelle": "Adresse officielle",
      "poids": "1",
      "intitule": "Assemblée nationale,",
      "numeroRue": "126",
      "nomRue": "Rue de l'Université,",
      "codePostal": "75355",
      "ville": "Paris 07 SP"
    }
  ],
  "mandats": [
    {
      "uid": "PM386474",
      "acteurRef": "PA2473",
      "legislature": "13",
      "typeOrgane": "ASSEMBLEE",
      "dateDebut": "2007-06-20T02:00:00.000+02:00",
      "dateFin": "2012-06-19T02:00:00.000+02:00",
      "preseance": "50",
      "nominPrincipale": "1",
      "infosQualite": {
        "codeQualite": "membre",
        "libQualite": "membre",
        "libQualiteSex": "membre"
      },
      "organesRefs": [
        "PO384266"
      ],
      "suppleant": {
        "dateDebut": "2007-06-20T02:00:00.000+02:00",
        "dateFin": "2012-06-19T02:00:00.000+02:00",
        "suppleantRef": "PA266833"
      },
      "election": {
        "lieu": {
          "region": "Pays de la Loire",
          "regionType": "Métropolitain",
          "departement": "Vendée",
          "numDepartement": "85",
          "numCirco": "1"
        },
        "causeMandat": "élections générales",
        "refCirconscription": "PO384743"
      },
      "mandature": {
        "datePriseFonction": "2007-06-20T02:00:00.000+02:00",
        "causeFin": "Fin de législature",
        "premiereElection": "1"
      }
    },
    {
      "uid": "PM387633",
      "acteurRef": "PA2473",
      "legislature": "13",
      "typeOrgane": "GP",
      "dateDebut": "2007-06-20T02:00:00.000+02:00",
      "dateFin": "2007-06-26T02:00:00.000+02:00",
      "preseance": "28",
      "nominPrincipale": "1",
      "infosQualite": {
        "codeQualite": "Député non-inscrit",
        "libQualite": "Député non-inscrit",
        "libQualiteSex": "Député non-inscrit"
      },
      "organesRefs": [
        "PO387155"
      ]
    },
    {
      "uid": "PM389656",
      "acteurRef": "PA2473",
      "legislature": "13",
      "typeOrgane": "GP",
      "dateDebut": "2007-06-27T02:00:00.000+02:00",
      "datePublication": "2007-06-27T02:00:00.000+02:00",
      "dateFin": "2012-06-19T02:00:00.000+02:00",
      "preseance": "20",
      "nominPrincipale": "1",
      "infosQualite": {
        "codeQualite": "Membre",
        "libQualite": "Membre du",
        "libQualiteSex": "Membre du"
      },
      "organesRefs": [
        "PO389639"
      ]
    },
    {
      "uid": "PM390551",
      "acteurRef": "PA2473",
      "legislature": "13",
      "typeOrgane": "COMPER",
      "dateDebut": "2007-06-27T02:00:00.000+02:00",
      "datePublication": "2007-06-28T02:00:00.000+02:00",
      "dateFin": "2009-06-30T02:00:00.000+02:00",
      "preseance": "32",
      "nominPrincipale": "1",
      "infosQualite": {
        "codeQualite": "Membre",
        "libQualite": "Membre",
        "libQualiteSex": "Membre"
      },
      "organesRefs": [
        "PO59045"
      ]
    },
    {
      "uid": "PM391066",
      "acteurRef": "PA2473",
      "legislature": "13",
      "typeOrgane": "COMPER",
      "dateDebut": "2007-06-28T02:00:00.000+02:00",
      "datePublication": "2007-06-29T02:00:00.000+02:00",
      "dateFin": "2009-06-30T02:00:00.000+02:00",
      "preseance": "8",
      "nominPrincipale": "1",
      "infosQualite": {
        "codeQualite": "Vice-Président",
        "libQualite": "Vice-président",
        "libQualiteSex": "Vice-président"
      },
      "organesRefs": [
        "PO59045"
      ]
    },
    {
      "uid": "PM393721",
      "acteurRef": "PA2473",
      "legislature": "13",
      "typeOrgane": "OFFPAR",
      "dateDebut": "2007-07-25T02:00:00.000+02:00",
      "datePublication": "2007-07-25T02:00:00.000+02:00",
      "dateFin": "2009-06-15T02:00:00.000+02:00",
      "preseance": "24",
      "nominPrincipale": "1",
      "infosQualite": {
        "codeQualite": "Membre",
        "libQualite": "Membre",
        "libQualiteSex": "Membre"
      },
      "organesRefs": [
        "PO288529"
      ]
    },
    {
      "uid": "PM393908",
      "acteurRef": "PA2473",
      "legislature": "13",
      "typeOrgane": "MISINFO",
      "dateDebut": "2007-07-11T02:00:00.000+02:00",
      "dateFin": "2012-06-19T02:00:00.000+02:00",
      "preseance": "10",
      "nominPrincipale": "1",
      "infosQualite": {
        "codeQualite": "Membre",
        "libQualite": "Membre",
        "libQualiteSex": "Membre"
      },
      "organesRefs": [
        "PO393884"
      ]
    },
    {
      "uid": "PM394582",
      "acteurRef": "PA2473",
      "legislature": "13",
      "typeOrgane": "ORGEXTPARL",
      "dateDebut": "2007-08-01T02:00:00.000+02:00",
      "datePublication": "2007-08-02T02:00:00.000+02:00",
      "dateFin": "2011-12-21T01:00:00.000+01:00",
      "preseance": "20",
      "nominPrincipale": "1",
      "infosQualite": {
        "codeQualite": "Titulaire",
        "libQualite": "Membre titulaire",
        "libQualiteSex": "Membre titulaire"
      },
      "organesRefs": [
        "PO60289"
      ]
    },
    {
      "uid": "PM394586",
      "acteurRef": "PA2473",
      "legislature": "13",
      "typeOrgane": "ORGEXTPARL",
      "dateDebut": "2007-08-01T02:00:00.000+02:00",
      "datePublication": "2007-08-02T02:00:00.000+02:00",
      "dateFin": "2011-12-21T01:00:00.000+01:00",
      "preseance": "20",
      "nominPrincipale": "1",
      "infosQualite": {
        "codeQualite": "Titulaire",
        "libQualite": "Membre titulaire",
        "libQualiteSex": "Membre titulaire"
      },
      "organesRefs": [
        "PO60287"
      ]
    },
    {
      "uid": "PM394798",
      "acteurRef": "PA2473",
      "legislature": "13",
      "typeOrgane": "ORGEXTPARL",
      "dateDebut": "2007-08-10T02:00:00.000+02:00",
      "datePublication": "2007-08-11T02:00:00.000+02:00",
      "dateFin": "2012-06-19T02:00:00.000+02:00",
      "preseance": "20",
      "nominPrincipale": "1",
      "infosQualite": {
        "codeQualite": "Titulaire",
        "libQualite": "Membre titulaire",
        "libQualiteSex": "Membre titulaire"
      },
      "organesRefs": [
        "PO215413"
      ]
    },
    {
      "uid": "PM403783",
      "acteurRef": "PA2473",
      "legislature": "13",
      "typeOrgane": "CMP",
      "dateDebut": "2007-11-16T01:00:00.000+01:00",
      "datePublication": "2007-11-17T01:00:00.000+01:00",
      "dateFin": "2007-11-23T01:00:00.000+01:00",
      "preseance": "28",
      "nominPrincipale": "1",
      "infosQualite": {
        "codeQualite": "Suppléant",
        "libQualite": "Membre suppléant",
        "libQualiteSex": "Membre suppléant"
      },
      "organesRefs": [
        "PO403765"
      ]
    },
    {
      "uid": "PM404172",
      "acteurRef": "PA2473",
      "legislature": "13",
      "typeOrgane": "GA",
      "dateDebut": "2007-11-27T01:00:00.000+01:00",
      "dateFin": "2012-06-19T02:00:00.000+02:00",
      "preseance": "20",
      "nominPrincipale": "1",
      "infosQualite": {
        "codeQualite": "Membre",
        "libQualite": "Membre",
        "libQualiteSex": "Membre"
      },
      "organesRefs": [
        "PO392995"
      ]
    },
    {
      "uid": "PM404173",
      "acteurRef": "PA2473",
      "legislature": "13",
      "typeOrgane": "GA",
      "dateDebut": "2007-11-27T01:00:00.000+01:00",
      "dateFin": "2012-06-19T02:00:00.000+02:00",
      "preseance": "20",
      "nominPrincipale": "0",
      "infosQualite": {
        "codeQualite": "Membre",
        "libQualite": "Membre",
        "libQualiteSex": "Membre"
      },
      "organesRefs": [
        "PO393075"
      ]
    },
    {
      "uid": "PM404174",
      "acteurRef": "PA2473",
      "legislature": "13",
      "typeOrgane": "GA",
      "dateDebut": "2007-11-27T01:00:00.000+01:00",
      "dateFin": "2012-06-19T02:00:00.000+02:00",
      "preseance": "20",
      "nominPrincipale": "1",
      "infosQualite": {
        "codeQualite": "Membre",
        "libQualite": "Membre",
        "libQualiteSex": "Membre"
      },
      "organesRefs": [
        "PO393333"
      ]
    },
    {
      "uid": "PM404175",
      "acteurRef": "PA2473",
      "legislature": "13",
      "typeOrgane": "GEVI",
      "dateDebut": "2007-11-27T01:00:00.000+01:00",
      "dateFin": "2012-06-19T02:00:00.000+02:00",
      "preseance": "20",
      "nominPrincipale": "1",
      "infosQualite": {
        "codeQualite": "Membre",
        "libQualite": "Membre",
        "libQualiteSex": "Membre"
      },
      "organesRefs": [
        "PO393498"
      ]
    },
    {
      "uid": "PM404226",
      "acteurRef": "PA2473",
      "legislature": "13",
      "typeOrgane": "GA",
      "dateDebut": "2007-11-27T01:00:00.000+01:00",
      "dateFin": "2012-06-19T02:00:00.000+02:00",
      "preseance": "20",
      "nominPrincipale": "1",
      "infosQualite": {
        "codeQualite": "Membre",
        "libQualite": "Membre",
        "libQualiteSex": "Membre"
      },
      "organesRefs": [
        "PO392674"
      ]
    },
    {
      "uid": "PM404227",
      "acteurRef": "PA2473",
      "legislature": "13",
      "typeOrgane": "GA",
      "dateDebut": "2007-11-27T01:00:00.000+01:00",
      "dateFin": "2012-06-19T02:00:00.000+02:00",
      "preseance": "20",
      "nominPrincipale": "1",
      "infosQualite": {
        "codeQualite": "Membre",
        "libQualite": "Membre",
        "libQualiteSex": "Membre"
      },
      "organesRefs": [
        "PO392694"
      ]
    },
    {
      "uid": "PM404228",
      "acteurRef": "PA2473",
      "legislature": "13",
      "typeOrgane": "GA",
      "dateDebut": "2007-11-27T01:00:00.000+01:00",
      "dateFin": "2012-06-19T02:00:00.000+02:00",
      "preseance": "20",
      "nominPrincipale": "1",
      "infosQualite": {
        "codeQualite": "Membre",
        "libQualite": "Membre",
        "libQualiteSex": "Membre"
      },
      "organesRefs": [
        "PO392750"
      ]
    },
    {
      "uid": "PM404229",
      "acteurRef": "PA2473",
      "legislature": "13",
      "typeOrgane": "GA",
      "dateDebut": "2007-11-27T01:00:00.000+01:00",
      "dateFin": "2012-06-19T02:00:00.000+02:00",
      "preseance": "20",
      "nominPrincipale": "1",
      "infosQualite": {
        "codeQualite": "Membre",
        "libQualite": "Membre",
        "libQualiteSex": "Membre"
      },
      "organesRefs": [
        "PO392785"
      ]
    },
    {
      "uid": "PM404230",
      "acteurRef": "PA2473",
      "legislature": "13",
      "typeOrgane": "GA",
      "dateDebut": "2007-11-27T01:00:00.000+01:00",
      "dateFin": "2012-06-19T02:00:00.000+02:00",
      "preseance": "20",
      "nominPrincipale": "1",
      "infosQualite": {
        "codeQualite": "Membre",
        "libQualite": "Membre",
        "libQualiteSex": "Membre"
      },
      "organesRefs": [
        "PO392820"
      ]
    },
    {
      "uid": "PM404231",
      "acteurRef": "PA2473",
      "legislature": "13",
      "typeOrgane": "GA",
      "dateDebut": "2007-11-27T01:00:00.000+01:00",
      "dateFin": "2012-06-19T02:00:00.000+02:00",
      "preseance": "20",
      "nominPrincipale": "1",
      "infosQualite": {
        "codeQualite": "Membre",
        "libQualite": "Membre",
        "libQualiteSex": "Membre"
      },
      "organesRefs": [
        "PO392900"
      ]
    },
    {
      "uid": "PM404232",
      "acteurRef": "PA2473",
      "legislature": "13",
      "typeOrgane": "GA",
      "dateDebut": "2007-11-27T01:00:00.000+01:00",
      "dateFin": "2012-06-19T02:00:00.000+02:00",
      "preseance": "20",
      "nominPrincipale": "1",
      "infosQualite": {
        "codeQualite": "Membre",
        "libQualite": "Membre",
        "libQualiteSex": "Membre"
      },
      "organesRefs": [
        "PO392915"
      ]
    },
    {
      "uid": "PM404233",
      "acteurRef": "PA2473",
      "legislature": "13",
      "typeOrgane": "GA",
      "dateDebut": "2007-11-27T01:00:00.000+01:00",
      "dateFin": "2012-06-19T02:00:00.000+02:00",
      "preseance": "20",
      "nominPrincipale": "1",
      "infosQualite": {
        "codeQualite": "Membre",
        "libQualite": "Membre",
        "libQualiteSex": "Membre"
      },
      "organesRefs": [
        "PO392940"
      ]
    },
    {
      "uid": "PM404234",
      "acteurRef": "PA2473",
      "legislature": "13",
      "typeOrgane": "GA",
      "dateDebut": "2007-11-27T01:00:00.000+01:00",
      "dateFin": "2012-06-19T02:00:00.000+02:00",
      "preseance": "20",
      "nominPrincipale": "1",
      "infosQualite": {
        "codeQualite": "Membre",
        "libQualite": "Membre",
        "libQualiteSex": "Membre"
      },
      "organesRefs": [
        "PO392950"
      ]
    },
    {
      "uid": "PM404235",
      "acteurRef": "PA2473",
      "legislature": "13",
      "typeOrgane": "GA",
      "dateDebut": "2007-11-27T01:00:00.000+01:00",
      "dateFin": "2012-06-19T02:00:00.000+02:00",
      "preseance": "20",
      "nominPrincipale": "1",
      "infosQualite": {
        "codeQualite": "Membre",
        "libQualite": "Membre",
        "libQualiteSex": "Membre"
      },
      "organesRefs": [
        "PO393070"
      ]
    },
    {
      "uid": "PM404236",
      "acteurRef": "PA2473",
      "legislature": "13",
      "typeOrgane": "GA",
      "dateDebut": "2007-11-27T01:00:00.000+01:00",
      "dateFin": "2012-06-19T02:00:00.000+02:00",
      "preseance": "20",
      "nominPrincipale": "1",
      "infosQualite": {
        "codeQualite": "Membre",
        "libQualite": "Membre",
        "libQualiteSex": "Membre"
      },
      "organesRefs": [
        "PO393161"
      ]
    },
    {
      "uid": "PM404237",
      "acteurRef": "PA2473",
      "legislature": "13",
      "typeOrgane": "GA",
      "dateDebut": "2007-11-27T01:00:00.000+01:00",
      "dateFin": "2012-06-19T02:00:00.000+02:00",
      "preseance": "20",
      "nominPrincipale": "1",
      "infosQualite": {
        "codeQualite": "Membre",
        "libQualite": "Membre",
        "libQualiteSex": "Membre"
      },
      "organesRefs": [
        "PO393167"
      ]
    },
    {
      "uid": "PM404238",
      "acteurRef": "PA2473",
      "legislature": "13",
      "typeOrgane": "GA",
      "dateDebut": "2007-11-27T01:00:00.000+01:00",
      "dateFin": "2012-06-19T02:00:00.000+02:00",
      "preseance": "20",
      "nominPrincipale": "1",
      "infosQualite": {
        "codeQualite": "Membre",
        "libQualite": "Membre",
        "libQualiteSex": "Membre"
      },
      "organesRefs": [
        "PO393192"
      ]
    },
    {
      "uid": "PM404239",
      "acteurRef": "PA2473",
      "legislature": "13",
      "typeOrgane": "GA",
      "dateDebut": "2007-11-27T01:00:00.000+01:00",
      "dateFin": "2012-06-19T02:00:00.000+02:00",
      "preseance": "20",
      "nominPrincipale": "1",
      "infosQualite": {
        "codeQualite": "Membre",
        "libQualite": "Membre",
        "libQualiteSex": "Membre"
      },
      "organesRefs": [
        "PO393197"
      ]
    },
    {
      "uid": "PM404240",
      "acteurRef": "PA2473",
      "legislature": "13",
      "typeOrgane": "GA",
      "dateDebut": "2007-11-27T01:00:00.000+01:00",
      "dateFin": "2012-06-19T02:00:00.000+02:00",
      "preseance": "20",
      "nominPrincipale": "1",
      "infosQualite": {
        "codeQualite": "Membre",
        "libQualite": "Membre",
        "libQualiteSex": "Membre"
      },
      "organesRefs": [
        "PO393207"
      ]
    },
    {
      "uid": "PM404241",
      "acteurRef": "PA2473",
      "legislature": "13",
      "typeOrgane": "GA",
      "dateDebut": "2007-11-27T01:00:00.000+01:00",
      "dateFin": "2012-06-19T02:00:00.000+02:00",
      "preseance": "20",
      "nominPrincipale": "1",
      "infosQualite": {
        "codeQualite": "Membre",
        "libQualite": "Membre",
        "libQualiteSex": "Membre"
      },
      "organesRefs": [
        "PO393263"
      ]
    },
    {
      "uid": "PM404242",
      "acteurRef": "PA2473",
      "legislature": "13",
      "typeOrgane": "GA",
      "dateDebut": "2007-11-27T01:00:00.000+01:00",
      "dateFin": "2012-06-19T02:00:00.000+02:00",
      "preseance": "20",
      "nominPrincipale": "1",
      "infosQualite": {
        "codeQualite": "Membre",
        "libQualite": "Membre",
        "libQualiteSex": "Membre"
      },
      "organesRefs": [
        "PO393308"
      ]
    },
    {
      "uid": "PM404243",
      "acteurRef": "PA2473",
      "legislature": "13",
      "typeOrgane": "GA",
      "dateDebut": "2007-11-27T01:00:00.000+01:00",
      "dateFin": "2012-06-19T02:00:00.000+02:00",
      "preseance": "20",
      "nominPrincipale": "1",
      "infosQualite": {
        "codeQualite": "Membre",
        "libQualite": "Membre",
        "libQualiteSex": "Membre"
      },
      "organesRefs": [
        "PO393338"
      ]
    },
    {
      "uid": "PM404244",
      "acteurRef": "PA2473",
      "legislature": "13",
      "typeOrgane": "GA",
      "dateDebut": "2007-11-27T01:00:00.000+01:00",
      "dateFin": "2012-06-19T02:00:00.000+02:00",
      "preseance": "20",
      "nominPrincipale": "1",
      "infosQualite": {
        "codeQualite": "Membre",
        "libQualite": "Membre",
        "libQualiteSex": "Membre"
      },
      "organesRefs": [
        "PO393368"
      ]
    },
    {
      "uid": "PM404853",
      "acteurRef": "PA2473",
      "legislature": "13",
      "typeOrgane": "GA",
      "dateDebut": "2007-11-27T01:00:00.000+01:00",
      "dateFin": "2012-06-19T02:00:00.000+02:00",
      "preseance": "8",
      "nominPrincipale": "1",
      "infosQualite": {
        "codeQualite": "Vice-Président",
        "libQualite": "Vice-Président",
        "libQualiteSex": "Vice-Président"
      },
      "organesRefs": [
        "PO393075"
      ]
    },
    {
      "uid": "PM405055",
      "acteurRef": "PA2473",
      "legislature": "13",
      "typeOrgane": "GA",
      "dateDebut": "2007-12-10T01:00:00.000+01:00",
      "dateFin": "2012-06-19T02:00:00.000+02:00",
      "preseance": "8",
      "nominPrincipale": "1",
      "infosQualite": {
        "codeQualite": "Vice-Président",
        "libQualite": "Vice-Président",
        "libQualiteSex": "Vice-Président"
      },
      "organesRefs": [
        "PO392900"
      ]
    },
    {
      "uid": "PM405077",
      "acteurRef": "PA2473",
      "legislature": "13",
      "typeOrgane": "GA",
      "dateDebut": "2007-12-11T01:00:00.000+01:00",
      "dateFin": "2012-06-19T02:00:00.000+02:00",
      "preseance": "8",
      "nominPrincipale": "1",
      "infosQualite": {
        "codeQualite": "Vice-Président",
        "libQualite": "Vice-Président",
        "libQualiteSex": "Vice-Président"
      },
      "organesRefs": [
        "PO393308"
      ]
    },
    {
      "uid": "PM405209",
      "acteurRef": "PA2473",
      "legislature": "13",
      "typeOrgane": "GA",
      "dateDebut": "2007-12-11T01:00:00.000+01:00",
      "dateFin": "2012-06-19T02:00:00.000+02:00",
      "preseance": "8",
      "nominPrincipale": "1",
      "infosQualite": {
        "codeQualite": "Vice-Président",
        "libQualite": "Vice-Président",
        "libQualiteSex": "Vice-Président"
      },
      "organesRefs": [
        "PO392995"
      ]
    },
    {
      "uid": "PM405390",
      "acteurRef": "PA2473",
      "legislature": "13",
      "typeOrgane": "GA",
      "dateDebut": "2007-11-28T01:00:00.000+01:00",
      "dateFin": "2012-06-19T02:00:00.000+02:00",
      "preseance": "8",
      "nominPrincipale": "1",
      "infosQualite": {
        "codeQualite": "Vice-Président",
        "libQualite": "Vice-Président",
        "libQualiteSex": "Vice-Président"
      },
      "organesRefs": [
        "PO393338"
      ]
    },
    {
      "uid": "PM406089",
      "acteurRef": "PA2473",
      "legislature": "13",
      "typeOrgane": "GA",
      "dateDebut": "2007-12-18T01:00:00.000+01:00",
      "dateFin": "2012-06-19T02:00:00.000+02:00",
      "preseance": "8",
      "nominPrincipale": "1",
      "infosQualite": {
        "codeQualite": "Vice-Président",
        "libQualite": "Vice-Président",
        "libQualiteSex": "Vice-Président"
      },
      "organesRefs": [
        "PO392915"
      ]
    },
    {
      "uid": "PM406481",
      "acteurRef": "PA2473",
      "legislature": "13",
      "typeOrgane": "GE",
      "dateDebut": "2008-01-09T01:00:00.000+01:00",
      "dateFin": "2012-06-19T02:00:00.000+02:00",
      "preseance": "20",
      "nominPrincipale": "1",
      "infosQualite": {
        "codeQualite": "Membre",
        "libQualite": "Membre",
        "libQualiteSex": "Membre"
      },
      "organesRefs": [
        "PO402734"
      ]
    },
    {
      "uid": "PM407317",
      "acteurRef": "PA2473",
      "legislature": "13",
      "typeOrgane": "GE",
      "dateDebut": "2008-01-20T01:00:00.000+01:00",
      "dateFin": "2012-06-19T02:00:00.000+02:00",
      "preseance": "20",
      "nominPrincipale": "1",
      "infosQualite": {
        "codeQualite": "Membre",
        "libQualite": "Membre",
        "libQualiteSex": "Membre"
      },
      "organesRefs": [
        "PO403045"
      ]
    },
    {
      "uid": "PM407811",
      "acteurRef": "PA2473",
      "legislature": "13",
      "typeOrgane": "GE",
      "dateDebut": "2008-01-30T01:00:00.000+01:00",
      "dateFin": "2012-06-19T02:00:00.000+02:00",
      "preseance": "20",
      "nominPrincipale": "1",
      "infosQualite": {
        "codeQualite": "Membre",
        "libQualite": "Membre",
        "libQualiteSex": "Membre"
      },
      "organesRefs": [
        "PO402850"
      ]
    },
    {
      "uid": "PM407840",
      "acteurRef": "PA2473",
      "legislature": "13",
      "typeOrgane": "GE",
      "dateDebut": "2008-01-22T01:00:00.000+01:00",
      "dateFin": "2012-06-19T02:00:00.000+02:00",
      "preseance": "20",
      "nominPrincipale": "1",
      "infosQualite": {
        "codeQualite": "Membre",
        "libQualite": "Membre",
        "libQualiteSex": "Membre"
      },
      "organesRefs": [
        "PO403033"
      ]
    },
    {
      "uid": "PM408371",
      "acteurRef": "PA2473",
      "legislature": "13",
      "typeOrgane": "GE",
      "dateDebut": "2008-02-07T01:00:00.000+01:00",
      "dateFin": "2012-06-19T02:00:00.000+02:00",
      "preseance": "20",
      "nominPrincipale": "1",
      "infosQualite": {
        "codeQualite": "Membre",
        "libQualite": "Membre",
        "libQualiteSex": "Membre"
      },
      "organesRefs": [
        "PO403178"
      ]
    },
    {
      "uid": "PM409986",
      "acteurRef": "PA2473",
      "legislature": "13",
      "typeOrgane": "GE",
      "dateDebut": "2008-01-20T01:00:00.000+01:00",
      "dateFin": "2012-06-19T02:00:00.000+02:00",
      "preseance": "20",
      "nominPrincipale": "1",
      "infosQualite": {
        "codeQualite": "Membre",
        "libQualite": "Membre",
        "libQualiteSex": "Membre"
      },
      "organesRefs": [
        "PO402802"
      ]
    },
    {
      "uid": "PM410937",
      "acteurRef": "PA2473",
      "legislature": "13",
      "typeOrgane": "GE",
      "dateDebut": "2008-01-15T01:00:00.000+01:00",
      "dateFin": "2012-06-19T02:00:00.000+02:00",
      "preseance": "20",
      "nominPrincipale": "1",
      "infosQualite": {
        "codeQualite": "Membre",
        "libQualite": "Membre",
        "libQualiteSex": "Membre"
      },
      "organesRefs": [
        "PO402919"
      ]
    },
    {
      "uid": "PM411723",
      "acteurRef": "PA2473",
      "legislature": "13",
      "typeOrgane": "GE",
      "dateDebut": "2007-12-19T01:00:00.000+01:00",
      "dateFin": "2012-06-19T02:00:00.000+02:00",
      "preseance": "20",
      "nominPrincipale": "1",
      "infosQualite": {
        "codeQualite": "Membre",
        "libQualite": "Membre",
        "libQualiteSex": "Membre"
      },
      "organesRefs": [
        "PO405818"
      ]
    },
    {
      "uid": "PM412253",
      "acteurRef": "PA2473",
      "legislature": "13",
      "typeOrgane": "GE",
      "dateDebut": "2008-04-10T02:00:00.000+02:00",
      "dateFin": "2012-06-19T02:00:00.000+02:00",
      "preseance": "20",
      "nominPrincipale": "1",
      "infosQualite": {
        "codeQualite": "Membre",
        "libQualite": "Membre",
        "libQualiteSex": "Membre"
      },
      "organesRefs": [
        "PO403208"
      ]
    },
    {
      "uid": "PM412452",
      "acteurRef": "PA2473",
      "legislature": "13",
      "typeOrgane": "GE",
      "dateDebut": "2008-02-05T01:00:00.000+01:00",
      "dateFin": "2012-06-19T02:00:00.000+02:00",
      "preseance": "20",
      "nominPrincipale": "1",
      "infosQualite": {
        "codeQualite": "Membre",
        "libQualite": "Membre",
        "libQualiteSex": "Membre"
      },
      "organesRefs": [
        "PO403172"
      ]
    },
    {
      "uid": "PM412675",
      "acteurRef": "PA2473",
      "legislature": "13",
      "typeOrgane": "GE",
      "dateDebut": "2008-04-16T02:00:00.000+02:00",
      "dateFin": "2012-06-19T02:00:00.000+02:00",
      "preseance": "20",
      "nominPrincipale": "0",
      "infosQualite": {
        "codeQualite": "Membre",
        "libQualite": "Membre",
        "libQualiteSex": "Membre"
      },
      "organesRefs": [
        "PO403003"
      ]
    },
    {
      "uid": "PM412682",
      "acteurRef": "PA2473",
      "legislature": "13",
      "typeOrgane": "GE",
      "dateDebut": "2008-04-16T02:00:00.000+02:00",
      "dateFin": "2012-06-19T02:00:00.000+02:00",
      "preseance": "8",
      "nominPrincipale": "1",
      "infosQualite": {
        "codeQualite": "Vice-Président",
        "libQualite": "Vice-Président",
        "libQualiteSex": "Vice-Président"
      },
      "organesRefs": [
        "PO403003"
      ]
    },
    {
      "uid": "PM414329",
      "acteurRef": "PA2473",
      "legislature": "13",
      "typeOrgane": "GE",
      "dateDebut": "2008-06-03T02:00:00.000+02:00",
      "dateFin": "2012-06-19T02:00:00.000+02:00",
      "preseance": "8",
      "nominPrincipale": "1",
      "infosQualite": {
        "codeQualite": "Vice-Président",
        "libQualite": "Vice-Président",
        "libQualiteSex": "Vice-Président"
      },
      "organesRefs": [
        "PO403178"
      ]
    },
    {
      "uid": "PM414659",
      "acteurRef": "PA2473",
      "legislature": "13",
      "typeOrgane": "MISINFOPRE",
      "dateDebut": "2008-07-09T02:00:00.000+02:00",
      "datePublication": "2008-07-10T02:00:00.000+02:00",
      "dateFin": "2010-01-22T01:00:00.000+01:00",
      "preseance": "20",
      "nominPrincipale": "1",
      "infosQualite": {
        "codeQualite": "Membre",
        "libQualite": "Membre",
        "libQualiteSex": "Membre"
      },
      "organesRefs": [
        "PO414626"
      ]
    },
    {
      "uid": "PM416503",
      "acteurRef": "PA2473",
      "legislature": "13",
      "typeOrgane": "GE",
      "dateDebut": "2008-10-27T01:00:00.000+01:00",
      "dateFin": "2012-06-19T02:00:00.000+02:00",
      "preseance": "20",
      "nominPrincipale": "0",
      "infosQualite": {
        "codeQualite": "Membre",
        "libQualite": "Membre",
        "libQualiteSex": "Membre"
      },
      "organesRefs": [
        "PO415344"
      ]
    },
    {
      "uid": "PM416504",
      "acteurRef": "PA2473",
      "legislature": "13",
      "typeOrgane": "GE",
      "dateDebut": "2008-10-27T01:00:00.000+01:00",
      "dateFin": "2012-06-19T02:00:00.000+02:00",
      "preseance": "4",
      "nominPrincipale": "1",
      "infosQualite": {
        "codeQualite": "Co-Président",
        "libQualite": "Co-Président",
        "libQualiteSex": "Co-Président"
      },
      "organesRefs": [
        "PO415344"
      ]
    },
    {
      "uid": "PM416720",
      "acteurRef": "PA2473",
      "legislature": "13",
      "typeOrgane": "CMP",
      "dateDebut": "2008-11-21T01:00:00.000+01:00",
      "datePublication": "2008-11-22T01:00:00.000+01:00",
      "dateFin": "2008-12-08T01:00:00.000+01:00",
      "preseance": "28",
      "nominPrincipale": "1",
      "infosQualite": {
        "codeQualite": "Suppléant",
        "libQualite": "Membre suppléant",
        "libQualiteSex": "Membre suppléant"
      },
      "organesRefs": [
        "PO416705"
      ]
    },
    {
      "uid": "PM419422",
      "acteurRef": "PA2473",
      "legislature": "13",
      "typeOrgane": "CMP",
      "dateDebut": "2009-06-08T02:00:00.000+02:00",
      "datePublication": "2009-06-11T02:00:00.000+02:00",
      "dateFin": "2009-07-01T02:00:00.000+02:00",
      "preseance": "28",
      "nominPrincipale": "1",
      "infosQualite": {
        "codeQualite": "Suppléant",
        "libQualite": "Membre suppléant",
        "libQualiteSex": "Membre suppléant"
      },
      "organesRefs": [
        "PO419397"
      ]
    },
    {
      "uid": "PM420604",
      "acteurRef": "PA2473",
      "legislature": "13",
      "typeOrgane": "COMPER",
      "dateDebut": "2009-07-01T02:00:00.000+02:00",
      "datePublication": "2009-07-01T02:00:00.000+02:00",
      "dateFin": "2012-06-19T02:00:00.000+02:00",
      "preseance": "32",
      "nominPrincipale": "0",
      "infosQualite": {
        "codeQualite": "Membre",
        "libQualite": "Membre",
        "libQualiteSex": "Membre"
      },
      "organesRefs": [
        "PO420120"
      ]
    },
    {
      "uid": "PM420860",
      "acteurRef": "PA2473",
      "legislature": "13",
      "typeOrgane": "COMPER",
      "dateDebut": "2009-07-01T02:00:00.000+02:00",
      "datePublication": "2009-07-02T02:00:00.000+02:00",
      "dateFin": "2012-06-19T02:00:00.000+02:00",
      "preseance": "8",
      "nominPrincipale": "1",
      "infosQualite": {
        "codeQualite": "Vice-Président",
        "libQualite": "Vice-président",
        "libQualiteSex": "Vice-président"
      },
      "organesRefs": [
        "PO420120"
      ]
    },
    {
      "uid": "PM422002",
      "acteurRef": "PA2473",
      "legislature": "13",
      "typeOrgane": "GE",
      "dateDebut": "2007-10-31T01:00:00.000+01:00",
      "dateFin": "2012-06-19T02:00:00.000+02:00",
      "preseance": "20",
      "nominPrincipale": "0",
      "infosQualite": {
        "codeQualite": "Membre",
        "libQualite": "Membre",
        "libQualiteSex": "Membre"
      },
      "organesRefs": [
        "PO403063"
      ]
    },
    {
      "uid": "PM422013",
      "acteurRef": "PA2473",
      "legislature": "13",
      "typeOrgane": "GE",
      "dateDebut": "2007-10-31T01:00:00.000+01:00",
      "dateFin": "2012-06-19T02:00:00.000+02:00",
      "preseance": "8",
      "nominPrincipale": "1",
      "infosQualite": {
        "codeQualite": "Vice-Président",
        "libQualite": "Vice-Président",
        "libQualiteSex": "Vice-Président"
      },
      "organesRefs": [
        "PO403063"
      ]
    },
    {
      "uid": "PM422315",
      "acteurRef": "PA2473",
      "legislature": "13",
      "typeOrgane": "CMP",
      "dateDebut": "2009-11-16T01:00:00.000+01:00",
      "datePublication": "2009-11-17T01:00:00.000+01:00",
      "dateFin": "2010-01-12T01:00:00.000+01:00",
      "preseance": "28",
      "nominPrincipale": "1",
      "infosQualite": {
        "codeQualite": "Suppléant",
        "libQualite": "Membre suppléant",
        "libQualiteSex": "Membre suppléant"
      },
      "organesRefs": [
        "PO422293"
      ]
    },
    {
      "uid": "PM423531",
      "acteurRef": "PA2473",
      "legislature": "13",
      "typeOrgane": "MISINFOPRE",
      "dateDebut": "2010-04-06T02:00:00.000+02:00",
      "datePublication": "2010-04-07T02:00:00.000+02:00",
      "dateFin": "2010-07-01T02:00:00.000+02:00",
      "preseance": "20",
      "nominPrincipale": "1",
      "infosQualite": {
        "codeQualite": "Membre",
        "libQualite": "Membre",
        "libQualiteSex": "Membre"
      },
      "organesRefs": [
        "PO423513"
      ]
    },
    {
      "uid": "PM423806",
      "acteurRef": "PA2473",
      "legislature": "13",
      "typeOrgane": "MISINFOPRE",
      "dateDebut": "2010-04-28T02:00:00.000+02:00",
      "datePublication": "2010-04-29T02:00:00.000+02:00",
      "dateFin": "2010-07-01T02:00:00.000+02:00",
      "preseance": "4",
      "nominPrincipale": "1",
      "infosQualite": {
        "codeQualite": "Vice-Président",
        "libQualite": "Vice-Président",
        "libQualiteSex": "Vice-Président"
      },
      "organesRefs": [
        "PO423513"
      ]
    },
    {
      "uid": "PM425392",
      "acteurRef": "PA2473",
      "legislature": "13",
      "typeOrgane": "CMP",
      "dateDebut": "2010-10-19T02:00:00.000+02:00",
      "datePublication": "2010-10-20T02:00:00.000+02:00",
      "dateFin": "2010-10-27T02:00:00.000+02:00",
      "preseance": "28",
      "nominPrincipale": "1",
      "infosQualite": {
        "codeQualite": "Suppléant",
        "libQualite": "Membre suppléant",
        "libQualiteSex": "Membre suppléant"
      },
      "organesRefs": [
        "PO425372"
      ]
    },
    {
      "uid": "PM425439",
      "acteurRef": "PA2473",
      "legislature": "13",
      "typeOrgane": "CMP",
      "dateDebut": "2010-10-22T02:00:00.000+02:00",
      "datePublication": "2010-10-23T02:00:00.000+02:00",
      "dateFin": "2010-10-28T02:00:00.000+02:00",
      "preseance": "28",
      "nominPrincipale": "1",
      "infosQualite": {
        "codeQualite": "Suppléant",
        "libQualite": "Membre suppléant",
        "libQualiteSex": "Membre suppléant"
      },
      "organesRefs": [
        "PO425421"
      ]
    },
    {
      "uid": "PM425675",
      "acteurRef": "PA2473",
      "legislature": "13",
      "typeOrgane": "CNPS",
      "dateDebut": "2010-11-10T01:00:00.000+01:00",
      "datePublication": "2010-11-11T01:00:00.000+01:00",
      "dateFin": "2011-06-23T02:00:00.000+02:00",
      "preseance": "20",
      "nominPrincipale": "1",
      "infosQualite": {
        "codeQualite": "Membre",
        "libQualite": "Membre",
        "libQualiteSex": "Membre"
      },
      "organesRefs": [
        "PO425550"
      ]
    },
    {
      "uid": "PM425826",
      "acteurRef": "PA2473",
      "legislature": "13",
      "typeOrgane": "CMP",
      "dateDebut": "2010-11-17T01:00:00.000+01:00",
      "datePublication": "2010-11-18T01:00:00.000+01:00",
      "dateFin": "2010-11-25T01:00:00.000+01:00",
      "preseance": "28",
      "nominPrincipale": "1",
      "infosQualite": {
        "codeQualite": "Suppléant",
        "libQualite": "Membre suppléant",
        "libQualiteSex": "Membre suppléant"
      },
      "organesRefs": [
        "PO425808"
      ]
    },
    {
      "uid": "PM428202",
      "acteurRef": "PA2473",
      "legislature": "13",
      "typeOrgane": "GE",
      "dateDebut": "2011-04-12T02:00:00.000+02:00",
      "dateFin": "2012-06-19T02:00:00.000+02:00",
      "preseance": "20",
      "nominPrincipale": "0",
      "infosQualite": {
        "codeQualite": "Membre",
        "libQualite": "Membre",
        "libQualiteSex": "Membre"
      },
      "organesRefs": [
        "PO426547"
      ]
    },
    {
      "uid": "PM428209",
      "acteurRef": "PA2473",
      "legislature": "13",
      "typeOrgane": "GE",
      "dateDebut": "2011-04-12T02:00:00.000+02:00",
      "dateFin": "2012-06-19T02:00:00.000+02:00",
      "preseance": "8",
      "nominPrincipale": "1",
      "infosQualite": {
        "codeQualite": "Vice-Président",
        "libQualite": "Vice-Président",
        "libQualiteSex": "Vice-Président"
      },
      "organesRefs": [
        "PO426547"
      ]
    },
    {
      "uid": "PM429523",
      "acteurRef": "PA2473",
      "legislature": "13",
      "typeOrgane": "CMP",
      "dateDebut": "2011-07-08T02:00:00.000+02:00",
      "datePublication": "2011-07-12T02:00:00.000+02:00",
      "dateFin": "2011-07-25T02:00:00.000+02:00",
      "preseance": "28",
      "nominPrincipale": "1",
      "infosQualite": {
        "codeQualite": "Suppléant",
        "libQualite": "Membre suppléant",
        "libQualiteSex": "Membre suppléant"
      },
      "organesRefs": [
        "PO429490"
      ]
    },
    {
      "uid": "PM430635",
      "acteurRef": "PA2473",
      "legislature": "13",
      "typeOrgane": "GE",
      "dateDebut": "2011-10-18T02:00:00.000+02:00",
      "dateFin": "2012-06-19T02:00:00.000+02:00",
      "preseance": "20",
      "nominPrincipale": "0",
      "infosQualite": {
        "codeQualite": "Membre",
        "libQualite": "Membre",
        "libQualiteSex": "Membre"
      },
      "organesRefs": [
        "PO429409"
      ]
    },
    {
      "uid": "PM430851",
      "acteurRef": "PA2473",
      "legislature": "13",
      "typeOrgane": "GE",
      "dateDebut": "2011-10-18T02:00:00.000+02:00",
      "dateFin": "2012-06-19T02:00:00.000+02:00",
      "preseance": "8",
      "nominPrincipale": "1",
      "infosQualite": {
        "codeQualite": "Vice-Président",
        "libQualite": "Vice-Président",
        "libQualiteSex": "Vice-Président"
      },
      "organesRefs": [
        "PO429409"
      ]
    },
    {
      "uid": "PM431041",
      "acteurRef": "PA2473",
      "legislature": "13",
      "typeOrgane": "CMP",
      "dateDebut": "2011-11-08T01:00:00.000+01:00",
      "datePublication": "2011-11-08T01:00:00.000+01:00",
      "dateFin": "2011-11-15T01:00:00.000+01:00",
      "preseance": "28",
      "nominPrincipale": "1",
      "infosQualite": {
        "codeQualite": "Suppléant",
        "libQualite": "Membre suppléant",
        "libQualiteSex": "Membre suppléant"
      },
      "organesRefs": [
        "PO430891"
      ]
    },
    {
      "uid": "PM431145",
      "acteurRef": "PA2473",
      "legislature": "13",
      "typeOrgane": "CMP",
      "dateDebut": "2011-11-15T01:00:00.000+01:00",
      "datePublication": "2011-11-16T01:00:00.000+01:00",
      "dateFin": "2011-11-16T01:00:00.000+01:00",
      "preseance": "28",
      "nominPrincipale": "1",
      "infosQualite": {
        "codeQualite": "Suppléant",
        "libQualite": "Membre suppléant",
        "libQualiteSex": "Membre suppléant"
      },
      "organesRefs": [
        "PO431110"
      ]
    }
  ]
}