{
  "uid": "PA719858",
  "etatCivil": {
    "ident": {
      "civ": "Mme",
      "prenom": "Monique",
      "nom": "Limon",
      "alpha": "Limon",
      "trigramme": "MLM"
    },
    "infoNaissance": {
      "dateNais": "1953-12-05T01:00:00.000+01:00",
      "villeNais": "Paris",
      "depNais": "Paris",
      "paysNais": "France"
    }
  },
  "profession": {
    "libelleCourant": "Retraitée Fonction publique territoriale",
    "socProcInsee": {
      "catSocPro": "Anciens cadres et professions intermédiaires",
      "famSocPro": "Retraités"
    }
  },
  "uriHatvp": "https://www.hatvp.fr/pages_nominatives/limon-monique",
  "adresses": [
    {
      "xsiType": "AdressePostale_Type",
      "uid": "AD719860",
      "type": "0",
      "typeLibelle": "Adresse officielle",
      "poids": "1",
      "intitule": "Assemblée nationale,",
      "numeroRue": "126",
      "nomRue": "Rue de l'Université,",
      "codePostal": "75355",
      "ville": "Paris 07 SP"
    },
    {
      "xsiType": "AdresseMail_Type",
      "uid": "AD728085",
      "type": "15",
      "typeLibelle": "Mèl",
      "valElec": "monique.limon@assemblee-nationale.fr"
    },
    {
      "xsiType": "AdresseSiteWeb_Type",
      "uid": "AD730627",
      "type": "22",
      "typeLibelle": "Site internet",
      "valElec": "www.monique-limon-deputee.fr/"
    },
    {
      "xsiType": "AdresseSiteWeb_Type",
      "uid": "AD730711",
      "type": "25",
      "typeLibelle": "Facebook",
      "valElec": "www.facebook.com/moniquelimonlegislatives2017/"
    }
  ],
  "mandats": [
    {
      "uid": "PM722782",
      "acteurRef": "PA719858",
      "legislature": "15",
      "typeOrgane": "ASSEMBLEE",
      "dateDebut": "2017-06-18T02:00:00.000+02:00",
      "preseance": "50",
      "nominPrincipale": "1",
      "infosQualite": {
        "codeQualite": "membre",
        "libQualite": "membre",
        "libQualiteSex": "membre"
      },
      "organesRefs": [
        "PO717460"
      ],
      "suppleant": {
        "dateDebut": "2017-06-18T02:00:00.000+02:00",
        "suppleantRef": "PA719862"
      },
      "election": {
        "lieu": {
          "region": "Auvergne-Rhône-Alpes",
          "regionType": "Métropolitain",
          "departement": "Isère",
          "numDepartement": "38",
          "numCirco": "7"
        },
        "causeMandat": "élections générales",
        "refCirconscription": "PO717798"
      },
      "mandature": {
        "datePriseFonction": "2017-06-21T02:00:00.000+02:00",
        "premiereElection": "0",
        "placeHemicycle": "382"
      },
      "collaborateurs": [
        {
          "qualite": "Mme",
          "prenom": "Pascale",
          "nom": "Pruvost"
        },
        {
          "qualite": "M.",
          "prenom": "Raphaël",
          "nom": "Gauthier"
        },
        {
          "qualite": "M.",
          "prenom": "Yenad",
          "nom": "Mlaraha"
        }
      ]
    },
    {
      "uid": "PM724432",
      "acteurRef": "PA719858",
      "legislature": "15",
      "typeOrgane": "GP",
      "dateDebut": "2017-06-21T02:00:00.000+02:00",
      "dateFin": "2017-06-26T02:00:00.000+02:00",
      "preseance": "28",
      "nominPrincipale": "1",
      "infosQualite": {
        "codeQualite": "Député non-inscrit",
        "libQualite": "Député non-inscrit",
        "libQualiteSex": "Députée non-inscrite"
      },
      "organesRefs": [
        "PO723569"
      ]
    },
    {
      "uid": "PM731088",
      "acteurRef": "PA719858",
      "legislature": "15",
      "typeOrgane": "GP",
      "dateDebut": "2017-06-27T02:00:00.000+02:00",
      "datePublication": "2017-06-28T02:00:00.000+02:00",
      "preseance": "20",
      "nominPrincipale": "1",
      "infosQualite": {
        "codeQualite": "Membre",
        "libQualite": "Membre du",
        "libQualiteSex": "Membre du"
      },
      "organesRefs": [
        "PO730964"
      ]
    },
    {
      "uid": "PM732162",
      "acteurRef": "PA719858",
      "legislature": "15",
      "typeOrgane": "COMPER",
      "dateDebut": "2017-06-29T02:00:00.000+02:00",
      "datePublication": "2017-06-29T02:00:00.000+02:00",
      "preseance": "32",
      "nominPrincipale": "1",
      "infosQualite": {
        "codeQualite": "Membre",
        "libQualite": "Membre",
        "libQualiteSex": "Membre"
      },
      "organesRefs": [
        "PO419610"
      ]
    },
    {
      "uid": "PM737303",
      "acteurRef": "PA719858",
      "legislature": "15",
      "typeOrgane": "GA",
      "dateDebut": "2017-10-04T02:00:00.000+02:00",
      "preseance": "20",
      "nominPrincipale": "1",
      "infosQualite": {
        "codeQualite": "Membre",
        "libQualite": "Membre",
        "libQualiteSex": "Membre"
      },
      "organesRefs": [
        "PO733057"
      ]
    },
    {
      "uid": "PM737304",
      "acteurRef": "PA719858",
      "legislature": "15",
      "typeOrgane": "GA",
      "dateDebut": "2017-10-04T02:00:00.000+02:00",
      "preseance": "20",
      "nominPrincipale": "1",
      "infosQualite": {
        "codeQualite": "Membre",
        "libQualite": "Membre",
        "libQualiteSex": "Membre"
      },
      "organesRefs": [
        "PO733607"
      ]
    },
    {
      "uid": "PM744750",
      "acteurRef": "PA719858",
      "legislature": "15",
      "typeOrgane": "CNPS",
      "dateDebut": "2017-12-06T01:00:00.000+01:00",
      "datePublication": "2017-12-06T01:00:00.000+01:00",
      "dateFin": "2018-07-31T02:00:00.000+02:00",
      "preseance": "20",
      "nominPrincipale": "1",
      "infosQualite": {
        "codeQualite": "Membre",
        "libQualite": "Membre",
        "libQualiteSex": "Membre"
      },
      "organesRefs": [
        "PO744107"
      ]
    },
    {
      "uid": "PM745265",
      "acteurRef": "PA719858",
      "typeOrgane": "PARPOL",
      "dateDebut": "2017-12-01T01:00:00.000+01:00",
      "preseance": "5",
      "nominPrincipale": "1",
      "infosQualite": {
        "codeQualite": "Membre",
        "libQualite": "Membre",
        "libQualiteSex": "Membre"
      },
      "organesRefs": [
        "PO744854"
      ]
    },
    {
      "uid": "PM747926",
      "acteurRef": "PA719858",
      "legislature": "15",
      "typeOrgane": "ORGEXTPARL",
      "dateDebut": "2018-01-10T01:00:00.000+01:00",
      "datePublication": "2018-01-11T01:00:00.000+01:00",
      "preseance": "20",
      "nominPrincipale": "1",
      "infosQualite": {
        "codeQualite": "Titulaire",
        "libQualite": "Membre titulaire",
        "libQualiteSex": "Membre titulaire"
      },
      "organesRefs": [
        "PO717436"
      ]
    },
    {
      "uid": "PM748465",
      "acteurRef": "PA719858",
      "legislature": "15",
      "typeOrgane": "GE",
      "dateDebut": "2018-02-01T01:00:00.000+01:00",
      "preseance": "20",
      "nominPrincipale": "0",
      "infosQualite": {
        "codeQualite": "Membre",
        "libQualite": "Membre",
        "libQualiteSex": "Membre"
      },
      "organesRefs": [
        "PO746618"
      ]
    },
    {
      "uid": "PM748466",
      "acteurRef": "PA719858",
      "legislature": "15",
      "typeOrgane": "GE",
      "dateDebut": "2018-02-01T01:00:00.000+01:00",
      "preseance": "4",
      "nominPrincipale": "1",
      "infosQualite": {
        "codeQualite": "Co-Président",
        "libQualite": "Co-Président",
        "libQualiteSex": "Co-Présidente"
      },
      "organesRefs": [
        "PO746618"
      ]
    },
    {
      "uid": "PM750967",
      "acteurRef": "PA719858",
      "legislature": "15",
      "typeOrgane": "GE",
      "dateDebut": "2018-02-19T01:00:00.000+01:00",
      "preseance": "20",
      "nominPrincipale": "1",
      "infosQualite": {
        "codeQualite": "Membre",
        "libQualite": "Membre",
        "libQualiteSex": "Membre"
      },
      "organesRefs": [
        "PO746880"
      ]
    },
    {
      "uid": "PM752326",
      "acteurRef": "PA719858",
      "legislature": "15",
      "typeOrgane": "GE",
      "dateDebut": "2018-03-05T01:00:00.000+01:00",
      "preseance": "20",
      "nominPrincipale": "1",
      "infosQualite": {
        "codeQualite": "Membre",
        "libQualite": "Membre",
        "libQualiteSex": "Membre"
      },
      "organesRefs": [
        "PO746806"
      ]
    },
    {
      "uid": "PM755435",
      "acteurRef": "PA719858",
      "legislature": "15",
      "typeOrgane": "CNPE",
      "dateDebut": "2018-04-14T02:00:00.000+02:00",
      "datePublication": "2018-04-14T02:00:00.000+02:00",
      "preseance": "20",
      "nominPrincipale": "1",
      "infosQualite": {
        "codeQualite": "Membre",
        "libQualite": "Membre",
        "libQualiteSex": "Membre"
      },
      "organesRefs": [
        "PO754360"
      ]
    },
    {
      "uid": "PM757588",
      "acteurRef": "PA719858",
      "legislature": "15",
      "typeOrgane": "MISINFOCOM",
      "dateDebut": "2018-07-04T02:00:00.000+02:00",
      "datePublication": "2018-07-05T02:00:00.000+02:00",
      "preseance": "20",
      "nominPrincipale": "1",
      "infosQualite": {
        "codeQualite": "Membre",
        "libQualite": "Membre",
        "libQualiteSex": "Membre"
      },
      "organesRefs": [
        "PO757572"
      ]
    },
    {
      "uid": "PM757598",
      "acteurRef": "PA719858",
      "legislature": "15",
      "typeOrgane": "CMP",
      "dateDebut": "2018-07-05T02:00:00.000+02:00",
      "datePublication": "2018-07-06T02:00:00.000+02:00",
      "preseance": "20",
      "nominPrincipale": "1",
      "infosQualite": {
        "codeQualite": "Titulaire",
        "libQualite": "Membre titulaire",
        "libQualiteSex": "Membre titulaire"
      },
      "organesRefs": [
        "PO757489"
      ]
    },
    {
      "uid": "PM758050",
      "acteurRef": "PA719858",
      "legislature": "15",
      "typeOrgane": "GE",
      "dateDebut": "2018-07-16T02:00:00.000+02:00",
      "preseance": "20",
      "nominPrincipale": "0",
      "infosQualite": {
        "codeQualite": "Membre",
        "libQualite": "Membre",
        "libQualiteSex": "Membre"
      },
      "organesRefs": [
        "PO747281"
      ]
    },
    {
      "uid": "PM759427",
      "acteurRef": "PA719858",
      "legislature": "15",
      "typeOrgane": "GE",
      "dateDebut": "2018-10-09T02:00:00.000+02:00",
      "preseance": "12",
      "nominPrincipale": "1",
      "infosQualite": {
        "codeQualite": "Secrétaire",
        "libQualite": "Secrétaire",
        "libQualiteSex": "Secrétaire"
      },
      "organesRefs": [
        "PO747281"
      ]
    }
  ]
}