{
  "uid": "PA609535",
  "etatCivil": {
    "ident": {
      "civ": "M.",
      "prenom": "Jean-Claude",
      "nom": "Buisine",
      "alpha": "Buisine"
    },
    "infoNaissance": {
      "dateNais": "1947-06-14T01:00:00.000+01:00",
      "villeNais": "Berck-sur-Mer",
      "depNais": "Pas-de-Calais",
      "paysNais": "France"
    }
  },
  "profession": {
    "libelleCourant": "Retraité de la fonction publique",
    "socProcInsee": {
      "catSocPro": "Anciens cadres et professions intermédiaires",
      "famSocPro": "Retraités"
    }
  },
  "adresses": [
    {
      "xsiType": "AdresseMail_Type",
      "uid": "AD648546",
      "type": "15",
      "typeLibelle": "Mèl",
      "valElec": "jcbuisine@assemblee-nationale.fr"
    },
    {
      "xsiType": "AdressePostale_Type",
      "uid": "AD650584",
      "type": "0",
      "typeLibelle": "Adresse officielle",
      "poids": "1",
      "intitule": "Assemblée nationale",
      "numeroRue": "126",
      "nomRue": "Rue de l'Université,",
      "codePostal": "75355",
      "ville": "PARIS 07 SP"
    },
    {
      "xsiType": "AdressePostale_Type",
      "uid": "AD687864",
      "type": "2",
      "typeLibelle": "Adresse publiée de circonscription",
      "poids": "22",
      "intitule": "Permanence parlementaire",
      "numeroRue": "13",
      "nomRue": "Rue du Général Sarrail",
      "codePostal": "80210",
      "ville": "Feuquières-en-Vimeu"
    },
    {
      "xsiType": "AdresseMail_Type",
      "uid": "AD687866",
      "type": "15",
      "typeLibelle": "Mèl",
      "valElec": "jcb.permanence@orange.fr"
    }
  ],
  "mandats": [
    {
      "uid": "PM645236",
      "acteurRef": "PA609535",
      "legislature": "14",
      "typeOrgane": "ASSEMBLEE",
      "dateDebut": "2012-06-20T02:00:00.000+02:00",
      "dateFin": "2017-06-20T02:00:00.000+02:00",
      "preseance": "50",
      "nominPrincipale": "1",
      "infosQualite": {
        "codeQualite": "membre",
        "libQualite": "membre",
        "libQualiteSex": "membre"
      },
      "organesRefs": [
        "PO644420"
      ],
      "suppleant": {
        "dateDebut": "2012-06-20T02:00:00.000+02:00",
        "dateFin": "2017-06-20T02:00:00.000+02:00",
        "suppleantRef": "PA643112"
      },
      "election": {
        "lieu": {
          "region": "Hauts-de-France",
          "regionType": "Métropolitain",
          "departement": "Somme",
          "numDepartement": "80",
          "numCirco": "3"
        },
        "causeMandat": "élections générales",
        "refCirconscription": "PO644876"
      },
      "mandature": {
        "datePriseFonction": "2012-06-20T02:00:00.000+02:00",
        "causeFin": "Fin de législature",
        "premiereElection": "0"
      }
    },
    {
      "uid": "PM656072",
      "acteurRef": "PA609535",
      "legislature": "14",
      "typeOrgane": "GP",
      "dateDebut": "2012-06-26T02:00:00.000+02:00",
      "datePublication": "2012-06-27T02:00:00.000+02:00",
      "dateFin": "2016-05-24T02:00:00.000+02:00",
      "preseance": "20",
      "nominPrincipale": "1",
      "infosQualite": {
        "codeQualite": "Membre",
        "libQualite": "Membre du",
        "libQualiteSex": "Membre du"
      },
      "organesRefs": [
        "PO656002"
      ]
    },
    {
      "uid": "PM657512",
      "acteurRef": "PA609535",
      "legislature": "14",
      "typeOrgane": "COMPER",
      "dateDebut": "2012-06-28T02:00:00.000+02:00",
      "datePublication": "2012-06-28T02:00:00.000+02:00",
      "dateFin": "2014-10-27T01:00:00.000+01:00",
      "preseance": "32",
      "nominPrincipale": "1",
      "infosQualite": {
        "codeQualite": "Membre",
        "libQualite": "Membre",
        "libQualiteSex": "Membre"
      },
      "organesRefs": [
        "PO59047"
      ]
    },
    {
      "uid": "PM678799",
      "acteurRef": "PA609535",
      "legislature": "14",
      "typeOrgane": "ORGEXTPARL",
      "dateDebut": "2012-09-28T02:00:00.000+02:00",
      "datePublication": "2012-09-29T02:00:00.000+02:00",
      "dateFin": "2016-06-20T02:00:00.000+02:00",
      "preseance": "20",
      "nominPrincipale": "1",
      "infosQualite": {
        "codeQualite": "Titulaire",
        "libQualite": "Membre titulaire",
        "libQualiteSex": "Membre titulaire"
      },
      "organesRefs": [
        "PO60166"
      ]
    },
    {
      "uid": "PM678822",
      "acteurRef": "PA609535",
      "legislature": "14",
      "typeOrgane": "ORGEXTPARL",
      "dateDebut": "2012-09-28T02:00:00.000+02:00",
      "datePublication": "2012-09-29T02:00:00.000+02:00",
      "dateFin": "2013-01-07T01:00:00.000+01:00",
      "preseance": "20",
      "nominPrincipale": "1",
      "infosQualite": {
        "codeQualite": "Titulaire",
        "libQualite": "Membre titulaire",
        "libQualiteSex": "Membre titulaire"
      },
      "organesRefs": [
        "PO423869"
      ]
    },
    {
      "uid": "PM680153",
      "acteurRef": "PA609535",
      "legislature": "14",
      "typeOrgane": "GA",
      "dateDebut": "2012-10-12T02:00:00.000+02:00",
      "dateFin": "2017-06-20T02:00:00.000+02:00",
      "preseance": "20",
      "nominPrincipale": "1",
      "infosQualite": {
        "codeQualite": "Membre",
        "libQualite": "Membre",
        "libQualiteSex": "Membre"
      },
      "organesRefs": [
        "PO675813"
      ]
    },
    {
      "uid": "PM680154",
      "acteurRef": "PA609535",
      "legislature": "14",
      "typeOrgane": "GA",
      "dateDebut": "2012-10-12T02:00:00.000+02:00",
      "dateFin": "2017-06-20T02:00:00.000+02:00",
      "preseance": "20",
      "nominPrincipale": "1",
      "infosQualite": {
        "codeQualite": "Membre",
        "libQualite": "Membre",
        "libQualiteSex": "Membre"
      },
      "organesRefs": [
        "PO675771"
      ]
    },
    {
      "uid": "PM680155",
      "acteurRef": "PA609535",
      "legislature": "14",
      "typeOrgane": "GA",
      "dateDebut": "2012-10-12T02:00:00.000+02:00",
      "dateFin": "2017-06-20T02:00:00.000+02:00",
      "preseance": "20",
      "nominPrincipale": "1",
      "infosQualite": {
        "codeQualite": "Membre",
        "libQualite": "Membre",
        "libQualiteSex": "Membre"
      },
      "organesRefs": [
        "PO675772"
      ]
    },
    {
      "uid": "PM680156",
      "acteurRef": "PA609535",
      "legislature": "14",
      "typeOrgane": "GA",
      "dateDebut": "2012-10-12T02:00:00.000+02:00",
      "dateFin": "2017-06-20T02:00:00.000+02:00",
      "preseance": "20",
      "nominPrincipale": "1",
      "infosQualite": {
        "codeQualite": "Membre",
        "libQualite": "Membre",
        "libQualiteSex": "Membre"
      },
      "organesRefs": [
        "PO675818"
      ]
    },
    {
      "uid": "PM680157",
      "acteurRef": "PA609535",
      "legislature": "14",
      "typeOrgane": "GA",
      "dateDebut": "2012-10-12T02:00:00.000+02:00",
      "dateFin": "2017-06-20T02:00:00.000+02:00",
      "preseance": "20",
      "nominPrincipale": "1",
      "infosQualite": {
        "codeQualite": "Membre",
        "libQualite": "Membre",
        "libQualiteSex": "Membre"
      },
      "organesRefs": [
        "PO675827"
      ]
    },
    {
      "uid": "PM680158",
      "acteurRef": "PA609535",
      "legislature": "14",
      "typeOrgane": "GA",
      "dateDebut": "2012-10-12T02:00:00.000+02:00",
      "dateFin": "2017-06-20T02:00:00.000+02:00",
      "preseance": "20",
      "nominPrincipale": "1",
      "infosQualite": {
        "codeQualite": "Membre",
        "libQualite": "Membre",
        "libQualiteSex": "Membre"
      },
      "organesRefs": [
        "PO675854"
      ]
    },
    {
      "uid": "PM680159",
      "acteurRef": "PA609535",
      "legislature": "14",
      "typeOrgane": "GA",
      "dateDebut": "2012-10-12T02:00:00.000+02:00",
      "dateFin": "2017-06-20T02:00:00.000+02:00",
      "preseance": "20",
      "nominPrincipale": "1",
      "infosQualite": {
        "codeQualite": "Membre",
        "libQualite": "Membre",
        "libQualiteSex": "Membre"
      },
      "organesRefs": [
        "PO675700"
      ]
    },
    {
      "uid": "PM683991",
      "acteurRef": "PA609535",
      "legislature": "14",
      "typeOrgane": "GA",
      "dateDebut": "2012-11-07T01:00:00.000+01:00",
      "dateFin": "2017-06-20T02:00:00.000+02:00",
      "preseance": "20",
      "nominPrincipale": "1",
      "infosQualite": {
        "codeQualite": "Membre",
        "libQualite": "Membre",
        "libQualiteSex": "Membre"
      },
      "organesRefs": [
        "PO675852"
      ]
    },
    {
      "uid": "PM684422",
      "acteurRef": "PA609535",
      "legislature": "14",
      "typeOrgane": "GA",
      "dateDebut": "2012-11-14T01:00:00.000+01:00",
      "dateFin": "2017-06-20T02:00:00.000+02:00",
      "preseance": "8",
      "nominPrincipale": "1",
      "infosQualite": {
        "codeQualite": "Vice-Président",
        "libQualite": "Vice-Président",
        "libQualiteSex": "Vice-Président"
      },
      "organesRefs": [
        "PO675771"
      ]
    },
    {
      "uid": "PM684512",
      "acteurRef": "PA609535",
      "legislature": "14",
      "typeOrgane": "GA",
      "dateDebut": "2012-11-14T01:00:00.000+01:00",
      "dateFin": "2017-06-20T02:00:00.000+02:00",
      "preseance": "8",
      "nominPrincipale": "1",
      "infosQualite": {
        "codeQualite": "Vice-Président",
        "libQualite": "Vice-Président",
        "libQualiteSex": "Vice-Président"
      },
      "organesRefs": [
        "PO675852"
      ]
    },
    {
      "uid": "PM684887",
      "acteurRef": "PA609535",
      "legislature": "14",
      "typeOrgane": "GA",
      "dateDebut": "2012-11-23T01:00:00.000+01:00",
      "dateFin": "2017-06-20T02:00:00.000+02:00",
      "preseance": "20",
      "nominPrincipale": "1",
      "infosQualite": {
        "codeQualite": "Membre",
        "libQualite": "Membre",
        "libQualiteSex": "Membre"
      },
      "organesRefs": [
        "PO675799"
      ]
    },
    {
      "uid": "PM685673",
      "acteurRef": "PA609535",
      "typeOrgane": "PARPOL",
      "dateDebut": "2012-12-01T01:00:00.000+01:00",
      "dateFin": "2017-06-20T02:00:00.000+02:00",
      "preseance": "5",
      "nominPrincipale": "1",
      "infosQualite": {
        "codeQualite": "Membre",
        "libQualite": "Membre",
        "libQualiteSex": "Membre"
      },
      "organesRefs": [
        "PO684932"
      ]
    },
    {
      "uid": "PM688531",
      "acteurRef": "PA609535",
      "legislature": "14",
      "typeOrgane": "GE",
      "dateDebut": "2013-01-24T01:00:00.000+01:00",
      "dateFin": "2017-06-20T02:00:00.000+02:00",
      "preseance": "20",
      "nominPrincipale": "1",
      "infosQualite": {
        "codeQualite": "Membre",
        "libQualite": "Membre",
        "libQualiteSex": "Membre"
      },
      "organesRefs": [
        "PO686188"
      ]
    },
    {
      "uid": "PM688702",
      "acteurRef": "PA609535",
      "legislature": "14",
      "typeOrgane": "GE",
      "dateDebut": "2013-01-25T01:00:00.000+01:00",
      "dateFin": "2017-06-20T02:00:00.000+02:00",
      "preseance": "20",
      "nominPrincipale": "1",
      "infosQualite": {
        "codeQualite": "Membre",
        "libQualite": "Membre",
        "libQualiteSex": "Membre"
      },
      "organesRefs": [
        "PO686501"
      ]
    },
    {
      "uid": "PM689042",
      "acteurRef": "PA609535",
      "legislature": "14",
      "typeOrgane": "GE",
      "dateDebut": "2013-01-29T01:00:00.000+01:00",
      "dateFin": "2017-06-20T02:00:00.000+02:00",
      "preseance": "20",
      "nominPrincipale": "1",
      "infosQualite": {
        "codeQualite": "Membre",
        "libQualite": "Membre",
        "libQualiteSex": "Membre"
      },
      "organesRefs": [
        "PO686541"
      ]
    },
    {
      "uid": "PM689137",
      "acteurRef": "PA609535",
      "legislature": "14",
      "typeOrgane": "GE",
      "dateDebut": "2013-02-13T01:00:00.000+01:00",
      "dateFin": "2017-06-20T02:00:00.000+02:00",
      "preseance": "12",
      "nominPrincipale": "1",
      "infosQualite": {
        "codeQualite": "Secrétaire",
        "libQualite": "Secrétaire",
        "libQualiteSex": "Secrétaire"
      },
      "organesRefs": [
        "PO686617"
      ]
    },
    {
      "uid": "PM689957",
      "acteurRef": "PA609535",
      "legislature": "14",
      "typeOrgane": "GE",
      "dateDebut": "2013-01-31T01:00:00.000+01:00",
      "dateFin": "2017-06-20T02:00:00.000+02:00",
      "preseance": "20",
      "nominPrincipale": "1",
      "infosQualite": {
        "codeQualite": "Membre",
        "libQualite": "Membre",
        "libQualiteSex": "Membre"
      },
      "organesRefs": [
        "PO686284"
      ]
    },
    {
      "uid": "PM690407",
      "acteurRef": "PA609535",
      "legislature": "14",
      "typeOrgane": "GE",
      "dateDebut": "2013-02-05T01:00:00.000+01:00",
      "dateFin": "2017-06-20T02:00:00.000+02:00",
      "preseance": "8",
      "nominPrincipale": "1",
      "infosQualite": {
        "codeQualite": "Vice-Président",
        "libQualite": "Vice-Président",
        "libQualiteSex": "Vice-Président"
      },
      "organesRefs": [
        "PO686188"
      ]
    },
    {
      "uid": "PM690461",
      "acteurRef": "PA609535",
      "legislature": "14",
      "typeOrgane": "GE",
      "dateDebut": "2013-01-23T01:00:00.000+01:00",
      "dateFin": "2017-06-20T02:00:00.000+02:00",
      "preseance": "20",
      "nominPrincipale": "0",
      "infosQualite": {
        "codeQualite": "Membre",
        "libQualite": "Membre",
        "libQualiteSex": "Membre"
      },
      "organesRefs": [
        "PO686337"
      ]
    },
    {
      "uid": "PM690572",
      "acteurRef": "PA609535",
      "legislature": "14",
      "typeOrgane": "GE",
      "dateDebut": "2013-01-23T01:00:00.000+01:00",
      "dateFin": "2017-06-20T02:00:00.000+02:00",
      "preseance": "12",
      "nominPrincipale": "1",
      "infosQualite": {
        "codeQualite": "Secrétaire",
        "libQualite": "Secrétaire",
        "libQualiteSex": "Secrétaire"
      },
      "organesRefs": [
        "PO686337"
      ]
    },
    {
      "uid": "PM690867",
      "acteurRef": "PA609535",
      "legislature": "14",
      "typeOrgane": "GE",
      "dateDebut": "2013-02-06T01:00:00.000+01:00",
      "dateFin": "2017-06-20T02:00:00.000+02:00",
      "preseance": "8",
      "nominPrincipale": "1",
      "infosQualite": {
        "codeQualite": "Vice-Président",
        "libQualite": "Vice-Président",
        "libQualiteSex": "Vice-Président"
      },
      "organesRefs": [
        "PO686451"
      ]
    },
    {
      "uid": "PM691150",
      "acteurRef": "PA609535",
      "legislature": "14",
      "typeOrgane": "GE",
      "dateDebut": "2013-01-16T01:00:00.000+01:00",
      "dateFin": "2017-06-20T02:00:00.000+02:00",
      "preseance": "20",
      "nominPrincipale": "1",
      "infosQualite": {
        "codeQualite": "Membre",
        "libQualite": "Membre",
        "libQualiteSex": "Membre"
      },
      "organesRefs": [
        "PO687381"
      ]
    },
    {
      "uid": "PM691857",
      "acteurRef": "PA609535",
      "legislature": "14",
      "typeOrgane": "GE",
      "dateDebut": "2013-02-20T01:00:00.000+01:00",
      "dateFin": "2017-06-20T02:00:00.000+02:00",
      "preseance": "20",
      "nominPrincipale": "1",
      "infosQualite": {
        "codeQualite": "Membre",
        "libQualite": "Membre",
        "libQualiteSex": "Membre"
      },
      "organesRefs": [
        "PO686406"
      ]
    },
    {
      "uid": "PM692061",
      "acteurRef": "PA609535",
      "legislature": "14",
      "typeOrgane": "GE",
      "dateDebut": "2013-02-19T01:00:00.000+01:00",
      "dateFin": "2017-06-20T02:00:00.000+02:00",
      "preseance": "20",
      "nominPrincipale": "1",
      "infosQualite": {
        "codeQualite": "Membre",
        "libQualite": "Membre",
        "libQualiteSex": "Membre"
      },
      "organesRefs": [
        "PO686249"
      ]
    },
    {
      "uid": "PM693259",
      "acteurRef": "PA609535",
      "legislature": "14",
      "typeOrgane": "GE",
      "dateDebut": "2013-04-03T02:00:00.000+02:00",
      "dateFin": "2017-06-20T02:00:00.000+02:00",
      "preseance": "20",
      "nominPrincipale": "1",
      "infosQualite": {
        "codeQualite": "Membre",
        "libQualite": "Membre",
        "libQualiteSex": "Membre"
      },
      "organesRefs": [
        "PO689000"
      ]
    },
    {
      "uid": "PM694677",
      "acteurRef": "PA609535",
      "legislature": "14",
      "typeOrgane": "GE",
      "dateDebut": "2013-05-29T02:00:00.000+02:00",
      "dateFin": "2017-06-20T02:00:00.000+02:00",
      "preseance": "20",
      "nominPrincipale": "1",
      "infosQualite": {
        "codeQualite": "Membre",
        "libQualite": "Membre",
        "libQualiteSex": "Membre"
      },
      "organesRefs": [
        "PO686826"
      ]
    },
    {
      "uid": "PM695701",
      "acteurRef": "PA609535",
      "legislature": "14",
      "typeOrgane": "CNPE",
      "dateDebut": "2013-07-02T02:00:00.000+02:00",
      "datePublication": "2013-07-03T02:00:00.000+02:00",
      "dateFin": "2013-12-11T01:00:00.000+01:00",
      "preseance": "20",
      "nominPrincipale": "1",
      "infosQualite": {
        "codeQualite": "Membre",
        "libQualite": "Membre",
        "libQualiteSex": "Membre"
      },
      "organesRefs": [
        "PO695608"
      ]
    },
    {
      "uid": "PM696247",
      "acteurRef": "PA609535",
      "legislature": "14",
      "typeOrgane": "GE",
      "dateDebut": "2013-07-17T02:00:00.000+02:00",
      "dateFin": "2017-06-20T02:00:00.000+02:00",
      "preseance": "20",
      "nominPrincipale": "1",
      "infosQualite": {
        "codeQualite": "Membre",
        "libQualite": "Membre",
        "libQualiteSex": "Membre"
      },
      "organesRefs": [
        "PO694572"
      ]
    },
    {
      "uid": "PM697269",
      "acteurRef": "PA609535",
      "legislature": "14",
      "typeOrgane": "GE",
      "dateDebut": "2013-10-01T02:00:00.000+02:00",
      "dateFin": "2017-06-20T02:00:00.000+02:00",
      "preseance": "20",
      "nominPrincipale": "1",
      "infosQualite": {
        "codeQualite": "Membre",
        "libQualite": "Membre",
        "libQualiteSex": "Membre"
      },
      "organesRefs": [
        "PO694560"
      ]
    },
    {
      "uid": "PM697627",
      "acteurRef": "PA609535",
      "legislature": "14",
      "typeOrgane": "GE",
      "dateDebut": "2013-10-08T02:00:00.000+02:00",
      "dateFin": "2017-06-20T02:00:00.000+02:00",
      "preseance": "8",
      "nominPrincipale": "1",
      "infosQualite": {
        "codeQualite": "Vice-Président",
        "libQualite": "Vice-Président",
        "libQualiteSex": "Vice-Président"
      },
      "organesRefs": [
        "PO694572"
      ]
    },
    {
      "uid": "PM704474",
      "acteurRef": "PA609535",
      "legislature": "14",
      "typeOrgane": "COMPER",
      "dateDebut": "2014-10-28T01:00:00.000+01:00",
      "datePublication": "2014-10-28T01:00:00.000+01:00",
      "dateFin": "2017-06-20T02:00:00.000+02:00",
      "preseance": "32",
      "nominPrincipale": "1",
      "infosQualite": {
        "codeQualite": "Membre",
        "libQualite": "Membre",
        "libQualiteSex": "Membre"
      },
      "organesRefs": [
        "PO59048"
      ]
    },
    {
      "uid": "PM705400",
      "acteurRef": "PA609535",
      "legislature": "14",
      "typeOrgane": "CMP",
      "dateDebut": "2014-12-15T01:00:00.000+01:00",
      "datePublication": "2014-12-13T01:00:00.000+01:00",
      "dateFin": "2014-12-18T01:00:00.000+01:00",
      "preseance": "28",
      "nominPrincipale": "1",
      "infosQualite": {
        "codeQualite": "Suppléant",
        "libQualite": "Membre suppléant",
        "libQualiteSex": "Membre suppléant"
      },
      "organesRefs": [
        "PO705391"
      ]
    },
    {
      "uid": "PM707579",
      "acteurRef": "PA609535",
      "legislature": "14",
      "typeOrgane": "MISINFO",
      "dateDebut": "2013-12-11T01:00:00.000+01:00",
      "dateFin": "2015-03-18T01:00:00.000+01:00",
      "preseance": "10",
      "nominPrincipale": "1",
      "infosQualite": {
        "codeQualite": "Membre",
        "libQualite": "Membre",
        "libQualiteSex": "Membre"
      },
      "organesRefs": [
        "PO707561"
      ]
    },
    {
      "uid": "PM708986",
      "acteurRef": "PA609535",
      "legislature": "14",
      "typeOrgane": "CMP",
      "dateDebut": "2015-07-10T02:00:00.000+02:00",
      "datePublication": "2015-07-11T02:00:00.000+02:00",
      "dateFin": "2015-07-16T02:00:00.000+02:00",
      "preseance": "28",
      "nominPrincipale": "1",
      "infosQualite": {
        "codeQualite": "Suppléant",
        "libQualite": "Membre suppléant",
        "libQualiteSex": "Membre suppléant"
      },
      "organesRefs": [
        "PO708938"
      ]
    },
    {
      "uid": "PM710387",
      "acteurRef": "PA609535",
      "legislature": "14",
      "typeOrgane": "CNPE",
      "dateDebut": "2015-12-02T01:00:00.000+01:00",
      "datePublication": "2015-12-02T01:00:00.000+01:00",
      "dateFin": "2015-12-31T01:00:00.000+01:00",
      "preseance": "20",
      "nominPrincipale": "1",
      "infosQualite": {
        "codeQualite": "Membre",
        "libQualite": "Membre",
        "libQualiteSex": "Membre"
      },
      "organesRefs": [
        "PO708697"
      ]
    },
    {
      "uid": "PM710687",
      "acteurRef": "PA609535",
      "legislature": "14",
      "typeOrgane": "CMP",
      "dateDebut": "2015-12-09T01:00:00.000+01:00",
      "datePublication": "2015-12-10T01:00:00.000+01:00",
      "dateFin": "2015-12-11T01:00:00.000+01:00",
      "preseance": "28",
      "nominPrincipale": "1",
      "infosQualite": {
        "codeQualite": "Suppléant",
        "libQualite": "Membre suppléant",
        "libQualiteSex": "Membre suppléant"
      },
      "organesRefs": [
        "PO710669"
      ]
    },
    {
      "uid": "PM710757",
      "acteurRef": "PA609535",
      "legislature": "14",
      "typeOrgane": "CMP",
      "dateDebut": "2015-12-10T01:00:00.000+01:00",
      "datePublication": "2015-12-12T01:00:00.000+01:00",
      "dateFin": "2015-12-15T01:00:00.000+01:00",
      "preseance": "28",
      "nominPrincipale": "1",
      "infosQualite": {
        "codeQualite": "Suppléant",
        "libQualite": "Membre suppléant",
        "libQualiteSex": "Membre suppléant"
      },
      "organesRefs": [
        "PO710744"
      ]
    },
    {
      "uid": "PM711202",
      "acteurRef": "PA609535",
      "legislature": "14",
      "typeOrgane": "MISINFO",
      "dateDebut": "2016-01-20T01:00:00.000+01:00",
      "dateFin": "2016-02-10T01:00:00.000+01:00",
      "preseance": "10",
      "nominPrincipale": "1",
      "infosQualite": {
        "codeQualite": "Membre",
        "libQualite": "Membre",
        "libQualiteSex": "Membre"
      },
      "organesRefs": [
        "PO683565"
      ]
    },
    {
      "uid": "PM711544",
      "acteurRef": "PA609535",
      "legislature": "14",
      "typeOrgane": "MISINFO",
      "dateDebut": "2016-02-10T01:00:00.000+01:00",
      "dateFin": "2017-06-20T02:00:00.000+02:00",
      "preseance": "15",
      "nominPrincipale": "1",
      "infosQualite": {
        "codeQualite": "Rapporteur",
        "libQualite": "Rapporteur sur \"La transparence et la gestion de la dette publique\"",
        "libQualiteSex": "Rapporteur sur \"La transparence et la gestion de la dette publique\""
      },
      "organesRefs": [
        "PO683565"
      ]
    },
    {
      "uid": "PM712823",
      "acteurRef": "PA609535",
      "legislature": "14",
      "typeOrgane": "CMP",
      "dateDebut": "2016-05-12T02:00:00.000+02:00",
      "datePublication": "2016-05-13T02:00:00.000+02:00",
      "dateFin": "2016-06-01T02:00:00.000+02:00",
      "preseance": "28",
      "nominPrincipale": "1",
      "infosQualite": {
        "codeQualite": "Suppléant",
        "libQualite": "Membre suppléant",
        "libQualiteSex": "Membre suppléant"
      },
      "organesRefs": [
        "PO712775"
      ]
    },
    {
      "uid": "PM713131",
      "acteurRef": "PA609535",
      "legislature": "14",
      "typeOrgane": "GP",
      "dateDebut": "2016-05-25T02:00:00.000+02:00",
      "dateFin": "2017-06-20T02:00:00.000+02:00",
      "preseance": "20",
      "nominPrincipale": "1",
      "infosQualite": {
        "codeQualite": "Membre",
        "libQualite": "Membre du",
        "libQualiteSex": "Membre du"
      },
      "organesRefs": [
        "PO713077"
      ]
    },
    {
      "uid": "PM714196",
      "acteurRef": "PA609535",
      "legislature": "14",
      "typeOrgane": "CMP",
      "dateDebut": "2016-07-08T02:00:00.000+02:00",
      "datePublication": "2016-07-09T02:00:00.000+02:00",
      "dateFin": "2016-07-13T02:00:00.000+02:00",
      "preseance": "20",
      "nominPrincipale": "1",
      "infosQualite": {
        "codeQualite": "Titulaire",
        "libQualite": "Membre titulaire",
        "libQualiteSex": "Membre titulaire"
      },
      "organesRefs": [
        "PO714186"
      ]
    },
    {
      "uid": "PM714831",
      "acteurRef": "PA609535",
      "legislature": "14",
      "typeOrgane": "COMNL",
      "dateDebut": "2016-10-05T02:00:00.000+02:00",
      "datePublication": "2016-10-05T02:00:00.000+02:00",
      "dateFin": "2016-10-05T02:00:00.000+02:00",
      "preseance": "20",
      "nominPrincipale": "1",
      "infosQualite": {
        "codeQualite": "Membre",
        "libQualite": "Membre",
        "libQualiteSex": "Membre"
      },
      "organesRefs": [
        "PO415287"
      ]
    },
    {
      "uid": "PM715969",
      "acteurRef": "PA609535",
      "legislature": "14",
      "typeOrgane": "CMP",
      "dateDebut": "2016-12-08T01:00:00.000+01:00",
      "datePublication": "2016-12-09T01:00:00.000+01:00",
      "dateFin": "2016-12-16T01:00:00.000+01:00",
      "preseance": "20",
      "nominPrincipale": "1",
      "infosQualite": {
        "codeQualite": "Titulaire",
        "libQualite": "Membre titulaire",
        "libQualiteSex": "Membre titulaire"
      },
      "organesRefs": [
        "PO715651"
      ]
    }
  ]
}