{
  "uid": "PO700861",
  "codeType": "MINISTERE",
  "libelle": "Secrétariat d'État, auprès de la ministre des affaires sociales et de la santé, chargé des personnes handicapées et de la lutte contre l'exclusion",
  "libelleEdition": ", auprès de la ministre des affaires sociales et de la santé, chargée des personnes handicapées et de la lutte contre l'exclusion",
  "libelleAbrege": "Handicapés et lutte contre l'exclusion",
  "libelleAbrev": "HAN",
  "viMoDe": {
    "dateDebut": "2014-04-10T02:00:00.000+02:00",
    "dateFin": "2014-08-26T02:00:00.000+02:00"
  },
  "organeParentRef": "PO700706"
}