{
  "uid": "PO675693",
  "codeType": "GA",
  "libelle": "France-Congo",
  "libelleEdition": "de France-Congo",
  "libelleAbrege": "Congo (République du)",
  "libelleAbrev": "CONG",
  "viMoDe": {
    "dateAgrement": "2012-07-18T02:00:00.000+02:00",
    "dateFin": "2017-06-20T02:00:00.000+02:00"
  },
  "regime": "5ème République",
  "legislature": "14",
  "secretariat": {}
}