{
  "uid": "PA1522",
  "etatCivil": {
    "ident": {
      "civ": "M.",
      "prenom": "François",
      "nom": "Goulard",
      "alpha": "Goulard"
    },
    "infoNaissance": {
      "dateNais": "1953-09-21T01:00:00.000+01:00",
      "villeNais": "Vannes",
      "depNais": "Morbihan"
    }
  },
  "profession": {
    "libelleCourant": "Sans profession déclarée",
    "socProcInsee": {
      "catSocPro": "Sans profession déclarée",
      "famSocPro": "Sans profession déclarée"
    }
  },
  "adresses": [
    {
      "xsiType": "AdressePostale_Type",
      "uid": "AD386835",
      "type": "0",
      "typeLibelle": "Adresse officielle",
      "poids": "1",
      "intitule": "Assemblée nationale,",
      "numeroRue": "126",
      "nomRue": "Rue de l'Université,",
      "codePostal": "75355",
      "ville": "Paris 07 SP"
    },
    {
      "xsiType": "AdressePostale_Type",
      "uid": "AD388250",
      "type": "2",
      "typeLibelle": "Adresse publiée de circonscription",
      "poids": "21",
      "intitule": "Hôtel de ville",
      "nomRue": "Place Maurice Marchais",
      "codePostal": "56000",
      "ville": "Vannes"
    },
    {
      "xsiType": "AdresseMail_Type",
      "uid": "AD391715",
      "type": "15",
      "typeLibelle": "Mèl",
      "valElec": "fgoulard@assemblee-nationale.fr"
    },
    {
      "xsiType": "AdresseTelephonique_Type",
      "uid": "AD396517",
      "type": "11",
      "typeLibelle": "Téléphone",
      "poids": "21",
      "adresseDeRattachement": "AD388250",
      "valElec": "02 97 01 60 10"
    },
    {
      "xsiType": "AdresseTelephonique_Type",
      "uid": "AD396518",
      "type": "12",
      "typeLibelle": "Télécopie",
      "poids": "21",
      "adresseDeRattachement": "AD388250",
      "valElec": "02 97 01 60 11"
    },
    {
      "xsiType": "AdressePostale_Type",
      "uid": "AD406616",
      "type": "2",
      "typeLibelle": "Adresse publiée de circonscription",
      "poids": "22",
      "intitule": "Permanence",
      "numeroRue": "2",
      "nomRue": "Rue de la Boucherie",
      "codePostal": "56000",
      "ville": "VANNES"
    },
    {
      "xsiType": "AdresseTelephonique_Type",
      "uid": "AD406618",
      "type": "11",
      "typeLibelle": "Téléphone",
      "poids": "22",
      "adresseDeRattachement": "AD406616",
      "valElec": "02 97 47 05 10"
    },
    {
      "xsiType": "AdresseTelephonique_Type",
      "uid": "AD406620",
      "type": "12",
      "typeLibelle": "Télécopie",
      "poids": "22",
      "adresseDeRattachement": "AD406616",
      "valElec": "02 97 47 80 13"
    }
  ],
  "mandats": [
    {
      "uid": "PM386260",
      "acteurRef": "PA1522",
      "legislature": "13",
      "typeOrgane": "ASSEMBLEE",
      "dateDebut": "2007-06-20T02:00:00.000+02:00",
      "dateFin": "2012-06-19T02:00:00.000+02:00",
      "preseance": "50",
      "nominPrincipale": "1",
      "infosQualite": {
        "codeQualite": "membre",
        "libQualite": "membre",
        "libQualiteSex": "membre"
      },
      "organesRefs": [
        "PO384266"
      ],
      "suppleant": {
        "dateDebut": "2007-06-20T02:00:00.000+02:00",
        "dateFin": "2012-06-19T02:00:00.000+02:00",
        "suppleantRef": "PA267045"
      },
      "election": {
        "lieu": {
          "region": "Bretagne",
          "regionType": "Métropolitain",
          "departement": "Morbihan",
          "numDepartement": "56",
          "numCirco": "1"
        },
        "causeMandat": "élections générales",
        "refCirconscription": "PO384524"
      },
      "mandature": {
        "datePriseFonction": "2007-06-20T02:00:00.000+02:00",
        "causeFin": "Fin de législature",
        "premiereElection": "1"
      }
    },
    {
      "uid": "PM387414",
      "acteurRef": "PA1522",
      "legislature": "13",
      "typeOrgane": "GP",
      "dateDebut": "2007-06-20T02:00:00.000+02:00",
      "dateFin": "2007-06-26T02:00:00.000+02:00",
      "preseance": "28",
      "nominPrincipale": "1",
      "infosQualite": {
        "codeQualite": "Député non-inscrit",
        "libQualite": "Député non-inscrit",
        "libQualiteSex": "Député non-inscrit"
      },
      "organesRefs": [
        "PO387155"
      ]
    },
    {
      "uid": "PM389828",
      "acteurRef": "PA1522",
      "legislature": "13",
      "typeOrgane": "GP",
      "dateDebut": "2007-06-27T02:00:00.000+02:00",
      "datePublication": "2007-06-27T02:00:00.000+02:00",
      "dateFin": "2012-06-19T02:00:00.000+02:00",
      "preseance": "20",
      "nominPrincipale": "1",
      "infosQualite": {
        "codeQualite": "Membre",
        "libQualite": "Membre du",
        "libQualiteSex": "Membre du"
      },
      "organesRefs": [
        "PO389395"
      ]
    },
    {
      "uid": "PM390892",
      "acteurRef": "PA1522",
      "legislature": "13",
      "typeOrgane": "COMPER",
      "dateDebut": "2007-06-27T02:00:00.000+02:00",
      "datePublication": "2007-06-28T02:00:00.000+02:00",
      "dateFin": "2008-02-08T01:00:00.000+01:00",
      "preseance": "32",
      "nominPrincipale": "1",
      "infosQualite": {
        "codeQualite": "Membre",
        "libQualite": "Membre",
        "libQualiteSex": "Membre"
      },
      "organesRefs": [
        "PO59051"
      ]
    },
    {
      "uid": "PM391452",
      "acteurRef": "PA1522",
      "legislature": "13",
      "typeOrgane": "OFFPAR",
      "dateDebut": "2007-07-03T02:00:00.000+02:00",
      "datePublication": "2007-07-04T02:00:00.000+02:00",
      "dateFin": "2012-06-19T02:00:00.000+02:00",
      "preseance": "24",
      "nominPrincipale": "1",
      "infosQualite": {
        "codeQualite": "Membre",
        "libQualite": "Membre",
        "libQualiteSex": "Membre"
      },
      "organesRefs": [
        "PO273589"
      ]
    },
    {
      "uid": "PM406666",
      "acteurRef": "PA1522",
      "legislature": "13",
      "typeOrgane": "GE",
      "dateDebut": "2008-01-11T01:00:00.000+01:00",
      "dateFin": "2012-06-19T02:00:00.000+02:00",
      "preseance": "20",
      "nominPrincipale": "1",
      "infosQualite": {
        "codeQualite": "Membre",
        "libQualite": "Membre",
        "libQualiteSex": "Membre"
      },
      "organesRefs": [
        "PO402727"
      ]
    },
    {
      "uid": "PM407551",
      "acteurRef": "PA1522",
      "legislature": "13",
      "typeOrgane": "GE",
      "dateDebut": "2008-01-24T01:00:00.000+01:00",
      "dateFin": "2012-06-19T02:00:00.000+02:00",
      "preseance": "20",
      "nominPrincipale": "1",
      "infosQualite": {
        "codeQualite": "Membre",
        "libQualite": "Membre",
        "libQualiteSex": "Membre"
      },
      "organesRefs": [
        "PO403262"
      ]
    },
    {
      "uid": "PM408746",
      "acteurRef": "PA1522",
      "legislature": "13",
      "typeOrgane": "COMPER",
      "dateDebut": "2008-02-08T01:00:00.000+01:00",
      "datePublication": "2008-02-09T01:00:00.000+01:00",
      "dateFin": "2012-06-19T02:00:00.000+02:00",
      "preseance": "32",
      "nominPrincipale": "1",
      "infosQualite": {
        "codeQualite": "Membre",
        "libQualite": "Membre",
        "libQualiteSex": "Membre"
      },
      "organesRefs": [
        "PO59048"
      ]
    },
    {
      "uid": "PM409479",
      "acteurRef": "PA1522",
      "legislature": "13",
      "typeOrgane": "GE",
      "dateDebut": "2008-01-09T01:00:00.000+01:00",
      "dateFin": "2012-06-19T02:00:00.000+02:00",
      "preseance": "20",
      "nominPrincipale": "1",
      "infosQualite": {
        "codeQualite": "Membre",
        "libQualite": "Membre",
        "libQualiteSex": "Membre"
      },
      "organesRefs": [
        "PO403069"
      ]
    },
    {
      "uid": "PM410827",
      "acteurRef": "PA1522",
      "legislature": "13",
      "typeOrgane": "GE",
      "dateDebut": "2008-01-30T01:00:00.000+01:00",
      "dateFin": "2012-06-19T02:00:00.000+02:00",
      "preseance": "12",
      "nominPrincipale": "1",
      "infosQualite": {
        "codeQualite": "Secrétaire",
        "libQualite": "Secrétaire",
        "libQualiteSex": "Secrétaire"
      },
      "organesRefs": [
        "PO403262"
      ]
    },
    {
      "uid": "PM412082",
      "acteurRef": "PA1522",
      "legislature": "13",
      "typeOrgane": "GE",
      "dateDebut": "2008-01-30T01:00:00.000+01:00",
      "dateFin": "2012-06-19T02:00:00.000+02:00",
      "preseance": "20",
      "nominPrincipale": "1",
      "infosQualite": {
        "codeQualite": "Membre",
        "libQualite": "Membre",
        "libQualiteSex": "Membre"
      },
      "organesRefs": [
        "PO403111"
      ]
    },
    {
      "uid": "PM412839",
      "acteurRef": "PA1522",
      "legislature": "13",
      "typeOrgane": "GE",
      "dateDebut": "2008-04-18T02:00:00.000+02:00",
      "dateFin": "2012-06-19T02:00:00.000+02:00",
      "preseance": "20",
      "nominPrincipale": "1",
      "infosQualite": {
        "codeQualite": "Membre",
        "libQualite": "Membre",
        "libQualiteSex": "Membre"
      },
      "organesRefs": [
        "PO403202"
      ]
    },
    {
      "uid": "PM414082",
      "acteurRef": "PA1522",
      "legislature": "13",
      "typeOrgane": "GE",
      "dateDebut": "2007-10-31T01:00:00.000+01:00",
      "dateFin": "2012-06-19T02:00:00.000+02:00",
      "preseance": "20",
      "nominPrincipale": "1",
      "infosQualite": {
        "codeQualite": "Membre",
        "libQualite": "Membre",
        "libQualiteSex": "Membre"
      },
      "organesRefs": [
        "PO403105"
      ]
    },
    {
      "uid": "PM414943",
      "acteurRef": "PA1522",
      "legislature": "13",
      "typeOrgane": "GE",
      "dateDebut": "2007-10-31T01:00:00.000+01:00",
      "dateFin": "2012-06-19T02:00:00.000+02:00",
      "preseance": "20",
      "nominPrincipale": "1",
      "infosQualite": {
        "codeQualite": "Membre",
        "libQualite": "Membre",
        "libQualiteSex": "Membre"
      },
      "organesRefs": [
        "PO403021"
      ]
    },
    {
      "uid": "PM424610",
      "acteurRef": "PA1522",
      "legislature": "13",
      "typeOrgane": "CNPE",
      "dateDebut": "2010-07-06T02:00:00.000+02:00",
      "datePublication": "2010-07-07T02:00:00.000+02:00",
      "dateFin": "2010-12-15T01:00:00.000+01:00",
      "preseance": "20",
      "nominPrincipale": "1",
      "infosQualite": {
        "codeQualite": "Membre",
        "libQualite": "Membre",
        "libQualiteSex": "Membre"
      },
      "organesRefs": [
        "PO424590"
      ]
    },
    {
      "uid": "PM425307",
      "acteurRef": "PA1522",
      "legislature": "13",
      "typeOrgane": "COMNL",
      "dateDebut": "2010-10-13T02:00:00.000+02:00",
      "dateFin": "2010-10-22T02:00:00.000+02:00",
      "preseance": "20",
      "nominPrincipale": "1",
      "infosQualite": {
        "codeQualite": "Membre",
        "libQualite": "Membre",
        "libQualiteSex": "Membre"
      },
      "organesRefs": [
        "PO420375"
      ]
    },
    {
      "uid": "PM426941",
      "acteurRef": "PA1522",
      "legislature": "13",
      "typeOrgane": "GE",
      "dateDebut": "2011-02-04T01:00:00.000+01:00",
      "dateFin": "2012-06-19T02:00:00.000+02:00",
      "preseance": "20",
      "nominPrincipale": "1",
      "infosQualite": {
        "codeQualite": "Membre",
        "libQualite": "Membre",
        "libQualiteSex": "Membre"
      },
      "organesRefs": [
        "PO425013"
      ]
    },
    {
      "uid": "PM430797",
      "acteurRef": "PA1522",
      "legislature": "13",
      "typeOrgane": "COMPER",
      "dateDebut": "2011-10-18T02:00:00.000+02:00",
      "dateFin": "2012-06-19T02:00:00.000+02:00",
      "preseance": "500",
      "nominPrincipale": "0",
      "infosQualite": {
        "codeQualite": "Rapporteur spécial",
        "libQualite": "Rapporteur spécial au nom de la commission des finances : Ville et Logement : Ville",
        "libQualiteSex": "Rapporteur spécial au nom de la commission des finances : Ville et Logement : Ville"
      },
      "organesRefs": [
        "PO59048"
      ]
    },
    {
      "uid": "PM438192",
      "acteurRef": "PA1522",
      "legislature": "13",
      "typeOrgane": "ORGEXTPARL",
      "dateDebut": "2011-12-05T01:00:00.000+01:00",
      "datePublication": "2011-12-06T01:00:00.000+01:00",
      "dateFin": "2012-06-19T02:00:00.000+02:00",
      "preseance": "20",
      "nominPrincipale": "1",
      "infosQualite": {
        "codeQualite": "Titulaire",
        "libQualite": "Membre titulaire",
        "libQualiteSex": "Membre titulaire"
      },
      "organesRefs": [
        "PO422779"
      ]
    }
  ]
}