{
  "uid": "PO686249",
  "codeType": "GE",
  "libelle": "Économie verte et économie circulaire",
  "libelleEdition": "Économie verte et économie circulaire",
  "libelleAbrege": "Économie verte et économie circulaire",
  "libelleAbrev": "ECONOMIE V",
  "viMoDe": {
    "dateAgrement": "2012-11-14T01:00:00.000+01:00",
    "dateFin": "2017-06-20T02:00:00.000+02:00"
  },
  "regime": "5ème République",
  "legislature": "14",
  "secretariat": {}
}