{
  "uid": "PO201361",
  "codeType": "ORGEXTPARL",
  "libelle": "Comité local d'information et de suivi du laboratoire souterrain de Bure",
  "libelleEdition": "du Comité local d'information et de suivi du laboratoire souterrain de Bure",
  "libelleAbrege": "Laboratoire de Bure",
  "libelleAbrev": "161",
  "viMoDe": {
    "dateDebut": "1991-12-30T01:00:00.000+01:00"
  },
  "regime": "5ème République",
  "regimeJuridique": "Article L. 542-13 du code de l’environnement",
  "siteInternet": "http://www.clis-bure.com/cadres/c_role.html"
}