{
  "uid": "PO694660",
  "codeType": "CMP",
  "libelle": "Commission mixte paritaire chargée de proposer un texte sur les dispositions restant en discussion du projet de loi portant diverses dispositions d'adaptation dans le domaine de la justice en application du droit de l'Union européenne et des engagements internationaux de la France",
  "libelleEdition": "du projet de loi portant diverses dispositions d'adaptation dans le domaine de la justice en application du droit de l'Union européenne et des engagements internationaux de la France",
  "libelleAbrege": "Droit européen justice",
  "libelleAbrev": "736",
  "viMoDe": {
    "dateDebut": "2013-05-28T02:00:00.000+02:00",
    "dateFin": "2013-07-16T02:00:00.000+02:00"
  },
  "regime": "5ème République",
  "legislature": "14",
  "secretariat": {}
}