{
  "uid": "PA721764",
  "etatCivil": {
    "ident": {
      "civ": "Mme",
      "prenom": "Olivia",
      "nom": "Gregoire",
      "alpha": "Gregoire",
      "trigramme": "OGR"
    },
    "infoNaissance": {
      "dateNais": "1978-09-30T02:00:00.000+02:00",
      "villeNais": "Paris",
      "depNais": "Paris",
      "paysNais": "France"
    }
  },
  "profession": {
    "libelleCourant": "Chef d'entreprise",
    "socProcInsee": {
      "catSocPro": "Professions libérales et assimilés",
      "famSocPro": "Cadres et professions intellectuelles supérieures"
    }
  },
  "uriHatvp": "https://www.hatvp.fr/pages_nominatives/gregoire-olivia",
  "adresses": [
    {
      "xsiType": "AdressePostale_Type",
      "uid": "AD721766",
      "type": "0",
      "typeLibelle": "Adresse officielle",
      "poids": "1",
      "intitule": "Assemblée nationale,",
      "numeroRue": "126",
      "nomRue": "Rue de l'Université,",
      "codePostal": "75355",
      "ville": "Paris 07 SP"
    },
    {
      "xsiType": "AdresseMail_Type",
      "uid": "AD728280",
      "type": "15",
      "typeLibelle": "Mèl",
      "valElec": "olivia.gregoire@assemblee-nationale.fr"
    },
    {
      "xsiType": "AdresseSiteWeb_Type",
      "uid": "AD728660",
      "type": "22",
      "typeLibelle": "Site internet",
      "valElec": "www.oliviagregoire.fr"
    },
    {
      "xsiType": "AdresseSiteWeb_Type",
      "uid": "AD728692",
      "type": "25",
      "typeLibelle": "Facebook",
      "valElec": "oliviagregoire2017"
    },
    {
      "xsiType": "AdresseMail_Type",
      "uid": "AD728866",
      "type": "15",
      "typeLibelle": "Mèl",
      "valElec": "oliviagregoire2017@gmail.com"
    },
    {
      "xsiType": "AdresseSiteWeb_Type",
      "uid": "AD729072",
      "type": "24",
      "typeLibelle": "Twitter",
      "valElec": "@oliviagregoire"
    }
  ],
  "mandats": [
    {
      "uid": "PM723376",
      "acteurRef": "PA721764",
      "legislature": "15",
      "typeOrgane": "ASSEMBLEE",
      "dateDebut": "2017-06-18T02:00:00.000+02:00",
      "preseance": "50",
      "nominPrincipale": "1",
      "infosQualite": {
        "codeQualite": "membre",
        "libQualite": "membre",
        "libQualiteSex": "membre"
      },
      "organesRefs": [
        "PO717460"
      ],
      "suppleant": {
        "dateDebut": "2017-06-18T02:00:00.000+02:00",
        "suppleantRef": "PA721768"
      },
      "election": {
        "lieu": {
          "region": "Ile-de-France",
          "regionType": "Métropolitain",
          "departement": "Paris",
          "numDepartement": "75",
          "numCirco": "12"
        },
        "causeMandat": "élections générales",
        "refCirconscription": "PO718212"
      },
      "mandature": {
        "datePriseFonction": "2017-06-21T02:00:00.000+02:00",
        "premiereElection": "0",
        "placeHemicycle": "345"
      },
      "collaborateurs": [
        {
          "qualite": "Mme",
          "prenom": "Baltis",
          "nom": "Mejanes"
        },
        {
          "qualite": "M.",
          "prenom": "Guillaume",
          "nom": "Zucman"
        },
        {
          "qualite": "Mme",
          "prenom": "Amandine",
          "nom": "Brûlé"
        }
      ]
    },
    {
      "uid": "PM724729",
      "acteurRef": "PA721764",
      "legislature": "15",
      "typeOrgane": "GP",
      "dateDebut": "2017-06-21T02:00:00.000+02:00",
      "dateFin": "2017-06-26T02:00:00.000+02:00",
      "preseance": "28",
      "nominPrincipale": "1",
      "infosQualite": {
        "codeQualite": "Député non-inscrit",
        "libQualite": "Député non-inscrit",
        "libQualiteSex": "Députée non-inscrite"
      },
      "organesRefs": [
        "PO723569"
      ]
    },
    {
      "uid": "PM731229",
      "acteurRef": "PA721764",
      "legislature": "15",
      "typeOrgane": "GP",
      "dateDebut": "2017-06-27T02:00:00.000+02:00",
      "datePublication": "2017-06-28T02:00:00.000+02:00",
      "preseance": "20",
      "nominPrincipale": "1",
      "infosQualite": {
        "codeQualite": "Membre",
        "libQualite": "Membre du",
        "libQualiteSex": "Membre du"
      },
      "organesRefs": [
        "PO730964"
      ]
    },
    {
      "uid": "PM731935",
      "acteurRef": "PA721764",
      "legislature": "15",
      "typeOrgane": "COMPER",
      "dateDebut": "2017-06-29T02:00:00.000+02:00",
      "datePublication": "2017-06-29T02:00:00.000+02:00",
      "preseance": "32",
      "nominPrincipale": "1",
      "infosQualite": {
        "codeQualite": "Membre",
        "libQualite": "Membre",
        "libQualiteSex": "Membre"
      },
      "organesRefs": [
        "PO59048"
      ]
    },
    {
      "uid": "PM739295",
      "acteurRef": "PA721764",
      "legislature": "15",
      "typeOrgane": "GA",
      "dateDebut": "2017-10-11T02:00:00.000+02:00",
      "preseance": "20",
      "nominPrincipale": "1",
      "infosQualite": {
        "codeQualite": "Membre",
        "libQualite": "Membre",
        "libQualiteSex": "Membre"
      },
      "organesRefs": [
        "PO732969"
      ]
    },
    {
      "uid": "PM739296",
      "acteurRef": "PA721764",
      "legislature": "15",
      "typeOrgane": "GA",
      "dateDebut": "2017-10-11T02:00:00.000+02:00",
      "preseance": "20",
      "nominPrincipale": "1",
      "infosQualite": {
        "codeQualite": "Membre",
        "libQualite": "Membre",
        "libQualiteSex": "Membre"
      },
      "organesRefs": [
        "PO733001"
      ]
    },
    {
      "uid": "PM739297",
      "acteurRef": "PA721764",
      "legislature": "15",
      "typeOrgane": "GA",
      "dateDebut": "2017-10-11T02:00:00.000+02:00",
      "preseance": "20",
      "nominPrincipale": "1",
      "infosQualite": {
        "codeQualite": "Membre",
        "libQualite": "Membre",
        "libQualiteSex": "Membre"
      },
      "organesRefs": [
        "PO733177"
      ]
    },
    {
      "uid": "PM739298",
      "acteurRef": "PA721764",
      "legislature": "15",
      "typeOrgane": "GA",
      "dateDebut": "2017-10-11T02:00:00.000+02:00",
      "preseance": "20",
      "nominPrincipale": "1",
      "infosQualite": {
        "codeQualite": "Membre",
        "libQualite": "Membre",
        "libQualiteSex": "Membre"
      },
      "organesRefs": [
        "PO733382"
      ]
    },
    {
      "uid": "PM739299",
      "acteurRef": "PA721764",
      "legislature": "15",
      "typeOrgane": "GA",
      "dateDebut": "2017-10-11T02:00:00.000+02:00",
      "preseance": "20",
      "nominPrincipale": "1",
      "infosQualite": {
        "codeQualite": "Membre",
        "libQualite": "Membre",
        "libQualiteSex": "Membre"
      },
      "organesRefs": [
        "PO733577"
      ]
    },
    {
      "uid": "PM739300",
      "acteurRef": "PA721764",
      "legislature": "15",
      "typeOrgane": "GA",
      "dateDebut": "2017-10-11T02:00:00.000+02:00",
      "preseance": "20",
      "nominPrincipale": "1",
      "infosQualite": {
        "codeQualite": "Membre",
        "libQualite": "Membre",
        "libQualiteSex": "Membre"
      },
      "organesRefs": [
        "PO733627"
      ]
    },
    {
      "uid": "PM744840",
      "acteurRef": "PA721764",
      "legislature": "15",
      "typeOrgane": "MISINFOPRE",
      "dateDebut": "2017-12-07T01:00:00.000+01:00",
      "datePublication": "2017-12-07T01:00:00.000+01:00",
      "dateFin": "2018-11-20T01:00:00.000+01:00",
      "preseance": "20",
      "nominPrincipale": "1",
      "infosQualite": {
        "codeQualite": "Membre",
        "libQualite": "Membre",
        "libQualiteSex": "Membre"
      },
      "organesRefs": [
        "PO743664"
      ]
    },
    {
      "uid": "PM745127",
      "acteurRef": "PA721764",
      "typeOrgane": "PARPOL",
      "dateDebut": "2017-12-01T01:00:00.000+01:00",
      "preseance": "5",
      "nominPrincipale": "1",
      "infosQualite": {
        "codeQualite": "Membre",
        "libQualite": "Membre",
        "libQualiteSex": "Membre"
      },
      "organesRefs": [
        "PO744854"
      ]
    },
    {
      "uid": "PM746481",
      "acteurRef": "PA721764",
      "legislature": "15",
      "typeOrgane": "CMP",
      "dateDebut": "2017-12-14T01:00:00.000+01:00",
      "datePublication": "2017-12-15T01:00:00.000+01:00",
      "dateFin": "2017-12-21T01:00:00.000+01:00",
      "preseance": "28",
      "nominPrincipale": "1",
      "infosQualite": {
        "codeQualite": "Suppléant",
        "libQualite": "Membre suppléant",
        "libQualiteSex": "Membre suppléante"
      },
      "organesRefs": [
        "PO746443"
      ]
    },
    {
      "uid": "PM747645",
      "acteurRef": "PA721764",
      "legislature": "15",
      "typeOrgane": "ORGEXTPARL",
      "dateDebut": "2017-11-02T01:00:00.000+01:00",
      "datePublication": "2017-11-03T01:00:00.000+01:00",
      "preseance": "20",
      "nominPrincipale": "1",
      "infosQualite": {
        "codeQualite": "Titulaire",
        "libQualite": "Membre titulaire",
        "libQualiteSex": "Membre titulaire"
      },
      "organesRefs": [
        "PO422874"
      ]
    },
    {
      "uid": "PM747847",
      "acteurRef": "PA721764",
      "legislature": "15",
      "typeOrgane": "ORGEXTPARL",
      "dateDebut": "2018-01-15T01:00:00.000+01:00",
      "datePublication": "2018-01-16T01:00:00.000+01:00",
      "preseance": "20",
      "nominPrincipale": "1",
      "infosQualite": {
        "codeQualite": "Titulaire",
        "libQualite": "Membre titulaire",
        "libQualiteSex": "Membre titulaire"
      },
      "organesRefs": [
        "PO692699"
      ]
    },
    {
      "uid": "PM750083",
      "acteurRef": "PA721764",
      "legislature": "15",
      "typeOrgane": "GE",
      "dateDebut": "2018-02-14T01:00:00.000+01:00",
      "preseance": "20",
      "nominPrincipale": "1",
      "infosQualite": {
        "codeQualite": "Membre",
        "libQualite": "Membre",
        "libQualiteSex": "Membre"
      },
      "organesRefs": [
        "PO746925"
      ]
    },
    {
      "uid": "PM750818",
      "acteurRef": "PA721764",
      "legislature": "15",
      "typeOrgane": "GE",
      "dateDebut": "2018-02-14T01:00:00.000+01:00",
      "preseance": "20",
      "nominPrincipale": "1",
      "infosQualite": {
        "codeQualite": "Membre",
        "libQualite": "Membre",
        "libQualiteSex": "Membre"
      },
      "organesRefs": [
        "PO747190"
      ]
    },
    {
      "uid": "PM751520",
      "acteurRef": "PA721764",
      "legislature": "15",
      "typeOrgane": "GE",
      "dateDebut": "2018-02-21T01:00:00.000+01:00",
      "preseance": "20",
      "nominPrincipale": "1",
      "infosQualite": {
        "codeQualite": "Membre",
        "libQualite": "Membre",
        "libQualiteSex": "Membre"
      },
      "organesRefs": [
        "PO746837"
      ]
    },
    {
      "uid": "PM752562",
      "acteurRef": "PA721764",
      "legislature": "15",
      "typeOrgane": "MISINFOCOM",
      "dateDebut": "2018-03-06T01:00:00.000+01:00",
      "datePublication": "2018-03-07T01:00:00.000+01:00",
      "dateFin": "2018-07-24T02:00:00.000+02:00",
      "preseance": "20",
      "nominPrincipale": "1",
      "infosQualite": {
        "codeQualite": "Membre",
        "libQualite": "Membre",
        "libQualiteSex": "Membre"
      },
      "organesRefs": [
        "PO752538"
      ]
    },
    {
      "uid": "PM752735",
      "acteurRef": "PA721764",
      "legislature": "15",
      "typeOrgane": "GE",
      "dateDebut": "2018-03-06T01:00:00.000+01:00",
      "preseance": "20",
      "nominPrincipale": "1",
      "infosQualite": {
        "codeQualite": "Membre",
        "libQualite": "Membre",
        "libQualiteSex": "Membre"
      },
      "organesRefs": [
        "PO747220"
      ]
    },
    {
      "uid": "PM755380",
      "acteurRef": "PA721764",
      "legislature": "15",
      "typeOrgane": "GE",
      "dateDebut": "2018-04-11T02:00:00.000+02:00",
      "preseance": "20",
      "nominPrincipale": "1",
      "infosQualite": {
        "codeQualite": "Membre",
        "libQualite": "Membre",
        "libQualiteSex": "Membre"
      },
      "organesRefs": [
        "PO747052"
      ]
    },
    {
      "uid": "PM757091",
      "acteurRef": "PA721764",
      "legislature": "15",
      "typeOrgane": "ORGEXTPARL",
      "dateDebut": "2018-06-04T02:00:00.000+02:00",
      "datePublication": "2018-06-05T02:00:00.000+02:00",
      "preseance": "20",
      "nominPrincipale": "1",
      "infosQualite": {
        "codeQualite": "Titulaire",
        "libQualite": "Membre titulaire",
        "libQualiteSex": "Membre titulaire"
      },
      "organesRefs": [
        "PO756933"
      ]
    },
    {
      "uid": "PM757313",
      "acteurRef": "PA721764",
      "legislature": "15",
      "typeOrgane": "CNPS",
      "dateDebut": "2018-06-27T02:00:00.000+02:00",
      "datePublication": "2018-06-28T02:00:00.000+02:00",
      "preseance": "20",
      "nominPrincipale": "0",
      "infosQualite": {
        "codeQualite": "Membre",
        "libQualite": "Membre",
        "libQualiteSex": "Membre"
      },
      "organesRefs": [
        "PO757134"
      ]
    },
    {
      "uid": "PM757517",
      "acteurRef": "PA721764",
      "legislature": "15",
      "typeOrgane": "CNPS",
      "dateDebut": "2018-07-03T02:00:00.000+02:00",
      "datePublication": "2018-07-04T02:00:00.000+02:00",
      "preseance": "1",
      "nominPrincipale": "1",
      "infosQualite": {
        "codeQualite": "Président",
        "libQualite": "Président",
        "libQualiteSex": "Présidente"
      },
      "organesRefs": [
        "PO757134"
      ]
    }
  ]
}