{
  "uid": "PO744094",
  "codeType": "MINISTERE",
  "libelle": "Secrétariat d'État, auprès du Premier ministre, chargé des relations avec le Parlement",
  "libelleEdition": ", auprès du Premier ministre, chargé des relations avec le Parlement",
  "libelleAbrege": "Relations avec le Parlement",
  "libelleAbrev": "PAR",
  "viMoDe": {
    "dateDebut": "2017-11-25T01:00:00.000+01:00",
    "dateFin": "2018-10-16T02:00:00.000+02:00"
  },
  "organeParentRef": "PO725688"
}