{
  "uid": "PO423028",
  "codeType": "CMP",
  "libelle": "Commission mixte paritaire chargée de proposer un texte sur les dispositions restant en discussion du projet de loi de finances rectificative pour 2010",
  "libelleEdition": "du projet de loi de finances rectificative pour 2010",
  "libelleAbrege": "Loi de finances rectificative pour 2010",
  "libelleAbrev": "2239",
  "viMoDe": {
    "dateDebut": "2010-02-17T01:00:00.000+01:00",
    "dateFin": "2010-02-25T01:00:00.000+01:00"
  },
  "regime": "5ème République",
  "legislature": "13",
  "secretariat": {}
}