{
  "uid": "PA343034",
  "etatCivil": {
    "ident": {
      "civ": "M.",
      "prenom": "Paul",
      "nom": "Jeanneteau",
      "alpha": "Jeanneteau"
    },
    "infoNaissance": {
      "dateNais": "1957-10-14T01:00:00.000+01:00",
      "villeNais": "Angers",
      "depNais": "Maine-et-Loire",
      "paysNais": "France"
    }
  },
  "profession": {
    "libelleCourant": "Pharmacien d'officine",
    "socProcInsee": {
      "catSocPro": "Professions libérales et assimilés",
      "famSocPro": "Cadres et professions intellectuelles supérieures"
    }
  },
  "adresses": [
    {
      "xsiType": "AdressePostale_Type",
      "uid": "AD392604",
      "type": "0",
      "typeLibelle": "Adresse officielle",
      "poids": "1",
      "intitule": "Assemblée nationale,",
      "numeroRue": "126",
      "nomRue": "Rue de l'Université,",
      "codePostal": "75355",
      "ville": "Paris 07 SP"
    },
    {
      "xsiType": "AdressePostale_Type",
      "uid": "AD393866",
      "type": "2",
      "typeLibelle": "Adresse publiée de circonscription",
      "poids": "21",
      "numeroRue": "14",
      "nomRue": "Rue René Brémont",
      "codePostal": "49100",
      "ville": "Angers"
    },
    {
      "xsiType": "AdresseTelephonique_Type",
      "uid": "AD393867",
      "type": "11",
      "typeLibelle": "Téléphone",
      "poids": "21",
      "adresseDeRattachement": "AD393866",
      "valElec": "02 41 87 42 41"
    },
    {
      "xsiType": "AdresseTelephonique_Type",
      "uid": "AD393868",
      "type": "12",
      "typeLibelle": "Télécopie",
      "poids": "21",
      "adresseDeRattachement": "AD393866",
      "valElec": "02 41 87 05 66"
    },
    {
      "xsiType": "AdresseMail_Type",
      "uid": "AD394353",
      "type": "15",
      "typeLibelle": "Mèl",
      "valElec": "pjeanneteau@assemblee-nationale.fr"
    }
  ],
  "mandats": [
    {
      "uid": "PM392585",
      "acteurRef": "PA343034",
      "legislature": "13",
      "typeOrgane": "ASSEMBLEE",
      "dateDebut": "2007-06-20T02:00:00.000+02:00",
      "dateFin": "2012-06-16T02:00:00.000+02:00",
      "preseance": "50",
      "nominPrincipale": "1",
      "infosQualite": {
        "codeQualite": "membre",
        "libQualite": "membre",
        "libQualiteSex": "membre"
      },
      "organesRefs": [
        "PO384266"
      ],
      "election": {
        "lieu": {
          "region": "Pays de la Loire",
          "regionType": "Métropolitain",
          "departement": "Maine-et-Loire",
          "numDepartement": "49",
          "numCirco": "1"
        },
        "causeMandat": "remplacement d'un député nommé au Gouvernement",
        "refCirconscription": "PO384492"
      },
      "mandature": {
        "datePriseFonction": "2007-07-20T02:00:00.000+02:00",
        "causeFin": "Reprise de l'exercice du mandat d'un ancien membre du Gouvernement",
        "premiereElection": "0"
      }
    },
    {
      "uid": "PM392620",
      "acteurRef": "PA343034",
      "legislature": "13",
      "typeOrgane": "GP",
      "dateDebut": "2007-07-20T02:00:00.000+02:00",
      "datePublication": "2007-07-21T02:00:00.000+02:00",
      "dateFin": "2007-07-23T02:00:00.000+02:00",
      "preseance": "28",
      "nominPrincipale": "1",
      "infosQualite": {
        "codeQualite": "Député non-inscrit",
        "libQualite": "Député non-inscrit",
        "libQualiteSex": "Député non-inscrit"
      },
      "organesRefs": [
        "PO387155"
      ]
    },
    {
      "uid": "PM393603",
      "acteurRef": "PA343034",
      "legislature": "13",
      "typeOrgane": "GP",
      "dateDebut": "2007-07-24T02:00:00.000+02:00",
      "datePublication": "2007-07-24T02:00:00.000+02:00",
      "dateFin": "2012-06-16T02:00:00.000+02:00",
      "preseance": "20",
      "nominPrincipale": "1",
      "infosQualite": {
        "codeQualite": "Membre",
        "libQualite": "Membre du",
        "libQualiteSex": "Membre du"
      },
      "organesRefs": [
        "PO389395"
      ]
    },
    {
      "uid": "PM394013",
      "acteurRef": "PA343034",
      "legislature": "13",
      "typeOrgane": "COMPER",
      "dateDebut": "2007-07-27T02:00:00.000+02:00",
      "datePublication": "2007-07-28T02:00:00.000+02:00",
      "dateFin": "2009-06-30T02:00:00.000+02:00",
      "preseance": "32",
      "nominPrincipale": "1",
      "infosQualite": {
        "codeQualite": "Membre",
        "libQualite": "Membre",
        "libQualiteSex": "Membre"
      },
      "organesRefs": [
        "PO59045"
      ]
    },
    {
      "uid": "PM398281",
      "acteurRef": "PA343034",
      "legislature": "13",
      "typeOrgane": "GA",
      "dateDebut": "2007-10-11T02:00:00.000+02:00",
      "dateFin": "2012-06-16T02:00:00.000+02:00",
      "preseance": "20",
      "nominPrincipale": "1",
      "infosQualite": {
        "codeQualite": "Membre",
        "libQualite": "Membre",
        "libQualiteSex": "Membre"
      },
      "organesRefs": [
        "PO393035"
      ]
    },
    {
      "uid": "PM398282",
      "acteurRef": "PA343034",
      "legislature": "13",
      "typeOrgane": "GA",
      "dateDebut": "2007-10-11T02:00:00.000+02:00",
      "dateFin": "2012-06-16T02:00:00.000+02:00",
      "preseance": "20",
      "nominPrincipale": "1",
      "infosQualite": {
        "codeQualite": "Membre",
        "libQualite": "Membre",
        "libQualiteSex": "Membre"
      },
      "organesRefs": [
        "PO393308"
      ]
    },
    {
      "uid": "PM398283",
      "acteurRef": "PA343034",
      "legislature": "13",
      "typeOrgane": "GA",
      "dateDebut": "2007-10-11T02:00:00.000+02:00",
      "dateFin": "2012-06-16T02:00:00.000+02:00",
      "preseance": "20",
      "nominPrincipale": "1",
      "infosQualite": {
        "codeQualite": "Membre",
        "libQualite": "Membre",
        "libQualiteSex": "Membre"
      },
      "organesRefs": [
        "PO393338"
      ]
    },
    {
      "uid": "PM398284",
      "acteurRef": "PA343034",
      "legislature": "13",
      "typeOrgane": "GA",
      "dateDebut": "2007-10-11T02:00:00.000+02:00",
      "dateFin": "2012-06-16T02:00:00.000+02:00",
      "preseance": "20",
      "nominPrincipale": "1",
      "infosQualite": {
        "codeQualite": "Membre",
        "libQualite": "Membre",
        "libQualiteSex": "Membre"
      },
      "organesRefs": [
        "PO393343"
      ]
    },
    {
      "uid": "PM406834",
      "acteurRef": "PA343034",
      "legislature": "13",
      "typeOrgane": "GE",
      "dateDebut": "2008-01-15T01:00:00.000+01:00",
      "dateFin": "2012-06-16T02:00:00.000+02:00",
      "preseance": "20",
      "nominPrincipale": "1",
      "infosQualite": {
        "codeQualite": "Membre",
        "libQualite": "Membre",
        "libQualiteSex": "Membre"
      },
      "organesRefs": [
        "PO402734"
      ]
    },
    {
      "uid": "PM408300",
      "acteurRef": "PA343034",
      "legislature": "13",
      "typeOrgane": "GE",
      "dateDebut": "2008-02-05T01:00:00.000+01:00",
      "dateFin": "2012-06-16T02:00:00.000+02:00",
      "preseance": "8",
      "nominPrincipale": "1",
      "infosQualite": {
        "codeQualite": "Vice-Président",
        "libQualite": "Vice-Président",
        "libQualiteSex": "Vice-Président"
      },
      "organesRefs": [
        "PO402734"
      ]
    },
    {
      "uid": "PM410883",
      "acteurRef": "PA343034",
      "legislature": "13",
      "typeOrgane": "GE",
      "dateDebut": "2008-01-08T01:00:00.000+01:00",
      "dateFin": "2012-06-16T02:00:00.000+02:00",
      "preseance": "20",
      "nominPrincipale": "1",
      "infosQualite": {
        "codeQualite": "Membre",
        "libQualite": "Membre",
        "libQualiteSex": "Membre"
      },
      "organesRefs": [
        "PO402919"
      ]
    },
    {
      "uid": "PM414651",
      "acteurRef": "PA343034",
      "legislature": "13",
      "typeOrgane": "MISINFOPRE",
      "dateDebut": "2008-07-09T02:00:00.000+02:00",
      "datePublication": "2008-07-10T02:00:00.000+02:00",
      "dateFin": "2010-01-22T01:00:00.000+01:00",
      "preseance": "20",
      "nominPrincipale": "1",
      "infosQualite": {
        "codeQualite": "Membre",
        "libQualite": "Membre",
        "libQualiteSex": "Membre"
      },
      "organesRefs": [
        "PO414626"
      ]
    },
    {
      "uid": "PM420500",
      "acteurRef": "PA343034",
      "legislature": "13",
      "typeOrgane": "COMPER",
      "dateDebut": "2009-07-01T02:00:00.000+02:00",
      "datePublication": "2009-07-01T02:00:00.000+02:00",
      "dateFin": "2012-06-16T02:00:00.000+02:00",
      "preseance": "32",
      "nominPrincipale": "1",
      "infosQualite": {
        "codeQualite": "Membre",
        "libQualite": "Membre",
        "libQualiteSex": "Membre"
      },
      "organesRefs": [
        "PO420120"
      ]
    },
    {
      "uid": "PM421987",
      "acteurRef": "PA343034",
      "legislature": "13",
      "typeOrgane": "GE",
      "dateDebut": "2007-10-31T01:00:00.000+01:00",
      "dateFin": "2012-06-16T02:00:00.000+02:00",
      "preseance": "20",
      "nominPrincipale": "1",
      "infosQualite": {
        "codeQualite": "Membre",
        "libQualite": "Membre",
        "libQualiteSex": "Membre"
      },
      "organesRefs": [
        "PO403063"
      ]
    },
    {
      "uid": "PM423405",
      "acteurRef": "PA343034",
      "legislature": "13",
      "typeOrgane": "CNPE",
      "dateDebut": "2010-03-30T02:00:00.000+02:00",
      "datePublication": "2010-03-31T02:00:00.000+02:00",
      "dateFin": "2010-03-30T02:00:00.000+02:00",
      "preseance": "20",
      "nominPrincipale": "1",
      "infosQualite": {
        "codeQualite": "Membre",
        "libQualite": "Membre",
        "libQualiteSex": "Membre"
      },
      "organesRefs": [
        "PO423145"
      ]
    },
    {
      "uid": "PM425660",
      "acteurRef": "PA343034",
      "legislature": "13",
      "typeOrgane": "CNPS",
      "dateDebut": "2010-11-10T01:00:00.000+01:00",
      "datePublication": "2010-11-11T01:00:00.000+01:00",
      "dateFin": "2011-06-23T02:00:00.000+02:00",
      "preseance": "20",
      "nominPrincipale": "1",
      "infosQualite": {
        "codeQualite": "Membre",
        "libQualite": "Membre",
        "libQualiteSex": "Membre"
      },
      "organesRefs": [
        "PO425550"
      ]
    },
    {
      "uid": "PM425852",
      "acteurRef": "PA343034",
      "legislature": "13",
      "typeOrgane": "CNPS",
      "dateDebut": "2010-11-17T01:00:00.000+01:00",
      "datePublication": "2010-11-18T01:00:00.000+01:00",
      "dateFin": "2011-06-23T02:00:00.000+02:00",
      "preseance": "8",
      "nominPrincipale": "1",
      "infosQualite": {
        "codeQualite": "Vice-Président",
        "libQualite": "Vice-Président",
        "libQualiteSex": "Vice-Président"
      },
      "organesRefs": [
        "PO425550"
      ]
    },
    {
      "uid": "PM428808",
      "acteurRef": "PA343034",
      "legislature": "13",
      "typeOrgane": "CMP",
      "dateDebut": "2011-06-14T02:00:00.000+02:00",
      "datePublication": "2011-06-15T02:00:00.000+02:00",
      "dateFin": "2011-07-25T02:00:00.000+02:00",
      "preseance": "20",
      "nominPrincipale": "1",
      "infosQualite": {
        "codeQualite": "Titulaire",
        "libQualite": "Membre titulaire",
        "libQualiteSex": "Membre titulaire"
      },
      "organesRefs": [
        "PO428784"
      ]
    }
  ]
}