{
  "uid": "PO758835",
  "codeType": "GP",
  "libelle": "Socialistes et apparentés",
  "libelleEdition": "du groupe Socialistes et apparentés",
  "libelleAbrege": "SOC",
  "libelleAbrev": "SOC",
  "viMoDe": {
    "dateDebut": "2018-09-12T02:00:00.000+02:00"
  },
  "regime": "5ème République",
  "legislature": "15",
  "secretariat": {},
  "positionPolitique": "Opposition"
}