{
  "uid": "PO425013",
  "codeType": "GE",
  "libelle": "Enseignement privé sous contrat et hors contrat",
  "libelleEdition": "Enseignement privé sous contrat et hors contrat",
  "libelleAbrege": "Enseignement privé sous contrat et hors contrat",
  "libelleAbrev": "ENS PRIV",
  "viMoDe": {
    "dateAgrement": "2010-06-16T02:00:00.000+02:00",
    "dateFin": "2012-06-19T02:00:00.000+02:00"
  },
  "regime": "5ème République",
  "legislature": "13",
  "secretariat": {}
}