{
  "uid": "PA223837",
  "etatCivil": {
    "ident": {
      "civ": "M.",
      "prenom": "Bernard",
      "nom": "Brochand",
      "alpha": "Brochand",
      "trigramme": "BBR"
    },
    "infoNaissance": {
      "dateNais": "1938-06-05T01:00:00.000+01:00",
      "villeNais": "Nice",
      "depNais": "Alpes-Maritimes",
      "paysNais": "France"
    }
  },
  "profession": {
    "libelleCourant": "Cadre du secteur privé retraité",
    "socProcInsee": {
      "catSocPro": "Anciens cadres et professions intermédiaires",
      "famSocPro": "Retraités"
    }
  },
  "uriHatvp": "https://www.hatvp.fr/pages_nominatives/brochand-bernard",
  "adresses": [
    {
      "xsiType": "AdressePostale_Type",
      "uid": "AD386602",
      "type": "0",
      "typeLibelle": "Adresse officielle",
      "poids": "1",
      "intitule": "Assemblée nationale,",
      "numeroRue": "126",
      "nomRue": "Rue de l'Université,",
      "codePostal": "75355",
      "ville": "Paris 07 SP"
    },
    {
      "xsiType": "AdresseMail_Type",
      "uid": "AD391984",
      "type": "15",
      "typeLibelle": "Mèl",
      "valElec": "bernard.brochand@assemblee-nationale.fr"
    },
    {
      "xsiType": "AdressePostale_Type",
      "uid": "AD712107",
      "type": "2",
      "typeLibelle": "Adresse publiée de circonscription",
      "poids": "23",
      "intitule": "Permanence parlementaire",
      "numeroRue": "8",
      "nomRue": "Rue du Docteur Pierre Gazagnaire",
      "codePostal": "06400",
      "ville": "Cannes"
    },
    {
      "xsiType": "AdresseTelephonique_Type",
      "uid": "AD712108",
      "type": "12",
      "typeLibelle": "Télécopie",
      "poids": "23",
      "adresseDeRattachement": "AD712107",
      "valElec": "04 93 68 39 10"
    },
    {
      "xsiType": "AdresseMail_Type",
      "uid": "AD732344",
      "type": "15",
      "typeLibelle": "Mèl",
      "valElec": "permanence.bbrochand@gmail.com"
    },
    {
      "xsiType": "AdresseTelephonique_Type",
      "uid": "AD735286",
      "type": "11",
      "typeLibelle": "Téléphone",
      "poids": "23",
      "adresseDeRattachement": "AD712107",
      "valElec": "04 93 99 07 00"
    },
    {
      "xsiType": "AdresseTelephonique_Type",
      "uid": "AD757817",
      "type": "11",
      "typeLibelle": "Téléphone",
      "poids": "1",
      "adresseDeRattachement": "AD386602",
      "valElec": "01.40.63.67.83"
    }
  ],
  "mandats": [
    {
      "uid": "PM386081",
      "acteurRef": "PA223837",
      "legislature": "13",
      "typeOrgane": "ASSEMBLEE",
      "dateDebut": "2007-06-20T02:00:00.000+02:00",
      "dateFin": "2012-06-19T02:00:00.000+02:00",
      "preseance": "50",
      "nominPrincipale": "1",
      "infosQualite": {
        "codeQualite": "membre",
        "libQualite": "membre",
        "libQualiteSex": "membre"
      },
      "organesRefs": [
        "PO384266"
      ],
      "suppleant": {
        "dateDebut": "2007-06-20T02:00:00.000+02:00",
        "dateFin": "2012-06-19T02:00:00.000+02:00",
        "suppleantRef": "PA224456"
      },
      "election": {
        "lieu": {
          "region": "Provence-Alpes-Côte d'Azur",
          "regionType": "Métropolitain",
          "departement": "Alpes-Maritimes",
          "numDepartement": "06",
          "numCirco": "8"
        },
        "causeMandat": "élections générales",
        "refCirconscription": "PO384291"
      },
      "mandature": {
        "datePriseFonction": "2007-06-20T02:00:00.000+02:00",
        "causeFin": "Fin de législature",
        "premiereElection": "1",
        "placeHemicycle": "082"
      }
    },
    {
      "uid": "PM387181",
      "acteurRef": "PA223837",
      "legislature": "13",
      "typeOrgane": "GP",
      "dateDebut": "2007-06-20T02:00:00.000+02:00",
      "dateFin": "2007-06-26T02:00:00.000+02:00",
      "preseance": "28",
      "nominPrincipale": "1",
      "infosQualite": {
        "codeQualite": "Député non-inscrit",
        "libQualite": "Député non-inscrit",
        "libQualiteSex": "Député non-inscrit"
      },
      "organesRefs": [
        "PO387155"
      ]
    },
    {
      "uid": "PM389732",
      "acteurRef": "PA223837",
      "legislature": "13",
      "typeOrgane": "GP",
      "dateDebut": "2007-06-27T02:00:00.000+02:00",
      "datePublication": "2007-06-27T02:00:00.000+02:00",
      "dateFin": "2012-06-19T02:00:00.000+02:00",
      "preseance": "20",
      "nominPrincipale": "1",
      "infosQualite": {
        "codeQualite": "Membre",
        "libQualite": "Membre du",
        "libQualiteSex": "Membre du"
      },
      "organesRefs": [
        "PO389395"
      ]
    },
    {
      "uid": "PM390370",
      "acteurRef": "PA223837",
      "legislature": "13",
      "typeOrgane": "COMPER",
      "dateDebut": "2007-06-27T02:00:00.000+02:00",
      "datePublication": "2007-06-28T02:00:00.000+02:00",
      "dateFin": "2009-06-30T02:00:00.000+02:00",
      "preseance": "32",
      "nominPrincipale": "1",
      "infosQualite": {
        "codeQualite": "Membre",
        "libQualite": "Membre",
        "libQualiteSex": "Membre"
      },
      "organesRefs": [
        "PO277060"
      ]
    },
    {
      "uid": "PM394545",
      "acteurRef": "PA223837",
      "legislature": "13",
      "typeOrgane": "ORGEXTPARL",
      "dateDebut": "2007-08-01T02:00:00.000+02:00",
      "datePublication": "2007-08-02T02:00:00.000+02:00",
      "dateFin": "2012-06-19T02:00:00.000+02:00",
      "preseance": "20",
      "nominPrincipale": "1",
      "infosQualite": {
        "codeQualite": "Titulaire",
        "libQualite": "Membre titulaire",
        "libQualiteSex": "Membre titulaire"
      },
      "organesRefs": [
        "PO60239"
      ]
    },
    {
      "uid": "PM398793",
      "acteurRef": "PA223837",
      "legislature": "13",
      "typeOrgane": "GA",
      "dateDebut": "2007-10-12T02:00:00.000+02:00",
      "dateFin": "2012-06-19T02:00:00.000+02:00",
      "preseance": "20",
      "nominPrincipale": "1",
      "infosQualite": {
        "codeQualite": "Membre",
        "libQualite": "Membre",
        "libQualiteSex": "Membre"
      },
      "organesRefs": [
        "PO393075"
      ]
    },
    {
      "uid": "PM398794",
      "acteurRef": "PA223837",
      "legislature": "13",
      "typeOrgane": "GA",
      "dateDebut": "2007-10-12T02:00:00.000+02:00",
      "dateFin": "2012-06-19T02:00:00.000+02:00",
      "preseance": "20",
      "nominPrincipale": "1",
      "infosQualite": {
        "codeQualite": "Membre",
        "libQualite": "Membre",
        "libQualiteSex": "Membre"
      },
      "organesRefs": [
        "PO393348"
      ]
    },
    {
      "uid": "PM398795",
      "acteurRef": "PA223837",
      "legislature": "13",
      "typeOrgane": "GA",
      "dateDebut": "2007-10-12T02:00:00.000+02:00",
      "dateFin": "2012-06-19T02:00:00.000+02:00",
      "preseance": "20",
      "nominPrincipale": "1",
      "infosQualite": {
        "codeQualite": "Membre",
        "libQualite": "Membre",
        "libQualiteSex": "Membre"
      },
      "organesRefs": [
        "PO393483"
      ]
    },
    {
      "uid": "PM398796",
      "acteurRef": "PA223837",
      "legislature": "13",
      "typeOrgane": "GA",
      "dateDebut": "2007-10-12T02:00:00.000+02:00",
      "dateFin": "2012-06-19T02:00:00.000+02:00",
      "preseance": "20",
      "nominPrincipale": "1",
      "infosQualite": {
        "codeQualite": "Membre",
        "libQualite": "Membre",
        "libQualiteSex": "Membre"
      },
      "organesRefs": [
        "PO392689"
      ]
    },
    {
      "uid": "PM398797",
      "acteurRef": "PA223837",
      "legislature": "13",
      "typeOrgane": "GA",
      "dateDebut": "2007-10-12T02:00:00.000+02:00",
      "dateFin": "2012-06-19T02:00:00.000+02:00",
      "preseance": "20",
      "nominPrincipale": "1",
      "infosQualite": {
        "codeQualite": "Membre",
        "libQualite": "Membre",
        "libQualiteSex": "Membre"
      },
      "organesRefs": [
        "PO392840"
      ]
    },
    {
      "uid": "PM398798",
      "acteurRef": "PA223837",
      "legislature": "13",
      "typeOrgane": "GA",
      "dateDebut": "2007-10-12T02:00:00.000+02:00",
      "dateFin": "2012-06-19T02:00:00.000+02:00",
      "preseance": "20",
      "nominPrincipale": "1",
      "infosQualite": {
        "codeQualite": "Membre",
        "libQualite": "Membre",
        "libQualiteSex": "Membre"
      },
      "organesRefs": [
        "PO392925"
      ]
    },
    {
      "uid": "PM398799",
      "acteurRef": "PA223837",
      "legislature": "13",
      "typeOrgane": "GA",
      "dateDebut": "2007-10-12T02:00:00.000+02:00",
      "dateFin": "2012-06-19T02:00:00.000+02:00",
      "preseance": "20",
      "nominPrincipale": "1",
      "infosQualite": {
        "codeQualite": "Membre",
        "libQualite": "Membre",
        "libQualiteSex": "Membre"
      },
      "organesRefs": [
        "PO392950"
      ]
    },
    {
      "uid": "PM398800",
      "acteurRef": "PA223837",
      "legislature": "13",
      "typeOrgane": "GA",
      "dateDebut": "2007-10-12T02:00:00.000+02:00",
      "dateFin": "2012-06-19T02:00:00.000+02:00",
      "preseance": "20",
      "nominPrincipale": "1",
      "infosQualite": {
        "codeQualite": "Membre",
        "libQualite": "Membre",
        "libQualiteSex": "Membre"
      },
      "organesRefs": [
        "PO393040"
      ]
    },
    {
      "uid": "PM398801",
      "acteurRef": "PA223837",
      "legislature": "13",
      "typeOrgane": "GA",
      "dateDebut": "2007-10-12T02:00:00.000+02:00",
      "dateFin": "2012-06-19T02:00:00.000+02:00",
      "preseance": "20",
      "nominPrincipale": "1",
      "infosQualite": {
        "codeQualite": "Membre",
        "libQualite": "Membre",
        "libQualiteSex": "Membre"
      },
      "organesRefs": [
        "PO393070"
      ]
    },
    {
      "uid": "PM398802",
      "acteurRef": "PA223837",
      "legislature": "13",
      "typeOrgane": "GA",
      "dateDebut": "2007-10-12T02:00:00.000+02:00",
      "dateFin": "2012-06-19T02:00:00.000+02:00",
      "preseance": "20",
      "nominPrincipale": "1",
      "infosQualite": {
        "codeQualite": "Membre",
        "libQualite": "Membre",
        "libQualiteSex": "Membre"
      },
      "organesRefs": [
        "PO393110"
      ]
    },
    {
      "uid": "PM398803",
      "acteurRef": "PA223837",
      "legislature": "13",
      "typeOrgane": "GA",
      "dateDebut": "2007-10-12T02:00:00.000+02:00",
      "dateFin": "2012-06-19T02:00:00.000+02:00",
      "preseance": "20",
      "nominPrincipale": "1",
      "infosQualite": {
        "codeQualite": "Membre",
        "libQualite": "Membre",
        "libQualiteSex": "Membre"
      },
      "organesRefs": [
        "PO393333"
      ]
    },
    {
      "uid": "PM404588",
      "acteurRef": "PA223837",
      "legislature": "13",
      "typeOrgane": "GE",
      "dateDebut": "2007-11-30T01:00:00.000+01:00",
      "dateFin": "2012-06-19T02:00:00.000+02:00",
      "preseance": "20",
      "nominPrincipale": "0",
      "infosQualite": {
        "codeQualite": "Membre",
        "libQualite": "Membre",
        "libQualiteSex": "Membre"
      },
      "organesRefs": [
        "PO402901"
      ]
    },
    {
      "uid": "PM404589",
      "acteurRef": "PA223837",
      "legislature": "13",
      "typeOrgane": "GE",
      "dateDebut": "2007-11-30T01:00:00.000+01:00",
      "dateFin": "2012-06-19T02:00:00.000+02:00",
      "preseance": "1",
      "nominPrincipale": "1",
      "infosQualite": {
        "codeQualite": "Président",
        "libQualite": "Président",
        "libQualiteSex": "Président"
      },
      "organesRefs": [
        "PO402901"
      ]
    },
    {
      "uid": "PM406334",
      "acteurRef": "PA223837",
      "legislature": "13",
      "typeOrgane": "GE",
      "dateDebut": "2008-01-11T01:00:00.000+01:00",
      "dateFin": "2012-06-19T02:00:00.000+02:00",
      "preseance": "20",
      "nominPrincipale": "1",
      "infosQualite": {
        "codeQualite": "Membre",
        "libQualite": "Membre",
        "libQualiteSex": "Membre"
      },
      "organesRefs": [
        "PO403160"
      ]
    },
    {
      "uid": "PM406980",
      "acteurRef": "PA223837",
      "legislature": "13",
      "typeOrgane": "GA",
      "dateDebut": "2008-01-16T01:00:00.000+01:00",
      "dateFin": "2012-06-19T02:00:00.000+02:00",
      "preseance": "8",
      "nominPrincipale": "1",
      "infosQualite": {
        "codeQualite": "Vice-Président",
        "libQualite": "Vice-Président",
        "libQualiteSex": "Vice-Président"
      },
      "organesRefs": [
        "PO393110"
      ]
    },
    {
      "uid": "PM407320",
      "acteurRef": "PA223837",
      "legislature": "13",
      "typeOrgane": "GE",
      "dateDebut": "2008-01-21T01:00:00.000+01:00",
      "dateFin": "2012-06-19T02:00:00.000+02:00",
      "preseance": "20",
      "nominPrincipale": "1",
      "infosQualite": {
        "codeQualite": "Membre",
        "libQualite": "Membre",
        "libQualiteSex": "Membre"
      },
      "organesRefs": [
        "PO403268"
      ]
    },
    {
      "uid": "PM407324",
      "acteurRef": "PA223837",
      "legislature": "13",
      "typeOrgane": "GE",
      "dateDebut": "2008-01-22T01:00:00.000+01:00",
      "dateFin": "2012-06-19T02:00:00.000+02:00",
      "preseance": "20",
      "nominPrincipale": "1",
      "infosQualite": {
        "codeQualite": "Membre",
        "libQualite": "Membre",
        "libQualiteSex": "Membre"
      },
      "organesRefs": [
        "PO402721"
      ]
    },
    {
      "uid": "PM408691",
      "acteurRef": "PA223837",
      "legislature": "13",
      "typeOrgane": "GE",
      "dateDebut": "2008-02-07T01:00:00.000+01:00",
      "dateFin": "2012-06-19T02:00:00.000+02:00",
      "preseance": "20",
      "nominPrincipale": "1",
      "infosQualite": {
        "codeQualite": "Membre",
        "libQualite": "Membre",
        "libQualiteSex": "Membre"
      },
      "organesRefs": [
        "PO403009"
      ]
    },
    {
      "uid": "PM409535",
      "acteurRef": "PA223837",
      "legislature": "13",
      "typeOrgane": "GE",
      "dateDebut": "2008-02-22T01:00:00.000+01:00",
      "dateFin": "2012-06-19T02:00:00.000+02:00",
      "preseance": "20",
      "nominPrincipale": "1",
      "infosQualite": {
        "codeQualite": "Membre",
        "libQualite": "Membre",
        "libQualiteSex": "Membre"
      },
      "organesRefs": [
        "PO403166"
      ]
    },
    {
      "uid": "PM411143",
      "acteurRef": "PA223837",
      "legislature": "13",
      "typeOrgane": "GE",
      "dateDebut": "2008-03-25T01:00:00.000+01:00",
      "dateFin": "2012-06-19T02:00:00.000+02:00",
      "preseance": "20",
      "nominPrincipale": "1",
      "infosQualite": {
        "codeQualite": "Membre",
        "libQualite": "Membre",
        "libQualiteSex": "Membre"
      },
      "organesRefs": [
        "PO402997"
      ]
    },
    {
      "uid": "PM411341",
      "acteurRef": "PA223837",
      "legislature": "13",
      "typeOrgane": "GE",
      "dateDebut": "2008-03-31T02:00:00.000+02:00",
      "dateFin": "2012-06-19T02:00:00.000+02:00",
      "preseance": "20",
      "nominPrincipale": "1",
      "infosQualite": {
        "codeQualite": "Membre",
        "libQualite": "Membre",
        "libQualiteSex": "Membre"
      },
      "organesRefs": [
        "PO405831"
      ]
    },
    {
      "uid": "PM412055",
      "acteurRef": "PA223837",
      "legislature": "13",
      "typeOrgane": "GE",
      "dateDebut": "2008-01-30T01:00:00.000+01:00",
      "dateFin": "2012-06-19T02:00:00.000+02:00",
      "preseance": "20",
      "nominPrincipale": "1",
      "infosQualite": {
        "codeQualite": "Membre",
        "libQualite": "Membre",
        "libQualiteSex": "Membre"
      },
      "organesRefs": [
        "PO403111"
      ]
    },
    {
      "uid": "PM412180",
      "acteurRef": "PA223837",
      "legislature": "13",
      "typeOrgane": "GE",
      "dateDebut": "2008-04-10T02:00:00.000+02:00",
      "dateFin": "2012-06-19T02:00:00.000+02:00",
      "preseance": "20",
      "nominPrincipale": "1",
      "infosQualite": {
        "codeQualite": "Membre",
        "libQualite": "Membre",
        "libQualiteSex": "Membre"
      },
      "organesRefs": [
        "PO402925"
      ]
    },
    {
      "uid": "PM412599",
      "acteurRef": "PA223837",
      "legislature": "13",
      "typeOrgane": "GE",
      "dateDebut": "2008-04-16T02:00:00.000+02:00",
      "dateFin": "2012-06-19T02:00:00.000+02:00",
      "preseance": "20",
      "nominPrincipale": "1",
      "infosQualite": {
        "codeQualite": "Membre",
        "libQualite": "Membre",
        "libQualiteSex": "Membre"
      },
      "organesRefs": [
        "PO403003"
      ]
    },
    {
      "uid": "PM414199",
      "acteurRef": "PA223837",
      "legislature": "13",
      "typeOrgane": "GE",
      "dateDebut": "2008-06-23T02:00:00.000+02:00",
      "dateFin": "2012-06-19T02:00:00.000+02:00",
      "preseance": "20",
      "nominPrincipale": "1",
      "infosQualite": {
        "codeQualite": "Membre",
        "libQualite": "Membre",
        "libQualiteSex": "Membre"
      },
      "organesRefs": [
        "PO403301"
      ]
    },
    {
      "uid": "PM420445",
      "acteurRef": "PA223837",
      "legislature": "13",
      "typeOrgane": "COMPER",
      "dateDebut": "2009-07-01T02:00:00.000+02:00",
      "datePublication": "2009-07-01T02:00:00.000+02:00",
      "dateFin": "2010-11-09T01:00:00.000+01:00",
      "preseance": "32",
      "nominPrincipale": "1",
      "infosQualite": {
        "codeQualite": "Membre",
        "libQualite": "Membre",
        "libQualiteSex": "Membre"
      },
      "organesRefs": [
        "PO419610"
      ]
    },
    {
      "uid": "PM425608",
      "acteurRef": "PA223837",
      "legislature": "13",
      "typeOrgane": "COMPER",
      "dateDebut": "2010-11-10T01:00:00.000+01:00",
      "datePublication": "2010-11-10T01:00:00.000+01:00",
      "dateFin": "2010-12-01T01:00:00.000+01:00",
      "preseance": "32",
      "nominPrincipale": "1",
      "infosQualite": {
        "codeQualite": "Membre",
        "libQualite": "Membre",
        "libQualiteSex": "Membre"
      },
      "organesRefs": [
        "PO59051"
      ]
    },
    {
      "uid": "PM425967",
      "acteurRef": "PA223837",
      "legislature": "13",
      "typeOrgane": "COMPER",
      "dateDebut": "2010-12-02T01:00:00.000+01:00",
      "datePublication": "2010-12-02T01:00:00.000+01:00",
      "dateFin": "2012-06-19T02:00:00.000+02:00",
      "preseance": "32",
      "nominPrincipale": "1",
      "infosQualite": {
        "codeQualite": "Membre",
        "libQualite": "Membre",
        "libQualiteSex": "Membre"
      },
      "organesRefs": [
        "PO419610"
      ]
    },
    {
      "uid": "PM645440",
      "acteurRef": "PA223837",
      "legislature": "14",
      "typeOrgane": "ASSEMBLEE",
      "dateDebut": "2012-06-20T02:00:00.000+02:00",
      "dateFin": "2017-06-20T02:00:00.000+02:00",
      "preseance": "50",
      "nominPrincipale": "1",
      "infosQualite": {
        "codeQualite": "membre",
        "libQualite": "membre",
        "libQualiteSex": "membre"
      },
      "organesRefs": [
        "PO644420"
      ],
      "suppleant": {
        "dateDebut": "2012-06-20T02:00:00.000+02:00",
        "dateFin": "2017-06-20T02:00:00.000+02:00",
        "suppleantRef": "PA224456"
      },
      "election": {
        "lieu": {
          "region": "Provence-Alpes-Côte d'Azur",
          "regionType": "Métropolitain",
          "departement": "Alpes-Maritimes",
          "numDepartement": "06",
          "numCirco": "8"
        },
        "causeMandat": "élections générales",
        "refCirconscription": "PO644445"
      },
      "mandature": {
        "datePriseFonction": "2012-06-20T02:00:00.000+02:00",
        "causeFin": "Fin de législature",
        "premiereElection": "1",
        "placeHemicycle": "082"
      }
    },
    {
      "uid": "PM656342",
      "acteurRef": "PA223837",
      "legislature": "14",
      "typeOrgane": "GP",
      "dateDebut": "2012-06-26T02:00:00.000+02:00",
      "datePublication": "2012-06-27T02:00:00.000+02:00",
      "dateFin": "2012-11-27T01:00:00.000+01:00",
      "preseance": "20",
      "nominPrincipale": "1",
      "infosQualite": {
        "codeQualite": "Membre",
        "libQualite": "Membre du",
        "libQualiteSex": "Membre du"
      },
      "organesRefs": [
        "PO656006"
      ]
    },
    {
      "uid": "PM657019",
      "acteurRef": "PA223837",
      "legislature": "14",
      "typeOrgane": "COMPER",
      "dateDebut": "2012-06-28T02:00:00.000+02:00",
      "datePublication": "2012-06-28T02:00:00.000+02:00",
      "dateFin": "2017-06-20T02:00:00.000+02:00",
      "preseance": "32",
      "nominPrincipale": "1",
      "infosQualite": {
        "codeQualite": "Membre",
        "libQualite": "Membre",
        "libQualiteSex": "Membre"
      },
      "organesRefs": [
        "PO419604"
      ]
    },
    {
      "uid": "PM682612",
      "acteurRef": "PA223837",
      "legislature": "14",
      "typeOrgane": "GA",
      "dateDebut": "2012-10-18T02:00:00.000+02:00",
      "dateFin": "2017-06-20T02:00:00.000+02:00",
      "preseance": "20",
      "nominPrincipale": "1",
      "infosQualite": {
        "codeQualite": "Membre",
        "libQualite": "Membre",
        "libQualiteSex": "Membre"
      },
      "organesRefs": [
        "PO675786"
      ]
    },
    {
      "uid": "PM683130",
      "acteurRef": "PA223837",
      "legislature": "14",
      "typeOrgane": "GA",
      "dateDebut": "2012-10-23T02:00:00.000+02:00",
      "dateFin": "2017-06-20T02:00:00.000+02:00",
      "preseance": "20",
      "nominPrincipale": "1",
      "infosQualite": {
        "codeQualite": "Membre",
        "libQualite": "Membre",
        "libQualiteSex": "Membre"
      },
      "organesRefs": [
        "PO675761"
      ]
    },
    {
      "uid": "PM683131",
      "acteurRef": "PA223837",
      "legislature": "14",
      "typeOrgane": "GA",
      "dateDebut": "2012-10-23T02:00:00.000+02:00",
      "dateFin": "2017-06-20T02:00:00.000+02:00",
      "preseance": "20",
      "nominPrincipale": "1",
      "infosQualite": {
        "codeQualite": "Membre",
        "libQualite": "Membre",
        "libQualiteSex": "Membre"
      },
      "organesRefs": [
        "PO675789"
      ]
    },
    {
      "uid": "PM684877",
      "acteurRef": "PA223837",
      "legislature": "14",
      "typeOrgane": "GA",
      "dateDebut": "2012-11-21T01:00:00.000+01:00",
      "dateFin": "2017-06-20T02:00:00.000+02:00",
      "preseance": "8",
      "nominPrincipale": "1",
      "infosQualite": {
        "codeQualite": "Vice-Président",
        "libQualite": "Vice-Président",
        "libQualiteSex": "Vice-Président"
      },
      "organesRefs": [
        "PO675761"
      ]
    },
    {
      "uid": "PM684972",
      "acteurRef": "PA223837",
      "legislature": "14",
      "typeOrgane": "GP",
      "dateDebut": "2012-11-27T01:00:00.000+01:00",
      "datePublication": "2012-11-28T01:00:00.000+01:00",
      "dateFin": "2013-01-15T01:00:00.000+01:00",
      "preseance": "20",
      "nominPrincipale": "1",
      "infosQualite": {
        "codeQualite": "Membre",
        "libQualite": "Membre du",
        "libQualiteSex": "Membre du"
      },
      "organesRefs": [
        "PO684957"
      ]
    },
    {
      "uid": "PM685439",
      "acteurRef": "PA223837",
      "typeOrgane": "PARPOL",
      "dateDebut": "2012-12-01T01:00:00.000+01:00",
      "dateFin": "2015-11-30T01:00:00.000+01:00",
      "preseance": "5",
      "nominPrincipale": "1",
      "infosQualite": {
        "codeQualite": "Membre",
        "libQualite": "Membre",
        "libQualiteSex": "Membre"
      },
      "organesRefs": [
        "PO684942"
      ]
    },
    {
      "uid": "PM687938",
      "acteurRef": "PA223837",
      "legislature": "14",
      "typeOrgane": "GP",
      "dateDebut": "2013-01-16T01:00:00.000+01:00",
      "datePublication": "2013-01-16T01:00:00.000+01:00",
      "dateFin": "2015-06-01T02:00:00.000+02:00",
      "preseance": "20",
      "nominPrincipale": "1",
      "infosQualite": {
        "codeQualite": "Membre",
        "libQualite": "Membre du",
        "libQualiteSex": "Membre du"
      },
      "organesRefs": [
        "PO656006"
      ]
    },
    {
      "uid": "PM689804",
      "acteurRef": "PA223837",
      "legislature": "14",
      "typeOrgane": "GE",
      "dateDebut": "2013-01-23T01:00:00.000+01:00",
      "dateFin": "2017-06-20T02:00:00.000+02:00",
      "preseance": "20",
      "nominPrincipale": "1",
      "infosQualite": {
        "codeQualite": "Membre",
        "libQualite": "Membre",
        "libQualiteSex": "Membre"
      },
      "organesRefs": [
        "PO687087"
      ]
    },
    {
      "uid": "PM690268",
      "acteurRef": "PA223837",
      "legislature": "14",
      "typeOrgane": "GE",
      "dateDebut": "2013-01-15T01:00:00.000+01:00",
      "dateFin": "2017-06-20T02:00:00.000+02:00",
      "preseance": "20",
      "nominPrincipale": "1",
      "infosQualite": {
        "codeQualite": "Membre",
        "libQualite": "Membre",
        "libQualiteSex": "Membre"
      },
      "organesRefs": [
        "PO686415"
      ]
    },
    {
      "uid": "PM690352",
      "acteurRef": "PA223837",
      "legislature": "14",
      "typeOrgane": "GE",
      "dateDebut": "2013-02-05T01:00:00.000+01:00",
      "dateFin": "2017-06-20T02:00:00.000+02:00",
      "preseance": "20",
      "nominPrincipale": "1",
      "infosQualite": {
        "codeQualite": "Membre",
        "libQualite": "Membre",
        "libQualiteSex": "Membre"
      },
      "organesRefs": [
        "PO686501"
      ]
    },
    {
      "uid": "PM690416",
      "acteurRef": "PA223837",
      "legislature": "14",
      "typeOrgane": "GE",
      "dateDebut": "2013-02-05T01:00:00.000+01:00",
      "dateFin": "2017-06-20T02:00:00.000+02:00",
      "preseance": "20",
      "nominPrincipale": "1",
      "infosQualite": {
        "codeQualite": "Membre",
        "libQualite": "Membre",
        "libQualiteSex": "Membre"
      },
      "organesRefs": [
        "PO686785"
      ]
    },
    {
      "uid": "PM690866",
      "acteurRef": "PA223837",
      "legislature": "14",
      "typeOrgane": "GE",
      "dateDebut": "2013-02-06T01:00:00.000+01:00",
      "dateFin": "2017-06-20T02:00:00.000+02:00",
      "preseance": "20",
      "nominPrincipale": "1",
      "infosQualite": {
        "codeQualite": "Membre",
        "libQualite": "Membre",
        "libQualiteSex": "Membre"
      },
      "organesRefs": [
        "PO686451"
      ]
    },
    {
      "uid": "PM693966",
      "acteurRef": "PA223837",
      "legislature": "14",
      "typeOrgane": "GA",
      "dateDebut": "2012-12-11T01:00:00.000+01:00",
      "dateFin": "2017-06-20T02:00:00.000+02:00",
      "preseance": "8",
      "nominPrincipale": "1",
      "infosQualite": {
        "codeQualite": "Vice-Président",
        "libQualite": "Vice-Président",
        "libQualiteSex": "Vice-Président"
      },
      "organesRefs": [
        "PO675786"
      ]
    },
    {
      "uid": "PM694191",
      "acteurRef": "PA223837",
      "legislature": "14",
      "typeOrgane": "GE",
      "dateDebut": "2013-04-29T02:00:00.000+02:00",
      "dateFin": "2017-06-20T02:00:00.000+02:00",
      "preseance": "20",
      "nominPrincipale": "1",
      "infosQualite": {
        "codeQualite": "Membre",
        "libQualite": "Membre",
        "libQualiteSex": "Membre"
      },
      "organesRefs": [
        "PO686433"
      ]
    },
    {
      "uid": "PM695684",
      "acteurRef": "PA223837",
      "legislature": "14",
      "typeOrgane": "GA",
      "dateDebut": "2013-07-01T02:00:00.000+02:00",
      "dateFin": "2017-06-20T02:00:00.000+02:00",
      "preseance": "20",
      "nominPrincipale": "1",
      "infosQualite": {
        "codeQualite": "Membre",
        "libQualite": "Membre",
        "libQualiteSex": "Membre"
      },
      "organesRefs": [
        "PO675745"
      ]
    },
    {
      "uid": "PM696419",
      "acteurRef": "PA223837",
      "legislature": "14",
      "typeOrgane": "GE",
      "dateDebut": "2013-07-24T02:00:00.000+02:00",
      "dateFin": "2017-06-20T02:00:00.000+02:00",
      "preseance": "20",
      "nominPrincipale": "1",
      "infosQualite": {
        "codeQualite": "Membre",
        "libQualite": "Membre",
        "libQualiteSex": "Membre"
      },
      "organesRefs": [
        "PO694566"
      ]
    },
    {
      "uid": "PM705612",
      "acteurRef": "PA223837",
      "legislature": "14",
      "typeOrgane": "GE",
      "dateDebut": "2014-12-17T01:00:00.000+01:00",
      "dateFin": "2017-06-20T02:00:00.000+02:00",
      "preseance": "20",
      "nominPrincipale": "1",
      "infosQualite": {
        "codeQualite": "Membre",
        "libQualite": "Membre",
        "libQualiteSex": "Membre"
      },
      "organesRefs": [
        "PO704831"
      ]
    },
    {
      "uid": "PM706352",
      "acteurRef": "PA223837",
      "legislature": "14",
      "typeOrgane": "GA",
      "dateDebut": "2015-02-16T01:00:00.000+01:00",
      "dateFin": "2017-06-20T02:00:00.000+02:00",
      "preseance": "8",
      "nominPrincipale": "1",
      "infosQualite": {
        "codeQualite": "Vice-Président",
        "libQualite": "Vice-Président",
        "libQualiteSex": "Vice-Président"
      },
      "organesRefs": [
        "PO675789"
      ]
    },
    {
      "uid": "PM708174",
      "acteurRef": "PA223837",
      "legislature": "14",
      "typeOrgane": "GP",
      "dateDebut": "2015-06-02T02:00:00.000+02:00",
      "datePublication": "2015-06-02T02:00:00.000+02:00",
      "dateFin": "2017-06-20T02:00:00.000+02:00",
      "preseance": "20",
      "nominPrincipale": "1",
      "infosQualite": {
        "codeQualite": "Membre",
        "libQualite": "Membre du",
        "libQualiteSex": "Membre du"
      },
      "organesRefs": [
        "PO707869"
      ]
    },
    {
      "uid": "PM710421",
      "acteurRef": "PA223837",
      "typeOrgane": "PARPOL",
      "dateDebut": "2015-12-01T01:00:00.000+01:00",
      "dateFin": "2017-06-20T02:00:00.000+02:00",
      "preseance": "5",
      "nominPrincipale": "1",
      "infosQualite": {
        "codeQualite": "Membre",
        "libQualite": "Membre",
        "libQualiteSex": "Membre"
      },
      "organesRefs": [
        "PO710396"
      ]
    },
    {
      "uid": "PM722458",
      "acteurRef": "PA223837",
      "legislature": "15",
      "typeOrgane": "ASSEMBLEE",
      "dateDebut": "2017-06-18T02:00:00.000+02:00",
      "preseance": "50",
      "nominPrincipale": "0",
      "infosQualite": {
        "codeQualite": "membre",
        "libQualite": "membre",
        "libQualiteSex": "membre"
      },
      "organesRefs": [
        "PO717460"
      ],
      "suppleant": {
        "dateDebut": "2017-06-18T02:00:00.000+02:00",
        "suppleantRef": "PA224456"
      },
      "election": {
        "lieu": {
          "region": "Provence-Alpes-Côte d'Azur",
          "regionType": "Métropolitain",
          "departement": "Alpes-Maritimes",
          "numDepartement": "06",
          "numCirco": "8"
        },
        "causeMandat": "élections générales",
        "refCirconscription": "PO717492"
      },
      "mandature": {
        "datePriseFonction": "2017-06-21T02:00:00.000+02:00",
        "premiereElection": "1",
        "placeHemicycle": "082"
      },
      "collaborateurs": [
        {
          "qualite": "M.",
          "prenom": "Stephan",
          "nom": "Pons"
        },
        {
          "qualite": "Mme",
          "prenom": "Isabelle",
          "nom": "Droguet"
        },
        {
          "qualite": "Mme",
          "prenom": "Béatrice",
          "nom": "Frot"
        },
        {
          "qualite": "Mme",
          "prenom": "Magali",
          "nom": "Reilhes"
        }
      ]
    },
    {
      "uid": "PM724270",
      "acteurRef": "PA223837",
      "legislature": "15",
      "typeOrgane": "GP",
      "dateDebut": "2017-06-21T02:00:00.000+02:00",
      "dateFin": "2017-06-26T02:00:00.000+02:00",
      "preseance": "28",
      "nominPrincipale": "1",
      "infosQualite": {
        "codeQualite": "Député non-inscrit",
        "libQualite": "Député non-inscrit",
        "libQualiteSex": "Député non-inscrit"
      },
      "organesRefs": [
        "PO723569"
      ]
    },
    {
      "uid": "PM725372",
      "acteurRef": "PA223837",
      "legislature": "15",
      "typeOrgane": "ASSEMBLEE",
      "dateDebut": "2017-06-21T02:00:00.000+02:00",
      "preseance": "1",
      "nominPrincipale": "1",
      "infosQualite": {
        "codeQualite": "Président d'âge",
        "libQualite": "Président d'âge de l'Assemblée nationale",
        "libQualiteSex": "Président d'âge de l'Assemblée nationale"
      },
      "organesRefs": [
        "PO717460"
      ],
      "election": {
        "lieu": {}
      },
      "mandature": {
        "premiereElection": "0"
      },
      "collaborateurs": [
        {
          "qualite": "M.",
          "prenom": "Stephan",
          "nom": "Pons"
        },
        {
          "qualite": "Mme",
          "prenom": "Isabelle",
          "nom": "Droguet"
        },
        {
          "qualite": "Mme",
          "prenom": "Béatrice",
          "nom": "Frot"
        },
        {
          "qualite": "Mme",
          "prenom": "Magali",
          "nom": "Reilhes"
        }
      ]
    },
    {
      "uid": "PM731293",
      "acteurRef": "PA223837",
      "legislature": "15",
      "typeOrgane": "GP",
      "dateDebut": "2017-06-27T02:00:00.000+02:00",
      "datePublication": "2017-06-28T02:00:00.000+02:00",
      "preseance": "20",
      "nominPrincipale": "1",
      "infosQualite": {
        "codeQualite": "Membre",
        "libQualite": "Membre du",
        "libQualiteSex": "Membre du"
      },
      "organesRefs": [
        "PO730934"
      ]
    },
    {
      "uid": "PM731807",
      "acteurRef": "PA223837",
      "legislature": "15",
      "typeOrgane": "COMPER",
      "dateDebut": "2017-06-29T02:00:00.000+02:00",
      "datePublication": "2017-06-29T02:00:00.000+02:00",
      "preseance": "32",
      "nominPrincipale": "1",
      "infosQualite": {
        "codeQualite": "Membre",
        "libQualite": "Membre",
        "libQualiteSex": "Membre"
      },
      "organesRefs": [
        "PO419604"
      ]
    },
    {
      "uid": "PM738584",
      "acteurRef": "PA223837",
      "legislature": "15",
      "typeOrgane": "GEVI",
      "dateDebut": "2017-10-10T02:00:00.000+02:00",
      "preseance": "20",
      "nominPrincipale": "1",
      "infosQualite": {
        "codeQualite": "Membre",
        "libQualite": "Membre",
        "libQualiteSex": "Membre"
      },
      "organesRefs": [
        "PO733047"
      ]
    },
    {
      "uid": "PM738585",
      "acteurRef": "PA223837",
      "legislature": "15",
      "typeOrgane": "GA",
      "dateDebut": "2017-10-10T02:00:00.000+02:00",
      "preseance": "20",
      "nominPrincipale": "1",
      "infosQualite": {
        "codeQualite": "Membre",
        "libQualite": "Membre",
        "libQualiteSex": "Membre"
      },
      "organesRefs": [
        "PO732919"
      ]
    },
    {
      "uid": "PM738586",
      "acteurRef": "PA223837",
      "legislature": "15",
      "typeOrgane": "GA",
      "dateDebut": "2017-10-10T02:00:00.000+02:00",
      "preseance": "20",
      "nominPrincipale": "1",
      "infosQualite": {
        "codeQualite": "Membre",
        "libQualite": "Membre",
        "libQualiteSex": "Membre"
      },
      "organesRefs": [
        "PO732974"
      ]
    },
    {
      "uid": "PM738587",
      "acteurRef": "PA223837",
      "legislature": "15",
      "typeOrgane": "GA",
      "dateDebut": "2017-10-10T02:00:00.000+02:00",
      "preseance": "20",
      "nominPrincipale": "1",
      "infosQualite": {
        "codeQualite": "Membre",
        "libQualite": "Membre",
        "libQualiteSex": "Membre"
      },
      "organesRefs": [
        "PO733127"
      ]
    },
    {
      "uid": "PM738588",
      "acteurRef": "PA223837",
      "legislature": "15",
      "typeOrgane": "GA",
      "dateDebut": "2017-10-10T02:00:00.000+02:00",
      "preseance": "20",
      "nominPrincipale": "1",
      "infosQualite": {
        "codeQualite": "Membre",
        "libQualite": "Membre",
        "libQualiteSex": "Membre"
      },
      "organesRefs": [
        "PO733202"
      ]
    },
    {
      "uid": "PM738589",
      "acteurRef": "PA223837",
      "legislature": "15",
      "typeOrgane": "GA",
      "dateDebut": "2017-10-10T02:00:00.000+02:00",
      "preseance": "20",
      "nominPrincipale": "1",
      "infosQualite": {
        "codeQualite": "Membre",
        "libQualite": "Membre",
        "libQualiteSex": "Membre"
      },
      "organesRefs": [
        "PO733297"
      ]
    },
    {
      "uid": "PM738590",
      "acteurRef": "PA223837",
      "legislature": "15",
      "typeOrgane": "GA",
      "dateDebut": "2017-10-10T02:00:00.000+02:00",
      "preseance": "20",
      "nominPrincipale": "1",
      "infosQualite": {
        "codeQualite": "Membre",
        "libQualite": "Membre",
        "libQualiteSex": "Membre"
      },
      "organesRefs": [
        "PO733312"
      ]
    },
    {
      "uid": "PM738591",
      "acteurRef": "PA223837",
      "legislature": "15",
      "typeOrgane": "GA",
      "dateDebut": "2017-10-10T02:00:00.000+02:00",
      "preseance": "20",
      "nominPrincipale": "0",
      "infosQualite": {
        "codeQualite": "Membre",
        "libQualite": "Membre",
        "libQualiteSex": "Membre"
      },
      "organesRefs": [
        "PO733367"
      ]
    },
    {
      "uid": "PM738592",
      "acteurRef": "PA223837",
      "legislature": "15",
      "typeOrgane": "GA",
      "dateDebut": "2017-10-10T02:00:00.000+02:00",
      "preseance": "20",
      "nominPrincipale": "1",
      "infosQualite": {
        "codeQualite": "Membre",
        "libQualite": "Membre",
        "libQualiteSex": "Membre"
      },
      "organesRefs": [
        "PO733397"
      ]
    },
    {
      "uid": "PM738593",
      "acteurRef": "PA223837",
      "legislature": "15",
      "typeOrgane": "GA",
      "dateDebut": "2017-10-10T02:00:00.000+02:00",
      "preseance": "20",
      "nominPrincipale": "1",
      "infosQualite": {
        "codeQualite": "Membre",
        "libQualite": "Membre",
        "libQualiteSex": "Membre"
      },
      "organesRefs": [
        "PO733412"
      ]
    },
    {
      "uid": "PM738594",
      "acteurRef": "PA223837",
      "legislature": "15",
      "typeOrgane": "GA",
      "dateDebut": "2017-10-10T02:00:00.000+02:00",
      "preseance": "20",
      "nominPrincipale": "1",
      "infosQualite": {
        "codeQualite": "Membre",
        "libQualite": "Membre",
        "libQualiteSex": "Membre"
      },
      "organesRefs": [
        "PO733472"
      ]
    },
    {
      "uid": "PM738595",
      "acteurRef": "PA223837",
      "legislature": "15",
      "typeOrgane": "GA",
      "dateDebut": "2017-10-10T02:00:00.000+02:00",
      "preseance": "20",
      "nominPrincipale": "1",
      "infosQualite": {
        "codeQualite": "Membre",
        "libQualite": "Membre",
        "libQualiteSex": "Membre"
      },
      "organesRefs": [
        "PO733482"
      ]
    },
    {
      "uid": "PM738596",
      "acteurRef": "PA223837",
      "legislature": "15",
      "typeOrgane": "GA",
      "dateDebut": "2017-10-10T02:00:00.000+02:00",
      "preseance": "20",
      "nominPrincipale": "1",
      "infosQualite": {
        "codeQualite": "Membre",
        "libQualite": "Membre",
        "libQualiteSex": "Membre"
      },
      "organesRefs": [
        "PO733502"
      ]
    },
    {
      "uid": "PM738597",
      "acteurRef": "PA223837",
      "legislature": "15",
      "typeOrgane": "GA",
      "dateDebut": "2017-10-10T02:00:00.000+02:00",
      "preseance": "20",
      "nominPrincipale": "1",
      "infosQualite": {
        "codeQualite": "Membre",
        "libQualite": "Membre",
        "libQualiteSex": "Membre"
      },
      "organesRefs": [
        "PO733567"
      ]
    },
    {
      "uid": "PM738598",
      "acteurRef": "PA223837",
      "legislature": "15",
      "typeOrgane": "GA",
      "dateDebut": "2017-10-10T02:00:00.000+02:00",
      "preseance": "20",
      "nominPrincipale": "0",
      "infosQualite": {
        "codeQualite": "Membre",
        "libQualite": "Membre",
        "libQualiteSex": "Membre"
      },
      "organesRefs": [
        "PO733632"
      ]
    },
    {
      "uid": "PM741938",
      "acteurRef": "PA223837",
      "legislature": "15",
      "typeOrgane": "MISINFO",
      "dateDebut": "2017-09-27T02:00:00.000+02:00",
      "preseance": "10",
      "nominPrincipale": "1",
      "infosQualite": {
        "codeQualite": "Membre",
        "libQualite": "Membre",
        "libQualiteSex": "Membre"
      },
      "organesRefs": [
        "PO741916"
      ]
    },
    {
      "uid": "PM742394",
      "acteurRef": "PA223837",
      "legislature": "15",
      "typeOrgane": "GA",
      "dateDebut": "2017-11-02T01:00:00.000+01:00",
      "preseance": "8",
      "nominPrincipale": "1",
      "infosQualite": {
        "codeQualite": "Vice-Président",
        "libQualite": "Vice-Président",
        "libQualiteSex": "Vice-Président"
      },
      "organesRefs": [
        "PO733367"
      ]
    },
    {
      "uid": "PM744016",
      "acteurRef": "PA223837",
      "legislature": "15",
      "typeOrgane": "GA",
      "dateDebut": "2017-11-23T01:00:00.000+01:00",
      "preseance": "8",
      "nominPrincipale": "1",
      "infosQualite": {
        "codeQualite": "Vice-Président",
        "libQualite": "Vice-Président",
        "libQualiteSex": "Vice-Président"
      },
      "organesRefs": [
        "PO733632"
      ]
    },
    {
      "uid": "PM745577",
      "acteurRef": "PA223837",
      "typeOrgane": "PARPOL",
      "dateDebut": "2017-12-01T01:00:00.000+01:00",
      "preseance": "5",
      "nominPrincipale": "1",
      "infosQualite": {
        "codeQualite": "Membre",
        "libQualite": "Membre",
        "libQualiteSex": "Membre"
      },
      "organesRefs": [
        "PO710396"
      ]
    },
    {
      "uid": "PM751100",
      "acteurRef": "PA223837",
      "legislature": "15",
      "typeOrgane": "GE",
      "dateDebut": "2018-02-19T01:00:00.000+01:00",
      "preseance": "20",
      "nominPrincipale": "1",
      "infosQualite": {
        "codeQualite": "Membre",
        "libQualite": "Membre",
        "libQualiteSex": "Membre"
      },
      "organesRefs": [
        "PO746684"
      ]
    },
    {
      "uid": "PM752536",
      "acteurRef": "PA223837",
      "legislature": "15",
      "typeOrgane": "GE",
      "dateDebut": "2018-03-06T01:00:00.000+01:00",
      "preseance": "20",
      "nominPrincipale": "1",
      "infosQualite": {
        "codeQualite": "Membre",
        "libQualite": "Membre",
        "libQualiteSex": "Membre"
      },
      "organesRefs": [
        "PO746987"
      ]
    },
    {
      "uid": "PM753544",
      "acteurRef": "PA223837",
      "legislature": "15",
      "typeOrgane": "GE",
      "dateDebut": "2018-03-15T01:00:00.000+01:00",
      "preseance": "20",
      "nominPrincipale": "1",
      "infosQualite": {
        "codeQualite": "Membre",
        "libQualite": "Membre",
        "libQualiteSex": "Membre"
      },
      "organesRefs": [
        "PO746689"
      ]
    },
    {
      "uid": "PM756939",
      "acteurRef": "PA223837",
      "legislature": "15",
      "typeOrgane": "ORGEXTPARL",
      "dateDebut": "2018-03-08T01:00:00.000+01:00",
      "datePublication": "2018-03-09T01:00:00.000+01:00",
      "preseance": "20",
      "nominPrincipale": "1",
      "infosQualite": {
        "codeQualite": "Titulaire",
        "libQualite": "Membre titulaire",
        "libQualiteSex": "Membre titulaire"
      },
      "organesRefs": [
        "PO756933"
      ]
    }
  ]
}