{
  "uid": "PA2549",
  "etatCivil": {
    "ident": {
      "civ": "Mme",
      "prenom": "Marie-Line",
      "nom": "Reynaud",
      "alpha": "Reynaud"
    },
    "infoNaissance": {
      "dateNais": "1954-07-17T01:00:00.000+01:00",
      "villeNais": "Barbezieux",
      "depNais": "Charente"
    }
  },
  "profession": {
    "libelleCourant": "Conseillère technique au centre d'information des droits de la femme",
    "socProcInsee": {
      "catSocPro": "Cadres de la fonction publique, professions intellectuelles et  artistiques",
      "famSocPro": "Cadres et professions intellectuelles supérieures"
    }
  },
  "adresses": [
    {
      "xsiType": "AdressePostale_Type",
      "uid": "AD386646",
      "type": "0",
      "typeLibelle": "Adresse officielle",
      "poids": "1",
      "intitule": "Assemblée nationale,",
      "numeroRue": "126",
      "nomRue": "Rue de l'Université,",
      "codePostal": "75355",
      "ville": "Paris 07 SP"
    },
    {
      "xsiType": "AdressePostale_Type",
      "uid": "AD388595",
      "type": "2",
      "typeLibelle": "Adresse publiée de circonscription",
      "poids": "22",
      "numeroRue": "44",
      "nomRue": "Grand rue",
      "complementAdresse": "BP 40",
      "codePostal": "16200",
      "ville": "Jarnac"
    },
    {
      "xsiType": "AdresseTelephonique_Type",
      "uid": "AD388597",
      "type": "11",
      "typeLibelle": "Téléphone",
      "poids": "22",
      "adresseDeRattachement": "AD388595",
      "valElec": "05 45 36 12 85"
    },
    {
      "xsiType": "AdresseTelephonique_Type",
      "uid": "AD388599",
      "type": "12",
      "typeLibelle": "Télécopie",
      "poids": "22",
      "adresseDeRattachement": "AD388595",
      "valElec": "05 45 82 28 81"
    },
    {
      "xsiType": "AdresseSiteWeb_Type",
      "uid": "AD716080",
      "type": "22",
      "typeLibelle": "Site internet",
      "valElec": "www.marie-line-reynaud.com"
    },
    {
      "xsiType": "AdresseMail_Type",
      "uid": "AD716084",
      "type": "15",
      "typeLibelle": "Mèl",
      "valElec": "marie-line.reynaud@wanadoo.fr"
    },
    {
      "xsiType": "AdresseMail_Type",
      "uid": "AD716088",
      "type": "15",
      "typeLibelle": "Mèl",
      "valElec": "mlreynaud@assemblee-nationale.fr"
    }
  ],
  "mandats": [
    {
      "uid": "PM386487",
      "acteurRef": "PA2549",
      "legislature": "13",
      "typeOrgane": "ASSEMBLEE",
      "dateDebut": "2007-06-20T02:00:00.000+02:00",
      "dateFin": "2012-06-19T02:00:00.000+02:00",
      "preseance": "50",
      "nominPrincipale": "1",
      "infosQualite": {
        "codeQualite": "membre",
        "libQualite": "membre",
        "libQualiteSex": "membre"
      },
      "organesRefs": [
        "PO384266"
      ],
      "suppleant": {
        "dateDebut": "2007-06-20T02:00:00.000+02:00",
        "dateFin": "2012-06-19T02:00:00.000+02:00",
        "suppleantRef": "PA340948"
      },
      "election": {
        "lieu": {
          "region": "Nouvelle-Aquitaine",
          "regionType": "Métropolitain",
          "departement": "Charente",
          "numDepartement": "16",
          "numCirco": "2"
        },
        "causeMandat": "élections générales",
        "refCirconscription": "PO384335"
      },
      "mandature": {
        "datePriseFonction": "2007-06-20T02:00:00.000+02:00",
        "causeFin": "Fin de législature",
        "premiereElection": "1"
      }
    },
    {
      "uid": "PM387225",
      "acteurRef": "PA2549",
      "legislature": "13",
      "typeOrgane": "GP",
      "dateDebut": "2007-06-20T02:00:00.000+02:00",
      "dateFin": "2007-06-26T02:00:00.000+02:00",
      "preseance": "28",
      "nominPrincipale": "1",
      "infosQualite": {
        "codeQualite": "Député non-inscrit",
        "libQualite": "Député non-inscrit",
        "libQualiteSex": "Députée non-inscrite"
      },
      "organesRefs": [
        "PO387155"
      ]
    },
    {
      "uid": "PM390082",
      "acteurRef": "PA2549",
      "legislature": "13",
      "typeOrgane": "GP",
      "dateDebut": "2007-06-27T02:00:00.000+02:00",
      "datePublication": "2007-06-27T02:00:00.000+02:00",
      "dateFin": "2012-06-19T02:00:00.000+02:00",
      "preseance": "20",
      "nominPrincipale": "1",
      "infosQualite": {
        "codeQualite": "Membre",
        "libQualite": "Membre du",
        "libQualiteSex": "Membre du"
      },
      "organesRefs": [
        "PO389507"
      ]
    },
    {
      "uid": "PM390789",
      "acteurRef": "PA2549",
      "legislature": "13",
      "typeOrgane": "COMPER",
      "dateDebut": "2007-06-27T02:00:00.000+02:00",
      "datePublication": "2007-06-28T02:00:00.000+02:00",
      "dateFin": "2008-05-07T02:00:00.000+02:00",
      "preseance": "32",
      "nominPrincipale": "1",
      "infosQualite": {
        "codeQualite": "Membre",
        "libQualite": "Membre",
        "libQualiteSex": "Membre"
      },
      "organesRefs": [
        "PO59051"
      ]
    },
    {
      "uid": "PM395772",
      "acteurRef": "PA2549",
      "legislature": "13",
      "typeOrgane": "API",
      "dateDebut": "2007-10-01T02:00:00.000+02:00",
      "datePublication": "2007-10-02T02:00:00.000+02:00",
      "dateFin": "2012-06-19T02:00:00.000+02:00",
      "preseance": "24",
      "nominPrincipale": "1",
      "infosQualite": {
        "codeQualite": "Suppléant",
        "libQualite": "Membre suppléant",
        "libQualiteSex": "Membre suppléante"
      },
      "organesRefs": [
        "PO304272"
      ]
    },
    {
      "uid": "PM395804",
      "acteurRef": "PA2549",
      "legislature": "13",
      "typeOrgane": "API",
      "dateDebut": "2007-10-01T02:00:00.000+02:00",
      "datePublication": "2007-10-02T02:00:00.000+02:00",
      "dateFin": "2012-06-19T02:00:00.000+02:00",
      "preseance": "24",
      "nominPrincipale": "1",
      "infosQualite": {
        "codeQualite": "Suppléant",
        "libQualite": "Représentant suppléant",
        "libQualiteSex": "Représentante suppléante"
      },
      "organesRefs": [
        "PO58977"
      ]
    },
    {
      "uid": "PM395851",
      "acteurRef": "PA2549",
      "legislature": "13",
      "typeOrgane": "API",
      "dateDebut": "2007-10-01T02:00:00.000+02:00",
      "datePublication": "2007-10-02T02:00:00.000+02:00",
      "dateFin": "2012-06-19T02:00:00.000+02:00",
      "preseance": "20",
      "nominPrincipale": "1",
      "infosQualite": {
        "codeQualite": "Membre",
        "libQualite": "Membre",
        "libQualiteSex": "Membre"
      },
      "organesRefs": [
        "PO206064"
      ]
    },
    {
      "uid": "PM397612",
      "acteurRef": "PA2549",
      "legislature": "13",
      "typeOrgane": "GA",
      "dateDebut": "2007-10-09T02:00:00.000+02:00",
      "dateFin": "2012-06-19T02:00:00.000+02:00",
      "preseance": "20",
      "nominPrincipale": "1",
      "infosQualite": {
        "codeQualite": "Membre",
        "libQualite": "Membre",
        "libQualiteSex": "Membre"
      },
      "organesRefs": [
        "PO392694"
      ]
    },
    {
      "uid": "PM397613",
      "acteurRef": "PA2549",
      "legislature": "13",
      "typeOrgane": "GA",
      "dateDebut": "2007-10-09T02:00:00.000+02:00",
      "dateFin": "2012-06-19T02:00:00.000+02:00",
      "preseance": "20",
      "nominPrincipale": "1",
      "infosQualite": {
        "codeQualite": "Membre",
        "libQualite": "Membre",
        "libQualiteSex": "Membre"
      },
      "organesRefs": [
        "PO392704"
      ]
    },
    {
      "uid": "PM397614",
      "acteurRef": "PA2549",
      "legislature": "13",
      "typeOrgane": "GA",
      "dateDebut": "2007-10-09T02:00:00.000+02:00",
      "dateFin": "2012-06-19T02:00:00.000+02:00",
      "preseance": "20",
      "nominPrincipale": "1",
      "infosQualite": {
        "codeQualite": "Membre",
        "libQualite": "Membre",
        "libQualiteSex": "Membre"
      },
      "organesRefs": [
        "PO392925"
      ]
    },
    {
      "uid": "PM397615",
      "acteurRef": "PA2549",
      "legislature": "13",
      "typeOrgane": "GA",
      "dateDebut": "2007-10-09T02:00:00.000+02:00",
      "dateFin": "2012-06-19T02:00:00.000+02:00",
      "preseance": "20",
      "nominPrincipale": "1",
      "infosQualite": {
        "codeQualite": "Membre",
        "libQualite": "Membre",
        "libQualiteSex": "Membre"
      },
      "organesRefs": [
        "PO393075"
      ]
    },
    {
      "uid": "PM397616",
      "acteurRef": "PA2549",
      "legislature": "13",
      "typeOrgane": "GA",
      "dateDebut": "2007-10-09T02:00:00.000+02:00",
      "dateFin": "2012-06-19T02:00:00.000+02:00",
      "preseance": "20",
      "nominPrincipale": "1",
      "infosQualite": {
        "codeQualite": "Membre",
        "libQualite": "Membre",
        "libQualiteSex": "Membre"
      },
      "organesRefs": [
        "PO393100"
      ]
    },
    {
      "uid": "PM401808",
      "acteurRef": "PA2549",
      "legislature": "13",
      "typeOrgane": "GA",
      "dateDebut": "2007-10-29T01:00:00.000+01:00",
      "dateFin": "2012-06-19T02:00:00.000+02:00",
      "preseance": "20",
      "nominPrincipale": "1",
      "infosQualite": {
        "codeQualite": "Membre",
        "libQualite": "Membre",
        "libQualiteSex": "Membre"
      },
      "organesRefs": [
        "PO393513"
      ]
    },
    {
      "uid": "PM402698",
      "acteurRef": "PA2549",
      "legislature": "13",
      "typeOrgane": "GA",
      "dateDebut": "2007-11-07T01:00:00.000+01:00",
      "dateFin": "2012-06-19T02:00:00.000+02:00",
      "preseance": "14",
      "nominPrincipale": "1",
      "infosQualite": {
        "codeQualite": "Secrétaire",
        "libQualite": "Secrétaire",
        "libQualiteSex": "Secrétaire"
      },
      "organesRefs": [
        "PO392704"
      ]
    },
    {
      "uid": "PM408560",
      "acteurRef": "PA2549",
      "legislature": "13",
      "typeOrgane": "GA",
      "dateDebut": "2008-02-04T01:00:00.000+01:00",
      "dateFin": "2012-06-19T02:00:00.000+02:00",
      "preseance": "8",
      "nominPrincipale": "1",
      "infosQualite": {
        "codeQualite": "Vice-Président",
        "libQualite": "Vice-Président",
        "libQualiteSex": "Vice-Présidente"
      },
      "organesRefs": [
        "PO393100"
      ]
    },
    {
      "uid": "PM409206",
      "acteurRef": "PA2549",
      "legislature": "13",
      "typeOrgane": "GE",
      "dateDebut": "2008-02-11T01:00:00.000+01:00",
      "dateFin": "2012-06-19T02:00:00.000+02:00",
      "preseance": "20",
      "nominPrincipale": "1",
      "infosQualite": {
        "codeQualite": "Membre",
        "libQualite": "Membre",
        "libQualiteSex": "Membre"
      },
      "organesRefs": [
        "PO403289"
      ]
    },
    {
      "uid": "PM410350",
      "acteurRef": "PA2549",
      "legislature": "13",
      "typeOrgane": "GE",
      "dateDebut": "2008-02-05T01:00:00.000+01:00",
      "dateFin": "2012-06-19T02:00:00.000+02:00",
      "preseance": "20",
      "nominPrincipale": "0",
      "infosQualite": {
        "codeQualite": "Membre",
        "libQualite": "Membre",
        "libQualiteSex": "Membre"
      },
      "organesRefs": [
        "PO403319"
      ]
    },
    {
      "uid": "PM410377",
      "acteurRef": "PA2549",
      "legislature": "13",
      "typeOrgane": "GE",
      "dateDebut": "2008-02-05T01:00:00.000+01:00",
      "dateFin": "2012-06-19T02:00:00.000+02:00",
      "preseance": "12",
      "nominPrincipale": "1",
      "infosQualite": {
        "codeQualite": "Secrétaire",
        "libQualite": "Secrétaire",
        "libQualiteSex": "Secrétaire"
      },
      "organesRefs": [
        "PO403319"
      ]
    },
    {
      "uid": "PM411133",
      "acteurRef": "PA2549",
      "legislature": "13",
      "typeOrgane": "GE",
      "dateDebut": "2008-03-25T01:00:00.000+01:00",
      "dateFin": "2012-06-19T02:00:00.000+02:00",
      "preseance": "12",
      "nominPrincipale": "1",
      "infosQualite": {
        "codeQualite": "Secrétaire",
        "libQualite": "Secrétaire",
        "libQualiteSex": "Secrétaire"
      },
      "organesRefs": [
        "PO403289"
      ]
    },
    {
      "uid": "PM412457",
      "acteurRef": "PA2549",
      "legislature": "13",
      "typeOrgane": "GE",
      "dateDebut": "2008-02-05T01:00:00.000+01:00",
      "dateFin": "2012-06-19T02:00:00.000+02:00",
      "preseance": "20",
      "nominPrincipale": "1",
      "infosQualite": {
        "codeQualite": "Membre",
        "libQualite": "Membre",
        "libQualiteSex": "Membre"
      },
      "organesRefs": [
        "PO403172"
      ]
    },
    {
      "uid": "PM413326",
      "acteurRef": "PA2549",
      "legislature": "13",
      "typeOrgane": "COMPER",
      "dateDebut": "2008-05-08T02:00:00.000+02:00",
      "datePublication": "2008-05-08T02:00:00.000+02:00",
      "dateFin": "2008-05-23T02:00:00.000+02:00",
      "preseance": "32",
      "nominPrincipale": "1",
      "infosQualite": {
        "codeQualite": "Membre",
        "libQualite": "Membre",
        "libQualiteSex": "Membre"
      },
      "organesRefs": [
        "PO277060"
      ]
    },
    {
      "uid": "PM413519",
      "acteurRef": "PA2549",
      "legislature": "13",
      "typeOrgane": "COMPER",
      "dateDebut": "2008-05-24T02:00:00.000+02:00",
      "datePublication": "2008-05-24T02:00:00.000+02:00",
      "dateFin": "2008-06-18T02:00:00.000+02:00",
      "preseance": "32",
      "nominPrincipale": "1",
      "infosQualite": {
        "codeQualite": "Membre",
        "libQualite": "Membre",
        "libQualiteSex": "Membre"
      },
      "organesRefs": [
        "PO59051"
      ]
    },
    {
      "uid": "PM413927",
      "acteurRef": "PA2549",
      "legislature": "13",
      "typeOrgane": "COMPER",
      "dateDebut": "2008-06-19T02:00:00.000+02:00",
      "datePublication": "2008-06-19T02:00:00.000+02:00",
      "dateFin": "2008-06-26T02:00:00.000+02:00",
      "preseance": "32",
      "nominPrincipale": "1",
      "infosQualite": {
        "codeQualite": "Membre",
        "libQualite": "Membre",
        "libQualiteSex": "Membre"
      },
      "organesRefs": [
        "PO277060"
      ]
    },
    {
      "uid": "PM414332",
      "acteurRef": "PA2549",
      "legislature": "13",
      "typeOrgane": "COMPER",
      "dateDebut": "2008-06-27T02:00:00.000+02:00",
      "datePublication": "2008-06-27T02:00:00.000+02:00",
      "dateFin": "2008-06-30T02:00:00.000+02:00",
      "preseance": "32",
      "nominPrincipale": "1",
      "infosQualite": {
        "codeQualite": "Membre",
        "libQualite": "Membre",
        "libQualiteSex": "Membre"
      },
      "organesRefs": [
        "PO59051"
      ]
    },
    {
      "uid": "PM414404",
      "acteurRef": "PA2549",
      "legislature": "13",
      "typeOrgane": "COMPER",
      "dateDebut": "2008-07-01T02:00:00.000+02:00",
      "datePublication": "2008-07-01T02:00:00.000+02:00",
      "dateFin": "2008-07-11T02:00:00.000+02:00",
      "preseance": "32",
      "nominPrincipale": "1",
      "infosQualite": {
        "codeQualite": "Membre",
        "libQualite": "Membre",
        "libQualiteSex": "Membre"
      },
      "organesRefs": [
        "PO277060"
      ]
    },
    {
      "uid": "PM414471",
      "acteurRef": "PA2549",
      "legislature": "13",
      "typeOrgane": "CMP",
      "dateDebut": "2008-07-02T02:00:00.000+02:00",
      "datePublication": "2008-07-04T02:00:00.000+02:00",
      "dateFin": "2008-07-22T02:00:00.000+02:00",
      "preseance": "20",
      "nominPrincipale": "1",
      "infosQualite": {
        "codeQualite": "Titulaire",
        "libQualite": "Membre titulaire",
        "libQualiteSex": "Membre titulaire"
      },
      "organesRefs": [
        "PO414343"
      ]
    },
    {
      "uid": "PM414681",
      "acteurRef": "PA2549",
      "legislature": "13",
      "typeOrgane": "COMPER",
      "dateDebut": "2008-07-12T02:00:00.000+02:00",
      "datePublication": "2008-07-12T02:00:00.000+02:00",
      "dateFin": "2008-09-30T02:00:00.000+02:00",
      "preseance": "32",
      "nominPrincipale": "1",
      "infosQualite": {
        "codeQualite": "Membre",
        "libQualite": "Membre",
        "libQualiteSex": "Membre"
      },
      "organesRefs": [
        "PO59051"
      ]
    },
    {
      "uid": "PM415705",
      "acteurRef": "PA2549",
      "legislature": "13",
      "typeOrgane": "COMPER",
      "dateDebut": "2008-10-01T02:00:00.000+02:00",
      "datePublication": "2008-10-01T02:00:00.000+02:00",
      "dateFin": "2009-06-30T02:00:00.000+02:00",
      "preseance": "32",
      "nominPrincipale": "1",
      "infosQualite": {
        "codeQualite": "Membre",
        "libQualite": "Membre",
        "libQualiteSex": "Membre"
      },
      "organesRefs": [
        "PO277060"
      ]
    },
    {
      "uid": "PM416180",
      "acteurRef": "PA2549",
      "legislature": "13",
      "typeOrgane": "GE",
      "dateDebut": "2008-09-01T02:00:00.000+02:00",
      "dateFin": "2012-06-19T02:00:00.000+02:00",
      "preseance": "20",
      "nominPrincipale": "0",
      "infosQualite": {
        "codeQualite": "Membre",
        "libQualite": "Membre",
        "libQualiteSex": "Membre"
      },
      "organesRefs": [
        "PO402937"
      ]
    },
    {
      "uid": "PM416198",
      "acteurRef": "PA2549",
      "legislature": "13",
      "typeOrgane": "GE",
      "dateDebut": "2008-09-01T02:00:00.000+02:00",
      "dateFin": "2012-06-19T02:00:00.000+02:00",
      "preseance": "8",
      "nominPrincipale": "1",
      "infosQualite": {
        "codeQualite": "Vice-Président",
        "libQualite": "Vice-Président",
        "libQualiteSex": "Vice-Présidente"
      },
      "organesRefs": [
        "PO402937"
      ]
    },
    {
      "uid": "PM420743",
      "acteurRef": "PA2549",
      "legislature": "13",
      "typeOrgane": "COMPER",
      "dateDebut": "2009-07-01T02:00:00.000+02:00",
      "datePublication": "2009-07-01T02:00:00.000+02:00",
      "dateFin": "2012-06-19T02:00:00.000+02:00",
      "preseance": "32",
      "nominPrincipale": "1",
      "infosQualite": {
        "codeQualite": "Membre",
        "libQualite": "Membre",
        "libQualiteSex": "Membre"
      },
      "organesRefs": [
        "PO419865"
      ]
    },
    {
      "uid": "PM423533",
      "acteurRef": "PA2549",
      "legislature": "13",
      "typeOrgane": "MISINFOPRE",
      "dateDebut": "2010-04-06T02:00:00.000+02:00",
      "datePublication": "2010-04-07T02:00:00.000+02:00",
      "dateFin": "2010-07-01T02:00:00.000+02:00",
      "preseance": "20",
      "nominPrincipale": "1",
      "infosQualite": {
        "codeQualite": "Membre",
        "libQualite": "Membre",
        "libQualiteSex": "Membre"
      },
      "organesRefs": [
        "PO423513"
      ]
    },
    {
      "uid": "PM425629",
      "acteurRef": "PA2549",
      "legislature": "13",
      "typeOrgane": "CNPS",
      "dateDebut": "2010-11-10T01:00:00.000+01:00",
      "datePublication": "2011-11-11T01:00:00.000+01:00",
      "dateFin": "2011-06-23T02:00:00.000+02:00",
      "preseance": "20",
      "nominPrincipale": "1",
      "infosQualite": {
        "codeQualite": "Membre",
        "libQualite": "Membre",
        "libQualiteSex": "Membre"
      },
      "organesRefs": [
        "PO425550"
      ]
    },
    {
      "uid": "PM427182",
      "acteurRef": "PA2549",
      "legislature": "13",
      "typeOrgane": "GE",
      "dateDebut": "2011-02-01T01:00:00.000+01:00",
      "dateFin": "2012-06-19T02:00:00.000+02:00",
      "preseance": "20",
      "nominPrincipale": "1",
      "infosQualite": {
        "codeQualite": "Membre",
        "libQualite": "Membre",
        "libQualiteSex": "Membre"
      },
      "organesRefs": [
        "PO425860"
      ]
    },
    {
      "uid": "PM428503",
      "acteurRef": "PA2549",
      "legislature": "13",
      "typeOrgane": "GE",
      "dateDebut": "2011-05-17T02:00:00.000+02:00",
      "dateFin": "2012-06-19T02:00:00.000+02:00",
      "preseance": "20",
      "nominPrincipale": "1",
      "infosQualite": {
        "codeQualite": "Membre",
        "libQualite": "Membre",
        "libQualiteSex": "Membre"
      },
      "organesRefs": [
        "PO428150"
      ]
    },
    {
      "uid": "PM428656",
      "acteurRef": "PA2549",
      "legislature": "13",
      "typeOrgane": "MISINFOPRE",
      "dateDebut": "2011-06-01T02:00:00.000+02:00",
      "datePublication": "2011-06-02T02:00:00.000+02:00",
      "dateFin": "2011-10-21T02:00:00.000+02:00",
      "preseance": "20",
      "nominPrincipale": "1",
      "infosQualite": {
        "codeQualite": "Membre",
        "libQualite": "Membre",
        "libQualiteSex": "Membre"
      },
      "organesRefs": [
        "PO428587"
      ]
    },
    {
      "uid": "PM430735",
      "acteurRef": "PA2549",
      "legislature": "13",
      "typeOrgane": "CNPS",
      "dateDebut": "2011-10-12T02:00:00.000+02:00",
      "datePublication": "2011-10-14T02:00:00.000+02:00",
      "dateFin": "2012-05-21T02:00:00.000+02:00",
      "preseance": "20",
      "nominPrincipale": "1",
      "infosQualite": {
        "codeQualite": "Membre",
        "libQualite": "Membre",
        "libQualiteSex": "Membre"
      },
      "organesRefs": [
        "PO430584"
      ]
    },
    {
      "uid": "PM508759",
      "acteurRef": "PA2549",
      "legislature": "13",
      "typeOrgane": "CMP",
      "dateDebut": "2012-02-17T01:00:00.000+01:00",
      "datePublication": "2012-02-18T01:00:00.000+01:00",
      "dateFin": "2012-02-29T01:00:00.000+01:00",
      "preseance": "28",
      "nominPrincipale": "1",
      "infosQualite": {
        "codeQualite": "Suppléant",
        "libQualite": "Membre suppléant",
        "libQualiteSex": "Membre suppléante"
      },
      "organesRefs": [
        "PO506485"
      ]
    },
    {
      "uid": "PM645412",
      "acteurRef": "PA2549",
      "legislature": "14",
      "typeOrgane": "ASSEMBLEE",
      "dateDebut": "2012-06-20T02:00:00.000+02:00",
      "dateFin": "2017-06-20T02:00:00.000+02:00",
      "preseance": "50",
      "nominPrincipale": "1",
      "infosQualite": {
        "codeQualite": "membre",
        "libQualite": "membre",
        "libQualiteSex": "membre"
      },
      "organesRefs": [
        "PO644420"
      ],
      "suppleant": {
        "dateDebut": "2012-06-20T02:00:00.000+02:00",
        "dateFin": "2017-06-20T02:00:00.000+02:00",
        "suppleantRef": "PA643093"
      },
      "election": {
        "lieu": {
          "region": "Nouvelle-Aquitaine",
          "regionType": "Métropolitain",
          "departement": "Charente",
          "numDepartement": "16",
          "numCirco": "2"
        },
        "causeMandat": "élections générales",
        "refCirconscription": "PO644489"
      },
      "mandature": {
        "datePriseFonction": "2012-06-20T02:00:00.000+02:00",
        "causeFin": "Fin de législature",
        "premiereElection": "1"
      }
    },
    {
      "uid": "PM656265",
      "acteurRef": "PA2549",
      "legislature": "14",
      "typeOrgane": "GP",
      "dateDebut": "2012-06-26T02:00:00.000+02:00",
      "datePublication": "2012-06-27T02:00:00.000+02:00",
      "dateFin": "2016-05-24T02:00:00.000+02:00",
      "preseance": "20",
      "nominPrincipale": "1",
      "infosQualite": {
        "codeQualite": "Membre",
        "libQualite": "Membre du",
        "libQualiteSex": "Membre du"
      },
      "organesRefs": [
        "PO656002"
      ]
    },
    {
      "uid": "PM657461",
      "acteurRef": "PA2549",
      "legislature": "14",
      "typeOrgane": "COMPER",
      "dateDebut": "2012-06-28T02:00:00.000+02:00",
      "datePublication": "2012-06-28T02:00:00.000+02:00",
      "dateFin": "2013-03-25T01:00:00.000+01:00",
      "preseance": "32",
      "nominPrincipale": "1",
      "infosQualite": {
        "codeQualite": "Membre",
        "libQualite": "Membre",
        "libQualiteSex": "Membre"
      },
      "organesRefs": [
        "PO419865"
      ]
    },
    {
      "uid": "PM671017",
      "acteurRef": "PA2549",
      "legislature": "14",
      "typeOrgane": "COMNL",
      "dateDebut": "2012-07-11T02:00:00.000+02:00",
      "datePublication": "2012-07-11T02:00:00.000+02:00",
      "dateFin": "2017-06-20T02:00:00.000+02:00",
      "preseance": "20",
      "nominPrincipale": "1",
      "infosQualite": {
        "codeQualite": "Membre",
        "libQualite": "Membre",
        "libQualiteSex": "Membre"
      },
      "organesRefs": [
        "PO271860"
      ]
    },
    {
      "uid": "PM677233",
      "acteurRef": "PA2549",
      "legislature": "14",
      "typeOrgane": "COMNL",
      "dateDebut": "2012-07-24T02:00:00.000+02:00",
      "datePublication": "2012-07-25T02:00:00.000+02:00",
      "dateFin": "2017-06-20T02:00:00.000+02:00",
      "preseance": "8",
      "nominPrincipale": "1",
      "infosQualite": {
        "codeQualite": "Vice-Président",
        "libQualite": "Vice-Président",
        "libQualiteSex": "Vice-Présidente"
      },
      "organesRefs": [
        "PO271860"
      ]
    },
    {
      "uid": "PM678205",
      "acteurRef": "PA2549",
      "legislature": "14",
      "typeOrgane": "MISINFOPRE",
      "dateDebut": "2012-09-20T02:00:00.000+02:00",
      "datePublication": "2012-09-21T02:00:00.000+02:00",
      "dateFin": "2013-03-27T01:00:00.000+01:00",
      "preseance": "20",
      "nominPrincipale": "1",
      "infosQualite": {
        "codeQualite": "Membre",
        "libQualite": "Membre",
        "libQualiteSex": "Membre"
      },
      "organesRefs": [
        "PO677887"
      ]
    },
    {
      "uid": "PM678664",
      "acteurRef": "PA2549",
      "legislature": "14",
      "typeOrgane": "GA",
      "dateDebut": "2012-09-26T02:00:00.000+02:00",
      "dateFin": "2017-06-20T02:00:00.000+02:00",
      "preseance": "20",
      "nominPrincipale": "0",
      "infosQualite": {
        "codeQualite": "Membre",
        "libQualite": "Membre",
        "libQualiteSex": "Membre"
      },
      "organesRefs": [
        "PO675760"
      ]
    },
    {
      "uid": "PM678665",
      "acteurRef": "PA2549",
      "legislature": "14",
      "typeOrgane": "GA",
      "dateDebut": "2012-09-26T02:00:00.000+02:00",
      "dateFin": "2017-06-20T02:00:00.000+02:00",
      "preseance": "1",
      "nominPrincipale": "1",
      "infosQualite": {
        "codeQualite": "Président",
        "libQualite": "Président",
        "libQualiteSex": "Présidente"
      },
      "organesRefs": [
        "PO675760"
      ]
    },
    {
      "uid": "PM678817",
      "acteurRef": "PA2549",
      "legislature": "14",
      "typeOrgane": "ORGEXTPARL",
      "dateDebut": "2012-09-28T02:00:00.000+02:00",
      "datePublication": "2012-09-29T02:00:00.000+02:00",
      "dateFin": "2017-06-20T02:00:00.000+02:00",
      "preseance": "20",
      "nominPrincipale": "1",
      "infosQualite": {
        "codeQualite": "Titulaire",
        "libQualite": "Membre titulaire",
        "libQualiteSex": "Membre titulaire"
      },
      "organesRefs": [
        "PO223397"
      ]
    },
    {
      "uid": "PM680340",
      "acteurRef": "PA2549",
      "legislature": "14",
      "typeOrgane": "GA",
      "dateDebut": "2012-10-12T02:00:00.000+02:00",
      "dateFin": "2017-06-20T02:00:00.000+02:00",
      "preseance": "20",
      "nominPrincipale": "1",
      "infosQualite": {
        "codeQualite": "Membre",
        "libQualite": "Membre",
        "libQualiteSex": "Membre"
      },
      "organesRefs": [
        "PO675766"
      ]
    },
    {
      "uid": "PM680341",
      "acteurRef": "PA2549",
      "legislature": "14",
      "typeOrgane": "GA",
      "dateDebut": "2012-10-12T02:00:00.000+02:00",
      "dateFin": "2017-06-20T02:00:00.000+02:00",
      "preseance": "20",
      "nominPrincipale": "1",
      "infosQualite": {
        "codeQualite": "Membre",
        "libQualite": "Membre",
        "libQualiteSex": "Membre"
      },
      "organesRefs": [
        "PO675704"
      ]
    },
    {
      "uid": "PM680342",
      "acteurRef": "PA2549",
      "legislature": "14",
      "typeOrgane": "GA",
      "dateDebut": "2012-10-12T02:00:00.000+02:00",
      "dateFin": "2017-06-20T02:00:00.000+02:00",
      "preseance": "20",
      "nominPrincipale": "1",
      "infosQualite": {
        "codeQualite": "Membre",
        "libQualite": "Membre",
        "libQualiteSex": "Membre"
      },
      "organesRefs": [
        "PO675810"
      ]
    },
    {
      "uid": "PM683954",
      "acteurRef": "PA2549",
      "legislature": "14",
      "typeOrgane": "GA",
      "dateDebut": "2012-11-06T01:00:00.000+01:00",
      "dateFin": "2017-06-20T02:00:00.000+02:00",
      "preseance": "20",
      "nominPrincipale": "1",
      "infosQualite": {
        "codeQualite": "Membre",
        "libQualite": "Membre",
        "libQualiteSex": "Membre"
      },
      "organesRefs": [
        "PO675745"
      ]
    },
    {
      "uid": "PM685984",
      "acteurRef": "PA2549",
      "typeOrgane": "PARPOL",
      "dateDebut": "2012-12-01T01:00:00.000+01:00",
      "dateFin": "2017-06-20T02:00:00.000+02:00",
      "preseance": "5",
      "nominPrincipale": "1",
      "infosQualite": {
        "codeQualite": "Membre",
        "libQualite": "Membre",
        "libQualiteSex": "Membre"
      },
      "organesRefs": [
        "PO684932"
      ]
    },
    {
      "uid": "PM686929",
      "acteurRef": "PA2549",
      "legislature": "14",
      "typeOrgane": "GA",
      "dateDebut": "2012-12-11T01:00:00.000+01:00",
      "dateFin": "2017-06-20T02:00:00.000+02:00",
      "preseance": "8",
      "nominPrincipale": "1",
      "infosQualite": {
        "codeQualite": "Vice-Président",
        "libQualite": "Vice-Président",
        "libQualiteSex": "Vice-Présidente"
      },
      "organesRefs": [
        "PO675766"
      ]
    },
    {
      "uid": "PM689227",
      "acteurRef": "PA2549",
      "legislature": "14",
      "typeOrgane": "GE",
      "dateDebut": "2013-02-01T01:00:00.000+01:00",
      "dateFin": "2017-06-20T02:00:00.000+02:00",
      "preseance": "20",
      "nominPrincipale": "1",
      "infosQualite": {
        "codeQualite": "Membre",
        "libQualite": "Membre",
        "libQualiteSex": "Membre"
      },
      "organesRefs": [
        "PO686510"
      ]
    },
    {
      "uid": "PM692152",
      "acteurRef": "PA2549",
      "legislature": "14",
      "typeOrgane": "GE",
      "dateDebut": "2013-02-27T01:00:00.000+01:00",
      "dateFin": "2017-06-20T02:00:00.000+02:00",
      "preseance": "8",
      "nominPrincipale": "1",
      "infosQualite": {
        "codeQualite": "Vice-Président",
        "libQualite": "Vice-Président",
        "libQualiteSex": "Vice-Présidente"
      },
      "organesRefs": [
        "PO686510"
      ]
    },
    {
      "uid": "PM692982",
      "acteurRef": "PA2549",
      "legislature": "14",
      "typeOrgane": "GE",
      "dateDebut": "2013-03-25T01:00:00.000+01:00",
      "dateFin": "2017-06-20T02:00:00.000+02:00",
      "preseance": "20",
      "nominPrincipale": "1",
      "infosQualite": {
        "codeQualite": "Membre",
        "libQualite": "Membre",
        "libQualiteSex": "Membre"
      },
      "organesRefs": [
        "PO689030"
      ]
    },
    {
      "uid": "PM693005",
      "acteurRef": "PA2549",
      "legislature": "14",
      "typeOrgane": "COMPER",
      "dateDebut": "2013-03-26T01:00:00.000+01:00",
      "datePublication": "2013-03-26T01:00:00.000+01:00",
      "dateFin": "2013-04-12T02:00:00.000+02:00",
      "preseance": "32",
      "nominPrincipale": "1",
      "infosQualite": {
        "codeQualite": "Membre",
        "libQualite": "Membre",
        "libQualiteSex": "Membre"
      },
      "organesRefs": [
        "PO59047"
      ]
    },
    {
      "uid": "PM693596",
      "acteurRef": "PA2549",
      "legislature": "14",
      "typeOrgane": "COMPER",
      "dateDebut": "2013-04-13T02:00:00.000+02:00",
      "datePublication": "2013-04-13T02:00:00.000+02:00",
      "dateFin": "2014-09-30T02:00:00.000+02:00",
      "preseance": "32",
      "nominPrincipale": "1",
      "infosQualite": {
        "codeQualite": "Membre",
        "libQualite": "Membre",
        "libQualiteSex": "Membre"
      },
      "organesRefs": [
        "PO419865"
      ]
    },
    {
      "uid": "PM694146",
      "acteurRef": "PA2549",
      "legislature": "14",
      "typeOrgane": "GE",
      "dateDebut": "2013-04-09T02:00:00.000+02:00",
      "dateFin": "2017-06-20T02:00:00.000+02:00",
      "preseance": "20",
      "nominPrincipale": "0",
      "infosQualite": {
        "codeQualite": "Membre",
        "libQualite": "Membre",
        "libQualiteSex": "Membre"
      },
      "organesRefs": [
        "PO689024"
      ]
    },
    {
      "uid": "PM694154",
      "acteurRef": "PA2549",
      "legislature": "14",
      "typeOrgane": "GE",
      "dateDebut": "2013-04-09T02:00:00.000+02:00",
      "dateFin": "2017-06-20T02:00:00.000+02:00",
      "preseance": "8",
      "nominPrincipale": "1",
      "infosQualite": {
        "codeQualite": "Vice-Président",
        "libQualite": "Vice-Président",
        "libQualiteSex": "Vice-Présidente"
      },
      "organesRefs": [
        "PO689024"
      ]
    },
    {
      "uid": "PM697012",
      "acteurRef": "PA2549",
      "legislature": "14",
      "typeOrgane": "GE",
      "dateDebut": "2013-09-18T02:00:00.000+02:00",
      "dateFin": "2017-06-20T02:00:00.000+02:00",
      "preseance": "20",
      "nominPrincipale": "1",
      "infosQualite": {
        "codeQualite": "Membre",
        "libQualite": "Membre",
        "libQualiteSex": "Membre"
      },
      "organesRefs": [
        "PO695581"
      ]
    },
    {
      "uid": "PM700935",
      "acteurRef": "PA2549",
      "legislature": "14",
      "typeOrgane": "CNPE",
      "dateDebut": "2014-04-16T02:00:00.000+02:00",
      "datePublication": "2014-04-17T02:00:00.000+02:00",
      "dateFin": "2014-10-30T01:00:00.000+01:00",
      "preseance": "20",
      "nominPrincipale": "1",
      "infosQualite": {
        "codeQualite": "Membre",
        "libQualite": "Membre",
        "libQualiteSex": "Membre"
      },
      "organesRefs": [
        "PO700816"
      ]
    },
    {
      "uid": "PM703058",
      "acteurRef": "PA2549",
      "legislature": "14",
      "typeOrgane": "CNPS",
      "dateDebut": "2014-09-02T02:00:00.000+02:00",
      "datePublication": "2014-09-03T02:00:00.000+02:00",
      "dateFin": "2014-09-15T02:00:00.000+02:00",
      "preseance": "20",
      "nominPrincipale": "1",
      "infosQualite": {
        "codeQualite": "Membre",
        "libQualite": "Membre",
        "libQualiteSex": "Membre"
      },
      "organesRefs": [
        "PO702808"
      ]
    },
    {
      "uid": "PM703347",
      "acteurRef": "PA2549",
      "legislature": "14",
      "typeOrgane": "COMPER",
      "dateDebut": "2014-10-01T02:00:00.000+02:00",
      "datePublication": "2014-10-01T02:00:00.000+02:00",
      "dateFin": "2017-06-20T02:00:00.000+02:00",
      "preseance": "32",
      "nominPrincipale": "1",
      "infosQualite": {
        "codeQualite": "Membre",
        "libQualite": "Membre",
        "libQualiteSex": "Membre"
      },
      "organesRefs": [
        "PO59047"
      ]
    },
    {
      "uid": "PM708512",
      "acteurRef": "PA2549",
      "legislature": "14",
      "typeOrgane": "MISINFO",
      "dateDebut": "2015-03-04T01:00:00.000+01:00",
      "dateFin": "2016-06-29T02:00:00.000+02:00",
      "preseance": "10",
      "nominPrincipale": "1",
      "infosQualite": {
        "codeQualite": "Membre",
        "libQualite": "Membre",
        "libQualiteSex": "Membre"
      },
      "organesRefs": [
        "PO708478"
      ]
    },
    {
      "uid": "PM711742",
      "acteurRef": "PA2549",
      "legislature": "14",
      "typeOrgane": "MISINFOCOM",
      "dateDebut": "2016-02-03T01:00:00.000+01:00",
      "dateFin": "2016-10-05T02:00:00.000+02:00",
      "preseance": "20",
      "nominPrincipale": "1",
      "infosQualite": {
        "codeQualite": "Membre",
        "libQualite": "Membre",
        "libQualiteSex": "Membre"
      },
      "organesRefs": [
        "PO711732"
      ]
    },
    {
      "uid": "PM713323",
      "acteurRef": "PA2549",
      "legislature": "14",
      "typeOrgane": "GP",
      "dateDebut": "2016-05-25T02:00:00.000+02:00",
      "dateFin": "2017-06-20T02:00:00.000+02:00",
      "preseance": "20",
      "nominPrincipale": "1",
      "infosQualite": {
        "codeQualite": "Membre",
        "libQualite": "Membre du",
        "libQualiteSex": "Membre du"
      },
      "organesRefs": [
        "PO713077"
      ]
    },
    {
      "uid": "PM714478",
      "acteurRef": "PA2549",
      "legislature": "14",
      "typeOrgane": "MISINFOPRE",
      "dateDebut": "2016-07-19T02:00:00.000+02:00",
      "datePublication": "2016-07-20T02:00:00.000+02:00",
      "dateFin": "2017-02-20T01:00:00.000+01:00",
      "preseance": "20",
      "nominPrincipale": "1",
      "infosQualite": {
        "codeQualite": "Membre",
        "libQualite": "Membre",
        "libQualiteSex": "Membre"
      },
      "organesRefs": [
        "PO714449"
      ]
    }
  ]
}