{
  "uid": "PA267309",
  "etatCivil": {
    "ident": {
      "civ": "M.",
      "prenom": "Patrice",
      "nom": "Debray",
      "alpha": "Debray"
    },
    "infoNaissance": {
      "dateNais": "1951-01-25T01:00:00.000+01:00",
      "villeNais": "Neuerburg",
      "paysNais": "Allemagne"
    }
  },
  "profession": {
    "libelleCourant": "Médecin",
    "socProcInsee": {
      "catSocPro": "Professions libérales et assimilés",
      "famSocPro": "Cadres et professions intellectuelles supérieures"
    }
  },
  "adresses": [
    {
      "xsiType": "AdressePostale_Type",
      "uid": "AD412785",
      "type": "0",
      "typeLibelle": "Adresse officielle",
      "poids": "1",
      "intitule": "Assemblée nationale,",
      "numeroRue": "126",
      "nomRue": "Rue de l'Université,",
      "codePostal": "75355",
      "ville": "Paris 07 SP"
    },
    {
      "xsiType": "AdresseMail_Type",
      "uid": "AD413015",
      "type": "15",
      "typeLibelle": "Mèl",
      "valElec": "pdebray@assemblee-nationale.fr"
    },
    {
      "xsiType": "AdresseMail_Type",
      "uid": "AD413016",
      "type": "15",
      "typeLibelle": "Mèl",
      "valElec": "patricedebray@orange.fr"
    },
    {
      "xsiType": "AdressePostale_Type",
      "uid": "AD413017",
      "type": "2",
      "typeLibelle": "Adresse publiée de circonscription",
      "poids": "21",
      "numeroRue": "5",
      "nomRue": "Avenue Carnot,",
      "codePostal": "70100",
      "ville": "Gray"
    },
    {
      "xsiType": "AdresseTelephonique_Type",
      "uid": "AD413018",
      "type": "11",
      "typeLibelle": "Téléphone",
      "poids": "21",
      "adresseDeRattachement": "AD413017",
      "valElec": "03 84 64 89 81"
    },
    {
      "xsiType": "AdresseTelephonique_Type",
      "uid": "AD413019",
      "type": "12",
      "typeLibelle": "Télécopie",
      "poids": "21",
      "adresseDeRattachement": "AD413017",
      "valElec": "03 84 65 34 42"
    },
    {
      "xsiType": "AdressePostale_Type",
      "uid": "AD413021",
      "type": "2",
      "typeLibelle": "Adresse publiée de circonscription",
      "poids": "22",
      "intitule": "Hôtel de ville,",
      "codePostal": "70000",
      "ville": "Vesoul"
    },
    {
      "xsiType": "AdresseTelephonique_Type",
      "uid": "AD413040",
      "type": "11",
      "typeLibelle": "Téléphone",
      "poids": "22",
      "adresseDeRattachement": "AD413021",
      "valElec": "03 84 76 27 27"
    },
    {
      "xsiType": "AdresseTelephonique_Type",
      "uid": "AD413041",
      "type": "12",
      "typeLibelle": "Télécopie",
      "poids": "22",
      "adresseDeRattachement": "AD413021",
      "valElec": "03 84 96 00 37"
    }
  ],
  "mandats": [
    {
      "uid": "PM412775",
      "acteurRef": "PA267309",
      "legislature": "13",
      "typeOrgane": "ASSEMBLEE",
      "dateDebut": "2007-06-20T02:00:00.000+02:00",
      "dateFin": "2010-08-05T02:00:00.000+02:00",
      "preseance": "50",
      "nominPrincipale": "1",
      "infosQualite": {
        "codeQualite": "membre",
        "libQualite": "membre",
        "libQualiteSex": "membre"
      },
      "organesRefs": [
        "PO384266"
      ],
      "election": {
        "lieu": {
          "region": "Bourgogne-Franche-Comté",
          "regionType": "Métropolitain",
          "departement": "Haute-Saône",
          "numDepartement": "70",
          "numCirco": "1"
        },
        "causeMandat": "remplacement d'un député nommé au Gouvernement",
        "refCirconscription": "PO384640"
      },
      "mandature": {
        "datePriseFonction": "2008-04-19T02:00:00.000+02:00",
        "causeFin": "Reprise de l'exercice du mandat d'un ancien membre du Gouvernement",
        "premiereElection": "0"
      }
    },
    {
      "uid": "PM412779",
      "acteurRef": "PA267309",
      "legislature": "13",
      "typeOrgane": "GP",
      "dateDebut": "2008-04-19T02:00:00.000+02:00",
      "datePublication": "2008-04-20T02:00:00.000+02:00",
      "dateFin": "2008-04-20T02:00:00.000+02:00",
      "preseance": "28",
      "nominPrincipale": "1",
      "infosQualite": {
        "codeQualite": "Député non-inscrit",
        "libQualite": "Député non-inscrit",
        "libQualiteSex": "Député non-inscrit"
      },
      "organesRefs": [
        "PO387155"
      ]
    },
    {
      "uid": "PM412899",
      "acteurRef": "PA267309",
      "legislature": "13",
      "typeOrgane": "GP",
      "dateDebut": "2008-04-21T02:00:00.000+02:00",
      "datePublication": "2008-04-22T02:00:00.000+02:00",
      "dateFin": "2010-08-05T02:00:00.000+02:00",
      "preseance": "20",
      "nominPrincipale": "1",
      "infosQualite": {
        "codeQualite": "Membre",
        "libQualite": "Membre du",
        "libQualiteSex": "Membre du"
      },
      "organesRefs": [
        "PO389395"
      ]
    },
    {
      "uid": "PM413153",
      "acteurRef": "PA267309",
      "legislature": "13",
      "typeOrgane": "GE",
      "dateDebut": "2008-04-28T02:00:00.000+02:00",
      "dateFin": "2010-08-05T02:00:00.000+02:00",
      "preseance": "20",
      "nominPrincipale": "1",
      "infosQualite": {
        "codeQualite": "Membre",
        "libQualite": "Membre",
        "libQualiteSex": "Membre"
      },
      "organesRefs": [
        "PO402991"
      ]
    },
    {
      "uid": "PM413180",
      "acteurRef": "PA267309",
      "legislature": "13",
      "typeOrgane": "COMPER",
      "dateDebut": "2008-04-29T02:00:00.000+02:00",
      "datePublication": "2008-04-29T02:00:00.000+02:00",
      "dateFin": "2009-06-30T02:00:00.000+02:00",
      "preseance": "32",
      "nominPrincipale": "1",
      "infosQualite": {
        "codeQualite": "Membre",
        "libQualite": "Membre",
        "libQualiteSex": "Membre"
      },
      "organesRefs": [
        "PO59045"
      ]
    },
    {
      "uid": "PM414582",
      "acteurRef": "PA267309",
      "legislature": "13",
      "typeOrgane": "GA",
      "dateDebut": "2008-07-08T02:00:00.000+02:00",
      "dateFin": "2010-08-05T02:00:00.000+02:00",
      "preseance": "20",
      "nominPrincipale": "1",
      "infosQualite": {
        "codeQualite": "Membre",
        "libQualite": "Membre",
        "libQualiteSex": "Membre"
      },
      "organesRefs": [
        "PO392674"
      ]
    },
    {
      "uid": "PM414583",
      "acteurRef": "PA267309",
      "legislature": "13",
      "typeOrgane": "GA",
      "dateDebut": "2008-07-08T02:00:00.000+02:00",
      "dateFin": "2010-08-05T02:00:00.000+02:00",
      "preseance": "20",
      "nominPrincipale": "1",
      "infosQualite": {
        "codeQualite": "Membre",
        "libQualite": "Membre",
        "libQualiteSex": "Membre"
      },
      "organesRefs": [
        "PO392940"
      ]
    },
    {
      "uid": "PM414584",
      "acteurRef": "PA267309",
      "legislature": "13",
      "typeOrgane": "GA",
      "dateDebut": "2008-07-08T02:00:00.000+02:00",
      "dateFin": "2010-08-05T02:00:00.000+02:00",
      "preseance": "20",
      "nominPrincipale": "1",
      "infosQualite": {
        "codeQualite": "Membre",
        "libQualite": "Membre",
        "libQualiteSex": "Membre"
      },
      "organesRefs": [
        "PO392950"
      ]
    },
    {
      "uid": "PM414585",
      "acteurRef": "PA267309",
      "legislature": "13",
      "typeOrgane": "GA",
      "dateDebut": "2008-07-08T02:00:00.000+02:00",
      "dateFin": "2010-08-05T02:00:00.000+02:00",
      "preseance": "20",
      "nominPrincipale": "1",
      "infosQualite": {
        "codeQualite": "Membre",
        "libQualite": "Membre",
        "libQualiteSex": "Membre"
      },
      "organesRefs": [
        "PO393075"
      ]
    },
    {
      "uid": "PM414586",
      "acteurRef": "PA267309",
      "legislature": "13",
      "typeOrgane": "GA",
      "dateDebut": "2008-07-08T02:00:00.000+02:00",
      "dateFin": "2010-08-05T02:00:00.000+02:00",
      "preseance": "20",
      "nominPrincipale": "1",
      "infosQualite": {
        "codeQualite": "Membre",
        "libQualite": "Membre",
        "libQualiteSex": "Membre"
      },
      "organesRefs": [
        "PO393085"
      ]
    },
    {
      "uid": "PM414587",
      "acteurRef": "PA267309",
      "legislature": "13",
      "typeOrgane": "GA",
      "dateDebut": "2008-07-08T02:00:00.000+02:00",
      "dateFin": "2010-08-05T02:00:00.000+02:00",
      "preseance": "20",
      "nominPrincipale": "1",
      "infosQualite": {
        "codeQualite": "Membre",
        "libQualite": "Membre",
        "libQualiteSex": "Membre"
      },
      "organesRefs": [
        "PO393363"
      ]
    },
    {
      "uid": "PM414588",
      "acteurRef": "PA267309",
      "legislature": "13",
      "typeOrgane": "GA",
      "dateDebut": "2008-07-08T02:00:00.000+02:00",
      "dateFin": "2010-08-05T02:00:00.000+02:00",
      "preseance": "20",
      "nominPrincipale": "1",
      "infosQualite": {
        "codeQualite": "Membre",
        "libQualite": "Membre",
        "libQualiteSex": "Membre"
      },
      "organesRefs": [
        "PO393508"
      ]
    },
    {
      "uid": "PM414791",
      "acteurRef": "PA267309",
      "legislature": "13",
      "typeOrgane": "GA",
      "dateDebut": "2008-07-16T02:00:00.000+02:00",
      "dateFin": "2010-08-05T02:00:00.000+02:00",
      "preseance": "20",
      "nominPrincipale": "1",
      "infosQualite": {
        "codeQualite": "Membre",
        "libQualite": "Membre",
        "libQualiteSex": "Membre"
      },
      "organesRefs": [
        "PO393443"
      ]
    },
    {
      "uid": "PM414792",
      "acteurRef": "PA267309",
      "legislature": "13",
      "typeOrgane": "GA",
      "dateDebut": "2008-07-16T02:00:00.000+02:00",
      "dateFin": "2010-08-05T02:00:00.000+02:00",
      "preseance": "20",
      "nominPrincipale": "1",
      "infosQualite": {
        "codeQualite": "Membre",
        "libQualite": "Membre",
        "libQualiteSex": "Membre"
      },
      "organesRefs": [
        "PO393005"
      ]
    },
    {
      "uid": "PM415397",
      "acteurRef": "PA267309",
      "legislature": "13",
      "typeOrgane": "GE",
      "dateDebut": "2008-04-28T02:00:00.000+02:00",
      "dateFin": "2010-08-05T02:00:00.000+02:00",
      "preseance": "20",
      "nominPrincipale": "1",
      "infosQualite": {
        "codeQualite": "Membre",
        "libQualite": "Membre",
        "libQualiteSex": "Membre"
      },
      "organesRefs": [
        "PO403325"
      ]
    },
    {
      "uid": "PM416229",
      "acteurRef": "PA267309",
      "legislature": "13",
      "typeOrgane": "GE",
      "dateDebut": "2008-10-02T02:00:00.000+02:00",
      "dateFin": "2010-08-05T02:00:00.000+02:00",
      "preseance": "8",
      "nominPrincipale": "1",
      "infosQualite": {
        "codeQualite": "Vice-Président",
        "libQualite": "Vice-Président",
        "libQualiteSex": "Vice-Président"
      },
      "organesRefs": [
        "PO403325"
      ]
    },
    {
      "uid": "PM420405",
      "acteurRef": "PA267309",
      "legislature": "13",
      "typeOrgane": "COMPER",
      "dateDebut": "2009-07-01T02:00:00.000+02:00",
      "datePublication": "2009-07-01T02:00:00.000+02:00",
      "dateFin": "2010-08-05T02:00:00.000+02:00",
      "preseance": "32",
      "nominPrincipale": "1",
      "infosQualite": {
        "codeQualite": "Membre",
        "libQualite": "Membre",
        "libQualiteSex": "Membre"
      },
      "organesRefs": [
        "PO419604"
      ]
    },
    {
      "uid": "PM423153",
      "acteurRef": "PA267309",
      "legislature": "13",
      "typeOrgane": "GA",
      "dateDebut": "2010-02-25T01:00:00.000+01:00",
      "dateFin": "2010-08-05T02:00:00.000+02:00",
      "preseance": "20",
      "nominPrincipale": "1",
      "infosQualite": {
        "codeQualite": "Membre",
        "libQualite": "Membre",
        "libQualiteSex": "Membre"
      },
      "organesRefs": [
        "PO393192"
      ]
    },
    {
      "uid": "PM423154",
      "acteurRef": "PA267309",
      "legislature": "13",
      "typeOrgane": "GA",
      "dateDebut": "2010-02-25T01:00:00.000+01:00",
      "dateFin": "2010-08-05T02:00:00.000+02:00",
      "preseance": "20",
      "nominPrincipale": "1",
      "infosQualite": {
        "codeQualite": "Membre",
        "libQualite": "Membre",
        "libQualiteSex": "Membre"
      },
      "organesRefs": [
        "PO393468"
      ]
    },
    {
      "uid": "PM423394",
      "acteurRef": "PA267309",
      "legislature": "13",
      "typeOrgane": "CNPE",
      "dateDebut": "2010-03-30T02:00:00.000+02:00",
      "datePublication": "2010-03-31T02:00:00.000+02:00",
      "dateFin": "2010-07-06T02:00:00.000+02:00",
      "preseance": "20",
      "nominPrincipale": "1",
      "infosQualite": {
        "codeQualite": "Membre",
        "libQualite": "Membre",
        "libQualiteSex": "Membre"
      },
      "organesRefs": [
        "PO423145"
      ]
    }
  ]
}