{
  "uid": "PO675807",
  "codeType": "GA",
  "libelle": "France-Salvador",
  "libelleEdition": "de France-Salvador",
  "libelleAbrege": "Salvador",
  "libelleAbrev": "SAL",
  "viMoDe": {
    "dateAgrement": "2012-07-18T02:00:00.000+02:00",
    "dateFin": "2017-06-20T02:00:00.000+02:00"
  },
  "regime": "5ème République",
  "legislature": "14",
  "secretariat": {}
}