{
  "uid": "PO704574",
  "codeType": "CMP",
  "libelle": "Commission mixte paritaire chargée de proposer un texte sur les dispositions restant en discussion du projet de loi de programmation des finances publiques pour 2014 à 2019",
  "libelleEdition": "du projet de loi de programmation des finances publiques pour 2014 à 2019",
  "libelleAbrege": "Programmation finances publiques 2014 2019",
  "libelleAbrev": "2236",
  "viMoDe": {
    "dateDebut": "2014-11-07T01:00:00.000+01:00",
    "dateFin": "2014-12-18T01:00:00.000+01:00"
  },
  "regime": "5ème République",
  "legislature": "14",
  "secretariat": {}
}