{
  "uid": "PO746684",
  "codeType": "GE",
  "libelle": "Cinéma et production audiovisuelle",
  "libelleEdition": "CINÉMA ET PRODUCTION AUDIOVISUELLE",
  "libelleAbrege": "CINÉMA ET PRODUCTION AUDIOVISUELLE",
  "libelleAbrev": "CINÉMA",
  "viMoDe": {
    "dateAgrement": "2017-12-20T01:00:00.000+01:00"
  },
  "regime": "5ème République",
  "legislature": "15",
  "secretariat": {
    "secretaire01": "M. Charles Boriaud"
  }
}