{
  "uid": "PO402979",
  "codeType": "GE",
  "libelle": "Fruits et légumes",
  "libelleEdition": "sur les fruits et les légumes",
  "libelleAbrege": "Fruits et légumes",
  "libelleAbrev": "FRU",
  "viMoDe": {
    "dateAgrement": "2007-10-31T01:00:00.000+01:00",
    "dateFin": "2012-06-19T02:00:00.000+02:00"
  },
  "regime": "5ème République",
  "legislature": "13",
  "secretariat": {}
}