{
  "uid": "PA642984",
  "etatCivil": {
    "ident": {
      "civ": "M.",
      "prenom": "Pierre",
      "nom": "Léautey",
      "alpha": "Leautey"
    },
    "infoNaissance": {
      "dateNais": "1946-12-12T01:00:00.000+01:00",
      "villeNais": "Paris",
      "depNais": "Paris",
      "paysNais": "France"
    }
  },
  "profession": {
    "libelleCourant": "Consultant en gestion",
    "socProcInsee": {
      "catSocPro": "Professions libérales et assimilés",
      "famSocPro": "Cadres et professions intellectuelles supérieures"
    }
  },
  "adresses": [
    {
      "xsiType": "AdressePostale_Type",
      "uid": "AD676848",
      "type": "0",
      "typeLibelle": "Adresse officielle",
      "poids": "1",
      "intitule": "Assemblée nationale",
      "numeroRue": "126",
      "nomRue": "Rue de l'Université",
      "codePostal": "75355",
      "ville": "Paris 07 SP"
    },
    {
      "xsiType": "AdressePostale_Type",
      "uid": "AD676849",
      "type": "2",
      "typeLibelle": "Adresse publiée de circonscription",
      "poids": "22",
      "numeroRue": "23",
      "nomRue": "Rue de la République",
      "codePostal": "76000",
      "ville": "Rouen"
    },
    {
      "xsiType": "AdresseMail_Type",
      "uid": "AD677284",
      "type": "15",
      "typeLibelle": "Mèl",
      "valElec": "pleautey@assemblee-nationale.fr"
    },
    {
      "xsiType": "AdresseSiteWeb_Type",
      "uid": "AD691145",
      "type": "22",
      "typeLibelle": "Site internet",
      "valElec": "www.pierre-leautey.fr"
    }
  ],
  "mandats": [
    {
      "uid": "PM676806",
      "acteurRef": "PA642984",
      "legislature": "14",
      "typeOrgane": "ASSEMBLEE",
      "dateDebut": "2012-06-20T02:00:00.000+02:00",
      "dateFin": "2014-07-03T02:00:00.000+02:00",
      "preseance": "50",
      "nominPrincipale": "1",
      "infosQualite": {
        "codeQualite": "membre",
        "libQualite": "membre",
        "libQualiteSex": "membre"
      },
      "organesRefs": [
        "PO644420"
      ],
      "election": {
        "lieu": {
          "region": "Normandie",
          "regionType": "Métropolitain",
          "departement": "Seine-Maritime",
          "numDepartement": "76",
          "numCirco": "1"
        },
        "causeMandat": "remplacement d'un député nommé au Gouvernement",
        "refCirconscription": "PO644837"
      },
      "mandature": {
        "datePriseFonction": "2012-07-22T02:00:00.000+02:00",
        "causeFin": "Reprise de l'exercice du mandat d'un ancien membre du Gouvernement",
        "premiereElection": "0"
      }
    },
    {
      "uid": "PM676901",
      "acteurRef": "PA642984",
      "legislature": "14",
      "typeOrgane": "GP",
      "dateDebut": "2012-07-22T02:00:00.000+02:00",
      "dateFin": "2012-07-23T02:00:00.000+02:00",
      "preseance": "28",
      "nominPrincipale": "1",
      "infosQualite": {
        "codeQualite": "Député non-inscrit",
        "libQualite": "Député non-inscrit",
        "libQualiteSex": "Député non-inscrit"
      },
      "organesRefs": [
        "PO645633"
      ]
    },
    {
      "uid": "PM676920",
      "acteurRef": "PA642984",
      "legislature": "14",
      "typeOrgane": "GP",
      "dateDebut": "2012-07-24T02:00:00.000+02:00",
      "datePublication": "2012-07-24T02:00:00.000+02:00",
      "dateFin": "2014-07-03T02:00:00.000+02:00",
      "preseance": "20",
      "nominPrincipale": "1",
      "infosQualite": {
        "codeQualite": "Membre",
        "libQualite": "Membre du",
        "libQualiteSex": "Membre du"
      },
      "organesRefs": [
        "PO656002"
      ]
    },
    {
      "uid": "PM677264",
      "acteurRef": "PA642984",
      "legislature": "14",
      "typeOrgane": "COMPER",
      "dateDebut": "2012-07-25T02:00:00.000+02:00",
      "datePublication": "2012-07-25T02:00:00.000+02:00",
      "dateFin": "2014-06-03T02:00:00.000+02:00",
      "preseance": "32",
      "nominPrincipale": "1",
      "infosQualite": {
        "codeQualite": "Membre",
        "libQualite": "Membre",
        "libQualiteSex": "Membre"
      },
      "organesRefs": [
        "PO419604"
      ]
    },
    {
      "uid": "PM683904",
      "acteurRef": "PA642984",
      "legislature": "14",
      "typeOrgane": "GA",
      "dateDebut": "2012-11-06T01:00:00.000+01:00",
      "dateFin": "2014-06-03T02:00:00.000+02:00",
      "preseance": "20",
      "nominPrincipale": "1",
      "infosQualite": {
        "codeQualite": "Membre",
        "libQualite": "Membre",
        "libQualiteSex": "Membre"
      },
      "organesRefs": [
        "PO675730"
      ]
    },
    {
      "uid": "PM685911",
      "acteurRef": "PA642984",
      "typeOrgane": "PARPOL",
      "dateDebut": "2012-12-01T01:00:00.000+01:00",
      "dateFin": "2014-07-03T02:00:00.000+02:00",
      "preseance": "5",
      "nominPrincipale": "1",
      "infosQualite": {
        "codeQualite": "Membre",
        "libQualite": "Membre",
        "libQualiteSex": "Membre"
      },
      "organesRefs": [
        "PO684932"
      ]
    },
    {
      "uid": "PM687359",
      "acteurRef": "PA642984",
      "legislature": "14",
      "typeOrgane": "GA",
      "dateDebut": "2012-11-27T01:00:00.000+01:00",
      "dateFin": "2014-06-03T02:00:00.000+02:00",
      "preseance": "8",
      "nominPrincipale": "1",
      "infosQualite": {
        "codeQualite": "Vice-Président",
        "libQualite": "Vice-Président",
        "libQualiteSex": "Vice-Président"
      },
      "organesRefs": [
        "PO675730"
      ]
    },
    {
      "uid": "PM688641",
      "acteurRef": "PA642984",
      "legislature": "14",
      "typeOrgane": "GE",
      "dateDebut": "2013-01-24T01:00:00.000+01:00",
      "dateFin": "2014-06-03T02:00:00.000+02:00",
      "preseance": "20",
      "nominPrincipale": "1",
      "infosQualite": {
        "codeQualite": "Membre",
        "libQualite": "Membre",
        "libQualiteSex": "Membre"
      },
      "organesRefs": [
        "PO686232"
      ]
    },
    {
      "uid": "PM691837",
      "acteurRef": "PA642984",
      "legislature": "14",
      "typeOrgane": "GE",
      "dateDebut": "2013-02-21T01:00:00.000+01:00",
      "dateFin": "2014-06-03T02:00:00.000+02:00",
      "preseance": "20",
      "nominPrincipale": "1",
      "infosQualite": {
        "codeQualite": "Membre",
        "libQualite": "Membre",
        "libQualiteSex": "Membre"
      },
      "organesRefs": [
        "PO686204"
      ]
    },
    {
      "uid": "PM693435",
      "acteurRef": "PA642984",
      "legislature": "14",
      "typeOrgane": "GE",
      "dateDebut": "2013-04-10T02:00:00.000+02:00",
      "dateFin": "2014-06-03T02:00:00.000+02:00",
      "preseance": "8",
      "nominPrincipale": "1",
      "infosQualite": {
        "codeQualite": "Vice-Président",
        "libQualite": "Vice-Président",
        "libQualiteSex": "Vice-Président"
      },
      "organesRefs": [
        "PO689018"
      ]
    }
  ]
}