{
  "uid": "PA719972",
  "etatCivil": {
    "ident": {
      "civ": "Mme",
      "prenom": "Nathalie",
      "nom": "Sarles",
      "alpha": "Sarles",
      "trigramme": "NSR"
    },
    "infoNaissance": {
      "dateNais": "1962-04-17T01:00:00.000+01:00",
      "villeNais": "Valence",
      "depNais": "Drôme",
      "paysNais": "France"
    }
  },
  "profession": {
    "libelleCourant": "Salariée du secteur médical",
    "socProcInsee": {
      "catSocPro": "Employés administratifs d'entreprise",
      "famSocPro": "Employés"
    }
  },
  "uriHatvp": "https://www.hatvp.fr/pages_nominatives/sarles-nathalie",
  "adresses": [
    {
      "xsiType": "AdressePostale_Type",
      "uid": "AD719974",
      "type": "0",
      "typeLibelle": "Adresse officielle",
      "poids": "1",
      "intitule": "Assemblée nationale,",
      "numeroRue": "126",
      "nomRue": "Rue de l'Université,",
      "codePostal": "75355",
      "ville": "Paris 07 SP"
    },
    {
      "xsiType": "AdresseMail_Type",
      "uid": "AD728097",
      "type": "15",
      "typeLibelle": "Mèl",
      "valElec": "nathalie.sarles@assemblee-nationale.fr"
    },
    {
      "xsiType": "AdresseMail_Type",
      "uid": "AD729002",
      "type": "15",
      "typeLibelle": "Mèl",
      "valElec": "contact@nathaliesarles.fr"
    },
    {
      "xsiType": "AdresseSiteWeb_Type",
      "uid": "AD747568",
      "type": "22",
      "typeLibelle": "Site internet",
      "valElec": "www.nathaliesarles.fr"
    },
    {
      "xsiType": "AdressePostale_Type",
      "uid": "AD747570",
      "type": "2",
      "typeLibelle": "Adresse publiée de circonscription",
      "poids": "2",
      "intitule": "Résidence les Pascalines",
      "numeroRue": "17",
      "nomRue": "Jardin des Balmes",
      "codePostal": "42120",
      "ville": "Le Coteau"
    }
  ],
  "mandats": [
    {
      "uid": "PM722820",
      "acteurRef": "PA719972",
      "legislature": "15",
      "typeOrgane": "ASSEMBLEE",
      "dateDebut": "2017-06-18T02:00:00.000+02:00",
      "preseance": "50",
      "nominPrincipale": "1",
      "infosQualite": {
        "codeQualite": "membre",
        "libQualite": "membre",
        "libQualiteSex": "membre"
      },
      "organesRefs": [
        "PO717460"
      ],
      "suppleant": {
        "dateDebut": "2017-06-18T02:00:00.000+02:00",
        "suppleantRef": "PA719976"
      },
      "election": {
        "lieu": {
          "region": "Auvergne-Rhône-Alpes",
          "regionType": "Métropolitain",
          "departement": "Loire",
          "numDepartement": "42",
          "numCirco": "5"
        },
        "causeMandat": "élections générales",
        "refCirconscription": "PO717830"
      },
      "mandature": {
        "datePriseFonction": "2017-06-21T02:00:00.000+02:00",
        "premiereElection": "0",
        "placeHemicycle": "290"
      },
      "collaborateurs": [
        {
          "qualite": "Mme",
          "prenom": "Aurélie",
          "nom": "Jaidane"
        },
        {
          "qualite": "Mme",
          "prenom": "Laure",
          "nom": "Deroche"
        },
        {
          "qualite": "M.",
          "prenom": "Jean-François",
          "nom": "Blain"
        }
      ]
    },
    {
      "uid": "PM724451",
      "acteurRef": "PA719972",
      "legislature": "15",
      "typeOrgane": "GP",
      "dateDebut": "2017-06-21T02:00:00.000+02:00",
      "dateFin": "2017-06-26T02:00:00.000+02:00",
      "preseance": "28",
      "nominPrincipale": "1",
      "infosQualite": {
        "codeQualite": "Député non-inscrit",
        "libQualite": "Député non-inscrit",
        "libQualiteSex": "Députée non-inscrite"
      },
      "organesRefs": [
        "PO723569"
      ]
    },
    {
      "uid": "PM731096",
      "acteurRef": "PA719972",
      "legislature": "15",
      "typeOrgane": "GP",
      "dateDebut": "2017-06-27T02:00:00.000+02:00",
      "datePublication": "2017-06-28T02:00:00.000+02:00",
      "preseance": "20",
      "nominPrincipale": "1",
      "infosQualite": {
        "codeQualite": "Membre",
        "libQualite": "Membre du",
        "libQualiteSex": "Membre du"
      },
      "organesRefs": [
        "PO730964"
      ]
    },
    {
      "uid": "PM732104",
      "acteurRef": "PA719972",
      "legislature": "15",
      "typeOrgane": "COMPER",
      "dateDebut": "2017-06-29T02:00:00.000+02:00",
      "datePublication": "2017-06-29T02:00:00.000+02:00",
      "preseance": "32",
      "nominPrincipale": "1",
      "infosQualite": {
        "codeQualite": "Membre",
        "libQualite": "Membre",
        "libQualiteSex": "Membre"
      },
      "organesRefs": [
        "PO419865"
      ]
    },
    {
      "uid": "PM732614",
      "acteurRef": "PA719972",
      "legislature": "15",
      "typeOrgane": "COMNL",
      "dateDebut": "2017-07-12T02:00:00.000+02:00",
      "datePublication": "2017-07-12T02:00:00.000+02:00",
      "preseance": "20",
      "nominPrincipale": "1",
      "infosQualite": {
        "codeQualite": "Membre",
        "libQualite": "Membre",
        "libQualiteSex": "Membre"
      },
      "organesRefs": [
        "PO420375"
      ]
    },
    {
      "uid": "PM736579",
      "acteurRef": "PA719972",
      "legislature": "15",
      "typeOrgane": "GA",
      "dateDebut": "2017-10-02T02:00:00.000+02:00",
      "preseance": "20",
      "nominPrincipale": "1",
      "infosQualite": {
        "codeQualite": "Membre",
        "libQualite": "Membre",
        "libQualiteSex": "Membre"
      },
      "organesRefs": [
        "PO733232"
      ]
    },
    {
      "uid": "PM736580",
      "acteurRef": "PA719972",
      "legislature": "15",
      "typeOrgane": "GA",
      "dateDebut": "2017-10-02T02:00:00.000+02:00",
      "preseance": "20",
      "nominPrincipale": "1",
      "infosQualite": {
        "codeQualite": "Membre",
        "libQualite": "Membre",
        "libQualiteSex": "Membre"
      },
      "organesRefs": [
        "PO733607"
      ]
    },
    {
      "uid": "PM740607",
      "acteurRef": "PA719972",
      "legislature": "15",
      "typeOrgane": "MISINFO",
      "dateDebut": "2017-10-18T02:00:00.000+02:00",
      "dateFin": "2018-06-21T02:00:00.000+02:00",
      "preseance": "10",
      "nominPrincipale": "1",
      "infosQualite": {
        "codeQualite": "Membre",
        "libQualite": "Membre",
        "libQualiteSex": "Membre"
      },
      "organesRefs": [
        "PO740575"
      ]
    },
    {
      "uid": "PM745459",
      "acteurRef": "PA719972",
      "typeOrgane": "PARPOL",
      "dateDebut": "2017-12-01T01:00:00.000+01:00",
      "preseance": "5",
      "nominPrincipale": "1",
      "infosQualite": {
        "codeQualite": "Membre",
        "libQualite": "Membre",
        "libQualiteSex": "Membre"
      },
      "organesRefs": [
        "PO744854"
      ]
    },
    {
      "uid": "PM747453",
      "acteurRef": "PA719972",
      "legislature": "15",
      "typeOrgane": "ORGEXTPARL",
      "dateDebut": "2017-12-18T01:00:00.000+01:00",
      "datePublication": "2017-12-19T01:00:00.000+01:00",
      "preseance": "20",
      "nominPrincipale": "1",
      "infosQualite": {
        "codeQualite": "Titulaire",
        "libQualite": "Membre titulaire",
        "libQualiteSex": "Membre titulaire"
      },
      "organesRefs": [
        "PO415444"
      ]
    },
    {
      "uid": "PM749524",
      "acteurRef": "PA719972",
      "legislature": "15",
      "typeOrgane": "GE",
      "dateDebut": "2018-02-13T01:00:00.000+01:00",
      "preseance": "20",
      "nominPrincipale": "1",
      "infosQualite": {
        "codeQualite": "Membre",
        "libQualite": "Membre",
        "libQualiteSex": "Membre"
      },
      "organesRefs": [
        "PO746748"
      ]
    },
    {
      "uid": "PM750714",
      "acteurRef": "PA719972",
      "legislature": "15",
      "typeOrgane": "GE",
      "dateDebut": "2018-02-16T01:00:00.000+01:00",
      "preseance": "20",
      "nominPrincipale": "1",
      "infosQualite": {
        "codeQualite": "Membre",
        "libQualite": "Membre",
        "libQualiteSex": "Membre"
      },
      "organesRefs": [
        "PO746847"
      ]
    },
    {
      "uid": "PM750973",
      "acteurRef": "PA719972",
      "legislature": "15",
      "typeOrgane": "GE",
      "dateDebut": "2018-02-19T01:00:00.000+01:00",
      "preseance": "20",
      "nominPrincipale": "1",
      "infosQualite": {
        "codeQualite": "Membre",
        "libQualite": "Membre",
        "libQualiteSex": "Membre"
      },
      "organesRefs": [
        "PO746880"
      ]
    },
    {
      "uid": "PM751965",
      "acteurRef": "PA719972",
      "legislature": "15",
      "typeOrgane": "GE",
      "dateDebut": "2018-02-23T01:00:00.000+01:00",
      "preseance": "20",
      "nominPrincipale": "1",
      "infosQualite": {
        "codeQualite": "Membre",
        "libQualite": "Membre",
        "libQualiteSex": "Membre"
      },
      "organesRefs": [
        "PO746925"
      ]
    },
    {
      "uid": "PM752005",
      "acteurRef": "PA719972",
      "legislature": "15",
      "typeOrgane": "GE",
      "dateDebut": "2018-02-26T01:00:00.000+01:00",
      "preseance": "20",
      "nominPrincipale": "0",
      "infosQualite": {
        "codeQualite": "Membre",
        "libQualite": "Membre",
        "libQualiteSex": "Membre"
      },
      "organesRefs": [
        "PO746649"
      ]
    },
    {
      "uid": "PM754339",
      "acteurRef": "PA719972",
      "legislature": "15",
      "typeOrgane": "GE",
      "dateDebut": "2018-03-27T02:00:00.000+02:00",
      "preseance": "8",
      "nominPrincipale": "1",
      "infosQualite": {
        "codeQualite": "Vice-Président",
        "libQualite": "Vice-Président",
        "libQualiteSex": "Vice-Présidente"
      },
      "organesRefs": [
        "PO746649"
      ]
    },
    {
      "uid": "PM755436",
      "acteurRef": "PA719972",
      "legislature": "15",
      "typeOrgane": "CNPE",
      "dateDebut": "2018-04-14T02:00:00.000+02:00",
      "datePublication": "2018-04-14T02:00:00.000+02:00",
      "preseance": "20",
      "nominPrincipale": "0",
      "infosQualite": {
        "codeQualite": "Membre",
        "libQualite": "Membre",
        "libQualiteSex": "Membre"
      },
      "organesRefs": [
        "PO754360"
      ]
    },
    {
      "uid": "PM755739",
      "acteurRef": "PA719972",
      "legislature": "15",
      "typeOrgane": "CNPE",
      "dateDebut": "2018-04-18T02:00:00.000+02:00",
      "datePublication": "2018-04-20T02:00:00.000+02:00",
      "preseance": "8",
      "nominPrincipale": "1",
      "infosQualite": {
        "codeQualite": "Vice-Président",
        "libQualite": "Vice-Président",
        "libQualiteSex": "Vice-Présidente"
      },
      "organesRefs": [
        "PO754360"
      ]
    },
    {
      "uid": "PM757503",
      "acteurRef": "PA719972",
      "legislature": "15",
      "typeOrgane": "GE",
      "dateDebut": "2018-06-24T02:00:00.000+02:00",
      "preseance": "20",
      "nominPrincipale": "1",
      "infosQualite": {
        "codeQualite": "Membre",
        "libQualite": "Membre",
        "libQualiteSex": "Membre"
      },
      "organesRefs": [
        "PO747145"
      ]
    },
    {
      "uid": "PM757629",
      "acteurRef": "PA719972",
      "legislature": "15",
      "typeOrgane": "MISINFOPRE",
      "dateDebut": "2018-07-05T02:00:00.000+02:00",
      "datePublication": "2018-07-06T02:00:00.000+02:00",
      "preseance": "20",
      "nominPrincipale": "1",
      "infosQualite": {
        "codeQualite": "Membre",
        "libQualite": "Membre",
        "libQualiteSex": "Membre"
      },
      "organesRefs": [
        "PO757231"
      ]
    },
    {
      "uid": "PM760376",
      "acteurRef": "PA719972",
      "legislature": "15",
      "typeOrgane": "GA",
      "dateDebut": "2018-11-20T01:00:00.000+01:00",
      "preseance": "20",
      "nominPrincipale": "1",
      "infosQualite": {
        "codeQualite": "Membre",
        "libQualite": "Membre",
        "libQualiteSex": "Membre"
      },
      "organesRefs": [
        "PO733417"
      ]
    },
    {
      "uid": "PM760622",
      "acteurRef": "PA719972",
      "legislature": "15",
      "typeOrgane": "GE",
      "dateDebut": "2018-11-23T01:00:00.000+01:00",
      "preseance": "20",
      "nominPrincipale": "1",
      "infosQualite": {
        "codeQualite": "Membre",
        "libQualite": "Membre",
        "libQualiteSex": "Membre"
      },
      "organesRefs": [
        "PO746644"
      ]
    },
    {
      "uid": "PM760666",
      "acteurRef": "PA719972",
      "legislature": "15",
      "typeOrgane": "GE",
      "dateDebut": "2018-11-26T01:00:00.000+01:00",
      "preseance": "20",
      "nominPrincipale": "1",
      "infosQualite": {
        "codeQualite": "Membre",
        "libQualite": "Membre",
        "libQualiteSex": "Membre"
      },
      "organesRefs": [
        "PO746669"
      ]
    },
    {
      "uid": "PM760681",
      "acteurRef": "PA719972",
      "legislature": "15",
      "typeOrgane": "GE",
      "dateDebut": "2018-11-26T01:00:00.000+01:00",
      "preseance": "20",
      "nominPrincipale": "1",
      "infosQualite": {
        "codeQualite": "Membre",
        "libQualite": "Membre",
        "libQualiteSex": "Membre"
      },
      "organesRefs": [
        "PO746811"
      ]
    },
    {
      "uid": "PM760812",
      "acteurRef": "PA719972",
      "legislature": "15",
      "typeOrgane": "GE",
      "dateDebut": "2018-12-04T01:00:00.000+01:00",
      "preseance": "20",
      "nominPrincipale": "1",
      "infosQualite": {
        "codeQualite": "Membre",
        "libQualite": "Membre",
        "libQualiteSex": "Membre"
      },
      "organesRefs": [
        "PO746852"
      ]
    }
  ]
}