{
  "uid": "PO747471",
  "codeType": "ORGEXTPARL",
  "libelle": "Commission prévue à l’article 113 de la loi n° 2017-256 du 28 février 2017 de programmation relative à l’égalité réelle outre-mer et portant autres dispositions en matière sociale et économique",
  "libelleAbrege": "Commission article 113 de la loi relative à l’égalité réelle outre-mer",
  "libelleAbrev": "382",
  "viMoDe": {
    "dateDebut": "2017-11-15T01:00:00.000+01:00"
  },
  "regime": "5ème République",
  "regimeJuridique": "Article 113 de la loi n° 2017-256 du 28 février 2017"
}