{
  "uid": "PO700719",
  "codeType": "MINISTERE",
  "libelle": "Ministère de l'éducation nationale, de l'enseignement supérieur et de la recherche",
  "libelleEdition": "de l'éducation nationale, de l'enseignement supérieur et de la recherche",
  "libelleAbrege": "Éducation nationale, enseignement supérieur et recherche",
  "libelleAbrev": "EDU",
  "viMoDe": {
    "dateDebut": "2014-04-03T02:00:00.000+02:00",
    "dateFin": "2014-08-26T02:00:00.000+02:00"
  },
  "organeParentRef": "PO700706"
}