{
  "uid": "PA267492",
  "etatCivil": {
    "ident": {
      "civ": "M.",
      "prenom": "Jean-Jacques",
      "nom": "Candelier",
      "alpha": "Candelier"
    },
    "infoNaissance": {
      "dateNais": "1945-03-07T01:00:00.000+01:00",
      "villeNais": "Bugnicourt",
      "depNais": "Nord",
      "paysNais": "France"
    }
  },
  "profession": {
    "libelleCourant": "Cadre A de la fonction publique territoriale",
    "socProcInsee": {
      "catSocPro": "Anciens cadres et professions intermédiaires",
      "famSocPro": "Retraités"
    }
  },
  "adresses": [
    {
      "xsiType": "AdressePostale_Type",
      "uid": "AD386869",
      "type": "0",
      "typeLibelle": "Adresse officielle",
      "poids": "1",
      "intitule": "Assemblée nationale,",
      "numeroRue": "126",
      "nomRue": "Rue de l'Université,",
      "codePostal": "75355",
      "ville": "Paris 07 SP"
    },
    {
      "xsiType": "AdressePostale_Type",
      "uid": "AD389298",
      "type": "2",
      "typeLibelle": "Adresse publiée de circonscription",
      "poids": "22",
      "intitule": "Permanence",
      "nomRue": "Place Victor Brachelet",
      "codePostal": "59490",
      "ville": "Somain"
    },
    {
      "xsiType": "AdresseTelephonique_Type",
      "uid": "AD389299",
      "type": "11",
      "typeLibelle": "Téléphone",
      "poids": "22",
      "adresseDeRattachement": "AD389298",
      "valElec": "03 27 98 82 21"
    },
    {
      "xsiType": "AdresseTelephonique_Type",
      "uid": "AD389300",
      "type": "12",
      "typeLibelle": "Télécopie",
      "poids": "22",
      "adresseDeRattachement": "AD389298",
      "valElec": "03 27 98 92 26"
    },
    {
      "xsiType": "AdresseMail_Type",
      "uid": "AD391926",
      "type": "15",
      "typeLibelle": "Mèl",
      "valElec": "jjcandelier@assemblee-nationale.fr"
    }
  ],
  "mandats": [
    {
      "uid": "PM386096",
      "acteurRef": "PA267492",
      "legislature": "13",
      "typeOrgane": "ASSEMBLEE",
      "dateDebut": "2007-06-20T02:00:00.000+02:00",
      "dateFin": "2012-06-19T02:00:00.000+02:00",
      "preseance": "50",
      "nominPrincipale": "1",
      "infosQualite": {
        "codeQualite": "membre",
        "libQualite": "membre",
        "libQualiteSex": "membre"
      },
      "organesRefs": [
        "PO384266"
      ],
      "suppleant": {
        "dateDebut": "2007-06-20T02:00:00.000+02:00",
        "dateFin": "2012-06-19T02:00:00.000+02:00",
        "suppleantRef": "PA343866"
      },
      "election": {
        "lieu": {
          "region": "Hauts-de-France",
          "regionType": "Métropolitain",
          "departement": "Nord",
          "numDepartement": "59",
          "numCirco": "16"
        },
        "causeMandat": "élections générales",
        "refCirconscription": "PO384558"
      },
      "mandature": {
        "datePriseFonction": "2007-06-20T02:00:00.000+02:00",
        "causeFin": "Fin de législature",
        "premiereElection": "0"
      }
    },
    {
      "uid": "PM387448",
      "acteurRef": "PA267492",
      "legislature": "13",
      "typeOrgane": "GP",
      "dateDebut": "2007-06-20T02:00:00.000+02:00",
      "dateFin": "2007-06-26T02:00:00.000+02:00",
      "preseance": "28",
      "nominPrincipale": "1",
      "infosQualite": {
        "codeQualite": "Député non-inscrit",
        "libQualite": "Député non-inscrit",
        "libQualiteSex": "Député non-inscrit"
      },
      "organesRefs": [
        "PO387155"
      ]
    },
    {
      "uid": "PM389674",
      "acteurRef": "PA267492",
      "legislature": "13",
      "typeOrgane": "GP",
      "dateDebut": "2007-06-27T02:00:00.000+02:00",
      "datePublication": "2007-06-27T02:00:00.000+02:00",
      "dateFin": "2012-06-19T02:00:00.000+02:00",
      "preseance": "20",
      "nominPrincipale": "1",
      "infosQualite": {
        "codeQualite": "Membre",
        "libQualite": "Membre du",
        "libQualiteSex": "Membre du"
      },
      "organesRefs": [
        "PO389635"
      ]
    },
    {
      "uid": "PM390676",
      "acteurRef": "PA267492",
      "legislature": "13",
      "typeOrgane": "COMPER",
      "dateDebut": "2007-06-27T02:00:00.000+02:00",
      "datePublication": "2007-06-28T02:00:00.000+02:00",
      "dateFin": "2007-07-10T02:00:00.000+02:00",
      "preseance": "32",
      "nominPrincipale": "1",
      "infosQualite": {
        "codeQualite": "Membre",
        "libQualite": "Membre",
        "libQualiteSex": "Membre"
      },
      "organesRefs": [
        "PO59047"
      ]
    },
    {
      "uid": "PM392358",
      "acteurRef": "PA267492",
      "legislature": "13",
      "typeOrgane": "COMPER",
      "dateDebut": "2007-07-11T02:00:00.000+02:00",
      "datePublication": "2007-07-11T02:00:00.000+02:00",
      "dateFin": "2012-06-19T02:00:00.000+02:00",
      "preseance": "32",
      "nominPrincipale": "1",
      "infosQualite": {
        "codeQualite": "Membre",
        "libQualite": "Membre",
        "libQualiteSex": "Membre"
      },
      "organesRefs": [
        "PO59046"
      ]
    },
    {
      "uid": "PM398893",
      "acteurRef": "PA267492",
      "legislature": "13",
      "typeOrgane": "ORGEXTPARL",
      "dateDebut": "2007-10-11T02:00:00.000+02:00",
      "datePublication": "2007-10-12T02:00:00.000+02:00",
      "dateFin": "2012-06-19T02:00:00.000+02:00",
      "preseance": "20",
      "nominPrincipale": "1",
      "infosQualite": {
        "codeQualite": "Titulaire",
        "libQualite": "Membre titulaire",
        "libQualiteSex": "Membre titulaire"
      },
      "organesRefs": [
        "PO191887"
      ]
    },
    {
      "uid": "PM399557",
      "acteurRef": "PA267492",
      "legislature": "13",
      "typeOrgane": "GA",
      "dateDebut": "2007-10-16T02:00:00.000+02:00",
      "dateFin": "2012-06-19T02:00:00.000+02:00",
      "preseance": "20",
      "nominPrincipale": "1",
      "infosQualite": {
        "codeQualite": "Membre",
        "libQualite": "Membre",
        "libQualiteSex": "Membre"
      },
      "organesRefs": [
        "PO392770"
      ]
    },
    {
      "uid": "PM399558",
      "acteurRef": "PA267492",
      "legislature": "13",
      "typeOrgane": "GA",
      "dateDebut": "2007-10-16T02:00:00.000+02:00",
      "dateFin": "2012-06-19T02:00:00.000+02:00",
      "preseance": "20",
      "nominPrincipale": "1",
      "infosQualite": {
        "codeQualite": "Membre",
        "libQualite": "Membre",
        "libQualiteSex": "Membre"
      },
      "organesRefs": [
        "PO392895"
      ]
    },
    {
      "uid": "PM399559",
      "acteurRef": "PA267492",
      "legislature": "13",
      "typeOrgane": "GA",
      "dateDebut": "2007-10-16T02:00:00.000+02:00",
      "dateFin": "2012-06-19T02:00:00.000+02:00",
      "preseance": "20",
      "nominPrincipale": "1",
      "infosQualite": {
        "codeQualite": "Membre",
        "libQualite": "Membre",
        "libQualiteSex": "Membre"
      },
      "organesRefs": [
        "PO392965"
      ]
    },
    {
      "uid": "PM399560",
      "acteurRef": "PA267492",
      "legislature": "13",
      "typeOrgane": "GA",
      "dateDebut": "2007-10-16T02:00:00.000+02:00",
      "dateFin": "2012-06-19T02:00:00.000+02:00",
      "preseance": "20",
      "nominPrincipale": "1",
      "infosQualite": {
        "codeQualite": "Membre",
        "libQualite": "Membre",
        "libQualiteSex": "Membre"
      },
      "organesRefs": [
        "PO393060"
      ]
    },
    {
      "uid": "PM399561",
      "acteurRef": "PA267492",
      "legislature": "13",
      "typeOrgane": "GA",
      "dateDebut": "2007-10-16T02:00:00.000+02:00",
      "dateFin": "2012-06-19T02:00:00.000+02:00",
      "preseance": "20",
      "nominPrincipale": "1",
      "infosQualite": {
        "codeQualite": "Membre",
        "libQualite": "Membre",
        "libQualiteSex": "Membre"
      },
      "organesRefs": [
        "PO393065"
      ]
    },
    {
      "uid": "PM399562",
      "acteurRef": "PA267492",
      "legislature": "13",
      "typeOrgane": "GA",
      "dateDebut": "2007-10-16T02:00:00.000+02:00",
      "dateFin": "2012-06-19T02:00:00.000+02:00",
      "preseance": "20",
      "nominPrincipale": "1",
      "infosQualite": {
        "codeQualite": "Membre",
        "libQualite": "Membre",
        "libQualiteSex": "Membre"
      },
      "organesRefs": [
        "PO393263"
      ]
    },
    {
      "uid": "PM399563",
      "acteurRef": "PA267492",
      "legislature": "13",
      "typeOrgane": "GA",
      "dateDebut": "2007-10-16T02:00:00.000+02:00",
      "dateFin": "2012-06-19T02:00:00.000+02:00",
      "preseance": "20",
      "nominPrincipale": "1",
      "infosQualite": {
        "codeQualite": "Membre",
        "libQualite": "Membre",
        "libQualiteSex": "Membre"
      },
      "organesRefs": [
        "PO393448"
      ]
    },
    {
      "uid": "PM399564",
      "acteurRef": "PA267492",
      "legislature": "13",
      "typeOrgane": "GA",
      "dateDebut": "2007-10-16T02:00:00.000+02:00",
      "dateFin": "2012-06-19T02:00:00.000+02:00",
      "preseance": "20",
      "nominPrincipale": "1",
      "infosQualite": {
        "codeQualite": "Membre",
        "libQualite": "Membre",
        "libQualiteSex": "Membre"
      },
      "organesRefs": [
        "PO393503"
      ]
    },
    {
      "uid": "PM404008",
      "acteurRef": "PA267492",
      "legislature": "13",
      "typeOrgane": "GA",
      "dateDebut": "2007-11-22T01:00:00.000+01:00",
      "dateFin": "2012-06-19T02:00:00.000+02:00",
      "preseance": "8",
      "nominPrincipale": "1",
      "infosQualite": {
        "codeQualite": "Vice-Président",
        "libQualite": "Vice-Président",
        "libQualiteSex": "Vice-Président"
      },
      "organesRefs": [
        "PO393448"
      ]
    },
    {
      "uid": "PM405799",
      "acteurRef": "PA267492",
      "legislature": "13",
      "typeOrgane": "GA",
      "dateDebut": "2007-12-19T01:00:00.000+01:00",
      "dateFin": "2012-06-19T02:00:00.000+02:00",
      "preseance": "8",
      "nominPrincipale": "1",
      "infosQualite": {
        "codeQualite": "Vice-Président",
        "libQualite": "Vice-Président",
        "libQualiteSex": "Vice-Président"
      },
      "organesRefs": [
        "PO393060"
      ]
    },
    {
      "uid": "PM406006",
      "acteurRef": "PA267492",
      "legislature": "13",
      "typeOrgane": "GA",
      "dateDebut": "2007-12-19T01:00:00.000+01:00",
      "dateFin": "2012-06-19T02:00:00.000+02:00",
      "preseance": "8",
      "nominPrincipale": "1",
      "infosQualite": {
        "codeQualite": "Vice-Président",
        "libQualite": "Vice-Président",
        "libQualiteSex": "Vice-Président"
      },
      "organesRefs": [
        "PO393263"
      ]
    },
    {
      "uid": "PM406380",
      "acteurRef": "PA267492",
      "legislature": "13",
      "typeOrgane": "GE",
      "dateDebut": "2008-01-11T01:00:00.000+01:00",
      "dateFin": "2012-06-19T02:00:00.000+02:00",
      "preseance": "20",
      "nominPrincipale": "1",
      "infosQualite": {
        "codeQualite": "Membre",
        "libQualite": "Membre",
        "libQualiteSex": "Membre"
      },
      "organesRefs": [
        "PO402949"
      ]
    },
    {
      "uid": "PM406406",
      "acteurRef": "PA267492",
      "legislature": "13",
      "typeOrgane": "GE",
      "dateDebut": "2007-12-18T01:00:00.000+01:00",
      "dateFin": "2012-06-19T02:00:00.000+02:00",
      "preseance": "20",
      "nominPrincipale": "1",
      "infosQualite": {
        "codeQualite": "Membre",
        "libQualite": "Membre",
        "libQualiteSex": "Membre"
      },
      "organesRefs": [
        "PO403283"
      ]
    },
    {
      "uid": "PM406599",
      "acteurRef": "PA267492",
      "legislature": "13",
      "typeOrgane": "GA",
      "dateDebut": "2008-01-14T01:00:00.000+01:00",
      "dateFin": "2012-06-19T02:00:00.000+02:00",
      "preseance": "20",
      "nominPrincipale": "1",
      "infosQualite": {
        "codeQualite": "Membre",
        "libQualite": "Membre",
        "libQualiteSex": "Membre"
      },
      "organesRefs": [
        "PO392935"
      ]
    },
    {
      "uid": "PM406600",
      "acteurRef": "PA267492",
      "legislature": "13",
      "typeOrgane": "GA",
      "dateDebut": "2008-01-14T01:00:00.000+01:00",
      "dateFin": "2012-06-19T02:00:00.000+02:00",
      "preseance": "20",
      "nominPrincipale": "1",
      "infosQualite": {
        "codeQualite": "Membre",
        "libQualite": "Membre",
        "libQualiteSex": "Membre"
      },
      "organesRefs": [
        "PO393105"
      ]
    },
    {
      "uid": "PM406601",
      "acteurRef": "PA267492",
      "legislature": "13",
      "typeOrgane": "GA",
      "dateDebut": "2008-01-14T01:00:00.000+01:00",
      "dateFin": "2012-06-19T02:00:00.000+02:00",
      "preseance": "20",
      "nominPrincipale": "1",
      "infosQualite": {
        "codeQualite": "Membre",
        "libQualite": "Membre",
        "libQualiteSex": "Membre"
      },
      "organesRefs": [
        "PO393283"
      ]
    },
    {
      "uid": "PM406602",
      "acteurRef": "PA267492",
      "legislature": "13",
      "typeOrgane": "GA",
      "dateDebut": "2008-01-14T01:00:00.000+01:00",
      "dateFin": "2012-06-19T02:00:00.000+02:00",
      "preseance": "20",
      "nominPrincipale": "0",
      "infosQualite": {
        "codeQualite": "Membre",
        "libQualite": "Membre",
        "libQualiteSex": "Membre"
      },
      "organesRefs": [
        "PO393612"
      ]
    },
    {
      "uid": "PM406606",
      "acteurRef": "PA267492",
      "legislature": "13",
      "typeOrgane": "GEVI",
      "dateDebut": "2008-01-14T01:00:00.000+01:00",
      "dateFin": "2012-06-19T02:00:00.000+02:00",
      "preseance": "20",
      "nominPrincipale": "1",
      "infosQualite": {
        "codeQualite": "Membre",
        "libQualite": "Membre",
        "libQualiteSex": "Membre"
      },
      "organesRefs": [
        "PO392870"
      ]
    },
    {
      "uid": "PM406610",
      "acteurRef": "PA267492",
      "legislature": "13",
      "typeOrgane": "GA",
      "dateDebut": "2008-01-14T01:00:00.000+01:00",
      "dateFin": "2012-06-19T02:00:00.000+02:00",
      "preseance": "8",
      "nominPrincipale": "1",
      "infosQualite": {
        "codeQualite": "Vice-Président",
        "libQualite": "Vice-Président",
        "libQualiteSex": "Vice-Président"
      },
      "organesRefs": [
        "PO393612"
      ]
    },
    {
      "uid": "PM406825",
      "acteurRef": "PA267492",
      "legislature": "13",
      "typeOrgane": "GA",
      "dateDebut": "2008-01-15T01:00:00.000+01:00",
      "dateFin": "2012-06-19T02:00:00.000+02:00",
      "preseance": "8",
      "nominPrincipale": "1",
      "infosQualite": {
        "codeQualite": "Vice-Président",
        "libQualite": "Vice-Président",
        "libQualiteSex": "Vice-Président"
      },
      "organesRefs": [
        "PO393105"
      ]
    },
    {
      "uid": "PM406999",
      "acteurRef": "PA267492",
      "legislature": "13",
      "typeOrgane": "GA",
      "dateDebut": "2008-01-15T01:00:00.000+01:00",
      "dateFin": "2012-06-19T02:00:00.000+02:00",
      "preseance": "8",
      "nominPrincipale": "1",
      "infosQualite": {
        "codeQualite": "Vice-Président",
        "libQualite": "Vice-Président",
        "libQualiteSex": "Vice-Président"
      },
      "organesRefs": [
        "PO393283"
      ]
    },
    {
      "uid": "PM407444",
      "acteurRef": "PA267492",
      "legislature": "13",
      "typeOrgane": "GA",
      "dateDebut": "2008-01-22T01:00:00.000+01:00",
      "dateFin": "2012-06-19T02:00:00.000+02:00",
      "preseance": "8",
      "nominPrincipale": "1",
      "infosQualite": {
        "codeQualite": "Vice-Président",
        "libQualite": "Vice-Président",
        "libQualiteSex": "Vice-Président"
      },
      "organesRefs": [
        "PO392935"
      ]
    },
    {
      "uid": "PM408458",
      "acteurRef": "PA267492",
      "legislature": "13",
      "typeOrgane": "GE",
      "dateDebut": "2008-02-05T01:00:00.000+01:00",
      "dateFin": "2012-06-19T02:00:00.000+02:00",
      "preseance": "20",
      "nominPrincipale": "0",
      "infosQualite": {
        "codeQualite": "Membre",
        "libQualite": "Membre",
        "libQualiteSex": "Membre"
      },
      "organesRefs": [
        "PO403244"
      ]
    },
    {
      "uid": "PM408521",
      "acteurRef": "PA267492",
      "legislature": "13",
      "typeOrgane": "GE",
      "dateDebut": "2008-02-05T01:00:00.000+01:00",
      "dateFin": "2012-06-19T02:00:00.000+02:00",
      "preseance": "8",
      "nominPrincipale": "1",
      "infosQualite": {
        "codeQualite": "Vice-Président",
        "libQualite": "Vice-Président",
        "libQualiteSex": "Vice-Président"
      },
      "organesRefs": [
        "PO403244"
      ]
    },
    {
      "uid": "PM408835",
      "acteurRef": "PA267492",
      "legislature": "13",
      "typeOrgane": "GE",
      "dateDebut": "2008-02-11T01:00:00.000+01:00",
      "dateFin": "2012-06-19T02:00:00.000+02:00",
      "preseance": "20",
      "nominPrincipale": "0",
      "infosQualite": {
        "codeQualite": "Membre",
        "libQualite": "Membre",
        "libQualiteSex": "Membre"
      },
      "organesRefs": [
        "PO403123"
      ]
    },
    {
      "uid": "PM409712",
      "acteurRef": "PA267492",
      "legislature": "13",
      "typeOrgane": "GE",
      "dateDebut": "2008-02-25T01:00:00.000+01:00",
      "dateFin": "2012-06-19T02:00:00.000+02:00",
      "preseance": "20",
      "nominPrincipale": "1",
      "infosQualite": {
        "codeQualite": "Membre",
        "libQualite": "Membre",
        "libQualiteSex": "Membre"
      },
      "organesRefs": [
        "PO402925"
      ]
    },
    {
      "uid": "PM409934",
      "acteurRef": "PA267492",
      "legislature": "13",
      "typeOrgane": "GE",
      "dateDebut": "2008-01-20T01:00:00.000+01:00",
      "dateFin": "2012-06-19T02:00:00.000+02:00",
      "preseance": "20",
      "nominPrincipale": "0",
      "infosQualite": {
        "codeQualite": "Membre",
        "libQualite": "Membre",
        "libQualiteSex": "Membre"
      },
      "organesRefs": [
        "PO402802"
      ]
    },
    {
      "uid": "PM410011",
      "acteurRef": "PA267492",
      "legislature": "13",
      "typeOrgane": "GE",
      "dateDebut": "2008-01-20T01:00:00.000+01:00",
      "dateFin": "2012-06-19T02:00:00.000+02:00",
      "preseance": "8",
      "nominPrincipale": "1",
      "infosQualite": {
        "codeQualite": "Vice-Président",
        "libQualite": "Vice-Président",
        "libQualiteSex": "Vice-Président"
      },
      "organesRefs": [
        "PO402802"
      ]
    },
    {
      "uid": "PM411595",
      "acteurRef": "PA267492",
      "legislature": "13",
      "typeOrgane": "GE",
      "dateDebut": "2008-04-02T02:00:00.000+02:00",
      "dateFin": "2012-06-19T02:00:00.000+02:00",
      "preseance": "8",
      "nominPrincipale": "1",
      "infosQualite": {
        "codeQualite": "Vice-Président",
        "libQualite": "Vice-Président",
        "libQualiteSex": "Vice-Président"
      },
      "organesRefs": [
        "PO402949"
      ]
    },
    {
      "uid": "PM412401",
      "acteurRef": "PA267492",
      "legislature": "13",
      "typeOrgane": "GE",
      "dateDebut": "2008-02-05T01:00:00.000+01:00",
      "dateFin": "2012-06-19T02:00:00.000+02:00",
      "preseance": "20",
      "nominPrincipale": "0",
      "infosQualite": {
        "codeQualite": "Membre",
        "libQualite": "Membre",
        "libQualiteSex": "Membre"
      },
      "organesRefs": [
        "PO403172"
      ]
    },
    {
      "uid": "PM412471",
      "acteurRef": "PA267492",
      "legislature": "13",
      "typeOrgane": "GE",
      "dateDebut": "2008-02-05T01:00:00.000+01:00",
      "dateFin": "2012-06-19T02:00:00.000+02:00",
      "preseance": "8",
      "nominPrincipale": "1",
      "infosQualite": {
        "codeQualite": "Vice-Président",
        "libQualite": "Vice-Président",
        "libQualiteSex": "Vice-Président"
      },
      "organesRefs": [
        "PO403172"
      ]
    },
    {
      "uid": "PM413066",
      "acteurRef": "PA267492",
      "legislature": "13",
      "typeOrgane": "GE",
      "dateDebut": "2008-04-29T02:00:00.000+02:00",
      "dateFin": "2012-06-19T02:00:00.000+02:00",
      "preseance": "20",
      "nominPrincipale": "1",
      "infosQualite": {
        "codeQualite": "Membre",
        "libQualite": "Membre",
        "libQualiteSex": "Membre"
      },
      "organesRefs": [
        "PO402913"
      ]
    },
    {
      "uid": "PM420834",
      "acteurRef": "PA267492",
      "legislature": "13",
      "typeOrgane": "COMPER",
      "dateDebut": "2009-07-01T02:00:00.000+02:00",
      "datePublication": "2009-07-02T02:00:00.000+02:00",
      "dateFin": "2012-06-19T02:00:00.000+02:00",
      "preseance": "16",
      "nominPrincipale": "1",
      "infosQualite": {
        "codeQualite": "Secrétaire",
        "libQualite": "Secrétaire",
        "libQualiteSex": "Secrétaire"
      },
      "organesRefs": [
        "PO59046"
      ]
    },
    {
      "uid": "PM422372",
      "acteurRef": "PA267492",
      "legislature": "13",
      "typeOrgane": "GE",
      "dateDebut": "2008-02-08T01:00:00.000+01:00",
      "dateFin": "2012-06-19T02:00:00.000+02:00",
      "preseance": "8",
      "nominPrincipale": "1",
      "infosQualite": {
        "codeQualite": "Vice-Président",
        "libQualite": "Vice-Président",
        "libQualiteSex": "Vice-Président"
      },
      "organesRefs": [
        "PO403123"
      ]
    },
    {
      "uid": "PM426035",
      "acteurRef": "PA267492",
      "legislature": "13",
      "typeOrgane": "DELEGBUREAU",
      "dateDebut": "2010-10-06T02:00:00.000+02:00",
      "dateFin": "2012-06-19T02:00:00.000+02:00",
      "preseance": "24",
      "nominPrincipale": "1",
      "infosQualite": {
        "codeQualite": "Membre",
        "libQualite": "Membre",
        "libQualiteSex": "Membre"
      },
      "organesRefs": [
        "PO426011"
      ]
    },
    {
      "uid": "PM427590",
      "acteurRef": "PA267492",
      "legislature": "13",
      "typeOrgane": "GE",
      "dateDebut": "2011-03-02T01:00:00.000+01:00",
      "dateFin": "2012-06-19T02:00:00.000+02:00",
      "preseance": "20",
      "nominPrincipale": "1",
      "infosQualite": {
        "codeQualite": "Membre",
        "libQualite": "Membre",
        "libQualiteSex": "Membre"
      },
      "organesRefs": [
        "PO425860"
      ]
    },
    {
      "uid": "PM428637",
      "acteurRef": "PA267492",
      "legislature": "13",
      "typeOrgane": "MISINFOPRE",
      "dateDebut": "2011-06-01T02:00:00.000+02:00",
      "datePublication": "2011-06-02T02:00:00.000+02:00",
      "dateFin": "2011-10-21T02:00:00.000+02:00",
      "preseance": "20",
      "nominPrincipale": "1",
      "infosQualite": {
        "codeQualite": "Membre",
        "libQualite": "Membre",
        "libQualiteSex": "Membre"
      },
      "organesRefs": [
        "PO428587"
      ]
    },
    {
      "uid": "PM428884",
      "acteurRef": "PA267492",
      "legislature": "13",
      "typeOrgane": "CNPE",
      "dateDebut": "2011-06-15T02:00:00.000+02:00",
      "datePublication": "2011-06-16T02:00:00.000+02:00",
      "dateFin": "2011-12-06T01:00:00.000+01:00",
      "preseance": "20",
      "nominPrincipale": "1",
      "infosQualite": {
        "codeQualite": "Membre",
        "libQualite": "Membre",
        "libQualiteSex": "Membre"
      },
      "organesRefs": [
        "PO428765"
      ]
    },
    {
      "uid": "PM429043",
      "acteurRef": "PA267492",
      "legislature": "13",
      "typeOrgane": "CNPE",
      "dateDebut": "2011-06-22T02:00:00.000+02:00",
      "datePublication": "2011-06-23T02:00:00.000+02:00",
      "dateFin": "2011-12-06T01:00:00.000+01:00",
      "preseance": "14",
      "nominPrincipale": "1",
      "infosQualite": {
        "codeQualite": "Secrétaire",
        "libQualite": "Secrétaire",
        "libQualiteSex": "Secrétaire"
      },
      "organesRefs": [
        "PO428765"
      ]
    },
    {
      "uid": "PM645465",
      "acteurRef": "PA267492",
      "legislature": "14",
      "typeOrgane": "ASSEMBLEE",
      "dateDebut": "2012-06-20T02:00:00.000+02:00",
      "dateFin": "2017-06-20T02:00:00.000+02:00",
      "preseance": "50",
      "nominPrincipale": "1",
      "infosQualite": {
        "codeQualite": "membre",
        "libQualite": "membre",
        "libQualiteSex": "membre"
      },
      "organesRefs": [
        "PO644420"
      ],
      "suppleant": {
        "dateDebut": "2012-06-20T02:00:00.000+02:00",
        "dateFin": "2017-06-20T02:00:00.000+02:00",
        "suppleantRef": "PA642870"
      },
      "election": {
        "lieu": {
          "region": "Hauts-de-France",
          "regionType": "Métropolitain",
          "departement": "Nord",
          "numDepartement": "59",
          "numCirco": "16"
        },
        "causeMandat": "élections générales",
        "refCirconscription": "PO644712"
      },
      "mandature": {
        "datePriseFonction": "2012-06-20T02:00:00.000+02:00",
        "causeFin": "Fin de législature",
        "premiereElection": "1"
      }
    },
    {
      "uid": "PM656588",
      "acteurRef": "PA267492",
      "legislature": "14",
      "typeOrgane": "GP",
      "dateDebut": "2012-06-26T02:00:00.000+02:00",
      "datePublication": "2012-06-27T02:00:00.000+02:00",
      "dateFin": "2017-06-20T02:00:00.000+02:00",
      "preseance": "20",
      "nominPrincipale": "1",
      "infosQualite": {
        "codeQualite": "Membre",
        "libQualite": "Membre du",
        "libQualiteSex": "Membre du"
      },
      "organesRefs": [
        "PO656018"
      ]
    },
    {
      "uid": "PM656820",
      "acteurRef": "PA267492",
      "legislature": "14",
      "typeOrgane": "COMPER",
      "dateDebut": "2012-06-28T02:00:00.000+02:00",
      "datePublication": "2012-06-28T02:00:00.000+02:00",
      "dateFin": "2017-06-20T02:00:00.000+02:00",
      "preseance": "32",
      "nominPrincipale": "0",
      "infosQualite": {
        "codeQualite": "Membre",
        "libQualite": "Membre",
        "libQualiteSex": "Membre"
      },
      "organesRefs": [
        "PO59046"
      ]
    },
    {
      "uid": "PM658972",
      "acteurRef": "PA267492",
      "legislature": "14",
      "typeOrgane": "COMPER",
      "dateDebut": "2012-06-28T02:00:00.000+02:00",
      "datePublication": "2012-06-29T02:00:00.000+02:00",
      "dateFin": "2017-06-20T02:00:00.000+02:00",
      "preseance": "8",
      "nominPrincipale": "1",
      "infosQualite": {
        "codeQualite": "Vice-Président",
        "libQualite": "Vice-président",
        "libQualiteSex": "Vice-président"
      },
      "organesRefs": [
        "PO59046"
      ]
    },
    {
      "uid": "PM678386",
      "acteurRef": "PA267492",
      "legislature": "14",
      "typeOrgane": "GA",
      "dateDebut": "2012-09-25T02:00:00.000+02:00",
      "dateFin": "2017-06-20T02:00:00.000+02:00",
      "preseance": "20",
      "nominPrincipale": "0",
      "infosQualite": {
        "codeQualite": "Membre",
        "libQualite": "Membre",
        "libQualiteSex": "Membre"
      },
      "organesRefs": [
        "PO675682"
      ]
    },
    {
      "uid": "PM678388",
      "acteurRef": "PA267492",
      "legislature": "14",
      "typeOrgane": "GA",
      "dateDebut": "2012-09-25T02:00:00.000+02:00",
      "dateFin": "2017-06-20T02:00:00.000+02:00",
      "preseance": "1",
      "nominPrincipale": "1",
      "infosQualite": {
        "codeQualite": "Président",
        "libQualite": "Président",
        "libQualiteSex": "Président"
      },
      "organesRefs": [
        "PO675682"
      ]
    },
    {
      "uid": "PM679149",
      "acteurRef": "PA267492",
      "legislature": "14",
      "typeOrgane": "ORGEXTPARL",
      "dateDebut": "2012-10-05T02:00:00.000+02:00",
      "datePublication": "2012-10-06T02:00:00.000+02:00",
      "dateFin": "2017-06-20T02:00:00.000+02:00",
      "preseance": "30",
      "nominPrincipale": "1",
      "infosQualite": {
        "codeQualite": "Suppléant",
        "libQualite": "Membre suppléant",
        "libQualiteSex": "Membre suppléant"
      },
      "organesRefs": [
        "PO218801"
      ]
    },
    {
      "uid": "PM679820",
      "acteurRef": "PA267492",
      "legislature": "14",
      "typeOrgane": "GA",
      "dateDebut": "2012-10-12T02:00:00.000+02:00",
      "dateFin": "2017-06-20T02:00:00.000+02:00",
      "preseance": "20",
      "nominPrincipale": "1",
      "infosQualite": {
        "codeQualite": "Membre",
        "libQualite": "Membre",
        "libQualiteSex": "Membre"
      },
      "organesRefs": [
        "PO675740"
      ]
    },
    {
      "uid": "PM679821",
      "acteurRef": "PA267492",
      "legislature": "14",
      "typeOrgane": "GA",
      "dateDebut": "2012-10-12T02:00:00.000+02:00",
      "dateFin": "2017-06-20T02:00:00.000+02:00",
      "preseance": "20",
      "nominPrincipale": "1",
      "infosQualite": {
        "codeQualite": "Membre",
        "libQualite": "Membre",
        "libQualiteSex": "Membre"
      },
      "organesRefs": [
        "PO675738"
      ]
    },
    {
      "uid": "PM679822",
      "acteurRef": "PA267492",
      "legislature": "14",
      "typeOrgane": "GA",
      "dateDebut": "2012-10-12T02:00:00.000+02:00",
      "dateFin": "2017-06-20T02:00:00.000+02:00",
      "preseance": "20",
      "nominPrincipale": "1",
      "infosQualite": {
        "codeQualite": "Membre",
        "libQualite": "Membre",
        "libQualiteSex": "Membre"
      },
      "organesRefs": [
        "PO675758"
      ]
    },
    {
      "uid": "PM682343",
      "acteurRef": "PA267492",
      "legislature": "14",
      "typeOrgane": "GEVI",
      "dateDebut": "2012-10-17T02:00:00.000+02:00",
      "dateFin": "2017-06-20T02:00:00.000+02:00",
      "preseance": "20",
      "nominPrincipale": "1",
      "infosQualite": {
        "codeQualite": "Membre",
        "libQualite": "Membre",
        "libQualiteSex": "Membre"
      },
      "organesRefs": [
        "PO675685"
      ]
    },
    {
      "uid": "PM685884",
      "acteurRef": "PA267492",
      "typeOrgane": "PARPOL",
      "dateDebut": "2012-12-01T01:00:00.000+01:00",
      "dateFin": "2017-06-20T02:00:00.000+02:00",
      "preseance": "5",
      "nominPrincipale": "1",
      "infosQualite": {
        "codeQualite": "Membre",
        "libQualite": "Membre",
        "libQualiteSex": "Membre"
      },
      "organesRefs": [
        "PO684926"
      ]
    },
    {
      "uid": "PM687502",
      "acteurRef": "PA267492",
      "legislature": "14",
      "typeOrgane": "GEVI",
      "dateDebut": "2012-12-19T01:00:00.000+01:00",
      "dateFin": "2017-06-20T02:00:00.000+02:00",
      "preseance": "8",
      "nominPrincipale": "1",
      "infosQualite": {
        "codeQualite": "Vice-Président",
        "libQualite": "Vice-Président",
        "libQualiteSex": "Vice-Président"
      },
      "organesRefs": [
        "PO675685"
      ]
    },
    {
      "uid": "PM689681",
      "acteurRef": "PA267492",
      "legislature": "14",
      "typeOrgane": "GE",
      "dateDebut": "2013-01-30T01:00:00.000+01:00",
      "dateFin": "2017-06-20T02:00:00.000+02:00",
      "preseance": "20",
      "nominPrincipale": "1",
      "infosQualite": {
        "codeQualite": "Membre",
        "libQualite": "Membre",
        "libQualiteSex": "Membre"
      },
      "organesRefs": [
        "PO686424"
      ]
    },
    {
      "uid": "PM689817",
      "acteurRef": "PA267492",
      "legislature": "14",
      "typeOrgane": "GE",
      "dateDebut": "2013-01-31T01:00:00.000+01:00",
      "dateFin": "2017-06-20T02:00:00.000+02:00",
      "preseance": "20",
      "nominPrincipale": "1",
      "infosQualite": {
        "codeQualite": "Membre",
        "libQualite": "Membre",
        "libQualiteSex": "Membre"
      },
      "organesRefs": [
        "PO686362"
      ]
    },
    {
      "uid": "PM690976",
      "acteurRef": "PA267492",
      "legislature": "14",
      "typeOrgane": "GE",
      "dateDebut": "2013-02-08T01:00:00.000+01:00",
      "dateFin": "2017-06-20T02:00:00.000+02:00",
      "preseance": "8",
      "nominPrincipale": "1",
      "infosQualite": {
        "codeQualite": "Vice-Président",
        "libQualite": "Vice-Président",
        "libQualiteSex": "Vice-Président"
      },
      "organesRefs": [
        "PO686424"
      ]
    },
    {
      "uid": "PM692687",
      "acteurRef": "PA267492",
      "legislature": "14",
      "typeOrgane": "GE",
      "dateDebut": "2013-03-14T01:00:00.000+01:00",
      "dateFin": "2017-06-20T02:00:00.000+02:00",
      "preseance": "20",
      "nominPrincipale": "1",
      "infosQualite": {
        "codeQualite": "Membre",
        "libQualite": "Membre",
        "libQualiteSex": "Membre"
      },
      "organesRefs": [
        "PO686835"
      ]
    },
    {
      "uid": "PM692830",
      "acteurRef": "PA267492",
      "legislature": "14",
      "typeOrgane": "GE",
      "dateDebut": "2013-03-19T01:00:00.000+01:00",
      "dateFin": "2017-06-20T02:00:00.000+02:00",
      "preseance": "8",
      "nominPrincipale": "1",
      "infosQualite": {
        "codeQualite": "Vice-Président",
        "libQualite": "Vice-Président",
        "libQualiteSex": "Vice-Président"
      },
      "organesRefs": [
        "PO686835"
      ]
    },
    {
      "uid": "PM693946",
      "acteurRef": "PA267492",
      "legislature": "14",
      "typeOrgane": "GE",
      "dateDebut": "2013-04-17T02:00:00.000+02:00",
      "dateFin": "2017-06-20T02:00:00.000+02:00",
      "preseance": "8",
      "nominPrincipale": "1",
      "infosQualite": {
        "codeQualite": "Vice-Président",
        "libQualite": "Vice-Président",
        "libQualiteSex": "Vice-Président"
      },
      "organesRefs": [
        "PO686362"
      ]
    },
    {
      "uid": "PM696544",
      "acteurRef": "PA267492",
      "legislature": "14",
      "typeOrgane": "GA",
      "dateDebut": "2013-07-24T02:00:00.000+02:00",
      "dateFin": "2017-06-20T02:00:00.000+02:00",
      "preseance": "8",
      "nominPrincipale": "1",
      "infosQualite": {
        "codeQualite": "Vice-Président",
        "libQualite": "Vice-Président",
        "libQualiteSex": "Vice-Président"
      },
      "organesRefs": [
        "PO675738"
      ]
    },
    {
      "uid": "PM708612",
      "acteurRef": "PA267492",
      "legislature": "14",
      "typeOrgane": "MISINFO",
      "dateDebut": "2014-12-17T01:00:00.000+01:00",
      "dateFin": "2015-12-09T01:00:00.000+01:00",
      "preseance": "10",
      "nominPrincipale": "1",
      "infosQualite": {
        "codeQualite": "Membre",
        "libQualite": "Membre",
        "libQualiteSex": "Membre"
      },
      "organesRefs": [
        "PO708578"
      ]
    },
    {
      "uid": "PM710953",
      "acteurRef": "PA267492",
      "legislature": "14",
      "typeOrgane": "MISINFO",
      "dateDebut": "2015-12-15T01:00:00.000+01:00",
      "dateFin": "2016-06-22T02:00:00.000+02:00",
      "preseance": "10",
      "nominPrincipale": "1",
      "infosQualite": {
        "codeQualite": "Membre",
        "libQualite": "Membre",
        "libQualiteSex": "Membre"
      },
      "organesRefs": [
        "PO710138"
      ]
    },
    {
      "uid": "PM712910",
      "acteurRef": "PA267492",
      "legislature": "14",
      "typeOrgane": "MISINFO",
      "dateDebut": "2016-05-10T02:00:00.000+02:00",
      "dateFin": "2016-12-14T01:00:00.000+01:00",
      "preseance": "10",
      "nominPrincipale": "1",
      "infosQualite": {
        "codeQualite": "Membre",
        "libQualite": "Membre",
        "libQualiteSex": "Membre"
      },
      "organesRefs": [
        "PO711941"
      ]
    }
  ]
}