{
  "uid": "PA2339",
  "etatCivil": {
    "ident": {
      "civ": "M.",
      "prenom": "Daniel",
      "nom": "Paul",
      "alpha": "PaulD"
    },
    "infoNaissance": {
      "dateNais": "1943-08-16T02:00:00.000+02:00",
      "villeNais": "Plourivo",
      "depNais": "Côtes-d'Armor"
    }
  },
  "profession": {
    "libelleCourant": "Instituteur",
    "socProcInsee": {
      "catSocPro": "Professions intermédiaires de l'enseignement, de la santé, de la fonction publique et assimilés",
      "famSocPro": "Professions Intermédiaires"
    }
  },
  "adresses": [
    {
      "xsiType": "AdressePostale_Type",
      "uid": "AD220732",
      "type": "2",
      "typeLibelle": "Adresse publiée de circonscription",
      "poids": "21",
      "numeroRue": "12",
      "nomRue": "Rue Michel Gautier,",
      "codePostal": "76600",
      "ville": "Le Havre"
    },
    {
      "xsiType": "AdresseTelephonique_Type",
      "uid": "AD220733",
      "type": "11",
      "typeLibelle": "Téléphone",
      "poids": "21",
      "adresseDeRattachement": "AD220732",
      "valElec": "02 35 53 05 79"
    },
    {
      "xsiType": "AdresseTelephonique_Type",
      "uid": "AD220734",
      "type": "12",
      "typeLibelle": "Télécopie",
      "poids": "21",
      "adresseDeRattachement": "AD220732",
      "valElec": "02 35 53 66 91"
    },
    {
      "xsiType": "AdresseMail_Type",
      "uid": "AD288444",
      "type": "15",
      "typeLibelle": "Mèl",
      "valElec": "an.dpaul@wanadoo.fr"
    },
    {
      "xsiType": "AdressePostale_Type",
      "uid": "AD387001",
      "type": "0",
      "typeLibelle": "Adresse officielle",
      "poids": "1",
      "intitule": "Assemblée nationale,",
      "numeroRue": "126",
      "nomRue": "Rue de l'Université,",
      "codePostal": "75355",
      "ville": "Paris 07 SP"
    },
    {
      "xsiType": "AdresseSiteWeb_Type",
      "uid": "AD423339",
      "type": "22",
      "typeLibelle": "Site internet",
      "valElec": "www.danielpaul-lehavre.org"
    }
  ],
  "mandats": [
    {
      "uid": "PM386452",
      "acteurRef": "PA2339",
      "legislature": "13",
      "typeOrgane": "ASSEMBLEE",
      "dateDebut": "2007-06-20T02:00:00.000+02:00",
      "dateFin": "2012-06-19T02:00:00.000+02:00",
      "preseance": "50",
      "nominPrincipale": "1",
      "infosQualite": {
        "codeQualite": "membre",
        "libQualite": "membre",
        "libQualiteSex": "membre"
      },
      "organesRefs": [
        "PO384266"
      ],
      "suppleant": {
        "dateDebut": "2007-06-20T02:00:00.000+02:00",
        "dateFin": "2012-06-19T02:00:00.000+02:00",
        "suppleantRef": "PA345636"
      },
      "election": {
        "lieu": {
          "region": "Normandie",
          "regionType": "Métropolitain",
          "departement": "Seine-Maritime",
          "numDepartement": "76",
          "numCirco": "8"
        },
        "causeMandat": "élections générales",
        "refCirconscription": "PO384690"
      },
      "mandature": {
        "datePriseFonction": "2007-06-20T02:00:00.000+02:00",
        "causeFin": "Fin de législature",
        "premiereElection": "1"
      }
    },
    {
      "uid": "PM387580",
      "acteurRef": "PA2339",
      "legislature": "13",
      "typeOrgane": "GP",
      "dateDebut": "2007-06-20T02:00:00.000+02:00",
      "dateFin": "2007-06-26T02:00:00.000+02:00",
      "preseance": "28",
      "nominPrincipale": "1",
      "infosQualite": {
        "codeQualite": "Député non-inscrit",
        "libQualite": "Député non-inscrit",
        "libQualiteSex": "Député non-inscrit"
      },
      "organesRefs": [
        "PO387155"
      ]
    },
    {
      "uid": "PM389686",
      "acteurRef": "PA2339",
      "legislature": "13",
      "typeOrgane": "GP",
      "dateDebut": "2007-06-27T02:00:00.000+02:00",
      "datePublication": "2007-06-27T02:00:00.000+02:00",
      "dateFin": "2012-06-19T02:00:00.000+02:00",
      "preseance": "20",
      "nominPrincipale": "1",
      "infosQualite": {
        "codeQualite": "Membre",
        "libQualite": "Membre du",
        "libQualiteSex": "Membre du"
      },
      "organesRefs": [
        "PO389635"
      ]
    },
    {
      "uid": "PM390359",
      "acteurRef": "PA2339",
      "legislature": "13",
      "typeOrgane": "COMPER",
      "dateDebut": "2007-06-27T02:00:00.000+02:00",
      "datePublication": "2007-06-28T02:00:00.000+02:00",
      "dateFin": "2009-04-28T02:00:00.000+02:00",
      "preseance": "32",
      "nominPrincipale": "1",
      "infosQualite": {
        "codeQualite": "Membre",
        "libQualite": "Membre",
        "libQualiteSex": "Membre"
      },
      "organesRefs": [
        "PO277060"
      ]
    },
    {
      "uid": "PM393588",
      "acteurRef": "PA2339",
      "legislature": "13",
      "typeOrgane": "CNPS",
      "dateDebut": "2007-07-24T02:00:00.000+02:00",
      "datePublication": "2007-07-24T02:00:00.000+02:00",
      "dateFin": "2007-08-02T02:00:00.000+02:00",
      "preseance": "20",
      "nominPrincipale": "1",
      "infosQualite": {
        "codeQualite": "Membre",
        "libQualite": "Membre",
        "libQualiteSex": "Membre"
      },
      "organesRefs": [
        "PO392640"
      ]
    },
    {
      "uid": "PM394527",
      "acteurRef": "PA2339",
      "legislature": "13",
      "typeOrgane": "ORGEXTPARL",
      "dateDebut": "2007-08-01T02:00:00.000+02:00",
      "datePublication": "2007-08-02T02:00:00.000+02:00",
      "dateFin": "2012-06-19T02:00:00.000+02:00",
      "preseance": "20",
      "nominPrincipale": "1",
      "infosQualite": {
        "codeQualite": "Titulaire",
        "libQualite": "Membre titulaire",
        "libQualiteSex": "Membre titulaire"
      },
      "organesRefs": [
        "PO60166"
      ]
    },
    {
      "uid": "PM395510",
      "acteurRef": "PA2339",
      "legislature": "13",
      "typeOrgane": "GA",
      "dateDebut": "2007-09-25T02:00:00.000+02:00",
      "dateFin": "2012-06-19T02:00:00.000+02:00",
      "preseance": "20",
      "nominPrincipale": "0",
      "infosQualite": {
        "codeQualite": "Membre",
        "libQualite": "Membre",
        "libQualiteSex": "Membre"
      },
      "organesRefs": [
        "PO392980"
      ]
    },
    {
      "uid": "PM395511",
      "acteurRef": "PA2339",
      "legislature": "13",
      "typeOrgane": "GA",
      "dateDebut": "2007-09-25T02:00:00.000+02:00",
      "dateFin": "2012-06-19T02:00:00.000+02:00",
      "preseance": "1",
      "nominPrincipale": "1",
      "infosQualite": {
        "codeQualite": "Président",
        "libQualite": "Président",
        "libQualiteSex": "Président"
      },
      "organesRefs": [
        "PO392980"
      ]
    },
    {
      "uid": "PM398347",
      "acteurRef": "PA2339",
      "legislature": "13",
      "typeOrgane": "GA",
      "dateDebut": "2007-10-11T02:00:00.000+02:00",
      "dateFin": "2012-06-19T02:00:00.000+02:00",
      "preseance": "20",
      "nominPrincipale": "1",
      "infosQualite": {
        "codeQualite": "Membre",
        "libQualite": "Membre",
        "libQualiteSex": "Membre"
      },
      "organesRefs": [
        "PO392990"
      ]
    },
    {
      "uid": "PM398348",
      "acteurRef": "PA2339",
      "legislature": "13",
      "typeOrgane": "GA",
      "dateDebut": "2007-10-11T02:00:00.000+02:00",
      "dateFin": "2012-06-19T02:00:00.000+02:00",
      "preseance": "20",
      "nominPrincipale": "1",
      "infosQualite": {
        "codeQualite": "Membre",
        "libQualite": "Membre",
        "libQualiteSex": "Membre"
      },
      "organesRefs": [
        "PO393060"
      ]
    },
    {
      "uid": "PM398349",
      "acteurRef": "PA2339",
      "legislature": "13",
      "typeOrgane": "GA",
      "dateDebut": "2007-10-11T02:00:00.000+02:00",
      "dateFin": "2012-06-19T02:00:00.000+02:00",
      "preseance": "20",
      "nominPrincipale": "1",
      "infosQualite": {
        "codeQualite": "Membre",
        "libQualite": "Membre",
        "libQualiteSex": "Membre"
      },
      "organesRefs": [
        "PO393408"
      ]
    },
    {
      "uid": "PM405548",
      "acteurRef": "PA2339",
      "legislature": "13",
      "typeOrgane": "GE",
      "dateDebut": "2007-12-12T01:00:00.000+01:00",
      "dateFin": "2012-06-19T02:00:00.000+02:00",
      "preseance": "20",
      "nominPrincipale": "0",
      "infosQualite": {
        "codeQualite": "Membre",
        "libQualite": "Membre",
        "libQualiteSex": "Membre"
      },
      "organesRefs": [
        "PO402808"
      ]
    },
    {
      "uid": "PM405563",
      "acteurRef": "PA2339",
      "legislature": "13",
      "typeOrgane": "GE",
      "dateDebut": "2007-12-12T01:00:00.000+01:00",
      "dateFin": "2012-06-19T02:00:00.000+02:00",
      "preseance": "8",
      "nominPrincipale": "1",
      "infosQualite": {
        "codeQualite": "Vice-Président",
        "libQualite": "Vice-Président",
        "libQualiteSex": "Vice-Président"
      },
      "organesRefs": [
        "PO402808"
      ]
    },
    {
      "uid": "PM405807",
      "acteurRef": "PA2339",
      "legislature": "13",
      "typeOrgane": "GA",
      "dateDebut": "2007-12-19T01:00:00.000+01:00",
      "dateFin": "2012-06-19T02:00:00.000+02:00",
      "preseance": "8",
      "nominPrincipale": "1",
      "infosQualite": {
        "codeQualite": "Vice-Président",
        "libQualite": "Vice-Président",
        "libQualiteSex": "Vice-Président"
      },
      "organesRefs": [
        "PO393060"
      ]
    },
    {
      "uid": "PM405936",
      "acteurRef": "PA2339",
      "legislature": "13",
      "typeOrgane": "GE",
      "dateDebut": "2007-12-20T01:00:00.000+01:00",
      "dateFin": "2012-06-19T02:00:00.000+02:00",
      "preseance": "20",
      "nominPrincipale": "1",
      "infosQualite": {
        "codeQualite": "Membre",
        "libQualite": "Membre",
        "libQualiteSex": "Membre"
      },
      "organesRefs": [
        "PO403141"
      ]
    },
    {
      "uid": "PM406309",
      "acteurRef": "PA2339",
      "legislature": "13",
      "typeOrgane": "GA",
      "dateDebut": "2008-01-09T01:00:00.000+01:00",
      "dateFin": "2012-06-19T02:00:00.000+02:00",
      "preseance": "20",
      "nominPrincipale": "1",
      "infosQualite": {
        "codeQualite": "Membre",
        "libQualite": "Membre",
        "libQualiteSex": "Membre"
      },
      "organesRefs": [
        "PO392820"
      ]
    },
    {
      "uid": "PM406310",
      "acteurRef": "PA2339",
      "legislature": "13",
      "typeOrgane": "GA",
      "dateDebut": "2008-01-09T01:00:00.000+01:00",
      "dateFin": "2012-06-19T02:00:00.000+02:00",
      "preseance": "20",
      "nominPrincipale": "1",
      "infosQualite": {
        "codeQualite": "Membre",
        "libQualite": "Membre",
        "libQualiteSex": "Membre"
      },
      "organesRefs": [
        "PO393040"
      ]
    },
    {
      "uid": "PM406311",
      "acteurRef": "PA2339",
      "legislature": "13",
      "typeOrgane": "GA",
      "dateDebut": "2008-01-09T01:00:00.000+01:00",
      "dateFin": "2012-06-19T02:00:00.000+02:00",
      "preseance": "20",
      "nominPrincipale": "1",
      "infosQualite": {
        "codeQualite": "Membre",
        "libQualite": "Membre",
        "libQualiteSex": "Membre"
      },
      "organesRefs": [
        "PO393268"
      ]
    },
    {
      "uid": "PM406312",
      "acteurRef": "PA2339",
      "legislature": "13",
      "typeOrgane": "GA",
      "dateDebut": "2008-01-09T01:00:00.000+01:00",
      "dateFin": "2012-06-19T02:00:00.000+02:00",
      "preseance": "20",
      "nominPrincipale": "1",
      "infosQualite": {
        "codeQualite": "Membre",
        "libQualite": "Membre",
        "libQualiteSex": "Membre"
      },
      "organesRefs": [
        "PO393328"
      ]
    },
    {
      "uid": "PM406326",
      "acteurRef": "PA2339",
      "legislature": "13",
      "typeOrgane": "GA",
      "dateDebut": "2008-01-10T01:00:00.000+01:00",
      "dateFin": "2012-06-19T02:00:00.000+02:00",
      "preseance": "8",
      "nominPrincipale": "1",
      "infosQualite": {
        "codeQualite": "Vice-Président",
        "libQualite": "Vice-Président",
        "libQualiteSex": "Vice-Président"
      },
      "organesRefs": [
        "PO393268"
      ]
    },
    {
      "uid": "PM406327",
      "acteurRef": "PA2339",
      "legislature": "13",
      "typeOrgane": "GA",
      "dateDebut": "2008-01-10T01:00:00.000+01:00",
      "dateFin": "2012-06-19T02:00:00.000+02:00",
      "preseance": "8",
      "nominPrincipale": "1",
      "infosQualite": {
        "codeQualite": "Vice-Président",
        "libQualite": "Vice-Président",
        "libQualiteSex": "Vice-Président"
      },
      "organesRefs": [
        "PO392820"
      ]
    },
    {
      "uid": "PM406378",
      "acteurRef": "PA2339",
      "legislature": "13",
      "typeOrgane": "GA",
      "dateDebut": "2008-01-11T01:00:00.000+01:00",
      "dateFin": "2012-06-19T02:00:00.000+02:00",
      "preseance": "8",
      "nominPrincipale": "1",
      "infosQualite": {
        "codeQualite": "Vice-Président",
        "libQualite": "Vice-Président",
        "libQualiteSex": "Vice-Président"
      },
      "organesRefs": [
        "PO393328"
      ]
    },
    {
      "uid": "PM406427",
      "acteurRef": "PA2339",
      "legislature": "13",
      "typeOrgane": "GE",
      "dateDebut": "2007-12-18T01:00:00.000+01:00",
      "dateFin": "2012-06-19T02:00:00.000+02:00",
      "preseance": "20",
      "nominPrincipale": "1",
      "infosQualite": {
        "codeQualite": "Membre",
        "libQualite": "Membre",
        "libQualiteSex": "Membre"
      },
      "organesRefs": [
        "PO403283"
      ]
    },
    {
      "uid": "PM406441",
      "acteurRef": "PA2339",
      "legislature": "13",
      "typeOrgane": "GE",
      "dateDebut": "2008-01-11T01:00:00.000+01:00",
      "dateFin": "2012-06-19T02:00:00.000+02:00",
      "preseance": "20",
      "nominPrincipale": "1",
      "infosQualite": {
        "codeQualite": "Membre",
        "libQualite": "Membre",
        "libQualiteSex": "Membre"
      },
      "organesRefs": [
        "PO403160"
      ]
    },
    {
      "uid": "PM406531",
      "acteurRef": "PA2339",
      "legislature": "13",
      "typeOrgane": "GE",
      "dateDebut": "2008-01-15T01:00:00.000+01:00",
      "dateFin": "2012-06-19T02:00:00.000+02:00",
      "preseance": "20",
      "nominPrincipale": "0",
      "infosQualite": {
        "codeQualite": "Membre",
        "libQualite": "Membre",
        "libQualiteSex": "Membre"
      },
      "organesRefs": [
        "PO402943"
      ]
    },
    {
      "uid": "PM407500",
      "acteurRef": "PA2339",
      "legislature": "13",
      "typeOrgane": "GE",
      "dateDebut": "2008-01-22T01:00:00.000+01:00",
      "dateFin": "2012-06-19T02:00:00.000+02:00",
      "preseance": "20",
      "nominPrincipale": "1",
      "infosQualite": {
        "codeQualite": "Membre",
        "libQualite": "Membre",
        "libQualiteSex": "Membre"
      },
      "organesRefs": [
        "PO402746"
      ]
    },
    {
      "uid": "PM407602",
      "acteurRef": "PA2339",
      "legislature": "13",
      "typeOrgane": "GE",
      "dateDebut": "2008-01-15T01:00:00.000+01:00",
      "dateFin": "2012-06-19T02:00:00.000+02:00",
      "preseance": "8",
      "nominPrincipale": "1",
      "infosQualite": {
        "codeQualite": "Vice-Président",
        "libQualite": "Vice-Président",
        "libQualiteSex": "Vice-Président"
      },
      "organesRefs": [
        "PO402943"
      ]
    },
    {
      "uid": "PM407881",
      "acteurRef": "PA2339",
      "legislature": "13",
      "typeOrgane": "GA",
      "dateDebut": "2008-01-25T01:00:00.000+01:00",
      "dateFin": "2012-06-19T02:00:00.000+02:00",
      "preseance": "8",
      "nominPrincipale": "1",
      "infosQualite": {
        "codeQualite": "Vice-Président",
        "libQualite": "Vice-Président",
        "libQualiteSex": "Vice-Président"
      },
      "organesRefs": [
        "PO392990"
      ]
    },
    {
      "uid": "PM407888",
      "acteurRef": "PA2339",
      "legislature": "13",
      "typeOrgane": "GA",
      "dateDebut": "2008-01-25T01:00:00.000+01:00",
      "dateFin": "2012-06-19T02:00:00.000+02:00",
      "preseance": "8",
      "nominPrincipale": "1",
      "infosQualite": {
        "codeQualite": "Vice-Président",
        "libQualite": "Vice-Président",
        "libQualiteSex": "Vice-Président"
      },
      "organesRefs": [
        "PO393408"
      ]
    },
    {
      "uid": "PM407889",
      "acteurRef": "PA2339",
      "legislature": "13",
      "typeOrgane": "GA",
      "dateDebut": "2008-01-25T01:00:00.000+01:00",
      "dateFin": "2012-06-19T02:00:00.000+02:00",
      "preseance": "20",
      "nominPrincipale": "0",
      "infosQualite": {
        "codeQualite": "Membre",
        "libQualite": "Membre",
        "libQualiteSex": "Membre"
      },
      "organesRefs": [
        "PO392915"
      ]
    },
    {
      "uid": "PM407890",
      "acteurRef": "PA2339",
      "legislature": "13",
      "typeOrgane": "GA",
      "dateDebut": "2008-01-25T01:00:00.000+01:00",
      "dateFin": "2012-06-19T02:00:00.000+02:00",
      "preseance": "8",
      "nominPrincipale": "1",
      "infosQualite": {
        "codeQualite": "Vice-Président",
        "libQualite": "Vice-Président",
        "libQualiteSex": "Vice-Président"
      },
      "organesRefs": [
        "PO392915"
      ]
    },
    {
      "uid": "PM408042",
      "acteurRef": "PA2339",
      "legislature": "13",
      "typeOrgane": "GE",
      "dateDebut": "2008-01-23T01:00:00.000+01:00",
      "dateFin": "2012-06-19T02:00:00.000+02:00",
      "preseance": "20",
      "nominPrincipale": "0",
      "infosQualite": {
        "codeQualite": "Membre",
        "libQualite": "Membre",
        "libQualiteSex": "Membre"
      },
      "organesRefs": [
        "PO403051"
      ]
    },
    {
      "uid": "PM409848",
      "acteurRef": "PA2339",
      "legislature": "13",
      "typeOrgane": "GE",
      "dateDebut": "2008-02-28T01:00:00.000+01:00",
      "dateFin": "2012-06-19T02:00:00.000+02:00",
      "preseance": "20",
      "nominPrincipale": "1",
      "infosQualite": {
        "codeQualite": "Membre",
        "libQualite": "Membre",
        "libQualiteSex": "Membre"
      },
      "organesRefs": [
        "PO402856"
      ]
    },
    {
      "uid": "PM412177",
      "acteurRef": "PA2339",
      "legislature": "13",
      "typeOrgane": "GE",
      "dateDebut": "2008-01-23T01:00:00.000+01:00",
      "dateFin": "2012-06-19T02:00:00.000+02:00",
      "preseance": "8",
      "nominPrincipale": "1",
      "infosQualite": {
        "codeQualite": "Vice-Président",
        "libQualite": "Vice-Président",
        "libQualiteSex": "Vice-Président"
      },
      "organesRefs": [
        "PO403051"
      ]
    },
    {
      "uid": "PM412325",
      "acteurRef": "PA2339",
      "legislature": "13",
      "typeOrgane": "GE",
      "dateDebut": "2008-03-26T01:00:00.000+01:00",
      "dateFin": "2012-06-19T02:00:00.000+02:00",
      "preseance": "20",
      "nominPrincipale": "0",
      "infosQualite": {
        "codeQualite": "Membre",
        "libQualite": "Membre",
        "libQualiteSex": "Membre"
      },
      "organesRefs": [
        "PO402795"
      ]
    },
    {
      "uid": "PM412345",
      "acteurRef": "PA2339",
      "legislature": "13",
      "typeOrgane": "GE",
      "dateDebut": "2008-03-26T01:00:00.000+01:00",
      "dateFin": "2012-06-19T02:00:00.000+02:00",
      "preseance": "8",
      "nominPrincipale": "1",
      "infosQualite": {
        "codeQualite": "Vice-Président",
        "libQualite": "Vice-Président",
        "libQualiteSex": "Vice-Président"
      },
      "organesRefs": [
        "PO402795"
      ]
    },
    {
      "uid": "PM412646",
      "acteurRef": "PA2339",
      "legislature": "13",
      "typeOrgane": "GE",
      "dateDebut": "2008-04-16T02:00:00.000+02:00",
      "dateFin": "2012-06-19T02:00:00.000+02:00",
      "preseance": "20",
      "nominPrincipale": "1",
      "infosQualite": {
        "codeQualite": "Membre",
        "libQualite": "Membre",
        "libQualiteSex": "Membre"
      },
      "organesRefs": [
        "PO403003"
      ]
    },
    {
      "uid": "PM413334",
      "acteurRef": "PA2339",
      "legislature": "13",
      "typeOrgane": "GE",
      "dateDebut": "2008-05-07T02:00:00.000+02:00",
      "dateFin": "2012-06-19T02:00:00.000+02:00",
      "preseance": "8",
      "nominPrincipale": "1",
      "infosQualite": {
        "codeQualite": "Vice-Président",
        "libQualite": "Vice-Président",
        "libQualiteSex": "Vice-Président"
      },
      "organesRefs": [
        "PO403160"
      ]
    },
    {
      "uid": "PM414046",
      "acteurRef": "PA2339",
      "legislature": "13",
      "typeOrgane": "GE",
      "dateDebut": "2008-06-20T02:00:00.000+02:00",
      "dateFin": "2012-06-19T02:00:00.000+02:00",
      "preseance": "20",
      "nominPrincipale": "1",
      "infosQualite": {
        "codeQualite": "Membre",
        "libQualite": "Membre",
        "libQualiteSex": "Membre"
      },
      "organesRefs": [
        "PO403135"
      ]
    },
    {
      "uid": "PM414370",
      "acteurRef": "PA2339",
      "legislature": "13",
      "typeOrgane": "GE",
      "dateDebut": "2008-06-24T02:00:00.000+02:00",
      "dateFin": "2012-06-19T02:00:00.000+02:00",
      "preseance": "8",
      "nominPrincipale": "1",
      "infosQualite": {
        "codeQualite": "Vice-Président",
        "libQualite": "Vice-Président",
        "libQualiteSex": "Vice-Président"
      },
      "organesRefs": [
        "PO403135"
      ]
    },
    {
      "uid": "PM415429",
      "acteurRef": "PA2339",
      "legislature": "13",
      "typeOrgane": "GE",
      "dateDebut": "2008-04-24T02:00:00.000+02:00",
      "dateFin": "2012-06-19T02:00:00.000+02:00",
      "preseance": "20",
      "nominPrincipale": "1",
      "infosQualite": {
        "codeQualite": "Membre",
        "libQualite": "Membre",
        "libQualiteSex": "Membre"
      },
      "organesRefs": [
        "PO403325"
      ]
    },
    {
      "uid": "PM418924",
      "acteurRef": "PA2339",
      "legislature": "13",
      "typeOrgane": "GE",
      "dateDebut": "2009-04-02T02:00:00.000+02:00",
      "dateFin": "2012-06-19T02:00:00.000+02:00",
      "preseance": "20",
      "nominPrincipale": "1",
      "infosQualite": {
        "codeQualite": "Membre",
        "libQualite": "Membre",
        "libQualiteSex": "Membre"
      },
      "organesRefs": [
        "PO417124"
      ]
    },
    {
      "uid": "PM419164",
      "acteurRef": "PA2339",
      "legislature": "13",
      "typeOrgane": "COMPER",
      "dateDebut": "2009-04-29T02:00:00.000+02:00",
      "datePublication": "2009-04-29T02:00:00.000+02:00",
      "dateFin": "2009-06-02T02:00:00.000+02:00",
      "preseance": "32",
      "nominPrincipale": "1",
      "infosQualite": {
        "codeQualite": "Membre",
        "libQualite": "Membre",
        "libQualiteSex": "Membre"
      },
      "organesRefs": [
        "PO59045"
      ]
    },
    {
      "uid": "PM419349",
      "acteurRef": "PA2339",
      "legislature": "13",
      "typeOrgane": "GE",
      "dateDebut": "2009-05-26T02:00:00.000+02:00",
      "dateFin": "2012-06-19T02:00:00.000+02:00",
      "preseance": "8",
      "nominPrincipale": "1",
      "infosQualite": {
        "codeQualite": "Vice-Président",
        "libQualite": "Vice-Président",
        "libQualiteSex": "Vice-Président"
      },
      "organesRefs": [
        "PO417124"
      ]
    },
    {
      "uid": "PM419376",
      "acteurRef": "PA2339",
      "legislature": "13",
      "typeOrgane": "COMPER",
      "dateDebut": "2009-06-03T02:00:00.000+02:00",
      "datePublication": "2009-06-03T02:00:00.000+02:00",
      "dateFin": "2009-06-30T02:00:00.000+02:00",
      "preseance": "32",
      "nominPrincipale": "1",
      "infosQualite": {
        "codeQualite": "Membre",
        "libQualite": "Membre",
        "libQualiteSex": "Membre"
      },
      "organesRefs": [
        "PO277060"
      ]
    },
    {
      "uid": "PM420585",
      "acteurRef": "PA2339",
      "legislature": "13",
      "typeOrgane": "COMPER",
      "dateDebut": "2009-07-01T02:00:00.000+02:00",
      "datePublication": "2009-07-01T02:00:00.000+02:00",
      "dateFin": "2009-11-09T01:00:00.000+01:00",
      "preseance": "32",
      "nominPrincipale": "0",
      "infosQualite": {
        "codeQualite": "Membre",
        "libQualite": "Membre",
        "libQualiteSex": "Membre"
      },
      "organesRefs": [
        "PO419610"
      ]
    },
    {
      "uid": "PM420824",
      "acteurRef": "PA2339",
      "legislature": "13",
      "typeOrgane": "COMPER",
      "dateDebut": "2009-07-01T02:00:00.000+02:00",
      "datePublication": "2009-07-02T02:00:00.000+02:00",
      "dateFin": "2009-11-09T01:00:00.000+01:00",
      "preseance": "16",
      "nominPrincipale": "1",
      "infosQualite": {
        "codeQualite": "Secrétaire",
        "libQualite": "Secrétaire",
        "libQualiteSex": "Secrétaire"
      },
      "organesRefs": [
        "PO419610"
      ]
    },
    {
      "uid": "PM421914",
      "acteurRef": "PA2339",
      "legislature": "13",
      "typeOrgane": "MISINFOCOM",
      "dateDebut": "2009-09-16T02:00:00.000+02:00",
      "datePublication": "2009-10-10T02:00:00.000+02:00",
      "dateFin": "2010-03-31T02:00:00.000+02:00",
      "preseance": "20",
      "nominPrincipale": "1",
      "infosQualite": {
        "codeQualite": "Membre",
        "libQualite": "Membre",
        "libQualiteSex": "Membre"
      },
      "organesRefs": [
        "PO421899"
      ]
    },
    {
      "uid": "PM422260",
      "acteurRef": "PA2339",
      "legislature": "13",
      "typeOrgane": "COMPER",
      "dateDebut": "2009-11-10T01:00:00.000+01:00",
      "datePublication": "2009-11-10T01:00:00.000+01:00",
      "dateFin": "2009-12-03T01:00:00.000+01:00",
      "preseance": "32",
      "nominPrincipale": "1",
      "infosQualite": {
        "codeQualite": "Membre",
        "libQualite": "Membre",
        "libQualiteSex": "Membre"
      },
      "organesRefs": [
        "PO420120"
      ]
    },
    {
      "uid": "PM422415",
      "acteurRef": "PA2339",
      "legislature": "13",
      "typeOrgane": "COMPER",
      "dateDebut": "2009-12-04T01:00:00.000+01:00",
      "datePublication": "2009-12-04T01:00:00.000+01:00",
      "dateFin": "2011-11-14T01:00:00.000+01:00",
      "preseance": "32",
      "nominPrincipale": "1",
      "infosQualite": {
        "codeQualite": "Membre",
        "libQualite": "Membre",
        "libQualiteSex": "Membre"
      },
      "organesRefs": [
        "PO419610"
      ]
    },
    {
      "uid": "PM423143",
      "acteurRef": "PA2339",
      "legislature": "13",
      "typeOrgane": "COMPER",
      "dateDebut": "2010-02-24T01:00:00.000+01:00",
      "datePublication": "2010-02-25T01:00:00.000+01:00",
      "dateFin": "2011-11-14T01:00:00.000+01:00",
      "preseance": "16",
      "nominPrincipale": "1",
      "infosQualite": {
        "codeQualite": "Secrétaire",
        "libQualite": "Secrétaire",
        "libQualiteSex": "Secrétaire"
      },
      "organesRefs": [
        "PO419610"
      ]
    },
    {
      "uid": "PM425155",
      "acteurRef": "PA2339",
      "legislature": "13",
      "typeOrgane": "ASSEMBLEE",
      "dateDebut": "2010-10-05T02:00:00.000+02:00",
      "dateFin": "2012-06-19T02:00:00.000+02:00",
      "preseance": "22",
      "nominPrincipale": "1",
      "infosQualite": {
        "codeQualite": "Secrétaire",
        "libQualite": "Secrétaire de l'Assemblée nationale",
        "libQualiteSex": "Secrétaire de l'Assemblée nationale"
      },
      "organesRefs": [
        "PO384266"
      ],
      "election": {
        "lieu": {}
      },
      "mandature": {
        "premiereElection": "0"
      }
    },
    {
      "uid": "PM425485",
      "acteurRef": "PA2339",
      "legislature": "13",
      "typeOrgane": "DELEGBUREAU",
      "dateDebut": "2010-10-27T02:00:00.000+02:00",
      "dateFin": "2012-06-19T02:00:00.000+02:00",
      "preseance": "24",
      "nominPrincipale": "1",
      "infosQualite": {
        "codeQualite": "Membre",
        "libQualite": "Membre",
        "libQualiteSex": "Membre"
      },
      "organesRefs": [
        "PO391126"
      ]
    },
    {
      "uid": "PM428018",
      "acteurRef": "PA2339",
      "legislature": "13",
      "typeOrgane": "OFFPAR",
      "dateDebut": "2011-04-08T02:00:00.000+02:00",
      "datePublication": "2011-04-08T02:00:00.000+02:00",
      "dateFin": "2011-12-13T01:00:00.000+01:00",
      "preseance": "24",
      "nominPrincipale": "1",
      "infosQualite": {
        "codeQualite": "Membre",
        "libQualite": "Membre",
        "libQualiteSex": "Membre"
      },
      "organesRefs": [
        "PO273589"
      ]
    },
    {
      "uid": "PM431107",
      "acteurRef": "PA2339",
      "legislature": "13",
      "typeOrgane": "COMPER",
      "dateDebut": "2011-11-15T01:00:00.000+01:00",
      "datePublication": "2011-11-15T01:00:00.000+01:00",
      "dateFin": "2011-11-17T01:00:00.000+01:00",
      "preseance": "32",
      "nominPrincipale": "1",
      "infosQualite": {
        "codeQualite": "Membre",
        "libQualite": "Membre",
        "libQualiteSex": "Membre"
      },
      "organesRefs": [
        "PO419865"
      ]
    },
    {
      "uid": "PM431199",
      "acteurRef": "PA2339",
      "legislature": "13",
      "typeOrgane": "COMPER",
      "dateDebut": "2011-11-18T01:00:00.000+01:00",
      "datePublication": "2011-11-18T01:00:00.000+01:00",
      "dateFin": "2011-11-29T01:00:00.000+01:00",
      "preseance": "32",
      "nominPrincipale": "1",
      "infosQualite": {
        "codeQualite": "Membre",
        "libQualite": "Membre",
        "libQualiteSex": "Membre"
      },
      "organesRefs": [
        "PO419610"
      ]
    },
    {
      "uid": "PM432413",
      "acteurRef": "PA2339",
      "legislature": "13",
      "typeOrgane": "COMPER",
      "dateDebut": "2011-11-30T01:00:00.000+01:00",
      "datePublication": "2011-11-30T01:00:00.000+01:00",
      "dateFin": "2011-12-01T01:00:00.000+01:00",
      "preseance": "32",
      "nominPrincipale": "1",
      "infosQualite": {
        "codeQualite": "Membre",
        "libQualite": "Membre",
        "libQualiteSex": "Membre"
      },
      "organesRefs": [
        "PO419865"
      ]
    },
    {
      "uid": "PM434672",
      "acteurRef": "PA2339",
      "legislature": "13",
      "typeOrgane": "COMPER",
      "dateDebut": "2011-12-02T01:00:00.000+01:00",
      "datePublication": "2011-12-02T01:00:00.000+01:00",
      "dateFin": "2012-02-27T01:00:00.000+01:00",
      "preseance": "16",
      "nominPrincipale": "1",
      "infosQualite": {
        "codeQualite": "Secrétaire",
        "libQualite": "Secrétaire",
        "libQualiteSex": "Secrétaire"
      },
      "organesRefs": [
        "PO419610"
      ]
    },
    {
      "uid": "PM447422",
      "acteurRef": "PA2339",
      "legislature": "13",
      "typeOrgane": "COMPER",
      "dateDebut": "2011-12-02T01:00:00.000+01:00",
      "datePublication": "2011-12-02T01:00:00.000+01:00",
      "dateFin": "2012-02-27T01:00:00.000+01:00",
      "preseance": "32",
      "nominPrincipale": "0",
      "infosQualite": {
        "codeQualite": "Membre",
        "libQualite": "Membre",
        "libQualiteSex": "Membre"
      },
      "organesRefs": [
        "PO419610"
      ]
    },
    {
      "uid": "PM518012",
      "acteurRef": "PA2339",
      "legislature": "13",
      "typeOrgane": "COMPER",
      "dateDebut": "2012-02-28T01:00:00.000+01:00",
      "datePublication": "2012-02-28T01:00:00.000+01:00",
      "dateFin": "2012-02-28T01:00:00.000+01:00",
      "preseance": "32",
      "nominPrincipale": "1",
      "infosQualite": {
        "codeQualite": "Membre",
        "libQualite": "Membre",
        "libQualiteSex": "Membre"
      },
      "organesRefs": [
        "PO59051"
      ]
    },
    {
      "uid": "PM519148",
      "acteurRef": "PA2339",
      "legislature": "13",
      "typeOrgane": "COMPER",
      "dateDebut": "2012-02-29T01:00:00.000+01:00",
      "datePublication": "2012-02-29T01:00:00.000+01:00",
      "dateFin": "2012-06-19T02:00:00.000+02:00",
      "preseance": "32",
      "nominPrincipale": "0",
      "infosQualite": {
        "codeQualite": "Membre",
        "libQualite": "Membre",
        "libQualiteSex": "Membre"
      },
      "organesRefs": [
        "PO419610"
      ]
    },
    {
      "uid": "PM550680",
      "acteurRef": "PA2339",
      "legislature": "13",
      "typeOrgane": "COMPER",
      "dateDebut": "2012-02-29T01:00:00.000+01:00",
      "dateFin": "2012-06-19T02:00:00.000+02:00",
      "preseance": "16",
      "nominPrincipale": "1",
      "infosQualite": {
        "codeQualite": "Secrétaire",
        "libQualite": "Secrétaire",
        "libQualiteSex": "Secrétaire"
      },
      "organesRefs": [
        "PO419610"
      ]
    }
  ]
}