{
  "uid": "PA1498",
  "etatCivil": {
    "ident": {
      "civ": "M.",
      "prenom": "Claude",
      "nom": "Goasguen",
      "alpha": "Goasguen",
      "trigramme": "CGO"
    },
    "infoNaissance": {
      "dateNais": "1945-03-12T01:00:00.000+01:00",
      "villeNais": "Toulon",
      "depNais": "Var",
      "paysNais": "France"
    }
  },
  "profession": {
    "libelleCourant": "Avocat à la Cour d'appel de Paris",
    "socProcInsee": {
      "catSocPro": "Professions libérales et assimilés",
      "famSocPro": "Cadres et professions intellectuelles supérieures"
    }
  },
  "uriHatvp": "https://www.hatvp.fr/pages_nominatives/goasguen-claude",
  "adresses": [
    {
      "xsiType": "AdressePostale_Type",
      "uid": "AD46774",
      "type": "2",
      "typeLibelle": "Adresse publiée de circonscription",
      "poids": "22",
      "intitule": "Mairie du 16è arrondissement de Paris",
      "numeroRue": "71",
      "nomRue": "Avenue Henri Martin",
      "codePostal": "75775",
      "ville": "Paris cedex 16"
    },
    {
      "xsiType": "AdresseTelephonique_Type",
      "uid": "AD47283",
      "type": "11",
      "typeLibelle": "Téléphone",
      "poids": "22",
      "adresseDeRattachement": "AD46774",
      "valElec": "01 40 72 16 00"
    },
    {
      "xsiType": "AdressePostale_Type",
      "uid": "AD386986",
      "type": "0",
      "typeLibelle": "Adresse officielle",
      "poids": "1",
      "intitule": "Assemblée nationale,",
      "numeroRue": "126",
      "nomRue": "Rue de l'Université,",
      "codePostal": "75355",
      "ville": "Paris 07 SP"
    },
    {
      "xsiType": "AdresseMail_Type",
      "uid": "AD727914",
      "type": "15",
      "typeLibelle": "Mèl",
      "valElec": "claude.goasguen@assemblee-nationale.fr"
    }
  ],
  "mandats": [
    {
      "uid": "PM386250",
      "acteurRef": "PA1498",
      "legislature": "13",
      "typeOrgane": "ASSEMBLEE",
      "dateDebut": "2007-06-20T02:00:00.000+02:00",
      "dateFin": "2012-06-19T02:00:00.000+02:00",
      "preseance": "50",
      "nominPrincipale": "1",
      "infosQualite": {
        "codeQualite": "membre",
        "libQualite": "membre",
        "libQualiteSex": "membre"
      },
      "organesRefs": [
        "PO384266"
      ],
      "suppleant": {
        "dateDebut": "2007-06-20T02:00:00.000+02:00",
        "dateFin": "2012-06-19T02:00:00.000+02:00",
        "suppleantRef": "PA1473"
      },
      "election": {
        "lieu": {
          "region": "Ile-de-France",
          "regionType": "Métropolitain",
          "departement": "Paris",
          "numDepartement": "75",
          "numCirco": "14"
        },
        "causeMandat": "élections générales",
        "refCirconscription": "PO384675"
      },
      "mandature": {
        "datePriseFonction": "2007-06-20T02:00:00.000+02:00",
        "causeFin": "Fin de législature",
        "premiereElection": "1",
        "placeHemicycle": "093"
      }
    },
    {
      "uid": "PM387565",
      "acteurRef": "PA1498",
      "legislature": "13",
      "typeOrgane": "GP",
      "dateDebut": "2007-06-20T02:00:00.000+02:00",
      "dateFin": "2007-06-26T02:00:00.000+02:00",
      "preseance": "28",
      "nominPrincipale": "1",
      "infosQualite": {
        "codeQualite": "Député non-inscrit",
        "libQualite": "Député non-inscrit",
        "libQualiteSex": "Député non-inscrit"
      },
      "organesRefs": [
        "PO387155"
      ]
    },
    {
      "uid": "PM389822",
      "acteurRef": "PA1498",
      "legislature": "13",
      "typeOrgane": "GP",
      "dateDebut": "2007-06-27T02:00:00.000+02:00",
      "datePublication": "2007-06-27T02:00:00.000+02:00",
      "dateFin": "2012-06-19T02:00:00.000+02:00",
      "preseance": "20",
      "nominPrincipale": "1",
      "infosQualite": {
        "codeQualite": "Membre",
        "libQualite": "Membre du",
        "libQualiteSex": "Membre du"
      },
      "organesRefs": [
        "PO389395"
      ]
    },
    {
      "uid": "PM390889",
      "acteurRef": "PA1498",
      "legislature": "13",
      "typeOrgane": "COMPER",
      "dateDebut": "2007-06-27T02:00:00.000+02:00",
      "datePublication": "2007-06-28T02:00:00.000+02:00",
      "dateFin": "2009-11-05T01:00:00.000+01:00",
      "preseance": "32",
      "nominPrincipale": "1",
      "infosQualite": {
        "codeQualite": "Membre",
        "libQualite": "Membre",
        "libQualiteSex": "Membre"
      },
      "organesRefs": [
        "PO59051"
      ]
    },
    {
      "uid": "PM393560",
      "acteurRef": "PA1498",
      "legislature": "13",
      "typeOrgane": "CNPS",
      "dateDebut": "2007-07-24T02:00:00.000+02:00",
      "datePublication": "2007-07-24T02:00:00.000+02:00",
      "dateFin": "2007-08-02T02:00:00.000+02:00",
      "preseance": "20",
      "nominPrincipale": "1",
      "infosQualite": {
        "codeQualite": "Membre",
        "libQualite": "Membre",
        "libQualiteSex": "Membre"
      },
      "organesRefs": [
        "PO392640"
      ]
    },
    {
      "uid": "PM393953",
      "acteurRef": "PA1498",
      "legislature": "13",
      "typeOrgane": "CMP",
      "dateDebut": "2007-07-27T02:00:00.000+02:00",
      "datePublication": "2007-07-28T02:00:00.000+02:00",
      "dateFin": "2007-07-31T02:00:00.000+02:00",
      "preseance": "28",
      "nominPrincipale": "1",
      "infosQualite": {
        "codeQualite": "Suppléant",
        "libQualite": "Membre suppléant",
        "libQualiteSex": "Membre suppléant"
      },
      "organesRefs": [
        "PO393935"
      ]
    },
    {
      "uid": "PM394837",
      "acteurRef": "PA1498",
      "legislature": "13",
      "typeOrgane": "ORGEXTPARL",
      "dateDebut": "2011-09-12T02:00:00.000+02:00",
      "datePublication": "2011-09-13T02:00:00.000+02:00",
      "dateFin": "2012-06-19T02:00:00.000+02:00",
      "preseance": "20",
      "nominPrincipale": "1",
      "infosQualite": {
        "codeQualite": "Titulaire",
        "libQualite": "Membre titulaire",
        "libQualiteSex": "Membre titulaire"
      },
      "organesRefs": [
        "PO394834"
      ]
    },
    {
      "uid": "PM395639",
      "acteurRef": "PA1498",
      "legislature": "13",
      "typeOrgane": "GA",
      "dateDebut": "2007-09-27T02:00:00.000+02:00",
      "dateFin": "2012-06-19T02:00:00.000+02:00",
      "preseance": "20",
      "nominPrincipale": "0",
      "infosQualite": {
        "codeQualite": "Membre",
        "libQualite": "Membre",
        "libQualiteSex": "Membre"
      },
      "organesRefs": [
        "PO393070"
      ]
    },
    {
      "uid": "PM395640",
      "acteurRef": "PA1498",
      "legislature": "13",
      "typeOrgane": "GA",
      "dateDebut": "2007-09-27T02:00:00.000+02:00",
      "dateFin": "2012-06-19T02:00:00.000+02:00",
      "preseance": "1",
      "nominPrincipale": "1",
      "infosQualite": {
        "codeQualite": "Président",
        "libQualite": "Président",
        "libQualiteSex": "Président"
      },
      "organesRefs": [
        "PO393070"
      ]
    },
    {
      "uid": "PM396183",
      "acteurRef": "PA1498",
      "legislature": "13",
      "typeOrgane": "GA",
      "dateDebut": "2007-10-04T02:00:00.000+02:00",
      "dateFin": "2012-06-19T02:00:00.000+02:00",
      "preseance": "20",
      "nominPrincipale": "1",
      "infosQualite": {
        "codeQualite": "Membre",
        "libQualite": "Membre",
        "libQualiteSex": "Membre"
      },
      "organesRefs": [
        "PO392950"
      ]
    },
    {
      "uid": "PM396184",
      "acteurRef": "PA1498",
      "legislature": "13",
      "typeOrgane": "GA",
      "dateDebut": "2007-10-04T02:00:00.000+02:00",
      "dateFin": "2012-06-19T02:00:00.000+02:00",
      "preseance": "20",
      "nominPrincipale": "1",
      "infosQualite": {
        "codeQualite": "Membre",
        "libQualite": "Membre",
        "libQualiteSex": "Membre"
      },
      "organesRefs": [
        "PO393015"
      ]
    },
    {
      "uid": "PM396185",
      "acteurRef": "PA1498",
      "legislature": "13",
      "typeOrgane": "GA",
      "dateDebut": "2007-10-04T02:00:00.000+02:00",
      "dateFin": "2012-06-19T02:00:00.000+02:00",
      "preseance": "20",
      "nominPrincipale": "1",
      "infosQualite": {
        "codeQualite": "Membre",
        "libQualite": "Membre",
        "libQualiteSex": "Membre"
      },
      "organesRefs": [
        "PO393075"
      ]
    },
    {
      "uid": "PM396186",
      "acteurRef": "PA1498",
      "legislature": "13",
      "typeOrgane": "GA",
      "dateDebut": "2007-10-04T02:00:00.000+02:00",
      "dateFin": "2012-06-19T02:00:00.000+02:00",
      "preseance": "20",
      "nominPrincipale": "1",
      "infosQualite": {
        "codeQualite": "Membre",
        "libQualite": "Membre",
        "libQualiteSex": "Membre"
      },
      "organesRefs": [
        "PO393192"
      ]
    },
    {
      "uid": "PM396187",
      "acteurRef": "PA1498",
      "legislature": "13",
      "typeOrgane": "GA",
      "dateDebut": "2007-10-04T02:00:00.000+02:00",
      "dateFin": "2012-06-19T02:00:00.000+02:00",
      "preseance": "20",
      "nominPrincipale": "1",
      "infosQualite": {
        "codeQualite": "Membre",
        "libQualite": "Membre",
        "libQualiteSex": "Membre"
      },
      "organesRefs": [
        "PO393338"
      ]
    },
    {
      "uid": "PM396188",
      "acteurRef": "PA1498",
      "legislature": "13",
      "typeOrgane": "GA",
      "dateDebut": "2007-10-04T02:00:00.000+02:00",
      "dateFin": "2012-06-19T02:00:00.000+02:00",
      "preseance": "20",
      "nominPrincipale": "1",
      "infosQualite": {
        "codeQualite": "Membre",
        "libQualite": "Membre",
        "libQualiteSex": "Membre"
      },
      "organesRefs": [
        "PO393348"
      ]
    },
    {
      "uid": "PM396189",
      "acteurRef": "PA1498",
      "legislature": "13",
      "typeOrgane": "GA",
      "dateDebut": "2007-10-04T02:00:00.000+02:00",
      "dateFin": "2012-06-19T02:00:00.000+02:00",
      "preseance": "20",
      "nominPrincipale": "1",
      "infosQualite": {
        "codeQualite": "Membre",
        "libQualite": "Membre",
        "libQualiteSex": "Membre"
      },
      "organesRefs": [
        "PO393483"
      ]
    },
    {
      "uid": "PM396190",
      "acteurRef": "PA1498",
      "legislature": "13",
      "typeOrgane": "GA",
      "dateDebut": "2007-10-04T02:00:00.000+02:00",
      "dateFin": "2012-06-19T02:00:00.000+02:00",
      "preseance": "20",
      "nominPrincipale": "1",
      "infosQualite": {
        "codeQualite": "Membre",
        "libQualite": "Membre",
        "libQualiteSex": "Membre"
      },
      "organesRefs": [
        "PO393508"
      ]
    },
    {
      "uid": "PM399636",
      "acteurRef": "PA1498",
      "legislature": "13",
      "typeOrgane": "CNPE",
      "dateDebut": "2007-10-16T02:00:00.000+02:00",
      "datePublication": "2007-10-17T02:00:00.000+02:00",
      "dateFin": "2008-01-23T01:00:00.000+01:00",
      "preseance": "20",
      "nominPrincipale": "1",
      "infosQualite": {
        "codeQualite": "Membre",
        "libQualite": "Membre",
        "libQualiteSex": "Membre"
      },
      "organesRefs": [
        "PO398680"
      ]
    },
    {
      "uid": "PM407254",
      "acteurRef": "PA1498",
      "legislature": "13",
      "typeOrgane": "GE",
      "dateDebut": "2008-01-01T01:00:00.000+01:00",
      "dateFin": "2012-06-19T02:00:00.000+02:00",
      "preseance": "20",
      "nominPrincipale": "1",
      "infosQualite": {
        "codeQualite": "Membre",
        "libQualite": "Membre",
        "libQualiteSex": "Membre"
      },
      "organesRefs": [
        "PO402985"
      ]
    },
    {
      "uid": "PM408397",
      "acteurRef": "PA1498",
      "legislature": "13",
      "typeOrgane": "GE",
      "dateDebut": "2008-02-07T01:00:00.000+01:00",
      "dateFin": "2012-06-19T02:00:00.000+02:00",
      "preseance": "20",
      "nominPrincipale": "1",
      "infosQualite": {
        "codeQualite": "Membre",
        "libQualite": "Membre",
        "libQualiteSex": "Membre"
      },
      "organesRefs": [
        "PO403178"
      ]
    },
    {
      "uid": "PM408551",
      "acteurRef": "PA1498",
      "legislature": "13",
      "typeOrgane": "GA",
      "dateDebut": "2008-02-05T01:00:00.000+01:00",
      "dateFin": "2012-06-19T02:00:00.000+02:00",
      "preseance": "8",
      "nominPrincipale": "1",
      "infosQualite": {
        "codeQualite": "Vice-Président",
        "libQualite": "Vice-Président",
        "libQualiteSex": "Vice-Président"
      },
      "organesRefs": [
        "PO393015"
      ]
    },
    {
      "uid": "PM412080",
      "acteurRef": "PA1498",
      "legislature": "13",
      "typeOrgane": "GE",
      "dateDebut": "2008-01-30T01:00:00.000+01:00",
      "dateFin": "2012-06-19T02:00:00.000+02:00",
      "preseance": "20",
      "nominPrincipale": "0",
      "infosQualite": {
        "codeQualite": "Membre",
        "libQualite": "Membre",
        "libQualiteSex": "Membre"
      },
      "organesRefs": [
        "PO403111"
      ]
    },
    {
      "uid": "PM412121",
      "acteurRef": "PA1498",
      "legislature": "13",
      "typeOrgane": "GE",
      "dateDebut": "2008-01-30T01:00:00.000+01:00",
      "dateFin": "2012-06-19T02:00:00.000+02:00",
      "preseance": "8",
      "nominPrincipale": "1",
      "infosQualite": {
        "codeQualite": "Vice-Président",
        "libQualite": "Vice-Président",
        "libQualiteSex": "Vice-Président"
      },
      "organesRefs": [
        "PO403111"
      ]
    },
    {
      "uid": "PM414547",
      "acteurRef": "PA1498",
      "legislature": "13",
      "typeOrgane": "GE",
      "dateDebut": "2008-07-07T02:00:00.000+02:00",
      "dateFin": "2012-06-19T02:00:00.000+02:00",
      "preseance": "20",
      "nominPrincipale": "1",
      "infosQualite": {
        "codeQualite": "Membre",
        "libQualite": "Membre",
        "libQualiteSex": "Membre"
      },
      "organesRefs": [
        "PO403184"
      ]
    },
    {
      "uid": "PM416107",
      "acteurRef": "PA1498",
      "legislature": "13",
      "typeOrgane": "GE",
      "dateDebut": "2008-10-08T02:00:00.000+02:00",
      "dateFin": "2012-06-19T02:00:00.000+02:00",
      "preseance": "20",
      "nominPrincipale": "1",
      "infosQualite": {
        "codeQualite": "Membre",
        "libQualite": "Membre",
        "libQualiteSex": "Membre"
      },
      "organesRefs": [
        "PO415352"
      ]
    },
    {
      "uid": "PM420568",
      "acteurRef": "PA1498",
      "legislature": "13",
      "typeOrgane": "COMNL",
      "dateDebut": "2009-07-01T02:00:00.000+02:00",
      "datePublication": "2009-07-01T02:00:00.000+02:00",
      "dateFin": "2012-06-19T02:00:00.000+02:00",
      "preseance": "20",
      "nominPrincipale": "1",
      "infosQualite": {
        "codeQualite": "Membre",
        "libQualite": "Membre",
        "libQualiteSex": "Membre"
      },
      "organesRefs": [
        "PO420375"
      ]
    },
    {
      "uid": "PM420905",
      "acteurRef": "PA1498",
      "legislature": "13",
      "typeOrgane": "COMNL",
      "dateDebut": "2009-07-02T02:00:00.000+02:00",
      "datePublication": "2009-07-03T02:00:00.000+02:00",
      "dateFin": "2012-06-19T02:00:00.000+02:00",
      "preseance": "8",
      "nominPrincipale": "1",
      "infosQualite": {
        "codeQualite": "Vice-Président",
        "libQualite": "Vice-Président",
        "libQualiteSex": "Vice-Président"
      },
      "organesRefs": [
        "PO420375"
      ]
    },
    {
      "uid": "PM421741",
      "acteurRef": "PA1498",
      "legislature": "13",
      "typeOrgane": "CMP",
      "dateDebut": "2009-09-28T02:00:00.000+02:00",
      "datePublication": "2009-09-30T02:00:00.000+02:00",
      "dateFin": "2009-10-26T01:00:00.000+01:00",
      "preseance": "20",
      "nominPrincipale": "1",
      "infosQualite": {
        "codeQualite": "Titulaire",
        "libQualite": "Membre titulaire",
        "libQualiteSex": "Membre titulaire"
      },
      "organesRefs": [
        "PO421619"
      ]
    },
    {
      "uid": "PM422204",
      "acteurRef": "PA1498",
      "legislature": "13",
      "typeOrgane": "COMPER",
      "dateDebut": "2009-11-06T01:00:00.000+01:00",
      "datePublication": "2009-11-06T01:00:00.000+01:00",
      "dateFin": "2009-11-09T01:00:00.000+01:00",
      "preseance": "32",
      "nominPrincipale": "1",
      "infosQualite": {
        "codeQualite": "Membre",
        "libQualite": "Membre",
        "libQualiteSex": "Membre"
      },
      "organesRefs": [
        "PO59048"
      ]
    },
    {
      "uid": "PM422256",
      "acteurRef": "PA1498",
      "legislature": "13",
      "typeOrgane": "COMPER",
      "dateDebut": "2009-11-10T01:00:00.000+01:00",
      "datePublication": "2009-11-10T01:00:00.000+01:00",
      "dateFin": "2012-02-24T01:00:00.000+01:00",
      "preseance": "32",
      "nominPrincipale": "1",
      "infosQualite": {
        "codeQualite": "Membre",
        "libQualite": "Membre",
        "libQualiteSex": "Membre"
      },
      "organesRefs": [
        "PO59051"
      ]
    },
    {
      "uid": "PM426940",
      "acteurRef": "PA1498",
      "legislature": "13",
      "typeOrgane": "GE",
      "dateDebut": "2011-02-04T01:00:00.000+01:00",
      "dateFin": "2012-06-19T02:00:00.000+02:00",
      "preseance": "20",
      "nominPrincipale": "1",
      "infosQualite": {
        "codeQualite": "Membre",
        "libQualite": "Membre",
        "libQualiteSex": "Membre"
      },
      "organesRefs": [
        "PO425013"
      ]
    },
    {
      "uid": "PM428119",
      "acteurRef": "PA1498",
      "legislature": "13",
      "typeOrgane": "CMP",
      "dateDebut": "2011-04-21T02:00:00.000+02:00",
      "datePublication": "2011-04-29T02:00:00.000+02:00",
      "dateFin": "2011-05-12T02:00:00.000+02:00",
      "preseance": "20",
      "nominPrincipale": "1",
      "infosQualite": {
        "codeQualite": "Titulaire",
        "libQualite": "Membre titulaire",
        "libQualiteSex": "Membre titulaire"
      },
      "organesRefs": [
        "PO428074"
      ]
    },
    {
      "uid": "PM428185",
      "acteurRef": "PA1498",
      "legislature": "13",
      "typeOrgane": "CMP",
      "dateDebut": "2011-05-04T02:00:00.000+02:00",
      "datePublication": "2011-05-05T02:00:00.000+02:00",
      "dateFin": "2011-05-12T02:00:00.000+02:00",
      "preseance": "16",
      "nominPrincipale": "1",
      "infosQualite": {
        "codeQualite": "Rapporteur",
        "libQualite": "Rapporteur",
        "libQualiteSex": "Rapporteur"
      },
      "organesRefs": [
        "PO428074"
      ]
    },
    {
      "uid": "PM515630",
      "acteurRef": "PA1498",
      "legislature": "13",
      "typeOrgane": "COMPER",
      "dateDebut": "2012-02-25T01:00:00.000+01:00",
      "datePublication": "2012-02-25T01:00:00.000+01:00",
      "dateFin": "2012-02-27T01:00:00.000+01:00",
      "preseance": "32",
      "nominPrincipale": "1",
      "infosQualite": {
        "codeQualite": "Membre",
        "libQualite": "Membre",
        "libQualiteSex": "Membre"
      },
      "organesRefs": [
        "PO59048"
      ]
    },
    {
      "uid": "PM518026",
      "acteurRef": "PA1498",
      "legislature": "13",
      "typeOrgane": "COMPER",
      "dateDebut": "2012-02-28T01:00:00.000+01:00",
      "datePublication": "2012-02-28T01:00:00.000+01:00",
      "dateFin": "2012-06-19T02:00:00.000+02:00",
      "preseance": "32",
      "nominPrincipale": "1",
      "infosQualite": {
        "codeQualite": "Membre",
        "libQualite": "Membre",
        "libQualiteSex": "Membre"
      },
      "organesRefs": [
        "PO59051"
      ]
    },
    {
      "uid": "PM645080",
      "acteurRef": "PA1498",
      "legislature": "14",
      "typeOrgane": "ASSEMBLEE",
      "dateDebut": "2012-06-20T02:00:00.000+02:00",
      "dateFin": "2017-06-20T02:00:00.000+02:00",
      "preseance": "50",
      "nominPrincipale": "1",
      "infosQualite": {
        "codeQualite": "membre",
        "libQualite": "membre",
        "libQualiteSex": "membre"
      },
      "organesRefs": [
        "PO644420"
      ],
      "suppleant": {
        "dateDebut": "2012-06-20T02:00:00.000+02:00",
        "dateFin": "2017-06-20T02:00:00.000+02:00",
        "suppleantRef": "PA1473"
      },
      "election": {
        "lieu": {
          "region": "Ile-de-France",
          "regionType": "Métropolitain",
          "departement": "Paris",
          "numDepartement": "75",
          "numCirco": "14"
        },
        "causeMandat": "élections générales",
        "refCirconscription": "PO644829"
      },
      "mandature": {
        "datePriseFonction": "2012-06-20T02:00:00.000+02:00",
        "causeFin": "Fin de législature",
        "premiereElection": "1",
        "placeHemicycle": "093"
      }
    },
    {
      "uid": "PM656395",
      "acteurRef": "PA1498",
      "legislature": "14",
      "typeOrgane": "GP",
      "dateDebut": "2012-06-26T02:00:00.000+02:00",
      "datePublication": "2012-06-27T02:00:00.000+02:00",
      "dateFin": "2015-06-01T02:00:00.000+02:00",
      "preseance": "20",
      "nominPrincipale": "1",
      "infosQualite": {
        "codeQualite": "Membre",
        "libQualite": "Membre du",
        "libQualiteSex": "Membre du"
      },
      "organesRefs": [
        "PO656006"
      ]
    },
    {
      "uid": "PM656997",
      "acteurRef": "PA1498",
      "legislature": "14",
      "typeOrgane": "COMPER",
      "dateDebut": "2012-06-28T02:00:00.000+02:00",
      "datePublication": "2012-06-28T02:00:00.000+02:00",
      "dateFin": "2017-06-20T02:00:00.000+02:00",
      "preseance": "32",
      "nominPrincipale": "1",
      "infosQualite": {
        "codeQualite": "Membre",
        "libQualite": "Membre",
        "libQualiteSex": "Membre"
      },
      "organesRefs": [
        "PO59048"
      ]
    },
    {
      "uid": "PM677140",
      "acteurRef": "PA1498",
      "legislature": "14",
      "typeOrgane": "COMNL",
      "dateDebut": "2012-07-25T02:00:00.000+02:00",
      "datePublication": "2012-07-25T02:00:00.000+02:00",
      "dateFin": "2017-06-20T02:00:00.000+02:00",
      "preseance": "20",
      "nominPrincipale": "1",
      "infosQualite": {
        "codeQualite": "Membre",
        "libQualite": "Membre",
        "libQualiteSex": "Membre"
      },
      "organesRefs": [
        "PO420375"
      ]
    },
    {
      "uid": "PM677450",
      "acteurRef": "PA1498",
      "legislature": "14",
      "typeOrgane": "COMNL",
      "dateDebut": "2012-07-26T02:00:00.000+02:00",
      "datePublication": "2012-07-27T02:00:00.000+02:00",
      "dateFin": "2015-01-14T01:00:00.000+01:00",
      "preseance": "8",
      "nominPrincipale": "1",
      "infosQualite": {
        "codeQualite": "Vice-Président",
        "libQualite": "Vice-Président",
        "libQualiteSex": "Vice-Président"
      },
      "organesRefs": [
        "PO420375"
      ]
    },
    {
      "uid": "PM677515",
      "acteurRef": "PA1498",
      "legislature": "14",
      "typeOrgane": "CMP",
      "dateDebut": "2012-07-30T02:00:00.000+02:00",
      "datePublication": "2012-07-31T02:00:00.000+02:00",
      "dateFin": "2012-07-30T02:00:00.000+02:00",
      "preseance": "28",
      "nominPrincipale": "1",
      "infosQualite": {
        "codeQualite": "Suppléant",
        "libQualite": "Membre suppléant",
        "libQualiteSex": "Membre suppléant"
      },
      "organesRefs": [
        "PO677474"
      ]
    },
    {
      "uid": "PM677843",
      "acteurRef": "PA1498",
      "legislature": "14",
      "typeOrgane": "ORGEXTPARL",
      "dateDebut": "2012-09-03T02:00:00.000+02:00",
      "datePublication": "2012-09-04T02:00:00.000+02:00",
      "dateFin": "2014-02-17T01:00:00.000+01:00",
      "preseance": "30",
      "nominPrincipale": "1",
      "infosQualite": {
        "codeQualite": "Suppléant",
        "libQualite": "Membre suppléant",
        "libQualiteSex": "Membre suppléant"
      },
      "organesRefs": [
        "PO394834"
      ]
    },
    {
      "uid": "PM679385",
      "acteurRef": "PA1498",
      "legislature": "14",
      "typeOrgane": "GA",
      "dateDebut": "2012-10-10T02:00:00.000+02:00",
      "dateFin": "2017-06-20T02:00:00.000+02:00",
      "preseance": "20",
      "nominPrincipale": "1",
      "infosQualite": {
        "codeQualite": "Membre",
        "libQualite": "Membre",
        "libQualiteSex": "Membre"
      },
      "organesRefs": [
        "PO675811"
      ]
    },
    {
      "uid": "PM679386",
      "acteurRef": "PA1498",
      "legislature": "14",
      "typeOrgane": "GA",
      "dateDebut": "2012-10-10T02:00:00.000+02:00",
      "dateFin": "2017-06-20T02:00:00.000+02:00",
      "preseance": "20",
      "nominPrincipale": "1",
      "infosQualite": {
        "codeQualite": "Membre",
        "libQualite": "Membre",
        "libQualiteSex": "Membre"
      },
      "organesRefs": [
        "PO675809"
      ]
    },
    {
      "uid": "PM679387",
      "acteurRef": "PA1498",
      "legislature": "14",
      "typeOrgane": "GA",
      "dateDebut": "2012-10-10T02:00:00.000+02:00",
      "dateFin": "2017-06-20T02:00:00.000+02:00",
      "preseance": "20",
      "nominPrincipale": "1",
      "infosQualite": {
        "codeQualite": "Membre",
        "libQualite": "Membre",
        "libQualiteSex": "Membre"
      },
      "organesRefs": [
        "PO675757"
      ]
    },
    {
      "uid": "PM679388",
      "acteurRef": "PA1498",
      "legislature": "14",
      "typeOrgane": "GA",
      "dateDebut": "2012-10-10T02:00:00.000+02:00",
      "dateFin": "2017-06-20T02:00:00.000+02:00",
      "preseance": "20",
      "nominPrincipale": "1",
      "infosQualite": {
        "codeQualite": "Membre",
        "libQualite": "Membre",
        "libQualiteSex": "Membre"
      },
      "organesRefs": [
        "PO675764"
      ]
    },
    {
      "uid": "PM679389",
      "acteurRef": "PA1498",
      "legislature": "14",
      "typeOrgane": "GA",
      "dateDebut": "2012-10-10T02:00:00.000+02:00",
      "dateFin": "2017-06-20T02:00:00.000+02:00",
      "preseance": "20",
      "nominPrincipale": "1",
      "infosQualite": {
        "codeQualite": "Membre",
        "libQualite": "Membre",
        "libQualiteSex": "Membre"
      },
      "organesRefs": [
        "PO675704"
      ]
    },
    {
      "uid": "PM679390",
      "acteurRef": "PA1498",
      "legislature": "14",
      "typeOrgane": "GA",
      "dateDebut": "2012-10-10T02:00:00.000+02:00",
      "dateFin": "2017-06-20T02:00:00.000+02:00",
      "preseance": "20",
      "nominPrincipale": "1",
      "infosQualite": {
        "codeQualite": "Membre",
        "libQualite": "Membre",
        "libQualiteSex": "Membre"
      },
      "organesRefs": [
        "PO675820"
      ]
    },
    {
      "uid": "PM679391",
      "acteurRef": "PA1498",
      "legislature": "14",
      "typeOrgane": "GA",
      "dateDebut": "2012-10-10T02:00:00.000+02:00",
      "dateFin": "2017-06-20T02:00:00.000+02:00",
      "preseance": "20",
      "nominPrincipale": "1",
      "infosQualite": {
        "codeQualite": "Membre",
        "libQualite": "Membre",
        "libQualiteSex": "Membre"
      },
      "organesRefs": [
        "PO675772"
      ]
    },
    {
      "uid": "PM684555",
      "acteurRef": "PA1498",
      "legislature": "14",
      "typeOrgane": "GA",
      "dateDebut": "2012-11-15T01:00:00.000+01:00",
      "dateFin": "2017-06-20T02:00:00.000+02:00",
      "preseance": "8",
      "nominPrincipale": "1",
      "infosQualite": {
        "codeQualite": "Vice-Président",
        "libQualite": "Vice-Président",
        "libQualiteSex": "Vice-Président"
      },
      "organesRefs": [
        "PO675764"
      ]
    },
    {
      "uid": "PM685493",
      "acteurRef": "PA1498",
      "typeOrgane": "PARPOL",
      "dateDebut": "2012-12-01T01:00:00.000+01:00",
      "dateFin": "2015-11-30T01:00:00.000+01:00",
      "preseance": "5",
      "nominPrincipale": "1",
      "infosQualite": {
        "codeQualite": "Membre",
        "libQualite": "Membre",
        "libQualiteSex": "Membre"
      },
      "organesRefs": [
        "PO684942"
      ]
    },
    {
      "uid": "PM686113",
      "acteurRef": "PA1498",
      "legislature": "14",
      "typeOrgane": "MISINFOPRE",
      "dateDebut": "2012-12-07T01:00:00.000+01:00",
      "datePublication": "2012-12-08T01:00:00.000+01:00",
      "dateFin": "2013-07-02T02:00:00.000+02:00",
      "preseance": "20",
      "nominPrincipale": "1",
      "infosQualite": {
        "codeQualite": "Membre",
        "libQualite": "Membre",
        "libQualiteSex": "Membre"
      },
      "organesRefs": [
        "PO684894"
      ]
    },
    {
      "uid": "PM687047",
      "acteurRef": "PA1498",
      "legislature": "14",
      "typeOrgane": "GA",
      "dateDebut": "2012-12-12T01:00:00.000+01:00",
      "dateFin": "2017-06-20T02:00:00.000+02:00",
      "preseance": "8",
      "nominPrincipale": "1",
      "infosQualite": {
        "codeQualite": "Vice-Président",
        "libQualite": "Vice-Président",
        "libQualiteSex": "Vice-Président"
      },
      "organesRefs": [
        "PO675757"
      ]
    },
    {
      "uid": "PM689578",
      "acteurRef": "PA1498",
      "legislature": "14",
      "typeOrgane": "GE",
      "dateDebut": "2013-01-20T01:00:00.000+01:00",
      "dateFin": "2017-06-20T02:00:00.000+02:00",
      "preseance": "20",
      "nominPrincipale": "1",
      "infosQualite": {
        "codeQualite": "Membre",
        "libQualite": "Membre",
        "libQualiteSex": "Membre"
      },
      "organesRefs": [
        "PO686802"
      ]
    },
    {
      "uid": "PM697966",
      "acteurRef": "PA1498",
      "legislature": "14",
      "typeOrgane": "CNPS",
      "dateDebut": "2013-10-22T02:00:00.000+02:00",
      "datePublication": "2013-10-22T02:00:00.000+02:00",
      "dateFin": "2016-04-14T02:00:00.000+02:00",
      "preseance": "20",
      "nominPrincipale": "1",
      "infosQualite": {
        "codeQualite": "Membre",
        "libQualite": "Membre",
        "libQualiteSex": "Membre"
      },
      "organesRefs": [
        "PO697810"
      ]
    },
    {
      "uid": "PM699462",
      "acteurRef": "PA1498",
      "legislature": "14",
      "typeOrgane": "MISINFOPRE",
      "dateDebut": "2014-01-15T01:00:00.000+01:00",
      "datePublication": "2014-01-16T01:00:00.000+01:00",
      "dateFin": "2014-10-28T01:00:00.000+01:00",
      "preseance": "20",
      "nominPrincipale": "1",
      "infosQualite": {
        "codeQualite": "Membre",
        "libQualite": "Membre",
        "libQualiteSex": "Membre"
      },
      "organesRefs": [
        "PO699419"
      ]
    },
    {
      "uid": "PM702741",
      "acteurRef": "PA1498",
      "legislature": "14",
      "typeOrgane": "GE",
      "dateDebut": "2014-06-25T02:00:00.000+02:00",
      "dateFin": "2017-06-20T02:00:00.000+02:00",
      "preseance": "20",
      "nominPrincipale": "1",
      "infosQualite": {
        "codeQualite": "Membre",
        "libQualite": "Membre",
        "libQualiteSex": "Membre"
      },
      "organesRefs": [
        "PO702209"
      ]
    },
    {
      "uid": "PM704414",
      "acteurRef": "PA1498",
      "legislature": "14",
      "typeOrgane": "CMP",
      "dateDebut": "2014-10-20T02:00:00.000+02:00",
      "datePublication": "2014-10-21T02:00:00.000+02:00",
      "dateFin": "2014-10-30T01:00:00.000+01:00",
      "preseance": "28",
      "nominPrincipale": "1",
      "infosQualite": {
        "codeQualite": "Suppléant",
        "libQualite": "Membre suppléant",
        "libQualiteSex": "Membre suppléant"
      },
      "organesRefs": [
        "PO704393"
      ]
    },
    {
      "uid": "PM705320",
      "acteurRef": "PA1498",
      "legislature": "14",
      "typeOrgane": "CNPE",
      "dateDebut": "2014-12-10T01:00:00.000+01:00",
      "datePublication": "2014-12-11T01:00:00.000+01:00",
      "dateFin": "2015-06-02T02:00:00.000+02:00",
      "preseance": "20",
      "nominPrincipale": "1",
      "infosQualite": {
        "codeQualite": "Membre",
        "libQualite": "Membre",
        "libQualiteSex": "Membre"
      },
      "organesRefs": [
        "PO705053"
      ]
    },
    {
      "uid": "PM705551",
      "acteurRef": "PA1498",
      "legislature": "14",
      "typeOrgane": "CNPE",
      "dateDebut": "2014-12-17T01:00:00.000+01:00",
      "datePublication": "2014-12-18T01:00:00.000+01:00",
      "dateFin": "2015-06-02T02:00:00.000+02:00",
      "preseance": "8",
      "nominPrincipale": "1",
      "infosQualite": {
        "codeQualite": "Vice-Président",
        "libQualite": "Vice-Président",
        "libQualiteSex": "Vice-Président"
      },
      "organesRefs": [
        "PO705053"
      ]
    },
    {
      "uid": "PM705974",
      "acteurRef": "PA1498",
      "legislature": "14",
      "typeOrgane": "GE",
      "dateDebut": "2015-01-27T01:00:00.000+01:00",
      "dateFin": "2017-06-20T02:00:00.000+02:00",
      "preseance": "20",
      "nominPrincipale": "1",
      "infosQualite": {
        "codeQualite": "Membre",
        "libQualite": "Membre",
        "libQualiteSex": "Membre"
      },
      "organesRefs": [
        "PO705526"
      ]
    },
    {
      "uid": "PM706235",
      "acteurRef": "PA1498",
      "legislature": "14",
      "typeOrgane": "COMNL",
      "dateDebut": "2015-01-22T01:00:00.000+01:00",
      "datePublication": "2015-02-10T01:00:00.000+01:00",
      "dateFin": "2017-06-20T02:00:00.000+02:00",
      "preseance": "8",
      "nominPrincipale": "1",
      "infosQualite": {
        "codeQualite": "Vice-Président",
        "libQualite": "Vice-Président",
        "libQualiteSex": "Vice-Président"
      },
      "organesRefs": [
        "PO420375"
      ]
    },
    {
      "uid": "PM707962",
      "acteurRef": "PA1498",
      "legislature": "14",
      "typeOrgane": "GP",
      "dateDebut": "2015-06-02T02:00:00.000+02:00",
      "datePublication": "2015-06-02T02:00:00.000+02:00",
      "dateFin": "2017-06-20T02:00:00.000+02:00",
      "preseance": "20",
      "nominPrincipale": "1",
      "infosQualite": {
        "codeQualite": "Membre",
        "libQualite": "Membre du",
        "libQualiteSex": "Membre du"
      },
      "organesRefs": [
        "PO707869"
      ]
    },
    {
      "uid": "PM710480",
      "acteurRef": "PA1498",
      "typeOrgane": "PARPOL",
      "dateDebut": "2015-12-01T01:00:00.000+01:00",
      "dateFin": "2017-06-20T02:00:00.000+02:00",
      "preseance": "5",
      "nominPrincipale": "1",
      "infosQualite": {
        "codeQualite": "Membre",
        "libQualite": "Membre",
        "libQualiteSex": "Membre"
      },
      "organesRefs": [
        "PO710396"
      ]
    },
    {
      "uid": "PM710731",
      "acteurRef": "PA1498",
      "legislature": "14",
      "typeOrgane": "MISINFOPRE",
      "dateDebut": "2015-12-10T01:00:00.000+01:00",
      "datePublication": "2015-12-11T01:00:00.000+01:00",
      "dateFin": "2016-07-20T02:00:00.000+02:00",
      "preseance": "20",
      "nominPrincipale": "1",
      "infosQualite": {
        "codeQualite": "Membre",
        "libQualite": "Membre",
        "libQualiteSex": "Membre"
      },
      "organesRefs": [
        "PO710376"
      ]
    },
    {
      "uid": "PM711887",
      "acteurRef": "PA1498",
      "legislature": "14",
      "typeOrgane": "GE",
      "dateDebut": "2014-09-17T02:00:00.000+02:00",
      "dateFin": "2016-03-13T01:00:00.000+01:00",
      "preseance": "8",
      "nominPrincipale": "1",
      "infosQualite": {
        "codeQualite": "Vice-Président",
        "libQualite": "Vice-Président",
        "libQualiteSex": "Vice-Président"
      },
      "organesRefs": [
        "PO702209"
      ]
    },
    {
      "uid": "PM711888",
      "acteurRef": "PA1498",
      "legislature": "14",
      "typeOrgane": "GE",
      "dateDebut": "2016-03-14T01:00:00.000+01:00",
      "dateFin": "2017-06-20T02:00:00.000+02:00",
      "preseance": "4",
      "nominPrincipale": "1",
      "infosQualite": {
        "codeQualite": "Co-Président",
        "libQualite": "Co-Président",
        "libQualiteSex": "Co-Président"
      },
      "organesRefs": [
        "PO702209"
      ]
    },
    {
      "uid": "PM716244",
      "acteurRef": "PA1498",
      "legislature": "14",
      "typeOrgane": "CMP",
      "dateDebut": "2016-12-15T01:00:00.000+01:00",
      "datePublication": "2016-12-17T01:00:00.000+01:00",
      "dateFin": "2016-12-20T01:00:00.000+01:00",
      "preseance": "20",
      "nominPrincipale": "1",
      "infosQualite": {
        "codeQualite": "Titulaire",
        "libQualite": "Membre titulaire",
        "libQualiteSex": "Membre titulaire"
      },
      "organesRefs": [
        "PO716192"
      ]
    },
    {
      "uid": "PM716294",
      "acteurRef": "PA1498",
      "legislature": "14",
      "typeOrgane": "CMP",
      "dateDebut": "2016-12-20T01:00:00.000+01:00",
      "datePublication": "2016-12-21T01:00:00.000+01:00",
      "dateFin": "2016-12-22T01:00:00.000+01:00",
      "preseance": "20",
      "nominPrincipale": "1",
      "infosQualite": {
        "codeQualite": "Titulaire",
        "libQualite": "Membre titulaire",
        "libQualiteSex": "Membre titulaire"
      },
      "organesRefs": [
        "PO716278"
      ]
    },
    {
      "uid": "PM723396",
      "acteurRef": "PA1498",
      "legislature": "15",
      "typeOrgane": "ASSEMBLEE",
      "dateDebut": "2017-06-18T02:00:00.000+02:00",
      "preseance": "50",
      "nominPrincipale": "1",
      "infosQualite": {
        "codeQualite": "membre",
        "libQualite": "membre",
        "libQualiteSex": "membre"
      },
      "organesRefs": [
        "PO717460"
      ],
      "suppleant": {
        "dateDebut": "2017-06-18T02:00:00.000+02:00",
        "suppleantRef": "PA721832"
      },
      "election": {
        "lieu": {
          "region": "Ile-de-France",
          "regionType": "Métropolitain",
          "departement": "Paris",
          "numDepartement": "75",
          "numCirco": "14"
        },
        "causeMandat": "élections générales",
        "refCirconscription": "PO718216"
      },
      "mandature": {
        "datePriseFonction": "2017-06-21T02:00:00.000+02:00",
        "premiereElection": "1",
        "placeHemicycle": "093"
      },
      "collaborateurs": [
        {
          "qualite": "Mme",
          "prenom": "Joséphine",
          "nom": "De Beaucorps"
        },
        {
          "qualite": "M.",
          "prenom": "Eddy",
          "nom": "Golob"
        },
        {
          "qualite": "Mme",
          "prenom": "Betty",
          "nom": "Dujardin"
        },
        {
          "qualite": "Mme",
          "prenom": "Aurélie",
          "nom": "Pirillo"
        }
      ]
    },
    {
      "uid": "PM724739",
      "acteurRef": "PA1498",
      "legislature": "15",
      "typeOrgane": "GP",
      "dateDebut": "2017-06-21T02:00:00.000+02:00",
      "dateFin": "2017-06-26T02:00:00.000+02:00",
      "preseance": "28",
      "nominPrincipale": "1",
      "infosQualite": {
        "codeQualite": "Député non-inscrit",
        "libQualite": "Député non-inscrit",
        "libQualiteSex": "Député non-inscrit"
      },
      "organesRefs": [
        "PO723569"
      ]
    },
    {
      "uid": "PM731328",
      "acteurRef": "PA1498",
      "legislature": "15",
      "typeOrgane": "GP",
      "dateDebut": "2017-06-27T02:00:00.000+02:00",
      "datePublication": "2017-06-28T02:00:00.000+02:00",
      "preseance": "20",
      "nominPrincipale": "1",
      "infosQualite": {
        "codeQualite": "Membre",
        "libQualite": "Membre du",
        "libQualiteSex": "Membre du"
      },
      "organesRefs": [
        "PO730934"
      ]
    },
    {
      "uid": "PM731763",
      "acteurRef": "PA1498",
      "legislature": "15",
      "typeOrgane": "COMPER",
      "dateDebut": "2017-06-29T02:00:00.000+02:00",
      "datePublication": "2017-06-29T02:00:00.000+02:00",
      "preseance": "32",
      "nominPrincipale": "1",
      "infosQualite": {
        "codeQualite": "Membre",
        "libQualite": "Membre",
        "libQualiteSex": "Membre"
      },
      "organesRefs": [
        "PO59047"
      ]
    },
    {
      "uid": "PM734448",
      "acteurRef": "PA1498",
      "legislature": "15",
      "typeOrgane": "API",
      "dateDebut": "2017-08-02T02:00:00.000+02:00",
      "datePublication": "2017-08-03T02:00:00.000+02:00",
      "preseance": "20",
      "nominPrincipale": "1",
      "infosQualite": {
        "codeQualite": "Titulaire",
        "libQualite": "Membre titulaire",
        "libQualiteSex": "Membre titulaire"
      },
      "organesRefs": [
        "PO58974"
      ]
    },
    {
      "uid": "PM736949",
      "acteurRef": "PA1498",
      "legislature": "15",
      "typeOrgane": "GA",
      "dateDebut": "2017-10-03T02:00:00.000+02:00",
      "preseance": "20",
      "nominPrincipale": "1",
      "infosQualite": {
        "codeQualite": "Membre",
        "libQualite": "Membre",
        "libQualiteSex": "Membre"
      },
      "organesRefs": [
        "PO732919"
      ]
    },
    {
      "uid": "PM736950",
      "acteurRef": "PA1498",
      "legislature": "15",
      "typeOrgane": "GA",
      "dateDebut": "2017-10-03T02:00:00.000+02:00",
      "preseance": "20",
      "nominPrincipale": "1",
      "infosQualite": {
        "codeQualite": "Membre",
        "libQualite": "Membre",
        "libQualiteSex": "Membre"
      },
      "organesRefs": [
        "PO733032"
      ]
    },
    {
      "uid": "PM736951",
      "acteurRef": "PA1498",
      "legislature": "15",
      "typeOrgane": "GA",
      "dateDebut": "2017-10-03T02:00:00.000+02:00",
      "preseance": "20",
      "nominPrincipale": "1",
      "infosQualite": {
        "codeQualite": "Membre",
        "libQualite": "Membre",
        "libQualiteSex": "Membre"
      },
      "organesRefs": [
        "PO733057"
      ]
    },
    {
      "uid": "PM736952",
      "acteurRef": "PA1498",
      "legislature": "15",
      "typeOrgane": "GA",
      "dateDebut": "2017-10-03T02:00:00.000+02:00",
      "preseance": "20",
      "nominPrincipale": "1",
      "infosQualite": {
        "codeQualite": "Membre",
        "libQualite": "Membre",
        "libQualiteSex": "Membre"
      },
      "organesRefs": [
        "PO733072"
      ]
    },
    {
      "uid": "PM736953",
      "acteurRef": "PA1498",
      "legislature": "15",
      "typeOrgane": "GA",
      "dateDebut": "2017-10-03T02:00:00.000+02:00",
      "preseance": "20",
      "nominPrincipale": "1",
      "infosQualite": {
        "codeQualite": "Membre",
        "libQualite": "Membre",
        "libQualiteSex": "Membre"
      },
      "organesRefs": [
        "PO733342"
      ]
    },
    {
      "uid": "PM736954",
      "acteurRef": "PA1498",
      "legislature": "15",
      "typeOrgane": "GA",
      "dateDebut": "2017-10-03T02:00:00.000+02:00",
      "preseance": "20",
      "nominPrincipale": "1",
      "infosQualite": {
        "codeQualite": "Membre",
        "libQualite": "Membre",
        "libQualiteSex": "Membre"
      },
      "organesRefs": [
        "PO733352"
      ]
    },
    {
      "uid": "PM736955",
      "acteurRef": "PA1498",
      "legislature": "15",
      "typeOrgane": "GA",
      "dateDebut": "2017-10-03T02:00:00.000+02:00",
      "preseance": "20",
      "nominPrincipale": "0",
      "infosQualite": {
        "codeQualite": "Membre",
        "libQualite": "Membre",
        "libQualiteSex": "Membre"
      },
      "organesRefs": [
        "PO733382"
      ]
    },
    {
      "uid": "PM736956",
      "acteurRef": "PA1498",
      "legislature": "15",
      "typeOrgane": "GA",
      "dateDebut": "2017-10-03T02:00:00.000+02:00",
      "preseance": "20",
      "nominPrincipale": "1",
      "infosQualite": {
        "codeQualite": "Membre",
        "libQualite": "Membre",
        "libQualiteSex": "Membre"
      },
      "organesRefs": [
        "PO733577"
      ]
    },
    {
      "uid": "PM738087",
      "acteurRef": "PA1498",
      "legislature": "15",
      "typeOrgane": "ORGEXTPARL",
      "dateDebut": "2017-10-05T02:00:00.000+02:00",
      "datePublication": "2017-10-06T02:00:00.000+02:00",
      "preseance": "20",
      "nominPrincipale": "1",
      "infosQualite": {
        "codeQualite": "Titulaire",
        "libQualite": "Membre titulaire",
        "libQualiteSex": "Membre titulaire"
      },
      "organesRefs": [
        "PO693355"
      ]
    },
    {
      "uid": "PM742891",
      "acteurRef": "PA1498",
      "legislature": "15",
      "typeOrgane": "GA",
      "dateDebut": "2017-10-31T01:00:00.000+01:00",
      "preseance": "8",
      "nominPrincipale": "1",
      "infosQualite": {
        "codeQualite": "Vice-Président",
        "libQualite": "Vice-Président",
        "libQualiteSex": "Vice-Président"
      },
      "organesRefs": [
        "PO733382"
      ]
    },
    {
      "uid": "PM744802",
      "acteurRef": "PA1498",
      "legislature": "15",
      "typeOrgane": "CNPS",
      "dateDebut": "2017-12-06T01:00:00.000+01:00",
      "datePublication": "2017-12-06T01:00:00.000+01:00",
      "dateFin": "2018-07-31T02:00:00.000+02:00",
      "preseance": "20",
      "nominPrincipale": "1",
      "infosQualite": {
        "codeQualite": "Membre",
        "libQualite": "Membre",
        "libQualiteSex": "Membre"
      },
      "organesRefs": [
        "PO744107"
      ]
    },
    {
      "uid": "PM745575",
      "acteurRef": "PA1498",
      "typeOrgane": "PARPOL",
      "dateDebut": "2017-12-01T01:00:00.000+01:00",
      "preseance": "5",
      "nominPrincipale": "1",
      "infosQualite": {
        "codeQualite": "Membre",
        "libQualite": "Membre",
        "libQualiteSex": "Membre"
      },
      "organesRefs": [
        "PO710396"
      ]
    },
    {
      "uid": "PM748870",
      "acteurRef": "PA1498",
      "legislature": "15",
      "typeOrgane": "GE",
      "dateDebut": "2018-02-01T01:00:00.000+01:00",
      "preseance": "20",
      "nominPrincipale": "0",
      "infosQualite": {
        "codeQualite": "Membre",
        "libQualite": "Membre",
        "libQualiteSex": "Membre"
      },
      "organesRefs": [
        "PO746679"
      ]
    },
    {
      "uid": "PM748871",
      "acteurRef": "PA1498",
      "legislature": "15",
      "typeOrgane": "GE",
      "dateDebut": "2018-02-01T01:00:00.000+01:00",
      "preseance": "4",
      "nominPrincipale": "1",
      "infosQualite": {
        "codeQualite": "Co-Président",
        "libQualite": "Co-Président",
        "libQualiteSex": "Co-Président"
      },
      "organesRefs": [
        "PO746679"
      ]
    },
    {
      "uid": "PM750371",
      "acteurRef": "PA1498",
      "legislature": "15",
      "typeOrgane": "GE",
      "dateDebut": "2018-02-14T01:00:00.000+01:00",
      "preseance": "20",
      "nominPrincipale": "1",
      "infosQualite": {
        "codeQualite": "Membre",
        "libQualite": "Membre",
        "libQualiteSex": "Membre"
      },
      "organesRefs": [
        "PO746748"
      ]
    },
    {
      "uid": "PM750440",
      "acteurRef": "PA1498",
      "legislature": "15",
      "typeOrgane": "GE",
      "dateDebut": "2018-02-14T01:00:00.000+01:00",
      "preseance": "20",
      "nominPrincipale": "1",
      "infosQualite": {
        "codeQualite": "Membre",
        "libQualite": "Membre",
        "libQualiteSex": "Membre"
      },
      "organesRefs": [
        "PO747032"
      ]
    },
    {
      "uid": "PM752879",
      "acteurRef": "PA1498",
      "legislature": "15",
      "typeOrgane": "GE",
      "dateDebut": "2018-03-08T01:00:00.000+01:00",
      "preseance": "20",
      "nominPrincipale": "0",
      "infosQualite": {
        "codeQualite": "Membre",
        "libQualite": "Membre",
        "libQualiteSex": "Membre"
      },
      "organesRefs": [
        "PO746629"
      ]
    },
    {
      "uid": "PM754385",
      "acteurRef": "PA1498",
      "legislature": "15",
      "typeOrgane": "GE",
      "dateDebut": "2018-03-27T02:00:00.000+02:00",
      "preseance": "8",
      "nominPrincipale": "1",
      "infosQualite": {
        "codeQualite": "Vice-Président",
        "libQualite": "Vice-Président",
        "libQualiteSex": "Vice-Président"
      },
      "organesRefs": [
        "PO746629"
      ]
    },
    {
      "uid": "PM755332",
      "acteurRef": "PA1498",
      "legislature": "15",
      "typeOrgane": "GE",
      "dateDebut": "2018-04-05T02:00:00.000+02:00",
      "preseance": "20",
      "nominPrincipale": "0",
      "infosQualite": {
        "codeQualite": "Membre",
        "libQualite": "Membre",
        "libQualiteSex": "Membre"
      },
      "organesRefs": [
        "PO747067"
      ]
    },
    {
      "uid": "PM756227",
      "acteurRef": "PA1498",
      "legislature": "15",
      "typeOrgane": "GE",
      "dateDebut": "2018-05-16T02:00:00.000+02:00",
      "preseance": "12",
      "nominPrincipale": "1",
      "infosQualite": {
        "codeQualite": "Secrétaire",
        "libQualite": "Secrétaire",
        "libQualiteSex": "Secrétaire"
      },
      "organesRefs": [
        "PO747067"
      ]
    },
    {
      "uid": "PM756644",
      "acteurRef": "PA1498",
      "legislature": "15",
      "typeOrgane": "GE",
      "dateDebut": "2018-05-29T02:00:00.000+02:00",
      "preseance": "20",
      "nominPrincipale": "1",
      "infosQualite": {
        "codeQualite": "Membre",
        "libQualite": "Membre",
        "libQualiteSex": "Membre"
      },
      "organesRefs": [
        "PO747175"
      ]
    },
    {
      "uid": "PM756776",
      "acteurRef": "PA1498",
      "legislature": "15",
      "typeOrgane": "GE",
      "dateDebut": "2018-06-01T02:00:00.000+02:00",
      "preseance": "20",
      "nominPrincipale": "1",
      "infosQualite": {
        "codeQualite": "Membre",
        "libQualite": "Membre",
        "libQualiteSex": "Membre"
      },
      "organesRefs": [
        "PO746915"
      ]
    },
    {
      "uid": "PM760028",
      "acteurRef": "PA1498",
      "legislature": "15",
      "typeOrgane": "MISINFO",
      "dateDebut": "2018-10-17T02:00:00.000+02:00",
      "preseance": "10",
      "nominPrincipale": "0",
      "infosQualite": {
        "codeQualite": "Membre",
        "libQualite": "Membre",
        "libQualiteSex": "Membre"
      },
      "organesRefs": [
        "PO760024"
      ]
    },
    {
      "uid": "PM760030",
      "acteurRef": "PA1498",
      "legislature": "15",
      "typeOrgane": "MISINFO",
      "dateDebut": "2018-10-17T02:00:00.000+02:00",
      "preseance": "5",
      "nominPrincipale": "1",
      "infosQualite": {
        "codeQualite": "Co-rapporteur",
        "libQualite": "Co-rapporteur",
        "libQualiteSex": "Co-rapporteur"
      },
      "organesRefs": [
        "PO760024"
      ]
    }
  ]
}