{
  "uid": "PA825",
  "etatCivil": {
    "ident": {
      "civ": "M.",
      "prenom": "Hervé",
      "nom": "de Charette",
      "alpha": "Charette (de)"
    },
    "infoNaissance": {
      "dateNais": "1938-07-30T01:00:00.000+01:00",
      "villeNais": "Paris",
      "depNais": "Paris"
    }
  },
  "profession": {
    "libelleCourant": "Avocat",
    "socProcInsee": {
      "catSocPro": "Professions libérales et assimilés",
      "famSocPro": "Cadres et professions intellectuelles supérieures"
    }
  },
  "adresses": [
    {
      "xsiType": "AdressePostale_Type",
      "uid": "AD46574",
      "type": "2",
      "typeLibelle": "Adresse publiée de circonscription",
      "poids": "21",
      "intitule": "Mairie,",
      "codePostal": "49410",
      "ville": "Saint-Florent-le-Vieil"
    },
    {
      "xsiType": "AdresseTelephonique_Type",
      "uid": "AD47962",
      "type": "11",
      "typeLibelle": "Téléphone",
      "poids": "21",
      "adresseDeRattachement": "AD46574",
      "valElec": "02 41 72 50 39"
    },
    {
      "xsiType": "AdresseTelephonique_Type",
      "uid": "AD49634",
      "type": "12",
      "typeLibelle": "Télécopie",
      "poids": "21",
      "adresseDeRattachement": "AD46574",
      "valElec": "02 41 72 55 85"
    },
    {
      "xsiType": "AdressePostale_Type",
      "uid": "AD386808",
      "type": "0",
      "typeLibelle": "Adresse officielle",
      "poids": "1",
      "intitule": "Assemblée nationale,",
      "numeroRue": "126",
      "nomRue": "Rue de l'Université,",
      "codePostal": "75355",
      "ville": "Paris 07 SP"
    },
    {
      "xsiType": "AdresseMail_Type",
      "uid": "AD391698",
      "type": "15",
      "typeLibelle": "Mèl",
      "valElec": "hdecharette@assemblee-nationale.fr"
    },
    {
      "xsiType": "AdressePostale_Type",
      "uid": "AD395125",
      "type": "1",
      "typeLibelle": "Adresse publiée pour Paris ou sa région",
      "poids": "11",
      "numeroRue": "250",
      "nomRue": "Boulevard Saint-Germain",
      "codePostal": "75007",
      "ville": "Paris"
    },
    {
      "xsiType": "AdresseTelephonique_Type",
      "uid": "AD395126",
      "type": "11",
      "typeLibelle": "Téléphone",
      "poids": "11",
      "adresseDeRattachement": "AD395125",
      "valElec": "01 42 22 69 51"
    },
    {
      "xsiType": "AdresseTelephonique_Type",
      "uid": "AD395127",
      "type": "12",
      "typeLibelle": "Télécopie",
      "poids": "11",
      "adresseDeRattachement": "AD395125",
      "valElec": "01 42 22 59 49"
    },
    {
      "xsiType": "AdresseSiteWeb_Type",
      "uid": "AD413046",
      "type": "22",
      "typeLibelle": "Site internet",
      "valElec": "hervedecharette.typepad.fr"
    }
  ],
  "mandats": [
    {
      "uid": "PM386111",
      "acteurRef": "PA825",
      "legislature": "13",
      "typeOrgane": "ASSEMBLEE",
      "dateDebut": "2007-06-20T02:00:00.000+02:00",
      "dateFin": "2012-06-19T02:00:00.000+02:00",
      "preseance": "50",
      "nominPrincipale": "1",
      "infosQualite": {
        "codeQualite": "membre",
        "libQualite": "membre",
        "libQualiteSex": "membre"
      },
      "organesRefs": [
        "PO384266"
      ],
      "suppleant": {
        "dateDebut": "2007-06-20T02:00:00.000+02:00",
        "dateFin": "2012-06-19T02:00:00.000+02:00",
        "suppleantRef": "PA267436"
      },
      "election": {
        "lieu": {
          "region": "Pays de la Loire",
          "regionType": "Métropolitain",
          "departement": "Maine-et-Loire",
          "numDepartement": "49",
          "numCirco": "6"
        },
        "causeMandat": "élections générales",
        "refCirconscription": "PO384497"
      },
      "mandature": {
        "datePriseFonction": "2007-06-20T02:00:00.000+02:00",
        "causeFin": "Fin de législature",
        "premiereElection": "1"
      }
    },
    {
      "uid": "PM387387",
      "acteurRef": "PA825",
      "legislature": "13",
      "typeOrgane": "GP",
      "dateDebut": "2007-06-20T02:00:00.000+02:00",
      "dateFin": "2007-06-26T02:00:00.000+02:00",
      "preseance": "28",
      "nominPrincipale": "1",
      "infosQualite": {
        "codeQualite": "Député non-inscrit",
        "libQualite": "Député non-inscrit",
        "libQualiteSex": "Député non-inscrit"
      },
      "organesRefs": [
        "PO387155"
      ]
    },
    {
      "uid": "PM389746",
      "acteurRef": "PA825",
      "legislature": "13",
      "typeOrgane": "GP",
      "dateDebut": "2007-06-27T02:00:00.000+02:00",
      "datePublication": "2007-06-27T02:00:00.000+02:00",
      "dateFin": "2010-01-11T01:00:00.000+01:00",
      "preseance": "20",
      "nominPrincipale": "1",
      "infosQualite": {
        "codeQualite": "Membre",
        "libQualite": "Membre du",
        "libQualiteSex": "Membre du"
      },
      "organesRefs": [
        "PO389395"
      ]
    },
    {
      "uid": "PM390678",
      "acteurRef": "PA825",
      "legislature": "13",
      "typeOrgane": "COMPER",
      "dateDebut": "2007-06-27T02:00:00.000+02:00",
      "datePublication": "2007-06-28T02:00:00.000+02:00",
      "dateFin": "2012-06-19T02:00:00.000+02:00",
      "preseance": "32",
      "nominPrincipale": "1",
      "infosQualite": {
        "codeQualite": "Membre",
        "libQualite": "Membre",
        "libQualiteSex": "Membre"
      },
      "organesRefs": [
        "PO59047"
      ]
    },
    {
      "uid": "PM402420",
      "acteurRef": "PA825",
      "legislature": "13",
      "typeOrgane": "GA",
      "dateDebut": "2007-11-05T01:00:00.000+01:00",
      "dateFin": "2012-06-19T02:00:00.000+02:00",
      "preseance": "20",
      "nominPrincipale": "0",
      "infosQualite": {
        "codeQualite": "Membre",
        "libQualite": "Membre",
        "libQualiteSex": "Membre"
      },
      "organesRefs": [
        "PO393423"
      ]
    },
    {
      "uid": "PM402421",
      "acteurRef": "PA825",
      "legislature": "13",
      "typeOrgane": "GA",
      "dateDebut": "2007-11-05T01:00:00.000+01:00",
      "dateFin": "2012-06-19T02:00:00.000+02:00",
      "preseance": "8",
      "nominPrincipale": "1",
      "infosQualite": {
        "codeQualite": "Vice-Président",
        "libQualite": "Vice-Président",
        "libQualiteSex": "Vice-Président"
      },
      "organesRefs": [
        "PO393423"
      ]
    },
    {
      "uid": "PM402496",
      "acteurRef": "PA825",
      "legislature": "13",
      "typeOrgane": "GA",
      "dateDebut": "2007-11-06T01:00:00.000+01:00",
      "dateFin": "2012-06-19T02:00:00.000+02:00",
      "preseance": "20",
      "nominPrincipale": "0",
      "infosQualite": {
        "codeQualite": "Membre",
        "libQualite": "Membre",
        "libQualiteSex": "Membre"
      },
      "organesRefs": [
        "PO393348"
      ]
    },
    {
      "uid": "PM402497",
      "acteurRef": "PA825",
      "legislature": "13",
      "typeOrgane": "GA",
      "dateDebut": "2007-11-06T01:00:00.000+01:00",
      "dateFin": "2012-06-19T02:00:00.000+02:00",
      "preseance": "8",
      "nominPrincipale": "1",
      "infosQualite": {
        "codeQualite": "Vice-Président",
        "libQualite": "Vice-Président",
        "libQualiteSex": "Vice-Président"
      },
      "organesRefs": [
        "PO393348"
      ]
    },
    {
      "uid": "PM405422",
      "acteurRef": "PA825",
      "legislature": "13",
      "typeOrgane": "GA",
      "dateDebut": "2007-11-28T01:00:00.000+01:00",
      "dateFin": "2012-06-19T02:00:00.000+02:00",
      "preseance": "20",
      "nominPrincipale": "0",
      "infosQualite": {
        "codeQualite": "Membre",
        "libQualite": "Membre",
        "libQualiteSex": "Membre"
      },
      "organesRefs": [
        "PO393055"
      ]
    },
    {
      "uid": "PM405423",
      "acteurRef": "PA825",
      "legislature": "13",
      "typeOrgane": "GA",
      "dateDebut": "2007-11-28T01:00:00.000+01:00",
      "dateFin": "2012-06-19T02:00:00.000+02:00",
      "preseance": "8",
      "nominPrincipale": "1",
      "infosQualite": {
        "codeQualite": "Vice-Président",
        "libQualite": "Vice-Président",
        "libQualiteSex": "Vice-Président"
      },
      "organesRefs": [
        "PO393055"
      ]
    },
    {
      "uid": "PM406090",
      "acteurRef": "PA825",
      "legislature": "13",
      "typeOrgane": "GA",
      "dateDebut": "2007-12-18T01:00:00.000+01:00",
      "dateFin": "2012-06-19T02:00:00.000+02:00",
      "preseance": "20",
      "nominPrincipale": "0",
      "infosQualite": {
        "codeQualite": "Membre",
        "libQualite": "Membre",
        "libQualiteSex": "Membre"
      },
      "organesRefs": [
        "PO392915"
      ]
    },
    {
      "uid": "PM406091",
      "acteurRef": "PA825",
      "legislature": "13",
      "typeOrgane": "GA",
      "dateDebut": "2007-12-18T01:00:00.000+01:00",
      "dateFin": "2012-06-19T02:00:00.000+02:00",
      "preseance": "8",
      "nominPrincipale": "1",
      "infosQualite": {
        "codeQualite": "Vice-Président",
        "libQualite": "Vice-Président",
        "libQualiteSex": "Vice-Président"
      },
      "organesRefs": [
        "PO392915"
      ]
    },
    {
      "uid": "PM406623",
      "acteurRef": "PA825",
      "legislature": "13",
      "typeOrgane": "GA",
      "dateDebut": "2008-01-14T01:00:00.000+01:00",
      "dateFin": "2012-06-19T02:00:00.000+02:00",
      "preseance": "20",
      "nominPrincipale": "1",
      "infosQualite": {
        "codeQualite": "Membre",
        "libQualite": "Membre",
        "libQualiteSex": "Membre"
      },
      "organesRefs": [
        "PO392669"
      ]
    },
    {
      "uid": "PM407332",
      "acteurRef": "PA825",
      "legislature": "13",
      "typeOrgane": "GE",
      "dateDebut": "2008-01-22T01:00:00.000+01:00",
      "dateFin": "2012-06-19T02:00:00.000+02:00",
      "preseance": "20",
      "nominPrincipale": "1",
      "infosQualite": {
        "codeQualite": "Membre",
        "libQualite": "Membre",
        "libQualiteSex": "Membre"
      },
      "organesRefs": [
        "PO403045"
      ]
    },
    {
      "uid": "PM407748",
      "acteurRef": "PA825",
      "legislature": "13",
      "typeOrgane": "GE",
      "dateDebut": "2008-01-28T01:00:00.000+01:00",
      "dateFin": "2012-06-19T02:00:00.000+02:00",
      "preseance": "20",
      "nominPrincipale": "1",
      "infosQualite": {
        "codeQualite": "Membre",
        "libQualite": "Membre",
        "libQualiteSex": "Membre"
      },
      "organesRefs": [
        "PO403520"
      ]
    },
    {
      "uid": "PM409511",
      "acteurRef": "PA825",
      "legislature": "13",
      "typeOrgane": "GE",
      "dateDebut": "2008-02-20T01:00:00.000+01:00",
      "dateFin": "2012-06-19T02:00:00.000+02:00",
      "preseance": "20",
      "nominPrincipale": "1",
      "infosQualite": {
        "codeQualite": "Membre",
        "libQualite": "Membre",
        "libQualiteSex": "Membre"
      },
      "organesRefs": [
        "PO403087"
      ]
    },
    {
      "uid": "PM416310",
      "acteurRef": "PA825",
      "legislature": "13",
      "typeOrgane": "GE",
      "dateDebut": "2008-02-06T01:00:00.000+01:00",
      "dateFin": "2012-06-19T02:00:00.000+02:00",
      "preseance": "20",
      "nominPrincipale": "1",
      "infosQualite": {
        "codeQualite": "Membre",
        "libQualite": "Membre",
        "libQualiteSex": "Membre"
      },
      "organesRefs": [
        "PO402931"
      ]
    },
    {
      "uid": "PM422800",
      "acteurRef": "PA825",
      "legislature": "13",
      "typeOrgane": "GP",
      "dateDebut": "2010-01-11T01:00:00.000+01:00",
      "datePublication": "2010-01-12T01:00:00.000+01:00",
      "dateFin": "2012-06-19T02:00:00.000+02:00",
      "preseance": "20",
      "nominPrincipale": "1",
      "infosQualite": {
        "codeQualite": "Membre",
        "libQualite": "Membre du",
        "libQualiteSex": "Membre du"
      },
      "organesRefs": [
        "PO389639"
      ]
    },
    {
      "uid": "PM426920",
      "acteurRef": "PA825",
      "legislature": "13",
      "typeOrgane": "GE",
      "dateDebut": "2011-02-04T01:00:00.000+01:00",
      "dateFin": "2012-06-19T02:00:00.000+02:00",
      "preseance": "20",
      "nominPrincipale": "1",
      "infosQualite": {
        "codeQualite": "Membre",
        "libQualite": "Membre",
        "libQualiteSex": "Membre"
      },
      "organesRefs": [
        "PO425013"
      ]
    },
    {
      "uid": "PM427226",
      "acteurRef": "PA825",
      "legislature": "13",
      "typeOrgane": "GE",
      "dateDebut": "2011-01-18T01:00:00.000+01:00",
      "dateFin": "2012-06-19T02:00:00.000+02:00",
      "preseance": "20",
      "nominPrincipale": "1",
      "infosQualite": {
        "codeQualite": "Membre",
        "libQualite": "Membre",
        "libQualiteSex": "Membre"
      },
      "organesRefs": [
        "PO425412"
      ]
    },
    {
      "uid": "PM428683",
      "acteurRef": "PA825",
      "legislature": "13",
      "typeOrgane": "GE",
      "dateDebut": "2011-06-01T02:00:00.000+02:00",
      "dateFin": "2012-06-19T02:00:00.000+02:00",
      "preseance": "20",
      "nominPrincipale": "1",
      "infosQualite": {
        "codeQualite": "Membre",
        "libQualite": "Membre",
        "libQualiteSex": "Membre"
      },
      "organesRefs": [
        "PO428157"
      ]
    }
  ]
}