{
  "uid": "PA643145",
  "etatCivil": {
    "ident": {
      "civ": "Mme",
      "prenom": "Hélène",
      "nom": "Vainqueur-Christophe",
      "alpha": "VainqueurChristophe",
      "trigramme": "HVA"
    },
    "infoNaissance": {
      "dateNais": "1956-05-06T01:00:00.000+01:00",
      "villeNais": "Trois-Rivières",
      "depNais": "Guadeloupe",
      "paysNais": "France"
    }
  },
  "profession": {
    "libelleCourant": "Pharmacienne",
    "socProcInsee": {
      "catSocPro": "Professions libérales et assimilés",
      "famSocPro": "Cadres et professions intellectuelles supérieures"
    }
  },
  "uriHatvp": "https://www.hatvp.fr/pages_nominatives/vainqueur-christophe-helene",
  "adresses": [
    {
      "xsiType": "AdressePostale_Type",
      "uid": "AD676822",
      "type": "0",
      "typeLibelle": "Adresse officielle",
      "poids": "1",
      "intitule": "Assemblée nationale",
      "numeroRue": "126",
      "nomRue": "Rue de l'Université",
      "codePostal": "75355",
      "ville": "Paris 07 SP"
    },
    {
      "xsiType": "AdressePostale_Type",
      "uid": "AD676823",
      "type": "2",
      "typeLibelle": "Adresse publiée de circonscription",
      "poids": "22",
      "nomRue": "Rue Général Delacroix",
      "codePostal": "97114",
      "ville": "Trois-Rivières"
    },
    {
      "xsiType": "AdresseTelephonique_Type",
      "uid": "AD676824",
      "type": "11",
      "typeLibelle": "Téléphone",
      "poids": "22",
      "adresseDeRattachement": "AD676823",
      "valElec": "05 90 86 91 39"
    },
    {
      "xsiType": "AdresseMail_Type",
      "uid": "AD676825",
      "type": "15",
      "typeLibelle": "Mèl",
      "valElec": "helene.vainqueur@wanadoo.fr"
    },
    {
      "xsiType": "AdresseMail_Type",
      "uid": "AD677293",
      "type": "15",
      "typeLibelle": "Mèl",
      "valElec": "helene.vainqueur@assemblee-nationale.fr"
    }
  ],
  "mandats": [
    {
      "uid": "PM676812",
      "acteurRef": "PA643145",
      "legislature": "14",
      "typeOrgane": "ASSEMBLEE",
      "dateDebut": "2012-06-20T02:00:00.000+02:00",
      "dateFin": "2014-05-02T02:00:00.000+02:00",
      "preseance": "50",
      "nominPrincipale": "1",
      "infosQualite": {
        "codeQualite": "membre",
        "libQualite": "membre",
        "libQualiteSex": "membre"
      },
      "organesRefs": [
        "PO644420"
      ],
      "election": {
        "lieu": {
          "region": "Guadeloupe",
          "regionType": "Dom",
          "departement": "Guadeloupe",
          "numDepartement": "971",
          "numCirco": "4"
        },
        "causeMandat": "remplacement d'un député nommé au Gouvernement",
        "refCirconscription": "PO644979"
      },
      "mandature": {
        "datePriseFonction": "2012-07-22T02:00:00.000+02:00",
        "causeFin": "Reprise de l'exercice du mandat d'un ancien membre du Gouvernement",
        "premiereElection": "0",
        "placeHemicycle": "496"
      }
    },
    {
      "uid": "PM676908",
      "acteurRef": "PA643145",
      "legislature": "14",
      "typeOrgane": "GP",
      "dateDebut": "2012-07-22T02:00:00.000+02:00",
      "dateFin": "2012-07-23T02:00:00.000+02:00",
      "preseance": "28",
      "nominPrincipale": "1",
      "infosQualite": {
        "codeQualite": "Député non-inscrit",
        "libQualite": "Député non-inscrit",
        "libQualiteSex": "Députée non-inscrite"
      },
      "organesRefs": [
        "PO645633"
      ]
    },
    {
      "uid": "PM676924",
      "acteurRef": "PA643145",
      "legislature": "14",
      "typeOrgane": "GP",
      "dateDebut": "2012-07-24T02:00:00.000+02:00",
      "datePublication": "2012-07-24T02:00:00.000+02:00",
      "dateFin": "2014-05-02T02:00:00.000+02:00",
      "preseance": "20",
      "nominPrincipale": "1",
      "infosQualite": {
        "codeQualite": "Membre",
        "libQualite": "Membre du",
        "libQualiteSex": "Membre du"
      },
      "organesRefs": [
        "PO656002"
      ]
    },
    {
      "uid": "PM677006",
      "acteurRef": "PA643145",
      "legislature": "14",
      "typeOrgane": "DELEG",
      "dateDebut": "2012-07-25T02:00:00.000+02:00",
      "datePublication": "2012-07-25T02:00:00.000+02:00",
      "dateFin": "2014-05-02T02:00:00.000+02:00",
      "preseance": "20",
      "nominPrincipale": "1",
      "infosQualite": {
        "codeQualite": "Membre",
        "libQualite": "Membre",
        "libQualiteSex": "Membre"
      },
      "organesRefs": [
        "PO675659"
      ]
    },
    {
      "uid": "PM677112",
      "acteurRef": "PA643145",
      "legislature": "14",
      "typeOrgane": "DELEG",
      "dateDebut": "2012-07-25T02:00:00.000+02:00",
      "datePublication": "2012-07-25T02:00:00.000+02:00",
      "dateFin": "2014-05-02T02:00:00.000+02:00",
      "preseance": "21",
      "nominPrincipale": "0",
      "infosQualite": {
        "codeQualite": "Membre de droit",
        "libQualite": "Membre de droit",
        "libQualiteSex": "Membre de droit"
      },
      "organesRefs": [
        "PO675659"
      ]
    },
    {
      "uid": "PM677276",
      "acteurRef": "PA643145",
      "legislature": "14",
      "typeOrgane": "COMPER",
      "dateDebut": "2012-07-25T02:00:00.000+02:00",
      "datePublication": "2012-07-25T02:00:00.000+02:00",
      "dateFin": "2013-03-07T01:00:00.000+01:00",
      "preseance": "32",
      "nominPrincipale": "1",
      "infosQualite": {
        "codeQualite": "Membre",
        "libQualite": "Membre",
        "libQualiteSex": "Membre"
      },
      "organesRefs": [
        "PO59048"
      ]
    },
    {
      "uid": "PM677979",
      "acteurRef": "PA643145",
      "legislature": "14",
      "typeOrgane": "API",
      "dateDebut": "2012-07-31T02:00:00.000+02:00",
      "dateFin": "2014-05-02T02:00:00.000+02:00",
      "preseance": "20",
      "nominPrincipale": "1",
      "infosQualite": {
        "codeQualite": "Membre",
        "libQualite": "Membre",
        "libQualiteSex": "Membre"
      },
      "organesRefs": [
        "PO206064"
      ]
    },
    {
      "uid": "PM680898",
      "acteurRef": "PA643145",
      "legislature": "14",
      "typeOrgane": "GA",
      "dateDebut": "2012-10-15T02:00:00.000+02:00",
      "dateFin": "2014-05-02T02:00:00.000+02:00",
      "preseance": "20",
      "nominPrincipale": "1",
      "infosQualite": {
        "codeQualite": "Membre",
        "libQualite": "Membre",
        "libQualiteSex": "Membre"
      },
      "organesRefs": [
        "PO675796"
      ]
    },
    {
      "uid": "PM680899",
      "acteurRef": "PA643145",
      "legislature": "14",
      "typeOrgane": "GA",
      "dateDebut": "2012-10-15T02:00:00.000+02:00",
      "dateFin": "2014-05-02T02:00:00.000+02:00",
      "preseance": "20",
      "nominPrincipale": "1",
      "infosQualite": {
        "codeQualite": "Membre",
        "libQualite": "Membre",
        "libQualiteSex": "Membre"
      },
      "organesRefs": [
        "PO675801"
      ]
    },
    {
      "uid": "PM680900",
      "acteurRef": "PA643145",
      "legislature": "14",
      "typeOrgane": "GA",
      "dateDebut": "2012-10-15T02:00:00.000+02:00",
      "dateFin": "2014-05-02T02:00:00.000+02:00",
      "preseance": "20",
      "nominPrincipale": "1",
      "infosQualite": {
        "codeQualite": "Membre",
        "libQualite": "Membre",
        "libQualiteSex": "Membre"
      },
      "organesRefs": [
        "PO675812"
      ]
    },
    {
      "uid": "PM686014",
      "acteurRef": "PA643145",
      "typeOrgane": "PARPOL",
      "dateDebut": "2012-12-01T01:00:00.000+01:00",
      "dateFin": "2014-05-02T02:00:00.000+02:00",
      "preseance": "5",
      "nominPrincipale": "1",
      "infosQualite": {
        "codeQualite": "Membre",
        "libQualite": "Membre",
        "libQualiteSex": "Membre"
      },
      "organesRefs": [
        "PO684932"
      ]
    },
    {
      "uid": "PM687674",
      "acteurRef": "PA643145",
      "legislature": "14",
      "typeOrgane": "GE",
      "dateDebut": "2013-01-10T01:00:00.000+01:00",
      "dateFin": "2014-05-02T02:00:00.000+02:00",
      "preseance": "20",
      "nominPrincipale": "1",
      "infosQualite": {
        "codeQualite": "Membre",
        "libQualite": "Membre",
        "libQualiteSex": "Membre"
      },
      "organesRefs": [
        "PO686397"
      ]
    },
    {
      "uid": "PM688787",
      "acteurRef": "PA643145",
      "legislature": "14",
      "typeOrgane": "GE",
      "dateDebut": "2013-01-25T01:00:00.000+01:00",
      "dateFin": "2014-05-02T02:00:00.000+02:00",
      "preseance": "20",
      "nominPrincipale": "1",
      "infosQualite": {
        "codeQualite": "Membre",
        "libQualite": "Membre",
        "libQualiteSex": "Membre"
      },
      "organesRefs": [
        "PO686501"
      ]
    },
    {
      "uid": "PM689715",
      "acteurRef": "PA643145",
      "legislature": "14",
      "typeOrgane": "GE",
      "dateDebut": "2013-01-30T01:00:00.000+01:00",
      "dateFin": "2014-05-02T02:00:00.000+02:00",
      "preseance": "20",
      "nominPrincipale": "1",
      "infosQualite": {
        "codeQualite": "Membre",
        "libQualite": "Membre",
        "libQualiteSex": "Membre"
      },
      "organesRefs": [
        "PO686424"
      ]
    },
    {
      "uid": "PM690629",
      "acteurRef": "PA643145",
      "legislature": "14",
      "typeOrgane": "GE",
      "dateDebut": "2013-02-01T01:00:00.000+01:00",
      "dateFin": "2014-05-02T02:00:00.000+02:00",
      "preseance": "20",
      "nominPrincipale": "1",
      "infosQualite": {
        "codeQualite": "Membre",
        "libQualite": "Membre",
        "libQualiteSex": "Membre"
      },
      "organesRefs": [
        "PO686459"
      ]
    },
    {
      "uid": "PM690916",
      "acteurRef": "PA643145",
      "legislature": "14",
      "typeOrgane": "GE",
      "dateDebut": "2013-02-06T01:00:00.000+01:00",
      "dateFin": "2014-05-02T02:00:00.000+02:00",
      "preseance": "20",
      "nominPrincipale": "1",
      "infosQualite": {
        "codeQualite": "Membre",
        "libQualite": "Membre",
        "libQualiteSex": "Membre"
      },
      "organesRefs": [
        "PO686451"
      ]
    },
    {
      "uid": "PM691230",
      "acteurRef": "PA643145",
      "legislature": "14",
      "typeOrgane": "GE",
      "dateDebut": "2013-01-15T01:00:00.000+01:00",
      "dateFin": "2014-05-02T02:00:00.000+02:00",
      "preseance": "20",
      "nominPrincipale": "1",
      "infosQualite": {
        "codeQualite": "Membre",
        "libQualite": "Membre",
        "libQualiteSex": "Membre"
      },
      "organesRefs": [
        "PO687381"
      ]
    },
    {
      "uid": "PM691800",
      "acteurRef": "PA643145",
      "legislature": "14",
      "typeOrgane": "GE",
      "dateDebut": "2013-02-20T01:00:00.000+01:00",
      "dateFin": "2014-05-02T02:00:00.000+02:00",
      "preseance": "20",
      "nominPrincipale": "1",
      "infosQualite": {
        "codeQualite": "Membre",
        "libQualite": "Membre",
        "libQualiteSex": "Membre"
      },
      "organesRefs": [
        "PO688313"
      ]
    },
    {
      "uid": "PM692588",
      "acteurRef": "PA643145",
      "legislature": "14",
      "typeOrgane": "COMPER",
      "dateDebut": "2013-03-08T01:00:00.000+01:00",
      "datePublication": "2013-03-08T01:00:00.000+01:00",
      "dateFin": "2013-03-28T01:00:00.000+01:00",
      "preseance": "32",
      "nominPrincipale": "1",
      "infosQualite": {
        "codeQualite": "Membre",
        "libQualite": "Membre",
        "libQualiteSex": "Membre"
      },
      "organesRefs": [
        "PO420120"
      ]
    },
    {
      "uid": "PM693111",
      "acteurRef": "PA643145",
      "legislature": "14",
      "typeOrgane": "COMPER",
      "dateDebut": "2013-03-29T01:00:00.000+01:00",
      "datePublication": "2013-03-29T01:00:00.000+01:00",
      "dateFin": "2014-05-02T02:00:00.000+02:00",
      "preseance": "32",
      "nominPrincipale": "1",
      "infosQualite": {
        "codeQualite": "Membre",
        "libQualite": "Membre",
        "libQualiteSex": "Membre"
      },
      "organesRefs": [
        "PO59048"
      ]
    },
    {
      "uid": "PM723130",
      "acteurRef": "PA643145",
      "legislature": "15",
      "typeOrgane": "ASSEMBLEE",
      "dateDebut": "2017-06-18T02:00:00.000+02:00",
      "preseance": "50",
      "nominPrincipale": "1",
      "infosQualite": {
        "codeQualite": "membre",
        "libQualite": "membre",
        "libQualiteSex": "membre"
      },
      "organesRefs": [
        "PO717460"
      ],
      "suppleant": {
        "dateDebut": "2017-06-18T02:00:00.000+02:00",
        "suppleantRef": "PA720984"
      },
      "election": {
        "lieu": {
          "region": "Guadeloupe",
          "regionType": "Dom",
          "departement": "Guadeloupe",
          "numDepartement": "971",
          "numCirco": "4"
        },
        "causeMandat": "élections générales",
        "refCirconscription": "PO718526"
      },
      "mandature": {
        "datePriseFonction": "2017-06-21T02:00:00.000+02:00",
        "premiereElection": "1",
        "placeHemicycle": "496"
      },
      "collaborateurs": [
        {
          "qualite": "M.",
          "prenom": "Paco",
          "nom": "Ipparrigary"
        },
        {
          "qualite": "M.",
          "prenom": "Jacques",
          "nom": "Paulo"
        },
        {
          "qualite": "M.",
          "prenom": "Hugo",
          "nom": "Petrachi"
        },
        {
          "qualite": "M.",
          "prenom": "Nicolas",
          "nom": "Julien-Emmanuel-Lurel"
        },
        {
          "qualite": "Mme",
          "prenom": "Isabelle",
          "nom": "Jean-François"
        },
        {
          "qualite": "M.",
          "prenom": "Romain",
          "nom": "Mielle"
        }
      ]
    },
    {
      "uid": "PM724606",
      "acteurRef": "PA643145",
      "legislature": "15",
      "typeOrgane": "GP",
      "dateDebut": "2017-06-21T02:00:00.000+02:00",
      "dateFin": "2017-06-26T02:00:00.000+02:00",
      "preseance": "28",
      "nominPrincipale": "1",
      "infosQualite": {
        "codeQualite": "Député non-inscrit",
        "libQualite": "Député non-inscrit",
        "libQualiteSex": "Députée non-inscrite"
      },
      "organesRefs": [
        "PO723569"
      ]
    },
    {
      "uid": "PM731497",
      "acteurRef": "PA643145",
      "legislature": "15",
      "typeOrgane": "GP",
      "dateDebut": "2017-06-27T02:00:00.000+02:00",
      "datePublication": "2017-06-28T02:00:00.000+02:00",
      "dateFin": "2018-09-11T02:00:00.000+02:00",
      "preseance": "20",
      "nominPrincipale": "1",
      "infosQualite": {
        "codeQualite": "Membre",
        "libQualite": "Membre du",
        "libQualiteSex": "Membre du"
      },
      "organesRefs": [
        "PO730946"
      ]
    },
    {
      "uid": "PM731932",
      "acteurRef": "PA643145",
      "legislature": "15",
      "typeOrgane": "COMPER",
      "dateDebut": "2017-06-29T02:00:00.000+02:00",
      "datePublication": "2017-06-29T02:00:00.000+02:00",
      "dateFin": "2018-01-10T01:00:00.000+01:00",
      "preseance": "32",
      "nominPrincipale": "1",
      "infosQualite": {
        "codeQualite": "Membre",
        "libQualite": "Membre",
        "libQualiteSex": "Membre"
      },
      "organesRefs": [
        "PO420120"
      ]
    },
    {
      "uid": "PM732532",
      "acteurRef": "PA643145",
      "legislature": "15",
      "typeOrgane": "DELEG",
      "dateDebut": "2017-07-12T02:00:00.000+02:00",
      "datePublication": "2017-07-12T02:00:00.000+02:00",
      "preseance": "20",
      "nominPrincipale": "1",
      "infosQualite": {
        "codeQualite": "Membre",
        "libQualite": "Membre",
        "libQualiteSex": "Membre"
      },
      "organesRefs": [
        "PO675659"
      ]
    },
    {
      "uid": "PM740496",
      "acteurRef": "PA643145",
      "legislature": "15",
      "typeOrgane": "GA",
      "dateDebut": "2017-10-18T02:00:00.000+02:00",
      "preseance": "20",
      "nominPrincipale": "0",
      "infosQualite": {
        "codeQualite": "Membre",
        "libQualite": "Membre",
        "libQualiteSex": "Membre"
      },
      "organesRefs": [
        "PO733592"
      ]
    },
    {
      "uid": "PM740742",
      "acteurRef": "PA643145",
      "legislature": "15",
      "typeOrgane": "ORGEXTPARL",
      "dateDebut": "2017-10-23T02:00:00.000+02:00",
      "datePublication": "2017-10-24T02:00:00.000+02:00",
      "preseance": "20",
      "nominPrincipale": "1",
      "infosQualite": {
        "codeQualite": "Titulaire",
        "libQualite": "Membre titulaire",
        "libQualiteSex": "Membre titulaire"
      },
      "organesRefs": [
        "PO425985"
      ]
    },
    {
      "uid": "PM742121",
      "acteurRef": "PA643145",
      "legislature": "15",
      "typeOrgane": "ORGAINT",
      "dateDebut": "2017-10-27T02:00:00.000+02:00",
      "datePublication": "2017-10-28T02:00:00.000+02:00",
      "preseance": "42",
      "nominPrincipale": "1",
      "infosQualite": {
        "codeQualite": "Membre",
        "libQualite": "Membre",
        "libQualiteSex": "Membre"
      },
      "organesRefs": [
        "PO201115"
      ]
    },
    {
      "uid": "PM742331",
      "acteurRef": "PA643145",
      "legislature": "15",
      "typeOrgane": "GA",
      "dateDebut": "2017-10-31T01:00:00.000+01:00",
      "preseance": "8",
      "nominPrincipale": "1",
      "infosQualite": {
        "codeQualite": "Vice-Président",
        "libQualite": "Vice-Président",
        "libQualiteSex": "Vice-Présidente"
      },
      "organesRefs": [
        "PO733592"
      ]
    },
    {
      "uid": "PM743652",
      "acteurRef": "PA643145",
      "legislature": "15",
      "typeOrgane": "MISINFOPRE",
      "dateDebut": "2017-11-22T01:00:00.000+01:00",
      "datePublication": "2017-11-22T01:00:00.000+01:00",
      "preseance": "20",
      "nominPrincipale": "0",
      "infosQualite": {
        "codeQualite": "Membre",
        "libQualite": "Membre",
        "libQualiteSex": "Membre"
      },
      "organesRefs": [
        "PO743158"
      ]
    },
    {
      "uid": "PM744034",
      "acteurRef": "PA643145",
      "legislature": "15",
      "typeOrgane": "MISINFOPRE",
      "dateDebut": "2017-11-24T01:00:00.000+01:00",
      "datePublication": "2017-11-24T01:00:00.000+01:00",
      "preseance": "4",
      "nominPrincipale": "1",
      "infosQualite": {
        "codeQualite": "Vice-Président",
        "libQualite": "Vice-Président",
        "libQualiteSex": "Vice-Présidente"
      },
      "organesRefs": [
        "PO743158"
      ]
    },
    {
      "uid": "PM745908",
      "acteurRef": "PA643145",
      "typeOrgane": "PARPOL",
      "dateDebut": "2017-12-01T01:00:00.000+01:00",
      "preseance": "5",
      "nominPrincipale": "1",
      "infosQualite": {
        "codeQualite": "Membre",
        "libQualite": "Membre",
        "libQualiteSex": "Membre"
      },
      "organesRefs": [
        "PO685893"
      ]
    },
    {
      "uid": "PM747463",
      "acteurRef": "PA643145",
      "legislature": "15",
      "typeOrgane": "ORGEXTPARL",
      "dateDebut": "2017-12-26T01:00:00.000+01:00",
      "datePublication": "2017-12-27T01:00:00.000+01:00",
      "preseance": "20",
      "nominPrincipale": "1",
      "infosQualite": {
        "codeQualite": "Titulaire",
        "libQualite": "Membre titulaire",
        "libQualiteSex": "Membre titulaire"
      },
      "organesRefs": [
        "PO678097"
      ]
    },
    {
      "uid": "PM747576",
      "acteurRef": "PA643145",
      "legislature": "15",
      "typeOrgane": "COMPER",
      "dateDebut": "2018-01-10T01:00:00.000+01:00",
      "datePublication": "2018-01-11T01:00:00.000+01:00",
      "dateFin": "2018-01-18T01:00:00.000+01:00",
      "preseance": "32",
      "nominPrincipale": "1",
      "infosQualite": {
        "codeQualite": "Membre",
        "libQualite": "Membre",
        "libQualiteSex": "Membre"
      },
      "organesRefs": [
        "PO419865"
      ]
    },
    {
      "uid": "PM747744",
      "acteurRef": "PA643145",
      "legislature": "15",
      "typeOrgane": "COMPER",
      "dateDebut": "2018-01-19T01:00:00.000+01:00",
      "datePublication": "2018-01-19T01:00:00.000+01:00",
      "dateFin": "2018-09-29T02:00:00.000+02:00",
      "preseance": "32",
      "nominPrincipale": "1",
      "infosQualite": {
        "codeQualite": "Membre",
        "libQualite": "Membre",
        "libQualiteSex": "Membre"
      },
      "organesRefs": [
        "PO420120"
      ]
    },
    {
      "uid": "PM748753",
      "acteurRef": "PA643145",
      "legislature": "15",
      "typeOrgane": "CNPE",
      "dateDebut": "2018-02-01T01:00:00.000+01:00",
      "datePublication": "2018-02-02T01:00:00.000+01:00",
      "dateFin": "2018-07-19T02:00:00.000+02:00",
      "preseance": "20",
      "nominPrincipale": "1",
      "infosQualite": {
        "codeQualite": "Membre",
        "libQualite": "Membre",
        "libQualiteSex": "Membre"
      },
      "organesRefs": [
        "PO748027"
      ]
    },
    {
      "uid": "PM754899",
      "acteurRef": "PA643145",
      "legislature": "15",
      "typeOrgane": "GE",
      "dateDebut": "2018-03-30T02:00:00.000+02:00",
      "preseance": "20",
      "nominPrincipale": "1",
      "infosQualite": {
        "codeQualite": "Membre",
        "libQualite": "Membre",
        "libQualiteSex": "Membre"
      },
      "organesRefs": [
        "PO746827"
      ]
    },
    {
      "uid": "PM758855",
      "acteurRef": "PA643145",
      "legislature": "15",
      "typeOrgane": "GP",
      "dateDebut": "2018-09-12T02:00:00.000+02:00",
      "preseance": "20",
      "nominPrincipale": "1",
      "infosQualite": {
        "codeQualite": "Membre",
        "libQualite": "Membre du",
        "libQualiteSex": "Membre du"
      },
      "organesRefs": [
        "PO758835"
      ]
    },
    {
      "uid": "PM759149",
      "acteurRef": "PA643145",
      "legislature": "15",
      "typeOrgane": "COMPER",
      "dateDebut": "2018-09-30T02:00:00.000+02:00",
      "datePublication": "2018-09-30T02:00:00.000+02:00",
      "dateFin": "2018-10-29T01:00:00.000+01:00",
      "preseance": "32",
      "nominPrincipale": "1",
      "infosQualite": {
        "codeQualite": "Membre",
        "libQualite": "Membre",
        "libQualiteSex": "Membre"
      },
      "organesRefs": [
        "PO419865"
      ]
    },
    {
      "uid": "PM759975",
      "acteurRef": "PA643145",
      "legislature": "15",
      "typeOrgane": "COMPER",
      "dateDebut": "2018-10-30T01:00:00.000+01:00",
      "datePublication": "2018-10-30T01:00:00.000+01:00",
      "dateFin": "2018-11-08T01:00:00.000+01:00",
      "preseance": "32",
      "nominPrincipale": "1",
      "infosQualite": {
        "codeQualite": "Membre",
        "libQualite": "Membre",
        "libQualiteSex": "Membre"
      },
      "organesRefs": [
        "PO420120"
      ]
    },
    {
      "uid": "PM760159",
      "acteurRef": "PA643145",
      "legislature": "15",
      "typeOrgane": "COMPER",
      "dateDebut": "2018-11-09T01:00:00.000+01:00",
      "datePublication": "2018-11-09T01:00:00.000+01:00",
      "dateFin": "2018-12-19T01:00:00.000+01:00",
      "preseance": "32",
      "nominPrincipale": "1",
      "infosQualite": {
        "codeQualite": "Membre",
        "libQualite": "Membre",
        "libQualiteSex": "Membre"
      },
      "organesRefs": [
        "PO419865"
      ]
    },
    {
      "uid": "PM761127",
      "acteurRef": "PA643145",
      "legislature": "15",
      "typeOrgane": "COMPER",
      "dateDebut": "2018-12-20T01:00:00.000+01:00",
      "datePublication": "2018-12-20T01:00:00.000+01:00",
      "dateFin": "2018-12-20T01:00:00.000+01:00",
      "preseance": "32",
      "nominPrincipale": "1",
      "infosQualite": {
        "codeQualite": "Membre",
        "libQualite": "Membre",
        "libQualiteSex": "Membre"
      },
      "organesRefs": [
        "PO420120"
      ]
    },
    {
      "uid": "PM761186",
      "acteurRef": "PA643145",
      "legislature": "15",
      "typeOrgane": "COMPER",
      "dateDebut": "2018-12-21T01:00:00.000+01:00",
      "datePublication": "2018-12-21T01:00:00.000+01:00",
      "preseance": "32",
      "nominPrincipale": "1",
      "infosQualite": {
        "codeQualite": "Membre",
        "libQualite": "Membre",
        "libQualiteSex": "Membre"
      },
      "organesRefs": [
        "PO419865"
      ]
    }
  ]
}