{
  "uid": "PA610313",
  "etatCivil": {
    "ident": {
      "civ": "Mme",
      "prenom": "Elisabeth",
      "nom": "Pochon",
      "alpha": "Pochon"
    },
    "infoNaissance": {
      "dateNais": "1955-04-19T01:00:00.000+01:00",
      "villeNais": "Constantine",
      "paysNais": "Algérie"
    }
  },
  "profession": {
    "libelleCourant": "Conseillère principale d'éducation",
    "socProcInsee": {
      "catSocPro": "Cadres de la fonction publique, professions intellectuelles et  artistiques",
      "famSocPro": "Cadres et professions intellectuelles supérieures"
    }
  },
  "adresses": [
    {
      "xsiType": "AdresseMail_Type",
      "uid": "AD648755",
      "type": "15",
      "typeLibelle": "Mèl",
      "valElec": "epochon@assemblee-nationale.fr"
    },
    {
      "xsiType": "AdressePostale_Type",
      "uid": "AD648839",
      "type": "0",
      "typeLibelle": "Adresse officielle",
      "poids": "1",
      "intitule": "Assemblée nationale",
      "numeroRue": "126",
      "nomRue": "Rue de l'Université",
      "codePostal": "75355",
      "ville": "Paris 07 SP"
    },
    {
      "xsiType": "AdresseMail_Type",
      "uid": "AD648843",
      "type": "15",
      "typeLibelle": "Mèl",
      "valElec": "elipochon@gmail.com"
    }
  ],
  "mandats": [
    {
      "uid": "PM645122",
      "acteurRef": "PA610313",
      "legislature": "14",
      "typeOrgane": "ASSEMBLEE",
      "dateDebut": "2012-06-20T02:00:00.000+02:00",
      "dateFin": "2017-06-20T02:00:00.000+02:00",
      "preseance": "50",
      "nominPrincipale": "1",
      "infosQualite": {
        "codeQualite": "membre",
        "libQualite": "membre",
        "libQualiteSex": "membre"
      },
      "organesRefs": [
        "PO644420"
      ],
      "suppleant": {
        "dateDebut": "2012-06-20T02:00:00.000+02:00",
        "dateFin": "2017-06-20T02:00:00.000+02:00",
        "suppleantRef": "PA643058"
      },
      "election": {
        "lieu": {
          "region": "Ile-de-France",
          "regionType": "Métropolitain",
          "departement": "Seine-Saint-Denis",
          "numDepartement": "93",
          "numCirco": "8"
        },
        "causeMandat": "élections générales",
        "refCirconscription": "PO644949"
      },
      "mandature": {
        "datePriseFonction": "2012-06-20T02:00:00.000+02:00",
        "causeFin": "Fin de législature",
        "premiereElection": "0"
      }
    },
    {
      "uid": "PM656252",
      "acteurRef": "PA610313",
      "legislature": "14",
      "typeOrgane": "GP",
      "dateDebut": "2012-06-26T02:00:00.000+02:00",
      "datePublication": "2012-06-27T02:00:00.000+02:00",
      "dateFin": "2016-05-24T02:00:00.000+02:00",
      "preseance": "20",
      "nominPrincipale": "1",
      "infosQualite": {
        "codeQualite": "Membre",
        "libQualite": "Membre du",
        "libQualiteSex": "Membre du"
      },
      "organesRefs": [
        "PO656002"
      ]
    },
    {
      "uid": "PM657421",
      "acteurRef": "PA610313",
      "legislature": "14",
      "typeOrgane": "COMPER",
      "dateDebut": "2012-06-28T02:00:00.000+02:00",
      "datePublication": "2012-06-28T02:00:00.000+02:00",
      "dateFin": "2016-06-14T02:00:00.000+02:00",
      "preseance": "32",
      "nominPrincipale": "1",
      "infosQualite": {
        "codeQualite": "Membre",
        "libQualite": "Membre",
        "libQualiteSex": "Membre"
      },
      "organesRefs": [
        "PO59051"
      ]
    },
    {
      "uid": "PM677974",
      "acteurRef": "PA610313",
      "legislature": "14",
      "typeOrgane": "API",
      "dateDebut": "2012-07-31T02:00:00.000+02:00",
      "dateFin": "2017-06-20T02:00:00.000+02:00",
      "preseance": "20",
      "nominPrincipale": "1",
      "infosQualite": {
        "codeQualite": "Membre",
        "libQualite": "Membre",
        "libQualiteSex": "Membre"
      },
      "organesRefs": [
        "PO206064"
      ]
    },
    {
      "uid": "PM680785",
      "acteurRef": "PA610313",
      "legislature": "14",
      "typeOrgane": "GA",
      "dateDebut": "2012-10-12T02:00:00.000+02:00",
      "dateFin": "2017-06-20T02:00:00.000+02:00",
      "preseance": "20",
      "nominPrincipale": "1",
      "infosQualite": {
        "codeQualite": "Membre",
        "libQualite": "Membre",
        "libQualiteSex": "Membre"
      },
      "organesRefs": [
        "PO675752"
      ]
    },
    {
      "uid": "PM680786",
      "acteurRef": "PA610313",
      "legislature": "14",
      "typeOrgane": "GA",
      "dateDebut": "2012-10-12T02:00:00.000+02:00",
      "dateFin": "2017-06-20T02:00:00.000+02:00",
      "preseance": "20",
      "nominPrincipale": "1",
      "infosQualite": {
        "codeQualite": "Membre",
        "libQualite": "Membre",
        "libQualiteSex": "Membre"
      },
      "organesRefs": [
        "PO675843"
      ]
    },
    {
      "uid": "PM680787",
      "acteurRef": "PA610313",
      "legislature": "14",
      "typeOrgane": "GA",
      "dateDebut": "2012-10-12T02:00:00.000+02:00",
      "dateFin": "2017-06-20T02:00:00.000+02:00",
      "preseance": "20",
      "nominPrincipale": "1",
      "infosQualite": {
        "codeQualite": "Membre",
        "libQualite": "Membre",
        "libQualiteSex": "Membre"
      },
      "organesRefs": [
        "PO675854"
      ]
    },
    {
      "uid": "PM680788",
      "acteurRef": "PA610313",
      "legislature": "14",
      "typeOrgane": "GA",
      "dateDebut": "2012-10-12T02:00:00.000+02:00",
      "dateFin": "2017-06-20T02:00:00.000+02:00",
      "preseance": "20",
      "nominPrincipale": "1",
      "infosQualite": {
        "codeQualite": "Membre",
        "libQualite": "Membre",
        "libQualiteSex": "Membre"
      },
      "organesRefs": [
        "PO675711"
      ]
    },
    {
      "uid": "PM680789",
      "acteurRef": "PA610313",
      "legislature": "14",
      "typeOrgane": "GA",
      "dateDebut": "2012-10-12T02:00:00.000+02:00",
      "dateFin": "2017-06-20T02:00:00.000+02:00",
      "preseance": "20",
      "nominPrincipale": "1",
      "infosQualite": {
        "codeQualite": "Membre",
        "libQualite": "Membre",
        "libQualiteSex": "Membre"
      },
      "organesRefs": [
        "PO675852"
      ]
    },
    {
      "uid": "PM685970",
      "acteurRef": "PA610313",
      "typeOrgane": "PARPOL",
      "dateDebut": "2012-12-01T01:00:00.000+01:00",
      "dateFin": "2017-06-20T02:00:00.000+02:00",
      "preseance": "5",
      "nominPrincipale": "1",
      "infosQualite": {
        "codeQualite": "Membre",
        "libQualite": "Membre",
        "libQualiteSex": "Membre"
      },
      "organesRefs": [
        "PO684932"
      ]
    },
    {
      "uid": "PM687673",
      "acteurRef": "PA610313",
      "legislature": "14",
      "typeOrgane": "GE",
      "dateDebut": "2013-01-10T01:00:00.000+01:00",
      "dateFin": "2017-06-20T02:00:00.000+02:00",
      "preseance": "20",
      "nominPrincipale": "1",
      "infosQualite": {
        "codeQualite": "Membre",
        "libQualite": "Membre",
        "libQualiteSex": "Membre"
      },
      "organesRefs": [
        "PO686397"
      ]
    },
    {
      "uid": "PM688647",
      "acteurRef": "PA610313",
      "legislature": "14",
      "typeOrgane": "GE",
      "dateDebut": "2013-01-24T01:00:00.000+01:00",
      "dateFin": "2017-06-20T02:00:00.000+02:00",
      "preseance": "20",
      "nominPrincipale": "1",
      "infosQualite": {
        "codeQualite": "Membre",
        "libQualite": "Membre",
        "libQualiteSex": "Membre"
      },
      "organesRefs": [
        "PO686232"
      ]
    },
    {
      "uid": "PM689052",
      "acteurRef": "PA610313",
      "legislature": "14",
      "typeOrgane": "GA",
      "dateDebut": "2013-01-23T01:00:00.000+01:00",
      "dateFin": "2017-06-20T02:00:00.000+02:00",
      "preseance": "8",
      "nominPrincipale": "1",
      "infosQualite": {
        "codeQualite": "Vice-Président",
        "libQualite": "Vice-Président",
        "libQualiteSex": "Vice-Présidente"
      },
      "organesRefs": [
        "PO675752"
      ]
    },
    {
      "uid": "PM689771",
      "acteurRef": "PA610313",
      "legislature": "14",
      "typeOrgane": "GE",
      "dateDebut": "2013-01-31T01:00:00.000+01:00",
      "dateFin": "2017-06-20T02:00:00.000+02:00",
      "preseance": "20",
      "nominPrincipale": "1",
      "infosQualite": {
        "codeQualite": "Membre",
        "libQualite": "Membre",
        "libQualiteSex": "Membre"
      },
      "organesRefs": [
        "PO686362"
      ]
    },
    {
      "uid": "PM690623",
      "acteurRef": "PA610313",
      "legislature": "14",
      "typeOrgane": "GE",
      "dateDebut": "2013-02-01T01:00:00.000+01:00",
      "dateFin": "2017-06-20T02:00:00.000+02:00",
      "preseance": "20",
      "nominPrincipale": "1",
      "infosQualite": {
        "codeQualite": "Membre",
        "libQualite": "Membre",
        "libQualiteSex": "Membre"
      },
      "organesRefs": [
        "PO686459"
      ]
    },
    {
      "uid": "PM691612",
      "acteurRef": "PA610313",
      "legislature": "14",
      "typeOrgane": "GE",
      "dateDebut": "2013-02-06T01:00:00.000+01:00",
      "dateFin": "2017-06-20T02:00:00.000+02:00",
      "preseance": "20",
      "nominPrincipale": "1",
      "infosQualite": {
        "codeQualite": "Membre",
        "libQualite": "Membre",
        "libQualiteSex": "Membre"
      },
      "organesRefs": [
        "PO687370"
      ]
    },
    {
      "uid": "PM692496",
      "acteurRef": "PA610313",
      "legislature": "14",
      "typeOrgane": "GE",
      "dateDebut": "2013-03-01T01:00:00.000+01:00",
      "dateFin": "2014-10-14T02:00:00.000+02:00",
      "preseance": "8",
      "nominPrincipale": "1",
      "infosQualite": {
        "codeQualite": "Vice-Président",
        "libQualite": "Vice-Président",
        "libQualiteSex": "Vice-Présidente"
      },
      "organesRefs": [
        "PO687370"
      ]
    },
    {
      "uid": "PM697394",
      "acteurRef": "PA610313",
      "legislature": "14",
      "typeOrgane": "CMP",
      "dateDebut": "2013-10-04T02:00:00.000+02:00",
      "datePublication": "2013-10-05T02:00:00.000+02:00",
      "dateFin": "2013-10-31T01:00:00.000+01:00",
      "preseance": "20",
      "nominPrincipale": "1",
      "infosQualite": {
        "codeQualite": "Titulaire",
        "libQualite": "Membre titulaire",
        "libQualiteSex": "Membre titulaire"
      },
      "organesRefs": [
        "PO697360"
      ]
    },
    {
      "uid": "PM697422",
      "acteurRef": "PA610313",
      "legislature": "14",
      "typeOrgane": "CMP",
      "dateDebut": "2013-10-04T02:00:00.000+02:00",
      "datePublication": "2013-10-05T02:00:00.000+02:00",
      "dateFin": "2013-10-31T01:00:00.000+01:00",
      "preseance": "20",
      "nominPrincipale": "1",
      "infosQualite": {
        "codeQualite": "Titulaire",
        "libQualite": "Membre titulaire",
        "libQualiteSex": "Membre titulaire"
      },
      "organesRefs": [
        "PO697366"
      ]
    },
    {
      "uid": "PM697458",
      "acteurRef": "PA610313",
      "legislature": "14",
      "typeOrgane": "CMP",
      "dateDebut": "2013-10-04T02:00:00.000+02:00",
      "datePublication": "2013-10-05T02:00:00.000+02:00",
      "dateFin": "2013-10-11T02:00:00.000+02:00",
      "preseance": "28",
      "nominPrincipale": "1",
      "infosQualite": {
        "codeQualite": "Suppléant",
        "libQualite": "Membre suppléant",
        "libQualiteSex": "Membre suppléante"
      },
      "organesRefs": [
        "PO697117"
      ]
    },
    {
      "uid": "PM697486",
      "acteurRef": "PA610313",
      "legislature": "14",
      "typeOrgane": "CMP",
      "dateDebut": "2013-10-04T02:00:00.000+02:00",
      "datePublication": "2013-10-05T02:00:00.000+02:00",
      "dateFin": "2013-10-11T02:00:00.000+02:00",
      "preseance": "28",
      "nominPrincipale": "1",
      "infosQualite": {
        "codeQualite": "Suppléant",
        "libQualite": "Membre suppléant",
        "libQualiteSex": "Membre suppléante"
      },
      "organesRefs": [
        "PO697123"
      ]
    },
    {
      "uid": "PM697506",
      "acteurRef": "PA610313",
      "legislature": "14",
      "typeOrgane": "CMP",
      "dateDebut": "2013-10-04T02:00:00.000+02:00",
      "datePublication": "2013-10-05T02:00:00.000+02:00",
      "dateFin": "2013-10-30T01:00:00.000+01:00",
      "preseance": "20",
      "nominPrincipale": "1",
      "infosQualite": {
        "codeQualite": "Titulaire",
        "libQualite": "Membre titulaire",
        "libQualiteSex": "Membre titulaire"
      },
      "organesRefs": [
        "PO696970"
      ]
    },
    {
      "uid": "PM701122",
      "acteurRef": "PA610313",
      "legislature": "14",
      "typeOrgane": "CMP",
      "dateDebut": "2014-05-07T02:00:00.000+02:00",
      "datePublication": "2014-05-08T02:00:00.000+02:00",
      "dateFin": "2014-05-15T02:00:00.000+02:00",
      "preseance": "28",
      "nominPrincipale": "1",
      "infosQualite": {
        "codeQualite": "Suppléant",
        "libQualite": "Membre suppléant",
        "libQualiteSex": "Membre suppléante"
      },
      "organesRefs": [
        "PO700948"
      ]
    },
    {
      "uid": "PM701143",
      "acteurRef": "PA610313",
      "legislature": "14",
      "typeOrgane": "CMP",
      "dateDebut": "2014-05-07T02:00:00.000+02:00",
      "datePublication": "2014-05-08T02:00:00.000+02:00",
      "dateFin": "2014-05-15T02:00:00.000+02:00",
      "preseance": "20",
      "nominPrincipale": "1",
      "infosQualite": {
        "codeQualite": "Titulaire",
        "libQualite": "Membre titulaire",
        "libQualiteSex": "Membre titulaire"
      },
      "organesRefs": [
        "PO701096"
      ]
    },
    {
      "uid": "PM701462",
      "acteurRef": "PA610313",
      "legislature": "14",
      "typeOrgane": "COMPER",
      "dateDebut": "2014-05-21T02:00:00.000+02:00",
      "dateFin": "2016-06-14T02:00:00.000+02:00",
      "preseance": "16",
      "nominPrincipale": "1",
      "infosQualite": {
        "codeQualite": "Secrétaire",
        "libQualite": "Secrétaire",
        "libQualiteSex": "Secrétaire"
      },
      "organesRefs": [
        "PO59051"
      ]
    },
    {
      "uid": "PM702296",
      "acteurRef": "PA610313",
      "legislature": "14",
      "typeOrgane": "CMP",
      "dateDebut": "2014-07-07T02:00:00.000+02:00",
      "datePublication": "2014-07-09T02:00:00.000+02:00",
      "dateFin": "2014-07-18T02:00:00.000+02:00",
      "preseance": "20",
      "nominPrincipale": "1",
      "infosQualite": {
        "codeQualite": "Titulaire",
        "libQualite": "Membre titulaire",
        "libQualiteSex": "Membre titulaire"
      },
      "organesRefs": [
        "PO702285"
      ]
    },
    {
      "uid": "PM703868",
      "acteurRef": "PA610313",
      "legislature": "14",
      "typeOrgane": "GE",
      "dateDebut": "2014-10-14T02:00:00.000+02:00",
      "dateFin": "2017-06-20T02:00:00.000+02:00",
      "preseance": "4",
      "nominPrincipale": "1",
      "infosQualite": {
        "codeQualite": "Co-Président",
        "libQualite": "Co-Président",
        "libQualiteSex": "Co-Présidente"
      },
      "organesRefs": [
        "PO687370"
      ]
    },
    {
      "uid": "PM705454",
      "acteurRef": "PA610313",
      "legislature": "14",
      "typeOrgane": "CNPS",
      "dateDebut": "2014-12-13T01:00:00.000+01:00",
      "datePublication": "2014-12-13T01:00:00.000+01:00",
      "dateFin": "2015-08-07T02:00:00.000+02:00",
      "preseance": "20",
      "nominPrincipale": "1",
      "infosQualite": {
        "codeQualite": "Membre",
        "libQualite": "Membre",
        "libQualiteSex": "Membre"
      },
      "organesRefs": [
        "PO704848"
      ]
    },
    {
      "uid": "PM705489",
      "acteurRef": "PA610313",
      "legislature": "14",
      "typeOrgane": "CNPS",
      "dateDebut": "2014-12-16T01:00:00.000+01:00",
      "datePublication": "2014-12-17T01:00:00.000+01:00",
      "dateFin": "2015-08-07T02:00:00.000+02:00",
      "preseance": "14",
      "nominPrincipale": "1",
      "infosQualite": {
        "codeQualite": "Secrétaire",
        "libQualite": "Secrétaire",
        "libQualiteSex": "Secrétaire"
      },
      "organesRefs": [
        "PO704848"
      ]
    },
    {
      "uid": "PM705542",
      "acteurRef": "PA610313",
      "legislature": "14",
      "typeOrgane": "MISINFO",
      "dateDebut": "2014-09-17T02:00:00.000+02:00",
      "datePublication": "2014-09-18T02:00:00.000+02:00",
      "dateFin": "2014-12-17T01:00:00.000+01:00",
      "preseance": "10",
      "nominPrincipale": "1",
      "infosQualite": {
        "codeQualite": "Membre",
        "libQualite": "Membre",
        "libQualiteSex": "Membre"
      },
      "organesRefs": [
        "PO703218"
      ]
    },
    {
      "uid": "PM708351",
      "acteurRef": "PA610313",
      "legislature": "14",
      "typeOrgane": "CMP",
      "dateDebut": "2015-06-05T02:00:00.000+02:00",
      "datePublication": "2015-06-05T02:00:00.000+02:00",
      "dateFin": "2015-06-11T02:00:00.000+02:00",
      "preseance": "20",
      "nominPrincipale": "1",
      "infosQualite": {
        "codeQualite": "Titulaire",
        "libQualite": "Membre titulaire",
        "libQualiteSex": "Membre titulaire"
      },
      "organesRefs": [
        "PO707805"
      ]
    },
    {
      "uid": "PM708377",
      "acteurRef": "PA610313",
      "legislature": "14",
      "typeOrgane": "CMP",
      "dateDebut": "2015-06-05T02:00:00.000+02:00",
      "datePublication": "2015-06-05T02:00:00.000+02:00",
      "dateFin": "2015-06-11T02:00:00.000+02:00",
      "preseance": "20",
      "nominPrincipale": "1",
      "infosQualite": {
        "codeQualite": "Titulaire",
        "libQualite": "Membre titulaire",
        "libQualiteSex": "Membre titulaire"
      },
      "organesRefs": [
        "PO707789"
      ]
    },
    {
      "uid": "PM708450",
      "acteurRef": "PA610313",
      "legislature": "14",
      "typeOrgane": "CMP",
      "dateDebut": "2015-06-10T02:00:00.000+02:00",
      "datePublication": "2015-06-11T02:00:00.000+02:00",
      "dateFin": "2015-06-11T02:00:00.000+02:00",
      "preseance": "16",
      "nominPrincipale": "1",
      "infosQualite": {
        "codeQualite": "Rapporteur",
        "libQualite": "Rapporteur",
        "libQualiteSex": "Rapporteure"
      },
      "organesRefs": [
        "PO707789"
      ]
    },
    {
      "uid": "PM710087",
      "acteurRef": "PA610313",
      "legislature": "14",
      "typeOrgane": "CMP",
      "dateDebut": "2015-11-12T01:00:00.000+01:00",
      "datePublication": "2015-11-13T01:00:00.000+01:00",
      "dateFin": "2015-11-25T01:00:00.000+01:00",
      "preseance": "28",
      "nominPrincipale": "1",
      "infosQualite": {
        "codeQualite": "Suppléant",
        "libQualite": "Membre suppléant",
        "libQualiteSex": "Membre suppléante"
      },
      "organesRefs": [
        "PO709816"
      ]
    },
    {
      "uid": "PM710114",
      "acteurRef": "PA610313",
      "legislature": "14",
      "typeOrgane": "CMP",
      "dateDebut": "2015-11-12T01:00:00.000+01:00",
      "datePublication": "2015-11-13T01:00:00.000+01:00",
      "dateFin": "2015-11-25T01:00:00.000+01:00",
      "preseance": "28",
      "nominPrincipale": "1",
      "infosQualite": {
        "codeQualite": "Suppléant",
        "libQualite": "Membre suppléant",
        "libQualiteSex": "Membre suppléante"
      },
      "organesRefs": [
        "PO709677"
      ]
    },
    {
      "uid": "PM710253",
      "acteurRef": "PA610313",
      "legislature": "14",
      "typeOrgane": "CMP",
      "dateDebut": "2015-11-19T01:00:00.000+01:00",
      "datePublication": "2015-11-20T01:00:00.000+01:00",
      "dateFin": "2015-11-25T01:00:00.000+01:00",
      "preseance": "28",
      "nominPrincipale": "1",
      "infosQualite": {
        "codeQualite": "Suppléant",
        "libQualite": "Membre suppléant",
        "libQualiteSex": "Membre suppléante"
      },
      "organesRefs": [
        "PO710225"
      ]
    },
    {
      "uid": "PM710286",
      "acteurRef": "PA610313",
      "legislature": "14",
      "typeOrgane": "CMP",
      "dateDebut": "2015-11-19T01:00:00.000+01:00",
      "datePublication": "2015-11-20T01:00:00.000+01:00",
      "dateFin": "2015-11-25T01:00:00.000+01:00",
      "preseance": "28",
      "nominPrincipale": "1",
      "infosQualite": {
        "codeQualite": "Suppléant",
        "libQualite": "Membre suppléant",
        "libQualiteSex": "Membre suppléante"
      },
      "organesRefs": [
        "PO710231"
      ]
    },
    {
      "uid": "PM711755",
      "acteurRef": "PA610313",
      "legislature": "14",
      "typeOrgane": "CMP",
      "dateDebut": "2016-03-10T01:00:00.000+01:00",
      "datePublication": "2016-03-11T01:00:00.000+01:00",
      "dateFin": "2016-04-05T02:00:00.000+02:00",
      "preseance": "20",
      "nominPrincipale": "1",
      "infosQualite": {
        "codeQualite": "Titulaire",
        "libQualite": "Membre titulaire",
        "libQualiteSex": "Membre titulaire"
      },
      "organesRefs": [
        "PO711634"
      ]
    },
    {
      "uid": "PM711781",
      "acteurRef": "PA610313",
      "legislature": "14",
      "typeOrgane": "CMP",
      "dateDebut": "2016-03-10T01:00:00.000+01:00",
      "datePublication": "2016-03-11T01:00:00.000+01:00",
      "dateFin": "2016-04-05T02:00:00.000+02:00",
      "preseance": "20",
      "nominPrincipale": "1",
      "infosQualite": {
        "codeQualite": "Titulaire",
        "libQualite": "Membre titulaire",
        "libQualiteSex": "Membre titulaire"
      },
      "organesRefs": [
        "PO711628"
      ]
    },
    {
      "uid": "PM711906",
      "acteurRef": "PA610313",
      "legislature": "14",
      "typeOrgane": "CMP",
      "dateDebut": "2016-03-15T01:00:00.000+01:00",
      "datePublication": "2016-03-16T01:00:00.000+01:00",
      "dateFin": "2016-04-05T02:00:00.000+02:00",
      "preseance": "16",
      "nominPrincipale": "1",
      "infosQualite": {
        "codeQualite": "Rapporteur",
        "libQualite": "Rapporteur",
        "libQualiteSex": "Rapporteure"
      },
      "organesRefs": [
        "PO711634"
      ]
    },
    {
      "uid": "PM711909",
      "acteurRef": "PA610313",
      "legislature": "14",
      "typeOrgane": "CMP",
      "dateDebut": "2016-03-15T01:00:00.000+01:00",
      "datePublication": "2016-03-16T01:00:00.000+01:00",
      "dateFin": "2016-04-05T02:00:00.000+02:00",
      "preseance": "16",
      "nominPrincipale": "1",
      "infosQualite": {
        "codeQualite": "Rapporteur",
        "libQualite": "Rapporteur",
        "libQualiteSex": "Rapporteure"
      },
      "organesRefs": [
        "PO711628"
      ]
    },
    {
      "uid": "PM712354",
      "acteurRef": "PA610313",
      "legislature": "14",
      "typeOrgane": "GE",
      "dateDebut": "2016-04-11T02:00:00.000+02:00",
      "dateFin": "2017-06-20T02:00:00.000+02:00",
      "preseance": "20",
      "nominPrincipale": "1",
      "infosQualite": {
        "codeQualite": "Membre",
        "libQualite": "Membre",
        "libQualiteSex": "Membre"
      },
      "organesRefs": [
        "PO712100"
      ]
    },
    {
      "uid": "PM712665",
      "acteurRef": "PA610313",
      "legislature": "14",
      "typeOrgane": "CMP",
      "dateDebut": "2016-05-04T02:00:00.000+02:00",
      "datePublication": "2016-05-05T02:00:00.000+02:00",
      "dateFin": "2016-06-01T02:00:00.000+02:00",
      "preseance": "28",
      "nominPrincipale": "1",
      "infosQualite": {
        "codeQualite": "Suppléant",
        "libQualite": "Membre suppléant",
        "libQualiteSex": "Membre suppléante"
      },
      "organesRefs": [
        "PO712266"
      ]
    },
    {
      "uid": "PM712726",
      "acteurRef": "PA610313",
      "legislature": "14",
      "typeOrgane": "CNPS",
      "dateDebut": "2016-05-05T02:00:00.000+02:00",
      "datePublication": "2016-05-05T02:00:00.000+02:00",
      "dateFin": "2017-02-20T01:00:00.000+01:00",
      "preseance": "20",
      "nominPrincipale": "1",
      "infosQualite": {
        "codeQualite": "Membre",
        "libQualite": "Membre",
        "libQualiteSex": "Membre"
      },
      "organesRefs": [
        "PO712376"
      ]
    },
    {
      "uid": "PM713309",
      "acteurRef": "PA610313",
      "legislature": "14",
      "typeOrgane": "GP",
      "dateDebut": "2016-05-25T02:00:00.000+02:00",
      "dateFin": "2017-06-20T02:00:00.000+02:00",
      "preseance": "20",
      "nominPrincipale": "1",
      "infosQualite": {
        "codeQualite": "Membre",
        "libQualite": "Membre du",
        "libQualiteSex": "Membre du"
      },
      "organesRefs": [
        "PO713077"
      ]
    },
    {
      "uid": "PM713710",
      "acteurRef": "PA610313",
      "legislature": "14",
      "typeOrgane": "COMPER",
      "dateDebut": "2016-06-15T02:00:00.000+02:00",
      "datePublication": "2016-06-15T02:00:00.000+02:00",
      "dateFin": "2016-06-15T02:00:00.000+02:00",
      "preseance": "32",
      "nominPrincipale": "1",
      "infosQualite": {
        "codeQualite": "Membre",
        "libQualite": "Membre",
        "libQualiteSex": "Membre"
      },
      "organesRefs": [
        "PO419865"
      ]
    },
    {
      "uid": "PM713724",
      "acteurRef": "PA610313",
      "legislature": "14",
      "typeOrgane": "COMPER",
      "dateDebut": "2016-06-16T02:00:00.000+02:00",
      "datePublication": "2016-06-16T02:00:00.000+02:00",
      "dateFin": "2017-06-20T02:00:00.000+02:00",
      "preseance": "32",
      "nominPrincipale": "0",
      "infosQualite": {
        "codeQualite": "Membre",
        "libQualite": "Membre",
        "libQualiteSex": "Membre"
      },
      "organesRefs": [
        "PO59051"
      ]
    },
    {
      "uid": "PM713725",
      "acteurRef": "PA610313",
      "legislature": "14",
      "typeOrgane": "COMPER",
      "dateDebut": "2016-06-16T02:00:00.000+02:00",
      "datePublication": "2016-06-16T02:00:00.000+02:00",
      "dateFin": "2017-06-20T02:00:00.000+02:00",
      "preseance": "16",
      "nominPrincipale": "1",
      "infosQualite": {
        "codeQualite": "Secrétaire",
        "libQualite": "Secrétaire",
        "libQualiteSex": "Secrétaire"
      },
      "organesRefs": [
        "PO59051"
      ]
    },
    {
      "uid": "PM714106",
      "acteurRef": "PA610313",
      "legislature": "14",
      "typeOrgane": "CMP",
      "dateDebut": "2016-07-06T02:00:00.000+02:00",
      "datePublication": "2016-07-07T02:00:00.000+02:00",
      "dateFin": "2016-07-13T02:00:00.000+02:00",
      "preseance": "20",
      "nominPrincipale": "1",
      "infosQualite": {
        "codeQualite": "Titulaire",
        "libQualite": "Membre titulaire",
        "libQualiteSex": "Membre titulaire"
      },
      "organesRefs": [
        "PO714021"
      ]
    },
    {
      "uid": "PM714126",
      "acteurRef": "PA610313",
      "legislature": "14",
      "typeOrgane": "CMP",
      "dateDebut": "2016-07-06T02:00:00.000+02:00",
      "datePublication": "2016-07-07T02:00:00.000+02:00",
      "dateFin": "2016-07-13T02:00:00.000+02:00",
      "preseance": "20",
      "nominPrincipale": "1",
      "infosQualite": {
        "codeQualite": "Titulaire",
        "libQualite": "Membre titulaire",
        "libQualiteSex": "Membre titulaire"
      },
      "organesRefs": [
        "PO714027"
      ]
    },
    {
      "uid": "PM714133",
      "acteurRef": "PA610313",
      "legislature": "14",
      "typeOrgane": "CMP",
      "dateDebut": "2016-07-06T02:00:00.000+02:00",
      "datePublication": "2016-07-07T02:00:00.000+02:00",
      "dateFin": "2016-07-13T02:00:00.000+02:00",
      "preseance": "20",
      "nominPrincipale": "1",
      "infosQualite": {
        "codeQualite": "Titulaire",
        "libQualite": "Membre titulaire",
        "libQualiteSex": "Membre titulaire"
      },
      "organesRefs": [
        "PO714015"
      ]
    },
    {
      "uid": "PM714284",
      "acteurRef": "PA610313",
      "legislature": "14",
      "typeOrgane": "CMP",
      "dateDebut": "2016-07-12T02:00:00.000+02:00",
      "datePublication": "2016-07-13T02:00:00.000+02:00",
      "dateFin": "2016-07-13T02:00:00.000+02:00",
      "preseance": "16",
      "nominPrincipale": "1",
      "infosQualite": {
        "codeQualite": "Rapporteur",
        "libQualite": "Rapporteur",
        "libQualiteSex": "Rapporteure"
      },
      "organesRefs": [
        "PO714021"
      ]
    },
    {
      "uid": "PM714289",
      "acteurRef": "PA610313",
      "legislature": "14",
      "typeOrgane": "CMP",
      "dateDebut": "2016-07-12T02:00:00.000+02:00",
      "datePublication": "2016-07-13T02:00:00.000+02:00",
      "dateFin": "2016-07-13T02:00:00.000+02:00",
      "preseance": "16",
      "nominPrincipale": "1",
      "infosQualite": {
        "codeQualite": "Rapporteur",
        "libQualite": "Rapporteur",
        "libQualiteSex": "Rapporteure"
      },
      "organesRefs": [
        "PO714027"
      ]
    },
    {
      "uid": "PM714295",
      "acteurRef": "PA610313",
      "legislature": "14",
      "typeOrgane": "CMP",
      "dateDebut": "2016-07-12T02:00:00.000+02:00",
      "datePublication": "2016-07-13T02:00:00.000+02:00",
      "dateFin": "2016-07-13T02:00:00.000+02:00",
      "preseance": "16",
      "nominPrincipale": "1",
      "infosQualite": {
        "codeQualite": "Rapporteur",
        "libQualite": "Rapporteur",
        "libQualiteSex": "Rapporteure"
      },
      "organesRefs": [
        "PO714015"
      ]
    }
  ]
}