{
  "uid": "PA328",
  "etatCivil": {
    "ident": {
      "civ": "M.",
      "prenom": "Jean-Marc",
      "nom": "Ayrault",
      "alpha": "Ayrault"
    },
    "infoNaissance": {
      "dateNais": "1950-01-25T01:00:00.000+01:00",
      "villeNais": "Maulévrier",
      "depNais": "Maine-et-Loire"
    }
  },
  "profession": {
    "libelleCourant": "Enseignant",
    "socProcInsee": {
      "catSocPro": "Cadres de la fonction publique, professions intellectuelles et  artistiques",
      "famSocPro": "Cadres et professions intellectuelles supérieures"
    }
  },
  "adresses": [
    {
      "xsiType": "AdressePostale_Type",
      "uid": "AD46542",
      "type": "2",
      "typeLibelle": "Adresse publiée de circonscription",
      "poids": "21",
      "intitule": "Permanence parlementaire,",
      "numeroRue": "47",
      "nomRue": "Place de Preux,",
      "complementAdresse": "BP 50 351,",
      "codePostal": "44816",
      "ville": "Saint-Herblain Cedex"
    },
    {
      "xsiType": "AdresseTelephonique_Type",
      "uid": "AD47970",
      "type": "11",
      "typeLibelle": "Téléphone",
      "poids": "21",
      "adresseDeRattachement": "AD46542",
      "valElec": "02 40 43 13 18"
    },
    {
      "xsiType": "AdresseTelephonique_Type",
      "uid": "AD49641",
      "type": "12",
      "typeLibelle": "Télécopie",
      "poids": "21",
      "adresseDeRattachement": "AD46542",
      "valElec": "02 40 46 15 07"
    },
    {
      "xsiType": "AdressePostale_Type",
      "uid": "AD386783",
      "type": "0",
      "typeLibelle": "Adresse officielle",
      "poids": "1",
      "intitule": "Assemblée nationale,",
      "numeroRue": "126",
      "nomRue": "Rue de l'Université,",
      "codePostal": "75355",
      "ville": "Paris 07 SP"
    },
    {
      "xsiType": "AdresseMail_Type",
      "uid": "AD391616",
      "type": "15",
      "typeLibelle": "Mèl",
      "valElec": "jmayrault@assemblee-nationale.fr"
    },
    {
      "xsiType": "AdresseSiteWeb_Type",
      "uid": "AD701091",
      "type": "22",
      "typeLibelle": "Site internet",
      "valElec": "jmayrault.fr"
    }
  ],
  "mandats": [
    {
      "uid": "PM386017",
      "acteurRef": "PA328",
      "legislature": "13",
      "typeOrgane": "ASSEMBLEE",
      "dateDebut": "2007-06-20T02:00:00.000+02:00",
      "dateFin": "2012-06-15T02:00:00.000+02:00",
      "preseance": "50",
      "nominPrincipale": "1",
      "infosQualite": {
        "codeQualite": "membre",
        "libQualite": "membre",
        "libQualiteSex": "membre"
      },
      "organesRefs": [
        "PO384266"
      ],
      "suppleant": {
        "dateDebut": "2007-06-20T02:00:00.000+02:00",
        "dateFin": "2012-06-15T02:00:00.000+02:00",
        "suppleantRef": "PA266863"
      },
      "election": {
        "lieu": {
          "region": "Pays de la Loire",
          "regionType": "Métropolitain",
          "departement": "Loire-Atlantique",
          "numDepartement": "44",
          "numCirco": "3"
        },
        "causeMandat": "élections générales",
        "refCirconscription": "PO384472"
      },
      "mandature": {
        "datePriseFonction": "2007-06-20T02:00:00.000+02:00",
        "causeFin": "Nomination comme membre du Gouvernement",
        "premiereElection": "1"
      }
    },
    {
      "uid": "PM387362",
      "acteurRef": "PA328",
      "legislature": "13",
      "typeOrgane": "GP",
      "dateDebut": "2007-06-20T02:00:00.000+02:00",
      "dateFin": "2007-06-26T02:00:00.000+02:00",
      "preseance": "28",
      "nominPrincipale": "1",
      "infosQualite": {
        "codeQualite": "Député non-inscrit",
        "libQualite": "Député non-inscrit",
        "libQualiteSex": "Député non-inscrit"
      },
      "organesRefs": [
        "PO387155"
      ]
    },
    {
      "uid": "PM390033",
      "acteurRef": "PA328",
      "legislature": "13",
      "typeOrgane": "GP",
      "dateDebut": "2007-06-27T02:00:00.000+02:00",
      "datePublication": "2007-06-27T02:00:00.000+02:00",
      "dateFin": "2012-06-15T02:00:00.000+02:00",
      "preseance": "20",
      "nominPrincipale": "0",
      "infosQualite": {
        "codeQualite": "Membre",
        "libQualite": "Membre du",
        "libQualiteSex": "Membre du"
      },
      "organesRefs": [
        "PO389507"
      ]
    },
    {
      "uid": "PM390217",
      "acteurRef": "PA328",
      "legislature": "13",
      "typeOrgane": "GP",
      "dateDebut": "2007-06-27T02:00:00.000+02:00",
      "datePublication": "2007-06-27T02:00:00.000+02:00",
      "dateFin": "2012-06-15T02:00:00.000+02:00",
      "preseance": "1",
      "nominPrincipale": "1",
      "infosQualite": {
        "codeQualite": "Président",
        "libQualite": "Président du",
        "libQualiteSex": "Président du"
      },
      "organesRefs": [
        "PO389507"
      ]
    },
    {
      "uid": "PM390740",
      "acteurRef": "PA328",
      "legislature": "13",
      "typeOrgane": "COMPER",
      "dateDebut": "2007-06-27T02:00:00.000+02:00",
      "datePublication": "2007-06-28T02:00:00.000+02:00",
      "dateFin": "2009-06-15T02:00:00.000+02:00",
      "preseance": "32",
      "nominPrincipale": "1",
      "infosQualite": {
        "codeQualite": "Membre",
        "libQualite": "Membre",
        "libQualiteSex": "Membre"
      },
      "organesRefs": [
        "PO59046"
      ]
    },
    {
      "uid": "PM394290",
      "acteurRef": "PA328",
      "legislature": "13",
      "typeOrgane": "ORGEXTPARL",
      "dateDebut": "2007-08-01T02:00:00.000+02:00",
      "datePublication": "2007-08-02T02:00:00.000+02:00",
      "dateFin": "2012-06-15T02:00:00.000+02:00",
      "preseance": "20",
      "nominPrincipale": "1",
      "infosQualite": {
        "codeQualite": "Titulaire",
        "libQualite": "Membre titulaire",
        "libQualiteSex": "Membre titulaire"
      },
      "organesRefs": [
        "PO323296"
      ]
    },
    {
      "uid": "PM401247",
      "acteurRef": "PA328",
      "legislature": "13",
      "typeOrgane": "GA",
      "dateDebut": "2007-10-26T02:00:00.000+02:00",
      "dateFin": "2012-06-15T02:00:00.000+02:00",
      "preseance": "20",
      "nominPrincipale": "1",
      "infosQualite": {
        "codeQualite": "Membre",
        "libQualite": "Membre",
        "libQualiteSex": "Membre"
      },
      "organesRefs": [
        "PO392674"
      ]
    },
    {
      "uid": "PM401248",
      "acteurRef": "PA328",
      "legislature": "13",
      "typeOrgane": "GA",
      "dateDebut": "2007-10-26T02:00:00.000+02:00",
      "dateFin": "2012-06-15T02:00:00.000+02:00",
      "preseance": "20",
      "nominPrincipale": "1",
      "infosQualite": {
        "codeQualite": "Membre",
        "libQualite": "Membre",
        "libQualiteSex": "Membre"
      },
      "organesRefs": [
        "PO392709"
      ]
    },
    {
      "uid": "PM401249",
      "acteurRef": "PA328",
      "legislature": "13",
      "typeOrgane": "GA",
      "dateDebut": "2007-10-26T02:00:00.000+02:00",
      "dateFin": "2012-06-15T02:00:00.000+02:00",
      "preseance": "20",
      "nominPrincipale": "1",
      "infosQualite": {
        "codeQualite": "Membre",
        "libQualite": "Membre",
        "libQualiteSex": "Membre"
      },
      "organesRefs": [
        "PO392770"
      ]
    },
    {
      "uid": "PM401250",
      "acteurRef": "PA328",
      "legislature": "13",
      "typeOrgane": "GA",
      "dateDebut": "2007-10-26T02:00:00.000+02:00",
      "dateFin": "2012-06-15T02:00:00.000+02:00",
      "preseance": "20",
      "nominPrincipale": "1",
      "infosQualite": {
        "codeQualite": "Membre",
        "libQualite": "Membre",
        "libQualiteSex": "Membre"
      },
      "organesRefs": [
        "PO392785"
      ]
    },
    {
      "uid": "PM401251",
      "acteurRef": "PA328",
      "legislature": "13",
      "typeOrgane": "GA",
      "dateDebut": "2007-10-26T02:00:00.000+02:00",
      "dateFin": "2012-06-15T02:00:00.000+02:00",
      "preseance": "20",
      "nominPrincipale": "1",
      "infosQualite": {
        "codeQualite": "Membre",
        "libQualite": "Membre",
        "libQualiteSex": "Membre"
      },
      "organesRefs": [
        "PO392840"
      ]
    },
    {
      "uid": "PM401252",
      "acteurRef": "PA328",
      "legislature": "13",
      "typeOrgane": "GA",
      "dateDebut": "2007-10-26T02:00:00.000+02:00",
      "dateFin": "2012-06-15T02:00:00.000+02:00",
      "preseance": "20",
      "nominPrincipale": "1",
      "infosQualite": {
        "codeQualite": "Membre",
        "libQualite": "Membre",
        "libQualiteSex": "Membre"
      },
      "organesRefs": [
        "PO392875"
      ]
    },
    {
      "uid": "PM401253",
      "acteurRef": "PA328",
      "legislature": "13",
      "typeOrgane": "GA",
      "dateDebut": "2007-10-26T02:00:00.000+02:00",
      "dateFin": "2012-06-15T02:00:00.000+02:00",
      "preseance": "20",
      "nominPrincipale": "1",
      "infosQualite": {
        "codeQualite": "Membre",
        "libQualite": "Membre",
        "libQualiteSex": "Membre"
      },
      "organesRefs": [
        "PO392950"
      ]
    },
    {
      "uid": "PM401254",
      "acteurRef": "PA328",
      "legislature": "13",
      "typeOrgane": "GA",
      "dateDebut": "2007-10-26T02:00:00.000+02:00",
      "dateFin": "2012-06-15T02:00:00.000+02:00",
      "preseance": "20",
      "nominPrincipale": "1",
      "infosQualite": {
        "codeQualite": "Membre",
        "libQualite": "Membre",
        "libQualiteSex": "Membre"
      },
      "organesRefs": [
        "PO392980"
      ]
    },
    {
      "uid": "PM401255",
      "acteurRef": "PA328",
      "legislature": "13",
      "typeOrgane": "GA",
      "dateDebut": "2007-10-26T02:00:00.000+02:00",
      "dateFin": "2012-06-15T02:00:00.000+02:00",
      "preseance": "20",
      "nominPrincipale": "1",
      "infosQualite": {
        "codeQualite": "Membre",
        "libQualite": "Membre",
        "libQualiteSex": "Membre"
      },
      "organesRefs": [
        "PO392990"
      ]
    },
    {
      "uid": "PM401256",
      "acteurRef": "PA328",
      "legislature": "13",
      "typeOrgane": "GA",
      "dateDebut": "2007-10-26T02:00:00.000+02:00",
      "dateFin": "2012-06-15T02:00:00.000+02:00",
      "preseance": "20",
      "nominPrincipale": "1",
      "infosQualite": {
        "codeQualite": "Membre",
        "libQualite": "Membre",
        "libQualiteSex": "Membre"
      },
      "organesRefs": [
        "PO393025"
      ]
    },
    {
      "uid": "PM401257",
      "acteurRef": "PA328",
      "legislature": "13",
      "typeOrgane": "GA",
      "dateDebut": "2007-10-26T02:00:00.000+02:00",
      "dateFin": "2012-06-15T02:00:00.000+02:00",
      "preseance": "20",
      "nominPrincipale": "1",
      "infosQualite": {
        "codeQualite": "Membre",
        "libQualite": "Membre",
        "libQualiteSex": "Membre"
      },
      "organesRefs": [
        "PO393070"
      ]
    },
    {
      "uid": "PM401258",
      "acteurRef": "PA328",
      "legislature": "13",
      "typeOrgane": "GA",
      "dateDebut": "2007-10-26T02:00:00.000+02:00",
      "dateFin": "2012-06-15T02:00:00.000+02:00",
      "preseance": "20",
      "nominPrincipale": "1",
      "infosQualite": {
        "codeQualite": "Membre",
        "libQualite": "Membre",
        "libQualiteSex": "Membre"
      },
      "organesRefs": [
        "PO393085"
      ]
    },
    {
      "uid": "PM401259",
      "acteurRef": "PA328",
      "legislature": "13",
      "typeOrgane": "GA",
      "dateDebut": "2007-10-26T02:00:00.000+02:00",
      "dateFin": "2012-06-15T02:00:00.000+02:00",
      "preseance": "20",
      "nominPrincipale": "1",
      "infosQualite": {
        "codeQualite": "Membre",
        "libQualite": "Membre",
        "libQualiteSex": "Membre"
      },
      "organesRefs": [
        "PO393328"
      ]
    },
    {
      "uid": "PM401260",
      "acteurRef": "PA328",
      "legislature": "13",
      "typeOrgane": "GA",
      "dateDebut": "2007-10-26T02:00:00.000+02:00",
      "dateFin": "2012-06-15T02:00:00.000+02:00",
      "preseance": "20",
      "nominPrincipale": "1",
      "infosQualite": {
        "codeQualite": "Membre",
        "libQualite": "Membre",
        "libQualiteSex": "Membre"
      },
      "organesRefs": [
        "PO393338"
      ]
    },
    {
      "uid": "PM401261",
      "acteurRef": "PA328",
      "legislature": "13",
      "typeOrgane": "GA",
      "dateDebut": "2007-10-26T02:00:00.000+02:00",
      "dateFin": "2012-06-15T02:00:00.000+02:00",
      "preseance": "20",
      "nominPrincipale": "1",
      "infosQualite": {
        "codeQualite": "Membre",
        "libQualite": "Membre",
        "libQualiteSex": "Membre"
      },
      "organesRefs": [
        "PO393343"
      ]
    },
    {
      "uid": "PM401394",
      "acteurRef": "PA328",
      "legislature": "13",
      "typeOrgane": "GEVI",
      "dateDebut": "2007-10-26T02:00:00.000+02:00",
      "dateFin": "2012-06-15T02:00:00.000+02:00",
      "preseance": "20",
      "nominPrincipale": "1",
      "infosQualite": {
        "codeQualite": "Membre",
        "libQualite": "Membre",
        "libQualiteSex": "Membre"
      },
      "organesRefs": [
        "PO393228"
      ]
    },
    {
      "uid": "PM404349",
      "acteurRef": "PA328",
      "legislature": "13",
      "typeOrgane": "GA",
      "dateDebut": "2007-11-28T01:00:00.000+01:00",
      "dateFin": "2012-06-15T02:00:00.000+02:00",
      "preseance": "14",
      "nominPrincipale": "1",
      "infosQualite": {
        "codeQualite": "Secrétaire",
        "libQualite": "Secrétaire",
        "libQualiteSex": "Secrétaire"
      },
      "organesRefs": [
        "PO392674"
      ]
    },
    {
      "uid": "PM406345",
      "acteurRef": "PA328",
      "legislature": "13",
      "typeOrgane": "GE",
      "dateDebut": "2008-01-11T01:00:00.000+01:00",
      "dateFin": "2012-06-15T02:00:00.000+02:00",
      "preseance": "20",
      "nominPrincipale": "1",
      "infosQualite": {
        "codeQualite": "Membre",
        "libQualite": "Membre",
        "libQualiteSex": "Membre"
      },
      "organesRefs": [
        "PO402776"
      ]
    },
    {
      "uid": "PM412026",
      "acteurRef": "PA328",
      "legislature": "13",
      "typeOrgane": "GE",
      "dateDebut": "2008-04-07T02:00:00.000+02:00",
      "dateFin": "2012-06-15T02:00:00.000+02:00",
      "preseance": "20",
      "nominPrincipale": "1",
      "infosQualite": {
        "codeQualite": "Membre",
        "libQualite": "Membre",
        "libQualiteSex": "Membre"
      },
      "organesRefs": [
        "PO403262"
      ]
    },
    {
      "uid": "PM412769",
      "acteurRef": "PA328",
      "legislature": "13",
      "typeOrgane": "GA",
      "dateDebut": "2008-04-18T02:00:00.000+02:00",
      "dateFin": "2012-06-15T02:00:00.000+02:00",
      "preseance": "20",
      "nominPrincipale": "1",
      "infosQualite": {
        "codeQualite": "Membre",
        "libQualite": "Membre",
        "libQualiteSex": "Membre"
      },
      "organesRefs": [
        "PO392810"
      ]
    },
    {
      "uid": "PM412770",
      "acteurRef": "PA328",
      "legislature": "13",
      "typeOrgane": "GA",
      "dateDebut": "2008-04-18T02:00:00.000+02:00",
      "dateFin": "2012-06-15T02:00:00.000+02:00",
      "preseance": "20",
      "nominPrincipale": "1",
      "infosQualite": {
        "codeQualite": "Membre",
        "libQualite": "Membre",
        "libQualiteSex": "Membre"
      },
      "organesRefs": [
        "PO393040"
      ]
    },
    {
      "uid": "PM412771",
      "acteurRef": "PA328",
      "legislature": "13",
      "typeOrgane": "GA",
      "dateDebut": "2008-04-18T02:00:00.000+02:00",
      "dateFin": "2012-06-15T02:00:00.000+02:00",
      "preseance": "20",
      "nominPrincipale": "1",
      "infosQualite": {
        "codeQualite": "Membre",
        "libQualite": "Membre",
        "libQualiteSex": "Membre"
      },
      "organesRefs": [
        "PO393207"
      ]
    },
    {
      "uid": "PM412772",
      "acteurRef": "PA328",
      "legislature": "13",
      "typeOrgane": "GA",
      "dateDebut": "2008-04-18T02:00:00.000+02:00",
      "dateFin": "2012-06-15T02:00:00.000+02:00",
      "preseance": "20",
      "nominPrincipale": "1",
      "infosQualite": {
        "codeQualite": "Membre",
        "libQualite": "Membre",
        "libQualiteSex": "Membre"
      },
      "organesRefs": [
        "PO393353"
      ]
    },
    {
      "uid": "PM416815",
      "acteurRef": "PA328",
      "legislature": "13",
      "typeOrgane": "GA",
      "dateDebut": "2007-12-12T01:00:00.000+01:00",
      "dateFin": "2012-06-15T02:00:00.000+02:00",
      "preseance": "8",
      "nominPrincipale": "1",
      "infosQualite": {
        "codeQualite": "Vice-Président",
        "libQualite": "Vice-Président",
        "libQualiteSex": "Vice-Président"
      },
      "organesRefs": [
        "PO392980"
      ]
    },
    {
      "uid": "PM419457",
      "acteurRef": "PA328",
      "legislature": "13",
      "typeOrgane": "COMPER",
      "dateDebut": "2009-06-16T02:00:00.000+02:00",
      "datePublication": "2009-06-16T02:00:00.000+02:00",
      "dateFin": "2009-06-22T02:00:00.000+02:00",
      "preseance": "32",
      "nominPrincipale": "1",
      "infosQualite": {
        "codeQualite": "Membre",
        "libQualite": "Membre",
        "libQualiteSex": "Membre"
      },
      "organesRefs": [
        "PO59045"
      ]
    },
    {
      "uid": "PM419515",
      "acteurRef": "PA328",
      "legislature": "13",
      "typeOrgane": "COMPER",
      "dateDebut": "2009-06-23T02:00:00.000+02:00",
      "datePublication": "2009-06-23T02:00:00.000+02:00",
      "dateFin": "2012-06-15T02:00:00.000+02:00",
      "preseance": "32",
      "nominPrincipale": "1",
      "infosQualite": {
        "codeQualite": "Membre",
        "libQualite": "Membre",
        "libQualiteSex": "Membre"
      },
      "organesRefs": [
        "PO59046"
      ]
    },
    {
      "uid": "PM420571",
      "acteurRef": "PA328",
      "legislature": "13",
      "typeOrgane": "COMNL",
      "dateDebut": "2009-07-01T02:00:00.000+02:00",
      "datePublication": "2009-07-03T02:00:00.000+02:00",
      "dateFin": "2012-06-15T02:00:00.000+02:00",
      "preseance": "2",
      "nominPrincipale": "1",
      "infosQualite": {
        "codeQualite": "Membre de droit du Bureau",
        "libQualite": "Membre de droit du Bureau",
        "libQualiteSex": "Membre de droit du Bureau"
      },
      "organesRefs": [
        "PO420375"
      ]
    },
    {
      "uid": "PM425104",
      "acteurRef": "PA328",
      "legislature": "13",
      "typeOrgane": "COMNL",
      "dateDebut": "2009-07-01T02:00:00.000+02:00",
      "datePublication": "2009-07-03T02:00:00.000+02:00",
      "dateFin": "2012-06-15T02:00:00.000+02:00",
      "preseance": "20",
      "nominPrincipale": "0",
      "infosQualite": {
        "codeQualite": "Membre",
        "libQualite": "Membre",
        "libQualiteSex": "Membre"
      },
      "organesRefs": [
        "PO420375"
      ]
    },
    {
      "uid": "PM590014",
      "acteurRef": "PA328",
      "typeOrgane": "MINISTERE",
      "dateDebut": "2012-05-16T02:00:00.000+02:00",
      "datePublication": "2012-05-16T02:00:00.000+02:00",
      "dateFin": "2012-06-18T02:00:00.000+02:00",
      "preseance": "1",
      "nominPrincipale": "1",
      "infosQualite": {
        "codeQualite": "Premier ministre",
        "libQualite": "Premier ministre",
        "libQualiteSex": "Premier ministre"
      },
      "organesRefs": [
        "PO590012"
      ]
    },
    {
      "uid": "PM645184",
      "acteurRef": "PA328",
      "legislature": "14",
      "typeOrgane": "ASSEMBLEE",
      "dateDebut": "2012-06-20T02:00:00.000+02:00",
      "dateFin": "2012-07-20T02:00:00.000+02:00",
      "preseance": "50",
      "nominPrincipale": "1",
      "infosQualite": {
        "codeQualite": "membre",
        "libQualite": "membre",
        "libQualiteSex": "membre"
      },
      "organesRefs": [
        "PO644420"
      ],
      "suppleant": {
        "dateDebut": "2012-06-20T02:00:00.000+02:00",
        "dateFin": "2012-07-20T02:00:00.000+02:00",
        "suppleantRef": "PA266863"
      },
      "election": {
        "lieu": {
          "region": "Pays de la Loire",
          "regionType": "Métropolitain",
          "departement": "Loire-Atlantique",
          "numDepartement": "44",
          "numCirco": "3"
        },
        "causeMandat": "élections générales",
        "refCirconscription": "PO644626"
      },
      "mandature": {
        "datePriseFonction": "2012-06-20T02:00:00.000+02:00",
        "causeFin": "Nomination comme membre du Gouvernement",
        "premiereElection": "1"
      }
    },
    {
      "uid": "PM653228",
      "acteurRef": "PA328",
      "typeOrgane": "MINISTERE",
      "dateDebut": "2012-06-19T02:00:00.000+02:00",
      "datePublication": "2012-06-19T02:00:00.000+02:00",
      "dateFin": "2014-03-31T02:00:00.000+02:00",
      "preseance": "1",
      "nominPrincipale": "1",
      "infosQualite": {
        "codeQualite": "Premier ministre",
        "libQualite": "Premier ministre",
        "libQualiteSex": "Premier ministre"
      },
      "organesRefs": [
        "PO653218"
      ]
    },
    {
      "uid": "PM656036",
      "acteurRef": "PA328",
      "legislature": "14",
      "typeOrgane": "GP",
      "dateDebut": "2012-06-26T02:00:00.000+02:00",
      "datePublication": "2012-06-27T02:00:00.000+02:00",
      "dateFin": "2012-07-20T02:00:00.000+02:00",
      "preseance": "20",
      "nominPrincipale": "1",
      "infosQualite": {
        "codeQualite": "Membre",
        "libQualite": "Membre du",
        "libQualiteSex": "Membre du"
      },
      "organesRefs": [
        "PO656002"
      ]
    },
    {
      "uid": "PM657325",
      "acteurRef": "PA328",
      "legislature": "14",
      "typeOrgane": "COMPER",
      "dateDebut": "2012-06-28T02:00:00.000+02:00",
      "datePublication": "2012-06-28T02:00:00.000+02:00",
      "dateFin": "2012-07-20T02:00:00.000+02:00",
      "preseance": "32",
      "nominPrincipale": "1",
      "infosQualite": {
        "codeQualite": "Membre",
        "libQualite": "Membre",
        "libQualiteSex": "Membre"
      },
      "organesRefs": [
        "PO59046"
      ]
    },
    {
      "uid": "PM701008",
      "acteurRef": "PA328",
      "legislature": "14",
      "typeOrgane": "ASSEMBLEE",
      "dateDebut": "2012-06-20T02:00:00.000+02:00",
      "dateFin": "2016-03-11T01:00:00.000+01:00",
      "preseance": "50",
      "nominPrincipale": "1",
      "infosQualite": {
        "codeQualite": "membre",
        "libQualite": "membre",
        "libQualiteSex": "membre"
      },
      "organesRefs": [
        "PO644420"
      ],
      "election": {
        "lieu": {
          "region": "Pays de la Loire",
          "regionType": "Métropolitain",
          "departement": "Loire-Atlantique",
          "numDepartement": "44",
          "numCirco": "3"
        },
        "causeMandat": "reprise de l'exercice du mandat d'un ancien membre du Gouvernement",
        "refCirconscription": "PO644626"
      },
      "mandature": {
        "datePriseFonction": "2014-05-01T02:00:00.000+02:00",
        "causeFin": "Nomination comme membre du Gouvernement",
        "premiereElection": "1",
        "mandatRemplaceRef": "PM645184"
      }
    },
    {
      "uid": "PM701010",
      "acteurRef": "PA328",
      "legislature": "14",
      "typeOrgane": "GP",
      "dateDebut": "2014-05-01T02:00:00.000+02:00",
      "dateFin": "2014-05-04T02:00:00.000+02:00",
      "preseance": "28",
      "nominPrincipale": "1",
      "infosQualite": {
        "codeQualite": "Député non-inscrit",
        "libQualite": "Député non-inscrit",
        "libQualiteSex": "Député non-inscrit"
      },
      "organesRefs": [
        "PO645633"
      ]
    },
    {
      "uid": "PM701065",
      "acteurRef": "PA328",
      "legislature": "14",
      "typeOrgane": "GP",
      "dateDebut": "2014-05-05T02:00:00.000+02:00",
      "datePublication": "2014-05-06T02:00:00.000+02:00",
      "dateFin": "2016-03-11T01:00:00.000+01:00",
      "preseance": "20",
      "nominPrincipale": "1",
      "infosQualite": {
        "codeQualite": "Membre",
        "libQualite": "Membre du",
        "libQualiteSex": "Membre du"
      },
      "organesRefs": [
        "PO656002"
      ]
    },
    {
      "uid": "PM701085",
      "acteurRef": "PA328",
      "legislature": "14",
      "typeOrgane": "COMPER",
      "dateDebut": "2014-05-06T02:00:00.000+02:00",
      "datePublication": "2014-05-06T02:00:00.000+02:00",
      "dateFin": "2016-03-11T01:00:00.000+01:00",
      "preseance": "32",
      "nominPrincipale": "1",
      "infosQualite": {
        "codeQualite": "Membre",
        "libQualite": "Membre",
        "libQualiteSex": "Membre"
      },
      "organesRefs": [
        "PO59047"
      ]
    },
    {
      "uid": "PM704518",
      "acteurRef": "PA328",
      "legislature": "14",
      "typeOrgane": "GA",
      "dateDebut": "2014-11-05T01:00:00.000+01:00",
      "dateFin": "2016-03-11T01:00:00.000+01:00",
      "preseance": "20",
      "nominPrincipale": "1",
      "infosQualite": {
        "codeQualite": "Membre",
        "libQualite": "Membre",
        "libQualiteSex": "Membre"
      },
      "organesRefs": [
        "PO675835"
      ]
    },
    {
      "uid": "PM705071",
      "acteurRef": "PA328",
      "typeOrgane": "PARPOL",
      "dateDebut": "2014-12-01T01:00:00.000+01:00",
      "dateFin": "2016-03-11T01:00:00.000+01:00",
      "preseance": "5",
      "nominPrincipale": "1",
      "infosQualite": {
        "codeQualite": "Membre",
        "libQualite": "Membre",
        "libQualiteSex": "Membre"
      },
      "organesRefs": [
        "PO684932"
      ]
    },
    {
      "uid": "PM709145",
      "acteurRef": "PA328",
      "legislature": "14",
      "typeOrgane": "ORGEXTPARL",
      "dateDebut": "2014-11-13T01:00:00.000+01:00",
      "datePublication": "2014-11-13T01:00:00.000+01:00",
      "dateFin": "2016-03-11T01:00:00.000+01:00",
      "preseance": "20",
      "nominPrincipale": "1",
      "infosQualite": {
        "codeQualite": "Titulaire",
        "libQualite": "Membre titulaire",
        "libQualiteSex": "Membre titulaire"
      },
      "organesRefs": [
        "PO427757"
      ]
    },
    {
      "uid": "PM711554",
      "acteurRef": "PA328",
      "typeOrgane": "MINISTERE",
      "dateDebut": "2016-02-12T01:00:00.000+01:00",
      "datePublication": "2016-02-12T01:00:00.000+01:00",
      "dateFin": "2016-12-06T01:00:00.000+01:00",
      "preseance": "30",
      "nominPrincipale": "1",
      "infosQualite": {
        "codeQualite": "Ministre",
        "libQualite": "Ministre",
        "libQualiteSex": "Ministre"
      },
      "organesRefs": [
        "PO711552"
      ]
    },
    {
      "uid": "PM715800",
      "acteurRef": "PA328",
      "typeOrgane": "MINISTERE",
      "dateDebut": "2016-12-07T01:00:00.000+01:00",
      "datePublication": "2016-12-07T01:00:00.000+01:00",
      "dateFin": "2017-05-17T02:00:00.000+02:00",
      "preseance": "30",
      "nominPrincipale": "1",
      "infosQualite": {
        "codeQualite": "Ministre",
        "libQualite": "Ministre",
        "libQualiteSex": "Ministre"
      },
      "organesRefs": [
        "PO715798"
      ]
    },
    {
      "uid": "PM15590014",
      "acteurRef": "PA328",
      "typeOrgane": "GOUVERNEMENT",
      "dateDebut": "2012-05-16T02:00:00.000+02:00",
      "datePublication": "2012-05-16T02:00:00.000+02:00",
      "dateFin": "2012-06-18T02:00:00.000+02:00",
      "preseance": "50",
      "nominPrincipale": "1",
      "infosQualite": {
        "codeQualite": "membre",
        "libQualite": "membre",
        "libQualiteSex": "membre"
      },
      "organesRefs": [
        "PO590011"
      ]
    },
    {
      "uid": "PM15653228",
      "acteurRef": "PA328",
      "typeOrgane": "GOUVERNEMENT",
      "dateDebut": "2012-06-19T02:00:00.000+02:00",
      "datePublication": "2012-06-19T02:00:00.000+02:00",
      "dateFin": "2014-03-31T02:00:00.000+02:00",
      "preseance": "50",
      "nominPrincipale": "1",
      "infosQualite": {
        "codeQualite": "membre",
        "libQualite": "membre",
        "libQualiteSex": "membre"
      },
      "organesRefs": [
        "PO653199"
      ]
    },
    {
      "uid": "PM15711554",
      "acteurRef": "PA328",
      "typeOrgane": "GOUVERNEMENT",
      "dateDebut": "2016-02-12T01:00:00.000+01:00",
      "datePublication": "2016-02-12T01:00:00.000+01:00",
      "dateFin": "2016-12-06T01:00:00.000+01:00",
      "preseance": "50",
      "nominPrincipale": "1",
      "infosQualite": {
        "codeQualite": "membre",
        "libQualite": "membre",
        "libQualiteSex": "membre"
      },
      "organesRefs": [
        "PO702883"
      ]
    },
    {
      "uid": "PM15715800",
      "acteurRef": "PA328",
      "typeOrgane": "GOUVERNEMENT",
      "dateDebut": "2016-12-07T01:00:00.000+01:00",
      "datePublication": "2016-12-07T01:00:00.000+01:00",
      "dateFin": "2017-05-17T02:00:00.000+02:00",
      "preseance": "50",
      "nominPrincipale": "1",
      "infosQualite": {
        "codeQualite": "membre",
        "libQualite": "membre",
        "libQualiteSex": "membre"
      },
      "organesRefs": [
        "PO715793"
      ]
    }
  ]
}