{
  "uid": "PA643069",
  "etatCivil": {
    "ident": {
      "civ": "M.",
      "prenom": "Christophe",
      "nom": "Premat",
      "alpha": "Premat"
    },
    "infoNaissance": {
      "dateNais": "1976-12-07T01:00:00.000+01:00",
      "villeNais": "Annecy",
      "depNais": "Haute-Savoie",
      "paysNais": "France"
    }
  },
  "profession": {
    "libelleCourant": "Enseignant-chercheur",
    "socProcInsee": {
      "catSocPro": "Cadres de la fonction publique, professions intellectuelles et  artistiques",
      "famSocPro": "Cadres et professions intellectuelles supérieures"
    }
  },
  "adresses": [
    {
      "xsiType": "AdressePostale_Type",
      "uid": "AD701239",
      "type": "0",
      "typeLibelle": "Adresse officielle",
      "poids": "1",
      "intitule": "Assemblée nationale",
      "numeroRue": "126",
      "nomRue": "Rue de l'Université",
      "codePostal": "75355",
      "ville": "Paris 07 SP"
    },
    {
      "xsiType": "AdresseMail_Type",
      "uid": "AD701308",
      "type": "15",
      "typeLibelle": "Mèl",
      "valElec": "cpremat@assemblee-nationale.fr"
    },
    {
      "xsiType": "AdresseSiteWeb_Type",
      "uid": "AD701692",
      "type": "22",
      "typeLibelle": "Site internet",
      "valElec": "www.christophepremat.com"
    }
  ],
  "mandats": [
    {
      "uid": "PM701218",
      "acteurRef": "PA643069",
      "legislature": "14",
      "typeOrgane": "ASSEMBLEE",
      "dateDebut": "2012-06-20T02:00:00.000+02:00",
      "dateFin": "2017-03-27T02:00:00.000+02:00",
      "preseance": "50",
      "nominPrincipale": "1",
      "infosQualite": {
        "codeQualite": "membre",
        "libQualite": "membre",
        "libQualiteSex": "membre"
      },
      "organesRefs": [
        "PO644420"
      ],
      "election": {
        "lieu": {
          "region": "Français établis hors de France",
          "regionType": "Français établis hors de France",
          "departement": "Français établis hors de France",
          "numDepartement": "099",
          "numCirco": "3"
        },
        "causeMandat": "remplacement d'un député nommé au Gouvernement",
        "refCirconscription": "PO645022"
      },
      "mandature": {
        "datePriseFonction": "2014-05-10T02:00:00.000+02:00",
        "causeFin": "Reprise de l'exercice du mandat d'un ancien membre du Gouvernement",
        "premiereElection": "0"
      }
    },
    {
      "uid": "PM701225",
      "acteurRef": "PA643069",
      "legislature": "14",
      "typeOrgane": "GP",
      "dateDebut": "2014-05-10T02:00:00.000+02:00",
      "datePublication": "2014-05-11T02:00:00.000+02:00",
      "dateFin": "2016-05-24T02:00:00.000+02:00",
      "preseance": "20",
      "nominPrincipale": "1",
      "infosQualite": {
        "codeQualite": "Membre",
        "libQualite": "Membre du",
        "libQualiteSex": "Membre du"
      },
      "organesRefs": [
        "PO656002"
      ]
    },
    {
      "uid": "PM701317",
      "acteurRef": "PA643069",
      "legislature": "14",
      "typeOrgane": "COMPER",
      "dateDebut": "2014-05-15T02:00:00.000+02:00",
      "datePublication": "2014-05-15T02:00:00.000+02:00",
      "dateFin": "2015-03-04T01:00:00.000+01:00",
      "preseance": "32",
      "nominPrincipale": "1",
      "infosQualite": {
        "codeQualite": "Membre",
        "libQualite": "Membre",
        "libQualiteSex": "Membre"
      },
      "organesRefs": [
        "PO419604"
      ]
    },
    {
      "uid": "PM701380",
      "acteurRef": "PA643069",
      "legislature": "14",
      "typeOrgane": "GA",
      "dateDebut": "2014-05-16T02:00:00.000+02:00",
      "dateFin": "2017-03-27T02:00:00.000+02:00",
      "preseance": "20",
      "nominPrincipale": "1",
      "infosQualite": {
        "codeQualite": "Membre",
        "libQualite": "Membre",
        "libQualiteSex": "Membre"
      },
      "organesRefs": [
        "PO675852"
      ]
    },
    {
      "uid": "PM701938",
      "acteurRef": "PA643069",
      "legislature": "14",
      "typeOrgane": "CNPE",
      "dateDebut": "2014-06-23T02:00:00.000+02:00",
      "datePublication": "2014-06-24T02:00:00.000+02:00",
      "dateFin": "2014-10-30T01:00:00.000+01:00",
      "preseance": "20",
      "nominPrincipale": "1",
      "infosQualite": {
        "codeQualite": "Membre",
        "libQualite": "Membre",
        "libQualiteSex": "Membre"
      },
      "organesRefs": [
        "PO700816"
      ]
    },
    {
      "uid": "PM701960",
      "acteurRef": "PA643069",
      "legislature": "14",
      "typeOrgane": "GA",
      "dateDebut": "2014-06-24T02:00:00.000+02:00",
      "dateFin": "2017-03-27T02:00:00.000+02:00",
      "preseance": "20",
      "nominPrincipale": "1",
      "infosQualite": {
        "codeQualite": "Membre",
        "libQualite": "Membre",
        "libQualiteSex": "Membre"
      },
      "organesRefs": [
        "PO675788"
      ]
    },
    {
      "uid": "PM702077",
      "acteurRef": "PA643069",
      "legislature": "14",
      "typeOrgane": "GA",
      "dateDebut": "2014-07-01T02:00:00.000+02:00",
      "dateFin": "2017-03-27T02:00:00.000+02:00",
      "preseance": "20",
      "nominPrincipale": "1",
      "infosQualite": {
        "codeQualite": "Membre",
        "libQualite": "Membre",
        "libQualiteSex": "Membre"
      },
      "organesRefs": [
        "PO675809"
      ]
    },
    {
      "uid": "PM702096",
      "acteurRef": "PA643069",
      "legislature": "14",
      "typeOrgane": "GA",
      "dateDebut": "2014-07-01T02:00:00.000+02:00",
      "dateFin": "2017-03-27T02:00:00.000+02:00",
      "preseance": "20",
      "nominPrincipale": "1",
      "infosQualite": {
        "codeQualite": "Membre",
        "libQualite": "Membre",
        "libQualiteSex": "Membre"
      },
      "organesRefs": [
        "PO675725"
      ]
    },
    {
      "uid": "PM702111",
      "acteurRef": "PA643069",
      "legislature": "14",
      "typeOrgane": "GA",
      "dateDebut": "2014-07-02T02:00:00.000+02:00",
      "dateFin": "2017-03-27T02:00:00.000+02:00",
      "preseance": "20",
      "nominPrincipale": "1",
      "infosQualite": {
        "codeQualite": "Membre",
        "libQualite": "Membre",
        "libQualiteSex": "Membre"
      },
      "organesRefs": [
        "PO675846"
      ]
    },
    {
      "uid": "PM702322",
      "acteurRef": "PA643069",
      "legislature": "14",
      "typeOrgane": "GA",
      "dateDebut": "2014-07-07T02:00:00.000+02:00",
      "dateFin": "2017-03-27T02:00:00.000+02:00",
      "preseance": "20",
      "nominPrincipale": "1",
      "infosQualite": {
        "codeQualite": "Membre",
        "libQualite": "Membre",
        "libQualiteSex": "Membre"
      },
      "organesRefs": [
        "PO675765"
      ]
    },
    {
      "uid": "PM702775",
      "acteurRef": "PA643069",
      "legislature": "14",
      "typeOrgane": "GE",
      "dateDebut": "2014-07-23T02:00:00.000+02:00",
      "dateFin": "2017-03-27T02:00:00.000+02:00",
      "preseance": "20",
      "nominPrincipale": "1",
      "infosQualite": {
        "codeQualite": "Membre",
        "libQualite": "Membre",
        "libQualiteSex": "Membre"
      },
      "organesRefs": [
        "PO702209"
      ]
    },
    {
      "uid": "PM702801",
      "acteurRef": "PA643069",
      "legislature": "14",
      "typeOrgane": "GE",
      "dateDebut": "2014-07-25T02:00:00.000+02:00",
      "dateFin": "2017-03-27T02:00:00.000+02:00",
      "preseance": "20",
      "nominPrincipale": "1",
      "infosQualite": {
        "codeQualite": "Membre",
        "libQualite": "Membre",
        "libQualiteSex": "Membre"
      },
      "organesRefs": [
        "PO686605"
      ]
    },
    {
      "uid": "PM702849",
      "acteurRef": "PA643069",
      "legislature": "14",
      "typeOrgane": "GE",
      "dateDebut": "2014-08-05T02:00:00.000+02:00",
      "dateFin": "2017-03-27T02:00:00.000+02:00",
      "preseance": "20",
      "nominPrincipale": "1",
      "infosQualite": {
        "codeQualite": "Membre",
        "libQualite": "Membre",
        "libQualiteSex": "Membre"
      },
      "organesRefs": [
        "PO686758"
      ]
    },
    {
      "uid": "PM703208",
      "acteurRef": "PA643069",
      "legislature": "14",
      "typeOrgane": "GA",
      "dateDebut": "2014-09-18T02:00:00.000+02:00",
      "dateFin": "2017-03-27T02:00:00.000+02:00",
      "preseance": "20",
      "nominPrincipale": "1",
      "infosQualite": {
        "codeQualite": "Membre",
        "libQualite": "Membre",
        "libQualiteSex": "Membre"
      },
      "organesRefs": [
        "PO675739"
      ]
    },
    {
      "uid": "PM705052",
      "acteurRef": "PA643069",
      "legislature": "14",
      "typeOrgane": "GE",
      "dateDebut": "2014-11-03T01:00:00.000+01:00",
      "dateFin": "2017-03-27T02:00:00.000+02:00",
      "preseance": "20",
      "nominPrincipale": "1",
      "infosQualite": {
        "codeQualite": "Membre",
        "libQualite": "Membre",
        "libQualiteSex": "Membre"
      },
      "organesRefs": [
        "PO686826"
      ]
    },
    {
      "uid": "PM705088",
      "acteurRef": "PA643069",
      "typeOrgane": "PARPOL",
      "dateDebut": "2014-12-01T01:00:00.000+01:00",
      "dateFin": "2017-06-20T02:00:00.000+02:00",
      "preseance": "5",
      "nominPrincipale": "1",
      "infosQualite": {
        "codeQualite": "Membre",
        "libQualite": "Membre",
        "libQualiteSex": "Membre"
      },
      "organesRefs": [
        "PO684932"
      ]
    },
    {
      "uid": "PM705996",
      "acteurRef": "PA643069",
      "legislature": "14",
      "typeOrgane": "GE",
      "dateDebut": "2015-01-27T01:00:00.000+01:00",
      "dateFin": "2017-03-27T02:00:00.000+02:00",
      "preseance": "20",
      "nominPrincipale": "1",
      "infosQualite": {
        "codeQualite": "Membre",
        "libQualite": "Membre",
        "libQualiteSex": "Membre"
      },
      "organesRefs": [
        "PO705526"
      ]
    },
    {
      "uid": "PM706445",
      "acteurRef": "PA643069",
      "legislature": "14",
      "typeOrgane": "COMPER",
      "dateDebut": "2015-03-05T01:00:00.000+01:00",
      "datePublication": "2015-03-05T01:00:00.000+01:00",
      "dateFin": "2015-04-01T02:00:00.000+02:00",
      "preseance": "32",
      "nominPrincipale": "1",
      "infosQualite": {
        "codeQualite": "Membre",
        "libQualite": "Membre",
        "libQualiteSex": "Membre"
      },
      "organesRefs": [
        "PO59048"
      ]
    },
    {
      "uid": "PM706465",
      "acteurRef": "PA643069",
      "legislature": "14",
      "typeOrgane": "GA",
      "dateDebut": "2015-03-06T01:00:00.000+01:00",
      "dateFin": "2017-03-27T02:00:00.000+02:00",
      "preseance": "20",
      "nominPrincipale": "1",
      "infosQualite": {
        "codeQualite": "Membre",
        "libQualite": "Membre",
        "libQualiteSex": "Membre"
      },
      "organesRefs": [
        "PO675703"
      ]
    },
    {
      "uid": "PM707166",
      "acteurRef": "PA643069",
      "legislature": "14",
      "typeOrgane": "COMPER",
      "dateDebut": "2015-04-02T02:00:00.000+02:00",
      "datePublication": "2015-04-02T02:00:00.000+02:00",
      "dateFin": "2017-03-27T02:00:00.000+02:00",
      "preseance": "32",
      "nominPrincipale": "1",
      "infosQualite": {
        "codeQualite": "Membre",
        "libQualite": "Membre",
        "libQualiteSex": "Membre"
      },
      "organesRefs": [
        "PO419604"
      ]
    },
    {
      "uid": "PM707223",
      "acteurRef": "PA643069",
      "legislature": "14",
      "typeOrgane": "ORGEXTPARL",
      "dateDebut": "2014-07-10T02:00:00.000+02:00",
      "datePublication": "2014-07-10T02:00:00.000+02:00",
      "dateFin": "2017-03-27T02:00:00.000+02:00",
      "preseance": "20",
      "nominPrincipale": "1",
      "infosQualite": {
        "codeQualite": "Titulaire",
        "libQualite": "Membre titulaire",
        "libQualiteSex": "Membre titulaire"
      },
      "organesRefs": [
        "PO60255"
      ]
    },
    {
      "uid": "PM707420",
      "acteurRef": "PA643069",
      "legislature": "14",
      "typeOrgane": "MISINFO",
      "dateDebut": "2014-12-17T01:00:00.000+01:00",
      "dateFin": "2015-07-08T02:00:00.000+02:00",
      "preseance": "10",
      "nominPrincipale": "1",
      "infosQualite": {
        "codeQualite": "Membre",
        "libQualite": "Membre",
        "libQualiteSex": "Membre"
      },
      "organesRefs": [
        "PO707403"
      ]
    },
    {
      "uid": "PM710072",
      "acteurRef": "PA643069",
      "legislature": "14",
      "typeOrgane": "CMP",
      "dateDebut": "2015-11-12T01:00:00.000+01:00",
      "datePublication": "2015-11-13T01:00:00.000+01:00",
      "dateFin": "2015-11-19T01:00:00.000+01:00",
      "preseance": "28",
      "nominPrincipale": "1",
      "infosQualite": {
        "codeQualite": "Suppléant",
        "libQualite": "Membre suppléant",
        "libQualiteSex": "Membre suppléant"
      },
      "organesRefs": [
        "PO709717"
      ]
    },
    {
      "uid": "PM711231",
      "acteurRef": "PA643069",
      "legislature": "14",
      "typeOrgane": "MISINFO",
      "dateDebut": "2016-01-20T01:00:00.000+01:00",
      "dateFin": "2016-10-05T02:00:00.000+02:00",
      "preseance": "10",
      "nominPrincipale": "1",
      "infosQualite": {
        "codeQualite": "Membre",
        "libQualite": "Membre",
        "libQualiteSex": "Membre"
      },
      "organesRefs": [
        "PO711218"
      ]
    },
    {
      "uid": "PM712375",
      "acteurRef": "PA643069",
      "legislature": "14",
      "typeOrgane": "GE",
      "dateDebut": "2016-04-13T02:00:00.000+02:00",
      "dateFin": "2017-03-27T02:00:00.000+02:00",
      "preseance": "20",
      "nominPrincipale": "1",
      "infosQualite": {
        "codeQualite": "Membre",
        "libQualite": "Membre",
        "libQualiteSex": "Membre"
      },
      "organesRefs": [
        "PO712100"
      ]
    },
    {
      "uid": "PM712993",
      "acteurRef": "PA643069",
      "legislature": "14",
      "typeOrgane": "CNPE",
      "dateDebut": "2016-05-19T02:00:00.000+02:00",
      "datePublication": "2016-05-20T02:00:00.000+02:00",
      "dateFin": "2016-10-12T02:00:00.000+02:00",
      "preseance": "20",
      "nominPrincipale": "1",
      "infosQualite": {
        "codeQualite": "Membre",
        "libQualite": "Membre",
        "libQualiteSex": "Membre"
      },
      "organesRefs": [
        "PO712743"
      ]
    },
    {
      "uid": "PM713315",
      "acteurRef": "PA643069",
      "legislature": "14",
      "typeOrgane": "GP",
      "dateDebut": "2016-05-25T02:00:00.000+02:00",
      "dateFin": "2017-03-27T02:00:00.000+02:00",
      "preseance": "20",
      "nominPrincipale": "1",
      "infosQualite": {
        "codeQualite": "Membre",
        "libQualite": "Membre du",
        "libQualiteSex": "Membre du"
      },
      "organesRefs": [
        "PO713077"
      ]
    },
    {
      "uid": "PM713530",
      "acteurRef": "PA643069",
      "legislature": "14",
      "typeOrgane": "GE",
      "dateDebut": "2016-05-31T02:00:00.000+02:00",
      "dateFin": "2017-03-27T02:00:00.000+02:00",
      "preseance": "20",
      "nominPrincipale": "1",
      "infosQualite": {
        "codeQualite": "Membre",
        "libQualite": "Membre",
        "libQualiteSex": "Membre"
      },
      "organesRefs": [
        "PO712794"
      ]
    },
    {
      "uid": "PM713858",
      "acteurRef": "PA643069",
      "legislature": "14",
      "typeOrgane": "CNPE",
      "dateDebut": "2016-06-17T02:00:00.000+02:00",
      "datePublication": "2016-06-18T02:00:00.000+02:00",
      "dateFin": "2016-12-20T01:00:00.000+01:00",
      "preseance": "20",
      "nominPrincipale": "1",
      "infosQualite": {
        "codeQualite": "Membre",
        "libQualite": "Membre",
        "libQualiteSex": "Membre"
      },
      "organesRefs": [
        "PO713684"
      ]
    },
    {
      "uid": "PM713889",
      "acteurRef": "PA643069",
      "legislature": "14",
      "typeOrgane": "DELEG",
      "dateDebut": "2016-06-22T02:00:00.000+02:00",
      "datePublication": "2016-06-22T02:00:00.000+02:00",
      "dateFin": "2017-03-27T02:00:00.000+02:00",
      "preseance": "20",
      "nominPrincipale": "1",
      "infosQualite": {
        "codeQualite": "Membre",
        "libQualite": "Membre",
        "libQualiteSex": "Membre"
      },
      "organesRefs": [
        "PO201269"
      ]
    },
    {
      "uid": "PM713906",
      "acteurRef": "PA643069",
      "legislature": "14",
      "typeOrgane": "CNPE",
      "dateDebut": "2016-06-21T02:00:00.000+02:00",
      "datePublication": "2016-06-22T02:00:00.000+02:00",
      "dateFin": "2016-12-20T01:00:00.000+01:00",
      "preseance": "14",
      "nominPrincipale": "1",
      "infosQualite": {
        "codeQualite": "Secrétaire",
        "libQualite": "Secrétaire",
        "libQualiteSex": "Secrétaire"
      },
      "organesRefs": [
        "PO713684"
      ]
    },
    {
      "uid": "PM714441",
      "acteurRef": "PA643069",
      "legislature": "14",
      "typeOrgane": "MISINFOPRE",
      "dateDebut": "2016-07-13T02:00:00.000+02:00",
      "datePublication": "2016-07-14T02:00:00.000+02:00",
      "dateFin": "2017-02-20T01:00:00.000+01:00",
      "preseance": "20",
      "nominPrincipale": "1",
      "infosQualite": {
        "codeQualite": "Membre",
        "libQualite": "Membre",
        "libQualiteSex": "Membre"
      },
      "organesRefs": [
        "PO714079"
      ]
    },
    {
      "uid": "PM714485",
      "acteurRef": "PA643069",
      "legislature": "14",
      "typeOrgane": "MISINFOPRE",
      "dateDebut": "2016-07-19T02:00:00.000+02:00",
      "datePublication": "2016-07-20T02:00:00.000+02:00",
      "dateFin": "2017-02-20T01:00:00.000+01:00",
      "preseance": "20",
      "nominPrincipale": "1",
      "infosQualite": {
        "codeQualite": "Membre",
        "libQualite": "Membre",
        "libQualiteSex": "Membre"
      },
      "organesRefs": [
        "PO714449"
      ]
    }
  ]
}