{
  "uid": "PA605143",
  "etatCivil": {
    "ident": {
      "civ": "Mme",
      "prenom": "Karine",
      "nom": "Berger",
      "alpha": "Berger"
    },
    "infoNaissance": {
      "dateNais": "1973-03-11T01:00:00.000+01:00",
      "villeNais": "Limoges",
      "depNais": "Haute-Vienne",
      "paysNais": "France"
    }
  },
  "profession": {
    "libelleCourant": "Cadre supérieur du secteur privé",
    "socProcInsee": {
      "catSocPro": "Cadres d'entreprise",
      "famSocPro": "Cadres et professions intellectuelles supérieures"
    }
  },
  "adresses": [
    {
      "xsiType": "AdresseMail_Type",
      "uid": "AD648517",
      "type": "15",
      "typeLibelle": "Mèl",
      "valElec": "kberger@assemblee-nationale.fr"
    },
    {
      "xsiType": "AdressePostale_Type",
      "uid": "AD653177",
      "type": "0",
      "typeLibelle": "Adresse officielle",
      "poids": "1",
      "intitule": "Assemblée nationale,",
      "numeroRue": "126",
      "nomRue": "Rue de l'Université,",
      "codePostal": "75355",
      "ville": "PARIS 07 SP"
    },
    {
      "xsiType": "AdresseMail_Type",
      "uid": "AD653178",
      "type": "15",
      "typeLibelle": "Mèl",
      "valElec": "karine.berger@m4x.org"
    }
  ],
  "mandats": [
    {
      "uid": "PM645423",
      "acteurRef": "PA605143",
      "legislature": "14",
      "typeOrgane": "ASSEMBLEE",
      "dateDebut": "2012-06-20T02:00:00.000+02:00",
      "dateFin": "2017-06-20T02:00:00.000+02:00",
      "preseance": "50",
      "nominPrincipale": "1",
      "infosQualite": {
        "codeQualite": "membre",
        "libQualite": "membre",
        "libQualiteSex": "membre"
      },
      "organesRefs": [
        "PO644420"
      ],
      "suppleant": {
        "dateDebut": "2012-06-20T02:00:00.000+02:00",
        "dateFin": "2017-06-20T02:00:00.000+02:00",
        "suppleantRef": "PA642652"
      },
      "election": {
        "lieu": {
          "region": "Provence-Alpes-Côte d'Azur",
          "regionType": "Métropolitain",
          "departement": "Hautes-Alpes",
          "numDepartement": "05",
          "numCirco": "1"
        },
        "causeMandat": "élections générales",
        "refCirconscription": "PO644436"
      },
      "mandature": {
        "datePriseFonction": "2012-06-20T02:00:00.000+02:00",
        "causeFin": "Fin de législature",
        "premiereElection": "0"
      }
    },
    {
      "uid": "PM656050",
      "acteurRef": "PA605143",
      "legislature": "14",
      "typeOrgane": "GP",
      "dateDebut": "2012-06-26T02:00:00.000+02:00",
      "datePublication": "2012-06-27T02:00:00.000+02:00",
      "dateFin": "2016-05-24T02:00:00.000+02:00",
      "preseance": "20",
      "nominPrincipale": "1",
      "infosQualite": {
        "codeQualite": "Membre",
        "libQualite": "Membre du",
        "libQualiteSex": "Membre du"
      },
      "organesRefs": [
        "PO656002"
      ]
    },
    {
      "uid": "PM657284",
      "acteurRef": "PA605143",
      "legislature": "14",
      "typeOrgane": "COMPER",
      "dateDebut": "2012-06-28T02:00:00.000+02:00",
      "datePublication": "2012-06-28T02:00:00.000+02:00",
      "dateFin": "2017-06-20T02:00:00.000+02:00",
      "preseance": "32",
      "nominPrincipale": "1",
      "infosQualite": {
        "codeQualite": "Membre",
        "libQualite": "Membre",
        "libQualiteSex": "Membre"
      },
      "organesRefs": [
        "PO59048"
      ]
    },
    {
      "uid": "PM677810",
      "acteurRef": "PA605143",
      "legislature": "14",
      "typeOrgane": "ORGEXTPARL",
      "dateDebut": "2012-09-03T02:00:00.000+02:00",
      "datePublication": "2012-09-04T02:00:00.000+02:00",
      "dateFin": "2017-06-20T02:00:00.000+02:00",
      "preseance": "20",
      "nominPrincipale": "1",
      "infosQualite": {
        "codeQualite": "Titulaire",
        "libQualite": "Membre titulaire",
        "libQualiteSex": "Membre titulaire"
      },
      "organesRefs": [
        "PO60215"
      ]
    },
    {
      "uid": "PM682435",
      "acteurRef": "PA605143",
      "legislature": "14",
      "typeOrgane": "GA",
      "dateDebut": "2012-10-17T02:00:00.000+02:00",
      "dateFin": "2017-06-20T02:00:00.000+02:00",
      "preseance": "20",
      "nominPrincipale": "1",
      "infosQualite": {
        "codeQualite": "Membre",
        "libQualite": "Membre",
        "libQualiteSex": "Membre"
      },
      "organesRefs": [
        "PO675835"
      ]
    },
    {
      "uid": "PM682436",
      "acteurRef": "PA605143",
      "legislature": "14",
      "typeOrgane": "GA",
      "dateDebut": "2012-10-17T02:00:00.000+02:00",
      "dateFin": "2017-06-20T02:00:00.000+02:00",
      "preseance": "20",
      "nominPrincipale": "1",
      "infosQualite": {
        "codeQualite": "Membre",
        "libQualite": "Membre",
        "libQualiteSex": "Membre"
      },
      "organesRefs": [
        "PO675704"
      ]
    },
    {
      "uid": "PM682437",
      "acteurRef": "PA605143",
      "legislature": "14",
      "typeOrgane": "GA",
      "dateDebut": "2012-10-17T02:00:00.000+02:00",
      "dateFin": "2017-06-20T02:00:00.000+02:00",
      "preseance": "20",
      "nominPrincipale": "1",
      "infosQualite": {
        "codeQualite": "Membre",
        "libQualite": "Membre",
        "libQualiteSex": "Membre"
      },
      "organesRefs": [
        "PO675762"
      ]
    },
    {
      "uid": "PM683931",
      "acteurRef": "PA605143",
      "legislature": "14",
      "typeOrgane": "CMP",
      "dateDebut": "2012-11-06T01:00:00.000+01:00",
      "datePublication": "2012-11-07T01:00:00.000+01:00",
      "dateFin": "2012-11-09T01:00:00.000+01:00",
      "preseance": "28",
      "nominPrincipale": "1",
      "infosQualite": {
        "codeQualite": "Suppléant",
        "libQualite": "Membre suppléant",
        "libQualiteSex": "Membre suppléante"
      },
      "organesRefs": [
        "PO683757"
      ]
    },
    {
      "uid": "PM683960",
      "acteurRef": "PA605143",
      "legislature": "14",
      "typeOrgane": "GA",
      "dateDebut": "2012-11-06T01:00:00.000+01:00",
      "dateFin": "2017-06-20T02:00:00.000+02:00",
      "preseance": "8",
      "nominPrincipale": "1",
      "infosQualite": {
        "codeQualite": "Vice-Président",
        "libQualite": "Vice-Président",
        "libQualiteSex": "Vice-Présidente"
      },
      "organesRefs": [
        "PO675704"
      ]
    },
    {
      "uid": "PM685276",
      "acteurRef": "PA605143",
      "legislature": "14",
      "typeOrgane": "CMP",
      "dateDebut": "2012-12-04T01:00:00.000+01:00",
      "datePublication": "2012-12-05T01:00:00.000+01:00",
      "dateFin": "2012-12-19T01:00:00.000+01:00",
      "preseance": "20",
      "nominPrincipale": "1",
      "infosQualite": {
        "codeQualite": "Titulaire",
        "libQualite": "Membre titulaire",
        "libQualiteSex": "Membre titulaire"
      },
      "organesRefs": [
        "PO684249"
      ]
    },
    {
      "uid": "PM685306",
      "acteurRef": "PA605143",
      "legislature": "14",
      "typeOrgane": "CMP",
      "dateDebut": "2012-12-04T01:00:00.000+01:00",
      "datePublication": "2012-12-05T01:00:00.000+01:00",
      "dateFin": "2012-12-19T01:00:00.000+01:00",
      "preseance": "20",
      "nominPrincipale": "1",
      "infosQualite": {
        "codeQualite": "Titulaire",
        "libQualite": "Membre titulaire",
        "libQualiteSex": "Membre titulaire"
      },
      "organesRefs": [
        "PO685148"
      ]
    },
    {
      "uid": "PM685647",
      "acteurRef": "PA605143",
      "typeOrgane": "PARPOL",
      "dateDebut": "2012-12-01T01:00:00.000+01:00",
      "dateFin": "2017-06-20T02:00:00.000+02:00",
      "preseance": "5",
      "nominPrincipale": "1",
      "infosQualite": {
        "codeQualite": "Membre",
        "libQualite": "Membre",
        "libQualiteSex": "Membre"
      },
      "organesRefs": [
        "PO684932"
      ]
    },
    {
      "uid": "PM687641",
      "acteurRef": "PA605143",
      "legislature": "14",
      "typeOrgane": "GE",
      "dateDebut": "2013-01-10T01:00:00.000+01:00",
      "dateFin": "2017-06-20T02:00:00.000+02:00",
      "preseance": "20",
      "nominPrincipale": "1",
      "infosQualite": {
        "codeQualite": "Membre",
        "libQualite": "Membre",
        "libQualiteSex": "Membre"
      },
      "organesRefs": [
        "PO686397"
      ]
    },
    {
      "uid": "PM690005",
      "acteurRef": "PA605143",
      "legislature": "14",
      "typeOrgane": "GE",
      "dateDebut": "2013-02-01T01:00:00.000+01:00",
      "dateFin": "2017-06-20T02:00:00.000+02:00",
      "preseance": "20",
      "nominPrincipale": "1",
      "infosQualite": {
        "codeQualite": "Membre",
        "libQualite": "Membre",
        "libQualiteSex": "Membre"
      },
      "organesRefs": [
        "PO686617"
      ]
    },
    {
      "uid": "PM693233",
      "acteurRef": "PA605143",
      "legislature": "14",
      "typeOrgane": "MINISTERE",
      "dateDebut": "2012-10-09T02:00:00.000+02:00",
      "datePublication": "2012-10-10T02:00:00.000+02:00",
      "dateFin": "2013-04-08T02:00:00.000+02:00",
      "preseance": "1",
      "nominPrincipale": "1",
      "infosQualite": {
        "codeQualite": "en mission",
        "libQualite": "en mission",
        "libQualiteSex": "en mission"
      },
      "organesRefs": [
        "PO653293",
        "PO692867"
      ],
      "libelle": "Réforme de la fiscalité de l'épargne"
    },
    {
      "uid": "PM693904",
      "acteurRef": "PA605143",
      "legislature": "14",
      "typeOrgane": "GE",
      "dateDebut": "2013-04-17T02:00:00.000+02:00",
      "dateFin": "2017-06-20T02:00:00.000+02:00",
      "preseance": "20",
      "nominPrincipale": "1",
      "infosQualite": {
        "codeQualite": "Membre",
        "libQualite": "Membre",
        "libQualiteSex": "Membre"
      },
      "organesRefs": [
        "PO692271"
      ]
    },
    {
      "uid": "PM694334",
      "acteurRef": "PA605143",
      "legislature": "14",
      "typeOrgane": "GE",
      "dateDebut": "2013-04-24T02:00:00.000+02:00",
      "dateFin": "2017-06-20T02:00:00.000+02:00",
      "preseance": "20",
      "nominPrincipale": "1",
      "infosQualite": {
        "codeQualite": "Membre",
        "libQualite": "Membre",
        "libQualiteSex": "Membre"
      },
      "organesRefs": [
        "PO689012"
      ]
    },
    {
      "uid": "PM695754",
      "acteurRef": "PA605143",
      "legislature": "14",
      "typeOrgane": "CMP",
      "dateDebut": "2013-07-03T02:00:00.000+02:00",
      "datePublication": "2013-07-04T02:00:00.000+02:00",
      "dateFin": "2013-07-18T02:00:00.000+02:00",
      "preseance": "20",
      "nominPrincipale": "1",
      "infosQualite": {
        "codeQualite": "Titulaire",
        "libQualite": "Membre titulaire",
        "libQualiteSex": "Membre titulaire"
      },
      "organesRefs": [
        "PO695634"
      ]
    },
    {
      "uid": "PM695805",
      "acteurRef": "PA605143",
      "legislature": "14",
      "typeOrgane": "GA",
      "dateDebut": "2013-07-04T02:00:00.000+02:00",
      "dateFin": "2017-06-20T02:00:00.000+02:00",
      "preseance": "20",
      "nominPrincipale": "1",
      "infosQualite": {
        "codeQualite": "Membre",
        "libQualite": "Membre",
        "libQualiteSex": "Membre"
      },
      "organesRefs": [
        "PO675766"
      ]
    },
    {
      "uid": "PM695963",
      "acteurRef": "PA605143",
      "legislature": "14",
      "typeOrgane": "CMP",
      "dateDebut": "2013-07-11T02:00:00.000+02:00",
      "datePublication": "2013-07-12T02:00:00.000+02:00",
      "dateFin": "2013-07-18T02:00:00.000+02:00",
      "preseance": "16",
      "nominPrincipale": "1",
      "infosQualite": {
        "codeQualite": "Rapporteur",
        "libQualite": "Rapporteur",
        "libQualiteSex": "Rapporteure"
      },
      "organesRefs": [
        "PO695634"
      ]
    },
    {
      "uid": "PM697655",
      "acteurRef": "PA605143",
      "legislature": "14",
      "typeOrgane": "GE",
      "dateDebut": "2013-10-09T02:00:00.000+02:00",
      "dateFin": "2017-06-20T02:00:00.000+02:00",
      "preseance": "20",
      "nominPrincipale": "1",
      "infosQualite": {
        "codeQualite": "Membre",
        "libQualite": "Membre",
        "libQualiteSex": "Membre"
      },
      "organesRefs": [
        "PO695599"
      ]
    },
    {
      "uid": "PM705427",
      "acteurRef": "PA605143",
      "legislature": "14",
      "typeOrgane": "CNPS",
      "dateDebut": "2014-12-13T01:00:00.000+01:00",
      "datePublication": "2014-12-13T01:00:00.000+01:00",
      "dateFin": "2015-06-05T02:00:00.000+02:00",
      "preseance": "20",
      "nominPrincipale": "1",
      "infosQualite": {
        "codeQualite": "Membre",
        "libQualite": "Membre",
        "libQualiteSex": "Membre"
      },
      "organesRefs": [
        "PO704848"
      ]
    },
    {
      "uid": "PM707472",
      "acteurRef": "PA605143",
      "legislature": "14",
      "typeOrgane": "MISINFO",
      "dateDebut": "2014-10-01T02:00:00.000+02:00",
      "dateFin": "2017-06-20T02:00:00.000+02:00",
      "preseance": "10",
      "nominPrincipale": "1",
      "infosQualite": {
        "codeQualite": "Membre",
        "libQualite": "Membre",
        "libQualiteSex": "Membre"
      },
      "organesRefs": [
        "PO707458"
      ]
    },
    {
      "uid": "PM711738",
      "acteurRef": "PA605143",
      "legislature": "14",
      "typeOrgane": "MISINFOCOM",
      "dateDebut": "2016-01-27T01:00:00.000+01:00",
      "dateFin": "2016-10-05T02:00:00.000+02:00",
      "preseance": "20",
      "nominPrincipale": "1",
      "infosQualite": {
        "codeQualite": "Membre",
        "libQualite": "Membre",
        "libQualiteSex": "Membre"
      },
      "organesRefs": [
        "PO711732"
      ]
    },
    {
      "uid": "PM711746",
      "acteurRef": "PA605143",
      "legislature": "14",
      "typeOrgane": "MISINFOCOM",
      "dateDebut": "2016-03-02T01:00:00.000+01:00",
      "dateFin": "2016-10-05T02:00:00.000+02:00",
      "preseance": "16",
      "nominPrincipale": "1",
      "infosQualite": {
        "codeQualite": "Rapporteur",
        "libQualite": "Rapporteur",
        "libQualiteSex": "Rapporteure"
      },
      "organesRefs": [
        "PO711732"
      ]
    },
    {
      "uid": "PM713111",
      "acteurRef": "PA605143",
      "legislature": "14",
      "typeOrgane": "GP",
      "dateDebut": "2016-05-25T02:00:00.000+02:00",
      "dateFin": "2017-06-20T02:00:00.000+02:00",
      "preseance": "20",
      "nominPrincipale": "1",
      "infosQualite": {
        "codeQualite": "Membre",
        "libQualite": "Membre du",
        "libQualiteSex": "Membre du"
      },
      "organesRefs": [
        "PO713077"
      ]
    }
  ]
}