{
  "uid": "PO717325",
  "codeType": "ORGEXTPARL",
  "libelle": "Comité de bassin Artois-Picardie",
  "libelleAbrege": "Comité bassin Artois-Picardie",
  "libelleAbrev": "370",
  "viMoDe": {
    "dateDebut": "2016-12-28T01:00:00.000+01:00"
  },
  "regime": "5ème République",
  "regimeJuridique": "Article L. 213-8 du code de l’environnement",
  "siteInternet": "http://www.eaufrance.fr/s-informer/agir-et-participer/participer/concertation/les-comites-de-bassin"
}