{
  "uid": "PA717379",
  "etatCivil": {
    "ident": {
      "civ": "M.",
      "prenom": "Sylvain",
      "nom": "Maillard",
      "alpha": "Maillard",
      "trigramme": "SMA"
    },
    "infoNaissance": {
      "dateNais": "1974-04-28T01:00:00.000+01:00",
      "villeNais": "saint maur des fossés",
      "depNais": "Val-de-Marne",
      "paysNais": "France"
    }
  },
  "profession": {
    "libelleCourant": "Industriel-Chef d'entreprise",
    "socProcInsee": {
      "catSocPro": "Chefs d'entreprise de 10 salariés ou plus",
      "famSocPro": "Artisans, commerçants et chefs d'entreprise"
    }
  },
  "uriHatvp": "https://www.hatvp.fr/pages_nominatives/maillard-sylvain",
  "adresses": [
    {
      "xsiType": "AdressePostale_Type",
      "uid": "AD717381",
      "type": "0",
      "typeLibelle": "Adresse officielle",
      "poids": "1",
      "intitule": "Assemblée nationale,",
      "numeroRue": "126",
      "nomRue": "Rue de l'Université,",
      "codePostal": "75355",
      "ville": "Paris 07 SP"
    },
    {
      "xsiType": "AdresseSiteWeb_Type",
      "uid": "AD717393",
      "type": "22",
      "typeLibelle": "Site internet",
      "valElec": "sylvainmaillard.fr"
    },
    {
      "xsiType": "AdresseSiteWeb_Type",
      "uid": "AD717403",
      "type": "25",
      "typeLibelle": "Facebook",
      "valElec": "sylvainmaillardparis"
    },
    {
      "xsiType": "AdresseSiteWeb_Type",
      "uid": "AD717405",
      "type": "24",
      "typeLibelle": "Twitter",
      "valElec": "@sylvainmaillard"
    },
    {
      "xsiType": "AdresseMail_Type",
      "uid": "AD727962",
      "type": "15",
      "typeLibelle": "Mèl",
      "valElec": "sylvain.maillard@assemblee-nationale.fr"
    },
    {
      "xsiType": "AdresseTelephonique_Type",
      "uid": "AD757763",
      "type": "11",
      "typeLibelle": "Téléphone",
      "poids": "1",
      "adresseDeRattachement": "AD717381",
      "valElec": "01.40.63.90.13"
    }
  ],
  "mandats": [
    {
      "uid": "PM723282",
      "acteurRef": "PA717379",
      "legislature": "15",
      "typeOrgane": "ASSEMBLEE",
      "dateDebut": "2017-06-11T02:00:00.000+02:00",
      "preseance": "50",
      "nominPrincipale": "1",
      "infosQualite": {
        "codeQualite": "membre",
        "libQualite": "membre",
        "libQualiteSex": "membre"
      },
      "organesRefs": [
        "PO717460"
      ],
      "suppleant": {
        "dateDebut": "2017-06-11T02:00:00.000+02:00",
        "suppleantRef": "PA717383"
      },
      "election": {
        "lieu": {
          "region": "Ile-de-France",
          "regionType": "Métropolitain",
          "departement": "Paris",
          "numDepartement": "75",
          "numCirco": "1"
        },
        "causeMandat": "élections générales",
        "refCirconscription": "PO718226"
      },
      "mandature": {
        "datePriseFonction": "2017-06-21T02:00:00.000+02:00",
        "premiereElection": "0",
        "placeHemicycle": "330"
      },
      "collaborateurs": [
        {
          "qualite": "Mme",
          "prenom": "Aude",
          "nom": "Vrillet"
        },
        {
          "qualite": "M.",
          "prenom": "Rodrigo",
          "nom": "Diaz-Romero"
        }
      ]
    },
    {
      "uid": "PM724682",
      "acteurRef": "PA717379",
      "legislature": "15",
      "typeOrgane": "GP",
      "dateDebut": "2017-06-21T02:00:00.000+02:00",
      "dateFin": "2017-06-26T02:00:00.000+02:00",
      "preseance": "28",
      "nominPrincipale": "1",
      "infosQualite": {
        "codeQualite": "Député non-inscrit",
        "libQualite": "Député non-inscrit",
        "libQualiteSex": "Député non-inscrit"
      },
      "organesRefs": [
        "PO723569"
      ]
    },
    {
      "uid": "PM731206",
      "acteurRef": "PA717379",
      "legislature": "15",
      "typeOrgane": "GP",
      "dateDebut": "2017-06-27T02:00:00.000+02:00",
      "datePublication": "2017-06-28T02:00:00.000+02:00",
      "preseance": "20",
      "nominPrincipale": "1",
      "infosQualite": {
        "codeQualite": "Membre",
        "libQualite": "Membre du",
        "libQualiteSex": "Membre du"
      },
      "organesRefs": [
        "PO730964"
      ]
    },
    {
      "uid": "PM732050",
      "acteurRef": "PA717379",
      "legislature": "15",
      "typeOrgane": "COMPER",
      "dateDebut": "2017-06-29T02:00:00.000+02:00",
      "datePublication": "2017-06-29T02:00:00.000+02:00",
      "preseance": "32",
      "nominPrincipale": "1",
      "infosQualite": {
        "codeQualite": "Membre",
        "libQualite": "Membre",
        "libQualiteSex": "Membre"
      },
      "organesRefs": [
        "PO420120"
      ]
    },
    {
      "uid": "PM737858",
      "acteurRef": "PA717379",
      "legislature": "15",
      "typeOrgane": "GA",
      "dateDebut": "2017-10-05T02:00:00.000+02:00",
      "preseance": "20",
      "nominPrincipale": "0",
      "infosQualite": {
        "codeQualite": "Membre",
        "libQualite": "Membre",
        "libQualiteSex": "Membre"
      },
      "organesRefs": [
        "PO733607"
      ]
    },
    {
      "uid": "PM737907",
      "acteurRef": "PA717379",
      "legislature": "15",
      "typeOrgane": "GA",
      "dateDebut": "2017-10-05T02:00:00.000+02:00",
      "preseance": "20",
      "nominPrincipale": "0",
      "infosQualite": {
        "codeQualite": "Membre",
        "libQualite": "Membre",
        "libQualiteSex": "Membre"
      },
      "organesRefs": [
        "PO733382"
      ]
    },
    {
      "uid": "PM737908",
      "acteurRef": "PA717379",
      "legislature": "15",
      "typeOrgane": "GA",
      "dateDebut": "2017-10-05T02:00:00.000+02:00",
      "preseance": "20",
      "nominPrincipale": "1",
      "infosQualite": {
        "codeQualite": "Membre",
        "libQualite": "Membre",
        "libQualiteSex": "Membre"
      },
      "organesRefs": [
        "PO733517"
      ]
    },
    {
      "uid": "PM741867",
      "acteurRef": "PA717379",
      "legislature": "15",
      "typeOrgane": "GA",
      "dateDebut": "2017-10-26T02:00:00.000+02:00",
      "preseance": "20",
      "nominPrincipale": "1",
      "infosQualite": {
        "codeQualite": "Membre",
        "libQualite": "Membre",
        "libQualiteSex": "Membre"
      },
      "organesRefs": [
        "PO733482"
      ]
    },
    {
      "uid": "PM742473",
      "acteurRef": "PA717379",
      "legislature": "15",
      "typeOrgane": "ORGEXTPARL",
      "dateDebut": "2017-11-02T01:00:00.000+01:00",
      "datePublication": "2017-11-03T01:00:00.000+01:00",
      "preseance": "20",
      "nominPrincipale": "1",
      "infosQualite": {
        "codeQualite": "Titulaire",
        "libQualite": "Membre titulaire",
        "libQualiteSex": "Membre titulaire"
      },
      "organesRefs": [
        "PO709169"
      ]
    },
    {
      "uid": "PM744564",
      "acteurRef": "PA717379",
      "legislature": "15",
      "typeOrgane": "CMP",
      "dateDebut": "2017-11-30T01:00:00.000+01:00",
      "datePublication": "2017-12-01T01:00:00.000+01:00",
      "dateFin": "2017-12-20T01:00:00.000+01:00",
      "preseance": "28",
      "nominPrincipale": "1",
      "infosQualite": {
        "codeQualite": "Suppléant",
        "libQualite": "Membre suppléant",
        "libQualiteSex": "Membre suppléant"
      },
      "organesRefs": [
        "PO739840"
      ]
    },
    {
      "uid": "PM744591",
      "acteurRef": "PA717379",
      "legislature": "15",
      "typeOrgane": "CMP",
      "dateDebut": "2017-11-30T01:00:00.000+01:00",
      "datePublication": "2017-12-01T01:00:00.000+01:00",
      "dateFin": "2018-02-15T01:00:00.000+01:00",
      "preseance": "28",
      "nominPrincipale": "1",
      "infosQualite": {
        "codeQualite": "Suppléant",
        "libQualite": "Membre suppléant",
        "libQualiteSex": "Membre suppléant"
      },
      "organesRefs": [
        "PO739847"
      ]
    },
    {
      "uid": "PM745235",
      "acteurRef": "PA717379",
      "typeOrgane": "PARPOL",
      "dateDebut": "2017-12-01T01:00:00.000+01:00",
      "preseance": "5",
      "nominPrincipale": "1",
      "infosQualite": {
        "codeQualite": "Membre",
        "libQualite": "Membre",
        "libQualiteSex": "Membre"
      },
      "organesRefs": [
        "PO744854"
      ]
    },
    {
      "uid": "PM747769",
      "acteurRef": "PA717379",
      "legislature": "15",
      "typeOrgane": "GA",
      "dateDebut": "2017-10-25T02:00:00.000+02:00",
      "preseance": "8",
      "nominPrincipale": "1",
      "infosQualite": {
        "codeQualite": "Vice-Président",
        "libQualite": "Vice-Président",
        "libQualiteSex": "Vice-Président"
      },
      "organesRefs": [
        "PO733607"
      ]
    },
    {
      "uid": "PM748467",
      "acteurRef": "PA717379",
      "legislature": "15",
      "typeOrgane": "GE",
      "dateDebut": "2018-02-01T01:00:00.000+01:00",
      "preseance": "20",
      "nominPrincipale": "0",
      "infosQualite": {
        "codeQualite": "Membre",
        "libQualite": "Membre",
        "libQualiteSex": "Membre"
      },
      "organesRefs": [
        "PO746629"
      ]
    },
    {
      "uid": "PM748468",
      "acteurRef": "PA717379",
      "legislature": "15",
      "typeOrgane": "GE",
      "dateDebut": "2018-02-01T01:00:00.000+01:00",
      "preseance": "1",
      "nominPrincipale": "1",
      "infosQualite": {
        "codeQualite": "Président",
        "libQualite": "Président",
        "libQualiteSex": "Président"
      },
      "organesRefs": [
        "PO746629"
      ]
    },
    {
      "uid": "PM750112",
      "acteurRef": "PA717379",
      "legislature": "15",
      "typeOrgane": "GE",
      "dateDebut": "2018-02-14T01:00:00.000+01:00",
      "preseance": "20",
      "nominPrincipale": "1",
      "infosQualite": {
        "codeQualite": "Membre",
        "libQualite": "Membre",
        "libQualiteSex": "Membre"
      },
      "organesRefs": [
        "PO747215"
      ]
    },
    {
      "uid": "PM750314",
      "acteurRef": "PA717379",
      "legislature": "15",
      "typeOrgane": "GE",
      "dateDebut": "2018-02-14T01:00:00.000+01:00",
      "preseance": "20",
      "nominPrincipale": "1",
      "infosQualite": {
        "codeQualite": "Membre",
        "libQualite": "Membre",
        "libQualiteSex": "Membre"
      },
      "organesRefs": [
        "PO746982"
      ]
    },
    {
      "uid": "PM750606",
      "acteurRef": "PA717379",
      "legislature": "15",
      "typeOrgane": "GE",
      "dateDebut": "2018-02-12T01:00:00.000+01:00",
      "preseance": "20",
      "nominPrincipale": "1",
      "infosQualite": {
        "codeQualite": "Membre",
        "libQualite": "Membre",
        "libQualiteSex": "Membre"
      },
      "organesRefs": [
        "PO746857"
      ]
    },
    {
      "uid": "PM750647",
      "acteurRef": "PA717379",
      "legislature": "15",
      "typeOrgane": "GE",
      "dateDebut": "2018-02-15T01:00:00.000+01:00",
      "preseance": "20",
      "nominPrincipale": "1",
      "infosQualite": {
        "codeQualite": "Membre",
        "libQualite": "Membre",
        "libQualiteSex": "Membre"
      },
      "organesRefs": [
        "PO747200"
      ]
    },
    {
      "uid": "PM751517",
      "acteurRef": "PA717379",
      "legislature": "15",
      "typeOrgane": "GE",
      "dateDebut": "2018-02-21T01:00:00.000+01:00",
      "preseance": "20",
      "nominPrincipale": "1",
      "infosQualite": {
        "codeQualite": "Membre",
        "libQualite": "Membre",
        "libQualiteSex": "Membre"
      },
      "organesRefs": [
        "PO746837"
      ]
    },
    {
      "uid": "PM751732",
      "acteurRef": "PA717379",
      "legislature": "15",
      "typeOrgane": "GE",
      "dateDebut": "2018-02-22T01:00:00.000+01:00",
      "preseance": "20",
      "nominPrincipale": "1",
      "infosQualite": {
        "codeQualite": "Membre",
        "libQualite": "Membre",
        "libQualiteSex": "Membre"
      },
      "organesRefs": [
        "PO746679"
      ]
    },
    {
      "uid": "PM752490",
      "acteurRef": "PA717379",
      "legislature": "15",
      "typeOrgane": "GE",
      "dateDebut": "2018-03-06T01:00:00.000+01:00",
      "preseance": "20",
      "nominPrincipale": "1",
      "infosQualite": {
        "codeQualite": "Membre",
        "libQualite": "Membre",
        "libQualiteSex": "Membre"
      },
      "organesRefs": [
        "PO746987"
      ]
    },
    {
      "uid": "PM752733",
      "acteurRef": "PA717379",
      "legislature": "15",
      "typeOrgane": "GE",
      "dateDebut": "2018-03-06T01:00:00.000+01:00",
      "preseance": "20",
      "nominPrincipale": "1",
      "infosQualite": {
        "codeQualite": "Membre",
        "libQualite": "Membre",
        "libQualiteSex": "Membre"
      },
      "organesRefs": [
        "PO747220"
      ]
    },
    {
      "uid": "PM753087",
      "acteurRef": "PA717379",
      "legislature": "15",
      "typeOrgane": "GE",
      "dateDebut": "2018-03-08T01:00:00.000+01:00",
      "preseance": "20",
      "nominPrincipale": "1",
      "infosQualite": {
        "codeQualite": "Membre",
        "libQualite": "Membre",
        "libQualiteSex": "Membre"
      },
      "organesRefs": [
        "PO746669"
      ]
    },
    {
      "uid": "PM758024",
      "acteurRef": "PA717379",
      "legislature": "15",
      "typeOrgane": "CMP",
      "dateDebut": "2018-07-12T02:00:00.000+02:00",
      "datePublication": "2018-07-14T02:00:00.000+02:00",
      "dateFin": "2018-08-01T02:00:00.000+02:00",
      "preseance": "28",
      "nominPrincipale": "1",
      "infosQualite": {
        "codeQualite": "Suppléant",
        "libQualite": "Membre suppléant",
        "libQualiteSex": "Membre suppléant"
      },
      "organesRefs": [
        "PO757975"
      ]
    },
    {
      "uid": "PM758813",
      "acteurRef": "PA717379",
      "legislature": "15",
      "typeOrgane": "GA",
      "dateDebut": "2017-10-31T01:00:00.000+01:00",
      "preseance": "8",
      "nominPrincipale": "1",
      "infosQualite": {
        "codeQualite": "Vice-Président",
        "libQualite": "Vice-Président",
        "libQualiteSex": "Vice-Président"
      },
      "organesRefs": [
        "PO733382"
      ]
    },
    {
      "uid": "PM760250",
      "acteurRef": "PA717379",
      "legislature": "15",
      "typeOrgane": "CNPS",
      "dateDebut": "2018-11-13T01:00:00.000+01:00",
      "datePublication": "2018-11-14T01:00:00.000+01:00",
      "preseance": "20",
      "nominPrincipale": "1",
      "infosQualite": {
        "codeQualite": "Membre",
        "libQualite": "Membre",
        "libQualiteSex": "Membre"
      },
      "organesRefs": [
        "PO760148"
      ]
    }
  ]
}