{
  "uid": "PO739530",
  "codeType": "CMP",
  "libelle": "Commission mixte paritaire chargée de proposer un texte sur les dispositions restant en discussion du projet de loi ratifiant les ordonnances n° 2016-1058 du 3 août 2016 relative à la modification des règles applicables à l'évaluation environnementale des projets, plans et programmes et n° 2016-1060 du 3 août 2016 portant réforme des procédures destinées à l'information et la participation du public à l'élaboration de certaines décisions susceptibles d'avoir une incidence sur l'environnement",
  "libelleEdition": "de la commission mixte paritaire chargée de proposer un texte sur les dispositions restant en discussion du projet de loi ratifiant les ordonnances n° 2016-1058 du 3 août 2016 relative à la modification des règles applicables à l'évaluation environnementale des projets, plans et programmes et n° 2016-1060 du 3 août 2016 portant réforme des procédures destinées à l'information et la participation du public à l'élaboration de certaines décisions susceptibles d'avoir une incidence sur l'environnement",
  "libelleAbrege": "Évaluation environnementale",
  "libelleAbrev": "11",
  "viMoDe": {
    "dateDebut": "2017-10-12T02:00:00.000+02:00",
    "dateFin": "2018-02-15T01:00:00.000+01:00"
  },
  "regime": "5ème République",
  "legislature": "15",
  "secretariat": {}
}