{
  "uid": "PO760826",
  "codeType": "CMP",
  "libelle": "Commission mixte paritaire chargée de proposer un texte commun sur le projet de loi de finances pour 2019",
  "libelleEdition": "de la commission mixte paritaire chargée de proposer un texte commun sur le projet de loi de finances pour 2019",
  "libelleAbrege": "Projet de loi de finances pour 2019",
  "libelleAbrev": "1255",
  "viMoDe": {
    "dateDebut": "2018-12-06T01:00:00.000+01:00"
  },
  "regime": "5ème République",
  "legislature": "15",
  "secretariat": {}
}