{
  "uid": "PO665150",
  "codeType": "DELEGBUREAU",
  "libelle": "Délégation chargée de la communication et de la presse",
  "libelleEdition": "de la délégation chargée de la communication et de la presse",
  "libelleAbrege": "Communication et presse",
  "libelleAbrev": "COM",
  "viMoDe": {
    "dateDebut": "2012-06-20T02:00:00.000+02:00",
    "dateFin": "2017-06-20T02:00:00.000+02:00"
  },
  "regime": "5ème République",
  "legislature": "14",
  "secretariat": {}
}