{
  "uid": "PA267706",
  "etatCivil": {
    "ident": {
      "civ": "Mme",
      "prenom": "Nathalie",
      "nom": "Appéré",
      "alpha": "Appere"
    },
    "infoNaissance": {
      "dateNais": "1975-07-08T01:00:00.000+01:00",
      "villeNais": "Ploemeur",
      "depNais": "Morbihan",
      "paysNais": "France"
    }
  },
  "profession": {
    "libelleCourant": "Directrice d'équipement social et culturel",
    "socProcInsee": {
      "catSocPro": "Cadres de la fonction publique, professions intellectuelles et  artistiques",
      "famSocPro": "Cadres et professions intellectuelles supérieures"
    }
  },
  "adresses": [
    {
      "xsiType": "AdresseMail_Type",
      "uid": "AD648492",
      "type": "15",
      "typeLibelle": "Mèl",
      "valElec": "nappere@assemblee-nationale.fr"
    },
    {
      "xsiType": "AdressePostale_Type",
      "uid": "AD650638",
      "type": "0",
      "typeLibelle": "Adresse officielle",
      "poids": "1",
      "intitule": "Assemblée nationale",
      "numeroRue": "126",
      "nomRue": "Rue de l'Université",
      "codePostal": "75355",
      "ville": "Paris 07 SP"
    },
    {
      "xsiType": "AdresseMail_Type",
      "uid": "AD650643",
      "type": "15",
      "typeLibelle": "Mèl",
      "valElec": "deputee@nathalieappere.fr"
    }
  ],
  "mandats": [
    {
      "uid": "PM645529",
      "acteurRef": "PA267706",
      "legislature": "14",
      "typeOrgane": "ASSEMBLEE",
      "dateDebut": "2012-06-20T02:00:00.000+02:00",
      "dateFin": "2017-06-20T02:00:00.000+02:00",
      "preseance": "50",
      "nominPrincipale": "1",
      "infosQualite": {
        "codeQualite": "membre",
        "libQualite": "membre",
        "libQualiteSex": "membre"
      },
      "organesRefs": [
        "PO644420"
      ],
      "suppleant": {
        "dateDebut": "2012-06-20T02:00:00.000+02:00",
        "dateFin": "2017-06-20T02:00:00.000+02:00",
        "suppleantRef": "PA642777"
      },
      "election": {
        "lieu": {
          "region": "Bretagne",
          "regionType": "Métropolitain",
          "departement": "Ille-et-Vilaine",
          "numDepartement": "35",
          "numCirco": "2"
        },
        "causeMandat": "élections générales",
        "refCirconscription": "PO644583"
      },
      "mandature": {
        "datePriseFonction": "2012-06-20T02:00:00.000+02:00",
        "causeFin": "Fin de législature",
        "premiereElection": "0"
      }
    },
    {
      "uid": "PM656032",
      "acteurRef": "PA267706",
      "legislature": "14",
      "typeOrgane": "GP",
      "dateDebut": "2012-06-26T02:00:00.000+02:00",
      "datePublication": "2012-06-27T02:00:00.000+02:00",
      "dateFin": "2016-05-24T02:00:00.000+02:00",
      "preseance": "20",
      "nominPrincipale": "1",
      "infosQualite": {
        "codeQualite": "Membre",
        "libQualite": "Membre du",
        "libQualiteSex": "Membre du"
      },
      "organesRefs": [
        "PO656002"
      ]
    },
    {
      "uid": "PM657393",
      "acteurRef": "PA267706",
      "legislature": "14",
      "typeOrgane": "COMPER",
      "dateDebut": "2012-06-28T02:00:00.000+02:00",
      "datePublication": "2012-06-28T02:00:00.000+02:00",
      "dateFin": "2017-06-20T02:00:00.000+02:00",
      "preseance": "32",
      "nominPrincipale": "1",
      "infosQualite": {
        "codeQualite": "Membre",
        "libQualite": "Membre",
        "libQualiteSex": "Membre"
      },
      "organesRefs": [
        "PO59051"
      ]
    },
    {
      "uid": "PM677842",
      "acteurRef": "PA267706",
      "legislature": "14",
      "typeOrgane": "ORGEXTPARL",
      "dateDebut": "2012-09-03T02:00:00.000+02:00",
      "datePublication": "2012-09-04T02:00:00.000+02:00",
      "dateFin": "2014-02-17T01:00:00.000+01:00",
      "preseance": "20",
      "nominPrincipale": "1",
      "infosQualite": {
        "codeQualite": "Titulaire",
        "libQualite": "Membre titulaire",
        "libQualiteSex": "Membre titulaire"
      },
      "organesRefs": [
        "PO394834"
      ]
    },
    {
      "uid": "PM683266",
      "acteurRef": "PA267706",
      "legislature": "14",
      "typeOrgane": "GA",
      "dateDebut": "2012-10-23T02:00:00.000+02:00",
      "dateFin": "2017-06-20T02:00:00.000+02:00",
      "preseance": "20",
      "nominPrincipale": "1",
      "infosQualite": {
        "codeQualite": "Membre",
        "libQualite": "Membre",
        "libQualiteSex": "Membre"
      },
      "organesRefs": [
        "PO675714"
      ]
    },
    {
      "uid": "PM683267",
      "acteurRef": "PA267706",
      "legislature": "14",
      "typeOrgane": "GA",
      "dateDebut": "2012-10-23T02:00:00.000+02:00",
      "dateFin": "2017-06-20T02:00:00.000+02:00",
      "preseance": "20",
      "nominPrincipale": "1",
      "infosQualite": {
        "codeQualite": "Membre",
        "libQualite": "Membre",
        "libQualiteSex": "Membre"
      },
      "organesRefs": [
        "PO675711"
      ]
    },
    {
      "uid": "PM685625",
      "acteurRef": "PA267706",
      "typeOrgane": "PARPOL",
      "dateDebut": "2012-12-01T01:00:00.000+01:00",
      "dateFin": "2017-06-20T02:00:00.000+02:00",
      "preseance": "5",
      "nominPrincipale": "1",
      "infosQualite": {
        "codeQualite": "Membre",
        "libQualite": "Membre",
        "libQualiteSex": "Membre"
      },
      "organesRefs": [
        "PO684932"
      ]
    },
    {
      "uid": "PM687399",
      "acteurRef": "PA267706",
      "legislature": "14",
      "typeOrgane": "GE",
      "dateDebut": "2012-12-19T01:00:00.000+01:00",
      "dateFin": "2017-06-20T02:00:00.000+02:00",
      "preseance": "20",
      "nominPrincipale": "0",
      "infosQualite": {
        "codeQualite": "Membre",
        "libQualite": "Membre",
        "libQualiteSex": "Membre"
      },
      "organesRefs": [
        "PO687392"
      ]
    },
    {
      "uid": "PM687401",
      "acteurRef": "PA267706",
      "legislature": "14",
      "typeOrgane": "GE",
      "dateDebut": "2012-12-19T01:00:00.000+01:00",
      "dateFin": "2017-06-20T02:00:00.000+02:00",
      "preseance": "4",
      "nominPrincipale": "1",
      "infosQualite": {
        "codeQualite": "Co-Président",
        "libQualite": "Co-Président",
        "libQualiteSex": "Co-Présidente"
      },
      "organesRefs": [
        "PO687392"
      ]
    },
    {
      "uid": "PM691176",
      "acteurRef": "PA267706",
      "legislature": "14",
      "typeOrgane": "GE",
      "dateDebut": "2013-01-17T01:00:00.000+01:00",
      "dateFin": "2017-06-20T02:00:00.000+02:00",
      "preseance": "20",
      "nominPrincipale": "1",
      "infosQualite": {
        "codeQualite": "Membre",
        "libQualite": "Membre",
        "libQualiteSex": "Membre"
      },
      "organesRefs": [
        "PO687381"
      ]
    },
    {
      "uid": "PM707654",
      "acteurRef": "PA267706",
      "legislature": "14",
      "typeOrgane": "GE",
      "dateDebut": "2015-05-06T02:00:00.000+02:00",
      "dateFin": "2017-06-20T02:00:00.000+02:00",
      "preseance": "20",
      "nominPrincipale": "1",
      "infosQualite": {
        "codeQualite": "Membre",
        "libQualite": "Membre",
        "libQualiteSex": "Membre"
      },
      "organesRefs": [
        "PO705534"
      ]
    },
    {
      "uid": "PM708880",
      "acteurRef": "PA267706",
      "legislature": "14",
      "typeOrgane": "CMP",
      "dateDebut": "2015-07-08T02:00:00.000+02:00",
      "datePublication": "2015-07-09T02:00:00.000+02:00",
      "dateFin": "2015-07-10T02:00:00.000+02:00",
      "preseance": "20",
      "nominPrincipale": "1",
      "infosQualite": {
        "codeQualite": "Titulaire",
        "libQualite": "Membre titulaire",
        "libQualiteSex": "Membre titulaire"
      },
      "organesRefs": [
        "PO708847"
      ]
    },
    {
      "uid": "PM709142",
      "acteurRef": "PA267706",
      "legislature": "14",
      "typeOrgane": "ORGEXTPARL",
      "dateDebut": "2015-06-03T02:00:00.000+02:00",
      "datePublication": "2015-06-04T02:00:00.000+02:00",
      "dateFin": "2017-06-20T02:00:00.000+02:00",
      "preseance": "20",
      "nominPrincipale": "1",
      "infosQualite": {
        "codeQualite": "Titulaire",
        "libQualite": "Membre titulaire",
        "libQualiteSex": "Membre titulaire"
      },
      "organesRefs": [
        "PO422826"
      ]
    },
    {
      "uid": "PM709146",
      "acteurRef": "PA267706",
      "legislature": "14",
      "typeOrgane": "ORGEXTPARL",
      "dateDebut": "2014-10-28T01:00:00.000+01:00",
      "datePublication": "2014-10-28T01:00:00.000+01:00",
      "dateFin": "2017-06-20T02:00:00.000+02:00",
      "preseance": "20",
      "nominPrincipale": "1",
      "infosQualite": {
        "codeQualite": "Titulaire",
        "libQualite": "Membre titulaire",
        "libQualiteSex": "Membre titulaire"
      },
      "organesRefs": [
        "PO430925"
      ]
    },
    {
      "uid": "PM712701",
      "acteurRef": "PA267706",
      "legislature": "14",
      "typeOrgane": "CNPS",
      "dateDebut": "2016-05-05T02:00:00.000+02:00",
      "datePublication": "2016-05-05T02:00:00.000+02:00",
      "dateFin": "2017-02-20T01:00:00.000+01:00",
      "preseance": "20",
      "nominPrincipale": "1",
      "infosQualite": {
        "codeQualite": "Membre",
        "libQualite": "Membre",
        "libQualiteSex": "Membre"
      },
      "organesRefs": [
        "PO712376"
      ]
    },
    {
      "uid": "PM713088",
      "acteurRef": "PA267706",
      "legislature": "14",
      "typeOrgane": "GP",
      "dateDebut": "2016-05-25T02:00:00.000+02:00",
      "dateFin": "2017-06-20T02:00:00.000+02:00",
      "preseance": "20",
      "nominPrincipale": "1",
      "infosQualite": {
        "codeQualite": "Membre",
        "libQualite": "Membre du",
        "libQualiteSex": "Membre du"
      },
      "organesRefs": [
        "PO713077"
      ]
    }
  ]
}