{
  "uid": "PO653252",
  "codeType": "MINISTERE",
  "libelle": "Ministère des affaires sociales et de la santé",
  "libelleEdition": "des affaires sociales et de la santé",
  "libelleAbrege": "Affaires sociales et santé",
  "libelleAbrev": "ASO",
  "viMoDe": {
    "dateDebut": "2012-06-22T02:00:00.000+02:00",
    "dateFin": "2014-03-31T02:00:00.000+02:00"
  },
  "organeParentRef": "PO653199"
}