{
  "uid": "PO758785",
  "codeType": "MINISTERE",
  "libelle": "Ministère des sports",
  "libelleEdition": "des sports",
  "libelleAbrege": "Sports",
  "libelleAbrev": "SPO",
  "viMoDe": {
    "dateDebut": "2018-09-05T02:00:00.000+02:00"
  },
  "organeParentRef": "PO725688"
}