{
  "uid": "PA608741",
  "etatCivil": {
    "ident": {
      "civ": "Mme",
      "prenom": "Sylvie",
      "nom": "Tolmont",
      "alpha": "Tolmont",
      "trigramme": "STL"
    },
    "infoNaissance": {
      "dateNais": "1962-10-09T01:00:00.000+01:00",
      "villeNais": "Le Mans",
      "depNais": "Sarthe",
      "paysNais": "France"
    }
  },
  "profession": {
    "libelleCourant": "Cadre de la fonction publique consulaire",
    "socProcInsee": {
      "catSocPro": "Cadres de la fonction publique, professions intellectuelles et  artistiques",
      "famSocPro": "Cadres et professions intellectuelles supérieures"
    }
  },
  "uriHatvp": "https://www.hatvp.fr/pages_nominatives/tolmont-sylvie",
  "adresses": [
    {
      "xsiType": "AdressePostale_Type",
      "uid": "AD676833",
      "type": "0",
      "typeLibelle": "Adresse officielle",
      "poids": "1",
      "intitule": "Assemblée nationale",
      "numeroRue": "126",
      "nomRue": "Rue de l'Université",
      "codePostal": "75355",
      "ville": "Paris 07 SP"
    },
    {
      "xsiType": "AdressePostale_Type",
      "uid": "AD676834",
      "type": "2",
      "typeLibelle": "Adresse publiée de circonscription",
      "poids": "22",
      "intitule": "Permanence parlementaire",
      "numeroRue": "73",
      "nomRue": "Boulevard Carnot",
      "codePostal": "72000",
      "ville": "Le Mans"
    },
    {
      "xsiType": "AdresseMail_Type",
      "uid": "AD677303",
      "type": "15",
      "typeLibelle": "Mèl",
      "valElec": "sylvie.tolmont@assemblee-nationale.fr"
    },
    {
      "xsiType": "AdresseTelephonique_Type",
      "uid": "AD757991",
      "type": "11",
      "typeLibelle": "Téléphone",
      "poids": "22",
      "adresseDeRattachement": "AD676834",
      "valElec": "02.43.24.69.08"
    },
    {
      "xsiType": "AdresseSiteWeb_Type",
      "uid": "AD757993",
      "type": "25",
      "typeLibelle": "Facebook",
      "valElec": "Deputee.Sylvie.Tolmont"
    },
    {
      "xsiType": "AdresseSiteWeb_Type",
      "uid": "AD757995",
      "type": "24",
      "typeLibelle": "Twitter",
      "valElec": "SylvieTolmont"
    },
    {
      "xsiType": "AdresseSiteWeb_Type",
      "uid": "AD757997",
      "type": "22",
      "typeLibelle": "Site internet",
      "valElec": "www.sylvietolmont.fr/"
    }
  ],
  "mandats": [
    {
      "uid": "PM676810",
      "acteurRef": "PA608741",
      "legislature": "14",
      "typeOrgane": "ASSEMBLEE",
      "dateDebut": "2012-06-20T02:00:00.000+02:00",
      "dateFin": "2017-06-17T02:00:00.000+02:00",
      "preseance": "50",
      "nominPrincipale": "1",
      "infosQualite": {
        "codeQualite": "membre",
        "libQualite": "membre",
        "libQualiteSex": "membre"
      },
      "organesRefs": [
        "PO644420"
      ],
      "election": {
        "lieu": {
          "region": "Pays de la Loire",
          "regionType": "Métropolitain",
          "departement": "Sarthe",
          "numDepartement": "72",
          "numCirco": "4"
        },
        "causeMandat": "remplacement d'un député nommé au Gouvernement",
        "refCirconscription": "PO644806"
      },
      "mandature": {
        "datePriseFonction": "2012-07-22T02:00:00.000+02:00",
        "causeFin": "Reprise de l'exercice du mandat d'un ancien membre du Gouvernement",
        "premiereElection": "0",
        "placeHemicycle": "577"
      }
    },
    {
      "uid": "PM676907",
      "acteurRef": "PA608741",
      "legislature": "14",
      "typeOrgane": "GP",
      "dateDebut": "2012-07-22T02:00:00.000+02:00",
      "dateFin": "2012-07-23T02:00:00.000+02:00",
      "preseance": "28",
      "nominPrincipale": "1",
      "infosQualite": {
        "codeQualite": "Député non-inscrit",
        "libQualite": "Député non-inscrit",
        "libQualiteSex": "Députée non-inscrite"
      },
      "organesRefs": [
        "PO645633"
      ]
    },
    {
      "uid": "PM676923",
      "acteurRef": "PA608741",
      "legislature": "14",
      "typeOrgane": "GP",
      "dateDebut": "2012-07-23T02:00:00.000+02:00",
      "datePublication": "2012-07-24T02:00:00.000+02:00",
      "dateFin": "2016-05-24T02:00:00.000+02:00",
      "preseance": "20",
      "nominPrincipale": "1",
      "infosQualite": {
        "codeQualite": "Membre",
        "libQualite": "Membre du",
        "libQualiteSex": "Membre du"
      },
      "organesRefs": [
        "PO656002"
      ]
    },
    {
      "uid": "PM677266",
      "acteurRef": "PA608741",
      "legislature": "14",
      "typeOrgane": "COMPER",
      "dateDebut": "2012-07-25T02:00:00.000+02:00",
      "datePublication": "2012-07-25T02:00:00.000+02:00",
      "dateFin": "2016-07-12T02:00:00.000+02:00",
      "preseance": "32",
      "nominPrincipale": "1",
      "infosQualite": {
        "codeQualite": "Membre",
        "libQualite": "Membre",
        "libQualiteSex": "Membre"
      },
      "organesRefs": [
        "PO419604"
      ]
    },
    {
      "uid": "PM680012",
      "acteurRef": "PA608741",
      "legislature": "14",
      "typeOrgane": "GA",
      "dateDebut": "2012-10-12T02:00:00.000+02:00",
      "dateFin": "2017-06-17T02:00:00.000+02:00",
      "preseance": "20",
      "nominPrincipale": "1",
      "infosQualite": {
        "codeQualite": "Membre",
        "libQualite": "Membre",
        "libQualiteSex": "Membre"
      },
      "organesRefs": [
        "PO675709"
      ]
    },
    {
      "uid": "PM680013",
      "acteurRef": "PA608741",
      "legislature": "14",
      "typeOrgane": "GA",
      "dateDebut": "2012-10-12T02:00:00.000+02:00",
      "dateFin": "2017-06-17T02:00:00.000+02:00",
      "preseance": "20",
      "nominPrincipale": "1",
      "infosQualite": {
        "codeQualite": "Membre",
        "libQualite": "Membre",
        "libQualiteSex": "Membre"
      },
      "organesRefs": [
        "PO675809"
      ]
    },
    {
      "uid": "PM684271",
      "acteurRef": "PA608741",
      "legislature": "14",
      "typeOrgane": "GA",
      "dateDebut": "2012-11-08T01:00:00.000+01:00",
      "dateFin": "2017-06-17T02:00:00.000+02:00",
      "preseance": "14",
      "nominPrincipale": "1",
      "infosQualite": {
        "codeQualite": "Secrétaire",
        "libQualite": "Secrétaire",
        "libQualiteSex": "Secrétaire"
      },
      "organesRefs": [
        "PO675809"
      ]
    },
    {
      "uid": "PM684404",
      "acteurRef": "PA608741",
      "legislature": "14",
      "typeOrgane": "GA",
      "dateDebut": "2012-11-14T01:00:00.000+01:00",
      "dateFin": "2017-06-17T02:00:00.000+02:00",
      "preseance": "14",
      "nominPrincipale": "1",
      "infosQualite": {
        "codeQualite": "Secrétaire",
        "libQualite": "Secrétaire",
        "libQualiteSex": "Secrétaire"
      },
      "organesRefs": [
        "PO675709"
      ]
    },
    {
      "uid": "PM686007",
      "acteurRef": "PA608741",
      "typeOrgane": "PARPOL",
      "dateDebut": "2012-12-01T01:00:00.000+01:00",
      "dateFin": "2017-06-20T02:00:00.000+02:00",
      "preseance": "5",
      "nominPrincipale": "1",
      "infosQualite": {
        "codeQualite": "Membre",
        "libQualite": "Membre",
        "libQualiteSex": "Membre"
      },
      "organesRefs": [
        "PO684932"
      ]
    },
    {
      "uid": "PM692017",
      "acteurRef": "PA608741",
      "legislature": "14",
      "typeOrgane": "GE",
      "dateDebut": "2013-02-25T01:00:00.000+01:00",
      "dateFin": "2017-06-17T02:00:00.000+02:00",
      "preseance": "20",
      "nominPrincipale": "1",
      "infosQualite": {
        "codeQualite": "Membre",
        "libQualite": "Membre",
        "libQualiteSex": "Membre"
      },
      "organesRefs": [
        "PO686204"
      ]
    },
    {
      "uid": "PM692626",
      "acteurRef": "PA608741",
      "legislature": "14",
      "typeOrgane": "GE",
      "dateDebut": "2013-02-26T01:00:00.000+01:00",
      "dateFin": "2017-06-17T02:00:00.000+02:00",
      "preseance": "20",
      "nominPrincipale": "1",
      "infosQualite": {
        "codeQualite": "Membre",
        "libQualite": "Membre",
        "libQualiteSex": "Membre"
      },
      "organesRefs": [
        "PO686617"
      ]
    },
    {
      "uid": "PM697955",
      "acteurRef": "PA608741",
      "legislature": "14",
      "typeOrgane": "CNPS",
      "dateDebut": "2013-10-22T02:00:00.000+02:00",
      "datePublication": "2013-10-22T02:00:00.000+02:00",
      "dateFin": "2016-04-14T02:00:00.000+02:00",
      "preseance": "20",
      "nominPrincipale": "1",
      "infosQualite": {
        "codeQualite": "Membre",
        "libQualite": "Membre",
        "libQualiteSex": "Membre"
      },
      "organesRefs": [
        "PO697810"
      ]
    },
    {
      "uid": "PM702153",
      "acteurRef": "PA608741",
      "legislature": "14",
      "typeOrgane": "CNPS",
      "dateDebut": "2014-07-03T02:00:00.000+02:00",
      "datePublication": "2014-07-03T02:00:00.000+02:00",
      "dateFin": "2014-12-19T01:00:00.000+01:00",
      "preseance": "20",
      "nominPrincipale": "1",
      "infosQualite": {
        "codeQualite": "Membre",
        "libQualite": "Membre",
        "libQualiteSex": "Membre"
      },
      "organesRefs": [
        "PO702090"
      ]
    },
    {
      "uid": "PM702525",
      "acteurRef": "PA608741",
      "legislature": "14",
      "typeOrgane": "CMP",
      "dateDebut": "2014-07-16T02:00:00.000+02:00",
      "datePublication": "2014-07-17T02:00:00.000+02:00",
      "dateFin": "2014-07-23T02:00:00.000+02:00",
      "preseance": "28",
      "nominPrincipale": "1",
      "infosQualite": {
        "codeQualite": "Suppléant",
        "libQualite": "Membre suppléant",
        "libQualiteSex": "Membre suppléante"
      },
      "organesRefs": [
        "PO702327"
      ]
    },
    {
      "uid": "PM702826",
      "acteurRef": "PA608741",
      "legislature": "14",
      "typeOrgane": "ORGEXTPARL",
      "dateDebut": "2014-08-01T02:00:00.000+02:00",
      "datePublication": "2014-08-01T02:00:00.000+02:00",
      "dateFin": "2017-06-17T02:00:00.000+02:00",
      "preseance": "20",
      "nominPrincipale": "1",
      "infosQualite": {
        "codeQualite": "Titulaire",
        "libQualite": "Membre titulaire",
        "libQualiteSex": "Membre titulaire"
      },
      "organesRefs": [
        "PO702822"
      ]
    },
    {
      "uid": "PM702835",
      "acteurRef": "PA608741",
      "legislature": "14",
      "typeOrgane": "ORGEXTPARL",
      "dateDebut": "2014-08-01T02:00:00.000+02:00",
      "datePublication": "2014-08-01T02:00:00.000+02:00",
      "dateFin": "2017-06-17T02:00:00.000+02:00",
      "preseance": "20",
      "nominPrincipale": "1",
      "infosQualite": {
        "codeQualite": "Titulaire",
        "libQualite": "Membre titulaire",
        "libQualiteSex": "Membre titulaire"
      },
      "organesRefs": [
        "PO702819"
      ]
    },
    {
      "uid": "PM704473",
      "acteurRef": "PA608741",
      "legislature": "14",
      "typeOrgane": "DELEG",
      "dateDebut": "2014-10-28T01:00:00.000+01:00",
      "datePublication": "2014-10-28T01:00:00.000+01:00",
      "dateFin": "2017-06-17T02:00:00.000+02:00",
      "preseance": "20",
      "nominPrincipale": "1",
      "infosQualite": {
        "codeQualite": "Membre",
        "libQualite": "Membre",
        "libQualiteSex": "Membre"
      },
      "organesRefs": [
        "PO201269"
      ]
    },
    {
      "uid": "PM706003",
      "acteurRef": "PA608741",
      "legislature": "14",
      "typeOrgane": "GE",
      "dateDebut": "2015-01-27T01:00:00.000+01:00",
      "dateFin": "2017-06-17T02:00:00.000+02:00",
      "preseance": "20",
      "nominPrincipale": "1",
      "infosQualite": {
        "codeQualite": "Membre",
        "libQualite": "Membre",
        "libQualiteSex": "Membre"
      },
      "organesRefs": [
        "PO705526"
      ]
    },
    {
      "uid": "PM711236",
      "acteurRef": "PA608741",
      "legislature": "14",
      "typeOrgane": "MISINFO",
      "dateDebut": "2016-01-20T01:00:00.000+01:00",
      "dateFin": "2016-10-05T02:00:00.000+02:00",
      "preseance": "10",
      "nominPrincipale": "1",
      "infosQualite": {
        "codeQualite": "Membre",
        "libQualite": "Membre",
        "libQualiteSex": "Membre"
      },
      "organesRefs": [
        "PO711218"
      ]
    },
    {
      "uid": "PM712730",
      "acteurRef": "PA608741",
      "legislature": "14",
      "typeOrgane": "CNPS",
      "dateDebut": "2016-05-05T02:00:00.000+02:00",
      "datePublication": "2016-05-05T02:00:00.000+02:00",
      "dateFin": "2017-02-20T01:00:00.000+01:00",
      "preseance": "20",
      "nominPrincipale": "1",
      "infosQualite": {
        "codeQualite": "Membre",
        "libQualite": "Membre",
        "libQualiteSex": "Membre"
      },
      "organesRefs": [
        "PO712376"
      ]
    },
    {
      "uid": "PM713345",
      "acteurRef": "PA608741",
      "legislature": "14",
      "typeOrgane": "GP",
      "dateDebut": "2016-05-25T02:00:00.000+02:00",
      "dateFin": "2017-06-17T02:00:00.000+02:00",
      "preseance": "20",
      "nominPrincipale": "1",
      "infosQualite": {
        "codeQualite": "Membre",
        "libQualite": "Membre du",
        "libQualiteSex": "Membre du"
      },
      "organesRefs": [
        "PO713077"
      ]
    },
    {
      "uid": "PM714347",
      "acteurRef": "PA608741",
      "legislature": "14",
      "typeOrgane": "COMPER",
      "dateDebut": "2016-07-13T02:00:00.000+02:00",
      "datePublication": "2016-07-13T02:00:00.000+02:00",
      "dateFin": "2016-07-13T02:00:00.000+02:00",
      "preseance": "32",
      "nominPrincipale": "1",
      "infosQualite": {
        "codeQualite": "Membre",
        "libQualite": "Membre",
        "libQualiteSex": "Membre"
      },
      "organesRefs": [
        "PO419610"
      ]
    },
    {
      "uid": "PM714384",
      "acteurRef": "PA608741",
      "legislature": "14",
      "typeOrgane": "COMPER",
      "dateDebut": "2016-07-14T02:00:00.000+02:00",
      "datePublication": "2016-07-14T02:00:00.000+02:00",
      "dateFin": "2017-06-17T02:00:00.000+02:00",
      "preseance": "32",
      "nominPrincipale": "1",
      "infosQualite": {
        "codeQualite": "Membre",
        "libQualite": "Membre",
        "libQualiteSex": "Membre"
      },
      "organesRefs": [
        "PO419604"
      ]
    },
    {
      "uid": "PM757984",
      "acteurRef": "PA608741",
      "legislature": "15",
      "typeOrgane": "ASSEMBLEE",
      "dateDebut": "2017-06-18T02:00:00.000+02:00",
      "preseance": "50",
      "nominPrincipale": "1",
      "infosQualite": {
        "codeQualite": "membre",
        "libQualite": "membre",
        "libQualiteSex": "membre"
      },
      "organesRefs": [
        "PO717460"
      ],
      "election": {
        "lieu": {
          "region": "Pays de la Loire",
          "regionType": "Métropolitain",
          "departement": "Sarthe",
          "numDepartement": "72",
          "numCirco": "4"
        },
        "causeMandat": "remplacement d'un député ayant démissionné pour cause d’incompatibilité prévue aux articles LO 137, LO 137-1, LO 141 ou LO 141-1 du code électoral",
        "refCirconscription": "PO718206"
      },
      "mandature": {
        "datePriseFonction": "2018-07-12T02:00:00.000+02:00",
        "premiereElection": "1",
        "placeHemicycle": "577"
      },
      "collaborateurs": [
        {
          "qualite": "M.",
          "prenom": "Léo",
          "nom": "Segouin-Schapira"
        },
        {
          "qualite": "Mme",
          "prenom": "Laurence",
          "nom": "Le Goarant"
        },
        {
          "qualite": "M.",
          "prenom": "Noé",
          "nom": "Girardot-Champsaur"
        }
      ]
    },
    {
      "uid": "PM758000",
      "acteurRef": "PA608741",
      "legislature": "15",
      "typeOrgane": "COMPER",
      "dateDebut": "2018-07-14T02:00:00.000+02:00",
      "datePublication": "2018-07-14T02:00:00.000+02:00",
      "dateFin": "2018-09-29T02:00:00.000+02:00",
      "preseance": "32",
      "nominPrincipale": "1",
      "infosQualite": {
        "codeQualite": "Membre",
        "libQualite": "Membre",
        "libQualiteSex": "Membre"
      },
      "organesRefs": [
        "PO419865"
      ]
    },
    {
      "uid": "PM758001",
      "acteurRef": "PA608741",
      "legislature": "15",
      "typeOrgane": "GP",
      "dateDebut": "2018-07-12T02:00:00.000+02:00",
      "datePublication": "2018-07-13T02:00:00.000+02:00",
      "dateFin": "2018-09-11T02:00:00.000+02:00",
      "preseance": "20",
      "nominPrincipale": "1",
      "infosQualite": {
        "codeQualite": "Membre",
        "libQualite": "Membre du",
        "libQualiteSex": "Membre du"
      },
      "organesRefs": [
        "PO730946"
      ]
    },
    {
      "uid": "PM758865",
      "acteurRef": "PA608741",
      "legislature": "15",
      "typeOrgane": "GP",
      "dateDebut": "2018-09-12T02:00:00.000+02:00",
      "preseance": "20",
      "nominPrincipale": "1",
      "infosQualite": {
        "codeQualite": "Membre",
        "libQualite": "Membre du",
        "libQualiteSex": "Membre du"
      },
      "organesRefs": [
        "PO758835"
      ]
    },
    {
      "uid": "PM759137",
      "acteurRef": "PA608741",
      "legislature": "15",
      "typeOrgane": "COMPER",
      "dateDebut": "2018-09-30T02:00:00.000+02:00",
      "datePublication": "2018-09-30T02:00:00.000+02:00",
      "preseance": "32",
      "nominPrincipale": "1",
      "infosQualite": {
        "codeQualite": "Membre",
        "libQualite": "Membre",
        "libQualiteSex": "Membre"
      },
      "organesRefs": [
        "PO419610"
      ]
    }
  ]
}