{
  "uid": "PO748821",
  "codeType": "COMSPSENAT",
  "libelle": "CS Etat au service d'une société de confiance",
  "libelleAbrege": "CS Etat au service d'une société de confiance",
  "libelleAbrev": "SOCIE",
  "viMoDe": {
    "dateDebut": "2018-01-31T01:00:00.000+01:00"
  }
}