{
  "uid": "PA609442",
  "etatCivil": {
    "ident": {
      "civ": "M.",
      "prenom": "Jean-Marie",
      "nom": "Tétart",
      "alpha": "Tetart"
    },
    "infoNaissance": {
      "dateNais": "1949-09-01T01:00:00.000+01:00",
      "villeNais": "Tigny-Noyelle",
      "depNais": "Pas-de-Calais",
      "paysNais": "France"
    }
  },
  "profession": {
    "libelleCourant": "Grands corps de l'État",
    "socProcInsee": {
      "catSocPro": "Cadres de la fonction publique, professions intellectuelles et  artistiques",
      "famSocPro": "Cadres et professions intellectuelles supérieures"
    }
  },
  "adresses": [
    {
      "xsiType": "AdresseMail_Type",
      "uid": "AD648791",
      "type": "15",
      "typeLibelle": "Mèl",
      "valElec": "jmtetart@assemblee-nationale.fr"
    },
    {
      "xsiType": "AdressePostale_Type",
      "uid": "AD653229",
      "type": "0",
      "typeLibelle": "Adresse officielle",
      "poids": "1",
      "intitule": "Assemblée nationale",
      "numeroRue": "126",
      "nomRue": "Rue de l'Université",
      "codePostal": "75355",
      "ville": "Paris 07 SP"
    }
  ],
  "mandats": [
    {
      "uid": "PM645214",
      "acteurRef": "PA609442",
      "legislature": "14",
      "typeOrgane": "ASSEMBLEE",
      "dateDebut": "2012-06-20T02:00:00.000+02:00",
      "dateFin": "2017-06-20T02:00:00.000+02:00",
      "preseance": "50",
      "nominPrincipale": "1",
      "infosQualite": {
        "codeQualite": "membre",
        "libQualite": "membre",
        "libQualiteSex": "membre"
      },
      "organesRefs": [
        "PO644420"
      ],
      "suppleant": {
        "dateDebut": "2012-06-20T02:00:00.000+02:00",
        "dateFin": "2017-06-20T02:00:00.000+02:00",
        "suppleantRef": "PA642996"
      },
      "election": {
        "lieu": {
          "region": "Ile-de-France",
          "regionType": "Métropolitain",
          "departement": "Yvelines",
          "numDepartement": "78",
          "numCirco": "9"
        },
        "causeMandat": "élections générales",
        "refCirconscription": "PO644866"
      },
      "mandature": {
        "datePriseFonction": "2012-06-20T02:00:00.000+02:00",
        "causeFin": "Fin de législature",
        "premiereElection": "0"
      }
    },
    {
      "uid": "PM656496",
      "acteurRef": "PA609442",
      "legislature": "14",
      "typeOrgane": "GP",
      "dateDebut": "2012-06-26T02:00:00.000+02:00",
      "datePublication": "2012-06-27T02:00:00.000+02:00",
      "dateFin": "2015-06-01T02:00:00.000+02:00",
      "preseance": "20",
      "nominPrincipale": "1",
      "infosQualite": {
        "codeQualite": "Membre",
        "libQualite": "Membre du",
        "libQualiteSex": "Membre du"
      },
      "organesRefs": [
        "PO656006"
      ]
    },
    {
      "uid": "PM657235",
      "acteurRef": "PA609442",
      "legislature": "14",
      "typeOrgane": "COMPER",
      "dateDebut": "2012-06-28T02:00:00.000+02:00",
      "datePublication": "2012-06-28T02:00:00.000+02:00",
      "dateFin": "2017-06-20T02:00:00.000+02:00",
      "preseance": "32",
      "nominPrincipale": "1",
      "infosQualite": {
        "codeQualite": "Membre",
        "libQualite": "Membre",
        "libQualiteSex": "Membre"
      },
      "organesRefs": [
        "PO419610"
      ]
    },
    {
      "uid": "PM677949",
      "acteurRef": "PA609442",
      "legislature": "14",
      "typeOrgane": "API",
      "dateDebut": "2012-07-31T02:00:00.000+02:00",
      "dateFin": "2017-06-20T02:00:00.000+02:00",
      "preseance": "20",
      "nominPrincipale": "1",
      "infosQualite": {
        "codeQualite": "Membre",
        "libQualite": "Membre",
        "libQualiteSex": "Membre"
      },
      "organesRefs": [
        "PO206064"
      ]
    },
    {
      "uid": "PM678842",
      "acteurRef": "PA609442",
      "legislature": "14",
      "typeOrgane": "CMP",
      "dateDebut": "2012-10-02T02:00:00.000+02:00",
      "datePublication": "2012-10-03T02:00:00.000+02:00",
      "dateFin": "2012-10-15T02:00:00.000+02:00",
      "preseance": "20",
      "nominPrincipale": "1",
      "infosQualite": {
        "codeQualite": "Titulaire",
        "libQualite": "Membre titulaire",
        "libQualiteSex": "Membre titulaire"
      },
      "organesRefs": [
        "PO678619"
      ]
    },
    {
      "uid": "PM680850",
      "acteurRef": "PA609442",
      "legislature": "14",
      "typeOrgane": "GA",
      "dateDebut": "2012-10-15T02:00:00.000+02:00",
      "dateFin": "2017-06-20T02:00:00.000+02:00",
      "preseance": "20",
      "nominPrincipale": "1",
      "infosQualite": {
        "codeQualite": "Membre",
        "libQualite": "Membre",
        "libQualiteSex": "Membre"
      },
      "organesRefs": [
        "PO675752"
      ]
    },
    {
      "uid": "PM680851",
      "acteurRef": "PA609442",
      "legislature": "14",
      "typeOrgane": "GA",
      "dateDebut": "2012-10-15T02:00:00.000+02:00",
      "dateFin": "2017-06-20T02:00:00.000+02:00",
      "preseance": "20",
      "nominPrincipale": "1",
      "infosQualite": {
        "codeQualite": "Membre",
        "libQualite": "Membre",
        "libQualiteSex": "Membre"
      },
      "organesRefs": [
        "PO675730"
      ]
    },
    {
      "uid": "PM680852",
      "acteurRef": "PA609442",
      "legislature": "14",
      "typeOrgane": "GA",
      "dateDebut": "2012-10-15T02:00:00.000+02:00",
      "dateFin": "2017-06-20T02:00:00.000+02:00",
      "preseance": "20",
      "nominPrincipale": "1",
      "infosQualite": {
        "codeQualite": "Membre",
        "libQualite": "Membre",
        "libQualiteSex": "Membre"
      },
      "organesRefs": [
        "PO675693"
      ]
    },
    {
      "uid": "PM680853",
      "acteurRef": "PA609442",
      "legislature": "14",
      "typeOrgane": "GA",
      "dateDebut": "2012-10-15T02:00:00.000+02:00",
      "dateFin": "2017-06-20T02:00:00.000+02:00",
      "preseance": "20",
      "nominPrincipale": "1",
      "infosQualite": {
        "codeQualite": "Membre",
        "libQualite": "Membre",
        "libQualiteSex": "Membre"
      },
      "organesRefs": [
        "PO675762"
      ]
    },
    {
      "uid": "PM680854",
      "acteurRef": "PA609442",
      "legislature": "14",
      "typeOrgane": "GA",
      "dateDebut": "2012-10-15T02:00:00.000+02:00",
      "dateFin": "2017-06-20T02:00:00.000+02:00",
      "preseance": "20",
      "nominPrincipale": "1",
      "infosQualite": {
        "codeQualite": "Membre",
        "libQualite": "Membre",
        "libQualiteSex": "Membre"
      },
      "organesRefs": [
        "PO675774"
      ]
    },
    {
      "uid": "PM683593",
      "acteurRef": "PA609442",
      "legislature": "14",
      "typeOrgane": "GA",
      "dateDebut": "2012-10-29T01:00:00.000+01:00",
      "dateFin": "2017-06-20T02:00:00.000+02:00",
      "preseance": "20",
      "nominPrincipale": "0",
      "infosQualite": {
        "codeQualite": "Membre",
        "libQualite": "Membre",
        "libQualiteSex": "Membre"
      },
      "organesRefs": [
        "PO675694"
      ]
    },
    {
      "uid": "PM683594",
      "acteurRef": "PA609442",
      "legislature": "14",
      "typeOrgane": "GA",
      "dateDebut": "2012-10-29T01:00:00.000+01:00",
      "dateFin": "2017-06-20T02:00:00.000+02:00",
      "preseance": "1",
      "nominPrincipale": "1",
      "infosQualite": {
        "codeQualite": "Président",
        "libQualite": "Président",
        "libQualiteSex": "Président"
      },
      "organesRefs": [
        "PO675694"
      ]
    },
    {
      "uid": "PM685377",
      "acteurRef": "PA609442",
      "legislature": "14",
      "typeOrgane": "GA",
      "dateDebut": "2012-12-05T01:00:00.000+01:00",
      "dateFin": "2017-06-20T02:00:00.000+02:00",
      "preseance": "8",
      "nominPrincipale": "1",
      "infosQualite": {
        "codeQualite": "Vice-Président",
        "libQualite": "Vice-Président",
        "libQualiteSex": "Vice-Président"
      },
      "organesRefs": [
        "PO675693"
      ]
    },
    {
      "uid": "PM685600",
      "acteurRef": "PA609442",
      "typeOrgane": "PARPOL",
      "dateDebut": "2012-12-01T01:00:00.000+01:00",
      "dateFin": "2015-11-30T01:00:00.000+01:00",
      "preseance": "5",
      "nominPrincipale": "1",
      "infosQualite": {
        "codeQualite": "Membre",
        "libQualite": "Membre",
        "libQualiteSex": "Membre"
      },
      "organesRefs": [
        "PO684942"
      ]
    },
    {
      "uid": "PM686125",
      "acteurRef": "PA609442",
      "legislature": "14",
      "typeOrgane": "MISINFOPRE",
      "dateDebut": "2012-12-07T01:00:00.000+01:00",
      "datePublication": "2012-12-08T01:00:00.000+01:00",
      "dateFin": "2013-07-02T02:00:00.000+02:00",
      "preseance": "20",
      "nominPrincipale": "1",
      "infosQualite": {
        "codeQualite": "Membre",
        "libQualite": "Membre",
        "libQualiteSex": "Membre"
      },
      "organesRefs": [
        "PO684894"
      ]
    },
    {
      "uid": "PM687360",
      "acteurRef": "PA609442",
      "legislature": "14",
      "typeOrgane": "GA",
      "dateDebut": "2012-11-27T01:00:00.000+01:00",
      "dateFin": "2017-06-20T02:00:00.000+02:00",
      "preseance": "8",
      "nominPrincipale": "1",
      "infosQualite": {
        "codeQualite": "Vice-Président",
        "libQualite": "Vice-Président",
        "libQualiteSex": "Vice-Président"
      },
      "organesRefs": [
        "PO675730"
      ]
    },
    {
      "uid": "PM687479",
      "acteurRef": "PA609442",
      "legislature": "14",
      "typeOrgane": "GE",
      "dateDebut": "2012-12-21T01:00:00.000+01:00",
      "dateFin": "2017-06-20T02:00:00.000+02:00",
      "preseance": "20",
      "nominPrincipale": "0",
      "infosQualite": {
        "codeQualite": "Membre",
        "libQualite": "Membre",
        "libQualiteSex": "Membre"
      },
      "organesRefs": [
        "PO687473"
      ]
    },
    {
      "uid": "PM687480",
      "acteurRef": "PA609442",
      "legislature": "14",
      "typeOrgane": "GE",
      "dateDebut": "2012-12-21T01:00:00.000+01:00",
      "dateFin": "2017-06-20T02:00:00.000+02:00",
      "preseance": "1",
      "nominPrincipale": "1",
      "infosQualite": {
        "codeQualite": "Président",
        "libQualite": "Président",
        "libQualiteSex": "Président"
      },
      "organesRefs": [
        "PO687473"
      ]
    },
    {
      "uid": "PM687664",
      "acteurRef": "PA609442",
      "legislature": "14",
      "typeOrgane": "GE",
      "dateDebut": "2013-01-10T01:00:00.000+01:00",
      "dateFin": "2017-06-20T02:00:00.000+02:00",
      "preseance": "20",
      "nominPrincipale": "1",
      "infosQualite": {
        "codeQualite": "Membre",
        "libQualite": "Membre",
        "libQualiteSex": "Membre"
      },
      "organesRefs": [
        "PO686397"
      ]
    },
    {
      "uid": "PM688048",
      "acteurRef": "PA609442",
      "legislature": "14",
      "typeOrgane": "MISINFOPRE",
      "dateDebut": "2013-01-16T01:00:00.000+01:00",
      "datePublication": "2013-01-17T01:00:00.000+01:00",
      "dateFin": "2013-07-02T02:00:00.000+02:00",
      "preseance": "8",
      "nominPrincipale": "1",
      "infosQualite": {
        "codeQualite": "Secrétaire",
        "libQualite": "Secrétaire",
        "libQualiteSex": "Secrétaire"
      },
      "organesRefs": [
        "PO684894"
      ]
    },
    {
      "uid": "PM689054",
      "acteurRef": "PA609442",
      "legislature": "14",
      "typeOrgane": "GA",
      "dateDebut": "2013-01-23T01:00:00.000+01:00",
      "dateFin": "2017-06-20T02:00:00.000+02:00",
      "preseance": "8",
      "nominPrincipale": "1",
      "infosQualite": {
        "codeQualite": "Vice-Président",
        "libQualite": "Vice-Président",
        "libQualiteSex": "Vice-Président"
      },
      "organesRefs": [
        "PO675752"
      ]
    },
    {
      "uid": "PM689264",
      "acteurRef": "PA609442",
      "legislature": "14",
      "typeOrgane": "GE",
      "dateDebut": "2013-01-09T01:00:00.000+01:00",
      "dateFin": "2017-06-20T02:00:00.000+02:00",
      "preseance": "20",
      "nominPrincipale": "1",
      "infosQualite": {
        "codeQualite": "Membre",
        "libQualite": "Membre",
        "libQualiteSex": "Membre"
      },
      "organesRefs": [
        "PO686617"
      ]
    },
    {
      "uid": "PM689530",
      "acteurRef": "PA609442",
      "legislature": "14",
      "typeOrgane": "GE",
      "dateDebut": "2013-01-23T01:00:00.000+01:00",
      "dateFin": "2017-06-20T02:00:00.000+02:00",
      "preseance": "20",
      "nominPrincipale": "1",
      "infosQualite": {
        "codeQualite": "Membre",
        "libQualite": "Membre",
        "libQualiteSex": "Membre"
      },
      "organesRefs": [
        "PO687109"
      ]
    },
    {
      "uid": "PM692430",
      "acteurRef": "PA609442",
      "legislature": "14",
      "typeOrgane": "GE",
      "dateDebut": "2013-02-26T01:00:00.000+01:00",
      "dateFin": "2017-06-20T02:00:00.000+02:00",
      "preseance": "20",
      "nominPrincipale": "1",
      "infosQualite": {
        "codeQualite": "Membre",
        "libQualite": "Membre",
        "libQualiteSex": "Membre"
      },
      "organesRefs": [
        "PO686589"
      ]
    },
    {
      "uid": "PM692776",
      "acteurRef": "PA609442",
      "legislature": "14",
      "typeOrgane": "GE",
      "dateDebut": "2013-03-18T01:00:00.000+01:00",
      "dateFin": "2017-06-20T02:00:00.000+02:00",
      "preseance": "20",
      "nominPrincipale": "1",
      "infosQualite": {
        "codeQualite": "Membre",
        "libQualite": "Membre",
        "libQualiteSex": "Membre"
      },
      "organesRefs": [
        "PO686835"
      ]
    },
    {
      "uid": "PM693521",
      "acteurRef": "PA609442",
      "legislature": "14",
      "typeOrgane": "GE",
      "dateDebut": "2013-01-21T01:00:00.000+01:00",
      "dateFin": "2017-06-20T02:00:00.000+02:00",
      "preseance": "20",
      "nominPrincipale": "1",
      "infosQualite": {
        "codeQualite": "Membre",
        "libQualite": "Membre",
        "libQualiteSex": "Membre"
      },
      "organesRefs": [
        "PO686213"
      ]
    },
    {
      "uid": "PM695196",
      "acteurRef": "PA609442",
      "legislature": "14",
      "typeOrgane": "GE",
      "dateDebut": "2012-12-18T01:00:00.000+01:00",
      "dateFin": "2017-06-20T02:00:00.000+02:00",
      "preseance": "20",
      "nominPrincipale": "1",
      "infosQualite": {
        "codeQualite": "Membre",
        "libQualite": "Membre",
        "libQualiteSex": "Membre"
      },
      "organesRefs": [
        "PO686266"
      ]
    },
    {
      "uid": "PM695296",
      "acteurRef": "PA609442",
      "legislature": "14",
      "typeOrgane": "GE",
      "dateDebut": "2013-06-13T02:00:00.000+02:00",
      "dateFin": "2017-06-20T02:00:00.000+02:00",
      "preseance": "20",
      "nominPrincipale": "1",
      "infosQualite": {
        "codeQualite": "Membre",
        "libQualite": "Membre",
        "libQualiteSex": "Membre"
      },
      "organesRefs": [
        "PO692259"
      ]
    },
    {
      "uid": "PM698457",
      "acteurRef": "PA609442",
      "legislature": "14",
      "typeOrgane": "GE",
      "dateDebut": "2013-11-13T01:00:00.000+01:00",
      "dateFin": "2017-06-20T02:00:00.000+02:00",
      "preseance": "20",
      "nominPrincipale": "1",
      "infosQualite": {
        "codeQualite": "Membre",
        "libQualite": "Membre",
        "libQualiteSex": "Membre"
      },
      "organesRefs": [
        "PO686878"
      ]
    },
    {
      "uid": "PM698639",
      "acteurRef": "PA609442",
      "legislature": "14",
      "typeOrgane": "ORGEXTPARL",
      "dateDebut": "2013-11-21T01:00:00.000+01:00",
      "datePublication": "2013-11-22T01:00:00.000+01:00",
      "dateFin": "2017-06-20T02:00:00.000+02:00",
      "preseance": "20",
      "nominPrincipale": "1",
      "infosQualite": {
        "codeQualite": "Titulaire",
        "libQualite": "Membre titulaire",
        "libQualiteSex": "Membre titulaire"
      },
      "organesRefs": [
        "PO698635"
      ]
    },
    {
      "uid": "PM699704",
      "acteurRef": "PA609442",
      "legislature": "14",
      "typeOrgane": "CMP",
      "dateDebut": "2014-01-29T01:00:00.000+01:00",
      "datePublication": "2014-01-30T01:00:00.000+01:00",
      "dateFin": "2014-02-17T01:00:00.000+01:00",
      "preseance": "20",
      "nominPrincipale": "1",
      "infosQualite": {
        "codeQualite": "Titulaire",
        "libQualite": "Membre titulaire",
        "libQualiteSex": "Membre titulaire"
      },
      "organesRefs": [
        "PO699474"
      ]
    },
    {
      "uid": "PM700002",
      "acteurRef": "PA609442",
      "legislature": "14",
      "typeOrgane": "CMP",
      "dateDebut": "2014-02-07T01:00:00.000+01:00",
      "datePublication": "2014-02-08T01:00:00.000+01:00",
      "dateFin": "2014-02-27T01:00:00.000+01:00",
      "preseance": "20",
      "nominPrincipale": "1",
      "infosQualite": {
        "codeQualite": "Titulaire",
        "libQualite": "Membre titulaire",
        "libQualiteSex": "Membre titulaire"
      },
      "organesRefs": [
        "PO699751"
      ]
    },
    {
      "uid": "PM700390",
      "acteurRef": "PA609442",
      "legislature": "14",
      "typeOrgane": "GE",
      "dateDebut": "2014-02-25T01:00:00.000+01:00",
      "dateFin": "2017-06-20T02:00:00.000+02:00",
      "preseance": "20",
      "nominPrincipale": "1",
      "infosQualite": {
        "codeQualite": "Membre",
        "libQualite": "Membre",
        "libQualiteSex": "Membre"
      },
      "organesRefs": [
        "PO695569"
      ]
    },
    {
      "uid": "PM700920",
      "acteurRef": "PA609442",
      "legislature": "14",
      "typeOrgane": "CNPE",
      "dateDebut": "2014-04-16T02:00:00.000+02:00",
      "datePublication": "2014-04-17T02:00:00.000+02:00",
      "dateFin": "2014-10-30T01:00:00.000+01:00",
      "preseance": "20",
      "nominPrincipale": "1",
      "infosQualite": {
        "codeQualite": "Membre",
        "libQualite": "Membre",
        "libQualiteSex": "Membre"
      },
      "organesRefs": [
        "PO700816"
      ]
    },
    {
      "uid": "PM701671",
      "acteurRef": "PA609442",
      "legislature": "14",
      "typeOrgane": "CMP",
      "dateDebut": "2014-06-03T02:00:00.000+02:00",
      "datePublication": "2014-06-04T02:00:00.000+02:00",
      "dateFin": "2014-06-23T02:00:00.000+02:00",
      "preseance": "20",
      "nominPrincipale": "1",
      "infosQualite": {
        "codeQualite": "Titulaire",
        "libQualite": "Membre titulaire",
        "libQualiteSex": "Membre titulaire"
      },
      "organesRefs": [
        "PO701542"
      ]
    },
    {
      "uid": "PM702187",
      "acteurRef": "PA609442",
      "legislature": "14",
      "typeOrgane": "CNPS",
      "dateDebut": "2014-07-03T02:00:00.000+02:00",
      "datePublication": "2014-07-03T02:00:00.000+02:00",
      "dateFin": "2014-12-19T01:00:00.000+01:00",
      "preseance": "20",
      "nominPrincipale": "1",
      "infosQualite": {
        "codeQualite": "Membre",
        "libQualite": "Membre",
        "libQualiteSex": "Membre"
      },
      "organesRefs": [
        "PO702090"
      ]
    },
    {
      "uid": "PM702788",
      "acteurRef": "PA609442",
      "legislature": "14",
      "typeOrgane": "GE",
      "dateDebut": "2014-07-23T02:00:00.000+02:00",
      "dateFin": "2017-06-20T02:00:00.000+02:00",
      "preseance": "20",
      "nominPrincipale": "1",
      "infosQualite": {
        "codeQualite": "Membre",
        "libQualite": "Membre",
        "libQualiteSex": "Membre"
      },
      "organesRefs": [
        "PO702209"
      ]
    },
    {
      "uid": "PM703086",
      "acteurRef": "PA609442",
      "legislature": "14",
      "typeOrgane": "CNPS",
      "dateDebut": "2014-09-02T02:00:00.000+02:00",
      "datePublication": "2014-09-03T02:00:00.000+02:00",
      "dateFin": "2015-08-18T02:00:00.000+02:00",
      "preseance": "20",
      "nominPrincipale": "1",
      "infosQualite": {
        "codeQualite": "Membre",
        "libQualite": "Membre",
        "libQualiteSex": "Membre"
      },
      "organesRefs": [
        "PO702808"
      ]
    },
    {
      "uid": "PM703169",
      "acteurRef": "PA609442",
      "legislature": "14",
      "typeOrgane": "GE",
      "dateDebut": "2014-09-16T02:00:00.000+02:00",
      "dateFin": "2017-06-20T02:00:00.000+02:00",
      "preseance": "20",
      "nominPrincipale": "1",
      "infosQualite": {
        "codeQualite": "Membre",
        "libQualite": "Membre",
        "libQualiteSex": "Membre"
      },
      "organesRefs": [
        "PO701621"
      ]
    },
    {
      "uid": "PM704681",
      "acteurRef": "PA609442",
      "legislature": "14",
      "typeOrgane": "MISINFOCOM",
      "dateDebut": "2013-04-10T02:00:00.000+02:00",
      "datePublication": "2013-04-11T02:00:00.000+02:00",
      "dateFin": "2015-02-04T01:00:00.000+01:00",
      "preseance": "20",
      "nominPrincipale": "1",
      "infosQualite": {
        "codeQualite": "Membre",
        "libQualite": "Membre",
        "libQualiteSex": "Membre"
      },
      "organesRefs": [
        "PO704669"
      ]
    },
    {
      "uid": "PM705377",
      "acteurRef": "PA609442",
      "legislature": "14",
      "typeOrgane": "CNPS",
      "dateDebut": "2014-12-13T01:00:00.000+01:00",
      "datePublication": "2014-12-13T01:00:00.000+01:00",
      "dateFin": "2015-08-07T02:00:00.000+02:00",
      "preseance": "20",
      "nominPrincipale": "1",
      "infosQualite": {
        "codeQualite": "Membre",
        "libQualite": "Membre",
        "libQualiteSex": "Membre"
      },
      "organesRefs": [
        "PO704848"
      ]
    },
    {
      "uid": "PM707224",
      "acteurRef": "PA609442",
      "legislature": "14",
      "typeOrgane": "ORGEXTPARL",
      "dateDebut": "2015-02-19T01:00:00.000+01:00",
      "dateFin": "2017-06-20T02:00:00.000+02:00",
      "preseance": "30",
      "nominPrincipale": "1",
      "infosQualite": {
        "codeQualite": "Suppléant",
        "libQualite": "Membre suppléant",
        "libQualiteSex": "Membre suppléant"
      },
      "organesRefs": [
        "PO60265"
      ]
    },
    {
      "uid": "PM707455",
      "acteurRef": "PA609442",
      "legislature": "14",
      "typeOrgane": "MISINFO",
      "dateDebut": "2014-11-18T01:00:00.000+01:00",
      "dateFin": "2015-07-07T02:00:00.000+02:00",
      "preseance": "10",
      "nominPrincipale": "1",
      "infosQualite": {
        "codeQualite": "Membre",
        "libQualite": "Membre",
        "libQualiteSex": "Membre"
      },
      "organesRefs": [
        "PO707445"
      ]
    },
    {
      "uid": "PM708050",
      "acteurRef": "PA609442",
      "legislature": "14",
      "typeOrgane": "GP",
      "dateDebut": "2015-06-02T02:00:00.000+02:00",
      "datePublication": "2015-06-02T02:00:00.000+02:00",
      "dateFin": "2017-06-20T02:00:00.000+02:00",
      "preseance": "20",
      "nominPrincipale": "1",
      "infosQualite": {
        "codeQualite": "Membre",
        "libQualite": "Membre du",
        "libQualiteSex": "Membre du"
      },
      "organesRefs": [
        "PO707869"
      ]
    },
    {
      "uid": "PM709085",
      "acteurRef": "PA609442",
      "legislature": "14",
      "typeOrgane": "GA",
      "dateDebut": "2015-07-20T02:00:00.000+02:00",
      "dateFin": "2017-06-20T02:00:00.000+02:00",
      "preseance": "20",
      "nominPrincipale": "1",
      "infosQualite": {
        "codeQualite": "Membre",
        "libQualite": "Membre",
        "libQualiteSex": "Membre"
      },
      "organesRefs": [
        "PO675699"
      ]
    },
    {
      "uid": "PM709289",
      "acteurRef": "PA609442",
      "legislature": "14",
      "typeOrgane": "MISINFO",
      "dateDebut": "2015-06-24T02:00:00.000+02:00",
      "dateFin": "2016-02-16T01:00:00.000+01:00",
      "preseance": "10",
      "nominPrincipale": "1",
      "infosQualite": {
        "codeQualite": "Membre",
        "libQualite": "Membre",
        "libQualiteSex": "Membre"
      },
      "organesRefs": [
        "PO709280"
      ]
    },
    {
      "uid": "PM710591",
      "acteurRef": "PA609442",
      "typeOrgane": "PARPOL",
      "dateDebut": "2015-12-01T01:00:00.000+01:00",
      "dateFin": "2017-06-20T02:00:00.000+02:00",
      "preseance": "5",
      "nominPrincipale": "1",
      "infosQualite": {
        "codeQualite": "Membre",
        "libQualite": "Membre",
        "libQualiteSex": "Membre"
      },
      "organesRefs": [
        "PO710396"
      ]
    },
    {
      "uid": "PM712418",
      "acteurRef": "PA609442",
      "legislature": "14",
      "typeOrgane": "GE",
      "dateDebut": "2016-04-25T02:00:00.000+02:00",
      "dateFin": "2017-06-20T02:00:00.000+02:00",
      "preseance": "20",
      "nominPrincipale": "1",
      "infosQualite": {
        "codeQualite": "Membre",
        "libQualite": "Membre",
        "libQualiteSex": "Membre"
      },
      "organesRefs": [
        "PO712100"
      ]
    },
    {
      "uid": "PM712504",
      "acteurRef": "PA609442",
      "legislature": "14",
      "typeOrgane": "MISINFO",
      "dateDebut": "2015-10-20T02:00:00.000+02:00",
      "dateFin": "2016-10-25T02:00:00.000+02:00",
      "preseance": "10",
      "nominPrincipale": "0",
      "infosQualite": {
        "codeQualite": "Membre",
        "libQualite": "Membre",
        "libQualiteSex": "Membre"
      },
      "organesRefs": [
        "PO712465"
      ]
    },
    {
      "uid": "PM712508",
      "acteurRef": "PA609442",
      "legislature": "14",
      "typeOrgane": "MISINFO",
      "dateDebut": "2015-10-20T02:00:00.000+02:00",
      "dateFin": "2016-10-25T02:00:00.000+02:00",
      "preseance": "5",
      "nominPrincipale": "1",
      "infosQualite": {
        "codeQualite": "Co-rapporteur",
        "libQualite": "Co-rapporteur",
        "libQualiteSex": "Co-rapporteur"
      },
      "organesRefs": [
        "PO712465"
      ]
    },
    {
      "uid": "PM712642",
      "acteurRef": "PA609442",
      "legislature": "14",
      "typeOrgane": "CNPS",
      "dateDebut": "2016-05-04T02:00:00.000+02:00",
      "datePublication": "2016-05-04T02:00:00.000+02:00",
      "dateFin": "2017-02-20T01:00:00.000+01:00",
      "preseance": "20",
      "nominPrincipale": "1",
      "infosQualite": {
        "codeQualite": "Membre",
        "libQualite": "Membre",
        "libQualiteSex": "Membre"
      },
      "organesRefs": [
        "PO712376"
      ]
    },
    {
      "uid": "PM715007",
      "acteurRef": "PA609442",
      "legislature": "14",
      "typeOrgane": "CMP",
      "dateDebut": "2016-10-27T02:00:00.000+02:00",
      "datePublication": "2016-10-28T02:00:00.000+02:00",
      "dateFin": "2016-11-03T01:00:00.000+01:00",
      "preseance": "20",
      "nominPrincipale": "1",
      "infosQualite": {
        "codeQualite": "Titulaire",
        "libQualite": "Membre titulaire",
        "libQualiteSex": "Membre titulaire"
      },
      "organesRefs": [
        "PO714924"
      ]
    },
    {
      "uid": "PM716460",
      "acteurRef": "PA609442",
      "legislature": "14",
      "typeOrgane": "CMP",
      "dateDebut": "2017-01-12T01:00:00.000+01:00",
      "datePublication": "2017-01-13T01:00:00.000+01:00",
      "dateFin": "2017-01-20T01:00:00.000+01:00",
      "preseance": "20",
      "nominPrincipale": "1",
      "infosQualite": {
        "codeQualite": "Titulaire",
        "libQualite": "Membre titulaire",
        "libQualiteSex": "Membre titulaire"
      },
      "organesRefs": [
        "PO716327"
      ]
    },
    {
      "uid": "PM716635",
      "acteurRef": "PA609442",
      "legislature": "14",
      "typeOrgane": "CMP",
      "dateDebut": "2017-01-27T01:00:00.000+01:00",
      "datePublication": "2017-01-28T01:00:00.000+01:00",
      "dateFin": "2017-02-02T01:00:00.000+01:00",
      "preseance": "20",
      "nominPrincipale": "1",
      "infosQualite": {
        "codeQualite": "Titulaire",
        "libQualite": "Membre titulaire",
        "libQualiteSex": "Membre titulaire"
      },
      "organesRefs": [
        "PO716629"
      ]
    },
    {
      "uid": "PM716708",
      "acteurRef": "PA609442",
      "legislature": "14",
      "typeOrgane": "CMP",
      "dateDebut": "2017-01-31T01:00:00.000+01:00",
      "datePublication": "2017-02-01T01:00:00.000+01:00",
      "dateFin": "2017-02-02T01:00:00.000+01:00",
      "preseance": "20",
      "nominPrincipale": "1",
      "infosQualite": {
        "codeQualite": "Titulaire",
        "libQualite": "Membre titulaire",
        "libQualiteSex": "Membre titulaire"
      },
      "organesRefs": [
        "PO716574"
      ]
    }
  ]
}