{
  "uid": "PO759099",
  "codeType": "CMP",
  "libelle": "Commission mixte paritaire chargée de proposer un texte sur les dispositions restant en discussion du projet de loi relatif à la lutte contre la fraude",
  "libelleEdition": "de la commission mixte paritaire chargée de proposer un texte sur les dispositions restant en discussion du projet de loi relatif à la lutte contre la fraude",
  "libelleAbrege": "Lutte contre la fraude",
  "libelleAbrev": "1142",
  "viMoDe": {
    "dateDebut": "2018-09-26T02:00:00.000+02:00"
  },
  "regime": "5ème République",
  "legislature": "15",
  "secretariat": {}
}