{
  "uid": "PA642965",
  "etatCivil": {
    "ident": {
      "civ": "M.",
      "prenom": "Jacques",
      "nom": "Dellerie",
      "alpha": "Dellerie"
    },
    "infoNaissance": {
      "dateNais": "1947-01-28T01:00:00.000+01:00",
      "villeNais": "Desvres",
      "depNais": "Pas-de-Calais",
      "paysNais": "France"
    }
  },
  "profession": {
    "libelleCourant": "Retraité du secteur privé",
    "socProcInsee": {
      "catSocPro": "Anciens cadres et professions intermédiaires",
      "famSocPro": "Retraités"
    }
  },
  "adresses": [
    {
      "xsiType": "AdressePostale_Type",
      "uid": "AD711820",
      "type": "0",
      "typeLibelle": "Adresse officielle",
      "poids": "1",
      "intitule": "Assemblée nationale",
      "numeroRue": "126",
      "nomRue": "Rue de l'Université",
      "codePostal": "75355",
      "ville": "Paris 07 SP"
    },
    {
      "xsiType": "AdressePostale_Type",
      "uid": "AD711852",
      "type": "0",
      "typeLibelle": "Adresse officielle",
      "poids": "2",
      "intitule": "Permanence parlementaire",
      "numeroRue": "43 Bis",
      "nomRue": "Rue Saint-Etienne",
      "codePostal": "76400",
      "ville": "Fécamp"
    },
    {
      "xsiType": "AdresseTelephonique_Type",
      "uid": "AD711853",
      "type": "11",
      "typeLibelle": "Téléphone",
      "poids": "2",
      "adresseDeRattachement": "AD711852",
      "valElec": "02 35 28 36 10"
    },
    {
      "xsiType": "AdresseMail_Type",
      "uid": "AD711934",
      "type": "15",
      "typeLibelle": "Mèl",
      "valElec": "jacques.dellerie@assemblee-nationale.fr"
    }
  ],
  "mandats": [
    {
      "uid": "PM711810",
      "acteurRef": "PA642965",
      "legislature": "14",
      "typeOrgane": "ASSEMBLEE",
      "dateDebut": "2012-06-20T02:00:00.000+02:00",
      "dateFin": "2017-06-17T02:00:00.000+02:00",
      "preseance": "50",
      "nominPrincipale": "1",
      "infosQualite": {
        "codeQualite": "membre",
        "libQualite": "membre",
        "libQualiteSex": "membre"
      },
      "organesRefs": [
        "PO644420"
      ],
      "election": {
        "lieu": {
          "region": "Normandie",
          "regionType": "Métropolitain",
          "departement": "Seine-Maritime",
          "numDepartement": "76",
          "numCirco": "9"
        },
        "causeMandat": "remplacement d'un député nommé au Gouvernement",
        "refCirconscription": "PO644845"
      },
      "mandature": {
        "datePriseFonction": "2016-03-12T01:00:00.000+01:00",
        "causeFin": "Reprise de l'exercice du mandat d'un ancien membre du Gouvernement",
        "premiereElection": "0"
      }
    },
    {
      "uid": "PM711831",
      "acteurRef": "PA642965",
      "legislature": "14",
      "typeOrgane": "GP",
      "dateDebut": "2016-03-12T01:00:00.000+01:00",
      "datePublication": "2016-03-13T01:00:00.000+01:00",
      "dateFin": "2016-05-24T02:00:00.000+02:00",
      "preseance": "20",
      "nominPrincipale": "1",
      "infosQualite": {
        "codeQualite": "Membre",
        "libQualite": "Membre du",
        "libQualiteSex": "Membre du"
      },
      "organesRefs": [
        "PO656002"
      ]
    },
    {
      "uid": "PM711864",
      "acteurRef": "PA642965",
      "legislature": "14",
      "typeOrgane": "COMPER",
      "dateDebut": "2016-03-15T01:00:00.000+01:00",
      "datePublication": "2016-03-15T01:00:00.000+01:00",
      "dateFin": "2017-06-17T02:00:00.000+02:00",
      "preseance": "32",
      "nominPrincipale": "1",
      "infosQualite": {
        "codeQualite": "Membre",
        "libQualite": "Membre",
        "libQualiteSex": "Membre"
      },
      "organesRefs": [
        "PO419604"
      ]
    },
    {
      "uid": "PM713175",
      "acteurRef": "PA642965",
      "legislature": "14",
      "typeOrgane": "GP",
      "dateDebut": "2016-05-25T02:00:00.000+02:00",
      "dateFin": "2017-06-17T02:00:00.000+02:00",
      "preseance": "20",
      "nominPrincipale": "1",
      "infosQualite": {
        "codeQualite": "Membre",
        "libQualite": "Membre du",
        "libQualiteSex": "Membre du"
      },
      "organesRefs": [
        "PO713077"
      ]
    },
    {
      "uid": "PM715691",
      "acteurRef": "PA642965",
      "typeOrgane": "PARPOL",
      "dateDebut": "2016-12-01T01:00:00.000+01:00",
      "dateFin": "2017-06-20T02:00:00.000+02:00",
      "preseance": "5",
      "nominPrincipale": "1",
      "infosQualite": {
        "codeQualite": "Membre",
        "libQualite": "Membre",
        "libQualiteSex": "Membre"
      },
      "organesRefs": [
        "PO684932"
      ]
    }
  ]
}