{
  "uid": "PO418172",
  "codeType": "MINISTERE",
  "libelle": "Ministère de l'immigration, intégration, identité nationale et développement solidaire",
  "libelleEdition": "de l'immigration, intégration, identité nationale et développement solidaire",
  "libelleAbrege": "Immigration, intégration, identité nationale et développement solidaire",
  "libelleAbrev": "IMM",
  "viMoDe": {
    "dateDebut": "2009-01-15T01:00:00.000+01:00",
    "dateFin": "2010-11-13T01:00:00.000+01:00"
  },
  "organeParentRef": "PO384206"
}