{
  "uid": "PA721976",
  "etatCivil": {
    "ident": {
      "civ": "M.",
      "prenom": "Bruno",
      "nom": "Millienne",
      "alpha": "Millienne",
      "trigramme": "BMI"
    },
    "infoNaissance": {
      "dateNais": "1959-11-28T01:00:00.000+01:00",
      "villeNais": "Argenteuil",
      "depNais": "Val-d'Oise",
      "paysNais": "France"
    }
  },
  "profession": {
    "libelleCourant": "Cadre supérieur (secteur privé)",
    "socProcInsee": {
      "catSocPro": "Cadres d'entreprise",
      "famSocPro": "Cadres et professions intellectuelles supérieures"
    }
  },
  "uriHatvp": "https://www.hatvp.fr/pages_nominatives/millienne-bruno",
  "adresses": [
    {
      "xsiType": "AdressePostale_Type",
      "uid": "AD721978",
      "type": "0",
      "typeLibelle": "Adresse officielle",
      "poids": "1",
      "intitule": "Assemblée nationale,",
      "numeroRue": "126",
      "nomRue": "Rue de l'Université,",
      "codePostal": "75355",
      "ville": "Paris 07 SP"
    },
    {
      "xsiType": "AdresseMail_Type",
      "uid": "AD728302",
      "type": "15",
      "typeLibelle": "Mèl",
      "valElec": "bruno.millienne@assemblee-nationale.fr"
    },
    {
      "xsiType": "AdresseTelephonique_Type",
      "uid": "AD757755",
      "type": "11",
      "typeLibelle": "Téléphone",
      "poids": "1",
      "adresseDeRattachement": "AD721978",
      "valElec": "01.40.63.67.53"
    }
  ],
  "mandats": [
    {
      "uid": "PM723438",
      "acteurRef": "PA721976",
      "legislature": "15",
      "typeOrgane": "ASSEMBLEE",
      "dateDebut": "2017-06-18T02:00:00.000+02:00",
      "preseance": "50",
      "nominPrincipale": "1",
      "infosQualite": {
        "codeQualite": "membre",
        "libQualite": "membre",
        "libQualiteSex": "membre"
      },
      "organesRefs": [
        "PO717460"
      ],
      "suppleant": {
        "dateDebut": "2017-06-18T02:00:00.000+02:00",
        "suppleantRef": "PA721980"
      },
      "election": {
        "lieu": {
          "region": "Ile-de-France",
          "regionType": "Métropolitain",
          "departement": "Yvelines",
          "numDepartement": "78",
          "numCirco": "9"
        },
        "causeMandat": "élections générales",
        "refCirconscription": "PO718312"
      },
      "mandature": {
        "datePriseFonction": "2017-06-21T02:00:00.000+02:00",
        "premiereElection": "0",
        "placeHemicycle": "178"
      },
      "collaborateurs": [
        {
          "qualite": "M.",
          "prenom": "Jean-Baptiste",
          "nom": "Hamonic"
        },
        {
          "qualite": "Mme",
          "prenom": "Virginie",
          "nom": "Estrampes"
        },
        {
          "qualite": "M.",
          "prenom": "Cédric",
          "nom": "Pemba-Marine"
        }
      ]
    },
    {
      "uid": "PM724760",
      "acteurRef": "PA721976",
      "legislature": "15",
      "typeOrgane": "GP",
      "dateDebut": "2017-06-21T02:00:00.000+02:00",
      "dateFin": "2017-06-26T02:00:00.000+02:00",
      "preseance": "28",
      "nominPrincipale": "1",
      "infosQualite": {
        "codeQualite": "Député non-inscrit",
        "libQualite": "Député non-inscrit",
        "libQualiteSex": "Député non-inscrit"
      },
      "organesRefs": [
        "PO723569"
      ]
    },
    {
      "uid": "PM731430",
      "acteurRef": "PA721976",
      "legislature": "15",
      "typeOrgane": "GP",
      "dateDebut": "2017-06-27T02:00:00.000+02:00",
      "datePublication": "2017-06-28T02:00:00.000+02:00",
      "preseance": "20",
      "nominPrincipale": "1",
      "infosQualite": {
        "codeQualite": "Membre",
        "libQualite": "Membre du",
        "libQualiteSex": "Membre du"
      },
      "organesRefs": [
        "PO730970"
      ]
    },
    {
      "uid": "PM731631",
      "acteurRef": "PA721976",
      "legislature": "15",
      "typeOrgane": "COMPER",
      "dateDebut": "2017-06-29T02:00:00.000+02:00",
      "datePublication": "2017-06-29T02:00:00.000+02:00",
      "preseance": "32",
      "nominPrincipale": "1",
      "infosQualite": {
        "codeQualite": "Membre",
        "libQualite": "Membre",
        "libQualiteSex": "Membre"
      },
      "organesRefs": [
        "PO419865"
      ]
    },
    {
      "uid": "PM735245",
      "acteurRef": "PA721976",
      "legislature": "15",
      "typeOrgane": "GA",
      "dateDebut": "2017-09-26T02:00:00.000+02:00",
      "preseance": "20",
      "nominPrincipale": "0",
      "infosQualite": {
        "codeQualite": "Membre",
        "libQualite": "Membre",
        "libQualiteSex": "Membre"
      },
      "organesRefs": [
        "PO733287"
      ]
    },
    {
      "uid": "PM735246",
      "acteurRef": "PA721976",
      "legislature": "15",
      "typeOrgane": "GA",
      "dateDebut": "2017-09-26T02:00:00.000+02:00",
      "preseance": "1",
      "nominPrincipale": "1",
      "infosQualite": {
        "codeQualite": "Président",
        "libQualite": "Président",
        "libQualiteSex": "Président"
      },
      "organesRefs": [
        "PO733287"
      ]
    },
    {
      "uid": "PM735838",
      "acteurRef": "PA721976",
      "legislature": "15",
      "typeOrgane": "GA",
      "dateDebut": "2017-09-28T02:00:00.000+02:00",
      "preseance": "20",
      "nominPrincipale": "1",
      "infosQualite": {
        "codeQualite": "Membre",
        "libQualite": "Membre",
        "libQualiteSex": "Membre"
      },
      "organesRefs": [
        "PO733037"
      ]
    },
    {
      "uid": "PM735839",
      "acteurRef": "PA721976",
      "legislature": "15",
      "typeOrgane": "GA",
      "dateDebut": "2017-09-28T02:00:00.000+02:00",
      "preseance": "20",
      "nominPrincipale": "0",
      "infosQualite": {
        "codeQualite": "Membre",
        "libQualite": "Membre",
        "libQualiteSex": "Membre"
      },
      "organesRefs": [
        "PO733127"
      ]
    },
    {
      "uid": "PM735840",
      "acteurRef": "PA721976",
      "legislature": "15",
      "typeOrgane": "GA",
      "dateDebut": "2017-09-28T02:00:00.000+02:00",
      "preseance": "20",
      "nominPrincipale": "1",
      "infosQualite": {
        "codeQualite": "Membre",
        "libQualite": "Membre",
        "libQualiteSex": "Membre"
      },
      "organesRefs": [
        "PO733397"
      ]
    },
    {
      "uid": "PM735841",
      "acteurRef": "PA721976",
      "legislature": "15",
      "typeOrgane": "GA",
      "dateDebut": "2017-09-28T02:00:00.000+02:00",
      "preseance": "20",
      "nominPrincipale": "1",
      "infosQualite": {
        "codeQualite": "Membre",
        "libQualite": "Membre",
        "libQualiteSex": "Membre"
      },
      "organesRefs": [
        "PO733487"
      ]
    },
    {
      "uid": "PM735842",
      "acteurRef": "PA721976",
      "legislature": "15",
      "typeOrgane": "GA",
      "dateDebut": "2017-09-28T02:00:00.000+02:00",
      "preseance": "20",
      "nominPrincipale": "0",
      "infosQualite": {
        "codeQualite": "Membre",
        "libQualite": "Membre",
        "libQualiteSex": "Membre"
      },
      "organesRefs": [
        "PO733497"
      ]
    },
    {
      "uid": "PM742156",
      "acteurRef": "PA721976",
      "legislature": "15",
      "typeOrgane": "ORGAINT",
      "dateDebut": "2017-10-27T02:00:00.000+02:00",
      "datePublication": "2017-10-28T02:00:00.000+02:00",
      "preseance": "42",
      "nominPrincipale": "1",
      "infosQualite": {
        "codeQualite": "Membre",
        "libQualite": "Membre",
        "libQualiteSex": "Membre"
      },
      "organesRefs": [
        "PO201115"
      ]
    },
    {
      "uid": "PM742466",
      "acteurRef": "PA721976",
      "legislature": "15",
      "typeOrgane": "ORGEXTPARL",
      "dateDebut": "2017-11-02T01:00:00.000+01:00",
      "datePublication": "2017-11-03T01:00:00.000+01:00",
      "preseance": "30",
      "nominPrincipale": "1",
      "infosQualite": {
        "codeQualite": "Suppléant",
        "libQualite": "Membre suppléant",
        "libQualiteSex": "Membre suppléant"
      },
      "organesRefs": [
        "PO683289"
      ]
    },
    {
      "uid": "PM744484",
      "acteurRef": "PA721976",
      "legislature": "15",
      "typeOrgane": "GA",
      "dateDebut": "2017-11-22T01:00:00.000+01:00",
      "preseance": "8",
      "nominPrincipale": "1",
      "infosQualite": {
        "codeQualite": "Vice-Président",
        "libQualite": "Vice-Président",
        "libQualiteSex": "Vice-Président"
      },
      "organesRefs": [
        "PO733127"
      ]
    },
    {
      "uid": "PM744781",
      "acteurRef": "PA721976",
      "legislature": "15",
      "typeOrgane": "CNPS",
      "dateDebut": "2017-12-06T01:00:00.000+01:00",
      "datePublication": "2017-12-06T01:00:00.000+01:00",
      "dateFin": "2018-07-31T02:00:00.000+02:00",
      "preseance": "20",
      "nominPrincipale": "1",
      "infosQualite": {
        "codeQualite": "Membre",
        "libQualite": "Membre",
        "libQualiteSex": "Membre"
      },
      "organesRefs": [
        "PO744107"
      ]
    },
    {
      "uid": "PM745864",
      "acteurRef": "PA721976",
      "typeOrgane": "PARPOL",
      "dateDebut": "2017-12-01T01:00:00.000+01:00",
      "preseance": "5",
      "nominPrincipale": "1",
      "infosQualite": {
        "codeQualite": "Membre",
        "libQualite": "Membre",
        "libQualiteSex": "Membre"
      },
      "organesRefs": [
        "PO684938"
      ]
    },
    {
      "uid": "PM746370",
      "acteurRef": "PA721976",
      "legislature": "15",
      "typeOrgane": "GA",
      "dateDebut": "2017-12-13T01:00:00.000+01:00",
      "preseance": "8",
      "nominPrincipale": "1",
      "infosQualite": {
        "codeQualite": "Vice-Président",
        "libQualite": "Vice-Président",
        "libQualiteSex": "Vice-Président"
      },
      "organesRefs": [
        "PO733497"
      ]
    },
    {
      "uid": "PM746493",
      "acteurRef": "PA721976",
      "legislature": "15",
      "typeOrgane": "CMP",
      "dateDebut": "2017-12-14T01:00:00.000+01:00",
      "datePublication": "2017-12-15T01:00:00.000+01:00",
      "dateFin": "2018-02-15T01:00:00.000+01:00",
      "preseance": "20",
      "nominPrincipale": "1",
      "infosQualite": {
        "codeQualite": "Titulaire",
        "libQualite": "Membre titulaire",
        "libQualiteSex": "Membre titulaire"
      },
      "organesRefs": [
        "PO739530"
      ]
    },
    {
      "uid": "PM747760",
      "acteurRef": "PA721976",
      "legislature": "15",
      "typeOrgane": "GA",
      "dateDebut": "2018-01-19T01:00:00.000+01:00",
      "preseance": "20",
      "nominPrincipale": "1",
      "infosQualite": {
        "codeQualite": "Membre",
        "libQualite": "Membre",
        "libQualiteSex": "Membre"
      },
      "organesRefs": [
        "PO733292"
      ]
    },
    {
      "uid": "PM748598",
      "acteurRef": "PA721976",
      "legislature": "15",
      "typeOrgane": "GE",
      "dateDebut": "2018-02-01T01:00:00.000+01:00",
      "preseance": "20",
      "nominPrincipale": "0",
      "infosQualite": {
        "codeQualite": "Membre",
        "libQualite": "Membre",
        "libQualiteSex": "Membre"
      },
      "organesRefs": [
        "PO747084"
      ]
    },
    {
      "uid": "PM748600",
      "acteurRef": "PA721976",
      "legislature": "15",
      "typeOrgane": "GE",
      "dateDebut": "2018-02-01T01:00:00.000+01:00",
      "preseance": "4",
      "nominPrincipale": "1",
      "infosQualite": {
        "codeQualite": "Co-Président",
        "libQualite": "Co-Président",
        "libQualiteSex": "Co-Président"
      },
      "organesRefs": [
        "PO747084"
      ]
    },
    {
      "uid": "PM749183",
      "acteurRef": "PA721976",
      "legislature": "15",
      "typeOrgane": "GE",
      "dateDebut": "2018-02-09T01:00:00.000+01:00",
      "preseance": "20",
      "nominPrincipale": "1",
      "infosQualite": {
        "codeQualite": "Membre",
        "libQualite": "Membre",
        "libQualiteSex": "Membre"
      },
      "organesRefs": [
        "PO747210"
      ]
    },
    {
      "uid": "PM749297",
      "acteurRef": "PA721976",
      "legislature": "15",
      "typeOrgane": "GE",
      "dateDebut": "2018-02-08T01:00:00.000+01:00",
      "preseance": "20",
      "nominPrincipale": "0",
      "infosQualite": {
        "codeQualite": "Membre",
        "libQualite": "Membre",
        "libQualiteSex": "Membre"
      },
      "organesRefs": [
        "PO747266"
      ]
    },
    {
      "uid": "PM750513",
      "acteurRef": "PA721976",
      "legislature": "15",
      "typeOrgane": "GE",
      "dateDebut": "2018-02-15T01:00:00.000+01:00",
      "preseance": "20",
      "nominPrincipale": "0",
      "infosQualite": {
        "codeQualite": "Membre",
        "libQualite": "Membre",
        "libQualiteSex": "Membre"
      },
      "organesRefs": [
        "PO746816"
      ]
    },
    {
      "uid": "PM750890",
      "acteurRef": "PA721976",
      "legislature": "15",
      "typeOrgane": "GE",
      "dateDebut": "2018-02-20T01:00:00.000+01:00",
      "preseance": "20",
      "nominPrincipale": "0",
      "infosQualite": {
        "codeQualite": "Membre",
        "libQualite": "Membre",
        "libQualiteSex": "Membre"
      },
      "organesRefs": [
        "PO747099"
      ]
    },
    {
      "uid": "PM751029",
      "acteurRef": "PA721976",
      "legislature": "15",
      "typeOrgane": "GE",
      "dateDebut": "2018-02-19T01:00:00.000+01:00",
      "preseance": "20",
      "nominPrincipale": "1",
      "infosQualite": {
        "codeQualite": "Membre",
        "libQualite": "Membre",
        "libQualiteSex": "Membre"
      },
      "organesRefs": [
        "PO746880"
      ]
    },
    {
      "uid": "PM752535",
      "acteurRef": "PA721976",
      "legislature": "15",
      "typeOrgane": "GE",
      "dateDebut": "2018-03-06T01:00:00.000+01:00",
      "preseance": "20",
      "nominPrincipale": "0",
      "infosQualite": {
        "codeQualite": "Membre",
        "libQualite": "Membre",
        "libQualiteSex": "Membre"
      },
      "organesRefs": [
        "PO747200"
      ]
    },
    {
      "uid": "PM753018",
      "acteurRef": "PA721976",
      "legislature": "15",
      "typeOrgane": "GE",
      "dateDebut": "2018-03-07T01:00:00.000+01:00",
      "preseance": "12",
      "nominPrincipale": "1",
      "infosQualite": {
        "codeQualite": "Secrétaire",
        "libQualite": "Secrétaire",
        "libQualiteSex": "Secrétaire"
      },
      "organesRefs": [
        "PO747099"
      ]
    },
    {
      "uid": "PM753113",
      "acteurRef": "PA721976",
      "legislature": "15",
      "typeOrgane": "GE",
      "dateDebut": "2018-03-08T01:00:00.000+01:00",
      "preseance": "20",
      "nominPrincipale": "1",
      "infosQualite": {
        "codeQualite": "Membre",
        "libQualite": "Membre",
        "libQualiteSex": "Membre"
      },
      "organesRefs": [
        "PO747037"
      ]
    },
    {
      "uid": "PM753516",
      "acteurRef": "PA721976",
      "legislature": "15",
      "typeOrgane": "GE",
      "dateDebut": "2018-03-13T01:00:00.000+01:00",
      "preseance": "8",
      "nominPrincipale": "1",
      "infosQualite": {
        "codeQualite": "Vice-Président",
        "libQualite": "Vice-Président",
        "libQualiteSex": "Vice-Président"
      },
      "organesRefs": [
        "PO747266"
      ]
    },
    {
      "uid": "PM753652",
      "acteurRef": "PA721976",
      "legislature": "15",
      "typeOrgane": "GE",
      "dateDebut": "2018-03-15T01:00:00.000+01:00",
      "preseance": "20",
      "nominPrincipale": "0",
      "infosQualite": {
        "codeQualite": "Membre",
        "libQualite": "Membre",
        "libQualiteSex": "Membre"
      },
      "organesRefs": [
        "PO746992"
      ]
    },
    {
      "uid": "PM753918",
      "acteurRef": "PA721976",
      "legislature": "15",
      "typeOrgane": "GE",
      "dateDebut": "2018-03-20T01:00:00.000+01:00",
      "preseance": "8",
      "nominPrincipale": "1",
      "infosQualite": {
        "codeQualite": "Vice-Président",
        "libQualite": "Vice-Président",
        "libQualiteSex": "Vice-Président"
      },
      "organesRefs": [
        "PO746992"
      ]
    },
    {
      "uid": "PM754178",
      "acteurRef": "PA721976",
      "legislature": "15",
      "typeOrgane": "GE",
      "dateDebut": "2018-03-22T01:00:00.000+01:00",
      "preseance": "8",
      "nominPrincipale": "1",
      "infosQualite": {
        "codeQualite": "Vice-Président",
        "libQualite": "Vice-Président",
        "libQualiteSex": "Vice-Président"
      },
      "organesRefs": [
        "PO747200"
      ]
    },
    {
      "uid": "PM754890",
      "acteurRef": "PA721976",
      "legislature": "15",
      "typeOrgane": "GE",
      "dateDebut": "2018-03-02T01:00:00.000+01:00",
      "preseance": "20",
      "nominPrincipale": "1",
      "infosQualite": {
        "codeQualite": "Membre",
        "libQualite": "Membre",
        "libQualiteSex": "Membre"
      },
      "organesRefs": [
        "PO746852"
      ]
    },
    {
      "uid": "PM756854",
      "acteurRef": "PA721976",
      "legislature": "15",
      "typeOrgane": "GE",
      "dateDebut": "2018-04-12T02:00:00.000+02:00",
      "preseance": "12",
      "nominPrincipale": "1",
      "infosQualite": {
        "codeQualite": "Secrétaire",
        "libQualite": "Secrétaire",
        "libQualiteSex": "Secrétaire"
      },
      "organesRefs": [
        "PO746816"
      ]
    },
    {
      "uid": "PM757039",
      "acteurRef": "PA721976",
      "legislature": "15",
      "typeOrgane": "ORGEXTPARL",
      "dateDebut": "2018-03-08T01:00:00.000+01:00",
      "datePublication": "2018-03-09T01:00:00.000+01:00",
      "preseance": "20",
      "nominPrincipale": "1",
      "infosQualite": {
        "codeQualite": "Titulaire",
        "libQualite": "Membre titulaire",
        "libQualiteSex": "Membre titulaire"
      },
      "organesRefs": [
        "PO756933"
      ]
    },
    {
      "uid": "PM757557",
      "acteurRef": "PA721976",
      "legislature": "15",
      "typeOrgane": "DELEG",
      "dateDebut": "2018-07-05T02:00:00.000+02:00",
      "datePublication": "2018-07-05T02:00:00.000+02:00",
      "preseance": "20",
      "nominPrincipale": "1",
      "infosQualite": {
        "codeQualite": "Membre",
        "libQualite": "Membre",
        "libQualiteSex": "Membre"
      },
      "organesRefs": [
        "PO744127"
      ]
    },
    {
      "uid": "PM759339",
      "acteurRef": "PA721976",
      "legislature": "15",
      "typeOrgane": "MISINFO",
      "dateDebut": "2018-07-18T02:00:00.000+02:00",
      "preseance": "10",
      "nominPrincipale": "1",
      "infosQualite": {
        "codeQualite": "Membre",
        "libQualite": "Membre",
        "libQualiteSex": "Membre"
      },
      "organesRefs": [
        "PO758945"
      ]
    }
  ]
}