{
  "uid": "PO653262",
  "codeType": "MINISTERE",
  "libelle": "Ministère chargé des anciens combattants",
  "libelleEdition": "chargé des anciens combattants",
  "libelleAbrege": "Anciens combattants",
  "libelleAbrev": "ACO",
  "viMoDe": {
    "dateDebut": "2012-06-22T02:00:00.000+02:00",
    "dateFin": "2014-03-31T02:00:00.000+02:00"
  },
  "organeParentRef": "PO653199"
}