{
  "uid": "PO393105",
  "codeType": "GA",
  "libelle": "France-République du Kirghizistan",
  "libelleEdition": "de France-République du Kirghizistan",
  "libelleAbrege": "Kirghizistan",
  "libelleAbrev": "KIR",
  "viMoDe": {
    "dateAgrement": "2007-07-18T02:00:00.000+02:00",
    "dateFin": "2012-06-19T02:00:00.000+02:00"
  },
  "regime": "5ème République",
  "legislature": "13",
  "secretariat": {}
}