{
  "uid": "PO715915",
  "codeType": "MINISTERE",
  "libelle": "Secrétariat d'État, auprès du ministère de l'économie et des finances, chargé du numérique et de l'innovation",
  "libelleEdition": ", auprès du ministre de l'économie et des finances, chargée du numérique et de l'innovation",
  "libelleAbrege": "Numérique et innovation",
  "libelleAbrev": "NUM",
  "viMoDe": {
    "dateDebut": "2016-12-07T01:00:00.000+01:00",
    "dateFin": "2017-02-27T01:00:00.000+01:00"
  },
  "organeParentRef": "PO715793"
}