{
  "uid": "PO675848",
  "codeType": "GA",
  "libelle": "France-République démocratique du Congo",
  "libelleEdition": "de France-République démocratique du Congo",
  "libelleAbrege": "Congo (République démocratique du)",
  "libelleAbrev": "RDC",
  "viMoDe": {
    "dateAgrement": "2012-07-18T02:00:00.000+02:00",
    "dateFin": "2017-06-20T02:00:00.000+02:00"
  },
  "regime": "5ème République",
  "legislature": "14",
  "secretariat": {}
}