{
  "uid": "PA522",
  "etatCivil": {
    "ident": {
      "civ": "M.",
      "prenom": "Jean-Marie",
      "nom": "Binetruy",
      "alpha": "Binetruy"
    },
    "infoNaissance": {
      "dateNais": "1946-07-17T01:00:00.000+01:00",
      "villeNais": "Villers-le-Lac",
      "depNais": "Doubs",
      "paysNais": "France"
    }
  },
  "profession": {
    "libelleCourant": "Enseignant",
    "socProcInsee": {
      "catSocPro": "Professions intermédiaires de l'enseignement, de la santé, de la fonction publique et assimilés",
      "famSocPro": "Professions Intermédiaires"
    }
  },
  "adresses": [
    {
      "xsiType": "AdressePostale_Type",
      "uid": "AD13113",
      "type": "2",
      "typeLibelle": "Adresse publiée de circonscription",
      "poids": "21",
      "intitule": "Hôtel de Ville,",
      "complementAdresse": "BP 53095,",
      "codePostal": "25503",
      "ville": "Morteau"
    },
    {
      "xsiType": "AdresseTelephonique_Type",
      "uid": "AD13120",
      "type": "11",
      "typeLibelle": "Téléphone",
      "poids": "21",
      "adresseDeRattachement": "AD13113",
      "valElec": "03 81 68 56 56"
    },
    {
      "xsiType": "AdresseTelephonique_Type",
      "uid": "AD13122",
      "type": "12",
      "typeLibelle": "Télécopie",
      "poids": "21",
      "adresseDeRattachement": "AD13113",
      "valElec": "03 81 67 25 09"
    },
    {
      "xsiType": "AdressePostale_Type",
      "uid": "AD274957",
      "type": "2",
      "typeLibelle": "Adresse publiée de circonscription",
      "poids": "22",
      "intitule": "Permanence,",
      "numeroRue": "5",
      "nomRue": "Rue du Parc",
      "codePostal": "25300",
      "ville": "Pontarlier"
    },
    {
      "xsiType": "AdresseTelephonique_Type",
      "uid": "AD274961",
      "type": "11",
      "typeLibelle": "Téléphone",
      "poids": "22",
      "adresseDeRattachement": "AD274957",
      "valElec": "03 81 38 88 80"
    },
    {
      "xsiType": "AdresseTelephonique_Type",
      "uid": "AD274962",
      "type": "12",
      "typeLibelle": "Télécopie",
      "poids": "22",
      "adresseDeRattachement": "AD274957",
      "valElec": "03 81 38 86 27"
    },
    {
      "xsiType": "AdresseMail_Type",
      "uid": "AD275088",
      "type": "15",
      "typeLibelle": "Mèl",
      "valElec": "jean-marie.binetruy@wanadoo.fr"
    },
    {
      "xsiType": "AdresseSiteWeb_Type",
      "uid": "AD313807",
      "type": "22",
      "typeLibelle": "Site internet",
      "valElec": "jeanmariebinetruy.blogspirit.com/"
    },
    {
      "xsiType": "AdressePostale_Type",
      "uid": "AD386684",
      "type": "0",
      "typeLibelle": "Adresse officielle",
      "poids": "1",
      "intitule": "Assemblée nationale,",
      "numeroRue": "126",
      "nomRue": "Rue de l'Université,",
      "codePostal": "75355",
      "ville": "Paris 07 SP"
    },
    {
      "xsiType": "AdresseMail_Type",
      "uid": "AD391596",
      "type": "15",
      "typeLibelle": "Mèl",
      "valElec": "jmbinetruy@assemblee-nationale.fr"
    }
  ],
  "mandats": [
    {
      "uid": "PM386048",
      "acteurRef": "PA522",
      "legislature": "13",
      "typeOrgane": "ASSEMBLEE",
      "dateDebut": "2007-06-20T02:00:00.000+02:00",
      "dateFin": "2012-06-19T02:00:00.000+02:00",
      "preseance": "50",
      "nominPrincipale": "1",
      "infosQualite": {
        "codeQualite": "membre",
        "libQualite": "membre",
        "libQualiteSex": "membre"
      },
      "organesRefs": [
        "PO384266"
      ],
      "suppleant": {
        "dateDebut": "2007-06-20T02:00:00.000+02:00",
        "dateFin": "2012-06-19T02:00:00.000+02:00",
        "suppleantRef": "PA267108"
      },
      "election": {
        "lieu": {
          "region": "Bourgogne-Franche-Comté",
          "regionType": "Métropolitain",
          "departement": "Doubs",
          "numDepartement": "25",
          "numCirco": "5"
        },
        "causeMandat": "élections générales",
        "refCirconscription": "PO384373"
      },
      "mandature": {
        "datePriseFonction": "2007-06-20T02:00:00.000+02:00",
        "causeFin": "Fin de législature",
        "premiereElection": "1"
      }
    },
    {
      "uid": "PM387263",
      "acteurRef": "PA522",
      "legislature": "13",
      "typeOrgane": "GP",
      "dateDebut": "2007-06-20T02:00:00.000+02:00",
      "dateFin": "2007-06-26T02:00:00.000+02:00",
      "preseance": "28",
      "nominPrincipale": "1",
      "infosQualite": {
        "codeQualite": "Député non-inscrit",
        "libQualite": "Député non-inscrit",
        "libQualiteSex": "Député non-inscrit"
      },
      "organesRefs": [
        "PO387155"
      ]
    },
    {
      "uid": "PM389713",
      "acteurRef": "PA522",
      "legislature": "13",
      "typeOrgane": "GP",
      "dateDebut": "2007-06-27T02:00:00.000+02:00",
      "datePublication": "2007-06-27T02:00:00.000+02:00",
      "dateFin": "2012-06-19T02:00:00.000+02:00",
      "preseance": "20",
      "nominPrincipale": "1",
      "infosQualite": {
        "codeQualite": "Membre",
        "libQualite": "Membre du",
        "libQualiteSex": "Membre du"
      },
      "organesRefs": [
        "PO389395"
      ]
    },
    {
      "uid": "PM390834",
      "acteurRef": "PA522",
      "legislature": "13",
      "typeOrgane": "COMPER",
      "dateDebut": "2007-06-27T02:00:00.000+02:00",
      "datePublication": "2007-06-28T02:00:00.000+02:00",
      "dateFin": "2012-06-19T02:00:00.000+02:00",
      "preseance": "32",
      "nominPrincipale": "1",
      "infosQualite": {
        "codeQualite": "Membre",
        "libQualite": "Membre",
        "libQualiteSex": "Membre"
      },
      "organesRefs": [
        "PO59048"
      ]
    },
    {
      "uid": "PM403537",
      "acteurRef": "PA522",
      "legislature": "13",
      "typeOrgane": "GA",
      "dateDebut": "2007-11-13T01:00:00.000+01:00",
      "dateFin": "2012-06-19T02:00:00.000+02:00",
      "preseance": "20",
      "nominPrincipale": "1",
      "infosQualite": {
        "codeQualite": "Membre",
        "libQualite": "Membre",
        "libQualiteSex": "Membre"
      },
      "organesRefs": [
        "PO392674"
      ]
    },
    {
      "uid": "PM403538",
      "acteurRef": "PA522",
      "legislature": "13",
      "typeOrgane": "GA",
      "dateDebut": "2007-11-13T01:00:00.000+01:00",
      "dateFin": "2012-06-19T02:00:00.000+02:00",
      "preseance": "20",
      "nominPrincipale": "1",
      "infosQualite": {
        "codeQualite": "Membre",
        "libQualite": "Membre",
        "libQualiteSex": "Membre"
      },
      "organesRefs": [
        "PO393075"
      ]
    },
    {
      "uid": "PM403539",
      "acteurRef": "PA522",
      "legislature": "13",
      "typeOrgane": "GA",
      "dateDebut": "2007-11-13T01:00:00.000+01:00",
      "dateFin": "2012-06-19T02:00:00.000+02:00",
      "preseance": "20",
      "nominPrincipale": "1",
      "infosQualite": {
        "codeQualite": "Membre",
        "libQualite": "Membre",
        "libQualiteSex": "Membre"
      },
      "organesRefs": [
        "PO393413"
      ]
    },
    {
      "uid": "PM407222",
      "acteurRef": "PA522",
      "legislature": "13",
      "typeOrgane": "GE",
      "dateDebut": "2008-01-01T01:00:00.000+01:00",
      "dateFin": "2012-06-19T02:00:00.000+02:00",
      "preseance": "20",
      "nominPrincipale": "1",
      "infosQualite": {
        "codeQualite": "Membre",
        "libQualite": "Membre",
        "libQualiteSex": "Membre"
      },
      "organesRefs": [
        "PO402985"
      ]
    },
    {
      "uid": "PM409284",
      "acteurRef": "PA522",
      "legislature": "13",
      "typeOrgane": "COMPER",
      "dateDebut": "2008-02-06T01:00:00.000+01:00",
      "dateFin": "2012-06-19T02:00:00.000+02:00",
      "preseance": "500",
      "nominPrincipale": "0",
      "infosQualite": {
        "codeQualite": "Rapporteur spécial",
        "libQualite": "Rapporteur spécial au nom de la commission des finances : Solidarité, insertion et égalité des chances",
        "libQualiteSex": "Rapporteur spécial au nom de la commission des finances : Solidarité, insertion et égalité des chances"
      },
      "organesRefs": [
        "PO59048"
      ]
    },
    {
      "uid": "PM411262",
      "acteurRef": "PA522",
      "legislature": "13",
      "typeOrgane": "GE",
      "dateDebut": "2007-11-30T01:00:00.000+01:00",
      "dateFin": "2012-06-19T02:00:00.000+02:00",
      "preseance": "20",
      "nominPrincipale": "1",
      "infosQualite": {
        "codeQualite": "Membre",
        "libQualite": "Membre",
        "libQualiteSex": "Membre"
      },
      "organesRefs": [
        "PO402901"
      ]
    },
    {
      "uid": "PM412052",
      "acteurRef": "PA522",
      "legislature": "13",
      "typeOrgane": "GE",
      "dateDebut": "2008-01-30T01:00:00.000+01:00",
      "dateFin": "2012-06-19T02:00:00.000+02:00",
      "preseance": "20",
      "nominPrincipale": "1",
      "infosQualite": {
        "codeQualite": "Membre",
        "libQualite": "Membre",
        "libQualiteSex": "Membre"
      },
      "organesRefs": [
        "PO403111"
      ]
    },
    {
      "uid": "PM413462",
      "acteurRef": "PA522",
      "legislature": "13",
      "typeOrgane": "GE",
      "dateDebut": "2008-05-21T02:00:00.000+02:00",
      "dateFin": "2012-06-19T02:00:00.000+02:00",
      "preseance": "20",
      "nominPrincipale": "1",
      "infosQualite": {
        "codeQualite": "Membre",
        "libQualite": "Membre",
        "libQualiteSex": "Membre"
      },
      "organesRefs": [
        "PO403202"
      ]
    },
    {
      "uid": "PM416302",
      "acteurRef": "PA522",
      "legislature": "13",
      "typeOrgane": "GE",
      "dateDebut": "2008-02-06T01:00:00.000+01:00",
      "dateFin": "2012-06-19T02:00:00.000+02:00",
      "preseance": "20",
      "nominPrincipale": "1",
      "infosQualite": {
        "codeQualite": "Membre",
        "libQualite": "Membre",
        "libQualiteSex": "Membre"
      },
      "organesRefs": [
        "PO402931"
      ]
    },
    {
      "uid": "PM416904",
      "acteurRef": "PA522",
      "legislature": "13",
      "typeOrgane": "GE",
      "dateDebut": "2008-02-20T01:00:00.000+01:00",
      "dateFin": "2012-06-19T02:00:00.000+02:00",
      "preseance": "20",
      "nominPrincipale": "1",
      "infosQualite": {
        "codeQualite": "Membre",
        "libQualite": "Membre",
        "libQualiteSex": "Membre"
      },
      "organesRefs": [
        "PO402973"
      ]
    },
    {
      "uid": "PM417126",
      "acteurRef": "PA522",
      "legislature": "13",
      "typeOrgane": "GE",
      "dateDebut": "2008-12-17T01:00:00.000+01:00",
      "dateFin": "2012-06-19T02:00:00.000+02:00",
      "preseance": "8",
      "nominPrincipale": "1",
      "infosQualite": {
        "codeQualite": "Vice-Président",
        "libQualite": "Vice-Président",
        "libQualiteSex": "Vice-Président"
      },
      "organesRefs": [
        "PO402973"
      ]
    },
    {
      "uid": "PM418688",
      "acteurRef": "PA522",
      "legislature": "13",
      "typeOrgane": "GE",
      "dateDebut": "2009-03-03T01:00:00.000+01:00",
      "dateFin": "2012-06-19T02:00:00.000+02:00",
      "preseance": "20",
      "nominPrincipale": "1",
      "infosQualite": {
        "codeQualite": "Membre",
        "libQualite": "Membre",
        "libQualiteSex": "Membre"
      },
      "organesRefs": [
        "PO405837"
      ]
    },
    {
      "uid": "PM418817",
      "acteurRef": "PA522",
      "legislature": "13",
      "typeOrgane": "GE",
      "dateDebut": "2009-03-03T01:00:00.000+01:00",
      "dateFin": "2012-06-19T02:00:00.000+02:00",
      "preseance": "20",
      "nominPrincipale": "1",
      "infosQualite": {
        "codeQualite": "Membre",
        "libQualite": "Membre",
        "libQualiteSex": "Membre"
      },
      "organesRefs": [
        "PO416217"
      ]
    },
    {
      "uid": "PM422533",
      "acteurRef": "PA522",
      "legislature": "13",
      "typeOrgane": "CNPS",
      "dateDebut": "2009-12-09T01:00:00.000+01:00",
      "datePublication": "2009-12-10T01:00:00.000+01:00",
      "dateFin": "2010-07-06T02:00:00.000+02:00",
      "preseance": "20",
      "nominPrincipale": "1",
      "infosQualite": {
        "codeQualite": "Membre",
        "libQualite": "Membre",
        "libQualiteSex": "Membre"
      },
      "organesRefs": [
        "PO422492"
      ]
    },
    {
      "uid": "PM424243",
      "acteurRef": "PA522",
      "legislature": "13",
      "typeOrgane": "GE",
      "dateDebut": "2010-06-08T02:00:00.000+02:00",
      "dateFin": "2012-06-19T02:00:00.000+02:00",
      "preseance": "20",
      "nominPrincipale": "1",
      "infosQualite": {
        "codeQualite": "Membre",
        "libQualite": "Membre",
        "libQualiteSex": "Membre"
      },
      "organesRefs": [
        "PO422919"
      ]
    },
    {
      "uid": "PM424373",
      "acteurRef": "PA522",
      "legislature": "13",
      "typeOrgane": "GE",
      "dateDebut": "2010-02-08T01:00:00.000+01:00",
      "dateFin": "2012-06-19T02:00:00.000+02:00",
      "preseance": "20",
      "nominPrincipale": "1",
      "infosQualite": {
        "codeQualite": "Membre",
        "libQualite": "Membre",
        "libQualiteSex": "Membre"
      },
      "organesRefs": [
        "PO422900"
      ]
    },
    {
      "uid": "PM426912",
      "acteurRef": "PA522",
      "legislature": "13",
      "typeOrgane": "GE",
      "dateDebut": "2011-02-04T01:00:00.000+01:00",
      "dateFin": "2012-06-19T02:00:00.000+02:00",
      "preseance": "20",
      "nominPrincipale": "1",
      "infosQualite": {
        "codeQualite": "Membre",
        "libQualite": "Membre",
        "libQualiteSex": "Membre"
      },
      "organesRefs": [
        "PO425013"
      ]
    },
    {
      "uid": "PM428893",
      "acteurRef": "PA522",
      "legislature": "13",
      "typeOrgane": "CNPE",
      "dateDebut": "2011-06-15T02:00:00.000+02:00",
      "datePublication": "2011-06-16T02:00:00.000+02:00",
      "dateFin": "2011-12-06T01:00:00.000+01:00",
      "preseance": "20",
      "nominPrincipale": "1",
      "infosQualite": {
        "codeQualite": "Membre",
        "libQualite": "Membre",
        "libQualiteSex": "Membre"
      },
      "organesRefs": [
        "PO428765"
      ]
    },
    {
      "uid": "PM430687",
      "acteurRef": "PA522",
      "legislature": "13",
      "typeOrgane": "CNPS",
      "dateDebut": "2011-10-12T02:00:00.000+02:00",
      "datePublication": "2011-10-14T02:00:00.000+02:00",
      "dateFin": "2012-05-21T02:00:00.000+02:00",
      "preseance": "20",
      "nominPrincipale": "1",
      "infosQualite": {
        "codeQualite": "Membre",
        "libQualite": "Membre",
        "libQualiteSex": "Membre"
      },
      "organesRefs": [
        "PO430584"
      ]
    },
    {
      "uid": "PM440472",
      "acteurRef": "PA522",
      "legislature": "13",
      "typeOrgane": "GE",
      "dateDebut": "2011-12-07T01:00:00.000+01:00",
      "dateFin": "2012-06-19T02:00:00.000+02:00",
      "preseance": "20",
      "nominPrincipale": "1",
      "infosQualite": {
        "codeQualite": "Membre",
        "libQualite": "Membre",
        "libQualiteSex": "Membre"
      },
      "organesRefs": [
        "PO429727"
      ]
    }
  ]
}