{
  "uid": "PA333224",
  "etatCivil": {
    "ident": {
      "civ": "M.",
      "prenom": "Benoist",
      "nom": "Apparu",
      "alpha": "Apparu"
    },
    "infoNaissance": {
      "dateNais": "1969-11-24T01:00:00.000+01:00",
      "villeNais": "Toulouse",
      "depNais": "Haute-Garonne",
      "paysNais": "France"
    }
  },
  "profession": {
    "socProcInsee": {}
  },
  "adresses": [
    {
      "xsiType": "AdressePostale_Type",
      "uid": "AD386818",
      "type": "0",
      "typeLibelle": "Adresse officielle",
      "poids": "1",
      "intitule": "Assemblée nationale,",
      "numeroRue": "126",
      "nomRue": "Rue de l'Université,",
      "codePostal": "75355",
      "ville": "Paris 07 SP"
    },
    {
      "xsiType": "AdresseMail_Type",
      "uid": "AD388025",
      "type": "15",
      "typeLibelle": "Mèl",
      "valElec": "contact@benoistapparu.com"
    },
    {
      "xsiType": "AdressePostale_Type",
      "uid": "AD391202",
      "type": "2",
      "typeLibelle": "Adresse publiée de circonscription",
      "poids": "22",
      "intitule": "Permanence parlementaire",
      "numeroRue": "25",
      "nomRue": "Rue Prieur de la Marne",
      "codePostal": "51000",
      "ville": "Châlons-en-Champagne"
    },
    {
      "xsiType": "AdresseTelephonique_Type",
      "uid": "AD391203",
      "type": "11",
      "typeLibelle": "Téléphone",
      "poids": "22",
      "adresseDeRattachement": "AD391202",
      "valElec": "03 26 64 13 12"
    },
    {
      "xsiType": "AdresseTelephonique_Type",
      "uid": "AD391204",
      "type": "12",
      "typeLibelle": "Télécopie",
      "poids": "22",
      "adresseDeRattachement": "AD391202",
      "valElec": "03 26 64 79 79"
    },
    {
      "xsiType": "AdresseMail_Type",
      "uid": "AD392100",
      "type": "15",
      "typeLibelle": "Mèl",
      "valElec": "bapparu@assemblee-nationale.fr"
    }
  ],
  "mandats": [
    {
      "uid": "PM386013",
      "acteurRef": "PA333224",
      "legislature": "13",
      "typeOrgane": "ASSEMBLEE",
      "dateDebut": "2007-06-20T02:00:00.000+02:00",
      "dateFin": "2009-07-23T02:00:00.000+02:00",
      "preseance": "50",
      "nominPrincipale": "1",
      "infosQualite": {
        "codeQualite": "membre",
        "libQualite": "membre",
        "libQualiteSex": "membre"
      },
      "organesRefs": [
        "PO384266"
      ],
      "suppleant": {
        "dateDebut": "2007-06-20T02:00:00.000+02:00",
        "dateFin": "2009-07-23T02:00:00.000+02:00",
        "suppleantRef": "PA612"
      },
      "election": {
        "lieu": {
          "region": "Grand Est",
          "regionType": "Métropolitain",
          "departement": "Marne",
          "numDepartement": "51",
          "numCirco": "4"
        },
        "causeMandat": "élections générales",
        "refCirconscription": "PO384507"
      },
      "mandature": {
        "datePriseFonction": "2007-06-20T02:00:00.000+02:00",
        "causeFin": "Nomination comme membre du Gouvernement",
        "premiereElection": "0"
      }
    },
    {
      "uid": "PM387397",
      "acteurRef": "PA333224",
      "legislature": "13",
      "typeOrgane": "GP",
      "dateDebut": "2007-06-20T02:00:00.000+02:00",
      "dateFin": "2007-06-26T02:00:00.000+02:00",
      "preseance": "28",
      "nominPrincipale": "1",
      "infosQualite": {
        "codeQualite": "Député non-inscrit",
        "libQualite": "Député non-inscrit",
        "libQualiteSex": "Député non-inscrit"
      },
      "organesRefs": [
        "PO387155"
      ]
    },
    {
      "uid": "PM389695",
      "acteurRef": "PA333224",
      "legislature": "13",
      "typeOrgane": "GP",
      "dateDebut": "2007-06-27T02:00:00.000+02:00",
      "datePublication": "2007-06-27T02:00:00.000+02:00",
      "dateFin": "2009-07-23T02:00:00.000+02:00",
      "preseance": "20",
      "nominPrincipale": "1",
      "infosQualite": {
        "codeQualite": "Membre",
        "libQualite": "Membre du",
        "libQualiteSex": "Membre du"
      },
      "organesRefs": [
        "PO389395"
      ]
    },
    {
      "uid": "PM390440",
      "acteurRef": "PA333224",
      "legislature": "13",
      "typeOrgane": "COMPER",
      "dateDebut": "2007-06-27T02:00:00.000+02:00",
      "datePublication": "2007-06-28T02:00:00.000+02:00",
      "dateFin": "2009-06-30T02:00:00.000+02:00",
      "preseance": "32",
      "nominPrincipale": "1",
      "infosQualite": {
        "codeQualite": "Membre",
        "libQualite": "Membre",
        "libQualiteSex": "Membre"
      },
      "organesRefs": [
        "PO59045"
      ]
    },
    {
      "uid": "PM393944",
      "acteurRef": "PA333224",
      "legislature": "13",
      "typeOrgane": "CMP",
      "dateDebut": "2007-07-27T02:00:00.000+02:00",
      "datePublication": "2007-07-28T02:00:00.000+02:00",
      "dateFin": "2007-07-31T02:00:00.000+02:00",
      "preseance": "20",
      "nominPrincipale": "1",
      "infosQualite": {
        "codeQualite": "Titulaire",
        "libQualite": "Membre titulaire",
        "libQualiteSex": "Membre titulaire"
      },
      "organesRefs": [
        "PO393935"
      ]
    },
    {
      "uid": "PM394115",
      "acteurRef": "PA333224",
      "legislature": "13",
      "typeOrgane": "CMP",
      "dateDebut": "2007-07-31T02:00:00.000+02:00",
      "datePublication": "2007-08-01T02:00:00.000+02:00",
      "dateFin": "2007-07-31T02:00:00.000+02:00",
      "preseance": "16",
      "nominPrincipale": "1",
      "infosQualite": {
        "codeQualite": "Rapporteur",
        "libQualite": "Rapporteur",
        "libQualiteSex": "Rapporteur"
      },
      "organesRefs": [
        "PO393935"
      ]
    },
    {
      "uid": "PM394567",
      "acteurRef": "PA333224",
      "legislature": "13",
      "typeOrgane": "ORGEXTPARL",
      "dateDebut": "2007-08-01T02:00:00.000+02:00",
      "datePublication": "2007-08-02T02:00:00.000+02:00",
      "dateFin": "2009-07-23T02:00:00.000+02:00",
      "preseance": "20",
      "nominPrincipale": "1",
      "infosQualite": {
        "codeQualite": "Titulaire",
        "libQualite": "Membre titulaire",
        "libQualiteSex": "Membre titulaire"
      },
      "organesRefs": [
        "PO322345"
      ]
    },
    {
      "uid": "PM397447",
      "acteurRef": "PA333224",
      "legislature": "13",
      "typeOrgane": "GA",
      "dateDebut": "2007-10-09T02:00:00.000+02:00",
      "dateFin": "2009-07-23T02:00:00.000+02:00",
      "preseance": "20",
      "nominPrincipale": "1",
      "infosQualite": {
        "codeQualite": "Membre",
        "libQualite": "Membre",
        "libQualiteSex": "Membre"
      },
      "organesRefs": [
        "PO392669"
      ]
    },
    {
      "uid": "PM397448",
      "acteurRef": "PA333224",
      "legislature": "13",
      "typeOrgane": "GA",
      "dateDebut": "2007-10-09T02:00:00.000+02:00",
      "dateFin": "2009-07-23T02:00:00.000+02:00",
      "preseance": "20",
      "nominPrincipale": "1",
      "infosQualite": {
        "codeQualite": "Membre",
        "libQualite": "Membre",
        "libQualiteSex": "Membre"
      },
      "organesRefs": [
        "PO392724"
      ]
    },
    {
      "uid": "PM397449",
      "acteurRef": "PA333224",
      "legislature": "13",
      "typeOrgane": "GA",
      "dateDebut": "2007-10-09T02:00:00.000+02:00",
      "dateFin": "2009-07-23T02:00:00.000+02:00",
      "preseance": "20",
      "nominPrincipale": "1",
      "infosQualite": {
        "codeQualite": "Membre",
        "libQualite": "Membre",
        "libQualiteSex": "Membre"
      },
      "organesRefs": [
        "PO392810"
      ]
    },
    {
      "uid": "PM397450",
      "acteurRef": "PA333224",
      "legislature": "13",
      "typeOrgane": "GA",
      "dateDebut": "2007-10-09T02:00:00.000+02:00",
      "dateFin": "2009-07-23T02:00:00.000+02:00",
      "preseance": "20",
      "nominPrincipale": "1",
      "infosQualite": {
        "codeQualite": "Membre",
        "libQualite": "Membre",
        "libQualiteSex": "Membre"
      },
      "organesRefs": [
        "PO392860"
      ]
    },
    {
      "uid": "PM397451",
      "acteurRef": "PA333224",
      "legislature": "13",
      "typeOrgane": "GA",
      "dateDebut": "2007-10-09T02:00:00.000+02:00",
      "dateFin": "2009-07-23T02:00:00.000+02:00",
      "preseance": "20",
      "nominPrincipale": "1",
      "infosQualite": {
        "codeQualite": "Membre",
        "libQualite": "Membre",
        "libQualiteSex": "Membre"
      },
      "organesRefs": [
        "PO393025"
      ]
    },
    {
      "uid": "PM397452",
      "acteurRef": "PA333224",
      "legislature": "13",
      "typeOrgane": "GA",
      "dateDebut": "2007-10-09T02:00:00.000+02:00",
      "dateFin": "2009-07-23T02:00:00.000+02:00",
      "preseance": "20",
      "nominPrincipale": "1",
      "infosQualite": {
        "codeQualite": "Membre",
        "libQualite": "Membre",
        "libQualiteSex": "Membre"
      },
      "organesRefs": [
        "PO393090"
      ]
    },
    {
      "uid": "PM397453",
      "acteurRef": "PA333224",
      "legislature": "13",
      "typeOrgane": "GA",
      "dateDebut": "2007-10-09T02:00:00.000+02:00",
      "dateFin": "2009-07-23T02:00:00.000+02:00",
      "preseance": "20",
      "nominPrincipale": "1",
      "infosQualite": {
        "codeQualite": "Membre",
        "libQualite": "Membre",
        "libQualiteSex": "Membre"
      },
      "organesRefs": [
        "PO393177"
      ]
    },
    {
      "uid": "PM397454",
      "acteurRef": "PA333224",
      "legislature": "13",
      "typeOrgane": "GA",
      "dateDebut": "2007-10-09T02:00:00.000+02:00",
      "dateFin": "2009-07-23T02:00:00.000+02:00",
      "preseance": "20",
      "nominPrincipale": "1",
      "infosQualite": {
        "codeQualite": "Membre",
        "libQualite": "Membre",
        "libQualiteSex": "Membre"
      },
      "organesRefs": [
        "PO393238"
      ]
    },
    {
      "uid": "PM397455",
      "acteurRef": "PA333224",
      "legislature": "13",
      "typeOrgane": "GA",
      "dateDebut": "2007-10-09T02:00:00.000+02:00",
      "dateFin": "2009-07-23T02:00:00.000+02:00",
      "preseance": "20",
      "nominPrincipale": "1",
      "infosQualite": {
        "codeQualite": "Membre",
        "libQualite": "Membre",
        "libQualiteSex": "Membre"
      },
      "organesRefs": [
        "PO393443"
      ]
    },
    {
      "uid": "PM403962",
      "acteurRef": "PA333224",
      "legislature": "13",
      "typeOrgane": "GA",
      "dateDebut": "2007-11-21T01:00:00.000+01:00",
      "dateFin": "2009-07-23T02:00:00.000+02:00",
      "preseance": "8",
      "nominPrincipale": "1",
      "infosQualite": {
        "codeQualite": "Vice-Président",
        "libQualite": "Vice-Président",
        "libQualiteSex": "Vice-Président"
      },
      "organesRefs": [
        "PO392724"
      ]
    },
    {
      "uid": "PM404608",
      "acteurRef": "PA333224",
      "legislature": "13",
      "typeOrgane": "GE",
      "dateDebut": "2007-11-30T01:00:00.000+01:00",
      "dateFin": "2009-07-23T02:00:00.000+02:00",
      "preseance": "20",
      "nominPrincipale": "0",
      "infosQualite": {
        "codeQualite": "Membre",
        "libQualite": "Membre",
        "libQualiteSex": "Membre"
      },
      "organesRefs": [
        "PO402844"
      ]
    },
    {
      "uid": "PM404609",
      "acteurRef": "PA333224",
      "legislature": "13",
      "typeOrgane": "GE",
      "dateDebut": "2007-11-30T01:00:00.000+01:00",
      "dateFin": "2009-07-23T02:00:00.000+02:00",
      "preseance": "4",
      "nominPrincipale": "1",
      "infosQualite": {
        "codeQualite": "Co-Président",
        "libQualite": "Co-Président",
        "libQualiteSex": "Co-Président"
      },
      "organesRefs": [
        "PO402844"
      ]
    },
    {
      "uid": "PM406206",
      "acteurRef": "PA333224",
      "legislature": "13",
      "typeOrgane": "GE",
      "dateDebut": "2008-01-08T01:00:00.000+01:00",
      "dateFin": "2009-07-23T02:00:00.000+02:00",
      "preseance": "20",
      "nominPrincipale": "1",
      "infosQualite": {
        "codeQualite": "Membre",
        "libQualite": "Membre",
        "libQualiteSex": "Membre"
      },
      "organesRefs": [
        "PO403226"
      ]
    },
    {
      "uid": "PM406296",
      "acteurRef": "PA333224",
      "legislature": "13",
      "typeOrgane": "GE",
      "dateDebut": "2008-01-09T01:00:00.000+01:00",
      "dateFin": "2009-07-23T02:00:00.000+02:00",
      "preseance": "20",
      "nominPrincipale": "1",
      "infosQualite": {
        "codeQualite": "Membre",
        "libQualite": "Membre",
        "libQualiteSex": "Membre"
      },
      "organesRefs": [
        "PO403268"
      ]
    },
    {
      "uid": "PM406344",
      "acteurRef": "PA333224",
      "legislature": "13",
      "typeOrgane": "GE",
      "dateDebut": "2008-01-11T01:00:00.000+01:00",
      "dateFin": "2009-07-23T02:00:00.000+02:00",
      "preseance": "20",
      "nominPrincipale": "1",
      "infosQualite": {
        "codeQualite": "Membre",
        "libQualite": "Membre",
        "libQualiteSex": "Membre"
      },
      "organesRefs": [
        "PO402776"
      ]
    },
    {
      "uid": "PM406626",
      "acteurRef": "PA333224",
      "legislature": "13",
      "typeOrgane": "GE",
      "dateDebut": "2008-01-11T01:00:00.000+01:00",
      "dateFin": "2009-07-23T02:00:00.000+02:00",
      "preseance": "20",
      "nominPrincipale": "1",
      "infosQualite": {
        "codeQualite": "Membre",
        "libQualite": "Membre",
        "libQualiteSex": "Membre"
      },
      "organesRefs": [
        "PO402727"
      ]
    },
    {
      "uid": "PM407464",
      "acteurRef": "PA333224",
      "legislature": "13",
      "typeOrgane": "GE",
      "dateDebut": "2008-01-23T01:00:00.000+01:00",
      "dateFin": "2009-07-23T02:00:00.000+02:00",
      "preseance": "12",
      "nominPrincipale": "1",
      "infosQualite": {
        "codeQualite": "Secrétaire",
        "libQualite": "Secrétaire",
        "libQualiteSex": "Secrétaire"
      },
      "organesRefs": [
        "PO402776"
      ]
    },
    {
      "uid": "PM407771",
      "acteurRef": "PA333224",
      "legislature": "13",
      "typeOrgane": "GE",
      "dateDebut": "2008-01-28T01:00:00.000+01:00",
      "dateFin": "2009-07-23T02:00:00.000+02:00",
      "preseance": "20",
      "nominPrincipale": "1",
      "infosQualite": {
        "codeQualite": "Membre",
        "libQualite": "Membre",
        "libQualiteSex": "Membre"
      },
      "organesRefs": [
        "PO403520"
      ]
    },
    {
      "uid": "PM408191",
      "acteurRef": "PA333224",
      "legislature": "13",
      "typeOrgane": "GE",
      "dateDebut": "2008-01-30T01:00:00.000+01:00",
      "dateFin": "2009-07-23T02:00:00.000+02:00",
      "preseance": "20",
      "nominPrincipale": "1",
      "infosQualite": {
        "codeQualite": "Membre",
        "libQualite": "Membre",
        "libQualiteSex": "Membre"
      },
      "organesRefs": [
        "PO403129"
      ]
    },
    {
      "uid": "PM408289",
      "acteurRef": "PA333224",
      "legislature": "13",
      "typeOrgane": "ORGEXTPARL",
      "dateDebut": "2008-01-31T01:00:00.000+01:00",
      "datePublication": "2008-02-01T01:00:00.000+01:00",
      "dateFin": "2009-07-23T02:00:00.000+02:00",
      "preseance": "30",
      "nominPrincipale": "1",
      "infosQualite": {
        "codeQualite": "Suppléant",
        "libQualite": "Membre suppléant",
        "libQualiteSex": "Membre suppléant"
      },
      "organesRefs": [
        "PO408286"
      ]
    },
    {
      "uid": "PM409528",
      "acteurRef": "PA333224",
      "legislature": "13",
      "typeOrgane": "GE",
      "dateDebut": "2008-02-22T01:00:00.000+01:00",
      "dateFin": "2009-07-23T02:00:00.000+02:00",
      "preseance": "20",
      "nominPrincipale": "1",
      "infosQualite": {
        "codeQualite": "Membre",
        "libQualite": "Membre",
        "libQualiteSex": "Membre"
      },
      "organesRefs": [
        "PO403166"
      ]
    },
    {
      "uid": "PM409661",
      "acteurRef": "PA333224",
      "legislature": "13",
      "typeOrgane": "GE",
      "dateDebut": "2008-02-25T01:00:00.000+01:00",
      "dateFin": "2009-07-23T02:00:00.000+02:00",
      "preseance": "20",
      "nominPrincipale": "1",
      "infosQualite": {
        "codeQualite": "Membre",
        "libQualite": "Membre",
        "libQualiteSex": "Membre"
      },
      "organesRefs": [
        "PO403301"
      ]
    },
    {
      "uid": "PM413480",
      "acteurRef": "PA333224",
      "legislature": "13",
      "typeOrgane": "CMP",
      "dateDebut": "2008-05-20T02:00:00.000+02:00",
      "datePublication": "2008-05-22T02:00:00.000+02:00",
      "dateFin": "2008-06-16T02:00:00.000+02:00",
      "preseance": "28",
      "nominPrincipale": "1",
      "infosQualite": {
        "codeQualite": "Suppléant",
        "libQualite": "Membre suppléant",
        "libQualiteSex": "Membre suppléant"
      },
      "organesRefs": [
        "PO413346"
      ]
    },
    {
      "uid": "PM414391",
      "acteurRef": "PA333224",
      "legislature": "13",
      "typeOrgane": "GA",
      "dateDebut": "2008-06-11T02:00:00.000+02:00",
      "dateFin": "2009-07-23T02:00:00.000+02:00",
      "preseance": "8",
      "nominPrincipale": "1",
      "infosQualite": {
        "codeQualite": "Vice-Président",
        "libQualite": "Vice-Président",
        "libQualiteSex": "Vice-Président"
      },
      "organesRefs": [
        "PO393238"
      ]
    },
    {
      "uid": "PM414865",
      "acteurRef": "PA333224",
      "legislature": "13",
      "typeOrgane": "CMP",
      "dateDebut": "2008-07-18T02:00:00.000+02:00",
      "datePublication": "2008-07-19T02:00:00.000+02:00",
      "dateFin": "2008-07-23T02:00:00.000+02:00",
      "preseance": "28",
      "nominPrincipale": "1",
      "infosQualite": {
        "codeQualite": "Suppléant",
        "libQualite": "Membre suppléant",
        "libQualiteSex": "Membre suppléant"
      },
      "organesRefs": [
        "PO414843"
      ]
    },
    {
      "uid": "PM415012",
      "acteurRef": "PA333224",
      "legislature": "13",
      "typeOrgane": "CMP",
      "dateDebut": "2008-07-22T02:00:00.000+02:00",
      "datePublication": "2008-07-23T02:00:00.000+02:00",
      "dateFin": "2008-07-23T02:00:00.000+02:00",
      "preseance": "28",
      "nominPrincipale": "1",
      "infosQualite": {
        "codeQualite": "Suppléant",
        "libQualite": "Membre suppléant",
        "libQualiteSex": "Membre suppléant"
      },
      "organesRefs": [
        "PO414889"
      ]
    },
    {
      "uid": "PM415088",
      "acteurRef": "PA333224",
      "legislature": "13",
      "typeOrgane": "CMP",
      "dateDebut": "2008-07-23T02:00:00.000+02:00",
      "datePublication": "2008-07-24T02:00:00.000+02:00",
      "dateFin": "2008-07-23T02:00:00.000+02:00",
      "preseance": "20",
      "nominPrincipale": "1",
      "infosQualite": {
        "codeQualite": "Titulaire",
        "libQualite": "Membre titulaire",
        "libQualiteSex": "Membre titulaire"
      },
      "organesRefs": [
        "PO414999"
      ]
    },
    {
      "uid": "PM416097",
      "acteurRef": "PA333224",
      "legislature": "13",
      "typeOrgane": "GE",
      "dateDebut": "2008-10-08T02:00:00.000+02:00",
      "dateFin": "2009-07-23T02:00:00.000+02:00",
      "preseance": "20",
      "nominPrincipale": "1",
      "infosQualite": {
        "codeQualite": "Membre",
        "libQualite": "Membre",
        "libQualiteSex": "Membre"
      },
      "organesRefs": [
        "PO415352"
      ]
    },
    {
      "uid": "PM416203",
      "acteurRef": "PA333224",
      "legislature": "13",
      "typeOrgane": "GE",
      "dateDebut": "2008-10-13T02:00:00.000+02:00",
      "dateFin": "2009-07-23T02:00:00.000+02:00",
      "preseance": "20",
      "nominPrincipale": "1",
      "infosQualite": {
        "codeQualite": "Membre",
        "libQualite": "Membre",
        "libQualiteSex": "Membre"
      },
      "organesRefs": [
        "PO402808"
      ]
    },
    {
      "uid": "PM416439",
      "acteurRef": "PA333224",
      "legislature": "13",
      "typeOrgane": "CNPS",
      "dateDebut": "2008-10-28T01:00:00.000+01:00",
      "datePublication": "2008-10-29T01:00:00.000+01:00",
      "dateFin": "2009-07-01T02:00:00.000+02:00",
      "preseance": "20",
      "nominPrincipale": "1",
      "infosQualite": {
        "codeQualite": "Membre",
        "libQualite": "Membre",
        "libQualiteSex": "Membre"
      },
      "organesRefs": [
        "PO416249"
      ]
    },
    {
      "uid": "PM419594",
      "acteurRef": "PA333224",
      "typeOrgane": "MINISTERE",
      "dateDebut": "2009-06-23T02:00:00.000+02:00",
      "datePublication": "2009-06-24T02:00:00.000+02:00",
      "dateFin": "2010-11-13T01:00:00.000+01:00",
      "preseance": "50",
      "nominPrincipale": "1",
      "infosQualite": {
        "codeQualite": "Secrétaire d'État",
        "libQualite": "Secrétaire d'État",
        "libQualiteSex": "Secrétaire d'État"
      },
      "organesRefs": [
        "PO419592"
      ]
    },
    {
      "uid": "PM420482",
      "acteurRef": "PA333224",
      "legislature": "13",
      "typeOrgane": "COMPER",
      "dateDebut": "2009-07-01T02:00:00.000+02:00",
      "datePublication": "2009-07-01T02:00:00.000+02:00",
      "dateFin": "2009-07-23T02:00:00.000+02:00",
      "preseance": "32",
      "nominPrincipale": "1",
      "infosQualite": {
        "codeQualite": "Membre",
        "libQualite": "Membre",
        "libQualiteSex": "Membre"
      },
      "organesRefs": [
        "PO420120"
      ]
    },
    {
      "uid": "PM425797",
      "acteurRef": "PA333224",
      "typeOrgane": "MINISTERE",
      "dateDebut": "2010-11-14T01:00:00.000+01:00",
      "datePublication": "2010-11-16T01:00:00.000+01:00",
      "dateFin": "2012-02-22T01:00:00.000+01:00",
      "preseance": "50",
      "nominPrincipale": "1",
      "infosQualite": {
        "codeQualite": "Secrétaire d'État",
        "libQualite": "Secrétaire d'État",
        "libQualiteSex": "Secrétaire d'État"
      },
      "organesRefs": [
        "PO425722"
      ]
    },
    {
      "uid": "PM514480",
      "acteurRef": "PA333224",
      "typeOrgane": "MINISTERE",
      "dateDebut": "2012-02-22T01:00:00.000+01:00",
      "datePublication": "2012-02-23T01:00:00.000+01:00",
      "dateFin": "2012-05-10T02:00:00.000+02:00",
      "preseance": "30",
      "nominPrincipale": "1",
      "infosQualite": {
        "codeQualite": "Ministre",
        "libQualite": "Ministre",
        "libQualiteSex": "Ministre"
      },
      "organesRefs": [
        "PO514478"
      ]
    },
    {
      "uid": "PM642582",
      "acteurRef": "PA333224",
      "legislature": "13",
      "typeOrgane": "ASSEMBLEE",
      "dateDebut": "2007-06-20T02:00:00.000+02:00",
      "dateFin": "2012-06-19T02:00:00.000+02:00",
      "preseance": "50",
      "nominPrincipale": "1",
      "infosQualite": {
        "codeQualite": "membre",
        "libQualite": "membre",
        "libQualiteSex": "membre"
      },
      "organesRefs": [
        "PO384266"
      ],
      "suppleant": {
        "dateDebut": "2007-06-20T02:00:00.000+02:00",
        "dateFin": "2012-06-19T02:00:00.000+02:00",
        "suppleantRef": "PA612"
      },
      "election": {
        "lieu": {
          "region": "Grand Est",
          "regionType": "Métropolitain",
          "departement": "Marne",
          "numDepartement": "51",
          "numCirco": "4"
        },
        "causeMandat": "reprise de l'exercice du mandat d'un ancien membre du Gouvernement",
        "refCirconscription": "PO384507"
      },
      "mandature": {
        "datePriseFonction": "2012-06-17T02:00:00.000+02:00",
        "causeFin": "Fin de législature",
        "premiereElection": "0",
        "mandatRemplaceRef": "PM386013"
      }
    },
    {
      "uid": "PM642616",
      "acteurRef": "PA333224",
      "legislature": "13",
      "typeOrgane": "GP",
      "dateDebut": "2012-06-17T02:00:00.000+02:00",
      "dateFin": "2012-06-19T02:00:00.000+02:00",
      "preseance": "28",
      "nominPrincipale": "1",
      "infosQualite": {
        "codeQualite": "Député non-inscrit",
        "libQualite": "Député non-inscrit",
        "libQualiteSex": "Député non-inscrit"
      },
      "organesRefs": [
        "PO387155"
      ]
    },
    {
      "uid": "PM645354",
      "acteurRef": "PA333224",
      "legislature": "14",
      "typeOrgane": "ASSEMBLEE",
      "dateDebut": "2012-06-20T02:00:00.000+02:00",
      "dateFin": "2017-06-20T02:00:00.000+02:00",
      "preseance": "50",
      "nominPrincipale": "1",
      "infosQualite": {
        "codeQualite": "membre",
        "libQualite": "membre",
        "libQualiteSex": "membre"
      },
      "organesRefs": [
        "PO644420"
      ],
      "suppleant": {
        "dateDebut": "2012-06-20T02:00:00.000+02:00",
        "dateFin": "2017-06-20T02:00:00.000+02:00",
        "suppleantRef": "PA642840"
      },
      "election": {
        "lieu": {
          "region": "Grand Est",
          "regionType": "Métropolitain",
          "departement": "Marne",
          "numDepartement": "51",
          "numCirco": "4"
        },
        "causeMandat": "élections générales",
        "refCirconscription": "PO644661"
      },
      "mandature": {
        "datePriseFonction": "2012-06-20T02:00:00.000+02:00",
        "causeFin": "Fin de législature",
        "premiereElection": "1"
      }
    },
    {
      "uid": "PM656328",
      "acteurRef": "PA333224",
      "legislature": "14",
      "typeOrgane": "GP",
      "dateDebut": "2012-06-26T02:00:00.000+02:00",
      "datePublication": "2012-06-27T02:00:00.000+02:00",
      "dateFin": "2015-06-01T02:00:00.000+02:00",
      "preseance": "20",
      "nominPrincipale": "1",
      "infosQualite": {
        "codeQualite": "Membre",
        "libQualite": "Membre du",
        "libQualiteSex": "Membre du"
      },
      "organesRefs": [
        "PO656006"
      ]
    },
    {
      "uid": "PM657017",
      "acteurRef": "PA333224",
      "legislature": "14",
      "typeOrgane": "COMPER",
      "dateDebut": "2012-06-28T02:00:00.000+02:00",
      "datePublication": "2012-06-28T02:00:00.000+02:00",
      "dateFin": "2017-06-20T02:00:00.000+02:00",
      "preseance": "32",
      "nominPrincipale": "1",
      "infosQualite": {
        "codeQualite": "Membre",
        "libQualite": "Membre",
        "libQualiteSex": "Membre"
      },
      "organesRefs": [
        "PO419604"
      ]
    },
    {
      "uid": "PM679117",
      "acteurRef": "PA333224",
      "legislature": "14",
      "typeOrgane": "ORGEXTPARL",
      "dateDebut": "2012-10-04T02:00:00.000+02:00",
      "datePublication": "2012-10-05T02:00:00.000+02:00",
      "dateFin": "2017-06-20T02:00:00.000+02:00",
      "preseance": "20",
      "nominPrincipale": "1",
      "infosQualite": {
        "codeQualite": "Titulaire",
        "libQualite": "Membre titulaire",
        "libQualiteSex": "Membre titulaire"
      },
      "organesRefs": [
        "PO415381"
      ]
    },
    {
      "uid": "PM685425",
      "acteurRef": "PA333224",
      "typeOrgane": "PARPOL",
      "dateDebut": "2012-12-01T01:00:00.000+01:00",
      "dateFin": "2015-11-30T01:00:00.000+01:00",
      "preseance": "5",
      "nominPrincipale": "1",
      "infosQualite": {
        "codeQualite": "Membre",
        "libQualite": "Membre",
        "libQualiteSex": "Membre"
      },
      "organesRefs": [
        "PO684942"
      ]
    },
    {
      "uid": "PM692716",
      "acteurRef": "PA333224",
      "legislature": "14",
      "typeOrgane": "GE",
      "dateDebut": "2013-03-15T01:00:00.000+01:00",
      "dateFin": "2017-06-20T02:00:00.000+02:00",
      "preseance": "20",
      "nominPrincipale": "1",
      "infosQualite": {
        "codeQualite": "Membre",
        "libQualite": "Membre",
        "libQualiteSex": "Membre"
      },
      "organesRefs": [
        "PO686896"
      ]
    },
    {
      "uid": "PM693495",
      "acteurRef": "PA333224",
      "legislature": "14",
      "typeOrgane": "GE",
      "dateDebut": "2013-01-21T01:00:00.000+01:00",
      "dateFin": "2017-06-20T02:00:00.000+02:00",
      "preseance": "20",
      "nominPrincipale": "1",
      "infosQualite": {
        "codeQualite": "Membre",
        "libQualite": "Membre",
        "libQualiteSex": "Membre"
      },
      "organesRefs": [
        "PO686213"
      ]
    },
    {
      "uid": "PM695495",
      "acteurRef": "PA333224",
      "legislature": "14",
      "typeOrgane": "CMP",
      "dateDebut": "2013-06-24T02:00:00.000+02:00",
      "datePublication": "2013-06-25T02:00:00.000+02:00",
      "dateFin": "2013-07-16T02:00:00.000+02:00",
      "preseance": "28",
      "nominPrincipale": "1",
      "infosQualite": {
        "codeQualite": "Suppléant",
        "libQualite": "Membre suppléant",
        "libQualiteSex": "Membre suppléant"
      },
      "organesRefs": [
        "PO695475"
      ]
    },
    {
      "uid": "PM699996",
      "acteurRef": "PA333224",
      "legislature": "14",
      "typeOrgane": "CMP",
      "dateDebut": "2014-02-07T01:00:00.000+01:00",
      "datePublication": "2014-02-08T01:00:00.000+01:00",
      "dateFin": "2014-02-27T01:00:00.000+01:00",
      "preseance": "20",
      "nominPrincipale": "1",
      "infosQualite": {
        "codeQualite": "Titulaire",
        "libQualite": "Membre titulaire",
        "libQualiteSex": "Membre titulaire"
      },
      "organesRefs": [
        "PO699751"
      ]
    },
    {
      "uid": "PM707407",
      "acteurRef": "PA333224",
      "legislature": "14",
      "typeOrgane": "MISINFO",
      "dateDebut": "2014-12-17T01:00:00.000+01:00",
      "dateFin": "2015-07-08T02:00:00.000+02:00",
      "preseance": "10",
      "nominPrincipale": "1",
      "infosQualite": {
        "codeQualite": "Membre",
        "libQualite": "Membre",
        "libQualiteSex": "Membre"
      },
      "organesRefs": [
        "PO707403"
      ]
    },
    {
      "uid": "PM708126",
      "acteurRef": "PA333224",
      "legislature": "14",
      "typeOrgane": "GP",
      "dateDebut": "2015-06-02T02:00:00.000+02:00",
      "datePublication": "2015-06-02T02:00:00.000+02:00",
      "dateFin": "2017-06-20T02:00:00.000+02:00",
      "preseance": "20",
      "nominPrincipale": "1",
      "infosQualite": {
        "codeQualite": "Membre",
        "libQualite": "Membre du",
        "libQualiteSex": "Membre du"
      },
      "organesRefs": [
        "PO707869"
      ]
    },
    {
      "uid": "PM710406",
      "acteurRef": "PA333224",
      "typeOrgane": "PARPOL",
      "dateDebut": "2015-12-01T01:00:00.000+01:00",
      "dateFin": "2017-06-20T02:00:00.000+02:00",
      "preseance": "5",
      "nominPrincipale": "1",
      "infosQualite": {
        "codeQualite": "Membre",
        "libQualite": "Membre",
        "libQualiteSex": "Membre"
      },
      "organesRefs": [
        "PO710396"
      ]
    },
    {
      "uid": "PM711213",
      "acteurRef": "PA333224",
      "legislature": "14",
      "typeOrgane": "MISINFO",
      "dateDebut": "2016-01-20T01:00:00.000+01:00",
      "dateFin": "2016-09-28T02:00:00.000+02:00",
      "preseance": "10",
      "nominPrincipale": "0",
      "infosQualite": {
        "codeQualite": "Membre",
        "libQualite": "Membre",
        "libQualiteSex": "Membre"
      },
      "organesRefs": [
        "PO711210"
      ]
    },
    {
      "uid": "PM711215",
      "acteurRef": "PA333224",
      "legislature": "14",
      "typeOrgane": "MISINFO",
      "dateDebut": "2016-01-20T01:00:00.000+01:00",
      "dateFin": "2016-09-28T02:00:00.000+02:00",
      "preseance": "5",
      "nominPrincipale": "1",
      "infosQualite": {
        "codeQualite": "Co-rapporteur",
        "libQualite": "Co-rapporteur",
        "libQualiteSex": "Co-rapporteur"
      },
      "organesRefs": [
        "PO711210"
      ]
    },
    {
      "uid": "PM712622",
      "acteurRef": "PA333224",
      "legislature": "14",
      "typeOrgane": "CNPS",
      "dateDebut": "2016-05-04T02:00:00.000+02:00",
      "datePublication": "2016-05-04T02:00:00.000+02:00",
      "dateFin": "2017-02-20T01:00:00.000+01:00",
      "preseance": "20",
      "nominPrincipale": "1",
      "infosQualite": {
        "codeQualite": "Membre",
        "libQualite": "Membre",
        "libQualiteSex": "Membre"
      },
      "organesRefs": [
        "PO712376"
      ]
    },
    {
      "uid": "PM15419594",
      "acteurRef": "PA333224",
      "typeOrgane": "GOUVERNEMENT",
      "dateDebut": "2009-06-23T02:00:00.000+02:00",
      "datePublication": "2009-06-24T02:00:00.000+02:00",
      "dateFin": "2010-11-13T01:00:00.000+01:00",
      "preseance": "50",
      "nominPrincipale": "1",
      "infosQualite": {
        "codeQualite": "membre",
        "libQualite": "membre",
        "libQualiteSex": "membre"
      },
      "organesRefs": [
        "PO384206"
      ]
    },
    {
      "uid": "PM15425797",
      "acteurRef": "PA333224",
      "typeOrgane": "GOUVERNEMENT",
      "dateDebut": "2010-11-14T01:00:00.000+01:00",
      "datePublication": "2010-11-16T01:00:00.000+01:00",
      "dateFin": "2012-05-10T02:00:00.000+02:00",
      "preseance": "50",
      "nominPrincipale": "1",
      "infosQualite": {
        "codeQualite": "membre",
        "libQualite": "membre",
        "libQualiteSex": "membre"
      },
      "organesRefs": [
        "PO425695"
      ]
    }
  ]
}