{
  "uid": "PO690795",
  "codeType": "CMP",
  "libelle": "Commission mixte paritaire chargée de proposer un texte sur les dispositions restant en discussion du projet de loi portant création du contrat de génération",
  "libelleEdition": "du projet de loi portant création du contrat de génération",
  "libelleAbrege": "Contrat de génération",
  "libelleAbrev": "CMP_492",
  "viMoDe": {
    "dateDebut": "2013-02-07T01:00:00.000+01:00",
    "dateFin": "2013-03-03T01:00:00.000+01:00"
  },
  "regime": "5ème République",
  "legislature": "14",
  "secretariat": {}
}