{
  "@xmlns:xsi": "http://www.w3.org/2001/XMLSchema-instance",
  "uid": "PO744090",
  "codeType": "MINISTERE",
  "libelle": "Secrétariat d'État auprès du Premier ministre, porte-parole du Gouvernement",
  "libelleEdition": "auprès du Premier ministre, porte-parole du Gouvernement",
  "libelleAbrege": "Porte-parole du Gouvernement",
  "libelleAbrev": "PPAR",
  "viMoDe": {
    "dateDebut": "2017-11-25T01:00:00.000+01:00",
    "dateAgrement": null,
    "dateFin": null
  },
  "organeParent": "PO725688"
}