{
  "@xmlns:xsi": "http://www.w3.org/2001/XMLSchema-instance",
  "uid": "PO421626",
  "codeType": "CMP",
  "libelle": "Commission mixte paritaire chargée de proposer un texte sur les dispositions restant en discussion du projet de loi relatif au transfert aux départements des parcs de l'équipement et à l'évolution de la situation des ouvriers des parcs et ateliers",
  "libelleEdition": "duprojet de loi relatif au transfert aux départements des parcs de l'équipement et à l'évolution de la situation des ouvriers des parcs et ateliers",
  "libelleAbrege": "Parcs de l'équipement",
  "libelleAbrev": "1585",
  "viMoDe": {
    "dateDebut": "2009-09-22T02:00:00.000+02:00",
    "dateAgrement": null,
    "dateFin": "2009-10-26T01:00:00.000+01:00"
  },
  "organeParent": null,
  "chambre": null,
  "regime": "5ème République",
  "legislature": "13",
  "secretariat": {
    "secretaire01": null,
    "secretaire02": null
  }
}