{
  "@xmlns:xsi": "http://www.w3.org/2001/XMLSchema-instance",
  "uid": "PO684932",
  "codeType": "PARPOL",
  "libelle": "Parti socialiste",
  "libelleEdition": "Parti socialiste",
  "libelleAbrege": "Parti socialiste",
  "libelleAbrev": "PS",
  "viMoDe": {
    "dateDebut": null,
    "dateAgrement": null,
    "dateFin": null
  },
  "organeParent": null
}