{
  "uid": {
    "@xsi:type": "IdActeur_type",
    "#text": "PA2713"
  },
  "etatCivil": {
    "ident": {
      "civ": "M.",
      "prenom": "Roger-Gérard",
      "nom": "Schwartzenberg",
      "alpha": "Schwartzenberg",
      "trigramme": null
    },
    "infoNaissance": {
      "dateNais": "1943-04-17T02:00:00.000+02:00",
      "villeNais": "Pau",
      "depNais": "Pyrénées-Atlantiques",
      "paysNais": "France"
    },
    "dateDeces": null
  },
  "profession": {
    "libelleCourant": "Professeur d'Université",
    "socProcINSEE": {
      "catSocPro": "Cadres de la fonction publique, professions intellectuelles et  artistiques",
      "famSocPro": "Cadres et professions intellectuelles supérieures"
    }
  },
  "uri_hatvp": null,
  "adresses": {
    "adresse": [
      {
        "@xsi:type": "AdressePostale_Type",
        "uid": "AD45768",
        "type": "0",
        "typeLibelle": "Adresse officielle",
        "poids": "1",
        "adresseDeRattachement": null,
        "intitule": "Assemblée nationale",
        "numeroRue": "126",
        "nomRue": "Rue de l'université",
        "complementAdresse": null,
        "codePostal": "75355",
        "ville": "Paris 07 SP"
      },
      {
        "@xsi:type": "AdresseMail_Type",
        "uid": "AD191336",
        "type": "15",
        "typeLibelle": "Mèl",
        "poids": null,
        "adresseDeRattachement": null,
        "valElec": "rgschwartzenberg@assemblee-nationale.fr"
      }
    ]
  },
  "mandats": {
    "mandat": [
      {
        "@xmlns:xsi": "http://www.w3.org/2001/XMLSchema-instance",
        "uid": "PM645148",
        "acteurRef": "PA2713",
        "legislature": "14",
        "typeOrgane": "ASSEMBLEE",
        "dateDebut": "2012-06-20T02:00:00.000+02:00",
        "datePublication": null,
        "dateFin": "2017-06-20T02:00:00.000+02:00",
        "preseance": "50",
        "nominPrincipale": "1",
        "infosQualite": {
          "codeQualite": "membre",
          "libQualite": "membre",
          "libQualiteSex": "membre"
        },
        "organes": {
          "organeRef": "PO644420"
        },
        "suppleants": {
          "suppleant": {
            "dateDebut": "2012-06-20T02:00:00.000+02:00",
            "dateFin": "2017-06-20T02:00:00.000+02:00",
            "suppleantRef": "PA643040"
          }
        },
        "chambre": null,
        "election": {
          "lieu": {
            "region": "Ile-de-France",
            "regionType": "Métropolitain",
            "departement": "Val-de-Marne",
            "numDepartement": "94",
            "numCirco": "3"
          },
          "causeMandat": "élections générales",
          "refCirconscription": "PO644957"
        },
        "mandature": {
          "datePriseFonction": "2012-06-20T02:00:00.000+02:00",
          "causeFin": "Fin de législature",
          "premiereElection": "1",
          "placeHemicycle": null,
          "mandatRemplaceRef": null
        },
        "collaborateurs": null
      },
      {
        "uid": "PM656615",
        "acteurRef": "PA2713",
        "legislature": "14",
        "typeOrgane": "GP",
        "dateDebut": "2012-06-26T02:00:00.000+02:00",
        "datePublication": "2012-06-27T02:00:00.000+02:00",
        "dateFin": "2017-06-20T02:00:00.000+02:00",
        "preseance": "20",
        "nominPrincipale": "0",
        "infosQualite": {
          "codeQualite": "Membre",
          "libQualite": "Membre du",
          "libQualiteSex": "Membre du"
        },
        "organes": {
          "organeRef": "PO656022"
        }
      },
      {
        "uid": "PM656617",
        "acteurRef": "PA2713",
        "legislature": "14",
        "typeOrgane": "GP",
        "dateDebut": "2012-06-26T02:00:00.000+02:00",
        "datePublication": "2012-06-27T02:00:00.000+02:00",
        "dateFin": "2017-06-20T02:00:00.000+02:00",
        "preseance": "1",
        "nominPrincipale": "1",
        "infosQualite": {
          "codeQualite": "Président",
          "libQualite": "Président du",
          "libQualiteSex": "Président du"
        },
        "organes": {
          "organeRef": "PO656022"
        }
      },
      {
        "uid": "PM656968",
        "acteurRef": "PA2713",
        "legislature": "14",
        "typeOrgane": "COMPER",
        "dateDebut": "2012-06-28T02:00:00.000+02:00",
        "datePublication": "2012-06-28T02:00:00.000+02:00",
        "dateFin": "2015-02-26T01:00:00.000+01:00",
        "preseance": "32",
        "nominPrincipale": "1",
        "infosQualite": {
          "codeQualite": "Membre",
          "libQualite": "Membre",
          "libQualiteSex": "Membre"
        },
        "organes": {
          "organeRef": "PO59051"
        }
      },
      {
        "uid": "PM677180",
        "acteurRef": "PA2713",
        "legislature": "14",
        "typeOrgane": "COMNL",
        "dateDebut": "2012-07-25T02:00:00.000+02:00",
        "datePublication": "2012-07-25T02:00:00.000+02:00",
        "dateFin": "2015-01-14T01:00:00.000+01:00",
        "preseance": "20",
        "nominPrincipale": "1",
        "infosQualite": {
          "codeQualite": "Membre",
          "libQualite": "Membre",
          "libQualiteSex": "Membre"
        },
        "organes": {
          "organeRef": "PO420375"
        },
        "suppleants": null
      },
      {
        "uid": "PM677449",
        "acteurRef": "PA2713",
        "legislature": "14",
        "typeOrgane": "COMNL",
        "dateDebut": "2012-07-26T02:00:00.000+02:00",
        "datePublication": "2012-07-27T02:00:00.000+02:00",
        "dateFin": "2015-01-14T01:00:00.000+01:00",
        "preseance": "2",
        "nominPrincipale": "1",
        "infosQualite": {
          "codeQualite": "Membre de droit du Bureau",
          "libQualite": "Membre de droit du Bureau",
          "libQualiteSex": "Membre de droit du Bureau"
        },
        "organes": {
          "organeRef": "PO420375"
        },
        "suppleants": null
      },
      {
        "@xmlns:xsi": "http://www.w3.org/2001/XMLSchema-instance",
        "uid": "PM684020",
        "acteurRef": "PA2713",
        "legislature": "14",
        "typeOrgane": "GA",
        "dateDebut": "2012-11-07T01:00:00.000+01:00",
        "datePublication": null,
        "dateFin": "2017-06-20T02:00:00.000+02:00",
        "preseance": "20",
        "nominPrincipale": "1",
        "infosQualite": {
          "codeQualite": "Membre",
          "libQualite": "Membre",
          "libQualiteSex": "Membre"
        },
        "organes": {
          "organeRef": "PO675799"
        }
      },
      {
        "@xmlns:xsi": "http://www.w3.org/2001/XMLSchema-instance",
        "uid": "PM684393",
        "acteurRef": "PA2713",
        "legislature": "14",
        "typeOrgane": "GA",
        "dateDebut": "2012-11-14T01:00:00.000+01:00",
        "datePublication": null,
        "dateFin": "2017-06-20T02:00:00.000+02:00",
        "preseance": "8",
        "nominPrincipale": "1",
        "infosQualite": {
          "codeQualite": "Vice-Président",
          "libQualite": "Vice-Président",
          "libQualiteSex": "Vice-Président"
        },
        "organes": {
          "organeRef": "PO675799"
        }
      },
      {
        "@xmlns:xsi": "http://www.w3.org/2001/XMLSchema-instance",
        "uid": "PM685908",
        "acteurRef": "PA2713",
        "legislature": null,
        "typeOrgane": "PARPOL",
        "dateDebut": "2012-12-01T01:00:00.000+01:00",
        "datePublication": null,
        "dateFin": "2017-06-20T02:00:00.000+02:00",
        "preseance": "5",
        "nominPrincipale": "1",
        "infosQualite": {
          "codeQualite": "Membre",
          "libQualite": "Membre",
          "libQualiteSex": "Membre"
        },
        "organes": {
          "organeRef": "PO684934"
        }
      },
      {
        "@xmlns:xsi": "http://www.w3.org/2001/XMLSchema-instance",
        "uid": "PM686395",
        "acteurRef": "PA2713",
        "legislature": "14",
        "typeOrgane": "GE",
        "dateDebut": "2012-12-12T01:00:00.000+01:00",
        "datePublication": null,
        "dateFin": "2017-06-20T02:00:00.000+02:00",
        "preseance": "20",
        "nominPrincipale": "0",
        "infosQualite": {
          "codeQualite": "Membre",
          "libQualite": "Membre",
          "libQualiteSex": "Membre"
        },
        "organes": {
          "organeRef": "PO686389"
        }
      },
      {
        "@xmlns:xsi": "http://www.w3.org/2001/XMLSchema-instance",
        "uid": "PM686396",
        "acteurRef": "PA2713",
        "legislature": "14",
        "typeOrgane": "GE",
        "dateDebut": "2012-12-12T01:00:00.000+01:00",
        "datePublication": null,
        "dateFin": "2017-06-20T02:00:00.000+02:00",
        "preseance": "1",
        "nominPrincipale": "1",
        "infosQualite": {
          "codeQualite": "Président",
          "libQualite": "Président",
          "libQualiteSex": "Président"
        },
        "organes": {
          "organeRef": "PO686389"
        }
      },
      {
        "@xmlns:xsi": "http://www.w3.org/2001/XMLSchema-instance",
        "uid": "PM690228",
        "acteurRef": "PA2713",
        "legislature": "14",
        "typeOrgane": "CONFPT",
        "dateDebut": "2012-06-20T02:00:00.000+02:00",
        "datePublication": null,
        "dateFin": "2017-06-20T02:00:00.000+02:00",
        "preseance": "20",
        "nominPrincipale": "1",
        "infosQualite": {
          "codeQualite": "Membre",
          "libQualite": "Membre",
          "libQualiteSex": "Membre"
        },
        "organes": {
          "organeRef": "PO690204"
        },
        "suppleants": null,
        "chambre": null,
        "election": {
          "lieu": {
            "region": null,
            "regionType": null,
            "departement": null,
            "numDepartement": null,
            "numCirco": null
          },
          "causeMandat": null
        },
        "mandature": {
          "datePriseFonction": null,
          "causeFin": null,
          "premiereElection": "0",
          "placeHemicycle": null,
          "mandatRemplaceRef": null
        },
        "collaborateurs": null
      },
      {
        "@xmlns:xsi": "http://www.w3.org/2001/XMLSchema-instance",
        "uid": "PM705999",
        "acteurRef": "PA2713",
        "legislature": "14",
        "typeOrgane": "GE",
        "dateDebut": "2015-01-27T01:00:00.000+01:00",
        "datePublication": null,
        "dateFin": "2017-06-20T02:00:00.000+02:00",
        "preseance": "20",
        "nominPrincipale": "1",
        "infosQualite": {
          "codeQualite": "Membre",
          "libQualite": "Membre",
          "libQualiteSex": "Membre"
        },
        "organes": {
          "organeRef": "PO705526"
        }
      },
      {
        "uid": "PM706418",
        "acteurRef": "PA2713",
        "legislature": "14",
        "typeOrgane": "COMPER",
        "dateDebut": "2015-02-27T01:00:00.000+01:00",
        "datePublication": "2015-02-27T01:00:00.000+01:00",
        "dateFin": "2015-03-16T01:00:00.000+01:00",
        "preseance": "32",
        "nominPrincipale": "1",
        "infosQualite": {
          "codeQualite": "Membre",
          "libQualite": "Membre",
          "libQualiteSex": "Membre"
        },
        "organes": {
          "organeRef": "PO419865"
        }
      },
      {
        "uid": "PM706616",
        "acteurRef": "PA2713",
        "legislature": "14",
        "typeOrgane": "COMPER",
        "dateDebut": "2015-03-17T01:00:00.000+01:00",
        "datePublication": "2015-03-17T01:00:00.000+01:00",
        "dateFin": "2015-06-11T02:00:00.000+02:00",
        "preseance": "32",
        "nominPrincipale": "1",
        "infosQualite": {
          "codeQualite": "Membre",
          "libQualite": "Membre",
          "libQualiteSex": "Membre"
        },
        "organes": {
          "organeRef": "PO59051"
        }
      },
      {
        "uid": "PM708461",
        "acteurRef": "PA2713",
        "legislature": "14",
        "typeOrgane": "COMPER",
        "dateDebut": "2015-06-11T02:00:00.000+02:00",
        "datePublication": "2015-06-12T02:00:00.000+02:00",
        "dateFin": "2015-06-22T02:00:00.000+02:00",
        "preseance": "32",
        "nominPrincipale": "1",
        "infosQualite": {
          "codeQualite": "Membre",
          "libQualite": "Membre",
          "libQualiteSex": "Membre"
        },
        "organes": {
          "organeRef": "PO419610"
        }
      },
      {
        "uid": "PM708693",
        "acteurRef": "PA2713",
        "legislature": "14",
        "typeOrgane": "COMPER",
        "dateDebut": "2015-06-22T02:00:00.000+02:00",
        "datePublication": "2015-06-23T02:00:00.000+02:00",
        "dateFin": "2016-02-09T01:00:00.000+01:00",
        "preseance": "32",
        "nominPrincipale": "1",
        "infosQualite": {
          "codeQualite": "Membre",
          "libQualite": "Membre",
          "libQualiteSex": "Membre"
        },
        "organes": {
          "organeRef": "PO59051"
        }
      },
      {
        "uid": "PM711503",
        "acteurRef": "PA2713",
        "legislature": "14",
        "typeOrgane": "COMPER",
        "dateDebut": "2016-02-10T01:00:00.000+01:00",
        "datePublication": "2016-02-10T01:00:00.000+01:00",
        "dateFin": "2016-02-11T01:00:00.000+01:00",
        "preseance": "32",
        "nominPrincipale": "1",
        "infosQualite": {
          "codeQualite": "Membre",
          "libQualite": "Membre",
          "libQualiteSex": "Membre"
        },
        "organes": {
          "organeRef": "PO59048"
        }
      },
      {
        "uid": "PM711549",
        "acteurRef": "PA2713",
        "legislature": "14",
        "typeOrgane": "COMPER",
        "dateDebut": "2016-02-12T01:00:00.000+01:00",
        "datePublication": "2016-02-12T01:00:00.000+01:00",
        "dateFin": "2016-03-02T01:00:00.000+01:00",
        "preseance": "32",
        "nominPrincipale": "1",
        "infosQualite": {
          "codeQualite": "Membre",
          "libQualite": "Membre",
          "libQualiteSex": "Membre"
        },
        "organes": {
          "organeRef": "PO59051"
        }
      },
      {
        "uid": "PM711692",
        "acteurRef": "PA2713",
        "legislature": "14",
        "typeOrgane": "COMPER",
        "dateDebut": "2016-03-02T01:00:00.000+01:00",
        "datePublication": "2016-03-03T01:00:00.000+01:00",
        "dateFin": "2016-03-14T01:00:00.000+01:00",
        "preseance": "32",
        "nominPrincipale": "1",
        "infosQualite": {
          "codeQualite": "Membre",
          "libQualite": "Membre",
          "libQualiteSex": "Membre"
        },
        "organes": {
          "organeRef": "PO59048"
        }
      },
      {
        "uid": "PM711884",
        "acteurRef": "PA2713",
        "legislature": "14",
        "typeOrgane": "COMPER",
        "dateDebut": "2016-03-15T01:00:00.000+01:00",
        "datePublication": "2016-03-15T01:00:00.000+01:00",
        "dateFin": "2016-04-25T02:00:00.000+02:00",
        "preseance": "32",
        "nominPrincipale": "1",
        "infosQualite": {
          "codeQualite": "Membre",
          "libQualite": "Membre",
          "libQualiteSex": "Membre"
        },
        "organes": {
          "organeRef": "PO59051"
        }
      },
      {
        "uid": "PM712427",
        "acteurRef": "PA2713",
        "legislature": "14",
        "typeOrgane": "COMPER",
        "dateDebut": "2016-04-26T02:00:00.000+02:00",
        "datePublication": "2016-04-26T02:00:00.000+02:00",
        "dateFin": "2016-04-27T02:00:00.000+02:00",
        "preseance": "32",
        "nominPrincipale": "1",
        "infosQualite": {
          "codeQualite": "Membre",
          "libQualite": "Membre",
          "libQualiteSex": "Membre"
        },
        "organes": {
          "organeRef": "PO59048"
        }
      },
      {
        "uid": "PM712469",
        "acteurRef": "PA2713",
        "legislature": "14",
        "typeOrgane": "COMPER",
        "dateDebut": "2016-04-27T02:00:00.000+02:00",
        "datePublication": "2016-04-28T02:00:00.000+02:00",
        "dateFin": "2017-06-20T02:00:00.000+02:00",
        "preseance": "32",
        "nominPrincipale": "1",
        "infosQualite": {
          "codeQualite": "Membre",
          "libQualite": "Membre",
          "libQualiteSex": "Membre"
        },
        "organes": {
          "organeRef": "PO59051"
        }
      }
    ]
  },
  "@xmlns:xsi": "http://www.w3.org/2001/XMLSchema-instance"
}