{
  "@xmlns:xsi": "http://www.w3.org/2001/XMLSchema-instance",
  "uid": "PO746768",
  "codeType": "GE",
  "libelle": "Déchets ménagers",
  "libelleEdition": "DÉCHETS MÉNAGERS",
  "libelleAbrege": "DÉCHETS MÉNAGERS",
  "libelleAbrev": "DÉCHETSMÉN",
  "viMoDe": {
    "dateDebut": null,
    "dateAgrement": "2017-12-20T01:00:00.000+01:00",
    "dateFin": null
  },
  "organeParent": null,
  "chambre": null,
  "regime": "5ème République",
  "legislature": "15",
  "secretariat": {
    "secretaire01": "Mme Emmanuelle Faure",
    "secretaire02": null
  }
}