{
  "@xmlns:xsi": "http://www.w3.org/2001/XMLSchema-instance",
  "uid": "PO729999",
  "codeType": "MINISTERE",
  "libelle": "Ministère de l'éducation nationale",
  "libelleEdition": "de l'éducation nationale",
  "libelleAbrege": "Éducation nationale",
  "libelleAbrev": "MEN",
  "viMoDe": {
    "dateDebut": "2017-06-22T02:00:00.000+02:00",
    "dateAgrement": null,
    "dateFin": "2018-10-16T02:00:00.000+02:00"
  },
  "organeParent": "PO725688"
}