{
  "@xmlns:xsi": "http://www.w3.org/2001/XMLSchema-instance",
  "uid": "PO711611",
  "codeType": "MINISTERE",
  "libelle": "Secrétariat d’Etat, auprès du ministère de la ville, de la jeunesse et des sports, chargé de la ville",
  "libelleEdition": "auprès du ministre de la ville, de la jeunesse et des sports, chargée de la ville",
  "libelleAbrege": "Ville",
  "libelleAbrev": "VIL",
  "viMoDe": {
    "dateDebut": "2016-02-12T01:00:00.000+01:00",
    "dateAgrement": null,
    "dateFin": "2016-12-06T01:00:00.000+01:00"
  },
  "organeParent": "PO702883"
}