{
  "@xmlns:xsi": "http://www.w3.org/2001/XMLSchema-instance",
  "uid": "PO421237",
  "codeType": "CMP",
  "libelle": "Commission mixte paritaire chargée de proposer un texte sur les dispositions restant en discussion du projet de loi organique relatif à l'évolution institutionnelle de la Nouvelle-Calédonie et de Mayotte",
  "libelleEdition": "du projet de loi organique relatif à l'évolution institutionnelle de la Nouvelle-Calédonie et de Mayotte",
  "libelleAbrege": "L.O évolution  Nouvelle Calédonie",
  "libelleAbrev": "467-08-09",
  "viMoDe": {
    "dateDebut": "2009-07-20T02:00:00.000+02:00",
    "dateAgrement": null,
    "dateFin": "2009-09-01T02:00:00.000+02:00"
  },
  "organeParent": null,
  "chambre": null,
  "regime": "5ème République",
  "legislature": "13",
  "secretariat": {
    "secretaire01": null,
    "secretaire02": null
  }
}