{
  "uid": {
    "@xsi:type": "IdActeur_type",
    "#text": "PA719052"
  },
  "etatCivil": {
    "ident": {
      "civ": "M.",
      "prenom": "Loïc",
      "nom": "Kervran",
      "alpha": "Kervran",
      "trigramme": "LKE"
    },
    "infoNaissance": {
      "dateNais": "1984-02-11T01:00:00.000+01:00",
      "villeNais": "Moulins",
      "depNais": "Allier",
      "paysNais": "France"
    },
    "dateDeces": null
  },
  "profession": {
    "libelleCourant": "Autre cadre (secteur privé)",
    "socProcINSEE": {
      "catSocPro": "Cadres d'entreprise",
      "famSocPro": "Cadres et professions intellectuelles supérieures"
    }
  },
  "uri_hatvp": "https://www.hatvp.fr/pages_nominatives/kervran-loic",
  "adresses": {
    "adresse": [
      {
        "@xsi:type": "AdressePostale_Type",
        "uid": "AD719054",
        "type": "0",
        "typeLibelle": "Adresse officielle",
        "poids": "1",
        "adresseDeRattachement": null,
        "intitule": "Assemblée nationale",
        "numeroRue": "126",
        "nomRue": "Rue de l'Université,",
        "complementAdresse": null,
        "codePostal": "75355",
        "ville": "Paris 07 SP"
      },
      {
        "@xsi:type": "AdresseMail_Type",
        "uid": "AD727999",
        "type": "15",
        "typeLibelle": "Mèl",
        "poids": null,
        "adresseDeRattachement": null,
        "valElec": "loic.kervran@assemblee-nationale.fr"
      },
      {
        "@xsi:type": "AdresseSiteWeb_Type",
        "uid": "AD728434",
        "type": "24",
        "typeLibelle": "Twitter",
        "poids": null,
        "adresseDeRattachement": null,
        "valElec": "@LoicKervran18"
      },
      {
        "@xsi:type": "AdresseSiteWeb_Type",
        "uid": "AD747574",
        "type": "25",
        "typeLibelle": "Facebook",
        "poids": null,
        "adresseDeRattachement": null,
        "valElec": "facebook.com/LoicKervran18"
      },
      {
        "@xsi:type": "AdresseTelephonique_Type",
        "uid": "AD757929",
        "type": "11",
        "typeLibelle": "Téléphone",
        "poids": "1",
        "adresseDeRattachement": "AD719054",
        "valElec": "01.40.63.76.62"
      }
    ]
  },
  "mandats": {
    "mandat": [
      {
        "@xmlns:xsi": "http://www.w3.org/2001/XMLSchema-instance",
        "uid": "PM722544",
        "acteurRef": "PA719052",
        "legislature": "15",
        "typeOrgane": "ASSEMBLEE",
        "dateDebut": "2017-06-18T02:00:00.000+02:00",
        "datePublication": null,
        "dateFin": null,
        "preseance": "50",
        "nominPrincipale": "1",
        "infosQualite": {
          "codeQualite": "membre",
          "libQualite": "membre",
          "libQualiteSex": "membre"
        },
        "organes": {
          "organeRef": "PO717460"
        },
        "suppleants": {
          "suppleant": {
            "dateDebut": "2017-06-18T02:00:00.000+02:00",
            "dateFin": null,
            "suppleantRef": "PA719056"
          }
        },
        "chambre": null,
        "election": {
          "lieu": {
            "region": "Centre-Val de Loire",
            "regionType": "Métropolitain",
            "departement": "Cher",
            "numDepartement": "18",
            "numCirco": "3"
          },
          "causeMandat": "élections générales",
          "refCirconscription": "PO717628"
        },
        "mandature": {
          "datePriseFonction": "2017-06-21T02:00:00.000+02:00",
          "causeFin": null,
          "premiereElection": "0",
          "placeHemicycle": "388",
          "mandatRemplaceRef": null
        },
        "collaborateurs": {
          "collaborateur": [
            {
              "qualite": "M.",
              "prenom": "Ludwig",
              "nom": "Speter-Lejeune",
              "dateDebut": null,
              "dateFin": null
            },
            {
              "qualite": "Mme",
              "prenom": "Jeanne",
              "nom": "Romero",
              "dateDebut": null,
              "dateFin": null
            },
            {
              "qualite": "Mme",
              "prenom": "Eve",
              "nom": "Roehrig",
              "dateDebut": null,
              "dateFin": null
            }
          ]
        }
      },
      {
        "@xmlns:xsi": "http://www.w3.org/2001/XMLSchema-instance",
        "uid": "PM724313",
        "acteurRef": "PA719052",
        "legislature": "15",
        "typeOrgane": "GP",
        "dateDebut": "2017-06-21T02:00:00.000+02:00",
        "datePublication": null,
        "dateFin": "2017-06-26T02:00:00.000+02:00",
        "preseance": "28",
        "nominPrincipale": "1",
        "infosQualite": {
          "codeQualite": "Député non-inscrit",
          "libQualite": "Député non-inscrit",
          "libQualiteSex": "Député non-inscrit"
        },
        "organes": {
          "organeRef": "PO723569"
        }
      },
      {
        "@xmlns:xsi": "http://www.w3.org/2001/XMLSchema-instance",
        "uid": "PM731006",
        "acteurRef": "PA719052",
        "legislature": "15",
        "typeOrgane": "GP",
        "dateDebut": "2017-06-27T02:00:00.000+02:00",
        "datePublication": "2017-06-28T02:00:00.000+02:00",
        "dateFin": null,
        "preseance": "20",
        "nominPrincipale": "1",
        "infosQualite": {
          "codeQualite": "Membre",
          "libQualite": "Membre du",
          "libQualiteSex": "Membre du"
        },
        "organes": {
          "organeRef": "PO730964"
        }
      },
      {
        "@xmlns:xsi": "http://www.w3.org/2001/XMLSchema-instance",
        "uid": "PM731983",
        "acteurRef": "PA719052",
        "legislature": "15",
        "typeOrgane": "COMPER",
        "dateDebut": "2017-06-29T02:00:00.000+02:00",
        "datePublication": "2017-06-29T02:00:00.000+02:00",
        "dateFin": null,
        "preseance": "32",
        "nominPrincipale": "1",
        "infosQualite": {
          "codeQualite": "Membre",
          "libQualite": "Membre",
          "libQualiteSex": "Membre"
        },
        "organes": {
          "organeRef": "PO59046"
        }
      },
      {
        "@xmlns:xsi": "http://www.w3.org/2001/XMLSchema-instance",
        "uid": "PM733758",
        "acteurRef": "PA719052",
        "legislature": "15",
        "typeOrgane": "OFFPAR",
        "dateDebut": "2017-07-25T02:00:00.000+02:00",
        "datePublication": "2017-07-25T02:00:00.000+02:00",
        "dateFin": null,
        "preseance": "24",
        "nominPrincipale": "0",
        "infosQualite": {
          "codeQualite": "Membre",
          "libQualite": "Membre",
          "libQualiteSex": "Membre"
        },
        "organes": {
          "organeRef": "PO402232"
        },
        "suppleants": null
      },
      {
        "@xmlns:xsi": "http://www.w3.org/2001/XMLSchema-instance",
        "uid": "PM733762",
        "acteurRef": "PA719052",
        "legislature": "15",
        "typeOrgane": "OFFPAR",
        "dateDebut": "2017-07-25T02:00:00.000+02:00",
        "datePublication": "2017-07-25T02:00:00.000+02:00",
        "dateFin": null,
        "preseance": "12",
        "nominPrincipale": "1",
        "infosQualite": {
          "codeQualite": "Membre nommé par le Président de l'Assemblée nationale",
          "libQualite": "Membre nommé par le Président de l'Assemblée nationale",
          "libQualiteSex": "Membre nommé par le Président de l'Assemblée nationale"
        },
        "organes": {
          "organeRef": "PO402232"
        },
        "suppleants": null
      },
      {
        "@xmlns:xsi": "http://www.w3.org/2001/XMLSchema-instance",
        "uid": "PM735159",
        "acteurRef": "PA719052",
        "legislature": "15",
        "typeOrgane": "GA",
        "dateDebut": "2017-09-26T02:00:00.000+02:00",
        "datePublication": null,
        "dateFin": null,
        "preseance": "20",
        "nominPrincipale": "0",
        "infosQualite": {
          "codeQualite": "Membre",
          "libQualite": "Membre",
          "libQualiteSex": "Membre"
        },
        "organes": {
          "organeRef": "PO733352"
        }
      },
      {
        "@xmlns:xsi": "http://www.w3.org/2001/XMLSchema-instance",
        "uid": "PM735160",
        "acteurRef": "PA719052",
        "legislature": "15",
        "typeOrgane": "GA",
        "dateDebut": "2017-09-26T02:00:00.000+02:00",
        "datePublication": null,
        "dateFin": null,
        "preseance": "1",
        "nominPrincipale": "1",
        "infosQualite": {
          "codeQualite": "Président",
          "libQualite": "Président",
          "libQualiteSex": "Président"
        },
        "organes": {
          "organeRef": "PO733352"
        }
      },
      {
        "@xmlns:xsi": "http://www.w3.org/2001/XMLSchema-instance",
        "uid": "PM739275",
        "acteurRef": "PA719052",
        "legislature": "15",
        "typeOrgane": "GEVI",
        "dateDebut": "2017-10-11T02:00:00.000+02:00",
        "datePublication": null,
        "dateFin": null,
        "preseance": "20",
        "nominPrincipale": "1",
        "infosQualite": {
          "codeQualite": "Membre",
          "libQualite": "Membre",
          "libQualiteSex": "Membre"
        },
        "organes": {
          "organeRef": "PO733462"
        }
      },
      {
        "@xmlns:xsi": "http://www.w3.org/2001/XMLSchema-instance",
        "uid": "PM739276",
        "acteurRef": "PA719052",
        "legislature": "15",
        "typeOrgane": "GA",
        "dateDebut": "2017-10-11T02:00:00.000+02:00",
        "datePublication": null,
        "dateFin": null,
        "preseance": "20",
        "nominPrincipale": "1",
        "infosQualite": {
          "codeQualite": "Membre",
          "libQualite": "Membre",
          "libQualiteSex": "Membre"
        },
        "organes": {
          "organeRef": "PO733022"
        }
      },
      {
        "@xmlns:xsi": "http://www.w3.org/2001/XMLSchema-instance",
        "uid": "PM739277",
        "acteurRef": "PA719052",
        "legislature": "15",
        "typeOrgane": "GA",
        "dateDebut": "2017-10-11T02:00:00.000+02:00",
        "datePublication": null,
        "dateFin": null,
        "preseance": "20",
        "nominPrincipale": "1",
        "infosQualite": {
          "codeQualite": "Membre",
          "libQualite": "Membre",
          "libQualiteSex": "Membre"
        },
        "organes": {
          "organeRef": "PO733032"
        }
      },
      {
        "@xmlns:xsi": "http://www.w3.org/2001/XMLSchema-instance",
        "uid": "PM739278",
        "acteurRef": "PA719052",
        "legislature": "15",
        "typeOrgane": "GA",
        "dateDebut": "2017-10-11T02:00:00.000+02:00",
        "datePublication": null,
        "dateFin": null,
        "preseance": "20",
        "nominPrincipale": "0",
        "infosQualite": {
          "codeQualite": "Membre",
          "libQualite": "Membre",
          "libQualiteSex": "Membre"
        },
        "organes": {
          "organeRef": "PO733147"
        }
      },
      {
        "@xmlns:xsi": "http://www.w3.org/2001/XMLSchema-instance",
        "uid": "PM739279",
        "acteurRef": "PA719052",
        "legislature": "15",
        "typeOrgane": "GA",
        "dateDebut": "2017-10-11T02:00:00.000+02:00",
        "datePublication": null,
        "dateFin": null,
        "preseance": "20",
        "nominPrincipale": "1",
        "infosQualite": {
          "codeQualite": "Membre",
          "libQualite": "Membre",
          "libQualiteSex": "Membre"
        },
        "organes": {
          "organeRef": "PO733187"
        }
      },
      {
        "@xmlns:xsi": "http://www.w3.org/2001/XMLSchema-instance",
        "uid": "PM739280",
        "acteurRef": "PA719052",
        "legislature": "15",
        "typeOrgane": "GA",
        "dateDebut": "2017-10-11T02:00:00.000+02:00",
        "datePublication": null,
        "dateFin": null,
        "preseance": "20",
        "nominPrincipale": "1",
        "infosQualite": {
          "codeQualite": "Membre",
          "libQualite": "Membre",
          "libQualiteSex": "Membre"
        },
        "organes": {
          "organeRef": "PO733202"
        }
      },
      {
        "@xmlns:xsi": "http://www.w3.org/2001/XMLSchema-instance",
        "uid": "PM739281",
        "acteurRef": "PA719052",
        "legislature": "15",
        "typeOrgane": "GA",
        "dateDebut": "2017-10-11T02:00:00.000+02:00",
        "datePublication": null,
        "dateFin": null,
        "preseance": "20",
        "nominPrincipale": "1",
        "infosQualite": {
          "codeQualite": "Membre",
          "libQualite": "Membre",
          "libQualiteSex": "Membre"
        },
        "organes": {
          "organeRef": "PO733317"
        }
      },
      {
        "@xmlns:xsi": "http://www.w3.org/2001/XMLSchema-instance",
        "uid": "PM739282",
        "acteurRef": "PA719052",
        "legislature": "15",
        "typeOrgane": "GA",
        "dateDebut": "2017-10-11T02:00:00.000+02:00",
        "datePublication": null,
        "dateFin": null,
        "preseance": "20",
        "nominPrincipale": "1",
        "infosQualite": {
          "codeQualite": "Membre",
          "libQualite": "Membre",
          "libQualiteSex": "Membre"
        },
        "organes": {
          "organeRef": "PO733362"
        }
      },
      {
        "@xmlns:xsi": "http://www.w3.org/2001/XMLSchema-instance",
        "uid": "PM739283",
        "acteurRef": "PA719052",
        "legislature": "15",
        "typeOrgane": "GA",
        "dateDebut": "2017-10-11T02:00:00.000+02:00",
        "datePublication": null,
        "dateFin": null,
        "preseance": "20",
        "nominPrincipale": "1",
        "infosQualite": {
          "codeQualite": "Membre",
          "libQualite": "Membre",
          "libQualiteSex": "Membre"
        },
        "organes": {
          "organeRef": "PO733367"
        }
      },
      {
        "@xmlns:xsi": "http://www.w3.org/2001/XMLSchema-instance",
        "uid": "PM739284",
        "acteurRef": "PA719052",
        "legislature": "15",
        "typeOrgane": "GA",
        "dateDebut": "2017-10-11T02:00:00.000+02:00",
        "datePublication": null,
        "dateFin": null,
        "preseance": "20",
        "nominPrincipale": "1",
        "infosQualite": {
          "codeQualite": "Membre",
          "libQualite": "Membre",
          "libQualiteSex": "Membre"
        },
        "organes": {
          "organeRef": "PO733407"
        }
      },
      {
        "@xmlns:xsi": "http://www.w3.org/2001/XMLSchema-instance",
        "uid": "PM739285",
        "acteurRef": "PA719052",
        "legislature": "15",
        "typeOrgane": "GA",
        "dateDebut": "2017-10-11T02:00:00.000+02:00",
        "datePublication": null,
        "dateFin": null,
        "preseance": "20",
        "nominPrincipale": "0",
        "infosQualite": {
          "codeQualite": "Membre",
          "libQualite": "Membre",
          "libQualiteSex": "Membre"
        },
        "organes": {
          "organeRef": "PO733442"
        }
      },
      {
        "@xmlns:xsi": "http://www.w3.org/2001/XMLSchema-instance",
        "uid": "PM739286",
        "acteurRef": "PA719052",
        "legislature": "15",
        "typeOrgane": "GA",
        "dateDebut": "2017-10-11T02:00:00.000+02:00",
        "datePublication": null,
        "dateFin": null,
        "preseance": "20",
        "nominPrincipale": "1",
        "infosQualite": {
          "codeQualite": "Membre",
          "libQualite": "Membre",
          "libQualiteSex": "Membre"
        },
        "organes": {
          "organeRef": "PO733482"
        }
      },
      {
        "@xmlns:xsi": "http://www.w3.org/2001/XMLSchema-instance",
        "uid": "PM739287",
        "acteurRef": "PA719052",
        "legislature": "15",
        "typeOrgane": "GA",
        "dateDebut": "2017-10-11T02:00:00.000+02:00",
        "datePublication": null,
        "dateFin": null,
        "preseance": "20",
        "nominPrincipale": "1",
        "infosQualite": {
          "codeQualite": "Membre",
          "libQualite": "Membre",
          "libQualiteSex": "Membre"
        },
        "organes": {
          "organeRef": "PO733547"
        }
      },
      {
        "@xmlns:xsi": "http://www.w3.org/2001/XMLSchema-instance",
        "uid": "PM739288",
        "acteurRef": "PA719052",
        "legislature": "15",
        "typeOrgane": "GA",
        "dateDebut": "2017-10-11T02:00:00.000+02:00",
        "datePublication": null,
        "dateFin": "2017-11-08T01:00:00.000+01:00",
        "preseance": "20",
        "nominPrincipale": "1",
        "infosQualite": {
          "codeQualite": "Membre",
          "libQualite": "Membre",
          "libQualiteSex": "Membre"
        },
        "organes": {
          "organeRef": "PO733582"
        }
      },
      {
        "@xmlns:xsi": "http://www.w3.org/2001/XMLSchema-instance",
        "uid": "PM739289",
        "acteurRef": "PA719052",
        "legislature": "15",
        "typeOrgane": "GA",
        "dateDebut": "2017-10-11T02:00:00.000+02:00",
        "datePublication": null,
        "dateFin": null,
        "preseance": "20",
        "nominPrincipale": "1",
        "infosQualite": {
          "codeQualite": "Membre",
          "libQualite": "Membre",
          "libQualiteSex": "Membre"
        },
        "organes": {
          "organeRef": "PO733597"
        }
      },
      {
        "@xmlns:xsi": "http://www.w3.org/2001/XMLSchema-instance",
        "uid": "PM739290",
        "acteurRef": "PA719052",
        "legislature": "15",
        "typeOrgane": "GA",
        "dateDebut": "2017-10-11T02:00:00.000+02:00",
        "datePublication": null,
        "dateFin": null,
        "preseance": "20",
        "nominPrincipale": "1",
        "infosQualite": {
          "codeQualite": "Membre",
          "libQualite": "Membre",
          "libQualiteSex": "Membre"
        },
        "organes": {
          "organeRef": "PO733632"
        }
      },
      {
        "@xmlns:xsi": "http://www.w3.org/2001/XMLSchema-instance",
        "uid": "PM739291",
        "acteurRef": "PA719052",
        "legislature": "15",
        "typeOrgane": "GA",
        "dateDebut": "2017-10-11T02:00:00.000+02:00",
        "datePublication": null,
        "dateFin": null,
        "preseance": "20",
        "nominPrincipale": "1",
        "infosQualite": {
          "codeQualite": "Membre",
          "libQualite": "Membre",
          "libQualiteSex": "Membre"
        },
        "organes": {
          "organeRef": "PO733672"
        }
      },
      {
        "@xmlns:xsi": "http://www.w3.org/2001/XMLSchema-instance",
        "uid": "PM742090",
        "acteurRef": "PA719052",
        "legislature": "15",
        "typeOrgane": "ORGAINT",
        "dateDebut": "2017-10-27T02:00:00.000+02:00",
        "datePublication": "2017-10-28T02:00:00.000+02:00",
        "dateFin": null,
        "preseance": "42",
        "nominPrincipale": "1",
        "infosQualite": {
          "codeQualite": "Membre",
          "libQualite": "Membre",
          "libQualiteSex": "Membre"
        },
        "organes": {
          "organeRef": "PO201115"
        }
      },
      {
        "uid": "PM743117",
        "acteurRef": "PA719052",
        "legislature": "15",
        "typeOrgane": "CNPE",
        "dateDebut": "2017-11-14T01:00:00.000+01:00",
        "datePublication": "2017-11-15T01:00:00.000+01:00",
        "dateFin": "2018-04-19T02:00:00.000+02:00",
        "preseance": "20",
        "nominPrincipale": "1",
        "infosQualite": {
          "codeQualite": "Membre",
          "libQualite": "Membre",
          "libQualiteSex": "Membre"
        },
        "organes": {
          "organeRef": "PO742273"
        }
      },
      {
        "@xmlns:xsi": "http://www.w3.org/2001/XMLSchema-instance",
        "uid": "PM743174",
        "acteurRef": "PA719052",
        "legislature": "15",
        "typeOrgane": "GEVI",
        "dateDebut": "2017-11-08T01:00:00.000+01:00",
        "datePublication": null,
        "dateFin": null,
        "preseance": "20",
        "nominPrincipale": "1",
        "infosQualite": {
          "codeQualite": "Membre",
          "libQualite": "Membre",
          "libQualiteSex": "Membre"
        },
        "organes": {
          "organeRef": "PO743166"
        }
      },
      {
        "@xmlns:xsi": "http://www.w3.org/2001/XMLSchema-instance",
        "uid": "PM745155",
        "acteurRef": "PA719052",
        "legislature": null,
        "typeOrgane": "PARPOL",
        "dateDebut": "2017-12-01T01:00:00.000+01:00",
        "datePublication": null,
        "dateFin": null,
        "preseance": "5",
        "nominPrincipale": "1",
        "infosQualite": {
          "codeQualite": "Membre",
          "libQualite": "Membre",
          "libQualiteSex": "Membre"
        },
        "organes": {
          "organeRef": "PO744854"
        }
      },
      {
        "@xmlns:xsi": "http://www.w3.org/2001/XMLSchema-instance",
        "uid": "PM747077",
        "acteurRef": "PA719052",
        "legislature": "15",
        "typeOrgane": "GA",
        "dateDebut": "2017-12-19T01:00:00.000+01:00",
        "datePublication": null,
        "dateFin": null,
        "preseance": "8",
        "nominPrincipale": "1",
        "infosQualite": {
          "codeQualite": "Vice-Président",
          "libQualite": "Vice-Président",
          "libQualiteSex": "Vice-Président"
        },
        "organes": {
          "organeRef": "PO733147"
        }
      },
      {
        "@xmlns:xsi": "http://www.w3.org/2001/XMLSchema-instance",
        "uid": "PM747882",
        "acteurRef": "PA719052",
        "legislature": "15",
        "typeOrgane": "ORGEXTPARL",
        "dateDebut": "2018-01-10T01:00:00.000+01:00",
        "datePublication": "2018-01-11T01:00:00.000+01:00",
        "dateFin": null,
        "preseance": "20",
        "nominPrincipale": "1",
        "infosQualite": {
          "codeQualite": "Titulaire",
          "libQualite": "Membre titulaire",
          "libQualiteSex": "Membre titulaire"
        },
        "organes": {
          "organeRef": "PO717436"
        }
      },
      {
        "@xmlns:xsi": "http://www.w3.org/2001/XMLSchema-instance",
        "uid": "PM750122",
        "acteurRef": "PA719052",
        "legislature": "15",
        "typeOrgane": "GE",
        "dateDebut": "2018-02-13T01:00:00.000+01:00",
        "datePublication": null,
        "dateFin": null,
        "preseance": "20",
        "nominPrincipale": "1",
        "infosQualite": {
          "codeQualite": "Membre",
          "libQualite": "Membre",
          "libQualiteSex": "Membre"
        },
        "organes": {
          "organeRef": "PO746982"
        }
      },
      {
        "@xmlns:xsi": "http://www.w3.org/2001/XMLSchema-instance",
        "uid": "PM750927",
        "acteurRef": "PA719052",
        "legislature": "15",
        "typeOrgane": "GE",
        "dateDebut": "2018-02-19T01:00:00.000+01:00",
        "datePublication": null,
        "dateFin": null,
        "preseance": "20",
        "nominPrincipale": "1",
        "infosQualite": {
          "codeQualite": "Membre",
          "libQualite": "Membre",
          "libQualiteSex": "Membre"
        },
        "organes": {
          "organeRef": "PO746880"
        }
      },
      {
        "@xmlns:xsi": "http://www.w3.org/2001/XMLSchema-instance",
        "uid": "PM751718",
        "acteurRef": "PA719052",
        "legislature": "15",
        "typeOrgane": "GE",
        "dateDebut": "2018-02-22T01:00:00.000+01:00",
        "datePublication": null,
        "dateFin": null,
        "preseance": "20",
        "nominPrincipale": "0",
        "infosQualite": {
          "codeQualite": "Membre",
          "libQualite": "Membre",
          "libQualiteSex": "Membre"
        },
        "organes": {
          "organeRef": "PO746679"
        }
      },
      {
        "@xmlns:xsi": "http://www.w3.org/2001/XMLSchema-instance",
        "uid": "PM752798",
        "acteurRef": "PA719052",
        "legislature": "15",
        "typeOrgane": "GE",
        "dateDebut": "2018-03-07T01:00:00.000+01:00",
        "datePublication": null,
        "dateFin": null,
        "preseance": "8",
        "nominPrincipale": "1",
        "infosQualite": {
          "codeQualite": "Vice-Président",
          "libQualite": "Vice-Président",
          "libQualiteSex": "Vice-Président"
        },
        "organes": {
          "organeRef": "PO746679"
        }
      },
      {
        "@xmlns:xsi": "http://www.w3.org/2001/XMLSchema-instance",
        "uid": "PM754496",
        "acteurRef": "PA719052",
        "legislature": "15",
        "typeOrgane": "GE",
        "dateDebut": "2018-03-29T02:00:00.000+02:00",
        "datePublication": null,
        "dateFin": null,
        "preseance": "20",
        "nominPrincipale": "1",
        "infosQualite": {
          "codeQualite": "Membre",
          "libQualite": "Membre",
          "libQualiteSex": "Membre"
        },
        "organes": {
          "organeRef": "PO746930"
        }
      },
      {
        "uid": "PM756871",
        "acteurRef": "PA719052",
        "legislature": "15",
        "typeOrgane": "CMP",
        "dateDebut": "2018-06-07T02:00:00.000+02:00",
        "datePublication": "2018-06-13T02:00:00.000+02:00",
        "dateFin": "2018-06-28T02:00:00.000+02:00",
        "preseance": "28",
        "nominPrincipale": "1",
        "infosQualite": {
          "codeQualite": "Suppléant",
          "libQualite": "Membre suppléant",
          "libQualiteSex": "Membre suppléant"
        },
        "organes": {
          "organeRef": "PO756661"
        }
      },
      {
        "@xmlns:xsi": "http://www.w3.org/2001/XMLSchema-instance",
        "uid": "PM760853",
        "acteurRef": "PA719052",
        "legislature": "15",
        "typeOrgane": "GA",
        "dateDebut": "2018-03-28T02:00:00.000+02:00",
        "datePublication": null,
        "dateFin": null,
        "preseance": "8",
        "nominPrincipale": "1",
        "infosQualite": {
          "codeQualite": "Vice-Président",
          "libQualite": "Vice-Président",
          "libQualiteSex": "Vice-Président"
        },
        "organes": {
          "organeRef": "PO733442"
        }
      }
    ]
  },
  "@xmlns:xsi": "http://www.w3.org/2001/XMLSchema-instance"
}