{
  "uid": {
    "@xsi:type": "IdActeur_type",
    "#text": "PA719520"
  },
  "etatCivil": {
    "ident": {
      "civ": "M.",
      "prenom": "Mickaël",
      "nom": "Nogal",
      "alpha": "Nogal",
      "trigramme": "MNO"
    },
    "infoNaissance": {
      "dateNais": "1990-11-26T01:00:00.000+01:00",
      "villeNais": "Toulouse",
      "depNais": "Haute-Garonne",
      "paysNais": "France"
    },
    "dateDeces": null
  },
  "profession": {
    "libelleCourant": "Autre profession libérale",
    "socProcINSEE": {
      "catSocPro": "Professions libérales et assimilés",
      "famSocPro": "Cadres et professions intellectuelles supérieures"
    }
  },
  "uri_hatvp": "https://www.hatvp.fr/pages_nominatives/nogal-mickael",
  "adresses": {
    "adresse": [
      {
        "@xsi:type": "AdressePostale_Type",
        "uid": "AD719522",
        "type": "0",
        "typeLibelle": "Adresse officielle",
        "poids": "1",
        "adresseDeRattachement": null,
        "intitule": "Assemblée nationale,",
        "numeroRue": "126",
        "nomRue": "Rue de l'Université,",
        "complementAdresse": null,
        "codePostal": "75355",
        "ville": "Paris 07 SP"
      },
      {
        "@xsi:type": "AdresseMail_Type",
        "uid": "AD728049",
        "type": "15",
        "typeLibelle": "Mèl",
        "poids": null,
        "adresseDeRattachement": null,
        "valElec": "mickael.nogal@assemblee-nationale.fr"
      },
      {
        "@xsi:type": "AdresseSiteWeb_Type",
        "uid": "AD728954",
        "type": "25",
        "typeLibelle": "Facebook",
        "poids": null,
        "adresseDeRattachement": null,
        "valElec": "deputemickaelnogal/"
      },
      {
        "@xsi:type": "AdresseSiteWeb_Type",
        "uid": "AD728982",
        "type": "24",
        "typeLibelle": "Twitter",
        "poids": null,
        "adresseDeRattachement": null,
        "valElec": "@mickaelnogal"
      },
      {
        "@xsi:type": "AdresseSiteWeb_Type",
        "uid": "AD729236",
        "type": "22",
        "typeLibelle": "Site internet",
        "poids": null,
        "adresseDeRattachement": null,
        "valElec": "www.mickaelnogal.fr"
      }
    ]
  },
  "mandats": {
    "mandat": [
      {
        "@xmlns:xsi": "http://www.w3.org/2001/XMLSchema-instance",
        "uid": "PM722684",
        "acteurRef": "PA719520",
        "legislature": "15",
        "typeOrgane": "ASSEMBLEE",
        "dateDebut": "2017-06-18T02:00:00.000+02:00",
        "datePublication": null,
        "dateFin": null,
        "preseance": "50",
        "nominPrincipale": "1",
        "infosQualite": {
          "codeQualite": "membre",
          "libQualite": "membre",
          "libQualiteSex": "membre"
        },
        "organes": {
          "organeRef": "PO717460"
        },
        "suppleants": {
          "suppleant": {
            "dateDebut": "2017-06-18T02:00:00.000+02:00",
            "dateFin": null,
            "suppleantRef": "PA719524"
          }
        },
        "chambre": null,
        "election": {
          "lieu": {
            "region": "Occitanie",
            "regionType": "Métropolitain",
            "departement": "Haute-Garonne",
            "numDepartement": "31",
            "numCirco": "4"
          },
          "causeMandat": "élections générales",
          "refCirconscription": "PO717708"
        },
        "mandature": {
          "datePriseFonction": "2017-06-21T02:00:00.000+02:00",
          "causeFin": null,
          "premiereElection": "0",
          "placeHemicycle": "548",
          "mandatRemplaceRef": null
        },
        "collaborateurs": {
          "collaborateur": [
            {
              "qualite": "Mme",
              "prenom": "Marie-Claire",
              "nom": "Constans",
              "dateDebut": null,
              "dateFin": null
            },
            {
              "qualite": "Mme",
              "prenom": "Emilie",
              "nom": "Gapaillard",
              "dateDebut": null,
              "dateFin": null
            }
          ]
        }
      },
      {
        "@xmlns:xsi": "http://www.w3.org/2001/XMLSchema-instance",
        "uid": "PM724383",
        "acteurRef": "PA719520",
        "legislature": "15",
        "typeOrgane": "GP",
        "dateDebut": "2017-06-21T02:00:00.000+02:00",
        "datePublication": null,
        "dateFin": "2017-06-26T02:00:00.000+02:00",
        "preseance": "28",
        "nominPrincipale": "1",
        "infosQualite": {
          "codeQualite": "Député non-inscrit",
          "libQualite": "Député non-inscrit",
          "libQualiteSex": "Député non-inscrit"
        },
        "organes": {
          "organeRef": "PO723569"
        }
      },
      {
        "@xmlns:xsi": "http://www.w3.org/2001/XMLSchema-instance",
        "uid": "PM731053",
        "acteurRef": "PA719520",
        "legislature": "15",
        "typeOrgane": "GP",
        "dateDebut": "2017-06-27T02:00:00.000+02:00",
        "datePublication": "2017-06-28T02:00:00.000+02:00",
        "dateFin": null,
        "preseance": "20",
        "nominPrincipale": "1",
        "infosQualite": {
          "codeQualite": "Membre",
          "libQualite": "Membre du",
          "libQualiteSex": "Membre du"
        },
        "organes": {
          "organeRef": "PO730964"
        }
      },
      {
        "@xmlns:xsi": "http://www.w3.org/2001/XMLSchema-instance",
        "uid": "PM732175",
        "acteurRef": "PA719520",
        "legislature": "15",
        "typeOrgane": "COMPER",
        "dateDebut": "2017-06-29T02:00:00.000+02:00",
        "datePublication": "2017-06-29T02:00:00.000+02:00",
        "dateFin": null,
        "preseance": "32",
        "nominPrincipale": "0",
        "infosQualite": {
          "codeQualite": "Membre",
          "libQualite": "Membre",
          "libQualiteSex": "Membre"
        },
        "organes": {
          "organeRef": "PO419610"
        }
      },
      {
        "@xmlns:xsi": "http://www.w3.org/2001/XMLSchema-instance",
        "uid": "PM732287",
        "acteurRef": "PA719520",
        "legislature": "15",
        "typeOrgane": "COMPER",
        "dateDebut": "2017-06-30T02:00:00.000+02:00",
        "datePublication": "2017-06-30T02:00:00.000+02:00",
        "dateFin": null,
        "preseance": "8",
        "nominPrincipale": "1",
        "infosQualite": {
          "codeQualite": "Vice-Président",
          "libQualite": "Vice-président",
          "libQualiteSex": "Vice-président"
        },
        "organes": {
          "organeRef": "PO419610"
        }
      },
      {
        "@xmlns:xsi": "http://www.w3.org/2001/XMLSchema-instance",
        "uid": "PM732676",
        "acteurRef": "PA719520",
        "legislature": "15",
        "typeOrgane": "DELEG",
        "dateDebut": "2017-07-12T02:00:00.000+02:00",
        "datePublication": "2017-07-12T02:00:00.000+02:00",
        "dateFin": null,
        "preseance": "20",
        "nominPrincipale": "1",
        "infosQualite": {
          "codeQualite": "Membre",
          "libQualite": "Membre",
          "libQualiteSex": "Membre"
        },
        "organes": {
          "organeRef": "PO201269"
        }
      },
      {
        "@xmlns:xsi": "http://www.w3.org/2001/XMLSchema-instance",
        "uid": "PM737886",
        "acteurRef": "PA719520",
        "legislature": "15",
        "typeOrgane": "GA",
        "dateDebut": "2017-10-05T02:00:00.000+02:00",
        "datePublication": null,
        "dateFin": null,
        "preseance": "20",
        "nominPrincipale": "1",
        "infosQualite": {
          "codeQualite": "Membre",
          "libQualite": "Membre",
          "libQualiteSex": "Membre"
        },
        "organes": {
          "organeRef": "PO732974"
        }
      },
      {
        "@xmlns:xsi": "http://www.w3.org/2001/XMLSchema-instance",
        "uid": "PM737887",
        "acteurRef": "PA719520",
        "legislature": "15",
        "typeOrgane": "GA",
        "dateDebut": "2017-10-05T02:00:00.000+02:00",
        "datePublication": null,
        "dateFin": null,
        "preseance": "20",
        "nominPrincipale": "1",
        "infosQualite": {
          "codeQualite": "Membre",
          "libQualite": "Membre",
          "libQualiteSex": "Membre"
        },
        "organes": {
          "organeRef": "PO733011"
        }
      },
      {
        "@xmlns:xsi": "http://www.w3.org/2001/XMLSchema-instance",
        "uid": "PM737888",
        "acteurRef": "PA719520",
        "legislature": "15",
        "typeOrgane": "GA",
        "dateDebut": "2017-10-05T02:00:00.000+02:00",
        "datePublication": null,
        "dateFin": null,
        "preseance": "20",
        "nominPrincipale": "1",
        "infosQualite": {
          "codeQualite": "Membre",
          "libQualite": "Membre",
          "libQualiteSex": "Membre"
        },
        "organes": {
          "organeRef": "PO733057"
        }
      },
      {
        "@xmlns:xsi": "http://www.w3.org/2001/XMLSchema-instance",
        "uid": "PM737889",
        "acteurRef": "PA719520",
        "legislature": "15",
        "typeOrgane": "GA",
        "dateDebut": "2017-10-05T02:00:00.000+02:00",
        "datePublication": null,
        "dateFin": null,
        "preseance": "20",
        "nominPrincipale": "1",
        "infosQualite": {
          "codeQualite": "Membre",
          "libQualite": "Membre",
          "libQualiteSex": "Membre"
        },
        "organes": {
          "organeRef": "PO733072"
        }
      },
      {
        "@xmlns:xsi": "http://www.w3.org/2001/XMLSchema-instance",
        "uid": "PM737890",
        "acteurRef": "PA719520",
        "legislature": "15",
        "typeOrgane": "GA",
        "dateDebut": "2017-10-05T02:00:00.000+02:00",
        "datePublication": null,
        "dateFin": null,
        "preseance": "20",
        "nominPrincipale": "0",
        "infosQualite": {
          "codeQualite": "Membre",
          "libQualite": "Membre",
          "libQualiteSex": "Membre"
        },
        "organes": {
          "organeRef": "PO733087"
        }
      },
      {
        "@xmlns:xsi": "http://www.w3.org/2001/XMLSchema-instance",
        "uid": "PM737891",
        "acteurRef": "PA719520",
        "legislature": "15",
        "typeOrgane": "GA",
        "dateDebut": "2017-10-05T02:00:00.000+02:00",
        "datePublication": null,
        "dateFin": null,
        "preseance": "20",
        "nominPrincipale": "1",
        "infosQualite": {
          "codeQualite": "Membre",
          "libQualite": "Membre",
          "libQualiteSex": "Membre"
        },
        "organes": {
          "organeRef": "PO733102"
        }
      },
      {
        "@xmlns:xsi": "http://www.w3.org/2001/XMLSchema-instance",
        "uid": "PM737892",
        "acteurRef": "PA719520",
        "legislature": "15",
        "typeOrgane": "GA",
        "dateDebut": "2017-10-05T02:00:00.000+02:00",
        "datePublication": null,
        "dateFin": null,
        "preseance": "20",
        "nominPrincipale": "1",
        "infosQualite": {
          "codeQualite": "Membre",
          "libQualite": "Membre",
          "libQualiteSex": "Membre"
        },
        "organes": {
          "organeRef": "PO733157"
        }
      },
      {
        "@xmlns:xsi": "http://www.w3.org/2001/XMLSchema-instance",
        "uid": "PM737893",
        "acteurRef": "PA719520",
        "legislature": "15",
        "typeOrgane": "GA",
        "dateDebut": "2017-10-05T02:00:00.000+02:00",
        "datePublication": null,
        "dateFin": null,
        "preseance": "20",
        "nominPrincipale": "1",
        "infosQualite": {
          "codeQualite": "Membre",
          "libQualite": "Membre",
          "libQualiteSex": "Membre"
        },
        "organes": {
          "organeRef": "PO733177"
        }
      },
      {
        "@xmlns:xsi": "http://www.w3.org/2001/XMLSchema-instance",
        "uid": "PM737894",
        "acteurRef": "PA719520",
        "legislature": "15",
        "typeOrgane": "GA",
        "dateDebut": "2017-10-05T02:00:00.000+02:00",
        "datePublication": null,
        "dateFin": null,
        "preseance": "20",
        "nominPrincipale": "1",
        "infosQualite": {
          "codeQualite": "Membre",
          "libQualite": "Membre",
          "libQualiteSex": "Membre"
        },
        "organes": {
          "organeRef": "PO733187"
        }
      },
      {
        "@xmlns:xsi": "http://www.w3.org/2001/XMLSchema-instance",
        "uid": "PM737895",
        "acteurRef": "PA719520",
        "legislature": "15",
        "typeOrgane": "GA",
        "dateDebut": "2017-10-05T02:00:00.000+02:00",
        "datePublication": null,
        "dateFin": null,
        "preseance": "20",
        "nominPrincipale": "0",
        "infosQualite": {
          "codeQualite": "Membre",
          "libQualite": "Membre",
          "libQualiteSex": "Membre"
        },
        "organes": {
          "organeRef": "PO733277"
        }
      },
      {
        "@xmlns:xsi": "http://www.w3.org/2001/XMLSchema-instance",
        "uid": "PM737896",
        "acteurRef": "PA719520",
        "legislature": "15",
        "typeOrgane": "GA",
        "dateDebut": "2017-10-05T02:00:00.000+02:00",
        "datePublication": null,
        "dateFin": null,
        "preseance": "20",
        "nominPrincipale": "0",
        "infosQualite": {
          "codeQualite": "Membre",
          "libQualite": "Membre",
          "libQualiteSex": "Membre"
        },
        "organes": {
          "organeRef": "PO733307"
        }
      },
      {
        "@xmlns:xsi": "http://www.w3.org/2001/XMLSchema-instance",
        "uid": "PM737897",
        "acteurRef": "PA719520",
        "legislature": "15",
        "typeOrgane": "GA",
        "dateDebut": "2017-10-05T02:00:00.000+02:00",
        "datePublication": null,
        "dateFin": null,
        "preseance": "20",
        "nominPrincipale": "1",
        "infosQualite": {
          "codeQualite": "Membre",
          "libQualite": "Membre",
          "libQualiteSex": "Membre"
        },
        "organes": {
          "organeRef": "PO733317"
        }
      },
      {
        "@xmlns:xsi": "http://www.w3.org/2001/XMLSchema-instance",
        "uid": "PM737898",
        "acteurRef": "PA719520",
        "legislature": "15",
        "typeOrgane": "GA",
        "dateDebut": "2017-10-05T02:00:00.000+02:00",
        "datePublication": null,
        "dateFin": null,
        "preseance": "20",
        "nominPrincipale": "1",
        "infosQualite": {
          "codeQualite": "Membre",
          "libQualite": "Membre",
          "libQualiteSex": "Membre"
        },
        "organes": {
          "organeRef": "PO733322"
        }
      },
      {
        "@xmlns:xsi": "http://www.w3.org/2001/XMLSchema-instance",
        "uid": "PM737899",
        "acteurRef": "PA719520",
        "legislature": "15",
        "typeOrgane": "GA",
        "dateDebut": "2017-10-05T02:00:00.000+02:00",
        "datePublication": null,
        "dateFin": null,
        "preseance": "20",
        "nominPrincipale": "1",
        "infosQualite": {
          "codeQualite": "Membre",
          "libQualite": "Membre",
          "libQualiteSex": "Membre"
        },
        "organes": {
          "organeRef": "PO733342"
        }
      },
      {
        "@xmlns:xsi": "http://www.w3.org/2001/XMLSchema-instance",
        "uid": "PM737900",
        "acteurRef": "PA719520",
        "legislature": "15",
        "typeOrgane": "GA",
        "dateDebut": "2017-10-05T02:00:00.000+02:00",
        "datePublication": null,
        "dateFin": null,
        "preseance": "20",
        "nominPrincipale": "1",
        "infosQualite": {
          "codeQualite": "Membre",
          "libQualite": "Membre",
          "libQualiteSex": "Membre"
        },
        "organes": {
          "organeRef": "PO733367"
        }
      },
      {
        "@xmlns:xsi": "http://www.w3.org/2001/XMLSchema-instance",
        "uid": "PM737901",
        "acteurRef": "PA719520",
        "legislature": "15",
        "typeOrgane": "GA",
        "dateDebut": "2017-10-05T02:00:00.000+02:00",
        "datePublication": null,
        "dateFin": null,
        "preseance": "20",
        "nominPrincipale": "1",
        "infosQualite": {
          "codeQualite": "Membre",
          "libQualite": "Membre",
          "libQualiteSex": "Membre"
        },
        "organes": {
          "organeRef": "PO733452"
        }
      },
      {
        "@xmlns:xsi": "http://www.w3.org/2001/XMLSchema-instance",
        "uid": "PM737902",
        "acteurRef": "PA719520",
        "legislature": "15",
        "typeOrgane": "GA",
        "dateDebut": "2017-10-05T02:00:00.000+02:00",
        "datePublication": null,
        "dateFin": null,
        "preseance": "20",
        "nominPrincipale": "1",
        "infosQualite": {
          "codeQualite": "Membre",
          "libQualite": "Membre",
          "libQualiteSex": "Membre"
        },
        "organes": {
          "organeRef": "PO733522"
        }
      },
      {
        "@xmlns:xsi": "http://www.w3.org/2001/XMLSchema-instance",
        "uid": "PM737903",
        "acteurRef": "PA719520",
        "legislature": "15",
        "typeOrgane": "GA",
        "dateDebut": "2017-10-05T02:00:00.000+02:00",
        "datePublication": null,
        "dateFin": null,
        "preseance": "20",
        "nominPrincipale": "1",
        "infosQualite": {
          "codeQualite": "Membre",
          "libQualite": "Membre",
          "libQualiteSex": "Membre"
        },
        "organes": {
          "organeRef": "PO733527"
        }
      },
      {
        "@xmlns:xsi": "http://www.w3.org/2001/XMLSchema-instance",
        "uid": "PM737904",
        "acteurRef": "PA719520",
        "legislature": "15",
        "typeOrgane": "GA",
        "dateDebut": "2017-10-05T02:00:00.000+02:00",
        "datePublication": null,
        "dateFin": null,
        "preseance": "20",
        "nominPrincipale": "1",
        "infosQualite": {
          "codeQualite": "Membre",
          "libQualite": "Membre",
          "libQualiteSex": "Membre"
        },
        "organes": {
          "organeRef": "PO733562"
        }
      },
      {
        "@xmlns:xsi": "http://www.w3.org/2001/XMLSchema-instance",
        "uid": "PM737905",
        "acteurRef": "PA719520",
        "legislature": "15",
        "typeOrgane": "GA",
        "dateDebut": "2017-10-05T02:00:00.000+02:00",
        "datePublication": null,
        "dateFin": null,
        "preseance": "20",
        "nominPrincipale": "1",
        "infosQualite": {
          "codeQualite": "Membre",
          "libQualite": "Membre",
          "libQualiteSex": "Membre"
        },
        "organes": {
          "organeRef": "PO733567"
        }
      },
      {
        "@xmlns:xsi": "http://www.w3.org/2001/XMLSchema-instance",
        "uid": "PM737906",
        "acteurRef": "PA719520",
        "legislature": "15",
        "typeOrgane": "GA",
        "dateDebut": "2017-10-05T02:00:00.000+02:00",
        "datePublication": null,
        "dateFin": null,
        "preseance": "20",
        "nominPrincipale": "0",
        "infosQualite": {
          "codeQualite": "Membre",
          "libQualite": "Membre",
          "libQualiteSex": "Membre"
        },
        "organes": {
          "organeRef": "PO733627"
        }
      },
      {
        "@xmlns:xsi": "http://www.w3.org/2001/XMLSchema-instance",
        "uid": "PM741858",
        "acteurRef": "PA719520",
        "legislature": "15",
        "typeOrgane": "ORGEXTPARL",
        "dateDebut": "2017-10-24T02:00:00.000+02:00",
        "datePublication": "2017-10-25T02:00:00.000+02:00",
        "dateFin": null,
        "preseance": "30",
        "nominPrincipale": "1",
        "infosQualite": {
          "codeQualite": "Suppléant",
          "libQualite": "Membre suppléant",
          "libQualiteSex": "Membre suppléant"
        },
        "organes": {
          "organeRef": "PO687635"
        }
      },
      {
        "@xmlns:xsi": "http://www.w3.org/2001/XMLSchema-instance",
        "uid": "PM741993",
        "acteurRef": "PA719520",
        "legislature": "15",
        "typeOrgane": "GA",
        "dateDebut": "2017-10-26T02:00:00.000+02:00",
        "datePublication": null,
        "dateFin": null,
        "preseance": "14",
        "nominPrincipale": "1",
        "infosQualite": {
          "codeQualite": "Secrétaire",
          "libQualite": "Secrétaire",
          "libQualiteSex": "Secrétaire"
        },
        "organes": {
          "organeRef": "PO733307"
        }
      },
      {
        "@xmlns:xsi": "http://www.w3.org/2001/XMLSchema-instance",
        "uid": "PM742382",
        "acteurRef": "PA719520",
        "legislature": "15",
        "typeOrgane": "GA",
        "dateDebut": "2017-10-31T01:00:00.000+01:00",
        "datePublication": null,
        "dateFin": null,
        "preseance": "8",
        "nominPrincipale": "1",
        "infosQualite": {
          "codeQualite": "Vice-Président",
          "libQualite": "Vice-Président",
          "libQualiteSex": "Vice-Président"
        },
        "organes": {
          "organeRef": "PO733277"
        }
      },
      {
        "@xmlns:xsi": "http://www.w3.org/2001/XMLSchema-instance",
        "uid": "PM743932",
        "acteurRef": "PA719520",
        "legislature": "15",
        "typeOrgane": "GA",
        "dateDebut": "2017-11-22T01:00:00.000+01:00",
        "datePublication": null,
        "dateFin": null,
        "preseance": "8",
        "nominPrincipale": "1",
        "infosQualite": {
          "codeQualite": "Vice-Président",
          "libQualite": "Vice-Président",
          "libQualiteSex": "Vice-Président"
        },
        "organes": {
          "organeRef": "PO733627"
        }
      },
      {
        "@xmlns:xsi": "http://www.w3.org/2001/XMLSchema-instance",
        "uid": "PM745257",
        "acteurRef": "PA719520",
        "legislature": null,
        "typeOrgane": "PARPOL",
        "dateDebut": "2017-12-01T01:00:00.000+01:00",
        "datePublication": null,
        "dateFin": null,
        "preseance": "5",
        "nominPrincipale": "1",
        "infosQualite": {
          "codeQualite": "Membre",
          "libQualite": "Membre",
          "libQualiteSex": "Membre"
        },
        "organes": {
          "organeRef": "PO744854"
        }
      },
      {
        "@xmlns:xsi": "http://www.w3.org/2001/XMLSchema-instance",
        "uid": "PM748689",
        "acteurRef": "PA719520",
        "legislature": "15",
        "typeOrgane": "GE",
        "dateDebut": "2018-02-01T01:00:00.000+01:00",
        "datePublication": null,
        "dateFin": null,
        "preseance": "20",
        "nominPrincipale": "0",
        "infosQualite": {
          "codeQualite": "Membre",
          "libQualite": "Membre",
          "libQualiteSex": "Membre"
        },
        "organes": {
          "organeRef": "PO746885"
        }
      },
      {
        "@xmlns:xsi": "http://www.w3.org/2001/XMLSchema-instance",
        "uid": "PM748690",
        "acteurRef": "PA719520",
        "legislature": "15",
        "typeOrgane": "GE",
        "dateDebut": "2018-02-01T01:00:00.000+01:00",
        "datePublication": null,
        "dateFin": null,
        "preseance": "4",
        "nominPrincipale": "1",
        "infosQualite": {
          "codeQualite": "Co-Président",
          "libQualite": "Co-Président",
          "libQualiteSex": "Co-Président"
        },
        "organes": {
          "organeRef": "PO746885"
        }
      },
      {
        "@xmlns:xsi": "http://www.w3.org/2001/XMLSchema-instance",
        "uid": "PM749414",
        "acteurRef": "PA719520",
        "legislature": "15",
        "typeOrgane": "GE",
        "dateDebut": "2018-02-12T01:00:00.000+01:00",
        "datePublication": null,
        "dateFin": null,
        "preseance": "20",
        "nominPrincipale": "1",
        "infosQualite": {
          "codeQualite": "Membre",
          "libQualite": "Membre",
          "libQualiteSex": "Membre"
        },
        "organes": {
          "organeRef": "PO746748"
        }
      },
      {
        "@xmlns:xsi": "http://www.w3.org/2001/XMLSchema-instance",
        "uid": "PM750538",
        "acteurRef": "PA719520",
        "legislature": "15",
        "typeOrgane": "GE",
        "dateDebut": "2018-02-15T01:00:00.000+01:00",
        "datePublication": null,
        "dateFin": null,
        "preseance": "20",
        "nominPrincipale": "1",
        "infosQualite": {
          "codeQualite": "Membre",
          "libQualite": "Membre",
          "libQualiteSex": "Membre"
        },
        "organes": {
          "organeRef": "PO746816"
        }
      },
      {
        "@xmlns:xsi": "http://www.w3.org/2001/XMLSchema-instance",
        "uid": "PM750612",
        "acteurRef": "PA719520",
        "legislature": "15",
        "typeOrgane": "GE",
        "dateDebut": "2018-02-12T01:00:00.000+01:00",
        "datePublication": null,
        "dateFin": null,
        "preseance": "20",
        "nominPrincipale": "1",
        "infosQualite": {
          "codeQualite": "Membre",
          "libQualite": "Membre",
          "libQualiteSex": "Membre"
        },
        "organes": {
          "organeRef": "PO746857"
        }
      },
      {
        "@xmlns:xsi": "http://www.w3.org/2001/XMLSchema-instance",
        "uid": "PM750624",
        "acteurRef": "PA719520",
        "legislature": "15",
        "typeOrgane": "GE",
        "dateDebut": "2018-02-15T01:00:00.000+01:00",
        "datePublication": null,
        "dateFin": null,
        "preseance": "20",
        "nominPrincipale": "1",
        "infosQualite": {
          "codeQualite": "Membre",
          "libQualite": "Membre",
          "libQualiteSex": "Membre"
        },
        "organes": {
          "organeRef": "PO747261"
        }
      },
      {
        "@xmlns:xsi": "http://www.w3.org/2001/XMLSchema-instance",
        "uid": "PM750656",
        "acteurRef": "PA719520",
        "legislature": "15",
        "typeOrgane": "GE",
        "dateDebut": "2018-02-15T01:00:00.000+01:00",
        "datePublication": null,
        "dateFin": null,
        "preseance": "20",
        "nominPrincipale": "1",
        "infosQualite": {
          "codeQualite": "Membre",
          "libQualite": "Membre",
          "libQualiteSex": "Membre"
        },
        "organes": {
          "organeRef": "PO747200"
        }
      },
      {
        "@xmlns:xsi": "http://www.w3.org/2001/XMLSchema-instance",
        "uid": "PM750661",
        "acteurRef": "PA719520",
        "legislature": "15",
        "typeOrgane": "GE",
        "dateDebut": "2018-02-15T01:00:00.000+01:00",
        "datePublication": null,
        "dateFin": null,
        "preseance": "20",
        "nominPrincipale": "1",
        "infosQualite": {
          "codeQualite": "Membre",
          "libQualite": "Membre",
          "libQualiteSex": "Membre"
        },
        "organes": {
          "organeRef": "PO747271"
        }
      },
      {
        "@xmlns:xsi": "http://www.w3.org/2001/XMLSchema-instance",
        "uid": "PM750707",
        "acteurRef": "PA719520",
        "legislature": "15",
        "typeOrgane": "GE",
        "dateDebut": "2018-02-16T01:00:00.000+01:00",
        "datePublication": null,
        "dateFin": null,
        "preseance": "20",
        "nominPrincipale": "1",
        "infosQualite": {
          "codeQualite": "Membre",
          "libQualite": "Membre",
          "libQualiteSex": "Membre"
        },
        "organes": {
          "organeRef": "PO746847"
        }
      },
      {
        "@xmlns:xsi": "http://www.w3.org/2001/XMLSchema-instance",
        "uid": "PM750844",
        "acteurRef": "PA719520",
        "legislature": "15",
        "typeOrgane": "GE",
        "dateDebut": "2018-02-19T01:00:00.000+01:00",
        "datePublication": null,
        "dateFin": null,
        "preseance": "20",
        "nominPrincipale": "1",
        "infosQualite": {
          "codeQualite": "Membre",
          "libQualite": "Membre",
          "libQualiteSex": "Membre"
        },
        "organes": {
          "organeRef": "PO746768"
        }
      },
      {
        "@xmlns:xsi": "http://www.w3.org/2001/XMLSchema-instance",
        "uid": "PM750906",
        "acteurRef": "PA719520",
        "legislature": "15",
        "typeOrgane": "GE",
        "dateDebut": "2018-02-19T01:00:00.000+01:00",
        "datePublication": null,
        "dateFin": null,
        "preseance": "20",
        "nominPrincipale": "1",
        "infosQualite": {
          "codeQualite": "Membre",
          "libQualite": "Membre",
          "libQualiteSex": "Membre"
        },
        "organes": {
          "organeRef": "PO747109"
        }
      },
      {
        "@xmlns:xsi": "http://www.w3.org/2001/XMLSchema-instance",
        "uid": "PM750955",
        "acteurRef": "PA719520",
        "legislature": "15",
        "typeOrgane": "GE",
        "dateDebut": "2018-02-19T01:00:00.000+01:00",
        "datePublication": null,
        "dateFin": null,
        "preseance": "20",
        "nominPrincipale": "1",
        "infosQualite": {
          "codeQualite": "Membre",
          "libQualite": "Membre",
          "libQualiteSex": "Membre"
        },
        "organes": {
          "organeRef": "PO746880"
        }
      },
      {
        "@xmlns:xsi": "http://www.w3.org/2001/XMLSchema-instance",
        "uid": "PM751108",
        "acteurRef": "PA719520",
        "legislature": "15",
        "typeOrgane": "GE",
        "dateDebut": "2018-02-19T01:00:00.000+01:00",
        "datePublication": null,
        "dateFin": null,
        "preseance": "20",
        "nominPrincipale": "1",
        "infosQualite": {
          "codeQualite": "Membre",
          "libQualite": "Membre",
          "libQualiteSex": "Membre"
        },
        "organes": {
          "organeRef": "PO746684"
        }
      },
      {
        "@xmlns:xsi": "http://www.w3.org/2001/XMLSchema-instance",
        "uid": "PM751180",
        "acteurRef": "PA719520",
        "legislature": "15",
        "typeOrgane": "GE",
        "dateDebut": "2018-02-19T01:00:00.000+01:00",
        "datePublication": null,
        "dateFin": null,
        "preseance": "20",
        "nominPrincipale": "0",
        "infosQualite": {
          "codeQualite": "Membre",
          "libQualite": "Membre",
          "libQualiteSex": "Membre"
        },
        "organes": {
          "organeRef": "PO747276"
        }
      },
      {
        "@xmlns:xsi": "http://www.w3.org/2001/XMLSchema-instance",
        "uid": "PM751418",
        "acteurRef": "PA719520",
        "legislature": "15",
        "typeOrgane": "GE",
        "dateDebut": "2018-02-21T01:00:00.000+01:00",
        "datePublication": null,
        "dateFin": null,
        "preseance": "20",
        "nominPrincipale": "1",
        "infosQualite": {
          "codeQualite": "Membre",
          "libQualite": "Membre",
          "libQualiteSex": "Membre"
        },
        "organes": {
          "organeRef": "PO746644"
        }
      },
      {
        "@xmlns:xsi": "http://www.w3.org/2001/XMLSchema-instance",
        "uid": "PM751987",
        "acteurRef": "PA719520",
        "legislature": "15",
        "typeOrgane": "GE",
        "dateDebut": "2018-02-23T01:00:00.000+01:00",
        "datePublication": null,
        "dateFin": null,
        "preseance": "20",
        "nominPrincipale": "1",
        "infosQualite": {
          "codeQualite": "Membre",
          "libQualite": "Membre",
          "libQualiteSex": "Membre"
        },
        "organes": {
          "organeRef": "PO747205"
        }
      },
      {
        "@xmlns:xsi": "http://www.w3.org/2001/XMLSchema-instance",
        "uid": "PM752037",
        "acteurRef": "PA719520",
        "legislature": "15",
        "typeOrgane": "GE",
        "dateDebut": "2018-02-21T01:00:00.000+01:00",
        "datePublication": null,
        "dateFin": null,
        "preseance": "8",
        "nominPrincipale": "1",
        "infosQualite": {
          "codeQualite": "Vice-Président",
          "libQualite": "Vice-Président",
          "libQualiteSex": "Vice-Président"
        },
        "organes": {
          "organeRef": "PO747276"
        }
      },
      {
        "@xmlns:xsi": "http://www.w3.org/2001/XMLSchema-instance",
        "uid": "PM752118",
        "acteurRef": "PA719520",
        "legislature": "15",
        "typeOrgane": "GE",
        "dateDebut": "2018-02-27T01:00:00.000+01:00",
        "datePublication": null,
        "dateFin": null,
        "preseance": "20",
        "nominPrincipale": "1",
        "infosQualite": {
          "codeQualite": "Membre",
          "libQualite": "Membre",
          "libQualiteSex": "Membre"
        },
        "organes": {
          "organeRef": "PO747251"
        }
      },
      {
        "@xmlns:xsi": "http://www.w3.org/2001/XMLSchema-instance",
        "uid": "PM752157",
        "acteurRef": "PA719520",
        "legislature": "15",
        "typeOrgane": "GE",
        "dateDebut": "2018-02-14T01:00:00.000+01:00",
        "datePublication": null,
        "dateFin": null,
        "preseance": "20",
        "nominPrincipale": "1",
        "infosQualite": {
          "codeQualite": "Membre",
          "libQualite": "Membre",
          "libQualiteSex": "Membre"
        },
        "organes": {
          "organeRef": "PO747067"
        }
      },
      {
        "@xmlns:xsi": "http://www.w3.org/2001/XMLSchema-instance",
        "uid": "PM753415",
        "acteurRef": "PA719520",
        "legislature": "15",
        "typeOrgane": "GE",
        "dateDebut": "2018-03-14T01:00:00.000+01:00",
        "datePublication": null,
        "dateFin": null,
        "preseance": "20",
        "nominPrincipale": "1",
        "infosQualite": {
          "codeQualite": "Membre",
          "libQualite": "Membre",
          "libQualiteSex": "Membre"
        },
        "organes": {
          "organeRef": "PO746997"
        }
      },
      {
        "@xmlns:xsi": "http://www.w3.org/2001/XMLSchema-instance",
        "uid": "PM754969",
        "acteurRef": "PA719520",
        "legislature": "15",
        "typeOrgane": "GA",
        "dateDebut": "2017-12-13T01:00:00.000+01:00",
        "datePublication": null,
        "dateFin": null,
        "preseance": "8",
        "nominPrincipale": "1",
        "infosQualite": {
          "codeQualite": "Vice-Président",
          "libQualite": "Vice-Président",
          "libQualiteSex": "Vice-Président"
        },
        "organes": {
          "organeRef": "PO733087"
        }
      },
      {
        "@xmlns:xsi": "http://www.w3.org/2001/XMLSchema-instance",
        "uid": "PM756950",
        "acteurRef": "PA719520",
        "legislature": "15",
        "typeOrgane": "ORGEXTPARL",
        "dateDebut": "2018-03-08T01:00:00.000+01:00",
        "datePublication": "2018-03-09T01:00:00.000+01:00",
        "dateFin": null,
        "preseance": "20",
        "nominPrincipale": "1",
        "infosQualite": {
          "codeQualite": "Titulaire",
          "libQualite": "Membre titulaire",
          "libQualiteSex": "Membre titulaire"
        },
        "organes": {
          "organeRef": "PO756933"
        }
      },
      {
        "@xmlns:xsi": "http://www.w3.org/2001/XMLSchema-instance",
        "uid": "PM758361",
        "acteurRef": "PA719520",
        "legislature": "15",
        "typeOrgane": "GA",
        "dateDebut": "2018-07-26T02:00:00.000+02:00",
        "datePublication": null,
        "dateFin": null,
        "preseance": "20",
        "nominPrincipale": "1",
        "infosQualite": {
          "codeQualite": "Membre",
          "libQualite": "Membre",
          "libQualiteSex": "Membre"
        },
        "organes": {
          "organeRef": "PO732984"
        }
      },
      {
        "@xmlns:xsi": "http://www.w3.org/2001/XMLSchema-instance",
        "uid": "PM758362",
        "acteurRef": "PA719520",
        "legislature": "15",
        "typeOrgane": "GA",
        "dateDebut": "2018-07-26T02:00:00.000+02:00",
        "datePublication": null,
        "dateFin": null,
        "preseance": "20",
        "nominPrincipale": "1",
        "infosQualite": {
          "codeQualite": "Membre",
          "libQualite": "Membre",
          "libQualiteSex": "Membre"
        },
        "organes": {
          "organeRef": "PO733001"
        }
      },
      {
        "@xmlns:xsi": "http://www.w3.org/2001/XMLSchema-instance",
        "uid": "PM758363",
        "acteurRef": "PA719520",
        "legislature": "15",
        "typeOrgane": "GA",
        "dateDebut": "2018-07-26T02:00:00.000+02:00",
        "datePublication": null,
        "dateFin": null,
        "preseance": "20",
        "nominPrincipale": "1",
        "infosQualite": {
          "codeQualite": "Membre",
          "libQualite": "Membre",
          "libQualiteSex": "Membre"
        },
        "organes": {
          "organeRef": "PO733122"
        }
      },
      {
        "@xmlns:xsi": "http://www.w3.org/2001/XMLSchema-instance",
        "uid": "PM758364",
        "acteurRef": "PA719520",
        "legislature": "15",
        "typeOrgane": "GA",
        "dateDebut": "2018-07-26T02:00:00.000+02:00",
        "datePublication": null,
        "dateFin": null,
        "preseance": "20",
        "nominPrincipale": "1",
        "infosQualite": {
          "codeQualite": "Membre",
          "libQualite": "Membre",
          "libQualiteSex": "Membre"
        },
        "organes": {
          "organeRef": "PO733127"
        }
      },
      {
        "@xmlns:xsi": "http://www.w3.org/2001/XMLSchema-instance",
        "uid": "PM758365",
        "acteurRef": "PA719520",
        "legislature": "15",
        "typeOrgane": "GA",
        "dateDebut": "2018-07-26T02:00:00.000+02:00",
        "datePublication": null,
        "dateFin": null,
        "preseance": "20",
        "nominPrincipale": "1",
        "infosQualite": {
          "codeQualite": "Membre",
          "libQualite": "Membre",
          "libQualiteSex": "Membre"
        },
        "organes": {
          "organeRef": "PO733372"
        }
      },
      {
        "@xmlns:xsi": "http://www.w3.org/2001/XMLSchema-instance",
        "uid": "PM758366",
        "acteurRef": "PA719520",
        "legislature": "15",
        "typeOrgane": "GA",
        "dateDebut": "2018-07-26T02:00:00.000+02:00",
        "datePublication": null,
        "dateFin": null,
        "preseance": "20",
        "nominPrincipale": "1",
        "infosQualite": {
          "codeQualite": "Membre",
          "libQualite": "Membre",
          "libQualiteSex": "Membre"
        },
        "organes": {
          "organeRef": "PO733397"
        }
      },
      {
        "@xmlns:xsi": "http://www.w3.org/2001/XMLSchema-instance",
        "uid": "PM758367",
        "acteurRef": "PA719520",
        "legislature": "15",
        "typeOrgane": "GA",
        "dateDebut": "2018-07-26T02:00:00.000+02:00",
        "datePublication": null,
        "dateFin": null,
        "preseance": "20",
        "nominPrincipale": "1",
        "infosQualite": {
          "codeQualite": "Membre",
          "libQualite": "Membre",
          "libQualiteSex": "Membre"
        },
        "organes": {
          "organeRef": "PO733492"
        }
      },
      {
        "@xmlns:xsi": "http://www.w3.org/2001/XMLSchema-instance",
        "uid": "PM758906",
        "acteurRef": "PA719520",
        "legislature": "15",
        "typeOrgane": "CMP",
        "dateDebut": "2018-09-13T02:00:00.000+02:00",
        "datePublication": "2018-09-14T02:00:00.000+02:00",
        "dateFin": null,
        "preseance": "20",
        "nominPrincipale": "1",
        "infosQualite": {
          "codeQualite": "Titulaire",
          "libQualite": "Membre titulaire",
          "libQualiteSex": "Membre titulaire"
        },
        "organes": {
          "organeRef": "PO758352"
        }
      },
      {
        "@xmlns:xsi": "http://www.w3.org/2001/XMLSchema-instance",
        "uid": "PM760911",
        "acteurRef": "PA719520",
        "legislature": "15",
        "typeOrgane": "MINISTERE",
        "dateDebut": "2018-12-10T01:00:00.000+01:00",
        "datePublication": "2018-12-11T01:00:00.000+01:00",
        "dateFin": null,
        "preseance": "1",
        "nominPrincipale": "1",
        "infosQualite": {
          "codeQualite": "en mission",
          "libQualite": "en mission",
          "libQualiteSex": "en mission"
        },
        "organes": {
          "organeRef": [
            "PO759779",
            "PO759801"
          ]
        },
        "libelle": "Les évolutions du modèle des agences immobilières",
        "missionSuivanteRef": null,
        "missionPrecedenteRef": null
      }
    ]
  },
  "@xmlns:xsi": "http://www.w3.org/2001/XMLSchema-instance"
}