{
  "@xmlns:xsi": "http://www.w3.org/2001/XMLSchema-instance",
  "uid": "PO733622",
  "codeType": "GEVI",
  "libelle": "Groupe d'études à vocation internationale sur les questions liées à l'expansion de l'économie taïwanaise",
  "libelleEdition": "de Groupe d'études à vocation internationale sur les questions liées à l'expansion de l'économie taïwanaise",
  "libelleAbrege": "Taïwan",
  "libelleAbrev": "TAI",
  "viMoDe": {
    "dateDebut": null,
    "dateAgrement": "2017-07-19T02:00:00.000+02:00",
    "dateFin": null
  },
  "organeParent": null,
  "chambre": null,
  "regime": "5ème République",
  "legislature": "15",
  "secretariat": {
    "secretaire01": "M. Pierre Zwickert",
    "secretaire02": null
  },
  "listePays": {
    "paysRef": "GOP756468"
  }
}