{
  "@xmlns:xsi": "http://www.w3.org/2001/XMLSchema-instance",
  "uid": "PO733282",
  "codeType": "GA",
  "libelle": "France-Guinée équatoriale",
  "libelleEdition": "de France-Guinée équatoriale",
  "libelleAbrege": "Guinée équatoriale",
  "libelleAbrev": "GUINEQ",
  "viMoDe": {
    "dateDebut": null,
    "dateAgrement": "2017-07-19T02:00:00.000+02:00",
    "dateFin": null
  },
  "organeParent": null,
  "chambre": null,
  "regime": "5ème République",
  "legislature": "15",
  "secretariat": {
    "secretaire01": "M. Serge Ezdra",
    "secretaire02": null
  },
  "listePays": {
    "paysRef": "GOP756505"
  }
}