{
  "@xmlns:xsi": "http://www.w3.org/2001/XMLSchema-instance",
  "uid": "PO417135",
  "codeType": "CMP",
  "libelle": "Commission mixte paritaire chargée de proposer un texte sur les dispositions restant en discussion du projet de loi de finances rectificative pour 2008",
  "libelleEdition": "du projet de loi de finances rectificative pour 2008",
  "libelleAbrege": "Loi de finances rectificative pour 2008",
  "libelleAbrev": "1266",
  "viMoDe": {
    "dateDebut": "2008-12-19T01:00:00.000+01:00",
    "dateAgrement": null,
    "dateFin": "2008-12-22T01:00:00.000+01:00"
  },
  "organeParent": null,
  "chambre": null,
  "regime": "5ème République",
  "legislature": "13",
  "secretariat": {
    "secretaire01": null,
    "secretaire02": null
  }
}