{
  "@xmlns:xsi": "http://www.w3.org/2001/XMLSchema-instance",
  "uid": "PO403003",
  "codeType": "GE",
  "libelle": "Intégration des personnes fragilisées et handicapées",
  "libelleEdition": "sur l'intégration des personnes fragilisées et handicapées",
  "libelleAbrege": "Intégration des personnes fragilisées et handicapées",
  "libelleAbrev": "INT",
  "viMoDe": {
    "dateDebut": null,
    "dateAgrement": "2007-10-31T01:00:00.000+01:00",
    "dateFin": "2012-06-19T02:00:00.000+02:00"
  },
  "organeParent": null,
  "chambre": null,
  "regime": "5ème République",
  "legislature": "13",
  "secretariat": {
    "secretaire01": null,
    "secretaire02": null
  }
}