{
  "@xmlns:xsi": "http://www.w3.org/2001/XMLSchema-instance",
  "uid": "PO423616",
  "codeType": "CMP",
  "libelle": "Commission mixte paritaire chargée de proposer un texte sur les dispositions restant en discussion du projet de loi relatif à l'entrepreneur individuel à responsabilité limitée",
  "libelleEdition": "du projet de loi relatif à l'entrepreneur individuel à responsabilité limitée",
  "libelleAbrege": "Entrepreneur individuel",
  "libelleAbrev": "2265",
  "viMoDe": {
    "dateDebut": "2010-04-09T02:00:00.000+02:00",
    "dateAgrement": null,
    "dateFin": "2010-06-16T02:00:00.000+02:00"
  },
  "organeParent": null,
  "chambre": null,
  "regime": "5ème République",
  "legislature": "13",
  "secretariat": {
    "secretaire01": null,
    "secretaire02": null
  }
}