{
  "uid": {
    "@xsi:type": "IdActeur_type",
    "#text": "PA2943"
  },
  "etatCivil": {
    "ident": {
      "civ": "M.",
      "prenom": "Philippe",
      "nom": "Vuilque",
      "alpha": "Vuilque",
      "trigramme": null
    },
    "infoNaissance": {
      "dateNais": "1956-01-29T01:00:00.000+01:00",
      "villeNais": "Charleville",
      "depNais": "Ardennes",
      "paysNais": null
    },
    "dateDeces": null
  },
  "profession": {
    "libelleCourant": "Directeur de clinique",
    "socProcINSEE": {
      "catSocPro": "Professions intermédiaires de l'enseignement, de la santé, de la fonction publique et assimilés",
      "famSocPro": "Professions Intermédiaires"
    }
  },
  "uri_hatvp": null,
  "adresses": {
    "adresse": [
      {
        "@xsi:type": "AdressePostale_Type",
        "uid": "AD47034",
        "type": "2",
        "typeLibelle": "Adresse publiée de circonscription",
        "poids": "21",
        "adresseDeRattachement": null,
        "intitule": "Permanence,",
        "numeroRue": "10",
        "nomRue": "Avenue Jean-Baptiste Clément,",
        "complementAdresse": "BP 130,",
        "codePostal": "08500",
        "ville": "Revin"
      },
      {
        "@xsi:type": "AdresseTelephonique_Type",
        "uid": "AD48963",
        "type": "11",
        "typeLibelle": "Téléphone",
        "poids": "21",
        "adresseDeRattachement": "AD47034",
        "valElec": "03 24 40 51 51"
      },
      {
        "@xsi:type": "AdresseTelephonique_Type",
        "uid": "AD50294",
        "type": "12",
        "typeLibelle": "Télécopie",
        "poids": "21",
        "adresseDeRattachement": "AD47034",
        "valElec": "03 24 40 51 50"
      },
      {
        "@xsi:type": "AdresseMail_Type",
        "uid": "AD191353",
        "type": "15",
        "typeLibelle": "Mèl",
        "poids": null,
        "adresseDeRattachement": null,
        "valElec": "Vuilque.Philippe@wanadoo.fr"
      },
      {
        "@xsi:type": "AdressePostale_Type",
        "uid": "AD386608",
        "type": "0",
        "typeLibelle": "Adresse officielle",
        "poids": "1",
        "adresseDeRattachement": null,
        "intitule": "Assemblée nationale,",
        "numeroRue": "126",
        "nomRue": "Rue de l'Université,",
        "complementAdresse": null,
        "codePostal": "75355",
        "ville": "Paris 07 SP"
      },
      {
        "@xsi:type": "AdresseSiteWeb_Type",
        "uid": "AD388513",
        "type": "22",
        "typeLibelle": "Site internet",
        "poids": null,
        "adresseDeRattachement": null,
        "valElec": "www.philippevuilque.fr"
      },
      {
        "@xsi:type": "AdresseMail_Type",
        "uid": "AD391976",
        "type": "15",
        "typeLibelle": "Mèl",
        "poids": null,
        "adresseDeRattachement": null,
        "valElec": "pvuilque@assemblee-nationale.fr"
      },
      {
        "@xsi:type": "AdresseTelephonique_Type",
        "uid": "AD413916",
        "type": "11",
        "typeLibelle": "Téléphone",
        "poids": "1",
        "adresseDeRattachement": "AD386608",
        "valElec": "01 40 63 74 60"
      }
    ]
  },
  "mandats": {
    "mandat": [
      {
        "@xmlns:xsi": "http://www.w3.org/2001/XMLSchema-instance",
        "uid": "PM386569",
        "acteurRef": "PA2943",
        "legislature": "13",
        "typeOrgane": "ASSEMBLEE",
        "dateDebut": "2007-06-20T02:00:00.000+02:00",
        "datePublication": null,
        "dateFin": "2012-06-19T02:00:00.000+02:00",
        "preseance": "50",
        "nominPrincipale": "1",
        "infosQualite": {
          "codeQualite": "membre",
          "libQualite": "membre",
          "libQualiteSex": "membre"
        },
        "organes": {
          "organeRef": "PO384266"
        },
        "suppleants": {
          "suppleant": {
            "dateDebut": "2007-06-20T02:00:00.000+02:00",
            "dateFin": "2012-06-19T02:00:00.000+02:00",
            "suppleantRef": "PA267263"
          }
        },
        "chambre": null,
        "election": {
          "lieu": {
            "region": "Grand Est",
            "regionType": "Métropolitain",
            "departement": "Ardennes",
            "numDepartement": "08",
            "numCirco": "2"
          },
          "causeMandat": "élections générales",
          "refCirconscription": "PO384297"
        },
        "mandature": {
          "datePriseFonction": "2007-06-20T02:00:00.000+02:00",
          "causeFin": "Fin de législature",
          "premiereElection": "1",
          "placeHemicycle": null,
          "mandatRemplaceRef": null
        },
        "collaborateurs": null
      },
      {
        "@xmlns:xsi": "http://www.w3.org/2001/XMLSchema-instance",
        "uid": "PM387187",
        "acteurRef": "PA2943",
        "legislature": "13",
        "typeOrgane": "GP",
        "dateDebut": "2007-06-20T02:00:00.000+02:00",
        "datePublication": null,
        "dateFin": "2007-06-26T02:00:00.000+02:00",
        "preseance": "28",
        "nominPrincipale": "1",
        "infosQualite": {
          "codeQualite": "Député non-inscrit",
          "libQualite": "Député non-inscrit",
          "libQualiteSex": "Député non-inscrit"
        },
        "organes": {
          "organeRef": "PO387155"
        }
      },
      {
        "uid": "PM390132",
        "acteurRef": "PA2943",
        "legislature": "13",
        "typeOrgane": "GP",
        "dateDebut": "2007-06-27T02:00:00.000+02:00",
        "datePublication": "2007-06-27T02:00:00.000+02:00",
        "dateFin": "2012-06-19T02:00:00.000+02:00",
        "preseance": "20",
        "nominPrincipale": "1",
        "infosQualite": {
          "codeQualite": "Membre",
          "libQualite": "Membre du",
          "libQualiteSex": "Membre du"
        },
        "organes": {
          "organeRef": "PO389507"
        }
      },
      {
        "uid": "PM390797",
        "acteurRef": "PA2943",
        "legislature": "13",
        "typeOrgane": "COMPER",
        "dateDebut": "2007-06-27T02:00:00.000+02:00",
        "datePublication": "2007-06-28T02:00:00.000+02:00",
        "dateFin": "2008-04-01T02:00:00.000+02:00",
        "preseance": "32",
        "nominPrincipale": "1",
        "infosQualite": {
          "codeQualite": "Membre",
          "libQualite": "Membre",
          "libQualiteSex": "Membre"
        },
        "organes": {
          "organeRef": "PO59051"
        }
      },
      {
        "uid": "PM391087",
        "acteurRef": "PA2943",
        "legislature": "13",
        "typeOrgane": "COMPER",
        "dateDebut": "2007-06-28T02:00:00.000+02:00",
        "datePublication": "2007-06-29T02:00:00.000+02:00",
        "dateFin": "2008-04-01T02:00:00.000+02:00",
        "preseance": "16",
        "nominPrincipale": "1",
        "infosQualite": {
          "codeQualite": "Secrétaire",
          "libQualite": "Secrétaire",
          "libQualiteSex": "Secrétaire"
        },
        "organes": {
          "organeRef": "PO59051"
        }
      },
      {
        "@xmlns:xsi": "http://www.w3.org/2001/XMLSchema-instance",
        "uid": "PM396343",
        "acteurRef": "PA2943",
        "legislature": "13",
        "typeOrgane": "GA",
        "dateDebut": "2007-10-05T02:00:00.000+02:00",
        "datePublication": null,
        "dateFin": "2012-06-19T02:00:00.000+02:00",
        "preseance": "20",
        "nominPrincipale": "1",
        "infosQualite": {
          "codeQualite": "Membre",
          "libQualite": "Membre",
          "libQualiteSex": "Membre"
        },
        "organes": {
          "organeRef": "PO392704"
        }
      },
      {
        "@xmlns:xsi": "http://www.w3.org/2001/XMLSchema-instance",
        "uid": "PM396344",
        "acteurRef": "PA2943",
        "legislature": "13",
        "typeOrgane": "GA",
        "dateDebut": "2007-10-05T02:00:00.000+02:00",
        "datePublication": null,
        "dateFin": "2012-06-19T02:00:00.000+02:00",
        "preseance": "20",
        "nominPrincipale": "1",
        "infosQualite": {
          "codeQualite": "Membre",
          "libQualite": "Membre",
          "libQualiteSex": "Membre"
        },
        "organes": {
          "organeRef": "PO392785"
        }
      },
      {
        "@xmlns:xsi": "http://www.w3.org/2001/XMLSchema-instance",
        "uid": "PM396345",
        "acteurRef": "PA2943",
        "legislature": "13",
        "typeOrgane": "GA",
        "dateDebut": "2007-10-05T02:00:00.000+02:00",
        "datePublication": null,
        "dateFin": "2012-06-19T02:00:00.000+02:00",
        "preseance": "20",
        "nominPrincipale": "1",
        "infosQualite": {
          "codeQualite": "Membre",
          "libQualite": "Membre",
          "libQualiteSex": "Membre"
        },
        "organes": {
          "organeRef": "PO392820"
        }
      },
      {
        "@xmlns:xsi": "http://www.w3.org/2001/XMLSchema-instance",
        "uid": "PM396346",
        "acteurRef": "PA2943",
        "legislature": "13",
        "typeOrgane": "GA",
        "dateDebut": "2007-10-05T02:00:00.000+02:00",
        "datePublication": null,
        "dateFin": "2012-06-19T02:00:00.000+02:00",
        "preseance": "20",
        "nominPrincipale": "1",
        "infosQualite": {
          "codeQualite": "Membre",
          "libQualite": "Membre",
          "libQualiteSex": "Membre"
        },
        "organes": {
          "organeRef": "PO392950"
        }
      },
      {
        "@xmlns:xsi": "http://www.w3.org/2001/XMLSchema-instance",
        "uid": "PM396347",
        "acteurRef": "PA2943",
        "legislature": "13",
        "typeOrgane": "GA",
        "dateDebut": "2007-10-05T02:00:00.000+02:00",
        "datePublication": null,
        "dateFin": "2012-06-19T02:00:00.000+02:00",
        "preseance": "20",
        "nominPrincipale": "1",
        "infosQualite": {
          "codeQualite": "Membre",
          "libQualite": "Membre",
          "libQualiteSex": "Membre"
        },
        "organes": {
          "organeRef": "PO393192"
        }
      },
      {
        "@xmlns:xsi": "http://www.w3.org/2001/XMLSchema-instance",
        "uid": "PM396348",
        "acteurRef": "PA2943",
        "legislature": "13",
        "typeOrgane": "GA",
        "dateDebut": "2007-10-05T02:00:00.000+02:00",
        "datePublication": null,
        "dateFin": "2012-06-19T02:00:00.000+02:00",
        "preseance": "20",
        "nominPrincipale": "1",
        "infosQualite": {
          "codeQualite": "Membre",
          "libQualite": "Membre",
          "libQualiteSex": "Membre"
        },
        "organes": {
          "organeRef": "PO393197"
        }
      },
      {
        "@xmlns:xsi": "http://www.w3.org/2001/XMLSchema-instance",
        "uid": "PM396349",
        "acteurRef": "PA2943",
        "legislature": "13",
        "typeOrgane": "GA",
        "dateDebut": "2007-10-05T02:00:00.000+02:00",
        "datePublication": null,
        "dateFin": "2012-06-19T02:00:00.000+02:00",
        "preseance": "20",
        "nominPrincipale": "1",
        "infosQualite": {
          "codeQualite": "Membre",
          "libQualite": "Membre",
          "libQualiteSex": "Membre"
        },
        "organes": {
          "organeRef": "PO393338"
        }
      },
      {
        "@xmlns:xsi": "http://www.w3.org/2001/XMLSchema-instance",
        "uid": "PM402694",
        "acteurRef": "PA2943",
        "legislature": "13",
        "typeOrgane": "GA",
        "dateDebut": "2007-11-07T01:00:00.000+01:00",
        "datePublication": null,
        "dateFin": "2012-06-19T02:00:00.000+02:00",
        "preseance": "8",
        "nominPrincipale": "1",
        "infosQualite": {
          "codeQualite": "Vice-Président",
          "libQualite": "Vice-Président",
          "libQualiteSex": "Vice-Président"
        },
        "organes": {
          "organeRef": "PO392704"
        }
      },
      {
        "@xmlns:xsi": "http://www.w3.org/2001/XMLSchema-instance",
        "uid": "PM403909",
        "acteurRef": "PA2943",
        "legislature": "13",
        "typeOrgane": "GE",
        "dateDebut": "2007-10-31T01:00:00.000+01:00",
        "datePublication": null,
        "dateFin": "2012-06-19T02:00:00.000+02:00",
        "preseance": "20",
        "nominPrincipale": "0",
        "infosQualite": {
          "codeQualite": "Membre",
          "libQualite": "Membre",
          "libQualiteSex": "Membre"
        },
        "organes": {
          "organeRef": "PO403220"
        }
      },
      {
        "@xmlns:xsi": "http://www.w3.org/2001/XMLSchema-instance",
        "uid": "PM403910",
        "acteurRef": "PA2943",
        "legislature": "13",
        "typeOrgane": "GE",
        "dateDebut": "2007-10-31T01:00:00.000+01:00",
        "datePublication": null,
        "dateFin": "2012-06-19T02:00:00.000+02:00",
        "preseance": "1",
        "nominPrincipale": "1",
        "infosQualite": {
          "codeQualite": "Président",
          "libQualite": "Président",
          "libQualiteSex": "Président"
        },
        "organes": {
          "organeRef": "PO403220"
        }
      },
      {
        "@xmlns:xsi": "http://www.w3.org/2001/XMLSchema-instance",
        "uid": "PM405378",
        "acteurRef": "PA2943",
        "legislature": "13",
        "typeOrgane": "GA",
        "dateDebut": "2007-12-12T01:00:00.000+01:00",
        "datePublication": null,
        "dateFin": "2012-06-19T02:00:00.000+02:00",
        "preseance": "8",
        "nominPrincipale": "1",
        "infosQualite": {
          "codeQualite": "Vice-Président",
          "libQualite": "Vice-Président",
          "libQualiteSex": "Vice-Président"
        },
        "organes": {
          "organeRef": "PO393197"
        }
      },
      {
        "@xmlns:xsi": "http://www.w3.org/2001/XMLSchema-instance",
        "uid": "PM407506",
        "acteurRef": "PA2943",
        "legislature": "13",
        "typeOrgane": "GE",
        "dateDebut": "2008-01-22T01:00:00.000+01:00",
        "datePublication": null,
        "dateFin": "2012-06-19T02:00:00.000+02:00",
        "preseance": "20",
        "nominPrincipale": "1",
        "infosQualite": {
          "codeQualite": "Membre",
          "libQualite": "Membre",
          "libQualiteSex": "Membre"
        },
        "organes": {
          "organeRef": "PO402746"
        }
      },
      {
        "@xmlns:xsi": "http://www.w3.org/2001/XMLSchema-instance",
        "uid": "PM408741",
        "acteurRef": "PA2943",
        "legislature": "13",
        "typeOrgane": "GE",
        "dateDebut": "2008-02-07T01:00:00.000+01:00",
        "datePublication": null,
        "dateFin": "2012-06-19T02:00:00.000+02:00",
        "preseance": "20",
        "nominPrincipale": "1",
        "infosQualite": {
          "codeQualite": "Membre",
          "libQualite": "Membre",
          "libQualiteSex": "Membre"
        },
        "organes": {
          "organeRef": "PO403009"
        }
      },
      {
        "@xmlns:xsi": "http://www.w3.org/2001/XMLSchema-instance",
        "uid": "PM409884",
        "acteurRef": "PA2943",
        "legislature": "13",
        "typeOrgane": "GE",
        "dateDebut": "2008-02-28T01:00:00.000+01:00",
        "datePublication": null,
        "dateFin": "2012-06-19T02:00:00.000+02:00",
        "preseance": "20",
        "nominPrincipale": "1",
        "infosQualite": {
          "codeQualite": "Membre",
          "libQualite": "Membre",
          "libQualiteSex": "Membre"
        },
        "organes": {
          "organeRef": "PO402856"
        }
      },
      {
        "@xmlns:xsi": "http://www.w3.org/2001/XMLSchema-instance",
        "uid": "PM410927",
        "acteurRef": "PA2943",
        "legislature": "13",
        "typeOrgane": "GE",
        "dateDebut": "2008-01-08T01:00:00.000+01:00",
        "datePublication": null,
        "dateFin": "2012-06-19T02:00:00.000+02:00",
        "preseance": "20",
        "nominPrincipale": "1",
        "infosQualite": {
          "codeQualite": "Membre",
          "libQualite": "Membre",
          "libQualiteSex": "Membre"
        },
        "organes": {
          "organeRef": "PO402919"
        }
      },
      {
        "@xmlns:xsi": "http://www.w3.org/2001/XMLSchema-instance",
        "uid": "PM411044",
        "acteurRef": "PA2943",
        "legislature": "13",
        "typeOrgane": "GE",
        "dateDebut": "2008-03-20T01:00:00.000+01:00",
        "datePublication": null,
        "dateFin": "2012-06-19T02:00:00.000+02:00",
        "preseance": "20",
        "nominPrincipale": "1",
        "infosQualite": {
          "codeQualite": "Membre",
          "libQualite": "Membre",
          "libQualiteSex": "Membre"
        },
        "organes": {
          "organeRef": "PO403232"
        }
      },
      {
        "@xmlns:xsi": "http://www.w3.org/2001/XMLSchema-instance",
        "uid": "PM411219",
        "acteurRef": "PA2943",
        "legislature": "13",
        "typeOrgane": "GE",
        "dateDebut": "2008-03-25T01:00:00.000+01:00",
        "datePublication": null,
        "dateFin": "2012-06-19T02:00:00.000+02:00",
        "preseance": "20",
        "nominPrincipale": "1",
        "infosQualite": {
          "codeQualite": "Membre",
          "libQualite": "Membre",
          "libQualiteSex": "Membre"
        },
        "organes": {
          "organeRef": "PO402997"
        }
      },
      {
        "uid": "PM411426",
        "acteurRef": "PA2943",
        "legislature": "13",
        "typeOrgane": "COMPER",
        "dateDebut": "2008-04-01T02:00:00.000+02:00",
        "datePublication": "2008-04-02T02:00:00.000+02:00",
        "dateFin": "2008-04-02T02:00:00.000+02:00",
        "preseance": "32",
        "nominPrincipale": "1",
        "infosQualite": {
          "codeQualite": "Membre",
          "libQualite": "Membre",
          "libQualiteSex": "Membre"
        },
        "organes": {
          "organeRef": "PO59046"
        }
      },
      {
        "uid": "PM411568",
        "acteurRef": "PA2943",
        "legislature": "13",
        "typeOrgane": "COMPER",
        "dateDebut": "2008-04-03T02:00:00.000+02:00",
        "datePublication": "2008-04-03T02:00:00.000+02:00",
        "dateFin": "2009-04-30T02:00:00.000+02:00",
        "preseance": "32",
        "nominPrincipale": "0",
        "infosQualite": {
          "codeQualite": "Membre",
          "libQualite": "Membre",
          "libQualiteSex": "Membre"
        },
        "organes": {
          "organeRef": "PO59051"
        }
      },
      {
        "uid": "PM411572",
        "acteurRef": "PA2943",
        "legislature": "13",
        "typeOrgane": "COMPER",
        "dateDebut": "2008-04-03T02:00:00.000+02:00",
        "datePublication": "2008-04-03T02:00:00.000+02:00",
        "dateFin": "2009-04-30T02:00:00.000+02:00",
        "preseance": "16",
        "nominPrincipale": "1",
        "infosQualite": {
          "codeQualite": "Secrétaire",
          "libQualite": "Secrétaire",
          "libQualiteSex": "Secrétaire"
        },
        "organes": {
          "organeRef": "PO59051"
        }
      },
      {
        "@xmlns:xsi": "http://www.w3.org/2001/XMLSchema-instance",
        "uid": "PM412342",
        "acteurRef": "PA2943",
        "legislature": "13",
        "typeOrgane": "GE",
        "dateDebut": "2008-03-26T01:00:00.000+01:00",
        "datePublication": null,
        "dateFin": "2012-06-19T02:00:00.000+02:00",
        "preseance": "20",
        "nominPrincipale": "1",
        "infosQualite": {
          "codeQualite": "Membre",
          "libQualite": "Membre",
          "libQualiteSex": "Membre"
        },
        "organes": {
          "organeRef": "PO402795"
        }
      },
      {
        "@xmlns:xsi": "http://www.w3.org/2001/XMLSchema-instance",
        "uid": "PM413147",
        "acteurRef": "PA2943",
        "legislature": "13",
        "typeOrgane": "GE",
        "dateDebut": "2008-02-05T01:00:00.000+01:00",
        "datePublication": null,
        "dateFin": "2012-06-19T02:00:00.000+02:00",
        "preseance": "20",
        "nominPrincipale": "1",
        "infosQualite": {
          "codeQualite": "Membre",
          "libQualite": "Membre",
          "libQualiteSex": "Membre"
        },
        "organes": {
          "organeRef": "PO403190"
        }
      },
      {
        "@xmlns:xsi": "http://www.w3.org/2001/XMLSchema-instance",
        "uid": "PM413886",
        "acteurRef": "PA2943",
        "legislature": "13",
        "typeOrgane": "GE",
        "dateDebut": "2008-06-17T02:00:00.000+02:00",
        "datePublication": null,
        "dateFin": "2012-06-19T02:00:00.000+02:00",
        "preseance": "20",
        "nominPrincipale": "1",
        "infosQualite": {
          "codeQualite": "Membre",
          "libQualite": "Membre",
          "libQualiteSex": "Membre"
        },
        "organes": {
          "organeRef": "PO403274"
        }
      },
      {
        "@xmlns:xsi": "http://www.w3.org/2001/XMLSchema-instance",
        "uid": "PM414114",
        "acteurRef": "PA2943",
        "legislature": "13",
        "typeOrgane": "GE",
        "dateDebut": "2007-10-31T01:00:00.000+01:00",
        "datePublication": null,
        "dateFin": "2012-06-19T02:00:00.000+02:00",
        "preseance": "20",
        "nominPrincipale": "1",
        "infosQualite": {
          "codeQualite": "Membre",
          "libQualite": "Membre",
          "libQualiteSex": "Membre"
        },
        "organes": {
          "organeRef": "PO403105"
        }
      },
      {
        "@xmlns:xsi": "http://www.w3.org/2001/XMLSchema-instance",
        "uid": "PM416938",
        "acteurRef": "PA2943",
        "legislature": "13",
        "typeOrgane": "GE",
        "dateDebut": "2008-02-20T01:00:00.000+01:00",
        "datePublication": null,
        "dateFin": "2012-06-19T02:00:00.000+02:00",
        "preseance": "20",
        "nominPrincipale": "1",
        "infosQualite": {
          "codeQualite": "Membre",
          "libQualite": "Membre",
          "libQualiteSex": "Membre"
        },
        "organes": {
          "organeRef": "PO402973"
        }
      },
      {
        "@xmlns:xsi": "http://www.w3.org/2001/XMLSchema-instance",
        "uid": "PM418869",
        "acteurRef": "PA2943",
        "legislature": "13",
        "typeOrgane": "GE",
        "dateDebut": "2009-03-03T01:00:00.000+01:00",
        "datePublication": null,
        "dateFin": "2012-06-19T02:00:00.000+02:00",
        "preseance": "20",
        "nominPrincipale": "1",
        "infosQualite": {
          "codeQualite": "Membre",
          "libQualite": "Membre",
          "libQualiteSex": "Membre"
        },
        "organes": {
          "organeRef": "PO416217"
        }
      },
      {
        "uid": "PM419178",
        "acteurRef": "PA2943",
        "legislature": "13",
        "typeOrgane": "COMPER",
        "dateDebut": "2009-04-29T02:00:00.000+02:00",
        "datePublication": "2009-04-30T02:00:00.000+02:00",
        "dateFin": "2009-04-30T02:00:00.000+02:00",
        "preseance": "32",
        "nominPrincipale": "1",
        "infosQualite": {
          "codeQualite": "Membre",
          "libQualite": "Membre",
          "libQualiteSex": "Membre"
        },
        "organes": {
          "organeRef": "PO59045"
        }
      },
      {
        "uid": "PM419222",
        "acteurRef": "PA2943",
        "legislature": "13",
        "typeOrgane": "COMPER",
        "dateDebut": "2009-04-30T02:00:00.000+02:00",
        "datePublication": "2009-05-02T02:00:00.000+02:00",
        "dateFin": "2012-01-31T01:00:00.000+01:00",
        "preseance": "32",
        "nominPrincipale": "0",
        "infosQualite": {
          "codeQualite": "Membre",
          "libQualite": "Membre",
          "libQualiteSex": "Membre"
        },
        "organes": {
          "organeRef": "PO59051"
        }
      },
      {
        "uid": "PM419223",
        "acteurRef": "PA2943",
        "legislature": "13",
        "typeOrgane": "COMPER",
        "dateDebut": "2009-04-30T02:00:00.000+02:00",
        "datePublication": "2009-05-02T02:00:00.000+02:00",
        "dateFin": "2012-01-31T01:00:00.000+01:00",
        "preseance": "16",
        "nominPrincipale": "1",
        "infosQualite": {
          "codeQualite": "Secrétaire",
          "libQualite": "Secrétaire",
          "libQualiteSex": "Secrétaire"
        },
        "organes": {
          "organeRef": "PO59051"
        }
      },
      {
        "@xmlns:xsi": "http://www.w3.org/2001/XMLSchema-instance",
        "uid": "PM424890",
        "acteurRef": "PA2943",
        "legislature": "13",
        "typeOrgane": "GE",
        "dateDebut": "2010-07-27T02:00:00.000+02:00",
        "datePublication": null,
        "dateFin": "2012-06-19T02:00:00.000+02:00",
        "preseance": "20",
        "nominPrincipale": "1",
        "infosQualite": {
          "codeQualite": "Membre",
          "libQualite": "Membre",
          "libQualiteSex": "Membre"
        },
        "organes": {
          "organeRef": "PO424325"
        }
      },
      {
        "@xmlns:xsi": "http://www.w3.org/2001/XMLSchema-instance",
        "uid": "PM425539",
        "acteurRef": "PA2943",
        "legislature": "13",
        "typeOrgane": "GE",
        "dateDebut": "2007-10-31T01:00:00.000+01:00",
        "datePublication": null,
        "dateFin": "2012-06-19T02:00:00.000+02:00",
        "preseance": "20",
        "nominPrincipale": "1",
        "infosQualite": {
          "codeQualite": "Membre",
          "libQualite": "Membre",
          "libQualiteSex": "Membre"
        },
        "organes": {
          "organeRef": "PO403238"
        }
      },
      {
        "uid": "PM425633",
        "acteurRef": "PA2943",
        "legislature": "13",
        "typeOrgane": "CNPS",
        "dateDebut": "2010-11-10T01:00:00.000+01:00",
        "datePublication": "2011-11-11T01:00:00.000+01:00",
        "dateFin": "2011-06-23T02:00:00.000+02:00",
        "preseance": "20",
        "nominPrincipale": "1",
        "infosQualite": {
          "codeQualite": "Membre",
          "libQualite": "Membre",
          "libQualiteSex": "Membre"
        },
        "organes": {
          "organeRef": "PO425550"
        }
      },
      {
        "uid": "PM427970",
        "acteurRef": "PA2943",
        "legislature": "13",
        "typeOrgane": "CMP",
        "dateDebut": "2011-04-04T02:00:00.000+02:00",
        "datePublication": "2011-04-05T02:00:00.000+02:00",
        "dateFin": "2011-04-15T02:00:00.000+02:00",
        "preseance": "20",
        "nominPrincipale": "1",
        "infosQualite": {
          "codeQualite": "Titulaire",
          "libQualite": "Membre titulaire",
          "libQualiteSex": "Membre titulaire"
        },
        "organes": {
          "organeRef": "PO427896"
        }
      },
      {
        "uid": "PM428812",
        "acteurRef": "PA2943",
        "legislature": "13",
        "typeOrgane": "CMP",
        "dateDebut": "2011-06-14T02:00:00.000+02:00",
        "datePublication": "2011-06-15T02:00:00.000+02:00",
        "dateFin": "2011-07-25T02:00:00.000+02:00",
        "preseance": "20",
        "nominPrincipale": "1",
        "infosQualite": {
          "codeQualite": "Titulaire",
          "libQualite": "Membre titulaire",
          "libQualiteSex": "Membre titulaire"
        },
        "organes": {
          "organeRef": "PO428784"
        }
      },
      {
        "uid": "PM475760",
        "acteurRef": "PA2943",
        "legislature": "13",
        "typeOrgane": "CMP",
        "dateDebut": "2012-01-13T01:00:00.000+01:00",
        "datePublication": "2012-01-14T01:00:00.000+01:00",
        "dateFin": "2012-02-29T01:00:00.000+01:00",
        "preseance": "20",
        "nominPrincipale": "1",
        "infosQualite": {
          "codeQualite": "Titulaire",
          "libQualite": "Membre titulaire",
          "libQualiteSex": "Membre titulaire"
        },
        "organes": {
          "organeRef": "PO474593"
        }
      },
      {
        "uid": "PM491684",
        "acteurRef": "PA2943",
        "legislature": "13",
        "typeOrgane": "COMPER",
        "dateDebut": "2012-02-01T01:00:00.000+01:00",
        "datePublication": "2012-02-01T01:00:00.000+01:00",
        "dateFin": "2012-02-01T01:00:00.000+01:00",
        "preseance": "32",
        "nominPrincipale": "1",
        "infosQualite": {
          "codeQualite": "Membre",
          "libQualite": "Membre",
          "libQualiteSex": "Membre"
        },
        "organes": {
          "organeRef": "PO419865"
        }
      },
      {
        "uid": "PM492846",
        "acteurRef": "PA2943",
        "legislature": "13",
        "typeOrgane": "COMPER",
        "dateDebut": "2012-02-02T01:00:00.000+01:00",
        "datePublication": "2012-02-02T01:00:00.000+01:00",
        "dateFin": "2012-06-19T02:00:00.000+02:00",
        "preseance": "32",
        "nominPrincipale": "1",
        "infosQualite": {
          "codeQualite": "Membre",
          "libQualite": "Membre",
          "libQualiteSex": "Membre"
        },
        "organes": {
          "organeRef": "PO59051"
        }
      }
    ]
  },
  "@xmlns:xsi": "http://www.w3.org/2001/XMLSchema-instance"
}