{
  "@xmlns:xsi": "http://www.w3.org/2001/XMLSchema-instance",
  "uid": "PO700746",
  "codeType": "MINISTERE",
  "libelle": "Ministère de la décentralisation, de la réforme de l'État et de la fonction publique",
  "libelleEdition": "de la décentralisation, de la réforme de l'État et de la fonction publique",
  "libelleAbrege": "Décentralisation, réforme de l'État et fonction publique",
  "libelleAbrev": "REF",
  "viMoDe": {
    "dateDebut": "2014-04-03T02:00:00.000+02:00",
    "dateAgrement": null,
    "dateFin": "2014-06-03T02:00:00.000+02:00"
  },
  "organeParent": "PO700706"
}