{
  "@xmlns:xsi": "http://www.w3.org/2001/XMLSchema-instance",
  "uid": "PO686776",
  "codeType": "GE",
  "libelle": "Cheval",
  "libelleEdition": "Cheval",
  "libelleAbrege": "Cheval",
  "libelleAbrev": "CHEVAL",
  "viMoDe": {
    "dateDebut": null,
    "dateAgrement": "2012-11-14T01:00:00.000+01:00",
    "dateFin": "2017-06-20T02:00:00.000+02:00"
  },
  "organeParent": null,
  "chambre": null,
  "regime": "5ème République",
  "legislature": "14",
  "secretariat": {
    "secretaire01": null,
    "secretaire02": null
  }
}