{
  "@xmlns:xsi": "http://www.w3.org/2001/XMLSchema-instance",
  "uid": "PO426290",
  "codeType": "CMP",
  "libelle": "Commission mixte paritaire chargée de proposer un texte sur les dispositions restant en discussion du projet de loi de finances rectificative",
  "libelleEdition": "du projet de loi de finances rectificative",
  "libelleAbrege": "PLFR 2010 (4)",
  "libelleAbrev": "2944",
  "viMoDe": {
    "dateDebut": "2010-12-17T01:00:00.000+01:00",
    "dateAgrement": null,
    "dateFin": "2010-12-23T01:00:00.000+01:00"
  },
  "organeParent": null,
  "chambre": null,
  "regime": "5ème République",
  "legislature": "13",
  "secretariat": {
    "secretaire01": null,
    "secretaire02": null
  }
}