{
  "uid": {
    "@xsi:type": "IdActeur_type",
    "#text": "PA546"
  },
  "etatCivil": {
    "ident": {
      "civ": "M.",
      "prenom": "Roland",
      "nom": "Blum",
      "alpha": "Blum",
      "trigramme": null
    },
    "infoNaissance": {
      "dateNais": "1945-07-12T02:00:00.000+02:00",
      "villeNais": "Pennes-Mirabeau",
      "depNais": "Bouches-du-Rhône",
      "paysNais": null
    },
    "dateDeces": null
  },
  "profession": {
    "libelleCourant": "Avocat",
    "socProcINSEE": {
      "catSocPro": "Professions libérales et assimilés",
      "famSocPro": "Cadres et professions intellectuelles supérieures"
    }
  },
  "uri_hatvp": null,
  "adresses": {
    "adresse": [
      {
        "@xsi:type": "AdressePostale_Type",
        "uid": "AD274257",
        "type": "2",
        "typeLibelle": "Adresse publiée de circonscription",
        "poids": "21",
        "adresseDeRattachement": null,
        "intitule": "Hôtel de ville de Marseille",
        "numeroRue": null,
        "nomRue": "Quai du port,",
        "complementAdresse": "Cabinet du Premier Adjoint",
        "codePostal": "13002",
        "ville": "Marseille"
      },
      {
        "@xsi:type": "AdresseTelephonique_Type",
        "uid": "AD274258",
        "type": "11",
        "typeLibelle": "Téléphone",
        "poids": "21",
        "adresseDeRattachement": "AD274257",
        "valElec": "04 91 55 35 90"
      },
      {
        "@xsi:type": "AdresseTelephonique_Type",
        "uid": "AD274259",
        "type": "12",
        "typeLibelle": "Télécopie",
        "poids": "21",
        "adresseDeRattachement": "AD274257",
        "valElec": "04 91 14 62 84"
      },
      {
        "@xsi:type": "AdresseMail_Type",
        "uid": "AD274343",
        "type": "15",
        "typeLibelle": "Mèl",
        "poids": null,
        "adresseDeRattachement": null,
        "valElec": "rblum@mairie-marseille.fr"
      },
      {
        "@xsi:type": "AdressePostale_Type",
        "uid": "AD386621",
        "type": "0",
        "typeLibelle": "Adresse officielle",
        "poids": "1",
        "adresseDeRattachement": null,
        "intitule": "Assemblée nationale,",
        "numeroRue": "126",
        "nomRue": "Rue de l'Université,",
        "complementAdresse": null,
        "codePostal": "75355",
        "ville": "Paris 07 SP"
      },
      {
        "@xsi:type": "AdresseMail_Type",
        "uid": "AD391601",
        "type": "15",
        "typeLibelle": "Mèl",
        "poids": null,
        "adresseDeRattachement": null,
        "valElec": "rblum@assemblee-nationale.fr"
      }
    ]
  },
  "mandats": {
    "mandat": [
      {
        "@xmlns:xsi": "http://www.w3.org/2001/XMLSchema-instance",
        "uid": "PM386055",
        "acteurRef": "PA546",
        "legislature": "13",
        "typeOrgane": "ASSEMBLEE",
        "dateDebut": "2007-06-20T02:00:00.000+02:00",
        "datePublication": null,
        "dateFin": "2012-06-19T02:00:00.000+02:00",
        "preseance": "50",
        "nominPrincipale": "1",
        "infosQualite": {
          "codeQualite": "membre",
          "libQualite": "membre",
          "libQualiteSex": "membre"
        },
        "organes": {
          "organeRef": "PO384266"
        },
        "suppleants": {
          "suppleant": {
            "dateDebut": "2007-06-20T02:00:00.000+02:00",
            "dateFin": "2012-06-19T02:00:00.000+02:00",
            "suppleantRef": "PA297"
          }
        },
        "chambre": null,
        "election": {
          "lieu": {
            "region": "Provence-Alpes-Côte d'Azur",
            "regionType": "Métropolitain",
            "departement": "Bouches-du-Rhône",
            "numDepartement": "13",
            "numCirco": "1"
          },
          "causeMandat": "élections générales",
          "refCirconscription": "PO384310"
        },
        "mandature": {
          "datePriseFonction": "2007-06-20T02:00:00.000+02:00",
          "causeFin": "Fin de législature",
          "premiereElection": "1",
          "placeHemicycle": null,
          "mandatRemplaceRef": null
        },
        "collaborateurs": null
      },
      {
        "@xmlns:xsi": "http://www.w3.org/2001/XMLSchema-instance",
        "uid": "PM387200",
        "acteurRef": "PA546",
        "legislature": "13",
        "typeOrgane": "GP",
        "dateDebut": "2007-06-20T02:00:00.000+02:00",
        "datePublication": null,
        "dateFin": "2007-06-26T02:00:00.000+02:00",
        "preseance": "28",
        "nominPrincipale": "1",
        "infosQualite": {
          "codeQualite": "Député non-inscrit",
          "libQualite": "Député non-inscrit",
          "libQualiteSex": "Député non-inscrit"
        },
        "organes": {
          "organeRef": "PO387155"
        }
      },
      {
        "uid": "PM389717",
        "acteurRef": "PA546",
        "legislature": "13",
        "typeOrgane": "GP",
        "dateDebut": "2007-06-27T02:00:00.000+02:00",
        "datePublication": "2007-06-27T02:00:00.000+02:00",
        "dateFin": "2012-06-19T02:00:00.000+02:00",
        "preseance": "20",
        "nominPrincipale": "1",
        "infosQualite": {
          "codeQualite": "Membre",
          "libQualite": "Membre du",
          "libQualiteSex": "Membre du"
        },
        "organes": {
          "organeRef": "PO389395"
        }
      },
      {
        "uid": "PM390673",
        "acteurRef": "PA546",
        "legislature": "13",
        "typeOrgane": "COMPER",
        "dateDebut": "2007-06-27T02:00:00.000+02:00",
        "datePublication": "2007-06-28T02:00:00.000+02:00",
        "dateFin": "2012-06-19T02:00:00.000+02:00",
        "preseance": "32",
        "nominPrincipale": "1",
        "infosQualite": {
          "codeQualite": "Membre",
          "libQualite": "Membre",
          "libQualiteSex": "Membre"
        },
        "organes": {
          "organeRef": "PO59047"
        }
      },
      {
        "uid": "PM394034",
        "acteurRef": "PA546",
        "legislature": "13",
        "typeOrgane": "API",
        "dateDebut": "2007-07-25T02:00:00.000+02:00",
        "datePublication": "2007-07-19T02:00:00.000+02:00",
        "dateFin": "2012-06-19T02:00:00.000+02:00",
        "preseance": "20",
        "nominPrincipale": "0",
        "infosQualite": {
          "codeQualite": "Membre",
          "libQualite": "Membre",
          "libQualiteSex": "Membre"
        },
        "organes": {
          "organeRef": "PO58976"
        }
      },
      {
        "uid": "PM394050",
        "acteurRef": "PA546",
        "legislature": "13",
        "typeOrgane": "API",
        "dateDebut": "2007-07-25T02:00:00.000+02:00",
        "datePublication": "2007-07-28T02:00:00.000+02:00",
        "dateFin": "2012-06-19T02:00:00.000+02:00",
        "preseance": "4",
        "nominPrincipale": "1",
        "infosQualite": {
          "codeQualite": "Vice-Président",
          "libQualite": "Vice-Président",
          "libQualiteSex": "Vice-Président"
        },
        "organes": {
          "organeRef": "PO58976"
        }
      },
      {
        "@xmlns:xsi": "http://www.w3.org/2001/XMLSchema-instance",
        "uid": "PM395694",
        "acteurRef": "PA546",
        "legislature": "13",
        "typeOrgane": "GA",
        "dateDebut": "2007-09-27T02:00:00.000+02:00",
        "datePublication": null,
        "dateFin": "2012-06-19T02:00:00.000+02:00",
        "preseance": "20",
        "nominPrincipale": "0",
        "infosQualite": {
          "codeQualite": "Membre",
          "libQualite": "Membre",
          "libQualiteSex": "Membre"
        },
        "organes": {
          "organeRef": "PO393283"
        }
      },
      {
        "@xmlns:xsi": "http://www.w3.org/2001/XMLSchema-instance",
        "uid": "PM395695",
        "acteurRef": "PA546",
        "legislature": "13",
        "typeOrgane": "GA",
        "dateDebut": "2007-09-27T02:00:00.000+02:00",
        "datePublication": null,
        "dateFin": "2012-06-19T02:00:00.000+02:00",
        "preseance": "1",
        "nominPrincipale": "1",
        "infosQualite": {
          "codeQualite": "Président",
          "libQualite": "Président",
          "libQualiteSex": "Président"
        },
        "organes": {
          "organeRef": "PO393283"
        }
      },
      {
        "uid": "PM395751",
        "acteurRef": "PA546",
        "legislature": "13",
        "typeOrgane": "API",
        "dateDebut": "2007-10-01T02:00:00.000+02:00",
        "datePublication": "2007-10-02T02:00:00.000+02:00",
        "dateFin": "2012-06-19T02:00:00.000+02:00",
        "preseance": "20",
        "nominPrincipale": "1",
        "infosQualite": {
          "codeQualite": "Titulaire",
          "libQualite": "Membre titulaire",
          "libQualiteSex": "Membre titulaire"
        },
        "organes": {
          "organeRef": "PO304272"
        }
      },
      {
        "uid": "PM395783",
        "acteurRef": "PA546",
        "legislature": "13",
        "typeOrgane": "API",
        "dateDebut": "2007-10-01T02:00:00.000+02:00",
        "datePublication": "2007-10-02T02:00:00.000+02:00",
        "dateFin": "2012-06-19T02:00:00.000+02:00",
        "preseance": "20",
        "nominPrincipale": "1",
        "infosQualite": {
          "codeQualite": "Titulaire",
          "libQualite": "Représentant titulaire",
          "libQualiteSex": "Représentant titulaire"
        },
        "organes": {
          "organeRef": "PO58977"
        }
      },
      {
        "@xmlns:xsi": "http://www.w3.org/2001/XMLSchema-instance",
        "uid": "PM399776",
        "acteurRef": "PA546",
        "legislature": "13",
        "typeOrgane": "GA",
        "dateDebut": "2007-10-17T02:00:00.000+02:00",
        "datePublication": null,
        "dateFin": "2012-06-19T02:00:00.000+02:00",
        "preseance": "20",
        "nominPrincipale": "1",
        "infosQualite": {
          "codeQualite": "Membre",
          "libQualite": "Membre",
          "libQualiteSex": "Membre"
        },
        "organes": {
          "organeRef": "PO392669"
        }
      },
      {
        "@xmlns:xsi": "http://www.w3.org/2001/XMLSchema-instance",
        "uid": "PM399777",
        "acteurRef": "PA546",
        "legislature": "13",
        "typeOrgane": "GA",
        "dateDebut": "2007-10-17T02:00:00.000+02:00",
        "datePublication": null,
        "dateFin": "2012-06-19T02:00:00.000+02:00",
        "preseance": "20",
        "nominPrincipale": "1",
        "infosQualite": {
          "codeQualite": "Membre",
          "libQualite": "Membre",
          "libQualiteSex": "Membre"
        },
        "organes": {
          "organeRef": "PO392699"
        }
      },
      {
        "@xmlns:xsi": "http://www.w3.org/2001/XMLSchema-instance",
        "uid": "PM399778",
        "acteurRef": "PA546",
        "legislature": "13",
        "typeOrgane": "GA",
        "dateDebut": "2007-10-17T02:00:00.000+02:00",
        "datePublication": null,
        "dateFin": "2012-06-19T02:00:00.000+02:00",
        "preseance": "20",
        "nominPrincipale": "1",
        "infosQualite": {
          "codeQualite": "Membre",
          "libQualite": "Membre",
          "libQualiteSex": "Membre"
        },
        "organes": {
          "organeRef": "PO392950"
        }
      },
      {
        "@xmlns:xsi": "http://www.w3.org/2001/XMLSchema-instance",
        "uid": "PM399779",
        "acteurRef": "PA546",
        "legislature": "13",
        "typeOrgane": "GA",
        "dateDebut": "2007-10-17T02:00:00.000+02:00",
        "datePublication": null,
        "dateFin": "2012-06-19T02:00:00.000+02:00",
        "preseance": "20",
        "nominPrincipale": "1",
        "infosQualite": {
          "codeQualite": "Membre",
          "libQualite": "Membre",
          "libQualiteSex": "Membre"
        },
        "organes": {
          "organeRef": "PO393065"
        }
      },
      {
        "@xmlns:xsi": "http://www.w3.org/2001/XMLSchema-instance",
        "uid": "PM399780",
        "acteurRef": "PA546",
        "legislature": "13",
        "typeOrgane": "GA",
        "dateDebut": "2007-10-17T02:00:00.000+02:00",
        "datePublication": null,
        "dateFin": "2012-06-19T02:00:00.000+02:00",
        "preseance": "20",
        "nominPrincipale": "1",
        "infosQualite": {
          "codeQualite": "Membre",
          "libQualite": "Membre",
          "libQualiteSex": "Membre"
        },
        "organes": {
          "organeRef": "PO393075"
        }
      },
      {
        "@xmlns:xsi": "http://www.w3.org/2001/XMLSchema-instance",
        "uid": "PM402540",
        "acteurRef": "PA546",
        "legislature": "13",
        "typeOrgane": "GA",
        "dateDebut": "2007-11-07T01:00:00.000+01:00",
        "datePublication": null,
        "dateFin": "2012-06-19T02:00:00.000+02:00",
        "preseance": "8",
        "nominPrincipale": "1",
        "infosQualite": {
          "codeQualite": "Vice-Président",
          "libQualite": "Vice-Président",
          "libQualiteSex": "Vice-Président"
        },
        "organes": {
          "organeRef": "PO392669"
        }
      },
      {
        "@xmlns:xsi": "http://www.w3.org/2001/XMLSchema-instance",
        "uid": "PM404624",
        "acteurRef": "PA546",
        "legislature": "13",
        "typeOrgane": "GE",
        "dateDebut": "2007-11-30T01:00:00.000+01:00",
        "datePublication": null,
        "dateFin": "2012-06-19T02:00:00.000+02:00",
        "preseance": "20",
        "nominPrincipale": "0",
        "infosQualite": {
          "codeQualite": "Membre",
          "libQualite": "Membre",
          "libQualiteSex": "Membre"
        },
        "organes": {
          "organeRef": "PO403283"
        }
      },
      {
        "@xmlns:xsi": "http://www.w3.org/2001/XMLSchema-instance",
        "uid": "PM404625",
        "acteurRef": "PA546",
        "legislature": "13",
        "typeOrgane": "GE",
        "dateDebut": "2007-11-30T01:00:00.000+01:00",
        "datePublication": null,
        "dateFin": "2012-06-19T02:00:00.000+02:00",
        "preseance": "4",
        "nominPrincipale": "1",
        "infosQualite": {
          "codeQualite": "Co-Président",
          "libQualite": "Co-Président",
          "libQualiteSex": "Co-Président"
        },
        "organes": {
          "organeRef": "PO403283"
        }
      },
      {
        "@xmlns:xsi": "http://www.w3.org/2001/XMLSchema-instance",
        "uid": "PM408170",
        "acteurRef": "PA546",
        "legislature": "13",
        "typeOrgane": "GE",
        "dateDebut": "2008-02-01T01:00:00.000+01:00",
        "datePublication": null,
        "dateFin": "2012-06-19T02:00:00.000+02:00",
        "preseance": "20",
        "nominPrincipale": "1",
        "infosQualite": {
          "codeQualite": "Membre",
          "libQualite": "Membre",
          "libQualiteSex": "Membre"
        },
        "organes": {
          "organeRef": "PO403160"
        }
      },
      {
        "@xmlns:xsi": "http://www.w3.org/2001/XMLSchema-instance",
        "uid": "PM410287",
        "acteurRef": "PA546",
        "legislature": "13",
        "typeOrgane": "GE",
        "dateDebut": "2008-02-05T01:00:00.000+01:00",
        "datePublication": null,
        "dateFin": "2012-06-19T02:00:00.000+02:00",
        "preseance": "20",
        "nominPrincipale": "1",
        "infosQualite": {
          "codeQualite": "Membre",
          "libQualite": "Membre",
          "libQualiteSex": "Membre"
        },
        "organes": {
          "organeRef": "PO403319"
        }
      },
      {
        "@xmlns:xsi": "http://www.w3.org/2001/XMLSchema-instance",
        "uid": "PM422302",
        "acteurRef": "PA546",
        "legislature": "13",
        "typeOrgane": "MINISTERE",
        "dateDebut": "2009-11-10T01:00:00.000+01:00",
        "datePublication": "2009-11-13T01:00:00.000+01:00",
        "dateFin": "2010-03-01T01:00:00.000+01:00",
        "preseance": "1",
        "nominPrincipale": "1",
        "infosQualite": {
          "codeQualite": "en mission",
          "libQualite": "en mission",
          "libQualiteSex": "en mission"
        },
        "organes": {
          "organeRef": "PO388143"
        },
        "libelle": "La desserte des ports",
        "missionSuivanteRef": null,
        "missionPrecedenteRef": null
      },
      {
        "@xmlns:xsi": "http://www.w3.org/2001/XMLSchema-instance",
        "uid": "PM473449",
        "acteurRef": "PA546",
        "legislature": "13",
        "typeOrgane": "MINISTERE",
        "dateDebut": "2012-01-10T01:00:00.000+01:00",
        "datePublication": "2012-01-11T01:00:00.000+01:00",
        "dateFin": "2012-05-10T02:00:00.000+02:00",
        "preseance": "1",
        "nominPrincipale": "1",
        "infosQualite": {
          "codeQualite": "en mission",
          "libQualite": "en mission",
          "libQualiteSex": "en mission"
        },
        "organes": {
          "organeRef": [
            "PO425720",
            "PO429241"
          ]
        },
        "libelle": "Politique énergétique",
        "missionSuivanteRef": null,
        "missionPrecedenteRef": null
      }
    ]
  },
  "@xmlns:xsi": "http://www.w3.org/2001/XMLSchema-instance"
}