{
  "@xmlns:xsi": "http://www.w3.org/2001/XMLSchema-instance",
  "uid": "PO591183",
  "codeType": "MINISTERE",
  "libelle": "Ministère de l'écologie, du développement durable et de l'énergie",
  "libelleEdition": "Ministère de l'écologie, du développement durable et de l'énergie",
  "libelleAbrege": "Écologie, développement durable et énergie",
  "libelleAbrev": "EDD",
  "viMoDe": {
    "dateDebut": "2012-05-17T02:00:00.000+02:00",
    "dateAgrement": null,
    "dateFin": "2012-06-18T02:00:00.000+02:00"
  },
  "organeParent": "PO590011"
}