{
  "uid": {
    "@xsi:type": "IdActeur_type",
    "#text": "PA2051"
  },
  "etatCivil": {
    "ident": {
      "civ": "M.",
      "prenom": "Thierry",
      "nom": "Mandon",
      "alpha": "Mandon",
      "trigramme": null
    },
    "infoNaissance": {
      "dateNais": "1957-12-30T01:00:00.000+01:00",
      "villeNais": "Lausanne",
      "depNais": null,
      "paysNais": "Suisse"
    },
    "dateDeces": null
  },
  "profession": {
    "libelleCourant": "Directeur de société",
    "socProcINSEE": {
      "catSocPro": "Cadres d'entreprise",
      "famSocPro": "Cadres et professions intellectuelles supérieures"
    }
  },
  "uri_hatvp": null,
  "adresses": {
    "adresse": [
      {
        "@xsi:type": "AdressePostale_Type",
        "uid": "AD45243",
        "type": "0",
        "typeLibelle": "Adresse officielle",
        "poids": "1",
        "adresseDeRattachement": null,
        "intitule": "Assemblée nationale",
        "numeroRue": "126",
        "nomRue": "Rue de l'université",
        "complementAdresse": null,
        "codePostal": "75355",
        "ville": "Paris 07 SP"
      },
      {
        "@xsi:type": "AdressePostale_Type",
        "uid": "AD645939",
        "type": "2",
        "typeLibelle": "Adresse publiée de circonscription",
        "poids": "22",
        "adresseDeRattachement": null,
        "intitule": "Hôtel de Ville",
        "numeroRue": null,
        "nomRue": "Place du Général de Gaulle",
        "complementAdresse": null,
        "codePostal": "91130",
        "ville": "Ris-Orangis"
      },
      {
        "@xsi:type": "AdresseTelephonique_Type",
        "uid": "AD645940",
        "type": "11",
        "typeLibelle": "Téléphone",
        "poids": "22",
        "adresseDeRattachement": "AD645939",
        "valElec": "01 69 02 52 03"
      },
      {
        "@xsi:type": "AdresseTelephonique_Type",
        "uid": "AD645941",
        "type": "12",
        "typeLibelle": "Télécopie",
        "poids": "22",
        "adresseDeRattachement": "AD645939",
        "valElec": "01 69 43 15 16"
      },
      {
        "@xsi:type": "AdresseMail_Type",
        "uid": "AD645943",
        "type": "15",
        "typeLibelle": "Mèl",
        "poids": null,
        "adresseDeRattachement": null,
        "valElec": "mandonthierry@gmail.com"
      },
      {
        "@xsi:type": "AdresseSiteWeb_Type",
        "uid": "AD645945",
        "type": "22",
        "typeLibelle": "Site internet",
        "poids": null,
        "adresseDeRattachement": null,
        "valElec": "www.thierrymandon.fr"
      },
      {
        "@xsi:type": "AdresseMail_Type",
        "uid": "AD648687",
        "type": "15",
        "typeLibelle": "Mèl",
        "poids": null,
        "adresseDeRattachement": null,
        "valElec": "tmandon@assemblee-nationale.fr"
      }
    ]
  },
  "mandats": {
    "mandat": [
      {
        "@xmlns:xsi": "http://www.w3.org/2001/XMLSchema-instance",
        "uid": "PM645056",
        "acteurRef": "PA2051",
        "legislature": "14",
        "typeOrgane": "ASSEMBLEE",
        "dateDebut": "2012-06-20T02:00:00.000+02:00",
        "datePublication": null,
        "dateFin": "2014-07-03T02:00:00.000+02:00",
        "preseance": "50",
        "nominPrincipale": "1",
        "infosQualite": {
          "codeQualite": "membre",
          "libQualite": "membre",
          "libQualiteSex": "membre"
        },
        "organes": {
          "organeRef": "PO644420"
        },
        "suppleants": {
          "suppleant": {
            "dateDebut": "2012-06-20T02:00:00.000+02:00",
            "dateFin": "2014-07-03T02:00:00.000+02:00",
            "suppleantRef": "PA643020"
          }
        },
        "chambre": null,
        "election": {
          "lieu": {
            "region": "Ile-de-France",
            "regionType": "Métropolitain",
            "departement": "Essonne",
            "numDepartement": "91",
            "numCirco": "9"
          },
          "causeMandat": "élections générales",
          "refCirconscription": "PO644927"
        },
        "mandature": {
          "datePriseFonction": "2012-06-20T02:00:00.000+02:00",
          "causeFin": "Nomination comme membre du Gouvernement",
          "premiereElection": "1",
          "placeHemicycle": null,
          "mandatRemplaceRef": null
        },
        "collaborateurs": null
      },
      {
        "uid": "PM656221",
        "acteurRef": "PA2051",
        "legislature": "14",
        "typeOrgane": "GP",
        "dateDebut": "2012-06-26T02:00:00.000+02:00",
        "datePublication": "2012-06-27T02:00:00.000+02:00",
        "dateFin": "2014-07-03T02:00:00.000+02:00",
        "preseance": "20",
        "nominPrincipale": "1",
        "infosQualite": {
          "codeQualite": "Membre",
          "libQualite": "Membre du",
          "libQualiteSex": "Membre du"
        },
        "organes": {
          "organeRef": "PO656002"
        }
      },
      {
        "uid": "PM657308",
        "acteurRef": "PA2051",
        "legislature": "14",
        "typeOrgane": "COMPER",
        "dateDebut": "2012-06-28T02:00:00.000+02:00",
        "datePublication": "2012-06-28T02:00:00.000+02:00",
        "dateFin": "2014-06-11T02:00:00.000+02:00",
        "preseance": "32",
        "nominPrincipale": "1",
        "infosQualite": {
          "codeQualite": "Membre",
          "libQualite": "Membre",
          "libQualiteSex": "Membre"
        },
        "organes": {
          "organeRef": "PO59048"
        }
      },
      {
        "uid": "PM677860",
        "acteurRef": "PA2051",
        "legislature": "14",
        "typeOrgane": "ORGEXTPARL",
        "dateDebut": "2012-09-03T02:00:00.000+02:00",
        "datePublication": "2012-09-04T02:00:00.000+02:00",
        "dateFin": "2014-07-03T02:00:00.000+02:00",
        "preseance": "20",
        "nominPrincipale": "1",
        "infosQualite": {
          "codeQualite": "Titulaire",
          "libQualite": "Membre titulaire",
          "libQualiteSex": "Membre titulaire"
        },
        "organes": {
          "organeRef": "PO428181"
        }
      },
      {
        "@xmlns:xsi": "http://www.w3.org/2001/XMLSchema-instance",
        "uid": "PM678203",
        "acteurRef": "PA2051",
        "legislature": "14",
        "typeOrgane": "MISINFOPRE",
        "dateDebut": "2012-09-20T02:00:00.000+02:00",
        "datePublication": "2012-09-21T02:00:00.000+02:00",
        "dateFin": "2013-03-27T01:00:00.000+01:00",
        "preseance": "20",
        "nominPrincipale": "1",
        "infosQualite": {
          "codeQualite": "Membre",
          "libQualite": "Membre",
          "libQualiteSex": "Membre"
        },
        "organes": {
          "organeRef": "PO677887"
        },
        "libelle": null,
        "missionSuivanteRef": null,
        "missionPrecedenteRef": null
      },
      {
        "uid": "PM678336",
        "acteurRef": "PA2051",
        "legislature": "14",
        "typeOrgane": "CNPS",
        "dateDebut": "2012-09-25T02:00:00.000+02:00",
        "datePublication": "2012-09-26T02:00:00.000+02:00",
        "dateFin": "2012-11-22T01:00:00.000+01:00",
        "preseance": "20",
        "nominPrincipale": "1",
        "infosQualite": {
          "codeQualite": "Membre",
          "libQualite": "Membre",
          "libQualiteSex": "Membre"
        },
        "organes": {
          "organeRef": "PO678157"
        }
      },
      {
        "uid": "PM683936",
        "acteurRef": "PA2051",
        "legislature": "14",
        "typeOrgane": "CMP",
        "dateDebut": "2012-11-06T01:00:00.000+01:00",
        "datePublication": "2012-11-07T01:00:00.000+01:00",
        "dateFin": "2012-11-09T01:00:00.000+01:00",
        "preseance": "28",
        "nominPrincipale": "1",
        "infosQualite": {
          "codeQualite": "Suppléant",
          "libQualite": "Membre suppléant",
          "libQualiteSex": "Membre suppléant"
        },
        "organes": {
          "organeRef": "PO683757"
        }
      },
      {
        "@xmlns:xsi": "http://www.w3.org/2001/XMLSchema-instance",
        "uid": "PM684231",
        "acteurRef": "PA2051",
        "legislature": "14",
        "typeOrgane": "GA",
        "dateDebut": "2012-11-08T01:00:00.000+01:00",
        "datePublication": null,
        "dateFin": "2014-07-03T02:00:00.000+02:00",
        "preseance": "20",
        "nominPrincipale": "1",
        "infosQualite": {
          "codeQualite": "Membre",
          "libQualite": "Membre",
          "libQualiteSex": "Membre"
        },
        "organes": {
          "organeRef": "PO675836"
        }
      },
      {
        "uid": "PM685281",
        "acteurRef": "PA2051",
        "legislature": "14",
        "typeOrgane": "CMP",
        "dateDebut": "2012-12-04T01:00:00.000+01:00",
        "datePublication": "2012-12-05T01:00:00.000+01:00",
        "dateFin": "2012-12-19T01:00:00.000+01:00",
        "preseance": "20",
        "nominPrincipale": "1",
        "infosQualite": {
          "codeQualite": "Titulaire",
          "libQualite": "Membre titulaire",
          "libQualiteSex": "Membre titulaire"
        },
        "organes": {
          "organeRef": "PO684249"
        }
      },
      {
        "uid": "PM685311",
        "acteurRef": "PA2051",
        "legislature": "14",
        "typeOrgane": "CMP",
        "dateDebut": "2012-12-04T01:00:00.000+01:00",
        "datePublication": "2012-12-05T01:00:00.000+01:00",
        "dateFin": "2012-12-19T01:00:00.000+01:00",
        "preseance": "20",
        "nominPrincipale": "1",
        "infosQualite": {
          "codeQualite": "Titulaire",
          "libQualite": "Membre titulaire",
          "libQualiteSex": "Membre titulaire"
        },
        "organes": {
          "organeRef": "PO685148"
        }
      },
      {
        "@xmlns:xsi": "http://www.w3.org/2001/XMLSchema-instance",
        "uid": "PM685941",
        "acteurRef": "PA2051",
        "legislature": null,
        "typeOrgane": "PARPOL",
        "dateDebut": "2012-12-01T01:00:00.000+01:00",
        "datePublication": null,
        "dateFin": "2014-07-03T02:00:00.000+02:00",
        "preseance": "5",
        "nominPrincipale": "1",
        "infosQualite": {
          "codeQualite": "Membre",
          "libQualite": "Membre",
          "libQualiteSex": "Membre"
        },
        "organes": {
          "organeRef": "PO684932"
        }
      },
      {
        "uid": "PM687159",
        "acteurRef": "PA2051",
        "legislature": "14",
        "typeOrgane": "CMP",
        "dateDebut": "2012-12-17T01:00:00.000+01:00",
        "datePublication": "2012-12-18T01:00:00.000+01:00",
        "dateFin": "2012-12-19T01:00:00.000+01:00",
        "preseance": "20",
        "nominPrincipale": "1",
        "infosQualite": {
          "codeQualite": "Titulaire",
          "libQualite": "Membre titulaire",
          "libQualiteSex": "Membre titulaire"
        },
        "organes": {
          "organeRef": "PO687137"
        }
      },
      {
        "@xmlns:xsi": "http://www.w3.org/2001/XMLSchema-instance",
        "uid": "PM687206",
        "acteurRef": "PA2051",
        "legislature": "14",
        "typeOrgane": "GA",
        "dateDebut": "2012-12-11T01:00:00.000+01:00",
        "datePublication": null,
        "dateFin": "2014-07-03T02:00:00.000+02:00",
        "preseance": "8",
        "nominPrincipale": "1",
        "infosQualite": {
          "codeQualite": "Vice-Président",
          "libQualite": "Vice-Président",
          "libQualiteSex": "Vice-Président"
        },
        "organes": {
          "organeRef": "PO675836"
        }
      },
      {
        "@xmlns:xsi": "http://www.w3.org/2001/XMLSchema-instance",
        "uid": "PM691517",
        "acteurRef": "PA2051",
        "legislature": "14",
        "typeOrgane": "MINISTERE",
        "dateDebut": "2013-02-14T01:00:00.000+01:00",
        "datePublication": "2013-02-15T01:00:00.000+01:00",
        "dateFin": "2013-08-13T02:00:00.000+02:00",
        "preseance": "1",
        "nominPrincipale": "1",
        "infosQualite": {
          "codeQualite": "en mission",
          "libQualite": "en mission",
          "libQualiteSex": "en mission"
        },
        "organes": {
          "organeRef": [
            "PO653293",
            "PO653335",
            "PO653341"
          ]
        },
        "libelle": "Simplification de l'environnement réglementaire et fiscal des entreprises",
        "missionSuivanteRef": null,
        "missionPrecedenteRef": null
      },
      {
        "uid": "PM698864",
        "acteurRef": "PA2051",
        "legislature": "14",
        "typeOrgane": "CMP",
        "dateDebut": "2013-12-04T01:00:00.000+01:00",
        "datePublication": "2013-12-05T01:00:00.000+01:00",
        "dateFin": "2014-01-02T01:00:00.000+01:00",
        "preseance": "20",
        "nominPrincipale": "1",
        "infosQualite": {
          "codeQualite": "Titulaire",
          "libQualite": "Membre titulaire",
          "libQualiteSex": "Membre titulaire"
        },
        "organes": {
          "organeRef": "PO698794"
        }
      },
      {
        "@xmlns:xsi": "http://www.w3.org/2001/XMLSchema-instance",
        "uid": "PM698961",
        "acteurRef": "PA2051",
        "legislature": "14",
        "typeOrgane": "MISINFOPRE",
        "dateDebut": "2013-12-06T01:00:00.000+01:00",
        "datePublication": "2013-12-07T01:00:00.000+01:00",
        "dateFin": "2014-06-03T02:00:00.000+02:00",
        "preseance": "20",
        "nominPrincipale": "1",
        "infosQualite": {
          "codeQualite": "Membre",
          "libQualite": "Membre",
          "libQualiteSex": "Membre"
        },
        "organes": {
          "organeRef": "PO698927"
        },
        "libelle": null,
        "missionSuivanteRef": null,
        "missionPrecedenteRef": null
      },
      {
        "@xmlns:xsi": "http://www.w3.org/2001/XMLSchema-instance",
        "uid": "PM699065",
        "acteurRef": "PA2051",
        "legislature": "14",
        "typeOrgane": "MISINFOPRE",
        "dateDebut": "2013-12-11T01:00:00.000+01:00",
        "datePublication": "2013-12-12T01:00:00.000+01:00",
        "dateFin": "2014-06-03T02:00:00.000+02:00",
        "preseance": "16",
        "nominPrincipale": "1",
        "infosQualite": {
          "codeQualite": "Rapporteur",
          "libQualite": "Rapporteur",
          "libQualiteSex": "Rapporteur"
        },
        "organes": {
          "organeRef": "PO698927"
        },
        "libelle": null,
        "missionSuivanteRef": null,
        "missionPrecedenteRef": null
      },
      {
        "uid": "PM699128",
        "acteurRef": "PA2051",
        "legislature": "14",
        "typeOrgane": "CMP",
        "dateDebut": "2013-12-13T01:00:00.000+01:00",
        "datePublication": "2013-12-17T01:00:00.000+01:00",
        "dateFin": "2014-01-02T01:00:00.000+01:00",
        "preseance": "28",
        "nominPrincipale": "1",
        "infosQualite": {
          "codeQualite": "Suppléant",
          "libQualite": "Membre suppléant",
          "libQualiteSex": "Membre suppléant"
        },
        "organes": {
          "organeRef": "PO699107"
        }
      },
      {
        "@xmlns:xsi": "http://www.w3.org/2001/XMLSchema-instance",
        "uid": "PM701711",
        "acteurRef": "PA2051",
        "legislature": null,
        "typeOrgane": "MINISTERE",
        "dateDebut": "2014-06-04T02:00:00.000+02:00",
        "datePublication": "2014-06-04T02:00:00.000+02:00",
        "dateFin": "2014-08-26T02:00:00.000+02:00",
        "preseance": "50",
        "nominPrincipale": "1",
        "infosQualite": {
          "codeQualite": "Secrétaire d'État",
          "libQualite": "Secrétaire d'État",
          "libQualiteSex": "Secrétaire d'État"
        },
        "organes": {
          "organeRef": "PO701709"
        }
      },
      {
        "uid": "PM701778",
        "acteurRef": "PA2051",
        "legislature": "14",
        "typeOrgane": "COMPER",
        "dateDebut": "2014-06-12T02:00:00.000+02:00",
        "datePublication": "2014-06-12T02:00:00.000+02:00",
        "dateFin": "2014-07-03T02:00:00.000+02:00",
        "preseance": "32",
        "nominPrincipale": "1",
        "infosQualite": {
          "codeQualite": "Membre",
          "libQualite": "Membre",
          "libQualiteSex": "Membre"
        },
        "organes": {
          "organeRef": "PO59046"
        }
      },
      {
        "@xmlns:xsi": "http://www.w3.org/2001/XMLSchema-instance",
        "uid": "PM702986",
        "acteurRef": "PA2051",
        "legislature": null,
        "typeOrgane": "MINISTERE",
        "dateDebut": "2014-08-27T02:00:00.000+02:00",
        "datePublication": "2014-08-27T02:00:00.000+02:00",
        "dateFin": "2015-06-17T02:00:00.000+02:00",
        "preseance": "50",
        "nominPrincipale": "1",
        "infosQualite": {
          "codeQualite": "Secrétaire d'État",
          "libQualite": "Secrétaire d'État",
          "libQualiteSex": "Secrétaire d'État"
        },
        "organes": {
          "organeRef": "PO702890"
        }
      },
      {
        "@xmlns:xsi": "http://www.w3.org/2001/XMLSchema-instance",
        "uid": "PM708674",
        "acteurRef": "PA2051",
        "legislature": null,
        "typeOrgane": "MINISTERE",
        "dateDebut": "2015-06-18T02:00:00.000+02:00",
        "datePublication": "2015-06-18T02:00:00.000+02:00",
        "dateFin": "2016-12-06T01:00:00.000+01:00",
        "preseance": "50",
        "nominPrincipale": "1",
        "infosQualite": {
          "codeQualite": "Secrétaire d'État",
          "libQualite": "Secrétaire d'État",
          "libQualiteSex": "Secrétaire d'État"
        },
        "organes": {
          "organeRef": "PO708672"
        }
      },
      {
        "@xmlns:xsi": "http://www.w3.org/2001/XMLSchema-instance",
        "uid": "PM715904",
        "acteurRef": "PA2051",
        "legislature": null,
        "typeOrgane": "MINISTERE",
        "dateDebut": "2016-12-07T01:00:00.000+01:00",
        "datePublication": "2016-12-07T01:00:00.000+01:00",
        "dateFin": "2017-05-17T02:00:00.000+02:00",
        "preseance": "50",
        "nominPrincipale": "1",
        "infosQualite": {
          "codeQualite": "Secrétaire d'État",
          "libQualite": "Secrétaire d'État",
          "libQualiteSex": "Secrétaire d'État"
        },
        "organes": {
          "organeRef": "PO715900"
        }
      },
      {
        "@xmlns:xsi": "http://www.w3.org/2001/XMLSchema-instance",
        "uid": "PM15701711",
        "acteurRef": "PA2051",
        "legislature": null,
        "typeOrgane": "GOUVERNEMENT",
        "dateDebut": "2014-06-04T02:00:00.000+02:00",
        "datePublication": "2014-06-04T02:00:00.000+02:00",
        "dateFin": "2014-08-26T02:00:00.000+02:00",
        "preseance": "50",
        "nominPrincipale": "1",
        "infosQualite": {
          "codeQualite": "membre",
          "libQualite": "membre",
          "libQualiteSex": "membre"
        },
        "organes": {
          "organeRef": "PO700706"
        }
      },
      {
        "@xmlns:xsi": "http://www.w3.org/2001/XMLSchema-instance",
        "uid": "PM15702986",
        "acteurRef": "PA2051",
        "legislature": null,
        "typeOrgane": "GOUVERNEMENT",
        "dateDebut": "2014-08-27T02:00:00.000+02:00",
        "datePublication": "2014-08-27T02:00:00.000+02:00",
        "dateFin": "2016-12-06T01:00:00.000+01:00",
        "preseance": "50",
        "nominPrincipale": "1",
        "infosQualite": {
          "codeQualite": "membre",
          "libQualite": "membre",
          "libQualiteSex": "membre"
        },
        "organes": {
          "organeRef": "PO702883"
        }
      },
      {
        "@xmlns:xsi": "http://www.w3.org/2001/XMLSchema-instance",
        "uid": "PM15715904",
        "acteurRef": "PA2051",
        "legislature": null,
        "typeOrgane": "GOUVERNEMENT",
        "dateDebut": "2016-12-07T01:00:00.000+01:00",
        "datePublication": "2016-12-07T01:00:00.000+01:00",
        "dateFin": "2017-05-17T02:00:00.000+02:00",
        "preseance": "50",
        "nominPrincipale": "1",
        "infosQualite": {
          "codeQualite": "membre",
          "libQualite": "membre",
          "libQualiteSex": "membre"
        },
        "organes": {
          "organeRef": "PO715793"
        }
      }
    ]
  },
  "@xmlns:xsi": "http://www.w3.org/2001/XMLSchema-instance"
}