{
  "@xmlns:xsi": "http://www.w3.org/2001/XMLSchema-instance",
  "uid": "PO420854",
  "codeType": "ORGEXTPARL",
  "libelle": "Conseil d'administration de l'Etablissement national des produits de l'agriculture et de la mer",
  "libelleEdition": "du conseil d'administration de l'Etablissement national des produits de l'agriculture et de la mer",
  "libelleAbrege": "FranceAgriMer",
  "libelleAbrev": "251",
  "viMoDe": {
    "dateDebut": "2009-03-25T01:00:00.000+01:00",
    "dateAgrement": null,
    "dateFin": null
  },
  "organeParent": null,
  "chambre": null,
  "regime": "5ème République",
  "legislature": null,
  "regimeJuridique": "Article L. 621-5 du code rural et de la pêche maritime",
  "siteInternet": "http://www.franceagrimer.fr/Etablissement/Organisation/Conseil-d-administration",
  "nombreReunionsAnnuelles": null
}