{
  "@xmlns:xsi": "http://www.w3.org/2001/XMLSchema-instance",
  "uid": "PO757572",
  "codeType": "MISINFOCOM",
  "libelle": "Mission d'information commune sur le suivi de la stratégie de sortie du glyphosate",
  "libelleEdition": "de la mission d'information commune sur le suivi de la stratégie de sortie du glyphosate",
  "libelleAbrege": "Glyphosate",
  "libelleAbrev": "MICGLYPHO",
  "viMoDe": {
    "dateDebut": "2018-07-04T02:00:00.000+02:00",
    "dateAgrement": null,
    "dateFin": null
  },
  "organeParent": null,
  "chambre": null,
  "regime": "5ème République",
  "legislature": "15",
  "secretariat": {
    "secretaire01": null,
    "secretaire02": null
  }
}