{
  "@xmlns:xsi": "http://www.w3.org/2001/XMLSchema-instance",
  "uid": "PO747185",
  "codeType": "GE",
  "libelle": "Santé environnementale",
  "libelleEdition": "SANTÉ ENVIRONNEMENTALE",
  "libelleAbrege": "SANTÉ ENVIRONNEMENTALE",
  "libelleAbrev": "SANTÉENVIR",
  "viMoDe": {
    "dateDebut": null,
    "dateAgrement": "2017-12-20T01:00:00.000+01:00",
    "dateFin": null
  },
  "organeParent": null,
  "chambre": null,
  "regime": "5ème République",
  "legislature": "15",
  "secretariat": {
    "secretaire01": "M. François Petaux",
    "secretaire02": null
  }
}