{
  "@xmlns:xsi": "http://www.w3.org/2001/XMLSchema-instance",
  "uid": "PO296218",
  "codeType": "ORGEXTPARL",
  "libelle": "Conseil d'administration du Fonds pour le développement de l'intermodalité dans les transports",
  "libelleEdition": "du conseil d'administration du Fonds pour le développement de l'intermodalité dans les transports",
  "libelleAbrege": "Transports, intermodalité",
  "libelleAbrev": "189",
  "viMoDe": {
    "dateDebut": "2002-04-05T02:00:00.000+02:00",
    "dateAgrement": null,
    "dateFin": null
  },
  "organeParent": null,
  "chambre": null,
  "regime": "5ème République",
  "legislature": null,
  "regimeJuridique": "Article L. 1512-8 du code des transports",
  "siteInternet": null,
  "nombreReunionsAnnuelles": null
}