{
  "@xmlns:xsi": "http://www.w3.org/2001/XMLSchema-instance",
  "uid": "PO707219",
  "codeType": "ORGEXTPARL",
  "libelle": "Agence française d'expertise technique internationale",
  "libelleEdition": null,
  "libelleAbrege": "AFETI",
  "libelleAbrev": "328",
  "viMoDe": {
    "dateDebut": "2014-12-29T01:00:00.000+01:00",
    "dateAgrement": null,
    "dateFin": null
  },
  "organeParent": null,
  "chambre": null,
  "regime": "5ème République",
  "legislature": null,
  "regimeJuridique": "Article 12 de la loi n° 2010-873 du 27 juillet 2010",
  "siteInternet": "http://www.europe-international-et-formation.eu/union-europeenne-formation/actualites/agence-francaise-d-expertise.html",
  "nombreReunionsAnnuelles": null
}