{
  "@xmlns:xsi": "http://www.w3.org/2001/XMLSchema-instance",
  "uid": "PO411370",
  "codeType": "MISINFOPRE",
  "libelle": "Mission d'information sur les questions mémorielles",
  "libelleEdition": "de la Mission d'information sur les questions mémorielles",
  "libelleAbrege": "Mission sur les questions mémorielles",
  "libelleAbrev": "MÉMOIRE",
  "viMoDe": {
    "dateDebut": "2008-03-25T01:00:00.000+01:00",
    "dateAgrement": null,
    "dateFin": "2010-01-26T01:00:00.000+01:00"
  },
  "organeParent": null,
  "chambre": null,
  "regime": "5ème République",
  "legislature": "13",
  "secretariat": {
    "secretaire01": null,
    "secretaire02": null
  }
}