{
  "@xmlns:xsi": "http://www.w3.org/2001/XMLSchema-instance",
  "uid": "PO732421",
  "codeType": "GROUPESENAT",
  "libelle": "Groupe La République En Marche",
  "libelleEdition": null,
  "libelleAbrege": "Groupe La République En Marche",
  "libelleAbrev": "LREMP",
  "viMoDe": {
    "dateDebut": "2017-06-28T02:00:00.000+02:00",
    "dateAgrement": null,
    "dateFin": null
  },
  "organeParent": null
}