{
  "uid": {
    "@xsi:type": "IdActeur_type",
    "#text": "PA508"
  },
  "etatCivil": {
    "ident": {
      "civ": "Mme",
      "prenom": "Gisèle",
      "nom": "Biémouret",
      "alpha": "Biemouret",
      "trigramme": "GBE"
    },
    "infoNaissance": {
      "dateNais": "1952-06-16T01:00:00.000+01:00",
      "villeNais": "Fleurance",
      "depNais": "Gers",
      "paysNais": "France"
    },
    "dateDeces": null
  },
  "profession": {
    "libelleCourant": "Assistante parlementaire",
    "socProcINSEE": {
      "catSocPro": "Cadres de la fonction publique, professions intellectuelles et  artistiques",
      "famSocPro": "Cadres et professions intellectuelles supérieures"
    }
  },
  "uri_hatvp": "https://www.hatvp.fr/pages_nominatives/biemouret-gisele",
  "adresses": {
    "adresse": [
      {
        "@xsi:type": "AdressePostale_Type",
        "uid": "AD386720",
        "type": "0",
        "typeLibelle": "Adresse officielle",
        "poids": "1",
        "adresseDeRattachement": null,
        "intitule": "Assemblée nationale,",
        "numeroRue": "126",
        "nomRue": "Rue de l'Université,",
        "complementAdresse": null,
        "codePostal": "75355",
        "ville": "Paris 07 SP"
      },
      {
        "@xsi:type": "AdresseMail_Type",
        "uid": "AD388873",
        "type": "15",
        "typeLibelle": "Mèl",
        "poids": null,
        "adresseDeRattachement": null,
        "valElec": "biemouret.gisele@orange.fr"
      },
      {
        "@xsi:type": "AdresseMail_Type",
        "uid": "AD391594",
        "type": "15",
        "typeLibelle": "Mèl",
        "poids": null,
        "adresseDeRattachement": null,
        "valElec": "gisele.biemouret@assemblee-nationale.fr"
      },
      {
        "@xsi:type": "AdressePostale_Type",
        "uid": "AD394409",
        "type": "2",
        "typeLibelle": "Adresse publiée de circonscription",
        "poids": "22",
        "adresseDeRattachement": null,
        "intitule": "Permanence",
        "numeroRue": "8",
        "nomRue": "Rue des Armuriers",
        "complementAdresse": null,
        "codePostal": "32100",
        "ville": "Condom"
      },
      {
        "@xsi:type": "AdresseTelephonique_Type",
        "uid": "AD394410",
        "type": "11",
        "typeLibelle": "Téléphone",
        "poids": "22",
        "adresseDeRattachement": "AD394409",
        "valElec": "05 62 68 09 55"
      }
    ]
  },
  "mandats": {
    "mandat": [
      {
        "@xmlns:xsi": "http://www.w3.org/2001/XMLSchema-instance",
        "uid": "PM386045",
        "acteurRef": "PA508",
        "legislature": "13",
        "typeOrgane": "ASSEMBLEE",
        "dateDebut": "2007-06-20T02:00:00.000+02:00",
        "datePublication": null,
        "dateFin": "2012-06-19T02:00:00.000+02:00",
        "preseance": "50",
        "nominPrincipale": "1",
        "infosQualite": {
          "codeQualite": "membre",
          "libQualite": "membre",
          "libQualiteSex": "membre"
        },
        "organes": {
          "organeRef": "PO384266"
        },
        "suppleants": {
          "suppleant": {
            "dateDebut": "2007-06-20T02:00:00.000+02:00",
            "dateFin": "2012-06-19T02:00:00.000+02:00",
            "suppleantRef": "PA341904"
          }
        },
        "chambre": null,
        "election": {
          "lieu": {
            "region": "Occitanie",
            "regionType": "Métropolitain",
            "departement": "Gers",
            "numDepartement": "32",
            "numCirco": "2"
          },
          "causeMandat": "élections générales",
          "refCirconscription": "PO384409"
        },
        "mandature": {
          "datePriseFonction": "2007-06-20T02:00:00.000+02:00",
          "causeFin": "Fin de législature",
          "premiereElection": "0",
          "placeHemicycle": "515",
          "mandatRemplaceRef": null
        },
        "collaborateurs": null
      },
      {
        "@xmlns:xsi": "http://www.w3.org/2001/XMLSchema-instance",
        "uid": "PM387299",
        "acteurRef": "PA508",
        "legislature": "13",
        "typeOrgane": "GP",
        "dateDebut": "2007-06-20T02:00:00.000+02:00",
        "datePublication": null,
        "dateFin": "2007-06-26T02:00:00.000+02:00",
        "preseance": "28",
        "nominPrincipale": "1",
        "infosQualite": {
          "codeQualite": "Député non-inscrit",
          "libQualite": "Député non-inscrit",
          "libQualiteSex": "Députée non-inscrite"
        },
        "organes": {
          "organeRef": "PO387155"
        }
      },
      {
        "uid": "PM390048",
        "acteurRef": "PA508",
        "legislature": "13",
        "typeOrgane": "GP",
        "dateDebut": "2007-06-27T02:00:00.000+02:00",
        "datePublication": "2007-06-27T02:00:00.000+02:00",
        "dateFin": "2012-06-19T02:00:00.000+02:00",
        "preseance": "20",
        "nominPrincipale": "1",
        "infosQualite": {
          "codeQualite": "Membre",
          "libQualite": "Membre du",
          "libQualiteSex": "Membre du"
        },
        "organes": {
          "organeRef": "PO389507"
        }
      },
      {
        "uid": "PM390741",
        "acteurRef": "PA508",
        "legislature": "13",
        "typeOrgane": "COMPER",
        "dateDebut": "2007-06-27T02:00:00.000+02:00",
        "datePublication": "2007-06-28T02:00:00.000+02:00",
        "dateFin": "2008-12-12T01:00:00.000+01:00",
        "preseance": "32",
        "nominPrincipale": "1",
        "infosQualite": {
          "codeQualite": "Membre",
          "libQualite": "Membre",
          "libQualiteSex": "Membre"
        },
        "organes": {
          "organeRef": "PO59046"
        }
      },
      {
        "@xmlns:xsi": "http://www.w3.org/2001/XMLSchema-instance",
        "uid": "PM397551",
        "acteurRef": "PA508",
        "legislature": "13",
        "typeOrgane": "GA",
        "dateDebut": "2007-10-09T02:00:00.000+02:00",
        "datePublication": null,
        "dateFin": "2012-06-19T02:00:00.000+02:00",
        "preseance": "20",
        "nominPrincipale": "1",
        "infosQualite": {
          "codeQualite": "Membre",
          "libQualite": "Membre",
          "libQualiteSex": "Membre"
        },
        "organes": {
          "organeRef": "PO392800"
        }
      },
      {
        "@xmlns:xsi": "http://www.w3.org/2001/XMLSchema-instance",
        "uid": "PM397552",
        "acteurRef": "PA508",
        "legislature": "13",
        "typeOrgane": "GA",
        "dateDebut": "2007-10-09T02:00:00.000+02:00",
        "datePublication": null,
        "dateFin": "2012-06-19T02:00:00.000+02:00",
        "preseance": "20",
        "nominPrincipale": "1",
        "infosQualite": {
          "codeQualite": "Membre",
          "libQualite": "Membre",
          "libQualiteSex": "Membre"
        },
        "organes": {
          "organeRef": "PO393353"
        }
      },
      {
        "@xmlns:xsi": "http://www.w3.org/2001/XMLSchema-instance",
        "uid": "PM397553",
        "acteurRef": "PA508",
        "legislature": "13",
        "typeOrgane": "GA",
        "dateDebut": "2007-10-09T02:00:00.000+02:00",
        "datePublication": null,
        "dateFin": "2012-06-19T02:00:00.000+02:00",
        "preseance": "20",
        "nominPrincipale": "1",
        "infosQualite": {
          "codeQualite": "Membre",
          "libQualite": "Membre",
          "libQualiteSex": "Membre"
        },
        "organes": {
          "organeRef": "PO393408"
        }
      },
      {
        "@xmlns:xsi": "http://www.w3.org/2001/XMLSchema-instance",
        "uid": "PM405627",
        "acteurRef": "PA508",
        "legislature": "13",
        "typeOrgane": "GE",
        "dateDebut": "2007-12-19T01:00:00.000+01:00",
        "datePublication": null,
        "dateFin": "2012-06-19T02:00:00.000+02:00",
        "preseance": "20",
        "nominPrincipale": "1",
        "infosQualite": {
          "codeQualite": "Membre",
          "libQualite": "Membre",
          "libQualiteSex": "Membre"
        },
        "organes": {
          "organeRef": "PO403220"
        }
      },
      {
        "@xmlns:xsi": "http://www.w3.org/2001/XMLSchema-instance",
        "uid": "PM406447",
        "acteurRef": "PA508",
        "legislature": "13",
        "typeOrgane": "GE",
        "dateDebut": "2008-01-09T01:00:00.000+01:00",
        "datePublication": null,
        "dateFin": "2012-06-19T02:00:00.000+02:00",
        "preseance": "20",
        "nominPrincipale": "1",
        "infosQualite": {
          "codeQualite": "Membre",
          "libQualite": "Membre",
          "libQualiteSex": "Membre"
        },
        "organes": {
          "organeRef": "PO402734"
        }
      },
      {
        "@xmlns:xsi": "http://www.w3.org/2001/XMLSchema-instance",
        "uid": "PM408830",
        "acteurRef": "PA508",
        "legislature": "13",
        "typeOrgane": "GE",
        "dateDebut": "2008-02-11T01:00:00.000+01:00",
        "datePublication": null,
        "dateFin": "2012-06-19T02:00:00.000+02:00",
        "preseance": "20",
        "nominPrincipale": "1",
        "infosQualite": {
          "codeQualite": "Membre",
          "libQualite": "Membre",
          "libQualiteSex": "Membre"
        },
        "organes": {
          "organeRef": "PO403123"
        }
      },
      {
        "@xmlns:xsi": "http://www.w3.org/2001/XMLSchema-instance",
        "uid": "PM410286",
        "acteurRef": "PA508",
        "legislature": "13",
        "typeOrgane": "GE",
        "dateDebut": "2008-02-05T01:00:00.000+01:00",
        "datePublication": null,
        "dateFin": "2012-06-19T02:00:00.000+02:00",
        "preseance": "20",
        "nominPrincipale": "1",
        "infosQualite": {
          "codeQualite": "Membre",
          "libQualite": "Membre",
          "libQualiteSex": "Membre"
        },
        "organes": {
          "organeRef": "PO403319"
        }
      },
      {
        "@xmlns:xsi": "http://www.w3.org/2001/XMLSchema-instance",
        "uid": "PM410386",
        "acteurRef": "PA508",
        "legislature": "13",
        "typeOrgane": "GE",
        "dateDebut": "2008-01-29T01:00:00.000+01:00",
        "datePublication": null,
        "dateFin": "2012-06-19T02:00:00.000+02:00",
        "preseance": "20",
        "nominPrincipale": "1",
        "infosQualite": {
          "codeQualite": "Membre",
          "libQualite": "Membre",
          "libQualiteSex": "Membre"
        },
        "organes": {
          "organeRef": "PO402764"
        }
      },
      {
        "@xmlns:xsi": "http://www.w3.org/2001/XMLSchema-instance",
        "uid": "PM411816",
        "acteurRef": "PA508",
        "legislature": "13",
        "typeOrgane": "GE",
        "dateDebut": "2008-02-05T01:00:00.000+01:00",
        "datePublication": null,
        "dateFin": "2012-06-19T02:00:00.000+02:00",
        "preseance": "20",
        "nominPrincipale": "1",
        "infosQualite": {
          "codeQualite": "Membre",
          "libQualite": "Membre",
          "libQualiteSex": "Membre"
        },
        "organes": {
          "organeRef": "PO402888"
        }
      },
      {
        "@xmlns:xsi": "http://www.w3.org/2001/XMLSchema-instance",
        "uid": "PM412151",
        "acteurRef": "PA508",
        "legislature": "13",
        "typeOrgane": "GE",
        "dateDebut": "2008-04-09T02:00:00.000+02:00",
        "datePublication": null,
        "dateFin": "2012-06-19T02:00:00.000+02:00",
        "preseance": "20",
        "nominPrincipale": "1",
        "infosQualite": {
          "codeQualite": "Membre",
          "libQualite": "Membre",
          "libQualiteSex": "Membre"
        },
        "organes": {
          "organeRef": "PO403256"
        }
      },
      {
        "@xmlns:xsi": "http://www.w3.org/2001/XMLSchema-instance",
        "uid": "PM414923",
        "acteurRef": "PA508",
        "legislature": "13",
        "typeOrgane": "GE",
        "dateDebut": "2007-10-31T01:00:00.000+01:00",
        "datePublication": null,
        "dateFin": "2012-06-19T02:00:00.000+02:00",
        "preseance": "20",
        "nominPrincipale": "1",
        "infosQualite": {
          "codeQualite": "Membre",
          "libQualite": "Membre",
          "libQualiteSex": "Membre"
        },
        "organes": {
          "organeRef": "PO403021"
        }
      },
      {
        "uid": "PM416404",
        "acteurRef": "PA508",
        "legislature": "13",
        "typeOrgane": "CMP",
        "dateDebut": "2008-10-28T01:00:00.000+01:00",
        "datePublication": "2008-10-30T01:00:00.000+01:00",
        "dateFin": "2008-12-08T01:00:00.000+01:00",
        "preseance": "28",
        "nominPrincipale": "1",
        "infosQualite": {
          "codeQualite": "Suppléant",
          "libQualite": "Membre suppléant",
          "libQualiteSex": "Membre suppléante"
        },
        "organes": {
          "organeRef": "PO416376"
        }
      },
      {
        "uid": "PM417086",
        "acteurRef": "PA508",
        "legislature": "13",
        "typeOrgane": "COMPER",
        "dateDebut": "2008-12-12T01:00:00.000+01:00",
        "datePublication": "2008-12-13T01:00:00.000+01:00",
        "dateFin": "2009-06-30T02:00:00.000+02:00",
        "preseance": "32",
        "nominPrincipale": "1",
        "infosQualite": {
          "codeQualite": "Membre",
          "libQualite": "Membre",
          "libQualiteSex": "Membre"
        },
        "organes": {
          "organeRef": "PO59045"
        }
      },
      {
        "uid": "PM420760",
        "acteurRef": "PA508",
        "legislature": "13",
        "typeOrgane": "COMPER",
        "dateDebut": "2009-07-01T02:00:00.000+02:00",
        "datePublication": "2009-07-01T02:00:00.000+02:00",
        "dateFin": "2009-07-03T02:00:00.000+02:00",
        "preseance": "32",
        "nominPrincipale": "1",
        "infosQualite": {
          "codeQualite": "Membre",
          "libQualite": "Membre",
          "libQualiteSex": "Membre"
        },
        "organes": {
          "organeRef": "PO59046"
        }
      },
      {
        "uid": "PM420930",
        "acteurRef": "PA508",
        "legislature": "13",
        "typeOrgane": "COMPER",
        "dateDebut": "2009-07-04T02:00:00.000+02:00",
        "datePublication": "2009-07-04T02:00:00.000+02:00",
        "dateFin": "2010-04-02T02:00:00.000+02:00",
        "preseance": "32",
        "nominPrincipale": "1",
        "infosQualite": {
          "codeQualite": "Membre",
          "libQualite": "Membre",
          "libQualiteSex": "Membre"
        },
        "organes": {
          "organeRef": "PO420120"
        }
      },
      {
        "uid": "PM422500",
        "acteurRef": "PA508",
        "legislature": "13",
        "typeOrgane": "CNPS",
        "dateDebut": "2009-12-09T01:00:00.000+01:00",
        "datePublication": "2009-12-10T01:00:00.000+01:00",
        "dateFin": "2010-07-06T02:00:00.000+02:00",
        "preseance": "20",
        "nominPrincipale": "1",
        "infosQualite": {
          "codeQualite": "Membre",
          "libQualite": "Membre",
          "libQualiteSex": "Membre"
        },
        "organes": {
          "organeRef": "PO422492"
        }
      },
      {
        "uid": "PM423449",
        "acteurRef": "PA508",
        "legislature": "13",
        "typeOrgane": "COMPER",
        "dateDebut": "2010-04-03T02:00:00.000+02:00",
        "datePublication": "2010-04-03T02:00:00.000+02:00",
        "dateFin": "2010-04-30T02:00:00.000+02:00",
        "preseance": "32",
        "nominPrincipale": "1",
        "infosQualite": {
          "codeQualite": "Membre",
          "libQualite": "Membre",
          "libQualiteSex": "Membre"
        },
        "organes": {
          "organeRef": "PO419604"
        }
      },
      {
        "uid": "PM423858",
        "acteurRef": "PA508",
        "legislature": "13",
        "typeOrgane": "COMPER",
        "dateDebut": "2010-05-02T02:00:00.000+02:00",
        "datePublication": "2010-05-02T02:00:00.000+02:00",
        "dateFin": "2010-12-14T01:00:00.000+01:00",
        "preseance": "32",
        "nominPrincipale": "1",
        "infosQualite": {
          "codeQualite": "Membre",
          "libQualite": "Membre",
          "libQualiteSex": "Membre"
        },
        "organes": {
          "organeRef": "PO420120"
        }
      },
      {
        "@xmlns:xsi": "http://www.w3.org/2001/XMLSchema-instance",
        "uid": "PM424730",
        "acteurRef": "PA508",
        "legislature": "13",
        "typeOrgane": "GE",
        "dateDebut": "2010-07-27T02:00:00.000+02:00",
        "datePublication": null,
        "dateFin": "2012-06-19T02:00:00.000+02:00",
        "preseance": "20",
        "nominPrincipale": "1",
        "infosQualite": {
          "codeQualite": "Membre",
          "libQualite": "Membre",
          "libQualiteSex": "Membre"
        },
        "organes": {
          "organeRef": "PO424325"
        }
      },
      {
        "@xmlns:xsi": "http://www.w3.org/2001/XMLSchema-instance",
        "uid": "PM425501",
        "acteurRef": "PA508",
        "legislature": "13",
        "typeOrgane": "GE",
        "dateDebut": "2007-10-31T01:00:00.000+01:00",
        "datePublication": null,
        "dateFin": "2012-06-19T02:00:00.000+02:00",
        "preseance": "20",
        "nominPrincipale": "1",
        "infosQualite": {
          "codeQualite": "Membre",
          "libQualite": "Membre",
          "libQualiteSex": "Membre"
        },
        "organes": {
          "organeRef": "PO403238"
        }
      },
      {
        "uid": "PM426152",
        "acteurRef": "PA508",
        "legislature": "13",
        "typeOrgane": "COMPER",
        "dateDebut": "2010-12-15T01:00:00.000+01:00",
        "datePublication": "2010-12-15T01:00:00.000+01:00",
        "dateFin": "2010-12-15T01:00:00.000+01:00",
        "preseance": "32",
        "nominPrincipale": "1",
        "infosQualite": {
          "codeQualite": "Membre",
          "libQualite": "Membre",
          "libQualiteSex": "Membre"
        },
        "organes": {
          "organeRef": "PO419865"
        }
      },
      {
        "uid": "PM426218",
        "acteurRef": "PA508",
        "legislature": "13",
        "typeOrgane": "COMPER",
        "dateDebut": "2010-12-16T01:00:00.000+01:00",
        "datePublication": "2010-12-16T01:00:00.000+01:00",
        "dateFin": "2011-01-11T01:00:00.000+01:00",
        "preseance": "32",
        "nominPrincipale": "1",
        "infosQualite": {
          "codeQualite": "Membre",
          "libQualite": "Membre",
          "libQualiteSex": "Membre"
        },
        "organes": {
          "organeRef": "PO420120"
        }
      },
      {
        "uid": "PM426498",
        "acteurRef": "PA508",
        "legislature": "13",
        "typeOrgane": "COMPER",
        "dateDebut": "2011-01-12T01:00:00.000+01:00",
        "datePublication": "2011-01-12T01:00:00.000+01:00",
        "dateFin": "2011-01-14T01:00:00.000+01:00",
        "preseance": "32",
        "nominPrincipale": "1",
        "infosQualite": {
          "codeQualite": "Membre",
          "libQualite": "Membre",
          "libQualiteSex": "Membre"
        },
        "organes": {
          "organeRef": "PO419865"
        }
      },
      {
        "uid": "PM426521",
        "acteurRef": "PA508",
        "legislature": "13",
        "typeOrgane": "COMPER",
        "dateDebut": "2011-01-15T01:00:00.000+01:00",
        "datePublication": "2011-01-15T01:00:00.000+01:00",
        "dateFin": "2012-06-19T02:00:00.000+02:00",
        "preseance": "32",
        "nominPrincipale": "1",
        "infosQualite": {
          "codeQualite": "Membre",
          "libQualite": "Membre",
          "libQualiteSex": "Membre"
        },
        "organes": {
          "organeRef": "PO420120"
        }
      },
      {
        "@xmlns:xsi": "http://www.w3.org/2001/XMLSchema-instance",
        "uid": "PM427211",
        "acteurRef": "PA508",
        "legislature": "13",
        "typeOrgane": "GE",
        "dateDebut": "2011-01-18T01:00:00.000+01:00",
        "datePublication": null,
        "dateFin": "2012-06-19T02:00:00.000+02:00",
        "preseance": "20",
        "nominPrincipale": "1",
        "infosQualite": {
          "codeQualite": "Membre",
          "libQualite": "Membre",
          "libQualiteSex": "Membre"
        },
        "organes": {
          "organeRef": "PO425412"
        }
      },
      {
        "uid": "PM430686",
        "acteurRef": "PA508",
        "legislature": "13",
        "typeOrgane": "CNPS",
        "dateDebut": "2011-10-12T02:00:00.000+02:00",
        "datePublication": "2011-10-14T02:00:00.000+02:00",
        "dateFin": "2012-05-21T02:00:00.000+02:00",
        "preseance": "20",
        "nominPrincipale": "1",
        "infosQualite": {
          "codeQualite": "Membre",
          "libQualite": "Membre",
          "libQualiteSex": "Membre"
        },
        "organes": {
          "organeRef": "PO430584"
        }
      },
      {
        "@xmlns:xsi": "http://www.w3.org/2001/XMLSchema-instance",
        "uid": "PM431147",
        "acteurRef": "PA508",
        "legislature": "13",
        "typeOrgane": "MISINFO",
        "dateDebut": "2011-10-04T02:00:00.000+02:00",
        "datePublication": null,
        "dateFin": "2012-06-19T02:00:00.000+02:00",
        "preseance": "10",
        "nominPrincipale": "1",
        "infosQualite": {
          "codeQualite": "Membre",
          "libQualite": "Membre",
          "libQualiteSex": "Membre"
        },
        "organes": {
          "organeRef": "PO393884"
        },
        "libelle": null,
        "missionSuivanteRef": null,
        "missionPrecedenteRef": null
      },
      {
        "@xmlns:xsi": "http://www.w3.org/2001/XMLSchema-instance",
        "uid": "PM645397",
        "acteurRef": "PA508",
        "legislature": "14",
        "typeOrgane": "ASSEMBLEE",
        "dateDebut": "2012-06-20T02:00:00.000+02:00",
        "datePublication": null,
        "dateFin": "2017-06-20T02:00:00.000+02:00",
        "preseance": "50",
        "nominPrincipale": "1",
        "infosQualite": {
          "codeQualite": "membre",
          "libQualite": "membre",
          "libQualiteSex": "membre"
        },
        "organes": {
          "organeRef": "PO644420"
        },
        "suppleants": {
          "suppleant": {
            "dateDebut": "2012-06-20T02:00:00.000+02:00",
            "dateFin": "2017-06-20T02:00:00.000+02:00",
            "suppleantRef": "PA643125"
          }
        },
        "chambre": null,
        "election": {
          "lieu": {
            "region": "Occitanie",
            "regionType": "Métropolitain",
            "departement": "Gers",
            "numDepartement": "32",
            "numCirco": "2"
          },
          "causeMandat": "élections générales",
          "refCirconscription": "PO644563"
        },
        "mandature": {
          "datePriseFonction": "2012-06-20T02:00:00.000+02:00",
          "causeFin": "Fin de législature",
          "premiereElection": "1",
          "placeHemicycle": "515",
          "mandatRemplaceRef": null
        },
        "collaborateurs": null
      },
      {
        "uid": "PM656051",
        "acteurRef": "PA508",
        "legislature": "14",
        "typeOrgane": "GP",
        "dateDebut": "2012-06-26T02:00:00.000+02:00",
        "datePublication": "2012-06-27T02:00:00.000+02:00",
        "dateFin": "2016-05-24T02:00:00.000+02:00",
        "preseance": "20",
        "nominPrincipale": "1",
        "infosQualite": {
          "codeQualite": "Membre",
          "libQualite": "Membre du",
          "libQualiteSex": "Membre du"
        },
        "organes": {
          "organeRef": "PO656002"
        }
      },
      {
        "uid": "PM657469",
        "acteurRef": "PA508",
        "legislature": "14",
        "typeOrgane": "COMPER",
        "dateDebut": "2012-06-28T02:00:00.000+02:00",
        "datePublication": "2012-06-28T02:00:00.000+02:00",
        "dateFin": "2014-01-20T01:00:00.000+01:00",
        "preseance": "32",
        "nominPrincipale": "0",
        "infosQualite": {
          "codeQualite": "Membre",
          "libQualite": "Membre",
          "libQualiteSex": "Membre"
        },
        "organes": {
          "organeRef": "PO420120"
        }
      },
      {
        "uid": "PM658872",
        "acteurRef": "PA508",
        "legislature": "14",
        "typeOrgane": "COMPER",
        "dateDebut": "2012-06-28T02:00:00.000+02:00",
        "datePublication": "2012-06-29T02:00:00.000+02:00",
        "dateFin": "2014-01-20T01:00:00.000+01:00",
        "preseance": "16",
        "nominPrincipale": "1",
        "infosQualite": {
          "codeQualite": "Secrétaire",
          "libQualite": "Secrétaire",
          "libQualiteSex": "Secrétaire"
        },
        "organes": {
          "organeRef": "PO420120"
        }
      },
      {
        "@xmlns:xsi": "http://www.w3.org/2001/XMLSchema-instance",
        "uid": "PM677426",
        "acteurRef": "PA508",
        "legislature": "14",
        "typeOrgane": "MISINFO",
        "dateDebut": "2012-07-26T02:00:00.000+02:00",
        "datePublication": "2012-07-27T02:00:00.000+02:00",
        "dateFin": "2017-06-20T02:00:00.000+02:00",
        "preseance": "10",
        "nominPrincipale": "1",
        "infosQualite": {
          "codeQualite": "Membre",
          "libQualite": "Membre",
          "libQualiteSex": "Membre"
        },
        "organes": {
          "organeRef": "PO677422"
        },
        "libelle": null,
        "missionSuivanteRef": null,
        "missionPrecedenteRef": null
      },
      {
        "uid": "PM679143",
        "acteurRef": "PA508",
        "legislature": "14",
        "typeOrgane": "ORGEXTPARL",
        "dateDebut": "2012-10-05T02:00:00.000+02:00",
        "datePublication": "2012-10-06T02:00:00.000+02:00",
        "dateFin": "2017-06-20T02:00:00.000+02:00",
        "preseance": "20",
        "nominPrincipale": "1",
        "infosQualite": {
          "codeQualite": "Titulaire",
          "libQualite": "Membre titulaire",
          "libQualiteSex": "Membre titulaire"
        },
        "organes": {
          "organeRef": "PO60266"
        }
      },
      {
        "@xmlns:xsi": "http://www.w3.org/2001/XMLSchema-instance",
        "uid": "PM683415",
        "acteurRef": "PA508",
        "legislature": "14",
        "typeOrgane": "GA",
        "dateDebut": "2012-10-24T02:00:00.000+02:00",
        "datePublication": null,
        "dateFin": "2017-06-20T02:00:00.000+02:00",
        "preseance": "20",
        "nominPrincipale": "1",
        "infosQualite": {
          "codeQualite": "Membre",
          "libQualite": "Membre",
          "libQualiteSex": "Membre"
        },
        "organes": {
          "organeRef": "PO675704"
        }
      },
      {
        "@xmlns:xsi": "http://www.w3.org/2001/XMLSchema-instance",
        "uid": "PM683416",
        "acteurRef": "PA508",
        "legislature": "14",
        "typeOrgane": "GA",
        "dateDebut": "2012-10-24T02:00:00.000+02:00",
        "datePublication": null,
        "dateFin": "2017-06-20T02:00:00.000+02:00",
        "preseance": "20",
        "nominPrincipale": "1",
        "infosQualite": {
          "codeQualite": "Membre",
          "libQualite": "Membre",
          "libQualiteSex": "Membre"
        },
        "organes": {
          "organeRef": "PO675734"
        }
      },
      {
        "@xmlns:xsi": "http://www.w3.org/2001/XMLSchema-instance",
        "uid": "PM683961",
        "acteurRef": "PA508",
        "legislature": "14",
        "typeOrgane": "GA",
        "dateDebut": "2012-11-06T01:00:00.000+01:00",
        "datePublication": null,
        "dateFin": "2017-06-20T02:00:00.000+02:00",
        "preseance": "8",
        "nominPrincipale": "1",
        "infosQualite": {
          "codeQualite": "Vice-Président",
          "libQualite": "Vice-Président",
          "libQualiteSex": "Vice-Présidente"
        },
        "organes": {
          "organeRef": "PO675704"
        }
      },
      {
        "uid": "PM684966",
        "acteurRef": "PA508",
        "legislature": "14",
        "typeOrgane": "ORGEXTPARL",
        "dateDebut": "2012-11-27T01:00:00.000+01:00",
        "datePublication": "2012-11-28T01:00:00.000+01:00",
        "dateFin": "2017-06-20T02:00:00.000+02:00",
        "preseance": "30",
        "nominPrincipale": "1",
        "infosQualite": {
          "codeQualite": "Suppléant",
          "libQualite": "Membre suppléant",
          "libQualiteSex": "Membre suppléante"
        },
        "organes": {
          "organeRef": "PO229652"
        }
      },
      {
        "@xmlns:xsi": "http://www.w3.org/2001/XMLSchema-instance",
        "uid": "PM685649",
        "acteurRef": "PA508",
        "legislature": null,
        "typeOrgane": "PARPOL",
        "dateDebut": "2012-12-01T01:00:00.000+01:00",
        "datePublication": null,
        "dateFin": "2017-06-20T02:00:00.000+02:00",
        "preseance": "5",
        "nominPrincipale": "1",
        "infosQualite": {
          "codeQualite": "Membre",
          "libQualite": "Membre",
          "libQualiteSex": "Membre"
        },
        "organes": {
          "organeRef": "PO684932"
        }
      },
      {
        "@xmlns:xsi": "http://www.w3.org/2001/XMLSchema-instance",
        "uid": "PM688696",
        "acteurRef": "PA508",
        "legislature": "14",
        "typeOrgane": "GE",
        "dateDebut": "2013-01-25T01:00:00.000+01:00",
        "datePublication": null,
        "dateFin": "2017-06-20T02:00:00.000+02:00",
        "preseance": "20",
        "nominPrincipale": "1",
        "infosQualite": {
          "codeQualite": "Membre",
          "libQualite": "Membre",
          "libQualiteSex": "Membre"
        },
        "organes": {
          "organeRef": "PO686501"
        }
      },
      {
        "@xmlns:xsi": "http://www.w3.org/2001/XMLSchema-instance",
        "uid": "PM688916",
        "acteurRef": "PA508",
        "legislature": "14",
        "typeOrgane": "GE",
        "dateDebut": "2013-01-25T01:00:00.000+01:00",
        "datePublication": null,
        "dateFin": "2017-06-20T02:00:00.000+02:00",
        "preseance": "20",
        "nominPrincipale": "1",
        "infosQualite": {
          "codeQualite": "Membre",
          "libQualite": "Membre",
          "libQualiteSex": "Membre"
        },
        "organes": {
          "organeRef": "PO686577"
        }
      },
      {
        "@xmlns:xsi": "http://www.w3.org/2001/XMLSchema-instance",
        "uid": "PM689109",
        "acteurRef": "PA508",
        "legislature": "14",
        "typeOrgane": "GE",
        "dateDebut": "2013-01-08T01:00:00.000+01:00",
        "datePublication": null,
        "dateFin": "2017-06-20T02:00:00.000+02:00",
        "preseance": "20",
        "nominPrincipale": "1",
        "infosQualite": {
          "codeQualite": "Membre",
          "libQualite": "Membre",
          "libQualiteSex": "Membre"
        },
        "organes": {
          "organeRef": "PO686617"
        }
      },
      {
        "@xmlns:xsi": "http://www.w3.org/2001/XMLSchema-instance",
        "uid": "PM690293",
        "acteurRef": "PA508",
        "legislature": "14",
        "typeOrgane": "GE",
        "dateDebut": "2013-01-30T01:00:00.000+01:00",
        "datePublication": null,
        "dateFin": "2017-06-20T02:00:00.000+02:00",
        "preseance": "12",
        "nominPrincipale": "1",
        "infosQualite": {
          "codeQualite": "Secrétaire",
          "libQualite": "Secrétaire",
          "libQualiteSex": "Secrétaire"
        },
        "organes": {
          "organeRef": "PO686577"
        }
      },
      {
        "@xmlns:xsi": "http://www.w3.org/2001/XMLSchema-instance",
        "uid": "PM690665",
        "acteurRef": "PA508",
        "legislature": "14",
        "typeOrgane": "GE",
        "dateDebut": "2013-02-06T01:00:00.000+01:00",
        "datePublication": null,
        "dateFin": "2017-06-20T02:00:00.000+02:00",
        "preseance": "20",
        "nominPrincipale": "1",
        "infosQualite": {
          "codeQualite": "Membre",
          "libQualite": "Membre",
          "libQualiteSex": "Membre"
        },
        "organes": {
          "organeRef": "PO686346"
        }
      },
      {
        "@xmlns:xsi": "http://www.w3.org/2001/XMLSchema-instance",
        "uid": "PM690994",
        "acteurRef": "PA508",
        "legislature": "14",
        "typeOrgane": "GE",
        "dateDebut": "2013-02-08T01:00:00.000+01:00",
        "datePublication": null,
        "dateFin": "2017-06-20T02:00:00.000+02:00",
        "preseance": "20",
        "nominPrincipale": "1",
        "infosQualite": {
          "codeQualite": "Membre",
          "libQualite": "Membre",
          "libQualiteSex": "Membre"
        },
        "organes": {
          "organeRef": "PO686362"
        }
      },
      {
        "@xmlns:xsi": "http://www.w3.org/2001/XMLSchema-instance",
        "uid": "PM691180",
        "acteurRef": "PA508",
        "legislature": "14",
        "typeOrgane": "GE",
        "dateDebut": "2013-01-15T01:00:00.000+01:00",
        "datePublication": null,
        "dateFin": "2017-06-20T02:00:00.000+02:00",
        "preseance": "20",
        "nominPrincipale": "1",
        "infosQualite": {
          "codeQualite": "Membre",
          "libQualite": "Membre",
          "libQualiteSex": "Membre"
        },
        "organes": {
          "organeRef": "PO687381"
        }
      },
      {
        "@xmlns:xsi": "http://www.w3.org/2001/XMLSchema-instance",
        "uid": "PM691594",
        "acteurRef": "PA508",
        "legislature": "14",
        "typeOrgane": "GE",
        "dateDebut": "2013-02-12T01:00:00.000+01:00",
        "datePublication": null,
        "dateFin": "2017-06-20T02:00:00.000+02:00",
        "preseance": "8",
        "nominPrincipale": "1",
        "infosQualite": {
          "codeQualite": "Vice-Président",
          "libQualite": "Vice-Président",
          "libQualiteSex": "Vice-Présidente"
        },
        "organes": {
          "organeRef": "PO686346"
        }
      },
      {
        "@xmlns:xsi": "http://www.w3.org/2001/XMLSchema-instance",
        "uid": "PM691750",
        "acteurRef": "PA508",
        "legislature": "14",
        "typeOrgane": "GA",
        "dateDebut": "2012-11-14T01:00:00.000+01:00",
        "datePublication": null,
        "dateFin": "2017-06-20T02:00:00.000+02:00",
        "preseance": "8",
        "nominPrincipale": "1",
        "infosQualite": {
          "codeQualite": "Vice-Président",
          "libQualite": "Vice-Président",
          "libQualiteSex": "Vice-Présidente"
        },
        "organes": {
          "organeRef": "PO675734"
        }
      },
      {
        "@xmlns:xsi": "http://www.w3.org/2001/XMLSchema-instance",
        "uid": "PM692711",
        "acteurRef": "PA508",
        "legislature": "14",
        "typeOrgane": "GE",
        "dateDebut": "2013-03-15T01:00:00.000+01:00",
        "datePublication": null,
        "dateFin": "2017-06-20T02:00:00.000+02:00",
        "preseance": "20",
        "nominPrincipale": "1",
        "infosQualite": {
          "codeQualite": "Membre",
          "libQualite": "Membre",
          "libQualiteSex": "Membre"
        },
        "organes": {
          "organeRef": "PO686896"
        }
      },
      {
        "@xmlns:xsi": "http://www.w3.org/2001/XMLSchema-instance",
        "uid": "PM693380",
        "acteurRef": "PA508",
        "legislature": "14",
        "typeOrgane": "GE",
        "dateDebut": "2013-03-27T01:00:00.000+01:00",
        "datePublication": null,
        "dateFin": "2017-06-20T02:00:00.000+02:00",
        "preseance": "20",
        "nominPrincipale": "1",
        "infosQualite": {
          "codeQualite": "Membre",
          "libQualite": "Membre",
          "libQualiteSex": "Membre"
        },
        "organes": {
          "organeRef": "PO689030"
        }
      },
      {
        "@xmlns:xsi": "http://www.w3.org/2001/XMLSchema-instance",
        "uid": "PM693383",
        "acteurRef": "PA508",
        "legislature": "14",
        "typeOrgane": "GE",
        "dateDebut": "2013-04-09T02:00:00.000+02:00",
        "datePublication": null,
        "dateFin": "2017-06-20T02:00:00.000+02:00",
        "preseance": "20",
        "nominPrincipale": "1",
        "infosQualite": {
          "codeQualite": "Membre",
          "libQualite": "Membre",
          "libQualiteSex": "Membre"
        },
        "organes": {
          "organeRef": "PO689000"
        }
      },
      {
        "@xmlns:xsi": "http://www.w3.org/2001/XMLSchema-instance",
        "uid": "PM697054",
        "acteurRef": "PA508",
        "legislature": "14",
        "typeOrgane": "GE",
        "dateDebut": "2013-09-20T02:00:00.000+02:00",
        "datePublication": null,
        "dateFin": "2017-06-20T02:00:00.000+02:00",
        "preseance": "20",
        "nominPrincipale": "1",
        "infosQualite": {
          "codeQualite": "Membre",
          "libQualite": "Membre",
          "libQualiteSex": "Membre"
        },
        "organes": {
          "organeRef": "PO695581"
        }
      },
      {
        "uid": "PM699536",
        "acteurRef": "PA508",
        "legislature": "14",
        "typeOrgane": "COMPER",
        "dateDebut": "2014-01-21T01:00:00.000+01:00",
        "datePublication": "2014-01-21T01:00:00.000+01:00",
        "dateFin": "2014-02-18T01:00:00.000+01:00",
        "preseance": "32",
        "nominPrincipale": "1",
        "infosQualite": {
          "codeQualite": "Membre",
          "libQualite": "Membre",
          "libQualiteSex": "Membre"
        },
        "organes": {
          "organeRef": "PO419865"
        }
      },
      {
        "uid": "PM700261",
        "acteurRef": "PA508",
        "legislature": "14",
        "typeOrgane": "COMPER",
        "dateDebut": "2014-02-19T01:00:00.000+01:00",
        "datePublication": "2014-02-19T01:00:00.000+01:00",
        "dateFin": "2014-06-02T02:00:00.000+02:00",
        "preseance": "32",
        "nominPrincipale": "1",
        "infosQualite": {
          "codeQualite": "Membre",
          "libQualite": "Membre",
          "libQualiteSex": "Membre"
        },
        "organes": {
          "organeRef": "PO420120"
        }
      },
      {
        "uid": "PM700327",
        "acteurRef": "PA508",
        "legislature": "14",
        "typeOrgane": "CMP",
        "dateDebut": "2014-02-20T01:00:00.000+01:00",
        "datePublication": "2014-02-21T01:00:00.000+01:00",
        "dateFin": "2014-02-27T01:00:00.000+01:00",
        "preseance": "28",
        "nominPrincipale": "1",
        "infosQualite": {
          "codeQualite": "Suppléant",
          "libQualite": "Membre suppléant",
          "libQualiteSex": "Membre suppléante"
        },
        "organes": {
          "organeRef": "PO700314"
        }
      },
      {
        "uid": "PM701652",
        "acteurRef": "PA508",
        "legislature": "14",
        "typeOrgane": "COMPER",
        "dateDebut": "2014-06-03T02:00:00.000+02:00",
        "datePublication": "2014-06-03T02:00:00.000+02:00",
        "dateFin": "2014-06-04T02:00:00.000+02:00",
        "preseance": "32",
        "nominPrincipale": "1",
        "infosQualite": {
          "codeQualite": "Membre",
          "libQualite": "Membre",
          "libQualiteSex": "Membre"
        },
        "organes": {
          "organeRef": "PO419865"
        }
      },
      {
        "uid": "PM701716",
        "acteurRef": "PA508",
        "legislature": "14",
        "typeOrgane": "COMPER",
        "dateDebut": "2014-06-05T02:00:00.000+02:00",
        "datePublication": "2014-06-05T02:00:00.000+02:00",
        "dateFin": "2017-06-20T02:00:00.000+02:00",
        "preseance": "32",
        "nominPrincipale": "0",
        "infosQualite": {
          "codeQualite": "Membre",
          "libQualite": "Membre",
          "libQualiteSex": "Membre"
        },
        "organes": {
          "organeRef": "PO420120"
        }
      },
      {
        "uid": "PM702602",
        "acteurRef": "PA508",
        "legislature": "14",
        "typeOrgane": "CMP",
        "dateDebut": "2014-07-17T02:00:00.000+02:00",
        "datePublication": "2014-07-18T02:00:00.000+02:00",
        "dateFin": "2014-07-23T02:00:00.000+02:00",
        "preseance": "28",
        "nominPrincipale": "1",
        "infosQualite": {
          "codeQualite": "Suppléant",
          "libQualite": "Membre suppléant",
          "libQualiteSex": "Membre suppléante"
        },
        "organes": {
          "organeRef": "PO702586"
        }
      },
      {
        "@xmlns:xsi": "http://www.w3.org/2001/XMLSchema-instance",
        "uid": "PM702686",
        "acteurRef": "PA508",
        "legislature": "14",
        "typeOrgane": "COMPER",
        "dateDebut": "2014-06-05T02:00:00.000+02:00",
        "datePublication": null,
        "dateFin": "2017-06-20T02:00:00.000+02:00",
        "preseance": "16",
        "nominPrincipale": "1",
        "infosQualite": {
          "codeQualite": "Secrétaire",
          "libQualite": "Secrétaire",
          "libQualiteSex": "Secrétaire"
        },
        "organes": {
          "organeRef": "PO420120"
        }
      },
      {
        "@xmlns:xsi": "http://www.w3.org/2001/XMLSchema-instance",
        "uid": "PM703864",
        "acteurRef": "PA508",
        "legislature": "14",
        "typeOrgane": "MISINFO",
        "dateDebut": "2014-10-08T02:00:00.000+02:00",
        "datePublication": "2014-10-09T02:00:00.000+02:00",
        "dateFin": "2017-06-20T02:00:00.000+02:00",
        "preseance": "2",
        "nominPrincipale": "1",
        "infosQualite": {
          "codeQualite": "Co-président",
          "libQualite": "Co-président",
          "libQualiteSex": "Co-présidente"
        },
        "organes": {
          "organeRef": "PO677422"
        },
        "libelle": null,
        "missionSuivanteRef": null,
        "missionPrecedenteRef": null
      },
      {
        "uid": "PM709033",
        "acteurRef": "PA508",
        "legislature": "14",
        "typeOrgane": "CMP",
        "dateDebut": "2015-07-16T02:00:00.000+02:00",
        "datePublication": "2015-07-16T02:00:00.000+02:00",
        "dateFin": "2015-07-17T02:00:00.000+02:00",
        "preseance": "28",
        "nominPrincipale": "1",
        "infosQualite": {
          "codeQualite": "Suppléant",
          "libQualite": "Membre suppléant",
          "libQualiteSex": "Membre suppléante"
        },
        "organes": {
          "organeRef": "PO708863"
        }
      },
      {
        "@xmlns:xsi": "http://www.w3.org/2001/XMLSchema-instance",
        "uid": "PM713112",
        "acteurRef": "PA508",
        "legislature": "14",
        "typeOrgane": "GP",
        "dateDebut": "2016-05-25T02:00:00.000+02:00",
        "datePublication": null,
        "dateFin": "2017-06-20T02:00:00.000+02:00",
        "preseance": "20",
        "nominPrincipale": "1",
        "infosQualite": {
          "codeQualite": "Membre",
          "libQualite": "Membre du",
          "libQualiteSex": "Membre du"
        },
        "organes": {
          "organeRef": "PO713077"
        }
      },
      {
        "@xmlns:xsi": "http://www.w3.org/2001/XMLSchema-instance",
        "uid": "PM722736",
        "acteurRef": "PA508",
        "legislature": "15",
        "typeOrgane": "ASSEMBLEE",
        "dateDebut": "2017-06-18T02:00:00.000+02:00",
        "datePublication": null,
        "dateFin": null,
        "preseance": "50",
        "nominPrincipale": "1",
        "infosQualite": {
          "codeQualite": "membre",
          "libQualite": "membre",
          "libQualiteSex": "membre"
        },
        "organes": {
          "organeRef": "PO717460"
        },
        "suppleants": {
          "suppleant": {
            "dateDebut": "2017-06-18T02:00:00.000+02:00",
            "dateFin": null,
            "suppleantRef": "PA643125"
          }
        },
        "chambre": null,
        "election": {
          "lieu": {
            "region": "Occitanie",
            "regionType": "Métropolitain",
            "departement": "Gers",
            "numDepartement": "32",
            "numCirco": "2"
          },
          "causeMandat": "élections générales",
          "refCirconscription": "PO717752"
        },
        "mandature": {
          "datePriseFonction": "2017-06-21T02:00:00.000+02:00",
          "causeFin": null,
          "premiereElection": "1",
          "placeHemicycle": "515",
          "mandatRemplaceRef": null
        },
        "collaborateurs": {
          "collaborateur": [
            {
              "qualite": "M.",
              "prenom": "Cédric",
              "nom": "Balech",
              "dateDebut": null,
              "dateFin": null
            },
            {
              "qualite": "Mme",
              "prenom": "Valérie",
              "nom": "Lacabanne",
              "dateDebut": null,
              "dateFin": null
            },
            {
              "qualite": "Mme",
              "prenom": "Cécilia",
              "nom": "Sanchez-Lansade",
              "dateDebut": null,
              "dateFin": null
            }
          ]
        }
      },
      {
        "@xmlns:xsi": "http://www.w3.org/2001/XMLSchema-instance",
        "uid": "PM724409",
        "acteurRef": "PA508",
        "legislature": "15",
        "typeOrgane": "GP",
        "dateDebut": "2017-06-21T02:00:00.000+02:00",
        "datePublication": null,
        "dateFin": "2017-06-26T02:00:00.000+02:00",
        "preseance": "28",
        "nominPrincipale": "1",
        "infosQualite": {
          "codeQualite": "Député non-inscrit",
          "libQualite": "Député non-inscrit",
          "libQualiteSex": "Députée non-inscrite"
        },
        "organes": {
          "organeRef": "PO723569"
        }
      },
      {
        "uid": "PM731486",
        "acteurRef": "PA508",
        "legislature": "15",
        "typeOrgane": "GP",
        "dateDebut": "2017-06-27T02:00:00.000+02:00",
        "datePublication": "2017-06-28T02:00:00.000+02:00",
        "dateFin": "2018-09-11T02:00:00.000+02:00",
        "preseance": "20",
        "nominPrincipale": "1",
        "infosQualite": {
          "codeQualite": "Membre",
          "libQualite": "Membre du",
          "libQualiteSex": "Membre du"
        },
        "organes": {
          "organeRef": "PO730946"
        }
      },
      {
        "uid": "PM731886",
        "acteurRef": "PA508",
        "legislature": "15",
        "typeOrgane": "COMPER",
        "dateDebut": "2017-06-29T02:00:00.000+02:00",
        "datePublication": "2017-06-29T02:00:00.000+02:00",
        "dateFin": "2018-01-15T01:00:00.000+01:00",
        "preseance": "32",
        "nominPrincipale": "1",
        "infosQualite": {
          "codeQualite": "Membre",
          "libQualite": "Membre",
          "libQualiteSex": "Membre"
        },
        "organes": {
          "organeRef": "PO419604"
        }
      },
      {
        "@xmlns:xsi": "http://www.w3.org/2001/XMLSchema-instance",
        "uid": "PM732712",
        "acteurRef": "PA508",
        "legislature": "15",
        "typeOrgane": "COMNL",
        "dateDebut": "2017-07-12T02:00:00.000+02:00",
        "datePublication": "2017-07-12T02:00:00.000+02:00",
        "dateFin": null,
        "preseance": "28",
        "nominPrincipale": "1",
        "infosQualite": {
          "codeQualite": "Suppléant",
          "libQualite": "Membre suppléant",
          "libQualiteSex": "Membre suppléante"
        },
        "organes": {
          "organeRef": "PO271850"
        },
        "suppleants": null
      },
      {
        "@xmlns:xsi": "http://www.w3.org/2001/XMLSchema-instance",
        "uid": "PM736709",
        "acteurRef": "PA508",
        "legislature": "15",
        "typeOrgane": "GA",
        "dateDebut": "2017-10-02T02:00:00.000+02:00",
        "datePublication": null,
        "dateFin": null,
        "preseance": "20",
        "nominPrincipale": "0",
        "infosQualite": {
          "codeQualite": "Membre",
          "libQualite": "Membre",
          "libQualiteSex": "Membre"
        },
        "organes": {
          "organeRef": "PO733057"
        }
      },
      {
        "@xmlns:xsi": "http://www.w3.org/2001/XMLSchema-instance",
        "uid": "PM736710",
        "acteurRef": "PA508",
        "legislature": "15",
        "typeOrgane": "GA",
        "dateDebut": "2017-10-02T02:00:00.000+02:00",
        "datePublication": null,
        "dateFin": null,
        "preseance": "20",
        "nominPrincipale": "1",
        "infosQualite": {
          "codeQualite": "Membre",
          "libQualite": "Membre",
          "libQualiteSex": "Membre"
        },
        "organes": {
          "organeRef": "PO733197"
        }
      },
      {
        "@xmlns:xsi": "http://www.w3.org/2001/XMLSchema-instance",
        "uid": "PM741944",
        "acteurRef": "PA508",
        "legislature": "15",
        "typeOrgane": "MISINFO",
        "dateDebut": "2017-09-27T02:00:00.000+02:00",
        "datePublication": null,
        "dateFin": "2018-01-15T01:00:00.000+01:00",
        "preseance": "10",
        "nominPrincipale": "1",
        "infosQualite": {
          "codeQualite": "Membre",
          "libQualite": "Membre",
          "libQualiteSex": "Membre"
        },
        "organes": {
          "organeRef": "PO741916"
        },
        "libelle": null,
        "missionSuivanteRef": null,
        "missionPrecedenteRef": null
      },
      {
        "@xmlns:xsi": "http://www.w3.org/2001/XMLSchema-instance",
        "uid": "PM745955",
        "acteurRef": "PA508",
        "legislature": null,
        "typeOrgane": "PARPOL",
        "dateDebut": "2017-12-01T01:00:00.000+01:00",
        "datePublication": null,
        "dateFin": null,
        "preseance": "5",
        "nominPrincipale": "1",
        "infosQualite": {
          "codeQualite": "Membre",
          "libQualite": "Membre",
          "libQualiteSex": "Membre"
        },
        "organes": {
          "organeRef": "PO684932"
        }
      },
      {
        "@xmlns:xsi": "http://www.w3.org/2001/XMLSchema-instance",
        "uid": "PM746049",
        "acteurRef": "PA508",
        "legislature": "15",
        "typeOrgane": "GA",
        "dateDebut": "2017-12-05T01:00:00.000+01:00",
        "datePublication": null,
        "dateFin": null,
        "preseance": "20",
        "nominPrincipale": "0",
        "infosQualite": {
          "codeQualite": "Membre",
          "libQualite": "Membre",
          "libQualiteSex": "Membre"
        },
        "organes": {
          "organeRef": "PO733001"
        }
      },
      {
        "@xmlns:xsi": "http://www.w3.org/2001/XMLSchema-instance",
        "uid": "PM746242",
        "acteurRef": "PA508",
        "legislature": "15",
        "typeOrgane": "GA",
        "dateDebut": "2017-12-06T01:00:00.000+01:00",
        "datePublication": null,
        "dateFin": null,
        "preseance": "14",
        "nominPrincipale": "1",
        "infosQualite": {
          "codeQualite": "Secrétaire",
          "libQualite": "Secrétaire",
          "libQualiteSex": "Secrétaire"
        },
        "organes": {
          "organeRef": "PO733001"
        }
      },
      {
        "@xmlns:xsi": "http://www.w3.org/2001/XMLSchema-instance",
        "uid": "PM747625",
        "acteurRef": "PA508",
        "legislature": "15",
        "typeOrgane": "GA",
        "dateDebut": "2017-11-22T01:00:00.000+01:00",
        "datePublication": null,
        "dateFin": null,
        "preseance": "8",
        "nominPrincipale": "1",
        "infosQualite": {
          "codeQualite": "Vice-Président",
          "libQualite": "Vice-Président",
          "libQualiteSex": "Vice-Présidente"
        },
        "organes": {
          "organeRef": "PO733057"
        }
      },
      {
        "uid": "PM747640",
        "acteurRef": "PA508",
        "legislature": "15",
        "typeOrgane": "COMPER",
        "dateDebut": "2018-01-16T01:00:00.000+01:00",
        "datePublication": "2018-01-16T01:00:00.000+01:00",
        "dateFin": "2018-12-17T01:00:00.000+01:00",
        "preseance": "32",
        "nominPrincipale": "1",
        "infosQualite": {
          "codeQualite": "Membre",
          "libQualite": "Membre",
          "libQualiteSex": "Membre"
        },
        "organes": {
          "organeRef": "PO420120"
        }
      },
      {
        "@xmlns:xsi": "http://www.w3.org/2001/XMLSchema-instance",
        "uid": "PM748522",
        "acteurRef": "PA508",
        "legislature": "15",
        "typeOrgane": "GE",
        "dateDebut": "2018-02-01T01:00:00.000+01:00",
        "datePublication": null,
        "dateFin": null,
        "preseance": "20",
        "nominPrincipale": "0",
        "infosQualite": {
          "codeQualite": "Membre",
          "libQualite": "Membre",
          "libQualiteSex": "Membre"
        },
        "organes": {
          "organeRef": "PO747109"
        }
      },
      {
        "@xmlns:xsi": "http://www.w3.org/2001/XMLSchema-instance",
        "uid": "PM748524",
        "acteurRef": "PA508",
        "legislature": "15",
        "typeOrgane": "GE",
        "dateDebut": "2018-02-01T01:00:00.000+01:00",
        "datePublication": null,
        "dateFin": null,
        "preseance": "4",
        "nominPrincipale": "1",
        "infosQualite": {
          "codeQualite": "Co-Président",
          "libQualite": "Co-Président",
          "libQualiteSex": "Co-Présidente"
        },
        "organes": {
          "organeRef": "PO747109"
        }
      },
      {
        "@xmlns:xsi": "http://www.w3.org/2001/XMLSchema-instance",
        "uid": "PM750773",
        "acteurRef": "PA508",
        "legislature": "15",
        "typeOrgane": "GE",
        "dateDebut": "2018-02-14T01:00:00.000+01:00",
        "datePublication": null,
        "dateFin": null,
        "preseance": "20",
        "nominPrincipale": "0",
        "infosQualite": {
          "codeQualite": "Membre",
          "libQualite": "Membre",
          "libQualiteSex": "Membre"
        },
        "organes": {
          "organeRef": "PO747266"
        }
      },
      {
        "@xmlns:xsi": "http://www.w3.org/2001/XMLSchema-instance",
        "uid": "PM750962",
        "acteurRef": "PA508",
        "legislature": "15",
        "typeOrgane": "GE",
        "dateDebut": "2018-02-19T01:00:00.000+01:00",
        "datePublication": null,
        "dateFin": null,
        "preseance": "20",
        "nominPrincipale": "1",
        "infosQualite": {
          "codeQualite": "Membre",
          "libQualite": "Membre",
          "libQualiteSex": "Membre"
        },
        "organes": {
          "organeRef": "PO746880"
        }
      },
      {
        "@xmlns:xsi": "http://www.w3.org/2001/XMLSchema-instance",
        "uid": "PM753511",
        "acteurRef": "PA508",
        "legislature": "15",
        "typeOrgane": "GE",
        "dateDebut": "2018-03-13T01:00:00.000+01:00",
        "datePublication": null,
        "dateFin": null,
        "preseance": "8",
        "nominPrincipale": "1",
        "infosQualite": {
          "codeQualite": "Vice-Président",
          "libQualite": "Vice-Président",
          "libQualiteSex": "Vice-Présidente"
        },
        "organes": {
          "organeRef": "PO747266"
        }
      },
      {
        "uid": "PM754149",
        "acteurRef": "PA508",
        "legislature": "15",
        "typeOrgane": "CNPE",
        "dateDebut": "2018-03-23T01:00:00.000+01:00",
        "datePublication": "2018-03-23T01:00:00.000+01:00",
        "dateFin": "2018-07-19T02:00:00.000+02:00",
        "preseance": "20",
        "nominPrincipale": "1",
        "infosQualite": {
          "codeQualite": "Membre",
          "libQualite": "Membre",
          "libQualiteSex": "Membre"
        },
        "organes": {
          "organeRef": "PO753283"
        }
      },
      {
        "@xmlns:xsi": "http://www.w3.org/2001/XMLSchema-instance",
        "uid": "PM755350",
        "acteurRef": "PA508",
        "legislature": "15",
        "typeOrgane": "GE",
        "dateDebut": "2018-04-11T02:00:00.000+02:00",
        "datePublication": null,
        "dateFin": null,
        "preseance": "20",
        "nominPrincipale": "1",
        "infosQualite": {
          "codeQualite": "Membre",
          "libQualite": "Membre",
          "libQualiteSex": "Membre"
        },
        "organes": {
          "organeRef": "PO747286"
        }
      },
      {
        "@xmlns:xsi": "http://www.w3.org/2001/XMLSchema-instance",
        "uid": "PM757247",
        "acteurRef": "PA508",
        "legislature": "15",
        "typeOrgane": "MISINFOPRE",
        "dateDebut": "2018-06-26T02:00:00.000+02:00",
        "datePublication": "2018-06-27T02:00:00.000+02:00",
        "dateFin": null,
        "preseance": "20",
        "nominPrincipale": "1",
        "infosQualite": {
          "codeQualite": "Membre",
          "libQualite": "Membre",
          "libQualiteSex": "Membre"
        },
        "organes": {
          "organeRef": "PO757118"
        },
        "libelle": null,
        "missionSuivanteRef": null,
        "missionPrecedenteRef": null
      },
      {
        "@xmlns:xsi": "http://www.w3.org/2001/XMLSchema-instance",
        "uid": "PM758844",
        "acteurRef": "PA508",
        "legislature": "15",
        "typeOrgane": "GP",
        "dateDebut": "2018-09-12T02:00:00.000+02:00",
        "datePublication": null,
        "dateFin": null,
        "preseance": "20",
        "nominPrincipale": "1",
        "infosQualite": {
          "codeQualite": "Membre",
          "libQualite": "Membre du",
          "libQualiteSex": "Membre du"
        },
        "organes": {
          "organeRef": "PO758835"
        }
      },
      {
        "uid": "PM761092",
        "acteurRef": "PA508",
        "legislature": "15",
        "typeOrgane": "COMPER",
        "dateDebut": "2018-12-18T01:00:00.000+01:00",
        "datePublication": "2018-12-18T01:00:00.000+01:00",
        "dateFin": "2018-12-20T01:00:00.000+01:00",
        "preseance": "32",
        "nominPrincipale": "1",
        "infosQualite": {
          "codeQualite": "Membre",
          "libQualite": "Membre",
          "libQualiteSex": "Membre"
        },
        "organes": {
          "organeRef": "PO419865"
        }
      },
      {
        "@xmlns:xsi": "http://www.w3.org/2001/XMLSchema-instance",
        "uid": "PM761166",
        "acteurRef": "PA508",
        "legislature": "15",
        "typeOrgane": "COMPER",
        "dateDebut": "2018-12-21T01:00:00.000+01:00",
        "datePublication": "2018-12-21T01:00:00.000+01:00",
        "dateFin": null,
        "preseance": "32",
        "nominPrincipale": "1",
        "infosQualite": {
          "codeQualite": "Membre",
          "libQualite": "Membre",
          "libQualiteSex": "Membre"
        },
        "organes": {
          "organeRef": "PO420120"
        }
      }
    ]
  },
  "@xmlns:xsi": "http://www.w3.org/2001/XMLSchema-instance"
}