{
  "@xmlns:xsi": "http://www.w3.org/2001/XMLSchema-instance",
  "uid": "PO709724",
  "codeType": "GA",
  "libelle": "France-Kosovo",
  "libelleEdition": "de Kosovo",
  "libelleAbrege": "Kosovo",
  "libelleAbrev": "KOS",
  "viMoDe": {
    "dateDebut": null,
    "dateAgrement": "2015-10-14T02:00:00.000+02:00",
    "dateFin": "2017-06-20T02:00:00.000+02:00"
  },
  "organeParent": null,
  "chambre": null,
  "regime": "5ème République",
  "legislature": "14",
  "secretariat": {
    "secretaire01": null,
    "secretaire02": null
  },
  "listePays": null
}