{
  "@xmlns:xsi": "http://www.w3.org/2001/XMLSchema-instance",
  "uid": "PO730035",
  "codeType": "MINISTERE",
  "libelle": "Secrétariat d'État, auprès du Premier ministre, chargé du numérique",
  "libelleEdition": ", auprès du Premier ministre, chargé du numérique",
  "libelleAbrege": "Numérique",
  "libelleAbrev": "NUM",
  "viMoDe": {
    "dateDebut": "2017-06-22T02:00:00.000+02:00",
    "dateAgrement": null,
    "dateFin": "2018-10-16T02:00:00.000+02:00"
  },
  "organeParent": "PO725688"
}