{
  "uid": {
    "@xsi:type": "IdActeur_type",
    "#text": "PA2690"
  },
  "etatCivil": {
    "ident": {
      "civ": "M.",
      "prenom": "François",
      "nom": "Sauvadet",
      "alpha": "Sauvadet",
      "trigramme": null
    },
    "infoNaissance": {
      "dateNais": "1953-04-20T01:00:00.000+01:00",
      "villeNais": "Dijon",
      "depNais": "Côte-d'Or",
      "paysNais": "France"
    },
    "dateDeces": null
  },
  "profession": {
    "libelleCourant": "Journaliste",
    "socProcINSEE": {
      "catSocPro": "Cadres de la fonction publique, professions intellectuelles et  artistiques",
      "famSocPro": "Cadres et professions intellectuelles supérieures"
    }
  },
  "uri_hatvp": null,
  "adresses": {
    "adresse": [
      {
        "@xsi:type": "AdressePostale_Type",
        "uid": "AD45857",
        "type": "2",
        "typeLibelle": "Adresse publiée de circonscription",
        "poids": "22",
        "adresseDeRattachement": null,
        "intitule": null,
        "numeroRue": "12",
        "nomRue": "Rue Édmé Millot,",
        "complementAdresse": null,
        "codePostal": "21350",
        "ville": "Vitteaux"
      },
      {
        "@xsi:type": "AdresseTelephonique_Type",
        "uid": "AD48202",
        "type": "11",
        "typeLibelle": "Téléphone",
        "poids": "22",
        "adresseDeRattachement": "AD45857",
        "valElec": "03 80 33 90 90"
      },
      {
        "@xsi:type": "AdresseTelephonique_Type",
        "uid": "AD49795",
        "type": "12",
        "typeLibelle": "Télécopie",
        "poids": "22",
        "adresseDeRattachement": "AD45857",
        "valElec": "03 80 33 90 95"
      },
      {
        "@xsi:type": "AdresseMail_Type",
        "uid": "AD275176",
        "type": "15",
        "typeLibelle": "Mèl",
        "poids": null,
        "adresseDeRattachement": null,
        "valElec": "francois.sauvadet@wanadoo.fr"
      },
      {
        "@xsi:type": "AdressePostale_Type",
        "uid": "AD386667",
        "type": "0",
        "typeLibelle": "Adresse officielle",
        "poids": "1",
        "adresseDeRattachement": null,
        "intitule": "Assemblée nationale,",
        "numeroRue": "126",
        "nomRue": "Rue de l'Université,",
        "complementAdresse": null,
        "codePostal": "75355",
        "ville": "Paris 07 SP"
      },
      {
        "@xsi:type": "AdresseMail_Type",
        "uid": "AD391848",
        "type": "15",
        "typeLibelle": "Mèl",
        "poids": null,
        "adresseDeRattachement": null,
        "valElec": "fsauvadet@assemblee-nationale.fr"
      },
      {
        "@xsi:type": "AdresseSiteWeb_Type",
        "uid": "AD423344",
        "type": "22",
        "typeLibelle": "Site internet",
        "poids": null,
        "adresseDeRattachement": null,
        "valElec": "www.francois-sauvadet.net"
      }
    ]
  },
  "mandats": {
    "mandat": [
      {
        "@xmlns:xsi": "http://www.w3.org/2001/XMLSchema-instance",
        "uid": "PM386518",
        "acteurRef": "PA2690",
        "legislature": "13",
        "typeOrgane": "ASSEMBLEE",
        "dateDebut": "2007-06-20T02:00:00.000+02:00",
        "datePublication": null,
        "dateFin": "2011-07-29T02:00:00.000+02:00",
        "preseance": "50",
        "nominPrincipale": "1",
        "infosQualite": {
          "codeQualite": "membre",
          "libQualite": "membre",
          "libQualiteSex": "membre"
        },
        "organes": {
          "organeRef": "PO384266"
        },
        "suppleants": {
          "suppleant": {
            "dateDebut": "2007-06-20T02:00:00.000+02:00",
            "dateFin": "2011-07-29T02:00:00.000+02:00",
            "suppleantRef": "PA341206"
          }
        },
        "chambre": null,
        "election": {
          "lieu": {
            "region": "Bourgogne-Franche-Comté",
            "regionType": "Métropolitain",
            "departement": "Côte-d'Or",
            "numDepartement": "21",
            "numCirco": "4"
          },
          "causeMandat": "élections générales",
          "refCirconscription": "PO384356"
        },
        "mandature": {
          "datePriseFonction": "2007-06-20T02:00:00.000+02:00",
          "causeFin": "Nomination comme membre du Gouvernement",
          "premiereElection": "1",
          "placeHemicycle": null,
          "mandatRemplaceRef": null
        },
        "collaborateurs": null
      },
      {
        "@xmlns:xsi": "http://www.w3.org/2001/XMLSchema-instance",
        "uid": "PM387246",
        "acteurRef": "PA2690",
        "legislature": "13",
        "typeOrgane": "GP",
        "dateDebut": "2007-06-20T02:00:00.000+02:00",
        "datePublication": null,
        "dateFin": "2007-06-26T02:00:00.000+02:00",
        "preseance": "28",
        "nominPrincipale": "1",
        "infosQualite": {
          "codeQualite": "Député non-inscrit",
          "libQualite": "Député non-inscrit",
          "libQualiteSex": "Député non-inscrit"
        },
        "organes": {
          "organeRef": "PO387155"
        }
      },
      {
        "uid": "PM389660",
        "acteurRef": "PA2690",
        "legislature": "13",
        "typeOrgane": "GP",
        "dateDebut": "2007-06-27T02:00:00.000+02:00",
        "datePublication": "2007-06-27T02:00:00.000+02:00",
        "dateFin": "2011-07-29T02:00:00.000+02:00",
        "preseance": "20",
        "nominPrincipale": "1",
        "infosQualite": {
          "codeQualite": "Membre",
          "libQualite": "Membre du",
          "libQualiteSex": "Membre du"
        },
        "organes": {
          "organeRef": "PO389639"
        }
      },
      {
        "uid": "PM389665",
        "acteurRef": "PA2690",
        "legislature": "13",
        "typeOrgane": "GP",
        "dateDebut": "2007-06-27T02:00:00.000+02:00",
        "datePublication": "2007-06-27T02:00:00.000+02:00",
        "dateFin": "2011-07-05T02:00:00.000+02:00",
        "preseance": "1",
        "nominPrincipale": "1",
        "infosQualite": {
          "codeQualite": "Président",
          "libQualite": "Président du",
          "libQualiteSex": "Président du"
        },
        "organes": {
          "organeRef": "PO389639"
        }
      },
      {
        "uid": "PM390623",
        "acteurRef": "PA2690",
        "legislature": "13",
        "typeOrgane": "COMPER",
        "dateDebut": "2007-06-27T02:00:00.000+02:00",
        "datePublication": "2007-06-28T02:00:00.000+02:00",
        "dateFin": "2009-06-30T02:00:00.000+02:00",
        "preseance": "32",
        "nominPrincipale": "1",
        "infosQualite": {
          "codeQualite": "Membre",
          "libQualite": "Membre",
          "libQualiteSex": "Membre"
        },
        "organes": {
          "organeRef": "PO277060"
        }
      },
      {
        "uid": "PM394604",
        "acteurRef": "PA2690",
        "legislature": "13",
        "typeOrgane": "ORGEXTPARL",
        "dateDebut": "2007-08-01T02:00:00.000+02:00",
        "datePublication": "2007-08-02T02:00:00.000+02:00",
        "dateFin": "2011-07-29T02:00:00.000+02:00",
        "preseance": "30",
        "nominPrincipale": "1",
        "infosQualite": {
          "codeQualite": "Suppléant",
          "libQualite": "Membre suppléant",
          "libQualiteSex": "Membre suppléant"
        },
        "organes": {
          "organeRef": "PO296368"
        }
      },
      {
        "uid": "PM394702",
        "acteurRef": "PA2690",
        "legislature": "13",
        "typeOrgane": "ORGEXTPARL",
        "dateDebut": "2007-08-01T02:00:00.000+02:00",
        "datePublication": "2007-08-02T02:00:00.000+02:00",
        "dateFin": "2011-07-29T02:00:00.000+02:00",
        "preseance": "20",
        "nominPrincipale": "1",
        "infosQualite": {
          "codeQualite": "Titulaire",
          "libQualite": "Membre titulaire",
          "libQualiteSex": "Membre titulaire"
        },
        "organes": {
          "organeRef": "PO60216"
        }
      },
      {
        "@xmlns:xsi": "http://www.w3.org/2001/XMLSchema-instance",
        "uid": "PM395354",
        "acteurRef": "PA2690",
        "legislature": "13",
        "typeOrgane": "GA",
        "dateDebut": "2007-09-11T02:00:00.000+02:00",
        "datePublication": null,
        "dateFin": "2011-07-29T02:00:00.000+02:00",
        "preseance": "20",
        "nominPrincipale": "0",
        "infosQualite": {
          "codeQualite": "Membre",
          "libQualite": "Membre",
          "libQualiteSex": "Membre"
        },
        "organes": {
          "organeRef": "PO392985"
        }
      },
      {
        "@xmlns:xsi": "http://www.w3.org/2001/XMLSchema-instance",
        "uid": "PM395355",
        "acteurRef": "PA2690",
        "legislature": "13",
        "typeOrgane": "GA",
        "dateDebut": "2007-09-11T02:00:00.000+02:00",
        "datePublication": null,
        "dateFin": "2011-07-29T02:00:00.000+02:00",
        "preseance": "1",
        "nominPrincipale": "1",
        "infosQualite": {
          "codeQualite": "Président",
          "libQualite": "Président",
          "libQualiteSex": "Président"
        },
        "organes": {
          "organeRef": "PO392985"
        }
      },
      {
        "@xmlns:xsi": "http://www.w3.org/2001/XMLSchema-instance",
        "uid": "PM400706",
        "acteurRef": "PA2690",
        "legislature": "13",
        "typeOrgane": "GA",
        "dateDebut": "2007-10-23T02:00:00.000+02:00",
        "datePublication": null,
        "dateFin": "2011-07-29T02:00:00.000+02:00",
        "preseance": "20",
        "nominPrincipale": "1",
        "infosQualite": {
          "codeQualite": "Membre",
          "libQualite": "Membre",
          "libQualiteSex": "Membre"
        },
        "organes": {
          "organeRef": "PO392659"
        }
      },
      {
        "@xmlns:xsi": "http://www.w3.org/2001/XMLSchema-instance",
        "uid": "PM400707",
        "acteurRef": "PA2690",
        "legislature": "13",
        "typeOrgane": "GA",
        "dateDebut": "2007-10-23T02:00:00.000+02:00",
        "datePublication": null,
        "dateFin": "2011-07-29T02:00:00.000+02:00",
        "preseance": "20",
        "nominPrincipale": "1",
        "infosQualite": {
          "codeQualite": "Membre",
          "libQualite": "Membre",
          "libQualiteSex": "Membre"
        },
        "organes": {
          "organeRef": "PO392780"
        }
      },
      {
        "@xmlns:xsi": "http://www.w3.org/2001/XMLSchema-instance",
        "uid": "PM400708",
        "acteurRef": "PA2690",
        "legislature": "13",
        "typeOrgane": "GA",
        "dateDebut": "2007-10-23T02:00:00.000+02:00",
        "datePublication": null,
        "dateFin": "2011-07-29T02:00:00.000+02:00",
        "preseance": "20",
        "nominPrincipale": "1",
        "infosQualite": {
          "codeQualite": "Membre",
          "libQualite": "Membre",
          "libQualiteSex": "Membre"
        },
        "organes": {
          "organeRef": "PO392840"
        }
      },
      {
        "@xmlns:xsi": "http://www.w3.org/2001/XMLSchema-instance",
        "uid": "PM400709",
        "acteurRef": "PA2690",
        "legislature": "13",
        "typeOrgane": "GA",
        "dateDebut": "2007-10-23T02:00:00.000+02:00",
        "datePublication": null,
        "dateFin": "2011-07-29T02:00:00.000+02:00",
        "preseance": "20",
        "nominPrincipale": "1",
        "infosQualite": {
          "codeQualite": "Membre",
          "libQualite": "Membre",
          "libQualiteSex": "Membre"
        },
        "organes": {
          "organeRef": "PO392895"
        }
      },
      {
        "@xmlns:xsi": "http://www.w3.org/2001/XMLSchema-instance",
        "uid": "PM400710",
        "acteurRef": "PA2690",
        "legislature": "13",
        "typeOrgane": "GA",
        "dateDebut": "2007-10-23T02:00:00.000+02:00",
        "datePublication": null,
        "dateFin": "2011-07-29T02:00:00.000+02:00",
        "preseance": "20",
        "nominPrincipale": "1",
        "infosQualite": {
          "codeQualite": "Membre",
          "libQualite": "Membre",
          "libQualiteSex": "Membre"
        },
        "organes": {
          "organeRef": "PO393085"
        }
      },
      {
        "@xmlns:xsi": "http://www.w3.org/2001/XMLSchema-instance",
        "uid": "PM400711",
        "acteurRef": "PA2690",
        "legislature": "13",
        "typeOrgane": "GA",
        "dateDebut": "2007-10-23T02:00:00.000+02:00",
        "datePublication": null,
        "dateFin": "2011-07-29T02:00:00.000+02:00",
        "preseance": "20",
        "nominPrincipale": "1",
        "infosQualite": {
          "codeQualite": "Membre",
          "libQualite": "Membre",
          "libQualiteSex": "Membre"
        },
        "organes": {
          "organeRef": "PO393100"
        }
      },
      {
        "@xmlns:xsi": "http://www.w3.org/2001/XMLSchema-instance",
        "uid": "PM400712",
        "acteurRef": "PA2690",
        "legislature": "13",
        "typeOrgane": "GA",
        "dateDebut": "2007-10-23T02:00:00.000+02:00",
        "datePublication": null,
        "dateFin": "2011-07-29T02:00:00.000+02:00",
        "preseance": "20",
        "nominPrincipale": "1",
        "infosQualite": {
          "codeQualite": "Membre",
          "libQualite": "Membre",
          "libQualiteSex": "Membre"
        },
        "organes": {
          "organeRef": "PO393523"
        }
      },
      {
        "@xmlns:xsi": "http://www.w3.org/2001/XMLSchema-instance",
        "uid": "PM402127",
        "acteurRef": "PA2690",
        "legislature": "13",
        "typeOrgane": "GA",
        "dateDebut": "2007-10-31T01:00:00.000+01:00",
        "datePublication": null,
        "dateFin": "2011-07-29T02:00:00.000+02:00",
        "preseance": "20",
        "nominPrincipale": "1",
        "infosQualite": {
          "codeQualite": "Membre",
          "libQualite": "Membre",
          "libQualiteSex": "Membre"
        },
        "organes": {
          "organeRef": "PO392699"
        }
      },
      {
        "@xmlns:xsi": "http://www.w3.org/2001/XMLSchema-instance",
        "uid": "PM403514",
        "acteurRef": "PA2690",
        "legislature": "13",
        "typeOrgane": "GE",
        "dateDebut": "2007-11-09T01:00:00.000+01:00",
        "datePublication": null,
        "dateFin": "2011-07-29T02:00:00.000+02:00",
        "preseance": "20",
        "nominPrincipale": "0",
        "infosQualite": {
          "codeQualite": "Membre",
          "libQualite": "Membre",
          "libQualiteSex": "Membre"
        },
        "organes": {
          "organeRef": "PO403166"
        }
      },
      {
        "@xmlns:xsi": "http://www.w3.org/2001/XMLSchema-instance",
        "uid": "PM403515",
        "acteurRef": "PA2690",
        "legislature": "13",
        "typeOrgane": "GE",
        "dateDebut": "2007-11-09T01:00:00.000+01:00",
        "datePublication": null,
        "dateFin": "2011-07-29T02:00:00.000+02:00",
        "preseance": "4",
        "nominPrincipale": "1",
        "infosQualite": {
          "codeQualite": "Co-Président",
          "libQualite": "Co-Président",
          "libQualiteSex": "Co-Président"
        },
        "organes": {
          "organeRef": "PO403166"
        }
      },
      {
        "@xmlns:xsi": "http://www.w3.org/2001/XMLSchema-instance",
        "uid": "PM403596",
        "acteurRef": "PA2690",
        "legislature": "13",
        "typeOrgane": "GA",
        "dateDebut": "2007-11-13T01:00:00.000+01:00",
        "datePublication": null,
        "dateFin": "2011-07-29T02:00:00.000+02:00",
        "preseance": "8",
        "nominPrincipale": "1",
        "infosQualite": {
          "codeQualite": "Vice-Président",
          "libQualite": "Vice-Président",
          "libQualiteSex": "Vice-Président"
        },
        "organes": {
          "organeRef": "PO393085"
        }
      },
      {
        "@xmlns:xsi": "http://www.w3.org/2001/XMLSchema-instance",
        "uid": "PM403730",
        "acteurRef": "PA2690",
        "legislature": "13",
        "typeOrgane": "GA",
        "dateDebut": "2007-11-16T01:00:00.000+01:00",
        "datePublication": null,
        "dateFin": "2011-07-29T02:00:00.000+02:00",
        "preseance": "20",
        "nominPrincipale": "1",
        "infosQualite": {
          "codeQualite": "Membre",
          "libQualite": "Membre",
          "libQualiteSex": "Membre"
        },
        "organes": {
          "organeRef": "PO393268"
        }
      },
      {
        "@xmlns:xsi": "http://www.w3.org/2001/XMLSchema-instance",
        "uid": "PM403868",
        "acteurRef": "PA2690",
        "legislature": "13",
        "typeOrgane": "GA",
        "dateDebut": "2007-11-20T01:00:00.000+01:00",
        "datePublication": null,
        "dateFin": "2011-07-29T02:00:00.000+02:00",
        "preseance": "8",
        "nominPrincipale": "1",
        "infosQualite": {
          "codeQualite": "Vice-Président",
          "libQualite": "Vice-Président",
          "libQualiteSex": "Vice-Président"
        },
        "organes": {
          "organeRef": "PO392895"
        }
      },
      {
        "@xmlns:xsi": "http://www.w3.org/2001/XMLSchema-instance",
        "uid": "PM404923",
        "acteurRef": "PA2690",
        "legislature": "13",
        "typeOrgane": "GA",
        "dateDebut": "2007-11-28T01:00:00.000+01:00",
        "datePublication": null,
        "dateFin": "2011-07-29T02:00:00.000+02:00",
        "preseance": "8",
        "nominPrincipale": "1",
        "infosQualite": {
          "codeQualite": "Vice-Président",
          "libQualite": "Vice-Président",
          "libQualiteSex": "Vice-Président"
        },
        "organes": {
          "organeRef": "PO393268"
        }
      },
      {
        "@xmlns:xsi": "http://www.w3.org/2001/XMLSchema-instance",
        "uid": "PM406374",
        "acteurRef": "PA2690",
        "legislature": "13",
        "typeOrgane": "GE",
        "dateDebut": "2008-01-11T01:00:00.000+01:00",
        "datePublication": null,
        "dateFin": "2011-07-29T02:00:00.000+02:00",
        "preseance": "20",
        "nominPrincipale": "1",
        "infosQualite": {
          "codeQualite": "Membre",
          "libQualite": "Membre",
          "libQualiteSex": "Membre"
        },
        "organes": {
          "organeRef": "PO402776"
        }
      },
      {
        "@xmlns:xsi": "http://www.w3.org/2001/XMLSchema-instance",
        "uid": "PM406400",
        "acteurRef": "PA2690",
        "legislature": "13",
        "typeOrgane": "GE",
        "dateDebut": "2008-01-11T01:00:00.000+01:00",
        "datePublication": null,
        "dateFin": "2011-07-29T02:00:00.000+02:00",
        "preseance": "20",
        "nominPrincipale": "1",
        "infosQualite": {
          "codeQualite": "Membre",
          "libQualite": "Membre",
          "libQualiteSex": "Membre"
        },
        "organes": {
          "organeRef": "PO402949"
        }
      },
      {
        "@xmlns:xsi": "http://www.w3.org/2001/XMLSchema-instance",
        "uid": "PM406561",
        "acteurRef": "PA2690",
        "legislature": "13",
        "typeOrgane": "GE",
        "dateDebut": "2008-01-15T01:00:00.000+01:00",
        "datePublication": null,
        "dateFin": "2011-07-29T02:00:00.000+02:00",
        "preseance": "20",
        "nominPrincipale": "0",
        "infosQualite": {
          "codeQualite": "Membre",
          "libQualite": "Membre",
          "libQualiteSex": "Membre"
        },
        "organes": {
          "organeRef": "PO402943"
        }
      },
      {
        "@xmlns:xsi": "http://www.w3.org/2001/XMLSchema-instance",
        "uid": "PM406705",
        "acteurRef": "PA2690",
        "legislature": "13",
        "typeOrgane": "GE",
        "dateDebut": "2008-01-11T01:00:00.000+01:00",
        "datePublication": null,
        "dateFin": "2011-07-29T02:00:00.000+02:00",
        "preseance": "20",
        "nominPrincipale": "1",
        "infosQualite": {
          "codeQualite": "Membre",
          "libQualite": "Membre",
          "libQualiteSex": "Membre"
        },
        "organes": {
          "organeRef": "PO402727"
        }
      },
      {
        "@xmlns:xsi": "http://www.w3.org/2001/XMLSchema-instance",
        "uid": "PM406790",
        "acteurRef": "PA2690",
        "legislature": "13",
        "typeOrgane": "GE",
        "dateDebut": "2008-01-15T01:00:00.000+01:00",
        "datePublication": null,
        "dateFin": "2011-07-29T02:00:00.000+02:00",
        "preseance": "20",
        "nominPrincipale": "1",
        "infosQualite": {
          "codeQualite": "Membre",
          "libQualite": "Membre",
          "libQualiteSex": "Membre"
        },
        "organes": {
          "organeRef": "PO402869"
        }
      },
      {
        "@xmlns:xsi": "http://www.w3.org/2001/XMLSchema-instance",
        "uid": "PM407086",
        "acteurRef": "PA2690",
        "legislature": "13",
        "typeOrgane": "GE",
        "dateDebut": "2008-01-15T01:00:00.000+01:00",
        "datePublication": null,
        "dateFin": "2011-07-29T02:00:00.000+02:00",
        "preseance": "20",
        "nominPrincipale": "1",
        "infosQualite": {
          "codeQualite": "Membre",
          "libQualite": "Membre",
          "libQualiteSex": "Membre"
        },
        "organes": {
          "organeRef": "PO403148"
        }
      },
      {
        "@xmlns:xsi": "http://www.w3.org/2001/XMLSchema-instance",
        "uid": "PM407298",
        "acteurRef": "PA2690",
        "legislature": "13",
        "typeOrgane": "GE",
        "dateDebut": "2008-01-01T01:00:00.000+01:00",
        "datePublication": null,
        "dateFin": "2011-07-29T02:00:00.000+02:00",
        "preseance": "20",
        "nominPrincipale": "1",
        "infosQualite": {
          "codeQualite": "Membre",
          "libQualite": "Membre",
          "libQualiteSex": "Membre"
        },
        "organes": {
          "organeRef": "PO402985"
        }
      },
      {
        "@xmlns:xsi": "http://www.w3.org/2001/XMLSchema-instance",
        "uid": "PM407322",
        "acteurRef": "PA2690",
        "legislature": "13",
        "typeOrgane": "GE",
        "dateDebut": "2008-01-22T01:00:00.000+01:00",
        "datePublication": null,
        "dateFin": "2011-07-29T02:00:00.000+02:00",
        "preseance": "8",
        "nominPrincipale": "1",
        "infosQualite": {
          "codeQualite": "Vice-Président",
          "libQualite": "Vice-Président",
          "libQualiteSex": "Vice-Président"
        },
        "organes": {
          "organeRef": "PO402727"
        }
      },
      {
        "@xmlns:xsi": "http://www.w3.org/2001/XMLSchema-instance",
        "uid": "PM407576",
        "acteurRef": "PA2690",
        "legislature": "13",
        "typeOrgane": "GE",
        "dateDebut": "2008-01-24T01:00:00.000+01:00",
        "datePublication": null,
        "dateFin": "2011-07-29T02:00:00.000+02:00",
        "preseance": "20",
        "nominPrincipale": "1",
        "infosQualite": {
          "codeQualite": "Membre",
          "libQualite": "Membre",
          "libQualiteSex": "Membre"
        },
        "organes": {
          "organeRef": "PO403262"
        }
      },
      {
        "@xmlns:xsi": "http://www.w3.org/2001/XMLSchema-instance",
        "uid": "PM407593",
        "acteurRef": "PA2690",
        "legislature": "13",
        "typeOrgane": "GE",
        "dateDebut": "2008-01-15T01:00:00.000+01:00",
        "datePublication": null,
        "dateFin": "2011-07-29T02:00:00.000+02:00",
        "preseance": "8",
        "nominPrincipale": "1",
        "infosQualite": {
          "codeQualite": "Vice-Président",
          "libQualite": "Vice-Président",
          "libQualiteSex": "Vice-Président"
        },
        "organes": {
          "organeRef": "PO402943"
        }
      },
      {
        "@xmlns:xsi": "http://www.w3.org/2001/XMLSchema-instance",
        "uid": "PM408055",
        "acteurRef": "PA2690",
        "legislature": "13",
        "typeOrgane": "GE",
        "dateDebut": "2008-01-23T01:00:00.000+01:00",
        "datePublication": null,
        "dateFin": "2011-07-29T02:00:00.000+02:00",
        "preseance": "20",
        "nominPrincipale": "1",
        "infosQualite": {
          "codeQualite": "Membre",
          "libQualite": "Membre",
          "libQualiteSex": "Membre"
        },
        "organes": {
          "organeRef": "PO403051"
        }
      },
      {
        "@xmlns:xsi": "http://www.w3.org/2001/XMLSchema-instance",
        "uid": "PM408256",
        "acteurRef": "PA2690",
        "legislature": "13",
        "typeOrgane": "GE",
        "dateDebut": "2008-02-01T01:00:00.000+01:00",
        "datePublication": null,
        "dateFin": "2011-07-29T02:00:00.000+02:00",
        "preseance": "20",
        "nominPrincipale": "1",
        "infosQualite": {
          "codeQualite": "Membre",
          "libQualite": "Membre",
          "libQualiteSex": "Membre"
        },
        "organes": {
          "organeRef": "PO402979"
        }
      },
      {
        "@xmlns:xsi": "http://www.w3.org/2001/XMLSchema-instance",
        "uid": "PM408513",
        "acteurRef": "PA2690",
        "legislature": "13",
        "typeOrgane": "GE",
        "dateDebut": "2008-02-05T01:00:00.000+01:00",
        "datePublication": null,
        "dateFin": "2011-07-29T02:00:00.000+02:00",
        "preseance": "20",
        "nominPrincipale": "1",
        "infosQualite": {
          "codeQualite": "Membre",
          "libQualite": "Membre",
          "libQualiteSex": "Membre"
        },
        "organes": {
          "organeRef": "PO403244"
        }
      },
      {
        "@xmlns:xsi": "http://www.w3.org/2001/XMLSchema-instance",
        "uid": "PM408562",
        "acteurRef": "PA2690",
        "legislature": "13",
        "typeOrgane": "GA",
        "dateDebut": "2008-02-04T01:00:00.000+01:00",
        "datePublication": null,
        "dateFin": "2011-07-29T02:00:00.000+02:00",
        "preseance": "8",
        "nominPrincipale": "1",
        "infosQualite": {
          "codeQualite": "Vice-Président",
          "libQualite": "Vice-Président",
          "libQualiteSex": "Vice-Président"
        },
        "organes": {
          "organeRef": "PO393100"
        }
      },
      {
        "@xmlns:xsi": "http://www.w3.org/2001/XMLSchema-instance",
        "uid": "PM408737",
        "acteurRef": "PA2690",
        "legislature": "13",
        "typeOrgane": "GE",
        "dateDebut": "2008-02-07T01:00:00.000+01:00",
        "datePublication": null,
        "dateFin": "2011-07-29T02:00:00.000+02:00",
        "preseance": "20",
        "nominPrincipale": "1",
        "infosQualite": {
          "codeQualite": "Membre",
          "libQualite": "Membre",
          "libQualiteSex": "Membre"
        },
        "organes": {
          "organeRef": "PO403009"
        }
      },
      {
        "@xmlns:xsi": "http://www.w3.org/2001/XMLSchema-instance",
        "uid": "PM409208",
        "acteurRef": "PA2690",
        "legislature": "13",
        "typeOrgane": "GE",
        "dateDebut": "2008-02-11T01:00:00.000+01:00",
        "datePublication": null,
        "dateFin": "2011-07-29T02:00:00.000+02:00",
        "preseance": "20",
        "nominPrincipale": "1",
        "infosQualite": {
          "codeQualite": "Membre",
          "libQualite": "Membre",
          "libQualiteSex": "Membre"
        },
        "organes": {
          "organeRef": "PO403289"
        }
      },
      {
        "@xmlns:xsi": "http://www.w3.org/2001/XMLSchema-instance",
        "uid": "PM409869",
        "acteurRef": "PA2690",
        "legislature": "13",
        "typeOrgane": "GE",
        "dateDebut": "2008-02-28T01:00:00.000+01:00",
        "datePublication": null,
        "dateFin": "2011-07-29T02:00:00.000+02:00",
        "preseance": "20",
        "nominPrincipale": "1",
        "infosQualite": {
          "codeQualite": "Membre",
          "libQualite": "Membre",
          "libQualiteSex": "Membre"
        },
        "organes": {
          "organeRef": "PO402856"
        }
      },
      {
        "@xmlns:xsi": "http://www.w3.org/2001/XMLSchema-instance",
        "uid": "PM409994",
        "acteurRef": "PA2690",
        "legislature": "13",
        "typeOrgane": "GE",
        "dateDebut": "2008-01-20T01:00:00.000+01:00",
        "datePublication": null,
        "dateFin": "2011-07-29T02:00:00.000+02:00",
        "preseance": "20",
        "nominPrincipale": "1",
        "infosQualite": {
          "codeQualite": "Membre",
          "libQualite": "Membre",
          "libQualiteSex": "Membre"
        },
        "organes": {
          "organeRef": "PO402802"
        }
      },
      {
        "@xmlns:xsi": "http://www.w3.org/2001/XMLSchema-instance",
        "uid": "PM410354",
        "acteurRef": "PA2690",
        "legislature": "13",
        "typeOrgane": "GE",
        "dateDebut": "2008-02-05T01:00:00.000+01:00",
        "datePublication": null,
        "dateFin": "2011-07-29T02:00:00.000+02:00",
        "preseance": "20",
        "nominPrincipale": "1",
        "infosQualite": {
          "codeQualite": "Membre",
          "libQualite": "Membre",
          "libQualiteSex": "Membre"
        },
        "organes": {
          "organeRef": "PO403319"
        }
      },
      {
        "@xmlns:xsi": "http://www.w3.org/2001/XMLSchema-instance",
        "uid": "PM412573",
        "acteurRef": "PA2690",
        "legislature": "13",
        "typeOrgane": "GE",
        "dateDebut": "2008-04-15T02:00:00.000+02:00",
        "datePublication": null,
        "dateFin": "2011-07-29T02:00:00.000+02:00",
        "preseance": "20",
        "nominPrincipale": "1",
        "infosQualite": {
          "codeQualite": "Membre",
          "libQualite": "Membre",
          "libQualiteSex": "Membre"
        },
        "organes": {
          "organeRef": "PO402997"
        }
      },
      {
        "@xmlns:xsi": "http://www.w3.org/2001/XMLSchema-instance",
        "uid": "PM412658",
        "acteurRef": "PA2690",
        "legislature": "13",
        "typeOrgane": "GE",
        "dateDebut": "2008-04-16T02:00:00.000+02:00",
        "datePublication": null,
        "dateFin": "2011-07-29T02:00:00.000+02:00",
        "preseance": "20",
        "nominPrincipale": "1",
        "infosQualite": {
          "codeQualite": "Membre",
          "libQualite": "Membre",
          "libQualiteSex": "Membre"
        },
        "organes": {
          "organeRef": "PO403003"
        }
      },
      {
        "@xmlns:xsi": "http://www.w3.org/2001/XMLSchema-instance",
        "uid": "PM412869",
        "acteurRef": "PA2690",
        "legislature": "13",
        "typeOrgane": "GE",
        "dateDebut": "2008-04-18T02:00:00.000+02:00",
        "datePublication": null,
        "dateFin": "2011-07-29T02:00:00.000+02:00",
        "preseance": "20",
        "nominPrincipale": "1",
        "infosQualite": {
          "codeQualite": "Membre",
          "libQualite": "Membre",
          "libQualiteSex": "Membre"
        },
        "organes": {
          "organeRef": "PO403202"
        }
      },
      {
        "@xmlns:xsi": "http://www.w3.org/2001/XMLSchema-instance",
        "uid": "PM414428",
        "acteurRef": "PA2690",
        "legislature": "13",
        "typeOrgane": "GA",
        "dateDebut": "2008-07-02T02:00:00.000+02:00",
        "datePublication": null,
        "dateFin": "2011-07-29T02:00:00.000+02:00",
        "preseance": "8",
        "nominPrincipale": "1",
        "infosQualite": {
          "codeQualite": "Vice-Président",
          "libQualite": "Vice-Président",
          "libQualiteSex": "Vice-Président"
        },
        "organes": {
          "organeRef": "PO393523"
        }
      },
      {
        "@xmlns:xsi": "http://www.w3.org/2001/XMLSchema-instance",
        "uid": "PM418702",
        "acteurRef": "PA2690",
        "legislature": "13",
        "typeOrgane": "GE",
        "dateDebut": "2008-01-29T01:00:00.000+01:00",
        "datePublication": null,
        "dateFin": "2011-07-29T02:00:00.000+02:00",
        "preseance": "20",
        "nominPrincipale": "1",
        "infosQualite": {
          "codeQualite": "Membre",
          "libQualite": "Membre",
          "libQualiteSex": "Membre"
        },
        "organes": {
          "organeRef": "PO402955"
        }
      },
      {
        "uid": "PM420576",
        "acteurRef": "PA2690",
        "legislature": "13",
        "typeOrgane": "COMNL",
        "dateDebut": "2009-07-01T02:00:00.000+02:00",
        "datePublication": "2009-07-03T02:00:00.000+02:00",
        "dateFin": "2011-07-29T02:00:00.000+02:00",
        "preseance": "2",
        "nominPrincipale": "1",
        "infosQualite": {
          "codeQualite": "Membre de droit du Bureau",
          "libQualite": "Membre de droit du Bureau",
          "libQualiteSex": "Membre de droit du Bureau"
        },
        "organes": {
          "organeRef": "PO420375"
        },
        "suppleants": null
      },
      {
        "uid": "PM420607",
        "acteurRef": "PA2690",
        "legislature": "13",
        "typeOrgane": "COMPER",
        "dateDebut": "2009-07-01T02:00:00.000+02:00",
        "datePublication": "2009-07-01T02:00:00.000+02:00",
        "dateFin": "2011-02-03T01:00:00.000+01:00",
        "preseance": "32",
        "nominPrincipale": "1",
        "infosQualite": {
          "codeQualite": "Membre",
          "libQualite": "Membre",
          "libQualiteSex": "Membre"
        },
        "organes": {
          "organeRef": "PO419865"
        }
      },
      {
        "@xmlns:xsi": "http://www.w3.org/2001/XMLSchema-instance",
        "uid": "PM424888",
        "acteurRef": "PA2690",
        "legislature": "13",
        "typeOrgane": "GE",
        "dateDebut": "2010-07-27T02:00:00.000+02:00",
        "datePublication": null,
        "dateFin": "2011-07-29T02:00:00.000+02:00",
        "preseance": "20",
        "nominPrincipale": "1",
        "infosQualite": {
          "codeQualite": "Membre",
          "libQualite": "Membre",
          "libQualiteSex": "Membre"
        },
        "organes": {
          "organeRef": "PO424325"
        }
      },
      {
        "uid": "PM425112",
        "acteurRef": "PA2690",
        "legislature": "13",
        "typeOrgane": "COMNL",
        "dateDebut": "2009-07-01T02:00:00.000+02:00",
        "datePublication": "2009-07-03T02:00:00.000+02:00",
        "dateFin": "2011-07-29T02:00:00.000+02:00",
        "preseance": "20",
        "nominPrincipale": "0",
        "infosQualite": {
          "codeQualite": "Membre",
          "libQualite": "Membre",
          "libQualiteSex": "Membre"
        },
        "organes": {
          "organeRef": "PO420375"
        },
        "suppleants": null
      },
      {
        "uid": "PM426901",
        "acteurRef": "PA2690",
        "legislature": "13",
        "typeOrgane": "COMPER",
        "dateDebut": "2011-02-04T01:00:00.000+01:00",
        "datePublication": "2011-02-04T01:00:00.000+01:00",
        "dateFin": "2011-07-29T02:00:00.000+02:00",
        "preseance": "32",
        "nominPrincipale": "1",
        "infosQualite": {
          "codeQualite": "Membre",
          "libQualite": "Membre",
          "libQualiteSex": "Membre"
        },
        "organes": {
          "organeRef": "PO419604"
        }
      },
      {
        "@xmlns:xsi": "http://www.w3.org/2001/XMLSchema-instance",
        "uid": "PM428455",
        "acteurRef": "PA2690",
        "legislature": "13",
        "typeOrgane": "GE",
        "dateDebut": "2010-12-16T01:00:00.000+01:00",
        "datePublication": null,
        "dateFin": "2011-07-29T02:00:00.000+02:00",
        "preseance": "20",
        "nominPrincipale": "0",
        "infosQualite": {
          "codeQualite": "Membre",
          "libQualite": "Membre",
          "libQualiteSex": "Membre"
        },
        "organes": {
          "organeRef": "PO422912"
        }
      },
      {
        "@xmlns:xsi": "http://www.w3.org/2001/XMLSchema-instance",
        "uid": "PM428467",
        "acteurRef": "PA2690",
        "legislature": "13",
        "typeOrgane": "GE",
        "dateDebut": "2010-12-16T01:00:00.000+01:00",
        "datePublication": null,
        "dateFin": "2011-07-29T02:00:00.000+02:00",
        "preseance": "8",
        "nominPrincipale": "1",
        "infosQualite": {
          "codeQualite": "Vice-Président",
          "libQualite": "Vice-Président",
          "libQualiteSex": "Vice-Président"
        },
        "organes": {
          "organeRef": "PO422912"
        }
      },
      {
        "@xmlns:xsi": "http://www.w3.org/2001/XMLSchema-instance",
        "uid": "PM429229",
        "acteurRef": "PA2690",
        "legislature": null,
        "typeOrgane": "MINISTERE",
        "dateDebut": "2011-06-29T02:00:00.000+02:00",
        "datePublication": "2011-06-30T02:00:00.000+02:00",
        "dateFin": "2012-05-10T02:00:00.000+02:00",
        "preseance": "30",
        "nominPrincipale": "1",
        "infosQualite": {
          "codeQualite": "Ministre",
          "libQualite": "Ministre",
          "libQualiteSex": "Ministre"
        },
        "organes": {
          "organeRef": "PO429218"
        }
      },
      {
        "@xmlns:xsi": "http://www.w3.org/2001/XMLSchema-instance",
        "uid": "PM645458",
        "acteurRef": "PA2690",
        "legislature": "14",
        "typeOrgane": "ASSEMBLEE",
        "dateDebut": "2012-06-20T02:00:00.000+02:00",
        "datePublication": null,
        "dateFin": "2016-08-17T02:00:00.000+02:00",
        "preseance": "50",
        "nominPrincipale": "1",
        "infosQualite": {
          "codeQualite": "membre",
          "libQualite": "membre",
          "libQualiteSex": "membre"
        },
        "organes": {
          "organeRef": "PO644420"
        },
        "suppleants": {
          "suppleant": {
            "dateDebut": "2012-06-20T02:00:00.000+02:00",
            "dateFin": "2016-08-17T02:00:00.000+02:00",
            "suppleantRef": "PA642691"
          }
        },
        "chambre": null,
        "election": {
          "lieu": {
            "region": "Bourgogne-Franche-Comté",
            "regionType": "Métropolitain",
            "departement": "Côte-d'Or",
            "numDepartement": "21",
            "numCirco": "4"
          },
          "causeMandat": "élections générales",
          "refCirconscription": "PO644510"
        },
        "mandature": {
          "datePriseFonction": "2012-06-20T02:00:00.000+02:00",
          "causeFin": "Démission",
          "premiereElection": "1",
          "placeHemicycle": null,
          "mandatRemplaceRef": null
        },
        "collaborateurs": null
      },
      {
        "uid": "PM656553",
        "acteurRef": "PA2690",
        "legislature": "14",
        "typeOrgane": "GP",
        "dateDebut": "2012-06-26T02:00:00.000+02:00",
        "datePublication": "2012-06-27T02:00:00.000+02:00",
        "dateFin": "2016-08-17T02:00:00.000+02:00",
        "preseance": "20",
        "nominPrincipale": "1",
        "infosQualite": {
          "codeQualite": "Membre",
          "libQualite": "Membre du",
          "libQualiteSex": "Membre du"
        },
        "organes": {
          "organeRef": "PO656010"
        }
      },
      {
        "uid": "PM656966",
        "acteurRef": "PA2690",
        "legislature": "14",
        "typeOrgane": "COMPER",
        "dateDebut": "2012-06-28T02:00:00.000+02:00",
        "datePublication": "2012-06-28T02:00:00.000+02:00",
        "dateFin": "2012-09-19T02:00:00.000+02:00",
        "preseance": "32",
        "nominPrincipale": "1",
        "infosQualite": {
          "codeQualite": "Membre",
          "libQualite": "Membre",
          "libQualiteSex": "Membre"
        },
        "organes": {
          "organeRef": "PO419610"
        }
      },
      {
        "uid": "PM678167",
        "acteurRef": "PA2690",
        "legislature": "14",
        "typeOrgane": "COMPER",
        "dateDebut": "2012-09-20T02:00:00.000+02:00",
        "datePublication": "2012-09-20T02:00:00.000+02:00",
        "dateFin": "2012-09-20T02:00:00.000+02:00",
        "preseance": "32",
        "nominPrincipale": "1",
        "infosQualite": {
          "codeQualite": "Membre",
          "libQualite": "Membre",
          "libQualiteSex": "Membre"
        },
        "organes": {
          "organeRef": "PO59047"
        }
      },
      {
        "uid": "PM678181",
        "acteurRef": "PA2690",
        "legislature": "14",
        "typeOrgane": "COMPER",
        "dateDebut": "2012-09-21T02:00:00.000+02:00",
        "datePublication": "2012-09-21T02:00:00.000+02:00",
        "dateFin": "2012-11-06T01:00:00.000+01:00",
        "preseance": "32",
        "nominPrincipale": "1",
        "infosQualite": {
          "codeQualite": "Membre",
          "libQualite": "Membre",
          "libQualiteSex": "Membre"
        },
        "organes": {
          "organeRef": "PO419610"
        }
      },
      {
        "uid": "PM681374",
        "acteurRef": "PA2690",
        "legislature": "14",
        "typeOrgane": "ORGEXTPARL",
        "dateDebut": "2012-10-11T02:00:00.000+02:00",
        "datePublication": "2012-10-12T02:00:00.000+02:00",
        "dateFin": "2016-08-17T02:00:00.000+02:00",
        "preseance": "20",
        "nominPrincipale": "1",
        "infosQualite": {
          "codeQualite": "Titulaire",
          "libQualite": "Membre titulaire",
          "libQualiteSex": "Membre titulaire"
        },
        "organes": {
          "organeRef": "PO60252"
        }
      },
      {
        "@xmlns:xsi": "http://www.w3.org/2001/XMLSchema-instance",
        "uid": "PM681935",
        "acteurRef": "PA2690",
        "legislature": "14",
        "typeOrgane": "GA",
        "dateDebut": "2012-10-16T02:00:00.000+02:00",
        "datePublication": null,
        "dateFin": "2016-08-17T02:00:00.000+02:00",
        "preseance": "20",
        "nominPrincipale": "1",
        "infosQualite": {
          "codeQualite": "Membre",
          "libQualite": "Membre",
          "libQualiteSex": "Membre"
        },
        "organes": {
          "organeRef": "PO675722"
        }
      },
      {
        "@xmlns:xsi": "http://www.w3.org/2001/XMLSchema-instance",
        "uid": "PM681936",
        "acteurRef": "PA2690",
        "legislature": "14",
        "typeOrgane": "GA",
        "dateDebut": "2012-10-16T02:00:00.000+02:00",
        "datePublication": null,
        "dateFin": "2016-08-17T02:00:00.000+02:00",
        "preseance": "20",
        "nominPrincipale": "1",
        "infosQualite": {
          "codeQualite": "Membre",
          "libQualite": "Membre",
          "libQualiteSex": "Membre"
        },
        "organes": {
          "organeRef": "PO675796"
        }
      },
      {
        "@xmlns:xsi": "http://www.w3.org/2001/XMLSchema-instance",
        "uid": "PM681937",
        "acteurRef": "PA2690",
        "legislature": "14",
        "typeOrgane": "GA",
        "dateDebut": "2012-10-16T02:00:00.000+02:00",
        "datePublication": null,
        "dateFin": "2016-08-17T02:00:00.000+02:00",
        "preseance": "20",
        "nominPrincipale": "1",
        "infosQualite": {
          "codeQualite": "Membre",
          "libQualite": "Membre",
          "libQualiteSex": "Membre"
        },
        "organes": {
          "organeRef": "PO675811"
        }
      },
      {
        "@xmlns:xsi": "http://www.w3.org/2001/XMLSchema-instance",
        "uid": "PM681938",
        "acteurRef": "PA2690",
        "legislature": "14",
        "typeOrgane": "GA",
        "dateDebut": "2012-10-16T02:00:00.000+02:00",
        "datePublication": null,
        "dateFin": "2016-08-17T02:00:00.000+02:00",
        "preseance": "20",
        "nominPrincipale": "1",
        "infosQualite": {
          "codeQualite": "Membre",
          "libQualite": "Membre",
          "libQualiteSex": "Membre"
        },
        "organes": {
          "organeRef": "PO675840"
        }
      },
      {
        "@xmlns:xsi": "http://www.w3.org/2001/XMLSchema-instance",
        "uid": "PM681939",
        "acteurRef": "PA2690",
        "legislature": "14",
        "typeOrgane": "GA",
        "dateDebut": "2012-10-16T02:00:00.000+02:00",
        "datePublication": null,
        "dateFin": "2016-08-17T02:00:00.000+02:00",
        "preseance": "20",
        "nominPrincipale": "1",
        "infosQualite": {
          "codeQualite": "Membre",
          "libQualite": "Membre",
          "libQualiteSex": "Membre"
        },
        "organes": {
          "organeRef": "PO675754"
        }
      },
      {
        "@xmlns:xsi": "http://www.w3.org/2001/XMLSchema-instance",
        "uid": "PM681940",
        "acteurRef": "PA2690",
        "legislature": "14",
        "typeOrgane": "GA",
        "dateDebut": "2012-10-16T02:00:00.000+02:00",
        "datePublication": null,
        "dateFin": "2016-08-17T02:00:00.000+02:00",
        "preseance": "20",
        "nominPrincipale": "1",
        "infosQualite": {
          "codeQualite": "Membre",
          "libQualite": "Membre",
          "libQualiteSex": "Membre"
        },
        "organes": {
          "organeRef": "PO675772"
        }
      },
      {
        "@xmlns:xsi": "http://www.w3.org/2001/XMLSchema-instance",
        "uid": "PM681941",
        "acteurRef": "PA2690",
        "legislature": "14",
        "typeOrgane": "GA",
        "dateDebut": "2012-10-16T02:00:00.000+02:00",
        "datePublication": null,
        "dateFin": "2016-08-17T02:00:00.000+02:00",
        "preseance": "20",
        "nominPrincipale": "1",
        "infosQualite": {
          "codeQualite": "Membre",
          "libQualite": "Membre",
          "libQualiteSex": "Membre"
        },
        "organes": {
          "organeRef": "PO675784"
        }
      },
      {
        "@xmlns:xsi": "http://www.w3.org/2001/XMLSchema-instance",
        "uid": "PM683737",
        "acteurRef": "PA2690",
        "legislature": "14",
        "typeOrgane": "GA",
        "dateDebut": "2012-10-31T01:00:00.000+01:00",
        "datePublication": null,
        "dateFin": "2016-08-17T02:00:00.000+02:00",
        "preseance": "8",
        "nominPrincipale": "1",
        "infosQualite": {
          "codeQualite": "Vice-Président",
          "libQualite": "Vice-Président",
          "libQualiteSex": "Vice-Président"
        },
        "organes": {
          "organeRef": "PO675722"
        }
      },
      {
        "uid": "PM683918",
        "acteurRef": "PA2690",
        "legislature": "14",
        "typeOrgane": "COMPER",
        "dateDebut": "2012-11-07T01:00:00.000+01:00",
        "datePublication": "2012-11-07T01:00:00.000+01:00",
        "dateFin": "2012-11-22T01:00:00.000+01:00",
        "preseance": "32",
        "nominPrincipale": "1",
        "infosQualite": {
          "codeQualite": "Membre",
          "libQualite": "Membre",
          "libQualiteSex": "Membre"
        },
        "organes": {
          "organeRef": "PO59051"
        }
      },
      {
        "@xmlns:xsi": "http://www.w3.org/2001/XMLSchema-instance",
        "uid": "PM684775",
        "acteurRef": "PA2690",
        "legislature": "14",
        "typeOrgane": "GA",
        "dateDebut": "2012-11-20T01:00:00.000+01:00",
        "datePublication": null,
        "dateFin": "2016-08-17T02:00:00.000+02:00",
        "preseance": "8",
        "nominPrincipale": "1",
        "infosQualite": {
          "codeQualite": "Vice-Président",
          "libQualite": "Vice-Président",
          "libQualiteSex": "Vice-Président"
        },
        "organes": {
          "organeRef": "PO675784"
        }
      },
      {
        "uid": "PM684872",
        "acteurRef": "PA2690",
        "legislature": "14",
        "typeOrgane": "COMPER",
        "dateDebut": "2012-11-23T01:00:00.000+01:00",
        "datePublication": "2012-11-23T01:00:00.000+01:00",
        "dateFin": "2013-02-05T01:00:00.000+01:00",
        "preseance": "32",
        "nominPrincipale": "1",
        "infosQualite": {
          "codeQualite": "Membre",
          "libQualite": "Membre",
          "libQualiteSex": "Membre"
        },
        "organes": {
          "organeRef": "PO419610"
        }
      },
      {
        "@xmlns:xsi": "http://www.w3.org/2001/XMLSchema-instance",
        "uid": "PM684921",
        "acteurRef": "PA2690",
        "legislature": "14",
        "typeOrgane": "GA",
        "dateDebut": "2012-11-21T01:00:00.000+01:00",
        "datePublication": null,
        "dateFin": "2016-08-17T02:00:00.000+02:00",
        "preseance": "8",
        "nominPrincipale": "1",
        "infosQualite": {
          "codeQualite": "Vice-Président",
          "libQualite": "Vice-Président",
          "libQualiteSex": "Vice-Président"
        },
        "organes": {
          "organeRef": "PO675796"
        }
      },
      {
        "@xmlns:xsi": "http://www.w3.org/2001/XMLSchema-instance",
        "uid": "PM686052",
        "acteurRef": "PA2690",
        "legislature": null,
        "typeOrgane": "PARPOL",
        "dateDebut": "2012-12-01T01:00:00.000+01:00",
        "datePublication": null,
        "dateFin": "2016-08-17T02:00:00.000+02:00",
        "preseance": "5",
        "nominPrincipale": "1",
        "infosQualite": {
          "codeQualite": "Membre",
          "libQualite": "Membre",
          "libQualiteSex": "Membre"
        },
        "organes": {
          "organeRef": "PO684940"
        }
      },
      {
        "@xmlns:xsi": "http://www.w3.org/2001/XMLSchema-instance",
        "uid": "PM687341",
        "acteurRef": "PA2690",
        "legislature": "14",
        "typeOrgane": "GA",
        "dateDebut": "2012-12-18T01:00:00.000+01:00",
        "datePublication": null,
        "dateFin": "2016-08-17T02:00:00.000+02:00",
        "preseance": "8",
        "nominPrincipale": "1",
        "infosQualite": {
          "codeQualite": "Vice-Président",
          "libQualite": "Vice-Président",
          "libQualiteSex": "Vice-Président"
        },
        "organes": {
          "organeRef": "PO675811"
        }
      },
      {
        "@xmlns:xsi": "http://www.w3.org/2001/XMLSchema-instance",
        "uid": "PM687514",
        "acteurRef": "PA2690",
        "legislature": "14",
        "typeOrgane": "GA",
        "dateDebut": "2012-12-21T01:00:00.000+01:00",
        "datePublication": null,
        "dateFin": "2016-08-17T02:00:00.000+02:00",
        "preseance": "8",
        "nominPrincipale": "1",
        "infosQualite": {
          "codeQualite": "Vice-Président",
          "libQualite": "Vice-Président",
          "libQualiteSex": "Vice-Président"
        },
        "organes": {
          "organeRef": "PO675754"
        }
      },
      {
        "@xmlns:xsi": "http://www.w3.org/2001/XMLSchema-instance",
        "uid": "PM688074",
        "acteurRef": "PA2690",
        "legislature": "14",
        "typeOrgane": "GA",
        "dateDebut": "2013-02-17T01:00:00.000+01:00",
        "datePublication": null,
        "dateFin": "2016-08-17T02:00:00.000+02:00",
        "preseance": "20",
        "nominPrincipale": "1",
        "infosQualite": {
          "codeQualite": "Membre",
          "libQualite": "Membre",
          "libQualiteSex": "Membre"
        },
        "organes": {
          "organeRef": "PO675836"
        }
      },
      {
        "@xmlns:xsi": "http://www.w3.org/2001/XMLSchema-instance",
        "uid": "PM688400",
        "acteurRef": "PA2690",
        "legislature": "14",
        "typeOrgane": "GE",
        "dateDebut": "2013-01-15T01:00:00.000+01:00",
        "datePublication": null,
        "dateFin": "2016-08-17T02:00:00.000+02:00",
        "preseance": "20",
        "nominPrincipale": "1",
        "infosQualite": {
          "codeQualite": "Membre",
          "libQualite": "Membre",
          "libQualiteSex": "Membre"
        },
        "organes": {
          "organeRef": "PO686415"
        }
      },
      {
        "@xmlns:xsi": "http://www.w3.org/2001/XMLSchema-instance",
        "uid": "PM688453",
        "acteurRef": "PA2690",
        "legislature": "14",
        "typeOrgane": "GE",
        "dateDebut": "2013-01-22T01:00:00.000+01:00",
        "datePublication": null,
        "dateFin": "2016-08-17T02:00:00.000+02:00",
        "preseance": "20",
        "nominPrincipale": "1",
        "infosQualite": {
          "codeQualite": "Membre",
          "libQualite": "Membre",
          "libQualiteSex": "Membre"
        },
        "organes": {
          "organeRef": "PO686793"
        }
      },
      {
        "@xmlns:xsi": "http://www.w3.org/2001/XMLSchema-instance",
        "uid": "PM688498",
        "acteurRef": "PA2690",
        "legislature": "14",
        "typeOrgane": "GE",
        "dateDebut": "2013-01-23T01:00:00.000+01:00",
        "datePublication": null,
        "dateFin": "2016-08-17T02:00:00.000+02:00",
        "preseance": "20",
        "nominPrincipale": "1",
        "infosQualite": {
          "codeQualite": "Membre",
          "libQualite": "Membre",
          "libQualiteSex": "Membre"
        },
        "organes": {
          "organeRef": "PO686785"
        }
      },
      {
        "@xmlns:xsi": "http://www.w3.org/2001/XMLSchema-instance",
        "uid": "PM688584",
        "acteurRef": "PA2690",
        "legislature": "14",
        "typeOrgane": "GE",
        "dateDebut": "2013-01-24T01:00:00.000+01:00",
        "datePublication": null,
        "dateFin": "2016-08-17T02:00:00.000+02:00",
        "preseance": "20",
        "nominPrincipale": "1",
        "infosQualite": {
          "codeQualite": "Membre",
          "libQualite": "Membre",
          "libQualiteSex": "Membre"
        },
        "organes": {
          "organeRef": "PO686258"
        }
      },
      {
        "@xmlns:xsi": "http://www.w3.org/2001/XMLSchema-instance",
        "uid": "PM689814",
        "acteurRef": "PA2690",
        "legislature": "14",
        "typeOrgane": "GE",
        "dateDebut": "2013-02-13T01:00:00.000+01:00",
        "datePublication": null,
        "dateFin": "2016-08-17T02:00:00.000+02:00",
        "preseance": "8",
        "nominPrincipale": "1",
        "infosQualite": {
          "codeQualite": "Vice-Président",
          "libQualite": "Vice-Président",
          "libQualiteSex": "Vice-Président"
        },
        "organes": {
          "organeRef": "PO686617"
        }
      },
      {
        "@xmlns:xsi": "http://www.w3.org/2001/XMLSchema-instance",
        "uid": "PM690001",
        "acteurRef": "PA2690",
        "legislature": "14",
        "typeOrgane": "GE",
        "dateDebut": "2013-01-29T01:00:00.000+01:00",
        "datePublication": null,
        "dateFin": "2016-08-17T02:00:00.000+02:00",
        "preseance": "8",
        "nominPrincipale": "1",
        "infosQualite": {
          "codeQualite": "Vice-Président",
          "libQualite": "Vice-Président",
          "libQualiteSex": "Vice-Président"
        },
        "organes": {
          "organeRef": "PO686415"
        }
      },
      {
        "@xmlns:xsi": "http://www.w3.org/2001/XMLSchema-instance",
        "uid": "PM690079",
        "acteurRef": "PA2690",
        "legislature": "14",
        "typeOrgane": "GE",
        "dateDebut": "2013-02-03T01:00:00.000+01:00",
        "datePublication": null,
        "dateFin": "2016-08-17T02:00:00.000+02:00",
        "preseance": "8",
        "nominPrincipale": "1",
        "infosQualite": {
          "codeQualite": "Vice-Président",
          "libQualite": "Vice-Président",
          "libQualiteSex": "Vice-Président"
        },
        "organes": {
          "organeRef": "PO686258"
        }
      },
      {
        "@xmlns:xsi": "http://www.w3.org/2001/XMLSchema-instance",
        "uid": "PM690279",
        "acteurRef": "PA2690",
        "legislature": "14",
        "typeOrgane": "GE",
        "dateDebut": "2013-02-04T01:00:00.000+01:00",
        "datePublication": null,
        "dateFin": "2016-08-17T02:00:00.000+02:00",
        "preseance": "20",
        "nominPrincipale": "1",
        "infosQualite": {
          "codeQualite": "Membre",
          "libQualite": "Membre",
          "libQualiteSex": "Membre"
        },
        "organes": {
          "organeRef": "PO686188"
        }
      },
      {
        "@xmlns:xsi": "http://www.w3.org/2001/XMLSchema-instance",
        "uid": "PM690280",
        "acteurRef": "PA2690",
        "legislature": "14",
        "typeOrgane": "GE",
        "dateDebut": "2013-02-01T01:00:00.000+01:00",
        "datePublication": null,
        "dateFin": "2016-08-17T02:00:00.000+02:00",
        "preseance": "20",
        "nominPrincipale": "1",
        "infosQualite": {
          "codeQualite": "Membre",
          "libQualite": "Membre",
          "libQualiteSex": "Membre"
        },
        "organes": {
          "organeRef": "PO686605"
        }
      },
      {
        "@xmlns:xsi": "http://www.w3.org/2001/XMLSchema-instance",
        "uid": "PM690281",
        "acteurRef": "PA2690",
        "legislature": "14",
        "typeOrgane": "GE",
        "dateDebut": "2013-02-05T01:00:00.000+01:00",
        "datePublication": null,
        "dateFin": "2016-08-17T02:00:00.000+02:00",
        "preseance": "20",
        "nominPrincipale": "1",
        "infosQualite": {
          "codeQualite": "Membre",
          "libQualite": "Membre",
          "libQualiteSex": "Membre"
        },
        "organes": {
          "organeRef": "PO687613"
        }
      },
      {
        "@xmlns:xsi": "http://www.w3.org/2001/XMLSchema-instance",
        "uid": "PM690319",
        "acteurRef": "PA2690",
        "legislature": "14",
        "typeOrgane": "GA",
        "dateDebut": "2012-12-04T01:00:00.000+01:00",
        "datePublication": null,
        "dateFin": "2016-08-17T02:00:00.000+02:00",
        "preseance": "8",
        "nominPrincipale": "1",
        "infosQualite": {
          "codeQualite": "Vice-Président",
          "libQualite": "Vice-Président",
          "libQualiteSex": "Vice-Président"
        },
        "organes": {
          "organeRef": "PO675840"
        }
      },
      {
        "@xmlns:xsi": "http://www.w3.org/2001/XMLSchema-instance",
        "uid": "PM690329",
        "acteurRef": "PA2690",
        "legislature": "14",
        "typeOrgane": "GE",
        "dateDebut": "2013-01-29T01:00:00.000+01:00",
        "datePublication": null,
        "dateFin": "2016-08-17T02:00:00.000+02:00",
        "preseance": "20",
        "nominPrincipale": "1",
        "infosQualite": {
          "codeQualite": "Membre",
          "libQualite": "Membre",
          "libQualiteSex": "Membre"
        },
        "organes": {
          "organeRef": "PO686519"
        }
      },
      {
        "@xmlns:xsi": "http://www.w3.org/2001/XMLSchema-instance",
        "uid": "PM690335",
        "acteurRef": "PA2690",
        "legislature": "14",
        "typeOrgane": "GE",
        "dateDebut": "2013-02-05T01:00:00.000+01:00",
        "datePublication": null,
        "dateFin": "2016-08-17T02:00:00.000+02:00",
        "preseance": "20",
        "nominPrincipale": "1",
        "infosQualite": {
          "codeQualite": "Membre",
          "libQualite": "Membre",
          "libQualiteSex": "Membre"
        },
        "organes": {
          "organeRef": "PO686510"
        }
      },
      {
        "uid": "PM690349",
        "acteurRef": "PA2690",
        "legislature": "14",
        "typeOrgane": "COMPER",
        "dateDebut": "2013-02-06T01:00:00.000+01:00",
        "datePublication": "2013-02-06T01:00:00.000+01:00",
        "dateFin": "2013-02-06T01:00:00.000+01:00",
        "preseance": "32",
        "nominPrincipale": "1",
        "infosQualite": {
          "codeQualite": "Membre",
          "libQualite": "Membre",
          "libQualiteSex": "Membre"
        },
        "organes": {
          "organeRef": "PO59051"
        }
      },
      {
        "@xmlns:xsi": "http://www.w3.org/2001/XMLSchema-instance",
        "uid": "PM690509",
        "acteurRef": "PA2690",
        "legislature": "14",
        "typeOrgane": "GE",
        "dateDebut": "2013-02-06T01:00:00.000+01:00",
        "datePublication": null,
        "dateFin": "2016-08-17T02:00:00.000+02:00",
        "preseance": "8",
        "nominPrincipale": "1",
        "infosQualite": {
          "codeQualite": "Vice-Président",
          "libQualite": "Vice-Président",
          "libQualiteSex": "Vice-Président"
        },
        "organes": {
          "organeRef": "PO686802"
        }
      },
      {
        "uid": "PM690580",
        "acteurRef": "PA2690",
        "legislature": "14",
        "typeOrgane": "COMPER",
        "dateDebut": "2013-02-07T01:00:00.000+01:00",
        "datePublication": "2013-02-07T01:00:00.000+01:00",
        "dateFin": "2013-03-19T01:00:00.000+01:00",
        "preseance": "32",
        "nominPrincipale": "1",
        "infosQualite": {
          "codeQualite": "Membre",
          "libQualite": "Membre",
          "libQualiteSex": "Membre"
        },
        "organes": {
          "organeRef": "PO419610"
        }
      },
      {
        "@xmlns:xsi": "http://www.w3.org/2001/XMLSchema-instance",
        "uid": "PM690591",
        "acteurRef": "PA2690",
        "legislature": "14",
        "typeOrgane": "GE",
        "dateDebut": "2013-02-06T01:00:00.000+01:00",
        "datePublication": null,
        "dateFin": "2016-08-17T02:00:00.000+02:00",
        "preseance": "8",
        "nominPrincipale": "1",
        "infosQualite": {
          "codeQualite": "Vice-Président",
          "libQualite": "Vice-Président",
          "libQualiteSex": "Vice-Président"
        },
        "organes": {
          "organeRef": "PO686605"
        }
      },
      {
        "@xmlns:xsi": "http://www.w3.org/2001/XMLSchema-instance",
        "uid": "PM690716",
        "acteurRef": "PA2690",
        "legislature": "14",
        "typeOrgane": "GE",
        "dateDebut": "2013-02-06T01:00:00.000+01:00",
        "datePublication": null,
        "dateFin": "2016-08-17T02:00:00.000+02:00",
        "preseance": "20",
        "nominPrincipale": "1",
        "infosQualite": {
          "codeQualite": "Membre",
          "libQualite": "Membre",
          "libQualiteSex": "Membre"
        },
        "organes": {
          "organeRef": "PO686346"
        }
      },
      {
        "@xmlns:xsi": "http://www.w3.org/2001/XMLSchema-instance",
        "uid": "PM690958",
        "acteurRef": "PA2690",
        "legislature": "14",
        "typeOrgane": "GE",
        "dateDebut": "2013-02-08T01:00:00.000+01:00",
        "datePublication": null,
        "dateFin": "2016-08-17T02:00:00.000+02:00",
        "preseance": "20",
        "nominPrincipale": "1",
        "infosQualite": {
          "codeQualite": "Membre",
          "libQualite": "Membre",
          "libQualiteSex": "Membre"
        },
        "organes": {
          "organeRef": "PO686776"
        }
      },
      {
        "@xmlns:xsi": "http://www.w3.org/2001/XMLSchema-instance",
        "uid": "PM691105",
        "acteurRef": "PA2690",
        "legislature": "14",
        "typeOrgane": "GE",
        "dateDebut": "2013-02-12T01:00:00.000+01:00",
        "datePublication": null,
        "dateFin": "2016-08-17T02:00:00.000+02:00",
        "preseance": "8",
        "nominPrincipale": "1",
        "infosQualite": {
          "codeQualite": "Vice-Président",
          "libQualite": "Vice-Président",
          "libQualiteSex": "Vice-Président"
        },
        "organes": {
          "organeRef": "PO686346"
        }
      },
      {
        "@xmlns:xsi": "http://www.w3.org/2001/XMLSchema-instance",
        "uid": "PM691144",
        "acteurRef": "PA2690",
        "legislature": "14",
        "typeOrgane": "GE",
        "dateDebut": "2013-01-23T01:00:00.000+01:00",
        "datePublication": null,
        "dateFin": "2016-08-17T02:00:00.000+02:00",
        "preseance": "20",
        "nominPrincipale": "1",
        "infosQualite": {
          "codeQualite": "Membre",
          "libQualite": "Membre",
          "libQualiteSex": "Membre"
        },
        "organes": {
          "organeRef": "PO687109"
        }
      },
      {
        "@xmlns:xsi": "http://www.w3.org/2001/XMLSchema-instance",
        "uid": "PM691412",
        "acteurRef": "PA2690",
        "legislature": "14",
        "typeOrgane": "GE",
        "dateDebut": "2013-02-12T01:00:00.000+01:00",
        "datePublication": null,
        "dateFin": "2016-08-17T02:00:00.000+02:00",
        "preseance": "20",
        "nominPrincipale": "1",
        "infosQualite": {
          "codeQualite": "Membre",
          "libQualite": "Membre",
          "libQualiteSex": "Membre"
        },
        "organes": {
          "organeRef": "PO687120"
        }
      },
      {
        "@xmlns:xsi": "http://www.w3.org/2001/XMLSchema-instance",
        "uid": "PM691449",
        "acteurRef": "PA2690",
        "legislature": "14",
        "typeOrgane": "GE",
        "dateDebut": "2013-02-15T01:00:00.000+01:00",
        "datePublication": null,
        "dateFin": "2016-08-17T02:00:00.000+02:00",
        "preseance": "8",
        "nominPrincipale": "1",
        "infosQualite": {
          "codeQualite": "Vice-Président",
          "libQualite": "Vice-Président",
          "libQualiteSex": "Vice-Président"
        },
        "organes": {
          "organeRef": "PO686785"
        }
      },
      {
        "@xmlns:xsi": "http://www.w3.org/2001/XMLSchema-instance",
        "uid": "PM691636",
        "acteurRef": "PA2690",
        "legislature": "14",
        "typeOrgane": "GE",
        "dateDebut": "2013-02-19T01:00:00.000+01:00",
        "datePublication": null,
        "dateFin": "2016-08-17T02:00:00.000+02:00",
        "preseance": "8",
        "nominPrincipale": "1",
        "infosQualite": {
          "codeQualite": "Vice-Président",
          "libQualite": "Vice-Président",
          "libQualiteSex": "Vice-Président"
        },
        "organes": {
          "organeRef": "PO687613"
        }
      },
      {
        "@xmlns:xsi": "http://www.w3.org/2001/XMLSchema-instance",
        "uid": "PM691693",
        "acteurRef": "PA2690",
        "legislature": "14",
        "typeOrgane": "GE",
        "dateDebut": "2013-02-20T01:00:00.000+01:00",
        "datePublication": null,
        "dateFin": "2016-08-17T02:00:00.000+02:00",
        "preseance": "8",
        "nominPrincipale": "1",
        "infosQualite": {
          "codeQualite": "Vice-Président",
          "libQualite": "Vice-Président",
          "libQualiteSex": "Vice-Président"
        },
        "organes": {
          "organeRef": "PO686776"
        }
      },
      {
        "@xmlns:xsi": "http://www.w3.org/2001/XMLSchema-instance",
        "uid": "PM691728",
        "acteurRef": "PA2690",
        "legislature": "14",
        "typeOrgane": "GE",
        "dateDebut": "2013-01-20T01:00:00.000+01:00",
        "datePublication": null,
        "dateFin": "2016-08-17T02:00:00.000+02:00",
        "preseance": "20",
        "nominPrincipale": "1",
        "infosQualite": {
          "codeQualite": "Membre",
          "libQualite": "Membre",
          "libQualiteSex": "Membre"
        },
        "organes": {
          "organeRef": "PO686284"
        }
      },
      {
        "@xmlns:xsi": "http://www.w3.org/2001/XMLSchema-instance",
        "uid": "PM691729",
        "acteurRef": "PA2690",
        "legislature": "14",
        "typeOrgane": "GE",
        "dateDebut": "2013-02-20T01:00:00.000+01:00",
        "datePublication": null,
        "dateFin": "2016-08-17T02:00:00.000+02:00",
        "preseance": "8",
        "nominPrincipale": "1",
        "infosQualite": {
          "codeQualite": "Vice-Président",
          "libQualite": "Vice-Président",
          "libQualiteSex": "Vice-Président"
        },
        "organes": {
          "organeRef": "PO686284"
        }
      },
      {
        "@xmlns:xsi": "http://www.w3.org/2001/XMLSchema-instance",
        "uid": "PM692157",
        "acteurRef": "PA2690",
        "legislature": "14",
        "typeOrgane": "GE",
        "dateDebut": "2013-02-27T01:00:00.000+01:00",
        "datePublication": null,
        "dateFin": "2016-08-17T02:00:00.000+02:00",
        "preseance": "8",
        "nominPrincipale": "1",
        "infosQualite": {
          "codeQualite": "Vice-Président",
          "libQualite": "Vice-Président",
          "libQualiteSex": "Vice-Président"
        },
        "organes": {
          "organeRef": "PO686510"
        }
      },
      {
        "@xmlns:xsi": "http://www.w3.org/2001/XMLSchema-instance",
        "uid": "PM692571",
        "acteurRef": "PA2690",
        "legislature": "14",
        "typeOrgane": "GE",
        "dateDebut": "2013-02-19T01:00:00.000+01:00",
        "datePublication": null,
        "dateFin": "2016-08-17T02:00:00.000+02:00",
        "preseance": "20",
        "nominPrincipale": "1",
        "infosQualite": {
          "codeQualite": "Membre",
          "libQualite": "Membre",
          "libQualiteSex": "Membre"
        },
        "organes": {
          "organeRef": "PO686767"
        }
      },
      {
        "uid": "PM692823",
        "acteurRef": "PA2690",
        "legislature": "14",
        "typeOrgane": "COMPER",
        "dateDebut": "2013-03-20T01:00:00.000+01:00",
        "datePublication": "2013-03-20T01:00:00.000+01:00",
        "dateFin": "2013-03-20T01:00:00.000+01:00",
        "preseance": "32",
        "nominPrincipale": "1",
        "infosQualite": {
          "codeQualite": "Membre",
          "libQualite": "Membre",
          "libQualiteSex": "Membre"
        },
        "organes": {
          "organeRef": "PO59051"
        }
      },
      {
        "uid": "PM692842",
        "acteurRef": "PA2690",
        "legislature": "14",
        "typeOrgane": "COMPER",
        "dateDebut": "2013-03-21T01:00:00.000+01:00",
        "datePublication": "2013-03-21T01:00:00.000+01:00",
        "dateFin": "2013-05-14T02:00:00.000+02:00",
        "preseance": "32",
        "nominPrincipale": "1",
        "infosQualite": {
          "codeQualite": "Membre",
          "libQualite": "Membre",
          "libQualiteSex": "Membre"
        },
        "organes": {
          "organeRef": "PO419610"
        }
      },
      {
        "@xmlns:xsi": "http://www.w3.org/2001/XMLSchema-instance",
        "uid": "PM692990",
        "acteurRef": "PA2690",
        "legislature": "14",
        "typeOrgane": "GE",
        "dateDebut": "2013-03-26T01:00:00.000+01:00",
        "datePublication": null,
        "dateFin": "2016-08-17T02:00:00.000+02:00",
        "preseance": "8",
        "nominPrincipale": "1",
        "infosQualite": {
          "codeQualite": "Vice-Président",
          "libQualite": "Vice-Président",
          "libQualiteSex": "Vice-Président"
        },
        "organes": {
          "organeRef": "PO689030"
        }
      },
      {
        "uid": "PM693167",
        "acteurRef": "PA2690",
        "legislature": "14",
        "typeOrgane": "CMP",
        "dateDebut": "2013-04-02T02:00:00.000+02:00",
        "datePublication": "2013-04-03T02:00:00.000+02:00",
        "dateFin": "2013-04-17T02:00:00.000+02:00",
        "preseance": "28",
        "nominPrincipale": "1",
        "infosQualite": {
          "codeQualite": "Suppléant",
          "libQualite": "Membre suppléant",
          "libQualiteSex": "Membre suppléant"
        },
        "organes": {
          "organeRef": "PO693149"
        }
      },
      {
        "uid": "PM693195",
        "acteurRef": "PA2690",
        "legislature": "14",
        "typeOrgane": "CMP",
        "dateDebut": "2013-04-02T02:00:00.000+02:00",
        "datePublication": "2013-04-03T02:00:00.000+02:00",
        "dateFin": "2013-04-14T02:00:00.000+02:00",
        "preseance": "28",
        "nominPrincipale": "1",
        "infosQualite": {
          "codeQualite": "Suppléant",
          "libQualite": "Membre suppléant",
          "libQualiteSex": "Membre suppléant"
        },
        "organes": {
          "organeRef": "PO693143"
        }
      },
      {
        "@xmlns:xsi": "http://www.w3.org/2001/XMLSchema-instance",
        "uid": "PM693411",
        "acteurRef": "PA2690",
        "legislature": "14",
        "typeOrgane": "GE",
        "dateDebut": "2013-04-09T02:00:00.000+02:00",
        "datePublication": null,
        "dateFin": "2016-08-17T02:00:00.000+02:00",
        "preseance": "20",
        "nominPrincipale": "0",
        "infosQualite": {
          "codeQualite": "Membre",
          "libQualite": "Membre",
          "libQualiteSex": "Membre"
        },
        "organes": {
          "organeRef": "PO689000"
        }
      },
      {
        "@xmlns:xsi": "http://www.w3.org/2001/XMLSchema-instance",
        "uid": "PM693519",
        "acteurRef": "PA2690",
        "legislature": "14",
        "typeOrgane": "GE",
        "dateDebut": "2013-01-21T01:00:00.000+01:00",
        "datePublication": null,
        "dateFin": "2016-08-17T02:00:00.000+02:00",
        "preseance": "20",
        "nominPrincipale": "1",
        "infosQualite": {
          "codeQualite": "Membre",
          "libQualite": "Membre",
          "libQualiteSex": "Membre"
        },
        "organes": {
          "organeRef": "PO686213"
        }
      },
      {
        "@xmlns:xsi": "http://www.w3.org/2001/XMLSchema-instance",
        "uid": "PM693526",
        "acteurRef": "PA2690",
        "legislature": "14",
        "typeOrgane": "GE",
        "dateDebut": "2013-04-09T02:00:00.000+02:00",
        "datePublication": null,
        "dateFin": "2016-08-17T02:00:00.000+02:00",
        "preseance": "8",
        "nominPrincipale": "1",
        "infosQualite": {
          "codeQualite": "Vice-Président",
          "libQualite": "Vice-Président",
          "libQualiteSex": "Vice-Président"
        },
        "organes": {
          "organeRef": "PO689000"
        }
      },
      {
        "@xmlns:xsi": "http://www.w3.org/2001/XMLSchema-instance",
        "uid": "PM693598",
        "acteurRef": "PA2690",
        "legislature": "14",
        "typeOrgane": "GE",
        "dateDebut": "2013-04-03T02:00:00.000+02:00",
        "datePublication": null,
        "dateFin": "2016-08-17T02:00:00.000+02:00",
        "preseance": "8",
        "nominPrincipale": "1",
        "infosQualite": {
          "codeQualite": "Vice-Président",
          "libQualite": "Vice-Président",
          "libQualiteSex": "Vice-Président"
        },
        "organes": {
          "organeRef": "PO687120"
        }
      },
      {
        "@xmlns:xsi": "http://www.w3.org/2001/XMLSchema-instance",
        "uid": "PM693815",
        "acteurRef": "PA2690",
        "legislature": "14",
        "typeOrgane": "GE",
        "dateDebut": "2013-04-16T02:00:00.000+02:00",
        "datePublication": null,
        "dateFin": "2016-08-17T02:00:00.000+02:00",
        "preseance": "20",
        "nominPrincipale": "1",
        "infosQualite": {
          "codeQualite": "Membre",
          "libQualite": "Membre",
          "libQualiteSex": "Membre"
        },
        "organes": {
          "organeRef": "PO689006"
        }
      },
      {
        "@xmlns:xsi": "http://www.w3.org/2001/XMLSchema-instance",
        "uid": "PM694337",
        "acteurRef": "PA2690",
        "legislature": "14",
        "typeOrgane": "GE",
        "dateDebut": "2013-06-04T02:00:00.000+02:00",
        "datePublication": null,
        "dateFin": "2016-08-17T02:00:00.000+02:00",
        "preseance": "8",
        "nominPrincipale": "1",
        "infosQualite": {
          "codeQualite": "Vice-Président",
          "libQualite": "Vice-Président",
          "libQualiteSex": "Vice-Président"
        },
        "organes": {
          "organeRef": "PO689012"
        }
      },
      {
        "uid": "PM694368",
        "acteurRef": "PA2690",
        "legislature": "14",
        "typeOrgane": "COMPER",
        "dateDebut": "2013-05-15T02:00:00.000+02:00",
        "datePublication": "2013-05-15T02:00:00.000+02:00",
        "dateFin": "2013-05-15T02:00:00.000+02:00",
        "preseance": "32",
        "nominPrincipale": "1",
        "infosQualite": {
          "codeQualite": "Membre",
          "libQualite": "Membre",
          "libQualiteSex": "Membre"
        },
        "organes": {
          "organeRef": "PO419604"
        }
      },
      {
        "uid": "PM694414",
        "acteurRef": "PA2690",
        "legislature": "14",
        "typeOrgane": "COMPER",
        "dateDebut": "2013-05-16T02:00:00.000+02:00",
        "datePublication": "2013-05-16T02:00:00.000+02:00",
        "dateFin": "2013-10-29T01:00:00.000+01:00",
        "preseance": "32",
        "nominPrincipale": "1",
        "infosQualite": {
          "codeQualite": "Membre",
          "libQualite": "Membre",
          "libQualiteSex": "Membre"
        },
        "organes": {
          "organeRef": "PO419610"
        }
      },
      {
        "@xmlns:xsi": "http://www.w3.org/2001/XMLSchema-instance",
        "uid": "PM694636",
        "acteurRef": "PA2690",
        "legislature": "14",
        "typeOrgane": "GE",
        "dateDebut": "2013-05-27T02:00:00.000+02:00",
        "datePublication": null,
        "dateFin": "2016-08-17T02:00:00.000+02:00",
        "preseance": "20",
        "nominPrincipale": "1",
        "infosQualite": {
          "codeQualite": "Membre",
          "libQualite": "Membre",
          "libQualiteSex": "Membre"
        },
        "organes": {
          "organeRef": "PO688348"
        }
      },
      {
        "@xmlns:xsi": "http://www.w3.org/2001/XMLSchema-instance",
        "uid": "PM695028",
        "acteurRef": "PA2690",
        "legislature": "14",
        "typeOrgane": "GE",
        "dateDebut": "2013-06-04T02:00:00.000+02:00",
        "datePublication": null,
        "dateFin": "2016-08-17T02:00:00.000+02:00",
        "preseance": "20",
        "nominPrincipale": "0",
        "infosQualite": {
          "codeQualite": "Membre",
          "libQualite": "Membre",
          "libQualiteSex": "Membre"
        },
        "organes": {
          "organeRef": "PO689012"
        }
      },
      {
        "@xmlns:xsi": "http://www.w3.org/2001/XMLSchema-instance",
        "uid": "PM695192",
        "acteurRef": "PA2690",
        "legislature": "14",
        "typeOrgane": "GE",
        "dateDebut": "2012-12-18T01:00:00.000+01:00",
        "datePublication": null,
        "dateFin": "2016-08-17T02:00:00.000+02:00",
        "preseance": "20",
        "nominPrincipale": "1",
        "infosQualite": {
          "codeQualite": "Membre",
          "libQualite": "Membre",
          "libQualiteSex": "Membre"
        },
        "organes": {
          "organeRef": "PO686266"
        }
      },
      {
        "@xmlns:xsi": "http://www.w3.org/2001/XMLSchema-instance",
        "uid": "PM696718",
        "acteurRef": "PA2690",
        "legislature": "14",
        "typeOrgane": "GE",
        "dateDebut": "2013-09-03T02:00:00.000+02:00",
        "datePublication": null,
        "dateFin": "2016-08-17T02:00:00.000+02:00",
        "preseance": "20",
        "nominPrincipale": "1",
        "infosQualite": {
          "codeQualite": "Membre",
          "libQualite": "Membre",
          "libQualiteSex": "Membre"
        },
        "organes": {
          "organeRef": "PO694572"
        }
      },
      {
        "@xmlns:xsi": "http://www.w3.org/2001/XMLSchema-instance",
        "uid": "PM697321",
        "acteurRef": "PA2690",
        "legislature": "14",
        "typeOrgane": "GE",
        "dateDebut": "2013-10-02T02:00:00.000+02:00",
        "datePublication": null,
        "dateFin": "2016-08-17T02:00:00.000+02:00",
        "preseance": "20",
        "nominPrincipale": "1",
        "infosQualite": {
          "codeQualite": "Membre",
          "libQualite": "Membre",
          "libQualiteSex": "Membre"
        },
        "organes": {
          "organeRef": "PO695581"
        }
      },
      {
        "@xmlns:xsi": "http://www.w3.org/2001/XMLSchema-instance",
        "uid": "PM697633",
        "acteurRef": "PA2690",
        "legislature": "14",
        "typeOrgane": "GE",
        "dateDebut": "2013-10-08T02:00:00.000+02:00",
        "datePublication": null,
        "dateFin": "2016-08-17T02:00:00.000+02:00",
        "preseance": "8",
        "nominPrincipale": "1",
        "infosQualite": {
          "codeQualite": "Vice-Président",
          "libQualite": "Vice-Président",
          "libQualiteSex": "Vice-Président"
        },
        "organes": {
          "organeRef": "PO694572"
        }
      },
      {
        "uid": "PM698150",
        "acteurRef": "PA2690",
        "legislature": "14",
        "typeOrgane": "COMPER",
        "dateDebut": "2013-10-30T01:00:00.000+01:00",
        "datePublication": "2013-10-30T01:00:00.000+01:00",
        "dateFin": "2013-11-04T01:00:00.000+01:00",
        "preseance": "32",
        "nominPrincipale": "1",
        "infosQualite": {
          "codeQualite": "Membre",
          "libQualite": "Membre",
          "libQualiteSex": "Membre"
        },
        "organes": {
          "organeRef": "PO59051"
        }
      },
      {
        "uid": "PM698216",
        "acteurRef": "PA2690",
        "legislature": "14",
        "typeOrgane": "COMPER",
        "dateDebut": "2013-11-05T01:00:00.000+01:00",
        "datePublication": "2013-11-05T01:00:00.000+01:00",
        "dateFin": "2013-11-13T01:00:00.000+01:00",
        "preseance": "32",
        "nominPrincipale": "1",
        "infosQualite": {
          "codeQualite": "Membre",
          "libQualite": "Membre",
          "libQualiteSex": "Membre"
        },
        "organes": {
          "organeRef": "PO419610"
        }
      },
      {
        "uid": "PM698379",
        "acteurRef": "PA2690",
        "legislature": "14",
        "typeOrgane": "COMPER",
        "dateDebut": "2013-11-14T01:00:00.000+01:00",
        "datePublication": "2013-11-14T01:00:00.000+01:00",
        "dateFin": "2013-11-14T01:00:00.000+01:00",
        "preseance": "32",
        "nominPrincipale": "1",
        "infosQualite": {
          "codeQualite": "Membre",
          "libQualite": "Membre",
          "libQualiteSex": "Membre"
        },
        "organes": {
          "organeRef": "PO420120"
        }
      },
      {
        "uid": "PM698517",
        "acteurRef": "PA2690",
        "legislature": "14",
        "typeOrgane": "COMPER",
        "dateDebut": "2013-11-15T01:00:00.000+01:00",
        "datePublication": "2013-11-15T01:00:00.000+01:00",
        "dateFin": "2013-11-18T01:00:00.000+01:00",
        "preseance": "32",
        "nominPrincipale": "1",
        "infosQualite": {
          "codeQualite": "Membre",
          "libQualite": "Membre",
          "libQualiteSex": "Membre"
        },
        "organes": {
          "organeRef": "PO419610"
        }
      },
      {
        "uid": "PM698596",
        "acteurRef": "PA2690",
        "legislature": "14",
        "typeOrgane": "COMPER",
        "dateDebut": "2013-11-19T01:00:00.000+01:00",
        "datePublication": "2013-11-19T01:00:00.000+01:00",
        "dateFin": "2013-11-20T01:00:00.000+01:00",
        "preseance": "32",
        "nominPrincipale": "1",
        "infosQualite": {
          "codeQualite": "Membre",
          "libQualite": "Membre",
          "libQualiteSex": "Membre"
        },
        "organes": {
          "organeRef": "PO59051"
        }
      },
      {
        "uid": "PM698618",
        "acteurRef": "PA2690",
        "legislature": "14",
        "typeOrgane": "COMPER",
        "dateDebut": "2013-11-21T01:00:00.000+01:00",
        "datePublication": "2013-11-21T01:00:00.000+01:00",
        "dateFin": "2013-11-27T01:00:00.000+01:00",
        "preseance": "32",
        "nominPrincipale": "1",
        "infosQualite": {
          "codeQualite": "Membre",
          "libQualite": "Membre",
          "libQualiteSex": "Membre"
        },
        "organes": {
          "organeRef": "PO419610"
        }
      },
      {
        "uid": "PM698776",
        "acteurRef": "PA2690",
        "legislature": "14",
        "typeOrgane": "COMPER",
        "dateDebut": "2013-11-28T01:00:00.000+01:00",
        "datePublication": "2013-11-28T01:00:00.000+01:00",
        "dateFin": "2013-11-29T01:00:00.000+01:00",
        "preseance": "32",
        "nominPrincipale": "1",
        "infosQualite": {
          "codeQualite": "Membre",
          "libQualite": "Membre",
          "libQualiteSex": "Membre"
        },
        "organes": {
          "organeRef": "PO59051"
        }
      },
      {
        "uid": "PM698802",
        "acteurRef": "PA2690",
        "legislature": "14",
        "typeOrgane": "COMPER",
        "dateDebut": "2013-11-29T01:00:00.000+01:00",
        "datePublication": "2013-11-30T01:00:00.000+01:00",
        "dateFin": "2016-08-17T02:00:00.000+02:00",
        "preseance": "32",
        "nominPrincipale": "1",
        "infosQualite": {
          "codeQualite": "Membre",
          "libQualite": "Membre",
          "libQualiteSex": "Membre"
        },
        "organes": {
          "organeRef": "PO419610"
        }
      },
      {
        "@xmlns:xsi": "http://www.w3.org/2001/XMLSchema-instance",
        "uid": "PM703141",
        "acteurRef": "PA2690",
        "legislature": "14",
        "typeOrgane": "GE",
        "dateDebut": "2014-09-09T02:00:00.000+02:00",
        "datePublication": null,
        "dateFin": "2016-08-17T02:00:00.000+02:00",
        "preseance": "20",
        "nominPrincipale": "1",
        "infosQualite": {
          "codeQualite": "Membre",
          "libQualite": "Membre",
          "libQualiteSex": "Membre"
        },
        "organes": {
          "organeRef": "PO702209"
        }
      },
      {
        "@xmlns:xsi": "http://www.w3.org/2001/XMLSchema-instance",
        "uid": "PM704541",
        "acteurRef": "PA2690",
        "legislature": "14",
        "typeOrgane": "MISINFOPRE",
        "dateDebut": "2014-11-06T01:00:00.000+01:00",
        "datePublication": "2014-11-07T01:00:00.000+01:00",
        "dateFin": "2016-08-17T02:00:00.000+02:00",
        "preseance": "20",
        "nominPrincipale": "1",
        "infosQualite": {
          "codeQualite": "Membre",
          "libQualite": "Membre",
          "libQualiteSex": "Membre"
        },
        "organes": {
          "organeRef": "PO703871"
        },
        "libelle": null,
        "missionSuivanteRef": null,
        "missionPrecedenteRef": null
      },
      {
        "@xmlns:xsi": "http://www.w3.org/2001/XMLSchema-instance",
        "uid": "PM707442",
        "acteurRef": "PA2690",
        "legislature": "14",
        "typeOrgane": "MISINFO",
        "dateDebut": "2014-11-18T01:00:00.000+01:00",
        "datePublication": null,
        "dateFin": "2015-10-14T02:00:00.000+02:00",
        "preseance": "10",
        "nominPrincipale": "1",
        "infosQualite": {
          "codeQualite": "Membre",
          "libQualite": "Membre",
          "libQualiteSex": "Membre"
        },
        "organes": {
          "organeRef": "PO707431"
        },
        "libelle": null,
        "missionSuivanteRef": null,
        "missionPrecedenteRef": null
      },
      {
        "@xmlns:xsi": "http://www.w3.org/2001/XMLSchema-instance",
        "uid": "PM712373",
        "acteurRef": "PA2690",
        "legislature": "14",
        "typeOrgane": "GE",
        "dateDebut": "2016-04-13T02:00:00.000+02:00",
        "datePublication": null,
        "dateFin": "2016-08-17T02:00:00.000+02:00",
        "preseance": "20",
        "nominPrincipale": "1",
        "infosQualite": {
          "codeQualite": "Membre",
          "libQualite": "Membre",
          "libQualiteSex": "Membre"
        },
        "organes": {
          "organeRef": "PO712100"
        }
      },
      {
        "@xmlns:xsi": "http://www.w3.org/2001/XMLSchema-instance",
        "uid": "PM713039",
        "acteurRef": "PA2690",
        "legislature": "14",
        "typeOrgane": "GE",
        "dateDebut": "2016-05-19T02:00:00.000+02:00",
        "datePublication": null,
        "dateFin": "2016-08-17T02:00:00.000+02:00",
        "preseance": "20",
        "nominPrincipale": "1",
        "infosQualite": {
          "codeQualite": "Membre",
          "libQualite": "Membre",
          "libQualiteSex": "Membre"
        },
        "organes": {
          "organeRef": "PO711617"
        }
      },
      {
        "@xmlns:xsi": "http://www.w3.org/2001/XMLSchema-instance",
        "uid": "PM15429229",
        "acteurRef": "PA2690",
        "legislature": null,
        "typeOrgane": "GOUVERNEMENT",
        "dateDebut": "2011-06-29T02:00:00.000+02:00",
        "datePublication": "2011-06-30T02:00:00.000+02:00",
        "dateFin": "2012-05-10T02:00:00.000+02:00",
        "preseance": "50",
        "nominPrincipale": "1",
        "infosQualite": {
          "codeQualite": "membre",
          "libQualite": "membre",
          "libQualiteSex": "membre"
        },
        "organes": {
          "organeRef": "PO425695"
        }
      }
    ]
  },
  "@xmlns:xsi": "http://www.w3.org/2001/XMLSchema-instance"
}