{
  "@xmlns:xsi": "http://www.w3.org/2001/XMLSchema-instance",
  "uid": "PO426365",
  "codeType": "CMP",
  "libelle": "commission mixte paritaire chargée de proposer un texte sur les dispositions restant en discussion de la proposition de loi portant diverses dispositions d'adaptation de la législation au droit communautaire",
  "libelleEdition": "de la proposition de loi portant diverses dispositions d'adaptation de la législation au droit communautaire",
  "libelleAbrege": "Adaptation de la législation",
  "libelleAbrev": "693-09-10",
  "viMoDe": {
    "dateDebut": "2010-12-20T01:00:00.000+01:00",
    "dateAgrement": null,
    "dateFin": "2010-12-23T01:00:00.000+01:00"
  },
  "organeParent": null,
  "chambre": null,
  "regime": "5ème République",
  "legislature": "13",
  "secretariat": {
    "secretaire01": null,
    "secretaire02": null
  }
}