{
  "@xmlns:xsi": "http://www.w3.org/2001/XMLSchema-instance",
  "uid": "PO733317",
  "codeType": "GA",
  "libelle": "France-Mexique",
  "libelleEdition": "de France-Mexique",
  "libelleAbrege": "Mexique",
  "libelleAbrev": "MEX",
  "viMoDe": {
    "dateDebut": null,
    "dateAgrement": "2017-07-19T02:00:00.000+02:00",
    "dateFin": null
  },
  "organeParent": null,
  "chambre": null,
  "regime": "5ème République",
  "legislature": "15",
  "secretariat": {
    "secretaire01": "Mme Nathalie Rabouin-Bouard",
    "secretaire02": null
  },
  "listePays": {
    "paysRef": "GOP756556"
  }
}