{
  "uid": {
    "@xsi:type": "IdActeur_type",
    "#text": "PA720900"
  },
  "etatCivil": {
    "ident": {
      "civ": "Mme",
      "prenom": "Cécile",
      "nom": "Rilhac",
      "alpha": "Rilhac",
      "trigramme": "CRI"
    },
    "infoNaissance": {
      "dateNais": "1974-04-21T01:00:00.000+01:00",
      "villeNais": "paris 15",
      "depNais": "Paris",
      "paysNais": "france"
    },
    "dateDeces": null
  },
  "profession": {
    "libelleCourant": "Profession rattachée à l'enseignement",
    "socProcINSEE": {
      "catSocPro": "Cadres de la fonction publique, professions intellectuelles et  artistiques",
      "famSocPro": "Cadres et professions intellectuelles supérieures"
    }
  },
  "uri_hatvp": "https://www.hatvp.fr/pages_nominatives/rilhac-cecile",
  "adresses": {
    "adresse": [
      {
        "@xsi:type": "AdressePostale_Type",
        "uid": "AD720902",
        "type": "0",
        "typeLibelle": "Adresse officielle",
        "poids": "1",
        "adresseDeRattachement": null,
        "intitule": "Assemblée nationale,",
        "numeroRue": "126",
        "nomRue": "Rue de l'Université,",
        "complementAdresse": null,
        "codePostal": "75355",
        "ville": "Paris 07 SP"
      },
      {
        "@xsi:type": "AdresseMail_Type",
        "uid": "AD728196",
        "type": "15",
        "typeLibelle": "Mèl",
        "poids": null,
        "adresseDeRattachement": null,
        "valElec": "cecile.rilhac@assemblee-nationale.fr"
      },
      {
        "@xsi:type": "AdresseSiteWeb_Type",
        "uid": "AD730723",
        "type": "25",
        "typeLibelle": "Facebook",
        "poids": null,
        "adresseDeRattachement": null,
        "valElec": "profile.php?id=100017133168739"
      },
      {
        "@xsi:type": "AdressePostale_Type",
        "uid": "AD735863",
        "type": "2",
        "typeLibelle": "Adresse publiée de circonscription",
        "poids": "22",
        "adresseDeRattachement": null,
        "intitule": null,
        "numeroRue": "55",
        "nomRue": "Boulevard du Havre",
        "complementAdresse": null,
        "codePostal": "95220",
        "ville": "Herblay"
      },
      {
        "@xsi:type": "AdresseSiteWeb_Type",
        "uid": "AD735866",
        "type": "24",
        "typeLibelle": "Twitter",
        "poids": null,
        "adresseDeRattachement": null,
        "valElec": "@Cecile_Rilhac"
      },
      {
        "@xsi:type": "AdresseTelephonique_Type",
        "uid": "AD757841",
        "type": "11",
        "typeLibelle": "Téléphone",
        "poids": "1",
        "adresseDeRattachement": "AD720902",
        "valElec": "01.40.63.95.10"
      }
    ]
  },
  "mandats": {
    "mandat": [
      {
        "@xmlns:xsi": "http://www.w3.org/2001/XMLSchema-instance",
        "uid": "PM723108",
        "acteurRef": "PA720900",
        "legislature": "15",
        "typeOrgane": "ASSEMBLEE",
        "dateDebut": "2017-06-18T02:00:00.000+02:00",
        "datePublication": null,
        "dateFin": null,
        "preseance": "50",
        "nominPrincipale": "1",
        "infosQualite": {
          "codeQualite": "membre",
          "libQualite": "membre",
          "libQualiteSex": "membre"
        },
        "organes": {
          "organeRef": "PO717460"
        },
        "suppleants": {
          "suppleant": {
            "dateDebut": "2017-06-18T02:00:00.000+02:00",
            "dateFin": null,
            "suppleantRef": "PA720904"
          }
        },
        "chambre": null,
        "election": {
          "lieu": {
            "region": "Ile-de-France",
            "regionType": "Métropolitain",
            "departement": "Val-d'Oise",
            "numDepartement": "95",
            "numCirco": "3"
          },
          "causeMandat": "élections générales",
          "refCirconscription": "PO718476"
        },
        "mandature": {
          "datePriseFonction": "2017-06-21T02:00:00.000+02:00",
          "causeFin": null,
          "premiereElection": "0",
          "placeHemicycle": "344",
          "mandatRemplaceRef": null
        },
        "collaborateurs": {
          "collaborateur": [
            {
              "qualite": "M.",
              "prenom": "Karim",
              "nom": "Boulkhoubz",
              "dateDebut": null,
              "dateFin": null
            },
            {
              "qualite": "M.",
              "prenom": "François",
              "nom": "Bechieau",
              "dateDebut": null,
              "dateFin": null
            },
            {
              "qualite": "M.",
              "prenom": "Nicolas",
              "nom": "Casellato",
              "dateDebut": null,
              "dateFin": null
            }
          ]
        }
      },
      {
        "@xmlns:xsi": "http://www.w3.org/2001/XMLSchema-instance",
        "uid": "PM724595",
        "acteurRef": "PA720900",
        "legislature": "15",
        "typeOrgane": "GP",
        "dateDebut": "2017-06-21T02:00:00.000+02:00",
        "datePublication": null,
        "dateFin": "2017-06-26T02:00:00.000+02:00",
        "preseance": "28",
        "nominPrincipale": "1",
        "infosQualite": {
          "codeQualite": "Député non-inscrit",
          "libQualite": "Député non-inscrit",
          "libQualiteSex": "Députée non-inscrite"
        },
        "organes": {
          "organeRef": "PO723569"
        }
      },
      {
        "@xmlns:xsi": "http://www.w3.org/2001/XMLSchema-instance",
        "uid": "PM731167",
        "acteurRef": "PA720900",
        "legislature": "15",
        "typeOrgane": "GP",
        "dateDebut": "2017-06-27T02:00:00.000+02:00",
        "datePublication": "2017-06-28T02:00:00.000+02:00",
        "dateFin": null,
        "preseance": "20",
        "nominPrincipale": "1",
        "infosQualite": {
          "codeQualite": "Membre",
          "libQualite": "Membre du",
          "libQualiteSex": "Membre du"
        },
        "organes": {
          "organeRef": "PO730964"
        }
      },
      {
        "@xmlns:xsi": "http://www.w3.org/2001/XMLSchema-instance",
        "uid": "PM732192",
        "acteurRef": "PA720900",
        "legislature": "15",
        "typeOrgane": "COMPER",
        "dateDebut": "2017-06-29T02:00:00.000+02:00",
        "datePublication": "2017-06-29T02:00:00.000+02:00",
        "dateFin": null,
        "preseance": "32",
        "nominPrincipale": "1",
        "infosQualite": {
          "codeQualite": "Membre",
          "libQualite": "Membre",
          "libQualiteSex": "Membre"
        },
        "organes": {
          "organeRef": "PO419604"
        }
      },
      {
        "@xmlns:xsi": "http://www.w3.org/2001/XMLSchema-instance",
        "uid": "PM732645",
        "acteurRef": "PA720900",
        "legislature": "15",
        "typeOrgane": "DELEG",
        "dateDebut": "2017-07-12T02:00:00.000+02:00",
        "datePublication": "2017-07-12T02:00:00.000+02:00",
        "dateFin": null,
        "preseance": "20",
        "nominPrincipale": "1",
        "infosQualite": {
          "codeQualite": "Membre",
          "libQualite": "Membre",
          "libQualiteSex": "Membre"
        },
        "organes": {
          "organeRef": "PO675659"
        }
      },
      {
        "@xmlns:xsi": "http://www.w3.org/2001/XMLSchema-instance",
        "uid": "PM737581",
        "acteurRef": "PA720900",
        "legislature": "15",
        "typeOrgane": "GA",
        "dateDebut": "2017-10-05T02:00:00.000+02:00",
        "datePublication": null,
        "dateFin": null,
        "preseance": "20",
        "nominPrincipale": "0",
        "infosQualite": {
          "codeQualite": "Membre",
          "libQualite": "Membre",
          "libQualiteSex": "Membre"
        },
        "organes": {
          "organeRef": "PO733072"
        }
      },
      {
        "@xmlns:xsi": "http://www.w3.org/2001/XMLSchema-instance",
        "uid": "PM737582",
        "acteurRef": "PA720900",
        "legislature": "15",
        "typeOrgane": "GA",
        "dateDebut": "2017-10-05T02:00:00.000+02:00",
        "datePublication": null,
        "dateFin": null,
        "preseance": "20",
        "nominPrincipale": "1",
        "infosQualite": {
          "codeQualite": "Membre",
          "libQualite": "Membre",
          "libQualiteSex": "Membre"
        },
        "organes": {
          "organeRef": "PO733197"
        }
      },
      {
        "@xmlns:xsi": "http://www.w3.org/2001/XMLSchema-instance",
        "uid": "PM737583",
        "acteurRef": "PA720900",
        "legislature": "15",
        "typeOrgane": "GA",
        "dateDebut": "2017-10-05T02:00:00.000+02:00",
        "datePublication": null,
        "dateFin": null,
        "preseance": "20",
        "nominPrincipale": "1",
        "infosQualite": {
          "codeQualite": "Membre",
          "libQualite": "Membre",
          "libQualiteSex": "Membre"
        },
        "organes": {
          "organeRef": "PO733307"
        }
      },
      {
        "@xmlns:xsi": "http://www.w3.org/2001/XMLSchema-instance",
        "uid": "PM737584",
        "acteurRef": "PA720900",
        "legislature": "15",
        "typeOrgane": "GA",
        "dateDebut": "2017-10-05T02:00:00.000+02:00",
        "datePublication": null,
        "dateFin": null,
        "preseance": "20",
        "nominPrincipale": "1",
        "infosQualite": {
          "codeQualite": "Membre",
          "libQualite": "Membre",
          "libQualiteSex": "Membre"
        },
        "organes": {
          "organeRef": "PO733342"
        }
      },
      {
        "@xmlns:xsi": "http://www.w3.org/2001/XMLSchema-instance",
        "uid": "PM737585",
        "acteurRef": "PA720900",
        "legislature": "15",
        "typeOrgane": "GA",
        "dateDebut": "2017-10-05T02:00:00.000+02:00",
        "datePublication": null,
        "dateFin": null,
        "preseance": "20",
        "nominPrincipale": "1",
        "infosQualite": {
          "codeQualite": "Membre",
          "libQualite": "Membre",
          "libQualiteSex": "Membre"
        },
        "organes": {
          "organeRef": "PO733452"
        }
      },
      {
        "@xmlns:xsi": "http://www.w3.org/2001/XMLSchema-instance",
        "uid": "PM737586",
        "acteurRef": "PA720900",
        "legislature": "15",
        "typeOrgane": "GA",
        "dateDebut": "2017-10-05T02:00:00.000+02:00",
        "datePublication": null,
        "dateFin": null,
        "preseance": "20",
        "nominPrincipale": "0",
        "infosQualite": {
          "codeQualite": "Membre",
          "libQualite": "Membre",
          "libQualiteSex": "Membre"
        },
        "organes": {
          "organeRef": "PO733472"
        }
      },
      {
        "@xmlns:xsi": "http://www.w3.org/2001/XMLSchema-instance",
        "uid": "PM740741",
        "acteurRef": "PA720900",
        "legislature": "15",
        "typeOrgane": "ORGEXTPARL",
        "dateDebut": "2017-10-23T02:00:00.000+02:00",
        "datePublication": "2017-10-24T02:00:00.000+02:00",
        "dateFin": null,
        "preseance": "20",
        "nominPrincipale": "1",
        "infosQualite": {
          "codeQualite": "Titulaire",
          "libQualite": "Membre titulaire",
          "libQualiteSex": "Membre titulaire"
        },
        "organes": {
          "organeRef": "PO425985"
        }
      },
      {
        "@xmlns:xsi": "http://www.w3.org/2001/XMLSchema-instance",
        "uid": "PM744007",
        "acteurRef": "PA720900",
        "legislature": "15",
        "typeOrgane": "ORGEXTPARL",
        "dateDebut": "2017-11-08T01:00:00.000+01:00",
        "datePublication": "2017-11-24T01:00:00.000+01:00",
        "dateFin": null,
        "preseance": "20",
        "nominPrincipale": "1",
        "infosQualite": {
          "codeQualite": "Titulaire",
          "libQualite": "Membre titulaire",
          "libQualiteSex": "Membre titulaire"
        },
        "organes": {
          "organeRef": "PO697215"
        }
      },
      {
        "@xmlns:xsi": "http://www.w3.org/2001/XMLSchema-instance",
        "uid": "PM744540",
        "acteurRef": "PA720900",
        "legislature": "15",
        "typeOrgane": "GA",
        "dateDebut": "2017-11-30T01:00:00.000+01:00",
        "datePublication": null,
        "dateFin": null,
        "preseance": "14",
        "nominPrincipale": "1",
        "infosQualite": {
          "codeQualite": "Secrétaire",
          "libQualite": "Secrétaire",
          "libQualiteSex": "Secrétaire"
        },
        "organes": {
          "organeRef": "PO733472"
        }
      },
      {
        "@xmlns:xsi": "http://www.w3.org/2001/XMLSchema-instance",
        "uid": "PM745369",
        "acteurRef": "PA720900",
        "legislature": null,
        "typeOrgane": "PARPOL",
        "dateDebut": "2017-12-01T01:00:00.000+01:00",
        "datePublication": null,
        "dateFin": null,
        "preseance": "5",
        "nominPrincipale": "1",
        "infosQualite": {
          "codeQualite": "Membre",
          "libQualite": "Membre",
          "libQualiteSex": "Membre"
        },
        "organes": {
          "organeRef": "PO744854"
        }
      },
      {
        "@xmlns:xsi": "http://www.w3.org/2001/XMLSchema-instance",
        "uid": "PM746302",
        "acteurRef": "PA720900",
        "legislature": "15",
        "typeOrgane": "GA",
        "dateDebut": "2017-11-08T01:00:00.000+01:00",
        "datePublication": null,
        "dateFin": null,
        "preseance": "8",
        "nominPrincipale": "1",
        "infosQualite": {
          "codeQualite": "Vice-Président",
          "libQualite": "Vice-Président",
          "libQualiteSex": "Vice-Présidente"
        },
        "organes": {
          "organeRef": "PO733072"
        }
      },
      {
        "@xmlns:xsi": "http://www.w3.org/2001/XMLSchema-instance",
        "uid": "PM746724",
        "acteurRef": "PA720900",
        "legislature": "15",
        "typeOrgane": "MISINFO",
        "dateDebut": "2017-12-20T01:00:00.000+01:00",
        "datePublication": null,
        "dateFin": "2018-11-15T01:00:00.000+01:00",
        "preseance": "10",
        "nominPrincipale": "1",
        "infosQualite": {
          "codeQualite": "Membre",
          "libQualite": "Membre",
          "libQualiteSex": "Membre"
        },
        "organes": {
          "organeRef": "PO746694"
        },
        "libelle": null,
        "missionSuivanteRef": null,
        "missionPrecedenteRef": null
      },
      {
        "@xmlns:xsi": "http://www.w3.org/2001/XMLSchema-instance",
        "uid": "PM747581",
        "acteurRef": "PA720900",
        "legislature": "15",
        "typeOrgane": "GA",
        "dateDebut": "2018-01-09T01:00:00.000+01:00",
        "datePublication": null,
        "dateFin": null,
        "preseance": "20",
        "nominPrincipale": "1",
        "infosQualite": {
          "codeQualite": "Membre",
          "libQualite": "Membre",
          "libQualiteSex": "Membre"
        },
        "organes": {
          "organeRef": "PO732939"
        }
      },
      {
        "uid": "PM749363",
        "acteurRef": "PA720900",
        "legislature": "15",
        "typeOrgane": "CMP",
        "dateDebut": "2018-02-12T01:00:00.000+01:00",
        "datePublication": "2018-02-10T01:00:00.000+01:00",
        "dateFin": "2018-02-15T01:00:00.000+01:00",
        "preseance": "28",
        "nominPrincipale": "1",
        "infosQualite": {
          "codeQualite": "Suppléant",
          "libQualite": "Membre suppléant",
          "libQualiteSex": "Membre suppléante"
        },
        "organes": {
          "organeRef": "PO749252"
        }
      },
      {
        "@xmlns:xsi": "http://www.w3.org/2001/XMLSchema-instance",
        "uid": "PM750082",
        "acteurRef": "PA720900",
        "legislature": "15",
        "typeOrgane": "GE",
        "dateDebut": "2018-02-14T01:00:00.000+01:00",
        "datePublication": null,
        "dateFin": null,
        "preseance": "20",
        "nominPrincipale": "1",
        "infosQualite": {
          "codeQualite": "Membre",
          "libQualite": "Membre",
          "libQualiteSex": "Membre"
        },
        "organes": {
          "organeRef": "PO746925"
        }
      },
      {
        "@xmlns:xsi": "http://www.w3.org/2001/XMLSchema-instance",
        "uid": "PM750625",
        "acteurRef": "PA720900",
        "legislature": "15",
        "typeOrgane": "GE",
        "dateDebut": "2018-02-15T01:00:00.000+01:00",
        "datePublication": null,
        "dateFin": null,
        "preseance": "20",
        "nominPrincipale": "1",
        "infosQualite": {
          "codeQualite": "Membre",
          "libQualite": "Membre",
          "libQualiteSex": "Membre"
        },
        "organes": {
          "organeRef": "PO747261"
        }
      },
      {
        "@xmlns:xsi": "http://www.w3.org/2001/XMLSchema-instance",
        "uid": "PM751055",
        "acteurRef": "PA720900",
        "legislature": "15",
        "typeOrgane": "GE",
        "dateDebut": "2018-02-19T01:00:00.000+01:00",
        "datePublication": null,
        "dateFin": null,
        "preseance": "20",
        "nominPrincipale": "1",
        "infosQualite": {
          "codeQualite": "Membre",
          "libQualite": "Membre",
          "libQualiteSex": "Membre"
        },
        "organes": {
          "organeRef": "PO747215"
        }
      },
      {
        "@xmlns:xsi": "http://www.w3.org/2001/XMLSchema-instance",
        "uid": "PM752017",
        "acteurRef": "PA720900",
        "legislature": "15",
        "typeOrgane": "GE",
        "dateDebut": "2018-02-26T01:00:00.000+01:00",
        "datePublication": null,
        "dateFin": null,
        "preseance": "20",
        "nominPrincipale": "0",
        "infosQualite": {
          "codeQualite": "Membre",
          "libQualite": "Membre",
          "libQualiteSex": "Membre"
        },
        "organes": {
          "organeRef": "PO746649"
        }
      },
      {
        "@xmlns:xsi": "http://www.w3.org/2001/XMLSchema-instance",
        "uid": "PM753369",
        "acteurRef": "PA720900",
        "legislature": "15",
        "typeOrgane": "GE",
        "dateDebut": "2018-03-14T01:00:00.000+01:00",
        "datePublication": null,
        "dateFin": null,
        "preseance": "20",
        "nominPrincipale": "0",
        "infosQualite": {
          "codeQualite": "Membre",
          "libQualite": "Membre",
          "libQualiteSex": "Membre"
        },
        "organes": {
          "organeRef": "PO747002"
        }
      },
      {
        "@xmlns:xsi": "http://www.w3.org/2001/XMLSchema-instance",
        "uid": "PM754346",
        "acteurRef": "PA720900",
        "legislature": "15",
        "typeOrgane": "GE",
        "dateDebut": "2018-03-27T02:00:00.000+02:00",
        "datePublication": null,
        "dateFin": null,
        "preseance": "12",
        "nominPrincipale": "1",
        "infosQualite": {
          "codeQualite": "Secrétaire",
          "libQualite": "Secrétaire",
          "libQualiteSex": "Secrétaire"
        },
        "organes": {
          "organeRef": "PO746649"
        }
      },
      {
        "@xmlns:xsi": "http://www.w3.org/2001/XMLSchema-instance",
        "uid": "PM755866",
        "acteurRef": "PA720900",
        "legislature": "15",
        "typeOrgane": "GE",
        "dateDebut": "2018-04-19T02:00:00.000+02:00",
        "datePublication": null,
        "dateFin": null,
        "preseance": "8",
        "nominPrincipale": "1",
        "infosQualite": {
          "codeQualite": "Vice-Président",
          "libQualite": "Vice-Président",
          "libQualiteSex": "Vice-Présidente"
        },
        "organes": {
          "organeRef": "PO747002"
        }
      },
      {
        "@xmlns:xsi": "http://www.w3.org/2001/XMLSchema-instance",
        "uid": "PM757077",
        "acteurRef": "PA720900",
        "legislature": "15",
        "typeOrgane": "ORGEXTPARL",
        "dateDebut": "2018-06-04T02:00:00.000+02:00",
        "datePublication": "2018-06-05T02:00:00.000+02:00",
        "dateFin": null,
        "preseance": "20",
        "nominPrincipale": "1",
        "infosQualite": {
          "codeQualite": "Titulaire",
          "libQualite": "Membre titulaire",
          "libQualiteSex": "Membre titulaire"
        },
        "organes": {
          "organeRef": "PO756933"
        }
      },
      {
        "@xmlns:xsi": "http://www.w3.org/2001/XMLSchema-instance",
        "uid": "PM759047",
        "acteurRef": "PA720900",
        "legislature": "15",
        "typeOrgane": "CMP",
        "dateDebut": "2018-09-25T02:00:00.000+02:00",
        "datePublication": "2018-09-26T02:00:00.000+02:00",
        "dateFin": null,
        "preseance": "28",
        "nominPrincipale": "1",
        "infosQualite": {
          "codeQualite": "Suppléant",
          "libQualite": "Membre suppléant",
          "libQualiteSex": "Membre suppléante"
        },
        "organes": {
          "organeRef": "PO758375"
        }
      },
      {
        "@xmlns:xsi": "http://www.w3.org/2001/XMLSchema-instance",
        "uid": "PM759075",
        "acteurRef": "PA720900",
        "legislature": "15",
        "typeOrgane": "CMP",
        "dateDebut": "2018-09-25T02:00:00.000+02:00",
        "datePublication": "2018-09-26T02:00:00.000+02:00",
        "dateFin": null,
        "preseance": "28",
        "nominPrincipale": "1",
        "infosQualite": {
          "codeQualite": "Suppléant",
          "libQualite": "Membre suppléant",
          "libQualiteSex": "Membre suppléante"
        },
        "organes": {
          "organeRef": "PO758368"
        }
      }
    ]
  },
  "@xmlns:xsi": "http://www.w3.org/2001/XMLSchema-instance"
}