{
  "@xmlns:xsi": "http://www.w3.org/2001/XMLSchema-instance",
  "uid": "PO702431",
  "codeType": "CMP",
  "libelle": "Commission mixte paritaire chargée de proposer un texte sur les dispositions restant en discussion du projet de loi portant réforme ferroviaire",
  "libelleEdition": "du projet de loi portant réforme ferroviaire",
  "libelleAbrege": "Réforme ferroviaire",
  "libelleAbrev": "1468",
  "viMoDe": {
    "dateDebut": "2014-07-11T02:00:00.000+02:00",
    "dateAgrement": null,
    "dateFin": "2014-07-22T02:00:00.000+02:00"
  },
  "organeParent": null,
  "chambre": null,
  "regime": "5ème République",
  "legislature": "14",
  "secretariat": {
    "secretaire01": null,
    "secretaire02": null
  }
}