{
  "@xmlns:xsi": "http://www.w3.org/2001/XMLSchema-instance",
  "uid": "PO679789",
  "codeType": "CMP",
  "libelle": "Commission mixte paritaire chargée de proposer un texte sur les dispositions restant en discussion du projet de loi relatif à la régulation économique outre-mer et portant diverses dispositions relatives aux outre-mer",
  "libelleEdition": "du projet de loi relatif à la régulation économique outre-mer et portant diverses dispositions relatives aux outre-mer",
  "libelleAbrege": "Régulation économique outre-mer",
  "libelleAbrev": "751-12-13",
  "viMoDe": {
    "dateDebut": "2012-10-11T02:00:00.000+02:00",
    "dateAgrement": null,
    "dateFin": "2012-11-15T01:00:00.000+01:00"
  },
  "organeParent": null,
  "chambre": null,
  "regime": "5ème République",
  "legislature": "14",
  "secretariat": {
    "secretaire01": null,
    "secretaire02": null
  }
}