{
  "uid": {
    "@xsi:type": "IdActeur_type",
    "#text": "PA560"
  },
  "etatCivil": {
    "ident": {
      "civ": "M.",
      "prenom": "Daniel",
      "nom": "Boisserie",
      "alpha": "Boisserie",
      "trigramme": null
    },
    "infoNaissance": {
      "dateNais": "1946-06-08T01:00:00.000+01:00",
      "villeNais": "Saint-Yrieix-la-Perche",
      "depNais": "Haute-Vienne",
      "paysNais": "France"
    },
    "dateDeces": null
  },
  "profession": {
    "libelleCourant": "Architecte",
    "socProcINSEE": {
      "catSocPro": "Professions libérales et assimilés",
      "famSocPro": "Cadres et professions intellectuelles supérieures"
    }
  },
  "uri_hatvp": null,
  "adresses": {
    "adresse": [
      {
        "@xsi:type": "AdressePostale_Type",
        "uid": "AD46351",
        "type": "2",
        "typeLibelle": "Adresse publiée de circonscription",
        "poids": "22",
        "adresseDeRattachement": null,
        "intitule": "Permanence,",
        "numeroRue": "23",
        "nomRue": "Place de la Nation,",
        "complementAdresse": "BP 15,",
        "codePostal": "87500",
        "ville": "Saint-Yrieix-la-Perche"
      },
      {
        "@xsi:type": "AdressePostale_Type",
        "uid": "AD46352",
        "type": "2",
        "typeLibelle": "Adresse publiée de circonscription",
        "poids": "22",
        "adresseDeRattachement": null,
        "intitule": "Mairie,",
        "numeroRue": null,
        "nomRue": null,
        "complementAdresse": null,
        "codePostal": "87500",
        "ville": "Saint-Yrieix-la-Perche"
      },
      {
        "@xsi:type": "AdresseTelephonique_Type",
        "uid": "AD47906",
        "type": "11",
        "typeLibelle": "Téléphone",
        "poids": "22",
        "adresseDeRattachement": "AD46352",
        "valElec": "05 55 08 88 57"
      },
      {
        "@xsi:type": "AdresseTelephonique_Type",
        "uid": "AD47907",
        "type": "11",
        "typeLibelle": "Téléphone",
        "poids": "22",
        "adresseDeRattachement": "AD46351",
        "valElec": "05 55 75 07 07"
      },
      {
        "@xsi:type": "AdresseTelephonique_Type",
        "uid": "AD49599",
        "type": "12",
        "typeLibelle": "Télécopie",
        "poids": "22",
        "adresseDeRattachement": "AD46352",
        "valElec": "05 55 08 88 89"
      },
      {
        "@xsi:type": "AdresseTelephonique_Type",
        "uid": "AD49600",
        "type": "12",
        "typeLibelle": "Télécopie",
        "poids": "22",
        "adresseDeRattachement": "AD46351",
        "valElec": "05 55 75 00 30"
      },
      {
        "@xsi:type": "AdressePostale_Type",
        "uid": "AD387064",
        "type": "0",
        "typeLibelle": "Adresse officielle",
        "poids": "1",
        "adresseDeRattachement": null,
        "intitule": "Assemblée nationale,",
        "numeroRue": "126",
        "nomRue": "Rue de l'Université,",
        "complementAdresse": null,
        "codePostal": "75355",
        "ville": "Paris 07 SP"
      },
      {
        "@xsi:type": "AdresseMail_Type",
        "uid": "AD391603",
        "type": "15",
        "typeLibelle": "Mèl",
        "poids": null,
        "adresseDeRattachement": null,
        "valElec": "dboisserie@assemblee-nationale.fr"
      },
      {
        "@xsi:type": "AdresseMail_Type",
        "uid": "AD650603",
        "type": "15",
        "typeLibelle": "Mèl",
        "poids": null,
        "adresseDeRattachement": null,
        "valElec": "d.boisserie@wanadoo.fr"
      },
      {
        "@xsi:type": "AdresseSiteWeb_Type",
        "uid": "AD700601",
        "type": "22",
        "typeLibelle": "Site internet",
        "poids": "22",
        "adresseDeRattachement": "AD46351",
        "valElec": "www.danielboisserie.fr"
      }
    ]
  },
  "mandats": {
    "mandat": [
      {
        "@xmlns:xsi": "http://www.w3.org/2001/XMLSchema-instance",
        "uid": "PM386058",
        "acteurRef": "PA560",
        "legislature": "13",
        "typeOrgane": "ASSEMBLEE",
        "dateDebut": "2007-06-20T02:00:00.000+02:00",
        "datePublication": null,
        "dateFin": "2012-06-19T02:00:00.000+02:00",
        "preseance": "50",
        "nominPrincipale": "1",
        "infosQualite": {
          "codeQualite": "membre",
          "libQualite": "membre",
          "libQualiteSex": "membre"
        },
        "organes": {
          "organeRef": "PO384266"
        },
        "suppleants": {
          "suppleant": {
            "dateDebut": "2007-06-20T02:00:00.000+02:00",
            "dateFin": "2012-06-19T02:00:00.000+02:00",
            "suppleantRef": "PA346461"
          }
        },
        "chambre": null,
        "election": {
          "lieu": {
            "region": "Nouvelle-Aquitaine",
            "regionType": "Métropolitain",
            "departement": "Haute-Vienne",
            "numDepartement": "87",
            "numCirco": "2"
          },
          "causeMandat": "élections générales",
          "refCirconscription": "PO384753"
        },
        "mandature": {
          "datePriseFonction": "2007-06-20T02:00:00.000+02:00",
          "causeFin": "Fin de législature",
          "premiereElection": "1",
          "placeHemicycle": null,
          "mandatRemplaceRef": null
        },
        "collaborateurs": null
      },
      {
        "@xmlns:xsi": "http://www.w3.org/2001/XMLSchema-instance",
        "uid": "PM387643",
        "acteurRef": "PA560",
        "legislature": "13",
        "typeOrgane": "GP",
        "dateDebut": "2007-06-20T02:00:00.000+02:00",
        "datePublication": null,
        "dateFin": "2007-06-26T02:00:00.000+02:00",
        "preseance": "28",
        "nominPrincipale": "1",
        "infosQualite": {
          "codeQualite": "Député non-inscrit",
          "libQualite": "Député non-inscrit",
          "libQualiteSex": "Député non-inscrit"
        },
        "organes": {
          "organeRef": "PO387155"
        }
      },
      {
        "uid": "PM390054",
        "acteurRef": "PA560",
        "legislature": "13",
        "typeOrgane": "GP",
        "dateDebut": "2007-06-27T02:00:00.000+02:00",
        "datePublication": "2007-06-27T02:00:00.000+02:00",
        "dateFin": "2012-06-19T02:00:00.000+02:00",
        "preseance": "20",
        "nominPrincipale": "1",
        "infosQualite": {
          "codeQualite": "Membre",
          "libQualite": "Membre du",
          "libQualiteSex": "Membre du"
        },
        "organes": {
          "organeRef": "PO389507"
        }
      },
      {
        "uid": "PM390575",
        "acteurRef": "PA560",
        "legislature": "13",
        "typeOrgane": "COMPER",
        "dateDebut": "2007-06-27T02:00:00.000+02:00",
        "datePublication": "2007-06-28T02:00:00.000+02:00",
        "dateFin": "2009-06-30T02:00:00.000+02:00",
        "preseance": "32",
        "nominPrincipale": "1",
        "infosQualite": {
          "codeQualite": "Membre",
          "libQualite": "Membre",
          "libQualiteSex": "Membre"
        },
        "organes": {
          "organeRef": "PO277060"
        }
      },
      {
        "@xmlns:xsi": "http://www.w3.org/2001/XMLSchema-instance",
        "uid": "PM399398",
        "acteurRef": "PA560",
        "legislature": "13",
        "typeOrgane": "GA",
        "dateDebut": "2007-10-16T02:00:00.000+02:00",
        "datePublication": null,
        "dateFin": "2012-06-19T02:00:00.000+02:00",
        "preseance": "20",
        "nominPrincipale": "1",
        "infosQualite": {
          "codeQualite": "Membre",
          "libQualite": "Membre",
          "libQualiteSex": "Membre"
        },
        "organes": {
          "organeRef": "PO392800"
        }
      },
      {
        "@xmlns:xsi": "http://www.w3.org/2001/XMLSchema-instance",
        "uid": "PM399399",
        "acteurRef": "PA560",
        "legislature": "13",
        "typeOrgane": "GA",
        "dateDebut": "2007-10-16T02:00:00.000+02:00",
        "datePublication": null,
        "dateFin": "2012-06-19T02:00:00.000+02:00",
        "preseance": "20",
        "nominPrincipale": "1",
        "infosQualite": {
          "codeQualite": "Membre",
          "libQualite": "Membre",
          "libQualiteSex": "Membre"
        },
        "organes": {
          "organeRef": "PO393192"
        }
      },
      {
        "@xmlns:xsi": "http://www.w3.org/2001/XMLSchema-instance",
        "uid": "PM399400",
        "acteurRef": "PA560",
        "legislature": "13",
        "typeOrgane": "GA",
        "dateDebut": "2007-10-16T02:00:00.000+02:00",
        "datePublication": null,
        "dateFin": "2012-06-19T02:00:00.000+02:00",
        "preseance": "20",
        "nominPrincipale": "1",
        "infosQualite": {
          "codeQualite": "Membre",
          "libQualite": "Membre",
          "libQualiteSex": "Membre"
        },
        "organes": {
          "organeRef": "PO393328"
        }
      },
      {
        "@xmlns:xsi": "http://www.w3.org/2001/XMLSchema-instance",
        "uid": "PM399401",
        "acteurRef": "PA560",
        "legislature": "13",
        "typeOrgane": "GA",
        "dateDebut": "2007-10-16T02:00:00.000+02:00",
        "datePublication": null,
        "dateFin": "2012-06-19T02:00:00.000+02:00",
        "preseance": "20",
        "nominPrincipale": "1",
        "infosQualite": {
          "codeQualite": "Membre",
          "libQualite": "Membre",
          "libQualiteSex": "Membre"
        },
        "organes": {
          "organeRef": "PO393343"
        }
      },
      {
        "@xmlns:xsi": "http://www.w3.org/2001/XMLSchema-instance",
        "uid": "PM399402",
        "acteurRef": "PA560",
        "legislature": "13",
        "typeOrgane": "GA",
        "dateDebut": "2007-10-16T02:00:00.000+02:00",
        "datePublication": null,
        "dateFin": "2012-06-19T02:00:00.000+02:00",
        "preseance": "20",
        "nominPrincipale": "1",
        "infosQualite": {
          "codeQualite": "Membre",
          "libQualite": "Membre",
          "libQualiteSex": "Membre"
        },
        "organes": {
          "organeRef": "PO393348"
        }
      },
      {
        "@xmlns:xsi": "http://www.w3.org/2001/XMLSchema-instance",
        "uid": "PM401281",
        "acteurRef": "PA560",
        "legislature": "13",
        "typeOrgane": "GA",
        "dateDebut": "2007-10-26T02:00:00.000+02:00",
        "datePublication": null,
        "dateFin": "2012-06-19T02:00:00.000+02:00",
        "preseance": "20",
        "nominPrincipale": "1",
        "infosQualite": {
          "codeQualite": "Membre",
          "libQualite": "Membre",
          "libQualiteSex": "Membre"
        },
        "organes": {
          "organeRef": "PO392915"
        }
      },
      {
        "@xmlns:xsi": "http://www.w3.org/2001/XMLSchema-instance",
        "uid": "PM401282",
        "acteurRef": "PA560",
        "legislature": "13",
        "typeOrgane": "GA",
        "dateDebut": "2007-10-26T02:00:00.000+02:00",
        "datePublication": null,
        "dateFin": "2012-06-19T02:00:00.000+02:00",
        "preseance": "20",
        "nominPrincipale": "1",
        "infosQualite": {
          "codeQualite": "Membre",
          "libQualite": "Membre",
          "libQualiteSex": "Membre"
        },
        "organes": {
          "organeRef": "PO393070"
        }
      },
      {
        "@xmlns:xsi": "http://www.w3.org/2001/XMLSchema-instance",
        "uid": "PM407321",
        "acteurRef": "PA560",
        "legislature": "13",
        "typeOrgane": "GE",
        "dateDebut": "2008-01-22T01:00:00.000+01:00",
        "datePublication": null,
        "dateFin": "2012-06-19T02:00:00.000+02:00",
        "preseance": "20",
        "nominPrincipale": "1",
        "infosQualite": {
          "codeQualite": "Membre",
          "libQualite": "Membre",
          "libQualiteSex": "Membre"
        },
        "organes": {
          "organeRef": "PO402734"
        }
      },
      {
        "@xmlns:xsi": "http://www.w3.org/2001/XMLSchema-instance",
        "uid": "PM408387",
        "acteurRef": "PA560",
        "legislature": "13",
        "typeOrgane": "GE",
        "dateDebut": "2008-02-07T01:00:00.000+01:00",
        "datePublication": null,
        "dateFin": "2012-06-19T02:00:00.000+02:00",
        "preseance": "20",
        "nominPrincipale": "1",
        "infosQualite": {
          "codeQualite": "Membre",
          "libQualite": "Membre",
          "libQualiteSex": "Membre"
        },
        "organes": {
          "organeRef": "PO403178"
        }
      },
      {
        "@xmlns:xsi": "http://www.w3.org/2001/XMLSchema-instance",
        "uid": "PM409364",
        "acteurRef": "PA560",
        "legislature": "13",
        "typeOrgane": "GE",
        "dateDebut": "2008-02-18T01:00:00.000+01:00",
        "datePublication": null,
        "dateFin": "2012-06-19T02:00:00.000+02:00",
        "preseance": "20",
        "nominPrincipale": "1",
        "infosQualite": {
          "codeQualite": "Membre",
          "libQualite": "Membre",
          "libQualiteSex": "Membre"
        },
        "organes": {
          "organeRef": "PO402770"
        }
      },
      {
        "@xmlns:xsi": "http://www.w3.org/2001/XMLSchema-instance",
        "uid": "PM409734",
        "acteurRef": "PA560",
        "legislature": "13",
        "typeOrgane": "GE",
        "dateDebut": "2008-02-28T01:00:00.000+01:00",
        "datePublication": null,
        "dateFin": "2012-06-19T02:00:00.000+02:00",
        "preseance": "20",
        "nominPrincipale": "1",
        "infosQualite": {
          "codeQualite": "Membre",
          "libQualite": "Membre",
          "libQualiteSex": "Membre"
        },
        "organes": {
          "organeRef": "PO402856"
        }
      },
      {
        "@xmlns:xsi": "http://www.w3.org/2001/XMLSchema-instance",
        "uid": "PM410845",
        "acteurRef": "PA560",
        "legislature": "13",
        "typeOrgane": "GE",
        "dateDebut": "2008-01-08T01:00:00.000+01:00",
        "datePublication": null,
        "dateFin": "2012-06-19T02:00:00.000+02:00",
        "preseance": "20",
        "nominPrincipale": "1",
        "infosQualite": {
          "codeQualite": "Membre",
          "libQualite": "Membre",
          "libQualiteSex": "Membre"
        },
        "organes": {
          "organeRef": "PO402919"
        }
      },
      {
        "@xmlns:xsi": "http://www.w3.org/2001/XMLSchema-instance",
        "uid": "PM412205",
        "acteurRef": "PA560",
        "legislature": "13",
        "typeOrgane": "GE",
        "dateDebut": "2008-04-10T02:00:00.000+02:00",
        "datePublication": null,
        "dateFin": "2012-06-19T02:00:00.000+02:00",
        "preseance": "20",
        "nominPrincipale": "1",
        "infosQualite": {
          "codeQualite": "Membre",
          "libQualite": "Membre",
          "libQualiteSex": "Membre"
        },
        "organes": {
          "organeRef": "PO403208"
        }
      },
      {
        "@xmlns:xsi": "http://www.w3.org/2001/XMLSchema-instance",
        "uid": "PM412813",
        "acteurRef": "PA560",
        "legislature": "13",
        "typeOrgane": "GE",
        "dateDebut": "2008-04-18T02:00:00.000+02:00",
        "datePublication": null,
        "dateFin": "2012-06-19T02:00:00.000+02:00",
        "preseance": "20",
        "nominPrincipale": "1",
        "infosQualite": {
          "codeQualite": "Membre",
          "libQualite": "Membre",
          "libQualiteSex": "Membre"
        },
        "organes": {
          "organeRef": "PO403202"
        }
      },
      {
        "@xmlns:xsi": "http://www.w3.org/2001/XMLSchema-instance",
        "uid": "PM413469",
        "acteurRef": "PA560",
        "legislature": "13",
        "typeOrgane": "GE",
        "dateDebut": "2008-05-21T02:00:00.000+02:00",
        "datePublication": null,
        "dateFin": "2012-06-19T02:00:00.000+02:00",
        "preseance": "20",
        "nominPrincipale": "1",
        "infosQualite": {
          "codeQualite": "Membre",
          "libQualite": "Membre",
          "libQualiteSex": "Membre"
        },
        "organes": {
          "organeRef": "PO403039"
        }
      },
      {
        "@xmlns:xsi": "http://www.w3.org/2001/XMLSchema-instance",
        "uid": "PM414925",
        "acteurRef": "PA560",
        "legislature": "13",
        "typeOrgane": "GE",
        "dateDebut": "2007-10-31T01:00:00.000+01:00",
        "datePublication": null,
        "dateFin": "2012-06-19T02:00:00.000+02:00",
        "preseance": "20",
        "nominPrincipale": "1",
        "infosQualite": {
          "codeQualite": "Membre",
          "libQualite": "Membre",
          "libQualiteSex": "Membre"
        },
        "organes": {
          "organeRef": "PO403021"
        }
      },
      {
        "@xmlns:xsi": "http://www.w3.org/2001/XMLSchema-instance",
        "uid": "PM416303",
        "acteurRef": "PA560",
        "legislature": "13",
        "typeOrgane": "GE",
        "dateDebut": "2008-02-06T01:00:00.000+01:00",
        "datePublication": null,
        "dateFin": "2012-06-19T02:00:00.000+02:00",
        "preseance": "20",
        "nominPrincipale": "1",
        "infosQualite": {
          "codeQualite": "Membre",
          "libQualite": "Membre",
          "libQualiteSex": "Membre"
        },
        "organes": {
          "organeRef": "PO402931"
        }
      },
      {
        "@xmlns:xsi": "http://www.w3.org/2001/XMLSchema-instance",
        "uid": "PM418848",
        "acteurRef": "PA560",
        "legislature": "13",
        "typeOrgane": "GE",
        "dateDebut": "2009-03-03T01:00:00.000+01:00",
        "datePublication": null,
        "dateFin": "2012-06-19T02:00:00.000+02:00",
        "preseance": "20",
        "nominPrincipale": "1",
        "infosQualite": {
          "codeQualite": "Membre",
          "libQualite": "Membre",
          "libQualiteSex": "Membre"
        },
        "organes": {
          "organeRef": "PO416217"
        }
      },
      {
        "uid": "PM420672",
        "acteurRef": "PA560",
        "legislature": "13",
        "typeOrgane": "COMPER",
        "dateDebut": "2009-07-01T02:00:00.000+02:00",
        "datePublication": "2009-07-01T02:00:00.000+02:00",
        "dateFin": "2009-10-08T02:00:00.000+02:00",
        "preseance": "32",
        "nominPrincipale": "1",
        "infosQualite": {
          "codeQualite": "Membre",
          "libQualite": "Membre",
          "libQualiteSex": "Membre"
        },
        "organes": {
          "organeRef": "PO419604"
        }
      },
      {
        "uid": "PM421891",
        "acteurRef": "PA560",
        "legislature": "13",
        "typeOrgane": "COMPER",
        "dateDebut": "2009-10-09T02:00:00.000+02:00",
        "datePublication": "2009-10-09T02:00:00.000+02:00",
        "dateFin": "2012-06-19T02:00:00.000+02:00",
        "preseance": "32",
        "nominPrincipale": "1",
        "infosQualite": {
          "codeQualite": "Membre",
          "libQualite": "Membre",
          "libQualiteSex": "Membre"
        },
        "organes": {
          "organeRef": "PO59046"
        }
      },
      {
        "uid": "PM422129",
        "acteurRef": "PA560",
        "legislature": "13",
        "typeOrgane": "COMNL",
        "dateDebut": "2009-10-21T02:00:00.000+02:00",
        "datePublication": "2009-10-22T02:00:00.000+02:00",
        "dateFin": "2012-06-19T02:00:00.000+02:00",
        "preseance": "24",
        "nominPrincipale": "1",
        "infosQualite": {
          "codeQualite": "Titulaire",
          "libQualite": "Membre titulaire",
          "libQualiteSex": "Membre titulaire"
        },
        "organes": {
          "organeRef": "PO271850"
        },
        "suppleants": null
      },
      {
        "@xmlns:xsi": "http://www.w3.org/2001/XMLSchema-instance",
        "uid": "PM424244",
        "acteurRef": "PA560",
        "legislature": "13",
        "typeOrgane": "GE",
        "dateDebut": "2010-06-08T02:00:00.000+02:00",
        "datePublication": null,
        "dateFin": "2012-06-19T02:00:00.000+02:00",
        "preseance": "20",
        "nominPrincipale": "1",
        "infosQualite": {
          "codeQualite": "Membre",
          "libQualite": "Membre",
          "libQualiteSex": "Membre"
        },
        "organes": {
          "organeRef": "PO422919"
        }
      },
      {
        "@xmlns:xsi": "http://www.w3.org/2001/XMLSchema-instance",
        "uid": "PM427215",
        "acteurRef": "PA560",
        "legislature": "13",
        "typeOrgane": "GE",
        "dateDebut": "2011-01-18T01:00:00.000+01:00",
        "datePublication": null,
        "dateFin": "2012-06-19T02:00:00.000+02:00",
        "preseance": "20",
        "nominPrincipale": "1",
        "infosQualite": {
          "codeQualite": "Membre",
          "libQualite": "Membre",
          "libQualiteSex": "Membre"
        },
        "organes": {
          "organeRef": "PO425412"
        }
      },
      {
        "uid": "PM428883",
        "acteurRef": "PA560",
        "legislature": "13",
        "typeOrgane": "CNPE",
        "dateDebut": "2011-06-15T02:00:00.000+02:00",
        "datePublication": "2011-06-16T02:00:00.000+02:00",
        "dateFin": "2011-12-06T01:00:00.000+01:00",
        "preseance": "20",
        "nominPrincipale": "1",
        "infosQualite": {
          "codeQualite": "Membre",
          "libQualite": "Membre",
          "libQualiteSex": "Membre"
        },
        "organes": {
          "organeRef": "PO428765"
        }
      },
      {
        "uid": "PM488196",
        "acteurRef": "PA560",
        "legislature": "13",
        "typeOrgane": "CMP",
        "dateDebut": "2012-01-26T01:00:00.000+01:00",
        "datePublication": "2012-01-27T01:00:00.000+01:00",
        "dateFin": "2012-02-21T01:00:00.000+01:00",
        "preseance": "20",
        "nominPrincipale": "1",
        "infosQualite": {
          "codeQualite": "Titulaire",
          "libQualite": "Membre titulaire",
          "libQualiteSex": "Membre titulaire"
        },
        "organes": {
          "organeRef": "PO485942"
        }
      },
      {
        "@xmlns:xsi": "http://www.w3.org/2001/XMLSchema-instance",
        "uid": "PM645337",
        "acteurRef": "PA560",
        "legislature": "14",
        "typeOrgane": "ASSEMBLEE",
        "dateDebut": "2012-06-20T02:00:00.000+02:00",
        "datePublication": null,
        "dateFin": "2017-06-20T02:00:00.000+02:00",
        "preseance": "50",
        "nominPrincipale": "1",
        "infosQualite": {
          "codeQualite": "membre",
          "libQualite": "membre",
          "libQualiteSex": "membre"
        },
        "organes": {
          "organeRef": "PO644420"
        },
        "suppleants": {
          "suppleant": {
            "dateDebut": "2012-06-20T02:00:00.000+02:00",
            "dateFin": "2017-06-20T02:00:00.000+02:00",
            "suppleantRef": "PA643035"
          }
        },
        "chambre": null,
        "election": {
          "lieu": {
            "region": "Nouvelle-Aquitaine",
            "regionType": "Métropolitain",
            "departement": "Haute-Vienne",
            "numDepartement": "87",
            "numCirco": "2"
          },
          "causeMandat": "élections générales",
          "refCirconscription": "PO644907"
        },
        "mandature": {
          "datePriseFonction": "2012-06-20T02:00:00.000+02:00",
          "causeFin": "Fin de législature",
          "premiereElection": "1",
          "placeHemicycle": null,
          "mandatRemplaceRef": null
        },
        "collaborateurs": null
      },
      {
        "uid": "PM656057",
        "acteurRef": "PA560",
        "legislature": "14",
        "typeOrgane": "GP",
        "dateDebut": "2012-06-26T02:00:00.000+02:00",
        "datePublication": "2012-06-27T02:00:00.000+02:00",
        "dateFin": "2016-05-24T02:00:00.000+02:00",
        "preseance": "20",
        "nominPrincipale": "1",
        "infosQualite": {
          "codeQualite": "Membre",
          "libQualite": "Membre du",
          "libQualiteSex": "Membre du"
        },
        "organes": {
          "organeRef": "PO656002"
        }
      },
      {
        "uid": "PM657329",
        "acteurRef": "PA560",
        "legislature": "14",
        "typeOrgane": "COMPER",
        "dateDebut": "2012-06-28T02:00:00.000+02:00",
        "datePublication": "2012-06-28T02:00:00.000+02:00",
        "dateFin": "2017-06-20T02:00:00.000+02:00",
        "preseance": "32",
        "nominPrincipale": "1",
        "infosQualite": {
          "codeQualite": "Membre",
          "libQualite": "Membre",
          "libQualiteSex": "Membre"
        },
        "organes": {
          "organeRef": "PO59046"
        }
      },
      {
        "uid": "PM671030",
        "acteurRef": "PA560",
        "legislature": "14",
        "typeOrgane": "COMNL",
        "dateDebut": "2012-07-11T02:00:00.000+02:00",
        "datePublication": "2012-07-11T02:00:00.000+02:00",
        "dateFin": "2017-06-20T02:00:00.000+02:00",
        "preseance": "24",
        "nominPrincipale": "1",
        "infosQualite": {
          "codeQualite": "Titulaire",
          "libQualite": "Membre titulaire",
          "libQualiteSex": "Membre titulaire"
        },
        "organes": {
          "organeRef": "PO271850"
        },
        "suppleants": null
      },
      {
        "uid": "PM678314",
        "acteurRef": "PA560",
        "legislature": "14",
        "typeOrgane": "CNPS",
        "dateDebut": "2012-09-25T02:00:00.000+02:00",
        "datePublication": "2012-09-26T02:00:00.000+02:00",
        "dateFin": "2012-11-22T01:00:00.000+01:00",
        "preseance": "20",
        "nominPrincipale": "1",
        "infosQualite": {
          "codeQualite": "Membre",
          "libQualite": "Membre",
          "libQualiteSex": "Membre"
        },
        "organes": {
          "organeRef": "PO678157"
        }
      },
      {
        "uid": "PM679108",
        "acteurRef": "PA560",
        "legislature": "14",
        "typeOrgane": "ORGEXTPARL",
        "dateDebut": "2012-10-04T02:00:00.000+02:00",
        "datePublication": "2012-10-05T02:00:00.000+02:00",
        "dateFin": "2017-06-20T02:00:00.000+02:00",
        "preseance": "20",
        "nominPrincipale": "1",
        "infosQualite": {
          "codeQualite": "Titulaire",
          "libQualite": "Membre titulaire",
          "libQualiteSex": "Membre titulaire"
        },
        "organes": {
          "organeRef": "PO323282"
        }
      },
      {
        "@xmlns:xsi": "http://www.w3.org/2001/XMLSchema-instance",
        "uid": "PM683449",
        "acteurRef": "PA560",
        "legislature": "14",
        "typeOrgane": "GA",
        "dateDebut": "2012-10-24T02:00:00.000+02:00",
        "datePublication": null,
        "dateFin": "2017-06-20T02:00:00.000+02:00",
        "preseance": "20",
        "nominPrincipale": "1",
        "infosQualite": {
          "codeQualite": "Membre",
          "libQualite": "Membre",
          "libQualiteSex": "Membre"
        },
        "organes": {
          "organeRef": "PO675772"
        }
      },
      {
        "@xmlns:xsi": "http://www.w3.org/2001/XMLSchema-instance",
        "uid": "PM684203",
        "acteurRef": "PA560",
        "legislature": "14",
        "typeOrgane": "GA",
        "dateDebut": "2012-11-08T01:00:00.000+01:00",
        "datePublication": null,
        "dateFin": "2017-06-20T02:00:00.000+02:00",
        "preseance": "20",
        "nominPrincipale": "1",
        "infosQualite": {
          "codeQualite": "Membre",
          "libQualite": "Membre",
          "libQualiteSex": "Membre"
        },
        "organes": {
          "organeRef": "PO675761"
        }
      },
      {
        "@xmlns:xsi": "http://www.w3.org/2001/XMLSchema-instance",
        "uid": "PM684876",
        "acteurRef": "PA560",
        "legislature": "14",
        "typeOrgane": "GA",
        "dateDebut": "2012-11-21T01:00:00.000+01:00",
        "datePublication": null,
        "dateFin": "2017-06-20T02:00:00.000+02:00",
        "preseance": "8",
        "nominPrincipale": "1",
        "infosQualite": {
          "codeQualite": "Vice-Président",
          "libQualite": "Vice-Président",
          "libQualiteSex": "Vice-Président"
        },
        "organes": {
          "organeRef": "PO675761"
        }
      },
      {
        "@xmlns:xsi": "http://www.w3.org/2001/XMLSchema-instance",
        "uid": "PM685657",
        "acteurRef": "PA560",
        "legislature": null,
        "typeOrgane": "PARPOL",
        "dateDebut": "2012-12-01T01:00:00.000+01:00",
        "datePublication": null,
        "dateFin": "2017-06-20T02:00:00.000+02:00",
        "preseance": "5",
        "nominPrincipale": "1",
        "infosQualite": {
          "codeQualite": "Membre",
          "libQualite": "Membre",
          "libQualiteSex": "Membre"
        },
        "organes": {
          "organeRef": "PO684932"
        }
      },
      {
        "uid": "PM686550",
        "acteurRef": "PA560",
        "legislature": "14",
        "typeOrgane": "CNPE",
        "dateDebut": "2012-12-12T01:00:00.000+01:00",
        "datePublication": "2012-12-13T01:00:00.000+01:00",
        "dateFin": "2013-05-24T02:00:00.000+02:00",
        "preseance": "20",
        "nominPrincipale": "1",
        "infosQualite": {
          "codeQualite": "Membre",
          "libQualite": "Membre",
          "libQualiteSex": "Membre"
        },
        "organes": {
          "organeRef": "PO685596"
        }
      },
      {
        "@xmlns:xsi": "http://www.w3.org/2001/XMLSchema-instance",
        "uid": "PM687718",
        "acteurRef": "PA560",
        "legislature": "14",
        "typeOrgane": "GE",
        "dateDebut": "2013-01-11T01:00:00.000+01:00",
        "datePublication": null,
        "dateFin": "2017-06-20T02:00:00.000+02:00",
        "preseance": "20",
        "nominPrincipale": "1",
        "infosQualite": {
          "codeQualite": "Membre",
          "libQualite": "Membre",
          "libQualiteSex": "Membre"
        },
        "organes": {
          "organeRef": "PO686258"
        }
      },
      {
        "@xmlns:xsi": "http://www.w3.org/2001/XMLSchema-instance",
        "uid": "PM688082",
        "acteurRef": "PA560",
        "legislature": "14",
        "typeOrgane": "GE",
        "dateDebut": "2013-01-17T01:00:00.000+01:00",
        "datePublication": null,
        "dateFin": "2017-06-20T02:00:00.000+02:00",
        "preseance": "20",
        "nominPrincipale": "1",
        "infosQualite": {
          "codeQualite": "Membre",
          "libQualite": "Membre",
          "libQualiteSex": "Membre"
        },
        "organes": {
          "organeRef": "PO686785"
        }
      },
      {
        "@xmlns:xsi": "http://www.w3.org/2001/XMLSchema-instance",
        "uid": "PM688699",
        "acteurRef": "PA560",
        "legislature": "14",
        "typeOrgane": "GE",
        "dateDebut": "2013-01-25T01:00:00.000+01:00",
        "datePublication": null,
        "dateFin": "2017-06-20T02:00:00.000+02:00",
        "preseance": "20",
        "nominPrincipale": "1",
        "infosQualite": {
          "codeQualite": "Membre",
          "libQualite": "Membre",
          "libQualiteSex": "Membre"
        },
        "organes": {
          "organeRef": "PO686501"
        }
      },
      {
        "@xmlns:xsi": "http://www.w3.org/2001/XMLSchema-instance",
        "uid": "PM689283",
        "acteurRef": "PA560",
        "legislature": "14",
        "typeOrgane": "GE",
        "dateDebut": "2012-12-22T01:00:00.000+01:00",
        "datePublication": null,
        "dateFin": "2017-06-20T02:00:00.000+02:00",
        "preseance": "20",
        "nominPrincipale": "1",
        "infosQualite": {
          "codeQualite": "Membre",
          "libQualite": "Membre",
          "libQualiteSex": "Membre"
        },
        "organes": {
          "organeRef": "PO686617"
        }
      },
      {
        "@xmlns:xsi": "http://www.w3.org/2001/XMLSchema-instance",
        "uid": "PM689464",
        "acteurRef": "PA560",
        "legislature": "14",
        "typeOrgane": "GE",
        "dateDebut": "2013-01-23T01:00:00.000+01:00",
        "datePublication": null,
        "dateFin": "2017-06-20T02:00:00.000+02:00",
        "preseance": "20",
        "nominPrincipale": "1",
        "infosQualite": {
          "codeQualite": "Membre",
          "libQualite": "Membre",
          "libQualiteSex": "Membre"
        },
        "organes": {
          "organeRef": "PO687109"
        }
      },
      {
        "uid": "PM689726",
        "acteurRef": "PA560",
        "legislature": "14",
        "typeOrgane": "COMNL",
        "dateDebut": "2014-11-05T01:00:00.000+01:00",
        "datePublication": "2014-11-06T01:00:00.000+01:00",
        "dateFin": "2017-06-20T02:00:00.000+02:00",
        "preseance": "1",
        "nominPrincipale": "1",
        "infosQualite": {
          "codeQualite": "Président",
          "libQualite": "Président",
          "libQualiteSex": "Président"
        },
        "organes": {
          "organeRef": "PO271850"
        },
        "suppleants": null
      },
      {
        "@xmlns:xsi": "http://www.w3.org/2001/XMLSchema-instance",
        "uid": "PM689745",
        "acteurRef": "PA560",
        "legislature": "14",
        "typeOrgane": "GA",
        "dateDebut": "2012-11-21T01:00:00.000+01:00",
        "datePublication": null,
        "dateFin": "2017-06-20T02:00:00.000+02:00",
        "preseance": "14",
        "nominPrincipale": "1",
        "infosQualite": {
          "codeQualite": "Secrétaire",
          "libQualite": "Secrétaire",
          "libQualiteSex": "Secrétaire"
        },
        "organes": {
          "organeRef": "PO675772"
        }
      },
      {
        "@xmlns:xsi": "http://www.w3.org/2001/XMLSchema-instance",
        "uid": "PM689955",
        "acteurRef": "PA560",
        "legislature": "14",
        "typeOrgane": "GE",
        "dateDebut": "2013-01-31T01:00:00.000+01:00",
        "datePublication": null,
        "dateFin": "2017-06-20T02:00:00.000+02:00",
        "preseance": "20",
        "nominPrincipale": "1",
        "infosQualite": {
          "codeQualite": "Membre",
          "libQualite": "Membre",
          "libQualiteSex": "Membre"
        },
        "organes": {
          "organeRef": "PO686284"
        }
      },
      {
        "@xmlns:xsi": "http://www.w3.org/2001/XMLSchema-instance",
        "uid": "PM690520",
        "acteurRef": "PA560",
        "legislature": "14",
        "typeOrgane": "GE",
        "dateDebut": "2013-01-29T01:00:00.000+01:00",
        "datePublication": null,
        "dateFin": "2017-06-20T02:00:00.000+02:00",
        "preseance": "20",
        "nominPrincipale": "1",
        "infosQualite": {
          "codeQualite": "Membre",
          "libQualite": "Membre",
          "libQualiteSex": "Membre"
        },
        "organes": {
          "organeRef": "PO686861"
        }
      },
      {
        "@xmlns:xsi": "http://www.w3.org/2001/XMLSchema-instance",
        "uid": "PM690669",
        "acteurRef": "PA560",
        "legislature": "14",
        "typeOrgane": "GE",
        "dateDebut": "2013-02-06T01:00:00.000+01:00",
        "datePublication": null,
        "dateFin": "2017-06-20T02:00:00.000+02:00",
        "preseance": "20",
        "nominPrincipale": "1",
        "infosQualite": {
          "codeQualite": "Membre",
          "libQualite": "Membre",
          "libQualiteSex": "Membre"
        },
        "organes": {
          "organeRef": "PO686346"
        }
      },
      {
        "@xmlns:xsi": "http://www.w3.org/2001/XMLSchema-instance",
        "uid": "PM691191",
        "acteurRef": "PA560",
        "legislature": "14",
        "typeOrgane": "GE",
        "dateDebut": "2013-01-12T01:00:00.000+01:00",
        "datePublication": null,
        "dateFin": "2017-06-20T02:00:00.000+02:00",
        "preseance": "20",
        "nominPrincipale": "1",
        "infosQualite": {
          "codeQualite": "Membre",
          "libQualite": "Membre",
          "libQualiteSex": "Membre"
        },
        "organes": {
          "organeRef": "PO687381"
        }
      },
      {
        "@xmlns:xsi": "http://www.w3.org/2001/XMLSchema-instance",
        "uid": "PM691722",
        "acteurRef": "PA560",
        "legislature": "14",
        "typeOrgane": "GE",
        "dateDebut": "2013-02-20T01:00:00.000+01:00",
        "datePublication": null,
        "dateFin": "2017-06-20T02:00:00.000+02:00",
        "preseance": "8",
        "nominPrincipale": "1",
        "infosQualite": {
          "codeQualite": "Vice-Président",
          "libQualite": "Vice-Président",
          "libQualiteSex": "Vice-Président"
        },
        "organes": {
          "organeRef": "PO686284"
        }
      },
      {
        "@xmlns:xsi": "http://www.w3.org/2001/XMLSchema-instance",
        "uid": "PM692048",
        "acteurRef": "PA560",
        "legislature": "14",
        "typeOrgane": "GE",
        "dateDebut": "2013-02-19T01:00:00.000+01:00",
        "datePublication": null,
        "dateFin": "2017-06-20T02:00:00.000+02:00",
        "preseance": "8",
        "nominPrincipale": "1",
        "infosQualite": {
          "codeQualite": "Vice-Président",
          "libQualite": "Vice-Président",
          "libQualiteSex": "Vice-Président"
        },
        "organes": {
          "organeRef": "PO687381"
        }
      },
      {
        "@xmlns:xsi": "http://www.w3.org/2001/XMLSchema-instance",
        "uid": "PM692500",
        "acteurRef": "PA560",
        "legislature": "14",
        "typeOrgane": "GE",
        "dateDebut": "2013-02-19T01:00:00.000+01:00",
        "datePublication": null,
        "dateFin": "2017-06-20T02:00:00.000+02:00",
        "preseance": "20",
        "nominPrincipale": "1",
        "infosQualite": {
          "codeQualite": "Membre",
          "libQualite": "Membre",
          "libQualiteSex": "Membre"
        },
        "organes": {
          "organeRef": "PO686767"
        }
      },
      {
        "@xmlns:xsi": "http://www.w3.org/2001/XMLSchema-instance",
        "uid": "PM693764",
        "acteurRef": "PA560",
        "legislature": "14",
        "typeOrgane": "GE",
        "dateDebut": "2013-04-16T02:00:00.000+02:00",
        "datePublication": null,
        "dateFin": "2017-06-20T02:00:00.000+02:00",
        "preseance": "20",
        "nominPrincipale": "1",
        "infosQualite": {
          "codeQualite": "Membre",
          "libQualite": "Membre",
          "libQualiteSex": "Membre"
        },
        "organes": {
          "organeRef": "PO689006"
        }
      },
      {
        "@xmlns:xsi": "http://www.w3.org/2001/XMLSchema-instance",
        "uid": "PM693906",
        "acteurRef": "PA560",
        "legislature": "14",
        "typeOrgane": "GE",
        "dateDebut": "2013-04-17T02:00:00.000+02:00",
        "datePublication": null,
        "dateFin": "2017-06-20T02:00:00.000+02:00",
        "preseance": "20",
        "nominPrincipale": "1",
        "infosQualite": {
          "codeQualite": "Membre",
          "libQualite": "Membre",
          "libQualiteSex": "Membre"
        },
        "organes": {
          "organeRef": "PO692271"
        }
      },
      {
        "@xmlns:xsi": "http://www.w3.org/2001/XMLSchema-instance",
        "uid": "PM696039",
        "acteurRef": "PA560",
        "legislature": "14",
        "typeOrgane": "GE",
        "dateDebut": "2013-07-15T02:00:00.000+02:00",
        "datePublication": null,
        "dateFin": "2017-06-20T02:00:00.000+02:00",
        "preseance": "20",
        "nominPrincipale": "1",
        "infosQualite": {
          "codeQualite": "Membre",
          "libQualite": "Membre",
          "libQualiteSex": "Membre"
        },
        "organes": {
          "organeRef": "PO694548"
        }
      },
      {
        "@xmlns:xsi": "http://www.w3.org/2001/XMLSchema-instance",
        "uid": "PM696494",
        "acteurRef": "PA560",
        "legislature": "14",
        "typeOrgane": "GE",
        "dateDebut": "2013-07-24T02:00:00.000+02:00",
        "datePublication": null,
        "dateFin": "2017-06-20T02:00:00.000+02:00",
        "preseance": "8",
        "nominPrincipale": "1",
        "infosQualite": {
          "codeQualite": "Vice-Président",
          "libQualite": "Vice-Président",
          "libQualiteSex": "Vice-Président"
        },
        "organes": {
          "organeRef": "PO694548"
        }
      },
      {
        "@xmlns:xsi": "http://www.w3.org/2001/XMLSchema-instance",
        "uid": "PM696960",
        "acteurRef": "PA560",
        "legislature": "14",
        "typeOrgane": "GE",
        "dateDebut": "2013-09-12T02:00:00.000+02:00",
        "datePublication": null,
        "dateFin": "2017-06-20T02:00:00.000+02:00",
        "preseance": "20",
        "nominPrincipale": "1",
        "infosQualite": {
          "codeQualite": "Membre",
          "libQualite": "Membre",
          "libQualiteSex": "Membre"
        },
        "organes": {
          "organeRef": "PO688337"
        }
      },
      {
        "@xmlns:xsi": "http://www.w3.org/2001/XMLSchema-instance",
        "uid": "PM702719",
        "acteurRef": "PA560",
        "legislature": "14",
        "typeOrgane": "GE",
        "dateDebut": "2014-07-23T02:00:00.000+02:00",
        "datePublication": null,
        "dateFin": "2017-06-20T02:00:00.000+02:00",
        "preseance": "20",
        "nominPrincipale": "1",
        "infosQualite": {
          "codeQualite": "Membre",
          "libQualite": "Membre",
          "libQualiteSex": "Membre"
        },
        "organes": {
          "organeRef": "PO702209"
        }
      },
      {
        "@xmlns:xsi": "http://www.w3.org/2001/XMLSchema-instance",
        "uid": "PM703163",
        "acteurRef": "PA560",
        "legislature": "14",
        "typeOrgane": "GE",
        "dateDebut": "2014-09-16T02:00:00.000+02:00",
        "datePublication": null,
        "dateFin": "2017-06-20T02:00:00.000+02:00",
        "preseance": "20",
        "nominPrincipale": "1",
        "infosQualite": {
          "codeQualite": "Membre",
          "libQualite": "Membre",
          "libQualiteSex": "Membre"
        },
        "organes": {
          "organeRef": "PO701621"
        }
      },
      {
        "uid": "PM705293",
        "acteurRef": "PA560",
        "legislature": "14",
        "typeOrgane": "CNPE",
        "dateDebut": "2014-12-10T01:00:00.000+01:00",
        "datePublication": "2014-12-11T01:00:00.000+01:00",
        "dateFin": "2015-05-21T02:00:00.000+02:00",
        "preseance": "20",
        "nominPrincipale": "1",
        "infosQualite": {
          "codeQualite": "Membre",
          "libQualite": "Membre",
          "libQualiteSex": "Membre"
        },
        "organes": {
          "organeRef": "PO705060"
        }
      },
      {
        "@xmlns:xsi": "http://www.w3.org/2001/XMLSchema-instance",
        "uid": "PM708629",
        "acteurRef": "PA560",
        "legislature": "14",
        "typeOrgane": "MISINFO",
        "dateDebut": "2014-12-17T01:00:00.000+01:00",
        "datePublication": null,
        "dateFin": "2015-12-16T01:00:00.000+01:00",
        "preseance": "10",
        "nominPrincipale": "1",
        "infosQualite": {
          "codeQualite": "Membre",
          "libQualite": "Membre",
          "libQualiteSex": "Membre"
        },
        "organes": {
          "organeRef": "PO708600"
        },
        "libelle": null,
        "missionSuivanteRef": null,
        "missionPrecedenteRef": null
      },
      {
        "@xmlns:xsi": "http://www.w3.org/2001/XMLSchema-instance",
        "uid": "PM713118",
        "acteurRef": "PA560",
        "legislature": "14",
        "typeOrgane": "GP",
        "dateDebut": "2016-05-25T02:00:00.000+02:00",
        "datePublication": null,
        "dateFin": "2017-06-20T02:00:00.000+02:00",
        "preseance": "20",
        "nominPrincipale": "1",
        "infosQualite": {
          "codeQualite": "Membre",
          "libQualite": "Membre du",
          "libQualiteSex": "Membre du"
        },
        "organes": {
          "organeRef": "PO713077"
        }
      }
    ]
  },
  "@xmlns:xsi": "http://www.w3.org/2001/XMLSchema-instance"
}