{
  "@xmlns:xsi": "http://www.w3.org/2001/XMLSchema-instance",
  "uid": "PO422919",
  "codeType": "GE",
  "libelle": "Imprimerie et culture papier",
  "libelleEdition": "sur l'imprimerie et culture papier",
  "libelleAbrege": "Imprimerie et culture papier",
  "libelleAbrev": "IMP",
  "viMoDe": {
    "dateDebut": null,
    "dateAgrement": "2010-02-08T01:00:00.000+01:00",
    "dateFin": "2012-06-19T02:00:00.000+02:00"
  },
  "organeParent": null,
  "chambre": null,
  "regime": "5ème République",
  "legislature": "13",
  "secretariat": {
    "secretaire01": null,
    "secretaire02": null
  }
}