{
  "@xmlns:xsi": "http://www.w3.org/2001/XMLSchema-instance",
  "uid": "PO420973",
  "codeType": "CMP",
  "libelle": "Commission mixte paritaire chargée de proposer un texte sur les dispositions restant en discussion du projet de loi relatif à la gendarmerie nationale",
  "libelleEdition": "du projet de loi relatif à la gendarmerie nationale",
  "libelleAbrege": "Gendarmerie",
  "libelleAbrev": "1336",
  "viMoDe": {
    "dateDebut": "2009-07-07T02:00:00.000+02:00",
    "dateAgrement": null,
    "dateFin": "2009-09-01T02:00:00.000+02:00"
  },
  "organeParent": null,
  "chambre": null,
  "regime": "5ème République",
  "legislature": "13",
  "secretariat": {
    "secretaire01": null,
    "secretaire02": null
  }
}