{
  "@xmlns:xsi": "http://www.w3.org/2001/XMLSchema-instance",
  "uid": "PO746634",
  "codeType": "GE",
  "libelle": "Arctique, Antarctique et Terres Australes et Antarctiques françaises – droit des grands fonds",
  "libelleEdition": null,
  "libelleAbrege": "ARCTIQUE, ANTARCTIQUE ET TERRES AUSTRALES ET ANTARCTIQUES FRANÇAISES",
  "libelleAbrev": "ARCTIQUE",
  "viMoDe": {
    "dateDebut": null,
    "dateAgrement": "2017-12-20T01:00:00.000+01:00",
    "dateFin": null
  },
  "organeParent": null,
  "chambre": null,
  "regime": "5ème République",
  "legislature": "15",
  "secretariat": {
    "secretaire01": "M. François-Xavier Carabelli",
    "secretaire02": null
  }
}