{
  "uid": {
    "@xsi:type": "IdActeur_type",
    "#text": "PA696"
  },
  "etatCivil": {
    "ident": {
      "civ": "M.",
      "prenom": "Dominique",
      "nom": "Bussereau",
      "alpha": "Bussereau",
      "trigramme": null
    },
    "infoNaissance": {
      "dateNais": "1952-07-13T01:00:00.000+01:00",
      "villeNais": "Tours",
      "depNais": "Indre-et-Loire",
      "paysNais": null
    },
    "dateDeces": null
  },
  "profession": {
    "libelleCourant": "Conseil en entreprises",
    "socProcINSEE": {
      "catSocPro": "Professions libérales et assimilés",
      "famSocPro": "Cadres et professions intellectuelles supérieures"
    }
  },
  "uri_hatvp": null,
  "adresses": {
    "adresse": [
      {
        "@xsi:type": "AdressePostale_Type",
        "uid": "AD46049",
        "type": "2",
        "typeLibelle": "Adresse publiée de circonscription",
        "poids": "22",
        "adresseDeRattachement": null,
        "intitule": "Conseil général de Charente-Maritime",
        "numeroRue": "88",
        "nomRue": "Boulevard de la République",
        "complementAdresse": null,
        "codePostal": "17000",
        "ville": "La Rochelle"
      },
      {
        "@xsi:type": "AdresseTelephonique_Type",
        "uid": "AD48079",
        "type": "11",
        "typeLibelle": "Téléphone",
        "poids": "22",
        "adresseDeRattachement": "AD46049",
        "valElec": "05 46 22 26 21"
      },
      {
        "@xsi:type": "AdressePostale_Type",
        "uid": "AD386652",
        "type": "0",
        "typeLibelle": "Adresse officielle",
        "poids": "1",
        "adresseDeRattachement": null,
        "intitule": "Assemblée nationale,",
        "numeroRue": "126",
        "nomRue": "Rue de l'Université,",
        "complementAdresse": null,
        "codePostal": "75355",
        "ville": "Paris 07 SP"
      },
      {
        "@xsi:type": "AdresseMail_Type",
        "uid": "AD391682",
        "type": "15",
        "typeLibelle": "Mèl",
        "poids": null,
        "adresseDeRattachement": null,
        "valElec": "dbussereau@assemblee-nationale.fr"
      },
      {
        "@xsi:type": "AdresseMail_Type",
        "uid": "AD649060",
        "type": "15",
        "typeLibelle": "Mèl",
        "poids": null,
        "adresseDeRattachement": null,
        "valElec": "dominique.bussereau@cg17.fr"
      }
    ]
  },
  "mandats": {
    "mandat": [
      {
        "@xmlns:xsi": "http://www.w3.org/2001/XMLSchema-instance",
        "uid": "PM386087",
        "acteurRef": "PA696",
        "legislature": "13",
        "typeOrgane": "ASSEMBLEE",
        "dateDebut": "2007-06-20T02:00:00.000+02:00",
        "datePublication": null,
        "dateFin": "2007-07-19T02:00:00.000+02:00",
        "preseance": "50",
        "nominPrincipale": "1",
        "infosQualite": {
          "codeQualite": "membre",
          "libQualite": "membre",
          "libQualiteSex": "membre"
        },
        "organes": {
          "organeRef": "PO384266"
        },
        "suppleants": {
          "suppleant": {
            "dateDebut": "2007-06-20T02:00:00.000+02:00",
            "dateFin": "2007-07-19T02:00:00.000+02:00",
            "suppleantRef": "PA418"
          }
        },
        "chambre": null,
        "election": {
          "lieu": {
            "region": "Nouvelle-Aquitaine",
            "regionType": "Métropolitain",
            "departement": "Charente-Maritime",
            "numDepartement": "17",
            "numCirco": "4"
          },
          "causeMandat": "élections générales",
          "refCirconscription": "PO384341"
        },
        "mandature": {
          "datePriseFonction": "2007-06-20T02:00:00.000+02:00",
          "causeFin": "Nomination comme membre du Gouvernement",
          "premiereElection": "1",
          "placeHemicycle": null,
          "mandatRemplaceRef": null
        },
        "collaborateurs": null
      },
      {
        "@xmlns:xsi": "http://www.w3.org/2001/XMLSchema-instance",
        "uid": "PM387231",
        "acteurRef": "PA696",
        "legislature": "13",
        "typeOrgane": "GP",
        "dateDebut": "2007-06-20T02:00:00.000+02:00",
        "datePublication": null,
        "dateFin": "2007-06-26T02:00:00.000+02:00",
        "preseance": "28",
        "nominPrincipale": "1",
        "infosQualite": {
          "codeQualite": "Député non-inscrit",
          "libQualite": "Député non-inscrit",
          "libQualiteSex": "Député non-inscrit"
        },
        "organes": {
          "organeRef": "PO387155"
        }
      },
      {
        "@xmlns:xsi": "http://www.w3.org/2001/XMLSchema-instance",
        "uid": "PM388407",
        "acteurRef": "PA696",
        "legislature": null,
        "typeOrgane": "MINISTERE",
        "dateDebut": "2007-06-19T02:00:00.000+02:00",
        "datePublication": "2007-06-20T02:00:00.000+02:00",
        "dateFin": "2010-11-13T01:00:00.000+01:00",
        "preseance": "50",
        "nominPrincipale": "1",
        "infosQualite": {
          "codeQualite": "Secrétaire d'État",
          "libQualite": "Secrétaire d'État",
          "libQualiteSex": "Secrétaire d'État"
        },
        "organes": {
          "organeRef": "PO388143"
        }
      },
      {
        "uid": "PM389736",
        "acteurRef": "PA696",
        "legislature": "13",
        "typeOrgane": "GP",
        "dateDebut": "2007-06-27T02:00:00.000+02:00",
        "datePublication": "2007-06-27T02:00:00.000+02:00",
        "dateFin": "2007-07-19T02:00:00.000+02:00",
        "preseance": "20",
        "nominPrincipale": "1",
        "infosQualite": {
          "codeQualite": "Membre",
          "libQualite": "Membre du",
          "libQualiteSex": "Membre du"
        },
        "organes": {
          "organeRef": "PO389395"
        }
      },
      {
        "@xmlns:xsi": "http://www.w3.org/2001/XMLSchema-instance",
        "uid": "PM426190",
        "acteurRef": "PA696",
        "legislature": "13",
        "typeOrgane": "ASSEMBLEE",
        "dateDebut": "2007-06-20T02:00:00.000+02:00",
        "datePublication": null,
        "dateFin": "2012-06-19T02:00:00.000+02:00",
        "preseance": "50",
        "nominPrincipale": "1",
        "infosQualite": {
          "codeQualite": "membre",
          "libQualite": "membre",
          "libQualiteSex": "membre"
        },
        "organes": {
          "organeRef": "PO384266"
        },
        "suppleants": {
          "suppleant": {
            "dateDebut": "2007-06-20T02:00:00.000+02:00",
            "dateFin": "2012-06-19T02:00:00.000+02:00",
            "suppleantRef": "PA418"
          }
        },
        "chambre": null,
        "election": {
          "lieu": {
            "region": "Nouvelle-Aquitaine",
            "regionType": "Métropolitain",
            "departement": "Charente-Maritime",
            "numDepartement": "17",
            "numCirco": "4"
          },
          "causeMandat": "reprise de l'exercice du mandat d'un ancien membre du Gouvernement",
          "refCirconscription": "PO384341"
        },
        "mandature": {
          "datePriseFonction": "2010-12-14T01:00:00.000+01:00",
          "causeFin": "Fin de législature",
          "premiereElection": "1",
          "placeHemicycle": null,
          "mandatRemplaceRef": "PM386087"
        },
        "collaborateurs": null
      },
      {
        "uid": "PM426198",
        "acteurRef": "PA696",
        "legislature": "13",
        "typeOrgane": "GP",
        "dateDebut": "2010-12-14T01:00:00.000+01:00",
        "datePublication": "2010-12-15T01:00:00.000+01:00",
        "dateFin": "2012-06-19T02:00:00.000+02:00",
        "preseance": "20",
        "nominPrincipale": "1",
        "infosQualite": {
          "codeQualite": "Membre",
          "libQualite": "Membre du",
          "libQualiteSex": "Membre du"
        },
        "organes": {
          "organeRef": "PO389395"
        }
      },
      {
        "uid": "PM426212",
        "acteurRef": "PA696",
        "legislature": "13",
        "typeOrgane": "COMPER",
        "dateDebut": "2010-12-15T01:00:00.000+01:00",
        "datePublication": "2010-12-15T01:00:00.000+01:00",
        "dateFin": "2012-06-19T02:00:00.000+02:00",
        "preseance": "32",
        "nominPrincipale": "1",
        "infosQualite": {
          "codeQualite": "Membre",
          "libQualite": "Membre",
          "libQualiteSex": "Membre"
        },
        "organes": {
          "organeRef": "PO59051"
        }
      },
      {
        "@xmlns:xsi": "http://www.w3.org/2001/XMLSchema-instance",
        "uid": "PM427021",
        "acteurRef": "PA696",
        "legislature": "13",
        "typeOrgane": "GA",
        "dateDebut": "2011-02-07T01:00:00.000+01:00",
        "datePublication": null,
        "dateFin": "2012-06-19T02:00:00.000+02:00",
        "preseance": "20",
        "nominPrincipale": "1",
        "infosQualite": {
          "codeQualite": "Membre",
          "libQualite": "Membre",
          "libQualiteSex": "Membre"
        },
        "organes": {
          "organeRef": "PO392674"
        }
      },
      {
        "@xmlns:xsi": "http://www.w3.org/2001/XMLSchema-instance",
        "uid": "PM427022",
        "acteurRef": "PA696",
        "legislature": "13",
        "typeOrgane": "GA",
        "dateDebut": "2011-02-07T01:00:00.000+01:00",
        "datePublication": null,
        "dateFin": "2012-06-19T02:00:00.000+02:00",
        "preseance": "20",
        "nominPrincipale": "1",
        "infosQualite": {
          "codeQualite": "Membre",
          "libQualite": "Membre",
          "libQualiteSex": "Membre"
        },
        "organes": {
          "organeRef": "PO392694"
        }
      },
      {
        "@xmlns:xsi": "http://www.w3.org/2001/XMLSchema-instance",
        "uid": "PM427023",
        "acteurRef": "PA696",
        "legislature": "13",
        "typeOrgane": "GA",
        "dateDebut": "2011-02-07T01:00:00.000+01:00",
        "datePublication": null,
        "dateFin": "2012-06-19T02:00:00.000+02:00",
        "preseance": "20",
        "nominPrincipale": "1",
        "infosQualite": {
          "codeQualite": "Membre",
          "libQualite": "Membre",
          "libQualiteSex": "Membre"
        },
        "organes": {
          "organeRef": "PO392704"
        }
      },
      {
        "@xmlns:xsi": "http://www.w3.org/2001/XMLSchema-instance",
        "uid": "PM427024",
        "acteurRef": "PA696",
        "legislature": "13",
        "typeOrgane": "GA",
        "dateDebut": "2011-02-07T01:00:00.000+01:00",
        "datePublication": null,
        "dateFin": "2012-06-19T02:00:00.000+02:00",
        "preseance": "20",
        "nominPrincipale": "1",
        "infosQualite": {
          "codeQualite": "Membre",
          "libQualite": "Membre",
          "libQualiteSex": "Membre"
        },
        "organes": {
          "organeRef": "PO392709"
        }
      },
      {
        "@xmlns:xsi": "http://www.w3.org/2001/XMLSchema-instance",
        "uid": "PM427025",
        "acteurRef": "PA696",
        "legislature": "13",
        "typeOrgane": "GA",
        "dateDebut": "2011-02-07T01:00:00.000+01:00",
        "datePublication": null,
        "dateFin": "2012-06-19T02:00:00.000+02:00",
        "preseance": "20",
        "nominPrincipale": "1",
        "infosQualite": {
          "codeQualite": "Membre",
          "libQualite": "Membre",
          "libQualiteSex": "Membre"
        },
        "organes": {
          "organeRef": "PO392719"
        }
      },
      {
        "@xmlns:xsi": "http://www.w3.org/2001/XMLSchema-instance",
        "uid": "PM427026",
        "acteurRef": "PA696",
        "legislature": "13",
        "typeOrgane": "GA",
        "dateDebut": "2011-02-07T01:00:00.000+01:00",
        "datePublication": null,
        "dateFin": "2012-06-19T02:00:00.000+02:00",
        "preseance": "20",
        "nominPrincipale": "1",
        "infosQualite": {
          "codeQualite": "Membre",
          "libQualite": "Membre",
          "libQualiteSex": "Membre"
        },
        "organes": {
          "organeRef": "PO392760"
        }
      },
      {
        "@xmlns:xsi": "http://www.w3.org/2001/XMLSchema-instance",
        "uid": "PM427027",
        "acteurRef": "PA696",
        "legislature": "13",
        "typeOrgane": "GA",
        "dateDebut": "2011-02-07T01:00:00.000+01:00",
        "datePublication": null,
        "dateFin": "2012-06-19T02:00:00.000+02:00",
        "preseance": "20",
        "nominPrincipale": "1",
        "infosQualite": {
          "codeQualite": "Membre",
          "libQualite": "Membre",
          "libQualiteSex": "Membre"
        },
        "organes": {
          "organeRef": "PO392785"
        }
      },
      {
        "@xmlns:xsi": "http://www.w3.org/2001/XMLSchema-instance",
        "uid": "PM427028",
        "acteurRef": "PA696",
        "legislature": "13",
        "typeOrgane": "GA",
        "dateDebut": "2011-02-07T01:00:00.000+01:00",
        "datePublication": null,
        "dateFin": "2012-06-19T02:00:00.000+02:00",
        "preseance": "20",
        "nominPrincipale": "1",
        "infosQualite": {
          "codeQualite": "Membre",
          "libQualite": "Membre",
          "libQualiteSex": "Membre"
        },
        "organes": {
          "organeRef": "PO392800"
        }
      },
      {
        "@xmlns:xsi": "http://www.w3.org/2001/XMLSchema-instance",
        "uid": "PM427029",
        "acteurRef": "PA696",
        "legislature": "13",
        "typeOrgane": "GA",
        "dateDebut": "2011-02-07T01:00:00.000+01:00",
        "datePublication": null,
        "dateFin": "2012-06-19T02:00:00.000+02:00",
        "preseance": "20",
        "nominPrincipale": "1",
        "infosQualite": {
          "codeQualite": "Membre",
          "libQualite": "Membre",
          "libQualiteSex": "Membre"
        },
        "organes": {
          "organeRef": "PO392810"
        }
      },
      {
        "@xmlns:xsi": "http://www.w3.org/2001/XMLSchema-instance",
        "uid": "PM427030",
        "acteurRef": "PA696",
        "legislature": "13",
        "typeOrgane": "GA",
        "dateDebut": "2011-02-07T01:00:00.000+01:00",
        "datePublication": null,
        "dateFin": "2012-06-19T02:00:00.000+02:00",
        "preseance": "20",
        "nominPrincipale": "1",
        "infosQualite": {
          "codeQualite": "Membre",
          "libQualite": "Membre",
          "libQualiteSex": "Membre"
        },
        "organes": {
          "organeRef": "PO392820"
        }
      },
      {
        "@xmlns:xsi": "http://www.w3.org/2001/XMLSchema-instance",
        "uid": "PM427031",
        "acteurRef": "PA696",
        "legislature": "13",
        "typeOrgane": "GA",
        "dateDebut": "2011-02-07T01:00:00.000+01:00",
        "datePublication": null,
        "dateFin": "2012-06-19T02:00:00.000+02:00",
        "preseance": "20",
        "nominPrincipale": "1",
        "infosQualite": {
          "codeQualite": "Membre",
          "libQualite": "Membre",
          "libQualiteSex": "Membre"
        },
        "organes": {
          "organeRef": "PO392835"
        }
      },
      {
        "@xmlns:xsi": "http://www.w3.org/2001/XMLSchema-instance",
        "uid": "PM427032",
        "acteurRef": "PA696",
        "legislature": "13",
        "typeOrgane": "GA",
        "dateDebut": "2011-02-07T01:00:00.000+01:00",
        "datePublication": null,
        "dateFin": "2012-06-19T02:00:00.000+02:00",
        "preseance": "20",
        "nominPrincipale": "1",
        "infosQualite": {
          "codeQualite": "Membre",
          "libQualite": "Membre",
          "libQualiteSex": "Membre"
        },
        "organes": {
          "organeRef": "PO392840"
        }
      },
      {
        "@xmlns:xsi": "http://www.w3.org/2001/XMLSchema-instance",
        "uid": "PM427033",
        "acteurRef": "PA696",
        "legislature": "13",
        "typeOrgane": "GA",
        "dateDebut": "2011-02-07T01:00:00.000+01:00",
        "datePublication": null,
        "dateFin": "2012-06-19T02:00:00.000+02:00",
        "preseance": "20",
        "nominPrincipale": "1",
        "infosQualite": {
          "codeQualite": "Membre",
          "libQualite": "Membre",
          "libQualiteSex": "Membre"
        },
        "organes": {
          "organeRef": "PO392875"
        }
      },
      {
        "@xmlns:xsi": "http://www.w3.org/2001/XMLSchema-instance",
        "uid": "PM427034",
        "acteurRef": "PA696",
        "legislature": "13",
        "typeOrgane": "GA",
        "dateDebut": "2011-02-07T01:00:00.000+01:00",
        "datePublication": null,
        "dateFin": "2012-06-19T02:00:00.000+02:00",
        "preseance": "20",
        "nominPrincipale": "1",
        "infosQualite": {
          "codeQualite": "Membre",
          "libQualite": "Membre",
          "libQualiteSex": "Membre"
        },
        "organes": {
          "organeRef": "PO392895"
        }
      },
      {
        "@xmlns:xsi": "http://www.w3.org/2001/XMLSchema-instance",
        "uid": "PM427035",
        "acteurRef": "PA696",
        "legislature": "13",
        "typeOrgane": "GA",
        "dateDebut": "2011-02-07T01:00:00.000+01:00",
        "datePublication": null,
        "dateFin": "2012-06-19T02:00:00.000+02:00",
        "preseance": "20",
        "nominPrincipale": "1",
        "infosQualite": {
          "codeQualite": "Membre",
          "libQualite": "Membre",
          "libQualiteSex": "Membre"
        },
        "organes": {
          "organeRef": "PO392915"
        }
      },
      {
        "@xmlns:xsi": "http://www.w3.org/2001/XMLSchema-instance",
        "uid": "PM427036",
        "acteurRef": "PA696",
        "legislature": "13",
        "typeOrgane": "GA",
        "dateDebut": "2011-02-07T01:00:00.000+01:00",
        "datePublication": null,
        "dateFin": "2012-06-19T02:00:00.000+02:00",
        "preseance": "20",
        "nominPrincipale": "1",
        "infosQualite": {
          "codeQualite": "Membre",
          "libQualite": "Membre",
          "libQualiteSex": "Membre"
        },
        "organes": {
          "organeRef": "PO392925"
        }
      },
      {
        "@xmlns:xsi": "http://www.w3.org/2001/XMLSchema-instance",
        "uid": "PM427037",
        "acteurRef": "PA696",
        "legislature": "13",
        "typeOrgane": "GA",
        "dateDebut": "2011-02-07T01:00:00.000+01:00",
        "datePublication": null,
        "dateFin": "2012-06-19T02:00:00.000+02:00",
        "preseance": "20",
        "nominPrincipale": "1",
        "infosQualite": {
          "codeQualite": "Membre",
          "libQualite": "Membre",
          "libQualiteSex": "Membre"
        },
        "organes": {
          "organeRef": "PO392940"
        }
      },
      {
        "@xmlns:xsi": "http://www.w3.org/2001/XMLSchema-instance",
        "uid": "PM427038",
        "acteurRef": "PA696",
        "legislature": "13",
        "typeOrgane": "GA",
        "dateDebut": "2011-02-07T01:00:00.000+01:00",
        "datePublication": null,
        "dateFin": "2012-06-19T02:00:00.000+02:00",
        "preseance": "20",
        "nominPrincipale": "1",
        "infosQualite": {
          "codeQualite": "Membre",
          "libQualite": "Membre",
          "libQualiteSex": "Membre"
        },
        "organes": {
          "organeRef": "PO392950"
        }
      },
      {
        "@xmlns:xsi": "http://www.w3.org/2001/XMLSchema-instance",
        "uid": "PM427039",
        "acteurRef": "PA696",
        "legislature": "13",
        "typeOrgane": "GA",
        "dateDebut": "2011-02-07T01:00:00.000+01:00",
        "datePublication": null,
        "dateFin": "2012-06-19T02:00:00.000+02:00",
        "preseance": "20",
        "nominPrincipale": "1",
        "infosQualite": {
          "codeQualite": "Membre",
          "libQualite": "Membre",
          "libQualiteSex": "Membre"
        },
        "organes": {
          "organeRef": "PO392965"
        }
      },
      {
        "@xmlns:xsi": "http://www.w3.org/2001/XMLSchema-instance",
        "uid": "PM427040",
        "acteurRef": "PA696",
        "legislature": "13",
        "typeOrgane": "GA",
        "dateDebut": "2011-02-07T01:00:00.000+01:00",
        "datePublication": null,
        "dateFin": "2012-06-19T02:00:00.000+02:00",
        "preseance": "20",
        "nominPrincipale": "1",
        "infosQualite": {
          "codeQualite": "Membre",
          "libQualite": "Membre",
          "libQualiteSex": "Membre"
        },
        "organes": {
          "organeRef": "PO392995"
        }
      },
      {
        "@xmlns:xsi": "http://www.w3.org/2001/XMLSchema-instance",
        "uid": "PM427041",
        "acteurRef": "PA696",
        "legislature": "13",
        "typeOrgane": "GA",
        "dateDebut": "2011-02-07T01:00:00.000+01:00",
        "datePublication": null,
        "dateFin": "2012-06-19T02:00:00.000+02:00",
        "preseance": "20",
        "nominPrincipale": "1",
        "infosQualite": {
          "codeQualite": "Membre",
          "libQualite": "Membre",
          "libQualiteSex": "Membre"
        },
        "organes": {
          "organeRef": "PO393005"
        }
      },
      {
        "@xmlns:xsi": "http://www.w3.org/2001/XMLSchema-instance",
        "uid": "PM427042",
        "acteurRef": "PA696",
        "legislature": "13",
        "typeOrgane": "GA",
        "dateDebut": "2011-02-07T01:00:00.000+01:00",
        "datePublication": null,
        "dateFin": "2012-06-19T02:00:00.000+02:00",
        "preseance": "20",
        "nominPrincipale": "1",
        "infosQualite": {
          "codeQualite": "Membre",
          "libQualite": "Membre",
          "libQualiteSex": "Membre"
        },
        "organes": {
          "organeRef": "PO393025"
        }
      },
      {
        "@xmlns:xsi": "http://www.w3.org/2001/XMLSchema-instance",
        "uid": "PM427043",
        "acteurRef": "PA696",
        "legislature": "13",
        "typeOrgane": "GA",
        "dateDebut": "2011-02-07T01:00:00.000+01:00",
        "datePublication": null,
        "dateFin": "2012-06-19T02:00:00.000+02:00",
        "preseance": "20",
        "nominPrincipale": "1",
        "infosQualite": {
          "codeQualite": "Membre",
          "libQualite": "Membre",
          "libQualiteSex": "Membre"
        },
        "organes": {
          "organeRef": "PO393035"
        }
      },
      {
        "@xmlns:xsi": "http://www.w3.org/2001/XMLSchema-instance",
        "uid": "PM427044",
        "acteurRef": "PA696",
        "legislature": "13",
        "typeOrgane": "GA",
        "dateDebut": "2011-02-07T01:00:00.000+01:00",
        "datePublication": null,
        "dateFin": "2012-06-19T02:00:00.000+02:00",
        "preseance": "20",
        "nominPrincipale": "1",
        "infosQualite": {
          "codeQualite": "Membre",
          "libQualite": "Membre",
          "libQualiteSex": "Membre"
        },
        "organes": {
          "organeRef": "PO393040"
        }
      },
      {
        "@xmlns:xsi": "http://www.w3.org/2001/XMLSchema-instance",
        "uid": "PM427045",
        "acteurRef": "PA696",
        "legislature": "13",
        "typeOrgane": "GA",
        "dateDebut": "2011-02-07T01:00:00.000+01:00",
        "datePublication": null,
        "dateFin": "2012-06-19T02:00:00.000+02:00",
        "preseance": "20",
        "nominPrincipale": "1",
        "infosQualite": {
          "codeQualite": "Membre",
          "libQualite": "Membre",
          "libQualiteSex": "Membre"
        },
        "organes": {
          "organeRef": "PO393045"
        }
      },
      {
        "@xmlns:xsi": "http://www.w3.org/2001/XMLSchema-instance",
        "uid": "PM427046",
        "acteurRef": "PA696",
        "legislature": "13",
        "typeOrgane": "GA",
        "dateDebut": "2011-02-07T01:00:00.000+01:00",
        "datePublication": null,
        "dateFin": "2012-06-19T02:00:00.000+02:00",
        "preseance": "20",
        "nominPrincipale": "1",
        "infosQualite": {
          "codeQualite": "Membre",
          "libQualite": "Membre",
          "libQualiteSex": "Membre"
        },
        "organes": {
          "organeRef": "PO393065"
        }
      },
      {
        "@xmlns:xsi": "http://www.w3.org/2001/XMLSchema-instance",
        "uid": "PM427047",
        "acteurRef": "PA696",
        "legislature": "13",
        "typeOrgane": "GA",
        "dateDebut": "2011-02-07T01:00:00.000+01:00",
        "datePublication": null,
        "dateFin": "2012-06-19T02:00:00.000+02:00",
        "preseance": "20",
        "nominPrincipale": "1",
        "infosQualite": {
          "codeQualite": "Membre",
          "libQualite": "Membre",
          "libQualiteSex": "Membre"
        },
        "organes": {
          "organeRef": "PO393070"
        }
      },
      {
        "@xmlns:xsi": "http://www.w3.org/2001/XMLSchema-instance",
        "uid": "PM427048",
        "acteurRef": "PA696",
        "legislature": "13",
        "typeOrgane": "GA",
        "dateDebut": "2011-02-07T01:00:00.000+01:00",
        "datePublication": null,
        "dateFin": "2012-06-19T02:00:00.000+02:00",
        "preseance": "20",
        "nominPrincipale": "1",
        "infosQualite": {
          "codeQualite": "Membre",
          "libQualite": "Membre",
          "libQualiteSex": "Membre"
        },
        "organes": {
          "organeRef": "PO393075"
        }
      },
      {
        "@xmlns:xsi": "http://www.w3.org/2001/XMLSchema-instance",
        "uid": "PM427049",
        "acteurRef": "PA696",
        "legislature": "13",
        "typeOrgane": "GA",
        "dateDebut": "2011-02-07T01:00:00.000+01:00",
        "datePublication": null,
        "dateFin": "2012-06-19T02:00:00.000+02:00",
        "preseance": "20",
        "nominPrincipale": "1",
        "infosQualite": {
          "codeQualite": "Membre",
          "libQualite": "Membre",
          "libQualiteSex": "Membre"
        },
        "organes": {
          "organeRef": "PO393085"
        }
      },
      {
        "@xmlns:xsi": "http://www.w3.org/2001/XMLSchema-instance",
        "uid": "PM427050",
        "acteurRef": "PA696",
        "legislature": "13",
        "typeOrgane": "GA",
        "dateDebut": "2011-02-07T01:00:00.000+01:00",
        "datePublication": null,
        "dateFin": "2012-06-19T02:00:00.000+02:00",
        "preseance": "20",
        "nominPrincipale": "1",
        "infosQualite": {
          "codeQualite": "Membre",
          "libQualite": "Membre",
          "libQualiteSex": "Membre"
        },
        "organes": {
          "organeRef": "PO393090"
        }
      },
      {
        "@xmlns:xsi": "http://www.w3.org/2001/XMLSchema-instance",
        "uid": "PM427051",
        "acteurRef": "PA696",
        "legislature": "13",
        "typeOrgane": "GA",
        "dateDebut": "2011-02-07T01:00:00.000+01:00",
        "datePublication": null,
        "dateFin": "2012-06-19T02:00:00.000+02:00",
        "preseance": "20",
        "nominPrincipale": "1",
        "infosQualite": {
          "codeQualite": "Membre",
          "libQualite": "Membre",
          "libQualiteSex": "Membre"
        },
        "organes": {
          "organeRef": "PO393110"
        }
      },
      {
        "@xmlns:xsi": "http://www.w3.org/2001/XMLSchema-instance",
        "uid": "PM427052",
        "acteurRef": "PA696",
        "legislature": "13",
        "typeOrgane": "GA",
        "dateDebut": "2011-02-07T01:00:00.000+01:00",
        "datePublication": null,
        "dateFin": "2012-06-19T02:00:00.000+02:00",
        "preseance": "20",
        "nominPrincipale": "1",
        "infosQualite": {
          "codeQualite": "Membre",
          "libQualite": "Membre",
          "libQualiteSex": "Membre"
        },
        "organes": {
          "organeRef": "PO393115"
        }
      },
      {
        "@xmlns:xsi": "http://www.w3.org/2001/XMLSchema-instance",
        "uid": "PM427053",
        "acteurRef": "PA696",
        "legislature": "13",
        "typeOrgane": "GA",
        "dateDebut": "2011-02-07T01:00:00.000+01:00",
        "datePublication": null,
        "dateFin": "2012-06-19T02:00:00.000+02:00",
        "preseance": "20",
        "nominPrincipale": "1",
        "infosQualite": {
          "codeQualite": "Membre",
          "libQualite": "Membre",
          "libQualiteSex": "Membre"
        },
        "organes": {
          "organeRef": "PO393125"
        }
      },
      {
        "@xmlns:xsi": "http://www.w3.org/2001/XMLSchema-instance",
        "uid": "PM427054",
        "acteurRef": "PA696",
        "legislature": "13",
        "typeOrgane": "GA",
        "dateDebut": "2011-02-07T01:00:00.000+01:00",
        "datePublication": null,
        "dateFin": "2012-06-19T02:00:00.000+02:00",
        "preseance": "20",
        "nominPrincipale": "1",
        "infosQualite": {
          "codeQualite": "Membre",
          "libQualite": "Membre",
          "libQualiteSex": "Membre"
        },
        "organes": {
          "organeRef": "PO393130"
        }
      },
      {
        "@xmlns:xsi": "http://www.w3.org/2001/XMLSchema-instance",
        "uid": "PM427055",
        "acteurRef": "PA696",
        "legislature": "13",
        "typeOrgane": "GA",
        "dateDebut": "2011-02-07T01:00:00.000+01:00",
        "datePublication": null,
        "dateFin": "2012-06-19T02:00:00.000+02:00",
        "preseance": "20",
        "nominPrincipale": "1",
        "infosQualite": {
          "codeQualite": "Membre",
          "libQualite": "Membre",
          "libQualiteSex": "Membre"
        },
        "organes": {
          "organeRef": "PO393146"
        }
      },
      {
        "@xmlns:xsi": "http://www.w3.org/2001/XMLSchema-instance",
        "uid": "PM427056",
        "acteurRef": "PA696",
        "legislature": "13",
        "typeOrgane": "GA",
        "dateDebut": "2011-02-07T01:00:00.000+01:00",
        "datePublication": null,
        "dateFin": "2012-06-19T02:00:00.000+02:00",
        "preseance": "20",
        "nominPrincipale": "1",
        "infosQualite": {
          "codeQualite": "Membre",
          "libQualite": "Membre",
          "libQualiteSex": "Membre"
        },
        "organes": {
          "organeRef": "PO393151"
        }
      },
      {
        "@xmlns:xsi": "http://www.w3.org/2001/XMLSchema-instance",
        "uid": "PM427057",
        "acteurRef": "PA696",
        "legislature": "13",
        "typeOrgane": "GA",
        "dateDebut": "2011-02-07T01:00:00.000+01:00",
        "datePublication": null,
        "dateFin": "2012-06-19T02:00:00.000+02:00",
        "preseance": "20",
        "nominPrincipale": "1",
        "infosQualite": {
          "codeQualite": "Membre",
          "libQualite": "Membre",
          "libQualiteSex": "Membre"
        },
        "organes": {
          "organeRef": "PO393161"
        }
      },
      {
        "@xmlns:xsi": "http://www.w3.org/2001/XMLSchema-instance",
        "uid": "PM427058",
        "acteurRef": "PA696",
        "legislature": "13",
        "typeOrgane": "GA",
        "dateDebut": "2011-02-07T01:00:00.000+01:00",
        "datePublication": null,
        "dateFin": "2012-06-19T02:00:00.000+02:00",
        "preseance": "20",
        "nominPrincipale": "1",
        "infosQualite": {
          "codeQualite": "Membre",
          "libQualite": "Membre",
          "libQualiteSex": "Membre"
        },
        "organes": {
          "organeRef": "PO393177"
        }
      },
      {
        "@xmlns:xsi": "http://www.w3.org/2001/XMLSchema-instance",
        "uid": "PM427059",
        "acteurRef": "PA696",
        "legislature": "13",
        "typeOrgane": "GA",
        "dateDebut": "2011-02-07T01:00:00.000+01:00",
        "datePublication": null,
        "dateFin": "2012-06-19T02:00:00.000+02:00",
        "preseance": "20",
        "nominPrincipale": "1",
        "infosQualite": {
          "codeQualite": "Membre",
          "libQualite": "Membre",
          "libQualiteSex": "Membre"
        },
        "organes": {
          "organeRef": "PO393187"
        }
      },
      {
        "@xmlns:xsi": "http://www.w3.org/2001/XMLSchema-instance",
        "uid": "PM427060",
        "acteurRef": "PA696",
        "legislature": "13",
        "typeOrgane": "GA",
        "dateDebut": "2011-02-07T01:00:00.000+01:00",
        "datePublication": null,
        "dateFin": "2012-06-19T02:00:00.000+02:00",
        "preseance": "20",
        "nominPrincipale": "1",
        "infosQualite": {
          "codeQualite": "Membre",
          "libQualite": "Membre",
          "libQualiteSex": "Membre"
        },
        "organes": {
          "organeRef": "PO393192"
        }
      },
      {
        "@xmlns:xsi": "http://www.w3.org/2001/XMLSchema-instance",
        "uid": "PM427061",
        "acteurRef": "PA696",
        "legislature": "13",
        "typeOrgane": "GA",
        "dateDebut": "2011-02-07T01:00:00.000+01:00",
        "datePublication": null,
        "dateFin": "2012-06-19T02:00:00.000+02:00",
        "preseance": "20",
        "nominPrincipale": "1",
        "infosQualite": {
          "codeQualite": "Membre",
          "libQualite": "Membre",
          "libQualiteSex": "Membre"
        },
        "organes": {
          "organeRef": "PO393197"
        }
      },
      {
        "@xmlns:xsi": "http://www.w3.org/2001/XMLSchema-instance",
        "uid": "PM427062",
        "acteurRef": "PA696",
        "legislature": "13",
        "typeOrgane": "GA",
        "dateDebut": "2011-02-07T01:00:00.000+01:00",
        "datePublication": null,
        "dateFin": "2012-06-19T02:00:00.000+02:00",
        "preseance": "20",
        "nominPrincipale": "1",
        "infosQualite": {
          "codeQualite": "Membre",
          "libQualite": "Membre",
          "libQualiteSex": "Membre"
        },
        "organes": {
          "organeRef": "PO393207"
        }
      },
      {
        "@xmlns:xsi": "http://www.w3.org/2001/XMLSchema-instance",
        "uid": "PM427063",
        "acteurRef": "PA696",
        "legislature": "13",
        "typeOrgane": "GA",
        "dateDebut": "2011-02-07T01:00:00.000+01:00",
        "datePublication": null,
        "dateFin": "2012-06-19T02:00:00.000+02:00",
        "preseance": "20",
        "nominPrincipale": "1",
        "infosQualite": {
          "codeQualite": "Membre",
          "libQualite": "Membre",
          "libQualiteSex": "Membre"
        },
        "organes": {
          "organeRef": "PO393217"
        }
      },
      {
        "@xmlns:xsi": "http://www.w3.org/2001/XMLSchema-instance",
        "uid": "PM427064",
        "acteurRef": "PA696",
        "legislature": "13",
        "typeOrgane": "GA",
        "dateDebut": "2011-02-07T01:00:00.000+01:00",
        "datePublication": null,
        "dateFin": "2012-06-19T02:00:00.000+02:00",
        "preseance": "20",
        "nominPrincipale": "1",
        "infosQualite": {
          "codeQualite": "Membre",
          "libQualite": "Membre",
          "libQualiteSex": "Membre"
        },
        "organes": {
          "organeRef": "PO393222"
        }
      },
      {
        "@xmlns:xsi": "http://www.w3.org/2001/XMLSchema-instance",
        "uid": "PM427065",
        "acteurRef": "PA696",
        "legislature": "13",
        "typeOrgane": "GA",
        "dateDebut": "2011-02-07T01:00:00.000+01:00",
        "datePublication": null,
        "dateFin": "2012-06-19T02:00:00.000+02:00",
        "preseance": "20",
        "nominPrincipale": "1",
        "infosQualite": {
          "codeQualite": "Membre",
          "libQualite": "Membre",
          "libQualiteSex": "Membre"
        },
        "organes": {
          "organeRef": "PO393238"
        }
      },
      {
        "@xmlns:xsi": "http://www.w3.org/2001/XMLSchema-instance",
        "uid": "PM427066",
        "acteurRef": "PA696",
        "legislature": "13",
        "typeOrgane": "GA",
        "dateDebut": "2011-02-07T01:00:00.000+01:00",
        "datePublication": null,
        "dateFin": "2012-06-19T02:00:00.000+02:00",
        "preseance": "20",
        "nominPrincipale": "1",
        "infosQualite": {
          "codeQualite": "Membre",
          "libQualite": "Membre",
          "libQualiteSex": "Membre"
        },
        "organes": {
          "organeRef": "PO393243"
        }
      },
      {
        "@xmlns:xsi": "http://www.w3.org/2001/XMLSchema-instance",
        "uid": "PM427067",
        "acteurRef": "PA696",
        "legislature": "13",
        "typeOrgane": "GA",
        "dateDebut": "2011-02-07T01:00:00.000+01:00",
        "datePublication": null,
        "dateFin": "2012-06-19T02:00:00.000+02:00",
        "preseance": "20",
        "nominPrincipale": "1",
        "infosQualite": {
          "codeQualite": "Membre",
          "libQualite": "Membre",
          "libQualiteSex": "Membre"
        },
        "organes": {
          "organeRef": "PO393263"
        }
      },
      {
        "@xmlns:xsi": "http://www.w3.org/2001/XMLSchema-instance",
        "uid": "PM427068",
        "acteurRef": "PA696",
        "legislature": "13",
        "typeOrgane": "GA",
        "dateDebut": "2011-02-07T01:00:00.000+01:00",
        "datePublication": null,
        "dateFin": "2012-06-19T02:00:00.000+02:00",
        "preseance": "20",
        "nominPrincipale": "1",
        "infosQualite": {
          "codeQualite": "Membre",
          "libQualite": "Membre",
          "libQualiteSex": "Membre"
        },
        "organes": {
          "organeRef": "PO393268"
        }
      },
      {
        "@xmlns:xsi": "http://www.w3.org/2001/XMLSchema-instance",
        "uid": "PM427069",
        "acteurRef": "PA696",
        "legislature": "13",
        "typeOrgane": "GA",
        "dateDebut": "2011-02-07T01:00:00.000+01:00",
        "datePublication": null,
        "dateFin": "2012-06-19T02:00:00.000+02:00",
        "preseance": "20",
        "nominPrincipale": "1",
        "infosQualite": {
          "codeQualite": "Membre",
          "libQualite": "Membre",
          "libQualiteSex": "Membre"
        },
        "organes": {
          "organeRef": "PO393273"
        }
      },
      {
        "@xmlns:xsi": "http://www.w3.org/2001/XMLSchema-instance",
        "uid": "PM427070",
        "acteurRef": "PA696",
        "legislature": "13",
        "typeOrgane": "GA",
        "dateDebut": "2011-02-07T01:00:00.000+01:00",
        "datePublication": null,
        "dateFin": "2012-06-19T02:00:00.000+02:00",
        "preseance": "20",
        "nominPrincipale": "1",
        "infosQualite": {
          "codeQualite": "Membre",
          "libQualite": "Membre",
          "libQualiteSex": "Membre"
        },
        "organes": {
          "organeRef": "PO393298"
        }
      },
      {
        "@xmlns:xsi": "http://www.w3.org/2001/XMLSchema-instance",
        "uid": "PM427071",
        "acteurRef": "PA696",
        "legislature": "13",
        "typeOrgane": "GA",
        "dateDebut": "2011-02-07T01:00:00.000+01:00",
        "datePublication": null,
        "dateFin": "2012-06-19T02:00:00.000+02:00",
        "preseance": "20",
        "nominPrincipale": "1",
        "infosQualite": {
          "codeQualite": "Membre",
          "libQualite": "Membre",
          "libQualiteSex": "Membre"
        },
        "organes": {
          "organeRef": "PO393308"
        }
      },
      {
        "@xmlns:xsi": "http://www.w3.org/2001/XMLSchema-instance",
        "uid": "PM427072",
        "acteurRef": "PA696",
        "legislature": "13",
        "typeOrgane": "GA",
        "dateDebut": "2011-02-07T01:00:00.000+01:00",
        "datePublication": null,
        "dateFin": "2012-06-19T02:00:00.000+02:00",
        "preseance": "20",
        "nominPrincipale": "1",
        "infosQualite": {
          "codeQualite": "Membre",
          "libQualite": "Membre",
          "libQualiteSex": "Membre"
        },
        "organes": {
          "organeRef": "PO393313"
        }
      },
      {
        "@xmlns:xsi": "http://www.w3.org/2001/XMLSchema-instance",
        "uid": "PM427073",
        "acteurRef": "PA696",
        "legislature": "13",
        "typeOrgane": "GA",
        "dateDebut": "2011-02-07T01:00:00.000+01:00",
        "datePublication": null,
        "dateFin": "2012-06-19T02:00:00.000+02:00",
        "preseance": "20",
        "nominPrincipale": "1",
        "infosQualite": {
          "codeQualite": "Membre",
          "libQualite": "Membre",
          "libQualiteSex": "Membre"
        },
        "organes": {
          "organeRef": "PO393318"
        }
      },
      {
        "@xmlns:xsi": "http://www.w3.org/2001/XMLSchema-instance",
        "uid": "PM427074",
        "acteurRef": "PA696",
        "legislature": "13",
        "typeOrgane": "GA",
        "dateDebut": "2011-02-07T01:00:00.000+01:00",
        "datePublication": null,
        "dateFin": "2012-06-19T02:00:00.000+02:00",
        "preseance": "20",
        "nominPrincipale": "1",
        "infosQualite": {
          "codeQualite": "Membre",
          "libQualite": "Membre",
          "libQualiteSex": "Membre"
        },
        "organes": {
          "organeRef": "PO393323"
        }
      },
      {
        "@xmlns:xsi": "http://www.w3.org/2001/XMLSchema-instance",
        "uid": "PM427075",
        "acteurRef": "PA696",
        "legislature": "13",
        "typeOrgane": "GA",
        "dateDebut": "2011-02-07T01:00:00.000+01:00",
        "datePublication": null,
        "dateFin": "2012-06-19T02:00:00.000+02:00",
        "preseance": "20",
        "nominPrincipale": "1",
        "infosQualite": {
          "codeQualite": "Membre",
          "libQualite": "Membre",
          "libQualiteSex": "Membre"
        },
        "organes": {
          "organeRef": "PO393328"
        }
      },
      {
        "@xmlns:xsi": "http://www.w3.org/2001/XMLSchema-instance",
        "uid": "PM427076",
        "acteurRef": "PA696",
        "legislature": "13",
        "typeOrgane": "GA",
        "dateDebut": "2011-02-07T01:00:00.000+01:00",
        "datePublication": null,
        "dateFin": "2012-06-19T02:00:00.000+02:00",
        "preseance": "20",
        "nominPrincipale": "1",
        "infosQualite": {
          "codeQualite": "Membre",
          "libQualite": "Membre",
          "libQualiteSex": "Membre"
        },
        "organes": {
          "organeRef": "PO393333"
        }
      },
      {
        "@xmlns:xsi": "http://www.w3.org/2001/XMLSchema-instance",
        "uid": "PM427077",
        "acteurRef": "PA696",
        "legislature": "13",
        "typeOrgane": "GA",
        "dateDebut": "2011-02-07T01:00:00.000+01:00",
        "datePublication": null,
        "dateFin": "2012-06-19T02:00:00.000+02:00",
        "preseance": "20",
        "nominPrincipale": "1",
        "infosQualite": {
          "codeQualite": "Membre",
          "libQualite": "Membre",
          "libQualiteSex": "Membre"
        },
        "organes": {
          "organeRef": "PO393338"
        }
      },
      {
        "@xmlns:xsi": "http://www.w3.org/2001/XMLSchema-instance",
        "uid": "PM427078",
        "acteurRef": "PA696",
        "legislature": "13",
        "typeOrgane": "GA",
        "dateDebut": "2011-02-07T01:00:00.000+01:00",
        "datePublication": null,
        "dateFin": "2012-06-19T02:00:00.000+02:00",
        "preseance": "20",
        "nominPrincipale": "1",
        "infosQualite": {
          "codeQualite": "Membre",
          "libQualite": "Membre",
          "libQualiteSex": "Membre"
        },
        "organes": {
          "organeRef": "PO393343"
        }
      },
      {
        "@xmlns:xsi": "http://www.w3.org/2001/XMLSchema-instance",
        "uid": "PM427079",
        "acteurRef": "PA696",
        "legislature": "13",
        "typeOrgane": "GA",
        "dateDebut": "2011-02-07T01:00:00.000+01:00",
        "datePublication": null,
        "dateFin": "2012-06-19T02:00:00.000+02:00",
        "preseance": "20",
        "nominPrincipale": "1",
        "infosQualite": {
          "codeQualite": "Membre",
          "libQualite": "Membre",
          "libQualiteSex": "Membre"
        },
        "organes": {
          "organeRef": "PO393348"
        }
      },
      {
        "@xmlns:xsi": "http://www.w3.org/2001/XMLSchema-instance",
        "uid": "PM427080",
        "acteurRef": "PA696",
        "legislature": "13",
        "typeOrgane": "GA",
        "dateDebut": "2011-02-07T01:00:00.000+01:00",
        "datePublication": null,
        "dateFin": "2012-06-19T02:00:00.000+02:00",
        "preseance": "20",
        "nominPrincipale": "1",
        "infosQualite": {
          "codeQualite": "Membre",
          "libQualite": "Membre",
          "libQualiteSex": "Membre"
        },
        "organes": {
          "organeRef": "PO393363"
        }
      },
      {
        "@xmlns:xsi": "http://www.w3.org/2001/XMLSchema-instance",
        "uid": "PM427081",
        "acteurRef": "PA696",
        "legislature": "13",
        "typeOrgane": "GA",
        "dateDebut": "2011-02-07T01:00:00.000+01:00",
        "datePublication": null,
        "dateFin": "2012-06-19T02:00:00.000+02:00",
        "preseance": "20",
        "nominPrincipale": "1",
        "infosQualite": {
          "codeQualite": "Membre",
          "libQualite": "Membre",
          "libQualiteSex": "Membre"
        },
        "organes": {
          "organeRef": "PO393378"
        }
      },
      {
        "@xmlns:xsi": "http://www.w3.org/2001/XMLSchema-instance",
        "uid": "PM427082",
        "acteurRef": "PA696",
        "legislature": "13",
        "typeOrgane": "GA",
        "dateDebut": "2011-02-07T01:00:00.000+01:00",
        "datePublication": null,
        "dateFin": "2012-06-19T02:00:00.000+02:00",
        "preseance": "20",
        "nominPrincipale": "1",
        "infosQualite": {
          "codeQualite": "Membre",
          "libQualite": "Membre",
          "libQualiteSex": "Membre"
        },
        "organes": {
          "organeRef": "PO393383"
        }
      },
      {
        "@xmlns:xsi": "http://www.w3.org/2001/XMLSchema-instance",
        "uid": "PM427083",
        "acteurRef": "PA696",
        "legislature": "13",
        "typeOrgane": "GA",
        "dateDebut": "2011-02-07T01:00:00.000+01:00",
        "datePublication": null,
        "dateFin": "2012-06-19T02:00:00.000+02:00",
        "preseance": "20",
        "nominPrincipale": "1",
        "infosQualite": {
          "codeQualite": "Membre",
          "libQualite": "Membre",
          "libQualiteSex": "Membre"
        },
        "organes": {
          "organeRef": "PO393403"
        }
      },
      {
        "@xmlns:xsi": "http://www.w3.org/2001/XMLSchema-instance",
        "uid": "PM427084",
        "acteurRef": "PA696",
        "legislature": "13",
        "typeOrgane": "GA",
        "dateDebut": "2011-02-07T01:00:00.000+01:00",
        "datePublication": null,
        "dateFin": "2012-06-19T02:00:00.000+02:00",
        "preseance": "20",
        "nominPrincipale": "1",
        "infosQualite": {
          "codeQualite": "Membre",
          "libQualite": "Membre",
          "libQualiteSex": "Membre"
        },
        "organes": {
          "organeRef": "PO393408"
        }
      },
      {
        "@xmlns:xsi": "http://www.w3.org/2001/XMLSchema-instance",
        "uid": "PM427085",
        "acteurRef": "PA696",
        "legislature": "13",
        "typeOrgane": "GA",
        "dateDebut": "2011-02-07T01:00:00.000+01:00",
        "datePublication": null,
        "dateFin": "2012-06-19T02:00:00.000+02:00",
        "preseance": "20",
        "nominPrincipale": "1",
        "infosQualite": {
          "codeQualite": "Membre",
          "libQualite": "Membre",
          "libQualiteSex": "Membre"
        },
        "organes": {
          "organeRef": "PO393413"
        }
      },
      {
        "@xmlns:xsi": "http://www.w3.org/2001/XMLSchema-instance",
        "uid": "PM427086",
        "acteurRef": "PA696",
        "legislature": "13",
        "typeOrgane": "GA",
        "dateDebut": "2011-02-07T01:00:00.000+01:00",
        "datePublication": null,
        "dateFin": "2012-06-19T02:00:00.000+02:00",
        "preseance": "20",
        "nominPrincipale": "1",
        "infosQualite": {
          "codeQualite": "Membre",
          "libQualite": "Membre",
          "libQualiteSex": "Membre"
        },
        "organes": {
          "organeRef": "PO393418"
        }
      },
      {
        "@xmlns:xsi": "http://www.w3.org/2001/XMLSchema-instance",
        "uid": "PM427087",
        "acteurRef": "PA696",
        "legislature": "13",
        "typeOrgane": "GA",
        "dateDebut": "2011-02-07T01:00:00.000+01:00",
        "datePublication": null,
        "dateFin": "2012-06-19T02:00:00.000+02:00",
        "preseance": "20",
        "nominPrincipale": "1",
        "infosQualite": {
          "codeQualite": "Membre",
          "libQualite": "Membre",
          "libQualiteSex": "Membre"
        },
        "organes": {
          "organeRef": "PO393423"
        }
      },
      {
        "@xmlns:xsi": "http://www.w3.org/2001/XMLSchema-instance",
        "uid": "PM427088",
        "acteurRef": "PA696",
        "legislature": "13",
        "typeOrgane": "GA",
        "dateDebut": "2011-02-07T01:00:00.000+01:00",
        "datePublication": null,
        "dateFin": "2012-06-19T02:00:00.000+02:00",
        "preseance": "20",
        "nominPrincipale": "1",
        "infosQualite": {
          "codeQualite": "Membre",
          "libQualite": "Membre",
          "libQualiteSex": "Membre"
        },
        "organes": {
          "organeRef": "PO393443"
        }
      },
      {
        "@xmlns:xsi": "http://www.w3.org/2001/XMLSchema-instance",
        "uid": "PM427089",
        "acteurRef": "PA696",
        "legislature": "13",
        "typeOrgane": "GA",
        "dateDebut": "2011-02-07T01:00:00.000+01:00",
        "datePublication": null,
        "dateFin": "2012-06-19T02:00:00.000+02:00",
        "preseance": "20",
        "nominPrincipale": "1",
        "infosQualite": {
          "codeQualite": "Membre",
          "libQualite": "Membre",
          "libQualiteSex": "Membre"
        },
        "organes": {
          "organeRef": "PO393448"
        }
      },
      {
        "@xmlns:xsi": "http://www.w3.org/2001/XMLSchema-instance",
        "uid": "PM427090",
        "acteurRef": "PA696",
        "legislature": "13",
        "typeOrgane": "GA",
        "dateDebut": "2011-02-07T01:00:00.000+01:00",
        "datePublication": null,
        "dateFin": "2012-06-19T02:00:00.000+02:00",
        "preseance": "20",
        "nominPrincipale": "1",
        "infosQualite": {
          "codeQualite": "Membre",
          "libQualite": "Membre",
          "libQualiteSex": "Membre"
        },
        "organes": {
          "organeRef": "PO393468"
        }
      },
      {
        "@xmlns:xsi": "http://www.w3.org/2001/XMLSchema-instance",
        "uid": "PM427091",
        "acteurRef": "PA696",
        "legislature": "13",
        "typeOrgane": "GA",
        "dateDebut": "2011-02-07T01:00:00.000+01:00",
        "datePublication": null,
        "dateFin": "2012-06-19T02:00:00.000+02:00",
        "preseance": "20",
        "nominPrincipale": "1",
        "infosQualite": {
          "codeQualite": "Membre",
          "libQualite": "Membre",
          "libQualiteSex": "Membre"
        },
        "organes": {
          "organeRef": "PO393493"
        }
      },
      {
        "@xmlns:xsi": "http://www.w3.org/2001/XMLSchema-instance",
        "uid": "PM427092",
        "acteurRef": "PA696",
        "legislature": "13",
        "typeOrgane": "GA",
        "dateDebut": "2011-02-07T01:00:00.000+01:00",
        "datePublication": null,
        "dateFin": "2012-06-19T02:00:00.000+02:00",
        "preseance": "20",
        "nominPrincipale": "1",
        "infosQualite": {
          "codeQualite": "Membre",
          "libQualite": "Membre",
          "libQualiteSex": "Membre"
        },
        "organes": {
          "organeRef": "PO393508"
        }
      },
      {
        "@xmlns:xsi": "http://www.w3.org/2001/XMLSchema-instance",
        "uid": "PM427093",
        "acteurRef": "PA696",
        "legislature": "13",
        "typeOrgane": "GEVI",
        "dateDebut": "2011-02-07T01:00:00.000+01:00",
        "datePublication": null,
        "dateFin": "2012-06-19T02:00:00.000+02:00",
        "preseance": "20",
        "nominPrincipale": "1",
        "infosQualite": {
          "codeQualite": "Membre",
          "libQualite": "Membre",
          "libQualiteSex": "Membre"
        },
        "organes": {
          "organeRef": "PO392960"
        }
      },
      {
        "@xmlns:xsi": "http://www.w3.org/2001/XMLSchema-instance",
        "uid": "PM427094",
        "acteurRef": "PA696",
        "legislature": "13",
        "typeOrgane": "GEVI",
        "dateDebut": "2011-02-07T01:00:00.000+01:00",
        "datePublication": null,
        "dateFin": "2012-06-19T02:00:00.000+02:00",
        "preseance": "20",
        "nominPrincipale": "1",
        "infosQualite": {
          "codeQualite": "Membre",
          "libQualite": "Membre",
          "libQualiteSex": "Membre"
        },
        "organes": {
          "organeRef": "PO393141"
        }
      },
      {
        "@xmlns:xsi": "http://www.w3.org/2001/XMLSchema-instance",
        "uid": "PM427095",
        "acteurRef": "PA696",
        "legislature": "13",
        "typeOrgane": "GEVI",
        "dateDebut": "2011-02-07T01:00:00.000+01:00",
        "datePublication": null,
        "dateFin": "2012-06-19T02:00:00.000+02:00",
        "preseance": "20",
        "nominPrincipale": "1",
        "infosQualite": {
          "codeQualite": "Membre",
          "libQualite": "Membre",
          "libQualiteSex": "Membre"
        },
        "organes": {
          "organeRef": "PO393433"
        }
      },
      {
        "@xmlns:xsi": "http://www.w3.org/2001/XMLSchema-instance",
        "uid": "PM645428",
        "acteurRef": "PA696",
        "legislature": "14",
        "typeOrgane": "ASSEMBLEE",
        "dateDebut": "2012-06-20T02:00:00.000+02:00",
        "datePublication": null,
        "dateFin": "2017-06-20T02:00:00.000+02:00",
        "preseance": "50",
        "nominPrincipale": "1",
        "infosQualite": {
          "codeQualite": "membre",
          "libQualite": "membre",
          "libQualiteSex": "membre"
        },
        "organes": {
          "organeRef": "PO644420"
        },
        "suppleants": {
          "suppleant": {
            "dateDebut": "2012-06-20T02:00:00.000+02:00",
            "dateFin": "2017-06-20T02:00:00.000+02:00",
            "suppleantRef": "PA642688"
          }
        },
        "chambre": null,
        "election": {
          "lieu": {
            "region": "Nouvelle-Aquitaine",
            "regionType": "Métropolitain",
            "departement": "Charente-Maritime",
            "numDepartement": "17",
            "numCirco": "4"
          },
          "causeMandat": "élections générales",
          "refCirconscription": "PO644495"
        },
        "mandature": {
          "datePriseFonction": "2012-06-20T02:00:00.000+02:00",
          "causeFin": "Fin de législature",
          "premiereElection": "1",
          "placeHemicycle": null,
          "mandatRemplaceRef": null
        },
        "collaborateurs": null
      },
      {
        "uid": "PM656343",
        "acteurRef": "PA696",
        "legislature": "14",
        "typeOrgane": "GP",
        "dateDebut": "2012-06-26T02:00:00.000+02:00",
        "datePublication": "2012-06-27T02:00:00.000+02:00",
        "dateFin": "2012-11-27T01:00:00.000+01:00",
        "preseance": "20",
        "nominPrincipale": "1",
        "infosQualite": {
          "codeQualite": "Membre",
          "libQualite": "Membre du",
          "libQualiteSex": "Membre du"
        },
        "organes": {
          "organeRef": "PO656006"
        }
      },
      {
        "uid": "PM657096",
        "acteurRef": "PA696",
        "legislature": "14",
        "typeOrgane": "COMPER",
        "dateDebut": "2012-06-28T02:00:00.000+02:00",
        "datePublication": "2012-06-28T02:00:00.000+02:00",
        "dateFin": "2016-03-22T01:00:00.000+01:00",
        "preseance": "32",
        "nominPrincipale": "1",
        "infosQualite": {
          "codeQualite": "Membre",
          "libQualite": "Membre",
          "libQualiteSex": "Membre"
        },
        "organes": {
          "organeRef": "PO59051"
        }
      },
      {
        "uid": "PM676942",
        "acteurRef": "PA696",
        "legislature": "14",
        "typeOrgane": "DELEG",
        "dateDebut": "2012-07-25T02:00:00.000+02:00",
        "datePublication": "2012-07-25T02:00:00.000+02:00",
        "dateFin": "2017-06-20T02:00:00.000+02:00",
        "preseance": "20",
        "nominPrincipale": "0",
        "infosQualite": {
          "codeQualite": "Membre",
          "libQualite": "Membre",
          "libQualiteSex": "Membre"
        },
        "organes": {
          "organeRef": "PO675659"
        }
      },
      {
        "uid": "PM677345",
        "acteurRef": "PA696",
        "legislature": "14",
        "typeOrgane": "DELEG",
        "dateDebut": "2012-07-25T02:00:00.000+02:00",
        "datePublication": "2012-07-26T02:00:00.000+02:00",
        "dateFin": "2017-06-20T02:00:00.000+02:00",
        "preseance": "14",
        "nominPrincipale": "1",
        "infosQualite": {
          "codeQualite": "Secrétaire",
          "libQualite": "Secrétaire",
          "libQualiteSex": "Secrétaire"
        },
        "organes": {
          "organeRef": "PO675659"
        }
      },
      {
        "uid": "PM681388",
        "acteurRef": "PA696",
        "legislature": "14",
        "typeOrgane": "ORGEXTPARL",
        "dateDebut": "2012-10-11T02:00:00.000+02:00",
        "datePublication": "2012-10-12T02:00:00.000+02:00",
        "dateFin": "2017-06-20T02:00:00.000+02:00",
        "preseance": "20",
        "nominPrincipale": "1",
        "infosQualite": {
          "codeQualite": "Titulaire",
          "libQualite": "Membre titulaire",
          "libQualiteSex": "Membre titulaire"
        },
        "organes": {
          "organeRef": "PO425985"
        }
      },
      {
        "@xmlns:xsi": "http://www.w3.org/2001/XMLSchema-instance",
        "uid": "PM681595",
        "acteurRef": "PA696",
        "legislature": "14",
        "typeOrgane": "GA",
        "dateDebut": "2012-10-16T02:00:00.000+02:00",
        "datePublication": null,
        "dateFin": "2017-06-20T02:00:00.000+02:00",
        "preseance": "20",
        "nominPrincipale": "1",
        "infosQualite": {
          "codeQualite": "Membre",
          "libQualite": "Membre",
          "libQualiteSex": "Membre"
        },
        "organes": {
          "organeRef": "PO675813"
        }
      },
      {
        "@xmlns:xsi": "http://www.w3.org/2001/XMLSchema-instance",
        "uid": "PM681596",
        "acteurRef": "PA696",
        "legislature": "14",
        "typeOrgane": "GA",
        "dateDebut": "2012-10-16T02:00:00.000+02:00",
        "datePublication": null,
        "dateFin": "2017-06-20T02:00:00.000+02:00",
        "preseance": "20",
        "nominPrincipale": "1",
        "infosQualite": {
          "codeQualite": "Membre",
          "libQualite": "Membre",
          "libQualiteSex": "Membre"
        },
        "organes": {
          "organeRef": "PO675786"
        }
      },
      {
        "@xmlns:xsi": "http://www.w3.org/2001/XMLSchema-instance",
        "uid": "PM681597",
        "acteurRef": "PA696",
        "legislature": "14",
        "typeOrgane": "GA",
        "dateDebut": "2012-10-16T02:00:00.000+02:00",
        "datePublication": null,
        "dateFin": "2017-06-20T02:00:00.000+02:00",
        "preseance": "20",
        "nominPrincipale": "1",
        "infosQualite": {
          "codeQualite": "Membre",
          "libQualite": "Membre",
          "libQualiteSex": "Membre"
        },
        "organes": {
          "organeRef": "PO675795"
        }
      },
      {
        "@xmlns:xsi": "http://www.w3.org/2001/XMLSchema-instance",
        "uid": "PM681598",
        "acteurRef": "PA696",
        "legislature": "14",
        "typeOrgane": "GA",
        "dateDebut": "2012-10-16T02:00:00.000+02:00",
        "datePublication": null,
        "dateFin": "2017-06-20T02:00:00.000+02:00",
        "preseance": "20",
        "nominPrincipale": "1",
        "infosQualite": {
          "codeQualite": "Membre",
          "libQualite": "Membre",
          "libQualiteSex": "Membre"
        },
        "organes": {
          "organeRef": "PO675771"
        }
      },
      {
        "@xmlns:xsi": "http://www.w3.org/2001/XMLSchema-instance",
        "uid": "PM681599",
        "acteurRef": "PA696",
        "legislature": "14",
        "typeOrgane": "GA",
        "dateDebut": "2012-10-16T02:00:00.000+02:00",
        "datePublication": null,
        "dateFin": "2017-06-20T02:00:00.000+02:00",
        "preseance": "20",
        "nominPrincipale": "1",
        "infosQualite": {
          "codeQualite": "Membre",
          "libQualite": "Membre",
          "libQualiteSex": "Membre"
        },
        "organes": {
          "organeRef": "PO675723"
        }
      },
      {
        "@xmlns:xsi": "http://www.w3.org/2001/XMLSchema-instance",
        "uid": "PM681600",
        "acteurRef": "PA696",
        "legislature": "14",
        "typeOrgane": "GA",
        "dateDebut": "2012-10-16T02:00:00.000+02:00",
        "datePublication": null,
        "dateFin": "2017-06-20T02:00:00.000+02:00",
        "preseance": "20",
        "nominPrincipale": "1",
        "infosQualite": {
          "codeQualite": "Membre",
          "libQualite": "Membre",
          "libQualiteSex": "Membre"
        },
        "organes": {
          "organeRef": "PO675722"
        }
      },
      {
        "@xmlns:xsi": "http://www.w3.org/2001/XMLSchema-instance",
        "uid": "PM681601",
        "acteurRef": "PA696",
        "legislature": "14",
        "typeOrgane": "GA",
        "dateDebut": "2012-10-16T02:00:00.000+02:00",
        "datePublication": null,
        "dateFin": "2017-06-20T02:00:00.000+02:00",
        "preseance": "20",
        "nominPrincipale": "1",
        "infosQualite": {
          "codeQualite": "Membre",
          "libQualite": "Membre",
          "libQualiteSex": "Membre"
        },
        "organes": {
          "organeRef": "PO675796"
        }
      },
      {
        "@xmlns:xsi": "http://www.w3.org/2001/XMLSchema-instance",
        "uid": "PM681602",
        "acteurRef": "PA696",
        "legislature": "14",
        "typeOrgane": "GA",
        "dateDebut": "2012-10-16T02:00:00.000+02:00",
        "datePublication": null,
        "dateFin": "2017-06-20T02:00:00.000+02:00",
        "preseance": "20",
        "nominPrincipale": "1",
        "infosQualite": {
          "codeQualite": "Membre",
          "libQualite": "Membre",
          "libQualiteSex": "Membre"
        },
        "organes": {
          "organeRef": "PO675811"
        }
      },
      {
        "@xmlns:xsi": "http://www.w3.org/2001/XMLSchema-instance",
        "uid": "PM681603",
        "acteurRef": "PA696",
        "legislature": "14",
        "typeOrgane": "GA",
        "dateDebut": "2012-10-16T02:00:00.000+02:00",
        "datePublication": null,
        "dateFin": "2017-06-20T02:00:00.000+02:00",
        "preseance": "20",
        "nominPrincipale": "1",
        "infosQualite": {
          "codeQualite": "Membre",
          "libQualite": "Membre",
          "libQualiteSex": "Membre"
        },
        "organes": {
          "organeRef": "PO675699"
        }
      },
      {
        "@xmlns:xsi": "http://www.w3.org/2001/XMLSchema-instance",
        "uid": "PM681604",
        "acteurRef": "PA696",
        "legislature": "14",
        "typeOrgane": "GA",
        "dateDebut": "2012-10-16T02:00:00.000+02:00",
        "datePublication": null,
        "dateFin": "2017-06-20T02:00:00.000+02:00",
        "preseance": "20",
        "nominPrincipale": "1",
        "infosQualite": {
          "codeQualite": "Membre",
          "libQualite": "Membre",
          "libQualiteSex": "Membre"
        },
        "organes": {
          "organeRef": "PO675818"
        }
      },
      {
        "@xmlns:xsi": "http://www.w3.org/2001/XMLSchema-instance",
        "uid": "PM681605",
        "acteurRef": "PA696",
        "legislature": "14",
        "typeOrgane": "GA",
        "dateDebut": "2012-10-16T02:00:00.000+02:00",
        "datePublication": null,
        "dateFin": "2017-06-20T02:00:00.000+02:00",
        "preseance": "20",
        "nominPrincipale": "1",
        "infosQualite": {
          "codeQualite": "Membre",
          "libQualite": "Membre",
          "libQualiteSex": "Membre"
        },
        "organes": {
          "organeRef": "PO675726"
        }
      },
      {
        "@xmlns:xsi": "http://www.w3.org/2001/XMLSchema-instance",
        "uid": "PM681606",
        "acteurRef": "PA696",
        "legislature": "14",
        "typeOrgane": "GA",
        "dateDebut": "2012-10-16T02:00:00.000+02:00",
        "datePublication": null,
        "dateFin": "2017-06-20T02:00:00.000+02:00",
        "preseance": "20",
        "nominPrincipale": "1",
        "infosQualite": {
          "codeQualite": "Membre",
          "libQualite": "Membre",
          "libQualiteSex": "Membre"
        },
        "organes": {
          "organeRef": "PO675732"
        }
      },
      {
        "@xmlns:xsi": "http://www.w3.org/2001/XMLSchema-instance",
        "uid": "PM681607",
        "acteurRef": "PA696",
        "legislature": "14",
        "typeOrgane": "GA",
        "dateDebut": "2012-10-16T02:00:00.000+02:00",
        "datePublication": null,
        "dateFin": "2017-06-20T02:00:00.000+02:00",
        "preseance": "20",
        "nominPrincipale": "1",
        "infosQualite": {
          "codeQualite": "Membre",
          "libQualite": "Membre",
          "libQualiteSex": "Membre"
        },
        "organes": {
          "organeRef": "PO675750"
        }
      },
      {
        "@xmlns:xsi": "http://www.w3.org/2001/XMLSchema-instance",
        "uid": "PM681608",
        "acteurRef": "PA696",
        "legislature": "14",
        "typeOrgane": "GA",
        "dateDebut": "2012-10-16T02:00:00.000+02:00",
        "datePublication": null,
        "dateFin": "2017-06-20T02:00:00.000+02:00",
        "preseance": "20",
        "nominPrincipale": "1",
        "infosQualite": {
          "codeQualite": "Membre",
          "libQualite": "Membre",
          "libQualiteSex": "Membre"
        },
        "organes": {
          "organeRef": "PO675702"
        }
      },
      {
        "@xmlns:xsi": "http://www.w3.org/2001/XMLSchema-instance",
        "uid": "PM681609",
        "acteurRef": "PA696",
        "legislature": "14",
        "typeOrgane": "GA",
        "dateDebut": "2012-10-16T02:00:00.000+02:00",
        "datePublication": null,
        "dateFin": "2017-06-20T02:00:00.000+02:00",
        "preseance": "20",
        "nominPrincipale": "1",
        "infosQualite": {
          "codeQualite": "Membre",
          "libQualite": "Membre",
          "libQualiteSex": "Membre"
        },
        "organes": {
          "organeRef": "PO675808"
        }
      },
      {
        "@xmlns:xsi": "http://www.w3.org/2001/XMLSchema-instance",
        "uid": "PM681610",
        "acteurRef": "PA696",
        "legislature": "14",
        "typeOrgane": "GA",
        "dateDebut": "2012-10-16T02:00:00.000+02:00",
        "datePublication": null,
        "dateFin": "2017-06-20T02:00:00.000+02:00",
        "preseance": "20",
        "nominPrincipale": "1",
        "infosQualite": {
          "codeQualite": "Membre",
          "libQualite": "Membre",
          "libQualiteSex": "Membre"
        },
        "organes": {
          "organeRef": "PO675854"
        }
      },
      {
        "@xmlns:xsi": "http://www.w3.org/2001/XMLSchema-instance",
        "uid": "PM681611",
        "acteurRef": "PA696",
        "legislature": "14",
        "typeOrgane": "GA",
        "dateDebut": "2012-10-16T02:00:00.000+02:00",
        "datePublication": null,
        "dateFin": "2017-06-20T02:00:00.000+02:00",
        "preseance": "20",
        "nominPrincipale": "1",
        "infosQualite": {
          "codeQualite": "Membre",
          "libQualite": "Membre",
          "libQualiteSex": "Membre"
        },
        "organes": {
          "organeRef": "PO675836"
        }
      },
      {
        "@xmlns:xsi": "http://www.w3.org/2001/XMLSchema-instance",
        "uid": "PM681612",
        "acteurRef": "PA696",
        "legislature": "14",
        "typeOrgane": "GA",
        "dateDebut": "2012-10-16T02:00:00.000+02:00",
        "datePublication": null,
        "dateFin": "2017-06-20T02:00:00.000+02:00",
        "preseance": "20",
        "nominPrincipale": "1",
        "infosQualite": {
          "codeQualite": "Membre",
          "libQualite": "Membre",
          "libQualiteSex": "Membre"
        },
        "organes": {
          "organeRef": "PO675711"
        }
      },
      {
        "@xmlns:xsi": "http://www.w3.org/2001/XMLSchema-instance",
        "uid": "PM681613",
        "acteurRef": "PA696",
        "legislature": "14",
        "typeOrgane": "GA",
        "dateDebut": "2012-10-16T02:00:00.000+02:00",
        "datePublication": null,
        "dateFin": "2017-06-20T02:00:00.000+02:00",
        "preseance": "20",
        "nominPrincipale": "1",
        "infosQualite": {
          "codeQualite": "Membre",
          "libQualite": "Membre",
          "libQualiteSex": "Membre"
        },
        "organes": {
          "organeRef": "PO675791"
        }
      },
      {
        "@xmlns:xsi": "http://www.w3.org/2001/XMLSchema-instance",
        "uid": "PM681614",
        "acteurRef": "PA696",
        "legislature": "14",
        "typeOrgane": "GA",
        "dateDebut": "2012-10-16T02:00:00.000+02:00",
        "datePublication": null,
        "dateFin": "2017-06-20T02:00:00.000+02:00",
        "preseance": "20",
        "nominPrincipale": "1",
        "infosQualite": {
          "codeQualite": "Membre",
          "libQualite": "Membre",
          "libQualiteSex": "Membre"
        },
        "organes": {
          "organeRef": "PO675701"
        }
      },
      {
        "@xmlns:xsi": "http://www.w3.org/2001/XMLSchema-instance",
        "uid": "PM681615",
        "acteurRef": "PA696",
        "legislature": "14",
        "typeOrgane": "GA",
        "dateDebut": "2012-10-16T02:00:00.000+02:00",
        "datePublication": null,
        "dateFin": "2017-06-20T02:00:00.000+02:00",
        "preseance": "20",
        "nominPrincipale": "1",
        "infosQualite": {
          "codeQualite": "Membre",
          "libQualite": "Membre",
          "libQualiteSex": "Membre"
        },
        "organes": {
          "organeRef": "PO675849"
        }
      },
      {
        "@xmlns:xsi": "http://www.w3.org/2001/XMLSchema-instance",
        "uid": "PM681616",
        "acteurRef": "PA696",
        "legislature": "14",
        "typeOrgane": "GA",
        "dateDebut": "2012-10-16T02:00:00.000+02:00",
        "datePublication": null,
        "dateFin": "2017-06-20T02:00:00.000+02:00",
        "preseance": "20",
        "nominPrincipale": "1",
        "infosQualite": {
          "codeQualite": "Membre",
          "libQualite": "Membre",
          "libQualiteSex": "Membre"
        },
        "organes": {
          "organeRef": "PO675831"
        }
      },
      {
        "@xmlns:xsi": "http://www.w3.org/2001/XMLSchema-instance",
        "uid": "PM681617",
        "acteurRef": "PA696",
        "legislature": "14",
        "typeOrgane": "GA",
        "dateDebut": "2012-10-16T02:00:00.000+02:00",
        "datePublication": null,
        "dateFin": "2017-06-20T02:00:00.000+02:00",
        "preseance": "20",
        "nominPrincipale": "1",
        "infosQualite": {
          "codeQualite": "Membre",
          "libQualite": "Membre",
          "libQualiteSex": "Membre"
        },
        "organes": {
          "organeRef": "PO675776"
        }
      },
      {
        "@xmlns:xsi": "http://www.w3.org/2001/XMLSchema-instance",
        "uid": "PM681618",
        "acteurRef": "PA696",
        "legislature": "14",
        "typeOrgane": "GA",
        "dateDebut": "2012-10-16T02:00:00.000+02:00",
        "datePublication": null,
        "dateFin": "2017-06-20T02:00:00.000+02:00",
        "preseance": "20",
        "nominPrincipale": "1",
        "infosQualite": {
          "codeQualite": "Membre",
          "libQualite": "Membre",
          "libQualiteSex": "Membre"
        },
        "organes": {
          "organeRef": "PO675718"
        }
      },
      {
        "@xmlns:xsi": "http://www.w3.org/2001/XMLSchema-instance",
        "uid": "PM681619",
        "acteurRef": "PA696",
        "legislature": "14",
        "typeOrgane": "GA",
        "dateDebut": "2012-10-16T02:00:00.000+02:00",
        "datePublication": null,
        "dateFin": "2017-06-20T02:00:00.000+02:00",
        "preseance": "20",
        "nominPrincipale": "1",
        "infosQualite": {
          "codeQualite": "Membre",
          "libQualite": "Membre",
          "libQualiteSex": "Membre"
        },
        "organes": {
          "organeRef": "PO675705"
        }
      },
      {
        "@xmlns:xsi": "http://www.w3.org/2001/XMLSchema-instance",
        "uid": "PM681621",
        "acteurRef": "PA696",
        "legislature": "14",
        "typeOrgane": "GA",
        "dateDebut": "2012-10-16T02:00:00.000+02:00",
        "datePublication": null,
        "dateFin": "2017-06-20T02:00:00.000+02:00",
        "preseance": "20",
        "nominPrincipale": "1",
        "infosQualite": {
          "codeQualite": "Membre",
          "libQualite": "Membre",
          "libQualiteSex": "Membre"
        },
        "organes": {
          "organeRef": "PO675828"
        }
      },
      {
        "@xmlns:xsi": "http://www.w3.org/2001/XMLSchema-instance",
        "uid": "PM681622",
        "acteurRef": "PA696",
        "legislature": "14",
        "typeOrgane": "GA",
        "dateDebut": "2012-10-16T02:00:00.000+02:00",
        "datePublication": null,
        "dateFin": "2017-06-20T02:00:00.000+02:00",
        "preseance": "20",
        "nominPrincipale": "1",
        "infosQualite": {
          "codeQualite": "Membre",
          "libQualite": "Membre",
          "libQualiteSex": "Membre"
        },
        "organes": {
          "organeRef": "PO675700"
        }
      },
      {
        "@xmlns:xsi": "http://www.w3.org/2001/XMLSchema-instance",
        "uid": "PM681623",
        "acteurRef": "PA696",
        "legislature": "14",
        "typeOrgane": "GA",
        "dateDebut": "2012-10-16T02:00:00.000+02:00",
        "datePublication": null,
        "dateFin": "2017-06-20T02:00:00.000+02:00",
        "preseance": "20",
        "nominPrincipale": "1",
        "infosQualite": {
          "codeQualite": "Membre",
          "libQualite": "Membre",
          "libQualiteSex": "Membre"
        },
        "organes": {
          "organeRef": "PO675720"
        }
      },
      {
        "@xmlns:xsi": "http://www.w3.org/2001/XMLSchema-instance",
        "uid": "PM681624",
        "acteurRef": "PA696",
        "legislature": "14",
        "typeOrgane": "GA",
        "dateDebut": "2012-10-16T02:00:00.000+02:00",
        "datePublication": null,
        "dateFin": "2017-06-20T02:00:00.000+02:00",
        "preseance": "20",
        "nominPrincipale": "1",
        "infosQualite": {
          "codeQualite": "Membre",
          "libQualite": "Membre",
          "libQualiteSex": "Membre"
        },
        "organes": {
          "organeRef": "PO675781"
        }
      },
      {
        "@xmlns:xsi": "http://www.w3.org/2001/XMLSchema-instance",
        "uid": "PM681625",
        "acteurRef": "PA696",
        "legislature": "14",
        "typeOrgane": "GA",
        "dateDebut": "2012-10-16T02:00:00.000+02:00",
        "datePublication": null,
        "dateFin": "2017-06-20T02:00:00.000+02:00",
        "preseance": "20",
        "nominPrincipale": "1",
        "infosQualite": {
          "codeQualite": "Membre",
          "libQualite": "Membre",
          "libQualiteSex": "Membre"
        },
        "organes": {
          "organeRef": "PO675728"
        }
      },
      {
        "@xmlns:xsi": "http://www.w3.org/2001/XMLSchema-instance",
        "uid": "PM681626",
        "acteurRef": "PA696",
        "legislature": "14",
        "typeOrgane": "GA",
        "dateDebut": "2012-10-16T02:00:00.000+02:00",
        "datePublication": null,
        "dateFin": "2017-06-20T02:00:00.000+02:00",
        "preseance": "20",
        "nominPrincipale": "1",
        "infosQualite": {
          "codeQualite": "Membre",
          "libQualite": "Membre",
          "libQualiteSex": "Membre"
        },
        "organes": {
          "organeRef": "PO675784"
        }
      },
      {
        "@xmlns:xsi": "http://www.w3.org/2001/XMLSchema-instance",
        "uid": "PM681947",
        "acteurRef": "PA696",
        "legislature": "14",
        "typeOrgane": "ORGAINT",
        "dateDebut": "2012-10-16T02:00:00.000+02:00",
        "datePublication": null,
        "dateFin": "2017-06-20T02:00:00.000+02:00",
        "preseance": "42",
        "nominPrincipale": "1",
        "infosQualite": {
          "codeQualite": "Membre",
          "libQualite": "Membre",
          "libQualiteSex": "Membre"
        },
        "organes": {
          "organeRef": "PO201115"
        }
      },
      {
        "uid": "PM682721",
        "acteurRef": "PA696",
        "legislature": "14",
        "typeOrgane": "CMP",
        "dateDebut": "2012-10-18T02:00:00.000+02:00",
        "datePublication": "2012-10-24T02:00:00.000+02:00",
        "dateFin": "2012-11-15T01:00:00.000+01:00",
        "preseance": "20",
        "nominPrincipale": "1",
        "infosQualite": {
          "codeQualite": "Titulaire",
          "libQualite": "Membre titulaire",
          "libQualiteSex": "Membre titulaire"
        },
        "organes": {
          "organeRef": "PO679789"
        }
      },
      {
        "@xmlns:xsi": "http://www.w3.org/2001/XMLSchema-instance",
        "uid": "PM683132",
        "acteurRef": "PA696",
        "legislature": "14",
        "typeOrgane": "GA",
        "dateDebut": "2012-10-23T02:00:00.000+02:00",
        "datePublication": null,
        "dateFin": "2017-06-20T02:00:00.000+02:00",
        "preseance": "20",
        "nominPrincipale": "1",
        "infosQualite": {
          "codeQualite": "Membre",
          "libQualite": "Membre",
          "libQualiteSex": "Membre"
        },
        "organes": {
          "organeRef": "PO675801"
        }
      },
      {
        "@xmlns:xsi": "http://www.w3.org/2001/XMLSchema-instance",
        "uid": "PM683133",
        "acteurRef": "PA696",
        "legislature": "14",
        "typeOrgane": "GA",
        "dateDebut": "2012-10-23T02:00:00.000+02:00",
        "datePublication": null,
        "dateFin": "2017-06-20T02:00:00.000+02:00",
        "preseance": "20",
        "nominPrincipale": "1",
        "infosQualite": {
          "codeQualite": "Membre",
          "libQualite": "Membre",
          "libQualiteSex": "Membre"
        },
        "organes": {
          "organeRef": "PO675760"
        }
      },
      {
        "@xmlns:xsi": "http://www.w3.org/2001/XMLSchema-instance",
        "uid": "PM684916",
        "acteurRef": "PA696",
        "legislature": "14",
        "typeOrgane": "GA",
        "dateDebut": "2012-11-21T01:00:00.000+01:00",
        "datePublication": null,
        "dateFin": "2017-06-20T02:00:00.000+02:00",
        "preseance": "8",
        "nominPrincipale": "1",
        "infosQualite": {
          "codeQualite": "Vice-Président",
          "libQualite": "Vice-Président",
          "libQualiteSex": "Vice-Président"
        },
        "organes": {
          "organeRef": "PO675796"
        }
      },
      {
        "uid": "PM684973",
        "acteurRef": "PA696",
        "legislature": "14",
        "typeOrgane": "GP",
        "dateDebut": "2012-11-27T01:00:00.000+01:00",
        "datePublication": "2012-11-28T01:00:00.000+01:00",
        "dateFin": "2013-01-15T01:00:00.000+01:00",
        "preseance": "20",
        "nominPrincipale": "1",
        "infosQualite": {
          "codeQualite": "Membre",
          "libQualite": "Membre du",
          "libQualiteSex": "Membre du"
        },
        "organes": {
          "organeRef": "PO684957"
        }
      },
      {
        "@xmlns:xsi": "http://www.w3.org/2001/XMLSchema-instance",
        "uid": "PM685440",
        "acteurRef": "PA696",
        "legislature": null,
        "typeOrgane": "PARPOL",
        "dateDebut": "2012-12-01T01:00:00.000+01:00",
        "datePublication": null,
        "dateFin": "2015-11-30T01:00:00.000+01:00",
        "preseance": "5",
        "nominPrincipale": "1",
        "infosQualite": {
          "codeQualite": "Membre",
          "libQualite": "Membre",
          "libQualiteSex": "Membre"
        },
        "organes": {
          "organeRef": "PO684942"
        }
      },
      {
        "@xmlns:xsi": "http://www.w3.org/2001/XMLSchema-instance",
        "uid": "PM687004",
        "acteurRef": "PA696",
        "legislature": "14",
        "typeOrgane": "GA",
        "dateDebut": "2012-12-13T01:00:00.000+01:00",
        "datePublication": null,
        "dateFin": "2017-06-20T02:00:00.000+02:00",
        "preseance": "8",
        "nominPrincipale": "1",
        "infosQualite": {
          "codeQualite": "Vice-Président",
          "libQualite": "Vice-Président",
          "libQualiteSex": "Vice-Président"
        },
        "organes": {
          "organeRef": "PO675760"
        }
      },
      {
        "@xmlns:xsi": "http://www.w3.org/2001/XMLSchema-instance",
        "uid": "PM687028",
        "acteurRef": "PA696",
        "legislature": "14",
        "typeOrgane": "GA",
        "dateDebut": "2012-12-11T01:00:00.000+01:00",
        "datePublication": null,
        "dateFin": "2017-06-20T02:00:00.000+02:00",
        "preseance": "8",
        "nominPrincipale": "1",
        "infosQualite": {
          "codeQualite": "Vice-Président",
          "libQualite": "Vice-Président",
          "libQualiteSex": "Vice-Président"
        },
        "organes": {
          "organeRef": "PO675711"
        }
      },
      {
        "uid": "PM687939",
        "acteurRef": "PA696",
        "legislature": "14",
        "typeOrgane": "GP",
        "dateDebut": "2013-01-16T01:00:00.000+01:00",
        "datePublication": "2013-01-16T01:00:00.000+01:00",
        "dateFin": "2015-06-01T02:00:00.000+02:00",
        "preseance": "20",
        "nominPrincipale": "1",
        "infosQualite": {
          "codeQualite": "Membre",
          "libQualite": "Membre du",
          "libQualiteSex": "Membre du"
        },
        "organes": {
          "organeRef": "PO656006"
        }
      },
      {
        "@xmlns:xsi": "http://www.w3.org/2001/XMLSchema-instance",
        "uid": "PM688864",
        "acteurRef": "PA696",
        "legislature": "14",
        "typeOrgane": "GE",
        "dateDebut": "2013-01-16T01:00:00.000+01:00",
        "datePublication": null,
        "dateFin": "2017-06-20T02:00:00.000+02:00",
        "preseance": "20",
        "nominPrincipale": "1",
        "infosQualite": {
          "codeQualite": "Membre",
          "libQualite": "Membre",
          "libQualiteSex": "Membre"
        },
        "organes": {
          "organeRef": "PO686519"
        }
      },
      {
        "@xmlns:xsi": "http://www.w3.org/2001/XMLSchema-instance",
        "uid": "PM689043",
        "acteurRef": "PA696",
        "legislature": "14",
        "typeOrgane": "GE",
        "dateDebut": "2013-01-29T01:00:00.000+01:00",
        "datePublication": null,
        "dateFin": "2017-06-20T02:00:00.000+02:00",
        "preseance": "8",
        "nominPrincipale": "1",
        "infosQualite": {
          "codeQualite": "Vice-Président",
          "libQualite": "Vice-Président",
          "libQualiteSex": "Vice-Président"
        },
        "organes": {
          "organeRef": "PO686541"
        }
      },
      {
        "@xmlns:xsi": "http://www.w3.org/2001/XMLSchema-instance",
        "uid": "PM689203",
        "acteurRef": "PA696",
        "legislature": "14",
        "typeOrgane": "GE",
        "dateDebut": "2013-02-01T01:00:00.000+01:00",
        "datePublication": null,
        "dateFin": "2017-06-20T02:00:00.000+02:00",
        "preseance": "20",
        "nominPrincipale": "1",
        "infosQualite": {
          "codeQualite": "Membre",
          "libQualite": "Membre",
          "libQualiteSex": "Membre"
        },
        "organes": {
          "organeRef": "PO686510"
        }
      },
      {
        "@xmlns:xsi": "http://www.w3.org/2001/XMLSchema-instance",
        "uid": "PM689470",
        "acteurRef": "PA696",
        "legislature": "14",
        "typeOrgane": "GE",
        "dateDebut": "2013-01-23T01:00:00.000+01:00",
        "datePublication": null,
        "dateFin": "2017-06-20T02:00:00.000+02:00",
        "preseance": "20",
        "nominPrincipale": "1",
        "infosQualite": {
          "codeQualite": "Membre",
          "libQualite": "Membre",
          "libQualiteSex": "Membre"
        },
        "organes": {
          "organeRef": "PO687109"
        }
      },
      {
        "@xmlns:xsi": "http://www.w3.org/2001/XMLSchema-instance",
        "uid": "PM690869",
        "acteurRef": "PA696",
        "legislature": "14",
        "typeOrgane": "GE",
        "dateDebut": "2013-02-06T01:00:00.000+01:00",
        "datePublication": null,
        "dateFin": "2017-06-20T02:00:00.000+02:00",
        "preseance": "20",
        "nominPrincipale": "1",
        "infosQualite": {
          "codeQualite": "Membre",
          "libQualite": "Membre",
          "libQualiteSex": "Membre"
        },
        "organes": {
          "organeRef": "PO686451"
        }
      },
      {
        "@xmlns:xsi": "http://www.w3.org/2001/XMLSchema-instance",
        "uid": "PM691329",
        "acteurRef": "PA696",
        "legislature": "14",
        "typeOrgane": "GE",
        "dateDebut": "2013-02-12T01:00:00.000+01:00",
        "datePublication": null,
        "dateFin": "2017-06-20T02:00:00.000+02:00",
        "preseance": "20",
        "nominPrincipale": "1",
        "infosQualite": {
          "codeQualite": "Membre",
          "libQualite": "Membre",
          "libQualiteSex": "Membre"
        },
        "organes": {
          "organeRef": "PO687120"
        }
      },
      {
        "@xmlns:xsi": "http://www.w3.org/2001/XMLSchema-instance",
        "uid": "PM692045",
        "acteurRef": "PA696",
        "legislature": "14",
        "typeOrgane": "GE",
        "dateDebut": "2013-02-26T01:00:00.000+01:00",
        "datePublication": null,
        "dateFin": "2017-06-20T02:00:00.000+02:00",
        "preseance": "20",
        "nominPrincipale": "1",
        "infosQualite": {
          "codeQualite": "Membre",
          "libQualite": "Membre",
          "libQualiteSex": "Membre"
        },
        "organes": {
          "organeRef": "PO687381"
        }
      },
      {
        "@xmlns:xsi": "http://www.w3.org/2001/XMLSchema-instance",
        "uid": "PM692134",
        "acteurRef": "PA696",
        "legislature": "14",
        "typeOrgane": "GA",
        "dateDebut": "2012-12-11T01:00:00.000+01:00",
        "datePublication": null,
        "dateFin": "2017-06-20T02:00:00.000+02:00",
        "preseance": "8",
        "nominPrincipale": "1",
        "infosQualite": {
          "codeQualite": "Vice-Président",
          "libQualite": "Vice-Président",
          "libQualiteSex": "Vice-Président"
        },
        "organes": {
          "organeRef": "PO675801"
        }
      },
      {
        "@xmlns:xsi": "http://www.w3.org/2001/XMLSchema-instance",
        "uid": "PM692393",
        "acteurRef": "PA696",
        "legislature": "14",
        "typeOrgane": "GE",
        "dateDebut": "2013-02-26T01:00:00.000+01:00",
        "datePublication": null,
        "dateFin": "2017-06-20T02:00:00.000+02:00",
        "preseance": "20",
        "nominPrincipale": "1",
        "infosQualite": {
          "codeQualite": "Membre",
          "libQualite": "Membre",
          "libQualiteSex": "Membre"
        },
        "organes": {
          "organeRef": "PO686589"
        }
      },
      {
        "@xmlns:xsi": "http://www.w3.org/2001/XMLSchema-instance",
        "uid": "PM692917",
        "acteurRef": "PA696",
        "legislature": "14",
        "typeOrgane": "GE",
        "dateDebut": "2013-03-25T01:00:00.000+01:00",
        "datePublication": null,
        "dateFin": "2017-06-20T02:00:00.000+02:00",
        "preseance": "20",
        "nominPrincipale": "1",
        "infosQualite": {
          "codeQualite": "Membre",
          "libQualite": "Membre",
          "libQualiteSex": "Membre"
        },
        "organes": {
          "organeRef": "PO689030"
        }
      },
      {
        "@xmlns:xsi": "http://www.w3.org/2001/XMLSchema-instance",
        "uid": "PM693260",
        "acteurRef": "PA696",
        "legislature": "14",
        "typeOrgane": "GE",
        "dateDebut": "2013-04-03T02:00:00.000+02:00",
        "datePublication": null,
        "dateFin": "2017-06-20T02:00:00.000+02:00",
        "preseance": "20",
        "nominPrincipale": "1",
        "infosQualite": {
          "codeQualite": "Membre",
          "libQualite": "Membre",
          "libQualiteSex": "Membre"
        },
        "organes": {
          "organeRef": "PO689000"
        }
      },
      {
        "@xmlns:xsi": "http://www.w3.org/2001/XMLSchema-instance",
        "uid": "PM693452",
        "acteurRef": "PA696",
        "legislature": "14",
        "typeOrgane": "GE",
        "dateDebut": "2013-04-10T02:00:00.000+02:00",
        "datePublication": null,
        "dateFin": "2017-06-20T02:00:00.000+02:00",
        "preseance": "20",
        "nominPrincipale": "1",
        "infosQualite": {
          "codeQualite": "Membre",
          "libQualite": "Membre",
          "libQualiteSex": "Membre"
        },
        "organes": {
          "organeRef": "PO689018"
        }
      },
      {
        "@xmlns:xsi": "http://www.w3.org/2001/XMLSchema-instance",
        "uid": "PM693663",
        "acteurRef": "PA696",
        "legislature": "14",
        "typeOrgane": "GE",
        "dateDebut": "2013-04-10T02:00:00.000+02:00",
        "datePublication": null,
        "dateFin": "2017-06-20T02:00:00.000+02:00",
        "preseance": "20",
        "nominPrincipale": "1",
        "infosQualite": {
          "codeQualite": "Membre",
          "libQualite": "Membre",
          "libQualiteSex": "Membre"
        },
        "organes": {
          "organeRef": "PO686389"
        }
      },
      {
        "@xmlns:xsi": "http://www.w3.org/2001/XMLSchema-instance",
        "uid": "PM695527",
        "acteurRef": "PA696",
        "legislature": "14",
        "typeOrgane": "GE",
        "dateDebut": "2013-06-24T02:00:00.000+02:00",
        "datePublication": null,
        "dateFin": "2017-06-20T02:00:00.000+02:00",
        "preseance": "20",
        "nominPrincipale": "1",
        "infosQualite": {
          "codeQualite": "Membre",
          "libQualite": "Membre",
          "libQualiteSex": "Membre"
        },
        "organes": {
          "organeRef": "PO688296"
        }
      },
      {
        "@xmlns:xsi": "http://www.w3.org/2001/XMLSchema-instance",
        "uid": "PM696999",
        "acteurRef": "PA696",
        "legislature": "14",
        "typeOrgane": "GE",
        "dateDebut": "2013-09-18T02:00:00.000+02:00",
        "datePublication": null,
        "dateFin": "2017-06-20T02:00:00.000+02:00",
        "preseance": "20",
        "nominPrincipale": "1",
        "infosQualite": {
          "codeQualite": "Membre",
          "libQualite": "Membre",
          "libQualiteSex": "Membre"
        },
        "organes": {
          "organeRef": "PO695581"
        }
      },
      {
        "@xmlns:xsi": "http://www.w3.org/2001/XMLSchema-instance",
        "uid": "PM698423",
        "acteurRef": "PA696",
        "legislature": "14",
        "typeOrgane": "GE",
        "dateDebut": "2013-11-13T01:00:00.000+01:00",
        "datePublication": null,
        "dateFin": "2017-06-20T02:00:00.000+02:00",
        "preseance": "20",
        "nominPrincipale": "1",
        "infosQualite": {
          "codeQualite": "Membre",
          "libQualite": "Membre",
          "libQualiteSex": "Membre"
        },
        "organes": {
          "organeRef": "PO686878"
        }
      },
      {
        "@xmlns:xsi": "http://www.w3.org/2001/XMLSchema-instance",
        "uid": "PM704533",
        "acteurRef": "PA696",
        "legislature": "14",
        "typeOrgane": "MISINFOPRE",
        "dateDebut": "2014-11-06T01:00:00.000+01:00",
        "datePublication": "2014-11-07T01:00:00.000+01:00",
        "dateFin": "2017-03-28T02:00:00.000+02:00",
        "preseance": "20",
        "nominPrincipale": "1",
        "infosQualite": {
          "codeQualite": "Membre",
          "libQualite": "Membre",
          "libQualiteSex": "Membre"
        },
        "organes": {
          "organeRef": "PO703871"
        },
        "libelle": null,
        "missionSuivanteRef": null,
        "missionPrecedenteRef": null
      },
      {
        "@xmlns:xsi": "http://www.w3.org/2001/XMLSchema-instance",
        "uid": "PM704754",
        "acteurRef": "PA696",
        "legislature": "14",
        "typeOrgane": "MINISTERE",
        "dateDebut": "2014-11-25T01:00:00.000+01:00",
        "datePublication": "2014-11-24T01:00:00.000+01:00",
        "dateFin": "2015-05-24T02:00:00.000+02:00",
        "preseance": "1",
        "nominPrincipale": "1",
        "infosQualite": {
          "codeQualite": "en mission",
          "libQualite": "en mission",
          "libQualiteSex": "en mission"
        },
        "organes": {
          "organeRef": "PO702908"
        },
        "libelle": "L'avenir des trains d'équilibre du territoire",
        "missionSuivanteRef": null,
        "missionPrecedenteRef": null
      },
      {
        "@xmlns:xsi": "http://www.w3.org/2001/XMLSchema-instance",
        "uid": "PM704837",
        "acteurRef": "PA696",
        "legislature": "14",
        "typeOrgane": "GE",
        "dateDebut": "2014-11-26T01:00:00.000+01:00",
        "datePublication": null,
        "dateFin": "2017-06-20T02:00:00.000+02:00",
        "preseance": "20",
        "nominPrincipale": "0",
        "infosQualite": {
          "codeQualite": "Membre",
          "libQualite": "Membre",
          "libQualiteSex": "Membre"
        },
        "organes": {
          "organeRef": "PO704831"
        }
      },
      {
        "@xmlns:xsi": "http://www.w3.org/2001/XMLSchema-instance",
        "uid": "PM704838",
        "acteurRef": "PA696",
        "legislature": "14",
        "typeOrgane": "GE",
        "dateDebut": "2014-11-26T01:00:00.000+01:00",
        "datePublication": null,
        "dateFin": "2017-06-20T02:00:00.000+02:00",
        "preseance": "1",
        "nominPrincipale": "1",
        "infosQualite": {
          "codeQualite": "Président",
          "libQualite": "Président",
          "libQualiteSex": "Président"
        },
        "organes": {
          "organeRef": "PO704831"
        }
      },
      {
        "@xmlns:xsi": "http://www.w3.org/2001/XMLSchema-instance",
        "uid": "PM706328",
        "acteurRef": "PA696",
        "legislature": "14",
        "typeOrgane": "MISINFOPRE",
        "dateDebut": "2015-02-12T01:00:00.000+01:00",
        "datePublication": "2015-02-12T01:00:00.000+01:00",
        "dateFin": "2017-03-28T02:00:00.000+02:00",
        "preseance": "1",
        "nominPrincipale": "1",
        "infosQualite": {
          "codeQualite": "Président",
          "libQualite": "Président",
          "libQualiteSex": "Président"
        },
        "organes": {
          "organeRef": "PO703871"
        },
        "libelle": null,
        "missionSuivanteRef": null,
        "missionPrecedenteRef": null
      },
      {
        "uid": "PM708160",
        "acteurRef": "PA696",
        "legislature": "14",
        "typeOrgane": "GP",
        "dateDebut": "2015-06-02T02:00:00.000+02:00",
        "datePublication": "2015-06-02T02:00:00.000+02:00",
        "dateFin": "2017-06-20T02:00:00.000+02:00",
        "preseance": "20",
        "nominPrincipale": "1",
        "infosQualite": {
          "codeQualite": "Membre",
          "libQualite": "Membre du",
          "libQualiteSex": "Membre du"
        },
        "organes": {
          "organeRef": "PO707869"
        }
      },
      {
        "@xmlns:xsi": "http://www.w3.org/2001/XMLSchema-instance",
        "uid": "PM710422",
        "acteurRef": "PA696",
        "legislature": null,
        "typeOrgane": "PARPOL",
        "dateDebut": "2015-12-01T01:00:00.000+01:00",
        "datePublication": null,
        "dateFin": "2017-06-20T02:00:00.000+02:00",
        "preseance": "5",
        "nominPrincipale": "1",
        "infosQualite": {
          "codeQualite": "Membre",
          "libQualite": "Membre",
          "libQualiteSex": "Membre"
        },
        "organes": {
          "organeRef": "PO710396"
        }
      },
      {
        "uid": "PM712039",
        "acteurRef": "PA696",
        "legislature": "14",
        "typeOrgane": "COMPER",
        "dateDebut": "2016-03-23T01:00:00.000+01:00",
        "datePublication": "2016-03-23T01:00:00.000+01:00",
        "dateFin": "2016-04-29T02:00:00.000+02:00",
        "preseance": "32",
        "nominPrincipale": "1",
        "infosQualite": {
          "codeQualite": "Membre",
          "libQualite": "Membre",
          "libQualiteSex": "Membre"
        },
        "organes": {
          "organeRef": "PO419865"
        }
      },
      {
        "uid": "PM712523",
        "acteurRef": "PA696",
        "legislature": "14",
        "typeOrgane": "COMPER",
        "dateDebut": "2016-04-29T02:00:00.000+02:00",
        "datePublication": "2016-04-29T02:00:00.000+02:00",
        "dateFin": "2017-06-20T02:00:00.000+02:00",
        "preseance": "32",
        "nominPrincipale": "1",
        "infosQualite": {
          "codeQualite": "Membre",
          "libQualite": "Membre",
          "libQualiteSex": "Membre"
        },
        "organes": {
          "organeRef": "PO59051"
        }
      },
      {
        "@xmlns:xsi": "http://www.w3.org/2001/XMLSchema-instance",
        "uid": "PM15388407",
        "acteurRef": "PA696",
        "legislature": null,
        "typeOrgane": "GOUVERNEMENT",
        "dateDebut": "2007-06-19T02:00:00.000+02:00",
        "datePublication": "2007-06-20T02:00:00.000+02:00",
        "dateFin": "2010-11-13T01:00:00.000+01:00",
        "preseance": "50",
        "nominPrincipale": "1",
        "infosQualite": {
          "codeQualite": "membre",
          "libQualite": "membre",
          "libQualiteSex": "membre"
        },
        "organes": {
          "organeRef": "PO384206"
        }
      }
    ]
  },
  "@xmlns:xsi": "http://www.w3.org/2001/XMLSchema-instance"
}