{
  "uid": {
    "@xsi:type": "IdActeur_type",
    "#text": "PA267553"
  },
  "etatCivil": {
    "ident": {
      "civ": "Mme",
      "prenom": "Nadine",
      "nom": "Morano",
      "alpha": "Morano",
      "trigramme": null
    },
    "infoNaissance": {
      "dateNais": "1963-11-06T01:00:00.000+01:00",
      "villeNais": "Nancy",
      "depNais": "Meurthe-et-Moselle",
      "paysNais": "France"
    },
    "dateDeces": null
  },
  "profession": {
    "libelleCourant": "Responsable de la communication du parc naturel régional de Lorraine",
    "socProcINSEE": {
      "catSocPro": "Cadres d'entreprise",
      "famSocPro": "Cadres et professions intellectuelles supérieures"
    }
  },
  "uri_hatvp": null,
  "adresses": {
    "adresse": [
      {
        "@xsi:type": "AdressePostale_Type",
        "uid": "AD283073",
        "type": "2",
        "typeLibelle": "Adresse publiée de circonscription",
        "poids": "21",
        "adresseDeRattachement": null,
        "intitule": "Permanence parlementaire,",
        "numeroRue": "1",
        "nomRue": "Rue Saint-Vaast,",
        "complementAdresse": "BP 158,",
        "codePostal": "54206",
        "ville": "Toul cedex"
      },
      {
        "@xsi:type": "AdresseTelephonique_Type",
        "uid": "AD283074",
        "type": "11",
        "typeLibelle": "Téléphone",
        "poids": "21",
        "adresseDeRattachement": "AD283073",
        "valElec": "03 83 64 24 43"
      },
      {
        "@xsi:type": "AdresseTelephonique_Type",
        "uid": "AD293425",
        "type": "12",
        "typeLibelle": "Télécopie",
        "poids": "21",
        "adresseDeRattachement": "AD283073",
        "valElec": "03 83 63 13 95"
      },
      {
        "@xsi:type": "AdresseSiteWeb_Type",
        "uid": "AD294348",
        "type": "22",
        "typeLibelle": "Site internet",
        "poids": null,
        "adresseDeRattachement": null,
        "valElec": "www.nadine-morano.com"
      },
      {
        "@xsi:type": "AdressePostale_Type",
        "uid": "AD386830",
        "type": "0",
        "typeLibelle": "Adresse officielle",
        "poids": "1",
        "adresseDeRattachement": null,
        "intitule": "Assemblée nationale,",
        "numeroRue": "126",
        "nomRue": "Rue de l'Université,",
        "complementAdresse": null,
        "codePostal": "75355",
        "ville": "Paris 07 SP"
      },
      {
        "@xsi:type": "AdresseMail_Type",
        "uid": "AD391934",
        "type": "15",
        "typeLibelle": "Mèl",
        "poids": null,
        "adresseDeRattachement": null,
        "valElec": "nmorano@assemblee-nationale.fr"
      }
    ]
  },
  "mandats": {
    "mandat": [
      {
        "@xmlns:xsi": "http://www.w3.org/2001/XMLSchema-instance",
        "uid": "PM386421",
        "acteurRef": "PA267553",
        "legislature": "13",
        "typeOrgane": "ASSEMBLEE",
        "dateDebut": "2007-06-20T02:00:00.000+02:00",
        "datePublication": null,
        "dateFin": "2008-04-19T02:00:00.000+02:00",
        "preseance": "50",
        "nominPrincipale": "1",
        "infosQualite": {
          "codeQualite": "membre",
          "libQualite": "membre",
          "libQualiteSex": "membre"
        },
        "organes": {
          "organeRef": "PO384266"
        },
        "suppleants": {
          "suppleant": {
            "dateDebut": "2007-06-20T02:00:00.000+02:00",
            "dateFin": "2008-04-19T02:00:00.000+02:00",
            "suppleantRef": "PA343385"
          }
        },
        "chambre": null,
        "election": {
          "lieu": {
            "region": "Grand Est",
            "regionType": "Métropolitain",
            "departement": "Meurthe-et-Moselle",
            "numDepartement": "54",
            "numCirco": "5"
          },
          "causeMandat": "élections générales",
          "refCirconscription": "PO384519"
        },
        "mandature": {
          "datePriseFonction": "2007-06-20T02:00:00.000+02:00",
          "causeFin": "Nomination comme membre du Gouvernement",
          "premiereElection": "1",
          "placeHemicycle": null,
          "mandatRemplaceRef": null
        },
        "collaborateurs": null
      },
      {
        "@xmlns:xsi": "http://www.w3.org/2001/XMLSchema-instance",
        "uid": "PM387409",
        "acteurRef": "PA267553",
        "legislature": "13",
        "typeOrgane": "GP",
        "dateDebut": "2007-06-20T02:00:00.000+02:00",
        "datePublication": null,
        "dateFin": "2007-06-26T02:00:00.000+02:00",
        "preseance": "28",
        "nominPrincipale": "1",
        "infosQualite": {
          "codeQualite": "Député non-inscrit",
          "libQualite": "Député non-inscrit",
          "libQualiteSex": "Députée non-inscrite"
        },
        "organes": {
          "organeRef": "PO387155"
        }
      },
      {
        "uid": "PM389922",
        "acteurRef": "PA267553",
        "legislature": "13",
        "typeOrgane": "GP",
        "dateDebut": "2007-06-27T02:00:00.000+02:00",
        "datePublication": "2007-06-27T02:00:00.000+02:00",
        "dateFin": "2008-04-19T02:00:00.000+02:00",
        "preseance": "20",
        "nominPrincipale": "1",
        "infosQualite": {
          "codeQualite": "Membre",
          "libQualite": "Membre du",
          "libQualiteSex": "Membre du"
        },
        "organes": {
          "organeRef": "PO389395"
        }
      },
      {
        "uid": "PM390654",
        "acteurRef": "PA267553",
        "legislature": "13",
        "typeOrgane": "COMPER",
        "dateDebut": "2007-06-27T02:00:00.000+02:00",
        "datePublication": "2007-06-28T02:00:00.000+02:00",
        "dateFin": "2008-04-19T02:00:00.000+02:00",
        "preseance": "32",
        "nominPrincipale": "1",
        "infosQualite": {
          "codeQualite": "Membre",
          "libQualite": "Membre",
          "libQualiteSex": "Membre"
        },
        "organes": {
          "organeRef": "PO59046"
        }
      },
      {
        "@xmlns:xsi": "http://www.w3.org/2001/XMLSchema-instance",
        "uid": "PM395722",
        "acteurRef": "PA267553",
        "legislature": "13",
        "typeOrgane": "GA",
        "dateDebut": "2007-09-27T02:00:00.000+02:00",
        "datePublication": null,
        "dateFin": "2008-04-19T02:00:00.000+02:00",
        "preseance": "20",
        "nominPrincipale": "1",
        "infosQualite": {
          "codeQualite": "Membre",
          "libQualite": "Membre",
          "libQualiteSex": "Membre"
        },
        "organes": {
          "organeRef": "PO393443"
        }
      },
      {
        "@xmlns:xsi": "http://www.w3.org/2001/XMLSchema-instance",
        "uid": "PM395723",
        "acteurRef": "PA267553",
        "legislature": "13",
        "typeOrgane": "GA",
        "dateDebut": "2007-09-27T02:00:00.000+02:00",
        "datePublication": null,
        "dateFin": "2008-04-14T02:00:00.000+02:00",
        "preseance": "1",
        "nominPrincipale": "1",
        "infosQualite": {
          "codeQualite": "Président",
          "libQualite": "Président",
          "libQualiteSex": "Présidente"
        },
        "organes": {
          "organeRef": "PO393443"
        }
      },
      {
        "uid": "PM399641",
        "acteurRef": "PA267553",
        "legislature": "13",
        "typeOrgane": "CNPE",
        "dateDebut": "2007-10-16T02:00:00.000+02:00",
        "datePublication": "2007-10-17T02:00:00.000+02:00",
        "dateFin": "2008-01-23T01:00:00.000+01:00",
        "preseance": "20",
        "nominPrincipale": "1",
        "infosQualite": {
          "codeQualite": "Membre",
          "libQualite": "Membre",
          "libQualiteSex": "Membre"
        },
        "organes": {
          "organeRef": "PO398680"
        }
      },
      {
        "uid": "PM403397",
        "acteurRef": "PA267553",
        "legislature": "13",
        "typeOrgane": "ORGAINT",
        "dateDebut": "2007-11-08T01:00:00.000+01:00",
        "datePublication": "2007-11-09T01:00:00.000+01:00",
        "dateFin": "2008-04-19T02:00:00.000+02:00",
        "preseance": "42",
        "nominPrincipale": "1",
        "infosQualite": {
          "codeQualite": "Membre",
          "libQualite": "Membre",
          "libQualiteSex": "Membre"
        },
        "organes": {
          "organeRef": "PO201115"
        }
      },
      {
        "@xmlns:xsi": "http://www.w3.org/2001/XMLSchema-instance",
        "uid": "PM411015",
        "acteurRef": "PA267553",
        "legislature": null,
        "typeOrgane": "MINISTERE",
        "dateDebut": "2008-03-18T01:00:00.000+01:00",
        "datePublication": "2008-03-19T01:00:00.000+01:00",
        "dateFin": "2009-06-23T02:00:00.000+02:00",
        "preseance": "50",
        "nominPrincipale": "1",
        "infosQualite": {
          "codeQualite": "Secrétaire d'État",
          "libQualite": "Secrétaire d'État",
          "libQualiteSex": "Secrétaire d'État"
        },
        "organes": {
          "organeRef": "PO410992"
        }
      },
      {
        "@xmlns:xsi": "http://www.w3.org/2001/XMLSchema-instance",
        "uid": "PM419588",
        "acteurRef": "PA267553",
        "legislature": null,
        "typeOrgane": "MINISTERE",
        "dateDebut": "2009-06-23T02:00:00.000+02:00",
        "datePublication": "2009-06-24T02:00:00.000+02:00",
        "dateFin": "2010-11-13T01:00:00.000+01:00",
        "preseance": "50",
        "nominPrincipale": "1",
        "infosQualite": {
          "codeQualite": "Secrétaire d'État",
          "libQualite": "Secrétaire d'État",
          "libQualiteSex": "Secrétaire d'État"
        },
        "organes": {
          "organeRef": "PO419586"
        }
      },
      {
        "@xmlns:xsi": "http://www.w3.org/2001/XMLSchema-instance",
        "uid": "PM425762",
        "acteurRef": "PA267553",
        "legislature": null,
        "typeOrgane": "MINISTERE",
        "dateDebut": "2010-11-14T01:00:00.000+01:00",
        "datePublication": "2010-11-16T01:00:00.000+01:00",
        "dateFin": "2012-05-10T02:00:00.000+02:00",
        "preseance": "30",
        "nominPrincipale": "1",
        "infosQualite": {
          "codeQualite": "Ministre",
          "libQualite": "Ministre",
          "libQualiteSex": "Ministre"
        },
        "organes": {
          "organeRef": "PO425706"
        }
      },
      {
        "@xmlns:xsi": "http://www.w3.org/2001/XMLSchema-instance",
        "uid": "PM15411015",
        "acteurRef": "PA267553",
        "legislature": null,
        "typeOrgane": "GOUVERNEMENT",
        "dateDebut": "2008-03-18T01:00:00.000+01:00",
        "datePublication": "2008-03-19T01:00:00.000+01:00",
        "dateFin": "2010-11-13T01:00:00.000+01:00",
        "preseance": "50",
        "nominPrincipale": "1",
        "infosQualite": {
          "codeQualite": "membre",
          "libQualite": "membre",
          "libQualiteSex": "membre"
        },
        "organes": {
          "organeRef": "PO384206"
        }
      },
      {
        "@xmlns:xsi": "http://www.w3.org/2001/XMLSchema-instance",
        "uid": "PM15425762",
        "acteurRef": "PA267553",
        "legislature": null,
        "typeOrgane": "GOUVERNEMENT",
        "dateDebut": "2010-11-14T01:00:00.000+01:00",
        "datePublication": "2010-11-16T01:00:00.000+01:00",
        "dateFin": "2012-05-10T02:00:00.000+02:00",
        "preseance": "50",
        "nominPrincipale": "1",
        "infosQualite": {
          "codeQualite": "membre",
          "libQualite": "membre",
          "libQualiteSex": "membre"
        },
        "organes": {
          "organeRef": "PO425695"
        }
      }
    ]
  },
  "@xmlns:xsi": "http://www.w3.org/2001/XMLSchema-instance"
}