{
  "@xmlns:xsi": "http://www.w3.org/2001/XMLSchema-instance",
  "uid": "PO715900",
  "codeType": "MINISTERE",
  "libelle": "Secrétariat d'État, auprès du ministère de l'éducation nationale, de l'enseignement supérieur et de la recherche, chargé de l'enseignement supérieur et de la recherche",
  "libelleEdition": ", auprès de la ministre de l'éducation nationale, de l'enseignement supérieur et de la recherche, chargé de l'enseignement supérieur et de la recherche",
  "libelleAbrege": "Enseignement supérieur et recherche",
  "libelleAbrev": "ENS",
  "viMoDe": {
    "dateDebut": "2016-12-07T01:00:00.000+01:00",
    "dateAgrement": null,
    "dateFin": "2017-05-17T02:00:00.000+02:00"
  },
  "organeParent": "PO715793"
}