{
  "@xmlns:xsi": "http://www.w3.org/2001/XMLSchema-instance",
  "uid": "PO394855",
  "codeType": "ORGEXTPARL",
  "libelle": "Commission chargée de l'élaboration du livre blanc sur la défense et la sécurité nationale",
  "libelleEdition": "de la Commission chargée de l'élaboration du livre blanc sur la défense et la sécurité nationale",
  "libelleAbrege": "Livre blanc défense",
  "libelleAbrev": "238",
  "viMoDe": {
    "dateDebut": "2007-07-30T02:00:00.000+02:00",
    "dateAgrement": null,
    "dateFin": "2008-07-21T02:00:00.000+02:00"
  },
  "organeParent": null,
  "chambre": null,
  "regime": "5ème République",
  "legislature": null,
  "regimeJuridique": "décret n° 2007-1144 du 30 juillet 2007",
  "siteInternet": null,
  "nombreReunionsAnnuelles": null
}