{
  "@xmlns:xsi": "http://www.w3.org/2001/XMLSchema-instance",
  "uid": "PO715793",
  "codeType": "GOUVERNEMENT",
  "libelle": "Gouvernement",
  "libelleEdition": "du Gouvernement",
  "libelleAbrege": "CAZENEUVE",
  "libelleAbrev": "GVT",
  "viMoDe": {
    "dateDebut": "2016-12-07T01:00:00.000+01:00",
    "dateAgrement": null,
    "dateFin": "2017-05-17T02:00:00.000+02:00"
  },
  "organeParent": null
}