{
  "uid": "PA721750",
  "etatCivil": {
    "ident": {
      "civ": "Mme",
      "prenom": "Céline",
      "nom": "Calvez",
      "alpha": "Calvez",
      "trigramme": "CCA"
    },
    "infoNaissance": {
      "dateNais": "1979-07-24T02:00:00.000+02:00",
      "villeNais": "Rennes",
      "depNais": "Ille-et-Vilaine",
      "paysNais": "France"
    }
  },
  "profession": {
    "libelleCourant": "Consultante communication",
    "socProcInsee": {
      "catSocPro": "Commerçants et assimilés",
      "famSocPro": "Artisans, commerçants et chefs d'entreprise"
    }
  },
  "uriHatvp": "https://www.hatvp.fr/pages_nominatives/calvez-celine",
  "adresses": [
    {
      "xsiType": "AdressePostale_Type",
      "uid": "AD721752",
      "type": "0",
      "typeLibelle": "Adresse officielle",
      "poids": "1",
      "intitule": "Assemblée nationale,",
      "numeroRue": "126",
      "nomRue": "Rue de l'Université,",
      "codePostal": "75355",
      "ville": "Paris 07 SP"
    },
    {
      "xsiType": "AdresseSiteWeb_Type",
      "uid": "AD725262",
      "type": "24",
      "typeLibelle": "Twitter",
      "valElec": "@celinecalvez"
    },
    {
      "xsiType": "AdresseMail_Type",
      "uid": "AD728279",
      "type": "15",
      "typeLibelle": "Mèl",
      "valElec": "celine.calvez@assemblee-nationale.fr"
    },
    {
      "xsiType": "AdresseSiteWeb_Type",
      "uid": "AD743703",
      "type": "22",
      "typeLibelle": "Site internet",
      "valElec": "celine-calvez.fr"
    },
    {
      "xsiType": "AdresseTelephonique_Type",
      "uid": "AD757935",
      "type": "11",
      "typeLibelle": "Téléphone",
      "poids": "1",
      "adresseDeRattachement": "AD721752",
      "valElec": "01.40.63.48.05"
    }
  ],
  "mandats": [
    {
      "xsiType": "MandatParlementaire_type",
      "uid": "PM723372",
      "acteurRef": "PA721750",
      "legislature": "15",
      "typeOrgane": "ASSEMBLEE",
      "dateDebut": "2017-06-18T02:00:00.000+02:00",
      "preseance": "50",
      "nominPrincipale": "1",
      "infosQualite": {
        "codeQualite": "membre",
        "libQualite": "membre",
        "libQualiteSex": "membre"
      },
      "organesRefs": [
        "PO717460"
      ],
      "suppleant": {
        "dateDebut": "2017-06-18T02:00:00.000+02:00",
        "suppleantRef": "PA721754"
      },
      "election": {
        "lieu": {
          "region": "Ile-de-France",
          "regionType": "Métropolitain",
          "departement": "Hauts-de-Seine",
          "numDepartement": "92",
          "numCirco": "5"
        },
        "causeMandat": "élections générales",
        "refCirconscription": "PO718438"
      },
      "mandature": {
        "datePriseFonction": "2017-06-21T02:00:00.000+02:00",
        "premiereElection": "0",
        "placeHemicycle": "270"
      },
      "collaborateurs": [
        {
          "qualite": "Mme",
          "prenom": "Catherine",
          "nom": "Sebaux"
        },
        {
          "qualite": "M.",
          "prenom": "Clément",
          "nom": "Tougeron"
        },
        {
          "qualite": "M.",
          "prenom": "Clément",
          "nom": "Schirmann"
        },
        {
          "qualite": "Mme",
          "prenom": "Manon",
          "nom": "Fouyer"
        }
      ]
    },
    {
      "xsiType": "MandatSimple_Type",
      "uid": "PM724727",
      "acteurRef": "PA721750",
      "legislature": "15",
      "typeOrgane": "GP",
      "dateDebut": "2017-06-21T02:00:00.000+02:00",
      "dateFin": "2017-06-26T02:00:00.000+02:00",
      "preseance": "28",
      "nominPrincipale": "1",
      "infosQualite": {
        "codeQualite": "Député non-inscrit",
        "libQualite": "Député non-inscrit",
        "libQualiteSex": "Députée non-inscrite"
      },
      "organesRefs": [
        "PO723569"
      ]
    },
    {
      "xsiType": "MandatSimple_Type",
      "uid": "PM731228",
      "acteurRef": "PA721750",
      "legislature": "15",
      "typeOrgane": "GP",
      "dateDebut": "2017-06-27T02:00:00.000+02:00",
      "datePublication": "2017-06-28T02:00:00.000+02:00",
      "preseance": "20",
      "nominPrincipale": "1",
      "infosQualite": {
        "codeQualite": "Membre",
        "libQualite": "Membre du",
        "libQualiteSex": "Membre du"
      },
      "organesRefs": [
        "PO730964"
      ]
    },
    {
      "xsiType": "MandatSimple_Type",
      "uid": "PM732011",
      "acteurRef": "PA721750",
      "legislature": "15",
      "typeOrgane": "COMPER",
      "dateDebut": "2017-06-29T02:00:00.000+02:00",
      "datePublication": "2017-06-29T02:00:00.000+02:00",
      "preseance": "32",
      "nominPrincipale": "1",
      "infosQualite": {
        "codeQualite": "Membre",
        "libQualite": "Membre",
        "libQualiteSex": "Membre"
      },
      "organesRefs": [
        "PO419604"
      ]
    },
    {
      "xsiType": "MandatSimple_Type",
      "uid": "PM732847",
      "acteurRef": "PA721750",
      "legislature": "15",
      "typeOrgane": "DELEG",
      "dateDebut": "2017-07-19T02:00:00.000+02:00",
      "datePublication": "2017-07-19T02:00:00.000+02:00",
      "preseance": "20",
      "nominPrincipale": "1",
      "infosQualite": {
        "codeQualite": "Membre",
        "libQualite": "Membre",
        "libQualiteSex": "Membre"
      },
      "organesRefs": [
        "PO201269"
      ]
    },
    {
      "xsiType": "MandatSimple_Type",
      "uid": "PM735338",
      "acteurRef": "PA721750",
      "legislature": "15",
      "typeOrgane": "GA",
      "dateDebut": "2017-09-26T02:00:00.000+02:00",
      "preseance": "20",
      "nominPrincipale": "0",
      "infosQualite": {
        "codeQualite": "Membre",
        "libQualite": "Membre",
        "libQualiteSex": "Membre"
      },
      "organesRefs": [
        "PO733617"
      ]
    },
    {
      "xsiType": "MandatSimple_Type",
      "uid": "PM735339",
      "acteurRef": "PA721750",
      "legislature": "15",
      "typeOrgane": "GA",
      "dateDebut": "2017-09-26T02:00:00.000+02:00",
      "preseance": "1",
      "nominPrincipale": "1",
      "infosQualite": {
        "codeQualite": "Président",
        "libQualite": "Président",
        "libQualiteSex": "Présidente"
      },
      "organesRefs": [
        "PO733617"
      ]
    },
    {
      "xsiType": "MandatSimple_Type",
      "uid": "PM740282",
      "acteurRef": "PA721750",
      "legislature": "15",
      "typeOrgane": "GA",
      "dateDebut": "2017-10-13T02:00:00.000+02:00",
      "preseance": "20",
      "nominPrincipale": "1",
      "infosQualite": {
        "codeQualite": "Membre",
        "libQualite": "Membre",
        "libQualiteSex": "Membre"
      },
      "organesRefs": [
        "PO732944"
      ]
    },
    {
      "xsiType": "MandatSimple_Type",
      "uid": "PM740283",
      "acteurRef": "PA721750",
      "legislature": "15",
      "typeOrgane": "GA",
      "dateDebut": "2017-10-13T02:00:00.000+02:00",
      "preseance": "20",
      "nominPrincipale": "1",
      "infosQualite": {
        "codeQualite": "Membre",
        "libQualite": "Membre",
        "libQualiteSex": "Membre"
      },
      "organesRefs": [
        "PO732984"
      ]
    },
    {
      "xsiType": "MandatSimple_Type",
      "uid": "PM740284",
      "acteurRef": "PA721750",
      "legislature": "15",
      "typeOrgane": "GA",
      "dateDebut": "2017-10-13T02:00:00.000+02:00",
      "preseance": "20",
      "nominPrincipale": "1",
      "infosQualite": {
        "codeQualite": "Membre",
        "libQualite": "Membre",
        "libQualiteSex": "Membre"
      },
      "organesRefs": [
        "PO733057"
      ]
    },
    {
      "xsiType": "MandatSimple_Type",
      "uid": "PM740285",
      "acteurRef": "PA721750",
      "legislature": "15",
      "typeOrgane": "GA",
      "dateDebut": "2017-10-13T02:00:00.000+02:00",
      "preseance": "20",
      "nominPrincipale": "1",
      "infosQualite": {
        "codeQualite": "Membre",
        "libQualite": "Membre",
        "libQualiteSex": "Membre"
      },
      "organesRefs": [
        "PO733202"
      ]
    },
    {
      "xsiType": "MandatSimple_Type",
      "uid": "PM740286",
      "acteurRef": "PA721750",
      "legislature": "15",
      "typeOrgane": "GA",
      "dateDebut": "2017-10-13T02:00:00.000+02:00",
      "preseance": "20",
      "nominPrincipale": "1",
      "infosQualite": {
        "codeQualite": "Membre",
        "libQualite": "Membre",
        "libQualiteSex": "Membre"
      },
      "organesRefs": [
        "PO733242"
      ]
    },
    {
      "xsiType": "MandatSimple_Type",
      "uid": "PM740287",
      "acteurRef": "PA721750",
      "legislature": "15",
      "typeOrgane": "GA",
      "dateDebut": "2017-10-13T02:00:00.000+02:00",
      "preseance": "20",
      "nominPrincipale": "1",
      "infosQualite": {
        "codeQualite": "Membre",
        "libQualite": "Membre",
        "libQualiteSex": "Membre"
      },
      "organesRefs": [
        "PO733297"
      ]
    },
    {
      "xsiType": "MandatSimple_Type",
      "uid": "PM740288",
      "acteurRef": "PA721750",
      "legislature": "15",
      "typeOrgane": "GA",
      "dateDebut": "2017-10-13T02:00:00.000+02:00",
      "preseance": "20",
      "nominPrincipale": "1",
      "infosQualite": {
        "codeQualite": "Membre",
        "libQualite": "Membre",
        "libQualiteSex": "Membre"
      },
      "organesRefs": [
        "PO733352"
      ]
    },
    {
      "xsiType": "MandatSimple_Type",
      "uid": "PM740289",
      "acteurRef": "PA721750",
      "legislature": "15",
      "typeOrgane": "GA",
      "dateDebut": "2017-10-13T02:00:00.000+02:00",
      "preseance": "20",
      "nominPrincipale": "1",
      "infosQualite": {
        "codeQualite": "Membre",
        "libQualite": "Membre",
        "libQualiteSex": "Membre"
      },
      "organesRefs": [
        "PO733517"
      ]
    },
    {
      "xsiType": "MandatSimple_Type",
      "uid": "PM740290",
      "acteurRef": "PA721750",
      "legislature": "15",
      "typeOrgane": "GA",
      "dateDebut": "2017-10-13T02:00:00.000+02:00",
      "preseance": "20",
      "nominPrincipale": "1",
      "infosQualite": {
        "codeQualite": "Membre",
        "libQualite": "Membre",
        "libQualiteSex": "Membre"
      },
      "organesRefs": [
        "PO733567"
      ]
    },
    {
      "xsiType": "MandatSimple_Type",
      "uid": "PM740291",
      "acteurRef": "PA721750",
      "legislature": "15",
      "typeOrgane": "GA",
      "dateDebut": "2017-10-13T02:00:00.000+02:00",
      "preseance": "20",
      "nominPrincipale": "1",
      "infosQualite": {
        "codeQualite": "Membre",
        "libQualite": "Membre",
        "libQualiteSex": "Membre"
      },
      "organesRefs": [
        "PO733577"
      ]
    },
    {
      "xsiType": "MandatMission_Type",
      "uid": "PM741957",
      "acteurRef": "PA721750",
      "legislature": "15",
      "typeOrgane": "MISINFO",
      "dateDebut": "2017-09-27T02:00:00.000+02:00",
      "preseance": "10",
      "nominPrincipale": "1",
      "infosQualite": {
        "codeQualite": "Membre",
        "libQualite": "Membre",
        "libQualiteSex": "Membre"
      },
      "organesRefs": [
        "PO741916"
      ]
    },
    {
      "xsiType": "MandatSimple_Type",
      "uid": "PM743084",
      "acteurRef": "PA721750",
      "legislature": "15",
      "typeOrgane": "ORGEXTPARL",
      "dateDebut": "2017-11-10T01:00:00.000+01:00",
      "datePublication": "2017-11-11T01:00:00.000+01:00",
      "preseance": "20",
      "nominPrincipale": "1",
      "infosQualite": {
        "codeQualite": "Titulaire",
        "libQualite": "Membre titulaire",
        "libQualiteSex": "Membre titulaire"
      },
      "organesRefs": [
        "PO60239"
      ]
    },
    {
      "xsiType": "MandatSimple_Type",
      "uid": "PM745047",
      "acteurRef": "PA721750",
      "typeOrgane": "PARPOL",
      "dateDebut": "2017-12-01T01:00:00.000+01:00",
      "dateFin": "2018-11-30T01:00:00.000+01:00",
      "preseance": "5",
      "nominPrincipale": "1",
      "infosQualite": {
        "codeQualite": "Membre",
        "libQualite": "Membre",
        "libQualiteSex": "Membre"
      },
      "organesRefs": [
        "PO744854"
      ]
    },
    {
      "xsiType": "MandatMission_Type",
      "uid": "PM748323",
      "acteurRef": "PA721750",
      "legislature": "15",
      "typeOrgane": "MISINFO",
      "dateDebut": "2018-01-31T01:00:00.000+01:00",
      "dateFin": "2018-11-15T01:00:00.000+01:00",
      "preseance": "10",
      "nominPrincipale": "1",
      "infosQualite": {
        "codeQualite": "Membre",
        "libQualite": "Membre",
        "libQualiteSex": "Membre"
      },
      "organesRefs": [
        "PO748305"
      ]
    },
    {
      "xsiType": "MandatSimple_Type",
      "uid": "PM751312",
      "acteurRef": "PA721750",
      "legislature": "15",
      "typeOrgane": "GE",
      "dateDebut": "2018-02-20T01:00:00.000+01:00",
      "preseance": "20",
      "nominPrincipale": "1",
      "infosQualite": {
        "codeQualite": "Membre",
        "libQualite": "Membre",
        "libQualiteSex": "Membre"
      },
      "organesRefs": [
        "PO747017"
      ]
    },
    {
      "xsiType": "MandatSimple_Type",
      "uid": "PM756212",
      "acteurRef": "PA721750",
      "legislature": "15",
      "typeOrgane": "GE",
      "dateDebut": "2018-05-18T02:00:00.000+02:00",
      "preseance": "20",
      "nominPrincipale": "1",
      "infosQualite": {
        "codeQualite": "Membre",
        "libQualite": "Membre",
        "libQualiteSex": "Membre"
      },
      "organesRefs": [
        "PO746910"
      ]
    },
    {
      "xsiType": "MandatSimple_Type",
      "uid": "PM759052",
      "acteurRef": "PA721750",
      "legislature": "15",
      "typeOrgane": "CMP",
      "dateDebut": "2018-09-25T02:00:00.000+02:00",
      "datePublication": "2018-09-26T02:00:00.000+02:00",
      "dateFin": "2018-11-20T01:00:00.000+01:00",
      "preseance": "28",
      "nominPrincipale": "1",
      "infosQualite": {
        "codeQualite": "Suppléant",
        "libQualite": "Membre suppléant",
        "libQualiteSex": "Membre suppléante"
      },
      "organesRefs": [
        "PO758375"
      ]
    },
    {
      "xsiType": "MandatSimple_Type",
      "uid": "PM759079",
      "acteurRef": "PA721750",
      "legislature": "15",
      "typeOrgane": "CMP",
      "dateDebut": "2018-09-25T02:00:00.000+02:00",
      "datePublication": "2018-09-26T02:00:00.000+02:00",
      "dateFin": "2018-11-20T01:00:00.000+01:00",
      "preseance": "28",
      "nominPrincipale": "1",
      "infosQualite": {
        "codeQualite": "Suppléant",
        "libQualite": "Membre suppléant",
        "libQualiteSex": "Membre suppléante"
      },
      "organesRefs": [
        "PO758368"
      ]
    },
    {
      "xsiType": "MandatSimple_Type",
      "uid": "PM759188",
      "acteurRef": "PA721750",
      "legislature": "15",
      "typeOrgane": "COMPER",
      "dateDebut": "2018-10-01T02:00:00.000+02:00",
      "datePublication": "2018-10-02T02:00:00.000+02:00",
      "dateFin": "2019-09-30T02:00:00.000+02:00",
      "preseance": "8",
      "nominPrincipale": "1",
      "infosQualite": {
        "codeQualite": "Vice-Président",
        "libQualite": "Vice-président",
        "libQualiteSex": "Vice-présidente"
      },
      "organesRefs": [
        "PO419604"
      ]
    },
    {
      "xsiType": "MandatSimple_Type",
      "uid": "PM764764",
      "acteurRef": "PA721750",
      "legislature": "15",
      "typeOrgane": "GE",
      "dateDebut": "2019-04-18T02:00:00.000+02:00",
      "preseance": "20",
      "nominPrincipale": "1",
      "infosQualite": {
        "codeQualite": "Membre",
        "libQualite": "Membre",
        "libQualiteSex": "Membre"
      },
      "organesRefs": [
        "PO747104"
      ]
    },
    {
      "xsiType": "MandatSimple_Type",
      "uid": "PM764766",
      "acteurRef": "PA721750",
      "legislature": "15",
      "typeOrgane": "GE",
      "dateDebut": "2019-04-18T02:00:00.000+02:00",
      "preseance": "20",
      "nominPrincipale": "1",
      "infosQualite": {
        "codeQualite": "Membre",
        "libQualite": "Membre",
        "libQualiteSex": "Membre"
      },
      "organesRefs": [
        "PO747135"
      ]
    },
    {
      "xsiType": "MandatSimple_Type",
      "uid": "PM764772",
      "acteurRef": "PA721750",
      "legislature": "15",
      "typeOrgane": "GE",
      "dateDebut": "2019-04-23T02:00:00.000+02:00",
      "preseance": "20",
      "nominPrincipale": "1",
      "infosQualite": {
        "codeQualite": "Membre",
        "libQualite": "Membre",
        "libQualiteSex": "Membre"
      },
      "organesRefs": [
        "PO746684"
      ]
    },
    {
      "xsiType": "MandatSimple_Type",
      "uid": "PM764789",
      "acteurRef": "PA721750",
      "legislature": "15",
      "typeOrgane": "GE",
      "dateDebut": "2019-04-17T02:00:00.000+02:00",
      "preseance": "20",
      "nominPrincipale": "1",
      "infosQualite": {
        "codeQualite": "Membre",
        "libQualite": "Membre",
        "libQualiteSex": "Membre"
      },
      "organesRefs": [
        "PO746837"
      ]
    },
    {
      "xsiType": "MandatSimple_Type",
      "uid": "PM765046",
      "acteurRef": "PA721750",
      "legislature": "15",
      "typeOrgane": "GE",
      "dateDebut": "2019-05-07T02:00:00.000+02:00",
      "preseance": "20",
      "nominPrincipale": "1",
      "infosQualite": {
        "codeQualite": "Membre",
        "libQualite": "Membre",
        "libQualiteSex": "Membre"
      },
      "organesRefs": [
        "PO747007"
      ]
    },
    {
      "xsiType": "MandatSimple_Type",
      "uid": "PM765055",
      "acteurRef": "PA721750",
      "legislature": "15",
      "typeOrgane": "GE",
      "dateDebut": "2019-05-13T02:00:00.000+02:00",
      "preseance": "20",
      "nominPrincipale": "1",
      "infosQualite": {
        "codeQualite": "Membre",
        "libQualite": "Membre",
        "libQualiteSex": "Membre"
      },
      "organesRefs": [
        "PO763269"
      ]
    },
    {
      "xsiType": "MandatSimple_Type",
      "uid": "PM765145",
      "acteurRef": "PA721750",
      "legislature": "15",
      "typeOrgane": "GE",
      "dateDebut": "2019-05-20T02:00:00.000+02:00",
      "preseance": "20",
      "nominPrincipale": "1",
      "infosQualite": {
        "codeQualite": "Membre",
        "libQualite": "Membre",
        "libQualiteSex": "Membre"
      },
      "organesRefs": [
        "PO763244"
      ]
    },
    {
      "xsiType": "MandatSimple_Type",
      "uid": "PM765450",
      "acteurRef": "PA721750",
      "legislature": "15",
      "typeOrgane": "CMP",
      "dateDebut": "2019-05-29T02:00:00.000+02:00",
      "datePublication": "2019-05-30T02:00:00.000+02:00",
      "dateFin": "2019-07-16T02:00:00.000+02:00",
      "preseance": "28",
      "nominPrincipale": "1",
      "infosQualite": {
        "codeQualite": "Suppléant",
        "libQualite": "Membre suppléant",
        "libQualiteSex": "Membre suppléante"
      },
      "organesRefs": [
        "PO765339"
      ]
    },
    {
      "xsiType": "MandatMission_Type",
      "uid": "PM766749",
      "acteurRef": "PA721750",
      "legislature": "15",
      "typeOrgane": "MISINFO",
      "dateDebut": "2019-07-24T02:00:00.000+02:00",
      "preseance": "10",
      "nominPrincipale": "1",
      "infosQualite": {
        "codeQualite": "Membre",
        "libQualite": "Membre",
        "libQualiteSex": "Membre"
      },
      "organesRefs": [
        "PO766728"
      ]
    },
    {
      "xsiType": "MandatSimple_Type",
      "uid": "PM766868",
      "acteurRef": "PA721750",
      "legislature": "15",
      "typeOrgane": "CMP",
      "dateDebut": "2019-07-25T02:00:00.000+02:00",
      "datePublication": "2019-07-26T02:00:00.000+02:00",
      "dateFin": "2019-10-16T02:00:00.000+02:00",
      "preseance": "28",
      "nominPrincipale": "1",
      "infosQualite": {
        "codeQualite": "Suppléant",
        "libQualite": "Membre suppléant",
        "libQualiteSex": "Membre suppléante"
      },
      "organesRefs": [
        "PO766371"
      ]
    },
    {
      "xsiType": "MandatSimple_Type",
      "uid": "PM767168",
      "acteurRef": "PA721750",
      "legislature": "15",
      "typeOrgane": "CMP",
      "dateDebut": "2019-09-19T02:00:00.000+02:00",
      "datePublication": "2019-09-20T02:00:00.000+02:00",
      "dateFin": "2019-10-08T02:00:00.000+02:00",
      "preseance": "20",
      "nominPrincipale": "1",
      "infosQualite": {
        "codeQualite": "Titulaire",
        "libQualite": "Membre titulaire",
        "libQualiteSex": "Membre titulaire"
      },
      "organesRefs": [
        "PO766825"
      ]
    }
  ]
}