{
  "uid": "PO59026",
  "codeType": "CNPE",
  "libelle": "Commission d'enquête sur le régime étudiant de sécurité sociale",
  "libelleEdition": "de la commission d'enquête sur le régime étudiant de sécurité sociale",
  "libelleAbrege": "Enquête régime étudiant sécurité sociale",
  "libelleAbrev": "MNEF",
  "viMoDe": {
    "dateDebut": "1999-03-10T01:00:00.000+01:00",
    "dateFin": "1999-07-06T02:00:00.000+02:00"
  },
  "regime": "5ème République",
  "legislature": "11",
  "secretariat": {}
}