{
  "uid": "PA720492",
  "etatCivil": {
    "ident": {
      "civ": "Mme",
      "prenom": "Catherine",
      "nom": "Osson",
      "alpha": "Osson",
      "trigramme": "COS"
    },
    "infoNaissance": {
      "dateNais": "1974-02-07T01:00:00.000+01:00",
      "villeNais": "Croix",
      "depNais": "Nord",
      "paysNais": "France"
    }
  },
  "profession": {
    "libelleCourant": "Directrice d'école",
    "socProcInsee": {
      "catSocPro": "Cadres de la fonction publique, professions intellectuelles et  artistiques",
      "famSocPro": "Cadres et professions intellectuelles supérieures"
    }
  },
  "uriHatvp": "https://www.hatvp.fr/pages_nominatives/osson-catherine",
  "adresses": [
    {
      "xsiType": "AdressePostale_Type",
      "uid": "AD720494",
      "type": "0",
      "typeLibelle": "Adresse officielle",
      "poids": "1",
      "intitule": "Assemblée nationale,",
      "numeroRue": "126",
      "nomRue": "Rue de l'Université,",
      "codePostal": "75355",
      "ville": "Paris 07 SP"
    },
    {
      "xsiType": "AdresseSiteWeb_Type",
      "uid": "AD724960",
      "type": "24",
      "typeLibelle": "Twitter",
      "valElec": "@Ossoncatherine"
    },
    {
      "xsiType": "AdresseMail_Type",
      "uid": "AD728152",
      "type": "15",
      "typeLibelle": "Mèl",
      "valElec": "catherine.osson@assemblee-nationale.fr"
    }
  ],
  "mandats": [
    {
      "xsiType": "MandatParlementaire_type",
      "uid": "PM722980",
      "acteurRef": "PA720492",
      "legislature": "15",
      "typeOrgane": "ASSEMBLEE",
      "dateDebut": "2017-06-18T02:00:00.000+02:00",
      "preseance": "50",
      "nominPrincipale": "1",
      "infosQualite": {
        "codeQualite": "membre",
        "libQualite": "membre",
        "libQualiteSex": "membre"
      },
      "organesRefs": [
        "PO717460"
      ],
      "suppleant": {
        "dateDebut": "2017-06-18T02:00:00.000+02:00",
        "suppleantRef": "PA720496"
      },
      "election": {
        "lieu": {
          "region": "Hauts-de-France",
          "regionType": "Métropolitain",
          "departement": "Nord",
          "numDepartement": "59",
          "numCirco": "8"
        },
        "causeMandat": "élections générales",
        "refCirconscription": "PO718018"
      },
      "mandature": {
        "datePriseFonction": "2017-06-21T02:00:00.000+02:00",
        "premiereElection": "0",
        "placeHemicycle": "570"
      },
      "collaborateurs": [
        {
          "qualite": "Mme",
          "prenom": "Nawelle",
          "nom": "Lecoeur"
        },
        {
          "qualite": "M.",
          "prenom": "Stéphane",
          "nom": "Thiery"
        },
        {
          "qualite": "M.",
          "prenom": "Pierre",
          "nom": "Calais"
        },
        {
          "qualite": "M.",
          "prenom": "Djamel",
          "nom": "Kerrouche"
        },
        {
          "qualite": "M.",
          "prenom": "Marc",
          "nom": "Vasseur"
        }
      ]
    },
    {
      "xsiType": "MandatSimple_Type",
      "uid": "PM724531",
      "acteurRef": "PA720492",
      "legislature": "15",
      "typeOrgane": "GP",
      "dateDebut": "2017-06-21T02:00:00.000+02:00",
      "dateFin": "2017-06-26T02:00:00.000+02:00",
      "preseance": "28",
      "nominPrincipale": "1",
      "infosQualite": {
        "codeQualite": "Député non-inscrit",
        "libQualite": "Député non-inscrit",
        "libQualiteSex": "Députée non-inscrite"
      },
      "organesRefs": [
        "PO723569"
      ]
    },
    {
      "xsiType": "MandatSimple_Type",
      "uid": "PM731142",
      "acteurRef": "PA720492",
      "legislature": "15",
      "typeOrgane": "GP",
      "dateDebut": "2017-06-27T02:00:00.000+02:00",
      "datePublication": "2017-06-28T02:00:00.000+02:00",
      "preseance": "20",
      "nominPrincipale": "1",
      "infosQualite": {
        "codeQualite": "Membre",
        "libQualite": "Membre du",
        "libQualiteSex": "Membre du"
      },
      "organesRefs": [
        "PO730964"
      ]
    },
    {
      "xsiType": "MandatSimple_Type",
      "uid": "PM731946",
      "acteurRef": "PA720492",
      "legislature": "15",
      "typeOrgane": "COMPER",
      "dateDebut": "2017-06-29T02:00:00.000+02:00",
      "datePublication": "2017-06-29T02:00:00.000+02:00",
      "preseance": "32",
      "nominPrincipale": "1",
      "infosQualite": {
        "codeQualite": "Membre",
        "libQualite": "Membre",
        "libQualiteSex": "Membre"
      },
      "organesRefs": [
        "PO59048"
      ]
    },
    {
      "xsiType": "MandatSimple_Type",
      "uid": "PM734574",
      "acteurRef": "PA720492",
      "legislature": "15",
      "typeOrgane": "ORGEXTPARL",
      "dateDebut": "2017-08-14T02:00:00.000+02:00",
      "datePublication": "2017-08-15T02:00:00.000+02:00",
      "preseance": "20",
      "nominPrincipale": "1",
      "infosQualite": {
        "codeQualite": "Titulaire",
        "libQualite": "Membre titulaire",
        "libQualiteSex": "Membre titulaire"
      },
      "organesRefs": [
        "PO717433"
      ]
    },
    {
      "xsiType": "MandatSimple_Type",
      "uid": "PM740398",
      "acteurRef": "PA720492",
      "legislature": "15",
      "typeOrgane": "GA",
      "dateDebut": "2017-10-17T02:00:00.000+02:00",
      "preseance": "20",
      "nominPrincipale": "0",
      "infosQualite": {
        "codeQualite": "Membre",
        "libQualite": "Membre",
        "libQualiteSex": "Membre"
      },
      "organesRefs": [
        "PO733637"
      ]
    },
    {
      "xsiType": "MandatSimple_Type",
      "uid": "PM742785",
      "acteurRef": "PA720492",
      "legislature": "15",
      "typeOrgane": "CMP",
      "dateDebut": "2017-11-09T01:00:00.000+01:00",
      "datePublication": "2017-11-10T01:00:00.000+01:00",
      "dateFin": "2017-11-14T01:00:00.000+01:00",
      "preseance": "28",
      "nominPrincipale": "1",
      "infosQualite": {
        "codeQualite": "Suppléant",
        "libQualite": "Membre suppléant",
        "libQualiteSex": "Membre suppléante"
      },
      "organesRefs": [
        "PO742740"
      ]
    },
    {
      "xsiType": "MandatSimple_Type",
      "uid": "PM744048",
      "acteurRef": "PA720492",
      "legislature": "15",
      "typeOrgane": "GA",
      "dateDebut": "2017-11-21T01:00:00.000+01:00",
      "preseance": "8",
      "nominPrincipale": "1",
      "infosQualite": {
        "codeQualite": "Vice-Président",
        "libQualite": "Vice-Président",
        "libQualiteSex": "Vice-Présidente"
      },
      "organesRefs": [
        "PO733637"
      ]
    },
    {
      "xsiType": "MandatSimple_Type",
      "uid": "PM745359",
      "acteurRef": "PA720492",
      "typeOrgane": "PARPOL",
      "dateDebut": "2017-12-01T01:00:00.000+01:00",
      "dateFin": "2018-11-30T01:00:00.000+01:00",
      "preseance": "5",
      "nominPrincipale": "1",
      "infosQualite": {
        "codeQualite": "Membre",
        "libQualite": "Membre",
        "libQualiteSex": "Membre"
      },
      "organesRefs": [
        "PO744854"
      ]
    },
    {
      "xsiType": "MandatSimple_Type",
      "uid": "PM746153",
      "acteurRef": "PA720492",
      "legislature": "15",
      "typeOrgane": "CMP",
      "dateDebut": "2017-12-07T01:00:00.000+01:00",
      "datePublication": "2017-12-08T01:00:00.000+01:00",
      "dateFin": "2017-12-21T01:00:00.000+01:00",
      "preseance": "28",
      "nominPrincipale": "1",
      "infosQualite": {
        "codeQualite": "Suppléant",
        "libQualite": "Membre suppléant",
        "libQualiteSex": "Membre suppléante"
      },
      "organesRefs": [
        "PO746099"
      ]
    },
    {
      "xsiType": "MandatSimple_Type",
      "uid": "PM746183",
      "acteurRef": "PA720492",
      "legislature": "15",
      "typeOrgane": "CMP",
      "dateDebut": "2017-12-07T01:00:00.000+01:00",
      "datePublication": "2017-12-08T01:00:00.000+01:00",
      "dateFin": "2017-12-21T01:00:00.000+01:00",
      "preseance": "28",
      "nominPrincipale": "1",
      "infosQualite": {
        "codeQualite": "Suppléant",
        "libQualite": "Membre suppléant",
        "libQualiteSex": "Membre suppléante"
      },
      "organesRefs": [
        "PO742972"
      ]
    },
    {
      "xsiType": "MandatSimple_Type",
      "uid": "PM750335",
      "acteurRef": "PA720492",
      "legislature": "15",
      "typeOrgane": "GE",
      "dateDebut": "2018-02-14T01:00:00.000+01:00",
      "preseance": "20",
      "nominPrincipale": "1",
      "infosQualite": {
        "codeQualite": "Membre",
        "libQualite": "Membre",
        "libQualiteSex": "Membre"
      },
      "organesRefs": [
        "PO747129"
      ]
    },
    {
      "xsiType": "MandatSimple_Type",
      "uid": "PM750389",
      "acteurRef": "PA720492",
      "legislature": "15",
      "typeOrgane": "GE",
      "dateDebut": "2018-02-14T01:00:00.000+01:00",
      "preseance": "20",
      "nominPrincipale": "1",
      "infosQualite": {
        "codeQualite": "Membre",
        "libQualite": "Membre",
        "libQualiteSex": "Membre"
      },
      "organesRefs": [
        "PO746885"
      ]
    },
    {
      "xsiType": "MandatSimple_Type",
      "uid": "PM751783",
      "acteurRef": "PA720492",
      "legislature": "15",
      "typeOrgane": "GE",
      "dateDebut": "2018-02-22T01:00:00.000+01:00",
      "preseance": "20",
      "nominPrincipale": "1",
      "infosQualite": {
        "codeQualite": "Membre",
        "libQualite": "Membre",
        "libQualiteSex": "Membre"
      },
      "organesRefs": [
        "PO747205"
      ]
    },
    {
      "xsiType": "MandatSimple_Type",
      "uid": "PM753367",
      "acteurRef": "PA720492",
      "legislature": "15",
      "typeOrgane": "GE",
      "dateDebut": "2018-03-14T01:00:00.000+01:00",
      "preseance": "20",
      "nominPrincipale": "1",
      "infosQualite": {
        "codeQualite": "Membre",
        "libQualite": "Membre",
        "libQualiteSex": "Membre"
      },
      "organesRefs": [
        "PO747002"
      ]
    },
    {
      "xsiType": "MandatSimple_Type",
      "uid": "PM753893",
      "acteurRef": "PA720492",
      "legislature": "15",
      "typeOrgane": "GE",
      "dateDebut": "2018-03-14T01:00:00.000+01:00",
      "preseance": "20",
      "nominPrincipale": "1",
      "infosQualite": {
        "codeQualite": "Membre",
        "libQualite": "Membre",
        "libQualiteSex": "Membre"
      },
      "organesRefs": [
        "PO747286"
      ]
    },
    {
      "xsiType": "MandatSimple_Type",
      "uid": "PM754593",
      "acteurRef": "PA720492",
      "legislature": "15",
      "typeOrgane": "GE",
      "dateDebut": "2018-03-30T02:00:00.000+02:00",
      "preseance": "20",
      "nominPrincipale": "0",
      "infosQualite": {
        "codeQualite": "Membre",
        "libQualite": "Membre",
        "libQualiteSex": "Membre"
      },
      "organesRefs": [
        "PO747180"
      ]
    },
    {
      "xsiType": "MandatSimple_Type",
      "uid": "PM755959",
      "acteurRef": "PA720492",
      "legislature": "15",
      "typeOrgane": "GE",
      "dateDebut": "2018-04-18T02:00:00.000+02:00",
      "preseance": "8",
      "nominPrincipale": "1",
      "infosQualite": {
        "codeQualite": "Vice-Président",
        "libQualite": "Vice-Président",
        "libQualiteSex": "Vice-Présidente"
      },
      "organesRefs": [
        "PO747180"
      ]
    },
    {
      "xsiType": "MandatSimple_Type",
      "uid": "PM756997",
      "acteurRef": "PA720492",
      "legislature": "15",
      "typeOrgane": "ORGEXTPARL",
      "dateDebut": "2018-03-08T01:00:00.000+01:00",
      "datePublication": "2018-03-09T01:00:00.000+01:00",
      "preseance": "20",
      "nominPrincipale": "1",
      "infosQualite": {
        "codeQualite": "Titulaire",
        "libQualite": "Membre titulaire",
        "libQualiteSex": "Membre titulaire"
      },
      "organesRefs": [
        "PO756933"
      ]
    },
    {
      "xsiType": "MandatSimple_Type",
      "uid": "PM759236",
      "acteurRef": "PA720492",
      "legislature": "15",
      "typeOrgane": "CMP",
      "dateDebut": "2018-10-02T02:00:00.000+02:00",
      "datePublication": "2018-10-03T02:00:00.000+02:00",
      "dateFin": "2018-10-10T02:00:00.000+02:00",
      "preseance": "28",
      "nominPrincipale": "1",
      "infosQualite": {
        "codeQualite": "Suppléant",
        "libQualite": "Membre suppléant",
        "libQualiteSex": "Membre suppléante"
      },
      "organesRefs": [
        "PO759099"
      ]
    },
    {
      "xsiType": "MandatSimple_Type",
      "uid": "PM763128",
      "acteurRef": "PA720492",
      "legislature": "15",
      "typeOrgane": "CNPE",
      "dateDebut": "2019-03-08T01:00:00.000+01:00",
      "datePublication": "2019-03-09T01:00:00.000+01:00",
      "dateFin": "2019-07-18T02:00:00.000+02:00",
      "preseance": "20",
      "nominPrincipale": "1",
      "infosQualite": {
        "codeQualite": "Membre",
        "libQualite": "Membre",
        "libQualiteSex": "Membre"
      },
      "organesRefs": [
        "PO762987"
      ]
    },
    {
      "xsiType": "MandatSimple_Type",
      "uid": "PM765897",
      "acteurRef": "PA720492",
      "legislature": "15",
      "typeOrgane": "CMP",
      "dateDebut": "2019-06-20T02:00:00.000+02:00",
      "datePublication": "2019-06-21T02:00:00.000+02:00",
      "dateFin": "2019-07-11T02:00:00.000+02:00",
      "preseance": "28",
      "nominPrincipale": "1",
      "infosQualite": {
        "codeQualite": "Suppléant",
        "libQualite": "Membre suppléant",
        "libQualiteSex": "Membre suppléante"
      },
      "organesRefs": [
        "PO765278"
      ]
    }
  ]
}