{
  "uid": "PO684938",
  "codeType": "PARPOL",
  "libelle": "Mouvement Démocrate",
  "libelleEdition": "Mouvement Démocrate",
  "libelleAbrege": "Mouvement Démocrate",
  "libelleAbrev": "MODEM",
  "viMoDe": {}
}