{
  "uid": "PO229129",
  "codeType": "CMP",
  "libelle": "projet de loi de finances pour 2002",
  "libelleEdition": "sur le projet de loi de finances pour 2002",
  "libelleAbrege": "Projet de loi de finances pour 2002",
  "libelleAbrev": "3262",
  "viMoDe": {
    "dateDebut": "2001-12-11T01:00:00.000+01:00",
    "dateFin": "2001-12-12T01:00:00.000+01:00"
  },
  "regime": "5ème République",
  "legislature": "11",
  "secretariat": {}
}