{
  "uid": "PO403051",
  "codeType": "GE",
  "libelle": "Marchés, commerce non sédentaire et commerce de proximité",
  "libelleEdition": "sur les marchés, le commerce non sédentaire et le commerce de proximité",
  "libelleAbrege": "Marchés, commerce non sédentaire et commerce de proximité",
  "libelleAbrev": "MAR",
  "viMoDe": {
    "dateAgrement": "2007-10-31T01:00:00.000+01:00",
    "dateFin": "2012-06-19T02:00:00.000+02:00"
  },
  "regime": "5ème République",
  "legislature": "13",
  "secretariat": {}
}