{
  "uid": "PO733562",
  "codeType": "GA",
  "libelle": "France-Sénégal",
  "libelleEdition": "de France-Sénégal",
  "libelleAbrege": "Sénégal",
  "libelleAbrev": "SEN",
  "viMoDe": {
    "dateAgrement": "2017-07-19T02:00:00.000+02:00"
  },
  "regime": "5ème République",
  "legislature": "15",
  "secretariat": {
    "secretaire01": "Mme Sandra Calixte"
  },
  "listePays": [
    "GOP756530"
  ]
}