{
  "uid": "PO692259",
  "codeType": "GE",
  "libelle": "Genre et droits des femmes à l'international",
  "libelleEdition": "Genre et droits des femmes à l'international",
  "libelleAbrege": "Genre et droits des femmes à l'international",
  "libelleAbrev": "GENRE INTE",
  "viMoDe": {
    "dateAgrement": "2013-02-27T01:00:00.000+01:00",
    "dateFin": "2017-06-20T02:00:00.000+02:00"
  },
  "regime": "5ème République",
  "legislature": "14",
  "secretariat": {}
}