{
  "uid": "PO733487",
  "codeType": "GA",
  "libelle": "France-Birmanie",
  "libelleEdition": "de France-Birmanie",
  "libelleAbrege": "Birmanie",
  "libelleAbrev": "BIR",
  "viMoDe": {
    "dateAgrement": "2017-07-19T02:00:00.000+02:00"
  },
  "regime": "5ème République",
  "legislature": "15",
  "secretariat": {
    "secretaire01": "M. Thierry Deilhes"
  },
  "listePays": [
    "GOP756460"
  ]
}