{
  "uid": "PA336439",
  "etatCivil": {
    "ident": {
      "civ": "M.",
      "prenom": "Jean-Michel",
      "nom": "Clément",
      "alpha": "Clement",
      "trigramme": "JCL"
    },
    "infoNaissance": {
      "dateNais": "1954-10-31T01:00:00.000+01:00",
      "villeNais": "Mauprevoir",
      "depNais": "Vienne",
      "paysNais": "France"
    }
  },
  "profession": {
    "libelleCourant": "Avocat",
    "socProcInsee": {
      "catSocPro": "Professions libérales et assimilés",
      "famSocPro": "Cadres et professions intellectuelles supérieures"
    }
  },
  "uriHatvp": "https://www.hatvp.fr/pages_nominatives/clement-jean-michel",
  "adresses": [
    {
      "xsiType": "AdressePostale_Type",
      "uid": "AD387061",
      "type": "0",
      "typeLibelle": "Adresse officielle",
      "poids": "1",
      "intitule": "Assemblée nationale,",
      "numeroRue": "126",
      "nomRue": "Rue de l'Université,",
      "codePostal": "75355",
      "ville": "Paris 07 SP"
    },
    {
      "xsiType": "AdressePostale_Type",
      "uid": "AD389019",
      "type": "2",
      "typeLibelle": "Adresse publiée de circonscription",
      "poids": "21",
      "intitule": "Permanence",
      "nomRue": "Place du Champ de Foire",
      "complementAdresse": "BP 25",
      "codePostal": "86160",
      "ville": "Gençay"
    },
    {
      "xsiType": "AdresseTelephonique_Type",
      "uid": "AD389022",
      "type": "11",
      "typeLibelle": "Téléphone",
      "poids": "21",
      "adresseDeRattachement": "AD389019",
      "valElec": "05 49 03 16 38"
    },
    {
      "xsiType": "AdresseMail_Type",
      "uid": "AD716615",
      "type": "15",
      "typeLibelle": "Mèl",
      "valElec": "jean-michel.clement@assemblee-nationale.fr"
    },
    {
      "xsiType": "AdresseSiteWeb_Type",
      "uid": "AD726028",
      "type": "22",
      "typeLibelle": "Site internet",
      "valElec": "www.jeanmichelclement.com/"
    },
    {
      "xsiType": "AdresseSiteWeb_Type",
      "uid": "AD726110",
      "type": "25",
      "typeLibelle": "Facebook",
      "valElec": "jeanmichel.clement.3"
    },
    {
      "xsiType": "AdresseSiteWeb_Type",
      "uid": "AD726662",
      "type": "24",
      "typeLibelle": "Twitter",
      "valElec": "@jmclement86"
    },
    {
      "xsiType": "AdresseTelephonique_Type",
      "uid": "AD757859",
      "type": "11",
      "typeLibelle": "Téléphone",
      "poids": "1",
      "adresseDeRattachement": "AD387061",
      "valElec": "01.40.63.73.31"
    }
  ],
  "mandats": [
    {
      "xsiType": "MandatParlementaire_type",
      "uid": "PM386122",
      "acteurRef": "PA336439",
      "legislature": "13",
      "typeOrgane": "ASSEMBLEE",
      "dateDebut": "2007-06-20T02:00:00.000+02:00",
      "dateFin": "2012-06-19T02:00:00.000+02:00",
      "preseance": "50",
      "nominPrincipale": "1",
      "infosQualite": {
        "codeQualite": "membre",
        "libQualite": "membre",
        "libQualiteSex": "membre"
      },
      "organesRefs": [
        "PO384266"
      ],
      "suppleant": {
        "dateDebut": "2007-06-20T02:00:00.000+02:00",
        "dateFin": "2012-06-19T02:00:00.000+02:00",
        "suppleantRef": "PA346434"
      },
      "election": {
        "lieu": {
          "region": "Nouvelle-Aquitaine",
          "regionType": "Métropolitain",
          "departement": "Vienne",
          "numDepartement": "86",
          "numCirco": "3"
        },
        "causeMandat": "élections générales",
        "refCirconscription": "PO384750"
      },
      "mandature": {
        "datePriseFonction": "2007-06-20T02:00:00.000+02:00",
        "causeFin": "Fin de législature",
        "premiereElection": "0",
        "placeHemicycle": "638"
      }
    },
    {
      "xsiType": "MandatSimple_Type",
      "uid": "PM387640",
      "acteurRef": "PA336439",
      "legislature": "13",
      "typeOrgane": "GP",
      "dateDebut": "2007-06-20T02:00:00.000+02:00",
      "dateFin": "2007-06-26T02:00:00.000+02:00",
      "preseance": "28",
      "nominPrincipale": "1",
      "infosQualite": {
        "codeQualite": "Député non-inscrit",
        "libQualite": "Député non-inscrit",
        "libQualiteSex": "Député non-inscrit"
      },
      "organesRefs": [
        "PO387155"
      ]
    },
    {
      "xsiType": "MandatSimple_Type",
      "uid": "PM390095",
      "acteurRef": "PA336439",
      "legislature": "13",
      "typeOrgane": "GP",
      "dateDebut": "2007-06-27T02:00:00.000+02:00",
      "datePublication": "2007-06-27T02:00:00.000+02:00",
      "dateFin": "2012-06-19T02:00:00.000+02:00",
      "preseance": "20",
      "nominPrincipale": "1",
      "infosQualite": {
        "codeQualite": "Membre",
        "libQualite": "Membre du",
        "libQualiteSex": "Membre du"
      },
      "organesRefs": [
        "PO389507"
      ]
    },
    {
      "xsiType": "MandatSimple_Type",
      "uid": "PM390773",
      "acteurRef": "PA336439",
      "legislature": "13",
      "typeOrgane": "COMPER",
      "dateDebut": "2007-06-27T02:00:00.000+02:00",
      "datePublication": "2007-06-28T02:00:00.000+02:00",
      "dateFin": "2009-12-21T01:00:00.000+01:00",
      "preseance": "32",
      "nominPrincipale": "1",
      "infosQualite": {
        "codeQualite": "Membre",
        "libQualite": "Membre",
        "libQualiteSex": "Membre"
      },
      "organesRefs": [
        "PO59051"
      ]
    },
    {
      "xsiType": "MandatSimple_Type",
      "uid": "PM401337",
      "acteurRef": "PA336439",
      "legislature": "13",
      "typeOrgane": "GA",
      "dateDebut": "2007-10-26T02:00:00.000+02:00",
      "dateFin": "2012-06-19T02:00:00.000+02:00",
      "preseance": "20",
      "nominPrincipale": "1",
      "infosQualite": {
        "codeQualite": "Membre",
        "libQualite": "Membre",
        "libQualiteSex": "Membre"
      },
      "organesRefs": [
        "PO392800"
      ]
    },
    {
      "xsiType": "MandatSimple_Type",
      "uid": "PM401338",
      "acteurRef": "PA336439",
      "legislature": "13",
      "typeOrgane": "GA",
      "dateDebut": "2007-10-26T02:00:00.000+02:00",
      "dateFin": "2012-06-19T02:00:00.000+02:00",
      "preseance": "20",
      "nominPrincipale": "1",
      "infosQualite": {
        "codeQualite": "Membre",
        "libQualite": "Membre",
        "libQualiteSex": "Membre"
      },
      "organesRefs": [
        "PO392835"
      ]
    },
    {
      "xsiType": "MandatSimple_Type",
      "uid": "PM401339",
      "acteurRef": "PA336439",
      "legislature": "13",
      "typeOrgane": "GA",
      "dateDebut": "2007-10-26T02:00:00.000+02:00",
      "dateFin": "2012-06-19T02:00:00.000+02:00",
      "preseance": "20",
      "nominPrincipale": "1",
      "infosQualite": {
        "codeQualite": "Membre",
        "libQualite": "Membre",
        "libQualiteSex": "Membre"
      },
      "organesRefs": [
        "PO392940"
      ]
    },
    {
      "xsiType": "MandatSimple_Type",
      "uid": "PM401340",
      "acteurRef": "PA336439",
      "legislature": "13",
      "typeOrgane": "GA",
      "dateDebut": "2007-10-26T02:00:00.000+02:00",
      "dateFin": "2012-06-19T02:00:00.000+02:00",
      "preseance": "20",
      "nominPrincipale": "1",
      "infosQualite": {
        "codeQualite": "Membre",
        "libQualite": "Membre",
        "libQualiteSex": "Membre"
      },
      "organesRefs": [
        "PO393263"
      ]
    },
    {
      "xsiType": "MandatSimple_Type",
      "uid": "PM406331",
      "acteurRef": "PA336439",
      "legislature": "13",
      "typeOrgane": "GA",
      "dateDebut": "2008-01-11T01:00:00.000+01:00",
      "dateFin": "2012-06-19T02:00:00.000+02:00",
      "preseance": "8",
      "nominPrincipale": "1",
      "infosQualite": {
        "codeQualite": "Vice-Président",
        "libQualite": "Vice-Président",
        "libQualiteSex": "Vice-Président"
      },
      "organesRefs": [
        "PO393263"
      ]
    },
    {
      "xsiType": "MandatSimple_Type",
      "uid": "PM406646",
      "acteurRef": "PA336439",
      "legislature": "13",
      "typeOrgane": "GE",
      "dateDebut": "2008-01-11T01:00:00.000+01:00",
      "dateFin": "2012-06-19T02:00:00.000+02:00",
      "preseance": "20",
      "nominPrincipale": "0",
      "infosQualite": {
        "codeQualite": "Membre",
        "libQualite": "Membre",
        "libQualiteSex": "Membre"
      },
      "organesRefs": [
        "PO402727"
      ]
    },
    {
      "xsiType": "MandatSimple_Type",
      "uid": "PM406710",
      "acteurRef": "PA336439",
      "legislature": "13",
      "typeOrgane": "GE",
      "dateDebut": "2008-01-11T01:00:00.000+01:00",
      "dateFin": "2012-06-19T02:00:00.000+02:00",
      "preseance": "8",
      "nominPrincipale": "1",
      "infosQualite": {
        "codeQualite": "Vice-Président",
        "libQualite": "Vice-Président",
        "libQualiteSex": "Vice-Président"
      },
      "organesRefs": [
        "PO402727"
      ]
    },
    {
      "xsiType": "MandatSimple_Type",
      "uid": "PM407588",
      "acteurRef": "PA336439",
      "legislature": "13",
      "typeOrgane": "GE",
      "dateDebut": "2008-01-15T01:00:00.000+01:00",
      "dateFin": "2012-06-19T02:00:00.000+02:00",
      "preseance": "20",
      "nominPrincipale": "1",
      "infosQualite": {
        "codeQualite": "Membre",
        "libQualite": "Membre",
        "libQualiteSex": "Membre"
      },
      "organesRefs": [
        "PO402943"
      ]
    },
    {
      "xsiType": "MandatSimple_Type",
      "uid": "PM408126",
      "acteurRef": "PA336439",
      "legislature": "13",
      "typeOrgane": "CMP",
      "dateDebut": "2008-02-01T01:00:00.000+01:00",
      "datePublication": "2008-02-02T01:00:00.000+01:00",
      "dateFin": "2008-02-07T01:00:00.000+01:00",
      "preseance": "28",
      "nominPrincipale": "1",
      "infosQualite": {
        "codeQualite": "Suppléant",
        "libQualite": "Membre suppléant",
        "libQualiteSex": "Membre suppléant"
      },
      "organesRefs": [
        "PO408111"
      ]
    },
    {
      "xsiType": "MandatSimple_Type",
      "uid": "PM408389",
      "acteurRef": "PA336439",
      "legislature": "13",
      "typeOrgane": "GE",
      "dateDebut": "2008-02-07T01:00:00.000+01:00",
      "dateFin": "2012-06-19T02:00:00.000+02:00",
      "preseance": "20",
      "nominPrincipale": "1",
      "infosQualite": {
        "codeQualite": "Membre",
        "libQualite": "Membre",
        "libQualiteSex": "Membre"
      },
      "organesRefs": [
        "PO403178"
      ]
    },
    {
      "xsiType": "MandatSimple_Type",
      "uid": "PM410394",
      "acteurRef": "PA336439",
      "legislature": "13",
      "typeOrgane": "GE",
      "dateDebut": "2008-01-29T01:00:00.000+01:00",
      "dateFin": "2012-06-19T02:00:00.000+02:00",
      "preseance": "20",
      "nominPrincipale": "1",
      "infosQualite": {
        "codeQualite": "Membre",
        "libQualite": "Membre",
        "libQualiteSex": "Membre"
      },
      "organesRefs": [
        "PO402764"
      ]
    },
    {
      "xsiType": "MandatSimple_Type",
      "uid": "PM410853",
      "acteurRef": "PA336439",
      "legislature": "13",
      "typeOrgane": "GE",
      "dateDebut": "2008-01-08T01:00:00.000+01:00",
      "dateFin": "2012-06-19T02:00:00.000+02:00",
      "preseance": "20",
      "nominPrincipale": "1",
      "infosQualite": {
        "codeQualite": "Membre",
        "libQualite": "Membre",
        "libQualiteSex": "Membre"
      },
      "organesRefs": [
        "PO402919"
      ]
    },
    {
      "xsiType": "MandatSimple_Type",
      "uid": "PM412059",
      "acteurRef": "PA336439",
      "legislature": "13",
      "typeOrgane": "GE",
      "dateDebut": "2008-01-30T01:00:00.000+01:00",
      "dateFin": "2012-06-19T02:00:00.000+02:00",
      "preseance": "20",
      "nominPrincipale": "1",
      "infosQualite": {
        "codeQualite": "Membre",
        "libQualite": "Membre",
        "libQualiteSex": "Membre"
      },
      "organesRefs": [
        "PO403111"
      ]
    },
    {
      "xsiType": "MandatSimple_Type",
      "uid": "PM412212",
      "acteurRef": "PA336439",
      "legislature": "13",
      "typeOrgane": "GE",
      "dateDebut": "2008-04-10T02:00:00.000+02:00",
      "dateFin": "2012-06-19T02:00:00.000+02:00",
      "preseance": "20",
      "nominPrincipale": "1",
      "infosQualite": {
        "codeQualite": "Membre",
        "libQualite": "Membre",
        "libQualiteSex": "Membre"
      },
      "organesRefs": [
        "PO403208"
      ]
    },
    {
      "xsiType": "MandatSimple_Type",
      "uid": "PM412405",
      "acteurRef": "PA336439",
      "legislature": "13",
      "typeOrgane": "GE",
      "dateDebut": "2008-02-05T01:00:00.000+01:00",
      "dateFin": "2012-06-19T02:00:00.000+02:00",
      "preseance": "20",
      "nominPrincipale": "1",
      "infosQualite": {
        "codeQualite": "Membre",
        "libQualite": "Membre",
        "libQualiteSex": "Membre"
      },
      "organesRefs": [
        "PO403172"
      ]
    },
    {
      "xsiType": "MandatSimple_Type",
      "uid": "PM412737",
      "acteurRef": "PA336439",
      "legislature": "13",
      "typeOrgane": "CMP",
      "dateDebut": "2008-04-17T02:00:00.000+02:00",
      "datePublication": "2008-04-18T02:00:00.000+02:00",
      "dateFin": "2008-05-19T02:00:00.000+02:00",
      "preseance": "28",
      "nominPrincipale": "1",
      "infosQualite": {
        "codeQualite": "Suppléant",
        "libQualite": "Membre suppléant",
        "libQualiteSex": "Membre suppléant"
      },
      "organesRefs": [
        "PO412189"
      ]
    },
    {
      "xsiType": "MandatSimple_Type",
      "uid": "PM412817",
      "acteurRef": "PA336439",
      "legislature": "13",
      "typeOrgane": "GE",
      "dateDebut": "2008-04-18T02:00:00.000+02:00",
      "dateFin": "2012-06-19T02:00:00.000+02:00",
      "preseance": "20",
      "nominPrincipale": "1",
      "infosQualite": {
        "codeQualite": "Membre",
        "libQualite": "Membre",
        "libQualiteSex": "Membre"
      },
      "organesRefs": [
        "PO403202"
      ]
    },
    {
      "xsiType": "MandatSimple_Type",
      "uid": "PM413536",
      "acteurRef": "PA336439",
      "legislature": "13",
      "typeOrgane": "GE",
      "dateDebut": "2008-05-27T02:00:00.000+02:00",
      "dateFin": "2012-06-19T02:00:00.000+02:00",
      "preseance": "20",
      "nominPrincipale": "1",
      "infosQualite": {
        "codeQualite": "Membre",
        "libQualite": "Membre",
        "libQualiteSex": "Membre"
      },
      "organesRefs": [
        "PO403256"
      ]
    },
    {
      "xsiType": "MandatSimple_Type",
      "uid": "PM414858",
      "acteurRef": "PA336439",
      "legislature": "13",
      "typeOrgane": "CMP",
      "dateDebut": "2008-07-18T02:00:00.000+02:00",
      "datePublication": "2008-07-19T02:00:00.000+02:00",
      "dateFin": "2008-07-23T02:00:00.000+02:00",
      "preseance": "20",
      "nominPrincipale": "1",
      "infosQualite": {
        "codeQualite": "Titulaire",
        "libQualite": "Membre titulaire",
        "libQualiteSex": "Membre titulaire"
      },
      "organesRefs": [
        "PO414843"
      ]
    },
    {
      "xsiType": "MandatSimple_Type",
      "uid": "PM415825",
      "acteurRef": "PA336439",
      "legislature": "13",
      "typeOrgane": "GE",
      "dateDebut": "2008-10-07T02:00:00.000+02:00",
      "dateFin": "2012-06-19T02:00:00.000+02:00",
      "preseance": "20",
      "nominPrincipale": "1",
      "infosQualite": {
        "codeQualite": "Membre",
        "libQualite": "Membre",
        "libQualiteSex": "Membre"
      },
      "organesRefs": [
        "PO403148"
      ]
    },
    {
      "xsiType": "MandatSimple_Type",
      "uid": "PM416101",
      "acteurRef": "PA336439",
      "legislature": "13",
      "typeOrgane": "GE",
      "dateDebut": "2008-10-08T02:00:00.000+02:00",
      "dateFin": "2012-06-19T02:00:00.000+02:00",
      "preseance": "20",
      "nominPrincipale": "1",
      "infosQualite": {
        "codeQualite": "Membre",
        "libQualite": "Membre",
        "libQualiteSex": "Membre"
      },
      "organesRefs": [
        "PO415352"
      ]
    },
    {
      "xsiType": "MandatSimple_Type",
      "uid": "PM416312",
      "acteurRef": "PA336439",
      "legislature": "13",
      "typeOrgane": "GE",
      "dateDebut": "2008-02-06T01:00:00.000+01:00",
      "dateFin": "2012-06-19T02:00:00.000+02:00",
      "preseance": "20",
      "nominPrincipale": "0",
      "infosQualite": {
        "codeQualite": "Membre",
        "libQualite": "Membre",
        "libQualiteSex": "Membre"
      },
      "organesRefs": [
        "PO402931"
      ]
    },
    {
      "xsiType": "MandatSimple_Type",
      "uid": "PM416366",
      "acteurRef": "PA336439",
      "legislature": "13",
      "typeOrgane": "GE",
      "dateDebut": "2008-02-06T01:00:00.000+01:00",
      "dateFin": "2012-06-19T02:00:00.000+02:00",
      "preseance": "8",
      "nominPrincipale": "1",
      "infosQualite": {
        "codeQualite": "Vice-Président",
        "libQualite": "Vice-Président",
        "libQualiteSex": "Vice-Président"
      },
      "organesRefs": [
        "PO402931"
      ]
    },
    {
      "xsiType": "MandatSimple_Type",
      "uid": "PM416384",
      "acteurRef": "PA336439",
      "legislature": "13",
      "typeOrgane": "GE",
      "dateDebut": "2008-10-22T02:00:00.000+02:00",
      "dateFin": "2012-06-19T02:00:00.000+02:00",
      "preseance": "8",
      "nominPrincipale": "1",
      "infosQualite": {
        "codeQualite": "Vice-Président",
        "libQualite": "Vice-Président",
        "libQualiteSex": "Vice-Président"
      },
      "organesRefs": [
        "PO415352"
      ]
    },
    {
      "xsiType": "MandatSimple_Type",
      "uid": "PM422722",
      "acteurRef": "PA336439",
      "legislature": "13",
      "typeOrgane": "COMPER",
      "dateDebut": "2009-12-22T01:00:00.000+01:00",
      "datePublication": "2009-12-22T01:00:00.000+01:00",
      "dateFin": "2010-01-20T01:00:00.000+01:00",
      "preseance": "32",
      "nominPrincipale": "1",
      "infosQualite": {
        "codeQualite": "Membre",
        "libQualite": "Membre",
        "libQualiteSex": "Membre"
      },
      "organesRefs": [
        "PO419604"
      ]
    },
    {
      "xsiType": "MandatSimple_Type",
      "uid": "PM422838",
      "acteurRef": "PA336439",
      "legislature": "13",
      "typeOrgane": "COMPER",
      "dateDebut": "2010-01-21T01:00:00.000+01:00",
      "datePublication": "2010-01-21T01:00:00.000+01:00",
      "dateFin": "2010-05-21T02:00:00.000+02:00",
      "preseance": "32",
      "nominPrincipale": "1",
      "infosQualite": {
        "codeQualite": "Membre",
        "libQualite": "Membre",
        "libQualiteSex": "Membre"
      },
      "organesRefs": [
        "PO59051"
      ]
    },
    {
      "xsiType": "MandatMission_Type",
      "uid": "PM423523",
      "acteurRef": "PA336439",
      "legislature": "13",
      "typeOrgane": "MISINFOPRE",
      "dateDebut": "2010-04-06T02:00:00.000+02:00",
      "datePublication": "2010-04-07T02:00:00.000+02:00",
      "dateFin": "2010-07-01T02:00:00.000+02:00",
      "preseance": "20",
      "nominPrincipale": "1",
      "infosQualite": {
        "codeQualite": "Membre",
        "libQualite": "Membre",
        "libQualiteSex": "Membre"
      },
      "organesRefs": [
        "PO423513"
      ]
    },
    {
      "xsiType": "MandatSimple_Type",
      "uid": "PM423764",
      "acteurRef": "PA336439",
      "legislature": "13",
      "typeOrgane": "CMP",
      "dateDebut": "2010-04-26T02:00:00.000+02:00",
      "datePublication": "2010-04-27T02:00:00.000+02:00",
      "dateFin": "2010-06-16T02:00:00.000+02:00",
      "preseance": "20",
      "nominPrincipale": "1",
      "infosQualite": {
        "codeQualite": "Titulaire",
        "libQualite": "Membre titulaire",
        "libQualiteSex": "Membre titulaire"
      },
      "organesRefs": [
        "PO423616"
      ]
    },
    {
      "xsiType": "MandatSimple_Type",
      "uid": "PM424091",
      "acteurRef": "PA336439",
      "legislature": "13",
      "typeOrgane": "COMPER",
      "dateDebut": "2010-05-22T02:00:00.000+02:00",
      "datePublication": "2010-05-22T02:00:00.000+02:00",
      "dateFin": "2010-06-02T02:00:00.000+02:00",
      "preseance": "32",
      "nominPrincipale": "1",
      "infosQualite": {
        "codeQualite": "Membre",
        "libQualite": "Membre",
        "libQualiteSex": "Membre"
      },
      "organesRefs": [
        "PO419610"
      ]
    },
    {
      "xsiType": "MandatSimple_Type",
      "uid": "PM424158",
      "acteurRef": "PA336439",
      "legislature": "13",
      "typeOrgane": "COMPER",
      "dateDebut": "2010-06-03T02:00:00.000+02:00",
      "datePublication": "2010-06-03T02:00:00.000+02:00",
      "dateFin": "2010-10-13T02:00:00.000+02:00",
      "preseance": "32",
      "nominPrincipale": "1",
      "infosQualite": {
        "codeQualite": "Membre",
        "libQualite": "Membre",
        "libQualiteSex": "Membre"
      },
      "organesRefs": [
        "PO59051"
      ]
    },
    {
      "xsiType": "MandatSimple_Type",
      "uid": "PM424172",
      "acteurRef": "PA336439",
      "legislature": "13",
      "typeOrgane": "CMP",
      "dateDebut": "2010-06-02T02:00:00.000+02:00",
      "datePublication": "2010-06-03T02:00:00.000+02:00",
      "dateFin": "2010-07-06T02:00:00.000+02:00",
      "preseance": "28",
      "nominPrincipale": "1",
      "infosQualite": {
        "codeQualite": "Suppléant",
        "libQualite": "Membre suppléant",
        "libQualiteSex": "Membre suppléant"
      },
      "organesRefs": [
        "PO424064"
      ]
    },
    {
      "xsiType": "MandatSimple_Type",
      "uid": "PM425311",
      "acteurRef": "PA336439",
      "legislature": "13",
      "typeOrgane": "COMPER",
      "dateDebut": "2010-10-14T02:00:00.000+02:00",
      "datePublication": "2010-10-14T02:00:00.000+02:00",
      "dateFin": "2010-10-15T02:00:00.000+02:00",
      "preseance": "32",
      "nominPrincipale": "1",
      "infosQualite": {
        "codeQualite": "Membre",
        "libQualite": "Membre",
        "libQualiteSex": "Membre"
      },
      "organesRefs": [
        "PO419604"
      ]
    },
    {
      "xsiType": "MandatSimple_Type",
      "uid": "PM425318",
      "acteurRef": "PA336439",
      "legislature": "13",
      "typeOrgane": "COMPER",
      "dateDebut": "2010-10-16T02:00:00.000+02:00",
      "datePublication": "2010-10-16T02:00:00.000+02:00",
      "dateFin": "2012-06-19T02:00:00.000+02:00",
      "preseance": "32",
      "nominPrincipale": "1",
      "infosQualite": {
        "codeQualite": "Membre",
        "libQualite": "Membre",
        "libQualiteSex": "Membre"
      },
      "organesRefs": [
        "PO59051"
      ]
    },
    {
      "xsiType": "MandatSimple_Type",
      "uid": "PM425506",
      "acteurRef": "PA336439",
      "legislature": "13",
      "typeOrgane": "GE",
      "dateDebut": "2007-10-31T01:00:00.000+01:00",
      "dateFin": "2012-06-19T02:00:00.000+02:00",
      "preseance": "20",
      "nominPrincipale": "1",
      "infosQualite": {
        "codeQualite": "Membre",
        "libQualite": "Membre",
        "libQualiteSex": "Membre"
      },
      "organesRefs": [
        "PO403238"
      ]
    },
    {
      "xsiType": "MandatSimple_Type",
      "uid": "PM427227",
      "acteurRef": "PA336439",
      "legislature": "13",
      "typeOrgane": "GE",
      "dateDebut": "2011-01-18T01:00:00.000+01:00",
      "dateFin": "2012-06-19T02:00:00.000+02:00",
      "preseance": "20",
      "nominPrincipale": "1",
      "infosQualite": {
        "codeQualite": "Membre",
        "libQualite": "Membre",
        "libQualiteSex": "Membre"
      },
      "organesRefs": [
        "PO425412"
      ]
    },
    {
      "xsiType": "MandatSimple_Type",
      "uid": "PM427967",
      "acteurRef": "PA336439",
      "legislature": "13",
      "typeOrgane": "CMP",
      "dateDebut": "2011-04-04T02:00:00.000+02:00",
      "datePublication": "2011-04-05T02:00:00.000+02:00",
      "dateFin": "2011-04-15T02:00:00.000+02:00",
      "preseance": "20",
      "nominPrincipale": "1",
      "infosQualite": {
        "codeQualite": "Titulaire",
        "libQualite": "Membre titulaire",
        "libQualiteSex": "Membre titulaire"
      },
      "organesRefs": [
        "PO427896"
      ]
    },
    {
      "xsiType": "MandatSimple_Type",
      "uid": "PM429013",
      "acteurRef": "PA336439",
      "legislature": "13",
      "typeOrgane": "CMP",
      "dateDebut": "2011-06-22T02:00:00.000+02:00",
      "datePublication": "2011-06-23T02:00:00.000+02:00",
      "dateFin": "2011-06-29T02:00:00.000+02:00",
      "preseance": "20",
      "nominPrincipale": "1",
      "infosQualite": {
        "codeQualite": "Titulaire",
        "libQualite": "Membre titulaire",
        "libQualiteSex": "Membre titulaire"
      },
      "organesRefs": [
        "PO428704"
      ]
    },
    {
      "xsiType": "MandatSimple_Type",
      "uid": "PM429359",
      "acteurRef": "PA336439",
      "legislature": "13",
      "typeOrgane": "CMP",
      "dateDebut": "2011-07-05T02:00:00.000+02:00",
      "datePublication": "2011-07-06T02:00:00.000+02:00",
      "dateFin": "2011-07-25T02:00:00.000+02:00",
      "preseance": "20",
      "nominPrincipale": "1",
      "infosQualite": {
        "codeQualite": "Titulaire",
        "libQualite": "Membre titulaire",
        "libQualiteSex": "Membre titulaire"
      },
      "organesRefs": [
        "PO429350"
      ]
    },
    {
      "xsiType": "MandatSimple_Type",
      "uid": "PM430606",
      "acteurRef": "PA336439",
      "legislature": "13",
      "typeOrgane": "GE",
      "dateDebut": "2011-10-18T02:00:00.000+02:00",
      "dateFin": "2012-06-19T02:00:00.000+02:00",
      "preseance": "20",
      "nominPrincipale": "1",
      "infosQualite": {
        "codeQualite": "Membre",
        "libQualite": "Membre",
        "libQualiteSex": "Membre"
      },
      "organesRefs": [
        "PO429409"
      ]
    },
    {
      "xsiType": "MandatSimple_Type",
      "uid": "PM475756",
      "acteurRef": "PA336439",
      "legislature": "13",
      "typeOrgane": "CMP",
      "dateDebut": "2012-01-13T01:00:00.000+01:00",
      "datePublication": "2012-01-14T01:00:00.000+01:00",
      "dateFin": "2012-02-29T01:00:00.000+01:00",
      "preseance": "20",
      "nominPrincipale": "1",
      "infosQualite": {
        "codeQualite": "Titulaire",
        "libQualite": "Membre titulaire",
        "libQualiteSex": "Membre titulaire"
      },
      "organesRefs": [
        "PO474593"
      ]
    },
    {
      "xsiType": "MandatParlementaire_type",
      "uid": "PM645333",
      "acteurRef": "PA336439",
      "legislature": "14",
      "typeOrgane": "ASSEMBLEE",
      "dateDebut": "2012-06-20T02:00:00.000+02:00",
      "dateFin": "2017-06-20T02:00:00.000+02:00",
      "preseance": "50",
      "nominPrincipale": "1",
      "infosQualite": {
        "codeQualite": "membre",
        "libQualite": "membre",
        "libQualiteSex": "membre"
      },
      "organesRefs": [
        "PO644420"
      ],
      "suppleant": {
        "dateDebut": "2012-06-20T02:00:00.000+02:00",
        "dateFin": "2017-06-20T02:00:00.000+02:00",
        "suppleantRef": "PA346434"
      },
      "election": {
        "lieu": {
          "region": "Nouvelle-Aquitaine",
          "regionType": "Métropolitain",
          "departement": "Vienne",
          "numDepartement": "86",
          "numCirco": "3"
        },
        "causeMandat": "élections générales",
        "refCirconscription": "PO644904"
      },
      "mandature": {
        "datePriseFonction": "2012-06-20T02:00:00.000+02:00",
        "causeFin": "Fin de législature",
        "premiereElection": "1",
        "placeHemicycle": "638"
      }
    },
    {
      "xsiType": "MandatSimple_Type",
      "uid": "PM656095",
      "acteurRef": "PA336439",
      "legislature": "14",
      "typeOrgane": "GP",
      "dateDebut": "2012-06-26T02:00:00.000+02:00",
      "datePublication": "2012-06-27T02:00:00.000+02:00",
      "dateFin": "2016-05-24T02:00:00.000+02:00",
      "preseance": "20",
      "nominPrincipale": "1",
      "infosQualite": {
        "codeQualite": "Membre",
        "libQualite": "Membre du",
        "libQualiteSex": "Membre du"
      },
      "organesRefs": [
        "PO656002"
      ]
    },
    {
      "xsiType": "MandatSimple_Type",
      "uid": "PM657399",
      "acteurRef": "PA336439",
      "legislature": "14",
      "typeOrgane": "COMPER",
      "dateDebut": "2012-06-28T02:00:00.000+02:00",
      "datePublication": "2012-06-28T02:00:00.000+02:00",
      "dateFin": "2013-12-10T01:00:00.000+01:00",
      "preseance": "32",
      "nominPrincipale": "1",
      "infosQualite": {
        "codeQualite": "Membre",
        "libQualite": "Membre",
        "libQualiteSex": "Membre"
      },
      "organesRefs": [
        "PO59051"
      ]
    },
    {
      "xsiType": "MandatSimple_Type",
      "uid": "PM678617",
      "acteurRef": "PA336439",
      "legislature": "14",
      "typeOrgane": "GA",
      "dateDebut": "2012-09-26T02:00:00.000+02:00",
      "dateFin": "2017-06-20T02:00:00.000+02:00",
      "preseance": "20",
      "nominPrincipale": "0",
      "infosQualite": {
        "codeQualite": "Membre",
        "libQualite": "Membre",
        "libQualiteSex": "Membre"
      },
      "organesRefs": [
        "PO675827"
      ]
    },
    {
      "xsiType": "MandatSimple_Type",
      "uid": "PM678618",
      "acteurRef": "PA336439",
      "legislature": "14",
      "typeOrgane": "GA",
      "dateDebut": "2012-09-26T02:00:00.000+02:00",
      "dateFin": "2017-06-20T02:00:00.000+02:00",
      "preseance": "1",
      "nominPrincipale": "1",
      "infosQualite": {
        "codeQualite": "Président",
        "libQualite": "Président",
        "libQualiteSex": "Président"
      },
      "organesRefs": [
        "PO675827"
      ]
    },
    {
      "xsiType": "MandatSimple_Type",
      "uid": "PM683259",
      "acteurRef": "PA336439",
      "legislature": "14",
      "typeOrgane": "GA",
      "dateDebut": "2012-10-23T02:00:00.000+02:00",
      "dateFin": "2017-06-20T02:00:00.000+02:00",
      "preseance": "20",
      "nominPrincipale": "1",
      "infosQualite": {
        "codeQualite": "Membre",
        "libQualite": "Membre",
        "libQualiteSex": "Membre"
      },
      "organesRefs": [
        "PO675730"
      ]
    },
    {
      "xsiType": "MandatSimple_Type",
      "uid": "PM683260",
      "acteurRef": "PA336439",
      "legislature": "14",
      "typeOrgane": "GA",
      "dateDebut": "2012-10-23T02:00:00.000+02:00",
      "dateFin": "2017-06-20T02:00:00.000+02:00",
      "preseance": "20",
      "nominPrincipale": "1",
      "infosQualite": {
        "codeQualite": "Membre",
        "libQualite": "Membre",
        "libQualiteSex": "Membre"
      },
      "organesRefs": [
        "PO675795"
      ]
    },
    {
      "xsiType": "MandatSimple_Type",
      "uid": "PM683261",
      "acteurRef": "PA336439",
      "legislature": "14",
      "typeOrgane": "GA",
      "dateDebut": "2012-10-23T02:00:00.000+02:00",
      "dateFin": "2017-06-20T02:00:00.000+02:00",
      "preseance": "20",
      "nominPrincipale": "1",
      "infosQualite": {
        "codeQualite": "Membre",
        "libQualite": "Membre",
        "libQualiteSex": "Membre"
      },
      "organesRefs": [
        "PO675697"
      ]
    },
    {
      "xsiType": "MandatSimple_Type",
      "uid": "PM683262",
      "acteurRef": "PA336439",
      "legislature": "14",
      "typeOrgane": "GA",
      "dateDebut": "2012-10-23T02:00:00.000+02:00",
      "dateFin": "2017-06-20T02:00:00.000+02:00",
      "preseance": "20",
      "nominPrincipale": "1",
      "infosQualite": {
        "codeQualite": "Membre",
        "libQualite": "Membre",
        "libQualiteSex": "Membre"
      },
      "organesRefs": [
        "PO675839"
      ]
    },
    {
      "xsiType": "MandatSimple_Type",
      "uid": "PM683263",
      "acteurRef": "PA336439",
      "legislature": "14",
      "typeOrgane": "GA",
      "dateDebut": "2012-10-23T02:00:00.000+02:00",
      "dateFin": "2017-06-20T02:00:00.000+02:00",
      "preseance": "20",
      "nominPrincipale": "1",
      "infosQualite": {
        "codeQualite": "Membre",
        "libQualite": "Membre",
        "libQualiteSex": "Membre"
      },
      "organesRefs": [
        "PO675762"
      ]
    },
    {
      "xsiType": "MandatSimple_Type",
      "uid": "PM683264",
      "acteurRef": "PA336439",
      "legislature": "14",
      "typeOrgane": "GA",
      "dateDebut": "2012-10-23T02:00:00.000+02:00",
      "dateFin": "2017-06-20T02:00:00.000+02:00",
      "preseance": "20",
      "nominPrincipale": "1",
      "infosQualite": {
        "codeQualite": "Membre",
        "libQualite": "Membre",
        "libQualiteSex": "Membre"
      },
      "organesRefs": [
        "PO675711"
      ]
    },
    {
      "xsiType": "MandatSimple_Type",
      "uid": "PM683265",
      "acteurRef": "PA336439",
      "legislature": "14",
      "typeOrgane": "GA",
      "dateDebut": "2012-10-23T02:00:00.000+02:00",
      "dateFin": "2017-06-20T02:00:00.000+02:00",
      "preseance": "20",
      "nominPrincipale": "1",
      "infosQualite": {
        "codeQualite": "Membre",
        "libQualite": "Membre",
        "libQualiteSex": "Membre"
      },
      "organesRefs": [
        "PO675784"
      ]
    },
    {
      "xsiType": "MandatSimple_Type",
      "uid": "PM685351",
      "acteurRef": "PA336439",
      "legislature": "14",
      "typeOrgane": "GA",
      "dateDebut": "2012-12-04T01:00:00.000+01:00",
      "dateFin": "2017-06-20T02:00:00.000+02:00",
      "preseance": "8",
      "nominPrincipale": "1",
      "infosQualite": {
        "codeQualite": "Vice-Président",
        "libQualite": "Vice-Président",
        "libQualiteSex": "Vice-Président"
      },
      "organesRefs": [
        "PO675697"
      ]
    },
    {
      "xsiType": "MandatSimple_Type",
      "uid": "PM685695",
      "acteurRef": "PA336439",
      "typeOrgane": "PARPOL",
      "dateDebut": "2012-12-01T01:00:00.000+01:00",
      "dateFin": "2017-06-20T02:00:00.000+02:00",
      "preseance": "5",
      "nominPrincipale": "1",
      "infosQualite": {
        "codeQualite": "Membre",
        "libQualite": "Membre",
        "libQualiteSex": "Membre"
      },
      "organesRefs": [
        "PO684932"
      ]
    },
    {
      "xsiType": "MandatSimple_Type",
      "uid": "PM686360",
      "acteurRef": "PA336439",
      "legislature": "14",
      "typeOrgane": "GE",
      "dateDebut": "2012-12-12T01:00:00.000+01:00",
      "dateFin": "2017-06-20T02:00:00.000+02:00",
      "preseance": "20",
      "nominPrincipale": "0",
      "infosQualite": {
        "codeQualite": "Membre",
        "libQualite": "Membre",
        "libQualiteSex": "Membre"
      },
      "organesRefs": [
        "PO686354"
      ]
    },
    {
      "xsiType": "MandatSimple_Type",
      "uid": "PM686361",
      "acteurRef": "PA336439",
      "legislature": "14",
      "typeOrgane": "GE",
      "dateDebut": "2012-12-12T01:00:00.000+01:00",
      "dateFin": "2017-06-20T02:00:00.000+02:00",
      "preseance": "1",
      "nominPrincipale": "1",
      "infosQualite": {
        "codeQualite": "Président",
        "libQualite": "Président",
        "libQualiteSex": "Président"
      },
      "organesRefs": [
        "PO686354"
      ]
    },
    {
      "xsiType": "MandatSimple_Type",
      "uid": "PM687646",
      "acteurRef": "PA336439",
      "legislature": "14",
      "typeOrgane": "GE",
      "dateDebut": "2013-01-10T01:00:00.000+01:00",
      "dateFin": "2017-06-20T02:00:00.000+02:00",
      "preseance": "20",
      "nominPrincipale": "1",
      "infosQualite": {
        "codeQualite": "Membre",
        "libQualite": "Membre",
        "libQualiteSex": "Membre"
      },
      "organesRefs": [
        "PO686397"
      ]
    },
    {
      "xsiType": "MandatSimple_Type",
      "uid": "PM687726",
      "acteurRef": "PA336439",
      "legislature": "14",
      "typeOrgane": "GE",
      "dateDebut": "2013-01-11T01:00:00.000+01:00",
      "dateFin": "2017-06-20T02:00:00.000+02:00",
      "preseance": "20",
      "nominPrincipale": "1",
      "infosQualite": {
        "codeQualite": "Membre",
        "libQualite": "Membre",
        "libQualiteSex": "Membre"
      },
      "organesRefs": [
        "PO686258"
      ]
    },
    {
      "xsiType": "MandatSimple_Type",
      "uid": "PM688068",
      "acteurRef": "PA336439",
      "legislature": "14",
      "typeOrgane": "GE",
      "dateDebut": "2013-01-16T01:00:00.000+01:00",
      "dateFin": "2017-06-20T02:00:00.000+02:00",
      "preseance": "8",
      "nominPrincipale": "1",
      "infosQualite": {
        "codeQualite": "Vice-Président",
        "libQualite": "Vice-Président",
        "libQualiteSex": "Vice-Président"
      },
      "organesRefs": [
        "PO686397"
      ]
    },
    {
      "xsiType": "MandatSimple_Type",
      "uid": "PM688931",
      "acteurRef": "PA336439",
      "legislature": "14",
      "typeOrgane": "GE",
      "dateDebut": "2013-01-25T01:00:00.000+01:00",
      "dateFin": "2017-06-20T02:00:00.000+02:00",
      "preseance": "20",
      "nominPrincipale": "1",
      "infosQualite": {
        "codeQualite": "Membre",
        "libQualite": "Membre",
        "libQualiteSex": "Membre"
      },
      "organesRefs": [
        "PO686577"
      ]
    },
    {
      "xsiType": "MandatSimple_Type",
      "uid": "PM689174",
      "acteurRef": "PA336439",
      "legislature": "14",
      "typeOrgane": "GE",
      "dateDebut": "2013-01-02T01:00:00.000+01:00",
      "dateFin": "2017-06-20T02:00:00.000+02:00",
      "preseance": "20",
      "nominPrincipale": "1",
      "infosQualite": {
        "codeQualite": "Membre",
        "libQualite": "Membre",
        "libQualiteSex": "Membre"
      },
      "organesRefs": [
        "PO686617"
      ]
    },
    {
      "xsiType": "MandatSimple_Type",
      "uid": "PM689476",
      "acteurRef": "PA336439",
      "legislature": "14",
      "typeOrgane": "GE",
      "dateDebut": "2013-01-23T01:00:00.000+01:00",
      "dateFin": "2017-06-20T02:00:00.000+02:00",
      "preseance": "20",
      "nominPrincipale": "1",
      "infosQualite": {
        "codeQualite": "Membre",
        "libQualite": "Membre",
        "libQualiteSex": "Membre"
      },
      "organesRefs": [
        "PO687109"
      ]
    },
    {
      "xsiType": "MandatSimple_Type",
      "uid": "PM690016",
      "acteurRef": "PA336439",
      "legislature": "14",
      "typeOrgane": "GE",
      "dateDebut": "2013-02-02T01:00:00.000+01:00",
      "dateFin": "2017-06-20T02:00:00.000+02:00",
      "preseance": "20",
      "nominPrincipale": "1",
      "infosQualite": {
        "codeQualite": "Membre",
        "libQualite": "Membre",
        "libQualiteSex": "Membre"
      },
      "organesRefs": [
        "PO686424"
      ]
    },
    {
      "xsiType": "MandatSimple_Type",
      "uid": "PM690441",
      "acteurRef": "PA336439",
      "legislature": "14",
      "typeOrgane": "GE",
      "dateDebut": "2013-02-06T01:00:00.000+01:00",
      "dateFin": "2017-06-20T02:00:00.000+02:00",
      "preseance": "12",
      "nominPrincipale": "1",
      "infosQualite": {
        "codeQualite": "Secrétaire",
        "libQualite": "Secrétaire",
        "libQualiteSex": "Secrétaire"
      },
      "organesRefs": [
        "PO686258"
      ]
    },
    {
      "xsiType": "MandatSimple_Type",
      "uid": "PM690466",
      "acteurRef": "PA336439",
      "legislature": "14",
      "typeOrgane": "GE",
      "dateDebut": "2013-01-23T01:00:00.000+01:00",
      "dateFin": "2017-06-20T02:00:00.000+02:00",
      "preseance": "20",
      "nominPrincipale": "1",
      "infosQualite": {
        "codeQualite": "Membre",
        "libQualite": "Membre",
        "libQualiteSex": "Membre"
      },
      "organesRefs": [
        "PO686337"
      ]
    },
    {
      "xsiType": "MandatSimple_Type",
      "uid": "PM690676",
      "acteurRef": "PA336439",
      "legislature": "14",
      "typeOrgane": "GE",
      "dateDebut": "2013-02-06T01:00:00.000+01:00",
      "dateFin": "2017-06-20T02:00:00.000+02:00",
      "preseance": "20",
      "nominPrincipale": "1",
      "infosQualite": {
        "codeQualite": "Membre",
        "libQualite": "Membre",
        "libQualiteSex": "Membre"
      },
      "organesRefs": [
        "PO686346"
      ]
    },
    {
      "xsiType": "MandatSimple_Type",
      "uid": "PM691332",
      "acteurRef": "PA336439",
      "legislature": "14",
      "typeOrgane": "GE",
      "dateDebut": "2013-02-12T01:00:00.000+01:00",
      "dateFin": "2017-06-20T02:00:00.000+02:00",
      "preseance": "20",
      "nominPrincipale": "1",
      "infosQualite": {
        "codeQualite": "Membre",
        "libQualite": "Membre",
        "libQualiteSex": "Membre"
      },
      "organesRefs": [
        "PO687120"
      ]
    },
    {
      "xsiType": "MandatSimple_Type",
      "uid": "PM693382",
      "acteurRef": "PA336439",
      "legislature": "14",
      "typeOrgane": "GE",
      "dateDebut": "2013-03-26T01:00:00.000+01:00",
      "dateFin": "2017-06-20T02:00:00.000+02:00",
      "preseance": "20",
      "nominPrincipale": "1",
      "infosQualite": {
        "codeQualite": "Membre",
        "libQualite": "Membre",
        "libQualiteSex": "Membre"
      },
      "organesRefs": [
        "PO689030"
      ]
    },
    {
      "xsiType": "MandatSimple_Type",
      "uid": "PM693433",
      "acteurRef": "PA336439",
      "legislature": "14",
      "typeOrgane": "GE",
      "dateDebut": "2013-04-09T02:00:00.000+02:00",
      "dateFin": "2017-06-20T02:00:00.000+02:00",
      "preseance": "20",
      "nominPrincipale": "1",
      "infosQualite": {
        "codeQualite": "Membre",
        "libQualite": "Membre",
        "libQualiteSex": "Membre"
      },
      "organesRefs": [
        "PO686896"
      ]
    },
    {
      "xsiType": "MandatSimple_Type",
      "uid": "PM698009",
      "acteurRef": "PA336439",
      "legislature": "14",
      "typeOrgane": "CMP",
      "dateDebut": "2013-10-22T02:00:00.000+02:00",
      "datePublication": "2013-10-23T02:00:00.000+02:00",
      "dateFin": "2013-11-21T01:00:00.000+01:00",
      "preseance": "28",
      "nominPrincipale": "1",
      "infosQualite": {
        "codeQualite": "Suppléant",
        "libQualite": "Membre suppléant",
        "libQualiteSex": "Membre suppléant"
      },
      "organesRefs": [
        "PO697540"
      ]
    },
    {
      "xsiType": "MandatSimple_Type",
      "uid": "PM698038",
      "acteurRef": "PA336439",
      "legislature": "14",
      "typeOrgane": "CMP",
      "dateDebut": "2013-10-22T02:00:00.000+02:00",
      "datePublication": "2013-10-23T02:00:00.000+02:00",
      "dateFin": "2013-11-21T01:00:00.000+01:00",
      "preseance": "28",
      "nominPrincipale": "1",
      "infosQualite": {
        "codeQualite": "Suppléant",
        "libQualite": "Membre suppléant",
        "libQualiteSex": "Membre suppléant"
      },
      "organesRefs": [
        "PO697534"
      ]
    },
    {
      "xsiType": "MandatSimple_Type",
      "uid": "PM699029",
      "acteurRef": "PA336439",
      "legislature": "14",
      "typeOrgane": "COMPER",
      "dateDebut": "2013-12-11T01:00:00.000+01:00",
      "datePublication": "2013-12-11T01:00:00.000+01:00",
      "dateFin": "2013-12-13T01:00:00.000+01:00",
      "preseance": "32",
      "nominPrincipale": "1",
      "infosQualite": {
        "codeQualite": "Membre",
        "libQualite": "Membre",
        "libQualiteSex": "Membre"
      },
      "organesRefs": [
        "PO419610"
      ]
    },
    {
      "xsiType": "MandatSimple_Type",
      "uid": "PM699100",
      "acteurRef": "PA336439",
      "legislature": "14",
      "typeOrgane": "COMPER",
      "dateDebut": "2013-12-14T01:00:00.000+01:00",
      "datePublication": "2013-12-14T01:00:00.000+01:00",
      "dateFin": "2014-06-23T02:00:00.000+02:00",
      "preseance": "32",
      "nominPrincipale": "1",
      "infosQualite": {
        "codeQualite": "Membre",
        "libQualite": "Membre",
        "libQualiteSex": "Membre"
      },
      "organesRefs": [
        "PO59051"
      ]
    },
    {
      "xsiType": "MandatSimple_Type",
      "uid": "PM701940",
      "acteurRef": "PA336439",
      "legislature": "14",
      "typeOrgane": "COMPER",
      "dateDebut": "2014-06-24T02:00:00.000+02:00",
      "datePublication": "2014-06-24T02:00:00.000+02:00",
      "dateFin": "2014-06-26T02:00:00.000+02:00",
      "preseance": "32",
      "nominPrincipale": "1",
      "infosQualite": {
        "codeQualite": "Membre",
        "libQualite": "Membre",
        "libQualiteSex": "Membre"
      },
      "organesRefs": [
        "PO419610"
      ]
    },
    {
      "xsiType": "MandatSimple_Type",
      "uid": "PM702047",
      "acteurRef": "PA336439",
      "legislature": "14",
      "typeOrgane": "COMPER",
      "dateDebut": "2014-06-27T02:00:00.000+02:00",
      "datePublication": "2014-06-27T02:00:00.000+02:00",
      "dateFin": "2016-12-06T01:00:00.000+01:00",
      "preseance": "32",
      "nominPrincipale": "1",
      "infosQualite": {
        "codeQualite": "Membre",
        "libQualite": "Membre",
        "libQualiteSex": "Membre"
      },
      "organesRefs": [
        "PO59051"
      ]
    },
    {
      "xsiType": "MandatSimple_Type",
      "uid": "PM702683",
      "acteurRef": "PA336439",
      "legislature": "14",
      "typeOrgane": "CMP",
      "dateDebut": "2014-07-22T02:00:00.000+02:00",
      "datePublication": "2014-07-23T02:00:00.000+02:00",
      "dateFin": "2014-09-11T02:00:00.000+02:00",
      "preseance": "28",
      "nominPrincipale": "1",
      "infosQualite": {
        "codeQualite": "Suppléant",
        "libQualite": "Membre suppléant",
        "libQualiteSex": "Membre suppléant"
      },
      "organesRefs": [
        "PO702646"
      ]
    },
    {
      "xsiType": "MandatSimple_Type",
      "uid": "PM703042",
      "acteurRef": "PA336439",
      "legislature": "14",
      "typeOrgane": "CNPS",
      "dateDebut": "2014-09-02T02:00:00.000+02:00",
      "datePublication": "2014-09-03T02:00:00.000+02:00",
      "dateFin": "2015-08-18T02:00:00.000+02:00",
      "preseance": "20",
      "nominPrincipale": "1",
      "infosQualite": {
        "codeQualite": "Membre",
        "libQualite": "Membre",
        "libQualiteSex": "Membre"
      },
      "organesRefs": [
        "PO702808"
      ]
    },
    {
      "xsiType": "MandatMission_Type",
      "uid": "PM703445",
      "acteurRef": "PA336439",
      "legislature": "14",
      "typeOrgane": "MISINFO",
      "dateDebut": "2014-10-01T02:00:00.000+02:00",
      "dateFin": "2014-12-17T01:00:00.000+01:00",
      "preseance": "10",
      "nominPrincipale": "0",
      "infosQualite": {
        "codeQualite": "Membre",
        "libQualite": "Membre",
        "libQualiteSex": "Membre"
      },
      "organesRefs": [
        "PO703211"
      ]
    },
    {
      "xsiType": "MandatMission_Type",
      "uid": "PM703463",
      "acteurRef": "PA336439",
      "legislature": "14",
      "typeOrgane": "MISINFO",
      "dateDebut": "2014-10-01T02:00:00.000+02:00",
      "dateFin": "2014-12-17T01:00:00.000+01:00",
      "preseance": "4",
      "nominPrincipale": "1",
      "infosQualite": {
        "codeQualite": "Vice-Président",
        "libQualite": "Vice-président",
        "libQualiteSex": "Vice-président"
      },
      "organesRefs": [
        "PO703211"
      ]
    },
    {
      "xsiType": "MandatSimple_Type",
      "uid": "PM706551",
      "acteurRef": "PA336439",
      "legislature": "14",
      "typeOrgane": "CMP",
      "dateDebut": "2015-03-10T01:00:00.000+01:00",
      "datePublication": "2015-03-11T01:00:00.000+01:00",
      "dateFin": "2015-03-19T01:00:00.000+01:00",
      "preseance": "28",
      "nominPrincipale": "1",
      "infosQualite": {
        "codeQualite": "Suppléant",
        "libQualite": "Membre suppléant",
        "libQualiteSex": "Membre suppléant"
      },
      "organesRefs": [
        "PO706057"
      ]
    },
    {
      "xsiType": "MandatSimple_Type",
      "uid": "PM707802",
      "acteurRef": "PA336439",
      "legislature": "14",
      "typeOrgane": "CNPS",
      "dateDebut": "2015-05-27T02:00:00.000+02:00",
      "datePublication": "2015-05-27T02:00:00.000+02:00",
      "dateFin": "2015-08-07T02:00:00.000+02:00",
      "preseance": "20",
      "nominPrincipale": "1",
      "infosQualite": {
        "codeQualite": "Membre",
        "libQualite": "Membre",
        "libQualiteSex": "Membre"
      },
      "organesRefs": [
        "PO704848"
      ]
    },
    {
      "xsiType": "MandatSimple_Type",
      "uid": "PM713155",
      "acteurRef": "PA336439",
      "legislature": "14",
      "typeOrgane": "GP",
      "dateDebut": "2016-05-25T02:00:00.000+02:00",
      "dateFin": "2017-06-20T02:00:00.000+02:00",
      "preseance": "20",
      "nominPrincipale": "1",
      "infosQualite": {
        "codeQualite": "Membre",
        "libQualite": "Membre du",
        "libQualiteSex": "Membre du"
      },
      "organesRefs": [
        "PO713077"
      ]
    },
    {
      "xsiType": "MandatSimple_Type",
      "uid": "PM713749",
      "acteurRef": "PA336439",
      "legislature": "14",
      "typeOrgane": "CMP",
      "dateDebut": "2016-06-15T02:00:00.000+02:00",
      "datePublication": "2016-06-17T02:00:00.000+02:00",
      "dateFin": "2016-06-29T02:00:00.000+02:00",
      "preseance": "20",
      "nominPrincipale": "1",
      "infosQualite": {
        "codeQualite": "Titulaire",
        "libQualite": "Membre titulaire",
        "libQualiteSex": "Membre titulaire"
      },
      "organesRefs": [
        "PO713391"
      ]
    },
    {
      "xsiType": "MandatSimple_Type",
      "uid": "PM713776",
      "acteurRef": "PA336439",
      "legislature": "14",
      "typeOrgane": "CMP",
      "dateDebut": "2016-06-15T02:00:00.000+02:00",
      "datePublication": "2016-06-17T02:00:00.000+02:00",
      "dateFin": "2016-06-29T02:00:00.000+02:00",
      "preseance": "20",
      "nominPrincipale": "1",
      "infosQualite": {
        "codeQualite": "Titulaire",
        "libQualite": "Membre titulaire",
        "libQualiteSex": "Membre titulaire"
      },
      "organesRefs": [
        "PO713397"
      ]
    },
    {
      "xsiType": "MandatSimple_Type",
      "uid": "PM713915",
      "acteurRef": "PA336439",
      "legislature": "14",
      "typeOrgane": "CMP",
      "dateDebut": "2016-06-22T02:00:00.000+02:00",
      "datePublication": "2016-06-23T02:00:00.000+02:00",
      "dateFin": "2016-06-29T02:00:00.000+02:00",
      "preseance": "16",
      "nominPrincipale": "1",
      "infosQualite": {
        "codeQualite": "Rapporteur",
        "libQualite": "Rapporteur",
        "libQualiteSex": "Rapporteur"
      },
      "organesRefs": [
        "PO713391"
      ]
    },
    {
      "xsiType": "MandatSimple_Type",
      "uid": "PM714114",
      "acteurRef": "PA336439",
      "legislature": "14",
      "typeOrgane": "CMP",
      "dateDebut": "2016-07-06T02:00:00.000+02:00",
      "datePublication": "2016-07-07T02:00:00.000+02:00",
      "dateFin": "2016-07-13T02:00:00.000+02:00",
      "preseance": "28",
      "nominPrincipale": "1",
      "infosQualite": {
        "codeQualite": "Suppléant",
        "libQualite": "Membre suppléant",
        "libQualiteSex": "Membre suppléant"
      },
      "organesRefs": [
        "PO714021"
      ]
    },
    {
      "xsiType": "MandatSimple_Type",
      "uid": "PM714142",
      "acteurRef": "PA336439",
      "legislature": "14",
      "typeOrgane": "CMP",
      "dateDebut": "2016-07-06T02:00:00.000+02:00",
      "datePublication": "2016-07-07T02:00:00.000+02:00",
      "dateFin": "2016-07-13T02:00:00.000+02:00",
      "preseance": "28",
      "nominPrincipale": "1",
      "infosQualite": {
        "codeQualite": "Suppléant",
        "libQualite": "Membre suppléant",
        "libQualiteSex": "Membre suppléant"
      },
      "organesRefs": [
        "PO714015"
      ]
    },
    {
      "xsiType": "MandatSimple_Type",
      "uid": "PM714147",
      "acteurRef": "PA336439",
      "legislature": "14",
      "typeOrgane": "CMP",
      "dateDebut": "2016-07-06T02:00:00.000+02:00",
      "datePublication": "2016-07-07T02:00:00.000+02:00",
      "dateFin": "2016-07-13T02:00:00.000+02:00",
      "preseance": "28",
      "nominPrincipale": "1",
      "infosQualite": {
        "codeQualite": "Suppléant",
        "libQualite": "Membre suppléant",
        "libQualiteSex": "Membre suppléant"
      },
      "organesRefs": [
        "PO714027"
      ]
    },
    {
      "xsiType": "MandatSimple_Type",
      "uid": "PM715022",
      "acteurRef": "PA336439",
      "legislature": "14",
      "typeOrgane": "CMP",
      "dateDebut": "2016-10-27T02:00:00.000+02:00",
      "datePublication": "2016-10-28T02:00:00.000+02:00",
      "dateFin": "2016-11-03T01:00:00.000+01:00",
      "preseance": "28",
      "nominPrincipale": "1",
      "infosQualite": {
        "codeQualite": "Suppléant",
        "libQualite": "Membre suppléant",
        "libQualiteSex": "Membre suppléant"
      },
      "organesRefs": [
        "PO714924"
      ]
    },
    {
      "xsiType": "MandatSimple_Type",
      "uid": "PM715757",
      "acteurRef": "PA336439",
      "legislature": "14",
      "typeOrgane": "COMPER",
      "dateDebut": "2016-12-07T01:00:00.000+01:00",
      "datePublication": "2016-12-07T01:00:00.000+01:00",
      "dateFin": "2016-12-13T01:00:00.000+01:00",
      "preseance": "32",
      "nominPrincipale": "1",
      "infosQualite": {
        "codeQualite": "Membre",
        "libQualite": "Membre",
        "libQualiteSex": "Membre"
      },
      "organesRefs": [
        "PO420120"
      ]
    },
    {
      "xsiType": "MandatSimple_Type",
      "uid": "PM716162",
      "acteurRef": "PA336439",
      "legislature": "14",
      "typeOrgane": "COMPER",
      "dateDebut": "2016-12-14T01:00:00.000+01:00",
      "datePublication": "2016-12-14T01:00:00.000+01:00",
      "dateFin": "2017-06-20T02:00:00.000+02:00",
      "preseance": "32",
      "nominPrincipale": "1",
      "infosQualite": {
        "codeQualite": "Membre",
        "libQualite": "Membre",
        "libQualiteSex": "Membre"
      },
      "organesRefs": [
        "PO59051"
      ]
    },
    {
      "xsiType": "MandatParlementaire_type",
      "uid": "PM723488",
      "acteurRef": "PA336439",
      "legislature": "15",
      "typeOrgane": "ASSEMBLEE",
      "dateDebut": "2017-06-18T02:00:00.000+02:00",
      "preseance": "50",
      "nominPrincipale": "1",
      "infosQualite": {
        "codeQualite": "membre",
        "libQualite": "membre",
        "libQualiteSex": "membre"
      },
      "organesRefs": [
        "PO717460"
      ],
      "suppleant": {
        "dateDebut": "2017-06-18T02:00:00.000+02:00",
        "suppleantRef": "PA722158"
      },
      "election": {
        "lieu": {
          "region": "Nouvelle-Aquitaine",
          "regionType": "Métropolitain",
          "departement": "Vienne",
          "numDepartement": "86",
          "numCirco": "3"
        },
        "causeMandat": "élections générales",
        "refCirconscription": "PO718354"
      },
      "mandature": {
        "datePriseFonction": "2017-06-21T02:00:00.000+02:00",
        "premiereElection": "1",
        "placeHemicycle": "638"
      },
      "collaborateurs": [
        {
          "qualite": "Mme",
          "prenom": "Martine",
          "nom": "Bonnet-Blanc"
        },
        {
          "qualite": "M.",
          "prenom": "Julien",
          "nom": "Papineau"
        },
        {
          "qualite": "Mme",
          "prenom": "Sylviane",
          "nom": "Sambor"
        },
        {
          "qualite": "Mme",
          "prenom": "Gaëlle",
          "nom": "Poisson"
        }
      ]
    },
    {
      "xsiType": "MandatSimple_Type",
      "uid": "PM724785",
      "acteurRef": "PA336439",
      "legislature": "15",
      "typeOrgane": "GP",
      "dateDebut": "2017-06-21T02:00:00.000+02:00",
      "dateFin": "2017-06-26T02:00:00.000+02:00",
      "preseance": "28",
      "nominPrincipale": "1",
      "infosQualite": {
        "codeQualite": "Député non-inscrit",
        "libQualite": "Député non-inscrit",
        "libQualiteSex": "Député non-inscrit"
      },
      "organesRefs": [
        "PO723569"
      ]
    },
    {
      "xsiType": "MandatSimple_Type",
      "uid": "PM731262",
      "acteurRef": "PA336439",
      "legislature": "15",
      "typeOrgane": "GP",
      "dateDebut": "2017-06-27T02:00:00.000+02:00",
      "datePublication": "2017-06-28T02:00:00.000+02:00",
      "dateFin": "2018-06-15T02:00:00.000+02:00",
      "preseance": "20",
      "nominPrincipale": "1",
      "infosQualite": {
        "codeQualite": "Membre",
        "libQualite": "Membre du",
        "libQualiteSex": "Membre du"
      },
      "organesRefs": [
        "PO730964"
      ]
    },
    {
      "xsiType": "MandatSimple_Type",
      "uid": "PM731849",
      "acteurRef": "PA336439",
      "legislature": "15",
      "typeOrgane": "COMPER",
      "dateDebut": "2017-06-29T02:00:00.000+02:00",
      "datePublication": "2017-06-29T02:00:00.000+02:00",
      "dateFin": "2018-06-18T02:00:00.000+02:00",
      "preseance": "32",
      "nominPrincipale": "1",
      "infosQualite": {
        "codeQualite": "Membre",
        "libQualite": "Membre",
        "libQualiteSex": "Membre"
      },
      "organesRefs": [
        "PO59051"
      ]
    },
    {
      "xsiType": "MandatSimple_Type",
      "uid": "PM732844",
      "acteurRef": "PA336439",
      "legislature": "15",
      "typeOrgane": "ORGEXTPARL",
      "dateDebut": "2017-07-17T02:00:00.000+02:00",
      "datePublication": "2017-07-18T02:00:00.000+02:00",
      "preseance": "20",
      "nominPrincipale": "1",
      "infosQualite": {
        "codeQualite": "Titulaire",
        "libQualite": "Membre titulaire",
        "libQualiteSex": "Membre titulaire"
      },
      "organesRefs": [
        "PO709209"
      ]
    },
    {
      "xsiType": "MandatSimple_Type",
      "uid": "PM735307",
      "acteurRef": "PA336439",
      "legislature": "15",
      "typeOrgane": "GA",
      "dateDebut": "2019-01-22T01:00:00.000+01:00",
      "preseance": "20",
      "nominPrincipale": "1",
      "infosQualite": {
        "codeQualite": "Membre",
        "libQualite": "Membre",
        "libQualiteSex": "Membre"
      },
      "organesRefs": [
        "PO733232"
      ]
    },
    {
      "xsiType": "MandatSimple_Type",
      "uid": "PM735308",
      "acteurRef": "PA336439",
      "legislature": "15",
      "typeOrgane": "GA",
      "dateDebut": "2017-09-26T02:00:00.000+02:00",
      "dateFin": "2019-01-08T01:00:00.000+01:00",
      "preseance": "1",
      "nominPrincipale": "1",
      "infosQualite": {
        "codeQualite": "Président",
        "libQualite": "Président",
        "libQualiteSex": "Président"
      },
      "organesRefs": [
        "PO733232"
      ]
    },
    {
      "xsiType": "MandatSimple_Type",
      "uid": "PM737227",
      "acteurRef": "PA336439",
      "legislature": "15",
      "typeOrgane": "GA",
      "dateDebut": "2017-10-04T02:00:00.000+02:00",
      "preseance": "20",
      "nominPrincipale": "0",
      "infosQualite": {
        "codeQualite": "Membre",
        "libQualite": "Membre",
        "libQualiteSex": "Membre"
      },
      "organesRefs": [
        "PO733332"
      ]
    },
    {
      "xsiType": "MandatSimple_Type",
      "uid": "PM737228",
      "acteurRef": "PA336439",
      "legislature": "15",
      "typeOrgane": "GA",
      "dateDebut": "2017-10-04T02:00:00.000+02:00",
      "preseance": "20",
      "nominPrincipale": "0",
      "infosQualite": {
        "codeQualite": "Membre",
        "libQualite": "Membre",
        "libQualiteSex": "Membre"
      },
      "organesRefs": [
        "PO733347"
      ]
    },
    {
      "xsiType": "MandatSimple_Type",
      "uid": "PM737229",
      "acteurRef": "PA336439",
      "legislature": "15",
      "typeOrgane": "GA",
      "dateDebut": "2017-10-04T02:00:00.000+02:00",
      "preseance": "20",
      "nominPrincipale": "0",
      "infosQualite": {
        "codeQualite": "Membre",
        "libQualite": "Membre",
        "libQualiteSex": "Membre"
      },
      "organesRefs": [
        "PO733417"
      ]
    },
    {
      "xsiType": "MandatSimple_Type",
      "uid": "PM737230",
      "acteurRef": "PA336439",
      "legislature": "15",
      "typeOrgane": "GA",
      "dateDebut": "2017-10-04T02:00:00.000+02:00",
      "preseance": "20",
      "nominPrincipale": "1",
      "infosQualite": {
        "codeQualite": "Membre",
        "libQualite": "Membre",
        "libQualiteSex": "Membre"
      },
      "organesRefs": [
        "PO733522"
      ]
    },
    {
      "xsiType": "MandatSimple_Type",
      "uid": "PM737231",
      "acteurRef": "PA336439",
      "legislature": "15",
      "typeOrgane": "GA",
      "dateDebut": "2017-10-04T02:00:00.000+02:00",
      "preseance": "20",
      "nominPrincipale": "1",
      "infosQualite": {
        "codeQualite": "Membre",
        "libQualite": "Membre",
        "libQualiteSex": "Membre"
      },
      "organesRefs": [
        "PO733642"
      ]
    },
    {
      "xsiType": "MandatMission_Type",
      "uid": "PM738120",
      "acteurRef": "PA336439",
      "legislature": "15",
      "typeOrgane": "MISINFO",
      "dateDebut": "2017-09-25T02:00:00.000+02:00",
      "dateFin": "2018-02-15T01:00:00.000+01:00",
      "preseance": "10",
      "nominPrincipale": "0",
      "infosQualite": {
        "codeQualite": "Membre",
        "libQualite": "Membre",
        "libQualiteSex": "Membre"
      },
      "organesRefs": [
        "PO738117"
      ]
    },
    {
      "xsiType": "MandatMission_Type",
      "uid": "PM738123",
      "acteurRef": "PA336439",
      "legislature": "15",
      "typeOrgane": "MISINFO",
      "dateDebut": "2017-09-25T02:00:00.000+02:00",
      "dateFin": "2018-02-15T01:00:00.000+01:00",
      "preseance": "5",
      "nominPrincipale": "1",
      "infosQualite": {
        "codeQualite": "Co-rapporteur",
        "libQualite": "Co-rapporteur",
        "libQualiteSex": "Co-rapporteur"
      },
      "organesRefs": [
        "PO738117"
      ]
    },
    {
      "xsiType": "MandatSimple_Type",
      "uid": "PM740642",
      "acteurRef": "PA336439",
      "legislature": "15",
      "typeOrgane": "GA",
      "dateDebut": "2017-10-18T02:00:00.000+02:00",
      "preseance": "8",
      "nominPrincipale": "1",
      "infosQualite": {
        "codeQualite": "Vice-Président",
        "libQualite": "Vice-Président",
        "libQualiteSex": "Vice-Président"
      },
      "organesRefs": [
        "PO733332"
      ]
    },
    {
      "xsiType": "MandatSimple_Type",
      "uid": "PM742158",
      "acteurRef": "PA336439",
      "legislature": "15",
      "typeOrgane": "API",
      "dateDebut": "2017-10-27T02:00:00.000+02:00",
      "datePublication": "2017-10-28T02:00:00.000+02:00",
      "dateFin": "2019-10-10T02:00:00.000+02:00",
      "preseance": "20",
      "nominPrincipale": "1",
      "infosQualite": {
        "codeQualite": "Membre",
        "libQualite": "Membre",
        "libQualiteSex": "Membre"
      },
      "organesRefs": [
        "PO201115"
      ]
    },
    {
      "xsiType": "MandatSimple_Type",
      "uid": "PM743428",
      "acteurRef": "PA336439",
      "legislature": "15",
      "typeOrgane": "GA",
      "dateDebut": "2017-11-15T01:00:00.000+01:00",
      "preseance": "8",
      "nominPrincipale": "1",
      "infosQualite": {
        "codeQualite": "Vice-Président",
        "libQualite": "Vice-Président",
        "libQualiteSex": "Vice-Président"
      },
      "organesRefs": [
        "PO733417"
      ]
    },
    {
      "xsiType": "MandatSimple_Type",
      "uid": "PM743792",
      "acteurRef": "PA336439",
      "legislature": "15",
      "typeOrgane": "GA",
      "dateDebut": "2017-11-21T01:00:00.000+01:00",
      "preseance": "8",
      "nominPrincipale": "1",
      "infosQualite": {
        "codeQualite": "Vice-Président",
        "libQualite": "Vice-Président",
        "libQualiteSex": "Vice-Président"
      },
      "organesRefs": [
        "PO733347"
      ]
    },
    {
      "xsiType": "MandatSimple_Type",
      "uid": "PM744967",
      "acteurRef": "PA336439",
      "typeOrgane": "PARPOL",
      "dateDebut": "2017-12-01T01:00:00.000+01:00",
      "dateFin": "2018-11-30T01:00:00.000+01:00",
      "preseance": "5",
      "nominPrincipale": "1",
      "infosQualite": {
        "codeQualite": "Membre",
        "libQualite": "Membre",
        "libQualiteSex": "Membre"
      },
      "organesRefs": [
        "PO744854"
      ]
    },
    {
      "xsiType": "MandatSimple_Type",
      "uid": "PM748018",
      "acteurRef": "PA336439",
      "legislature": "15",
      "typeOrgane": "ORGEXTPARL",
      "dateDebut": "2018-01-10T01:00:00.000+01:00",
      "datePublication": "2018-01-11T01:00:00.000+01:00",
      "preseance": "20",
      "nominPrincipale": "1",
      "infosQualite": {
        "codeQualite": "Titulaire",
        "libQualite": "Membre titulaire",
        "libQualiteSex": "Membre titulaire"
      },
      "organesRefs": [
        "PO717436"
      ]
    },
    {
      "xsiType": "MandatSimple_Type",
      "uid": "PM748638",
      "acteurRef": "PA336439",
      "legislature": "15",
      "typeOrgane": "GE",
      "dateDebut": "2018-02-01T01:00:00.000+01:00",
      "preseance": "20",
      "nominPrincipale": "0",
      "infosQualite": {
        "codeQualite": "Membre",
        "libQualite": "Membre",
        "libQualiteSex": "Membre"
      },
      "organesRefs": [
        "PO747114"
      ]
    },
    {
      "xsiType": "MandatSimple_Type",
      "uid": "PM748640",
      "acteurRef": "PA336439",
      "legislature": "15",
      "typeOrgane": "GE",
      "dateDebut": "2019-06-18T02:00:00.000+02:00",
      "preseance": "8",
      "nominPrincipale": "1",
      "infosQualite": {
        "codeQualite": "Vice-Président",
        "libQualite": "Vice-Président",
        "libQualiteSex": "Vice-Président"
      },
      "organesRefs": [
        "PO747114"
      ]
    },
    {
      "xsiType": "MandatSimple_Type",
      "uid": "PM750458",
      "acteurRef": "PA336439",
      "legislature": "15",
      "typeOrgane": "GE",
      "dateDebut": "2018-02-08T01:00:00.000+01:00",
      "preseance": "20",
      "nominPrincipale": "1",
      "infosQualite": {
        "codeQualite": "Membre",
        "libQualite": "Membre",
        "libQualiteSex": "Membre"
      },
      "organesRefs": [
        "PO747266"
      ]
    },
    {
      "xsiType": "MandatSimple_Type",
      "uid": "PM751035",
      "acteurRef": "PA336439",
      "legislature": "15",
      "typeOrgane": "GE",
      "dateDebut": "2018-02-19T01:00:00.000+01:00",
      "preseance": "20",
      "nominPrincipale": "1",
      "infosQualite": {
        "codeQualite": "Membre",
        "libQualite": "Membre",
        "libQualiteSex": "Membre"
      },
      "organesRefs": [
        "PO746880"
      ]
    },
    {
      "xsiType": "MandatSimple_Type",
      "uid": "PM751142",
      "acteurRef": "PA336439",
      "legislature": "15",
      "typeOrgane": "GE",
      "dateDebut": "2018-02-19T01:00:00.000+01:00",
      "preseance": "20",
      "nominPrincipale": "1",
      "infosQualite": {
        "codeQualite": "Membre",
        "libQualite": "Membre",
        "libQualiteSex": "Membre"
      },
      "organesRefs": [
        "PO746791"
      ]
    },
    {
      "xsiType": "MandatSimple_Type",
      "uid": "PM751297",
      "acteurRef": "PA336439",
      "legislature": "15",
      "typeOrgane": "GE",
      "dateDebut": "2018-02-20T01:00:00.000+01:00",
      "preseance": "20",
      "nominPrincipale": "1",
      "infosQualite": {
        "codeQualite": "Membre",
        "libQualite": "Membre",
        "libQualiteSex": "Membre"
      },
      "organesRefs": [
        "PO746925"
      ]
    },
    {
      "xsiType": "MandatSimple_Type",
      "uid": "PM753040",
      "acteurRef": "PA336439",
      "legislature": "15",
      "typeOrgane": "GE",
      "dateDebut": "2018-03-08T01:00:00.000+01:00",
      "preseance": "20",
      "nominPrincipale": "1",
      "infosQualite": {
        "codeQualite": "Membre",
        "libQualite": "Membre",
        "libQualiteSex": "Membre"
      },
      "organesRefs": [
        "PO746811"
      ]
    },
    {
      "xsiType": "MandatSimple_Type",
      "uid": "PM753795",
      "acteurRef": "PA336439",
      "legislature": "15",
      "typeOrgane": "GE",
      "dateDebut": "2018-03-19T01:00:00.000+01:00",
      "preseance": "20",
      "nominPrincipale": "1",
      "infosQualite": {
        "codeQualite": "Membre",
        "libQualite": "Membre",
        "libQualiteSex": "Membre"
      },
      "organesRefs": [
        "PO747084"
      ]
    },
    {
      "xsiType": "MandatSimple_Type",
      "uid": "PM757111",
      "acteurRef": "PA336439",
      "legislature": "15",
      "typeOrgane": "GP",
      "dateDebut": "2018-06-16T02:00:00.000+02:00",
      "datePublication": "2018-06-16T02:00:00.000+02:00",
      "dateFin": "2018-10-17T02:00:00.000+02:00",
      "preseance": "28",
      "nominPrincipale": "1",
      "infosQualite": {
        "codeQualite": "Député non-inscrit",
        "libQualite": "Député non-inscrit",
        "libQualiteSex": "Député non-inscrit"
      },
      "organesRefs": [
        "PO723569"
      ]
    },
    {
      "xsiType": "MandatSimple_Type",
      "uid": "PM757117",
      "acteurRef": "PA336439",
      "legislature": "15",
      "typeOrgane": "COMPER",
      "dateDebut": "2018-06-19T02:00:00.000+02:00",
      "datePublication": "2018-06-19T02:00:00.000+02:00",
      "dateFin": "2018-09-29T02:00:00.000+02:00",
      "preseance": "32",
      "nominPrincipale": "1",
      "infosQualite": {
        "codeQualite": "Membre",
        "libQualite": "Membre",
        "libQualiteSex": "Membre"
      },
      "organesRefs": [
        "PO419604"
      ]
    },
    {
      "xsiType": "MandatMission_Type",
      "uid": "PM757170",
      "acteurRef": "PA336439",
      "legislature": "15",
      "typeOrgane": "MISINFO",
      "dateDebut": "2018-06-21T02:00:00.000+02:00",
      "dateFin": "2018-09-29T02:00:00.000+02:00",
      "preseance": "10",
      "nominPrincipale": "1",
      "infosQualite": {
        "codeQualite": "Membre",
        "libQualite": "Membre",
        "libQualiteSex": "Membre"
      },
      "organesRefs": [
        "PO741916"
      ]
    },
    {
      "xsiType": "MandatSimple_Type",
      "uid": "PM759140",
      "acteurRef": "PA336439",
      "legislature": "15",
      "typeOrgane": "COMPER",
      "dateDebut": "2018-09-30T02:00:00.000+02:00",
      "datePublication": "2018-09-30T02:00:00.000+02:00",
      "preseance": "32",
      "nominPrincipale": "1",
      "infosQualite": {
        "codeQualite": "Membre",
        "libQualite": "Membre",
        "libQualiteSex": "Membre"
      },
      "organesRefs": [
        "PO59047"
      ]
    },
    {
      "xsiType": "MandatSimple_Type",
      "uid": "PM759916",
      "acteurRef": "PA336439",
      "legislature": "15",
      "typeOrgane": "GP",
      "dateDebut": "2018-10-18T02:00:00.000+02:00",
      "datePublication": "2018-10-18T02:00:00.000+02:00",
      "preseance": "20",
      "nominPrincipale": "1",
      "infosQualite": {
        "codeQualite": "Membre",
        "libQualite": "Membre du",
        "libQualiteSex": "Membre du"
      },
      "organesRefs": [
        "PO759900"
      ]
    },
    {
      "xsiType": "MandatSimple_Type",
      "uid": "PM760730",
      "acteurRef": "PA336439",
      "legislature": "15",
      "typeOrgane": "CMP",
      "dateDebut": "2018-11-28T01:00:00.000+01:00",
      "datePublication": "2018-11-29T01:00:00.000+01:00",
      "dateFin": "2019-02-18T01:00:00.000+01:00",
      "preseance": "28",
      "nominPrincipale": "1",
      "infosQualite": {
        "codeQualite": "Suppléant",
        "libQualite": "Membre suppléant",
        "libQualiteSex": "Membre suppléant"
      },
      "organesRefs": [
        "PO760711"
      ]
    },
    {
      "xsiType": "MandatSimple_Type",
      "uid": "PM762051",
      "acteurRef": "PA336439",
      "legislature": "15",
      "typeOrgane": "GA",
      "dateDebut": "2019-01-22T01:00:00.000+01:00",
      "dateFin": "2019-10-08T02:00:00.000+02:00",
      "preseance": "1",
      "nominPrincipale": "1",
      "infosQualite": {
        "codeQualite": "Président",
        "libQualite": "Président",
        "libQualiteSex": "Président"
      },
      "organesRefs": [
        "PO733232"
      ]
    },
    {
      "xsiType": "MandatSimple_Type",
      "uid": "PM763498",
      "acteurRef": "PA336439",
      "legislature": "15",
      "typeOrgane": "ORGEXTPARL",
      "dateDebut": "2019-03-14T01:00:00.000+01:00",
      "datePublication": "2019-03-15T01:00:00.000+01:00",
      "preseance": "20",
      "nominPrincipale": "1",
      "infosQualite": {
        "codeQualite": "Titulaire",
        "libQualite": "Membre titulaire",
        "libQualiteSex": "Membre titulaire"
      },
      "organesRefs": [
        "PO763346"
      ]
    },
    {
      "xsiType": "MandatSimple_Type",
      "uid": "PM766126",
      "acteurRef": "PA336439",
      "legislature": "15",
      "typeOrgane": "CMP",
      "dateDebut": "2019-06-27T02:00:00.000+02:00",
      "datePublication": "2019-06-28T02:00:00.000+02:00",
      "dateFin": "2019-07-24T02:00:00.000+02:00",
      "preseance": "28",
      "nominPrincipale": "1",
      "infosQualite": {
        "codeQualite": "Suppléant",
        "libQualite": "Membre suppléant",
        "libQualiteSex": "Membre suppléant"
      },
      "organesRefs": [
        "PO766097"
      ]
    }
  ]
}