{
  "uid": "PO744364",
  "codeType": "MISINFO",
  "libelle": "Mission d'information sur la diplomatie climatique : une action diplomatique forte pour consolider les accords sur le climat",
  "libelleEdition": "de la mission d'information sur la diplomatie climatique : une action diplomatique forte pour consolider les accords sur le climat",
  "libelleAbrege": "Diplomatie climatique",
  "libelleAbrev": "CLIMAT2",
  "viMoDe": {
    "dateDebut": "2017-10-24T02:00:00.000+02:00",
    "dateFin": "2018-11-28T01:00:00.000+01:00"
  },
  "organeParentRef": "PO59047",
  "regime": "5ème République",
  "legislature": "15",
  "secretariat": {}
}