{
  "uid": "PO59905",
  "codeType": "GE",
  "libelle": "Groupe d'études sur le médicament",
  "libelleEdition": "du groupe d'études sur le médicament",
  "libelleAbrege": "Médicament",
  "libelleAbrev": "MED",
  "viMoDe": {
    "dateAgrement": "1993-06-10T02:00:00.000+02:00",
    "dateFin": "1997-04-21T02:00:00.000+02:00"
  },
  "regime": "5ème République",
  "legislature": "10",
  "secretariat": {}
}