{
  "uid": "PO764414",
  "codeType": "MISINFO",
  "libelle": "Mission d'information sur l'évaluation de l'impact de la loi n° 2015-991 du 7 août 2015 relative à la nouvelle organisation territoriale de la République (loi NOTRe)",
  "libelleEdition": "de la mission d'information sur l'évaluation de l'impact de la loi n° 2015-991 du 7 août 2015 relative à la nouvelle organisation territoriale de la République (loi NOTRe)",
  "libelleAbrege": "Loi NOTRe",
  "libelleAbrev": "LOI NOTRE",
  "viMoDe": {
    "dateDebut": "2019-03-12T01:00:00.000+01:00"
  },
  "organeParentRef": "PO59051",
  "regime": "5ème République",
  "legislature": "15",
  "secretariat": {}
}