{
  "uid": "PO686213",
  "codeType": "GE",
  "libelle": "Biocarburants",
  "libelleEdition": "Biocarburants",
  "libelleAbrege": "Biocarburants",
  "libelleAbrev": "BIOCARBURA",
  "viMoDe": {
    "dateAgrement": "2012-11-14T01:00:00.000+01:00",
    "dateFin": "2017-06-20T02:00:00.000+02:00"
  },
  "regime": "5ème République",
  "legislature": "14",
  "secretariat": {}
}