{
  "uid": "PO713057",
  "codeType": "MISINFO",
  "libelle": "Avenir de la prévention spécialisée",
  "libelleEdition": "de la mission d'information sur l'avenir de la prévention spécialisée",
  "libelleAbrege": "Prévention spécialisée",
  "libelleAbrev": "PRESPE",
  "viMoDe": {
    "dateDebut": "2016-03-16T01:00:00.000+01:00",
    "dateFin": "2017-02-01T01:00:00.000+01:00"
  },
  "organeParentRef": "PO420120",
  "regime": "5ème République",
  "legislature": "14",
  "secretariat": {}
}