{
  "uid": "PO60212",
  "codeType": "ORGEXTPARL",
  "libelle": "Comité central d'enquête sur le coût et le rendement des services publics",
  "libelleEdition": "du Comité central d'enquête sur le coût et le rendement des services publics",
  "libelleAbrege": "Services publics, coût et rendement",
  "libelleAbrev": "69",
  "viMoDe": {
    "dateDebut": "1975-04-08T01:00:00.000+01:00",
    "dateFin": "2017-06-28T02:00:00.000+02:00"
  },
  "regime": "5ème République",
  "regimeJuridique": "Article D. 320-2 du code des juridictions financières"
}