{
  "uid": "PA720696",
  "etatCivil": {
    "ident": {
      "civ": "Mme",
      "prenom": "Béatrice",
      "nom": "Descamps",
      "alpha": "Descamps",
      "trigramme": "BDE"
    },
    "infoNaissance": {
      "dateNais": "1961-04-24T01:00:00.000+01:00",
      "villeNais": "Valenciennes",
      "depNais": "Nord",
      "paysNais": "France"
    }
  },
  "profession": {
    "libelleCourant": "Enseignant 1er deg.-directeur école",
    "socProcInsee": {
      "catSocPro": "Professions intermédiaires de l'enseignement, de la santé, de la fonction publique et assimilés",
      "famSocPro": "Professions Intermédiaires"
    }
  },
  "uriHatvp": "https://www.hatvp.fr/pages_nominatives/descamps-beatrice-13212",
  "adresses": [
    {
      "xsiType": "AdressePostale_Type",
      "uid": "AD720698",
      "type": "0",
      "typeLibelle": "Adresse officielle",
      "poids": "1",
      "intitule": "Assemblée nationale,",
      "numeroRue": "126",
      "nomRue": "Rue de l'Université,",
      "codePostal": "75355",
      "ville": "Paris 07 SP"
    },
    {
      "xsiType": "AdresseMail_Type",
      "uid": "AD728174",
      "type": "15",
      "typeLibelle": "Mèl",
      "valElec": "beatrice.descamps@assemblee-nationale.fr"
    }
  ],
  "mandats": [
    {
      "xsiType": "MandatParlementaire_type",
      "uid": "PM723044",
      "acteurRef": "PA720696",
      "legislature": "15",
      "typeOrgane": "ASSEMBLEE",
      "dateDebut": "2017-06-18T02:00:00.000+02:00",
      "preseance": "50",
      "nominPrincipale": "1",
      "infosQualite": {
        "codeQualite": "membre",
        "libQualite": "membre",
        "libQualiteSex": "membre"
      },
      "organesRefs": [
        "PO717460"
      ],
      "suppleant": {
        "dateDebut": "2017-06-18T02:00:00.000+02:00",
        "suppleantRef": "PA702053"
      },
      "election": {
        "lieu": {
          "region": "Hauts-de-France",
          "regionType": "Métropolitain",
          "departement": "Nord",
          "numDepartement": "59",
          "numCirco": "21"
        },
        "causeMandat": "élections générales",
        "refCirconscription": "PO718012"
      },
      "mandature": {
        "datePriseFonction": "2017-06-21T02:00:00.000+02:00",
        "premiereElection": "0",
        "placeHemicycle": "143"
      },
      "collaborateurs": [
        {
          "qualite": "Mme",
          "prenom": "Pauline",
          "nom": "Ledru"
        },
        {
          "qualite": "M.",
          "prenom": "Rafik",
          "nom": "Mokrane"
        },
        {
          "qualite": "Mme",
          "prenom": "Clémence",
          "nom": "Gauroy"
        }
      ]
    },
    {
      "xsiType": "MandatSimple_Type",
      "uid": "PM724563",
      "acteurRef": "PA720696",
      "legislature": "15",
      "typeOrgane": "GP",
      "dateDebut": "2017-06-21T02:00:00.000+02:00",
      "dateFin": "2017-06-26T02:00:00.000+02:00",
      "preseance": "28",
      "nominPrincipale": "1",
      "infosQualite": {
        "codeQualite": "Député non-inscrit",
        "libQualite": "Député non-inscrit",
        "libQualiteSex": "Députée non-inscrite"
      },
      "organesRefs": [
        "PO723569"
      ]
    },
    {
      "xsiType": "MandatSimple_Type",
      "uid": "PM731458",
      "acteurRef": "PA720696",
      "legislature": "15",
      "typeOrgane": "GP",
      "dateDebut": "2017-06-27T02:00:00.000+02:00",
      "datePublication": "2017-06-28T02:00:00.000+02:00",
      "dateFin": "2017-11-28T01:00:00.000+01:00",
      "preseance": "20",
      "nominPrincipale": "1",
      "infosQualite": {
        "codeQualite": "Membre",
        "libQualite": "Membre du",
        "libQualiteSex": "Membre du"
      },
      "organesRefs": [
        "PO730952"
      ]
    },
    {
      "xsiType": "MandatSimple_Type",
      "uid": "PM731729",
      "acteurRef": "PA720696",
      "legislature": "15",
      "typeOrgane": "COMPER",
      "dateDebut": "2017-06-29T02:00:00.000+02:00",
      "datePublication": "2017-06-29T02:00:00.000+02:00",
      "preseance": "32",
      "nominPrincipale": "1",
      "infosQualite": {
        "codeQualite": "Membre",
        "libQualite": "Membre",
        "libQualiteSex": "Membre"
      },
      "organesRefs": [
        "PO419604"
      ]
    },
    {
      "xsiType": "MandatSimple_Type",
      "uid": "PM739644",
      "acteurRef": "PA720696",
      "legislature": "15",
      "typeOrgane": "GA",
      "dateDebut": "2017-10-12T02:00:00.000+02:00",
      "preseance": "20",
      "nominPrincipale": "0",
      "infosQualite": {
        "codeQualite": "Membre",
        "libQualite": "Membre",
        "libQualiteSex": "Membre"
      },
      "organesRefs": [
        "PO733637"
      ]
    },
    {
      "xsiType": "MandatSimple_Type",
      "uid": "PM739645",
      "acteurRef": "PA720696",
      "legislature": "15",
      "typeOrgane": "GA",
      "dateDebut": "2017-10-12T02:00:00.000+02:00",
      "preseance": "20",
      "nominPrincipale": "0",
      "infosQualite": {
        "codeQualite": "Membre",
        "libQualite": "Membre",
        "libQualiteSex": "Membre"
      },
      "organesRefs": [
        "PO733662"
      ]
    },
    {
      "xsiType": "MandatMission_Type",
      "uid": "PM741950",
      "acteurRef": "PA720696",
      "legislature": "15",
      "typeOrgane": "MISINFO",
      "dateDebut": "2017-09-27T02:00:00.000+02:00",
      "preseance": "10",
      "nominPrincipale": "1",
      "infosQualite": {
        "codeQualite": "Membre",
        "libQualite": "Membre",
        "libQualiteSex": "Membre"
      },
      "organesRefs": [
        "PO741916"
      ]
    },
    {
      "xsiType": "MandatSimple_Type",
      "uid": "PM742476",
      "acteurRef": "PA720696",
      "legislature": "15",
      "typeOrgane": "ORGEXTPARL",
      "dateDebut": "2017-11-02T01:00:00.000+01:00",
      "datePublication": "2017-11-03T01:00:00.000+01:00",
      "preseance": "20",
      "nominPrincipale": "1",
      "infosQualite": {
        "codeQualite": "Titulaire",
        "libQualite": "Membre titulaire",
        "libQualiteSex": "Membre titulaire"
      },
      "organesRefs": [
        "PO709195"
      ]
    },
    {
      "xsiType": "MandatSimple_Type",
      "uid": "PM743433",
      "acteurRef": "PA720696",
      "legislature": "15",
      "typeOrgane": "GA",
      "dateDebut": "2017-11-15T01:00:00.000+01:00",
      "preseance": "8",
      "nominPrincipale": "1",
      "infosQualite": {
        "codeQualite": "Vice-Président",
        "libQualite": "Vice-Président",
        "libQualiteSex": "Vice-Présidente"
      },
      "organesRefs": [
        "PO733662"
      ]
    },
    {
      "xsiType": "MandatSimple_Type",
      "uid": "PM744049",
      "acteurRef": "PA720696",
      "legislature": "15",
      "typeOrgane": "GA",
      "dateDebut": "2017-11-21T01:00:00.000+01:00",
      "preseance": "8",
      "nominPrincipale": "1",
      "infosQualite": {
        "codeQualite": "Vice-Président",
        "libQualite": "Vice-Président",
        "libQualiteSex": "Vice-Présidente"
      },
      "organesRefs": [
        "PO733637"
      ]
    },
    {
      "xsiType": "MandatSimple_Type",
      "uid": "PM744446",
      "acteurRef": "PA720696",
      "legislature": "15",
      "typeOrgane": "GP",
      "dateDebut": "2017-11-29T01:00:00.000+01:00",
      "dateFin": "2019-06-10T02:00:00.000+02:00",
      "preseance": "20",
      "nominPrincipale": "1",
      "infosQualite": {
        "codeQualite": "Membre",
        "libQualite": "Membre du",
        "libQualiteSex": "Membre du"
      },
      "organesRefs": [
        "PO744425"
      ]
    },
    {
      "xsiType": "MandatMission_Type",
      "uid": "PM746722",
      "acteurRef": "PA720696",
      "legislature": "15",
      "typeOrgane": "MISINFO",
      "dateDebut": "2017-12-20T01:00:00.000+01:00",
      "dateFin": "2018-11-15T01:00:00.000+01:00",
      "preseance": "10",
      "nominPrincipale": "1",
      "infosQualite": {
        "codeQualite": "Membre",
        "libQualite": "Membre",
        "libQualiteSex": "Membre"
      },
      "organesRefs": [
        "PO746694"
      ]
    },
    {
      "xsiType": "MandatSimple_Type",
      "uid": "PM747445",
      "acteurRef": "PA720696",
      "legislature": "15",
      "typeOrgane": "ORGEXTPARL",
      "dateDebut": "2017-12-21T01:00:00.000+01:00",
      "datePublication": "2017-12-22T01:00:00.000+01:00",
      "preseance": "30",
      "nominPrincipale": "1",
      "infosQualite": {
        "codeQualite": "Suppléant",
        "libQualite": "Membre suppléant",
        "libQualiteSex": "Membre suppléante"
      },
      "organesRefs": [
        "PO60277"
      ]
    },
    {
      "xsiType": "MandatSimple_Type",
      "uid": "PM748774",
      "acteurRef": "PA720696",
      "legislature": "15",
      "typeOrgane": "GE",
      "dateDebut": "2018-02-01T01:00:00.000+01:00",
      "preseance": "20",
      "nominPrincipale": "0",
      "infosQualite": {
        "codeQualite": "Membre",
        "libQualite": "Membre",
        "libQualiteSex": "Membre"
      },
      "organesRefs": [
        "PO747002"
      ]
    },
    {
      "xsiType": "MandatSimple_Type",
      "uid": "PM748775",
      "acteurRef": "PA720696",
      "legislature": "15",
      "typeOrgane": "GE",
      "dateDebut": "2018-02-01T01:00:00.000+01:00",
      "preseance": "4",
      "nominPrincipale": "1",
      "infosQualite": {
        "codeQualite": "Co-Président",
        "libQualite": "Co-Président",
        "libQualiteSex": "Co-Présidente"
      },
      "organesRefs": [
        "PO747002"
      ]
    },
    {
      "xsiType": "MandatSimple_Type",
      "uid": "PM749361",
      "acteurRef": "PA720696",
      "legislature": "15",
      "typeOrgane": "CMP",
      "dateDebut": "2018-02-12T01:00:00.000+01:00",
      "datePublication": "2018-02-10T01:00:00.000+01:00",
      "dateFin": "2018-02-15T01:00:00.000+01:00",
      "preseance": "28",
      "nominPrincipale": "1",
      "infosQualite": {
        "codeQualite": "Suppléant",
        "libQualite": "Membre suppléant",
        "libQualiteSex": "Membre suppléante"
      },
      "organesRefs": [
        "PO749252"
      ]
    },
    {
      "xsiType": "MandatSimple_Type",
      "uid": "PM754921",
      "acteurRef": "PA720696",
      "legislature": "15",
      "typeOrgane": "GE",
      "dateDebut": "2018-04-03T02:00:00.000+02:00",
      "preseance": "20",
      "nominPrincipale": "1",
      "infosQualite": {
        "codeQualite": "Membre",
        "libQualite": "Membre",
        "libQualiteSex": "Membre"
      },
      "organesRefs": [
        "PO747215"
      ]
    },
    {
      "xsiType": "MandatSimple_Type",
      "uid": "PM754929",
      "acteurRef": "PA720696",
      "legislature": "15",
      "typeOrgane": "GE",
      "dateDebut": "2018-04-03T02:00:00.000+02:00",
      "preseance": "20",
      "nominPrincipale": "1",
      "infosQualite": {
        "codeQualite": "Membre",
        "libQualite": "Membre",
        "libQualiteSex": "Membre"
      },
      "organesRefs": [
        "PO746880"
      ]
    },
    {
      "xsiType": "MandatSimple_Type",
      "uid": "PM755093",
      "acteurRef": "PA720696",
      "legislature": "15",
      "typeOrgane": "GE",
      "dateDebut": "2018-04-05T02:00:00.000+02:00",
      "preseance": "20",
      "nominPrincipale": "1",
      "infosQualite": {
        "codeQualite": "Membre",
        "libQualite": "Membre",
        "libQualiteSex": "Membre"
      },
      "organesRefs": [
        "PO747067"
      ]
    },
    {
      "xsiType": "MandatSimple_Type",
      "uid": "PM755351",
      "acteurRef": "PA720696",
      "legislature": "15",
      "typeOrgane": "GE",
      "dateDebut": "2018-04-11T02:00:00.000+02:00",
      "preseance": "20",
      "nominPrincipale": "1",
      "infosQualite": {
        "codeQualite": "Membre",
        "libQualite": "Membre",
        "libQualiteSex": "Membre"
      },
      "organesRefs": [
        "PO747286"
      ]
    },
    {
      "xsiType": "MandatSimple_Type",
      "uid": "PM755440",
      "acteurRef": "PA720696",
      "legislature": "15",
      "typeOrgane": "CNPE",
      "dateDebut": "2018-04-14T02:00:00.000+02:00",
      "datePublication": "2018-04-14T02:00:00.000+02:00",
      "dateFin": "2018-09-28T02:00:00.000+02:00",
      "preseance": "20",
      "nominPrincipale": "1",
      "infosQualite": {
        "codeQualite": "Membre",
        "libQualite": "Membre",
        "libQualiteSex": "Membre"
      },
      "organesRefs": [
        "PO754360"
      ]
    },
    {
      "xsiType": "MandatSimple_Type",
      "uid": "PM755701",
      "acteurRef": "PA720696",
      "legislature": "15",
      "typeOrgane": "GE",
      "dateDebut": "2018-04-18T02:00:00.000+02:00",
      "preseance": "20",
      "nominPrincipale": "1",
      "infosQualite": {
        "codeQualite": "Membre",
        "libQualite": "Membre",
        "libQualiteSex": "Membre"
      },
      "organesRefs": [
        "PO747261"
      ]
    },
    {
      "xsiType": "MandatSimple_Type",
      "uid": "PM757007",
      "acteurRef": "PA720696",
      "legislature": "15",
      "typeOrgane": "ORGEXTPARL",
      "dateDebut": "2018-03-08T01:00:00.000+01:00",
      "datePublication": "2018-03-09T01:00:00.000+01:00",
      "preseance": "20",
      "nominPrincipale": "1",
      "infosQualite": {
        "codeQualite": "Titulaire",
        "libQualite": "Membre titulaire",
        "libQualiteSex": "Membre titulaire"
      },
      "organesRefs": [
        "PO756933"
      ]
    },
    {
      "xsiType": "MandatSimple_Type",
      "uid": "PM758083",
      "acteurRef": "PA720696",
      "legislature": "15",
      "typeOrgane": "CMP",
      "dateDebut": "2018-07-16T02:00:00.000+02:00",
      "datePublication": "2018-07-17T02:00:00.000+02:00",
      "dateFin": "2018-07-30T02:00:00.000+02:00",
      "preseance": "28",
      "nominPrincipale": "1",
      "infosQualite": {
        "codeQualite": "Suppléant",
        "libQualite": "Membre suppléant",
        "libQualiteSex": "Membre suppléante"
      },
      "organesRefs": [
        "PO758043"
      ]
    },
    {
      "xsiType": "MandatSimple_Type",
      "uid": "PM759046",
      "acteurRef": "PA720696",
      "legislature": "15",
      "typeOrgane": "CMP",
      "dateDebut": "2018-09-25T02:00:00.000+02:00",
      "datePublication": "2018-09-26T02:00:00.000+02:00",
      "dateFin": "2018-11-20T01:00:00.000+01:00",
      "preseance": "28",
      "nominPrincipale": "1",
      "infosQualite": {
        "codeQualite": "Suppléant",
        "libQualite": "Membre suppléant",
        "libQualiteSex": "Membre suppléante"
      },
      "organesRefs": [
        "PO758375"
      ]
    },
    {
      "xsiType": "MandatSimple_Type",
      "uid": "PM759074",
      "acteurRef": "PA720696",
      "legislature": "15",
      "typeOrgane": "CMP",
      "dateDebut": "2018-09-25T02:00:00.000+02:00",
      "datePublication": "2018-09-26T02:00:00.000+02:00",
      "dateFin": "2018-11-20T01:00:00.000+01:00",
      "preseance": "28",
      "nominPrincipale": "1",
      "infosQualite": {
        "codeQualite": "Suppléant",
        "libQualite": "Membre suppléant",
        "libQualiteSex": "Membre suppléante"
      },
      "organesRefs": [
        "PO758368"
      ]
    },
    {
      "xsiType": "MandatSimple_Type",
      "uid": "PM763143",
      "acteurRef": "PA720696",
      "legislature": "15",
      "typeOrgane": "CNPE",
      "dateDebut": "2019-03-08T01:00:00.000+01:00",
      "datePublication": "2019-03-09T01:00:00.000+01:00",
      "dateFin": "2019-07-18T02:00:00.000+02:00",
      "preseance": "20",
      "nominPrincipale": "1",
      "infosQualite": {
        "codeQualite": "Membre",
        "libQualite": "Membre",
        "libQualiteSex": "Membre"
      },
      "organesRefs": [
        "PO762987"
      ]
    },
    {
      "xsiType": "MandatSimple_Type",
      "uid": "PM765069",
      "acteurRef": "PA720696",
      "legislature": "15",
      "typeOrgane": "GE",
      "dateDebut": "2019-05-13T02:00:00.000+02:00",
      "preseance": "20",
      "nominPrincipale": "1",
      "infosQualite": {
        "codeQualite": "Membre",
        "libQualite": "Membre",
        "libQualiteSex": "Membre"
      },
      "organesRefs": [
        "PO763269"
      ]
    },
    {
      "xsiType": "MandatSimple_Type",
      "uid": "PM765622",
      "acteurRef": "PA720696",
      "legislature": "15",
      "typeOrgane": "CMP",
      "dateDebut": "2019-06-06T02:00:00.000+02:00",
      "datePublication": "2019-06-07T02:00:00.000+02:00",
      "dateFin": "2019-07-04T02:00:00.000+02:00",
      "preseance": "28",
      "nominPrincipale": "1",
      "infosQualite": {
        "codeQualite": "Suppléant",
        "libQualite": "Membre suppléant",
        "libQualiteSex": "Membre suppléante"
      },
      "organesRefs": [
        "PO765254"
      ]
    },
    {
      "xsiType": "MandatSimple_Type",
      "uid": "PM765649",
      "acteurRef": "PA720696",
      "legislature": "15",
      "typeOrgane": "GP",
      "dateDebut": "2019-06-11T02:00:00.000+02:00",
      "dateFin": "2019-09-27T02:00:00.000+02:00",
      "preseance": "20",
      "nominPrincipale": "1",
      "infosQualite": {
        "codeQualite": "Membre",
        "libQualite": "Membre du",
        "libQualiteSex": "Membre du"
      },
      "organesRefs": [
        "PO765636"
      ]
    },
    {
      "xsiType": "MandatMission_Type",
      "uid": "PM766745",
      "acteurRef": "PA720696",
      "legislature": "15",
      "typeOrgane": "MISINFO",
      "dateDebut": "2019-07-24T02:00:00.000+02:00",
      "preseance": "10",
      "nominPrincipale": "1",
      "infosQualite": {
        "codeQualite": "Membre",
        "libQualite": "Membre",
        "libQualiteSex": "Membre"
      },
      "organesRefs": [
        "PO766728"
      ]
    },
    {
      "xsiType": "MandatSimple_Type",
      "uid": "PM767231",
      "acteurRef": "PA720696",
      "legislature": "15",
      "typeOrgane": "GP",
      "dateDebut": "2019-09-28T02:00:00.000+02:00",
      "datePublication": "2019-09-27T02:00:00.000+02:00",
      "preseance": "20",
      "nominPrincipale": "1",
      "infosQualite": {
        "codeQualite": "Membre",
        "libQualite": "Membre du",
        "libQualiteSex": "Membre du"
      },
      "organesRefs": [
        "PO767217"
      ]
    }
  ]
}