{
  "uid": "PO429101",
  "codeType": "CMP",
  "libelle": "Commission mixte paritaire chargée de proposer un texte sur les dispositions restant en discussion de la proposition de loi pour le développement de l'alternance et la sécurisation des parcours professionnels",
  "libelleEdition": "de la proposition de loi pour le développement de l'alternance et la sécurisation des parcours professionnels",
  "libelleAbrege": "Alternance",
  "libelleAbrev": "3369",
  "viMoDe": {
    "dateDebut": "2011-06-28T02:00:00.000+02:00",
    "dateFin": "2011-07-25T02:00:00.000+02:00"
  },
  "regime": "5ème République",
  "legislature": "13",
  "secretariat": {}
}