{
  "uid": "PO425949",
  "codeType": "ORGEXTPARL",
  "libelle": "Conseil national de l'aide aux victimes",
  "libelleEdition": "du Conseil national de l'aide aux victimes",
  "libelleAbrege": "Aide aux victimes",
  "libelleAbrev": "269",
  "viMoDe": {
    "dateDebut": "2010-09-21T02:00:00.000+02:00"
  },
  "regime": "5ème République",
  "regimeJuridique": "Article 37 de la loi n° 2018-699 du 3 août 2018",
  "siteInternet": "http://www.justice.gouv.fr/aide-aux-victimes-10044/la-justice-et-les-associations-10278/le-conseil-national-de-laide-aux-victimes-23095.html",
  "nombreReunionsAnnuelles": "0"
}