{
  "uid": "PA720046",
  "etatCivil": {
    "ident": {
      "civ": "Mme",
      "prenom": "Audrey",
      "nom": "Dufeu Schubert",
      "alpha": "DufeuSchubert",
      "trigramme": "ADU"
    },
    "infoNaissance": {
      "dateNais": "1980-06-03T02:00:00.000+02:00",
      "villeNais": "Saint-Nazaire",
      "depNais": "Loire-Atlantique",
      "paysNais": "FRANCE"
    }
  },
  "profession": {
    "libelleCourant": "Directrice établissement de santé",
    "socProcInsee": {
      "catSocPro": "Cadres d'entreprise",
      "famSocPro": "Cadres et professions intellectuelles supérieures"
    }
  },
  "uriHatvp": "https://www.hatvp.fr/pages_nominatives/dufeu-schubert-audrey",
  "adresses": [
    {
      "xsiType": "AdressePostale_Type",
      "uid": "AD720048",
      "type": "0",
      "typeLibelle": "Adresse officielle",
      "poids": "1",
      "intitule": "Assemblée nationale,",
      "numeroRue": "126",
      "nomRue": "Rue de l'Université,",
      "codePostal": "75355",
      "ville": "Paris 07 SP"
    },
    {
      "xsiType": "AdresseMail_Type",
      "uid": "AD728105",
      "type": "15",
      "typeLibelle": "Mèl",
      "valElec": "audrey.dufeuschubert@assemblee-nationale.fr"
    },
    {
      "xsiType": "AdresseSiteWeb_Type",
      "uid": "AD730166",
      "type": "25",
      "typeLibelle": "Facebook",
      "valElec": "audreydufeuschubert"
    },
    {
      "xsiType": "AdresseSiteWeb_Type",
      "uid": "AD730220",
      "type": "24",
      "typeLibelle": "Twitter",
      "valElec": "@audreydufeu"
    },
    {
      "xsiType": "AdresseTelephonique_Type",
      "uid": "AD757921",
      "type": "11",
      "typeLibelle": "Téléphone",
      "poids": "1",
      "adresseDeRattachement": "AD720048",
      "valElec": "01.40.63.76.77"
    },
    {
      "xsiType": "AdressePostale_Type",
      "uid": "AD766914",
      "type": "2",
      "typeLibelle": "Adresse publiée de circonscription",
      "poids": "2",
      "nomRue": "Sur rendez-vous"
    },
    {
      "xsiType": "AdresseTelephonique_Type",
      "uid": "AD766916",
      "type": "11",
      "typeLibelle": "Téléphone",
      "poids": "2",
      "adresseDeRattachement": "AD766914",
      "valElec": "0770217376"
    }
  ],
  "mandats": [
    {
      "xsiType": "MandatParlementaire_type",
      "uid": "PM722842",
      "acteurRef": "PA720046",
      "legislature": "15",
      "typeOrgane": "ASSEMBLEE",
      "dateDebut": "2017-06-18T02:00:00.000+02:00",
      "preseance": "50",
      "nominPrincipale": "1",
      "infosQualite": {
        "codeQualite": "membre",
        "libQualite": "membre",
        "libQualiteSex": "membre"
      },
      "organesRefs": [
        "PO717460"
      ],
      "suppleant": {
        "dateDebut": "2017-06-18T02:00:00.000+02:00",
        "suppleantRef": "PA720050"
      },
      "election": {
        "lieu": {
          "region": "Pays de la Loire",
          "regionType": "Métropolitain",
          "departement": "Loire-Atlantique",
          "numDepartement": "44",
          "numCirco": "8"
        },
        "causeMandat": "élections générales",
        "refCirconscription": "PO717884"
      },
      "mandature": {
        "datePriseFonction": "2017-06-21T02:00:00.000+02:00",
        "premiereElection": "0",
        "placeHemicycle": "522"
      },
      "collaborateurs": [
        {
          "qualite": "M.",
          "prenom": "Christophe",
          "nom": "Calmann-Lévy"
        },
        {
          "qualite": "Mme",
          "prenom": "Anita",
          "nom": "Royer"
        },
        {
          "qualite": "Mme",
          "prenom": "Marie",
          "nom": "Faverjon"
        },
        {
          "qualite": "Mme",
          "prenom": "Sandra",
          "nom": "Stoklosa"
        }
      ]
    },
    {
      "xsiType": "MandatSimple_Type",
      "uid": "PM724462",
      "acteurRef": "PA720046",
      "legislature": "15",
      "typeOrgane": "GP",
      "dateDebut": "2017-06-21T02:00:00.000+02:00",
      "dateFin": "2017-06-26T02:00:00.000+02:00",
      "preseance": "28",
      "nominPrincipale": "1",
      "infosQualite": {
        "codeQualite": "Député non-inscrit",
        "libQualite": "Député non-inscrit",
        "libQualiteSex": "Députée non-inscrite"
      },
      "organesRefs": [
        "PO723569"
      ]
    },
    {
      "xsiType": "MandatSimple_Type",
      "uid": "PM731104",
      "acteurRef": "PA720046",
      "legislature": "15",
      "typeOrgane": "GP",
      "dateDebut": "2017-06-27T02:00:00.000+02:00",
      "datePublication": "2017-06-28T02:00:00.000+02:00",
      "preseance": "20",
      "nominPrincipale": "1",
      "infosQualite": {
        "codeQualite": "Membre",
        "libQualite": "Membre du",
        "libQualiteSex": "Membre du"
      },
      "organesRefs": [
        "PO730964"
      ]
    },
    {
      "xsiType": "MandatSimple_Type",
      "uid": "PM732033",
      "acteurRef": "PA720046",
      "legislature": "15",
      "typeOrgane": "COMPER",
      "dateDebut": "2017-06-29T02:00:00.000+02:00",
      "datePublication": "2017-06-29T02:00:00.000+02:00",
      "preseance": "32",
      "nominPrincipale": "1",
      "infosQualite": {
        "codeQualite": "Membre",
        "libQualite": "Membre",
        "libQualiteSex": "Membre"
      },
      "organesRefs": [
        "PO420120"
      ]
    },
    {
      "xsiType": "MandatAvecSuppleant_Type",
      "uid": "PM732617",
      "acteurRef": "PA720046",
      "legislature": "15",
      "typeOrgane": "COMNL",
      "dateDebut": "2017-07-12T02:00:00.000+02:00",
      "datePublication": "2017-07-12T02:00:00.000+02:00",
      "dateFin": "2017-10-24T02:00:00.000+02:00",
      "preseance": "20",
      "nominPrincipale": "1",
      "infosQualite": {
        "codeQualite": "Membre",
        "libQualite": "Membre",
        "libQualiteSex": "Membre"
      },
      "organesRefs": [
        "PO420375"
      ]
    },
    {
      "xsiType": "MandatMission_Type",
      "uid": "PM732878",
      "acteurRef": "PA720046",
      "legislature": "15",
      "typeOrgane": "MISINFO",
      "dateDebut": "2017-07-20T02:00:00.000+02:00",
      "datePublication": "2017-07-20T02:00:00.000+02:00",
      "preseance": "10",
      "nominPrincipale": "1",
      "infosQualite": {
        "codeQualite": "Membre",
        "libQualite": "Membre",
        "libQualiteSex": "Membre"
      },
      "organesRefs": [
        "PO732866"
      ]
    },
    {
      "xsiType": "MandatSimple_Type",
      "uid": "PM733844",
      "acteurRef": "PA720046",
      "legislature": "15",
      "typeOrgane": "ORGEXTPARL",
      "dateDebut": "2017-07-21T02:00:00.000+02:00",
      "datePublication": "2017-07-22T02:00:00.000+02:00",
      "preseance": "20",
      "nominPrincipale": "1",
      "infosQualite": {
        "codeQualite": "Titulaire",
        "libQualite": "Membre titulaire",
        "libQualiteSex": "Membre titulaire"
      },
      "organesRefs": [
        "PO60210"
      ]
    },
    {
      "xsiType": "MandatSimple_Type",
      "uid": "PM743126",
      "acteurRef": "PA720046",
      "legislature": "15",
      "typeOrgane": "CNPE",
      "dateDebut": "2017-11-14T01:00:00.000+01:00",
      "datePublication": "2017-11-15T01:00:00.000+01:00",
      "dateFin": "2018-04-19T02:00:00.000+02:00",
      "preseance": "20",
      "nominPrincipale": "1",
      "infosQualite": {
        "codeQualite": "Membre",
        "libQualite": "Membre",
        "libQualiteSex": "Membre"
      },
      "organesRefs": [
        "PO742273"
      ]
    },
    {
      "xsiType": "MandatSimple_Type",
      "uid": "PM743681",
      "acteurRef": "PA720046",
      "legislature": "15",
      "typeOrgane": "CMP",
      "dateDebut": "2017-11-17T01:00:00.000+01:00",
      "datePublication": "2017-11-22T01:00:00.000+01:00",
      "dateFin": "2017-12-22T01:00:00.000+01:00",
      "preseance": "28",
      "nominPrincipale": "1",
      "infosQualite": {
        "codeQualite": "Suppléant",
        "libQualite": "Membre suppléant",
        "libQualiteSex": "Membre suppléante"
      },
      "organesRefs": [
        "PO743571"
      ]
    },
    {
      "xsiType": "MandatSimple_Type",
      "uid": "PM745093",
      "acteurRef": "PA720046",
      "typeOrgane": "PARPOL",
      "dateDebut": "2017-12-01T01:00:00.000+01:00",
      "dateFin": "2018-11-30T01:00:00.000+01:00",
      "preseance": "5",
      "nominPrincipale": "1",
      "infosQualite": {
        "codeQualite": "Membre",
        "libQualite": "Membre",
        "libQualiteSex": "Membre"
      },
      "organesRefs": [
        "PO744854"
      ]
    },
    {
      "xsiType": "MandatSimple_Type",
      "uid": "PM749386",
      "acteurRef": "PA720046",
      "legislature": "15",
      "typeOrgane": "GE",
      "dateDebut": "2018-02-12T01:00:00.000+01:00",
      "preseance": "20",
      "nominPrincipale": "1",
      "infosQualite": {
        "codeQualite": "Membre",
        "libQualite": "Membre",
        "libQualiteSex": "Membre"
      },
      "organesRefs": [
        "PO746925"
      ]
    },
    {
      "xsiType": "MandatSimple_Type",
      "uid": "PM750803",
      "acteurRef": "PA720046",
      "legislature": "15",
      "typeOrgane": "GE",
      "dateDebut": "2018-02-16T01:00:00.000+01:00",
      "preseance": "20",
      "nominPrincipale": "1",
      "infosQualite": {
        "codeQualite": "Membre",
        "libQualite": "Membre",
        "libQualiteSex": "Membre"
      },
      "organesRefs": [
        "PO746659"
      ]
    },
    {
      "xsiType": "MandatSimple_Type",
      "uid": "PM750815",
      "acteurRef": "PA720046",
      "legislature": "15",
      "typeOrgane": "GE",
      "dateDebut": "2018-02-14T01:00:00.000+01:00",
      "preseance": "20",
      "nominPrincipale": "1",
      "infosQualite": {
        "codeQualite": "Membre",
        "libQualite": "Membre",
        "libQualiteSex": "Membre"
      },
      "organesRefs": [
        "PO747190"
      ]
    },
    {
      "xsiType": "MandatSimple_Type",
      "uid": "PM751078",
      "acteurRef": "PA720046",
      "legislature": "15",
      "typeOrgane": "GE",
      "dateDebut": "2018-02-19T01:00:00.000+01:00",
      "preseance": "20",
      "nominPrincipale": "0",
      "infosQualite": {
        "codeQualite": "Membre",
        "libQualite": "Membre",
        "libQualiteSex": "Membre"
      },
      "organesRefs": [
        "PO746832"
      ]
    },
    {
      "xsiType": "MandatSimple_Type",
      "uid": "PM752711",
      "acteurRef": "PA720046",
      "legislature": "15",
      "typeOrgane": "GE",
      "dateDebut": "2018-03-07T01:00:00.000+01:00",
      "preseance": "8",
      "nominPrincipale": "1",
      "infosQualite": {
        "codeQualite": "Vice-Président",
        "libQualite": "Vice-Président",
        "libQualiteSex": "Vice-Présidente"
      },
      "organesRefs": [
        "PO746832"
      ]
    },
    {
      "xsiType": "MandatSimple_Type",
      "uid": "PM755365",
      "acteurRef": "PA720046",
      "legislature": "15",
      "typeOrgane": "GE",
      "dateDebut": "2018-04-11T02:00:00.000+02:00",
      "preseance": "20",
      "nominPrincipale": "0",
      "infosQualite": {
        "codeQualite": "Membre",
        "libQualite": "Membre",
        "libQualiteSex": "Membre"
      },
      "organesRefs": [
        "PO747052"
      ]
    },
    {
      "xsiType": "MandatSimple_Type",
      "uid": "PM755653",
      "acteurRef": "PA720046",
      "legislature": "15",
      "typeOrgane": "GE",
      "dateDebut": "2018-04-10T02:00:00.000+02:00",
      "preseance": "20",
      "nominPrincipale": "1",
      "infosQualite": {
        "codeQualite": "Membre",
        "libQualite": "Membre",
        "libQualiteSex": "Membre"
      },
      "organesRefs": [
        "PO751484"
      ]
    },
    {
      "xsiType": "MandatSimple_Type",
      "uid": "PM756824",
      "acteurRef": "PA720046",
      "legislature": "15",
      "typeOrgane": "GE",
      "dateDebut": "2018-06-08T02:00:00.000+02:00",
      "preseance": "12",
      "nominPrincipale": "1",
      "infosQualite": {
        "codeQualite": "Secrétaire",
        "libQualite": "Secrétaire",
        "libQualiteSex": "Secrétaire"
      },
      "organesRefs": [
        "PO747052"
      ]
    },
    {
      "xsiType": "MandatSimple_Type",
      "uid": "PM757064",
      "acteurRef": "PA720046",
      "legislature": "15",
      "typeOrgane": "ORGEXTPARL",
      "dateDebut": "2018-06-04T02:00:00.000+02:00",
      "datePublication": "2018-06-05T02:00:00.000+02:00",
      "preseance": "20",
      "nominPrincipale": "1",
      "infosQualite": {
        "codeQualite": "Titulaire",
        "libQualite": "Membre titulaire",
        "libQualiteSex": "Membre titulaire"
      },
      "organesRefs": [
        "PO756933"
      ]
    },
    {
      "xsiType": "MandatSimple_Type",
      "uid": "PM757504",
      "acteurRef": "PA720046",
      "legislature": "15",
      "typeOrgane": "GE",
      "dateDebut": "2018-06-24T02:00:00.000+02:00",
      "preseance": "20",
      "nominPrincipale": "1",
      "infosQualite": {
        "codeQualite": "Membre",
        "libQualite": "Membre",
        "libQualiteSex": "Membre"
      },
      "organesRefs": [
        "PO747145"
      ]
    },
    {
      "xsiType": "MandatSimple_Type",
      "uid": "PM760463",
      "acteurRef": "PA720046",
      "legislature": "15",
      "typeOrgane": "CMP",
      "dateDebut": "2018-11-15T01:00:00.000+01:00",
      "datePublication": "2018-11-21T01:00:00.000+01:00",
      "dateFin": "2018-12-03T01:00:00.000+01:00",
      "preseance": "28",
      "nominPrincipale": "1",
      "infosQualite": {
        "codeQualite": "Suppléant",
        "libQualite": "Membre suppléant",
        "libQualiteSex": "Membre suppléante"
      },
      "organesRefs": [
        "PO760284"
      ]
    },
    {
      "xsiType": "MandatSimple_Type",
      "uid": "PM761914",
      "acteurRef": "PA720046",
      "legislature": "15",
      "typeOrgane": "GE",
      "dateDebut": "2019-01-08T01:00:00.000+01:00",
      "preseance": "20",
      "nominPrincipale": "1",
      "infosQualite": {
        "codeQualite": "Membre",
        "libQualite": "Membre",
        "libQualiteSex": "Membre"
      },
      "organesRefs": [
        "PO747266"
      ]
    },
    {
      "xsiType": "MandatMission_Type",
      "uid": "PM765976",
      "acteurRef": "PA720046",
      "legislature": "15",
      "typeOrgane": "MINISTERE",
      "dateDebut": "2019-06-18T02:00:00.000+02:00",
      "preseance": "1",
      "nominPrincipale": "1",
      "infosQualite": {
        "codeQualite": "en mission",
        "libQualite": "en mission",
        "libQualiteSex": "en mission"
      },
      "organesRefs": [
        "PO729979"
      ],
      "libelle": "La place et l'image des aînés dans notre société"
    },
    {
      "xsiType": "MandatSimple_Type",
      "uid": "PM766192",
      "acteurRef": "PA720046",
      "legislature": "15",
      "typeOrgane": "GE",
      "dateDebut": "2019-07-03T02:00:00.000+02:00",
      "preseance": "20",
      "nominPrincipale": "1",
      "infosQualite": {
        "codeQualite": "Membre",
        "libQualite": "Membre",
        "libQualiteSex": "Membre"
      },
      "organesRefs": [
        "PO763259"
      ]
    }
  ]
}