{
  "uid": "PO763346",
  "codeType": "ORGEXTPARL",
  "libelle": "Commission départementale de coopération intercommunale",
  "libelleAbrege": "Commission départementale de coopération intercommunale",
  "libelleAbrev": "388",
  "viMoDe": {
    "dateDebut": "2018-08-03T02:00:00.000+02:00"
  },
  "regime": "5ème République",
  "regimeJuridique": "Article L. 5211-43 du code général des collectivités territoriales"
}