{
  "uid": "PO309456",
  "codeType": "ORGEXTPARL",
  "libelle": "Conseil d'administration de l'Etablissement public du musée du quai Branly",
  "libelleEdition": "du conseil d'administration de l'Etablissement public du musée du quai Branly",
  "libelleAbrege": "Musée du quai Branly",
  "libelleAbrev": "208",
  "viMoDe": {},
  "regimeJuridique": "Article 6 du décret n° 2004-1350 du 9 décembre 2004",
  "siteInternet": "http://www.quaibranly.fr/fr/missions-et-fonctionnement/instances-deliberatives-et-consultatives/le-conseil-dadministration/"
}