{
  "uid": "PO741732",
  "codeType": "MISINFO",
  "libelle": "Mission d'information sur la politique familiale",
  "libelleEdition": "de la mission d'information sur la politique familiale",
  "libelleAbrege": "Politique familiale",
  "libelleAbrev": "POLFAM",
  "viMoDe": {
    "dateDebut": "2017-10-24T02:00:00.000+02:00"
  },
  "organeParentRef": "PO420120",
  "regime": "5ème République",
  "legislature": "15",
  "secretariat": {}
}