{
  "uid": "PA720278",
  "etatCivil": {
    "ident": {
      "civ": "M.",
      "prenom": "Matthieu",
      "nom": "Orphelin",
      "alpha": "Orphelin",
      "trigramme": "MOR"
    },
    "infoNaissance": {
      "dateNais": "1972-12-03T01:00:00.000+01:00",
      "villeNais": "Saint-Nazaire",
      "depNais": "Loire-Atlantique",
      "paysNais": "France"
    }
  },
  "profession": {
    "libelleCourant": "Cadre supérieur (entreprises publiques)",
    "socProcInsee": {
      "catSocPro": "Cadres d'entreprise",
      "famSocPro": "Cadres et professions intellectuelles supérieures"
    }
  },
  "uriHatvp": "https://www.hatvp.fr/pages_nominatives/orphelin-matthieu",
  "adresses": [
    {
      "xsiType": "AdressePostale_Type",
      "uid": "AD720280",
      "type": "0",
      "typeLibelle": "Adresse officielle",
      "poids": "1",
      "intitule": "Assemblée nationale,",
      "numeroRue": "126",
      "nomRue": "Rue de l'Université,",
      "codePostal": "75355",
      "ville": "Paris 07 SP"
    },
    {
      "xsiType": "AdresseMail_Type",
      "uid": "AD726230",
      "type": "15",
      "typeLibelle": "Mèl",
      "valElec": "bureau-m-orphelin@assemblee-nationale.fr"
    },
    {
      "xsiType": "AdresseSiteWeb_Type",
      "uid": "AD726260",
      "type": "25",
      "typeLibelle": "Facebook",
      "valElec": "matthieuorphelinrem"
    },
    {
      "xsiType": "AdresseSiteWeb_Type",
      "uid": "AD726420",
      "type": "24",
      "typeLibelle": "Twitter",
      "valElec": "@M_Orphelin"
    },
    {
      "xsiType": "AdresseSiteWeb_Type",
      "uid": "AD726718",
      "type": "22",
      "typeLibelle": "Site internet",
      "valElec": "matthieuorphelin.org"
    },
    {
      "xsiType": "AdresseMail_Type",
      "uid": "AD728129",
      "type": "15",
      "typeLibelle": "Mèl",
      "valElec": "matthieu.orphelin@assemblee-nationale.fr"
    }
  ],
  "mandats": [
    {
      "xsiType": "MandatParlementaire_type",
      "uid": "PM722916",
      "acteurRef": "PA720278",
      "legislature": "15",
      "typeOrgane": "ASSEMBLEE",
      "dateDebut": "2017-06-18T02:00:00.000+02:00",
      "preseance": "50",
      "nominPrincipale": "1",
      "infosQualite": {
        "codeQualite": "membre",
        "libQualite": "membre",
        "libQualiteSex": "membre"
      },
      "organesRefs": [
        "PO717460"
      ],
      "suppleant": {
        "dateDebut": "2017-06-18T02:00:00.000+02:00",
        "suppleantRef": "PA720282"
      },
      "election": {
        "lieu": {
          "region": "Pays de la Loire",
          "regionType": "Métropolitain",
          "departement": "Maine-et-Loire",
          "numDepartement": "49",
          "numCirco": "1"
        },
        "causeMandat": "élections générales",
        "refCirconscription": "PO717916"
      },
      "mandature": {
        "datePriseFonction": "2017-06-21T02:00:00.000+02:00",
        "premiereElection": "0",
        "placeHemicycle": "636"
      },
      "collaborateurs": [
        {
          "qualite": "Mme",
          "prenom": "Emeline",
          "nom": "Robert"
        },
        {
          "qualite": "M.",
          "prenom": "Cédric",
          "nom": "Dindault"
        },
        {
          "qualite": "M.",
          "prenom": "David",
          "nom": "Georget"
        },
        {
          "qualite": "Mme",
          "prenom": "Gabrielle",
          "nom": "Pollet"
        }
      ]
    },
    {
      "xsiType": "MandatSimple_Type",
      "uid": "PM724499",
      "acteurRef": "PA720278",
      "legislature": "15",
      "typeOrgane": "GP",
      "dateDebut": "2017-06-21T02:00:00.000+02:00",
      "dateFin": "2017-06-26T02:00:00.000+02:00",
      "preseance": "28",
      "nominPrincipale": "1",
      "infosQualite": {
        "codeQualite": "Député non-inscrit",
        "libQualite": "Député non-inscrit",
        "libQualiteSex": "Député non-inscrit"
      },
      "organesRefs": [
        "PO723569"
      ]
    },
    {
      "xsiType": "MandatSimple_Type",
      "uid": "PM731123",
      "acteurRef": "PA720278",
      "legislature": "15",
      "typeOrgane": "GP",
      "dateDebut": "2017-06-27T02:00:00.000+02:00",
      "datePublication": "2017-06-28T02:00:00.000+02:00",
      "dateFin": "2019-02-14T01:00:00.000+01:00",
      "preseance": "20",
      "nominPrincipale": "1",
      "infosQualite": {
        "codeQualite": "Membre",
        "libQualite": "Membre du",
        "libQualiteSex": "Membre du"
      },
      "organesRefs": [
        "PO730964"
      ]
    },
    {
      "xsiType": "MandatSimple_Type",
      "uid": "PM732080",
      "acteurRef": "PA720278",
      "legislature": "15",
      "typeOrgane": "COMPER",
      "dateDebut": "2017-06-29T02:00:00.000+02:00",
      "datePublication": "2017-06-29T02:00:00.000+02:00",
      "preseance": "32",
      "nominPrincipale": "1",
      "infosQualite": {
        "codeQualite": "Membre",
        "libQualite": "Membre",
        "libQualiteSex": "Membre"
      },
      "organesRefs": [
        "PO419865"
      ]
    },
    {
      "xsiType": "MandatSimple_Type",
      "uid": "PM735212",
      "acteurRef": "PA720278",
      "legislature": "15",
      "typeOrgane": "GA",
      "dateDebut": "2017-09-26T02:00:00.000+02:00",
      "preseance": "20",
      "nominPrincipale": "0",
      "infosQualite": {
        "codeQualite": "Membre",
        "libQualite": "Membre",
        "libQualiteSex": "Membre"
      },
      "organesRefs": [
        "PO733242"
      ]
    },
    {
      "xsiType": "MandatSimple_Type",
      "uid": "PM735213",
      "acteurRef": "PA720278",
      "legislature": "15",
      "typeOrgane": "GA",
      "dateDebut": "2017-09-26T02:00:00.000+02:00",
      "preseance": "1",
      "nominPrincipale": "1",
      "infosQualite": {
        "codeQualite": "Président",
        "libQualite": "Président",
        "libQualiteSex": "Président"
      },
      "organesRefs": [
        "PO733242"
      ]
    },
    {
      "xsiType": "MandatSimple_Type",
      "uid": "PM739646",
      "acteurRef": "PA720278",
      "legislature": "15",
      "typeOrgane": "GA",
      "dateDebut": "2017-10-12T02:00:00.000+02:00",
      "preseance": "20",
      "nominPrincipale": "1",
      "infosQualite": {
        "codeQualite": "Membre",
        "libQualite": "Membre",
        "libQualiteSex": "Membre"
      },
      "organesRefs": [
        "PO733307"
      ]
    },
    {
      "xsiType": "MandatSimple_Type",
      "uid": "PM739647",
      "acteurRef": "PA720278",
      "legislature": "15",
      "typeOrgane": "GA",
      "dateDebut": "2017-10-12T02:00:00.000+02:00",
      "preseance": "20",
      "nominPrincipale": "1",
      "infosQualite": {
        "codeQualite": "Membre",
        "libQualite": "Membre",
        "libQualiteSex": "Membre"
      },
      "organesRefs": [
        "PO733322"
      ]
    },
    {
      "xsiType": "MandatSimple_Type",
      "uid": "PM739648",
      "acteurRef": "PA720278",
      "legislature": "15",
      "typeOrgane": "GA",
      "dateDebut": "2017-10-12T02:00:00.000+02:00",
      "preseance": "20",
      "nominPrincipale": "1",
      "infosQualite": {
        "codeQualite": "Membre",
        "libQualite": "Membre",
        "libQualiteSex": "Membre"
      },
      "organesRefs": [
        "PO733342"
      ]
    },
    {
      "xsiType": "MandatSimple_Type",
      "uid": "PM739649",
      "acteurRef": "PA720278",
      "legislature": "15",
      "typeOrgane": "GA",
      "dateDebut": "2017-10-12T02:00:00.000+02:00",
      "preseance": "20",
      "nominPrincipale": "0",
      "infosQualite": {
        "codeQualite": "Membre",
        "libQualite": "Membre",
        "libQualiteSex": "Membre"
      },
      "organesRefs": [
        "PO733617"
      ]
    },
    {
      "xsiType": "MandatSimple_Type",
      "uid": "PM739650",
      "acteurRef": "PA720278",
      "legislature": "15",
      "typeOrgane": "GA",
      "dateDebut": "2017-10-12T02:00:00.000+02:00",
      "preseance": "20",
      "nominPrincipale": "1",
      "infosQualite": {
        "codeQualite": "Membre",
        "libQualite": "Membre",
        "libQualiteSex": "Membre"
      },
      "organesRefs": [
        "PO733642"
      ]
    },
    {
      "xsiType": "MandatMission_Type",
      "uid": "PM740543",
      "acteurRef": "PA720278",
      "legislature": "15",
      "typeOrgane": "MISINFOCOM",
      "dateDebut": "2017-10-18T02:00:00.000+02:00",
      "datePublication": "2017-10-19T02:00:00.000+02:00",
      "dateFin": "2018-04-06T02:00:00.000+02:00",
      "preseance": "20",
      "nominPrincipale": "1",
      "infosQualite": {
        "codeQualite": "Membre",
        "libQualite": "Membre",
        "libQualiteSex": "Membre"
      },
      "organesRefs": [
        "PO740454"
      ]
    },
    {
      "xsiType": "MandatSimple_Type",
      "uid": "PM742109",
      "acteurRef": "PA720278",
      "legislature": "15",
      "typeOrgane": "API",
      "dateDebut": "2017-10-27T02:00:00.000+02:00",
      "datePublication": "2017-10-28T02:00:00.000+02:00",
      "preseance": "20",
      "nominPrincipale": "1",
      "infosQualite": {
        "codeQualite": "Membre",
        "libQualite": "Membre",
        "libQualiteSex": "Membre"
      },
      "organesRefs": [
        "PO201115"
      ]
    },
    {
      "xsiType": "MandatSimple_Type",
      "uid": "PM742262",
      "acteurRef": "PA720278",
      "legislature": "15",
      "typeOrgane": "GA",
      "dateDebut": "2017-10-31T01:00:00.000+01:00",
      "preseance": "14",
      "nominPrincipale": "1",
      "infosQualite": {
        "codeQualite": "Secrétaire",
        "libQualite": "Secrétaire",
        "libQualiteSex": "Secrétaire"
      },
      "organesRefs": [
        "PO733617"
      ]
    },
    {
      "xsiType": "MandatSimple_Type",
      "uid": "PM743545",
      "acteurRef": "PA720278",
      "legislature": "15",
      "typeOrgane": "CMP",
      "dateDebut": "2017-11-16T01:00:00.000+01:00",
      "datePublication": "2017-11-16T01:00:00.000+01:00",
      "dateFin": "2017-12-19T01:00:00.000+01:00",
      "preseance": "28",
      "nominPrincipale": "1",
      "infosQualite": {
        "codeQualite": "Suppléant",
        "libQualite": "Membre suppléant",
        "libQualiteSex": "Membre suppléant"
      },
      "organesRefs": [
        "PO742823"
      ]
    },
    {
      "xsiType": "MandatSimple_Type",
      "uid": "PM745353",
      "acteurRef": "PA720278",
      "typeOrgane": "PARPOL",
      "dateDebut": "2017-12-01T01:00:00.000+01:00",
      "dateFin": "2018-11-30T01:00:00.000+01:00",
      "preseance": "5",
      "nominPrincipale": "1",
      "infosQualite": {
        "codeQualite": "Membre",
        "libQualite": "Membre",
        "libQualiteSex": "Membre"
      },
      "organesRefs": [
        "PO744854"
      ]
    },
    {
      "xsiType": "MandatSimple_Type",
      "uid": "PM750330",
      "acteurRef": "PA720278",
      "legislature": "15",
      "typeOrgane": "GE",
      "dateDebut": "2018-02-14T01:00:00.000+01:00",
      "preseance": "20",
      "nominPrincipale": "1",
      "infosQualite": {
        "codeQualite": "Membre",
        "libQualite": "Membre",
        "libQualiteSex": "Membre"
      },
      "organesRefs": [
        "PO747129"
      ]
    },
    {
      "xsiType": "MandatSimple_Type",
      "uid": "PM753422",
      "acteurRef": "PA720278",
      "legislature": "15",
      "typeOrgane": "GE",
      "dateDebut": "2018-03-14T01:00:00.000+01:00",
      "preseance": "20",
      "nominPrincipale": "1",
      "infosQualite": {
        "codeQualite": "Membre",
        "libQualite": "Membre",
        "libQualiteSex": "Membre"
      },
      "organesRefs": [
        "PO746997"
      ]
    },
    {
      "xsiType": "MandatSimple_Type",
      "uid": "PM757072",
      "acteurRef": "PA720278",
      "legislature": "15",
      "typeOrgane": "ORGEXTPARL",
      "dateDebut": "2018-06-04T02:00:00.000+02:00",
      "datePublication": "2018-06-05T02:00:00.000+02:00",
      "preseance": "20",
      "nominPrincipale": "1",
      "infosQualite": {
        "codeQualite": "Titulaire",
        "libQualite": "Membre titulaire",
        "libQualiteSex": "Membre titulaire"
      },
      "organesRefs": [
        "PO756933"
      ]
    },
    {
      "xsiType": "MandatMission_Type",
      "uid": "PM757589",
      "acteurRef": "PA720278",
      "legislature": "15",
      "typeOrgane": "MISINFOCOM",
      "dateDebut": "2018-07-04T02:00:00.000+02:00",
      "datePublication": "2018-07-05T02:00:00.000+02:00",
      "preseance": "20",
      "nominPrincipale": "1",
      "infosQualite": {
        "codeQualite": "Membre",
        "libQualite": "Membre",
        "libQualiteSex": "Membre"
      },
      "organesRefs": [
        "PO757572"
      ]
    },
    {
      "xsiType": "MandatSimple_Type",
      "uid": "PM762797",
      "acteurRef": "PA720278",
      "legislature": "15",
      "typeOrgane": "GP",
      "dateDebut": "2019-02-15T01:00:00.000+01:00",
      "datePublication": "2019-02-15T01:00:00.000+01:00",
      "dateFin": "2019-09-27T02:00:00.000+02:00",
      "preseance": "28",
      "nominPrincipale": "1",
      "infosQualite": {
        "codeQualite": "Député non-inscrit",
        "libQualite": "Député non-inscrit",
        "libQualiteSex": "Député non-inscrit"
      },
      "organesRefs": [
        "PO723569"
      ]
    },
    {
      "xsiType": "MandatSimple_Type",
      "uid": "PM764647",
      "acteurRef": "PA720278",
      "legislature": "15",
      "typeOrgane": "GE",
      "dateDebut": "2019-04-09T02:00:00.000+02:00",
      "preseance": "20",
      "nominPrincipale": "1",
      "infosQualite": {
        "codeQualite": "Membre",
        "libQualite": "Membre",
        "libQualiteSex": "Membre"
      },
      "organesRefs": [
        "PO763249"
      ]
    },
    {
      "xsiType": "MandatSimple_Type",
      "uid": "PM765008",
      "acteurRef": "PA720278",
      "legislature": "15",
      "typeOrgane": "GE",
      "dateDebut": "2019-05-07T02:00:00.000+02:00",
      "preseance": "20",
      "nominPrincipale": "1",
      "infosQualite": {
        "codeQualite": "Membre",
        "libQualite": "Membre",
        "libQualiteSex": "Membre"
      },
      "organesRefs": [
        "PO763254"
      ]
    },
    {
      "xsiType": "MandatSimple_Type",
      "uid": "PM766852",
      "acteurRef": "PA720278",
      "legislature": "15",
      "typeOrgane": "CNPS",
      "dateDebut": "2019-07-25T02:00:00.000+02:00",
      "datePublication": "2019-07-26T02:00:00.000+02:00",
      "preseance": "20",
      "nominPrincipale": "1",
      "infosQualite": {
        "codeQualite": "Membre",
        "libQualite": "Membre",
        "libQualiteSex": "Membre"
      },
      "organesRefs": [
        "PO766718"
      ]
    },
    {
      "xsiType": "MandatSimple_Type",
      "uid": "PM767293",
      "acteurRef": "PA720278",
      "legislature": "15",
      "typeOrgane": "GP",
      "dateDebut": "2019-09-28T02:00:00.000+02:00",
      "datePublication": "2019-09-28T02:00:00.000+02:00",
      "preseance": "24",
      "nominPrincipale": "1",
      "infosQualite": {
        "codeQualite": "Membre apparenté",
        "libQualite": "Apparenté au",
        "libQualiteSex": "Apparenté au"
      },
      "organesRefs": [
        "PO759900"
      ]
    }
  ]
}