{
  "uid": "PO702898",
  "codeType": "MINISTERE",
  "libelle": "Ministère de l'agriculture, de l'agroalimentaire et de la forêt",
  "libelleEdition": "de l'agriculture, de l'agroalimentaire et de la forêt",
  "libelleAbrege": "Agriculture, agroalimentaire et forêt",
  "libelleAbrev": "AGR",
  "viMoDe": {
    "dateDebut": "2014-08-27T02:00:00.000+02:00",
    "dateFin": "2016-12-06T01:00:00.000+01:00"
  },
  "organeParentRef": "PO702883"
}