{
  "uid": "PO714924",
  "codeType": "CMP",
  "libelle": "Commission mixte paritaire chargée de proposer un texte sur les dispositions restant en discussion de la proposition de loi relative au devoir de vigilance des sociétés mères et des entreprises donneuses d'ordre",
  "libelleEdition": "de la commission mixte paritaire chargée de proposer un texte sur les dispositionsrestant en discussion de la proposition de loi relative au devoir de vigilance des sociétés mères et des entreprises donneuses d'ordre",
  "libelleAbrege": "Entreprises donneuses d'ordre",
  "libelleAbrev": "2578",
  "viMoDe": {
    "dateDebut": "2016-10-14T02:00:00.000+02:00",
    "dateFin": "2016-11-03T01:00:00.000+01:00"
  },
  "regime": "5ème République",
  "legislature": "14",
  "secretariat": {}
}