{
  "uid": "PO703144",
  "codeType": "CNPE",
  "libelle": "Commission d'enquête relative aux tarifs de l'électricité",
  "libelleEdition": "de la commission d'enquête relative aux tarifs de l'électricité",
  "libelleAbrege": "Commission d'enquête sur les tarifs de l'électricité",
  "libelleAbrev": "TARIFELEC",
  "viMoDe": {
    "dateDebut": "2014-09-10T02:00:00.000+02:00",
    "dateFin": "2015-03-05T01:00:00.000+01:00"
  },
  "regime": "5ème République",
  "legislature": "14",
  "secretariat": {}
}