{
  "uid": "PO762788",
  "codeType": "MISINFO",
  "libelle": "Mission d'information sur \" Dérèglements climatiques et conflits \"",
  "libelleEdition": "de la mission d'information sur \" Dérèglements climatiques et conflits \"",
  "libelleAbrege": "dérèglements climatiques et conflits",
  "libelleAbrev": "DRGLT CLIM",
  "viMoDe": {
    "dateDebut": "2019-02-13T01:00:00.000+01:00"
  },
  "organeParentRef": "PO59047",
  "regime": "5ème République",
  "legislature": "15",
  "secretariat": {}
}