{
  "uid": "PA748954",
  "etatCivil": {
    "ident": {
      "civ": "M.",
      "prenom": "Antoine",
      "nom": "Savignat",
      "alpha": "Savignat",
      "trigramme": "ASV"
    },
    "infoNaissance": {
      "dateNais": "1975-07-22T01:00:00.000+01:00",
      "villeNais": "Cormeilles-en-Parisis",
      "depNais": "Val-d'Oise",
      "paysNais": "France"
    }
  },
  "profession": {
    "libelleCourant": "Avocat",
    "socProcInsee": {
      "catSocPro": "Professions libérales et assimilés",
      "famSocPro": "Cadres et professions intellectuelles supérieures"
    }
  },
  "uriHatvp": "https://www.hatvp.fr/pages_nominatives/savignat-antoine",
  "adresses": [
    {
      "xsiType": "AdressePostale_Type",
      "uid": "AD748979",
      "type": "0",
      "typeLibelle": "Adresse officielle",
      "poids": "1",
      "intitule": "Assemblée nationale",
      "numeroRue": "126",
      "nomRue": "Rue de l'Université,",
      "codePostal": "75355",
      "ville": "Paris 07 SP"
    },
    {
      "xsiType": "AdressePostale_Type",
      "uid": "AD748981",
      "type": "2",
      "typeLibelle": "Adresse publiée de circonscription",
      "poids": "2",
      "intitule": "Permanence parlementaire",
      "numeroRue": "11",
      "nomRue": "Place de l'Hôtel de Ville",
      "codePostal": "95300",
      "ville": "Pontoise"
    },
    {
      "xsiType": "AdresseMail_Type",
      "uid": "AD751821",
      "type": "15",
      "typeLibelle": "Mèl",
      "valElec": "antoine.savignat@assemblee-nationale.fr"
    }
  ],
  "mandats": [
    {
      "xsiType": "MandatParlementaire_type",
      "uid": "PM748958",
      "acteurRef": "PA748954",
      "legislature": "15",
      "typeOrgane": "ASSEMBLEE",
      "dateDebut": "2018-02-04T01:00:00.000+01:00",
      "preseance": "50",
      "nominPrincipale": "1",
      "infosQualite": {
        "codeQualite": "membre",
        "libQualite": "membre",
        "libQualiteSex": "membre"
      },
      "organesRefs": [
        "PO717460"
      ],
      "suppleant": {
        "dateDebut": "2018-02-04T01:00:00.000+01:00",
        "suppleantRef": "PA748956"
      },
      "election": {
        "lieu": {
          "region": "Ile-de-France",
          "regionType": "Métropolitain",
          "departement": "Val-d'Oise",
          "numDepartement": "95",
          "numCirco": "1"
        },
        "causeMandat": "élection partielle, suite à l'annulation de l'élection d'un député",
        "refCirconscription": "PO718504"
      },
      "mandature": {
        "datePriseFonction": "2018-02-05T01:00:00.000+01:00",
        "premiereElection": "0",
        "placeHemicycle": "070"
      },
      "collaborateurs": [
        {
          "qualite": "M.",
          "prenom": "Guy-Noël",
          "nom": "Orthion"
        },
        {
          "qualite": "Mme",
          "prenom": "Caroline",
          "nom": "Bettinger-Aucagos"
        },
        {
          "qualite": "M.",
          "prenom": "Thierry",
          "nom": "Pilath"
        },
        {
          "qualite": "Mme",
          "prenom": "Pauline",
          "nom": "Demaré"
        }
      ]
    },
    {
      "xsiType": "MandatSimple_Type",
      "uid": "PM748959",
      "acteurRef": "PA748954",
      "legislature": "15",
      "typeOrgane": "GP",
      "dateDebut": "2018-02-05T01:00:00.000+01:00",
      "preseance": "20",
      "nominPrincipale": "1",
      "infosQualite": {
        "codeQualite": "Membre",
        "libQualite": "Membre du",
        "libQualiteSex": "Membre du"
      },
      "organesRefs": [
        "PO730934"
      ]
    },
    {
      "xsiType": "MandatSimple_Type",
      "uid": "PM748976",
      "acteurRef": "PA748954",
      "legislature": "15",
      "typeOrgane": "COMPER",
      "dateDebut": "2018-02-06T01:00:00.000+01:00",
      "datePublication": "2018-02-06T01:00:00.000+01:00",
      "dateFin": "2018-10-12T02:00:00.000+02:00",
      "preseance": "32",
      "nominPrincipale": "1",
      "infosQualite": {
        "codeQualite": "Membre",
        "libQualite": "Membre",
        "libQualiteSex": "Membre"
      },
      "organesRefs": [
        "PO59046"
      ]
    },
    {
      "xsiType": "MandatSimple_Type",
      "uid": "PM754107",
      "acteurRef": "PA748954",
      "legislature": "15",
      "typeOrgane": "GE",
      "dateDebut": "2018-03-21T01:00:00.000+01:00",
      "preseance": "20",
      "nominPrincipale": "1",
      "infosQualite": {
        "codeQualite": "Membre",
        "libQualite": "Membre",
        "libQualiteSex": "Membre"
      },
      "organesRefs": [
        "PO747124"
      ]
    },
    {
      "xsiType": "MandatSimple_Type",
      "uid": "PM757048",
      "acteurRef": "PA748954",
      "legislature": "15",
      "typeOrgane": "ORGEXTPARL",
      "dateDebut": "2018-03-08T01:00:00.000+01:00",
      "datePublication": "2018-03-09T01:00:00.000+01:00",
      "preseance": "20",
      "nominPrincipale": "1",
      "infosQualite": {
        "codeQualite": "Titulaire",
        "libQualite": "Membre titulaire",
        "libQualiteSex": "Membre titulaire"
      },
      "organesRefs": [
        "PO756933"
      ]
    },
    {
      "xsiType": "MandatSimple_Type",
      "uid": "PM759440",
      "acteurRef": "PA748954",
      "legislature": "15",
      "typeOrgane": "COMPER",
      "dateDebut": "2018-10-13T02:00:00.000+02:00",
      "datePublication": "2018-10-13T02:00:00.000+02:00",
      "dateFin": "2018-12-03T01:00:00.000+01:00",
      "preseance": "32",
      "nominPrincipale": "1",
      "infosQualite": {
        "codeQualite": "Membre",
        "libQualite": "Membre",
        "libQualiteSex": "Membre"
      },
      "organesRefs": [
        "PO59051"
      ]
    },
    {
      "xsiType": "MandatSimple_Type",
      "uid": "PM760724",
      "acteurRef": "PA748954",
      "legislature": "15",
      "typeOrgane": "CMP",
      "dateDebut": "2018-11-28T01:00:00.000+01:00",
      "datePublication": "2018-11-29T01:00:00.000+01:00",
      "dateFin": "2019-02-18T01:00:00.000+01:00",
      "preseance": "20",
      "nominPrincipale": "1",
      "infosQualite": {
        "codeQualite": "Titulaire",
        "libQualite": "Membre titulaire",
        "libQualiteSex": "Membre titulaire"
      },
      "organesRefs": [
        "PO760711"
      ]
    },
    {
      "xsiType": "MandatSimple_Type",
      "uid": "PM760752",
      "acteurRef": "PA748954",
      "legislature": "15",
      "typeOrgane": "CMP",
      "dateDebut": "2018-11-27T01:00:00.000+01:00",
      "datePublication": "2018-11-29T01:00:00.000+01:00",
      "dateFin": "2019-02-20T01:00:00.000+01:00",
      "preseance": "20",
      "nominPrincipale": "1",
      "infosQualite": {
        "codeQualite": "Titulaire",
        "libQualite": "Membre titulaire",
        "libQualiteSex": "Membre titulaire"
      },
      "organesRefs": [
        "PO760704"
      ]
    },
    {
      "xsiType": "MandatMission_Type",
      "uid": "PM760777",
      "acteurRef": "PA748954",
      "legislature": "15",
      "typeOrgane": "MISINFO",
      "dateDebut": "2018-11-28T01:00:00.000+01:00",
      "dateFin": "2019-02-20T01:00:00.000+01:00",
      "preseance": "10",
      "nominPrincipale": "1",
      "infosQualite": {
        "codeQualite": "Membre",
        "libQualite": "Membre",
        "libQualiteSex": "Membre"
      },
      "organesRefs": [
        "PO754002"
      ]
    },
    {
      "xsiType": "MandatSimple_Type",
      "uid": "PM760800",
      "acteurRef": "PA748954",
      "legislature": "15",
      "typeOrgane": "COMPER",
      "dateDebut": "2018-12-04T01:00:00.000+01:00",
      "datePublication": "2018-12-04T01:00:00.000+01:00",
      "dateFin": "2018-12-18T01:00:00.000+01:00",
      "preseance": "32",
      "nominPrincipale": "1",
      "infosQualite": {
        "codeQualite": "Membre",
        "libQualite": "Membre",
        "libQualiteSex": "Membre"
      },
      "organesRefs": [
        "PO59046"
      ]
    },
    {
      "xsiType": "MandatSimple_Type",
      "uid": "PM761107",
      "acteurRef": "PA748954",
      "legislature": "15",
      "typeOrgane": "COMPER",
      "dateDebut": "2018-12-19T01:00:00.000+01:00",
      "datePublication": "2018-12-19T01:00:00.000+01:00",
      "dateFin": "2018-12-20T01:00:00.000+01:00",
      "preseance": "32",
      "nominPrincipale": "1",
      "infosQualite": {
        "codeQualite": "Membre",
        "libQualite": "Membre",
        "libQualiteSex": "Membre"
      },
      "organesRefs": [
        "PO59051"
      ]
    },
    {
      "xsiType": "MandatSimple_Type",
      "uid": "PM761164",
      "acteurRef": "PA748954",
      "legislature": "15",
      "typeOrgane": "COMPER",
      "dateDebut": "2018-12-21T01:00:00.000+01:00",
      "datePublication": "2018-12-21T01:00:00.000+01:00",
      "dateFin": "2019-02-19T01:00:00.000+01:00",
      "preseance": "32",
      "nominPrincipale": "1",
      "infosQualite": {
        "codeQualite": "Membre",
        "libQualite": "Membre",
        "libQualiteSex": "Membre"
      },
      "organesRefs": [
        "PO59046"
      ]
    },
    {
      "xsiType": "MandatSimple_Type",
      "uid": "PM762820",
      "acteurRef": "PA748954",
      "legislature": "15",
      "typeOrgane": "COMPER",
      "dateDebut": "2019-02-20T01:00:00.000+01:00",
      "datePublication": "2019-02-20T01:00:00.000+01:00",
      "dateFin": "2019-02-20T01:00:00.000+01:00",
      "preseance": "32",
      "nominPrincipale": "1",
      "infosQualite": {
        "codeQualite": "Membre",
        "libQualite": "Membre",
        "libQualiteSex": "Membre"
      },
      "organesRefs": [
        "PO59051"
      ]
    },
    {
      "xsiType": "MandatSimple_Type",
      "uid": "PM762860",
      "acteurRef": "PA748954",
      "legislature": "15",
      "typeOrgane": "COMPER",
      "dateDebut": "2019-02-21T01:00:00.000+01:00",
      "datePublication": "2019-02-21T01:00:00.000+01:00",
      "dateFin": "2019-10-10T02:00:00.000+02:00",
      "preseance": "32",
      "nominPrincipale": "1",
      "infosQualite": {
        "codeQualite": "Membre",
        "libQualite": "Membre",
        "libQualiteSex": "Membre"
      },
      "organesRefs": [
        "PO59046"
      ]
    },
    {
      "xsiType": "MandatSimple_Type",
      "uid": "PM767484",
      "acteurRef": "PA748954",
      "legislature": "15",
      "typeOrgane": "COMPER",
      "dateDebut": "2019-10-11T02:00:00.000+02:00",
      "datePublication": "2019-10-11T02:00:00.000+02:00",
      "preseance": "32",
      "nominPrincipale": "1",
      "infosQualite": {
        "codeQualite": "Membre",
        "libQualite": "Membre",
        "libQualiteSex": "Membre"
      },
      "organesRefs": [
        "PO59051"
      ]
    }
  ]
}