{
  "uid": "PA720286",
  "etatCivil": {
    "ident": {
      "civ": "Mme",
      "prenom": "Caroline",
      "nom": "Fiat",
      "alpha": "Fiat",
      "trigramme": "CFI"
    },
    "infoNaissance": {
      "dateNais": "1977-01-28T01:00:00.000+01:00",
      "villeNais": "VERDUN",
      "depNais": "Meuse",
      "paysNais": "France"
    }
  },
  "profession": {
    "libelleCourant": "Salariée du secteur médical",
    "socProcInsee": {
      "catSocPro": "Ouvriers qualifiés",
      "famSocPro": "Ouvriers"
    }
  },
  "uriHatvp": "https://www.hatvp.fr/pages_nominatives/fiat-caroline",
  "adresses": [
    {
      "xsiType": "AdressePostale_Type",
      "uid": "AD720288",
      "type": "0",
      "typeLibelle": "Adresse officielle",
      "poids": "1",
      "intitule": "Assemblée nationale,",
      "numeroRue": "126",
      "nomRue": "Rue de l'Université,",
      "codePostal": "75355",
      "ville": "Paris 07 SP"
    },
    {
      "xsiType": "AdresseSiteWeb_Type",
      "uid": "AD725946",
      "type": "25",
      "typeLibelle": "Facebook",
      "valElec": "kro.epousefiat"
    },
    {
      "xsiType": "AdresseMail_Type",
      "uid": "AD728130",
      "type": "15",
      "typeLibelle": "Mèl",
      "valElec": "caroline.fiat@assemblee-nationale.fr"
    }
  ],
  "mandats": [
    {
      "xsiType": "MandatParlementaire_type",
      "uid": "PM722918",
      "acteurRef": "PA720286",
      "legislature": "15",
      "typeOrgane": "ASSEMBLEE",
      "dateDebut": "2017-06-18T02:00:00.000+02:00",
      "preseance": "50",
      "nominPrincipale": "1",
      "infosQualite": {
        "codeQualite": "membre",
        "libQualite": "membre",
        "libQualiteSex": "membre"
      },
      "organesRefs": [
        "PO717460"
      ],
      "suppleant": {
        "dateDebut": "2017-06-18T02:00:00.000+02:00",
        "suppleantRef": "PA720290"
      },
      "election": {
        "lieu": {
          "region": "Grand Est",
          "regionType": "Métropolitain",
          "departement": "Meurthe-et-Moselle",
          "numDepartement": "54",
          "numCirco": "6"
        },
        "causeMandat": "élections générales",
        "refCirconscription": "PO717966"
      },
      "mandature": {
        "datePriseFonction": "2017-06-21T02:00:00.000+02:00",
        "premiereElection": "0",
        "placeHemicycle": "602"
      },
      "collaborateurs": [
        {
          "qualite": "M.",
          "prenom": "Fabien",
          "nom": "Allait"
        },
        {
          "qualite": "M.",
          "prenom": "Grégory",
          "nom": "Felipe"
        },
        {
          "qualite": "Mme",
          "prenom": "Sandrine",
          "nom": "Hirschler"
        }
      ]
    },
    {
      "xsiType": "MandatSimple_Type",
      "uid": "PM724500",
      "acteurRef": "PA720286",
      "legislature": "15",
      "typeOrgane": "GP",
      "dateDebut": "2017-06-21T02:00:00.000+02:00",
      "dateFin": "2017-06-26T02:00:00.000+02:00",
      "preseance": "28",
      "nominPrincipale": "1",
      "infosQualite": {
        "codeQualite": "Député non-inscrit",
        "libQualite": "Député non-inscrit",
        "libQualiteSex": "Députée non-inscrite"
      },
      "organesRefs": [
        "PO723569"
      ]
    },
    {
      "xsiType": "MandatSimple_Type",
      "uid": "PM731517",
      "acteurRef": "PA720286",
      "legislature": "15",
      "typeOrgane": "GP",
      "dateDebut": "2017-06-27T02:00:00.000+02:00",
      "datePublication": "2017-06-28T02:00:00.000+02:00",
      "preseance": "20",
      "nominPrincipale": "1",
      "infosQualite": {
        "codeQualite": "Membre",
        "libQualite": "Membre du",
        "libQualiteSex": "Membre du"
      },
      "organesRefs": [
        "PO730958"
      ]
    },
    {
      "xsiType": "MandatSimple_Type",
      "uid": "PM731675",
      "acteurRef": "PA720286",
      "legislature": "15",
      "typeOrgane": "COMPER",
      "dateDebut": "2017-06-29T02:00:00.000+02:00",
      "datePublication": "2017-06-29T02:00:00.000+02:00",
      "dateFin": "2019-02-11T01:00:00.000+01:00",
      "preseance": "32",
      "nominPrincipale": "1",
      "infosQualite": {
        "codeQualite": "Membre",
        "libQualite": "Membre",
        "libQualiteSex": "Membre"
      },
      "organesRefs": [
        "PO420120"
      ]
    },
    {
      "xsiType": "MandatMission_Type",
      "uid": "PM732879",
      "acteurRef": "PA720286",
      "legislature": "15",
      "typeOrgane": "MISINFO",
      "dateDebut": "2017-07-20T02:00:00.000+02:00",
      "datePublication": "2017-07-20T02:00:00.000+02:00",
      "preseance": "10",
      "nominPrincipale": "1",
      "infosQualite": {
        "codeQualite": "Membre",
        "libQualite": "Membre",
        "libQualiteSex": "Membre"
      },
      "organesRefs": [
        "PO732866"
      ]
    },
    {
      "xsiType": "MandatSimple_Type",
      "uid": "PM740369",
      "acteurRef": "PA720286",
      "legislature": "15",
      "typeOrgane": "GA",
      "dateDebut": "2017-10-17T02:00:00.000+02:00",
      "preseance": "20",
      "nominPrincipale": "0",
      "infosQualite": {
        "codeQualite": "Membre",
        "libQualite": "Membre",
        "libQualiteSex": "Membre"
      },
      "organesRefs": [
        "PO733302"
      ]
    },
    {
      "xsiType": "MandatSimple_Type",
      "uid": "PM740370",
      "acteurRef": "PA720286",
      "legislature": "15",
      "typeOrgane": "GA",
      "dateDebut": "2017-10-17T02:00:00.000+02:00",
      "preseance": "20",
      "nominPrincipale": "0",
      "infosQualite": {
        "codeQualite": "Membre",
        "libQualite": "Membre",
        "libQualiteSex": "Membre"
      },
      "organesRefs": [
        "PO733577"
      ]
    },
    {
      "xsiType": "MandatMission_Type",
      "uid": "PM740538",
      "acteurRef": "PA720286",
      "legislature": "15",
      "typeOrgane": "MISINFO",
      "dateDebut": "2017-10-04T02:00:00.000+02:00",
      "dateFin": "2018-11-23T01:00:00.000+01:00",
      "preseance": "10",
      "nominPrincipale": "0",
      "infosQualite": {
        "codeQualite": "Membre",
        "libQualite": "Membre",
        "libQualiteSex": "Membre"
      },
      "organesRefs": [
        "PO740515"
      ]
    },
    {
      "xsiType": "MandatMission_Type",
      "uid": "PM740540",
      "acteurRef": "PA720286",
      "legislature": "15",
      "typeOrgane": "MISINFO",
      "dateDebut": "2017-10-04T02:00:00.000+02:00",
      "dateFin": "2018-11-23T01:00:00.000+01:00",
      "preseance": "5",
      "nominPrincipale": "1",
      "infosQualite": {
        "codeQualite": "Co-rapporteur",
        "libQualite": "Co-rapporteur",
        "libQualiteSex": "Co-rapporteure"
      },
      "organesRefs": [
        "PO740515"
      ]
    },
    {
      "xsiType": "MandatSimple_Type",
      "uid": "PM740937",
      "acteurRef": "PA720286",
      "legislature": "15",
      "typeOrgane": "ORGEXTPARL",
      "dateDebut": "2017-10-19T02:00:00.000+02:00",
      "datePublication": "2017-10-21T02:00:00.000+02:00",
      "preseance": "30",
      "nominPrincipale": "1",
      "infosQualite": {
        "codeQualite": "Suppléant",
        "libQualite": "Membre suppléant",
        "libQualiteSex": "Membre suppléante"
      },
      "organesRefs": [
        "PO312952"
      ]
    },
    {
      "xsiType": "MandatSimple_Type",
      "uid": "PM741814",
      "acteurRef": "PA720286",
      "legislature": "15",
      "typeOrgane": "ORGEXTPARL",
      "dateDebut": "2017-10-25T02:00:00.000+02:00",
      "datePublication": "2017-10-26T02:00:00.000+02:00",
      "preseance": "20",
      "nominPrincipale": "1",
      "infosQualite": {
        "codeQualite": "Titulaire",
        "libQualite": "Membre titulaire",
        "libQualiteSex": "Membre titulaire"
      },
      "organesRefs": [
        "PO307788"
      ]
    },
    {
      "xsiType": "MandatSimple_Type",
      "uid": "PM742282",
      "acteurRef": "PA720286",
      "legislature": "15",
      "typeOrgane": "GA",
      "dateDebut": "2017-10-31T01:00:00.000+01:00",
      "preseance": "8",
      "nominPrincipale": "1",
      "infosQualite": {
        "codeQualite": "Vice-Président",
        "libQualite": "Vice-Président",
        "libQualiteSex": "Vice-Présidente"
      },
      "organesRefs": [
        "PO733302"
      ]
    },
    {
      "xsiType": "MandatSimple_Type",
      "uid": "PM742296",
      "acteurRef": "PA720286",
      "legislature": "15",
      "typeOrgane": "GA",
      "dateDebut": "2017-10-31T01:00:00.000+01:00",
      "preseance": "8",
      "nominPrincipale": "1",
      "infosQualite": {
        "codeQualite": "Vice-Président",
        "libQualite": "Vice-Président",
        "libQualiteSex": "Vice-Présidente"
      },
      "organesRefs": [
        "PO733577"
      ]
    },
    {
      "xsiType": "MandatSimple_Type",
      "uid": "PM743683",
      "acteurRef": "PA720286",
      "legislature": "15",
      "typeOrgane": "CMP",
      "dateDebut": "2017-11-17T01:00:00.000+01:00",
      "datePublication": "2017-11-22T01:00:00.000+01:00",
      "dateFin": "2017-12-22T01:00:00.000+01:00",
      "preseance": "28",
      "nominPrincipale": "1",
      "infosQualite": {
        "codeQualite": "Suppléant",
        "libQualite": "Membre suppléant",
        "libQualiteSex": "Membre suppléante"
      },
      "organesRefs": [
        "PO743571"
      ]
    },
    {
      "xsiType": "MandatSimple_Type",
      "uid": "PM747959",
      "acteurRef": "PA720286",
      "legislature": "15",
      "typeOrgane": "ORGEXTPARL",
      "dateDebut": "2018-01-10T01:00:00.000+01:00",
      "datePublication": "2018-01-11T01:00:00.000+01:00",
      "preseance": "20",
      "nominPrincipale": "1",
      "infosQualite": {
        "codeQualite": "Titulaire",
        "libQualite": "Membre titulaire",
        "libQualiteSex": "Membre titulaire"
      },
      "organesRefs": [
        "PO717436"
      ]
    },
    {
      "xsiType": "MandatSimple_Type",
      "uid": "PM750076",
      "acteurRef": "PA720286",
      "legislature": "15",
      "typeOrgane": "GE",
      "dateDebut": "2018-02-14T01:00:00.000+01:00",
      "preseance": "20",
      "nominPrincipale": "0",
      "infosQualite": {
        "codeQualite": "Membre",
        "libQualite": "Membre",
        "libQualiteSex": "Membre"
      },
      "organesRefs": [
        "PO746925"
      ]
    },
    {
      "xsiType": "MandatSimple_Type",
      "uid": "PM753735",
      "acteurRef": "PA720286",
      "legislature": "15",
      "typeOrgane": "GE",
      "dateDebut": "2018-03-14T01:00:00.000+01:00",
      "preseance": "8",
      "nominPrincipale": "1",
      "infosQualite": {
        "codeQualite": "Vice-Président",
        "libQualite": "Vice-Président",
        "libQualiteSex": "Vice-Présidente"
      },
      "organesRefs": [
        "PO746925"
      ]
    },
    {
      "xsiType": "MandatSimple_Type",
      "uid": "PM754155",
      "acteurRef": "PA720286",
      "legislature": "15",
      "typeOrgane": "CNPE",
      "dateDebut": "2018-03-23T01:00:00.000+01:00",
      "datePublication": "2018-03-23T01:00:00.000+01:00",
      "dateFin": "2018-07-19T02:00:00.000+02:00",
      "preseance": "20",
      "nominPrincipale": "1",
      "infosQualite": {
        "codeQualite": "Membre",
        "libQualite": "Membre",
        "libQualiteSex": "Membre"
      },
      "organesRefs": [
        "PO753283"
      ]
    },
    {
      "xsiType": "MandatSimple_Type",
      "uid": "PM758020",
      "acteurRef": "PA720286",
      "legislature": "15",
      "typeOrgane": "CMP",
      "dateDebut": "2018-07-12T02:00:00.000+02:00",
      "datePublication": "2018-07-14T02:00:00.000+02:00",
      "dateFin": "2018-08-01T02:00:00.000+02:00",
      "preseance": "28",
      "nominPrincipale": "1",
      "infosQualite": {
        "codeQualite": "Suppléant",
        "libQualite": "Membre suppléant",
        "libQualiteSex": "Membre suppléante"
      },
      "organesRefs": [
        "PO757975"
      ]
    },
    {
      "xsiType": "MandatSimple_Type",
      "uid": "PM760464",
      "acteurRef": "PA720286",
      "legislature": "15",
      "typeOrgane": "CMP",
      "dateDebut": "2018-11-15T01:00:00.000+01:00",
      "datePublication": "2018-11-21T01:00:00.000+01:00",
      "dateFin": "2018-12-03T01:00:00.000+01:00",
      "preseance": "28",
      "nominPrincipale": "1",
      "infosQualite": {
        "codeQualite": "Suppléant",
        "libQualite": "Membre suppléant",
        "libQualiteSex": "Membre suppléante"
      },
      "organesRefs": [
        "PO760284"
      ]
    },
    {
      "xsiType": "MandatMission_Type",
      "uid": "PM762399",
      "acteurRef": "PA720286",
      "legislature": "15",
      "typeOrgane": "MISINFOCOM",
      "dateDebut": "2019-01-31T01:00:00.000+01:00",
      "preseance": "20",
      "nominPrincipale": "1",
      "infosQualite": {
        "codeQualite": "Membre",
        "libQualite": "Membre",
        "libQualiteSex": "Membre"
      },
      "organesRefs": [
        "PO762383"
      ]
    },
    {
      "xsiType": "MandatSimple_Type",
      "uid": "PM762615",
      "acteurRef": "PA720286",
      "legislature": "15",
      "typeOrgane": "COMPER",
      "dateDebut": "2019-02-12T01:00:00.000+01:00",
      "datePublication": "2019-02-12T01:00:00.000+01:00",
      "dateFin": "2019-02-25T01:00:00.000+01:00",
      "preseance": "32",
      "nominPrincipale": "1",
      "infosQualite": {
        "codeQualite": "Membre",
        "libQualite": "Membre",
        "libQualiteSex": "Membre"
      },
      "organesRefs": [
        "PO59046"
      ]
    },
    {
      "xsiType": "MandatSimple_Type",
      "uid": "PM762920",
      "acteurRef": "PA720286",
      "legislature": "15",
      "typeOrgane": "COMPER",
      "dateDebut": "2019-02-26T01:00:00.000+01:00",
      "datePublication": "2019-02-26T01:00:00.000+01:00",
      "preseance": "32",
      "nominPrincipale": "1",
      "infosQualite": {
        "codeQualite": "Membre",
        "libQualite": "Membre",
        "libQualiteSex": "Membre"
      },
      "organesRefs": [
        "PO420120"
      ]
    },
    {
      "xsiType": "MandatMission_Type",
      "uid": "PM764652",
      "acteurRef": "PA720286",
      "legislature": "15",
      "typeOrgane": "MISINFO",
      "dateDebut": "2019-04-10T02:00:00.000+02:00",
      "preseance": "10",
      "nominPrincipale": "0",
      "infosQualite": {
        "codeQualite": "Membre",
        "libQualite": "Membre",
        "libQualiteSex": "Membre"
      },
      "organesRefs": [
        "PO764648"
      ]
    },
    {
      "xsiType": "MandatMission_Type",
      "uid": "PM764657",
      "acteurRef": "PA720286",
      "legislature": "15",
      "typeOrgane": "MISINFO",
      "dateDebut": "2019-04-10T02:00:00.000+02:00",
      "preseance": "5",
      "nominPrincipale": "1",
      "infosQualite": {
        "codeQualite": "Co-rapporteur",
        "libQualite": "Co-rapporteur",
        "libQualiteSex": "Co-rapporteure"
      },
      "organesRefs": [
        "PO764648"
      ]
    },
    {
      "xsiType": "MandatSimple_Type",
      "uid": "PM766256",
      "acteurRef": "PA720286",
      "legislature": "15",
      "typeOrgane": "CMP",
      "dateDebut": "2019-07-04T02:00:00.000+02:00",
      "datePublication": "2019-07-05T02:00:00.000+02:00",
      "dateFin": "2019-07-25T02:00:00.000+02:00",
      "preseance": "28",
      "nominPrincipale": "1",
      "infosQualite": {
        "codeQualite": "Suppléant",
        "libQualite": "Membre suppléant",
        "libQualiteSex": "Membre suppléante"
      },
      "organesRefs": [
        "PO766090"
      ]
    },
    {
      "xsiType": "MandatSimple_Type",
      "uid": "PM768220",
      "acteurRef": "PA720286",
      "legislature": "15",
      "typeOrgane": "CMP",
      "dateDebut": "2019-11-14T01:00:00.000+01:00",
      "datePublication": "2019-11-15T01:00:00.000+01:00",
      "preseance": "28",
      "nominPrincipale": "1",
      "infosQualite": {
        "codeQualite": "Suppléant",
        "libQualite": "Membre suppléant",
        "libQualiteSex": "Membre suppléante"
      },
      "organesRefs": [
        "PO768194"
      ]
    }
  ]
}