{
  "uid": "PO746099",
  "codeType": "CMP",
  "libelle": "Commission mixte paritaire chargée de proposer un texte sur les dispositions restant en discussion sur le projet de loi de finances pour 2018",
  "libelleEdition": "de la commission mixte paritaire chargée de proposer un texte sur les dispositions restant en discussion sur le projet de loi de finances pour 2018",
  "libelleAbrege": "Projet de loi de finances pour 2018",
  "libelleAbrev": "235",
  "viMoDe": {
    "dateDebut": "2017-12-07T01:00:00.000+01:00",
    "dateFin": "2017-12-21T01:00:00.000+01:00"
  },
  "regime": "5ème République",
  "legislature": "15",
  "secretariat": {}
}