{
  "uid": "PO274208",
  "codeType": "GA",
  "libelle": "France République du Vénézuela",
  "libelleEdition": "de France République du Vénézuela",
  "libelleAbrege": "Venezuela",
  "libelleAbrev": "YV",
  "viMoDe": {
    "dateAgrement": "2002-07-24T02:00:00.000+02:00",
    "dateFin": "2007-06-19T02:00:00.000+02:00"
  },
  "regime": "5ème République",
  "legislature": "12",
  "secretariat": {}
}