{
  "uid": "PA643205",
  "etatCivil": {
    "ident": {
      "civ": "Mme",
      "prenom": "Anne-Christine",
      "nom": "Lang",
      "alpha": "Lang",
      "trigramme": "ALA"
    },
    "infoNaissance": {
      "dateNais": "1961-08-10T01:00:00.000+01:00",
      "villeNais": "Mont-de-Marsan",
      "depNais": "Landes",
      "paysNais": "France"
    }
  },
  "profession": {
    "libelleCourant": "Cadre territorial",
    "socProcInsee": {
      "catSocPro": "Cadres de la fonction publique, professions intellectuelles et  artistiques",
      "famSocPro": "Cadres et professions intellectuelles supérieures"
    }
  },
  "uriHatvp": "https://www.hatvp.fr/pages_nominatives/lang-anne-christine",
  "adresses": [
    {
      "xsiType": "AdressePostale_Type",
      "uid": "AD701236",
      "type": "0",
      "typeLibelle": "Adresse officielle",
      "poids": "1",
      "intitule": "Assemblée nationale",
      "numeroRue": "126",
      "nomRue": "Rue de l'Université",
      "codePostal": "75355",
      "ville": "Paris 07 SP"
    },
    {
      "xsiType": "AdresseMail_Type",
      "uid": "AD701244",
      "type": "15",
      "typeLibelle": "Mèl",
      "valElec": "anne-christine.lang@paris.fr"
    },
    {
      "xsiType": "AdresseSiteWeb_Type",
      "uid": "AD724836",
      "type": "24",
      "typeLibelle": "Twitter",
      "valElec": "@AChristine_Lang"
    },
    {
      "xsiType": "AdresseSiteWeb_Type",
      "uid": "AD725158",
      "type": "22",
      "typeLibelle": "Site internet",
      "valElec": "www.annechristinelang.fr"
    },
    {
      "xsiType": "AdresseSiteWeb_Type",
      "uid": "AD725162",
      "type": "25",
      "typeLibelle": "Facebook",
      "valElec": "ACLang13"
    },
    {
      "xsiType": "AdresseMail_Type",
      "uid": "AD727957",
      "type": "15",
      "typeLibelle": "Mèl",
      "valElec": "anne-christine.lang@assemblee-nationale.fr"
    }
  ],
  "mandats": [
    {
      "xsiType": "MandatParlementaire_type",
      "uid": "PM701215",
      "acteurRef": "PA643205",
      "legislature": "14",
      "typeOrgane": "ASSEMBLEE",
      "dateDebut": "2012-06-20T02:00:00.000+02:00",
      "dateFin": "2017-06-17T02:00:00.000+02:00",
      "preseance": "50",
      "nominPrincipale": "1",
      "infosQualite": {
        "codeQualite": "membre",
        "libQualite": "membre",
        "libQualiteSex": "membre"
      },
      "organesRefs": [
        "PO644420"
      ],
      "election": {
        "lieu": {
          "region": "Ile-de-France",
          "regionType": "Métropolitain",
          "departement": "Paris",
          "numDepartement": "75",
          "numCirco": "9"
        },
        "causeMandat": "remplacement d'un député nommé au Gouvernement",
        "refCirconscription": "PO644824"
      },
      "mandature": {
        "datePriseFonction": "2014-05-10T02:00:00.000+02:00",
        "causeFin": "Reprise de l'exercice du mandat d'un ancien membre du Gouvernement",
        "premiereElection": "0",
        "placeHemicycle": "282"
      }
    },
    {
      "xsiType": "MandatSimple_Type",
      "uid": "PM701223",
      "acteurRef": "PA643205",
      "legislature": "14",
      "typeOrgane": "GP",
      "dateDebut": "2014-05-10T02:00:00.000+02:00",
      "datePublication": "2014-05-11T02:00:00.000+02:00",
      "dateFin": "2016-05-24T02:00:00.000+02:00",
      "preseance": "20",
      "nominPrincipale": "1",
      "infosQualite": {
        "codeQualite": "Membre",
        "libQualite": "Membre du",
        "libQualiteSex": "Membre du"
      },
      "organesRefs": [
        "PO656002"
      ]
    },
    {
      "xsiType": "MandatSimple_Type",
      "uid": "PM701262",
      "acteurRef": "PA643205",
      "legislature": "14",
      "typeOrgane": "COMPER",
      "dateDebut": "2014-05-14T02:00:00.000+02:00",
      "datePublication": "2014-05-14T02:00:00.000+02:00",
      "dateFin": "2016-07-12T02:00:00.000+02:00",
      "preseance": "32",
      "nominPrincipale": "1",
      "infosQualite": {
        "codeQualite": "Membre",
        "libQualite": "Membre",
        "libQualiteSex": "Membre"
      },
      "organesRefs": [
        "PO419604"
      ]
    },
    {
      "xsiType": "MandatSimple_Type",
      "uid": "PM705083",
      "acteurRef": "PA643205",
      "typeOrgane": "PARPOL",
      "dateDebut": "2014-12-01T01:00:00.000+01:00",
      "dateFin": "2017-06-20T02:00:00.000+02:00",
      "preseance": "5",
      "nominPrincipale": "1",
      "infosQualite": {
        "codeQualite": "Membre",
        "libQualite": "Membre",
        "libQualiteSex": "Membre"
      },
      "organesRefs": [
        "PO684932"
      ]
    },
    {
      "xsiType": "MandatMission_Type",
      "uid": "PM707416",
      "acteurRef": "PA643205",
      "legislature": "14",
      "typeOrgane": "MISINFO",
      "dateDebut": "2014-12-17T01:00:00.000+01:00",
      "dateFin": "2015-07-08T02:00:00.000+02:00",
      "preseance": "10",
      "nominPrincipale": "1",
      "infosQualite": {
        "codeQualite": "Membre",
        "libQualite": "Membre",
        "libQualiteSex": "Membre"
      },
      "organesRefs": [
        "PO707403"
      ]
    },
    {
      "xsiType": "MandatMission_Type",
      "uid": "PM711228",
      "acteurRef": "PA643205",
      "legislature": "14",
      "typeOrgane": "MISINFO",
      "dateDebut": "2016-01-20T01:00:00.000+01:00",
      "dateFin": "2016-10-05T02:00:00.000+02:00",
      "preseance": "10",
      "nominPrincipale": "1",
      "infosQualite": {
        "codeQualite": "Membre",
        "libQualite": "Membre",
        "libQualiteSex": "Membre"
      },
      "organesRefs": [
        "PO711218"
      ]
    },
    {
      "xsiType": "MandatSimple_Type",
      "uid": "PM712698",
      "acteurRef": "PA643205",
      "legislature": "14",
      "typeOrgane": "CNPS",
      "dateDebut": "2016-05-05T02:00:00.000+02:00",
      "datePublication": "2016-05-05T02:00:00.000+02:00",
      "dateFin": "2017-02-20T01:00:00.000+01:00",
      "preseance": "20",
      "nominPrincipale": "1",
      "infosQualite": {
        "codeQualite": "Membre",
        "libQualite": "Membre",
        "libQualiteSex": "Membre"
      },
      "organesRefs": [
        "PO712376"
      ]
    },
    {
      "xsiType": "MandatSimple_Type",
      "uid": "PM712768",
      "acteurRef": "PA643205",
      "legislature": "14",
      "typeOrgane": "CNPS",
      "dateDebut": "2016-05-11T02:00:00.000+02:00",
      "datePublication": "2016-05-12T02:00:00.000+02:00",
      "dateFin": "2017-02-20T01:00:00.000+01:00",
      "preseance": "8",
      "nominPrincipale": "1",
      "infosQualite": {
        "codeQualite": "Vice-Président",
        "libQualite": "Vice-Président",
        "libQualiteSex": "Vice-Présidente"
      },
      "organesRefs": [
        "PO712376"
      ]
    },
    {
      "xsiType": "MandatSimple_Type",
      "uid": "PM713251",
      "acteurRef": "PA643205",
      "legislature": "14",
      "typeOrgane": "GP",
      "dateDebut": "2016-05-25T02:00:00.000+02:00",
      "dateFin": "2017-06-17T02:00:00.000+02:00",
      "preseance": "20",
      "nominPrincipale": "1",
      "infosQualite": {
        "codeQualite": "Membre",
        "libQualite": "Membre du",
        "libQualiteSex": "Membre du"
      },
      "organesRefs": [
        "PO713077"
      ]
    },
    {
      "xsiType": "MandatSimple_Type",
      "uid": "PM714344",
      "acteurRef": "PA643205",
      "legislature": "14",
      "typeOrgane": "COMPER",
      "dateDebut": "2016-07-13T02:00:00.000+02:00",
      "datePublication": "2016-07-13T02:00:00.000+02:00",
      "dateFin": "2016-07-13T02:00:00.000+02:00",
      "preseance": "32",
      "nominPrincipale": "1",
      "infosQualite": {
        "codeQualite": "Membre",
        "libQualite": "Membre",
        "libQualiteSex": "Membre"
      },
      "organesRefs": [
        "PO419610"
      ]
    },
    {
      "xsiType": "MandatSimple_Type",
      "uid": "PM714383",
      "acteurRef": "PA643205",
      "legislature": "14",
      "typeOrgane": "COMPER",
      "dateDebut": "2016-07-14T02:00:00.000+02:00",
      "datePublication": "2016-07-14T02:00:00.000+02:00",
      "dateFin": "2017-06-17T02:00:00.000+02:00",
      "preseance": "32",
      "nominPrincipale": "1",
      "infosQualite": {
        "codeQualite": "Membre",
        "libQualite": "Membre",
        "libQualiteSex": "Membre"
      },
      "organesRefs": [
        "PO419604"
      ]
    },
    {
      "xsiType": "MandatParlementaire_type",
      "uid": "PM723358",
      "acteurRef": "PA643205",
      "legislature": "15",
      "typeOrgane": "ASSEMBLEE",
      "dateDebut": "2017-06-18T02:00:00.000+02:00",
      "preseance": "50",
      "nominPrincipale": "1",
      "infosQualite": {
        "codeQualite": "membre",
        "libQualite": "membre",
        "libQualiteSex": "membre"
      },
      "organesRefs": [
        "PO717460"
      ],
      "suppleant": {
        "dateDebut": "2017-06-18T02:00:00.000+02:00",
        "suppleantRef": "PA721698"
      },
      "election": {
        "lieu": {
          "region": "Ile-de-France",
          "regionType": "Métropolitain",
          "departement": "Paris",
          "numDepartement": "75",
          "numCirco": "10"
        },
        "causeMandat": "élections générales",
        "refCirconscription": "PO718208"
      },
      "mandature": {
        "datePriseFonction": "2017-06-21T02:00:00.000+02:00",
        "premiereElection": "1",
        "placeHemicycle": "282"
      },
      "collaborateurs": [
        {
          "qualite": "M.",
          "prenom": "John",
          "nom": "Samingo"
        },
        {
          "qualite": "M.",
          "prenom": "Théo",
          "nom": "Tedeschi"
        },
        {
          "qualite": "M.",
          "prenom": "Florent",
          "nom": "Dussidour"
        }
      ]
    },
    {
      "xsiType": "MandatSimple_Type",
      "uid": "PM724720",
      "acteurRef": "PA643205",
      "legislature": "15",
      "typeOrgane": "GP",
      "dateDebut": "2017-06-21T02:00:00.000+02:00",
      "dateFin": "2017-06-26T02:00:00.000+02:00",
      "preseance": "28",
      "nominPrincipale": "1",
      "infosQualite": {
        "codeQualite": "Député non-inscrit",
        "libQualite": "Député non-inscrit",
        "libQualiteSex": "Députée non-inscrite"
      },
      "organesRefs": [
        "PO723569"
      ]
    },
    {
      "xsiType": "MandatSimple_Type",
      "uid": "PM731223",
      "acteurRef": "PA643205",
      "legislature": "15",
      "typeOrgane": "GP",
      "dateDebut": "2017-06-27T02:00:00.000+02:00",
      "datePublication": "2017-06-28T02:00:00.000+02:00",
      "preseance": "20",
      "nominPrincipale": "1",
      "infosQualite": {
        "codeQualite": "Membre",
        "libQualite": "Membre du",
        "libQualiteSex": "Membre du"
      },
      "organesRefs": [
        "PO730964"
      ]
    },
    {
      "xsiType": "MandatSimple_Type",
      "uid": "PM732193",
      "acteurRef": "PA643205",
      "legislature": "15",
      "typeOrgane": "COMPER",
      "dateDebut": "2017-06-29T02:00:00.000+02:00",
      "datePublication": "2017-06-29T02:00:00.000+02:00",
      "preseance": "32",
      "nominPrincipale": "1",
      "infosQualite": {
        "codeQualite": "Membre",
        "libQualite": "Membre",
        "libQualiteSex": "Membre"
      },
      "organesRefs": [
        "PO419604"
      ]
    },
    {
      "xsiType": "MandatSimple_Type",
      "uid": "PM739461",
      "acteurRef": "PA643205",
      "legislature": "15",
      "typeOrgane": "GA",
      "dateDebut": "2017-10-12T02:00:00.000+02:00",
      "preseance": "20",
      "nominPrincipale": "1",
      "infosQualite": {
        "codeQualite": "Membre",
        "libQualite": "Membre",
        "libQualiteSex": "Membre"
      },
      "organesRefs": [
        "PO732964"
      ]
    },
    {
      "xsiType": "MandatSimple_Type",
      "uid": "PM739462",
      "acteurRef": "PA643205",
      "legislature": "15",
      "typeOrgane": "GA",
      "dateDebut": "2017-10-12T02:00:00.000+02:00",
      "preseance": "20",
      "nominPrincipale": "1",
      "infosQualite": {
        "codeQualite": "Membre",
        "libQualite": "Membre",
        "libQualiteSex": "Membre"
      },
      "organesRefs": [
        "PO733137"
      ]
    },
    {
      "xsiType": "MandatSimple_Type",
      "uid": "PM739463",
      "acteurRef": "PA643205",
      "legislature": "15",
      "typeOrgane": "GA",
      "dateDebut": "2017-10-12T02:00:00.000+02:00",
      "preseance": "20",
      "nominPrincipale": "1",
      "infosQualite": {
        "codeQualite": "Membre",
        "libQualite": "Membre",
        "libQualiteSex": "Membre"
      },
      "organesRefs": [
        "PO733292"
      ]
    },
    {
      "xsiType": "MandatSimple_Type",
      "uid": "PM739464",
      "acteurRef": "PA643205",
      "legislature": "15",
      "typeOrgane": "GA",
      "dateDebut": "2017-10-12T02:00:00.000+02:00",
      "preseance": "20",
      "nominPrincipale": "1",
      "infosQualite": {
        "codeQualite": "Membre",
        "libQualite": "Membre",
        "libQualiteSex": "Membre"
      },
      "organesRefs": [
        "PO733532"
      ]
    },
    {
      "xsiType": "MandatSimple_Type",
      "uid": "PM739465",
      "acteurRef": "PA643205",
      "legislature": "15",
      "typeOrgane": "GA",
      "dateDebut": "2017-10-12T02:00:00.000+02:00",
      "preseance": "20",
      "nominPrincipale": "1",
      "infosQualite": {
        "codeQualite": "Membre",
        "libQualite": "Membre",
        "libQualiteSex": "Membre"
      },
      "organesRefs": [
        "PO733562"
      ]
    },
    {
      "xsiType": "MandatSimple_Type",
      "uid": "PM739466",
      "acteurRef": "PA643205",
      "legislature": "15",
      "typeOrgane": "GA",
      "dateDebut": "2017-10-12T02:00:00.000+02:00",
      "preseance": "20",
      "nominPrincipale": "1",
      "infosQualite": {
        "codeQualite": "Membre",
        "libQualite": "Membre",
        "libQualiteSex": "Membre"
      },
      "organesRefs": [
        "PO733567"
      ]
    },
    {
      "xsiType": "MandatSimple_Type",
      "uid": "PM739467",
      "acteurRef": "PA643205",
      "legislature": "15",
      "typeOrgane": "GA",
      "dateDebut": "2017-10-12T02:00:00.000+02:00",
      "preseance": "20",
      "nominPrincipale": "1",
      "infosQualite": {
        "codeQualite": "Membre",
        "libQualite": "Membre",
        "libQualiteSex": "Membre"
      },
      "organesRefs": [
        "PO733597"
      ]
    },
    {
      "xsiType": "MandatSimple_Type",
      "uid": "PM739468",
      "acteurRef": "PA643205",
      "legislature": "15",
      "typeOrgane": "GA",
      "dateDebut": "2017-10-12T02:00:00.000+02:00",
      "preseance": "20",
      "nominPrincipale": "1",
      "infosQualite": {
        "codeQualite": "Membre",
        "libQualite": "Membre",
        "libQualiteSex": "Membre"
      },
      "organesRefs": [
        "PO733617"
      ]
    },
    {
      "xsiType": "MandatSimple_Type",
      "uid": "PM739469",
      "acteurRef": "PA643205",
      "legislature": "15",
      "typeOrgane": "GA",
      "dateDebut": "2017-10-12T02:00:00.000+02:00",
      "preseance": "20",
      "nominPrincipale": "1",
      "infosQualite": {
        "codeQualite": "Membre",
        "libQualite": "Membre",
        "libQualiteSex": "Membre"
      },
      "organesRefs": [
        "PO733652"
      ]
    },
    {
      "xsiType": "MandatSimple_Type",
      "uid": "PM739470",
      "acteurRef": "PA643205",
      "legislature": "15",
      "typeOrgane": "GA",
      "dateDebut": "2017-10-12T02:00:00.000+02:00",
      "preseance": "20",
      "nominPrincipale": "1",
      "infosQualite": {
        "codeQualite": "Membre",
        "libQualite": "Membre",
        "libQualiteSex": "Membre"
      },
      "organesRefs": [
        "PO733703"
      ]
    },
    {
      "xsiType": "MandatMission_Type",
      "uid": "PM741956",
      "acteurRef": "PA643205",
      "legislature": "15",
      "typeOrgane": "MISINFO",
      "dateDebut": "2017-09-27T02:00:00.000+02:00",
      "preseance": "10",
      "nominPrincipale": "1",
      "infosQualite": {
        "codeQualite": "Membre",
        "libQualite": "Membre",
        "libQualiteSex": "Membre"
      },
      "organesRefs": [
        "PO741916"
      ]
    },
    {
      "xsiType": "MandatSimple_Type",
      "uid": "PM743723",
      "acteurRef": "PA643205",
      "legislature": "15",
      "typeOrgane": "ORGEXTPARL",
      "dateDebut": "2017-11-21T01:00:00.000+01:00",
      "datePublication": "2017-11-22T01:00:00.000+01:00",
      "preseance": "20",
      "nominPrincipale": "1",
      "infosQualite": {
        "codeQualite": "Titulaire",
        "libQualite": "Membre titulaire",
        "libQualiteSex": "Membre titulaire"
      },
      "organesRefs": [
        "PO322345"
      ]
    },
    {
      "xsiType": "MandatSimple_Type",
      "uid": "PM743756",
      "acteurRef": "PA643205",
      "legislature": "15",
      "typeOrgane": "ORGEXTPARL",
      "dateDebut": "2017-11-09T01:00:00.000+01:00",
      "datePublication": "2017-11-10T01:00:00.000+01:00",
      "preseance": "20",
      "nominPrincipale": "1",
      "infosQualite": {
        "codeQualite": "Titulaire",
        "libQualite": "Membre titulaire",
        "libQualiteSex": "Membre titulaire"
      },
      "organesRefs": [
        "PO677769"
      ]
    },
    {
      "xsiType": "MandatSimple_Type",
      "uid": "PM745151",
      "acteurRef": "PA643205",
      "typeOrgane": "PARPOL",
      "dateDebut": "2017-12-01T01:00:00.000+01:00",
      "dateFin": "2018-11-30T01:00:00.000+01:00",
      "preseance": "5",
      "nominPrincipale": "1",
      "infosQualite": {
        "codeQualite": "Membre",
        "libQualite": "Membre",
        "libQualiteSex": "Membre"
      },
      "organesRefs": [
        "PO744854"
      ]
    },
    {
      "xsiType": "MandatMission_Type",
      "uid": "PM748322",
      "acteurRef": "PA643205",
      "legislature": "15",
      "typeOrgane": "MISINFO",
      "dateDebut": "2018-01-31T01:00:00.000+01:00",
      "dateFin": "2018-11-15T01:00:00.000+01:00",
      "preseance": "10",
      "nominPrincipale": "1",
      "infosQualite": {
        "codeQualite": "Membre",
        "libQualite": "Membre",
        "libQualiteSex": "Membre"
      },
      "organesRefs": [
        "PO748305"
      ]
    },
    {
      "xsiType": "MandatSimple_Type",
      "uid": "PM749365",
      "acteurRef": "PA643205",
      "legislature": "15",
      "typeOrgane": "CMP",
      "dateDebut": "2018-02-12T01:00:00.000+01:00",
      "datePublication": "2018-02-10T01:00:00.000+01:00",
      "dateFin": "2018-02-15T01:00:00.000+01:00",
      "preseance": "28",
      "nominPrincipale": "1",
      "infosQualite": {
        "codeQualite": "Suppléant",
        "libQualite": "Membre suppléant",
        "libQualiteSex": "Membre suppléante"
      },
      "organesRefs": [
        "PO749252"
      ]
    },
    {
      "xsiType": "MandatSimple_Type",
      "uid": "PM755016",
      "acteurRef": "PA643205",
      "legislature": "15",
      "typeOrgane": "GE",
      "dateDebut": "2018-04-03T02:00:00.000+02:00",
      "preseance": "20",
      "nominPrincipale": "0",
      "infosQualite": {
        "codeQualite": "Membre",
        "libQualite": "Membre",
        "libQualiteSex": "Membre"
      },
      "organesRefs": [
        "PO746842"
      ]
    },
    {
      "xsiType": "MandatSimple_Type",
      "uid": "PM756101",
      "acteurRef": "PA643205",
      "legislature": "15",
      "typeOrgane": "GE",
      "dateDebut": "2018-05-15T02:00:00.000+02:00",
      "preseance": "8",
      "nominPrincipale": "1",
      "infosQualite": {
        "codeQualite": "Vice-Président",
        "libQualite": "Vice-Président",
        "libQualiteSex": "Vice-Présidente"
      },
      "organesRefs": [
        "PO746842"
      ]
    },
    {
      "xsiType": "MandatSimple_Type",
      "uid": "PM765602",
      "acteurRef": "PA643205",
      "legislature": "15",
      "typeOrgane": "CMP",
      "dateDebut": "2019-06-06T02:00:00.000+02:00",
      "datePublication": "2019-06-07T02:00:00.000+02:00",
      "dateFin": "2019-07-04T02:00:00.000+02:00",
      "preseance": "20",
      "nominPrincipale": "1",
      "infosQualite": {
        "codeQualite": "Titulaire",
        "libQualite": "Membre titulaire",
        "libQualiteSex": "Membre titulaire"
      },
      "organesRefs": [
        "PO765254"
      ]
    },
    {
      "xsiType": "MandatSimple_Type",
      "uid": "PM765768",
      "acteurRef": "PA643205",
      "legislature": "15",
      "typeOrgane": "CMP",
      "dateDebut": "2019-06-13T02:00:00.000+02:00",
      "datePublication": "2019-06-14T02:00:00.000+02:00",
      "dateFin": "2019-07-04T02:00:00.000+02:00",
      "preseance": "16",
      "nominPrincipale": "1",
      "infosQualite": {
        "codeQualite": "Rapporteur",
        "libQualite": "Rapporteur",
        "libQualiteSex": "Rapporteure"
      },
      "organesRefs": [
        "PO765254"
      ]
    },
    {
      "xsiType": "MandatSimple_Type",
      "uid": "PM766792",
      "acteurRef": "PA643205",
      "legislature": "15",
      "typeOrgane": "CNPS",
      "dateDebut": "2019-07-24T02:00:00.000+02:00",
      "datePublication": "2019-07-25T02:00:00.000+02:00",
      "preseance": "20",
      "nominPrincipale": "1",
      "infosQualite": {
        "codeQualite": "Membre",
        "libQualite": "Membre",
        "libQualiteSex": "Membre"
      },
      "organesRefs": [
        "PO766718"
      ]
    }
  ]
}