{
  "uid": "PO322372",
  "codeType": "CMP",
  "libelle": "Commission mixte paritaire sur le projet de loi pour l'égalité des chances",
  "libelleEdition": "sur le projet de loi pour l'égalité des chances",
  "libelleAbrege": "CMP égalité des chances",
  "libelleAbrev": "2787",
  "viMoDe": {
    "dateDebut": "2006-03-06T01:00:00.000+01:00",
    "dateFin": "2006-03-07T01:00:00.000+01:00"
  },
  "regime": "5ème République",
  "legislature": "12",
  "secretariat": {}
}