{
  "uid": "PO767517",
  "codeType": "CNPE",
  "libelle": "Commission d'enquête chargée de faire la lumière sur les dysfonctionnements ayant conduit aux attaques commises à la préfecture de police de Paris le jeudi 3 octobre 2019",
  "libelleEdition": "de la commission d'enquête chargée de faire la lumière sur les dysfonctionnements ayant conduit aux attaques commises à la préfecture de police de Paris le jeudi 3 octobre 2019",
  "libelleAbrege": "Commission d'enquête sur les attaques à la préfecture de police de Paris",
  "libelleAbrev": "CEPREFPOL",
  "viMoDe": {
    "dateDebut": "2019-10-15T02:00:00.000+02:00"
  },
  "regime": "5ème République",
  "legislature": "15",
  "secretariat": {}
}