{
  "uid": "PO425808",
  "codeType": "CMP",
  "libelle": "Commission mixte paritaire chargée de proposer un texte sur les dispositions restant en discussion du projet de loi de financement de la sécurité sociale pour 2011",
  "libelleEdition": "projet de loi de financement de la sécurité sociale pour 2011",
  "libelleAbrege": "Financement de la sécurité sociale pour 2011",
  "libelleAbrev": "PLFSS2011",
  "viMoDe": {
    "dateDebut": "2010-11-17T01:00:00.000+01:00",
    "dateFin": "2010-11-25T01:00:00.000+01:00"
  },
  "regime": "5ème République",
  "legislature": "13",
  "secretariat": {}
}