{
  "uid": "PO216511",
  "codeType": "CMP",
  "libelle": "Projet de loi relatif à l' élection des sénateurs",
  "libelleEdition": "sur le projet de loi relatif à l' élection des sénateurs",
  "libelleAbrege": "Election des sénateurs",
  "libelleAbrev": "260-98/99",
  "viMoDe": {
    "dateDebut": "2000-04-25T02:00:00.000+02:00",
    "dateFin": "2000-05-17T02:00:00.000+02:00"
  },
  "regime": "5ème République",
  "legislature": "11",
  "secretariat": {}
}