{
  "uid": "PA719540",
  "etatCivil": {
    "ident": {
      "civ": "Mme",
      "prenom": "Élisabeth",
      "nom": "Toutut-Picard",
      "alpha": "ToututPicard",
      "trigramme": "ETO"
    },
    "infoNaissance": {
      "dateNais": "1954-12-17T01:00:00.000+01:00",
      "villeNais": "Blida",
      "paysNais": "Algérie"
    }
  },
  "profession": {
    "libelleCourant": "Fonctionnaire de catégorie A",
    "socProcInsee": {
      "catSocPro": "Cadres de la fonction publique, professions intellectuelles et  artistiques",
      "famSocPro": "Cadres et professions intellectuelles supérieures"
    }
  },
  "uriHatvp": "https://www.hatvp.fr/pages_nominatives/toutut-picard-elisabeth",
  "adresses": [
    {
      "xsiType": "AdressePostale_Type",
      "uid": "AD719542",
      "type": "0",
      "typeLibelle": "Adresse officielle",
      "poids": "1",
      "intitule": "Assemblée nationale,",
      "numeroRue": "126",
      "nomRue": "Rue de l'Université,",
      "codePostal": "75355",
      "ville": "Paris 07 SP"
    },
    {
      "xsiType": "AdresseMail_Type",
      "uid": "AD726062",
      "type": "15",
      "typeLibelle": "Mèl",
      "valElec": "contact@etp31.fr"
    },
    {
      "xsiType": "AdresseSiteWeb_Type",
      "uid": "AD726342",
      "type": "24",
      "typeLibelle": "Twitter",
      "valElec": "@etoututpicard"
    },
    {
      "xsiType": "AdresseSiteWeb_Type",
      "uid": "AD726378",
      "type": "22",
      "typeLibelle": "Site internet",
      "valElec": "www.elisabeth-toutut-picard.fr"
    },
    {
      "xsiType": "AdresseSiteWeb_Type",
      "uid": "AD726590",
      "type": "25",
      "typeLibelle": "Facebook",
      "valElec": "Toutut-Picard"
    },
    {
      "xsiType": "AdresseMail_Type",
      "uid": "AD728051",
      "type": "15",
      "typeLibelle": "Mèl",
      "valElec": "elisabeth.toutut-picard@assemblee-nationale.fr"
    },
    {
      "xsiType": "AdressePostale_Type",
      "uid": "AD756909",
      "type": "2",
      "typeLibelle": "Adresse publiée de circonscription",
      "poids": "22",
      "intitule": "Résidence Belles Rives",
      "numeroRue": "8",
      "nomRue": "Rue de l'Abbé Breuil",
      "complementAdresse": "Appartement 18 - Bâtiment A",
      "codePostal": "31600",
      "ville": "Muret"
    },
    {
      "xsiType": "AdresseTelephonique_Type",
      "uid": "AD756911",
      "type": "11",
      "typeLibelle": "Téléphone",
      "poids": "22",
      "adresseDeRattachement": "AD756909",
      "valElec": "05 34 51 67 70"
    }
  ],
  "mandats": [
    {
      "xsiType": "MandatParlementaire_type",
      "uid": "PM722690",
      "acteurRef": "PA719540",
      "legislature": "15",
      "typeOrgane": "ASSEMBLEE",
      "dateDebut": "2017-06-18T02:00:00.000+02:00",
      "preseance": "50",
      "nominPrincipale": "1",
      "infosQualite": {
        "codeQualite": "membre",
        "libQualite": "membre",
        "libQualiteSex": "membre"
      },
      "organesRefs": [
        "PO717460"
      ],
      "suppleant": {
        "dateDebut": "2017-06-18T02:00:00.000+02:00",
        "suppleantRef": "PA341853"
      },
      "election": {
        "lieu": {
          "region": "Occitanie",
          "regionType": "Métropolitain",
          "departement": "Haute-Garonne",
          "numDepartement": "31",
          "numCirco": "7"
        },
        "causeMandat": "élections générales",
        "refCirconscription": "PO717750"
      },
      "mandature": {
        "datePriseFonction": "2017-06-21T02:00:00.000+02:00",
        "premiereElection": "0",
        "placeHemicycle": "331"
      },
      "collaborateurs": [
        {
          "qualite": "Mme",
          "prenom": "Anne-Laure",
          "nom": "Labouesse"
        },
        {
          "qualite": "Mme",
          "prenom": "Karine",
          "nom": "Brun"
        },
        {
          "qualite": "M.",
          "prenom": "Gaëtan",
          "nom": "Metzger"
        },
        {
          "qualite": "M.",
          "prenom": "Pascal",
          "nom": "De Rauglaudre"
        }
      ]
    },
    {
      "xsiType": "MandatSimple_Type",
      "uid": "PM724386",
      "acteurRef": "PA719540",
      "legislature": "15",
      "typeOrgane": "GP",
      "dateDebut": "2017-06-21T02:00:00.000+02:00",
      "dateFin": "2017-06-26T02:00:00.000+02:00",
      "preseance": "28",
      "nominPrincipale": "1",
      "infosQualite": {
        "codeQualite": "Député non-inscrit",
        "libQualite": "Député non-inscrit",
        "libQualiteSex": "Députée non-inscrite"
      },
      "organesRefs": [
        "PO723569"
      ]
    },
    {
      "xsiType": "MandatSimple_Type",
      "uid": "PM731056",
      "acteurRef": "PA719540",
      "legislature": "15",
      "typeOrgane": "GP",
      "dateDebut": "2017-06-27T02:00:00.000+02:00",
      "datePublication": "2017-06-28T02:00:00.000+02:00",
      "preseance": "20",
      "nominPrincipale": "1",
      "infosQualite": {
        "codeQualite": "Membre",
        "libQualite": "Membre du",
        "libQualiteSex": "Membre du"
      },
      "organesRefs": [
        "PO730964"
      ]
    },
    {
      "xsiType": "MandatSimple_Type",
      "uid": "PM732066",
      "acteurRef": "PA719540",
      "legislature": "15",
      "typeOrgane": "COMPER",
      "dateDebut": "2017-06-29T02:00:00.000+02:00",
      "datePublication": "2017-06-29T02:00:00.000+02:00",
      "dateFin": "2019-09-30T02:00:00.000+02:00",
      "preseance": "32",
      "nominPrincipale": "1",
      "infosQualite": {
        "codeQualite": "Membre",
        "libQualite": "Membre",
        "libQualiteSex": "Membre"
      },
      "organesRefs": [
        "PO420120"
      ]
    },
    {
      "xsiType": "MandatSimple_Type",
      "uid": "PM732261",
      "acteurRef": "PA719540",
      "legislature": "15",
      "typeOrgane": "COMPER",
      "dateDebut": "2017-06-30T02:00:00.000+02:00",
      "datePublication": "2017-06-30T02:00:00.000+02:00",
      "dateFin": "2019-09-30T02:00:00.000+02:00",
      "preseance": "16",
      "nominPrincipale": "1",
      "infosQualite": {
        "codeQualite": "Secrétaire",
        "libQualite": "Secrétaire",
        "libQualiteSex": "Secrétaire"
      },
      "organesRefs": [
        "PO420120"
      ]
    },
    {
      "xsiType": "MandatMission_Type",
      "uid": "PM732873",
      "acteurRef": "PA719540",
      "legislature": "15",
      "typeOrgane": "MISINFO",
      "dateDebut": "2017-07-20T02:00:00.000+02:00",
      "datePublication": "2017-07-20T02:00:00.000+02:00",
      "preseance": "10",
      "nominPrincipale": "1",
      "infosQualite": {
        "codeQualite": "Membre",
        "libQualite": "Membre",
        "libQualiteSex": "Membre"
      },
      "organesRefs": [
        "PO732866"
      ]
    },
    {
      "xsiType": "MandatSimple_Type",
      "uid": "PM735976",
      "acteurRef": "PA719540",
      "legislature": "15",
      "typeOrgane": "GA",
      "dateDebut": "2017-09-29T02:00:00.000+02:00",
      "preseance": "20",
      "nominPrincipale": "1",
      "infosQualite": {
        "codeQualite": "Membre",
        "libQualite": "Membre",
        "libQualiteSex": "Membre"
      },
      "organesRefs": [
        "PO733072"
      ]
    },
    {
      "xsiType": "MandatSimple_Type",
      "uid": "PM735977",
      "acteurRef": "PA719540",
      "legislature": "15",
      "typeOrgane": "GA",
      "dateDebut": "2017-09-29T02:00:00.000+02:00",
      "preseance": "20",
      "nominPrincipale": "1",
      "infosQualite": {
        "codeQualite": "Membre",
        "libQualite": "Membre",
        "libQualiteSex": "Membre"
      },
      "organesRefs": [
        "PO733132"
      ]
    },
    {
      "xsiType": "MandatSimple_Type",
      "uid": "PM735978",
      "acteurRef": "PA719540",
      "legislature": "15",
      "typeOrgane": "GA",
      "dateDebut": "2017-09-29T02:00:00.000+02:00",
      "preseance": "20",
      "nominPrincipale": "1",
      "infosQualite": {
        "codeQualite": "Membre",
        "libQualite": "Membre",
        "libQualiteSex": "Membre"
      },
      "organesRefs": [
        "PO733307"
      ]
    },
    {
      "xsiType": "MandatSimple_Type",
      "uid": "PM735979",
      "acteurRef": "PA719540",
      "legislature": "15",
      "typeOrgane": "GA",
      "dateDebut": "2017-09-29T02:00:00.000+02:00",
      "preseance": "20",
      "nominPrincipale": "1",
      "infosQualite": {
        "codeQualite": "Membre",
        "libQualite": "Membre",
        "libQualiteSex": "Membre"
      },
      "organesRefs": [
        "PO733417"
      ]
    },
    {
      "xsiType": "MandatSimple_Type",
      "uid": "PM735980",
      "acteurRef": "PA719540",
      "legislature": "15",
      "typeOrgane": "GA",
      "dateDebut": "2017-09-29T02:00:00.000+02:00",
      "preseance": "20",
      "nominPrincipale": "0",
      "infosQualite": {
        "codeQualite": "Membre",
        "libQualite": "Membre",
        "libQualiteSex": "Membre"
      },
      "organesRefs": [
        "PO733472"
      ]
    },
    {
      "xsiType": "MandatSimple_Type",
      "uid": "PM735981",
      "acteurRef": "PA719540",
      "legislature": "15",
      "typeOrgane": "GA",
      "dateDebut": "2017-09-29T02:00:00.000+02:00",
      "preseance": "20",
      "nominPrincipale": "0",
      "infosQualite": {
        "codeQualite": "Membre",
        "libQualite": "Membre",
        "libQualiteSex": "Membre"
      },
      "organesRefs": [
        "PO733492"
      ]
    },
    {
      "xsiType": "MandatSimple_Type",
      "uid": "PM740437",
      "acteurRef": "PA719540",
      "legislature": "15",
      "typeOrgane": "GA",
      "dateDebut": "2017-10-17T02:00:00.000+02:00",
      "preseance": "20",
      "nominPrincipale": "1",
      "infosQualite": {
        "codeQualite": "Membre",
        "libQualite": "Membre",
        "libQualiteSex": "Membre"
      },
      "organesRefs": [
        "PO732979"
      ]
    },
    {
      "xsiType": "MandatMission_Type",
      "uid": "PM740548",
      "acteurRef": "PA719540",
      "legislature": "15",
      "typeOrgane": "MISINFOCOM",
      "dateDebut": "2017-10-18T02:00:00.000+02:00",
      "datePublication": "2017-10-19T02:00:00.000+02:00",
      "dateFin": "2018-04-06T02:00:00.000+02:00",
      "preseance": "20",
      "nominPrincipale": "1",
      "infosQualite": {
        "codeQualite": "Membre",
        "libQualite": "Membre",
        "libQualiteSex": "Membre"
      },
      "organesRefs": [
        "PO740454"
      ]
    },
    {
      "xsiType": "MandatMission_Type",
      "uid": "PM741998",
      "acteurRef": "PA719540",
      "legislature": "15",
      "typeOrgane": "MISINFOCOM",
      "dateDebut": "2017-10-26T02:00:00.000+02:00",
      "datePublication": "2017-10-27T02:00:00.000+02:00",
      "dateFin": "2018-04-06T02:00:00.000+02:00",
      "preseance": "1",
      "nominPrincipale": "1",
      "infosQualite": {
        "codeQualite": "Président",
        "libQualite": "Président",
        "libQualiteSex": "Présidente"
      },
      "organesRefs": [
        "PO740454"
      ]
    },
    {
      "xsiType": "MandatSimple_Type",
      "uid": "PM743486",
      "acteurRef": "PA719540",
      "legislature": "15",
      "typeOrgane": "GA",
      "dateDebut": "2017-11-15T01:00:00.000+01:00",
      "preseance": "8",
      "nominPrincipale": "1",
      "infosQualite": {
        "codeQualite": "Vice-Président",
        "libQualite": "Vice-Président",
        "libQualiteSex": "Vice-Présidente"
      },
      "organesRefs": [
        "PO733492"
      ]
    },
    {
      "xsiType": "MandatSimple_Type",
      "uid": "PM744529",
      "acteurRef": "PA719540",
      "legislature": "15",
      "typeOrgane": "GA",
      "dateDebut": "2017-11-30T01:00:00.000+01:00",
      "preseance": "8",
      "nominPrincipale": "1",
      "infosQualite": {
        "codeQualite": "Vice-Président",
        "libQualite": "Vice-Président",
        "libQualiteSex": "Vice-Présidente"
      },
      "organesRefs": [
        "PO733472"
      ]
    },
    {
      "xsiType": "MandatSimple_Type",
      "uid": "PM744560",
      "acteurRef": "PA719540",
      "legislature": "15",
      "typeOrgane": "CMP",
      "dateDebut": "2017-11-30T01:00:00.000+01:00",
      "datePublication": "2017-12-01T01:00:00.000+01:00",
      "dateFin": "2017-12-20T01:00:00.000+01:00",
      "preseance": "28",
      "nominPrincipale": "1",
      "infosQualite": {
        "codeQualite": "Suppléant",
        "libQualite": "Membre suppléant",
        "libQualiteSex": "Membre suppléante"
      },
      "organesRefs": [
        "PO739840"
      ]
    },
    {
      "xsiType": "MandatSimple_Type",
      "uid": "PM744579",
      "acteurRef": "PA719540",
      "legislature": "15",
      "typeOrgane": "CMP",
      "dateDebut": "2017-11-30T01:00:00.000+01:00",
      "datePublication": "2017-12-01T01:00:00.000+01:00",
      "dateFin": "2018-02-15T01:00:00.000+01:00",
      "preseance": "20",
      "nominPrincipale": "1",
      "infosQualite": {
        "codeQualite": "Titulaire",
        "libQualite": "Membre titulaire",
        "libQualiteSex": "Membre titulaire"
      },
      "organesRefs": [
        "PO739847"
      ]
    },
    {
      "xsiType": "MandatSimple_Type",
      "uid": "PM744820",
      "acteurRef": "PA719540",
      "legislature": "15",
      "typeOrgane": "CMP",
      "dateDebut": "2017-12-05T01:00:00.000+01:00",
      "datePublication": "2017-12-06T01:00:00.000+01:00",
      "dateFin": "2018-02-15T01:00:00.000+01:00",
      "preseance": "16",
      "nominPrincipale": "1",
      "infosQualite": {
        "codeQualite": "Rapporteur",
        "libQualite": "Rapporteur",
        "libQualiteSex": "Rapporteure"
      },
      "organesRefs": [
        "PO739847"
      ]
    },
    {
      "xsiType": "MandatSimple_Type",
      "uid": "PM745451",
      "acteurRef": "PA719540",
      "typeOrgane": "PARPOL",
      "dateDebut": "2017-12-01T01:00:00.000+01:00",
      "dateFin": "2018-11-30T01:00:00.000+01:00",
      "preseance": "5",
      "nominPrincipale": "1",
      "infosQualite": {
        "codeQualite": "Membre",
        "libQualite": "Membre",
        "libQualiteSex": "Membre"
      },
      "organesRefs": [
        "PO744854"
      ]
    },
    {
      "xsiType": "MandatSimple_Type",
      "uid": "PM747465",
      "acteurRef": "PA719540",
      "legislature": "15",
      "typeOrgane": "ORGEXTPARL",
      "dateDebut": "2017-12-21T01:00:00.000+01:00",
      "datePublication": "2017-12-22T01:00:00.000+01:00",
      "preseance": "20",
      "nominPrincipale": "1",
      "infosQualite": {
        "codeQualite": "Titulaire",
        "libQualite": "Membre titulaire",
        "libQualiteSex": "Membre titulaire"
      },
      "organesRefs": [
        "PO709202"
      ]
    },
    {
      "xsiType": "MandatSimple_Type",
      "uid": "PM749421",
      "acteurRef": "PA719540",
      "legislature": "15",
      "typeOrgane": "GE",
      "dateDebut": "2018-02-12T01:00:00.000+01:00",
      "preseance": "20",
      "nominPrincipale": "0",
      "infosQualite": {
        "codeQualite": "Membre",
        "libQualite": "Membre",
        "libQualiteSex": "Membre"
      },
      "organesRefs": [
        "PO746925"
      ]
    },
    {
      "xsiType": "MandatSimple_Type",
      "uid": "PM752057",
      "acteurRef": "PA719540",
      "legislature": "15",
      "typeOrgane": "GE",
      "dateDebut": "2018-02-26T01:00:00.000+01:00",
      "preseance": "20",
      "nominPrincipale": "1",
      "infosQualite": {
        "codeQualite": "Membre",
        "libQualite": "Membre",
        "libQualiteSex": "Membre"
      },
      "organesRefs": [
        "PO746857"
      ]
    },
    {
      "xsiType": "MandatSimple_Type",
      "uid": "PM752058",
      "acteurRef": "PA719540",
      "legislature": "15",
      "typeOrgane": "GE",
      "dateDebut": "2018-02-26T01:00:00.000+01:00",
      "preseance": "20",
      "nominPrincipale": "1",
      "infosQualite": {
        "codeQualite": "Membre",
        "libQualite": "Membre",
        "libQualiteSex": "Membre"
      },
      "organesRefs": [
        "PO746977"
      ]
    },
    {
      "xsiType": "MandatSimple_Type",
      "uid": "PM752087",
      "acteurRef": "PA719540",
      "legislature": "15",
      "typeOrgane": "GE",
      "dateDebut": "2018-02-27T01:00:00.000+01:00",
      "preseance": "20",
      "nominPrincipale": "1",
      "infosQualite": {
        "codeQualite": "Membre",
        "libQualite": "Membre",
        "libQualiteSex": "Membre"
      },
      "organesRefs": [
        "PO746618"
      ]
    },
    {
      "xsiType": "MandatSimple_Type",
      "uid": "PM752236",
      "acteurRef": "PA719540",
      "legislature": "15",
      "typeOrgane": "GE",
      "dateDebut": "2018-03-03T01:00:00.000+01:00",
      "preseance": "20",
      "nominPrincipale": "1",
      "infosQualite": {
        "codeQualite": "Membre",
        "libQualite": "Membre",
        "libQualiteSex": "Membre"
      },
      "organesRefs": [
        "PO747185"
      ]
    },
    {
      "xsiType": "MandatSimple_Type",
      "uid": "PM752448",
      "acteurRef": "PA719540",
      "legislature": "15",
      "typeOrgane": "GE",
      "dateDebut": "2018-02-26T01:00:00.000+01:00",
      "preseance": "20",
      "nominPrincipale": "1",
      "infosQualite": {
        "codeQualite": "Membre",
        "libQualite": "Membre",
        "libQualiteSex": "Membre"
      },
      "organesRefs": [
        "PO747027"
      ]
    },
    {
      "xsiType": "MandatSimple_Type",
      "uid": "PM752763",
      "acteurRef": "PA719540",
      "legislature": "15",
      "typeOrgane": "GE",
      "dateDebut": "2018-03-07T01:00:00.000+01:00",
      "preseance": "20",
      "nominPrincipale": "1",
      "infosQualite": {
        "codeQualite": "Membre",
        "libQualite": "Membre",
        "libQualiteSex": "Membre"
      },
      "organesRefs": [
        "PO747140"
      ]
    },
    {
      "xsiType": "MandatSimple_Type",
      "uid": "PM753742",
      "acteurRef": "PA719540",
      "legislature": "15",
      "typeOrgane": "GE",
      "dateDebut": "2018-03-14T01:00:00.000+01:00",
      "preseance": "12",
      "nominPrincipale": "1",
      "infosQualite": {
        "codeQualite": "Secrétaire",
        "libQualite": "Secrétaire",
        "libQualiteSex": "Secrétaire"
      },
      "organesRefs": [
        "PO746925"
      ]
    },
    {
      "xsiType": "MandatSimple_Type",
      "uid": "PM753855",
      "acteurRef": "PA719540",
      "legislature": "15",
      "typeOrgane": "GE",
      "dateDebut": "2018-03-20T01:00:00.000+01:00",
      "preseance": "20",
      "nominPrincipale": "1",
      "infosQualite": {
        "codeQualite": "Membre",
        "libQualite": "Membre",
        "libQualiteSex": "Membre"
      },
      "organesRefs": [
        "PO747084"
      ]
    },
    {
      "xsiType": "MandatSimple_Type",
      "uid": "PM755375",
      "acteurRef": "PA719540",
      "legislature": "15",
      "typeOrgane": "GE",
      "dateDebut": "2018-04-11T02:00:00.000+02:00",
      "preseance": "20",
      "nominPrincipale": "1",
      "infosQualite": {
        "codeQualite": "Membre",
        "libQualite": "Membre",
        "libQualiteSex": "Membre"
      },
      "organesRefs": [
        "PO747052"
      ]
    },
    {
      "xsiType": "MandatSimple_Type",
      "uid": "PM755432",
      "acteurRef": "PA719540",
      "legislature": "15",
      "typeOrgane": "CNPE",
      "dateDebut": "2018-04-14T02:00:00.000+02:00",
      "datePublication": "2018-04-14T02:00:00.000+02:00",
      "dateFin": "2018-09-28T02:00:00.000+02:00",
      "preseance": "20",
      "nominPrincipale": "1",
      "infosQualite": {
        "codeQualite": "Membre",
        "libQualite": "Membre",
        "libQualiteSex": "Membre"
      },
      "organesRefs": [
        "PO754360"
      ]
    },
    {
      "xsiType": "MandatSimple_Type",
      "uid": "PM755738",
      "acteurRef": "PA719540",
      "legislature": "15",
      "typeOrgane": "CNPE",
      "dateDebut": "2018-04-18T02:00:00.000+02:00",
      "datePublication": "2018-04-20T02:00:00.000+02:00",
      "dateFin": "2018-09-28T02:00:00.000+02:00",
      "preseance": "8",
      "nominPrincipale": "1",
      "infosQualite": {
        "codeQualite": "Vice-Président",
        "libQualite": "Vice-Président",
        "libQualiteSex": "Vice-Présidente"
      },
      "organesRefs": [
        "PO754360"
      ]
    },
    {
      "xsiType": "MandatSimple_Type",
      "uid": "PM758731",
      "acteurRef": "PA719540",
      "legislature": "15",
      "typeOrgane": "GA",
      "dateDebut": "2018-07-25T02:00:00.000+02:00",
      "dateFin": "2019-03-06T01:00:00.000+01:00",
      "preseance": "8",
      "nominPrincipale": "1",
      "infosQualite": {
        "codeQualite": "Vice-Président",
        "libQualite": "Vice-Président",
        "libQualiteSex": "Vice-Présidente"
      },
      "organesRefs": [
        "PO732979"
      ]
    },
    {
      "xsiType": "MandatSimple_Type",
      "uid": "PM758773",
      "acteurRef": "PA719540",
      "legislature": "15",
      "typeOrgane": "GE",
      "dateDebut": "2018-09-03T02:00:00.000+02:00",
      "preseance": "20",
      "nominPrincipale": "0",
      "infosQualite": {
        "codeQualite": "Membre",
        "libQualite": "Membre",
        "libQualiteSex": "Membre"
      },
      "organesRefs": [
        "PO747235"
      ]
    },
    {
      "xsiType": "MandatSimple_Type",
      "uid": "PM758775",
      "acteurRef": "PA719540",
      "legislature": "15",
      "typeOrgane": "GE",
      "dateDebut": "2018-09-03T02:00:00.000+02:00",
      "preseance": "1",
      "nominPrincipale": "1",
      "infosQualite": {
        "codeQualite": "Président",
        "libQualite": "Président",
        "libQualiteSex": "Présidente"
      },
      "organesRefs": [
        "PO747235"
      ]
    },
    {
      "xsiType": "MandatMission_Type",
      "uid": "PM759090",
      "acteurRef": "PA719540",
      "legislature": "15",
      "typeOrgane": "MISINFOCOM",
      "dateDebut": "2018-09-26T02:00:00.000+02:00",
      "datePublication": "2018-09-27T02:00:00.000+02:00",
      "preseance": "20",
      "nominPrincipale": "1",
      "infosQualite": {
        "codeQualite": "Membre",
        "libQualite": "Membre",
        "libQualiteSex": "Membre"
      },
      "organesRefs": [
        "PO757572"
      ]
    },
    {
      "xsiType": "MandatMission_Type",
      "uid": "PM762390",
      "acteurRef": "PA719540",
      "legislature": "15",
      "typeOrgane": "MISINFOCOM",
      "dateDebut": "2019-01-31T01:00:00.000+01:00",
      "preseance": "20",
      "nominPrincipale": "1",
      "infosQualite": {
        "codeQualite": "Membre",
        "libQualite": "Membre",
        "libQualiteSex": "Membre"
      },
      "organesRefs": [
        "PO762383"
      ]
    },
    {
      "xsiType": "MandatSimple_Type",
      "uid": "PM763395",
      "acteurRef": "PA719540",
      "legislature": "15",
      "typeOrgane": "ORGEXTPARL",
      "dateDebut": "2019-03-14T01:00:00.000+01:00",
      "datePublication": "2019-03-15T01:00:00.000+01:00",
      "preseance": "20",
      "nominPrincipale": "1",
      "infosQualite": {
        "codeQualite": "Titulaire",
        "libQualite": "Membre titulaire",
        "libQualiteSex": "Membre titulaire"
      },
      "organesRefs": [
        "PO763346"
      ]
    },
    {
      "xsiType": "MandatSimple_Type",
      "uid": "PM765229",
      "acteurRef": "PA719540",
      "legislature": "15",
      "typeOrgane": "GE",
      "dateDebut": "2019-05-15T02:00:00.000+02:00",
      "preseance": "20",
      "nominPrincipale": "1",
      "infosQualite": {
        "codeQualite": "Membre",
        "libQualite": "Membre",
        "libQualiteSex": "Membre"
      },
      "organesRefs": [
        "PO763229"
      ]
    },
    {
      "xsiType": "MandatSimple_Type",
      "uid": "PM765744",
      "acteurRef": "PA719540",
      "legislature": "15",
      "typeOrgane": "CNPE",
      "dateDebut": "2019-06-13T02:00:00.000+02:00",
      "datePublication": "2019-06-14T02:00:00.000+02:00",
      "preseance": "20",
      "nominPrincipale": "1",
      "infosQualite": {
        "codeQualite": "Membre",
        "libQualite": "Membre",
        "libQualiteSex": "Membre"
      },
      "organesRefs": [
        "PO765498"
      ]
    },
    {
      "xsiType": "MandatSimple_Type",
      "uid": "PM766189",
      "acteurRef": "PA719540",
      "legislature": "15",
      "typeOrgane": "GE",
      "dateDebut": "2019-07-03T02:00:00.000+02:00",
      "preseance": "20",
      "nominPrincipale": "1",
      "infosQualite": {
        "codeQualite": "Membre",
        "libQualite": "Membre",
        "libQualiteSex": "Membre"
      },
      "organesRefs": [
        "PO763259"
      ]
    },
    {
      "xsiType": "MandatSimple_Type",
      "uid": "PM767272",
      "acteurRef": "PA719540",
      "legislature": "15",
      "typeOrgane": "COMPER",
      "dateDebut": "2019-10-01T02:00:00.000+02:00",
      "datePublication": "2019-10-01T02:00:00.000+02:00",
      "preseance": "32",
      "nominPrincipale": "1",
      "infosQualite": {
        "codeQualite": "Membre",
        "libQualite": "Membre",
        "libQualiteSex": "Membre"
      },
      "organesRefs": [
        "PO419865"
      ]
    },
    {
      "xsiType": "MandatSimple_Type",
      "uid": "PM768082",
      "acteurRef": "PA719540",
      "legislature": "15",
      "typeOrgane": "ORGEXTPARL",
      "dateDebut": "2018-06-27T02:00:00.000+02:00",
      "datePublication": "2019-04-06T02:00:00.000+02:00",
      "preseance": "20",
      "nominPrincipale": "1",
      "infosQualite": {
        "codeQualite": "Titulaire",
        "libQualite": "Membre titulaire",
        "libQualiteSex": "Membre titulaire"
      },
      "organesRefs": [
        "PO60196"
      ]
    }
  ]
}