{
  "uid": "PO59286",
  "codeType": "GA",
  "libelle": "France République Gabonaise",
  "libelleEdition": "de France République Gabonaise",
  "libelleAbrege": "Gabon",
  "libelleAbrev": "G",
  "viMoDe": {
    "dateAgrement": "1997-06-12T02:00:00.000+02:00",
    "dateFin": "2002-06-18T02:00:00.000+02:00"
  },
  "regime": "5ème République",
  "legislature": "11",
  "secretariat": {}
}