{
  "uid": "PO304526",
  "codeType": "CNPS",
  "libelle": "Commission spéciale chargée d'examiner le projet de loi organique (n°1833) modifiant la loi organique n° 2001-692 du 1er août 2001 relative aux lois de finances",
  "libelleEdition": "de la Commission spéciale chargée d'examiner le projet de loi organique (n°1833) modifiant la loi organique n° 2001-692 du 1er août 2001 relative aux lois de finances",
  "libelleAbrege": "Commission spéciale loi organique (n°1833)",
  "libelleAbrev": "CSMODLO",
  "viMoDe": {
    "dateDebut": "2004-10-12T02:00:00.000+02:00",
    "dateFin": "2005-07-12T02:00:00.000+02:00"
  },
  "regime": "5ème République",
  "legislature": "12",
  "secretariat": {}
}