{
  "uid": "PO716574",
  "codeType": "CMP",
  "libelle": "Commission mixte paritaire chargée de proposer un texte sur les dispositions restant en discussion du projet de loi de programmation relatif à l'égalité réelle outre-mer et portant autres dispositions en matière sociale et économique",
  "libelleEdition": "de la commission mixte paritaire chargée de proposer un texte sur les dispositions restant en discussion du projet de loi de programmation relatif à l'égalité réelle outre-mer et portant autres dispositions en matière sociale et économique",
  "libelleAbrege": "Égalité réelle outre-mer",
  "libelleAbrev": "4000",
  "viMoDe": {
    "dateDebut": "2017-01-20T01:00:00.000+01:00",
    "dateFin": "2017-02-02T01:00:00.000+01:00"
  },
  "regime": "5ème République",
  "legislature": "14",
  "secretariat": {}
}