{
  "uid": "PA342415",
  "etatCivil": {
    "ident": {
      "civ": "Mme",
      "prenom": "Marie-Noëlle",
      "nom": "Battistel",
      "alpha": "Battistel",
      "trigramme": "MNB"
    },
    "infoNaissance": {
      "dateNais": "1956-08-20T01:00:00.000+01:00",
      "villeNais": "Grenoble",
      "depNais": "Isère",
      "paysNais": "France"
    }
  },
  "profession": {
    "libelleCourant": "Autre cadre (secteur privé)",
    "socProcInsee": {
      "catSocPro": "Cadres d'entreprise",
      "famSocPro": "Cadres et professions intellectuelles supérieures"
    }
  },
  "uriHatvp": "https://www.hatvp.fr/pages_nominatives/battistel-marie-noelle",
  "adresses": [
    {
      "xsiType": "AdressePostale_Type",
      "uid": "AD424227",
      "type": "0",
      "typeLibelle": "Adresse officielle",
      "poids": "1",
      "intitule": "Assemblée nationale",
      "numeroRue": "126",
      "nomRue": "Rue de l'Université",
      "codePostal": "75355",
      "ville": "Paris 07 SP"
    },
    {
      "xsiType": "AdresseMail_Type",
      "uid": "AD424318",
      "type": "15",
      "typeLibelle": "Mèl",
      "valElec": "marie-noelle.battistel@assemblee-nationale.fr"
    },
    {
      "xsiType": "AdressePostale_Type",
      "uid": "AD424526",
      "type": "2",
      "typeLibelle": "Adresse publiée de circonscription",
      "poids": "22",
      "intitule": "Permanence",
      "numeroRue": "9",
      "nomRue": "Rue de la Poste,",
      "codePostal": "38170",
      "ville": "Seyssinet-Pariset"
    },
    {
      "xsiType": "AdresseTelephonique_Type",
      "uid": "AD424527",
      "type": "11",
      "typeLibelle": "Téléphone",
      "poids": "22",
      "adresseDeRattachement": "AD424526",
      "valElec": "04 76 70 15 15"
    },
    {
      "xsiType": "AdresseMail_Type",
      "uid": "AD426461",
      "type": "15",
      "typeLibelle": "Mèl",
      "valElec": "mnoelle.battistel@orange.fr"
    }
  ],
  "mandats": [
    {
      "xsiType": "MandatParlementaire_type",
      "uid": "PM424225",
      "acteurRef": "PA342415",
      "legislature": "13",
      "typeOrgane": "ASSEMBLEE",
      "dateDebut": "2010-06-06T02:00:00.000+02:00",
      "dateFin": "2012-06-19T02:00:00.000+02:00",
      "preseance": "50",
      "nominPrincipale": "1",
      "infosQualite": {
        "codeQualite": "membre",
        "libQualite": "membre",
        "libQualiteSex": "membre"
      },
      "organesRefs": [
        "PO384266"
      ],
      "election": {
        "lieu": {
          "region": "Auvergne-Rhône-Alpes",
          "regionType": "Métropolitain",
          "departement": "Isère",
          "numDepartement": "38",
          "numCirco": "4"
        },
        "causeMandat": "élection partielle, remplacement d'un député démissionnaire",
        "refCirconscription": "PO384446"
      },
      "mandature": {
        "datePriseFonction": "2010-06-07T02:00:00.000+02:00",
        "causeFin": "Fin de législature",
        "premiereElection": "0",
        "placeHemicycle": "513"
      }
    },
    {
      "xsiType": "MandatSimple_Type",
      "uid": "PM424228",
      "acteurRef": "PA342415",
      "legislature": "13",
      "typeOrgane": "GP",
      "dateDebut": "2010-06-07T02:00:00.000+02:00",
      "datePublication": "2010-06-08T02:00:00.000+02:00",
      "dateFin": "2010-06-14T02:00:00.000+02:00",
      "preseance": "28",
      "nominPrincipale": "1",
      "infosQualite": {
        "codeQualite": "Député non-inscrit",
        "libQualite": "Député non-inscrit",
        "libQualiteSex": "Députée non-inscrite"
      },
      "organesRefs": [
        "PO387155"
      ]
    },
    {
      "xsiType": "MandatSimple_Type",
      "uid": "PM424320",
      "acteurRef": "PA342415",
      "legislature": "13",
      "typeOrgane": "GP",
      "dateDebut": "2010-06-14T02:00:00.000+02:00",
      "datePublication": "2010-06-15T02:00:00.000+02:00",
      "dateFin": "2012-06-19T02:00:00.000+02:00",
      "preseance": "20",
      "nominPrincipale": "1",
      "infosQualite": {
        "codeQualite": "Membre",
        "libQualite": "Membre du",
        "libQualiteSex": "Membre du"
      },
      "organesRefs": [
        "PO389507"
      ]
    },
    {
      "xsiType": "MandatSimple_Type",
      "uid": "PM424464",
      "acteurRef": "PA342415",
      "legislature": "13",
      "typeOrgane": "COMPER",
      "dateDebut": "2010-06-24T02:00:00.000+02:00",
      "datePublication": "2010-06-24T02:00:00.000+02:00",
      "dateFin": "2012-06-19T02:00:00.000+02:00",
      "preseance": "32",
      "nominPrincipale": "1",
      "infosQualite": {
        "codeQualite": "Membre",
        "libQualite": "Membre",
        "libQualiteSex": "Membre"
      },
      "organesRefs": [
        "PO59046"
      ]
    },
    {
      "xsiType": "MandatSimple_Type",
      "uid": "PM427916",
      "acteurRef": "PA342415",
      "legislature": "13",
      "typeOrgane": "GE",
      "dateDebut": "2011-03-30T02:00:00.000+02:00",
      "dateFin": "2012-06-19T02:00:00.000+02:00",
      "preseance": "20",
      "nominPrincipale": "1",
      "infosQualite": {
        "codeQualite": "Membre",
        "libQualite": "Membre",
        "libQualiteSex": "Membre"
      },
      "organesRefs": [
        "PO426566"
      ]
    },
    {
      "xsiType": "MandatSimple_Type",
      "uid": "PM430683",
      "acteurRef": "PA342415",
      "legislature": "13",
      "typeOrgane": "CNPS",
      "dateDebut": "2011-10-12T02:00:00.000+02:00",
      "datePublication": "2011-10-14T02:00:00.000+02:00",
      "dateFin": "2012-05-21T02:00:00.000+02:00",
      "preseance": "20",
      "nominPrincipale": "1",
      "infosQualite": {
        "codeQualite": "Membre",
        "libQualite": "Membre",
        "libQualiteSex": "Membre"
      },
      "organesRefs": [
        "PO430584"
      ]
    },
    {
      "xsiType": "MandatSimple_Type",
      "uid": "PM430789",
      "acteurRef": "PA342415",
      "legislature": "13",
      "typeOrgane": "DELEG",
      "dateDebut": "2011-10-19T02:00:00.000+02:00",
      "datePublication": "2011-10-19T02:00:00.000+02:00",
      "dateFin": "2012-06-19T02:00:00.000+02:00",
      "preseance": "20",
      "nominPrincipale": "1",
      "infosQualite": {
        "codeQualite": "Membre",
        "libQualite": "Membre",
        "libQualiteSex": "Membre"
      },
      "organesRefs": [
        "PO201269"
      ]
    },
    {
      "xsiType": "MandatSimple_Type",
      "uid": "PM430902",
      "acteurRef": "PA342415",
      "legislature": "13",
      "typeOrgane": "GE",
      "dateDebut": "2011-10-28T02:00:00.000+02:00",
      "dateFin": "2012-06-19T02:00:00.000+02:00",
      "preseance": "20",
      "nominPrincipale": "1",
      "infosQualite": {
        "codeQualite": "Membre",
        "libQualite": "Membre",
        "libQualiteSex": "Membre"
      },
      "organesRefs": [
        "PO428150"
      ]
    },
    {
      "xsiType": "MandatParlementaire_type",
      "uid": "PM645532",
      "acteurRef": "PA342415",
      "legislature": "14",
      "typeOrgane": "ASSEMBLEE",
      "dateDebut": "2012-06-20T02:00:00.000+02:00",
      "dateFin": "2017-06-20T02:00:00.000+02:00",
      "preseance": "50",
      "nominPrincipale": "1",
      "infosQualite": {
        "codeQualite": "membre",
        "libQualite": "membre",
        "libQualiteSex": "membre"
      },
      "organesRefs": [
        "PO644420"
      ],
      "suppleant": {
        "dateDebut": "2012-06-20T02:00:00.000+02:00",
        "dateFin": "2017-06-20T02:00:00.000+02:00",
        "suppleantRef": "PA643180"
      },
      "election": {
        "lieu": {
          "region": "Auvergne-Rhône-Alpes",
          "regionType": "Métropolitain",
          "departement": "Isère",
          "numDepartement": "38",
          "numCirco": "4"
        },
        "causeMandat": "élections générales",
        "refCirconscription": "PO644600"
      },
      "mandature": {
        "datePriseFonction": "2012-06-20T02:00:00.000+02:00",
        "causeFin": "Fin de législature",
        "premiereElection": "1",
        "placeHemicycle": "513"
      }
    },
    {
      "xsiType": "MandatSimple_Type",
      "uid": "PM656044",
      "acteurRef": "PA342415",
      "legislature": "14",
      "typeOrgane": "GP",
      "dateDebut": "2012-06-26T02:00:00.000+02:00",
      "datePublication": "2012-06-27T02:00:00.000+02:00",
      "dateFin": "2016-05-24T02:00:00.000+02:00",
      "preseance": "20",
      "nominPrincipale": "1",
      "infosQualite": {
        "codeQualite": "Membre",
        "libQualite": "Membre du",
        "libQualiteSex": "Membre du"
      },
      "organesRefs": [
        "PO656002"
      ]
    },
    {
      "xsiType": "MandatSimple_Type",
      "uid": "PM657542",
      "acteurRef": "PA342415",
      "legislature": "14",
      "typeOrgane": "COMPER",
      "dateDebut": "2012-06-28T02:00:00.000+02:00",
      "datePublication": "2012-06-28T02:00:00.000+02:00",
      "dateFin": "2013-12-17T01:00:00.000+01:00",
      "preseance": "32",
      "nominPrincipale": "1",
      "infosQualite": {
        "codeQualite": "Membre",
        "libQualite": "Membre",
        "libQualiteSex": "Membre"
      },
      "organesRefs": [
        "PO419610"
      ]
    },
    {
      "xsiType": "MandatSimple_Type",
      "uid": "PM677381",
      "acteurRef": "PA342415",
      "legislature": "14",
      "typeOrgane": "ORGEXTPARL",
      "dateDebut": "2012-07-17T02:00:00.000+02:00",
      "datePublication": "2012-07-24T02:00:00.000+02:00",
      "dateFin": "2017-06-20T02:00:00.000+02:00",
      "preseance": "20",
      "nominPrincipale": "1",
      "infosQualite": {
        "codeQualite": "Titulaire",
        "libQualite": "Membre titulaire",
        "libQualiteSex": "Membre titulaire"
      },
      "organesRefs": [
        "PO60235"
      ]
    },
    {
      "xsiType": "MandatSimple_Type",
      "uid": "PM682947",
      "acteurRef": "PA342415",
      "legislature": "14",
      "typeOrgane": "GA",
      "dateDebut": "2012-10-22T02:00:00.000+02:00",
      "dateFin": "2017-06-20T02:00:00.000+02:00",
      "preseance": "20",
      "nominPrincipale": "1",
      "infosQualite": {
        "codeQualite": "Membre",
        "libQualite": "Membre",
        "libQualiteSex": "Membre"
      },
      "organesRefs": [
        "PO675771"
      ]
    },
    {
      "xsiType": "MandatSimple_Type",
      "uid": "PM682948",
      "acteurRef": "PA342415",
      "legislature": "14",
      "typeOrgane": "GA",
      "dateDebut": "2012-10-22T02:00:00.000+02:00",
      "dateFin": "2017-06-20T02:00:00.000+02:00",
      "preseance": "20",
      "nominPrincipale": "1",
      "infosQualite": {
        "codeQualite": "Membre",
        "libQualite": "Membre",
        "libQualiteSex": "Membre"
      },
      "organesRefs": [
        "PO675773"
      ]
    },
    {
      "xsiType": "MandatSimple_Type",
      "uid": "PM682949",
      "acteurRef": "PA342415",
      "legislature": "14",
      "typeOrgane": "GA",
      "dateDebut": "2012-10-22T02:00:00.000+02:00",
      "dateFin": "2017-06-20T02:00:00.000+02:00",
      "preseance": "20",
      "nominPrincipale": "1",
      "infosQualite": {
        "codeQualite": "Membre",
        "libQualite": "Membre",
        "libQualiteSex": "Membre"
      },
      "organesRefs": [
        "PO675772"
      ]
    },
    {
      "xsiType": "MandatSimple_Type",
      "uid": "PM684013",
      "acteurRef": "PA342415",
      "legislature": "14",
      "typeOrgane": "GA",
      "dateDebut": "2012-11-07T01:00:00.000+01:00",
      "dateFin": "2017-06-20T02:00:00.000+02:00",
      "preseance": "20",
      "nominPrincipale": "1",
      "infosQualite": {
        "codeQualite": "Membre",
        "libQualite": "Membre",
        "libQualiteSex": "Membre"
      },
      "organesRefs": [
        "PO675799"
      ]
    },
    {
      "xsiType": "MandatSimple_Type",
      "uid": "PM684750",
      "acteurRef": "PA342415",
      "legislature": "14",
      "typeOrgane": "GA",
      "dateDebut": "2012-11-21T01:00:00.000+01:00",
      "dateFin": "2017-06-20T02:00:00.000+02:00",
      "preseance": "14",
      "nominPrincipale": "1",
      "infosQualite": {
        "codeQualite": "Secrétaire",
        "libQualite": "Secrétaire",
        "libQualiteSex": "Secrétaire"
      },
      "organesRefs": [
        "PO675799"
      ]
    },
    {
      "xsiType": "MandatSimple_Type",
      "uid": "PM685639",
      "acteurRef": "PA342415",
      "typeOrgane": "PARPOL",
      "dateDebut": "2012-12-01T01:00:00.000+01:00",
      "dateFin": "2017-06-20T02:00:00.000+02:00",
      "preseance": "5",
      "nominPrincipale": "1",
      "infosQualite": {
        "codeQualite": "Membre",
        "libQualite": "Membre",
        "libQualiteSex": "Membre"
      },
      "organesRefs": [
        "PO684932"
      ]
    },
    {
      "xsiType": "MandatSimple_Type",
      "uid": "PM688825",
      "acteurRef": "PA342415",
      "legislature": "14",
      "typeOrgane": "GE",
      "dateDebut": "2013-01-28T01:00:00.000+01:00",
      "dateFin": "2017-06-20T02:00:00.000+02:00",
      "preseance": "20",
      "nominPrincipale": "1",
      "infosQualite": {
        "codeQualite": "Membre",
        "libQualite": "Membre",
        "libQualiteSex": "Membre"
      },
      "organesRefs": [
        "PO686749"
      ]
    },
    {
      "xsiType": "MandatSimple_Type",
      "uid": "PM690207",
      "acteurRef": "PA342415",
      "legislature": "14",
      "typeOrgane": "GE",
      "dateDebut": "2013-01-07T01:00:00.000+01:00",
      "dateFin": "2017-06-20T02:00:00.000+02:00",
      "preseance": "20",
      "nominPrincipale": "1",
      "infosQualite": {
        "codeQualite": "Membre",
        "libQualite": "Membre",
        "libQualiteSex": "Membre"
      },
      "organesRefs": [
        "PO686617"
      ]
    },
    {
      "xsiType": "MandatSimple_Type",
      "uid": "PM691697",
      "acteurRef": "PA342415",
      "legislature": "14",
      "typeOrgane": "GA",
      "dateDebut": "2013-01-29T01:00:00.000+01:00",
      "dateFin": "2017-06-20T02:00:00.000+02:00",
      "preseance": "20",
      "nominPrincipale": "0",
      "infosQualite": {
        "codeQualite": "Membre",
        "libQualite": "Membre",
        "libQualiteSex": "Membre"
      },
      "organesRefs": [
        "PO675713"
      ]
    },
    {
      "xsiType": "MandatSimple_Type",
      "uid": "PM691706",
      "acteurRef": "PA342415",
      "legislature": "14",
      "typeOrgane": "GA",
      "dateDebut": "2013-01-29T01:00:00.000+01:00",
      "dateFin": "2017-06-20T02:00:00.000+02:00",
      "preseance": "14",
      "nominPrincipale": "1",
      "infosQualite": {
        "codeQualite": "Secrétaire",
        "libQualite": "Secrétaire",
        "libQualiteSex": "Secrétaire"
      },
      "organesRefs": [
        "PO675713"
      ]
    },
    {
      "xsiType": "MandatSimple_Type",
      "uid": "PM692846",
      "acteurRef": "PA342415",
      "legislature": "14",
      "typeOrgane": "GE",
      "dateDebut": "2013-02-06T01:00:00.000+01:00",
      "dateFin": "2017-06-20T02:00:00.000+02:00",
      "preseance": "8",
      "nominPrincipale": "1",
      "infosQualite": {
        "codeQualite": "Vice-Président",
        "libQualite": "Vice-Président",
        "libQualiteSex": "Vice-Présidente"
      },
      "organesRefs": [
        "PO686749"
      ]
    },
    {
      "xsiType": "MandatSimple_Type",
      "uid": "PM694308",
      "acteurRef": "PA342415",
      "legislature": "14",
      "typeOrgane": "GE",
      "dateDebut": "2013-04-16T02:00:00.000+02:00",
      "dateFin": "2017-06-20T02:00:00.000+02:00",
      "preseance": "20",
      "nominPrincipale": "1",
      "infosQualite": {
        "codeQualite": "Membre",
        "libQualite": "Membre",
        "libQualiteSex": "Membre"
      },
      "organesRefs": [
        "PO689012"
      ]
    },
    {
      "xsiType": "MandatSimple_Type",
      "uid": "PM694673",
      "acteurRef": "PA342415",
      "legislature": "14",
      "typeOrgane": "GE",
      "dateDebut": "2013-05-29T02:00:00.000+02:00",
      "dateFin": "2017-06-20T02:00:00.000+02:00",
      "preseance": "20",
      "nominPrincipale": "1",
      "infosQualite": {
        "codeQualite": "Membre",
        "libQualite": "Membre",
        "libQualiteSex": "Membre"
      },
      "organesRefs": [
        "PO686501"
      ]
    },
    {
      "xsiType": "MandatSimple_Type",
      "uid": "PM694681",
      "acteurRef": "PA342415",
      "legislature": "14",
      "typeOrgane": "DELEG",
      "dateDebut": "2013-05-30T02:00:00.000+02:00",
      "datePublication": "2013-05-30T02:00:00.000+02:00",
      "dateFin": "2017-06-20T02:00:00.000+02:00",
      "preseance": "20",
      "nominPrincipale": "1",
      "infosQualite": {
        "codeQualite": "Membre",
        "libQualite": "Membre",
        "libQualiteSex": "Membre"
      },
      "organesRefs": [
        "PO201269"
      ]
    },
    {
      "xsiType": "MandatSimple_Type",
      "uid": "PM695697",
      "acteurRef": "PA342415",
      "legislature": "14",
      "typeOrgane": "CNPE",
      "dateDebut": "2013-07-02T02:00:00.000+02:00",
      "datePublication": "2013-07-03T02:00:00.000+02:00",
      "dateFin": "2013-07-03T02:00:00.000+02:00",
      "preseance": "20",
      "nominPrincipale": "1",
      "infosQualite": {
        "codeQualite": "Membre",
        "libQualite": "Membre",
        "libQualiteSex": "Membre"
      },
      "organesRefs": [
        "PO695608"
      ]
    },
    {
      "xsiType": "MandatSimple_Type",
      "uid": "PM697074",
      "acteurRef": "PA342415",
      "legislature": "14",
      "typeOrgane": "GE",
      "dateDebut": "2013-09-18T02:00:00.000+02:00",
      "dateFin": "2017-06-20T02:00:00.000+02:00",
      "preseance": "20",
      "nominPrincipale": "1",
      "infosQualite": {
        "codeQualite": "Membre",
        "libQualite": "Membre",
        "libQualiteSex": "Membre"
      },
      "organesRefs": [
        "PO686326"
      ]
    },
    {
      "xsiType": "MandatSimple_Type",
      "uid": "PM697661",
      "acteurRef": "PA342415",
      "legislature": "14",
      "typeOrgane": "GA",
      "dateDebut": "2013-10-08T02:00:00.000+02:00",
      "dateFin": "2017-06-20T02:00:00.000+02:00",
      "preseance": "8",
      "nominPrincipale": "1",
      "infosQualite": {
        "codeQualite": "Vice-Président",
        "libQualite": "Vice-Président",
        "libQualiteSex": "Vice-Présidente"
      },
      "organesRefs": [
        "PO675773"
      ]
    },
    {
      "xsiType": "MandatSimple_Type",
      "uid": "PM699198",
      "acteurRef": "PA342415",
      "legislature": "14",
      "typeOrgane": "COMPER",
      "dateDebut": "2013-12-18T01:00:00.000+01:00",
      "datePublication": "2013-12-18T01:00:00.000+01:00",
      "dateFin": "2014-01-21T01:00:00.000+01:00",
      "preseance": "32",
      "nominPrincipale": "1",
      "infosQualite": {
        "codeQualite": "Membre",
        "libQualite": "Membre",
        "libQualiteSex": "Membre"
      },
      "organesRefs": [
        "PO420120"
      ]
    },
    {
      "xsiType": "MandatSimple_Type",
      "uid": "PM699201",
      "acteurRef": "PA342415",
      "legislature": "14",
      "typeOrgane": "CNPE",
      "dateDebut": "2013-12-17T01:00:00.000+01:00",
      "datePublication": "2013-12-18T01:00:00.000+01:00",
      "dateFin": "2014-10-30T01:00:00.000+01:00",
      "preseance": "20",
      "nominPrincipale": "1",
      "infosQualite": {
        "codeQualite": "Membre",
        "libQualite": "Membre",
        "libQualiteSex": "Membre"
      },
      "organesRefs": [
        "PO699054"
      ]
    },
    {
      "xsiType": "MandatSimple_Type",
      "uid": "PM699574",
      "acteurRef": "PA342415",
      "legislature": "14",
      "typeOrgane": "COMPER",
      "dateDebut": "2014-01-22T01:00:00.000+01:00",
      "datePublication": "2014-01-22T01:00:00.000+01:00",
      "dateFin": "2017-06-20T02:00:00.000+02:00",
      "preseance": "32",
      "nominPrincipale": "1",
      "infosQualite": {
        "codeQualite": "Membre",
        "libQualite": "Membre",
        "libQualiteSex": "Membre"
      },
      "organesRefs": [
        "PO419610"
      ]
    },
    {
      "xsiType": "MandatSimple_Type",
      "uid": "PM701330",
      "acteurRef": "PA342415",
      "legislature": "14",
      "typeOrgane": "CMP",
      "dateDebut": "2014-05-13T02:00:00.000+02:00",
      "datePublication": "2014-05-15T02:00:00.000+02:00",
      "dateFin": "2014-06-10T02:00:00.000+02:00",
      "preseance": "28",
      "nominPrincipale": "1",
      "infosQualite": {
        "codeQualite": "Suppléant",
        "libQualite": "Membre suppléant",
        "libQualiteSex": "Membre suppléante"
      },
      "organesRefs": [
        "PO700965"
      ]
    },
    {
      "xsiType": "MandatSimple_Type",
      "uid": "PM701475",
      "acteurRef": "PA342415",
      "legislature": "14",
      "typeOrgane": "CMP",
      "dateDebut": "2014-05-21T02:00:00.000+02:00",
      "datePublication": "2014-05-23T02:00:00.000+02:00",
      "dateFin": "2014-06-10T02:00:00.000+02:00",
      "preseance": "4",
      "nominPrincipale": "1",
      "infosQualite": {
        "codeQualite": "Vice-Président",
        "libQualite": "Vice-Président",
        "libQualiteSex": "Vice-Présidente"
      },
      "organesRefs": [
        "PO700965"
      ]
    },
    {
      "xsiType": "MandatSimple_Type",
      "uid": "PM701886",
      "acteurRef": "PA342415",
      "legislature": "14",
      "typeOrgane": "GEVI",
      "dateDebut": "2014-06-17T02:00:00.000+02:00",
      "dateFin": "2017-06-20T02:00:00.000+02:00",
      "preseance": "20",
      "nominPrincipale": "1",
      "infosQualite": {
        "codeQualite": "Membre",
        "libQualite": "Membre",
        "libQualiteSex": "Membre"
      },
      "organesRefs": [
        "PO675838"
      ]
    },
    {
      "xsiType": "MandatSimple_Type",
      "uid": "PM702075",
      "acteurRef": "PA342415",
      "legislature": "14",
      "typeOrgane": "GA",
      "dateDebut": "2014-06-30T02:00:00.000+02:00",
      "dateFin": "2017-06-20T02:00:00.000+02:00",
      "preseance": "1",
      "nominPrincipale": "1",
      "infosQualite": {
        "codeQualite": "Président",
        "libQualite": "Président",
        "libQualiteSex": "Présidente"
      },
      "organesRefs": [
        "PO675771"
      ]
    },
    {
      "xsiType": "MandatSimple_Type",
      "uid": "PM702189",
      "acteurRef": "PA342415",
      "legislature": "14",
      "typeOrgane": "CNPS",
      "dateDebut": "2014-07-03T02:00:00.000+02:00",
      "datePublication": "2014-07-03T02:00:00.000+02:00",
      "dateFin": "2014-12-19T01:00:00.000+01:00",
      "preseance": "20",
      "nominPrincipale": "1",
      "infosQualite": {
        "codeQualite": "Membre",
        "libQualite": "Membre",
        "libQualiteSex": "Membre"
      },
      "organesRefs": [
        "PO702090"
      ]
    },
    {
      "xsiType": "MandatSimple_Type",
      "uid": "PM703031",
      "acteurRef": "PA342415",
      "legislature": "14",
      "typeOrgane": "CNPS",
      "dateDebut": "2014-09-02T02:00:00.000+02:00",
      "datePublication": "2014-09-03T02:00:00.000+02:00",
      "dateFin": "2015-08-18T02:00:00.000+02:00",
      "preseance": "20",
      "nominPrincipale": "1",
      "infosQualite": {
        "codeQualite": "Membre",
        "libQualite": "Membre",
        "libQualiteSex": "Membre"
      },
      "organesRefs": [
        "PO702808"
      ]
    },
    {
      "xsiType": "MandatSimple_Type",
      "uid": "PM703134",
      "acteurRef": "PA342415",
      "legislature": "14",
      "typeOrgane": "CNPS",
      "dateDebut": "2014-09-09T02:00:00.000+02:00",
      "datePublication": "2014-09-10T02:00:00.000+02:00",
      "dateFin": "2015-08-18T02:00:00.000+02:00",
      "preseance": "16",
      "nominPrincipale": "1",
      "infosQualite": {
        "codeQualite": "Rapporteur",
        "libQualite": "Rapporteur",
        "libQualiteSex": "Rapporteure"
      },
      "organesRefs": [
        "PO702808"
      ]
    },
    {
      "xsiType": "MandatSimple_Type",
      "uid": "PM703225",
      "acteurRef": "PA342415",
      "legislature": "14",
      "typeOrgane": "GE",
      "dateDebut": "2014-09-19T02:00:00.000+02:00",
      "dateFin": "2017-06-20T02:00:00.000+02:00",
      "preseance": "20",
      "nominPrincipale": "1",
      "infosQualite": {
        "codeQualite": "Membre",
        "libQualite": "Membre",
        "libQualiteSex": "Membre"
      },
      "organesRefs": [
        "PO701621"
      ]
    },
    {
      "xsiType": "MandatSimple_Type",
      "uid": "PM703264",
      "acteurRef": "PA342415",
      "legislature": "14",
      "typeOrgane": "CNPE",
      "dateDebut": "2014-09-26T02:00:00.000+02:00",
      "datePublication": "2014-09-26T02:00:00.000+02:00",
      "dateFin": "2015-03-05T01:00:00.000+01:00",
      "preseance": "20",
      "nominPrincipale": "1",
      "infosQualite": {
        "codeQualite": "Membre",
        "libQualite": "Membre",
        "libQualiteSex": "Membre"
      },
      "organesRefs": [
        "PO703144"
      ]
    },
    {
      "xsiType": "MandatSimple_Type",
      "uid": "PM706155",
      "acteurRef": "PA342415",
      "legislature": "14",
      "typeOrgane": "API",
      "dateDebut": "2015-02-03T01:00:00.000+01:00",
      "dateFin": "2017-06-20T02:00:00.000+02:00",
      "preseance": "20",
      "nominPrincipale": "1",
      "infosQualite": {
        "codeQualite": "Membre",
        "libQualite": "Membre",
        "libQualiteSex": "Membre"
      },
      "organesRefs": [
        "PO201115"
      ]
    },
    {
      "xsiType": "MandatSimple_Type",
      "uid": "PM706498",
      "acteurRef": "PA342415",
      "legislature": "14",
      "typeOrgane": "CMP",
      "dateDebut": "2015-03-06T01:00:00.000+01:00",
      "datePublication": "2015-03-07T01:00:00.000+01:00",
      "dateFin": "2015-05-25T02:00:00.000+02:00",
      "preseance": "20",
      "nominPrincipale": "1",
      "infosQualite": {
        "codeQualite": "Titulaire",
        "libQualite": "Membre titulaire",
        "libQualiteSex": "Membre titulaire"
      },
      "organesRefs": [
        "PO706437"
      ]
    },
    {
      "xsiType": "MandatSimple_Type",
      "uid": "PM706569",
      "acteurRef": "PA342415",
      "legislature": "14",
      "typeOrgane": "CMP",
      "dateDebut": "2015-03-10T01:00:00.000+01:00",
      "datePublication": "2015-03-11T01:00:00.000+01:00",
      "dateFin": "2015-05-25T02:00:00.000+02:00",
      "preseance": "16",
      "nominPrincipale": "1",
      "infosQualite": {
        "codeQualite": "Rapporteur",
        "libQualite": "Rapporteur",
        "libQualiteSex": "Rapporteure"
      },
      "organesRefs": [
        "PO706437"
      ]
    },
    {
      "xsiType": "MandatMission_Type",
      "uid": "PM709608",
      "acteurRef": "PA342415",
      "legislature": "14",
      "typeOrgane": "MISINFO",
      "dateDebut": "2015-07-22T02:00:00.000+02:00",
      "dateFin": "2016-03-30T02:00:00.000+02:00",
      "preseance": "10",
      "nominPrincipale": "1",
      "infosQualite": {
        "codeQualite": "Membre",
        "libQualite": "Membre",
        "libQualiteSex": "Membre"
      },
      "organesRefs": [
        "PO709593"
      ]
    },
    {
      "xsiType": "MandatMission_Type",
      "uid": "PM709909",
      "acteurRef": "PA342415",
      "legislature": "14",
      "typeOrgane": "MISINFOCOM",
      "dateDebut": "2015-11-03T01:00:00.000+01:00",
      "datePublication": "2015-11-04T01:00:00.000+01:00",
      "dateFin": "2016-11-16T01:00:00.000+01:00",
      "preseance": "20",
      "nominPrincipale": "1",
      "infosQualite": {
        "codeQualite": "Membre",
        "libQualite": "Membre",
        "libQualiteSex": "Membre"
      },
      "organesRefs": [
        "PO709765"
      ]
    },
    {
      "xsiType": "MandatMission_Type",
      "uid": "PM710330",
      "acteurRef": "PA342415",
      "legislature": "14",
      "typeOrgane": "MISINFO",
      "dateDebut": "2015-11-10T01:00:00.000+01:00",
      "dateFin": "2016-04-26T02:00:00.000+02:00",
      "preseance": "9",
      "nominPrincipale": "1",
      "infosQualite": {
        "codeQualite": "Rapporteur",
        "libQualite": "Rapporteur",
        "libQualiteSex": "Rapporteure"
      },
      "organesRefs": [
        "PO710316"
      ]
    },
    {
      "xsiType": "MandatMission_Type",
      "uid": "PM712847",
      "acteurRef": "PA342415",
      "legislature": "14",
      "typeOrgane": "MISINFOCOM",
      "dateDebut": "2016-01-20T01:00:00.000+01:00",
      "dateFin": "2016-11-16T01:00:00.000+01:00",
      "preseance": "16",
      "nominPrincipale": "1",
      "infosQualite": {
        "codeQualite": "Rapporteur",
        "libQualite": "Rapporteur",
        "libQualiteSex": "Rapporteure"
      },
      "organesRefs": [
        "PO709765"
      ]
    },
    {
      "xsiType": "MandatSimple_Type",
      "uid": "PM713104",
      "acteurRef": "PA342415",
      "legislature": "14",
      "typeOrgane": "GP",
      "dateDebut": "2016-05-25T02:00:00.000+02:00",
      "dateFin": "2017-06-20T02:00:00.000+02:00",
      "preseance": "20",
      "nominPrincipale": "1",
      "infosQualite": {
        "codeQualite": "Membre",
        "libQualite": "Membre du",
        "libQualiteSex": "Membre du"
      },
      "organesRefs": [
        "PO713077"
      ]
    },
    {
      "xsiType": "MandatSimple_Type",
      "uid": "PM716213",
      "acteurRef": "PA342415",
      "legislature": "14",
      "typeOrgane": "CMP",
      "dateDebut": "2016-12-15T01:00:00.000+01:00",
      "dateFin": "2016-12-20T01:00:00.000+01:00",
      "preseance": "20",
      "nominPrincipale": "1",
      "infosQualite": {
        "codeQualite": "Titulaire",
        "libQualite": "Membre titulaire",
        "libQualiteSex": "Membre titulaire"
      },
      "organesRefs": [
        "PO716199"
      ]
    },
    {
      "xsiType": "MandatSimple_Type",
      "uid": "PM716637",
      "acteurRef": "PA342415",
      "legislature": "14",
      "typeOrgane": "CMP",
      "dateDebut": "2017-01-27T01:00:00.000+01:00",
      "datePublication": "2017-01-28T01:00:00.000+01:00",
      "dateFin": "2017-02-02T01:00:00.000+01:00",
      "preseance": "20",
      "nominPrincipale": "1",
      "infosQualite": {
        "codeQualite": "Titulaire",
        "libQualite": "Membre titulaire",
        "libQualiteSex": "Membre titulaire"
      },
      "organesRefs": [
        "PO716629"
      ]
    },
    {
      "xsiType": "MandatParlementaire_type",
      "uid": "PM722826",
      "acteurRef": "PA342415",
      "legislature": "15",
      "typeOrgane": "ASSEMBLEE",
      "dateDebut": "2017-06-18T02:00:00.000+02:00",
      "preseance": "50",
      "nominPrincipale": "1",
      "infosQualite": {
        "codeQualite": "membre",
        "libQualite": "membre",
        "libQualiteSex": "membre"
      },
      "organesRefs": [
        "PO717460"
      ],
      "suppleant": {
        "dateDebut": "2017-06-18T02:00:00.000+02:00",
        "suppleantRef": "PA719990"
      },
      "election": {
        "lieu": {
          "region": "Auvergne-Rhône-Alpes",
          "regionType": "Métropolitain",
          "departement": "Isère",
          "numDepartement": "38",
          "numCirco": "4"
        },
        "causeMandat": "élections générales",
        "refCirconscription": "PO717796"
      },
      "mandature": {
        "datePriseFonction": "2017-06-21T02:00:00.000+02:00",
        "premiereElection": "1",
        "placeHemicycle": "513"
      },
      "collaborateurs": [
        {
          "qualite": "M.",
          "prenom": "Guillaume",
          "nom": "Lissy"
        },
        {
          "qualite": "M.",
          "prenom": "Adrian",
          "nom": "Raffin"
        },
        {
          "qualite": "Mme",
          "prenom": "Agathe",
          "nom": "Arsenne"
        },
        {
          "qualite": "M.",
          "prenom": "Aurélien",
          "nom": "Tarquis"
        }
      ]
    },
    {
      "xsiType": "MandatSimple_Type",
      "uid": "PM724454",
      "acteurRef": "PA342415",
      "legislature": "15",
      "typeOrgane": "GP",
      "dateDebut": "2017-06-21T02:00:00.000+02:00",
      "dateFin": "2017-06-26T02:00:00.000+02:00",
      "preseance": "28",
      "nominPrincipale": "1",
      "infosQualite": {
        "codeQualite": "Député non-inscrit",
        "libQualite": "Député non-inscrit",
        "libQualiteSex": "Députée non-inscrite"
      },
      "organesRefs": [
        "PO723569"
      ]
    },
    {
      "xsiType": "MandatSimple_Type",
      "uid": "PM731489",
      "acteurRef": "PA342415",
      "legislature": "15",
      "typeOrgane": "GP",
      "dateDebut": "2017-06-27T02:00:00.000+02:00",
      "datePublication": "2017-06-28T02:00:00.000+02:00",
      "dateFin": "2018-09-11T02:00:00.000+02:00",
      "preseance": "20",
      "nominPrincipale": "1",
      "infosQualite": {
        "codeQualite": "Membre",
        "libQualite": "Membre du",
        "libQualiteSex": "Membre du"
      },
      "organesRefs": [
        "PO730946"
      ]
    },
    {
      "xsiType": "MandatSimple_Type",
      "uid": "PM731897",
      "acteurRef": "PA342415",
      "legislature": "15",
      "typeOrgane": "COMPER",
      "dateDebut": "2017-06-29T02:00:00.000+02:00",
      "datePublication": "2017-06-29T02:00:00.000+02:00",
      "dateFin": "2019-02-04T01:00:00.000+01:00",
      "preseance": "32",
      "nominPrincipale": "1",
      "infosQualite": {
        "codeQualite": "Membre",
        "libQualite": "Membre",
        "libQualiteSex": "Membre"
      },
      "organesRefs": [
        "PO419610"
      ]
    },
    {
      "xsiType": "MandatSimple_Type",
      "uid": "PM732288",
      "acteurRef": "PA342415",
      "legislature": "15",
      "typeOrgane": "COMPER",
      "dateDebut": "2017-06-30T02:00:00.000+02:00",
      "datePublication": "2017-06-30T02:00:00.000+02:00",
      "dateFin": "2019-02-04T01:00:00.000+01:00",
      "preseance": "8",
      "nominPrincipale": "1",
      "infosQualite": {
        "codeQualite": "Vice-Président",
        "libQualite": "Vice-président",
        "libQualiteSex": "Vice-présidente"
      },
      "organesRefs": [
        "PO419610"
      ]
    },
    {
      "xsiType": "MandatSimple_Type",
      "uid": "PM732694",
      "acteurRef": "PA342415",
      "legislature": "15",
      "typeOrgane": "DELEG",
      "dateDebut": "2017-07-12T02:00:00.000+02:00",
      "datePublication": "2017-07-12T02:00:00.000+02:00",
      "preseance": "20",
      "nominPrincipale": "0",
      "infosQualite": {
        "codeQualite": "Membre",
        "libQualite": "Membre",
        "libQualiteSex": "Membre"
      },
      "organesRefs": [
        "PO201269"
      ]
    },
    {
      "xsiType": "MandatSimple_Type",
      "uid": "PM732716",
      "acteurRef": "PA342415",
      "legislature": "15",
      "typeOrgane": "DELEG",
      "dateDebut": "2017-07-12T02:00:00.000+02:00",
      "datePublication": "2017-07-13T02:00:00.000+02:00",
      "preseance": "8",
      "nominPrincipale": "1",
      "infosQualite": {
        "codeQualite": "Vice-Président",
        "libQualite": "Vice-Président",
        "libQualiteSex": "Vice-Présidente"
      },
      "organesRefs": [
        "PO201269"
      ]
    },
    {
      "xsiType": "MandatSimple_Type",
      "uid": "PM734477",
      "acteurRef": "PA342415",
      "legislature": "15",
      "typeOrgane": "API",
      "dateDebut": "2017-08-02T02:00:00.000+02:00",
      "datePublication": "2017-08-03T02:00:00.000+02:00",
      "preseance": "20",
      "nominPrincipale": "1",
      "infosQualite": {
        "codeQualite": "Membre",
        "libQualite": "Membre",
        "libQualiteSex": "Membre"
      },
      "organesRefs": [
        "PO206064"
      ]
    },
    {
      "xsiType": "MandatSimple_Type",
      "uid": "PM737693",
      "acteurRef": "PA342415",
      "legislature": "15",
      "typeOrgane": "GEVI",
      "dateDebut": "2017-10-05T02:00:00.000+02:00",
      "preseance": "20",
      "nominPrincipale": "0",
      "infosQualite": {
        "codeQualite": "Membre",
        "libQualite": "Membre",
        "libQualiteSex": "Membre"
      },
      "organesRefs": [
        "PO733622"
      ]
    },
    {
      "xsiType": "MandatSimple_Type",
      "uid": "PM737694",
      "acteurRef": "PA342415",
      "legislature": "15",
      "typeOrgane": "GA",
      "dateDebut": "2017-10-05T02:00:00.000+02:00",
      "preseance": "20",
      "nominPrincipale": "1",
      "infosQualite": {
        "codeQualite": "Membre",
        "libQualite": "Membre",
        "libQualiteSex": "Membre"
      },
      "organesRefs": [
        "PO733072"
      ]
    },
    {
      "xsiType": "MandatSimple_Type",
      "uid": "PM737695",
      "acteurRef": "PA342415",
      "legislature": "15",
      "typeOrgane": "GA",
      "dateDebut": "2017-10-05T02:00:00.000+02:00",
      "preseance": "20",
      "nominPrincipale": "0",
      "infosQualite": {
        "codeQualite": "Membre",
        "libQualite": "Membre",
        "libQualiteSex": "Membre"
      },
      "organesRefs": [
        "PO733322"
      ]
    },
    {
      "xsiType": "MandatSimple_Type",
      "uid": "PM737696",
      "acteurRef": "PA342415",
      "legislature": "15",
      "typeOrgane": "GA",
      "dateDebut": "2017-10-05T02:00:00.000+02:00",
      "preseance": "20",
      "nominPrincipale": "1",
      "infosQualite": {
        "codeQualite": "Membre",
        "libQualite": "Membre",
        "libQualiteSex": "Membre"
      },
      "organesRefs": [
        "PO733342"
      ]
    },
    {
      "xsiType": "MandatSimple_Type",
      "uid": "PM737697",
      "acteurRef": "PA342415",
      "legislature": "15",
      "typeOrgane": "GA",
      "dateDebut": "2017-10-05T02:00:00.000+02:00",
      "preseance": "20",
      "nominPrincipale": "0",
      "infosQualite": {
        "codeQualite": "Membre",
        "libQualite": "Membre",
        "libQualiteSex": "Membre"
      },
      "organesRefs": [
        "PO733577"
      ]
    },
    {
      "xsiType": "MandatSimple_Type",
      "uid": "PM737698",
      "acteurRef": "PA342415",
      "legislature": "15",
      "typeOrgane": "GA",
      "dateDebut": "2017-10-05T02:00:00.000+02:00",
      "preseance": "20",
      "nominPrincipale": "1",
      "infosQualite": {
        "codeQualite": "Membre",
        "libQualite": "Membre",
        "libQualiteSex": "Membre"
      },
      "organesRefs": [
        "PO733642"
      ]
    },
    {
      "xsiType": "MandatSimple_Type",
      "uid": "PM740777",
      "acteurRef": "PA342415",
      "legislature": "15",
      "typeOrgane": "ORGEXTPARL",
      "dateDebut": "2017-10-19T02:00:00.000+02:00",
      "datePublication": "2017-10-21T02:00:00.000+02:00",
      "preseance": "20",
      "nominPrincipale": "1",
      "infosQualite": {
        "codeQualite": "Titulaire",
        "libQualite": "Membre titulaire",
        "libQualiteSex": "Membre titulaire"
      },
      "organesRefs": [
        "PO60193"
      ]
    },
    {
      "xsiType": "MandatSimple_Type",
      "uid": "PM742587",
      "acteurRef": "PA342415",
      "legislature": "15",
      "typeOrgane": "GA",
      "dateDebut": "2017-11-07T01:00:00.000+01:00",
      "preseance": "8",
      "nominPrincipale": "1",
      "infosQualite": {
        "codeQualite": "Vice-Président",
        "libQualite": "Vice-Président",
        "libQualiteSex": "Vice-Présidente"
      },
      "organesRefs": [
        "PO733322"
      ]
    },
    {
      "xsiType": "MandatSimple_Type",
      "uid": "PM743006",
      "acteurRef": "PA342415",
      "legislature": "15",
      "typeOrgane": "ORGEXTPARL",
      "dateDebut": "2017-11-10T01:00:00.000+01:00",
      "datePublication": "2017-11-11T01:00:00.000+01:00",
      "preseance": "30",
      "nominPrincipale": "1",
      "infosQualite": {
        "codeQualite": "Suppléant",
        "libQualite": "Membre suppléant",
        "libQualiteSex": "Membre suppléante"
      },
      "organesRefs": [
        "PO60170"
      ]
    },
    {
      "xsiType": "MandatSimple_Type",
      "uid": "PM743103",
      "acteurRef": "PA342415",
      "legislature": "15",
      "typeOrgane": "GEVI",
      "dateDebut": "2017-11-14T01:00:00.000+01:00",
      "preseance": "8",
      "nominPrincipale": "1",
      "infosQualite": {
        "codeQualite": "Vice-Président",
        "libQualite": "Vice-Président",
        "libQualiteSex": "Vice-Présidente"
      },
      "organesRefs": [
        "PO733622"
      ]
    },
    {
      "xsiType": "MandatSimple_Type",
      "uid": "PM743124",
      "acteurRef": "PA342415",
      "legislature": "15",
      "typeOrgane": "CNPE",
      "dateDebut": "2017-11-14T01:00:00.000+01:00",
      "datePublication": "2017-11-15T01:00:00.000+01:00",
      "dateFin": "2018-04-19T02:00:00.000+02:00",
      "preseance": "20",
      "nominPrincipale": "1",
      "infosQualite": {
        "codeQualite": "Membre",
        "libQualite": "Membre",
        "libQualiteSex": "Membre"
      },
      "organesRefs": [
        "PO742273"
      ]
    },
    {
      "xsiType": "MandatSimple_Type",
      "uid": "PM743507",
      "acteurRef": "PA342415",
      "legislature": "15",
      "typeOrgane": "GA",
      "dateDebut": "2017-11-16T01:00:00.000+01:00",
      "preseance": "8",
      "nominPrincipale": "1",
      "infosQualite": {
        "codeQualite": "Vice-Président",
        "libQualite": "Vice-Président",
        "libQualiteSex": "Vice-Présidente"
      },
      "organesRefs": [
        "PO733577"
      ]
    },
    {
      "xsiType": "MandatSimple_Type",
      "uid": "PM743523",
      "acteurRef": "PA342415",
      "legislature": "15",
      "typeOrgane": "CNPE",
      "dateDebut": "2017-11-16T01:00:00.000+01:00",
      "datePublication": "2017-11-17T01:00:00.000+01:00",
      "dateFin": "2018-04-19T02:00:00.000+02:00",
      "preseance": "14",
      "nominPrincipale": "1",
      "infosQualite": {
        "codeQualite": "Secrétaire",
        "libQualite": "Secrétaire",
        "libQualiteSex": "Secrétaire"
      },
      "organesRefs": [
        "PO742273"
      ]
    },
    {
      "xsiType": "MandatSimple_Type",
      "uid": "PM743672",
      "acteurRef": "PA342415",
      "legislature": "15",
      "typeOrgane": "GA",
      "dateDebut": "2017-11-21T01:00:00.000+01:00",
      "preseance": "20",
      "nominPrincipale": "1",
      "infosQualite": {
        "codeQualite": "Membre",
        "libQualite": "Membre",
        "libQualiteSex": "Membre"
      },
      "organesRefs": [
        "PO733347"
      ]
    },
    {
      "xsiType": "MandatMission_Type",
      "uid": "PM744000",
      "acteurRef": "PA342415",
      "legislature": "15",
      "typeOrgane": "MISINFO",
      "dateDebut": "2017-11-06T01:00:00.000+01:00",
      "dateFin": "2017-12-26T01:00:00.000+01:00",
      "preseance": "10",
      "nominPrincipale": "0",
      "infosQualite": {
        "codeQualite": "Membre",
        "libQualite": "Membre",
        "libQualiteSex": "Membre"
      },
      "organesRefs": [
        "PO743978"
      ]
    },
    {
      "xsiType": "MandatMission_Type",
      "uid": "PM744002",
      "acteurRef": "PA342415",
      "legislature": "15",
      "typeOrgane": "MISINFO",
      "dateDebut": "2017-11-06T01:00:00.000+01:00",
      "dateFin": "2017-12-26T01:00:00.000+01:00",
      "preseance": "5",
      "nominPrincipale": "1",
      "infosQualite": {
        "codeQualite": "Co-rapporteur",
        "libQualite": "Co-rapporteur",
        "libQualiteSex": "Co-rapporteure"
      },
      "organesRefs": [
        "PO743978"
      ]
    },
    {
      "xsiType": "MandatSimple_Type",
      "uid": "PM746545",
      "acteurRef": "PA342415",
      "legislature": "15",
      "typeOrgane": "CMP",
      "dateDebut": "2017-12-15T01:00:00.000+01:00",
      "datePublication": "2017-12-16T01:00:00.000+01:00",
      "dateFin": "2017-12-21T01:00:00.000+01:00",
      "preseance": "28",
      "nominPrincipale": "1",
      "infosQualite": {
        "codeQualite": "Suppléant",
        "libQualite": "Membre suppléant",
        "libQualiteSex": "Membre suppléante"
      },
      "organesRefs": [
        "PO746520"
      ]
    },
    {
      "xsiType": "MandatSimple_Type",
      "uid": "PM749198",
      "acteurRef": "PA342415",
      "legislature": "15",
      "typeOrgane": "GE",
      "dateDebut": "2018-02-08T01:00:00.000+01:00",
      "preseance": "20",
      "nominPrincipale": "0",
      "infosQualite": {
        "codeQualite": "Membre",
        "libQualite": "Membre",
        "libQualiteSex": "Membre"
      },
      "organesRefs": [
        "PO746925"
      ]
    },
    {
      "xsiType": "MandatSimple_Type",
      "uid": "PM750027",
      "acteurRef": "PA342415",
      "legislature": "15",
      "typeOrgane": "GE",
      "dateDebut": "2018-02-13T01:00:00.000+01:00",
      "preseance": "20",
      "nominPrincipale": "0",
      "infosQualite": {
        "codeQualite": "Membre",
        "libQualite": "Membre",
        "libQualiteSex": "Membre"
      },
      "organesRefs": [
        "PO747094"
      ]
    },
    {
      "xsiType": "MandatSimple_Type",
      "uid": "PM750554",
      "acteurRef": "PA342415",
      "legislature": "15",
      "typeOrgane": "GE",
      "dateDebut": "2018-02-12T01:00:00.000+01:00",
      "preseance": "20",
      "nominPrincipale": "0",
      "infosQualite": {
        "codeQualite": "Membre",
        "libQualite": "Membre",
        "libQualiteSex": "Membre"
      },
      "organesRefs": [
        "PO746857"
      ]
    },
    {
      "xsiType": "MandatSimple_Type",
      "uid": "PM750874",
      "acteurRef": "PA342415",
      "legislature": "15",
      "typeOrgane": "GE",
      "dateDebut": "2018-02-20T01:00:00.000+01:00",
      "preseance": "20",
      "nominPrincipale": "1",
      "infosQualite": {
        "codeQualite": "Membre",
        "libQualite": "Membre",
        "libQualiteSex": "Membre"
      },
      "organesRefs": [
        "PO747099"
      ]
    },
    {
      "xsiType": "MandatSimple_Type",
      "uid": "PM751365",
      "acteurRef": "PA342415",
      "legislature": "15",
      "typeOrgane": "GE",
      "dateDebut": "2018-03-13T01:00:00.000+01:00",
      "preseance": "20",
      "nominPrincipale": "0",
      "infosQualite": {
        "codeQualite": "Membre",
        "libQualite": "Membre",
        "libQualiteSex": "Membre"
      },
      "organesRefs": [
        "PO746899"
      ]
    },
    {
      "xsiType": "MandatSimple_Type",
      "uid": "PM751761",
      "acteurRef": "PA342415",
      "legislature": "15",
      "typeOrgane": "GE",
      "dateDebut": "2018-02-22T01:00:00.000+01:00",
      "preseance": "20",
      "nominPrincipale": "1",
      "infosQualite": {
        "codeQualite": "Membre",
        "libQualite": "Membre",
        "libQualiteSex": "Membre"
      },
      "organesRefs": [
        "PO746880"
      ]
    },
    {
      "xsiType": "MandatSimple_Type",
      "uid": "PM752298",
      "acteurRef": "PA342415",
      "legislature": "15",
      "typeOrgane": "GE",
      "dateDebut": "2018-02-21T01:00:00.000+01:00",
      "preseance": "20",
      "nominPrincipale": "1",
      "infosQualite": {
        "codeQualite": "Membre",
        "libQualite": "Membre",
        "libQualiteSex": "Membre"
      },
      "organesRefs": [
        "PO746910"
      ]
    },
    {
      "xsiType": "MandatSimple_Type",
      "uid": "PM752683",
      "acteurRef": "PA342415",
      "legislature": "15",
      "typeOrgane": "GE",
      "dateDebut": "2018-03-07T01:00:00.000+01:00",
      "preseance": "8",
      "nominPrincipale": "1",
      "infosQualite": {
        "codeQualite": "Vice-Président",
        "libQualite": "Vice-Président",
        "libQualiteSex": "Vice-Présidente"
      },
      "organesRefs": [
        "PO746857"
      ]
    },
    {
      "xsiType": "MandatSimple_Type",
      "uid": "PM753029",
      "acteurRef": "PA342415",
      "legislature": "15",
      "typeOrgane": "GE",
      "dateDebut": "2018-03-08T01:00:00.000+01:00",
      "preseance": "20",
      "nominPrincipale": "0",
      "infosQualite": {
        "codeQualite": "Membre",
        "libQualite": "Membre",
        "libQualiteSex": "Membre"
      },
      "organesRefs": [
        "PO746811"
      ]
    },
    {
      "xsiType": "MandatSimple_Type",
      "uid": "PM753614",
      "acteurRef": "PA342415",
      "legislature": "15",
      "typeOrgane": "GE",
      "dateDebut": "2018-03-13T01:00:00.000+01:00",
      "preseance": "8",
      "nominPrincipale": "1",
      "infosQualite": {
        "codeQualite": "Vice-Président",
        "libQualite": "Vice-Président",
        "libQualiteSex": "Vice-Présidente"
      },
      "organesRefs": [
        "PO746899"
      ]
    },
    {
      "xsiType": "MandatSimple_Type",
      "uid": "PM753733",
      "acteurRef": "PA342415",
      "legislature": "15",
      "typeOrgane": "GE",
      "dateDebut": "2018-03-14T01:00:00.000+01:00",
      "preseance": "8",
      "nominPrincipale": "1",
      "infosQualite": {
        "codeQualite": "Vice-Président",
        "libQualite": "Vice-Président",
        "libQualiteSex": "Vice-Présidente"
      },
      "organesRefs": [
        "PO746925"
      ]
    },
    {
      "xsiType": "MandatSimple_Type",
      "uid": "PM753761",
      "acteurRef": "PA342415",
      "legislature": "15",
      "typeOrgane": "GE",
      "dateDebut": "2018-03-19T01:00:00.000+01:00",
      "preseance": "20",
      "nominPrincipale": "1",
      "infosQualite": {
        "codeQualite": "Membre",
        "libQualite": "Membre",
        "libQualiteSex": "Membre"
      },
      "organesRefs": [
        "PO747084"
      ]
    },
    {
      "xsiType": "MandatSimple_Type",
      "uid": "PM755187",
      "acteurRef": "PA342415",
      "legislature": "15",
      "typeOrgane": "GE",
      "dateDebut": "2018-04-03T02:00:00.000+02:00",
      "preseance": "8",
      "nominPrincipale": "1",
      "infosQualite": {
        "codeQualite": "Vice-Président",
        "libQualite": "Vice-Président",
        "libQualiteSex": "Vice-Présidente"
      },
      "organesRefs": [
        "PO747094"
      ]
    },
    {
      "xsiType": "MandatSimple_Type",
      "uid": "PM755254",
      "acteurRef": "PA342415",
      "legislature": "15",
      "typeOrgane": "GE",
      "dateDebut": "2018-04-10T02:00:00.000+02:00",
      "preseance": "12",
      "nominPrincipale": "1",
      "infosQualite": {
        "codeQualite": "Secrétaire",
        "libQualite": "Secrétaire",
        "libQualiteSex": "Secrétaire"
      },
      "organesRefs": [
        "PO746811"
      ]
    },
    {
      "xsiType": "MandatSimple_Type",
      "uid": "PM756984",
      "acteurRef": "PA342415",
      "legislature": "15",
      "typeOrgane": "ORGEXTPARL",
      "dateDebut": "2018-03-08T01:00:00.000+01:00",
      "datePublication": "2018-03-09T01:00:00.000+01:00",
      "preseance": "20",
      "nominPrincipale": "1",
      "infosQualite": {
        "codeQualite": "Titulaire",
        "libQualite": "Membre titulaire",
        "libQualiteSex": "Membre titulaire"
      },
      "organesRefs": [
        "PO756933"
      ]
    },
    {
      "xsiType": "MandatSimple_Type",
      "uid": "PM757349",
      "acteurRef": "PA342415",
      "legislature": "15",
      "typeOrgane": "CNPS",
      "dateDebut": "2018-06-27T02:00:00.000+02:00",
      "datePublication": "2018-06-28T02:00:00.000+02:00",
      "dateFin": "2019-04-11T02:00:00.000+02:00",
      "preseance": "20",
      "nominPrincipale": "1",
      "infosQualite": {
        "codeQualite": "Membre",
        "libQualite": "Membre",
        "libQualiteSex": "Membre"
      },
      "organesRefs": [
        "PO757134"
      ]
    },
    {
      "xsiType": "MandatSimple_Type",
      "uid": "PM757524",
      "acteurRef": "PA342415",
      "legislature": "15",
      "typeOrgane": "CNPS",
      "dateDebut": "2018-07-03T02:00:00.000+02:00",
      "datePublication": "2018-07-04T02:00:00.000+02:00",
      "dateFin": "2019-04-11T02:00:00.000+02:00",
      "preseance": "8",
      "nominPrincipale": "1",
      "infosQualite": {
        "codeQualite": "Vice-Président",
        "libQualite": "Vice-Président",
        "libQualiteSex": "Vice-Présidente"
      },
      "organesRefs": [
        "PO757134"
      ]
    },
    {
      "xsiType": "MandatMission_Type",
      "uid": "PM757643",
      "acteurRef": "PA342415",
      "legislature": "15",
      "typeOrgane": "MISINFOPRE",
      "dateDebut": "2018-07-05T02:00:00.000+02:00",
      "datePublication": "2018-07-06T02:00:00.000+02:00",
      "dateFin": "2019-08-05T02:00:00.000+02:00",
      "preseance": "20",
      "nominPrincipale": "1",
      "infosQualite": {
        "codeQualite": "Membre",
        "libQualite": "Membre",
        "libQualiteSex": "Membre"
      },
      "organesRefs": [
        "PO757231"
      ]
    },
    {
      "xsiType": "MandatMission_Type",
      "uid": "PM758136",
      "acteurRef": "PA342415",
      "legislature": "15",
      "typeOrgane": "MISINFOPRE",
      "dateDebut": "2018-07-18T02:00:00.000+02:00",
      "datePublication": "2018-07-19T02:00:00.000+02:00",
      "dateFin": "2019-08-05T02:00:00.000+02:00",
      "preseance": "4",
      "nominPrincipale": "1",
      "infosQualite": {
        "codeQualite": "Vice-Président",
        "libQualite": "Vice-Président",
        "libQualiteSex": "Vice-Présidente"
      },
      "organesRefs": [
        "PO757231"
      ]
    },
    {
      "xsiType": "MandatSimple_Type",
      "uid": "PM758847",
      "acteurRef": "PA342415",
      "legislature": "15",
      "typeOrgane": "GP",
      "dateDebut": "2018-09-12T02:00:00.000+02:00",
      "preseance": "20",
      "nominPrincipale": "1",
      "infosQualite": {
        "codeQualite": "Membre",
        "libQualite": "Membre du",
        "libQualiteSex": "Membre du"
      },
      "organesRefs": [
        "PO758835"
      ]
    },
    {
      "xsiType": "MandatMission_Type",
      "uid": "PM762305",
      "acteurRef": "PA342415",
      "legislature": "15",
      "typeOrgane": "MISINFO",
      "dateDebut": "2019-01-23T01:00:00.000+01:00",
      "preseance": "10",
      "nominPrincipale": "0",
      "infosQualite": {
        "codeQualite": "Membre",
        "libQualite": "Membre",
        "libQualiteSex": "Membre"
      },
      "organesRefs": [
        "PO762272"
      ]
    },
    {
      "xsiType": "MandatSimple_Type",
      "uid": "PM762426",
      "acteurRef": "PA342415",
      "legislature": "15",
      "typeOrgane": "COMPER",
      "dateDebut": "2019-02-05T01:00:00.000+01:00",
      "datePublication": "2019-02-05T01:00:00.000+01:00",
      "dateFin": "2019-02-06T01:00:00.000+01:00",
      "preseance": "32",
      "nominPrincipale": "1",
      "infosQualite": {
        "codeQualite": "Membre",
        "libQualite": "Membre",
        "libQualiteSex": "Membre"
      },
      "organesRefs": [
        "PO419865"
      ]
    },
    {
      "xsiType": "MandatSimple_Type",
      "uid": "PM762496",
      "acteurRef": "PA342415",
      "legislature": "15",
      "typeOrgane": "COMPER",
      "dateDebut": "2019-02-07T01:00:00.000+01:00",
      "datePublication": "2019-02-07T01:00:00.000+01:00",
      "dateFin": "2019-05-06T02:00:00.000+02:00",
      "preseance": "32",
      "nominPrincipale": "0",
      "infosQualite": {
        "codeQualite": "Membre",
        "libQualite": "Membre",
        "libQualiteSex": "Membre"
      },
      "organesRefs": [
        "PO419610"
      ]
    },
    {
      "xsiType": "MandatSimple_Type",
      "uid": "PM762497",
      "acteurRef": "PA342415",
      "legislature": "15",
      "typeOrgane": "COMPER",
      "dateDebut": "2019-02-07T01:00:00.000+01:00",
      "datePublication": "2019-02-07T01:00:00.000+01:00",
      "dateFin": "2019-05-06T02:00:00.000+02:00",
      "preseance": "8",
      "nominPrincipale": "1",
      "infosQualite": {
        "codeQualite": "Vice-Président",
        "libQualite": "Vice-président",
        "libQualiteSex": "Vice-présidente"
      },
      "organesRefs": [
        "PO419610"
      ]
    },
    {
      "xsiType": "MandatMission_Type",
      "uid": "PM762775",
      "acteurRef": "PA342415",
      "legislature": "15",
      "typeOrgane": "MISINFO",
      "dateDebut": "2019-02-14T01:00:00.000+01:00",
      "preseance": "4",
      "nominPrincipale": "1",
      "infosQualite": {
        "codeQualite": "Vice-Président",
        "libQualite": "Vice-président",
        "libQualiteSex": "Vice-présidente"
      },
      "organesRefs": [
        "PO762272"
      ]
    },
    {
      "xsiType": "MandatSimple_Type",
      "uid": "PM762982",
      "acteurRef": "PA342415",
      "legislature": "15",
      "typeOrgane": "CNPE",
      "dateDebut": "2019-03-05T01:00:00.000+01:00",
      "datePublication": "2019-03-06T01:00:00.000+01:00",
      "dateFin": "2019-07-25T02:00:00.000+02:00",
      "preseance": "20",
      "nominPrincipale": "1",
      "infosQualite": {
        "codeQualite": "Membre",
        "libQualite": "Membre",
        "libQualiteSex": "Membre"
      },
      "organesRefs": [
        "PO762821"
      ]
    },
    {
      "xsiType": "MandatSimple_Type",
      "uid": "PM763091",
      "acteurRef": "PA342415",
      "legislature": "15",
      "typeOrgane": "CNPE",
      "dateDebut": "2019-03-07T01:00:00.000+01:00",
      "datePublication": "2019-03-08T01:00:00.000+01:00",
      "dateFin": "2019-07-25T02:00:00.000+02:00",
      "preseance": "8",
      "nominPrincipale": "1",
      "infosQualite": {
        "codeQualite": "Vice-Président",
        "libQualite": "Vice-Président",
        "libQualiteSex": "Vice-Présidente"
      },
      "organesRefs": [
        "PO762821"
      ]
    },
    {
      "xsiType": "MandatSimple_Type",
      "uid": "PM764886",
      "acteurRef": "PA342415",
      "legislature": "15",
      "typeOrgane": "GE",
      "dateDebut": "2019-05-02T02:00:00.000+02:00",
      "preseance": "20",
      "nominPrincipale": "0",
      "infosQualite": {
        "codeQualite": "Membre",
        "libQualite": "Membre",
        "libQualiteSex": "Membre"
      },
      "organesRefs": [
        "PO763234"
      ]
    },
    {
      "xsiType": "MandatSimple_Type",
      "uid": "PM764887",
      "acteurRef": "PA342415",
      "legislature": "15",
      "typeOrgane": "GE",
      "dateDebut": "2019-05-02T02:00:00.000+02:00",
      "preseance": "8",
      "nominPrincipale": "1",
      "infosQualite": {
        "codeQualite": "Vice-Président",
        "libQualite": "Vice-Président",
        "libQualiteSex": "Vice-Présidente"
      },
      "organesRefs": [
        "PO763234"
      ]
    },
    {
      "xsiType": "MandatSimple_Type",
      "uid": "PM764967",
      "acteurRef": "PA342415",
      "legislature": "15",
      "typeOrgane": "COMPER",
      "dateDebut": "2019-05-07T02:00:00.000+02:00",
      "datePublication": "2019-05-07T02:00:00.000+02:00",
      "dateFin": "2019-05-07T02:00:00.000+02:00",
      "preseance": "32",
      "nominPrincipale": "1",
      "infosQualite": {
        "codeQualite": "Membre",
        "libQualite": "Membre",
        "libQualiteSex": "Membre"
      },
      "organesRefs": [
        "PO419865"
      ]
    },
    {
      "xsiType": "MandatSimple_Type",
      "uid": "PM764997",
      "acteurRef": "PA342415",
      "legislature": "15",
      "typeOrgane": "COMPER",
      "dateDebut": "2019-05-08T02:00:00.000+02:00",
      "datePublication": "2019-05-08T02:00:00.000+02:00",
      "dateFin": "2019-06-11T02:00:00.000+02:00",
      "preseance": "32",
      "nominPrincipale": "0",
      "infosQualite": {
        "codeQualite": "Membre",
        "libQualite": "Membre",
        "libQualiteSex": "Membre"
      },
      "organesRefs": [
        "PO419610"
      ]
    },
    {
      "xsiType": "MandatSimple_Type",
      "uid": "PM765003",
      "acteurRef": "PA342415",
      "legislature": "15",
      "typeOrgane": "COMPER",
      "dateDebut": "2019-05-08T02:00:00.000+02:00",
      "datePublication": "2019-05-08T02:00:00.000+02:00",
      "dateFin": "2019-06-11T02:00:00.000+02:00",
      "preseance": "8",
      "nominPrincipale": "1",
      "infosQualite": {
        "codeQualite": "Vice-Président",
        "libQualite": "Vice-président",
        "libQualiteSex": "Vice-présidente"
      },
      "organesRefs": [
        "PO419610"
      ]
    },
    {
      "xsiType": "MandatSimple_Type",
      "uid": "PM765633",
      "acteurRef": "PA342415",
      "legislature": "15",
      "typeOrgane": "COMPER",
      "dateDebut": "2019-06-12T02:00:00.000+02:00",
      "datePublication": "2019-06-12T02:00:00.000+02:00",
      "dateFin": "2019-06-12T02:00:00.000+02:00",
      "preseance": "32",
      "nominPrincipale": "1",
      "infosQualite": {
        "codeQualite": "Membre",
        "libQualite": "Membre",
        "libQualiteSex": "Membre"
      },
      "organesRefs": [
        "PO419865"
      ]
    },
    {
      "xsiType": "MandatSimple_Type",
      "uid": "PM765675",
      "acteurRef": "PA342415",
      "legislature": "15",
      "typeOrgane": "COMPER",
      "dateDebut": "2019-06-13T02:00:00.000+02:00",
      "datePublication": "2019-06-13T02:00:00.000+02:00",
      "preseance": "32",
      "nominPrincipale": "0",
      "infosQualite": {
        "codeQualite": "Membre",
        "libQualite": "Membre",
        "libQualiteSex": "Membre"
      },
      "organesRefs": [
        "PO419610"
      ]
    },
    {
      "xsiType": "MandatSimple_Type",
      "uid": "PM765678",
      "acteurRef": "PA342415",
      "legislature": "15",
      "typeOrgane": "COMPER",
      "dateDebut": "2019-06-13T02:00:00.000+02:00",
      "datePublication": "2019-06-13T02:00:00.000+02:00",
      "preseance": "8",
      "nominPrincipale": "1",
      "infosQualite": {
        "codeQualite": "Vice-Président",
        "libQualite": "Vice-président",
        "libQualiteSex": "Vice-présidente"
      },
      "organesRefs": [
        "PO419610"
      ]
    },
    {
      "xsiType": "MandatSimple_Type",
      "uid": "PM766573",
      "acteurRef": "PA342415",
      "legislature": "15",
      "typeOrgane": "CMP",
      "dateDebut": "2019-07-18T02:00:00.000+02:00",
      "datePublication": "2019-07-19T02:00:00.000+02:00",
      "dateFin": "2019-09-26T02:00:00.000+02:00",
      "preseance": "28",
      "nominPrincipale": "1",
      "infosQualite": {
        "codeQualite": "Suppléant",
        "libQualite": "Membre suppléant",
        "libQualiteSex": "Membre suppléante"
      },
      "organesRefs": [
        "PO766528"
      ]
    },
    {
      "xsiType": "MandatSimple_Type",
      "uid": "PM766773",
      "acteurRef": "PA342415",
      "legislature": "15",
      "typeOrgane": "CNPS",
      "dateDebut": "2019-07-24T02:00:00.000+02:00",
      "datePublication": "2019-07-25T02:00:00.000+02:00",
      "preseance": "20",
      "nominPrincipale": "0",
      "infosQualite": {
        "codeQualite": "Membre",
        "libQualite": "Membre",
        "libQualiteSex": "Membre"
      },
      "organesRefs": [
        "PO766718"
      ]
    },
    {
      "xsiType": "MandatSimple_Type",
      "uid": "PM766847",
      "acteurRef": "PA342415",
      "legislature": "15",
      "typeOrgane": "CNPS",
      "dateDebut": "2019-07-25T02:00:00.000+02:00",
      "datePublication": "2019-07-26T02:00:00.000+02:00",
      "preseance": "14",
      "nominPrincipale": "1",
      "infosQualite": {
        "codeQualite": "Secrétaire",
        "libQualite": "Secrétaire",
        "libQualiteSex": "Secrétaire"
      },
      "organesRefs": [
        "PO766718"
      ]
    }
  ]
}