{
  "uid": "PO675818",
  "codeType": "GA",
  "libelle": "France-Maurice",
  "libelleEdition": "de France-Maurice",
  "libelleAbrege": "Maurice",
  "libelleAbrev": "MAUR",
  "viMoDe": {
    "dateAgrement": "2012-07-18T02:00:00.000+02:00",
    "dateFin": "2017-06-20T02:00:00.000+02:00"
  },
  "regime": "5ème République",
  "legislature": "14",
  "secretariat": {}
}