{
  "uid": "PA719080",
  "etatCivil": {
    "ident": {
      "civ": "Mme",
      "prenom": "Sandra",
      "nom": "Marsaud",
      "alpha": "Marsaud",
      "trigramme": "SMR"
    },
    "infoNaissance": {
      "dateNais": "1974-01-02T01:00:00.000+01:00",
      "villeNais": "Périgueux",
      "depNais": "Dordogne",
      "paysNais": "France"
    }
  },
  "profession": {
    "libelleCourant": "Cadre (entreprises publiques)",
    "socProcInsee": {
      "catSocPro": "Cadres d'entreprise",
      "famSocPro": "Cadres et professions intellectuelles supérieures"
    }
  },
  "uriHatvp": "https://www.hatvp.fr/pages_nominatives/marsaud-sandra",
  "adresses": [
    {
      "xsiType": "AdressePostale_Type",
      "uid": "AD719082",
      "type": "0",
      "typeLibelle": "Adresse officielle",
      "poids": "1",
      "intitule": "Assemblée nationale,",
      "numeroRue": "126",
      "nomRue": "Rue de l'Université,",
      "codePostal": "75355",
      "ville": "Paris 07 SP"
    },
    {
      "xsiType": "AdresseSiteWeb_Type",
      "uid": "AD725130",
      "type": "25",
      "typeLibelle": "Facebook",
      "valElec": "sandramarsaudlarepubliquenmarche"
    },
    {
      "xsiType": "AdresseMail_Type",
      "uid": "AD728002",
      "type": "15",
      "typeLibelle": "Mèl",
      "valElec": "sandra.marsaud@assemblee-nationale.fr"
    },
    {
      "xsiType": "AdressePostale_Type",
      "uid": "AD734939",
      "type": "2",
      "typeLibelle": "Adresse publiée de circonscription",
      "poids": "22",
      "intitule": "Permanence parlementaire",
      "numeroRue": "2",
      "nomRue": "Place de l'ancien Marché",
      "complementAdresse": "BP 90117",
      "codePostal": "16200",
      "ville": "Jarnac"
    }
  ],
  "mandats": [
    {
      "xsiType": "MandatParlementaire_type",
      "uid": "PM722554",
      "acteurRef": "PA719080",
      "legislature": "15",
      "typeOrgane": "ASSEMBLEE",
      "dateDebut": "2017-06-18T02:00:00.000+02:00",
      "preseance": "50",
      "nominPrincipale": "1",
      "infosQualite": {
        "codeQualite": "membre",
        "libQualite": "membre",
        "libQualiteSex": "membre"
      },
      "organesRefs": [
        "PO717460"
      ],
      "suppleant": {
        "dateDebut": "2017-06-18T02:00:00.000+02:00",
        "suppleantRef": "PA719084"
      },
      "election": {
        "lieu": {
          "region": "Nouvelle-Aquitaine",
          "regionType": "Métropolitain",
          "departement": "Charente",
          "numDepartement": "16",
          "numCirco": "2"
        },
        "causeMandat": "élections générales",
        "refCirconscription": "PO717578"
      },
      "mandature": {
        "datePriseFonction": "2017-06-21T02:00:00.000+02:00",
        "premiereElection": "0",
        "placeHemicycle": "372"
      },
      "collaborateurs": [
        {
          "qualite": "Mme",
          "prenom": "Anne-Céline",
          "nom": "Py"
        },
        {
          "qualite": "Mme",
          "prenom": "Julie",
          "nom": "Courtemanche"
        }
      ]
    },
    {
      "xsiType": "MandatSimple_Type",
      "uid": "PM724318",
      "acteurRef": "PA719080",
      "legislature": "15",
      "typeOrgane": "GP",
      "dateDebut": "2017-06-21T02:00:00.000+02:00",
      "dateFin": "2017-06-26T02:00:00.000+02:00",
      "preseance": "28",
      "nominPrincipale": "1",
      "infosQualite": {
        "codeQualite": "Député non-inscrit",
        "libQualite": "Député non-inscrit",
        "libQualiteSex": "Députée non-inscrite"
      },
      "organesRefs": [
        "PO723569"
      ]
    },
    {
      "xsiType": "MandatSimple_Type",
      "uid": "PM731009",
      "acteurRef": "PA719080",
      "legislature": "15",
      "typeOrgane": "GP",
      "dateDebut": "2017-06-27T02:00:00.000+02:00",
      "datePublication": "2017-06-28T02:00:00.000+02:00",
      "preseance": "20",
      "nominPrincipale": "1",
      "infosQualite": {
        "codeQualite": "Membre",
        "libQualite": "Membre du",
        "libQualiteSex": "Membre du"
      },
      "organesRefs": [
        "PO730964"
      ]
    },
    {
      "xsiType": "MandatSimple_Type",
      "uid": "PM732076",
      "acteurRef": "PA719080",
      "legislature": "15",
      "typeOrgane": "COMPER",
      "dateDebut": "2017-06-29T02:00:00.000+02:00",
      "datePublication": "2017-06-29T02:00:00.000+02:00",
      "preseance": "32",
      "nominPrincipale": "1",
      "infosQualite": {
        "codeQualite": "Membre",
        "libQualite": "Membre",
        "libQualiteSex": "Membre"
      },
      "organesRefs": [
        "PO419865"
      ]
    },
    {
      "xsiType": "MandatSimple_Type",
      "uid": "PM740306",
      "acteurRef": "PA719080",
      "legislature": "15",
      "typeOrgane": "GA",
      "dateDebut": "2017-10-13T02:00:00.000+02:00",
      "preseance": "20",
      "nominPrincipale": "0",
      "infosQualite": {
        "codeQualite": "Membre",
        "libQualite": "Membre",
        "libQualiteSex": "Membre"
      },
      "organesRefs": [
        "PO732949"
      ]
    },
    {
      "xsiType": "MandatSimple_Type",
      "uid": "PM740307",
      "acteurRef": "PA719080",
      "legislature": "15",
      "typeOrgane": "GA",
      "dateDebut": "2017-10-13T02:00:00.000+02:00",
      "preseance": "20",
      "nominPrincipale": "1",
      "infosQualite": {
        "codeQualite": "Membre",
        "libQualite": "Membre",
        "libQualiteSex": "Membre"
      },
      "organesRefs": [
        "PO733102"
      ]
    },
    {
      "xsiType": "MandatSimple_Type",
      "uid": "PM740308",
      "acteurRef": "PA719080",
      "legislature": "15",
      "typeOrgane": "GA",
      "dateDebut": "2017-10-13T02:00:00.000+02:00",
      "preseance": "20",
      "nominPrincipale": "1",
      "infosQualite": {
        "codeQualite": "Membre",
        "libQualite": "Membre",
        "libQualiteSex": "Membre"
      },
      "organesRefs": [
        "PO733642"
      ]
    },
    {
      "xsiType": "MandatSimple_Type",
      "uid": "PM742335",
      "acteurRef": "PA719080",
      "legislature": "15",
      "typeOrgane": "GA",
      "dateDebut": "2017-10-26T02:00:00.000+02:00",
      "preseance": "8",
      "nominPrincipale": "1",
      "infosQualite": {
        "codeQualite": "Vice-Président",
        "libQualite": "Vice-Président",
        "libQualiteSex": "Vice-Présidente"
      },
      "organesRefs": [
        "PO732949"
      ]
    },
    {
      "xsiType": "MandatSimple_Type",
      "uid": "PM745243",
      "acteurRef": "PA719080",
      "typeOrgane": "PARPOL",
      "dateDebut": "2017-12-01T01:00:00.000+01:00",
      "dateFin": "2018-11-30T01:00:00.000+01:00",
      "preseance": "5",
      "nominPrincipale": "1",
      "infosQualite": {
        "codeQualite": "Membre",
        "libQualite": "Membre",
        "libQualiteSex": "Membre"
      },
      "organesRefs": [
        "PO744854"
      ]
    },
    {
      "xsiType": "MandatSimple_Type",
      "uid": "PM746064",
      "acteurRef": "PA719080",
      "legislature": "15",
      "typeOrgane": "ORGEXTPARL",
      "dateDebut": "2017-12-01T01:00:00.000+01:00",
      "datePublication": "2017-12-02T01:00:00.000+01:00",
      "preseance": "20",
      "nominPrincipale": "1",
      "infosQualite": {
        "codeQualite": "Titulaire",
        "libQualite": "Membre titulaire",
        "libQualiteSex": "Membre titulaire"
      },
      "organesRefs": [
        "PO60214"
      ]
    },
    {
      "xsiType": "MandatSimple_Type",
      "uid": "PM747883",
      "acteurRef": "PA719080",
      "legislature": "15",
      "typeOrgane": "ORGEXTPARL",
      "dateDebut": "2018-01-10T01:00:00.000+01:00",
      "datePublication": "2018-01-11T01:00:00.000+01:00",
      "preseance": "20",
      "nominPrincipale": "1",
      "infosQualite": {
        "codeQualite": "Titulaire",
        "libQualite": "Membre titulaire",
        "libQualiteSex": "Membre titulaire"
      },
      "organesRefs": [
        "PO717436"
      ]
    },
    {
      "xsiType": "MandatMission_Type",
      "uid": "PM749070",
      "acteurRef": "PA719080",
      "legislature": "15",
      "typeOrgane": "MISINFOCOM",
      "dateDebut": "2018-02-08T01:00:00.000+01:00",
      "datePublication": "2018-02-08T01:00:00.000+01:00",
      "dateFin": "2018-12-05T01:00:00.000+01:00",
      "preseance": "20",
      "nominPrincipale": "1",
      "infosQualite": {
        "codeQualite": "Membre",
        "libQualite": "Membre",
        "libQualiteSex": "Membre"
      },
      "organesRefs": [
        "PO749043"
      ]
    },
    {
      "xsiType": "MandatSimple_Type",
      "uid": "PM750442",
      "acteurRef": "PA719080",
      "legislature": "15",
      "typeOrgane": "GE",
      "dateDebut": "2018-02-08T01:00:00.000+01:00",
      "preseance": "20",
      "nominPrincipale": "1",
      "infosQualite": {
        "codeQualite": "Membre",
        "libQualite": "Membre",
        "libQualiteSex": "Membre"
      },
      "organesRefs": [
        "PO747266"
      ]
    },
    {
      "xsiType": "MandatSimple_Type",
      "uid": "PM750464",
      "acteurRef": "PA719080",
      "legislature": "15",
      "typeOrgane": "GE",
      "dateDebut": "2018-02-14T01:00:00.000+01:00",
      "preseance": "20",
      "nominPrincipale": "1",
      "infosQualite": {
        "codeQualite": "Membre",
        "libQualite": "Membre",
        "libQualiteSex": "Membre"
      },
      "organesRefs": [
        "PO746972"
      ]
    },
    {
      "xsiType": "MandatSimple_Type",
      "uid": "PM750542",
      "acteurRef": "PA719080",
      "legislature": "15",
      "typeOrgane": "GE",
      "dateDebut": "2018-02-12T01:00:00.000+01:00",
      "preseance": "20",
      "nominPrincipale": "1",
      "infosQualite": {
        "codeQualite": "Membre",
        "libQualite": "Membre",
        "libQualiteSex": "Membre"
      },
      "organesRefs": [
        "PO746977"
      ]
    },
    {
      "xsiType": "MandatSimple_Type",
      "uid": "PM750931",
      "acteurRef": "PA719080",
      "legislature": "15",
      "typeOrgane": "GE",
      "dateDebut": "2018-02-19T01:00:00.000+01:00",
      "preseance": "20",
      "nominPrincipale": "0",
      "infosQualite": {
        "codeQualite": "Membre",
        "libQualite": "Membre",
        "libQualiteSex": "Membre"
      },
      "organesRefs": [
        "PO746880"
      ]
    },
    {
      "xsiType": "MandatSimple_Type",
      "uid": "PM751694",
      "acteurRef": "PA719080",
      "legislature": "15",
      "typeOrgane": "GE",
      "dateDebut": "2018-02-22T01:00:00.000+01:00",
      "preseance": "20",
      "nominPrincipale": "1",
      "infosQualite": {
        "codeQualite": "Membre",
        "libQualite": "Membre",
        "libQualiteSex": "Membre"
      },
      "organesRefs": [
        "PO746857"
      ]
    },
    {
      "xsiType": "MandatSimple_Type",
      "uid": "PM751698",
      "acteurRef": "PA719080",
      "legislature": "15",
      "typeOrgane": "GE",
      "dateDebut": "2018-02-22T01:00:00.000+01:00",
      "preseance": "20",
      "nominPrincipale": "1",
      "infosQualite": {
        "codeQualite": "Membre",
        "libQualite": "Membre",
        "libQualiteSex": "Membre"
      },
      "organesRefs": [
        "PO746669"
      ]
    },
    {
      "xsiType": "MandatSimple_Type",
      "uid": "PM752114",
      "acteurRef": "PA719080",
      "legislature": "15",
      "typeOrgane": "GE",
      "dateDebut": "2018-02-27T01:00:00.000+01:00",
      "preseance": "20",
      "nominPrincipale": "0",
      "infosQualite": {
        "codeQualite": "Membre",
        "libQualite": "Membre",
        "libQualiteSex": "Membre"
      },
      "organesRefs": [
        "PO747251"
      ]
    },
    {
      "xsiType": "MandatSimple_Type",
      "uid": "PM753994",
      "acteurRef": "PA719080",
      "legislature": "15",
      "typeOrgane": "GE",
      "dateDebut": "2018-03-14T01:00:00.000+01:00",
      "preseance": "12",
      "nominPrincipale": "1",
      "infosQualite": {
        "codeQualite": "Secrétaire",
        "libQualite": "Secrétaire",
        "libQualiteSex": "Secrétaire"
      },
      "organesRefs": [
        "PO746880"
      ]
    },
    {
      "xsiType": "MandatSimple_Type",
      "uid": "PM754861",
      "acteurRef": "PA719080",
      "legislature": "15",
      "typeOrgane": "GE",
      "dateDebut": "2018-03-02T01:00:00.000+01:00",
      "preseance": "20",
      "nominPrincipale": "1",
      "infosQualite": {
        "codeQualite": "Membre",
        "libQualite": "Membre",
        "libQualiteSex": "Membre"
      },
      "organesRefs": [
        "PO746852"
      ]
    },
    {
      "xsiType": "MandatSimple_Type",
      "uid": "PM755541",
      "acteurRef": "PA719080",
      "legislature": "15",
      "typeOrgane": "GE",
      "dateDebut": "2018-04-17T02:00:00.000+02:00",
      "preseance": "8",
      "nominPrincipale": "1",
      "infosQualite": {
        "codeQualite": "Vice-Président",
        "libQualite": "Vice-Président",
        "libQualiteSex": "Vice-Présidente"
      },
      "organesRefs": [
        "PO747251"
      ]
    },
    {
      "xsiType": "MandatSimple_Type",
      "uid": "PM758919",
      "acteurRef": "PA719080",
      "legislature": "15",
      "typeOrgane": "CMP",
      "dateDebut": "2018-09-13T02:00:00.000+02:00",
      "datePublication": "2018-09-14T02:00:00.000+02:00",
      "dateFin": "2018-10-16T02:00:00.000+02:00",
      "preseance": "28",
      "nominPrincipale": "1",
      "infosQualite": {
        "codeQualite": "Suppléant",
        "libQualite": "Membre suppléant",
        "libQualiteSex": "Membre suppléante"
      },
      "organesRefs": [
        "PO758352"
      ]
    },
    {
      "xsiType": "MandatMission_Type",
      "uid": "PM759333",
      "acteurRef": "PA719080",
      "legislature": "15",
      "typeOrgane": "MISINFO",
      "dateDebut": "2018-07-18T02:00:00.000+02:00",
      "preseance": "10",
      "nominPrincipale": "1",
      "infosQualite": {
        "codeQualite": "Membre",
        "libQualite": "Membre",
        "libQualiteSex": "Membre"
      },
      "organesRefs": [
        "PO758945"
      ]
    },
    {
      "xsiType": "MandatSimple_Type",
      "uid": "PM760157",
      "acteurRef": "PA719080",
      "legislature": "15",
      "typeOrgane": "GA",
      "dateDebut": "2018-11-08T01:00:00.000+01:00",
      "preseance": "20",
      "nominPrincipale": "1",
      "infosQualite": {
        "codeQualite": "Membre",
        "libQualite": "Membre",
        "libQualiteSex": "Membre"
      },
      "organesRefs": [
        "PO733172"
      ]
    },
    {
      "xsiType": "MandatSimple_Type",
      "uid": "PM760158",
      "acteurRef": "PA719080",
      "legislature": "15",
      "typeOrgane": "GA",
      "dateDebut": "2018-11-08T01:00:00.000+01:00",
      "preseance": "20",
      "nominPrincipale": "1",
      "infosQualite": {
        "codeQualite": "Membre",
        "libQualite": "Membre",
        "libQualiteSex": "Membre"
      },
      "organesRefs": [
        "PO733197"
      ]
    },
    {
      "xsiType": "MandatSimple_Type",
      "uid": "PM760206",
      "acteurRef": "PA719080",
      "legislature": "15",
      "typeOrgane": "CNPS",
      "dateDebut": "2018-11-13T01:00:00.000+01:00",
      "datePublication": "2018-11-14T01:00:00.000+01:00",
      "dateFin": "2019-01-17T01:00:00.000+01:00",
      "preseance": "20",
      "nominPrincipale": "1",
      "infosQualite": {
        "codeQualite": "Membre",
        "libQualite": "Membre",
        "libQualiteSex": "Membre"
      },
      "organesRefs": [
        "PO760148"
      ]
    },
    {
      "xsiType": "MandatSimple_Type",
      "uid": "PM764963",
      "acteurRef": "PA719080",
      "legislature": "15",
      "typeOrgane": "GE",
      "dateDebut": "2019-05-06T02:00:00.000+02:00",
      "preseance": "20",
      "nominPrincipale": "1",
      "infosQualite": {
        "codeQualite": "Membre",
        "libQualite": "Membre",
        "libQualiteSex": "Membre"
      },
      "organesRefs": [
        "PO747104"
      ]
    },
    {
      "xsiType": "MandatSimple_Type",
      "uid": "PM765176",
      "acteurRef": "PA719080",
      "legislature": "15",
      "typeOrgane": "GE",
      "dateDebut": "2019-05-20T02:00:00.000+02:00",
      "preseance": "20",
      "nominPrincipale": "1",
      "infosQualite": {
        "codeQualite": "Membre",
        "libQualite": "Membre",
        "libQualiteSex": "Membre"
      },
      "organesRefs": [
        "PO763244"
      ]
    },
    {
      "xsiType": "MandatSimple_Type",
      "uid": "PM765739",
      "acteurRef": "PA719080",
      "legislature": "15",
      "typeOrgane": "CNPE",
      "dateDebut": "2019-06-13T02:00:00.000+02:00",
      "datePublication": "2019-06-14T02:00:00.000+02:00",
      "preseance": "20",
      "nominPrincipale": "1",
      "infosQualite": {
        "codeQualite": "Membre",
        "libQualite": "Membre",
        "libQualiteSex": "Membre"
      },
      "organesRefs": [
        "PO765498"
      ]
    },
    {
      "xsiType": "MandatMission_Type",
      "uid": "PM767358",
      "acteurRef": "PA719080",
      "legislature": "15",
      "typeOrgane": "MISINFO",
      "dateDebut": "2019-10-02T02:00:00.000+02:00",
      "preseance": "10",
      "nominPrincipale": "1",
      "infosQualite": {
        "codeQualite": "Membre",
        "libQualite": "Membre",
        "libQualiteSex": "Membre"
      },
      "organesRefs": [
        "PO767135"
      ]
    }
  ]
}