{
  "uid": "PO746674",
  "codeType": "GE",
  "libelle": "Cheval",
  "libelleEdition": "CHEVAL",
  "libelleAbrege": "CHEVAL",
  "libelleAbrev": "CHEVAL",
  "viMoDe": {
    "dateAgrement": "2017-12-20T01:00:00.000+01:00"
  },
  "regime": "5ème République",
  "legislature": "15",
  "secretariat": {
    "secretaire01": "M. Théodore Bidgrain",
    "secretaire02": "Mme Marie Wencker"
  }
}