{
  "xsiType": "OrganeParlementaire_Type",
  "uid": "PO757134",
  "codeType": "CNPS",
  "libelle": "Commission spéciale chargée d'examiner le projet de loi relatif à la croissance et la transformation des entreprises",
  "libelleEdition": "de la commission spéciale chargée d'examiner le projet de loi relatif à la croissance et la transformation des entreprises",
  "libelleAbrege": "Commission spéciale sur la croissance et la transformation des entreprises",
  "libelleAbrev": "CSPACTE",
  "viMoDe": {
    "dateDebut": "2018-06-19T02:00:00.000+02:00",
    "dateFin": "2019-04-11T02:00:00.000+02:00"
  },
  "regime": "5ème République",
  "legislature": "15",
  "secretariat": {}
}