{
  "xsiType": "OrganeExtraParlementaire_type",
  "uid": "PO230231",
  "codeType": "ORGEXTPARL",
  "libelle": "Conférence permanente \"habitat-construction-développement durable\"",
  "libelleEdition": "de la Conférence permanente \"habitat-construction-développement durable\"",
  "libelleAbrege": "Habitat-construction-développement durable",
  "libelleAbrev": "184",
  "viMoDe": {
    "dateDebut": "2002-04-09T02:00:00.000+02:00",
    "dateFin": "2008-07-21T02:00:00.000+02:00"
  },
  "regime": "5ème République",
  "regimeJuridique": "décret 2002-484 du 9 avril 2002 (art.4)"
}