{
  "uid": "PA2420",
  "etatCivil": {
    "ident": {
      "civ": "M.",
      "prenom": "Xavier",
      "nom": "Pintat",
      "alpha": "PINTAT XAVIER"
    },
    "infoNaissance": {
      "dateNais": "1954-03-15T01:00:00.000+01:00",
      "villeNais": "Bordeaux",
      "depNais": "Gironde"
    }
  },
  "profession": {
    "libelleCourant": "Ingénieur  au CEA",
    "socProcInsee": {
      "catSocPro": "Cadres d'entreprise",
      "famSocPro": "Cadres et professions intellectuelles supérieures"
    }
  },
  "adresses": [
    {
      "xsiType": "AdressePostale_Type",
      "uid": "AD44390",
      "type": "0",
      "typeLibelle": "Adresse officielle",
      "poids": "1",
      "intitule": "Casier de la Poste,",
      "complementAdresse": "Palais Bourbon,",
      "codePostal": "75355",
      "ville": "Paris 07 SP"
    },
    {
      "xsiType": "AdressePostale_Type",
      "uid": "AD44394",
      "type": "2",
      "typeLibelle": "Adresse publiée de circonscription",
      "poids": "21",
      "intitule": "Cabinet du Maire,",
      "codePostal": "33780",
      "ville": "Soulac-Sur-Mer"
    },
    {
      "xsiType": "AdresseTelephonique_Type",
      "uid": "AD47347",
      "type": "11",
      "typeLibelle": "Téléphone",
      "poids": "21",
      "adresseDeRattachement": "AD44394",
      "valElec": "05 56 73 29 03"
    },
    {
      "xsiType": "AdresseTelephonique_Type",
      "uid": "AD49229",
      "type": "12",
      "typeLibelle": "Télécopie",
      "poids": "21",
      "adresseDeRattachement": "AD44394",
      "valElec": "05 56 09 70 85"
    },
    {
      "xsiType": "AdresseSiteWeb_Type",
      "uid": "AD317636",
      "type": "23",
      "typeLibelle": "Url sénateur",
      "valElec": "https://www.senat.fr/senateur/pintat_xavier98021n.html"
    }
  ],
  "mandats": [
    {
      "xsiType": "MandatParlementaire_type",
      "uid": "PM89530",
      "acteurRef": "PA2420",
      "typeOrgane": "SENAT",
      "dateDebut": "1998-10-01T02:00:00.000+02:00",
      "datePublication": "1998-10-02T02:00:00.000+02:00",
      "dateFin": "2008-09-30T02:00:00.000+02:00",
      "preseance": "20",
      "nominPrincipale": "1",
      "infosQualite": {
        "codeQualite": "Sénateur",
        "libQualite": "SENATEUR",
        "libQualiteSex": "SENATEUR"
      },
      "organesRefs": [
        "PO78718"
      ],
      "election": {
        "lieu": {
          "numDepartement": "33"
        }
      },
      "mandature": {
        "premiereElection": "0"
      }
    },
    {
      "xsiType": "MandatSimple_Type",
      "uid": "PM229151",
      "acteurRef": "PA2420",
      "typeOrgane": "API",
      "dateDebut": "2001-12-12T01:00:00.000+01:00",
      "dateFin": "2007-07-25T02:00:00.000+02:00",
      "preseance": "20",
      "nominPrincipale": "1",
      "infosQualite": {
        "codeQualite": "Membre",
        "libQualite": "Membre",
        "libQualiteSex": "Membre"
      },
      "organesRefs": [
        "PO58976"
      ]
    },
    {
      "xsiType": "MandatSimple_Type",
      "uid": "PM275649",
      "acteurRef": "PA2420",
      "typeOrgane": "API",
      "dateDebut": "2002-07-31T02:00:00.000+02:00",
      "dateFin": "2007-07-25T02:00:00.000+02:00",
      "preseance": "4",
      "nominPrincipale": "1",
      "infosQualite": {
        "codeQualite": "Vice-Président",
        "libQualite": "Vice-Président",
        "libQualiteSex": "Vice-Président"
      },
      "organesRefs": [
        "PO58976"
      ]
    },
    {
      "xsiType": "MandatSimple_Type",
      "uid": "PM286553",
      "acteurRef": "PA2420",
      "typeOrgane": "GROUPESENAT",
      "dateDebut": "2002-12-11T01:00:00.000+01:00",
      "datePublication": "2002-12-11T01:00:00.000+01:00",
      "dateFin": "2017-09-30T02:00:00.000+02:00",
      "preseance": "4",
      "nominPrincipale": "1",
      "infosQualite": {
        "codeQualite": "Membre",
        "libQualite": "Membre",
        "libQualiteSex": "Membre"
      },
      "organesRefs": [
        "PO286005"
      ]
    },
    {
      "xsiType": "MandatSimple_Type",
      "uid": "PM288098",
      "acteurRef": "PA2420",
      "typeOrgane": "API",
      "dateDebut": "2002-07-30T02:00:00.000+02:00",
      "dateFin": "2008-09-30T02:00:00.000+02:00",
      "preseance": "20",
      "nominPrincipale": "1",
      "infosQualite": {
        "codeQualite": "Membre",
        "libQualite": "Membre",
        "libQualiteSex": "Membre"
      },
      "organesRefs": [
        "PO206064"
      ]
    },
    {
      "xsiType": "MandatSimple_Type",
      "uid": "PM320626",
      "acteurRef": "PA2420",
      "typeOrgane": "COMSENAT",
      "dateDebut": "2001-10-03T02:00:00.000+02:00",
      "dateFin": "2011-09-30T02:00:00.000+02:00",
      "preseance": "10",
      "nominPrincipale": "1",
      "infosQualite": {
        "codeQualite": "Membre",
        "libQualite": "Membre",
        "libQualiteSex": "Membre"
      },
      "organesRefs": [
        "PO211491"
      ]
    },
    {
      "xsiType": "MandatSimple_Type",
      "uid": "PM394045",
      "acteurRef": "PA2420",
      "typeOrgane": "API",
      "dateDebut": "2007-07-25T02:00:00.000+02:00",
      "dateFin": "2008-09-30T02:00:00.000+02:00",
      "preseance": "20",
      "nominPrincipale": "0",
      "infosQualite": {
        "codeQualite": "Membre",
        "libQualite": "Membre",
        "libQualiteSex": "Membre"
      },
      "organesRefs": [
        "PO58976"
      ]
    },
    {
      "xsiType": "MandatSimple_Type",
      "uid": "PM394052",
      "acteurRef": "PA2420",
      "typeOrgane": "API",
      "dateDebut": "2007-07-25T02:00:00.000+02:00",
      "dateFin": "2008-09-30T02:00:00.000+02:00",
      "preseance": "4",
      "nominPrincipale": "1",
      "infosQualite": {
        "codeQualite": "Vice-Président",
        "libQualite": "Vice-Président",
        "libQualiteSex": "Vice-Président"
      },
      "organesRefs": [
        "PO58976"
      ]
    },
    {
      "xsiType": "MandatParlementaire_type",
      "uid": "PM415540",
      "acteurRef": "PA2420",
      "typeOrgane": "SENAT",
      "dateDebut": "2008-10-01T02:00:00.000+02:00",
      "dateFin": "2014-09-30T02:00:00.000+02:00",
      "preseance": "20",
      "nominPrincipale": "1",
      "infosQualite": {
        "codeQualite": "Sénateur",
        "libQualite": "SENATEUR",
        "libQualiteSex": "SENATEUR"
      },
      "organesRefs": [
        "PO78718"
      ],
      "election": {
        "lieu": {
          "numDepartement": "33"
        }
      },
      "mandature": {
        "premiereElection": "0"
      }
    },
    {
      "xsiType": "MandatAvecSuppleant_Type",
      "uid": "PM416578",
      "acteurRef": "PA2420",
      "typeOrgane": "OFFPAR",
      "dateDebut": "2008-11-04T01:00:00.000+01:00",
      "datePublication": "2008-11-05T01:00:00.000+01:00",
      "dateFin": "2011-09-30T02:00:00.000+02:00",
      "preseance": "24",
      "nominPrincipale": "1",
      "infosQualite": {
        "codeQualite": "Membre",
        "libQualite": "Membre",
        "libQualiteSex": "Membre"
      },
      "organesRefs": [
        "PO273589"
      ]
    },
    {
      "xsiType": "MandatSimple_Type",
      "uid": "PM418152",
      "acteurRef": "PA2420",
      "typeOrgane": "API",
      "dateDebut": "2009-01-14T01:00:00.000+01:00",
      "dateFin": "2011-12-15T01:00:00.000+01:00",
      "preseance": "20",
      "nominPrincipale": "0",
      "infosQualite": {
        "codeQualite": "Membre",
        "libQualite": "Membre",
        "libQualiteSex": "Membre"
      },
      "organesRefs": [
        "PO58976"
      ]
    },
    {
      "xsiType": "MandatSimple_Type",
      "uid": "PM418155",
      "acteurRef": "PA2420",
      "typeOrgane": "API",
      "dateDebut": "2009-01-14T01:00:00.000+01:00",
      "dateFin": "2011-12-15T01:00:00.000+01:00",
      "preseance": "4",
      "nominPrincipale": "1",
      "infosQualite": {
        "codeQualite": "Vice-Président",
        "libQualite": "Vice-Président",
        "libQualiteSex": "Vice-Président"
      },
      "organesRefs": [
        "PO58976"
      ]
    },
    {
      "xsiType": "MandatSimple_Type",
      "uid": "PM430420",
      "acteurRef": "PA2420",
      "typeOrgane": "COMSENAT",
      "dateDebut": "2011-10-01T02:00:00.000+02:00",
      "dateFin": "2014-10-07T02:00:00.000+02:00",
      "nominPrincipale": "1",
      "infosQualite": {
        "libQualite": "Vice-Président",
        "libQualiteSex": "Vice-Président"
      },
      "organesRefs": [
        "PO211491"
      ]
    },
    {
      "xsiType": "MandatSimple_Type",
      "uid": "PM684607",
      "acteurRef": "PA2420",
      "typeOrgane": "API",
      "dateDebut": "2012-07-31T02:00:00.000+02:00",
      "dateFin": "2014-09-30T02:00:00.000+02:00",
      "preseance": "20",
      "nominPrincipale": "1",
      "infosQualite": {
        "codeQualite": "Titulaire",
        "libQualite": "Membre titulaire",
        "libQualiteSex": "Membre titulaire"
      },
      "organesRefs": [
        "PO58974"
      ]
    },
    {
      "xsiType": "MandatParlementaire_type",
      "uid": "PM703661",
      "acteurRef": "PA2420",
      "typeOrgane": "SENAT",
      "dateDebut": "2014-10-01T02:00:00.000+02:00",
      "dateFin": "2017-09-30T02:00:00.000+02:00",
      "preseance": "20",
      "nominPrincipale": "1",
      "infosQualite": {
        "codeQualite": "Sénateur",
        "libQualite": "SENATEUR",
        "libQualiteSex": "SENATEUR"
      },
      "organesRefs": [
        "PO78718"
      ],
      "election": {
        "lieu": {
          "numDepartement": "33"
        }
      },
      "mandature": {
        "premiereElection": "0"
      }
    },
    {
      "xsiType": "MandatSimple_Type",
      "uid": "PM704104",
      "acteurRef": "PA2420",
      "typeOrgane": "COMSENAT",
      "dateDebut": "2014-10-08T02:00:00.000+02:00",
      "dateFin": "2014-10-08T02:00:00.000+02:00",
      "preseance": "10",
      "nominPrincipale": "1",
      "infosQualite": {
        "codeQualite": "Membre",
        "libQualite": "Membre",
        "libQualiteSex": "Membre"
      },
      "organesRefs": [
        "PO211491"
      ]
    },
    {
      "xsiType": "MandatSimple_Type",
      "uid": "PM704255",
      "acteurRef": "PA2420",
      "typeOrgane": "COMSENAT",
      "dateDebut": "2014-10-09T02:00:00.000+02:00",
      "dateFin": "2017-09-30T02:00:00.000+02:00",
      "nominPrincipale": "1",
      "infosQualite": {
        "libQualite": "Vice-Président",
        "libQualiteSex": "Vice-Président"
      },
      "organesRefs": [
        "PO211491"
      ]
    },
    {
      "xsiType": "MandatSimple_Type",
      "uid": "PM705680",
      "acteurRef": "PA2420",
      "typeOrgane": "API",
      "dateDebut": "2014-10-01T02:00:00.000+02:00",
      "dateFin": "2017-09-30T02:00:00.000+02:00",
      "preseance": "20",
      "nominPrincipale": "1",
      "infosQualite": {
        "codeQualite": "Titulaire",
        "libQualite": "Membre titulaire",
        "libQualiteSex": "Membre titulaire"
      },
      "organesRefs": [
        "PO58974"
      ]
    },
    {
      "xsiType": "MandatSimple_Type",
      "uid": "PM708974",
      "acteurRef": "PA2420",
      "typeOrgane": "CMP",
      "dateDebut": "2015-07-10T02:00:00.000+02:00",
      "datePublication": "2015-07-11T02:00:00.000+02:00",
      "dateFin": "2015-07-16T02:00:00.000+02:00",
      "preseance": "28",
      "nominPrincipale": "1",
      "infosQualite": {
        "codeQualite": "Suppléant",
        "libQualite": "Membre suppléant",
        "libQualiteSex": "Membre suppléant"
      },
      "organesRefs": [
        "PO708945"
      ]
    }
  ]
}