{
  "xsiType": "OrganeParlementaireInternational",
  "uid": "PO675716",
  "codeType": "GA",
  "libelle": "France-Turquie",
  "libelleEdition": "de France-Turquie",
  "libelleAbrege": "Turquie",
  "libelleAbrev": "TURQ",
  "viMoDe": {
    "dateAgrement": "2012-07-18T02:00:00.000+02:00",
    "dateFin": "2017-06-20T02:00:00.000+02:00"
  },
  "regime": "5ème République",
  "legislature": "14",
  "secretariat": {}
}