{
  "xsiType": "OrganeParlementaire_Type",
  "uid": "PO695808",
  "codeType": "CMP",
  "libelle": "Commission mixte paritaire chargée de proposer un texte commun sur les dispositions restant en discussion du projet de loi de règlement du budget et d'approbation des comptes de l'année 2012",
  "libelleEdition": "du projet de loi de règlement du budget et d'approbation des comptes de l'année 2012",
  "libelleAbrege": "Règlement du budget 2012",
  "libelleAbrev": "1083",
  "viMoDe": {
    "dateDebut": "2013-07-05T02:00:00.000+02:00",
    "dateFin": "2013-07-16T02:00:00.000+02:00"
  },
  "regime": "5ème République",
  "legislature": "14",
  "secretariat": {}
}