{
  "uid": "PA610615",
  "etatCivil": {
    "ident": {
      "civ": "M.",
      "prenom": "Ary",
      "nom": "Chalus",
      "alpha": "Chalus"
    },
    "infoNaissance": {
      "dateNais": "1961-12-06T01:00:00.000+01:00",
      "villeNais": "Pointe-à-Pitre",
      "depNais": "Guadeloupe",
      "paysNais": "France"
    }
  },
  "profession": {
    "libelleCourant": "Agent EDF",
    "socProcInsee": {
      "catSocPro": "Contremaîtres, agents de maîtrise",
      "famSocPro": "Professions Intermédiaires"
    }
  },
  "adresses": [
    {
      "xsiType": "AdressePostale_Type",
      "uid": "AD648932",
      "type": "0",
      "typeLibelle": "Adresse officielle",
      "poids": "1",
      "intitule": "Assemblée nationale",
      "numeroRue": "126",
      "nomRue": "Rue de l'Université",
      "codePostal": "75355",
      "ville": "Paris 07 SP"
    },
    {
      "xsiType": "AdresseMail_Type",
      "uid": "AD716027",
      "type": "15",
      "typeLibelle": "Mèl",
      "valElec": "ary.chalus@baiemahault.fr"
    },
    {
      "xsiType": "AdresseMail_Type",
      "uid": "AD716094",
      "type": "15",
      "typeLibelle": "Mèl",
      "valElec": "achalus@assemblee-nationale.fr"
    }
  ],
  "mandats": [
    {
      "xsiType": "MandatParlementaire_type",
      "uid": "PM645243",
      "acteurRef": "PA610615",
      "legislature": "14",
      "typeOrgane": "ASSEMBLEE",
      "dateDebut": "2012-06-20T02:00:00.000+02:00",
      "dateFin": "2017-06-20T02:00:00.000+02:00",
      "preseance": "50",
      "nominPrincipale": "1",
      "infosQualite": {
        "codeQualite": "membre",
        "libQualite": "membre",
        "libQualiteSex": "membre"
      },
      "organesRefs": [
        "PO644420"
      ],
      "suppleant": {
        "dateDebut": "2012-06-20T02:00:00.000+02:00",
        "dateFin": "2017-06-20T02:00:00.000+02:00",
        "suppleantRef": "PA643144"
      },
      "election": {
        "lieu": {
          "region": "Guadeloupe",
          "regionType": "Dom",
          "departement": "Guadeloupe",
          "numDepartement": "971",
          "numCirco": "3"
        },
        "causeMandat": "élections générales",
        "refCirconscription": "PO644978"
      },
      "mandature": {
        "datePriseFonction": "2012-06-20T02:00:00.000+02:00",
        "causeFin": "Fin de législature",
        "premiereElection": "0"
      }
    },
    {
      "xsiType": "MandatSimple_Type",
      "uid": "PM656621",
      "acteurRef": "PA610615",
      "legislature": "14",
      "typeOrgane": "GP",
      "dateDebut": "2012-06-26T02:00:00.000+02:00",
      "datePublication": "2012-06-27T02:00:00.000+02:00",
      "dateFin": "2012-07-04T02:00:00.000+02:00",
      "preseance": "28",
      "nominPrincipale": "1",
      "infosQualite": {
        "codeQualite": "Député non-inscrit",
        "libQualite": "Député non-inscrit",
        "libQualiteSex": "Député non-inscrit"
      },
      "organesRefs": [
        "PO645633"
      ]
    },
    {
      "xsiType": "MandatSimple_Type",
      "uid": "PM656865",
      "acteurRef": "PA610615",
      "legislature": "14",
      "typeOrgane": "COMPER",
      "dateDebut": "2012-06-28T02:00:00.000+02:00",
      "datePublication": "2012-06-28T02:00:00.000+02:00",
      "dateFin": "2017-06-20T02:00:00.000+02:00",
      "preseance": "32",
      "nominPrincipale": "1",
      "infosQualite": {
        "codeQualite": "Membre",
        "libQualite": "Membre",
        "libQualiteSex": "Membre"
      },
      "organesRefs": [
        "PO419604"
      ]
    },
    {
      "xsiType": "MandatSimple_Type",
      "uid": "PM665188",
      "acteurRef": "PA610615",
      "legislature": "14",
      "typeOrgane": "GP",
      "dateDebut": "2012-07-05T02:00:00.000+02:00",
      "datePublication": "2012-07-05T02:00:00.000+02:00",
      "dateFin": "2017-06-20T02:00:00.000+02:00",
      "preseance": "20",
      "nominPrincipale": "1",
      "infosQualite": {
        "codeQualite": "Membre",
        "libQualite": "Membre du",
        "libQualiteSex": "Membre du"
      },
      "organesRefs": [
        "PO656022"
      ]
    },
    {
      "xsiType": "MandatSimple_Type",
      "uid": "PM676973",
      "acteurRef": "PA610615",
      "legislature": "14",
      "typeOrgane": "DELEG",
      "dateDebut": "2012-07-25T02:00:00.000+02:00",
      "datePublication": "2012-07-25T02:00:00.000+02:00",
      "dateFin": "2017-06-20T02:00:00.000+02:00",
      "preseance": "20",
      "nominPrincipale": "1",
      "infosQualite": {
        "codeQualite": "Membre",
        "libQualite": "Membre",
        "libQualiteSex": "Membre"
      },
      "organesRefs": [
        "PO675659"
      ]
    },
    {
      "xsiType": "MandatSimple_Type",
      "uid": "PM677050",
      "acteurRef": "PA610615",
      "legislature": "14",
      "typeOrgane": "DELEG",
      "dateDebut": "2012-07-25T02:00:00.000+02:00",
      "datePublication": "2012-07-25T02:00:00.000+02:00",
      "dateFin": "2017-06-20T02:00:00.000+02:00",
      "preseance": "21",
      "nominPrincipale": "0",
      "infosQualite": {
        "codeQualite": "Membre de droit",
        "libQualite": "Membre de droit",
        "libQualiteSex": "Membre de droit"
      },
      "organesRefs": [
        "PO675659"
      ]
    },
    {
      "xsiType": "MandatSimple_Type",
      "uid": "PM677800",
      "acteurRef": "PA610615",
      "legislature": "14",
      "typeOrgane": "ORGEXTPARL",
      "dateDebut": "2012-09-03T02:00:00.000+02:00",
      "datePublication": "2012-09-04T02:00:00.000+02:00",
      "dateFin": "2017-06-20T02:00:00.000+02:00",
      "preseance": "30",
      "nominPrincipale": "1",
      "infosQualite": {
        "codeQualite": "Suppléant",
        "libQualite": "Membre suppléant",
        "libQualiteSex": "Membre suppléant"
      },
      "organesRefs": [
        "PO60174"
      ]
    },
    {
      "xsiType": "MandatSimple_Type",
      "uid": "PM685853",
      "acteurRef": "PA610615",
      "typeOrgane": "PARPOL",
      "dateDebut": "2012-12-01T01:00:00.000+01:00",
      "dateFin": "2017-06-20T02:00:00.000+02:00",
      "preseance": "5",
      "nominPrincipale": "1",
      "infosQualite": {
        "codeQualite": "Membre",
        "libQualite": "Membre",
        "libQualiteSex": "Membre"
      },
      "organesRefs": [
        "PO685851"
      ]
    },
    {
      "xsiType": "MandatSimple_Type",
      "uid": "PM688706",
      "acteurRef": "PA610615",
      "legislature": "14",
      "typeOrgane": "GE",
      "dateDebut": "2013-01-25T01:00:00.000+01:00",
      "dateFin": "2017-06-20T02:00:00.000+02:00",
      "preseance": "20",
      "nominPrincipale": "1",
      "infosQualite": {
        "codeQualite": "Membre",
        "libQualite": "Membre",
        "libQualiteSex": "Membre"
      },
      "organesRefs": [
        "PO686501"
      ]
    },
    {
      "xsiType": "MandatSimple_Type",
      "uid": "PM690464",
      "acteurRef": "PA610615",
      "legislature": "14",
      "typeOrgane": "GE",
      "dateDebut": "2013-01-23T01:00:00.000+01:00",
      "dateFin": "2017-06-20T02:00:00.000+02:00",
      "preseance": "20",
      "nominPrincipale": "0",
      "infosQualite": {
        "codeQualite": "Membre",
        "libQualite": "Membre",
        "libQualiteSex": "Membre"
      },
      "organesRefs": [
        "PO686337"
      ]
    },
    {
      "xsiType": "MandatSimple_Type",
      "uid": "PM690573",
      "acteurRef": "PA610615",
      "legislature": "14",
      "typeOrgane": "GE",
      "dateDebut": "2013-01-23T01:00:00.000+01:00",
      "dateFin": "2017-06-20T02:00:00.000+02:00",
      "preseance": "12",
      "nominPrincipale": "1",
      "infosQualite": {
        "codeQualite": "Secrétaire",
        "libQualite": "Secrétaire",
        "libQualiteSex": "Secrétaire"
      },
      "organesRefs": [
        "PO686337"
      ]
    },
    {
      "xsiType": "MandatSimple_Type",
      "uid": "PM690872",
      "acteurRef": "PA610615",
      "legislature": "14",
      "typeOrgane": "GE",
      "dateDebut": "2013-02-06T01:00:00.000+01:00",
      "dateFin": "2017-06-20T02:00:00.000+02:00",
      "preseance": "20",
      "nominPrincipale": "1",
      "infosQualite": {
        "codeQualite": "Membre",
        "libQualite": "Membre",
        "libQualiteSex": "Membre"
      },
      "organesRefs": [
        "PO686451"
      ]
    }
  ]
}