{
  "uid": "PA721486",
  "etatCivil": {
    "ident": {
      "civ": "M.",
      "prenom": "Christophe",
      "nom": "Naegelen",
      "alpha": "Naegelen",
      "trigramme": "CNA"
    },
    "infoNaissance": {
      "dateNais": "1983-12-30T01:00:00.000+01:00",
      "villeNais": "Remiremont",
      "depNais": "Vosges",
      "paysNais": "France"
    }
  },
  "profession": {
    "libelleCourant": "Industriel-Chef d'entreprise",
    "socProcInsee": {
      "catSocPro": "Chefs d'entreprise de 10 salariés ou plus",
      "famSocPro": "Artisans, commerçants et chefs d'entreprise"
    }
  },
  "uriHatvp": "https://www.hatvp.fr/pages_nominatives/naegelen-christophe",
  "adresses": [
    {
      "xsiType": "AdressePostale_Type",
      "uid": "AD721488",
      "type": "0",
      "typeLibelle": "Adresse officielle",
      "poids": "1",
      "intitule": "Assemblée nationale,",
      "numeroRue": "126",
      "nomRue": "Rue de l'Université,",
      "codePostal": "75355",
      "ville": "Paris 07 SP"
    },
    {
      "xsiType": "AdresseMail_Type",
      "uid": "AD728253",
      "type": "15",
      "typeLibelle": "Mèl",
      "valElec": "christophe.naegelen@assemblee-nationale.fr"
    },
    {
      "xsiType": "AdresseSiteWeb_Type",
      "uid": "AD734516",
      "type": "25",
      "typeLibelle": "Facebook",
      "valElec": "ChristopheNaegelenVosges"
    },
    {
      "xsiType": "AdresseSiteWeb_Type",
      "uid": "AD734518",
      "type": "24",
      "typeLibelle": "Twitter",
      "valElec": "@c_naegelen"
    },
    {
      "xsiType": "AdressePostale_Type",
      "uid": "AD734740",
      "type": "2",
      "typeLibelle": "Adresse publiée de circonscription",
      "poids": "22",
      "intitule": "Permanence parlementaire",
      "numeroRue": "78 Quater",
      "nomRue": "Boulevard Thiers",
      "codePostal": "88200",
      "ville": "Remiremont"
    },
    {
      "xsiType": "AdresseMail_Type",
      "uid": "AD734755",
      "type": "15",
      "typeLibelle": "Mèl",
      "valElec": "contact@naegelen.fr"
    },
    {
      "xsiType": "AdresseSiteWeb_Type",
      "uid": "AD734757",
      "type": "22",
      "typeLibelle": "Site internet",
      "valElec": "www.naegelen.fr"
    },
    {
      "xsiType": "AdresseTelephonique_Type",
      "uid": "AD757943",
      "type": "11",
      "typeLibelle": "Téléphone",
      "poids": "22",
      "adresseDeRattachement": "AD734740",
      "valElec": "03.29.22.30.65"
    }
  ],
  "mandats": [
    {
      "xsiType": "MandatParlementaire_type",
      "uid": "PM723290",
      "acteurRef": "PA721486",
      "legislature": "15",
      "typeOrgane": "ASSEMBLEE",
      "dateDebut": "2017-06-18T02:00:00.000+02:00",
      "preseance": "50",
      "nominPrincipale": "1",
      "infosQualite": {
        "codeQualite": "membre",
        "libQualite": "membre",
        "libQualiteSex": "membre"
      },
      "organesRefs": [
        "PO717460"
      ],
      "suppleant": {
        "dateDebut": "2017-06-18T02:00:00.000+02:00",
        "suppleantRef": "PA721490"
      },
      "election": {
        "lieu": {
          "region": "Grand Est",
          "regionType": "Métropolitain",
          "departement": "Vosges",
          "numDepartement": "88",
          "numCirco": "3"
        },
        "causeMandat": "élections générales",
        "refCirconscription": "PO718400"
      },
      "mandature": {
        "datePriseFonction": "2017-06-21T02:00:00.000+02:00",
        "premiereElection": "0",
        "placeHemicycle": "203"
      },
      "collaborateurs": [
        {
          "qualite": "Mme",
          "prenom": "Isabeau",
          "nom": "de Challemaison"
        },
        {
          "qualite": "Mme",
          "prenom": "Patricia",
          "nom": "Ferry"
        },
        {
          "qualite": "M.",
          "prenom": "Florent",
          "nom": "Frantz"
        },
        {
          "qualite": "M.",
          "prenom": "Eric",
          "nom": "Constantin"
        },
        {
          "qualite": "Mme",
          "prenom": "Chloé",
          "nom": "Bouley"
        }
      ]
    },
    {
      "xsiType": "MandatSimple_Type",
      "uid": "PM724686",
      "acteurRef": "PA721486",
      "legislature": "15",
      "typeOrgane": "GP",
      "dateDebut": "2017-06-21T02:00:00.000+02:00",
      "dateFin": "2017-06-26T02:00:00.000+02:00",
      "preseance": "28",
      "nominPrincipale": "1",
      "infosQualite": {
        "codeQualite": "Député non-inscrit",
        "libQualite": "Député non-inscrit",
        "libQualiteSex": "Député non-inscrit"
      },
      "organesRefs": [
        "PO723569"
      ]
    },
    {
      "xsiType": "MandatSimple_Type",
      "uid": "PM731466",
      "acteurRef": "PA721486",
      "legislature": "15",
      "typeOrgane": "GP",
      "dateDebut": "2017-06-27T02:00:00.000+02:00",
      "datePublication": "2017-06-28T02:00:00.000+02:00",
      "dateFin": "2017-11-28T01:00:00.000+01:00",
      "preseance": "20",
      "nominPrincipale": "1",
      "infosQualite": {
        "codeQualite": "Membre",
        "libQualite": "Membre du",
        "libQualiteSex": "Membre du"
      },
      "organesRefs": [
        "PO730952"
      ]
    },
    {
      "xsiType": "MandatSimple_Type",
      "uid": "PM731741",
      "acteurRef": "PA721486",
      "legislature": "15",
      "typeOrgane": "COMPER",
      "dateDebut": "2017-06-29T02:00:00.000+02:00",
      "datePublication": "2017-06-29T02:00:00.000+02:00",
      "dateFin": "2017-11-14T01:00:00.000+01:00",
      "preseance": "32",
      "nominPrincipale": "1",
      "infosQualite": {
        "codeQualite": "Membre",
        "libQualite": "Membre",
        "libQualiteSex": "Membre"
      },
      "organesRefs": [
        "PO59047"
      ]
    },
    {
      "xsiType": "MandatAvecSuppleant_Type",
      "uid": "PM732386",
      "acteurRef": "PA721486",
      "legislature": "15",
      "typeOrgane": "COMNL",
      "dateDebut": "2017-07-05T02:00:00.000+02:00",
      "datePublication": "2017-07-05T02:00:00.000+02:00",
      "preseance": "20",
      "nominPrincipale": "0",
      "infosQualite": {
        "codeQualite": "Membre",
        "libQualite": "Membre",
        "libQualiteSex": "Membre"
      },
      "organesRefs": [
        "PO415287"
      ]
    },
    {
      "xsiType": "MandatSimple_Type",
      "uid": "PM735119",
      "acteurRef": "PA721486",
      "legislature": "15",
      "typeOrgane": "GA",
      "dateDebut": "2017-09-26T02:00:00.000+02:00",
      "preseance": "20",
      "nominPrincipale": "0",
      "infosQualite": {
        "codeQualite": "Membre",
        "libQualite": "Membre",
        "libQualiteSex": "Membre"
      },
      "organesRefs": [
        "PO733087"
      ]
    },
    {
      "xsiType": "MandatSimple_Type",
      "uid": "PM735120",
      "acteurRef": "PA721486",
      "legislature": "15",
      "typeOrgane": "GA",
      "dateDebut": "2017-09-26T02:00:00.000+02:00",
      "preseance": "1",
      "nominPrincipale": "1",
      "infosQualite": {
        "codeQualite": "Président",
        "libQualite": "Président",
        "libQualiteSex": "Président"
      },
      "organesRefs": [
        "PO733087"
      ]
    },
    {
      "xsiType": "MandatSimple_Type",
      "uid": "PM735870",
      "acteurRef": "PA721486",
      "legislature": "15",
      "typeOrgane": "GA",
      "dateDebut": "2017-09-28T02:00:00.000+02:00",
      "preseance": "20",
      "nominPrincipale": "0",
      "infosQualite": {
        "codeQualite": "Membre",
        "libQualite": "Membre",
        "libQualiteSex": "Membre"
      },
      "organesRefs": [
        "PO733117"
      ]
    },
    {
      "xsiType": "MandatSimple_Type",
      "uid": "PM735871",
      "acteurRef": "PA721486",
      "legislature": "15",
      "typeOrgane": "GA",
      "dateDebut": "2017-09-28T02:00:00.000+02:00",
      "preseance": "20",
      "nominPrincipale": "1",
      "infosQualite": {
        "codeQualite": "Membre",
        "libQualite": "Membre",
        "libQualiteSex": "Membre"
      },
      "organesRefs": [
        "PO733177"
      ]
    },
    {
      "xsiType": "MandatSimple_Type",
      "uid": "PM735872",
      "acteurRef": "PA721486",
      "legislature": "15",
      "typeOrgane": "GA",
      "dateDebut": "2017-09-28T02:00:00.000+02:00",
      "preseance": "20",
      "nominPrincipale": "0",
      "infosQualite": {
        "codeQualite": "Membre",
        "libQualite": "Membre",
        "libQualiteSex": "Membre"
      },
      "organesRefs": [
        "PO733322"
      ]
    },
    {
      "xsiType": "MandatSimple_Type",
      "uid": "PM735873",
      "acteurRef": "PA721486",
      "legislature": "15",
      "typeOrgane": "GA",
      "dateDebut": "2017-09-28T02:00:00.000+02:00",
      "preseance": "20",
      "nominPrincipale": "0",
      "infosQualite": {
        "codeQualite": "Membre",
        "libQualite": "Membre",
        "libQualiteSex": "Membre"
      },
      "organesRefs": [
        "PO733437"
      ]
    },
    {
      "xsiType": "MandatSimple_Type",
      "uid": "PM735874",
      "acteurRef": "PA721486",
      "legislature": "15",
      "typeOrgane": "GA",
      "dateDebut": "2017-09-28T02:00:00.000+02:00",
      "preseance": "20",
      "nominPrincipale": "1",
      "infosQualite": {
        "codeQualite": "Membre",
        "libQualite": "Membre",
        "libQualiteSex": "Membre"
      },
      "organesRefs": [
        "PO733567"
      ]
    },
    {
      "xsiType": "MandatSimple_Type",
      "uid": "PM735875",
      "acteurRef": "PA721486",
      "legislature": "15",
      "typeOrgane": "GEVI",
      "dateDebut": "2017-09-28T02:00:00.000+02:00",
      "preseance": "20",
      "nominPrincipale": "0",
      "infosQualite": {
        "codeQualite": "Membre",
        "libQualite": "Membre",
        "libQualiteSex": "Membre"
      },
      "organesRefs": [
        "PO733047"
      ]
    },
    {
      "xsiType": "MandatSimple_Type",
      "uid": "PM735876",
      "acteurRef": "PA721486",
      "legislature": "15",
      "typeOrgane": "GEVI",
      "dateDebut": "2017-09-28T02:00:00.000+02:00",
      "preseance": "20",
      "nominPrincipale": "1",
      "infosQualite": {
        "codeQualite": "Membre",
        "libQualite": "Membre",
        "libQualiteSex": "Membre"
      },
      "organesRefs": [
        "PO733217"
      ]
    },
    {
      "xsiType": "MandatSimple_Type",
      "uid": "PM740386",
      "acteurRef": "PA721486",
      "legislature": "15",
      "typeOrgane": "ORGEXTPARL",
      "dateDebut": "2017-10-16T02:00:00.000+02:00",
      "datePublication": "2017-10-17T02:00:00.000+02:00",
      "preseance": "30",
      "nominPrincipale": "1",
      "infosQualite": {
        "codeQualite": "Suppléant",
        "libQualite": "Membre suppléant",
        "libQualiteSex": "Membre suppléant"
      },
      "organesRefs": [
        "PO681380"
      ]
    },
    {
      "xsiType": "MandatSimple_Type",
      "uid": "PM740725",
      "acteurRef": "PA721486",
      "legislature": "15",
      "typeOrgane": "GA",
      "dateDebut": "2017-10-24T02:00:00.000+02:00",
      "preseance": "8",
      "nominPrincipale": "1",
      "infosQualite": {
        "codeQualite": "Vice-Président",
        "libQualite": "Vice-Président",
        "libQualiteSex": "Vice-Président"
      },
      "organesRefs": [
        "PO733117"
      ]
    },
    {
      "xsiType": "MandatSimple_Type",
      "uid": "PM742590",
      "acteurRef": "PA721486",
      "legislature": "15",
      "typeOrgane": "GA",
      "dateDebut": "2017-11-07T01:00:00.000+01:00",
      "preseance": "8",
      "nominPrincipale": "1",
      "infosQualite": {
        "codeQualite": "Vice-Président",
        "libQualite": "Vice-Président",
        "libQualiteSex": "Vice-Président"
      },
      "organesRefs": [
        "PO733322"
      ]
    },
    {
      "xsiType": "MandatSimple_Type",
      "uid": "PM742933",
      "acteurRef": "PA721486",
      "legislature": "15",
      "typeOrgane": "GA",
      "dateDebut": "2017-11-08T01:00:00.000+01:00",
      "preseance": "8",
      "nominPrincipale": "1",
      "infosQualite": {
        "codeQualite": "Vice-Président",
        "libQualite": "Vice-Président",
        "libQualiteSex": "Vice-Président"
      },
      "organesRefs": [
        "PO733437"
      ]
    },
    {
      "xsiType": "MandatSimple_Type",
      "uid": "PM743298",
      "acteurRef": "PA721486",
      "legislature": "15",
      "typeOrgane": "COMPER",
      "dateDebut": "2017-11-15T01:00:00.000+01:00",
      "datePublication": "2017-11-15T01:00:00.000+01:00",
      "dateFin": "2017-12-04T01:00:00.000+01:00",
      "preseance": "32",
      "nominPrincipale": "1",
      "infosQualite": {
        "codeQualite": "Membre",
        "libQualite": "Membre",
        "libQualiteSex": "Membre"
      },
      "organesRefs": [
        "PO420120"
      ]
    },
    {
      "xsiType": "MandatSimple_Type",
      "uid": "PM743753",
      "acteurRef": "PA721486",
      "legislature": "15",
      "typeOrgane": "ORGEXTPARL",
      "dateDebut": "2017-11-17T01:00:00.000+01:00",
      "datePublication": "2017-11-18T01:00:00.000+01:00",
      "preseance": "30",
      "nominPrincipale": "1",
      "infosQualite": {
        "codeQualite": "Suppléant",
        "libQualite": "Membre suppléant",
        "libQualiteSex": "Membre suppléant"
      },
      "organesRefs": [
        "PO717320"
      ]
    },
    {
      "xsiType": "MandatMission_Type",
      "uid": "PM744283",
      "acteurRef": "PA721486",
      "legislature": "15",
      "typeOrgane": "MISINFO",
      "dateDebut": "2017-10-24T02:00:00.000+02:00",
      "dateFin": "2018-11-29T01:00:00.000+01:00",
      "preseance": "10",
      "nominPrincipale": "0",
      "infosQualite": {
        "codeQualite": "Membre",
        "libQualite": "Membre",
        "libQualiteSex": "Membre"
      },
      "organesRefs": [
        "PO744260"
      ]
    },
    {
      "xsiType": "MandatMission_Type",
      "uid": "PM744285",
      "acteurRef": "PA721486",
      "legislature": "15",
      "typeOrgane": "MISINFO",
      "dateDebut": "2017-10-24T02:00:00.000+02:00",
      "dateFin": "2018-11-29T01:00:00.000+01:00",
      "preseance": "5",
      "nominPrincipale": "1",
      "infosQualite": {
        "codeQualite": "Co-rapporteur",
        "libQualite": "Co-rapporteur",
        "libQualiteSex": "Co-rapporteur"
      },
      "organesRefs": [
        "PO744260"
      ]
    },
    {
      "xsiType": "MandatSimple_Type",
      "uid": "PM744454",
      "acteurRef": "PA721486",
      "legislature": "15",
      "typeOrgane": "GP",
      "dateDebut": "2017-11-29T01:00:00.000+01:00",
      "dateFin": "2019-06-10T02:00:00.000+02:00",
      "preseance": "20",
      "nominPrincipale": "1",
      "infosQualite": {
        "codeQualite": "Membre",
        "libQualite": "Membre du",
        "libQualiteSex": "Membre du"
      },
      "organesRefs": [
        "PO744425"
      ]
    },
    {
      "xsiType": "MandatSimple_Type",
      "uid": "PM744644",
      "acteurRef": "PA721486",
      "legislature": "15",
      "typeOrgane": "COMPER",
      "dateDebut": "2017-12-05T01:00:00.000+01:00",
      "datePublication": "2017-12-05T01:00:00.000+01:00",
      "dateFin": "2017-12-06T01:00:00.000+01:00",
      "preseance": "32",
      "nominPrincipale": "1",
      "infosQualite": {
        "codeQualite": "Membre",
        "libQualite": "Membre",
        "libQualiteSex": "Membre"
      },
      "organesRefs": [
        "PO59047"
      ]
    },
    {
      "xsiType": "MandatSimple_Type",
      "uid": "PM744773",
      "acteurRef": "PA721486",
      "legislature": "15",
      "typeOrgane": "CNPS",
      "dateDebut": "2017-12-06T01:00:00.000+01:00",
      "datePublication": "2017-12-06T01:00:00.000+01:00",
      "dateFin": "2018-07-31T02:00:00.000+02:00",
      "preseance": "20",
      "nominPrincipale": "1",
      "infosQualite": {
        "codeQualite": "Membre",
        "libQualite": "Membre",
        "libQualiteSex": "Membre"
      },
      "organesRefs": [
        "PO744107"
      ]
    },
    {
      "xsiType": "MandatMission_Type",
      "uid": "PM744850",
      "acteurRef": "PA721486",
      "legislature": "15",
      "typeOrgane": "MISINFOPRE",
      "dateDebut": "2017-12-07T01:00:00.000+01:00",
      "datePublication": "2017-12-07T01:00:00.000+01:00",
      "dateFin": "2018-11-20T01:00:00.000+01:00",
      "preseance": "20",
      "nominPrincipale": "1",
      "infosQualite": {
        "codeQualite": "Membre",
        "libQualite": "Membre",
        "libQualiteSex": "Membre"
      },
      "organesRefs": [
        "PO743664"
      ]
    },
    {
      "xsiType": "MandatSimple_Type",
      "uid": "PM745504",
      "acteurRef": "PA721486",
      "legislature": "15",
      "typeOrgane": "COMPER",
      "dateDebut": "2017-12-07T01:00:00.000+01:00",
      "datePublication": "2017-12-07T01:00:00.000+01:00",
      "dateFin": "2017-12-12T01:00:00.000+01:00",
      "preseance": "32",
      "nominPrincipale": "1",
      "infosQualite": {
        "codeQualite": "Membre",
        "libQualite": "Membre",
        "libQualiteSex": "Membre"
      },
      "organesRefs": [
        "PO420120"
      ]
    },
    {
      "xsiType": "MandatSimple_Type",
      "uid": "PM746043",
      "acteurRef": "PA721486",
      "typeOrgane": "PARPOL",
      "dateDebut": "2017-12-01T01:00:00.000+01:00",
      "preseance": "5",
      "nominPrincipale": "1",
      "infosQualite": {
        "codeQualite": "Membre",
        "libQualite": "Membre",
        "libQualiteSex": "Membre"
      },
      "organesRefs": [
        "PO744864"
      ]
    },
    {
      "xsiType": "MandatSimple_Type",
      "uid": "PM746083",
      "acteurRef": "PA721486",
      "legislature": "15",
      "typeOrgane": "CNPS",
      "dateDebut": "2017-12-07T01:00:00.000+01:00",
      "datePublication": "2017-12-07T01:00:00.000+01:00",
      "dateFin": "2018-07-31T02:00:00.000+02:00",
      "preseance": "8",
      "nominPrincipale": "1",
      "infosQualite": {
        "codeQualite": "Vice-Président",
        "libQualite": "Vice-Président",
        "libQualiteSex": "Vice-Président"
      },
      "organesRefs": [
        "PO744107"
      ]
    },
    {
      "xsiType": "MandatSimple_Type",
      "uid": "PM746336",
      "acteurRef": "PA721486",
      "legislature": "15",
      "typeOrgane": "COMPER",
      "dateDebut": "2017-12-13T01:00:00.000+01:00",
      "datePublication": "2017-12-13T01:00:00.000+01:00",
      "dateFin": "2018-11-12T01:00:00.000+01:00",
      "preseance": "32",
      "nominPrincipale": "1",
      "infosQualite": {
        "codeQualite": "Membre",
        "libQualite": "Membre",
        "libQualiteSex": "Membre"
      },
      "organesRefs": [
        "PO59047"
      ]
    },
    {
      "xsiType": "MandatMission_Type",
      "uid": "PM746747",
      "acteurRef": "PA721486",
      "legislature": "15",
      "typeOrgane": "MISINFOPRE",
      "dateDebut": "2017-12-21T01:00:00.000+01:00",
      "datePublication": "2017-12-21T01:00:00.000+01:00",
      "dateFin": "2018-11-20T01:00:00.000+01:00",
      "preseance": "8",
      "nominPrincipale": "1",
      "infosQualite": {
        "codeQualite": "Secrétaire",
        "libQualite": "Secrétaire",
        "libQualiteSex": "Secrétaire"
      },
      "organesRefs": [
        "PO743664"
      ]
    },
    {
      "xsiType": "MandatSimple_Type",
      "uid": "PM747753",
      "acteurRef": "PA721486",
      "legislature": "15",
      "typeOrgane": "GEVI",
      "dateDebut": "2017-11-30T01:00:00.000+01:00",
      "preseance": "8",
      "nominPrincipale": "1",
      "infosQualite": {
        "codeQualite": "Vice-Président",
        "libQualite": "Vice-Président",
        "libQualiteSex": "Vice-Président"
      },
      "organesRefs": [
        "PO733047"
      ]
    },
    {
      "xsiType": "MandatSimple_Type",
      "uid": "PM748002",
      "acteurRef": "PA721486",
      "legislature": "15",
      "typeOrgane": "ORGEXTPARL",
      "dateDebut": "2018-01-10T01:00:00.000+01:00",
      "datePublication": "2018-01-11T01:00:00.000+01:00",
      "preseance": "20",
      "nominPrincipale": "1",
      "infosQualite": {
        "codeQualite": "Titulaire",
        "libQualite": "Membre titulaire",
        "libQualiteSex": "Membre titulaire"
      },
      "organesRefs": [
        "PO717436"
      ]
    },
    {
      "xsiType": "MandatSimple_Type",
      "uid": "PM749097",
      "acteurRef": "PA721486",
      "legislature": "15",
      "typeOrgane": "GE",
      "dateDebut": "2018-02-08T01:00:00.000+01:00",
      "preseance": "20",
      "nominPrincipale": "1",
      "infosQualite": {
        "codeQualite": "Membre",
        "libQualite": "Membre",
        "libQualiteSex": "Membre"
      },
      "organesRefs": [
        "PO746894"
      ]
    },
    {
      "xsiType": "MandatSimple_Type",
      "uid": "PM749522",
      "acteurRef": "PA721486",
      "legislature": "15",
      "typeOrgane": "GE",
      "dateDebut": "2018-02-28T01:00:00.000+01:00",
      "preseance": "20",
      "nominPrincipale": "0",
      "infosQualite": {
        "codeQualite": "Membre",
        "libQualite": "Membre",
        "libQualiteSex": "Membre"
      },
      "organesRefs": [
        "PO746674"
      ]
    },
    {
      "xsiType": "MandatSimple_Type",
      "uid": "PM750036",
      "acteurRef": "PA721486",
      "legislature": "15",
      "typeOrgane": "GE",
      "dateDebut": "2018-02-13T01:00:00.000+01:00",
      "preseance": "20",
      "nominPrincipale": "0",
      "infosQualite": {
        "codeQualite": "Membre",
        "libQualite": "Membre",
        "libQualiteSex": "Membre"
      },
      "organesRefs": [
        "PO747094"
      ]
    },
    {
      "xsiType": "MandatSimple_Type",
      "uid": "PM751019",
      "acteurRef": "PA721486",
      "legislature": "15",
      "typeOrgane": "GE",
      "dateDebut": "2018-02-19T01:00:00.000+01:00",
      "preseance": "20",
      "nominPrincipale": "1",
      "infosQualite": {
        "codeQualite": "Membre",
        "libQualite": "Membre",
        "libQualiteSex": "Membre"
      },
      "organesRefs": [
        "PO746880"
      ]
    },
    {
      "xsiType": "MandatSimple_Type",
      "uid": "PM751262",
      "acteurRef": "PA721486",
      "legislature": "15",
      "typeOrgane": "GE",
      "dateDebut": "2018-02-19T01:00:00.000+01:00",
      "preseance": "20",
      "nominPrincipale": "1",
      "infosQualite": {
        "codeQualite": "Membre",
        "libQualite": "Membre",
        "libQualiteSex": "Membre"
      },
      "organesRefs": [
        "PO747241"
      ]
    },
    {
      "xsiType": "MandatSimple_Type",
      "uid": "PM751453",
      "acteurRef": "PA721486",
      "legislature": "15",
      "typeOrgane": "GE",
      "dateDebut": "2018-02-21T01:00:00.000+01:00",
      "preseance": "20",
      "nominPrincipale": "1",
      "infosQualite": {
        "codeQualite": "Membre",
        "libQualite": "Membre",
        "libQualiteSex": "Membre"
      },
      "organesRefs": [
        "PO746644"
      ]
    },
    {
      "xsiType": "MandatSimple_Type",
      "uid": "PM751711",
      "acteurRef": "PA721486",
      "legislature": "15",
      "typeOrgane": "GE",
      "dateDebut": "2018-02-22T01:00:00.000+01:00",
      "preseance": "20",
      "nominPrincipale": "1",
      "infosQualite": {
        "codeQualite": "Membre",
        "libQualite": "Membre",
        "libQualiteSex": "Membre"
      },
      "organesRefs": [
        "PO746669"
      ]
    },
    {
      "xsiType": "MandatSimple_Type",
      "uid": "PM751971",
      "acteurRef": "PA721486",
      "legislature": "15",
      "typeOrgane": "GE",
      "dateDebut": "2018-02-23T01:00:00.000+01:00",
      "preseance": "20",
      "nominPrincipale": "1",
      "infosQualite": {
        "codeQualite": "Membre",
        "libQualite": "Membre",
        "libQualiteSex": "Membre"
      },
      "organesRefs": [
        "PO746925"
      ]
    },
    {
      "xsiType": "MandatSimple_Type",
      "uid": "PM752392",
      "acteurRef": "PA721486",
      "legislature": "15",
      "typeOrgane": "GE",
      "dateDebut": "2018-03-05T01:00:00.000+01:00",
      "preseance": "20",
      "nominPrincipale": "0",
      "infosQualite": {
        "codeQualite": "Membre",
        "libQualite": "Membre",
        "libQualiteSex": "Membre"
      },
      "organesRefs": [
        "PO746930"
      ]
    },
    {
      "xsiType": "MandatSimple_Type",
      "uid": "PM752444",
      "acteurRef": "PA721486",
      "legislature": "15",
      "typeOrgane": "GE",
      "dateDebut": "2018-03-06T01:00:00.000+01:00",
      "preseance": "20",
      "nominPrincipale": "0",
      "infosQualite": {
        "codeQualite": "Membre",
        "libQualite": "Membre",
        "libQualiteSex": "Membre"
      },
      "organesRefs": [
        "PO746920"
      ]
    },
    {
      "xsiType": "MandatSimple_Type",
      "uid": "PM752658",
      "acteurRef": "PA721486",
      "legislature": "15",
      "typeOrgane": "GE",
      "dateDebut": "2018-03-06T01:00:00.000+01:00",
      "preseance": "20",
      "nominPrincipale": "1",
      "infosQualite": {
        "codeQualite": "Membre",
        "libQualite": "Membre",
        "libQualiteSex": "Membre"
      },
      "organesRefs": [
        "PO747220"
      ]
    },
    {
      "xsiType": "MandatSimple_Type",
      "uid": "PM752824",
      "acteurRef": "PA721486",
      "legislature": "15",
      "typeOrgane": "GE",
      "dateDebut": "2018-03-07T01:00:00.000+01:00",
      "preseance": "8",
      "nominPrincipale": "1",
      "infosQualite": {
        "codeQualite": "Vice-Président",
        "libQualite": "Vice-Président",
        "libQualiteSex": "Vice-Président"
      },
      "organesRefs": [
        "PO746674"
      ]
    },
    {
      "xsiType": "MandatSimple_Type",
      "uid": "PM752913",
      "acteurRef": "PA721486",
      "legislature": "15",
      "typeOrgane": "GE",
      "dateDebut": "2018-03-05T01:00:00.000+01:00",
      "preseance": "20",
      "nominPrincipale": "0",
      "infosQualite": {
        "codeQualite": "Membre",
        "libQualite": "Membre",
        "libQualiteSex": "Membre"
      },
      "organesRefs": [
        "PO747057"
      ]
    },
    {
      "xsiType": "MandatSimple_Type",
      "uid": "PM753121",
      "acteurRef": "PA721486",
      "legislature": "15",
      "typeOrgane": "GA",
      "dateDebut": "2018-03-09T01:00:00.000+01:00",
      "preseance": "20",
      "nominPrincipale": "1",
      "infosQualite": {
        "codeQualite": "Membre",
        "libQualite": "Membre",
        "libQualiteSex": "Membre"
      },
      "organesRefs": [
        "PO733412"
      ]
    },
    {
      "xsiType": "MandatSimple_Type",
      "uid": "PM753456",
      "acteurRef": "PA721486",
      "legislature": "15",
      "typeOrgane": "GE",
      "dateDebut": "2018-03-14T01:00:00.000+01:00",
      "preseance": "8",
      "nominPrincipale": "1",
      "infosQualite": {
        "codeQualite": "Vice-Président",
        "libQualite": "Vice-Président",
        "libQualiteSex": "Vice-Président"
      },
      "organesRefs": [
        "PO747057"
      ]
    },
    {
      "xsiType": "MandatSimple_Type",
      "uid": "PM753570",
      "acteurRef": "PA721486",
      "legislature": "15",
      "typeOrgane": "GE",
      "dateDebut": "2018-03-15T01:00:00.000+01:00",
      "preseance": "20",
      "nominPrincipale": "0",
      "infosQualite": {
        "codeQualite": "Membre",
        "libQualite": "Membre",
        "libQualiteSex": "Membre"
      },
      "organesRefs": [
        "PO746689"
      ]
    },
    {
      "xsiType": "MandatSimple_Type",
      "uid": "PM753675",
      "acteurRef": "PA721486",
      "legislature": "15",
      "typeOrgane": "CMP",
      "dateDebut": "2018-03-16T01:00:00.000+01:00",
      "datePublication": "2018-03-16T01:00:00.000+01:00",
      "dateFin": "2018-07-31T02:00:00.000+02:00",
      "preseance": "28",
      "nominPrincipale": "1",
      "infosQualite": {
        "codeQualite": "Suppléant",
        "libQualite": "Membre suppléant",
        "libQualiteSex": "Membre suppléant"
      },
      "organesRefs": [
        "PO753655"
      ]
    },
    {
      "xsiType": "MandatSimple_Type",
      "uid": "PM753793",
      "acteurRef": "PA721486",
      "legislature": "15",
      "typeOrgane": "GE",
      "dateDebut": "2018-03-19T01:00:00.000+01:00",
      "preseance": "20",
      "nominPrincipale": "1",
      "infosQualite": {
        "codeQualite": "Membre",
        "libQualite": "Membre",
        "libQualiteSex": "Membre"
      },
      "organesRefs": [
        "PO747084"
      ]
    },
    {
      "xsiType": "MandatSimple_Type",
      "uid": "PM753956",
      "acteurRef": "PA721486",
      "legislature": "15",
      "typeOrgane": "GE",
      "dateDebut": "2018-03-20T01:00:00.000+01:00",
      "preseance": "8",
      "nominPrincipale": "1",
      "infosQualite": {
        "codeQualite": "Vice-Président",
        "libQualite": "Vice-Président",
        "libQualiteSex": "Vice-Président"
      },
      "organesRefs": [
        "PO746689"
      ]
    },
    {
      "xsiType": "MandatSimple_Type",
      "uid": "PM754415",
      "acteurRef": "PA721486",
      "legislature": "15",
      "typeOrgane": "GE",
      "dateDebut": "2018-03-27T02:00:00.000+02:00",
      "preseance": "12",
      "nominPrincipale": "1",
      "infosQualite": {
        "codeQualite": "Secrétaire",
        "libQualite": "Secrétaire",
        "libQualiteSex": "Secrétaire"
      },
      "organesRefs": [
        "PO746920"
      ]
    },
    {
      "xsiType": "MandatSimple_Type",
      "uid": "PM755185",
      "acteurRef": "PA721486",
      "legislature": "15",
      "typeOrgane": "GE",
      "dateDebut": "2018-04-03T02:00:00.000+02:00",
      "preseance": "12",
      "nominPrincipale": "1",
      "infosQualite": {
        "codeQualite": "Secrétaire",
        "libQualite": "Secrétaire",
        "libQualiteSex": "Secrétaire"
      },
      "organesRefs": [
        "PO747094"
      ]
    },
    {
      "xsiType": "MandatSimple_Type",
      "uid": "PM755270",
      "acteurRef": "PA721486",
      "legislature": "15",
      "typeOrgane": "GE",
      "dateDebut": "2018-04-04T02:00:00.000+02:00",
      "preseance": "8",
      "nominPrincipale": "1",
      "infosQualite": {
        "codeQualite": "Vice-Président",
        "libQualite": "Vice-Président",
        "libQualiteSex": "Vice-Président"
      },
      "organesRefs": [
        "PO746930"
      ]
    },
    {
      "xsiType": "MandatSimple_Type",
      "uid": "PM755671",
      "acteurRef": "PA721486",
      "legislature": "15",
      "typeOrgane": "GE",
      "dateDebut": "2018-04-10T02:00:00.000+02:00",
      "preseance": "20",
      "nominPrincipale": "1",
      "infosQualite": {
        "codeQualite": "Membre",
        "libQualite": "Membre",
        "libQualiteSex": "Membre"
      },
      "organesRefs": [
        "PO751484"
      ]
    },
    {
      "xsiType": "MandatSimple_Type",
      "uid": "PM757150",
      "acteurRef": "PA721486",
      "legislature": "15",
      "typeOrgane": "GE",
      "dateDebut": "2018-06-19T02:00:00.000+02:00",
      "preseance": "20",
      "nominPrincipale": "1",
      "infosQualite": {
        "codeQualite": "Membre",
        "libQualite": "Membre",
        "libQualiteSex": "Membre"
      },
      "organesRefs": [
        "PO747261"
      ]
    },
    {
      "xsiType": "MandatSimple_Type",
      "uid": "PM757662",
      "acteurRef": "PA721486",
      "legislature": "15",
      "typeOrgane": "GEVI",
      "dateDebut": "2018-07-05T02:00:00.000+02:00",
      "preseance": "20",
      "nominPrincipale": "1",
      "infosQualite": {
        "codeQualite": "Membre",
        "libQualite": "Membre",
        "libQualiteSex": "Membre"
      },
      "organesRefs": [
        "PO733622"
      ]
    },
    {
      "xsiType": "MandatSimple_Type",
      "uid": "PM760183",
      "acteurRef": "PA721486",
      "legislature": "15",
      "typeOrgane": "COMPER",
      "dateDebut": "2018-11-13T01:00:00.000+01:00",
      "datePublication": "2018-11-13T01:00:00.000+01:00",
      "dateFin": "2018-11-28T01:00:00.000+01:00",
      "preseance": "32",
      "nominPrincipale": "1",
      "infosQualite": {
        "codeQualite": "Membre",
        "libQualite": "Membre",
        "libQualiteSex": "Membre"
      },
      "organesRefs": [
        "PO419610"
      ]
    },
    {
      "xsiType": "MandatSimple_Type",
      "uid": "PM760251",
      "acteurRef": "PA721486",
      "legislature": "15",
      "typeOrgane": "CNPS",
      "dateDebut": "2018-11-13T01:00:00.000+01:00",
      "datePublication": "2018-11-14T01:00:00.000+01:00",
      "dateFin": "2019-01-17T01:00:00.000+01:00",
      "preseance": "20",
      "nominPrincipale": "1",
      "infosQualite": {
        "codeQualite": "Membre",
        "libQualite": "Membre",
        "libQualiteSex": "Membre"
      },
      "organesRefs": [
        "PO760148"
      ]
    },
    {
      "xsiType": "MandatAvecSuppleant_Type",
      "uid": "PM760645",
      "acteurRef": "PA721486",
      "legislature": "15",
      "typeOrgane": "COMNL",
      "dateDebut": "2018-11-23T01:00:00.000+01:00",
      "datePublication": "2018-11-24T01:00:00.000+01:00",
      "preseance": "16",
      "nominPrincipale": "1",
      "infosQualite": {
        "codeQualite": "Secrétaire",
        "libQualite": "Secrétaire",
        "libQualiteSex": "Secrétaire"
      },
      "organesRefs": [
        "PO415287"
      ]
    },
    {
      "xsiType": "MandatSimple_Type",
      "uid": "PM760779",
      "acteurRef": "PA721486",
      "legislature": "15",
      "typeOrgane": "COMPER",
      "dateDebut": "2018-11-29T01:00:00.000+01:00",
      "datePublication": "2018-11-29T01:00:00.000+01:00",
      "dateFin": "2018-11-30T01:00:00.000+01:00",
      "preseance": "32",
      "nominPrincipale": "1",
      "infosQualite": {
        "codeQualite": "Membre",
        "libQualite": "Membre",
        "libQualiteSex": "Membre"
      },
      "organesRefs": [
        "PO59047"
      ]
    },
    {
      "xsiType": "MandatSimple_Type",
      "uid": "PM760794",
      "acteurRef": "PA721486",
      "legislature": "15",
      "typeOrgane": "COMPER",
      "dateDebut": "2018-12-01T01:00:00.000+01:00",
      "datePublication": "2018-12-01T01:00:00.000+01:00",
      "dateFin": "2018-12-07T01:00:00.000+01:00",
      "preseance": "32",
      "nominPrincipale": "1",
      "infosQualite": {
        "codeQualite": "Membre",
        "libQualite": "Membre",
        "libQualiteSex": "Membre"
      },
      "organesRefs": [
        "PO419610"
      ]
    },
    {
      "xsiType": "MandatSimple_Type",
      "uid": "PM760851",
      "acteurRef": "PA721486",
      "legislature": "15",
      "typeOrgane": "COMPER",
      "dateDebut": "2018-12-08T01:00:00.000+01:00",
      "datePublication": "2018-12-08T01:00:00.000+01:00",
      "preseance": "32",
      "nominPrincipale": "1",
      "infosQualite": {
        "codeQualite": "Membre",
        "libQualite": "Membre",
        "libQualiteSex": "Membre"
      },
      "organesRefs": [
        "PO59047"
      ]
    },
    {
      "xsiType": "MandatSimple_Type",
      "uid": "PM762651",
      "acteurRef": "PA721486",
      "legislature": "15",
      "typeOrgane": "CNPE",
      "dateDebut": "2019-02-12T01:00:00.000+01:00",
      "datePublication": "2019-02-13T01:00:00.000+01:00",
      "dateFin": "2019-07-03T02:00:00.000+02:00",
      "preseance": "20",
      "nominPrincipale": "1",
      "infosQualite": {
        "codeQualite": "Membre",
        "libQualite": "Membre",
        "libQualiteSex": "Membre"
      },
      "organesRefs": [
        "PO762435"
      ]
    },
    {
      "xsiType": "MandatSimple_Type",
      "uid": "PM762719",
      "acteurRef": "PA721486",
      "legislature": "15",
      "typeOrgane": "GA",
      "dateDebut": "2019-02-13T01:00:00.000+01:00",
      "preseance": "20",
      "nominPrincipale": "1",
      "infosQualite": {
        "codeQualite": "Membre",
        "libQualite": "Membre",
        "libQualiteSex": "Membre"
      },
      "organesRefs": [
        "PO733522"
      ]
    },
    {
      "xsiType": "MandatSimple_Type",
      "uid": "PM762840",
      "acteurRef": "PA721486",
      "legislature": "15",
      "typeOrgane": "CNPE",
      "dateDebut": "2019-02-19T01:00:00.000+01:00",
      "datePublication": "2019-02-20T01:00:00.000+01:00",
      "dateFin": "2019-07-03T02:00:00.000+02:00",
      "preseance": "16",
      "nominPrincipale": "1",
      "infosQualite": {
        "codeQualite": "Rapporteur",
        "libQualite": "Rapporteur",
        "libQualiteSex": "Rapporteur"
      },
      "organesRefs": [
        "PO762435"
      ]
    },
    {
      "xsiType": "MandatMission_Type",
      "uid": "PM763225",
      "acteurRef": "PA721486",
      "legislature": "15",
      "typeOrgane": "MISINFO",
      "dateDebut": "2019-03-13T01:00:00.000+01:00",
      "preseance": "10",
      "nominPrincipale": "0",
      "infosQualite": {
        "codeQualite": "Membre",
        "libQualite": "Membre",
        "libQualiteSex": "Membre"
      },
      "organesRefs": [
        "PO760017"
      ]
    },
    {
      "xsiType": "MandatMission_Type",
      "uid": "PM763226",
      "acteurRef": "PA721486",
      "legislature": "15",
      "typeOrgane": "MISINFO",
      "dateDebut": "2019-03-13T01:00:00.000+01:00",
      "preseance": "5",
      "nominPrincipale": "1",
      "infosQualite": {
        "codeQualite": "Co-rapporteur",
        "libQualite": "Co-rapporteur",
        "libQualiteSex": "Co-rapporteur"
      },
      "organesRefs": [
        "PO760017"
      ]
    },
    {
      "xsiType": "MandatSimple_Type",
      "uid": "PM763506",
      "acteurRef": "PA721486",
      "legislature": "15",
      "typeOrgane": "ORGEXTPARL",
      "dateDebut": "2019-03-14T01:00:00.000+01:00",
      "datePublication": "2019-03-15T01:00:00.000+01:00",
      "preseance": "20",
      "nominPrincipale": "1",
      "infosQualite": {
        "codeQualite": "Titulaire",
        "libQualite": "Membre titulaire",
        "libQualiteSex": "Membre titulaire"
      },
      "organesRefs": [
        "PO763346"
      ]
    },
    {
      "xsiType": "MandatSimple_Type",
      "uid": "PM765417",
      "acteurRef": "PA721486",
      "legislature": "15",
      "typeOrgane": "GE",
      "dateDebut": "2019-05-29T02:00:00.000+02:00",
      "preseance": "20",
      "nominPrincipale": "0",
      "infosQualite": {
        "codeQualite": "Membre",
        "libQualite": "Membre",
        "libQualiteSex": "Membre"
      },
      "organesRefs": [
        "PO763264"
      ]
    },
    {
      "xsiType": "MandatSimple_Type",
      "uid": "PM765531",
      "acteurRef": "PA721486",
      "legislature": "15",
      "typeOrgane": "GE",
      "dateDebut": "2019-06-04T02:00:00.000+02:00",
      "preseance": "8",
      "nominPrincipale": "1",
      "infosQualite": {
        "codeQualite": "Vice-Président",
        "libQualite": "Vice-Président",
        "libQualiteSex": "Vice-Président"
      },
      "organesRefs": [
        "PO763264"
      ]
    },
    {
      "xsiType": "MandatSimple_Type",
      "uid": "PM765658",
      "acteurRef": "PA721486",
      "legislature": "15",
      "typeOrgane": "GP",
      "dateDebut": "2019-06-11T02:00:00.000+02:00",
      "dateFin": "2019-09-27T02:00:00.000+02:00",
      "preseance": "20",
      "nominPrincipale": "1",
      "infosQualite": {
        "codeQualite": "Membre",
        "libQualite": "Membre du",
        "libQualiteSex": "Membre du"
      },
      "organesRefs": [
        "PO765636"
      ]
    },
    {
      "xsiType": "MandatSimple_Type",
      "uid": "PM766202",
      "acteurRef": "PA721486",
      "legislature": "15",
      "typeOrgane": "GE",
      "dateDebut": "2019-07-03T02:00:00.000+02:00",
      "preseance": "20",
      "nominPrincipale": "1",
      "infosQualite": {
        "codeQualite": "Membre",
        "libQualite": "Membre",
        "libQualiteSex": "Membre"
      },
      "organesRefs": [
        "PO763259"
      ]
    },
    {
      "xsiType": "MandatMission_Type",
      "uid": "PM766900",
      "acteurRef": "PA721486",
      "legislature": "15",
      "typeOrgane": "MISINFO",
      "dateDebut": "2019-07-23T02:00:00.000+02:00",
      "preseance": "10",
      "nominPrincipale": "0",
      "infosQualite": {
        "codeQualite": "Membre",
        "libQualite": "Membre",
        "libQualiteSex": "Membre"
      },
      "organesRefs": [
        "PO766896"
      ]
    },
    {
      "xsiType": "MandatMission_Type",
      "uid": "PM766902",
      "acteurRef": "PA721486",
      "legislature": "15",
      "typeOrgane": "MISINFO",
      "dateDebut": "2019-07-23T02:00:00.000+02:00",
      "preseance": "5",
      "nominPrincipale": "1",
      "infosQualite": {
        "codeQualite": "Co-rapporteur",
        "libQualite": "Co-rapporteur",
        "libQualiteSex": "Co-rapporteur"
      },
      "organesRefs": [
        "PO766896"
      ]
    },
    {
      "xsiType": "MandatSimple_Type",
      "uid": "PM767239",
      "acteurRef": "PA721486",
      "legislature": "15",
      "typeOrgane": "GP",
      "dateDebut": "2019-09-28T02:00:00.000+02:00",
      "datePublication": "2019-09-27T02:00:00.000+02:00",
      "preseance": "20",
      "nominPrincipale": "1",
      "infosQualite": {
        "codeQualite": "Membre",
        "libQualite": "Membre du",
        "libQualiteSex": "Membre du"
      },
      "organesRefs": [
        "PO767217"
      ]
    }
  ]
}