{
  "uid": "PA2850",
  "etatCivil": {
    "ident": {
      "civ": "M.",
      "prenom": "Jean",
      "nom": "Ueberschlag",
      "alpha": "Ueberschlag"
    },
    "infoNaissance": {
      "dateNais": "1935-05-29T01:00:00.000+01:00",
      "villeNais": "Folgensbourg",
      "depNais": "Haut-Rhin"
    }
  },
  "profession": {
    "libelleCourant": "Chirurgien-dentiste retraité",
    "socProcInsee": {
      "catSocPro": "Professions libérales et assimilés",
      "famSocPro": "Cadres et professions intellectuelles supérieures"
    }
  },
  "adresses": [
    {
      "xsiType": "AdressePostale_Type",
      "uid": "AD46335",
      "type": "2",
      "typeLibelle": "Adresse publiée de circonscription",
      "poids": "21",
      "numeroRue": "34",
      "nomRue": "Rue de la Liberté,",
      "codePostal": "68300",
      "ville": "Saint-Louis"
    },
    {
      "xsiType": "AdressePostale_Type",
      "uid": "AD46348",
      "type": "2",
      "typeLibelle": "Adresse publiée de circonscription",
      "poids": "22",
      "intitule": "Hôtel de Ville,",
      "codePostal": "68300",
      "ville": "Saint-Louis"
    },
    {
      "xsiType": "AdresseTelephonique_Type",
      "uid": "AD47323",
      "type": "11",
      "typeLibelle": "Téléphone",
      "poids": "22",
      "adresseDeRattachement": "AD46348",
      "valElec": "03 89 69 52 00"
    },
    {
      "xsiType": "AdresseTelephonique_Type",
      "uid": "AD49209",
      "type": "12",
      "typeLibelle": "Télécopie",
      "poids": "22",
      "adresseDeRattachement": "AD46348",
      "valElec": "03 89 69 37 72"
    },
    {
      "xsiType": "AdresseMail_Type",
      "uid": "AD211249",
      "type": "15",
      "typeLibelle": "Mèl",
      "valElec": "jean.ueberschlag@wanadoo.fr"
    },
    {
      "xsiType": "AdressePostale_Type",
      "uid": "AD221293",
      "type": "2",
      "typeLibelle": "Adresse publiée de circonscription",
      "poids": "23",
      "intitule": "Permanence,",
      "numeroRue": "12",
      "nomRue": "Croisée des Lys,",
      "codePostal": "68300",
      "ville": "Saint-Louis"
    },
    {
      "xsiType": "AdresseTelephonique_Type",
      "uid": "AD221294",
      "type": "11",
      "typeLibelle": "Téléphone",
      "poids": "23",
      "adresseDeRattachement": "AD221293",
      "valElec": "03 89 69 15 31"
    },
    {
      "xsiType": "AdresseTelephonique_Type",
      "uid": "AD221296",
      "type": "12",
      "typeLibelle": "Télécopie",
      "poids": "23",
      "adresseDeRattachement": "AD221293",
      "valElec": "03 89 69 00 09"
    },
    {
      "xsiType": "AdresseSiteWeb_Type",
      "uid": "AD383454",
      "type": "22",
      "typeLibelle": "Site internet",
      "valElec": "jean.ueberschlag.over-blog.com"
    },
    {
      "xsiType": "AdressePostale_Type",
      "uid": "AD386933",
      "type": "0",
      "typeLibelle": "Adresse officielle",
      "poids": "1",
      "intitule": "Assemblée nationale,",
      "numeroRue": "126",
      "nomRue": "Rue de l'Université,",
      "codePostal": "75355",
      "ville": "Paris 07 SP"
    },
    {
      "xsiType": "AdresseMail_Type",
      "uid": "AD391962",
      "type": "15",
      "typeLibelle": "Mèl",
      "valElec": "jueberschlag@assemblee-nationale.fr"
    }
  ],
  "mandats": [
    {
      "xsiType": "MandatParlementaire_type",
      "uid": "PM267361",
      "acteurRef": "PA2850",
      "legislature": "12",
      "typeOrgane": "ASSEMBLEE",
      "dateDebut": "2002-06-19T02:00:00.000+02:00",
      "dateFin": "2007-06-19T02:00:00.000+02:00",
      "preseance": "50",
      "nominPrincipale": "1",
      "infosQualite": {
        "codeQualite": "membre",
        "libQualite": "membre",
        "libQualiteSex": "membre"
      },
      "organesRefs": [
        "PO230434"
      ],
      "suppleant": {
        "dateDebut": "2002-06-19T02:00:00.000+02:00",
        "dateFin": "2007-06-19T02:00:00.000+02:00",
        "suppleantRef": "PA267360"
      },
      "election": {
        "lieu": {
          "region": "Grand Est",
          "regionType": "Métropolitain",
          "departement": "Haut-Rhin",
          "numDepartement": "68",
          "numCirco": "4"
        },
        "causeMandat": "élections générales",
        "refCirconscription": "PO230790"
      },
      "mandature": {
        "datePriseFonction": "2002-06-19T02:00:00.000+02:00",
        "causeFin": "Fin de législature",
        "premiereElection": "1"
      }
    },
    {
      "xsiType": "MandatSimple_Type",
      "uid": "PM271291",
      "acteurRef": "PA2850",
      "legislature": "12",
      "typeOrgane": "GP",
      "dateDebut": "2002-06-25T02:00:00.000+02:00",
      "datePublication": "2002-06-26T02:00:00.000+02:00",
      "dateFin": "2007-06-19T02:00:00.000+02:00",
      "preseance": "20",
      "nominPrincipale": "1",
      "infosQualite": {
        "codeQualite": "Membre",
        "libQualite": "Membre du",
        "libQualiteSex": "Membre du"
      },
      "organesRefs": [
        "PO270903"
      ]
    },
    {
      "xsiType": "MandatSimple_Type",
      "uid": "PM271785",
      "acteurRef": "PA2850",
      "legislature": "12",
      "typeOrgane": "COMPER",
      "dateDebut": "2002-06-26T02:00:00.000+02:00",
      "datePublication": "2002-06-27T02:00:00.000+02:00",
      "dateFin": "2007-06-19T02:00:00.000+02:00",
      "preseance": "32",
      "nominPrincipale": "1",
      "infosQualite": {
        "codeQualite": "Membre",
        "libQualite": "Membre",
        "libQualiteSex": "Membre"
      },
      "organesRefs": [
        "PO59045"
      ]
    },
    {
      "xsiType": "MandatParlementaire_type",
      "uid": "PM272257",
      "acteurRef": "PA2850",
      "legislature": "12",
      "typeOrgane": "ASSEMBLEE",
      "dateDebut": "2002-06-26T02:00:00.000+02:00",
      "datePublication": "2002-06-27T02:00:00.000+02:00",
      "dateFin": "2007-06-19T02:00:00.000+02:00",
      "preseance": "20",
      "nominPrincipale": "1",
      "infosQualite": {
        "codeQualite": "Secrétaire",
        "libQualite": "Secrétaire de l'Assemblée nationale",
        "libQualiteSex": "Secrétaire de l'Assemblée nationale"
      },
      "organesRefs": [
        "PO230434"
      ],
      "election": {
        "lieu": {}
      },
      "mandature": {
        "premiereElection": "0"
      }
    },
    {
      "xsiType": "MandatSimple_Type",
      "uid": "PM273561",
      "acteurRef": "PA2850",
      "legislature": "12",
      "typeOrgane": "DELEGBUREAU",
      "dateDebut": "2002-07-03T02:00:00.000+02:00",
      "dateFin": "2007-06-19T02:00:00.000+02:00",
      "preseance": "24",
      "nominPrincipale": "1",
      "infosQualite": {
        "codeQualite": "Membre",
        "libQualite": "Membre",
        "libQualiteSex": "Membre"
      },
      "organesRefs": [
        "PO273548"
      ]
    },
    {
      "xsiType": "MandatSimple_Type",
      "uid": "PM273568",
      "acteurRef": "PA2850",
      "legislature": "12",
      "typeOrgane": "DELEGBUREAU",
      "dateDebut": "2002-07-03T02:00:00.000+02:00",
      "dateFin": "2007-06-19T02:00:00.000+02:00",
      "preseance": "24",
      "nominPrincipale": "1",
      "infosQualite": {
        "codeQualite": "Membre",
        "libQualite": "Membre",
        "libQualiteSex": "Membre"
      },
      "organesRefs": [
        "PO273563"
      ]
    },
    {
      "xsiType": "MandatSimple_Type",
      "uid": "PM275032",
      "acteurRef": "PA2850",
      "legislature": "12",
      "typeOrgane": "ORGEXTPARL",
      "dateDebut": "2002-09-03T02:00:00.000+02:00",
      "datePublication": "2002-09-05T02:00:00.000+02:00",
      "dateFin": "2007-06-19T02:00:00.000+02:00",
      "preseance": "20",
      "nominPrincipale": "1",
      "infosQualite": {
        "codeQualite": "Titulaire",
        "libQualite": "Membre titulaire",
        "libQualiteSex": "Membre titulaire"
      },
      "organesRefs": [
        "PO60285"
      ]
    },
    {
      "xsiType": "MandatSimple_Type",
      "uid": "PM275228",
      "acteurRef": "PA2850",
      "legislature": "12",
      "typeOrgane": "ORGEXTPARL",
      "dateDebut": "2002-08-01T02:00:00.000+02:00",
      "datePublication": "2002-08-02T02:00:00.000+02:00",
      "dateFin": "2007-06-19T02:00:00.000+02:00",
      "preseance": "20",
      "nominPrincipale": "1",
      "infosQualite": {
        "codeQualite": "Titulaire",
        "libQualite": "Membre titulaire",
        "libQualiteSex": "Membre titulaire"
      },
      "organesRefs": [
        "PO60241"
      ]
    },
    {
      "xsiType": "MandatSimple_Type",
      "uid": "PM277364",
      "acteurRef": "PA2850",
      "legislature": "12",
      "typeOrgane": "GA",
      "dateDebut": "2002-10-18T02:00:00.000+02:00",
      "dateFin": "2007-06-19T02:00:00.000+02:00",
      "preseance": "20",
      "nominPrincipale": "0",
      "infosQualite": {
        "codeQualite": "Membre",
        "libQualite": "Membre",
        "libQualiteSex": "Membre"
      },
      "organesRefs": [
        "PO274074"
      ]
    },
    {
      "xsiType": "MandatSimple_Type",
      "uid": "PM277365",
      "acteurRef": "PA2850",
      "legislature": "12",
      "typeOrgane": "GA",
      "dateDebut": "2002-10-18T02:00:00.000+02:00",
      "dateFin": "2007-06-19T02:00:00.000+02:00",
      "preseance": "1",
      "nominPrincipale": "1",
      "infosQualite": {
        "codeQualite": "Président",
        "libQualite": "Président",
        "libQualiteSex": "Président"
      },
      "organesRefs": [
        "PO274074"
      ]
    },
    {
      "xsiType": "MandatSimple_Type",
      "uid": "PM286241",
      "acteurRef": "PA2850",
      "legislature": "12",
      "typeOrgane": "GA",
      "dateDebut": "2002-12-17T01:00:00.000+01:00",
      "dateFin": "2007-06-19T02:00:00.000+02:00",
      "preseance": "20",
      "nominPrincipale": "1",
      "infosQualite": {
        "codeQualite": "Membre",
        "libQualite": "Membre",
        "libQualiteSex": "Membre"
      },
      "organesRefs": [
        "PO274082"
      ]
    },
    {
      "xsiType": "MandatSimple_Type",
      "uid": "PM288856",
      "acteurRef": "PA2850",
      "legislature": "12",
      "typeOrgane": "API",
      "dateDebut": "2002-10-01T02:00:00.000+02:00",
      "dateFin": "2007-06-19T02:00:00.000+02:00",
      "preseance": "20",
      "nominPrincipale": "1",
      "infosQualite": {
        "codeQualite": "Membre",
        "libQualite": "Membre",
        "libQualiteSex": "Membre"
      },
      "organesRefs": [
        "PO201115"
      ]
    },
    {
      "xsiType": "MandatSimple_Type",
      "uid": "PM294947",
      "acteurRef": "PA2850",
      "legislature": "12",
      "typeOrgane": "GE",
      "dateDebut": "2003-04-09T02:00:00.000+02:00",
      "dateFin": "2007-06-19T02:00:00.000+02:00",
      "preseance": "20",
      "nominPrincipale": "1",
      "infosQualite": {
        "codeQualite": "Membre",
        "libQualite": "Membre",
        "libQualiteSex": "Membre"
      },
      "organesRefs": [
        "PO292843"
      ]
    },
    {
      "xsiType": "MandatSimple_Type",
      "uid": "PM297302",
      "acteurRef": "PA2850",
      "legislature": "12",
      "typeOrgane": "GE",
      "dateDebut": "2003-04-29T02:00:00.000+02:00",
      "dateFin": "2007-06-19T02:00:00.000+02:00",
      "preseance": "20",
      "nominPrincipale": "1",
      "infosQualite": {
        "codeQualite": "Membre",
        "libQualite": "Membre",
        "libQualiteSex": "Membre"
      },
      "organesRefs": [
        "PO292860"
      ]
    },
    {
      "xsiType": "MandatSimple_Type",
      "uid": "PM311263",
      "acteurRef": "PA2850",
      "legislature": "12",
      "typeOrgane": "ORGEXTPARL",
      "dateDebut": "2005-03-21T01:00:00.000+01:00",
      "datePublication": "2005-03-23T01:00:00.000+01:00",
      "dateFin": "2007-06-19T02:00:00.000+02:00",
      "preseance": "20",
      "nominPrincipale": "1",
      "infosQualite": {
        "codeQualite": "Titulaire",
        "libQualite": "Membre titulaire",
        "libQualiteSex": "Membre titulaire"
      },
      "organesRefs": [
        "PO311260"
      ]
    },
    {
      "xsiType": "MandatSimple_Type",
      "uid": "PM323694",
      "acteurRef": "PA2850",
      "legislature": "12",
      "typeOrgane": "GE",
      "dateDebut": "2006-05-30T02:00:00.000+02:00",
      "dateFin": "2007-06-19T02:00:00.000+02:00",
      "preseance": "20",
      "nominPrincipale": "1",
      "infosQualite": {
        "codeQualite": "Membre",
        "libQualite": "Membre",
        "libQualiteSex": "Membre"
      },
      "organesRefs": [
        "PO287299"
      ]
    },
    {
      "xsiType": "MandatParlementaire_type",
      "uid": "PM386544",
      "acteurRef": "PA2850",
      "legislature": "13",
      "typeOrgane": "ASSEMBLEE",
      "dateDebut": "2007-06-20T02:00:00.000+02:00",
      "dateFin": "2012-06-19T02:00:00.000+02:00",
      "preseance": "50",
      "nominPrincipale": "1",
      "infosQualite": {
        "codeQualite": "membre",
        "libQualite": "membre",
        "libQualiteSex": "membre"
      },
      "organesRefs": [
        "PO384266"
      ],
      "suppleant": {
        "dateDebut": "2007-06-20T02:00:00.000+02:00",
        "dateFin": "2012-06-19T02:00:00.000+02:00",
        "suppleantRef": "PA344693"
      },
      "election": {
        "lieu": {
          "region": "Grand Est",
          "regionType": "Métropolitain",
          "departement": "Haut-Rhin",
          "numDepartement": "68",
          "numCirco": "4"
        },
        "causeMandat": "élections générales",
        "refCirconscription": "PO384622"
      },
      "mandature": {
        "datePriseFonction": "2007-06-20T02:00:00.000+02:00",
        "causeFin": "Fin de législature",
        "premiereElection": "1"
      }
    },
    {
      "xsiType": "MandatSimple_Type",
      "uid": "PM387512",
      "acteurRef": "PA2850",
      "legislature": "13",
      "typeOrgane": "GP",
      "dateDebut": "2007-06-20T02:00:00.000+02:00",
      "dateFin": "2007-06-26T02:00:00.000+02:00",
      "preseance": "28",
      "nominPrincipale": "1",
      "infosQualite": {
        "codeQualite": "Député non-inscrit",
        "libQualite": "Député non-inscrit",
        "libQualiteSex": "Député non-inscrit"
      },
      "organesRefs": [
        "PO387155"
      ]
    },
    {
      "xsiType": "MandatSimple_Type",
      "uid": "PM389992",
      "acteurRef": "PA2850",
      "legislature": "13",
      "typeOrgane": "GP",
      "dateDebut": "2007-06-27T02:00:00.000+02:00",
      "datePublication": "2007-06-27T02:00:00.000+02:00",
      "dateFin": "2012-06-19T02:00:00.000+02:00",
      "preseance": "20",
      "nominPrincipale": "1",
      "infosQualite": {
        "codeQualite": "Membre",
        "libQualite": "Membre du",
        "libQualiteSex": "Membre du"
      },
      "organesRefs": [
        "PO389395"
      ]
    },
    {
      "xsiType": "MandatSimple_Type",
      "uid": "PM390710",
      "acteurRef": "PA2850",
      "legislature": "13",
      "typeOrgane": "COMPER",
      "dateDebut": "2007-06-27T02:00:00.000+02:00",
      "datePublication": "2007-06-28T02:00:00.000+02:00",
      "dateFin": "2008-04-17T02:00:00.000+02:00",
      "preseance": "32",
      "nominPrincipale": "1",
      "infosQualite": {
        "codeQualite": "Membre",
        "libQualite": "Membre",
        "libQualiteSex": "Membre"
      },
      "organesRefs": [
        "PO59047"
      ]
    },
    {
      "xsiType": "MandatSimple_Type",
      "uid": "PM394514",
      "acteurRef": "PA2850",
      "legislature": "13",
      "typeOrgane": "ORGEXTPARL",
      "dateDebut": "2007-08-01T02:00:00.000+02:00",
      "datePublication": "2007-08-02T02:00:00.000+02:00",
      "dateFin": "2007-08-01T02:00:00.000+02:00",
      "preseance": "20",
      "nominPrincipale": "1",
      "infosQualite": {
        "codeQualite": "Titulaire",
        "libQualite": "Membre titulaire",
        "libQualiteSex": "Membre titulaire"
      },
      "organesRefs": [
        "PO60285"
      ]
    },
    {
      "xsiType": "MandatSimple_Type",
      "uid": "PM394543",
      "acteurRef": "PA2850",
      "legislature": "13",
      "typeOrgane": "ORGEXTPARL",
      "dateDebut": "2007-08-01T02:00:00.000+02:00",
      "datePublication": "2007-08-02T02:00:00.000+02:00",
      "dateFin": "2012-05-14T02:00:00.000+02:00",
      "preseance": "20",
      "nominPrincipale": "1",
      "infosQualite": {
        "codeQualite": "Titulaire",
        "libQualite": "Membre titulaire",
        "libQualiteSex": "Membre titulaire"
      },
      "organesRefs": [
        "PO60241"
      ]
    },
    {
      "xsiType": "MandatSimple_Type",
      "uid": "PM394628",
      "acteurRef": "PA2850",
      "legislature": "13",
      "typeOrgane": "ORGEXTPARL",
      "dateDebut": "2007-08-01T02:00:00.000+02:00",
      "datePublication": "2007-08-02T02:00:00.000+02:00",
      "dateFin": "2010-08-01T02:00:00.000+02:00",
      "preseance": "20",
      "nominPrincipale": "1",
      "infosQualite": {
        "codeQualite": "Titulaire",
        "libQualite": "Membre titulaire",
        "libQualiteSex": "Membre titulaire"
      },
      "organesRefs": [
        "PO311260"
      ]
    },
    {
      "xsiType": "MandatSimple_Type",
      "uid": "PM395720",
      "acteurRef": "PA2850",
      "legislature": "13",
      "typeOrgane": "GA",
      "dateDebut": "2007-09-27T02:00:00.000+02:00",
      "dateFin": "2012-06-19T02:00:00.000+02:00",
      "preseance": "20",
      "nominPrincipale": "0",
      "infosQualite": {
        "codeQualite": "Membre",
        "libQualite": "Membre",
        "libQualiteSex": "Membre"
      },
      "organesRefs": [
        "PO393413"
      ]
    },
    {
      "xsiType": "MandatSimple_Type",
      "uid": "PM395721",
      "acteurRef": "PA2850",
      "legislature": "13",
      "typeOrgane": "GA",
      "dateDebut": "2007-09-27T02:00:00.000+02:00",
      "dateFin": "2012-06-19T02:00:00.000+02:00",
      "preseance": "1",
      "nominPrincipale": "1",
      "infosQualite": {
        "codeQualite": "Président",
        "libQualite": "Président",
        "libQualiteSex": "Président"
      },
      "organesRefs": [
        "PO393413"
      ]
    },
    {
      "xsiType": "MandatSimple_Type",
      "uid": "PM403417",
      "acteurRef": "PA2850",
      "legislature": "13",
      "typeOrgane": "API",
      "dateDebut": "2007-11-08T01:00:00.000+01:00",
      "datePublication": "2007-11-09T01:00:00.000+01:00",
      "dateFin": "2012-06-19T02:00:00.000+02:00",
      "preseance": "20",
      "nominPrincipale": "1",
      "infosQualite": {
        "codeQualite": "Membre",
        "libQualite": "Membre",
        "libQualiteSex": "Membre"
      },
      "organesRefs": [
        "PO201115"
      ]
    },
    {
      "xsiType": "MandatSimple_Type",
      "uid": "PM408061",
      "acteurRef": "PA2850",
      "legislature": "13",
      "typeOrgane": "GE",
      "dateDebut": "2008-01-23T01:00:00.000+01:00",
      "dateFin": "2012-06-19T02:00:00.000+02:00",
      "preseance": "20",
      "nominPrincipale": "1",
      "infosQualite": {
        "codeQualite": "Membre",
        "libQualite": "Membre",
        "libQualiteSex": "Membre"
      },
      "organesRefs": [
        "PO403051"
      ]
    },
    {
      "xsiType": "MandatSimple_Type",
      "uid": "PM408584",
      "acteurRef": "PA2850",
      "legislature": "13",
      "typeOrgane": "ORGEXTPARL",
      "dateDebut": "2008-02-06T01:00:00.000+01:00",
      "datePublication": "2008-02-07T01:00:00.000+01:00",
      "dateFin": "2011-01-24T01:00:00.000+01:00",
      "preseance": "20",
      "nominPrincipale": "1",
      "infosQualite": {
        "codeQualite": "Titulaire",
        "libQualite": "Membre titulaire",
        "libQualiteSex": "Membre titulaire"
      },
      "organesRefs": [
        "PO313844"
      ]
    },
    {
      "xsiType": "MandatSimple_Type",
      "uid": "PM409707",
      "acteurRef": "PA2850",
      "legislature": "13",
      "typeOrgane": "GE",
      "dateDebut": "2008-02-25T01:00:00.000+01:00",
      "dateFin": "2012-06-19T02:00:00.000+02:00",
      "preseance": "20",
      "nominPrincipale": "1",
      "infosQualite": {
        "codeQualite": "Membre",
        "libQualite": "Membre",
        "libQualiteSex": "Membre"
      },
      "organesRefs": [
        "PO403301"
      ]
    },
    {
      "xsiType": "MandatSimple_Type",
      "uid": "PM412712",
      "acteurRef": "PA2850",
      "legislature": "13",
      "typeOrgane": "COMPER",
      "dateDebut": "2008-04-18T02:00:00.000+02:00",
      "datePublication": "2008-04-18T02:00:00.000+02:00",
      "dateFin": "2009-06-30T02:00:00.000+02:00",
      "preseance": "32",
      "nominPrincipale": "1",
      "infosQualite": {
        "codeQualite": "Membre",
        "libQualite": "Membre",
        "libQualiteSex": "Membre"
      },
      "organesRefs": [
        "PO59045"
      ]
    },
    {
      "xsiType": "MandatSimple_Type",
      "uid": "PM416467",
      "acteurRef": "PA2850",
      "legislature": "13",
      "typeOrgane": "CNPS",
      "dateDebut": "2008-10-28T01:00:00.000+01:00",
      "datePublication": "2008-10-29T01:00:00.000+01:00",
      "dateFin": "2009-07-01T02:00:00.000+02:00",
      "preseance": "20",
      "nominPrincipale": "1",
      "infosQualite": {
        "codeQualite": "Membre",
        "libQualite": "Membre",
        "libQualiteSex": "Membre"
      },
      "organesRefs": [
        "PO416249"
      ]
    },
    {
      "xsiType": "MandatSimple_Type",
      "uid": "PM416935",
      "acteurRef": "PA2850",
      "legislature": "13",
      "typeOrgane": "GE",
      "dateDebut": "2008-02-20T01:00:00.000+01:00",
      "dateFin": "2012-06-19T02:00:00.000+02:00",
      "preseance": "20",
      "nominPrincipale": "1",
      "infosQualite": {
        "codeQualite": "Membre",
        "libQualite": "Membre",
        "libQualiteSex": "Membre"
      },
      "organesRefs": [
        "PO402973"
      ]
    },
    {
      "xsiType": "MandatSimple_Type",
      "uid": "PM420519",
      "acteurRef": "PA2850",
      "legislature": "13",
      "typeOrgane": "COMPER",
      "dateDebut": "2009-07-01T02:00:00.000+02:00",
      "datePublication": "2009-07-01T02:00:00.000+02:00",
      "dateFin": "2010-09-30T02:00:00.000+02:00",
      "preseance": "32",
      "nominPrincipale": "1",
      "infosQualite": {
        "codeQualite": "Membre",
        "libQualite": "Membre",
        "libQualiteSex": "Membre"
      },
      "organesRefs": [
        "PO420120"
      ]
    },
    {
      "xsiType": "MandatSimple_Type",
      "uid": "PM422009",
      "acteurRef": "PA2850",
      "legislature": "13",
      "typeOrgane": "GE",
      "dateDebut": "2007-10-31T01:00:00.000+01:00",
      "dateFin": "2012-06-19T02:00:00.000+02:00",
      "preseance": "20",
      "nominPrincipale": "1",
      "infosQualite": {
        "codeQualite": "Membre",
        "libQualite": "Membre",
        "libQualiteSex": "Membre"
      },
      "organesRefs": [
        "PO403063"
      ]
    },
    {
      "xsiType": "MandatSimple_Type",
      "uid": "PM425140",
      "acteurRef": "PA2850",
      "legislature": "13",
      "typeOrgane": "COMPER",
      "dateDebut": "2010-10-01T02:00:00.000+02:00",
      "datePublication": "2010-10-01T02:00:00.000+02:00",
      "dateFin": "2012-06-19T02:00:00.000+02:00",
      "preseance": "32",
      "nominPrincipale": "1",
      "infosQualite": {
        "codeQualite": "Membre",
        "libQualite": "Membre",
        "libQualiteSex": "Membre"
      },
      "organesRefs": [
        "PO419604"
      ]
    },
    {
      "xsiType": "MandatSimple_Type",
      "uid": "PM426609",
      "acteurRef": "PA2850",
      "legislature": "13",
      "typeOrgane": "ORGEXTPARL",
      "dateDebut": "2011-01-14T01:00:00.000+01:00",
      "datePublication": "2011-01-15T01:00:00.000+01:00",
      "dateFin": "2011-09-28T02:00:00.000+02:00",
      "preseance": "20",
      "nominPrincipale": "1",
      "infosQualite": {
        "codeQualite": "Titulaire",
        "libQualite": "Membre titulaire",
        "libQualiteSex": "Membre titulaire"
      },
      "organesRefs": [
        "PO311260"
      ]
    }
  ]
}