{
  "uid": "PA267028",
  "etatCivil": {
    "ident": {
      "civ": "M.",
      "prenom": "Daniel",
      "nom": "Fidelin",
      "alpha": "Fidelin"
    },
    "infoNaissance": {
      "dateNais": "1948-05-25T01:00:00.000+01:00",
      "villeNais": "Fécamp",
      "depNais": "Seine-Maritime",
      "paysNais": "France"
    }
  },
  "profession": {
    "libelleCourant": "Assureur",
    "socProcInsee": {
      "catSocPro": "Commerçants et assimilés",
      "famSocPro": "Artisans, commerçants et chefs d'entreprise"
    }
  },
  "adresses": [
    {
      "xsiType": "AdressePostale_Type",
      "uid": "AD11962",
      "type": "2",
      "typeLibelle": "Adresse publiée de circonscription",
      "poids": "21",
      "intitule": "Permanence",
      "numeroRue": "21",
      "nomRue": "Rue des Mégissiers,",
      "complementAdresse": "BP 21,",
      "codePostal": "76290",
      "ville": "Montivilliers"
    },
    {
      "xsiType": "AdresseTelephonique_Type",
      "uid": "AD11963",
      "type": "11",
      "typeLibelle": "Téléphone",
      "poids": "21",
      "adresseDeRattachement": "AD11962",
      "valElec": "02 35 20 74 55"
    },
    {
      "xsiType": "AdressePostale_Type",
      "uid": "AD275713",
      "type": "2",
      "typeLibelle": "Adresse publiée de circonscription",
      "poids": "22",
      "intitule": "Permanence parlementaire,",
      "numeroRue": "28",
      "nomRue": "Rue de l'Inondation,",
      "complementAdresse": "BP 61,",
      "codePostal": "76400",
      "ville": "Fécamp"
    },
    {
      "xsiType": "AdresseTelephonique_Type",
      "uid": "AD275714",
      "type": "11",
      "typeLibelle": "Téléphone",
      "poids": "22",
      "adresseDeRattachement": "AD275713",
      "valElec": "02 35 28 53 09"
    },
    {
      "xsiType": "AdresseMail_Type",
      "uid": "AD288902",
      "type": "15",
      "typeLibelle": "Mèl",
      "valElec": "d.fidelin.depute@wanadoo.fr"
    },
    {
      "xsiType": "AdresseTelephonique_Type",
      "uid": "AD288954",
      "type": "12",
      "typeLibelle": "Télécopie",
      "poids": "21",
      "adresseDeRattachement": "AD11962",
      "valElec": "02 35 55 28 00"
    },
    {
      "xsiType": "AdresseTelephonique_Type",
      "uid": "AD288955",
      "type": "12",
      "typeLibelle": "Télécopie",
      "poids": "22",
      "adresseDeRattachement": "AD275713",
      "valElec": "02 35 27 79 86"
    },
    {
      "xsiType": "AdressePostale_Type",
      "uid": "AD387002",
      "type": "0",
      "typeLibelle": "Adresse officielle",
      "poids": "1",
      "intitule": "Assemblée nationale,",
      "numeroRue": "126",
      "nomRue": "Rue de l'Université,",
      "codePostal": "75355",
      "ville": "Paris 07 SP"
    },
    {
      "xsiType": "AdresseMail_Type",
      "uid": "AD389203",
      "type": "15",
      "typeLibelle": "Mèl",
      "valElec": "fidelin.monti@wanadoo.fr"
    },
    {
      "xsiType": "AdresseMail_Type",
      "uid": "AD392010",
      "type": "15",
      "typeLibelle": "Mèl",
      "valElec": "dfidelin@assemblee-nationale.fr"
    }
  ],
  "mandats": [
    {
      "xsiType": "MandatParlementaire_type",
      "uid": "PM267030",
      "acteurRef": "PA267028",
      "legislature": "12",
      "typeOrgane": "ASSEMBLEE",
      "dateDebut": "2002-06-19T02:00:00.000+02:00",
      "dateFin": "2007-06-19T02:00:00.000+02:00",
      "preseance": "50",
      "nominPrincipale": "1",
      "infosQualite": {
        "codeQualite": "membre",
        "libQualite": "membre",
        "libQualiteSex": "membre"
      },
      "organesRefs": [
        "PO230434"
      ],
      "suppleant": {
        "dateDebut": "2002-06-19T02:00:00.000+02:00",
        "dateFin": "2007-06-19T02:00:00.000+02:00",
        "suppleantRef": "PA267029"
      },
      "election": {
        "lieu": {
          "region": "Normandie",
          "regionType": "Métropolitain",
          "departement": "Seine-Maritime",
          "numDepartement": "76",
          "numCirco": "9"
        },
        "causeMandat": "élections générales",
        "refCirconscription": "PO230859"
      },
      "mandature": {
        "datePriseFonction": "2002-06-19T02:00:00.000+02:00",
        "causeFin": "Fin de législature",
        "premiereElection": "0"
      }
    },
    {
      "xsiType": "MandatSimple_Type",
      "uid": "PM271087",
      "acteurRef": "PA267028",
      "legislature": "12",
      "typeOrgane": "GP",
      "dateDebut": "2002-06-25T02:00:00.000+02:00",
      "datePublication": "2002-06-26T02:00:00.000+02:00",
      "dateFin": "2007-06-19T02:00:00.000+02:00",
      "preseance": "20",
      "nominPrincipale": "1",
      "infosQualite": {
        "codeQualite": "Membre",
        "libQualite": "Membre du",
        "libQualiteSex": "Membre du"
      },
      "organesRefs": [
        "PO270903"
      ]
    },
    {
      "xsiType": "MandatSimple_Type",
      "uid": "PM271633",
      "acteurRef": "PA267028",
      "legislature": "12",
      "typeOrgane": "COMPER",
      "dateDebut": "2002-06-26T02:00:00.000+02:00",
      "datePublication": "2002-06-27T02:00:00.000+02:00",
      "dateFin": "2007-06-19T02:00:00.000+02:00",
      "preseance": "32",
      "nominPrincipale": "1",
      "infosQualite": {
        "codeQualite": "Membre",
        "libQualite": "Membre",
        "libQualiteSex": "Membre"
      },
      "organesRefs": [
        "PO277060"
      ]
    },
    {
      "xsiType": "MandatSimple_Type",
      "uid": "PM290309",
      "acteurRef": "PA267028",
      "legislature": "12",
      "typeOrgane": "GE",
      "dateDebut": "2003-02-11T01:00:00.000+01:00",
      "dateFin": "2007-06-19T02:00:00.000+02:00",
      "preseance": "20",
      "nominPrincipale": "1",
      "infosQualite": {
        "codeQualite": "Membre",
        "libQualite": "Membre",
        "libQualiteSex": "Membre"
      },
      "organesRefs": [
        "PO287313"
      ]
    },
    {
      "xsiType": "MandatSimple_Type",
      "uid": "PM290599",
      "acteurRef": "PA267028",
      "legislature": "12",
      "typeOrgane": "GE",
      "dateDebut": "2003-03-05T01:00:00.000+01:00",
      "dateFin": "2007-06-19T02:00:00.000+02:00",
      "preseance": "20",
      "nominPrincipale": "1",
      "infosQualite": {
        "codeQualite": "Membre",
        "libQualite": "Membre",
        "libQualiteSex": "Membre"
      },
      "organesRefs": [
        "PO285107"
      ]
    },
    {
      "xsiType": "MandatSimple_Type",
      "uid": "PM293613",
      "acteurRef": "PA267028",
      "legislature": "12",
      "typeOrgane": "GE",
      "dateDebut": "2002-10-26T02:00:00.000+02:00",
      "dateFin": "2007-06-19T02:00:00.000+02:00",
      "preseance": "20",
      "nominPrincipale": "1",
      "infosQualite": {
        "codeQualite": "Membre",
        "libQualite": "Membre",
        "libQualiteSex": "Membre"
      },
      "organesRefs": [
        "PO285132"
      ]
    },
    {
      "xsiType": "MandatSimple_Type",
      "uid": "PM299459",
      "acteurRef": "PA267028",
      "legislature": "12",
      "typeOrgane": "GE",
      "dateDebut": "2003-04-08T02:00:00.000+02:00",
      "dateFin": "2007-06-19T02:00:00.000+02:00",
      "preseance": "20",
      "nominPrincipale": "1",
      "infosQualite": {
        "codeQualite": "Membre",
        "libQualite": "Membre",
        "libQualiteSex": "Membre"
      },
      "organesRefs": [
        "PO285111"
      ]
    },
    {
      "xsiType": "MandatSimple_Type",
      "uid": "PM300176",
      "acteurRef": "PA267028",
      "legislature": "12",
      "typeOrgane": "GE",
      "dateDebut": "2004-01-20T01:00:00.000+01:00",
      "dateFin": "2007-06-19T02:00:00.000+02:00",
      "preseance": "20",
      "nominPrincipale": "1",
      "infosQualite": {
        "codeQualite": "Membre",
        "libQualite": "Membre",
        "libQualiteSex": "Membre"
      },
      "organesRefs": [
        "PO295253"
      ]
    },
    {
      "xsiType": "MandatSimple_Type",
      "uid": "PM310071",
      "acteurRef": "PA267028",
      "legislature": "12",
      "typeOrgane": "GE",
      "dateDebut": "2002-10-16T02:00:00.000+02:00",
      "dateFin": "2007-06-19T02:00:00.000+02:00",
      "preseance": "20",
      "nominPrincipale": "1",
      "infosQualite": {
        "codeQualite": "Membre",
        "libQualite": "Membre",
        "libQualiteSex": "Membre"
      },
      "organesRefs": [
        "PO285038"
      ]
    },
    {
      "xsiType": "MandatSimple_Type",
      "uid": "PM311161",
      "acteurRef": "PA267028",
      "legislature": "12",
      "typeOrgane": "GE",
      "dateDebut": "2003-01-01T01:00:00.000+01:00",
      "dateFin": "2007-06-19T02:00:00.000+02:00",
      "preseance": "20",
      "nominPrincipale": "1",
      "infosQualite": {
        "codeQualite": "Membre",
        "libQualite": "Membre",
        "libQualiteSex": "Membre"
      },
      "organesRefs": [
        "PO285097"
      ]
    },
    {
      "xsiType": "MandatSimple_Type",
      "uid": "PM311338",
      "acteurRef": "PA267028",
      "legislature": "12",
      "typeOrgane": "GE",
      "dateDebut": "2005-03-14T01:00:00.000+01:00",
      "dateFin": "2007-06-19T02:00:00.000+02:00",
      "preseance": "20",
      "nominPrincipale": "1",
      "infosQualite": {
        "codeQualite": "Membre",
        "libQualite": "Membre",
        "libQualiteSex": "Membre"
      },
      "organesRefs": [
        "PO309941"
      ]
    },
    {
      "xsiType": "MandatSimple_Type",
      "uid": "PM312074",
      "acteurRef": "PA267028",
      "legislature": "12",
      "typeOrgane": "GE",
      "dateDebut": "2004-01-01T01:00:00.000+01:00",
      "dateFin": "2007-06-19T02:00:00.000+02:00",
      "preseance": "20",
      "nominPrincipale": "1",
      "infosQualite": {
        "codeQualite": "Membre",
        "libQualite": "Membre",
        "libQualiteSex": "Membre"
      },
      "organesRefs": [
        "PO293186"
      ]
    },
    {
      "xsiType": "MandatSimple_Type",
      "uid": "PM323858",
      "acteurRef": "PA267028",
      "legislature": "12",
      "typeOrgane": "GE",
      "dateDebut": "2006-05-30T02:00:00.000+02:00",
      "dateFin": "2007-06-19T02:00:00.000+02:00",
      "preseance": "20",
      "nominPrincipale": "1",
      "infosQualite": {
        "codeQualite": "Membre",
        "libQualite": "Membre",
        "libQualiteSex": "Membre"
      },
      "organesRefs": [
        "PO287299"
      ]
    },
    {
      "xsiType": "MandatSimple_Type",
      "uid": "PM381603",
      "acteurRef": "PA267028",
      "legislature": "12",
      "typeOrgane": "GE",
      "dateDebut": "2006-12-13T01:00:00.000+01:00",
      "dateFin": "2007-06-19T02:00:00.000+02:00",
      "preseance": "20",
      "nominPrincipale": "1",
      "infosQualite": {
        "codeQualite": "Membre",
        "libQualite": "Membre",
        "libQualiteSex": "Membre"
      },
      "organesRefs": [
        "PO324488"
      ]
    },
    {
      "xsiType": "MandatParlementaire_type",
      "uid": "PM386208",
      "acteurRef": "PA267028",
      "legislature": "13",
      "typeOrgane": "ASSEMBLEE",
      "dateDebut": "2007-06-20T02:00:00.000+02:00",
      "dateFin": "2012-06-19T02:00:00.000+02:00",
      "preseance": "50",
      "nominPrincipale": "1",
      "infosQualite": {
        "codeQualite": "membre",
        "libQualite": "membre",
        "libQualiteSex": "membre"
      },
      "organesRefs": [
        "PO384266"
      ],
      "suppleant": {
        "dateDebut": "2007-06-20T02:00:00.000+02:00",
        "dateFin": "2012-06-19T02:00:00.000+02:00",
        "suppleantRef": "PA345648"
      },
      "election": {
        "lieu": {
          "region": "Normandie",
          "regionType": "Métropolitain",
          "departement": "Seine-Maritime",
          "numDepartement": "76",
          "numCirco": "9"
        },
        "causeMandat": "élections générales",
        "refCirconscription": "PO384691"
      },
      "mandature": {
        "datePriseFonction": "2007-06-20T02:00:00.000+02:00",
        "causeFin": "Fin de législature",
        "premiereElection": "1"
      }
    },
    {
      "xsiType": "MandatSimple_Type",
      "uid": "PM387581",
      "acteurRef": "PA267028",
      "legislature": "13",
      "typeOrgane": "GP",
      "dateDebut": "2007-06-20T02:00:00.000+02:00",
      "dateFin": "2007-06-26T02:00:00.000+02:00",
      "preseance": "28",
      "nominPrincipale": "1",
      "infosQualite": {
        "codeQualite": "Député non-inscrit",
        "libQualite": "Député non-inscrit",
        "libQualiteSex": "Député non-inscrit"
      },
      "organesRefs": [
        "PO387155"
      ]
    },
    {
      "xsiType": "MandatSimple_Type",
      "uid": "PM389797",
      "acteurRef": "PA267028",
      "legislature": "13",
      "typeOrgane": "GP",
      "dateDebut": "2007-06-27T02:00:00.000+02:00",
      "datePublication": "2007-06-27T02:00:00.000+02:00",
      "dateFin": "2012-06-19T02:00:00.000+02:00",
      "preseance": "20",
      "nominPrincipale": "1",
      "infosQualite": {
        "codeQualite": "Membre",
        "libQualite": "Membre du",
        "libQualiteSex": "Membre du"
      },
      "organesRefs": [
        "PO389395"
      ]
    },
    {
      "xsiType": "MandatSimple_Type",
      "uid": "PM390381",
      "acteurRef": "PA267028",
      "legislature": "13",
      "typeOrgane": "COMPER",
      "dateDebut": "2007-06-27T02:00:00.000+02:00",
      "datePublication": "2007-06-28T02:00:00.000+02:00",
      "dateFin": "2009-06-30T02:00:00.000+02:00",
      "preseance": "32",
      "nominPrincipale": "1",
      "infosQualite": {
        "codeQualite": "Membre",
        "libQualite": "Membre",
        "libQualiteSex": "Membre"
      },
      "organesRefs": [
        "PO277060"
      ]
    },
    {
      "xsiType": "MandatSimple_Type",
      "uid": "PM401049",
      "acteurRef": "PA267028",
      "legislature": "13",
      "typeOrgane": "GA",
      "dateDebut": "2007-10-24T02:00:00.000+02:00",
      "dateFin": "2012-06-19T02:00:00.000+02:00",
      "preseance": "20",
      "nominPrincipale": "1",
      "infosQualite": {
        "codeQualite": "Membre",
        "libQualite": "Membre",
        "libQualiteSex": "Membre"
      },
      "organesRefs": [
        "PO392785"
      ]
    },
    {
      "xsiType": "MandatSimple_Type",
      "uid": "PM401050",
      "acteurRef": "PA267028",
      "legislature": "13",
      "typeOrgane": "GA",
      "dateDebut": "2007-10-24T02:00:00.000+02:00",
      "dateFin": "2012-06-19T02:00:00.000+02:00",
      "preseance": "20",
      "nominPrincipale": "1",
      "infosQualite": {
        "codeQualite": "Membre",
        "libQualite": "Membre",
        "libQualiteSex": "Membre"
      },
      "organesRefs": [
        "PO392800"
      ]
    },
    {
      "xsiType": "MandatSimple_Type",
      "uid": "PM401051",
      "acteurRef": "PA267028",
      "legislature": "13",
      "typeOrgane": "GA",
      "dateDebut": "2007-10-24T02:00:00.000+02:00",
      "dateFin": "2012-06-19T02:00:00.000+02:00",
      "preseance": "20",
      "nominPrincipale": "1",
      "infosQualite": {
        "codeQualite": "Membre",
        "libQualite": "Membre",
        "libQualiteSex": "Membre"
      },
      "organesRefs": [
        "PO392840"
      ]
    },
    {
      "xsiType": "MandatSimple_Type",
      "uid": "PM401052",
      "acteurRef": "PA267028",
      "legislature": "13",
      "typeOrgane": "GA",
      "dateDebut": "2007-10-24T02:00:00.000+02:00",
      "dateFin": "2012-06-19T02:00:00.000+02:00",
      "preseance": "20",
      "nominPrincipale": "1",
      "infosQualite": {
        "codeQualite": "Membre",
        "libQualite": "Membre",
        "libQualiteSex": "Membre"
      },
      "organesRefs": [
        "PO392915"
      ]
    },
    {
      "xsiType": "MandatSimple_Type",
      "uid": "PM401053",
      "acteurRef": "PA267028",
      "legislature": "13",
      "typeOrgane": "GA",
      "dateDebut": "2007-10-24T02:00:00.000+02:00",
      "dateFin": "2012-06-19T02:00:00.000+02:00",
      "preseance": "20",
      "nominPrincipale": "1",
      "infosQualite": {
        "codeQualite": "Membre",
        "libQualite": "Membre",
        "libQualiteSex": "Membre"
      },
      "organesRefs": [
        "PO392940"
      ]
    },
    {
      "xsiType": "MandatSimple_Type",
      "uid": "PM401054",
      "acteurRef": "PA267028",
      "legislature": "13",
      "typeOrgane": "GA",
      "dateDebut": "2007-10-24T02:00:00.000+02:00",
      "dateFin": "2012-06-19T02:00:00.000+02:00",
      "preseance": "20",
      "nominPrincipale": "1",
      "infosQualite": {
        "codeQualite": "Membre",
        "libQualite": "Membre",
        "libQualiteSex": "Membre"
      },
      "organesRefs": [
        "PO393075"
      ]
    },
    {
      "xsiType": "MandatSimple_Type",
      "uid": "PM401055",
      "acteurRef": "PA267028",
      "legislature": "13",
      "typeOrgane": "GA",
      "dateDebut": "2007-10-24T02:00:00.000+02:00",
      "dateFin": "2012-06-19T02:00:00.000+02:00",
      "preseance": "20",
      "nominPrincipale": "1",
      "infosQualite": {
        "codeQualite": "Membre",
        "libQualite": "Membre",
        "libQualiteSex": "Membre"
      },
      "organesRefs": [
        "PO393100"
      ]
    },
    {
      "xsiType": "MandatSimple_Type",
      "uid": "PM401056",
      "acteurRef": "PA267028",
      "legislature": "13",
      "typeOrgane": "GA",
      "dateDebut": "2007-10-24T02:00:00.000+02:00",
      "dateFin": "2012-06-19T02:00:00.000+02:00",
      "preseance": "20",
      "nominPrincipale": "1",
      "infosQualite": {
        "codeQualite": "Membre",
        "libQualite": "Membre",
        "libQualiteSex": "Membre"
      },
      "organesRefs": [
        "PO393192"
      ]
    },
    {
      "xsiType": "MandatSimple_Type",
      "uid": "PM401057",
      "acteurRef": "PA267028",
      "legislature": "13",
      "typeOrgane": "GA",
      "dateDebut": "2007-10-24T02:00:00.000+02:00",
      "dateFin": "2012-06-19T02:00:00.000+02:00",
      "preseance": "20",
      "nominPrincipale": "1",
      "infosQualite": {
        "codeQualite": "Membre",
        "libQualite": "Membre",
        "libQualiteSex": "Membre"
      },
      "organesRefs": [
        "PO393207"
      ]
    },
    {
      "xsiType": "MandatSimple_Type",
      "uid": "PM405521",
      "acteurRef": "PA267028",
      "legislature": "13",
      "typeOrgane": "GE",
      "dateDebut": "2007-12-12T01:00:00.000+01:00",
      "dateFin": "2012-06-19T02:00:00.000+02:00",
      "preseance": "20",
      "nominPrincipale": "1",
      "infosQualite": {
        "codeQualite": "Membre",
        "libQualite": "Membre",
        "libQualiteSex": "Membre"
      },
      "organesRefs": [
        "PO402808"
      ]
    },
    {
      "xsiType": "MandatSimple_Type",
      "uid": "PM405907",
      "acteurRef": "PA267028",
      "legislature": "13",
      "typeOrgane": "GE",
      "dateDebut": "2007-12-20T01:00:00.000+01:00",
      "dateFin": "2012-06-19T02:00:00.000+02:00",
      "preseance": "20",
      "nominPrincipale": "1",
      "infosQualite": {
        "codeQualite": "Membre",
        "libQualite": "Membre",
        "libQualiteSex": "Membre"
      },
      "organesRefs": [
        "PO403141"
      ]
    },
    {
      "xsiType": "MandatSimple_Type",
      "uid": "PM407886",
      "acteurRef": "PA267028",
      "legislature": "13",
      "typeOrgane": "GE",
      "dateDebut": "2008-01-29T01:00:00.000+01:00",
      "dateFin": "2012-06-19T02:00:00.000+02:00",
      "preseance": "20",
      "nominPrincipale": "1",
      "infosQualite": {
        "codeQualite": "Membre",
        "libQualite": "Membre",
        "libQualiteSex": "Membre"
      },
      "organesRefs": [
        "PO403268"
      ]
    },
    {
      "xsiType": "MandatSimple_Type",
      "uid": "PM408085",
      "acteurRef": "PA267028",
      "legislature": "13",
      "typeOrgane": "GE",
      "dateDebut": "2008-01-30T01:00:00.000+01:00",
      "dateFin": "2012-06-19T02:00:00.000+02:00",
      "preseance": "20",
      "nominPrincipale": "1",
      "infosQualite": {
        "codeQualite": "Membre",
        "libQualite": "Membre",
        "libQualiteSex": "Membre"
      },
      "organesRefs": [
        "PO402782"
      ]
    },
    {
      "xsiType": "MandatSimple_Type",
      "uid": "PM408104",
      "acteurRef": "PA267028",
      "legislature": "13",
      "typeOrgane": "GE",
      "dateDebut": "2008-01-30T01:00:00.000+01:00",
      "dateFin": "2012-06-19T02:00:00.000+02:00",
      "preseance": "8",
      "nominPrincipale": "1",
      "infosQualite": {
        "codeQualite": "Vice-Président",
        "libQualite": "Vice-Président",
        "libQualiteSex": "Vice-Président"
      },
      "organesRefs": [
        "PO403141"
      ]
    },
    {
      "xsiType": "MandatSimple_Type",
      "uid": "PM408343",
      "acteurRef": "PA267028",
      "legislature": "13",
      "typeOrgane": "GE",
      "dateDebut": "2008-02-02T01:00:00.000+01:00",
      "dateFin": "2012-06-19T02:00:00.000+02:00",
      "preseance": "20",
      "nominPrincipale": "1",
      "infosQualite": {
        "codeQualite": "Membre",
        "libQualite": "Membre",
        "libQualiteSex": "Membre"
      },
      "organesRefs": [
        "PO402727"
      ]
    },
    {
      "xsiType": "MandatSimple_Type",
      "uid": "PM408537",
      "acteurRef": "PA267028",
      "legislature": "13",
      "typeOrgane": "GE",
      "dateDebut": "2008-02-07T01:00:00.000+01:00",
      "dateFin": "2012-06-19T02:00:00.000+02:00",
      "preseance": "20",
      "nominPrincipale": "1",
      "infosQualite": {
        "codeQualite": "Membre",
        "libQualite": "Membre",
        "libQualiteSex": "Membre"
      },
      "organesRefs": [
        "PO403148"
      ]
    },
    {
      "xsiType": "MandatSimple_Type",
      "uid": "PM408542",
      "acteurRef": "PA267028",
      "legislature": "13",
      "typeOrgane": "GE",
      "dateDebut": "2008-02-07T01:00:00.000+01:00",
      "dateFin": "2012-06-19T02:00:00.000+02:00",
      "preseance": "20",
      "nominPrincipale": "1",
      "infosQualite": {
        "codeQualite": "Membre",
        "libQualite": "Membre",
        "libQualiteSex": "Membre"
      },
      "organesRefs": [
        "PO403160"
      ]
    },
    {
      "xsiType": "MandatSimple_Type",
      "uid": "PM408633",
      "acteurRef": "PA267028",
      "legislature": "13",
      "typeOrgane": "GE",
      "dateDebut": "2008-01-14T01:00:00.000+01:00",
      "dateFin": "2012-06-19T02:00:00.000+02:00",
      "preseance": "20",
      "nominPrincipale": "1",
      "infosQualite": {
        "codeQualite": "Membre",
        "libQualite": "Membre",
        "libQualiteSex": "Membre"
      },
      "organesRefs": [
        "PO403015"
      ]
    },
    {
      "xsiType": "MandatSimple_Type",
      "uid": "PM409474",
      "acteurRef": "PA267028",
      "legislature": "13",
      "typeOrgane": "GE",
      "dateDebut": "2008-01-09T01:00:00.000+01:00",
      "dateFin": "2012-06-19T02:00:00.000+02:00",
      "preseance": "20",
      "nominPrincipale": "1",
      "infosQualite": {
        "codeQualite": "Membre",
        "libQualite": "Membre",
        "libQualiteSex": "Membre"
      },
      "organesRefs": [
        "PO403069"
      ]
    },
    {
      "xsiType": "MandatSimple_Type",
      "uid": "PM409778",
      "acteurRef": "PA267028",
      "legislature": "13",
      "typeOrgane": "GE",
      "dateDebut": "2008-02-28T01:00:00.000+01:00",
      "dateFin": "2012-06-19T02:00:00.000+02:00",
      "preseance": "20",
      "nominPrincipale": "1",
      "infosQualite": {
        "codeQualite": "Membre",
        "libQualite": "Membre",
        "libQualiteSex": "Membre"
      },
      "organesRefs": [
        "PO402856"
      ]
    },
    {
      "xsiType": "MandatSimple_Type",
      "uid": "PM411158",
      "acteurRef": "PA267028",
      "legislature": "13",
      "typeOrgane": "GE",
      "dateDebut": "2008-03-25T01:00:00.000+01:00",
      "dateFin": "2012-06-19T02:00:00.000+02:00",
      "preseance": "20",
      "nominPrincipale": "1",
      "infosQualite": {
        "codeQualite": "Membre",
        "libQualite": "Membre",
        "libQualiteSex": "Membre"
      },
      "organesRefs": [
        "PO402997"
      ]
    },
    {
      "xsiType": "MandatSimple_Type",
      "uid": "PM413126",
      "acteurRef": "PA267028",
      "legislature": "13",
      "typeOrgane": "GE",
      "dateDebut": "2008-02-05T01:00:00.000+01:00",
      "dateFin": "2012-06-19T02:00:00.000+02:00",
      "preseance": "20",
      "nominPrincipale": "1",
      "infosQualite": {
        "codeQualite": "Membre",
        "libQualite": "Membre",
        "libQualiteSex": "Membre"
      },
      "organesRefs": [
        "PO403190"
      ]
    },
    {
      "xsiType": "MandatSimple_Type",
      "uid": "PM415406",
      "acteurRef": "PA267028",
      "legislature": "13",
      "typeOrgane": "GE",
      "dateDebut": "2008-05-06T02:00:00.000+02:00",
      "dateFin": "2012-06-19T02:00:00.000+02:00",
      "preseance": "20",
      "nominPrincipale": "1",
      "infosQualite": {
        "codeQualite": "Membre",
        "libQualite": "Membre",
        "libQualiteSex": "Membre"
      },
      "organesRefs": [
        "PO403325"
      ]
    },
    {
      "xsiType": "MandatSimple_Type",
      "uid": "PM420533",
      "acteurRef": "PA267028",
      "legislature": "13",
      "typeOrgane": "COMPER",
      "dateDebut": "2009-07-01T02:00:00.000+02:00",
      "datePublication": "2009-07-01T02:00:00.000+02:00",
      "dateFin": "2012-06-19T02:00:00.000+02:00",
      "preseance": "32",
      "nominPrincipale": "1",
      "infosQualite": {
        "codeQualite": "Membre",
        "libQualite": "Membre",
        "libQualiteSex": "Membre"
      },
      "organesRefs": [
        "PO419865"
      ]
    },
    {
      "xsiType": "MandatMission_Type",
      "uid": "PM421909",
      "acteurRef": "PA267028",
      "legislature": "13",
      "typeOrgane": "MISINFOCOM",
      "dateDebut": "2009-09-16T02:00:00.000+02:00",
      "datePublication": "2009-10-10T02:00:00.000+02:00",
      "dateFin": "2010-03-31T02:00:00.000+02:00",
      "preseance": "20",
      "nominPrincipale": "0",
      "infosQualite": {
        "codeQualite": "Membre",
        "libQualite": "Membre",
        "libQualiteSex": "Membre"
      },
      "organesRefs": [
        "PO421899"
      ]
    },
    {
      "xsiType": "MandatMission_Type",
      "uid": "PM421921",
      "acteurRef": "PA267028",
      "legislature": "13",
      "typeOrgane": "MISINFOCOM",
      "dateDebut": "2009-09-16T02:00:00.000+02:00",
      "datePublication": "2009-10-10T02:00:00.000+02:00",
      "dateFin": "2010-03-31T02:00:00.000+02:00",
      "preseance": "4",
      "nominPrincipale": "1",
      "infosQualite": {
        "codeQualite": "Vice-Président",
        "libQualite": "Vice-président",
        "libQualiteSex": "Vice-président"
      },
      "organesRefs": [
        "PO421899"
      ]
    },
    {
      "xsiType": "MandatSimple_Type",
      "uid": "PM424257",
      "acteurRef": "PA267028",
      "legislature": "13",
      "typeOrgane": "GE",
      "dateDebut": "2010-06-08T02:00:00.000+02:00",
      "dateFin": "2012-06-19T02:00:00.000+02:00",
      "preseance": "20",
      "nominPrincipale": "1",
      "infosQualite": {
        "codeQualite": "Membre",
        "libQualite": "Membre",
        "libQualiteSex": "Membre"
      },
      "organesRefs": [
        "PO422919"
      ]
    },
    {
      "xsiType": "MandatSimple_Type",
      "uid": "PM424389",
      "acteurRef": "PA267028",
      "legislature": "13",
      "typeOrgane": "GE",
      "dateDebut": "2010-02-08T01:00:00.000+01:00",
      "dateFin": "2012-06-19T02:00:00.000+02:00",
      "preseance": "20",
      "nominPrincipale": "1",
      "infosQualite": {
        "codeQualite": "Membre",
        "libQualite": "Membre",
        "libQualiteSex": "Membre"
      },
      "organesRefs": [
        "PO422900"
      ]
    },
    {
      "xsiType": "MandatSimple_Type",
      "uid": "PM491664",
      "acteurRef": "PA267028",
      "legislature": "13",
      "typeOrgane": "CMP",
      "dateDebut": "2012-01-30T01:00:00.000+01:00",
      "datePublication": "2012-01-31T01:00:00.000+01:00",
      "dateFin": "2012-02-13T01:00:00.000+01:00",
      "preseance": "20",
      "nominPrincipale": "1",
      "infosQualite": {
        "codeQualite": "Titulaire",
        "libQualite": "Membre titulaire",
        "libQualiteSex": "Membre titulaire"
      },
      "organesRefs": [
        "PO489394"
      ]
    },
    {
      "xsiType": "MandatSimple_Type",
      "uid": "PM493989",
      "acteurRef": "PA267028",
      "legislature": "13",
      "typeOrgane": "CMP",
      "dateDebut": "2012-02-01T01:00:00.000+01:00",
      "datePublication": "2012-02-03T01:00:00.000+01:00",
      "dateFin": "2012-02-13T01:00:00.000+01:00",
      "preseance": "16",
      "nominPrincipale": "1",
      "infosQualite": {
        "codeQualite": "Rapporteur",
        "libQualite": "Rapporteur",
        "libQualiteSex": "Rapporteur"
      },
      "organesRefs": [
        "PO489394"
      ]
    }
  ]
}