{
  "xsiType": "OrganeExtraParlementaire_type",
  "uid": "PO767963",
  "codeType": "ORGEXTPARL",
  "libelle": "Conseil d'administration de l'Agence nationale pour la rénovation urbaine",
  "libelleAbrege": "Conseil d'administration de l'Agence nationale pour la rénovation urbaine",
  "libelleAbrev": "387",
  "viMoDe": {
    "dateDebut": "2018-11-23T01:00:00.000+01:00"
  },
  "regime": "5ème République",
  "regimeJuridique": "Article 11 de la loi n° 2003-710 du 1 août 2003 d'orientation et de programmation pour la ville et la rénovation urbaine",
  "siteInternet": "https://www.anru.fr/fre/ANRU/Organisation-de-l-ANRU",
  "nombreReunionsAnnuelles": "0"
}