{
  "uid": "PA1459",
  "etatCivil": {
    "ident": {
      "civ": "M.",
      "prenom": "Bernard",
      "nom": "Gérard",
      "alpha": "Gerard B"
    },
    "infoNaissance": {
      "dateNais": "1953-08-29T01:00:00.000+01:00",
      "villeNais": "Valenciennes",
      "depNais": "Nord",
      "paysNais": "France"
    }
  },
  "profession": {
    "libelleCourant": "Avocat honoraire",
    "socProcInsee": {
      "catSocPro": "Professions libérales et assimilés",
      "famSocPro": "Cadres et professions intellectuelles supérieures"
    }
  },
  "adresses": [
    {
      "xsiType": "AdressePostale_Type",
      "uid": "AD383107",
      "type": "2",
      "typeLibelle": "Adresse publiée de circonscription",
      "poids": "22",
      "numeroRue": "103",
      "nomRue": "Avenue Foch,",
      "codePostal": "59700",
      "ville": "Marcq-en-Baroeul"
    },
    {
      "xsiType": "AdresseTelephonique_Type",
      "uid": "AD383108",
      "type": "11",
      "typeLibelle": "Téléphone",
      "poids": "22",
      "adresseDeRattachement": "AD383107",
      "valElec": "03 20 45 45 45"
    },
    {
      "xsiType": "AdresseTelephonique_Type",
      "uid": "AD383112",
      "type": "12",
      "typeLibelle": "Télécopie",
      "poids": "22",
      "adresseDeRattachement": "AD383107",
      "valElec": "03 20 45 45 37"
    },
    {
      "xsiType": "AdressePostale_Type",
      "uid": "AD386862",
      "type": "0",
      "typeLibelle": "Adresse officielle",
      "poids": "1",
      "intitule": "Assemblée nationale,",
      "numeroRue": "126",
      "nomRue": "Rue de l'Université,",
      "codePostal": "75355",
      "ville": "Paris 07 SP"
    },
    {
      "xsiType": "AdresseMail_Type",
      "uid": "AD391731",
      "type": "15",
      "typeLibelle": "Mèl",
      "valElec": "bgerard@assemblee-nationale.fr"
    }
  ],
  "mandats": [
    {
      "xsiType": "MandatParlementaire_type",
      "uid": "PM386278",
      "acteurRef": "PA1459",
      "legislature": "13",
      "typeOrgane": "ASSEMBLEE",
      "dateDebut": "2007-06-20T02:00:00.000+02:00",
      "dateFin": "2012-06-19T02:00:00.000+02:00",
      "preseance": "50",
      "nominPrincipale": "1",
      "infosQualite": {
        "codeQualite": "membre",
        "libQualite": "membre",
        "libQualiteSex": "membre"
      },
      "organesRefs": [
        "PO384266"
      ],
      "suppleant": {
        "dateDebut": "2007-06-20T02:00:00.000+02:00",
        "dateFin": "2012-06-19T02:00:00.000+02:00",
        "suppleantRef": "PA343775"
      },
      "election": {
        "lieu": {
          "region": "Hauts-de-France",
          "regionType": "Métropolitain",
          "departement": "Nord",
          "numDepartement": "59",
          "numCirco": "9"
        },
        "causeMandat": "élections générales",
        "refCirconscription": "PO384551"
      },
      "mandature": {
        "datePriseFonction": "2007-06-20T02:00:00.000+02:00",
        "causeFin": "Fin de législature",
        "premiereElection": "0"
      }
    },
    {
      "xsiType": "MandatSimple_Type",
      "uid": "PM387441",
      "acteurRef": "PA1459",
      "legislature": "13",
      "typeOrgane": "GP",
      "dateDebut": "2007-06-20T02:00:00.000+02:00",
      "dateFin": "2007-06-26T02:00:00.000+02:00",
      "preseance": "28",
      "nominPrincipale": "1",
      "infosQualite": {
        "codeQualite": "Député non-inscrit",
        "libQualite": "Député non-inscrit",
        "libQualiteSex": "Député non-inscrit"
      },
      "organesRefs": [
        "PO387155"
      ]
    },
    {
      "xsiType": "MandatSimple_Type",
      "uid": "PM389816",
      "acteurRef": "PA1459",
      "legislature": "13",
      "typeOrgane": "GP",
      "dateDebut": "2007-06-27T02:00:00.000+02:00",
      "datePublication": "2007-06-27T02:00:00.000+02:00",
      "dateFin": "2012-06-19T02:00:00.000+02:00",
      "preseance": "20",
      "nominPrincipale": "1",
      "infosQualite": {
        "codeQualite": "Membre",
        "libQualite": "Membre du",
        "libQualiteSex": "Membre du"
      },
      "organesRefs": [
        "PO389395"
      ]
    },
    {
      "xsiType": "MandatSimple_Type",
      "uid": "PM390386",
      "acteurRef": "PA1459",
      "legislature": "13",
      "typeOrgane": "COMPER",
      "dateDebut": "2007-06-27T02:00:00.000+02:00",
      "datePublication": "2007-06-28T02:00:00.000+02:00",
      "dateFin": "2009-06-30T02:00:00.000+02:00",
      "preseance": "32",
      "nominPrincipale": "1",
      "infosQualite": {
        "codeQualite": "Membre",
        "libQualite": "Membre",
        "libQualiteSex": "Membre"
      },
      "organesRefs": [
        "PO277060"
      ]
    },
    {
      "xsiType": "MandatSimple_Type",
      "uid": "PM402625",
      "acteurRef": "PA1459",
      "legislature": "13",
      "typeOrgane": "GA",
      "dateDebut": "2007-11-07T01:00:00.000+01:00",
      "dateFin": "2012-06-19T02:00:00.000+02:00",
      "preseance": "20",
      "nominPrincipale": "1",
      "infosQualite": {
        "codeQualite": "Membre",
        "libQualite": "Membre",
        "libQualiteSex": "Membre"
      },
      "organesRefs": [
        "PO392669"
      ]
    },
    {
      "xsiType": "MandatSimple_Type",
      "uid": "PM402626",
      "acteurRef": "PA1459",
      "legislature": "13",
      "typeOrgane": "GA",
      "dateDebut": "2007-11-07T01:00:00.000+01:00",
      "dateFin": "2012-06-19T02:00:00.000+02:00",
      "preseance": "20",
      "nominPrincipale": "1",
      "infosQualite": {
        "codeQualite": "Membre",
        "libQualite": "Membre",
        "libQualiteSex": "Membre"
      },
      "organesRefs": [
        "PO392750"
      ]
    },
    {
      "xsiType": "MandatSimple_Type",
      "uid": "PM402627",
      "acteurRef": "PA1459",
      "legislature": "13",
      "typeOrgane": "GA",
      "dateDebut": "2007-11-07T01:00:00.000+01:00",
      "dateFin": "2012-06-19T02:00:00.000+02:00",
      "preseance": "20",
      "nominPrincipale": "1",
      "infosQualite": {
        "codeQualite": "Membre",
        "libQualite": "Membre",
        "libQualiteSex": "Membre"
      },
      "organesRefs": [
        "PO392840"
      ]
    },
    {
      "xsiType": "MandatSimple_Type",
      "uid": "PM402628",
      "acteurRef": "PA1459",
      "legislature": "13",
      "typeOrgane": "GA",
      "dateDebut": "2007-11-07T01:00:00.000+01:00",
      "dateFin": "2012-06-19T02:00:00.000+02:00",
      "preseance": "20",
      "nominPrincipale": "1",
      "infosQualite": {
        "codeQualite": "Membre",
        "libQualite": "Membre",
        "libQualiteSex": "Membre"
      },
      "organesRefs": [
        "PO392920"
      ]
    },
    {
      "xsiType": "MandatSimple_Type",
      "uid": "PM402629",
      "acteurRef": "PA1459",
      "legislature": "13",
      "typeOrgane": "GA",
      "dateDebut": "2007-11-07T01:00:00.000+01:00",
      "dateFin": "2012-06-19T02:00:00.000+02:00",
      "preseance": "20",
      "nominPrincipale": "1",
      "infosQualite": {
        "codeQualite": "Membre",
        "libQualite": "Membre",
        "libQualiteSex": "Membre"
      },
      "organesRefs": [
        "PO393192"
      ]
    },
    {
      "xsiType": "MandatSimple_Type",
      "uid": "PM402630",
      "acteurRef": "PA1459",
      "legislature": "13",
      "typeOrgane": "GA",
      "dateDebut": "2007-11-07T01:00:00.000+01:00",
      "dateFin": "2012-06-19T02:00:00.000+02:00",
      "preseance": "20",
      "nominPrincipale": "1",
      "infosQualite": {
        "codeQualite": "Membre",
        "libQualite": "Membre",
        "libQualiteSex": "Membre"
      },
      "organesRefs": [
        "PO393468"
      ]
    },
    {
      "xsiType": "MandatSimple_Type",
      "uid": "PM403977",
      "acteurRef": "PA1459",
      "legislature": "13",
      "typeOrgane": "GA",
      "dateDebut": "2007-11-21T01:00:00.000+01:00",
      "dateFin": "2012-06-19T02:00:00.000+02:00",
      "preseance": "8",
      "nominPrincipale": "1",
      "infosQualite": {
        "codeQualite": "Vice-Président",
        "libQualite": "Vice-Président",
        "libQualiteSex": "Vice-Président"
      },
      "organesRefs": [
        "PO392750"
      ]
    },
    {
      "xsiType": "MandatSimple_Type",
      "uid": "PM405247",
      "acteurRef": "PA1459",
      "legislature": "13",
      "typeOrgane": "GA",
      "dateDebut": "2007-12-12T01:00:00.000+01:00",
      "dateFin": "2012-06-19T02:00:00.000+02:00",
      "preseance": "8",
      "nominPrincipale": "1",
      "infosQualite": {
        "codeQualite": "Vice-Président",
        "libQualite": "Vice-Président",
        "libQualiteSex": "Vice-Président"
      },
      "organesRefs": [
        "PO392920"
      ]
    },
    {
      "xsiType": "MandatSimple_Type",
      "uid": "PM406663",
      "acteurRef": "PA1459",
      "legislature": "13",
      "typeOrgane": "GE",
      "dateDebut": "2008-01-11T01:00:00.000+01:00",
      "dateFin": "2012-06-19T02:00:00.000+02:00",
      "preseance": "20",
      "nominPrincipale": "1",
      "infosQualite": {
        "codeQualite": "Membre",
        "libQualite": "Membre",
        "libQualiteSex": "Membre"
      },
      "organesRefs": [
        "PO402727"
      ]
    },
    {
      "xsiType": "MandatSimple_Type",
      "uid": "PM406774",
      "acteurRef": "PA1459",
      "legislature": "13",
      "typeOrgane": "GE",
      "dateDebut": "2008-01-15T01:00:00.000+01:00",
      "dateFin": "2012-06-19T02:00:00.000+02:00",
      "preseance": "20",
      "nominPrincipale": "1",
      "infosQualite": {
        "codeQualite": "Membre",
        "libQualite": "Membre",
        "libQualiteSex": "Membre"
      },
      "organesRefs": [
        "PO402869"
      ]
    },
    {
      "xsiType": "MandatSimple_Type",
      "uid": "PM408312",
      "acteurRef": "PA1459",
      "legislature": "13",
      "typeOrgane": "GE",
      "dateDebut": "2008-02-05T01:00:00.000+01:00",
      "dateFin": "2012-06-19T02:00:00.000+02:00",
      "preseance": "8",
      "nominPrincipale": "1",
      "infosQualite": {
        "codeQualite": "Vice-Président",
        "libQualite": "Vice-Président",
        "libQualiteSex": "Vice-Président"
      },
      "organesRefs": [
        "PO403039"
      ]
    },
    {
      "xsiType": "MandatSimple_Type",
      "uid": "PM408379",
      "acteurRef": "PA1459",
      "legislature": "13",
      "typeOrgane": "GE",
      "dateDebut": "2008-02-07T01:00:00.000+01:00",
      "dateFin": "2012-06-19T02:00:00.000+02:00",
      "preseance": "20",
      "nominPrincipale": "1",
      "infosQualite": {
        "codeQualite": "Membre",
        "libQualite": "Membre",
        "libQualiteSex": "Membre"
      },
      "organesRefs": [
        "PO403178"
      ]
    },
    {
      "xsiType": "MandatSimple_Type",
      "uid": "PM408596",
      "acteurRef": "PA1459",
      "legislature": "13",
      "typeOrgane": "GE",
      "dateDebut": "2008-01-25T01:00:00.000+01:00",
      "dateFin": "2012-06-19T02:00:00.000+02:00",
      "preseance": "8",
      "nominPrincipale": "1",
      "infosQualite": {
        "codeQualite": "Vice-Président",
        "libQualite": "Vice-Président",
        "libQualiteSex": "Vice-Président"
      },
      "organesRefs": [
        "PO402869"
      ]
    },
    {
      "xsiType": "MandatSimple_Type",
      "uid": "PM409613",
      "acteurRef": "PA1459",
      "legislature": "13",
      "typeOrgane": "GE",
      "dateDebut": "2008-02-22T01:00:00.000+01:00",
      "dateFin": "2012-06-19T02:00:00.000+02:00",
      "preseance": "20",
      "nominPrincipale": "1",
      "infosQualite": {
        "codeQualite": "Membre",
        "libQualite": "Membre",
        "libQualiteSex": "Membre"
      },
      "organesRefs": [
        "PO402715"
      ]
    },
    {
      "xsiType": "MandatSimple_Type",
      "uid": "PM412296",
      "acteurRef": "PA1459",
      "legislature": "13",
      "typeOrgane": "GE",
      "dateDebut": "2008-03-26T01:00:00.000+01:00",
      "dateFin": "2012-06-19T02:00:00.000+02:00",
      "preseance": "20",
      "nominPrincipale": "1",
      "infosQualite": {
        "codeQualite": "Membre",
        "libQualite": "Membre",
        "libQualiteSex": "Membre"
      },
      "organesRefs": [
        "PO402795"
      ]
    },
    {
      "xsiType": "MandatSimple_Type",
      "uid": "PM413237",
      "acteurRef": "PA1459",
      "legislature": "13",
      "typeOrgane": "GE",
      "dateDebut": "2008-05-02T02:00:00.000+02:00",
      "dateFin": "2012-06-19T02:00:00.000+02:00",
      "preseance": "20",
      "nominPrincipale": "1",
      "infosQualite": {
        "codeQualite": "Membre",
        "libQualite": "Membre",
        "libQualiteSex": "Membre"
      },
      "organesRefs": [
        "PO403250"
      ]
    },
    {
      "xsiType": "MandatSimple_Type",
      "uid": "PM413626",
      "acteurRef": "PA1459",
      "legislature": "13",
      "typeOrgane": "GE",
      "dateDebut": "2008-02-05T01:00:00.000+01:00",
      "dateFin": "2012-06-19T02:00:00.000+02:00",
      "preseance": "20",
      "nominPrincipale": "0",
      "infosQualite": {
        "codeQualite": "Membre",
        "libQualite": "Membre",
        "libQualiteSex": "Membre"
      },
      "organesRefs": [
        "PO403039"
      ]
    },
    {
      "xsiType": "MandatSimple_Type",
      "uid": "PM414011",
      "acteurRef": "PA1459",
      "legislature": "13",
      "typeOrgane": "ORGEXTPARL",
      "dateDebut": "2008-06-17T02:00:00.000+02:00",
      "datePublication": "2008-06-20T02:00:00.000+02:00",
      "dateFin": "2012-06-19T02:00:00.000+02:00",
      "preseance": "20",
      "nominPrincipale": "1",
      "infosQualite": {
        "codeQualite": "Titulaire",
        "libQualite": "Membre titulaire",
        "libQualiteSex": "Membre titulaire"
      },
      "organesRefs": [
        "PO60294"
      ]
    },
    {
      "xsiType": "MandatSimple_Type",
      "uid": "PM416106",
      "acteurRef": "PA1459",
      "legislature": "13",
      "typeOrgane": "GE",
      "dateDebut": "2008-10-08T02:00:00.000+02:00",
      "dateFin": "2012-06-19T02:00:00.000+02:00",
      "preseance": "20",
      "nominPrincipale": "1",
      "infosQualite": {
        "codeQualite": "Membre",
        "libQualite": "Membre",
        "libQualiteSex": "Membre"
      },
      "organesRefs": [
        "PO415352"
      ]
    },
    {
      "xsiType": "MandatSimple_Type",
      "uid": "PM416916",
      "acteurRef": "PA1459",
      "legislature": "13",
      "typeOrgane": "GE",
      "dateDebut": "2008-02-20T01:00:00.000+01:00",
      "dateFin": "2012-06-19T02:00:00.000+02:00",
      "preseance": "20",
      "nominPrincipale": "1",
      "infosQualite": {
        "codeQualite": "Membre",
        "libQualite": "Membre",
        "libQualiteSex": "Membre"
      },
      "organesRefs": [
        "PO402973"
      ]
    },
    {
      "xsiType": "MandatSimple_Type",
      "uid": "PM418969",
      "acteurRef": "PA1459",
      "legislature": "13",
      "typeOrgane": "CMP",
      "dateDebut": "2009-04-03T02:00:00.000+02:00",
      "datePublication": "2009-04-04T02:00:00.000+02:00",
      "dateFin": "2009-04-22T02:00:00.000+02:00",
      "preseance": "20",
      "nominPrincipale": "1",
      "infosQualite": {
        "codeQualite": "Titulaire",
        "libQualite": "Membre titulaire",
        "libQualiteSex": "Membre titulaire"
      },
      "organesRefs": [
        "PO418960"
      ]
    },
    {
      "xsiType": "MandatSimple_Type",
      "uid": "PM420453",
      "acteurRef": "PA1459",
      "legislature": "13",
      "typeOrgane": "COMPER",
      "dateDebut": "2009-07-01T02:00:00.000+02:00",
      "datePublication": "2009-07-01T02:00:00.000+02:00",
      "dateFin": "2012-06-19T02:00:00.000+02:00",
      "preseance": "32",
      "nominPrincipale": "1",
      "infosQualite": {
        "codeQualite": "Membre",
        "libQualite": "Membre",
        "libQualiteSex": "Membre"
      },
      "organesRefs": [
        "PO419610"
      ]
    },
    {
      "xsiType": "MandatSimple_Type",
      "uid": "PM421546",
      "acteurRef": "PA1459",
      "legislature": "13",
      "typeOrgane": "CMP",
      "dateDebut": "2009-09-15T02:00:00.000+02:00",
      "datePublication": "2009-09-17T02:00:00.000+02:00",
      "dateFin": "2009-10-26T01:00:00.000+01:00",
      "preseance": "28",
      "nominPrincipale": "1",
      "infosQualite": {
        "codeQualite": "Suppléant",
        "libQualite": "Membre suppléant",
        "libQualiteSex": "Membre suppléant"
      },
      "organesRefs": [
        "PO421509"
      ]
    },
    {
      "xsiType": "MandatSimple_Type",
      "uid": "PM425653",
      "acteurRef": "PA1459",
      "legislature": "13",
      "typeOrgane": "CNPS",
      "dateDebut": "2010-11-10T01:00:00.000+01:00",
      "datePublication": "2010-11-11T01:00:00.000+01:00",
      "dateFin": "2010-11-15T01:00:00.000+01:00",
      "preseance": "20",
      "nominPrincipale": "1",
      "infosQualite": {
        "codeQualite": "Membre",
        "libQualite": "Membre",
        "libQualiteSex": "Membre"
      },
      "organesRefs": [
        "PO425550"
      ]
    },
    {
      "xsiType": "MandatMission_Type",
      "uid": "PM426629",
      "acteurRef": "PA1459",
      "legislature": "13",
      "typeOrgane": "MISINFOPRE",
      "dateDebut": "2011-01-20T01:00:00.000+01:00",
      "datePublication": "2011-01-21T01:00:00.000+01:00",
      "dateFin": "2011-11-09T01:00:00.000+01:00",
      "preseance": "20",
      "nominPrincipale": "1",
      "infosQualite": {
        "codeQualite": "Membre",
        "libQualite": "Membre",
        "libQualiteSex": "Membre"
      },
      "organesRefs": [
        "PO426618"
      ]
    },
    {
      "xsiType": "MandatSimple_Type",
      "uid": "PM429014",
      "acteurRef": "PA1459",
      "legislature": "13",
      "typeOrgane": "CMP",
      "dateDebut": "2011-06-22T02:00:00.000+02:00",
      "datePublication": "2011-06-23T02:00:00.000+02:00",
      "dateFin": "2011-06-29T02:00:00.000+02:00",
      "preseance": "20",
      "nominPrincipale": "1",
      "infosQualite": {
        "codeQualite": "Titulaire",
        "libQualite": "Membre titulaire",
        "libQualiteSex": "Membre titulaire"
      },
      "organesRefs": [
        "PO428704"
      ]
    },
    {
      "xsiType": "MandatSimple_Type",
      "uid": "PM429125",
      "acteurRef": "PA1459",
      "legislature": "13",
      "typeOrgane": "CMP",
      "dateDebut": "2011-06-28T02:00:00.000+02:00",
      "datePublication": "2011-06-29T02:00:00.000+02:00",
      "dateFin": "2011-06-29T02:00:00.000+02:00",
      "preseance": "20",
      "nominPrincipale": "1",
      "infosQualite": {
        "codeQualite": "Titulaire",
        "libQualite": "Membre titulaire",
        "libQualiteSex": "Membre titulaire"
      },
      "organesRefs": [
        "PO429117"
      ]
    },
    {
      "xsiType": "MandatSimple_Type",
      "uid": "PM430711",
      "acteurRef": "PA1459",
      "legislature": "13",
      "typeOrgane": "CNPS",
      "dateDebut": "2011-10-12T02:00:00.000+02:00",
      "datePublication": "2011-10-14T02:00:00.000+02:00",
      "dateFin": "2012-05-21T02:00:00.000+02:00",
      "preseance": "20",
      "nominPrincipale": "1",
      "infosQualite": {
        "codeQualite": "Membre",
        "libQualite": "Membre",
        "libQualiteSex": "Membre"
      },
      "organesRefs": [
        "PO430584"
      ]
    },
    {
      "xsiType": "MandatSimple_Type",
      "uid": "PM499631",
      "acteurRef": "PA1459",
      "legislature": "13",
      "typeOrgane": "CMP",
      "dateDebut": "2012-02-08T01:00:00.000+01:00",
      "datePublication": "2012-02-09T01:00:00.000+01:00",
      "dateFin": "2012-02-29T01:00:00.000+01:00",
      "preseance": "28",
      "nominPrincipale": "1",
      "infosQualite": {
        "codeQualite": "Suppléant",
        "libQualite": "Membre suppléant",
        "libQualiteSex": "Membre suppléant"
      },
      "organesRefs": [
        "PO493992"
      ]
    },
    {
      "xsiType": "MandatSimple_Type",
      "uid": "PM521414",
      "acteurRef": "PA1459",
      "legislature": "13",
      "typeOrgane": "CMP",
      "dateDebut": "2012-03-01T01:00:00.000+01:00",
      "datePublication": "2012-03-02T01:00:00.000+01:00",
      "dateFin": "2012-03-06T01:00:00.000+01:00",
      "preseance": "20",
      "nominPrincipale": "1",
      "infosQualite": {
        "codeQualite": "Titulaire",
        "libQualite": "Membre titulaire",
        "libQualiteSex": "Membre titulaire"
      },
      "organesRefs": [
        "PO521392"
      ]
    },
    {
      "xsiType": "MandatSimple_Type",
      "uid": "PM524808",
      "acteurRef": "PA1459",
      "legislature": "13",
      "typeOrgane": "CMP",
      "dateDebut": "2012-03-05T01:00:00.000+01:00",
      "datePublication": "2012-03-06T01:00:00.000+01:00",
      "dateFin": "2012-03-06T01:00:00.000+01:00",
      "preseance": "16",
      "nominPrincipale": "1",
      "infosQualite": {
        "codeQualite": "Rapporteur",
        "libQualite": "Rapporteur",
        "libQualiteSex": "Rapporteur"
      },
      "organesRefs": [
        "PO521392"
      ]
    },
    {
      "xsiType": "MandatParlementaire_type",
      "uid": "PM645518",
      "acteurRef": "PA1459",
      "legislature": "14",
      "typeOrgane": "ASSEMBLEE",
      "dateDebut": "2012-06-20T02:00:00.000+02:00",
      "dateFin": "2017-06-20T02:00:00.000+02:00",
      "preseance": "50",
      "nominPrincipale": "1",
      "infosQualite": {
        "codeQualite": "membre",
        "libQualite": "membre",
        "libQualiteSex": "membre"
      },
      "organesRefs": [
        "PO644420"
      ],
      "suppleant": {
        "dateDebut": "2012-06-20T02:00:00.000+02:00",
        "dateFin": "2017-06-20T02:00:00.000+02:00",
        "suppleantRef": "PA343775"
      },
      "election": {
        "lieu": {
          "region": "Hauts-de-France",
          "regionType": "Métropolitain",
          "departement": "Nord",
          "numDepartement": "59",
          "numCirco": "9"
        },
        "causeMandat": "élections générales",
        "refCirconscription": "PO644705"
      },
      "mandature": {
        "datePriseFonction": "2012-06-20T02:00:00.000+02:00",
        "causeFin": "Fin de législature",
        "premiereElection": "1"
      }
    },
    {
      "xsiType": "MandatSimple_Type",
      "uid": "PM656389",
      "acteurRef": "PA1459",
      "legislature": "14",
      "typeOrgane": "GP",
      "dateDebut": "2012-06-26T02:00:00.000+02:00",
      "datePublication": "2012-06-27T02:00:00.000+02:00",
      "dateFin": "2015-06-01T02:00:00.000+02:00",
      "preseance": "20",
      "nominPrincipale": "1",
      "infosQualite": {
        "codeQualite": "Membre",
        "libQualite": "Membre du",
        "libQualiteSex": "Membre du"
      },
      "organesRefs": [
        "PO656006"
      ]
    },
    {
      "xsiType": "MandatSimple_Type",
      "uid": "PM657103",
      "acteurRef": "PA1459",
      "legislature": "14",
      "typeOrgane": "COMPER",
      "dateDebut": "2012-06-28T02:00:00.000+02:00",
      "datePublication": "2012-06-28T02:00:00.000+02:00",
      "dateFin": "2016-12-01T01:00:00.000+01:00",
      "preseance": "32",
      "nominPrincipale": "1",
      "infosQualite": {
        "codeQualite": "Membre",
        "libQualite": "Membre",
        "libQualiteSex": "Membre"
      },
      "organesRefs": [
        "PO59051"
      ]
    },
    {
      "xsiType": "MandatSimple_Type",
      "uid": "PM679119",
      "acteurRef": "PA1459",
      "legislature": "14",
      "typeOrgane": "ORGEXTPARL",
      "dateDebut": "2012-10-04T02:00:00.000+02:00",
      "datePublication": "2012-10-05T02:00:00.000+02:00",
      "dateFin": "2015-01-27T01:00:00.000+01:00",
      "preseance": "20",
      "nominPrincipale": "1",
      "infosQualite": {
        "codeQualite": "Titulaire",
        "libQualite": "Membre titulaire",
        "libQualiteSex": "Membre titulaire"
      },
      "organesRefs": [
        "PO422779"
      ]
    },
    {
      "xsiType": "MandatSimple_Type",
      "uid": "PM680600",
      "acteurRef": "PA1459",
      "legislature": "14",
      "typeOrgane": "GA",
      "dateDebut": "2012-10-12T02:00:00.000+02:00",
      "dateFin": "2017-06-20T02:00:00.000+02:00",
      "preseance": "20",
      "nominPrincipale": "1",
      "infosQualite": {
        "codeQualite": "Membre",
        "libQualite": "Membre",
        "libQualiteSex": "Membre"
      },
      "organesRefs": [
        "PO675806"
      ]
    },
    {
      "xsiType": "MandatSimple_Type",
      "uid": "PM680601",
      "acteurRef": "PA1459",
      "legislature": "14",
      "typeOrgane": "GA",
      "dateDebut": "2012-10-12T02:00:00.000+02:00",
      "dateFin": "2017-06-20T02:00:00.000+02:00",
      "preseance": "20",
      "nominPrincipale": "1",
      "infosQualite": {
        "codeQualite": "Membre",
        "libQualite": "Membre",
        "libQualiteSex": "Membre"
      },
      "organesRefs": [
        "PO675722"
      ]
    },
    {
      "xsiType": "MandatSimple_Type",
      "uid": "PM680602",
      "acteurRef": "PA1459",
      "legislature": "14",
      "typeOrgane": "GA",
      "dateDebut": "2012-10-12T02:00:00.000+02:00",
      "dateFin": "2017-06-20T02:00:00.000+02:00",
      "preseance": "20",
      "nominPrincipale": "1",
      "infosQualite": {
        "codeQualite": "Membre",
        "libQualite": "Membre",
        "libQualiteSex": "Membre"
      },
      "organesRefs": [
        "PO675811"
      ]
    },
    {
      "xsiType": "MandatSimple_Type",
      "uid": "PM680603",
      "acteurRef": "PA1459",
      "legislature": "14",
      "typeOrgane": "GA",
      "dateDebut": "2012-10-12T02:00:00.000+02:00",
      "dateFin": "2017-06-20T02:00:00.000+02:00",
      "preseance": "20",
      "nominPrincipale": "1",
      "infosQualite": {
        "codeQualite": "Membre",
        "libQualite": "Membre",
        "libQualiteSex": "Membre"
      },
      "organesRefs": [
        "PO675751"
      ]
    },
    {
      "xsiType": "MandatSimple_Type",
      "uid": "PM680604",
      "acteurRef": "PA1459",
      "legislature": "14",
      "typeOrgane": "GA",
      "dateDebut": "2012-10-12T02:00:00.000+02:00",
      "dateFin": "2017-06-20T02:00:00.000+02:00",
      "preseance": "20",
      "nominPrincipale": "1",
      "infosQualite": {
        "codeQualite": "Membre",
        "libQualite": "Membre",
        "libQualiteSex": "Membre"
      },
      "organesRefs": [
        "PO675719"
      ]
    },
    {
      "xsiType": "MandatSimple_Type",
      "uid": "PM680605",
      "acteurRef": "PA1459",
      "legislature": "14",
      "typeOrgane": "GA",
      "dateDebut": "2012-10-12T02:00:00.000+02:00",
      "dateFin": "2017-06-20T02:00:00.000+02:00",
      "preseance": "20",
      "nominPrincipale": "1",
      "infosQualite": {
        "codeQualite": "Membre",
        "libQualite": "Membre",
        "libQualiteSex": "Membre"
      },
      "organesRefs": [
        "PO675772"
      ]
    },
    {
      "xsiType": "MandatSimple_Type",
      "uid": "PM680606",
      "acteurRef": "PA1459",
      "legislature": "14",
      "typeOrgane": "GA",
      "dateDebut": "2012-10-12T02:00:00.000+02:00",
      "dateFin": "2017-06-20T02:00:00.000+02:00",
      "preseance": "20",
      "nominPrincipale": "1",
      "infosQualite": {
        "codeQualite": "Membre",
        "libQualite": "Membre",
        "libQualiteSex": "Membre"
      },
      "organesRefs": [
        "PO675781"
      ]
    },
    {
      "xsiType": "MandatSimple_Type",
      "uid": "PM683430",
      "acteurRef": "PA1459",
      "legislature": "14",
      "typeOrgane": "GA",
      "dateDebut": "2012-10-24T02:00:00.000+02:00",
      "dateFin": "2017-06-20T02:00:00.000+02:00",
      "preseance": "14",
      "nominPrincipale": "1",
      "infosQualite": {
        "codeQualite": "Secrétaire",
        "libQualite": "Secrétaire",
        "libQualiteSex": "Secrétaire"
      },
      "organesRefs": [
        "PO675751"
      ]
    },
    {
      "xsiType": "MandatSimple_Type",
      "uid": "PM685486",
      "acteurRef": "PA1459",
      "typeOrgane": "PARPOL",
      "dateDebut": "2012-12-01T01:00:00.000+01:00",
      "dateFin": "2015-11-30T01:00:00.000+01:00",
      "preseance": "5",
      "nominPrincipale": "1",
      "infosQualite": {
        "codeQualite": "Membre",
        "libQualite": "Membre",
        "libQualiteSex": "Membre"
      },
      "organesRefs": [
        "PO684942"
      ]
    },
    {
      "xsiType": "MandatSimple_Type",
      "uid": "PM688354",
      "acteurRef": "PA1459",
      "legislature": "14",
      "typeOrgane": "GE",
      "dateDebut": "2013-01-21T01:00:00.000+01:00",
      "dateFin": "2017-06-20T02:00:00.000+02:00",
      "preseance": "20",
      "nominPrincipale": "0",
      "infosQualite": {
        "codeQualite": "Membre",
        "libQualite": "Membre",
        "libQualiteSex": "Membre"
      },
      "organesRefs": [
        "PO688348"
      ]
    },
    {
      "xsiType": "MandatSimple_Type",
      "uid": "PM688355",
      "acteurRef": "PA1459",
      "legislature": "14",
      "typeOrgane": "GE",
      "dateDebut": "2013-01-21T01:00:00.000+01:00",
      "dateFin": "2017-06-20T02:00:00.000+02:00",
      "preseance": "1",
      "nominPrincipale": "1",
      "infosQualite": {
        "codeQualite": "Président",
        "libQualite": "Président",
        "libQualiteSex": "Président"
      },
      "organesRefs": [
        "PO688348"
      ]
    },
    {
      "xsiType": "MandatSimple_Type",
      "uid": "PM688373",
      "acteurRef": "PA1459",
      "legislature": "14",
      "typeOrgane": "GE",
      "dateDebut": "2013-01-16T01:00:00.000+01:00",
      "dateFin": "2017-06-20T02:00:00.000+02:00",
      "preseance": "20",
      "nominPrincipale": "1",
      "infosQualite": {
        "codeQualite": "Membre",
        "libQualite": "Membre",
        "libQualiteSex": "Membre"
      },
      "organesRefs": [
        "PO686204"
      ]
    },
    {
      "xsiType": "MandatSimple_Type",
      "uid": "PM690939",
      "acteurRef": "PA1459",
      "legislature": "14",
      "typeOrgane": "GE",
      "dateDebut": "2013-02-08T01:00:00.000+01:00",
      "dateFin": "2017-06-20T02:00:00.000+02:00",
      "preseance": "20",
      "nominPrincipale": "1",
      "infosQualite": {
        "codeQualite": "Membre",
        "libQualite": "Membre",
        "libQualiteSex": "Membre"
      },
      "organesRefs": [
        "PO686776"
      ]
    },
    {
      "xsiType": "MandatSimple_Type",
      "uid": "PM691455",
      "acteurRef": "PA1459",
      "legislature": "14",
      "typeOrgane": "GE",
      "dateDebut": "2013-02-14T01:00:00.000+01:00",
      "dateFin": "2017-06-20T02:00:00.000+02:00",
      "preseance": "20",
      "nominPrincipale": "1",
      "infosQualite": {
        "codeQualite": "Membre",
        "libQualite": "Membre",
        "libQualiteSex": "Membre"
      },
      "organesRefs": [
        "PO686878"
      ]
    },
    {
      "xsiType": "MandatSimple_Type",
      "uid": "PM691465",
      "acteurRef": "PA1459",
      "legislature": "14",
      "typeOrgane": "GE",
      "dateDebut": "2013-02-15T01:00:00.000+01:00",
      "dateFin": "2017-06-20T02:00:00.000+02:00",
      "preseance": "20",
      "nominPrincipale": "1",
      "infosQualite": {
        "codeQualite": "Membre",
        "libQualite": "Membre",
        "libQualiteSex": "Membre"
      },
      "organesRefs": [
        "PO687403"
      ]
    },
    {
      "xsiType": "MandatSimple_Type",
      "uid": "PM691688",
      "acteurRef": "PA1459",
      "legislature": "14",
      "typeOrgane": "GE",
      "dateDebut": "2013-02-20T01:00:00.000+01:00",
      "dateFin": "2017-06-20T02:00:00.000+02:00",
      "preseance": "8",
      "nominPrincipale": "1",
      "infosQualite": {
        "codeQualite": "Vice-Président",
        "libQualite": "Vice-Président",
        "libQualiteSex": "Vice-Président"
      },
      "organesRefs": [
        "PO686776"
      ]
    },
    {
      "xsiType": "MandatSimple_Type",
      "uid": "PM691745",
      "acteurRef": "PA1459",
      "legislature": "14",
      "typeOrgane": "GE",
      "dateDebut": "2013-02-20T01:00:00.000+01:00",
      "dateFin": "2017-06-20T02:00:00.000+02:00",
      "preseance": "20",
      "nominPrincipale": "1",
      "infosQualite": {
        "codeQualite": "Membre",
        "libQualite": "Membre",
        "libQualiteSex": "Membre"
      },
      "organesRefs": [
        "PO686433"
      ]
    },
    {
      "xsiType": "MandatSimple_Type",
      "uid": "PM691984",
      "acteurRef": "PA1459",
      "legislature": "14",
      "typeOrgane": "GE",
      "dateDebut": "2013-01-24T01:00:00.000+01:00",
      "dateFin": "2017-06-20T02:00:00.000+02:00",
      "preseance": "20",
      "nominPrincipale": "1",
      "infosQualite": {
        "codeQualite": "Membre",
        "libQualite": "Membre",
        "libQualiteSex": "Membre"
      },
      "organesRefs": [
        "PO686844"
      ]
    },
    {
      "xsiType": "MandatSimple_Type",
      "uid": "PM692132",
      "acteurRef": "PA1459",
      "legislature": "14",
      "typeOrgane": "GA",
      "dateDebut": "2013-02-27T01:00:00.000+01:00",
      "dateFin": "2017-06-20T02:00:00.000+02:00",
      "preseance": "20",
      "nominPrincipale": "1",
      "infosQualite": {
        "codeQualite": "Membre",
        "libQualite": "Membre",
        "libQualiteSex": "Membre"
      },
      "organesRefs": [
        "PO675765"
      ]
    },
    {
      "xsiType": "MandatSimple_Type",
      "uid": "PM692213",
      "acteurRef": "PA1459",
      "legislature": "14",
      "typeOrgane": "GE",
      "dateDebut": "2013-02-27T01:00:00.000+01:00",
      "dateFin": "2017-06-20T02:00:00.000+02:00",
      "preseance": "20",
      "nominPrincipale": "1",
      "infosQualite": {
        "codeQualite": "Membre",
        "libQualite": "Membre",
        "libQualiteSex": "Membre"
      },
      "organesRefs": [
        "PO686810"
      ]
    },
    {
      "xsiType": "MandatSimple_Type",
      "uid": "PM692636",
      "acteurRef": "PA1459",
      "legislature": "14",
      "typeOrgane": "GA",
      "dateDebut": "2013-03-12T01:00:00.000+01:00",
      "dateFin": "2017-06-20T02:00:00.000+02:00",
      "preseance": "1",
      "nominPrincipale": "1",
      "infosQualite": {
        "codeQualite": "Président",
        "libQualite": "Président",
        "libQualiteSex": "Président"
      },
      "organesRefs": [
        "PO675719"
      ]
    },
    {
      "xsiType": "MandatSimple_Type",
      "uid": "PM693157",
      "acteurRef": "PA1459",
      "legislature": "14",
      "typeOrgane": "CMP",
      "dateDebut": "2013-04-02T02:00:00.000+02:00",
      "datePublication": "2013-04-03T02:00:00.000+02:00",
      "dateFin": "2013-04-17T02:00:00.000+02:00",
      "preseance": "20",
      "nominPrincipale": "1",
      "infosQualite": {
        "codeQualite": "Titulaire",
        "libQualite": "Membre titulaire",
        "libQualiteSex": "Membre titulaire"
      },
      "organesRefs": [
        "PO693149"
      ]
    },
    {
      "xsiType": "MandatSimple_Type",
      "uid": "PM693185",
      "acteurRef": "PA1459",
      "legislature": "14",
      "typeOrgane": "CMP",
      "dateDebut": "2013-04-02T02:00:00.000+02:00",
      "datePublication": "2013-04-03T02:00:00.000+02:00",
      "dateFin": "2013-04-14T02:00:00.000+02:00",
      "preseance": "20",
      "nominPrincipale": "1",
      "infosQualite": {
        "codeQualite": "Titulaire",
        "libQualite": "Membre titulaire",
        "libQualiteSex": "Membre titulaire"
      },
      "organesRefs": [
        "PO693143"
      ]
    },
    {
      "xsiType": "MandatSimple_Type",
      "uid": "PM694923",
      "acteurRef": "PA1459",
      "legislature": "14",
      "typeOrgane": "GE",
      "dateDebut": "2013-05-29T02:00:00.000+02:00",
      "dateFin": "2017-06-20T02:00:00.000+02:00",
      "preseance": "20",
      "nominPrincipale": "1",
      "infosQualite": {
        "codeQualite": "Membre",
        "libQualite": "Membre",
        "libQualiteSex": "Membre"
      },
      "organesRefs": [
        "PO692283"
      ]
    },
    {
      "xsiType": "MandatSimple_Type",
      "uid": "PM694994",
      "acteurRef": "PA1459",
      "legislature": "14",
      "typeOrgane": "GEVI",
      "dateDebut": "2013-06-05T02:00:00.000+02:00",
      "dateFin": "2017-06-20T02:00:00.000+02:00",
      "preseance": "20",
      "nominPrincipale": "1",
      "infosQualite": {
        "codeQualite": "Membre",
        "libQualite": "Membre",
        "libQualiteSex": "Membre"
      },
      "organesRefs": [
        "PO675743"
      ]
    },
    {
      "xsiType": "MandatSimple_Type",
      "uid": "PM695560",
      "acteurRef": "PA1459",
      "legislature": "14",
      "typeOrgane": "GEVI",
      "dateDebut": "2013-06-26T02:00:00.000+02:00",
      "dateFin": "2017-06-20T02:00:00.000+02:00",
      "preseance": "20",
      "nominPrincipale": "1",
      "infosQualite": {
        "codeQualite": "Membre",
        "libQualite": "Membre",
        "libQualiteSex": "Membre"
      },
      "organesRefs": [
        "PO675838"
      ]
    },
    {
      "xsiType": "MandatSimple_Type",
      "uid": "PM695989",
      "acteurRef": "PA1459",
      "legislature": "14",
      "typeOrgane": "CMP",
      "dateDebut": "2013-07-12T02:00:00.000+02:00",
      "datePublication": "2013-07-13T02:00:00.000+02:00",
      "dateFin": "2013-07-16T02:00:00.000+02:00",
      "preseance": "20",
      "nominPrincipale": "1",
      "infosQualite": {
        "codeQualite": "Titulaire",
        "libQualite": "Membre titulaire",
        "libQualiteSex": "Membre titulaire"
      },
      "organesRefs": [
        "PO694660"
      ]
    },
    {
      "xsiType": "MandatSimple_Type",
      "uid": "PM696145",
      "acteurRef": "PA1459",
      "legislature": "14",
      "typeOrgane": "CMP",
      "dateDebut": "2013-07-16T02:00:00.000+02:00",
      "datePublication": "2013-07-17T02:00:00.000+02:00",
      "dateFin": "2013-07-16T02:00:00.000+02:00",
      "preseance": "20",
      "nominPrincipale": "1",
      "infosQualite": {
        "codeQualite": "Titulaire",
        "libQualite": "Membre titulaire",
        "libQualiteSex": "Membre titulaire"
      },
      "organesRefs": [
        "PO696134"
      ]
    },
    {
      "xsiType": "MandatSimple_Type",
      "uid": "PM696175",
      "acteurRef": "PA1459",
      "legislature": "14",
      "typeOrgane": "CMP",
      "dateDebut": "2013-07-16T02:00:00.000+02:00",
      "datePublication": "2013-07-17T02:00:00.000+02:00",
      "dateFin": "2013-07-16T02:00:00.000+02:00",
      "preseance": "20",
      "nominPrincipale": "1",
      "infosQualite": {
        "codeQualite": "Titulaire",
        "libQualite": "Membre titulaire",
        "libQualiteSex": "Membre titulaire"
      },
      "organesRefs": [
        "PO696167"
      ]
    },
    {
      "xsiType": "MandatSimple_Type",
      "uid": "PM696249",
      "acteurRef": "PA1459",
      "legislature": "14",
      "typeOrgane": "GE",
      "dateDebut": "2013-07-17T02:00:00.000+02:00",
      "dateFin": "2017-06-20T02:00:00.000+02:00",
      "preseance": "20",
      "nominPrincipale": "1",
      "infosQualite": {
        "codeQualite": "Membre",
        "libQualite": "Membre",
        "libQualiteSex": "Membre"
      },
      "organesRefs": [
        "PO694572"
      ]
    },
    {
      "xsiType": "MandatSimple_Type",
      "uid": "PM697021",
      "acteurRef": "PA1459",
      "legislature": "14",
      "typeOrgane": "GE",
      "dateDebut": "2013-09-18T02:00:00.000+02:00",
      "dateFin": "2017-06-20T02:00:00.000+02:00",
      "preseance": "20",
      "nominPrincipale": "1",
      "infosQualite": {
        "codeQualite": "Membre",
        "libQualite": "Membre",
        "libQualiteSex": "Membre"
      },
      "organesRefs": [
        "PO695581"
      ]
    },
    {
      "xsiType": "MandatSimple_Type",
      "uid": "PM697631",
      "acteurRef": "PA1459",
      "legislature": "14",
      "typeOrgane": "GE",
      "dateDebut": "2013-10-08T02:00:00.000+02:00",
      "dateFin": "2017-06-20T02:00:00.000+02:00",
      "preseance": "8",
      "nominPrincipale": "1",
      "infosQualite": {
        "codeQualite": "Vice-Président",
        "libQualite": "Vice-Président",
        "libQualiteSex": "Vice-Président"
      },
      "organesRefs": [
        "PO694572"
      ]
    },
    {
      "xsiType": "MandatSimple_Type",
      "uid": "PM698010",
      "acteurRef": "PA1459",
      "legislature": "14",
      "typeOrgane": "CMP",
      "dateDebut": "2013-10-22T02:00:00.000+02:00",
      "datePublication": "2013-10-23T02:00:00.000+02:00",
      "dateFin": "2013-11-21T01:00:00.000+01:00",
      "preseance": "28",
      "nominPrincipale": "1",
      "infosQualite": {
        "codeQualite": "Suppléant",
        "libQualite": "Membre suppléant",
        "libQualiteSex": "Membre suppléant"
      },
      "organesRefs": [
        "PO697540"
      ]
    },
    {
      "xsiType": "MandatSimple_Type",
      "uid": "PM698039",
      "acteurRef": "PA1459",
      "legislature": "14",
      "typeOrgane": "CMP",
      "dateDebut": "2013-10-22T02:00:00.000+02:00",
      "datePublication": "2013-10-23T02:00:00.000+02:00",
      "dateFin": "2013-11-21T01:00:00.000+01:00",
      "preseance": "28",
      "nominPrincipale": "1",
      "infosQualite": {
        "codeQualite": "Suppléant",
        "libQualite": "Membre suppléant",
        "libQualiteSex": "Membre suppléant"
      },
      "organesRefs": [
        "PO697534"
      ]
    },
    {
      "xsiType": "MandatSimple_Type",
      "uid": "PM702166",
      "acteurRef": "PA1459",
      "legislature": "14",
      "typeOrgane": "CNPS",
      "dateDebut": "2014-07-03T02:00:00.000+02:00",
      "datePublication": "2014-07-03T02:00:00.000+02:00",
      "dateFin": "2014-12-19T01:00:00.000+01:00",
      "preseance": "20",
      "nominPrincipale": "1",
      "infosQualite": {
        "codeQualite": "Membre",
        "libQualite": "Membre",
        "libQualiteSex": "Membre"
      },
      "organesRefs": [
        "PO702090"
      ]
    },
    {
      "xsiType": "MandatSimple_Type",
      "uid": "PM702806",
      "acteurRef": "PA1459",
      "legislature": "14",
      "typeOrgane": "GE",
      "dateDebut": "2014-07-28T02:00:00.000+02:00",
      "dateFin": "2017-06-20T02:00:00.000+02:00",
      "preseance": "20",
      "nominPrincipale": "1",
      "infosQualite": {
        "codeQualite": "Membre",
        "libQualite": "Membre",
        "libQualiteSex": "Membre"
      },
      "organesRefs": [
        "PO702209"
      ]
    },
    {
      "xsiType": "MandatSimple_Type",
      "uid": "PM704696",
      "acteurRef": "PA1459",
      "legislature": "14",
      "typeOrgane": "CMP",
      "dateDebut": "2014-11-19T01:00:00.000+01:00",
      "datePublication": "2014-11-21T01:00:00.000+01:00",
      "dateFin": "2014-12-18T01:00:00.000+01:00",
      "preseance": "20",
      "nominPrincipale": "1",
      "infosQualite": {
        "codeQualite": "Titulaire",
        "libQualite": "Membre titulaire",
        "libQualiteSex": "Membre titulaire"
      },
      "organesRefs": [
        "PO704567"
      ]
    },
    {
      "xsiType": "MandatSimple_Type",
      "uid": "PM705366",
      "acteurRef": "PA1459",
      "legislature": "14",
      "typeOrgane": "CNPS",
      "dateDebut": "2014-12-13T01:00:00.000+01:00",
      "datePublication": "2014-12-13T01:00:00.000+01:00",
      "dateFin": "2015-08-07T02:00:00.000+02:00",
      "preseance": "20",
      "nominPrincipale": "1",
      "infosQualite": {
        "codeQualite": "Membre",
        "libQualite": "Membre",
        "libQualiteSex": "Membre"
      },
      "organesRefs": [
        "PO704848"
      ]
    },
    {
      "xsiType": "MandatMission_Type",
      "uid": "PM706153",
      "acteurRef": "PA1459",
      "legislature": "14",
      "typeOrgane": "MINISTERE",
      "dateDebut": "2015-01-21T01:00:00.000+01:00",
      "datePublication": "2015-01-22T01:00:00.000+01:00",
      "dateFin": "2015-07-08T02:00:00.000+02:00",
      "preseance": "1",
      "nominPrincipale": "1",
      "infosQualite": {
        "codeQualite": "en mission",
        "libQualite": "en mission",
        "libQualiteSex": "en mission"
      },
      "organesRefs": [
        "PO702890",
        "PO702892",
        "PO702920"
      ],
      "libelle": "Les contrôles des URSSAF"
    },
    {
      "xsiType": "MandatSimple_Type",
      "uid": "PM706157",
      "acteurRef": "PA1459",
      "legislature": "14",
      "typeOrgane": "API",
      "dateDebut": "2015-02-03T01:00:00.000+01:00",
      "dateFin": "2017-06-20T02:00:00.000+02:00",
      "preseance": "20",
      "nominPrincipale": "1",
      "infosQualite": {
        "codeQualite": "Membre",
        "libQualite": "Membre",
        "libQualiteSex": "Membre"
      },
      "organesRefs": [
        "PO201115"
      ]
    },
    {
      "xsiType": "MandatSimple_Type",
      "uid": "PM708212",
      "acteurRef": "PA1459",
      "legislature": "14",
      "typeOrgane": "GP",
      "dateDebut": "2015-06-02T02:00:00.000+02:00",
      "datePublication": "2015-06-02T02:00:00.000+02:00",
      "dateFin": "2017-06-20T02:00:00.000+02:00",
      "preseance": "20",
      "nominPrincipale": "1",
      "infosQualite": {
        "codeQualite": "Membre",
        "libQualite": "Membre du",
        "libQualiteSex": "Membre du"
      },
      "organesRefs": [
        "PO707869"
      ]
    },
    {
      "xsiType": "MandatMission_Type",
      "uid": "PM709701",
      "acteurRef": "PA1459",
      "legislature": "14",
      "typeOrgane": "MISINFOCOM",
      "dateDebut": "2015-10-15T02:00:00.000+02:00",
      "datePublication": "2015-10-15T02:00:00.000+02:00",
      "dateFin": "2017-02-20T01:00:00.000+01:00",
      "preseance": "20",
      "nominPrincipale": "1",
      "infosQualite": {
        "codeQualite": "Membre",
        "libQualite": "Membre",
        "libQualiteSex": "Membre"
      },
      "organesRefs": [
        "PO709614"
      ]
    },
    {
      "xsiType": "MandatSimple_Type",
      "uid": "PM710473",
      "acteurRef": "PA1459",
      "typeOrgane": "PARPOL",
      "dateDebut": "2015-12-01T01:00:00.000+01:00",
      "dateFin": "2017-06-20T02:00:00.000+02:00",
      "preseance": "5",
      "nominPrincipale": "1",
      "infosQualite": {
        "codeQualite": "Membre",
        "libQualite": "Membre",
        "libQualiteSex": "Membre"
      },
      "organesRefs": [
        "PO710396"
      ]
    },
    {
      "xsiType": "MandatSimple_Type",
      "uid": "PM712319",
      "acteurRef": "PA1459",
      "legislature": "14",
      "typeOrgane": "GE",
      "dateDebut": "2016-04-07T02:00:00.000+02:00",
      "dateFin": "2017-06-20T02:00:00.000+02:00",
      "preseance": "20",
      "nominPrincipale": "1",
      "infosQualite": {
        "codeQualite": "Membre",
        "libQualite": "Membre",
        "libQualiteSex": "Membre"
      },
      "organesRefs": [
        "PO712100"
      ]
    },
    {
      "xsiType": "MandatSimple_Type",
      "uid": "PM715672",
      "acteurRef": "PA1459",
      "legislature": "14",
      "typeOrgane": "COMPER",
      "dateDebut": "2016-12-02T01:00:00.000+01:00",
      "datePublication": "2016-12-02T01:00:00.000+01:00",
      "dateFin": "2016-12-08T01:00:00.000+01:00",
      "preseance": "32",
      "nominPrincipale": "1",
      "infosQualite": {
        "codeQualite": "Membre",
        "libQualite": "Membre",
        "libQualiteSex": "Membre"
      },
      "organesRefs": [
        "PO59046"
      ]
    },
    {
      "xsiType": "MandatSimple_Type",
      "uid": "PM715999",
      "acteurRef": "PA1459",
      "legislature": "14",
      "typeOrgane": "COMPER",
      "dateDebut": "2016-12-09T01:00:00.000+01:00",
      "datePublication": "2016-12-09T01:00:00.000+01:00",
      "dateFin": "2017-06-20T02:00:00.000+02:00",
      "preseance": "32",
      "nominPrincipale": "1",
      "infosQualite": {
        "codeQualite": "Membre",
        "libQualite": "Membre",
        "libQualiteSex": "Membre"
      },
      "organesRefs": [
        "PO59051"
      ]
    }
  ]
}