{
  "xsiType": "OrganeExterne_Type",
  "uid": "PO702932",
  "codeType": "MINISTERE",
  "libelle": "Ministère du logement, de l'égalité des territoires et de la ruralité",
  "libelleEdition": "du logement, de l'égalité des territoires et de la ruralité",
  "libelleAbrege": "Logement, égalité des territoires et ruralité",
  "libelleAbrev": "LOG",
  "viMoDe": {
    "dateDebut": "2014-08-27T02:00:00.000+02:00",
    "dateFin": "2016-02-12T01:00:00.000+01:00"
  },
  "organeParentRef": "PO702883"
}