{
  "xsiType": "GroupePolitique_type",
  "uid": "PO713077",
  "codeType": "GP",
  "libelle": "Socialiste, écologiste et républicain",
  "libelleEdition": "du groupe Socialiste, écologiste et républicain",
  "libelleAbrege": "SER",
  "libelleAbrev": "SER",
  "viMoDe": {
    "dateDebut": "2016-05-25T02:00:00.000+02:00",
    "dateFin": "2017-06-20T02:00:00.000+02:00"
  },
  "regime": "5ème République",
  "legislature": "14",
  "secretariat": {},
  "positionPolitique": "Majoritaire",
  "preseance": "1"
}