{
  "xsiType": "OrganeParlementaire_Type",
  "uid": "PO708590",
  "codeType": "MISINFO",
  "libelle": "Conséquences du rythme des OPEX sur le maintien en condition opérationnelle des matériels",
  "libelleEdition": "de la mission d'information sur les conséquences du rythme des OPEX sur le maintien en condition opérationnelle des matériels",
  "libelleAbrege": "Rythme des OPEX et maintien des matériels",
  "libelleAbrev": "OPEX",
  "viMoDe": {
    "dateDebut": "2014-12-17T01:00:00.000+01:00",
    "dateFin": "2015-12-09T01:00:00.000+01:00"
  },
  "organeParentRef": "PO59046",
  "regime": "5ème République",
  "legislature": "14",
  "secretariat": {}
}