{
  "uid": "PA267200",
  "etatCivil": {
    "ident": {
      "civ": "M.",
      "prenom": "Sébastien",
      "nom": "Huyghe",
      "alpha": "Huyghe",
      "trigramme": "SHY"
    },
    "infoNaissance": {
      "dateNais": "1969-10-25T01:00:00.000+01:00",
      "villeNais": "Béthune",
      "depNais": "Pas-de-Calais",
      "paysNais": "France"
    }
  },
  "profession": {
    "libelleCourant": "Notaire",
    "socProcInsee": {
      "catSocPro": "Professions libérales et assimilés",
      "famSocPro": "Cadres et professions intellectuelles supérieures"
    }
  },
  "uriHatvp": "https://www.hatvp.fr/pages_nominatives/huyghe-sebastien",
  "adresses": [
    {
      "xsiType": "AdressePostale_Type",
      "uid": "AD13648",
      "type": "2",
      "typeLibelle": "Adresse publiée de circonscription",
      "poids": "22",
      "numeroRue": "234",
      "nomRue": "Rue du Général de Gaulle,",
      "complementAdresse": "BP 10099",
      "codePostal": "59635",
      "ville": "Wattignies Cedex"
    },
    {
      "xsiType": "AdresseTelephonique_Type",
      "uid": "AD13650",
      "type": "11",
      "typeLibelle": "Téléphone",
      "poids": "22",
      "adresseDeRattachement": "AD13648",
      "valElec": "03 20 60 26 26"
    },
    {
      "xsiType": "AdressePostale_Type",
      "uid": "AD386858",
      "type": "0",
      "typeLibelle": "Adresse officielle",
      "poids": "1",
      "intitule": "Assemblée nationale,",
      "numeroRue": "126",
      "nomRue": "Rue de l'Université,",
      "codePostal": "75355",
      "ville": "Paris 07 SP"
    },
    {
      "xsiType": "AdresseMail_Type",
      "uid": "AD391992",
      "type": "15",
      "typeLibelle": "Mèl",
      "valElec": "sebastien.huyghe@assemblee-nationale.fr"
    },
    {
      "xsiType": "AdresseSiteWeb_Type",
      "uid": "AD726090",
      "type": "25",
      "typeLibelle": "Facebook",
      "valElec": "shuyghe.depute"
    },
    {
      "xsiType": "AdresseSiteWeb_Type",
      "uid": "AD726422",
      "type": "24",
      "typeLibelle": "Twitter",
      "valElec": "@SebastienHuyghe"
    }
  ],
  "mandats": [
    {
      "xsiType": "MandatParlementaire_type",
      "uid": "PM267202",
      "acteurRef": "PA267200",
      "legislature": "12",
      "typeOrgane": "ASSEMBLEE",
      "dateDebut": "2002-06-19T02:00:00.000+02:00",
      "dateFin": "2007-06-19T02:00:00.000+02:00",
      "preseance": "50",
      "nominPrincipale": "1",
      "infosQualite": {
        "codeQualite": "membre",
        "libQualite": "membre",
        "libQualiteSex": "membre"
      },
      "organesRefs": [
        "PO230434"
      ],
      "suppleant": {
        "dateDebut": "2002-06-19T02:00:00.000+02:00",
        "dateFin": "2007-06-19T02:00:00.000+02:00",
        "suppleantRef": "PA267201"
      },
      "election": {
        "lieu": {
          "region": "Hauts-de-France",
          "regionType": "Métropolitain",
          "departement": "Nord",
          "numDepartement": "59",
          "numCirco": "5"
        },
        "causeMandat": "élections générales",
        "refCirconscription": "PO230715"
      },
      "mandature": {
        "datePriseFonction": "2002-06-19T02:00:00.000+02:00",
        "causeFin": "Fin de législature",
        "premiereElection": "0",
        "placeHemicycle": "043"
      }
    },
    {
      "xsiType": "MandatSimple_Type",
      "uid": "PM271142",
      "acteurRef": "PA267200",
      "legislature": "12",
      "typeOrgane": "GP",
      "dateDebut": "2002-06-25T02:00:00.000+02:00",
      "datePublication": "2002-06-26T02:00:00.000+02:00",
      "dateFin": "2007-06-19T02:00:00.000+02:00",
      "preseance": "20",
      "nominPrincipale": "1",
      "infosQualite": {
        "codeQualite": "Membre",
        "libQualite": "Membre du",
        "libQualiteSex": "Membre du"
      },
      "organesRefs": [
        "PO270903"
      ]
    },
    {
      "xsiType": "MandatSimple_Type",
      "uid": "PM272096",
      "acteurRef": "PA267200",
      "legislature": "12",
      "typeOrgane": "COMPER",
      "dateDebut": "2002-06-26T02:00:00.000+02:00",
      "datePublication": "2002-06-27T02:00:00.000+02:00",
      "dateFin": "2007-06-19T02:00:00.000+02:00",
      "preseance": "32",
      "nominPrincipale": "1",
      "infosQualite": {
        "codeQualite": "Membre",
        "libQualite": "Membre",
        "libQualiteSex": "Membre"
      },
      "organesRefs": [
        "PO59051"
      ]
    },
    {
      "xsiType": "MandatSimple_Type",
      "uid": "PM274312",
      "acteurRef": "PA267200",
      "legislature": "12",
      "typeOrgane": "API",
      "dateDebut": "2002-07-25T02:00:00.000+02:00",
      "dateFin": "2007-06-19T02:00:00.000+02:00",
      "preseance": "20",
      "nominPrincipale": "1",
      "infosQualite": {
        "codeQualite": "Membre",
        "libQualite": "Membre",
        "libQualiteSex": "Membre"
      },
      "organesRefs": [
        "PO206064"
      ]
    },
    {
      "xsiType": "MandatSimple_Type",
      "uid": "PM282593",
      "acteurRef": "PA267200",
      "legislature": "12",
      "typeOrgane": "GEVI",
      "dateDebut": "2002-11-08T01:00:00.000+01:00",
      "dateFin": "2007-06-19T02:00:00.000+02:00",
      "preseance": "20",
      "nominPrincipale": "1",
      "infosQualite": {
        "codeQualite": "Membre",
        "libQualite": "Membre",
        "libQualiteSex": "Membre"
      },
      "organesRefs": [
        "PO274049"
      ]
    },
    {
      "xsiType": "MandatSimple_Type",
      "uid": "PM282594",
      "acteurRef": "PA267200",
      "legislature": "12",
      "typeOrgane": "GA",
      "dateDebut": "2002-11-08T01:00:00.000+01:00",
      "dateFin": "2007-06-19T02:00:00.000+02:00",
      "preseance": "20",
      "nominPrincipale": "1",
      "infosQualite": {
        "codeQualite": "Membre",
        "libQualite": "Membre",
        "libQualiteSex": "Membre"
      },
      "organesRefs": [
        "PO274099"
      ]
    },
    {
      "xsiType": "MandatSimple_Type",
      "uid": "PM282595",
      "acteurRef": "PA267200",
      "legislature": "12",
      "typeOrgane": "GA",
      "dateDebut": "2002-11-08T01:00:00.000+01:00",
      "dateFin": "2007-06-19T02:00:00.000+02:00",
      "preseance": "20",
      "nominPrincipale": "1",
      "infosQualite": {
        "codeQualite": "Membre",
        "libQualite": "Membre",
        "libQualiteSex": "Membre"
      },
      "organesRefs": [
        "PO274128"
      ]
    },
    {
      "xsiType": "MandatSimple_Type",
      "uid": "PM282596",
      "acteurRef": "PA267200",
      "legislature": "12",
      "typeOrgane": "GA",
      "dateDebut": "2002-11-08T01:00:00.000+01:00",
      "dateFin": "2007-06-19T02:00:00.000+02:00",
      "preseance": "20",
      "nominPrincipale": "1",
      "infosQualite": {
        "codeQualite": "Membre",
        "libQualite": "Membre",
        "libQualiteSex": "Membre"
      },
      "organesRefs": [
        "PO274200"
      ]
    },
    {
      "xsiType": "MandatSimple_Type",
      "uid": "PM282597",
      "acteurRef": "PA267200",
      "legislature": "12",
      "typeOrgane": "GA",
      "dateDebut": "2002-11-08T01:00:00.000+01:00",
      "dateFin": "2007-06-19T02:00:00.000+02:00",
      "preseance": "20",
      "nominPrincipale": "1",
      "infosQualite": {
        "codeQualite": "Membre",
        "libQualite": "Membre",
        "libQualiteSex": "Membre"
      },
      "organesRefs": [
        "PO274116"
      ]
    },
    {
      "xsiType": "MandatSimple_Type",
      "uid": "PM286650",
      "acteurRef": "PA267200",
      "legislature": "12",
      "typeOrgane": "GE",
      "dateDebut": "2002-12-18T01:00:00.000+01:00",
      "dateFin": "2007-06-19T02:00:00.000+02:00",
      "preseance": "20",
      "nominPrincipale": "1",
      "infosQualite": {
        "codeQualite": "Membre",
        "libQualite": "Membre",
        "libQualiteSex": "Membre"
      },
      "organesRefs": [
        "PO285047"
      ]
    },
    {
      "xsiType": "MandatSimple_Type",
      "uid": "PM287623",
      "acteurRef": "PA267200",
      "legislature": "12",
      "typeOrgane": "GE",
      "dateDebut": "2002-12-20T01:00:00.000+01:00",
      "dateFin": "2007-06-19T02:00:00.000+02:00",
      "preseance": "20",
      "nominPrincipale": "1",
      "infosQualite": {
        "codeQualite": "Membre",
        "libQualite": "Membre",
        "libQualiteSex": "Membre"
      },
      "organesRefs": [
        "PO287326"
      ]
    },
    {
      "xsiType": "MandatSimple_Type",
      "uid": "PM290728",
      "acteurRef": "PA267200",
      "legislature": "12",
      "typeOrgane": "GE",
      "dateDebut": "2003-02-26T01:00:00.000+01:00",
      "dateFin": "2007-06-19T02:00:00.000+02:00",
      "preseance": "20",
      "nominPrincipale": "1",
      "infosQualite": {
        "codeQualite": "Membre",
        "libQualite": "Membre",
        "libQualiteSex": "Membre"
      },
      "organesRefs": [
        "PO285073"
      ]
    },
    {
      "xsiType": "MandatSimple_Type",
      "uid": "PM291412",
      "acteurRef": "PA267200",
      "legislature": "12",
      "typeOrgane": "GA",
      "dateDebut": "2003-03-28T01:00:00.000+01:00",
      "dateFin": "2007-06-19T02:00:00.000+02:00",
      "preseance": "20",
      "nominPrincipale": "1",
      "infosQualite": {
        "codeQualite": "Membre",
        "libQualite": "Membre",
        "libQualiteSex": "Membre"
      },
      "organesRefs": [
        "PO274133"
      ]
    },
    {
      "xsiType": "MandatSimple_Type",
      "uid": "PM295058",
      "acteurRef": "PA267200",
      "legislature": "12",
      "typeOrgane": "GE",
      "dateDebut": "2003-04-29T02:00:00.000+02:00",
      "dateFin": "2007-06-19T02:00:00.000+02:00",
      "preseance": "20",
      "nominPrincipale": "0",
      "infosQualite": {
        "codeQualite": "Membre",
        "libQualite": "Membre",
        "libQualiteSex": "Membre"
      },
      "organesRefs": [
        "PO292860"
      ]
    },
    {
      "xsiType": "MandatSimple_Type",
      "uid": "PM295667",
      "acteurRef": "PA267200",
      "legislature": "12",
      "typeOrgane": "GE",
      "dateDebut": "2003-03-26T01:00:00.000+01:00",
      "dateFin": "2007-06-19T02:00:00.000+02:00",
      "preseance": "20",
      "nominPrincipale": "1",
      "infosQualite": {
        "codeQualite": "Membre",
        "libQualite": "Membre",
        "libQualiteSex": "Membre"
      },
      "organesRefs": [
        "PO285131"
      ]
    },
    {
      "xsiType": "MandatSimple_Type",
      "uid": "PM295777",
      "acteurRef": "PA267200",
      "legislature": "12",
      "typeOrgane": "GE",
      "dateDebut": "2002-11-27T01:00:00.000+01:00",
      "dateFin": "2007-06-19T02:00:00.000+02:00",
      "preseance": "20",
      "nominPrincipale": "1",
      "infosQualite": {
        "codeQualite": "Membre",
        "libQualite": "Membre",
        "libQualiteSex": "Membre"
      },
      "organesRefs": [
        "PO285126"
      ]
    },
    {
      "xsiType": "MandatSimple_Type",
      "uid": "PM296920",
      "acteurRef": "PA267200",
      "legislature": "12",
      "typeOrgane": "GE",
      "dateDebut": "2003-09-16T02:00:00.000+02:00",
      "dateFin": "2007-06-19T02:00:00.000+02:00",
      "preseance": "20",
      "nominPrincipale": "1",
      "infosQualite": {
        "codeQualite": "Membre",
        "libQualite": "Membre",
        "libQualiteSex": "Membre"
      },
      "organesRefs": [
        "PO292868"
      ]
    },
    {
      "xsiType": "MandatSimple_Type",
      "uid": "PM297282",
      "acteurRef": "PA267200",
      "legislature": "12",
      "typeOrgane": "GE",
      "dateDebut": "2003-04-29T02:00:00.000+02:00",
      "dateFin": "2007-06-19T02:00:00.000+02:00",
      "preseance": "8",
      "nominPrincipale": "1",
      "infosQualite": {
        "codeQualite": "Vice-Président",
        "libQualite": "Vice-Président",
        "libQualiteSex": "Vice-Président"
      },
      "organesRefs": [
        "PO292860"
      ]
    },
    {
      "xsiType": "MandatSimple_Type",
      "uid": "PM299700",
      "acteurRef": "PA267200",
      "legislature": "12",
      "typeOrgane": "GE",
      "dateDebut": "2003-10-14T02:00:00.000+02:00",
      "dateFin": "2007-06-19T02:00:00.000+02:00",
      "preseance": "20",
      "nominPrincipale": "1",
      "infosQualite": {
        "codeQualite": "Membre",
        "libQualite": "Membre",
        "libQualiteSex": "Membre"
      },
      "organesRefs": [
        "PO285075"
      ]
    },
    {
      "xsiType": "MandatSimple_Type",
      "uid": "PM299864",
      "acteurRef": "PA267200",
      "legislature": "12",
      "typeOrgane": "GE",
      "dateDebut": "2003-03-11T01:00:00.000+01:00",
      "dateFin": "2007-06-19T02:00:00.000+02:00",
      "preseance": "20",
      "nominPrincipale": "0",
      "infosQualite": {
        "codeQualite": "Membre",
        "libQualite": "Membre",
        "libQualiteSex": "Membre"
      },
      "organesRefs": [
        "PO287425"
      ]
    },
    {
      "xsiType": "MandatSimple_Type",
      "uid": "PM299884",
      "acteurRef": "PA267200",
      "legislature": "12",
      "typeOrgane": "GE",
      "dateDebut": "2003-03-11T01:00:00.000+01:00",
      "dateFin": "2007-06-19T02:00:00.000+02:00",
      "preseance": "8",
      "nominPrincipale": "1",
      "infosQualite": {
        "codeQualite": "Vice-Président",
        "libQualite": "Vice-Président",
        "libQualiteSex": "Vice-Président"
      },
      "organesRefs": [
        "PO287425"
      ]
    },
    {
      "xsiType": "MandatSimple_Type",
      "uid": "PM300421",
      "acteurRef": "PA267200",
      "legislature": "12",
      "typeOrgane": "GE",
      "dateDebut": "2003-01-28T01:00:00.000+01:00",
      "dateFin": "2007-06-19T02:00:00.000+02:00",
      "preseance": "20",
      "nominPrincipale": "1",
      "infosQualite": {
        "codeQualite": "Membre",
        "libQualite": "Membre",
        "libQualiteSex": "Membre"
      },
      "organesRefs": [
        "PO285134"
      ]
    },
    {
      "xsiType": "MandatSimple_Type",
      "uid": "PM310526",
      "acteurRef": "PA267200",
      "legislature": "12",
      "typeOrgane": "GE",
      "dateDebut": "2004-09-06T02:00:00.000+02:00",
      "dateFin": "2007-06-19T02:00:00.000+02:00",
      "preseance": "20",
      "nominPrincipale": "0",
      "infosQualite": {
        "codeQualite": "Membre",
        "libQualite": "Membre",
        "libQualiteSex": "Membre"
      },
      "organesRefs": [
        "PO285111"
      ]
    },
    {
      "xsiType": "MandatSimple_Type",
      "uid": "PM310527",
      "acteurRef": "PA267200",
      "legislature": "12",
      "typeOrgane": "GE",
      "dateDebut": "2004-09-06T02:00:00.000+02:00",
      "dateFin": "2007-06-19T02:00:00.000+02:00",
      "preseance": "1",
      "nominPrincipale": "1",
      "infosQualite": {
        "codeQualite": "Président",
        "libQualite": "Président",
        "libQualiteSex": "Président"
      },
      "organesRefs": [
        "PO285111"
      ]
    },
    {
      "xsiType": "MandatSimple_Type",
      "uid": "PM310963",
      "acteurRef": "PA267200",
      "legislature": "12",
      "typeOrgane": "GE",
      "dateDebut": "2005-02-01T01:00:00.000+01:00",
      "dateFin": "2007-06-19T02:00:00.000+02:00",
      "preseance": "20",
      "nominPrincipale": "0",
      "infosQualite": {
        "codeQualite": "Membre",
        "libQualite": "Membre",
        "libQualiteSex": "Membre"
      },
      "organesRefs": [
        "PO309949"
      ]
    },
    {
      "xsiType": "MandatSimple_Type",
      "uid": "PM310969",
      "acteurRef": "PA267200",
      "legislature": "12",
      "typeOrgane": "GE",
      "dateDebut": "2005-02-01T01:00:00.000+01:00",
      "dateFin": "2007-06-19T02:00:00.000+02:00",
      "preseance": "8",
      "nominPrincipale": "1",
      "infosQualite": {
        "codeQualite": "Vice-Président",
        "libQualite": "Vice-Président",
        "libQualiteSex": "Vice-Président"
      },
      "organesRefs": [
        "PO309949"
      ]
    },
    {
      "xsiType": "MandatSimple_Type",
      "uid": "PM312614",
      "acteurRef": "PA267200",
      "legislature": "12",
      "typeOrgane": "GE",
      "dateDebut": "2005-05-04T02:00:00.000+02:00",
      "dateFin": "2007-06-19T02:00:00.000+02:00",
      "preseance": "20",
      "nominPrincipale": "1",
      "infosQualite": {
        "codeQualite": "Membre",
        "libQualite": "Membre",
        "libQualiteSex": "Membre"
      },
      "organesRefs": [
        "PO290178"
      ]
    },
    {
      "xsiType": "MandatSimple_Type",
      "uid": "PM313442",
      "acteurRef": "PA267200",
      "legislature": "12",
      "typeOrgane": "GE",
      "dateDebut": "2005-07-01T02:00:00.000+02:00",
      "dateFin": "2007-06-19T02:00:00.000+02:00",
      "preseance": "20",
      "nominPrincipale": "0",
      "infosQualite": {
        "codeQualite": "Membre",
        "libQualite": "Membre",
        "libQualiteSex": "Membre"
      },
      "organesRefs": [
        "PO309981"
      ]
    },
    {
      "xsiType": "MandatSimple_Type",
      "uid": "PM313464",
      "acteurRef": "PA267200",
      "legislature": "12",
      "typeOrgane": "GE",
      "dateDebut": "2005-07-01T02:00:00.000+02:00",
      "dateFin": "2007-06-19T02:00:00.000+02:00",
      "preseance": "8",
      "nominPrincipale": "1",
      "infosQualite": {
        "codeQualite": "Vice-Président",
        "libQualite": "Vice-Président",
        "libQualiteSex": "Vice-Président"
      },
      "organesRefs": [
        "PO309981"
      ]
    },
    {
      "xsiType": "MandatSimple_Type",
      "uid": "PM381623",
      "acteurRef": "PA267200",
      "legislature": "12",
      "typeOrgane": "GE",
      "dateDebut": "2006-12-13T01:00:00.000+01:00",
      "dateFin": "2007-06-19T02:00:00.000+02:00",
      "preseance": "20",
      "nominPrincipale": "1",
      "infosQualite": {
        "codeQualite": "Membre",
        "libQualite": "Membre",
        "libQualiteSex": "Membre"
      },
      "organesRefs": [
        "PO324488"
      ]
    },
    {
      "xsiType": "MandatParlementaire_type",
      "uid": "PM386294",
      "acteurRef": "PA267200",
      "legislature": "13",
      "typeOrgane": "ASSEMBLEE",
      "dateDebut": "2007-06-20T02:00:00.000+02:00",
      "dateFin": "2012-06-19T02:00:00.000+02:00",
      "preseance": "50",
      "nominPrincipale": "1",
      "infosQualite": {
        "codeQualite": "membre",
        "libQualite": "membre",
        "libQualiteSex": "membre"
      },
      "organesRefs": [
        "PO384266"
      ],
      "suppleant": {
        "dateDebut": "2007-06-20T02:00:00.000+02:00",
        "dateFin": "2012-06-19T02:00:00.000+02:00",
        "suppleantRef": "PA343725"
      },
      "election": {
        "lieu": {
          "region": "Hauts-de-France",
          "regionType": "Métropolitain",
          "departement": "Nord",
          "numDepartement": "59",
          "numCirco": "5"
        },
        "causeMandat": "élections générales",
        "refCirconscription": "PO384547"
      },
      "mandature": {
        "datePriseFonction": "2007-06-20T02:00:00.000+02:00",
        "causeFin": "Fin de législature",
        "premiereElection": "1",
        "placeHemicycle": "043"
      }
    },
    {
      "xsiType": "MandatSimple_Type",
      "uid": "PM387437",
      "acteurRef": "PA267200",
      "legislature": "13",
      "typeOrgane": "GP",
      "dateDebut": "2007-06-20T02:00:00.000+02:00",
      "dateFin": "2007-06-26T02:00:00.000+02:00",
      "preseance": "28",
      "nominPrincipale": "1",
      "infosQualite": {
        "codeQualite": "Député non-inscrit",
        "libQualite": "Député non-inscrit",
        "libQualiteSex": "Député non-inscrit"
      },
      "organesRefs": [
        "PO387155"
      ]
    },
    {
      "xsiType": "MandatSimple_Type",
      "uid": "PM389850",
      "acteurRef": "PA267200",
      "legislature": "13",
      "typeOrgane": "GP",
      "dateDebut": "2007-06-27T02:00:00.000+02:00",
      "datePublication": "2007-06-27T02:00:00.000+02:00",
      "dateFin": "2012-06-19T02:00:00.000+02:00",
      "preseance": "20",
      "nominPrincipale": "1",
      "infosQualite": {
        "codeQualite": "Membre",
        "libQualite": "Membre du",
        "libQualiteSex": "Membre du"
      },
      "organesRefs": [
        "PO389395"
      ]
    },
    {
      "xsiType": "MandatSimple_Type",
      "uid": "PM390895",
      "acteurRef": "PA267200",
      "legislature": "13",
      "typeOrgane": "COMPER",
      "dateDebut": "2007-06-27T02:00:00.000+02:00",
      "datePublication": "2007-06-28T02:00:00.000+02:00",
      "dateFin": "2010-11-09T01:00:00.000+01:00",
      "preseance": "32",
      "nominPrincipale": "1",
      "infosQualite": {
        "codeQualite": "Membre",
        "libQualite": "Membre",
        "libQualiteSex": "Membre"
      },
      "organesRefs": [
        "PO59051"
      ]
    },
    {
      "xsiType": "MandatSimple_Type",
      "uid": "PM391085",
      "acteurRef": "PA267200",
      "legislature": "13",
      "typeOrgane": "COMPER",
      "dateDebut": "2007-06-28T02:00:00.000+02:00",
      "datePublication": "2007-06-29T02:00:00.000+02:00",
      "dateFin": "2008-10-01T02:00:00.000+02:00",
      "preseance": "16",
      "nominPrincipale": "1",
      "infosQualite": {
        "codeQualite": "Secrétaire",
        "libQualite": "Secrétaire",
        "libQualiteSex": "Secrétaire"
      },
      "organesRefs": [
        "PO59051"
      ]
    },
    {
      "xsiType": "MandatSimple_Type",
      "uid": "PM391581",
      "acteurRef": "PA267200",
      "legislature": "13",
      "typeOrgane": "ORGEXTPARL",
      "dateDebut": "2007-07-04T02:00:00.000+02:00",
      "datePublication": "2007-07-06T02:00:00.000+02:00",
      "dateFin": "2012-06-19T02:00:00.000+02:00",
      "preseance": "20",
      "nominPrincipale": "1",
      "infosQualite": {
        "codeQualite": "Titulaire",
        "libQualite": "Membre titulaire",
        "libQualiteSex": "Membre titulaire"
      },
      "organesRefs": [
        "PO60185"
      ]
    },
    {
      "xsiType": "MandatSimple_Type",
      "uid": "PM396269",
      "acteurRef": "PA267200",
      "legislature": "13",
      "typeOrgane": "GA",
      "dateDebut": "2007-10-05T02:00:00.000+02:00",
      "dateFin": "2012-06-19T02:00:00.000+02:00",
      "preseance": "20",
      "nominPrincipale": "1",
      "infosQualite": {
        "codeQualite": "Membre",
        "libQualite": "Membre",
        "libQualiteSex": "Membre"
      },
      "organesRefs": [
        "PO392840"
      ]
    },
    {
      "xsiType": "MandatSimple_Type",
      "uid": "PM396270",
      "acteurRef": "PA267200",
      "legislature": "13",
      "typeOrgane": "GA",
      "dateDebut": "2007-10-05T02:00:00.000+02:00",
      "dateFin": "2012-06-19T02:00:00.000+02:00",
      "preseance": "20",
      "nominPrincipale": "1",
      "infosQualite": {
        "codeQualite": "Membre",
        "libQualite": "Membre",
        "libQualiteSex": "Membre"
      },
      "organesRefs": [
        "PO393070"
      ]
    },
    {
      "xsiType": "MandatSimple_Type",
      "uid": "PM396271",
      "acteurRef": "PA267200",
      "legislature": "13",
      "typeOrgane": "GA",
      "dateDebut": "2007-10-05T02:00:00.000+02:00",
      "dateFin": "2012-06-19T02:00:00.000+02:00",
      "preseance": "20",
      "nominPrincipale": "1",
      "infosQualite": {
        "codeQualite": "Membre",
        "libQualite": "Membre",
        "libQualiteSex": "Membre"
      },
      "organesRefs": [
        "PO393192"
      ]
    },
    {
      "xsiType": "MandatSimple_Type",
      "uid": "PM396413",
      "acteurRef": "PA267200",
      "legislature": "13",
      "typeOrgane": "GA",
      "dateDebut": "2007-10-05T02:00:00.000+02:00",
      "dateFin": "2012-06-19T02:00:00.000+02:00",
      "preseance": "20",
      "nominPrincipale": "1",
      "infosQualite": {
        "codeQualite": "Membre",
        "libQualite": "Membre",
        "libQualiteSex": "Membre"
      },
      "organesRefs": [
        "PO392669"
      ]
    },
    {
      "xsiType": "MandatSimple_Type",
      "uid": "PM396414",
      "acteurRef": "PA267200",
      "legislature": "13",
      "typeOrgane": "GA",
      "dateDebut": "2007-10-05T02:00:00.000+02:00",
      "dateFin": "2012-06-19T02:00:00.000+02:00",
      "preseance": "20",
      "nominPrincipale": "1",
      "infosQualite": {
        "codeQualite": "Membre",
        "libQualite": "Membre",
        "libQualiteSex": "Membre"
      },
      "organesRefs": [
        "PO392820"
      ]
    },
    {
      "xsiType": "MandatSimple_Type",
      "uid": "PM396416",
      "acteurRef": "PA267200",
      "legislature": "13",
      "typeOrgane": "GA",
      "dateDebut": "2007-10-05T02:00:00.000+02:00",
      "dateFin": "2012-06-19T02:00:00.000+02:00",
      "preseance": "20",
      "nominPrincipale": "1",
      "infosQualite": {
        "codeQualite": "Membre",
        "libQualite": "Membre",
        "libQualiteSex": "Membre"
      },
      "organesRefs": [
        "PO392950"
      ]
    },
    {
      "xsiType": "MandatSimple_Type",
      "uid": "PM396417",
      "acteurRef": "PA267200",
      "legislature": "13",
      "typeOrgane": "GA",
      "dateDebut": "2007-10-05T02:00:00.000+02:00",
      "dateFin": "2012-06-19T02:00:00.000+02:00",
      "preseance": "20",
      "nominPrincipale": "1",
      "infosQualite": {
        "codeQualite": "Membre",
        "libQualite": "Membre",
        "libQualiteSex": "Membre"
      },
      "organesRefs": [
        "PO392990"
      ]
    },
    {
      "xsiType": "MandatSimple_Type",
      "uid": "PM396419",
      "acteurRef": "PA267200",
      "legislature": "13",
      "typeOrgane": "GA",
      "dateDebut": "2007-10-05T02:00:00.000+02:00",
      "dateFin": "2012-06-19T02:00:00.000+02:00",
      "preseance": "20",
      "nominPrincipale": "1",
      "infosQualite": {
        "codeQualite": "Membre",
        "libQualite": "Membre",
        "libQualiteSex": "Membre"
      },
      "organesRefs": [
        "PO393130"
      ]
    },
    {
      "xsiType": "MandatSimple_Type",
      "uid": "PM396421",
      "acteurRef": "PA267200",
      "legislature": "13",
      "typeOrgane": "GA",
      "dateDebut": "2007-10-05T02:00:00.000+02:00",
      "dateFin": "2012-06-19T02:00:00.000+02:00",
      "preseance": "20",
      "nominPrincipale": "1",
      "infosQualite": {
        "codeQualite": "Membre",
        "libQualite": "Membre",
        "libQualiteSex": "Membre"
      },
      "organesRefs": [
        "PO393363"
      ]
    },
    {
      "xsiType": "MandatSimple_Type",
      "uid": "PM396422",
      "acteurRef": "PA267200",
      "legislature": "13",
      "typeOrgane": "GA",
      "dateDebut": "2007-10-05T02:00:00.000+02:00",
      "dateFin": "2012-06-19T02:00:00.000+02:00",
      "preseance": "20",
      "nominPrincipale": "1",
      "infosQualite": {
        "codeQualite": "Membre",
        "libQualite": "Membre",
        "libQualiteSex": "Membre"
      },
      "organesRefs": [
        "PO393468"
      ]
    },
    {
      "xsiType": "MandatSimple_Type",
      "uid": "PM396423",
      "acteurRef": "PA267200",
      "legislature": "13",
      "typeOrgane": "GEVI",
      "dateDebut": "2007-10-05T02:00:00.000+02:00",
      "dateFin": "2012-06-19T02:00:00.000+02:00",
      "preseance": "20",
      "nominPrincipale": "1",
      "infosQualite": {
        "codeQualite": "Membre",
        "libQualite": "Membre",
        "libQualiteSex": "Membre"
      },
      "organesRefs": [
        "PO393498"
      ]
    },
    {
      "xsiType": "MandatSimple_Type",
      "uid": "PM404435",
      "acteurRef": "PA267200",
      "legislature": "13",
      "typeOrgane": "GA",
      "dateDebut": "2007-11-28T01:00:00.000+01:00",
      "dateFin": "2012-06-19T02:00:00.000+02:00",
      "preseance": "8",
      "nominPrincipale": "1",
      "infosQualite": {
        "codeQualite": "Vice-Président",
        "libQualite": "Vice-Président",
        "libQualiteSex": "Vice-Président"
      },
      "organesRefs": [
        "PO393363"
      ]
    },
    {
      "xsiType": "MandatSimple_Type",
      "uid": "PM404886",
      "acteurRef": "PA267200",
      "legislature": "13",
      "typeOrgane": "GA",
      "dateDebut": "2007-12-04T01:00:00.000+01:00",
      "dateFin": "2012-06-19T02:00:00.000+02:00",
      "preseance": "14",
      "nominPrincipale": "1",
      "infosQualite": {
        "codeQualite": "Secrétaire",
        "libQualite": "Secrétaire",
        "libQualiteSex": "Secrétaire"
      },
      "organesRefs": [
        "PO392950"
      ]
    },
    {
      "xsiType": "MandatSimple_Type",
      "uid": "PM405013",
      "acteurRef": "PA267200",
      "legislature": "13",
      "typeOrgane": "GE",
      "dateDebut": "2007-12-07T01:00:00.000+01:00",
      "dateFin": "2012-06-19T02:00:00.000+02:00",
      "preseance": "20",
      "nominPrincipale": "1",
      "infosQualite": {
        "codeQualite": "Membre",
        "libQualite": "Membre",
        "libQualiteSex": "Membre"
      },
      "organesRefs": [
        "PO403325"
      ]
    },
    {
      "xsiType": "MandatSimple_Type",
      "uid": "PM405014",
      "acteurRef": "PA267200",
      "legislature": "13",
      "typeOrgane": "GE",
      "dateDebut": "2007-12-07T01:00:00.000+01:00",
      "dateFin": "2008-07-15T02:00:00.000+02:00",
      "preseance": "4",
      "nominPrincipale": "1",
      "infosQualite": {
        "codeQualite": "Co-Président",
        "libQualite": "Co-Président",
        "libQualiteSex": "Co-Président"
      },
      "organesRefs": [
        "PO403325"
      ]
    },
    {
      "xsiType": "MandatSimple_Type",
      "uid": "PM405872",
      "acteurRef": "PA267200",
      "legislature": "13",
      "typeOrgane": "GE",
      "dateDebut": "2007-12-20T01:00:00.000+01:00",
      "dateFin": "2012-06-19T02:00:00.000+02:00",
      "preseance": "20",
      "nominPrincipale": "1",
      "infosQualite": {
        "codeQualite": "Membre",
        "libQualite": "Membre",
        "libQualiteSex": "Membre"
      },
      "organesRefs": [
        "PO403226"
      ]
    },
    {
      "xsiType": "MandatSimple_Type",
      "uid": "PM406190",
      "acteurRef": "PA267200",
      "legislature": "13",
      "typeOrgane": "GA",
      "dateDebut": "2008-01-03T01:00:00.000+01:00",
      "dateFin": "2012-06-19T02:00:00.000+02:00",
      "preseance": "20",
      "nominPrincipale": "1",
      "infosQualite": {
        "codeQualite": "Membre",
        "libQualite": "Membre",
        "libQualiteSex": "Membre"
      },
      "organesRefs": [
        "PO393085"
      ]
    },
    {
      "xsiType": "MandatSimple_Type",
      "uid": "PM406256",
      "acteurRef": "PA267200",
      "legislature": "13",
      "typeOrgane": "GE",
      "dateDebut": "2008-01-09T01:00:00.000+01:00",
      "dateFin": "2012-06-19T02:00:00.000+02:00",
      "preseance": "20",
      "nominPrincipale": "1",
      "infosQualite": {
        "codeQualite": "Membre",
        "libQualite": "Membre",
        "libQualiteSex": "Membre"
      },
      "organesRefs": [
        "PO402991"
      ]
    },
    {
      "xsiType": "MandatSimple_Type",
      "uid": "PM408284",
      "acteurRef": "PA267200",
      "legislature": "13",
      "typeOrgane": "GE",
      "dateDebut": "2008-01-22T01:00:00.000+01:00",
      "dateFin": "2012-06-19T02:00:00.000+02:00",
      "preseance": "20",
      "nominPrincipale": "1",
      "infosQualite": {
        "codeQualite": "Membre",
        "libQualite": "Membre",
        "libQualiteSex": "Membre"
      },
      "organesRefs": [
        "PO403148"
      ]
    },
    {
      "xsiType": "MandatSimple_Type",
      "uid": "PM408710",
      "acteurRef": "PA267200",
      "legislature": "13",
      "typeOrgane": "GE",
      "dateDebut": "2008-02-07T01:00:00.000+01:00",
      "dateFin": "2012-06-19T02:00:00.000+02:00",
      "preseance": "20",
      "nominPrincipale": "1",
      "infosQualite": {
        "codeQualite": "Membre",
        "libQualite": "Membre",
        "libQualiteSex": "Membre"
      },
      "organesRefs": [
        "PO403009"
      ]
    },
    {
      "xsiType": "MandatSimple_Type",
      "uid": "PM410877",
      "acteurRef": "PA267200",
      "legislature": "13",
      "typeOrgane": "GE",
      "dateDebut": "2008-01-08T01:00:00.000+01:00",
      "dateFin": "2012-06-19T02:00:00.000+02:00",
      "preseance": "20",
      "nominPrincipale": "1",
      "infosQualite": {
        "codeQualite": "Membre",
        "libQualite": "Membre",
        "libQualiteSex": "Membre"
      },
      "organesRefs": [
        "PO402919"
      ]
    },
    {
      "xsiType": "MandatSimple_Type",
      "uid": "PM411077",
      "acteurRef": "PA267200",
      "legislature": "13",
      "typeOrgane": "GE",
      "dateDebut": "2008-03-21T01:00:00.000+01:00",
      "dateFin": "2012-06-19T02:00:00.000+02:00",
      "preseance": "20",
      "nominPrincipale": "1",
      "infosQualite": {
        "codeQualite": "Membre",
        "libQualite": "Membre",
        "libQualiteSex": "Membre"
      },
      "organesRefs": [
        "PO403129"
      ]
    },
    {
      "xsiType": "MandatSimple_Type",
      "uid": "PM411223",
      "acteurRef": "PA267200",
      "legislature": "13",
      "typeOrgane": "GE",
      "dateDebut": "2008-03-26T01:00:00.000+01:00",
      "dateFin": "2012-06-19T02:00:00.000+02:00",
      "preseance": "20",
      "nominPrincipale": "1",
      "infosQualite": {
        "codeQualite": "Membre",
        "libQualite": "Membre",
        "libQualiteSex": "Membre"
      },
      "organesRefs": [
        "PO403301"
      ]
    },
    {
      "xsiType": "MandatSimple_Type",
      "uid": "PM411654",
      "acteurRef": "PA267200",
      "legislature": "13",
      "typeOrgane": "GE",
      "dateDebut": "2008-03-31T02:00:00.000+02:00",
      "dateFin": "2012-06-19T02:00:00.000+02:00",
      "preseance": "20",
      "nominPrincipale": "1",
      "infosQualite": {
        "codeQualite": "Membre",
        "libQualite": "Membre",
        "libQualiteSex": "Membre"
      },
      "organesRefs": [
        "PO402882"
      ]
    },
    {
      "xsiType": "MandatSimple_Type",
      "uid": "PM412089",
      "acteurRef": "PA267200",
      "legislature": "13",
      "typeOrgane": "GE",
      "dateDebut": "2008-01-30T01:00:00.000+01:00",
      "dateFin": "2012-06-19T02:00:00.000+02:00",
      "preseance": "20",
      "nominPrincipale": "1",
      "infosQualite": {
        "codeQualite": "Membre",
        "libQualite": "Membre",
        "libQualiteSex": "Membre"
      },
      "organesRefs": [
        "PO403111"
      ]
    },
    {
      "xsiType": "MandatSimple_Type",
      "uid": "PM415358",
      "acteurRef": "PA267200",
      "legislature": "13",
      "typeOrgane": "GE",
      "dateDebut": "2008-09-19T02:00:00.000+02:00",
      "dateFin": "2012-06-19T02:00:00.000+02:00",
      "preseance": "20",
      "nominPrincipale": "0",
      "infosQualite": {
        "codeQualite": "Membre",
        "libQualite": "Membre",
        "libQualiteSex": "Membre"
      },
      "organesRefs": [
        "PO415352"
      ]
    },
    {
      "xsiType": "MandatSimple_Type",
      "uid": "PM415359",
      "acteurRef": "PA267200",
      "legislature": "13",
      "typeOrgane": "GE",
      "dateDebut": "2008-09-19T02:00:00.000+02:00",
      "dateFin": "2012-06-19T02:00:00.000+02:00",
      "preseance": "1",
      "nominPrincipale": "1",
      "infosQualite": {
        "codeQualite": "Président",
        "libQualite": "Président",
        "libQualiteSex": "Président"
      },
      "organesRefs": [
        "PO415352"
      ]
    },
    {
      "xsiType": "MandatSimple_Type",
      "uid": "PM415728",
      "acteurRef": "PA267200",
      "legislature": "13",
      "typeOrgane": "COMPER",
      "dateDebut": "2008-10-01T02:00:00.000+02:00",
      "datePublication": "2008-10-02T02:00:00.000+02:00",
      "dateFin": "2009-07-01T02:00:00.000+02:00",
      "preseance": "8",
      "nominPrincipale": "1",
      "infosQualite": {
        "codeQualite": "Vice-Président",
        "libQualite": "Vice-président",
        "libQualiteSex": "Vice-président"
      },
      "organesRefs": [
        "PO59051"
      ]
    },
    {
      "xsiType": "MandatSimple_Type",
      "uid": "PM416230",
      "acteurRef": "PA267200",
      "legislature": "13",
      "typeOrgane": "GE",
      "dateDebut": "2008-10-02T02:00:00.000+02:00",
      "dateFin": "2012-06-19T02:00:00.000+02:00",
      "preseance": "8",
      "nominPrincipale": "1",
      "infosQualite": {
        "codeQualite": "Vice-Président",
        "libQualite": "Vice-Président",
        "libQualiteSex": "Vice-Président"
      },
      "organesRefs": [
        "PO403325"
      ]
    },
    {
      "xsiType": "MandatSimple_Type",
      "uid": "PM416452",
      "acteurRef": "PA267200",
      "legislature": "13",
      "typeOrgane": "CNPS",
      "dateDebut": "2008-10-28T01:00:00.000+01:00",
      "datePublication": "2008-10-29T01:00:00.000+01:00",
      "dateFin": "2009-07-01T02:00:00.000+02:00",
      "preseance": "20",
      "nominPrincipale": "1",
      "infosQualite": {
        "codeQualite": "Membre",
        "libQualite": "Membre",
        "libQualiteSex": "Membre"
      },
      "organesRefs": [
        "PO416249"
      ]
    },
    {
      "xsiType": "MandatSimple_Type",
      "uid": "PM416897",
      "acteurRef": "PA267200",
      "legislature": "13",
      "typeOrgane": "GE",
      "dateDebut": "2008-12-01T01:00:00.000+01:00",
      "dateFin": "2012-06-19T02:00:00.000+02:00",
      "preseance": "20",
      "nominPrincipale": "1",
      "infosQualite": {
        "codeQualite": "Membre",
        "libQualite": "Membre",
        "libQualiteSex": "Membre"
      },
      "organesRefs": [
        "PO415344"
      ]
    },
    {
      "xsiType": "MandatSimple_Type",
      "uid": "PM418734",
      "acteurRef": "PA267200",
      "legislature": "13",
      "typeOrgane": "GE",
      "dateDebut": "2009-03-19T01:00:00.000+01:00",
      "dateFin": "2012-06-19T02:00:00.000+02:00",
      "preseance": "20",
      "nominPrincipale": "1",
      "infosQualite": {
        "codeQualite": "Membre",
        "libQualite": "Membre",
        "libQualiteSex": "Membre"
      },
      "organesRefs": [
        "PO402715"
      ]
    },
    {
      "xsiType": "MandatSimple_Type",
      "uid": "PM420882",
      "acteurRef": "PA267200",
      "legislature": "13",
      "typeOrgane": "COMPER",
      "dateDebut": "2009-07-01T02:00:00.000+02:00",
      "datePublication": "2009-07-02T02:00:00.000+02:00",
      "dateFin": "2010-10-05T02:00:00.000+02:00",
      "preseance": "16",
      "nominPrincipale": "1",
      "infosQualite": {
        "codeQualite": "Secrétaire",
        "libQualite": "Secrétaire",
        "libQualiteSex": "Secrétaire"
      },
      "organesRefs": [
        "PO59051"
      ]
    },
    {
      "xsiType": "MandatSimple_Type",
      "uid": "PM421778",
      "acteurRef": "PA267200",
      "legislature": "13",
      "typeOrgane": "CMP",
      "dateDebut": "2009-09-28T02:00:00.000+02:00",
      "datePublication": "2009-10-01T02:00:00.000+02:00",
      "dateFin": "2009-10-26T01:00:00.000+01:00",
      "preseance": "28",
      "nominPrincipale": "1",
      "infosQualite": {
        "codeQualite": "Suppléant",
        "libQualite": "Membre suppléant",
        "libQualiteSex": "Membre suppléant"
      },
      "organesRefs": [
        "PO421633"
      ]
    },
    {
      "xsiType": "MandatSimple_Type",
      "uid": "PM421797",
      "acteurRef": "PA267200",
      "legislature": "13",
      "typeOrgane": "CMP",
      "dateDebut": "2009-09-28T02:00:00.000+02:00",
      "datePublication": "2009-10-01T02:00:00.000+02:00",
      "dateFin": "2009-10-26T01:00:00.000+01:00",
      "preseance": "20",
      "nominPrincipale": "1",
      "infosQualite": {
        "codeQualite": "Titulaire",
        "libQualite": "Membre titulaire",
        "libQualiteSex": "Membre titulaire"
      },
      "organesRefs": [
        "PO421626"
      ]
    },
    {
      "xsiType": "MandatSimple_Type",
      "uid": "PM422549",
      "acteurRef": "PA267200",
      "legislature": "13",
      "typeOrgane": "CNPS",
      "dateDebut": "2009-12-09T01:00:00.000+01:00",
      "datePublication": "2009-12-10T01:00:00.000+01:00",
      "dateFin": "2010-07-06T02:00:00.000+02:00",
      "preseance": "20",
      "nominPrincipale": "1",
      "infosQualite": {
        "codeQualite": "Membre",
        "libQualite": "Membre",
        "libQualiteSex": "Membre"
      },
      "organesRefs": [
        "PO422492"
      ]
    },
    {
      "xsiType": "MandatMission_Type",
      "uid": "PM423584",
      "acteurRef": "PA267200",
      "legislature": "13",
      "typeOrgane": "MISINFOCOM",
      "dateDebut": "2010-04-07T02:00:00.000+02:00",
      "datePublication": "2010-04-08T02:00:00.000+02:00",
      "dateFin": "2011-06-22T02:00:00.000+02:00",
      "preseance": "20",
      "nominPrincipale": "0",
      "infosQualite": {
        "codeQualite": "Membre",
        "libQualite": "Membre",
        "libQualiteSex": "Membre"
      },
      "organesRefs": [
        "PO423569"
      ]
    },
    {
      "xsiType": "MandatMission_Type",
      "uid": "PM423596",
      "acteurRef": "PA267200",
      "legislature": "13",
      "typeOrgane": "MISINFOCOM",
      "dateDebut": "2010-04-07T02:00:00.000+02:00",
      "datePublication": "2010-04-08T02:00:00.000+02:00",
      "dateFin": "2011-06-22T02:00:00.000+02:00",
      "preseance": "4",
      "nominPrincipale": "1",
      "infosQualite": {
        "codeQualite": "Vice-Président",
        "libQualite": "Vice-président",
        "libQualiteSex": "Vice-président"
      },
      "organesRefs": [
        "PO423569"
      ]
    },
    {
      "xsiType": "MandatSimple_Type",
      "uid": "PM424166",
      "acteurRef": "PA267200",
      "legislature": "13",
      "typeOrgane": "CMP",
      "dateDebut": "2010-06-02T02:00:00.000+02:00",
      "datePublication": "2010-06-03T02:00:00.000+02:00",
      "dateFin": "2010-07-06T02:00:00.000+02:00",
      "preseance": "20",
      "nominPrincipale": "1",
      "infosQualite": {
        "codeQualite": "Titulaire",
        "libQualite": "Membre titulaire",
        "libQualiteSex": "Membre titulaire"
      },
      "organesRefs": [
        "PO424064"
      ]
    },
    {
      "xsiType": "MandatSimple_Type",
      "uid": "PM424264",
      "acteurRef": "PA267200",
      "legislature": "13",
      "typeOrgane": "GE",
      "dateDebut": "2010-06-08T02:00:00.000+02:00",
      "dateFin": "2012-06-19T02:00:00.000+02:00",
      "preseance": "20",
      "nominPrincipale": "1",
      "infosQualite": {
        "codeQualite": "Membre",
        "libQualite": "Membre",
        "libQualiteSex": "Membre"
      },
      "organesRefs": [
        "PO422919"
      ]
    },
    {
      "xsiType": "MandatSimple_Type",
      "uid": "PM424613",
      "acteurRef": "PA267200",
      "legislature": "13",
      "typeOrgane": "CNPE",
      "dateDebut": "2010-07-06T02:00:00.000+02:00",
      "datePublication": "2010-07-07T02:00:00.000+02:00",
      "dateFin": "2010-12-15T01:00:00.000+01:00",
      "preseance": "20",
      "nominPrincipale": "1",
      "infosQualite": {
        "codeQualite": "Membre",
        "libQualite": "Membre",
        "libQualiteSex": "Membre"
      },
      "organesRefs": [
        "PO424590"
      ]
    },
    {
      "xsiType": "MandatSimple_Type",
      "uid": "PM425160",
      "acteurRef": "PA267200",
      "legislature": "13",
      "typeOrgane": "COMPER",
      "dateDebut": "2010-10-05T02:00:00.000+02:00",
      "datePublication": "2010-10-06T02:00:00.000+02:00",
      "dateFin": "2010-11-09T01:00:00.000+01:00",
      "preseance": "8",
      "nominPrincipale": "1",
      "infosQualite": {
        "codeQualite": "Vice-Président",
        "libQualite": "Vice-président",
        "libQualiteSex": "Vice-président"
      },
      "organesRefs": [
        "PO59051"
      ]
    },
    {
      "xsiType": "MandatSimple_Type",
      "uid": "PM425607",
      "acteurRef": "PA267200",
      "legislature": "13",
      "typeOrgane": "COMPER",
      "dateDebut": "2010-11-10T01:00:00.000+01:00",
      "datePublication": "2010-11-10T01:00:00.000+01:00",
      "dateFin": "2010-12-01T01:00:00.000+01:00",
      "preseance": "32",
      "nominPrincipale": "1",
      "infosQualite": {
        "codeQualite": "Membre",
        "libQualite": "Membre",
        "libQualiteSex": "Membre"
      },
      "organesRefs": [
        "PO419610"
      ]
    },
    {
      "xsiType": "MandatSimple_Type",
      "uid": "PM425969",
      "acteurRef": "PA267200",
      "legislature": "13",
      "typeOrgane": "COMPER",
      "dateDebut": "2010-12-02T01:00:00.000+01:00",
      "datePublication": "2010-12-02T01:00:00.000+01:00",
      "dateFin": "2012-06-19T02:00:00.000+02:00",
      "preseance": "32",
      "nominPrincipale": "0",
      "infosQualite": {
        "codeQualite": "Membre",
        "libQualite": "Membre",
        "libQualiteSex": "Membre"
      },
      "organesRefs": [
        "PO59051"
      ]
    },
    {
      "xsiType": "MandatSimple_Type",
      "uid": "PM426135",
      "acteurRef": "PA267200",
      "legislature": "13",
      "typeOrgane": "COMPER",
      "dateDebut": "2010-10-05T02:00:00.000+02:00",
      "datePublication": "2010-10-06T02:00:00.000+02:00",
      "dateFin": "2012-06-19T02:00:00.000+02:00",
      "preseance": "8",
      "nominPrincipale": "1",
      "infosQualite": {
        "codeQualite": "Vice-Président",
        "libQualite": "Vice-président",
        "libQualiteSex": "Vice-président"
      },
      "organesRefs": [
        "PO59051"
      ]
    },
    {
      "xsiType": "MandatSimple_Type",
      "uid": "PM426698",
      "acteurRef": "PA267200",
      "legislature": "13",
      "typeOrgane": "CMP",
      "dateDebut": "2011-01-24T01:00:00.000+01:00",
      "datePublication": "2011-11-25T01:00:00.000+01:00",
      "dateFin": "2011-02-10T01:00:00.000+01:00",
      "preseance": "28",
      "nominPrincipale": "1",
      "infosQualite": {
        "codeQualite": "Suppléant",
        "libQualite": "Membre suppléant",
        "libQualiteSex": "Membre suppléant"
      },
      "organesRefs": [
        "PO426576"
      ]
    },
    {
      "xsiType": "MandatSimple_Type",
      "uid": "PM427610",
      "acteurRef": "PA267200",
      "legislature": "13",
      "typeOrgane": "CMP",
      "dateDebut": "2011-03-08T01:00:00.000+01:00",
      "datePublication": "2011-03-09T01:00:00.000+01:00",
      "dateFin": "2011-03-16T01:00:00.000+01:00",
      "preseance": "20",
      "nominPrincipale": "1",
      "infosQualite": {
        "codeQualite": "Titulaire",
        "libQualite": "Membre titulaire",
        "libQualiteSex": "Membre titulaire"
      },
      "organesRefs": [
        "PO427600"
      ]
    },
    {
      "xsiType": "MandatSimple_Type",
      "uid": "PM427644",
      "acteurRef": "PA267200",
      "legislature": "13",
      "typeOrgane": "CMP",
      "dateDebut": "2011-03-08T01:00:00.000+01:00",
      "datePublication": "2011-03-09T01:00:00.000+01:00",
      "dateFin": "2011-03-16T01:00:00.000+01:00",
      "preseance": "20",
      "nominPrincipale": "1",
      "infosQualite": {
        "codeQualite": "Titulaire",
        "libQualite": "Membre titulaire",
        "libQualiteSex": "Membre titulaire"
      },
      "organesRefs": [
        "PO427594"
      ]
    },
    {
      "xsiType": "MandatSimple_Type",
      "uid": "PM428898",
      "acteurRef": "PA267200",
      "legislature": "13",
      "typeOrgane": "CNPE",
      "dateDebut": "2011-06-15T02:00:00.000+02:00",
      "datePublication": "2011-06-16T02:00:00.000+02:00",
      "dateFin": "2011-12-06T01:00:00.000+01:00",
      "preseance": "20",
      "nominPrincipale": "1",
      "infosQualite": {
        "codeQualite": "Membre",
        "libQualite": "Membre",
        "libQualiteSex": "Membre"
      },
      "organesRefs": [
        "PO428765"
      ]
    },
    {
      "xsiType": "MandatSimple_Type",
      "uid": "PM429126",
      "acteurRef": "PA267200",
      "legislature": "13",
      "typeOrgane": "CMP",
      "dateDebut": "2011-06-28T02:00:00.000+02:00",
      "datePublication": "2011-06-29T02:00:00.000+02:00",
      "dateFin": "2011-06-29T02:00:00.000+02:00",
      "preseance": "20",
      "nominPrincipale": "1",
      "infosQualite": {
        "codeQualite": "Titulaire",
        "libQualite": "Membre titulaire",
        "libQualiteSex": "Membre titulaire"
      },
      "organesRefs": [
        "PO429117"
      ]
    },
    {
      "xsiType": "MandatSimple_Type",
      "uid": "PM429156",
      "acteurRef": "PA267200",
      "legislature": "13",
      "typeOrgane": "CMP",
      "dateDebut": "2011-06-29T02:00:00.000+02:00",
      "datePublication": "2011-06-30T02:00:00.000+02:00",
      "dateFin": "2011-06-29T02:00:00.000+02:00",
      "preseance": "16",
      "nominPrincipale": "1",
      "infosQualite": {
        "codeQualite": "Rapporteur",
        "libQualite": "Rapporteur",
        "libQualiteSex": "Rapporteur"
      },
      "organesRefs": [
        "PO429117"
      ]
    },
    {
      "xsiType": "MandatSimple_Type",
      "uid": "PM430593",
      "acteurRef": "PA267200",
      "legislature": "13",
      "typeOrgane": "ORGEXTPARL",
      "dateDebut": "2011-09-28T02:00:00.000+02:00",
      "datePublication": "2011-09-30T02:00:00.000+02:00",
      "dateFin": "2012-06-19T02:00:00.000+02:00",
      "preseance": "20",
      "nominPrincipale": "1",
      "infosQualite": {
        "codeQualite": "Titulaire",
        "libQualite": "Membre titulaire",
        "libQualiteSex": "Membre titulaire"
      },
      "organesRefs": [
        "PO226838"
      ]
    },
    {
      "xsiType": "MandatParlementaire_type",
      "uid": "PM645502",
      "acteurRef": "PA267200",
      "legislature": "14",
      "typeOrgane": "ASSEMBLEE",
      "dateDebut": "2012-06-20T02:00:00.000+02:00",
      "dateFin": "2017-06-20T02:00:00.000+02:00",
      "preseance": "50",
      "nominPrincipale": "1",
      "infosQualite": {
        "codeQualite": "membre",
        "libQualite": "membre",
        "libQualiteSex": "membre"
      },
      "organesRefs": [
        "PO644420"
      ],
      "suppleant": {
        "dateDebut": "2012-06-20T02:00:00.000+02:00",
        "dateFin": "2017-06-20T02:00:00.000+02:00",
        "suppleantRef": "PA643162"
      },
      "election": {
        "lieu": {
          "region": "Hauts-de-France",
          "regionType": "Métropolitain",
          "departement": "Nord",
          "numDepartement": "59",
          "numCirco": "5"
        },
        "causeMandat": "élections générales",
        "refCirconscription": "PO644701"
      },
      "mandature": {
        "datePriseFonction": "2012-06-20T02:00:00.000+02:00",
        "causeFin": "Fin de législature",
        "premiereElection": "1",
        "placeHemicycle": "043"
      }
    },
    {
      "xsiType": "MandatSimple_Type",
      "uid": "PM656414",
      "acteurRef": "PA267200",
      "legislature": "14",
      "typeOrgane": "GP",
      "dateDebut": "2012-06-26T02:00:00.000+02:00",
      "datePublication": "2012-06-27T02:00:00.000+02:00",
      "dateFin": "2015-06-01T02:00:00.000+02:00",
      "preseance": "20",
      "nominPrincipale": "1",
      "infosQualite": {
        "codeQualite": "Membre",
        "libQualite": "Membre du",
        "libQualiteSex": "Membre du"
      },
      "organesRefs": [
        "PO656006"
      ]
    },
    {
      "xsiType": "MandatSimple_Type",
      "uid": "PM657109",
      "acteurRef": "PA267200",
      "legislature": "14",
      "typeOrgane": "COMPER",
      "dateDebut": "2012-06-28T02:00:00.000+02:00",
      "datePublication": "2012-06-28T02:00:00.000+02:00",
      "dateFin": "2017-06-20T02:00:00.000+02:00",
      "preseance": "32",
      "nominPrincipale": "1",
      "infosQualite": {
        "codeQualite": "Membre",
        "libQualite": "Membre",
        "libQualiteSex": "Membre"
      },
      "organesRefs": [
        "PO59051"
      ]
    },
    {
      "xsiType": "MandatSimple_Type",
      "uid": "PM659016",
      "acteurRef": "PA267200",
      "legislature": "14",
      "typeOrgane": "COMPER",
      "dateDebut": "2012-06-28T02:00:00.000+02:00",
      "datePublication": "2012-06-29T02:00:00.000+02:00",
      "dateFin": "2013-10-01T02:00:00.000+02:00",
      "preseance": "16",
      "nominPrincipale": "1",
      "infosQualite": {
        "codeQualite": "Secrétaire",
        "libQualite": "Secrétaire",
        "libQualiteSex": "Secrétaire"
      },
      "organesRefs": [
        "PO59051"
      ]
    },
    {
      "xsiType": "MandatSimple_Type",
      "uid": "PM678863",
      "acteurRef": "PA267200",
      "legislature": "14",
      "typeOrgane": "ORGEXTPARL",
      "dateDebut": "2012-10-03T02:00:00.000+02:00",
      "datePublication": "2012-10-04T02:00:00.000+02:00",
      "dateFin": "2015-02-24T01:00:00.000+01:00",
      "preseance": "20",
      "nominPrincipale": "1",
      "infosQualite": {
        "codeQualite": "Titulaire",
        "libQualite": "Membre titulaire",
        "libQualiteSex": "Membre titulaire"
      },
      "organesRefs": [
        "PO60185"
      ]
    },
    {
      "xsiType": "MandatSimple_Type",
      "uid": "PM685512",
      "acteurRef": "PA267200",
      "typeOrgane": "PARPOL",
      "dateDebut": "2012-12-01T01:00:00.000+01:00",
      "dateFin": "2015-11-30T01:00:00.000+01:00",
      "preseance": "5",
      "nominPrincipale": "1",
      "infosQualite": {
        "codeQualite": "Membre",
        "libQualite": "Membre",
        "libQualiteSex": "Membre"
      },
      "organesRefs": [
        "PO684942"
      ]
    },
    {
      "xsiType": "MandatSimple_Type",
      "uid": "PM686669",
      "acteurRef": "PA267200",
      "legislature": "14",
      "typeOrgane": "CMP",
      "dateDebut": "2012-12-12T01:00:00.000+01:00",
      "datePublication": "2012-12-13T01:00:00.000+01:00",
      "dateFin": "2012-12-19T01:00:00.000+01:00",
      "preseance": "20",
      "nominPrincipale": "1",
      "infosQualite": {
        "codeQualite": "Titulaire",
        "libQualite": "Membre titulaire",
        "libQualiteSex": "Membre titulaire"
      },
      "organesRefs": [
        "PO686534"
      ]
    },
    {
      "xsiType": "MandatSimple_Type",
      "uid": "PM687877",
      "acteurRef": "PA267200",
      "legislature": "14",
      "typeOrgane": "GE",
      "dateDebut": "2013-01-15T01:00:00.000+01:00",
      "dateFin": "2017-06-20T02:00:00.000+02:00",
      "preseance": "20",
      "nominPrincipale": "1",
      "infosQualite": {
        "codeQualite": "Membre",
        "libQualite": "Membre",
        "libQualiteSex": "Membre"
      },
      "organesRefs": [
        "PO686415"
      ]
    },
    {
      "xsiType": "MandatSimple_Type",
      "uid": "PM688636",
      "acteurRef": "PA267200",
      "legislature": "14",
      "typeOrgane": "GE",
      "dateDebut": "2013-01-24T01:00:00.000+01:00",
      "dateFin": "2017-06-20T02:00:00.000+02:00",
      "preseance": "8",
      "nominPrincipale": "1",
      "infosQualite": {
        "codeQualite": "Vice-Président",
        "libQualite": "Vice-Président",
        "libQualiteSex": "Vice-Président"
      },
      "organesRefs": [
        "PO686232"
      ]
    },
    {
      "xsiType": "MandatSimple_Type",
      "uid": "PM689974",
      "acteurRef": "PA267200",
      "legislature": "14",
      "typeOrgane": "GE",
      "dateDebut": "2013-01-23T01:00:00.000+01:00",
      "dateFin": "2017-06-20T02:00:00.000+02:00",
      "preseance": "20",
      "nominPrincipale": "1",
      "infosQualite": {
        "codeQualite": "Membre",
        "libQualite": "Membre",
        "libQualiteSex": "Membre"
      },
      "organesRefs": [
        "PO687403"
      ]
    },
    {
      "xsiType": "MandatSimple_Type",
      "uid": "PM690972",
      "acteurRef": "PA267200",
      "legislature": "14",
      "typeOrgane": "GE",
      "dateDebut": "2013-02-08T01:00:00.000+01:00",
      "dateFin": "2017-06-20T02:00:00.000+02:00",
      "preseance": "20",
      "nominPrincipale": "1",
      "infosQualite": {
        "codeQualite": "Membre",
        "libQualite": "Membre",
        "libQualiteSex": "Membre"
      },
      "organesRefs": [
        "PO687087"
      ]
    },
    {
      "xsiType": "MandatSimple_Type",
      "uid": "PM691080",
      "acteurRef": "PA267200",
      "legislature": "14",
      "typeOrgane": "GE",
      "dateDebut": "2013-02-11T01:00:00.000+01:00",
      "dateFin": "2017-06-20T02:00:00.000+02:00",
      "preseance": "20",
      "nominPrincipale": "1",
      "infosQualite": {
        "codeQualite": "Membre",
        "libQualite": "Membre",
        "libQualiteSex": "Membre"
      },
      "organesRefs": [
        "PO687370"
      ]
    },
    {
      "xsiType": "MandatSimple_Type",
      "uid": "PM691112",
      "acteurRef": "PA267200",
      "legislature": "14",
      "typeOrgane": "GE",
      "dateDebut": "2013-01-12T01:00:00.000+01:00",
      "dateFin": "2017-06-20T02:00:00.000+02:00",
      "preseance": "20",
      "nominPrincipale": "1",
      "infosQualite": {
        "codeQualite": "Membre",
        "libQualite": "Membre",
        "libQualiteSex": "Membre"
      },
      "organesRefs": [
        "PO687613"
      ]
    },
    {
      "xsiType": "MandatSimple_Type",
      "uid": "PM691990",
      "acteurRef": "PA267200",
      "legislature": "14",
      "typeOrgane": "GE",
      "dateDebut": "2013-01-24T01:00:00.000+01:00",
      "dateFin": "2017-06-20T02:00:00.000+02:00",
      "preseance": "20",
      "nominPrincipale": "1",
      "infosQualite": {
        "codeQualite": "Membre",
        "libQualite": "Membre",
        "libQualiteSex": "Membre"
      },
      "organesRefs": [
        "PO686844"
      ]
    },
    {
      "xsiType": "MandatSimple_Type",
      "uid": "PM692217",
      "acteurRef": "PA267200",
      "legislature": "14",
      "typeOrgane": "GE",
      "dateDebut": "2013-02-27T01:00:00.000+01:00",
      "dateFin": "2017-06-20T02:00:00.000+02:00",
      "preseance": "20",
      "nominPrincipale": "1",
      "infosQualite": {
        "codeQualite": "Membre",
        "libQualite": "Membre",
        "libQualiteSex": "Membre"
      },
      "organesRefs": [
        "PO686810"
      ]
    },
    {
      "xsiType": "MandatSimple_Type",
      "uid": "PM692553",
      "acteurRef": "PA267200",
      "legislature": "14",
      "typeOrgane": "GE",
      "dateDebut": "2013-02-19T01:00:00.000+01:00",
      "dateFin": "2017-06-20T02:00:00.000+02:00",
      "preseance": "20",
      "nominPrincipale": "1",
      "infosQualite": {
        "codeQualite": "Membre",
        "libQualite": "Membre",
        "libQualiteSex": "Membre"
      },
      "organesRefs": [
        "PO686767"
      ]
    },
    {
      "xsiType": "MandatSimple_Type",
      "uid": "PM693759",
      "acteurRef": "PA267200",
      "legislature": "14",
      "typeOrgane": "GE",
      "dateDebut": "2013-04-16T02:00:00.000+02:00",
      "dateFin": "2017-06-20T02:00:00.000+02:00",
      "preseance": "20",
      "nominPrincipale": "1",
      "infosQualite": {
        "codeQualite": "Membre",
        "libQualite": "Membre",
        "libQualiteSex": "Membre"
      },
      "organesRefs": [
        "PO689000"
      ]
    },
    {
      "xsiType": "MandatSimple_Type",
      "uid": "PM694931",
      "acteurRef": "PA267200",
      "legislature": "14",
      "typeOrgane": "GE",
      "dateDebut": "2013-04-12T02:00:00.000+02:00",
      "dateFin": "2017-06-20T02:00:00.000+02:00",
      "preseance": "20",
      "nominPrincipale": "1",
      "infosQualite": {
        "codeQualite": "Membre",
        "libQualite": "Membre",
        "libQualiteSex": "Membre"
      },
      "organesRefs": [
        "PO692283"
      ]
    },
    {
      "xsiType": "MandatSimple_Type",
      "uid": "PM695822",
      "acteurRef": "PA267200",
      "legislature": "14",
      "typeOrgane": "GE",
      "dateDebut": "2013-07-05T02:00:00.000+02:00",
      "dateFin": "2017-06-20T02:00:00.000+02:00",
      "preseance": "20",
      "nominPrincipale": "1",
      "infosQualite": {
        "codeQualite": "Membre",
        "libQualite": "Membre",
        "libQualiteSex": "Membre"
      },
      "organesRefs": [
        "PO694566"
      ]
    },
    {
      "xsiType": "MandatSimple_Type",
      "uid": "PM697043",
      "acteurRef": "PA267200",
      "legislature": "14",
      "typeOrgane": "GE",
      "dateDebut": "2013-09-19T02:00:00.000+02:00",
      "dateFin": "2017-06-20T02:00:00.000+02:00",
      "preseance": "20",
      "nominPrincipale": "1",
      "infosQualite": {
        "codeQualite": "Membre",
        "libQualite": "Membre",
        "libQualiteSex": "Membre"
      },
      "organesRefs": [
        "PO695581"
      ]
    },
    {
      "xsiType": "MandatSimple_Type",
      "uid": "PM702747",
      "acteurRef": "PA267200",
      "legislature": "14",
      "typeOrgane": "GE",
      "dateDebut": "2014-06-25T02:00:00.000+02:00",
      "dateFin": "2017-06-20T02:00:00.000+02:00",
      "preseance": "20",
      "nominPrincipale": "1",
      "infosQualite": {
        "codeQualite": "Membre",
        "libQualite": "Membre",
        "libQualiteSex": "Membre"
      },
      "organesRefs": [
        "PO702209"
      ]
    },
    {
      "xsiType": "MandatMission_Type",
      "uid": "PM703450",
      "acteurRef": "PA267200",
      "legislature": "14",
      "typeOrgane": "MISINFO",
      "dateDebut": "2014-10-01T02:00:00.000+02:00",
      "dateFin": "2014-12-17T01:00:00.000+01:00",
      "preseance": "10",
      "nominPrincipale": "1",
      "infosQualite": {
        "codeQualite": "Membre",
        "libQualite": "Membre",
        "libQualiteSex": "Membre"
      },
      "organesRefs": [
        "PO703211"
      ]
    },
    {
      "xsiType": "MandatSimple_Type",
      "uid": "PM705370",
      "acteurRef": "PA267200",
      "legislature": "14",
      "typeOrgane": "CNPS",
      "dateDebut": "2014-12-13T01:00:00.000+01:00",
      "datePublication": "2014-12-13T01:00:00.000+01:00",
      "dateFin": "2015-08-07T02:00:00.000+02:00",
      "preseance": "20",
      "nominPrincipale": "1",
      "infosQualite": {
        "codeQualite": "Membre",
        "libQualite": "Membre",
        "libQualiteSex": "Membre"
      },
      "organesRefs": [
        "PO704848"
      ]
    },
    {
      "xsiType": "MandatSimple_Type",
      "uid": "PM706633",
      "acteurRef": "PA267200",
      "legislature": "14",
      "typeOrgane": "GE",
      "dateDebut": "2015-03-24T01:00:00.000+01:00",
      "dateFin": "2017-06-20T02:00:00.000+02:00",
      "preseance": "20",
      "nominPrincipale": "1",
      "infosQualite": {
        "codeQualite": "Membre",
        "libQualite": "Membre",
        "libQualiteSex": "Membre"
      },
      "organesRefs": [
        "PO694572"
      ]
    },
    {
      "xsiType": "MandatSimple_Type",
      "uid": "PM708204",
      "acteurRef": "PA267200",
      "legislature": "14",
      "typeOrgane": "GP",
      "dateDebut": "2015-06-02T02:00:00.000+02:00",
      "datePublication": "2015-06-02T02:00:00.000+02:00",
      "dateFin": "2017-06-20T02:00:00.000+02:00",
      "preseance": "20",
      "nominPrincipale": "1",
      "infosQualite": {
        "codeQualite": "Membre",
        "libQualite": "Membre du",
        "libQualiteSex": "Membre du"
      },
      "organesRefs": [
        "PO707869"
      ]
    },
    {
      "xsiType": "MandatMission_Type",
      "uid": "PM709700",
      "acteurRef": "PA267200",
      "legislature": "14",
      "typeOrgane": "MISINFOCOM",
      "dateDebut": "2015-10-15T02:00:00.000+02:00",
      "datePublication": "2015-10-15T02:00:00.000+02:00",
      "dateFin": "2017-02-20T01:00:00.000+01:00",
      "preseance": "20",
      "nominPrincipale": "1",
      "infosQualite": {
        "codeQualite": "Membre",
        "libQualite": "Membre",
        "libQualiteSex": "Membre"
      },
      "organesRefs": [
        "PO709614"
      ]
    },
    {
      "xsiType": "MandatSimple_Type",
      "uid": "PM710499",
      "acteurRef": "PA267200",
      "typeOrgane": "PARPOL",
      "dateDebut": "2015-12-01T01:00:00.000+01:00",
      "dateFin": "2017-06-20T02:00:00.000+02:00",
      "preseance": "5",
      "nominPrincipale": "1",
      "infosQualite": {
        "codeQualite": "Membre",
        "libQualite": "Membre",
        "libQualiteSex": "Membre"
      },
      "organesRefs": [
        "PO710396"
      ]
    },
    {
      "xsiType": "MandatSimple_Type",
      "uid": "PM714115",
      "acteurRef": "PA267200",
      "legislature": "14",
      "typeOrgane": "GE",
      "dateDebut": "2016-07-06T02:00:00.000+02:00",
      "dateFin": "2017-06-20T02:00:00.000+02:00",
      "preseance": "20",
      "nominPrincipale": "1",
      "infosQualite": {
        "codeQualite": "Membre",
        "libQualite": "Membre",
        "libQualiteSex": "Membre"
      },
      "organesRefs": [
        "PO712091"
      ]
    },
    {
      "xsiType": "MandatParlementaire_type",
      "uid": "PM722974",
      "acteurRef": "PA267200",
      "legislature": "15",
      "typeOrgane": "ASSEMBLEE",
      "dateDebut": "2017-06-18T02:00:00.000+02:00",
      "preseance": "50",
      "nominPrincipale": "1",
      "infosQualite": {
        "codeQualite": "membre",
        "libQualite": "membre",
        "libQualiteSex": "membre"
      },
      "organesRefs": [
        "PO717460"
      ],
      "suppleant": {
        "dateDebut": "2017-06-18T02:00:00.000+02:00",
        "suppleantRef": "PA720476"
      },
      "election": {
        "lieu": {
          "region": "Hauts-de-France",
          "regionType": "Métropolitain",
          "departement": "Nord",
          "numDepartement": "59",
          "numCirco": "5"
        },
        "causeMandat": "élections générales",
        "refCirconscription": "PO717982"
      },
      "mandature": {
        "datePriseFonction": "2017-06-21T02:00:00.000+02:00",
        "premiereElection": "1",
        "placeHemicycle": "043"
      },
      "collaborateurs": [
        {
          "qualite": "Mme",
          "prenom": "Véronique",
          "nom": "Van Tichelen-Lestoquoi"
        },
        {
          "qualite": "M.",
          "prenom": "Clément",
          "nom": "Delplanque"
        },
        {
          "qualite": "M.",
          "prenom": "Bastien",
          "nom": "Dauphin"
        },
        {
          "qualite": "Mme",
          "prenom": "Emeline",
          "nom": "Clair"
        }
      ]
    },
    {
      "xsiType": "MandatSimple_Type",
      "uid": "PM724528",
      "acteurRef": "PA267200",
      "legislature": "15",
      "typeOrgane": "GP",
      "dateDebut": "2017-06-21T02:00:00.000+02:00",
      "dateFin": "2017-06-26T02:00:00.000+02:00",
      "preseance": "28",
      "nominPrincipale": "1",
      "infosQualite": {
        "codeQualite": "Député non-inscrit",
        "libQualite": "Député non-inscrit",
        "libQualiteSex": "Député non-inscrit"
      },
      "organesRefs": [
        "PO723569"
      ]
    },
    {
      "xsiType": "MandatSimple_Type",
      "uid": "PM731354",
      "acteurRef": "PA267200",
      "legislature": "15",
      "typeOrgane": "GP",
      "dateDebut": "2017-06-27T02:00:00.000+02:00",
      "datePublication": "2017-06-28T02:00:00.000+02:00",
      "preseance": "20",
      "nominPrincipale": "1",
      "infosQualite": {
        "codeQualite": "Membre",
        "libQualite": "Membre du",
        "libQualiteSex": "Membre du"
      },
      "organesRefs": [
        "PO730934"
      ]
    },
    {
      "xsiType": "MandatSimple_Type",
      "uid": "PM731867",
      "acteurRef": "PA267200",
      "legislature": "15",
      "typeOrgane": "COMPER",
      "dateDebut": "2017-06-29T02:00:00.000+02:00",
      "datePublication": "2017-06-29T02:00:00.000+02:00",
      "preseance": "32",
      "nominPrincipale": "1",
      "infosQualite": {
        "codeQualite": "Membre",
        "libQualite": "Membre",
        "libQualiteSex": "Membre"
      },
      "organesRefs": [
        "PO59051"
      ]
    },
    {
      "xsiType": "MandatMission_Type",
      "uid": "PM734794",
      "acteurRef": "PA267200",
      "legislature": "15",
      "typeOrgane": "MISINFO",
      "dateDebut": "2017-09-13T02:00:00.000+02:00",
      "dateFin": "2018-01-31T01:00:00.000+01:00",
      "preseance": "10",
      "nominPrincipale": "1",
      "infosQualite": {
        "codeQualite": "Membre",
        "libQualite": "Membre",
        "libQualiteSex": "Membre"
      },
      "organesRefs": [
        "PO734758"
      ]
    },
    {
      "xsiType": "MandatSimple_Type",
      "uid": "PM738920",
      "acteurRef": "PA267200",
      "legislature": "15",
      "typeOrgane": "GEVI",
      "dateDebut": "2017-10-10T02:00:00.000+02:00",
      "preseance": "20",
      "nominPrincipale": "1",
      "infosQualite": {
        "codeQualite": "Membre",
        "libQualite": "Membre",
        "libQualiteSex": "Membre"
      },
      "organesRefs": [
        "PO733217"
      ]
    },
    {
      "xsiType": "MandatSimple_Type",
      "uid": "PM738921",
      "acteurRef": "PA267200",
      "legislature": "15",
      "typeOrgane": "GA",
      "dateDebut": "2017-10-10T02:00:00.000+02:00",
      "preseance": "20",
      "nominPrincipale": "1",
      "infosQualite": {
        "codeQualite": "Membre",
        "libQualite": "Membre",
        "libQualiteSex": "Membre"
      },
      "organesRefs": [
        "PO733057"
      ]
    },
    {
      "xsiType": "MandatSimple_Type",
      "uid": "PM738922",
      "acteurRef": "PA267200",
      "legislature": "15",
      "typeOrgane": "GA",
      "dateDebut": "2017-10-10T02:00:00.000+02:00",
      "preseance": "20",
      "nominPrincipale": "1",
      "infosQualite": {
        "codeQualite": "Membre",
        "libQualite": "Membre",
        "libQualiteSex": "Membre"
      },
      "organesRefs": [
        "PO733072"
      ]
    },
    {
      "xsiType": "MandatSimple_Type",
      "uid": "PM738923",
      "acteurRef": "PA267200",
      "legislature": "15",
      "typeOrgane": "GA",
      "dateDebut": "2017-10-10T02:00:00.000+02:00",
      "preseance": "20",
      "nominPrincipale": "1",
      "infosQualite": {
        "codeQualite": "Membre",
        "libQualite": "Membre",
        "libQualiteSex": "Membre"
      },
      "organesRefs": [
        "PO733117"
      ]
    },
    {
      "xsiType": "MandatSimple_Type",
      "uid": "PM738924",
      "acteurRef": "PA267200",
      "legislature": "15",
      "typeOrgane": "GA",
      "dateDebut": "2017-10-10T02:00:00.000+02:00",
      "preseance": "20",
      "nominPrincipale": "1",
      "infosQualite": {
        "codeQualite": "Membre",
        "libQualite": "Membre",
        "libQualiteSex": "Membre"
      },
      "organesRefs": [
        "PO733307"
      ]
    },
    {
      "xsiType": "MandatSimple_Type",
      "uid": "PM738925",
      "acteurRef": "PA267200",
      "legislature": "15",
      "typeOrgane": "GA",
      "dateDebut": "2017-10-10T02:00:00.000+02:00",
      "preseance": "20",
      "nominPrincipale": "1",
      "infosQualite": {
        "codeQualite": "Membre",
        "libQualite": "Membre",
        "libQualiteSex": "Membre"
      },
      "organesRefs": [
        "PO733322"
      ]
    },
    {
      "xsiType": "MandatSimple_Type",
      "uid": "PM738926",
      "acteurRef": "PA267200",
      "legislature": "15",
      "typeOrgane": "GA",
      "dateDebut": "2017-10-10T02:00:00.000+02:00",
      "preseance": "20",
      "nominPrincipale": "1",
      "infosQualite": {
        "codeQualite": "Membre",
        "libQualite": "Membre",
        "libQualiteSex": "Membre"
      },
      "organesRefs": [
        "PO733342"
      ]
    },
    {
      "xsiType": "MandatSimple_Type",
      "uid": "PM738927",
      "acteurRef": "PA267200",
      "legislature": "15",
      "typeOrgane": "GA",
      "dateDebut": "2017-10-10T02:00:00.000+02:00",
      "preseance": "20",
      "nominPrincipale": "1",
      "infosQualite": {
        "codeQualite": "Membre",
        "libQualite": "Membre",
        "libQualiteSex": "Membre"
      },
      "organesRefs": [
        "PO733357"
      ]
    },
    {
      "xsiType": "MandatSimple_Type",
      "uid": "PM738928",
      "acteurRef": "PA267200",
      "legislature": "15",
      "typeOrgane": "GA",
      "dateDebut": "2017-10-10T02:00:00.000+02:00",
      "preseance": "20",
      "nominPrincipale": "1",
      "infosQualite": {
        "codeQualite": "Membre",
        "libQualite": "Membre",
        "libQualiteSex": "Membre"
      },
      "organesRefs": [
        "PO733372"
      ]
    },
    {
      "xsiType": "MandatSimple_Type",
      "uid": "PM738929",
      "acteurRef": "PA267200",
      "legislature": "15",
      "typeOrgane": "GA",
      "dateDebut": "2017-10-10T02:00:00.000+02:00",
      "preseance": "20",
      "nominPrincipale": "1",
      "infosQualite": {
        "codeQualite": "Membre",
        "libQualite": "Membre",
        "libQualiteSex": "Membre"
      },
      "organesRefs": [
        "PO733397"
      ]
    },
    {
      "xsiType": "MandatSimple_Type",
      "uid": "PM738930",
      "acteurRef": "PA267200",
      "legislature": "15",
      "typeOrgane": "GA",
      "dateDebut": "2017-10-10T02:00:00.000+02:00",
      "preseance": "20",
      "nominPrincipale": "1",
      "infosQualite": {
        "codeQualite": "Membre",
        "libQualite": "Membre",
        "libQualiteSex": "Membre"
      },
      "organesRefs": [
        "PO733412"
      ]
    },
    {
      "xsiType": "MandatSimple_Type",
      "uid": "PM738931",
      "acteurRef": "PA267200",
      "legislature": "15",
      "typeOrgane": "GA",
      "dateDebut": "2017-10-10T02:00:00.000+02:00",
      "preseance": "20",
      "nominPrincipale": "1",
      "infosQualite": {
        "codeQualite": "Membre",
        "libQualite": "Membre",
        "libQualiteSex": "Membre"
      },
      "organesRefs": [
        "PO733437"
      ]
    },
    {
      "xsiType": "MandatSimple_Type",
      "uid": "PM738932",
      "acteurRef": "PA267200",
      "legislature": "15",
      "typeOrgane": "GA",
      "dateDebut": "2017-10-10T02:00:00.000+02:00",
      "preseance": "20",
      "nominPrincipale": "1",
      "infosQualite": {
        "codeQualite": "Membre",
        "libQualite": "Membre",
        "libQualiteSex": "Membre"
      },
      "organesRefs": [
        "PO733567"
      ]
    },
    {
      "xsiType": "MandatSimple_Type",
      "uid": "PM738933",
      "acteurRef": "PA267200",
      "legislature": "15",
      "typeOrgane": "GA",
      "dateDebut": "2017-10-10T02:00:00.000+02:00",
      "preseance": "20",
      "nominPrincipale": "1",
      "infosQualite": {
        "codeQualite": "Membre",
        "libQualite": "Membre",
        "libQualiteSex": "Membre"
      },
      "organesRefs": [
        "PO733572"
      ]
    },
    {
      "xsiType": "MandatSimple_Type",
      "uid": "PM738934",
      "acteurRef": "PA267200",
      "legislature": "15",
      "typeOrgane": "GA",
      "dateDebut": "2017-10-10T02:00:00.000+02:00",
      "preseance": "20",
      "nominPrincipale": "1",
      "infosQualite": {
        "codeQualite": "Membre",
        "libQualite": "Membre",
        "libQualiteSex": "Membre"
      },
      "organesRefs": [
        "PO733577"
      ]
    },
    {
      "xsiType": "MandatSimple_Type",
      "uid": "PM738935",
      "acteurRef": "PA267200",
      "legislature": "15",
      "typeOrgane": "GA",
      "dateDebut": "2017-10-10T02:00:00.000+02:00",
      "preseance": "20",
      "nominPrincipale": "1",
      "infosQualite": {
        "codeQualite": "Membre",
        "libQualite": "Membre",
        "libQualiteSex": "Membre"
      },
      "organesRefs": [
        "PO733607"
      ]
    },
    {
      "xsiType": "MandatSimple_Type",
      "uid": "PM738936",
      "acteurRef": "PA267200",
      "legislature": "15",
      "typeOrgane": "GA",
      "dateDebut": "2017-10-10T02:00:00.000+02:00",
      "preseance": "20",
      "nominPrincipale": "1",
      "infosQualite": {
        "codeQualite": "Membre",
        "libQualite": "Membre",
        "libQualiteSex": "Membre"
      },
      "organesRefs": [
        "PO733617"
      ]
    },
    {
      "xsiType": "MandatSimple_Type",
      "uid": "PM738937",
      "acteurRef": "PA267200",
      "legislature": "15",
      "typeOrgane": "GA",
      "dateDebut": "2017-10-10T02:00:00.000+02:00",
      "preseance": "20",
      "nominPrincipale": "1",
      "infosQualite": {
        "codeQualite": "Membre",
        "libQualite": "Membre",
        "libQualiteSex": "Membre"
      },
      "organesRefs": [
        "PO733632"
      ]
    },
    {
      "xsiType": "MandatSimple_Type",
      "uid": "PM738938",
      "acteurRef": "PA267200",
      "legislature": "15",
      "typeOrgane": "GA",
      "dateDebut": "2017-10-10T02:00:00.000+02:00",
      "preseance": "20",
      "nominPrincipale": "1",
      "infosQualite": {
        "codeQualite": "Membre",
        "libQualite": "Membre",
        "libQualiteSex": "Membre"
      },
      "organesRefs": [
        "PO733637"
      ]
    },
    {
      "xsiType": "MandatSimple_Type",
      "uid": "PM743049",
      "acteurRef": "PA267200",
      "legislature": "15",
      "typeOrgane": "ORGEXTPARL",
      "dateDebut": "2017-11-10T01:00:00.000+01:00",
      "datePublication": "2017-11-11T01:00:00.000+01:00",
      "preseance": "20",
      "nominPrincipale": "1",
      "infosQualite": {
        "codeQualite": "Titulaire",
        "libQualite": "Membre titulaire",
        "libQualiteSex": "Membre titulaire"
      },
      "organesRefs": [
        "PO430925"
      ]
    },
    {
      "xsiType": "MandatSimple_Type",
      "uid": "PM745683",
      "acteurRef": "PA267200",
      "typeOrgane": "PARPOL",
      "dateDebut": "2017-12-01T01:00:00.000+01:00",
      "preseance": "5",
      "nominPrincipale": "1",
      "infosQualite": {
        "codeQualite": "Membre",
        "libQualite": "Membre",
        "libQualiteSex": "Membre"
      },
      "organesRefs": [
        "PO710396"
      ]
    },
    {
      "xsiType": "MandatSimple_Type",
      "uid": "PM749448",
      "acteurRef": "PA267200",
      "legislature": "15",
      "typeOrgane": "GE",
      "dateDebut": "2018-02-12T01:00:00.000+01:00",
      "preseance": "20",
      "nominPrincipale": "1",
      "infosQualite": {
        "codeQualite": "Membre",
        "libQualite": "Membre",
        "libQualiteSex": "Membre"
      },
      "organesRefs": [
        "PO746894"
      ]
    },
    {
      "xsiType": "MandatMission_Type",
      "uid": "PM750177",
      "acteurRef": "PA267200",
      "legislature": "15",
      "typeOrgane": "MISINFO",
      "dateDebut": "2018-02-14T01:00:00.000+01:00",
      "preseance": "10",
      "nominPrincipale": "1",
      "infosQualite": {
        "codeQualite": "Membre",
        "libQualite": "Membre",
        "libQualiteSex": "Membre"
      },
      "organesRefs": [
        "PO750141"
      ]
    },
    {
      "xsiType": "MandatSimple_Type",
      "uid": "PM751430",
      "acteurRef": "PA267200",
      "legislature": "15",
      "typeOrgane": "GE",
      "dateDebut": "2018-02-21T01:00:00.000+01:00",
      "preseance": "20",
      "nominPrincipale": "0",
      "infosQualite": {
        "codeQualite": "Membre",
        "libQualite": "Membre",
        "libQualiteSex": "Membre"
      },
      "organesRefs": [
        "PO746644"
      ]
    },
    {
      "xsiType": "MandatSimple_Type",
      "uid": "PM752259",
      "acteurRef": "PA267200",
      "legislature": "15",
      "typeOrgane": "GE",
      "dateDebut": "2018-03-05T01:00:00.000+01:00",
      "preseance": "20",
      "nominPrincipale": "1",
      "infosQualite": {
        "codeQualite": "Membre",
        "libQualite": "Membre",
        "libQualiteSex": "Membre"
      },
      "organesRefs": [
        "PO746679"
      ]
    },
    {
      "xsiType": "MandatSimple_Type",
      "uid": "PM752275",
      "acteurRef": "PA267200",
      "legislature": "15",
      "typeOrgane": "GE",
      "dateDebut": "2018-03-05T01:00:00.000+01:00",
      "preseance": "20",
      "nominPrincipale": "0",
      "infosQualite": {
        "codeQualite": "Membre",
        "libQualite": "Membre",
        "libQualiteSex": "Membre"
      },
      "organesRefs": [
        "PO746837"
      ]
    },
    {
      "xsiType": "MandatSimple_Type",
      "uid": "PM752442",
      "acteurRef": "PA267200",
      "legislature": "15",
      "typeOrgane": "GE",
      "dateDebut": "2018-03-06T01:00:00.000+01:00",
      "preseance": "20",
      "nominPrincipale": "1",
      "infosQualite": {
        "codeQualite": "Membre",
        "libQualite": "Membre",
        "libQualiteSex": "Membre"
      },
      "organesRefs": [
        "PO746920"
      ]
    },
    {
      "xsiType": "MandatSimple_Type",
      "uid": "PM752650",
      "acteurRef": "PA267200",
      "legislature": "15",
      "typeOrgane": "GE",
      "dateDebut": "2018-03-06T01:00:00.000+01:00",
      "preseance": "20",
      "nominPrincipale": "1",
      "infosQualite": {
        "codeQualite": "Membre",
        "libQualite": "Membre",
        "libQualiteSex": "Membre"
      },
      "organesRefs": [
        "PO747220"
      ]
    },
    {
      "xsiType": "MandatSimple_Type",
      "uid": "PM752988",
      "acteurRef": "PA267200",
      "legislature": "15",
      "typeOrgane": "CMP",
      "dateDebut": "2018-03-09T01:00:00.000+01:00",
      "datePublication": "2018-03-09T01:00:00.000+01:00",
      "dateFin": "2018-04-11T02:00:00.000+02:00",
      "preseance": "20",
      "nominPrincipale": "1",
      "infosQualite": {
        "codeQualite": "Titulaire",
        "libQualite": "Membre titulaire",
        "libQualiteSex": "Membre titulaire"
      },
      "organesRefs": [
        "PO750828"
      ]
    },
    {
      "xsiType": "MandatSimple_Type",
      "uid": "PM753309",
      "acteurRef": "PA267200",
      "legislature": "15",
      "typeOrgane": "GE",
      "dateDebut": "2018-03-13T01:00:00.000+01:00",
      "preseance": "20",
      "nominPrincipale": "1",
      "infosQualite": {
        "codeQualite": "Membre",
        "libQualite": "Membre",
        "libQualiteSex": "Membre"
      },
      "organesRefs": [
        "PO747047"
      ]
    },
    {
      "xsiType": "MandatSimple_Type",
      "uid": "PM753340",
      "acteurRef": "PA267200",
      "legislature": "15",
      "typeOrgane": "GE",
      "dateDebut": "2018-03-06T01:00:00.000+01:00",
      "preseance": "8",
      "nominPrincipale": "1",
      "infosQualite": {
        "codeQualite": "Vice-Président",
        "libQualite": "Vice-Président",
        "libQualiteSex": "Vice-Président"
      },
      "organesRefs": [
        "PO746644"
      ]
    },
    {
      "xsiType": "MandatSimple_Type",
      "uid": "PM753459",
      "acteurRef": "PA267200",
      "legislature": "15",
      "typeOrgane": "GE",
      "dateDebut": "2018-03-14T01:00:00.000+01:00",
      "preseance": "20",
      "nominPrincipale": "1",
      "infosQualite": {
        "codeQualite": "Membre",
        "libQualite": "Membre",
        "libQualiteSex": "Membre"
      },
      "organesRefs": [
        "PO746987"
      ]
    },
    {
      "xsiType": "MandatSimple_Type",
      "uid": "PM754353",
      "acteurRef": "PA267200",
      "legislature": "15",
      "typeOrgane": "GE",
      "dateDebut": "2018-03-26T02:00:00.000+02:00",
      "preseance": "20",
      "nominPrincipale": "1",
      "infosQualite": {
        "codeQualite": "Membre",
        "libQualite": "Membre",
        "libQualiteSex": "Membre"
      },
      "organesRefs": [
        "PO747007"
      ]
    },
    {
      "xsiType": "MandatSimple_Type",
      "uid": "PM754523",
      "acteurRef": "PA267200",
      "legislature": "15",
      "typeOrgane": "GE",
      "dateDebut": "2018-03-29T02:00:00.000+02:00",
      "preseance": "20",
      "nominPrincipale": "1",
      "infosQualite": {
        "codeQualite": "Membre",
        "libQualite": "Membre",
        "libQualiteSex": "Membre"
      },
      "organesRefs": [
        "PO746957"
      ]
    },
    {
      "xsiType": "MandatSimple_Type",
      "uid": "PM755524",
      "acteurRef": "PA267200",
      "legislature": "15",
      "typeOrgane": "GE",
      "dateDebut": "2018-04-11T02:00:00.000+02:00",
      "preseance": "12",
      "nominPrincipale": "1",
      "infosQualite": {
        "codeQualite": "Secrétaire",
        "libQualite": "Secrétaire",
        "libQualiteSex": "Secrétaire"
      },
      "organesRefs": [
        "PO746837"
      ]
    },
    {
      "xsiType": "MandatSimple_Type",
      "uid": "PM755830",
      "acteurRef": "PA267200",
      "legislature": "15",
      "typeOrgane": "GE",
      "dateDebut": "2018-04-23T02:00:00.000+02:00",
      "preseance": "20",
      "nominPrincipale": "0",
      "infosQualite": {
        "codeQualite": "Membre",
        "libQualite": "Membre",
        "libQualiteSex": "Membre"
      },
      "organesRefs": [
        "PO746684"
      ]
    },
    {
      "xsiType": "MandatSimple_Type",
      "uid": "PM755832",
      "acteurRef": "PA267200",
      "legislature": "15",
      "typeOrgane": "GE",
      "dateDebut": "2018-04-23T02:00:00.000+02:00",
      "preseance": "12",
      "nominPrincipale": "1",
      "infosQualite": {
        "codeQualite": "Secrétaire",
        "libQualite": "Secrétaire",
        "libQualiteSex": "Secrétaire"
      },
      "organesRefs": [
        "PO746684"
      ]
    },
    {
      "xsiType": "MandatAvecSuppleant_Type",
      "uid": "PM756337",
      "acteurRef": "PA267200",
      "legislature": "15",
      "typeOrgane": "OFFPAR",
      "dateDebut": "2018-05-24T02:00:00.000+02:00",
      "datePublication": "2018-05-24T02:00:00.000+02:00",
      "preseance": "24",
      "nominPrincipale": "1",
      "infosQualite": {
        "codeQualite": "Membre",
        "libQualite": "Membre",
        "libQualiteSex": "Membre"
      },
      "organesRefs": [
        "PO756284"
      ]
    },
    {
      "xsiType": "MandatSimple_Type",
      "uid": "PM758280",
      "acteurRef": "PA267200",
      "legislature": "15",
      "typeOrgane": "CMP",
      "dateDebut": "2018-07-19T02:00:00.000+02:00",
      "datePublication": "2018-07-20T02:00:00.000+02:00",
      "dateFin": "2018-08-01T02:00:00.000+02:00",
      "preseance": "20",
      "nominPrincipale": "1",
      "infosQualite": {
        "codeQualite": "Titulaire",
        "libQualite": "Membre titulaire",
        "libQualiteSex": "Membre titulaire"
      },
      "organesRefs": [
        "PO757668"
      ]
    },
    {
      "xsiType": "MandatSimple_Type",
      "uid": "PM758799",
      "acteurRef": "PA267200",
      "legislature": "15",
      "typeOrgane": "GE",
      "dateDebut": "2018-09-06T02:00:00.000+02:00",
      "preseance": "20",
      "nominPrincipale": "1",
      "infosQualite": {
        "codeQualite": "Membre",
        "libQualite": "Membre",
        "libQualiteSex": "Membre"
      },
      "organesRefs": [
        "PO747281"
      ]
    },
    {
      "xsiType": "MandatSimple_Type",
      "uid": "PM760231",
      "acteurRef": "PA267200",
      "legislature": "15",
      "typeOrgane": "CNPS",
      "dateDebut": "2018-11-13T01:00:00.000+01:00",
      "datePublication": "2018-11-14T01:00:00.000+01:00",
      "dateFin": "2019-01-17T01:00:00.000+01:00",
      "preseance": "20",
      "nominPrincipale": "1",
      "infosQualite": {
        "codeQualite": "Membre",
        "libQualite": "Membre",
        "libQualiteSex": "Membre"
      },
      "organesRefs": [
        "PO760148"
      ]
    },
    {
      "xsiType": "MandatMission_Type",
      "uid": "PM766176",
      "acteurRef": "PA267200",
      "legislature": "15",
      "typeOrgane": "MISINFO",
      "dateDebut": "2019-07-03T02:00:00.000+02:00",
      "preseance": "10",
      "nominPrincipale": "0",
      "infosQualite": {
        "codeQualite": "Membre",
        "libQualite": "Membre",
        "libQualiteSex": "Membre"
      },
      "organesRefs": [
        "PO766172"
      ]
    },
    {
      "xsiType": "MandatMission_Type",
      "uid": "PM766178",
      "acteurRef": "PA267200",
      "legislature": "15",
      "typeOrgane": "MISINFO",
      "dateDebut": "2019-07-03T02:00:00.000+02:00",
      "preseance": "5",
      "nominPrincipale": "1",
      "infosQualite": {
        "codeQualite": "Co-rapporteur",
        "libQualite": "Co-rapporteur",
        "libQualiteSex": "Co-rapporteur"
      },
      "organesRefs": [
        "PO766172"
      ]
    }
  ]
}