{
  "uid": "PA609205",
  "etatCivil": {
    "ident": {
      "civ": "Mme",
      "prenom": "Catherine",
      "nom": "Troallic",
      "alpha": "Troallic"
    },
    "infoNaissance": {
      "dateNais": "1974-05-10T01:00:00.000+01:00",
      "villeNais": "Sainte Adresse",
      "depNais": "Seine-Maritime",
      "paysNais": "France"
    }
  },
  "profession": {
    "libelleCourant": "Fonctionnaire de catégorie B",
    "socProcInsee": {
      "catSocPro": "Professions intermédiaires de l'enseignement, de la santé, de la fonction publique et assimilés",
      "famSocPro": "Professions Intermédiaires"
    }
  },
  "adresses": [
    {
      "xsiType": "AdresseMail_Type",
      "uid": "AD648794",
      "type": "15",
      "typeLibelle": "Mèl",
      "valElec": "ctroallic@assemblee-nationale.fr"
    },
    {
      "xsiType": "AdressePostale_Type",
      "uid": "AD650721",
      "type": "0",
      "typeLibelle": "Adresse officielle",
      "poids": "1",
      "intitule": "Assemblée nationale,",
      "numeroRue": "126",
      "nomRue": "Rue de l'Université,",
      "codePostal": "75355",
      "ville": "PARIS 07 SP"
    },
    {
      "xsiType": "AdressePostale_Type",
      "uid": "AD702275",
      "type": "2",
      "typeLibelle": "Adresse publiée de circonscription",
      "poids": "22",
      "intitule": "Permanence parlementaire",
      "numeroRue": "53",
      "nomRue": "Rue Collard",
      "codePostal": "76600",
      "ville": "Le Havre"
    },
    {
      "xsiType": "AdresseTelephonique_Type",
      "uid": "AD702277",
      "type": "11",
      "typeLibelle": "Téléphone",
      "poids": "22",
      "adresseDeRattachement": "AD702275",
      "valElec": "02 32 72 48 40"
    }
  ],
  "mandats": [
    {
      "xsiType": "MandatParlementaire_type",
      "uid": "PM645128",
      "acteurRef": "PA609205",
      "legislature": "14",
      "typeOrgane": "ASSEMBLEE",
      "dateDebut": "2012-06-20T02:00:00.000+02:00",
      "dateFin": "2017-06-20T02:00:00.000+02:00",
      "preseance": "50",
      "nominPrincipale": "1",
      "infosQualite": {
        "codeQualite": "membre",
        "libQualite": "membre",
        "libQualiteSex": "membre"
      },
      "organesRefs": [
        "PO644420"
      ],
      "suppleant": {
        "dateDebut": "2012-06-20T02:00:00.000+02:00",
        "dateFin": "2017-06-20T02:00:00.000+02:00",
        "suppleantRef": "PA642964"
      },
      "election": {
        "lieu": {
          "region": "Normandie",
          "regionType": "Métropolitain",
          "departement": "Seine-Maritime",
          "numDepartement": "76",
          "numCirco": "8"
        },
        "causeMandat": "élections générales",
        "refCirconscription": "PO644844"
      },
      "mandature": {
        "datePriseFonction": "2012-06-20T02:00:00.000+02:00",
        "causeFin": "Fin de législature",
        "premiereElection": "0"
      }
    },
    {
      "xsiType": "MandatSimple_Type",
      "uid": "PM656290",
      "acteurRef": "PA609205",
      "legislature": "14",
      "typeOrgane": "GP",
      "dateDebut": "2012-06-26T02:00:00.000+02:00",
      "datePublication": "2012-06-27T02:00:00.000+02:00",
      "dateFin": "2016-05-24T02:00:00.000+02:00",
      "preseance": "20",
      "nominPrincipale": "1",
      "infosQualite": {
        "codeQualite": "Membre",
        "libQualite": "Membre du",
        "libQualiteSex": "Membre du"
      },
      "organesRefs": [
        "PO656002"
      ]
    },
    {
      "xsiType": "MandatSimple_Type",
      "uid": "PM657574",
      "acteurRef": "PA609205",
      "legislature": "14",
      "typeOrgane": "COMPER",
      "dateDebut": "2012-06-28T02:00:00.000+02:00",
      "datePublication": "2012-06-28T02:00:00.000+02:00",
      "dateFin": "2012-12-05T01:00:00.000+01:00",
      "preseance": "32",
      "nominPrincipale": "1",
      "infosQualite": {
        "codeQualite": "Membre",
        "libQualite": "Membre",
        "libQualiteSex": "Membre"
      },
      "organesRefs": [
        "PO419610"
      ]
    },
    {
      "xsiType": "MandatSimple_Type",
      "uid": "PM678630",
      "acteurRef": "PA609205",
      "legislature": "14",
      "typeOrgane": "GA",
      "dateDebut": "2012-09-26T02:00:00.000+02:00",
      "dateFin": "2017-06-20T02:00:00.000+02:00",
      "preseance": "20",
      "nominPrincipale": "1",
      "infosQualite": {
        "codeQualite": "Membre",
        "libQualite": "Membre",
        "libQualiteSex": "Membre"
      },
      "organesRefs": [
        "PO675735"
      ]
    },
    {
      "xsiType": "MandatSimple_Type",
      "uid": "PM678858",
      "acteurRef": "PA609205",
      "legislature": "14",
      "typeOrgane": "ORGEXTPARL",
      "dateDebut": "2012-09-28T02:00:00.000+02:00",
      "datePublication": "2012-09-29T02:00:00.000+02:00",
      "dateFin": "2015-06-02T02:00:00.000+02:00",
      "preseance": "20",
      "nominPrincipale": "1",
      "infosQualite": {
        "codeQualite": "Titulaire",
        "libQualite": "Membre titulaire",
        "libQualiteSex": "Membre titulaire"
      },
      "organesRefs": [
        "PO422826"
      ]
    },
    {
      "xsiType": "MandatSimple_Type",
      "uid": "PM684184",
      "acteurRef": "PA609205",
      "legislature": "14",
      "typeOrgane": "GA",
      "dateDebut": "2012-11-08T01:00:00.000+01:00",
      "dateFin": "2017-06-20T02:00:00.000+02:00",
      "preseance": "20",
      "nominPrincipale": "1",
      "infosQualite": {
        "codeQualite": "Membre",
        "libQualite": "Membre",
        "libQualiteSex": "Membre"
      },
      "organesRefs": [
        "PO675810"
      ]
    },
    {
      "xsiType": "MandatSimple_Type",
      "uid": "PM685076",
      "acteurRef": "PA609205",
      "legislature": "14",
      "typeOrgane": "GA",
      "dateDebut": "2012-11-27T01:00:00.000+01:00",
      "dateFin": "2017-06-20T02:00:00.000+02:00",
      "preseance": "8",
      "nominPrincipale": "1",
      "infosQualite": {
        "codeQualite": "Vice-Président",
        "libQualite": "Vice-Président",
        "libQualiteSex": "Vice-Présidente"
      },
      "organesRefs": [
        "PO675810"
      ]
    },
    {
      "xsiType": "MandatSimple_Type",
      "uid": "PM685421",
      "acteurRef": "PA609205",
      "legislature": "14",
      "typeOrgane": "COMPER",
      "dateDebut": "2012-12-06T01:00:00.000+01:00",
      "datePublication": "2012-12-06T01:00:00.000+01:00",
      "dateFin": "2012-12-20T01:00:00.000+01:00",
      "preseance": "32",
      "nominPrincipale": "1",
      "infosQualite": {
        "codeQualite": "Membre",
        "libQualite": "Membre",
        "libQualiteSex": "Membre"
      },
      "organesRefs": [
        "PO420120"
      ]
    },
    {
      "xsiType": "MandatSimple_Type",
      "uid": "PM686010",
      "acteurRef": "PA609205",
      "typeOrgane": "PARPOL",
      "dateDebut": "2012-12-01T01:00:00.000+01:00",
      "dateFin": "2017-06-20T02:00:00.000+02:00",
      "preseance": "5",
      "nominPrincipale": "1",
      "infosQualite": {
        "codeQualite": "Membre",
        "libQualite": "Membre",
        "libQualiteSex": "Membre"
      },
      "organesRefs": [
        "PO684932"
      ]
    },
    {
      "xsiType": "MandatSimple_Type",
      "uid": "PM687455",
      "acteurRef": "PA609205",
      "legislature": "14",
      "typeOrgane": "COMPER",
      "dateDebut": "2012-12-21T01:00:00.000+01:00",
      "dateFin": "2015-10-08T02:00:00.000+02:00",
      "preseance": "32",
      "nominPrincipale": "1",
      "infosQualite": {
        "codeQualite": "Membre",
        "libQualite": "Membre",
        "libQualiteSex": "Membre"
      },
      "organesRefs": [
        "PO419610"
      ]
    },
    {
      "xsiType": "MandatSimple_Type",
      "uid": "PM690725",
      "acteurRef": "PA609205",
      "legislature": "14",
      "typeOrgane": "GE",
      "dateDebut": "2013-02-06T01:00:00.000+01:00",
      "dateFin": "2013-02-07T01:00:00.000+01:00",
      "preseance": "20",
      "nominPrincipale": "1",
      "infosQualite": {
        "codeQualite": "Membre",
        "libQualite": "Membre",
        "libQualiteSex": "Membre"
      },
      "organesRefs": [
        "PO686196"
      ]
    },
    {
      "xsiType": "MandatSimple_Type",
      "uid": "PM691030",
      "acteurRef": "PA609205",
      "legislature": "14",
      "typeOrgane": "GE",
      "dateDebut": "2013-02-11T01:00:00.000+01:00",
      "dateFin": "2017-06-20T02:00:00.000+02:00",
      "preseance": "20",
      "nominPrincipale": "1",
      "infosQualite": {
        "codeQualite": "Membre",
        "libQualite": "Membre",
        "libQualiteSex": "Membre"
      },
      "organesRefs": [
        "PO686317"
      ]
    },
    {
      "xsiType": "MandatSimple_Type",
      "uid": "PM691033",
      "acteurRef": "PA609205",
      "legislature": "14",
      "typeOrgane": "GE",
      "dateDebut": "2013-02-11T01:00:00.000+01:00",
      "dateFin": "2017-06-20T02:00:00.000+02:00",
      "preseance": "20",
      "nominPrincipale": "1",
      "infosQualite": {
        "codeQualite": "Membre",
        "libQualite": "Membre",
        "libQualiteSex": "Membre"
      },
      "organesRefs": [
        "PO686204"
      ]
    },
    {
      "xsiType": "MandatSimple_Type",
      "uid": "PM691078",
      "acteurRef": "PA609205",
      "legislature": "14",
      "typeOrgane": "GE",
      "dateDebut": "2013-01-08T01:00:00.000+01:00",
      "dateFin": "2017-06-20T02:00:00.000+02:00",
      "preseance": "20",
      "nominPrincipale": "1",
      "infosQualite": {
        "codeQualite": "Membre",
        "libQualite": "Membre",
        "libQualiteSex": "Membre"
      },
      "organesRefs": [
        "PO686577"
      ]
    },
    {
      "xsiType": "MandatSimple_Type",
      "uid": "PM692178",
      "acteurRef": "PA609205",
      "legislature": "14",
      "typeOrgane": "GE",
      "dateDebut": "2013-02-27T01:00:00.000+01:00",
      "dateFin": "2017-06-20T02:00:00.000+02:00",
      "preseance": "8",
      "nominPrincipale": "1",
      "infosQualite": {
        "codeQualite": "Vice-Président",
        "libQualite": "Vice-Président",
        "libQualiteSex": "Vice-Présidente"
      },
      "organesRefs": [
        "PO686317"
      ]
    },
    {
      "xsiType": "MandatSimple_Type",
      "uid": "PM693448",
      "acteurRef": "PA609205",
      "legislature": "14",
      "typeOrgane": "GE",
      "dateDebut": "2013-04-10T02:00:00.000+02:00",
      "dateFin": "2017-06-20T02:00:00.000+02:00",
      "preseance": "20",
      "nominPrincipale": "1",
      "infosQualite": {
        "codeQualite": "Membre",
        "libQualite": "Membre",
        "libQualiteSex": "Membre"
      },
      "organesRefs": [
        "PO689018"
      ]
    },
    {
      "xsiType": "MandatSimple_Type",
      "uid": "PM695710",
      "acteurRef": "PA609205",
      "legislature": "14",
      "typeOrgane": "CNPE",
      "dateDebut": "2013-07-02T02:00:00.000+02:00",
      "datePublication": "2013-07-03T02:00:00.000+02:00",
      "dateFin": "2013-12-11T01:00:00.000+01:00",
      "preseance": "20",
      "nominPrincipale": "1",
      "infosQualite": {
        "codeQualite": "Membre",
        "libQualite": "Membre",
        "libQualiteSex": "Membre"
      },
      "organesRefs": [
        "PO695608"
      ]
    },
    {
      "xsiType": "MandatSimple_Type",
      "uid": "PM695802",
      "acteurRef": "PA609205",
      "legislature": "14",
      "typeOrgane": "CNPE",
      "dateDebut": "2013-07-03T02:00:00.000+02:00",
      "datePublication": "2013-07-05T02:00:00.000+02:00",
      "dateFin": "2013-12-11T01:00:00.000+01:00",
      "preseance": "14",
      "nominPrincipale": "1",
      "infosQualite": {
        "codeQualite": "Secrétaire",
        "libQualite": "Secrétaire",
        "libQualiteSex": "Secrétaire"
      },
      "organesRefs": [
        "PO695608"
      ]
    },
    {
      "xsiType": "MandatSimple_Type",
      "uid": "PM698269",
      "acteurRef": "PA609205",
      "legislature": "14",
      "typeOrgane": "GE",
      "dateDebut": "2013-10-31T01:00:00.000+01:00",
      "dateFin": "2017-06-20T02:00:00.000+02:00",
      "preseance": "20",
      "nominPrincipale": "1",
      "infosQualite": {
        "codeQualite": "Membre",
        "libQualite": "Membre",
        "libQualiteSex": "Membre"
      },
      "organesRefs": [
        "PO695593"
      ]
    },
    {
      "xsiType": "MandatSimple_Type",
      "uid": "PM698384",
      "acteurRef": "PA609205",
      "legislature": "14",
      "typeOrgane": "GE",
      "dateDebut": "2013-11-13T01:00:00.000+01:00",
      "dateFin": "2017-06-20T02:00:00.000+02:00",
      "preseance": "8",
      "nominPrincipale": "1",
      "infosQualite": {
        "codeQualite": "Vice-Président",
        "libQualite": "Vice-Président",
        "libQualiteSex": "Vice-Présidente"
      },
      "organesRefs": [
        "PO695593"
      ]
    },
    {
      "xsiType": "MandatSimple_Type",
      "uid": "PM701677",
      "acteurRef": "PA609205",
      "legislature": "14",
      "typeOrgane": "CMP",
      "dateDebut": "2014-06-03T02:00:00.000+02:00",
      "datePublication": "2014-06-04T02:00:00.000+02:00",
      "dateFin": "2014-06-23T02:00:00.000+02:00",
      "preseance": "28",
      "nominPrincipale": "1",
      "infosQualite": {
        "codeQualite": "Suppléant",
        "libQualite": "Membre suppléant",
        "libQualiteSex": "Membre suppléante"
      },
      "organesRefs": [
        "PO701542"
      ]
    },
    {
      "xsiType": "MandatSimple_Type",
      "uid": "PM702405",
      "acteurRef": "PA609205",
      "legislature": "14",
      "typeOrgane": "CMP",
      "dateDebut": "2014-07-10T02:00:00.000+02:00",
      "datePublication": "2014-07-11T02:00:00.000+02:00",
      "dateFin": "2014-07-21T02:00:00.000+02:00",
      "preseance": "28",
      "nominPrincipale": "1",
      "infosQualite": {
        "codeQualite": "Suppléant",
        "libQualite": "Membre suppléant",
        "libQualiteSex": "Membre suppléante"
      },
      "organesRefs": [
        "PO702220"
      ]
    },
    {
      "xsiType": "MandatSimple_Type",
      "uid": "PM703062",
      "acteurRef": "PA609205",
      "legislature": "14",
      "typeOrgane": "CNPS",
      "dateDebut": "2014-09-02T02:00:00.000+02:00",
      "datePublication": "2014-09-03T02:00:00.000+02:00",
      "dateFin": "2015-04-13T02:00:00.000+02:00",
      "preseance": "20",
      "nominPrincipale": "1",
      "infosQualite": {
        "codeQualite": "Membre",
        "libQualite": "Membre",
        "libQualiteSex": "Membre"
      },
      "organesRefs": [
        "PO702808"
      ]
    },
    {
      "xsiType": "MandatSimple_Type",
      "uid": "PM703132",
      "acteurRef": "PA609205",
      "legislature": "14",
      "typeOrgane": "CNPS",
      "dateDebut": "2014-09-09T02:00:00.000+02:00",
      "datePublication": "2014-09-10T02:00:00.000+02:00",
      "dateFin": "2015-04-13T02:00:00.000+02:00",
      "preseance": "14",
      "nominPrincipale": "1",
      "infosQualite": {
        "codeQualite": "Secrétaire",
        "libQualite": "Secrétaire",
        "libQualiteSex": "Secrétaire"
      },
      "organesRefs": [
        "PO702808"
      ]
    },
    {
      "xsiType": "MandatSimple_Type",
      "uid": "PM706509",
      "acteurRef": "PA609205",
      "legislature": "14",
      "typeOrgane": "CMP",
      "dateDebut": "2015-03-06T01:00:00.000+01:00",
      "datePublication": "2015-03-07T01:00:00.000+01:00",
      "dateFin": "2015-05-25T02:00:00.000+02:00",
      "preseance": "28",
      "nominPrincipale": "1",
      "infosQualite": {
        "codeQualite": "Suppléant",
        "libQualite": "Membre suppléant",
        "libQualiteSex": "Membre suppléante"
      },
      "organesRefs": [
        "PO706437"
      ]
    },
    {
      "xsiType": "MandatSimple_Type",
      "uid": "PM707334",
      "acteurRef": "PA609205",
      "legislature": "14",
      "typeOrgane": "CNPS",
      "dateDebut": "2015-04-18T02:00:00.000+02:00",
      "datePublication": "2015-04-18T02:00:00.000+02:00",
      "dateFin": "2015-08-18T02:00:00.000+02:00",
      "preseance": "20",
      "nominPrincipale": "0",
      "infosQualite": {
        "codeQualite": "Membre",
        "libQualite": "Membre",
        "libQualiteSex": "Membre"
      },
      "organesRefs": [
        "PO702808"
      ]
    },
    {
      "xsiType": "MandatSimple_Type",
      "uid": "PM707340",
      "acteurRef": "PA609205",
      "legislature": "14",
      "typeOrgane": "CNPS",
      "dateDebut": "2015-04-18T02:00:00.000+02:00",
      "datePublication": "2015-04-18T02:00:00.000+02:00",
      "dateFin": "2015-08-18T02:00:00.000+02:00",
      "preseance": "14",
      "nominPrincipale": "1",
      "infosQualite": {
        "codeQualite": "Secrétaire",
        "libQualite": "Secrétaire",
        "libQualiteSex": "Secrétaire"
      },
      "organesRefs": [
        "PO702808"
      ]
    },
    {
      "xsiType": "MandatSimple_Type",
      "uid": "PM707692",
      "acteurRef": "PA609205",
      "legislature": "14",
      "typeOrgane": "GE",
      "dateDebut": "2015-05-06T02:00:00.000+02:00",
      "dateFin": "2017-06-20T02:00:00.000+02:00",
      "preseance": "20",
      "nominPrincipale": "1",
      "infosQualite": {
        "codeQualite": "Membre",
        "libQualite": "Membre",
        "libQualiteSex": "Membre"
      },
      "organesRefs": [
        "PO705534"
      ]
    },
    {
      "xsiType": "MandatSimple_Type",
      "uid": "PM707786",
      "acteurRef": "PA609205",
      "legislature": "14",
      "typeOrgane": "GE",
      "dateDebut": "2015-05-20T02:00:00.000+02:00",
      "dateFin": "2017-06-20T02:00:00.000+02:00",
      "preseance": "8",
      "nominPrincipale": "1",
      "infosQualite": {
        "codeQualite": "Vice-Président",
        "libQualite": "Vice-Président",
        "libQualiteSex": "Vice-Présidente"
      },
      "organesRefs": [
        "PO705534"
      ]
    },
    {
      "xsiType": "MandatSimple_Type",
      "uid": "PM709633",
      "acteurRef": "PA609205",
      "legislature": "14",
      "typeOrgane": "COMPER",
      "dateDebut": "2015-10-09T02:00:00.000+02:00",
      "datePublication": "2015-10-09T02:00:00.000+02:00",
      "dateFin": "2015-11-10T01:00:00.000+01:00",
      "preseance": "32",
      "nominPrincipale": "1",
      "infosQualite": {
        "codeQualite": "Membre",
        "libQualite": "Membre",
        "libQualiteSex": "Membre"
      },
      "organesRefs": [
        "PO419865"
      ]
    },
    {
      "xsiType": "MandatSimple_Type",
      "uid": "PM709953",
      "acteurRef": "PA609205",
      "legislature": "14",
      "typeOrgane": "CMP",
      "dateDebut": "2015-11-05T01:00:00.000+01:00",
      "datePublication": "2015-11-06T01:00:00.000+01:00",
      "dateFin": "2015-11-18T01:00:00.000+01:00",
      "preseance": "28",
      "nominPrincipale": "1",
      "infosQualite": {
        "codeQualite": "Suppléant",
        "libQualite": "Membre suppléant",
        "libQualiteSex": "Membre suppléante"
      },
      "organesRefs": [
        "PO709711"
      ]
    },
    {
      "xsiType": "MandatSimple_Type",
      "uid": "PM710042",
      "acteurRef": "PA609205",
      "legislature": "14",
      "typeOrgane": "COMPER",
      "dateDebut": "2015-11-11T01:00:00.000+01:00",
      "datePublication": "2015-11-11T01:00:00.000+01:00",
      "dateFin": "2017-06-20T02:00:00.000+02:00",
      "preseance": "32",
      "nominPrincipale": "1",
      "infosQualite": {
        "codeQualite": "Membre",
        "libQualite": "Membre",
        "libQualiteSex": "Membre"
      },
      "organesRefs": [
        "PO419610"
      ]
    },
    {
      "xsiType": "MandatSimple_Type",
      "uid": "PM712224",
      "acteurRef": "PA609205",
      "legislature": "14",
      "typeOrgane": "CMP",
      "dateDebut": "2016-03-31T02:00:00.000+02:00",
      "datePublication": "2016-04-01T02:00:00.000+02:00",
      "dateFin": "2016-04-07T02:00:00.000+02:00",
      "preseance": "20",
      "nominPrincipale": "1",
      "infosQualite": {
        "codeQualite": "Titulaire",
        "libQualite": "Membre titulaire",
        "libQualiteSex": "Membre titulaire"
      },
      "organesRefs": [
        "PO712133"
      ]
    },
    {
      "xsiType": "MandatSimple_Type",
      "uid": "PM713348",
      "acteurRef": "PA609205",
      "legislature": "14",
      "typeOrgane": "GP",
      "dateDebut": "2016-05-25T02:00:00.000+02:00",
      "dateFin": "2017-06-20T02:00:00.000+02:00",
      "preseance": "20",
      "nominPrincipale": "1",
      "infosQualite": {
        "codeQualite": "Membre",
        "libQualite": "Membre du",
        "libQualiteSex": "Membre du"
      },
      "organesRefs": [
        "PO713077"
      ]
    }
  ]
}