{
  "uid": "PA415480",
  "etatCivil": {
    "ident": {
      "civ": "M.",
      "prenom": "Raymond",
      "nom": "Vall",
      "alpha": "VALL RAYMOND"
    },
    "infoNaissance": {
      "dateNais": "1942-01-13T02:00:00.000+02:00"
    }
  },
  "profession": {
    "socProcInsee": {}
  },
  "adresses": [
    {
      "xsiType": "AdresseSiteWeb_Type",
      "uid": "AD415656",
      "type": "23",
      "typeLibelle": "Url sénateur",
      "valElec": "https://www.senat.fr/senateur/vall_raymond08049c.html"
    }
  ],
  "mandats": [
    {
      "xsiType": "MandatParlementaire_type",
      "uid": "PM415576",
      "acteurRef": "PA415480",
      "typeOrgane": "SENAT",
      "dateDebut": "2008-10-01T02:00:00.000+02:00",
      "dateFin": "2014-09-30T02:00:00.000+02:00",
      "preseance": "20",
      "nominPrincipale": "1",
      "infosQualite": {
        "codeQualite": "Sénateur",
        "libQualite": "SENATEUR",
        "libQualiteSex": "SENATEUR"
      },
      "organesRefs": [
        "PO78718"
      ],
      "election": {
        "lieu": {
          "numDepartement": "32"
        }
      },
      "mandature": {
        "premiereElection": "0"
      }
    },
    {
      "xsiType": "MandatSimple_Type",
      "uid": "PM415776",
      "acteurRef": "PA415480",
      "typeOrgane": "GROUPESENAT",
      "dateDebut": "2008-10-01T02:00:00.000+02:00",
      "dateFin": "2014-09-30T02:00:00.000+02:00",
      "preseance": "4",
      "nominPrincipale": "1",
      "infosQualite": {
        "codeQualite": "Membre",
        "libQualite": "Membre",
        "libQualiteSex": "Membre"
      },
      "organesRefs": [
        "PO77714"
      ]
    },
    {
      "xsiType": "MandatSimple_Type",
      "uid": "PM415970",
      "acteurRef": "PA415480",
      "typeOrgane": "COMSENAT",
      "dateDebut": "2008-10-07T02:00:00.000+02:00",
      "dateFin": "2011-09-30T02:00:00.000+02:00",
      "preseance": "10",
      "nominPrincipale": "1",
      "infosQualite": {
        "codeQualite": "Membre",
        "libQualite": "Membre",
        "libQualiteSex": "Membre"
      },
      "organesRefs": [
        "PO211492"
      ]
    },
    {
      "xsiType": "MandatSimple_Type",
      "uid": "PM418797",
      "acteurRef": "PA415480",
      "typeOrgane": "API",
      "dateDebut": "2009-03-19T01:00:00.000+01:00",
      "dateFin": "2014-09-30T02:00:00.000+02:00",
      "preseance": "20",
      "nominPrincipale": "1",
      "infosQualite": {
        "codeQualite": "Membre",
        "libQualite": "Membre",
        "libQualiteSex": "Membre"
      },
      "organesRefs": [
        "PO206064"
      ]
    },
    {
      "xsiType": "MandatSimple_Type",
      "uid": "PM424137",
      "acteurRef": "PA415480",
      "typeOrgane": "CMP",
      "dateDebut": "2010-05-26T02:00:00.000+02:00",
      "datePublication": "2010-06-02T02:00:00.000+02:00",
      "dateFin": "2010-07-06T02:00:00.000+02:00",
      "preseance": "28",
      "nominPrincipale": "1",
      "infosQualite": {
        "codeQualite": "Suppléant",
        "libQualite": "Membre suppléant",
        "libQualiteSex": "Membre suppléant"
      },
      "organesRefs": [
        "PO423987"
      ]
    },
    {
      "xsiType": "MandatSimple_Type",
      "uid": "PM430440",
      "acteurRef": "PA415480",
      "typeOrgane": "COMSENAT",
      "dateDebut": "2011-10-01T02:00:00.000+02:00",
      "dateFin": "2012-02-20T01:00:00.000+01:00",
      "nominPrincipale": "1",
      "infosQualite": {
        "libQualite": "Vice-Président",
        "libQualiteSex": "Vice-Président"
      },
      "organesRefs": [
        "PO211492"
      ]
    },
    {
      "xsiType": "MandatSimple_Type",
      "uid": "PM491660",
      "acteurRef": "PA415480",
      "typeOrgane": "CMP",
      "dateDebut": "2012-01-27T01:00:00.000+01:00",
      "datePublication": "2012-01-31T01:00:00.000+01:00",
      "dateFin": "2012-02-13T01:00:00.000+01:00",
      "preseance": "28",
      "nominPrincipale": "1",
      "infosQualite": {
        "codeQualite": "Suppléant",
        "libQualite": "Membre suppléant",
        "libQualiteSex": "Membre suppléant"
      },
      "organesRefs": [
        "PO489394"
      ]
    },
    {
      "xsiType": "MandatSimple_Type",
      "uid": "PM516840",
      "acteurRef": "PA415480",
      "typeOrgane": "COMSENAT",
      "dateDebut": "2012-02-21T01:00:00.000+01:00",
      "dateFin": "2014-09-30T02:00:00.000+02:00",
      "nominPrincipale": "1",
      "infosQualite": {
        "libQualite": "Président",
        "libQualiteSex": "Président"
      },
      "organesRefs": [
        "PO516754"
      ]
    },
    {
      "xsiType": "MandatSimple_Type",
      "uid": "PM685181",
      "acteurRef": "PA415480",
      "typeOrgane": "CMP",
      "dateDebut": "2012-11-29T01:00:00.000+01:00",
      "datePublication": "2012-11-30T01:00:00.000+01:00",
      "dateFin": "2012-12-13T01:00:00.000+01:00",
      "preseance": "20",
      "nominPrincipale": "1",
      "infosQualite": {
        "codeQualite": "Titulaire",
        "libQualite": "Membre titulaire",
        "libQualiteSex": "Membre titulaire"
      },
      "organesRefs": [
        "PO684833"
      ]
    },
    {
      "xsiType": "MandatSimple_Type",
      "uid": "PM685341",
      "acteurRef": "PA415480",
      "typeOrgane": "CMP",
      "dateDebut": "2012-12-04T01:00:00.000+01:00",
      "datePublication": "2012-12-05T01:00:00.000+01:00",
      "dateFin": "2012-12-13T01:00:00.000+01:00",
      "preseance": "1",
      "nominPrincipale": "1",
      "infosQualite": {
        "codeQualite": "Président",
        "libQualite": "Président",
        "libQualiteSex": "Président"
      },
      "organesRefs": [
        "PO684833"
      ]
    },
    {
      "xsiType": "MandatSimple_Type",
      "uid": "PM693746",
      "acteurRef": "PA415480",
      "typeOrgane": "CMP",
      "dateDebut": "2013-04-16T02:00:00.000+02:00",
      "datePublication": "2013-04-17T02:00:00.000+02:00",
      "dateFin": "2013-04-24T02:00:00.000+02:00",
      "preseance": "20",
      "nominPrincipale": "1",
      "infosQualite": {
        "codeQualite": "Titulaire",
        "libQualite": "Membre titulaire",
        "libQualiteSex": "Membre titulaire"
      },
      "organesRefs": [
        "PO693720"
      ]
    },
    {
      "xsiType": "MandatSimple_Type",
      "uid": "PM693893",
      "acteurRef": "PA415480",
      "typeOrgane": "CMP",
      "dateDebut": "2013-04-17T02:00:00.000+02:00",
      "datePublication": "2013-04-18T02:00:00.000+02:00",
      "dateFin": "2013-04-24T02:00:00.000+02:00",
      "preseance": "4",
      "nominPrincipale": "1",
      "infosQualite": {
        "codeQualite": "Vice-Président",
        "libQualite": "Vice-Président",
        "libQualiteSex": "Vice-Président"
      },
      "organesRefs": [
        "PO693720"
      ]
    },
    {
      "xsiType": "MandatSimple_Type",
      "uid": "PM695018",
      "acteurRef": "PA415480",
      "typeOrgane": "CMP",
      "dateDebut": "2013-06-05T02:00:00.000+02:00",
      "datePublication": "2013-06-06T02:00:00.000+02:00",
      "dateFin": "2013-07-02T02:00:00.000+02:00",
      "preseance": "20",
      "nominPrincipale": "1",
      "infosQualite": {
        "codeQualite": "Titulaire",
        "libQualite": "Membre titulaire",
        "libQualiteSex": "Membre titulaire"
      },
      "organesRefs": [
        "PO694654"
      ]
    },
    {
      "xsiType": "MandatSimple_Type",
      "uid": "PM695235",
      "acteurRef": "PA415480",
      "typeOrgane": "CMP",
      "dateDebut": "2013-06-12T02:00:00.000+02:00",
      "datePublication": "2013-06-13T02:00:00.000+02:00",
      "dateFin": "2013-07-02T02:00:00.000+02:00",
      "preseance": "1",
      "nominPrincipale": "1",
      "infosQualite": {
        "codeQualite": "Président",
        "libQualite": "Président",
        "libQualiteSex": "Président"
      },
      "organesRefs": [
        "PO694654"
      ]
    },
    {
      "xsiType": "MandatSimple_Type",
      "uid": "PM701434",
      "acteurRef": "PA415480",
      "typeOrgane": "CMP",
      "dateDebut": "2014-05-20T02:00:00.000+02:00",
      "datePublication": "2014-05-21T02:00:00.000+02:00",
      "dateFin": "2014-06-19T02:00:00.000+02:00",
      "preseance": "20",
      "nominPrincipale": "1",
      "infosQualite": {
        "codeQualite": "Titulaire",
        "libQualite": "Membre titulaire",
        "libQualiteSex": "Membre titulaire"
      },
      "organesRefs": [
        "PO701387"
      ]
    },
    {
      "xsiType": "MandatSimple_Type",
      "uid": "PM701466",
      "acteurRef": "PA415480",
      "typeOrgane": "CMP",
      "dateDebut": "2014-05-21T02:00:00.000+02:00",
      "datePublication": "2014-05-22T02:00:00.000+02:00",
      "dateFin": "2014-06-19T02:00:00.000+02:00",
      "preseance": "4",
      "nominPrincipale": "1",
      "infosQualite": {
        "codeQualite": "Vice-Président",
        "libQualite": "Vice-Président",
        "libQualiteSex": "Vice-Président"
      },
      "organesRefs": [
        "PO701387"
      ]
    },
    {
      "xsiType": "MandatSimple_Type",
      "uid": "PM702467",
      "acteurRef": "PA415480",
      "typeOrgane": "CMP",
      "dateDebut": "2014-07-11T02:00:00.000+02:00",
      "datePublication": "2014-07-16T02:00:00.000+02:00",
      "dateFin": "2014-07-22T02:00:00.000+02:00",
      "preseance": "28",
      "nominPrincipale": "1",
      "infosQualite": {
        "codeQualite": "Suppléant",
        "libQualite": "Membre suppléant",
        "libQualiteSex": "Membre suppléant"
      },
      "organesRefs": [
        "PO702437"
      ]
    },
    {
      "xsiType": "MandatSimple_Type",
      "uid": "PM702494",
      "acteurRef": "PA415480",
      "typeOrgane": "CMP",
      "dateDebut": "2014-07-11T02:00:00.000+02:00",
      "datePublication": "2014-07-16T02:00:00.000+02:00",
      "dateFin": "2014-07-22T02:00:00.000+02:00",
      "preseance": "20",
      "nominPrincipale": "1",
      "infosQualite": {
        "codeQualite": "Titulaire",
        "libQualite": "Membre titulaire",
        "libQualiteSex": "Membre titulaire"
      },
      "organesRefs": [
        "PO702431"
      ]
    },
    {
      "xsiType": "MandatSimple_Type",
      "uid": "PM702507",
      "acteurRef": "PA415480",
      "typeOrgane": "CMP",
      "dateDebut": "2014-07-16T02:00:00.000+02:00",
      "datePublication": "2014-07-17T02:00:00.000+02:00",
      "dateFin": "2014-07-22T02:00:00.000+02:00",
      "preseance": "1",
      "nominPrincipale": "1",
      "infosQualite": {
        "codeQualite": "Président",
        "libQualite": "Président",
        "libQualiteSex": "Président"
      },
      "organesRefs": [
        "PO702431"
      ]
    },
    {
      "xsiType": "MandatSimple_Type",
      "uid": "PM702511",
      "acteurRef": "PA415480",
      "typeOrgane": "CMP",
      "dateDebut": "2014-07-16T02:00:00.000+02:00",
      "datePublication": "2014-07-17T02:00:00.000+02:00",
      "dateFin": "2014-07-22T02:00:00.000+02:00",
      "preseance": "1",
      "nominPrincipale": "1",
      "infosQualite": {
        "codeQualite": "Président",
        "libQualite": "Président",
        "libQualiteSex": "Président"
      },
      "organesRefs": [
        "PO702437"
      ]
    },
    {
      "xsiType": "MandatSimple_Type",
      "uid": "PM709299",
      "acteurRef": "PA415480",
      "typeOrgane": "GROUPESENAT",
      "dateDebut": "2015-09-07T02:00:00.000+02:00",
      "dateFin": "2015-09-09T02:00:00.000+02:00",
      "preseance": "4",
      "nominPrincipale": "1",
      "infosQualite": {
        "codeQualite": "Membre",
        "libQualite": "Membre",
        "libQualiteSex": "Membre"
      },
      "organesRefs": [
        "PO77708"
      ]
    },
    {
      "xsiType": "MandatSimple_Type",
      "uid": "PM709302",
      "acteurRef": "PA415480",
      "typeOrgane": "GROUPESENAT",
      "dateDebut": "2015-09-10T02:00:00.000+02:00",
      "preseance": "4",
      "nominPrincipale": "1",
      "infosQualite": {
        "codeQualite": "Membre",
        "libQualite": "Membre",
        "libQualiteSex": "Membre"
      },
      "organesRefs": [
        "PO77714"
      ]
    },
    {
      "xsiType": "MandatParlementaire_type",
      "uid": "PM709303",
      "acteurRef": "PA415480",
      "typeOrgane": "SENAT",
      "dateDebut": "2015-09-07T02:00:00.000+02:00",
      "preseance": "20",
      "nominPrincipale": "1",
      "infosQualite": {
        "codeQualite": "Sénateur",
        "libQualite": "SENATEUR",
        "libQualiteSex": "SENATEUR"
      },
      "organesRefs": [
        "PO78718"
      ],
      "election": {
        "lieu": {
          "numDepartement": "32"
        }
      },
      "mandature": {
        "premiereElection": "0"
      }
    },
    {
      "xsiType": "MandatSimple_Type",
      "uid": "PM709412",
      "acteurRef": "PA415480",
      "typeOrgane": "COMSENAT",
      "dateDebut": "2015-09-16T02:00:00.000+02:00",
      "dateFin": "2017-10-03T02:00:00.000+02:00",
      "preseance": "10",
      "nominPrincipale": "1",
      "infosQualite": {
        "codeQualite": "Membre",
        "libQualite": "Membre",
        "libQualiteSex": "Membre"
      },
      "organesRefs": [
        "PO211491"
      ]
    },
    {
      "xsiType": "MandatSimple_Type",
      "uid": "PM741187",
      "acteurRef": "PA415480",
      "typeOrgane": "COMSENAT",
      "dateDebut": "2017-10-04T02:00:00.000+02:00",
      "preseance": "10",
      "nominPrincipale": "1",
      "infosQualite": {
        "codeQualite": "Membre",
        "libQualite": "Membre",
        "libQualiteSex": "Membre"
      },
      "organesRefs": [
        "PO211491"
      ]
    },
    {
      "xsiType": "MandatSimple_Type",
      "uid": "PM741511",
      "acteurRef": "PA415480",
      "typeOrgane": "DELEGSENAT",
      "dateDebut": "2017-10-18T02:00:00.000+02:00",
      "preseance": "4",
      "nominPrincipale": "1",
      "infosQualite": {
        "codeQualite": "Membre",
        "libQualite": "Membre",
        "libQualiteSex": "Membre"
      },
      "organesRefs": [
        "PO420387"
      ]
    },
    {
      "xsiType": "MandatSimple_Type",
      "uid": "PM743234",
      "acteurRef": "PA415480",
      "typeOrgane": "API",
      "dateDebut": "2017-11-08T01:00:00.000+01:00",
      "preseance": "20",
      "nominPrincipale": "0",
      "infosQualite": {
        "codeQualite": "Membre",
        "libQualite": "Membre",
        "libQualiteSex": "Membre"
      },
      "organesRefs": [
        "PO206064"
      ]
    },
    {
      "xsiType": "MandatSimple_Type",
      "uid": "PM743263",
      "acteurRef": "PA415480",
      "typeOrgane": "API",
      "dateDebut": "2017-11-08T01:00:00.000+01:00",
      "preseance": "24",
      "nominPrincipale": "1",
      "infosQualite": {
        "codeQualite": "Suppléant",
        "libQualite": "Membre suppléant",
        "libQualiteSex": "Membre suppléant"
      },
      "organesRefs": [
        "PO58974"
      ]
    },
    {
      "xsiType": "MandatSimple_Type",
      "uid": "PM743373",
      "acteurRef": "PA415480",
      "typeOrgane": "API",
      "dateDebut": "2017-11-15T01:00:00.000+01:00",
      "preseance": "4",
      "nominPrincipale": "1",
      "infosQualite": {
        "codeQualite": "Vice-Président",
        "libQualite": "Vice-Président",
        "libQualiteSex": "Vice-Président"
      },
      "organesRefs": [
        "PO206064"
      ]
    },
    {
      "xsiType": "MandatSimple_Type",
      "uid": "PM756879",
      "acteurRef": "PA415480",
      "typeOrgane": "CMP",
      "dateDebut": "2018-06-12T02:00:00.000+02:00",
      "datePublication": "2018-06-13T02:00:00.000+02:00",
      "dateFin": "2018-06-28T02:00:00.000+02:00",
      "preseance": "20",
      "nominPrincipale": "1",
      "infosQualite": {
        "codeQualite": "Titulaire",
        "libQualite": "Membre titulaire",
        "libQualiteSex": "Membre titulaire"
      },
      "organesRefs": [
        "PO756661"
      ]
    }
  ]
}