{
  "uid": "PA722236",
  "etatCivil": {
    "ident": {
      "civ": "M.",
      "prenom": "Jean-Baptiste",
      "nom": "Djebbari",
      "alpha": "Djebbari"
    },
    "infoNaissance": {
      "dateNais": "1982-02-26T01:00:00.000+01:00",
      "villeNais": "Melun",
      "depNais": "Seine-et-Marne",
      "paysNais": "France"
    }
  },
  "profession": {
    "libelleCourant": "Industriel-Chef d'entreprise",
    "socProcInsee": {
      "catSocPro": "Cadres d'entreprise",
      "famSocPro": "Cadres et professions intellectuelles supérieures"
    }
  },
  "adresses": [
    {
      "xsiType": "AdressePostale_Type",
      "uid": "AD722238",
      "type": "0",
      "typeLibelle": "Adresse officielle",
      "poids": "1",
      "intitule": "Assemblée nationale,",
      "numeroRue": "126",
      "nomRue": "Rue de l'Université,",
      "codePostal": "75355",
      "ville": "Paris 07 SP"
    },
    {
      "xsiType": "AdresseSiteWeb_Type",
      "uid": "AD725736",
      "type": "24",
      "typeLibelle": "Twitter",
      "valElec": "@Djebbari_JB"
    },
    {
      "xsiType": "AdresseSiteWeb_Type",
      "uid": "AD726234",
      "type": "25",
      "typeLibelle": "Facebook",
      "valElec": "Jean-Baptiste-Djebbari"
    },
    {
      "xsiType": "AdresseMail_Type",
      "uid": "AD728330",
      "type": "15",
      "typeLibelle": "Mèl",
      "valElec": "jean-baptiste.djebbari@assemblee-nationale.fr"
    },
    {
      "xsiType": "AdressePostale_Type",
      "uid": "AD746599",
      "type": "2",
      "typeLibelle": "Adresse publiée de circonscription",
      "poids": "22",
      "intitule": "Permanence parlementaire",
      "numeroRue": "1",
      "nomRue": "Place de la République",
      "complementAdresse": "BP n° 8",
      "codePostal": "87800",
      "ville": "Nexon"
    },
    {
      "xsiType": "AdresseTelephonique_Type",
      "uid": "AD746601",
      "type": "11",
      "typeLibelle": "Téléphone",
      "poids": "22",
      "adresseDeRattachement": "AD746599",
      "valElec": "05 55 70 68 92"
    }
  ],
  "mandats": [
    {
      "xsiType": "MandatParlementaire_type",
      "uid": "PM723514",
      "acteurRef": "PA722236",
      "legislature": "15",
      "typeOrgane": "ASSEMBLEE",
      "dateDebut": "2017-06-18T02:00:00.000+02:00",
      "dateFin": "2019-10-03T02:00:00.000+02:00",
      "preseance": "50",
      "nominPrincipale": "1",
      "infosQualite": {
        "codeQualite": "membre",
        "libQualite": "membre",
        "libQualiteSex": "membre"
      },
      "organesRefs": [
        "PO717460"
      ],
      "suppleant": {
        "dateDebut": "2017-06-18T02:00:00.000+02:00",
        "dateFin": "2019-10-03T02:00:00.000+02:00",
        "suppleantRef": "PA722240"
      },
      "election": {
        "lieu": {
          "region": "Nouvelle-Aquitaine",
          "regionType": "Métropolitain",
          "departement": "Haute-Vienne",
          "numDepartement": "87",
          "numCirco": "2"
        },
        "causeMandat": "élections générales",
        "refCirconscription": "PO718356"
      },
      "mandature": {
        "datePriseFonction": "2017-06-21T02:00:00.000+02:00",
        "causeFin": "Nomination comme membre du Gouvernement",
        "premiereElection": "0"
      }
    },
    {
      "xsiType": "MandatSimple_Type",
      "uid": "PM724798",
      "acteurRef": "PA722236",
      "legislature": "15",
      "typeOrgane": "GP",
      "dateDebut": "2017-06-21T02:00:00.000+02:00",
      "dateFin": "2017-06-26T02:00:00.000+02:00",
      "preseance": "28",
      "nominPrincipale": "1",
      "infosQualite": {
        "codeQualite": "Député non-inscrit",
        "libQualite": "Député non-inscrit",
        "libQualiteSex": "Député non-inscrit"
      },
      "organesRefs": [
        "PO723569"
      ]
    },
    {
      "xsiType": "MandatSimple_Type",
      "uid": "PM731268",
      "acteurRef": "PA722236",
      "legislature": "15",
      "typeOrgane": "GP",
      "dateDebut": "2017-06-27T02:00:00.000+02:00",
      "datePublication": "2017-06-28T02:00:00.000+02:00",
      "dateFin": "2019-10-03T02:00:00.000+02:00",
      "preseance": "20",
      "nominPrincipale": "1",
      "infosQualite": {
        "codeQualite": "Membre",
        "libQualite": "Membre du",
        "libQualiteSex": "Membre du"
      },
      "organesRefs": [
        "PO730964"
      ]
    },
    {
      "xsiType": "MandatSimple_Type",
      "uid": "PM732026",
      "acteurRef": "PA722236",
      "legislature": "15",
      "typeOrgane": "COMPER",
      "dateDebut": "2017-06-29T02:00:00.000+02:00",
      "datePublication": "2017-06-29T02:00:00.000+02:00",
      "dateFin": "2019-09-30T02:00:00.000+02:00",
      "preseance": "32",
      "nominPrincipale": "1",
      "infosQualite": {
        "codeQualite": "Membre",
        "libQualite": "Membre",
        "libQualiteSex": "Membre"
      },
      "organesRefs": [
        "PO419865"
      ]
    },
    {
      "xsiType": "MandatSimple_Type",
      "uid": "PM735398",
      "acteurRef": "PA722236",
      "legislature": "15",
      "typeOrgane": "GA",
      "dateDebut": "2017-09-26T02:00:00.000+02:00",
      "dateFin": "2019-10-03T02:00:00.000+02:00",
      "preseance": "20",
      "nominPrincipale": "0",
      "infosQualite": {
        "codeQualite": "Membre",
        "libQualite": "Membre",
        "libQualiteSex": "Membre"
      },
      "organesRefs": [
        "PO733237"
      ]
    },
    {
      "xsiType": "MandatSimple_Type",
      "uid": "PM735399",
      "acteurRef": "PA722236",
      "legislature": "15",
      "typeOrgane": "GA",
      "dateDebut": "2017-09-26T02:00:00.000+02:00",
      "dateFin": "2019-10-03T02:00:00.000+02:00",
      "preseance": "1",
      "nominPrincipale": "1",
      "infosQualite": {
        "codeQualite": "Président",
        "libQualite": "Président",
        "libQualiteSex": "Président"
      },
      "organesRefs": [
        "PO733237"
      ]
    },
    {
      "xsiType": "MandatSimple_Type",
      "uid": "PM738163",
      "acteurRef": "PA722236",
      "legislature": "15",
      "typeOrgane": "GA",
      "dateDebut": "2017-10-09T02:00:00.000+02:00",
      "dateFin": "2019-10-03T02:00:00.000+02:00",
      "preseance": "20",
      "nominPrincipale": "1",
      "infosQualite": {
        "codeQualite": "Membre",
        "libQualite": "Membre",
        "libQualiteSex": "Membre"
      },
      "organesRefs": [
        "PO733202"
      ]
    },
    {
      "xsiType": "MandatSimple_Type",
      "uid": "PM738164",
      "acteurRef": "PA722236",
      "legislature": "15",
      "typeOrgane": "GA",
      "dateDebut": "2017-10-09T02:00:00.000+02:00",
      "dateFin": "2019-10-03T02:00:00.000+02:00",
      "preseance": "20",
      "nominPrincipale": "1",
      "infosQualite": {
        "codeQualite": "Membre",
        "libQualite": "Membre",
        "libQualiteSex": "Membre"
      },
      "organesRefs": [
        "PO733352"
      ]
    },
    {
      "xsiType": "MandatSimple_Type",
      "uid": "PM738165",
      "acteurRef": "PA722236",
      "legislature": "15",
      "typeOrgane": "GA",
      "dateDebut": "2017-10-09T02:00:00.000+02:00",
      "dateFin": "2019-10-03T02:00:00.000+02:00",
      "preseance": "20",
      "nominPrincipale": "1",
      "infosQualite": {
        "codeQualite": "Membre",
        "libQualite": "Membre",
        "libQualiteSex": "Membre"
      },
      "organesRefs": [
        "PO733382"
      ]
    },
    {
      "xsiType": "MandatSimple_Type",
      "uid": "PM738166",
      "acteurRef": "PA722236",
      "legislature": "15",
      "typeOrgane": "GA",
      "dateDebut": "2017-10-09T02:00:00.000+02:00",
      "dateFin": "2019-10-03T02:00:00.000+02:00",
      "preseance": "20",
      "nominPrincipale": "1",
      "infosQualite": {
        "codeQualite": "Membre",
        "libQualite": "Membre",
        "libQualiteSex": "Membre"
      },
      "organesRefs": [
        "PO733442"
      ]
    },
    {
      "xsiType": "MandatSimple_Type",
      "uid": "PM738167",
      "acteurRef": "PA722236",
      "legislature": "15",
      "typeOrgane": "GA",
      "dateDebut": "2017-10-09T02:00:00.000+02:00",
      "dateFin": "2019-10-03T02:00:00.000+02:00",
      "preseance": "20",
      "nominPrincipale": "1",
      "infosQualite": {
        "codeQualite": "Membre",
        "libQualite": "Membre",
        "libQualiteSex": "Membre"
      },
      "organesRefs": [
        "PO733472"
      ]
    },
    {
      "xsiType": "MandatSimple_Type",
      "uid": "PM738168",
      "acteurRef": "PA722236",
      "legislature": "15",
      "typeOrgane": "GA",
      "dateDebut": "2017-10-09T02:00:00.000+02:00",
      "dateFin": "2019-10-03T02:00:00.000+02:00",
      "preseance": "20",
      "nominPrincipale": "1",
      "infosQualite": {
        "codeQualite": "Membre",
        "libQualite": "Membre",
        "libQualiteSex": "Membre"
      },
      "organesRefs": [
        "PO733482"
      ]
    },
    {
      "xsiType": "MandatSimple_Type",
      "uid": "PM738169",
      "acteurRef": "PA722236",
      "legislature": "15",
      "typeOrgane": "GA",
      "dateDebut": "2017-10-09T02:00:00.000+02:00",
      "dateFin": "2019-10-03T02:00:00.000+02:00",
      "preseance": "20",
      "nominPrincipale": "1",
      "infosQualite": {
        "codeQualite": "Membre",
        "libQualite": "Membre",
        "libQualiteSex": "Membre"
      },
      "organesRefs": [
        "PO733522"
      ]
    },
    {
      "xsiType": "MandatSimple_Type",
      "uid": "PM738170",
      "acteurRef": "PA722236",
      "legislature": "15",
      "typeOrgane": "GA",
      "dateDebut": "2017-10-09T02:00:00.000+02:00",
      "dateFin": "2019-10-03T02:00:00.000+02:00",
      "preseance": "20",
      "nominPrincipale": "1",
      "infosQualite": {
        "codeQualite": "Membre",
        "libQualite": "Membre",
        "libQualiteSex": "Membre"
      },
      "organesRefs": [
        "PO733567"
      ]
    },
    {
      "xsiType": "MandatSimple_Type",
      "uid": "PM740940",
      "acteurRef": "PA722236",
      "legislature": "15",
      "typeOrgane": "ORGEXTPARL",
      "dateDebut": "2017-10-19T02:00:00.000+02:00",
      "datePublication": "2017-10-21T02:00:00.000+02:00",
      "dateFin": "2019-10-03T02:00:00.000+02:00",
      "preseance": "20",
      "nominPrincipale": "1",
      "infosQualite": {
        "codeQualite": "Titulaire",
        "libQualite": "Membre titulaire",
        "libQualiteSex": "Membre titulaire"
      },
      "organesRefs": [
        "PO423980"
      ]
    },
    {
      "xsiType": "MandatSimple_Type",
      "uid": "PM741796",
      "acteurRef": "PA722236",
      "legislature": "15",
      "typeOrgane": "GA",
      "dateDebut": "2017-10-26T02:00:00.000+02:00",
      "dateFin": "2019-10-03T02:00:00.000+02:00",
      "preseance": "8",
      "nominPrincipale": "1",
      "infosQualite": {
        "codeQualite": "Vice-Président",
        "libQualite": "Vice-Président",
        "libQualiteSex": "Vice-Président"
      },
      "organesRefs": [
        "PO733202"
      ]
    },
    {
      "xsiType": "MandatSimple_Type",
      "uid": "PM741837",
      "acteurRef": "PA722236",
      "legislature": "15",
      "typeOrgane": "ORGEXTPARL",
      "dateDebut": "2017-10-25T02:00:00.000+02:00",
      "datePublication": "2017-10-26T02:00:00.000+02:00",
      "dateFin": "2019-10-03T02:00:00.000+02:00",
      "preseance": "20",
      "nominPrincipale": "1",
      "infosQualite": {
        "codeQualite": "Titulaire",
        "libQualite": "Membre titulaire",
        "libQualiteSex": "Membre titulaire"
      },
      "organesRefs": [
        "PO702841"
      ]
    },
    {
      "xsiType": "MandatSimple_Type",
      "uid": "PM743549",
      "acteurRef": "PA722236",
      "legislature": "15",
      "typeOrgane": "CMP",
      "dateDebut": "2017-11-16T01:00:00.000+01:00",
      "datePublication": "2017-11-16T01:00:00.000+01:00",
      "dateFin": "2017-12-19T01:00:00.000+01:00",
      "preseance": "28",
      "nominPrincipale": "1",
      "infosQualite": {
        "codeQualite": "Suppléant",
        "libQualite": "Membre suppléant",
        "libQualiteSex": "Membre suppléant"
      },
      "organesRefs": [
        "PO742823"
      ]
    },
    {
      "xsiType": "MandatSimple_Type",
      "uid": "PM745055",
      "acteurRef": "PA722236",
      "typeOrgane": "PARPOL",
      "dateDebut": "2017-12-01T01:00:00.000+01:00",
      "dateFin": "2018-11-30T01:00:00.000+01:00",
      "preseance": "5",
      "nominPrincipale": "1",
      "infosQualite": {
        "codeQualite": "Membre",
        "libQualite": "Membre",
        "libQualiteSex": "Membre"
      },
      "organesRefs": [
        "PO744854"
      ]
    },
    {
      "xsiType": "MandatSimple_Type",
      "uid": "PM746495",
      "acteurRef": "PA722236",
      "legislature": "15",
      "typeOrgane": "CMP",
      "dateDebut": "2017-12-14T01:00:00.000+01:00",
      "datePublication": "2017-12-15T01:00:00.000+01:00",
      "dateFin": "2018-02-15T01:00:00.000+01:00",
      "preseance": "20",
      "nominPrincipale": "1",
      "infosQualite": {
        "codeQualite": "Titulaire",
        "libQualite": "Membre titulaire",
        "libQualiteSex": "Membre titulaire"
      },
      "organesRefs": [
        "PO739530"
      ]
    },
    {
      "xsiType": "MandatSimple_Type",
      "uid": "PM750351",
      "acteurRef": "PA722236",
      "legislature": "15",
      "typeOrgane": "GE",
      "dateDebut": "2018-02-14T01:00:00.000+01:00",
      "dateFin": "2019-10-03T02:00:00.000+02:00",
      "preseance": "20",
      "nominPrincipale": "1",
      "infosQualite": {
        "codeQualite": "Membre",
        "libQualite": "Membre",
        "libQualiteSex": "Membre"
      },
      "organesRefs": [
        "PO746786"
      ]
    },
    {
      "xsiType": "MandatSimple_Type",
      "uid": "PM750597",
      "acteurRef": "PA722236",
      "legislature": "15",
      "typeOrgane": "GE",
      "dateDebut": "2018-02-12T01:00:00.000+01:00",
      "dateFin": "2019-10-03T02:00:00.000+02:00",
      "preseance": "20",
      "nominPrincipale": "1",
      "infosQualite": {
        "codeQualite": "Membre",
        "libQualite": "Membre",
        "libQualiteSex": "Membre"
      },
      "organesRefs": [
        "PO746857"
      ]
    },
    {
      "xsiType": "MandatSimple_Type",
      "uid": "PM750643",
      "acteurRef": "PA722236",
      "legislature": "15",
      "typeOrgane": "GE",
      "dateDebut": "2018-02-15T01:00:00.000+01:00",
      "dateFin": "2019-10-03T02:00:00.000+02:00",
      "preseance": "20",
      "nominPrincipale": "1",
      "infosQualite": {
        "codeQualite": "Membre",
        "libQualite": "Membre",
        "libQualiteSex": "Membre"
      },
      "organesRefs": [
        "PO747200"
      ]
    },
    {
      "xsiType": "MandatSimple_Type",
      "uid": "PM751038",
      "acteurRef": "PA722236",
      "legislature": "15",
      "typeOrgane": "GE",
      "dateDebut": "2018-02-19T01:00:00.000+01:00",
      "dateFin": "2019-09-20T02:00:00.000+02:00",
      "preseance": "20",
      "nominPrincipale": "1",
      "infosQualite": {
        "codeQualite": "Membre",
        "libQualite": "Membre",
        "libQualiteSex": "Membre"
      },
      "organesRefs": [
        "PO746880"
      ]
    },
    {
      "xsiType": "MandatSimple_Type",
      "uid": "PM751466",
      "acteurRef": "PA722236",
      "legislature": "15",
      "typeOrgane": "GE",
      "dateDebut": "2018-02-21T01:00:00.000+01:00",
      "dateFin": "2019-10-03T02:00:00.000+02:00",
      "preseance": "20",
      "nominPrincipale": "1",
      "infosQualite": {
        "codeQualite": "Membre",
        "libQualite": "Membre",
        "libQualiteSex": "Membre"
      },
      "organesRefs": [
        "PO746644"
      ]
    },
    {
      "xsiType": "MandatSimple_Type",
      "uid": "PM753182",
      "acteurRef": "PA722236",
      "legislature": "15",
      "typeOrgane": "GE",
      "dateDebut": "2018-03-11T01:00:00.000+01:00",
      "dateFin": "2019-10-03T02:00:00.000+02:00",
      "preseance": "20",
      "nominPrincipale": "1",
      "infosQualite": {
        "codeQualite": "Membre",
        "libQualite": "Membre",
        "libQualiteSex": "Membre"
      },
      "organesRefs": [
        "PO747124"
      ]
    },
    {
      "xsiType": "MandatSimple_Type",
      "uid": "PM756803",
      "acteurRef": "PA722236",
      "legislature": "15",
      "typeOrgane": "CMP",
      "dateDebut": "2018-06-07T02:00:00.000+02:00",
      "datePublication": "2018-06-08T02:00:00.000+02:00",
      "dateFin": "2018-06-14T02:00:00.000+02:00",
      "preseance": "20",
      "nominPrincipale": "1",
      "infosQualite": {
        "codeQualite": "Titulaire",
        "libQualite": "Membre titulaire",
        "libQualiteSex": "Membre titulaire"
      },
      "organesRefs": [
        "PO756719"
      ]
    },
    {
      "xsiType": "MandatSimple_Type",
      "uid": "PM756844",
      "acteurRef": "PA722236",
      "legislature": "15",
      "typeOrgane": "CMP",
      "dateDebut": "2018-06-11T02:00:00.000+02:00",
      "datePublication": "2018-06-12T02:00:00.000+02:00",
      "dateFin": "2018-06-14T02:00:00.000+02:00",
      "preseance": "16",
      "nominPrincipale": "1",
      "infosQualite": {
        "codeQualite": "Rapporteur",
        "libQualite": "Rapporteur",
        "libQualiteSex": "Rapporteur"
      },
      "organesRefs": [
        "PO756719"
      ]
    },
    {
      "xsiType": "MandatMission_Type",
      "uid": "PM759343",
      "acteurRef": "PA722236",
      "legislature": "15",
      "typeOrgane": "MISINFO",
      "dateDebut": "2018-07-18T02:00:00.000+02:00",
      "dateFin": "2019-10-03T02:00:00.000+02:00",
      "preseance": "10",
      "nominPrincipale": "1",
      "infosQualite": {
        "codeQualite": "Membre",
        "libQualite": "Membre",
        "libQualiteSex": "Membre"
      },
      "organesRefs": [
        "PO758945"
      ]
    },
    {
      "xsiType": "MandatSimple_Type",
      "uid": "PM759966",
      "acteurRef": "PA722236",
      "legislature": "15",
      "typeOrgane": "GEVI",
      "dateDebut": "2018-10-25T02:00:00.000+02:00",
      "dateFin": "2019-10-03T02:00:00.000+02:00",
      "preseance": "20",
      "nominPrincipale": "1",
      "infosQualite": {
        "codeQualite": "Membre",
        "libQualite": "Membre",
        "libQualiteSex": "Membre"
      },
      "organesRefs": [
        "PO733622"
      ]
    },
    {
      "xsiType": "MandatSimple_Type",
      "uid": "PM760918",
      "acteurRef": "PA722236",
      "legislature": "15",
      "typeOrgane": "GE",
      "dateDebut": "2018-12-11T01:00:00.000+01:00",
      "dateFin": "2019-10-03T02:00:00.000+02:00",
      "preseance": "20",
      "nominPrincipale": "1",
      "infosQualite": {
        "codeQualite": "Membre",
        "libQualite": "Membre",
        "libQualiteSex": "Membre"
      },
      "organesRefs": [
        "PO747256"
      ]
    },
    {
      "xsiType": "MandatSimple_Type",
      "uid": "PM761507",
      "acteurRef": "PA722236",
      "typeOrgane": "PARPOL",
      "dateDebut": "2018-12-01T01:00:00.000+01:00",
      "preseance": "5",
      "nominPrincipale": "1",
      "infosQualite": {
        "codeQualite": "Membre",
        "libQualite": "Membre",
        "libQualiteSex": "Membre"
      },
      "organesRefs": [
        "PO761294"
      ]
    },
    {
      "xsiType": "MandatMission_Type",
      "uid": "PM762699",
      "acteurRef": "PA722236",
      "legislature": "15",
      "typeOrgane": "MISINFO",
      "dateDebut": "2019-02-13T01:00:00.000+01:00",
      "dateFin": "2019-04-12T02:00:00.000+02:00",
      "preseance": "10",
      "nominPrincipale": "0",
      "infosQualite": {
        "codeQualite": "Membre",
        "libQualite": "Membre",
        "libQualiteSex": "Membre"
      },
      "organesRefs": [
        "PO762674"
      ]
    },
    {
      "xsiType": "MandatMission_Type",
      "uid": "PM762700",
      "acteurRef": "PA722236",
      "legislature": "15",
      "typeOrgane": "MISINFO",
      "dateDebut": "2019-02-13T01:00:00.000+01:00",
      "dateFin": "2019-04-12T02:00:00.000+02:00",
      "preseance": "5",
      "nominPrincipale": "1",
      "infosQualite": {
        "codeQualite": "Co-rapporteur",
        "libQualite": "Co-rapporteur",
        "libQualiteSex": "Co-rapporteur"
      },
      "organesRefs": [
        "PO762674"
      ]
    },
    {
      "xsiType": "MandatSimple_Type",
      "uid": "PM763409",
      "acteurRef": "PA722236",
      "legislature": "15",
      "typeOrgane": "ORGEXTPARL",
      "dateDebut": "2019-03-14T01:00:00.000+01:00",
      "datePublication": "2019-03-15T01:00:00.000+01:00",
      "dateFin": "2019-10-03T02:00:00.000+02:00",
      "preseance": "20",
      "nominPrincipale": "1",
      "infosQualite": {
        "codeQualite": "Titulaire",
        "libQualite": "Membre titulaire",
        "libQualiteSex": "Membre titulaire"
      },
      "organesRefs": [
        "PO763346"
      ]
    },
    {
      "xsiType": "MandatSimple_Type",
      "uid": "PM766972",
      "acteurRef": "PA722236",
      "typeOrgane": "MINISTERE",
      "dateDebut": "2019-09-04T02:00:00.000+02:00",
      "datePublication": "2019-09-04T02:00:00.000+02:00",
      "preseance": "50",
      "nominPrincipale": "1",
      "infosQualite": {
        "codeQualite": "Secrétaire d'État",
        "libQualite": "Secrétaire d'État",
        "libQualiteSex": "Secrétaire d'État"
      },
      "organesRefs": [
        "PO766967"
      ]
    },
    {
      "xsiType": "MandatSimple_Type",
      "uid": "PM767285",
      "acteurRef": "PA722236",
      "legislature": "15",
      "typeOrgane": "COMPER",
      "dateDebut": "2019-10-01T02:00:00.000+02:00",
      "datePublication": "2019-10-01T02:00:00.000+02:00",
      "dateFin": "2019-10-03T02:00:00.000+02:00",
      "preseance": "32",
      "nominPrincipale": "1",
      "infosQualite": {
        "codeQualite": "Membre",
        "libQualite": "Membre",
        "libQualiteSex": "Membre"
      },
      "organesRefs": [
        "PO59046"
      ]
    },
    {
      "xsiType": "MandatSimple_Type",
      "uid": "PM15766972",
      "acteurRef": "PA722236",
      "typeOrgane": "GOUVERNEMENT",
      "dateDebut": "2019-09-04T02:00:00.000+02:00",
      "datePublication": "2019-09-04T02:00:00.000+02:00",
      "preseance": "50",
      "nominPrincipale": "1",
      "infosQualite": {
        "codeQualite": "membre",
        "libQualite": "membre",
        "libQualiteSex": "membre"
      },
      "organesRefs": [
        "PO725688"
      ]
    }
  ]
}