{
  "xsiType": "OrganeExterne_Type",
  "uid": "PO425754",
  "codeType": "MINISTERE",
  "libelle": "Ministère des sports",
  "libelleEdition": "des sports",
  "libelleAbrege": "Sports",
  "libelleAbrev": "SPO",
  "viMoDe": {
    "dateDebut": "2010-11-14T01:00:00.000+01:00",
    "dateFin": "2012-05-10T02:00:00.000+02:00"
  },
  "organeParentRef": "PO425695"
}