{
  "xsiType": "OrganeExterne_Type",
  "uid": "PO744860",
  "codeType": "PARPOL",
  "libelle": "Tapura Huiraatira",
  "libelleEdition": "Tapura Huiraatira",
  "libelleAbrege": "Tapura Huiraatira",
  "libelleAbrev": "TPH",
  "viMoDe": {}
}