{
  "uid": "PA718918",
  "etatCivil": {
    "ident": {
      "civ": "Mme",
      "prenom": "Alexandra",
      "nom": "Louis",
      "alpha": "Louis",
      "trigramme": "ALO"
    },
    "infoNaissance": {
      "dateNais": "1983-09-17T02:00:00.000+02:00",
      "villeNais": "Grenoble",
      "depNais": "Isère",
      "paysNais": "France"
    }
  },
  "profession": {
    "libelleCourant": "Avocat",
    "socProcInsee": {
      "catSocPro": "Professions libérales et assimilés",
      "famSocPro": "Cadres et professions intellectuelles supérieures"
    }
  },
  "uriHatvp": "https://www.hatvp.fr/pages_nominatives/louis-alexandra",
  "adresses": [
    {
      "xsiType": "AdressePostale_Type",
      "uid": "AD718920",
      "type": "0",
      "typeLibelle": "Adresse officielle",
      "poids": "1",
      "intitule": "Assemblée nationale,",
      "numeroRue": "126",
      "nomRue": "Rue de l'Université,",
      "codePostal": "75355",
      "ville": "Paris 07 SP"
    },
    {
      "xsiType": "AdresseMail_Type",
      "uid": "AD727987",
      "type": "15",
      "typeLibelle": "Mèl",
      "valElec": "alexandra.louis@assemblee-nationale.fr"
    }
  ],
  "mandats": [
    {
      "xsiType": "MandatParlementaire_type",
      "uid": "PM722500",
      "acteurRef": "PA718918",
      "legislature": "15",
      "typeOrgane": "ASSEMBLEE",
      "dateDebut": "2017-06-18T02:00:00.000+02:00",
      "preseance": "50",
      "nominPrincipale": "1",
      "infosQualite": {
        "codeQualite": "membre",
        "libQualite": "membre",
        "libQualiteSex": "membre"
      },
      "organesRefs": [
        "PO717460"
      ],
      "suppleant": {
        "dateDebut": "2017-06-18T02:00:00.000+02:00",
        "suppleantRef": "PA718922"
      },
      "election": {
        "lieu": {
          "region": "Provence-Alpes-Côte d'Azur",
          "regionType": "Métropolitain",
          "departement": "Bouches-du-Rhône",
          "numDepartement": "13",
          "numCirco": "3"
        },
        "causeMandat": "élections générales",
        "refCirconscription": "PO717568"
      },
      "mandature": {
        "datePriseFonction": "2017-06-21T02:00:00.000+02:00",
        "premiereElection": "0",
        "placeHemicycle": "456"
      },
      "collaborateurs": [
        {
          "qualite": "M.",
          "prenom": "Guillaume",
          "nom": "Jesberger"
        },
        {
          "qualite": "Mme",
          "prenom": "Céline",
          "nom": "Fabre"
        },
        {
          "qualite": "M.",
          "prenom": "Wiktor",
          "nom": "Zamojski"
        },
        {
          "qualite": "Mme",
          "prenom": "Hélène",
          "nom": "Canari"
        }
      ]
    },
    {
      "xsiType": "MandatSimple_Type",
      "uid": "PM724291",
      "acteurRef": "PA718918",
      "legislature": "15",
      "typeOrgane": "GP",
      "dateDebut": "2017-06-21T02:00:00.000+02:00",
      "dateFin": "2017-06-26T02:00:00.000+02:00",
      "preseance": "28",
      "nominPrincipale": "1",
      "infosQualite": {
        "codeQualite": "Député non-inscrit",
        "libQualite": "Député non-inscrit",
        "libQualiteSex": "Députée non-inscrite"
      },
      "organesRefs": [
        "PO723569"
      ]
    },
    {
      "xsiType": "MandatSimple_Type",
      "uid": "PM730995",
      "acteurRef": "PA718918",
      "legislature": "15",
      "typeOrgane": "GP",
      "dateDebut": "2017-06-27T02:00:00.000+02:00",
      "datePublication": "2017-06-28T02:00:00.000+02:00",
      "preseance": "20",
      "nominPrincipale": "1",
      "infosQualite": {
        "codeQualite": "Membre",
        "libQualite": "Membre du",
        "libQualiteSex": "Membre du"
      },
      "organesRefs": [
        "PO730964"
      ]
    },
    {
      "xsiType": "MandatSimple_Type",
      "uid": "PM731874",
      "acteurRef": "PA718918",
      "legislature": "15",
      "typeOrgane": "COMPER",
      "dateDebut": "2017-06-29T02:00:00.000+02:00",
      "datePublication": "2017-06-29T02:00:00.000+02:00",
      "preseance": "32",
      "nominPrincipale": "1",
      "infosQualite": {
        "codeQualite": "Membre",
        "libQualite": "Membre",
        "libQualiteSex": "Membre"
      },
      "organesRefs": [
        "PO59051"
      ]
    },
    {
      "xsiType": "MandatSimple_Type",
      "uid": "PM734397",
      "acteurRef": "PA718918",
      "legislature": "15",
      "typeOrgane": "API",
      "dateDebut": "2017-08-02T02:00:00.000+02:00",
      "datePublication": "2017-08-03T02:00:00.000+02:00",
      "preseance": "20",
      "nominPrincipale": "1",
      "infosQualite": {
        "codeQualite": "Titulaire",
        "libQualite": "Membre titulaire",
        "libQualiteSex": "Membre titulaire"
      },
      "organesRefs": [
        "PO304272"
      ]
    },
    {
      "xsiType": "MandatSimple_Type",
      "uid": "PM735362",
      "acteurRef": "PA718918",
      "legislature": "15",
      "typeOrgane": "GA",
      "dateDebut": "2017-09-26T02:00:00.000+02:00",
      "preseance": "20",
      "nominPrincipale": "0",
      "infosQualite": {
        "codeQualite": "Membre",
        "libQualite": "Membre",
        "libQualiteSex": "Membre"
      },
      "organesRefs": [
        "PO733182"
      ]
    },
    {
      "xsiType": "MandatSimple_Type",
      "uid": "PM735363",
      "acteurRef": "PA718918",
      "legislature": "15",
      "typeOrgane": "GA",
      "dateDebut": "2017-09-26T02:00:00.000+02:00",
      "preseance": "1",
      "nominPrincipale": "1",
      "infosQualite": {
        "codeQualite": "Président",
        "libQualite": "Président",
        "libQualiteSex": "Présidente"
      },
      "organesRefs": [
        "PO733182"
      ]
    },
    {
      "xsiType": "MandatSimple_Type",
      "uid": "PM737778",
      "acteurRef": "PA718918",
      "legislature": "15",
      "typeOrgane": "GA",
      "dateDebut": "2017-10-05T02:00:00.000+02:00",
      "preseance": "20",
      "nominPrincipale": "0",
      "infosQualite": {
        "codeQualite": "Membre",
        "libQualite": "Membre",
        "libQualiteSex": "Membre"
      },
      "organesRefs": [
        "PO732954"
      ]
    },
    {
      "xsiType": "MandatSimple_Type",
      "uid": "PM737779",
      "acteurRef": "PA718918",
      "legislature": "15",
      "typeOrgane": "GA",
      "dateDebut": "2017-10-05T02:00:00.000+02:00",
      "preseance": "20",
      "nominPrincipale": "1",
      "infosQualite": {
        "codeQualite": "Membre",
        "libQualite": "Membre",
        "libQualiteSex": "Membre"
      },
      "organesRefs": [
        "PO733057"
      ]
    },
    {
      "xsiType": "MandatSimple_Type",
      "uid": "PM737780",
      "acteurRef": "PA718918",
      "legislature": "15",
      "typeOrgane": "GA",
      "dateDebut": "2017-10-05T02:00:00.000+02:00",
      "preseance": "20",
      "nominPrincipale": "1",
      "infosQualite": {
        "codeQualite": "Membre",
        "libQualite": "Membre",
        "libQualiteSex": "Membre"
      },
      "organesRefs": [
        "PO733317"
      ]
    },
    {
      "xsiType": "MandatSimple_Type",
      "uid": "PM737781",
      "acteurRef": "PA718918",
      "legislature": "15",
      "typeOrgane": "GA",
      "dateDebut": "2017-10-05T02:00:00.000+02:00",
      "preseance": "20",
      "nominPrincipale": "1",
      "infosQualite": {
        "codeQualite": "Membre",
        "libQualite": "Membre",
        "libQualiteSex": "Membre"
      },
      "organesRefs": [
        "PO733342"
      ]
    },
    {
      "xsiType": "MandatSimple_Type",
      "uid": "PM737782",
      "acteurRef": "PA718918",
      "legislature": "15",
      "typeOrgane": "GA",
      "dateDebut": "2017-10-05T02:00:00.000+02:00",
      "preseance": "20",
      "nominPrincipale": "1",
      "infosQualite": {
        "codeQualite": "Membre",
        "libQualite": "Membre",
        "libQualiteSex": "Membre"
      },
      "organesRefs": [
        "PO733417"
      ]
    },
    {
      "xsiType": "MandatSimple_Type",
      "uid": "PM737783",
      "acteurRef": "PA718918",
      "legislature": "15",
      "typeOrgane": "GA",
      "dateDebut": "2017-10-05T02:00:00.000+02:00",
      "preseance": "20",
      "nominPrincipale": "1",
      "infosQualite": {
        "codeQualite": "Membre",
        "libQualite": "Membre",
        "libQualiteSex": "Membre"
      },
      "organesRefs": [
        "PO733452"
      ]
    },
    {
      "xsiType": "MandatSimple_Type",
      "uid": "PM737784",
      "acteurRef": "PA718918",
      "legislature": "15",
      "typeOrgane": "GA",
      "dateDebut": "2017-10-05T02:00:00.000+02:00",
      "preseance": "20",
      "nominPrincipale": "1",
      "infosQualite": {
        "codeQualite": "Membre",
        "libQualite": "Membre",
        "libQualiteSex": "Membre"
      },
      "organesRefs": [
        "PO733472"
      ]
    },
    {
      "xsiType": "MandatSimple_Type",
      "uid": "PM737785",
      "acteurRef": "PA718918",
      "legislature": "15",
      "typeOrgane": "GA",
      "dateDebut": "2017-10-05T02:00:00.000+02:00",
      "preseance": "20",
      "nominPrincipale": "1",
      "infosQualite": {
        "codeQualite": "Membre",
        "libQualite": "Membre",
        "libQualiteSex": "Membre"
      },
      "organesRefs": [
        "PO733517"
      ]
    },
    {
      "xsiType": "MandatSimple_Type",
      "uid": "PM740148",
      "acteurRef": "PA718918",
      "legislature": "15",
      "typeOrgane": "GA",
      "dateDebut": "2017-10-13T02:00:00.000+02:00",
      "preseance": "20",
      "nominPrincipale": "1",
      "infosQualite": {
        "codeQualite": "Membre",
        "libQualite": "Membre",
        "libQualiteSex": "Membre"
      },
      "organesRefs": [
        "PO733312"
      ]
    },
    {
      "xsiType": "MandatSimple_Type",
      "uid": "PM742085",
      "acteurRef": "PA718918",
      "legislature": "15",
      "typeOrgane": "API",
      "dateDebut": "2017-10-27T02:00:00.000+02:00",
      "datePublication": "2017-10-28T02:00:00.000+02:00",
      "preseance": "20",
      "nominPrincipale": "1",
      "infosQualite": {
        "codeQualite": "Membre",
        "libQualite": "Membre",
        "libQualiteSex": "Membre"
      },
      "organesRefs": [
        "PO201115"
      ]
    },
    {
      "xsiType": "MandatSimple_Type",
      "uid": "PM743043",
      "acteurRef": "PA718918",
      "legislature": "15",
      "typeOrgane": "ORGEXTPARL",
      "dateDebut": "2017-11-10T01:00:00.000+01:00",
      "datePublication": "2017-11-11T01:00:00.000+01:00",
      "preseance": "20",
      "nominPrincipale": "1",
      "infosQualite": {
        "codeQualite": "Titulaire",
        "libQualite": "Membre titulaire",
        "libQualiteSex": "Membre titulaire"
      },
      "organesRefs": [
        "PO425949"
      ]
    },
    {
      "xsiType": "MandatAvecSuppleant_Type",
      "uid": "PM743399",
      "acteurRef": "PA718918",
      "legislature": "15",
      "typeOrgane": "CJR",
      "dateDebut": "2017-11-14T01:00:00.000+01:00",
      "datePublication": "2017-11-15T01:00:00.000+01:00",
      "preseance": "5",
      "nominPrincipale": "1",
      "infosQualite": {
        "codeQualite": "Juge suppléant",
        "libQualite": "Juge suppléant",
        "libQualiteSex": "Juge suppléant"
      },
      "organesRefs": [
        "PO58996"
      ]
    },
    {
      "xsiType": "MandatSimple_Type",
      "uid": "PM745237",
      "acteurRef": "PA718918",
      "typeOrgane": "PARPOL",
      "dateDebut": "2017-12-01T01:00:00.000+01:00",
      "dateFin": "2018-11-30T01:00:00.000+01:00",
      "preseance": "5",
      "nominPrincipale": "1",
      "infosQualite": {
        "codeQualite": "Membre",
        "libQualite": "Membre",
        "libQualiteSex": "Membre"
      },
      "organesRefs": [
        "PO744854"
      ]
    },
    {
      "xsiType": "MandatSimple_Type",
      "uid": "PM748499",
      "acteurRef": "PA718918",
      "legislature": "15",
      "typeOrgane": "GE",
      "dateDebut": "2018-02-01T01:00:00.000+01:00",
      "preseance": "20",
      "nominPrincipale": "0",
      "infosQualite": {
        "codeQualite": "Membre",
        "libQualite": "Membre",
        "libQualiteSex": "Membre"
      },
      "organesRefs": [
        "PO746806"
      ]
    },
    {
      "xsiType": "MandatSimple_Type",
      "uid": "PM748502",
      "acteurRef": "PA718918",
      "legislature": "15",
      "typeOrgane": "GE",
      "dateDebut": "2018-02-01T01:00:00.000+01:00",
      "preseance": "4",
      "nominPrincipale": "1",
      "infosQualite": {
        "codeQualite": "Co-Président",
        "libQualite": "Co-Président",
        "libQualiteSex": "Co-Présidente"
      },
      "organesRefs": [
        "PO746806"
      ]
    },
    {
      "xsiType": "MandatMission_Type",
      "uid": "PM750168",
      "acteurRef": "PA718918",
      "legislature": "15",
      "typeOrgane": "MISINFO",
      "dateDebut": "2018-02-14T01:00:00.000+01:00",
      "preseance": "10",
      "nominPrincipale": "1",
      "infosQualite": {
        "codeQualite": "Membre",
        "libQualite": "Membre",
        "libQualiteSex": "Membre"
      },
      "organesRefs": [
        "PO750141"
      ]
    },
    {
      "xsiType": "MandatSimple_Type",
      "uid": "PM751985",
      "acteurRef": "PA718918",
      "legislature": "15",
      "typeOrgane": "GE",
      "dateDebut": "2018-02-23T01:00:00.000+01:00",
      "preseance": "20",
      "nominPrincipale": "1",
      "infosQualite": {
        "codeQualite": "Membre",
        "libQualite": "Membre",
        "libQualiteSex": "Membre"
      },
      "organesRefs": [
        "PO747205"
      ]
    },
    {
      "xsiType": "MandatMission_Type",
      "uid": "PM756742",
      "acteurRef": "PA718918",
      "legislature": "15",
      "typeOrgane": "MISINFO",
      "dateDebut": "2018-04-11T02:00:00.000+02:00",
      "dateFin": "2019-02-20T01:00:00.000+01:00",
      "preseance": "10",
      "nominPrincipale": "1",
      "infosQualite": {
        "codeQualite": "Membre",
        "libQualite": "Membre",
        "libQualiteSex": "Membre"
      },
      "organesRefs": [
        "PO754002"
      ]
    },
    {
      "xsiType": "MandatSimple_Type",
      "uid": "PM756941",
      "acteurRef": "PA718918",
      "legislature": "15",
      "typeOrgane": "ORGEXTPARL",
      "dateDebut": "2018-03-08T01:00:00.000+01:00",
      "datePublication": "2018-03-09T01:00:00.000+01:00",
      "preseance": "20",
      "nominPrincipale": "1",
      "infosQualite": {
        "codeQualite": "Titulaire",
        "libQualite": "Membre titulaire",
        "libQualiteSex": "Membre titulaire"
      },
      "organesRefs": [
        "PO756933"
      ]
    },
    {
      "xsiType": "MandatSimple_Type",
      "uid": "PM758277",
      "acteurRef": "PA718918",
      "legislature": "15",
      "typeOrgane": "CMP",
      "dateDebut": "2018-07-19T02:00:00.000+02:00",
      "datePublication": "2018-07-20T02:00:00.000+02:00",
      "dateFin": "2018-08-01T02:00:00.000+02:00",
      "preseance": "20",
      "nominPrincipale": "1",
      "infosQualite": {
        "codeQualite": "Titulaire",
        "libQualite": "Membre titulaire",
        "libQualiteSex": "Membre titulaire"
      },
      "organesRefs": [
        "PO757668"
      ]
    },
    {
      "xsiType": "MandatSimple_Type",
      "uid": "PM758334",
      "acteurRef": "PA718918",
      "legislature": "15",
      "typeOrgane": "CMP",
      "dateDebut": "2018-07-23T02:00:00.000+02:00",
      "datePublication": "2018-07-24T02:00:00.000+02:00",
      "dateFin": "2018-08-01T02:00:00.000+02:00",
      "preseance": "16",
      "nominPrincipale": "1",
      "infosQualite": {
        "codeQualite": "Rapporteur",
        "libQualite": "Rapporteur",
        "libQualiteSex": "Rapporteure"
      },
      "organesRefs": [
        "PO757668"
      ]
    },
    {
      "xsiType": "MandatSimple_Type",
      "uid": "PM761599",
      "acteurRef": "PA718918",
      "typeOrgane": "PARPOL",
      "dateDebut": "2018-12-01T01:00:00.000+01:00",
      "preseance": "5",
      "nominPrincipale": "1",
      "infosQualite": {
        "codeQualite": "Membre",
        "libQualite": "Membre",
        "libQualiteSex": "Membre"
      },
      "organesRefs": [
        "PO761294"
      ]
    },
    {
      "xsiType": "MandatSimple_Type",
      "uid": "PM762736",
      "acteurRef": "PA718918",
      "legislature": "15",
      "typeOrgane": "GA",
      "dateDebut": "2019-02-14T01:00:00.000+01:00",
      "preseance": "8",
      "nominPrincipale": "1",
      "infosQualite": {
        "codeQualite": "Vice-Président",
        "libQualite": "Vice-Président",
        "libQualiteSex": "Vice-Présidente"
      },
      "organesRefs": [
        "PO732954"
      ]
    },
    {
      "xsiType": "MandatSimple_Type",
      "uid": "PM767611",
      "acteurRef": "PA718918",
      "legislature": "15",
      "typeOrgane": "CNPE",
      "dateDebut": "2019-10-18T02:00:00.000+02:00",
      "datePublication": "2019-10-19T02:00:00.000+02:00",
      "preseance": "20",
      "nominPrincipale": "1",
      "infosQualite": {
        "codeQualite": "Membre",
        "libQualite": "Membre",
        "libQualiteSex": "Membre"
      },
      "organesRefs": [
        "PO767517"
      ]
    }
  ]
}