{
  "uid": "PA266837",
  "etatCivil": {
    "ident": {
      "civ": "M.",
      "prenom": "Jacques",
      "nom": "Houssin",
      "alpha": "Houssin"
    },
    "infoNaissance": {
      "dateNais": "1964-02-16T01:00:00.000+01:00",
      "villeNais": "Lille",
      "depNais": "Nord",
      "paysNais": "France"
    }
  },
  "profession": {
    "libelleCourant": "Hôtelier",
    "socProcInsee": {
      "catSocPro": "Chefs d'entreprise de 10 salariés ou plus",
      "famSocPro": "Artisans, commerçants et chefs d'entreprise"
    }
  },
  "adresses": [
    {
      "xsiType": "AdressePostale_Type",
      "uid": "AD301538",
      "type": "0",
      "typeLibelle": "Adresse officielle",
      "poids": "1",
      "intitule": "Assemblée nationale",
      "numeroRue": "126",
      "nomRue": "Rue de l'Université",
      "codePostal": "75355",
      "ville": "Paris 07 SP"
    },
    {
      "xsiType": "AdresseMail_Type",
      "uid": "AD301897",
      "type": "15",
      "typeLibelle": "Mèl",
      "valElec": "cg@jacqueshoussin.fr"
    },
    {
      "xsiType": "AdressePostale_Type",
      "uid": "AD301898",
      "type": "2",
      "typeLibelle": "Adresse publiée de circonscription",
      "poids": "21",
      "intitule": "Mairie",
      "nomRue": "Place du Général de Gaulle",
      "complementAdresse": "BP 209",
      "codePostal": "59832",
      "ville": "Verlinghem cedex"
    },
    {
      "xsiType": "AdresseTelephonique_Type",
      "uid": "AD301899",
      "type": "11",
      "typeLibelle": "Téléphone",
      "poids": "21",
      "adresseDeRattachement": "AD301898",
      "valElec": "03 20 30 69 30"
    },
    {
      "xsiType": "AdresseTelephonique_Type",
      "uid": "AD301900",
      "type": "12",
      "typeLibelle": "Télécopie",
      "poids": "21",
      "adresseDeRattachement": "AD301898",
      "valElec": "03 20 30 69 69"
    },
    {
      "xsiType": "AdresseMail_Type",
      "uid": "AD303522",
      "type": "15",
      "typeLibelle": "Mèl",
      "valElec": "jhoussin@assemblee-nationale.fr"
    },
    {
      "xsiType": "AdresseSiteWeb_Type",
      "uid": "AD423827",
      "type": "22",
      "typeLibelle": "Site internet",
      "valElec": "www.jacqueshoussin.fr"
    }
  ],
  "mandats": [
    {
      "xsiType": "MandatParlementaire_type",
      "uid": "PM423740",
      "acteurRef": "PA266837",
      "legislature": "13",
      "typeOrgane": "ASSEMBLEE",
      "dateDebut": "2007-06-20T02:00:00.000+02:00",
      "dateFin": "2010-12-14T01:00:00.000+01:00",
      "preseance": "50",
      "nominPrincipale": "1",
      "infosQualite": {
        "codeQualite": "membre",
        "libQualite": "membre",
        "libQualiteSex": "membre"
      },
      "organesRefs": [
        "PO384266"
      ],
      "election": {
        "lieu": {
          "region": "Hauts-de-France",
          "regionType": "Métropolitain",
          "departement": "Nord",
          "numDepartement": "59",
          "numCirco": "4"
        },
        "causeMandat": "remplacement d'un député nommé au Gouvernement",
        "refCirconscription": "PO384546"
      },
      "mandature": {
        "datePriseFonction": "2010-04-23T02:00:00.000+02:00",
        "causeFin": "Reprise de l'exercice du mandat d'un ancien membre du Gouvernement",
        "premiereElection": "1"
      }
    },
    {
      "xsiType": "MandatSimple_Type",
      "uid": "PM423747",
      "acteurRef": "PA266837",
      "legislature": "13",
      "typeOrgane": "GP",
      "dateDebut": "2010-04-23T02:00:00.000+02:00",
      "datePublication": "2010-03-24T01:00:00.000+01:00",
      "dateFin": "2010-12-14T01:00:00.000+01:00",
      "preseance": "20",
      "nominPrincipale": "1",
      "infosQualite": {
        "codeQualite": "Membre",
        "libQualite": "Membre du",
        "libQualiteSex": "Membre du"
      },
      "organesRefs": [
        "PO389395"
      ]
    },
    {
      "xsiType": "MandatSimple_Type",
      "uid": "PM423750",
      "acteurRef": "PA266837",
      "legislature": "13",
      "typeOrgane": "COMPER",
      "dateDebut": "2010-04-24T02:00:00.000+02:00",
      "datePublication": "2010-04-24T02:00:00.000+02:00",
      "dateFin": "2010-12-14T01:00:00.000+01:00",
      "preseance": "32",
      "nominPrincipale": "1",
      "infosQualite": {
        "codeQualite": "Membre",
        "libQualite": "Membre",
        "libQualiteSex": "Membre"
      },
      "organesRefs": [
        "PO419865"
      ]
    },
    {
      "xsiType": "MandatSimple_Type",
      "uid": "PM424071",
      "acteurRef": "PA266837",
      "legislature": "13",
      "typeOrgane": "GA",
      "dateDebut": "2010-05-19T02:00:00.000+02:00",
      "dateFin": "2010-12-14T01:00:00.000+01:00",
      "preseance": "20",
      "nominPrincipale": "1",
      "infosQualite": {
        "codeQualite": "Membre",
        "libQualite": "Membre",
        "libQualiteSex": "Membre"
      },
      "organesRefs": [
        "PO392840"
      ]
    },
    {
      "xsiType": "MandatSimple_Type",
      "uid": "PM424072",
      "acteurRef": "PA266837",
      "legislature": "13",
      "typeOrgane": "GA",
      "dateDebut": "2010-05-19T02:00:00.000+02:00",
      "dateFin": "2010-12-14T01:00:00.000+01:00",
      "preseance": "20",
      "nominPrincipale": "1",
      "infosQualite": {
        "codeQualite": "Membre",
        "libQualite": "Membre",
        "libQualiteSex": "Membre"
      },
      "organesRefs": [
        "PO393040"
      ]
    },
    {
      "xsiType": "MandatSimple_Type",
      "uid": "PM424073",
      "acteurRef": "PA266837",
      "legislature": "13",
      "typeOrgane": "GA",
      "dateDebut": "2010-05-19T02:00:00.000+02:00",
      "dateFin": "2010-12-14T01:00:00.000+01:00",
      "preseance": "20",
      "nominPrincipale": "1",
      "infosQualite": {
        "codeQualite": "Membre",
        "libQualite": "Membre",
        "libQualiteSex": "Membre"
      },
      "organesRefs": [
        "PO393263"
      ]
    },
    {
      "xsiType": "MandatSimple_Type",
      "uid": "PM424080",
      "acteurRef": "PA266837",
      "legislature": "13",
      "typeOrgane": "GA",
      "dateDebut": "2010-05-21T02:00:00.000+02:00",
      "dateFin": "2010-12-14T01:00:00.000+01:00",
      "preseance": "20",
      "nominPrincipale": "1",
      "infosQualite": {
        "codeQualite": "Membre",
        "libQualite": "Membre",
        "libQualiteSex": "Membre"
      },
      "organesRefs": [
        "PO392750"
      ]
    },
    {
      "xsiType": "MandatSimple_Type",
      "uid": "PM424081",
      "acteurRef": "PA266837",
      "legislature": "13",
      "typeOrgane": "GA",
      "dateDebut": "2010-05-21T02:00:00.000+02:00",
      "dateFin": "2010-12-14T01:00:00.000+01:00",
      "preseance": "20",
      "nominPrincipale": "1",
      "infosQualite": {
        "codeQualite": "Membre",
        "libQualite": "Membre",
        "libQualiteSex": "Membre"
      },
      "organesRefs": [
        "PO392950"
      ]
    },
    {
      "xsiType": "MandatSimple_Type",
      "uid": "PM424082",
      "acteurRef": "PA266837",
      "legislature": "13",
      "typeOrgane": "GA",
      "dateDebut": "2010-05-21T02:00:00.000+02:00",
      "dateFin": "2010-12-14T01:00:00.000+01:00",
      "preseance": "20",
      "nominPrincipale": "1",
      "infosQualite": {
        "codeQualite": "Membre",
        "libQualite": "Membre",
        "libQualiteSex": "Membre"
      },
      "organesRefs": [
        "PO393508"
      ]
    },
    {
      "xsiType": "MandatSimple_Type",
      "uid": "PM424083",
      "acteurRef": "PA266837",
      "legislature": "13",
      "typeOrgane": "GEVI",
      "dateDebut": "2010-05-21T02:00:00.000+02:00",
      "dateFin": "2010-12-14T01:00:00.000+01:00",
      "preseance": "20",
      "nominPrincipale": "1",
      "infosQualite": {
        "codeQualite": "Membre",
        "libQualite": "Membre",
        "libQualiteSex": "Membre"
      },
      "organesRefs": [
        "PO393433"
      ]
    }
  ]
}