{
  "xsiType": "OrganeExterne_Type",
  "uid": "PO700730",
  "codeType": "MINISTERE",
  "libelle": "Ministère des affaires sociales et de la santé",
  "libelleEdition": "des affaires sociales et de la santé",
  "libelleAbrege": "Affaires sociales",
  "libelleAbrev": "ASO",
  "viMoDe": {
    "dateDebut": "2014-04-03T02:00:00.000+02:00",
    "dateFin": "2014-08-26T02:00:00.000+02:00"
  },
  "organeParentRef": "PO700706"
}