{
  "uid": "PA2557",
  "etatCivil": {
    "ident": {
      "civ": "M.",
      "prenom": "Philippe",
      "nom": "Richert",
      "alpha": "RICHERT"
    },
    "infoNaissance": {
      "dateNais": "1953-05-22T01:00:00.000+01:00"
    }
  },
  "profession": {
    "socProcInsee": {
      "catSocPro": "Professions intermédiaires de l'enseignement, de la santé, de la fonction publique et assimilés",
      "famSocPro": "Professions Intermédiaires"
    }
  },
  "adresses": [
    {
      "xsiType": "AdresseSiteWeb_Type",
      "uid": "AD322640",
      "type": "23",
      "typeLibelle": "Url sénateur",
      "valElec": "https://www.senat.fr/senateur/richert_philippe92005m.html"
    }
  ],
  "mandats": [
    {
      "xsiType": "MandatParlementaire_type",
      "uid": "PM310449",
      "acteurRef": "PA2557",
      "typeOrgane": "SENAT",
      "dateDebut": "2005-02-21T01:00:00.000+01:00",
      "datePublication": "2005-02-22T01:00:00.000+01:00",
      "dateFin": "2010-12-14T01:00:00.000+01:00",
      "preseance": "20",
      "nominPrincipale": "1",
      "infosQualite": {
        "codeQualite": "Sénateur",
        "libQualite": "SENATEUR",
        "libQualiteSex": "SENATEUR"
      },
      "organesRefs": [
        "PO78718"
      ],
      "election": {
        "lieu": {
          "numDepartement": "67"
        }
      },
      "mandature": {
        "premiereElection": "0"
      }
    },
    {
      "xsiType": "MandatParlementaire_type",
      "uid": "PM318155",
      "acteurRef": "PA2557",
      "typeOrgane": "SENAT",
      "dateDebut": "2005-03-02T01:00:00.000+01:00",
      "dateFin": "2008-10-06T02:00:00.000+02:00",
      "nominPrincipale": "1",
      "infosQualite": {
        "libQualite": "Vice-président",
        "libQualiteSex": "Vice-président"
      },
      "organesRefs": [
        "PO78718"
      ],
      "election": {
        "lieu": {}
      },
      "mandature": {
        "premiereElection": "0"
      }
    },
    {
      "xsiType": "MandatSimple_Type",
      "uid": "PM318622",
      "acteurRef": "PA2557",
      "typeOrgane": "GROUPESENAT",
      "dateDebut": "2005-02-22T01:00:00.000+01:00",
      "dateFin": "2010-12-14T01:00:00.000+01:00",
      "preseance": "4",
      "nominPrincipale": "1",
      "infosQualite": {
        "codeQualite": "Membre",
        "libQualite": "Membre",
        "libQualiteSex": "Membre"
      },
      "organesRefs": [
        "PO286005"
      ]
    },
    {
      "xsiType": "MandatSimple_Type",
      "uid": "PM320209",
      "acteurRef": "PA2557",
      "typeOrgane": "COMSENAT",
      "dateDebut": "2005-03-01T01:00:00.000+01:00",
      "dateFin": "2010-12-14T01:00:00.000+01:00",
      "preseance": "10",
      "nominPrincipale": "1",
      "infosQualite": {
        "codeQualite": "Membre",
        "libQualite": "Membre",
        "libQualiteSex": "Membre"
      },
      "organesRefs": [
        "PO211490"
      ]
    },
    {
      "xsiType": "MandatSimple_Type",
      "uid": "PM414876",
      "acteurRef": "PA2557",
      "typeOrgane": "CMP",
      "dateDebut": "2008-07-18T02:00:00.000+02:00",
      "datePublication": "2008-07-19T02:00:00.000+02:00",
      "dateFin": "2008-07-23T02:00:00.000+02:00",
      "preseance": "20",
      "nominPrincipale": "1",
      "infosQualite": {
        "codeQualite": "Titulaire",
        "libQualite": "Membre titulaire",
        "libQualiteSex": "Membre titulaire"
      },
      "organesRefs": [
        "PO414843"
      ]
    },
    {
      "xsiType": "MandatSimple_Type",
      "uid": "PM415034",
      "acteurRef": "PA2557",
      "typeOrgane": "CMP",
      "dateDebut": "2008-07-22T02:00:00.000+02:00",
      "datePublication": "2008-07-23T02:00:00.000+02:00",
      "dateFin": "2008-07-23T02:00:00.000+02:00",
      "preseance": "16",
      "nominPrincipale": "1",
      "infosQualite": {
        "codeQualite": "Rapporteur",
        "libQualite": "Rapporteur",
        "libQualiteSex": "Rapporteur"
      },
      "organesRefs": [
        "PO414843"
      ]
    },
    {
      "xsiType": "MandatParlementaire_type",
      "uid": "PM415876",
      "acteurRef": "PA2557",
      "typeOrgane": "SENAT",
      "dateDebut": "2008-10-07T02:00:00.000+02:00",
      "dateFin": "2010-11-25T01:00:00.000+01:00",
      "nominPrincipale": "1",
      "infosQualite": {
        "libQualite": "Questeur",
        "libQualiteSex": "Questeur"
      },
      "organesRefs": [
        "PO78718"
      ],
      "election": {
        "lieu": {}
      },
      "mandature": {
        "premiereElection": "0"
      }
    },
    {
      "xsiType": "MandatSimple_Type",
      "uid": "PM425764",
      "acteurRef": "PA2557",
      "typeOrgane": "MINISTERE",
      "dateDebut": "2010-11-14T01:00:00.000+01:00",
      "datePublication": "2010-11-16T01:00:00.000+01:00",
      "dateFin": "2012-05-10T02:00:00.000+02:00",
      "preseance": "30",
      "nominPrincipale": "1",
      "infosQualite": {
        "codeQualite": "Ministre",
        "libQualite": "Ministre",
        "libQualiteSex": "Ministre"
      },
      "organesRefs": [
        "PO425740"
      ]
    },
    {
      "xsiType": "MandatSimple_Type",
      "uid": "PM15425764",
      "acteurRef": "PA2557",
      "typeOrgane": "GOUVERNEMENT",
      "dateDebut": "2010-11-14T01:00:00.000+01:00",
      "datePublication": "2010-11-16T01:00:00.000+01:00",
      "dateFin": "2012-05-10T02:00:00.000+02:00",
      "preseance": "50",
      "nominPrincipale": "1",
      "infosQualite": {
        "codeQualite": "membre",
        "libQualite": "membre",
        "libQualiteSex": "membre"
      },
      "organesRefs": [
        "PO425695"
      ]
    }
  ]
}