{
  "uid": "PA492",
  "etatCivil": {
    "ident": {
      "civ": "M.",
      "prenom": "Roger",
      "nom": "Besse",
      "alpha": "BESSE ROGER"
    },
    "infoNaissance": {
      "dateNais": "1929-08-18T01:00:00.000+01:00"
    },
    "dateDeces": "2009-01-07T01:00:00.000+01:00"
  },
  "profession": {
    "socProcInsee": {}
  },
  "adresses": [
    {
      "xsiType": "AdresseSiteWeb_Type",
      "uid": "AD317443",
      "type": "23",
      "typeLibelle": "Url sénateur",
      "valElec": "https://www.senat.fr/senateur/besse_roger89010j.html"
    }
  ],
  "mandats": [
    {
      "xsiType": "MandatParlementaire_type",
      "uid": "PM89479",
      "acteurRef": "PA492",
      "typeOrgane": "SENAT",
      "dateDebut": "1998-10-01T02:00:00.000+02:00",
      "datePublication": "1998-10-02T02:00:00.000+02:00",
      "dateFin": "2008-09-30T02:00:00.000+02:00",
      "preseance": "20",
      "nominPrincipale": "1",
      "infosQualite": {
        "codeQualite": "Sénateur",
        "libQualite": "SENATEUR",
        "libQualiteSex": "SENATEUR"
      },
      "organesRefs": [
        "PO78718"
      ],
      "election": {
        "lieu": {
          "numDepartement": "15"
        }
      },
      "mandature": {
        "premiereElection": "0"
      }
    },
    {
      "xsiType": "MandatSimple_Type",
      "uid": "PM286439",
      "acteurRef": "PA492",
      "typeOrgane": "GROUPESENAT",
      "dateDebut": "2002-12-11T01:00:00.000+01:00",
      "datePublication": "2002-12-11T01:00:00.000+01:00",
      "dateFin": "2008-09-30T02:00:00.000+02:00",
      "preseance": "4",
      "nominPrincipale": "1",
      "infosQualite": {
        "codeQualite": "Membre",
        "libQualite": "Membre",
        "libQualiteSex": "Membre"
      },
      "organesRefs": [
        "PO286005"
      ]
    },
    {
      "xsiType": "MandatSimple_Type",
      "uid": "PM318276",
      "acteurRef": "PA492",
      "typeOrgane": "COMSENAT",
      "dateDebut": "2001-10-03T02:00:00.000+02:00",
      "dateFin": "2008-09-30T02:00:00.000+02:00",
      "preseance": "10",
      "nominPrincipale": "1",
      "infosQualite": {
        "codeQualite": "Membre",
        "libQualite": "Membre",
        "libQualiteSex": "Membre"
      },
      "organesRefs": [
        "PO211494"
      ]
    },
    {
      "xsiType": "MandatSimple_Type",
      "uid": "PM318584",
      "acteurRef": "PA492",
      "typeOrgane": "DELEGSENAT",
      "dateDebut": "2001-09-10T02:00:00.000+02:00",
      "dateFin": "2008-09-30T02:00:00.000+02:00",
      "preseance": "4",
      "nominPrincipale": "1",
      "infosQualite": {
        "codeQualite": "Membre",
        "libQualite": "Membre",
        "libQualiteSex": "Membre"
      },
      "organesRefs": [
        "PO317936"
      ]
    }
  ]
}