{
  "xsiType": "OrganeParlementaire_Type",
  "uid": "PO712165",
  "codeType": "MISINFO",
  "libelle": "État d'avancement de la manœuvre ressources humaines et conséquences des arrêts de la CEDH",
  "libelleEdition": "de la mission d'information sur l'état d'avancement de la manœuvre ressources humaines et les conséquences des arrêts de la CEDH",
  "libelleAbrege": "Manoeuvre ressources humaines",
  "libelleAbrev": "MANRH",
  "viMoDe": {
    "dateDebut": "2014-10-02T02:00:00.000+02:00",
    "dateFin": "2015-05-06T02:00:00.000+02:00"
  },
  "organeParentRef": "PO59046",
  "regime": "5ème République",
  "legislature": "14",
  "secretariat": {}
}