{
  "xsiType": "OrganeExterne_Type",
  "uid": "PO653218",
  "codeType": "MINISTERE",
  "libelle": "Premier ministre",
  "libelleAbrege": "Premier ministre",
  "libelleAbrev": "PMI",
  "viMoDe": {
    "dateDebut": "2012-06-19T02:00:00.000+02:00",
    "dateFin": "2014-03-31T02:00:00.000+02:00"
  },
  "organeParentRef": "PO653199"
}