{
  "xsiType": "OrganeParlementaire_Type",
  "uid": "PO431080",
  "codeType": "OFFPAR",
  "libelle": "Comité parlementaire chargé de veiller au respect du principe du repos dominical posé à l'article L.3132-3 du code du travail",
  "libelleEdition": "Comité parlementaire chargé de veiller au respect du principe du repos dominical posé à l'article L.3132-3 du code du travail",
  "libelleAbrege": "comité parlementaire pour le respect du repos dominical",
  "libelleAbrev": "REPOS",
  "viMoDe": {
    "dateDebut": "2009-08-10T02:00:00.000+02:00",
    "dateFin": "2011-11-09T01:00:00.000+01:00"
  },
  "regime": "5ème République",
  "secretariat": {}
}