{
  "xsiType": "OrganeExterne_Type",
  "uid": "PO514475",
  "codeType": "MINISTERE",
  "libelle": "Ministère de l'écologie, du développement durable, des transports et du logement",
  "libelleEdition": "de l'écologie, du développement durable, des transports et du logement",
  "libelleAbrege": "Écologie, développement durable, transports et logement",
  "libelleAbrev": "EDD",
  "viMoDe": {
    "dateDebut": "2012-02-22T01:00:00.000+01:00",
    "dateFin": "2012-05-10T02:00:00.000+02:00"
  },
  "organeParentRef": "PO425695"
}