{
  "uid": "PA945",
  "etatCivil": {
    "ident": {
      "civ": "M.",
      "prenom": "Jean-Patrick",
      "nom": "Courtois",
      "alpha": "COURTOIS"
    },
    "infoNaissance": {
      "dateNais": "1951-05-20T01:00:00.000+01:00"
    }
  },
  "profession": {
    "socProcInsee": {}
  },
  "adresses": [
    {
      "xsiType": "AdresseSiteWeb_Type",
      "uid": "AD317550",
      "type": "23",
      "typeLibelle": "Url sénateur",
      "valElec": "https://www.senat.fr/senateur/courtois_jean_patrick95020y.html"
    }
  ],
  "mandats": [
    {
      "xsiType": "MandatSimple_Type",
      "uid": "PM286462",
      "acteurRef": "PA945",
      "typeOrgane": "GROUPESENAT",
      "dateDebut": "2002-12-11T01:00:00.000+01:00",
      "datePublication": "2002-12-11T01:00:00.000+01:00",
      "dateFin": "2008-01-15T01:00:00.000+01:00",
      "preseance": "4",
      "nominPrincipale": "1",
      "infosQualite": {
        "codeQualite": "Membre",
        "libQualite": "Membre",
        "libQualiteSex": "Membre"
      },
      "organesRefs": [
        "PO286005"
      ]
    },
    {
      "xsiType": "MandatParlementaire_type",
      "uid": "PM303912",
      "acteurRef": "PA945",
      "typeOrgane": "SENAT",
      "dateDebut": "2004-10-01T02:00:00.000+02:00",
      "datePublication": "2004-10-02T02:00:00.000+02:00",
      "dateFin": "2014-09-30T02:00:00.000+02:00",
      "preseance": "20",
      "nominPrincipale": "1",
      "infosQualite": {
        "codeQualite": "Sénateur",
        "libQualite": "SENATEUR",
        "libQualiteSex": "SENATEUR"
      },
      "organesRefs": [
        "PO78718"
      ],
      "election": {
        "lieu": {
          "numDepartement": "71"
        }
      },
      "mandature": {
        "premiereElection": "0"
      }
    },
    {
      "xsiType": "MandatSimple_Type",
      "uid": "PM318291",
      "acteurRef": "PA945",
      "typeOrgane": "COMSENAT",
      "dateDebut": "2001-10-03T02:00:00.000+02:00",
      "dateFin": "2014-10-08T02:00:00.000+02:00",
      "preseance": "10",
      "nominPrincipale": "1",
      "infosQualite": {
        "codeQualite": "Membre",
        "libQualite": "Membre",
        "libQualiteSex": "Membre"
      },
      "organesRefs": [
        "PO211495"
      ]
    },
    {
      "xsiType": "MandatSimple_Type",
      "uid": "PM382493",
      "acteurRef": "PA945",
      "typeOrgane": "CMP",
      "dateDebut": "2007-02-14T01:00:00.000+01:00",
      "datePublication": "2007-02-16T01:00:00.000+01:00",
      "dateFin": "2007-07-20T02:00:00.000+02:00",
      "preseance": "20",
      "nominPrincipale": "1",
      "infosQualite": {
        "codeQualite": "Titulaire",
        "libQualite": "Membre titulaire",
        "libQualiteSex": "Membre titulaire"
      },
      "organesRefs": [
        "PO382464"
      ]
    },
    {
      "xsiType": "MandatSimple_Type",
      "uid": "PM399545",
      "acteurRef": "PA945",
      "typeOrgane": "CMP",
      "dateDebut": "2007-10-11T02:00:00.000+02:00",
      "datePublication": "2007-10-12T02:00:00.000+02:00",
      "dateFin": "2007-10-23T02:00:00.000+02:00",
      "preseance": "20",
      "nominPrincipale": "1",
      "infosQualite": {
        "codeQualite": "Titulaire",
        "libQualite": "Membre titulaire",
        "libQualiteSex": "Membre titulaire"
      },
      "organesRefs": [
        "PO396511"
      ]
    },
    {
      "xsiType": "MandatAvecSuppleant_Type",
      "uid": "PM403464",
      "acteurRef": "PA945",
      "typeOrgane": "OFFPAR",
      "dateDebut": "2007-10-30T01:00:00.000+01:00",
      "datePublication": "2007-10-31T01:00:00.000+01:00",
      "dateFin": "2014-09-30T02:00:00.000+02:00",
      "preseance": "24",
      "nominPrincipale": "1",
      "infosQualite": {
        "codeQualite": "Membre",
        "libQualite": "Membre",
        "libQualiteSex": "Membre"
      },
      "organesRefs": [
        "PO402232"
      ]
    },
    {
      "xsiType": "MandatSimple_Type",
      "uid": "PM405196",
      "acteurRef": "PA945",
      "typeOrgane": "DELEGSENAT",
      "dateDebut": "2007-10-10T02:00:00.000+02:00",
      "preseance": "4",
      "nominPrincipale": "1",
      "infosQualite": {
        "codeQualite": "Membre",
        "libQualite": "Membre",
        "libQualiteSex": "Membre"
      },
      "organesRefs": [
        "PO405191"
      ]
    },
    {
      "xsiType": "MandatAvecSuppleant_Type",
      "uid": "PM405296",
      "acteurRef": "PA945",
      "typeOrgane": "OFFPAR",
      "dateDebut": "2007-12-12T01:00:00.000+01:00",
      "datePublication": "2007-12-13T01:00:00.000+01:00",
      "dateFin": "2014-09-30T02:00:00.000+02:00",
      "preseance": "14",
      "nominPrincipale": "1",
      "infosQualite": {
        "codeQualite": "Membre nommé par le Président du Sénat",
        "libQualite": "Membre nommé par le Président du Sénat",
        "libQualiteSex": "Membre nommé par le Président du Sénat"
      },
      "organesRefs": [
        "PO402232"
      ]
    },
    {
      "xsiType": "MandatSimple_Type",
      "uid": "PM407157",
      "acteurRef": "PA945",
      "typeOrgane": "GROUPESENAT",
      "dateDebut": "2008-01-15T01:00:00.000+01:00",
      "dateFin": "2011-09-30T02:00:00.000+02:00",
      "nominPrincipale": "1",
      "infosQualite": {
        "libQualite": "Vice-Président délégué",
        "libQualiteSex": "Vice-Président délégué"
      },
      "organesRefs": [
        "PO286005"
      ]
    },
    {
      "xsiType": "MandatSimple_Type",
      "uid": "PM408142",
      "acteurRef": "PA945",
      "typeOrgane": "CMP",
      "dateDebut": "2008-02-01T01:00:00.000+01:00",
      "dateFin": "2008-02-07T01:00:00.000+01:00",
      "preseance": "28",
      "nominPrincipale": "1",
      "infosQualite": {
        "codeQualite": "Suppléant",
        "libQualite": "Membre suppléant",
        "libQualiteSex": "Membre suppléant"
      },
      "organesRefs": [
        "PO408111"
      ]
    },
    {
      "xsiType": "MandatSimple_Type",
      "uid": "PM418782",
      "acteurRef": "PA945",
      "typeOrgane": "API",
      "dateDebut": "2009-03-19T01:00:00.000+01:00",
      "dateFin": "2012-01-31T01:00:00.000+01:00",
      "preseance": "20",
      "nominPrincipale": "1",
      "infosQualite": {
        "codeQualite": "Membre",
        "libQualite": "Membre",
        "libQualiteSex": "Membre"
      },
      "organesRefs": [
        "PO206064"
      ]
    },
    {
      "xsiType": "MandatSimple_Type",
      "uid": "PM420981",
      "acteurRef": "PA945",
      "typeOrgane": "CMP",
      "dateDebut": "2009-07-07T02:00:00.000+02:00",
      "datePublication": "2009-07-08T02:00:00.000+02:00",
      "dateFin": "2009-09-01T02:00:00.000+02:00",
      "preseance": "20",
      "nominPrincipale": "1",
      "infosQualite": {
        "codeQualite": "Titulaire",
        "libQualite": "Membre titulaire",
        "libQualiteSex": "Membre titulaire"
      },
      "organesRefs": [
        "PO420973"
      ]
    },
    {
      "xsiType": "MandatSimple_Type",
      "uid": "PM421647",
      "acteurRef": "PA945",
      "typeOrgane": "DELEGSENAT",
      "dateDebut": "2009-09-23T02:00:00.000+02:00",
      "preseance": "4",
      "nominPrincipale": "1",
      "infosQualite": {
        "codeQualite": "Membre",
        "libQualite": "Membre",
        "libQualiteSex": "Membre"
      },
      "organesRefs": [
        "PO420387"
      ]
    },
    {
      "xsiType": "MandatAvecSuppleant_Type",
      "uid": "PM423425",
      "acteurRef": "PA945",
      "typeOrgane": "CJR",
      "dateDebut": "2010-03-30T02:00:00.000+02:00",
      "datePublication": "2010-03-31T02:00:00.000+02:00",
      "dateFin": "2014-09-30T02:00:00.000+02:00",
      "preseance": "5",
      "nominPrincipale": "1",
      "infosQualite": {
        "codeQualite": "Juge suppléant",
        "libQualite": "Juge suppléant",
        "libQualiteSex": "Juge suppléant"
      },
      "organesRefs": [
        "PO58996"
      ]
    },
    {
      "xsiType": "MandatSimple_Type",
      "uid": "PM425193",
      "acteurRef": "PA945",
      "typeOrgane": "CMP",
      "dateDebut": "2010-10-06T02:00:00.000+02:00",
      "datePublication": "2010-10-07T02:00:00.000+02:00",
      "dateFin": "2010-11-17T01:00:00.000+01:00",
      "preseance": "20",
      "nominPrincipale": "1",
      "infosQualite": {
        "codeQualite": "Titulaire",
        "libQualite": "Membre titulaire",
        "libQualiteSex": "Membre titulaire"
      },
      "organesRefs": [
        "PO425127"
      ]
    },
    {
      "xsiType": "MandatSimple_Type",
      "uid": "PM425586",
      "acteurRef": "PA945",
      "typeOrgane": "CMP",
      "dateDebut": "2010-11-03T01:00:00.000+01:00",
      "datePublication": "2010-11-04T01:00:00.000+01:00",
      "dateFin": "2010-11-17T01:00:00.000+01:00",
      "preseance": "16",
      "nominPrincipale": "1",
      "infosQualite": {
        "codeQualite": "Rapporteur",
        "libQualite": "Rapporteur",
        "libQualiteSex": "Rapporteur"
      },
      "organesRefs": [
        "PO425127"
      ]
    },
    {
      "xsiType": "MandatSimple_Type",
      "uid": "PM426704",
      "acteurRef": "PA945",
      "typeOrgane": "CMP",
      "dateDebut": "2011-01-20T01:00:00.000+01:00",
      "datePublication": "2011-11-25T01:00:00.000+01:00",
      "dateFin": "2011-02-10T01:00:00.000+01:00",
      "preseance": "20",
      "nominPrincipale": "1",
      "infosQualite": {
        "codeQualite": "Titulaire",
        "libQualite": "Membre titulaire",
        "libQualiteSex": "Membre titulaire"
      },
      "organesRefs": [
        "PO426576"
      ]
    },
    {
      "xsiType": "MandatSimple_Type",
      "uid": "PM426782",
      "acteurRef": "PA945",
      "typeOrgane": "CMP",
      "dateDebut": "2011-01-26T01:00:00.000+01:00",
      "datePublication": "2011-01-27T01:00:00.000+01:00",
      "dateFin": "2011-02-10T01:00:00.000+01:00",
      "preseance": "16",
      "nominPrincipale": "1",
      "infosQualite": {
        "codeQualite": "Rapporteur",
        "libQualite": "Rapporteur",
        "libQualiteSex": "Rapporteur"
      },
      "organesRefs": [
        "PO426576"
      ]
    },
    {
      "xsiType": "MandatParlementaire_type",
      "uid": "PM430229",
      "acteurRef": "PA945",
      "typeOrgane": "SENAT",
      "dateDebut": "2011-10-05T02:00:00.000+02:00",
      "dateFin": "2014-09-30T02:00:00.000+02:00",
      "nominPrincipale": "1",
      "infosQualite": {
        "libQualite": "Vice-président",
        "libQualiteSex": "Vice-président"
      },
      "organesRefs": [
        "PO78718"
      ],
      "election": {
        "lieu": {}
      },
      "mandature": {
        "premiereElection": "0"
      }
    },
    {
      "xsiType": "MandatSimple_Type",
      "uid": "PM430566",
      "acteurRef": "PA945",
      "typeOrgane": "GROUPESENAT",
      "dateDebut": "2011-10-01T02:00:00.000+02:00",
      "dateFin": "2015-06-12T02:00:00.000+02:00",
      "preseance": "4",
      "nominPrincipale": "1",
      "infosQualite": {
        "codeQualite": "Membre",
        "libQualite": "Membre",
        "libQualiteSex": "Membre"
      },
      "organesRefs": [
        "PO286005"
      ]
    },
    {
      "xsiType": "MandatSimple_Type",
      "uid": "PM471130",
      "acteurRef": "PA945",
      "typeOrgane": "CMP",
      "dateDebut": "2012-01-09T01:00:00.000+01:00",
      "datePublication": "2012-01-10T01:00:00.000+01:00",
      "dateFin": "2012-03-06T01:00:00.000+01:00",
      "preseance": "28",
      "nominPrincipale": "1",
      "infosQualite": {
        "codeQualite": "Suppléant",
        "libQualite": "Membre suppléant",
        "libQualiteSex": "Membre suppléant"
      },
      "organesRefs": [
        "PO447437"
      ]
    },
    {
      "xsiType": "MandatSimple_Type",
      "uid": "PM471154",
      "acteurRef": "PA945",
      "typeOrgane": "CMP",
      "dateDebut": "2012-01-09T01:00:00.000+01:00",
      "datePublication": "2012-01-10T01:00:00.000+01:00",
      "dateFin": "2012-01-26T01:00:00.000+01:00",
      "preseance": "28",
      "nominPrincipale": "1",
      "infosQualite": {
        "codeQualite": "Suppléant",
        "libQualite": "Membre suppléant",
        "libQualiteSex": "Membre suppléant"
      },
      "organesRefs": [
        "PO450932"
      ]
    },
    {
      "xsiType": "MandatSimple_Type",
      "uid": "PM685262",
      "acteurRef": "PA945",
      "typeOrgane": "CMP",
      "dateDebut": "2012-11-29T01:00:00.000+01:00",
      "datePublication": "2012-12-05T01:00:00.000+01:00",
      "dateFin": "2012-12-13T01:00:00.000+01:00",
      "preseance": "20",
      "nominPrincipale": "1",
      "infosQualite": {
        "codeQualite": "Titulaire",
        "libQualite": "Membre titulaire",
        "libQualiteSex": "Membre titulaire"
      },
      "organesRefs": [
        "PO685125"
      ]
    },
    {
      "xsiType": "MandatSimple_Type",
      "uid": "PM699922",
      "acteurRef": "PA945",
      "typeOrgane": "COMSPSENAT",
      "dateDebut": "2014-01-22T01:00:00.000+01:00",
      "dateFin": "2015-06-12T02:00:00.000+02:00",
      "nominPrincipale": "1",
      "infosQualite": {
        "libQualite": "Membre",
        "libQualiteSex": "Membre"
      },
      "organesRefs": [
        "PO699895"
      ]
    },
    {
      "xsiType": "MandatSimple_Type",
      "uid": "PM700178",
      "acteurRef": "PA945",
      "typeOrgane": "CMP",
      "dateDebut": "2014-02-12T01:00:00.000+01:00",
      "datePublication": "2014-02-15T01:00:00.000+01:00",
      "dateFin": "2014-02-27T01:00:00.000+01:00",
      "preseance": "28",
      "nominPrincipale": "1",
      "infosQualite": {
        "codeQualite": "Suppléant",
        "libQualite": "Membre suppléant",
        "libQualiteSex": "Membre suppléant"
      },
      "organesRefs": [
        "PO700121"
      ]
    },
    {
      "xsiType": "MandatSimple_Type",
      "uid": "PM701133",
      "acteurRef": "PA945",
      "typeOrgane": "CMP",
      "dateDebut": "2014-04-30T02:00:00.000+02:00",
      "datePublication": "2014-05-08T02:00:00.000+02:00",
      "dateFin": "2014-05-15T02:00:00.000+02:00",
      "preseance": "28",
      "nominPrincipale": "1",
      "infosQualite": {
        "codeQualite": "Suppléant",
        "libQualite": "Membre suppléant",
        "libQualiteSex": "Membre suppléant"
      },
      "organesRefs": [
        "PO700948"
      ]
    },
    {
      "xsiType": "MandatSimple_Type",
      "uid": "PM701160",
      "acteurRef": "PA945",
      "typeOrgane": "CMP",
      "dateDebut": "2014-05-06T02:00:00.000+02:00",
      "datePublication": "2014-05-08T02:00:00.000+02:00",
      "dateFin": "2014-05-15T02:00:00.000+02:00",
      "preseance": "28",
      "nominPrincipale": "1",
      "infosQualite": {
        "codeQualite": "Suppléant",
        "libQualite": "Membre suppléant",
        "libQualiteSex": "Membre suppléant"
      },
      "organesRefs": [
        "PO701096"
      ]
    },
    {
      "xsiType": "MandatParlementaire_type",
      "uid": "PM703662",
      "acteurRef": "PA945",
      "typeOrgane": "SENAT",
      "dateDebut": "2014-10-01T02:00:00.000+02:00",
      "dateFin": "2015-06-11T02:00:00.000+02:00",
      "preseance": "20",
      "nominPrincipale": "1",
      "infosQualite": {
        "codeQualite": "Sénateur",
        "libQualite": "SENATEUR",
        "libQualiteSex": "SENATEUR"
      },
      "organesRefs": [
        "PO78718"
      ],
      "election": {
        "lieu": {
          "numDepartement": "71"
        }
      },
      "mandature": {
        "premiereElection": "0"
      }
    },
    {
      "xsiType": "MandatSimple_Type",
      "uid": "PM704177",
      "acteurRef": "PA945",
      "typeOrgane": "COMSENAT",
      "dateDebut": "2014-10-09T02:00:00.000+02:00",
      "dateFin": "2015-06-12T02:00:00.000+02:00",
      "nominPrincipale": "1",
      "infosQualite": {
        "libQualite": "Vice-Président",
        "libQualiteSex": "Vice-Président"
      },
      "organesRefs": [
        "PO211495"
      ]
    },
    {
      "xsiType": "MandatSimple_Type",
      "uid": "PM704424",
      "acteurRef": "PA945",
      "typeOrgane": "CMP",
      "dateDebut": "2014-10-17T02:00:00.000+02:00",
      "datePublication": "2014-10-21T02:00:00.000+02:00",
      "dateFin": "2014-10-30T01:00:00.000+01:00",
      "preseance": "20",
      "nominPrincipale": "1",
      "infosQualite": {
        "codeQualite": "Titulaire",
        "libQualite": "Membre titulaire",
        "libQualiteSex": "Membre titulaire"
      },
      "organesRefs": [
        "PO704393"
      ]
    },
    {
      "xsiType": "MandatSimple_Type",
      "uid": "PM704883",
      "acteurRef": "PA945",
      "typeOrgane": "DELEGSENAT",
      "dateDebut": "2014-10-29T01:00:00.000+01:00",
      "preseance": "4",
      "nominPrincipale": "1",
      "infosQualite": {
        "codeQualite": "Membre",
        "libQualite": "Membre",
        "libQualiteSex": "Membre"
      },
      "organesRefs": [
        "PO420388"
      ]
    },
    {
      "xsiType": "MandatAvecSuppleant_Type",
      "uid": "PM705830",
      "acteurRef": "PA945",
      "typeOrgane": "OFFPAR",
      "dateDebut": "2015-01-15T01:00:00.000+01:00",
      "datePublication": "2015-01-16T01:00:00.000+01:00",
      "dateFin": "2015-06-11T02:00:00.000+02:00",
      "preseance": "24",
      "nominPrincipale": "0",
      "infosQualite": {
        "codeQualite": "Membre",
        "libQualite": "Membre",
        "libQualiteSex": "Membre"
      },
      "organesRefs": [
        "PO402232"
      ]
    },
    {
      "xsiType": "MandatAvecSuppleant_Type",
      "uid": "PM705831",
      "acteurRef": "PA945",
      "typeOrgane": "OFFPAR",
      "dateDebut": "2015-01-15T01:00:00.000+01:00",
      "datePublication": "2015-01-16T01:00:00.000+01:00",
      "dateFin": "2015-06-11T02:00:00.000+02:00",
      "preseance": "14",
      "nominPrincipale": "1",
      "infosQualite": {
        "codeQualite": "Membre nommé par le Président du Sénat",
        "libQualite": "Membre nommé par le Président du Sénat",
        "libQualiteSex": "Membre nommé par le Président du Sénat"
      },
      "organesRefs": [
        "PO402232"
      ]
    },
    {
      "xsiType": "MandatSimple_Type",
      "uid": "PM705890",
      "acteurRef": "PA945",
      "typeOrgane": "CMP",
      "dateDebut": "2015-01-22T01:00:00.000+01:00",
      "datePublication": "2015-01-23T01:00:00.000+01:00",
      "dateFin": "2015-03-04T01:00:00.000+01:00",
      "preseance": "28",
      "nominPrincipale": "1",
      "infosQualite": {
        "codeQualite": "Suppléant",
        "libQualite": "Membre suppléant",
        "libQualiteSex": "Membre suppléant"
      },
      "organesRefs": [
        "PO705475"
      ]
    },
    {
      "xsiType": "MandatSimple_Type",
      "uid": "PM706537",
      "acteurRef": "PA945",
      "typeOrgane": "CMP",
      "dateDebut": "2015-03-04T01:00:00.000+01:00",
      "datePublication": "2015-03-11T01:00:00.000+01:00",
      "dateFin": "2015-03-19T01:00:00.000+01:00",
      "preseance": "28",
      "nominPrincipale": "1",
      "infosQualite": {
        "codeQualite": "Suppléant",
        "libQualite": "Membre suppléant",
        "libQualiteSex": "Membre suppléant"
      },
      "organesRefs": [
        "PO706057"
      ]
    },
    {
      "xsiType": "MandatSimple_Type",
      "uid": "PM708396",
      "acteurRef": "PA945",
      "typeOrgane": "CMP",
      "dateDebut": "2015-06-05T02:00:00.000+02:00",
      "datePublication": "2015-06-05T02:00:00.000+02:00",
      "dateFin": "2015-06-11T02:00:00.000+02:00",
      "preseance": "28",
      "nominPrincipale": "1",
      "infosQualite": {
        "codeQualite": "Suppléant",
        "libQualite": "Membre suppléant",
        "libQualiteSex": "Membre suppléant"
      },
      "organesRefs": [
        "PO707789"
      ]
    }
  ]
}