{
  "uid": "PA1886",
  "etatCivil": {
    "ident": {
      "civ": "M.",
      "prenom": "Bruno",
      "nom": "Le Roux",
      "alpha": "LeRoux"
    },
    "infoNaissance": {
      "dateNais": "1965-05-02T01:00:00.000+01:00",
      "villeNais": "Gennevilliers",
      "depNais": "Hauts-de-Seine",
      "paysNais": "France"
    }
  },
  "profession": {
    "libelleCourant": "Consultant en gestion et management",
    "socProcInsee": {
      "catSocPro": "Cadres d'entreprise",
      "famSocPro": "Cadres et professions intellectuelles supérieures"
    }
  },
  "adresses": [
    {
      "xsiType": "AdresseMail_Type",
      "uid": "AD191198",
      "type": "15",
      "typeLibelle": "Mèl",
      "valElec": "brunolerouxdepute@yahoo.fr"
    },
    {
      "xsiType": "AdressePostale_Type",
      "uid": "AD387099",
      "type": "0",
      "typeLibelle": "Adresse officielle",
      "poids": "1",
      "intitule": "Assemblée nationale,",
      "numeroRue": "126",
      "nomRue": "Rue de l'Université,",
      "codePostal": "75355",
      "ville": "Paris 07 SP"
    },
    {
      "xsiType": "AdresseMail_Type",
      "uid": "AD391820",
      "type": "15",
      "typeLibelle": "Mèl",
      "valElec": "bleroux@assemblee-nationale.fr"
    },
    {
      "xsiType": "AdressePostale_Type",
      "uid": "AD648808",
      "type": "2",
      "typeLibelle": "Adresse publiée de circonscription",
      "poids": "22",
      "numeroRue": "19-21",
      "nomRue": "Avenue de la République",
      "codePostal": "93800",
      "ville": "Epinay-sur-Seine"
    }
  ],
  "mandats": [
    {
      "xsiType": "MandatParlementaire_type",
      "uid": "PM267975",
      "acteurRef": "PA1886",
      "legislature": "12",
      "typeOrgane": "ASSEMBLEE",
      "dateDebut": "2002-06-19T02:00:00.000+02:00",
      "dateFin": "2007-06-19T02:00:00.000+02:00",
      "preseance": "50",
      "nominPrincipale": "1",
      "infosQualite": {
        "codeQualite": "membre",
        "libQualite": "membre",
        "libQualiteSex": "membre"
      },
      "organesRefs": [
        "PO230434"
      ],
      "suppleant": {
        "dateDebut": "2002-06-19T02:00:00.000+02:00",
        "dateFin": "2007-06-19T02:00:00.000+02:00",
        "suppleantRef": "PA1170"
      },
      "election": {
        "lieu": {
          "region": "Ile-de-France",
          "regionType": "Métropolitain",
          "departement": "Seine-Saint-Denis",
          "numDepartement": "93",
          "numCirco": "1"
        },
        "causeMandat": "élections générales",
        "refCirconscription": "PO230956"
      },
      "mandature": {
        "datePriseFonction": "2002-06-19T02:00:00.000+02:00",
        "causeFin": "Fin de législature",
        "premiereElection": "1"
      }
    },
    {
      "xsiType": "MandatSimple_Type",
      "uid": "PM271414",
      "acteurRef": "PA1886",
      "legislature": "12",
      "typeOrgane": "GP",
      "dateDebut": "2002-06-25T02:00:00.000+02:00",
      "datePublication": "2002-06-26T02:00:00.000+02:00",
      "dateFin": "2007-06-19T02:00:00.000+02:00",
      "preseance": "20",
      "nominPrincipale": "1",
      "infosQualite": {
        "codeQualite": "Membre",
        "libQualite": "Membre du",
        "libQualiteSex": "Membre du"
      },
      "organesRefs": [
        "PO270907"
      ]
    },
    {
      "xsiType": "MandatSimple_Type",
      "uid": "PM274318",
      "acteurRef": "PA1886",
      "legislature": "12",
      "typeOrgane": "API",
      "dateDebut": "2002-07-25T02:00:00.000+02:00",
      "dateFin": "2007-06-19T02:00:00.000+02:00",
      "preseance": "20",
      "nominPrincipale": "1",
      "infosQualite": {
        "codeQualite": "Membre",
        "libQualite": "Membre",
        "libQualiteSex": "Membre"
      },
      "organesRefs": [
        "PO206064"
      ]
    },
    {
      "xsiType": "MandatSimple_Type",
      "uid": "PM278842",
      "acteurRef": "PA1886",
      "legislature": "12",
      "typeOrgane": "GEVI",
      "dateDebut": "2002-10-28T01:00:00.000+01:00",
      "dateFin": "2007-06-19T02:00:00.000+02:00",
      "preseance": "20",
      "nominPrincipale": "1",
      "infosQualite": {
        "codeQualite": "Membre",
        "libQualite": "Membre",
        "libQualiteSex": "Membre"
      },
      "organesRefs": [
        "PO274041"
      ]
    },
    {
      "xsiType": "MandatSimple_Type",
      "uid": "PM278843",
      "acteurRef": "PA1886",
      "legislature": "12",
      "typeOrgane": "GA",
      "dateDebut": "2002-10-28T01:00:00.000+01:00",
      "dateFin": "2007-06-19T02:00:00.000+02:00",
      "preseance": "20",
      "nominPrincipale": "1",
      "infosQualite": {
        "codeQualite": "Membre",
        "libQualite": "Membre",
        "libQualiteSex": "Membre"
      },
      "organesRefs": [
        "PO274162"
      ]
    },
    {
      "xsiType": "MandatSimple_Type",
      "uid": "PM278844",
      "acteurRef": "PA1886",
      "legislature": "12",
      "typeOrgane": "GA",
      "dateDebut": "2002-10-28T01:00:00.000+01:00",
      "dateFin": "2007-06-19T02:00:00.000+02:00",
      "preseance": "20",
      "nominPrincipale": "1",
      "infosQualite": {
        "codeQualite": "Membre",
        "libQualite": "Membre",
        "libQualiteSex": "Membre"
      },
      "organesRefs": [
        "PO274156"
      ]
    },
    {
      "xsiType": "MandatSimple_Type",
      "uid": "PM278845",
      "acteurRef": "PA1886",
      "legislature": "12",
      "typeOrgane": "GA",
      "dateDebut": "2002-10-28T01:00:00.000+01:00",
      "dateFin": "2007-06-19T02:00:00.000+02:00",
      "preseance": "20",
      "nominPrincipale": "1",
      "infosQualite": {
        "codeQualite": "Membre",
        "libQualite": "Membre",
        "libQualiteSex": "Membre"
      },
      "organesRefs": [
        "PO274159"
      ]
    },
    {
      "xsiType": "MandatSimple_Type",
      "uid": "PM278846",
      "acteurRef": "PA1886",
      "legislature": "12",
      "typeOrgane": "GA",
      "dateDebut": "2002-10-28T01:00:00.000+01:00",
      "dateFin": "2007-06-19T02:00:00.000+02:00",
      "preseance": "20",
      "nominPrincipale": "1",
      "infosQualite": {
        "codeQualite": "Membre",
        "libQualite": "Membre",
        "libQualiteSex": "Membre"
      },
      "organesRefs": [
        "PO274111"
      ]
    },
    {
      "xsiType": "MandatSimple_Type",
      "uid": "PM285751",
      "acteurRef": "PA1886",
      "legislature": "12",
      "typeOrgane": "GE",
      "dateDebut": "2002-12-10T01:00:00.000+01:00",
      "dateFin": "2007-06-19T02:00:00.000+02:00",
      "preseance": "20",
      "nominPrincipale": "1",
      "infosQualite": {
        "codeQualite": "Membre",
        "libQualite": "Membre",
        "libQualiteSex": "Membre"
      },
      "organesRefs": [
        "PO285043"
      ]
    },
    {
      "xsiType": "MandatAvecSuppleant_Type",
      "uid": "PM286001",
      "acteurRef": "PA1886",
      "legislature": "12",
      "typeOrgane": "COMNL",
      "dateDebut": "2002-12-13T01:00:00.000+01:00",
      "datePublication": "2002-12-13T01:00:00.000+01:00",
      "dateFin": "2007-06-19T02:00:00.000+02:00",
      "preseance": "24",
      "nominPrincipale": "1",
      "infosQualite": {
        "codeQualite": "Titulaire",
        "libQualite": "Membre titulaire",
        "libQualiteSex": "Membre titulaire"
      },
      "organesRefs": [
        "PO271850"
      ]
    },
    {
      "xsiType": "MandatSimple_Type",
      "uid": "PM287464",
      "acteurRef": "PA1886",
      "legislature": "12",
      "typeOrgane": "GE",
      "dateDebut": "2002-11-27T01:00:00.000+01:00",
      "dateFin": "2007-06-19T02:00:00.000+02:00",
      "preseance": "20",
      "nominPrincipale": "0",
      "infosQualite": {
        "codeQualite": "Membre",
        "libQualite": "Membre",
        "libQualiteSex": "Membre"
      },
      "organesRefs": [
        "PO285110"
      ]
    },
    {
      "xsiType": "MandatSimple_Type",
      "uid": "PM287465",
      "acteurRef": "PA1886",
      "legislature": "12",
      "typeOrgane": "GE",
      "dateDebut": "2002-11-27T01:00:00.000+01:00",
      "dateFin": "2007-06-19T02:00:00.000+02:00",
      "preseance": "1",
      "nominPrincipale": "1",
      "infosQualite": {
        "codeQualite": "Président",
        "libQualite": "Président",
        "libQualiteSex": "Président"
      },
      "organesRefs": [
        "PO285110"
      ]
    },
    {
      "xsiType": "MandatSimple_Type",
      "uid": "PM288153",
      "acteurRef": "PA1886",
      "legislature": "12",
      "typeOrgane": "GA",
      "dateDebut": "2002-12-18T01:00:00.000+01:00",
      "dateFin": "2007-06-19T02:00:00.000+02:00",
      "preseance": "8",
      "nominPrincipale": "1",
      "infosQualite": {
        "codeQualite": "Vice-Président",
        "libQualite": "Vice-Président",
        "libQualiteSex": "Vice-Président"
      },
      "organesRefs": [
        "PO274159"
      ]
    },
    {
      "xsiType": "MandatSimple_Type",
      "uid": "PM288501",
      "acteurRef": "PA1886",
      "legislature": "12",
      "typeOrgane": "ORGEXTPARL",
      "dateDebut": "2000-07-01T02:00:00.000+02:00",
      "datePublication": "2000-07-01T02:00:00.000+02:00",
      "dateFin": "2007-06-19T02:00:00.000+02:00",
      "preseance": "20",
      "nominPrincipale": "1",
      "infosQualite": {
        "codeQualite": "Titulaire",
        "libQualite": "Membre titulaire",
        "libQualiteSex": "Membre titulaire"
      },
      "organesRefs": [
        "PO216154"
      ]
    },
    {
      "xsiType": "MandatSimple_Type",
      "uid": "PM296930",
      "acteurRef": "PA1886",
      "legislature": "12",
      "typeOrgane": "GE",
      "dateDebut": "2003-09-16T02:00:00.000+02:00",
      "dateFin": "2007-06-19T02:00:00.000+02:00",
      "preseance": "20",
      "nominPrincipale": "0",
      "infosQualite": {
        "codeQualite": "Membre",
        "libQualite": "Membre",
        "libQualiteSex": "Membre"
      },
      "organesRefs": [
        "PO292868"
      ]
    },
    {
      "xsiType": "MandatSimple_Type",
      "uid": "PM296978",
      "acteurRef": "PA1886",
      "legislature": "12",
      "typeOrgane": "GE",
      "dateDebut": "2003-09-16T02:00:00.000+02:00",
      "dateFin": "2007-06-19T02:00:00.000+02:00",
      "preseance": "8",
      "nominPrincipale": "1",
      "infosQualite": {
        "codeQualite": "Vice-Président",
        "libQualite": "Vice-Président",
        "libQualiteSex": "Vice-Président"
      },
      "organesRefs": [
        "PO292868"
      ]
    },
    {
      "xsiType": "MandatSimple_Type",
      "uid": "PM297266",
      "acteurRef": "PA1886",
      "legislature": "12",
      "typeOrgane": "GE",
      "dateDebut": "2002-12-14T01:00:00.000+01:00",
      "dateFin": "2007-06-19T02:00:00.000+02:00",
      "preseance": "20",
      "nominPrincipale": "1",
      "infosQualite": {
        "codeQualite": "Membre",
        "libQualite": "Membre",
        "libQualiteSex": "Membre"
      },
      "organesRefs": [
        "PO285050"
      ]
    },
    {
      "xsiType": "MandatSimple_Type",
      "uid": "PM299413",
      "acteurRef": "PA1886",
      "legislature": "12",
      "typeOrgane": "GE",
      "dateDebut": "2004-01-29T01:00:00.000+01:00",
      "dateFin": "2007-06-19T02:00:00.000+02:00",
      "preseance": "20",
      "nominPrincipale": "0",
      "infosQualite": {
        "codeQualite": "Membre",
        "libQualite": "Membre",
        "libQualiteSex": "Membre"
      },
      "organesRefs": [
        "PO295425"
      ]
    },
    {
      "xsiType": "MandatSimple_Type",
      "uid": "PM299414",
      "acteurRef": "PA1886",
      "legislature": "12",
      "typeOrgane": "GE",
      "dateDebut": "2004-01-29T01:00:00.000+01:00",
      "dateFin": "2007-06-19T02:00:00.000+02:00",
      "preseance": "1",
      "nominPrincipale": "1",
      "infosQualite": {
        "codeQualite": "Président",
        "libQualite": "Président",
        "libQualiteSex": "Président"
      },
      "organesRefs": [
        "PO295425"
      ]
    },
    {
      "xsiType": "MandatSimple_Type",
      "uid": "PM324354",
      "acteurRef": "PA1886",
      "legislature": "12",
      "typeOrgane": "GE",
      "dateDebut": "2006-06-20T02:00:00.000+02:00",
      "dateFin": "2007-06-19T02:00:00.000+02:00",
      "preseance": "20",
      "nominPrincipale": "1",
      "infosQualite": {
        "codeQualite": "Membre",
        "libQualite": "Membre",
        "libQualiteSex": "Membre"
      },
      "organesRefs": [
        "PO323244"
      ]
    },
    {
      "xsiType": "MandatSimple_Type",
      "uid": "PM381434",
      "acteurRef": "PA1886",
      "legislature": "12",
      "typeOrgane": "COMPER",
      "dateDebut": "2006-12-05T01:00:00.000+01:00",
      "datePublication": "2006-12-05T01:00:00.000+01:00",
      "dateFin": "2007-06-19T02:00:00.000+02:00",
      "preseance": "32",
      "nominPrincipale": "1",
      "infosQualite": {
        "codeQualite": "Membre",
        "libQualite": "Membre",
        "libQualiteSex": "Membre"
      },
      "organesRefs": [
        "PO59051"
      ]
    },
    {
      "xsiType": "MandatParlementaire_type",
      "uid": "PM386347",
      "acteurRef": "PA1886",
      "legislature": "13",
      "typeOrgane": "ASSEMBLEE",
      "dateDebut": "2007-06-20T02:00:00.000+02:00",
      "dateFin": "2012-06-19T02:00:00.000+02:00",
      "preseance": "50",
      "nominPrincipale": "1",
      "infosQualite": {
        "codeQualite": "membre",
        "libQualite": "membre",
        "libQualiteSex": "membre"
      },
      "organesRefs": [
        "PO384266"
      ],
      "suppleant": {
        "dateDebut": "2007-06-20T02:00:00.000+02:00",
        "dateFin": "2012-06-19T02:00:00.000+02:00",
        "suppleantRef": "PA346932"
      },
      "election": {
        "lieu": {
          "region": "Ile-de-France",
          "regionType": "Métropolitain",
          "departement": "Seine-Saint-Denis",
          "numDepartement": "93",
          "numCirco": "1"
        },
        "causeMandat": "élections générales",
        "refCirconscription": "PO384788"
      },
      "mandature": {
        "datePriseFonction": "2007-06-20T02:00:00.000+02:00",
        "causeFin": "Fin de législature",
        "premiereElection": "1"
      }
    },
    {
      "xsiType": "MandatSimple_Type",
      "uid": "PM387678",
      "acteurRef": "PA1886",
      "legislature": "13",
      "typeOrgane": "GP",
      "dateDebut": "2007-06-20T02:00:00.000+02:00",
      "dateFin": "2007-06-26T02:00:00.000+02:00",
      "preseance": "28",
      "nominPrincipale": "1",
      "infosQualite": {
        "codeQualite": "Député non-inscrit",
        "libQualite": "Député non-inscrit",
        "libQualiteSex": "Député non-inscrit"
      },
      "organesRefs": [
        "PO387155"
      ]
    },
    {
      "xsiType": "MandatSimple_Type",
      "uid": "PM390199",
      "acteurRef": "PA1886",
      "legislature": "13",
      "typeOrgane": "GP",
      "dateDebut": "2007-06-27T02:00:00.000+02:00",
      "datePublication": "2007-06-27T02:00:00.000+02:00",
      "dateFin": "2012-06-19T02:00:00.000+02:00",
      "preseance": "20",
      "nominPrincipale": "1",
      "infosQualite": {
        "codeQualite": "Membre",
        "libQualite": "Membre du",
        "libQualiteSex": "Membre du"
      },
      "organesRefs": [
        "PO389507"
      ]
    },
    {
      "xsiType": "MandatSimple_Type",
      "uid": "PM390782",
      "acteurRef": "PA1886",
      "legislature": "13",
      "typeOrgane": "COMPER",
      "dateDebut": "2007-06-27T02:00:00.000+02:00",
      "datePublication": "2007-06-28T02:00:00.000+02:00",
      "dateFin": "2012-06-19T02:00:00.000+02:00",
      "preseance": "32",
      "nominPrincipale": "1",
      "infosQualite": {
        "codeQualite": "Membre",
        "libQualite": "Membre",
        "libQualiteSex": "Membre"
      },
      "organesRefs": [
        "PO59051"
      ]
    },
    {
      "xsiType": "MandatSimple_Type",
      "uid": "PM391408",
      "acteurRef": "PA1886",
      "legislature": "13",
      "typeOrgane": "DELEG",
      "dateDebut": "2007-07-03T02:00:00.000+02:00",
      "datePublication": "2007-07-04T02:00:00.000+02:00",
      "dateFin": "2012-06-19T02:00:00.000+02:00",
      "preseance": "20",
      "nominPrincipale": "1",
      "infosQualite": {
        "codeQualite": "Membre",
        "libQualite": "Membre",
        "libQualiteSex": "Membre"
      },
      "organesRefs": [
        "PO201269"
      ]
    },
    {
      "xsiType": "MandatSimple_Type",
      "uid": "PM395254",
      "acteurRef": "PA1886",
      "legislature": "13",
      "typeOrgane": "GA",
      "dateDebut": "2007-09-07T02:00:00.000+02:00",
      "dateFin": "2012-06-19T02:00:00.000+02:00",
      "preseance": "20",
      "nominPrincipale": "0",
      "infosQualite": {
        "codeQualite": "Membre",
        "libQualite": "Membre",
        "libQualiteSex": "Membre"
      },
      "organesRefs": [
        "PO393408"
      ]
    },
    {
      "xsiType": "MandatSimple_Type",
      "uid": "PM395255",
      "acteurRef": "PA1886",
      "legislature": "13",
      "typeOrgane": "GA",
      "dateDebut": "2007-09-07T02:00:00.000+02:00",
      "dateFin": "2012-06-19T02:00:00.000+02:00",
      "preseance": "1",
      "nominPrincipale": "1",
      "infosQualite": {
        "codeQualite": "Président",
        "libQualite": "Président",
        "libQualiteSex": "Président"
      },
      "organesRefs": [
        "PO393408"
      ]
    },
    {
      "xsiType": "MandatSimple_Type",
      "uid": "PM396387",
      "acteurRef": "PA1886",
      "legislature": "13",
      "typeOrgane": "GA",
      "dateDebut": "2007-10-05T02:00:00.000+02:00",
      "dateFin": "2012-06-19T02:00:00.000+02:00",
      "preseance": "20",
      "nominPrincipale": "1",
      "infosQualite": {
        "codeQualite": "Membre",
        "libQualite": "Membre",
        "libQualiteSex": "Membre"
      },
      "organesRefs": [
        "PO392699"
      ]
    },
    {
      "xsiType": "MandatSimple_Type",
      "uid": "PM396388",
      "acteurRef": "PA1886",
      "legislature": "13",
      "typeOrgane": "GA",
      "dateDebut": "2007-10-05T02:00:00.000+02:00",
      "dateFin": "2012-06-19T02:00:00.000+02:00",
      "preseance": "20",
      "nominPrincipale": "1",
      "infosQualite": {
        "codeQualite": "Membre",
        "libQualite": "Membre",
        "libQualiteSex": "Membre"
      },
      "organesRefs": [
        "PO392785"
      ]
    },
    {
      "xsiType": "MandatSimple_Type",
      "uid": "PM396389",
      "acteurRef": "PA1886",
      "legislature": "13",
      "typeOrgane": "GA",
      "dateDebut": "2007-10-05T02:00:00.000+02:00",
      "dateFin": "2012-06-19T02:00:00.000+02:00",
      "preseance": "20",
      "nominPrincipale": "1",
      "infosQualite": {
        "codeQualite": "Membre",
        "libQualite": "Membre",
        "libQualiteSex": "Membre"
      },
      "organesRefs": [
        "PO392820"
      ]
    },
    {
      "xsiType": "MandatSimple_Type",
      "uid": "PM396390",
      "acteurRef": "PA1886",
      "legislature": "13",
      "typeOrgane": "GA",
      "dateDebut": "2007-10-05T02:00:00.000+02:00",
      "dateFin": "2012-06-19T02:00:00.000+02:00",
      "preseance": "20",
      "nominPrincipale": "1",
      "infosQualite": {
        "codeQualite": "Membre",
        "libQualite": "Membre",
        "libQualiteSex": "Membre"
      },
      "organesRefs": [
        "PO392835"
      ]
    },
    {
      "xsiType": "MandatSimple_Type",
      "uid": "PM396391",
      "acteurRef": "PA1886",
      "legislature": "13",
      "typeOrgane": "GA",
      "dateDebut": "2007-10-05T02:00:00.000+02:00",
      "dateFin": "2012-06-19T02:00:00.000+02:00",
      "preseance": "20",
      "nominPrincipale": "1",
      "infosQualite": {
        "codeQualite": "Membre",
        "libQualite": "Membre",
        "libQualiteSex": "Membre"
      },
      "organesRefs": [
        "PO392840"
      ]
    },
    {
      "xsiType": "MandatSimple_Type",
      "uid": "PM396392",
      "acteurRef": "PA1886",
      "legislature": "13",
      "typeOrgane": "GA",
      "dateDebut": "2007-10-05T02:00:00.000+02:00",
      "dateFin": "2012-06-19T02:00:00.000+02:00",
      "preseance": "20",
      "nominPrincipale": "1",
      "infosQualite": {
        "codeQualite": "Membre",
        "libQualite": "Membre",
        "libQualiteSex": "Membre"
      },
      "organesRefs": [
        "PO392950"
      ]
    },
    {
      "xsiType": "MandatSimple_Type",
      "uid": "PM396393",
      "acteurRef": "PA1886",
      "legislature": "13",
      "typeOrgane": "GA",
      "dateDebut": "2007-10-05T02:00:00.000+02:00",
      "dateFin": "2012-06-19T02:00:00.000+02:00",
      "preseance": "20",
      "nominPrincipale": "1",
      "infosQualite": {
        "codeQualite": "Membre",
        "libQualite": "Membre",
        "libQualiteSex": "Membre"
      },
      "organesRefs": [
        "PO393070"
      ]
    },
    {
      "xsiType": "MandatSimple_Type",
      "uid": "PM396394",
      "acteurRef": "PA1886",
      "legislature": "13",
      "typeOrgane": "GEVI",
      "dateDebut": "2007-10-05T02:00:00.000+02:00",
      "dateFin": "2012-06-19T02:00:00.000+02:00",
      "preseance": "20",
      "nominPrincipale": "1",
      "infosQualite": {
        "codeQualite": "Membre",
        "libQualite": "Membre",
        "libQualiteSex": "Membre"
      },
      "organesRefs": [
        "PO393228"
      ]
    },
    {
      "xsiType": "MandatSimple_Type",
      "uid": "PM401920",
      "acteurRef": "PA1886",
      "legislature": "13",
      "typeOrgane": "GA",
      "dateDebut": "2007-10-29T01:00:00.000+01:00",
      "dateFin": "2012-06-19T02:00:00.000+02:00",
      "preseance": "20",
      "nominPrincipale": "1",
      "infosQualite": {
        "codeQualite": "Membre",
        "libQualite": "Membre",
        "libQualiteSex": "Membre"
      },
      "organesRefs": [
        "PO393182"
      ]
    },
    {
      "xsiType": "MandatSimple_Type",
      "uid": "PM404023",
      "acteurRef": "PA1886",
      "legislature": "13",
      "typeOrgane": "GA",
      "dateDebut": "2007-11-21T01:00:00.000+01:00",
      "dateFin": "2012-06-19T02:00:00.000+02:00",
      "preseance": "8",
      "nominPrincipale": "1",
      "infosQualite": {
        "codeQualite": "Vice-Président",
        "libQualite": "Vice-Président",
        "libQualiteSex": "Vice-Président"
      },
      "organesRefs": [
        "PO392835"
      ]
    },
    {
      "xsiType": "MandatSimple_Type",
      "uid": "PM406108",
      "acteurRef": "PA1886",
      "legislature": "13",
      "typeOrgane": "GA",
      "dateDebut": "2007-12-12T01:00:00.000+01:00",
      "dateFin": "2012-06-19T02:00:00.000+02:00",
      "preseance": "8",
      "nominPrincipale": "1",
      "infosQualite": {
        "codeQualite": "Vice-Président",
        "libQualite": "Vice-Président",
        "libQualiteSex": "Vice-Président"
      },
      "organesRefs": [
        "PO392840"
      ]
    },
    {
      "xsiType": "MandatSimple_Type",
      "uid": "PM407040",
      "acteurRef": "PA1886",
      "legislature": "13",
      "typeOrgane": "GE",
      "dateDebut": "2008-01-17T01:00:00.000+01:00",
      "dateFin": "2012-06-19T02:00:00.000+02:00",
      "preseance": "20",
      "nominPrincipale": "0",
      "infosQualite": {
        "codeQualite": "Membre",
        "libQualite": "Membre",
        "libQualiteSex": "Membre"
      },
      "organesRefs": [
        "PO405843"
      ]
    },
    {
      "xsiType": "MandatSimple_Type",
      "uid": "PM407041",
      "acteurRef": "PA1886",
      "legislature": "13",
      "typeOrgane": "GE",
      "dateDebut": "2008-01-17T01:00:00.000+01:00",
      "dateFin": "2012-06-19T02:00:00.000+02:00",
      "preseance": "1",
      "nominPrincipale": "1",
      "infosQualite": {
        "codeQualite": "Président",
        "libQualite": "Président",
        "libQualiteSex": "Président"
      },
      "organesRefs": [
        "PO405843"
      ]
    },
    {
      "xsiType": "MandatSimple_Type",
      "uid": "PM415425",
      "acteurRef": "PA1886",
      "legislature": "13",
      "typeOrgane": "GE",
      "dateDebut": "2008-05-07T02:00:00.000+02:00",
      "dateFin": "2012-06-19T02:00:00.000+02:00",
      "preseance": "20",
      "nominPrincipale": "1",
      "infosQualite": {
        "codeQualite": "Membre",
        "libQualite": "Membre",
        "libQualiteSex": "Membre"
      },
      "organesRefs": [
        "PO403325"
      ]
    },
    {
      "xsiType": "MandatSimple_Type",
      "uid": "PM421252",
      "acteurRef": "PA1886",
      "legislature": "13",
      "typeOrgane": "CMP",
      "dateDebut": "2009-07-21T02:00:00.000+02:00",
      "datePublication": "2009-07-22T02:00:00.000+02:00",
      "dateFin": "2009-09-01T02:00:00.000+02:00",
      "preseance": "20",
      "nominPrincipale": "1",
      "infosQualite": {
        "codeQualite": "Titulaire",
        "libQualite": "Membre titulaire",
        "libQualiteSex": "Membre titulaire"
      },
      "organesRefs": [
        "PO421243"
      ]
    },
    {
      "xsiType": "MandatSimple_Type",
      "uid": "PM421279",
      "acteurRef": "PA1886",
      "legislature": "13",
      "typeOrgane": "CMP",
      "dateDebut": "2009-07-21T02:00:00.000+02:00",
      "datePublication": "2009-07-22T02:00:00.000+02:00",
      "dateFin": "2009-09-01T02:00:00.000+02:00",
      "preseance": "20",
      "nominPrincipale": "1",
      "infosQualite": {
        "codeQualite": "Titulaire",
        "libQualite": "Membre titulaire",
        "libQualiteSex": "Membre titulaire"
      },
      "organesRefs": [
        "PO421237"
      ]
    },
    {
      "xsiType": "MandatSimple_Type",
      "uid": "PM428434",
      "acteurRef": "PA1886",
      "legislature": "13",
      "typeOrgane": "GE",
      "dateDebut": "2010-12-16T01:00:00.000+01:00",
      "dateFin": "2012-06-19T02:00:00.000+02:00",
      "preseance": "20",
      "nominPrincipale": "1",
      "infosQualite": {
        "codeQualite": "Membre",
        "libQualite": "Membre",
        "libQualiteSex": "Membre"
      },
      "organesRefs": [
        "PO422912"
      ]
    },
    {
      "xsiType": "MandatParlementaire_type",
      "uid": "PM645099",
      "acteurRef": "PA1886",
      "legislature": "14",
      "typeOrgane": "ASSEMBLEE",
      "dateDebut": "2012-06-20T02:00:00.000+02:00",
      "dateFin": "2017-01-06T01:00:00.000+01:00",
      "preseance": "50",
      "nominPrincipale": "1",
      "infosQualite": {
        "codeQualite": "membre",
        "libQualite": "membre",
        "libQualiteSex": "membre"
      },
      "organesRefs": [
        "PO644420"
      ],
      "suppleant": {
        "dateDebut": "2012-06-20T02:00:00.000+02:00",
        "dateFin": "2017-01-06T01:00:00.000+01:00",
        "suppleantRef": "PA643053"
      },
      "election": {
        "lieu": {
          "region": "Ile-de-France",
          "regionType": "Métropolitain",
          "departement": "Seine-Saint-Denis",
          "numDepartement": "93",
          "numCirco": "1"
        },
        "causeMandat": "élections générales",
        "refCirconscription": "PO644942"
      },
      "mandature": {
        "datePriseFonction": "2012-06-20T02:00:00.000+02:00",
        "causeFin": "Nomination comme membre du Gouvernement",
        "premiereElection": "1"
      }
    },
    {
      "xsiType": "MandatSimple_Type",
      "uid": "PM656211",
      "acteurRef": "PA1886",
      "legislature": "14",
      "typeOrgane": "GP",
      "dateDebut": "2012-06-26T02:00:00.000+02:00",
      "datePublication": "2012-06-27T02:00:00.000+02:00",
      "dateFin": "2016-05-24T02:00:00.000+02:00",
      "preseance": "20",
      "nominPrincipale": "0",
      "infosQualite": {
        "codeQualite": "Membre",
        "libQualite": "Membre du",
        "libQualiteSex": "Membre du"
      },
      "organesRefs": [
        "PO656002"
      ]
    },
    {
      "xsiType": "MandatSimple_Type",
      "uid": "PM656305",
      "acteurRef": "PA1886",
      "legislature": "14",
      "typeOrgane": "GP",
      "dateDebut": "2012-06-26T02:00:00.000+02:00",
      "datePublication": "2012-06-27T02:00:00.000+02:00",
      "dateFin": "2016-05-24T02:00:00.000+02:00",
      "preseance": "1",
      "nominPrincipale": "1",
      "infosQualite": {
        "codeQualite": "Président",
        "libQualite": "Président du",
        "libQualiteSex": "Président du"
      },
      "organesRefs": [
        "PO656002"
      ]
    },
    {
      "xsiType": "MandatSimple_Type",
      "uid": "PM657343",
      "acteurRef": "PA1886",
      "legislature": "14",
      "typeOrgane": "COMPER",
      "dateDebut": "2012-06-28T02:00:00.000+02:00",
      "datePublication": "2012-06-28T02:00:00.000+02:00",
      "dateFin": "2017-01-06T01:00:00.000+01:00",
      "preseance": "32",
      "nominPrincipale": "1",
      "infosQualite": {
        "codeQualite": "Membre",
        "libQualite": "Membre",
        "libQualiteSex": "Membre"
      },
      "organesRefs": [
        "PO59046"
      ]
    },
    {
      "xsiType": "MandatAvecSuppleant_Type",
      "uid": "PM677178",
      "acteurRef": "PA1886",
      "legislature": "14",
      "typeOrgane": "COMNL",
      "dateDebut": "2012-07-25T02:00:00.000+02:00",
      "datePublication": "2012-07-25T02:00:00.000+02:00",
      "dateFin": "2015-01-14T01:00:00.000+01:00",
      "preseance": "20",
      "nominPrincipale": "1",
      "infosQualite": {
        "codeQualite": "Membre",
        "libQualite": "Membre",
        "libQualiteSex": "Membre"
      },
      "organesRefs": [
        "PO420375"
      ]
    },
    {
      "xsiType": "MandatSimple_Type",
      "uid": "PM677250",
      "acteurRef": "PA1886",
      "legislature": "14",
      "typeOrgane": "DELEG",
      "dateDebut": "2012-07-25T02:00:00.000+02:00",
      "datePublication": "2012-07-25T02:00:00.000+02:00",
      "dateFin": "2017-01-06T01:00:00.000+01:00",
      "preseance": "20",
      "nominPrincipale": "1",
      "infosQualite": {
        "codeQualite": "Membre",
        "libQualite": "Membre",
        "libQualiteSex": "Membre"
      },
      "organesRefs": [
        "PO675659"
      ]
    },
    {
      "xsiType": "MandatAvecSuppleant_Type",
      "uid": "PM677447",
      "acteurRef": "PA1886",
      "legislature": "14",
      "typeOrgane": "COMNL",
      "dateDebut": "2012-07-26T02:00:00.000+02:00",
      "datePublication": "2012-07-27T02:00:00.000+02:00",
      "dateFin": "2015-01-14T01:00:00.000+01:00",
      "preseance": "2",
      "nominPrincipale": "1",
      "infosQualite": {
        "codeQualite": "Membre de droit du Bureau",
        "libQualite": "Membre de droit du Bureau",
        "libQualiteSex": "Membre de droit du Bureau"
      },
      "organesRefs": [
        "PO420375"
      ]
    },
    {
      "xsiType": "MandatSimple_Type",
      "uid": "PM677855",
      "acteurRef": "PA1886",
      "legislature": "14",
      "typeOrgane": "ORGEXTPARL",
      "dateDebut": "2012-09-03T02:00:00.000+02:00",
      "datePublication": "2012-09-04T02:00:00.000+02:00",
      "dateFin": "2017-01-06T01:00:00.000+01:00",
      "preseance": "20",
      "nominPrincipale": "1",
      "infosQualite": {
        "codeQualite": "Titulaire",
        "libQualite": "Membre titulaire",
        "libQualiteSex": "Membre titulaire"
      },
      "organesRefs": [
        "PO423980"
      ]
    },
    {
      "xsiType": "MandatSimple_Type",
      "uid": "PM678530",
      "acteurRef": "PA1886",
      "legislature": "14",
      "typeOrgane": "GA",
      "dateDebut": "2012-09-26T02:00:00.000+02:00",
      "dateFin": "2017-01-06T01:00:00.000+01:00",
      "preseance": "20",
      "nominPrincipale": "1",
      "infosQualite": {
        "codeQualite": "Membre",
        "libQualite": "Membre",
        "libQualiteSex": "Membre"
      },
      "organesRefs": [
        "PO675751"
      ]
    },
    {
      "xsiType": "MandatSimple_Type",
      "uid": "PM678531",
      "acteurRef": "PA1886",
      "legislature": "14",
      "typeOrgane": "GA",
      "dateDebut": "2012-09-26T02:00:00.000+02:00",
      "dateFin": "2014-05-27T02:00:00.000+02:00",
      "preseance": "1",
      "nominPrincipale": "1",
      "infosQualite": {
        "codeQualite": "Président",
        "libQualite": "Président",
        "libQualiteSex": "Président"
      },
      "organesRefs": [
        "PO675751"
      ]
    },
    {
      "xsiType": "MandatSimple_Type",
      "uid": "PM683297",
      "acteurRef": "PA1886",
      "legislature": "14",
      "typeOrgane": "GA",
      "dateDebut": "2012-10-24T02:00:00.000+02:00",
      "dateFin": "2017-01-06T01:00:00.000+01:00",
      "preseance": "20",
      "nominPrincipale": "1",
      "infosQualite": {
        "codeQualite": "Membre",
        "libQualite": "Membre",
        "libQualiteSex": "Membre"
      },
      "organesRefs": [
        "PO675722"
      ]
    },
    {
      "xsiType": "MandatSimple_Type",
      "uid": "PM683500",
      "acteurRef": "PA1886",
      "legislature": "14",
      "typeOrgane": "GA",
      "dateDebut": "2012-10-22T02:00:00.000+02:00",
      "dateFin": "2017-01-06T01:00:00.000+01:00",
      "preseance": "20",
      "nominPrincipale": "1",
      "infosQualite": {
        "codeQualite": "Membre",
        "libQualite": "Membre",
        "libQualiteSex": "Membre"
      },
      "organesRefs": [
        "PO675812"
      ]
    },
    {
      "xsiType": "MandatSimple_Type",
      "uid": "PM683732",
      "acteurRef": "PA1886",
      "legislature": "14",
      "typeOrgane": "GA",
      "dateDebut": "2012-10-31T01:00:00.000+01:00",
      "dateFin": "2014-05-28T02:00:00.000+02:00",
      "preseance": "8",
      "nominPrincipale": "1",
      "infosQualite": {
        "codeQualite": "Vice-Président",
        "libQualite": "Vice-Président",
        "libQualiteSex": "Vice-Président"
      },
      "organesRefs": [
        "PO675722"
      ]
    },
    {
      "xsiType": "MandatSimple_Type",
      "uid": "PM683896",
      "acteurRef": "PA1886",
      "legislature": "14",
      "typeOrgane": "GA",
      "dateDebut": "2012-11-06T01:00:00.000+01:00",
      "dateFin": "2017-01-06T01:00:00.000+01:00",
      "preseance": "20",
      "nominPrincipale": "1",
      "infosQualite": {
        "codeQualite": "Membre",
        "libQualite": "Membre",
        "libQualiteSex": "Membre"
      },
      "organesRefs": [
        "PO675852"
      ]
    },
    {
      "xsiType": "MandatSimple_Type",
      "uid": "PM685930",
      "acteurRef": "PA1886",
      "typeOrgane": "PARPOL",
      "dateDebut": "2012-12-01T01:00:00.000+01:00",
      "dateFin": "2017-06-20T02:00:00.000+02:00",
      "preseance": "5",
      "nominPrincipale": "1",
      "infosQualite": {
        "codeQualite": "Membre",
        "libQualite": "Membre",
        "libQualiteSex": "Membre"
      },
      "organesRefs": [
        "PO684932"
      ]
    },
    {
      "xsiType": "MandatParlementaire_type",
      "uid": "PM690225",
      "acteurRef": "PA1886",
      "legislature": "14",
      "typeOrgane": "CONFPT",
      "dateDebut": "2016-05-25T02:00:00.000+02:00",
      "dateFin": "2016-12-12T01:00:00.000+01:00",
      "preseance": "20",
      "nominPrincipale": "1",
      "infosQualite": {
        "codeQualite": "Membre",
        "libQualite": "Membre",
        "libQualiteSex": "Membre"
      },
      "organesRefs": [
        "PO690204"
      ],
      "election": {
        "lieu": {}
      },
      "mandature": {
        "premiereElection": "0"
      }
    },
    {
      "xsiType": "MandatSimple_Type",
      "uid": "PM695343",
      "acteurRef": "PA1886",
      "legislature": "14",
      "typeOrgane": "CNPE",
      "dateDebut": "2013-06-18T02:00:00.000+02:00",
      "datePublication": "2013-06-19T02:00:00.000+02:00",
      "dateFin": "2013-12-13T01:00:00.000+01:00",
      "preseance": "20",
      "nominPrincipale": "1",
      "infosQualite": {
        "codeQualite": "Membre",
        "libQualite": "Membre",
        "libQualiteSex": "Membre"
      },
      "organesRefs": [
        "PO695226"
      ]
    },
    {
      "xsiType": "MandatSimple_Type",
      "uid": "PM695707",
      "acteurRef": "PA1886",
      "legislature": "14",
      "typeOrgane": "CNPE",
      "dateDebut": "2013-07-02T02:00:00.000+02:00",
      "datePublication": "2013-07-03T02:00:00.000+02:00",
      "dateFin": "2013-12-11T01:00:00.000+01:00",
      "preseance": "20",
      "nominPrincipale": "1",
      "infosQualite": {
        "codeQualite": "Membre",
        "libQualite": "Membre",
        "libQualiteSex": "Membre"
      },
      "organesRefs": [
        "PO695608"
      ]
    },
    {
      "xsiType": "MandatSimple_Type",
      "uid": "PM697675",
      "acteurRef": "PA1886",
      "legislature": "14",
      "typeOrgane": "GE",
      "dateDebut": "2013-10-09T02:00:00.000+02:00",
      "dateFin": "2017-01-06T01:00:00.000+01:00",
      "preseance": "8",
      "nominPrincipale": "1",
      "infosQualite": {
        "codeQualite": "Vice-Président",
        "libQualite": "Vice-Président",
        "libQualiteSex": "Vice-Président"
      },
      "organesRefs": [
        "PO695599"
      ]
    },
    {
      "xsiType": "MandatSimple_Type",
      "uid": "PM698156",
      "acteurRef": "PA1886",
      "legislature": "14",
      "typeOrgane": "GA",
      "dateDebut": "2013-10-30T01:00:00.000+01:00",
      "dateFin": "2017-01-06T01:00:00.000+01:00",
      "preseance": "20",
      "nominPrincipale": "1",
      "infosQualite": {
        "codeQualite": "Membre",
        "libQualite": "Membre",
        "libQualiteSex": "Membre"
      },
      "organesRefs": [
        "PO675784"
      ]
    },
    {
      "xsiType": "MandatMission_Type",
      "uid": "PM699447",
      "acteurRef": "PA1886",
      "legislature": "14",
      "typeOrgane": "MISINFOPRE",
      "dateDebut": "2014-01-14T01:00:00.000+01:00",
      "datePublication": "2014-01-15T01:00:00.000+01:00",
      "dateFin": "2014-10-28T01:00:00.000+01:00",
      "preseance": "20",
      "nominPrincipale": "1",
      "infosQualite": {
        "codeQualite": "Membre",
        "libQualite": "Membre",
        "libQualiteSex": "Membre"
      },
      "organesRefs": [
        "PO699419"
      ]
    },
    {
      "xsiType": "MandatMission_Type",
      "uid": "PM699750",
      "acteurRef": "PA1886",
      "legislature": "14",
      "typeOrgane": "MISINFOPRE",
      "dateDebut": "2014-01-22T01:00:00.000+01:00",
      "datePublication": "2014-01-23T01:00:00.000+01:00",
      "dateFin": "2014-10-28T01:00:00.000+01:00",
      "preseance": "16",
      "nominPrincipale": "1",
      "infosQualite": {
        "codeQualite": "Rapporteur",
        "libQualite": "Rapporteur",
        "libQualiteSex": "Rapporteur"
      },
      "organesRefs": [
        "PO699419"
      ]
    },
    {
      "xsiType": "MandatSimple_Type",
      "uid": "PM701606",
      "acteurRef": "PA1886",
      "legislature": "14",
      "typeOrgane": "GA",
      "dateDebut": "2014-05-28T02:00:00.000+02:00",
      "dateFin": "2012-12-06T01:00:00.000+01:00",
      "preseance": "1",
      "nominPrincipale": "1",
      "infosQualite": {
        "codeQualite": "Président",
        "libQualite": "Président",
        "libQualiteSex": "Président"
      },
      "organesRefs": [
        "PO675722"
      ]
    },
    {
      "xsiType": "MandatSimple_Type",
      "uid": "PM701734",
      "acteurRef": "PA1886",
      "legislature": "14",
      "typeOrgane": "GA",
      "dateDebut": "2014-06-06T02:00:00.000+02:00",
      "dateFin": "2017-01-06T01:00:00.000+01:00",
      "preseance": "8",
      "nominPrincipale": "1",
      "infosQualite": {
        "codeQualite": "Vice-Président",
        "libQualite": "Vice-Président",
        "libQualiteSex": "Vice-Président"
      },
      "organesRefs": [
        "PO675751"
      ]
    },
    {
      "xsiType": "MandatSimple_Type",
      "uid": "PM712799",
      "acteurRef": "PA1886",
      "legislature": "14",
      "typeOrgane": "GE",
      "dateDebut": "2016-05-12T02:00:00.000+02:00",
      "dateFin": "2017-01-06T01:00:00.000+01:00",
      "preseance": "20",
      "nominPrincipale": "0",
      "infosQualite": {
        "codeQualite": "Membre",
        "libQualite": "Membre",
        "libQualiteSex": "Membre"
      },
      "organesRefs": [
        "PO712794"
      ]
    },
    {
      "xsiType": "MandatSimple_Type",
      "uid": "PM712802",
      "acteurRef": "PA1886",
      "legislature": "14",
      "typeOrgane": "GE",
      "dateDebut": "2016-05-12T02:00:00.000+02:00",
      "dateFin": "2017-01-06T01:00:00.000+01:00",
      "preseance": "4",
      "nominPrincipale": "1",
      "infosQualite": {
        "codeQualite": "Co-Président",
        "libQualite": "Co-Président",
        "libQualiteSex": "Co-Président"
      },
      "organesRefs": [
        "PO712794"
      ]
    },
    {
      "xsiType": "MandatSimple_Type",
      "uid": "PM713269",
      "acteurRef": "PA1886",
      "legislature": "14",
      "typeOrgane": "GP",
      "dateDebut": "2016-05-25T02:00:00.000+02:00",
      "dateFin": "2017-01-06T01:00:00.000+01:00",
      "preseance": "20",
      "nominPrincipale": "1",
      "infosQualite": {
        "codeQualite": "Membre",
        "libQualite": "Membre du",
        "libQualiteSex": "Membre du"
      },
      "organesRefs": [
        "PO713077"
      ]
    },
    {
      "xsiType": "MandatSimple_Type",
      "uid": "PM713359",
      "acteurRef": "PA1886",
      "legislature": "14",
      "typeOrgane": "GP",
      "dateDebut": "2016-05-25T02:00:00.000+02:00",
      "dateFin": "2016-12-12T01:00:00.000+01:00",
      "preseance": "1",
      "nominPrincipale": "1",
      "infosQualite": {
        "codeQualite": "Président",
        "libQualite": "Président du",
        "libQualiteSex": "Président du"
      },
      "organesRefs": [
        "PO713077"
      ]
    },
    {
      "xsiType": "MandatMission_Type",
      "uid": "PM714423",
      "acteurRef": "PA1886",
      "legislature": "14",
      "typeOrgane": "MISINFOPRE",
      "dateDebut": "2016-07-13T02:00:00.000+02:00",
      "datePublication": "2016-07-14T02:00:00.000+02:00",
      "dateFin": "2017-01-06T01:00:00.000+01:00",
      "preseance": "20",
      "nominPrincipale": "1",
      "infosQualite": {
        "codeQualite": "Membre",
        "libQualite": "Membre",
        "libQualiteSex": "Membre"
      },
      "organesRefs": [
        "PO714079"
      ]
    },
    {
      "xsiType": "MandatSimple_Type",
      "uid": "PM715827",
      "acteurRef": "PA1886",
      "typeOrgane": "MINISTERE",
      "dateDebut": "2016-12-07T01:00:00.000+01:00",
      "datePublication": "2016-12-07T01:00:00.000+01:00",
      "dateFin": "2017-03-21T01:00:00.000+01:00",
      "preseance": "30",
      "nominPrincipale": "1",
      "infosQualite": {
        "codeQualite": "Ministre",
        "libQualite": "Ministre",
        "libQualiteSex": "Ministre"
      },
      "organesRefs": [
        "PO715825"
      ]
    },
    {
      "xsiType": "MandatParlementaire_type",
      "uid": "PM717022",
      "acteurRef": "PA1886",
      "legislature": "14",
      "typeOrgane": "ASSEMBLEE",
      "dateDebut": "2012-06-20T02:00:00.000+02:00",
      "dateFin": "2017-06-20T02:00:00.000+02:00",
      "preseance": "50",
      "nominPrincipale": "1",
      "infosQualite": {
        "codeQualite": "membre",
        "libQualite": "membre",
        "libQualiteSex": "membre"
      },
      "organesRefs": [
        "PO644420"
      ],
      "suppleant": {
        "dateDebut": "2012-06-20T02:00:00.000+02:00",
        "dateFin": "2017-06-20T02:00:00.000+02:00",
        "suppleantRef": "PA643053"
      },
      "election": {
        "lieu": {
          "region": "Ile-de-France",
          "regionType": "Métropolitain",
          "departement": "Seine-Saint-Denis",
          "numDepartement": "93",
          "numCirco": "1"
        },
        "causeMandat": "reprise de l'exercice du mandat d'un ancien membre du Gouvernement",
        "refCirconscription": "PO644942"
      },
      "mandature": {
        "datePriseFonction": "2017-04-22T02:00:00.000+02:00",
        "causeFin": "Fin de législature",
        "premiereElection": "1",
        "mandatRemplaceRef": "PM645099"
      }
    },
    {
      "xsiType": "MandatSimple_Type",
      "uid": "PM717023",
      "acteurRef": "PA1886",
      "legislature": "14",
      "typeOrgane": "GP",
      "dateDebut": "2017-04-22T02:00:00.000+02:00",
      "dateFin": "2017-06-20T02:00:00.000+02:00",
      "preseance": "20",
      "nominPrincipale": "1",
      "infosQualite": {
        "codeQualite": "Membre",
        "libQualite": "Membre du",
        "libQualiteSex": "Membre du"
      },
      "organesRefs": [
        "PO713077"
      ]
    },
    {
      "xsiType": "MandatSimple_Type",
      "uid": "PM717024",
      "acteurRef": "PA1886",
      "legislature": "14",
      "typeOrgane": "COMPER",
      "dateDebut": "2017-04-25T02:00:00.000+02:00",
      "datePublication": "2017-04-25T02:00:00.000+02:00",
      "dateFin": "2017-06-20T02:00:00.000+02:00",
      "preseance": "32",
      "nominPrincipale": "1",
      "infosQualite": {
        "codeQualite": "Membre",
        "libQualite": "Membre",
        "libQualiteSex": "Membre"
      },
      "organesRefs": [
        "PO59046"
      ]
    },
    {
      "xsiType": "MandatSimple_Type",
      "uid": "PM15715827",
      "acteurRef": "PA1886",
      "typeOrgane": "GOUVERNEMENT",
      "dateDebut": "2016-12-07T01:00:00.000+01:00",
      "datePublication": "2016-12-07T01:00:00.000+01:00",
      "dateFin": "2017-03-21T01:00:00.000+01:00",
      "preseance": "50",
      "nominPrincipale": "1",
      "infosQualite": {
        "codeQualite": "membre",
        "libQualite": "membre",
        "libQualiteSex": "membre"
      },
      "organesRefs": [
        "PO715793"
      ]
    }
  ]
}