{
  "uid": "PA718728",
  "etatCivil": {
    "ident": {
      "civ": "Mme",
      "prenom": "Laurence",
      "nom": "Vanceunebrock-Mialon",
      "alpha": "Vanceunebrock-Mialon",
      "trigramme": "LVA"
    },
    "infoNaissance": {
      "dateNais": "1970-05-06T01:00:00.000+01:00",
      "villeNais": "Avion",
      "depNais": "Pas-de-Calais",
      "paysNais": "France"
    }
  },
  "profession": {
    "libelleCourant": "Fonctionnaire de catégorie B",
    "socProcInsee": {
      "catSocPro": "Employés de la fonction publique",
      "famSocPro": "Employés"
    }
  },
  "uriHatvp": "https://www.hatvp.fr/pages_nominatives/vanceunebrock-mialon-laurence",
  "adresses": [
    {
      "xsiType": "AdressePostale_Type",
      "uid": "AD718730",
      "type": "0",
      "typeLibelle": "Adresse officielle",
      "poids": "1",
      "intitule": "Assemblée nationale,",
      "numeroRue": "126",
      "nomRue": "Rue de l'Université,",
      "codePostal": "75355",
      "ville": "Paris 07 SP"
    },
    {
      "xsiType": "AdresseMail_Type",
      "uid": "AD727968",
      "type": "15",
      "typeLibelle": "Mèl",
      "valElec": "laurence.vanceunebrock-mialon@assemblee-nationale.fr"
    },
    {
      "xsiType": "AdresseSiteWeb_Type",
      "uid": "AD728448",
      "type": "24",
      "typeLibelle": "Twitter",
      "valElec": "@LaurenceVanceu"
    },
    {
      "xsiType": "AdresseSiteWeb_Type",
      "uid": "AD729010",
      "type": "25",
      "typeLibelle": "Facebook",
      "valElec": "LaurenceVanceunebrockMialon"
    }
  ],
  "mandats": [
    {
      "xsiType": "MandatParlementaire_type",
      "uid": "PM722438",
      "acteurRef": "PA718728",
      "legislature": "15",
      "typeOrgane": "ASSEMBLEE",
      "dateDebut": "2017-06-18T02:00:00.000+02:00",
      "preseance": "50",
      "nominPrincipale": "1",
      "infosQualite": {
        "codeQualite": "membre",
        "libQualite": "membre",
        "libQualiteSex": "membre"
      },
      "organesRefs": [
        "PO717460"
      ],
      "suppleant": {
        "dateDebut": "2017-06-18T02:00:00.000+02:00",
        "suppleantRef": "PA718732"
      },
      "election": {
        "lieu": {
          "region": "Auvergne-Rhône-Alpes",
          "regionType": "Métropolitain",
          "departement": "Allier",
          "numDepartement": "03",
          "numCirco": "2"
        },
        "causeMandat": "élections générales",
        "refCirconscription": "PO717474"
      },
      "mandature": {
        "datePriseFonction": "2017-06-21T02:00:00.000+02:00",
        "premiereElection": "0",
        "placeHemicycle": "292"
      },
      "collaborateurs": [
        {
          "qualite": "M.",
          "prenom": "Dominique",
          "nom": "Walfard de Sède"
        },
        {
          "qualite": "Mme",
          "prenom": "Laurence",
          "nom": "Chicois"
        },
        {
          "qualite": "Mme",
          "prenom": "Aïda",
          "nom": "Epelbaum"
        },
        {
          "qualite": "Mme",
          "prenom": "Inès",
          "nom": "Bendouba"
        }
      ]
    },
    {
      "xsiType": "MandatSimple_Type",
      "uid": "PM724260",
      "acteurRef": "PA718728",
      "legislature": "15",
      "typeOrgane": "GP",
      "dateDebut": "2017-06-21T02:00:00.000+02:00",
      "dateFin": "2017-06-26T02:00:00.000+02:00",
      "preseance": "28",
      "nominPrincipale": "1",
      "infosQualite": {
        "codeQualite": "Député non-inscrit",
        "libQualite": "Député non-inscrit",
        "libQualiteSex": "Députée non-inscrite"
      },
      "organesRefs": [
        "PO723569"
      ]
    },
    {
      "xsiType": "MandatSimple_Type",
      "uid": "PM730983",
      "acteurRef": "PA718728",
      "legislature": "15",
      "typeOrgane": "GP",
      "dateDebut": "2017-06-27T02:00:00.000+02:00",
      "datePublication": "2017-06-28T02:00:00.000+02:00",
      "preseance": "20",
      "nominPrincipale": "1",
      "infosQualite": {
        "codeQualite": "Membre",
        "libQualite": "Membre du",
        "libQualiteSex": "Membre du"
      },
      "organesRefs": [
        "PO730964"
      ]
    },
    {
      "xsiType": "MandatSimple_Type",
      "uid": "PM732102",
      "acteurRef": "PA718728",
      "legislature": "15",
      "typeOrgane": "COMPER",
      "dateDebut": "2017-06-29T02:00:00.000+02:00",
      "datePublication": "2017-06-29T02:00:00.000+02:00",
      "dateFin": "2018-06-07T02:00:00.000+02:00",
      "preseance": "32",
      "nominPrincipale": "1",
      "infosQualite": {
        "codeQualite": "Membre",
        "libQualite": "Membre",
        "libQualiteSex": "Membre"
      },
      "organesRefs": [
        "PO419865"
      ]
    },
    {
      "xsiType": "MandatSimple_Type",
      "uid": "PM735280",
      "acteurRef": "PA718728",
      "legislature": "15",
      "typeOrgane": "GA",
      "dateDebut": "2017-09-26T02:00:00.000+02:00",
      "preseance": "20",
      "nominPrincipale": "0",
      "infosQualite": {
        "codeQualite": "Membre",
        "libQualite": "Membre",
        "libQualiteSex": "Membre"
      },
      "organesRefs": [
        "PO733102"
      ]
    },
    {
      "xsiType": "MandatSimple_Type",
      "uid": "PM735281",
      "acteurRef": "PA718728",
      "legislature": "15",
      "typeOrgane": "GA",
      "dateDebut": "2017-09-26T02:00:00.000+02:00",
      "preseance": "1",
      "nominPrincipale": "1",
      "infosQualite": {
        "codeQualite": "Président",
        "libQualite": "Président",
        "libQualiteSex": "Présidente"
      },
      "organesRefs": [
        "PO733102"
      ]
    },
    {
      "xsiType": "MandatSimple_Type",
      "uid": "PM737049",
      "acteurRef": "PA718728",
      "legislature": "15",
      "typeOrgane": "GA",
      "dateDebut": "2017-10-03T02:00:00.000+02:00",
      "preseance": "20",
      "nominPrincipale": "1",
      "infosQualite": {
        "codeQualite": "Membre",
        "libQualite": "Membre",
        "libQualiteSex": "Membre"
      },
      "organesRefs": [
        "PO733322"
      ]
    },
    {
      "xsiType": "MandatSimple_Type",
      "uid": "PM741816",
      "acteurRef": "PA718728",
      "legislature": "15",
      "typeOrgane": "ORGEXTPARL",
      "dateDebut": "2017-10-25T02:00:00.000+02:00",
      "datePublication": "2017-10-26T02:00:00.000+02:00",
      "dateFin": "2018-06-12T02:00:00.000+02:00",
      "preseance": "20",
      "nominPrincipale": "1",
      "infosQualite": {
        "codeQualite": "Titulaire",
        "libQualite": "Membre titulaire",
        "libQualiteSex": "Membre titulaire"
      },
      "organesRefs": [
        "PO681960"
      ]
    },
    {
      "xsiType": "MandatSimple_Type",
      "uid": "PM744005",
      "acteurRef": "PA718728",
      "legislature": "15",
      "typeOrgane": "DELEG",
      "dateDebut": "2017-11-24T01:00:00.000+01:00",
      "datePublication": "2017-11-24T01:00:00.000+01:00",
      "preseance": "20",
      "nominPrincipale": "1",
      "infosQualite": {
        "codeQualite": "Membre",
        "libQualite": "Membre",
        "libQualiteSex": "Membre"
      },
      "organesRefs": [
        "PO675659"
      ]
    },
    {
      "xsiType": "MandatSimple_Type",
      "uid": "PM745439",
      "acteurRef": "PA718728",
      "typeOrgane": "PARPOL",
      "dateDebut": "2017-12-01T01:00:00.000+01:00",
      "dateFin": "2018-11-30T01:00:00.000+01:00",
      "preseance": "5",
      "nominPrincipale": "1",
      "infosQualite": {
        "codeQualite": "Membre",
        "libQualite": "Membre",
        "libQualiteSex": "Membre"
      },
      "organesRefs": [
        "PO744854"
      ]
    },
    {
      "xsiType": "MandatSimple_Type",
      "uid": "PM747866",
      "acteurRef": "PA718728",
      "legislature": "15",
      "typeOrgane": "ORGEXTPARL",
      "dateDebut": "2018-01-10T01:00:00.000+01:00",
      "datePublication": "2018-01-11T01:00:00.000+01:00",
      "preseance": "20",
      "nominPrincipale": "1",
      "infosQualite": {
        "codeQualite": "Titulaire",
        "libQualite": "Membre titulaire",
        "libQualiteSex": "Membre titulaire"
      },
      "organesRefs": [
        "PO717436"
      ]
    },
    {
      "xsiType": "MandatSimple_Type",
      "uid": "PM749149",
      "acteurRef": "PA718728",
      "legislature": "15",
      "typeOrgane": "GE",
      "dateDebut": "2018-02-08T01:00:00.000+01:00",
      "preseance": "20",
      "nominPrincipale": "0",
      "infosQualite": {
        "codeQualite": "Membre",
        "libQualite": "Membre",
        "libQualiteSex": "Membre"
      },
      "organesRefs": [
        "PO746796"
      ]
    },
    {
      "xsiType": "MandatSimple_Type",
      "uid": "PM749189",
      "acteurRef": "PA718728",
      "legislature": "15",
      "typeOrgane": "GE",
      "dateDebut": "2018-02-08T01:00:00.000+01:00",
      "preseance": "20",
      "nominPrincipale": "1",
      "infosQualite": {
        "codeQualite": "Membre",
        "libQualite": "Membre",
        "libQualiteSex": "Membre"
      },
      "organesRefs": [
        "PO746925"
      ]
    },
    {
      "xsiType": "MandatSimple_Type",
      "uid": "PM749499",
      "acteurRef": "PA718728",
      "legislature": "15",
      "typeOrgane": "GE",
      "dateDebut": "2018-02-13T01:00:00.000+01:00",
      "preseance": "20",
      "nominPrincipale": "1",
      "infosQualite": {
        "codeQualite": "Membre",
        "libQualite": "Membre",
        "libQualiteSex": "Membre"
      },
      "organesRefs": [
        "PO746735"
      ]
    },
    {
      "xsiType": "MandatSimple_Type",
      "uid": "PM750617",
      "acteurRef": "PA718728",
      "legislature": "15",
      "typeOrgane": "GE",
      "dateDebut": "2018-02-12T01:00:00.000+01:00",
      "preseance": "20",
      "nominPrincipale": "1",
      "infosQualite": {
        "codeQualite": "Membre",
        "libQualite": "Membre",
        "libQualiteSex": "Membre"
      },
      "organesRefs": [
        "PO746857"
      ]
    },
    {
      "xsiType": "MandatSimple_Type",
      "uid": "PM750913",
      "acteurRef": "PA718728",
      "legislature": "15",
      "typeOrgane": "GE",
      "dateDebut": "2018-02-19T01:00:00.000+01:00",
      "preseance": "20",
      "nominPrincipale": "1",
      "infosQualite": {
        "codeQualite": "Membre",
        "libQualite": "Membre",
        "libQualiteSex": "Membre"
      },
      "organesRefs": [
        "PO746880"
      ]
    },
    {
      "xsiType": "MandatSimple_Type",
      "uid": "PM751234",
      "acteurRef": "PA718728",
      "legislature": "15",
      "typeOrgane": "GE",
      "dateDebut": "2018-02-19T01:00:00.000+01:00",
      "preseance": "20",
      "nominPrincipale": "1",
      "infosQualite": {
        "codeQualite": "Membre",
        "libQualite": "Membre",
        "libQualiteSex": "Membre"
      },
      "organesRefs": [
        "PO747241"
      ]
    },
    {
      "xsiType": "MandatSimple_Type",
      "uid": "PM751665",
      "acteurRef": "PA718728",
      "legislature": "15",
      "typeOrgane": "GE",
      "dateDebut": "2018-02-22T01:00:00.000+01:00",
      "preseance": "20",
      "nominPrincipale": "1",
      "infosQualite": {
        "codeQualite": "Membre",
        "libQualite": "Membre",
        "libQualiteSex": "Membre"
      },
      "organesRefs": [
        "PO746669"
      ]
    },
    {
      "xsiType": "MandatSimple_Type",
      "uid": "PM752001",
      "acteurRef": "PA718728",
      "legislature": "15",
      "typeOrgane": "GE",
      "dateDebut": "2018-02-26T01:00:00.000+01:00",
      "preseance": "20",
      "nominPrincipale": "1",
      "infosQualite": {
        "codeQualite": "Membre",
        "libQualite": "Membre",
        "libQualiteSex": "Membre"
      },
      "organesRefs": [
        "PO746649"
      ]
    },
    {
      "xsiType": "MandatSimple_Type",
      "uid": "PM752229",
      "acteurRef": "PA718728",
      "legislature": "15",
      "typeOrgane": "GE",
      "dateDebut": "2018-03-05T01:00:00.000+01:00",
      "preseance": "20",
      "nominPrincipale": "1",
      "infosQualite": {
        "codeQualite": "Membre",
        "libQualite": "Membre",
        "libQualiteSex": "Membre"
      },
      "organesRefs": [
        "PO747205"
      ]
    },
    {
      "xsiType": "MandatSimple_Type",
      "uid": "PM752241",
      "acteurRef": "PA718728",
      "legislature": "15",
      "typeOrgane": "GE",
      "dateDebut": "2018-03-03T01:00:00.000+01:00",
      "preseance": "20",
      "nominPrincipale": "1",
      "infosQualite": {
        "codeQualite": "Membre",
        "libQualite": "Membre",
        "libQualiteSex": "Membre"
      },
      "organesRefs": [
        "PO747185"
      ]
    },
    {
      "xsiType": "MandatSimple_Type",
      "uid": "PM752319",
      "acteurRef": "PA718728",
      "legislature": "15",
      "typeOrgane": "GE",
      "dateDebut": "2018-03-05T01:00:00.000+01:00",
      "preseance": "20",
      "nominPrincipale": "0",
      "infosQualite": {
        "codeQualite": "Membre",
        "libQualite": "Membre",
        "libQualiteSex": "Membre"
      },
      "organesRefs": [
        "PO746806"
      ]
    },
    {
      "xsiType": "MandatSimple_Type",
      "uid": "PM752595",
      "acteurRef": "PA718728",
      "legislature": "15",
      "typeOrgane": "GE",
      "dateDebut": "2018-03-06T01:00:00.000+01:00",
      "preseance": "20",
      "nominPrincipale": "1",
      "infosQualite": {
        "codeQualite": "Membre",
        "libQualite": "Membre",
        "libQualiteSex": "Membre"
      },
      "organesRefs": [
        "PO747165"
      ]
    },
    {
      "xsiType": "MandatSimple_Type",
      "uid": "PM753272",
      "acteurRef": "PA718728",
      "legislature": "15",
      "typeOrgane": "GE",
      "dateDebut": "2018-03-13T01:00:00.000+01:00",
      "preseance": "20",
      "nominPrincipale": "1",
      "infosQualite": {
        "codeQualite": "Membre",
        "libQualite": "Membre",
        "libQualiteSex": "Membre"
      },
      "organesRefs": [
        "PO747047"
      ]
    },
    {
      "xsiType": "MandatSimple_Type",
      "uid": "PM753460",
      "acteurRef": "PA718728",
      "legislature": "15",
      "typeOrgane": "GE",
      "dateDebut": "2018-03-14T01:00:00.000+01:00",
      "preseance": "20",
      "nominPrincipale": "0",
      "infosQualite": {
        "codeQualite": "Membre",
        "libQualite": "Membre",
        "libQualiteSex": "Membre"
      },
      "organesRefs": [
        "PO747160"
      ]
    },
    {
      "xsiType": "MandatSimple_Type",
      "uid": "PM753600",
      "acteurRef": "PA718728",
      "legislature": "15",
      "typeOrgane": "GE",
      "dateDebut": "2018-03-15T01:00:00.000+01:00",
      "preseance": "12",
      "nominPrincipale": "1",
      "infosQualite": {
        "codeQualite": "Secrétaire",
        "libQualite": "Secrétaire",
        "libQualiteSex": "Secrétaire"
      },
      "organesRefs": [
        "PO746796"
      ]
    },
    {
      "xsiType": "MandatSimple_Type",
      "uid": "PM753766",
      "acteurRef": "PA718728",
      "legislature": "15",
      "typeOrgane": "GE",
      "dateDebut": "2018-03-19T01:00:00.000+01:00",
      "preseance": "20",
      "nominPrincipale": "1",
      "infosQualite": {
        "codeQualite": "Membre",
        "libQualite": "Membre",
        "libQualiteSex": "Membre"
      },
      "organesRefs": [
        "PO747084"
      ]
    },
    {
      "xsiType": "MandatSimple_Type",
      "uid": "PM754116",
      "acteurRef": "PA718728",
      "legislature": "15",
      "typeOrgane": "GE",
      "dateDebut": "2018-03-22T01:00:00.000+01:00",
      "preseance": "8",
      "nominPrincipale": "1",
      "infosQualite": {
        "codeQualite": "Vice-Président",
        "libQualite": "Vice-Président",
        "libQualiteSex": "Vice-Présidente"
      },
      "organesRefs": [
        "PO747160"
      ]
    },
    {
      "xsiType": "MandatSimple_Type",
      "uid": "PM754996",
      "acteurRef": "PA718728",
      "legislature": "15",
      "typeOrgane": "GE",
      "dateDebut": "2018-04-04T02:00:00.000+02:00",
      "preseance": "8",
      "nominPrincipale": "1",
      "infosQualite": {
        "codeQualite": "Vice-Président",
        "libQualite": "Vice-Président",
        "libQualiteSex": "Vice-Présidente"
      },
      "organesRefs": [
        "PO746806"
      ]
    },
    {
      "xsiType": "MandatSimple_Type",
      "uid": "PM756758",
      "acteurRef": "PA718728",
      "legislature": "15",
      "typeOrgane": "GE",
      "dateDebut": "2018-06-01T02:00:00.000+02:00",
      "preseance": "20",
      "nominPrincipale": "1",
      "infosQualite": {
        "codeQualite": "Membre",
        "libQualite": "Membre",
        "libQualiteSex": "Membre"
      },
      "organesRefs": [
        "PO746915"
      ]
    },
    {
      "xsiType": "MandatSimple_Type",
      "uid": "PM756812",
      "acteurRef": "PA718728",
      "legislature": "15",
      "typeOrgane": "COMPER",
      "dateDebut": "2018-06-08T02:00:00.000+02:00",
      "datePublication": "2018-06-08T02:00:00.000+02:00",
      "dateFin": "2019-07-09T02:00:00.000+02:00",
      "preseance": "32",
      "nominPrincipale": "1",
      "infosQualite": {
        "codeQualite": "Membre",
        "libQualite": "Membre",
        "libQualiteSex": "Membre"
      },
      "organesRefs": [
        "PO420120"
      ]
    },
    {
      "xsiType": "MandatMission_Type",
      "uid": "PM757241",
      "acteurRef": "PA718728",
      "legislature": "15",
      "typeOrgane": "MISINFOPRE",
      "dateDebut": "2018-06-26T02:00:00.000+02:00",
      "datePublication": "2018-06-27T02:00:00.000+02:00",
      "dateFin": "2019-01-15T01:00:00.000+01:00",
      "preseance": "20",
      "nominPrincipale": "1",
      "infosQualite": {
        "codeQualite": "Membre",
        "libQualite": "Membre",
        "libQualiteSex": "Membre"
      },
      "organesRefs": [
        "PO757118"
      ]
    },
    {
      "xsiType": "MandatSimple_Type",
      "uid": "PM761847",
      "acteurRef": "PA718728",
      "typeOrgane": "PARPOL",
      "dateDebut": "2018-12-01T01:00:00.000+01:00",
      "preseance": "5",
      "nominPrincipale": "1",
      "infosQualite": {
        "codeQualite": "Membre",
        "libQualite": "Membre",
        "libQualiteSex": "Membre"
      },
      "organesRefs": [
        "PO761294"
      ]
    },
    {
      "xsiType": "MandatSimple_Type",
      "uid": "PM762645",
      "acteurRef": "PA718728",
      "legislature": "15",
      "typeOrgane": "CNPE",
      "dateDebut": "2019-02-12T01:00:00.000+01:00",
      "datePublication": "2019-02-13T01:00:00.000+01:00",
      "dateFin": "2019-07-03T02:00:00.000+02:00",
      "preseance": "20",
      "nominPrincipale": "1",
      "infosQualite": {
        "codeQualite": "Membre",
        "libQualite": "Membre",
        "libQualiteSex": "Membre"
      },
      "organesRefs": [
        "PO762435"
      ]
    },
    {
      "xsiType": "MandatSimple_Type",
      "uid": "PM762836",
      "acteurRef": "PA718728",
      "legislature": "15",
      "typeOrgane": "CNPE",
      "dateDebut": "2019-02-19T01:00:00.000+01:00",
      "datePublication": "2019-02-20T01:00:00.000+01:00",
      "dateFin": "2019-07-03T02:00:00.000+02:00",
      "preseance": "14",
      "nominPrincipale": "1",
      "infosQualite": {
        "codeQualite": "Secrétaire",
        "libQualite": "Secrétaire",
        "libQualiteSex": "Secrétaire"
      },
      "organesRefs": [
        "PO762435"
      ]
    },
    {
      "xsiType": "MandatSimple_Type",
      "uid": "PM764551",
      "acteurRef": "PA718728",
      "legislature": "15",
      "typeOrgane": "GE",
      "dateDebut": "2019-04-09T02:00:00.000+02:00",
      "preseance": "20",
      "nominPrincipale": "1",
      "infosQualite": {
        "codeQualite": "Membre",
        "libQualite": "Membre",
        "libQualiteSex": "Membre"
      },
      "organesRefs": [
        "PO763249"
      ]
    },
    {
      "xsiType": "MandatSimple_Type",
      "uid": "PM765737",
      "acteurRef": "PA718728",
      "legislature": "15",
      "typeOrgane": "CNPE",
      "dateDebut": "2019-06-13T02:00:00.000+02:00",
      "datePublication": "2019-06-14T02:00:00.000+02:00",
      "preseance": "20",
      "nominPrincipale": "1",
      "infosQualite": {
        "codeQualite": "Membre",
        "libQualite": "Membre",
        "libQualiteSex": "Membre"
      },
      "organesRefs": [
        "PO765498"
      ]
    },
    {
      "xsiType": "MandatSimple_Type",
      "uid": "PM766304",
      "acteurRef": "PA718728",
      "legislature": "15",
      "typeOrgane": "COMPER",
      "dateDebut": "2019-07-10T02:00:00.000+02:00",
      "datePublication": "2019-07-10T02:00:00.000+02:00",
      "dateFin": "2019-07-11T02:00:00.000+02:00",
      "preseance": "32",
      "nominPrincipale": "1",
      "infosQualite": {
        "codeQualite": "Membre",
        "libQualite": "Membre",
        "libQualiteSex": "Membre"
      },
      "organesRefs": [
        "PO59051"
      ]
    },
    {
      "xsiType": "MandatMission_Type",
      "uid": "PM766363",
      "acteurRef": "PA718728",
      "legislature": "15",
      "typeOrgane": "MISINFO",
      "dateDebut": "2019-07-10T02:00:00.000+02:00",
      "preseance": "10",
      "nominPrincipale": "0",
      "infosQualite": {
        "codeQualite": "Membre",
        "libQualite": "Membre",
        "libQualiteSex": "Membre"
      },
      "organesRefs": [
        "PO766338"
      ]
    },
    {
      "xsiType": "MandatMission_Type",
      "uid": "PM766365",
      "acteurRef": "PA718728",
      "legislature": "15",
      "typeOrgane": "MISINFO",
      "dateDebut": "2019-07-10T02:00:00.000+02:00",
      "preseance": "5",
      "nominPrincipale": "1",
      "infosQualite": {
        "codeQualite": "Co-rapporteur",
        "libQualite": "Co-rapporteur",
        "libQualiteSex": "Co-rapporteure"
      },
      "organesRefs": [
        "PO766338"
      ]
    },
    {
      "xsiType": "MandatSimple_Type",
      "uid": "PM766392",
      "acteurRef": "PA718728",
      "legislature": "15",
      "typeOrgane": "COMPER",
      "dateDebut": "2019-07-12T02:00:00.000+02:00",
      "datePublication": "2019-07-12T02:00:00.000+02:00",
      "preseance": "32",
      "nominPrincipale": "1",
      "infosQualite": {
        "codeQualite": "Membre",
        "libQualite": "Membre",
        "libQualiteSex": "Membre"
      },
      "organesRefs": [
        "PO420120"
      ]
    },
    {
      "xsiType": "MandatMission_Type",
      "uid": "PM766403",
      "acteurRef": "PA718728",
      "legislature": "15",
      "typeOrgane": "MISINFOPRE",
      "dateDebut": "2019-07-12T02:00:00.000+02:00",
      "datePublication": "2019-07-13T02:00:00.000+02:00",
      "preseance": "20",
      "nominPrincipale": "1",
      "infosQualite": {
        "codeQualite": "Membre",
        "libQualite": "Membre",
        "libQualiteSex": "Membre"
      },
      "organesRefs": [
        "PO766012"
      ]
    },
    {
      "xsiType": "MandatSimple_Type",
      "uid": "PM766799",
      "acteurRef": "PA718728",
      "legislature": "15",
      "typeOrgane": "CNPS",
      "dateDebut": "2019-07-24T02:00:00.000+02:00",
      "datePublication": "2019-07-25T02:00:00.000+02:00",
      "preseance": "20",
      "nominPrincipale": "1",
      "infosQualite": {
        "codeQualite": "Membre",
        "libQualite": "Membre",
        "libQualiteSex": "Membre"
      },
      "organesRefs": [
        "PO766718"
      ]
    }
  ]
}