{
  "xsiType": "GroupePolitique_type",
  "uid": "PO730964",
  "codeType": "GP",
  "libelle": "La République en Marche",
  "libelleEdition": "du groupe La République en Marche",
  "libelleAbrege": "LaREM",
  "libelleAbrev": "LAREM",
  "viMoDe": {
    "dateDebut": "2017-06-27T02:00:00.000+02:00"
  },
  "regime": "5ème République",
  "legislature": "15",
  "secretariat": {},
  "positionPolitique": "Majoritaire",
  "preseance": "1",
  "couleurAssociee": "#702A82"
}