{
  "xsiType": "OrganeExterne_Type",
  "uid": "PO388083",
  "codeType": "MINISTERE",
  "libelle": "Ministère de l'immigration, de l'intégration, de l'identité nationale et du codéveloppement",
  "libelleEdition": "de l'immigration, de l'intégration, de l'identité nationale et du codéveloppement",
  "libelleAbrege": "Immigration, intégration, identité nationale et codéveloppement",
  "libelleAbrev": "IMM",
  "viMoDe": {
    "dateDebut": "2007-06-19T02:00:00.000+02:00",
    "dateFin": "2008-03-17T01:00:00.000+01:00"
  },
  "organeParentRef": "PO384206"
}