{
  "uid": "PA810",
  "etatCivil": {
    "ident": {
      "civ": "M.",
      "prenom": "Jean-Paul",
      "nom": "Chanteguet",
      "alpha": "Chanteguet"
    },
    "infoNaissance": {
      "dateNais": "1949-12-09T01:00:00.000+01:00",
      "villeNais": "Le Blanc",
      "depNais": "Indre",
      "paysNais": "France"
    }
  },
  "profession": {
    "libelleCourant": "Conseiller économique",
    "socProcInsee": {
      "catSocPro": "Professions libérales et assimilés",
      "famSocPro": "Cadres et professions intellectuelles supérieures"
    }
  },
  "adresses": [
    {
      "xsiType": "AdressePostale_Type",
      "uid": "AD45336",
      "type": "2",
      "typeLibelle": "Adresse publiée de circonscription",
      "poids": "22",
      "intitule": "Hôtel de Ville,",
      "complementAdresse": "BP 107",
      "codePostal": "36300",
      "ville": "Le Blanc"
    },
    {
      "xsiType": "AdresseTelephonique_Type",
      "uid": "AD47528",
      "type": "11",
      "typeLibelle": "Téléphone",
      "poids": "22",
      "adresseDeRattachement": "AD45336",
      "valElec": "02 54 37 18 30"
    },
    {
      "xsiType": "AdressePostale_Type",
      "uid": "AD386748",
      "type": "0",
      "typeLibelle": "Adresse officielle",
      "poids": "1",
      "intitule": "Assemblée nationale,",
      "numeroRue": "126",
      "nomRue": "Rue de l'Université,",
      "codePostal": "75355",
      "ville": "Paris 07 SP"
    },
    {
      "xsiType": "AdresseMail_Type",
      "uid": "AD391695",
      "type": "15",
      "typeLibelle": "Mèl",
      "valElec": "jpchanteguet@assemblee-nationale.fr"
    },
    {
      "xsiType": "AdresseTelephonique_Type",
      "uid": "AD665185",
      "type": "11",
      "typeLibelle": "Téléphone",
      "poids": "1",
      "adresseDeRattachement": "AD386748",
      "valElec": "01 40 63 25 17"
    },
    {
      "xsiType": "AdresseTelephonique_Type",
      "uid": "AD665186",
      "type": "12",
      "typeLibelle": "Télécopie",
      "poids": "1",
      "adresseDeRattachement": "AD386748",
      "valElec": "01 40 63 25 95"
    },
    {
      "xsiType": "AdresseTelephonique_Type",
      "uid": "AD704736",
      "type": "12",
      "typeLibelle": "Télécopie",
      "poids": "22",
      "adresseDeRattachement": "AD45336",
      "valElec": "02 54 37 15 55"
    },
    {
      "xsiType": "AdressePostale_Type",
      "uid": "AD704737",
      "type": "2",
      "typeLibelle": "Adresse publiée de circonscription",
      "poids": "23",
      "intitule": "Permanence parlementaire",
      "numeroRue": "6 Bis",
      "nomRue": "Rue Saint-Luc",
      "codePostal": "36000",
      "ville": "Châteauroux"
    },
    {
      "xsiType": "AdresseTelephonique_Type",
      "uid": "AD704738",
      "type": "11",
      "typeLibelle": "Téléphone",
      "poids": "23",
      "adresseDeRattachement": "AD704737",
      "valElec": "02 54 08 43 48"
    },
    {
      "xsiType": "AdresseTelephonique_Type",
      "uid": "AD704739",
      "type": "12",
      "typeLibelle": "Télécopie",
      "poids": "23",
      "adresseDeRattachement": "AD704737",
      "valElec": "02 54 08 43 48"
    }
  ],
  "mandats": [
    {
      "xsiType": "MandatParlementaire_type",
      "uid": "PM267658",
      "acteurRef": "PA810",
      "legislature": "12",
      "typeOrgane": "ASSEMBLEE",
      "dateDebut": "2002-06-19T02:00:00.000+02:00",
      "dateFin": "2007-06-19T02:00:00.000+02:00",
      "preseance": "50",
      "nominPrincipale": "1",
      "infosQualite": {
        "codeQualite": "membre",
        "libQualite": "membre",
        "libQualiteSex": "membre"
      },
      "organesRefs": [
        "PO230434"
      ],
      "suppleant": {
        "dateDebut": "2002-06-19T02:00:00.000+02:00",
        "dateFin": "2007-06-19T02:00:00.000+02:00",
        "suppleantRef": "PA2646"
      },
      "election": {
        "lieu": {
          "region": "Centre-Val de Loire",
          "regionType": "Métropolitain",
          "departement": "Indre",
          "numDepartement": "36",
          "numCirco": "3"
        },
        "causeMandat": "élections générales",
        "refCirconscription": "PO230605"
      },
      "mandature": {
        "datePriseFonction": "2002-06-19T02:00:00.000+02:00",
        "causeFin": "Fin de législature",
        "premiereElection": "1"
      }
    },
    {
      "xsiType": "MandatSimple_Type",
      "uid": "PM271352",
      "acteurRef": "PA810",
      "legislature": "12",
      "typeOrgane": "GP",
      "dateDebut": "2002-06-25T02:00:00.000+02:00",
      "datePublication": "2002-06-26T02:00:00.000+02:00",
      "dateFin": "2007-06-19T02:00:00.000+02:00",
      "preseance": "20",
      "nominPrincipale": "1",
      "infosQualite": {
        "codeQualite": "Membre",
        "libQualite": "Membre du",
        "libQualiteSex": "Membre du"
      },
      "organesRefs": [
        "PO270907"
      ]
    },
    {
      "xsiType": "MandatSimple_Type",
      "uid": "PM271948",
      "acteurRef": "PA810",
      "legislature": "12",
      "typeOrgane": "COMPER",
      "dateDebut": "2002-06-26T02:00:00.000+02:00",
      "datePublication": "2002-06-27T02:00:00.000+02:00",
      "dateFin": "2007-06-19T02:00:00.000+02:00",
      "preseance": "32",
      "nominPrincipale": "1",
      "infosQualite": {
        "codeQualite": "Membre",
        "libQualite": "Membre",
        "libQualiteSex": "Membre"
      },
      "organesRefs": [
        "PO277060"
      ]
    },
    {
      "xsiType": "MandatSimple_Type",
      "uid": "PM279193",
      "acteurRef": "PA810",
      "legislature": "12",
      "typeOrgane": "GA",
      "dateDebut": "2002-10-29T01:00:00.000+01:00",
      "dateFin": "2007-06-19T02:00:00.000+02:00",
      "preseance": "20",
      "nominPrincipale": "1",
      "infosQualite": {
        "codeQualite": "Membre",
        "libQualite": "Membre",
        "libQualiteSex": "Membre"
      },
      "organesRefs": [
        "PO274067"
      ]
    },
    {
      "xsiType": "MandatSimple_Type",
      "uid": "PM286308",
      "acteurRef": "PA810",
      "legislature": "12",
      "typeOrgane": "GE",
      "dateDebut": "2002-12-18T01:00:00.000+01:00",
      "dateFin": "2007-06-19T02:00:00.000+02:00",
      "preseance": "20",
      "nominPrincipale": "1",
      "infosQualite": {
        "codeQualite": "Membre",
        "libQualite": "Membre",
        "libQualiteSex": "Membre"
      },
      "organesRefs": [
        "PO285047"
      ]
    },
    {
      "xsiType": "MandatSimple_Type",
      "uid": "PM287292",
      "acteurRef": "PA810",
      "legislature": "12",
      "typeOrgane": "GE",
      "dateDebut": "2002-11-27T01:00:00.000+01:00",
      "dateFin": "2007-06-19T02:00:00.000+02:00",
      "preseance": "20",
      "nominPrincipale": "0",
      "infosQualite": {
        "codeQualite": "Membre",
        "libQualite": "Membre",
        "libQualiteSex": "Membre"
      },
      "organesRefs": [
        "PO285081"
      ]
    },
    {
      "xsiType": "MandatSimple_Type",
      "uid": "PM287293",
      "acteurRef": "PA810",
      "legislature": "12",
      "typeOrgane": "GE",
      "dateDebut": "2002-11-27T01:00:00.000+01:00",
      "dateFin": "2007-06-19T02:00:00.000+02:00",
      "preseance": "1",
      "nominPrincipale": "1",
      "infosQualite": {
        "codeQualite": "Président",
        "libQualite": "Président",
        "libQualiteSex": "Président"
      },
      "organesRefs": [
        "PO285081"
      ]
    },
    {
      "xsiType": "MandatSimple_Type",
      "uid": "PM288401",
      "acteurRef": "PA810",
      "legislature": "12",
      "typeOrgane": "GE",
      "dateDebut": "2002-12-17T01:00:00.000+01:00",
      "dateFin": "2007-06-19T02:00:00.000+02:00",
      "preseance": "20",
      "nominPrincipale": "1",
      "infosQualite": {
        "codeQualite": "Membre",
        "libQualite": "Membre",
        "libQualiteSex": "Membre"
      },
      "organesRefs": [
        "PO285129"
      ]
    },
    {
      "xsiType": "MandatSimple_Type",
      "uid": "PM288656",
      "acteurRef": "PA810",
      "legislature": "12",
      "typeOrgane": "GE",
      "dateDebut": "2003-01-29T01:00:00.000+01:00",
      "dateFin": "2007-06-19T02:00:00.000+02:00",
      "preseance": "20",
      "nominPrincipale": "1",
      "infosQualite": {
        "codeQualite": "Membre",
        "libQualite": "Membre",
        "libQualiteSex": "Membre"
      },
      "organesRefs": [
        "PO285117"
      ]
    },
    {
      "xsiType": "MandatSimple_Type",
      "uid": "PM290594",
      "acteurRef": "PA810",
      "legislature": "12",
      "typeOrgane": "GE",
      "dateDebut": "2003-03-05T01:00:00.000+01:00",
      "dateFin": "2007-06-19T02:00:00.000+02:00",
      "preseance": "20",
      "nominPrincipale": "1",
      "infosQualite": {
        "codeQualite": "Membre",
        "libQualite": "Membre",
        "libQualiteSex": "Membre"
      },
      "organesRefs": [
        "PO285107"
      ]
    },
    {
      "xsiType": "MandatSimple_Type",
      "uid": "PM295928",
      "acteurRef": "PA810",
      "legislature": "12",
      "typeOrgane": "GE",
      "dateDebut": "2003-04-01T02:00:00.000+02:00",
      "dateFin": "2007-06-19T02:00:00.000+02:00",
      "preseance": "20",
      "nominPrincipale": "1",
      "infosQualite": {
        "codeQualite": "Membre",
        "libQualite": "Membre",
        "libQualiteSex": "Membre"
      },
      "organesRefs": [
        "PO285121"
      ]
    },
    {
      "xsiType": "MandatSimple_Type",
      "uid": "PM296775",
      "acteurRef": "PA810",
      "legislature": "12",
      "typeOrgane": "GE",
      "dateDebut": "2002-11-01T01:00:00.000+01:00",
      "dateFin": "2007-06-19T02:00:00.000+02:00",
      "preseance": "20",
      "nominPrincipale": "1",
      "infosQualite": {
        "codeQualite": "Membre",
        "libQualite": "Membre",
        "libQualiteSex": "Membre"
      },
      "organesRefs": [
        "PO285046"
      ]
    },
    {
      "xsiType": "MandatSimple_Type",
      "uid": "PM297067",
      "acteurRef": "PA810",
      "legislature": "12",
      "typeOrgane": "GE",
      "dateDebut": "2002-10-16T02:00:00.000+02:00",
      "dateFin": "2007-06-19T02:00:00.000+02:00",
      "preseance": "20",
      "nominPrincipale": "1",
      "infosQualite": {
        "codeQualite": "Membre",
        "libQualite": "Membre",
        "libQualiteSex": "Membre"
      },
      "organesRefs": [
        "PO285071"
      ]
    },
    {
      "xsiType": "MandatParlementaire_type",
      "uid": "PM386109",
      "acteurRef": "PA810",
      "legislature": "13",
      "typeOrgane": "ASSEMBLEE",
      "dateDebut": "2007-06-20T02:00:00.000+02:00",
      "dateFin": "2012-06-19T02:00:00.000+02:00",
      "preseance": "50",
      "nominPrincipale": "1",
      "infosQualite": {
        "codeQualite": "membre",
        "libQualite": "membre",
        "libQualiteSex": "membre"
      },
      "organesRefs": [
        "PO384266"
      ],
      "suppleant": {
        "dateDebut": "2007-06-20T02:00:00.000+02:00",
        "dateFin": "2012-06-19T02:00:00.000+02:00",
        "suppleantRef": "PA2646"
      },
      "election": {
        "lieu": {
          "region": "Centre-Val de Loire",
          "regionType": "Métropolitain",
          "departement": "Indre",
          "numDepartement": "36",
          "numCirco": "3"
        },
        "causeMandat": "élections générales",
        "refCirconscription": "PO384437"
      },
      "mandature": {
        "datePriseFonction": "2007-06-20T02:00:00.000+02:00",
        "causeFin": "Fin de législature",
        "premiereElection": "1"
      }
    },
    {
      "xsiType": "MandatSimple_Type",
      "uid": "PM387327",
      "acteurRef": "PA810",
      "legislature": "13",
      "typeOrgane": "GP",
      "dateDebut": "2007-06-20T02:00:00.000+02:00",
      "dateFin": "2007-06-26T02:00:00.000+02:00",
      "preseance": "28",
      "nominPrincipale": "1",
      "infosQualite": {
        "codeQualite": "Député non-inscrit",
        "libQualite": "Député non-inscrit",
        "libQualiteSex": "Député non-inscrit"
      },
      "organesRefs": [
        "PO387155"
      ]
    },
    {
      "xsiType": "MandatSimple_Type",
      "uid": "PM390091",
      "acteurRef": "PA810",
      "legislature": "13",
      "typeOrgane": "GP",
      "dateDebut": "2007-06-27T02:00:00.000+02:00",
      "datePublication": "2007-06-27T02:00:00.000+02:00",
      "dateFin": "2012-06-19T02:00:00.000+02:00",
      "preseance": "20",
      "nominPrincipale": "1",
      "infosQualite": {
        "codeQualite": "Membre",
        "libQualite": "Membre du",
        "libQualiteSex": "Membre du"
      },
      "organesRefs": [
        "PO389507"
      ]
    },
    {
      "xsiType": "MandatSimple_Type",
      "uid": "PM390577",
      "acteurRef": "PA810",
      "legislature": "13",
      "typeOrgane": "COMPER",
      "dateDebut": "2007-06-27T02:00:00.000+02:00",
      "datePublication": "2007-06-28T02:00:00.000+02:00",
      "dateFin": "2009-06-30T02:00:00.000+02:00",
      "preseance": "32",
      "nominPrincipale": "1",
      "infosQualite": {
        "codeQualite": "Membre",
        "libQualite": "Membre",
        "libQualiteSex": "Membre"
      },
      "organesRefs": [
        "PO277060"
      ]
    },
    {
      "xsiType": "MandatSimple_Type",
      "uid": "PM391427",
      "acteurRef": "PA810",
      "legislature": "13",
      "typeOrgane": "DELEG",
      "dateDebut": "2007-07-03T02:00:00.000+02:00",
      "datePublication": "2007-07-04T02:00:00.000+02:00",
      "dateFin": "2009-06-15T02:00:00.000+02:00",
      "preseance": "20",
      "nominPrincipale": "1",
      "infosQualite": {
        "codeQualite": "Membre",
        "libQualite": "Membre",
        "libQualiteSex": "Membre"
      },
      "organesRefs": [
        "PO201275"
      ]
    },
    {
      "xsiType": "MandatSimple_Type",
      "uid": "PM395679",
      "acteurRef": "PA810",
      "legislature": "13",
      "typeOrgane": "GA",
      "dateDebut": "2007-09-28T02:00:00.000+02:00",
      "dateFin": "2012-06-19T02:00:00.000+02:00",
      "preseance": "20",
      "nominPrincipale": "0",
      "infosQualite": {
        "codeQualite": "Membre",
        "libQualite": "Membre",
        "libQualiteSex": "Membre"
      },
      "organesRefs": [
        "PO393105"
      ]
    },
    {
      "xsiType": "MandatSimple_Type",
      "uid": "PM395680",
      "acteurRef": "PA810",
      "legislature": "13",
      "typeOrgane": "GA",
      "dateDebut": "2007-09-28T02:00:00.000+02:00",
      "dateFin": "2012-06-19T02:00:00.000+02:00",
      "preseance": "1",
      "nominPrincipale": "1",
      "infosQualite": {
        "codeQualite": "Président",
        "libQualite": "Président",
        "libQualiteSex": "Président"
      },
      "organesRefs": [
        "PO393105"
      ]
    },
    {
      "xsiType": "MandatSimple_Type",
      "uid": "PM397715",
      "acteurRef": "PA810",
      "legislature": "13",
      "typeOrgane": "GA",
      "dateDebut": "2007-10-10T02:00:00.000+02:00",
      "dateFin": "2012-06-19T02:00:00.000+02:00",
      "preseance": "20",
      "nominPrincipale": "1",
      "infosQualite": {
        "codeQualite": "Membre",
        "libQualite": "Membre",
        "libQualiteSex": "Membre"
      },
      "organesRefs": [
        "PO392714"
      ]
    },
    {
      "xsiType": "MandatSimple_Type",
      "uid": "PM397716",
      "acteurRef": "PA810",
      "legislature": "13",
      "typeOrgane": "GA",
      "dateDebut": "2007-10-10T02:00:00.000+02:00",
      "dateFin": "2012-06-19T02:00:00.000+02:00",
      "preseance": "20",
      "nominPrincipale": "1",
      "infosQualite": {
        "codeQualite": "Membre",
        "libQualite": "Membre",
        "libQualiteSex": "Membre"
      },
      "organesRefs": [
        "PO392785"
      ]
    },
    {
      "xsiType": "MandatSimple_Type",
      "uid": "PM397717",
      "acteurRef": "PA810",
      "legislature": "13",
      "typeOrgane": "GA",
      "dateDebut": "2007-10-10T02:00:00.000+02:00",
      "dateFin": "2012-06-19T02:00:00.000+02:00",
      "preseance": "20",
      "nominPrincipale": "1",
      "infosQualite": {
        "codeQualite": "Membre",
        "libQualite": "Membre",
        "libQualiteSex": "Membre"
      },
      "organesRefs": [
        "PO393202"
      ]
    },
    {
      "xsiType": "MandatSimple_Type",
      "uid": "PM397718",
      "acteurRef": "PA810",
      "legislature": "13",
      "typeOrgane": "GA",
      "dateDebut": "2007-10-10T02:00:00.000+02:00",
      "dateFin": "2012-06-19T02:00:00.000+02:00",
      "preseance": "20",
      "nominPrincipale": "1",
      "infosQualite": {
        "codeQualite": "Membre",
        "libQualite": "Membre",
        "libQualiteSex": "Membre"
      },
      "organesRefs": [
        "PO393283"
      ]
    },
    {
      "xsiType": "MandatSimple_Type",
      "uid": "PM397719",
      "acteurRef": "PA810",
      "legislature": "13",
      "typeOrgane": "GA",
      "dateDebut": "2007-10-10T02:00:00.000+02:00",
      "dateFin": "2012-06-19T02:00:00.000+02:00",
      "preseance": "20",
      "nominPrincipale": "1",
      "infosQualite": {
        "codeQualite": "Membre",
        "libQualite": "Membre",
        "libQualiteSex": "Membre"
      },
      "organesRefs": [
        "PO393428"
      ]
    },
    {
      "xsiType": "MandatSimple_Type",
      "uid": "PM397720",
      "acteurRef": "PA810",
      "legislature": "13",
      "typeOrgane": "GA",
      "dateDebut": "2007-10-10T02:00:00.000+02:00",
      "dateFin": "2012-06-19T02:00:00.000+02:00",
      "preseance": "20",
      "nominPrincipale": "1",
      "infosQualite": {
        "codeQualite": "Membre",
        "libQualite": "Membre",
        "libQualiteSex": "Membre"
      },
      "organesRefs": [
        "PO393473"
      ]
    },
    {
      "xsiType": "MandatSimple_Type",
      "uid": "PM401324",
      "acteurRef": "PA810",
      "legislature": "13",
      "typeOrgane": "GA",
      "dateDebut": "2007-10-26T02:00:00.000+02:00",
      "dateFin": "2012-06-19T02:00:00.000+02:00",
      "preseance": "20",
      "nominPrincipale": "1",
      "infosQualite": {
        "codeQualite": "Membre",
        "libQualite": "Membre",
        "libQualiteSex": "Membre"
      },
      "organesRefs": [
        "PO392694"
      ]
    },
    {
      "xsiType": "MandatSimple_Type",
      "uid": "PM401325",
      "acteurRef": "PA810",
      "legislature": "13",
      "typeOrgane": "GA",
      "dateDebut": "2007-10-26T02:00:00.000+02:00",
      "dateFin": "2012-06-19T02:00:00.000+02:00",
      "preseance": "20",
      "nominPrincipale": "1",
      "infosQualite": {
        "codeQualite": "Membre",
        "libQualite": "Membre",
        "libQualiteSex": "Membre"
      },
      "organesRefs": [
        "PO392729"
      ]
    },
    {
      "xsiType": "MandatSimple_Type",
      "uid": "PM401326",
      "acteurRef": "PA810",
      "legislature": "13",
      "typeOrgane": "GA",
      "dateDebut": "2007-10-26T02:00:00.000+02:00",
      "dateFin": "2012-06-19T02:00:00.000+02:00",
      "preseance": "20",
      "nominPrincipale": "1",
      "infosQualite": {
        "codeQualite": "Membre",
        "libQualite": "Membre",
        "libQualiteSex": "Membre"
      },
      "organesRefs": [
        "PO392770"
      ]
    },
    {
      "xsiType": "MandatSimple_Type",
      "uid": "PM401327",
      "acteurRef": "PA810",
      "legislature": "13",
      "typeOrgane": "GA",
      "dateDebut": "2007-10-26T02:00:00.000+02:00",
      "dateFin": "2012-06-19T02:00:00.000+02:00",
      "preseance": "20",
      "nominPrincipale": "1",
      "infosQualite": {
        "codeQualite": "Membre",
        "libQualite": "Membre",
        "libQualiteSex": "Membre"
      },
      "organesRefs": [
        "PO392835"
      ]
    },
    {
      "xsiType": "MandatSimple_Type",
      "uid": "PM401328",
      "acteurRef": "PA810",
      "legislature": "13",
      "typeOrgane": "GA",
      "dateDebut": "2007-10-26T02:00:00.000+02:00",
      "dateFin": "2012-06-19T02:00:00.000+02:00",
      "preseance": "20",
      "nominPrincipale": "1",
      "infosQualite": {
        "codeQualite": "Membre",
        "libQualite": "Membre",
        "libQualiteSex": "Membre"
      },
      "organesRefs": [
        "PO392840"
      ]
    },
    {
      "xsiType": "MandatSimple_Type",
      "uid": "PM401329",
      "acteurRef": "PA810",
      "legislature": "13",
      "typeOrgane": "GA",
      "dateDebut": "2007-10-26T02:00:00.000+02:00",
      "dateFin": "2012-06-19T02:00:00.000+02:00",
      "preseance": "20",
      "nominPrincipale": "1",
      "infosQualite": {
        "codeQualite": "Membre",
        "libQualite": "Membre",
        "libQualiteSex": "Membre"
      },
      "organesRefs": [
        "PO393060"
      ]
    },
    {
      "xsiType": "MandatSimple_Type",
      "uid": "PM401330",
      "acteurRef": "PA810",
      "legislature": "13",
      "typeOrgane": "GA",
      "dateDebut": "2007-10-26T02:00:00.000+02:00",
      "dateFin": "2012-06-19T02:00:00.000+02:00",
      "preseance": "20",
      "nominPrincipale": "1",
      "infosQualite": {
        "codeQualite": "Membre",
        "libQualite": "Membre",
        "libQualiteSex": "Membre"
      },
      "organesRefs": [
        "PO393065"
      ]
    },
    {
      "xsiType": "MandatSimple_Type",
      "uid": "PM401331",
      "acteurRef": "PA810",
      "legislature": "13",
      "typeOrgane": "GA",
      "dateDebut": "2007-10-26T02:00:00.000+02:00",
      "dateFin": "2012-06-19T02:00:00.000+02:00",
      "preseance": "20",
      "nominPrincipale": "1",
      "infosQualite": {
        "codeQualite": "Membre",
        "libQualite": "Membre",
        "libQualiteSex": "Membre"
      },
      "organesRefs": [
        "PO393313"
      ]
    },
    {
      "xsiType": "MandatSimple_Type",
      "uid": "PM401332",
      "acteurRef": "PA810",
      "legislature": "13",
      "typeOrgane": "GA",
      "dateDebut": "2007-10-26T02:00:00.000+02:00",
      "dateFin": "2012-06-19T02:00:00.000+02:00",
      "preseance": "20",
      "nominPrincipale": "1",
      "infosQualite": {
        "codeQualite": "Membre",
        "libQualite": "Membre",
        "libQualiteSex": "Membre"
      },
      "organesRefs": [
        "PO393328"
      ]
    },
    {
      "xsiType": "MandatSimple_Type",
      "uid": "PM401333",
      "acteurRef": "PA810",
      "legislature": "13",
      "typeOrgane": "GA",
      "dateDebut": "2007-10-26T02:00:00.000+02:00",
      "dateFin": "2012-06-19T02:00:00.000+02:00",
      "preseance": "20",
      "nominPrincipale": "1",
      "infosQualite": {
        "codeQualite": "Membre",
        "libQualite": "Membre",
        "libQualiteSex": "Membre"
      },
      "organesRefs": [
        "PO393408"
      ]
    },
    {
      "xsiType": "MandatSimple_Type",
      "uid": "PM403923",
      "acteurRef": "PA810",
      "legislature": "13",
      "typeOrgane": "GE",
      "dateDebut": "2007-10-31T01:00:00.000+01:00",
      "dateFin": "2012-06-19T02:00:00.000+02:00",
      "preseance": "20",
      "nominPrincipale": "0",
      "infosQualite": {
        "codeQualite": "Membre",
        "libQualite": "Membre",
        "libQualiteSex": "Membre"
      },
      "organesRefs": [
        "PO403105"
      ]
    },
    {
      "xsiType": "MandatSimple_Type",
      "uid": "PM403924",
      "acteurRef": "PA810",
      "legislature": "13",
      "typeOrgane": "GE",
      "dateDebut": "2007-10-31T01:00:00.000+01:00",
      "dateFin": "2012-06-19T02:00:00.000+02:00",
      "preseance": "1",
      "nominPrincipale": "1",
      "infosQualite": {
        "codeQualite": "Président",
        "libQualite": "Président",
        "libQualiteSex": "Président"
      },
      "organesRefs": [
        "PO403105"
      ]
    },
    {
      "xsiType": "MandatSimple_Type",
      "uid": "PM413892",
      "acteurRef": "PA810",
      "legislature": "13",
      "typeOrgane": "GA",
      "dateDebut": "2007-12-13T01:00:00.000+01:00",
      "dateFin": "2012-06-19T02:00:00.000+02:00",
      "preseance": "8",
      "nominPrincipale": "1",
      "infosQualite": {
        "codeQualite": "Vice-Président",
        "libQualite": "Vice-Président",
        "libQualiteSex": "Vice-Président"
      },
      "organesRefs": [
        "PO393428"
      ]
    },
    {
      "xsiType": "MandatSimple_Type",
      "uid": "PM416308",
      "acteurRef": "PA810",
      "legislature": "13",
      "typeOrgane": "GE",
      "dateDebut": "2008-02-06T01:00:00.000+01:00",
      "dateFin": "2012-06-19T02:00:00.000+02:00",
      "preseance": "20",
      "nominPrincipale": "1",
      "infosQualite": {
        "codeQualite": "Membre",
        "libQualite": "Membre",
        "libQualiteSex": "Membre"
      },
      "organesRefs": [
        "PO402931"
      ]
    },
    {
      "xsiType": "MandatSimple_Type",
      "uid": "PM420725",
      "acteurRef": "PA810",
      "legislature": "13",
      "typeOrgane": "COMPER",
      "dateDebut": "2009-07-01T02:00:00.000+02:00",
      "datePublication": "2009-07-01T02:00:00.000+02:00",
      "dateFin": "2012-06-19T02:00:00.000+02:00",
      "preseance": "32",
      "nominPrincipale": "1",
      "infosQualite": {
        "codeQualite": "Membre",
        "libQualite": "Membre",
        "libQualiteSex": "Membre"
      },
      "organesRefs": [
        "PO419865"
      ]
    },
    {
      "xsiType": "MandatSimple_Type",
      "uid": "PM421201",
      "acteurRef": "PA810",
      "legislature": "13",
      "typeOrgane": "CMP",
      "dateDebut": "2009-07-16T02:00:00.000+02:00",
      "datePublication": "2009-07-17T02:00:00.000+02:00",
      "dateFin": "2009-09-01T02:00:00.000+02:00",
      "preseance": "20",
      "nominPrincipale": "1",
      "infosQualite": {
        "codeQualite": "Titulaire",
        "libQualite": "Membre titulaire",
        "libQualiteSex": "Membre titulaire"
      },
      "organesRefs": [
        "PO421034"
      ]
    },
    {
      "xsiType": "MandatSimple_Type",
      "uid": "PM424111",
      "acteurRef": "PA810",
      "legislature": "13",
      "typeOrgane": "CMP",
      "dateDebut": "2010-06-01T02:00:00.000+02:00",
      "datePublication": "2010-06-02T02:00:00.000+02:00",
      "dateFin": "2010-07-06T02:00:00.000+02:00",
      "preseance": "20",
      "nominPrincipale": "1",
      "infosQualite": {
        "codeQualite": "Titulaire",
        "libQualite": "Membre titulaire",
        "libQualiteSex": "Membre titulaire"
      },
      "organesRefs": [
        "PO423987"
      ]
    },
    {
      "xsiType": "MandatSimple_Type",
      "uid": "PM426160",
      "acteurRef": "PA810",
      "legislature": "13",
      "typeOrgane": "CNPE",
      "dateDebut": "2010-12-14T01:00:00.000+01:00",
      "datePublication": "2010-12-15T01:00:00.000+01:00",
      "dateFin": "2011-06-15T02:00:00.000+02:00",
      "preseance": "20",
      "nominPrincipale": "1",
      "infosQualite": {
        "codeQualite": "Membre",
        "libQualite": "Membre",
        "libQualiteSex": "Membre"
      },
      "organesRefs": [
        "PO426051"
      ]
    },
    {
      "xsiType": "MandatSimple_Type",
      "uid": "PM426385",
      "acteurRef": "PA810",
      "legislature": "13",
      "typeOrgane": "CMP",
      "dateDebut": "2010-12-20T01:00:00.000+01:00",
      "datePublication": "2010-12-22T01:00:00.000+01:00",
      "dateFin": "2010-12-23T01:00:00.000+01:00",
      "preseance": "20",
      "nominPrincipale": "1",
      "infosQualite": {
        "codeQualite": "Titulaire",
        "libQualite": "Membre titulaire",
        "libQualiteSex": "Membre titulaire"
      },
      "organesRefs": [
        "PO426365"
      ]
    },
    {
      "xsiType": "MandatSimple_Type",
      "uid": "PM428858",
      "acteurRef": "PA810",
      "legislature": "13",
      "typeOrgane": "CMP",
      "dateDebut": "2011-06-14T02:00:00.000+02:00",
      "datePublication": "2011-06-15T02:00:00.000+02:00",
      "dateFin": "2011-07-25T02:00:00.000+02:00",
      "preseance": "20",
      "nominPrincipale": "1",
      "infosQualite": {
        "codeQualite": "Titulaire",
        "libQualite": "Membre titulaire",
        "libQualiteSex": "Membre titulaire"
      },
      "organesRefs": [
        "PO428793"
      ]
    },
    {
      "xsiType": "MandatSimple_Type",
      "uid": "PM446225",
      "acteurRef": "PA810",
      "legislature": "13",
      "typeOrgane": "CNPE",
      "dateDebut": "2011-12-13T01:00:00.000+01:00",
      "datePublication": "2011-12-14T01:00:00.000+01:00",
      "dateFin": "2012-03-07T01:00:00.000+01:00",
      "preseance": "20",
      "nominPrincipale": "1",
      "infosQualite": {
        "codeQualite": "Membre",
        "libQualite": "Membre",
        "libQualiteSex": "Membre"
      },
      "organesRefs": [
        "PO446215"
      ]
    },
    {
      "xsiType": "MandatSimple_Type",
      "uid": "PM475770",
      "acteurRef": "PA810",
      "legislature": "13",
      "typeOrgane": "CMP",
      "dateDebut": "2012-01-13T01:00:00.000+01:00",
      "datePublication": "2012-01-14T01:00:00.000+01:00",
      "dateFin": "2012-02-29T01:00:00.000+01:00",
      "preseance": "28",
      "nominPrincipale": "1",
      "infosQualite": {
        "codeQualite": "Suppléant",
        "libQualite": "Membre suppléant",
        "libQualiteSex": "Membre suppléant"
      },
      "organesRefs": [
        "PO474593"
      ]
    },
    {
      "xsiType": "MandatSimple_Type",
      "uid": "PM491668",
      "acteurRef": "PA810",
      "legislature": "13",
      "typeOrgane": "CMP",
      "dateDebut": "2012-01-30T01:00:00.000+01:00",
      "datePublication": "2012-01-31T01:00:00.000+01:00",
      "dateFin": "2012-02-13T01:00:00.000+01:00",
      "preseance": "28",
      "nominPrincipale": "1",
      "infosQualite": {
        "codeQualite": "Suppléant",
        "libQualite": "Membre suppléant",
        "libQualiteSex": "Membre suppléant"
      },
      "organesRefs": [
        "PO489394"
      ]
    },
    {
      "xsiType": "MandatSimple_Type",
      "uid": "PM508748",
      "acteurRef": "PA810",
      "legislature": "13",
      "typeOrgane": "CMP",
      "dateDebut": "2012-02-17T01:00:00.000+01:00",
      "datePublication": "2012-02-18T01:00:00.000+01:00",
      "dateFin": "2012-02-29T01:00:00.000+01:00",
      "preseance": "20",
      "nominPrincipale": "1",
      "infosQualite": {
        "codeQualite": "Titulaire",
        "libQualite": "Membre titulaire",
        "libQualiteSex": "Membre titulaire"
      },
      "organesRefs": [
        "PO506485"
      ]
    },
    {
      "xsiType": "MandatParlementaire_type",
      "uid": "PM645557",
      "acteurRef": "PA810",
      "legislature": "14",
      "typeOrgane": "ASSEMBLEE",
      "dateDebut": "2012-06-20T02:00:00.000+02:00",
      "dateFin": "2017-06-20T02:00:00.000+02:00",
      "preseance": "50",
      "nominPrincipale": "1",
      "infosQualite": {
        "codeQualite": "membre",
        "libQualite": "membre",
        "libQualiteSex": "membre"
      },
      "organesRefs": [
        "PO644420"
      ],
      "suppleant": {
        "dateDebut": "2012-06-20T02:00:00.000+02:00",
        "dateFin": "2017-06-20T02:00:00.000+02:00",
        "suppleantRef": "PA2679"
      },
      "election": {
        "lieu": {
          "region": "Centre-Val de Loire",
          "regionType": "Métropolitain",
          "departement": "Indre",
          "numDepartement": "36",
          "numCirco": "1"
        },
        "causeMandat": "élections générales",
        "refCirconscription": "PO644589"
      },
      "mandature": {
        "datePriseFonction": "2012-06-20T02:00:00.000+02:00",
        "causeFin": "Fin de législature",
        "premiereElection": "1"
      }
    },
    {
      "xsiType": "MandatSimple_Type",
      "uid": "PM656089",
      "acteurRef": "PA810",
      "legislature": "14",
      "typeOrgane": "GP",
      "dateDebut": "2012-06-26T02:00:00.000+02:00",
      "datePublication": "2012-06-27T02:00:00.000+02:00",
      "dateFin": "2016-05-24T02:00:00.000+02:00",
      "preseance": "20",
      "nominPrincipale": "1",
      "infosQualite": {
        "codeQualite": "Membre",
        "libQualite": "Membre du",
        "libQualiteSex": "Membre du"
      },
      "organesRefs": [
        "PO656002"
      ]
    },
    {
      "xsiType": "MandatSimple_Type",
      "uid": "PM657445",
      "acteurRef": "PA810",
      "legislature": "14",
      "typeOrgane": "COMPER",
      "dateDebut": "2012-06-28T02:00:00.000+02:00",
      "datePublication": "2012-06-28T02:00:00.000+02:00",
      "dateFin": "2017-06-20T02:00:00.000+02:00",
      "preseance": "32",
      "nominPrincipale": "0",
      "infosQualite": {
        "codeQualite": "Membre",
        "libQualite": "Membre",
        "libQualiteSex": "Membre"
      },
      "organesRefs": [
        "PO419865"
      ]
    },
    {
      "xsiType": "MandatSimple_Type",
      "uid": "PM658964",
      "acteurRef": "PA810",
      "legislature": "14",
      "typeOrgane": "COMPER",
      "dateDebut": "2012-06-28T02:00:00.000+02:00",
      "datePublication": "2012-06-29T02:00:00.000+02:00",
      "dateFin": "2017-06-20T02:00:00.000+02:00",
      "preseance": "1",
      "nominPrincipale": "1",
      "infosQualite": {
        "codeQualite": "Président",
        "libQualite": "Président",
        "libQualiteSex": "Président"
      },
      "organesRefs": [
        "PO419865"
      ]
    },
    {
      "xsiType": "MandatAvecSuppleant_Type",
      "uid": "PM677170",
      "acteurRef": "PA810",
      "legislature": "14",
      "typeOrgane": "COMNL",
      "dateDebut": "2012-07-25T02:00:00.000+02:00",
      "datePublication": "2012-07-25T02:00:00.000+02:00",
      "dateFin": "2015-01-14T01:00:00.000+01:00",
      "preseance": "20",
      "nominPrincipale": "0",
      "infosQualite": {
        "codeQualite": "Membre",
        "libQualite": "Membre",
        "libQualiteSex": "Membre"
      },
      "organesRefs": [
        "PO420375"
      ]
    },
    {
      "xsiType": "MandatAvecSuppleant_Type",
      "uid": "PM677200",
      "acteurRef": "PA810",
      "legislature": "14",
      "typeOrgane": "COMNL",
      "dateDebut": "2012-07-25T02:00:00.000+02:00",
      "datePublication": "2012-07-25T02:00:00.000+02:00",
      "dateFin": "2015-01-14T01:00:00.000+01:00",
      "preseance": "19",
      "nominPrincipale": "1",
      "infosQualite": {
        "codeQualite": "Membre de droit",
        "libQualite": "Membre de droit",
        "libQualiteSex": "Membre de droit"
      },
      "organesRefs": [
        "PO420375"
      ]
    },
    {
      "xsiType": "MandatSimple_Type",
      "uid": "PM678654",
      "acteurRef": "PA810",
      "legislature": "14",
      "typeOrgane": "GA",
      "dateDebut": "2012-09-26T02:00:00.000+02:00",
      "dateFin": "2017-06-20T02:00:00.000+02:00",
      "preseance": "20",
      "nominPrincipale": "0",
      "infosQualite": {
        "codeQualite": "Membre",
        "libQualite": "Membre",
        "libQualiteSex": "Membre"
      },
      "organesRefs": [
        "PO675842"
      ]
    },
    {
      "xsiType": "MandatSimple_Type",
      "uid": "PM678655",
      "acteurRef": "PA810",
      "legislature": "14",
      "typeOrgane": "GA",
      "dateDebut": "2012-09-26T02:00:00.000+02:00",
      "dateFin": "2017-06-20T02:00:00.000+02:00",
      "preseance": "1",
      "nominPrincipale": "1",
      "infosQualite": {
        "codeQualite": "Président",
        "libQualite": "Président",
        "libQualiteSex": "Président"
      },
      "organesRefs": [
        "PO675842"
      ]
    },
    {
      "xsiType": "MandatSimple_Type",
      "uid": "PM685169",
      "acteurRef": "PA810",
      "legislature": "14",
      "typeOrgane": "CMP",
      "dateDebut": "2012-11-29T01:00:00.000+01:00",
      "datePublication": "2012-11-30T01:00:00.000+01:00",
      "dateFin": "2012-12-13T01:00:00.000+01:00",
      "preseance": "20",
      "nominPrincipale": "1",
      "infosQualite": {
        "codeQualite": "Titulaire",
        "libQualite": "Membre titulaire",
        "libQualiteSex": "Membre titulaire"
      },
      "organesRefs": [
        "PO684833"
      ]
    },
    {
      "xsiType": "MandatSimple_Type",
      "uid": "PM685343",
      "acteurRef": "PA810",
      "legislature": "14",
      "typeOrgane": "CMP",
      "dateDebut": "2012-12-04T01:00:00.000+01:00",
      "datePublication": "2012-12-05T01:00:00.000+01:00",
      "dateFin": "2012-12-13T01:00:00.000+01:00",
      "preseance": "4",
      "nominPrincipale": "1",
      "infosQualite": {
        "codeQualite": "Vice-Président",
        "libQualite": "Vice-Président",
        "libQualiteSex": "Vice-Président"
      },
      "organesRefs": [
        "PO684833"
      ]
    },
    {
      "xsiType": "MandatSimple_Type",
      "uid": "PM685688",
      "acteurRef": "PA810",
      "typeOrgane": "PARPOL",
      "dateDebut": "2012-12-01T01:00:00.000+01:00",
      "dateFin": "2017-06-20T02:00:00.000+02:00",
      "preseance": "5",
      "nominPrincipale": "1",
      "infosQualite": {
        "codeQualite": "Membre",
        "libQualite": "Membre",
        "libQualiteSex": "Membre"
      },
      "organesRefs": [
        "PO684932"
      ]
    },
    {
      "xsiType": "MandatSimple_Type",
      "uid": "PM687836",
      "acteurRef": "PA810",
      "legislature": "14",
      "typeOrgane": "GE",
      "dateDebut": "2013-01-10T01:00:00.000+01:00",
      "dateFin": "2017-06-20T02:00:00.000+02:00",
      "preseance": "20",
      "nominPrincipale": "1",
      "infosQualite": {
        "codeQualite": "Membre",
        "libQualite": "Membre",
        "libQualiteSex": "Membre"
      },
      "organesRefs": [
        "PO686397"
      ]
    },
    {
      "xsiType": "MandatSimple_Type",
      "uid": "PM690108",
      "acteurRef": "PA810",
      "legislature": "14",
      "typeOrgane": "GE",
      "dateDebut": "2013-02-04T01:00:00.000+01:00",
      "dateFin": "2017-06-20T02:00:00.000+02:00",
      "preseance": "20",
      "nominPrincipale": "1",
      "infosQualite": {
        "codeQualite": "Membre",
        "libQualite": "Membre",
        "libQualiteSex": "Membre"
      },
      "organesRefs": [
        "PO686275"
      ]
    },
    {
      "xsiType": "MandatParlementaire_type",
      "uid": "PM690217",
      "acteurRef": "PA810",
      "legislature": "14",
      "typeOrgane": "CONFPT",
      "dateDebut": "2012-06-20T02:00:00.000+02:00",
      "dateFin": "2017-06-20T02:00:00.000+02:00",
      "preseance": "20",
      "nominPrincipale": "1",
      "infosQualite": {
        "codeQualite": "Membre",
        "libQualite": "Membre",
        "libQualiteSex": "Membre"
      },
      "organesRefs": [
        "PO690204"
      ],
      "election": {
        "lieu": {}
      },
      "mandature": {
        "premiereElection": "0"
      }
    },
    {
      "xsiType": "MandatSimple_Type",
      "uid": "PM691113",
      "acteurRef": "PA810",
      "legislature": "14",
      "typeOrgane": "GE",
      "dateDebut": "2013-02-12T01:00:00.000+01:00",
      "dateFin": "2017-06-20T02:00:00.000+02:00",
      "preseance": "20",
      "nominPrincipale": "1",
      "infosQualite": {
        "codeQualite": "Membre",
        "libQualite": "Membre",
        "libQualiteSex": "Membre"
      },
      "organesRefs": [
        "PO686758"
      ]
    },
    {
      "xsiType": "MandatSimple_Type",
      "uid": "PM692039",
      "acteurRef": "PA810",
      "legislature": "14",
      "typeOrgane": "GE",
      "dateDebut": "2013-02-26T01:00:00.000+01:00",
      "dateFin": "2017-06-20T02:00:00.000+02:00",
      "preseance": "8",
      "nominPrincipale": "1",
      "infosQualite": {
        "codeQualite": "Vice-Président",
        "libQualite": "Vice-Président",
        "libQualiteSex": "Vice-Président"
      },
      "organesRefs": [
        "PO689012"
      ]
    },
    {
      "xsiType": "MandatSimple_Type",
      "uid": "PM692040",
      "acteurRef": "PA810",
      "legislature": "14",
      "typeOrgane": "GE",
      "dateDebut": "2013-02-26T01:00:00.000+01:00",
      "dateFin": "2013-02-28T01:00:00.000+01:00",
      "preseance": "1",
      "nominPrincipale": "1",
      "infosQualite": {
        "codeQualite": "Président",
        "libQualite": "Président",
        "libQualiteSex": "Président"
      },
      "organesRefs": [
        "PO689012"
      ]
    },
    {
      "xsiType": "MandatSimple_Type",
      "uid": "PM692064",
      "acteurRef": "PA810",
      "legislature": "14",
      "typeOrgane": "GE",
      "dateDebut": "2013-02-19T01:00:00.000+01:00",
      "dateFin": "2017-06-20T02:00:00.000+02:00",
      "preseance": "20",
      "nominPrincipale": "1",
      "infosQualite": {
        "codeQualite": "Membre",
        "libQualite": "Membre",
        "libQualiteSex": "Membre"
      },
      "organesRefs": [
        "PO686249"
      ]
    },
    {
      "xsiType": "MandatSimple_Type",
      "uid": "PM693546",
      "acteurRef": "PA810",
      "legislature": "14",
      "typeOrgane": "GE",
      "dateDebut": "2013-04-11T02:00:00.000+02:00",
      "dateFin": "2017-06-20T02:00:00.000+02:00",
      "preseance": "20",
      "nominPrincipale": "1",
      "infosQualite": {
        "codeQualite": "Membre",
        "libQualite": "Membre",
        "libQualiteSex": "Membre"
      },
      "organesRefs": [
        "PO686627"
      ]
    },
    {
      "xsiType": "MandatSimple_Type",
      "uid": "PM693640",
      "acteurRef": "PA810",
      "legislature": "14",
      "typeOrgane": "GE",
      "dateDebut": "2013-04-15T02:00:00.000+02:00",
      "dateFin": "2017-06-20T02:00:00.000+02:00",
      "preseance": "20",
      "nominPrincipale": "1",
      "infosQualite": {
        "codeQualite": "Membre",
        "libQualite": "Membre",
        "libQualiteSex": "Membre"
      },
      "organesRefs": [
        "PO692265"
      ]
    },
    {
      "xsiType": "MandatSimple_Type",
      "uid": "PM693728",
      "acteurRef": "PA810",
      "legislature": "14",
      "typeOrgane": "CMP",
      "dateDebut": "2013-04-16T02:00:00.000+02:00",
      "dateFin": "2013-04-24T02:00:00.000+02:00",
      "preseance": "20",
      "nominPrincipale": "1",
      "infosQualite": {
        "codeQualite": "Titulaire",
        "libQualite": "Membre titulaire",
        "libQualiteSex": "Membre titulaire"
      },
      "organesRefs": [
        "PO693720"
      ]
    },
    {
      "xsiType": "MandatSimple_Type",
      "uid": "PM693877",
      "acteurRef": "PA810",
      "legislature": "14",
      "typeOrgane": "GE",
      "dateDebut": "2013-04-17T02:00:00.000+02:00",
      "dateFin": "2017-06-20T02:00:00.000+02:00",
      "preseance": "20",
      "nominPrincipale": "1",
      "infosQualite": {
        "codeQualite": "Membre",
        "libQualite": "Membre",
        "libQualiteSex": "Membre"
      },
      "organesRefs": [
        "PO686389"
      ]
    },
    {
      "xsiType": "MandatSimple_Type",
      "uid": "PM693890",
      "acteurRef": "PA810",
      "legislature": "14",
      "typeOrgane": "CMP",
      "dateDebut": "2013-04-17T02:00:00.000+02:00",
      "datePublication": "2013-04-18T02:00:00.000+02:00",
      "dateFin": "2013-04-24T02:00:00.000+02:00",
      "preseance": "1",
      "nominPrincipale": "1",
      "infosQualite": {
        "codeQualite": "Président",
        "libQualite": "Président",
        "libQualiteSex": "Président"
      },
      "organesRefs": [
        "PO693720"
      ]
    },
    {
      "xsiType": "MandatSimple_Type",
      "uid": "PM694127",
      "acteurRef": "PA810",
      "legislature": "14",
      "typeOrgane": "GE",
      "dateDebut": "2013-04-09T02:00:00.000+02:00",
      "dateFin": "2017-06-20T02:00:00.000+02:00",
      "preseance": "20",
      "nominPrincipale": "1",
      "infosQualite": {
        "codeQualite": "Membre",
        "libQualite": "Membre",
        "libQualiteSex": "Membre"
      },
      "organesRefs": [
        "PO689024"
      ]
    },
    {
      "xsiType": "MandatSimple_Type",
      "uid": "PM695032",
      "acteurRef": "PA810",
      "legislature": "14",
      "typeOrgane": "CMP",
      "dateDebut": "2013-06-05T02:00:00.000+02:00",
      "datePublication": "2013-06-06T02:00:00.000+02:00",
      "dateFin": "2013-07-02T02:00:00.000+02:00",
      "preseance": "20",
      "nominPrincipale": "1",
      "infosQualite": {
        "codeQualite": "Titulaire",
        "libQualite": "Membre titulaire",
        "libQualiteSex": "Membre titulaire"
      },
      "organesRefs": [
        "PO694654"
      ]
    },
    {
      "xsiType": "MandatSimple_Type",
      "uid": "PM695233",
      "acteurRef": "PA810",
      "legislature": "14",
      "typeOrgane": "CMP",
      "dateDebut": "2013-06-12T02:00:00.000+02:00",
      "datePublication": "2013-06-13T02:00:00.000+02:00",
      "dateFin": "2013-07-02T02:00:00.000+02:00",
      "preseance": "4",
      "nominPrincipale": "1",
      "infosQualite": {
        "codeQualite": "Vice-Président",
        "libQualite": "Vice-Président",
        "libQualiteSex": "Vice-Président"
      },
      "organesRefs": [
        "PO694654"
      ]
    },
    {
      "xsiType": "MandatMission_Type",
      "uid": "PM698753",
      "acteurRef": "PA810",
      "legislature": "14",
      "typeOrgane": "MISINFOPRE",
      "dateDebut": "2013-11-26T01:00:00.000+01:00",
      "datePublication": "2013-11-28T01:00:00.000+01:00",
      "dateFin": "2014-05-14T02:00:00.000+02:00",
      "preseance": "20",
      "nominPrincipale": "1",
      "infosQualite": {
        "codeQualite": "Membre",
        "libQualite": "Membre",
        "libQualiteSex": "Membre"
      },
      "organesRefs": [
        "PO698717"
      ]
    },
    {
      "xsiType": "MandatSimple_Type",
      "uid": "PM699207",
      "acteurRef": "PA810",
      "legislature": "14",
      "typeOrgane": "CNPE",
      "dateDebut": "2013-12-17T01:00:00.000+01:00",
      "datePublication": "2013-12-18T01:00:00.000+01:00",
      "dateFin": "2014-10-30T01:00:00.000+01:00",
      "preseance": "20",
      "nominPrincipale": "1",
      "infosQualite": {
        "codeQualite": "Membre",
        "libQualite": "Membre",
        "libQualiteSex": "Membre"
      },
      "organesRefs": [
        "PO699054"
      ]
    },
    {
      "xsiType": "MandatMission_Type",
      "uid": "PM701052",
      "acteurRef": "PA810",
      "legislature": "14",
      "typeOrgane": "MISINFOPRE",
      "dateDebut": "2013-12-04T01:00:00.000+01:00",
      "datePublication": "2013-12-05T01:00:00.000+01:00",
      "dateFin": "2014-05-14T02:00:00.000+02:00",
      "preseance": "1",
      "nominPrincipale": "1",
      "infosQualite": {
        "codeQualite": "Président",
        "libQualite": "Président",
        "libQualiteSex": "Président"
      },
      "organesRefs": [
        "PO698717"
      ]
    },
    {
      "xsiType": "MandatSimple_Type",
      "uid": "PM701415",
      "acteurRef": "PA810",
      "legislature": "14",
      "typeOrgane": "CMP",
      "dateDebut": "2014-05-20T02:00:00.000+02:00",
      "datePublication": "2014-05-21T02:00:00.000+02:00",
      "dateFin": "2014-06-19T02:00:00.000+02:00",
      "preseance": "20",
      "nominPrincipale": "1",
      "infosQualite": {
        "codeQualite": "Titulaire",
        "libQualite": "Membre titulaire",
        "libQualiteSex": "Membre titulaire"
      },
      "organesRefs": [
        "PO701387"
      ]
    },
    {
      "xsiType": "MandatSimple_Type",
      "uid": "PM701464",
      "acteurRef": "PA810",
      "legislature": "14",
      "typeOrgane": "CMP",
      "dateDebut": "2014-05-21T02:00:00.000+02:00",
      "datePublication": "2014-05-22T02:00:00.000+02:00",
      "dateFin": "2014-06-19T02:00:00.000+02:00",
      "preseance": "1",
      "nominPrincipale": "1",
      "infosQualite": {
        "codeQualite": "Président",
        "libQualite": "Président",
        "libQualiteSex": "Président"
      },
      "organesRefs": [
        "PO701387"
      ]
    },
    {
      "xsiType": "MandatSimple_Type",
      "uid": "PM702448",
      "acteurRef": "PA810",
      "legislature": "14",
      "typeOrgane": "CMP",
      "dateDebut": "2014-07-15T02:00:00.000+02:00",
      "datePublication": "2014-07-16T02:00:00.000+02:00",
      "dateFin": "2014-07-15T02:00:00.000+02:00",
      "preseance": "20",
      "nominPrincipale": "1",
      "infosQualite": {
        "codeQualite": "Titulaire",
        "libQualite": "Membre titulaire",
        "libQualiteSex": "Membre titulaire"
      },
      "organesRefs": [
        "PO702437"
      ]
    },
    {
      "xsiType": "MandatSimple_Type",
      "uid": "PM702475",
      "acteurRef": "PA810",
      "legislature": "14",
      "typeOrgane": "CMP",
      "dateDebut": "2014-07-15T02:00:00.000+02:00",
      "datePublication": "2014-07-16T02:00:00.000+02:00",
      "dateFin": "2014-07-22T02:00:00.000+02:00",
      "preseance": "20",
      "nominPrincipale": "1",
      "infosQualite": {
        "codeQualite": "Titulaire",
        "libQualite": "Membre titulaire",
        "libQualiteSex": "Membre titulaire"
      },
      "organesRefs": [
        "PO702431"
      ]
    },
    {
      "xsiType": "MandatSimple_Type",
      "uid": "PM702509",
      "acteurRef": "PA810",
      "legislature": "14",
      "typeOrgane": "CMP",
      "dateDebut": "2014-07-16T02:00:00.000+02:00",
      "datePublication": "2014-07-17T02:00:00.000+02:00",
      "dateFin": "2014-07-22T02:00:00.000+02:00",
      "preseance": "4",
      "nominPrincipale": "1",
      "infosQualite": {
        "codeQualite": "Vice-Président",
        "libQualite": "Vice-Président",
        "libQualiteSex": "Vice-Président"
      },
      "organesRefs": [
        "PO702431"
      ]
    },
    {
      "xsiType": "MandatSimple_Type",
      "uid": "PM702514",
      "acteurRef": "PA810",
      "legislature": "14",
      "typeOrgane": "CMP",
      "dateDebut": "2014-07-16T02:00:00.000+02:00",
      "datePublication": "2014-07-17T02:00:00.000+02:00",
      "dateFin": "2014-07-16T02:00:00.000+02:00",
      "preseance": "4",
      "nominPrincipale": "1",
      "infosQualite": {
        "codeQualite": "Vice-Président",
        "libQualite": "Vice-Président",
        "libQualiteSex": "Vice-Président"
      },
      "organesRefs": [
        "PO702437"
      ]
    },
    {
      "xsiType": "MandatSimple_Type",
      "uid": "PM703041",
      "acteurRef": "PA810",
      "legislature": "14",
      "typeOrgane": "CNPS",
      "dateDebut": "2014-09-02T02:00:00.000+02:00",
      "datePublication": "2014-09-03T02:00:00.000+02:00",
      "dateFin": "2015-08-18T02:00:00.000+02:00",
      "preseance": "20",
      "nominPrincipale": "1",
      "infosQualite": {
        "codeQualite": "Membre",
        "libQualite": "Membre",
        "libQualiteSex": "Membre"
      },
      "organesRefs": [
        "PO702808"
      ]
    },
    {
      "xsiType": "MandatSimple_Type",
      "uid": "PM705437",
      "acteurRef": "PA810",
      "legislature": "14",
      "typeOrgane": "CNPS",
      "dateDebut": "2014-12-13T01:00:00.000+01:00",
      "datePublication": "2014-12-13T01:00:00.000+01:00",
      "dateFin": "2015-08-07T02:00:00.000+02:00",
      "preseance": "20",
      "nominPrincipale": "1",
      "infosQualite": {
        "codeQualite": "Membre",
        "libQualite": "Membre",
        "libQualiteSex": "Membre"
      },
      "organesRefs": [
        "PO704848"
      ]
    },
    {
      "xsiType": "MandatSimple_Type",
      "uid": "PM707217",
      "acteurRef": "PA810",
      "legislature": "14",
      "typeOrgane": "ORGEXTPARL",
      "dateDebut": "2015-03-26T01:00:00.000+01:00",
      "datePublication": "2015-03-26T01:00:00.000+01:00",
      "dateFin": "2017-06-20T02:00:00.000+02:00",
      "preseance": "20",
      "nominPrincipale": "1",
      "infosQualite": {
        "codeQualite": "Titulaire",
        "libQualite": "Membre titulaire",
        "libQualiteSex": "Membre titulaire"
      },
      "organesRefs": [
        "PO707215"
      ]
    },
    {
      "xsiType": "MandatMission_Type",
      "uid": "PM709912",
      "acteurRef": "PA810",
      "legislature": "14",
      "typeOrgane": "MISINFOCOM",
      "dateDebut": "2015-11-03T01:00:00.000+01:00",
      "datePublication": "2015-11-04T01:00:00.000+01:00",
      "dateFin": "2016-11-16T01:00:00.000+01:00",
      "preseance": "20",
      "nominPrincipale": "1",
      "infosQualite": {
        "codeQualite": "Membre",
        "libQualite": "Membre",
        "libQualiteSex": "Membre"
      },
      "organesRefs": [
        "PO709765"
      ]
    },
    {
      "xsiType": "MandatSimple_Type",
      "uid": "PM709944",
      "acteurRef": "PA810",
      "legislature": "14",
      "typeOrgane": "CMP",
      "dateDebut": "2015-11-05T01:00:00.000+01:00",
      "datePublication": "2015-11-06T01:00:00.000+01:00",
      "dateFin": "2015-11-18T01:00:00.000+01:00",
      "preseance": "20",
      "nominPrincipale": "1",
      "infosQualite": {
        "codeQualite": "Titulaire",
        "libQualite": "Membre titulaire",
        "libQualiteSex": "Membre titulaire"
      },
      "organesRefs": [
        "PO709711"
      ]
    },
    {
      "xsiType": "MandatSimple_Type",
      "uid": "PM709968",
      "acteurRef": "PA810",
      "legislature": "14",
      "typeOrgane": "CMP",
      "dateDebut": "2015-11-05T01:00:00.000+01:00",
      "datePublication": "2015-11-06T01:00:00.000+01:00",
      "dateFin": "2015-11-18T01:00:00.000+01:00",
      "preseance": "20",
      "nominPrincipale": "1",
      "infosQualite": {
        "codeQualite": "Titulaire",
        "libQualite": "Membre titulaire",
        "libQualiteSex": "Membre titulaire"
      },
      "organesRefs": [
        "PO709822"
      ]
    },
    {
      "xsiType": "MandatSimple_Type",
      "uid": "PM710032",
      "acteurRef": "PA810",
      "legislature": "14",
      "typeOrgane": "CMP",
      "dateDebut": "2015-11-10T01:00:00.000+01:00",
      "datePublication": "2015-11-11T01:00:00.000+01:00",
      "dateFin": "2015-11-18T01:00:00.000+01:00",
      "preseance": "1",
      "nominPrincipale": "1",
      "infosQualite": {
        "codeQualite": "Président",
        "libQualite": "Président",
        "libQualiteSex": "Président"
      },
      "organesRefs": [
        "PO709711"
      ]
    },
    {
      "xsiType": "MandatSimple_Type",
      "uid": "PM710036",
      "acteurRef": "PA810",
      "legislature": "14",
      "typeOrgane": "CMP",
      "dateDebut": "2015-11-10T01:00:00.000+01:00",
      "datePublication": "2015-11-11T01:00:00.000+01:00",
      "dateFin": "2015-11-18T01:00:00.000+01:00",
      "preseance": "1",
      "nominPrincipale": "1",
      "infosQualite": {
        "codeQualite": "Président",
        "libQualite": "Président",
        "libQualiteSex": "Président"
      },
      "organesRefs": [
        "PO709822"
      ]
    },
    {
      "xsiType": "MandatMission_Type",
      "uid": "PM711106",
      "acteurRef": "PA810",
      "legislature": "14",
      "typeOrgane": "MISINFOCOM",
      "dateDebut": "2016-01-13T01:00:00.000+01:00",
      "datePublication": "2016-01-14T01:00:00.000+01:00",
      "dateFin": "2016-11-16T01:00:00.000+01:00",
      "preseance": "1",
      "nominPrincipale": "1",
      "infosQualite": {
        "codeQualite": "Président",
        "libQualite": "Président",
        "libQualiteSex": "Président"
      },
      "organesRefs": [
        "PO709765"
      ]
    },
    {
      "xsiType": "MandatSimple_Type",
      "uid": "PM711402",
      "acteurRef": "PA810",
      "legislature": "14",
      "typeOrgane": "CMP",
      "dateDebut": "2016-02-04T01:00:00.000+01:00",
      "datePublication": "2016-02-05T01:00:00.000+01:00",
      "dateFin": "2016-03-09T01:00:00.000+01:00",
      "preseance": "20",
      "nominPrincipale": "1",
      "infosQualite": {
        "codeQualite": "Titulaire",
        "libQualite": "Membre titulaire",
        "libQualiteSex": "Membre titulaire"
      },
      "organesRefs": [
        "PO711331"
      ]
    },
    {
      "xsiType": "MandatSimple_Type",
      "uid": "PM711521",
      "acteurRef": "PA810",
      "legislature": "14",
      "typeOrgane": "CMP",
      "dateDebut": "2016-02-10T01:00:00.000+01:00",
      "datePublication": "2016-02-11T01:00:00.000+01:00",
      "dateFin": "2016-03-09T01:00:00.000+01:00",
      "preseance": "4",
      "nominPrincipale": "1",
      "infosQualite": {
        "codeQualite": "Vice-Président",
        "libQualite": "Vice-Président",
        "libQualiteSex": "Vice-Président"
      },
      "organesRefs": [
        "PO711331"
      ]
    },
    {
      "xsiType": "MandatSimple_Type",
      "uid": "PM712221",
      "acteurRef": "PA810",
      "legislature": "14",
      "typeOrgane": "CMP",
      "dateDebut": "2016-03-31T02:00:00.000+02:00",
      "datePublication": "2016-04-01T02:00:00.000+02:00",
      "dateFin": "2016-04-07T02:00:00.000+02:00",
      "preseance": "20",
      "nominPrincipale": "1",
      "infosQualite": {
        "codeQualite": "Titulaire",
        "libQualite": "Membre titulaire",
        "libQualiteSex": "Membre titulaire"
      },
      "organesRefs": [
        "PO712133"
      ]
    },
    {
      "xsiType": "MandatSimple_Type",
      "uid": "PM712298",
      "acteurRef": "PA810",
      "legislature": "14",
      "typeOrgane": "CMP",
      "dateDebut": "2016-04-06T02:00:00.000+02:00",
      "datePublication": "2016-04-07T02:00:00.000+02:00",
      "dateFin": "2016-04-07T02:00:00.000+02:00",
      "preseance": "4",
      "nominPrincipale": "1",
      "infosQualite": {
        "codeQualite": "Vice-Président",
        "libQualite": "Vice-Président",
        "libQualiteSex": "Vice-Président"
      },
      "organesRefs": [
        "PO712133"
      ]
    },
    {
      "xsiType": "MandatSimple_Type",
      "uid": "PM712960",
      "acteurRef": "PA810",
      "legislature": "14",
      "typeOrgane": "CMP",
      "dateDebut": "2016-05-19T02:00:00.000+02:00",
      "datePublication": "2016-05-20T02:00:00.000+02:00",
      "dateFin": "2016-06-01T02:00:00.000+02:00",
      "preseance": "20",
      "nominPrincipale": "1",
      "infosQualite": {
        "codeQualite": "Titulaire",
        "libQualite": "Membre titulaire",
        "libQualiteSex": "Membre titulaire"
      },
      "organesRefs": [
        "PO712837"
      ]
    },
    {
      "xsiType": "MandatSimple_Type",
      "uid": "PM713148",
      "acteurRef": "PA810",
      "legislature": "14",
      "typeOrgane": "GP",
      "dateDebut": "2016-05-25T02:00:00.000+02:00",
      "dateFin": "2017-06-20T02:00:00.000+02:00",
      "preseance": "20",
      "nominPrincipale": "1",
      "infosQualite": {
        "codeQualite": "Membre",
        "libQualite": "Membre du",
        "libQualiteSex": "Membre du"
      },
      "organesRefs": [
        "PO713077"
      ]
    },
    {
      "xsiType": "MandatSimple_Type",
      "uid": "PM713404",
      "acteurRef": "PA810",
      "legislature": "14",
      "typeOrgane": "CMP",
      "dateDebut": "2016-05-25T02:00:00.000+02:00",
      "datePublication": "2016-05-26T02:00:00.000+02:00",
      "dateFin": "2016-06-01T02:00:00.000+02:00",
      "preseance": "1",
      "nominPrincipale": "1",
      "infosQualite": {
        "codeQualite": "Président",
        "libQualite": "Président",
        "libQualiteSex": "Président"
      },
      "organesRefs": [
        "PO712837"
      ]
    },
    {
      "xsiType": "MandatSimple_Type",
      "uid": "PM715569",
      "acteurRef": "PA810",
      "legislature": "14",
      "typeOrgane": "CMP",
      "dateDebut": "2016-11-24T01:00:00.000+01:00",
      "datePublication": "2016-11-25T01:00:00.000+01:00",
      "dateFin": "2016-12-01T01:00:00.000+01:00",
      "preseance": "20",
      "nominPrincipale": "1",
      "infosQualite": {
        "codeQualite": "Titulaire",
        "libQualite": "Membre titulaire",
        "libQualiteSex": "Membre titulaire"
      },
      "organesRefs": [
        "PO715260"
      ]
    },
    {
      "xsiType": "MandatSimple_Type",
      "uid": "PM715595",
      "acteurRef": "PA810",
      "legislature": "14",
      "typeOrgane": "CMP",
      "dateDebut": "2016-11-24T01:00:00.000+01:00",
      "datePublication": "2016-11-25T01:00:00.000+01:00",
      "dateFin": "2016-12-01T01:00:00.000+01:00",
      "preseance": "20",
      "nominPrincipale": "1",
      "infosQualite": {
        "codeQualite": "Titulaire",
        "libQualite": "Membre titulaire",
        "libQualiteSex": "Membre titulaire"
      },
      "organesRefs": [
        "PO715055"
      ]
    },
    {
      "xsiType": "MandatSimple_Type",
      "uid": "PM715647",
      "acteurRef": "PA810",
      "legislature": "14",
      "typeOrgane": "CMP",
      "dateDebut": "2016-11-30T01:00:00.000+01:00",
      "datePublication": "2016-12-01T01:00:00.000+01:00",
      "dateFin": "2016-12-01T01:00:00.000+01:00",
      "preseance": "4",
      "nominPrincipale": "1",
      "infosQualite": {
        "codeQualite": "Vice-Président",
        "libQualite": "Vice-Président",
        "libQualiteSex": "Vice-Président"
      },
      "organesRefs": [
        "PO715260"
      ]
    },
    {
      "xsiType": "MandatSimple_Type",
      "uid": "PM715663",
      "acteurRef": "PA810",
      "legislature": "14",
      "typeOrgane": "CMP",
      "dateDebut": "2016-11-30T01:00:00.000+01:00",
      "datePublication": "2016-12-01T01:00:00.000+01:00",
      "dateFin": "2016-12-01T01:00:00.000+01:00",
      "preseance": "4",
      "nominPrincipale": "1",
      "infosQualite": {
        "codeQualite": "Vice-Président",
        "libQualite": "Vice-Président",
        "libQualiteSex": "Vice-Président"
      },
      "organesRefs": [
        "PO715055"
      ]
    }
  ]
}