{
  "uid": "PA429852",
  "etatCivil": {
    "ident": {
      "civ": "M.",
      "prenom": "Yannick",
      "nom": "Vaugrenard",
      "alpha": "VAUGRENARD_YANNICK_11066Q"
    },
    "infoNaissance": {
      "dateNais": "1950-06-25T01:00:00.000+01:00"
    }
  },
  "profession": {
    "socProcInsee": {}
  },
  "adresses": [
    {
      "xsiType": "AdresseSiteWeb_Type",
      "uid": "AD430101",
      "type": "23",
      "typeLibelle": "Url sénateur",
      "valElec": "https://www.senat.fr/senateur/vaugrenard_yannick11066q.html"
    }
  ],
  "mandats": [
    {
      "xsiType": "MandatParlementaire_type",
      "uid": "PM430021",
      "acteurRef": "PA429852",
      "typeOrgane": "SENAT",
      "dateDebut": "2011-10-01T02:00:00.000+02:00",
      "dateFin": "2017-10-01T02:00:00.000+02:00",
      "preseance": "20",
      "nominPrincipale": "1",
      "infosQualite": {
        "codeQualite": "Sénateur",
        "libQualite": "SENATEUR",
        "libQualiteSex": "SENATEUR"
      },
      "organesRefs": [
        "PO78718"
      ],
      "election": {
        "lieu": {
          "numDepartement": "44"
        }
      },
      "mandature": {
        "premiereElection": "0"
      }
    },
    {
      "xsiType": "MandatSimple_Type",
      "uid": "PM430307",
      "acteurRef": "PA429852",
      "typeOrgane": "COMSENAT",
      "dateDebut": "2011-10-01T02:00:00.000+02:00",
      "dateFin": "2012-02-20T01:00:00.000+01:00",
      "preseance": "10",
      "nominPrincipale": "1",
      "infosQualite": {
        "codeQualite": "Membre",
        "libQualite": "Membre",
        "libQualiteSex": "Membre"
      },
      "organesRefs": [
        "PO211492"
      ]
    },
    {
      "xsiType": "MandatSimple_Type",
      "uid": "PM430536",
      "acteurRef": "PA429852",
      "typeOrgane": "GROUPESENAT",
      "dateDebut": "2011-10-01T02:00:00.000+02:00",
      "preseance": "4",
      "nominPrincipale": "1",
      "infosQualite": {
        "codeQualite": "Membre",
        "libQualite": "Membre",
        "libQualiteSex": "Membre"
      },
      "organesRefs": [
        "PO77710"
      ]
    },
    {
      "xsiType": "MandatSimple_Type",
      "uid": "PM436971",
      "acteurRef": "PA429852",
      "typeOrgane": "DELEGSENAT",
      "dateDebut": "2011-11-30T01:00:00.000+01:00",
      "preseance": "4",
      "nominPrincipale": "1",
      "infosQualite": {
        "codeQualite": "Membre",
        "libQualite": "Membre",
        "libQualiteSex": "Membre"
      },
      "organesRefs": [
        "PO420388"
      ]
    },
    {
      "xsiType": "MandatSimple_Type",
      "uid": "PM476911",
      "acteurRef": "PA429852",
      "typeOrgane": "DELEGSENAT",
      "dateDebut": "2012-01-11T01:00:00.000+01:00",
      "nominPrincipale": "1",
      "infosQualite": {
        "libQualite": "Vice-Président",
        "libQualiteSex": "Vice-Président"
      },
      "organesRefs": [
        "PO420388"
      ]
    },
    {
      "xsiType": "MandatSimple_Type",
      "uid": "PM516832",
      "acteurRef": "PA429852",
      "typeOrgane": "COMSENAT",
      "dateDebut": "2012-02-21T01:00:00.000+01:00",
      "dateFin": "2014-10-08T02:00:00.000+02:00",
      "preseance": "10",
      "nominPrincipale": "1",
      "infosQualite": {
        "codeQualite": "Membre",
        "libQualite": "Membre",
        "libQualiteSex": "Membre"
      },
      "organesRefs": [
        "PO516753"
      ]
    },
    {
      "xsiType": "MandatSimple_Type",
      "uid": "PM695790",
      "acteurRef": "PA429852",
      "typeOrgane": "CMP",
      "dateDebut": "2013-07-02T02:00:00.000+02:00",
      "datePublication": "2013-07-04T02:00:00.000+02:00",
      "dateFin": "2013-07-18T02:00:00.000+02:00",
      "preseance": "28",
      "nominPrincipale": "1",
      "infosQualite": {
        "codeQualite": "Suppléant",
        "libQualite": "Membre suppléant",
        "libQualiteSex": "Membre suppléant"
      },
      "organesRefs": [
        "PO695634"
      ]
    },
    {
      "xsiType": "MandatSimple_Type",
      "uid": "PM701342",
      "acteurRef": "PA429852",
      "typeOrgane": "CMP",
      "dateDebut": "2014-05-14T02:00:00.000+02:00",
      "datePublication": "2014-05-15T02:00:00.000+02:00",
      "dateFin": "2014-06-10T02:00:00.000+02:00",
      "preseance": "20",
      "nominPrincipale": "1",
      "infosQualite": {
        "codeQualite": "Titulaire",
        "libQualite": "Membre titulaire",
        "libQualiteSex": "Membre titulaire"
      },
      "organesRefs": [
        "PO700965"
      ]
    },
    {
      "xsiType": "MandatSimple_Type",
      "uid": "PM701478",
      "acteurRef": "PA429852",
      "typeOrgane": "CMP",
      "dateDebut": "2014-05-21T02:00:00.000+02:00",
      "datePublication": "2014-05-23T02:00:00.000+02:00",
      "dateFin": "2014-06-10T02:00:00.000+02:00",
      "preseance": "16",
      "nominPrincipale": "1",
      "infosQualite": {
        "codeQualite": "Rapporteur",
        "libQualite": "Rapporteur",
        "libQualiteSex": "Rapporteur"
      },
      "organesRefs": [
        "PO700965"
      ]
    },
    {
      "xsiType": "MandatSimple_Type",
      "uid": "PM702423",
      "acteurRef": "PA429852",
      "typeOrgane": "CMP",
      "dateDebut": "2014-07-09T02:00:00.000+02:00",
      "datePublication": "2014-07-11T02:00:00.000+02:00",
      "dateFin": "2014-07-21T02:00:00.000+02:00",
      "preseance": "28",
      "nominPrincipale": "1",
      "infosQualite": {
        "codeQualite": "Suppléant",
        "libQualite": "Membre suppléant",
        "libQualiteSex": "Membre suppléant"
      },
      "organesRefs": [
        "PO702220"
      ]
    },
    {
      "xsiType": "MandatSimple_Type",
      "uid": "PM704197",
      "acteurRef": "PA429852",
      "typeOrgane": "COMSENAT",
      "dateDebut": "2014-10-09T02:00:00.000+02:00",
      "dateFin": "2017-10-03T02:00:00.000+02:00",
      "nominPrincipale": "1",
      "infosQualite": {
        "libQualite": "Vice-Président",
        "libQualiteSex": "Vice-Président"
      },
      "organesRefs": [
        "PO516753"
      ]
    },
    {
      "xsiType": "MandatSimple_Type",
      "uid": "PM704275",
      "acteurRef": "PA429852",
      "typeOrgane": "COMSPSENAT",
      "dateDebut": "2014-10-09T02:00:00.000+02:00",
      "dateFin": "2015-01-17T01:00:00.000+01:00",
      "nominPrincipale": "1",
      "infosQualite": {
        "libQualite": "Membre",
        "libQualiteSex": "Membre"
      },
      "organesRefs": [
        "PO701979"
      ]
    },
    {
      "xsiType": "MandatSimple_Type",
      "uid": "PM704988",
      "acteurRef": "PA429852",
      "typeOrgane": "DELEGSENAT",
      "dateDebut": "2014-11-05T01:00:00.000+01:00",
      "nominPrincipale": "1",
      "infosQualite": {
        "libQualite": "Vice-Président",
        "libQualiteSex": "Vice-Président"
      },
      "organesRefs": [
        "PO420388"
      ]
    },
    {
      "xsiType": "MandatSimple_Type",
      "uid": "PM705793",
      "acteurRef": "PA429852",
      "typeOrgane": "COMSPSENAT",
      "dateDebut": "2015-01-15T01:00:00.000+01:00",
      "dateFin": "2015-01-19T01:00:00.000+01:00",
      "nominPrincipale": "1",
      "infosQualite": {
        "libQualite": "Membre",
        "libQualiteSex": "Membre"
      },
      "organesRefs": [
        "PO705751"
      ]
    },
    {
      "xsiType": "MandatSimple_Type",
      "uid": "PM706124",
      "acteurRef": "PA429852",
      "typeOrgane": "COMSPSENAT",
      "dateDebut": "2015-01-20T01:00:00.000+01:00",
      "dateFin": "2015-03-25T01:00:00.000+01:00",
      "nominPrincipale": "1",
      "infosQualite": {
        "libQualite": "Vice-Président",
        "libQualiteSex": "Vice-Président"
      },
      "organesRefs": [
        "PO705751"
      ]
    },
    {
      "xsiType": "MandatSimple_Type",
      "uid": "PM707840",
      "acteurRef": "PA429852",
      "typeOrgane": "CMP",
      "dateDebut": "2015-05-28T02:00:00.000+02:00",
      "datePublication": "2015-05-29T02:00:00.000+02:00",
      "dateFin": "2015-06-04T02:00:00.000+02:00",
      "preseance": "28",
      "nominPrincipale": "1",
      "infosQualite": {
        "codeQualite": "Suppléant",
        "libQualite": "Membre suppléant",
        "libQualiteSex": "Membre suppléant"
      },
      "organesRefs": [
        "PO707762"
      ]
    },
    {
      "xsiType": "MandatSimple_Type",
      "uid": "PM711461",
      "acteurRef": "PA429852",
      "typeOrgane": "CMP",
      "dateDebut": "2016-02-03T01:00:00.000+01:00",
      "datePublication": "2016-02-06T01:00:00.000+01:00",
      "dateFin": "2016-02-11T01:00:00.000+01:00",
      "preseance": "20",
      "nominPrincipale": "1",
      "infosQualite": {
        "codeQualite": "Titulaire",
        "libQualite": "Membre titulaire",
        "libQualiteSex": "Membre titulaire"
      },
      "organesRefs": [
        "PO711338"
      ]
    },
    {
      "xsiType": "MandatSimple_Type",
      "uid": "PM714001",
      "acteurRef": "PA429852",
      "typeOrgane": "COMSPSENAT",
      "dateDebut": "2016-06-22T02:00:00.000+02:00",
      "dateFin": "2016-07-07T02:00:00.000+02:00",
      "nominPrincipale": "1",
      "infosQualite": {
        "libQualite": "Membre",
        "libQualiteSex": "Membre"
      },
      "organesRefs": [
        "PO713965"
      ]
    },
    {
      "xsiType": "MandatSimple_Type",
      "uid": "PM714259",
      "acteurRef": "PA429852",
      "typeOrgane": "COMSPSENAT",
      "dateDebut": "2016-07-07T02:00:00.000+02:00",
      "dateFin": "2017-06-12T02:00:00.000+02:00",
      "nominPrincipale": "1",
      "infosQualite": {
        "libQualite": "Membre",
        "libQualiteSex": "Membre"
      },
      "organesRefs": [
        "PO714224"
      ]
    },
    {
      "xsiType": "MandatSimple_Type",
      "uid": "PM716471",
      "acteurRef": "PA429852",
      "typeOrgane": "CMP",
      "dateDebut": "2017-01-11T01:00:00.000+01:00",
      "datePublication": "2017-01-13T01:00:00.000+01:00",
      "dateFin": "2017-01-20T01:00:00.000+01:00",
      "preseance": "20",
      "nominPrincipale": "1",
      "infosQualite": {
        "codeQualite": "Titulaire",
        "libQualite": "Membre titulaire",
        "libQualiteSex": "Membre titulaire"
      },
      "organesRefs": [
        "PO716327"
      ]
    },
    {
      "xsiType": "MandatParlementaire_type",
      "uid": "PM736275",
      "acteurRef": "PA429852",
      "typeOrgane": "SENAT",
      "dateDebut": "2017-10-02T02:00:00.000+02:00",
      "preseance": "20",
      "nominPrincipale": "1",
      "infosQualite": {
        "codeQualite": "Sénateur",
        "libQualite": "SENATEUR",
        "libQualiteSex": "SENATEUR"
      },
      "organesRefs": [
        "PO78718"
      ],
      "election": {
        "lieu": {
          "numDepartement": "44"
        }
      },
      "mandature": {
        "premiereElection": "0"
      }
    },
    {
      "xsiType": "MandatSimple_Type",
      "uid": "PM741189",
      "acteurRef": "PA429852",
      "typeOrgane": "COMSENAT",
      "dateDebut": "2017-10-04T02:00:00.000+02:00",
      "preseance": "10",
      "nominPrincipale": "1",
      "infosQualite": {
        "codeQualite": "Membre",
        "libQualite": "Membre",
        "libQualiteSex": "Membre"
      },
      "organesRefs": [
        "PO211491"
      ]
    },
    {
      "xsiType": "MandatSimple_Type",
      "uid": "PM741370",
      "acteurRef": "PA429852",
      "typeOrgane": "DELEGSENAT",
      "dateDebut": "2017-10-18T02:00:00.000+02:00",
      "preseance": "4",
      "nominPrincipale": "1",
      "infosQualite": {
        "codeQualite": "Membre",
        "libQualite": "Membre",
        "libQualiteSex": "Membre"
      },
      "organesRefs": [
        "PO420388"
      ]
    },
    {
      "xsiType": "MandatSimple_Type",
      "uid": "PM742184",
      "acteurRef": "PA429852",
      "typeOrgane": "DELEGSENAT",
      "dateDebut": "2017-10-26T02:00:00.000+02:00",
      "nominPrincipale": "1",
      "infosQualite": {
        "libQualite": "Vice-Président",
        "libQualiteSex": "Vice-Président"
      },
      "organesRefs": [
        "PO420388"
      ]
    },
    {
      "xsiType": "MandatSimple_Type",
      "uid": "PM743239",
      "acteurRef": "PA429852",
      "typeOrgane": "API",
      "dateDebut": "2017-11-08T01:00:00.000+01:00",
      "preseance": "20",
      "nominPrincipale": "1",
      "infosQualite": {
        "codeQualite": "Membre",
        "libQualite": "Membre",
        "libQualiteSex": "Membre"
      },
      "organesRefs": [
        "PO206064"
      ]
    },
    {
      "xsiType": "MandatSimple_Type",
      "uid": "PM756890",
      "acteurRef": "PA429852",
      "typeOrgane": "CMP",
      "dateDebut": "2018-06-12T02:00:00.000+02:00",
      "datePublication": "2018-06-13T02:00:00.000+02:00",
      "dateFin": "2018-06-28T02:00:00.000+02:00",
      "preseance": "28",
      "nominPrincipale": "1",
      "infosQualite": {
        "codeQualite": "Suppléant",
        "libQualite": "Membre suppléant",
        "libQualiteSex": "Membre suppléant"
      },
      "organesRefs": [
        "PO756661"
      ]
    },
    {
      "xsiType": "MandatSimple_Type",
      "uid": "PM767839",
      "acteurRef": "PA429852",
      "typeOrgane": "COMSPSENAT",
      "dateDebut": "2019-10-23T02:00:00.000+02:00",
      "nominPrincipale": "1",
      "infosQualite": {
        "libQualite": "Membre",
        "libQualiteSex": "Membre"
      },
      "organesRefs": [
        "PO767640"
      ]
    }
  ]
}