{
  "xsiType": "OrganeParlementaire_Type",
  "uid": "PO285100",
  "codeType": "GE",
  "libelle": "Groupe d'études sur le sida",
  "libelleEdition": "du groupe d'études sur le sida",
  "libelleAbrege": "Sida",
  "libelleAbrev": "SIDA",
  "viMoDe": {
    "dateAgrement": "2002-10-16T02:00:00.000+02:00",
    "dateFin": "2007-06-19T02:00:00.000+02:00"
  },
  "regime": "5ème République",
  "legislature": "12",
  "secretariat": {}
}