{
  "uid": "PA300",
  "etatCivil": {
    "ident": {
      "civ": "M.",
      "prenom": "Bertrand",
      "nom": "Auban",
      "alpha": "AUBAN"
    },
    "infoNaissance": {
      "dateNais": "1947-01-18T01:00:00.000+01:00"
    }
  },
  "profession": {
    "socProcInsee": {}
  },
  "adresses": [
    {
      "xsiType": "AdresseSiteWeb_Type",
      "uid": "AD317626",
      "type": "23",
      "typeLibelle": "Url sénateur",
      "valElec": "https://www.senat.fr/senateur/auban_bertrand98011l.html"
    }
  ],
  "mandats": [
    {
      "xsiType": "MandatParlementaire_type",
      "uid": "PM89619",
      "acteurRef": "PA300",
      "typeOrgane": "SENAT",
      "dateDebut": "1998-10-01T02:00:00.000+02:00",
      "datePublication": "1998-10-02T02:00:00.000+02:00",
      "dateFin": "2008-09-30T02:00:00.000+02:00",
      "preseance": "20",
      "nominPrincipale": "1",
      "infosQualite": {
        "codeQualite": "Sénateur",
        "libQualite": "SENATEUR",
        "libQualiteSex": "SENATEUR"
      },
      "organesRefs": [
        "PO78718"
      ],
      "election": {
        "lieu": {
          "numDepartement": "31"
        }
      },
      "mandature": {
        "premiereElection": "0"
      }
    },
    {
      "xsiType": "MandatSimple_Type",
      "uid": "PM219572",
      "acteurRef": "PA300",
      "typeOrgane": "API",
      "dateDebut": "1999-01-27T01:00:00.000+01:00",
      "dateFin": "2008-09-30T02:00:00.000+02:00",
      "preseance": "20",
      "nominPrincipale": "1",
      "infosQualite": {
        "codeQualite": "Membre",
        "libQualite": "Membre",
        "libQualiteSex": "Membre"
      },
      "organesRefs": [
        "PO206064"
      ]
    },
    {
      "xsiType": "MandatSimple_Type",
      "uid": "PM318608",
      "acteurRef": "PA300",
      "typeOrgane": "GROUPESENAT",
      "dateDebut": "2004-10-15T02:00:00.000+02:00",
      "dateFin": "2011-09-30T02:00:00.000+02:00",
      "nominPrincipale": "1",
      "infosQualite": {
        "libQualite": "Vice-Président",
        "libQualiteSex": "Vice-Président"
      },
      "organesRefs": [
        "PO77710"
      ]
    },
    {
      "xsiType": "MandatSimple_Type",
      "uid": "PM320570",
      "acteurRef": "PA300",
      "typeOrgane": "COMSENAT",
      "dateDebut": "2001-10-01T02:00:00.000+02:00",
      "dateFin": "2011-08-30T02:00:00.000+02:00",
      "preseance": "10",
      "nominPrincipale": "1",
      "infosQualite": {
        "codeQualite": "Membre",
        "libQualite": "Membre",
        "libQualiteSex": "Membre"
      },
      "organesRefs": [
        "PO211494"
      ]
    },
    {
      "xsiType": "MandatParlementaire_type",
      "uid": "PM415549",
      "acteurRef": "PA300",
      "typeOrgane": "SENAT",
      "dateDebut": "2008-10-01T02:00:00.000+02:00",
      "dateFin": "2014-09-30T02:00:00.000+02:00",
      "preseance": "20",
      "nominPrincipale": "1",
      "infosQualite": {
        "codeQualite": "Sénateur",
        "libQualite": "SENATEUR",
        "libQualiteSex": "SENATEUR"
      },
      "organesRefs": [
        "PO78718"
      ],
      "election": {
        "lieu": {
          "numDepartement": "31"
        }
      },
      "mandature": {
        "premiereElection": "0"
      }
    },
    {
      "xsiType": "MandatSimple_Type",
      "uid": "PM418777",
      "acteurRef": "PA300",
      "typeOrgane": "API",
      "dateDebut": "2009-03-19T01:00:00.000+01:00",
      "dateFin": "2012-01-31T01:00:00.000+01:00",
      "preseance": "20",
      "nominPrincipale": "1",
      "infosQualite": {
        "codeQualite": "Membre",
        "libQualite": "Membre",
        "libQualiteSex": "Membre"
      },
      "organesRefs": [
        "PO206064"
      ]
    },
    {
      "xsiType": "MandatSimple_Type",
      "uid": "PM430406",
      "acteurRef": "PA300",
      "typeOrgane": "COMSENAT",
      "dateDebut": "2011-10-01T02:00:00.000+02:00",
      "dateFin": "2014-09-30T02:00:00.000+02:00",
      "preseance": "10",
      "nominPrincipale": "1",
      "infosQualite": {
        "codeQualite": "Membre",
        "libQualite": "Membre",
        "libQualiteSex": "Membre"
      },
      "organesRefs": [
        "PO211491"
      ]
    },
    {
      "xsiType": "MandatSimple_Type",
      "uid": "PM430571",
      "acteurRef": "PA300",
      "typeOrgane": "GROUPESENAT",
      "dateDebut": "2011-10-01T02:00:00.000+02:00",
      "dateFin": "2011-11-01T01:00:00.000+01:00",
      "preseance": "4",
      "nominPrincipale": "1",
      "infosQualite": {
        "codeQualite": "Membre",
        "libQualite": "Membre",
        "libQualiteSex": "Membre"
      },
      "organesRefs": [
        "PO77710"
      ]
    },
    {
      "xsiType": "MandatSimple_Type",
      "uid": "PM431001",
      "acteurRef": "PA300",
      "typeOrgane": "GROUPESENAT",
      "dateDebut": "2011-11-02T01:00:00.000+01:00",
      "dateFin": "2014-09-30T02:00:00.000+02:00",
      "nominPrincipale": "1",
      "infosQualite": {
        "libQualite": "Vice-Président",
        "libQualiteSex": "Vice-Président"
      },
      "organesRefs": [
        "PO77710"
      ]
    }
  ]
}