{
  "uid": "PA304108",
  "etatCivil": {
    "ident": {
      "civ": "Mme",
      "prenom": "Joëlle",
      "nom": "Garriaud-Maylam",
      "alpha": "GARRIAUD-MAYLAM JOËLLE"
    },
    "infoNaissance": {
      "dateNais": "1955-03-20T01:00:00.000+01:00"
    }
  },
  "profession": {
    "socProcInsee": {}
  },
  "adresses": [
    {
      "xsiType": "AdresseSiteWeb_Type",
      "uid": "AD317039",
      "type": "23",
      "typeLibelle": "Url sénateur",
      "valElec": "https://www.senat.fr/senateur/garriaud_maylam_joelle04035d.html"
    }
  ],
  "mandats": [
    {
      "xsiType": "MandatParlementaire_type",
      "uid": "PM304249",
      "acteurRef": "PA304108",
      "typeOrgane": "SENAT",
      "dateDebut": "2004-10-01T02:00:00.000+02:00",
      "datePublication": "2004-10-02T02:00:00.000+02:00",
      "dateFin": "2011-09-30T02:00:00.000+02:00",
      "preseance": "20",
      "nominPrincipale": "1",
      "infosQualite": {
        "codeQualite": "Sénateur",
        "libQualite": "SENATEUR",
        "libQualiteSex": "Sénateur 5ème République"
      },
      "organesRefs": [
        "PO78718"
      ],
      "election": {
        "lieu": {
          "numDepartement": "998"
        }
      },
      "mandature": {
        "premiereElection": "0"
      }
    },
    {
      "xsiType": "MandatSimple_Type",
      "uid": "PM304308",
      "acteurRef": "PA304108",
      "typeOrgane": "GROUPESENAT",
      "dateDebut": "2004-10-05T02:00:00.000+02:00",
      "datePublication": "2004-10-07T02:00:00.000+02:00",
      "dateFin": "2011-10-30T02:00:00.000+01:00",
      "preseance": "4",
      "nominPrincipale": "1",
      "infosQualite": {
        "codeQualite": "Membre",
        "libQualite": "Membre",
        "libQualiteSex": "Membre du"
      },
      "organesRefs": [
        "PO286005"
      ]
    },
    {
      "xsiType": "MandatSimple_Type",
      "uid": "PM308851",
      "acteurRef": "PA304108",
      "typeOrgane": "COMSENAT",
      "dateDebut": "2004-10-06T02:00:00.000+02:00",
      "dateFin": "2008-10-07T02:00:00.000+02:00",
      "preseance": "10",
      "nominPrincipale": "1",
      "infosQualite": {
        "codeQualite": "Membre",
        "libQualite": "Membre",
        "libQualiteSex": "Membre"
      },
      "organesRefs": [
        "PO211491"
      ]
    },
    {
      "xsiType": "MandatSimple_Type",
      "uid": "PM309627",
      "acteurRef": "PA304108",
      "typeOrgane": "API",
      "dateDebut": "2005-01-18T01:00:00.000+01:00",
      "dateFin": "2011-09-30T02:00:00.000+02:00",
      "preseance": "20",
      "nominPrincipale": "1",
      "infosQualite": {
        "codeQualite": "Membre",
        "libQualite": "Membre",
        "libQualiteSex": "Membre"
      },
      "organesRefs": [
        "PO201115"
      ]
    },
    {
      "xsiType": "MandatSimple_Type",
      "uid": "PM310770",
      "acteurRef": "PA304108",
      "typeOrgane": "DELEGSENAT",
      "dateDebut": "2004-10-05T02:00:00.000+02:00",
      "dateFin": "2008-11-17T01:00:00.000+01:00",
      "preseance": "4",
      "nominPrincipale": "1",
      "infosQualite": {
        "codeQualite": "Membre",
        "libQualite": "Membre",
        "libQualiteSex": "Membre"
      },
      "organesRefs": [
        "PO310693"
      ]
    },
    {
      "xsiType": "MandatSimple_Type",
      "uid": "PM314314",
      "acteurRef": "PA304108",
      "typeOrgane": "API",
      "dateDebut": "2004-10-01T02:00:00.000+02:00",
      "dateFin": "2011-09-30T02:00:00.000+02:00",
      "preseance": "20",
      "nominPrincipale": "1",
      "infosQualite": {
        "codeQualite": "Membre",
        "libQualite": "Membre",
        "libQualiteSex": "Membre"
      },
      "organesRefs": [
        "PO206064"
      ]
    },
    {
      "xsiType": "MandatSimple_Type",
      "uid": "PM320781",
      "acteurRef": "PA304108",
      "typeOrgane": "DELEGSENAT",
      "dateDebut": "2004-10-13T02:00:00.000+02:00",
      "dateFin": "2008-12-02T01:00:00.000+01:00",
      "nominPrincipale": "1",
      "infosQualite": {
        "libQualite": "Secrétaire"
      },
      "organesRefs": [
        "PO310693"
      ]
    },
    {
      "xsiType": "MandatAvecSuppleant_Type",
      "uid": "PM403529",
      "acteurRef": "PA304108",
      "typeOrgane": "OFFPAR",
      "dateDebut": "2007-07-25T02:00:00.000+02:00",
      "datePublication": "2007-07-27T02:00:00.000+02:00",
      "dateFin": "2009-06-15T02:00:00.000+02:00",
      "preseance": "32",
      "nominPrincipale": "1",
      "infosQualite": {
        "codeQualite": "Membre de droit (Représentant de la commission des affaires étrangères)",
        "libQualite": "Membre de droit (Représentant de la commission des affaires étrangères)",
        "libQualiteSex": "Membre de droit (Représentante de la commission des affaires étrangères)"
      },
      "organesRefs": [
        "PO60146"
      ]
    },
    {
      "xsiType": "MandatSimple_Type",
      "uid": "PM416080",
      "acteurRef": "PA304108",
      "typeOrgane": "COMSENAT",
      "dateDebut": "2008-10-08T02:00:00.000+02:00",
      "dateFin": "2011-09-30T02:00:00.000+02:00",
      "nominPrincipale": "1",
      "infosQualite": {
        "libQualite": "Secrétaire"
      },
      "organesRefs": [
        "PO211491"
      ]
    },
    {
      "xsiType": "MandatSimple_Type",
      "uid": "PM416765",
      "acteurRef": "PA304108",
      "typeOrgane": "DELEGSENAT",
      "dateDebut": "2008-11-18T01:00:00.000+01:00",
      "dateFin": "2011-11-29T01:00:00.000+01:00",
      "preseance": "4",
      "nominPrincipale": "1",
      "infosQualite": {
        "codeQualite": "Membre",
        "libQualite": "Membre",
        "libQualiteSex": "Membre"
      },
      "organesRefs": [
        "PO310693"
      ]
    },
    {
      "xsiType": "MandatSimple_Type",
      "uid": "PM416995",
      "acteurRef": "PA304108",
      "typeOrgane": "DELEGSENAT",
      "dateDebut": "2008-12-03T01:00:00.000+01:00",
      "dateFin": "2011-11-29T01:00:00.000+01:00",
      "nominPrincipale": "1",
      "infosQualite": {
        "libQualite": "Secrétaire"
      },
      "organesRefs": [
        "PO310693"
      ]
    },
    {
      "xsiType": "MandatParlementaire_type",
      "uid": "PM429994",
      "acteurRef": "PA304108",
      "typeOrgane": "SENAT",
      "dateDebut": "2011-10-01T02:00:00.000+02:00",
      "dateFin": "2017-10-01T02:00:00.000+02:00",
      "preseance": "20",
      "nominPrincipale": "1",
      "infosQualite": {
        "codeQualite": "Sénateur",
        "libQualite": "SENATEUR",
        "libQualiteSex": "Sénateur 5ème République"
      },
      "organesRefs": [
        "PO78718"
      ],
      "election": {
        "lieu": {
          "numDepartement": "998"
        }
      },
      "mandature": {
        "premiereElection": "0"
      }
    },
    {
      "xsiType": "MandatSimple_Type",
      "uid": "PM430345",
      "acteurRef": "PA304108",
      "typeOrgane": "COMSENAT",
      "dateDebut": "2011-10-01T02:00:00.000+02:00",
      "dateFin": "2014-10-07T02:00:00.000+02:00",
      "nominPrincipale": "1",
      "infosQualite": {
        "libQualite": "Secrétaire"
      },
      "organesRefs": [
        "PO211491"
      ]
    },
    {
      "xsiType": "MandatSimple_Type",
      "uid": "PM431255",
      "acteurRef": "PA304108",
      "typeOrgane": "GROUPESENAT",
      "dateDebut": "2011-11-01T01:00:00.000+01:00",
      "dateFin": "2014-10-06T02:00:00.000+02:00",
      "nominPrincipale": "1",
      "infosQualite": {
        "libQualite": "Vice-Président"
      },
      "organesRefs": [
        "PO286005"
      ]
    },
    {
      "xsiType": "MandatSimple_Type",
      "uid": "PM436967",
      "acteurRef": "PA304108",
      "typeOrgane": "DELEGSENAT",
      "dateDebut": "2011-11-30T01:00:00.000+01:00",
      "preseance": "4",
      "nominPrincipale": "1",
      "infosQualite": {
        "codeQualite": "Membre",
        "libQualite": "Membre",
        "libQualiteSex": "Membre"
      },
      "organesRefs": [
        "PO310693"
      ]
    },
    {
      "xsiType": "MandatSimple_Type",
      "uid": "PM449798",
      "acteurRef": "PA304108",
      "typeOrgane": "DELEGSENAT",
      "dateDebut": "2011-12-14T01:00:00.000+01:00",
      "nominPrincipale": "1",
      "infosQualite": {
        "libQualite": "Vice-Président"
      },
      "organesRefs": [
        "PO310693"
      ]
    },
    {
      "xsiType": "MandatSimple_Type",
      "uid": "PM517987",
      "acteurRef": "PA304108",
      "typeOrgane": "API",
      "dateDebut": "2012-01-31T01:00:00.000+01:00",
      "dateFin": "2017-10-01T02:00:00.000+02:00",
      "preseance": "20",
      "nominPrincipale": "1",
      "infosQualite": {
        "codeQualite": "Membre",
        "libQualite": "Membre",
        "libQualiteSex": "Membre"
      },
      "organesRefs": [
        "PO206064"
      ]
    },
    {
      "xsiType": "MandatSimple_Type",
      "uid": "PM679766",
      "acteurRef": "PA304108",
      "typeOrgane": "API",
      "dateDebut": "2012-10-11T02:00:00.000+02:00",
      "dateFin": "2017-10-01T02:00:00.000+02:00",
      "preseance": "20",
      "nominPrincipale": "1",
      "infosQualite": {
        "codeQualite": "Membre",
        "libQualite": "Membre",
        "libQualiteSex": "Membre"
      },
      "organesRefs": [
        "PO201115"
      ]
    },
    {
      "xsiType": "MandatSimple_Type",
      "uid": "PM684483",
      "acteurRef": "PA304108",
      "typeOrgane": "ORGAINT",
      "dateDebut": "2012-11-14T01:00:00.000+01:00",
      "preseance": "41",
      "nominPrincipale": "1",
      "infosQualite": {
        "codeQualite": "Autre membre du Bureau",
        "libQualite": "Membre du Bureau",
        "libQualiteSex": "Membre du Bureau"
      },
      "organesRefs": [
        "PO201115"
      ]
    },
    {
      "xsiType": "MandatSimple_Type",
      "uid": "PM684604",
      "acteurRef": "PA304108",
      "typeOrgane": "API",
      "dateDebut": "2012-07-31T02:00:00.000+02:00",
      "dateFin": "2017-10-01T02:00:00.000+02:00",
      "preseance": "20",
      "nominPrincipale": "1",
      "infosQualite": {
        "codeQualite": "Titulaire",
        "libQualite": "Membre titulaire",
        "libQualiteSex": "Membre titulaire"
      },
      "organesRefs": [
        "PO58974"
      ]
    },
    {
      "xsiType": "MandatSimple_Type",
      "uid": "PM701681",
      "acteurRef": "PA304108",
      "typeOrgane": "CMP",
      "dateDebut": "2014-05-28T02:00:00.000+02:00",
      "datePublication": "2014-06-04T02:00:00.000+02:00",
      "dateFin": "2014-06-23T02:00:00.000+02:00",
      "preseance": "20",
      "nominPrincipale": "1",
      "infosQualite": {
        "codeQualite": "Titulaire",
        "libQualite": "Membre titulaire",
        "libQualiteSex": "Membre titulaire"
      },
      "organesRefs": [
        "PO701542"
      ]
    },
    {
      "xsiType": "MandatSimple_Type",
      "uid": "PM704140",
      "acteurRef": "PA304108",
      "typeOrgane": "COMSENAT",
      "dateDebut": "2014-10-08T02:00:00.000+02:00",
      "dateFin": "2014-10-08T02:00:00.000+02:00",
      "preseance": "10",
      "nominPrincipale": "1",
      "infosQualite": {
        "codeQualite": "Membre",
        "libQualite": "Membre",
        "libQualiteSex": "Membre"
      },
      "organesRefs": [
        "PO211491"
      ]
    },
    {
      "xsiType": "MandatSimple_Type",
      "uid": "PM704261",
      "acteurRef": "PA304108",
      "typeOrgane": "COMSENAT",
      "dateDebut": "2014-10-09T02:00:00.000+02:00",
      "dateFin": "2017-10-04T02:00:00.000+02:00",
      "nominPrincipale": "1",
      "infosQualite": {
        "libQualite": "Secrétaire"
      },
      "organesRefs": [
        "PO211491"
      ]
    },
    {
      "xsiType": "MandatSimple_Type",
      "uid": "PM704316",
      "acteurRef": "PA304108",
      "typeOrgane": "GROUPESENAT",
      "dateDebut": "2014-10-07T02:00:00.000+02:00",
      "preseance": "4",
      "nominPrincipale": "1",
      "infosQualite": {
        "codeQualite": "Membre",
        "libQualite": "Membre",
        "libQualiteSex": "Membre du"
      },
      "organesRefs": [
        "PO286005"
      ]
    },
    {
      "xsiType": "MandatSimple_Type",
      "uid": "PM704971",
      "acteurRef": "PA304108",
      "typeOrgane": "DELEGSENAT",
      "dateDebut": "2014-11-06T01:00:00.000+01:00",
      "nominPrincipale": "1",
      "infosQualite": {
        "libQualite": "Vice-Président"
      },
      "organesRefs": [
        "PO310693"
      ]
    },
    {
      "xsiType": "MandatSimple_Type",
      "uid": "PM713980",
      "acteurRef": "PA304108",
      "typeOrgane": "COMSPSENAT",
      "dateDebut": "2016-06-22T02:00:00.000+02:00",
      "dateFin": "2016-07-07T02:00:00.000+02:00",
      "nominPrincipale": "1",
      "infosQualite": {
        "libQualite": "Membre"
      },
      "organesRefs": [
        "PO713965"
      ]
    },
    {
      "xsiType": "MandatSimple_Type",
      "uid": "PM714241",
      "acteurRef": "PA304108",
      "typeOrgane": "COMSPSENAT",
      "dateDebut": "2016-07-07T02:00:00.000+02:00",
      "dateFin": "2017-06-12T02:00:00.000+02:00",
      "nominPrincipale": "1",
      "infosQualite": {
        "libQualite": "Membre"
      },
      "organesRefs": [
        "PO714224"
      ]
    },
    {
      "xsiType": "MandatParlementaire_type",
      "uid": "PM736399",
      "acteurRef": "PA304108",
      "typeOrgane": "SENAT",
      "dateDebut": "2017-10-02T02:00:00.000+02:00",
      "preseance": "20",
      "nominPrincipale": "1",
      "infosQualite": {
        "codeQualite": "Sénateur",
        "libQualite": "SENATEUR",
        "libQualiteSex": "Sénateur 5ème République"
      },
      "organesRefs": [
        "PO78718"
      ],
      "election": {
        "lieu": {
          "numDepartement": "998"
        }
      },
      "mandature": {
        "premiereElection": "0"
      }
    },
    {
      "xsiType": "MandatSimple_Type",
      "uid": "PM741342",
      "acteurRef": "PA304108",
      "typeOrgane": "COMSENAT",
      "dateDebut": "2017-10-05T02:00:00.000+02:00",
      "nominPrincipale": "1",
      "infosQualite": {
        "libQualite": "Secrétaire"
      },
      "organesRefs": [
        "PO211491"
      ]
    },
    {
      "xsiType": "MandatSimple_Type",
      "uid": "PM741394",
      "acteurRef": "PA304108",
      "typeOrgane": "DELEGSENAT",
      "dateDebut": "2017-10-18T02:00:00.000+02:00",
      "preseance": "4",
      "nominPrincipale": "1",
      "infosQualite": {
        "codeQualite": "Membre",
        "libQualite": "Membre",
        "libQualiteSex": "Membre"
      },
      "organesRefs": [
        "PO310693"
      ]
    },
    {
      "xsiType": "MandatSimple_Type",
      "uid": "PM742223",
      "acteurRef": "PA304108",
      "typeOrgane": "DELEGSENAT",
      "dateDebut": "2017-10-26T02:00:00.000+02:00",
      "nominPrincipale": "1",
      "infosQualite": {
        "libQualite": "Vice-Président"
      },
      "organesRefs": [
        "PO310693"
      ]
    },
    {
      "xsiType": "MandatSimple_Type",
      "uid": "PM743251",
      "acteurRef": "PA304108",
      "typeOrgane": "API",
      "dateDebut": "2017-11-08T01:00:00.000+01:00",
      "preseance": "20",
      "nominPrincipale": "1",
      "infosQualite": {
        "codeQualite": "Membre",
        "libQualite": "Membre",
        "libQualiteSex": "Membre"
      },
      "organesRefs": [
        "PO206064"
      ]
    },
    {
      "xsiType": "MandatSimple_Type",
      "uid": "PM743261",
      "acteurRef": "PA304108",
      "typeOrgane": "API",
      "dateDebut": "2017-11-08T01:00:00.000+01:00",
      "preseance": "20",
      "nominPrincipale": "1",
      "infosQualite": {
        "codeQualite": "Titulaire",
        "libQualite": "Membre titulaire",
        "libQualiteSex": "Membre titulaire"
      },
      "organesRefs": [
        "PO58974"
      ]
    },
    {
      "xsiType": "MandatSimple_Type",
      "uid": "PM748179",
      "acteurRef": "PA304108",
      "typeOrgane": "API",
      "dateDebut": "2018-01-26T01:00:00.000+01:00",
      "preseance": "8",
      "nominPrincipale": "1",
      "infosQualite": {
        "codeQualite": "Secrétaire général",
        "libQualite": "Secrétaire général",
        "libQualiteSex": "Secrétaire générale"
      },
      "organesRefs": [
        "PO201115"
      ]
    },
    {
      "xsiType": "MandatSimple_Type",
      "uid": "PM759698",
      "acteurRef": "PA304108",
      "typeOrgane": "COMSPSENAT",
      "dateDebut": "2018-10-10T02:00:00.000+02:00",
      "nominPrincipale": "1",
      "infosQualite": {
        "libQualite": "Membre"
      },
      "organesRefs": [
        "PO759364"
      ]
    }
  ]
}