{
  "uid": "PA346839",
  "etatCivil": {
    "ident": {
      "civ": "M.",
      "prenom": "Eric",
      "nom": "Berdoati",
      "alpha": "Berdoati"
    },
    "infoNaissance": {
      "dateNais": "1964-05-09T01:00:00.000+01:00",
      "villeNais": "Vincennes",
      "depNais": "Val-de-Marne",
      "paysNais": "France"
    }
  },
  "profession": {
    "libelleCourant": "Gérant d'une SARL",
    "socProcInsee": {
      "catSocPro": "Chefs d'entreprise de 10 salariés ou plus",
      "famSocPro": "Artisans, commerçants et chefs d'entreprise"
    }
  },
  "adresses": [
    {
      "xsiType": "AdressePostale_Type",
      "uid": "AD426265",
      "type": "0",
      "typeLibelle": "Adresse officielle",
      "poids": "1",
      "intitule": "Assemblée nationale",
      "numeroRue": "126",
      "nomRue": "Rue de l'Université",
      "codePostal": "75355",
      "ville": "Paris 07 SP"
    },
    {
      "xsiType": "AdressePostale_Type",
      "uid": "AD426662",
      "type": "2",
      "typeLibelle": "Adresse publiée de circonscription",
      "poids": "21",
      "intitule": "Permanence",
      "numeroRue": "12",
      "nomRue": "Rue Hevet",
      "codePostal": "92500",
      "ville": "Rueil-Malmaison"
    },
    {
      "xsiType": "AdresseMail_Type",
      "uid": "AD426672",
      "type": "15",
      "typeLibelle": "Mèl",
      "valElec": "eberdoati@assemblee-nationale.fr"
    }
  ],
  "mandats": [
    {
      "xsiType": "MandatParlementaire_type",
      "uid": "PM426223",
      "acteurRef": "PA346839",
      "legislature": "13",
      "typeOrgane": "ASSEMBLEE",
      "dateDebut": "2007-06-20T02:00:00.000+02:00",
      "dateFin": "2012-06-07T02:00:00.000+02:00",
      "preseance": "50",
      "nominPrincipale": "1",
      "infosQualite": {
        "codeQualite": "membre",
        "libQualite": "membre",
        "libQualiteSex": "membre"
      },
      "organesRefs": [
        "PO384266"
      ],
      "election": {
        "lieu": {
          "region": "Ile-de-France",
          "regionType": "Métropolitain",
          "departement": "Hauts-de-Seine",
          "numDepartement": "92",
          "numCirco": "7"
        },
        "causeMandat": "remplacement d'un député nommé au Gouvernement",
        "refCirconscription": "PO384781"
      },
      "mandature": {
        "datePriseFonction": "2010-12-15T01:00:00.000+01:00",
        "causeFin": "Démission",
        "premiereElection": "0"
      }
    },
    {
      "xsiType": "MandatSimple_Type",
      "uid": "PM426224",
      "acteurRef": "PA346839",
      "legislature": "13",
      "typeOrgane": "GP",
      "dateDebut": "2010-12-15T01:00:00.000+01:00",
      "datePublication": "2010-12-16T01:00:00.000+01:00",
      "dateFin": "2012-06-07T02:00:00.000+02:00",
      "preseance": "20",
      "nominPrincipale": "1",
      "infosQualite": {
        "codeQualite": "Membre",
        "libQualite": "Membre du",
        "libQualiteSex": "Membre du"
      },
      "organesRefs": [
        "PO389395"
      ]
    },
    {
      "xsiType": "MandatSimple_Type",
      "uid": "PM426232",
      "acteurRef": "PA346839",
      "legislature": "13",
      "typeOrgane": "COMPER",
      "dateDebut": "2010-12-15T01:00:00.000+01:00",
      "datePublication": "2010-12-15T01:00:00.000+01:00",
      "dateFin": "2011-05-31T02:00:00.000+02:00",
      "preseance": "32",
      "nominPrincipale": "1",
      "infosQualite": {
        "codeQualite": "Membre",
        "libQualite": "Membre",
        "libQualiteSex": "Membre"
      },
      "organesRefs": [
        "PO419604"
      ]
    },
    {
      "xsiType": "MandatSimple_Type",
      "uid": "PM428619",
      "acteurRef": "PA346839",
      "legislature": "13",
      "typeOrgane": "COMPER",
      "dateDebut": "2011-06-01T02:00:00.000+02:00",
      "datePublication": "2011-06-01T02:00:00.000+02:00",
      "dateFin": "2011-06-01T02:00:00.000+02:00",
      "preseance": "32",
      "nominPrincipale": "1",
      "infosQualite": {
        "codeQualite": "Membre",
        "libQualite": "Membre",
        "libQualiteSex": "Membre"
      },
      "organesRefs": [
        "PO59048"
      ]
    },
    {
      "xsiType": "MandatSimple_Type",
      "uid": "PM428669",
      "acteurRef": "PA346839",
      "legislature": "13",
      "typeOrgane": "COMPER",
      "dateDebut": "2011-06-02T02:00:00.000+02:00",
      "datePublication": "2011-06-02T02:00:00.000+02:00",
      "dateFin": "2012-02-24T01:00:00.000+01:00",
      "preseance": "32",
      "nominPrincipale": "1",
      "infosQualite": {
        "codeQualite": "Membre",
        "libQualite": "Membre",
        "libQualiteSex": "Membre"
      },
      "organesRefs": [
        "PO419604"
      ]
    },
    {
      "xsiType": "MandatSimple_Type",
      "uid": "PM513330",
      "acteurRef": "PA346839",
      "legislature": "13",
      "typeOrgane": "CMP",
      "dateDebut": "2012-02-22T01:00:00.000+01:00",
      "datePublication": "2012-02-23T01:00:00.000+01:00",
      "dateFin": "2012-03-01T01:00:00.000+01:00",
      "preseance": "20",
      "nominPrincipale": "0",
      "infosQualite": {
        "codeQualite": "Titulaire",
        "libQualite": "Membre titulaire",
        "libQualiteSex": "Membre titulaire"
      },
      "organesRefs": [
        "PO513309"
      ]
    },
    {
      "xsiType": "MandatSimple_Type",
      "uid": "PM513344",
      "acteurRef": "PA346839",
      "legislature": "13",
      "typeOrgane": "CMP",
      "dateDebut": "2012-02-22T01:00:00.000+01:00",
      "datePublication": "2012-02-23T01:00:00.000+01:00",
      "dateFin": "2012-03-01T01:00:00.000+01:00",
      "preseance": "16",
      "nominPrincipale": "1",
      "infosQualite": {
        "codeQualite": "Rapporteur",
        "libQualite": "Rapporteur",
        "libQualiteSex": "Rapporteur"
      },
      "organesRefs": [
        "PO513309"
      ]
    },
    {
      "xsiType": "MandatSimple_Type",
      "uid": "PM514493",
      "acteurRef": "PA346839",
      "legislature": "13",
      "typeOrgane": "CMP",
      "dateDebut": "2012-02-23T01:00:00.000+01:00",
      "datePublication": "2012-02-24T01:00:00.000+01:00",
      "dateFin": "2012-02-29T01:00:00.000+01:00",
      "preseance": "28",
      "nominPrincipale": "1",
      "infosQualite": {
        "codeQualite": "Suppléant",
        "libQualite": "Membre suppléant",
        "libQualiteSex": "Membre suppléant"
      },
      "organesRefs": [
        "PO514469"
      ]
    },
    {
      "xsiType": "MandatSimple_Type",
      "uid": "PM515629",
      "acteurRef": "PA346839",
      "legislature": "13",
      "typeOrgane": "COMPER",
      "dateDebut": "2012-02-25T01:00:00.000+01:00",
      "datePublication": "2012-02-25T01:00:00.000+01:00",
      "dateFin": "2012-03-01T01:00:00.000+01:00",
      "preseance": "32",
      "nominPrincipale": "1",
      "infosQualite": {
        "codeQualite": "Membre",
        "libQualite": "Membre",
        "libQualiteSex": "Membre"
      },
      "organesRefs": [
        "PO59048"
      ]
    },
    {
      "xsiType": "MandatSimple_Type",
      "uid": "PM521389",
      "acteurRef": "PA346839",
      "legislature": "13",
      "typeOrgane": "COMPER",
      "dateDebut": "2012-03-02T01:00:00.000+01:00",
      "datePublication": "2012-03-02T01:00:00.000+01:00",
      "dateFin": "2012-06-07T02:00:00.000+02:00",
      "preseance": "32",
      "nominPrincipale": "1",
      "infosQualite": {
        "codeQualite": "Membre",
        "libQualite": "Membre",
        "libQualiteSex": "Membre"
      },
      "organesRefs": [
        "PO419604"
      ]
    }
  ]
}