{
  "xsiType": "OrganeExterne_Type",
  "uid": "PO717192",
  "codeType": "MINISTERE",
  "libelle": "Ministère de l’économie",
  "libelleEdition": "de l’économie",
  "libelleAbrege": "Économie",
  "libelleAbrev": "ECO",
  "viMoDe": {
    "dateDebut": "2017-05-18T02:00:00.000+02:00",
    "dateFin": "2017-06-19T02:00:00.000+02:00"
  },
  "organeParentRef": "PO717173"
}