{
  "xsiType": "OrganeParlementaireInternational",
  "uid": "PO733572",
  "codeType": "GA",
  "libelle": "France-Pologne",
  "libelleEdition": "de France-Pologne",
  "libelleAbrege": "Pologne",
  "libelleAbrev": "PL",
  "viMoDe": {
    "dateAgrement": "2017-07-19T02:00:00.000+02:00"
  },
  "regime": "5ème République",
  "legislature": "15",
  "secretariat": {
    "secretaire01": "M. Renaud Wetzel"
  },
  "listePays": [
    "GOP756413"
  ]
}