{
  "xsiType": "OrganeParlementaire_Type",
  "uid": "PO708847",
  "codeType": "CMP",
  "libelle": "Commission mixte paritaire chargée de proposer un texte sur les dispositions restant en discussion du projet de loi portant nouvelle organisation territoriale de la République",
  "libelleEdition": "de la commission mixte paritaire chargée de proposer un texte sur les dispositions restant en discussion du projet de loi portant nouvelle organisation territoriale de la République",
  "libelleAbrege": "Nouvelle organisation territoriale de la République",
  "libelleAbrev": "2529",
  "viMoDe": {
    "dateDebut": "2015-07-03T02:00:00.000+02:00",
    "dateFin": "2015-07-10T02:00:00.000+02:00"
  },
  "regime": "5ème République",
  "legislature": "14",
  "secretariat": {}
}