{
  "uid": "PA345897",
  "etatCivil": {
    "ident": {
      "civ": "M.",
      "prenom": "Arnaud",
      "nom": "Richard",
      "alpha": "Richard"
    },
    "infoNaissance": {
      "dateNais": "1971-04-30T01:00:00.000+01:00",
      "villeNais": "Rouen",
      "depNais": "Seine-Maritime",
      "paysNais": "France"
    }
  },
  "profession": {
    "libelleCourant": "Responsable de relations institutionnelles",
    "socProcInsee": {
      "catSocPro": "Cadres d'entreprise",
      "famSocPro": "Cadres et professions intellectuelles supérieures"
    }
  },
  "adresses": [
    {
      "xsiType": "AdressePostale_Type",
      "uid": "AD424222",
      "type": "0",
      "typeLibelle": "Adresse officielle",
      "poids": "1",
      "intitule": "Assemblée nationale",
      "numeroRue": "126",
      "nomRue": "Rue de l'Université",
      "codePostal": "75355",
      "ville": "Paris 07 SP"
    },
    {
      "xsiType": "AdresseMail_Type",
      "uid": "AD424319",
      "type": "15",
      "typeLibelle": "Mèl",
      "valElec": "arichard@assemblee-nationale.fr"
    },
    {
      "xsiType": "AdressePostale_Type",
      "uid": "AD424361",
      "type": "2",
      "typeLibelle": "Adresse publiée de circonscription",
      "poids": "22",
      "intitule": "Permanence",
      "numeroRue": "107",
      "nomRue": "Rue Paul Doumer",
      "codePostal": "78510",
      "ville": "Triel-sur-Seine"
    },
    {
      "xsiType": "AdresseTelephonique_Type",
      "uid": "AD424362",
      "type": "11",
      "typeLibelle": "Téléphone",
      "poids": "22",
      "adresseDeRattachement": "AD424361",
      "valElec": "01 39 70 88 99"
    },
    {
      "xsiType": "AdresseMail_Type",
      "uid": "AD424364",
      "type": "15",
      "typeLibelle": "Mèl",
      "valElec": "depute.arnaud.richard@gmail.com"
    }
  ],
  "mandats": [
    {
      "xsiType": "MandatParlementaire_type",
      "uid": "PM424219",
      "acteurRef": "PA345897",
      "legislature": "13",
      "typeOrgane": "ASSEMBLEE",
      "dateDebut": "2007-06-20T02:00:00.000+02:00",
      "dateFin": "2012-06-19T02:00:00.000+02:00",
      "preseance": "50",
      "nominPrincipale": "1",
      "infosQualite": {
        "codeQualite": "membre",
        "libQualite": "membre",
        "libQualiteSex": "membre"
      },
      "organesRefs": [
        "PO384266"
      ],
      "election": {
        "lieu": {
          "region": "Ile-de-France",
          "regionType": "Métropolitain",
          "departement": "Yvelines",
          "numDepartement": "78",
          "numCirco": "7"
        },
        "causeMandat": "remplacement d'un député en mission au-delà de 6 mois",
        "refCirconscription": "PO384710"
      },
      "mandature": {
        "datePriseFonction": "2010-06-05T02:00:00.000+02:00",
        "causeFin": "Fin de législature",
        "premiereElection": "0"
      }
    },
    {
      "xsiType": "MandatSimple_Type",
      "uid": "PM424220",
      "acteurRef": "PA345897",
      "legislature": "13",
      "typeOrgane": "GP",
      "dateDebut": "2010-06-05T02:00:00.000+02:00",
      "datePublication": "2010-06-06T02:00:00.000+02:00",
      "dateFin": "2010-06-07T02:00:00.000+02:00",
      "preseance": "28",
      "nominPrincipale": "1",
      "infosQualite": {
        "codeQualite": "Député non-inscrit",
        "libQualite": "Député non-inscrit",
        "libQualiteSex": "Député non-inscrit"
      },
      "organesRefs": [
        "PO387155"
      ]
    },
    {
      "xsiType": "MandatSimple_Type",
      "uid": "PM424224",
      "acteurRef": "PA345897",
      "legislature": "13",
      "typeOrgane": "GP",
      "dateDebut": "2010-06-07T02:00:00.000+02:00",
      "datePublication": "2010-06-08T02:00:00.000+02:00",
      "dateFin": "2012-06-19T02:00:00.000+02:00",
      "preseance": "20",
      "nominPrincipale": "1",
      "infosQualite": {
        "codeQualite": "Membre",
        "libQualite": "Membre du",
        "libQualiteSex": "Membre du"
      },
      "organesRefs": [
        "PO389395"
      ]
    },
    {
      "xsiType": "MandatSimple_Type",
      "uid": "PM424310",
      "acteurRef": "PA345897",
      "legislature": "13",
      "typeOrgane": "COMPER",
      "dateDebut": "2010-06-11T02:00:00.000+02:00",
      "datePublication": "2010-06-12T02:00:00.000+02:00",
      "dateFin": "2010-10-12T02:00:00.000+02:00",
      "preseance": "32",
      "nominPrincipale": "1",
      "infosQualite": {
        "codeQualite": "Membre",
        "libQualite": "Membre",
        "libQualiteSex": "Membre"
      },
      "organesRefs": [
        "PO420120"
      ]
    },
    {
      "xsiType": "MandatSimple_Type",
      "uid": "PM424787",
      "acteurRef": "PA345897",
      "legislature": "13",
      "typeOrgane": "GE",
      "dateDebut": "2010-07-27T02:00:00.000+02:00",
      "dateFin": "2012-06-19T02:00:00.000+02:00",
      "preseance": "20",
      "nominPrincipale": "1",
      "infosQualite": {
        "codeQualite": "Membre",
        "libQualite": "Membre",
        "libQualiteSex": "Membre"
      },
      "organesRefs": [
        "PO424325"
      ]
    },
    {
      "xsiType": "MandatSimple_Type",
      "uid": "PM425083",
      "acteurRef": "PA345897",
      "legislature": "13",
      "typeOrgane": "CMP",
      "dateDebut": "2010-09-28T02:00:00.000+02:00",
      "datePublication": "2010-09-29T02:00:00.000+02:00",
      "dateFin": "2010-10-06T02:00:00.000+02:00",
      "preseance": "28",
      "nominPrincipale": "1",
      "infosQualite": {
        "codeQualite": "Suppléant",
        "libQualite": "Membre suppléant",
        "libQualiteSex": "Membre suppléant"
      },
      "organesRefs": [
        "PO425048"
      ]
    },
    {
      "xsiType": "MandatSimple_Type",
      "uid": "PM425258",
      "acteurRef": "PA345897",
      "legislature": "13",
      "typeOrgane": "COMPER",
      "dateDebut": "2010-10-13T02:00:00.000+02:00",
      "datePublication": "2010-10-13T02:00:00.000+02:00",
      "dateFin": "2010-10-13T02:00:00.000+02:00",
      "preseance": "32",
      "nominPrincipale": "1",
      "infosQualite": {
        "codeQualite": "Membre",
        "libQualite": "Membre",
        "libQualiteSex": "Membre"
      },
      "organesRefs": [
        "PO59048"
      ]
    },
    {
      "xsiType": "MandatSimple_Type",
      "uid": "PM425315",
      "acteurRef": "PA345897",
      "legislature": "13",
      "typeOrgane": "COMPER",
      "dateDebut": "2010-10-14T02:00:00.000+02:00",
      "datePublication": "2010-10-14T02:00:00.000+02:00",
      "dateFin": "2012-06-19T02:00:00.000+02:00",
      "preseance": "32",
      "nominPrincipale": "1",
      "infosQualite": {
        "codeQualite": "Membre",
        "libQualite": "Membre",
        "libQualiteSex": "Membre"
      },
      "organesRefs": [
        "PO420120"
      ]
    },
    {
      "xsiType": "MandatSimple_Type",
      "uid": "PM425350",
      "acteurRef": "PA345897",
      "legislature": "13",
      "typeOrgane": "GA",
      "dateDebut": "2010-10-19T02:00:00.000+02:00",
      "dateFin": "2012-06-19T02:00:00.000+02:00",
      "preseance": "20",
      "nominPrincipale": "1",
      "infosQualite": {
        "codeQualite": "Membre",
        "libQualite": "Membre",
        "libQualiteSex": "Membre"
      },
      "organesRefs": [
        "PO393055"
      ]
    },
    {
      "xsiType": "MandatSimple_Type",
      "uid": "PM425351",
      "acteurRef": "PA345897",
      "legislature": "13",
      "typeOrgane": "GA",
      "dateDebut": "2010-10-19T02:00:00.000+02:00",
      "dateFin": "2012-06-19T02:00:00.000+02:00",
      "preseance": "20",
      "nominPrincipale": "1",
      "infosQualite": {
        "codeQualite": "Membre",
        "libQualite": "Membre",
        "libQualiteSex": "Membre"
      },
      "organesRefs": [
        "PO393070"
      ]
    },
    {
      "xsiType": "MandatSimple_Type",
      "uid": "PM425352",
      "acteurRef": "PA345897",
      "legislature": "13",
      "typeOrgane": "GA",
      "dateDebut": "2010-10-19T02:00:00.000+02:00",
      "dateFin": "2012-06-19T02:00:00.000+02:00",
      "preseance": "20",
      "nominPrincipale": "1",
      "infosQualite": {
        "codeQualite": "Membre",
        "libQualite": "Membre",
        "libQualiteSex": "Membre"
      },
      "organesRefs": [
        "PO393161"
      ]
    },
    {
      "xsiType": "MandatSimple_Type",
      "uid": "PM425353",
      "acteurRef": "PA345897",
      "legislature": "13",
      "typeOrgane": "GA",
      "dateDebut": "2010-10-19T02:00:00.000+02:00",
      "dateFin": "2012-06-19T02:00:00.000+02:00",
      "preseance": "20",
      "nominPrincipale": "1",
      "infosQualite": {
        "codeQualite": "Membre",
        "libQualite": "Membre",
        "libQualiteSex": "Membre"
      },
      "organesRefs": [
        "PO393328"
      ]
    },
    {
      "xsiType": "MandatSimple_Type",
      "uid": "PM425354",
      "acteurRef": "PA345897",
      "legislature": "13",
      "typeOrgane": "GE",
      "dateDebut": "2010-10-19T02:00:00.000+02:00",
      "dateFin": "2012-06-19T02:00:00.000+02:00",
      "preseance": "20",
      "nominPrincipale": "1",
      "infosQualite": {
        "codeQualite": "Membre",
        "libQualite": "Membre",
        "libQualiteSex": "Membre"
      },
      "organesRefs": [
        "PO402997"
      ]
    },
    {
      "xsiType": "MandatSimple_Type",
      "uid": "PM425371",
      "acteurRef": "PA345897",
      "legislature": "13",
      "typeOrgane": "GE",
      "dateDebut": "2010-10-19T02:00:00.000+02:00",
      "dateFin": "2012-06-19T02:00:00.000+02:00",
      "preseance": "20",
      "nominPrincipale": "1",
      "infosQualite": {
        "codeQualite": "Membre",
        "libQualite": "Membre",
        "libQualiteSex": "Membre"
      },
      "organesRefs": [
        "PO403160"
      ]
    },
    {
      "xsiType": "MandatSimple_Type",
      "uid": "PM425379",
      "acteurRef": "PA345897",
      "legislature": "13",
      "typeOrgane": "GE",
      "dateDebut": "2010-10-20T02:00:00.000+02:00",
      "dateFin": "2012-06-19T02:00:00.000+02:00",
      "preseance": "20",
      "nominPrincipale": "1",
      "infosQualite": {
        "codeQualite": "Membre",
        "libQualite": "Membre",
        "libQualiteSex": "Membre"
      },
      "organesRefs": [
        "PO416217"
      ]
    },
    {
      "xsiType": "MandatSimple_Type",
      "uid": "PM425462",
      "acteurRef": "PA345897",
      "legislature": "13",
      "typeOrgane": "GE",
      "dateDebut": "2010-10-24T02:00:00.000+02:00",
      "dateFin": "2012-06-19T02:00:00.000+02:00",
      "preseance": "20",
      "nominPrincipale": "1",
      "infosQualite": {
        "codeQualite": "Membre",
        "libQualite": "Membre",
        "libQualiteSex": "Membre"
      },
      "organesRefs": [
        "PO402955"
      ]
    },
    {
      "xsiType": "MandatSimple_Type",
      "uid": "PM425952",
      "acteurRef": "PA345897",
      "legislature": "13",
      "typeOrgane": "ORGEXTPARL",
      "dateDebut": "2010-11-30T01:00:00.000+01:00",
      "datePublication": "2010-12-01T01:00:00.000+01:00",
      "dateFin": "2012-06-19T02:00:00.000+02:00",
      "preseance": "20",
      "nominPrincipale": "1",
      "infosQualite": {
        "codeQualite": "Titulaire",
        "libQualite": "Membre titulaire",
        "libQualiteSex": "Membre titulaire"
      },
      "organesRefs": [
        "PO60266"
      ]
    },
    {
      "xsiType": "MandatSimple_Type",
      "uid": "PM428261",
      "acteurRef": "PA345897",
      "legislature": "13",
      "typeOrgane": "CNPS",
      "dateDebut": "2011-05-10T02:00:00.000+02:00",
      "datePublication": "2011-05-10T02:00:00.000+02:00",
      "dateFin": "2011-06-23T02:00:00.000+02:00",
      "preseance": "20",
      "nominPrincipale": "1",
      "infosQualite": {
        "codeQualite": "Membre",
        "libQualite": "Membre",
        "libQualiteSex": "Membre"
      },
      "organesRefs": [
        "PO425550"
      ]
    },
    {
      "xsiType": "MandatSimple_Type",
      "uid": "PM429116",
      "acteurRef": "PA345897",
      "legislature": "13",
      "typeOrgane": "CNPE",
      "dateDebut": "2011-06-29T02:00:00.000+02:00",
      "datePublication": "2011-06-29T02:00:00.000+02:00",
      "dateFin": "2011-11-30T01:00:00.000+01:00",
      "preseance": "20",
      "nominPrincipale": "1",
      "infosQualite": {
        "codeQualite": "Membre",
        "libQualite": "Membre",
        "libQualiteSex": "Membre"
      },
      "organesRefs": [
        "PO428772"
      ]
    },
    {
      "xsiType": "MandatSimple_Type",
      "uid": "PM429476",
      "acteurRef": "PA345897",
      "legislature": "13",
      "typeOrgane": "CMP",
      "dateDebut": "2011-07-06T02:00:00.000+02:00",
      "datePublication": "2011-07-07T02:00:00.000+02:00",
      "dateFin": "2011-07-25T02:00:00.000+02:00",
      "preseance": "20",
      "nominPrincipale": "1",
      "infosQualite": {
        "codeQualite": "Titulaire",
        "libQualite": "Membre titulaire",
        "libQualiteSex": "Membre titulaire"
      },
      "organesRefs": [
        "PO429417"
      ]
    },
    {
      "xsiType": "MandatSimple_Type",
      "uid": "PM429539",
      "acteurRef": "PA345897",
      "legislature": "13",
      "typeOrgane": "CNPE",
      "dateDebut": "2011-07-12T02:00:00.000+02:00",
      "datePublication": "2011-07-14T02:00:00.000+02:00",
      "dateFin": "2011-11-30T01:00:00.000+01:00",
      "preseance": "8",
      "nominPrincipale": "1",
      "infosQualite": {
        "codeQualite": "Vice-Président",
        "libQualite": "Vice-Président",
        "libQualiteSex": "Vice-Président"
      },
      "organesRefs": [
        "PO428772"
      ]
    },
    {
      "xsiType": "MandatSimple_Type",
      "uid": "PM446250",
      "acteurRef": "PA345897",
      "legislature": "13",
      "typeOrgane": "CNPE",
      "dateDebut": "2011-12-13T01:00:00.000+01:00",
      "datePublication": "2011-12-14T01:00:00.000+01:00",
      "dateFin": "2012-03-07T01:00:00.000+01:00",
      "preseance": "20",
      "nominPrincipale": "1",
      "infosQualite": {
        "codeQualite": "Membre",
        "libQualite": "Membre",
        "libQualiteSex": "Membre"
      },
      "organesRefs": [
        "PO446215"
      ]
    },
    {
      "xsiType": "MandatParlementaire_type",
      "uid": "PM645209",
      "acteurRef": "PA345897",
      "legislature": "14",
      "typeOrgane": "ASSEMBLEE",
      "dateDebut": "2012-06-20T02:00:00.000+02:00",
      "dateFin": "2017-06-20T02:00:00.000+02:00",
      "preseance": "50",
      "nominPrincipale": "1",
      "infosQualite": {
        "codeQualite": "membre",
        "libQualite": "membre",
        "libQualiteSex": "membre"
      },
      "organesRefs": [
        "PO644420"
      ],
      "suppleant": {
        "dateDebut": "2012-06-20T02:00:00.000+02:00",
        "dateFin": "2017-06-20T02:00:00.000+02:00",
        "suppleantRef": "PA642994"
      },
      "election": {
        "lieu": {
          "region": "Ile-de-France",
          "regionType": "Métropolitain",
          "departement": "Yvelines",
          "numDepartement": "78",
          "numCirco": "7"
        },
        "causeMandat": "élections générales",
        "refCirconscription": "PO644864"
      },
      "mandature": {
        "datePriseFonction": "2012-06-20T02:00:00.000+02:00",
        "causeFin": "Fin de législature",
        "premiereElection": "1"
      }
    },
    {
      "xsiType": "MandatSimple_Type",
      "uid": "PM656549",
      "acteurRef": "PA345897",
      "legislature": "14",
      "typeOrgane": "GP",
      "dateDebut": "2012-06-26T02:00:00.000+02:00",
      "datePublication": "2012-06-27T02:00:00.000+02:00",
      "dateFin": "2017-06-20T02:00:00.000+02:00",
      "preseance": "20",
      "nominPrincipale": "1",
      "infosQualite": {
        "codeQualite": "Membre",
        "libQualite": "Membre du",
        "libQualiteSex": "Membre du"
      },
      "organesRefs": [
        "PO656010"
      ]
    },
    {
      "xsiType": "MandatSimple_Type",
      "uid": "PM656981",
      "acteurRef": "PA345897",
      "legislature": "14",
      "typeOrgane": "COMPER",
      "dateDebut": "2012-06-28T02:00:00.000+02:00",
      "datePublication": "2012-06-28T02:00:00.000+02:00",
      "dateFin": "2013-11-13T01:00:00.000+01:00",
      "preseance": "32",
      "nominPrincipale": "1",
      "infosQualite": {
        "codeQualite": "Membre",
        "libQualite": "Membre",
        "libQualiteSex": "Membre"
      },
      "organesRefs": [
        "PO420120"
      ]
    },
    {
      "xsiType": "MandatAvecSuppleant_Type",
      "uid": "PM664000",
      "acteurRef": "PA345897",
      "legislature": "14",
      "typeOrgane": "COMNL",
      "dateDebut": "2012-07-04T02:00:00.000+02:00",
      "datePublication": "2012-07-04T02:00:00.000+02:00",
      "dateFin": "2017-06-20T02:00:00.000+02:00",
      "preseance": "20",
      "nominPrincipale": "1",
      "infosQualite": {
        "codeQualite": "Membre",
        "libQualite": "Membre",
        "libQualiteSex": "Membre"
      },
      "organesRefs": [
        "PO415287"
      ]
    },
    {
      "xsiType": "MandatAvecSuppleant_Type",
      "uid": "PM670980",
      "acteurRef": "PA345897",
      "legislature": "14",
      "typeOrgane": "COMNL",
      "dateDebut": "2012-07-11T02:00:00.000+02:00",
      "datePublication": "2012-07-11T02:00:00.000+02:00",
      "dateFin": "2014-10-07T02:00:00.000+02:00",
      "preseance": "20",
      "nominPrincipale": "1",
      "infosQualite": {
        "codeQualite": "Membre",
        "libQualite": "Membre",
        "libQualiteSex": "Membre"
      },
      "organesRefs": [
        "PO271860"
      ]
    },
    {
      "xsiType": "MandatAvecSuppleant_Type",
      "uid": "PM677237",
      "acteurRef": "PA345897",
      "legislature": "14",
      "typeOrgane": "COMNL",
      "dateDebut": "2012-07-24T02:00:00.000+02:00",
      "datePublication": "2012-07-25T02:00:00.000+02:00",
      "dateFin": "2014-10-07T02:00:00.000+02:00",
      "preseance": "16",
      "nominPrincipale": "1",
      "infosQualite": {
        "codeQualite": "Secrétaire",
        "libQualite": "Secrétaire",
        "libQualiteSex": "Secrétaire"
      },
      "organesRefs": [
        "PO271860"
      ]
    },
    {
      "xsiType": "MandatSimple_Type",
      "uid": "PM678751",
      "acteurRef": "PA345897",
      "legislature": "14",
      "typeOrgane": "CMP",
      "dateDebut": "2012-09-27T02:00:00.000+02:00",
      "datePublication": "2012-06-28T02:00:00.000+02:00",
      "dateFin": "2012-10-15T02:00:00.000+02:00",
      "preseance": "28",
      "nominPrincipale": "1",
      "infosQualite": {
        "codeQualite": "Suppléant",
        "libQualite": "Membre suppléant",
        "libQualiteSex": "Membre suppléant"
      },
      "organesRefs": [
        "PO678407"
      ]
    },
    {
      "xsiType": "MandatSimple_Type",
      "uid": "PM679144",
      "acteurRef": "PA345897",
      "legislature": "14",
      "typeOrgane": "ORGEXTPARL",
      "dateDebut": "2012-10-05T02:00:00.000+02:00",
      "datePublication": "2012-10-06T02:00:00.000+02:00",
      "dateFin": "2017-06-20T02:00:00.000+02:00",
      "preseance": "30",
      "nominPrincipale": "1",
      "infosQualite": {
        "codeQualite": "Suppléant",
        "libQualite": "Membre suppléant",
        "libQualiteSex": "Membre suppléant"
      },
      "organesRefs": [
        "PO60266"
      ]
    },
    {
      "xsiType": "MandatSimple_Type",
      "uid": "PM679160",
      "acteurRef": "PA345897",
      "legislature": "14",
      "typeOrgane": "ORGEXTPARL",
      "dateDebut": "2012-10-05T02:00:00.000+02:00",
      "datePublication": "2012-10-06T02:00:00.000+02:00",
      "dateFin": "2017-06-20T02:00:00.000+02:00",
      "preseance": "20",
      "nominPrincipale": "1",
      "infosQualite": {
        "codeQualite": "Titulaire",
        "libQualite": "Membre titulaire",
        "libQualiteSex": "Membre titulaire"
      },
      "organesRefs": [
        "PO311260"
      ]
    },
    {
      "xsiType": "MandatSimple_Type",
      "uid": "PM683679",
      "acteurRef": "PA345897",
      "legislature": "14",
      "typeOrgane": "GA",
      "dateDebut": "2012-10-31T01:00:00.000+01:00",
      "dateFin": "2017-06-20T02:00:00.000+02:00",
      "preseance": "20",
      "nominPrincipale": "1",
      "infosQualite": {
        "codeQualite": "Membre",
        "libQualite": "Membre",
        "libQualiteSex": "Membre"
      },
      "organesRefs": [
        "PO675835"
      ]
    },
    {
      "xsiType": "MandatSimple_Type",
      "uid": "PM683680",
      "acteurRef": "PA345897",
      "legislature": "14",
      "typeOrgane": "GA",
      "dateDebut": "2012-10-31T01:00:00.000+01:00",
      "dateFin": "2017-06-20T02:00:00.000+02:00",
      "preseance": "20",
      "nominPrincipale": "1",
      "infosQualite": {
        "codeQualite": "Membre",
        "libQualite": "Membre",
        "libQualiteSex": "Membre"
      },
      "organesRefs": [
        "PO675709"
      ]
    },
    {
      "xsiType": "MandatSimple_Type",
      "uid": "PM683681",
      "acteurRef": "PA345897",
      "legislature": "14",
      "typeOrgane": "GA",
      "dateDebut": "2012-10-31T01:00:00.000+01:00",
      "dateFin": "2017-06-20T02:00:00.000+02:00",
      "preseance": "20",
      "nominPrincipale": "1",
      "infosQualite": {
        "codeQualite": "Membre",
        "libQualite": "Membre",
        "libQualiteSex": "Membre"
      },
      "organesRefs": [
        "PO675811"
      ]
    },
    {
      "xsiType": "MandatSimple_Type",
      "uid": "PM683682",
      "acteurRef": "PA345897",
      "legislature": "14",
      "typeOrgane": "GA",
      "dateDebut": "2012-10-31T01:00:00.000+01:00",
      "dateFin": "2017-06-20T02:00:00.000+02:00",
      "preseance": "20",
      "nominPrincipale": "1",
      "infosQualite": {
        "codeQualite": "Membre",
        "libQualite": "Membre",
        "libQualiteSex": "Membre"
      },
      "organesRefs": [
        "PO675833"
      ]
    },
    {
      "xsiType": "MandatSimple_Type",
      "uid": "PM683683",
      "acteurRef": "PA345897",
      "legislature": "14",
      "typeOrgane": "GA",
      "dateDebut": "2012-10-31T01:00:00.000+01:00",
      "dateFin": "2017-06-20T02:00:00.000+02:00",
      "preseance": "20",
      "nominPrincipale": "1",
      "infosQualite": {
        "codeQualite": "Membre",
        "libQualite": "Membre",
        "libQualiteSex": "Membre"
      },
      "organesRefs": [
        "PO675736"
      ]
    },
    {
      "xsiType": "MandatSimple_Type",
      "uid": "PM683684",
      "acteurRef": "PA345897",
      "legislature": "14",
      "typeOrgane": "GA",
      "dateDebut": "2012-10-31T01:00:00.000+01:00",
      "dateFin": "2017-06-20T02:00:00.000+02:00",
      "preseance": "20",
      "nominPrincipale": "1",
      "infosQualite": {
        "codeQualite": "Membre",
        "libQualite": "Membre",
        "libQualiteSex": "Membre"
      },
      "organesRefs": [
        "PO675764"
      ]
    },
    {
      "xsiType": "MandatSimple_Type",
      "uid": "PM683685",
      "acteurRef": "PA345897",
      "legislature": "14",
      "typeOrgane": "GA",
      "dateDebut": "2012-10-31T01:00:00.000+01:00",
      "dateFin": "2017-06-20T02:00:00.000+02:00",
      "preseance": "20",
      "nominPrincipale": "1",
      "infosQualite": {
        "codeQualite": "Membre",
        "libQualite": "Membre",
        "libQualiteSex": "Membre"
      },
      "organesRefs": [
        "PO675719"
      ]
    },
    {
      "xsiType": "MandatSimple_Type",
      "uid": "PM683686",
      "acteurRef": "PA345897",
      "legislature": "14",
      "typeOrgane": "GA",
      "dateDebut": "2012-10-31T01:00:00.000+01:00",
      "dateFin": "2017-06-20T02:00:00.000+02:00",
      "preseance": "20",
      "nominPrincipale": "1",
      "infosQualite": {
        "codeQualite": "Membre",
        "libQualite": "Membre",
        "libQualiteSex": "Membre"
      },
      "organesRefs": [
        "PO675772"
      ]
    },
    {
      "xsiType": "MandatSimple_Type",
      "uid": "PM683687",
      "acteurRef": "PA345897",
      "legislature": "14",
      "typeOrgane": "GA",
      "dateDebut": "2012-10-31T01:00:00.000+01:00",
      "dateFin": "2017-06-20T02:00:00.000+02:00",
      "preseance": "20",
      "nominPrincipale": "1",
      "infosQualite": {
        "codeQualite": "Membre",
        "libQualite": "Membre",
        "libQualiteSex": "Membre"
      },
      "organesRefs": [
        "PO675794"
      ]
    },
    {
      "xsiType": "MandatSimple_Type",
      "uid": "PM683688",
      "acteurRef": "PA345897",
      "legislature": "14",
      "typeOrgane": "GA",
      "dateDebut": "2012-10-31T01:00:00.000+01:00",
      "dateFin": "2017-06-20T02:00:00.000+02:00",
      "preseance": "20",
      "nominPrincipale": "1",
      "infosQualite": {
        "codeQualite": "Membre",
        "libQualite": "Membre",
        "libQualiteSex": "Membre"
      },
      "organesRefs": [
        "PO675854"
      ]
    },
    {
      "xsiType": "MandatSimple_Type",
      "uid": "PM683689",
      "acteurRef": "PA345897",
      "legislature": "14",
      "typeOrgane": "GA",
      "dateDebut": "2012-10-31T01:00:00.000+01:00",
      "dateFin": "2017-06-20T02:00:00.000+02:00",
      "preseance": "20",
      "nominPrincipale": "1",
      "infosQualite": {
        "codeQualite": "Membre",
        "libQualite": "Membre",
        "libQualiteSex": "Membre"
      },
      "organesRefs": [
        "PO675716"
      ]
    },
    {
      "xsiType": "MandatSimple_Type",
      "uid": "PM684399",
      "acteurRef": "PA345897",
      "legislature": "14",
      "typeOrgane": "GA",
      "dateDebut": "2012-11-14T01:00:00.000+01:00",
      "dateFin": "2017-06-20T02:00:00.000+02:00",
      "preseance": "8",
      "nominPrincipale": "1",
      "infosQualite": {
        "codeQualite": "Vice-Président",
        "libQualite": "Vice-Président",
        "libQualiteSex": "Vice-Président"
      },
      "organesRefs": [
        "PO675709"
      ]
    },
    {
      "xsiType": "MandatSimple_Type",
      "uid": "PM684675",
      "acteurRef": "PA345897",
      "legislature": "14",
      "typeOrgane": "GA",
      "dateDebut": "2012-11-20T01:00:00.000+01:00",
      "dateFin": "2017-06-20T02:00:00.000+02:00",
      "preseance": "8",
      "nominPrincipale": "1",
      "infosQualite": {
        "codeQualite": "Vice-Président",
        "libQualite": "Vice-Président",
        "libQualiteSex": "Vice-Président"
      },
      "organesRefs": [
        "PO675736"
      ]
    },
    {
      "xsiType": "MandatSimple_Type",
      "uid": "PM685411",
      "acteurRef": "PA345897",
      "legislature": "14",
      "typeOrgane": "GA",
      "dateDebut": "2012-12-04T01:00:00.000+01:00",
      "dateFin": "2017-06-20T02:00:00.000+02:00",
      "preseance": "8",
      "nominPrincipale": "1",
      "infosQualite": {
        "codeQualite": "Vice-Président",
        "libQualite": "Vice-Président",
        "libQualiteSex": "Vice-Président"
      },
      "organesRefs": [
        "PO675716"
      ]
    },
    {
      "xsiType": "MandatSimple_Type",
      "uid": "PM686049",
      "acteurRef": "PA345897",
      "typeOrgane": "PARPOL",
      "dateDebut": "2012-12-01T01:00:00.000+01:00",
      "dateFin": "2017-06-20T02:00:00.000+02:00",
      "preseance": "5",
      "nominPrincipale": "1",
      "infosQualite": {
        "codeQualite": "Membre",
        "libQualite": "Membre",
        "libQualiteSex": "Membre"
      },
      "organesRefs": [
        "PO684940"
      ]
    },
    {
      "xsiType": "MandatSimple_Type",
      "uid": "PM686748",
      "acteurRef": "PA345897",
      "legislature": "14",
      "typeOrgane": "CMP",
      "dateDebut": "2012-12-12T01:00:00.000+01:00",
      "datePublication": "2012-12-12T01:00:00.000+01:00",
      "dateFin": "2012-12-19T01:00:00.000+01:00",
      "preseance": "20",
      "nominPrincipale": "1",
      "infosQualite": {
        "codeQualite": "Titulaire",
        "libQualite": "Membre titulaire",
        "libQualiteSex": "Membre titulaire"
      },
      "organesRefs": [
        "PO686534"
      ]
    },
    {
      "xsiType": "MandatSimple_Type",
      "uid": "PM687019",
      "acteurRef": "PA345897",
      "legislature": "14",
      "typeOrgane": "GA",
      "dateDebut": "2012-12-12T01:00:00.000+01:00",
      "dateFin": "2017-06-20T02:00:00.000+02:00",
      "preseance": "8",
      "nominPrincipale": "1",
      "infosQualite": {
        "codeQualite": "Vice-Président",
        "libQualite": "Vice-Président",
        "libQualiteSex": "Vice-Président"
      },
      "organesRefs": [
        "PO675854"
      ]
    },
    {
      "xsiType": "MandatSimple_Type",
      "uid": "PM687925",
      "acteurRef": "PA345897",
      "legislature": "14",
      "typeOrgane": "GE",
      "dateDebut": "2013-01-09T01:00:00.000+01:00",
      "dateFin": "2017-06-20T02:00:00.000+02:00",
      "preseance": "20",
      "nominPrincipale": "1",
      "infosQualite": {
        "codeQualite": "Membre",
        "libQualite": "Membre",
        "libQualiteSex": "Membre"
      },
      "organesRefs": [
        "PO686793"
      ]
    },
    {
      "xsiType": "MandatSimple_Type",
      "uid": "PM688651",
      "acteurRef": "PA345897",
      "legislature": "14",
      "typeOrgane": "GE",
      "dateDebut": "2013-01-24T01:00:00.000+01:00",
      "dateFin": "2017-06-20T02:00:00.000+02:00",
      "preseance": "20",
      "nominPrincipale": "1",
      "infosQualite": {
        "codeQualite": "Membre",
        "libQualite": "Membre",
        "libQualiteSex": "Membre"
      },
      "organesRefs": [
        "PO686232"
      ]
    },
    {
      "xsiType": "MandatSimple_Type",
      "uid": "PM688983",
      "acteurRef": "PA345897",
      "legislature": "14",
      "typeOrgane": "GE",
      "dateDebut": "2013-01-25T01:00:00.000+01:00",
      "dateFin": "2017-06-20T02:00:00.000+02:00",
      "preseance": "20",
      "nominPrincipale": "1",
      "infosQualite": {
        "codeQualite": "Membre",
        "libQualite": "Membre",
        "libQualiteSex": "Membre"
      },
      "organesRefs": [
        "PO686577"
      ]
    },
    {
      "xsiType": "MandatSimple_Type",
      "uid": "PM690291",
      "acteurRef": "PA345897",
      "legislature": "14",
      "typeOrgane": "GE",
      "dateDebut": "2013-01-30T01:00:00.000+01:00",
      "dateFin": "2017-06-20T02:00:00.000+02:00",
      "preseance": "8",
      "nominPrincipale": "1",
      "infosQualite": {
        "codeQualite": "Vice-Président",
        "libQualite": "Vice-Président",
        "libQualiteSex": "Vice-Président"
      },
      "organesRefs": [
        "PO686577"
      ]
    },
    {
      "xsiType": "MandatSimple_Type",
      "uid": "PM690834",
      "acteurRef": "PA345897",
      "legislature": "14",
      "typeOrgane": "CMP",
      "dateDebut": "2013-02-07T01:00:00.000+01:00",
      "datePublication": "2013-02-08T01:00:00.000+01:00",
      "dateFin": "2013-03-03T01:00:00.000+01:00",
      "preseance": "28",
      "nominPrincipale": "1",
      "infosQualite": {
        "codeQualite": "Suppléant",
        "libQualite": "Membre suppléant",
        "libQualiteSex": "Membre suppléant"
      },
      "organesRefs": [
        "PO690795"
      ]
    },
    {
      "xsiType": "MandatSimple_Type",
      "uid": "PM691082",
      "acteurRef": "PA345897",
      "legislature": "14",
      "typeOrgane": "GE",
      "dateDebut": "2013-02-12T01:00:00.000+01:00",
      "dateFin": "2017-06-20T02:00:00.000+02:00",
      "preseance": "20",
      "nominPrincipale": "1",
      "infosQualite": {
        "codeQualite": "Membre",
        "libQualite": "Membre",
        "libQualiteSex": "Membre"
      },
      "organesRefs": [
        "PO686362"
      ]
    },
    {
      "xsiType": "MandatSimple_Type",
      "uid": "PM691097",
      "acteurRef": "PA345897",
      "legislature": "14",
      "typeOrgane": "GE",
      "dateDebut": "2013-02-12T01:00:00.000+01:00",
      "dateFin": "2017-06-20T02:00:00.000+02:00",
      "preseance": "20",
      "nominPrincipale": "1",
      "infosQualite": {
        "codeQualite": "Membre",
        "libQualite": "Membre",
        "libQualiteSex": "Membre"
      },
      "organesRefs": [
        "PO686785"
      ]
    },
    {
      "xsiType": "MandatSimple_Type",
      "uid": "PM691146",
      "acteurRef": "PA345897",
      "legislature": "14",
      "typeOrgane": "GE",
      "dateDebut": "2013-02-10T01:00:00.000+01:00",
      "dateFin": "2017-06-20T02:00:00.000+02:00",
      "preseance": "20",
      "nominPrincipale": "1",
      "infosQualite": {
        "codeQualite": "Membre",
        "libQualite": "Membre",
        "libQualiteSex": "Membre"
      },
      "organesRefs": [
        "PO687392"
      ]
    },
    {
      "xsiType": "MandatSimple_Type",
      "uid": "PM691291",
      "acteurRef": "PA345897",
      "legislature": "14",
      "typeOrgane": "GE",
      "dateDebut": "2013-02-13T01:00:00.000+01:00",
      "dateFin": "2017-06-20T02:00:00.000+02:00",
      "preseance": "20",
      "nominPrincipale": "1",
      "infosQualite": {
        "codeQualite": "Membre",
        "libQualite": "Membre",
        "libQualiteSex": "Membre"
      },
      "organesRefs": [
        "PO686284"
      ]
    },
    {
      "xsiType": "MandatSimple_Type",
      "uid": "PM691397",
      "acteurRef": "PA345897",
      "legislature": "14",
      "typeOrgane": "GE",
      "dateDebut": "2013-02-14T01:00:00.000+01:00",
      "dateFin": "2017-06-20T02:00:00.000+02:00",
      "preseance": "20",
      "nominPrincipale": "1",
      "infosQualite": {
        "codeQualite": "Membre",
        "libQualite": "Membre",
        "libQualiteSex": "Membre"
      },
      "organesRefs": [
        "PO686188"
      ]
    },
    {
      "xsiType": "MandatSimple_Type",
      "uid": "PM691488",
      "acteurRef": "PA345897",
      "legislature": "14",
      "typeOrgane": "GE",
      "dateDebut": "2013-02-14T01:00:00.000+01:00",
      "dateFin": "2017-06-20T02:00:00.000+02:00",
      "preseance": "20",
      "nominPrincipale": "1",
      "infosQualite": {
        "codeQualite": "Membre",
        "libQualite": "Membre",
        "libQualiteSex": "Membre"
      },
      "organesRefs": [
        "PO687613"
      ]
    },
    {
      "xsiType": "MandatSimple_Type",
      "uid": "PM693951",
      "acteurRef": "PA345897",
      "legislature": "14",
      "typeOrgane": "GE",
      "dateDebut": "2013-04-17T02:00:00.000+02:00",
      "dateFin": "2017-06-20T02:00:00.000+02:00",
      "preseance": "8",
      "nominPrincipale": "1",
      "infosQualite": {
        "codeQualite": "Vice-Président",
        "libQualite": "Vice-Président",
        "libQualiteSex": "Vice-Président"
      },
      "organesRefs": [
        "PO686362"
      ]
    },
    {
      "xsiType": "MandatSimple_Type",
      "uid": "PM695739",
      "acteurRef": "PA345897",
      "legislature": "14",
      "typeOrgane": "GE",
      "dateDebut": "2013-07-02T02:00:00.000+02:00",
      "dateFin": "2017-06-20T02:00:00.000+02:00",
      "preseance": "20",
      "nominPrincipale": "1",
      "infosQualite": {
        "codeQualite": "Membre",
        "libQualite": "Membre",
        "libQualiteSex": "Membre"
      },
      "organesRefs": [
        "PO688296"
      ]
    },
    {
      "xsiType": "MandatSimple_Type",
      "uid": "PM695745",
      "acteurRef": "PA345897",
      "legislature": "14",
      "typeOrgane": "GE",
      "dateDebut": "2013-07-02T02:00:00.000+02:00",
      "dateFin": "2017-06-20T02:00:00.000+02:00",
      "preseance": "20",
      "nominPrincipale": "1",
      "infosQualite": {
        "codeQualite": "Membre",
        "libQualite": "Membre",
        "libQualiteSex": "Membre"
      },
      "organesRefs": [
        "PO694566"
      ]
    },
    {
      "xsiType": "MandatSimple_Type",
      "uid": "PM696078",
      "acteurRef": "PA345897",
      "legislature": "14",
      "typeOrgane": "GE",
      "dateDebut": "2013-07-15T02:00:00.000+02:00",
      "dateFin": "2017-06-20T02:00:00.000+02:00",
      "preseance": "8",
      "nominPrincipale": "1",
      "infosQualite": {
        "codeQualite": "Vice-Président",
        "libQualite": "Vice-Président",
        "libQualiteSex": "Vice-Président"
      },
      "organesRefs": [
        "PO688296"
      ]
    },
    {
      "xsiType": "MandatSimple_Type",
      "uid": "PM698377",
      "acteurRef": "PA345897",
      "legislature": "14",
      "typeOrgane": "COMPER",
      "dateDebut": "2013-11-14T01:00:00.000+01:00",
      "datePublication": "2013-11-14T01:00:00.000+01:00",
      "dateFin": "2013-11-14T01:00:00.000+01:00",
      "preseance": "32",
      "nominPrincipale": "1",
      "infosQualite": {
        "codeQualite": "Membre",
        "libQualite": "Membre",
        "libQualiteSex": "Membre"
      },
      "organesRefs": [
        "PO419610"
      ]
    },
    {
      "xsiType": "MandatSimple_Type",
      "uid": "PM698518",
      "acteurRef": "PA345897",
      "legislature": "14",
      "typeOrgane": "COMPER",
      "dateDebut": "2013-11-15T01:00:00.000+01:00",
      "datePublication": "2013-11-15T01:00:00.000+01:00",
      "dateFin": "2014-11-25T01:00:00.000+01:00",
      "preseance": "32",
      "nominPrincipale": "1",
      "infosQualite": {
        "codeQualite": "Membre",
        "libQualite": "Membre",
        "libQualiteSex": "Membre"
      },
      "organesRefs": [
        "PO420120"
      ]
    },
    {
      "xsiType": "MandatSimple_Type",
      "uid": "PM699710",
      "acteurRef": "PA345897",
      "legislature": "14",
      "typeOrgane": "CMP",
      "dateDebut": "2014-01-29T01:00:00.000+01:00",
      "datePublication": "2014-01-30T01:00:00.000+01:00",
      "dateFin": "2014-02-17T01:00:00.000+01:00",
      "preseance": "28",
      "nominPrincipale": "1",
      "infosQualite": {
        "codeQualite": "Suppléant",
        "libQualite": "Membre suppléant",
        "libQualiteSex": "Membre suppléant"
      },
      "organesRefs": [
        "PO699474"
      ]
    },
    {
      "xsiType": "MandatSimple_Type",
      "uid": "PM700330",
      "acteurRef": "PA345897",
      "legislature": "14",
      "typeOrgane": "CMP",
      "dateDebut": "2014-02-20T01:00:00.000+01:00",
      "datePublication": "2014-02-21T01:00:00.000+01:00",
      "dateFin": "2014-02-27T01:00:00.000+01:00",
      "preseance": "28",
      "nominPrincipale": "1",
      "infosQualite": {
        "codeQualite": "Suppléant",
        "libQualite": "Membre suppléant",
        "libQualiteSex": "Membre suppléant"
      },
      "organesRefs": [
        "PO700314"
      ]
    },
    {
      "xsiType": "MandatSimple_Type",
      "uid": "PM701463",
      "acteurRef": "PA345897",
      "legislature": "14",
      "typeOrgane": "GE",
      "dateDebut": "2014-05-21T02:00:00.000+02:00",
      "dateFin": "2017-06-20T02:00:00.000+02:00",
      "preseance": "20",
      "nominPrincipale": "1",
      "infosQualite": {
        "codeQualite": "Membre",
        "libQualite": "Membre",
        "libQualiteSex": "Membre"
      },
      "organesRefs": [
        "PO686519"
      ]
    },
    {
      "xsiType": "MandatSimple_Type",
      "uid": "PM701586",
      "acteurRef": "PA345897",
      "legislature": "14",
      "typeOrgane": "CMP",
      "dateDebut": "2014-05-27T02:00:00.000+02:00",
      "datePublication": "2014-05-28T02:00:00.000+02:00",
      "dateFin": "2014-06-26T02:00:00.000+02:00",
      "preseance": "28",
      "nominPrincipale": "1",
      "infosQualite": {
        "codeQualite": "Suppléant",
        "libQualite": "Membre suppléant",
        "libQualiteSex": "Membre suppléant"
      },
      "organesRefs": [
        "PO701381"
      ]
    },
    {
      "xsiType": "MandatSimple_Type",
      "uid": "PM701813",
      "acteurRef": "PA345897",
      "legislature": "14",
      "typeOrgane": "CMP",
      "dateDebut": "2014-06-13T02:00:00.000+02:00",
      "datePublication": "2014-06-14T02:00:00.000+02:00",
      "dateFin": "2014-06-26T02:00:00.000+02:00",
      "preseance": "28",
      "nominPrincipale": "1",
      "infosQualite": {
        "codeQualite": "Suppléant",
        "libQualite": "Membre suppléant",
        "libQualiteSex": "Membre suppléant"
      },
      "organesRefs": [
        "PO701795"
      ]
    },
    {
      "xsiType": "MandatSimple_Type",
      "uid": "PM702408",
      "acteurRef": "PA345897",
      "legislature": "14",
      "typeOrgane": "CMP",
      "dateDebut": "2014-07-10T02:00:00.000+02:00",
      "datePublication": "2014-07-11T02:00:00.000+02:00",
      "dateFin": "2014-07-21T02:00:00.000+02:00",
      "preseance": "28",
      "nominPrincipale": "1",
      "infosQualite": {
        "codeQualite": "Suppléant",
        "libQualite": "Membre suppléant",
        "libQualiteSex": "Membre suppléant"
      },
      "organesRefs": [
        "PO702220"
      ]
    },
    {
      "xsiType": "MandatParlementaire_type",
      "uid": "PM703400",
      "acteurRef": "PA345897",
      "legislature": "14",
      "typeOrgane": "ASSEMBLEE",
      "dateDebut": "2014-10-01T02:00:00.000+02:00",
      "dateFin": "2015-09-30T02:00:00.000+02:00",
      "preseance": "30",
      "nominPrincipale": "1",
      "infosQualite": {
        "codeQualite": "Secrétaire",
        "libQualite": "Secrétaire de l'Assemblée nationale",
        "libQualiteSex": "Secrétaire de l'Assemblée nationale"
      },
      "organesRefs": [
        "PO644420"
      ],
      "election": {
        "lieu": {}
      },
      "mandature": {
        "premiereElection": "0"
      }
    },
    {
      "xsiType": "MandatSimple_Type",
      "uid": "PM703435",
      "acteurRef": "PA345897",
      "legislature": "14",
      "typeOrgane": "DELEGBUREAU",
      "dateDebut": "2014-10-01T02:00:00.000+02:00",
      "dateFin": "2015-09-30T02:00:00.000+02:00",
      "preseance": "24",
      "nominPrincipale": "1",
      "infosQualite": {
        "codeQualite": "Membre",
        "libQualite": "Membre",
        "libQualiteSex": "Membre"
      },
      "organesRefs": [
        "PO665158"
      ]
    },
    {
      "xsiType": "MandatSimple_Type",
      "uid": "PM703438",
      "acteurRef": "PA345897",
      "legislature": "14",
      "typeOrgane": "DELEGBUREAU",
      "dateDebut": "2014-10-01T02:00:00.000+02:00",
      "dateFin": "2015-09-30T02:00:00.000+02:00",
      "preseance": "24",
      "nominPrincipale": "1",
      "infosQualite": {
        "codeQualite": "Membre",
        "libQualite": "Membre",
        "libQualiteSex": "Membre"
      },
      "organesRefs": [
        "PO665154"
      ]
    },
    {
      "xsiType": "MandatSimple_Type",
      "uid": "PM704729",
      "acteurRef": "PA345897",
      "legislature": "14",
      "typeOrgane": "COMPER",
      "dateDebut": "2014-11-25T01:00:00.000+01:00",
      "datePublication": "2014-11-25T01:00:00.000+01:00",
      "dateFin": "2014-11-27T01:00:00.000+01:00",
      "preseance": "32",
      "nominPrincipale": "1",
      "infosQualite": {
        "codeQualite": "Membre",
        "libQualite": "Membre",
        "libQualiteSex": "Membre"
      },
      "organesRefs": [
        "PO59051"
      ]
    },
    {
      "xsiType": "MandatSimple_Type",
      "uid": "PM704798",
      "acteurRef": "PA345897",
      "legislature": "14",
      "typeOrgane": "COMPER",
      "dateDebut": "2014-11-28T01:00:00.000+01:00",
      "datePublication": "2014-11-28T01:00:00.000+01:00",
      "dateFin": "2015-06-12T02:00:00.000+02:00",
      "preseance": "32",
      "nominPrincipale": "1",
      "infosQualite": {
        "codeQualite": "Membre",
        "libQualite": "Membre",
        "libQualiteSex": "Membre"
      },
      "organesRefs": [
        "PO420120"
      ]
    },
    {
      "xsiType": "MandatSimple_Type",
      "uid": "PM708358",
      "acteurRef": "PA345897",
      "legislature": "14",
      "typeOrgane": "CMP",
      "dateDebut": "2015-06-05T02:00:00.000+02:00",
      "datePublication": "2015-06-05T02:00:00.000+02:00",
      "dateFin": "2015-06-11T02:00:00.000+02:00",
      "preseance": "28",
      "nominPrincipale": "1",
      "infosQualite": {
        "codeQualite": "Suppléant",
        "libQualite": "Membre suppléant",
        "libQualiteSex": "Membre suppléant"
      },
      "organesRefs": [
        "PO707805"
      ]
    },
    {
      "xsiType": "MandatSimple_Type",
      "uid": "PM708598",
      "acteurRef": "PA345897",
      "legislature": "14",
      "typeOrgane": "COMPER",
      "dateDebut": "2015-06-13T02:00:00.000+02:00",
      "datePublication": "2015-06-13T02:00:00.000+02:00",
      "dateFin": "2015-06-19T02:00:00.000+02:00",
      "preseance": "32",
      "nominPrincipale": "1",
      "infosQualite": {
        "codeQualite": "Membre",
        "libQualite": "Membre",
        "libQualiteSex": "Membre"
      },
      "organesRefs": [
        "PO59051"
      ]
    },
    {
      "xsiType": "MandatSimple_Type",
      "uid": "PM708682",
      "acteurRef": "PA345897",
      "legislature": "14",
      "typeOrgane": "COMPER",
      "dateDebut": "2015-06-20T02:00:00.000+02:00",
      "datePublication": "2015-06-20T02:00:00.000+02:00",
      "dateFin": "2015-11-03T01:00:00.000+01:00",
      "preseance": "32",
      "nominPrincipale": "1",
      "infosQualite": {
        "codeQualite": "Membre",
        "libQualite": "Membre",
        "libQualiteSex": "Membre"
      },
      "organesRefs": [
        "PO420120"
      ]
    },
    {
      "xsiType": "MandatMission_Type",
      "uid": "PM708926",
      "acteurRef": "PA345897",
      "legislature": "14",
      "typeOrgane": "MISINFOPRE",
      "dateDebut": "2015-07-09T02:00:00.000+02:00",
      "datePublication": "2015-07-10T02:00:00.000+02:00",
      "dateFin": "2016-06-21T02:00:00.000+02:00",
      "preseance": "20",
      "nominPrincipale": "1",
      "infosQualite": {
        "codeQualite": "Membre",
        "libQualite": "Membre",
        "libQualiteSex": "Membre"
      },
      "organesRefs": [
        "PO708706"
      ]
    },
    {
      "xsiType": "MandatMission_Type",
      "uid": "PM709397",
      "acteurRef": "PA345897",
      "legislature": "14",
      "typeOrgane": "MISINFOPRE",
      "dateDebut": "2015-09-16T02:00:00.000+02:00",
      "datePublication": "2015-09-17T02:00:00.000+02:00",
      "dateFin": "2016-06-21T02:00:00.000+02:00",
      "preseance": "1",
      "nominPrincipale": "1",
      "infosQualite": {
        "codeQualite": "Président",
        "libQualite": "Président",
        "libQualiteSex": "Président"
      },
      "organesRefs": [
        "PO708706"
      ]
    },
    {
      "xsiType": "MandatAvecSuppleant_Type",
      "uid": "PM709557",
      "acteurRef": "PA345897",
      "legislature": "14",
      "typeOrgane": "COMNL",
      "dateDebut": "2015-10-03T02:00:00.000+02:00",
      "datePublication": "2015-10-03T02:00:00.000+02:00",
      "dateFin": "2017-06-20T02:00:00.000+02:00",
      "preseance": "20",
      "nominPrincipale": "1",
      "infosQualite": {
        "codeQualite": "Membre",
        "libQualite": "Membre",
        "libQualiteSex": "Membre"
      },
      "organesRefs": [
        "PO271860"
      ]
    },
    {
      "xsiType": "MandatAvecSuppleant_Type",
      "uid": "PM709620",
      "acteurRef": "PA345897",
      "legislature": "14",
      "typeOrgane": "COMNL",
      "dateDebut": "2015-10-06T02:00:00.000+02:00",
      "datePublication": "2015-10-07T02:00:00.000+02:00",
      "dateFin": "2017-06-20T02:00:00.000+02:00",
      "preseance": "16",
      "nominPrincipale": "1",
      "infosQualite": {
        "codeQualite": "Secrétaire",
        "libQualite": "Secrétaire",
        "libQualiteSex": "Secrétaire"
      },
      "organesRefs": [
        "PO271860"
      ]
    },
    {
      "xsiType": "MandatSimple_Type",
      "uid": "PM709779",
      "acteurRef": "PA345897",
      "legislature": "14",
      "typeOrgane": "CMP",
      "dateDebut": "2015-10-22T02:00:00.000+02:00",
      "datePublication": "2015-10-22T02:00:00.000+02:00",
      "dateFin": "2015-10-28T01:00:00.000+01:00",
      "preseance": "28",
      "nominPrincipale": "1",
      "infosQualite": {
        "codeQualite": "Suppléant",
        "libQualite": "Membre suppléant",
        "libQualiteSex": "Membre suppléant"
      },
      "organesRefs": [
        "PO709622"
      ]
    },
    {
      "xsiType": "MandatSimple_Type",
      "uid": "PM709907",
      "acteurRef": "PA345897",
      "legislature": "14",
      "typeOrgane": "COMPER",
      "dateDebut": "2015-11-04T01:00:00.000+01:00",
      "datePublication": "2015-11-04T01:00:00.000+01:00",
      "dateFin": "2015-11-05T01:00:00.000+01:00",
      "preseance": "32",
      "nominPrincipale": "1",
      "infosQualite": {
        "codeQualite": "Membre",
        "libQualite": "Membre",
        "libQualiteSex": "Membre"
      },
      "organesRefs": [
        "PO419865"
      ]
    },
    {
      "xsiType": "MandatSimple_Type",
      "uid": "PM709993",
      "acteurRef": "PA345897",
      "legislature": "14",
      "typeOrgane": "COMPER",
      "dateDebut": "2015-11-06T01:00:00.000+01:00",
      "datePublication": "2015-11-06T01:00:00.000+01:00",
      "dateFin": "2015-11-17T01:00:00.000+01:00",
      "preseance": "32",
      "nominPrincipale": "1",
      "infosQualite": {
        "codeQualite": "Membre",
        "libQualite": "Membre",
        "libQualiteSex": "Membre"
      },
      "organesRefs": [
        "PO420120"
      ]
    },
    {
      "xsiType": "MandatSimple_Type",
      "uid": "PM710205",
      "acteurRef": "PA345897",
      "legislature": "14",
      "typeOrgane": "COMPER",
      "dateDebut": "2015-11-18T01:00:00.000+01:00",
      "datePublication": "2015-11-18T01:00:00.000+01:00",
      "dateFin": "2015-11-18T01:00:00.000+01:00",
      "preseance": "32",
      "nominPrincipale": "1",
      "infosQualite": {
        "codeQualite": "Membre",
        "libQualite": "Membre",
        "libQualiteSex": "Membre"
      },
      "organesRefs": [
        "PO419865"
      ]
    },
    {
      "xsiType": "MandatSimple_Type",
      "uid": "PM710224",
      "acteurRef": "PA345897",
      "legislature": "14",
      "typeOrgane": "COMPER",
      "dateDebut": "2015-11-19T01:00:00.000+01:00",
      "datePublication": "2015-11-19T01:00:00.000+01:00",
      "dateFin": "2015-11-25T01:00:00.000+01:00",
      "preseance": "32",
      "nominPrincipale": "1",
      "infosQualite": {
        "codeQualite": "Membre",
        "libQualite": "Membre",
        "libQualiteSex": "Membre"
      },
      "organesRefs": [
        "PO420120"
      ]
    },
    {
      "xsiType": "MandatSimple_Type",
      "uid": "PM710312",
      "acteurRef": "PA345897",
      "legislature": "14",
      "typeOrgane": "COMPER",
      "dateDebut": "2015-11-26T01:00:00.000+01:00",
      "datePublication": "2015-11-26T01:00:00.000+01:00",
      "dateFin": "2015-11-27T01:00:00.000+01:00",
      "preseance": "32",
      "nominPrincipale": "1",
      "infosQualite": {
        "codeQualite": "Membre",
        "libQualite": "Membre",
        "libQualiteSex": "Membre"
      },
      "organesRefs": [
        "PO419865"
      ]
    },
    {
      "xsiType": "MandatSimple_Type",
      "uid": "PM710337",
      "acteurRef": "PA345897",
      "legislature": "14",
      "typeOrgane": "COMPER",
      "dateDebut": "2015-11-28T01:00:00.000+01:00",
      "datePublication": "2015-11-28T01:00:00.000+01:00",
      "dateFin": "2016-12-05T01:00:00.000+01:00",
      "preseance": "32",
      "nominPrincipale": "1",
      "infosQualite": {
        "codeQualite": "Membre",
        "libQualite": "Membre",
        "libQualiteSex": "Membre"
      },
      "organesRefs": [
        "PO420120"
      ]
    },
    {
      "xsiType": "MandatSimple_Type",
      "uid": "PM710354",
      "acteurRef": "PA345897",
      "legislature": "14",
      "typeOrgane": "CMP",
      "dateDebut": "2015-11-27T01:00:00.000+01:00",
      "datePublication": "2015-11-28T01:00:00.000+01:00",
      "dateFin": "2015-12-03T01:00:00.000+01:00",
      "preseance": "28",
      "nominPrincipale": "1",
      "infosQualite": {
        "codeQualite": "Suppléant",
        "libQualite": "Membre suppléant",
        "libQualiteSex": "Membre suppléant"
      },
      "organesRefs": [
        "PO709840"
      ]
    },
    {
      "xsiType": "MandatSimple_Type",
      "uid": "PM712370",
      "acteurRef": "PA345897",
      "legislature": "14",
      "typeOrgane": "GE",
      "dateDebut": "2016-04-13T02:00:00.000+02:00",
      "dateFin": "2017-06-20T02:00:00.000+02:00",
      "preseance": "20",
      "nominPrincipale": "1",
      "infosQualite": {
        "codeQualite": "Membre",
        "libQualite": "Membre",
        "libQualiteSex": "Membre"
      },
      "organesRefs": [
        "PO712100"
      ]
    },
    {
      "xsiType": "MandatSimple_Type",
      "uid": "PM712653",
      "acteurRef": "PA345897",
      "legislature": "14",
      "typeOrgane": "CNPS",
      "dateDebut": "2016-05-04T02:00:00.000+02:00",
      "datePublication": "2016-05-04T02:00:00.000+02:00",
      "dateFin": "2017-02-20T01:00:00.000+01:00",
      "preseance": "20",
      "nominPrincipale": "1",
      "infosQualite": {
        "codeQualite": "Membre",
        "libQualite": "Membre",
        "libQualiteSex": "Membre"
      },
      "organesRefs": [
        "PO712376"
      ]
    },
    {
      "xsiType": "MandatSimple_Type",
      "uid": "PM712884",
      "acteurRef": "PA345897",
      "legislature": "14",
      "typeOrgane": "GE",
      "dateDebut": "2016-05-17T02:00:00.000+02:00",
      "dateFin": "2017-06-20T02:00:00.000+02:00",
      "preseance": "20",
      "nominPrincipale": "0",
      "infosQualite": {
        "codeQualite": "Membre",
        "libQualite": "Membre",
        "libQualiteSex": "Membre"
      },
      "organesRefs": [
        "PO712091"
      ]
    },
    {
      "xsiType": "MandatSimple_Type",
      "uid": "PM712896",
      "acteurRef": "PA345897",
      "legislature": "14",
      "typeOrgane": "GE",
      "dateDebut": "2016-05-17T02:00:00.000+02:00",
      "dateFin": "2017-06-20T02:00:00.000+02:00",
      "preseance": "8",
      "nominPrincipale": "1",
      "infosQualite": {
        "codeQualite": "Vice-Président",
        "libQualite": "Vice-Président",
        "libQualiteSex": "Vice-Président"
      },
      "organesRefs": [
        "PO712091"
      ]
    },
    {
      "xsiType": "MandatSimple_Type",
      "uid": "PM713926",
      "acteurRef": "PA345897",
      "legislature": "14",
      "typeOrgane": "CMP",
      "dateDebut": "2016-06-23T02:00:00.000+02:00",
      "datePublication": "2016-06-24T02:00:00.000+02:00",
      "dateFin": "2016-07-05T02:00:00.000+02:00",
      "preseance": "28",
      "nominPrincipale": "1",
      "infosQualite": {
        "codeQualite": "Suppléant",
        "libQualite": "Membre suppléant",
        "libQualiteSex": "Membre suppléant"
      },
      "organesRefs": [
        "PO713876"
      ]
    },
    {
      "xsiType": "MandatMission_Type",
      "uid": "PM713949",
      "acteurRef": "PA345897",
      "legislature": "14",
      "typeOrgane": "MISINFO",
      "dateDebut": "2016-06-07T02:00:00.000+02:00",
      "dateFin": "2017-02-15T01:00:00.000+01:00",
      "preseance": "10",
      "nominPrincipale": "1",
      "infosQualite": {
        "codeQualite": "Membre",
        "libQualite": "Membre",
        "libQualiteSex": "Membre"
      },
      "organesRefs": [
        "PO713063"
      ]
    },
    {
      "xsiType": "MandatSimple_Type",
      "uid": "PM714607",
      "acteurRef": "PA345897",
      "legislature": "14",
      "typeOrgane": "GA",
      "dateDebut": "2016-08-24T02:00:00.000+02:00",
      "dateFin": "2017-06-20T02:00:00.000+02:00",
      "preseance": "8",
      "nominPrincipale": "1",
      "infosQualite": {
        "codeQualite": "Vice-Président",
        "libQualite": "Vice-Président",
        "libQualiteSex": "Vice-Président"
      },
      "organesRefs": [
        "PO675833"
      ]
    },
    {
      "xsiType": "MandatSimple_Type",
      "uid": "PM715750",
      "acteurRef": "PA345897",
      "legislature": "14",
      "typeOrgane": "COMPER",
      "dateDebut": "2016-12-06T01:00:00.000+01:00",
      "datePublication": "2016-12-06T01:00:00.000+01:00",
      "dateFin": "2016-12-08T01:00:00.000+01:00",
      "preseance": "32",
      "nominPrincipale": "1",
      "infosQualite": {
        "codeQualite": "Membre",
        "libQualite": "Membre",
        "libQualiteSex": "Membre"
      },
      "organesRefs": [
        "PO59051"
      ]
    },
    {
      "xsiType": "MandatSimple_Type",
      "uid": "PM715964",
      "acteurRef": "PA345897",
      "legislature": "14",
      "typeOrgane": "COMPER",
      "dateDebut": "2016-12-09T01:00:00.000+01:00",
      "datePublication": "2016-12-09T01:00:00.000+01:00",
      "dateFin": "2017-01-10T01:00:00.000+01:00",
      "preseance": "32",
      "nominPrincipale": "1",
      "infosQualite": {
        "codeQualite": "Membre",
        "libQualite": "Membre",
        "libQualiteSex": "Membre"
      },
      "organesRefs": [
        "PO420120"
      ]
    },
    {
      "xsiType": "MandatSimple_Type",
      "uid": "PM716302",
      "acteurRef": "PA345897",
      "legislature": "14",
      "typeOrgane": "CMP",
      "dateDebut": "2016-12-20T01:00:00.000+01:00",
      "datePublication": "2016-12-21T01:00:00.000+01:00",
      "dateFin": "2016-12-22T01:00:00.000+01:00",
      "preseance": "28",
      "nominPrincipale": "1",
      "infosQualite": {
        "codeQualite": "Suppléant",
        "libQualite": "Membre suppléant",
        "libQualiteSex": "Membre suppléant"
      },
      "organesRefs": [
        "PO716278"
      ]
    },
    {
      "xsiType": "MandatSimple_Type",
      "uid": "PM716390",
      "acteurRef": "PA345897",
      "legislature": "14",
      "typeOrgane": "COMPER",
      "dateDebut": "2017-01-11T01:00:00.000+01:00",
      "datePublication": "2017-01-11T01:00:00.000+01:00",
      "dateFin": "2017-01-11T01:00:00.000+01:00",
      "preseance": "32",
      "nominPrincipale": "1",
      "infosQualite": {
        "codeQualite": "Membre",
        "libQualite": "Membre",
        "libQualiteSex": "Membre"
      },
      "organesRefs": [
        "PO59051"
      ]
    },
    {
      "xsiType": "MandatSimple_Type",
      "uid": "PM716394",
      "acteurRef": "PA345897",
      "legislature": "14",
      "typeOrgane": "COMPER",
      "dateDebut": "2017-01-12T01:00:00.000+01:00",
      "datePublication": "2017-01-12T01:00:00.000+01:00",
      "dateFin": "2017-06-20T02:00:00.000+02:00",
      "preseance": "32",
      "nominPrincipale": "1",
      "infosQualite": {
        "codeQualite": "Membre",
        "libQualite": "Membre",
        "libQualiteSex": "Membre"
      },
      "organesRefs": [
        "PO420120"
      ]
    },
    {
      "xsiType": "MandatSimple_Type",
      "uid": "PM716411",
      "acteurRef": "PA345897",
      "legislature": "14",
      "typeOrgane": "CMP",
      "dateDebut": "2017-01-12T01:00:00.000+01:00",
      "datePublication": "2017-01-13T01:00:00.000+01:00",
      "dateFin": "2017-01-20T01:00:00.000+01:00",
      "preseance": "28",
      "nominPrincipale": "1",
      "infosQualite": {
        "codeQualite": "Suppléant",
        "libQualite": "Membre suppléant",
        "libQualiteSex": "Membre suppléant"
      },
      "organesRefs": [
        "PO715032"
      ]
    },
    {
      "xsiType": "MandatSimple_Type",
      "uid": "PM716438",
      "acteurRef": "PA345897",
      "legislature": "14",
      "typeOrgane": "CMP",
      "dateDebut": "2017-01-12T01:00:00.000+01:00",
      "datePublication": "2017-01-13T01:00:00.000+01:00",
      "dateFin": "2017-01-20T01:00:00.000+01:00",
      "preseance": "28",
      "nominPrincipale": "1",
      "infosQualite": {
        "codeQualite": "Suppléant",
        "libQualite": "Membre suppléant",
        "libQualiteSex": "Membre suppléant"
      },
      "organesRefs": [
        "PO715554"
      ]
    }
  ]
}