{
  "uid": "PA720822",
  "etatCivil": {
    "ident": {
      "civ": "M.",
      "prenom": "Bruno",
      "nom": "Bilde",
      "alpha": "Bilde",
      "trigramme": "BBI"
    },
    "infoNaissance": {
      "dateNais": "1976-09-22T02:00:00.000+02:00",
      "villeNais": "Laxou",
      "depNais": "Meurthe-et-Moselle",
      "paysNais": "France"
    }
  },
  "profession": {
    "libelleCourant": "Juriste",
    "socProcInsee": {
      "catSocPro": "Professions libérales et assimilés",
      "famSocPro": "Cadres et professions intellectuelles supérieures"
    }
  },
  "uriHatvp": "https://www.hatvp.fr/pages_nominatives/bilde-bruno",
  "adresses": [
    {
      "xsiType": "AdressePostale_Type",
      "uid": "AD720824",
      "type": "0",
      "typeLibelle": "Adresse officielle",
      "poids": "1",
      "intitule": "Assemblée nationale,",
      "numeroRue": "126",
      "nomRue": "Rue de l'Université,",
      "codePostal": "75355",
      "ville": "Paris 07 SP"
    },
    {
      "xsiType": "AdresseMail_Type",
      "uid": "AD728188",
      "type": "15",
      "typeLibelle": "Mèl",
      "valElec": "bruno.bilde@assemblee-nationale.fr"
    },
    {
      "xsiType": "AdressePostale_Type",
      "uid": "AD763098",
      "type": "2",
      "typeLibelle": "Adresse publiée de circonscription",
      "poids": "2",
      "intitule": "Permanence parlementaire",
      "numeroRue": "131 Bis",
      "nomRue": "Rue Jean-Baptiste Défernez",
      "codePostal": "62800",
      "ville": "Liévin"
    }
  ],
  "mandats": [
    {
      "xsiType": "MandatParlementaire_type",
      "uid": "PM723086",
      "acteurRef": "PA720822",
      "legislature": "15",
      "typeOrgane": "ASSEMBLEE",
      "dateDebut": "2017-06-18T02:00:00.000+02:00",
      "preseance": "50",
      "nominPrincipale": "1",
      "infosQualite": {
        "codeQualite": "membre",
        "libQualite": "membre",
        "libQualiteSex": "membre"
      },
      "organesRefs": [
        "PO717460"
      ],
      "suppleant": {
        "dateDebut": "2017-06-18T02:00:00.000+02:00",
        "suppleantRef": "PA720826"
      },
      "election": {
        "lieu": {
          "region": "Hauts-de-France",
          "regionType": "Métropolitain",
          "departement": "Pas-de-Calais",
          "numDepartement": "62",
          "numCirco": "12"
        },
        "causeMandat": "élections générales",
        "refCirconscription": "PO718086"
      },
      "mandature": {
        "datePriseFonction": "2017-06-21T02:00:00.000+02:00",
        "premiereElection": "0",
        "placeHemicycle": "066"
      },
      "collaborateurs": [
        {
          "qualite": "M.",
          "prenom": "Laurent",
          "nom": "Dassonville"
        },
        {
          "qualite": "M.",
          "prenom": "Julien",
          "nom": "Odoul"
        },
        {
          "qualite": "M.",
          "prenom": "Laurent",
          "nom": "Brice"
        },
        {
          "qualite": "M.",
          "prenom": "Louis",
          "nom": "Mompeu"
        }
      ]
    },
    {
      "xsiType": "MandatSimple_Type",
      "uid": "PM724584",
      "acteurRef": "PA720822",
      "legislature": "15",
      "typeOrgane": "GP",
      "dateDebut": "2017-06-21T02:00:00.000+02:00",
      "dateFin": "2017-06-26T02:00:00.000+02:00",
      "preseance": "28",
      "nominPrincipale": "1",
      "infosQualite": {
        "codeQualite": "Député non-inscrit",
        "libQualite": "Député non-inscrit",
        "libQualiteSex": "Député non-inscrit"
      },
      "organesRefs": [
        "PO723569"
      ]
    },
    {
      "xsiType": "MandatSimple_Type",
      "uid": "PM731562",
      "acteurRef": "PA720822",
      "legislature": "15",
      "typeOrgane": "GP",
      "dateDebut": "2017-06-27T02:00:00.000+02:00",
      "preseance": "28",
      "nominPrincipale": "1",
      "infosQualite": {
        "codeQualite": "Député non-inscrit",
        "libQualite": "Député non-inscrit",
        "libQualiteSex": "Député non-inscrit"
      },
      "organesRefs": [
        "PO723569"
      ]
    },
    {
      "xsiType": "MandatSimple_Type",
      "uid": "PM731602",
      "acteurRef": "PA720822",
      "legislature": "15",
      "typeOrgane": "COMPER",
      "dateDebut": "2017-06-29T02:00:00.000+02:00",
      "datePublication": "2017-06-29T02:00:00.000+02:00",
      "dateFin": "2018-09-29T02:00:00.000+02:00",
      "preseance": "32",
      "nominPrincipale": "1",
      "infosQualite": {
        "codeQualite": "Membre",
        "libQualite": "Membre",
        "libQualiteSex": "Membre"
      },
      "organesRefs": [
        "PO420120"
      ]
    },
    {
      "xsiType": "MandatSimple_Type",
      "uid": "PM739512",
      "acteurRef": "PA720822",
      "legislature": "15",
      "typeOrgane": "GA",
      "dateDebut": "2017-10-12T02:00:00.000+02:00",
      "preseance": "20",
      "nominPrincipale": "1",
      "infosQualite": {
        "codeQualite": "Membre",
        "libQualite": "Membre",
        "libQualiteSex": "Membre"
      },
      "organesRefs": [
        "PO732919"
      ]
    },
    {
      "xsiType": "MandatSimple_Type",
      "uid": "PM739513",
      "acteurRef": "PA720822",
      "legislature": "15",
      "typeOrgane": "GA",
      "dateDebut": "2017-10-12T02:00:00.000+02:00",
      "preseance": "20",
      "nominPrincipale": "1",
      "infosQualite": {
        "codeQualite": "Membre",
        "libQualite": "Membre",
        "libQualiteSex": "Membre"
      },
      "organesRefs": [
        "PO733182"
      ]
    },
    {
      "xsiType": "MandatSimple_Type",
      "uid": "PM739514",
      "acteurRef": "PA720822",
      "legislature": "15",
      "typeOrgane": "GA",
      "dateDebut": "2017-10-12T02:00:00.000+02:00",
      "preseance": "20",
      "nominPrincipale": "1",
      "infosQualite": {
        "codeQualite": "Membre",
        "libQualite": "Membre",
        "libQualiteSex": "Membre"
      },
      "organesRefs": [
        "PO733567"
      ]
    },
    {
      "xsiType": "MandatSimple_Type",
      "uid": "PM739515",
      "acteurRef": "PA720822",
      "legislature": "15",
      "typeOrgane": "GA",
      "dateDebut": "2017-10-12T02:00:00.000+02:00",
      "preseance": "20",
      "nominPrincipale": "1",
      "infosQualite": {
        "codeQualite": "Membre",
        "libQualite": "Membre",
        "libQualiteSex": "Membre"
      },
      "organesRefs": [
        "PO733572"
      ]
    },
    {
      "xsiType": "MandatSimple_Type",
      "uid": "PM745533",
      "acteurRef": "PA720822",
      "typeOrgane": "PARPOL",
      "dateDebut": "2017-12-01T01:00:00.000+01:00",
      "dateFin": "2018-11-30T01:00:00.000+01:00",
      "preseance": "5",
      "nominPrincipale": "1",
      "infosQualite": {
        "codeQualite": "Membre",
        "libQualite": "Membre",
        "libQualiteSex": "Membre"
      },
      "organesRefs": [
        "PO684946"
      ]
    },
    {
      "xsiType": "MandatSimple_Type",
      "uid": "PM747983",
      "acteurRef": "PA720822",
      "legislature": "15",
      "typeOrgane": "ORGEXTPARL",
      "dateDebut": "2018-01-10T01:00:00.000+01:00",
      "datePublication": "2018-01-11T01:00:00.000+01:00",
      "preseance": "20",
      "nominPrincipale": "1",
      "infosQualite": {
        "codeQualite": "Titulaire",
        "libQualite": "Membre titulaire",
        "libQualiteSex": "Membre titulaire"
      },
      "organesRefs": [
        "PO717436"
      ]
    },
    {
      "xsiType": "MandatSimple_Type",
      "uid": "PM757009",
      "acteurRef": "PA720822",
      "legislature": "15",
      "typeOrgane": "ORGEXTPARL",
      "dateDebut": "2018-03-08T01:00:00.000+01:00",
      "datePublication": "2018-03-09T01:00:00.000+01:00",
      "preseance": "20",
      "nominPrincipale": "1",
      "infosQualite": {
        "codeQualite": "Titulaire",
        "libQualite": "Membre titulaire",
        "libQualiteSex": "Membre titulaire"
      },
      "organesRefs": [
        "PO756933"
      ]
    },
    {
      "xsiType": "MandatSimple_Type",
      "uid": "PM759133",
      "acteurRef": "PA720822",
      "legislature": "15",
      "typeOrgane": "COMPER",
      "dateDebut": "2018-09-30T02:00:00.000+02:00",
      "datePublication": "2018-09-30T02:00:00.000+02:00",
      "preseance": "32",
      "nominPrincipale": "1",
      "infosQualite": {
        "codeQualite": "Membre",
        "libQualite": "Membre",
        "libQualiteSex": "Membre"
      },
      "organesRefs": [
        "PO419604"
      ]
    },
    {
      "xsiType": "MandatSimple_Type",
      "uid": "PM760483",
      "acteurRef": "PA720822",
      "legislature": "15",
      "typeOrgane": "CNPS",
      "dateDebut": "2018-11-20T01:00:00.000+01:00",
      "datePublication": "2018-11-22T01:00:00.000+01:00",
      "dateFin": "2019-01-17T01:00:00.000+01:00",
      "preseance": "20",
      "nominPrincipale": "1",
      "infosQualite": {
        "codeQualite": "Membre",
        "libQualite": "Membre",
        "libQualiteSex": "Membre"
      },
      "organesRefs": [
        "PO760148"
      ]
    },
    {
      "xsiType": "MandatSimple_Type",
      "uid": "PM761289",
      "acteurRef": "PA720822",
      "typeOrgane": "PARPOL",
      "dateDebut": "2018-12-01T01:00:00.000+01:00",
      "preseance": "5",
      "nominPrincipale": "1",
      "infosQualite": {
        "codeQualite": "Membre",
        "libQualite": "Membre",
        "libQualiteSex": "Membre"
      },
      "organesRefs": [
        "PO761239"
      ]
    }
  ]
}