{
  "uid": "PA632",
  "etatCivil": {
    "ident": {
      "civ": "Mme",
      "prenom": "Christine",
      "nom": "Boutin",
      "alpha": "Boutin"
    },
    "infoNaissance": {
      "dateNais": "1944-02-06T01:00:00.000+01:00",
      "villeNais": "Levroux",
      "depNais": "Indre"
    }
  },
  "profession": {
    "libelleCourant": "Journaliste",
    "socProcInsee": {
      "catSocPro": "Cadres de la fonction publique, professions intellectuelles et  artistiques",
      "famSocPro": "Cadres et professions intellectuelles supérieures"
    }
  },
  "adresses": [
    {
      "xsiType": "AdressePostale_Type",
      "uid": "AD387024",
      "type": "0",
      "typeLibelle": "Adresse officielle",
      "poids": "1",
      "intitule": "Assemblée nationale,",
      "numeroRue": "126",
      "nomRue": "Rue de l'Université,",
      "codePostal": "75355",
      "ville": "Paris 07 SP"
    },
    {
      "xsiType": "AdresseMail_Type",
      "uid": "AD391672",
      "type": "15",
      "typeLibelle": "Mèl",
      "valElec": "cboutin@assemblee-nationale.fr"
    }
  ],
  "mandats": [
    {
      "xsiType": "MandatParlementaire_type",
      "uid": "PM267617",
      "acteurRef": "PA632",
      "legislature": "12",
      "typeOrgane": "ASSEMBLEE",
      "dateDebut": "2002-06-19T02:00:00.000+02:00",
      "dateFin": "2007-06-19T02:00:00.000+02:00",
      "preseance": "50",
      "nominPrincipale": "1",
      "infosQualite": {
        "codeQualite": "membre",
        "libQualite": "membre",
        "libQualiteSex": "membre"
      },
      "organesRefs": [
        "PO230434"
      ],
      "suppleant": {
        "dateDebut": "2002-06-19T02:00:00.000+02:00",
        "dateFin": "2007-06-19T02:00:00.000+02:00",
        "suppleantRef": "PA2352"
      },
      "election": {
        "lieu": {
          "region": "Ile-de-France",
          "regionType": "Métropolitain",
          "departement": "Yvelines",
          "numDepartement": "78",
          "numCirco": "10"
        },
        "causeMandat": "élections générales",
        "refCirconscription": "PO230881"
      },
      "mandature": {
        "datePriseFonction": "2002-06-19T02:00:00.000+02:00",
        "causeFin": "Fin de législature",
        "premiereElection": "1"
      }
    },
    {
      "xsiType": "MandatSimple_Type",
      "uid": "PM271001",
      "acteurRef": "PA632",
      "legislature": "12",
      "typeOrgane": "GP",
      "dateDebut": "2002-06-25T02:00:00.000+02:00",
      "datePublication": "2002-06-26T02:00:00.000+02:00",
      "dateFin": "2007-06-19T02:00:00.000+02:00",
      "preseance": "20",
      "nominPrincipale": "1",
      "infosQualite": {
        "codeQualite": "Membre",
        "libQualite": "Membre du",
        "libQualiteSex": "Membre du"
      },
      "organesRefs": [
        "PO270903"
      ]
    },
    {
      "xsiType": "MandatSimple_Type",
      "uid": "PM271715",
      "acteurRef": "PA632",
      "legislature": "12",
      "typeOrgane": "COMPER",
      "dateDebut": "2002-06-26T02:00:00.000+02:00",
      "datePublication": "2002-06-27T02:00:00.000+02:00",
      "dateFin": "2007-06-19T02:00:00.000+02:00",
      "preseance": "32",
      "nominPrincipale": "1",
      "infosQualite": {
        "codeQualite": "Membre",
        "libQualite": "Membre",
        "libQualiteSex": "Membre"
      },
      "organesRefs": [
        "PO59045"
      ]
    },
    {
      "xsiType": "MandatSimple_Type",
      "uid": "PM274010",
      "acteurRef": "PA632",
      "legislature": "12",
      "typeOrgane": "API",
      "dateDebut": "2002-07-20T02:00:00.000+02:00",
      "datePublication": "2002-07-20T02:00:00.000+02:00",
      "dateFin": "2007-06-19T02:00:00.000+02:00",
      "preseance": "20",
      "nominPrincipale": "1",
      "infosQualite": {
        "codeQualite": "Titulaire",
        "libQualite": "Membre titulaire",
        "libQualiteSex": "Membre titulaire"
      },
      "organesRefs": [
        "PO58974"
      ]
    },
    {
      "xsiType": "MandatSimple_Type",
      "uid": "PM274991",
      "acteurRef": "PA632",
      "legislature": "12",
      "typeOrgane": "ORGEXTPARL",
      "dateDebut": "2002-09-03T02:00:00.000+02:00",
      "datePublication": "2002-09-05T02:00:00.000+02:00",
      "dateFin": "2007-06-19T02:00:00.000+02:00",
      "preseance": "20",
      "nominPrincipale": "1",
      "infosQualite": {
        "codeQualite": "Titulaire",
        "libQualite": "Membre titulaire",
        "libQualiteSex": "Membre titulaire"
      },
      "organesRefs": [
        "PO60227"
      ]
    },
    {
      "xsiType": "MandatSimple_Type",
      "uid": "PM280024",
      "acteurRef": "PA632",
      "legislature": "12",
      "typeOrgane": "GA",
      "dateDebut": "2002-10-31T01:00:00.000+01:00",
      "dateFin": "2007-06-19T02:00:00.000+02:00",
      "preseance": "20",
      "nominPrincipale": "1",
      "infosQualite": {
        "codeQualite": "Membre",
        "libQualite": "Membre",
        "libQualiteSex": "Membre"
      },
      "organesRefs": [
        "PO274050"
      ]
    },
    {
      "xsiType": "MandatSimple_Type",
      "uid": "PM280025",
      "acteurRef": "PA632",
      "legislature": "12",
      "typeOrgane": "GA",
      "dateDebut": "2002-10-31T01:00:00.000+01:00",
      "dateFin": "2007-06-19T02:00:00.000+02:00",
      "preseance": "20",
      "nominPrincipale": "1",
      "infosQualite": {
        "codeQualite": "Membre",
        "libQualite": "Membre",
        "libQualiteSex": "Membre"
      },
      "organesRefs": [
        "PO274078"
      ]
    },
    {
      "xsiType": "MandatSimple_Type",
      "uid": "PM280026",
      "acteurRef": "PA632",
      "legislature": "12",
      "typeOrgane": "GA",
      "dateDebut": "2002-10-31T01:00:00.000+01:00",
      "dateFin": "2007-06-19T02:00:00.000+02:00",
      "preseance": "20",
      "nominPrincipale": "1",
      "infosQualite": {
        "codeQualite": "Membre",
        "libQualite": "Membre",
        "libQualiteSex": "Membre"
      },
      "organesRefs": [
        "PO274181"
      ]
    },
    {
      "xsiType": "MandatSimple_Type",
      "uid": "PM280027",
      "acteurRef": "PA632",
      "legislature": "12",
      "typeOrgane": "GEVI",
      "dateDebut": "2002-10-31T01:00:00.000+01:00",
      "dateFin": "2007-06-19T02:00:00.000+02:00",
      "preseance": "20",
      "nominPrincipale": "1",
      "infosQualite": {
        "codeQualite": "Membre",
        "libQualite": "Membre",
        "libQualiteSex": "Membre"
      },
      "organesRefs": [
        "PO274049"
      ]
    },
    {
      "xsiType": "MandatSimple_Type",
      "uid": "PM280028",
      "acteurRef": "PA632",
      "legislature": "12",
      "typeOrgane": "GA",
      "dateDebut": "2002-10-31T01:00:00.000+01:00",
      "dateFin": "2007-06-19T02:00:00.000+02:00",
      "preseance": "20",
      "nominPrincipale": "1",
      "infosQualite": {
        "codeQualite": "Membre",
        "libQualite": "Membre",
        "libQualiteSex": "Membre"
      },
      "organesRefs": [
        "PO274054"
      ]
    },
    {
      "xsiType": "MandatSimple_Type",
      "uid": "PM280029",
      "acteurRef": "PA632",
      "legislature": "12",
      "typeOrgane": "GA",
      "dateDebut": "2002-10-31T01:00:00.000+01:00",
      "dateFin": "2007-06-19T02:00:00.000+02:00",
      "preseance": "20",
      "nominPrincipale": "1",
      "infosQualite": {
        "codeQualite": "Membre",
        "libQualite": "Membre",
        "libQualiteSex": "Membre"
      },
      "organesRefs": [
        "PO274171"
      ]
    },
    {
      "xsiType": "MandatSimple_Type",
      "uid": "PM280030",
      "acteurRef": "PA632",
      "legislature": "12",
      "typeOrgane": "GA",
      "dateDebut": "2002-10-31T01:00:00.000+01:00",
      "dateFin": "2007-06-19T02:00:00.000+02:00",
      "preseance": "20",
      "nominPrincipale": "1",
      "infosQualite": {
        "codeQualite": "Membre",
        "libQualite": "Membre",
        "libQualiteSex": "Membre"
      },
      "organesRefs": [
        "PO274161"
      ]
    },
    {
      "xsiType": "MandatSimple_Type",
      "uid": "PM280031",
      "acteurRef": "PA632",
      "legislature": "12",
      "typeOrgane": "GA",
      "dateDebut": "2002-10-31T01:00:00.000+01:00",
      "dateFin": "2007-06-19T02:00:00.000+02:00",
      "preseance": "20",
      "nominPrincipale": "1",
      "infosQualite": {
        "codeQualite": "Membre",
        "libQualite": "Membre",
        "libQualiteSex": "Membre"
      },
      "organesRefs": [
        "PO274136"
      ]
    },
    {
      "xsiType": "MandatSimple_Type",
      "uid": "PM280032",
      "acteurRef": "PA632",
      "legislature": "12",
      "typeOrgane": "GA",
      "dateDebut": "2002-10-31T01:00:00.000+01:00",
      "dateFin": "2007-06-19T02:00:00.000+02:00",
      "preseance": "20",
      "nominPrincipale": "1",
      "infosQualite": {
        "codeQualite": "Membre",
        "libQualite": "Membre",
        "libQualiteSex": "Membre"
      },
      "organesRefs": [
        "PO274185"
      ]
    },
    {
      "xsiType": "MandatSimple_Type",
      "uid": "PM280033",
      "acteurRef": "PA632",
      "legislature": "12",
      "typeOrgane": "GA",
      "dateDebut": "2002-10-31T01:00:00.000+01:00",
      "dateFin": "2007-06-19T02:00:00.000+02:00",
      "preseance": "20",
      "nominPrincipale": "1",
      "infosQualite": {
        "codeQualite": "Membre",
        "libQualite": "Membre",
        "libQualiteSex": "Membre"
      },
      "organesRefs": [
        "PO274192"
      ]
    },
    {
      "xsiType": "MandatSimple_Type",
      "uid": "PM280034",
      "acteurRef": "PA632",
      "legislature": "12",
      "typeOrgane": "GA",
      "dateDebut": "2002-10-31T01:00:00.000+01:00",
      "dateFin": "2007-06-19T02:00:00.000+02:00",
      "preseance": "20",
      "nominPrincipale": "1",
      "infosQualite": {
        "codeQualite": "Membre",
        "libQualite": "Membre",
        "libQualiteSex": "Membre"
      },
      "organesRefs": [
        "PO274157"
      ]
    },
    {
      "xsiType": "MandatSimple_Type",
      "uid": "PM280035",
      "acteurRef": "PA632",
      "legislature": "12",
      "typeOrgane": "GA",
      "dateDebut": "2002-10-31T01:00:00.000+01:00",
      "dateFin": "2007-06-19T02:00:00.000+02:00",
      "preseance": "20",
      "nominPrincipale": "1",
      "infosQualite": {
        "codeQualite": "Membre",
        "libQualite": "Membre",
        "libQualiteSex": "Membre"
      },
      "organesRefs": [
        "PO274093"
      ]
    },
    {
      "xsiType": "MandatSimple_Type",
      "uid": "PM280036",
      "acteurRef": "PA632",
      "legislature": "12",
      "typeOrgane": "GA",
      "dateDebut": "2002-10-31T01:00:00.000+01:00",
      "dateFin": "2007-06-19T02:00:00.000+02:00",
      "preseance": "20",
      "nominPrincipale": "1",
      "infosQualite": {
        "codeQualite": "Membre",
        "libQualite": "Membre",
        "libQualiteSex": "Membre"
      },
      "organesRefs": [
        "PO274200"
      ]
    },
    {
      "xsiType": "MandatSimple_Type",
      "uid": "PM280038",
      "acteurRef": "PA632",
      "legislature": "12",
      "typeOrgane": "GA",
      "dateDebut": "2002-10-31T01:00:00.000+01:00",
      "dateFin": "2007-06-19T02:00:00.000+02:00",
      "preseance": "20",
      "nominPrincipale": "1",
      "infosQualite": {
        "codeQualite": "Membre",
        "libQualite": "Membre",
        "libQualiteSex": "Membre"
      },
      "organesRefs": [
        "PO274156"
      ]
    },
    {
      "xsiType": "MandatSimple_Type",
      "uid": "PM280040",
      "acteurRef": "PA632",
      "legislature": "12",
      "typeOrgane": "GA",
      "dateDebut": "2002-10-31T01:00:00.000+01:00",
      "dateFin": "2007-06-19T02:00:00.000+02:00",
      "preseance": "20",
      "nominPrincipale": "1",
      "infosQualite": {
        "codeQualite": "Membre",
        "libQualite": "Membre",
        "libQualiteSex": "Membre"
      },
      "organesRefs": [
        "PO274119"
      ]
    },
    {
      "xsiType": "MandatSimple_Type",
      "uid": "PM280042",
      "acteurRef": "PA632",
      "legislature": "12",
      "typeOrgane": "GA",
      "dateDebut": "2002-10-31T01:00:00.000+01:00",
      "dateFin": "2007-06-19T02:00:00.000+02:00",
      "preseance": "20",
      "nominPrincipale": "1",
      "infosQualite": {
        "codeQualite": "Membre",
        "libQualite": "Membre",
        "libQualiteSex": "Membre"
      },
      "organesRefs": [
        "PO274111"
      ]
    },
    {
      "xsiType": "MandatSimple_Type",
      "uid": "PM280043",
      "acteurRef": "PA632",
      "legislature": "12",
      "typeOrgane": "GA",
      "dateDebut": "2002-10-31T01:00:00.000+01:00",
      "dateFin": "2007-06-19T02:00:00.000+02:00",
      "preseance": "20",
      "nominPrincipale": "1",
      "infosQualite": {
        "codeQualite": "Membre",
        "libQualite": "Membre",
        "libQualiteSex": "Membre"
      },
      "organesRefs": [
        "PO274167"
      ]
    },
    {
      "xsiType": "MandatSimple_Type",
      "uid": "PM283179",
      "acteurRef": "PA632",
      "legislature": "12",
      "typeOrgane": "GA",
      "dateDebut": "2002-11-20T01:00:00.000+01:00",
      "dateFin": "2007-06-19T02:00:00.000+02:00",
      "preseance": "20",
      "nominPrincipale": "1",
      "infosQualite": {
        "codeQualite": "Membre",
        "libQualite": "Membre",
        "libQualiteSex": "Membre"
      },
      "organesRefs": [
        "PO274194"
      ]
    },
    {
      "xsiType": "MandatSimple_Type",
      "uid": "PM285716",
      "acteurRef": "PA632",
      "legislature": "12",
      "typeOrgane": "GE",
      "dateDebut": "2002-12-10T01:00:00.000+01:00",
      "dateFin": "2007-06-19T02:00:00.000+02:00",
      "preseance": "20",
      "nominPrincipale": "1",
      "infosQualite": {
        "codeQualite": "Membre",
        "libQualite": "Membre",
        "libQualiteSex": "Membre"
      },
      "organesRefs": [
        "PO285043"
      ]
    },
    {
      "xsiType": "MandatSimple_Type",
      "uid": "PM286431",
      "acteurRef": "PA632",
      "legislature": "12",
      "typeOrgane": "GE",
      "dateDebut": "2002-12-18T01:00:00.000+01:00",
      "dateFin": "2007-06-19T02:00:00.000+02:00",
      "preseance": "20",
      "nominPrincipale": "1",
      "infosQualite": {
        "codeQualite": "Membre",
        "libQualite": "Membre",
        "libQualiteSex": "Membre"
      },
      "organesRefs": [
        "PO285047"
      ]
    },
    {
      "xsiType": "MandatSimple_Type",
      "uid": "PM286787",
      "acteurRef": "PA632",
      "legislature": "12",
      "typeOrgane": "GA",
      "dateDebut": "2002-12-11T01:00:00.000+01:00",
      "dateFin": "2007-06-19T02:00:00.000+02:00",
      "preseance": "8",
      "nominPrincipale": "1",
      "infosQualite": {
        "codeQualite": "Vice-Président",
        "libQualite": "Vice-Président",
        "libQualiteSex": "Vice-Présidente"
      },
      "organesRefs": [
        "PO274200"
      ]
    },
    {
      "xsiType": "MandatSimple_Type",
      "uid": "PM287021",
      "acteurRef": "PA632",
      "legislature": "12",
      "typeOrgane": "GE",
      "dateDebut": "2002-12-13T01:00:00.000+01:00",
      "dateFin": "2007-06-19T02:00:00.000+02:00",
      "preseance": "20",
      "nominPrincipale": "1",
      "infosQualite": {
        "codeQualite": "Membre",
        "libQualite": "Membre",
        "libQualiteSex": "Membre"
      },
      "organesRefs": [
        "PO285068"
      ]
    },
    {
      "xsiType": "MandatSimple_Type",
      "uid": "PM287602",
      "acteurRef": "PA632",
      "legislature": "12",
      "typeOrgane": "GE",
      "dateDebut": "2002-12-20T01:00:00.000+01:00",
      "dateFin": "2007-06-19T02:00:00.000+02:00",
      "preseance": "20",
      "nominPrincipale": "1",
      "infosQualite": {
        "codeQualite": "Membre",
        "libQualite": "Membre",
        "libQualiteSex": "Membre"
      },
      "organesRefs": [
        "PO287326"
      ]
    },
    {
      "xsiType": "MandatSimple_Type",
      "uid": "PM287681",
      "acteurRef": "PA632",
      "legislature": "12",
      "typeOrgane": "GE",
      "dateDebut": "2002-12-03T01:00:00.000+01:00",
      "dateFin": "2007-06-19T02:00:00.000+02:00",
      "preseance": "20",
      "nominPrincipale": "1",
      "infosQualite": {
        "codeQualite": "Membre",
        "libQualite": "Membre",
        "libQualiteSex": "Membre"
      },
      "organesRefs": [
        "PO285103"
      ]
    },
    {
      "xsiType": "MandatSimple_Type",
      "uid": "PM288100",
      "acteurRef": "PA632",
      "legislature": "12",
      "typeOrgane": "GA",
      "dateDebut": "2002-12-18T01:00:00.000+01:00",
      "dateFin": "2007-06-19T02:00:00.000+02:00",
      "preseance": "8",
      "nominPrincipale": "1",
      "infosQualite": {
        "codeQualite": "Vice-Président",
        "libQualite": "Vice-Président",
        "libQualiteSex": "Vice-Présidente"
      },
      "organesRefs": [
        "PO274192"
      ]
    },
    {
      "xsiType": "MandatSimple_Type",
      "uid": "PM288648",
      "acteurRef": "PA632",
      "legislature": "12",
      "typeOrgane": "GE",
      "dateDebut": "2003-01-29T01:00:00.000+01:00",
      "dateFin": "2007-06-19T02:00:00.000+02:00",
      "preseance": "20",
      "nominPrincipale": "1",
      "infosQualite": {
        "codeQualite": "Membre",
        "libQualite": "Membre",
        "libQualiteSex": "Membre"
      },
      "organesRefs": [
        "PO285117"
      ]
    },
    {
      "xsiType": "MandatSimple_Type",
      "uid": "PM288867",
      "acteurRef": "PA632",
      "legislature": "12",
      "typeOrgane": "GE",
      "dateDebut": "2003-01-21T01:00:00.000+01:00",
      "dateFin": "2007-06-19T02:00:00.000+02:00",
      "preseance": "8",
      "nominPrincipale": "1",
      "infosQualite": {
        "codeQualite": "Vice-Président",
        "libQualite": "Vice-Président",
        "libQualiteSex": "Vice-Présidente"
      },
      "organesRefs": [
        "PO287326"
      ]
    },
    {
      "xsiType": "MandatSimple_Type",
      "uid": "PM289832",
      "acteurRef": "PA632",
      "legislature": "12",
      "typeOrgane": "GE",
      "dateDebut": "2003-02-04T01:00:00.000+01:00",
      "dateFin": "2007-06-19T02:00:00.000+02:00",
      "preseance": "20",
      "nominPrincipale": "1",
      "infosQualite": {
        "codeQualite": "Membre",
        "libQualite": "Membre",
        "libQualiteSex": "Membre"
      },
      "organesRefs": [
        "PO285064"
      ]
    },
    {
      "xsiType": "MandatSimple_Type",
      "uid": "PM290351",
      "acteurRef": "PA632",
      "legislature": "12",
      "typeOrgane": "GE",
      "dateDebut": "2003-02-28T01:00:00.000+01:00",
      "dateFin": "2007-06-19T02:00:00.000+02:00",
      "preseance": "20",
      "nominPrincipale": "1",
      "infosQualite": {
        "codeQualite": "Membre",
        "libQualite": "Membre",
        "libQualiteSex": "Membre"
      },
      "organesRefs": [
        "PO285059"
      ]
    },
    {
      "xsiType": "MandatSimple_Type",
      "uid": "PM290705",
      "acteurRef": "PA632",
      "legislature": "12",
      "typeOrgane": "GE",
      "dateDebut": "2003-02-26T01:00:00.000+01:00",
      "dateFin": "2007-06-19T02:00:00.000+02:00",
      "preseance": "20",
      "nominPrincipale": "1",
      "infosQualite": {
        "codeQualite": "Membre",
        "libQualite": "Membre",
        "libQualiteSex": "Membre"
      },
      "organesRefs": [
        "PO285073"
      ]
    },
    {
      "xsiType": "MandatSimple_Type",
      "uid": "PM290853",
      "acteurRef": "PA632",
      "legislature": "12",
      "typeOrgane": "GE",
      "dateDebut": "2003-01-21T01:00:00.000+01:00",
      "dateFin": "2007-06-19T02:00:00.000+02:00",
      "preseance": "8",
      "nominPrincipale": "1",
      "infosQualite": {
        "codeQualite": "Vice-Président",
        "libQualite": "Vice-Président",
        "libQualiteSex": "Vice-Présidente"
      },
      "organesRefs": [
        "PO285068"
      ]
    },
    {
      "xsiType": "MandatSimple_Type",
      "uid": "PM292164",
      "acteurRef": "PA632",
      "legislature": "12",
      "typeOrgane": "GE",
      "dateDebut": "2003-01-29T01:00:00.000+01:00",
      "dateFin": "2007-06-19T02:00:00.000+02:00",
      "preseance": "20",
      "nominPrincipale": "1",
      "infosQualite": {
        "codeQualite": "Membre",
        "libQualite": "Membre",
        "libQualiteSex": "Membre"
      },
      "organesRefs": [
        "PO289713"
      ]
    },
    {
      "xsiType": "MandatSimple_Type",
      "uid": "PM293329",
      "acteurRef": "PA632",
      "legislature": "12",
      "typeOrgane": "GA",
      "dateDebut": "2002-12-18T01:00:00.000+01:00",
      "dateFin": "2007-06-19T02:00:00.000+02:00",
      "preseance": "8",
      "nominPrincipale": "1",
      "infosQualite": {
        "codeQualite": "Vice-Président",
        "libQualite": "Vice-Président",
        "libQualiteSex": "Vice-Présidente"
      },
      "organesRefs": [
        "PO274078"
      ]
    },
    {
      "xsiType": "MandatSimple_Type",
      "uid": "PM293601",
      "acteurRef": "PA632",
      "legislature": "12",
      "typeOrgane": "GE",
      "dateDebut": "2002-10-26T02:00:00.000+02:00",
      "dateFin": "2007-06-19T02:00:00.000+02:00",
      "preseance": "20",
      "nominPrincipale": "1",
      "infosQualite": {
        "codeQualite": "Membre",
        "libQualite": "Membre",
        "libQualiteSex": "Membre"
      },
      "organesRefs": [
        "PO285132"
      ]
    },
    {
      "xsiType": "MandatSimple_Type",
      "uid": "PM294010",
      "acteurRef": "PA632",
      "legislature": "12",
      "typeOrgane": "GE",
      "dateDebut": "2003-03-27T01:00:00.000+01:00",
      "dateFin": "2007-06-19T02:00:00.000+02:00",
      "preseance": "20",
      "nominPrincipale": "1",
      "infosQualite": {
        "codeQualite": "Membre",
        "libQualite": "Membre",
        "libQualiteSex": "Membre"
      },
      "organesRefs": [
        "PO285081"
      ]
    },
    {
      "xsiType": "MandatSimple_Type",
      "uid": "PM295289",
      "acteurRef": "PA632",
      "legislature": "12",
      "typeOrgane": "GE",
      "dateDebut": "2002-11-27T01:00:00.000+01:00",
      "dateFin": "2007-06-19T02:00:00.000+02:00",
      "preseance": "20",
      "nominPrincipale": "1",
      "infosQualite": {
        "codeQualite": "Membre",
        "libQualite": "Membre",
        "libQualiteSex": "Membre"
      },
      "organesRefs": [
        "PO285082"
      ]
    },
    {
      "xsiType": "MandatSimple_Type",
      "uid": "PM295600",
      "acteurRef": "PA632",
      "legislature": "12",
      "typeOrgane": "GE",
      "dateDebut": "2003-02-05T01:00:00.000+01:00",
      "dateFin": "2007-06-19T02:00:00.000+02:00",
      "preseance": "20",
      "nominPrincipale": "1",
      "infosQualite": {
        "codeQualite": "Membre",
        "libQualite": "Membre",
        "libQualiteSex": "Membre"
      },
      "organesRefs": [
        "PO285054"
      ]
    },
    {
      "xsiType": "MandatSimple_Type",
      "uid": "PM295721",
      "acteurRef": "PA632",
      "legislature": "12",
      "typeOrgane": "GE",
      "dateDebut": "2002-12-16T01:00:00.000+01:00",
      "dateFin": "2007-06-19T02:00:00.000+02:00",
      "preseance": "20",
      "nominPrincipale": "1",
      "infosQualite": {
        "codeQualite": "Membre",
        "libQualite": "Membre",
        "libQualiteSex": "Membre"
      },
      "organesRefs": [
        "PO285072"
      ]
    },
    {
      "xsiType": "MandatSimple_Type",
      "uid": "PM296311",
      "acteurRef": "PA632",
      "legislature": "12",
      "typeOrgane": "GE",
      "dateDebut": "2003-06-14T02:00:00.000+02:00",
      "dateFin": "2007-06-19T02:00:00.000+02:00",
      "preseance": "20",
      "nominPrincipale": "1",
      "infosQualite": {
        "codeQualite": "Membre",
        "libQualite": "Membre",
        "libQualiteSex": "Membre"
      },
      "organesRefs": [
        "PO293177"
      ]
    },
    {
      "xsiType": "MandatSimple_Type",
      "uid": "PM296879",
      "acteurRef": "PA632",
      "legislature": "12",
      "typeOrgane": "GE",
      "dateDebut": "2003-09-16T02:00:00.000+02:00",
      "dateFin": "2007-06-19T02:00:00.000+02:00",
      "preseance": "20",
      "nominPrincipale": "1",
      "infosQualite": {
        "codeQualite": "Membre",
        "libQualite": "Membre",
        "libQualiteSex": "Membre"
      },
      "organesRefs": [
        "PO292868"
      ]
    },
    {
      "xsiType": "MandatSimple_Type",
      "uid": "PM297145",
      "acteurRef": "PA632",
      "legislature": "12",
      "typeOrgane": "GE",
      "dateDebut": "2002-12-14T01:00:00.000+01:00",
      "dateFin": "2007-06-19T02:00:00.000+02:00",
      "preseance": "20",
      "nominPrincipale": "1",
      "infosQualite": {
        "codeQualite": "Membre",
        "libQualite": "Membre",
        "libQualiteSex": "Membre"
      },
      "organesRefs": [
        "PO285135"
      ]
    },
    {
      "xsiType": "MandatSimple_Type",
      "uid": "PM297235",
      "acteurRef": "PA632",
      "legislature": "12",
      "typeOrgane": "GE",
      "dateDebut": "2002-12-14T01:00:00.000+01:00",
      "dateFin": "2007-06-19T02:00:00.000+02:00",
      "preseance": "20",
      "nominPrincipale": "1",
      "infosQualite": {
        "codeQualite": "Membre",
        "libQualite": "Membre",
        "libQualiteSex": "Membre"
      },
      "organesRefs": [
        "PO285050"
      ]
    },
    {
      "xsiType": "MandatSimple_Type",
      "uid": "PM297755",
      "acteurRef": "PA632",
      "legislature": "12",
      "typeOrgane": "GE",
      "dateDebut": "2003-02-04T01:00:00.000+01:00",
      "dateFin": "2007-06-19T02:00:00.000+02:00",
      "preseance": "20",
      "nominPrincipale": "1",
      "infosQualite": {
        "codeQualite": "Membre",
        "libQualite": "Membre",
        "libQualiteSex": "Membre"
      },
      "organesRefs": [
        "PO287435"
      ]
    },
    {
      "xsiType": "MandatSimple_Type",
      "uid": "PM297951",
      "acteurRef": "PA632",
      "legislature": "12",
      "typeOrgane": "GE",
      "dateDebut": "2002-11-27T01:00:00.000+01:00",
      "dateFin": "2007-06-19T02:00:00.000+02:00",
      "preseance": "20",
      "nominPrincipale": "1",
      "infosQualite": {
        "codeQualite": "Membre",
        "libQualite": "Membre",
        "libQualiteSex": "Membre"
      },
      "organesRefs": [
        "PO285109"
      ]
    },
    {
      "xsiType": "MandatSimple_Type",
      "uid": "PM298074",
      "acteurRef": "PA632",
      "legislature": "12",
      "typeOrgane": "GE",
      "dateDebut": "2003-01-06T01:00:00.000+01:00",
      "dateFin": "2007-06-19T02:00:00.000+02:00",
      "preseance": "20",
      "nominPrincipale": "1",
      "infosQualite": {
        "codeQualite": "Membre",
        "libQualite": "Membre",
        "libQualiteSex": "Membre"
      },
      "organesRefs": [
        "PO285042"
      ]
    },
    {
      "xsiType": "MandatSimple_Type",
      "uid": "PM298185",
      "acteurRef": "PA632",
      "legislature": "12",
      "typeOrgane": "GE",
      "dateDebut": "2002-12-17T01:00:00.000+01:00",
      "dateFin": "2007-06-19T02:00:00.000+02:00",
      "preseance": "20",
      "nominPrincipale": "1",
      "infosQualite": {
        "codeQualite": "Membre",
        "libQualite": "Membre",
        "libQualiteSex": "Membre"
      },
      "organesRefs": [
        "PO285079"
      ]
    },
    {
      "xsiType": "MandatSimple_Type",
      "uid": "PM298237",
      "acteurRef": "PA632",
      "legislature": "12",
      "typeOrgane": "GE",
      "dateDebut": "2003-01-15T01:00:00.000+01:00",
      "dateFin": "2007-06-19T02:00:00.000+02:00",
      "preseance": "20",
      "nominPrincipale": "1",
      "infosQualite": {
        "codeQualite": "Membre",
        "libQualite": "Membre",
        "libQualiteSex": "Membre"
      },
      "organesRefs": [
        "PO285084"
      ]
    },
    {
      "xsiType": "MandatSimple_Type",
      "uid": "PM299856",
      "acteurRef": "PA632",
      "legislature": "12",
      "typeOrgane": "GE",
      "dateDebut": "2003-03-11T01:00:00.000+01:00",
      "dateFin": "2007-06-19T02:00:00.000+02:00",
      "preseance": "20",
      "nominPrincipale": "1",
      "infosQualite": {
        "codeQualite": "Membre",
        "libQualite": "Membre",
        "libQualiteSex": "Membre"
      },
      "organesRefs": [
        "PO287425"
      ]
    },
    {
      "xsiType": "MandatSimple_Type",
      "uid": "PM299941",
      "acteurRef": "PA632",
      "legislature": "12",
      "typeOrgane": "GE",
      "dateDebut": "2002-11-28T01:00:00.000+01:00",
      "dateFin": "2007-06-19T02:00:00.000+02:00",
      "preseance": "20",
      "nominPrincipale": "1",
      "infosQualite": {
        "codeQualite": "Membre",
        "libQualite": "Membre",
        "libQualiteSex": "Membre"
      },
      "organesRefs": [
        "PO285053"
      ]
    },
    {
      "xsiType": "MandatSimple_Type",
      "uid": "PM300401",
      "acteurRef": "PA632",
      "legislature": "12",
      "typeOrgane": "GE",
      "dateDebut": "2003-01-28T01:00:00.000+01:00",
      "dateFin": "2007-06-19T02:00:00.000+02:00",
      "preseance": "20",
      "nominPrincipale": "1",
      "infosQualite": {
        "codeQualite": "Membre",
        "libQualite": "Membre",
        "libQualiteSex": "Membre"
      },
      "organesRefs": [
        "PO285134"
      ]
    },
    {
      "xsiType": "MandatSimple_Type",
      "uid": "PM300461",
      "acteurRef": "PA632",
      "legislature": "12",
      "typeOrgane": "GE",
      "dateDebut": "2004-02-23T01:00:00.000+01:00",
      "dateFin": "2007-06-19T02:00:00.000+02:00",
      "preseance": "20",
      "nominPrincipale": "1",
      "infosQualite": {
        "codeQualite": "Membre",
        "libQualite": "Membre",
        "libQualiteSex": "Membre"
      },
      "organesRefs": [
        "PO298457"
      ]
    },
    {
      "xsiType": "MandatSimple_Type",
      "uid": "PM300517",
      "acteurRef": "PA632",
      "legislature": "12",
      "typeOrgane": "GE",
      "dateDebut": "2003-11-19T01:00:00.000+01:00",
      "dateFin": "2007-06-19T02:00:00.000+02:00",
      "preseance": "20",
      "nominPrincipale": "1",
      "infosQualite": {
        "codeQualite": "Membre",
        "libQualite": "Membre",
        "libQualiteSex": "Membre"
      },
      "organesRefs": [
        "PO293185"
      ]
    },
    {
      "xsiType": "MandatSimple_Type",
      "uid": "PM301472",
      "acteurRef": "PA632",
      "legislature": "12",
      "typeOrgane": "GE",
      "dateDebut": "2004-02-10T01:00:00.000+01:00",
      "dateFin": "2007-06-19T02:00:00.000+02:00",
      "preseance": "20",
      "nominPrincipale": "1",
      "infosQualite": {
        "codeQualite": "Membre",
        "libQualite": "Membre",
        "libQualiteSex": "Membre"
      },
      "organesRefs": [
        "PO298452"
      ]
    },
    {
      "xsiType": "MandatSimple_Type",
      "uid": "PM301602",
      "acteurRef": "PA632",
      "legislature": "12",
      "typeOrgane": "GE",
      "dateDebut": "2002-10-25T02:00:00.000+02:00",
      "dateFin": "2007-06-19T02:00:00.000+02:00",
      "preseance": "20",
      "nominPrincipale": "1",
      "infosQualite": {
        "codeQualite": "Membre",
        "libQualite": "Membre",
        "libQualiteSex": "Membre"
      },
      "organesRefs": [
        "PO285092"
      ]
    },
    {
      "xsiType": "MandatSimple_Type",
      "uid": "PM302179",
      "acteurRef": "PA632",
      "legislature": "12",
      "typeOrgane": "GE",
      "dateDebut": "2003-07-16T02:00:00.000+02:00",
      "dateFin": "2007-06-19T02:00:00.000+02:00",
      "preseance": "20",
      "nominPrincipale": "0",
      "infosQualite": {
        "codeQualite": "Membre",
        "libQualite": "Membre",
        "libQualiteSex": "Membre"
      },
      "organesRefs": [
        "PO293169"
      ]
    },
    {
      "xsiType": "MandatSimple_Type",
      "uid": "PM302207",
      "acteurRef": "PA632",
      "legislature": "12",
      "typeOrgane": "GE",
      "dateDebut": "2003-07-16T02:00:00.000+02:00",
      "dateFin": "2007-06-19T02:00:00.000+02:00",
      "preseance": "8",
      "nominPrincipale": "1",
      "infosQualite": {
        "codeQualite": "Vice-Président",
        "libQualite": "Vice-Président",
        "libQualiteSex": "Vice-Présidente"
      },
      "organesRefs": [
        "PO293169"
      ]
    },
    {
      "xsiType": "MandatSimple_Type",
      "uid": "PM309165",
      "acteurRef": "PA632",
      "legislature": "12",
      "typeOrgane": "GA",
      "dateDebut": "2004-12-16T01:00:00.000+01:00",
      "dateFin": "2007-06-19T02:00:00.000+02:00",
      "preseance": "20",
      "nominPrincipale": "1",
      "infosQualite": {
        "codeQualite": "Membre",
        "libQualite": "Membre",
        "libQualiteSex": "Membre"
      },
      "organesRefs": [
        "PO274129"
      ]
    },
    {
      "xsiType": "MandatSimple_Type",
      "uid": "PM309963",
      "acteurRef": "PA632",
      "legislature": "12",
      "typeOrgane": "GE",
      "dateDebut": "2005-02-01T01:00:00.000+01:00",
      "dateFin": "2007-06-19T02:00:00.000+02:00",
      "preseance": "20",
      "nominPrincipale": "0",
      "infosQualite": {
        "codeQualite": "Membre",
        "libQualite": "Membre",
        "libQualiteSex": "Membre"
      },
      "organesRefs": [
        "PO309957"
      ]
    },
    {
      "xsiType": "MandatSimple_Type",
      "uid": "PM309964",
      "acteurRef": "PA632",
      "legislature": "12",
      "typeOrgane": "GE",
      "dateDebut": "2005-02-01T01:00:00.000+01:00",
      "dateFin": "2007-06-19T02:00:00.000+02:00",
      "preseance": "1",
      "nominPrincipale": "1",
      "infosQualite": {
        "codeQualite": "Président",
        "libQualite": "Président",
        "libQualiteSex": "Présidente"
      },
      "organesRefs": [
        "PO309957"
      ]
    },
    {
      "xsiType": "MandatSimple_Type",
      "uid": "PM311136",
      "acteurRef": "PA632",
      "legislature": "12",
      "typeOrgane": "GE",
      "dateDebut": "2003-01-01T01:00:00.000+01:00",
      "dateFin": "2007-06-19T02:00:00.000+02:00",
      "preseance": "20",
      "nominPrincipale": "1",
      "infosQualite": {
        "codeQualite": "Membre",
        "libQualite": "Membre",
        "libQualiteSex": "Membre"
      },
      "organesRefs": [
        "PO285097"
      ]
    },
    {
      "xsiType": "MandatSimple_Type",
      "uid": "PM312058",
      "acteurRef": "PA632",
      "legislature": "12",
      "typeOrgane": "GE",
      "dateDebut": "2004-01-01T01:00:00.000+01:00",
      "dateFin": "2007-06-19T02:00:00.000+02:00",
      "preseance": "20",
      "nominPrincipale": "1",
      "infosQualite": {
        "codeQualite": "Membre",
        "libQualite": "Membre",
        "libQualiteSex": "Membre"
      },
      "organesRefs": [
        "PO293186"
      ]
    },
    {
      "xsiType": "MandatSimple_Type",
      "uid": "PM312603",
      "acteurRef": "PA632",
      "legislature": "12",
      "typeOrgane": "GE",
      "dateDebut": "2005-05-04T02:00:00.000+02:00",
      "dateFin": "2007-06-19T02:00:00.000+02:00",
      "preseance": "20",
      "nominPrincipale": "1",
      "infosQualite": {
        "codeQualite": "Membre",
        "libQualite": "Membre",
        "libQualiteSex": "Membre"
      },
      "organesRefs": [
        "PO290178"
      ]
    },
    {
      "xsiType": "MandatSimple_Type",
      "uid": "PM314451",
      "acteurRef": "PA632",
      "legislature": "12",
      "typeOrgane": "GA",
      "dateDebut": "2005-10-18T02:00:00.000+02:00",
      "dateFin": "2007-06-19T02:00:00.000+02:00",
      "preseance": "20",
      "nominPrincipale": "1",
      "infosQualite": {
        "codeQualite": "Membre",
        "libQualite": "Membre",
        "libQualiteSex": "Membre"
      },
      "organesRefs": [
        "PO274159"
      ]
    },
    {
      "xsiType": "MandatSimple_Type",
      "uid": "PM323589",
      "acteurRef": "PA632",
      "legislature": "12",
      "typeOrgane": "GE",
      "dateDebut": "2006-05-30T02:00:00.000+02:00",
      "dateFin": "2007-06-19T02:00:00.000+02:00",
      "preseance": "20",
      "nominPrincipale": "1",
      "infosQualite": {
        "codeQualite": "Membre",
        "libQualite": "Membre",
        "libQualiteSex": "Membre"
      },
      "organesRefs": [
        "PO287299"
      ]
    },
    {
      "xsiType": "MandatSimple_Type",
      "uid": "PM381577",
      "acteurRef": "PA632",
      "legislature": "12",
      "typeOrgane": "GE",
      "dateDebut": "2006-12-13T01:00:00.000+01:00",
      "dateFin": "2007-06-19T02:00:00.000+02:00",
      "preseance": "20",
      "nominPrincipale": "1",
      "infosQualite": {
        "codeQualite": "Membre",
        "libQualite": "Membre",
        "libQualiteSex": "Membre"
      },
      "organesRefs": [
        "PO324488"
      ]
    },
    {
      "xsiType": "MandatSimple_Type",
      "uid": "PM382991",
      "acteurRef": "PA632",
      "typeOrgane": "MINISTERE",
      "dateDebut": "2007-05-18T02:00:00.000+02:00",
      "datePublication": "2007-05-19T02:00:00.000+02:00",
      "dateFin": "2007-06-18T02:00:00.000+02:00",
      "preseance": "30",
      "nominPrincipale": "1",
      "infosQualite": {
        "codeQualite": "Ministre",
        "libQualite": "Ministre",
        "libQualiteSex": "Ministre"
      },
      "organesRefs": [
        "PO382989"
      ]
    },
    {
      "xsiType": "MandatParlementaire_type",
      "uid": "PM386071",
      "acteurRef": "PA632",
      "legislature": "13",
      "typeOrgane": "ASSEMBLEE",
      "dateDebut": "2007-06-20T02:00:00.000+02:00",
      "dateFin": "2007-07-19T02:00:00.000+02:00",
      "preseance": "50",
      "nominPrincipale": "1",
      "infosQualite": {
        "codeQualite": "membre",
        "libQualite": "membre",
        "libQualiteSex": "membre"
      },
      "organesRefs": [
        "PO384266"
      ],
      "suppleant": {
        "dateDebut": "2007-06-20T02:00:00.000+02:00",
        "dateFin": "2007-07-19T02:00:00.000+02:00",
        "suppleantRef": "PA345937"
      },
      "election": {
        "lieu": {
          "region": "Ile-de-France",
          "regionType": "Métropolitain",
          "departement": "Yvelines",
          "numDepartement": "78",
          "numCirco": "10"
        },
        "causeMandat": "élections générales",
        "refCirconscription": "PO384713"
      },
      "mandature": {
        "datePriseFonction": "2007-06-20T02:00:00.000+02:00",
        "causeFin": "Nomination comme membre du Gouvernement",
        "premiereElection": "1"
      }
    },
    {
      "xsiType": "MandatSimple_Type",
      "uid": "PM387603",
      "acteurRef": "PA632",
      "legislature": "13",
      "typeOrgane": "GP",
      "dateDebut": "2007-06-20T02:00:00.000+02:00",
      "dateFin": "2007-06-26T02:00:00.000+02:00",
      "preseance": "28",
      "nominPrincipale": "1",
      "infosQualite": {
        "codeQualite": "Député non-inscrit",
        "libQualite": "Député non-inscrit",
        "libQualiteSex": "Députée non-inscrite"
      },
      "organesRefs": [
        "PO387155"
      ]
    },
    {
      "xsiType": "MandatSimple_Type",
      "uid": "PM388384",
      "acteurRef": "PA632",
      "typeOrgane": "MINISTERE",
      "dateDebut": "2007-06-19T02:00:00.000+02:00",
      "datePublication": "2007-06-20T02:00:00.000+02:00",
      "dateFin": "2009-01-14T01:00:00.000+01:00",
      "preseance": "30",
      "nominPrincipale": "1",
      "infosQualite": {
        "codeQualite": "Ministre",
        "libQualite": "Ministre",
        "libQualiteSex": "Ministre"
      },
      "organesRefs": [
        "PO388096"
      ]
    },
    {
      "xsiType": "MandatSimple_Type",
      "uid": "PM389725",
      "acteurRef": "PA632",
      "legislature": "13",
      "typeOrgane": "GP",
      "dateDebut": "2007-06-27T02:00:00.000+02:00",
      "datePublication": "2007-06-27T02:00:00.000+02:00",
      "dateFin": "2007-07-19T02:00:00.000+02:00",
      "preseance": "20",
      "nominPrincipale": "1",
      "infosQualite": {
        "codeQualite": "Membre",
        "libQualite": "Membre du",
        "libQualiteSex": "Membre du"
      },
      "organesRefs": [
        "PO389395"
      ]
    },
    {
      "xsiType": "MandatSimple_Type",
      "uid": "PM418177",
      "acteurRef": "PA632",
      "typeOrgane": "MINISTERE",
      "dateDebut": "2009-01-15T01:00:00.000+01:00",
      "datePublication": "2009-01-16T01:00:00.000+01:00",
      "dateFin": "2009-06-23T02:00:00.000+02:00",
      "preseance": "30",
      "nominPrincipale": "1",
      "infosQualite": {
        "codeQualite": "Ministre",
        "libQualite": "Ministre",
        "libQualiteSex": "Ministre"
      },
      "organesRefs": [
        "PO418175"
      ]
    },
    {
      "xsiType": "MandatParlementaire_type",
      "uid": "PM421335",
      "acteurRef": "PA632",
      "legislature": "13",
      "typeOrgane": "ASSEMBLEE",
      "dateDebut": "2007-06-20T02:00:00.000+02:00",
      "dateFin": "2009-07-24T02:00:00.000+02:00",
      "preseance": "50",
      "nominPrincipale": "1",
      "infosQualite": {
        "codeQualite": "membre",
        "libQualite": "membre",
        "libQualiteSex": "membre"
      },
      "organesRefs": [
        "PO384266"
      ],
      "suppleant": {
        "dateDebut": "2007-06-20T02:00:00.000+02:00",
        "dateFin": "2009-07-24T02:00:00.000+02:00",
        "suppleantRef": "PA345937"
      },
      "election": {
        "lieu": {
          "region": "Ile-de-France",
          "regionType": "Métropolitain",
          "departement": "Yvelines",
          "numDepartement": "78",
          "numCirco": "10"
        },
        "causeMandat": "reprise de l'exercice du mandat d'un ancien membre du Gouvernement",
        "refCirconscription": "PO384713"
      },
      "mandature": {
        "datePriseFonction": "2009-07-24T02:00:00.000+02:00",
        "causeFin": "Démission",
        "premiereElection": "1",
        "mandatRemplaceRef": "PM386071"
      }
    },
    {
      "xsiType": "MandatSimple_Type",
      "uid": "PM15382991",
      "acteurRef": "PA632",
      "typeOrgane": "GOUVERNEMENT",
      "dateDebut": "2007-05-18T02:00:00.000+02:00",
      "datePublication": "2007-05-19T02:00:00.000+02:00",
      "dateFin": "2007-06-18T02:00:00.000+02:00",
      "preseance": "50",
      "nominPrincipale": "1",
      "infosQualite": {
        "codeQualite": "membre",
        "libQualite": "membre",
        "libQualiteSex": "membre"
      },
      "organesRefs": [
        "PO382939"
      ]
    },
    {
      "xsiType": "MandatSimple_Type",
      "uid": "PM15388384",
      "acteurRef": "PA632",
      "typeOrgane": "GOUVERNEMENT",
      "dateDebut": "2007-06-19T02:00:00.000+02:00",
      "datePublication": "2007-06-20T02:00:00.000+02:00",
      "dateFin": "2009-06-23T02:00:00.000+02:00",
      "preseance": "50",
      "nominPrincipale": "1",
      "infosQualite": {
        "codeQualite": "membre",
        "libQualite": "membre",
        "libQualiteSex": "membre"
      },
      "organesRefs": [
        "PO384206"
      ]
    }
  ]
}