{
  "xsiType": "OrganeParlementaireInternational",
  "uid": "PO733177",
  "codeType": "GA",
  "libelle": "France-Suisse",
  "libelleEdition": "de France-Suisse",
  "libelleAbrege": "Suisse",
  "libelleAbrev": "SUI",
  "viMoDe": {
    "dateAgrement": "2017-07-19T02:00:00.000+02:00"
  },
  "regime": "5ème République",
  "legislature": "15",
  "secretariat": {
    "secretaire01": "M. Didier Eifermann"
  },
  "listePays": [
    "GOP756434"
  ]
}