{
  "uid": "PA215169",
  "etatCivil": {
    "ident": {
      "civ": "Mme",
      "prenom": "Claire-Lise",
      "nom": "Campion",
      "alpha": "CAMPION"
    },
    "infoNaissance": {
      "dateNais": "1951-07-27T01:00:00.000+01:00"
    }
  },
  "profession": {
    "socProcInsee": {}
  },
  "adresses": [
    {
      "xsiType": "AdresseSiteWeb_Type",
      "uid": "AD316873",
      "type": "23",
      "typeLibelle": "Url sénateur",
      "valElec": "https://www.senat.fr/senateur/campion_claire_lise00003c.html"
    }
  ],
  "mandats": [
    {
      "xsiType": "MandatSimple_Type",
      "uid": "PM215172",
      "acteurRef": "PA215169",
      "typeOrgane": "GROUPESENAT",
      "dateDebut": "2000-05-02T02:00:00.000+02:00",
      "datePublication": "2000-04-30T02:00:00.000+02:00",
      "dateFin": "2017-10-01T02:00:00.000+02:00",
      "preseance": "4",
      "nominPrincipale": "1",
      "infosQualite": {
        "codeQualite": "Membre",
        "libQualite": "Membre",
        "libQualiteSex": "Membre du"
      },
      "organesRefs": [
        "PO77710"
      ]
    },
    {
      "xsiType": "MandatParlementaire_type",
      "uid": "PM303951",
      "acteurRef": "PA215169",
      "typeOrgane": "SENAT",
      "dateDebut": "2004-10-01T02:00:00.000+02:00",
      "datePublication": "2004-10-02T02:00:00.000+02:00",
      "dateFin": "2011-09-30T02:00:00.000+02:00",
      "preseance": "20",
      "nominPrincipale": "1",
      "infosQualite": {
        "codeQualite": "Sénateur",
        "libQualite": "SENATEUR",
        "libQualiteSex": "Sénateur 5ème République"
      },
      "organesRefs": [
        "PO78718"
      ],
      "election": {
        "lieu": {
          "numDepartement": "91"
        }
      },
      "mandature": {
        "premiereElection": "0"
      }
    },
    {
      "xsiType": "MandatSimple_Type",
      "uid": "PM318577",
      "acteurRef": "PA215169",
      "typeOrgane": "DELEGSENAT",
      "dateDebut": "2001-10-10T02:00:00.000+02:00",
      "dateFin": "2008-09-30T02:00:00.000+02:00",
      "preseance": "4",
      "nominPrincipale": "1",
      "infosQualite": {
        "codeQualite": "Membre",
        "libQualite": "Membre",
        "libQualiteSex": "Membre"
      },
      "organesRefs": [
        "PO310693"
      ]
    },
    {
      "xsiType": "MandatSimple_Type",
      "uid": "PM320176",
      "acteurRef": "PA215169",
      "typeOrgane": "COMSENAT",
      "dateDebut": "2004-10-07T02:00:00.000+02:00",
      "dateFin": "2008-10-06T02:00:00.000+02:00",
      "nominPrincipale": "1",
      "infosQualite": {
        "libQualite": "Vice-Président"
      },
      "organesRefs": [
        "PO211493"
      ]
    },
    {
      "xsiType": "MandatSimple_Type",
      "uid": "PM415941",
      "acteurRef": "PA215169",
      "typeOrgane": "COMSENAT",
      "dateDebut": "2008-10-07T02:00:00.000+02:00",
      "dateFin": "2011-09-30T02:00:00.000+02:00",
      "preseance": "10",
      "nominPrincipale": "1",
      "infosQualite": {
        "codeQualite": "Membre",
        "libQualite": "Membre",
        "libQualiteSex": "Membre"
      },
      "organesRefs": [
        "PO211493"
      ]
    },
    {
      "xsiType": "MandatSimple_Type",
      "uid": "PM422605",
      "acteurRef": "PA215169",
      "typeOrgane": "COMSPSENAT",
      "dateDebut": "2009-12-09T01:00:00.000+01:00",
      "dateFin": "2010-04-08T02:00:00.000+02:00",
      "nominPrincipale": "1",
      "infosQualite": {
        "libQualite": "Membre"
      },
      "organesRefs": [
        "PO422577"
      ]
    },
    {
      "xsiType": "MandatParlementaire_type",
      "uid": "PM429924",
      "acteurRef": "PA215169",
      "typeOrgane": "SENAT",
      "dateDebut": "2011-10-01T02:00:00.000+02:00",
      "dateFin": "2017-10-01T02:00:00.000+02:00",
      "preseance": "20",
      "nominPrincipale": "1",
      "infosQualite": {
        "codeQualite": "Sénateur",
        "libQualite": "SENATEUR",
        "libQualiteSex": "Sénateur 5ème République"
      },
      "organesRefs": [
        "PO78718"
      ],
      "election": {
        "lieu": {
          "numDepartement": "91"
        }
      },
      "mandature": {
        "premiereElection": "0"
      }
    },
    {
      "xsiType": "MandatSimple_Type",
      "uid": "PM430425",
      "acteurRef": "PA215169",
      "typeOrgane": "COMSENAT",
      "dateDebut": "2011-10-01T02:00:00.000+02:00",
      "dateFin": "2014-10-07T02:00:00.000+02:00",
      "nominPrincipale": "1",
      "infosQualite": {
        "libQualite": "Secrétaire"
      },
      "organesRefs": [
        "PO211493"
      ]
    },
    {
      "xsiType": "MandatSimple_Type",
      "uid": "PM517978",
      "acteurRef": "PA215169",
      "typeOrgane": "API",
      "dateDebut": "2012-01-31T01:00:00.000+01:00",
      "dateFin": "2014-09-30T02:00:00.000+02:00",
      "preseance": "20",
      "nominPrincipale": "1",
      "infosQualite": {
        "codeQualite": "Membre",
        "libQualite": "Membre",
        "libQualiteSex": "Membre"
      },
      "organesRefs": [
        "PO206064"
      ]
    },
    {
      "xsiType": "MandatSimple_Type",
      "uid": "PM701816",
      "acteurRef": "PA215169",
      "typeOrgane": "CMP",
      "dateDebut": "2014-06-12T02:00:00.000+02:00",
      "datePublication": "2014-06-14T02:00:00.000+02:00",
      "dateFin": "2014-06-26T02:00:00.000+02:00",
      "preseance": "20",
      "nominPrincipale": "1",
      "infosQualite": {
        "codeQualite": "Titulaire",
        "libQualite": "Membre titulaire",
        "libQualiteSex": "Membre titulaire"
      },
      "organesRefs": [
        "PO701795"
      ]
    },
    {
      "xsiType": "MandatSimple_Type",
      "uid": "PM701879",
      "acteurRef": "PA215169",
      "typeOrgane": "CMP",
      "dateDebut": "2014-06-17T02:00:00.000+02:00",
      "datePublication": "2014-06-18T02:00:00.000+02:00",
      "dateFin": "2014-06-26T02:00:00.000+02:00",
      "preseance": "16",
      "nominPrincipale": "1",
      "infosQualite": {
        "codeQualite": "Rapporteur",
        "libQualite": "Rapporteur",
        "libQualiteSex": "Rapporteure"
      },
      "organesRefs": [
        "PO701795"
      ]
    },
    {
      "xsiType": "MandatSimple_Type",
      "uid": "PM704115",
      "acteurRef": "PA215169",
      "typeOrgane": "COMSENAT",
      "dateDebut": "2014-10-08T02:00:00.000+02:00",
      "dateFin": "2017-10-01T02:00:00.000+02:00",
      "preseance": "10",
      "nominPrincipale": "1",
      "infosQualite": {
        "codeQualite": "Membre",
        "libQualite": "Membre",
        "libQualiteSex": "Membre"
      },
      "organesRefs": [
        "PO211493"
      ]
    },
    {
      "xsiType": "MandatSimple_Type",
      "uid": "PM709013",
      "acteurRef": "PA215169",
      "typeOrgane": "CMP",
      "dateDebut": "2015-07-16T02:00:00.000+02:00",
      "datePublication": "2015-07-16T02:00:00.000+02:00",
      "dateFin": "2015-07-17T02:00:00.000+02:00",
      "preseance": "20",
      "nominPrincipale": "1",
      "infosQualite": {
        "codeQualite": "Titulaire",
        "libQualite": "Membre titulaire",
        "libQualiteSex": "Membre titulaire"
      },
      "organesRefs": [
        "PO708863"
      ]
    },
    {
      "xsiType": "MandatSimple_Type",
      "uid": "PM711058",
      "acteurRef": "PA215169",
      "typeOrgane": "CMP",
      "dateDebut": "2015-12-17T01:00:00.000+01:00",
      "datePublication": "2016-01-09T01:00:00.000+01:00",
      "dateFin": "2016-02-11T01:00:00.000+01:00",
      "preseance": "20",
      "nominPrincipale": "1",
      "infosQualite": {
        "codeQualite": "Titulaire",
        "libQualite": "Membre titulaire",
        "libQualiteSex": "Membre titulaire"
      },
      "organesRefs": [
        "PO710237"
      ]
    }
  ]
}