{
  "xsiType": "OrganeParlementaire_Type",
  "uid": "PO309058",
  "codeType": "MISINFO",
  "libelle": "Mission d'évaluation et de contrôle des lois de financement de la sécurité sociale",
  "libelleEdition": "de la Mission d'évaluation et de contrôle des lois de financement de la sécurité sociale",
  "libelleAbrege": "MEC sécurité sociale",
  "libelleAbrev": "MECSS",
  "viMoDe": {
    "dateDebut": "2004-10-01T02:00:00.000+02:00",
    "dateFin": "2007-06-19T02:00:00.000+02:00"
  },
  "regime": "5ème République",
  "legislature": "12",
  "secretariat": {}
}