{
  "uid": "PA721384",
  "etatCivil": {
    "ident": {
      "civ": "Mme",
      "prenom": "Pascale",
      "nom": "Fontenel-Personne",
      "alpha": "FontenelPersonne",
      "trigramme": "PFO"
    },
    "infoNaissance": {
      "dateNais": "1962-05-26T01:00:00.000+01:00",
      "villeNais": "Le Mans",
      "depNais": "Sarthe",
      "paysNais": "France"
    }
  },
  "profession": {
    "libelleCourant": "Industriel-Chef d'entreprise",
    "socProcInsee": {
      "catSocPro": "Commerçants et assimilés",
      "famSocPro": "Artisans, commerçants et chefs d'entreprise"
    }
  },
  "uriHatvp": "https://www.hatvp.fr/pages_nominatives/fontenel-personne-pascale",
  "adresses": [
    {
      "xsiType": "AdressePostale_Type",
      "uid": "AD721386",
      "type": "0",
      "typeLibelle": "Adresse officielle",
      "poids": "1",
      "intitule": "Assemblée nationale,",
      "numeroRue": "126",
      "nomRue": "Rue de l'Université,",
      "codePostal": "75355",
      "ville": "Paris 07 SP"
    },
    {
      "xsiType": "AdresseMail_Type",
      "uid": "AD724900",
      "type": "15",
      "typeLibelle": "Mèl",
      "valElec": "permanencedeputee7203@gmail.com"
    },
    {
      "xsiType": "AdresseSiteWeb_Type",
      "uid": "AD725010",
      "type": "25",
      "typeLibelle": "Facebook",
      "valElec": "fontenelpersonne"
    },
    {
      "xsiType": "AdresseSiteWeb_Type",
      "uid": "AD725058",
      "type": "24",
      "typeLibelle": "Twitter",
      "valElec": "@f_personne"
    },
    {
      "xsiType": "AdresseMail_Type",
      "uid": "AD728243",
      "type": "15",
      "typeLibelle": "Mèl",
      "valElec": "pascale.fontenel-personne@assemblee-nationale.fr"
    }
  ],
  "mandats": [
    {
      "xsiType": "MandatParlementaire_type",
      "uid": "PM723256",
      "acteurRef": "PA721384",
      "legislature": "15",
      "typeOrgane": "ASSEMBLEE",
      "dateDebut": "2017-06-18T02:00:00.000+02:00",
      "preseance": "50",
      "nominPrincipale": "1",
      "infosQualite": {
        "codeQualite": "membre",
        "libQualite": "membre",
        "libQualiteSex": "membre"
      },
      "organesRefs": [
        "PO717460"
      ],
      "suppleant": {
        "dateDebut": "2017-06-18T02:00:00.000+02:00",
        "suppleantRef": "PA721388"
      },
      "election": {
        "lieu": {
          "region": "Pays de la Loire",
          "regionType": "Métropolitain",
          "departement": "Sarthe",
          "numDepartement": "72",
          "numCirco": "3"
        },
        "causeMandat": "élections générales",
        "refCirconscription": "PO718200"
      },
      "mandature": {
        "datePriseFonction": "2017-06-21T02:00:00.000+02:00",
        "premiereElection": "0",
        "placeHemicycle": "463"
      },
      "collaborateurs": [
        {
          "qualite": "Mme",
          "prenom": "Clara",
          "nom": "Avenant"
        },
        {
          "qualite": "Mme",
          "prenom": "Véronique",
          "nom": "Godard"
        },
        {
          "qualite": "M.",
          "prenom": "Abigail",
          "nom": "Giordano"
        },
        {
          "qualite": "Mme",
          "prenom": "Margaux",
          "nom": "Wahba"
        }
      ]
    },
    {
      "xsiType": "MandatSimple_Type",
      "uid": "PM724669",
      "acteurRef": "PA721384",
      "legislature": "15",
      "typeOrgane": "GP",
      "dateDebut": "2017-06-21T02:00:00.000+02:00",
      "dateFin": "2017-06-26T02:00:00.000+02:00",
      "preseance": "28",
      "nominPrincipale": "1",
      "infosQualite": {
        "codeQualite": "Député non-inscrit",
        "libQualite": "Député non-inscrit",
        "libQualiteSex": "Députée non-inscrite"
      },
      "organesRefs": [
        "PO723569"
      ]
    },
    {
      "xsiType": "MandatSimple_Type",
      "uid": "PM731200",
      "acteurRef": "PA721384",
      "legislature": "15",
      "typeOrgane": "GP",
      "dateDebut": "2017-06-27T02:00:00.000+02:00",
      "datePublication": "2017-06-28T02:00:00.000+02:00",
      "preseance": "20",
      "nominPrincipale": "1",
      "infosQualite": {
        "codeQualite": "Membre",
        "libQualite": "Membre du",
        "libQualiteSex": "Membre du"
      },
      "organesRefs": [
        "PO730964"
      ]
    },
    {
      "xsiType": "MandatSimple_Type",
      "uid": "PM732167",
      "acteurRef": "PA721384",
      "legislature": "15",
      "typeOrgane": "COMPER",
      "dateDebut": "2017-06-29T02:00:00.000+02:00",
      "datePublication": "2017-06-29T02:00:00.000+02:00",
      "dateFin": "2018-01-22T01:00:00.000+01:00",
      "preseance": "32",
      "nominPrincipale": "1",
      "infosQualite": {
        "codeQualite": "Membre",
        "libQualite": "Membre",
        "libQualiteSex": "Membre"
      },
      "organesRefs": [
        "PO419610"
      ]
    },
    {
      "xsiType": "MandatSimple_Type",
      "uid": "PM732846",
      "acteurRef": "PA721384",
      "legislature": "15",
      "typeOrgane": "DELEG",
      "dateDebut": "2017-07-19T02:00:00.000+02:00",
      "datePublication": "2017-07-19T02:00:00.000+02:00",
      "dateFin": "2018-12-13T01:00:00.000+01:00",
      "preseance": "20",
      "nominPrincipale": "1",
      "infosQualite": {
        "codeQualite": "Membre",
        "libQualite": "Membre",
        "libQualiteSex": "Membre"
      },
      "organesRefs": [
        "PO201269"
      ]
    },
    {
      "xsiType": "MandatSimple_Type",
      "uid": "PM737542",
      "acteurRef": "PA721384",
      "legislature": "15",
      "typeOrgane": "GA",
      "dateDebut": "2017-10-05T02:00:00.000+02:00",
      "preseance": "20",
      "nominPrincipale": "1",
      "infosQualite": {
        "codeQualite": "Membre",
        "libQualite": "Membre",
        "libQualiteSex": "Membre"
      },
      "organesRefs": [
        "PO732964"
      ]
    },
    {
      "xsiType": "MandatSimple_Type",
      "uid": "PM737543",
      "acteurRef": "PA721384",
      "legislature": "15",
      "typeOrgane": "GA",
      "dateDebut": "2017-10-05T02:00:00.000+02:00",
      "preseance": "20",
      "nominPrincipale": "1",
      "infosQualite": {
        "codeQualite": "Membre",
        "libQualite": "Membre",
        "libQualiteSex": "Membre"
      },
      "organesRefs": [
        "PO733607"
      ]
    },
    {
      "xsiType": "MandatSimple_Type",
      "uid": "PM742136",
      "acteurRef": "PA721384",
      "legislature": "15",
      "typeOrgane": "API",
      "dateDebut": "2017-10-27T02:00:00.000+02:00",
      "datePublication": "2017-10-28T02:00:00.000+02:00",
      "preseance": "20",
      "nominPrincipale": "1",
      "infosQualite": {
        "codeQualite": "Membre",
        "libQualite": "Membre",
        "libQualiteSex": "Membre"
      },
      "organesRefs": [
        "PO201115"
      ]
    },
    {
      "xsiType": "MandatSimple_Type",
      "uid": "PM743715",
      "acteurRef": "PA721384",
      "legislature": "15",
      "typeOrgane": "ORGEXTPARL",
      "dateDebut": "2017-11-17T01:00:00.000+01:00",
      "datePublication": "2017-11-18T01:00:00.000+01:00",
      "preseance": "20",
      "nominPrincipale": "1",
      "infosQualite": {
        "codeQualite": "Titulaire",
        "libQualite": "Membre titulaire",
        "libQualiteSex": "Membre titulaire"
      },
      "organesRefs": [
        "PO205834"
      ]
    },
    {
      "xsiType": "MandatSimple_Type",
      "uid": "PM744136",
      "acteurRef": "PA721384",
      "legislature": "15",
      "typeOrgane": "GA",
      "dateDebut": "2017-11-28T01:00:00.000+01:00",
      "preseance": "20",
      "nominPrincipale": "0",
      "infosQualite": {
        "codeQualite": "Membre",
        "libQualite": "Membre",
        "libQualiteSex": "Membre"
      },
      "organesRefs": [
        "PO733192"
      ]
    },
    {
      "xsiType": "MandatSimple_Type",
      "uid": "PM745119",
      "acteurRef": "PA721384",
      "typeOrgane": "PARPOL",
      "dateDebut": "2017-12-01T01:00:00.000+01:00",
      "dateFin": "2018-11-30T01:00:00.000+01:00",
      "preseance": "5",
      "nominPrincipale": "1",
      "infosQualite": {
        "codeQualite": "Membre",
        "libQualite": "Membre",
        "libQualiteSex": "Membre"
      },
      "organesRefs": [
        "PO744854"
      ]
    },
    {
      "xsiType": "MandatSimple_Type",
      "uid": "PM747829",
      "acteurRef": "PA721384",
      "legislature": "15",
      "typeOrgane": "COMPER",
      "dateDebut": "2018-01-23T01:00:00.000+01:00",
      "datePublication": "2018-01-23T01:00:00.000+01:00",
      "preseance": "32",
      "nominPrincipale": "1",
      "infosQualite": {
        "codeQualite": "Membre",
        "libQualite": "Membre",
        "libQualiteSex": "Membre"
      },
      "organesRefs": [
        "PO59046"
      ]
    },
    {
      "xsiType": "MandatSimple_Type",
      "uid": "PM747998",
      "acteurRef": "PA721384",
      "legislature": "15",
      "typeOrgane": "ORGEXTPARL",
      "dateDebut": "2018-01-10T01:00:00.000+01:00",
      "datePublication": "2018-01-11T01:00:00.000+01:00",
      "preseance": "20",
      "nominPrincipale": "1",
      "infosQualite": {
        "codeQualite": "Titulaire",
        "libQualite": "Membre titulaire",
        "libQualiteSex": "Membre titulaire"
      },
      "organesRefs": [
        "PO717436"
      ]
    },
    {
      "xsiType": "MandatSimple_Type",
      "uid": "PM750418",
      "acteurRef": "PA721384",
      "legislature": "15",
      "typeOrgane": "GE",
      "dateDebut": "2018-02-14T01:00:00.000+01:00",
      "preseance": "20",
      "nominPrincipale": "1",
      "infosQualite": {
        "codeQualite": "Membre",
        "libQualite": "Membre",
        "libQualiteSex": "Membre"
      },
      "organesRefs": [
        "PO746925"
      ]
    },
    {
      "xsiType": "MandatSimple_Type",
      "uid": "PM751833",
      "acteurRef": "PA721384",
      "legislature": "15",
      "typeOrgane": "GE",
      "dateDebut": "2018-02-22T01:00:00.000+01:00",
      "preseance": "20",
      "nominPrincipale": "0",
      "infosQualite": {
        "codeQualite": "Membre",
        "libQualite": "Membre",
        "libQualiteSex": "Membre"
      },
      "organesRefs": [
        "PO751484"
      ]
    },
    {
      "xsiType": "MandatSimple_Type",
      "uid": "PM751834",
      "acteurRef": "PA721384",
      "legislature": "15",
      "typeOrgane": "GE",
      "dateDebut": "2018-02-22T01:00:00.000+01:00",
      "preseance": "4",
      "nominPrincipale": "1",
      "infosQualite": {
        "codeQualite": "Co-Président",
        "libQualite": "Co-Président",
        "libQualiteSex": "Co-Présidente"
      },
      "organesRefs": [
        "PO751484"
      ]
    },
    {
      "xsiType": "MandatSimple_Type",
      "uid": "PM752071",
      "acteurRef": "PA721384",
      "legislature": "15",
      "typeOrgane": "GE",
      "dateDebut": "2018-02-27T01:00:00.000+01:00",
      "preseance": "20",
      "nominPrincipale": "1",
      "infosQualite": {
        "codeQualite": "Membre",
        "libQualite": "Membre",
        "libQualiteSex": "Membre"
      },
      "organesRefs": [
        "PO747104"
      ]
    },
    {
      "xsiType": "MandatSimple_Type",
      "uid": "PM754159",
      "acteurRef": "PA721384",
      "legislature": "15",
      "typeOrgane": "CNPE",
      "dateDebut": "2018-03-23T01:00:00.000+01:00",
      "datePublication": "2018-03-23T01:00:00.000+01:00",
      "dateFin": "2018-07-19T02:00:00.000+02:00",
      "preseance": "20",
      "nominPrincipale": "1",
      "infosQualite": {
        "codeQualite": "Membre",
        "libQualite": "Membre",
        "libQualiteSex": "Membre"
      },
      "organesRefs": [
        "PO753283"
      ]
    },
    {
      "xsiType": "MandatMission_Type",
      "uid": "PM757254",
      "acteurRef": "PA721384",
      "legislature": "15",
      "typeOrgane": "MISINFOPRE",
      "dateDebut": "2018-06-26T02:00:00.000+02:00",
      "datePublication": "2018-06-27T02:00:00.000+02:00",
      "dateFin": "2018-11-13T01:00:00.000+01:00",
      "preseance": "20",
      "nominPrincipale": "1",
      "infosQualite": {
        "codeQualite": "Membre",
        "libQualite": "Membre",
        "libQualiteSex": "Membre"
      },
      "organesRefs": [
        "PO757118"
      ]
    },
    {
      "xsiType": "MandatSimple_Type",
      "uid": "PM758144",
      "acteurRef": "PA721384",
      "legislature": "15",
      "typeOrgane": "GE",
      "dateDebut": "2018-07-17T02:00:00.000+02:00",
      "preseance": "20",
      "nominPrincipale": "0",
      "infosQualite": {
        "codeQualite": "Membre",
        "libQualite": "Membre",
        "libQualiteSex": "Membre"
      },
      "organesRefs": [
        "PO746910"
      ]
    },
    {
      "xsiType": "MandatSimple_Type",
      "uid": "PM758145",
      "acteurRef": "PA721384",
      "legislature": "15",
      "typeOrgane": "GE",
      "dateDebut": "2018-07-18T02:00:00.000+02:00",
      "preseance": "12",
      "nominPrincipale": "1",
      "infosQualite": {
        "codeQualite": "Secrétaire",
        "libQualite": "Secrétaire",
        "libQualiteSex": "Secrétaire"
      },
      "organesRefs": [
        "PO746910"
      ]
    },
    {
      "xsiType": "MandatSimple_Type",
      "uid": "PM758832",
      "acteurRef": "PA721384",
      "legislature": "15",
      "typeOrgane": "GA",
      "dateDebut": "2018-09-12T02:00:00.000+02:00",
      "preseance": "8",
      "nominPrincipale": "1",
      "infosQualite": {
        "codeQualite": "Vice-Président",
        "libQualite": "Vice-Président",
        "libQualiteSex": "Vice-Présidente"
      },
      "organesRefs": [
        "PO733192"
      ]
    },
    {
      "xsiType": "MandatSimple_Type",
      "uid": "PM761493",
      "acteurRef": "PA721384",
      "typeOrgane": "PARPOL",
      "dateDebut": "2018-12-01T01:00:00.000+01:00",
      "preseance": "5",
      "nominPrincipale": "1",
      "infosQualite": {
        "codeQualite": "Membre",
        "libQualite": "Membre",
        "libQualiteSex": "Membre"
      },
      "organesRefs": [
        "PO761294"
      ]
    },
    {
      "xsiType": "MandatMission_Type",
      "uid": "PM763228",
      "acteurRef": "PA721384",
      "legislature": "15",
      "typeOrgane": "MINISTERE",
      "dateDebut": "2019-03-13T01:00:00.000+01:00",
      "datePublication": "2019-03-14T01:00:00.000+01:00",
      "preseance": "1",
      "nominPrincipale": "1",
      "infosQualite": {
        "codeQualite": "en mission",
        "libQualite": "en mission",
        "libQualiteSex": "en mission"
      },
      "organesRefs": [
        "PO729976",
        "PO729979",
        "PO729982",
        "PO730021"
      ],
      "libelle": "L'identification de pistes pour refonder le tourisme domestique."
    },
    {
      "xsiType": "MandatSimple_Type",
      "uid": "PM763483",
      "acteurRef": "PA721384",
      "legislature": "15",
      "typeOrgane": "ORGEXTPARL",
      "dateDebut": "2019-03-14T01:00:00.000+01:00",
      "datePublication": "2019-03-15T01:00:00.000+01:00",
      "preseance": "20",
      "nominPrincipale": "1",
      "infosQualite": {
        "codeQualite": "Titulaire",
        "libQualite": "Membre titulaire",
        "libQualiteSex": "Membre titulaire"
      },
      "organesRefs": [
        "PO763346"
      ]
    },
    {
      "xsiType": "MandatSimple_Type",
      "uid": "PM765166",
      "acteurRef": "PA721384",
      "legislature": "15",
      "typeOrgane": "GE",
      "dateDebut": "2019-05-20T02:00:00.000+02:00",
      "preseance": "20",
      "nominPrincipale": "1",
      "infosQualite": {
        "codeQualite": "Membre",
        "libQualite": "Membre",
        "libQualiteSex": "Membre"
      },
      "organesRefs": [
        "PO763244"
      ]
    },
    {
      "xsiType": "MandatSimple_Type",
      "uid": "PM766199",
      "acteurRef": "PA721384",
      "legislature": "15",
      "typeOrgane": "GE",
      "dateDebut": "2019-07-03T02:00:00.000+02:00",
      "preseance": "20",
      "nominPrincipale": "1",
      "infosQualite": {
        "codeQualite": "Membre",
        "libQualite": "Membre",
        "libQualiteSex": "Membre"
      },
      "organesRefs": [
        "PO763259"
      ]
    }
  ]
}