{
  "xsiType": "OrganeExterne_Type",
  "uid": "PO729979",
  "codeType": "MINISTERE",
  "libelle": "Ministère des solidarités et de la santé",
  "libelleEdition": "des solidarités et de la santé",
  "libelleAbrege": "Solidarités et santé",
  "libelleAbrev": "SSA",
  "viMoDe": {
    "dateDebut": "2017-06-22T02:00:00.000+02:00"
  },
  "organeParentRef": "PO725688"
}