{
  "uid": "PA546",
  "etatCivil": {
    "ident": {
      "civ": "M.",
      "prenom": "Roland",
      "nom": "Blum",
      "alpha": "Blum"
    },
    "infoNaissance": {
      "dateNais": "1945-07-12T02:00:00.000+02:00",
      "villeNais": "Pennes-Mirabeau",
      "depNais": "Bouches-du-Rhône"
    }
  },
  "profession": {
    "libelleCourant": "Avocat",
    "socProcInsee": {
      "catSocPro": "Professions libérales et assimilés",
      "famSocPro": "Cadres et professions intellectuelles supérieures"
    }
  },
  "adresses": [
    {
      "xsiType": "AdressePostale_Type",
      "uid": "AD274257",
      "type": "2",
      "typeLibelle": "Adresse publiée de circonscription",
      "poids": "21",
      "intitule": "Hôtel de ville de Marseille",
      "nomRue": "Quai du port,",
      "complementAdresse": "Cabinet du Premier Adjoint",
      "codePostal": "13002",
      "ville": "Marseille"
    },
    {
      "xsiType": "AdresseTelephonique_Type",
      "uid": "AD274258",
      "type": "11",
      "typeLibelle": "Téléphone",
      "poids": "21",
      "adresseDeRattachement": "AD274257",
      "valElec": "04 91 55 35 90"
    },
    {
      "xsiType": "AdresseTelephonique_Type",
      "uid": "AD274259",
      "type": "12",
      "typeLibelle": "Télécopie",
      "poids": "21",
      "adresseDeRattachement": "AD274257",
      "valElec": "04 91 14 62 84"
    },
    {
      "xsiType": "AdresseMail_Type",
      "uid": "AD274343",
      "type": "15",
      "typeLibelle": "Mèl",
      "valElec": "rblum@mairie-marseille.fr"
    },
    {
      "xsiType": "AdressePostale_Type",
      "uid": "AD386621",
      "type": "0",
      "typeLibelle": "Adresse officielle",
      "poids": "1",
      "intitule": "Assemblée nationale,",
      "numeroRue": "126",
      "nomRue": "Rue de l'Université,",
      "codePostal": "75355",
      "ville": "Paris 07 SP"
    },
    {
      "xsiType": "AdresseMail_Type",
      "uid": "AD391601",
      "type": "15",
      "typeLibelle": "Mèl",
      "valElec": "rblum@assemblee-nationale.fr"
    }
  ],
  "mandats": [
    {
      "xsiType": "MandatParlementaire_type",
      "uid": "PM267984",
      "acteurRef": "PA546",
      "legislature": "12",
      "typeOrgane": "ASSEMBLEE",
      "dateDebut": "2002-06-19T02:00:00.000+02:00",
      "dateFin": "2007-06-19T02:00:00.000+02:00",
      "preseance": "50",
      "nominPrincipale": "1",
      "infosQualite": {
        "codeQualite": "membre",
        "libQualite": "membre",
        "libQualiteSex": "membre"
      },
      "organesRefs": [
        "PO230434"
      ],
      "election": {
        "lieu": {
          "region": "Provence-Alpes-Côte d'Azur",
          "regionType": "Métropolitain",
          "departement": "Bouches-du-Rhône",
          "numDepartement": "13",
          "numCirco": "1"
        },
        "causeMandat": "élections générales",
        "refCirconscription": "PO230478"
      },
      "mandature": {
        "datePriseFonction": "2002-06-19T02:00:00.000+02:00",
        "causeFin": "Fin de législature",
        "premiereElection": "1"
      }
    },
    {
      "xsiType": "MandatSimple_Type",
      "uid": "PM270993",
      "acteurRef": "PA546",
      "legislature": "12",
      "typeOrgane": "GP",
      "dateDebut": "2002-06-25T02:00:00.000+02:00",
      "datePublication": "2002-06-26T02:00:00.000+02:00",
      "dateFin": "2007-06-19T02:00:00.000+02:00",
      "preseance": "20",
      "nominPrincipale": "1",
      "infosQualite": {
        "codeQualite": "Membre",
        "libQualite": "Membre du",
        "libQualiteSex": "Membre du"
      },
      "organesRefs": [
        "PO270903"
      ]
    },
    {
      "xsiType": "MandatSimple_Type",
      "uid": "PM271568",
      "acteurRef": "PA546",
      "legislature": "12",
      "typeOrgane": "COMPER",
      "dateDebut": "2002-06-26T02:00:00.000+02:00",
      "datePublication": "2002-06-27T02:00:00.000+02:00",
      "dateFin": "2007-06-19T02:00:00.000+02:00",
      "preseance": "32",
      "nominPrincipale": "1",
      "infosQualite": {
        "codeQualite": "Membre",
        "libQualite": "Membre",
        "libQualiteSex": "Membre"
      },
      "organesRefs": [
        "PO59047"
      ]
    },
    {
      "xsiType": "MandatSimple_Type",
      "uid": "PM273999",
      "acteurRef": "PA546",
      "legislature": "12",
      "typeOrgane": "API",
      "dateDebut": "2002-07-20T02:00:00.000+02:00",
      "datePublication": "2002-07-20T02:00:00.000+02:00",
      "dateFin": "2007-06-19T02:00:00.000+02:00",
      "preseance": "20",
      "nominPrincipale": "1",
      "infosQualite": {
        "codeQualite": "Membre",
        "libQualite": "Membre",
        "libQualiteSex": "Membre"
      },
      "organesRefs": [
        "PO58976"
      ]
    },
    {
      "xsiType": "MandatSimple_Type",
      "uid": "PM275651",
      "acteurRef": "PA546",
      "legislature": "12",
      "typeOrgane": "API",
      "dateDebut": "2002-07-31T02:00:00.000+02:00",
      "dateFin": "2007-06-19T02:00:00.000+02:00",
      "preseance": "4",
      "nominPrincipale": "1",
      "infosQualite": {
        "codeQualite": "Vice-Président",
        "libQualite": "Vice-Président",
        "libQualiteSex": "Vice-Président"
      },
      "organesRefs": [
        "PO58976"
      ]
    },
    {
      "xsiType": "MandatSimple_Type",
      "uid": "PM277260",
      "acteurRef": "PA546",
      "legislature": "12",
      "typeOrgane": "GA",
      "dateDebut": "2002-10-18T02:00:00.000+02:00",
      "dateFin": "2007-06-19T02:00:00.000+02:00",
      "preseance": "20",
      "nominPrincipale": "0",
      "infosQualite": {
        "codeQualite": "Membre",
        "libQualite": "Membre",
        "libQualiteSex": "Membre"
      },
      "organesRefs": [
        "PO274145"
      ]
    },
    {
      "xsiType": "MandatSimple_Type",
      "uid": "PM277262",
      "acteurRef": "PA546",
      "legislature": "12",
      "typeOrgane": "GA",
      "dateDebut": "2002-10-18T02:00:00.000+02:00",
      "dateFin": "2007-06-19T02:00:00.000+02:00",
      "preseance": "1",
      "nominPrincipale": "1",
      "infosQualite": {
        "codeQualite": "Président",
        "libQualite": "Président",
        "libQualiteSex": "Président"
      },
      "organesRefs": [
        "PO274145"
      ]
    },
    {
      "xsiType": "MandatSimple_Type",
      "uid": "PM278542",
      "acteurRef": "PA546",
      "legislature": "12",
      "typeOrgane": "GA",
      "dateDebut": "2002-10-25T02:00:00.000+02:00",
      "dateFin": "2007-06-19T02:00:00.000+02:00",
      "preseance": "20",
      "nominPrincipale": "1",
      "infosQualite": {
        "codeQualite": "Membre",
        "libQualite": "Membre",
        "libQualiteSex": "Membre"
      },
      "organesRefs": [
        "PO274055"
      ]
    },
    {
      "xsiType": "MandatSimple_Type",
      "uid": "PM278545",
      "acteurRef": "PA546",
      "legislature": "12",
      "typeOrgane": "GA",
      "dateDebut": "2002-10-25T02:00:00.000+02:00",
      "dateFin": "2007-06-19T02:00:00.000+02:00",
      "preseance": "20",
      "nominPrincipale": "1",
      "infosQualite": {
        "codeQualite": "Membre",
        "libQualite": "Membre",
        "libQualiteSex": "Membre"
      },
      "organesRefs": [
        "PO274081"
      ]
    },
    {
      "xsiType": "MandatSimple_Type",
      "uid": "PM278546",
      "acteurRef": "PA546",
      "legislature": "12",
      "typeOrgane": "GA",
      "dateDebut": "2002-10-25T02:00:00.000+02:00",
      "dateFin": "2007-06-19T02:00:00.000+02:00",
      "preseance": "20",
      "nominPrincipale": "1",
      "infosQualite": {
        "codeQualite": "Membre",
        "libQualite": "Membre",
        "libQualiteSex": "Membre"
      },
      "organesRefs": [
        "PO274110"
      ]
    },
    {
      "xsiType": "MandatSimple_Type",
      "uid": "PM278548",
      "acteurRef": "PA546",
      "legislature": "12",
      "typeOrgane": "GA",
      "dateDebut": "2002-10-25T02:00:00.000+02:00",
      "dateFin": "2007-06-19T02:00:00.000+02:00",
      "preseance": "20",
      "nominPrincipale": "1",
      "infosQualite": {
        "codeQualite": "Membre",
        "libQualite": "Membre",
        "libQualiteSex": "Membre"
      },
      "organesRefs": [
        "PO274141"
      ]
    },
    {
      "xsiType": "MandatSimple_Type",
      "uid": "PM278550",
      "acteurRef": "PA546",
      "legislature": "12",
      "typeOrgane": "GA",
      "dateDebut": "2002-10-25T02:00:00.000+02:00",
      "dateFin": "2007-06-19T02:00:00.000+02:00",
      "preseance": "20",
      "nominPrincipale": "1",
      "infosQualite": {
        "codeQualite": "Membre",
        "libQualite": "Membre",
        "libQualiteSex": "Membre"
      },
      "organesRefs": [
        "PO274132"
      ]
    },
    {
      "xsiType": "MandatSimple_Type",
      "uid": "PM278554",
      "acteurRef": "PA546",
      "legislature": "12",
      "typeOrgane": "GA",
      "dateDebut": "2002-10-25T02:00:00.000+02:00",
      "dateFin": "2007-06-19T02:00:00.000+02:00",
      "preseance": "20",
      "nominPrincipale": "1",
      "infosQualite": {
        "codeQualite": "Membre",
        "libQualite": "Membre",
        "libQualiteSex": "Membre"
      },
      "organesRefs": [
        "PO274111"
      ]
    },
    {
      "xsiType": "MandatSimple_Type",
      "uid": "PM288645",
      "acteurRef": "PA546",
      "legislature": "12",
      "typeOrgane": "GE",
      "dateDebut": "2003-01-29T01:00:00.000+01:00",
      "dateFin": "2007-06-19T02:00:00.000+02:00",
      "preseance": "20",
      "nominPrincipale": "1",
      "infosQualite": {
        "codeQualite": "Membre",
        "libQualite": "Membre",
        "libQualiteSex": "Membre"
      },
      "organesRefs": [
        "PO285117"
      ]
    },
    {
      "xsiType": "MandatSimple_Type",
      "uid": "PM292254",
      "acteurRef": "PA546",
      "legislature": "12",
      "typeOrgane": "GE",
      "dateDebut": "2003-04-29T02:00:00.000+02:00",
      "dateFin": "2007-06-19T02:00:00.000+02:00",
      "preseance": "20",
      "nominPrincipale": "1",
      "infosQualite": {
        "codeQualite": "Membre",
        "libQualite": "Membre",
        "libQualiteSex": "Membre"
      },
      "organesRefs": [
        "PO287282"
      ]
    },
    {
      "xsiType": "MandatSimple_Type",
      "uid": "PM301802",
      "acteurRef": "PA546",
      "legislature": "12",
      "typeOrgane": "GE",
      "dateDebut": "2003-10-14T02:00:00.000+02:00",
      "dateFin": "2007-06-19T02:00:00.000+02:00",
      "preseance": "20",
      "nominPrincipale": "1",
      "infosQualite": {
        "codeQualite": "Membre",
        "libQualite": "Membre",
        "libQualiteSex": "Membre"
      },
      "organesRefs": [
        "PO285061"
      ]
    },
    {
      "xsiType": "MandatSimple_Type",
      "uid": "PM304041",
      "acteurRef": "PA546",
      "legislature": "12",
      "typeOrgane": "COMPER",
      "dateDebut": "2004-10-05T02:00:00.000+02:00",
      "datePublication": "2004-10-06T02:00:00.000+02:00",
      "dateFin": "2007-06-19T02:00:00.000+02:00",
      "preseance": "8",
      "nominPrincipale": "1",
      "infosQualite": {
        "codeQualite": "Vice-Président",
        "libQualite": "Vice-président",
        "libQualiteSex": "Vice-président"
      },
      "organesRefs": [
        "PO59047"
      ]
    },
    {
      "xsiType": "MandatSimple_Type",
      "uid": "PM314966",
      "acteurRef": "PA546",
      "legislature": "12",
      "typeOrgane": "COMPER",
      "dateDebut": "2005-05-10T02:00:00.000+02:00",
      "dateFin": "2007-06-19T02:00:00.000+02:00",
      "preseance": "500",
      "nominPrincipale": "0",
      "infosQualite": {
        "libQualite": "Rapporteur pour avis au nom de la commission des affaires étrangères : Affaires européennes",
        "libQualiteSex": "Rapporteur pour avis au nom de la commission des affaires étrangères : Affaires européennes"
      },
      "organesRefs": [
        "PO59047"
      ]
    },
    {
      "xsiType": "MandatSimple_Type",
      "uid": "PM323250",
      "acteurRef": "PA546",
      "legislature": "12",
      "typeOrgane": "GE",
      "dateDebut": "2006-05-15T02:00:00.000+02:00",
      "dateFin": "2007-06-19T02:00:00.000+02:00",
      "preseance": "20",
      "nominPrincipale": "0",
      "infosQualite": {
        "codeQualite": "Membre",
        "libQualite": "Membre",
        "libQualiteSex": "Membre"
      },
      "organesRefs": [
        "PO323244"
      ]
    },
    {
      "xsiType": "MandatSimple_Type",
      "uid": "PM324228",
      "acteurRef": "PA546",
      "legislature": "12",
      "typeOrgane": "GE",
      "dateDebut": "2006-05-15T02:00:00.000+02:00",
      "dateFin": "2007-06-19T02:00:00.000+02:00",
      "preseance": "4",
      "nominPrincipale": "1",
      "infosQualite": {
        "codeQualite": "Co-Président",
        "libQualite": "Co-Président",
        "libQualiteSex": "Co-Président"
      },
      "organesRefs": [
        "PO323244"
      ]
    },
    {
      "xsiType": "MandatSimple_Type",
      "uid": "PM381573",
      "acteurRef": "PA546",
      "legislature": "12",
      "typeOrgane": "GE",
      "dateDebut": "2006-12-13T01:00:00.000+01:00",
      "dateFin": "2007-06-19T02:00:00.000+02:00",
      "preseance": "20",
      "nominPrincipale": "1",
      "infosQualite": {
        "codeQualite": "Membre",
        "libQualite": "Membre",
        "libQualiteSex": "Membre"
      },
      "organesRefs": [
        "PO324488"
      ]
    },
    {
      "xsiType": "MandatParlementaire_type",
      "uid": "PM386055",
      "acteurRef": "PA546",
      "legislature": "13",
      "typeOrgane": "ASSEMBLEE",
      "dateDebut": "2007-06-20T02:00:00.000+02:00",
      "dateFin": "2012-06-19T02:00:00.000+02:00",
      "preseance": "50",
      "nominPrincipale": "1",
      "infosQualite": {
        "codeQualite": "membre",
        "libQualite": "membre",
        "libQualiteSex": "membre"
      },
      "organesRefs": [
        "PO384266"
      ],
      "suppleant": {
        "dateDebut": "2007-06-20T02:00:00.000+02:00",
        "dateFin": "2012-06-19T02:00:00.000+02:00",
        "suppleantRef": "PA297"
      },
      "election": {
        "lieu": {
          "region": "Provence-Alpes-Côte d'Azur",
          "regionType": "Métropolitain",
          "departement": "Bouches-du-Rhône",
          "numDepartement": "13",
          "numCirco": "1"
        },
        "causeMandat": "élections générales",
        "refCirconscription": "PO384310"
      },
      "mandature": {
        "datePriseFonction": "2007-06-20T02:00:00.000+02:00",
        "causeFin": "Fin de législature",
        "premiereElection": "1"
      }
    },
    {
      "xsiType": "MandatSimple_Type",
      "uid": "PM387200",
      "acteurRef": "PA546",
      "legislature": "13",
      "typeOrgane": "GP",
      "dateDebut": "2007-06-20T02:00:00.000+02:00",
      "dateFin": "2007-06-26T02:00:00.000+02:00",
      "preseance": "28",
      "nominPrincipale": "1",
      "infosQualite": {
        "codeQualite": "Député non-inscrit",
        "libQualite": "Député non-inscrit",
        "libQualiteSex": "Député non-inscrit"
      },
      "organesRefs": [
        "PO387155"
      ]
    },
    {
      "xsiType": "MandatSimple_Type",
      "uid": "PM389717",
      "acteurRef": "PA546",
      "legislature": "13",
      "typeOrgane": "GP",
      "dateDebut": "2007-06-27T02:00:00.000+02:00",
      "datePublication": "2007-06-27T02:00:00.000+02:00",
      "dateFin": "2012-06-19T02:00:00.000+02:00",
      "preseance": "20",
      "nominPrincipale": "1",
      "infosQualite": {
        "codeQualite": "Membre",
        "libQualite": "Membre du",
        "libQualiteSex": "Membre du"
      },
      "organesRefs": [
        "PO389395"
      ]
    },
    {
      "xsiType": "MandatSimple_Type",
      "uid": "PM390673",
      "acteurRef": "PA546",
      "legislature": "13",
      "typeOrgane": "COMPER",
      "dateDebut": "2007-06-27T02:00:00.000+02:00",
      "datePublication": "2007-06-28T02:00:00.000+02:00",
      "dateFin": "2012-06-19T02:00:00.000+02:00",
      "preseance": "32",
      "nominPrincipale": "1",
      "infosQualite": {
        "codeQualite": "Membre",
        "libQualite": "Membre",
        "libQualiteSex": "Membre"
      },
      "organesRefs": [
        "PO59047"
      ]
    },
    {
      "xsiType": "MandatSimple_Type",
      "uid": "PM394034",
      "acteurRef": "PA546",
      "legislature": "13",
      "typeOrgane": "API",
      "dateDebut": "2007-07-25T02:00:00.000+02:00",
      "datePublication": "2007-07-19T02:00:00.000+02:00",
      "dateFin": "2012-06-19T02:00:00.000+02:00",
      "preseance": "20",
      "nominPrincipale": "0",
      "infosQualite": {
        "codeQualite": "Membre",
        "libQualite": "Membre",
        "libQualiteSex": "Membre"
      },
      "organesRefs": [
        "PO58976"
      ]
    },
    {
      "xsiType": "MandatSimple_Type",
      "uid": "PM394050",
      "acteurRef": "PA546",
      "legislature": "13",
      "typeOrgane": "API",
      "dateDebut": "2007-07-25T02:00:00.000+02:00",
      "datePublication": "2007-07-28T02:00:00.000+02:00",
      "dateFin": "2012-06-19T02:00:00.000+02:00",
      "preseance": "4",
      "nominPrincipale": "1",
      "infosQualite": {
        "codeQualite": "Vice-Président",
        "libQualite": "Vice-Président",
        "libQualiteSex": "Vice-Président"
      },
      "organesRefs": [
        "PO58976"
      ]
    },
    {
      "xsiType": "MandatSimple_Type",
      "uid": "PM395694",
      "acteurRef": "PA546",
      "legislature": "13",
      "typeOrgane": "GA",
      "dateDebut": "2007-09-27T02:00:00.000+02:00",
      "dateFin": "2012-06-19T02:00:00.000+02:00",
      "preseance": "20",
      "nominPrincipale": "0",
      "infosQualite": {
        "codeQualite": "Membre",
        "libQualite": "Membre",
        "libQualiteSex": "Membre"
      },
      "organesRefs": [
        "PO393283"
      ]
    },
    {
      "xsiType": "MandatSimple_Type",
      "uid": "PM395695",
      "acteurRef": "PA546",
      "legislature": "13",
      "typeOrgane": "GA",
      "dateDebut": "2007-09-27T02:00:00.000+02:00",
      "dateFin": "2012-06-19T02:00:00.000+02:00",
      "preseance": "1",
      "nominPrincipale": "1",
      "infosQualite": {
        "codeQualite": "Président",
        "libQualite": "Président",
        "libQualiteSex": "Président"
      },
      "organesRefs": [
        "PO393283"
      ]
    },
    {
      "xsiType": "MandatSimple_Type",
      "uid": "PM395751",
      "acteurRef": "PA546",
      "legislature": "13",
      "typeOrgane": "API",
      "dateDebut": "2007-10-01T02:00:00.000+02:00",
      "datePublication": "2007-10-02T02:00:00.000+02:00",
      "dateFin": "2012-06-19T02:00:00.000+02:00",
      "preseance": "20",
      "nominPrincipale": "1",
      "infosQualite": {
        "codeQualite": "Titulaire",
        "libQualite": "Membre titulaire",
        "libQualiteSex": "Membre titulaire"
      },
      "organesRefs": [
        "PO304272"
      ]
    },
    {
      "xsiType": "MandatSimple_Type",
      "uid": "PM395783",
      "acteurRef": "PA546",
      "legislature": "13",
      "typeOrgane": "API",
      "dateDebut": "2007-10-01T02:00:00.000+02:00",
      "datePublication": "2007-10-02T02:00:00.000+02:00",
      "dateFin": "2012-06-19T02:00:00.000+02:00",
      "preseance": "20",
      "nominPrincipale": "1",
      "infosQualite": {
        "codeQualite": "Titulaire",
        "libQualite": "Représentant titulaire",
        "libQualiteSex": "Représentant titulaire"
      },
      "organesRefs": [
        "PO58977"
      ]
    },
    {
      "xsiType": "MandatSimple_Type",
      "uid": "PM399776",
      "acteurRef": "PA546",
      "legislature": "13",
      "typeOrgane": "GA",
      "dateDebut": "2007-10-17T02:00:00.000+02:00",
      "dateFin": "2012-06-19T02:00:00.000+02:00",
      "preseance": "20",
      "nominPrincipale": "1",
      "infosQualite": {
        "codeQualite": "Membre",
        "libQualite": "Membre",
        "libQualiteSex": "Membre"
      },
      "organesRefs": [
        "PO392669"
      ]
    },
    {
      "xsiType": "MandatSimple_Type",
      "uid": "PM399777",
      "acteurRef": "PA546",
      "legislature": "13",
      "typeOrgane": "GA",
      "dateDebut": "2007-10-17T02:00:00.000+02:00",
      "dateFin": "2012-06-19T02:00:00.000+02:00",
      "preseance": "20",
      "nominPrincipale": "1",
      "infosQualite": {
        "codeQualite": "Membre",
        "libQualite": "Membre",
        "libQualiteSex": "Membre"
      },
      "organesRefs": [
        "PO392699"
      ]
    },
    {
      "xsiType": "MandatSimple_Type",
      "uid": "PM399778",
      "acteurRef": "PA546",
      "legislature": "13",
      "typeOrgane": "GA",
      "dateDebut": "2007-10-17T02:00:00.000+02:00",
      "dateFin": "2012-06-19T02:00:00.000+02:00",
      "preseance": "20",
      "nominPrincipale": "1",
      "infosQualite": {
        "codeQualite": "Membre",
        "libQualite": "Membre",
        "libQualiteSex": "Membre"
      },
      "organesRefs": [
        "PO392950"
      ]
    },
    {
      "xsiType": "MandatSimple_Type",
      "uid": "PM399779",
      "acteurRef": "PA546",
      "legislature": "13",
      "typeOrgane": "GA",
      "dateDebut": "2007-10-17T02:00:00.000+02:00",
      "dateFin": "2012-06-19T02:00:00.000+02:00",
      "preseance": "20",
      "nominPrincipale": "1",
      "infosQualite": {
        "codeQualite": "Membre",
        "libQualite": "Membre",
        "libQualiteSex": "Membre"
      },
      "organesRefs": [
        "PO393065"
      ]
    },
    {
      "xsiType": "MandatSimple_Type",
      "uid": "PM399780",
      "acteurRef": "PA546",
      "legislature": "13",
      "typeOrgane": "GA",
      "dateDebut": "2007-10-17T02:00:00.000+02:00",
      "dateFin": "2012-06-19T02:00:00.000+02:00",
      "preseance": "20",
      "nominPrincipale": "1",
      "infosQualite": {
        "codeQualite": "Membre",
        "libQualite": "Membre",
        "libQualiteSex": "Membre"
      },
      "organesRefs": [
        "PO393075"
      ]
    },
    {
      "xsiType": "MandatSimple_Type",
      "uid": "PM402540",
      "acteurRef": "PA546",
      "legislature": "13",
      "typeOrgane": "GA",
      "dateDebut": "2007-11-07T01:00:00.000+01:00",
      "dateFin": "2012-06-19T02:00:00.000+02:00",
      "preseance": "8",
      "nominPrincipale": "1",
      "infosQualite": {
        "codeQualite": "Vice-Président",
        "libQualite": "Vice-Président",
        "libQualiteSex": "Vice-Président"
      },
      "organesRefs": [
        "PO392669"
      ]
    },
    {
      "xsiType": "MandatSimple_Type",
      "uid": "PM404624",
      "acteurRef": "PA546",
      "legislature": "13",
      "typeOrgane": "GE",
      "dateDebut": "2007-11-30T01:00:00.000+01:00",
      "dateFin": "2012-06-19T02:00:00.000+02:00",
      "preseance": "20",
      "nominPrincipale": "0",
      "infosQualite": {
        "codeQualite": "Membre",
        "libQualite": "Membre",
        "libQualiteSex": "Membre"
      },
      "organesRefs": [
        "PO403283"
      ]
    },
    {
      "xsiType": "MandatSimple_Type",
      "uid": "PM404625",
      "acteurRef": "PA546",
      "legislature": "13",
      "typeOrgane": "GE",
      "dateDebut": "2007-11-30T01:00:00.000+01:00",
      "dateFin": "2012-06-19T02:00:00.000+02:00",
      "preseance": "4",
      "nominPrincipale": "1",
      "infosQualite": {
        "codeQualite": "Co-Président",
        "libQualite": "Co-Président",
        "libQualiteSex": "Co-Président"
      },
      "organesRefs": [
        "PO403283"
      ]
    },
    {
      "xsiType": "MandatSimple_Type",
      "uid": "PM408170",
      "acteurRef": "PA546",
      "legislature": "13",
      "typeOrgane": "GE",
      "dateDebut": "2008-02-01T01:00:00.000+01:00",
      "dateFin": "2012-06-19T02:00:00.000+02:00",
      "preseance": "20",
      "nominPrincipale": "1",
      "infosQualite": {
        "codeQualite": "Membre",
        "libQualite": "Membre",
        "libQualiteSex": "Membre"
      },
      "organesRefs": [
        "PO403160"
      ]
    },
    {
      "xsiType": "MandatSimple_Type",
      "uid": "PM410287",
      "acteurRef": "PA546",
      "legislature": "13",
      "typeOrgane": "GE",
      "dateDebut": "2008-02-05T01:00:00.000+01:00",
      "dateFin": "2012-06-19T02:00:00.000+02:00",
      "preseance": "20",
      "nominPrincipale": "1",
      "infosQualite": {
        "codeQualite": "Membre",
        "libQualite": "Membre",
        "libQualiteSex": "Membre"
      },
      "organesRefs": [
        "PO403319"
      ]
    },
    {
      "xsiType": "MandatMission_Type",
      "uid": "PM422302",
      "acteurRef": "PA546",
      "legislature": "13",
      "typeOrgane": "MINISTERE",
      "dateDebut": "2009-11-10T01:00:00.000+01:00",
      "datePublication": "2009-11-13T01:00:00.000+01:00",
      "dateFin": "2010-03-01T01:00:00.000+01:00",
      "preseance": "1",
      "nominPrincipale": "1",
      "infosQualite": {
        "codeQualite": "en mission",
        "libQualite": "en mission",
        "libQualiteSex": "en mission"
      },
      "organesRefs": [
        "PO388143"
      ],
      "libelle": "La desserte des ports"
    },
    {
      "xsiType": "MandatMission_Type",
      "uid": "PM473449",
      "acteurRef": "PA546",
      "legislature": "13",
      "typeOrgane": "MINISTERE",
      "dateDebut": "2012-01-10T01:00:00.000+01:00",
      "datePublication": "2012-01-11T01:00:00.000+01:00",
      "dateFin": "2012-05-10T02:00:00.000+02:00",
      "preseance": "1",
      "nominPrincipale": "1",
      "infosQualite": {
        "codeQualite": "en mission",
        "libQualite": "en mission",
        "libQualiteSex": "en mission"
      },
      "organesRefs": [
        "PO425720",
        "PO429241"
      ],
      "libelle": "Politique énergétique"
    }
  ]
}