{
  "uid": "PA1282",
  "etatCivil": {
    "ident": {
      "civ": "M.",
      "prenom": "Pierre",
      "nom": "Fauchon",
      "alpha": "FAUCHON"
    },
    "infoNaissance": {
      "dateNais": "1929-07-13T01:00:00.000+01:00"
    },
    "dateDeces": "2016-07-25T02:00:00.000+02:00"
  },
  "profession": {
    "socProcInsee": {}
  },
  "adresses": [
    {
      "xsiType": "AdresseSiteWeb_Type",
      "uid": "AD317500",
      "type": "23",
      "typeLibelle": "Url sénateur",
      "valElec": "https://www.senat.fr/senateur/fauchon_pierre92022n.html"
    }
  ],
  "mandats": [
    {
      "xsiType": "MandatParlementaire_type",
      "uid": "PM227113",
      "acteurRef": "PA1282",
      "typeOrgane": "SENAT",
      "dateDebut": "2001-10-01T02:00:00.000+02:00",
      "datePublication": "2001-10-02T02:00:00.000+02:00",
      "dateFin": "2011-01-23T01:00:00.000+01:00",
      "preseance": "20",
      "nominPrincipale": "1",
      "infosQualite": {
        "codeQualite": "Sénateur",
        "libQualite": "SENATEUR",
        "libQualiteSex": "SENATEUR"
      },
      "organesRefs": [
        "PO78718"
      ],
      "election": {
        "lieu": {
          "numDepartement": "41"
        }
      },
      "mandature": {
        "premiereElection": "0"
      }
    },
    {
      "xsiType": "MandatSimple_Type",
      "uid": "PM229150",
      "acteurRef": "PA1282",
      "typeOrgane": "API",
      "dateDebut": "2001-12-12T01:00:00.000+01:00",
      "dateFin": "2007-07-25T02:00:00.000+02:00",
      "preseance": "20",
      "nominPrincipale": "1",
      "infosQualite": {
        "codeQualite": "Membre",
        "libQualite": "Membre",
        "libQualiteSex": "Membre"
      },
      "organesRefs": [
        "PO58976"
      ]
    },
    {
      "xsiType": "MandatSimple_Type",
      "uid": "PM307843",
      "acteurRef": "PA1282",
      "typeOrgane": "HCJ",
      "dateDebut": "2004-10-26T02:00:00.000+02:00",
      "datePublication": "2004-10-27T02:00:00.000+02:00",
      "dateFin": "2011-01-23T01:00:00.000+01:00",
      "preseance": "5",
      "nominPrincipale": "1",
      "infosQualite": {
        "codeQualite": "Juge suppléant",
        "libQualite": "Juge suppléant",
        "libQualiteSex": "Juge suppléant"
      },
      "organesRefs": [
        "PO60112"
      ]
    },
    {
      "xsiType": "MandatAvecSuppleant_Type",
      "uid": "PM307846",
      "acteurRef": "PA1282",
      "typeOrgane": "CJR",
      "dateDebut": "2004-10-26T02:00:00.000+02:00",
      "datePublication": "2004-10-27T02:00:00.000+02:00",
      "dateFin": "2008-10-21T02:00:00.000+02:00",
      "preseance": "1",
      "nominPrincipale": "1",
      "infosQualite": {
        "codeQualite": "Juge titulaire",
        "libQualite": "Juge titulaire",
        "libQualiteSex": "Juge titulaire"
      },
      "organesRefs": [
        "PO58996"
      ]
    },
    {
      "xsiType": "MandatSimple_Type",
      "uid": "PM308946",
      "acteurRef": "PA1282",
      "typeOrgane": "COMSENAT",
      "dateDebut": "2004-10-06T02:00:00.000+02:00",
      "dateFin": "2011-01-12T01:00:00.000+01:00",
      "preseance": "10",
      "nominPrincipale": "1",
      "infosQualite": {
        "codeQualite": "Membre",
        "libQualite": "Membre",
        "libQualiteSex": "Membre"
      },
      "organesRefs": [
        "PO211495"
      ]
    },
    {
      "xsiType": "MandatSimple_Type",
      "uid": "PM309483",
      "acteurRef": "PA1282",
      "typeOrgane": "GROUPESENAT",
      "dateDebut": "2011-10-01T02:00:00.000+02:00",
      "dateFin": "2016-07-25T02:00:00.000+02:00",
      "preseance": "4",
      "nominPrincipale": "1",
      "infosQualite": {
        "codeQualite": "Membre",
        "libQualite": "Membre",
        "libQualiteSex": "Membre"
      },
      "organesRefs": [
        "PO309463"
      ]
    },
    {
      "xsiType": "MandatSimple_Type",
      "uid": "PM318569",
      "acteurRef": "PA1282",
      "typeOrgane": "DELEGSENAT",
      "dateDebut": "2001-10-10T02:00:00.000+02:00",
      "dateFin": "2008-10-07T02:00:00.000+02:00",
      "preseance": "4",
      "nominPrincipale": "1",
      "infosQualite": {
        "codeQualite": "Membre",
        "libQualite": "Membre",
        "libQualiteSex": "Membre"
      },
      "organesRefs": [
        "PO317934"
      ]
    },
    {
      "xsiType": "MandatSimple_Type",
      "uid": "PM394044",
      "acteurRef": "PA1282",
      "typeOrgane": "API",
      "dateDebut": "2007-07-25T02:00:00.000+02:00",
      "dateFin": "2011-01-23T01:00:00.000+01:00",
      "preseance": "20",
      "nominPrincipale": "1",
      "infosQualite": {
        "codeQualite": "Membre",
        "libQualite": "Membre",
        "libQualiteSex": "Membre"
      },
      "organesRefs": [
        "PO58976"
      ]
    },
    {
      "xsiType": "MandatSimple_Type",
      "uid": "PM399546",
      "acteurRef": "PA1282",
      "typeOrgane": "CMP",
      "dateDebut": "2007-10-11T02:00:00.000+02:00",
      "datePublication": "2007-10-12T02:00:00.000+02:00",
      "dateFin": "2007-10-23T02:00:00.000+02:00",
      "preseance": "20",
      "nominPrincipale": "1",
      "infosQualite": {
        "codeQualite": "Titulaire",
        "libQualite": "Membre titulaire",
        "libQualiteSex": "Membre titulaire"
      },
      "organesRefs": [
        "PO396511"
      ]
    },
    {
      "xsiType": "MandatSimple_Type",
      "uid": "PM408132",
      "acteurRef": "PA1282",
      "typeOrgane": "CMP",
      "dateDebut": "2008-02-01T01:00:00.000+01:00",
      "dateFin": "2008-02-07T01:00:00.000+01:00",
      "preseance": "20",
      "nominPrincipale": "1",
      "infosQualite": {
        "codeQualite": "Titulaire",
        "libQualite": "Membre titulaire",
        "libQualiteSex": "Membre titulaire"
      },
      "organesRefs": [
        "PO408111"
      ]
    },
    {
      "xsiType": "MandatSimple_Type",
      "uid": "PM415244",
      "acteurRef": "PA1282",
      "typeOrgane": "API",
      "dateDebut": "2004-10-01T02:00:00.000+02:00",
      "dateFin": "2011-01-23T01:00:00.000+01:00",
      "preseance": "20",
      "nominPrincipale": "1",
      "infosQualite": {
        "codeQualite": "Membre",
        "libQualite": "Membre",
        "libQualiteSex": "Membre"
      },
      "organesRefs": [
        "PO206064"
      ]
    },
    {
      "xsiType": "MandatAvecSuppleant_Type",
      "uid": "PM416287",
      "acteurRef": "PA1282",
      "typeOrgane": "CJR",
      "dateDebut": "2008-10-21T02:00:00.000+02:00",
      "datePublication": "2008-10-22T02:00:00.000+02:00",
      "dateFin": "2011-01-23T01:00:00.000+01:00",
      "preseance": "1",
      "nominPrincipale": "1",
      "infosQualite": {
        "codeQualite": "Juge titulaire",
        "libQualite": "Juge titulaire",
        "libQualiteSex": "Juge titulaire"
      },
      "organesRefs": [
        "PO58996"
      ]
    },
    {
      "xsiType": "MandatSimple_Type",
      "uid": "PM418154",
      "acteurRef": "PA1282",
      "typeOrgane": "API",
      "dateDebut": "2009-01-14T01:00:00.000+01:00",
      "dateFin": "2011-01-23T01:00:00.000+01:00",
      "preseance": "4",
      "nominPrincipale": "1",
      "infosQualite": {
        "codeQualite": "Vice-Président",
        "libQualite": "Vice-Président",
        "libQualiteSex": "Vice-Président"
      },
      "organesRefs": [
        "PO58976"
      ]
    },
    {
      "xsiType": "MandatSimple_Type",
      "uid": "PM421788",
      "acteurRef": "PA1282",
      "typeOrgane": "CMP",
      "dateDebut": "2009-09-29T02:00:00.000+02:00",
      "datePublication": "2009-10-01T02:00:00.000+02:00",
      "dateFin": "2009-10-26T01:00:00.000+01:00",
      "preseance": "28",
      "nominPrincipale": "1",
      "infosQualite": {
        "codeQualite": "Suppléant",
        "libQualite": "Membre suppléant",
        "libQualiteSex": "Membre suppléant"
      },
      "organesRefs": [
        "PO421633"
      ]
    },
    {
      "xsiType": "MandatSimple_Type",
      "uid": "PM423471",
      "acteurRef": "PA1282",
      "typeOrgane": "CMP",
      "dateDebut": "2010-03-31T02:00:00.000+02:00",
      "datePublication": "2010-04-02T02:00:00.000+02:00",
      "dateFin": "2010-07-06T02:00:00.000+02:00",
      "preseance": "20",
      "nominPrincipale": "1",
      "infosQualite": {
        "codeQualite": "Titulaire",
        "libQualite": "Membre titulaire",
        "libQualiteSex": "Membre titulaire"
      },
      "organesRefs": [
        "PO423169"
      ]
    },
    {
      "xsiType": "MandatSimple_Type",
      "uid": "PM423500",
      "acteurRef": "PA1282",
      "typeOrgane": "CMP",
      "dateDebut": "2010-03-31T02:00:00.000+02:00",
      "datePublication": "2010-04-02T02:00:00.000+02:00",
      "dateFin": "2010-07-06T02:00:00.000+02:00",
      "preseance": "20",
      "nominPrincipale": "1",
      "infosQualite": {
        "codeQualite": "Titulaire",
        "libQualite": "Membre titulaire",
        "libQualiteSex": "Membre titulaire"
      },
      "organesRefs": [
        "PO423176"
      ]
    },
    {
      "xsiType": "MandatSimple_Type",
      "uid": "PM426523",
      "acteurRef": "PA1282",
      "typeOrgane": "COMSENAT",
      "dateDebut": "2011-01-13T01:00:00.000+01:00",
      "dateFin": "2011-01-23T01:00:00.000+01:00",
      "preseance": "10",
      "nominPrincipale": "1",
      "infosQualite": {
        "codeQualite": "Membre",
        "libQualite": "Membre",
        "libQualiteSex": "Membre"
      },
      "organesRefs": [
        "PO211490"
      ]
    }
  ]
}