{
  "xsiType": "OrganeParlementaire_Type",
  "uid": "PO686354",
  "codeType": "GE",
  "libelle": "Pêche de loisir et protection du milieu aquatique",
  "libelleEdition": "Pêche de loisir et protection du milieu aquatique",
  "libelleAbrege": "Pêche de loisir et protection du milieu aquatique",
  "libelleAbrev": "PÊCHE LOIS",
  "viMoDe": {
    "dateAgrement": "2012-11-14T01:00:00.000+01:00",
    "dateFin": "2017-06-20T02:00:00.000+02:00"
  },
  "regime": "5ème République",
  "legislature": "14",
  "secretariat": {}
}