{
  "xsiType": "OrganeExtraParlementaire_type",
  "uid": "PO394839",
  "codeType": "ORGEXTPARL",
  "libelle": "Comité consultatif des subventions aux exploitants d'aérodromes",
  "libelleEdition": "du Comité consultatif des subventions aux exploitants d'aérodromes",
  "libelleAbrege": "Aérodromes",
  "libelleAbrev": "223",
  "viMoDe": {
    "dateDebut": "2005-05-16T02:00:00.000+02:00",
    "dateFin": "2012-05-14T02:00:00.000+02:00"
  },
  "regime": "5ème République",
  "regimeJuridique": "article D. 213-3 du code de l'aviation civile"
}