{
  "uid": "PA335532",
  "etatCivil": {
    "ident": {
      "civ": "Mme",
      "prenom": "George",
      "nom": "Pau-Langevin",
      "alpha": "PauLangevin",
      "trigramme": "GPA"
    },
    "infoNaissance": {
      "dateNais": "1948-10-19T01:00:00.000+01:00",
      "villeNais": "Pointe-à-Pitre",
      "depNais": "Guadeloupe",
      "paysNais": "France"
    }
  },
  "profession": {
    "libelleCourant": "Avocat honoraire",
    "socProcInsee": {
      "catSocPro": "Professions libérales et assimilés",
      "famSocPro": "Cadres et professions intellectuelles supérieures"
    }
  },
  "uriHatvp": "https://www.hatvp.fr/pages_nominatives/pau-langevin-george",
  "adresses": [
    {
      "xsiType": "AdressePostale_Type",
      "uid": "AD386993",
      "type": "0",
      "typeLibelle": "Adresse officielle",
      "poids": "1",
      "intitule": "Assemblée nationale,",
      "numeroRue": "126",
      "nomRue": "Rue de l'Université,",
      "codePostal": "75355",
      "ville": "Paris 07 SP"
    },
    {
      "xsiType": "AdressePostale_Type",
      "uid": "AD714822",
      "type": "2",
      "typeLibelle": "Adresse publiée de circonscription",
      "poids": "2",
      "intitule": "Permanence parlementaire",
      "numeroRue": "8",
      "nomRue": "Rue de la Cour des Noues",
      "codePostal": "75020",
      "ville": "Paris"
    },
    {
      "xsiType": "AdresseTelephonique_Type",
      "uid": "AD714824",
      "type": "11",
      "typeLibelle": "Téléphone",
      "poids": "2",
      "adresseDeRattachement": "AD714822",
      "valElec": "01 43 15 61 24"
    },
    {
      "xsiType": "AdresseMail_Type",
      "uid": "AD716619",
      "type": "15",
      "typeLibelle": "Mèl",
      "valElec": "george.pau-langevin@assemblee-nationale.fr"
    },
    {
      "xsiType": "AdresseSiteWeb_Type",
      "uid": "AD725746",
      "type": "25",
      "typeLibelle": "Facebook",
      "valElec": "georgepaulange20"
    },
    {
      "xsiType": "AdresseMail_Type",
      "uid": "AD726252",
      "type": "15",
      "typeLibelle": "Mèl",
      "valElec": "georgepaulangevin@gmail.com"
    },
    {
      "xsiType": "AdresseSiteWeb_Type",
      "uid": "AD726318",
      "type": "24",
      "typeLibelle": "Twitter",
      "valElec": "@Pau_Langevin"
    },
    {
      "xsiType": "AdresseSiteWeb_Type",
      "uid": "AD726484",
      "type": "22",
      "typeLibelle": "Site internet",
      "valElec": "www.georgepaulangevin.fr"
    },
    {
      "xsiType": "AdresseTelephonique_Type",
      "uid": "AD757855",
      "type": "11",
      "typeLibelle": "Téléphone",
      "poids": "1",
      "adresseDeRattachement": "AD386993",
      "valElec": "01.40.63.92.52"
    }
  ],
  "mandats": [
    {
      "xsiType": "MandatParlementaire_type",
      "uid": "PM386450",
      "acteurRef": "PA335532",
      "legislature": "13",
      "typeOrgane": "ASSEMBLEE",
      "dateDebut": "2007-06-20T02:00:00.000+02:00",
      "dateFin": "2012-06-16T02:00:00.000+02:00",
      "preseance": "50",
      "nominPrincipale": "1",
      "infosQualite": {
        "codeQualite": "membre",
        "libQualite": "membre",
        "libQualiteSex": "membre"
      },
      "organesRefs": [
        "PO384266"
      ],
      "suppleant": {
        "dateDebut": "2007-06-20T02:00:00.000+02:00",
        "dateFin": "2012-06-16T02:00:00.000+02:00",
        "suppleantRef": "PA324"
      },
      "election": {
        "lieu": {
          "region": "Ile-de-France",
          "regionType": "Métropolitain",
          "departement": "Paris",
          "numDepartement": "75",
          "numCirco": "21"
        },
        "causeMandat": "élections générales",
        "refCirconscription": "PO384682"
      },
      "mandature": {
        "datePriseFonction": "2007-06-20T02:00:00.000+02:00",
        "causeFin": "Nomination comme membre du Gouvernement",
        "premiereElection": "0",
        "placeHemicycle": "511"
      }
    },
    {
      "xsiType": "MandatSimple_Type",
      "uid": "PM387572",
      "acteurRef": "PA335532",
      "legislature": "13",
      "typeOrgane": "GP",
      "dateDebut": "2007-06-20T02:00:00.000+02:00",
      "dateFin": "2007-06-26T02:00:00.000+02:00",
      "preseance": "28",
      "nominPrincipale": "1",
      "infosQualite": {
        "codeQualite": "Député non-inscrit",
        "libQualite": "Député non-inscrit",
        "libQualiteSex": "Députée non-inscrite"
      },
      "organesRefs": [
        "PO387155"
      ]
    },
    {
      "xsiType": "MandatSimple_Type",
      "uid": "PM390063",
      "acteurRef": "PA335532",
      "legislature": "13",
      "typeOrgane": "GP",
      "dateDebut": "2007-06-27T02:00:00.000+02:00",
      "datePublication": "2007-06-27T02:00:00.000+02:00",
      "dateFin": "2012-06-16T02:00:00.000+02:00",
      "preseance": "20",
      "nominPrincipale": "1",
      "infosQualite": {
        "codeQualite": "Membre",
        "libQualite": "Membre du",
        "libQualiteSex": "Membre du"
      },
      "organesRefs": [
        "PO389507"
      ]
    },
    {
      "xsiType": "MandatSimple_Type",
      "uid": "PM390785",
      "acteurRef": "PA335532",
      "legislature": "13",
      "typeOrgane": "COMPER",
      "dateDebut": "2007-06-27T02:00:00.000+02:00",
      "datePublication": "2007-06-28T02:00:00.000+02:00",
      "dateFin": "2012-06-16T02:00:00.000+02:00",
      "preseance": "32",
      "nominPrincipale": "1",
      "infosQualite": {
        "codeQualite": "Membre",
        "libQualite": "Membre",
        "libQualiteSex": "Membre"
      },
      "organesRefs": [
        "PO59051"
      ]
    },
    {
      "xsiType": "MandatSimple_Type",
      "uid": "PM395264",
      "acteurRef": "PA335532",
      "legislature": "13",
      "typeOrgane": "GA",
      "dateDebut": "2007-09-07T02:00:00.000+02:00",
      "dateFin": "2012-06-16T02:00:00.000+02:00",
      "preseance": "20",
      "nominPrincipale": "0",
      "infosQualite": {
        "codeQualite": "Membre",
        "libQualite": "Membre",
        "libQualiteSex": "Membre"
      },
      "organesRefs": [
        "PO393025"
      ]
    },
    {
      "xsiType": "MandatSimple_Type",
      "uid": "PM395265",
      "acteurRef": "PA335532",
      "legislature": "13",
      "typeOrgane": "GA",
      "dateDebut": "2007-09-07T02:00:00.000+02:00",
      "dateFin": "2012-06-16T02:00:00.000+02:00",
      "preseance": "1",
      "nominPrincipale": "1",
      "infosQualite": {
        "codeQualite": "Président",
        "libQualite": "Président",
        "libQualiteSex": "Présidente"
      },
      "organesRefs": [
        "PO393025"
      ]
    },
    {
      "xsiType": "MandatSimple_Type",
      "uid": "PM397113",
      "acteurRef": "PA335532",
      "legislature": "13",
      "typeOrgane": "GA",
      "dateDebut": "2007-10-09T02:00:00.000+02:00",
      "dateFin": "2012-06-16T02:00:00.000+02:00",
      "preseance": "20",
      "nominPrincipale": "1",
      "infosQualite": {
        "codeQualite": "Membre",
        "libQualite": "Membre",
        "libQualiteSex": "Membre"
      },
      "organesRefs": [
        "PO392825"
      ]
    },
    {
      "xsiType": "MandatSimple_Type",
      "uid": "PM397974",
      "acteurRef": "PA335532",
      "legislature": "13",
      "typeOrgane": "CMP",
      "dateDebut": "2007-10-10T02:00:00.000+02:00",
      "datePublication": "2007-10-11T02:00:00.000+02:00",
      "dateFin": "2007-10-23T02:00:00.000+02:00",
      "preseance": "20",
      "nominPrincipale": "1",
      "infosQualite": {
        "codeQualite": "Titulaire",
        "libQualite": "Membre titulaire",
        "libQualiteSex": "Membre titulaire"
      },
      "organesRefs": [
        "PO396511"
      ]
    },
    {
      "xsiType": "MandatSimple_Type",
      "uid": "PM401235",
      "acteurRef": "PA335532",
      "legislature": "13",
      "typeOrgane": "GA",
      "dateDebut": "2007-10-26T02:00:00.000+02:00",
      "dateFin": "2012-06-16T02:00:00.000+02:00",
      "preseance": "20",
      "nominPrincipale": "1",
      "infosQualite": {
        "codeQualite": "Membre",
        "libQualite": "Membre",
        "libQualiteSex": "Membre"
      },
      "organesRefs": [
        "PO393040"
      ]
    },
    {
      "xsiType": "MandatSimple_Type",
      "uid": "PM401745",
      "acteurRef": "PA335532",
      "legislature": "13",
      "typeOrgane": "GA",
      "dateDebut": "2007-10-29T01:00:00.000+01:00",
      "dateFin": "2012-06-16T02:00:00.000+02:00",
      "preseance": "20",
      "nominPrincipale": "1",
      "infosQualite": {
        "codeQualite": "Membre",
        "libQualite": "Membre",
        "libQualiteSex": "Membre"
      },
      "organesRefs": [
        "PO392659"
      ]
    },
    {
      "xsiType": "MandatSimple_Type",
      "uid": "PM401746",
      "acteurRef": "PA335532",
      "legislature": "13",
      "typeOrgane": "GA",
      "dateDebut": "2007-10-29T01:00:00.000+01:00",
      "dateFin": "2012-06-16T02:00:00.000+02:00",
      "preseance": "20",
      "nominPrincipale": "1",
      "infosQualite": {
        "codeQualite": "Membre",
        "libQualite": "Membre",
        "libQualiteSex": "Membre"
      },
      "organesRefs": [
        "PO392669"
      ]
    },
    {
      "xsiType": "MandatSimple_Type",
      "uid": "PM401747",
      "acteurRef": "PA335532",
      "legislature": "13",
      "typeOrgane": "GA",
      "dateDebut": "2007-10-29T01:00:00.000+01:00",
      "dateFin": "2012-06-16T02:00:00.000+02:00",
      "preseance": "20",
      "nominPrincipale": "1",
      "infosQualite": {
        "codeQualite": "Membre",
        "libQualite": "Membre",
        "libQualiteSex": "Membre"
      },
      "organesRefs": [
        "PO392800"
      ]
    },
    {
      "xsiType": "MandatSimple_Type",
      "uid": "PM401748",
      "acteurRef": "PA335532",
      "legislature": "13",
      "typeOrgane": "GA",
      "dateDebut": "2007-10-29T01:00:00.000+01:00",
      "dateFin": "2012-06-16T02:00:00.000+02:00",
      "preseance": "20",
      "nominPrincipale": "1",
      "infosQualite": {
        "codeQualite": "Membre",
        "libQualite": "Membre",
        "libQualiteSex": "Membre"
      },
      "organesRefs": [
        "PO393075"
      ]
    },
    {
      "xsiType": "MandatSimple_Type",
      "uid": "PM401749",
      "acteurRef": "PA335532",
      "legislature": "13",
      "typeOrgane": "GA",
      "dateDebut": "2007-10-29T01:00:00.000+01:00",
      "dateFin": "2012-06-16T02:00:00.000+02:00",
      "preseance": "20",
      "nominPrincipale": "1",
      "infosQualite": {
        "codeQualite": "Membre",
        "libQualite": "Membre",
        "libQualiteSex": "Membre"
      },
      "organesRefs": [
        "PO393130"
      ]
    },
    {
      "xsiType": "MandatSimple_Type",
      "uid": "PM401750",
      "acteurRef": "PA335532",
      "legislature": "13",
      "typeOrgane": "GA",
      "dateDebut": "2007-10-29T01:00:00.000+01:00",
      "dateFin": "2012-06-16T02:00:00.000+02:00",
      "preseance": "20",
      "nominPrincipale": "1",
      "infosQualite": {
        "codeQualite": "Membre",
        "libQualite": "Membre",
        "libQualiteSex": "Membre"
      },
      "organesRefs": [
        "PO393182"
      ]
    },
    {
      "xsiType": "MandatSimple_Type",
      "uid": "PM401751",
      "acteurRef": "PA335532",
      "legislature": "13",
      "typeOrgane": "GA",
      "dateDebut": "2007-10-29T01:00:00.000+01:00",
      "dateFin": "2012-06-16T02:00:00.000+02:00",
      "preseance": "20",
      "nominPrincipale": "1",
      "infosQualite": {
        "codeQualite": "Membre",
        "libQualite": "Membre",
        "libQualiteSex": "Membre"
      },
      "organesRefs": [
        "PO393192"
      ]
    },
    {
      "xsiType": "MandatSimple_Type",
      "uid": "PM401752",
      "acteurRef": "PA335532",
      "legislature": "13",
      "typeOrgane": "GA",
      "dateDebut": "2007-10-29T01:00:00.000+01:00",
      "dateFin": "2012-06-16T02:00:00.000+02:00",
      "preseance": "20",
      "nominPrincipale": "1",
      "infosQualite": {
        "codeQualite": "Membre",
        "libQualite": "Membre",
        "libQualiteSex": "Membre"
      },
      "organesRefs": [
        "PO393338"
      ]
    },
    {
      "xsiType": "MandatSimple_Type",
      "uid": "PM401753",
      "acteurRef": "PA335532",
      "legislature": "13",
      "typeOrgane": "GA",
      "dateDebut": "2007-10-29T01:00:00.000+01:00",
      "dateFin": "2012-06-16T02:00:00.000+02:00",
      "preseance": "20",
      "nominPrincipale": "1",
      "infosQualite": {
        "codeQualite": "Membre",
        "libQualite": "Membre",
        "libQualiteSex": "Membre"
      },
      "organesRefs": [
        "PO393358"
      ]
    },
    {
      "xsiType": "MandatSimple_Type",
      "uid": "PM401754",
      "acteurRef": "PA335532",
      "legislature": "13",
      "typeOrgane": "GA",
      "dateDebut": "2007-10-29T01:00:00.000+01:00",
      "dateFin": "2012-06-16T02:00:00.000+02:00",
      "preseance": "20",
      "nominPrincipale": "1",
      "infosQualite": {
        "codeQualite": "Membre",
        "libQualite": "Membre",
        "libQualiteSex": "Membre"
      },
      "organesRefs": [
        "PO393468"
      ]
    },
    {
      "xsiType": "MandatSimple_Type",
      "uid": "PM403402",
      "acteurRef": "PA335532",
      "legislature": "13",
      "typeOrgane": "API",
      "dateDebut": "2007-11-08T01:00:00.000+01:00",
      "datePublication": "2007-11-09T01:00:00.000+01:00",
      "dateFin": "2012-06-16T02:00:00.000+02:00",
      "preseance": "20",
      "nominPrincipale": "1",
      "infosQualite": {
        "codeQualite": "Membre",
        "libQualite": "Membre",
        "libQualiteSex": "Membre"
      },
      "organesRefs": [
        "PO201115"
      ]
    },
    {
      "xsiType": "MandatMission_Type",
      "uid": "PM411413",
      "acteurRef": "PA335532",
      "legislature": "13",
      "typeOrgane": "MISINFOPRE",
      "dateDebut": "2008-04-01T02:00:00.000+02:00",
      "datePublication": "2008-04-02T02:00:00.000+02:00",
      "dateFin": "2010-01-26T01:00:00.000+01:00",
      "preseance": "20",
      "nominPrincipale": "1",
      "infosQualite": {
        "codeQualite": "Membre",
        "libQualite": "Membre",
        "libQualiteSex": "Membre"
      },
      "organesRefs": [
        "PO411370"
      ]
    },
    {
      "xsiType": "MandatSimple_Type",
      "uid": "PM412733",
      "acteurRef": "PA335532",
      "legislature": "13",
      "typeOrgane": "CMP",
      "dateDebut": "2008-04-17T02:00:00.000+02:00",
      "datePublication": "2008-04-18T02:00:00.000+02:00",
      "dateFin": "2008-05-19T02:00:00.000+02:00",
      "preseance": "20",
      "nominPrincipale": "1",
      "infosQualite": {
        "codeQualite": "Titulaire",
        "libQualite": "Membre titulaire",
        "libQualiteSex": "Membre titulaire"
      },
      "organesRefs": [
        "PO412189"
      ]
    },
    {
      "xsiType": "MandatSimple_Type",
      "uid": "PM412923",
      "acteurRef": "PA335532",
      "legislature": "13",
      "typeOrgane": "GE",
      "dateDebut": "2008-04-09T02:00:00.000+02:00",
      "dateFin": "2012-06-16T02:00:00.000+02:00",
      "preseance": "20",
      "nominPrincipale": "1",
      "infosQualite": {
        "codeQualite": "Membre",
        "libQualite": "Membre",
        "libQualiteSex": "Membre"
      },
      "organesRefs": [
        "PO403154"
      ]
    },
    {
      "xsiType": "MandatSimple_Type",
      "uid": "PM416170",
      "acteurRef": "PA335532",
      "legislature": "13",
      "typeOrgane": "GE",
      "dateDebut": "2008-09-01T02:00:00.000+02:00",
      "dateFin": "2012-06-16T02:00:00.000+02:00",
      "preseance": "20",
      "nominPrincipale": "1",
      "infosQualite": {
        "codeQualite": "Membre",
        "libQualite": "Membre",
        "libQualiteSex": "Membre"
      },
      "organesRefs": [
        "PO402937"
      ]
    },
    {
      "xsiType": "MandatMission_Type",
      "uid": "PM420775",
      "acteurRef": "PA335532",
      "legislature": "13",
      "typeOrgane": "MISINFOPRE",
      "dateDebut": "2009-06-30T02:00:00.000+02:00",
      "datePublication": "2009-07-01T02:00:00.000+02:00",
      "dateFin": "2010-04-01T02:00:00.000+02:00",
      "preseance": "20",
      "nominPrincipale": "1",
      "infosQualite": {
        "codeQualite": "Membre",
        "libQualite": "Membre",
        "libQualiteSex": "Membre"
      },
      "organesRefs": [
        "PO419519"
      ]
    },
    {
      "xsiType": "MandatSimple_Type",
      "uid": "PM423093",
      "acteurRef": "PA335532",
      "legislature": "13",
      "typeOrgane": "CMP",
      "dateDebut": "2010-02-18T01:00:00.000+01:00",
      "datePublication": "2010-02-19T01:00:00.000+01:00",
      "dateFin": "2010-02-25T01:00:00.000+01:00",
      "preseance": "20",
      "nominPrincipale": "1",
      "infosQualite": {
        "codeQualite": "Titulaire",
        "libQualite": "Membre titulaire",
        "libQualiteSex": "Membre titulaire"
      },
      "organesRefs": [
        "PO423071"
      ]
    },
    {
      "xsiType": "MandatSimple_Type",
      "uid": "PM427612",
      "acteurRef": "PA335532",
      "legislature": "13",
      "typeOrgane": "CMP",
      "dateDebut": "2011-03-08T01:00:00.000+01:00",
      "datePublication": "2011-03-09T01:00:00.000+01:00",
      "dateFin": "2011-03-16T01:00:00.000+01:00",
      "preseance": "20",
      "nominPrincipale": "1",
      "infosQualite": {
        "codeQualite": "Titulaire",
        "libQualite": "Membre titulaire",
        "libQualiteSex": "Membre titulaire"
      },
      "organesRefs": [
        "PO427600"
      ]
    },
    {
      "xsiType": "MandatSimple_Type",
      "uid": "PM427646",
      "acteurRef": "PA335532",
      "legislature": "13",
      "typeOrgane": "CMP",
      "dateDebut": "2011-03-08T01:00:00.000+01:00",
      "datePublication": "2011-03-09T01:00:00.000+01:00",
      "dateFin": "2011-03-16T01:00:00.000+01:00",
      "preseance": "20",
      "nominPrincipale": "1",
      "infosQualite": {
        "codeQualite": "Titulaire",
        "libQualite": "Membre titulaire",
        "libQualiteSex": "Membre titulaire"
      },
      "organesRefs": [
        "PO427594"
      ]
    },
    {
      "xsiType": "MandatSimple_Type",
      "uid": "PM427974",
      "acteurRef": "PA335532",
      "legislature": "13",
      "typeOrgane": "CMP",
      "dateDebut": "2011-04-04T02:00:00.000+02:00",
      "datePublication": "2011-04-05T02:00:00.000+02:00",
      "dateFin": "2011-04-15T02:00:00.000+02:00",
      "preseance": "28",
      "nominPrincipale": "1",
      "infosQualite": {
        "codeQualite": "Suppléant",
        "libQualite": "Membre suppléant",
        "libQualiteSex": "Membre suppléante"
      },
      "organesRefs": [
        "PO427896"
      ]
    },
    {
      "xsiType": "MandatSimple_Type",
      "uid": "PM429127",
      "acteurRef": "PA335532",
      "legislature": "13",
      "typeOrgane": "CMP",
      "dateDebut": "2011-06-28T02:00:00.000+02:00",
      "datePublication": "2011-06-29T02:00:00.000+02:00",
      "dateFin": "2011-06-29T02:00:00.000+02:00",
      "preseance": "20",
      "nominPrincipale": "1",
      "infosQualite": {
        "codeQualite": "Titulaire",
        "libQualite": "Membre titulaire",
        "libQualiteSex": "Membre titulaire"
      },
      "organesRefs": [
        "PO429117"
      ]
    },
    {
      "xsiType": "MandatSimple_Type",
      "uid": "PM429361",
      "acteurRef": "PA335532",
      "legislature": "13",
      "typeOrgane": "CMP",
      "dateDebut": "2011-07-05T02:00:00.000+02:00",
      "datePublication": "2011-07-06T02:00:00.000+02:00",
      "dateFin": "2011-07-25T02:00:00.000+02:00",
      "preseance": "20",
      "nominPrincipale": "1",
      "infosQualite": {
        "codeQualite": "Titulaire",
        "libQualite": "Membre titulaire",
        "libQualiteSex": "Membre titulaire"
      },
      "organesRefs": [
        "PO429350"
      ]
    },
    {
      "xsiType": "MandatSimple_Type",
      "uid": "PM430725",
      "acteurRef": "PA335532",
      "legislature": "13",
      "typeOrgane": "CNPS",
      "dateDebut": "2011-10-12T02:00:00.000+02:00",
      "datePublication": "2011-10-14T02:00:00.000+02:00",
      "dateFin": "2012-05-21T02:00:00.000+02:00",
      "preseance": "20",
      "nominPrincipale": "1",
      "infosQualite": {
        "codeQualite": "Membre",
        "libQualite": "Membre",
        "libQualiteSex": "Membre"
      },
      "organesRefs": [
        "PO430584"
      ]
    },
    {
      "xsiType": "MandatSimple_Type",
      "uid": "PM430959",
      "acteurRef": "PA335532",
      "legislature": "13",
      "typeOrgane": "CMP",
      "dateDebut": "2011-11-04T01:00:00.000+01:00",
      "datePublication": "2011-11-05T01:00:00.000+01:00",
      "dateFin": "2011-11-10T01:00:00.000+01:00",
      "preseance": "20",
      "nominPrincipale": "1",
      "infosQualite": {
        "codeQualite": "Titulaire",
        "libQualite": "Membre titulaire",
        "libQualiteSex": "Membre titulaire"
      },
      "organesRefs": [
        "PO430883"
      ]
    },
    {
      "xsiType": "MandatSimple_Type",
      "uid": "PM506463",
      "acteurRef": "PA335532",
      "legislature": "13",
      "typeOrgane": "CMP",
      "dateDebut": "2012-02-15T01:00:00.000+01:00",
      "datePublication": "2012-02-16T01:00:00.000+01:00",
      "dateFin": "2012-03-01T01:00:00.000+01:00",
      "preseance": "20",
      "nominPrincipale": "1",
      "infosQualite": {
        "codeQualite": "Titulaire",
        "libQualite": "Membre titulaire",
        "libQualiteSex": "Membre titulaire"
      },
      "organesRefs": [
        "PO505313"
      ]
    },
    {
      "xsiType": "MandatSimple_Type",
      "uid": "PM591222",
      "acteurRef": "PA335532",
      "typeOrgane": "MINISTERE",
      "dateDebut": "2012-05-17T02:00:00.000+02:00",
      "datePublication": "2012-05-17T02:00:00.000+02:00",
      "dateFin": "2012-06-18T02:00:00.000+02:00",
      "preseance": "40",
      "nominPrincipale": "1",
      "infosQualite": {
        "codeQualite": "Ministre délégué",
        "libQualite": "Ministre délégué",
        "libQualiteSex": "Ministre déléguée"
      },
      "organesRefs": [
        "PO591220"
      ]
    },
    {
      "xsiType": "MandatParlementaire_type",
      "uid": "PM645082",
      "acteurRef": "PA335532",
      "legislature": "14",
      "typeOrgane": "ASSEMBLEE",
      "dateDebut": "2012-06-20T02:00:00.000+02:00",
      "dateFin": "2012-07-21T02:00:00.000+02:00",
      "preseance": "50",
      "nominPrincipale": "1",
      "infosQualite": {
        "codeQualite": "membre",
        "libQualite": "membre",
        "libQualiteSex": "membre"
      },
      "organesRefs": [
        "PO644420"
      ],
      "suppleant": {
        "dateDebut": "2012-06-20T02:00:00.000+02:00",
        "dateFin": "2012-07-21T02:00:00.000+02:00",
        "suppleantRef": "PA642940"
      },
      "election": {
        "lieu": {
          "region": "Ile-de-France",
          "regionType": "Métropolitain",
          "departement": "Paris",
          "numDepartement": "75",
          "numCirco": "15"
        },
        "causeMandat": "élections générales",
        "refCirconscription": "PO644830"
      },
      "mandature": {
        "datePriseFonction": "2012-06-20T02:00:00.000+02:00",
        "causeFin": "Nomination comme membre du Gouvernement",
        "premiereElection": "1",
        "placeHemicycle": "511"
      }
    },
    {
      "xsiType": "MandatSimple_Type",
      "uid": "PM653349",
      "acteurRef": "PA335532",
      "typeOrgane": "MINISTERE",
      "dateDebut": "2012-06-22T02:00:00.000+02:00",
      "datePublication": "2012-06-22T02:00:00.000+02:00",
      "dateFin": "2014-03-31T02:00:00.000+02:00",
      "preseance": "40",
      "nominPrincipale": "1",
      "infosQualite": {
        "codeQualite": "Ministre délégué",
        "libQualite": "Ministre délégué",
        "libQualiteSex": "Ministre déléguée"
      },
      "organesRefs": [
        "PO653347"
      ]
    },
    {
      "xsiType": "MandatSimple_Type",
      "uid": "PM656243",
      "acteurRef": "PA335532",
      "legislature": "14",
      "typeOrgane": "GP",
      "dateDebut": "2012-06-26T02:00:00.000+02:00",
      "datePublication": "2012-06-27T02:00:00.000+02:00",
      "dateFin": "2012-07-21T02:00:00.000+02:00",
      "preseance": "20",
      "nominPrincipale": "1",
      "infosQualite": {
        "codeQualite": "Membre",
        "libQualite": "Membre du",
        "libQualiteSex": "Membre du"
      },
      "organesRefs": [
        "PO656002"
      ]
    },
    {
      "xsiType": "MandatSimple_Type",
      "uid": "PM657496",
      "acteurRef": "PA335532",
      "legislature": "14",
      "typeOrgane": "COMPER",
      "dateDebut": "2012-06-28T02:00:00.000+02:00",
      "datePublication": "2012-06-28T02:00:00.000+02:00",
      "dateFin": "2012-07-21T02:00:00.000+02:00",
      "preseance": "32",
      "nominPrincipale": "1",
      "infosQualite": {
        "codeQualite": "Membre",
        "libQualite": "Membre",
        "libQualiteSex": "Membre"
      },
      "organesRefs": [
        "PO420120"
      ]
    },
    {
      "xsiType": "MandatSimple_Type",
      "uid": "PM700760",
      "acteurRef": "PA335532",
      "typeOrgane": "MINISTERE",
      "dateDebut": "2014-04-03T02:00:00.000+02:00",
      "datePublication": "2014-04-03T02:00:00.000+02:00",
      "dateFin": "2014-08-26T02:00:00.000+02:00",
      "preseance": "30",
      "nominPrincipale": "1",
      "infosQualite": {
        "codeQualite": "Ministre",
        "libQualite": "Ministre",
        "libQualiteSex": "Ministre"
      },
      "organesRefs": [
        "PO700758"
      ]
    },
    {
      "xsiType": "MandatSimple_Type",
      "uid": "PM702985",
      "acteurRef": "PA335532",
      "typeOrgane": "MINISTERE",
      "dateDebut": "2014-08-27T02:00:00.000+02:00",
      "datePublication": "2014-08-27T02:00:00.000+02:00",
      "dateFin": "2016-08-30T02:00:00.000+02:00",
      "preseance": "30",
      "nominPrincipale": "1",
      "infosQualite": {
        "codeQualite": "Ministre",
        "libQualite": "Ministre",
        "libQualiteSex": "Ministre"
      },
      "organesRefs": [
        "PO702936"
      ]
    },
    {
      "xsiType": "MandatParlementaire_type",
      "uid": "PM714818",
      "acteurRef": "PA335532",
      "legislature": "14",
      "typeOrgane": "ASSEMBLEE",
      "dateDebut": "2012-06-20T02:00:00.000+02:00",
      "dateFin": "2017-06-20T02:00:00.000+02:00",
      "preseance": "50",
      "nominPrincipale": "1",
      "infosQualite": {
        "codeQualite": "membre",
        "libQualite": "membre",
        "libQualiteSex": "membre"
      },
      "organesRefs": [
        "PO644420"
      ],
      "suppleant": {
        "dateDebut": "2012-06-20T02:00:00.000+02:00",
        "dateFin": "2017-06-20T02:00:00.000+02:00",
        "suppleantRef": "PA642940"
      },
      "election": {
        "lieu": {
          "region": "Ile-de-France",
          "regionType": "Métropolitain",
          "departement": "Paris",
          "numDepartement": "75",
          "numCirco": "15"
        },
        "causeMandat": "reprise de l'exercice du mandat d'un ancien membre du Gouvernement",
        "refCirconscription": "PO644830"
      },
      "mandature": {
        "datePriseFonction": "2016-10-01T02:00:00.000+02:00",
        "causeFin": "Fin de législature",
        "premiereElection": "1",
        "placeHemicycle": "511",
        "mandatRemplaceRef": "PM645082"
      }
    },
    {
      "xsiType": "MandatSimple_Type",
      "uid": "PM714819",
      "acteurRef": "PA335532",
      "legislature": "14",
      "typeOrgane": "GP",
      "dateDebut": "2016-10-01T02:00:00.000+02:00",
      "dateFin": "2017-06-20T02:00:00.000+02:00",
      "preseance": "20",
      "nominPrincipale": "1",
      "infosQualite": {
        "codeQualite": "Membre",
        "libQualite": "Membre du",
        "libQualiteSex": "Membre du"
      },
      "organesRefs": [
        "PO713077"
      ]
    },
    {
      "xsiType": "MandatSimple_Type",
      "uid": "PM714827",
      "acteurRef": "PA335532",
      "legislature": "14",
      "typeOrgane": "COMPER",
      "dateDebut": "2016-10-04T02:00:00.000+02:00",
      "datePublication": "2016-10-04T02:00:00.000+02:00",
      "dateFin": "2017-06-20T02:00:00.000+02:00",
      "preseance": "32",
      "nominPrincipale": "1",
      "infosQualite": {
        "codeQualite": "Membre",
        "libQualite": "Membre",
        "libQualiteSex": "Membre"
      },
      "organesRefs": [
        "PO420120"
      ]
    },
    {
      "xsiType": "MandatSimple_Type",
      "uid": "PM715723",
      "acteurRef": "PA335532",
      "typeOrgane": "PARPOL",
      "dateDebut": "2016-12-01T01:00:00.000+01:00",
      "dateFin": "2017-06-20T02:00:00.000+02:00",
      "preseance": "5",
      "nominPrincipale": "1",
      "infosQualite": {
        "codeQualite": "Membre",
        "libQualite": "Membre",
        "libQualiteSex": "Membre"
      },
      "organesRefs": [
        "PO684932"
      ]
    },
    {
      "xsiType": "MandatParlementaire_type",
      "uid": "PM723416",
      "acteurRef": "PA335532",
      "legislature": "15",
      "typeOrgane": "ASSEMBLEE",
      "dateDebut": "2017-06-18T02:00:00.000+02:00",
      "preseance": "50",
      "nominPrincipale": "1",
      "infosQualite": {
        "codeQualite": "membre",
        "libQualite": "membre",
        "libQualiteSex": "membre"
      },
      "organesRefs": [
        "PO717460"
      ],
      "suppleant": {
        "dateDebut": "2017-06-18T02:00:00.000+02:00",
        "suppleantRef": "PA721904"
      },
      "election": {
        "lieu": {
          "region": "Ile-de-France",
          "regionType": "Métropolitain",
          "departement": "Paris",
          "numDepartement": "75",
          "numCirco": "15"
        },
        "causeMandat": "élections générales",
        "refCirconscription": "PO718222"
      },
      "mandature": {
        "datePriseFonction": "2017-06-21T02:00:00.000+02:00",
        "premiereElection": "1",
        "placeHemicycle": "511"
      },
      "collaborateurs": [
        {
          "qualite": "M.",
          "prenom": "Jean",
          "nom": "Bourdeau"
        },
        {
          "qualite": "Mme",
          "prenom": "Margaux",
          "nom": "Wagner"
        },
        {
          "qualite": "M.",
          "prenom": "Ruben",
          "nom": "Rabinovitch"
        },
        {
          "qualite": "M.",
          "prenom": "Simon",
          "nom": "Guérand"
        },
        {
          "qualite": "M.",
          "prenom": "Pascal",
          "nom": "Joseph"
        }
      ]
    },
    {
      "xsiType": "MandatSimple_Type",
      "uid": "PM724749",
      "acteurRef": "PA335532",
      "legislature": "15",
      "typeOrgane": "GP",
      "dateDebut": "2017-06-21T02:00:00.000+02:00",
      "dateFin": "2017-06-26T02:00:00.000+02:00",
      "preseance": "28",
      "nominPrincipale": "1",
      "infosQualite": {
        "codeQualite": "Député non-inscrit",
        "libQualite": "Député non-inscrit",
        "libQualiteSex": "Députée non-inscrite"
      },
      "organesRefs": [
        "PO723569"
      ]
    },
    {
      "xsiType": "MandatSimple_Type",
      "uid": "PM731503",
      "acteurRef": "PA335532",
      "legislature": "15",
      "typeOrgane": "GP",
      "dateDebut": "2017-06-27T02:00:00.000+02:00",
      "datePublication": "2017-06-28T02:00:00.000+02:00",
      "dateFin": "2018-09-11T02:00:00.000+02:00",
      "preseance": "20",
      "nominPrincipale": "1",
      "infosQualite": {
        "codeQualite": "Membre",
        "libQualite": "Membre du",
        "libQualiteSex": "Membre du"
      },
      "organesRefs": [
        "PO730946"
      ]
    },
    {
      "xsiType": "MandatSimple_Type",
      "uid": "PM731889",
      "acteurRef": "PA335532",
      "legislature": "15",
      "typeOrgane": "COMPER",
      "dateDebut": "2017-06-29T02:00:00.000+02:00",
      "datePublication": "2017-06-29T02:00:00.000+02:00",
      "dateFin": "2019-02-12T01:00:00.000+01:00",
      "preseance": "32",
      "nominPrincipale": "1",
      "infosQualite": {
        "codeQualite": "Membre",
        "libQualite": "Membre",
        "libQualiteSex": "Membre"
      },
      "organesRefs": [
        "PO419604"
      ]
    },
    {
      "xsiType": "MandatSimple_Type",
      "uid": "PM732692",
      "acteurRef": "PA335532",
      "legislature": "15",
      "typeOrgane": "DELEG",
      "dateDebut": "2017-07-12T02:00:00.000+02:00",
      "datePublication": "2017-07-12T02:00:00.000+02:00",
      "preseance": "20",
      "nominPrincipale": "1",
      "infosQualite": {
        "codeQualite": "Membre",
        "libQualite": "Membre",
        "libQualiteSex": "Membre"
      },
      "organesRefs": [
        "PO675659"
      ]
    },
    {
      "xsiType": "MandatSimple_Type",
      "uid": "PM736550",
      "acteurRef": "PA335532",
      "legislature": "15",
      "typeOrgane": "GA",
      "dateDebut": "2017-10-02T02:00:00.000+02:00",
      "preseance": "20",
      "nominPrincipale": "1",
      "infosQualite": {
        "codeQualite": "Membre",
        "libQualite": "Membre",
        "libQualiteSex": "Membre"
      },
      "organesRefs": [
        "PO732964"
      ]
    },
    {
      "xsiType": "MandatSimple_Type",
      "uid": "PM736551",
      "acteurRef": "PA335532",
      "legislature": "15",
      "typeOrgane": "GA",
      "dateDebut": "2017-10-02T02:00:00.000+02:00",
      "preseance": "20",
      "nominPrincipale": "1",
      "infosQualite": {
        "codeQualite": "Membre",
        "libQualite": "Membre",
        "libQualiteSex": "Membre"
      },
      "organesRefs": [
        "PO733347"
      ]
    },
    {
      "xsiType": "MandatSimple_Type",
      "uid": "PM736552",
      "acteurRef": "PA335532",
      "legislature": "15",
      "typeOrgane": "GA",
      "dateDebut": "2017-10-02T02:00:00.000+02:00",
      "preseance": "20",
      "nominPrincipale": "1",
      "infosQualite": {
        "codeQualite": "Membre",
        "libQualite": "Membre",
        "libQualiteSex": "Membre"
      },
      "organesRefs": [
        "PO733562"
      ]
    },
    {
      "xsiType": "MandatSimple_Type",
      "uid": "PM736553",
      "acteurRef": "PA335532",
      "legislature": "15",
      "typeOrgane": "GA",
      "dateDebut": "2017-10-02T02:00:00.000+02:00",
      "preseance": "20",
      "nominPrincipale": "1",
      "infosQualite": {
        "codeQualite": "Membre",
        "libQualite": "Membre",
        "libQualiteSex": "Membre"
      },
      "organesRefs": [
        "PO733592"
      ]
    },
    {
      "xsiType": "MandatSimple_Type",
      "uid": "PM736554",
      "acteurRef": "PA335532",
      "legislature": "15",
      "typeOrgane": "GA",
      "dateDebut": "2017-10-02T02:00:00.000+02:00",
      "preseance": "20",
      "nominPrincipale": "0",
      "infosQualite": {
        "codeQualite": "Membre",
        "libQualite": "Membre",
        "libQualiteSex": "Membre"
      },
      "organesRefs": [
        "PO733617"
      ]
    },
    {
      "xsiType": "MandatSimple_Type",
      "uid": "PM740376",
      "acteurRef": "PA335532",
      "legislature": "15",
      "typeOrgane": "ORGEXTPARL",
      "dateDebut": "2017-10-11T02:00:00.000+02:00",
      "datePublication": "2017-10-12T02:00:00.000+02:00",
      "preseance": "30",
      "nominPrincipale": "1",
      "infosQualite": {
        "codeQualite": "Suppléant",
        "libQualite": "Membre suppléant",
        "libQualiteSex": "Membre suppléante"
      },
      "organesRefs": [
        "PO60244"
      ]
    },
    {
      "xsiType": "MandatMission_Type",
      "uid": "PM741978",
      "acteurRef": "PA335532",
      "legislature": "15",
      "typeOrgane": "MISINFO",
      "dateDebut": "2017-09-27T02:00:00.000+02:00",
      "dateFin": "2019-02-12T01:00:00.000+01:00",
      "preseance": "10",
      "nominPrincipale": "1",
      "infosQualite": {
        "codeQualite": "Membre",
        "libQualite": "Membre",
        "libQualiteSex": "Membre"
      },
      "organesRefs": [
        "PO741916"
      ]
    },
    {
      "xsiType": "MandatSimple_Type",
      "uid": "PM742257",
      "acteurRef": "PA335532",
      "legislature": "15",
      "typeOrgane": "GA",
      "dateDebut": "2017-10-31T01:00:00.000+01:00",
      "preseance": "8",
      "nominPrincipale": "1",
      "infosQualite": {
        "codeQualite": "Vice-Président",
        "libQualite": "Vice-Président",
        "libQualiteSex": "Vice-Présidente"
      },
      "organesRefs": [
        "PO733617"
      ]
    },
    {
      "xsiType": "MandatSimple_Type",
      "uid": "PM745943",
      "acteurRef": "PA335532",
      "typeOrgane": "PARPOL",
      "dateDebut": "2017-12-01T01:00:00.000+01:00",
      "preseance": "5",
      "nominPrincipale": "1",
      "infosQualite": {
        "codeQualite": "Membre",
        "libQualite": "Membre",
        "libQualiteSex": "Membre"
      },
      "organesRefs": [
        "PO684932"
      ]
    },
    {
      "xsiType": "MandatMission_Type",
      "uid": "PM748047",
      "acteurRef": "PA335532",
      "legislature": "15",
      "typeOrgane": "MISINFO",
      "dateDebut": "2018-01-24T01:00:00.000+01:00",
      "dateFin": "2018-11-15T01:00:00.000+01:00",
      "preseance": "10",
      "nominPrincipale": "0",
      "infosQualite": {
        "codeQualite": "Membre",
        "libQualite": "Membre",
        "libQualiteSex": "Membre"
      },
      "organesRefs": [
        "PO748043"
      ]
    },
    {
      "xsiType": "MandatMission_Type",
      "uid": "PM748049",
      "acteurRef": "PA335532",
      "legislature": "15",
      "typeOrgane": "MISINFO",
      "dateDebut": "2018-01-24T01:00:00.000+01:00",
      "dateFin": "2018-11-15T01:00:00.000+01:00",
      "preseance": "5",
      "nominPrincipale": "1",
      "infosQualite": {
        "codeQualite": "Co-rapporteur",
        "libQualite": "Co-rapporteur",
        "libQualiteSex": "Co-rapporteure"
      },
      "organesRefs": [
        "PO748043"
      ]
    },
    {
      "xsiType": "MandatMission_Type",
      "uid": "PM748325",
      "acteurRef": "PA335532",
      "legislature": "15",
      "typeOrgane": "MISINFO",
      "dateDebut": "2018-01-31T01:00:00.000+01:00",
      "dateFin": "2018-11-15T01:00:00.000+01:00",
      "preseance": "10",
      "nominPrincipale": "1",
      "infosQualite": {
        "codeQualite": "Membre",
        "libQualite": "Membre",
        "libQualiteSex": "Membre"
      },
      "organesRefs": [
        "PO748305"
      ]
    },
    {
      "xsiType": "MandatSimple_Type",
      "uid": "PM749366",
      "acteurRef": "PA335532",
      "legislature": "15",
      "typeOrgane": "CMP",
      "dateDebut": "2018-02-12T01:00:00.000+01:00",
      "datePublication": "2018-02-10T01:00:00.000+01:00",
      "dateFin": "2018-02-15T01:00:00.000+01:00",
      "preseance": "28",
      "nominPrincipale": "1",
      "infosQualite": {
        "codeQualite": "Suppléant",
        "libQualite": "Membre suppléant",
        "libQualiteSex": "Membre suppléante"
      },
      "organesRefs": [
        "PO749252"
      ]
    },
    {
      "xsiType": "MandatSimple_Type",
      "uid": "PM752286",
      "acteurRef": "PA335532",
      "legislature": "15",
      "typeOrgane": "GE",
      "dateDebut": "2018-03-05T01:00:00.000+01:00",
      "preseance": "20",
      "nominPrincipale": "1",
      "infosQualite": {
        "codeQualite": "Membre",
        "libQualite": "Membre",
        "libQualiteSex": "Membre"
      },
      "organesRefs": [
        "PO747261"
      ]
    },
    {
      "xsiType": "MandatSimple_Type",
      "uid": "PM752451",
      "acteurRef": "PA335532",
      "legislature": "15",
      "typeOrgane": "GE",
      "dateDebut": "2018-03-06T01:00:00.000+01:00",
      "preseance": "20",
      "nominPrincipale": "1",
      "infosQualite": {
        "codeQualite": "Membre",
        "libQualite": "Membre",
        "libQualiteSex": "Membre"
      },
      "organesRefs": [
        "PO747047"
      ]
    },
    {
      "xsiType": "MandatSimple_Type",
      "uid": "PM758085",
      "acteurRef": "PA335532",
      "legislature": "15",
      "typeOrgane": "CMP",
      "dateDebut": "2018-07-16T02:00:00.000+02:00",
      "datePublication": "2018-07-17T02:00:00.000+02:00",
      "dateFin": "2018-07-30T02:00:00.000+02:00",
      "preseance": "28",
      "nominPrincipale": "1",
      "infosQualite": {
        "codeQualite": "Suppléant",
        "libQualite": "Membre suppléant",
        "libQualiteSex": "Membre suppléante"
      },
      "organesRefs": [
        "PO758043"
      ]
    },
    {
      "xsiType": "MandatSimple_Type",
      "uid": "PM758860",
      "acteurRef": "PA335532",
      "legislature": "15",
      "typeOrgane": "GP",
      "dateDebut": "2018-09-12T02:00:00.000+02:00",
      "preseance": "20",
      "nominPrincipale": "1",
      "infosQualite": {
        "codeQualite": "Membre",
        "libQualite": "Membre du",
        "libQualiteSex": "Membre du"
      },
      "organesRefs": [
        "PO758835"
      ]
    },
    {
      "xsiType": "MandatSimple_Type",
      "uid": "PM762622",
      "acteurRef": "PA335532",
      "legislature": "15",
      "typeOrgane": "COMPER",
      "dateDebut": "2019-02-13T01:00:00.000+01:00",
      "datePublication": "2019-02-13T01:00:00.000+01:00",
      "dateFin": "2019-07-02T02:00:00.000+02:00",
      "preseance": "32",
      "nominPrincipale": "1",
      "infosQualite": {
        "codeQualite": "Membre",
        "libQualite": "Membre",
        "libQualiteSex": "Membre"
      },
      "organesRefs": [
        "PO59051"
      ]
    },
    {
      "xsiType": "MandatSimple_Type",
      "uid": "PM762957",
      "acteurRef": "PA335532",
      "legislature": "15",
      "typeOrgane": "GEVI",
      "dateDebut": "2019-03-01T01:00:00.000+01:00",
      "preseance": "20",
      "nominPrincipale": "1",
      "infosQualite": {
        "codeQualite": "Membre",
        "libQualite": "Membre",
        "libQualiteSex": "Membre"
      },
      "organesRefs": [
        "PO733622"
      ]
    },
    {
      "xsiType": "MandatSimple_Type",
      "uid": "PM764841",
      "acteurRef": "PA335532",
      "legislature": "15",
      "typeOrgane": "CMP",
      "dateDebut": "2019-04-30T02:00:00.000+02:00",
      "datePublication": "2019-05-02T02:00:00.000+02:00",
      "dateFin": "2019-05-23T02:00:00.000+02:00",
      "preseance": "28",
      "nominPrincipale": "1",
      "infosQualite": {
        "codeQualite": "Suppléant",
        "libQualite": "Membre suppléant",
        "libQualiteSex": "Membre suppléante"
      },
      "organesRefs": [
        "PO764703"
      ]
    },
    {
      "xsiType": "MandatSimple_Type",
      "uid": "PM764859",
      "acteurRef": "PA335532",
      "legislature": "15",
      "typeOrgane": "CMP",
      "dateDebut": "2019-04-30T02:00:00.000+02:00",
      "datePublication": "2019-05-02T02:00:00.000+02:00",
      "dateFin": "2019-05-23T02:00:00.000+02:00",
      "preseance": "28",
      "nominPrincipale": "1",
      "infosQualite": {
        "codeQualite": "Suppléant",
        "libQualite": "Membre suppléant",
        "libQualiteSex": "Membre suppléante"
      },
      "organesRefs": [
        "PO764697"
      ]
    },
    {
      "xsiType": "MandatSimple_Type",
      "uid": "PM766164",
      "acteurRef": "PA335532",
      "legislature": "15",
      "typeOrgane": "COMPER",
      "dateDebut": "2019-07-03T02:00:00.000+02:00",
      "datePublication": "2019-07-03T02:00:00.000+02:00",
      "dateFin": "2019-07-15T02:00:00.000+02:00",
      "preseance": "32",
      "nominPrincipale": "1",
      "infosQualite": {
        "codeQualite": "Membre",
        "libQualite": "Membre",
        "libQualiteSex": "Membre"
      },
      "organesRefs": [
        "PO59048"
      ]
    },
    {
      "xsiType": "MandatSimple_Type",
      "uid": "PM766467",
      "acteurRef": "PA335532",
      "legislature": "15",
      "typeOrgane": "COMPER",
      "dateDebut": "2019-07-16T02:00:00.000+02:00",
      "datePublication": "2019-07-16T02:00:00.000+02:00",
      "dateFin": "2019-11-12T01:00:00.000+01:00",
      "preseance": "32",
      "nominPrincipale": "1",
      "infosQualite": {
        "codeQualite": "Membre",
        "libQualite": "Membre",
        "libQualiteSex": "Membre"
      },
      "organesRefs": [
        "PO59051"
      ]
    },
    {
      "xsiType": "MandatSimple_Type",
      "uid": "PM766774",
      "acteurRef": "PA335532",
      "legislature": "15",
      "typeOrgane": "CNPS",
      "dateDebut": "2019-07-24T02:00:00.000+02:00",
      "datePublication": "2019-07-25T02:00:00.000+02:00",
      "preseance": "20",
      "nominPrincipale": "1",
      "infosQualite": {
        "codeQualite": "Membre",
        "libQualite": "Membre",
        "libQualiteSex": "Membre"
      },
      "organesRefs": [
        "PO766718"
      ]
    },
    {
      "xsiType": "MandatSimple_Type",
      "uid": "PM767633",
      "acteurRef": "PA335532",
      "legislature": "15",
      "typeOrgane": "CNPE",
      "dateDebut": "2019-10-18T02:00:00.000+02:00",
      "datePublication": "2019-10-19T02:00:00.000+02:00",
      "preseance": "20",
      "nominPrincipale": "0",
      "infosQualite": {
        "codeQualite": "Membre",
        "libQualite": "Membre",
        "libQualiteSex": "Membre"
      },
      "organesRefs": [
        "PO767517"
      ]
    },
    {
      "xsiType": "MandatSimple_Type",
      "uid": "PM767800",
      "acteurRef": "PA335532",
      "legislature": "15",
      "typeOrgane": "CNPE",
      "dateDebut": "2019-10-23T02:00:00.000+02:00",
      "datePublication": "2019-10-24T02:00:00.000+02:00",
      "preseance": "8",
      "nominPrincipale": "1",
      "infosQualite": {
        "codeQualite": "Vice-Président",
        "libQualite": "Vice-Président",
        "libQualiteSex": "Vice-Présidente"
      },
      "organesRefs": [
        "PO767517"
      ]
    },
    {
      "xsiType": "MandatSimple_Type",
      "uid": "PM768133",
      "acteurRef": "PA335532",
      "legislature": "15",
      "typeOrgane": "COMPER",
      "dateDebut": "2019-11-13T01:00:00.000+01:00",
      "datePublication": "2019-11-13T01:00:00.000+01:00",
      "dateFin": "2019-11-13T01:00:00.000+01:00",
      "preseance": "32",
      "nominPrincipale": "1",
      "infosQualite": {
        "codeQualite": "Membre",
        "libQualite": "Membre",
        "libQualiteSex": "Membre"
      },
      "organesRefs": [
        "PO419610"
      ]
    },
    {
      "xsiType": "MandatSimple_Type",
      "uid": "PM768149",
      "acteurRef": "PA335532",
      "legislature": "15",
      "typeOrgane": "COMPER",
      "dateDebut": "2019-11-14T01:00:00.000+01:00",
      "datePublication": "2019-11-14T01:00:00.000+01:00",
      "preseance": "32",
      "nominPrincipale": "1",
      "infosQualite": {
        "codeQualite": "Membre",
        "libQualite": "Membre",
        "libQualiteSex": "Membre"
      },
      "organesRefs": [
        "PO59051"
      ]
    },
    {
      "xsiType": "MandatSimple_Type",
      "uid": "PM15591222",
      "acteurRef": "PA335532",
      "typeOrgane": "GOUVERNEMENT",
      "dateDebut": "2012-05-17T02:00:00.000+02:00",
      "datePublication": "2012-05-17T02:00:00.000+02:00",
      "dateFin": "2012-06-18T02:00:00.000+02:00",
      "preseance": "50",
      "nominPrincipale": "1",
      "infosQualite": {
        "codeQualite": "membre",
        "libQualite": "membre",
        "libQualiteSex": "membre"
      },
      "organesRefs": [
        "PO590011"
      ]
    },
    {
      "xsiType": "MandatSimple_Type",
      "uid": "PM15653349",
      "acteurRef": "PA335532",
      "typeOrgane": "GOUVERNEMENT",
      "dateDebut": "2012-06-22T02:00:00.000+02:00",
      "datePublication": "2012-06-22T02:00:00.000+02:00",
      "dateFin": "2014-03-31T02:00:00.000+02:00",
      "preseance": "50",
      "nominPrincipale": "1",
      "infosQualite": {
        "codeQualite": "membre",
        "libQualite": "membre",
        "libQualiteSex": "membre"
      },
      "organesRefs": [
        "PO653199"
      ]
    },
    {
      "xsiType": "MandatSimple_Type",
      "uid": "PM15700760",
      "acteurRef": "PA335532",
      "typeOrgane": "GOUVERNEMENT",
      "dateDebut": "2014-04-03T02:00:00.000+02:00",
      "datePublication": "2014-04-03T02:00:00.000+02:00",
      "dateFin": "2014-08-26T02:00:00.000+02:00",
      "preseance": "50",
      "nominPrincipale": "1",
      "infosQualite": {
        "codeQualite": "membre",
        "libQualite": "membre",
        "libQualiteSex": "membre"
      },
      "organesRefs": [
        "PO700706"
      ]
    },
    {
      "xsiType": "MandatSimple_Type",
      "uid": "PM15702985",
      "acteurRef": "PA335532",
      "typeOrgane": "GOUVERNEMENT",
      "dateDebut": "2014-08-27T02:00:00.000+02:00",
      "datePublication": "2014-08-27T02:00:00.000+02:00",
      "dateFin": "2016-08-30T02:00:00.000+02:00",
      "preseance": "50",
      "nominPrincipale": "1",
      "infosQualite": {
        "codeQualite": "membre",
        "libQualite": "membre",
        "libQualiteSex": "membre"
      },
      "organesRefs": [
        "PO702883"
      ]
    }
  ]
}