{
  "uid": "PA872",
  "etatCivil": {
    "ident": {
      "civ": "M.",
      "prenom": "Alain",
      "nom": "Claeys",
      "alpha": "Claeys"
    },
    "infoNaissance": {
      "dateNais": "1948-08-25T01:00:00.000+01:00",
      "villeNais": "Poitiers",
      "depNais": "Vienne",
      "paysNais": "France"
    }
  },
  "profession": {
    "libelleCourant": "Enseignant",
    "socProcInsee": {
      "catSocPro": "Cadres de la fonction publique, professions intellectuelles et  artistiques",
      "famSocPro": "Cadres et professions intellectuelles supérieures"
    }
  },
  "adresses": [
    {
      "xsiType": "AdressePostale_Type",
      "uid": "AD45794",
      "type": "2",
      "typeLibelle": "Adresse publiée de circonscription",
      "poids": "23",
      "intitule": "Permanence",
      "numeroRue": "16",
      "nomRue": "Rue du Mouton,",
      "codePostal": "86000",
      "ville": "Poitiers"
    },
    {
      "xsiType": "AdresseTelephonique_Type",
      "uid": "AD48864",
      "type": "11",
      "typeLibelle": "Téléphone",
      "poids": "23",
      "adresseDeRattachement": "AD45794",
      "valElec": "05 49 50 97 79"
    },
    {
      "xsiType": "AdressePostale_Type",
      "uid": "AD387059",
      "type": "0",
      "typeLibelle": "Adresse officielle",
      "poids": "1",
      "intitule": "Assemblée nationale,",
      "numeroRue": "126",
      "nomRue": "Rue de l'Université,",
      "codePostal": "75355",
      "ville": "Paris 07 SP"
    },
    {
      "xsiType": "AdresseMail_Type",
      "uid": "AD391634",
      "type": "15",
      "typeLibelle": "Mèl",
      "valElec": "aclaeys@assemblee-nationale.fr"
    },
    {
      "xsiType": "AdressePostale_Type",
      "uid": "AD414254",
      "type": "2",
      "typeLibelle": "Adresse publiée de circonscription",
      "poids": "22",
      "intitule": "Hôtel de ville",
      "codePostal": "86021",
      "ville": "Poitiers Cedex"
    },
    {
      "xsiType": "AdresseTelephonique_Type",
      "uid": "AD414255",
      "type": "11",
      "typeLibelle": "Téléphone",
      "poids": "22",
      "adresseDeRattachement": "AD414254",
      "valElec": "05 49 52 35 35"
    },
    {
      "xsiType": "AdresseTelephonique_Type",
      "uid": "AD414256",
      "type": "12",
      "typeLibelle": "Télécopie",
      "poids": "22",
      "adresseDeRattachement": "AD414254",
      "valElec": "05 49 41 91 97"
    },
    {
      "xsiType": "AdresseMail_Type",
      "uid": "AD650589",
      "type": "15",
      "typeLibelle": "Mèl",
      "valElec": "alain.claeys@mairie-poitiers.fr"
    }
  ],
  "mandats": [
    {
      "xsiType": "MandatParlementaire_type",
      "uid": "PM267566",
      "acteurRef": "PA872",
      "legislature": "12",
      "typeOrgane": "ASSEMBLEE",
      "dateDebut": "2002-06-19T02:00:00.000+02:00",
      "dateFin": "2007-06-19T02:00:00.000+02:00",
      "preseance": "50",
      "nominPrincipale": "1",
      "infosQualite": {
        "codeQualite": "membre",
        "libQualite": "membre",
        "libQualiteSex": "membre"
      },
      "organesRefs": [
        "PO230434"
      ],
      "suppleant": {
        "dateDebut": "2002-06-19T02:00:00.000+02:00",
        "dateFin": "2007-06-19T02:00:00.000+02:00",
        "suppleantRef": "PA972"
      },
      "election": {
        "lieu": {
          "region": "Nouvelle-Aquitaine",
          "regionType": "Métropolitain",
          "departement": "Vienne",
          "numDepartement": "86",
          "numCirco": "1"
        },
        "causeMandat": "élections générales",
        "refCirconscription": "PO230916"
      },
      "mandature": {
        "datePriseFonction": "2002-06-19T02:00:00.000+02:00",
        "causeFin": "Fin de législature",
        "premiereElection": "1"
      }
    },
    {
      "xsiType": "MandatSimple_Type",
      "uid": "PM271354",
      "acteurRef": "PA872",
      "legislature": "12",
      "typeOrgane": "GP",
      "dateDebut": "2002-06-25T02:00:00.000+02:00",
      "datePublication": "2002-06-26T02:00:00.000+02:00",
      "dateFin": "2007-06-19T02:00:00.000+02:00",
      "preseance": "20",
      "nominPrincipale": "1",
      "infosQualite": {
        "codeQualite": "Membre",
        "libQualite": "Membre du",
        "libQualiteSex": "Membre du"
      },
      "organesRefs": [
        "PO270907"
      ]
    },
    {
      "xsiType": "MandatAvecSuppleant_Type",
      "uid": "PM273603",
      "acteurRef": "PA872",
      "legislature": "12",
      "typeOrgane": "OFFPAR",
      "dateDebut": "2002-07-03T02:00:00.000+02:00",
      "datePublication": "2002-07-03T02:00:00.000+02:00",
      "dateFin": "2007-06-19T02:00:00.000+02:00",
      "preseance": "24",
      "nominPrincipale": "1",
      "infosQualite": {
        "codeQualite": "Membre",
        "libQualite": "Membre",
        "libQualiteSex": "Membre"
      },
      "organesRefs": [
        "PO273589"
      ]
    },
    {
      "xsiType": "MandatSimple_Type",
      "uid": "PM280553",
      "acteurRef": "PA872",
      "legislature": "12",
      "typeOrgane": "GA",
      "dateDebut": "2002-11-06T01:00:00.000+01:00",
      "dateFin": "2007-06-19T02:00:00.000+02:00",
      "preseance": "20",
      "nominPrincipale": "1",
      "infosQualite": {
        "codeQualite": "Membre",
        "libQualite": "Membre",
        "libQualiteSex": "Membre"
      },
      "organesRefs": [
        "PO274200"
      ]
    },
    {
      "xsiType": "MandatSimple_Type",
      "uid": "PM280554",
      "acteurRef": "PA872",
      "legislature": "12",
      "typeOrgane": "GA",
      "dateDebut": "2002-11-06T01:00:00.000+01:00",
      "dateFin": "2007-06-19T02:00:00.000+02:00",
      "preseance": "20",
      "nominPrincipale": "1",
      "infosQualite": {
        "codeQualite": "Membre",
        "libQualite": "Membre",
        "libQualiteSex": "Membre"
      },
      "organesRefs": [
        "PO274111"
      ]
    },
    {
      "xsiType": "MandatSimple_Type",
      "uid": "PM287027",
      "acteurRef": "PA872",
      "legislature": "12",
      "typeOrgane": "GE",
      "dateDebut": "2002-12-13T01:00:00.000+01:00",
      "dateFin": "2007-06-19T02:00:00.000+02:00",
      "preseance": "20",
      "nominPrincipale": "1",
      "infosQualite": {
        "codeQualite": "Membre",
        "libQualite": "Membre",
        "libQualiteSex": "Membre"
      },
      "organesRefs": [
        "PO285068"
      ]
    },
    {
      "xsiType": "MandatSimple_Type",
      "uid": "PM291929",
      "acteurRef": "PA872",
      "legislature": "12",
      "typeOrgane": "GE",
      "dateDebut": "2002-11-26T01:00:00.000+01:00",
      "dateFin": "2007-06-19T02:00:00.000+02:00",
      "preseance": "20",
      "nominPrincipale": "1",
      "infosQualite": {
        "codeQualite": "Membre",
        "libQualite": "Membre",
        "libQualiteSex": "Membre"
      },
      "organesRefs": [
        "PO287146"
      ]
    },
    {
      "xsiType": "MandatSimple_Type",
      "uid": "PM292170",
      "acteurRef": "PA872",
      "legislature": "12",
      "typeOrgane": "GE",
      "dateDebut": "2003-01-29T01:00:00.000+01:00",
      "dateFin": "2007-06-19T02:00:00.000+02:00",
      "preseance": "20",
      "nominPrincipale": "1",
      "infosQualite": {
        "codeQualite": "Membre",
        "libQualite": "Membre",
        "libQualiteSex": "Membre"
      },
      "organesRefs": [
        "PO289713"
      ]
    },
    {
      "xsiType": "MandatSimple_Type",
      "uid": "PM292260",
      "acteurRef": "PA872",
      "legislature": "12",
      "typeOrgane": "GE",
      "dateDebut": "2003-04-29T02:00:00.000+02:00",
      "dateFin": "2007-06-19T02:00:00.000+02:00",
      "preseance": "20",
      "nominPrincipale": "1",
      "infosQualite": {
        "codeQualite": "Membre",
        "libQualite": "Membre",
        "libQualiteSex": "Membre"
      },
      "organesRefs": [
        "PO287282"
      ]
    },
    {
      "xsiType": "MandatSimple_Type",
      "uid": "PM295199",
      "acteurRef": "PA872",
      "legislature": "12",
      "typeOrgane": "GE",
      "dateDebut": "2003-02-12T01:00:00.000+01:00",
      "dateFin": "2007-06-19T02:00:00.000+02:00",
      "preseance": "20",
      "nominPrincipale": "1",
      "infosQualite": {
        "codeQualite": "Membre",
        "libQualite": "Membre",
        "libQualiteSex": "Membre"
      },
      "organesRefs": [
        "PO285100"
      ]
    },
    {
      "xsiType": "MandatSimple_Type",
      "uid": "PM296277",
      "acteurRef": "PA872",
      "legislature": "12",
      "typeOrgane": "GE",
      "dateDebut": "2003-01-30T01:00:00.000+01:00",
      "dateFin": "2007-06-19T02:00:00.000+02:00",
      "preseance": "20",
      "nominPrincipale": "1",
      "infosQualite": {
        "codeQualite": "Membre",
        "libQualite": "Membre",
        "libQualiteSex": "Membre"
      },
      "organesRefs": [
        "PO285130"
      ]
    },
    {
      "xsiType": "MandatSimple_Type",
      "uid": "PM296888",
      "acteurRef": "PA872",
      "legislature": "12",
      "typeOrgane": "GE",
      "dateDebut": "2003-09-16T02:00:00.000+02:00",
      "dateFin": "2007-06-19T02:00:00.000+02:00",
      "preseance": "20",
      "nominPrincipale": "1",
      "infosQualite": {
        "codeQualite": "Membre",
        "libQualite": "Membre",
        "libQualiteSex": "Membre"
      },
      "organesRefs": [
        "PO292868"
      ]
    },
    {
      "xsiType": "MandatMission_Type",
      "uid": "PM300714",
      "acteurRef": "PA872",
      "legislature": "12",
      "typeOrgane": "MISINFO",
      "dateDebut": "2003-01-21T01:00:00.000+01:00",
      "dateFin": "2007-06-19T02:00:00.000+02:00",
      "preseance": "10",
      "nominPrincipale": "1",
      "infosQualite": {
        "codeQualite": "Membre",
        "libQualite": "Membre",
        "libQualiteSex": "Membre"
      },
      "organesRefs": [
        "PO300695"
      ]
    },
    {
      "xsiType": "MandatSimple_Type",
      "uid": "PM308074",
      "acteurRef": "PA872",
      "legislature": "12",
      "typeOrgane": "ORGEXTPARL",
      "dateDebut": "2004-11-08T01:00:00.000+01:00",
      "datePublication": "2004-11-09T01:00:00.000+01:00",
      "dateFin": "2007-06-19T02:00:00.000+02:00",
      "preseance": "20",
      "nominPrincipale": "1",
      "infosQualite": {
        "codeQualite": "Titulaire",
        "libQualite": "Membre titulaire",
        "libQualiteSex": "Membre titulaire"
      },
      "organesRefs": [
        "PO60210"
      ]
    },
    {
      "xsiType": "MandatMission_Type",
      "uid": "PM314407",
      "acteurRef": "PA872",
      "legislature": "12",
      "typeOrgane": "MISINFOPRE",
      "dateDebut": "2005-10-13T02:00:00.000+02:00",
      "datePublication": "2005-10-14T02:00:00.000+02:00",
      "dateFin": "2007-06-19T02:00:00.000+02:00",
      "preseance": "20",
      "nominPrincipale": "1",
      "infosQualite": {
        "codeQualite": "Membre",
        "libQualite": "Membre",
        "libQualiteSex": "Membre"
      },
      "organesRefs": [
        "PO314272"
      ]
    },
    {
      "xsiType": "MandatSimple_Type",
      "uid": "PM322465",
      "acteurRef": "PA872",
      "legislature": "12",
      "typeOrgane": "COMPER",
      "dateDebut": "2006-03-04T01:00:00.000+01:00",
      "datePublication": "2006-03-04T01:00:00.000+01:00",
      "dateFin": "2007-06-19T02:00:00.000+02:00",
      "preseance": "32",
      "nominPrincipale": "1",
      "infosQualite": {
        "codeQualite": "Membre",
        "libQualite": "Membre",
        "libQualiteSex": "Membre"
      },
      "organesRefs": [
        "PO59048"
      ]
    },
    {
      "xsiType": "MandatParlementaire_type",
      "uid": "PM386121",
      "acteurRef": "PA872",
      "legislature": "13",
      "typeOrgane": "ASSEMBLEE",
      "dateDebut": "2007-06-20T02:00:00.000+02:00",
      "dateFin": "2012-06-19T02:00:00.000+02:00",
      "preseance": "50",
      "nominPrincipale": "1",
      "infosQualite": {
        "codeQualite": "membre",
        "libQualite": "membre",
        "libQualiteSex": "membre"
      },
      "organesRefs": [
        "PO384266"
      ],
      "suppleant": {
        "dateDebut": "2007-06-20T02:00:00.000+02:00",
        "dateFin": "2012-06-19T02:00:00.000+02:00",
        "suppleantRef": "PA972"
      },
      "election": {
        "lieu": {
          "region": "Nouvelle-Aquitaine",
          "regionType": "Métropolitain",
          "departement": "Vienne",
          "numDepartement": "86",
          "numCirco": "1"
        },
        "causeMandat": "élections générales",
        "refCirconscription": "PO384748"
      },
      "mandature": {
        "datePriseFonction": "2007-06-20T02:00:00.000+02:00",
        "causeFin": "Fin de législature",
        "premiereElection": "1"
      }
    },
    {
      "xsiType": "MandatSimple_Type",
      "uid": "PM387638",
      "acteurRef": "PA872",
      "legislature": "13",
      "typeOrgane": "GP",
      "dateDebut": "2007-06-20T02:00:00.000+02:00",
      "dateFin": "2007-06-26T02:00:00.000+02:00",
      "preseance": "28",
      "nominPrincipale": "1",
      "infosQualite": {
        "codeQualite": "Député non-inscrit",
        "libQualite": "Député non-inscrit",
        "libQualiteSex": "Député non-inscrit"
      },
      "organesRefs": [
        "PO387155"
      ]
    },
    {
      "xsiType": "MandatSimple_Type",
      "uid": "PM390093",
      "acteurRef": "PA872",
      "legislature": "13",
      "typeOrgane": "GP",
      "dateDebut": "2007-06-27T02:00:00.000+02:00",
      "datePublication": "2007-06-27T02:00:00.000+02:00",
      "dateFin": "2012-06-19T02:00:00.000+02:00",
      "preseance": "20",
      "nominPrincipale": "1",
      "infosQualite": {
        "codeQualite": "Membre",
        "libQualite": "Membre du",
        "libQualiteSex": "Membre du"
      },
      "organesRefs": [
        "PO389507"
      ]
    },
    {
      "xsiType": "MandatSimple_Type",
      "uid": "PM390807",
      "acteurRef": "PA872",
      "legislature": "13",
      "typeOrgane": "COMPER",
      "dateDebut": "2007-06-27T02:00:00.000+02:00",
      "datePublication": "2007-06-28T02:00:00.000+02:00",
      "dateFin": "2012-06-19T02:00:00.000+02:00",
      "preseance": "32",
      "nominPrincipale": "1",
      "infosQualite": {
        "codeQualite": "Membre",
        "libQualite": "Membre",
        "libQualiteSex": "Membre"
      },
      "organesRefs": [
        "PO59048"
      ]
    },
    {
      "xsiType": "MandatAvecSuppleant_Type",
      "uid": "PM391446",
      "acteurRef": "PA872",
      "legislature": "13",
      "typeOrgane": "OFFPAR",
      "dateDebut": "2007-07-03T02:00:00.000+02:00",
      "datePublication": "2007-07-04T02:00:00.000+02:00",
      "dateFin": "2012-06-19T02:00:00.000+02:00",
      "preseance": "24",
      "nominPrincipale": "1",
      "infosQualite": {
        "codeQualite": "Membre",
        "libQualite": "Membre",
        "libQualiteSex": "Membre"
      },
      "organesRefs": [
        "PO273589"
      ]
    },
    {
      "xsiType": "MandatMission_Type",
      "uid": "PM393826",
      "acteurRef": "PA872",
      "legislature": "13",
      "typeOrgane": "MISINFO",
      "dateDebut": "2007-07-25T02:00:00.000+02:00",
      "datePublication": "2007-07-26T02:00:00.000+02:00",
      "dateFin": "2012-06-19T02:00:00.000+02:00",
      "preseance": "10",
      "nominPrincipale": "1",
      "infosQualite": {
        "codeQualite": "Membre",
        "libQualite": "Membre",
        "libQualiteSex": "Membre"
      },
      "organesRefs": [
        "PO393808"
      ]
    },
    {
      "xsiType": "MandatSimple_Type",
      "uid": "PM393952",
      "acteurRef": "PA872",
      "legislature": "13",
      "typeOrgane": "CMP",
      "dateDebut": "2007-07-27T02:00:00.000+02:00",
      "datePublication": "2007-07-28T02:00:00.000+02:00",
      "dateFin": "2007-07-31T02:00:00.000+02:00",
      "preseance": "28",
      "nominPrincipale": "1",
      "infosQualite": {
        "codeQualite": "Suppléant",
        "libQualite": "Membre suppléant",
        "libQualiteSex": "Membre suppléant"
      },
      "organesRefs": [
        "PO393935"
      ]
    },
    {
      "xsiType": "MandatSimple_Type",
      "uid": "PM394303",
      "acteurRef": "PA872",
      "legislature": "13",
      "typeOrgane": "ORGEXTPARL",
      "dateDebut": "2007-08-01T02:00:00.000+02:00",
      "datePublication": "2007-08-02T02:00:00.000+02:00",
      "dateFin": "2009-01-28T01:00:00.000+01:00",
      "preseance": "20",
      "nominPrincipale": "1",
      "infosQualite": {
        "codeQualite": "Titulaire",
        "libQualite": "Membre titulaire",
        "libQualiteSex": "Membre titulaire"
      },
      "organesRefs": [
        "PO60210"
      ]
    },
    {
      "xsiType": "MandatSimple_Type",
      "uid": "PM399513",
      "acteurRef": "PA872",
      "legislature": "13",
      "typeOrgane": "GA",
      "dateDebut": "2007-10-16T02:00:00.000+02:00",
      "dateFin": "2012-06-19T02:00:00.000+02:00",
      "preseance": "20",
      "nominPrincipale": "1",
      "infosQualite": {
        "codeQualite": "Membre",
        "libQualite": "Membre",
        "libQualiteSex": "Membre"
      },
      "organesRefs": [
        "PO392950"
      ]
    },
    {
      "xsiType": "MandatSimple_Type",
      "uid": "PM399514",
      "acteurRef": "PA872",
      "legislature": "13",
      "typeOrgane": "GA",
      "dateDebut": "2007-10-16T02:00:00.000+02:00",
      "dateFin": "2012-06-19T02:00:00.000+02:00",
      "preseance": "20",
      "nominPrincipale": "1",
      "infosQualite": {
        "codeQualite": "Membre",
        "libQualite": "Membre",
        "libQualiteSex": "Membre"
      },
      "organesRefs": [
        "PO393070"
      ]
    },
    {
      "xsiType": "MandatSimple_Type",
      "uid": "PM403351",
      "acteurRef": "PA872",
      "legislature": "13",
      "typeOrgane": "API",
      "dateDebut": "2007-11-08T01:00:00.000+01:00",
      "datePublication": "2007-11-09T01:00:00.000+01:00",
      "dateFin": "2012-06-19T02:00:00.000+02:00",
      "preseance": "20",
      "nominPrincipale": "1",
      "infosQualite": {
        "codeQualite": "Membre",
        "libQualite": "Membre",
        "libQualiteSex": "Membre"
      },
      "organesRefs": [
        "PO201115"
      ]
    },
    {
      "xsiType": "MandatSimple_Type",
      "uid": "PM409276",
      "acteurRef": "PA872",
      "legislature": "13",
      "typeOrgane": "COMPER",
      "dateDebut": "2008-02-06T01:00:00.000+01:00",
      "dateFin": "2012-06-19T02:00:00.000+02:00",
      "preseance": "500",
      "nominPrincipale": "0",
      "infosQualite": {
        "codeQualite": "Rapporteur spécial",
        "libQualite": "Rapporteur spécial au nom de la commission des finances : Recherche et enseignement supérieur : Recherche dans les domaines du développement durable",
        "libQualiteSex": "Rapporteur spécial au nom de la commission des finances : Recherche et enseignement supérieur : Recherche dans les domaines du développement durable"
      },
      "organesRefs": [
        "PO59048"
      ]
    },
    {
      "xsiType": "MandatMission_Type",
      "uid": "PM414641",
      "acteurRef": "PA872",
      "legislature": "13",
      "typeOrgane": "MISINFOPRE",
      "dateDebut": "2008-07-09T02:00:00.000+02:00",
      "datePublication": "2008-07-10T02:00:00.000+02:00",
      "dateFin": "2010-01-22T01:00:00.000+01:00",
      "preseance": "20",
      "nominPrincipale": "1",
      "infosQualite": {
        "codeQualite": "Membre",
        "libQualite": "Membre",
        "libQualiteSex": "Membre"
      },
      "organesRefs": [
        "PO414626"
      ]
    },
    {
      "xsiType": "MandatMission_Type",
      "uid": "PM415043",
      "acteurRef": "PA872",
      "legislature": "13",
      "typeOrgane": "MISINFOPRE",
      "dateDebut": "2008-07-22T02:00:00.000+02:00",
      "datePublication": "2008-07-23T02:00:00.000+02:00",
      "dateFin": "2010-01-22T01:00:00.000+01:00",
      "preseance": "1",
      "nominPrincipale": "1",
      "infosQualite": {
        "codeQualite": "Président",
        "libQualite": "Président",
        "libQualiteSex": "Président"
      },
      "organesRefs": [
        "PO414626"
      ]
    },
    {
      "xsiType": "MandatAvecSuppleant_Type",
      "uid": "PM420617",
      "acteurRef": "PA872",
      "legislature": "13",
      "typeOrgane": "COMNL",
      "dateDebut": "2009-07-01T02:00:00.000+02:00",
      "datePublication": "2009-07-01T02:00:00.000+02:00",
      "dateFin": "2009-07-17T02:00:00.000+02:00",
      "preseance": "20",
      "nominPrincipale": "1",
      "infosQualite": {
        "codeQualite": "Membre",
        "libQualite": "Membre",
        "libQualiteSex": "Membre"
      },
      "organesRefs": [
        "PO420375"
      ]
    },
    {
      "xsiType": "MandatSimple_Type",
      "uid": "PM425613",
      "acteurRef": "PA872",
      "legislature": "13",
      "typeOrgane": "CNPS",
      "dateDebut": "2010-11-10T01:00:00.000+01:00",
      "datePublication": "2011-11-11T01:00:00.000+01:00",
      "dateFin": "2011-06-23T02:00:00.000+02:00",
      "preseance": "20",
      "nominPrincipale": "1",
      "infosQualite": {
        "codeQualite": "Membre",
        "libQualite": "Membre",
        "libQualiteSex": "Membre"
      },
      "organesRefs": [
        "PO425550"
      ]
    },
    {
      "xsiType": "MandatSimple_Type",
      "uid": "PM425850",
      "acteurRef": "PA872",
      "legislature": "13",
      "typeOrgane": "CNPS",
      "dateDebut": "2010-11-17T01:00:00.000+01:00",
      "datePublication": "2010-11-18T01:00:00.000+01:00",
      "dateFin": "2011-06-23T02:00:00.000+02:00",
      "preseance": "1",
      "nominPrincipale": "1",
      "infosQualite": {
        "codeQualite": "Président",
        "libQualite": "Président",
        "libQualiteSex": "Président"
      },
      "organesRefs": [
        "PO425550"
      ]
    },
    {
      "xsiType": "MandatSimple_Type",
      "uid": "PM428807",
      "acteurRef": "PA872",
      "legislature": "13",
      "typeOrgane": "CMP",
      "dateDebut": "2011-06-14T02:00:00.000+02:00",
      "datePublication": "2011-06-15T02:00:00.000+02:00",
      "dateFin": "2011-07-25T02:00:00.000+02:00",
      "preseance": "20",
      "nominPrincipale": "1",
      "infosQualite": {
        "codeQualite": "Titulaire",
        "libQualite": "Membre titulaire",
        "libQualiteSex": "Membre titulaire"
      },
      "organesRefs": [
        "PO428784"
      ]
    },
    {
      "xsiType": "MandatSimple_Type",
      "uid": "PM428874",
      "acteurRef": "PA872",
      "legislature": "13",
      "typeOrgane": "CMP",
      "dateDebut": "2011-06-15T02:00:00.000+02:00",
      "datePublication": "2011-06-16T02:00:00.000+02:00",
      "dateFin": "2011-07-25T02:00:00.000+02:00",
      "preseance": "4",
      "nominPrincipale": "1",
      "infosQualite": {
        "codeQualite": "Vice-Président",
        "libQualite": "Vice-Président",
        "libQualiteSex": "Vice-Président"
      },
      "organesRefs": [
        "PO428784"
      ]
    },
    {
      "xsiType": "MandatParlementaire_type",
      "uid": "PM645331",
      "acteurRef": "PA872",
      "legislature": "14",
      "typeOrgane": "ASSEMBLEE",
      "dateDebut": "2012-06-20T02:00:00.000+02:00",
      "dateFin": "2017-06-20T02:00:00.000+02:00",
      "preseance": "50",
      "nominPrincipale": "1",
      "infosQualite": {
        "codeQualite": "membre",
        "libQualite": "membre",
        "libQualiteSex": "membre"
      },
      "organesRefs": [
        "PO644420"
      ],
      "suppleant": {
        "dateDebut": "2012-06-20T02:00:00.000+02:00",
        "dateFin": "2017-06-20T02:00:00.000+02:00",
        "suppleantRef": "PA643111"
      },
      "election": {
        "lieu": {
          "region": "Nouvelle-Aquitaine",
          "regionType": "Métropolitain",
          "departement": "Vienne",
          "numDepartement": "86",
          "numCirco": "1"
        },
        "causeMandat": "élections générales",
        "refCirconscription": "PO644902"
      },
      "mandature": {
        "datePriseFonction": "2012-06-20T02:00:00.000+02:00",
        "causeFin": "Fin de législature",
        "premiereElection": "1"
      }
    },
    {
      "xsiType": "MandatSimple_Type",
      "uid": "PM656094",
      "acteurRef": "PA872",
      "legislature": "14",
      "typeOrgane": "GP",
      "dateDebut": "2012-06-26T02:00:00.000+02:00",
      "datePublication": "2012-06-27T02:00:00.000+02:00",
      "dateFin": "2016-05-24T02:00:00.000+02:00",
      "preseance": "20",
      "nominPrincipale": "1",
      "infosQualite": {
        "codeQualite": "Membre",
        "libQualite": "Membre du",
        "libQualiteSex": "Membre du"
      },
      "organesRefs": [
        "PO656002"
      ]
    },
    {
      "xsiType": "MandatSimple_Type",
      "uid": "PM657288",
      "acteurRef": "PA872",
      "legislature": "14",
      "typeOrgane": "COMPER",
      "dateDebut": "2012-06-28T02:00:00.000+02:00",
      "datePublication": "2012-06-28T02:00:00.000+02:00",
      "dateFin": "2015-01-30T01:00:00.000+01:00",
      "preseance": "32",
      "nominPrincipale": "1",
      "infosQualite": {
        "codeQualite": "Membre",
        "libQualite": "Membre",
        "libQualiteSex": "Membre"
      },
      "organesRefs": [
        "PO59048"
      ]
    },
    {
      "xsiType": "MandatAvecSuppleant_Type",
      "uid": "PM671005",
      "acteurRef": "PA872",
      "legislature": "14",
      "typeOrgane": "OFFPAR",
      "dateDebut": "2012-07-11T02:00:00.000+02:00",
      "datePublication": "2012-07-11T02:00:00.000+02:00",
      "dateFin": "2017-06-20T02:00:00.000+02:00",
      "preseance": "24",
      "nominPrincipale": "1",
      "infosQualite": {
        "codeQualite": "Membre",
        "libQualite": "Membre",
        "libQualiteSex": "Membre"
      },
      "organesRefs": [
        "PO273589"
      ]
    },
    {
      "xsiType": "MandatSimple_Type",
      "uid": "PM677803",
      "acteurRef": "PA872",
      "legislature": "14",
      "typeOrgane": "ORGEXTPARL",
      "dateDebut": "2012-09-03T02:00:00.000+02:00",
      "datePublication": "2012-09-04T02:00:00.000+02:00",
      "dateFin": "2016-09-03T02:00:00.000+02:00",
      "preseance": "20",
      "nominPrincipale": "1",
      "infosQualite": {
        "codeQualite": "Titulaire",
        "libQualite": "Membre titulaire",
        "libQualiteSex": "Membre titulaire"
      },
      "organesRefs": [
        "PO60175"
      ]
    },
    {
      "xsiType": "MandatSimple_Type",
      "uid": "PM678318",
      "acteurRef": "PA872",
      "legislature": "14",
      "typeOrgane": "CNPS",
      "dateDebut": "2012-09-25T02:00:00.000+02:00",
      "datePublication": "2012-09-26T02:00:00.000+02:00",
      "dateFin": "2012-11-22T01:00:00.000+01:00",
      "preseance": "20",
      "nominPrincipale": "1",
      "infosQualite": {
        "codeQualite": "Membre",
        "libQualite": "Membre",
        "libQualiteSex": "Membre"
      },
      "organesRefs": [
        "PO678157"
      ]
    },
    {
      "xsiType": "MandatSimple_Type",
      "uid": "PM685694",
      "acteurRef": "PA872",
      "typeOrgane": "PARPOL",
      "dateDebut": "2012-12-01T01:00:00.000+01:00",
      "dateFin": "2017-06-20T02:00:00.000+02:00",
      "preseance": "5",
      "nominPrincipale": "1",
      "infosQualite": {
        "codeQualite": "Membre",
        "libQualite": "Membre",
        "libQualiteSex": "Membre"
      },
      "organesRefs": [
        "PO684932"
      ]
    },
    {
      "xsiType": "MandatMission_Type",
      "uid": "PM688403",
      "acteurRef": "PA872",
      "legislature": "14",
      "typeOrgane": "MISINFO",
      "dateDebut": "2012-12-05T01:00:00.000+01:00",
      "datePublication": "2012-12-06T01:00:00.000+01:00",
      "dateFin": "2017-06-20T02:00:00.000+02:00",
      "preseance": "10",
      "nominPrincipale": "0",
      "infosQualite": {
        "codeQualite": "Membre",
        "libQualite": "Membre",
        "libQualiteSex": "Membre"
      },
      "organesRefs": [
        "PO683565"
      ]
    },
    {
      "xsiType": "MandatMission_Type",
      "uid": "PM690299",
      "acteurRef": "PA872",
      "legislature": "14",
      "typeOrgane": "MISINFO",
      "dateDebut": "2012-12-05T01:00:00.000+01:00",
      "datePublication": "2012-12-05T01:00:00.000+01:00",
      "dateFin": "2017-06-20T02:00:00.000+02:00",
      "preseance": "2",
      "nominPrincipale": "1",
      "infosQualite": {
        "codeQualite": "Co-président",
        "libQualite": "Co-président",
        "libQualiteSex": "Co-président"
      },
      "organesRefs": [
        "PO683565"
      ]
    },
    {
      "xsiType": "MandatSimple_Type",
      "uid": "PM694372",
      "acteurRef": "PA872",
      "legislature": "14",
      "typeOrgane": "CNPE",
      "dateDebut": "2013-05-14T02:00:00.000+02:00",
      "datePublication": "2013-04-15T02:00:00.000+02:00",
      "dateFin": "2013-10-08T02:00:00.000+02:00",
      "preseance": "20",
      "nominPrincipale": "1",
      "infosQualite": {
        "codeQualite": "Membre",
        "libQualite": "Membre",
        "libQualiteSex": "Membre"
      },
      "organesRefs": [
        "PO694085"
      ]
    },
    {
      "xsiType": "MandatSimple_Type",
      "uid": "PM694398",
      "acteurRef": "PA872",
      "legislature": "14",
      "typeOrgane": "CNPE",
      "dateDebut": "2013-05-15T02:00:00.000+02:00",
      "datePublication": "2013-05-16T02:00:00.000+02:00",
      "dateFin": "2013-10-08T02:00:00.000+02:00",
      "preseance": "16",
      "nominPrincipale": "1",
      "infosQualite": {
        "codeQualite": "Rapporteur",
        "libQualite": "Rapporteur",
        "libQualiteSex": "Rapporteur"
      },
      "organesRefs": [
        "PO694085"
      ]
    },
    {
      "xsiType": "MandatMission_Type",
      "uid": "PM698755",
      "acteurRef": "PA872",
      "legislature": "14",
      "typeOrgane": "MISINFOPRE",
      "dateDebut": "2013-11-26T01:00:00.000+01:00",
      "datePublication": "2013-11-28T01:00:00.000+01:00",
      "dateFin": "2014-05-14T02:00:00.000+02:00",
      "preseance": "20",
      "nominPrincipale": "1",
      "infosQualite": {
        "codeQualite": "Membre",
        "libQualite": "Membre",
        "libQualiteSex": "Membre"
      },
      "organesRefs": [
        "PO698717"
      ]
    },
    {
      "xsiType": "MandatMission_Type",
      "uid": "PM701457",
      "acteurRef": "PA872",
      "legislature": "14",
      "typeOrgane": "MISINFO",
      "dateDebut": "2014-02-05T01:00:00.000+01:00",
      "dateFin": "2015-12-03T01:00:00.000+01:00",
      "preseance": "15",
      "nominPrincipale": "0",
      "infosQualite": {
        "codeQualite": "Rapporteur",
        "libQualite": "Rapporteur sur \"La gestion des programmes d’investissements d’avenir relevant de la mission Recherche et enseignement supérieur\"",
        "libQualiteSex": "Rapporteur sur \"La gestion des programmes d’investissements d’avenir relevant de la mission Recherche et enseignement supérieur\""
      },
      "organesRefs": [
        "PO683565"
      ]
    },
    {
      "xsiType": "MandatMission_Type",
      "uid": "PM701946",
      "acteurRef": "PA872",
      "legislature": "14",
      "typeOrgane": "MINISTERE",
      "dateDebut": "2014-06-20T02:00:00.000+02:00",
      "datePublication": "2014-06-21T02:00:00.000+02:00",
      "dateFin": "2014-12-19T01:00:00.000+01:00",
      "preseance": "1",
      "nominPrincipale": "1",
      "infosQualite": {
        "codeQualite": "en mission",
        "libQualite": "en mission",
        "libQualiteSex": "en mission"
      },
      "organesRefs": [
        "PO702892"
      ],
      "libelle": "Accompagnement des personnes en fin de vie"
    },
    {
      "xsiType": "MandatSimple_Type",
      "uid": "PM706106",
      "acteurRef": "PA872",
      "legislature": "14",
      "typeOrgane": "COMPER",
      "dateDebut": "2015-01-31T01:00:00.000+01:00",
      "datePublication": "2015-01-31T01:00:00.000+01:00",
      "dateFin": "2015-03-12T01:00:00.000+01:00",
      "preseance": "32",
      "nominPrincipale": "1",
      "infosQualite": {
        "codeQualite": "Membre",
        "libQualite": "Membre",
        "libQualiteSex": "Membre"
      },
      "organesRefs": [
        "PO420120"
      ]
    },
    {
      "xsiType": "MandatSimple_Type",
      "uid": "PM706601",
      "acteurRef": "PA872",
      "legislature": "14",
      "typeOrgane": "COMPER",
      "dateDebut": "2015-03-13T01:00:00.000+01:00",
      "datePublication": "2015-03-13T01:00:00.000+01:00",
      "dateFin": "2015-09-29T02:00:00.000+02:00",
      "preseance": "32",
      "nominPrincipale": "1",
      "infosQualite": {
        "codeQualite": "Membre",
        "libQualite": "Membre",
        "libQualiteSex": "Membre"
      },
      "organesRefs": [
        "PO59048"
      ]
    },
    {
      "xsiType": "MandatSimple_Type",
      "uid": "PM709500",
      "acteurRef": "PA872",
      "legislature": "14",
      "typeOrgane": "COMPER",
      "dateDebut": "2015-09-29T02:00:00.000+02:00",
      "datePublication": "2015-09-30T02:00:00.000+02:00",
      "dateFin": "2015-09-30T02:00:00.000+02:00",
      "preseance": "32",
      "nominPrincipale": "1",
      "infosQualite": {
        "codeQualite": "Membre",
        "libQualite": "Membre",
        "libQualiteSex": "Membre"
      },
      "organesRefs": [
        "PO420120"
      ]
    },
    {
      "xsiType": "MandatSimple_Type",
      "uid": "PM709511",
      "acteurRef": "PA872",
      "legislature": "14",
      "typeOrgane": "COMPER",
      "dateDebut": "2015-10-01T02:00:00.000+02:00",
      "dateFin": "2015-10-02T02:00:00.000+02:00",
      "preseance": "32",
      "nominPrincipale": "1",
      "infosQualite": {
        "codeQualite": "Membre",
        "libQualite": "Membre",
        "libQualiteSex": "Membre"
      },
      "organesRefs": [
        "PO59048"
      ]
    },
    {
      "xsiType": "MandatSimple_Type",
      "uid": "PM709550",
      "acteurRef": "PA872",
      "legislature": "14",
      "typeOrgane": "COMPER",
      "dateDebut": "2015-10-03T02:00:00.000+02:00",
      "datePublication": "2015-10-03T02:00:00.000+02:00",
      "dateFin": "2015-10-06T02:00:00.000+02:00",
      "preseance": "32",
      "nominPrincipale": "1",
      "infosQualite": {
        "codeQualite": "Membre",
        "libQualite": "Membre",
        "libQualiteSex": "Membre"
      },
      "organesRefs": [
        "PO420120"
      ]
    },
    {
      "xsiType": "MandatSimple_Type",
      "uid": "PM709587",
      "acteurRef": "PA872",
      "legislature": "14",
      "typeOrgane": "COMPER",
      "dateDebut": "2015-10-06T02:00:00.000+02:00",
      "datePublication": "2015-10-07T02:00:00.000+02:00",
      "dateFin": "2017-06-20T02:00:00.000+02:00",
      "preseance": "32",
      "nominPrincipale": "1",
      "infosQualite": {
        "codeQualite": "Membre",
        "libQualite": "Membre",
        "libQualiteSex": "Membre"
      },
      "organesRefs": [
        "PO59048"
      ]
    },
    {
      "xsiType": "MandatMission_Type",
      "uid": "PM710772",
      "acteurRef": "PA872",
      "legislature": "14",
      "typeOrgane": "MISINFOPRE",
      "dateDebut": "2015-12-10T01:00:00.000+01:00",
      "datePublication": "2015-12-11T01:00:00.000+01:00",
      "dateFin": "2016-07-20T02:00:00.000+02:00",
      "preseance": "20",
      "nominPrincipale": "1",
      "infosQualite": {
        "codeQualite": "Membre",
        "libQualite": "Membre",
        "libQualiteSex": "Membre"
      },
      "organesRefs": [
        "PO710376"
      ]
    },
    {
      "xsiType": "MandatSimple_Type",
      "uid": "PM711117",
      "acteurRef": "PA872",
      "legislature": "14",
      "typeOrgane": "CMP",
      "dateDebut": "2016-01-14T01:00:00.000+01:00",
      "datePublication": "2016-01-15T01:00:00.000+01:00",
      "dateFin": "2016-02-11T01:00:00.000+01:00",
      "preseance": "20",
      "nominPrincipale": "1",
      "infosQualite": {
        "codeQualite": "Titulaire",
        "libQualite": "Membre titulaire",
        "libQualiteSex": "Membre titulaire"
      },
      "organesRefs": [
        "PO709882"
      ]
    },
    {
      "xsiType": "MandatSimple_Type",
      "uid": "PM711181",
      "acteurRef": "PA872",
      "legislature": "14",
      "typeOrgane": "CMP",
      "dateDebut": "2016-01-19T01:00:00.000+01:00",
      "datePublication": "2016-01-20T01:00:00.000+01:00",
      "dateFin": "2016-02-11T01:00:00.000+01:00",
      "preseance": "16",
      "nominPrincipale": "1",
      "infosQualite": {
        "codeQualite": "Rapporteur",
        "libQualite": "Rapporteur",
        "libQualiteSex": "Rapporteur"
      },
      "organesRefs": [
        "PO709882"
      ]
    },
    {
      "xsiType": "MandatSimple_Type",
      "uid": "PM713154",
      "acteurRef": "PA872",
      "legislature": "14",
      "typeOrgane": "GP",
      "dateDebut": "2016-05-25T02:00:00.000+02:00",
      "dateFin": "2017-06-20T02:00:00.000+02:00",
      "preseance": "20",
      "nominPrincipale": "1",
      "infosQualite": {
        "codeQualite": "Membre",
        "libQualite": "Membre du",
        "libQualiteSex": "Membre du"
      },
      "organesRefs": [
        "PO713077"
      ]
    },
    {
      "xsiType": "MandatSimple_Type",
      "uid": "PM713496",
      "acteurRef": "PA872",
      "legislature": "14",
      "typeOrgane": "GE",
      "dateDebut": "2016-05-31T02:00:00.000+02:00",
      "dateFin": "2017-06-20T02:00:00.000+02:00",
      "preseance": "20",
      "nominPrincipale": "1",
      "infosQualite": {
        "codeQualite": "Membre",
        "libQualite": "Membre",
        "libQualiteSex": "Membre"
      },
      "organesRefs": [
        "PO712794"
      ]
    },
    {
      "xsiType": "MandatSimple_Type",
      "uid": "PM717286",
      "acteurRef": "PA872",
      "legislature": "14",
      "typeOrgane": "ORGEXTPARL",
      "dateDebut": "2016-09-13T02:00:00.000+02:00",
      "datePublication": "2016-09-13T02:00:00.000+02:00",
      "dateFin": "2017-06-20T02:00:00.000+02:00",
      "preseance": "20",
      "nominPrincipale": "1",
      "infosQualite": {
        "codeQualite": "Titulaire",
        "libQualite": "Membre titulaire",
        "libQualiteSex": "Membre titulaire"
      },
      "organesRefs": [
        "PO60175"
      ]
    }
  ]
}