{
  "uid": "PA915",
  "etatCivil": {
    "ident": {
      "civ": "Mme",
      "prenom": "Anne-Marie",
      "nom": "Comparini",
      "alpha": "Comparini"
    },
    "infoNaissance": {
      "dateNais": "1947-07-11T01:00:00.000+01:00",
      "villeNais": "Orange",
      "depNais": "Vaucluse",
      "paysNais": "France"
    }
  },
  "profession": {
    "libelleCourant": "Administratrice",
    "socProcInsee": {
      "catSocPro": "Cadres d'entreprise",
      "famSocPro": "Cadres et professions intellectuelles supérieures"
    }
  },
  "adresses": [
    {
      "xsiType": "AdressePostale_Type",
      "uid": "AD11215",
      "type": "0",
      "typeLibelle": "Adresse officielle",
      "poids": "1",
      "intitule": "Casier de la Poste,",
      "complementAdresse": "Palais Bourbon,",
      "codePostal": "75355",
      "ville": "Paris 07 SP"
    },
    {
      "xsiType": "AdresseMail_Type",
      "uid": "AD12683",
      "type": "15",
      "typeLibelle": "Mèl",
      "valElec": "amcomparini@assemblee-nationale.fr"
    },
    {
      "xsiType": "AdresseTelephonique_Type",
      "uid": "AD284018",
      "type": "11",
      "typeLibelle": "Téléphone",
      "poids": "1",
      "adresseDeRattachement": "AD11215",
      "valElec": "01 40 63 67 09"
    },
    {
      "xsiType": "AdressePostale_Type",
      "uid": "AD285973",
      "type": "2",
      "typeLibelle": "Adresse publiée de circonscription",
      "poids": "21",
      "intitule": "Permanence parlementaire,",
      "numeroRue": "203",
      "nomRue": "Montée de Choulans,",
      "codePostal": "69005",
      "ville": "Lyon"
    },
    {
      "xsiType": "AdresseTelephonique_Type",
      "uid": "AD285974",
      "type": "11",
      "typeLibelle": "Téléphone",
      "poids": "21",
      "adresseDeRattachement": "AD285973",
      "valElec": "04 78 36 67 46"
    },
    {
      "xsiType": "AdresseTelephonique_Type",
      "uid": "AD285975",
      "type": "12",
      "typeLibelle": "Télécopie",
      "poids": "21",
      "adresseDeRattachement": "AD285973",
      "valElec": "04 78 36 29 77"
    },
    {
      "xsiType": "AdresseTelephonique_Type",
      "uid": "AD286240",
      "type": "12",
      "typeLibelle": "Télécopie",
      "poids": "1",
      "adresseDeRattachement": "AD11215",
      "valElec": "01 40 63 98 95"
    },
    {
      "xsiType": "AdresseMail_Type",
      "uid": "AD288248",
      "type": "15",
      "typeLibelle": "Mèl",
      "valElec": "anne-marie@comparini.net"
    },
    {
      "xsiType": "AdresseSiteWeb_Type",
      "uid": "AD291074",
      "type": "22",
      "typeLibelle": "Site internet",
      "valElec": "www.comparini.net"
    }
  ],
  "mandats": [
    {
      "xsiType": "MandatParlementaire_type",
      "uid": "PM268014",
      "acteurRef": "PA915",
      "legislature": "12",
      "typeOrgane": "ASSEMBLEE",
      "dateDebut": "2002-06-19T02:00:00.000+02:00",
      "dateFin": "2007-06-19T02:00:00.000+02:00",
      "preseance": "50",
      "nominPrincipale": "1",
      "infosQualite": {
        "codeQualite": "membre",
        "libQualite": "membre",
        "libQualiteSex": "membre"
      },
      "organesRefs": [
        "PO230434"
      ],
      "suppleant": {
        "dateDebut": "2002-06-19T02:00:00.000+02:00",
        "dateFin": "2007-06-19T02:00:00.000+02:00",
        "suppleantRef": "PA268013"
      },
      "election": {
        "lieu": {
          "region": "Auvergne-Rhône-Alpes",
          "regionType": "Métropolitain",
          "departement": "Rhône",
          "numDepartement": "69",
          "numCirco": "1"
        },
        "causeMandat": "élections générales",
        "refCirconscription": "PO230794"
      },
      "mandature": {
        "datePriseFonction": "2002-06-19T02:00:00.000+02:00",
        "causeFin": "Fin de législature",
        "premiereElection": "0"
      }
    },
    {
      "xsiType": "MandatSimple_Type",
      "uid": "PM271467",
      "acteurRef": "PA915",
      "legislature": "12",
      "typeOrgane": "GP",
      "dateDebut": "2002-06-25T02:00:00.000+02:00",
      "datePublication": "2002-06-26T02:00:00.000+02:00",
      "dateFin": "2007-06-19T02:00:00.000+02:00",
      "preseance": "20",
      "nominPrincipale": "1",
      "infosQualite": {
        "codeQualite": "Membre",
        "libQualite": "Membre du",
        "libQualiteSex": "Membre du"
      },
      "organesRefs": [
        "PO270911"
      ]
    },
    {
      "xsiType": "MandatAvecSuppleant_Type",
      "uid": "PM272290",
      "acteurRef": "PA915",
      "legislature": "12",
      "typeOrgane": "COMNL",
      "dateDebut": "2002-06-26T02:00:00.000+02:00",
      "datePublication": "2002-06-27T02:00:00.000+02:00",
      "dateFin": "2007-06-19T02:00:00.000+02:00",
      "preseance": "28",
      "nominPrincipale": "1",
      "infosQualite": {
        "codeQualite": "Suppléant",
        "libQualite": "Membre suppléant",
        "libQualiteSex": "Membre suppléante"
      },
      "organesRefs": [
        "PO271850"
      ]
    },
    {
      "xsiType": "MandatSimple_Type",
      "uid": "PM273469",
      "acteurRef": "PA915",
      "legislature": "12",
      "typeOrgane": "DELEG",
      "dateDebut": "2002-07-03T02:00:00.000+02:00",
      "datePublication": "2002-07-03T02:00:00.000+02:00",
      "dateFin": "2007-06-19T02:00:00.000+02:00",
      "preseance": "20",
      "nominPrincipale": "1",
      "infosQualite": {
        "codeQualite": "Membre",
        "libQualite": "Membre",
        "libQualiteSex": "Membre"
      },
      "organesRefs": [
        "PO201269"
      ]
    },
    {
      "xsiType": "MandatSimple_Type",
      "uid": "PM273718",
      "acteurRef": "PA915",
      "legislature": "12",
      "typeOrgane": "DELEG",
      "dateDebut": "2002-07-10T02:00:00.000+02:00",
      "datePublication": "2002-07-11T02:00:00.000+02:00",
      "dateFin": "2007-06-19T02:00:00.000+02:00",
      "preseance": "8",
      "nominPrincipale": "1",
      "infosQualite": {
        "codeQualite": "Vice-Président",
        "libQualite": "Vice-Président",
        "libQualiteSex": "Vice-Présidente"
      },
      "organesRefs": [
        "PO201269"
      ]
    },
    {
      "xsiType": "MandatSimple_Type",
      "uid": "PM280572",
      "acteurRef": "PA915",
      "legislature": "12",
      "typeOrgane": "GA",
      "dateDebut": "2002-11-06T01:00:00.000+01:00",
      "dateFin": "2007-06-19T02:00:00.000+02:00",
      "preseance": "20",
      "nominPrincipale": "1",
      "infosQualite": {
        "codeQualite": "Membre",
        "libQualite": "Membre",
        "libQualiteSex": "Membre"
      },
      "organesRefs": [
        "PO274153"
      ]
    },
    {
      "xsiType": "MandatSimple_Type",
      "uid": "PM280573",
      "acteurRef": "PA915",
      "legislature": "12",
      "typeOrgane": "GEVI",
      "dateDebut": "2002-11-06T01:00:00.000+01:00",
      "dateFin": "2007-06-19T02:00:00.000+02:00",
      "preseance": "20",
      "nominPrincipale": "1",
      "infosQualite": {
        "codeQualite": "Membre",
        "libQualite": "Membre",
        "libQualiteSex": "Membre"
      },
      "organesRefs": [
        "PO274049"
      ]
    },
    {
      "xsiType": "MandatSimple_Type",
      "uid": "PM280574",
      "acteurRef": "PA915",
      "legislature": "12",
      "typeOrgane": "GA",
      "dateDebut": "2002-11-06T01:00:00.000+01:00",
      "dateFin": "2007-06-19T02:00:00.000+02:00",
      "preseance": "20",
      "nominPrincipale": "1",
      "infosQualite": {
        "codeQualite": "Membre",
        "libQualite": "Membre",
        "libQualiteSex": "Membre"
      },
      "organesRefs": [
        "PO274128"
      ]
    },
    {
      "xsiType": "MandatSimple_Type",
      "uid": "PM280575",
      "acteurRef": "PA915",
      "legislature": "12",
      "typeOrgane": "GA",
      "dateDebut": "2002-11-06T01:00:00.000+01:00",
      "dateFin": "2007-06-19T02:00:00.000+02:00",
      "preseance": "20",
      "nominPrincipale": "1",
      "infosQualite": {
        "codeQualite": "Membre",
        "libQualite": "Membre",
        "libQualiteSex": "Membre"
      },
      "organesRefs": [
        "PO274156"
      ]
    },
    {
      "xsiType": "MandatSimple_Type",
      "uid": "PM280576",
      "acteurRef": "PA915",
      "legislature": "12",
      "typeOrgane": "GA",
      "dateDebut": "2002-11-06T01:00:00.000+01:00",
      "dateFin": "2007-06-19T02:00:00.000+02:00",
      "preseance": "20",
      "nominPrincipale": "1",
      "infosQualite": {
        "codeQualite": "Membre",
        "libQualite": "Membre",
        "libQualiteSex": "Membre"
      },
      "organesRefs": [
        "PO274203"
      ]
    },
    {
      "xsiType": "MandatSimple_Type",
      "uid": "PM286841",
      "acteurRef": "PA915",
      "legislature": "12",
      "typeOrgane": "GA",
      "dateDebut": "2002-12-18T01:00:00.000+01:00",
      "dateFin": "2007-06-19T02:00:00.000+02:00",
      "preseance": "8",
      "nominPrincipale": "1",
      "infosQualite": {
        "codeQualite": "Vice-Président",
        "libQualite": "Vice-Président",
        "libQualiteSex": "Vice-Présidente"
      },
      "organesRefs": [
        "PO274128"
      ]
    },
    {
      "xsiType": "MandatSimple_Type",
      "uid": "PM288790",
      "acteurRef": "PA915",
      "legislature": "12",
      "typeOrgane": "API",
      "dateDebut": "2002-10-01T02:00:00.000+02:00",
      "dateFin": "2007-06-19T02:00:00.000+02:00",
      "preseance": "20",
      "nominPrincipale": "1",
      "infosQualite": {
        "codeQualite": "Membre",
        "libQualite": "Membre",
        "libQualiteSex": "Membre"
      },
      "organesRefs": [
        "PO201115"
      ]
    },
    {
      "xsiType": "MandatSimple_Type",
      "uid": "PM289304",
      "acteurRef": "PA915",
      "legislature": "12",
      "typeOrgane": "GA",
      "dateDebut": "2002-11-27T01:00:00.000+01:00",
      "dateFin": "2007-06-19T02:00:00.000+02:00",
      "preseance": "8",
      "nominPrincipale": "1",
      "infosQualite": {
        "codeQualite": "Vice-Président",
        "libQualite": "Vice-Président",
        "libQualiteSex": "Vice-Présidente"
      },
      "organesRefs": [
        "PO274203"
      ]
    },
    {
      "xsiType": "MandatSimple_Type",
      "uid": "PM289764",
      "acteurRef": "PA915",
      "legislature": "12",
      "typeOrgane": "GE",
      "dateDebut": "2003-02-04T01:00:00.000+01:00",
      "dateFin": "2007-06-19T02:00:00.000+02:00",
      "preseance": "20",
      "nominPrincipale": "1",
      "infosQualite": {
        "codeQualite": "Membre",
        "libQualite": "Membre",
        "libQualiteSex": "Membre"
      },
      "organesRefs": [
        "PO285043"
      ]
    },
    {
      "xsiType": "MandatSimple_Type",
      "uid": "PM292338",
      "acteurRef": "PA915",
      "legislature": "12",
      "typeOrgane": "DELEG",
      "dateDebut": "2003-04-30T02:00:00.000+02:00",
      "datePublication": "2003-04-30T02:00:00.000+02:00",
      "dateFin": "2007-06-19T02:00:00.000+02:00",
      "preseance": "20",
      "nominPrincipale": "1",
      "infosQualite": {
        "codeQualite": "Membre",
        "libQualite": "Membre",
        "libQualiteSex": "Membre"
      },
      "organesRefs": [
        "PO59054"
      ]
    },
    {
      "xsiType": "MandatSimple_Type",
      "uid": "PM311037",
      "acteurRef": "PA915",
      "legislature": "12",
      "typeOrgane": "GE",
      "dateDebut": "2005-03-23T01:00:00.000+01:00",
      "dateFin": "2007-06-19T02:00:00.000+02:00",
      "preseance": "20",
      "nominPrincipale": "1",
      "infosQualite": {
        "codeQualite": "Membre",
        "libQualite": "Membre",
        "libQualiteSex": "Membre"
      },
      "organesRefs": [
        "PO309957"
      ]
    },
    {
      "xsiType": "MandatSimple_Type",
      "uid": "PM323057",
      "acteurRef": "PA915",
      "legislature": "12",
      "typeOrgane": "COMPER",
      "dateDebut": "2006-04-14T02:00:00.000+02:00",
      "datePublication": "2006-04-14T02:00:00.000+02:00",
      "dateFin": "2007-06-19T02:00:00.000+02:00",
      "preseance": "32",
      "nominPrincipale": "1",
      "infosQualite": {
        "codeQualite": "Membre",
        "libQualite": "Membre",
        "libQualiteSex": "Membre"
      },
      "organesRefs": [
        "PO59051"
      ]
    },
    {
      "xsiType": "MandatSimple_Type",
      "uid": "PM324345",
      "acteurRef": "PA915",
      "legislature": "12",
      "typeOrgane": "GE",
      "dateDebut": "2006-06-20T02:00:00.000+02:00",
      "dateFin": "2007-06-19T02:00:00.000+02:00",
      "preseance": "20",
      "nominPrincipale": "1",
      "infosQualite": {
        "codeQualite": "Membre",
        "libQualite": "Membre",
        "libQualiteSex": "Membre"
      },
      "organesRefs": [
        "PO323244"
      ]
    },
    {
      "xsiType": "MandatSimple_Type",
      "uid": "PM324375",
      "acteurRef": "PA915",
      "legislature": "12",
      "typeOrgane": "GE",
      "dateDebut": "2006-06-28T02:00:00.000+02:00",
      "dateFin": "2007-06-19T02:00:00.000+02:00",
      "preseance": "8",
      "nominPrincipale": "1",
      "infosQualite": {
        "codeQualite": "Vice-Président",
        "libQualite": "Vice-Président",
        "libQualiteSex": "Vice-Présidente"
      },
      "organesRefs": [
        "PO323244"
      ]
    }
  ]
}