{
  "xsiType": "OrganeParlementaire_Type",
  "uid": "PO402907",
  "codeType": "GE",
  "libelle": "Coutellerie et arts de la table",
  "libelleEdition": "sur la coutellerie et les arts de la table",
  "libelleAbrege": "Coutellerie et arts de la table",
  "libelleAbrev": "COU",
  "viMoDe": {
    "dateAgrement": "2007-10-31T01:00:00.000+01:00",
    "dateFin": "2012-06-19T02:00:00.000+02:00"
  },
  "regime": "5ème République",
  "legislature": "13",
  "secretariat": {}
}