{
  "uid": "PA803",
  "etatCivil": {
    "ident": {
      "civ": "M.",
      "prenom": "Jean-Yves",
      "nom": "Chamard",
      "alpha": "Chamard"
    },
    "infoNaissance": {
      "dateNais": "1942-12-14T01:00:00.000+01:00",
      "villeNais": "Tours",
      "depNais": "Indre-et-Loire",
      "paysNais": "France"
    }
  },
  "profession": {
    "libelleCourant": "Maître de conférences à l'Université de Poitiers",
    "socProcInsee": {
      "catSocPro": "Cadres de la fonction publique, professions intellectuelles et  artistiques",
      "famSocPro": "Cadres et professions intellectuelles supérieures"
    }
  },
  "adresses": [
    {
      "xsiType": "AdressePostale_Type",
      "uid": "AD11098",
      "type": "0",
      "typeLibelle": "Adresse officielle",
      "poids": "1",
      "intitule": "Casier de la Poste,",
      "complementAdresse": "Palais Bourbon,",
      "codePostal": "75355",
      "ville": "Paris 07 SP"
    },
    {
      "xsiType": "AdresseMail_Type",
      "uid": "AD12671",
      "type": "15",
      "typeLibelle": "Mèl",
      "valElec": "jychamard@assemblee-nationale.fr"
    },
    {
      "xsiType": "AdressePostale_Type",
      "uid": "AD13818",
      "type": "2",
      "typeLibelle": "Adresse publiée de circonscription",
      "poids": "21",
      "intitule": "Permanence,",
      "numeroRue": "20",
      "nomRue": "Boulevard de Verdun,",
      "complementAdresse": "BP 507,",
      "codePostal": "86012",
      "ville": "Poitiers cedex"
    },
    {
      "xsiType": "AdresseTelephonique_Type",
      "uid": "AD13819",
      "type": "11",
      "typeLibelle": "Téléphone",
      "poids": "21",
      "adresseDeRattachement": "AD13818",
      "valElec": "05 49 41 09 71"
    },
    {
      "xsiType": "AdresseTelephonique_Type",
      "uid": "AD13820",
      "type": "12",
      "typeLibelle": "Télécopie",
      "poids": "21",
      "adresseDeRattachement": "AD13818",
      "valElec": "05 49 41 08 70"
    },
    {
      "xsiType": "AdressePostale_Type",
      "uid": "AD47108",
      "type": "2",
      "typeLibelle": "Adresse publiée de circonscription",
      "poids": "22",
      "intitule": "Conseil général,",
      "complementAdresse": "BP 319,",
      "codePostal": "86008",
      "ville": "Poitiers cedex"
    },
    {
      "xsiType": "AdresseTelephonique_Type",
      "uid": "AD48921",
      "type": "11",
      "typeLibelle": "Téléphone",
      "poids": "22",
      "adresseDeRattachement": "AD47108",
      "valElec": "05 49 55 66 74"
    },
    {
      "xsiType": "AdresseTelephonique_Type",
      "uid": "AD50260",
      "type": "12",
      "typeLibelle": "Télécopie",
      "poids": "22",
      "adresseDeRattachement": "AD47108",
      "valElec": "05 49 37 88 01"
    },
    {
      "xsiType": "AdresseSiteWeb_Type",
      "uid": "AD325950",
      "type": "22",
      "typeLibelle": "Site internet",
      "valElec": "jychamard.org/"
    }
  ],
  "mandats": [
    {
      "xsiType": "MandatParlementaire_type",
      "uid": "PM267568",
      "acteurRef": "PA803",
      "legislature": "12",
      "typeOrgane": "ASSEMBLEE",
      "dateDebut": "2002-06-19T02:00:00.000+02:00",
      "dateFin": "2007-06-19T02:00:00.000+02:00",
      "preseance": "50",
      "nominPrincipale": "1",
      "infosQualite": {
        "codeQualite": "membre",
        "libQualite": "membre",
        "libQualiteSex": "membre"
      },
      "organesRefs": [
        "PO230434"
      ],
      "suppleant": {
        "dateDebut": "2002-06-19T02:00:00.000+02:00",
        "dateFin": "2007-06-19T02:00:00.000+02:00",
        "suppleantRef": "PA267567"
      },
      "election": {
        "lieu": {
          "region": "Nouvelle-Aquitaine",
          "regionType": "Métropolitain",
          "departement": "Vienne",
          "numDepartement": "86",
          "numCirco": "2"
        },
        "causeMandat": "élections générales",
        "refCirconscription": "PO230917"
      },
      "mandature": {
        "datePriseFonction": "2002-06-19T02:00:00.000+02:00",
        "causeFin": "Fin de législature",
        "premiereElection": "1"
      }
    },
    {
      "xsiType": "MandatSimple_Type",
      "uid": "PM271022",
      "acteurRef": "PA803",
      "legislature": "12",
      "typeOrgane": "GP",
      "dateDebut": "2002-06-25T02:00:00.000+02:00",
      "datePublication": "2002-06-26T02:00:00.000+02:00",
      "dateFin": "2007-06-19T02:00:00.000+02:00",
      "preseance": "20",
      "nominPrincipale": "1",
      "infosQualite": {
        "codeQualite": "Membre",
        "libQualite": "Membre du",
        "libQualiteSex": "Membre du"
      },
      "organesRefs": [
        "PO270903"
      ]
    },
    {
      "xsiType": "MandatSimple_Type",
      "uid": "PM271526",
      "acteurRef": "PA803",
      "legislature": "12",
      "typeOrgane": "COMPER",
      "dateDebut": "2002-06-26T02:00:00.000+02:00",
      "datePublication": "2002-06-27T02:00:00.000+02:00",
      "dateFin": "2007-06-19T02:00:00.000+02:00",
      "preseance": "32",
      "nominPrincipale": "1",
      "infosQualite": {
        "codeQualite": "Membre",
        "libQualite": "Membre",
        "libQualiteSex": "Membre"
      },
      "organesRefs": [
        "PO59048"
      ]
    },
    {
      "xsiType": "MandatSimple_Type",
      "uid": "PM275374",
      "acteurRef": "PA803",
      "legislature": "12",
      "typeOrgane": "ORGEXTPARL",
      "dateDebut": "2002-08-01T02:00:00.000+02:00",
      "datePublication": "2002-08-02T02:00:00.000+02:00",
      "dateFin": "2007-06-19T02:00:00.000+02:00",
      "preseance": "30",
      "nominPrincipale": "1",
      "infosQualite": {
        "codeQualite": "Suppléant",
        "libQualite": "Membre suppléant",
        "libQualiteSex": "Membre suppléant"
      },
      "organesRefs": [
        "PO229652"
      ]
    },
    {
      "xsiType": "MandatSimple_Type",
      "uid": "PM290089",
      "acteurRef": "PA803",
      "legislature": "12",
      "typeOrgane": "GE",
      "dateDebut": "2003-02-10T01:00:00.000+01:00",
      "dateFin": "2007-06-19T02:00:00.000+02:00",
      "preseance": "20",
      "nominPrincipale": "1",
      "infosQualite": {
        "codeQualite": "Membre",
        "libQualite": "Membre",
        "libQualiteSex": "Membre"
      },
      "organesRefs": [
        "PO285047"
      ]
    },
    {
      "xsiType": "MandatSimple_Type",
      "uid": "PM290593",
      "acteurRef": "PA803",
      "legislature": "12",
      "typeOrgane": "GE",
      "dateDebut": "2003-03-05T01:00:00.000+01:00",
      "dateFin": "2007-06-19T02:00:00.000+02:00",
      "preseance": "20",
      "nominPrincipale": "1",
      "infosQualite": {
        "codeQualite": "Membre",
        "libQualite": "Membre",
        "libQualiteSex": "Membre"
      },
      "organesRefs": [
        "PO285107"
      ]
    },
    {
      "xsiType": "MandatSimple_Type",
      "uid": "PM290682",
      "acteurRef": "PA803",
      "legislature": "12",
      "typeOrgane": "GE",
      "dateDebut": "2003-01-14T01:00:00.000+01:00",
      "dateFin": "2007-06-19T02:00:00.000+02:00",
      "preseance": "20",
      "nominPrincipale": "1",
      "infosQualite": {
        "codeQualite": "Membre",
        "libQualite": "Membre",
        "libQualiteSex": "Membre"
      },
      "organesRefs": [
        "PO285078"
      ]
    },
    {
      "xsiType": "MandatSimple_Type",
      "uid": "PM291925",
      "acteurRef": "PA803",
      "legislature": "12",
      "typeOrgane": "GE",
      "dateDebut": "2002-11-26T01:00:00.000+01:00",
      "dateFin": "2007-06-19T02:00:00.000+02:00",
      "preseance": "20",
      "nominPrincipale": "1",
      "infosQualite": {
        "codeQualite": "Membre",
        "libQualite": "Membre",
        "libQualiteSex": "Membre"
      },
      "organesRefs": [
        "PO287146"
      ]
    },
    {
      "xsiType": "MandatSimple_Type",
      "uid": "PM310637",
      "acteurRef": "PA803",
      "legislature": "12",
      "typeOrgane": "GE",
      "dateDebut": "2005-03-17T01:00:00.000+01:00",
      "dateFin": "2007-06-19T02:00:00.000+02:00",
      "preseance": "20",
      "nominPrincipale": "1",
      "infosQualite": {
        "codeQualite": "Membre",
        "libQualite": "Membre",
        "libQualiteSex": "Membre"
      },
      "organesRefs": [
        "PO309973"
      ]
    },
    {
      "xsiType": "MandatSimple_Type",
      "uid": "PM314818",
      "acteurRef": "PA803",
      "legislature": "12",
      "typeOrgane": "COMPER",
      "dateDebut": "2005-03-29T02:00:00.000+02:00",
      "dateFin": "2007-06-19T02:00:00.000+02:00",
      "preseance": "500",
      "nominPrincipale": "0",
      "infosQualite": {
        "codeQualite": "Rapporteur spécial",
        "libQualite": "Rapporteur spécial au nom de la commission des finances : Enseignement scolaire",
        "libQualiteSex": "Rapporteur spécial au nom de la commission des finances : Enseignement scolaire"
      },
      "organesRefs": [
        "PO59048"
      ]
    }
  ]
}