{
  "xsiType": "OrganeParlementaire_Type",
  "uid": "PO743902",
  "codeType": "MISINFO",
  "libelle": "Mission d'information sur la diplomatie économique : où en est la diplomatie économique de la France ?",
  "libelleEdition": "de la mission d'information sur la diplomatie économique : où en est la diplomatie économique de la France ?",
  "libelleAbrege": "Diplomatie économique de la France",
  "libelleAbrev": "ECONOMIE",
  "viMoDe": {
    "dateDebut": "2017-10-24T02:00:00.000+02:00",
    "dateFin": "2018-09-19T02:00:00.000+02:00"
  },
  "organeParentRef": "PO59047",
  "regime": "5ème République",
  "legislature": "15",
  "secretariat": {}
}