{
  "xsiType": "OrganeParlementaire_Type",
  "uid": "PO273580",
  "codeType": "DELEGBUREAU",
  "libelle": "Délégation chargée des questions concernant les offices parlementaires",
  "libelleEdition": "de la délégation du  Bureau chargée des questions concernant les offices parlementaires",
  "libelleAbrege": "Délégation concernant les offices parlementaires",
  "libelleAbrev": "OFP",
  "viMoDe": {
    "dateDebut": "2002-07-03T02:00:00.000+02:00",
    "dateFin": "2007-06-19T02:00:00.000+02:00"
  },
  "regime": "5ème République",
  "legislature": "12",
  "secretariat": {}
}