{
  "xsiType": "OrganeParlementaireInternational",
  "uid": "PO274123",
  "codeType": "GA",
  "libelle": "France Grand-Duché de Luxembourg",
  "libelleEdition": "de France Grand-Duché de Luxembourg",
  "libelleAbrege": "Luxembourg",
  "libelleAbrev": "L",
  "viMoDe": {
    "dateAgrement": "2002-07-24T02:00:00.000+02:00",
    "dateFin": "2007-06-19T02:00:00.000+02:00"
  },
  "regime": "5ème République",
  "legislature": "12",
  "secretariat": {}
}