{
  "xsiType": "OrganeParlementaire_Type",
  "uid": "PO760529",
  "codeType": "MISINFO",
  "libelle": "Mission flash précocités et troubles associés : quelle prise en charge à l'école ?",
  "libelleAbrege": "Prise en charge des enfants précoces",
  "libelleAbrev": "PRECOCITE",
  "viMoDe": {
    "dateDebut": "2018-11-21T01:00:00.000+01:00"
  },
  "organeParentRef": "PO419604",
  "regime": "5ème République",
  "legislature": "15",
  "secretariat": {}
}