{
  "uid": "PA415499",
  "etatCivil": {
    "ident": {
      "civ": "M.",
      "prenom": "Georges",
      "nom": "Patient",
      "alpha": "PATIENT GEORGES"
    },
    "infoNaissance": {
      "dateNais": "1949-04-01T01:00:00.000+01:00"
    }
  },
  "profession": {
    "socProcInsee": {}
  },
  "adresses": [
    {
      "xsiType": "AdresseSiteWeb_Type",
      "uid": "AD415680",
      "type": "23",
      "typeLibelle": "Url sénateur",
      "valElec": "https://www.senat.fr/senateur/patient_georges08073c.html"
    }
  ],
  "mandats": [
    {
      "xsiType": "MandatParlementaire_type",
      "uid": "PM415614",
      "acteurRef": "PA415499",
      "typeOrgane": "SENAT",
      "dateDebut": "2008-10-01T02:00:00.000+02:00",
      "dateFin": "2014-09-30T02:00:00.000+02:00",
      "preseance": "20",
      "nominPrincipale": "1",
      "infosQualite": {
        "codeQualite": "Sénateur",
        "libQualite": "SENATEUR",
        "libQualiteSex": "SENATEUR"
      },
      "organesRefs": [
        "PO78718"
      ],
      "election": {
        "lieu": {
          "numDepartement": "973"
        }
      },
      "mandature": {
        "premiereElection": "0"
      }
    },
    {
      "xsiType": "MandatSimple_Type",
      "uid": "PM415797",
      "acteurRef": "PA415499",
      "typeOrgane": "GROUPESENAT",
      "dateDebut": "2008-10-01T02:00:00.000+02:00",
      "dateFin": "2015-06-09T02:00:00.000+02:00",
      "preseance": "4",
      "nominPrincipale": "1",
      "infosQualite": {
        "codeQualite": "Membre",
        "libQualite": "Membre",
        "libQualiteSex": "Membre"
      },
      "organesRefs": [
        "PO77710"
      ]
    },
    {
      "xsiType": "MandatSimple_Type",
      "uid": "PM415925",
      "acteurRef": "PA415499",
      "typeOrgane": "COMSENAT",
      "dateDebut": "2008-10-07T02:00:00.000+02:00",
      "dateFin": "2011-09-30T02:00:00.000+02:00",
      "preseance": "10",
      "nominPrincipale": "1",
      "infosQualite": {
        "codeQualite": "Membre",
        "libQualite": "Membre",
        "libQualiteSex": "Membre"
      },
      "organesRefs": [
        "PO211492"
      ]
    },
    {
      "xsiType": "MandatSimple_Type",
      "uid": "PM421491",
      "acteurRef": "PA415499",
      "typeOrgane": "API",
      "dateDebut": "2009-09-11T02:00:00.000+02:00",
      "dateFin": "2014-09-30T02:00:00.000+02:00",
      "preseance": "20",
      "nominPrincipale": "1",
      "infosQualite": {
        "codeQualite": "Membre",
        "libQualite": "Membre",
        "libQualiteSex": "Membre"
      },
      "organesRefs": [
        "PO201115"
      ]
    },
    {
      "xsiType": "MandatSimple_Type",
      "uid": "PM430391",
      "acteurRef": "PA415499",
      "typeOrgane": "COMSENAT",
      "dateDebut": "2011-10-01T02:00:00.000+02:00",
      "dateFin": "2014-10-08T02:00:00.000+02:00",
      "preseance": "10",
      "nominPrincipale": "1",
      "infosQualite": {
        "codeQualite": "Membre",
        "libQualite": "Membre",
        "libQualiteSex": "Membre"
      },
      "organesRefs": [
        "PO211494"
      ]
    },
    {
      "xsiType": "MandatSimple_Type",
      "uid": "PM430835",
      "acteurRef": "PA415499",
      "typeOrgane": "CMP",
      "dateDebut": "2011-10-20T02:00:00.000+02:00",
      "datePublication": "2011-10-21T02:00:00.000+02:00",
      "dateFin": "2011-10-25T02:00:00.000+02:00",
      "preseance": "28",
      "nominPrincipale": "1",
      "infosQualite": {
        "codeQualite": "Suppléant",
        "libQualite": "Membre suppléant",
        "libQualiteSex": "Membre suppléant"
      },
      "organesRefs": [
        "PO430805"
      ]
    },
    {
      "xsiType": "MandatSimple_Type",
      "uid": "PM437031",
      "acteurRef": "PA415499",
      "typeOrgane": "DELEGSENAT",
      "dateDebut": "2011-11-30T01:00:00.000+01:00",
      "preseance": "4",
      "nominPrincipale": "1",
      "infosQualite": {
        "codeQualite": "Membre",
        "libQualite": "Membre",
        "libQualiteSex": "Membre"
      },
      "organesRefs": [
        "PO436945"
      ]
    },
    {
      "xsiType": "MandatParlementaire_type",
      "uid": "PM703647",
      "acteurRef": "PA415499",
      "typeOrgane": "SENAT",
      "dateDebut": "2014-10-01T02:00:00.000+02:00",
      "preseance": "20",
      "nominPrincipale": "1",
      "infosQualite": {
        "codeQualite": "Sénateur",
        "libQualite": "SENATEUR",
        "libQualiteSex": "SENATEUR"
      },
      "organesRefs": [
        "PO78718"
      ],
      "election": {
        "lieu": {
          "numDepartement": "973"
        }
      },
      "mandature": {
        "premiereElection": "0"
      }
    },
    {
      "xsiType": "MandatSimple_Type",
      "uid": "PM704166",
      "acteurRef": "PA415499",
      "typeOrgane": "COMSENAT",
      "dateDebut": "2014-10-09T02:00:00.000+02:00",
      "dateFin": "2017-10-04T02:00:00.000+02:00",
      "nominPrincipale": "1",
      "infosQualite": {
        "libQualite": "Vice-Président",
        "libQualiteSex": "Vice-Président"
      },
      "organesRefs": [
        "PO211494"
      ]
    },
    {
      "xsiType": "MandatSimple_Type",
      "uid": "PM704947",
      "acteurRef": "PA415499",
      "typeOrgane": "DELEGSENAT",
      "dateDebut": "2014-10-29T01:00:00.000+01:00",
      "preseance": "4",
      "nominPrincipale": "1",
      "infosQualite": {
        "codeQualite": "Membre",
        "libQualite": "Membre",
        "libQualiteSex": "Membre"
      },
      "organesRefs": [
        "PO436945"
      ]
    },
    {
      "xsiType": "MandatSimple_Type",
      "uid": "PM708429",
      "acteurRef": "PA415499",
      "typeOrgane": "CMP",
      "dateDebut": "2015-06-09T02:00:00.000+02:00",
      "datePublication": "2015-06-10T02:00:00.000+02:00",
      "dateFin": "2015-06-12T02:00:00.000+02:00",
      "preseance": "20",
      "nominPrincipale": "1",
      "infosQualite": {
        "codeQualite": "Titulaire",
        "libQualite": "Membre titulaire",
        "libQualiteSex": "Membre titulaire"
      },
      "organesRefs": [
        "PO708315"
      ]
    },
    {
      "xsiType": "MandatSimple_Type",
      "uid": "PM708640",
      "acteurRef": "PA415499",
      "typeOrgane": "GROUPESENAT",
      "dateDebut": "2015-06-10T02:00:00.000+02:00",
      "dateFin": "2017-06-27T02:00:00.000+02:00",
      "preseance": "4",
      "nominPrincipale": "1",
      "infosQualite": {
        "codeQualite": "Membre",
        "libQualite": "Membre",
        "libQualiteSex": "Membre"
      },
      "organesRefs": [
        "PO77710"
      ]
    },
    {
      "xsiType": "MandatSimple_Type",
      "uid": "PM716694",
      "acteurRef": "PA415499",
      "typeOrgane": "CMP",
      "dateDebut": "2017-01-24T01:00:00.000+01:00",
      "datePublication": "2017-02-01T01:00:00.000+01:00",
      "dateFin": "2017-02-02T01:00:00.000+01:00",
      "preseance": "28",
      "nominPrincipale": "1",
      "infosQualite": {
        "codeQualite": "Suppléant",
        "libQualite": "Membre suppléant",
        "libQualiteSex": "Membre suppléant"
      },
      "organesRefs": [
        "PO716574"
      ]
    },
    {
      "xsiType": "MandatSimple_Type",
      "uid": "PM732464",
      "acteurRef": "PA415499",
      "typeOrgane": "GROUPESENAT",
      "dateDebut": "2017-06-28T02:00:00.000+02:00",
      "preseance": "4",
      "nominPrincipale": "1",
      "infosQualite": {
        "codeQualite": "Membre",
        "libQualite": "Membre",
        "libQualiteSex": "Membre"
      },
      "organesRefs": [
        "PO732421"
      ]
    },
    {
      "xsiType": "MandatSimple_Type",
      "uid": "PM741306",
      "acteurRef": "PA415499",
      "typeOrgane": "COMSENAT",
      "dateDebut": "2017-10-05T02:00:00.000+02:00",
      "nominPrincipale": "1",
      "infosQualite": {
        "libQualite": "Vice-Président",
        "libQualiteSex": "Vice-Président"
      },
      "organesRefs": [
        "PO211494"
      ]
    },
    {
      "xsiType": "MandatSimple_Type",
      "uid": "PM741533",
      "acteurRef": "PA415499",
      "typeOrgane": "DELEGSENAT",
      "dateDebut": "2017-10-18T02:00:00.000+02:00",
      "preseance": "4",
      "nominPrincipale": "1",
      "infosQualite": {
        "codeQualite": "Membre",
        "libQualite": "Membre",
        "libQualiteSex": "Membre"
      },
      "organesRefs": [
        "PO436945"
      ]
    },
    {
      "xsiType": "MandatSimple_Type",
      "uid": "PM759474",
      "acteurRef": "PA415499",
      "typeOrgane": "COMSPSENAT",
      "dateDebut": "2018-10-10T02:00:00.000+02:00",
      "dateFin": "2019-05-22T02:00:00.000+02:00",
      "nominPrincipale": "1",
      "infosQualite": {
        "libQualite": "Membre",
        "libQualiteSex": "Membre"
      },
      "organesRefs": [
        "PO759351"
      ]
    },
    {
      "xsiType": "MandatSimple_Type",
      "uid": "PM760368",
      "acteurRef": "PA415499",
      "typeOrgane": "CMP",
      "dateDebut": "2018-11-19T01:00:00.000+01:00",
      "datePublication": "2018-11-20T01:00:00.000+01:00",
      "dateFin": "2018-11-28T01:00:00.000+01:00",
      "preseance": "28",
      "nominPrincipale": "1",
      "infosQualite": {
        "codeQualite": "Suppléant",
        "libQualite": "Membre suppléant",
        "libQualiteSex": "Membre suppléant"
      },
      "organesRefs": [
        "PO760277"
      ]
    },
    {
      "xsiType": "MandatSimple_Type",
      "uid": "PM762765",
      "acteurRef": "PA415499",
      "typeOrgane": "CMP",
      "dateDebut": "2019-02-12T01:00:00.000+01:00",
      "datePublication": "2019-02-15T01:00:00.000+01:00",
      "dateFin": "2019-04-11T02:00:00.000+02:00",
      "preseance": "20",
      "nominPrincipale": "1",
      "infosQualite": {
        "codeQualite": "Titulaire",
        "libQualite": "Membre titulaire",
        "libQualiteSex": "Membre titulaire"
      },
      "organesRefs": [
        "PO762655"
      ]
    }
  ]
}