{
  "uid": "PA227090",
  "etatCivil": {
    "ident": {
      "civ": "Mme",
      "prenom": "Josiane",
      "nom": "Mathon-Poinat",
      "alpha": "MATHON-POINAT"
    },
    "infoNaissance": {
      "dateNais": "1954-08-23T01:00:00.000+01:00"
    }
  },
  "profession": {
    "socProcInsee": {}
  },
  "adresses": [
    {
      "xsiType": "AdresseSiteWeb_Type",
      "uid": "AD316995",
      "type": "23",
      "typeLibelle": "Url sénateur",
      "valElec": "https://www.senat.fr/senateur/mathon_poinat_josiane01038t.html"
    }
  ],
  "mandats": [
    {
      "xsiType": "MandatParlementaire_type",
      "uid": "PM227116",
      "acteurRef": "PA227090",
      "typeOrgane": "SENAT",
      "dateDebut": "2001-10-01T02:00:00.000+02:00",
      "datePublication": "2001-10-02T02:00:00.000+02:00",
      "dateFin": "2011-09-30T02:00:00.000+02:00",
      "preseance": "20",
      "nominPrincipale": "1",
      "infosQualite": {
        "codeQualite": "Sénateur",
        "libQualite": "SENATEUR",
        "libQualiteSex": "Sénateur 5ème République"
      },
      "organesRefs": [
        "PO78718"
      ],
      "election": {
        "lieu": {
          "numDepartement": "42"
        }
      },
      "mandature": {
        "premiereElection": "0"
      }
    },
    {
      "xsiType": "MandatSimple_Type",
      "uid": "PM227232",
      "acteurRef": "PA227090",
      "typeOrgane": "GROUPESENAT",
      "dateDebut": "2001-10-02T02:00:00.000+02:00",
      "datePublication": "2001-10-03T02:00:00.000+02:00",
      "dateFin": "2011-09-30T02:00:00.000+02:00",
      "preseance": "4",
      "nominPrincipale": "1",
      "infosQualite": {
        "codeQualite": "Membre",
        "libQualite": "Membre",
        "libQualiteSex": "Membre du"
      },
      "organesRefs": [
        "PO77707"
      ]
    },
    {
      "xsiType": "MandatSimple_Type",
      "uid": "PM320613",
      "acteurRef": "PA227090",
      "typeOrgane": "COMSENAT",
      "dateDebut": "2001-10-03T02:00:00.000+02:00",
      "dateFin": "2011-09-30T02:00:00.000+02:00",
      "preseance": "10",
      "nominPrincipale": "1",
      "infosQualite": {
        "codeQualite": "Membre",
        "libQualite": "Membre",
        "libQualiteSex": "Membre"
      },
      "organesRefs": [
        "PO211495"
      ]
    },
    {
      "xsiType": "MandatSimple_Type",
      "uid": "PM408136",
      "acteurRef": "PA227090",
      "typeOrgane": "CMP",
      "dateDebut": "2008-02-01T01:00:00.000+01:00",
      "dateFin": "2008-02-07T01:00:00.000+01:00",
      "preseance": "20",
      "nominPrincipale": "1",
      "infosQualite": {
        "codeQualite": "Titulaire",
        "libQualite": "Membre titulaire",
        "libQualiteSex": "Membre titulaire"
      },
      "organesRefs": [
        "PO408111"
      ]
    },
    {
      "xsiType": "MandatSimple_Type",
      "uid": "PM421009",
      "acteurRef": "PA227090",
      "typeOrgane": "CMP",
      "dateDebut": "2009-07-07T02:00:00.000+02:00",
      "datePublication": "2009-07-08T02:00:00.000+02:00",
      "dateFin": "2009-09-01T02:00:00.000+02:00",
      "preseance": "20",
      "nominPrincipale": "1",
      "infosQualite": {
        "codeQualite": "Titulaire",
        "libQualite": "Membre titulaire",
        "libQualiteSex": "Membre titulaire"
      },
      "organesRefs": [
        "PO420966"
      ]
    },
    {
      "xsiType": "MandatSimple_Type",
      "uid": "PM421811",
      "acteurRef": "PA227090",
      "typeOrgane": "CMP",
      "dateDebut": "2009-09-29T02:00:00.000+02:00",
      "datePublication": "2009-10-01T02:00:00.000+02:00",
      "dateFin": "2009-10-26T01:00:00.000+01:00",
      "preseance": "20",
      "nominPrincipale": "1",
      "infosQualite": {
        "codeQualite": "Titulaire",
        "libQualite": "Membre titulaire",
        "libQualiteSex": "Membre titulaire"
      },
      "organesRefs": [
        "PO421626"
      ]
    },
    {
      "xsiType": "MandatSimple_Type",
      "uid": "PM424010",
      "acteurRef": "PA227090",
      "typeOrgane": "CMP",
      "dateDebut": "2010-05-12T02:00:00.000+02:00",
      "datePublication": "2010-05-13T02:00:00.000+02:00",
      "dateFin": "2010-06-16T02:00:00.000+02:00",
      "preseance": "20",
      "nominPrincipale": "1",
      "infosQualite": {
        "codeQualite": "Titulaire",
        "libQualite": "Membre titulaire",
        "libQualiteSex": "Membre titulaire"
      },
      "organesRefs": [
        "PO423925"
      ]
    },
    {
      "xsiType": "MandatSimple_Type",
      "uid": "PM424206",
      "acteurRef": "PA227090",
      "typeOrgane": "CMP",
      "dateDebut": "2010-06-02T02:00:00.000+02:00",
      "datePublication": "2010-06-04T02:00:00.000+02:00",
      "dateFin": "2010-07-06T02:00:00.000+02:00",
      "preseance": "20",
      "nominPrincipale": "1",
      "infosQualite": {
        "codeQualite": "Titulaire",
        "libQualite": "Membre titulaire",
        "libQualiteSex": "Membre titulaire"
      },
      "organesRefs": [
        "PO424144"
      ]
    },
    {
      "xsiType": "MandatSimple_Type",
      "uid": "PM427978",
      "acteurRef": "PA227090",
      "typeOrgane": "CMP",
      "dateDebut": "2011-03-30T02:00:00.000+02:00",
      "datePublication": "2011-04-05T02:00:00.000+02:00",
      "dateFin": "2011-04-15T02:00:00.000+02:00",
      "preseance": "20",
      "nominPrincipale": "1",
      "infosQualite": {
        "codeQualite": "Titulaire",
        "libQualite": "Membre titulaire",
        "libQualiteSex": "Membre titulaire"
      },
      "organesRefs": [
        "PO427896"
      ]
    },
    {
      "xsiType": "MandatSimple_Type",
      "uid": "PM429026",
      "acteurRef": "PA227090",
      "typeOrgane": "CMP",
      "dateDebut": "2011-06-22T02:00:00.000+02:00",
      "datePublication": "2011-06-23T02:00:00.000+02:00",
      "dateFin": "2011-06-29T02:00:00.000+02:00",
      "preseance": "20",
      "nominPrincipale": "1",
      "infosQualite": {
        "codeQualite": "Titulaire",
        "libQualite": "Membre titulaire",
        "libQualiteSex": "Membre titulaire"
      },
      "organesRefs": [
        "PO428704"
      ]
    }
  ]
}