{
  "@xmlns": "http://schemas.assemblee-nationale.fr/referentiel",
  "@xmlns:xsi": "http://www.w3.org/2001/XMLSchema-instance",
  "@xsi:type": "OrganeParlementaire_Type",
  "uid": "PO323244",
  "codeType": "GE",
  "libelle": "Préparation de l'adoption d'un traité international relatif au commerce des armes légères et de petit calibre et la question des mines anti personnel",
  "libelleEdition": "sur la préparation de l'adoption d'un traité international relatif au commerce des armes légères et de petit calibre et la question des mines anti personnel",
  "libelleAbrege": "Armes légères et mines anti-personnel",
  "libelleAbrev": "ARMES",
  "viMoDe": {
    "dateDebut": null,
    "dateAgrement": "2006-03-22T01:00:00.000+01:00",
    "dateFin": "2007-06-19T02:00:00.000+02:00"
  },
  "organeParent": null,
  "chambre": null,
  "regime": "5ème République",
  "legislature": "12",
  "secretariat": {
    "secretaire01": null,
    "secretaire02": null
  }
}