{
  "@xmlns": "http://schemas.assemblee-nationale.fr/referentiel",
  "uid": {
    "@xmlns:xsi": "http://www.w3.org/2001/XMLSchema-instance",
    "@xsi:type": "IdActeur_type",
    "#text": "PA428"
  },
  "etatCivil": {
    "ident": {
      "civ": "M.",
      "prenom": "Michel",
      "nom": "Bécot",
      "alpha": "BECOT",
      "trigramme": {
        "@xmlns:xsi": "http://www.w3.org/2001/XMLSchema-instance",
        "@xsi:nil": "true"
      }
    },
    "infoNaissance": {
      "dateNais": "1939-10-10T01:00:00.000+01:00",
      "villeNais": {
        "@xmlns:xsi": "http://www.w3.org/2001/XMLSchema-instance",
        "@xsi:nil": "true"
      },
      "depNais": {
        "@xmlns:xsi": "http://www.w3.org/2001/XMLSchema-instance",
        "@xsi:nil": "true"
      },
      "paysNais": {
        "@xmlns:xsi": "http://www.w3.org/2001/XMLSchema-instance",
        "@xsi:nil": "true"
      }
    },
    "dateDeces": {
      "@xmlns:xsi": "http://www.w3.org/2001/XMLSchema-instance",
      "@xsi:nil": "true"
    }
  },
  "profession": {
    "libelleCourant": {
      "@xmlns:xsi": "http://www.w3.org/2001/XMLSchema-instance",
      "@xsi:nil": "true"
    },
    "socProcINSEE": {
      "catSocPro": {
        "@xmlns:xsi": "http://www.w3.org/2001/XMLSchema-instance",
        "@xsi:nil": "true"
      },
      "famSocPro": {
        "@xmlns:xsi": "http://www.w3.org/2001/XMLSchema-instance",
        "@xsi:nil": "true"
      }
    }
  },
  "uri_hatvp": {
    "@xmlns:xsi": "http://www.w3.org/2001/XMLSchema-instance",
    "@xsi:nil": "true"
  },
  "adresses": {
    "adresse": {
      "@xmlns:xsi": "http://www.w3.org/2001/XMLSchema-instance",
      "@xsi:type": "AdresseSiteWeb_Type",
      "uid": "AD317539",
      "type": "23",
      "typeLibelle": "Url sénateur",
      "poids": null,
      "adresseDeRattachement": null,
      "valElec": "https://www.senat.fr/senateur/becot_michel95009e.html"
    }
  },
  "mandats": {
    "mandat": [
      {
        "@xmlns:xsi": "http://www.w3.org/2001/XMLSchema-instance",
        "@xsi:type": "MandatSimple_Type",
        "uid": "PM699911",
        "acteurRef": "PA428",
        "legislature": null,
        "typeOrgane": "COMSPSENAT",
        "dateDebut": "2014-01-22T01:00:00.000+01:00",
        "datePublication": null,
        "dateFin": "2014-02-04T01:00:00.000+01:00",
        "preseance": null,
        "nominPrincipale": "1",
        "infosQualite": {
          "codeQualite": null,
          "libQualite": "Membre",
          "libQualiteSex": "Membre"
        },
        "organes": {
          "organeRef": "PO699895"
        }
      },
      {
        "@xmlns:xsi": "http://www.w3.org/2001/XMLSchema-instance",
        "@xsi:type": "MandatSimple_Type",
        "uid": "PM699980",
        "acteurRef": "PA428",
        "legislature": null,
        "typeOrgane": "COMSPSENAT",
        "dateDebut": "2014-02-05T01:00:00.000+01:00",
        "datePublication": null,
        "dateFin": "2014-09-30T02:00:00.000+02:00",
        "preseance": null,
        "nominPrincipale": "1",
        "infosQualite": {
          "codeQualite": null,
          "libQualite": "Secrétaire",
          "libQualiteSex": "Secrétaire"
        },
        "organes": {
          "organeRef": "PO699895"
        }
      },
      {
        "@xmlns:xsi": "http://www.w3.org/2001/XMLSchema-instance",
        "@xsi:type": "MandatSimple_Type",
        "uid": "PM516770",
        "acteurRef": "PA428",
        "legislature": null,
        "typeOrgane": "COMSENAT",
        "dateDebut": "2012-02-21T01:00:00.000+01:00",
        "datePublication": null,
        "dateFin": "2014-09-30T02:00:00.000+02:00",
        "preseance": "10",
        "nominPrincipale": "1",
        "infosQualite": {
          "codeQualite": "Membre",
          "libQualite": "Membre",
          "libQualiteSex": "Membre"
        },
        "organes": {
          "organeRef": "PO516753"
        }
      },
      {
        "@xmlns:xsi": "http://www.w3.org/2001/XMLSchema-instance",
        "@xsi:type": "MandatSimple_Type",
        "uid": "PM319780",
        "acteurRef": "PA428",
        "legislature": null,
        "typeOrgane": "COMSENAT",
        "dateDebut": "2001-10-03T02:00:00.000+02:00",
        "datePublication": null,
        "dateFin": "2012-02-20T01:00:00.000+01:00",
        "preseance": "10",
        "nominPrincipale": "1",
        "infosQualite": {
          "codeQualite": "Membre",
          "libQualite": "Membre",
          "libQualiteSex": "Membre"
        },
        "organes": {
          "organeRef": "PO211492"
        }
      },
      {
        "@xmlns:xsi": "http://www.w3.org/2001/XMLSchema-instance",
        "@xsi:type": "MandatSimple_Type",
        "uid": "PM286237",
        "acteurRef": "PA428",
        "legislature": null,
        "typeOrgane": "GROUPESENAT",
        "dateDebut": "2002-12-11T01:00:00.000+01:00",
        "datePublication": "2002-12-11T01:00:00.000+01:00",
        "dateFin": "2014-09-30T02:00:00.000+02:00",
        "preseance": "4",
        "nominPrincipale": "1",
        "infosQualite": {
          "codeQualite": "Membre",
          "libQualite": "Membre",
          "libQualiteSex": "Membre"
        },
        "organes": {
          "organeRef": "PO286005"
        }
      },
      {
        "@xmlns:xsi": "http://www.w3.org/2001/XMLSchema-instance",
        "@xsi:type": "MandatSimple_Type",
        "uid": "PM517970",
        "acteurRef": "PA428",
        "legislature": null,
        "typeOrgane": "API",
        "dateDebut": "2012-01-31T01:00:00.000+01:00",
        "datePublication": null,
        "dateFin": "2014-09-30T02:00:00.000+02:00",
        "preseance": "20",
        "nominPrincipale": "1",
        "infosQualite": {
          "codeQualite": "Membre",
          "libQualite": "Membre",
          "libQualiteSex": "Membre"
        },
        "organes": {
          "organeRef": "PO206064"
        }
      },
      {
        "@xmlns:xsi": "http://www.w3.org/2001/XMLSchema-instance",
        "@xsi:type": "MandatSimple_Type",
        "uid": "PM699711",
        "acteurRef": "PA428",
        "legislature": null,
        "typeOrgane": "CMP",
        "dateDebut": "2014-01-29T01:00:00.000+01:00",
        "datePublication": "2014-01-30T01:00:00.000+01:00",
        "dateFin": "2014-02-17T01:00:00.000+01:00",
        "preseance": "20",
        "nominPrincipale": "1",
        "infosQualite": {
          "codeQualite": "Titulaire",
          "libQualite": "Membre titulaire",
          "libQualiteSex": "Membre titulaire"
        },
        "organes": {
          "organeRef": "PO699474"
        }
      },
      {
        "@xmlns:xsi": "http://www.w3.org/2001/XMLSchema-instance",
        "@xsi:type": "MandatParlementaire_type",
        "uid": "PM303904",
        "acteurRef": "PA428",
        "legislature": null,
        "typeOrgane": "SENAT",
        "dateDebut": "2004-10-01T02:00:00.000+02:00",
        "datePublication": "2004-10-02T02:00:00.000+02:00",
        "dateFin": "2014-09-30T02:00:00.000+02:00",
        "preseance": "20",
        "nominPrincipale": "1",
        "infosQualite": {
          "codeQualite": "Sénateur",
          "libQualite": "SENATEUR",
          "libQualiteSex": "SENATEUR"
        },
        "organes": {
          "organeRef": "PO78718"
        },
        "suppleants": null,
        "chambre": null,
        "election": {
          "lieu": {
            "region": null,
            "regionType": null,
            "departement": null,
            "numDepartement": "79",
            "numCirco": null
          },
          "causeMandat": null
        },
        "mandature": {
          "datePriseFonction": null,
          "causeFin": null,
          "premiereElection": "0",
          "placeHemicycle": null,
          "mandatRemplaceRef": null
        },
        "collaborateurs": null
      },
      {
        "@xmlns:xsi": "http://www.w3.org/2001/XMLSchema-instance",
        "@xsi:type": "MandatSimple_Type",
        "uid": "PM405470",
        "acteurRef": "PA428",
        "legislature": null,
        "typeOrgane": "CMP",
        "dateDebut": "2007-12-14T01:00:00.000+01:00",
        "datePublication": "2007-12-18T01:00:00.000+01:00",
        "dateFin": "2007-12-26T01:00:00.000+01:00",
        "preseance": "28",
        "nominPrincipale": "1",
        "infosQualite": {
          "codeQualite": "Suppléant",
          "libQualite": "Membre suppléant",
          "libQualiteSex": "Membre suppléant"
        },
        "organes": {
          "organeRef": "PO405441"
        }
      },
      {
        "@xmlns:xsi": "http://www.w3.org/2001/XMLSchema-instance",
        "@xsi:type": "MandatSimple_Type",
        "uid": "PM699850",
        "acteurRef": "PA428",
        "legislature": null,
        "typeOrgane": "CMP",
        "dateDebut": "2014-01-30T01:00:00.000+01:00",
        "datePublication": "2014-02-06T01:00:00.000+01:00",
        "dateFin": "2014-02-17T01:00:00.000+01:00",
        "preseance": "28",
        "nominPrincipale": "1",
        "infosQualite": {
          "codeQualite": "Suppléant",
          "libQualite": "Membre suppléant",
          "libQualiteSex": "Membre suppléant"
        },
        "organes": {
          "organeRef": "PO699729"
        }
      },
      {
        "@xmlns:xsi": "http://www.w3.org/2001/XMLSchema-instance",
        "@xsi:type": "MandatSimple_Type",
        "uid": "PM428851",
        "acteurRef": "PA428",
        "legislature": null,
        "typeOrgane": "CMP",
        "dateDebut": "2011-06-14T02:00:00.000+02:00",
        "datePublication": "2011-06-15T02:00:00.000+02:00",
        "dateFin": "2011-07-25T02:00:00.000+02:00",
        "preseance": "28",
        "nominPrincipale": "1",
        "infosQualite": {
          "codeQualite": "Suppléant",
          "libQualite": "Membre suppléant",
          "libQualiteSex": "Membre suppléant"
        },
        "organes": {
          "organeRef": "PO428793"
        }
      },
      {
        "@xmlns:xsi": "http://www.w3.org/2001/XMLSchema-instance",
        "@xsi:type": "MandatSimple_Type",
        "uid": "PM700019",
        "acteurRef": "PA428",
        "legislature": null,
        "typeOrgane": "CMP",
        "dateDebut": "2014-02-05T01:00:00.000+01:00",
        "datePublication": "2014-02-08T01:00:00.000+01:00",
        "dateFin": "2014-02-27T01:00:00.000+01:00",
        "preseance": "28",
        "nominPrincipale": "1",
        "infosQualite": {
          "codeQualite": "Suppléant",
          "libQualite": "Membre suppléant",
          "libQualiteSex": "Membre suppléant"
        },
        "organes": {
          "organeRef": "PO699751"
        }
      },
      {
        "@xmlns:xsi": "http://www.w3.org/2001/XMLSchema-instance",
        "@xsi:type": "MandatSimple_Type",
        "uid": "PM422064",
        "acteurRef": "PA428",
        "legislature": null,
        "typeOrgane": "CMP",
        "dateDebut": "2009-10-07T02:00:00.000+02:00",
        "datePublication": "2009-10-15T02:00:00.000+02:00",
        "dateFin": "2009-11-20T01:00:00.000+01:00",
        "preseance": "28",
        "nominPrincipale": "1",
        "infosQualite": {
          "codeQualite": "Suppléant",
          "libQualite": "Membre suppléant",
          "libQualiteSex": "Membre suppléant"
        },
        "organes": {
          "organeRef": "PO421720"
        }
      },
      {
        "@xmlns:xsi": "http://www.w3.org/2001/XMLSchema-instance",
        "@xsi:type": "MandatSimple_Type",
        "uid": "PM702417",
        "acteurRef": "PA428",
        "legislature": null,
        "typeOrgane": "CMP",
        "dateDebut": "2014-07-09T02:00:00.000+02:00",
        "datePublication": "2014-07-11T02:00:00.000+02:00",
        "dateFin": "2014-07-21T02:00:00.000+02:00",
        "preseance": "28",
        "nominPrincipale": "1",
        "infosQualite": {
          "codeQualite": "Suppléant",
          "libQualite": "Membre suppléant",
          "libQualiteSex": "Membre suppléant"
        },
        "organes": {
          "organeRef": "PO702220"
        }
      }
    ]
  }
}