{
  "@xmlns": "http://schemas.assemblee-nationale.fr/referentiel",
  "@xmlns:xsi": "http://www.w3.org/2001/XMLSchema-instance",
  "@xsi:type": "OrganeExterne_Type",
  "uid": "PO425750",
  "codeType": "MINISTERE",
  "libelle": "Ministère des solidarités et de la cohésion sociale",
  "libelleEdition": "des solidarités et la cohésion sociale",
  "libelleAbrege": "Solidarités et cohésion sociale",
  "libelleAbrev": "SOL",
  "viMoDe": {
    "dateDebut": "2010-11-14T01:00:00.000+01:00",
    "dateAgrement": null,
    "dateFin": "2012-05-10T02:00:00.000+02:00"
  },
  "organeParent": "PO425695"
}