{
  "@xmlns": "http://schemas.assemblee-nationale.fr/referentiel",
  "@xmlns:xsi": "http://www.w3.org/2001/XMLSchema-instance",
  "@xsi:type": "OrganeParlementaire_Type",
  "uid": "PO709765",
  "codeType": "MISINFOCOM",
  "libelle": "Mission d'information commune sur l'application de la loi du 17 août 2015 relative à la transition énergétique pour la croissance verte",
  "libelleEdition": "de la mission d'information commune sur l'application de la loi du 17 août 2015 relative à la transition énergétique pour la croissance verte",
  "libelleAbrege": "Application de la loi sur la transition énergétique",
  "libelleAbrev": "TRANSITION",
  "viMoDe": {
    "dateDebut": "2015-10-21T02:00:00.000+02:00",
    "dateAgrement": null,
    "dateFin": "2016-11-16T01:00:00.000+01:00"
  },
  "organeParent": null,
  "chambre": null,
  "regime": "5ème République",
  "legislature": "14",
  "secretariat": {
    "secretaire01": null,
    "secretaire02": null
  }
}