{
  "@xmlns": "http://schemas.assemblee-nationale.fr/referentiel",
  "uid": {
    "@xmlns:xsi": "http://www.w3.org/2001/XMLSchema-instance",
    "@xsi:type": "IdActeur_type",
    "#text": "PA1132"
  },
  "etatCivil": {
    "ident": {
      "civ": "M.",
      "prenom": "Jean",
      "nom": "Diébold",
      "alpha": "Diebold",
      "trigramme": {
        "@xmlns:xsi": "http://www.w3.org/2001/XMLSchema-instance",
        "@xsi:nil": "true"
      }
    },
    "infoNaissance": {
      "dateNais": "1939-04-22T01:00:00.000+01:00",
      "villeNais": "Rennes",
      "depNais": "Ille-et-Vilaine",
      "paysNais": "France"
    },
    "dateDeces": "2007-08-30T02:00:00.000+02:00"
  },
  "profession": {
    "libelleCourant": "Ingénieur aérospatial",
    "socProcINSEE": {
      "catSocPro": "Cadres d'entreprise",
      "famSocPro": "Cadres et professions intellectuelles supérieures"
    }
  },
  "uri_hatvp": {
    "@xmlns:xsi": "http://www.w3.org/2001/XMLSchema-instance",
    "@xsi:nil": "true"
  },
  "adresses": {
    "adresse": [
      {
        "@xmlns:xsi": "http://www.w3.org/2001/XMLSchema-instance",
        "@xsi:type": "AdressePostale_Type",
        "uid": "AD11169",
        "type": "0",
        "typeLibelle": "Adresse officielle",
        "poids": "1",
        "adresseDeRattachement": null,
        "intitule": "Casier de la Poste,",
        "numeroRue": null,
        "nomRue": null,
        "complementAdresse": "Palais Bourbon,",
        "codePostal": "75355",
        "ville": "Paris 07 SP"
      },
      {
        "@xmlns:xsi": "http://www.w3.org/2001/XMLSchema-instance",
        "@xsi:type": "AdressePostale_Type",
        "uid": "AD45720",
        "type": "2",
        "typeLibelle": "Adresse publiée de circonscription",
        "poids": "21",
        "adresseDeRattachement": null,
        "intitule": null,
        "numeroRue": "1",
        "nomRue": "Rue de Sébastopol,",
        "complementAdresse": null,
        "codePostal": "31000",
        "ville": "Toulouse"
      },
      {
        "@xmlns:xsi": "http://www.w3.org/2001/XMLSchema-instance",
        "@xsi:type": "AdresseTelephonique_Type",
        "uid": "AD47985",
        "type": "11",
        "typeLibelle": "Téléphone",
        "poids": "21",
        "adresseDeRattachement": "AD45720",
        "valElec": "05 61 22 20 81"
      },
      {
        "@xmlns:xsi": "http://www.w3.org/2001/XMLSchema-instance",
        "@xsi:type": "AdresseTelephonique_Type",
        "uid": "AD49647",
        "type": "12",
        "typeLibelle": "Télécopie",
        "poids": "21",
        "adresseDeRattachement": "AD45720",
        "valElec": "05 61 22 22 14"
      }
    ]
  },
  "mandats": {
    "mandat": [
      {
        "@xmlns:xsi": "http://www.w3.org/2001/XMLSchema-instance",
        "@xsi:type": "MandatSimple_Type",
        "uid": "PM272414",
        "acteurRef": "PA1132",
        "legislature": "12",
        "typeOrgane": "DELEG",
        "dateDebut": "2002-06-03T02:00:00.000+02:00",
        "datePublication": "2002-07-03T02:00:00.000+02:00",
        "dateFin": "2007-06-19T02:00:00.000+02:00",
        "preseance": "20",
        "nominPrincipale": "1",
        "infosQualite": {
          "codeQualite": "Membre",
          "libQualite": "Membre",
          "libQualiteSex": "Membre"
        },
        "organes": {
          "organeRef": "PO201275"
        }
      },
      {
        "@xmlns:xsi": "http://www.w3.org/2001/XMLSchema-instance",
        "@xsi:type": "MandatSimple_Type",
        "uid": "PM271067",
        "acteurRef": "PA1132",
        "legislature": "12",
        "typeOrgane": "GP",
        "dateDebut": "2002-06-25T02:00:00.000+02:00",
        "datePublication": "2002-06-26T02:00:00.000+02:00",
        "dateFin": "2007-06-19T02:00:00.000+02:00",
        "preseance": "20",
        "nominPrincipale": "1",
        "infosQualite": {
          "codeQualite": "Membre",
          "libQualite": "Membre du",
          "libQualiteSex": "Membre du"
        },
        "organes": {
          "organeRef": "PO270903"
        }
      },
      {
        "@xmlns:xsi": "http://www.w3.org/2001/XMLSchema-instance",
        "@xsi:type": "MandatSimple_Type",
        "uid": "PM272132",
        "acteurRef": "PA1132",
        "legislature": "12",
        "typeOrgane": "COMPER",
        "dateDebut": "2002-06-26T02:00:00.000+02:00",
        "datePublication": "2002-06-27T02:00:00.000+02:00",
        "dateFin": "2007-06-19T02:00:00.000+02:00",
        "preseance": "32",
        "nominPrincipale": "1",
        "infosQualite": {
          "codeQualite": "Membre",
          "libQualite": "Membre",
          "libQualiteSex": "Membre"
        },
        "organes": {
          "organeRef": "PO59046"
        }
      },
      {
        "@xmlns:xsi": "http://www.w3.org/2001/XMLSchema-instance",
        "@xsi:type": "MandatSimple_Type",
        "uid": "PM275464",
        "acteurRef": "PA1132",
        "legislature": "12",
        "typeOrgane": "ORGEXTPARL",
        "dateDebut": "2002-08-01T02:00:00.000+02:00",
        "datePublication": "2002-08-02T02:00:00.000+02:00",
        "dateFin": "2007-06-19T02:00:00.000+02:00",
        "preseance": "20",
        "nominPrincipale": "1",
        "infosQualite": {
          "codeQualite": "Titulaire",
          "libQualite": "Membre titulaire",
          "libQualiteSex": "Membre titulaire"
        },
        "organes": {
          "organeRef": "PO60176"
        }
      },
      {
        "@xmlns:xsi": "http://www.w3.org/2001/XMLSchema-instance",
        "@xsi:type": "MandatSimple_Type",
        "uid": "PM285817",
        "acteurRef": "PA1132",
        "legislature": "12",
        "typeOrgane": "GE",
        "dateDebut": "2002-11-26T01:00:00.000+01:00",
        "datePublication": null,
        "dateFin": "2007-06-19T02:00:00.000+02:00",
        "preseance": "20",
        "nominPrincipale": "0",
        "infosQualite": {
          "codeQualite": "Membre",
          "libQualite": "Membre",
          "libQualiteSex": "Membre"
        },
        "organes": {
          "organeRef": "PO285037"
        }
      },
      {
        "@xmlns:xsi": "http://www.w3.org/2001/XMLSchema-instance",
        "@xsi:type": "MandatSimple_Type",
        "uid": "PM285819",
        "acteurRef": "PA1132",
        "legislature": "12",
        "typeOrgane": "GE",
        "dateDebut": "2002-11-26T01:00:00.000+01:00",
        "datePublication": null,
        "dateFin": "2007-06-19T02:00:00.000+02:00",
        "preseance": "1",
        "nominPrincipale": "1",
        "infosQualite": {
          "codeQualite": "Président",
          "libQualite": "Président",
          "libQualiteSex": "Président"
        },
        "organes": {
          "organeRef": "PO285037"
        }
      },
      {
        "@xmlns:xsi": "http://www.w3.org/2001/XMLSchema-instance",
        "@xsi:type": "MandatSimple_Type",
        "uid": "PM300410",
        "acteurRef": "PA1132",
        "legislature": "12",
        "typeOrgane": "GE",
        "dateDebut": "2003-01-28T01:00:00.000+01:00",
        "datePublication": null,
        "dateFin": "2007-06-19T02:00:00.000+02:00",
        "preseance": "20",
        "nominPrincipale": "1",
        "infosQualite": {
          "codeQualite": "Membre",
          "libQualite": "Membre",
          "libQualiteSex": "Membre"
        },
        "organes": {
          "organeRef": "PO285134"
        }
      },
      {
        "@xmlns:xsi": "http://www.w3.org/2001/XMLSchema-instance",
        "@xsi:type": "MandatParlementaire_type",
        "uid": "PM267850",
        "acteurRef": "PA1132",
        "legislature": "12",
        "typeOrgane": "ASSEMBLEE",
        "dateDebut": "2002-06-19T02:00:00.000+02:00",
        "datePublication": null,
        "dateFin": "2007-06-19T02:00:00.000+02:00",
        "preseance": "50",
        "nominPrincipale": "1",
        "infosQualite": {
          "codeQualite": "membre",
          "libQualite": "membre",
          "libQualiteSex": "membre"
        },
        "organes": {
          "organeRef": "PO230434"
        },
        "suppleants": {
          "suppleant": {
            "dateDebut": "2002-06-19T02:00:00.000+02:00",
            "dateFin": "2007-06-19T02:00:00.000+02:00",
            "suppleantRef": "PA267849"
          }
        },
        "chambre": null,
        "election": {
          "lieu": {
            "region": "Occitanie",
            "regionType": "Métropolitain",
            "departement": "Haute-Garonne",
            "numDepartement": "31",
            "numCirco": "4"
          },
          "causeMandat": "élections générales",
          "refCirconscription": "PO230571"
        },
        "mandature": {
          "datePriseFonction": "2002-06-19T02:00:00.000+02:00",
          "causeFin": "Fin de législature",
          "premiereElection": "1",
          "placeHemicycle": null,
          "mandatRemplaceRef": null
        },
        "collaborateurs": null
      }
    ]
  }
}