{
  "@xmlns": "http://schemas.assemblee-nationale.fr/referentiel",
  "@xmlns:xsi": "http://www.w3.org/2001/XMLSchema-instance",
  "@xsi:type": "OrganeParlementaire_Type",
  "uid": "PO746987",
  "codeType": "GE",
  "libelle": "Industrie du luxe et de moyens",
  "libelleEdition": "INDUSTRIE DU LUXE ET DE MOYENS",
  "libelleAbrege": "INDUSTRIE DU LUXE ET DE MOYENS",
  "libelleAbrev": "INDUSTLUXE",
  "viMoDe": {
    "dateDebut": null,
    "dateAgrement": "2017-12-20T01:00:00.000+01:00",
    "dateFin": null
  },
  "organeParent": null,
  "chambre": null,
  "regime": "5ème République",
  "legislature": "15",
  "secretariat": {
    "secretaire01": "Mme Frédérique Hugon-Petel",
    "secretaire02": null
  }
}