{
  "@xmlns": "http://schemas.assemblee-nationale.fr/referentiel",
  "@xmlns:xsi": "http://www.w3.org/2001/XMLSchema-instance",
  "@xsi:type": "OrganeExterne_Type",
  "uid": "PO730014",
  "codeType": "MINISTERE",
  "libelle": "Ministère auprès du ministre d'État, ministre de la transition écologique et solidaire, chargé des transports",
  "libelleEdition": "auprès du ministre d'État, ministre de la transition écologique et solidaire, chargée des transports",
  "libelleAbrege": "Transports",
  "libelleAbrev": "TRA",
  "viMoDe": {
    "dateDebut": "2017-06-22T02:00:00.000+02:00",
    "dateAgrement": null,
    "dateFin": "2019-07-16T02:00:00.000+02:00"
  },
  "organeParent": "PO725688"
}