{
  "@xmlns": "http://schemas.assemblee-nationale.fr/referentiel",
  "@xmlns:xsi": "http://www.w3.org/2001/XMLSchema-instance",
  "@xsi:type": "OrganeParlementaireInternational",
  "uid": "PO733672",
  "codeType": "GA",
  "libelle": "France-Amérique centrale",
  "libelleEdition": "de France-Amérique centrale",
  "libelleAbrege": "Amérique centrale",
  "libelleAbrev": "AMQC",
  "viMoDe": {
    "dateDebut": null,
    "dateAgrement": "2017-07-19T02:00:00.000+02:00",
    "dateFin": null
  },
  "organeParent": null,
  "chambre": null,
  "regime": "5ème République",
  "legislature": "15",
  "secretariat": {
    "secretaire01": "Mme Sylvie Malgouyard",
    "secretaire02": null
  },
  "listePays": null
}