{
  "@xmlns": "http://schemas.assemblee-nationale.fr/referentiel",
  "@xmlns:xsi": "http://www.w3.org/2001/XMLSchema-instance",
  "@xsi:type": "OrganeParlementaire_Type",
  "uid": "PO416249",
  "codeType": "CNPS",
  "libelle": "Commission spéciale chargée d'examiner le projet de loi organique relatif à la nomination des présidents des sociétés de l'audiovisuel public et le projet de loi sur le service public de la télévision",
  "libelleEdition": "de la commission spéciale chargée d'examiner le projet de loi organique relatif à la nomination des présidents des sociétés de l'audiovisuel public et le projet de loi sur le service public de la télévision",
  "libelleAbrege": "Spéciale sur la communication audiovisuelle",
  "libelleAbrev": "CSAUDIO",
  "viMoDe": {
    "dateDebut": "2008-10-22T02:00:00.000+02:00",
    "dateAgrement": null,
    "dateFin": "2009-07-01T02:00:00.000+02:00"
  },
  "organeParent": null,
  "chambre": null,
  "regime": "5ème République",
  "legislature": "13",
  "secretariat": {
    "secretaire01": null,
    "secretaire02": null
  }
}