{
  "@xmlns": "http://schemas.assemblee-nationale.fr/referentiel",
  "@xmlns:xsi": "http://www.w3.org/2001/XMLSchema-instance",
  "@xsi:type": "OrganeExtraParlementaire_type",
  "uid": "PO60241",
  "codeType": "ORGEXTPARL",
  "libelle": "Conseil d'administration de la société nationale de programme France 3",
  "libelleEdition": "du conseil d'administration de la société nationale de programme France 3",
  "libelleAbrege": "France 3",
  "libelleAbrev": "101",
  "viMoDe": {
    "dateDebut": "1986-09-30T01:00:00.000+01:00",
    "dateAgrement": null,
    "dateFin": "2012-05-14T02:00:00.000+02:00"
  },
  "organeParent": null,
  "chambre": null,
  "regime": "5ème République",
  "legislature": null,
  "regimeJuridique": "Loi 86-1067 du 30 09 1986 (ART. 47), modifiée par loi 2000-719 du 01/08/2000",
  "siteInternet": null,
  "nombreReunionsAnnuelles": null
}