{
  "@xmlns": "http://schemas.assemblee-nationale.fr/referentiel",
  "@xmlns:xsi": "http://www.w3.org/2001/XMLSchema-instance",
  "@xsi:type": "OrganeParlementaire_Type",
  "uid": "PO748027",
  "codeType": "CNPE",
  "libelle": "Commission d’enquête sur les maladies et pathologies professionnelles dans l’industrie (risques chimiques, psychosociaux ou physiques) et les moyens à déployer pour leur élimination",
  "libelleEdition": "de la commission d’enquête sur les maladies et pathologies professionnelles dans l’industrie (risques chimiques, psychosociaux ou physiques) et les moyens à déployer pour leur élimination",
  "libelleAbrege": "Commission d'enquête sur les maladies professionnelles",
  "libelleAbrev": "CEMALPA",
  "viMoDe": {
    "dateDebut": "2018-01-24T01:00:00.000+01:00",
    "dateAgrement": null,
    "dateFin": "2018-07-19T02:00:00.000+02:00"
  },
  "organeParent": null,
  "chambre": null,
  "regime": "5ème République",
  "legislature": "15",
  "secretariat": {
    "secretaire01": null,
    "secretaire02": null
  }
}