{
  "@xmlns": "http://schemas.assemblee-nationale.fr/referentiel",
  "uid": {
    "@xmlns:xsi": "http://www.w3.org/2001/XMLSchema-instance",
    "@xsi:type": "IdActeur_type",
    "#text": "PA672"
  },
  "etatCivil": {
    "ident": {
      "civ": "M.",
      "prenom": "Jean-Jacques",
      "nom": "Bridey",
      "alpha": "Bridey",
      "trigramme": "JBI"
    },
    "infoNaissance": {
      "dateNais": "1953-05-07T01:00:00.000+01:00",
      "villeNais": "Nice",
      "depNais": "Alpes-Maritimes",
      "paysNais": "France"
    },
    "dateDeces": {
      "@xmlns:xsi": "http://www.w3.org/2001/XMLSchema-instance",
      "@xsi:nil": "true"
    }
  },
  "profession": {
    "libelleCourant": "Cadre supérieur du secteur privé",
    "socProcINSEE": {
      "catSocPro": "Cadres d'entreprise",
      "famSocPro": "Cadres et professions intellectuelles supérieures"
    }
  },
  "uri_hatvp": "https://www.hatvp.fr/pages_nominatives/bridey-jean-jacques",
  "adresses": {
    "adresse": [
      {
        "@xmlns:xsi": "http://www.w3.org/2001/XMLSchema-instance",
        "@xsi:type": "AdresseMail_Type",
        "uid": "AD648540",
        "type": "15",
        "typeLibelle": "Mèl",
        "poids": null,
        "adresseDeRattachement": null,
        "valElec": "jean-jacques.bridey@assemblee-nationale.fr"
      },
      {
        "@xmlns:xsi": "http://www.w3.org/2001/XMLSchema-instance",
        "@xsi:type": "AdressePostale_Type",
        "uid": "AD648858",
        "type": "0",
        "typeLibelle": "Adresse officielle",
        "poids": "1",
        "adresseDeRattachement": null,
        "intitule": "Assemblée nationale",
        "numeroRue": "126",
        "nomRue": "Rue de l'Université",
        "complementAdresse": null,
        "codePostal": "75355",
        "ville": "Paris 07 SP"
      },
      {
        "@xmlns:xsi": "http://www.w3.org/2001/XMLSchema-instance",
        "@xsi:type": "AdressePostale_Type",
        "uid": "AD648859",
        "type": "2",
        "typeLibelle": "Adresse publiée de circonscription",
        "poids": "22",
        "adresseDeRattachement": null,
        "intitule": "Hôtel de Ville",
        "numeroRue": null,
        "nomRue": null,
        "complementAdresse": null,
        "codePostal": "94260",
        "ville": "Fresnes"
      },
      {
        "@xmlns:xsi": "http://www.w3.org/2001/XMLSchema-instance",
        "@xsi:type": "AdresseSiteWeb_Type",
        "uid": "AD732207",
        "type": "24",
        "typeLibelle": "Twitter",
        "poids": null,
        "adresseDeRattachement": null,
        "valElec": "@jjbridey94260"
      },
      {
        "@xmlns:xsi": "http://www.w3.org/2001/XMLSchema-instance",
        "@xsi:type": "AdresseSiteWeb_Type",
        "uid": "AD732244",
        "type": "25",
        "typeLibelle": "Facebook",
        "poids": null,
        "adresseDeRattachement": null,
        "valElec": "jjbridey"
      }
    ]
  },
  "mandats": {
    "mandat": [
      {
        "@xmlns:xsi": "http://www.w3.org/2001/XMLSchema-instance",
        "@xsi:type": "MandatParlementaire_type",
        "uid": "PM732324",
        "acteurRef": "PA672",
        "legislature": "15",
        "typeOrgane": "CONFPT",
        "dateDebut": "2017-06-30T02:00:00.000+02:00",
        "datePublication": "2017-06-30T02:00:00.000+02:00",
        "dateFin": "2019-09-30T02:00:00.000+02:00",
        "preseance": "20",
        "nominPrincipale": "1",
        "infosQualite": {
          "codeQualite": "Membre",
          "libQualite": "Membre",
          "libQualiteSex": "Membre"
        },
        "organes": {
          "organeRef": "PO725343"
        },
        "suppleants": null,
        "chambre": null,
        "election": {
          "lieu": {
            "region": null,
            "regionType": null,
            "departement": null,
            "numDepartement": null,
            "numCirco": null
          },
          "causeMandat": null
        },
        "mandature": {
          "datePriseFonction": null,
          "causeFin": null,
          "premiereElection": "0",
          "placeHemicycle": null,
          "mandatRemplaceRef": null
        },
        "collaborateurs": null
      },
      {
        "@xmlns:xsi": "http://www.w3.org/2001/XMLSchema-instance",
        "@xsi:type": "MandatAvecSuppleant_Type",
        "uid": "PM733756",
        "acteurRef": "PA672",
        "legislature": "15",
        "typeOrgane": "OFFPAR",
        "dateDebut": "2017-07-25T02:00:00.000+02:00",
        "datePublication": "2017-07-25T02:00:00.000+02:00",
        "dateFin": "2019-10-01T02:00:00.000+02:00",
        "preseance": "24",
        "nominPrincipale": "0",
        "infosQualite": {
          "codeQualite": "Membre",
          "libQualite": "Membre",
          "libQualiteSex": "Membre"
        },
        "organes": {
          "organeRef": "PO402232"
        },
        "suppleants": null
      },
      {
        "@xmlns:xsi": "http://www.w3.org/2001/XMLSchema-instance",
        "@xsi:type": "MandatAvecSuppleant_Type",
        "uid": "PM663959",
        "acteurRef": "PA672",
        "legislature": "14",
        "typeOrgane": "COMNL",
        "dateDebut": "2012-07-04T02:00:00.000+02:00",
        "datePublication": "2012-07-04T02:00:00.000+02:00",
        "dateFin": "2017-06-20T02:00:00.000+02:00",
        "preseance": "20",
        "nominPrincipale": "1",
        "infosQualite": {
          "codeQualite": "Membre",
          "libQualite": "Membre",
          "libQualiteSex": "Membre"
        },
        "organes": {
          "organeRef": "PO415287"
        },
        "suppleants": null
      },
      {
        "@xmlns:xsi": "http://www.w3.org/2001/XMLSchema-instance",
        "@xsi:type": "MandatSimple_Type",
        "uid": "PM677240",
        "acteurRef": "PA672",
        "legislature": "14",
        "typeOrgane": "DELEG",
        "dateDebut": "2012-07-25T02:00:00.000+02:00",
        "datePublication": "2012-07-25T02:00:00.000+02:00",
        "dateFin": "2017-06-20T02:00:00.000+02:00",
        "preseance": "20",
        "nominPrincipale": "1",
        "infosQualite": {
          "codeQualite": "Membre",
          "libQualite": "Membre",
          "libQualiteSex": "Membre"
        },
        "organes": {
          "organeRef": "PO675659"
        }
      },
      {
        "@xmlns:xsi": "http://www.w3.org/2001/XMLSchema-instance",
        "@xsi:type": "MandatMission_Type",
        "uid": "PM695934",
        "acteurRef": "PA672",
        "legislature": "14",
        "typeOrgane": "MISINFOCOM",
        "dateDebut": "2013-07-09T02:00:00.000+02:00",
        "datePublication": "2013-07-10T02:00:00.000+02:00",
        "dateFin": "2013-07-11T02:00:00.000+02:00",
        "preseance": "20",
        "nominPrincipale": "1",
        "infosQualite": {
          "codeQualite": "Membre",
          "libQualite": "Membre",
          "libQualiteSex": "Membre"
        },
        "organes": {
          "organeRef": "PO695928"
        },
        "libelle": null,
        "missionSuivanteRef": null,
        "missionPrecedenteRef": null
      },
      {
        "@xmlns:xsi": "http://www.w3.org/2001/XMLSchema-instance",
        "@xsi:type": "MandatMission_Type",
        "uid": "PM692120",
        "acteurRef": "PA672",
        "legislature": "14",
        "typeOrgane": "MISINFO",
        "dateDebut": "2013-02-05T01:00:00.000+01:00",
        "datePublication": null,
        "dateFin": "2013-07-10T02:00:00.000+02:00",
        "preseance": "10",
        "nominPrincipale": "1",
        "infosQualite": {
          "codeQualite": "Membre",
          "libQualite": "Membre",
          "libQualiteSex": "Membre"
        },
        "organes": {
          "organeRef": "PO683565"
        },
        "libelle": null,
        "missionSuivanteRef": null,
        "missionPrecedenteRef": null
      },
      {
        "@xmlns:xsi": "http://www.w3.org/2001/XMLSchema-instance",
        "@xsi:type": "MandatMission_Type",
        "uid": "PM708623",
        "acteurRef": "PA672",
        "legislature": "14",
        "typeOrgane": "MISINFO",
        "dateDebut": "2014-12-17T01:00:00.000+01:00",
        "datePublication": null,
        "dateFin": "2015-12-09T01:00:00.000+01:00",
        "preseance": "10",
        "nominPrincipale": "1",
        "infosQualite": {
          "codeQualite": "Membre",
          "libQualite": "Membre",
          "libQualiteSex": "Membre"
        },
        "organes": {
          "organeRef": "PO708590"
        },
        "libelle": null,
        "missionSuivanteRef": null,
        "missionPrecedenteRef": null
      },
      {
        "@xmlns:xsi": "http://www.w3.org/2001/XMLSchema-instance",
        "@xsi:type": "MandatSimple_Type",
        "uid": "PM761311",
        "acteurRef": "PA672",
        "legislature": null,
        "typeOrgane": "PARPOL",
        "dateDebut": "2018-12-01T01:00:00.000+01:00",
        "datePublication": null,
        "dateFin": null,
        "preseance": "5",
        "nominPrincipale": "1",
        "infosQualite": {
          "codeQualite": "Membre",
          "libQualite": "Membre",
          "libQualiteSex": "Membre"
        },
        "organes": {
          "organeRef": "PO761294"
        }
      },
      {
        "@xmlns:xsi": "http://www.w3.org/2001/XMLSchema-instance",
        "@xsi:type": "MandatMission_Type",
        "uid": "PM711951",
        "acteurRef": "PA672",
        "legislature": "14",
        "typeOrgane": "MISINFO",
        "dateDebut": "2016-03-16T01:00:00.000+01:00",
        "datePublication": null,
        "dateFin": "2016-12-14T01:00:00.000+01:00",
        "preseance": "9",
        "nominPrincipale": "1",
        "infosQualite": {
          "codeQualite": "Rapporteur",
          "libQualite": "Rapporteur",
          "libQualiteSex": "Rapporteur"
        },
        "organes": {
          "organeRef": "PO711941"
        },
        "libelle": null,
        "missionSuivanteRef": null,
        "missionPrecedenteRef": null
      },
      {
        "@xmlns:xsi": "http://www.w3.org/2001/XMLSchema-instance",
        "@xsi:type": "MandatMission_Type",
        "uid": "PM711949",
        "acteurRef": "PA672",
        "legislature": "14",
        "typeOrgane": "MISINFO",
        "dateDebut": "2016-03-16T01:00:00.000+01:00",
        "datePublication": null,
        "dateFin": "2016-12-14T01:00:00.000+01:00",
        "preseance": "10",
        "nominPrincipale": "0",
        "infosQualite": {
          "codeQualite": "Membre",
          "libQualite": "Membre",
          "libQualiteSex": "Membre"
        },
        "organes": {
          "organeRef": "PO711941"
        },
        "libelle": null,
        "missionSuivanteRef": null,
        "missionPrecedenteRef": null
      },
      {
        "@xmlns:xsi": "http://www.w3.org/2001/XMLSchema-instance",
        "@xsi:type": "MandatSimple_Type",
        "uid": "PM744889",
        "acteurRef": "PA672",
        "legislature": null,
        "typeOrgane": "PARPOL",
        "dateDebut": "2017-12-01T01:00:00.000+01:00",
        "datePublication": null,
        "dateFin": "2018-11-30T01:00:00.000+01:00",
        "preseance": "5",
        "nominPrincipale": "1",
        "infosQualite": {
          "codeQualite": "Membre",
          "libQualite": "Membre",
          "libQualiteSex": "Membre"
        },
        "organes": {
          "organeRef": "PO744854"
        }
      },
      {
        "@xmlns:xsi": "http://www.w3.org/2001/XMLSchema-instance",
        "@xsi:type": "MandatSimple_Type",
        "uid": "PM685668",
        "acteurRef": "PA672",
        "legislature": null,
        "typeOrgane": "PARPOL",
        "dateDebut": "2012-12-01T01:00:00.000+01:00",
        "datePublication": null,
        "dateFin": "2017-06-20T02:00:00.000+02:00",
        "preseance": "5",
        "nominPrincipale": "1",
        "infosQualite": {
          "codeQualite": "Membre",
          "libQualite": "Membre",
          "libQualiteSex": "Membre"
        },
        "organes": {
          "organeRef": "PO684932"
        }
      },
      {
        "@xmlns:xsi": "http://www.w3.org/2001/XMLSchema-instance",
        "@xsi:type": "MandatSimple_Type",
        "uid": "PM705431",
        "acteurRef": "PA672",
        "legislature": "14",
        "typeOrgane": "CNPS",
        "dateDebut": "2014-12-13T01:00:00.000+01:00",
        "datePublication": "2014-12-13T01:00:00.000+01:00",
        "dateFin": "2015-08-07T02:00:00.000+02:00",
        "preseance": "20",
        "nominPrincipale": "1",
        "infosQualite": {
          "codeQualite": "Membre",
          "libQualite": "Membre",
          "libQualiteSex": "Membre"
        },
        "organes": {
          "organeRef": "PO704848"
        }
      },
      {
        "@xmlns:xsi": "http://www.w3.org/2001/XMLSchema-instance",
        "@xsi:type": "MandatSimple_Type",
        "uid": "PM678315",
        "acteurRef": "PA672",
        "legislature": "14",
        "typeOrgane": "CNPS",
        "dateDebut": "2012-09-25T02:00:00.000+02:00",
        "datePublication": "2012-09-26T02:00:00.000+02:00",
        "dateFin": "2012-11-22T01:00:00.000+01:00",
        "preseance": "20",
        "nominPrincipale": "1",
        "infosQualite": {
          "codeQualite": "Membre",
          "libQualite": "Membre",
          "libQualiteSex": "Membre"
        },
        "organes": {
          "organeRef": "PO678157"
        }
      },
      {
        "@xmlns:xsi": "http://www.w3.org/2001/XMLSchema-instance",
        "@xsi:type": "MandatSimple_Type",
        "uid": "PM734443",
        "acteurRef": "PA672",
        "legislature": "15",
        "typeOrgane": "API",
        "dateDebut": "2017-08-02T02:00:00.000+02:00",
        "datePublication": "2017-08-03T02:00:00.000+02:00",
        "dateFin": null,
        "preseance": "20",
        "nominPrincipale": "1",
        "infosQualite": {
          "codeQualite": "Titulaire",
          "libQualite": "Membre titulaire",
          "libQualiteSex": "Membre titulaire"
        },
        "organes": {
          "organeRef": "PO58974"
        }
      },
      {
        "@xmlns:xsi": "http://www.w3.org/2001/XMLSchema-instance",
        "@xsi:type": "MandatAvecSuppleant_Type",
        "uid": "PM765120",
        "acteurRef": "PA672",
        "legislature": "15",
        "typeOrgane": "OFFPAR",
        "dateDebut": "2019-05-17T02:00:00.000+02:00",
        "datePublication": "2019-05-17T02:00:00.000+02:00",
        "dateFin": "2019-10-01T02:00:00.000+02:00",
        "preseance": "6",
        "nominPrincipale": "1",
        "infosQualite": {
          "codeQualite": "Premier vice-président",
          "libQualite": "Premier vice-président",
          "libQualiteSex": "Premier vice-président"
        },
        "organes": {
          "organeRef": "PO402232"
        },
        "suppleants": null
      },
      {
        "@xmlns:xsi": "http://www.w3.org/2001/XMLSchema-instance",
        "@xsi:type": "MandatSimple_Type",
        "uid": "PM656068",
        "acteurRef": "PA672",
        "legislature": "14",
        "typeOrgane": "GP",
        "dateDebut": "2012-06-26T02:00:00.000+02:00",
        "datePublication": "2012-06-27T02:00:00.000+02:00",
        "dateFin": "2016-05-24T02:00:00.000+02:00",
        "preseance": "20",
        "nominPrincipale": "1",
        "infosQualite": {
          "codeQualite": "Membre",
          "libQualite": "Membre du",
          "libQualiteSex": "Membre du"
        },
        "organes": {
          "organeRef": "PO656002"
        }
      },
      {
        "@xmlns:xsi": "http://www.w3.org/2001/XMLSchema-instance",
        "@xsi:type": "MandatSimple_Type",
        "uid": "PM713128",
        "acteurRef": "PA672",
        "legislature": "14",
        "typeOrgane": "GP",
        "dateDebut": "2016-05-25T02:00:00.000+02:00",
        "datePublication": null,
        "dateFin": "2017-06-20T02:00:00.000+02:00",
        "preseance": "20",
        "nominPrincipale": "1",
        "infosQualite": {
          "codeQualite": "Membre",
          "libQualite": "Membre du",
          "libQualiteSex": "Membre du"
        },
        "organes": {
          "organeRef": "PO713077"
        }
      },
      {
        "@xmlns:xsi": "http://www.w3.org/2001/XMLSchema-instance",
        "@xsi:type": "MandatSimple_Type",
        "uid": "PM731192",
        "acteurRef": "PA672",
        "legislature": "15",
        "typeOrgane": "GP",
        "dateDebut": "2017-06-27T02:00:00.000+02:00",
        "datePublication": "2017-06-28T02:00:00.000+02:00",
        "dateFin": null,
        "preseance": "20",
        "nominPrincipale": "1",
        "infosQualite": {
          "codeQualite": "Membre",
          "libQualite": "Membre du",
          "libQualiteSex": "Membre du"
        },
        "organes": {
          "organeRef": "PO730964"
        }
      },
      {
        "@xmlns:xsi": "http://www.w3.org/2001/XMLSchema-instance",
        "@xsi:type": "MandatSimple_Type",
        "uid": "PM706179",
        "acteurRef": "PA672",
        "legislature": "14",
        "typeOrgane": "COMPER",
        "dateDebut": "2015-02-04T01:00:00.000+01:00",
        "datePublication": "2015-02-04T01:00:00.000+01:00",
        "dateFin": "2015-02-04T01:00:00.000+01:00",
        "preseance": "32",
        "nominPrincipale": "1",
        "infosQualite": {
          "codeQualite": "Membre",
          "libQualite": "Membre",
          "libQualiteSex": "Membre"
        },
        "organes": {
          "organeRef": "PO59051"
        }
      },
      {
        "@xmlns:xsi": "http://www.w3.org/2001/XMLSchema-instance",
        "@xsi:type": "MandatSimple_Type",
        "uid": "PM706189",
        "acteurRef": "PA672",
        "legislature": "14",
        "typeOrgane": "COMPER",
        "dateDebut": "2015-02-05T01:00:00.000+01:00",
        "datePublication": "2015-02-05T01:00:00.000+01:00",
        "dateFin": "2016-07-12T02:00:00.000+02:00",
        "preseance": "32",
        "nominPrincipale": "1",
        "infosQualite": {
          "codeQualite": "Membre",
          "libQualite": "Membre",
          "libQualiteSex": "Membre"
        },
        "organes": {
          "organeRef": "PO59046"
        }
      },
      {
        "@xmlns:xsi": "http://www.w3.org/2001/XMLSchema-instance",
        "@xsi:type": "MandatSimple_Type",
        "uid": "PM731968",
        "acteurRef": "PA672",
        "legislature": "15",
        "typeOrgane": "COMPER",
        "dateDebut": "2017-06-29T02:00:00.000+02:00",
        "datePublication": "2017-06-29T02:00:00.000+02:00",
        "dateFin": null,
        "preseance": "32",
        "nominPrincipale": "1",
        "infosQualite": {
          "codeQualite": "Membre",
          "libQualite": "Membre",
          "libQualiteSex": "Membre"
        },
        "organes": {
          "organeRef": "PO59046"
        }
      },
      {
        "@xmlns:xsi": "http://www.w3.org/2001/XMLSchema-instance",
        "@xsi:type": "MandatSimple_Type",
        "uid": "PM701891",
        "acteurRef": "PA672",
        "legislature": "14",
        "typeOrgane": "COMPER",
        "dateDebut": "2014-06-19T02:00:00.000+02:00",
        "datePublication": "2014-06-19T02:00:00.000+02:00",
        "dateFin": "2015-02-03T01:00:00.000+01:00",
        "preseance": "32",
        "nominPrincipale": "1",
        "infosQualite": {
          "codeQualite": "Membre",
          "libQualite": "Membre",
          "libQualiteSex": "Membre"
        },
        "organes": {
          "organeRef": "PO59046"
        }
      },
      {
        "@xmlns:xsi": "http://www.w3.org/2001/XMLSchema-instance",
        "@xsi:type": "MandatSimple_Type",
        "uid": "PM714387",
        "acteurRef": "PA672",
        "legislature": "14",
        "typeOrgane": "COMPER",
        "dateDebut": "2016-07-14T02:00:00.000+02:00",
        "datePublication": "2016-07-14T02:00:00.000+02:00",
        "dateFin": "2016-07-19T02:00:00.000+02:00",
        "preseance": "32",
        "nominPrincipale": "1",
        "infosQualite": {
          "codeQualite": "Membre",
          "libQualite": "Membre",
          "libQualiteSex": "Membre"
        },
        "organes": {
          "organeRef": "PO59046"
        }
      },
      {
        "@xmlns:xsi": "http://www.w3.org/2001/XMLSchema-instance",
        "@xsi:type": "MandatSimple_Type",
        "uid": "PM657330",
        "acteurRef": "PA672",
        "legislature": "14",
        "typeOrgane": "COMPER",
        "dateDebut": "2012-06-28T02:00:00.000+02:00",
        "datePublication": "2012-06-28T02:00:00.000+02:00",
        "dateFin": "2014-06-17T02:00:00.000+02:00",
        "preseance": "32",
        "nominPrincipale": "1",
        "infosQualite": {
          "codeQualite": "Membre",
          "libQualite": "Membre",
          "libQualiteSex": "Membre"
        },
        "organes": {
          "organeRef": "PO59046"
        }
      },
      {
        "@xmlns:xsi": "http://www.w3.org/2001/XMLSchema-instance",
        "@xsi:type": "MandatSimple_Type",
        "uid": "PM714462",
        "acteurRef": "PA672",
        "legislature": "14",
        "typeOrgane": "COMPER",
        "dateDebut": "2016-07-20T02:00:00.000+02:00",
        "datePublication": "2016-07-20T02:00:00.000+02:00",
        "dateFin": "2016-07-20T02:00:00.000+02:00",
        "preseance": "32",
        "nominPrincipale": "1",
        "infosQualite": {
          "codeQualite": "Membre",
          "libQualite": "Membre",
          "libQualiteSex": "Membre"
        },
        "organes": {
          "organeRef": "PO419865"
        }
      },
      {
        "@xmlns:xsi": "http://www.w3.org/2001/XMLSchema-instance",
        "@xsi:type": "MandatSimple_Type",
        "uid": "PM701874",
        "acteurRef": "PA672",
        "legislature": "14",
        "typeOrgane": "COMPER",
        "dateDebut": "2014-06-18T02:00:00.000+02:00",
        "datePublication": "2014-06-18T02:00:00.000+02:00",
        "dateFin": "2014-06-18T02:00:00.000+02:00",
        "preseance": "32",
        "nominPrincipale": "1",
        "infosQualite": {
          "codeQualite": "Membre",
          "libQualite": "Membre",
          "libQualiteSex": "Membre"
        },
        "organes": {
          "organeRef": "PO59048"
        }
      },
      {
        "@xmlns:xsi": "http://www.w3.org/2001/XMLSchema-instance",
        "@xsi:type": "MandatSimple_Type",
        "uid": "PM714337",
        "acteurRef": "PA672",
        "legislature": "14",
        "typeOrgane": "COMPER",
        "dateDebut": "2016-07-13T02:00:00.000+02:00",
        "datePublication": "2016-07-13T02:00:00.000+02:00",
        "dateFin": "2016-07-13T02:00:00.000+02:00",
        "preseance": "32",
        "nominPrincipale": "1",
        "infosQualite": {
          "codeQualite": "Membre",
          "libQualite": "Membre",
          "libQualiteSex": "Membre"
        },
        "organes": {
          "organeRef": "PO419610"
        }
      },
      {
        "@xmlns:xsi": "http://www.w3.org/2001/XMLSchema-instance",
        "@xsi:type": "MandatSimple_Type",
        "uid": "PM714524",
        "acteurRef": "PA672",
        "legislature": "14",
        "typeOrgane": "COMPER",
        "dateDebut": "2016-07-21T02:00:00.000+02:00",
        "datePublication": "2016-07-21T02:00:00.000+02:00",
        "dateFin": "2017-06-20T02:00:00.000+02:00",
        "preseance": "32",
        "nominPrincipale": "1",
        "infosQualite": {
          "codeQualite": "Membre",
          "libQualite": "Membre",
          "libQualiteSex": "Membre"
        },
        "organes": {
          "organeRef": "PO59046"
        }
      },
      {
        "@xmlns:xsi": "http://www.w3.org/2001/XMLSchema-instance",
        "@xsi:type": "MandatSimple_Type",
        "uid": "PM677997",
        "acteurRef": "PA672",
        "legislature": "14",
        "typeOrgane": "API",
        "dateDebut": "2012-07-31T02:00:00.000+02:00",
        "datePublication": null,
        "dateFin": "2017-06-20T02:00:00.000+02:00",
        "preseance": "24",
        "nominPrincipale": "1",
        "infosQualite": {
          "codeQualite": "Suppléant",
          "libQualite": "Membre suppléant",
          "libQualiteSex": "Membre suppléant"
        },
        "organes": {
          "organeRef": "PO58974"
        }
      },
      {
        "@xmlns:xsi": "http://www.w3.org/2001/XMLSchema-instance",
        "@xsi:type": "MandatSimple_Type",
        "uid": "PM757148",
        "acteurRef": "PA672",
        "legislature": "15",
        "typeOrgane": "CMP",
        "dateDebut": "2018-06-19T02:00:00.000+02:00",
        "datePublication": "2018-06-20T02:00:00.000+02:00",
        "dateFin": "2018-06-28T02:00:00.000+02:00",
        "preseance": "16",
        "nominPrincipale": "1",
        "infosQualite": {
          "codeQualite": "Rapporteur",
          "libQualite": "Rapporteur",
          "libQualiteSex": "Rapporteur"
        },
        "organes": {
          "organeRef": "PO756661"
        }
      },
      {
        "@xmlns:xsi": "http://www.w3.org/2001/XMLSchema-instance",
        "@xsi:type": "MandatSimple_Type",
        "uid": "PM756867",
        "acteurRef": "PA672",
        "legislature": "15",
        "typeOrgane": "CMP",
        "dateDebut": "2018-06-07T02:00:00.000+02:00",
        "datePublication": "2018-06-13T02:00:00.000+02:00",
        "dateFin": "2018-06-28T02:00:00.000+02:00",
        "preseance": "20",
        "nominPrincipale": "1",
        "infosQualite": {
          "codeQualite": "Titulaire",
          "libQualite": "Membre titulaire",
          "libQualiteSex": "Membre titulaire"
        },
        "organes": {
          "organeRef": "PO756661"
        }
      },
      {
        "@xmlns:xsi": "http://www.w3.org/2001/XMLSchema-instance",
        "@xsi:type": "MandatSimple_Type",
        "uid": "PM681950",
        "acteurRef": "PA672",
        "legislature": "14",
        "typeOrgane": "ORGEXTPARL",
        "dateDebut": "2012-10-16T02:00:00.000+02:00",
        "datePublication": "2012-10-17T02:00:00.000+02:00",
        "dateFin": "2015-10-16T02:00:00.000+02:00",
        "preseance": "20",
        "nominPrincipale": "1",
        "infosQualite": {
          "codeQualite": "Titulaire",
          "libQualite": "Membre titulaire",
          "libQualiteSex": "Membre titulaire"
        },
        "organes": {
          "organeRef": "PO60159"
        }
      },
      {
        "@xmlns:xsi": "http://www.w3.org/2001/XMLSchema-instance",
        "@xsi:type": "MandatAvecSuppleant_Type",
        "uid": "PM733748",
        "acteurRef": "PA672",
        "legislature": "15",
        "typeOrgane": "OFFPAR",
        "dateDebut": "2017-07-25T02:00:00.000+02:00",
        "datePublication": "2017-07-25T02:00:00.000+02:00",
        "dateFin": "2019-10-01T02:00:00.000+02:00",
        "preseance": "16",
        "nominPrincipale": "1",
        "infosQualite": {
          "codeQualite": "Membre de droit (Président de la commission de la défense)",
          "libQualite": "Membre de droit (Président de la commission de la défense)",
          "libQualiteSex": "Membre de droit (Président de la commission de la défense)"
        },
        "organes": {
          "organeRef": "PO402232"
        },
        "suppleants": null
      },
      {
        "@xmlns:xsi": "http://www.w3.org/2001/XMLSchema-instance",
        "@xsi:type": "MandatAvecSuppleant_Type",
        "uid": "PM755406",
        "acteurRef": "PA672",
        "legislature": "15",
        "typeOrgane": "OFFPAR",
        "dateDebut": "2018-04-13T02:00:00.000+02:00",
        "datePublication": "2018-04-13T02:00:00.000+02:00",
        "dateFin": "2019-05-16T02:00:00.000+02:00",
        "preseance": "7",
        "nominPrincipale": "1",
        "infosQualite": {
          "codeQualite": "Deuxième Vice-Président",
          "libQualite": "Deuxième Vice-Président",
          "libQualiteSex": "Deuxième Vice-Président"
        },
        "organes": {
          "organeRef": "PO402232"
        },
        "suppleants": null
      },
      {
        "@xmlns:xsi": "http://www.w3.org/2001/XMLSchema-instance",
        "@xsi:type": "MandatSimple_Type",
        "uid": "PM724656",
        "acteurRef": "PA672",
        "legislature": "15",
        "typeOrgane": "GP",
        "dateDebut": "2017-06-21T02:00:00.000+02:00",
        "datePublication": null,
        "dateFin": "2017-06-26T02:00:00.000+02:00",
        "preseance": "28",
        "nominPrincipale": "1",
        "infosQualite": {
          "codeQualite": "Député non-inscrit",
          "libQualite": "Député non-inscrit",
          "libQualiteSex": "Député non-inscrit"
        },
        "organes": {
          "organeRef": "PO723569"
        }
      },
      {
        "@xmlns:xsi": "http://www.w3.org/2001/XMLSchema-instance",
        "@xsi:type": "MandatSimple_Type",
        "uid": "PM689680",
        "acteurRef": "PA672",
        "legislature": "14",
        "typeOrgane": "GE",
        "dateDebut": "2013-01-30T01:00:00.000+01:00",
        "datePublication": null,
        "dateFin": "2017-06-20T02:00:00.000+02:00",
        "preseance": "20",
        "nominPrincipale": "1",
        "infosQualite": {
          "codeQualite": "Membre",
          "libQualite": "Membre",
          "libQualiteSex": "Membre"
        },
        "organes": {
          "organeRef": "PO686424"
        }
      },
      {
        "@xmlns:xsi": "http://www.w3.org/2001/XMLSchema-instance",
        "@xsi:type": "MandatSimple_Type",
        "uid": "PM713493",
        "acteurRef": "PA672",
        "legislature": "14",
        "typeOrgane": "GE",
        "dateDebut": "2016-05-31T02:00:00.000+02:00",
        "datePublication": null,
        "dateFin": "2017-06-20T02:00:00.000+02:00",
        "preseance": "20",
        "nominPrincipale": "1",
        "infosQualite": {
          "codeQualite": "Membre",
          "libQualite": "Membre",
          "libQualiteSex": "Membre"
        },
        "organes": {
          "organeRef": "PO712794"
        }
      },
      {
        "@xmlns:xsi": "http://www.w3.org/2001/XMLSchema-instance",
        "@xsi:type": "MandatSimple_Type",
        "uid": "PM755171",
        "acteurRef": "PA672",
        "legislature": "15",
        "typeOrgane": "GE",
        "dateDebut": "2018-04-09T02:00:00.000+02:00",
        "datePublication": null,
        "dateFin": null,
        "preseance": "20",
        "nominPrincipale": "1",
        "infosQualite": {
          "codeQualite": "Membre",
          "libQualite": "Membre",
          "libQualiteSex": "Membre"
        },
        "organes": {
          "organeRef": "PO746634"
        }
      },
      {
        "@xmlns:xsi": "http://www.w3.org/2001/XMLSchema-instance",
        "@xsi:type": "MandatSimple_Type",
        "uid": "PM750056",
        "acteurRef": "PA672",
        "legislature": "15",
        "typeOrgane": "GE",
        "dateDebut": "2018-02-14T01:00:00.000+01:00",
        "datePublication": null,
        "dateFin": null,
        "preseance": "20",
        "nominPrincipale": "0",
        "infosQualite": {
          "codeQualite": "Membre",
          "libQualite": "Membre",
          "libQualiteSex": "Membre"
        },
        "organes": {
          "organeRef": "PO747032"
        }
      },
      {
        "@xmlns:xsi": "http://www.w3.org/2001/XMLSchema-instance",
        "@xsi:type": "MandatSimple_Type",
        "uid": "PM705564",
        "acteurRef": "PA672",
        "legislature": "14",
        "typeOrgane": "GE",
        "dateDebut": "2014-12-17T01:00:00.000+01:00",
        "datePublication": null,
        "dateFin": "2017-06-20T02:00:00.000+02:00",
        "preseance": "20",
        "nominPrincipale": "1",
        "infosQualite": {
          "codeQualite": "Membre",
          "libQualite": "Membre",
          "libQualiteSex": "Membre"
        },
        "organes": {
          "organeRef": "PO704831"
        }
      },
      {
        "@xmlns:xsi": "http://www.w3.org/2001/XMLSchema-instance",
        "@xsi:type": "MandatSimple_Type",
        "uid": "PM740405",
        "acteurRef": "PA672",
        "legislature": "15",
        "typeOrgane": "GA",
        "dateDebut": "2017-10-17T02:00:00.000+02:00",
        "datePublication": null,
        "dateFin": null,
        "preseance": "20",
        "nominPrincipale": "1",
        "infosQualite": {
          "codeQualite": "Membre",
          "libQualite": "Membre",
          "libQualiteSex": "Membre"
        },
        "organes": {
          "organeRef": "PO733693"
        }
      },
      {
        "@xmlns:xsi": "http://www.w3.org/2001/XMLSchema-instance",
        "@xsi:type": "MandatSimple_Type",
        "uid": "PM681743",
        "acteurRef": "PA672",
        "legislature": "14",
        "typeOrgane": "GA",
        "dateDebut": "2012-10-16T02:00:00.000+02:00",
        "datePublication": null,
        "dateFin": "2017-06-20T02:00:00.000+02:00",
        "preseance": "20",
        "nominPrincipale": "1",
        "infosQualite": {
          "codeQualite": "Membre",
          "libQualite": "Membre",
          "libQualiteSex": "Membre"
        },
        "organes": {
          "organeRef": "PO675802"
        }
      },
      {
        "@xmlns:xsi": "http://www.w3.org/2001/XMLSchema-instance",
        "@xsi:type": "MandatSimple_Type",
        "uid": "PM683893",
        "acteurRef": "PA672",
        "legislature": "14",
        "typeOrgane": "GA",
        "dateDebut": "2012-11-05T01:00:00.000+01:00",
        "datePublication": null,
        "dateFin": "2017-06-20T02:00:00.000+02:00",
        "preseance": "20",
        "nominPrincipale": "1",
        "infosQualite": {
          "codeQualite": "Membre",
          "libQualite": "Membre",
          "libQualiteSex": "Membre"
        },
        "organes": {
          "organeRef": "PO675796"
        }
      },
      {
        "@xmlns:xsi": "http://www.w3.org/2001/XMLSchema-instance",
        "@xsi:type": "MandatSimple_Type",
        "uid": "PM683178",
        "acteurRef": "PA672",
        "legislature": "14",
        "typeOrgane": "GA",
        "dateDebut": "2012-10-23T02:00:00.000+02:00",
        "datePublication": null,
        "dateFin": "2017-06-20T02:00:00.000+02:00",
        "preseance": "20",
        "nominPrincipale": "1",
        "infosQualite": {
          "codeQualite": "Membre",
          "libQualite": "Membre",
          "libQualiteSex": "Membre"
        },
        "organes": {
          "organeRef": "PO675799"
        }
      },
      {
        "@xmlns:xsi": "http://www.w3.org/2001/XMLSchema-instance",
        "@xsi:type": "MandatSimple_Type",
        "uid": "PM735340",
        "acteurRef": "PA672",
        "legislature": "15",
        "typeOrgane": "GA",
        "dateDebut": "2017-09-26T02:00:00.000+02:00",
        "datePublication": null,
        "dateFin": null,
        "preseance": "20",
        "nominPrincipale": "0",
        "infosQualite": {
          "codeQualite": "Membre",
          "libQualite": "Membre",
          "libQualiteSex": "Membre"
        },
        "organes": {
          "organeRef": "PO733547"
        }
      },
      {
        "@xmlns:xsi": "http://www.w3.org/2001/XMLSchema-instance",
        "@xsi:type": "MandatSimple_Type",
        "uid": "PM740502",
        "acteurRef": "PA672",
        "legislature": "15",
        "typeOrgane": "GA",
        "dateDebut": "2017-10-18T02:00:00.000+02:00",
        "datePublication": null,
        "dateFin": null,
        "preseance": "20",
        "nominPrincipale": "0",
        "infosQualite": {
          "codeQualite": "Membre",
          "libQualite": "Membre",
          "libQualiteSex": "Membre"
        },
        "organes": {
          "organeRef": "PO733432"
        }
      },
      {
        "@xmlns:xsi": "http://www.w3.org/2001/XMLSchema-instance",
        "@xsi:type": "MandatSimple_Type",
        "uid": "PM678609",
        "acteurRef": "PA672",
        "legislature": "14",
        "typeOrgane": "GA",
        "dateDebut": "2012-09-26T02:00:00.000+02:00",
        "datePublication": null,
        "dateFin": "2017-06-20T02:00:00.000+02:00",
        "preseance": "20",
        "nominPrincipale": "0",
        "infosQualite": {
          "codeQualite": "Membre",
          "libQualite": "Membre",
          "libQualiteSex": "Membre"
        },
        "organes": {
          "organeRef": "PO675822"
        }
      },
      {
        "@xmlns:xsi": "http://www.w3.org/2001/XMLSchema-instance",
        "@xsi:type": "MandatSimple_Type",
        "uid": "PM681742",
        "acteurRef": "PA672",
        "legislature": "14",
        "typeOrgane": "GA",
        "dateDebut": "2012-10-16T02:00:00.000+02:00",
        "datePublication": null,
        "dateFin": "2017-06-20T02:00:00.000+02:00",
        "preseance": "20",
        "nominPrincipale": "1",
        "infosQualite": {
          "codeQualite": "Membre",
          "libQualite": "Membre",
          "libQualiteSex": "Membre"
        },
        "organes": {
          "organeRef": "PO675806"
        }
      },
      {
        "@xmlns:xsi": "http://www.w3.org/2001/XMLSchema-instance",
        "@xsi:type": "MandatSimple_Type",
        "uid": "PM681744",
        "acteurRef": "PA672",
        "legislature": "14",
        "typeOrgane": "GA",
        "dateDebut": "2012-10-16T02:00:00.000+02:00",
        "datePublication": null,
        "dateFin": "2017-06-20T02:00:00.000+02:00",
        "preseance": "20",
        "nominPrincipale": "1",
        "infosQualite": {
          "codeQualite": "Membre",
          "libQualite": "Membre",
          "libQualiteSex": "Membre"
        },
        "organes": {
          "organeRef": "PO675828"
        }
      },
      {
        "@xmlns:xsi": "http://www.w3.org/2001/XMLSchema-instance",
        "@xsi:type": "MandatSimple_Type",
        "uid": "PM683246",
        "acteurRef": "PA672",
        "legislature": "14",
        "typeOrgane": "GA",
        "dateDebut": "2012-10-23T02:00:00.000+02:00",
        "datePublication": null,
        "dateFin": "2017-06-20T02:00:00.000+02:00",
        "preseance": "20",
        "nominPrincipale": "1",
        "infosQualite": {
          "codeQualite": "Membre",
          "libQualite": "Membre",
          "libQualiteSex": "Membre"
        },
        "organes": {
          "organeRef": "PO675784"
        }
      },
      {
        "@xmlns:xsi": "http://www.w3.org/2001/XMLSchema-instance",
        "@xsi:type": "MandatSimple_Type",
        "uid": "PM683179",
        "acteurRef": "PA672",
        "legislature": "14",
        "typeOrgane": "GA",
        "dateDebut": "2012-10-23T02:00:00.000+02:00",
        "datePublication": null,
        "dateFin": "2017-06-20T02:00:00.000+02:00",
        "preseance": "20",
        "nominPrincipale": "1",
        "infosQualite": {
          "codeQualite": "Membre",
          "libQualite": "Membre",
          "libQualiteSex": "Membre"
        },
        "organes": {
          "organeRef": "PO675764"
        }
      },
      {
        "@xmlns:xsi": "http://www.w3.org/2001/XMLSchema-instance",
        "@xsi:type": "MandatSimple_Type",
        "uid": "PM735341",
        "acteurRef": "PA672",
        "legislature": "15",
        "typeOrgane": "GA",
        "dateDebut": "2017-09-26T02:00:00.000+02:00",
        "datePublication": null,
        "dateFin": null,
        "preseance": "1",
        "nominPrincipale": "1",
        "infosQualite": {
          "codeQualite": "Président",
          "libQualite": "Président",
          "libQualiteSex": "Président"
        },
        "organes": {
          "organeRef": "PO733547"
        }
      },
      {
        "@xmlns:xsi": "http://www.w3.org/2001/XMLSchema-instance",
        "@xsi:type": "MandatSimple_Type",
        "uid": "PM678610",
        "acteurRef": "PA672",
        "legislature": "14",
        "typeOrgane": "GA",
        "dateDebut": "2012-09-26T02:00:00.000+02:00",
        "datePublication": null,
        "dateFin": "2017-06-20T02:00:00.000+02:00",
        "preseance": "1",
        "nominPrincipale": "1",
        "infosQualite": {
          "codeQualite": "Président",
          "libQualite": "Président",
          "libQualiteSex": "Président"
        },
        "organes": {
          "organeRef": "PO675822"
        }
      },
      {
        "@xmlns:xsi": "http://www.w3.org/2001/XMLSchema-instance",
        "@xsi:type": "MandatMission_Type",
        "uid": "PM692124",
        "acteurRef": "PA672",
        "legislature": "14",
        "typeOrgane": "MISINFO",
        "dateDebut": "2012-06-26T02:00:00.000+02:00",
        "datePublication": null,
        "dateFin": "2013-07-10T02:00:00.000+02:00",
        "preseance": "14",
        "nominPrincipale": "1",
        "infosQualite": {
          "codeQualite": "Rapporteur",
          "libQualite": "Rapporteur sur \"La conduite des programmes d'armement en coopération\"",
          "libQualiteSex": "Rapporteur sur \"La conduite des programmes d'armement en coopération\""
        },
        "organes": {
          "organeRef": "PO683565"
        },
        "libelle": null,
        "missionSuivanteRef": null,
        "missionPrecedenteRef": null
      },
      {
        "@xmlns:xsi": "http://www.w3.org/2001/XMLSchema-instance",
        "@xsi:type": "MandatSimple_Type",
        "uid": "PM732323",
        "acteurRef": "PA672",
        "legislature": "15",
        "typeOrgane": "COMPER",
        "dateDebut": "2017-06-30T02:00:00.000+02:00",
        "datePublication": "2017-06-30T02:00:00.000+02:00",
        "dateFin": "2019-09-30T02:00:00.000+02:00",
        "preseance": "1",
        "nominPrincipale": "1",
        "infosQualite": {
          "codeQualite": "Président",
          "libQualite": "Président",
          "libQualiteSex": "Président"
        },
        "organes": {
          "organeRef": "PO59046"
        }
      },
      {
        "@xmlns:xsi": "http://www.w3.org/2001/XMLSchema-instance",
        "@xsi:type": "MandatSimple_Type",
        "uid": "PM708958",
        "acteurRef": "PA672",
        "legislature": "14",
        "typeOrgane": "CMP",
        "dateDebut": "2015-07-10T02:00:00.000+02:00",
        "datePublication": "2015-07-11T02:00:00.000+02:00",
        "dateFin": "2015-07-16T02:00:00.000+02:00",
        "preseance": "28",
        "nominPrincipale": "1",
        "infosQualite": {
          "codeQualite": "Suppléant",
          "libQualite": "Membre suppléant",
          "libQualiteSex": "Membre suppléant"
        },
        "organes": {
          "organeRef": "PO708945"
        }
      },
      {
        "@xmlns:xsi": "http://www.w3.org/2001/XMLSchema-instance",
        "@xsi:type": "MandatParlementaire_type",
        "uid": "PM645175",
        "acteurRef": "PA672",
        "legislature": "14",
        "typeOrgane": "ASSEMBLEE",
        "dateDebut": "2012-06-20T02:00:00.000+02:00",
        "datePublication": null,
        "dateFin": "2017-06-20T02:00:00.000+02:00",
        "preseance": "50",
        "nominPrincipale": "1",
        "infosQualite": {
          "codeQualite": "membre",
          "libQualite": "membre",
          "libQualiteSex": "membre"
        },
        "organes": {
          "organeRef": "PO644420"
        },
        "suppleants": {
          "suppleant": {
            "dateDebut": "2012-06-20T02:00:00.000+02:00",
            "dateFin": "2017-06-20T02:00:00.000+02:00",
            "suppleantRef": "PA643044"
          }
        },
        "chambre": null,
        "election": {
          "lieu": {
            "region": "Ile-de-France",
            "regionType": "Métropolitain",
            "departement": "Val-de-Marne",
            "numDepartement": "94",
            "numCirco": "7"
          },
          "causeMandat": "élections générales",
          "refCirconscription": "PO644961"
        },
        "mandature": {
          "datePriseFonction": "2012-06-20T02:00:00.000+02:00",
          "causeFin": "Fin de législature",
          "premiereElection": "0",
          "placeHemicycle": "454",
          "mandatRemplaceRef": null
        },
        "collaborateurs": null
      },
      {
        "@xmlns:xsi": "http://www.w3.org/2001/XMLSchema-instance",
        "@xsi:type": "MandatSimple_Type",
        "uid": "PM756834",
        "acteurRef": "PA672",
        "legislature": "15",
        "typeOrgane": "GE",
        "dateDebut": "2018-05-16T02:00:00.000+02:00",
        "datePublication": null,
        "dateFin": null,
        "preseance": "8",
        "nominPrincipale": "1",
        "infosQualite": {
          "codeQualite": "Vice-Président",
          "libQualite": "Vice-Président",
          "libQualiteSex": "Vice-Président"
        },
        "organes": {
          "organeRef": "PO747032"
        }
      },
      {
        "@xmlns:xsi": "http://www.w3.org/2001/XMLSchema-instance",
        "@xsi:type": "MandatSimple_Type",
        "uid": "PM687440",
        "acteurRef": "PA672",
        "legislature": "14",
        "typeOrgane": "GA",
        "dateDebut": "2012-12-18T01:00:00.000+01:00",
        "datePublication": null,
        "dateFin": "2017-06-20T02:00:00.000+02:00",
        "preseance": "8",
        "nominPrincipale": "1",
        "infosQualite": {
          "codeQualite": "Vice-Président",
          "libQualite": "Vice-Président",
          "libQualiteSex": "Vice-Président"
        },
        "organes": {
          "organeRef": "PO675828"
        }
      },
      {
        "@xmlns:xsi": "http://www.w3.org/2001/XMLSchema-instance",
        "@xsi:type": "MandatSimple_Type",
        "uid": "PM748040",
        "acteurRef": "PA672",
        "legislature": "15",
        "typeOrgane": "GA",
        "dateDebut": "2018-01-23T01:00:00.000+01:00",
        "datePublication": null,
        "dateFin": null,
        "preseance": "8",
        "nominPrincipale": "1",
        "infosQualite": {
          "codeQualite": "Vice-Président",
          "libQualite": "Vice-Président",
          "libQualiteSex": "Vice-Président"
        },
        "organes": {
          "organeRef": "PO733432"
        }
      },
      {
        "@xmlns:xsi": "http://www.w3.org/2001/XMLSchema-instance",
        "@xsi:type": "MandatSimple_Type",
        "uid": "PM684839",
        "acteurRef": "PA672",
        "legislature": "14",
        "typeOrgane": "GA",
        "dateDebut": "2012-11-22T01:00:00.000+01:00",
        "datePublication": null,
        "dateFin": "2017-06-20T02:00:00.000+02:00",
        "preseance": "8",
        "nominPrincipale": "1",
        "infosQualite": {
          "codeQualite": "Vice-Président",
          "libQualite": "Vice-Président",
          "libQualiteSex": "Vice-Président"
        },
        "organes": {
          "organeRef": "PO675802"
        }
      },
      {
        "@xmlns:xsi": "http://www.w3.org/2001/XMLSchema-instance",
        "@xsi:type": "MandatParlementaire_type",
        "uid": "PM723230",
        "acteurRef": "PA672",
        "legislature": "15",
        "typeOrgane": "ASSEMBLEE",
        "dateDebut": "2017-06-18T02:00:00.000+02:00",
        "datePublication": null,
        "dateFin": null,
        "preseance": "50",
        "nominPrincipale": "1",
        "infosQualite": {
          "codeQualite": "membre",
          "libQualite": "membre",
          "libQualiteSex": "membre"
        },
        "organes": {
          "organeRef": "PO717460"
        },
        "suppleants": {
          "suppleant": {
            "dateDebut": "2017-06-18T02:00:00.000+02:00",
            "dateFin": null,
            "suppleantRef": "PA721304"
          }
        },
        "chambre": null,
        "election": {
          "lieu": {
            "region": "Ile-de-France",
            "regionType": "Métropolitain",
            "departement": "Val-de-Marne",
            "numDepartement": "94",
            "numCirco": "7"
          },
          "causeMandat": "élections générales",
          "refCirconscription": "PO718492"
        },
        "mandature": {
          "datePriseFonction": "2017-06-21T02:00:00.000+02:00",
          "causeFin": null,
          "premiereElection": "1",
          "placeHemicycle": "454",
          "mandatRemplaceRef": null
        },
        "collaborateurs": {
          "collaborateur": [
            {
              "qualite": "Mme",
              "prenom": "Sonia",
              "nom": "Skandrani",
              "dateDebut": null,
              "dateFin": null
            },
            {
              "qualite": "M.",
              "prenom": "Abdoulaye",
              "nom": "Bathily",
              "dateDebut": null,
              "dateFin": null
            }
          ]
        }
      }
    ]
  }
}