{
  "@xmlns": "http://schemas.assemblee-nationale.fr/referentiel",
  "@xmlns:xsi": "http://www.w3.org/2001/XMLSchema-instance",
  "@xsi:type": "OrganeParlementaire_Type",
  "uid": "PO707509",
  "codeType": "MISINFO",
  "libelle": "Engagement et diplomatie : quelles doctrine pour nos interventions militaires ?",
  "libelleEdition": "de la mission d'information sur Engagement et diplomatie : quelles doctrine pour nos interventions militaires ?",
  "libelleAbrege": "Engagement et diplomatie",
  "libelleAbrev": "DIPLO",
  "viMoDe": {
    "dateDebut": "2012-11-14T01:00:00.000+01:00",
    "dateAgrement": null,
    "dateFin": "2015-05-20T02:00:00.000+02:00"
  },
  "organeParent": "PO59047",
  "chambre": null,
  "regime": "5ème République",
  "legislature": "14",
  "secretariat": {
    "secretaire01": null,
    "secretaire02": null
  }
}