{
  "@xmlns": "http://schemas.assemblee-nationale.fr/referentiel",
  "@xmlns:xsi": "http://www.w3.org/2001/XMLSchema-instance",
  "@xsi:type": "OrganeExterne_Type",
  "uid": "PO715852",
  "codeType": "MINISTERE",
  "libelle": "Secrétariat d'État, auprès du Premier ministre, chargé de la réforme de l'État et de la simplification",
  "libelleEdition": ", auprès du Premier ministre, chargé de la réforme de l'État et de la simplification",
  "libelleAbrege": "Réforme de l'État et simplification",
  "libelleAbrev": "REF",
  "viMoDe": {
    "dateDebut": "2016-12-07T01:00:00.000+01:00",
    "dateAgrement": null,
    "dateFin": "2017-05-17T02:00:00.000+02:00"
  },
  "organeParent": "PO715793"
}