{
  "@xmlns": "http://schemas.assemblee-nationale.fr/referentiel",
  "@xmlns:xsi": "http://www.w3.org/2001/XMLSchema-instance",
  "@xsi:type": "OrganeParlementaireInternational",
  "uid": "PO733052",
  "codeType": "GA",
  "libelle": "France-Géorgie",
  "libelleEdition": "de France-Géorgie",
  "libelleAbrege": "Géorgie",
  "libelleAbrev": "GEOR",
  "viMoDe": {
    "dateDebut": null,
    "dateAgrement": "2017-07-19T02:00:00.000+02:00",
    "dateFin": null
  },
  "organeParent": null,
  "chambre": null,
  "regime": "5ème République",
  "legislature": "15",
  "secretariat": {
    "secretaire01": "Mme Marine Heilaud",
    "secretaire02": null
  },
  "listePays": {
    "paysRef": "GOP756484"
  }
}