{
  "@xmlns": "http://schemas.assemblee-nationale.fr/referentiel",
  "@xmlns:xsi": "http://www.w3.org/2001/XMLSchema-instance",
  "@xsi:type": "OrganeParlementaireInternational",
  "uid": "PO274081",
  "codeType": "GA",
  "libelle": "France République de Chypre",
  "libelleEdition": "de France République de Chypre",
  "libelleAbrege": "Chypre",
  "libelleAbrev": "CY",
  "viMoDe": {
    "dateDebut": null,
    "dateAgrement": "2002-07-24T02:00:00.000+02:00",
    "dateFin": "2007-06-19T02:00:00.000+02:00"
  },
  "organeParent": null,
  "chambre": null,
  "regime": "5ème République",
  "legislature": "12",
  "secretariat": {
    "secretaire01": null,
    "secretaire02": null
  },
  "listePays": null
}