{
  "@xmlns": "http://schemas.assemblee-nationale.fr/referentiel",
  "@xmlns:xsi": "http://www.w3.org/2001/XMLSchema-instance",
  "@xsi:type": "OrganeExtraParlementaire_type",
  "uid": "PO717314",
  "codeType": "ORGEXTPARL",
  "libelle": "Comité de massif du Massif jurassien",
  "libelleEdition": null,
  "libelleAbrege": "Comité massif du Jura",
  "libelleAbrev": "366",
  "viMoDe": {
    "dateDebut": "2016-12-28T01:00:00.000+01:00",
    "dateAgrement": null,
    "dateFin": null
  },
  "organeParent": null,
  "chambre": null,
  "regime": "5ème République",
  "legislature": null,
  "regimeJuridique": "Article 7 de la loi n° 85-30 du 9 janvier 1985",
  "siteInternet": "http://www.cget.gouv.fr/montagne/commissariats-de-massifs",
  "nombreReunionsAnnuelles": null
}