{
  "@xmlns": "http://schemas.assemblee-nationale.fr/referentiel",
  "@xmlns:xsi": "http://www.w3.org/2001/XMLSchema-instance",
  "@xsi:type": "OrganeExterne_Type",
  "uid": "PO382998",
  "codeType": "MINISTERE",
  "libelle": "Ministère de la santé, de la jeunesse et des sports",
  "libelleEdition": "de la santé, de la jeunesse et des sports",
  "libelleAbrege": "santé, jeunesse et sports",
  "libelleAbrev": "SAN",
  "viMoDe": {
    "dateDebut": "2007-05-18T02:00:00.000+02:00",
    "dateAgrement": null,
    "dateFin": "2007-06-18T02:00:00.000+02:00"
  },
  "organeParent": "PO382939"
}