{
  "@xmlns": "http://schemas.assemblee-nationale.fr/referentiel",
  "@xmlns:xsi": "http://www.w3.org/2001/XMLSchema-instance",
  "@xsi:type": "OrganeExterne_Type",
  "uid": "PO410980",
  "codeType": "MINISTERE",
  "libelle": "Secrétariat d'Etat aux sports, à la jeunesse et à la vie associative, auprès de la ministre de la santé, de la jeunesse, des sports et de la vie associative",
  "libelleEdition": "aux sports, à la jeunesse et à la vie associative, auprès de la ministre de la santé, de la jeunesse, des sports et de la vie associative",
  "libelleAbrege": "Sports, jeunesse et vie associative",
  "libelleAbrev": "SPO",
  "viMoDe": {
    "dateDebut": "2008-03-18T01:00:00.000+01:00",
    "dateAgrement": null,
    "dateFin": "2009-01-12T01:00:00.000+01:00"
  },
  "organeParent": "PO384206"
}