{
  "@xmlns": "http://schemas.assemblee-nationale.fr/referentiel",
  "@xmlns:xsi": "http://www.w3.org/2001/XMLSchema-instance",
  "@xsi:type": "OrganeExterne_Type",
  "uid": "PO714650",
  "codeType": "MINISTERE",
  "libelle": "Secrétariat d'État, auprès du ministère de l'économie et des finances, chargé du commerce, de l'artisanat, de la consommation et de l'économie sociale et solidaire",
  "libelleEdition": ", auprès du ministre de l'économie et des finances, chargée du commerce, de l'artisanat, de la consommation et de l'économie sociale et solidaire",
  "libelleAbrege": "Commerce, artisanat, consommation et économie sociale et solidaire",
  "libelleAbrev": "ACC",
  "viMoDe": {
    "dateDebut": "2016-08-31T02:00:00.000+02:00",
    "dateAgrement": null,
    "dateFin": "2016-12-06T01:00:00.000+01:00"
  },
  "organeParent": "PO702883"
}