{
  "@xmlns": "http://schemas.assemblee-nationale.fr/referentiel",
  "@xmlns:xsi": "http://www.w3.org/2001/XMLSchema-instance",
  "@xsi:type": "OrganeParlementaireInternational",
  "uid": "PO675745",
  "codeType": "GA",
  "libelle": "France-Azerbaïdjan",
  "libelleEdition": "de France-Azerbaïdjan",
  "libelleAbrege": "Azerbaïdjan",
  "libelleAbrev": "AZE",
  "viMoDe": {
    "dateDebut": null,
    "dateAgrement": "2012-07-18T02:00:00.000+02:00",
    "dateFin": "2017-06-20T02:00:00.000+02:00"
  },
  "organeParent": null,
  "chambre": null,
  "regime": "5ème République",
  "legislature": "14",
  "secretariat": {
    "secretaire01": null,
    "secretaire02": null
  },
  "listePays": null
}