{
  "@xmlns": "http://schemas.assemblee-nationale.fr/referentiel",
  "@xmlns:xsi": "http://www.w3.org/2001/XMLSchema-instance",
  "@xsi:type": "OrganeParlementaire_Type",
  "uid": "PO709067",
  "codeType": "CMP",
  "libelle": "Commission mixte paritaire chargée de proposer un texte sur les dispositions restant en discussion du projet de loi d'actualisation du droit des outre-mer",
  "libelleEdition": "de la commission mixte paritaire chargée de proposer un texte sur les dispositions restant en discussion du projet de loi d'actualisation du droit des outre-mer",
  "libelleAbrege": "Droit des outre-mer",
  "libelleAbrev": "2910",
  "viMoDe": {
    "dateDebut": "2015-07-17T02:00:00.000+02:00",
    "dateAgrement": null,
    "dateFin": "2015-10-07T02:00:00.000+02:00"
  },
  "organeParent": null,
  "chambre": null,
  "regime": "5ème République",
  "legislature": "14",
  "secretariat": {
    "secretaire01": null,
    "secretaire02": null
  }
}