{
  "@xmlns": "http://schemas.assemblee-nationale.fr/referentiel",
  "uid": {
    "@xmlns:xsi": "http://www.w3.org/2001/XMLSchema-instance",
    "@xsi:type": "IdActeur_type",
    "#text": "PA721062"
  },
  "etatCivil": {
    "ident": {
      "civ": "M.",
      "prenom": "Jean-Hugues",
      "nom": "Ratenon",
      "alpha": "Ratenon",
      "trigramme": "JRA"
    },
    "infoNaissance": {
      "dateNais": "1967-06-25T01:00:00.000+01:00",
      "villeNais": "Saint-Benoît",
      "depNais": "Réunion",
      "paysNais": "France"
    },
    "dateDeces": {
      "@xmlns:xsi": "http://www.w3.org/2001/XMLSchema-instance",
      "@xsi:nil": "true"
    }
  },
  "profession": {
    "libelleCourant": "Employé (secteur privé)",
    "socProcINSEE": {
      "catSocPro": "Employés de commerce",
      "famSocPro": "Employés"
    }
  },
  "uri_hatvp": "https://www.hatvp.fr/pages_nominatives/ratenon-jean-hugues",
  "adresses": {
    "adresse": [
      {
        "@xmlns:xsi": "http://www.w3.org/2001/XMLSchema-instance",
        "@xsi:type": "AdressePostale_Type",
        "uid": "AD721064",
        "type": "0",
        "typeLibelle": "Adresse officielle",
        "poids": "1",
        "adresseDeRattachement": null,
        "intitule": "Assemblée nationale,",
        "numeroRue": "126",
        "nomRue": "Rue de l'Université,",
        "complementAdresse": null,
        "codePostal": "75355",
        "ville": "Paris 07 SP"
      },
      {
        "@xmlns:xsi": "http://www.w3.org/2001/XMLSchema-instance",
        "@xsi:type": "AdresseMail_Type",
        "uid": "AD728212",
        "type": "15",
        "typeLibelle": "Mèl",
        "poids": null,
        "adresseDeRattachement": null,
        "valElec": "jean-hugues.ratenon@assemblee-nationale.fr"
      },
      {
        "@xmlns:xsi": "http://www.w3.org/2001/XMLSchema-instance",
        "@xsi:type": "AdressePostale_Type",
        "uid": "AD763900",
        "type": "2",
        "typeLibelle": "Adresse publiée de circonscription",
        "poids": "2",
        "adresseDeRattachement": null,
        "intitule": null,
        "numeroRue": "13",
        "nomRue": "Cité Curiale",
        "complementAdresse": null,
        "codePostal": "97470",
        "ville": "Saint-Benoît"
      }
    ]
  },
  "mandats": {
    "mandat": [
      {
        "@xmlns:xsi": "http://www.w3.org/2001/XMLSchema-instance",
        "@xsi:type": "MandatSimple_Type",
        "uid": "PM732543",
        "acteurRef": "PA721062",
        "legislature": "15",
        "typeOrgane": "DELEG",
        "dateDebut": "2017-07-12T02:00:00.000+02:00",
        "datePublication": "2017-07-12T02:00:00.000+02:00",
        "dateFin": null,
        "preseance": "20",
        "nominPrincipale": "1",
        "infosQualite": {
          "codeQualite": "Membre",
          "libQualite": "Membre",
          "libQualiteSex": "Membre"
        },
        "organes": {
          "organeRef": "PO675659"
        }
      },
      {
        "@xmlns:xsi": "http://www.w3.org/2001/XMLSchema-instance",
        "@xsi:type": "MandatMission_Type",
        "uid": "PM743654",
        "acteurRef": "PA721062",
        "legislature": "15",
        "typeOrgane": "MISINFOPRE",
        "dateDebut": "2017-11-22T01:00:00.000+01:00",
        "datePublication": "2017-11-22T01:00:00.000+01:00",
        "dateFin": "2018-11-14T01:00:00.000+01:00",
        "preseance": "20",
        "nominPrincipale": "1",
        "infosQualite": {
          "codeQualite": "Membre",
          "libQualite": "Membre",
          "libQualiteSex": "Membre"
        },
        "organes": {
          "organeRef": "PO743158"
        },
        "libelle": null,
        "missionSuivanteRef": null,
        "missionPrecedenteRef": null
      },
      {
        "@xmlns:xsi": "http://www.w3.org/2001/XMLSchema-instance",
        "@xsi:type": "MandatSimple_Type",
        "uid": "PM745559",
        "acteurRef": "PA721062",
        "legislature": null,
        "typeOrgane": "PARPOL",
        "dateDebut": "2017-12-01T01:00:00.000+01:00",
        "datePublication": null,
        "dateFin": null,
        "preseance": "5",
        "nominPrincipale": "1",
        "infosQualite": {
          "codeQualite": "Membre",
          "libQualite": "Membre",
          "libQualiteSex": "Membre"
        },
        "organes": {
          "organeRef": "PO744856"
        }
      },
      {
        "@xmlns:xsi": "http://www.w3.org/2001/XMLSchema-instance",
        "@xsi:type": "MandatMission_Type",
        "uid": "PM744037",
        "acteurRef": "PA721062",
        "legislature": "15",
        "typeOrgane": "MISINFOPRE",
        "dateDebut": "2017-11-24T01:00:00.000+01:00",
        "datePublication": "2017-11-24T01:00:00.000+01:00",
        "dateFin": "2018-11-14T01:00:00.000+01:00",
        "preseance": "8",
        "nominPrincipale": "1",
        "infosQualite": {
          "codeQualite": "Secrétaire",
          "libQualite": "Secrétaire",
          "libQualiteSex": "Secrétaire"
        },
        "organes": {
          "organeRef": "PO743158"
        },
        "libelle": null,
        "missionSuivanteRef": null,
        "missionPrecedenteRef": null
      },
      {
        "@xmlns:xsi": "http://www.w3.org/2001/XMLSchema-instance",
        "@xsi:type": "MandatSimple_Type",
        "uid": "PM731522",
        "acteurRef": "PA721062",
        "legislature": "15",
        "typeOrgane": "GP",
        "dateDebut": "2017-06-27T02:00:00.000+02:00",
        "datePublication": "2017-06-28T02:00:00.000+02:00",
        "dateFin": null,
        "preseance": "20",
        "nominPrincipale": "1",
        "infosQualite": {
          "codeQualite": "Membre",
          "libQualite": "Membre du",
          "libQualiteSex": "Membre du"
        },
        "organes": {
          "organeRef": "PO730958"
        }
      },
      {
        "@xmlns:xsi": "http://www.w3.org/2001/XMLSchema-instance",
        "@xsi:type": "MandatSimple_Type",
        "uid": "PM731677",
        "acteurRef": "PA721062",
        "legislature": "15",
        "typeOrgane": "COMPER",
        "dateDebut": "2017-06-29T02:00:00.000+02:00",
        "datePublication": "2017-06-29T02:00:00.000+02:00",
        "dateFin": "2018-01-09T01:00:00.000+01:00",
        "preseance": "32",
        "nominPrincipale": "1",
        "infosQualite": {
          "codeQualite": "Membre",
          "libQualite": "Membre",
          "libQualiteSex": "Membre"
        },
        "organes": {
          "organeRef": "PO420120"
        }
      },
      {
        "@xmlns:xsi": "http://www.w3.org/2001/XMLSchema-instance",
        "@xsi:type": "MandatSimple_Type",
        "uid": "PM762353",
        "acteurRef": "PA721062",
        "legislature": "15",
        "typeOrgane": "COMPER",
        "dateDebut": "2019-01-30T01:00:00.000+01:00",
        "datePublication": "2019-01-30T01:00:00.000+01:00",
        "dateFin": "2019-02-11T01:00:00.000+01:00",
        "preseance": "32",
        "nominPrincipale": "1",
        "infosQualite": {
          "codeQualite": "Membre",
          "libQualite": "Membre",
          "libQualiteSex": "Membre"
        },
        "organes": {
          "organeRef": "PO419865"
        }
      },
      {
        "@xmlns:xsi": "http://www.w3.org/2001/XMLSchema-instance",
        "@xsi:type": "MandatSimple_Type",
        "uid": "PM747590",
        "acteurRef": "PA721062",
        "legislature": "15",
        "typeOrgane": "COMPER",
        "dateDebut": "2018-01-12T01:00:00.000+01:00",
        "datePublication": "2018-01-12T01:00:00.000+01:00",
        "dateFin": "2019-01-29T01:00:00.000+01:00",
        "preseance": "32",
        "nominPrincipale": "1",
        "infosQualite": {
          "codeQualite": "Membre",
          "libQualite": "Membre",
          "libQualiteSex": "Membre"
        },
        "organes": {
          "organeRef": "PO420120"
        }
      },
      {
        "@xmlns:xsi": "http://www.w3.org/2001/XMLSchema-instance",
        "@xsi:type": "MandatSimple_Type",
        "uid": "PM762617",
        "acteurRef": "PA721062",
        "legislature": "15",
        "typeOrgane": "COMPER",
        "dateDebut": "2019-02-12T01:00:00.000+01:00",
        "datePublication": "2019-02-12T01:00:00.000+01:00",
        "dateFin": "2019-02-25T01:00:00.000+01:00",
        "preseance": "32",
        "nominPrincipale": "1",
        "infosQualite": {
          "codeQualite": "Membre",
          "libQualite": "Membre",
          "libQualiteSex": "Membre"
        },
        "organes": {
          "organeRef": "PO419610"
        }
      },
      {
        "@xmlns:xsi": "http://www.w3.org/2001/XMLSchema-instance",
        "@xsi:type": "MandatSimple_Type",
        "uid": "PM762922",
        "acteurRef": "PA721062",
        "legislature": "15",
        "typeOrgane": "COMPER",
        "dateDebut": "2019-02-26T01:00:00.000+01:00",
        "datePublication": "2019-02-26T01:00:00.000+01:00",
        "dateFin": null,
        "preseance": "32",
        "nominPrincipale": "1",
        "infosQualite": {
          "codeQualite": "Membre",
          "libQualite": "Membre",
          "libQualiteSex": "Membre"
        },
        "organes": {
          "organeRef": "PO420120"
        }
      },
      {
        "@xmlns:xsi": "http://www.w3.org/2001/XMLSchema-instance",
        "@xsi:type": "MandatSimple_Type",
        "uid": "PM747548",
        "acteurRef": "PA721062",
        "legislature": "15",
        "typeOrgane": "COMPER",
        "dateDebut": "2018-01-10T01:00:00.000+01:00",
        "datePublication": "2018-01-10T01:00:00.000+01:00",
        "dateFin": "2018-01-11T01:00:00.000+01:00",
        "preseance": "32",
        "nominPrincipale": "1",
        "infosQualite": {
          "codeQualite": "Membre",
          "libQualite": "Membre",
          "libQualiteSex": "Membre"
        },
        "organes": {
          "organeRef": "PO419610"
        }
      },
      {
        "@xmlns:xsi": "http://www.w3.org/2001/XMLSchema-instance",
        "@xsi:type": "MandatSimple_Type",
        "uid": "PM740757",
        "acteurRef": "PA721062",
        "legislature": "15",
        "typeOrgane": "ORGEXTPARL",
        "dateDebut": "2017-10-23T02:00:00.000+02:00",
        "datePublication": "2017-10-24T02:00:00.000+02:00",
        "dateFin": null,
        "preseance": "30",
        "nominPrincipale": "1",
        "infosQualite": {
          "codeQualite": "Suppléant",
          "libQualite": "Membre suppléant",
          "libQualiteSex": "Membre suppléant"
        },
        "organes": {
          "organeRef": "PO425985"
        }
      },
      {
        "@xmlns:xsi": "http://www.w3.org/2001/XMLSchema-instance",
        "@xsi:type": "MandatSimple_Type",
        "uid": "PM724620",
        "acteurRef": "PA721062",
        "legislature": "15",
        "typeOrgane": "GP",
        "dateDebut": "2017-06-21T02:00:00.000+02:00",
        "datePublication": null,
        "dateFin": "2017-06-26T02:00:00.000+02:00",
        "preseance": "28",
        "nominPrincipale": "1",
        "infosQualite": {
          "codeQualite": "Député non-inscrit",
          "libQualite": "Député non-inscrit",
          "libQualiteSex": "Député non-inscrit"
        },
        "organes": {
          "organeRef": "PO723569"
        }
      },
      {
        "@xmlns:xsi": "http://www.w3.org/2001/XMLSchema-instance",
        "@xsi:type": "MandatSimple_Type",
        "uid": "PM754903",
        "acteurRef": "PA721062",
        "legislature": "15",
        "typeOrgane": "GE",
        "dateDebut": "2018-03-30T02:00:00.000+02:00",
        "datePublication": null,
        "dateFin": null,
        "preseance": "20",
        "nominPrincipale": "0",
        "infosQualite": {
          "codeQualite": "Membre",
          "libQualite": "Membre",
          "libQualiteSex": "Membre"
        },
        "organes": {
          "organeRef": "PO746827"
        }
      },
      {
        "@xmlns:xsi": "http://www.w3.org/2001/XMLSchema-instance",
        "@xsi:type": "MandatSimple_Type",
        "uid": "PM755423",
        "acteurRef": "PA721062",
        "legislature": "15",
        "typeOrgane": "GE",
        "dateDebut": "2018-04-12T02:00:00.000+02:00",
        "datePublication": null,
        "dateFin": null,
        "preseance": "20",
        "nominPrincipale": "1",
        "infosQualite": {
          "codeQualite": "Membre",
          "libQualite": "Membre",
          "libQualiteSex": "Membre"
        },
        "organes": {
          "organeRef": "PO746634"
        }
      },
      {
        "@xmlns:xsi": "http://www.w3.org/2001/XMLSchema-instance",
        "@xsi:type": "MandatSimple_Type",
        "uid": "PM754909",
        "acteurRef": "PA721062",
        "legislature": "15",
        "typeOrgane": "GE",
        "dateDebut": "2018-03-30T02:00:00.000+02:00",
        "datePublication": null,
        "dateFin": null,
        "preseance": "1",
        "nominPrincipale": "1",
        "infosQualite": {
          "codeQualite": "Président",
          "libQualite": "Président",
          "libQualiteSex": "Président"
        },
        "organes": {
          "organeRef": "PO746827"
        }
      },
      {
        "@xmlns:xsi": "http://www.w3.org/2001/XMLSchema-instance",
        "@xsi:type": "MandatSimple_Type",
        "uid": "PM740354",
        "acteurRef": "PA721062",
        "legislature": "15",
        "typeOrgane": "GA",
        "dateDebut": "2017-10-17T02:00:00.000+02:00",
        "datePublication": null,
        "dateFin": null,
        "preseance": "20",
        "nominPrincipale": "0",
        "infosQualite": {
          "codeQualite": "Membre",
          "libQualite": "Membre",
          "libQualiteSex": "Membre"
        },
        "organes": {
          "organeRef": "PO732984"
        }
      },
      {
        "@xmlns:xsi": "http://www.w3.org/2001/XMLSchema-instance",
        "@xsi:type": "MandatSimple_Type",
        "uid": "PM740356",
        "acteurRef": "PA721062",
        "legislature": "15",
        "typeOrgane": "GA",
        "dateDebut": "2017-10-17T02:00:00.000+02:00",
        "datePublication": null,
        "dateFin": null,
        "preseance": "20",
        "nominPrincipale": "0",
        "infosQualite": {
          "codeQualite": "Membre",
          "libQualite": "Membre",
          "libQualiteSex": "Membre"
        },
        "organes": {
          "organeRef": "PO733182"
        }
      },
      {
        "@xmlns:xsi": "http://www.w3.org/2001/XMLSchema-instance",
        "@xsi:type": "MandatSimple_Type",
        "uid": "PM740353",
        "acteurRef": "PA721062",
        "legislature": "15",
        "typeOrgane": "GA",
        "dateDebut": "2017-10-17T02:00:00.000+02:00",
        "datePublication": null,
        "dateFin": null,
        "preseance": "20",
        "nominPrincipale": "1",
        "infosQualite": {
          "codeQualite": "Membre",
          "libQualite": "Membre",
          "libQualiteSex": "Membre"
        },
        "organes": {
          "organeRef": "PO732954"
        }
      },
      {
        "@xmlns:xsi": "http://www.w3.org/2001/XMLSchema-instance",
        "@xsi:type": "MandatSimple_Type",
        "uid": "PM740355",
        "acteurRef": "PA721062",
        "legislature": "15",
        "typeOrgane": "GA",
        "dateDebut": "2017-10-17T02:00:00.000+02:00",
        "datePublication": null,
        "dateFin": null,
        "preseance": "20",
        "nominPrincipale": "0",
        "infosQualite": {
          "codeQualite": "Membre",
          "libQualite": "Membre",
          "libQualiteSex": "Membre"
        },
        "organes": {
          "organeRef": "PO733112"
        }
      },
      {
        "@xmlns:xsi": "http://www.w3.org/2001/XMLSchema-instance",
        "@xsi:type": "MandatSimple_Type",
        "uid": "PM740357",
        "acteurRef": "PA721062",
        "legislature": "15",
        "typeOrgane": "GA",
        "dateDebut": "2017-10-17T02:00:00.000+02:00",
        "datePublication": null,
        "dateFin": null,
        "preseance": "20",
        "nominPrincipale": "0",
        "infosQualite": {
          "codeQualite": "Membre",
          "libQualite": "Membre",
          "libQualiteSex": "Membre"
        },
        "organes": {
          "organeRef": "PO733252"
        }
      },
      {
        "@xmlns:xsi": "http://www.w3.org/2001/XMLSchema-instance",
        "@xsi:type": "MandatSimple_Type",
        "uid": "PM744563",
        "acteurRef": "PA721062",
        "legislature": "15",
        "typeOrgane": "CMP",
        "dateDebut": "2017-11-30T01:00:00.000+01:00",
        "datePublication": "2017-12-01T01:00:00.000+01:00",
        "dateFin": "2017-12-20T01:00:00.000+01:00",
        "preseance": "28",
        "nominPrincipale": "1",
        "infosQualite": {
          "codeQualite": "Suppléant",
          "libQualite": "Membre suppléant",
          "libQualiteSex": "Membre suppléant"
        },
        "organes": {
          "organeRef": "PO739840"
        }
      },
      {
        "@xmlns:xsi": "http://www.w3.org/2001/XMLSchema-instance",
        "@xsi:type": "MandatSimple_Type",
        "uid": "PM743364",
        "acteurRef": "PA721062",
        "legislature": "15",
        "typeOrgane": "GA",
        "dateDebut": "2017-11-15T01:00:00.000+01:00",
        "datePublication": null,
        "dateFin": null,
        "preseance": "8",
        "nominPrincipale": "1",
        "infosQualite": {
          "codeQualite": "Vice-Président",
          "libQualite": "Vice-Président",
          "libQualiteSex": "Vice-Président"
        },
        "organes": {
          "organeRef": "PO732984"
        }
      },
      {
        "@xmlns:xsi": "http://www.w3.org/2001/XMLSchema-instance",
        "@xsi:type": "MandatSimple_Type",
        "uid": "PM742677",
        "acteurRef": "PA721062",
        "legislature": "15",
        "typeOrgane": "GA",
        "dateDebut": "2017-11-08T01:00:00.000+01:00",
        "datePublication": null,
        "dateFin": null,
        "preseance": "8",
        "nominPrincipale": "1",
        "infosQualite": {
          "codeQualite": "Vice-Président",
          "libQualite": "Vice-Président",
          "libQualiteSex": "Vice-Président"
        },
        "organes": {
          "organeRef": "PO733252"
        }
      },
      {
        "@xmlns:xsi": "http://www.w3.org/2001/XMLSchema-instance",
        "@xsi:type": "MandatSimple_Type",
        "uid": "PM747519",
        "acteurRef": "PA721062",
        "legislature": "15",
        "typeOrgane": "GA",
        "dateDebut": "2017-11-14T01:00:00.000+01:00",
        "datePublication": null,
        "dateFin": null,
        "preseance": "8",
        "nominPrincipale": "1",
        "infosQualite": {
          "codeQualite": "Vice-Président",
          "libQualite": "Vice-Président",
          "libQualiteSex": "Vice-Président"
        },
        "organes": {
          "organeRef": "PO733182"
        }
      },
      {
        "@xmlns:xsi": "http://www.w3.org/2001/XMLSchema-instance",
        "@xsi:type": "MandatSimple_Type",
        "uid": "PM742580",
        "acteurRef": "PA721062",
        "legislature": "15",
        "typeOrgane": "GA",
        "dateDebut": "2017-11-07T01:00:00.000+01:00",
        "datePublication": null,
        "dateFin": null,
        "preseance": "8",
        "nominPrincipale": "1",
        "infosQualite": {
          "codeQualite": "Vice-Président",
          "libQualite": "Vice-Président",
          "libQualiteSex": "Vice-Président"
        },
        "organes": {
          "organeRef": "PO733112"
        }
      },
      {
        "@xmlns:xsi": "http://www.w3.org/2001/XMLSchema-instance",
        "@xsi:type": "MandatParlementaire_type",
        "uid": "PM723158",
        "acteurRef": "PA721062",
        "legislature": "15",
        "typeOrgane": "ASSEMBLEE",
        "dateDebut": "2017-06-18T02:00:00.000+02:00",
        "datePublication": null,
        "dateFin": null,
        "preseance": "50",
        "nominPrincipale": "1",
        "infosQualite": {
          "codeQualite": "membre",
          "libQualite": "membre",
          "libQualiteSex": "membre"
        },
        "organes": {
          "organeRef": "PO717460"
        },
        "suppleants": {
          "suppleant": {
            "dateDebut": "2017-06-18T02:00:00.000+02:00",
            "dateFin": null,
            "suppleantRef": "PA721066"
          }
        },
        "chambre": null,
        "election": {
          "lieu": {
            "region": "Réunion",
            "regionType": "Dom",
            "departement": "Réunion",
            "numDepartement": "974",
            "numCirco": "5"
          },
          "causeMandat": "élections générales",
          "refCirconscription": "PO718520"
        },
        "mandature": {
          "datePriseFonction": "2017-06-21T02:00:00.000+02:00",
          "causeFin": null,
          "premiereElection": "0",
          "placeHemicycle": "619",
          "mandatRemplaceRef": null
        },
        "collaborateurs": {
          "collaborateur": [
            {
              "qualite": "M.",
              "prenom": "Alexandre",
              "nom": "Cailleteau",
              "dateDebut": null,
              "dateFin": null
            },
            {
              "qualite": "M.",
              "prenom": "Eric",
              "nom": "Parlier",
              "dateDebut": null,
              "dateFin": null
            },
            {
              "qualite": "Mme",
              "prenom": "Vanessa",
              "nom": "Balbine",
              "dateDebut": null,
              "dateFin": null
            },
            {
              "qualite": "M.",
              "prenom": "Jasmin",
              "nom": "Moutoussamy",
              "dateDebut": null,
              "dateFin": null
            }
          ]
        }
      }
    ]
  }
}