{
  "@xmlns": "http://schemas.assemblee-nationale.fr/referentiel",
  "uid": {
    "@xmlns:xsi": "http://www.w3.org/2001/XMLSchema-instance",
    "@xsi:type": "IdActeur_type",
    "#text": "PA1660"
  },
  "etatCivil": {
    "ident": {
      "civ": "M.",
      "prenom": "Michel",
      "nom": "Houel",
      "alpha": "HOUEL MICHEL",
      "trigramme": {
        "@xmlns:xsi": "http://www.w3.org/2001/XMLSchema-instance",
        "@xsi:nil": "true"
      }
    },
    "infoNaissance": {
      "dateNais": "1942-11-08T01:00:00.000+01:00",
      "villeNais": {
        "@xmlns:xsi": "http://www.w3.org/2001/XMLSchema-instance",
        "@xsi:nil": "true"
      },
      "depNais": {
        "@xmlns:xsi": "http://www.w3.org/2001/XMLSchema-instance",
        "@xsi:nil": "true"
      },
      "paysNais": {
        "@xmlns:xsi": "http://www.w3.org/2001/XMLSchema-instance",
        "@xsi:nil": "true"
      }
    },
    "dateDeces": "2016-11-30T01:00:00.000+01:00"
  },
  "profession": {
    "libelleCourant": {
      "@xmlns:xsi": "http://www.w3.org/2001/XMLSchema-instance",
      "@xsi:nil": "true"
    },
    "socProcINSEE": {
      "catSocPro": {
        "@xmlns:xsi": "http://www.w3.org/2001/XMLSchema-instance",
        "@xsi:nil": "true"
      },
      "famSocPro": {
        "@xmlns:xsi": "http://www.w3.org/2001/XMLSchema-instance",
        "@xsi:nil": "true"
      }
    }
  },
  "uri_hatvp": {
    "@xmlns:xsi": "http://www.w3.org/2001/XMLSchema-instance",
    "@xsi:nil": "true"
  },
  "adresses": {
    "adresse": {
      "@xmlns:xsi": "http://www.w3.org/2001/XMLSchema-instance",
      "@xsi:type": "AdresseSiteWeb_Type",
      "uid": "AD317052",
      "type": "23",
      "typeLibelle": "Url sénateur",
      "poids": null,
      "adresseDeRattachement": null,
      "valElec": "https://www.senat.fr/senateur/houel_michel04048j.html"
    }
  },
  "mandats": {
    "mandat": [
      {
        "@xmlns:xsi": "http://www.w3.org/2001/XMLSchema-instance",
        "@xsi:type": "MandatSimple_Type",
        "uid": "PM419100",
        "acteurRef": "PA1660",
        "legislature": null,
        "typeOrgane": "COMSPSENAT",
        "dateDebut": "2009-04-29T02:00:00.000+02:00",
        "datePublication": null,
        "dateFin": "2009-06-30T02:00:00.000+02:00",
        "preseance": null,
        "nominPrincipale": "1",
        "infosQualite": {
          "codeQualite": null,
          "libQualite": "Membre",
          "libQualiteSex": "Membre"
        },
        "organes": {
          "organeRef": "PO419077"
        }
      },
      {
        "@xmlns:xsi": "http://www.w3.org/2001/XMLSchema-instance",
        "@xsi:type": "MandatSimple_Type",
        "uid": "PM422596",
        "acteurRef": "PA1660",
        "legislature": null,
        "typeOrgane": "COMSPSENAT",
        "dateDebut": "2009-12-09T01:00:00.000+01:00",
        "datePublication": null,
        "dateFin": "2010-04-08T02:00:00.000+02:00",
        "preseance": null,
        "nominPrincipale": "1",
        "infosQualite": {
          "codeQualite": null,
          "libQualite": "Membre",
          "libQualiteSex": "Membre"
        },
        "organes": {
          "organeRef": "PO422577"
        }
      },
      {
        "@xmlns:xsi": "http://www.w3.org/2001/XMLSchema-instance",
        "@xsi:type": "MandatSimple_Type",
        "uid": "PM516791",
        "acteurRef": "PA1660",
        "legislature": null,
        "typeOrgane": "COMSENAT",
        "dateDebut": "2012-02-21T01:00:00.000+01:00",
        "datePublication": null,
        "dateFin": "2016-11-30T01:00:00.000+01:00",
        "preseance": "10",
        "nominPrincipale": "1",
        "infosQualite": {
          "codeQualite": "Membre",
          "libQualite": "Membre",
          "libQualiteSex": "Membre"
        },
        "organes": {
          "organeRef": "PO516753"
        }
      },
      {
        "@xmlns:xsi": "http://www.w3.org/2001/XMLSchema-instance",
        "@xsi:type": "MandatSimple_Type",
        "uid": "PM308750",
        "acteurRef": "PA1660",
        "legislature": null,
        "typeOrgane": "COMSENAT",
        "dateDebut": "2004-10-06T02:00:00.000+02:00",
        "datePublication": null,
        "dateFin": "2012-02-20T01:00:00.000+01:00",
        "preseance": "10",
        "nominPrincipale": "1",
        "infosQualite": {
          "codeQualite": "Membre",
          "libQualite": "Membre",
          "libQualiteSex": "Membre"
        },
        "organes": {
          "organeRef": "PO211492"
        }
      },
      {
        "@xmlns:xsi": "http://www.w3.org/2001/XMLSchema-instance",
        "@xsi:type": "MandatSimple_Type",
        "uid": "PM304312",
        "acteurRef": "PA1660",
        "legislature": null,
        "typeOrgane": "GROUPESENAT",
        "dateDebut": "2004-10-05T02:00:00.000+02:00",
        "datePublication": "2004-10-07T02:00:00.000+02:00",
        "dateFin": "2016-11-30T01:00:00.000+01:00",
        "preseance": "4",
        "nominPrincipale": "1",
        "infosQualite": {
          "codeQualite": "Membre",
          "libQualite": "Membre",
          "libQualiteSex": "Membre"
        },
        "organes": {
          "organeRef": "PO286005"
        }
      },
      {
        "@xmlns:xsi": "http://www.w3.org/2001/XMLSchema-instance",
        "@xsi:type": "MandatSimple_Type",
        "uid": "PM428954",
        "acteurRef": "PA1660",
        "legislature": null,
        "typeOrgane": "CMP",
        "dateDebut": "2011-06-15T02:00:00.000+02:00",
        "datePublication": "2011-06-16T02:00:00.000+02:00",
        "dateFin": "2011-07-25T02:00:00.000+02:00",
        "preseance": "16",
        "nominPrincipale": "1",
        "infosQualite": {
          "codeQualite": "Rapporteur",
          "libQualite": "Rapporteur",
          "libQualiteSex": "Rapporteur"
        },
        "organes": {
          "organeRef": "PO428793"
        }
      },
      {
        "@xmlns:xsi": "http://www.w3.org/2001/XMLSchema-instance",
        "@xsi:type": "MandatSimple_Type",
        "uid": "PM428848",
        "acteurRef": "PA1660",
        "legislature": null,
        "typeOrgane": "CMP",
        "dateDebut": "2011-06-14T02:00:00.000+02:00",
        "datePublication": "2011-06-15T02:00:00.000+02:00",
        "dateFin": "2011-07-25T02:00:00.000+02:00",
        "preseance": "20",
        "nominPrincipale": "1",
        "infosQualite": {
          "codeQualite": "Titulaire",
          "libQualite": "Membre titulaire",
          "libQualiteSex": "Membre titulaire"
        },
        "organes": {
          "organeRef": "PO428793"
        }
      },
      {
        "@xmlns:xsi": "http://www.w3.org/2001/XMLSchema-instance",
        "@xsi:type": "MandatSimple_Type",
        "uid": "PM711519",
        "acteurRef": "PA1660",
        "legislature": null,
        "typeOrgane": "CMP",
        "dateDebut": "2016-02-10T01:00:00.000+01:00",
        "datePublication": "2016-02-11T01:00:00.000+01:00",
        "dateFin": "2016-02-11T01:00:00.000+01:00",
        "preseance": "16",
        "nominPrincipale": "1",
        "infosQualite": {
          "codeQualite": "Rapporteur",
          "libQualite": "Rapporteur",
          "libQualiteSex": "Rapporteur"
        },
        "organes": {
          "organeRef": "PO711338"
        }
      },
      {
        "@xmlns:xsi": "http://www.w3.org/2001/XMLSchema-instance",
        "@xsi:type": "MandatSimple_Type",
        "uid": "PM423776",
        "acteurRef": "PA1660",
        "legislature": null,
        "typeOrgane": "CMP",
        "dateDebut": "2010-04-26T02:00:00.000+02:00",
        "datePublication": "2010-04-27T02:00:00.000+02:00",
        "dateFin": "2010-06-16T02:00:00.000+02:00",
        "preseance": "20",
        "nominPrincipale": "1",
        "infosQualite": {
          "codeQualite": "Titulaire",
          "libQualite": "Membre titulaire",
          "libQualiteSex": "Membre titulaire"
        },
        "organes": {
          "organeRef": "PO423616"
        }
      },
      {
        "@xmlns:xsi": "http://www.w3.org/2001/XMLSchema-instance",
        "@xsi:type": "MandatSimple_Type",
        "uid": "PM711462",
        "acteurRef": "PA1660",
        "legislature": null,
        "typeOrgane": "CMP",
        "dateDebut": "2016-02-03T01:00:00.000+01:00",
        "datePublication": "2016-02-06T01:00:00.000+01:00",
        "dateFin": "2016-02-11T01:00:00.000+01:00",
        "preseance": "20",
        "nominPrincipale": "1",
        "infosQualite": {
          "codeQualite": "Titulaire",
          "libQualite": "Membre titulaire",
          "libQualiteSex": "Membre titulaire"
        },
        "organes": {
          "organeRef": "PO711338"
        }
      },
      {
        "@xmlns:xsi": "http://www.w3.org/2001/XMLSchema-instance",
        "@xsi:type": "MandatSimple_Type",
        "uid": "PM687272",
        "acteurRef": "PA1660",
        "legislature": null,
        "typeOrgane": "CMP",
        "dateDebut": "2012-12-18T01:00:00.000+01:00",
        "datePublication": "2012-12-19T01:00:00.000+01:00",
        "dateFin": "2012-12-19T01:00:00.000+01:00",
        "preseance": "28",
        "nominPrincipale": "1",
        "infosQualite": {
          "codeQualite": "Suppléant",
          "libQualite": "Membre suppléant",
          "libQualiteSex": "Membre suppléant"
        },
        "organes": {
          "organeRef": "PO687144"
        }
      },
      {
        "@xmlns:xsi": "http://www.w3.org/2001/XMLSchema-instance",
        "@xsi:type": "MandatParlementaire_type",
        "uid": "PM303925",
        "acteurRef": "PA1660",
        "legislature": null,
        "typeOrgane": "SENAT",
        "dateDebut": "2004-10-01T02:00:00.000+02:00",
        "datePublication": "2004-10-02T02:00:00.000+02:00",
        "dateFin": "2011-09-30T02:00:00.000+02:00",
        "preseance": "20",
        "nominPrincipale": "1",
        "infosQualite": {
          "codeQualite": "Sénateur",
          "libQualite": "SENATEUR",
          "libQualiteSex": "SENATEUR"
        },
        "organes": {
          "organeRef": "PO78718"
        },
        "suppleants": null,
        "chambre": null,
        "election": {
          "lieu": {
            "region": null,
            "regionType": null,
            "departement": null,
            "numDepartement": "77",
            "numCirco": null
          },
          "causeMandat": null
        },
        "mandature": {
          "datePriseFonction": null,
          "causeFin": null,
          "premiereElection": "0",
          "placeHemicycle": null,
          "mandatRemplaceRef": null
        },
        "collaborateurs": null
      },
      {
        "@xmlns:xsi": "http://www.w3.org/2001/XMLSchema-instance",
        "@xsi:type": "MandatParlementaire_type",
        "uid": "PM430033",
        "acteurRef": "PA1660",
        "legislature": null,
        "typeOrgane": "SENAT",
        "dateDebut": "2011-10-01T02:00:00.000+02:00",
        "datePublication": null,
        "dateFin": "2016-11-30T01:00:00.000+01:00",
        "preseance": "20",
        "nominPrincipale": "1",
        "infosQualite": {
          "codeQualite": "Sénateur",
          "libQualite": "SENATEUR",
          "libQualiteSex": "SENATEUR"
        },
        "organes": {
          "organeRef": "PO78718"
        },
        "suppleants": null,
        "chambre": null,
        "election": {
          "lieu": {
            "region": null,
            "regionType": null,
            "departement": null,
            "numDepartement": "77",
            "numCirco": null
          },
          "causeMandat": null
        },
        "mandature": {
          "datePriseFonction": null,
          "causeFin": null,
          "premiereElection": "0",
          "placeHemicycle": null,
          "mandatRemplaceRef": null
        },
        "collaborateurs": null
      },
      {
        "@xmlns:xsi": "http://www.w3.org/2001/XMLSchema-instance",
        "@xsi:type": "MandatSimple_Type",
        "uid": "PM678903",
        "acteurRef": "PA1660",
        "legislature": null,
        "typeOrgane": "CMP",
        "dateDebut": "2012-10-02T02:00:00.000+02:00",
        "datePublication": "2012-10-03T02:00:00.000+02:00",
        "dateFin": "2012-10-15T02:00:00.000+02:00",
        "preseance": "28",
        "nominPrincipale": "1",
        "infosQualite": {
          "codeQualite": "Suppléant",
          "libQualite": "Membre suppléant",
          "libQualiteSex": "Membre suppléant"
        },
        "organes": {
          "organeRef": "PO678619"
        }
      },
      {
        "@xmlns:xsi": "http://www.w3.org/2001/XMLSchema-instance",
        "@xsi:type": "MandatSimple_Type",
        "uid": "PM521407",
        "acteurRef": "PA1660",
        "legislature": null,
        "typeOrgane": "CMP",
        "dateDebut": "2012-03-01T01:00:00.000+01:00",
        "datePublication": "2012-03-02T01:00:00.000+01:00",
        "dateFin": "2012-03-06T01:00:00.000+01:00",
        "preseance": "28",
        "nominPrincipale": "1",
        "infosQualite": {
          "codeQualite": "Suppléant",
          "libQualite": "Membre suppléant",
          "libQualiteSex": "Membre suppléant"
        },
        "organes": {
          "organeRef": "PO521392"
        }
      },
      {
        "@xmlns:xsi": "http://www.w3.org/2001/XMLSchema-instance",
        "@xsi:type": "MandatSimple_Type",
        "uid": "PM418304",
        "acteurRef": "PA1660",
        "legislature": null,
        "typeOrgane": "CMP",
        "dateDebut": "2009-01-27T01:00:00.000+01:00",
        "datePublication": "2009-01-28T01:00:00.000+01:00",
        "dateFin": "2009-02-10T01:00:00.000+01:00",
        "preseance": "28",
        "nominPrincipale": "1",
        "infosQualite": {
          "codeQualite": "Suppléant",
          "libQualite": "Membre suppléant",
          "libQualiteSex": "Membre suppléant"
        },
        "organes": {
          "organeRef": "PO418239"
        }
      },
      {
        "@xmlns:xsi": "http://www.w3.org/2001/XMLSchema-instance",
        "@xsi:type": "MandatSimple_Type",
        "uid": "PM702665",
        "acteurRef": "PA1660",
        "legislature": null,
        "typeOrgane": "CMP",
        "dateDebut": "2014-07-22T02:00:00.000+02:00",
        "datePublication": "2014-07-23T02:00:00.000+02:00",
        "dateFin": "2014-09-11T02:00:00.000+02:00",
        "preseance": "28",
        "nominPrincipale": "1",
        "infosQualite": {
          "codeQualite": "Suppléant",
          "libQualite": "Membre suppléant",
          "libQualiteSex": "Membre suppléant"
        },
        "organes": {
          "organeRef": "PO702646"
        }
      },
      {
        "@xmlns:xsi": "http://www.w3.org/2001/XMLSchema-instance",
        "@xsi:type": "MandatSimple_Type",
        "uid": "PM683281",
        "acteurRef": "PA1660",
        "legislature": null,
        "typeOrgane": "CMP",
        "dateDebut": "2012-10-23T02:00:00.000+02:00",
        "datePublication": "2012-10-24T02:00:00.000+02:00",
        "dateFin": "2012-11-15T01:00:00.000+01:00",
        "preseance": "28",
        "nominPrincipale": "1",
        "infosQualite": {
          "codeQualite": "Suppléant",
          "libQualite": "Membre suppléant",
          "libQualiteSex": "Membre suppléant"
        },
        "organes": {
          "organeRef": "PO679789"
        }
      },
      {
        "@xmlns:xsi": "http://www.w3.org/2001/XMLSchema-instance",
        "@xsi:type": "MandatSimple_Type",
        "uid": "PM701344",
        "acteurRef": "PA1660",
        "legislature": null,
        "typeOrgane": "CMP",
        "dateDebut": "2014-05-14T02:00:00.000+02:00",
        "datePublication": "2014-05-15T02:00:00.000+02:00",
        "dateFin": "2014-06-10T02:00:00.000+02:00",
        "preseance": "28",
        "nominPrincipale": "1",
        "infosQualite": {
          "codeQualite": "Suppléant",
          "libQualite": "Membre suppléant",
          "libQualiteSex": "Membre suppléant"
        },
        "organes": {
          "organeRef": "PO700965"
        }
      }
    ]
  }
}