{
  "@xmlns": "http://schemas.assemblee-nationale.fr/referentiel",
  "uid": {
    "@xmlns:xsi": "http://www.w3.org/2001/XMLSchema-instance",
    "@xsi:type": "IdActeur_type",
    "#text": "PA2860"
  },
  "etatCivil": {
    "ident": {
      "civ": "M.",
      "prenom": "Jacques",
      "nom": "Valade",
      "alpha": "VALADE",
      "trigramme": {
        "@xmlns:xsi": "http://www.w3.org/2001/XMLSchema-instance",
        "@xsi:nil": "true"
      }
    },
    "infoNaissance": {
      "dateNais": "1930-05-04T01:00:00.000+01:00",
      "villeNais": {
        "@xmlns:xsi": "http://www.w3.org/2001/XMLSchema-instance",
        "@xsi:nil": "true"
      },
      "depNais": {
        "@xmlns:xsi": "http://www.w3.org/2001/XMLSchema-instance",
        "@xsi:nil": "true"
      },
      "paysNais": {
        "@xmlns:xsi": "http://www.w3.org/2001/XMLSchema-instance",
        "@xsi:nil": "true"
      }
    },
    "dateDeces": {
      "@xmlns:xsi": "http://www.w3.org/2001/XMLSchema-instance",
      "@xsi:nil": "true"
    }
  },
  "profession": {
    "libelleCourant": {
      "@xmlns:xsi": "http://www.w3.org/2001/XMLSchema-instance",
      "@xsi:nil": "true"
    },
    "socProcINSEE": {
      "catSocPro": {
        "@xmlns:xsi": "http://www.w3.org/2001/XMLSchema-instance",
        "@xsi:nil": "true"
      },
      "famSocPro": {
        "@xmlns:xsi": "http://www.w3.org/2001/XMLSchema-instance",
        "@xsi:nil": "true"
      }
    }
  },
  "uri_hatvp": {
    "@xmlns:xsi": "http://www.w3.org/2001/XMLSchema-instance",
    "@xsi:nil": "true"
  },
  "adresses": {
    "adresse": {
      "@xmlns:xsi": "http://www.w3.org/2001/XMLSchema-instance",
      "@xsi:type": "AdresseSiteWeb_Type",
      "uid": "AD317355",
      "type": "23",
      "typeLibelle": "Url sénateur",
      "poids": null,
      "adresseDeRattachement": null,
      "valElec": "https://www.senat.fr/senateur/valade_jacques80046h.html"
    }
  },
  "mandats": {
    "mandat": [
      {
        "@xmlns:xsi": "http://www.w3.org/2001/XMLSchema-instance",
        "@xsi:type": "MandatSimple_Type",
        "uid": "PM320147",
        "acteurRef": "PA2860",
        "legislature": null,
        "typeOrgane": "COMSENAT",
        "dateDebut": "2004-10-07T02:00:00.000+02:00",
        "datePublication": null,
        "dateFin": "2008-09-30T02:00:00.000+02:00",
        "preseance": null,
        "nominPrincipale": "1",
        "infosQualite": {
          "codeQualite": null,
          "libQualite": "Président",
          "libQualiteSex": "Président"
        },
        "organes": {
          "organeRef": "PO211490"
        }
      },
      {
        "@xmlns:xsi": "http://www.w3.org/2001/XMLSchema-instance",
        "@xsi:type": "MandatSimple_Type",
        "uid": "PM230064",
        "acteurRef": "PA2860",
        "legislature": null,
        "typeOrgane": "API",
        "dateDebut": "2002-01-20T01:00:00.000+01:00",
        "datePublication": null,
        "dateFin": "2008-09-30T02:00:00.000+02:00",
        "preseance": "20",
        "nominPrincipale": "1",
        "infosQualite": {
          "codeQualite": "Membre",
          "libQualite": "Membre",
          "libQualiteSex": "Membre"
        },
        "organes": {
          "organeRef": "PO201115"
        }
      },
      {
        "@xmlns:xsi": "http://www.w3.org/2001/XMLSchema-instance",
        "@xsi:type": "MandatSimple_Type",
        "uid": "PM286579",
        "acteurRef": "PA2860",
        "legislature": null,
        "typeOrgane": "GROUPESENAT",
        "dateDebut": "2002-12-11T01:00:00.000+01:00",
        "datePublication": "2002-12-11T01:00:00.000+01:00",
        "dateFin": "2008-09-30T02:00:00.000+02:00",
        "preseance": "4",
        "nominPrincipale": "1",
        "infosQualite": {
          "codeQualite": "Membre",
          "libQualite": "Membre",
          "libQualiteSex": "Membre"
        },
        "organes": {
          "organeRef": "PO286005"
        }
      },
      {
        "@xmlns:xsi": "http://www.w3.org/2001/XMLSchema-instance",
        "@xsi:type": "MandatSimple_Type",
        "uid": "PM394116",
        "acteurRef": "PA2860",
        "legislature": null,
        "typeOrgane": "CMP",
        "dateDebut": "2007-07-31T02:00:00.000+02:00",
        "datePublication": "2007-08-01T02:00:00.000+02:00",
        "dateFin": "2007-07-31T02:00:00.000+02:00",
        "preseance": "1",
        "nominPrincipale": "1",
        "infosQualite": {
          "codeQualite": "Président",
          "libQualite": "Président",
          "libQualiteSex": "Président"
        },
        "organes": {
          "organeRef": "PO393935"
        }
      },
      {
        "@xmlns:xsi": "http://www.w3.org/2001/XMLSchema-instance",
        "@xsi:type": "MandatSimple_Type",
        "uid": "PM414877",
        "acteurRef": "PA2860",
        "legislature": null,
        "typeOrgane": "CMP",
        "dateDebut": "2008-07-18T02:00:00.000+02:00",
        "datePublication": "2008-07-19T02:00:00.000+02:00",
        "dateFin": "2008-07-23T02:00:00.000+02:00",
        "preseance": "20",
        "nominPrincipale": "1",
        "infosQualite": {
          "codeQualite": "Titulaire",
          "libQualite": "Membre titulaire",
          "libQualiteSex": "Membre titulaire"
        },
        "organes": {
          "organeRef": "PO414843"
        }
      },
      {
        "@xmlns:xsi": "http://www.w3.org/2001/XMLSchema-instance",
        "@xsi:type": "MandatSimple_Type",
        "uid": "PM413619",
        "acteurRef": "PA2860",
        "legislature": null,
        "typeOrgane": "CMP",
        "dateDebut": "2008-06-03T02:00:00.000+02:00",
        "datePublication": "2008-06-05T02:00:00.000+02:00",
        "dateFin": "2008-06-19T02:00:00.000+02:00",
        "preseance": "20",
        "nominPrincipale": "1",
        "infosQualite": {
          "codeQualite": "Titulaire",
          "libQualite": "Membre titulaire",
          "libQualiteSex": "Membre titulaire"
        },
        "organes": {
          "organeRef": "PO413502"
        }
      },
      {
        "@xmlns:xsi": "http://www.w3.org/2001/XMLSchema-instance",
        "@xsi:type": "MandatSimple_Type",
        "uid": "PM393964",
        "acteurRef": "PA2860",
        "legislature": null,
        "typeOrgane": "CMP",
        "dateDebut": "2007-07-27T02:00:00.000+02:00",
        "datePublication": "2007-07-28T02:00:00.000+02:00",
        "dateFin": "2007-07-31T02:00:00.000+02:00",
        "preseance": "20",
        "nominPrincipale": "1",
        "infosQualite": {
          "codeQualite": "Titulaire",
          "libQualite": "Membre titulaire",
          "libQualiteSex": "Membre titulaire"
        },
        "organes": {
          "organeRef": "PO393935"
        }
      },
      {
        "@xmlns:xsi": "http://www.w3.org/2001/XMLSchema-instance",
        "@xsi:type": "MandatSimple_Type",
        "uid": "PM415033",
        "acteurRef": "PA2860",
        "legislature": null,
        "typeOrgane": "CMP",
        "dateDebut": "2008-07-22T02:00:00.000+02:00",
        "datePublication": "2008-07-23T02:00:00.000+02:00",
        "dateFin": "2008-07-23T02:00:00.000+02:00",
        "preseance": "1",
        "nominPrincipale": "1",
        "infosQualite": {
          "codeQualite": "Président",
          "libQualite": "Président",
          "libQualiteSex": "Président"
        },
        "organes": {
          "organeRef": "PO414843"
        }
      },
      {
        "@xmlns:xsi": "http://www.w3.org/2001/XMLSchema-instance",
        "@xsi:type": "MandatParlementaire_type",
        "uid": "PM89480",
        "acteurRef": "PA2860",
        "legislature": null,
        "typeOrgane": "SENAT",
        "dateDebut": "1998-10-01T02:00:00.000+02:00",
        "datePublication": "1998-10-02T02:00:00.000+02:00",
        "dateFin": "2008-09-30T02:00:00.000+02:00",
        "preseance": "20",
        "nominPrincipale": "1",
        "infosQualite": {
          "codeQualite": "Sénateur",
          "libQualite": "SENATEUR",
          "libQualiteSex": "SENATEUR"
        },
        "organes": {
          "organeRef": "PO78718"
        },
        "suppleants": null,
        "chambre": null,
        "election": {
          "lieu": {
            "region": null,
            "regionType": null,
            "departement": null,
            "numDepartement": "33",
            "numCirco": null
          },
          "causeMandat": null
        },
        "mandature": {
          "datePriseFonction": null,
          "causeFin": null,
          "premiereElection": "0",
          "placeHemicycle": null,
          "mandatRemplaceRef": null
        },
        "collaborateurs": null
      },
      {
        "@xmlns:xsi": "http://www.w3.org/2001/XMLSchema-instance",
        "@xsi:type": "MandatSimple_Type",
        "uid": "PM413675",
        "acteurRef": "PA2860",
        "legislature": null,
        "typeOrgane": "CMP",
        "dateDebut": "2008-06-10T02:00:00.000+02:00",
        "datePublication": "2008-06-10T02:00:00.000+02:00",
        "dateFin": "2008-06-19T02:00:00.000+02:00",
        "preseance": "4",
        "nominPrincipale": "1",
        "infosQualite": {
          "codeQualite": "Vice-Président",
          "libQualite": "Vice-Président",
          "libQualiteSex": "Vice-Président"
        },
        "organes": {
          "organeRef": "PO413502"
        }
      }
    ]
  }
}