{
  "@xmlns": "http://schemas.assemblee-nationale.fr/referentiel",
  "uid": {
    "@xmlns:xsi": "http://www.w3.org/2001/XMLSchema-instance",
    "@xsi:type": "IdActeur_type",
    "#text": "PA719118"
  },
  "etatCivil": {
    "ident": {
      "civ": "M.",
      "prenom": "François",
      "nom": "Cormier-Bouligeon",
      "alpha": "CormierBouligeon",
      "trigramme": "FCR"
    },
    "infoNaissance": {
      "dateNais": "1972-11-19T01:00:00.000+01:00",
      "villeNais": "Bourges",
      "depNais": "Cher",
      "paysNais": "France"
    },
    "dateDeces": {
      "@xmlns:xsi": "http://www.w3.org/2001/XMLSchema-instance",
      "@xsi:nil": "true"
    }
  },
  "profession": {
    "libelleCourant": "Conseiller ministériel",
    "socProcINSEE": {
      "catSocPro": "Cadres de la fonction publique, professions intellectuelles et  artistiques",
      "famSocPro": "Cadres et professions intellectuelles supérieures"
    }
  },
  "uri_hatvp": "https://www.hatvp.fr/pages_nominatives/cormier-bouligeon-francois",
  "adresses": {
    "adresse": [
      {
        "@xmlns:xsi": "http://www.w3.org/2001/XMLSchema-instance",
        "@xsi:type": "AdressePostale_Type",
        "uid": "AD719120",
        "type": "0",
        "typeLibelle": "Adresse officielle",
        "poids": "1",
        "adresseDeRattachement": null,
        "intitule": "Assemblée nationale,",
        "numeroRue": "126",
        "nomRue": "Rue de l'Université,",
        "complementAdresse": null,
        "codePostal": "75355",
        "ville": "Paris 07 SP"
      },
      {
        "@xmlns:xsi": "http://www.w3.org/2001/XMLSchema-instance",
        "@xsi:type": "AdresseSiteWeb_Type",
        "uid": "AD726374",
        "type": "25",
        "typeLibelle": "Facebook",
        "poids": null,
        "adresseDeRattachement": null,
        "valElec": "francoiscormierbouligeon2017"
      },
      {
        "@xmlns:xsi": "http://www.w3.org/2001/XMLSchema-instance",
        "@xsi:type": "AdresseMail_Type",
        "uid": "AD728006",
        "type": "15",
        "typeLibelle": "Mèl",
        "poids": null,
        "adresseDeRattachement": null,
        "valElec": "francois.cormier-bouligeon@assemblee-nationale.fr"
      }
    ]
  },
  "mandats": {
    "mandat": [
      {
        "@xmlns:xsi": "http://www.w3.org/2001/XMLSchema-instance",
        "@xsi:type": "MandatAvecSuppleant_Type",
        "uid": "PM732663",
        "acteurRef": "PA719118",
        "legislature": "15",
        "typeOrgane": "COMNL",
        "dateDebut": "2017-07-12T02:00:00.000+02:00",
        "datePublication": "2017-07-12T02:00:00.000+02:00",
        "dateFin": null,
        "preseance": "24",
        "nominPrincipale": "1",
        "infosQualite": {
          "codeQualite": "Titulaire",
          "libQualite": "Membre titulaire",
          "libQualiteSex": "Membre titulaire"
        },
        "organes": {
          "organeRef": "PO271850"
        },
        "suppleants": null
      },
      {
        "@xmlns:xsi": "http://www.w3.org/2001/XMLSchema-instance",
        "@xsi:type": "MandatSimple_Type",
        "uid": "PM744975",
        "acteurRef": "PA719118",
        "legislature": null,
        "typeOrgane": "PARPOL",
        "dateDebut": "2017-12-01T01:00:00.000+01:00",
        "datePublication": null,
        "dateFin": "2018-11-30T01:00:00.000+01:00",
        "preseance": "5",
        "nominPrincipale": "1",
        "infosQualite": {
          "codeQualite": "Membre",
          "libQualite": "Membre",
          "libQualiteSex": "Membre"
        },
        "organes": {
          "organeRef": "PO744854"
        }
      },
      {
        "@xmlns:xsi": "http://www.w3.org/2001/XMLSchema-instance",
        "@xsi:type": "MandatMission_Type",
        "uid": "PM741942",
        "acteurRef": "PA719118",
        "legislature": "15",
        "typeOrgane": "MISINFO",
        "dateDebut": "2017-09-27T02:00:00.000+02:00",
        "datePublication": null,
        "dateFin": null,
        "preseance": "10",
        "nominPrincipale": "1",
        "infosQualite": {
          "codeQualite": "Membre",
          "libQualite": "Membre",
          "libQualiteSex": "Membre"
        },
        "organes": {
          "organeRef": "PO741916"
        },
        "libelle": null,
        "missionSuivanteRef": null,
        "missionPrecedenteRef": null
      },
      {
        "@xmlns:xsi": "http://www.w3.org/2001/XMLSchema-instance",
        "@xsi:type": "MandatSimple_Type",
        "uid": "PM761451",
        "acteurRef": "PA719118",
        "legislature": null,
        "typeOrgane": "PARPOL",
        "dateDebut": "2018-12-01T01:00:00.000+01:00",
        "datePublication": null,
        "dateFin": null,
        "preseance": "5",
        "nominPrincipale": "1",
        "infosQualite": {
          "codeQualite": "Membre",
          "libQualite": "Membre",
          "libQualiteSex": "Membre"
        },
        "organes": {
          "organeRef": "PO761294"
        }
      },
      {
        "@xmlns:xsi": "http://www.w3.org/2001/XMLSchema-instance",
        "@xsi:type": "MandatSimple_Type",
        "uid": "PM743726",
        "acteurRef": "PA719118",
        "legislature": "15",
        "typeOrgane": "ORGEXTPARL",
        "dateDebut": "2017-11-17T01:00:00.000+01:00",
        "datePublication": "2017-11-18T01:00:00.000+01:00",
        "dateFin": null,
        "preseance": "20",
        "nominPrincipale": "1",
        "infosQualite": {
          "codeQualite": "Titulaire",
          "libQualite": "Membre titulaire",
          "libQualiteSex": "Membre titulaire"
        },
        "organes": {
          "organeRef": "PO424150"
        }
      },
      {
        "@xmlns:xsi": "http://www.w3.org/2001/XMLSchema-instance",
        "@xsi:type": "MandatSimple_Type",
        "uid": "PM743760",
        "acteurRef": "PA719118",
        "legislature": "15",
        "typeOrgane": "ORGEXTPARL",
        "dateDebut": "2017-11-09T01:00:00.000+01:00",
        "datePublication": "2017-11-10T01:00:00.000+01:00",
        "dateFin": null,
        "preseance": "20",
        "nominPrincipale": "1",
        "infosQualite": {
          "codeQualite": "Titulaire",
          "libQualite": "Membre titulaire",
          "libQualiteSex": "Membre titulaire"
        },
        "organes": {
          "organeRef": "PO696474"
        }
      },
      {
        "@xmlns:xsi": "http://www.w3.org/2001/XMLSchema-instance",
        "@xsi:type": "MandatSimple_Type",
        "uid": "PM731013",
        "acteurRef": "PA719118",
        "legislature": "15",
        "typeOrgane": "GP",
        "dateDebut": "2017-06-27T02:00:00.000+02:00",
        "datePublication": "2017-06-28T02:00:00.000+02:00",
        "dateFin": null,
        "preseance": "20",
        "nominPrincipale": "1",
        "infosQualite": {
          "codeQualite": "Membre",
          "libQualite": "Membre du",
          "libQualiteSex": "Membre du"
        },
        "organes": {
          "organeRef": "PO730964"
        }
      },
      {
        "@xmlns:xsi": "http://www.w3.org/2001/XMLSchema-instance",
        "@xsi:type": "MandatMission_Type",
        "uid": "PM758820",
        "acteurRef": "PA719118",
        "legislature": "15",
        "typeOrgane": "MINISTERE",
        "dateDebut": "2018-09-05T02:00:00.000+02:00",
        "datePublication": null,
        "dateFin": "2018-10-22T02:00:00.000+02:00",
        "preseance": "1",
        "nominPrincipale": "1",
        "infosQualite": {
          "codeQualite": "en mission",
          "libQualite": "en mission",
          "libQualiteSex": "en mission"
        },
        "organes": {
          "organeRef": "PO758785"
        },
        "libelle": "La pratique sportive tout au long de la vie.",
        "missionSuivanteRef": null,
        "missionPrecedenteRef": "PM757167"
      },
      {
        "@xmlns:xsi": "http://www.w3.org/2001/XMLSchema-instance",
        "@xsi:type": "MandatMission_Type",
        "uid": "PM757167",
        "acteurRef": "PA719118",
        "legislature": "15",
        "typeOrgane": "MINISTERE",
        "dateDebut": "2018-04-23T02:00:00.000+02:00",
        "datePublication": null,
        "dateFin": "2018-09-04T02:00:00.000+02:00",
        "preseance": "1",
        "nominPrincipale": "1",
        "infosQualite": {
          "codeQualite": "en mission",
          "libQualite": "en mission",
          "libQualiteSex": "en mission"
        },
        "organes": {
          "organeRef": "PO730018"
        },
        "libelle": "La pratique sportive tout au long de la vie.",
        "missionSuivanteRef": "PM758820",
        "missionPrecedenteRef": null
      },
      {
        "@xmlns:xsi": "http://www.w3.org/2001/XMLSchema-instance",
        "@xsi:type": "MandatSimple_Type",
        "uid": "PM732132",
        "acteurRef": "PA719118",
        "legislature": "15",
        "typeOrgane": "COMPER",
        "dateDebut": "2017-06-29T02:00:00.000+02:00",
        "datePublication": "2017-06-29T02:00:00.000+02:00",
        "dateFin": null,
        "preseance": "32",
        "nominPrincipale": "1",
        "infosQualite": {
          "codeQualite": "Membre",
          "libQualite": "Membre",
          "libQualiteSex": "Membre"
        },
        "organes": {
          "organeRef": "PO419604"
        }
      },
      {
        "@xmlns:xsi": "http://www.w3.org/2001/XMLSchema-instance",
        "@xsi:type": "MandatSimple_Type",
        "uid": "PM724325",
        "acteurRef": "PA719118",
        "legislature": "15",
        "typeOrgane": "GP",
        "dateDebut": "2017-06-21T02:00:00.000+02:00",
        "datePublication": null,
        "dateFin": "2017-06-26T02:00:00.000+02:00",
        "preseance": "28",
        "nominPrincipale": "1",
        "infosQualite": {
          "codeQualite": "Député non-inscrit",
          "libQualite": "Député non-inscrit",
          "libQualiteSex": "Député non-inscrit"
        },
        "organes": {
          "organeRef": "PO723569"
        }
      },
      {
        "@xmlns:xsi": "http://www.w3.org/2001/XMLSchema-instance",
        "@xsi:type": "MandatSimple_Type",
        "uid": "PM752634",
        "acteurRef": "PA719118",
        "legislature": "15",
        "typeOrgane": "GE",
        "dateDebut": "2018-03-06T01:00:00.000+01:00",
        "datePublication": null,
        "dateFin": null,
        "preseance": "20",
        "nominPrincipale": "1",
        "infosQualite": {
          "codeQualite": "Membre",
          "libQualite": "Membre",
          "libQualiteSex": "Membre"
        },
        "organes": {
          "organeRef": "PO746669"
        }
      },
      {
        "@xmlns:xsi": "http://www.w3.org/2001/XMLSchema-instance",
        "@xsi:type": "MandatSimple_Type",
        "uid": "PM750704",
        "acteurRef": "PA719118",
        "legislature": "15",
        "typeOrgane": "GE",
        "dateDebut": "2018-02-16T01:00:00.000+01:00",
        "datePublication": null,
        "dateFin": null,
        "preseance": "20",
        "nominPrincipale": "1",
        "infosQualite": {
          "codeQualite": "Membre",
          "libQualite": "Membre",
          "libQualiteSex": "Membre"
        },
        "organes": {
          "organeRef": "PO746847"
        }
      },
      {
        "@xmlns:xsi": "http://www.w3.org/2001/XMLSchema-instance",
        "@xsi:type": "MandatSimple_Type",
        "uid": "PM750309",
        "acteurRef": "PA719118",
        "legislature": "15",
        "typeOrgane": "GE",
        "dateDebut": "2018-02-14T01:00:00.000+01:00",
        "datePublication": null,
        "dateFin": null,
        "preseance": "20",
        "nominPrincipale": "1",
        "infosQualite": {
          "codeQualite": "Membre",
          "libQualite": "Membre",
          "libQualiteSex": "Membre"
        },
        "organes": {
          "organeRef": "PO746982"
        }
      },
      {
        "@xmlns:xsi": "http://www.w3.org/2001/XMLSchema-instance",
        "@xsi:type": "MandatSimple_Type",
        "uid": "PM750820",
        "acteurRef": "PA719118",
        "legislature": "15",
        "typeOrgane": "GE",
        "dateDebut": "2018-02-17T01:00:00.000+01:00",
        "datePublication": null,
        "dateFin": null,
        "preseance": "20",
        "nominPrincipale": "1",
        "infosQualite": {
          "codeQualite": "Membre",
          "libQualite": "Membre",
          "libQualiteSex": "Membre"
        },
        "organes": {
          "organeRef": "PO746920"
        }
      },
      {
        "@xmlns:xsi": "http://www.w3.org/2001/XMLSchema-instance",
        "@xsi:type": "MandatSimple_Type",
        "uid": "PM753771",
        "acteurRef": "PA719118",
        "legislature": "15",
        "typeOrgane": "GE",
        "dateDebut": "2018-03-19T01:00:00.000+01:00",
        "datePublication": null,
        "dateFin": null,
        "preseance": "20",
        "nominPrincipale": "1",
        "infosQualite": {
          "codeQualite": "Membre",
          "libQualite": "Membre",
          "libQualiteSex": "Membre"
        },
        "organes": {
          "organeRef": "PO747084"
        }
      },
      {
        "@xmlns:xsi": "http://www.w3.org/2001/XMLSchema-instance",
        "@xsi:type": "MandatSimple_Type",
        "uid": "PM753412",
        "acteurRef": "PA719118",
        "legislature": "15",
        "typeOrgane": "GE",
        "dateDebut": "2018-03-14T01:00:00.000+01:00",
        "datePublication": null,
        "dateFin": null,
        "preseance": "20",
        "nominPrincipale": "1",
        "infosQualite": {
          "codeQualite": "Membre",
          "libQualite": "Membre",
          "libQualiteSex": "Membre"
        },
        "organes": {
          "organeRef": "PO746997"
        }
      },
      {
        "@xmlns:xsi": "http://www.w3.org/2001/XMLSchema-instance",
        "@xsi:type": "MandatSimple_Type",
        "uid": "PM748678",
        "acteurRef": "PA719118",
        "legislature": "15",
        "typeOrgane": "GE",
        "dateDebut": "2018-02-01T01:00:00.000+01:00",
        "datePublication": null,
        "dateFin": null,
        "preseance": "1",
        "nominPrincipale": "1",
        "infosQualite": {
          "codeQualite": "Président",
          "libQualite": "Président",
          "libQualiteSex": "Président"
        },
        "organes": {
          "organeRef": "PO747215"
        }
      },
      {
        "@xmlns:xsi": "http://www.w3.org/2001/XMLSchema-instance",
        "@xsi:type": "MandatSimple_Type",
        "uid": "PM765597",
        "acteurRef": "PA719118",
        "legislature": "15",
        "typeOrgane": "GE",
        "dateDebut": "2019-06-06T02:00:00.000+02:00",
        "datePublication": null,
        "dateFin": null,
        "preseance": "12",
        "nominPrincipale": "1",
        "infosQualite": {
          "codeQualite": "Secrétaire",
          "libQualite": "Secrétaire",
          "libQualiteSex": "Secrétaire"
        },
        "organes": {
          "organeRef": "PO763264"
        }
      },
      {
        "@xmlns:xsi": "http://www.w3.org/2001/XMLSchema-instance",
        "@xsi:type": "MandatSimple_Type",
        "uid": "PM752864",
        "acteurRef": "PA719118",
        "legislature": "15",
        "typeOrgane": "GE",
        "dateDebut": "2018-03-08T01:00:00.000+01:00",
        "datePublication": null,
        "dateFin": null,
        "preseance": "20",
        "nominPrincipale": "1",
        "infosQualite": {
          "codeQualite": "Membre",
          "libQualite": "Membre",
          "libQualiteSex": "Membre"
        },
        "organes": {
          "organeRef": "PO746629"
        }
      },
      {
        "@xmlns:xsi": "http://www.w3.org/2001/XMLSchema-instance",
        "@xsi:type": "MandatSimple_Type",
        "uid": "PM749311",
        "acteurRef": "PA719118",
        "legislature": "15",
        "typeOrgane": "GE",
        "dateDebut": "2018-02-09T01:00:00.000+01:00",
        "datePublication": null,
        "dateFin": null,
        "preseance": "20",
        "nominPrincipale": "1",
        "infosQualite": {
          "codeQualite": "Membre",
          "libQualite": "Membre",
          "libQualiteSex": "Membre"
        },
        "organes": {
          "organeRef": "PO746821"
        }
      },
      {
        "@xmlns:xsi": "http://www.w3.org/2001/XMLSchema-instance",
        "@xsi:type": "MandatSimple_Type",
        "uid": "PM750934",
        "acteurRef": "PA719118",
        "legislature": "15",
        "typeOrgane": "GE",
        "dateDebut": "2018-02-19T01:00:00.000+01:00",
        "datePublication": null,
        "dateFin": null,
        "preseance": "20",
        "nominPrincipale": "1",
        "infosQualite": {
          "codeQualite": "Membre",
          "libQualite": "Membre",
          "libQualiteSex": "Membre"
        },
        "organes": {
          "organeRef": "PO746880"
        }
      },
      {
        "@xmlns:xsi": "http://www.w3.org/2001/XMLSchema-instance",
        "@xsi:type": "MandatSimple_Type",
        "uid": "PM751597",
        "acteurRef": "PA719118",
        "legislature": "15",
        "typeOrgane": "GE",
        "dateDebut": "2018-02-21T01:00:00.000+01:00",
        "datePublication": null,
        "dateFin": null,
        "preseance": "20",
        "nominPrincipale": "1",
        "infosQualite": {
          "codeQualite": "Membre",
          "libQualite": "Membre",
          "libQualiteSex": "Membre"
        },
        "organes": {
          "organeRef": "PO747261"
        }
      },
      {
        "@xmlns:xsi": "http://www.w3.org/2001/XMLSchema-instance",
        "@xsi:type": "MandatSimple_Type",
        "uid": "PM752342",
        "acteurRef": "PA719118",
        "legislature": "15",
        "typeOrgane": "GE",
        "dateDebut": "2018-03-05T01:00:00.000+01:00",
        "datePublication": null,
        "dateFin": null,
        "preseance": "20",
        "nominPrincipale": "1",
        "infosQualite": {
          "codeQualite": "Membre",
          "libQualite": "Membre",
          "libQualiteSex": "Membre"
        },
        "organes": {
          "organeRef": "PO747246"
        }
      },
      {
        "@xmlns:xsi": "http://www.w3.org/2001/XMLSchema-instance",
        "@xsi:type": "MandatSimple_Type",
        "uid": "PM749429",
        "acteurRef": "PA719118",
        "legislature": "15",
        "typeOrgane": "GE",
        "dateDebut": "2018-02-12T01:00:00.000+01:00",
        "datePublication": null,
        "dateFin": null,
        "preseance": "20",
        "nominPrincipale": "1",
        "infosQualite": {
          "codeQualite": "Membre",
          "libQualite": "Membre",
          "libQualiteSex": "Membre"
        },
        "organes": {
          "organeRef": "PO747155"
        }
      },
      {
        "@xmlns:xsi": "http://www.w3.org/2001/XMLSchema-instance",
        "@xsi:type": "MandatSimple_Type",
        "uid": "PM765372",
        "acteurRef": "PA719118",
        "legislature": "15",
        "typeOrgane": "GE",
        "dateDebut": "2019-05-29T02:00:00.000+02:00",
        "datePublication": null,
        "dateFin": null,
        "preseance": "20",
        "nominPrincipale": "0",
        "infosQualite": {
          "codeQualite": "Membre",
          "libQualite": "Membre",
          "libQualiteSex": "Membre"
        },
        "organes": {
          "organeRef": "PO763264"
        }
      },
      {
        "@xmlns:xsi": "http://www.w3.org/2001/XMLSchema-instance",
        "@xsi:type": "MandatSimple_Type",
        "uid": "PM748675",
        "acteurRef": "PA719118",
        "legislature": "15",
        "typeOrgane": "GE",
        "dateDebut": "2018-02-01T01:00:00.000+01:00",
        "datePublication": null,
        "dateFin": null,
        "preseance": "20",
        "nominPrincipale": "0",
        "infosQualite": {
          "codeQualite": "Membre",
          "libQualite": "Membre",
          "libQualiteSex": "Membre"
        },
        "organes": {
          "organeRef": "PO747215"
        }
      },
      {
        "@xmlns:xsi": "http://www.w3.org/2001/XMLSchema-instance",
        "@xsi:type": "MandatSimple_Type",
        "uid": "PM754318",
        "acteurRef": "PA719118",
        "legislature": "15",
        "typeOrgane": "GE",
        "dateDebut": "2018-03-06T01:00:00.000+01:00",
        "datePublication": null,
        "dateFin": null,
        "preseance": "20",
        "nominPrincipale": "1",
        "infosQualite": {
          "codeQualite": "Membre",
          "libQualite": "Membre",
          "libQualiteSex": "Membre"
        },
        "organes": {
          "organeRef": "PO747135"
        }
      },
      {
        "@xmlns:xsi": "http://www.w3.org/2001/XMLSchema-instance",
        "@xsi:type": "MandatSimple_Type",
        "uid": "PM751907",
        "acteurRef": "PA719118",
        "legislature": "15",
        "typeOrgane": "GE",
        "dateDebut": "2018-02-23T01:00:00.000+01:00",
        "datePublication": null,
        "dateFin": null,
        "preseance": "20",
        "nominPrincipale": "1",
        "infosQualite": {
          "codeQualite": "Membre",
          "libQualite": "Membre",
          "libQualiteSex": "Membre"
        },
        "organes": {
          "organeRef": "PO746857"
        }
      },
      {
        "@xmlns:xsi": "http://www.w3.org/2001/XMLSchema-instance",
        "@xsi:type": "MandatSimple_Type",
        "uid": "PM750465",
        "acteurRef": "PA719118",
        "legislature": "15",
        "typeOrgane": "GE",
        "dateDebut": "2018-02-14T01:00:00.000+01:00",
        "datePublication": null,
        "dateFin": null,
        "preseance": "20",
        "nominPrincipale": "1",
        "infosQualite": {
          "codeQualite": "Membre",
          "libQualite": "Membre",
          "libQualiteSex": "Membre"
        },
        "organes": {
          "organeRef": "PO746972"
        }
      },
      {
        "@xmlns:xsi": "http://www.w3.org/2001/XMLSchema-instance",
        "@xsi:type": "MandatSimple_Type",
        "uid": "PM766187",
        "acteurRef": "PA719118",
        "legislature": "15",
        "typeOrgane": "GE",
        "dateDebut": "2019-07-03T02:00:00.000+02:00",
        "datePublication": null,
        "dateFin": null,
        "preseance": "20",
        "nominPrincipale": "1",
        "infosQualite": {
          "codeQualite": "Membre",
          "libQualite": "Membre",
          "libQualiteSex": "Membre"
        },
        "organes": {
          "organeRef": "PO763259"
        }
      },
      {
        "@xmlns:xsi": "http://www.w3.org/2001/XMLSchema-instance",
        "@xsi:type": "MandatSimple_Type",
        "uid": "PM753094",
        "acteurRef": "PA719118",
        "legislature": "15",
        "typeOrgane": "GE",
        "dateDebut": "2018-03-08T01:00:00.000+01:00",
        "datePublication": null,
        "dateFin": null,
        "preseance": "20",
        "nominPrincipale": "1",
        "infosQualite": {
          "codeQualite": "Membre",
          "libQualite": "Membre",
          "libQualiteSex": "Membre"
        },
        "organes": {
          "organeRef": "PO747037"
        }
      },
      {
        "@xmlns:xsi": "http://www.w3.org/2001/XMLSchema-instance",
        "@xsi:type": "MandatSimple_Type",
        "uid": "PM750074",
        "acteurRef": "PA719118",
        "legislature": "15",
        "typeOrgane": "GE",
        "dateDebut": "2018-02-14T01:00:00.000+01:00",
        "datePublication": null,
        "dateFin": null,
        "preseance": "20",
        "nominPrincipale": "1",
        "infosQualite": {
          "codeQualite": "Membre",
          "libQualite": "Membre",
          "libQualiteSex": "Membre"
        },
        "organes": {
          "organeRef": "PO746925"
        }
      },
      {
        "@xmlns:xsi": "http://www.w3.org/2001/XMLSchema-instance",
        "@xsi:type": "MandatSimple_Type",
        "uid": "PM753519",
        "acteurRef": "PA719118",
        "legislature": "15",
        "typeOrgane": "GE",
        "dateDebut": "2018-03-13T01:00:00.000+01:00",
        "datePublication": null,
        "dateFin": null,
        "preseance": "12",
        "nominPrincipale": "1",
        "infosQualite": {
          "codeQualite": "Secrétaire",
          "libQualite": "Secrétaire",
          "libQualiteSex": "Secrétaire"
        },
        "organes": {
          "organeRef": "PO747266"
        }
      },
      {
        "@xmlns:xsi": "http://www.w3.org/2001/XMLSchema-instance",
        "@xsi:type": "MandatSimple_Type",
        "uid": "PM751378",
        "acteurRef": "PA719118",
        "legislature": "15",
        "typeOrgane": "GE",
        "dateDebut": "2018-03-13T01:00:00.000+01:00",
        "datePublication": null,
        "dateFin": null,
        "preseance": "20",
        "nominPrincipale": "1",
        "infosQualite": {
          "codeQualite": "Membre",
          "libQualite": "Membre",
          "libQualiteSex": "Membre"
        },
        "organes": {
          "organeRef": "PO746899"
        }
      },
      {
        "@xmlns:xsi": "http://www.w3.org/2001/XMLSchema-instance",
        "@xsi:type": "MandatSimple_Type",
        "uid": "PM749278",
        "acteurRef": "PA719118",
        "legislature": "15",
        "typeOrgane": "GE",
        "dateDebut": "2018-02-08T01:00:00.000+01:00",
        "datePublication": null,
        "dateFin": null,
        "preseance": "20",
        "nominPrincipale": "0",
        "infosQualite": {
          "codeQualite": "Membre",
          "libQualite": "Membre",
          "libQualiteSex": "Membre"
        },
        "organes": {
          "organeRef": "PO747266"
        }
      },
      {
        "@xmlns:xsi": "http://www.w3.org/2001/XMLSchema-instance",
        "@xsi:type": "MandatSimple_Type",
        "uid": "PM752618",
        "acteurRef": "PA719118",
        "legislature": "15",
        "typeOrgane": "GE",
        "dateDebut": "2018-03-06T01:00:00.000+01:00",
        "datePublication": null,
        "dateFin": null,
        "preseance": "20",
        "nominPrincipale": "1",
        "infosQualite": {
          "codeQualite": "Membre",
          "libQualite": "Membre",
          "libQualiteSex": "Membre"
        },
        "organes": {
          "organeRef": "PO747165"
        }
      },
      {
        "@xmlns:xsi": "http://www.w3.org/2001/XMLSchema-instance",
        "@xsi:type": "MandatSimple_Type",
        "uid": "PM751174",
        "acteurRef": "PA719118",
        "legislature": "15",
        "typeOrgane": "GE",
        "dateDebut": "2018-02-19T01:00:00.000+01:00",
        "datePublication": null,
        "dateFin": null,
        "preseance": "20",
        "nominPrincipale": "1",
        "infosQualite": {
          "codeQualite": "Membre",
          "libQualite": "Membre",
          "libQualiteSex": "Membre"
        },
        "organes": {
          "organeRef": "PO747276"
        }
      },
      {
        "@xmlns:xsi": "http://www.w3.org/2001/XMLSchema-instance",
        "@xsi:type": "MandatSimple_Type",
        "uid": "PM737476",
        "acteurRef": "PA719118",
        "legislature": "15",
        "typeOrgane": "GA",
        "dateDebut": "2017-10-05T02:00:00.000+02:00",
        "datePublication": null,
        "dateFin": null,
        "preseance": "20",
        "nominPrincipale": "0",
        "infosQualite": {
          "codeQualite": "Membre",
          "libQualite": "Membre",
          "libQualiteSex": "Membre"
        },
        "organes": {
          "organeRef": "PO732984"
        }
      },
      {
        "@xmlns:xsi": "http://www.w3.org/2001/XMLSchema-instance",
        "@xsi:type": "MandatSimple_Type",
        "uid": "PM737480",
        "acteurRef": "PA719118",
        "legislature": "15",
        "typeOrgane": "GA",
        "dateDebut": "2017-10-05T02:00:00.000+02:00",
        "datePublication": null,
        "dateFin": null,
        "preseance": "20",
        "nominPrincipale": "0",
        "infosQualite": {
          "codeQualite": "Membre",
          "libQualite": "Membre",
          "libQualiteSex": "Membre"
        },
        "organes": {
          "organeRef": "PO733342"
        }
      },
      {
        "@xmlns:xsi": "http://www.w3.org/2001/XMLSchema-instance",
        "@xsi:type": "MandatSimple_Type",
        "uid": "PM737478",
        "acteurRef": "PA719118",
        "legislature": "15",
        "typeOrgane": "GA",
        "dateDebut": "2017-10-05T02:00:00.000+02:00",
        "datePublication": null,
        "dateFin": null,
        "preseance": "20",
        "nominPrincipale": "1",
        "infosQualite": {
          "codeQualite": "Membre",
          "libQualite": "Membre",
          "libQualiteSex": "Membre"
        },
        "organes": {
          "organeRef": "PO733072"
        }
      },
      {
        "@xmlns:xsi": "http://www.w3.org/2001/XMLSchema-instance",
        "@xsi:type": "MandatSimple_Type",
        "uid": "PM737482",
        "acteurRef": "PA719118",
        "legislature": "15",
        "typeOrgane": "GA",
        "dateDebut": "2017-10-05T02:00:00.000+02:00",
        "datePublication": null,
        "dateFin": null,
        "preseance": "20",
        "nominPrincipale": "1",
        "infosQualite": {
          "codeQualite": "Membre",
          "libQualite": "Membre",
          "libQualiteSex": "Membre"
        },
        "organes": {
          "organeRef": "PO733417"
        }
      },
      {
        "@xmlns:xsi": "http://www.w3.org/2001/XMLSchema-instance",
        "@xsi:type": "MandatSimple_Type",
        "uid": "PM737484",
        "acteurRef": "PA719118",
        "legislature": "15",
        "typeOrgane": "GA",
        "dateDebut": "2017-10-05T02:00:00.000+02:00",
        "datePublication": null,
        "dateFin": null,
        "preseance": "20",
        "nominPrincipale": "1",
        "infosQualite": {
          "codeQualite": "Membre",
          "libQualite": "Membre",
          "libQualiteSex": "Membre"
        },
        "organes": {
          "organeRef": "PO733492"
        }
      },
      {
        "@xmlns:xsi": "http://www.w3.org/2001/XMLSchema-instance",
        "@xsi:type": "MandatSimple_Type",
        "uid": "PM737486",
        "acteurRef": "PA719118",
        "legislature": "15",
        "typeOrgane": "GA",
        "dateDebut": "2017-10-05T02:00:00.000+02:00",
        "datePublication": null,
        "dateFin": null,
        "preseance": "20",
        "nominPrincipale": "1",
        "infosQualite": {
          "codeQualite": "Membre",
          "libQualite": "Membre",
          "libQualiteSex": "Membre"
        },
        "organes": {
          "organeRef": "PO733562"
        }
      },
      {
        "@xmlns:xsi": "http://www.w3.org/2001/XMLSchema-instance",
        "@xsi:type": "MandatSimple_Type",
        "uid": "PM737488",
        "acteurRef": "PA719118",
        "legislature": "15",
        "typeOrgane": "GA",
        "dateDebut": "2017-10-05T02:00:00.000+02:00",
        "datePublication": null,
        "dateFin": null,
        "preseance": "20",
        "nominPrincipale": "1",
        "infosQualite": {
          "codeQualite": "Membre",
          "libQualite": "Membre",
          "libQualiteSex": "Membre"
        },
        "organes": {
          "organeRef": "PO733617"
        }
      },
      {
        "@xmlns:xsi": "http://www.w3.org/2001/XMLSchema-instance",
        "@xsi:type": "MandatSimple_Type",
        "uid": "PM743367",
        "acteurRef": "PA719118",
        "legislature": "15",
        "typeOrgane": "GA",
        "dateDebut": "2017-11-15T01:00:00.000+01:00",
        "datePublication": null,
        "dateFin": null,
        "preseance": "14",
        "nominPrincipale": "1",
        "infosQualite": {
          "codeQualite": "Secrétaire",
          "libQualite": "Secrétaire",
          "libQualiteSex": "Secrétaire"
        },
        "organes": {
          "organeRef": "PO732984"
        }
      },
      {
        "@xmlns:xsi": "http://www.w3.org/2001/XMLSchema-instance",
        "@xsi:type": "MandatSimple_Type",
        "uid": "PM742924",
        "acteurRef": "PA719118",
        "legislature": "15",
        "typeOrgane": "GA",
        "dateDebut": "2017-11-09T01:00:00.000+01:00",
        "datePublication": null,
        "dateFin": null,
        "preseance": "14",
        "nominPrincipale": "1",
        "infosQualite": {
          "codeQualite": "Secrétaire",
          "libQualite": "Secrétaire",
          "libQualiteSex": "Secrétaire"
        },
        "organes": {
          "organeRef": "PO733342"
        }
      },
      {
        "@xmlns:xsi": "http://www.w3.org/2001/XMLSchema-instance",
        "@xsi:type": "MandatSimple_Type",
        "uid": "PM737477",
        "acteurRef": "PA719118",
        "legislature": "15",
        "typeOrgane": "GA",
        "dateDebut": "2017-10-05T02:00:00.000+02:00",
        "datePublication": null,
        "dateFin": null,
        "preseance": "20",
        "nominPrincipale": "1",
        "infosQualite": {
          "codeQualite": "Membre",
          "libQualite": "Membre",
          "libQualiteSex": "Membre"
        },
        "organes": {
          "organeRef": "PO733057"
        }
      },
      {
        "@xmlns:xsi": "http://www.w3.org/2001/XMLSchema-instance",
        "@xsi:type": "MandatSimple_Type",
        "uid": "PM737481",
        "acteurRef": "PA719118",
        "legislature": "15",
        "typeOrgane": "GA",
        "dateDebut": "2017-10-05T02:00:00.000+02:00",
        "datePublication": null,
        "dateFin": null,
        "preseance": "20",
        "nominPrincipale": "1",
        "infosQualite": {
          "codeQualite": "Membre",
          "libQualite": "Membre",
          "libQualiteSex": "Membre"
        },
        "organes": {
          "organeRef": "PO733382"
        }
      },
      {
        "@xmlns:xsi": "http://www.w3.org/2001/XMLSchema-instance",
        "@xsi:type": "MandatSimple_Type",
        "uid": "PM737479",
        "acteurRef": "PA719118",
        "legislature": "15",
        "typeOrgane": "GA",
        "dateDebut": "2017-10-05T02:00:00.000+02:00",
        "datePublication": null,
        "dateFin": null,
        "preseance": "20",
        "nominPrincipale": "1",
        "infosQualite": {
          "codeQualite": "Membre",
          "libQualite": "Membre",
          "libQualiteSex": "Membre"
        },
        "organes": {
          "organeRef": "PO733117"
        }
      },
      {
        "@xmlns:xsi": "http://www.w3.org/2001/XMLSchema-instance",
        "@xsi:type": "MandatSimple_Type",
        "uid": "PM737483",
        "acteurRef": "PA719118",
        "legislature": "15",
        "typeOrgane": "GA",
        "dateDebut": "2017-10-05T02:00:00.000+02:00",
        "datePublication": null,
        "dateFin": null,
        "preseance": "20",
        "nominPrincipale": "1",
        "infosQualite": {
          "codeQualite": "Membre",
          "libQualite": "Membre",
          "libQualiteSex": "Membre"
        },
        "organes": {
          "organeRef": "PO733437"
        }
      },
      {
        "@xmlns:xsi": "http://www.w3.org/2001/XMLSchema-instance",
        "@xsi:type": "MandatSimple_Type",
        "uid": "PM737485",
        "acteurRef": "PA719118",
        "legislature": "15",
        "typeOrgane": "GA",
        "dateDebut": "2017-10-05T02:00:00.000+02:00",
        "datePublication": null,
        "dateFin": null,
        "preseance": "20",
        "nominPrincipale": "1",
        "infosQualite": {
          "codeQualite": "Membre",
          "libQualite": "Membre",
          "libQualiteSex": "Membre"
        },
        "organes": {
          "organeRef": "PO733522"
        }
      },
      {
        "@xmlns:xsi": "http://www.w3.org/2001/XMLSchema-instance",
        "@xsi:type": "MandatSimple_Type",
        "uid": "PM737487",
        "acteurRef": "PA719118",
        "legislature": "15",
        "typeOrgane": "GA",
        "dateDebut": "2017-10-05T02:00:00.000+02:00",
        "datePublication": null,
        "dateFin": null,
        "preseance": "20",
        "nominPrincipale": "1",
        "infosQualite": {
          "codeQualite": "Membre",
          "libQualite": "Membre",
          "libQualiteSex": "Membre"
        },
        "organes": {
          "organeRef": "PO733577"
        }
      },
      {
        "@xmlns:xsi": "http://www.w3.org/2001/XMLSchema-instance",
        "@xsi:type": "MandatSimple_Type",
        "uid": "PM737489",
        "acteurRef": "PA719118",
        "legislature": "15",
        "typeOrgane": "GA",
        "dateDebut": "2017-10-05T02:00:00.000+02:00",
        "datePublication": null,
        "dateFin": null,
        "preseance": "20",
        "nominPrincipale": "1",
        "infosQualite": {
          "codeQualite": "Membre",
          "libQualite": "Membre",
          "libQualiteSex": "Membre"
        },
        "organes": {
          "organeRef": "PO733632"
        }
      },
      {
        "@xmlns:xsi": "http://www.w3.org/2001/XMLSchema-instance",
        "@xsi:type": "MandatSimple_Type",
        "uid": "PM766549",
        "acteurRef": "PA719118",
        "legislature": "15",
        "typeOrgane": "CMP",
        "dateDebut": "2019-07-18T02:00:00.000+02:00",
        "datePublication": "2019-07-19T02:00:00.000+02:00",
        "dateFin": "2019-07-25T02:00:00.000+02:00",
        "preseance": "28",
        "nominPrincipale": "1",
        "infosQualite": {
          "codeQualite": "Suppléant",
          "libQualite": "Membre suppléant",
          "libQualiteSex": "Membre suppléant"
        },
        "organes": {
          "organeRef": "PO766521"
        }
      },
      {
        "@xmlns:xsi": "http://www.w3.org/2001/XMLSchema-instance",
        "@xsi:type": "MandatParlementaire_type",
        "uid": "PM722568",
        "acteurRef": "PA719118",
        "legislature": "15",
        "typeOrgane": "ASSEMBLEE",
        "dateDebut": "2017-06-18T02:00:00.000+02:00",
        "datePublication": null,
        "dateFin": null,
        "preseance": "50",
        "nominPrincipale": "1",
        "infosQualite": {
          "codeQualite": "membre",
          "libQualite": "membre",
          "libQualiteSex": "membre"
        },
        "organes": {
          "organeRef": "PO717460"
        },
        "suppleants": {
          "suppleant": {
            "dateDebut": "2017-06-18T02:00:00.000+02:00",
            "dateFin": null,
            "suppleantRef": "PA719122"
          }
        },
        "chambre": null,
        "election": {
          "lieu": {
            "region": "Centre-Val de Loire",
            "regionType": "Métropolitain",
            "departement": "Cher",
            "numDepartement": "18",
            "numCirco": "1"
          },
          "causeMandat": "élections générales",
          "refCirconscription": "PO717624"
        },
        "mandature": {
          "datePriseFonction": "2017-06-21T02:00:00.000+02:00",
          "causeFin": null,
          "premiereElection": "0",
          "placeHemicycle": "300",
          "mandatRemplaceRef": null
        },
        "collaborateurs": {
          "collaborateur": [
            {
              "qualite": "M.",
              "prenom": "Frédéric",
              "nom": "Sardin",
              "dateDebut": null,
              "dateFin": null
            },
            {
              "qualite": "Mme",
              "prenom": "Mary-Jennifer",
              "nom": "Roumet",
              "dateDebut": null,
              "dateFin": null
            },
            {
              "qualite": "Mme",
              "prenom": "Sabah",
              "nom": "Ingremeau",
              "dateDebut": null,
              "dateFin": null
            },
            {
              "qualite": "M.",
              "prenom": "Thomas",
              "nom": "Jaquemet",
              "dateDebut": null,
              "dateFin": null
            },
            {
              "qualite": "M.",
              "prenom": "Arthur",
              "nom": "Jarrige",
              "dateDebut": null,
              "dateFin": null
            }
          ]
        }
      }
    ]
  }
}