{
  "@xmlns": "http://schemas.assemblee-nationale.fr/referentiel",
  "uid": {
    "@xmlns:xsi": "http://www.w3.org/2001/XMLSchema-instance",
    "@xsi:type": "IdActeur_type",
    "#text": "PA267138"
  },
  "etatCivil": {
    "ident": {
      "civ": "M.",
      "prenom": "Fabien",
      "nom": "Limonta",
      "alpha": "Limonta",
      "trigramme": {
        "@xmlns:xsi": "http://www.w3.org/2001/XMLSchema-instance",
        "@xsi:nil": "true"
      }
    },
    "infoNaissance": {
      "dateNais": "1946-12-26T01:00:00.000+01:00",
      "villeNais": "Tunis",
      "depNais": {
        "@xmlns:xsi": "http://www.w3.org/2001/XMLSchema-instance",
        "@xsi:nil": "true"
      },
      "paysNais": "Tunisie"
    },
    "dateDeces": {
      "@xmlns:xsi": "http://www.w3.org/2001/XMLSchema-instance",
      "@xsi:nil": "true"
    }
  },
  "profession": {
    "libelleCourant": {
      "@xmlns:xsi": "http://www.w3.org/2001/XMLSchema-instance",
      "@xsi:nil": "true"
    },
    "socProcINSEE": {
      "catSocPro": "Cadres d'entreprise",
      "famSocPro": "Cadres et professions intellectuelles supérieures"
    }
  },
  "uri_hatvp": {
    "@xmlns:xsi": "http://www.w3.org/2001/XMLSchema-instance",
    "@xsi:nil": "true"
  },
  "adresses": {
    "adresse": {
      "@xmlns:xsi": "http://www.w3.org/2001/XMLSchema-instance",
      "@xsi:type": "AdressePostale_Type",
      "uid": "AD382911",
      "type": "0",
      "typeLibelle": "Adresse officielle",
      "poids": "1",
      "adresseDeRattachement": null,
      "intitule": "Casier de la Poste,",
      "numeroRue": null,
      "nomRue": null,
      "complementAdresse": "Palais Bourbon,",
      "codePostal": "75355",
      "ville": "Paris 07 SP"
    }
  },
  "mandats": {
    "mandat": [
      {
        "@xmlns:xsi": "http://www.w3.org/2001/XMLSchema-instance",
        "@xsi:type": "MandatSimple_Type",
        "uid": "PM382917",
        "acteurRef": "PA267138",
        "legislature": "12",
        "typeOrgane": "GP",
        "dateDebut": "2007-04-27T02:00:00.000+02:00",
        "datePublication": "2007-04-28T02:00:00.000+02:00",
        "dateFin": "2007-06-19T02:00:00.000+02:00",
        "preseance": "20",
        "nominPrincipale": "1",
        "infosQualite": {
          "codeQualite": "Membre",
          "libQualite": "Membre du",
          "libQualiteSex": "Membre du"
        },
        "organes": {
          "organeRef": "PO270903"
        }
      },
      {
        "@xmlns:xsi": "http://www.w3.org/2001/XMLSchema-instance",
        "@xsi:type": "MandatSimple_Type",
        "uid": "PM382913",
        "acteurRef": "PA267138",
        "legislature": "12",
        "typeOrgane": "COMPER",
        "dateDebut": "2007-04-27T02:00:00.000+02:00",
        "datePublication": "2007-04-28T02:00:00.000+02:00",
        "dateFin": "2007-06-19T02:00:00.000+02:00",
        "preseance": "32",
        "nominPrincipale": "1",
        "infosQualite": {
          "codeQualite": "Membre",
          "libQualite": "Membre",
          "libQualiteSex": "Membre"
        },
        "organes": {
          "organeRef": "PO59045"
        }
      },
      {
        "@xmlns:xsi": "http://www.w3.org/2001/XMLSchema-instance",
        "@xsi:type": "MandatParlementaire_type",
        "uid": "PM382910",
        "acteurRef": "PA267138",
        "legislature": "12",
        "typeOrgane": "ASSEMBLEE",
        "dateDebut": "2002-06-19T02:00:00.000+02:00",
        "datePublication": null,
        "dateFin": "2007-06-19T02:00:00.000+02:00",
        "preseance": "50",
        "nominPrincipale": "1",
        "infosQualite": {
          "codeQualite": "membre",
          "libQualite": "membre",
          "libQualiteSex": "membre"
        },
        "organes": {
          "organeRef": "PO230434"
        },
        "suppleants": null,
        "chambre": null,
        "election": {
          "lieu": {
            "region": "Auvergne-Rhône-Alpes",
            "regionType": "Métropolitain",
            "departement": "Drôme",
            "numDepartement": "26",
            "numCirco": "3"
          },
          "causeMandat": "remplacement d'un député nommé au Gouvernement",
          "refCirconscription": "PO230544"
        },
        "mandature": {
          "datePriseFonction": "2007-04-27T02:00:00.000+02:00",
          "causeFin": "Fin de législature",
          "premiereElection": "0",
          "placeHemicycle": null,
          "mandatRemplaceRef": null
        },
        "collaborateurs": null
      }
    ]
  }
}