{
  "@xmlns": "http://schemas.assemblee-nationale.fr/referentiel",
  "uid": {
    "@xmlns:xsi": "http://www.w3.org/2001/XMLSchema-instance",
    "@xsi:type": "IdActeur_type",
    "#text": "PA922"
  },
  "etatCivil": {
    "ident": {
      "civ": "M.",
      "prenom": "Gérard",
      "nom": "Cornu",
      "alpha": "CORNU GERARD",
      "trigramme": {
        "@xmlns:xsi": "http://www.w3.org/2001/XMLSchema-instance",
        "@xsi:nil": "true"
      }
    },
    "infoNaissance": {
      "dateNais": "1952-02-06T01:00:00.000+01:00",
      "villeNais": "Aoste",
      "depNais": "Ardennes",
      "paysNais": {
        "@xmlns:xsi": "http://www.w3.org/2001/XMLSchema-instance",
        "@xsi:nil": "true"
      }
    },
    "dateDeces": {
      "@xmlns:xsi": "http://www.w3.org/2001/XMLSchema-instance",
      "@xsi:nil": "true"
    }
  },
  "profession": {
    "libelleCourant": "Opticien",
    "socProcINSEE": {
      "catSocPro": "Professions libérales et assimilés",
      "famSocPro": "Cadres et professions intellectuelles supérieures"
    }
  },
  "uri_hatvp": {
    "@xmlns:xsi": "http://www.w3.org/2001/XMLSchema-instance",
    "@xsi:nil": "true"
  },
  "adresses": {
    "adresse": [
      {
        "@xmlns:xsi": "http://www.w3.org/2001/XMLSchema-instance",
        "@xsi:type": "AdressePostale_Type",
        "uid": "AD45771",
        "type": "2",
        "typeLibelle": "Adresse publiée de circonscription",
        "poids": "21",
        "adresseDeRattachement": null,
        "intitule": "Mairie,",
        "numeroRue": null,
        "nomRue": null,
        "complementAdresse": null,
        "codePostal": "28630",
        "ville": "Fontenay-Sur-Eure"
      },
      {
        "@xmlns:xsi": "http://www.w3.org/2001/XMLSchema-instance",
        "@xsi:type": "AdressePostale_Type",
        "uid": "AD45774",
        "type": "2",
        "typeLibelle": "Adresse publiée de circonscription",
        "poids": "22",
        "adresseDeRattachement": null,
        "intitule": "Permanence Parlementaire :",
        "numeroRue": null,
        "nomRue": null,
        "complementAdresse": "BP 166",
        "codePostal": "28003",
        "ville": "Chartres"
      },
      {
        "@xmlns:xsi": "http://www.w3.org/2001/XMLSchema-instance",
        "@xsi:type": "AdressePostale_Type",
        "uid": "AD45834",
        "type": "0",
        "typeLibelle": "Adresse officielle",
        "poids": "1",
        "adresseDeRattachement": null,
        "intitule": "Casier de la Poste,",
        "numeroRue": null,
        "nomRue": null,
        "complementAdresse": "Palais Bourbon,",
        "codePostal": "75355",
        "ville": "Paris 07 SP"
      },
      {
        "@xmlns:xsi": "http://www.w3.org/2001/XMLSchema-instance",
        "@xsi:type": "AdresseTelephonique_Type",
        "uid": "AD48107",
        "type": "11",
        "typeLibelle": "Téléphone",
        "poids": "22",
        "adresseDeRattachement": "AD45774",
        "valElec": "02 37 36 64 64"
      },
      {
        "@xmlns:xsi": "http://www.w3.org/2001/XMLSchema-instance",
        "@xsi:type": "AdresseTelephonique_Type",
        "uid": "AD48108",
        "type": "11",
        "typeLibelle": "Téléphone",
        "poids": "21",
        "adresseDeRattachement": "AD45771",
        "valElec": "02 37 25 87 49"
      },
      {
        "@xmlns:xsi": "http://www.w3.org/2001/XMLSchema-instance",
        "@xsi:type": "AdresseTelephonique_Type",
        "uid": "AD49728",
        "type": "12",
        "typeLibelle": "Télécopie",
        "poids": "22",
        "adresseDeRattachement": "AD45774",
        "valElec": "02 37 21 76 93"
      },
      {
        "@xmlns:xsi": "http://www.w3.org/2001/XMLSchema-instance",
        "@xsi:type": "AdresseTelephonique_Type",
        "uid": "AD49729",
        "type": "12",
        "typeLibelle": "Télécopie",
        "poids": "21",
        "adresseDeRattachement": "AD45771",
        "valElec": "02 37 25 82 56"
      },
      {
        "@xmlns:xsi": "http://www.w3.org/2001/XMLSchema-instance",
        "@xsi:type": "AdresseSiteWeb_Type",
        "uid": "AD317638",
        "type": "23",
        "typeLibelle": "Url sénateur",
        "poids": null,
        "adresseDeRattachement": null,
        "valElec": "https://www.senat.fr/senateur/cornu_gerard98023q.html"
      }
    ]
  },
  "mandats": {
    "mandat": [
      {
        "@xmlns:xsi": "http://www.w3.org/2001/XMLSchema-instance",
        "@xsi:type": "MandatSimple_Type",
        "uid": "PM436959",
        "acteurRef": "PA922",
        "legislature": null,
        "typeOrgane": "DELEGSENAT",
        "dateDebut": "2011-11-30T01:00:00.000+01:00",
        "datePublication": null,
        "dateFin": null,
        "preseance": "4",
        "nominPrincipale": "1",
        "infosQualite": {
          "codeQualite": "Membre",
          "libQualite": "Membre",
          "libQualiteSex": "Membre"
        },
        "organes": {
          "organeRef": "PO310693"
        }
      },
      {
        "@xmlns:xsi": "http://www.w3.org/2001/XMLSchema-instance",
        "@xsi:type": "MandatSimple_Type",
        "uid": "PM413759",
        "acteurRef": "PA922",
        "legislature": null,
        "typeOrgane": "COMSPSENAT",
        "dateDebut": "2008-06-18T02:00:00.000+02:00",
        "datePublication": null,
        "dateFin": "2008-07-23T02:00:00.000+02:00",
        "preseance": null,
        "nominPrincipale": "1",
        "infosQualite": {
          "codeQualite": null,
          "libQualite": "Membre",
          "libQualiteSex": "Membre"
        },
        "organes": {
          "organeRef": "PO413755"
        }
      },
      {
        "@xmlns:xsi": "http://www.w3.org/2001/XMLSchema-instance",
        "@xsi:type": "MandatSimple_Type",
        "uid": "PM318578",
        "acteurRef": "PA922",
        "legislature": null,
        "typeOrgane": "DELEGSENAT",
        "dateDebut": "2001-10-10T02:00:00.000+02:00",
        "datePublication": null,
        "dateFin": "2008-09-30T02:00:00.000+02:00",
        "preseance": "4",
        "nominPrincipale": "1",
        "infosQualite": {
          "codeQualite": "Membre",
          "libQualite": "Membre",
          "libQualiteSex": "Membre"
        },
        "organes": {
          "organeRef": "PO310693"
        }
      },
      {
        "@xmlns:xsi": "http://www.w3.org/2001/XMLSchema-instance",
        "@xsi:type": "MandatSimple_Type",
        "uid": "PM704147",
        "acteurRef": "PA922",
        "legislature": null,
        "typeOrgane": "COMSENAT",
        "dateDebut": "2014-10-08T02:00:00.000+02:00",
        "datePublication": null,
        "dateFin": "2014-10-08T02:00:00.000+02:00",
        "preseance": "10",
        "nominPrincipale": "1",
        "infosQualite": {
          "codeQualite": "Membre",
          "libQualite": "Membre",
          "libQualiteSex": "Membre"
        },
        "organes": {
          "organeRef": "PO516754"
        }
      },
      {
        "@xmlns:xsi": "http://www.w3.org/2001/XMLSchema-instance",
        "@xsi:type": "MandatSimple_Type",
        "uid": "PM746486",
        "acteurRef": "PA922",
        "legislature": null,
        "typeOrgane": "CMP",
        "dateDebut": "2017-12-14T01:00:00.000+01:00",
        "datePublication": "2017-12-15T01:00:00.000+01:00",
        "dateFin": "2018-02-15T01:00:00.000+01:00",
        "preseance": "20",
        "nominPrincipale": "1",
        "infosQualite": {
          "codeQualite": "Titulaire",
          "libQualite": "Membre titulaire",
          "libQualiteSex": "Membre titulaire"
        },
        "organes": {
          "organeRef": "PO739530"
        }
      },
      {
        "@xmlns:xsi": "http://www.w3.org/2001/XMLSchema-instance",
        "@xsi:type": "MandatSimple_Type",
        "uid": "PM756783",
        "acteurRef": "PA922",
        "legislature": null,
        "typeOrgane": "CMP",
        "dateDebut": "2018-06-07T02:00:00.000+02:00",
        "datePublication": "2018-06-08T02:00:00.000+02:00",
        "dateFin": "2018-06-14T02:00:00.000+02:00",
        "preseance": "20",
        "nominPrincipale": "1",
        "infosQualite": {
          "codeQualite": "Titulaire",
          "libQualite": "Membre titulaire",
          "libQualiteSex": "Membre titulaire"
        },
        "organes": {
          "organeRef": "PO756719"
        }
      },
      {
        "@xmlns:xsi": "http://www.w3.org/2001/XMLSchema-instance",
        "@xsi:type": "MandatSimple_Type",
        "uid": "PM422668",
        "acteurRef": "PA922",
        "legislature": null,
        "typeOrgane": "CMP",
        "dateDebut": "2009-12-17T01:00:00.000+01:00",
        "datePublication": "2009-12-19T01:00:00.000+01:00",
        "dateFin": "2010-02-25T01:00:00.000+01:00",
        "preseance": "20",
        "nominPrincipale": "1",
        "infosQualite": {
          "codeQualite": "Titulaire",
          "libQualite": "Membre titulaire",
          "libQualiteSex": "Membre titulaire"
        },
        "organes": {
          "organeRef": "PO421878"
        }
      },
      {
        "@xmlns:xsi": "http://www.w3.org/2001/XMLSchema-instance",
        "@xsi:type": "MandatSimple_Type",
        "uid": "PM693741",
        "acteurRef": "PA922",
        "legislature": null,
        "typeOrgane": "CMP",
        "dateDebut": "2013-04-16T02:00:00.000+02:00",
        "datePublication": "2013-04-17T02:00:00.000+02:00",
        "dateFin": "2013-04-24T02:00:00.000+02:00",
        "preseance": "20",
        "nominPrincipale": "1",
        "infosQualite": {
          "codeQualite": "Titulaire",
          "libQualite": "Membre titulaire",
          "libQualiteSex": "Membre titulaire"
        },
        "organes": {
          "organeRef": "PO693720"
        }
      },
      {
        "@xmlns:xsi": "http://www.w3.org/2001/XMLSchema-instance",
        "@xsi:type": "MandatSimple_Type",
        "uid": "PM756845",
        "acteurRef": "PA922",
        "legislature": null,
        "typeOrgane": "CMP",
        "dateDebut": "2018-06-11T02:00:00.000+02:00",
        "datePublication": "2018-06-12T02:00:00.000+02:00",
        "dateFin": "2018-06-14T02:00:00.000+02:00",
        "preseance": "16",
        "nominPrincipale": "1",
        "infosQualite": {
          "codeQualite": "Rapporteur",
          "libQualite": "Rapporteur",
          "libQualiteSex": "Rapporteur"
        },
        "organes": {
          "organeRef": "PO756719"
        }
      },
      {
        "@xmlns:xsi": "http://www.w3.org/2001/XMLSchema-instance",
        "@xsi:type": "MandatSimple_Type",
        "uid": "PM685182",
        "acteurRef": "PA922",
        "legislature": null,
        "typeOrgane": "CMP",
        "dateDebut": "2012-11-29T01:00:00.000+01:00",
        "datePublication": "2012-11-30T01:00:00.000+01:00",
        "dateFin": "2012-12-13T01:00:00.000+01:00",
        "preseance": "20",
        "nominPrincipale": "1",
        "infosQualite": {
          "codeQualite": "Titulaire",
          "libQualite": "Membre titulaire",
          "libQualiteSex": "Membre titulaire"
        },
        "organes": {
          "organeRef": "PO684833"
        }
      },
      {
        "@xmlns:xsi": "http://www.w3.org/2001/XMLSchema-instance",
        "@xsi:type": "MandatSimple_Type",
        "uid": "PM405601",
        "acteurRef": "PA922",
        "legislature": null,
        "typeOrgane": "CMP",
        "dateDebut": "2007-12-18T01:00:00.000+01:00",
        "datePublication": "2007-12-19T01:00:00.000+01:00",
        "dateFin": "2007-12-26T01:00:00.000+01:00",
        "preseance": "16",
        "nominPrincipale": "1",
        "infosQualite": {
          "codeQualite": "Rapporteur",
          "libQualite": "Rapporteur",
          "libQualiteSex": "Rapporteur"
        },
        "organes": {
          "organeRef": "PO405441"
        }
      },
      {
        "@xmlns:xsi": "http://www.w3.org/2001/XMLSchema-instance",
        "@xsi:type": "MandatSimple_Type",
        "uid": "PM405463",
        "acteurRef": "PA922",
        "legislature": null,
        "typeOrgane": "CMP",
        "dateDebut": "2007-12-14T01:00:00.000+01:00",
        "datePublication": "2007-12-18T01:00:00.000+01:00",
        "dateFin": "2007-12-26T01:00:00.000+01:00",
        "preseance": "20",
        "nominPrincipale": "1",
        "infosQualite": {
          "codeQualite": "Titulaire",
          "libQualite": "Membre titulaire",
          "libQualiteSex": "Membre titulaire"
        },
        "organes": {
          "organeRef": "PO405441"
        }
      },
      {
        "@xmlns:xsi": "http://www.w3.org/2001/XMLSchema-instance",
        "@xsi:type": "MandatSimple_Type",
        "uid": "PM699843",
        "acteurRef": "PA922",
        "legislature": null,
        "typeOrgane": "CMP",
        "dateDebut": "2014-01-30T01:00:00.000+01:00",
        "datePublication": "2014-02-06T01:00:00.000+01:00",
        "dateFin": "2014-02-17T01:00:00.000+01:00",
        "preseance": "20",
        "nominPrincipale": "1",
        "infosQualite": {
          "codeQualite": "Titulaire",
          "libQualite": "Membre titulaire",
          "libQualiteSex": "Membre titulaire"
        },
        "organes": {
          "organeRef": "PO699729"
        }
      },
      {
        "@xmlns:xsi": "http://www.w3.org/2001/XMLSchema-instance",
        "@xsi:type": "MandatSimple_Type",
        "uid": "PM320156",
        "acteurRef": "PA922",
        "legislature": null,
        "typeOrgane": "COMSENAT",
        "dateDebut": "2004-10-07T02:00:00.000+02:00",
        "datePublication": null,
        "dateFin": "2008-10-06T02:00:00.000+02:00",
        "preseance": null,
        "nominPrincipale": "1",
        "infosQualite": {
          "codeQualite": null,
          "libQualite": "Vice-Président",
          "libQualiteSex": "Vice-Président"
        },
        "organes": {
          "organeRef": "PO211492"
        }
      },
      {
        "@xmlns:xsi": "http://www.w3.org/2001/XMLSchema-instance",
        "@xsi:type": "MandatSimple_Type",
        "uid": "PM416039",
        "acteurRef": "PA922",
        "legislature": null,
        "typeOrgane": "COMSENAT",
        "dateDebut": "2008-10-07T02:00:00.000+02:00",
        "datePublication": null,
        "dateFin": "2012-02-20T01:00:00.000+01:00",
        "preseance": null,
        "nominPrincipale": "1",
        "infosQualite": {
          "codeQualite": null,
          "libQualite": "Vice-Président",
          "libQualiteSex": "Vice-Président"
        },
        "organes": {
          "organeRef": "PO211492"
        }
      },
      {
        "@xmlns:xsi": "http://www.w3.org/2001/XMLSchema-instance",
        "@xsi:type": "MandatSimple_Type",
        "uid": "PM704207",
        "acteurRef": "PA922",
        "legislature": null,
        "typeOrgane": "COMSENAT",
        "dateDebut": "2014-10-09T02:00:00.000+02:00",
        "datePublication": null,
        "dateFin": "2017-10-04T02:00:00.000+02:00",
        "preseance": null,
        "nominPrincipale": "1",
        "infosQualite": {
          "codeQualite": null,
          "libQualite": "Vice-Président",
          "libQualiteSex": "Vice-Président"
        },
        "organes": {
          "organeRef": "PO516754"
        }
      },
      {
        "@xmlns:xsi": "http://www.w3.org/2001/XMLSchema-instance",
        "@xsi:type": "MandatSimple_Type",
        "uid": "PM516782",
        "acteurRef": "PA922",
        "legislature": null,
        "typeOrgane": "COMSENAT",
        "dateDebut": "2012-02-21T01:00:00.000+01:00",
        "datePublication": null,
        "dateFin": "2014-10-07T02:00:00.000+02:00",
        "preseance": null,
        "nominPrincipale": "1",
        "infosQualite": {
          "codeQualite": null,
          "libQualite": "Vice-Président",
          "libQualiteSex": "Vice-Président"
        },
        "organes": {
          "organeRef": "PO516754"
        }
      },
      {
        "@xmlns:xsi": "http://www.w3.org/2001/XMLSchema-instance",
        "@xsi:type": "MandatSimple_Type",
        "uid": "PM741272",
        "acteurRef": "PA922",
        "legislature": null,
        "typeOrgane": "COMSENAT",
        "dateDebut": "2017-10-05T02:00:00.000+02:00",
        "datePublication": null,
        "dateFin": "2018-12-30T01:00:00.000+01:00",
        "preseance": null,
        "nominPrincipale": "1",
        "infosQualite": {
          "codeQualite": null,
          "libQualite": "Vice-Président",
          "libQualiteSex": "Vice-Président"
        },
        "organes": {
          "organeRef": "PO516754"
        }
      },
      {
        "@xmlns:xsi": "http://www.w3.org/2001/XMLSchema-instance",
        "@xsi:type": "MandatSimple_Type",
        "uid": "PM286461",
        "acteurRef": "PA922",
        "legislature": null,
        "typeOrgane": "GROUPESENAT",
        "dateDebut": "2002-12-11T01:00:00.000+01:00",
        "datePublication": "2002-12-11T01:00:00.000+01:00",
        "dateFin": "2018-12-30T01:00:00.000+01:00",
        "preseance": "8",
        "nominPrincipale": "1",
        "infosQualite": {
          "codeQualite": "Membre apparenté",
          "libQualite": "Membre apparenté",
          "libQualiteSex": "Membre apparenté"
        },
        "organes": {
          "organeRef": "PO286005"
        }
      },
      {
        "@xmlns:xsi": "http://www.w3.org/2001/XMLSchema-instance",
        "@xsi:type": "MandatParlementaire_type",
        "uid": "PM89631",
        "acteurRef": "PA922",
        "legislature": null,
        "typeOrgane": "SENAT",
        "dateDebut": "1998-10-01T02:00:00.000+02:00",
        "datePublication": "1998-10-02T02:00:00.000+02:00",
        "dateFin": "2008-09-30T02:00:00.000+02:00",
        "preseance": "20",
        "nominPrincipale": "1",
        "infosQualite": {
          "codeQualite": "Sénateur",
          "libQualite": "SENATEUR",
          "libQualiteSex": "SENATEUR"
        },
        "organes": {
          "organeRef": "PO78718"
        },
        "suppleants": null,
        "chambre": null,
        "election": {
          "lieu": {
            "region": null,
            "regionType": null,
            "departement": null,
            "numDepartement": "28",
            "numCirco": null
          },
          "causeMandat": null
        },
        "mandature": {
          "datePriseFonction": null,
          "causeFin": null,
          "premiereElection": "0",
          "placeHemicycle": null,
          "mandatRemplaceRef": null
        },
        "collaborateurs": null
      },
      {
        "@xmlns:xsi": "http://www.w3.org/2001/XMLSchema-instance",
        "@xsi:type": "MandatParlementaire_type",
        "uid": "PM415515",
        "acteurRef": "PA922",
        "legislature": null,
        "typeOrgane": "SENAT",
        "dateDebut": "2008-10-01T02:00:00.000+02:00",
        "datePublication": null,
        "dateFin": "2014-09-30T02:00:00.000+02:00",
        "preseance": "20",
        "nominPrincipale": "1",
        "infosQualite": {
          "codeQualite": "Sénateur",
          "libQualite": "SENATEUR",
          "libQualiteSex": "SENATEUR"
        },
        "organes": {
          "organeRef": "PO78718"
        },
        "suppleants": null,
        "chambre": null,
        "election": {
          "lieu": {
            "region": null,
            "regionType": null,
            "departement": null,
            "numDepartement": "28",
            "numCirco": null
          },
          "causeMandat": null
        },
        "mandature": {
          "datePriseFonction": null,
          "causeFin": null,
          "premiereElection": "0",
          "placeHemicycle": null,
          "mandatRemplaceRef": null
        },
        "collaborateurs": null
      },
      {
        "@xmlns:xsi": "http://www.w3.org/2001/XMLSchema-instance",
        "@xsi:type": "MandatParlementaire_type",
        "uid": "PM703609",
        "acteurRef": "PA922",
        "legislature": null,
        "typeOrgane": "SENAT",
        "dateDebut": "2014-10-01T02:00:00.000+02:00",
        "datePublication": null,
        "dateFin": "2018-12-30T01:00:00.000+01:00",
        "preseance": "20",
        "nominPrincipale": "1",
        "infosQualite": {
          "codeQualite": "Sénateur",
          "libQualite": "SENATEUR",
          "libQualiteSex": "SENATEUR"
        },
        "organes": {
          "organeRef": "PO78718"
        },
        "suppleants": null,
        "chambre": null,
        "election": {
          "lieu": {
            "region": null,
            "regionType": null,
            "departement": null,
            "numDepartement": "28",
            "numCirco": null
          },
          "causeMandat": null
        },
        "mandature": {
          "datePriseFonction": null,
          "causeFin": null,
          "premiereElection": "0",
          "placeHemicycle": null,
          "mandatRemplaceRef": null
        },
        "collaborateurs": null
      },
      {
        "@xmlns:xsi": "http://www.w3.org/2001/XMLSchema-instance",
        "@xsi:type": "MandatSimple_Type",
        "uid": "PM709987",
        "acteurRef": "PA922",
        "legislature": null,
        "typeOrgane": "CMP",
        "dateDebut": "2015-11-05T01:00:00.000+01:00",
        "datePublication": "2015-11-06T01:00:00.000+01:00",
        "dateFin": "2015-11-18T01:00:00.000+01:00",
        "preseance": "28",
        "nominPrincipale": "1",
        "infosQualite": {
          "codeQualite": "Suppléant",
          "libQualite": "Membre suppléant",
          "libQualiteSex": "Membre suppléant"
        },
        "organes": {
          "organeRef": "PO709822"
        }
      },
      {
        "@xmlns:xsi": "http://www.w3.org/2001/XMLSchema-instance",
        "@xsi:type": "MandatSimple_Type",
        "uid": "PM422756",
        "acteurRef": "PA922",
        "legislature": null,
        "typeOrgane": "CMP",
        "dateDebut": "2009-12-22T01:00:00.000+01:00",
        "datePublication": "2009-12-23T01:00:00.000+01:00",
        "dateFin": "2010-01-19T01:00:00.000+01:00",
        "preseance": "28",
        "nominPrincipale": "1",
        "infosQualite": {
          "codeQualite": "Suppléant",
          "libQualite": "Membre suppléant",
          "libQualiteSex": "Membre suppléant"
        },
        "organes": {
          "organeRef": "PO422730"
        }
      },
      {
        "@xmlns:xsi": "http://www.w3.org/2001/XMLSchema-instance",
        "@xsi:type": "MandatSimple_Type",
        "uid": "PM709962",
        "acteurRef": "PA922",
        "legislature": null,
        "typeOrgane": "CMP",
        "dateDebut": "2015-10-26T01:00:00.000+01:00",
        "datePublication": "2015-11-06T01:00:00.000+01:00",
        "dateFin": "2015-11-18T01:00:00.000+01:00",
        "preseance": "28",
        "nominPrincipale": "1",
        "infosQualite": {
          "codeQualite": "Suppléant",
          "libQualite": "Membre suppléant",
          "libQualiteSex": "Membre suppléant"
        },
        "organes": {
          "organeRef": "PO709711"
        }
      },
      {
        "@xmlns:xsi": "http://www.w3.org/2001/XMLSchema-instance",
        "@xsi:type": "MandatSimple_Type",
        "uid": "PM418518",
        "acteurRef": "PA922",
        "legislature": null,
        "typeOrgane": "CMP",
        "dateDebut": "2009-02-11T01:00:00.000+01:00",
        "datePublication": "2009-02-12T01:00:00.000+01:00",
        "dateFin": "2009-02-19T01:00:00.000+01:00",
        "preseance": "28",
        "nominPrincipale": "1",
        "infosQualite": {
          "codeQualite": "Suppléant",
          "libQualite": "Membre suppléant",
          "libQualiteSex": "Membre suppléant"
        },
        "organes": {
          "organeRef": "PO418487"
        }
      },
      {
        "@xmlns:xsi": "http://www.w3.org/2001/XMLSchema-instance",
        "@xsi:type": "MandatSimple_Type",
        "uid": "PM695019",
        "acteurRef": "PA922",
        "legislature": null,
        "typeOrgane": "CMP",
        "dateDebut": "2013-06-05T02:00:00.000+02:00",
        "datePublication": "2013-06-06T02:00:00.000+02:00",
        "dateFin": "2013-07-02T02:00:00.000+02:00",
        "preseance": "28",
        "nominPrincipale": "1",
        "infosQualite": {
          "codeQualite": "Suppléant",
          "libQualite": "Membre suppléant",
          "libQualiteSex": "Membre suppléant"
        },
        "organes": {
          "organeRef": "PO694654"
        }
      },
      {
        "@xmlns:xsi": "http://www.w3.org/2001/XMLSchema-instance",
        "@xsi:type": "MandatSimple_Type",
        "uid": "PM701436",
        "acteurRef": "PA922",
        "legislature": null,
        "typeOrgane": "CMP",
        "dateDebut": "2014-05-20T02:00:00.000+02:00",
        "datePublication": "2014-05-21T02:00:00.000+02:00",
        "dateFin": "2014-06-19T02:00:00.000+02:00",
        "preseance": "28",
        "nominPrincipale": "1",
        "infosQualite": {
          "codeQualite": "Suppléant",
          "libQualite": "Membre suppléant",
          "libQualiteSex": "Membre suppléant"
        },
        "organes": {
          "organeRef": "PO701387"
        }
      },
      {
        "@xmlns:xsi": "http://www.w3.org/2001/XMLSchema-instance",
        "@xsi:type": "MandatSimple_Type",
        "uid": "PM426395",
        "acteurRef": "PA922",
        "legislature": null,
        "typeOrgane": "CMP",
        "dateDebut": "2010-12-20T01:00:00.000+01:00",
        "datePublication": "2010-12-22T01:00:00.000+01:00",
        "dateFin": "2010-12-23T01:00:00.000+01:00",
        "preseance": "28",
        "nominPrincipale": "1",
        "infosQualite": {
          "codeQualite": "Suppléant",
          "libQualite": "Membre suppléant",
          "libQualiteSex": "Membre suppléant"
        },
        "organes": {
          "organeRef": "PO426365"
        }
      },
      {
        "@xmlns:xsi": "http://www.w3.org/2001/XMLSchema-instance",
        "@xsi:type": "MandatSimple_Type",
        "uid": "PM702498",
        "acteurRef": "PA922",
        "legislature": null,
        "typeOrgane": "CMP",
        "dateDebut": "2014-07-11T02:00:00.000+02:00",
        "datePublication": "2014-07-16T02:00:00.000+02:00",
        "dateFin": "2014-07-22T02:00:00.000+02:00",
        "preseance": "28",
        "nominPrincipale": "1",
        "infosQualite": {
          "codeQualite": "Suppléant",
          "libQualite": "Membre suppléant",
          "libQualiteSex": "Membre suppléant"
        },
        "organes": {
          "organeRef": "PO702431"
        }
      },
      {
        "@xmlns:xsi": "http://www.w3.org/2001/XMLSchema-instance",
        "@xsi:type": "MandatSimple_Type",
        "uid": "PM704716",
        "acteurRef": "PA922",
        "legislature": null,
        "typeOrgane": "CMP",
        "dateDebut": "2014-11-19T01:00:00.000+01:00",
        "datePublication": "2014-11-21T01:00:00.000+01:00",
        "dateFin": "2014-12-18T01:00:00.000+01:00",
        "preseance": "28",
        "nominPrincipale": "1",
        "infosQualite": {
          "codeQualite": "Suppléant",
          "libQualite": "Membre suppléant",
          "libQualiteSex": "Membre suppléant"
        },
        "organes": {
          "organeRef": "PO704567"
        }
      },
      {
        "@xmlns:xsi": "http://www.w3.org/2001/XMLSchema-instance",
        "@xsi:type": "MandatSimple_Type",
        "uid": "PM702471",
        "acteurRef": "PA922",
        "legislature": null,
        "typeOrgane": "CMP",
        "dateDebut": "2014-07-11T02:00:00.000+02:00",
        "datePublication": "2014-07-16T02:00:00.000+02:00",
        "dateFin": "2014-07-22T02:00:00.000+02:00",
        "preseance": "28",
        "nominPrincipale": "1",
        "infosQualite": {
          "codeQualite": "Suppléant",
          "libQualite": "Membre suppléant",
          "libQualiteSex": "Membre suppléant"
        },
        "organes": {
          "organeRef": "PO702437"
        }
      },
      {
        "@xmlns:xsi": "http://www.w3.org/2001/XMLSchema-instance",
        "@xsi:type": "MandatSimple_Type",
        "uid": "PM715612",
        "acteurRef": "PA922",
        "legislature": null,
        "typeOrgane": "CMP",
        "dateDebut": "2016-11-23T01:00:00.000+01:00",
        "datePublication": "2016-11-25T01:00:00.000+01:00",
        "dateFin": "2016-12-01T01:00:00.000+01:00",
        "preseance": "28",
        "nominPrincipale": "1",
        "infosQualite": {
          "codeQualite": "Suppléant",
          "libQualite": "Membre suppléant",
          "libQualiteSex": "Membre suppléant"
        },
        "organes": {
          "organeRef": "PO715055"
        }
      },
      {
        "@xmlns:xsi": "http://www.w3.org/2001/XMLSchema-instance",
        "@xsi:type": "MandatSimple_Type",
        "uid": "PM428853",
        "acteurRef": "PA922",
        "legislature": null,
        "typeOrgane": "CMP",
        "dateDebut": "2011-06-14T02:00:00.000+02:00",
        "datePublication": "2011-06-15T02:00:00.000+02:00",
        "dateFin": "2011-07-25T02:00:00.000+02:00",
        "preseance": "28",
        "nominPrincipale": "1",
        "infosQualite": {
          "codeQualite": "Suppléant",
          "libQualite": "Membre suppléant",
          "libQualiteSex": "Membre suppléant"
        },
        "organes": {
          "organeRef": "PO428793"
        }
      }
    ]
  }
}