{
  "@xmlns": "http://schemas.assemblee-nationale.fr/referentiel",
  "@xmlns:xsi": "http://www.w3.org/2001/XMLSchema-instance",
  "@xsi:type": "OrganeExterne_Type",
  "uid": "PO700843",
  "codeType": "MINISTERE",
  "libelle": "Secrétariat d'État, auprès du ministre des affaires étrangères et du développement international, chargé du développement et de la francophonie",
  "libelleEdition": ", auprès du ministre des affaires étrangères et du développement international, chargée du développement et de la francophonie",
  "libelleAbrege": "Francophonie",
  "libelleAbrev": "FRP",
  "viMoDe": {
    "dateDebut": "2014-04-10T02:00:00.000+02:00",
    "dateAgrement": null,
    "dateFin": "2014-08-26T02:00:00.000+02:00"
  },
  "organeParent": "PO700706"
}