{
  "@xmlns": "http://schemas.assemblee-nationale.fr/referentiel",
  "@xmlns:xsi": "http://www.w3.org/2001/XMLSchema-instance",
  "@xsi:type": "OrganeExterne_Type",
  "uid": "PO211494",
  "codeType": "COMSENAT",
  "libelle": "Commission des finances",
  "libelleEdition": "de la commission des finances",
  "libelleAbrege": "Finances",
  "libelleAbrev": "FINCC",
  "viMoDe": {
    "dateDebut": "1900-01-01T00:00:00.000+00:00",
    "dateAgrement": null,
    "dateFin": null
  },
  "organeParent": null
}