{
  "@xmlns": "http://schemas.assemblee-nationale.fr/referentiel",
  "uid": {
    "@xmlns:xsi": "http://www.w3.org/2001/XMLSchema-instance",
    "@xsi:type": "IdActeur_type",
    "#text": "PA227440"
  },
  "etatCivil": {
    "ident": {
      "civ": "M.",
      "prenom": "Christian",
      "nom": "Cointat",
      "alpha": "COINTAT",
      "trigramme": {
        "@xmlns:xsi": "http://www.w3.org/2001/XMLSchema-instance",
        "@xsi:nil": "true"
      }
    },
    "infoNaissance": {
      "dateNais": "1943-07-11T02:00:00.000+02:00",
      "villeNais": {
        "@xmlns:xsi": "http://www.w3.org/2001/XMLSchema-instance",
        "@xsi:nil": "true"
      },
      "depNais": {
        "@xmlns:xsi": "http://www.w3.org/2001/XMLSchema-instance",
        "@xsi:nil": "true"
      },
      "paysNais": {
        "@xmlns:xsi": "http://www.w3.org/2001/XMLSchema-instance",
        "@xsi:nil": "true"
      }
    },
    "dateDeces": {
      "@xmlns:xsi": "http://www.w3.org/2001/XMLSchema-instance",
      "@xsi:nil": "true"
    }
  },
  "profession": {
    "libelleCourant": {
      "@xmlns:xsi": "http://www.w3.org/2001/XMLSchema-instance",
      "@xsi:nil": "true"
    },
    "socProcINSEE": {
      "catSocPro": {
        "@xmlns:xsi": "http://www.w3.org/2001/XMLSchema-instance",
        "@xsi:nil": "true"
      },
      "famSocPro": {
        "@xmlns:xsi": "http://www.w3.org/2001/XMLSchema-instance",
        "@xsi:nil": "true"
      }
    }
  },
  "uri_hatvp": {
    "@xmlns:xsi": "http://www.w3.org/2001/XMLSchema-instance",
    "@xsi:nil": "true"
  },
  "adresses": {
    "adresse": {
      "@xmlns:xsi": "http://www.w3.org/2001/XMLSchema-instance",
      "@xsi:type": "AdresseSiteWeb_Type",
      "uid": "AD317019",
      "type": "23",
      "typeLibelle": "Url sénateur",
      "poids": null,
      "adresseDeRattachement": null,
      "valElec": "https://www.senat.fr/senateur/cointat_christian01063u.html"
    }
  },
  "mandats": {
    "mandat": [
      {
        "@xmlns:xsi": "http://www.w3.org/2001/XMLSchema-instance",
        "@xsi:type": "MandatSimple_Type",
        "uid": "PM699921",
        "acteurRef": "PA227440",
        "legislature": null,
        "typeOrgane": "COMSPSENAT",
        "dateDebut": "2014-01-22T01:00:00.000+01:00",
        "datePublication": null,
        "dateFin": "2014-09-29T02:00:00.000+02:00",
        "preseance": null,
        "nominPrincipale": "1",
        "infosQualite": {
          "codeQualite": null,
          "libQualite": "Membre",
          "libQualiteSex": "Membre"
        },
        "organes": {
          "organeRef": "PO699895"
        }
      },
      {
        "@xmlns:xsi": "http://www.w3.org/2001/XMLSchema-instance",
        "@xsi:type": "MandatSimple_Type",
        "uid": "PM437001",
        "acteurRef": "PA227440",
        "legislature": null,
        "typeOrgane": "DELEGSENAT",
        "dateDebut": "2011-11-30T01:00:00.000+01:00",
        "datePublication": null,
        "dateFin": null,
        "preseance": "4",
        "nominPrincipale": "1",
        "infosQualite": {
          "codeQualite": "Membre",
          "libQualite": "Membre",
          "libQualiteSex": "Membre"
        },
        "organes": {
          "organeRef": "PO436945"
        }
      },
      {
        "@xmlns:xsi": "http://www.w3.org/2001/XMLSchema-instance",
        "@xsi:type": "MandatSimple_Type",
        "uid": "PM320788",
        "acteurRef": "PA227440",
        "legislature": null,
        "typeOrgane": "DELEGSENAT",
        "dateDebut": "2004-10-13T02:00:00.000+02:00",
        "datePublication": null,
        "dateFin": "2008-10-07T02:00:00.000+02:00",
        "preseance": "4",
        "nominPrincipale": "1",
        "infosQualite": {
          "codeQualite": "Membre",
          "libQualite": "Membre",
          "libQualiteSex": "Membre"
        },
        "organes": {
          "organeRef": "PO317934"
        }
      },
      {
        "@xmlns:xsi": "http://www.w3.org/2001/XMLSchema-instance",
        "@xsi:type": "MandatSimple_Type",
        "uid": "PM320195",
        "acteurRef": "PA227440",
        "legislature": null,
        "typeOrgane": "COMSENAT",
        "dateDebut": "2004-10-07T02:00:00.000+02:00",
        "datePublication": null,
        "dateFin": "2008-10-06T02:00:00.000+02:00",
        "preseance": null,
        "nominPrincipale": "1",
        "infosQualite": {
          "codeQualite": null,
          "libQualite": "Secrétaire",
          "libQualiteSex": "Secrétaire"
        },
        "organes": {
          "organeRef": "PO211495"
        }
      },
      {
        "@xmlns:xsi": "http://www.w3.org/2001/XMLSchema-instance",
        "@xsi:type": "MandatSimple_Type",
        "uid": "PM416010",
        "acteurRef": "PA227440",
        "legislature": null,
        "typeOrgane": "COMSENAT",
        "dateDebut": "2008-10-07T02:00:00.000+02:00",
        "datePublication": null,
        "dateFin": "2014-09-30T02:00:00.000+02:00",
        "preseance": null,
        "nominPrincipale": "1",
        "infosQualite": {
          "codeQualite": null,
          "libQualite": "Secrétaire",
          "libQualiteSex": "Secrétaire"
        },
        "organes": {
          "organeRef": "PO211495"
        }
      },
      {
        "@xmlns:xsi": "http://www.w3.org/2001/XMLSchema-instance",
        "@xsi:type": "MandatSimple_Type",
        "uid": "PM286460",
        "acteurRef": "PA227440",
        "legislature": null,
        "typeOrgane": "GROUPESENAT",
        "dateDebut": "2002-12-11T01:00:00.000+01:00",
        "datePublication": "2002-12-11T01:00:00.000+01:00",
        "dateFin": "2014-09-29T02:00:00.000+02:00",
        "preseance": "4",
        "nominPrincipale": "1",
        "infosQualite": {
          "codeQualite": "Membre",
          "libQualite": "Membre",
          "libQualiteSex": "Membre"
        },
        "organes": {
          "organeRef": "PO286005"
        }
      },
      {
        "@xmlns:xsi": "http://www.w3.org/2001/XMLSchema-instance",
        "@xsi:type": "MandatSimple_Type",
        "uid": "PM429393",
        "acteurRef": "PA227440",
        "legislature": null,
        "typeOrgane": "CMP",
        "dateDebut": "2011-07-05T02:00:00.000+02:00",
        "datePublication": "2011-07-06T02:00:00.000+02:00",
        "dateFin": "2011-07-25T02:00:00.000+02:00",
        "preseance": "16",
        "nominPrincipale": "1",
        "infosQualite": {
          "codeQualite": "Rapporteur",
          "libQualite": "Rapporteur",
          "libQualiteSex": "Rapporteur"
        },
        "organes": {
          "organeRef": "PO429207"
        }
      },
      {
        "@xmlns:xsi": "http://www.w3.org/2001/XMLSchema-instance",
        "@xsi:type": "MandatSimple_Type",
        "uid": "PM421317",
        "acteurRef": "PA227440",
        "legislature": null,
        "typeOrgane": "CMP",
        "dateDebut": "2009-07-22T02:00:00.000+02:00",
        "datePublication": "2009-07-23T02:00:00.000+02:00",
        "dateFin": "2009-09-01T02:00:00.000+02:00",
        "preseance": "16",
        "nominPrincipale": "1",
        "infosQualite": {
          "codeQualite": "Rapporteur",
          "libQualite": "Rapporteur",
          "libQualiteSex": "Rapporteur"
        },
        "organes": {
          "organeRef": "PO421243"
        }
      },
      {
        "@xmlns:xsi": "http://www.w3.org/2001/XMLSchema-instance",
        "@xsi:type": "MandatSimple_Type",
        "uid": "PM697405",
        "acteurRef": "PA227440",
        "legislature": null,
        "typeOrgane": "CMP",
        "dateDebut": "2013-10-03T02:00:00.000+02:00",
        "datePublication": "2013-10-05T02:00:00.000+02:00",
        "dateFin": "2013-10-31T01:00:00.000+01:00",
        "preseance": "20",
        "nominPrincipale": "1",
        "infosQualite": {
          "codeQualite": "Titulaire",
          "libQualite": "Membre titulaire",
          "libQualiteSex": "Membre titulaire"
        },
        "organes": {
          "organeRef": "PO697360"
        }
      },
      {
        "@xmlns:xsi": "http://www.w3.org/2001/XMLSchema-instance",
        "@xsi:type": "MandatSimple_Type",
        "uid": "PM429256",
        "acteurRef": "PA227440",
        "legislature": null,
        "typeOrgane": "CMP",
        "dateDebut": "2011-07-01T02:00:00.000+02:00",
        "datePublication": "2011-07-02T02:00:00.000+02:00",
        "dateFin": "2011-07-25T02:00:00.000+02:00",
        "preseance": "20",
        "nominPrincipale": "1",
        "infosQualite": {
          "codeQualite": "Titulaire",
          "libQualite": "Membre titulaire",
          "libQualiteSex": "Membre titulaire"
        },
        "organes": {
          "organeRef": "PO429163"
        }
      },
      {
        "@xmlns:xsi": "http://www.w3.org/2001/XMLSchema-instance",
        "@xsi:type": "MandatSimple_Type",
        "uid": "PM421291",
        "acteurRef": "PA227440",
        "legislature": null,
        "typeOrgane": "CMP",
        "dateDebut": "2009-07-21T02:00:00.000+02:00",
        "datePublication": "2009-07-22T02:00:00.000+02:00",
        "dateFin": "2009-09-01T02:00:00.000+02:00",
        "preseance": "20",
        "nominPrincipale": "1",
        "infosQualite": {
          "codeQualite": "Titulaire",
          "libQualite": "Membre titulaire",
          "libQualiteSex": "Membre titulaire"
        },
        "organes": {
          "organeRef": "PO421237"
        }
      },
      {
        "@xmlns:xsi": "http://www.w3.org/2001/XMLSchema-instance",
        "@xsi:type": "MandatSimple_Type",
        "uid": "PM429270",
        "acteurRef": "PA227440",
        "legislature": null,
        "typeOrgane": "CMP",
        "dateDebut": "2011-06-30T02:00:00.000+02:00",
        "datePublication": "2011-07-02T02:00:00.000+02:00",
        "dateFin": "2011-07-25T02:00:00.000+02:00",
        "preseance": "20",
        "nominPrincipale": "1",
        "infosQualite": {
          "codeQualite": "Titulaire",
          "libQualite": "Membre titulaire",
          "libQualiteSex": "Membre titulaire"
        },
        "organes": {
          "organeRef": "PO429180"
        }
      },
      {
        "@xmlns:xsi": "http://www.w3.org/2001/XMLSchema-instance",
        "@xsi:type": "MandatSimple_Type",
        "uid": "PM421264",
        "acteurRef": "PA227440",
        "legislature": null,
        "typeOrgane": "CMP",
        "dateDebut": "2009-07-21T02:00:00.000+02:00",
        "datePublication": "2009-07-22T02:00:00.000+02:00",
        "dateFin": "2009-09-01T02:00:00.000+02:00",
        "preseance": "20",
        "nominPrincipale": "1",
        "infosQualite": {
          "codeQualite": "Titulaire",
          "libQualite": "Membre titulaire",
          "libQualiteSex": "Membre titulaire"
        },
        "organes": {
          "organeRef": "PO421243"
        }
      },
      {
        "@xmlns:xsi": "http://www.w3.org/2001/XMLSchema-instance",
        "@xsi:type": "MandatSimple_Type",
        "uid": "PM429386",
        "acteurRef": "PA227440",
        "legislature": null,
        "typeOrgane": "CMP",
        "dateDebut": "2011-07-05T02:00:00.000+02:00",
        "datePublication": "2011-07-06T02:00:00.000+02:00",
        "dateFin": "2011-07-25T02:00:00.000+02:00",
        "preseance": "16",
        "nominPrincipale": "1",
        "infosQualite": {
          "codeQualite": "Rapporteur",
          "libQualite": "Rapporteur",
          "libQualiteSex": "Rapporteur"
        },
        "organes": {
          "organeRef": "PO429180"
        }
      },
      {
        "@xmlns:xsi": "http://www.w3.org/2001/XMLSchema-instance",
        "@xsi:type": "MandatSimple_Type",
        "uid": "PM429390",
        "acteurRef": "PA227440",
        "legislature": null,
        "typeOrgane": "CMP",
        "dateDebut": "2011-07-05T02:00:00.000+02:00",
        "datePublication": "2011-07-06T02:00:00.000+02:00",
        "dateFin": "2011-07-25T02:00:00.000+02:00",
        "preseance": "16",
        "nominPrincipale": "1",
        "infosQualite": {
          "codeQualite": "Rapporteur",
          "libQualite": "Rapporteur",
          "libQualiteSex": "Rapporteur"
        },
        "organes": {
          "organeRef": "PO429163"
        }
      },
      {
        "@xmlns:xsi": "http://www.w3.org/2001/XMLSchema-instance",
        "@xsi:type": "MandatSimple_Type",
        "uid": "PM697433",
        "acteurRef": "PA227440",
        "legislature": null,
        "typeOrgane": "CMP",
        "dateDebut": "2013-10-03T02:00:00.000+02:00",
        "datePublication": "2013-10-04T02:00:00.000+02:00",
        "dateFin": "2013-10-31T01:00:00.000+01:00",
        "preseance": "20",
        "nominPrincipale": "1",
        "infosQualite": {
          "codeQualite": "Titulaire",
          "libQualite": "Membre titulaire",
          "libQualiteSex": "Membre titulaire"
        },
        "organes": {
          "organeRef": "PO697366"
        }
      },
      {
        "@xmlns:xsi": "http://www.w3.org/2001/XMLSchema-instance",
        "@xsi:type": "MandatSimple_Type",
        "uid": "PM421320",
        "acteurRef": "PA227440",
        "legislature": null,
        "typeOrgane": "CMP",
        "dateDebut": "2009-07-22T02:00:00.000+02:00",
        "datePublication": "2009-07-23T02:00:00.000+02:00",
        "dateFin": "2009-09-01T02:00:00.000+02:00",
        "preseance": "16",
        "nominPrincipale": "1",
        "infosQualite": {
          "codeQualite": "Rapporteur",
          "libQualite": "Rapporteur",
          "libQualiteSex": "Rapporteur"
        },
        "organes": {
          "organeRef": "PO421237"
        }
      },
      {
        "@xmlns:xsi": "http://www.w3.org/2001/XMLSchema-instance",
        "@xsi:type": "MandatSimple_Type",
        "uid": "PM429296",
        "acteurRef": "PA227440",
        "legislature": null,
        "typeOrgane": "CMP",
        "dateDebut": "2011-07-01T02:00:00.000+02:00",
        "datePublication": "2011-07-01T02:00:00.000+02:00",
        "dateFin": "2011-07-25T02:00:00.000+02:00",
        "preseance": "20",
        "nominPrincipale": "1",
        "infosQualite": {
          "codeQualite": "Titulaire",
          "libQualite": "Membre titulaire",
          "libQualiteSex": "Membre titulaire"
        },
        "organes": {
          "organeRef": "PO429207"
        }
      },
      {
        "@xmlns:xsi": "http://www.w3.org/2001/XMLSchema-instance",
        "@xsi:type": "MandatSimple_Type",
        "uid": "PM408140",
        "acteurRef": "PA227440",
        "legislature": null,
        "typeOrgane": "CMP",
        "dateDebut": "2008-02-01T01:00:00.000+01:00",
        "datePublication": null,
        "dateFin": "2008-02-07T01:00:00.000+01:00",
        "preseance": "28",
        "nominPrincipale": "1",
        "infosQualite": {
          "codeQualite": "Suppléant",
          "libQualite": "Membre suppléant",
          "libQualiteSex": "Membre suppléant"
        },
        "organes": {
          "organeRef": "PO408111"
        }
      },
      {
        "@xmlns:xsi": "http://www.w3.org/2001/XMLSchema-instance",
        "@xsi:type": "MandatParlementaire_type",
        "uid": "PM303977",
        "acteurRef": "PA227440",
        "legislature": null,
        "typeOrgane": "SENAT",
        "dateDebut": "2004-10-01T02:00:00.000+02:00",
        "datePublication": "2004-10-02T02:00:00.000+02:00",
        "dateFin": "2014-09-30T02:00:00.000+02:00",
        "preseance": "20",
        "nominPrincipale": "1",
        "infosQualite": {
          "codeQualite": "Sénateur",
          "libQualite": "SENATEUR",
          "libQualiteSex": "SENATEUR"
        },
        "organes": {
          "organeRef": "PO78718"
        },
        "suppleants": null,
        "chambre": null,
        "election": {
          "lieu": {
            "region": null,
            "regionType": null,
            "departement": null,
            "numDepartement": "997",
            "numCirco": null
          },
          "causeMandat": null
        },
        "mandature": {
          "datePriseFonction": null,
          "causeFin": null,
          "premiereElection": "0",
          "placeHemicycle": null,
          "mandatRemplaceRef": null
        },
        "collaborateurs": null
      },
      {
        "@xmlns:xsi": "http://www.w3.org/2001/XMLSchema-instance",
        "@xsi:type": "MandatSimple_Type",
        "uid": "PM392569",
        "acteurRef": "PA227440",
        "legislature": null,
        "typeOrgane": "CMP",
        "dateDebut": "2007-07-19T02:00:00.000+02:00",
        "datePublication": "2007-07-24T02:00:00.000+02:00",
        "dateFin": "2007-07-26T02:00:00.000+02:00",
        "preseance": "28",
        "nominPrincipale": "1",
        "infosQualite": {
          "codeQualite": "Suppléant",
          "libQualite": "Membre suppléant",
          "libQualiteSex": "Membre suppléant"
        },
        "organes": {
          "organeRef": "PO392541"
        }
      },
      {
        "@xmlns:xsi": "http://www.w3.org/2001/XMLSchema-instance",
        "@xsi:type": "MandatSimple_Type",
        "uid": "PM421013",
        "acteurRef": "PA227440",
        "legislature": null,
        "typeOrgane": "CMP",
        "dateDebut": "2009-07-07T02:00:00.000+02:00",
        "datePublication": "2009-07-08T02:00:00.000+02:00",
        "dateFin": "2009-09-01T02:00:00.000+02:00",
        "preseance": "28",
        "nominPrincipale": "1",
        "infosQualite": {
          "codeQualite": "Suppléant",
          "libQualite": "Membre suppléant",
          "libQualiteSex": "Membre suppléant"
        },
        "organes": {
          "organeRef": "PO420966"
        }
      }
    ]
  }
}