{
  "@xmlns": "http://schemas.assemblee-nationale.fr/referentiel",
  "uid": {
    "@xmlns:xsi": "http://www.w3.org/2001/XMLSchema-instance",
    "@xsi:type": "IdActeur_type",
    "#text": "PA2233"
  },
  "etatCivil": {
    "ident": {
      "civ": "M.",
      "prenom": "Michel",
      "nom": "Moreigne",
      "alpha": "MOREIGNE",
      "trigramme": {
        "@xmlns:xsi": "http://www.w3.org/2001/XMLSchema-instance",
        "@xsi:nil": "true"
      }
    },
    "infoNaissance": {
      "dateNais": "1934-05-06T01:00:00.000+01:00",
      "villeNais": {
        "@xmlns:xsi": "http://www.w3.org/2001/XMLSchema-instance",
        "@xsi:nil": "true"
      },
      "depNais": {
        "@xmlns:xsi": "http://www.w3.org/2001/XMLSchema-instance",
        "@xsi:nil": "true"
      },
      "paysNais": {
        "@xmlns:xsi": "http://www.w3.org/2001/XMLSchema-instance",
        "@xsi:nil": "true"
      }
    },
    "dateDeces": {
      "@xmlns:xsi": "http://www.w3.org/2001/XMLSchema-instance",
      "@xsi:nil": "true"
    }
  },
  "profession": {
    "libelleCourant": {
      "@xmlns:xsi": "http://www.w3.org/2001/XMLSchema-instance",
      "@xsi:nil": "true"
    },
    "socProcINSEE": {
      "catSocPro": {
        "@xmlns:xsi": "http://www.w3.org/2001/XMLSchema-instance",
        "@xsi:nil": "true"
      },
      "famSocPro": {
        "@xmlns:xsi": "http://www.w3.org/2001/XMLSchema-instance",
        "@xsi:nil": "true"
      }
    }
  },
  "uri_hatvp": {
    "@xmlns:xsi": "http://www.w3.org/2001/XMLSchema-instance",
    "@xsi:nil": "true"
  },
  "adresses": {
    "adresse": {
      "@xmlns:xsi": "http://www.w3.org/2001/XMLSchema-instance",
      "@xsi:type": "AdresseSiteWeb_Type",
      "uid": "AD317290",
      "type": "23",
      "typeLibelle": "Url sénateur",
      "poids": null,
      "adresseDeRattachement": null,
      "valElec": "https://www.senat.fr/senateur/moreigne_michel73006g.html"
    }
  },
  "mandats": {
    "mandat": [
      {
        "@xmlns:xsi": "http://www.w3.org/2001/XMLSchema-instance",
        "@xsi:type": "MandatSimple_Type",
        "uid": "PM320200",
        "acteurRef": "PA2233",
        "legislature": null,
        "typeOrgane": "COMSENAT",
        "dateDebut": "2004-10-07T02:00:00.000+02:00",
        "datePublication": null,
        "dateFin": "2008-09-30T02:00:00.000+02:00",
        "preseance": null,
        "nominPrincipale": "1",
        "infosQualite": {
          "codeQualite": null,
          "libQualite": "Secrétaire",
          "libQualiteSex": "Secrétaire"
        },
        "organes": {
          "organeRef": "PO211494"
        }
      },
      {
        "@xmlns:xsi": "http://www.w3.org/2001/XMLSchema-instance",
        "@xsi:type": "MandatSimple_Type",
        "uid": "PM89711",
        "acteurRef": "PA2233",
        "legislature": null,
        "typeOrgane": "GROUPESENAT",
        "dateDebut": "2014-09-04T02:00:00.000+02:00",
        "datePublication": null,
        "dateFin": null,
        "preseance": "4",
        "nominPrincipale": "1",
        "infosQualite": {
          "codeQualite": "Membre",
          "libQualite": "Membre",
          "libQualiteSex": "Membre"
        },
        "organes": {
          "organeRef": "PO77710"
        }
      },
      {
        "@xmlns:xsi": "http://www.w3.org/2001/XMLSchema-instance",
        "@xsi:type": "MandatParlementaire_type",
        "uid": "PM89506",
        "acteurRef": "PA2233",
        "legislature": null,
        "typeOrgane": "SENAT",
        "dateDebut": "1998-10-01T02:00:00.000+02:00",
        "datePublication": "1998-10-02T02:00:00.000+02:00",
        "dateFin": "2008-09-30T02:00:00.000+02:00",
        "preseance": "20",
        "nominPrincipale": "1",
        "infosQualite": {
          "codeQualite": "Sénateur",
          "libQualite": "SENATEUR",
          "libQualiteSex": "SENATEUR"
        },
        "organes": {
          "organeRef": "PO78718"
        },
        "suppleants": null,
        "chambre": null,
        "election": {
          "lieu": {
            "region": null,
            "regionType": null,
            "departement": null,
            "numDepartement": "23",
            "numCirco": null
          },
          "causeMandat": null
        },
        "mandature": {
          "datePriseFonction": null,
          "causeFin": null,
          "premiereElection": "0",
          "placeHemicycle": null,
          "mandatRemplaceRef": null
        },
        "collaborateurs": null
      },
      {
        "@xmlns:xsi": "http://www.w3.org/2001/XMLSchema-instance",
        "@xsi:type": "MandatSimple_Type",
        "uid": "PM394080",
        "acteurRef": "PA2233",
        "legislature": null,
        "typeOrgane": "CMP",
        "dateDebut": "2007-07-30T02:00:00.000+02:00",
        "datePublication": "2007-07-31T02:00:00.000+02:00",
        "dateFin": "2007-07-31T02:00:00.000+02:00",
        "preseance": "28",
        "nominPrincipale": "1",
        "infosQualite": {
          "codeQualite": "Suppléant",
          "libQualite": "Membre suppléant",
          "libQualiteSex": "Membre suppléant"
        },
        "organes": {
          "organeRef": "PO393978"
        }
      }
    ]
  }
}