{
  "@xmlns": "http://schemas.assemblee-nationale.fr/referentiel",
  "@xmlns:xsi": "http://www.w3.org/2001/XMLSchema-instance",
  "@xsi:type": "OrganeParlementaire_Type",
  "uid": "PO696274",
  "codeType": "CMP",
  "libelle": "Commission mixte paritaire chargée de proposer un texte sur les dispositions restant en discussion du projet de loi organique relatif au procureur de la République financier",
  "libelleEdition": "du projet de loi organique relatif au procureur de la République financier",
  "libelleAbrege": "Procureur financier",
  "libelleAbrev": "CMP_1019",
  "viMoDe": {
    "dateDebut": "2013-07-19T02:00:00.000+02:00",
    "dateAgrement": null,
    "dateFin": "2013-07-23T02:00:00.000+02:00"
  },
  "organeParent": null,
  "chambre": null,
  "regime": "5ème République",
  "legislature": "14",
  "secretariat": {
    "secretaire01": null,
    "secretaire02": null
  }
}