{
  "@xmlns": "http://schemas.assemblee-nationale.fr/referentiel",
  "uid": {
    "@xmlns:xsi": "http://www.w3.org/2001/XMLSchema-instance",
    "@xsi:type": "IdActeur_type",
    "#text": "PA703494"
  },
  "etatCivil": {
    "ident": {
      "civ": "Mme",
      "prenom": "Catherine",
      "nom": "Di Folco",
      "alpha": "DI_FOLCO_Catherine",
      "trigramme": {
        "@xmlns:xsi": "http://www.w3.org/2001/XMLSchema-instance",
        "@xsi:nil": "true"
      }
    },
    "infoNaissance": {
      "dateNais": "1960-11-30T01:00:00.000+01:00",
      "villeNais": {
        "@xmlns:xsi": "http://www.w3.org/2001/XMLSchema-instance",
        "@xsi:nil": "true"
      },
      "depNais": {
        "@xmlns:xsi": "http://www.w3.org/2001/XMLSchema-instance",
        "@xsi:nil": "true"
      },
      "paysNais": {
        "@xmlns:xsi": "http://www.w3.org/2001/XMLSchema-instance",
        "@xsi:nil": "true"
      }
    },
    "dateDeces": {
      "@xmlns:xsi": "http://www.w3.org/2001/XMLSchema-instance",
      "@xsi:nil": "true"
    }
  },
  "profession": {
    "libelleCourant": {
      "@xmlns:xsi": "http://www.w3.org/2001/XMLSchema-instance",
      "@xsi:nil": "true"
    },
    "socProcINSEE": {
      "catSocPro": {
        "@xmlns:xsi": "http://www.w3.org/2001/XMLSchema-instance",
        "@xsi:nil": "true"
      },
      "famSocPro": {
        "@xmlns:xsi": "http://www.w3.org/2001/XMLSchema-instance",
        "@xsi:nil": "true"
      }
    }
  },
  "uri_hatvp": {
    "@xmlns:xsi": "http://www.w3.org/2001/XMLSchema-instance",
    "@xsi:nil": "true"
  },
  "adresses": {
    "adresse": {
      "@xmlns:xsi": "http://www.w3.org/2001/XMLSchema-instance",
      "@xsi:type": "AdresseSiteWeb_Type",
      "uid": "AD703741",
      "type": "23",
      "typeLibelle": "Url sénateur",
      "poids": null,
      "adresseDeRattachement": null,
      "valElec": "https://www.senat.fr/senateur/di_folco_catherine14215l.html"
    }
  },
  "mandats": {
    "mandat": [
      {
        "@xmlns:xsi": "http://www.w3.org/2001/XMLSchema-instance",
        "@xsi:type": "MandatSimple_Type",
        "uid": "PM759470",
        "acteurRef": "PA703494",
        "legislature": null,
        "typeOrgane": "COMSPSENAT",
        "dateDebut": "2018-10-10T02:00:00.000+02:00",
        "datePublication": null,
        "dateFin": "2018-10-10T02:00:00.000+02:00",
        "preseance": null,
        "nominPrincipale": "1",
        "infosQualite": {
          "codeQualite": null,
          "libQualite": "Membre",
          "libQualiteSex": null
        },
        "organes": {
          "organeRef": "PO759377"
        }
      },
      {
        "@xmlns:xsi": "http://www.w3.org/2001/XMLSchema-instance",
        "@xsi:type": "MandatSimple_Type",
        "uid": "PM759472",
        "acteurRef": "PA703494",
        "legislature": null,
        "typeOrgane": "COMSPSENAT",
        "dateDebut": "2018-10-11T02:00:00.000+02:00",
        "datePublication": null,
        "dateFin": "2018-11-12T01:00:00.000+01:00",
        "preseance": null,
        "nominPrincipale": "1",
        "infosQualite": {
          "codeQualite": null,
          "libQualite": "Vice-Président",
          "libQualiteSex": null
        },
        "organes": {
          "organeRef": "PO759377"
        }
      },
      {
        "@xmlns:xsi": "http://www.w3.org/2001/XMLSchema-instance",
        "@xsi:type": "MandatSimple_Type",
        "uid": "PM767662",
        "acteurRef": "PA703494",
        "legislature": null,
        "typeOrgane": "COMSPSENAT",
        "dateDebut": "2019-10-16T02:00:00.000+02:00",
        "datePublication": null,
        "dateFin": null,
        "preseance": null,
        "nominPrincipale": "1",
        "infosQualite": {
          "codeQualite": null,
          "libQualite": "Membre",
          "libQualiteSex": null
        },
        "organes": {
          "organeRef": "PO767640"
        }
      },
      {
        "@xmlns:xsi": "http://www.w3.org/2001/XMLSchema-instance",
        "@xsi:type": "MandatSimple_Type",
        "uid": "PM714239",
        "acteurRef": "PA703494",
        "legislature": null,
        "typeOrgane": "COMSPSENAT",
        "dateDebut": "2016-07-07T02:00:00.000+02:00",
        "datePublication": null,
        "dateFin": "2017-06-12T02:00:00.000+02:00",
        "preseance": null,
        "nominPrincipale": "1",
        "infosQualite": {
          "codeQualite": null,
          "libQualite": "Membre",
          "libQualiteSex": null
        },
        "organes": {
          "organeRef": "PO714224"
        }
      },
      {
        "@xmlns:xsi": "http://www.w3.org/2001/XMLSchema-instance",
        "@xsi:type": "MandatSimple_Type",
        "uid": "PM713976",
        "acteurRef": "PA703494",
        "legislature": null,
        "typeOrgane": "COMSPSENAT",
        "dateDebut": "2016-06-22T02:00:00.000+02:00",
        "datePublication": null,
        "dateFin": "2016-07-07T02:00:00.000+02:00",
        "preseance": null,
        "nominPrincipale": "1",
        "infosQualite": {
          "codeQualite": null,
          "libQualite": "Membre",
          "libQualiteSex": null
        },
        "organes": {
          "organeRef": "PO713965"
        }
      },
      {
        "@xmlns:xsi": "http://www.w3.org/2001/XMLSchema-instance",
        "@xsi:type": "MandatSimple_Type",
        "uid": "PM704031",
        "acteurRef": "PA703494",
        "legislature": null,
        "typeOrgane": "COMSENAT",
        "dateDebut": "2014-10-08T02:00:00.000+02:00",
        "datePublication": null,
        "dateFin": "2017-10-04T02:00:00.000+02:00",
        "preseance": "10",
        "nominPrincipale": "1",
        "infosQualite": {
          "codeQualite": "Membre",
          "libQualite": "Membre",
          "libQualiteSex": "Membre"
        },
        "organes": {
          "organeRef": "PO211495"
        }
      },
      {
        "@xmlns:xsi": "http://www.w3.org/2001/XMLSchema-instance",
        "@xsi:type": "MandatSimple_Type",
        "uid": "PM741245",
        "acteurRef": "PA703494",
        "legislature": null,
        "typeOrgane": "COMSENAT",
        "dateDebut": "2017-10-05T02:00:00.000+02:00",
        "datePublication": null,
        "dateFin": null,
        "preseance": null,
        "nominPrincipale": "1",
        "infosQualite": {
          "codeQualite": null,
          "libQualite": "Vice-Président",
          "libQualiteSex": null
        },
        "organes": {
          "organeRef": "PO211495"
        }
      },
      {
        "@xmlns:xsi": "http://www.w3.org/2001/XMLSchema-instance",
        "@xsi:type": "MandatSimple_Type",
        "uid": "PM766214",
        "acteurRef": "PA703494",
        "legislature": null,
        "typeOrgane": "CMP",
        "dateDebut": "2019-07-04T02:00:00.000+02:00",
        "datePublication": "2019-07-05T02:00:00.000+02:00",
        "dateFin": "2019-07-24T02:00:00.000+02:00",
        "preseance": "16",
        "nominPrincipale": "1",
        "infosQualite": {
          "codeQualite": "Rapporteur",
          "libQualite": "Rapporteur",
          "libQualiteSex": "Rapporteure"
        },
        "organes": {
          "organeRef": "PO766053"
        }
      },
      {
        "@xmlns:xsi": "http://www.w3.org/2001/XMLSchema-instance",
        "@xsi:type": "MandatSimple_Type",
        "uid": "PM766076",
        "acteurRef": "PA703494",
        "legislature": null,
        "typeOrgane": "CMP",
        "dateDebut": "2019-06-27T02:00:00.000+02:00",
        "datePublication": "2019-06-28T02:00:00.000+02:00",
        "dateFin": "2019-07-24T02:00:00.000+02:00",
        "preseance": "20",
        "nominPrincipale": "1",
        "infosQualite": {
          "codeQualite": "Titulaire",
          "libQualite": "Membre titulaire",
          "libQualiteSex": "Membre titulaire"
        },
        "organes": {
          "organeRef": "PO766053"
        }
      },
      {
        "@xmlns:xsi": "http://www.w3.org/2001/XMLSchema-instance",
        "@xsi:type": "MandatSimple_Type",
        "uid": "PM708786",
        "acteurRef": "PA703494",
        "legislature": null,
        "typeOrgane": "CMP",
        "dateDebut": "2015-07-01T02:00:00.000+02:00",
        "datePublication": "2015-07-02T02:00:00.000+02:00",
        "dateFin": "2015-07-03T02:00:00.000+02:00",
        "preseance": "20",
        "nominPrincipale": "1",
        "infosQualite": {
          "codeQualite": "Titulaire",
          "libQualite": "Membre titulaire",
          "libQualiteSex": "Membre titulaire"
        },
        "organes": {
          "organeRef": "PO708719"
        }
      },
      {
        "@xmlns:xsi": "http://www.w3.org/2001/XMLSchema-instance",
        "@xsi:type": "MandatSimple_Type",
        "uid": "PM746527",
        "acteurRef": "PA703494",
        "legislature": null,
        "typeOrgane": "CMP",
        "dateDebut": "2017-12-15T01:00:00.000+01:00",
        "datePublication": "2017-12-16T01:00:00.000+01:00",
        "dateFin": "2017-12-21T01:00:00.000+01:00",
        "preseance": "20",
        "nominPrincipale": "1",
        "infosQualite": {
          "codeQualite": "Titulaire",
          "libQualite": "Membre titulaire",
          "libQualiteSex": "Membre titulaire"
        },
        "organes": {
          "organeRef": "PO746520"
        }
      },
      {
        "@xmlns:xsi": "http://www.w3.org/2001/XMLSchema-instance",
        "@xsi:type": "MandatSimple_Type",
        "uid": "PM755555",
        "acteurRef": "PA703494",
        "legislature": null,
        "typeOrgane": "CMP",
        "dateDebut": "2018-04-18T02:00:00.000+02:00",
        "datePublication": "2018-04-18T02:00:00.000+02:00",
        "dateFin": "2018-05-23T02:00:00.000+02:00",
        "preseance": "20",
        "nominPrincipale": "1",
        "infosQualite": {
          "codeQualite": "Titulaire",
          "libQualite": "Membre titulaire",
          "libQualiteSex": "Membre titulaire"
        },
        "organes": {
          "organeRef": "PO755391"
        }
      },
      {
        "@xmlns:xsi": "http://www.w3.org/2001/XMLSchema-instance",
        "@xsi:type": "MandatSimple_Type",
        "uid": "PM711973",
        "acteurRef": "PA703494",
        "legislature": null,
        "typeOrgane": "CMP",
        "dateDebut": "2016-03-02T01:00:00.000+01:00",
        "datePublication": "2016-03-18T01:00:00.000+01:00",
        "dateFin": "2016-03-30T02:00:00.000+02:00",
        "preseance": "20",
        "nominPrincipale": "1",
        "infosQualite": {
          "codeQualite": "Titulaire",
          "libQualite": "Membre titulaire",
          "libQualiteSex": "Membre titulaire"
        },
        "organes": {
          "organeRef": "PO711322"
        }
      },
      {
        "@xmlns:xsi": "http://www.w3.org/2001/XMLSchema-instance",
        "@xsi:type": "MandatSimple_Type",
        "uid": "PM768383",
        "acteurRef": "PA703494",
        "legislature": null,
        "typeOrgane": "CMP",
        "dateDebut": "2019-11-21T01:00:00.000+01:00",
        "datePublication": "2019-11-22T01:00:00.000+01:00",
        "dateFin": null,
        "preseance": "20",
        "nominPrincipale": "1",
        "infosQualite": {
          "codeQualite": "Titulaire",
          "libQualite": "Membre titulaire",
          "libQualiteSex": "Membre titulaire"
        },
        "organes": {
          "organeRef": "PO768135"
        }
      },
      {
        "@xmlns:xsi": "http://www.w3.org/2001/XMLSchema-instance",
        "@xsi:type": "MandatSimple_Type",
        "uid": "PM744623",
        "acteurRef": "PA703494",
        "legislature": null,
        "typeOrgane": "CMP",
        "dateDebut": "2017-11-30T01:00:00.000+01:00",
        "datePublication": "2017-12-02T01:00:00.000+01:00",
        "dateFin": "2017-12-18T01:00:00.000+01:00",
        "preseance": "20",
        "nominPrincipale": "1",
        "infosQualite": {
          "codeQualite": "Titulaire",
          "libQualite": "Membre titulaire",
          "libQualiteSex": "Membre titulaire"
        },
        "organes": {
          "organeRef": "PO744418"
        }
      },
      {
        "@xmlns:xsi": "http://www.w3.org/2001/XMLSchema-instance",
        "@xsi:type": "MandatSimple_Type",
        "uid": "PM704345",
        "acteurRef": "PA703494",
        "legislature": null,
        "typeOrgane": "GROUPESENAT",
        "dateDebut": "2014-10-07T02:00:00.000+02:00",
        "datePublication": null,
        "dateFin": null,
        "preseance": "8",
        "nominPrincipale": "1",
        "infosQualite": {
          "codeQualite": "Membre apparenté",
          "libQualite": "Membre apparenté",
          "libQualiteSex": "Apparentée au"
        },
        "organes": {
          "organeRef": "PO286005"
        }
      },
      {
        "@xmlns:xsi": "http://www.w3.org/2001/XMLSchema-instance",
        "@xsi:type": "MandatParlementaire_type",
        "uid": "PM703602",
        "acteurRef": "PA703494",
        "legislature": null,
        "typeOrgane": "SENAT",
        "dateDebut": "2014-10-01T02:00:00.000+02:00",
        "datePublication": null,
        "dateFin": null,
        "preseance": "20",
        "nominPrincipale": "1",
        "infosQualite": {
          "codeQualite": "Sénateur",
          "libQualite": "SENATEUR",
          "libQualiteSex": "Sénateur 5ème République"
        },
        "organes": {
          "organeRef": "PO78718"
        },
        "suppleants": null,
        "chambre": null,
        "election": {
          "lieu": {
            "region": null,
            "regionType": null,
            "departement": null,
            "numDepartement": "69",
            "numCirco": null
          },
          "causeMandat": null
        },
        "mandature": {
          "datePriseFonction": null,
          "causeFin": null,
          "premiereElection": "0",
          "placeHemicycle": null,
          "mandatRemplaceRef": null
        },
        "collaborateurs": null
      },
      {
        "@xmlns:xsi": "http://www.w3.org/2001/XMLSchema-instance",
        "@xsi:type": "MandatSimple_Type",
        "uid": "PM711775",
        "acteurRef": "PA703494",
        "legislature": null,
        "typeOrgane": "CMP",
        "dateDebut": "2016-03-02T01:00:00.000+01:00",
        "datePublication": "2016-03-10T01:00:00.000+01:00",
        "dateFin": "2016-04-05T02:00:00.000+02:00",
        "preseance": "28",
        "nominPrincipale": "1",
        "infosQualite": {
          "codeQualite": "Suppléant",
          "libQualite": "Membre suppléant",
          "libQualiteSex": "Membre suppléante"
        },
        "organes": {
          "organeRef": "PO711634"
        }
      },
      {
        "@xmlns:xsi": "http://www.w3.org/2001/XMLSchema-instance",
        "@xsi:type": "MandatSimple_Type",
        "uid": "PM760739",
        "acteurRef": "PA703494",
        "legislature": null,
        "typeOrgane": "CMP",
        "dateDebut": "2018-11-27T01:00:00.000+01:00",
        "datePublication": "2018-11-29T01:00:00.000+01:00",
        "dateFin": "2019-02-18T01:00:00.000+01:00",
        "preseance": "28",
        "nominPrincipale": "1",
        "infosQualite": {
          "codeQualite": "Suppléant",
          "libQualite": "Membre suppléant",
          "libQualiteSex": "Membre suppléante"
        },
        "organes": {
          "organeRef": "PO760711"
        }
      },
      {
        "@xmlns:xsi": "http://www.w3.org/2001/XMLSchema-instance",
        "@xsi:type": "MandatSimple_Type",
        "uid": "PM734201",
        "acteurRef": "PA703494",
        "legislature": null,
        "typeOrgane": "CMP",
        "dateDebut": "2017-07-28T02:00:00.000+02:00",
        "datePublication": "2017-07-28T02:00:00.000+02:00",
        "dateFin": "2017-08-01T02:00:00.000+02:00",
        "preseance": "28",
        "nominPrincipale": "1",
        "infosQualite": {
          "codeQualite": "Suppléant",
          "libQualite": "Membre suppléant",
          "libQualiteSex": "Membre suppléante"
        },
        "organes": {
          "organeRef": "PO733952"
        }
      },
      {
        "@xmlns:xsi": "http://www.w3.org/2001/XMLSchema-instance",
        "@xsi:type": "MandatSimple_Type",
        "uid": "PM709465",
        "acteurRef": "PA703494",
        "legislature": null,
        "typeOrgane": "CMP",
        "dateDebut": "2015-09-16T02:00:00.000+02:00",
        "datePublication": "2015-09-25T02:00:00.000+02:00",
        "dateFin": "2015-10-07T02:00:00.000+02:00",
        "preseance": "28",
        "nominPrincipale": "1",
        "infosQualite": {
          "codeQualite": "Suppléant",
          "libQualite": "Membre suppléant",
          "libQualiteSex": "Membre suppléante"
        },
        "organes": {
          "organeRef": "PO709067"
        }
      },
      {
        "@xmlns:xsi": "http://www.w3.org/2001/XMLSchema-instance",
        "@xsi:type": "MandatSimple_Type",
        "uid": "PM764871",
        "acteurRef": "PA703494",
        "legislature": null,
        "typeOrgane": "CMP",
        "dateDebut": "2019-04-30T02:00:00.000+02:00",
        "datePublication": "2019-05-02T02:00:00.000+02:00",
        "dateFin": "2019-05-23T02:00:00.000+02:00",
        "preseance": "28",
        "nominPrincipale": "1",
        "infosQualite": {
          "codeQualite": "Suppléant",
          "libQualite": "Membre suppléant",
          "libQualiteSex": "Membre suppléante"
        },
        "organes": {
          "organeRef": "PO764697"
        }
      },
      {
        "@xmlns:xsi": "http://www.w3.org/2001/XMLSchema-instance",
        "@xsi:type": "MandatSimple_Type",
        "uid": "PM757388",
        "acteurRef": "PA703494",
        "legislature": null,
        "typeOrgane": "CMP",
        "dateDebut": "2018-06-28T02:00:00.000+02:00",
        "datePublication": "2018-06-29T02:00:00.000+02:00",
        "dateFin": "2018-08-01T02:00:00.000+02:00",
        "preseance": "28",
        "nominPrincipale": "1",
        "infosQualite": {
          "codeQualite": "Suppléant",
          "libQualite": "Membre suppléant",
          "libQualiteSex": "Membre suppléante"
        },
        "organes": {
          "organeRef": "PO757359"
        }
      },
      {
        "@xmlns:xsi": "http://www.w3.org/2001/XMLSchema-instance",
        "@xsi:type": "MandatSimple_Type",
        "uid": "PM760767",
        "acteurRef": "PA703494",
        "legislature": null,
        "typeOrgane": "CMP",
        "dateDebut": "2018-11-26T01:00:00.000+01:00",
        "datePublication": "2018-11-29T01:00:00.000+01:00",
        "dateFin": "2019-02-20T01:00:00.000+01:00",
        "preseance": "28",
        "nominPrincipale": "1",
        "infosQualite": {
          "codeQualite": "Suppléant",
          "libQualite": "Membre suppléant",
          "libQualiteSex": "Membre suppléante"
        },
        "organes": {
          "organeRef": "PO760704"
        }
      },
      {
        "@xmlns:xsi": "http://www.w3.org/2001/XMLSchema-instance",
        "@xsi:type": "MandatSimple_Type",
        "uid": "PM714181",
        "acteurRef": "PA703494",
        "legislature": null,
        "typeOrgane": "CMP",
        "dateDebut": "2016-06-30T02:00:00.000+02:00",
        "datePublication": "2016-07-07T02:00:00.000+02:00",
        "dateFin": "2016-07-13T02:00:00.000+02:00",
        "preseance": "28",
        "nominPrincipale": "1",
        "infosQualite": {
          "codeQualite": "Suppléant",
          "libQualite": "Membre suppléant",
          "libQualiteSex": "Membre suppléante"
        },
        "organes": {
          "organeRef": "PO714027"
        }
      },
      {
        "@xmlns:xsi": "http://www.w3.org/2001/XMLSchema-instance",
        "@xsi:type": "MandatSimple_Type",
        "uid": "PM756198",
        "acteurRef": "PA703494",
        "legislature": null,
        "typeOrgane": "CMP",
        "dateDebut": "2018-05-17T02:00:00.000+02:00",
        "datePublication": "2018-05-18T02:00:00.000+02:00",
        "dateFin": "2018-06-21T02:00:00.000+02:00",
        "preseance": "28",
        "nominPrincipale": "1",
        "infosQualite": {
          "codeQualite": "Suppléant",
          "libQualite": "Membre suppléant",
          "libQualiteSex": "Membre suppléante"
        },
        "organes": {
          "organeRef": "PO755798"
        }
      },
      {
        "@xmlns:xsi": "http://www.w3.org/2001/XMLSchema-instance",
        "@xsi:type": "MandatSimple_Type",
        "uid": "PM714150",
        "acteurRef": "PA703494",
        "legislature": null,
        "typeOrgane": "CMP",
        "dateDebut": "2016-06-30T02:00:00.000+02:00",
        "datePublication": "2016-07-07T02:00:00.000+02:00",
        "dateFin": "2016-07-13T02:00:00.000+02:00",
        "preseance": "28",
        "nominPrincipale": "1",
        "infosQualite": {
          "codeQualite": "Suppléant",
          "libQualite": "Membre suppléant",
          "libQualiteSex": "Membre suppléante"
        },
        "organes": {
          "organeRef": "PO714021"
        }
      },
      {
        "@xmlns:xsi": "http://www.w3.org/2001/XMLSchema-instance",
        "@xsi:type": "MandatSimple_Type",
        "uid": "PM734162",
        "acteurRef": "PA703494",
        "legislature": null,
        "typeOrgane": "CMP",
        "dateDebut": "2017-07-28T02:00:00.000+02:00",
        "datePublication": "2017-07-28T02:00:00.000+02:00",
        "dateFin": "2017-08-01T02:00:00.000+02:00",
        "preseance": "28",
        "nominPrincipale": "1",
        "infosQualite": {
          "codeQualite": "Suppléant",
          "libQualite": "Membre suppléant",
          "libQualiteSex": "Membre suppléante"
        },
        "organes": {
          "organeRef": "PO733946"
        }
      },
      {
        "@xmlns:xsi": "http://www.w3.org/2001/XMLSchema-instance",
        "@xsi:type": "MandatSimple_Type",
        "uid": "PM710370",
        "acteurRef": "PA703494",
        "legislature": null,
        "typeOrgane": "CMP",
        "dateDebut": "2015-11-27T01:00:00.000+01:00",
        "datePublication": "2015-11-28T01:00:00.000+01:00",
        "dateFin": "2015-12-03T01:00:00.000+01:00",
        "preseance": "28",
        "nominPrincipale": "1",
        "infosQualite": {
          "codeQualite": "Suppléant",
          "libQualite": "Membre suppléant",
          "libQualiteSex": "Membre suppléante"
        },
        "organes": {
          "organeRef": "PO709840"
        }
      },
      {
        "@xmlns:xsi": "http://www.w3.org/2001/XMLSchema-instance",
        "@xsi:type": "MandatSimple_Type",
        "uid": "PM752973",
        "acteurRef": "PA703494",
        "legislature": null,
        "typeOrgane": "CMP",
        "dateDebut": "2018-03-09T01:00:00.000+01:00",
        "datePublication": "2018-03-09T01:00:00.000+01:00",
        "dateFin": "2018-04-11T02:00:00.000+02:00",
        "preseance": "28",
        "nominPrincipale": "1",
        "infosQualite": {
          "codeQualite": "Suppléant",
          "libQualite": "Membre suppléant",
          "libQualiteSex": "Membre suppléante"
        },
        "organes": {
          "organeRef": "PO750828"
        }
      },
      {
        "@xmlns:xsi": "http://www.w3.org/2001/XMLSchema-instance",
        "@xsi:type": "MandatSimple_Type",
        "uid": "PM750577",
        "acteurRef": "PA703494",
        "legislature": null,
        "typeOrgane": "CMP",
        "dateDebut": "2018-02-16T01:00:00.000+01:00",
        "datePublication": "2018-02-16T01:00:00.000+01:00",
        "dateFin": "2018-03-15T01:00:00.000+01:00",
        "preseance": "28",
        "nominPrincipale": "1",
        "infosQualite": {
          "codeQualite": "Suppléant",
          "libQualite": "Membre suppléant",
          "libQualiteSex": "Membre suppléante"
        },
        "organes": {
          "organeRef": "PO749105"
        }
      },
      {
        "@xmlns:xsi": "http://www.w3.org/2001/XMLSchema-instance",
        "@xsi:type": "MandatSimple_Type",
        "uid": "PM764835",
        "acteurRef": "PA703494",
        "legislature": null,
        "typeOrgane": "CMP",
        "dateDebut": "2019-04-30T02:00:00.000+02:00",
        "datePublication": "2019-05-02T02:00:00.000+02:00",
        "dateFin": "2019-05-23T02:00:00.000+02:00",
        "preseance": "28",
        "nominPrincipale": "1",
        "infosQualite": {
          "codeQualite": "Suppléant",
          "libQualite": "Membre suppléant",
          "libQualiteSex": "Membre suppléante"
        },
        "organes": {
          "organeRef": "PO764703"
        }
      },
      {
        "@xmlns:xsi": "http://www.w3.org/2001/XMLSchema-instance",
        "@xsi:type": "MandatSimple_Type",
        "uid": "PM714172",
        "acteurRef": "PA703494",
        "legislature": null,
        "typeOrgane": "CMP",
        "dateDebut": "2016-06-30T02:00:00.000+02:00",
        "datePublication": "2016-07-07T02:00:00.000+02:00",
        "dateFin": "2016-07-13T02:00:00.000+02:00",
        "preseance": "28",
        "nominPrincipale": "1",
        "infosQualite": {
          "codeQualite": "Suppléant",
          "libQualite": "Membre suppléant",
          "libQualiteSex": "Membre suppléante"
        },
        "organes": {
          "organeRef": "PO714015"
        }
      },
      {
        "@xmlns:xsi": "http://www.w3.org/2001/XMLSchema-instance",
        "@xsi:type": "MandatSimple_Type",
        "uid": "PM757423",
        "acteurRef": "PA703494",
        "legislature": null,
        "typeOrgane": "CMP",
        "dateDebut": "2018-06-28T02:00:00.000+02:00",
        "datePublication": "2018-06-29T02:00:00.000+02:00",
        "dateFin": "2018-07-13T02:00:00.000+02:00",
        "preseance": "28",
        "nominPrincipale": "1",
        "infosQualite": {
          "codeQualite": "Suppléant",
          "libQualite": "Membre suppléant",
          "libQualiteSex": "Membre suppléante"
        },
        "organes": {
          "organeRef": "PO757402"
        }
      },
      {
        "@xmlns:xsi": "http://www.w3.org/2001/XMLSchema-instance",
        "@xsi:type": "MandatSimple_Type",
        "uid": "PM758298",
        "acteurRef": "PA703494",
        "legislature": null,
        "typeOrgane": "CMP",
        "dateDebut": "2018-07-10T02:00:00.000+02:00",
        "datePublication": "2018-07-20T02:00:00.000+02:00",
        "dateFin": "2018-08-01T02:00:00.000+02:00",
        "preseance": "28",
        "nominPrincipale": "1",
        "infosQualite": {
          "codeQualite": "Suppléant",
          "libQualite": "Membre suppléant",
          "libQualiteSex": "Membre suppléante"
        },
        "organes": {
          "organeRef": "PO757668"
        }
      },
      {
        "@xmlns:xsi": "http://www.w3.org/2001/XMLSchema-instance",
        "@xsi:type": "MandatSimple_Type",
        "uid": "PM766268",
        "acteurRef": "PA703494",
        "legislature": null,
        "typeOrgane": "CMP",
        "dateDebut": "2019-07-02T02:00:00.000+02:00",
        "datePublication": "2019-07-05T02:00:00.000+02:00",
        "dateFin": "2019-07-25T02:00:00.000+02:00",
        "preseance": "28",
        "nominPrincipale": "1",
        "infosQualite": {
          "codeQualite": "Suppléant",
          "libQualite": "Membre suppléant",
          "libQualiteSex": "Membre suppléante"
        },
        "organes": {
          "organeRef": "PO766090"
        }
      },
      {
        "@xmlns:xsi": "http://www.w3.org/2001/XMLSchema-instance",
        "@xsi:type": "MandatSimple_Type",
        "uid": "PM754552",
        "acteurRef": "PA703494",
        "legislature": null,
        "typeOrgane": "CMP",
        "dateDebut": "2018-03-28T02:00:00.000+02:00",
        "datePublication": "2018-03-30T02:00:00.000+02:00",
        "dateFin": "2018-05-14T02:00:00.000+02:00",
        "preseance": "28",
        "nominPrincipale": "1",
        "infosQualite": {
          "codeQualite": "Suppléant",
          "libQualite": "Membre suppléant",
          "libQualiteSex": "Membre suppléante"
        },
        "organes": {
          "organeRef": "PO754171"
        }
      },
      {
        "@xmlns:xsi": "http://www.w3.org/2001/XMLSchema-instance",
        "@xsi:type": "MandatSimple_Type",
        "uid": "PM711801",
        "acteurRef": "PA703494",
        "legislature": null,
        "typeOrgane": "CMP",
        "dateDebut": "2016-03-02T01:00:00.000+01:00",
        "datePublication": "2016-03-11T01:00:00.000+01:00",
        "dateFin": "2016-04-05T02:00:00.000+02:00",
        "preseance": "28",
        "nominPrincipale": "1",
        "infosQualite": {
          "codeQualite": "Suppléant",
          "libQualite": "Membre suppléant",
          "libQualiteSex": "Membre suppléante"
        },
        "organes": {
          "organeRef": "PO711628"
        }
      },
      {
        "@xmlns:xsi": "http://www.w3.org/2001/XMLSchema-instance",
        "@xsi:type": "MandatSimple_Type",
        "uid": "PM708573",
        "acteurRef": "PA703494",
        "legislature": null,
        "typeOrgane": "CMP",
        "dateDebut": "2015-06-10T02:00:00.000+02:00",
        "datePublication": "2015-06-13T02:00:00.000+02:00",
        "dateFin": "2015-06-17T02:00:00.000+02:00",
        "preseance": "28",
        "nominPrincipale": "1",
        "infosQualite": {
          "codeQualite": "Suppléant",
          "libQualite": "Membre suppléant",
          "libQualiteSex": "Membre suppléante"
        },
        "organes": {
          "organeRef": "PO708438"
        }
      },
      {
        "@xmlns:xsi": "http://www.w3.org/2001/XMLSchema-instance",
        "@xsi:type": "MandatSimple_Type",
        "uid": "PM712678",
        "acteurRef": "PA703494",
        "legislature": null,
        "typeOrgane": "CMP",
        "dateDebut": "2016-05-04T02:00:00.000+02:00",
        "datePublication": "2016-05-05T02:00:00.000+02:00",
        "dateFin": "2016-06-01T02:00:00.000+02:00",
        "preseance": "28",
        "nominPrincipale": "1",
        "infosQualite": {
          "codeQualite": "Suppléant",
          "libQualite": "Membre suppléant",
          "libQualiteSex": "Membre suppléante"
        },
        "organes": {
          "organeRef": "PO712266"
        }
      },
      {
        "@xmlns:xsi": "http://www.w3.org/2001/XMLSchema-instance",
        "@xsi:type": "MandatSimple_Type",
        "uid": "PM756060",
        "acteurRef": "PA703494",
        "legislature": null,
        "typeOrgane": "CMP",
        "dateDebut": "2018-04-18T02:00:00.000+02:00",
        "datePublication": "2018-05-12T02:00:00.000+02:00",
        "dateFin": "2018-07-31T02:00:00.000+02:00",
        "preseance": "28",
        "nominPrincipale": "1",
        "infosQualite": {
          "codeQualite": "Suppléant",
          "libQualite": "Membre suppléant",
          "libQualiteSex": "Membre suppléante"
        },
        "organes": {
          "organeRef": "PO755721"
        }
      }
    ]
  }
}