{
  "@xmlns": "http://schemas.assemblee-nationale.fr/referentiel",
  "@xmlns:xsi": "http://www.w3.org/2001/XMLSchema-instance",
  "@xsi:type": "OrganeExterne_Type",
  "uid": "PO388139",
  "codeType": "MINISTERE",
  "libelle": "Haut-commissariat aux solidarités actives contre la pauvreté",
  "libelleEdition": "aux solidarités actives contre la pauvreté",
  "libelleAbrege": "Solidarités actives contre la pauvreté",
  "libelleAbrev": "SAP",
  "viMoDe": {
    "dateDebut": "2007-06-19T02:00:00.000+02:00",
    "dateAgrement": null,
    "dateFin": "2009-01-12T01:00:00.000+01:00"
  },
  "organeParent": "PO384206"
}