{
  "@xmlns": "http://schemas.assemblee-nationale.fr/referentiel",
  "@xmlns:xsi": "http://www.w3.org/2001/XMLSchema-instance",
  "@xsi:type": "OrganeExtraParlementaire_type",
  "uid": "PO60216",
  "codeType": "ORGEXTPARL",
  "libelle": "Conseil supérieur de la sûreté et de l'information nucléaires",
  "libelleEdition": "du conseil supérieur de la sûreté et de l'information nucléaires",
  "libelleAbrege": "Nucléaire",
  "libelleAbrev": "074",
  "viMoDe": {
    "dateDebut": "1973-03-13T01:00:00.000+01:00",
    "dateAgrement": null,
    "dateFin": "2012-05-14T02:00:00.000+02:00"
  },
  "organeParent": null,
  "chambre": null,
  "regime": "5ème République",
  "legislature": null,
  "regimeJuridique": "Décret 73-278 du 13 03 1973 modifié par décret 87-137 du 02 03 1987",
  "siteInternet": null,
  "nombreReunionsAnnuelles": null
}