{
  "@xmlns": "http://schemas.assemblee-nationale.fr/referentiel",
  "@xmlns:xsi": "http://www.w3.org/2001/XMLSchema-instance",
  "@xsi:type": "OrganeParlementaire_Type",
  "uid": "PO709614",
  "codeType": "MISINFOCOM",
  "libelle": "Mission d'information commune sur l'application de la loi du 6 août 2015 pour la croissance, l'activité et l'égalité des chances économiques",
  "libelleEdition": "de la mission d'information commune sur l'application de la loi du 6 août 2015 pour la croissance, l'activité et l'égalité des chances économiques",
  "libelleAbrege": "Application de la loi croissance, activité et égalité des chances économiques",
  "libelleAbrev": "CROISSANCE",
  "viMoDe": {
    "dateDebut": "2015-10-07T02:00:00.000+02:00",
    "dateAgrement": null,
    "dateFin": "2017-02-20T01:00:00.000+01:00"
  },
  "organeParent": null,
  "chambre": null,
  "regime": "5ème République",
  "legislature": "14",
  "secretariat": {
    "secretaire01": null,
    "secretaire02": null
  }
}