{
  "@xmlns": "http://schemas.assemblee-nationale.fr/referentiel",
  "@xmlns:xsi": "http://www.w3.org/2001/XMLSchema-instance",
  "@xsi:type": "OrganeParlementaire_Type",
  "uid": "PO424553",
  "codeType": "CMP",
  "libelle": "Commission mixte paritaire chargée de proposer un texte sur les dispositions restant en discussion du projet de loi de modernisation de l'agriculture et de la pêche",
  "libelleEdition": "du projet de loi de modernisation de l'agriculture et de la pêche",
  "libelleAbrege": "Modernisation de l'agriculture et de la pêche",
  "libelleAbrev": "200-09-10",
  "viMoDe": {
    "dateDebut": "2010-07-06T02:00:00.000+02:00",
    "dateAgrement": null,
    "dateFin": "2010-07-13T02:00:00.000+02:00"
  },
  "organeParent": null,
  "chambre": null,
  "regime": "5ème République",
  "legislature": "13",
  "secretariat": {
    "secretaire01": null,
    "secretaire02": null
  }
}