{
  "@xmlns": "http://schemas.assemblee-nationale.fr/referentiel",
  "@xmlns:xsi": "http://www.w3.org/2001/XMLSchema-instance",
  "@xsi:type": "OrganeExterne_Type",
  "uid": "PO729964",
  "codeType": "MINISTERE",
  "libelle": "Ministère de la transition écologique et solidaire",
  "libelleEdition": "de la transition écologique et solidaire",
  "libelleAbrege": "Transition écologique et solidaire",
  "libelleAbrev": "TRE",
  "viMoDe": {
    "dateDebut": "2017-06-22T02:00:00.000+02:00",
    "dateAgrement": null,
    "dateFin": "2018-09-04T02:00:00.000+02:00"
  },
  "organeParent": "PO725688"
}