{
  "@xmlns": "http://schemas.assemblee-nationale.fr/referentiel",
  "@xmlns:xsi": "http://www.w3.org/2001/XMLSchema-instance",
  "@xsi:type": "OrganeParlementaire_Type",
  "uid": "PO692289",
  "codeType": "GE",
  "libelle": "Santé et numérique",
  "libelleEdition": "Santé et numérique",
  "libelleAbrege": "Santé et numérique",
  "libelleAbrev": "SANTÉ NUMÉ",
  "viMoDe": {
    "dateDebut": null,
    "dateAgrement": "2013-02-27T01:00:00.000+01:00",
    "dateFin": "2017-06-20T02:00:00.000+02:00"
  },
  "organeParent": null,
  "chambre": null,
  "regime": "5ème République",
  "legislature": "14",
  "secretariat": {
    "secretaire01": null,
    "secretaire02": null
  }
}