{
  "@xmlns": "http://schemas.assemblee-nationale.fr/referentiel",
  "@xmlns:xsi": "http://www.w3.org/2001/XMLSchema-instance",
  "@xsi:type": "OrganeExtraParlementaire_type",
  "uid": "PO709206",
  "codeType": "ORGEXTPARL",
  "libelle": "Conseil supérieur de l'Agence France-Presse",
  "libelleEdition": "du Conseil supérieur de l'Agence France-Presse",
  "libelleAbrege": "AFP",
  "libelleAbrev": "341",
  "viMoDe": {
    "dateDebut": "2015-06-23T02:00:00.000+02:00",
    "dateAgrement": null,
    "dateFin": null
  },
  "organeParent": null,
  "chambre": null,
  "regime": "5ème République",
  "legislature": null,
  "regimeJuridique": "Article 4 de la loi n° 57-32 du 10 janvier 1957",
  "siteInternet": "https://www.afp.com/fr/lagence/propos/les-gouvernances",
  "nombreReunionsAnnuelles": null
}