{
  "@xmlns": "http://schemas.assemblee-nationale.fr/referentiel",
  "@xmlns:xsi": "http://www.w3.org/2001/XMLSchema-instance",
  "@xsi:type": "OrganeExterne_Type",
  "uid": "PO700857",
  "codeType": "MINISTERE",
  "libelle": "Secrétariat d'État, auprès de la ministre de la décentralisation, de la réforme de l'État et de la fonction publique, chargé de la réforme territoriale",
  "libelleEdition": ", auprès de la ministre de la décentralisation, de la réforme de l'État et de la fonction publique, chargé de la réforme territoriale",
  "libelleAbrege": "Réforme territoriale",
  "libelleAbrev": "RTE",
  "viMoDe": {
    "dateDebut": "2014-04-10T02:00:00.000+02:00",
    "dateAgrement": null,
    "dateFin": "2014-06-03T02:00:00.000+02:00"
  },
  "organeParent": "PO700706"
}