{
  "@xmlns": "http://schemas.assemblee-nationale.fr/referentiel",
  "@xmlns:xsi": "http://www.w3.org/2001/XMLSchema-instance",
  "@xsi:type": "OrganeParlementaire_Type",
  "uid": "PO687392",
  "codeType": "GE",
  "libelle": "Villes et banlieues",
  "libelleEdition": "Villes et banlieues",
  "libelleAbrege": "Villes et banlieues",
  "libelleAbrev": "VILBANLIEU",
  "viMoDe": {
    "dateDebut": null,
    "dateAgrement": "2012-11-14T01:00:00.000+01:00",
    "dateFin": "2017-06-20T02:00:00.000+02:00"
  },
  "organeParent": null,
  "chambre": null,
  "regime": "5ème République",
  "legislature": "14",
  "secretariat": {
    "secretaire01": null,
    "secretaire02": null
  }
}