{
  "@xmlns": "http://schemas.assemblee-nationale.fr/referentiel",
  "uid": {
    "@xmlns:xsi": "http://www.w3.org/2001/XMLSchema-instance",
    "@xsi:type": "IdActeur_type",
    "#text": "PA1090"
  },
  "etatCivil": {
    "ident": {
      "civ": "M.",
      "prenom": "Gérard",
      "nom": "Dériot",
      "alpha": "DERIOT",
      "trigramme": {
        "@xmlns:xsi": "http://www.w3.org/2001/XMLSchema-instance",
        "@xsi:nil": "true"
      }
    },
    "infoNaissance": {
      "dateNais": "1944-11-01T01:00:00.000+01:00",
      "villeNais": {
        "@xmlns:xsi": "http://www.w3.org/2001/XMLSchema-instance",
        "@xsi:nil": "true"
      },
      "depNais": {
        "@xmlns:xsi": "http://www.w3.org/2001/XMLSchema-instance",
        "@xsi:nil": "true"
      },
      "paysNais": {
        "@xmlns:xsi": "http://www.w3.org/2001/XMLSchema-instance",
        "@xsi:nil": "true"
      }
    },
    "dateDeces": {
      "@xmlns:xsi": "http://www.w3.org/2001/XMLSchema-instance",
      "@xsi:nil": "true"
    }
  },
  "profession": {
    "libelleCourant": {
      "@xmlns:xsi": "http://www.w3.org/2001/XMLSchema-instance",
      "@xsi:nil": "true"
    },
    "socProcINSEE": {
      "catSocPro": {
        "@xmlns:xsi": "http://www.w3.org/2001/XMLSchema-instance",
        "@xsi:nil": "true"
      },
      "famSocPro": {
        "@xmlns:xsi": "http://www.w3.org/2001/XMLSchema-instance",
        "@xsi:nil": "true"
      }
    }
  },
  "uri_hatvp": {
    "@xmlns:xsi": "http://www.w3.org/2001/XMLSchema-instance",
    "@xsi:nil": "true"
  },
  "adresses": {
    "adresse": {
      "@xmlns:xsi": "http://www.w3.org/2001/XMLSchema-instance",
      "@xsi:type": "AdresseSiteWeb_Type",
      "uid": "AD317639",
      "type": "23",
      "typeLibelle": "Url sénateur",
      "poids": null,
      "adresseDeRattachement": null,
      "valElec": "https://www.senat.fr/senateur/deriot_gerard98024r.html"
    }
  },
  "mandats": {
    "mandat": [
      {
        "@xmlns:xsi": "http://www.w3.org/2001/XMLSchema-instance",
        "@xsi:type": "MandatAvecSuppleant_Type",
        "uid": "PM288554",
        "acteurRef": "PA1090",
        "legislature": null,
        "typeOrgane": "OFFPAR",
        "dateDebut": "2003-01-21T01:00:00.000+01:00",
        "datePublication": "2003-01-22T01:00:00.000+01:00",
        "dateFin": "2008-09-30T02:00:00.000+02:00",
        "preseance": "24",
        "nominPrincipale": "1",
        "infosQualite": {
          "codeQualite": "Membre",
          "libQualite": "Membre",
          "libQualiteSex": "Membre"
        },
        "organes": {
          "organeRef": "PO288529"
        },
        "suppleants": null
      },
      {
        "@xmlns:xsi": "http://www.w3.org/2001/XMLSchema-instance",
        "@xsi:type": "MandatAvecSuppleant_Type",
        "uid": "PM416583",
        "acteurRef": "PA1090",
        "legislature": null,
        "typeOrgane": "OFFPAR",
        "dateDebut": "2008-11-04T01:00:00.000+01:00",
        "datePublication": "2008-11-05T01:00:00.000+01:00",
        "dateFin": "2009-06-15T02:00:00.000+02:00",
        "preseance": "24",
        "nominPrincipale": "1",
        "infosQualite": {
          "codeQualite": "Membre",
          "libQualite": "Membre",
          "libQualiteSex": "Membre"
        },
        "organes": {
          "organeRef": "PO288529"
        },
        "suppleants": null
      },
      {
        "@xmlns:xsi": "http://www.w3.org/2001/XMLSchema-instance",
        "@xsi:type": "MandatSimple_Type",
        "uid": "PM426525",
        "acteurRef": "PA1090",
        "legislature": null,
        "typeOrgane": "COMSENAT",
        "dateDebut": "2011-01-14T01:00:00.000+01:00",
        "datePublication": null,
        "dateFin": "2014-10-08T02:00:00.000+02:00",
        "preseance": "10",
        "nominPrincipale": "1",
        "infosQualite": {
          "codeQualite": "Membre",
          "libQualite": "Membre",
          "libQualiteSex": "Membre"
        },
        "organes": {
          "organeRef": "PO211493"
        }
      },
      {
        "@xmlns:xsi": "http://www.w3.org/2001/XMLSchema-instance",
        "@xsi:type": "MandatSimple_Type",
        "uid": "PM741279",
        "acteurRef": "PA1090",
        "legislature": null,
        "typeOrgane": "COMSENAT",
        "dateDebut": "2017-10-05T02:00:00.000+02:00",
        "datePublication": null,
        "dateFin": null,
        "preseance": null,
        "nominPrincipale": "1",
        "infosQualite": {
          "codeQualite": null,
          "libQualite": "Vice-Président",
          "libQualiteSex": "Vice-Président"
        },
        "organes": {
          "organeRef": "PO211493"
        }
      },
      {
        "@xmlns:xsi": "http://www.w3.org/2001/XMLSchema-instance",
        "@xsi:type": "MandatSimple_Type",
        "uid": "PM711131",
        "acteurRef": "PA1090",
        "legislature": null,
        "typeOrgane": "CMP",
        "dateDebut": "2015-12-17T01:00:00.000+01:00",
        "datePublication": "2016-01-15T01:00:00.000+01:00",
        "dateFin": "2016-02-11T01:00:00.000+01:00",
        "preseance": "20",
        "nominPrincipale": "1",
        "infosQualite": {
          "codeQualite": "Titulaire",
          "libQualite": "Membre titulaire",
          "libQualiteSex": "Membre titulaire"
        },
        "organes": {
          "organeRef": "PO709882"
        }
      },
      {
        "@xmlns:xsi": "http://www.w3.org/2001/XMLSchema-instance",
        "@xsi:type": "MandatSimple_Type",
        "uid": "PM419427",
        "acteurRef": "PA1090",
        "legislature": null,
        "typeOrgane": "CMP",
        "dateDebut": "2009-06-10T02:00:00.000+02:00",
        "datePublication": "2009-06-11T02:00:00.000+02:00",
        "dateFin": "2009-07-01T02:00:00.000+02:00",
        "preseance": "20",
        "nominPrincipale": "1",
        "infosQualite": {
          "codeQualite": "Titulaire",
          "libQualite": "Membre titulaire",
          "libQualiteSex": "Membre titulaire"
        },
        "organes": {
          "organeRef": "PO419397"
        }
      },
      {
        "@xmlns:xsi": "http://www.w3.org/2001/XMLSchema-instance",
        "@xsi:type": "MandatSimple_Type",
        "uid": "PM711182",
        "acteurRef": "PA1090",
        "legislature": null,
        "typeOrgane": "CMP",
        "dateDebut": "2016-01-19T01:00:00.000+01:00",
        "datePublication": "2016-01-20T01:00:00.000+01:00",
        "dateFin": "2016-02-11T01:00:00.000+01:00",
        "preseance": "16",
        "nominPrincipale": "1",
        "infosQualite": {
          "codeQualite": "Rapporteur",
          "libQualite": "Rapporteur",
          "libQualiteSex": "Rapporteur"
        },
        "organes": {
          "organeRef": "PO709882"
        }
      },
      {
        "@xmlns:xsi": "http://www.w3.org/2001/XMLSchema-instance",
        "@xsi:type": "MandatSimple_Type",
        "uid": "PM403789",
        "acteurRef": "PA1090",
        "legislature": null,
        "typeOrgane": "CMP",
        "dateDebut": "2007-11-16T01:00:00.000+01:00",
        "datePublication": "2007-11-17T01:00:00.000+01:00",
        "dateFin": "2007-11-23T01:00:00.000+01:00",
        "preseance": "20",
        "nominPrincipale": "1",
        "infosQualite": {
          "codeQualite": "Titulaire",
          "libQualite": "Membre titulaire",
          "libQualiteSex": "Membre titulaire"
        },
        "organes": {
          "organeRef": "PO403765"
        }
      },
      {
        "@xmlns:xsi": "http://www.w3.org/2001/XMLSchema-instance",
        "@xsi:type": "MandatSimple_Type",
        "uid": "PM425089",
        "acteurRef": "PA1090",
        "legislature": null,
        "typeOrgane": "CMP",
        "dateDebut": "2010-09-28T02:00:00.000+02:00",
        "datePublication": "2010-09-29T02:00:00.000+02:00",
        "dateFin": "2010-10-06T02:00:00.000+02:00",
        "preseance": "20",
        "nominPrincipale": "1",
        "infosQualite": {
          "codeQualite": "Titulaire",
          "libQualite": "Membre titulaire",
          "libQualiteSex": "Membre titulaire"
        },
        "organes": {
          "organeRef": "PO425048"
        }
      },
      {
        "@xmlns:xsi": "http://www.w3.org/2001/XMLSchema-instance",
        "@xsi:type": "MandatSimple_Type",
        "uid": "PM431127",
        "acteurRef": "PA1090",
        "legislature": null,
        "typeOrgane": "CMP",
        "dateDebut": "2011-11-15T01:00:00.000+01:00",
        "datePublication": "2011-11-16T01:00:00.000+01:00",
        "dateFin": "2011-11-16T01:00:00.000+01:00",
        "preseance": "28",
        "nominPrincipale": "1",
        "infosQualite": {
          "codeQualite": "Suppléant",
          "libQualite": "Membre suppléant",
          "libQualiteSex": "Membre suppléant"
        },
        "organes": {
          "organeRef": "PO431110"
        }
      },
      {
        "@xmlns:xsi": "http://www.w3.org/2001/XMLSchema-instance",
        "@xsi:type": "MandatSimple_Type",
        "uid": "PM422319",
        "acteurRef": "PA1090",
        "legislature": null,
        "typeOrgane": "CMP",
        "dateDebut": "2009-11-16T01:00:00.000+01:00",
        "datePublication": "2009-11-17T01:00:00.000+01:00",
        "dateFin": "2010-01-12T01:00:00.000+01:00",
        "preseance": "20",
        "nominPrincipale": "1",
        "infosQualite": {
          "codeQualite": "Titulaire",
          "libQualite": "Membre titulaire",
          "libQualiteSex": "Membre titulaire"
        },
        "organes": {
          "organeRef": "PO422293"
        }
      },
      {
        "@xmlns:xsi": "http://www.w3.org/2001/XMLSchema-instance",
        "@xsi:type": "MandatSimple_Type",
        "uid": "PM425829",
        "acteurRef": "PA1090",
        "legislature": null,
        "typeOrgane": "CMP",
        "dateDebut": "2010-11-17T01:00:00.000+01:00",
        "datePublication": "2010-11-18T01:00:00.000+01:00",
        "dateFin": "2010-11-25T01:00:00.000+01:00",
        "preseance": "20",
        "nominPrincipale": "1",
        "infosQualite": {
          "codeQualite": "Titulaire",
          "libQualite": "Membre titulaire",
          "libQualiteSex": "Membre titulaire"
        },
        "organes": {
          "organeRef": "PO425808"
        }
      },
      {
        "@xmlns:xsi": "http://www.w3.org/2001/XMLSchema-instance",
        "@xsi:type": "MandatSimple_Type",
        "uid": "PM320174",
        "acteurRef": "PA1090",
        "legislature": null,
        "typeOrgane": "COMSENAT",
        "dateDebut": "2004-10-07T02:00:00.000+02:00",
        "datePublication": null,
        "dateFin": "2008-10-06T02:00:00.000+02:00",
        "preseance": null,
        "nominPrincipale": "1",
        "infosQualite": {
          "codeQualite": null,
          "libQualite": "Vice-Président",
          "libQualiteSex": "Vice-Président"
        },
        "organes": {
          "organeRef": "PO211493"
        }
      },
      {
        "@xmlns:xsi": "http://www.w3.org/2001/XMLSchema-instance",
        "@xsi:type": "MandatSimple_Type",
        "uid": "PM416018",
        "acteurRef": "PA1090",
        "legislature": null,
        "typeOrgane": "COMSENAT",
        "dateDebut": "2008-10-07T02:00:00.000+02:00",
        "datePublication": null,
        "dateFin": "2011-01-13T01:00:00.000+01:00",
        "preseance": null,
        "nominPrincipale": "1",
        "infosQualite": {
          "codeQualite": null,
          "libQualite": "Vice-Président",
          "libQualiteSex": "Vice-Président"
        },
        "organes": {
          "organeRef": "PO211493"
        }
      },
      {
        "@xmlns:xsi": "http://www.w3.org/2001/XMLSchema-instance",
        "@xsi:type": "MandatSimple_Type",
        "uid": "PM704217",
        "acteurRef": "PA1090",
        "legislature": null,
        "typeOrgane": "COMSENAT",
        "dateDebut": "2014-10-09T02:00:00.000+02:00",
        "datePublication": null,
        "dateFin": "2017-10-04T02:00:00.000+02:00",
        "preseance": null,
        "nominPrincipale": "1",
        "infosQualite": {
          "codeQualite": null,
          "libQualite": "Vice-Président",
          "libQualiteSex": "Vice-Président"
        },
        "organes": {
          "organeRef": "PO211493"
        }
      },
      {
        "@xmlns:xsi": "http://www.w3.org/2001/XMLSchema-instance",
        "@xsi:type": "MandatSimple_Type",
        "uid": "PM286589",
        "acteurRef": "PA1090",
        "legislature": null,
        "typeOrgane": "GROUPESENAT",
        "dateDebut": "2002-12-11T01:00:00.000+01:00",
        "datePublication": "2002-12-11T01:00:00.000+01:00",
        "dateFin": null,
        "preseance": "8",
        "nominPrincipale": "1",
        "infosQualite": {
          "codeQualite": "Membre rattaché",
          "libQualite": "Membre rattaché",
          "libQualiteSex": "Membre rattaché"
        },
        "organes": {
          "organeRef": "PO286005"
        }
      },
      {
        "@xmlns:xsi": "http://www.w3.org/2001/XMLSchema-instance",
        "@xsi:type": "MandatParlementaire_type",
        "uid": "PM426116",
        "acteurRef": "PA1090",
        "legislature": null,
        "typeOrgane": "SENAT",
        "dateDebut": "2010-12-07T01:00:00.000+01:00",
        "datePublication": null,
        "dateFin": "2014-09-30T02:00:00.000+02:00",
        "preseance": null,
        "nominPrincipale": "1",
        "infosQualite": {
          "codeQualite": null,
          "libQualite": "Questeur",
          "libQualiteSex": "Questeur"
        },
        "organes": {
          "organeRef": "PO78718"
        },
        "suppleants": null,
        "chambre": null,
        "election": {
          "lieu": {
            "region": null,
            "regionType": null,
            "departement": null,
            "numDepartement": null,
            "numCirco": null
          },
          "causeMandat": null
        },
        "mandature": {
          "datePriseFonction": null,
          "causeFin": null,
          "premiereElection": "0",
          "placeHemicycle": null,
          "mandatRemplaceRef": null
        },
        "collaborateurs": null
      },
      {
        "@xmlns:xsi": "http://www.w3.org/2001/XMLSchema-instance",
        "@xsi:type": "MandatParlementaire_type",
        "uid": "PM415584",
        "acteurRef": "PA1090",
        "legislature": null,
        "typeOrgane": "SENAT",
        "dateDebut": "2008-10-01T02:00:00.000+02:00",
        "datePublication": null,
        "dateFin": "2014-09-30T02:00:00.000+02:00",
        "preseance": "20",
        "nominPrincipale": "1",
        "infosQualite": {
          "codeQualite": "Sénateur",
          "libQualite": "SENATEUR",
          "libQualiteSex": "SENATEUR"
        },
        "organes": {
          "organeRef": "PO78718"
        },
        "suppleants": null,
        "chambre": null,
        "election": {
          "lieu": {
            "region": null,
            "regionType": null,
            "departement": null,
            "numDepartement": "03",
            "numCirco": null
          },
          "causeMandat": null
        },
        "mandature": {
          "datePriseFonction": null,
          "causeFin": null,
          "premiereElection": "0",
          "placeHemicycle": null,
          "mandatRemplaceRef": null
        },
        "collaborateurs": null
      },
      {
        "@xmlns:xsi": "http://www.w3.org/2001/XMLSchema-instance",
        "@xsi:type": "MandatParlementaire_type",
        "uid": "PM89540",
        "acteurRef": "PA1090",
        "legislature": null,
        "typeOrgane": "SENAT",
        "dateDebut": "1998-10-01T02:00:00.000+02:00",
        "datePublication": "1998-10-02T02:00:00.000+02:00",
        "dateFin": "2008-09-30T02:00:00.000+02:00",
        "preseance": "20",
        "nominPrincipale": "1",
        "infosQualite": {
          "codeQualite": "Sénateur",
          "libQualite": "SENATEUR",
          "libQualiteSex": "SENATEUR"
        },
        "organes": {
          "organeRef": "PO78718"
        },
        "suppleants": null,
        "chambre": null,
        "election": {
          "lieu": {
            "region": null,
            "regionType": null,
            "departement": null,
            "numDepartement": "03",
            "numCirco": null
          },
          "causeMandat": null
        },
        "mandature": {
          "datePriseFonction": null,
          "causeFin": null,
          "premiereElection": "0",
          "placeHemicycle": null,
          "mandatRemplaceRef": null
        },
        "collaborateurs": null
      },
      {
        "@xmlns:xsi": "http://www.w3.org/2001/XMLSchema-instance",
        "@xsi:type": "MandatParlementaire_type",
        "uid": "PM703681",
        "acteurRef": "PA1090",
        "legislature": null,
        "typeOrgane": "SENAT",
        "dateDebut": "2014-10-01T02:00:00.000+02:00",
        "datePublication": null,
        "dateFin": null,
        "preseance": "20",
        "nominPrincipale": "1",
        "infosQualite": {
          "codeQualite": "Sénateur",
          "libQualite": "SENATEUR",
          "libQualiteSex": "SENATEUR"
        },
        "organes": {
          "organeRef": "PO78718"
        },
        "suppleants": null,
        "chambre": null,
        "election": {
          "lieu": {
            "region": null,
            "regionType": null,
            "departement": null,
            "numDepartement": "03",
            "numCirco": null
          },
          "causeMandat": null
        },
        "mandature": {
          "datePriseFonction": null,
          "causeFin": null,
          "premiereElection": "0",
          "placeHemicycle": null,
          "mandatRemplaceRef": null
        },
        "collaborateurs": null
      },
      {
        "@xmlns:xsi": "http://www.w3.org/2001/XMLSchema-instance",
        "@xsi:type": "MandatSimple_Type",
        "uid": "PM704646",
        "acteurRef": "PA1090",
        "legislature": null,
        "typeOrgane": "CMP",
        "dateDebut": "2014-11-18T01:00:00.000+01:00",
        "datePublication": "2014-11-18T01:00:00.000+01:00",
        "dateFin": "2014-12-01T01:00:00.000+01:00",
        "preseance": "28",
        "nominPrincipale": "1",
        "infosQualite": {
          "codeQualite": "Suppléant",
          "libQualite": "Membre suppléant",
          "libQualiteSex": "Membre suppléant"
        },
        "organes": {
          "organeRef": "PO704616"
        }
      },
      {
        "@xmlns:xsi": "http://www.w3.org/2001/XMLSchema-instance",
        "@xsi:type": "MandatSimple_Type",
        "uid": "PM768223",
        "acteurRef": "PA1090",
        "legislature": null,
        "typeOrgane": "CMP",
        "dateDebut": "2019-11-14T01:00:00.000+01:00",
        "datePublication": "2019-11-15T01:00:00.000+01:00",
        "dateFin": null,
        "preseance": "28",
        "nominPrincipale": "1",
        "infosQualite": {
          "codeQualite": "Suppléant",
          "libQualite": "Membre suppléant",
          "libQualiteSex": "Membre suppléant"
        },
        "organes": {
          "organeRef": "PO768194"
        }
      },
      {
        "@xmlns:xsi": "http://www.w3.org/2001/XMLSchema-instance",
        "@xsi:type": "MandatSimple_Type",
        "uid": "PM710201",
        "acteurRef": "PA1090",
        "legislature": null,
        "typeOrgane": "CMP",
        "dateDebut": "2015-11-12T01:00:00.000+01:00",
        "datePublication": "2015-11-17T01:00:00.000+01:00",
        "dateFin": "2015-11-18T01:00:00.000+01:00",
        "preseance": "28",
        "nominPrincipale": "1",
        "infosQualite": {
          "codeQualite": "Suppléant",
          "libQualite": "Membre suppléant",
          "libQualiteSex": "Membre suppléant"
        },
        "organes": {
          "organeRef": "PO710132"
        }
      },
      {
        "@xmlns:xsi": "http://www.w3.org/2001/XMLSchema-instance",
        "@xsi:type": "MandatSimple_Type",
        "uid": "PM744586",
        "acteurRef": "PA1090",
        "legislature": null,
        "typeOrgane": "CMP",
        "dateDebut": "2017-11-30T01:00:00.000+01:00",
        "datePublication": "2017-12-01T01:00:00.000+01:00",
        "dateFin": "2018-02-15T01:00:00.000+01:00",
        "preseance": "28",
        "nominPrincipale": "1",
        "infosQualite": {
          "codeQualite": "Suppléant",
          "libQualite": "Membre suppléant",
          "libQualiteSex": "Membre suppléant"
        },
        "organes": {
          "organeRef": "PO739847"
        }
      },
      {
        "@xmlns:xsi": "http://www.w3.org/2001/XMLSchema-instance",
        "@xsi:type": "MandatSimple_Type",
        "uid": "PM425451",
        "acteurRef": "PA1090",
        "legislature": null,
        "typeOrgane": "CMP",
        "dateDebut": "2010-10-22T02:00:00.000+02:00",
        "datePublication": "2010-10-23T02:00:00.000+02:00",
        "dateFin": "2010-10-28T02:00:00.000+02:00",
        "preseance": "28",
        "nominPrincipale": "1",
        "infosQualite": {
          "codeQualite": "Suppléant",
          "libQualite": "Membre suppléant",
          "libQualiteSex": "Membre suppléant"
        },
        "organes": {
          "organeRef": "PO425421"
        }
      },
      {
        "@xmlns:xsi": "http://www.w3.org/2001/XMLSchema-instance",
        "@xsi:type": "MandatSimple_Type",
        "uid": "PM760461",
        "acteurRef": "PA1090",
        "legislature": null,
        "typeOrgane": "CMP",
        "dateDebut": "2018-11-15T01:00:00.000+01:00",
        "datePublication": "2018-11-21T01:00:00.000+01:00",
        "dateFin": "2018-12-03T01:00:00.000+01:00",
        "preseance": "28",
        "nominPrincipale": "1",
        "infosQualite": {
          "codeQualite": "Suppléant",
          "libQualite": "Membre suppléant",
          "libQualiteSex": "Membre suppléant"
        },
        "organes": {
          "organeRef": "PO760284"
        }
      },
      {
        "@xmlns:xsi": "http://www.w3.org/2001/XMLSchema-instance",
        "@xsi:type": "MandatSimple_Type",
        "uid": "PM744559",
        "acteurRef": "PA1090",
        "legislature": null,
        "typeOrgane": "CMP",
        "dateDebut": "2017-11-30T01:00:00.000+01:00",
        "datePublication": "2017-12-01T01:00:00.000+01:00",
        "dateFin": "2017-12-20T01:00:00.000+01:00",
        "preseance": "28",
        "nominPrincipale": "1",
        "infosQualite": {
          "codeQualite": "Suppléant",
          "libQualite": "Membre suppléant",
          "libQualiteSex": "Membre suppléant"
        },
        "organes": {
          "organeRef": "PO739840"
        }
      },
      {
        "@xmlns:xsi": "http://www.w3.org/2001/XMLSchema-instance",
        "@xsi:type": "MandatSimple_Type",
        "uid": "PM715529",
        "acteurRef": "PA1090",
        "legislature": null,
        "typeOrgane": "CMP",
        "dateDebut": "2016-11-17T01:00:00.000+01:00",
        "datePublication": "2016-11-18T01:00:00.000+01:00",
        "dateFin": "2016-11-23T01:00:00.000+01:00",
        "preseance": "28",
        "nominPrincipale": "1",
        "infosQualite": {
          "codeQualite": "Suppléant",
          "libQualite": "Membre suppléant",
          "libQualiteSex": "Membre suppléant"
        },
        "organes": {
          "organeRef": "PO715306"
        }
      },
      {
        "@xmlns:xsi": "http://www.w3.org/2001/XMLSchema-instance",
        "@xsi:type": "MandatSimple_Type",
        "uid": "PM748102",
        "acteurRef": "PA1090",
        "legislature": null,
        "typeOrgane": "CMP",
        "dateDebut": "2018-01-25T01:00:00.000+01:00",
        "datePublication": "2018-01-26T01:00:00.000+01:00",
        "dateFin": "2018-02-14T01:00:00.000+01:00",
        "preseance": "28",
        "nominPrincipale": "1",
        "infosQualite": {
          "codeQualite": "Suppléant",
          "libQualite": "Membre suppléant",
          "libQualiteSex": "Membre suppléant"
        },
        "organes": {
          "organeRef": "PO748059"
        }
      },
      {
        "@xmlns:xsi": "http://www.w3.org/2001/XMLSchema-instance",
        "@xsi:type": "MandatSimple_Type",
        "uid": "PM743695",
        "acteurRef": "PA1090",
        "legislature": null,
        "typeOrgane": "CMP",
        "dateDebut": "2017-11-17T01:00:00.000+01:00",
        "datePublication": "2017-11-22T01:00:00.000+01:00",
        "dateFin": "2017-12-22T01:00:00.000+01:00",
        "preseance": "28",
        "nominPrincipale": "1",
        "infosQualite": {
          "codeQualite": "Suppléant",
          "libQualite": "Membre suppléant",
          "libQualiteSex": "Membre suppléant"
        },
        "organes": {
          "organeRef": "PO743571"
        }
      },
      {
        "@xmlns:xsi": "http://www.w3.org/2001/XMLSchema-instance",
        "@xsi:type": "MandatSimple_Type",
        "uid": "PM416736",
        "acteurRef": "PA1090",
        "legislature": null,
        "typeOrgane": "CMP",
        "dateDebut": "2008-11-21T01:00:00.000+01:00",
        "datePublication": "2008-11-22T01:00:00.000+01:00",
        "dateFin": "2008-12-08T01:00:00.000+01:00",
        "preseance": "28",
        "nominPrincipale": "1",
        "infosQualite": {
          "codeQualite": "Suppléant",
          "libQualite": "Membre suppléant",
          "libQualiteSex": "Membre suppléant"
        },
        "organes": {
          "organeRef": "PO416705"
        }
      }
    ]
  }
}