{
  "@xmlns": "http://schemas.assemblee-nationale.fr/referentiel",
  "uid": {
    "@xmlns:xsi": "http://www.w3.org/2001/XMLSchema-instance",
    "@xsi:type": "IdActeur_type",
    "#text": "PA391505"
  },
  "etatCivil": {
    "ident": {
      "civ": "Mme",
      "prenom": "Brigitte",
      "nom": "Gonthier-Maurin",
      "alpha": "GONTHIER-MAURIN BRIGITTE",
      "trigramme": {
        "@xmlns:xsi": "http://www.w3.org/2001/XMLSchema-instance",
        "@xsi:nil": "true"
      }
    },
    "infoNaissance": {
      "dateNais": "1956-04-23T01:00:00.000+01:00",
      "villeNais": {
        "@xmlns:xsi": "http://www.w3.org/2001/XMLSchema-instance",
        "@xsi:nil": "true"
      },
      "depNais": {
        "@xmlns:xsi": "http://www.w3.org/2001/XMLSchema-instance",
        "@xsi:nil": "true"
      },
      "paysNais": {
        "@xmlns:xsi": "http://www.w3.org/2001/XMLSchema-instance",
        "@xsi:nil": "true"
      }
    },
    "dateDeces": {
      "@xmlns:xsi": "http://www.w3.org/2001/XMLSchema-instance",
      "@xsi:nil": "true"
    }
  },
  "profession": {
    "libelleCourant": {
      "@xmlns:xsi": "http://www.w3.org/2001/XMLSchema-instance",
      "@xsi:nil": "true"
    },
    "socProcINSEE": {
      "catSocPro": {
        "@xmlns:xsi": "http://www.w3.org/2001/XMLSchema-instance",
        "@xsi:nil": "true"
      },
      "famSocPro": {
        "@xmlns:xsi": "http://www.w3.org/2001/XMLSchema-instance",
        "@xsi:nil": "true"
      }
    }
  },
  "uri_hatvp": {
    "@xmlns:xsi": "http://www.w3.org/2001/XMLSchema-instance",
    "@xsi:nil": "true"
  },
  "adresses": {
    "adresse": {
      "@xmlns:xsi": "http://www.w3.org/2001/XMLSchema-instance",
      "@xsi:type": "AdresseSiteWeb_Type",
      "uid": "AD391567",
      "type": "23",
      "typeLibelle": "Url sénateur",
      "poids": null,
      "adresseDeRattachement": null,
      "valElec": "https://www.senat.fr/senateur/gonthier_maurin_brigitte07026q.html"
    }
  },
  "mandats": {
    "mandat": [
      {
        "@xmlns:xsi": "http://www.w3.org/2001/XMLSchema-instance",
        "@xsi:type": "MandatSimple_Type",
        "uid": "PM704972",
        "acteurRef": "PA391505",
        "legislature": null,
        "typeOrgane": "DELEGSENAT",
        "dateDebut": "2014-11-06T01:00:00.000+01:00",
        "datePublication": null,
        "dateFin": null,
        "preseance": null,
        "nominPrincipale": "1",
        "infosQualite": {
          "codeQualite": null,
          "libQualite": "Vice-Président",
          "libQualiteSex": null
        },
        "organes": {
          "organeRef": "PO310693"
        }
      },
      {
        "@xmlns:xsi": "http://www.w3.org/2001/XMLSchema-instance",
        "@xsi:type": "MandatSimple_Type",
        "uid": "PM704283",
        "acteurRef": "PA391505",
        "legislature": null,
        "typeOrgane": "COMSPSENAT",
        "dateDebut": "2014-10-09T02:00:00.000+02:00",
        "datePublication": null,
        "dateFin": "2016-04-13T02:00:00.000+02:00",
        "preseance": null,
        "nominPrincipale": "1",
        "infosQualite": {
          "codeQualite": null,
          "libQualite": "Membre",
          "libQualiteSex": null
        },
        "organes": {
          "organeRef": "PO699895"
        }
      },
      {
        "@xmlns:xsi": "http://www.w3.org/2001/XMLSchema-instance",
        "@xsi:type": "MandatSimple_Type",
        "uid": "PM436973",
        "acteurRef": "PA391505",
        "legislature": null,
        "typeOrgane": "DELEGSENAT",
        "dateDebut": "2011-11-30T01:00:00.000+01:00",
        "datePublication": null,
        "dateFin": null,
        "preseance": "4",
        "nominPrincipale": "1",
        "infosQualite": {
          "codeQualite": "Membre",
          "libQualite": "Membre",
          "libQualiteSex": "Membre"
        },
        "organes": {
          "organeRef": "PO310693"
        }
      },
      {
        "@xmlns:xsi": "http://www.w3.org/2001/XMLSchema-instance",
        "@xsi:type": "MandatSimple_Type",
        "uid": "PM421095",
        "acteurRef": "PA391505",
        "legislature": null,
        "typeOrgane": "COMSPSENAT",
        "dateDebut": "2009-07-22T02:00:00.000+02:00",
        "datePublication": null,
        "dateFin": "2009-10-14T02:00:00.000+02:00",
        "preseance": null,
        "nominPrincipale": "1",
        "infosQualite": {
          "codeQualite": null,
          "libQualite": "Membre",
          "libQualiteSex": null
        },
        "organes": {
          "organeRef": "PO421070"
        }
      },
      {
        "@xmlns:xsi": "http://www.w3.org/2001/XMLSchema-instance",
        "@xsi:type": "MandatSimple_Type",
        "uid": "PM449795",
        "acteurRef": "PA391505",
        "legislature": null,
        "typeOrgane": "DELEGSENAT",
        "dateDebut": "2011-12-14T01:00:00.000+01:00",
        "datePublication": null,
        "dateFin": null,
        "preseance": null,
        "nominPrincipale": "1",
        "infosQualite": {
          "codeQualite": null,
          "libQualite": "Président",
          "libQualiteSex": null
        },
        "organes": {
          "organeRef": "PO310693"
        }
      },
      {
        "@xmlns:xsi": "http://www.w3.org/2001/XMLSchema-instance",
        "@xsi:type": "MandatSimple_Type",
        "uid": "PM423193",
        "acteurRef": "PA391505",
        "legislature": null,
        "typeOrgane": "COMSPSENAT",
        "dateDebut": "2009-12-09T01:00:00.000+01:00",
        "datePublication": null,
        "dateFin": "2010-04-08T02:00:00.000+02:00",
        "preseance": null,
        "nominPrincipale": "1",
        "infosQualite": {
          "codeQualite": null,
          "libQualite": "Membre",
          "libQualiteSex": null
        },
        "organes": {
          "organeRef": "PO422577"
        }
      },
      {
        "@xmlns:xsi": "http://www.w3.org/2001/XMLSchema-instance",
        "@xsi:type": "MandatAvecSuppleant_Type",
        "uid": "PM704511",
        "acteurRef": "PA391505",
        "legislature": null,
        "typeOrgane": "OFFPAR",
        "dateDebut": "2014-11-01T01:00:00.000+01:00",
        "datePublication": "2014-11-01T01:00:00.000+01:00",
        "dateFin": "2015-02-20T01:00:00.000+01:00",
        "preseance": "24",
        "nominPrincipale": "1",
        "infosQualite": {
          "codeQualite": "Membre",
          "libQualite": "Membre",
          "libQualiteSex": "Membre"
        },
        "organes": {
          "organeRef": "PO273589"
        },
        "suppleants": null
      },
      {
        "@xmlns:xsi": "http://www.w3.org/2001/XMLSchema-instance",
        "@xsi:type": "MandatSimple_Type",
        "uid": "PM704238",
        "acteurRef": "PA391505",
        "legislature": null,
        "typeOrgane": "COMSENAT",
        "dateDebut": "2014-10-09T02:00:00.000+02:00",
        "datePublication": null,
        "dateFin": "2017-10-01T02:00:00.000+02:00",
        "preseance": null,
        "nominPrincipale": "1",
        "infosQualite": {
          "codeQualite": null,
          "libQualite": "Vice-Président",
          "libQualiteSex": null
        },
        "organes": {
          "organeRef": "PO211490"
        }
      },
      {
        "@xmlns:xsi": "http://www.w3.org/2001/XMLSchema-instance",
        "@xsi:type": "MandatSimple_Type",
        "uid": "PM392440",
        "acteurRef": "PA391505",
        "legislature": null,
        "typeOrgane": "COMSENAT",
        "dateDebut": "2007-07-11T02:00:00.000+02:00",
        "datePublication": null,
        "dateFin": "2011-09-30T02:00:00.000+02:00",
        "preseance": "10",
        "nominPrincipale": "1",
        "infosQualite": {
          "codeQualite": "Membre",
          "libQualite": "Membre",
          "libQualiteSex": "Membre"
        },
        "organes": {
          "organeRef": "PO211490"
        }
      },
      {
        "@xmlns:xsi": "http://www.w3.org/2001/XMLSchema-instance",
        "@xsi:type": "MandatSimple_Type",
        "uid": "PM704127",
        "acteurRef": "PA391505",
        "legislature": null,
        "typeOrgane": "COMSENAT",
        "dateDebut": "2014-10-08T02:00:00.000+02:00",
        "datePublication": null,
        "dateFin": "2014-10-08T02:00:00.000+02:00",
        "preseance": "10",
        "nominPrincipale": "1",
        "infosQualite": {
          "codeQualite": "Membre",
          "libQualite": "Membre",
          "libQualiteSex": "Membre"
        },
        "organes": {
          "organeRef": "PO211490"
        }
      },
      {
        "@xmlns:xsi": "http://www.w3.org/2001/XMLSchema-instance",
        "@xsi:type": "MandatSimple_Type",
        "uid": "PM430431",
        "acteurRef": "PA391505",
        "legislature": null,
        "typeOrgane": "COMSENAT",
        "dateDebut": "2011-10-01T02:00:00.000+02:00",
        "datePublication": null,
        "dateFin": "2014-10-07T02:00:00.000+02:00",
        "preseance": null,
        "nominPrincipale": "1",
        "infosQualite": {
          "codeQualite": null,
          "libQualite": "Vice-Président",
          "libQualiteSex": null
        },
        "organes": {
          "organeRef": "PO211490"
        }
      },
      {
        "@xmlns:xsi": "http://www.w3.org/2001/XMLSchema-instance",
        "@xsi:type": "MandatSimple_Type",
        "uid": "PM391557",
        "acteurRef": "PA391505",
        "legislature": null,
        "typeOrgane": "GROUPESENAT",
        "dateDebut": "2007-06-29T02:00:00.000+02:00",
        "datePublication": null,
        "dateFin": "2007-07-03T02:00:00.000+02:00",
        "preseance": "4",
        "nominPrincipale": "1",
        "infosQualite": {
          "codeQualite": "Membre",
          "libQualite": "Membre",
          "libQualiteSex": "Membre du"
        },
        "organes": {
          "organeRef": "PO77708"
        }
      },
      {
        "@xmlns:xsi": "http://www.w3.org/2001/XMLSchema-instance",
        "@xsi:type": "MandatSimple_Type",
        "uid": "PM391558",
        "acteurRef": "PA391505",
        "legislature": null,
        "typeOrgane": "GROUPESENAT",
        "dateDebut": "2007-07-04T02:00:00.000+02:00",
        "datePublication": null,
        "dateFin": "2017-10-01T02:00:00.000+02:00",
        "preseance": "4",
        "nominPrincipale": "1",
        "infosQualite": {
          "codeQualite": "Membre",
          "libQualite": "Membre",
          "libQualiteSex": "Membre du"
        },
        "organes": {
          "organeRef": "PO77707"
        }
      },
      {
        "@xmlns:xsi": "http://www.w3.org/2001/XMLSchema-instance",
        "@xsi:type": "MandatSimple_Type",
        "uid": "PM695503",
        "acteurRef": "PA391505",
        "legislature": null,
        "typeOrgane": "CMP",
        "dateDebut": "2013-06-24T02:00:00.000+02:00",
        "datePublication": "2013-06-25T02:00:00.000+02:00",
        "dateFin": "2013-07-16T02:00:00.000+02:00",
        "preseance": "28",
        "nominPrincipale": "1",
        "infosQualite": {
          "codeQualite": "Suppléant",
          "libQualite": "Membre suppléant",
          "libQualiteSex": "Membre suppléante"
        },
        "organes": {
          "organeRef": "PO695475"
        }
      },
      {
        "@xmlns:xsi": "http://www.w3.org/2001/XMLSchema-instance",
        "@xsi:type": "MandatSimple_Type",
        "uid": "PM414880",
        "acteurRef": "PA391505",
        "legislature": null,
        "typeOrgane": "CMP",
        "dateDebut": "2008-07-18T02:00:00.000+02:00",
        "datePublication": "2008-07-19T02:00:00.000+02:00",
        "dateFin": "2008-07-23T02:00:00.000+02:00",
        "preseance": "28",
        "nominPrincipale": "1",
        "infosQualite": {
          "codeQualite": "Suppléant",
          "libQualite": "Membre suppléant",
          "libQualiteSex": "Membre suppléante"
        },
        "organes": {
          "organeRef": "PO414843"
        }
      },
      {
        "@xmlns:xsi": "http://www.w3.org/2001/XMLSchema-instance",
        "@xsi:type": "MandatParlementaire_type",
        "uid": "PM391563",
        "acteurRef": "PA391505",
        "legislature": null,
        "typeOrgane": "SENAT",
        "dateDebut": "2007-06-29T02:00:00.000+02:00",
        "datePublication": null,
        "dateFin": "2011-09-30T02:00:00.000+02:00",
        "preseance": "20",
        "nominPrincipale": "1",
        "infosQualite": {
          "codeQualite": "Sénateur",
          "libQualite": "SENATEUR",
          "libQualiteSex": "Sénateur 5ème République"
        },
        "organes": {
          "organeRef": "PO78718"
        },
        "suppleants": null,
        "chambre": null,
        "election": {
          "lieu": {
            "region": null,
            "regionType": null,
            "departement": null,
            "numDepartement": "92",
            "numCirco": null
          },
          "causeMandat": null
        },
        "mandature": {
          "datePriseFonction": null,
          "causeFin": null,
          "premiereElection": "0",
          "placeHemicycle": null,
          "mandatRemplaceRef": null
        },
        "collaborateurs": null
      },
      {
        "@xmlns:xsi": "http://www.w3.org/2001/XMLSchema-instance",
        "@xsi:type": "MandatParlementaire_type",
        "uid": "PM430062",
        "acteurRef": "PA391505",
        "legislature": null,
        "typeOrgane": "SENAT",
        "dateDebut": "2011-10-01T02:00:00.000+02:00",
        "datePublication": null,
        "dateFin": "2017-10-01T02:00:00.000+02:00",
        "preseance": "20",
        "nominPrincipale": "1",
        "infosQualite": {
          "codeQualite": "Sénateur",
          "libQualite": "SENATEUR",
          "libQualiteSex": "Sénateur 5ème République"
        },
        "organes": {
          "organeRef": "PO78718"
        },
        "suppleants": null,
        "chambre": null,
        "election": {
          "lieu": {
            "region": null,
            "regionType": null,
            "departement": null,
            "numDepartement": "92",
            "numCirco": null
          },
          "causeMandat": null
        },
        "mandature": {
          "datePriseFonction": null,
          "causeFin": null,
          "premiereElection": "0",
          "placeHemicycle": null,
          "mandatRemplaceRef": null
        },
        "collaborateurs": null
      }
    ]
  }
}