{
  "@xmlns": "http://schemas.assemblee-nationale.fr/referentiel",
  "@xmlns:xsi": "http://www.w3.org/2001/XMLSchema-instance",
  "@xsi:type": "GroupePolitique_type",
  "uid": "PO730934",
  "codeType": "GP",
  "libelle": "Les Républicains",
  "libelleEdition": "du groupe Les Républicains",
  "libelleAbrege": "LR",
  "libelleAbrev": "LR",
  "viMoDe": {
    "dateDebut": "2017-06-27T02:00:00.000+02:00",
    "dateAgrement": null,
    "dateFin": null
  },
  "organeParent": null,
  "chambre": null,
  "regime": "5ème République",
  "legislature": "15",
  "secretariat": {
    "secretaire01": null,
    "secretaire02": null
  },
  "positionPolitique": "Opposition",
  "preseance": "2",
  "couleurAssociee": "#1C2EFA"
}