{
  "@xmlns": "http://schemas.assemblee-nationale.fr/referentiel",
  "@xmlns:xsi": "http://www.w3.org/2001/XMLSchema-instance",
  "@xsi:type": "OrganeParlementaire_Type",
  "uid": "PO489394",
  "codeType": "CMP",
  "libelle": "Commission mixte paritaire chargée de proposer un texte sur les dispositions restant en discussion du projet de loi portant réforme des ports d'outre-mer relevant de l'Etat",
  "libelleEdition": "du projet de loi portant réforme des ports d'outre-mer relevant de l'Etat",
  "libelleAbrege": "Ports d'outre-mer",
  "libelleAbrev": "3858",
  "viMoDe": {
    "dateDebut": "2012-01-27T01:00:00.000+01:00",
    "dateAgrement": null,
    "dateFin": "2012-02-13T01:00:00.000+01:00"
  },
  "organeParent": null,
  "chambre": null,
  "regime": "5ème République",
  "legislature": "13",
  "secretariat": {
    "secretaire01": null,
    "secretaire02": null
  }
}