{
  "@xmlns": "http://schemas.assemblee-nationale.fr/referentiel",
  "@xmlns:xsi": "http://www.w3.org/2001/XMLSchema-instance",
  "@xsi:type": "OrganeParlementaire_Type",
  "uid": "PO711218",
  "codeType": "MISINFO",
  "libelle": "Formation des enseignants",
  "libelleEdition": "de la mission d'information sur la formation des enseignants",
  "libelleAbrege": "Formation des enseignants",
  "libelleAbrev": "FORMENS",
  "viMoDe": {
    "dateDebut": "2015-12-16T01:00:00.000+01:00",
    "dateAgrement": null,
    "dateFin": "2016-10-05T02:00:00.000+02:00"
  },
  "organeParent": "PO419604",
  "chambre": null,
  "regime": "5ème République",
  "legislature": "14",
  "secretariat": {
    "secretaire01": null,
    "secretaire02": null
  }
}