{
  "@xmlns": "http://schemas.assemblee-nationale.fr/referentiel",
  "@xmlns:xsi": "http://www.w3.org/2001/XMLSchema-instance",
  "@xsi:type": "OrganeParlementaire_Type",
  "uid": "PO753655",
  "codeType": "CMP",
  "libelle": "Commission mixte paritaire chargée de proposer un texte sur les dispositions restant en discussion du projet de loi renforçant l'efficacité de l'administration pour une relation de confiance avec le public",
  "libelleEdition": "de la commission mixte paritaire chargée de proposer un texte sur les dispositions restant en discussion du projet de loi renforçant l'efficacité de l'administration pour une relation de confiance avec le public",
  "libelleAbrege": "Société de confiance",
  "libelleAbrev": "424",
  "viMoDe": {
    "dateDebut": "2018-03-15T01:00:00.000+01:00",
    "dateAgrement": null,
    "dateFin": "2018-07-31T02:00:00.000+02:00"
  },
  "organeParent": null,
  "chambre": null,
  "regime": "5ème République",
  "legislature": "15",
  "secretariat": {
    "secretaire01": null,
    "secretaire02": null
  }
}