{
  "@xmlns": "http://schemas.assemblee-nationale.fr/referentiel",
  "@xmlns:xsi": "http://www.w3.org/2001/XMLSchema-instance",
  "@xsi:type": "OrganeExtraParlementaire_type",
  "uid": "PO223698",
  "codeType": "ORGEXTPARL",
  "libelle": "Commission nationale d'information sur les farines animales",
  "libelleEdition": "de la commission nationale d'information sur les farines animales",
  "libelleAbrege": "Farines animales",
  "libelleAbrev": "IFA",
  "viMoDe": {
    "dateDebut": "2001-02-05T01:00:00.000+01:00",
    "dateAgrement": null,
    "dateFin": "2012-05-14T02:00:00.000+02:00"
  },
  "organeParent": null,
  "chambre": null,
  "regime": "5ème République",
  "legislature": null,
  "regimeJuridique": "décision du gouvernement, non datée, non publiée au J.O.",
  "siteInternet": null,
  "nombreReunionsAnnuelles": null
}