{
  "xsiType": "OrganeExterne_Type",
  "uid": "PO686029",
  "codeType": "PARPOL",
  "libelle": "Pour la Réunion",
  "libelleEdition": "Pour la Réunion",
  "libelleAbrege": "Pour la Réunion",
  "libelleAbrev": "PLR",
  "viMoDe": {}
}