{
  "uid": "PA607919",
  "etatCivil": {
    "ident": {
      "civ": "Mme",
      "prenom": "Anne-Lise",
      "nom": "Dufour-Tonini",
      "alpha": "Dufour_Tonini_Anne_Lise"
    },
    "infoNaissance": {
      "dateNais": "1970-03-02T01:00:00.000+01:00",
      "villeNais": "Denain",
      "depNais": "Nord",
      "paysNais": "France"
    }
  },
  "profession": {
    "libelleCourant": "Chef d'établissement scolaire",
    "socProcInsee": {
      "catSocPro": "Professions intermédiaires de l'enseignement, de la santé, de la fonction publique et assimilés",
      "famSocPro": "Professions Intermédiaires"
    }
  },
  "adresses": [
    {
      "xsiType": "AdresseMail_Type",
      "uid": "AD648596",
      "type": "15",
      "typeLibelle": "Mèl",
      "valElec": "aldufourtonini@assemblee-nationale.fr"
    },
    {
      "xsiType": "AdressePostale_Type",
      "uid": "AD648644",
      "type": "0",
      "typeLibelle": "Adresse officielle",
      "poids": "1",
      "intitule": "Assemblée nationale,",
      "numeroRue": "126",
      "nomRue": "Rue de l'Université,",
      "codePostal": "75355",
      "ville": "PARIS 07 SP"
    },
    {
      "xsiType": "AdressePostale_Type",
      "uid": "AD648647",
      "type": "2",
      "typeLibelle": "Adresse publiée de circonscription",
      "poids": "22",
      "intitule": "Hôtel de ville",
      "nomRue": "Rue de Villars",
      "codePostal": "59220",
      "ville": "Denain"
    },
    {
      "xsiType": "AdresseTelephonique_Type",
      "uid": "AD648648",
      "type": "11",
      "typeLibelle": "Téléphone",
      "poids": "22",
      "adresseDeRattachement": "AD648647",
      "valElec": "0327235959"
    },
    {
      "xsiType": "AdresseMail_Type",
      "uid": "AD648651",
      "type": "15",
      "typeLibelle": "Mèl",
      "valElec": "aldtdenain@gmail.com"
    },
    {
      "xsiType": "AdresseSiteWeb_Type",
      "uid": "AD732499",
      "type": "23",
      "typeLibelle": "Url sénateur",
      "valElec": "https://www.senat.fr/senateur/dufour_tonini_anne_lise18127e.html"
    }
  ],
  "mandats": [
    {
      "xsiType": "MandatParlementaire_type",
      "uid": "PM645478",
      "acteurRef": "PA607919",
      "legislature": "14",
      "typeOrgane": "ASSEMBLEE",
      "dateDebut": "2012-06-20T02:00:00.000+02:00",
      "dateFin": "2017-06-20T02:00:00.000+02:00",
      "preseance": "50",
      "nominPrincipale": "1",
      "infosQualite": {
        "codeQualite": "membre",
        "libQualite": "membre",
        "libQualiteSex": "membre"
      },
      "organesRefs": [
        "PO644420"
      ],
      "suppleant": {
        "dateDebut": "2012-06-20T02:00:00.000+02:00",
        "dateFin": "2017-06-20T02:00:00.000+02:00",
        "suppleantRef": "PA642872"
      },
      "election": {
        "lieu": {
          "region": "Hauts-de-France",
          "regionType": "Métropolitain",
          "departement": "Nord",
          "numDepartement": "59",
          "numCirco": "19"
        },
        "causeMandat": "élections générales",
        "refCirconscription": "PO644715"
      },
      "mandature": {
        "datePriseFonction": "2012-06-20T02:00:00.000+02:00",
        "causeFin": "Fin de législature",
        "premiereElection": "0"
      }
    },
    {
      "xsiType": "MandatSimple_Type",
      "uid": "PM685722",
      "acteurRef": "PA607919",
      "typeOrgane": "PARPOL",
      "dateDebut": "2012-12-01T01:00:00.000+01:00",
      "dateFin": "2017-06-20T02:00:00.000+02:00",
      "preseance": "5",
      "nominPrincipale": "1",
      "infosQualite": {
        "codeQualite": "Membre",
        "libQualite": "Membre",
        "libQualiteSex": "Membre"
      },
      "organesRefs": [
        "PO684932"
      ]
    },
    {
      "xsiType": "MandatSimple_Type",
      "uid": "PM688599",
      "acteurRef": "PA607919",
      "legislature": "14",
      "typeOrgane": "GE",
      "dateDebut": "2013-01-23T01:00:00.000+01:00",
      "dateFin": "2017-06-20T02:00:00.000+02:00",
      "preseance": "20",
      "nominPrincipale": "1",
      "infosQualite": {
        "codeQualite": "Membre",
        "libQualite": "Membre",
        "libQualiteSex": "Membre"
      },
      "organesRefs": [
        "PO686196"
      ]
    },
    {
      "xsiType": "MandatSimple_Type",
      "uid": "PM692252",
      "acteurRef": "PA607919",
      "legislature": "14",
      "typeOrgane": "GE",
      "dateDebut": "2013-02-26T01:00:00.000+01:00",
      "dateFin": "2017-06-20T02:00:00.000+02:00",
      "preseance": "8",
      "nominPrincipale": "1",
      "infosQualite": {
        "codeQualite": "Vice-Président",
        "libQualite": "Vice-Président",
        "libQualiteSex": "Vice-Présidente"
      },
      "organesRefs": [
        "PO686196"
      ]
    },
    {
      "xsiType": "MandatSimple_Type",
      "uid": "PM713187",
      "acteurRef": "PA607919",
      "legislature": "14",
      "typeOrgane": "GP",
      "dateDebut": "2016-05-25T02:00:00.000+02:00",
      "dateFin": "2017-06-20T02:00:00.000+02:00",
      "preseance": "20",
      "nominPrincipale": "1",
      "infosQualite": {
        "codeQualite": "Membre",
        "libQualite": "Membre du",
        "libQualiteSex": "Membre du"
      },
      "organesRefs": [
        "PO713077"
      ]
    },
    {
      "xsiType": "MandatSimple_Type",
      "uid": "PM716715",
      "acteurRef": "PA607919",
      "legislature": "14",
      "typeOrgane": "COMPER",
      "dateDebut": "2017-02-02T01:00:00.000+01:00",
      "datePublication": "2017-02-02T01:00:00.000+01:00",
      "dateFin": "2017-06-20T02:00:00.000+02:00",
      "preseance": "32",
      "nominPrincipale": "1",
      "infosQualite": {
        "codeQualite": "Membre",
        "libQualite": "Membre",
        "libQualiteSex": "Membre"
      },
      "organesRefs": [
        "PO419604"
      ]
    },
    {
      "xsiType": "MandatSimple_Type",
      "uid": "PM732486",
      "acteurRef": "PA607919",
      "typeOrgane": "GROUPESENAT",
      "dateDebut": "2017-07-04T02:00:00.000+02:00",
      "dateFin": "2017-07-04T02:00:00.000+02:00",
      "preseance": "4",
      "nominPrincipale": "1",
      "infosQualite": {
        "codeQualite": "Membre",
        "libQualite": "Membre",
        "libQualiteSex": "Membre du"
      },
      "organesRefs": [
        "PO77708"
      ]
    },
    {
      "xsiType": "MandatSimple_Type",
      "uid": "PM732487",
      "acteurRef": "PA607919",
      "typeOrgane": "GROUPESENAT",
      "dateDebut": "2017-07-05T02:00:00.000+02:00",
      "dateFin": "2017-10-01T02:00:00.000+02:00",
      "preseance": "4",
      "nominPrincipale": "1",
      "infosQualite": {
        "codeQualite": "Membre",
        "libQualite": "Membre",
        "libQualiteSex": "Membre du"
      },
      "organesRefs": [
        "PO77710"
      ]
    },
    {
      "xsiType": "MandatParlementaire_type",
      "uid": "PM732495",
      "acteurRef": "PA607919",
      "typeOrgane": "SENAT",
      "dateDebut": "2017-07-04T02:00:00.000+02:00",
      "dateFin": "2017-10-01T02:00:00.000+02:00",
      "preseance": "20",
      "nominPrincipale": "1",
      "infosQualite": {
        "codeQualite": "Sénateur",
        "libQualite": "SENATEUR",
        "libQualiteSex": "Sénateur 5ème République"
      },
      "organesRefs": [
        "PO78718"
      ],
      "election": {
        "lieu": {
          "numDepartement": "59"
        }
      },
      "mandature": {
        "premiereElection": "0"
      }
    },
    {
      "xsiType": "MandatSimple_Type",
      "uid": "PM732808",
      "acteurRef": "PA607919",
      "typeOrgane": "COMSENAT",
      "dateDebut": "2017-07-10T02:00:00.000+02:00",
      "dateFin": "2017-10-01T02:00:00.000+02:00",
      "preseance": "10",
      "nominPrincipale": "1",
      "infosQualite": {
        "codeQualite": "Membre",
        "libQualite": "Membre",
        "libQualiteSex": "Membre"
      },
      "organesRefs": [
        "PO211490"
      ]
    }
  ]
}