{
  "xsiType": "OrganeExterne_Type",
  "uid": "PO211493",
  "codeType": "COMSENAT",
  "libelle": "Commission des affaires sociales",
  "libelleEdition": "de la commission des affaires sociales",
  "libelleAbrege": "Affaires sociales",
  "libelleAbrev": "SOCIC",
  "viMoDe": {
    "dateDebut": "1900-01-01T00:00:00.000+00:00"
  }
}