{
  "xsiType": "OrganeExterne_Type",
  "uid": "PO717182",
  "codeType": "MINISTERE",
  "libelle": "Ministère des armées",
  "libelleEdition": "des armées",
  "libelleAbrege": "Armées",
  "libelleAbrev": "ARM",
  "viMoDe": {
    "dateDebut": "2017-05-18T02:00:00.000+02:00",
    "dateFin": "2017-06-19T02:00:00.000+02:00"
  },
  "organeParentRef": "PO717173"
}