{
  "uid": "PA708632",
  "etatCivil": {
    "ident": {
      "civ": "Mme",
      "prenom": "Marie",
      "nom": "Mercier",
      "alpha": "MERCIER_Marie"
    },
    "infoNaissance": {
      "dateNais": "1958-06-16T01:00:00.000+01:00"
    }
  },
  "profession": {
    "socProcInsee": {}
  },
  "adresses": [
    {
      "xsiType": "AdresseSiteWeb_Type",
      "uid": "AD708644",
      "type": "23",
      "typeLibelle": "Url sénateur",
      "valElec": "https://www.senat.fr/senateur/mercier_marie14147r.html"
    }
  ],
  "mandats": [
    {
      "xsiType": "MandatParlementaire_type",
      "uid": "PM708643",
      "acteurRef": "PA708632",
      "typeOrgane": "SENAT",
      "dateDebut": "2015-06-12T02:00:00.000+02:00",
      "preseance": "20",
      "nominPrincipale": "1",
      "infosQualite": {
        "codeQualite": "Sénateur",
        "libQualite": "SENATEUR",
        "libQualiteSex": "Sénateur 5ème République"
      },
      "organesRefs": [
        "PO78718"
      ],
      "election": {
        "lieu": {
          "numDepartement": "71"
        }
      },
      "mandature": {
        "premiereElection": "0"
      }
    },
    {
      "xsiType": "MandatSimple_Type",
      "uid": "PM708685",
      "acteurRef": "PA708632",
      "typeOrgane": "COMSENAT",
      "dateDebut": "2015-06-17T02:00:00.000+02:00",
      "dateFin": "2019-03-28T01:00:00.000+01:00",
      "preseance": "10",
      "nominPrincipale": "1",
      "infosQualite": {
        "codeQualite": "Membre",
        "libQualite": "Membre",
        "libQualiteSex": "Membre"
      },
      "organesRefs": [
        "PO211495"
      ]
    },
    {
      "xsiType": "MandatSimple_Type",
      "uid": "PM708689",
      "acteurRef": "PA708632",
      "typeOrgane": "GROUPESENAT",
      "dateDebut": "2015-06-15T02:00:00.000+02:00",
      "preseance": "4",
      "nominPrincipale": "1",
      "infosQualite": {
        "codeQualite": "Membre",
        "libQualite": "Membre",
        "libQualiteSex": "Membre du"
      },
      "organesRefs": [
        "PO286005"
      ]
    },
    {
      "xsiType": "MandatSimple_Type",
      "uid": "PM741359",
      "acteurRef": "PA708632",
      "typeOrgane": "DELEGSENAT",
      "dateDebut": "2017-10-18T02:00:00.000+02:00",
      "preseance": "4",
      "nominPrincipale": "1",
      "infosQualite": {
        "codeQualite": "Membre",
        "libQualite": "Membre",
        "libQualiteSex": "Membre"
      },
      "organesRefs": [
        "PO420388"
      ]
    },
    {
      "xsiType": "MandatSimple_Type",
      "uid": "PM742182",
      "acteurRef": "PA708632",
      "typeOrgane": "DELEGSENAT",
      "dateDebut": "2017-10-26T02:00:00.000+02:00",
      "nominPrincipale": "1",
      "infosQualite": {
        "libQualite": "Vice-Président"
      },
      "organesRefs": [
        "PO420388"
      ]
    },
    {
      "xsiType": "MandatSimple_Type",
      "uid": "PM743233",
      "acteurRef": "PA708632",
      "typeOrgane": "API",
      "dateDebut": "2017-11-08T01:00:00.000+01:00",
      "preseance": "20",
      "nominPrincipale": "1",
      "infosQualite": {
        "codeQualite": "Membre",
        "libQualite": "Membre",
        "libQualiteSex": "Membre"
      },
      "organesRefs": [
        "PO206064"
      ]
    },
    {
      "xsiType": "MandatSimple_Type",
      "uid": "PM752978",
      "acteurRef": "PA708632",
      "typeOrgane": "CMP",
      "dateDebut": "2018-03-09T01:00:00.000+01:00",
      "datePublication": "2018-03-09T01:00:00.000+01:00",
      "dateFin": "2018-04-11T02:00:00.000+02:00",
      "preseance": "28",
      "nominPrincipale": "1",
      "infosQualite": {
        "codeQualite": "Suppléant",
        "libQualite": "Membre suppléant",
        "libQualiteSex": "Membre suppléante"
      },
      "organesRefs": [
        "PO750828"
      ]
    },
    {
      "xsiType": "MandatSimple_Type",
      "uid": "PM758292",
      "acteurRef": "PA708632",
      "typeOrgane": "CMP",
      "dateDebut": "2018-07-10T02:00:00.000+02:00",
      "datePublication": "2018-07-20T02:00:00.000+02:00",
      "dateFin": "2018-08-01T02:00:00.000+02:00",
      "preseance": "20",
      "nominPrincipale": "1",
      "infosQualite": {
        "codeQualite": "Titulaire",
        "libQualite": "Membre titulaire",
        "libQualiteSex": "Membre titulaire"
      },
      "organesRefs": [
        "PO757668"
      ]
    },
    {
      "xsiType": "MandatSimple_Type",
      "uid": "PM758333",
      "acteurRef": "PA708632",
      "typeOrgane": "CMP",
      "dateDebut": "2018-07-23T02:00:00.000+02:00",
      "datePublication": "2018-07-24T02:00:00.000+02:00",
      "dateFin": "2018-08-01T02:00:00.000+02:00",
      "preseance": "16",
      "nominPrincipale": "1",
      "infosQualite": {
        "codeQualite": "Rapporteur",
        "libQualite": "Rapporteur",
        "libQualiteSex": "Rapporteure"
      },
      "organesRefs": [
        "PO757668"
      ]
    },
    {
      "xsiType": "MandatSimple_Type",
      "uid": "PM764363",
      "acteurRef": "PA708632",
      "typeOrgane": "COMSENAT",
      "dateDebut": "2019-03-29T01:00:00.000+01:00",
      "nominPrincipale": "1",
      "infosQualite": {
        "libQualite": "Secrétaire"
      },
      "organesRefs": [
        "PO211495"
      ]
    },
    {
      "xsiType": "MandatSimple_Type",
      "uid": "PM766271",
      "acteurRef": "PA708632",
      "typeOrgane": "CMP",
      "dateDebut": "2019-07-02T02:00:00.000+02:00",
      "datePublication": "2019-07-05T02:00:00.000+02:00",
      "dateFin": "2019-07-25T02:00:00.000+02:00",
      "preseance": "28",
      "nominPrincipale": "1",
      "infosQualite": {
        "codeQualite": "Suppléant",
        "libQualite": "Membre suppléant",
        "libQualiteSex": "Membre suppléante"
      },
      "organesRefs": [
        "PO766090"
      ]
    },
    {
      "xsiType": "MandatSimple_Type",
      "uid": "PM767674",
      "acteurRef": "PA708632",
      "typeOrgane": "COMSPSENAT",
      "dateDebut": "2019-10-16T02:00:00.000+02:00",
      "nominPrincipale": "1",
      "infosQualite": {
        "libQualite": "Membre"
      },
      "organesRefs": [
        "PO767640"
      ]
    }
  ]
}