{
  "xsiType": "OrganeParlementaireInternational",
  "uid": "PO743166",
  "codeType": "GEVI",
  "libelle": "Groupe d'études à vocation internationale France-Syrie",
  "libelleEdition": "de France-Groupe d'études à vocation internationale sur la Syrie",
  "libelleAbrege": "Syrie",
  "libelleAbrev": "SYR",
  "viMoDe": {
    "dateAgrement": "2017-11-08T01:00:00.000+01:00"
  },
  "regime": "5ème République",
  "legislature": "15",
  "secretariat": {
    "secretaire01": "M. Bruno Legrain"
  },
  "listePays": [
    "GOP756446"
  ]
}