{
  "uid": "PA2200",
  "etatCivil": {
    "ident": {
      "civ": "M.",
      "prenom": "Gérard",
      "nom": "Miquel",
      "alpha": "MIQUEL"
    },
    "infoNaissance": {
      "dateNais": "1946-06-17T01:00:00.000+01:00"
    }
  },
  "profession": {
    "socProcInsee": {}
  },
  "adresses": [
    {
      "xsiType": "AdresseSiteWeb_Type",
      "uid": "AD317517",
      "type": "23",
      "typeLibelle": "Url sénateur",
      "valElec": "https://www.senat.fr/senateur/miquel_gerard92039x.html"
    }
  ],
  "mandats": [
    {
      "xsiType": "MandatSimple_Type",
      "uid": "PM227330",
      "acteurRef": "PA2200",
      "typeOrgane": "GROUPESENAT",
      "dateDebut": "2014-09-04T02:00:00.000+02:00",
      "datePublication": "2001-10-03T02:00:00.000+02:00",
      "preseance": "4",
      "nominPrincipale": "1",
      "infosQualite": {
        "codeQualite": "Membre",
        "libQualite": "Membre",
        "libQualiteSex": "Membre"
      },
      "organesRefs": [
        "PO77710"
      ]
    },
    {
      "xsiType": "MandatSimple_Type",
      "uid": "PM421706",
      "acteurRef": "PA2200",
      "typeOrgane": "DELEGSENAT",
      "dateDebut": "2009-09-23T02:00:00.000+02:00",
      "preseance": "4",
      "nominPrincipale": "1",
      "infosQualite": {
        "codeQualite": "Membre",
        "libQualite": "Membre",
        "libQualiteSex": "Membre"
      },
      "organesRefs": [
        "PO420388"
      ]
    },
    {
      "xsiType": "MandatSimple_Type",
      "uid": "PM421951",
      "acteurRef": "PA2200",
      "typeOrgane": "DELEGSENAT",
      "dateDebut": "2009-10-07T02:00:00.000+02:00",
      "nominPrincipale": "1",
      "infosQualite": {
        "libQualite": "Vice-Président",
        "libQualiteSex": "Vice-Président"
      },
      "organesRefs": [
        "PO420388"
      ]
    },
    {
      "xsiType": "MandatParlementaire_type",
      "uid": "PM429909",
      "acteurRef": "PA2200",
      "typeOrgane": "SENAT",
      "dateDebut": "2011-10-01T02:00:00.000+02:00",
      "dateFin": "2017-10-01T02:00:00.000+02:00",
      "preseance": "20",
      "nominPrincipale": "1",
      "infosQualite": {
        "codeQualite": "Sénateur",
        "libQualite": "SENATEUR",
        "libQualiteSex": "SENATEUR"
      },
      "organesRefs": [
        "PO78718"
      ],
      "election": {
        "lieu": {
          "numDepartement": "46"
        }
      },
      "mandature": {
        "premiereElection": "0"
      }
    },
    {
      "xsiType": "MandatSimple_Type",
      "uid": "PM437009",
      "acteurRef": "PA2200",
      "typeOrgane": "DELEGSENAT",
      "dateDebut": "2011-11-30T01:00:00.000+01:00",
      "preseance": "4",
      "nominPrincipale": "1",
      "infosQualite": {
        "codeQualite": "Membre",
        "libQualite": "Membre",
        "libQualiteSex": "Membre"
      },
      "organesRefs": [
        "PO436945"
      ]
    },
    {
      "xsiType": "MandatSimple_Type",
      "uid": "PM704204",
      "acteurRef": "PA2200",
      "typeOrgane": "COMSENAT",
      "dateDebut": "2014-10-09T02:00:00.000+02:00",
      "dateFin": "2017-10-01T02:00:00.000+02:00",
      "nominPrincipale": "1",
      "infosQualite": {
        "libQualite": "Secrétaire",
        "libQualiteSex": "Secrétaire"
      },
      "organesRefs": [
        "PO516754"
      ]
    },
    {
      "xsiType": "MandatSimple_Type",
      "uid": "PM732462",
      "acteurRef": "PA2200",
      "typeOrgane": "GROUPESENAT",
      "dateDebut": "2017-06-28T02:00:00.000+02:00",
      "dateFin": "2017-10-01T02:00:00.000+02:00",
      "preseance": "4",
      "nominPrincipale": "1",
      "infosQualite": {
        "codeQualite": "Membre",
        "libQualite": "Membre",
        "libQualiteSex": "Membre"
      },
      "organesRefs": [
        "PO732421"
      ]
    }
  ]
}