{
  "xsiType": "OrganeParlementaire_Type",
  "uid": "PO762533",
  "codeType": "MISINFO",
  "libelle": "Mission d'information sur le continuum sécurité-développement",
  "libelleEdition": "de la mission d'information sur le continuum sécurité-développement",
  "libelleAbrege": "Continuum secu dev",
  "libelleAbrev": "CSDEV",
  "viMoDe": {
    "dateDebut": "2019-02-06T01:00:00.000+01:00"
  },
  "organeParentRef": "PO59046",
  "regime": "5ème République",
  "legislature": "15",
  "secretariat": {}
}