{
  "uid": "PA267728",
  "etatCivil": {
    "ident": {
      "civ": "M.",
      "prenom": "Christophe",
      "nom": "Priou",
      "alpha": "Priou_Christophe"
    },
    "infoNaissance": {
      "dateNais": "1958-05-02T01:00:00.000+01:00",
      "villeNais": "Nantes",
      "depNais": "Loire-Atlantique",
      "paysNais": "France"
    }
  },
  "profession": {
    "socProcInsee": {}
  },
  "adresses": [
    {
      "xsiType": "AdressePostale_Type",
      "uid": "AD12499",
      "type": "2",
      "typeLibelle": "Adresse publiée de circonscription",
      "poids": "21",
      "intitule": "Permanence parlementaire,",
      "numeroRue": "2 Bis",
      "nomRue": "Faubourg Sainte-Anne",
      "complementAdresse": "BP 85308",
      "codePostal": "44353",
      "ville": "Guérande"
    },
    {
      "xsiType": "AdresseTelephonique_Type",
      "uid": "AD12501",
      "type": "11",
      "typeLibelle": "Téléphone",
      "poids": "21",
      "adresseDeRattachement": "AD12499",
      "valElec": "02 40 62 02 72"
    },
    {
      "xsiType": "AdresseTelephonique_Type",
      "uid": "AD275120",
      "type": "12",
      "typeLibelle": "Télécopie",
      "poids": "21",
      "adresseDeRattachement": "AD12499",
      "valElec": "02 40 62 00 99"
    },
    {
      "xsiType": "AdresseMail_Type",
      "uid": "AD275172",
      "type": "15",
      "typeLibelle": "Mèl",
      "valElec": "christophepriou@wanadoo.fr"
    },
    {
      "xsiType": "AdressePostale_Type",
      "uid": "AD386787",
      "type": "0",
      "typeLibelle": "Adresse officielle",
      "poids": "1",
      "intitule": "Assemblée nationale,",
      "numeroRue": "126",
      "nomRue": "Rue de l'Université,",
      "codePostal": "75355",
      "ville": "Paris 07 SP"
    },
    {
      "xsiType": "AdresseMail_Type",
      "uid": "AD392027",
      "type": "15",
      "typeLibelle": "Mèl",
      "valElec": "cpriou@assemblee-nationale.fr"
    },
    {
      "xsiType": "AdresseSiteWeb_Type",
      "uid": "AD736439",
      "type": "23",
      "typeLibelle": "Url sénateur",
      "valElec": "https://www.senat.fr/senateur/priou_christophe17583w.html"
    }
  ],
  "mandats": [
    {
      "xsiType": "MandatParlementaire_type",
      "uid": "PM645216",
      "acteurRef": "PA267728",
      "legislature": "14",
      "typeOrgane": "ASSEMBLEE",
      "dateDebut": "2012-06-20T02:00:00.000+02:00",
      "dateFin": "2017-06-20T02:00:00.000+02:00",
      "preseance": "50",
      "nominPrincipale": "1",
      "infosQualite": {
        "codeQualite": "membre",
        "libQualite": "membre",
        "libQualiteSex": "membre"
      },
      "organesRefs": [
        "PO644420"
      ],
      "suppleant": {
        "dateDebut": "2012-06-20T02:00:00.000+02:00",
        "dateFin": "2017-06-20T02:00:00.000+02:00",
        "suppleantRef": "PA342828"
      },
      "election": {
        "lieu": {
          "region": "Pays de la Loire",
          "regionType": "Métropolitain",
          "departement": "Loire-Atlantique",
          "numDepartement": "44",
          "numCirco": "7"
        },
        "causeMandat": "élections générales",
        "refCirconscription": "PO644630"
      },
      "mandature": {
        "datePriseFonction": "2012-06-20T02:00:00.000+02:00",
        "causeFin": "Fin de législature",
        "premiereElection": "1"
      }
    },
    {
      "xsiType": "MandatSimple_Type",
      "uid": "PM657165",
      "acteurRef": "PA267728",
      "legislature": "14",
      "typeOrgane": "COMPER",
      "dateDebut": "2012-06-28T02:00:00.000+02:00",
      "datePublication": "2012-06-28T02:00:00.000+02:00",
      "dateFin": "2017-06-20T02:00:00.000+02:00",
      "preseance": "32",
      "nominPrincipale": "1",
      "infosQualite": {
        "codeQualite": "Membre",
        "libQualite": "Membre",
        "libQualiteSex": "Membre"
      },
      "organesRefs": [
        "PO419865"
      ]
    },
    {
      "xsiType": "MandatSimple_Type",
      "uid": "PM688552",
      "acteurRef": "PA267728",
      "legislature": "14",
      "typeOrgane": "GE",
      "dateDebut": "2013-01-24T01:00:00.000+01:00",
      "dateFin": "2017-06-20T02:00:00.000+02:00",
      "preseance": "20",
      "nominPrincipale": "1",
      "infosQualite": {
        "codeQualite": "Membre",
        "libQualite": "Membre",
        "libQualiteSex": "Membre"
      },
      "organesRefs": [
        "PO686188"
      ]
    },
    {
      "xsiType": "MandatSimple_Type",
      "uid": "PM688610",
      "acteurRef": "PA267728",
      "legislature": "14",
      "typeOrgane": "GE",
      "dateDebut": "2013-01-23T01:00:00.000+01:00",
      "dateFin": "2017-06-20T02:00:00.000+02:00",
      "preseance": "20",
      "nominPrincipale": "1",
      "infosQualite": {
        "codeQualite": "Membre",
        "libQualite": "Membre",
        "libQualiteSex": "Membre"
      },
      "organesRefs": [
        "PO686196"
      ]
    },
    {
      "xsiType": "MandatSimple_Type",
      "uid": "PM689387",
      "acteurRef": "PA267728",
      "legislature": "14",
      "typeOrgane": "GE",
      "dateDebut": "2013-01-23T01:00:00.000+01:00",
      "dateFin": "2017-06-20T02:00:00.000+02:00",
      "preseance": "20",
      "nominPrincipale": "1",
      "infosQualite": {
        "codeQualite": "Membre",
        "libQualite": "Membre",
        "libQualiteSex": "Membre"
      },
      "organesRefs": [
        "PO687076"
      ]
    },
    {
      "xsiType": "MandatSimple_Type",
      "uid": "PM689522",
      "acteurRef": "PA267728",
      "legislature": "14",
      "typeOrgane": "GE",
      "dateDebut": "2013-01-23T01:00:00.000+01:00",
      "dateFin": "2017-06-20T02:00:00.000+02:00",
      "preseance": "20",
      "nominPrincipale": "1",
      "infosQualite": {
        "codeQualite": "Membre",
        "libQualite": "Membre",
        "libQualiteSex": "Membre"
      },
      "organesRefs": [
        "PO687109"
      ]
    },
    {
      "xsiType": "MandatSimple_Type",
      "uid": "PM689601",
      "acteurRef": "PA267728",
      "legislature": "14",
      "typeOrgane": "GE",
      "dateDebut": "2013-01-20T01:00:00.000+01:00",
      "dateFin": "2017-06-20T02:00:00.000+02:00",
      "preseance": "20",
      "nominPrincipale": "1",
      "infosQualite": {
        "codeQualite": "Membre",
        "libQualite": "Membre",
        "libQualiteSex": "Membre"
      },
      "organesRefs": [
        "PO686802"
      ]
    },
    {
      "xsiType": "MandatSimple_Type",
      "uid": "PM690154",
      "acteurRef": "PA267728",
      "legislature": "14",
      "typeOrgane": "GE",
      "dateDebut": "2013-02-04T01:00:00.000+01:00",
      "dateFin": "2017-06-20T02:00:00.000+02:00",
      "preseance": "20",
      "nominPrincipale": "1",
      "infosQualite": {
        "codeQualite": "Membre",
        "libQualite": "Membre",
        "libQualiteSex": "Membre"
      },
      "organesRefs": [
        "PO686275"
      ]
    },
    {
      "xsiType": "MandatSimple_Type",
      "uid": "PM690498",
      "acteurRef": "PA267728",
      "legislature": "14",
      "typeOrgane": "GE",
      "dateDebut": "2013-01-23T01:00:00.000+01:00",
      "dateFin": "2017-06-20T02:00:00.000+02:00",
      "preseance": "20",
      "nominPrincipale": "1",
      "infosQualite": {
        "codeQualite": "Membre",
        "libQualite": "Membre",
        "libQualiteSex": "Membre"
      },
      "organesRefs": [
        "PO686337"
      ]
    },
    {
      "xsiType": "MandatSimple_Type",
      "uid": "PM690712",
      "acteurRef": "PA267728",
      "legislature": "14",
      "typeOrgane": "GE",
      "dateDebut": "2013-02-06T01:00:00.000+01:00",
      "dateFin": "2017-06-20T02:00:00.000+02:00",
      "preseance": "20",
      "nominPrincipale": "1",
      "infosQualite": {
        "codeQualite": "Membre",
        "libQualite": "Membre",
        "libQualiteSex": "Membre"
      },
      "organesRefs": [
        "PO686346"
      ]
    },
    {
      "xsiType": "MandatSimple_Type",
      "uid": "PM690908",
      "acteurRef": "PA267728",
      "legislature": "14",
      "typeOrgane": "GE",
      "dateDebut": "2013-02-06T01:00:00.000+01:00",
      "dateFin": "2017-06-20T02:00:00.000+02:00",
      "preseance": "20",
      "nominPrincipale": "1",
      "infosQualite": {
        "codeQualite": "Membre",
        "libQualite": "Membre",
        "libQualiteSex": "Membre"
      },
      "organesRefs": [
        "PO686451"
      ]
    },
    {
      "xsiType": "MandatSimple_Type",
      "uid": "PM691083",
      "acteurRef": "PA267728",
      "legislature": "14",
      "typeOrgane": "GE",
      "dateDebut": "2013-02-20T01:00:00.000+01:00",
      "dateFin": "2017-06-20T02:00:00.000+02:00",
      "preseance": "20",
      "nominPrincipale": "1",
      "infosQualite": {
        "codeQualite": "Membre",
        "libQualite": "Membre",
        "libQualiteSex": "Membre"
      },
      "organesRefs": [
        "PO686372"
      ]
    },
    {
      "xsiType": "MandatSimple_Type",
      "uid": "PM691084",
      "acteurRef": "PA267728",
      "legislature": "14",
      "typeOrgane": "GE",
      "dateDebut": "2013-12-10T01:00:00.000+01:00",
      "dateFin": "2017-06-20T02:00:00.000+02:00",
      "preseance": "20",
      "nominPrincipale": "1",
      "infosQualite": {
        "codeQualite": "Membre",
        "libQualite": "Membre",
        "libQualiteSex": "Membre"
      },
      "organesRefs": [
        "PO686605"
      ]
    },
    {
      "xsiType": "MandatSimple_Type",
      "uid": "PM691247",
      "acteurRef": "PA267728",
      "legislature": "14",
      "typeOrgane": "GE",
      "dateDebut": "2013-01-14T01:00:00.000+01:00",
      "dateFin": "2017-06-20T02:00:00.000+02:00",
      "preseance": "20",
      "nominPrincipale": "1",
      "infosQualite": {
        "codeQualite": "Membre",
        "libQualite": "Membre",
        "libQualiteSex": "Membre"
      },
      "organesRefs": [
        "PO687381"
      ]
    },
    {
      "xsiType": "MandatSimple_Type",
      "uid": "PM691571",
      "acteurRef": "PA267728",
      "legislature": "14",
      "typeOrgane": "GE",
      "dateDebut": "2013-02-05T01:00:00.000+01:00",
      "dateFin": "2017-06-20T02:00:00.000+02:00",
      "preseance": "20",
      "nominPrincipale": "1",
      "infosQualite": {
        "codeQualite": "Membre",
        "libQualite": "Membre",
        "libQualiteSex": "Membre"
      },
      "organesRefs": [
        "PO686301"
      ]
    },
    {
      "xsiType": "MandatSimple_Type",
      "uid": "PM692539",
      "acteurRef": "PA267728",
      "legislature": "14",
      "typeOrgane": "GE",
      "dateDebut": "2013-02-19T01:00:00.000+01:00",
      "dateFin": "2017-06-20T02:00:00.000+02:00",
      "preseance": "20",
      "nominPrincipale": "1",
      "infosQualite": {
        "codeQualite": "Membre",
        "libQualite": "Membre",
        "libQualiteSex": "Membre"
      },
      "organesRefs": [
        "PO686767"
      ]
    },
    {
      "xsiType": "MandatSimple_Type",
      "uid": "PM692980",
      "acteurRef": "PA267728",
      "legislature": "14",
      "typeOrgane": "GE",
      "dateDebut": "2013-03-25T01:00:00.000+01:00",
      "dateFin": "2017-06-20T02:00:00.000+02:00",
      "preseance": "20",
      "nominPrincipale": "1",
      "infosQualite": {
        "codeQualite": "Membre",
        "libQualite": "Membre",
        "libQualiteSex": "Membre"
      },
      "organesRefs": [
        "PO689030"
      ]
    },
    {
      "xsiType": "MandatSimple_Type",
      "uid": "PM693103",
      "acteurRef": "PA267728",
      "legislature": "14",
      "typeOrgane": "GE",
      "dateDebut": "2013-02-01T01:00:00.000+01:00",
      "dateFin": "2017-06-20T02:00:00.000+02:00",
      "preseance": "20",
      "nominPrincipale": "1",
      "infosQualite": {
        "codeQualite": "Membre",
        "libQualite": "Membre",
        "libQualiteSex": "Membre"
      },
      "organesRefs": [
        "PO686354"
      ]
    },
    {
      "xsiType": "MandatSimple_Type",
      "uid": "PM693593",
      "acteurRef": "PA267728",
      "legislature": "14",
      "typeOrgane": "GE",
      "dateDebut": "2013-04-11T02:00:00.000+02:00",
      "dateFin": "2017-06-20T02:00:00.000+02:00",
      "preseance": "20",
      "nominPrincipale": "1",
      "infosQualite": {
        "codeQualite": "Membre",
        "libQualite": "Membre",
        "libQualiteSex": "Membre"
      },
      "organesRefs": [
        "PO689018"
      ]
    },
    {
      "xsiType": "MandatSimple_Type",
      "uid": "PM693811",
      "acteurRef": "PA267728",
      "legislature": "14",
      "typeOrgane": "GE",
      "dateDebut": "2013-04-16T02:00:00.000+02:00",
      "dateFin": "2017-06-20T02:00:00.000+02:00",
      "preseance": "20",
      "nominPrincipale": "1",
      "infosQualite": {
        "codeQualite": "Membre",
        "libQualite": "Membre",
        "libQualiteSex": "Membre"
      },
      "organesRefs": [
        "PO689006"
      ]
    },
    {
      "xsiType": "MandatSimple_Type",
      "uid": "PM694316",
      "acteurRef": "PA267728",
      "legislature": "14",
      "typeOrgane": "GE",
      "dateDebut": "2013-04-13T02:00:00.000+02:00",
      "dateFin": "2017-06-20T02:00:00.000+02:00",
      "preseance": "20",
      "nominPrincipale": "1",
      "infosQualite": {
        "codeQualite": "Membre",
        "libQualite": "Membre",
        "libQualiteSex": "Membre"
      },
      "organesRefs": [
        "PO689012"
      ]
    },
    {
      "xsiType": "MandatSimple_Type",
      "uid": "PM695443",
      "acteurRef": "PA267728",
      "legislature": "14",
      "typeOrgane": "GE",
      "dateDebut": "2013-06-17T02:00:00.000+02:00",
      "dateFin": "2017-06-20T02:00:00.000+02:00",
      "preseance": "20",
      "nominPrincipale": "1",
      "infosQualite": {
        "codeQualite": "Membre",
        "libQualite": "Membre",
        "libQualiteSex": "Membre"
      },
      "organesRefs": [
        "PO688296"
      ]
    },
    {
      "xsiType": "MandatSimple_Type",
      "uid": "PM697048",
      "acteurRef": "PA267728",
      "legislature": "14",
      "typeOrgane": "GE",
      "dateDebut": "2013-09-19T02:00:00.000+02:00",
      "dateFin": "2017-06-20T02:00:00.000+02:00",
      "preseance": "20",
      "nominPrincipale": "1",
      "infosQualite": {
        "codeQualite": "Membre",
        "libQualite": "Membre",
        "libQualiteSex": "Membre"
      },
      "organesRefs": [
        "PO695581"
      ]
    },
    {
      "xsiType": "MandatSimple_Type",
      "uid": "PM697095",
      "acteurRef": "PA267728",
      "legislature": "14",
      "typeOrgane": "GE",
      "dateDebut": "2013-09-18T02:00:00.000+02:00",
      "dateFin": "2017-06-20T02:00:00.000+02:00",
      "preseance": "20",
      "nominPrincipale": "1",
      "infosQualite": {
        "codeQualite": "Membre",
        "libQualite": "Membre",
        "libQualiteSex": "Membre"
      },
      "organesRefs": [
        "PO686326"
      ]
    },
    {
      "xsiType": "MandatSimple_Type",
      "uid": "PM697179",
      "acteurRef": "PA267728",
      "legislature": "14",
      "typeOrgane": "GE",
      "dateDebut": "2013-09-25T02:00:00.000+02:00",
      "dateFin": "2017-06-20T02:00:00.000+02:00",
      "preseance": "20",
      "nominPrincipale": "1",
      "infosQualite": {
        "codeQualite": "Membre",
        "libQualite": "Membre",
        "libQualiteSex": "Membre"
      },
      "organesRefs": [
        "PO694578"
      ]
    },
    {
      "xsiType": "MandatSimple_Type",
      "uid": "PM698450",
      "acteurRef": "PA267728",
      "legislature": "14",
      "typeOrgane": "GE",
      "dateDebut": "2013-11-13T01:00:00.000+01:00",
      "dateFin": "2017-06-20T02:00:00.000+02:00",
      "preseance": "20",
      "nominPrincipale": "1",
      "infosQualite": {
        "codeQualite": "Membre",
        "libQualite": "Membre",
        "libQualiteSex": "Membre"
      },
      "organesRefs": [
        "PO686878"
      ]
    },
    {
      "xsiType": "MandatSimple_Type",
      "uid": "PM698693",
      "acteurRef": "PA267728",
      "legislature": "14",
      "typeOrgane": "GE",
      "dateDebut": "2013-11-20T01:00:00.000+01:00",
      "dateFin": "2017-06-20T02:00:00.000+02:00",
      "preseance": "20",
      "nominPrincipale": "1",
      "infosQualite": {
        "codeQualite": "Membre",
        "libQualite": "Membre",
        "libQualiteSex": "Membre"
      },
      "organesRefs": [
        "PO692277"
      ]
    },
    {
      "xsiType": "MandatSimple_Type",
      "uid": "PM704461",
      "acteurRef": "PA267728",
      "legislature": "14",
      "typeOrgane": "GE",
      "dateDebut": "2014-10-23T02:00:00.000+02:00",
      "dateFin": "2017-06-20T02:00:00.000+02:00",
      "preseance": "20",
      "nominPrincipale": "1",
      "infosQualite": {
        "codeQualite": "Membre",
        "libQualite": "Membre",
        "libQualiteSex": "Membre"
      },
      "organesRefs": [
        "PO689000"
      ]
    },
    {
      "xsiType": "MandatSimple_Type",
      "uid": "PM708052",
      "acteurRef": "PA267728",
      "legislature": "14",
      "typeOrgane": "GP",
      "dateDebut": "2015-06-02T02:00:00.000+02:00",
      "datePublication": "2015-06-02T02:00:00.000+02:00",
      "dateFin": "2017-06-20T02:00:00.000+02:00",
      "preseance": "20",
      "nominPrincipale": "1",
      "infosQualite": {
        "codeQualite": "Membre",
        "libQualite": "Membre du",
        "libQualiteSex": "Membre du"
      },
      "organesRefs": [
        "PO707869"
      ]
    },
    {
      "xsiType": "MandatSimple_Type",
      "uid": "PM710565",
      "acteurRef": "PA267728",
      "typeOrgane": "PARPOL",
      "dateDebut": "2015-12-01T01:00:00.000+01:00",
      "dateFin": "2017-06-20T02:00:00.000+02:00",
      "preseance": "5",
      "nominPrincipale": "1",
      "infosQualite": {
        "codeQualite": "Membre",
        "libQualite": "Membre",
        "libQualiteSex": "Membre"
      },
      "organesRefs": [
        "PO710396"
      ]
    },
    {
      "xsiType": "MandatParlementaire_type",
      "uid": "PM736277",
      "acteurRef": "PA267728",
      "typeOrgane": "SENAT",
      "dateDebut": "2017-10-02T02:00:00.000+02:00",
      "preseance": "20",
      "nominPrincipale": "1",
      "infosQualite": {
        "codeQualite": "Sénateur",
        "libQualite": "SENATEUR",
        "libQualiteSex": "SENATEUR"
      },
      "organesRefs": [
        "PO78718"
      ],
      "election": {
        "lieu": {
          "numDepartement": "44"
        }
      },
      "mandature": {
        "premiereElection": "0"
      }
    },
    {
      "xsiType": "MandatSimple_Type",
      "uid": "PM741110",
      "acteurRef": "PA267728",
      "typeOrgane": "COMSENAT",
      "dateDebut": "2017-10-04T02:00:00.000+02:00",
      "preseance": "10",
      "nominPrincipale": "1",
      "infosQualite": {
        "codeQualite": "Membre",
        "libQualite": "Membre",
        "libQualiteSex": "Membre"
      },
      "organesRefs": [
        "PO516754"
      ]
    },
    {
      "xsiType": "MandatSimple_Type",
      "uid": "PM741644",
      "acteurRef": "PA267728",
      "typeOrgane": "GROUPESENAT",
      "dateDebut": "2017-10-03T02:00:00.000+02:00",
      "preseance": "4",
      "nominPrincipale": "1",
      "infosQualite": {
        "codeQualite": "Membre",
        "libQualite": "Membre",
        "libQualiteSex": "Membre"
      },
      "organesRefs": [
        "PO286005"
      ]
    },
    {
      "xsiType": "MandatSimple_Type",
      "uid": "PM765944",
      "acteurRef": "PA267728",
      "typeOrgane": "CMP",
      "dateDebut": "2019-05-22T02:00:00.000+02:00",
      "datePublication": "2019-06-21T02:00:00.000+02:00",
      "dateFin": "2019-07-16T02:00:00.000+02:00",
      "preseance": "28",
      "nominPrincipale": "1",
      "infosQualite": {
        "codeQualite": "Suppléant",
        "libQualite": "Membre suppléant",
        "libQualiteSex": "Membre suppléant"
      },
      "organesRefs": [
        "PO764715"
      ]
    },
    {
      "xsiType": "MandatSimple_Type",
      "uid": "PM765971",
      "acteurRef": "PA267728",
      "typeOrgane": "CMP",
      "dateDebut": "2019-05-22T02:00:00.000+02:00",
      "datePublication": "2019-06-21T02:00:00.000+02:00",
      "dateFin": "2019-07-16T02:00:00.000+02:00",
      "preseance": "28",
      "nominPrincipale": "1",
      "infosQualite": {
        "codeQualite": "Suppléant",
        "libQualite": "Membre suppléant",
        "libQualiteSex": "Membre suppléant"
      },
      "organesRefs": [
        "PO764709"
      ]
    },
    {
      "xsiType": "MandatSimple_Type",
      "uid": "PM766245",
      "acteurRef": "PA267728",
      "typeOrgane": "CMP",
      "dateDebut": "2019-07-03T02:00:00.000+02:00",
      "datePublication": "2019-07-05T02:00:00.000+02:00",
      "preseance": "28",
      "nominPrincipale": "1",
      "infosQualite": {
        "codeQualite": "Suppléant",
        "libQualite": "Membre suppléant",
        "libQualiteSex": "Membre suppléant"
      },
      "organesRefs": [
        "PO765825"
      ]
    }
  ]
}