{
  "uid": "PA429847",
  "etatCivil": {
    "ident": {
      "civ": "Mme",
      "prenom": "Chantal",
      "nom": "Jouanno",
      "alpha": "JOUANNO CHANTAL"
    },
    "infoNaissance": {
      "dateNais": "1969-07-12T01:00:00.000+01:00"
    }
  },
  "profession": {
    "socProcInsee": {}
  },
  "adresses": [
    {
      "xsiType": "AdresseSiteWeb_Type",
      "uid": "AD430094",
      "type": "23",
      "typeLibelle": "Url sénateur",
      "valElec": "https://www.senat.fr/senateur/jouanno_chantal09001p.html"
    }
  ],
  "mandats": [
    {
      "xsiType": "MandatParlementaire_type",
      "uid": "PM430067",
      "acteurRef": "PA429847",
      "typeOrgane": "SENAT",
      "dateDebut": "2011-10-01T02:00:00.000+02:00",
      "dateFin": "2017-10-01T02:00:00.000+02:00",
      "preseance": "20",
      "nominPrincipale": "1",
      "infosQualite": {
        "codeQualite": "Sénateur",
        "libQualite": "SENATEUR",
        "libQualiteSex": "Sénateur 5ème République"
      },
      "organesRefs": [
        "PO78718"
      ],
      "election": {
        "lieu": {
          "numDepartement": "75"
        }
      },
      "mandature": {
        "premiereElection": "0"
      }
    },
    {
      "xsiType": "MandatSimple_Type",
      "uid": "PM436975",
      "acteurRef": "PA429847",
      "typeOrgane": "DELEGSENAT",
      "dateDebut": "2011-11-30T01:00:00.000+01:00",
      "preseance": "4",
      "nominPrincipale": "1",
      "infosQualite": {
        "codeQualite": "Membre",
        "libQualite": "Membre",
        "libQualiteSex": "Membre"
      },
      "organesRefs": [
        "PO310693"
      ]
    },
    {
      "xsiType": "MandatSimple_Type",
      "uid": "PM449801",
      "acteurRef": "PA429847",
      "typeOrgane": "DELEGSENAT",
      "dateDebut": "2011-12-14T01:00:00.000+01:00",
      "nominPrincipale": "1",
      "infosQualite": {
        "libQualite": "Vice-Président"
      },
      "organesRefs": [
        "PO310693"
      ]
    },
    {
      "xsiType": "MandatSimple_Type",
      "uid": "PM683582",
      "acteurRef": "PA429847",
      "typeOrgane": "GROUPESENAT",
      "dateDebut": "2012-10-23T02:00:00.000+02:00",
      "dateFin": "2017-10-01T02:00:00.000+02:00",
      "preseance": "4",
      "nominPrincipale": "1",
      "infosQualite": {
        "codeQualite": "Membre",
        "libQualite": "Membre",
        "libQualiteSex": "Membre du"
      },
      "organesRefs": [
        "PO309463"
      ]
    },
    {
      "xsiType": "MandatSimple_Type",
      "uid": "PM701187",
      "acteurRef": "PA429847",
      "typeOrgane": "COMSENAT",
      "dateDebut": "2014-05-05T02:00:00.000+02:00",
      "dateFin": "2017-10-01T02:00:00.000+02:00",
      "preseance": "10",
      "nominPrincipale": "1",
      "infosQualite": {
        "codeQualite": "Membre",
        "libQualite": "Membre",
        "libQualiteSex": "Membre"
      },
      "organesRefs": [
        "PO516754"
      ]
    },
    {
      "xsiType": "MandatSimple_Type",
      "uid": "PM704966",
      "acteurRef": "PA429847",
      "typeOrgane": "DELEGSENAT",
      "dateDebut": "2014-11-06T01:00:00.000+01:00",
      "nominPrincipale": "1",
      "infosQualite": {
        "libQualite": "Président"
      },
      "organesRefs": [
        "PO310693"
      ]
    }
  ]
}