{
  "uid": "PA719660",
  "etatCivil": {
    "ident": {
      "civ": "Mme",
      "prenom": "Christelle",
      "nom": "Dubos",
      "alpha": "Dubos"
    },
    "infoNaissance": {
      "dateNais": "1976-03-26T01:00:00.000+01:00",
      "villeNais": "Le Coteau",
      "depNais": "Loire",
      "paysNais": "France"
    }
  },
  "profession": {
    "libelleCourant": "Directrice d'un service emploi et solidarités",
    "socProcInsee": {
      "catSocPro": "Cadres de la fonction publique, professions intellectuelles et  artistiques",
      "famSocPro": "Cadres et professions intellectuelles supérieures"
    }
  },
  "adresses": [
    {
      "xsiType": "AdressePostale_Type",
      "uid": "AD719662",
      "type": "0",
      "typeLibelle": "Adresse officielle",
      "poids": "1",
      "intitule": "Assemblée nationale,",
      "numeroRue": "126",
      "nomRue": "Rue de l'Université,",
      "codePostal": "75355",
      "ville": "Paris 07 SP"
    },
    {
      "xsiType": "AdresseMail_Type",
      "uid": "AD728064",
      "type": "15",
      "typeLibelle": "Mèl",
      "valElec": "christelle.dubos@assemblee-nationale.fr"
    },
    {
      "xsiType": "AdresseSiteWeb_Type",
      "uid": "AD730148",
      "type": "25",
      "typeLibelle": "Facebook",
      "valElec": "duboschristelle"
    },
    {
      "xsiType": "AdresseSiteWeb_Type",
      "uid": "AD730162",
      "type": "22",
      "typeLibelle": "Site internet",
      "valElec": "christelledubos.fr"
    },
    {
      "xsiType": "AdresseSiteWeb_Type",
      "uid": "AD730236",
      "type": "24",
      "typeLibelle": "Twitter",
      "valElec": "@duboschristelle"
    },
    {
      "xsiType": "AdresseTelephonique_Type",
      "uid": "AD757853",
      "type": "11",
      "typeLibelle": "Téléphone",
      "poids": "1",
      "adresseDeRattachement": "AD719662",
      "valElec": "01.40.63.04.63"
    }
  ],
  "mandats": [
    {
      "xsiType": "MandatParlementaire_type",
      "uid": "PM722724",
      "acteurRef": "PA719660",
      "legislature": "15",
      "typeOrgane": "ASSEMBLEE",
      "dateDebut": "2017-06-18T02:00:00.000+02:00",
      "dateFin": "2018-11-16T01:00:00.000+01:00",
      "preseance": "50",
      "nominPrincipale": "1",
      "infosQualite": {
        "codeQualite": "membre",
        "libQualite": "membre",
        "libQualiteSex": "membre"
      },
      "organesRefs": [
        "PO717460"
      ],
      "suppleant": {
        "dateDebut": "2017-06-18T02:00:00.000+02:00",
        "dateFin": "2018-11-16T01:00:00.000+01:00",
        "suppleantRef": "PA719664"
      },
      "election": {
        "lieu": {
          "region": "Nouvelle-Aquitaine",
          "regionType": "Métropolitain",
          "departement": "Gironde",
          "numDepartement": "33",
          "numCirco": "12"
        },
        "causeMandat": "élections générales",
        "refCirconscription": "PO718544"
      },
      "mandature": {
        "datePriseFonction": "2017-06-21T02:00:00.000+02:00",
        "causeFin": "Nomination comme membre du Gouvernement",
        "premiereElection": "0"
      }
    },
    {
      "xsiType": "MandatSimple_Type",
      "uid": "PM724403",
      "acteurRef": "PA719660",
      "legislature": "15",
      "typeOrgane": "GP",
      "dateDebut": "2017-06-21T02:00:00.000+02:00",
      "dateFin": "2017-06-26T02:00:00.000+02:00",
      "preseance": "28",
      "nominPrincipale": "1",
      "infosQualite": {
        "codeQualite": "Député non-inscrit",
        "libQualite": "Député non-inscrit",
        "libQualiteSex": "Députée non-inscrite"
      },
      "organesRefs": [
        "PO723569"
      ]
    },
    {
      "xsiType": "MandatSimple_Type",
      "uid": "PM731068",
      "acteurRef": "PA719660",
      "legislature": "15",
      "typeOrgane": "GP",
      "dateDebut": "2017-06-27T02:00:00.000+02:00",
      "datePublication": "2017-06-28T02:00:00.000+02:00",
      "dateFin": "2018-11-16T01:00:00.000+01:00",
      "preseance": "20",
      "nominPrincipale": "1",
      "infosQualite": {
        "codeQualite": "Membre",
        "libQualite": "Membre du",
        "libQualiteSex": "Membre du"
      },
      "organesRefs": [
        "PO730964"
      ]
    },
    {
      "xsiType": "MandatSimple_Type",
      "uid": "PM732143",
      "acteurRef": "PA719660",
      "legislature": "15",
      "typeOrgane": "COMPER",
      "dateDebut": "2017-06-29T02:00:00.000+02:00",
      "datePublication": "2017-06-29T02:00:00.000+02:00",
      "dateFin": "2018-11-16T01:00:00.000+01:00",
      "preseance": "32",
      "nominPrincipale": "1",
      "infosQualite": {
        "codeQualite": "Membre",
        "libQualite": "Membre",
        "libQualiteSex": "Membre"
      },
      "organesRefs": [
        "PO419610"
      ]
    },
    {
      "xsiType": "MandatSimple_Type",
      "uid": "PM732292",
      "acteurRef": "PA719660",
      "legislature": "15",
      "typeOrgane": "COMPER",
      "dateDebut": "2017-06-30T02:00:00.000+02:00",
      "datePublication": "2017-06-30T02:00:00.000+02:00",
      "dateFin": "2018-11-07T01:00:00.000+01:00",
      "preseance": "16",
      "nominPrincipale": "1",
      "infosQualite": {
        "codeQualite": "Secrétaire",
        "libQualite": "Secrétaire",
        "libQualiteSex": "Secrétaire"
      },
      "organesRefs": [
        "PO419610"
      ]
    },
    {
      "xsiType": "MandatAvecSuppleant_Type",
      "uid": "PM732705",
      "acteurRef": "PA719660",
      "legislature": "15",
      "typeOrgane": "COMNL",
      "dateDebut": "2017-07-13T02:00:00.000+02:00",
      "datePublication": "2017-07-13T02:00:00.000+02:00",
      "dateFin": "2018-11-16T01:00:00.000+01:00",
      "preseance": "28",
      "nominPrincipale": "1",
      "infosQualite": {
        "codeQualite": "Suppléant",
        "libQualite": "Membre suppléant",
        "libQualiteSex": "Membre suppléante"
      },
      "organesRefs": [
        "PO271850"
      ]
    },
    {
      "xsiType": "MandatSimple_Type",
      "uid": "PM735433",
      "acteurRef": "PA719660",
      "legislature": "15",
      "typeOrgane": "GA",
      "dateDebut": "2017-09-27T02:00:00.000+02:00",
      "dateFin": "2018-11-16T01:00:00.000+01:00",
      "preseance": "20",
      "nominPrincipale": "1",
      "infosQualite": {
        "codeQualite": "Membre",
        "libQualite": "Membre",
        "libQualiteSex": "Membre"
      },
      "organesRefs": [
        "PO732974"
      ]
    },
    {
      "xsiType": "MandatSimple_Type",
      "uid": "PM735434",
      "acteurRef": "PA719660",
      "legislature": "15",
      "typeOrgane": "GA",
      "dateDebut": "2017-09-27T02:00:00.000+02:00",
      "dateFin": "2018-11-16T01:00:00.000+01:00",
      "preseance": "20",
      "nominPrincipale": "1",
      "infosQualite": {
        "codeQualite": "Membre",
        "libQualite": "Membre",
        "libQualiteSex": "Membre"
      },
      "organesRefs": [
        "PO733057"
      ]
    },
    {
      "xsiType": "MandatSimple_Type",
      "uid": "PM735435",
      "acteurRef": "PA719660",
      "legislature": "15",
      "typeOrgane": "GA",
      "dateDebut": "2017-09-27T02:00:00.000+02:00",
      "dateFin": "2018-11-16T01:00:00.000+01:00",
      "preseance": "20",
      "nominPrincipale": "1",
      "infosQualite": {
        "codeQualite": "Membre",
        "libQualite": "Membre",
        "libQualiteSex": "Membre"
      },
      "organesRefs": [
        "PO733112"
      ]
    },
    {
      "xsiType": "MandatSimple_Type",
      "uid": "PM735436",
      "acteurRef": "PA719660",
      "legislature": "15",
      "typeOrgane": "GA",
      "dateDebut": "2017-09-27T02:00:00.000+02:00",
      "dateFin": "2018-11-16T01:00:00.000+01:00",
      "preseance": "20",
      "nominPrincipale": "1",
      "infosQualite": {
        "codeQualite": "Membre",
        "libQualite": "Membre",
        "libQualiteSex": "Membre"
      },
      "organesRefs": [
        "PO733307"
      ]
    },
    {
      "xsiType": "MandatSimple_Type",
      "uid": "PM735437",
      "acteurRef": "PA719660",
      "legislature": "15",
      "typeOrgane": "GA",
      "dateDebut": "2017-09-27T02:00:00.000+02:00",
      "dateFin": "2018-11-16T01:00:00.000+01:00",
      "preseance": "20",
      "nominPrincipale": "1",
      "infosQualite": {
        "codeQualite": "Membre",
        "libQualite": "Membre",
        "libQualiteSex": "Membre"
      },
      "organesRefs": [
        "PO733577"
      ]
    },
    {
      "xsiType": "MandatSimple_Type",
      "uid": "PM741859",
      "acteurRef": "PA719660",
      "legislature": "15",
      "typeOrgane": "ORGEXTPARL",
      "dateDebut": "2017-10-24T02:00:00.000+02:00",
      "datePublication": "2017-10-25T02:00:00.000+02:00",
      "dateFin": "2018-11-16T01:00:00.000+01:00",
      "preseance": "20",
      "nominPrincipale": "1",
      "infosQualite": {
        "codeQualite": "Titulaire",
        "libQualite": "Membre titulaire",
        "libQualiteSex": "Membre titulaire"
      },
      "organesRefs": [
        "PO717345"
      ]
    },
    {
      "xsiType": "MandatSimple_Type",
      "uid": "PM742098",
      "acteurRef": "PA719660",
      "legislature": "15",
      "typeOrgane": "API",
      "dateDebut": "2017-10-27T02:00:00.000+02:00",
      "datePublication": "2017-10-28T02:00:00.000+02:00",
      "dateFin": "2018-11-16T01:00:00.000+01:00",
      "preseance": "20",
      "nominPrincipale": "1",
      "infosQualite": {
        "codeQualite": "Membre",
        "libQualite": "Membre",
        "libQualiteSex": "Membre"
      },
      "organesRefs": [
        "PO201115"
      ]
    },
    {
      "xsiType": "MandatSimple_Type",
      "uid": "PM742315",
      "acteurRef": "PA719660",
      "legislature": "15",
      "typeOrgane": "GA",
      "dateDebut": "2017-10-31T01:00:00.000+01:00",
      "dateFin": "2018-11-16T01:00:00.000+01:00",
      "preseance": "20",
      "nominPrincipale": "1",
      "infosQualite": {
        "codeQualite": "Membre",
        "libQualite": "Membre",
        "libQualiteSex": "Membre"
      },
      "organesRefs": [
        "PO733552"
      ]
    },
    {
      "xsiType": "MandatSimple_Type",
      "uid": "PM742582",
      "acteurRef": "PA719660",
      "legislature": "15",
      "typeOrgane": "GA",
      "dateDebut": "2017-11-07T01:00:00.000+01:00",
      "dateFin": "2018-11-16T01:00:00.000+01:00",
      "preseance": "14",
      "nominPrincipale": "1",
      "infosQualite": {
        "codeQualite": "Secrétaire",
        "libQualite": "Secrétaire",
        "libQualiteSex": "Secrétaire"
      },
      "organesRefs": [
        "PO733112"
      ]
    },
    {
      "xsiType": "MandatSimple_Type",
      "uid": "PM743500",
      "acteurRef": "PA719660",
      "legislature": "15",
      "typeOrgane": "GA",
      "dateDebut": "2017-11-15T01:00:00.000+01:00",
      "dateFin": "2018-11-16T01:00:00.000+01:00",
      "preseance": "14",
      "nominPrincipale": "1",
      "infosQualite": {
        "codeQualite": "Secrétaire",
        "libQualite": "Secrétaire",
        "libQualiteSex": "Secrétaire"
      },
      "organesRefs": [
        "PO732974"
      ]
    },
    {
      "xsiType": "MandatSimple_Type",
      "uid": "PM743802",
      "acteurRef": "PA719660",
      "legislature": "15",
      "typeOrgane": "GA",
      "dateDebut": "2017-11-22T01:00:00.000+01:00",
      "dateFin": "2018-11-16T01:00:00.000+01:00",
      "preseance": "14",
      "nominPrincipale": "1",
      "infosQualite": {
        "codeQualite": "Secrétaire",
        "libQualite": "Secrétaire",
        "libQualiteSex": "Secrétaire"
      },
      "organesRefs": [
        "PO733552"
      ]
    },
    {
      "xsiType": "MandatMission_Type",
      "uid": "PM744829",
      "acteurRef": "PA719660",
      "legislature": "15",
      "typeOrgane": "MISINFOPRE",
      "dateDebut": "2017-12-07T01:00:00.000+01:00",
      "datePublication": "2017-12-07T01:00:00.000+01:00",
      "dateFin": "2018-11-16T01:00:00.000+01:00",
      "preseance": "20",
      "nominPrincipale": "1",
      "infosQualite": {
        "codeQualite": "Membre",
        "libQualite": "Membre",
        "libQualiteSex": "Membre"
      },
      "organesRefs": [
        "PO743664"
      ]
    },
    {
      "xsiType": "MandatSimple_Type",
      "uid": "PM744999",
      "acteurRef": "PA719660",
      "typeOrgane": "PARPOL",
      "dateDebut": "2017-12-01T01:00:00.000+01:00",
      "dateFin": "2018-11-30T01:00:00.000+01:00",
      "preseance": "5",
      "nominPrincipale": "1",
      "infosQualite": {
        "codeQualite": "Membre",
        "libQualite": "Membre",
        "libQualiteSex": "Membre"
      },
      "organesRefs": [
        "PO744854"
      ]
    },
    {
      "xsiType": "MandatSimple_Type",
      "uid": "PM748183",
      "acteurRef": "PA719660",
      "legislature": "15",
      "typeOrgane": "API",
      "dateDebut": "2018-01-26T01:00:00.000+01:00",
      "dateFin": "2018-11-16T01:00:00.000+01:00",
      "preseance": "38",
      "nominPrincipale": "0",
      "infosQualite": {
        "codeQualite": "Secrétaire",
        "libQualite": "Secrétaire",
        "libQualiteSex": "Secrétaire"
      },
      "organesRefs": [
        "PO201115"
      ]
    },
    {
      "xsiType": "MandatSimple_Type",
      "uid": "PM750227",
      "acteurRef": "PA719660",
      "legislature": "15",
      "typeOrgane": "GE",
      "dateDebut": "2018-02-08T01:00:00.000+01:00",
      "dateFin": "2018-11-16T01:00:00.000+01:00",
      "preseance": "20",
      "nominPrincipale": "1",
      "infosQualite": {
        "codeQualite": "Membre",
        "libQualite": "Membre",
        "libQualiteSex": "Membre"
      },
      "organesRefs": [
        "PO747266"
      ]
    },
    {
      "xsiType": "MandatSimple_Type",
      "uid": "PM750326",
      "acteurRef": "PA719660",
      "legislature": "15",
      "typeOrgane": "GE",
      "dateDebut": "2018-02-14T01:00:00.000+01:00",
      "dateFin": "2018-11-16T01:00:00.000+01:00",
      "preseance": "20",
      "nominPrincipale": "1",
      "infosQualite": {
        "codeQualite": "Membre",
        "libQualite": "Membre",
        "libQualiteSex": "Membre"
      },
      "organesRefs": [
        "PO747129"
      ]
    },
    {
      "xsiType": "MandatSimple_Type",
      "uid": "PM750709",
      "acteurRef": "PA719660",
      "legislature": "15",
      "typeOrgane": "GE",
      "dateDebut": "2018-02-16T01:00:00.000+01:00",
      "dateFin": "2018-11-16T01:00:00.000+01:00",
      "preseance": "20",
      "nominPrincipale": "1",
      "infosQualite": {
        "codeQualite": "Membre",
        "libQualite": "Membre",
        "libQualiteSex": "Membre"
      },
      "organesRefs": [
        "PO746847"
      ]
    },
    {
      "xsiType": "MandatSimple_Type",
      "uid": "PM751673",
      "acteurRef": "PA719660",
      "legislature": "15",
      "typeOrgane": "GE",
      "dateDebut": "2018-02-22T01:00:00.000+01:00",
      "dateFin": "2018-11-16T01:00:00.000+01:00",
      "preseance": "20",
      "nominPrincipale": "1",
      "infosQualite": {
        "codeQualite": "Membre",
        "libQualite": "Membre",
        "libQualiteSex": "Membre"
      },
      "organesRefs": [
        "PO746669"
      ]
    },
    {
      "xsiType": "MandatSimple_Type",
      "uid": "PM753418",
      "acteurRef": "PA719660",
      "legislature": "15",
      "typeOrgane": "GE",
      "dateDebut": "2018-03-14T01:00:00.000+01:00",
      "dateFin": "2018-11-16T01:00:00.000+01:00",
      "preseance": "20",
      "nominPrincipale": "1",
      "infosQualite": {
        "codeQualite": "Membre",
        "libQualite": "Membre",
        "libQualiteSex": "Membre"
      },
      "organesRefs": [
        "PO746997"
      ]
    },
    {
      "xsiType": "MandatSimple_Type",
      "uid": "PM754252",
      "acteurRef": "PA719660",
      "legislature": "15",
      "typeOrgane": "GE",
      "dateDebut": "2018-03-22T01:00:00.000+01:00",
      "dateFin": "2018-11-16T01:00:00.000+01:00",
      "preseance": "12",
      "nominPrincipale": "1",
      "infosQualite": {
        "codeQualite": "Secrétaire",
        "libQualite": "Secrétaire",
        "libQualiteSex": "Secrétaire"
      },
      "organesRefs": [
        "PO747129"
      ]
    },
    {
      "xsiType": "MandatSimple_Type",
      "uid": "PM756960",
      "acteurRef": "PA719660",
      "legislature": "15",
      "typeOrgane": "ORGEXTPARL",
      "dateDebut": "2018-03-08T01:00:00.000+01:00",
      "datePublication": "2018-03-09T01:00:00.000+01:00",
      "dateFin": "2018-11-16T01:00:00.000+01:00",
      "preseance": "20",
      "nominPrincipale": "1",
      "infosQualite": {
        "codeQualite": "Titulaire",
        "libQualite": "Membre titulaire",
        "libQualiteSex": "Membre titulaire"
      },
      "organesRefs": [
        "PO756933"
      ]
    },
    {
      "xsiType": "MandatSimple_Type",
      "uid": "PM758907",
      "acteurRef": "PA719660",
      "legislature": "15",
      "typeOrgane": "CMP",
      "dateDebut": "2018-09-13T02:00:00.000+02:00",
      "datePublication": "2018-09-14T02:00:00.000+02:00",
      "dateFin": "2018-10-16T02:00:00.000+02:00",
      "preseance": "20",
      "nominPrincipale": "1",
      "infosQualite": {
        "codeQualite": "Titulaire",
        "libQualite": "Membre titulaire",
        "libQualiteSex": "Membre titulaire"
      },
      "organesRefs": [
        "PO758352"
      ]
    },
    {
      "xsiType": "MandatSimple_Type",
      "uid": "PM759004",
      "acteurRef": "PA719660",
      "legislature": "15",
      "typeOrgane": "CMP",
      "dateDebut": "2018-09-19T02:00:00.000+02:00",
      "datePublication": "2018-09-21T02:00:00.000+02:00",
      "dateFin": "2018-10-16T02:00:00.000+02:00",
      "preseance": "16",
      "nominPrincipale": "1",
      "infosQualite": {
        "codeQualite": "Rapporteur",
        "libQualite": "Rapporteur",
        "libQualiteSex": "Rapporteure"
      },
      "organesRefs": [
        "PO758352"
      ]
    },
    {
      "xsiType": "MandatSimple_Type",
      "uid": "PM759814",
      "acteurRef": "PA719660",
      "typeOrgane": "MINISTERE",
      "dateDebut": "2018-10-17T02:00:00.000+02:00",
      "datePublication": "2018-10-17T02:00:00.000+02:00",
      "preseance": "50",
      "nominPrincipale": "1",
      "infosQualite": {
        "codeQualite": "Secrétaire d'État",
        "libQualite": "Secrétaire d'État",
        "libQualiteSex": "Secrétaire d'État"
      },
      "organesRefs": [
        "PO759811"
      ]
    },
    {
      "xsiType": "MandatSimple_Type",
      "uid": "PM15759814",
      "acteurRef": "PA719660",
      "typeOrgane": "GOUVERNEMENT",
      "dateDebut": "2018-10-17T02:00:00.000+02:00",
      "datePublication": "2018-10-17T02:00:00.000+02:00",
      "preseance": "50",
      "nominPrincipale": "1",
      "infosQualite": {
        "codeQualite": "membre",
        "libQualite": "membre",
        "libQualiteSex": "membre"
      },
      "organesRefs": [
        "PO725688"
      ]
    }
  ]
}