{
  "xsiType": "OrganeExtraParlementaire_type",
  "uid": "PO732861",
  "codeType": "ORGEXTPARL",
  "libelle": "Conseil national de l'enseignement supérieur et de la recherche artistiques et culturels",
  "libelleAbrege": "Conseil national enseignement supérieur et recherche artistiques et culturels",
  "libelleAbrev": "378",
  "viMoDe": {
    "dateDebut": "2016-07-07T02:00:00.000+02:00"
  },
  "regime": "5ème République",
  "regimeJuridique": "Article L. 239-1 du code de l’éducation",
  "siteInternet": "http://www.culture.gouv.fr/Thematiques/Enseignement-superieur-et-Recherche/Le-Cneserac",
  "nombreReunionsAnnuelles": "0"
}