{
  "uid": "PA2543",
  "etatCivil": {
    "ident": {
      "civ": "M.",
      "prenom": "Charles",
      "nom": "Revet",
      "alpha": "REVET"
    },
    "infoNaissance": {
      "dateNais": "1937-11-09T00:00:00.000+00:00",
      "villeNais": "Turretot",
      "depNais": "Seine-Maritime"
    }
  },
  "profession": {
    "libelleCourant": "Agriculteur",
    "socProcInsee": {
      "catSocPro": "Agriculteurs exploitants",
      "famSocPro": "Agriculteurs exploitants"
    }
  },
  "adresses": [
    {
      "xsiType": "AdressePostale_Type",
      "uid": "AD44527",
      "type": "2",
      "typeLibelle": "Adresse publiée de circonscription",
      "poids": "21",
      "complementAdresse": "Fécamp,",
      "codePostal": "76400"
    },
    {
      "xsiType": "AdressePostale_Type",
      "uid": "AD44530",
      "type": "0",
      "typeLibelle": "Adresse officielle",
      "poids": "1",
      "intitule": "Casier de la Poste,",
      "complementAdresse": "Palais Bourbon,",
      "codePostal": "75355",
      "ville": "Paris 07 SP"
    },
    {
      "xsiType": "AdresseTelephonique_Type",
      "uid": "AD48554",
      "type": "11",
      "typeLibelle": "Téléphone",
      "poids": "21",
      "adresseDeRattachement": "AD44527",
      "valElec": "02 35 28 47 85"
    },
    {
      "xsiType": "AdresseTelephonique_Type",
      "uid": "AD50026",
      "type": "12",
      "typeLibelle": "Télécopie",
      "poids": "21",
      "adresseDeRattachement": "AD44527",
      "valElec": "02 35 28 82 53"
    },
    {
      "xsiType": "AdresseSiteWeb_Type",
      "uid": "AD317592",
      "type": "23",
      "typeLibelle": "Url sénateur",
      "valElec": "https://www.senat.fr/senateur/revet_charles95062k.html"
    }
  ],
  "mandats": [
    {
      "xsiType": "MandatSimple_Type",
      "uid": "PM286561",
      "acteurRef": "PA2543",
      "typeOrgane": "GROUPESENAT",
      "dateDebut": "2002-12-11T01:00:00.000+01:00",
      "datePublication": "2002-12-11T01:00:00.000+01:00",
      "dateFin": "2019-09-30T02:00:00.000+02:00",
      "preseance": "4",
      "nominPrincipale": "1",
      "infosQualite": {
        "codeQualite": "Membre",
        "libQualite": "Membre",
        "libQualiteSex": "Membre"
      },
      "organesRefs": [
        "PO286005"
      ]
    },
    {
      "xsiType": "MandatSimple_Type",
      "uid": "PM437014",
      "acteurRef": "PA2543",
      "typeOrgane": "DELEGSENAT",
      "dateDebut": "2011-11-30T01:00:00.000+01:00",
      "preseance": "4",
      "nominPrincipale": "1",
      "infosQualite": {
        "codeQualite": "Membre",
        "libQualite": "Membre",
        "libQualiteSex": "Membre"
      },
      "organesRefs": [
        "PO436945"
      ]
    },
    {
      "xsiType": "MandatParlementaire_type",
      "uid": "PM703671",
      "acteurRef": "PA2543",
      "typeOrgane": "SENAT",
      "dateDebut": "2014-10-01T02:00:00.000+02:00",
      "dateFin": "2019-09-30T02:00:00.000+02:00",
      "preseance": "20",
      "nominPrincipale": "1",
      "infosQualite": {
        "codeQualite": "Sénateur",
        "libQualite": "SENATEUR",
        "libQualiteSex": "SENATEUR"
      },
      "organesRefs": [
        "PO78718"
      ],
      "election": {
        "lieu": {
          "numDepartement": "76"
        }
      },
      "mandature": {
        "premiereElection": "0"
      }
    },
    {
      "xsiType": "MandatSimple_Type",
      "uid": "PM704214",
      "acteurRef": "PA2543",
      "typeOrgane": "COMSENAT",
      "dateDebut": "2014-10-09T02:00:00.000+02:00",
      "dateFin": "2017-10-03T02:00:00.000+02:00",
      "nominPrincipale": "1",
      "infosQualite": {
        "libQualite": "Vice-Président",
        "libQualiteSex": "Vice-Président"
      },
      "organesRefs": [
        "PO516754"
      ]
    },
    {
      "xsiType": "MandatSimple_Type",
      "uid": "PM704932",
      "acteurRef": "PA2543",
      "typeOrgane": "DELEGSENAT",
      "dateDebut": "2014-10-29T01:00:00.000+01:00",
      "preseance": "4",
      "nominPrincipale": "1",
      "infosQualite": {
        "codeQualite": "Membre",
        "libQualite": "Membre",
        "libQualiteSex": "Membre"
      },
      "organesRefs": [
        "PO436945"
      ]
    },
    {
      "xsiType": "MandatSimple_Type",
      "uid": "PM741111",
      "acteurRef": "PA2543",
      "typeOrgane": "COMSENAT",
      "dateDebut": "2017-10-04T02:00:00.000+02:00",
      "dateFin": "2019-09-30T02:00:00.000+02:00",
      "preseance": "10",
      "nominPrincipale": "1",
      "infosQualite": {
        "codeQualite": "Membre",
        "libQualite": "Membre",
        "libQualiteSex": "Membre"
      },
      "organesRefs": [
        "PO516754"
      ]
    },
    {
      "xsiType": "MandatSimple_Type",
      "uid": "PM741473",
      "acteurRef": "PA2543",
      "typeOrgane": "DELEGSENAT",
      "dateDebut": "2017-10-18T02:00:00.000+02:00",
      "preseance": "4",
      "nominPrincipale": "1",
      "infosQualite": {
        "codeQualite": "Membre",
        "libQualite": "Membre",
        "libQualiteSex": "Membre"
      },
      "organesRefs": [
        "PO436945"
      ]
    }
  ]
}