{
  "uid": "PA227089",
  "etatCivil": {
    "ident": {
      "civ": "Mme",
      "prenom": "Valérie",
      "nom": "Létard",
      "alpha": "LETARD"
    },
    "infoNaissance": {
      "dateNais": "1962-10-13T01:00:00.000+01:00"
    }
  },
  "profession": {
    "socProcInsee": {}
  },
  "adresses": [
    {
      "xsiType": "AdresseSiteWeb_Type",
      "uid": "AD317000",
      "type": "23",
      "typeLibelle": "Url sénateur",
      "valElec": "https://www.senat.fr/senateur/letard_valerie01043q.html"
    }
  ],
  "mandats": [
    {
      "xsiType": "MandatSimple_Type",
      "uid": "PM309490",
      "acteurRef": "PA227089",
      "typeOrgane": "GROUPESENAT",
      "dateDebut": "2011-10-01T02:00:00.000+02:00",
      "preseance": "4",
      "nominPrincipale": "1",
      "infosQualite": {
        "codeQualite": "Membre",
        "libQualite": "Membre",
        "libQualiteSex": "Membre du"
      },
      "organesRefs": [
        "PO309463"
      ]
    },
    {
      "xsiType": "MandatSimple_Type",
      "uid": "PM426330",
      "acteurRef": "PA227089",
      "typeOrgane": "GROUPESENAT",
      "dateDebut": "2010-12-14T01:00:00.000+01:00",
      "preseance": "4",
      "nominPrincipale": "1",
      "infosQualite": {
        "codeQualite": "Membre",
        "libQualite": "Membre",
        "libQualiteSex": "Membre du"
      },
      "organesRefs": [
        "PO309463"
      ]
    },
    {
      "xsiType": "MandatParlementaire_type",
      "uid": "PM430016",
      "acteurRef": "PA227089",
      "typeOrgane": "SENAT",
      "dateDebut": "2011-10-01T02:00:00.000+02:00",
      "dateFin": "2017-10-01T02:00:00.000+02:00",
      "preseance": "20",
      "nominPrincipale": "1",
      "infosQualite": {
        "codeQualite": "Sénateur",
        "libQualite": "SENATEUR",
        "libQualiteSex": "Sénateur 5ème République"
      },
      "organesRefs": [
        "PO78718"
      ],
      "election": {
        "lieu": {
          "numDepartement": "59"
        }
      },
      "mandature": {
        "premiereElection": "0"
      }
    },
    {
      "xsiType": "MandatSimple_Type",
      "uid": "PM436976",
      "acteurRef": "PA227089",
      "typeOrgane": "DELEGSENAT",
      "dateDebut": "2011-11-30T01:00:00.000+01:00",
      "preseance": "4",
      "nominPrincipale": "1",
      "infosQualite": {
        "codeQualite": "Membre",
        "libQualite": "Membre",
        "libQualiteSex": "Membre"
      },
      "organesRefs": [
        "PO310693"
      ]
    },
    {
      "xsiType": "MandatParlementaire_type",
      "uid": "PM703941",
      "acteurRef": "PA227089",
      "typeOrgane": "SENAT",
      "dateDebut": "2014-10-08T02:00:00.000+02:00",
      "dateFin": "2017-10-03T02:00:00.000+02:00",
      "nominPrincipale": "1",
      "infosQualite": {
        "libQualite": "Secrétaire"
      },
      "organesRefs": [
        "PO78718"
      ],
      "election": {
        "lieu": {}
      },
      "mandature": {
        "premiereElection": "0"
      }
    },
    {
      "xsiType": "MandatSimple_Type",
      "uid": "PM704199",
      "acteurRef": "PA227089",
      "typeOrgane": "COMSENAT",
      "dateDebut": "2014-10-09T02:00:00.000+02:00",
      "dateFin": "2017-10-04T02:00:00.000+02:00",
      "nominPrincipale": "1",
      "infosQualite": {
        "libQualite": "Secrétaire"
      },
      "organesRefs": [
        "PO516753"
      ]
    },
    {
      "xsiType": "MandatSimple_Type",
      "uid": "PM705045",
      "acteurRef": "PA227089",
      "typeOrgane": "DELEGSENAT",
      "dateDebut": "2014-11-26T01:00:00.000+01:00",
      "preseance": "4",
      "nominPrincipale": "1",
      "infosQualite": {
        "codeQualite": "Membre",
        "libQualite": "Membre",
        "libQualiteSex": "Membre"
      },
      "organesRefs": [
        "PO704856"
      ]
    },
    {
      "xsiType": "MandatParlementaire_type",
      "uid": "PM736372",
      "acteurRef": "PA227089",
      "typeOrgane": "SENAT",
      "dateDebut": "2017-10-02T02:00:00.000+02:00",
      "preseance": "20",
      "nominPrincipale": "1",
      "infosQualite": {
        "codeQualite": "Sénateur",
        "libQualite": "SENATEUR",
        "libQualiteSex": "Sénateur 5ème République"
      },
      "organesRefs": [
        "PO78718"
      ],
      "election": {
        "lieu": {
          "numDepartement": "59"
        }
      },
      "mandature": {
        "premiereElection": "0"
      }
    },
    {
      "xsiType": "MandatParlementaire_type",
      "uid": "PM741026",
      "acteurRef": "PA227089",
      "typeOrgane": "SENAT",
      "dateDebut": "2017-10-04T02:00:00.000+02:00",
      "nominPrincipale": "1",
      "infosQualite": {
        "libQualite": "Vice-président"
      },
      "organesRefs": [
        "PO78718"
      ],
      "election": {
        "lieu": {}
      },
      "mandature": {
        "premiereElection": "0"
      }
    },
    {
      "xsiType": "MandatSimple_Type",
      "uid": "PM741267",
      "acteurRef": "PA227089",
      "typeOrgane": "COMSENAT",
      "dateDebut": "2017-10-05T02:00:00.000+02:00",
      "nominPrincipale": "1",
      "infosQualite": {
        "libQualite": "Secrétaire"
      },
      "organesRefs": [
        "PO516753"
      ]
    },
    {
      "xsiType": "MandatSimple_Type",
      "uid": "PM741409",
      "acteurRef": "PA227089",
      "typeOrgane": "DELEGSENAT",
      "dateDebut": "2017-10-18T02:00:00.000+02:00",
      "preseance": "4",
      "nominPrincipale": "1",
      "infosQualite": {
        "codeQualite": "Membre",
        "libQualite": "Membre",
        "libQualiteSex": "Membre"
      },
      "organesRefs": [
        "PO310693"
      ]
    },
    {
      "xsiType": "MandatSimple_Type",
      "uid": "PM758912",
      "acteurRef": "PA227089",
      "typeOrgane": "CMP",
      "dateDebut": "2018-09-13T02:00:00.000+02:00",
      "datePublication": "2018-09-14T02:00:00.000+02:00",
      "dateFin": "2018-10-16T02:00:00.000+02:00",
      "preseance": "20",
      "nominPrincipale": "1",
      "infosQualite": {
        "codeQualite": "Titulaire",
        "libQualite": "Membre titulaire",
        "libQualiteSex": "Membre titulaire"
      },
      "organesRefs": [
        "PO758352"
      ]
    }
  ]
}