{
  "uid": "PA736190",
  "etatCivil": {
    "ident": {
      "civ": "Mme",
      "prenom": "Maryse",
      "nom": "Carrère",
      "alpha": "CARRERE_Maryse"
    },
    "infoNaissance": {
      "dateNais": "1967-04-08T01:00:00.000+01:00"
    }
  },
  "profession": {
    "socProcInsee": {}
  },
  "adresses": [
    {
      "xsiType": "AdresseSiteWeb_Type",
      "uid": "AD736479",
      "type": "23",
      "typeLibelle": "Url sénateur",
      "valElec": "https://www.senat.fr/senateur/carrere_maryse19629c.html"
    }
  ],
  "mandats": [
    {
      "xsiType": "MandatParlementaire_type",
      "uid": "PM736255",
      "acteurRef": "PA736190",
      "typeOrgane": "SENAT",
      "dateDebut": "2017-10-02T02:00:00.000+02:00",
      "preseance": "20",
      "nominPrincipale": "1",
      "infosQualite": {
        "codeQualite": "Sénateur",
        "libQualite": "SENATEUR",
        "libQualiteSex": "Sénateur 5ème République"
      },
      "organesRefs": [
        "PO78718"
      ],
      "election": {
        "lieu": {
          "numDepartement": "65"
        }
      },
      "mandature": {
        "premiereElection": "0"
      }
    },
    {
      "xsiType": "MandatSimple_Type",
      "uid": "PM741066",
      "acteurRef": "PA736190",
      "typeOrgane": "COMSENAT",
      "dateDebut": "2017-10-04T02:00:00.000+02:00",
      "preseance": "10",
      "nominPrincipale": "1",
      "infosQualite": {
        "codeQualite": "Membre",
        "libQualite": "Membre",
        "libQualiteSex": "Membre"
      },
      "organesRefs": [
        "PO211495"
      ]
    },
    {
      "xsiType": "MandatSimple_Type",
      "uid": "PM741378",
      "acteurRef": "PA736190",
      "typeOrgane": "DELEGSENAT",
      "dateDebut": "2017-10-18T02:00:00.000+02:00",
      "preseance": "4",
      "nominPrincipale": "1",
      "infosQualite": {
        "codeQualite": "Membre",
        "libQualite": "Membre",
        "libQualiteSex": "Membre"
      },
      "organesRefs": [
        "PO420388"
      ]
    },
    {
      "xsiType": "MandatSimple_Type",
      "uid": "PM741579",
      "acteurRef": "PA736190",
      "typeOrgane": "GROUPESENAT",
      "dateDebut": "2017-10-03T02:00:00.000+02:00",
      "preseance": "4",
      "nominPrincipale": "1",
      "infosQualite": {
        "codeQualite": "Membre",
        "libQualite": "Membre",
        "libQualiteSex": "Membre du"
      },
      "organesRefs": [
        "PO77714"
      ]
    },
    {
      "xsiType": "MandatSimple_Type",
      "uid": "PM746550",
      "acteurRef": "PA736190",
      "typeOrgane": "CMP",
      "dateDebut": "2017-12-15T01:00:00.000+01:00",
      "datePublication": "2017-12-16T01:00:00.000+01:00",
      "dateFin": "2017-12-21T01:00:00.000+01:00",
      "preseance": "28",
      "nominPrincipale": "1",
      "infosQualite": {
        "codeQualite": "Suppléant",
        "libQualite": "Membre suppléant",
        "libQualiteSex": "Membre suppléante"
      },
      "organesRefs": [
        "PO746520"
      ]
    },
    {
      "xsiType": "MandatSimple_Type",
      "uid": "PM748720",
      "acteurRef": "PA736190",
      "typeOrgane": "CMP",
      "dateDebut": "2018-02-03T01:00:00.000+01:00",
      "datePublication": "2018-02-03T01:00:00.000+01:00",
      "dateFin": "2018-02-15T01:00:00.000+01:00",
      "preseance": "28",
      "nominPrincipale": "1",
      "infosQualite": {
        "codeQualite": "Suppléant",
        "libQualite": "Membre suppléant",
        "libQualiteSex": "Membre suppléante"
      },
      "organesRefs": [
        "PO748454"
      ]
    },
    {
      "xsiType": "MandatSimple_Type",
      "uid": "PM750586",
      "acteurRef": "PA736190",
      "typeOrgane": "CMP",
      "dateDebut": "2018-02-16T01:00:00.000+01:00",
      "datePublication": "2018-02-16T01:00:00.000+01:00",
      "dateFin": "2018-03-15T01:00:00.000+01:00",
      "preseance": "28",
      "nominPrincipale": "1",
      "infosQualite": {
        "codeQualite": "Suppléant",
        "libQualite": "Membre suppléant",
        "libQualiteSex": "Membre suppléante"
      },
      "organesRefs": [
        "PO749105"
      ]
    },
    {
      "xsiType": "MandatSimple_Type",
      "uid": "PM752979",
      "acteurRef": "PA736190",
      "typeOrgane": "CMP",
      "dateDebut": "2018-03-09T01:00:00.000+01:00",
      "datePublication": "2018-03-09T01:00:00.000+01:00",
      "dateFin": "2018-04-11T02:00:00.000+02:00",
      "preseance": "28",
      "nominPrincipale": "1",
      "infosQualite": {
        "codeQualite": "Suppléant",
        "libQualite": "Membre suppléant",
        "libQualiteSex": "Membre suppléante"
      },
      "organesRefs": [
        "PO750828"
      ]
    },
    {
      "xsiType": "MandatSimple_Type",
      "uid": "PM754556",
      "acteurRef": "PA736190",
      "typeOrgane": "CMP",
      "dateDebut": "2018-03-28T02:00:00.000+02:00",
      "datePublication": "2018-03-30T02:00:00.000+02:00",
      "dateFin": "2018-05-14T02:00:00.000+02:00",
      "preseance": "28",
      "nominPrincipale": "1",
      "infosQualite": {
        "codeQualite": "Suppléant",
        "libQualite": "Membre suppléant",
        "libQualiteSex": "Membre suppléante"
      },
      "organesRefs": [
        "PO754171"
      ]
    },
    {
      "xsiType": "MandatSimple_Type",
      "uid": "PM756064",
      "acteurRef": "PA736190",
      "typeOrgane": "CMP",
      "dateDebut": "2018-04-18T02:00:00.000+02:00",
      "datePublication": "2018-05-12T02:00:00.000+02:00",
      "dateFin": "2018-07-31T02:00:00.000+02:00",
      "preseance": "28",
      "nominPrincipale": "1",
      "infosQualite": {
        "codeQualite": "Suppléant",
        "libQualite": "Membre suppléant",
        "libQualiteSex": "Membre suppléante"
      },
      "organesRefs": [
        "PO755721"
      ]
    },
    {
      "xsiType": "MandatSimple_Type",
      "uid": "PM756200",
      "acteurRef": "PA736190",
      "typeOrgane": "CMP",
      "dateDebut": "2018-05-17T02:00:00.000+02:00",
      "datePublication": "2018-05-18T02:00:00.000+02:00",
      "dateFin": "2018-06-21T02:00:00.000+02:00",
      "preseance": "28",
      "nominPrincipale": "1",
      "infosQualite": {
        "codeQualite": "Suppléant",
        "libQualite": "Membre suppléant",
        "libQualiteSex": "Membre suppléante"
      },
      "organesRefs": [
        "PO755798"
      ]
    },
    {
      "xsiType": "MandatSimple_Type",
      "uid": "PM758293",
      "acteurRef": "PA736190",
      "typeOrgane": "CMP",
      "dateDebut": "2018-07-10T02:00:00.000+02:00",
      "datePublication": "2018-07-20T02:00:00.000+02:00",
      "dateFin": "2018-08-01T02:00:00.000+02:00",
      "preseance": "20",
      "nominPrincipale": "1",
      "infosQualite": {
        "codeQualite": "Titulaire",
        "libQualite": "Membre titulaire",
        "libQualiteSex": "Membre titulaire"
      },
      "organesRefs": [
        "PO757668"
      ]
    },
    {
      "xsiType": "MandatSimple_Type",
      "uid": "PM759040",
      "acteurRef": "PA736190",
      "typeOrgane": "CMP",
      "dateDebut": "2018-09-25T02:00:00.000+02:00",
      "datePublication": "2018-09-26T02:00:00.000+02:00",
      "dateFin": "2018-11-20T01:00:00.000+01:00",
      "preseance": "20",
      "nominPrincipale": "1",
      "infosQualite": {
        "codeQualite": "Titulaire",
        "libQualite": "Membre titulaire",
        "libQualiteSex": "Membre titulaire"
      },
      "organesRefs": [
        "PO758375"
      ]
    },
    {
      "xsiType": "MandatSimple_Type",
      "uid": "PM759068",
      "acteurRef": "PA736190",
      "typeOrgane": "CMP",
      "dateDebut": "2018-09-25T02:00:00.000+02:00",
      "datePublication": "2018-09-26T02:00:00.000+02:00",
      "dateFin": "2018-11-20T01:00:00.000+01:00",
      "preseance": "20",
      "nominPrincipale": "1",
      "infosQualite": {
        "codeQualite": "Titulaire",
        "libQualite": "Membre titulaire",
        "libQualiteSex": "Membre titulaire"
      },
      "organesRefs": [
        "PO758368"
      ]
    },
    {
      "xsiType": "MandatSimple_Type",
      "uid": "PM760741",
      "acteurRef": "PA736190",
      "typeOrgane": "CMP",
      "dateDebut": "2018-11-27T01:00:00.000+01:00",
      "datePublication": "2018-11-29T01:00:00.000+01:00",
      "dateFin": "2019-02-18T01:00:00.000+01:00",
      "preseance": "28",
      "nominPrincipale": "1",
      "infosQualite": {
        "codeQualite": "Suppléant",
        "libQualite": "Membre suppléant",
        "libQualiteSex": "Membre suppléante"
      },
      "organesRefs": [
        "PO760711"
      ]
    },
    {
      "xsiType": "MandatSimple_Type",
      "uid": "PM760769",
      "acteurRef": "PA736190",
      "typeOrgane": "CMP",
      "dateDebut": "2018-11-26T01:00:00.000+01:00",
      "datePublication": "2018-11-29T01:00:00.000+01:00",
      "dateFin": "2019-02-20T01:00:00.000+01:00",
      "preseance": "28",
      "nominPrincipale": "1",
      "infosQualite": {
        "codeQualite": "Suppléant",
        "libQualite": "Membre suppléant",
        "libQualiteSex": "Membre suppléante"
      },
      "organesRefs": [
        "PO760704"
      ]
    },
    {
      "xsiType": "MandatSimple_Type",
      "uid": "PM764843",
      "acteurRef": "PA736190",
      "typeOrgane": "CMP",
      "dateDebut": "2019-04-30T02:00:00.000+02:00",
      "datePublication": "2019-05-02T02:00:00.000+02:00",
      "dateFin": "2019-05-23T02:00:00.000+02:00",
      "preseance": "28",
      "nominPrincipale": "1",
      "infosQualite": {
        "codeQualite": "Suppléant",
        "libQualite": "Membre suppléant",
        "libQualiteSex": "Membre suppléante"
      },
      "organesRefs": [
        "PO764703"
      ]
    },
    {
      "xsiType": "MandatSimple_Type",
      "uid": "PM764870",
      "acteurRef": "PA736190",
      "typeOrgane": "CMP",
      "dateDebut": "2019-04-30T02:00:00.000+02:00",
      "datePublication": "2019-05-02T02:00:00.000+02:00",
      "dateFin": "2019-05-23T02:00:00.000+02:00",
      "preseance": "28",
      "nominPrincipale": "1",
      "infosQualite": {
        "codeQualite": "Suppléant",
        "libQualite": "Membre suppléant",
        "libQualiteSex": "Membre suppléante"
      },
      "organesRefs": [
        "PO764697"
      ]
    },
    {
      "xsiType": "MandatSimple_Type",
      "uid": "PM766272",
      "acteurRef": "PA736190",
      "typeOrgane": "CMP",
      "dateDebut": "2019-07-02T02:00:00.000+02:00",
      "datePublication": "2019-07-05T02:00:00.000+02:00",
      "dateFin": "2019-07-25T02:00:00.000+02:00",
      "preseance": "28",
      "nominPrincipale": "1",
      "infosQualite": {
        "codeQualite": "Suppléant",
        "libQualite": "Membre suppléant",
        "libQualiteSex": "Membre suppléante"
      },
      "organesRefs": [
        "PO766090"
      ]
    }
  ]
}