{
  "uid": "PA712014",
  "etatCivil": {
    "ident": {
      "civ": "M.",
      "prenom": "Vincent",
      "nom": "Ledoux",
      "alpha": "Ledoux",
      "trigramme": "VLE"
    },
    "infoNaissance": {
      "dateNais": "1966-06-21T01:00:00.000+01:00",
      "villeNais": "Watermael-Boitsfort",
      "paysNais": "Belgique"
    }
  },
  "profession": {
    "libelleCourant": "Enseignant",
    "socProcInsee": {
      "catSocPro": "Cadres de la fonction publique, professions intellectuelles et  artistiques",
      "famSocPro": "Cadres et professions intellectuelles supérieures"
    }
  },
  "uriHatvp": "https://www.hatvp.fr/pages_nominatives/ledoux-vincent",
  "adresses": [
    {
      "xsiType": "AdressePostale_Type",
      "uid": "AD712028",
      "type": "0",
      "typeLibelle": "Adresse officielle",
      "poids": "1",
      "intitule": "Assemblée nationale",
      "numeroRue": "126",
      "nomRue": "Rue de l'Université",
      "codePostal": "75355",
      "ville": "Paris 07 SP"
    },
    {
      "xsiType": "AdresseMail_Type",
      "uid": "AD712059",
      "type": "15",
      "typeLibelle": "Mèl",
      "valElec": "vincent.ledoux@assemblee-nationale.fr"
    },
    {
      "xsiType": "AdresseSiteWeb_Type",
      "uid": "AD728820",
      "type": "22",
      "typeLibelle": "Site internet",
      "valElec": "www.vincentledoux.com"
    },
    {
      "xsiType": "AdresseSiteWeb_Type",
      "uid": "AD728892",
      "type": "25",
      "typeLibelle": "Facebook",
      "valElec": "vincent.ledoux.313"
    },
    {
      "xsiType": "AdresseMail_Type",
      "uid": "AD728928",
      "type": "15",
      "typeLibelle": "Mèl",
      "valElec": "vincent.ledoux@roncq.fr"
    },
    {
      "xsiType": "AdressePostale_Type",
      "uid": "AD729084",
      "type": "2",
      "typeLibelle": "Adresse publiée de circonscription",
      "poids": "22",
      "numeroRue": "60 Bis",
      "nomRue": "Chaussée Albert Einstein",
      "codePostal": "59290",
      "ville": "Tourcoing"
    },
    {
      "xsiType": "AdresseTelephonique_Type",
      "uid": "AD729086",
      "type": "11",
      "typeLibelle": "Téléphone",
      "poids": "22",
      "adresseDeRattachement": "AD729084",
      "valElec": "03 20 11 11 61"
    },
    {
      "xsiType": "AdresseSiteWeb_Type",
      "uid": "AD729196",
      "type": "24",
      "typeLibelle": "Twitter",
      "valElec": "@VincentLedoux59"
    }
  ],
  "mandats": [
    {
      "xsiType": "MandatParlementaire_type",
      "uid": "PM712023",
      "acteurRef": "PA712014",
      "legislature": "14",
      "typeOrgane": "ASSEMBLEE",
      "dateDebut": "2016-03-20T01:00:00.000+01:00",
      "dateFin": "2017-06-20T02:00:00.000+02:00",
      "preseance": "50",
      "nominPrincipale": "1",
      "infosQualite": {
        "codeQualite": "membre",
        "libQualite": "membre",
        "libQualiteSex": "membre"
      },
      "organesRefs": [
        "PO644420"
      ],
      "suppleant": {
        "dateDebut": "2016-03-20T01:00:00.000+01:00",
        "dateFin": "2017-06-20T02:00:00.000+02:00",
        "suppleantRef": "PA712017"
      },
      "election": {
        "lieu": {
          "region": "Hauts-de-France",
          "regionType": "Métropolitain",
          "departement": "Nord",
          "numDepartement": "59",
          "numCirco": "10"
        },
        "causeMandat": "élection partielle",
        "refCirconscription": "PO644706"
      },
      "mandature": {
        "datePriseFonction": "2016-03-21T01:00:00.000+01:00",
        "causeFin": "Fin de législature",
        "premiereElection": "0",
        "placeHemicycle": "130"
      }
    },
    {
      "xsiType": "MandatSimple_Type",
      "uid": "PM712031",
      "acteurRef": "PA712014",
      "legislature": "14",
      "typeOrgane": "GP",
      "dateDebut": "2016-03-21T01:00:00.000+01:00",
      "dateFin": "2017-06-20T02:00:00.000+02:00",
      "preseance": "20",
      "nominPrincipale": "1",
      "infosQualite": {
        "codeQualite": "Membre",
        "libQualite": "Membre du",
        "libQualiteSex": "Membre du"
      },
      "organesRefs": [
        "PO707869"
      ]
    },
    {
      "xsiType": "MandatSimple_Type",
      "uid": "PM712046",
      "acteurRef": "PA712014",
      "legislature": "14",
      "typeOrgane": "COMPER",
      "dateDebut": "2016-03-23T01:00:00.000+01:00",
      "datePublication": "2016-03-23T01:00:00.000+01:00",
      "dateFin": "2017-06-20T02:00:00.000+02:00",
      "preseance": "32",
      "nominPrincipale": "1",
      "infosQualite": {
        "codeQualite": "Membre",
        "libQualite": "Membre",
        "libQualiteSex": "Membre"
      },
      "organesRefs": [
        "PO419604"
      ]
    },
    {
      "xsiType": "MandatSimple_Type",
      "uid": "PM712126",
      "acteurRef": "PA712014",
      "legislature": "14",
      "typeOrgane": "GA",
      "dateDebut": "2016-03-24T01:00:00.000+01:00",
      "dateFin": "2017-06-20T02:00:00.000+02:00",
      "preseance": "20",
      "nominPrincipale": "1",
      "infosQualite": {
        "codeQualite": "Membre",
        "libQualite": "Membre",
        "libQualiteSex": "Membre"
      },
      "organesRefs": [
        "PO675841"
      ]
    },
    {
      "xsiType": "MandatSimple_Type",
      "uid": "PM712339",
      "acteurRef": "PA712014",
      "legislature": "14",
      "typeOrgane": "GE",
      "dateDebut": "2016-04-07T02:00:00.000+02:00",
      "dateFin": "2017-06-20T02:00:00.000+02:00",
      "preseance": "20",
      "nominPrincipale": "1",
      "infosQualite": {
        "codeQualite": "Membre",
        "libQualite": "Membre",
        "libQualiteSex": "Membre"
      },
      "organesRefs": [
        "PO712100"
      ]
    },
    {
      "xsiType": "MandatSimple_Type",
      "uid": "PM712765",
      "acteurRef": "PA712014",
      "legislature": "14",
      "typeOrgane": "GA",
      "dateDebut": "2016-05-11T02:00:00.000+02:00",
      "dateFin": "2017-06-20T02:00:00.000+02:00",
      "preseance": "20",
      "nominPrincipale": "1",
      "infosQualite": {
        "codeQualite": "Membre",
        "libQualite": "Membre",
        "libQualiteSex": "Membre"
      },
      "organesRefs": [
        "PO675854"
      ]
    },
    {
      "xsiType": "MandatSimple_Type",
      "uid": "PM713669",
      "acteurRef": "PA712014",
      "legislature": "14",
      "typeOrgane": "GE",
      "dateDebut": "2016-06-07T02:00:00.000+02:00",
      "dateFin": "2017-06-20T02:00:00.000+02:00",
      "preseance": "20",
      "nominPrincipale": "1",
      "infosQualite": {
        "codeQualite": "Membre",
        "libQualite": "Membre",
        "libQualiteSex": "Membre"
      },
      "organesRefs": [
        "PO686442"
      ]
    },
    {
      "xsiType": "MandatSimple_Type",
      "uid": "PM714789",
      "acteurRef": "PA712014",
      "legislature": "14",
      "typeOrgane": "GEVI",
      "dateDebut": "2016-09-21T02:00:00.000+02:00",
      "dateFin": "2017-06-20T02:00:00.000+02:00",
      "preseance": "20",
      "nominPrincipale": "1",
      "infosQualite": {
        "codeQualite": "Membre",
        "libQualite": "Membre",
        "libQualiteSex": "Membre"
      },
      "organesRefs": [
        "PO675743"
      ]
    },
    {
      "xsiType": "MandatSimple_Type",
      "uid": "PM715715",
      "acteurRef": "PA712014",
      "typeOrgane": "PARPOL",
      "dateDebut": "2016-12-01T01:00:00.000+01:00",
      "dateFin": "2017-06-20T02:00:00.000+02:00",
      "preseance": "5",
      "nominPrincipale": "1",
      "infosQualite": {
        "codeQualite": "Membre",
        "libQualite": "Membre",
        "libQualiteSex": "Membre"
      },
      "organesRefs": [
        "PO710396"
      ]
    },
    {
      "xsiType": "MandatParlementaire_type",
      "uid": "PM722984",
      "acteurRef": "PA712014",
      "legislature": "15",
      "typeOrgane": "ASSEMBLEE",
      "dateDebut": "2017-06-18T02:00:00.000+02:00",
      "preseance": "50",
      "nominPrincipale": "1",
      "infosQualite": {
        "codeQualite": "membre",
        "libQualite": "membre",
        "libQualiteSex": "membre"
      },
      "organesRefs": [
        "PO717460"
      ],
      "suppleant": {
        "dateDebut": "2017-06-18T02:00:00.000+02:00",
        "suppleantRef": "PA720508"
      },
      "election": {
        "lieu": {
          "region": "Hauts-de-France",
          "regionType": "Métropolitain",
          "departement": "Nord",
          "numDepartement": "59",
          "numCirco": "10"
        },
        "causeMandat": "élections générales",
        "refCirconscription": "PO718022"
      },
      "mandature": {
        "datePriseFonction": "2017-06-21T02:00:00.000+02:00",
        "premiereElection": "1",
        "placeHemicycle": "130"
      },
      "collaborateurs": [
        {
          "qualite": "M.",
          "prenom": "Khalidou",
          "nom": "Kebe"
        },
        {
          "qualite": "Mme",
          "prenom": "Olga",
          "nom": "Fernandes"
        },
        {
          "qualite": "Mme",
          "prenom": "Caroline",
          "nom": "Fel"
        }
      ]
    },
    {
      "xsiType": "MandatSimple_Type",
      "uid": "PM724533",
      "acteurRef": "PA712014",
      "legislature": "15",
      "typeOrgane": "GP",
      "dateDebut": "2017-06-21T02:00:00.000+02:00",
      "dateFin": "2017-06-26T02:00:00.000+02:00",
      "preseance": "28",
      "nominPrincipale": "1",
      "infosQualite": {
        "codeQualite": "Député non-inscrit",
        "libQualite": "Député non-inscrit",
        "libQualiteSex": "Député non-inscrit"
      },
      "organesRefs": [
        "PO723569"
      ]
    },
    {
      "xsiType": "MandatSimple_Type",
      "uid": "PM731456",
      "acteurRef": "PA712014",
      "legislature": "15",
      "typeOrgane": "GP",
      "dateDebut": "2017-06-27T02:00:00.000+02:00",
      "datePublication": "2017-06-28T02:00:00.000+02:00",
      "dateFin": "2017-11-28T01:00:00.000+01:00",
      "preseance": "20",
      "nominPrincipale": "1",
      "infosQualite": {
        "codeQualite": "Membre",
        "libQualite": "Membre du",
        "libQualiteSex": "Membre du"
      },
      "organesRefs": [
        "PO730952"
      ]
    },
    {
      "xsiType": "MandatSimple_Type",
      "uid": "PM731822",
      "acteurRef": "PA712014",
      "legislature": "15",
      "typeOrgane": "COMPER",
      "dateDebut": "2017-06-29T02:00:00.000+02:00",
      "datePublication": "2017-06-29T02:00:00.000+02:00",
      "dateFin": "2019-03-29T01:00:00.000+01:00",
      "preseance": "32",
      "nominPrincipale": "1",
      "infosQualite": {
        "codeQualite": "Membre",
        "libQualite": "Membre",
        "libQualiteSex": "Membre"
      },
      "organesRefs": [
        "PO59048"
      ]
    },
    {
      "xsiType": "MandatSimple_Type",
      "uid": "PM739795",
      "acteurRef": "PA712014",
      "legislature": "15",
      "typeOrgane": "GEVI",
      "dateDebut": "2017-10-12T02:00:00.000+02:00",
      "preseance": "20",
      "nominPrincipale": "0",
      "infosQualite": {
        "codeQualite": "Membre",
        "libQualite": "Membre",
        "libQualiteSex": "Membre"
      },
      "organesRefs": [
        "PO733217"
      ]
    },
    {
      "xsiType": "MandatSimple_Type",
      "uid": "PM739796",
      "acteurRef": "PA712014",
      "legislature": "15",
      "typeOrgane": "GA",
      "dateDebut": "2017-10-12T02:00:00.000+02:00",
      "preseance": "20",
      "nominPrincipale": "1",
      "infosQualite": {
        "codeQualite": "Membre",
        "libQualite": "Membre",
        "libQualiteSex": "Membre"
      },
      "organesRefs": [
        "PO732939"
      ]
    },
    {
      "xsiType": "MandatSimple_Type",
      "uid": "PM739797",
      "acteurRef": "PA712014",
      "legislature": "15",
      "typeOrgane": "GA",
      "dateDebut": "2017-10-12T02:00:00.000+02:00",
      "preseance": "20",
      "nominPrincipale": "0",
      "infosQualite": {
        "codeQualite": "Membre",
        "libQualite": "Membre",
        "libQualiteSex": "Membre"
      },
      "organesRefs": [
        "PO732964"
      ]
    },
    {
      "xsiType": "MandatSimple_Type",
      "uid": "PM739798",
      "acteurRef": "PA712014",
      "legislature": "15",
      "typeOrgane": "GA",
      "dateDebut": "2017-10-12T02:00:00.000+02:00",
      "preseance": "20",
      "nominPrincipale": "0",
      "infosQualite": {
        "codeQualite": "Membre",
        "libQualite": "Membre",
        "libQualiteSex": "Membre"
      },
      "organesRefs": [
        "PO733562"
      ]
    },
    {
      "xsiType": "MandatSimple_Type",
      "uid": "PM740561",
      "acteurRef": "PA712014",
      "legislature": "15",
      "typeOrgane": "GA",
      "dateDebut": "2017-10-18T02:00:00.000+02:00",
      "preseance": "8",
      "nominPrincipale": "1",
      "infosQualite": {
        "codeQualite": "Vice-Président",
        "libQualite": "Vice-Président",
        "libQualiteSex": "Vice-Président"
      },
      "organesRefs": [
        "PO733562"
      ]
    },
    {
      "xsiType": "MandatSimple_Type",
      "uid": "PM742113",
      "acteurRef": "PA712014",
      "legislature": "15",
      "typeOrgane": "API",
      "dateDebut": "2017-10-27T02:00:00.000+02:00",
      "datePublication": "2017-10-28T02:00:00.000+02:00",
      "preseance": "20",
      "nominPrincipale": "0",
      "infosQualite": {
        "codeQualite": "Membre",
        "libQualite": "Membre",
        "libQualiteSex": "Membre"
      },
      "organesRefs": [
        "PO201115"
      ]
    },
    {
      "xsiType": "MandatSimple_Type",
      "uid": "PM742628",
      "acteurRef": "PA712014",
      "legislature": "15",
      "typeOrgane": "GEVI",
      "dateDebut": "2017-11-08T01:00:00.000+01:00",
      "preseance": "8",
      "nominPrincipale": "1",
      "infosQualite": {
        "codeQualite": "Vice-Président",
        "libQualite": "Vice-Président",
        "libQualiteSex": "Vice-Président"
      },
      "organesRefs": [
        "PO733217"
      ]
    },
    {
      "xsiType": "MandatSimple_Type",
      "uid": "PM744444",
      "acteurRef": "PA712014",
      "legislature": "15",
      "typeOrgane": "GP",
      "dateDebut": "2017-11-29T01:00:00.000+01:00",
      "dateFin": "2019-06-10T02:00:00.000+02:00",
      "preseance": "20",
      "nominPrincipale": "1",
      "infosQualite": {
        "codeQualite": "Membre",
        "libQualite": "Membre du",
        "libQualiteSex": "Membre du"
      },
      "organesRefs": [
        "PO744425"
      ]
    },
    {
      "xsiType": "MandatSimple_Type",
      "uid": "PM744475",
      "acteurRef": "PA712014",
      "legislature": "15",
      "typeOrgane": "GA",
      "dateDebut": "2017-11-14T01:00:00.000+01:00",
      "preseance": "8",
      "nominPrincipale": "1",
      "infosQualite": {
        "codeQualite": "Vice-Président",
        "libQualite": "Vice-Président",
        "libQualiteSex": "Vice-Président"
      },
      "organesRefs": [
        "PO732964"
      ]
    },
    {
      "xsiType": "MandatSimple_Type",
      "uid": "PM744760",
      "acteurRef": "PA712014",
      "legislature": "15",
      "typeOrgane": "CNPS",
      "dateDebut": "2017-12-06T01:00:00.000+01:00",
      "datePublication": "2017-12-06T01:00:00.000+01:00",
      "dateFin": "2018-07-31T02:00:00.000+02:00",
      "preseance": "20",
      "nominPrincipale": "1",
      "infosQualite": {
        "codeQualite": "Membre",
        "libQualite": "Membre",
        "libQualiteSex": "Membre"
      },
      "organesRefs": [
        "PO744107"
      ]
    },
    {
      "xsiType": "MandatSimple_Type",
      "uid": "PM746035",
      "acteurRef": "PA712014",
      "typeOrgane": "PARPOL",
      "dateDebut": "2017-12-01T01:00:00.000+01:00",
      "preseance": "5",
      "nominPrincipale": "1",
      "infosQualite": {
        "codeQualite": "Membre",
        "libQualite": "Membre",
        "libQualiteSex": "Membre"
      },
      "organesRefs": [
        "PO744864"
      ]
    },
    {
      "xsiType": "MandatSimple_Type",
      "uid": "PM748766",
      "acteurRef": "PA712014",
      "legislature": "15",
      "typeOrgane": "GE",
      "dateDebut": "2018-02-01T01:00:00.000+01:00",
      "preseance": "20",
      "nominPrincipale": "0",
      "infosQualite": {
        "codeQualite": "Membre",
        "libQualite": "Membre",
        "libQualiteSex": "Membre"
      },
      "organesRefs": [
        "PO746791"
      ]
    },
    {
      "xsiType": "MandatSimple_Type",
      "uid": "PM748767",
      "acteurRef": "PA712014",
      "legislature": "15",
      "typeOrgane": "GE",
      "dateDebut": "2018-02-01T01:00:00.000+01:00",
      "preseance": "4",
      "nominPrincipale": "1",
      "infosQualite": {
        "codeQualite": "Co-Président",
        "libQualite": "Co-Président",
        "libQualiteSex": "Co-Président"
      },
      "organesRefs": [
        "PO746791"
      ]
    },
    {
      "xsiType": "MandatSimple_Type",
      "uid": "PM759010",
      "acteurRef": "PA712014",
      "legislature": "15",
      "typeOrgane": "API",
      "dateDebut": "2018-09-01T02:00:00.000+02:00",
      "preseance": "19",
      "nominPrincipale": "1",
      "infosQualite": {
        "codeQualite": "Autre membre du Bureau",
        "libQualite": "Membre du Bureau",
        "libQualiteSex": "Membre du Bureau"
      },
      "organesRefs": [
        "PO201115"
      ]
    },
    {
      "xsiType": "MandatMission_Type",
      "uid": "PM762441",
      "acteurRef": "PA712014",
      "legislature": "15",
      "typeOrgane": "MISINFO",
      "dateDebut": "2019-01-23T01:00:00.000+01:00",
      "preseance": "10",
      "nominPrincipale": "1",
      "infosQualite": {
        "codeQualite": "Membre",
        "libQualite": "Membre",
        "libQualiteSex": "Membre"
      },
      "organesRefs": [
        "PO762170"
      ]
    },
    {
      "xsiType": "MandatMission_Type",
      "uid": "PM762967",
      "acteurRef": "PA712014",
      "legislature": "15",
      "typeOrgane": "MINISTERE",
      "dateDebut": "2019-02-25T01:00:00.000+01:00",
      "datePublication": "2019-02-26T01:00:00.000+01:00",
      "dateFin": "2019-08-25T02:00:00.000+02:00",
      "preseance": "1",
      "nominPrincipale": "1",
      "infosQualite": {
        "codeQualite": "en mission",
        "libQualite": "en mission",
        "libQualiteSex": "en mission"
      },
      "organesRefs": [
        "PO729976"
      ],
      "libelle": "La contribution des acteurs territoriaux à la priorité africaine de la diplomatie française"
    },
    {
      "xsiType": "MandatSimple_Type",
      "uid": "PM764346",
      "acteurRef": "PA712014",
      "legislature": "15",
      "typeOrgane": "COMPER",
      "dateDebut": "2019-03-30T01:00:00.000+01:00",
      "datePublication": "2019-03-30T01:00:00.000+01:00",
      "dateFin": "2019-04-04T02:00:00.000+02:00",
      "preseance": "32",
      "nominPrincipale": "1",
      "infosQualite": {
        "codeQualite": "Membre",
        "libQualite": "Membre",
        "libQualiteSex": "Membre"
      },
      "organesRefs": [
        "PO419604"
      ]
    },
    {
      "xsiType": "MandatSimple_Type",
      "uid": "PM764463",
      "acteurRef": "PA712014",
      "legislature": "15",
      "typeOrgane": "COMPER",
      "dateDebut": "2019-04-05T02:00:00.000+02:00",
      "datePublication": "2019-04-05T02:00:00.000+02:00",
      "preseance": "32",
      "nominPrincipale": "1",
      "infosQualite": {
        "codeQualite": "Membre",
        "libQualite": "Membre",
        "libQualiteSex": "Membre"
      },
      "organesRefs": [
        "PO59048"
      ]
    },
    {
      "xsiType": "MandatSimple_Type",
      "uid": "PM765647",
      "acteurRef": "PA712014",
      "legislature": "15",
      "typeOrgane": "GP",
      "dateDebut": "2019-06-11T02:00:00.000+02:00",
      "dateFin": "2019-09-27T02:00:00.000+02:00",
      "preseance": "20",
      "nominPrincipale": "1",
      "infosQualite": {
        "codeQualite": "Membre",
        "libQualite": "Membre du",
        "libQualiteSex": "Membre du"
      },
      "organesRefs": [
        "PO765636"
      ]
    },
    {
      "xsiType": "MandatSimple_Type",
      "uid": "PM767229",
      "acteurRef": "PA712014",
      "legislature": "15",
      "typeOrgane": "GP",
      "dateDebut": "2019-09-28T02:00:00.000+02:00",
      "datePublication": "2019-09-27T02:00:00.000+02:00",
      "preseance": "20",
      "nominPrincipale": "1",
      "infosQualite": {
        "codeQualite": "Membre",
        "libQualite": "Membre du",
        "libQualiteSex": "Membre du"
      },
      "organesRefs": [
        "PO767217"
      ]
    }
  ]
}