{
  "xsiType": "OrganeExtraParlementaire_type",
  "uid": "PO419451",
  "codeType": "ORGEXTPARL",
  "libelle": "Conseil d'administration de la Société en charge de l'audiovisuel extérieur de la France",
  "libelleEdition": "du conseil d'administration de la Société en charge de l'audiovisuel extérieur de la France",
  "libelleAbrege": "Audiovisuel extérieur",
  "libelleAbrev": "250",
  "viMoDe": {
    "dateDebut": "2009-03-05T01:00:00.000+01:00"
  },
  "regime": "5ème République",
  "regimeJuridique": "Article 47-3  de la loi n° 86-1067 du 30 septembre 1986"
}