{
  "uid": "PA336175",
  "etatCivil": {
    "ident": {
      "civ": "Mme",
      "prenom": "Sylvia",
      "nom": "Pinel",
      "alpha": "Pinel",
      "trigramme": "SPI"
    },
    "infoNaissance": {
      "dateNais": "1977-09-28T01:00:00.000+01:00",
      "villeNais": "L'Union",
      "depNais": "Haute-Garonne",
      "paysNais": "France"
    }
  },
  "profession": {
    "socProcInsee": {
      "catSocPro": "Sans profession déclarée",
      "famSocPro": "Sans profession déclarée"
    }
  },
  "uriHatvp": "https://www.hatvp.fr/pages_nominatives/pinel-sylvia",
  "adresses": [
    {
      "xsiType": "AdressePostale_Type",
      "uid": "AD387042",
      "type": "0",
      "typeLibelle": "Adresse officielle",
      "poids": "1",
      "intitule": "Assemblée nationale,",
      "numeroRue": "126",
      "nomRue": "Rue de l'Université,",
      "codePostal": "75355",
      "ville": "Paris 07 SP"
    },
    {
      "xsiType": "AdressePostale_Type",
      "uid": "AD394923",
      "type": "2",
      "typeLibelle": "Adresse publiée de circonscription",
      "poids": "22",
      "intitule": "Permanence Parlementaire,",
      "numeroRue": "27",
      "nomRue": "Rue Paul Descazeaux",
      "codePostal": "82100",
      "ville": "Castelsarrasin"
    },
    {
      "xsiType": "AdresseTelephonique_Type",
      "uid": "AD395012",
      "type": "11",
      "typeLibelle": "Téléphone",
      "poids": "22",
      "adresseDeRattachement": "AD394923",
      "valElec": "05 63 32 58 81"
    },
    {
      "xsiType": "AdresseMail_Type",
      "uid": "AD716075",
      "type": "15",
      "typeLibelle": "Mèl",
      "valElec": "sylvia.pinel@assemblee-nationale.fr"
    },
    {
      "xsiType": "AdresseSiteWeb_Type",
      "uid": "AD726134",
      "type": "24",
      "typeLibelle": "Twitter",
      "valElec": "@SylviaPinel"
    },
    {
      "xsiType": "AdresseMail_Type",
      "uid": "AD726156",
      "type": "15",
      "typeLibelle": "Mèl",
      "valElec": "permanencesylviapinel@orange.fr"
    },
    {
      "xsiType": "AdresseSiteWeb_Type",
      "uid": "AD726336",
      "type": "25",
      "typeLibelle": "Facebook",
      "valElec": "sylvia.pinel"
    }
  ],
  "mandats": [
    {
      "xsiType": "MandatParlementaire_type",
      "uid": "PM711812",
      "acteurRef": "PA336175",
      "legislature": "14",
      "typeOrgane": "ASSEMBLEE",
      "dateDebut": "2012-06-20T02:00:00.000+02:00",
      "dateFin": "2017-06-20T02:00:00.000+02:00",
      "preseance": "50",
      "nominPrincipale": "1",
      "infosQualite": {
        "codeQualite": "membre",
        "libQualite": "membre",
        "libQualiteSex": "membre"
      },
      "organesRefs": [
        "PO644420"
      ],
      "suppleant": {
        "dateDebut": "2012-06-20T02:00:00.000+02:00",
        "dateFin": "2017-06-20T02:00:00.000+02:00",
        "suppleantRef": "PA346170"
      },
      "election": {
        "lieu": {
          "region": "Occitanie",
          "regionType": "Métropolitain",
          "departement": "Tarn-et-Garonne",
          "numDepartement": "82",
          "numCirco": "2"
        },
        "causeMandat": "reprise de l'exercice du mandat d'un ancien membre du Gouvernement",
        "refCirconscription": "PO644885"
      },
      "mandature": {
        "datePriseFonction": "2016-03-12T01:00:00.000+01:00",
        "causeFin": "Fin de législature",
        "premiereElection": "1",
        "placeHemicycle": "192",
        "mandatRemplaceRef": "PM645264"
      }
    },
    {
      "xsiType": "MandatSimple_Type",
      "uid": "PM711836",
      "acteurRef": "PA336175",
      "legislature": "14",
      "typeOrgane": "GP",
      "dateDebut": "2016-03-12T01:00:00.000+01:00",
      "datePublication": "2016-03-13T01:00:00.000+01:00",
      "dateFin": "2017-06-20T02:00:00.000+02:00",
      "preseance": "20",
      "nominPrincipale": "1",
      "infosQualite": {
        "codeQualite": "Membre",
        "libQualite": "Membre du",
        "libQualiteSex": "Membre du"
      },
      "organesRefs": [
        "PO656022"
      ]
    },
    {
      "xsiType": "MandatSimple_Type",
      "uid": "PM711886",
      "acteurRef": "PA336175",
      "legislature": "14",
      "typeOrgane": "COMPER",
      "dateDebut": "2016-03-15T01:00:00.000+01:00",
      "datePublication": "2016-03-15T01:00:00.000+01:00",
      "dateFin": "2017-06-20T02:00:00.000+02:00",
      "preseance": "32",
      "nominPrincipale": "1",
      "infosQualite": {
        "codeQualite": "Membre",
        "libQualite": "Membre",
        "libQualiteSex": "Membre"
      },
      "organesRefs": [
        "PO59046"
      ]
    },
    {
      "xsiType": "MandatSimple_Type",
      "uid": "PM715727",
      "acteurRef": "PA336175",
      "typeOrgane": "PARPOL",
      "dateDebut": "2016-12-01T01:00:00.000+01:00",
      "dateFin": "2017-06-20T02:00:00.000+02:00",
      "preseance": "5",
      "nominPrincipale": "1",
      "infosQualite": {
        "codeQualite": "Membre",
        "libQualite": "Membre",
        "libQualiteSex": "Membre"
      },
      "organesRefs": [
        "PO684934"
      ]
    },
    {
      "xsiType": "MandatParlementaire_type",
      "uid": "PM723328",
      "acteurRef": "PA336175",
      "legislature": "15",
      "typeOrgane": "ASSEMBLEE",
      "dateDebut": "2017-06-18T02:00:00.000+02:00",
      "preseance": "50",
      "nominPrincipale": "1",
      "infosQualite": {
        "codeQualite": "membre",
        "libQualite": "membre",
        "libQualiteSex": "membre"
      },
      "organesRefs": [
        "PO717460"
      ],
      "suppleant": {
        "dateDebut": "2017-06-18T02:00:00.000+02:00",
        "suppleantRef": "PA721596"
      },
      "election": {
        "lieu": {
          "region": "Occitanie",
          "regionType": "Métropolitain",
          "departement": "Tarn-et-Garonne",
          "numDepartement": "82",
          "numCirco": "2"
        },
        "causeMandat": "élections générales",
        "refCirconscription": "PO718344"
      },
      "mandature": {
        "datePriseFonction": "2017-06-21T02:00:00.000+02:00",
        "premiereElection": "1",
        "placeHemicycle": "192"
      },
      "collaborateurs": [
        {
          "qualite": "Mme",
          "prenom": "Lucie",
          "nom": "Fournel"
        },
        {
          "qualite": "Mme",
          "prenom": "Marie",
          "nom": "Castro"
        },
        {
          "qualite": "Mme",
          "prenom": "Judith",
          "nom": "Martin"
        }
      ]
    },
    {
      "xsiType": "MandatSimple_Type",
      "uid": "PM724705",
      "acteurRef": "PA336175",
      "legislature": "15",
      "typeOrgane": "GP",
      "dateDebut": "2017-06-21T02:00:00.000+02:00",
      "dateFin": "2017-06-26T02:00:00.000+02:00",
      "preseance": "28",
      "nominPrincipale": "1",
      "infosQualite": {
        "codeQualite": "Député non-inscrit",
        "libQualite": "Député non-inscrit",
        "libQualiteSex": "Députée non-inscrite"
      },
      "organesRefs": [
        "PO723569"
      ]
    },
    {
      "xsiType": "MandatSimple_Type",
      "uid": "PM731564",
      "acteurRef": "PA336175",
      "legislature": "15",
      "typeOrgane": "GP",
      "dateDebut": "2017-06-27T02:00:00.000+02:00",
      "dateFin": "2018-10-17T02:00:00.000+02:00",
      "preseance": "28",
      "nominPrincipale": "1",
      "infosQualite": {
        "codeQualite": "Député non-inscrit",
        "libQualite": "Député non-inscrit",
        "libQualiteSex": "Députée non-inscrite"
      },
      "organesRefs": [
        "PO723569"
      ]
    },
    {
      "xsiType": "MandatSimple_Type",
      "uid": "PM731621",
      "acteurRef": "PA336175",
      "legislature": "15",
      "typeOrgane": "COMPER",
      "dateDebut": "2017-06-29T02:00:00.000+02:00",
      "datePublication": "2017-06-29T02:00:00.000+02:00",
      "dateFin": "2019-09-30T02:00:00.000+02:00",
      "preseance": "32",
      "nominPrincipale": "1",
      "infosQualite": {
        "codeQualite": "Membre",
        "libQualite": "Membre",
        "libQualiteSex": "Membre"
      },
      "organesRefs": [
        "PO59048"
      ]
    },
    {
      "xsiType": "MandatSimple_Type",
      "uid": "PM745913",
      "acteurRef": "PA336175",
      "typeOrgane": "PARPOL",
      "dateDebut": "2017-12-01T01:00:00.000+01:00",
      "preseance": "5",
      "nominPrincipale": "1",
      "infosQualite": {
        "codeQualite": "Membre",
        "libQualite": "Membre",
        "libQualiteSex": "Membre"
      },
      "organesRefs": [
        "PO684934"
      ]
    },
    {
      "xsiType": "MandatSimple_Type",
      "uid": "PM750827",
      "acteurRef": "PA336175",
      "legislature": "15",
      "typeOrgane": "GE",
      "dateDebut": "2018-02-16T01:00:00.000+01:00",
      "preseance": "20",
      "nominPrincipale": "1",
      "infosQualite": {
        "codeQualite": "Membre",
        "libQualite": "Membre",
        "libQualiteSex": "Membre"
      },
      "organesRefs": [
        "PO746816"
      ]
    },
    {
      "xsiType": "MandatSimple_Type",
      "uid": "PM751689",
      "acteurRef": "PA336175",
      "legislature": "15",
      "typeOrgane": "GE",
      "dateDebut": "2018-02-22T01:00:00.000+01:00",
      "preseance": "20",
      "nominPrincipale": "1",
      "infosQualite": {
        "codeQualite": "Membre",
        "libQualite": "Membre",
        "libQualiteSex": "Membre"
      },
      "organesRefs": [
        "PO746669"
      ]
    },
    {
      "xsiType": "MandatSimple_Type",
      "uid": "PM751972",
      "acteurRef": "PA336175",
      "legislature": "15",
      "typeOrgane": "GE",
      "dateDebut": "2018-02-23T01:00:00.000+01:00",
      "preseance": "20",
      "nominPrincipale": "1",
      "infosQualite": {
        "codeQualite": "Membre",
        "libQualite": "Membre",
        "libQualiteSex": "Membre"
      },
      "organesRefs": [
        "PO746925"
      ]
    },
    {
      "xsiType": "MandatSimple_Type",
      "uid": "PM752135",
      "acteurRef": "PA336175",
      "legislature": "15",
      "typeOrgane": "GE",
      "dateDebut": "2018-02-27T01:00:00.000+01:00",
      "preseance": "20",
      "nominPrincipale": "1",
      "infosQualite": {
        "codeQualite": "Membre",
        "libQualite": "Membre",
        "libQualiteSex": "Membre"
      },
      "organesRefs": [
        "PO747251"
      ]
    },
    {
      "xsiType": "MandatSimple_Type",
      "uid": "PM752304",
      "acteurRef": "PA336175",
      "legislature": "15",
      "typeOrgane": "GE",
      "dateDebut": "2018-02-20T01:00:00.000+01:00",
      "preseance": "20",
      "nominPrincipale": "1",
      "infosQualite": {
        "codeQualite": "Membre",
        "libQualite": "Membre",
        "libQualiteSex": "Membre"
      },
      "organesRefs": [
        "PO746910"
      ]
    },
    {
      "xsiType": "MandatSimple_Type",
      "uid": "PM752673",
      "acteurRef": "PA336175",
      "legislature": "15",
      "typeOrgane": "GE",
      "dateDebut": "2018-03-06T01:00:00.000+01:00",
      "preseance": "20",
      "nominPrincipale": "1",
      "infosQualite": {
        "codeQualite": "Membre",
        "libQualite": "Membre",
        "libQualiteSex": "Membre"
      },
      "organesRefs": [
        "PO746885"
      ]
    },
    {
      "xsiType": "MandatSimple_Type",
      "uid": "PM755313",
      "acteurRef": "PA336175",
      "legislature": "15",
      "typeOrgane": "GE",
      "dateDebut": "2018-04-10T02:00:00.000+02:00",
      "preseance": "20",
      "nominPrincipale": "1",
      "infosQualite": {
        "codeQualite": "Membre",
        "libQualite": "Membre",
        "libQualiteSex": "Membre"
      },
      "organesRefs": [
        "PO747276"
      ]
    },
    {
      "xsiType": "MandatSimple_Type",
      "uid": "PM759915",
      "acteurRef": "PA336175",
      "legislature": "15",
      "typeOrgane": "GP",
      "dateDebut": "2018-10-18T02:00:00.000+02:00",
      "datePublication": "2018-10-18T02:00:00.000+02:00",
      "preseance": "20",
      "nominPrincipale": "1",
      "infosQualite": {
        "codeQualite": "Membre",
        "libQualite": "Membre du",
        "libQualiteSex": "Membre du"
      },
      "organesRefs": [
        "PO759900"
      ]
    },
    {
      "xsiType": "MandatSimple_Type",
      "uid": "PM764269",
      "acteurRef": "PA336175",
      "legislature": "15",
      "typeOrgane": "GE",
      "dateDebut": "2019-03-27T01:00:00.000+01:00",
      "preseance": "20",
      "nominPrincipale": "1",
      "infosQualite": {
        "codeQualite": "Membre",
        "libQualite": "Membre",
        "libQualiteSex": "Membre"
      },
      "organesRefs": [
        "PO747027"
      ]
    },
    {
      "xsiType": "MandatSimple_Type",
      "uid": "PM766784",
      "acteurRef": "PA336175",
      "legislature": "15",
      "typeOrgane": "CNPS",
      "dateDebut": "2019-07-24T02:00:00.000+02:00",
      "datePublication": "2019-07-25T02:00:00.000+02:00",
      "preseance": "20",
      "nominPrincipale": "1",
      "infosQualite": {
        "codeQualite": "Membre",
        "libQualite": "Membre",
        "libQualiteSex": "Membre"
      },
      "organesRefs": [
        "PO766718"
      ]
    },
    {
      "xsiType": "MandatSimple_Type",
      "uid": "PM767282",
      "acteurRef": "PA336175",
      "legislature": "15",
      "typeOrgane": "COMPER",
      "dateDebut": "2019-10-01T02:00:00.000+02:00",
      "datePublication": "2019-10-01T02:00:00.000+02:00",
      "preseance": "32",
      "nominPrincipale": "1",
      "infosQualite": {
        "codeQualite": "Membre",
        "libQualite": "Membre",
        "libQualiteSex": "Membre"
      },
      "organesRefs": [
        "PO419610"
      ]
    }
  ]
}