{
  "uid": "PA304085",
  "etatCivil": {
    "ident": {
      "civ": "M.",
      "prenom": "Christian",
      "nom": "Cambon",
      "alpha": "CAMBON CHRISTIAN"
    },
    "infoNaissance": {
      "dateNais": "1948-03-08T01:00:00.000+01:00"
    }
  },
  "profession": {
    "socProcInsee": {}
  },
  "adresses": [
    {
      "xsiType": "AdresseSiteWeb_Type",
      "uid": "AD317046",
      "type": "23",
      "typeLibelle": "Url sénateur",
      "valElec": "https://www.senat.fr/senateur/cambon_christian04042c.html"
    }
  ],
  "mandats": [
    {
      "xsiType": "MandatSimple_Type",
      "uid": "PM304303",
      "acteurRef": "PA304085",
      "typeOrgane": "GROUPESENAT",
      "dateDebut": "2004-10-05T02:00:00.000+02:00",
      "datePublication": "2004-10-07T02:00:00.000+02:00",
      "preseance": "4",
      "nominPrincipale": "1",
      "infosQualite": {
        "codeQualite": "Membre",
        "libQualite": "Membre",
        "libQualiteSex": "Membre"
      },
      "organesRefs": [
        "PO286005"
      ]
    },
    {
      "xsiType": "MandatParlementaire_type",
      "uid": "PM430058",
      "acteurRef": "PA304085",
      "typeOrgane": "SENAT",
      "dateDebut": "2011-10-01T02:00:00.000+02:00",
      "dateFin": "2017-10-01T02:00:00.000+02:00",
      "preseance": "20",
      "nominPrincipale": "1",
      "infosQualite": {
        "codeQualite": "Sénateur",
        "libQualite": "SENATEUR",
        "libQualiteSex": "SENATEUR"
      },
      "organesRefs": [
        "PO78718"
      ],
      "election": {
        "lieu": {
          "numDepartement": "94"
        }
      },
      "mandature": {
        "premiereElection": "0"
      }
    },
    {
      "xsiType": "MandatSimple_Type",
      "uid": "PM517977",
      "acteurRef": "PA304085",
      "typeOrgane": "API",
      "dateDebut": "2012-01-31T01:00:00.000+01:00",
      "dateFin": "2017-10-01T02:00:00.000+02:00",
      "preseance": "20",
      "nominPrincipale": "1",
      "infosQualite": {
        "codeQualite": "Membre",
        "libQualite": "Membre",
        "libQualiteSex": "Membre"
      },
      "organesRefs": [
        "PO206064"
      ]
    },
    {
      "xsiType": "MandatSimple_Type",
      "uid": "PM679753",
      "acteurRef": "PA304085",
      "typeOrgane": "API",
      "dateDebut": "2012-10-11T02:00:00.000+02:00",
      "dateFin": "2017-10-01T02:00:00.000+02:00",
      "preseance": "20",
      "nominPrincipale": "1",
      "infosQualite": {
        "codeQualite": "Membre",
        "libQualite": "Membre",
        "libQualiteSex": "Membre"
      },
      "organesRefs": [
        "PO201115"
      ]
    },
    {
      "xsiType": "MandatParlementaire_type",
      "uid": "PM703933",
      "acteurRef": "PA304085",
      "typeOrgane": "SENAT",
      "dateDebut": "2014-10-08T02:00:00.000+02:00",
      "dateFin": "2017-07-12T02:00:00.000+02:00",
      "nominPrincipale": "1",
      "infosQualite": {
        "libQualite": "Secrétaire",
        "libQualiteSex": "Secrétaire"
      },
      "organesRefs": [
        "PO78718"
      ],
      "election": {
        "lieu": {}
      },
      "mandature": {
        "premiereElection": "0"
      }
    },
    {
      "xsiType": "MandatSimple_Type",
      "uid": "PM704249",
      "acteurRef": "PA304085",
      "typeOrgane": "COMSENAT",
      "dateDebut": "2014-10-09T02:00:00.000+02:00",
      "dateFin": "2017-07-11T02:00:00.000+02:00",
      "nominPrincipale": "1",
      "infosQualite": {
        "libQualite": "Vice-Président",
        "libQualiteSex": "Vice-Président"
      },
      "organesRefs": [
        "PO211491"
      ]
    },
    {
      "xsiType": "MandatSimple_Type",
      "uid": "PM732810",
      "acteurRef": "PA304085",
      "typeOrgane": "COMSENAT",
      "dateDebut": "2017-07-12T02:00:00.000+02:00",
      "dateFin": "2017-10-04T02:00:00.000+02:00",
      "nominPrincipale": "1",
      "infosQualite": {
        "libQualite": "Président",
        "libQualiteSex": "Président"
      },
      "organesRefs": [
        "PO211491"
      ]
    },
    {
      "xsiType": "MandatSimple_Type",
      "uid": "PM733739",
      "acteurRef": "PA304085",
      "typeOrgane": "DELEGSENAT",
      "dateDebut": "2017-07-12T02:00:00.000+02:00",
      "dateFin": "2019-05-16T02:00:00.000+02:00",
      "preseance": "4",
      "nominPrincipale": "1",
      "infosQualite": {
        "codeQualite": "Membre",
        "libQualite": "Membre",
        "libQualiteSex": "Membre"
      },
      "organesRefs": [
        "PO405191"
      ]
    },
    {
      "xsiType": "MandatAvecSuppleant_Type",
      "uid": "PM733847",
      "acteurRef": "PA304085",
      "typeOrgane": "OFFPAR",
      "dateDebut": "2017-07-13T02:00:00.000+02:00",
      "datePublication": "2017-07-26T02:00:00.000+02:00",
      "dateFin": "2017-10-01T02:00:00.000+02:00",
      "preseance": "16",
      "nominPrincipale": "1",
      "infosQualite": {
        "codeQualite": "Membre de droit (Président de la commission des affaires étrangères)",
        "libQualite": "Membre de droit (Président de la commission des affaires étrangères et de la défense)",
        "libQualiteSex": "Membre de droit (Président de la commission des affaires étrangères et de la défense)"
      },
      "organesRefs": [
        "PO402232"
      ]
    },
    {
      "xsiType": "MandatParlementaire_type",
      "uid": "PM736343",
      "acteurRef": "PA304085",
      "typeOrgane": "SENAT",
      "dateDebut": "2017-10-02T02:00:00.000+02:00",
      "preseance": "20",
      "nominPrincipale": "1",
      "infosQualite": {
        "codeQualite": "Sénateur",
        "libQualite": "SENATEUR",
        "libQualiteSex": "SENATEUR"
      },
      "organesRefs": [
        "PO78718"
      ],
      "election": {
        "lieu": {
          "numDepartement": "94"
        }
      },
      "mandature": {
        "premiereElection": "0"
      }
    },
    {
      "xsiType": "MandatAvecSuppleant_Type",
      "uid": "PM740265",
      "acteurRef": "PA304085",
      "typeOrgane": "OFFPAR",
      "dateDebut": "2017-10-12T02:00:00.000+02:00",
      "datePublication": "2017-10-12T02:00:00.000+02:00",
      "preseance": "16",
      "nominPrincipale": "0",
      "infosQualite": {
        "codeQualite": "Membre de droit (Président de la commission des affaires étrangères)",
        "libQualite": "Membre de droit (Président de la commission des affaires étrangères et de la défense)",
        "libQualiteSex": "Membre de droit (Président de la commission des affaires étrangères et de la défense)"
      },
      "organesRefs": [
        "PO402232"
      ]
    },
    {
      "xsiType": "MandatSimple_Type",
      "uid": "PM741330",
      "acteurRef": "PA304085",
      "typeOrgane": "COMSENAT",
      "dateDebut": "2017-10-05T02:00:00.000+02:00",
      "nominPrincipale": "1",
      "infosQualite": {
        "libQualite": "Président",
        "libQualiteSex": "Président"
      },
      "organesRefs": [
        "PO211491"
      ]
    },
    {
      "xsiType": "MandatSimple_Type",
      "uid": "PM743259",
      "acteurRef": "PA304085",
      "typeOrgane": "API",
      "dateDebut": "2017-11-08T01:00:00.000+01:00",
      "preseance": "20",
      "nominPrincipale": "1",
      "infosQualite": {
        "codeQualite": "Titulaire",
        "libQualite": "Membre titulaire",
        "libQualiteSex": "Membre titulaire"
      },
      "organesRefs": [
        "PO58974"
      ]
    },
    {
      "xsiType": "MandatSimple_Type",
      "uid": "PM748156",
      "acteurRef": "PA304085",
      "typeOrgane": "API",
      "dateDebut": "2018-01-26T01:00:00.000+01:00",
      "preseance": "20",
      "nominPrincipale": "1",
      "infosQualite": {
        "codeQualite": "Membre",
        "libQualite": "Membre",
        "libQualiteSex": "Membre"
      },
      "organesRefs": [
        "PO201115"
      ]
    },
    {
      "xsiType": "MandatAvecSuppleant_Type",
      "uid": "PM755405",
      "acteurRef": "PA304085",
      "typeOrgane": "OFFPAR",
      "dateDebut": "2018-04-13T02:00:00.000+02:00",
      "datePublication": "2018-04-13T02:00:00.000+02:00",
      "dateFin": "2019-05-16T02:00:00.000+02:00",
      "preseance": "6",
      "nominPrincipale": "1",
      "infosQualite": {
        "codeQualite": "Premier vice-président",
        "libQualite": "Premier vice-président",
        "libQualiteSex": "Premier vice-président"
      },
      "organesRefs": [
        "PO402232"
      ]
    },
    {
      "xsiType": "MandatSimple_Type",
      "uid": "PM756882",
      "acteurRef": "PA304085",
      "typeOrgane": "CMP",
      "dateDebut": "2018-06-12T02:00:00.000+02:00",
      "datePublication": "2018-06-13T02:00:00.000+02:00",
      "dateFin": "2018-06-28T02:00:00.000+02:00",
      "preseance": "20",
      "nominPrincipale": "1",
      "infosQualite": {
        "codeQualite": "Titulaire",
        "libQualite": "Membre titulaire",
        "libQualiteSex": "Membre titulaire"
      },
      "organesRefs": [
        "PO756661"
      ]
    },
    {
      "xsiType": "MandatSimple_Type",
      "uid": "PM757149",
      "acteurRef": "PA304085",
      "typeOrgane": "CMP",
      "dateDebut": "2018-06-19T02:00:00.000+02:00",
      "datePublication": "2018-06-20T02:00:00.000+02:00",
      "dateFin": "2018-06-28T02:00:00.000+02:00",
      "preseance": "16",
      "nominPrincipale": "1",
      "infosQualite": {
        "codeQualite": "Rapporteur",
        "libQualite": "Rapporteur",
        "libQualiteSex": "Rapporteur"
      },
      "organesRefs": [
        "PO756661"
      ]
    },
    {
      "xsiType": "MandatAvecSuppleant_Type",
      "uid": "PM765119",
      "acteurRef": "PA304085",
      "typeOrgane": "OFFPAR",
      "dateDebut": "2019-05-17T02:00:00.000+02:00",
      "datePublication": "2019-05-17T02:00:00.000+02:00",
      "preseance": "4",
      "nominPrincipale": "1",
      "infosQualite": {
        "codeQualite": "Président",
        "libQualite": "Président",
        "libQualiteSex": "Président"
      },
      "organesRefs": [
        "PO402232"
      ]
    },
    {
      "xsiType": "MandatSimple_Type",
      "uid": "PM765295",
      "acteurRef": "PA304085",
      "typeOrgane": "DELEGSENAT",
      "dateDebut": "2019-05-17T02:00:00.000+02:00",
      "nominPrincipale": "1",
      "infosQualite": {
        "libQualite": "Président",
        "libQualiteSex": "Président"
      },
      "organesRefs": [
        "PO405191"
      ]
    }
  ]
}