{
  "xsiType": "OrganeExtraParlementaire_type",
  "uid": "PO60291",
  "codeType": "ORGEXTPARL",
  "libelle": "Commission nationale du débat public",
  "libelleEdition": "de la Commission nationale du débat public",
  "libelleAbrege": "Débat public",
  "libelleAbrev": "152",
  "viMoDe": {
    "dateDebut": "1996-05-11T02:00:00.000+02:00"
  },
  "regime": "5ème République",
  "regimeJuridique": "Article L. 121-3 du code de l'environnement",
  "siteInternet": "https://www.debatpublic.fr/sa-composition"
}