{
  "xsiType": "OrganeParlementaire_Type",
  "uid": "PO746816",
  "codeType": "GE",
  "libelle": "Éco-construction",
  "libelleEdition": "ÉCO-CONSTRUCTION",
  "libelleAbrege": "ÉCO-CONSTRUCTION",
  "libelleAbrev": "ÉCOCONSTRU",
  "viMoDe": {
    "dateAgrement": "2017-12-20T01:00:00.000+01:00"
  },
  "regime": "5ème République",
  "legislature": "15",
  "secretariat": {
    "secretaire01": "M. Sébastien Meriaux"
  }
}