{
  "xsiType": "OrganeExtraParlementaire_type",
  "uid": "PO60255",
  "codeType": "ORGEXTPARL",
  "libelle": "Conseil d'administration de l'Agence pour l'enseignement français à l'étranger",
  "libelleEdition": "du conseil d'administration de l'Agence pour l'enseignement français à l'étranger",
  "libelleAbrege": "Enseignement français à l'étranger",
  "libelleAbrev": "115",
  "viMoDe": {
    "dateDebut": "1990-07-06T02:00:00.000+02:00"
  },
  "regime": "5ème République",
  "regimeJuridique": "Article L. 452-6 du code de l'éducation",
  "siteInternet": "http://www.aefe.fr/aefe/organigramme/organigramme-de-laefe-conseil-dadministration-ca"
}