{
  "xsiType": "OrganeExterne_Type",
  "uid": "PO766967",
  "codeType": "MINISTERE",
  "libelle": "Secrétariat d’État auprès de la ministre de la transition écologique et solidaire, chargé des transports",
  "libelleEdition": "auprès de la ministre de la transition écologique et solidaire, chargé des transports",
  "libelleAbrege": "Transports",
  "libelleAbrev": "TRA",
  "viMoDe": {
    "dateDebut": "2019-09-04T02:00:00.000+02:00"
  },
  "organeParentRef": "PO725688"
}