{
  "uid": "PA703539",
  "etatCivil": {
    "ident": {
      "civ": "Mme",
      "prenom": "Jacky",
      "nom": "Deromedi",
      "alpha": "DEROMEDI_Jacky"
    },
    "infoNaissance": {
      "dateNais": "1944-06-15T02:00:00.000+02:00"
    }
  },
  "profession": {
    "socProcInsee": {}
  },
  "adresses": [
    {
      "xsiType": "AdresseSiteWeb_Type",
      "uid": "AD703805",
      "type": "23",
      "typeLibelle": "Url sénateur",
      "valElec": "https://www.senat.fr/senateur/deromedi_jacky14041t.html"
    }
  ],
  "mandats": [
    {
      "xsiType": "MandatParlementaire_type",
      "uid": "PM703693",
      "acteurRef": "PA703539",
      "typeOrgane": "SENAT",
      "dateDebut": "2014-10-01T02:00:00.000+02:00",
      "preseance": "20",
      "nominPrincipale": "1",
      "infosQualite": {
        "codeQualite": "Sénateur",
        "libQualite": "SENATEUR",
        "libQualiteSex": "Sénateur 5ème République"
      },
      "organesRefs": [
        "PO78718"
      ],
      "election": {
        "lieu": {
          "numDepartement": "997"
        }
      },
      "mandature": {
        "premiereElection": "0"
      }
    },
    {
      "xsiType": "MandatSimple_Type",
      "uid": "PM704030",
      "acteurRef": "PA703539",
      "typeOrgane": "COMSENAT",
      "dateDebut": "2014-10-08T02:00:00.000+02:00",
      "preseance": "10",
      "nominPrincipale": "1",
      "infosQualite": {
        "codeQualite": "Membre",
        "libQualite": "Membre",
        "libQualiteSex": "Membre"
      },
      "organesRefs": [
        "PO211495"
      ]
    },
    {
      "xsiType": "MandatSimple_Type",
      "uid": "PM704328",
      "acteurRef": "PA703539",
      "typeOrgane": "GROUPESENAT",
      "dateDebut": "2014-10-07T02:00:00.000+02:00",
      "preseance": "4",
      "nominPrincipale": "1",
      "infosQualite": {
        "codeQualite": "Membre",
        "libQualite": "Membre",
        "libQualiteSex": "Membre du"
      },
      "organesRefs": [
        "PO286005"
      ]
    },
    {
      "xsiType": "MandatSimple_Type",
      "uid": "PM704977",
      "acteurRef": "PA703539",
      "typeOrgane": "DELEGSENAT",
      "dateDebut": "2014-11-06T01:00:00.000+01:00",
      "nominPrincipale": "1",
      "infosQualite": {
        "libQualite": "Secrétaire"
      },
      "organesRefs": [
        "PO310693"
      ]
    },
    {
      "xsiType": "MandatSimple_Type",
      "uid": "PM705015",
      "acteurRef": "PA703539",
      "typeOrgane": "DELEGSENAT",
      "dateDebut": "2014-11-26T01:00:00.000+01:00",
      "preseance": "4",
      "nominPrincipale": "1",
      "infosQualite": {
        "codeQualite": "Membre",
        "libQualite": "Membre",
        "libQualiteSex": "Membre"
      },
      "organesRefs": [
        "PO704856"
      ]
    },
    {
      "xsiType": "MandatSimple_Type",
      "uid": "PM707310",
      "acteurRef": "PA703539",
      "typeOrgane": "API",
      "dateDebut": "2015-04-10T02:00:00.000+02:00",
      "dateFin": "2018-01-25T01:00:00.000+01:00",
      "preseance": "20",
      "nominPrincipale": "1",
      "infosQualite": {
        "codeQualite": "Membre",
        "libQualite": "Membre",
        "libQualiteSex": "Membre"
      },
      "organesRefs": [
        "PO201115"
      ]
    },
    {
      "xsiType": "MandatSimple_Type",
      "uid": "PM737846",
      "acteurRef": "PA703539",
      "typeOrgane": "CMP",
      "dateDebut": "2017-10-06T02:00:00.000+02:00",
      "datePublication": "2017-10-06T02:00:00.000+02:00",
      "dateFin": "2017-10-18T02:00:00.000+02:00",
      "preseance": "20",
      "nominPrincipale": "1",
      "infosQualite": {
        "codeQualite": "Titulaire",
        "libQualite": "Membre titulaire",
        "libQualiteSex": "Membre titulaire"
      },
      "organesRefs": [
        "PO737081"
      ]
    },
    {
      "xsiType": "MandatParlementaire_type",
      "uid": "PM741039",
      "acteurRef": "PA703539",
      "typeOrgane": "SENAT",
      "dateDebut": "2017-10-04T02:00:00.000+02:00",
      "nominPrincipale": "1",
      "infosQualite": {
        "libQualite": "Secrétaire"
      },
      "organesRefs": [
        "PO78718"
      ],
      "election": {
        "lieu": {}
      },
      "mandature": {
        "premiereElection": "0"
      }
    },
    {
      "xsiType": "MandatSimple_Type",
      "uid": "PM741421",
      "acteurRef": "PA703539",
      "typeOrgane": "DELEGSENAT",
      "dateDebut": "2017-10-18T02:00:00.000+02:00",
      "preseance": "4",
      "nominPrincipale": "1",
      "infosQualite": {
        "codeQualite": "Membre",
        "libQualite": "Membre",
        "libQualiteSex": "Membre"
      },
      "organesRefs": [
        "PO704856"
      ]
    },
    {
      "xsiType": "MandatSimple_Type",
      "uid": "PM743229",
      "acteurRef": "PA703539",
      "typeOrgane": "API",
      "dateDebut": "2017-11-08T01:00:00.000+01:00",
      "preseance": "20",
      "nominPrincipale": "1",
      "infosQualite": {
        "codeQualite": "Membre",
        "libQualite": "Membre",
        "libQualiteSex": "Membre"
      },
      "organesRefs": [
        "PO206064"
      ]
    },
    {
      "xsiType": "MandatSimple_Type",
      "uid": "PM744630",
      "acteurRef": "PA703539",
      "typeOrgane": "CMP",
      "dateDebut": "2017-11-30T01:00:00.000+01:00",
      "datePublication": "2017-12-02T01:00:00.000+01:00",
      "dateFin": "2017-12-18T01:00:00.000+01:00",
      "preseance": "28",
      "nominPrincipale": "1",
      "infosQualite": {
        "codeQualite": "Suppléant",
        "libQualite": "Membre suppléant",
        "libQualiteSex": "Membre suppléante"
      },
      "organesRefs": [
        "PO744418"
      ]
    },
    {
      "xsiType": "MandatSimple_Type",
      "uid": "PM747785",
      "acteurRef": "PA703539",
      "typeOrgane": "COMSPSENAT",
      "dateDebut": "2018-01-17T01:00:00.000+01:00",
      "dateFin": "2018-01-30T01:00:00.000+01:00",
      "nominPrincipale": "1",
      "infosQualite": {
        "libQualite": "Membre"
      },
      "organesRefs": [
        "PO747777"
      ]
    },
    {
      "xsiType": "MandatSimple_Type",
      "uid": "PM748836",
      "acteurRef": "PA703539",
      "typeOrgane": "COMSPSENAT",
      "dateDebut": "2018-01-31T01:00:00.000+01:00",
      "dateFin": "2018-08-10T02:00:00.000+02:00",
      "nominPrincipale": "1",
      "infosQualite": {
        "libQualite": "Membre"
      },
      "organesRefs": [
        "PO748821"
      ]
    },
    {
      "xsiType": "MandatSimple_Type",
      "uid": "PM754546",
      "acteurRef": "PA703539",
      "typeOrgane": "CMP",
      "dateDebut": "2018-03-28T02:00:00.000+02:00",
      "datePublication": "2018-03-30T02:00:00.000+02:00",
      "dateFin": "2018-05-14T02:00:00.000+02:00",
      "preseance": "20",
      "nominPrincipale": "1",
      "infosQualite": {
        "codeQualite": "Titulaire",
        "libQualite": "Membre titulaire",
        "libQualiteSex": "Membre titulaire"
      },
      "organesRefs": [
        "PO754171"
      ]
    },
    {
      "xsiType": "MandatSimple_Type",
      "uid": "PM755570",
      "acteurRef": "PA703539",
      "typeOrgane": "CMP",
      "dateDebut": "2018-04-18T02:00:00.000+02:00",
      "datePublication": "2018-04-18T02:00:00.000+02:00",
      "dateFin": "2018-05-23T02:00:00.000+02:00",
      "preseance": "28",
      "nominPrincipale": "1",
      "infosQualite": {
        "codeQualite": "Suppléant",
        "libQualite": "Membre suppléant",
        "libQualiteSex": "Membre suppléante"
      },
      "organesRefs": [
        "PO755391"
      ]
    },
    {
      "xsiType": "MandatSimple_Type",
      "uid": "PM757434",
      "acteurRef": "PA703539",
      "typeOrgane": "CMP",
      "dateDebut": "2018-06-28T02:00:00.000+02:00",
      "datePublication": "2018-06-29T02:00:00.000+02:00",
      "dateFin": "2018-07-26T02:00:00.000+02:00",
      "preseance": "20",
      "nominPrincipale": "1",
      "infosQualite": {
        "codeQualite": "Titulaire",
        "libQualite": "Membre titulaire",
        "libQualiteSex": "Membre titulaire"
      },
      "organesRefs": [
        "PO756918"
      ]
    },
    {
      "xsiType": "MandatSimple_Type",
      "uid": "PM758291",
      "acteurRef": "PA703539",
      "typeOrgane": "CMP",
      "dateDebut": "2018-07-10T02:00:00.000+02:00",
      "datePublication": "2018-07-20T02:00:00.000+02:00",
      "dateFin": "2018-08-01T02:00:00.000+02:00",
      "preseance": "20",
      "nominPrincipale": "1",
      "infosQualite": {
        "codeQualite": "Titulaire",
        "libQualite": "Membre titulaire",
        "libQualiteSex": "Membre titulaire"
      },
      "organesRefs": [
        "PO757668"
      ]
    },
    {
      "xsiType": "MandatSimple_Type",
      "uid": "PM766086",
      "acteurRef": "PA703539",
      "typeOrgane": "CMP",
      "dateDebut": "2019-06-27T02:00:00.000+02:00",
      "datePublication": "2019-06-28T02:00:00.000+02:00",
      "dateFin": "2019-07-24T02:00:00.000+02:00",
      "preseance": "28",
      "nominPrincipale": "1",
      "infosQualite": {
        "codeQualite": "Suppléant",
        "libQualite": "Membre suppléant",
        "libQualiteSex": "Membre suppléante"
      },
      "organesRefs": [
        "PO766053"
      ]
    },
    {
      "xsiType": "MandatSimple_Type",
      "uid": "PM767690",
      "acteurRef": "PA703539",
      "typeOrgane": "COMSPSENAT",
      "dateDebut": "2019-10-16T02:00:00.000+02:00",
      "nominPrincipale": "1",
      "infosQualite": {
        "libQualite": "Membre"
      },
      "organesRefs": [
        "PO767640"
      ]
    }
  ]
}