{
  "uid": "PA758716",
  "etatCivil": {
    "ident": {
      "civ": "Mme",
      "prenom": "Sylviane",
      "nom": "Noël",
      "alpha": "NOEL_Sylviane"
    },
    "infoNaissance": {
      "dateNais": "1978-01-27T01:00:00.000+01:00"
    }
  },
  "profession": {
    "socProcInsee": {}
  },
  "adresses": [
    {
      "xsiType": "AdresseSiteWeb_Type",
      "uid": "AD758718",
      "type": "23",
      "typeLibelle": "Url sénateur",
      "valElec": "https://www.senat.fr/senateur/noel_sylviane19768n.html"
    }
  ],
  "mandats": [
    {
      "xsiType": "MandatParlementaire_type",
      "uid": "PM758720",
      "acteurRef": "PA758716",
      "typeOrgane": "SENAT",
      "dateDebut": "2018-08-07T02:00:00.000+02:00",
      "preseance": "20",
      "nominPrincipale": "1",
      "infosQualite": {
        "codeQualite": "Sénateur",
        "libQualite": "SENATEUR",
        "libQualiteSex": "Sénateur 5ème République"
      },
      "organesRefs": [
        "PO78718"
      ],
      "election": {
        "lieu": {
          "numDepartement": "74"
        }
      },
      "mandature": {
        "premiereElection": "0"
      }
    },
    {
      "xsiType": "MandatSimple_Type",
      "uid": "PM758722",
      "acteurRef": "PA758716",
      "typeOrgane": "GROUPESENAT",
      "dateDebut": "2018-08-07T02:00:00.000+02:00",
      "dateFin": "2018-08-08T02:00:00.000+02:00",
      "preseance": "4",
      "nominPrincipale": "1",
      "infosQualite": {
        "codeQualite": "Membre",
        "libQualite": "Membre",
        "libQualiteSex": "Membre du"
      },
      "organesRefs": [
        "PO77708"
      ]
    },
    {
      "xsiType": "MandatSimple_Type",
      "uid": "PM758724",
      "acteurRef": "PA758716",
      "typeOrgane": "GROUPESENAT",
      "dateDebut": "2018-08-09T02:00:00.000+02:00",
      "preseance": "4",
      "nominPrincipale": "1",
      "infosQualite": {
        "codeQualite": "Membre",
        "libQualite": "Membre",
        "libQualiteSex": "Membre du"
      },
      "organesRefs": [
        "PO286005"
      ]
    },
    {
      "xsiType": "MandatSimple_Type",
      "uid": "PM759019",
      "acteurRef": "PA758716",
      "typeOrgane": "COMSENAT",
      "dateDebut": "2018-09-14T02:00:00.000+02:00",
      "preseance": "10",
      "nominPrincipale": "1",
      "infosQualite": {
        "codeQualite": "Membre",
        "libQualite": "Membre",
        "libQualiteSex": "Membre"
      },
      "organesRefs": [
        "PO516753"
      ]
    },
    {
      "xsiType": "MandatSimple_Type",
      "uid": "PM766130",
      "acteurRef": "PA758716",
      "typeOrgane": "CMP",
      "dateDebut": "2019-06-27T02:00:00.000+02:00",
      "datePublication": "2019-06-28T02:00:00.000+02:00",
      "dateFin": "2019-07-24T02:00:00.000+02:00",
      "preseance": "28",
      "nominPrincipale": "1",
      "infosQualite": {
        "codeQualite": "Suppléant",
        "libQualite": "Membre suppléant",
        "libQualiteSex": "Membre suppléante"
      },
      "organesRefs": [
        "PO766097"
      ]
    }
  ]
}