{
  "uid": "PA689",
  "etatCivil": {
    "ident": {
      "civ": "Mme",
      "prenom": "Marie-George",
      "nom": "Buffet",
      "alpha": "Buffet",
      "trigramme": "MBF"
    },
    "infoNaissance": {
      "dateNais": "1949-05-07T01:00:00.000+01:00",
      "villeNais": "Sceaux",
      "depNais": "Hauts-de-Seine",
      "paysNais": "France"
    }
  },
  "profession": {
    "libelleCourant": "Employée",
    "socProcInsee": {
      "catSocPro": "Employés administratifs d'entreprise",
      "famSocPro": "Employés"
    }
  },
  "uriHatvp": "https://www.hatvp.fr/pages_nominatives/buffet-marie-george",
  "adresses": [
    {
      "xsiType": "AdressePostale_Type",
      "uid": "AD387102",
      "type": "0",
      "typeLibelle": "Adresse officielle",
      "poids": "1",
      "intitule": "Assemblée nationale,",
      "numeroRue": "126",
      "nomRue": "Rue de l'Université,",
      "codePostal": "75355",
      "ville": "Paris 07 SP"
    },
    {
      "xsiType": "AdresseMail_Type",
      "uid": "AD391679",
      "type": "15",
      "typeLibelle": "Mèl",
      "valElec": "marie-george.buffet@assemblee-nationale.fr"
    },
    {
      "xsiType": "AdressePostale_Type",
      "uid": "AD725100",
      "type": "2",
      "typeLibelle": "Adresse publiée de circonscription",
      "poids": "22",
      "numeroRue": "38",
      "nomRue": "Avenue Paul Vaillant-Couturier",
      "codePostal": "93240",
      "ville": "Stains"
    },
    {
      "xsiType": "AdresseTelephonique_Type",
      "uid": "AD725102",
      "type": "11",
      "typeLibelle": "Téléphone",
      "poids": "22",
      "adresseDeRattachement": "AD725100",
      "valElec": "01 42 35 71 97"
    },
    {
      "xsiType": "AdresseMail_Type",
      "uid": "AD725256",
      "type": "15",
      "typeLibelle": "Mèl",
      "valElec": "marie-george.buffet@wanadoo.fr"
    }
  ],
  "mandats": [
    {
      "xsiType": "MandatParlementaire_type",
      "uid": "PM645113",
      "acteurRef": "PA689",
      "legislature": "14",
      "typeOrgane": "ASSEMBLEE",
      "dateDebut": "2012-06-20T02:00:00.000+02:00",
      "dateFin": "2017-06-20T02:00:00.000+02:00",
      "preseance": "50",
      "nominPrincipale": "1",
      "infosQualite": {
        "codeQualite": "membre",
        "libQualite": "membre",
        "libQualiteSex": "membre"
      },
      "organesRefs": [
        "PO644420"
      ],
      "suppleant": {
        "dateDebut": "2012-06-20T02:00:00.000+02:00",
        "dateFin": "2017-06-20T02:00:00.000+02:00",
        "suppleantRef": "PA643055"
      },
      "election": {
        "lieu": {
          "region": "Ile-de-France",
          "regionType": "Métropolitain",
          "departement": "Seine-Saint-Denis",
          "numDepartement": "93",
          "numCirco": "4"
        },
        "causeMandat": "élections générales",
        "refCirconscription": "PO644945"
      },
      "mandature": {
        "datePriseFonction": "2012-06-20T02:00:00.000+02:00",
        "causeFin": "Fin de législature",
        "premiereElection": "1",
        "placeHemicycle": "593"
      }
    },
    {
      "xsiType": "MandatSimple_Type",
      "uid": "PM656587",
      "acteurRef": "PA689",
      "legislature": "14",
      "typeOrgane": "GP",
      "dateDebut": "2012-06-26T02:00:00.000+02:00",
      "datePublication": "2012-06-27T02:00:00.000+02:00",
      "dateFin": "2017-06-20T02:00:00.000+02:00",
      "preseance": "20",
      "nominPrincipale": "1",
      "infosQualite": {
        "codeQualite": "Membre",
        "libQualite": "Membre du",
        "libQualiteSex": "Membre du"
      },
      "organesRefs": [
        "PO656018"
      ]
    },
    {
      "xsiType": "MandatSimple_Type",
      "uid": "PM663922",
      "acteurRef": "PA689",
      "legislature": "14",
      "typeOrgane": "DELEG",
      "dateDebut": "2012-07-04T02:00:00.000+02:00",
      "datePublication": "2012-07-04T02:00:00.000+02:00",
      "dateFin": "2017-06-20T02:00:00.000+02:00",
      "preseance": "20",
      "nominPrincipale": "1",
      "infosQualite": {
        "codeQualite": "Membre",
        "libQualite": "Membre",
        "libQualiteSex": "Membre"
      },
      "organesRefs": [
        "PO201269"
      ]
    },
    {
      "xsiType": "MandatSimple_Type",
      "uid": "PM678380",
      "acteurRef": "PA689",
      "legislature": "14",
      "typeOrgane": "GA",
      "dateDebut": "2012-09-25T02:00:00.000+02:00",
      "dateFin": "2017-06-20T02:00:00.000+02:00",
      "preseance": "20",
      "nominPrincipale": "0",
      "infosQualite": {
        "codeQualite": "Membre",
        "libQualite": "Membre",
        "libQualiteSex": "Membre"
      },
      "organesRefs": [
        "PO675777"
      ]
    },
    {
      "xsiType": "MandatSimple_Type",
      "uid": "PM678381",
      "acteurRef": "PA689",
      "legislature": "14",
      "typeOrgane": "GA",
      "dateDebut": "2012-09-25T02:00:00.000+02:00",
      "dateFin": "2017-06-20T02:00:00.000+02:00",
      "preseance": "1",
      "nominPrincipale": "1",
      "infosQualite": {
        "codeQualite": "Président",
        "libQualite": "Président",
        "libQualiteSex": "Présidente"
      },
      "organesRefs": [
        "PO675777"
      ]
    },
    {
      "xsiType": "MandatSimple_Type",
      "uid": "PM685883",
      "acteurRef": "PA689",
      "typeOrgane": "PARPOL",
      "dateDebut": "2012-12-01T01:00:00.000+01:00",
      "dateFin": "2017-06-20T02:00:00.000+02:00",
      "preseance": "5",
      "nominPrincipale": "1",
      "infosQualite": {
        "codeQualite": "Membre",
        "libQualite": "Membre",
        "libQualiteSex": "Membre"
      },
      "organesRefs": [
        "PO684926"
      ]
    },
    {
      "xsiType": "MandatSimple_Type",
      "uid": "PM686386",
      "acteurRef": "PA689",
      "legislature": "14",
      "typeOrgane": "GE",
      "dateDebut": "2012-12-12T01:00:00.000+01:00",
      "dateFin": "2017-06-20T02:00:00.000+02:00",
      "preseance": "20",
      "nominPrincipale": "0",
      "infosQualite": {
        "codeQualite": "Membre",
        "libQualite": "Membre",
        "libQualiteSex": "Membre"
      },
      "organesRefs": [
        "PO686380"
      ]
    },
    {
      "xsiType": "MandatSimple_Type",
      "uid": "PM686387",
      "acteurRef": "PA689",
      "legislature": "14",
      "typeOrgane": "GE",
      "dateDebut": "2012-12-12T01:00:00.000+01:00",
      "dateFin": "2017-06-20T02:00:00.000+02:00",
      "preseance": "1",
      "nominPrincipale": "1",
      "infosQualite": {
        "codeQualite": "Président",
        "libQualite": "Président",
        "libQualiteSex": "Présidente"
      },
      "organesRefs": [
        "PO686380"
      ]
    },
    {
      "xsiType": "MandatSimple_Type",
      "uid": "PM687133",
      "acteurRef": "PA689",
      "legislature": "14",
      "typeOrgane": "GE",
      "dateDebut": "2012-12-17T01:00:00.000+01:00",
      "dateFin": "2017-06-20T02:00:00.000+02:00",
      "preseance": "20",
      "nominPrincipale": "1",
      "infosQualite": {
        "codeQualite": "Membre",
        "libQualite": "Membre",
        "libQualiteSex": "Membre"
      },
      "organesRefs": [
        "PO686468"
      ]
    },
    {
      "xsiType": "MandatSimple_Type",
      "uid": "PM687769",
      "acteurRef": "PA689",
      "legislature": "14",
      "typeOrgane": "GE",
      "dateDebut": "2013-01-15T01:00:00.000+01:00",
      "dateFin": "2017-06-20T02:00:00.000+02:00",
      "preseance": "20",
      "nominPrincipale": "1",
      "infosQualite": {
        "codeQualite": "Membre",
        "libQualite": "Membre",
        "libQualiteSex": "Membre"
      },
      "organesRefs": [
        "PO686415"
      ]
    },
    {
      "xsiType": "MandatSimple_Type",
      "uid": "PM712325",
      "acteurRef": "PA689",
      "legislature": "14",
      "typeOrgane": "GE",
      "dateDebut": "2016-04-07T02:00:00.000+02:00",
      "dateFin": "2017-06-20T02:00:00.000+02:00",
      "preseance": "20",
      "nominPrincipale": "1",
      "infosQualite": {
        "codeQualite": "Membre",
        "libQualite": "Membre",
        "libQualiteSex": "Membre"
      },
      "organesRefs": [
        "PO712100"
      ]
    },
    {
      "xsiType": "MandatSimple_Type",
      "uid": "PM712475",
      "acteurRef": "PA689",
      "legislature": "14",
      "typeOrgane": "GE",
      "dateDebut": "2016-04-26T02:00:00.000+02:00",
      "dateFin": "2017-06-20T02:00:00.000+02:00",
      "preseance": "8",
      "nominPrincipale": "1",
      "infosQualite": {
        "codeQualite": "Vice-Président",
        "libQualite": "Vice-Président",
        "libQualiteSex": "Vice-Présidente"
      },
      "organesRefs": [
        "PO712100"
      ]
    },
    {
      "xsiType": "MandatSimple_Type",
      "uid": "PM716605",
      "acteurRef": "PA689",
      "legislature": "14",
      "typeOrgane": "COMPER",
      "dateDebut": "2017-01-26T01:00:00.000+01:00",
      "datePublication": "2017-01-26T01:00:00.000+01:00",
      "dateFin": "2017-06-20T02:00:00.000+02:00",
      "preseance": "32",
      "nominPrincipale": "0",
      "infosQualite": {
        "codeQualite": "Membre",
        "libQualite": "Membre",
        "libQualiteSex": "Membre"
      },
      "organesRefs": [
        "PO419604"
      ]
    },
    {
      "xsiType": "MandatSimple_Type",
      "uid": "PM716606",
      "acteurRef": "PA689",
      "legislature": "14",
      "typeOrgane": "COMPER",
      "dateDebut": "2017-01-26T01:00:00.000+01:00",
      "datePublication": "2017-01-26T01:00:00.000+01:00",
      "dateFin": "2017-06-20T02:00:00.000+02:00",
      "preseance": "8",
      "nominPrincipale": "1",
      "infosQualite": {
        "codeQualite": "Vice-Président",
        "libQualite": "Vice-président",
        "libQualiteSex": "Vice-présidente"
      },
      "organesRefs": [
        "PO419604"
      ]
    },
    {
      "xsiType": "MandatParlementaire_type",
      "uid": "PM723090",
      "acteurRef": "PA689",
      "legislature": "15",
      "typeOrgane": "ASSEMBLEE",
      "dateDebut": "2017-06-18T02:00:00.000+02:00",
      "preseance": "50",
      "nominPrincipale": "1",
      "infosQualite": {
        "codeQualite": "membre",
        "libQualite": "membre",
        "libQualiteSex": "membre"
      },
      "organesRefs": [
        "PO717460"
      ],
      "suppleant": {
        "dateDebut": "2017-06-18T02:00:00.000+02:00",
        "suppleantRef": "PA720838"
      },
      "election": {
        "lieu": {
          "region": "Ile-de-France",
          "regionType": "Métropolitain",
          "departement": "Seine-Saint-Denis",
          "numDepartement": "93",
          "numCirco": "4"
        },
        "causeMandat": "élections générales",
        "refCirconscription": "PO718460"
      },
      "mandature": {
        "datePriseFonction": "2017-06-21T02:00:00.000+02:00",
        "premiereElection": "1",
        "placeHemicycle": "593"
      },
      "collaborateurs": [
        {
          "qualite": "Mme",
          "prenom": "Isabelle",
          "nom": "Monteil-Delplace"
        },
        {
          "qualite": "M.",
          "prenom": "Brian",
          "nom": "Blactot"
        },
        {
          "qualite": "Mme",
          "prenom": "Lorédane",
          "nom": "Cléret"
        }
      ]
    },
    {
      "xsiType": "MandatSimple_Type",
      "uid": "PM724586",
      "acteurRef": "PA689",
      "legislature": "15",
      "typeOrgane": "GP",
      "dateDebut": "2017-06-21T02:00:00.000+02:00",
      "dateFin": "2017-06-26T02:00:00.000+02:00",
      "preseance": "28",
      "nominPrincipale": "1",
      "infosQualite": {
        "codeQualite": "Député non-inscrit",
        "libQualite": "Député non-inscrit",
        "libQualiteSex": "Députée non-inscrite"
      },
      "organesRefs": [
        "PO723569"
      ]
    },
    {
      "xsiType": "MandatSimple_Type",
      "uid": "PM731536",
      "acteurRef": "PA689",
      "legislature": "15",
      "typeOrgane": "GP",
      "dateDebut": "2017-06-27T02:00:00.000+02:00",
      "datePublication": "2017-06-28T02:00:00.000+02:00",
      "preseance": "20",
      "nominPrincipale": "1",
      "infosQualite": {
        "codeQualite": "Membre",
        "libQualite": "Membre du",
        "libQualiteSex": "Membre du"
      },
      "organesRefs": [
        "PO730940"
      ]
    },
    {
      "xsiType": "MandatSimple_Type",
      "uid": "PM731656",
      "acteurRef": "PA689",
      "legislature": "15",
      "typeOrgane": "COMPER",
      "dateDebut": "2017-06-29T02:00:00.000+02:00",
      "datePublication": "2017-06-29T02:00:00.000+02:00",
      "dateFin": "2019-01-28T01:00:00.000+01:00",
      "preseance": "32",
      "nominPrincipale": "1",
      "infosQualite": {
        "codeQualite": "Membre",
        "libQualite": "Membre",
        "libQualiteSex": "Membre"
      },
      "organesRefs": [
        "PO419604"
      ]
    },
    {
      "xsiType": "MandatSimple_Type",
      "uid": "PM732556",
      "acteurRef": "PA689",
      "legislature": "15",
      "typeOrgane": "DELEG",
      "dateDebut": "2017-07-12T02:00:00.000+02:00",
      "datePublication": "2017-07-12T02:00:00.000+02:00",
      "dateFin": "2017-11-21T01:00:00.000+01:00",
      "preseance": "20",
      "nominPrincipale": "1",
      "infosQualite": {
        "codeQualite": "Membre",
        "libQualite": "Membre",
        "libQualiteSex": "Membre"
      },
      "organesRefs": [
        "PO201269"
      ]
    },
    {
      "xsiType": "MandatSimple_Type",
      "uid": "PM735061",
      "acteurRef": "PA689",
      "legislature": "15",
      "typeOrgane": "ORGEXTPARL",
      "dateDebut": "2017-09-18T02:00:00.000+02:00",
      "datePublication": "2017-09-21T02:00:00.000+02:00",
      "preseance": "20",
      "nominPrincipale": "1",
      "infosQualite": {
        "codeQualite": "Titulaire",
        "libQualite": "Membre titulaire",
        "libQualiteSex": "Membre titulaire"
      },
      "organesRefs": [
        "PO191887"
      ]
    },
    {
      "xsiType": "MandatSimple_Type",
      "uid": "PM735697",
      "acteurRef": "PA689",
      "legislature": "15",
      "typeOrgane": "GA",
      "dateDebut": "2017-09-28T02:00:00.000+02:00",
      "preseance": "20",
      "nominPrincipale": "0",
      "infosQualite": {
        "codeQualite": "Membre",
        "libQualite": "Membre",
        "libQualiteSex": "Membre"
      },
      "organesRefs": [
        "PO733572"
      ]
    },
    {
      "xsiType": "MandatSimple_Type",
      "uid": "PM735703",
      "acteurRef": "PA689",
      "legislature": "15",
      "typeOrgane": "GA",
      "dateDebut": "2017-09-28T02:00:00.000+02:00",
      "preseance": "20",
      "nominPrincipale": "0",
      "infosQualite": {
        "codeQualite": "Membre",
        "libQualite": "Membre",
        "libQualiteSex": "Membre"
      },
      "organesRefs": [
        "PO733107"
      ]
    },
    {
      "xsiType": "MandatSimple_Type",
      "uid": "PM735726",
      "acteurRef": "PA689",
      "legislature": "15",
      "typeOrgane": "GA",
      "dateDebut": "2017-09-28T02:00:00.000+02:00",
      "preseance": "20",
      "nominPrincipale": "0",
      "infosQualite": {
        "codeQualite": "Membre",
        "libQualite": "Membre",
        "libQualiteSex": "Membre"
      },
      "organesRefs": [
        "PO733252"
      ]
    },
    {
      "xsiType": "MandatSimple_Type",
      "uid": "PM735739",
      "acteurRef": "PA689",
      "legislature": "15",
      "typeOrgane": "GA",
      "dateDebut": "2017-09-28T02:00:00.000+02:00",
      "preseance": "20",
      "nominPrincipale": "0",
      "infosQualite": {
        "codeQualite": "Membre",
        "libQualite": "Membre",
        "libQualiteSex": "Membre"
      },
      "organesRefs": [
        "PO733612"
      ]
    },
    {
      "xsiType": "MandatSimple_Type",
      "uid": "PM735747",
      "acteurRef": "PA689",
      "legislature": "15",
      "typeOrgane": "GA",
      "dateDebut": "2017-09-28T02:00:00.000+02:00",
      "preseance": "20",
      "nominPrincipale": "1",
      "infosQualite": {
        "codeQualite": "Membre",
        "libQualite": "Membre",
        "libQualiteSex": "Membre"
      },
      "organesRefs": [
        "PO733397"
      ]
    },
    {
      "xsiType": "MandatSimple_Type",
      "uid": "PM735749",
      "acteurRef": "PA689",
      "legislature": "15",
      "typeOrgane": "GA",
      "dateDebut": "2017-09-28T02:00:00.000+02:00",
      "preseance": "20",
      "nominPrincipale": "0",
      "infosQualite": {
        "codeQualite": "Membre",
        "libQualite": "Membre",
        "libQualiteSex": "Membre"
      },
      "organesRefs": [
        "PO732984"
      ]
    },
    {
      "xsiType": "MandatSimple_Type",
      "uid": "PM735755",
      "acteurRef": "PA689",
      "legislature": "15",
      "typeOrgane": "GA",
      "dateDebut": "2017-09-28T02:00:00.000+02:00",
      "preseance": "20",
      "nominPrincipale": "1",
      "infosQualite": {
        "codeQualite": "Membre",
        "libQualite": "Membre",
        "libQualiteSex": "Membre"
      },
      "organesRefs": [
        "PO733472"
      ]
    },
    {
      "xsiType": "MandatSimple_Type",
      "uid": "PM735762",
      "acteurRef": "PA689",
      "legislature": "15",
      "typeOrgane": "GA",
      "dateDebut": "2017-09-28T02:00:00.000+02:00",
      "preseance": "20",
      "nominPrincipale": "1",
      "infosQualite": {
        "codeQualite": "Membre",
        "libQualite": "Membre",
        "libQualiteSex": "Membre"
      },
      "organesRefs": [
        "PO732954"
      ]
    },
    {
      "xsiType": "MandatSimple_Type",
      "uid": "PM735768",
      "acteurRef": "PA689",
      "legislature": "15",
      "typeOrgane": "GA",
      "dateDebut": "2017-09-28T02:00:00.000+02:00",
      "preseance": "20",
      "nominPrincipale": "0",
      "infosQualite": {
        "codeQualite": "Membre",
        "libQualite": "Membre",
        "libQualiteSex": "Membre"
      },
      "organesRefs": [
        "PO732964"
      ]
    },
    {
      "xsiType": "MandatSimple_Type",
      "uid": "PM735778",
      "acteurRef": "PA689",
      "legislature": "15",
      "typeOrgane": "GA",
      "dateDebut": "2017-09-28T02:00:00.000+02:00",
      "preseance": "20",
      "nominPrincipale": "0",
      "infosQualite": {
        "codeQualite": "Membre",
        "libQualite": "Membre",
        "libQualiteSex": "Membre"
      },
      "organesRefs": [
        "PO733562"
      ]
    },
    {
      "xsiType": "MandatSimple_Type",
      "uid": "PM735791",
      "acteurRef": "PA689",
      "legislature": "15",
      "typeOrgane": "GEVI",
      "dateDebut": "2017-09-28T02:00:00.000+02:00",
      "preseance": "20",
      "nominPrincipale": "0",
      "infosQualite": {
        "codeQualite": "Membre",
        "libQualite": "Membre",
        "libQualiteSex": "Membre"
      },
      "organesRefs": [
        "PO733462"
      ]
    },
    {
      "xsiType": "MandatSimple_Type",
      "uid": "PM740562",
      "acteurRef": "PA689",
      "legislature": "15",
      "typeOrgane": "GA",
      "dateDebut": "2017-10-18T02:00:00.000+02:00",
      "preseance": "8",
      "nominPrincipale": "1",
      "infosQualite": {
        "codeQualite": "Vice-Président",
        "libQualite": "Vice-Président",
        "libQualiteSex": "Vice-Présidente"
      },
      "organesRefs": [
        "PO733562"
      ]
    },
    {
      "xsiType": "MandatSimple_Type",
      "uid": "PM740972",
      "acteurRef": "PA689",
      "legislature": "15",
      "typeOrgane": "ORGEXTPARL",
      "dateDebut": "2017-10-19T02:00:00.000+02:00",
      "datePublication": "2017-10-21T02:00:00.000+02:00",
      "preseance": "30",
      "nominPrincipale": "1",
      "infosQualite": {
        "codeQualite": "Suppléant",
        "libQualite": "Membre suppléant",
        "libQualiteSex": "Membre suppléante"
      },
      "organesRefs": [
        "PO709193"
      ]
    },
    {
      "xsiType": "MandatMission_Type",
      "uid": "PM741951",
      "acteurRef": "PA689",
      "legislature": "15",
      "typeOrgane": "MISINFO",
      "dateDebut": "2017-09-27T02:00:00.000+02:00",
      "preseance": "10",
      "nominPrincipale": "1",
      "infosQualite": {
        "codeQualite": "Membre",
        "libQualite": "Membre",
        "libQualiteSex": "Membre"
      },
      "organesRefs": [
        "PO741916"
      ]
    },
    {
      "xsiType": "MandatSimple_Type",
      "uid": "PM742675",
      "acteurRef": "PA689",
      "legislature": "15",
      "typeOrgane": "GA",
      "dateDebut": "2017-11-08T01:00:00.000+01:00",
      "preseance": "8",
      "nominPrincipale": "1",
      "infosQualite": {
        "codeQualite": "Vice-Président",
        "libQualite": "Vice-Président",
        "libQualiteSex": "Vice-Présidente"
      },
      "organesRefs": [
        "PO733252"
      ]
    },
    {
      "xsiType": "MandatSimple_Type",
      "uid": "PM742685",
      "acteurRef": "PA689",
      "legislature": "15",
      "typeOrgane": "GA",
      "dateDebut": "2017-11-08T01:00:00.000+01:00",
      "preseance": "8",
      "nominPrincipale": "1",
      "infosQualite": {
        "codeQualite": "Vice-Président",
        "libQualite": "Vice-Président",
        "libQualiteSex": "Vice-Présidente"
      },
      "organesRefs": [
        "PO733612"
      ]
    },
    {
      "xsiType": "MandatSimple_Type",
      "uid": "PM743335",
      "acteurRef": "PA689",
      "legislature": "15",
      "typeOrgane": "GA",
      "dateDebut": "2017-11-08T01:00:00.000+01:00",
      "preseance": "8",
      "nominPrincipale": "1",
      "infosQualite": {
        "codeQualite": "Vice-Président",
        "libQualite": "Vice-Président",
        "libQualiteSex": "Vice-Présidente"
      },
      "organesRefs": [
        "PO733572"
      ]
    },
    {
      "xsiType": "MandatSimple_Type",
      "uid": "PM743363",
      "acteurRef": "PA689",
      "legislature": "15",
      "typeOrgane": "GA",
      "dateDebut": "2017-11-15T01:00:00.000+01:00",
      "preseance": "8",
      "nominPrincipale": "1",
      "infosQualite": {
        "codeQualite": "Vice-Président",
        "libQualite": "Vice-Président",
        "libQualiteSex": "Vice-Présidente"
      },
      "organesRefs": [
        "PO732984"
      ]
    },
    {
      "xsiType": "MandatSimple_Type",
      "uid": "PM743762",
      "acteurRef": "PA689",
      "legislature": "15",
      "typeOrgane": "ORGEXTPARL",
      "dateDebut": "2017-11-09T01:00:00.000+01:00",
      "datePublication": "2017-11-10T01:00:00.000+01:00",
      "preseance": "30",
      "nominPrincipale": "1",
      "infosQualite": {
        "codeQualite": "Suppléant",
        "libQualite": "Membre suppléant",
        "libQualiteSex": "Membre suppléante"
      },
      "organesRefs": [
        "PO696474"
      ]
    },
    {
      "xsiType": "MandatSimple_Type",
      "uid": "PM744477",
      "acteurRef": "PA689",
      "legislature": "15",
      "typeOrgane": "GA",
      "dateDebut": "2017-11-14T01:00:00.000+01:00",
      "preseance": "8",
      "nominPrincipale": "1",
      "infosQualite": {
        "codeQualite": "Vice-Président",
        "libQualite": "Vice-Président",
        "libQualiteSex": "Vice-Présidente"
      },
      "organesRefs": [
        "PO732964"
      ]
    },
    {
      "xsiType": "MandatSimple_Type",
      "uid": "PM745886",
      "acteurRef": "PA689",
      "typeOrgane": "PARPOL",
      "dateDebut": "2017-12-01T01:00:00.000+01:00",
      "preseance": "5",
      "nominPrincipale": "1",
      "infosQualite": {
        "codeQualite": "Membre",
        "libQualite": "Membre",
        "libQualiteSex": "Membre"
      },
      "organesRefs": [
        "PO684926"
      ]
    },
    {
      "xsiType": "MandatSimple_Type",
      "uid": "PM747666",
      "acteurRef": "PA689",
      "legislature": "15",
      "typeOrgane": "GEVI",
      "dateDebut": "2017-11-29T01:00:00.000+01:00",
      "preseance": "8",
      "nominPrincipale": "1",
      "infosQualite": {
        "codeQualite": "Vice-Président",
        "libQualite": "Vice-Président",
        "libQualiteSex": "Vice-Présidente"
      },
      "organesRefs": [
        "PO733462"
      ]
    },
    {
      "xsiType": "MandatSimple_Type",
      "uid": "PM748627",
      "acteurRef": "PA689",
      "legislature": "15",
      "typeOrgane": "GE",
      "dateDebut": "2018-02-01T01:00:00.000+01:00",
      "preseance": "20",
      "nominPrincipale": "0",
      "infosQualite": {
        "codeQualite": "Membre",
        "libQualite": "Membre",
        "libQualiteSex": "Membre"
      },
      "organesRefs": [
        "PO747119"
      ]
    },
    {
      "xsiType": "MandatSimple_Type",
      "uid": "PM748628",
      "acteurRef": "PA689",
      "legislature": "15",
      "typeOrgane": "GE",
      "dateDebut": "2018-02-01T01:00:00.000+01:00",
      "preseance": "1",
      "nominPrincipale": "1",
      "infosQualite": {
        "codeQualite": "Président",
        "libQualite": "Président",
        "libQualiteSex": "Présidente"
      },
      "organesRefs": [
        "PO747119"
      ]
    },
    {
      "xsiType": "MandatSimple_Type",
      "uid": "PM748986",
      "acteurRef": "PA689",
      "legislature": "15",
      "typeOrgane": "GE",
      "dateDebut": "2018-02-06T01:00:00.000+01:00",
      "preseance": "20",
      "nominPrincipale": "0",
      "infosQualite": {
        "codeQualite": "Membre",
        "libQualite": "Membre",
        "libQualiteSex": "Membre"
      },
      "organesRefs": [
        "PO746796"
      ]
    },
    {
      "xsiType": "MandatSimple_Type",
      "uid": "PM749362",
      "acteurRef": "PA689",
      "legislature": "15",
      "typeOrgane": "CMP",
      "dateDebut": "2018-02-12T01:00:00.000+01:00",
      "datePublication": "2018-02-10T01:00:00.000+01:00",
      "dateFin": "2018-02-15T01:00:00.000+01:00",
      "preseance": "28",
      "nominPrincipale": "1",
      "infosQualite": {
        "codeQualite": "Suppléant",
        "libQualite": "Membre suppléant",
        "libQualiteSex": "Membre suppléante"
      },
      "organesRefs": [
        "PO749252"
      ]
    },
    {
      "xsiType": "MandatSimple_Type",
      "uid": "PM753601",
      "acteurRef": "PA689",
      "legislature": "15",
      "typeOrgane": "GE",
      "dateDebut": "2018-03-15T01:00:00.000+01:00",
      "preseance": "12",
      "nominPrincipale": "1",
      "infosQualite": {
        "codeQualite": "Secrétaire",
        "libQualite": "Secrétaire",
        "libQualiteSex": "Secrétaire"
      },
      "organesRefs": [
        "PO746796"
      ]
    },
    {
      "xsiType": "MandatSimple_Type",
      "uid": "PM754468",
      "acteurRef": "PA689",
      "legislature": "15",
      "typeOrgane": "GA",
      "dateDebut": "2018-03-28T02:00:00.000+02:00",
      "preseance": "8",
      "nominPrincipale": "1",
      "infosQualite": {
        "codeQualite": "Vice-Président",
        "libQualite": "Vice-Président",
        "libQualiteSex": "Vice-Présidente"
      },
      "organesRefs": [
        "PO733107"
      ]
    },
    {
      "xsiType": "MandatMission_Type",
      "uid": "PM756749",
      "acteurRef": "PA689",
      "legislature": "15",
      "typeOrgane": "MISINFO",
      "dateDebut": "2018-04-11T02:00:00.000+02:00",
      "dateFin": "2019-02-20T01:00:00.000+01:00",
      "preseance": "10",
      "nominPrincipale": "1",
      "infosQualite": {
        "codeQualite": "Membre",
        "libQualite": "Membre",
        "libQualiteSex": "Membre"
      },
      "organesRefs": [
        "PO754002"
      ]
    },
    {
      "xsiType": "MandatMission_Type",
      "uid": "PM757268",
      "acteurRef": "PA689",
      "legislature": "15",
      "typeOrgane": "MISINFOPRE",
      "dateDebut": "2018-06-26T02:00:00.000+02:00",
      "datePublication": "2018-06-27T02:00:00.000+02:00",
      "dateFin": "2019-01-15T01:00:00.000+01:00",
      "preseance": "20",
      "nominPrincipale": "1",
      "infosQualite": {
        "codeQualite": "Membre",
        "libQualite": "Membre",
        "libQualiteSex": "Membre"
      },
      "organesRefs": [
        "PO757118"
      ]
    },
    {
      "xsiType": "MandatSimple_Type",
      "uid": "PM762330",
      "acteurRef": "PA689",
      "legislature": "15",
      "typeOrgane": "COMPER",
      "dateDebut": "2019-01-29T01:00:00.000+01:00",
      "datePublication": "2019-01-29T01:00:00.000+01:00",
      "dateFin": "2019-01-29T01:00:00.000+01:00",
      "preseance": "32",
      "nominPrincipale": "1",
      "infosQualite": {
        "codeQualite": "Membre",
        "libQualite": "Membre",
        "libQualiteSex": "Membre"
      },
      "organesRefs": [
        "PO420120"
      ]
    },
    {
      "xsiType": "MandatSimple_Type",
      "uid": "PM762338",
      "acteurRef": "PA689",
      "legislature": "15",
      "typeOrgane": "COMPER",
      "dateDebut": "2019-01-30T01:00:00.000+01:00",
      "datePublication": "2019-01-30T01:00:00.000+01:00",
      "dateFin": "2019-02-12T01:00:00.000+01:00",
      "preseance": "32",
      "nominPrincipale": "1",
      "infosQualite": {
        "codeQualite": "Membre",
        "libQualite": "Membre",
        "libQualiteSex": "Membre"
      },
      "organesRefs": [
        "PO419604"
      ]
    },
    {
      "xsiType": "MandatSimple_Type",
      "uid": "PM762620",
      "acteurRef": "PA689",
      "legislature": "15",
      "typeOrgane": "COMPER",
      "dateDebut": "2019-02-13T01:00:00.000+01:00",
      "datePublication": "2019-02-13T01:00:00.000+01:00",
      "dateFin": "2019-02-13T01:00:00.000+01:00",
      "preseance": "32",
      "nominPrincipale": "1",
      "infosQualite": {
        "codeQualite": "Membre",
        "libQualite": "Membre",
        "libQualiteSex": "Membre"
      },
      "organesRefs": [
        "PO420120"
      ]
    },
    {
      "xsiType": "MandatSimple_Type",
      "uid": "PM762712",
      "acteurRef": "PA689",
      "legislature": "15",
      "typeOrgane": "COMPER",
      "dateDebut": "2019-02-14T01:00:00.000+01:00",
      "datePublication": "2019-02-14T01:00:00.000+01:00",
      "dateFin": "2019-02-19T01:00:00.000+01:00",
      "preseance": "32",
      "nominPrincipale": "1",
      "infosQualite": {
        "codeQualite": "Membre",
        "libQualite": "Membre",
        "libQualiteSex": "Membre"
      },
      "organesRefs": [
        "PO419604"
      ]
    },
    {
      "xsiType": "MandatSimple_Type",
      "uid": "PM762813",
      "acteurRef": "PA689",
      "legislature": "15",
      "typeOrgane": "COMPER",
      "dateDebut": "2019-02-20T01:00:00.000+01:00",
      "datePublication": "2019-02-20T01:00:00.000+01:00",
      "dateFin": "2019-02-20T01:00:00.000+01:00",
      "preseance": "32",
      "nominPrincipale": "1",
      "infosQualite": {
        "codeQualite": "Membre",
        "libQualite": "Membre",
        "libQualiteSex": "Membre"
      },
      "organesRefs": [
        "PO419610"
      ]
    },
    {
      "xsiType": "MandatSimple_Type",
      "uid": "PM762864",
      "acteurRef": "PA689",
      "legislature": "15",
      "typeOrgane": "COMPER",
      "dateDebut": "2019-02-21T01:00:00.000+01:00",
      "datePublication": "2019-02-21T01:00:00.000+01:00",
      "dateFin": "2019-03-06T01:00:00.000+01:00",
      "preseance": "32",
      "nominPrincipale": "1",
      "infosQualite": {
        "codeQualite": "Membre",
        "libQualite": "Membre",
        "libQualiteSex": "Membre"
      },
      "organesRefs": [
        "PO419604"
      ]
    },
    {
      "xsiType": "MandatSimple_Type",
      "uid": "PM763074",
      "acteurRef": "PA689",
      "legislature": "15",
      "typeOrgane": "COMPER",
      "dateDebut": "2019-03-07T01:00:00.000+01:00",
      "datePublication": "2019-03-07T01:00:00.000+01:00",
      "dateFin": "2019-03-07T01:00:00.000+01:00",
      "preseance": "32",
      "nominPrincipale": "1",
      "infosQualite": {
        "codeQualite": "Membre",
        "libQualite": "Membre",
        "libQualiteSex": "Membre"
      },
      "organesRefs": [
        "PO420120"
      ]
    },
    {
      "xsiType": "MandatSimple_Type",
      "uid": "PM763099",
      "acteurRef": "PA689",
      "legislature": "15",
      "typeOrgane": "COMPER",
      "dateDebut": "2019-03-08T01:00:00.000+01:00",
      "datePublication": "2019-03-08T01:00:00.000+01:00",
      "preseance": "32",
      "nominPrincipale": "1",
      "infosQualite": {
        "codeQualite": "Membre",
        "libQualite": "Membre",
        "libQualiteSex": "Membre"
      },
      "organesRefs": [
        "PO419604"
      ]
    },
    {
      "xsiType": "MandatSimple_Type",
      "uid": "PM765455",
      "acteurRef": "PA689",
      "legislature": "15",
      "typeOrgane": "CMP",
      "dateDebut": "2019-05-29T02:00:00.000+02:00",
      "datePublication": "2019-05-30T02:00:00.000+02:00",
      "dateFin": "2019-07-16T02:00:00.000+02:00",
      "preseance": "28",
      "nominPrincipale": "1",
      "infosQualite": {
        "codeQualite": "Suppléant",
        "libQualite": "Membre suppléant",
        "libQualiteSex": "Membre suppléante"
      },
      "organesRefs": [
        "PO765339"
      ]
    },
    {
      "xsiType": "MandatMission_Type",
      "uid": "PM765876",
      "acteurRef": "PA689",
      "legislature": "15",
      "typeOrgane": "MISINFOCOM",
      "dateDebut": "2019-06-19T02:00:00.000+02:00",
      "datePublication": "2019-06-20T02:00:00.000+02:00",
      "preseance": "20",
      "nominPrincipale": "0",
      "infosQualite": {
        "codeQualite": "Membre",
        "libQualite": "Membre",
        "libQualiteSex": "Membre"
      },
      "organesRefs": [
        "PO765869"
      ]
    },
    {
      "xsiType": "MandatMission_Type",
      "uid": "PM765878",
      "acteurRef": "PA689",
      "legislature": "15",
      "typeOrgane": "MISINFOCOM",
      "dateDebut": "2019-06-19T02:00:00.000+02:00",
      "datePublication": "2019-06-20T02:00:00.000+02:00",
      "preseance": "16",
      "nominPrincipale": "1",
      "infosQualite": {
        "codeQualite": "Rapporteur",
        "libQualite": "Rapporteur",
        "libQualiteSex": "Rapporteure"
      },
      "organesRefs": [
        "PO765869"
      ]
    },
    {
      "xsiType": "MandatSimple_Type",
      "uid": "PM766866",
      "acteurRef": "PA689",
      "legislature": "15",
      "typeOrgane": "CMP",
      "dateDebut": "2019-07-25T02:00:00.000+02:00",
      "datePublication": "2019-07-26T02:00:00.000+02:00",
      "dateFin": "2019-10-16T02:00:00.000+02:00",
      "preseance": "28",
      "nominPrincipale": "1",
      "infosQualite": {
        "codeQualite": "Suppléant",
        "libQualite": "Membre suppléant",
        "libQualiteSex": "Membre suppléante"
      },
      "organesRefs": [
        "PO766371"
      ]
    }
  ]
}