{
  "uid": "PA720030",
  "etatCivil": {
    "ident": {
      "civ": "M.",
      "prenom": "Alexandre",
      "nom": "Freschi",
      "alpha": "Freschi",
      "trigramme": "AFR"
    },
    "infoNaissance": {
      "dateNais": "1979-05-17T02:00:00.000+02:00",
      "villeNais": "Marmande",
      "depNais": "Lot-et-Garonne",
      "paysNais": "France"
    }
  },
  "profession": {
    "libelleCourant": "Dirigeant de société",
    "socProcInsee": {
      "catSocPro": "Chefs d'entreprise de 10 salariés ou plus",
      "famSocPro": "Artisans, commerçants et chefs d'entreprise"
    }
  },
  "uriHatvp": "https://www.hatvp.fr/pages_nominatives/freschi-alexandre",
  "adresses": [
    {
      "xsiType": "AdressePostale_Type",
      "uid": "AD720032",
      "type": "0",
      "typeLibelle": "Adresse officielle",
      "poids": "1",
      "intitule": "Assemblée nationale,",
      "numeroRue": "126",
      "nomRue": "Rue de l'Université,",
      "codePostal": "75355",
      "ville": "Paris 07 SP"
    },
    {
      "xsiType": "AdresseMail_Type",
      "uid": "AD728103",
      "type": "15",
      "typeLibelle": "Mèl",
      "valElec": "alexandre.freschi@assemblee-nationale.fr"
    },
    {
      "xsiType": "AdresseSiteWeb_Type",
      "uid": "AD728442",
      "type": "25",
      "typeLibelle": "Facebook",
      "valElec": "Alexandre.V.Freschi"
    },
    {
      "xsiType": "AdresseMail_Type",
      "uid": "AD728580",
      "type": "15",
      "typeLibelle": "Mèl",
      "valElec": "a.freschi@outlook.fr"
    }
  ],
  "mandats": [
    {
      "xsiType": "MandatParlementaire_type",
      "uid": "PM722838",
      "acteurRef": "PA720030",
      "legislature": "15",
      "typeOrgane": "ASSEMBLEE",
      "dateDebut": "2017-06-18T02:00:00.000+02:00",
      "preseance": "50",
      "nominPrincipale": "1",
      "infosQualite": {
        "codeQualite": "membre",
        "libQualite": "membre",
        "libQualiteSex": "membre"
      },
      "organesRefs": [
        "PO717460"
      ],
      "suppleant": {
        "dateDebut": "2017-06-18T02:00:00.000+02:00",
        "suppleantRef": "PA720034"
      },
      "election": {
        "lieu": {
          "region": "Nouvelle-Aquitaine",
          "regionType": "Métropolitain",
          "departement": "Lot-et-Garonne",
          "numDepartement": "47",
          "numCirco": "2"
        },
        "causeMandat": "élections générales",
        "refCirconscription": "PO717910"
      },
      "mandature": {
        "datePriseFonction": "2017-06-21T02:00:00.000+02:00",
        "premiereElection": "0",
        "placeHemicycle": "474"
      },
      "collaborateurs": [
        {
          "qualite": "Mme",
          "prenom": "Pegah",
          "nom": "Malek-Ahmadi"
        },
        {
          "qualite": "Mme",
          "prenom": "Nina",
          "nom": "Charles"
        },
        {
          "qualite": "Mme",
          "prenom": "Paola",
          "nom": "Emerit"
        }
      ]
    },
    {
      "xsiType": "MandatSimple_Type",
      "uid": "PM724460",
      "acteurRef": "PA720030",
      "legislature": "15",
      "typeOrgane": "GP",
      "dateDebut": "2017-06-21T02:00:00.000+02:00",
      "dateFin": "2017-06-26T02:00:00.000+02:00",
      "preseance": "28",
      "nominPrincipale": "1",
      "infosQualite": {
        "codeQualite": "Député non-inscrit",
        "libQualite": "Député non-inscrit",
        "libQualiteSex": "Député non-inscrit"
      },
      "organesRefs": [
        "PO723569"
      ]
    },
    {
      "xsiType": "MandatSimple_Type",
      "uid": "PM731102",
      "acteurRef": "PA720030",
      "legislature": "15",
      "typeOrgane": "GP",
      "dateDebut": "2017-06-27T02:00:00.000+02:00",
      "datePublication": "2017-06-28T02:00:00.000+02:00",
      "preseance": "20",
      "nominPrincipale": "1",
      "infosQualite": {
        "codeQualite": "Membre",
        "libQualite": "Membre du",
        "libQualiteSex": "Membre du"
      },
      "organesRefs": [
        "PO730964"
      ]
    },
    {
      "xsiType": "MandatSimple_Type",
      "uid": "PM732135",
      "acteurRef": "PA720030",
      "legislature": "15",
      "typeOrgane": "COMPER",
      "dateDebut": "2017-06-29T02:00:00.000+02:00",
      "datePublication": "2017-06-29T02:00:00.000+02:00",
      "preseance": "32",
      "nominPrincipale": "1",
      "infosQualite": {
        "codeQualite": "Membre",
        "libQualite": "Membre",
        "libQualiteSex": "Membre"
      },
      "organesRefs": [
        "PO419604"
      ]
    },
    {
      "xsiType": "MandatAvecSuppleant_Type",
      "uid": "PM732360",
      "acteurRef": "PA720030",
      "legislature": "15",
      "typeOrgane": "COMNL",
      "dateDebut": "2017-07-05T02:00:00.000+02:00",
      "datePublication": "2017-07-05T02:00:00.000+02:00",
      "preseance": "20",
      "nominPrincipale": "1",
      "infosQualite": {
        "codeQualite": "Membre",
        "libQualite": "Membre",
        "libQualiteSex": "Membre"
      },
      "organesRefs": [
        "PO415287"
      ]
    },
    {
      "xsiType": "MandatSimple_Type",
      "uid": "PM740488",
      "acteurRef": "PA720030",
      "legislature": "15",
      "typeOrgane": "GA",
      "dateDebut": "2017-10-18T02:00:00.000+02:00",
      "preseance": "20",
      "nominPrincipale": "0",
      "infosQualite": {
        "codeQualite": "Membre",
        "libQualite": "Membre",
        "libQualiteSex": "Membre"
      },
      "organesRefs": [
        "PO733057"
      ]
    },
    {
      "xsiType": "MandatSimple_Type",
      "uid": "PM740713",
      "acteurRef": "PA720030",
      "legislature": "15",
      "typeOrgane": "GA",
      "dateDebut": "2017-10-23T02:00:00.000+02:00",
      "preseance": "20",
      "nominPrincipale": "1",
      "infosQualite": {
        "codeQualite": "Membre",
        "libQualite": "Membre",
        "libQualiteSex": "Membre"
      },
      "organesRefs": [
        "PO733342"
      ]
    },
    {
      "xsiType": "MandatSimple_Type",
      "uid": "PM740714",
      "acteurRef": "PA720030",
      "legislature": "15",
      "typeOrgane": "GA",
      "dateDebut": "2017-10-23T02:00:00.000+02:00",
      "preseance": "20",
      "nominPrincipale": "0",
      "infosQualite": {
        "codeQualite": "Membre",
        "libQualite": "Membre",
        "libQualiteSex": "Membre"
      },
      "organesRefs": [
        "PO732939"
      ]
    },
    {
      "xsiType": "MandatSimple_Type",
      "uid": "PM742536",
      "acteurRef": "PA720030",
      "legislature": "15",
      "typeOrgane": "GA",
      "dateDebut": "2017-10-24T02:00:00.000+02:00",
      "preseance": "14",
      "nominPrincipale": "1",
      "infosQualite": {
        "codeQualite": "Secrétaire",
        "libQualite": "Secrétaire",
        "libQualiteSex": "Secrétaire"
      },
      "organesRefs": [
        "PO732939"
      ]
    },
    {
      "xsiType": "MandatSimple_Type",
      "uid": "PM745091",
      "acteurRef": "PA720030",
      "typeOrgane": "PARPOL",
      "dateDebut": "2017-12-01T01:00:00.000+01:00",
      "dateFin": "2018-11-30T01:00:00.000+01:00",
      "preseance": "5",
      "nominPrincipale": "1",
      "infosQualite": {
        "codeQualite": "Membre",
        "libQualite": "Membre",
        "libQualiteSex": "Membre"
      },
      "organesRefs": [
        "PO744854"
      ]
    },
    {
      "xsiType": "MandatMission_Type",
      "uid": "PM746721",
      "acteurRef": "PA720030",
      "legislature": "15",
      "typeOrgane": "MISINFO",
      "dateDebut": "2017-12-20T01:00:00.000+01:00",
      "dateFin": "2018-11-15T01:00:00.000+01:00",
      "preseance": "10",
      "nominPrincipale": "1",
      "infosQualite": {
        "codeQualite": "Membre",
        "libQualite": "Membre",
        "libQualiteSex": "Membre"
      },
      "organesRefs": [
        "PO746694"
      ]
    },
    {
      "xsiType": "MandatSimple_Type",
      "uid": "PM747457",
      "acteurRef": "PA720030",
      "legislature": "15",
      "typeOrgane": "ORGEXTPARL",
      "dateDebut": "2017-12-21T01:00:00.000+01:00",
      "datePublication": "2017-12-22T01:00:00.000+01:00",
      "preseance": "20",
      "nominPrincipale": "1",
      "infosQualite": {
        "codeQualite": "Titulaire",
        "libQualite": "Membre titulaire",
        "libQualiteSex": "Membre titulaire"
      },
      "organesRefs": [
        "PO429567"
      ]
    },
    {
      "xsiType": "MandatSimple_Type",
      "uid": "PM747628",
      "acteurRef": "PA720030",
      "legislature": "15",
      "typeOrgane": "GA",
      "dateDebut": "2017-11-22T01:00:00.000+01:00",
      "preseance": "8",
      "nominPrincipale": "1",
      "infosQualite": {
        "codeQualite": "Vice-Président",
        "libQualite": "Vice-Président",
        "libQualiteSex": "Vice-Président"
      },
      "organesRefs": [
        "PO733057"
      ]
    },
    {
      "xsiType": "MandatSimple_Type",
      "uid": "PM752215",
      "acteurRef": "PA720030",
      "legislature": "15",
      "typeOrgane": "GE",
      "dateDebut": "2018-03-02T01:00:00.000+01:00",
      "preseance": "20",
      "nominPrincipale": "1",
      "infosQualite": {
        "codeQualite": "Membre",
        "libQualite": "Membre",
        "libQualiteSex": "Membre"
      },
      "organesRefs": [
        "PO746847"
      ]
    },
    {
      "xsiType": "MandatSimple_Type",
      "uid": "PM752219",
      "acteurRef": "PA720030",
      "legislature": "15",
      "typeOrgane": "GE",
      "dateDebut": "2018-03-02T01:00:00.000+01:00",
      "preseance": "20",
      "nominPrincipale": "1",
      "infosQualite": {
        "codeQualite": "Membre",
        "libQualite": "Membre",
        "libQualiteSex": "Membre"
      },
      "organesRefs": [
        "PO747266"
      ]
    },
    {
      "xsiType": "MandatSimple_Type",
      "uid": "PM752285",
      "acteurRef": "PA720030",
      "legislature": "15",
      "typeOrgane": "GE",
      "dateDebut": "2018-03-05T01:00:00.000+01:00",
      "preseance": "20",
      "nominPrincipale": "1",
      "infosQualite": {
        "codeQualite": "Membre",
        "libQualite": "Membre",
        "libQualiteSex": "Membre"
      },
      "organesRefs": [
        "PO747261"
      ]
    },
    {
      "xsiType": "MandatSimple_Type",
      "uid": "PM752408",
      "acteurRef": "PA720030",
      "legislature": "15",
      "typeOrgane": "GE",
      "dateDebut": "2018-03-05T01:00:00.000+01:00",
      "preseance": "20",
      "nominPrincipale": "1",
      "infosQualite": {
        "codeQualite": "Membre",
        "libQualite": "Membre",
        "libQualiteSex": "Membre"
      },
      "organesRefs": [
        "PO746925"
      ]
    },
    {
      "xsiType": "MandatSimple_Type",
      "uid": "PM752422",
      "acteurRef": "PA720030",
      "legislature": "15",
      "typeOrgane": "GE",
      "dateDebut": "2018-03-05T01:00:00.000+01:00",
      "preseance": "20",
      "nominPrincipale": "1",
      "infosQualite": {
        "codeQualite": "Membre",
        "libQualite": "Membre",
        "libQualiteSex": "Membre"
      },
      "organesRefs": [
        "PO747129"
      ]
    },
    {
      "xsiType": "MandatSimple_Type",
      "uid": "PM753102",
      "acteurRef": "PA720030",
      "legislature": "15",
      "typeOrgane": "GE",
      "dateDebut": "2018-03-08T01:00:00.000+01:00",
      "preseance": "20",
      "nominPrincipale": "1",
      "infosQualite": {
        "codeQualite": "Membre",
        "libQualite": "Membre",
        "libQualiteSex": "Membre"
      },
      "organesRefs": [
        "PO747037"
      ]
    },
    {
      "xsiType": "MandatSimple_Type",
      "uid": "PM753185",
      "acteurRef": "PA720030",
      "legislature": "15",
      "typeOrgane": "GE",
      "dateDebut": "2018-03-12T01:00:00.000+01:00",
      "preseance": "20",
      "nominPrincipale": "1",
      "infosQualite": {
        "codeQualite": "Membre",
        "libQualite": "Membre",
        "libQualiteSex": "Membre"
      },
      "organesRefs": [
        "PO746880"
      ]
    },
    {
      "xsiType": "MandatSimple_Type",
      "uid": "PM753218",
      "acteurRef": "PA720030",
      "legislature": "15",
      "typeOrgane": "GE",
      "dateDebut": "2018-03-12T01:00:00.000+01:00",
      "preseance": "20",
      "nominPrincipale": "1",
      "infosQualite": {
        "codeQualite": "Membre",
        "libQualite": "Membre",
        "libQualiteSex": "Membre"
      },
      "organesRefs": [
        "PO747220"
      ]
    },
    {
      "xsiType": "MandatSimple_Type",
      "uid": "PM753754",
      "acteurRef": "PA720030",
      "legislature": "15",
      "typeOrgane": "GE",
      "dateDebut": "2018-03-13T01:00:00.000+01:00",
      "preseance": "20",
      "nominPrincipale": "1",
      "infosQualite": {
        "codeQualite": "Membre",
        "libQualite": "Membre",
        "libQualiteSex": "Membre"
      },
      "organesRefs": [
        "PO746997"
      ]
    },
    {
      "xsiType": "MandatSimple_Type",
      "uid": "PM753943",
      "acteurRef": "PA720030",
      "legislature": "15",
      "typeOrgane": "GE",
      "dateDebut": "2018-03-20T01:00:00.000+01:00",
      "preseance": "20",
      "nominPrincipale": "1",
      "infosQualite": {
        "codeQualite": "Membre",
        "libQualite": "Membre",
        "libQualiteSex": "Membre"
      },
      "organesRefs": [
        "PO747215"
      ]
    },
    {
      "xsiType": "MandatSimple_Type",
      "uid": "PM754150",
      "acteurRef": "PA720030",
      "legislature": "15",
      "typeOrgane": "CNPE",
      "dateDebut": "2018-03-23T01:00:00.000+01:00",
      "datePublication": "2018-03-23T01:00:00.000+01:00",
      "dateFin": "2018-07-19T02:00:00.000+02:00",
      "preseance": "20",
      "nominPrincipale": "1",
      "infosQualite": {
        "codeQualite": "Membre",
        "libQualite": "Membre",
        "libQualiteSex": "Membre"
      },
      "organesRefs": [
        "PO753283"
      ]
    },
    {
      "xsiType": "MandatSimple_Type",
      "uid": "PM754561",
      "acteurRef": "PA720030",
      "legislature": "15",
      "typeOrgane": "CNPE",
      "dateDebut": "2018-03-29T02:00:00.000+02:00",
      "datePublication": "2018-03-30T02:00:00.000+02:00",
      "dateFin": "2018-07-19T02:00:00.000+02:00",
      "preseance": "1",
      "nominPrincipale": "1",
      "infosQualite": {
        "codeQualite": "Président",
        "libQualite": "Président",
        "libQualiteSex": "Président"
      },
      "organesRefs": [
        "PO753283"
      ]
    },
    {
      "xsiType": "MandatSimple_Type",
      "uid": "PM761475",
      "acteurRef": "PA720030",
      "typeOrgane": "PARPOL",
      "dateDebut": "2018-12-01T01:00:00.000+01:00",
      "preseance": "5",
      "nominPrincipale": "1",
      "infosQualite": {
        "codeQualite": "Membre",
        "libQualite": "Membre",
        "libQualiteSex": "Membre"
      },
      "organesRefs": [
        "PO761294"
      ]
    },
    {
      "xsiType": "MandatSimple_Type",
      "uid": "PM763427",
      "acteurRef": "PA720030",
      "legislature": "15",
      "typeOrgane": "ORGEXTPARL",
      "dateDebut": "2019-03-14T01:00:00.000+01:00",
      "datePublication": "2019-03-15T01:00:00.000+01:00",
      "preseance": "20",
      "nominPrincipale": "1",
      "infosQualite": {
        "codeQualite": "Titulaire",
        "libQualite": "Membre titulaire",
        "libQualiteSex": "Membre titulaire"
      },
      "organesRefs": [
        "PO763346"
      ]
    },
    {
      "xsiType": "MandatSimple_Type",
      "uid": "PM765604",
      "acteurRef": "PA720030",
      "legislature": "15",
      "typeOrgane": "CMP",
      "dateDebut": "2019-06-06T02:00:00.000+02:00",
      "datePublication": "2019-06-07T02:00:00.000+02:00",
      "dateFin": "2019-07-04T02:00:00.000+02:00",
      "preseance": "20",
      "nominPrincipale": "1",
      "infosQualite": {
        "codeQualite": "Titulaire",
        "libQualite": "Membre titulaire",
        "libQualiteSex": "Membre titulaire"
      },
      "organesRefs": [
        "PO765254"
      ]
    }
  ]
}