{
  "uid": "PA227029",
  "etatCivil": {
    "ident": {
      "civ": "Mme",
      "prenom": "Françoise",
      "nom": "Férat",
      "alpha": "FERAT FRANCOISE"
    },
    "infoNaissance": {
      "dateNais": "1949-03-05T01:00:00.000+01:00"
    }
  },
  "profession": {
    "socProcInsee": {}
  },
  "adresses": [
    {
      "xsiType": "AdresseSiteWeb_Type",
      "uid": "AD316982",
      "type": "23",
      "typeLibelle": "Url sénateur",
      "valElec": "https://www.senat.fr/senateur/ferat_francoise01025n.html"
    }
  ],
  "mandats": [
    {
      "xsiType": "MandatSimple_Type",
      "uid": "PM309484",
      "acteurRef": "PA227029",
      "typeOrgane": "GROUPESENAT",
      "dateDebut": "2011-10-01T02:00:00.000+02:00",
      "preseance": "4",
      "nominPrincipale": "1",
      "infosQualite": {
        "codeQualite": "Membre",
        "libQualite": "Membre",
        "libQualiteSex": "Membre du"
      },
      "organesRefs": [
        "PO309463"
      ]
    },
    {
      "xsiType": "MandatParlementaire_type",
      "uid": "PM429904",
      "acteurRef": "PA227029",
      "typeOrgane": "SENAT",
      "dateDebut": "2011-10-01T02:00:00.000+02:00",
      "dateFin": "2017-10-01T02:00:00.000+02:00",
      "preseance": "20",
      "nominPrincipale": "1",
      "infosQualite": {
        "codeQualite": "Sénateur",
        "libQualite": "SENATEUR",
        "libQualiteSex": "Sénateur 5ème République"
      },
      "organesRefs": [
        "PO78718"
      ],
      "election": {
        "lieu": {
          "numDepartement": "51"
        }
      },
      "mandature": {
        "premiereElection": "0"
      }
    },
    {
      "xsiType": "MandatSimple_Type",
      "uid": "PM704243",
      "acteurRef": "PA227029",
      "typeOrgane": "COMSENAT",
      "dateDebut": "2014-10-09T02:00:00.000+02:00",
      "dateFin": "2017-10-03T02:00:00.000+02:00",
      "nominPrincipale": "1",
      "infosQualite": {
        "libQualite": "Secrétaire"
      },
      "organesRefs": [
        "PO211490"
      ]
    },
    {
      "xsiType": "MandatSimple_Type",
      "uid": "PM704366",
      "acteurRef": "PA227029",
      "typeOrgane": "GROUPESENAT",
      "dateDebut": "2014-10-07T02:00:00.000+02:00",
      "preseance": "4",
      "nominPrincipale": "1",
      "infosQualite": {
        "codeQualite": "Membre",
        "libQualite": "Membre",
        "libQualiteSex": "Membre du"
      },
      "organesRefs": [
        "PO309463"
      ]
    },
    {
      "xsiType": "MandatSimple_Type",
      "uid": "PM707297",
      "acteurRef": "PA227029",
      "typeOrgane": "API",
      "dateDebut": "2015-04-10T02:00:00.000+02:00",
      "dateFin": "2017-10-01T02:00:00.000+02:00",
      "preseance": "20",
      "nominPrincipale": "0",
      "infosQualite": {
        "codeQualite": "Membre",
        "libQualite": "Membre",
        "libQualiteSex": "Membre"
      },
      "organesRefs": [
        "PO201115"
      ]
    },
    {
      "xsiType": "MandatSimple_Type",
      "uid": "PM707298",
      "acteurRef": "PA227029",
      "typeOrgane": "API",
      "dateDebut": "2015-04-10T02:00:00.000+02:00",
      "dateFin": "2017-10-01T02:00:00.000+02:00",
      "preseance": "19",
      "nominPrincipale": "1",
      "infosQualite": {
        "codeQualite": "Autre membre du Bureau",
        "libQualite": "Membre du Bureau",
        "libQualiteSex": "Membre du Bureau"
      },
      "organesRefs": [
        "PO201115"
      ]
    },
    {
      "xsiType": "MandatParlementaire_type",
      "uid": "PM736306",
      "acteurRef": "PA227029",
      "typeOrgane": "SENAT",
      "dateDebut": "2017-10-02T02:00:00.000+02:00",
      "preseance": "20",
      "nominPrincipale": "1",
      "infosQualite": {
        "codeQualite": "Sénateur",
        "libQualite": "SENATEUR",
        "libQualiteSex": "Sénateur 5ème République"
      },
      "organesRefs": [
        "PO78718"
      ],
      "election": {
        "lieu": {
          "numDepartement": "51"
        }
      },
      "mandature": {
        "premiereElection": "0"
      }
    },
    {
      "xsiType": "MandatSimple_Type",
      "uid": "PM741191",
      "acteurRef": "PA227029",
      "typeOrgane": "COMSENAT",
      "dateDebut": "2017-10-04T02:00:00.000+02:00",
      "preseance": "10",
      "nominPrincipale": "1",
      "infosQualite": {
        "codeQualite": "Membre",
        "libQualite": "Membre",
        "libQualiteSex": "Membre"
      },
      "organesRefs": [
        "PO516753"
      ]
    },
    {
      "xsiType": "MandatSimple_Type",
      "uid": "PM743554",
      "acteurRef": "PA227029",
      "typeOrgane": "CMP",
      "dateDebut": "2017-11-16T01:00:00.000+01:00",
      "datePublication": "2017-11-16T01:00:00.000+01:00",
      "dateFin": "2017-12-19T01:00:00.000+01:00",
      "preseance": "20",
      "nominPrincipale": "1",
      "infosQualite": {
        "codeQualite": "Titulaire",
        "libQualite": "Membre titulaire",
        "libQualiteSex": "Membre titulaire"
      },
      "organesRefs": [
        "PO742823"
      ]
    },
    {
      "xsiType": "MandatSimple_Type",
      "uid": "PM748151",
      "acteurRef": "PA227029",
      "typeOrgane": "API",
      "dateDebut": "2018-01-26T01:00:00.000+01:00",
      "preseance": "20",
      "nominPrincipale": "0",
      "infosQualite": {
        "codeQualite": "Membre",
        "libQualite": "Membre",
        "libQualiteSex": "Membre"
      },
      "organesRefs": [
        "PO201115"
      ]
    },
    {
      "xsiType": "MandatSimple_Type",
      "uid": "PM748199",
      "acteurRef": "PA227029",
      "typeOrgane": "API",
      "dateDebut": "2018-01-26T01:00:00.000+01:00",
      "preseance": "19",
      "nominPrincipale": "1",
      "infosQualite": {
        "codeQualite": "Autre membre du Bureau",
        "libQualite": "Membre du Bureau",
        "libQualiteSex": "Membre du Bureau"
      },
      "organesRefs": [
        "PO201115"
      ]
    }
  ]
}