{
  "uid": "PA747421",
  "etatCivil": {
    "ident": {
      "civ": "M.",
      "prenom": "Yves",
      "nom": "Bouloux",
      "alpha": "BOULOUX_Yves"
    },
    "infoNaissance": {
      "dateNais": "1960-08-30T01:00:00.000+01:00"
    }
  },
  "profession": {
    "socProcInsee": {}
  },
  "adresses": [
    {
      "xsiType": "AdresseSiteWeb_Type",
      "uid": "AD747432",
      "type": "23",
      "typeLibelle": "Url sénateur",
      "valElec": "https://www.senat.fr/senateur/bouloux_yves19747h.html"
    }
  ],
  "mandats": [
    {
      "xsiType": "MandatSimple_Type",
      "uid": "PM747425",
      "acteurRef": "PA747421",
      "typeOrgane": "GROUPESENAT",
      "dateDebut": "2017-12-18T01:00:00.000+01:00",
      "dateFin": "2017-12-18T01:00:00.000+01:00",
      "preseance": "4",
      "nominPrincipale": "1",
      "infosQualite": {
        "codeQualite": "Membre",
        "libQualite": "Membre",
        "libQualiteSex": "Membre"
      },
      "organesRefs": [
        "PO77708"
      ]
    },
    {
      "xsiType": "MandatSimple_Type",
      "uid": "PM747427",
      "acteurRef": "PA747421",
      "typeOrgane": "GROUPESENAT",
      "dateDebut": "2017-12-19T01:00:00.000+01:00",
      "preseance": "8",
      "nominPrincipale": "1",
      "infosQualite": {
        "codeQualite": "Membre apparenté",
        "libQualite": "Membre apparenté",
        "libQualiteSex": "Membre apparenté"
      },
      "organesRefs": [
        "PO286005"
      ]
    },
    {
      "xsiType": "MandatParlementaire_type",
      "uid": "PM747429",
      "acteurRef": "PA747421",
      "typeOrgane": "SENAT",
      "dateDebut": "2017-12-18T01:00:00.000+01:00",
      "preseance": "20",
      "nominPrincipale": "1",
      "infosQualite": {
        "codeQualite": "Sénateur",
        "libQualite": "SENATEUR",
        "libQualiteSex": "SENATEUR"
      },
      "organesRefs": [
        "PO78718"
      ],
      "election": {
        "lieu": {
          "numDepartement": "86"
        }
      },
      "mandature": {
        "premiereElection": "0"
      }
    },
    {
      "xsiType": "MandatSimple_Type",
      "uid": "PM747779",
      "acteurRef": "PA747421",
      "typeOrgane": "COMSENAT",
      "dateDebut": "2018-01-16T01:00:00.000+01:00",
      "preseance": "10",
      "nominPrincipale": "1",
      "infosQualite": {
        "codeQualite": "Membre",
        "libQualite": "Membre",
        "libQualiteSex": "Membre"
      },
      "organesRefs": [
        "PO516753"
      ]
    },
    {
      "xsiType": "MandatSimple_Type",
      "uid": "PM759620",
      "acteurRef": "PA747421",
      "typeOrgane": "COMSPSENAT",
      "dateDebut": "2018-10-10T02:00:00.000+02:00",
      "dateFin": "2018-11-12T01:00:00.000+01:00",
      "nominPrincipale": "1",
      "infosQualite": {
        "libQualite": "Membre",
        "libQualiteSex": "Membre"
      },
      "organesRefs": [
        "PO759377"
      ]
    }
  ]
}