{
  "uid": "PA267355",
  "etatCivil": {
    "ident": {
      "civ": "M.",
      "prenom": "Antoine",
      "nom": "Herth",
      "alpha": "Herth",
      "trigramme": "AHE"
    },
    "infoNaissance": {
      "dateNais": "1963-02-14T01:00:00.000+01:00",
      "villeNais": "Sélestat",
      "depNais": "Bas-Rhin",
      "paysNais": "France"
    }
  },
  "profession": {
    "libelleCourant": "Agriculteur",
    "socProcInsee": {
      "catSocPro": "Agriculteurs exploitants",
      "famSocPro": "Agriculteurs exploitants"
    }
  },
  "uriHatvp": "https://www.hatvp.fr/pages_nominatives/herth-antoine",
  "adresses": [
    {
      "xsiType": "AdressePostale_Type",
      "uid": "AD14012",
      "type": "2",
      "typeLibelle": "Adresse publiée de circonscription",
      "poids": "22",
      "intitule": "Permanence,",
      "numeroRue": "5",
      "nomRue": "Rue Roswag",
      "complementAdresse": "BP 80192",
      "codePostal": "67604",
      "ville": "Sélestat"
    },
    {
      "xsiType": "AdresseTelephonique_Type",
      "uid": "AD14013",
      "type": "11",
      "typeLibelle": "Téléphone",
      "poids": "22",
      "adresseDeRattachement": "AD14012",
      "valElec": "03 88 92 32 45"
    },
    {
      "xsiType": "AdressePostale_Type",
      "uid": "AD386925",
      "type": "0",
      "typeLibelle": "Adresse officielle",
      "poids": "1",
      "intitule": "Assemblée nationale,",
      "numeroRue": "126",
      "nomRue": "Rue de l'Université,",
      "codePostal": "75355",
      "ville": "Paris 07 SP"
    },
    {
      "xsiType": "AdresseMail_Type",
      "uid": "AD391914",
      "type": "15",
      "typeLibelle": "Mèl",
      "valElec": "antoine.herth@assemblee-nationale.fr"
    },
    {
      "xsiType": "AdresseMail_Type",
      "uid": "AD648735",
      "type": "15",
      "typeLibelle": "Mèl",
      "valElec": "info@antoine-herth.fr"
    },
    {
      "xsiType": "AdresseSiteWeb_Type",
      "uid": "AD725870",
      "type": "24",
      "typeLibelle": "Twitter",
      "valElec": "@antoineherth"
    },
    {
      "xsiType": "AdresseSiteWeb_Type",
      "uid": "AD726440",
      "type": "22",
      "typeLibelle": "Site internet",
      "valElec": "www.antoine-herth.fr/"
    },
    {
      "xsiType": "AdresseSiteWeb_Type",
      "uid": "AD726778",
      "type": "25",
      "typeLibelle": "Facebook",
      "valElec": "antoine.herth"
    }
  ],
  "mandats": [
    {
      "xsiType": "MandatParlementaire_type",
      "uid": "PM645581",
      "acteurRef": "PA267355",
      "legislature": "14",
      "typeOrgane": "ASSEMBLEE",
      "dateDebut": "2012-06-20T02:00:00.000+02:00",
      "dateFin": "2017-06-20T02:00:00.000+02:00",
      "preseance": "50",
      "nominPrincipale": "1",
      "infosQualite": {
        "codeQualite": "membre",
        "libQualite": "membre",
        "libQualiteSex": "membre"
      },
      "organesRefs": [
        "PO644420"
      ],
      "suppleant": {
        "dateDebut": "2012-06-20T02:00:00.000+02:00",
        "dateFin": "2017-06-20T02:00:00.000+02:00",
        "suppleantRef": "PA643166"
      },
      "election": {
        "lieu": {
          "region": "Grand Est",
          "regionType": "Métropolitain",
          "departement": "Bas-Rhin",
          "numDepartement": "67",
          "numCirco": "5"
        },
        "causeMandat": "élections générales",
        "refCirconscription": "PO644768"
      },
      "mandature": {
        "datePriseFonction": "2012-06-20T02:00:00.000+02:00",
        "causeFin": "Fin de législature",
        "premiereElection": "1",
        "placeHemicycle": "145"
      }
    },
    {
      "xsiType": "MandatSimple_Type",
      "uid": "PM657219",
      "acteurRef": "PA267355",
      "legislature": "14",
      "typeOrgane": "COMPER",
      "dateDebut": "2012-06-28T02:00:00.000+02:00",
      "datePublication": "2012-06-28T02:00:00.000+02:00",
      "dateFin": "2017-06-20T02:00:00.000+02:00",
      "preseance": "32",
      "nominPrincipale": "1",
      "infosQualite": {
        "codeQualite": "Membre",
        "libQualite": "Membre",
        "libQualiteSex": "Membre"
      },
      "organesRefs": [
        "PO419610"
      ]
    },
    {
      "xsiType": "MandatSimple_Type",
      "uid": "PM682085",
      "acteurRef": "PA267355",
      "legislature": "14",
      "typeOrgane": "GA",
      "dateDebut": "2012-10-16T02:00:00.000+02:00",
      "dateFin": "2017-06-20T02:00:00.000+02:00",
      "preseance": "20",
      "nominPrincipale": "1",
      "infosQualite": {
        "codeQualite": "Membre",
        "libQualite": "Membre",
        "libQualiteSex": "Membre"
      },
      "organesRefs": [
        "PO675835"
      ]
    },
    {
      "xsiType": "MandatSimple_Type",
      "uid": "PM682086",
      "acteurRef": "PA267355",
      "legislature": "14",
      "typeOrgane": "GA",
      "dateDebut": "2012-10-16T02:00:00.000+02:00",
      "dateFin": "2017-06-20T02:00:00.000+02:00",
      "preseance": "20",
      "nominPrincipale": "1",
      "infosQualite": {
        "codeQualite": "Membre",
        "libQualite": "Membre",
        "libQualiteSex": "Membre"
      },
      "organesRefs": [
        "PO675819"
      ]
    },
    {
      "xsiType": "MandatSimple_Type",
      "uid": "PM682087",
      "acteurRef": "PA267355",
      "legislature": "14",
      "typeOrgane": "GA",
      "dateDebut": "2012-10-16T02:00:00.000+02:00",
      "dateFin": "2017-06-20T02:00:00.000+02:00",
      "preseance": "20",
      "nominPrincipale": "1",
      "infosQualite": {
        "codeQualite": "Membre",
        "libQualite": "Membre",
        "libQualiteSex": "Membre"
      },
      "organesRefs": [
        "PO675714"
      ]
    },
    {
      "xsiType": "MandatSimple_Type",
      "uid": "PM682088",
      "acteurRef": "PA267355",
      "legislature": "14",
      "typeOrgane": "GA",
      "dateDebut": "2012-10-16T02:00:00.000+02:00",
      "dateFin": "2017-06-20T02:00:00.000+02:00",
      "preseance": "20",
      "nominPrincipale": "1",
      "infosQualite": {
        "codeQualite": "Membre",
        "libQualite": "Membre",
        "libQualiteSex": "Membre"
      },
      "organesRefs": [
        "PO675719"
      ]
    },
    {
      "xsiType": "MandatSimple_Type",
      "uid": "PM682089",
      "acteurRef": "PA267355",
      "legislature": "14",
      "typeOrgane": "GA",
      "dateDebut": "2012-10-16T02:00:00.000+02:00",
      "dateFin": "2017-06-20T02:00:00.000+02:00",
      "preseance": "20",
      "nominPrincipale": "1",
      "infosQualite": {
        "codeQualite": "Membre",
        "libQualite": "Membre",
        "libQualiteSex": "Membre"
      },
      "organesRefs": [
        "PO675841"
      ]
    },
    {
      "xsiType": "MandatSimple_Type",
      "uid": "PM682090",
      "acteurRef": "PA267355",
      "legislature": "14",
      "typeOrgane": "GA",
      "dateDebut": "2012-10-16T02:00:00.000+02:00",
      "dateFin": "2017-06-20T02:00:00.000+02:00",
      "preseance": "20",
      "nominPrincipale": "1",
      "infosQualite": {
        "codeQualite": "Membre",
        "libQualite": "Membre",
        "libQualiteSex": "Membre"
      },
      "organesRefs": [
        "PO675808"
      ]
    },
    {
      "xsiType": "MandatSimple_Type",
      "uid": "PM682091",
      "acteurRef": "PA267355",
      "legislature": "14",
      "typeOrgane": "GA",
      "dateDebut": "2012-10-16T02:00:00.000+02:00",
      "dateFin": "2017-06-20T02:00:00.000+02:00",
      "preseance": "20",
      "nominPrincipale": "1",
      "infosQualite": {
        "codeQualite": "Membre",
        "libQualite": "Membre",
        "libQualiteSex": "Membre"
      },
      "organesRefs": [
        "PO675810"
      ]
    },
    {
      "xsiType": "MandatSimple_Type",
      "uid": "PM684708",
      "acteurRef": "PA267355",
      "legislature": "14",
      "typeOrgane": "GA",
      "dateDebut": "2012-11-20T01:00:00.000+01:00",
      "dateFin": "2017-06-20T02:00:00.000+02:00",
      "preseance": "8",
      "nominPrincipale": "1",
      "infosQualite": {
        "codeQualite": "Vice-Président",
        "libQualite": "Vice-Président",
        "libQualiteSex": "Vice-Président"
      },
      "organesRefs": [
        "PO675841"
      ]
    },
    {
      "xsiType": "MandatSimple_Type",
      "uid": "PM688328",
      "acteurRef": "PA267355",
      "legislature": "14",
      "typeOrgane": "GE",
      "dateDebut": "2013-01-22T01:00:00.000+01:00",
      "dateFin": "2017-06-20T02:00:00.000+02:00",
      "preseance": "20",
      "nominPrincipale": "1",
      "infosQualite": {
        "codeQualite": "Membre",
        "libQualite": "Membre",
        "libQualiteSex": "Membre"
      },
      "organesRefs": [
        "PO686785"
      ]
    },
    {
      "xsiType": "MandatSimple_Type",
      "uid": "PM689720",
      "acteurRef": "PA267355",
      "legislature": "14",
      "typeOrgane": "GE",
      "dateDebut": "2013-01-11T01:00:00.000+01:00",
      "dateFin": "2017-06-20T02:00:00.000+02:00",
      "preseance": "20",
      "nominPrincipale": "1",
      "infosQualite": {
        "codeQualite": "Membre",
        "libQualite": "Membre",
        "libQualiteSex": "Membre"
      },
      "organesRefs": [
        "PO686617"
      ]
    },
    {
      "xsiType": "MandatSimple_Type",
      "uid": "PM691233",
      "acteurRef": "PA267355",
      "legislature": "14",
      "typeOrgane": "GE",
      "dateDebut": "2013-01-21T01:00:00.000+01:00",
      "dateFin": "2017-06-20T02:00:00.000+02:00",
      "preseance": "20",
      "nominPrincipale": "1",
      "infosQualite": {
        "codeQualite": "Membre",
        "libQualite": "Membre",
        "libQualiteSex": "Membre"
      },
      "organesRefs": [
        "PO687381"
      ]
    },
    {
      "xsiType": "MandatSimple_Type",
      "uid": "PM691357",
      "acteurRef": "PA267355",
      "legislature": "14",
      "typeOrgane": "GE",
      "dateDebut": "2013-02-12T01:00:00.000+01:00",
      "dateFin": "2017-06-20T02:00:00.000+02:00",
      "preseance": "20",
      "nominPrincipale": "1",
      "infosQualite": {
        "codeQualite": "Membre",
        "libQualite": "Membre",
        "libQualiteSex": "Membre"
      },
      "organesRefs": [
        "PO687120"
      ]
    },
    {
      "xsiType": "MandatSimple_Type",
      "uid": "PM692647",
      "acteurRef": "PA267355",
      "legislature": "14",
      "typeOrgane": "GA",
      "dateDebut": "2013-03-12T01:00:00.000+01:00",
      "dateFin": "2017-06-20T02:00:00.000+02:00",
      "preseance": "14",
      "nominPrincipale": "1",
      "infosQualite": {
        "codeQualite": "Secrétaire",
        "libQualite": "Secrétaire",
        "libQualiteSex": "Secrétaire"
      },
      "organesRefs": [
        "PO675719"
      ]
    },
    {
      "xsiType": "MandatSimple_Type",
      "uid": "PM692952",
      "acteurRef": "PA267355",
      "legislature": "14",
      "typeOrgane": "GE",
      "dateDebut": "2013-03-25T01:00:00.000+01:00",
      "dateFin": "2017-06-20T02:00:00.000+02:00",
      "preseance": "20",
      "nominPrincipale": "1",
      "infosQualite": {
        "codeQualite": "Membre",
        "libQualite": "Membre",
        "libQualiteSex": "Membre"
      },
      "organesRefs": [
        "PO689030"
      ]
    },
    {
      "xsiType": "MandatSimple_Type",
      "uid": "PM693509",
      "acteurRef": "PA267355",
      "legislature": "14",
      "typeOrgane": "GE",
      "dateDebut": "2013-01-21T01:00:00.000+01:00",
      "dateFin": "2017-06-20T02:00:00.000+02:00",
      "preseance": "20",
      "nominPrincipale": "1",
      "infosQualite": {
        "codeQualite": "Membre",
        "libQualite": "Membre",
        "libQualiteSex": "Membre"
      },
      "organesRefs": [
        "PO686213"
      ]
    },
    {
      "xsiType": "MandatSimple_Type",
      "uid": "PM695441",
      "acteurRef": "PA267355",
      "legislature": "14",
      "typeOrgane": "GE",
      "dateDebut": "2013-06-18T02:00:00.000+02:00",
      "dateFin": "2017-06-20T02:00:00.000+02:00",
      "preseance": "20",
      "nominPrincipale": "1",
      "infosQualite": {
        "codeQualite": "Membre",
        "libQualite": "Membre",
        "libQualiteSex": "Membre"
      },
      "organesRefs": [
        "PO688296"
      ]
    },
    {
      "xsiType": "MandatSimple_Type",
      "uid": "PM696343",
      "acteurRef": "PA267355",
      "legislature": "14",
      "typeOrgane": "GE",
      "dateDebut": "2013-07-19T02:00:00.000+02:00",
      "dateFin": "2017-06-20T02:00:00.000+02:00",
      "preseance": "20",
      "nominPrincipale": "1",
      "infosQualite": {
        "codeQualite": "Membre",
        "libQualite": "Membre",
        "libQualiteSex": "Membre"
      },
      "organesRefs": [
        "PO694572"
      ]
    },
    {
      "xsiType": "MandatSimple_Type",
      "uid": "PM696969",
      "acteurRef": "PA267355",
      "legislature": "14",
      "typeOrgane": "GE",
      "dateDebut": "2013-09-17T02:00:00.000+02:00",
      "dateFin": "2017-06-20T02:00:00.000+02:00",
      "preseance": "20",
      "nominPrincipale": "1",
      "infosQualite": {
        "codeQualite": "Membre",
        "libQualite": "Membre",
        "libQualiteSex": "Membre"
      },
      "organesRefs": [
        "PO695581"
      ]
    },
    {
      "xsiType": "MandatSimple_Type",
      "uid": "PM697546",
      "acteurRef": "PA267355",
      "legislature": "14",
      "typeOrgane": "GE",
      "dateDebut": "2013-10-04T02:00:00.000+02:00",
      "dateFin": "2017-06-20T02:00:00.000+02:00",
      "preseance": "20",
      "nominPrincipale": "1",
      "infosQualite": {
        "codeQualite": "Membre",
        "libQualite": "Membre",
        "libQualiteSex": "Membre"
      },
      "organesRefs": [
        "PO692301"
      ]
    },
    {
      "xsiType": "MandatSimple_Type",
      "uid": "PM700285",
      "acteurRef": "PA267355",
      "legislature": "14",
      "typeOrgane": "GE",
      "dateDebut": "2014-02-19T01:00:00.000+01:00",
      "dateFin": "2017-06-20T02:00:00.000+02:00",
      "preseance": "20",
      "nominPrincipale": "1",
      "infosQualite": {
        "codeQualite": "Membre",
        "libQualite": "Membre",
        "libQualiteSex": "Membre"
      },
      "organesRefs": [
        "PO694554"
      ]
    },
    {
      "xsiType": "MandatSimple_Type",
      "uid": "PM702864",
      "acteurRef": "PA267355",
      "legislature": "14",
      "typeOrgane": "GE",
      "dateDebut": "2014-08-02T02:00:00.000+02:00",
      "dateFin": "2017-06-20T02:00:00.000+02:00",
      "preseance": "20",
      "nominPrincipale": "1",
      "infosQualite": {
        "codeQualite": "Membre",
        "libQualite": "Membre",
        "libQualiteSex": "Membre"
      },
      "organesRefs": [
        "PO702209"
      ]
    },
    {
      "xsiType": "MandatSimple_Type",
      "uid": "PM708266",
      "acteurRef": "PA267355",
      "legislature": "14",
      "typeOrgane": "GP",
      "dateDebut": "2015-06-02T02:00:00.000+02:00",
      "datePublication": "2015-06-02T02:00:00.000+02:00",
      "dateFin": "2017-06-20T02:00:00.000+02:00",
      "preseance": "20",
      "nominPrincipale": "1",
      "infosQualite": {
        "codeQualite": "Membre",
        "libQualite": "Membre du",
        "libQualiteSex": "Membre du"
      },
      "organesRefs": [
        "PO707869"
      ]
    },
    {
      "xsiType": "MandatSimple_Type",
      "uid": "PM710495",
      "acteurRef": "PA267355",
      "typeOrgane": "PARPOL",
      "dateDebut": "2015-12-01T01:00:00.000+01:00",
      "dateFin": "2017-06-20T02:00:00.000+02:00",
      "preseance": "5",
      "nominPrincipale": "1",
      "infosQualite": {
        "codeQualite": "Membre",
        "libQualite": "Membre",
        "libQualiteSex": "Membre"
      },
      "organesRefs": [
        "PO710396"
      ]
    },
    {
      "xsiType": "MandatSimple_Type",
      "uid": "PM711486",
      "acteurRef": "PA267355",
      "legislature": "14",
      "typeOrgane": "ORGEXTPARL",
      "dateDebut": "2012-10-05T02:00:00.000+02:00",
      "dateFin": "2017-06-20T02:00:00.000+02:00",
      "preseance": "30",
      "nominPrincipale": "1",
      "infosQualite": {
        "codeQualite": "Suppléant",
        "libQualite": "Membre suppléant",
        "libQualiteSex": "Membre suppléant"
      },
      "organesRefs": [
        "PO431264"
      ]
    },
    {
      "xsiType": "MandatParlementaire_type",
      "uid": "PM723524",
      "acteurRef": "PA267355",
      "legislature": "15",
      "typeOrgane": "ASSEMBLEE",
      "dateDebut": "2017-06-18T02:00:00.000+02:00",
      "preseance": "50",
      "nominPrincipale": "1",
      "infosQualite": {
        "codeQualite": "membre",
        "libQualite": "membre",
        "libQualiteSex": "membre"
      },
      "organesRefs": [
        "PO717460"
      ],
      "suppleant": {
        "dateDebut": "2017-06-18T02:00:00.000+02:00",
        "suppleantRef": "PA722276"
      },
      "election": {
        "lieu": {
          "region": "Grand Est",
          "regionType": "Métropolitain",
          "departement": "Bas-Rhin",
          "numDepartement": "67",
          "numCirco": "5"
        },
        "causeMandat": "élections générales",
        "refCirconscription": "PO718134"
      },
      "mandature": {
        "datePriseFonction": "2017-06-21T02:00:00.000+02:00",
        "premiereElection": "1",
        "placeHemicycle": "145"
      },
      "collaborateurs": [
        {
          "qualite": "Mme",
          "prenom": "Sylvie",
          "nom": "Leonhart"
        },
        {
          "qualite": "M.",
          "prenom": "Fabien",
          "nom": "Hamm"
        },
        {
          "qualite": "Mme",
          "prenom": "Isabelle",
          "nom": "Deblir"
        }
      ]
    },
    {
      "xsiType": "MandatSimple_Type",
      "uid": "PM724803",
      "acteurRef": "PA267355",
      "legislature": "15",
      "typeOrgane": "GP",
      "dateDebut": "2017-06-21T02:00:00.000+02:00",
      "dateFin": "2017-06-26T02:00:00.000+02:00",
      "preseance": "28",
      "nominPrincipale": "1",
      "infosQualite": {
        "codeQualite": "Député non-inscrit",
        "libQualite": "Député non-inscrit",
        "libQualiteSex": "Député non-inscrit"
      },
      "organesRefs": [
        "PO723569"
      ]
    },
    {
      "xsiType": "MandatSimple_Type",
      "uid": "PM731475",
      "acteurRef": "PA267355",
      "legislature": "15",
      "typeOrgane": "GP",
      "dateDebut": "2017-06-27T02:00:00.000+02:00",
      "datePublication": "2017-06-28T02:00:00.000+02:00",
      "dateFin": "2017-11-28T01:00:00.000+01:00",
      "preseance": "20",
      "nominPrincipale": "1",
      "infosQualite": {
        "codeQualite": "Membre",
        "libQualite": "Membre du",
        "libQualiteSex": "Membre du"
      },
      "organesRefs": [
        "PO730952"
      ]
    },
    {
      "xsiType": "MandatSimple_Type",
      "uid": "PM731737",
      "acteurRef": "PA267355",
      "legislature": "15",
      "typeOrgane": "COMPER",
      "dateDebut": "2017-06-29T02:00:00.000+02:00",
      "datePublication": "2017-06-29T02:00:00.000+02:00",
      "dateFin": "2018-11-12T01:00:00.000+01:00",
      "preseance": "32",
      "nominPrincipale": "1",
      "infosQualite": {
        "codeQualite": "Membre",
        "libQualite": "Membre",
        "libQualiteSex": "Membre"
      },
      "organesRefs": [
        "PO419610"
      ]
    },
    {
      "xsiType": "MandatAvecSuppleant_Type",
      "uid": "PM732524",
      "acteurRef": "PA267355",
      "legislature": "15",
      "typeOrgane": "OFFPAR",
      "dateDebut": "2017-07-12T02:00:00.000+02:00",
      "datePublication": "2017-07-12T02:00:00.000+02:00",
      "preseance": "24",
      "nominPrincipale": "1",
      "infosQualite": {
        "codeQualite": "Membre",
        "libQualite": "Membre",
        "libQualiteSex": "Membre"
      },
      "organesRefs": [
        "PO273589"
      ]
    },
    {
      "xsiType": "MandatSimple_Type",
      "uid": "PM735113",
      "acteurRef": "PA267355",
      "legislature": "15",
      "typeOrgane": "GA",
      "dateDebut": "2017-09-26T02:00:00.000+02:00",
      "preseance": "20",
      "nominPrincipale": "0",
      "infosQualite": {
        "codeQualite": "Membre",
        "libQualite": "Membre",
        "libQualiteSex": "Membre"
      },
      "organesRefs": [
        "PO733537"
      ]
    },
    {
      "xsiType": "MandatSimple_Type",
      "uid": "PM735114",
      "acteurRef": "PA267355",
      "legislature": "15",
      "typeOrgane": "GA",
      "dateDebut": "2017-09-26T02:00:00.000+02:00",
      "preseance": "1",
      "nominPrincipale": "1",
      "infosQualite": {
        "codeQualite": "Président",
        "libQualite": "Président",
        "libQualiteSex": "Président"
      },
      "organesRefs": [
        "PO733537"
      ]
    },
    {
      "xsiType": "MandatSimple_Type",
      "uid": "PM737558",
      "acteurRef": "PA267355",
      "legislature": "15",
      "typeOrgane": "GA",
      "dateDebut": "2017-10-05T02:00:00.000+02:00",
      "preseance": "20",
      "nominPrincipale": "0",
      "infosQualite": {
        "codeQualite": "Membre",
        "libQualite": "Membre",
        "libQualiteSex": "Membre"
      },
      "organesRefs": [
        "PO732964"
      ]
    },
    {
      "xsiType": "MandatSimple_Type",
      "uid": "PM737559",
      "acteurRef": "PA267355",
      "legislature": "15",
      "typeOrgane": "GA",
      "dateDebut": "2017-10-05T02:00:00.000+02:00",
      "preseance": "20",
      "nominPrincipale": "1",
      "infosQualite": {
        "codeQualite": "Membre",
        "libQualite": "Membre",
        "libQualiteSex": "Membre"
      },
      "organesRefs": [
        "PO733157"
      ]
    },
    {
      "xsiType": "MandatSimple_Type",
      "uid": "PM737560",
      "acteurRef": "PA267355",
      "legislature": "15",
      "typeOrgane": "GA",
      "dateDebut": "2017-10-05T02:00:00.000+02:00",
      "preseance": "20",
      "nominPrincipale": "1",
      "infosQualite": {
        "codeQualite": "Membre",
        "libQualite": "Membre",
        "libQualiteSex": "Membre"
      },
      "organesRefs": [
        "PO733182"
      ]
    },
    {
      "xsiType": "MandatSimple_Type",
      "uid": "PM737561",
      "acteurRef": "PA267355",
      "legislature": "15",
      "typeOrgane": "GA",
      "dateDebut": "2017-10-05T02:00:00.000+02:00",
      "preseance": "20",
      "nominPrincipale": "0",
      "infosQualite": {
        "codeQualite": "Membre",
        "libQualite": "Membre",
        "libQualiteSex": "Membre"
      },
      "organesRefs": [
        "PO733267"
      ]
    },
    {
      "xsiType": "MandatSimple_Type",
      "uid": "PM737562",
      "acteurRef": "PA267355",
      "legislature": "15",
      "typeOrgane": "GA",
      "dateDebut": "2017-10-05T02:00:00.000+02:00",
      "preseance": "20",
      "nominPrincipale": "1",
      "infosQualite": {
        "codeQualite": "Membre",
        "libQualite": "Membre",
        "libQualiteSex": "Membre"
      },
      "organesRefs": [
        "PO733322"
      ]
    },
    {
      "xsiType": "MandatSimple_Type",
      "uid": "PM737563",
      "acteurRef": "PA267355",
      "legislature": "15",
      "typeOrgane": "GA",
      "dateDebut": "2017-10-05T02:00:00.000+02:00",
      "preseance": "20",
      "nominPrincipale": "1",
      "infosQualite": {
        "codeQualite": "Membre",
        "libQualite": "Membre",
        "libQualiteSex": "Membre"
      },
      "organesRefs": [
        "PO733397"
      ]
    },
    {
      "xsiType": "MandatSimple_Type",
      "uid": "PM737564",
      "acteurRef": "PA267355",
      "legislature": "15",
      "typeOrgane": "GA",
      "dateDebut": "2017-10-05T02:00:00.000+02:00",
      "preseance": "20",
      "nominPrincipale": "0",
      "infosQualite": {
        "codeQualite": "Membre",
        "libQualite": "Membre",
        "libQualiteSex": "Membre"
      },
      "organesRefs": [
        "PO733597"
      ]
    },
    {
      "xsiType": "MandatSimple_Type",
      "uid": "PM737565",
      "acteurRef": "PA267355",
      "legislature": "15",
      "typeOrgane": "GA",
      "dateDebut": "2017-10-05T02:00:00.000+02:00",
      "preseance": "20",
      "nominPrincipale": "1",
      "infosQualite": {
        "codeQualite": "Membre",
        "libQualite": "Membre",
        "libQualiteSex": "Membre"
      },
      "organesRefs": [
        "PO733607"
      ]
    },
    {
      "xsiType": "MandatMission_Type",
      "uid": "PM740474",
      "acteurRef": "PA267355",
      "legislature": "15",
      "typeOrgane": "MISINFOCOM",
      "dateDebut": "2017-10-18T02:00:00.000+02:00",
      "datePublication": "2017-10-19T02:00:00.000+02:00",
      "dateFin": "2018-04-06T02:00:00.000+02:00",
      "preseance": "20",
      "nominPrincipale": "1",
      "infosQualite": {
        "codeQualite": "Membre",
        "libQualite": "Membre",
        "libQualiteSex": "Membre"
      },
      "organesRefs": [
        "PO740454"
      ]
    },
    {
      "xsiType": "MandatSimple_Type",
      "uid": "PM740622",
      "acteurRef": "PA267355",
      "legislature": "15",
      "typeOrgane": "GA",
      "dateDebut": "2017-10-19T02:00:00.000+02:00",
      "preseance": "8",
      "nominPrincipale": "1",
      "infosQualite": {
        "codeQualite": "Vice-Président",
        "libQualite": "Vice-Président",
        "libQualiteSex": "Vice-Président"
      },
      "organesRefs": [
        "PO733267"
      ]
    },
    {
      "xsiType": "MandatSimple_Type",
      "uid": "PM741781",
      "acteurRef": "PA267355",
      "legislature": "15",
      "typeOrgane": "GA",
      "dateDebut": "2017-10-25T02:00:00.000+02:00",
      "preseance": "8",
      "nominPrincipale": "1",
      "infosQualite": {
        "codeQualite": "Vice-Président",
        "libQualite": "Vice-Président",
        "libQualiteSex": "Vice-Président"
      },
      "organesRefs": [
        "PO733597"
      ]
    },
    {
      "xsiType": "MandatMission_Type",
      "uid": "PM742005",
      "acteurRef": "PA267355",
      "legislature": "15",
      "typeOrgane": "MISINFOCOM",
      "dateDebut": "2017-10-26T02:00:00.000+02:00",
      "datePublication": "2017-10-27T02:00:00.000+02:00",
      "dateFin": "2018-04-06T02:00:00.000+02:00",
      "preseance": "8",
      "nominPrincipale": "1",
      "infosQualite": {
        "codeQualite": "Secrétaire",
        "libQualite": "Secrétaire",
        "libQualiteSex": "Secrétaire"
      },
      "organesRefs": [
        "PO740454"
      ]
    },
    {
      "xsiType": "MandatSimple_Type",
      "uid": "PM742161",
      "acteurRef": "PA267355",
      "legislature": "15",
      "typeOrgane": "API",
      "dateDebut": "2017-10-27T02:00:00.000+02:00",
      "datePublication": "2017-10-28T02:00:00.000+02:00",
      "preseance": "20",
      "nominPrincipale": "1",
      "infosQualite": {
        "codeQualite": "Membre",
        "libQualite": "Membre",
        "libQualiteSex": "Membre"
      },
      "organesRefs": [
        "PO201115"
      ]
    },
    {
      "xsiType": "MandatSimple_Type",
      "uid": "PM744462",
      "acteurRef": "PA267355",
      "legislature": "15",
      "typeOrgane": "GP",
      "dateDebut": "2017-11-29T01:00:00.000+01:00",
      "dateFin": "2019-06-10T02:00:00.000+02:00",
      "preseance": "20",
      "nominPrincipale": "1",
      "infosQualite": {
        "codeQualite": "Membre",
        "libQualite": "Membre du",
        "libQualiteSex": "Membre du"
      },
      "organesRefs": [
        "PO744425"
      ]
    },
    {
      "xsiType": "MandatSimple_Type",
      "uid": "PM744482",
      "acteurRef": "PA267355",
      "legislature": "15",
      "typeOrgane": "GA",
      "dateDebut": "2017-11-14T01:00:00.000+01:00",
      "preseance": "8",
      "nominPrincipale": "1",
      "infosQualite": {
        "codeQualite": "Vice-Président",
        "libQualite": "Vice-Président",
        "libQualiteSex": "Vice-Président"
      },
      "organesRefs": [
        "PO732964"
      ]
    },
    {
      "xsiType": "MandatSimple_Type",
      "uid": "PM746003",
      "acteurRef": "PA267355",
      "typeOrgane": "PARPOL",
      "dateDebut": "2017-12-01T01:00:00.000+01:00",
      "preseance": "5",
      "nominPrincipale": "1",
      "infosQualite": {
        "codeQualite": "Membre",
        "libQualite": "Membre",
        "libQualiteSex": "Membre"
      },
      "organesRefs": [
        "PO744864"
      ]
    },
    {
      "xsiType": "MandatSimple_Type",
      "uid": "PM749304",
      "acteurRef": "PA267355",
      "legislature": "15",
      "typeOrgane": "GE",
      "dateDebut": "2018-02-09T01:00:00.000+01:00",
      "preseance": "20",
      "nominPrincipale": "1",
      "infosQualite": {
        "codeQualite": "Membre",
        "libQualite": "Membre",
        "libQualiteSex": "Membre"
      },
      "organesRefs": [
        "PO747266"
      ]
    },
    {
      "xsiType": "MandatSimple_Type",
      "uid": "PM749307",
      "acteurRef": "PA267355",
      "legislature": "15",
      "typeOrgane": "GE",
      "dateDebut": "2018-02-09T01:00:00.000+01:00",
      "preseance": "20",
      "nominPrincipale": "1",
      "infosQualite": {
        "codeQualite": "Membre",
        "libQualite": "Membre",
        "libQualiteSex": "Membre"
      },
      "organesRefs": [
        "PO746735"
      ]
    },
    {
      "xsiType": "MandatSimple_Type",
      "uid": "PM750802",
      "acteurRef": "PA267355",
      "legislature": "15",
      "typeOrgane": "GE",
      "dateDebut": "2018-02-16T01:00:00.000+01:00",
      "preseance": "20",
      "nominPrincipale": "1",
      "infosQualite": {
        "codeQualite": "Membre",
        "libQualite": "Membre",
        "libQualiteSex": "Membre"
      },
      "organesRefs": [
        "PO747027"
      ]
    },
    {
      "xsiType": "MandatSimple_Type",
      "uid": "PM751739",
      "acteurRef": "PA267355",
      "legislature": "15",
      "typeOrgane": "GE",
      "dateDebut": "2018-02-22T01:00:00.000+01:00",
      "preseance": "20",
      "nominPrincipale": "1",
      "infosQualite": {
        "codeQualite": "Membre",
        "libQualite": "Membre",
        "libQualiteSex": "Membre"
      },
      "organesRefs": [
        "PO746679"
      ]
    },
    {
      "xsiType": "MandatSimple_Type",
      "uid": "PM752199",
      "acteurRef": "PA267355",
      "legislature": "15",
      "typeOrgane": "GE",
      "dateDebut": "2018-02-28T01:00:00.000+01:00",
      "preseance": "20",
      "nominPrincipale": "1",
      "infosQualite": {
        "codeQualite": "Membre",
        "libQualite": "Membre",
        "libQualiteSex": "Membre"
      },
      "organesRefs": [
        "PO747286"
      ]
    },
    {
      "xsiType": "MandatSimple_Type",
      "uid": "PM752400",
      "acteurRef": "PA267355",
      "legislature": "15",
      "typeOrgane": "GE",
      "dateDebut": "2018-03-05T01:00:00.000+01:00",
      "preseance": "20",
      "nominPrincipale": "1",
      "infosQualite": {
        "codeQualite": "Membre",
        "libQualite": "Membre",
        "libQualiteSex": "Membre"
      },
      "organesRefs": [
        "PO746930"
      ]
    },
    {
      "xsiType": "MandatSimple_Type",
      "uid": "PM752445",
      "acteurRef": "PA267355",
      "legislature": "15",
      "typeOrgane": "GE",
      "dateDebut": "2018-03-06T01:00:00.000+01:00",
      "preseance": "20",
      "nominPrincipale": "0",
      "infosQualite": {
        "codeQualite": "Membre",
        "libQualite": "Membre",
        "libQualiteSex": "Membre"
      },
      "organesRefs": [
        "PO746920"
      ]
    },
    {
      "xsiType": "MandatSimple_Type",
      "uid": "PM753051",
      "acteurRef": "PA267355",
      "legislature": "15",
      "typeOrgane": "GE",
      "dateDebut": "2018-03-08T01:00:00.000+01:00",
      "preseance": "20",
      "nominPrincipale": "1",
      "infosQualite": {
        "codeQualite": "Membre",
        "libQualite": "Membre",
        "libQualiteSex": "Membre"
      },
      "organesRefs": [
        "PO746811"
      ]
    },
    {
      "xsiType": "MandatSimple_Type",
      "uid": "PM753114",
      "acteurRef": "PA267355",
      "legislature": "15",
      "typeOrgane": "GE",
      "dateDebut": "2018-03-08T01:00:00.000+01:00",
      "preseance": "20",
      "nominPrincipale": "1",
      "infosQualite": {
        "codeQualite": "Membre",
        "libQualite": "Membre",
        "libQualiteSex": "Membre"
      },
      "organesRefs": [
        "PO747037"
      ]
    },
    {
      "xsiType": "MandatSimple_Type",
      "uid": "PM753796",
      "acteurRef": "PA267355",
      "legislature": "15",
      "typeOrgane": "GE",
      "dateDebut": "2018-03-19T01:00:00.000+01:00",
      "preseance": "20",
      "nominPrincipale": "1",
      "infosQualite": {
        "codeQualite": "Membre",
        "libQualite": "Membre",
        "libQualiteSex": "Membre"
      },
      "organesRefs": [
        "PO747084"
      ]
    },
    {
      "xsiType": "MandatSimple_Type",
      "uid": "PM754285",
      "acteurRef": "PA267355",
      "legislature": "15",
      "typeOrgane": "GE",
      "dateDebut": "2018-03-26T02:00:00.000+02:00",
      "preseance": "20",
      "nominPrincipale": "0",
      "infosQualite": {
        "codeQualite": "Membre",
        "libQualite": "Membre",
        "libQualiteSex": "Membre"
      },
      "organesRefs": [
        "PO747256"
      ]
    },
    {
      "xsiType": "MandatSimple_Type",
      "uid": "PM754411",
      "acteurRef": "PA267355",
      "legislature": "15",
      "typeOrgane": "GE",
      "dateDebut": "2018-03-27T02:00:00.000+02:00",
      "preseance": "8",
      "nominPrincipale": "1",
      "infosQualite": {
        "codeQualite": "Vice-Président",
        "libQualite": "Vice-Président",
        "libQualiteSex": "Vice-Président"
      },
      "organesRefs": [
        "PO746920"
      ]
    },
    {
      "xsiType": "MandatSimple_Type",
      "uid": "PM756970",
      "acteurRef": "PA267355",
      "legislature": "15",
      "typeOrgane": "ORGEXTPARL",
      "dateDebut": "2018-03-08T01:00:00.000+01:00",
      "datePublication": "2018-03-09T01:00:00.000+01:00",
      "preseance": "20",
      "nominPrincipale": "1",
      "infosQualite": {
        "codeQualite": "Titulaire",
        "libQualite": "Membre titulaire",
        "libQualiteSex": "Membre titulaire"
      },
      "organesRefs": [
        "PO756933"
      ]
    },
    {
      "xsiType": "MandatMission_Type",
      "uid": "PM757593",
      "acteurRef": "PA267355",
      "legislature": "15",
      "typeOrgane": "MISINFOCOM",
      "dateDebut": "2018-07-04T02:00:00.000+02:00",
      "datePublication": "2018-07-05T02:00:00.000+02:00",
      "preseance": "20",
      "nominPrincipale": "1",
      "infosQualite": {
        "codeQualite": "Membre",
        "libQualite": "Membre",
        "libQualiteSex": "Membre"
      },
      "organesRefs": [
        "PO757572"
      ]
    },
    {
      "xsiType": "MandatSimple_Type",
      "uid": "PM758158",
      "acteurRef": "PA267355",
      "legislature": "15",
      "typeOrgane": "GE",
      "dateDebut": "2018-07-18T02:00:00.000+02:00",
      "preseance": "8",
      "nominPrincipale": "1",
      "infosQualite": {
        "codeQualite": "Vice-Président",
        "libQualite": "Vice-Président",
        "libQualiteSex": "Vice-Président"
      },
      "organesRefs": [
        "PO747256"
      ]
    },
    {
      "xsiType": "MandatSimple_Type",
      "uid": "PM760184",
      "acteurRef": "PA267355",
      "legislature": "15",
      "typeOrgane": "COMPER",
      "dateDebut": "2018-11-13T01:00:00.000+01:00",
      "datePublication": "2018-11-13T01:00:00.000+01:00",
      "dateFin": "2018-11-28T01:00:00.000+01:00",
      "preseance": "32",
      "nominPrincipale": "1",
      "infosQualite": {
        "codeQualite": "Membre",
        "libQualite": "Membre",
        "libQualiteSex": "Membre"
      },
      "organesRefs": [
        "PO59047"
      ]
    },
    {
      "xsiType": "MandatSimple_Type",
      "uid": "PM760780",
      "acteurRef": "PA267355",
      "legislature": "15",
      "typeOrgane": "COMPER",
      "dateDebut": "2018-11-29T01:00:00.000+01:00",
      "datePublication": "2018-11-29T01:00:00.000+01:00",
      "dateFin": "2018-11-30T01:00:00.000+01:00",
      "preseance": "32",
      "nominPrincipale": "1",
      "infosQualite": {
        "codeQualite": "Membre",
        "libQualite": "Membre",
        "libQualiteSex": "Membre"
      },
      "organesRefs": [
        "PO419610"
      ]
    },
    {
      "xsiType": "MandatSimple_Type",
      "uid": "PM760793",
      "acteurRef": "PA267355",
      "legislature": "15",
      "typeOrgane": "COMPER",
      "dateDebut": "2018-12-01T01:00:00.000+01:00",
      "datePublication": "2018-12-01T01:00:00.000+01:00",
      "dateFin": "2018-12-07T01:00:00.000+01:00",
      "preseance": "32",
      "nominPrincipale": "1",
      "infosQualite": {
        "codeQualite": "Membre",
        "libQualite": "Membre",
        "libQualiteSex": "Membre"
      },
      "organesRefs": [
        "PO59047"
      ]
    },
    {
      "xsiType": "MandatSimple_Type",
      "uid": "PM760852",
      "acteurRef": "PA267355",
      "legislature": "15",
      "typeOrgane": "COMPER",
      "dateDebut": "2018-12-08T01:00:00.000+01:00",
      "datePublication": "2018-12-08T01:00:00.000+01:00",
      "preseance": "32",
      "nominPrincipale": "1",
      "infosQualite": {
        "codeQualite": "Membre",
        "libQualite": "Membre",
        "libQualiteSex": "Membre"
      },
      "organesRefs": [
        "PO419610"
      ]
    },
    {
      "xsiType": "MandatSimple_Type",
      "uid": "PM765429",
      "acteurRef": "PA267355",
      "legislature": "15",
      "typeOrgane": "GE",
      "dateDebut": "2019-05-29T02:00:00.000+02:00",
      "preseance": "20",
      "nominPrincipale": "1",
      "infosQualite": {
        "codeQualite": "Membre",
        "libQualite": "Membre",
        "libQualiteSex": "Membre"
      },
      "organesRefs": [
        "PO763264"
      ]
    },
    {
      "xsiType": "MandatSimple_Type",
      "uid": "PM765664",
      "acteurRef": "PA267355",
      "legislature": "15",
      "typeOrgane": "GP",
      "dateDebut": "2019-06-11T02:00:00.000+02:00",
      "dateFin": "2019-09-27T02:00:00.000+02:00",
      "preseance": "20",
      "nominPrincipale": "1",
      "infosQualite": {
        "codeQualite": "Membre",
        "libQualite": "Membre du",
        "libQualiteSex": "Membre du"
      },
      "organesRefs": [
        "PO765636"
      ]
    },
    {
      "xsiType": "MandatSimple_Type",
      "uid": "PM767245",
      "acteurRef": "PA267355",
      "legislature": "15",
      "typeOrgane": "GP",
      "dateDebut": "2019-09-28T02:00:00.000+02:00",
      "datePublication": "2019-09-27T02:00:00.000+02:00",
      "preseance": "20",
      "nominPrincipale": "1",
      "infosQualite": {
        "codeQualite": "Membre",
        "libQualite": "Membre du",
        "libQualiteSex": "Membre du"
      },
      "organesRefs": [
        "PO767217"
      ]
    },
    {
      "xsiType": "MandatSimple_Type",
      "uid": "PM768188",
      "acteurRef": "PA267355",
      "legislature": "15",
      "typeOrgane": "GEVI",
      "dateDebut": "2019-11-13T01:00:00.000+01:00",
      "preseance": "20",
      "nominPrincipale": "1",
      "infosQualite": {
        "codeQualite": "Membre",
        "libQualite": "Membre",
        "libQualiteSex": "Membre"
      },
      "organesRefs": [
        "PO733217"
      ]
    }
  ]
}