{
  "xsiType": "OrganeExtraParlementaire_type",
  "uid": "PO717301",
  "codeType": "ORGEXTPARL",
  "libelle": "Conseil d'administration de l'agence nationale de santé publique",
  "libelleAbrege": "ANSP",
  "libelleAbrev": "361",
  "viMoDe": {
    "dateDebut": "2017-02-24T01:00:00.000+01:00"
  },
  "regime": "5ème République",
  "regimeJuridique": "Article L. 1413-9 du code de la santé publique"
}