{
  "uid": "PA721226",
  "etatCivil": {
    "ident": {
      "civ": "Mme",
      "prenom": "Sabine",
      "nom": "Rubin",
      "alpha": "Rubin",
      "trigramme": "SRU"
    },
    "infoNaissance": {
      "dateNais": "1960-08-13T01:00:00.000+01:00",
      "villeNais": "Paris",
      "depNais": "Paris",
      "paysNais": "France"
    }
  },
  "profession": {
    "libelleCourant": "Fonctionnaire de catégorie A",
    "socProcInsee": {
      "catSocPro": "Cadres de la fonction publique, professions intellectuelles et  artistiques",
      "famSocPro": "Cadres et professions intellectuelles supérieures"
    }
  },
  "uriHatvp": "https://www.hatvp.fr/pages_nominatives/rubin-sabine",
  "adresses": [
    {
      "xsiType": "AdressePostale_Type",
      "uid": "AD721228",
      "type": "0",
      "typeLibelle": "Adresse officielle",
      "poids": "1",
      "intitule": "Assemblée nationale,",
      "numeroRue": "126",
      "nomRue": "Rue de l'Université,",
      "codePostal": "75355",
      "ville": "Paris 07 SP"
    },
    {
      "xsiType": "AdresseSiteWeb_Type",
      "uid": "AD726136",
      "type": "24",
      "typeLibelle": "Twitter",
      "valElec": "@SabineRubinFI93"
    },
    {
      "xsiType": "AdresseSiteWeb_Type",
      "uid": "AD726166",
      "type": "25",
      "typeLibelle": "Facebook",
      "valElec": "insoumis9309"
    },
    {
      "xsiType": "AdresseMail_Type",
      "uid": "AD728227",
      "type": "15",
      "typeLibelle": "Mèl",
      "valElec": "sabine.rubin@assemblee-nationale.fr"
    }
  ],
  "mandats": [
    {
      "xsiType": "MandatParlementaire_type",
      "uid": "PM723208",
      "acteurRef": "PA721226",
      "legislature": "15",
      "typeOrgane": "ASSEMBLEE",
      "dateDebut": "2017-06-18T02:00:00.000+02:00",
      "preseance": "50",
      "nominPrincipale": "1",
      "infosQualite": {
        "codeQualite": "membre",
        "libQualite": "membre",
        "libQualiteSex": "membre"
      },
      "organesRefs": [
        "PO717460"
      ],
      "suppleant": {
        "dateDebut": "2017-06-18T02:00:00.000+02:00",
        "suppleantRef": "PA721230"
      },
      "election": {
        "lieu": {
          "region": "Ile-de-France",
          "regionType": "Métropolitain",
          "departement": "Seine-Saint-Denis",
          "numDepartement": "93",
          "numCirco": "9"
        },
        "causeMandat": "élections générales",
        "refCirconscription": "PO718474"
      },
      "mandature": {
        "datePriseFonction": "2017-06-21T02:00:00.000+02:00",
        "premiereElection": "0",
        "placeHemicycle": "628"
      },
      "collaborateurs": [
        {
          "qualite": "M.",
          "prenom": "Charles",
          "nom": "Alonso"
        },
        {
          "qualite": "M.",
          "prenom": "Camille",
          "nom": "Court"
        },
        {
          "qualite": "Mme",
          "prenom": "Delphine",
          "nom": "Debord"
        },
        {
          "qualite": "M.",
          "prenom": "Bastien",
          "nom": "Mignot"
        }
      ]
    },
    {
      "xsiType": "MandatSimple_Type",
      "uid": "PM724645",
      "acteurRef": "PA721226",
      "legislature": "15",
      "typeOrgane": "GP",
      "dateDebut": "2017-06-21T02:00:00.000+02:00",
      "dateFin": "2017-06-26T02:00:00.000+02:00",
      "preseance": "28",
      "nominPrincipale": "1",
      "infosQualite": {
        "codeQualite": "Député non-inscrit",
        "libQualite": "Député non-inscrit",
        "libQualiteSex": "Députée non-inscrite"
      },
      "organesRefs": [
        "PO723569"
      ]
    },
    {
      "xsiType": "MandatSimple_Type",
      "uid": "PM731525",
      "acteurRef": "PA721226",
      "legislature": "15",
      "typeOrgane": "GP",
      "dateDebut": "2017-06-27T02:00:00.000+02:00",
      "datePublication": "2017-06-28T02:00:00.000+02:00",
      "preseance": "20",
      "nominPrincipale": "1",
      "infosQualite": {
        "codeQualite": "Membre",
        "libQualite": "Membre du",
        "libQualiteSex": "Membre du"
      },
      "organesRefs": [
        "PO730958"
      ]
    },
    {
      "xsiType": "MandatSimple_Type",
      "uid": "PM731670",
      "acteurRef": "PA721226",
      "legislature": "15",
      "typeOrgane": "COMPER",
      "dateDebut": "2017-06-29T02:00:00.000+02:00",
      "datePublication": "2017-06-29T02:00:00.000+02:00",
      "dateFin": "2018-07-09T02:00:00.000+02:00",
      "preseance": "32",
      "nominPrincipale": "1",
      "infosQualite": {
        "codeQualite": "Membre",
        "libQualite": "Membre",
        "libQualiteSex": "Membre"
      },
      "organesRefs": [
        "PO419604"
      ]
    },
    {
      "xsiType": "MandatSimple_Type",
      "uid": "PM734825",
      "acteurRef": "PA721226",
      "legislature": "15",
      "typeOrgane": "ORGEXTPARL",
      "dateDebut": "2017-09-13T02:00:00.000+02:00",
      "datePublication": "2017-09-14T02:00:00.000+02:00",
      "preseance": "30",
      "nominPrincipale": "1",
      "infosQualite": {
        "codeQualite": "Suppléant",
        "libQualite": "Membre suppléant",
        "libQualiteSex": "Membre suppléante"
      },
      "organesRefs": [
        "PO709158"
      ]
    },
    {
      "xsiType": "MandatSimple_Type",
      "uid": "PM736578",
      "acteurRef": "PA721226",
      "legislature": "15",
      "typeOrgane": "GA",
      "dateDebut": "2017-10-02T02:00:00.000+02:00",
      "preseance": "20",
      "nominPrincipale": "0",
      "infosQualite": {
        "codeQualite": "Membre",
        "libQualite": "Membre",
        "libQualiteSex": "Membre"
      },
      "organesRefs": [
        "PO733232"
      ]
    },
    {
      "xsiType": "MandatSimple_Type",
      "uid": "PM740361",
      "acteurRef": "PA721226",
      "legislature": "15",
      "typeOrgane": "GA",
      "dateDebut": "2017-10-17T02:00:00.000+02:00",
      "preseance": "20",
      "nominPrincipale": "0",
      "infosQualite": {
        "codeQualite": "Membre",
        "libQualite": "Membre",
        "libQualiteSex": "Membre"
      },
      "organesRefs": [
        "PO733382"
      ]
    },
    {
      "xsiType": "MandatSimple_Type",
      "uid": "PM740362",
      "acteurRef": "PA721226",
      "legislature": "15",
      "typeOrgane": "GA",
      "dateDebut": "2017-10-17T02:00:00.000+02:00",
      "preseance": "20",
      "nominPrincipale": "0",
      "infosQualite": {
        "codeQualite": "Membre",
        "libQualite": "Membre",
        "libQualiteSex": "Membre"
      },
      "organesRefs": [
        "PO733627"
      ]
    },
    {
      "xsiType": "MandatMission_Type",
      "uid": "PM741974",
      "acteurRef": "PA721226",
      "legislature": "15",
      "typeOrgane": "MISINFO",
      "dateDebut": "2017-09-27T02:00:00.000+02:00",
      "dateFin": "2018-07-11T02:00:00.000+02:00",
      "preseance": "10",
      "nominPrincipale": "1",
      "infosQualite": {
        "codeQualite": "Membre",
        "libQualite": "Membre",
        "libQualiteSex": "Membre"
      },
      "organesRefs": [
        "PO741916"
      ]
    },
    {
      "xsiType": "MandatSimple_Type",
      "uid": "PM742889",
      "acteurRef": "PA721226",
      "legislature": "15",
      "typeOrgane": "GA",
      "dateDebut": "2017-10-31T01:00:00.000+01:00",
      "preseance": "8",
      "nominPrincipale": "1",
      "infosQualite": {
        "codeQualite": "Vice-Président",
        "libQualite": "Vice-Président",
        "libQualiteSex": "Vice-Présidente"
      },
      "organesRefs": [
        "PO733382"
      ]
    },
    {
      "xsiType": "MandatSimple_Type",
      "uid": "PM743288",
      "acteurRef": "PA721226",
      "legislature": "15",
      "typeOrgane": "GA",
      "dateDebut": "2017-11-14T01:00:00.000+01:00",
      "preseance": "8",
      "nominPrincipale": "1",
      "infosQualite": {
        "codeQualite": "Vice-Président",
        "libQualite": "Vice-Président",
        "libQualiteSex": "Vice-Présidente"
      },
      "organesRefs": [
        "PO733232"
      ]
    },
    {
      "xsiType": "MandatSimple_Type",
      "uid": "PM743938",
      "acteurRef": "PA721226",
      "legislature": "15",
      "typeOrgane": "GA",
      "dateDebut": "2017-11-22T01:00:00.000+01:00",
      "preseance": "8",
      "nominPrincipale": "1",
      "infosQualite": {
        "codeQualite": "Vice-Président",
        "libQualite": "Vice-Président",
        "libQualiteSex": "Vice-Présidente"
      },
      "organesRefs": [
        "PO733627"
      ]
    },
    {
      "xsiType": "MandatSimple_Type",
      "uid": "PM744813",
      "acteurRef": "PA721226",
      "legislature": "15",
      "typeOrgane": "CNPS",
      "dateDebut": "2017-12-06T01:00:00.000+01:00",
      "datePublication": "2017-12-06T01:00:00.000+01:00",
      "dateFin": "2018-07-31T02:00:00.000+02:00",
      "preseance": "20",
      "nominPrincipale": "1",
      "infosQualite": {
        "codeQualite": "Membre",
        "libQualite": "Membre",
        "libQualiteSex": "Membre"
      },
      "organesRefs": [
        "PO744107"
      ]
    },
    {
      "xsiType": "MandatSimple_Type",
      "uid": "PM745565",
      "acteurRef": "PA721226",
      "typeOrgane": "PARPOL",
      "dateDebut": "2017-12-01T01:00:00.000+01:00",
      "preseance": "5",
      "nominPrincipale": "1",
      "infosQualite": {
        "codeQualite": "Membre",
        "libQualite": "Membre",
        "libQualiteSex": "Membre"
      },
      "organesRefs": [
        "PO744856"
      ]
    },
    {
      "xsiType": "MandatMission_Type",
      "uid": "PM746725",
      "acteurRef": "PA721226",
      "legislature": "15",
      "typeOrgane": "MISINFO",
      "dateDebut": "2017-12-20T01:00:00.000+01:00",
      "dateFin": "2018-07-09T02:00:00.000+02:00",
      "preseance": "10",
      "nominPrincipale": "1",
      "infosQualite": {
        "codeQualite": "Membre",
        "libQualite": "Membre",
        "libQualiteSex": "Membre"
      },
      "organesRefs": [
        "PO746694"
      ]
    },
    {
      "xsiType": "MandatSimple_Type",
      "uid": "PM750788",
      "acteurRef": "PA721226",
      "legislature": "15",
      "typeOrgane": "GE",
      "dateDebut": "2018-02-16T01:00:00.000+01:00",
      "preseance": "20",
      "nominPrincipale": "0",
      "infosQualite": {
        "codeQualite": "Membre",
        "libQualite": "Membre",
        "libQualiteSex": "Membre"
      },
      "organesRefs": [
        "PO747072"
      ]
    },
    {
      "xsiType": "MandatSimple_Type",
      "uid": "PM752265",
      "acteurRef": "PA721226",
      "legislature": "15",
      "typeOrgane": "GE",
      "dateDebut": "2018-03-05T01:00:00.000+01:00",
      "preseance": "20",
      "nominPrincipale": "0",
      "infosQualite": {
        "codeQualite": "Membre",
        "libQualite": "Membre",
        "libQualiteSex": "Membre"
      },
      "organesRefs": [
        "PO747271"
      ]
    },
    {
      "xsiType": "MandatSimple_Type",
      "uid": "PM755078",
      "acteurRef": "PA721226",
      "legislature": "15",
      "typeOrgane": "GE",
      "dateDebut": "2018-04-04T02:00:00.000+02:00",
      "preseance": "8",
      "nominPrincipale": "1",
      "infosQualite": {
        "codeQualite": "Vice-Président",
        "libQualite": "Vice-Président",
        "libQualiteSex": "Vice-Présidente"
      },
      "organesRefs": [
        "PO747072"
      ]
    },
    {
      "xsiType": "MandatSimple_Type",
      "uid": "PM755116",
      "acteurRef": "PA721226",
      "legislature": "15",
      "typeOrgane": "GE",
      "dateDebut": "2018-04-06T02:00:00.000+02:00",
      "preseance": "12",
      "nominPrincipale": "1",
      "infosQualite": {
        "codeQualite": "Secrétaire",
        "libQualite": "Secrétaire",
        "libQualiteSex": "Secrétaire"
      },
      "organesRefs": [
        "PO747271"
      ]
    },
    {
      "xsiType": "MandatSimple_Type",
      "uid": "PM757712",
      "acteurRef": "PA721226",
      "legislature": "15",
      "typeOrgane": "COMPER",
      "dateDebut": "2018-07-10T02:00:00.000+02:00",
      "datePublication": "2018-07-10T02:00:00.000+02:00",
      "preseance": "32",
      "nominPrincipale": "1",
      "infosQualite": {
        "codeQualite": "Membre",
        "libQualite": "Membre",
        "libQualiteSex": "Membre"
      },
      "organesRefs": [
        "PO59048"
      ]
    },
    {
      "xsiType": "MandatMission_Type",
      "uid": "PM762206",
      "acteurRef": "PA721226",
      "legislature": "15",
      "typeOrgane": "MISINFO",
      "dateDebut": "2019-01-23T01:00:00.000+01:00",
      "preseance": "10",
      "nominPrincipale": "1",
      "infosQualite": {
        "codeQualite": "Membre",
        "libQualite": "Membre",
        "libQualiteSex": "Membre"
      },
      "organesRefs": [
        "PO762170"
      ]
    },
    {
      "xsiType": "MandatMission_Type",
      "uid": "PM762241",
      "acteurRef": "PA721226",
      "legislature": "15",
      "typeOrgane": "MISINFO",
      "dateDebut": "2019-01-23T01:00:00.000+01:00",
      "preseance": "10",
      "nominPrincipale": "1",
      "infosQualite": {
        "codeQualite": "Membre",
        "libQualite": "Membre",
        "libQualiteSex": "Membre"
      },
      "organesRefs": [
        "PO762207"
      ]
    },
    {
      "xsiType": "MandatSimple_Type",
      "uid": "PM763126",
      "acteurRef": "PA721226",
      "legislature": "15",
      "typeOrgane": "CNPE",
      "dateDebut": "2019-03-08T01:00:00.000+01:00",
      "datePublication": "2019-03-09T01:00:00.000+01:00",
      "dateFin": "2019-07-18T02:00:00.000+02:00",
      "preseance": "20",
      "nominPrincipale": "1",
      "infosQualite": {
        "codeQualite": "Membre",
        "libQualite": "Membre",
        "libQualiteSex": "Membre"
      },
      "organesRefs": [
        "PO762987"
      ]
    },
    {
      "xsiType": "MandatMission_Type",
      "uid": "PM764355",
      "acteurRef": "PA721226",
      "legislature": "15",
      "typeOrgane": "MISINFO",
      "dateDebut": "2019-03-13T01:00:00.000+01:00",
      "dateFin": "2019-10-02T02:00:00.000+02:00",
      "preseance": "10",
      "nominPrincipale": "1",
      "infosQualite": {
        "codeQualite": "Membre",
        "libQualite": "Membre",
        "libQualiteSex": "Membre"
      },
      "organesRefs": [
        "PO764350"
      ]
    },
    {
      "xsiType": "MandatSimple_Type",
      "uid": "PM765608",
      "acteurRef": "PA721226",
      "legislature": "15",
      "typeOrgane": "CMP",
      "dateDebut": "2019-06-06T02:00:00.000+02:00",
      "datePublication": "2019-06-07T02:00:00.000+02:00",
      "dateFin": "2019-07-04T02:00:00.000+02:00",
      "preseance": "28",
      "nominPrincipale": "1",
      "infosQualite": {
        "codeQualite": "Suppléant",
        "libQualite": "Membre suppléant",
        "libQualiteSex": "Membre suppléante"
      },
      "organesRefs": [
        "PO765254"
      ]
    },
    {
      "xsiType": "MandatSimple_Type",
      "uid": "PM765898",
      "acteurRef": "PA721226",
      "legislature": "15",
      "typeOrgane": "CMP",
      "dateDebut": "2019-06-20T02:00:00.000+02:00",
      "datePublication": "2019-06-21T02:00:00.000+02:00",
      "dateFin": "2019-07-11T02:00:00.000+02:00",
      "preseance": "28",
      "nominPrincipale": "1",
      "infosQualite": {
        "codeQualite": "Suppléant",
        "libQualite": "Membre suppléant",
        "libQualiteSex": "Membre suppléante"
      },
      "organesRefs": [
        "PO765278"
      ]
    }
  ]
}