{
  "xsiType": "OrganeExterne_Type",
  "uid": "PO758787",
  "codeType": "MINISTERE",
  "libelle": "Ministère de la transition écologique et solidaire",
  "libelleEdition": "de la transition écologique et solidaire",
  "libelleAbrege": "Transition écologique et solidaire",
  "libelleAbrev": "TRE",
  "viMoDe": {
    "dateDebut": "2018-09-05T02:00:00.000+02:00",
    "dateFin": "2019-07-16T02:00:00.000+02:00"
  },
  "organeParentRef": "PO725688"
}