{
  "xsiType": "OrganeExterne_Type",
  "uid": "PO717174",
  "codeType": "MINISTERE",
  "libelle": "Premier ministre",
  "libelleAbrege": "Premier ministre",
  "libelleAbrev": "PRM",
  "viMoDe": {
    "dateDebut": "2017-05-18T02:00:00.000+02:00",
    "dateFin": "2017-06-19T02:00:00.000+02:00"
  },
  "organeParentRef": "PO717173"
}