{
  "xsiType": "GroupePolitique_type",
  "uid": "PO730958",
  "codeType": "GP",
  "libelle": "La France insoumise",
  "libelleEdition": "du groupe La France insoumise",
  "libelleAbrege": "FI",
  "libelleAbrev": "FI",
  "viMoDe": {
    "dateDebut": "2017-06-27T02:00:00.000+02:00"
  },
  "regime": "5ème République",
  "legislature": "15",
  "secretariat": {},
  "positionPolitique": "Opposition",
  "preseance": "7",
  "couleurAssociee": "#ED302C"
}