{
  "xsiType": "OrganeParlementaire_Type",
  "uid": "PO755773",
  "codeType": "MISINFOCOM",
  "libelle": "Mission d'information commune sur le site de stockage souterrain de déchets StocaMine",
  "libelleEdition": "de la mission d'information commune sur le site de stockage souterrain de déchets StocaMine",
  "libelleAbrege": "StocaMine",
  "libelleAbrev": "MICSTOC",
  "viMoDe": {
    "dateDebut": "2018-04-19T02:00:00.000+02:00",
    "dateFin": "2018-09-18T02:00:00.000+02:00"
  },
  "regime": "5ème République",
  "legislature": "15",
  "secretariat": {}
}