{
  "xsiType": "OrganeExtraParlementaire_type",
  "uid": "PO60296",
  "codeType": "ORGEXTPARL",
  "libelle": "Conseil d'administration de l'Institut des hautes études de défense nationale",
  "libelleEdition": "du conseil d'administration de l'Institut des hautes études de défense nationale",
  "libelleAbrege": "Défense nationale",
  "libelleAbrev": "157",
  "viMoDe": {
    "dateDebut": "1997-09-06T02:00:00.000+02:00"
  },
  "regime": "5ème République",
  "regimeJuridique": "Article L. 1132-1 du code de la défense",
  "siteInternet": "https://www.ihedn.fr/conseil-dadministration"
}