{
  "uid": "PA719130",
  "etatCivil": {
    "ident": {
      "civ": "Mme",
      "prenom": "Monica",
      "nom": "Michel",
      "alpha": "Michel",
      "trigramme": "MMI"
    },
    "infoNaissance": {
      "dateNais": "1955-04-16T01:00:00.000+01:00",
      "villeNais": "Victoria",
      "paysNais": "Seychelles"
    }
  },
  "profession": {
    "libelleCourant": "Directrice commerciale",
    "socProcInsee": {
      "catSocPro": "Cadres d'entreprise",
      "famSocPro": "Cadres et professions intellectuelles supérieures"
    }
  },
  "uriHatvp": "https://www.hatvp.fr/pages_nominatives/michel-monica",
  "adresses": [
    {
      "xsiType": "AdressePostale_Type",
      "uid": "AD719132",
      "type": "0",
      "typeLibelle": "Adresse officielle",
      "poids": "1",
      "intitule": "Assemblée nationale,",
      "numeroRue": "126",
      "nomRue": "Rue de l'Université,",
      "codePostal": "75355",
      "ville": "Paris 07 SP"
    },
    {
      "xsiType": "AdresseMail_Type",
      "uid": "AD728007",
      "type": "15",
      "typeLibelle": "Mèl",
      "valElec": "monica.michel@assemblee-nationale.fr"
    },
    {
      "xsiType": "AdressePostale_Type",
      "uid": "AD728648",
      "type": "2",
      "typeLibelle": "Adresse publiée de circonscription",
      "poids": "22",
      "numeroRue": "13",
      "nomRue": "Rue de la République",
      "codePostal": "13200",
      "ville": "Arles"
    },
    {
      "xsiType": "AdresseSiteWeb_Type",
      "uid": "AD728754",
      "type": "25",
      "typeLibelle": "Facebook",
      "valElec": "MonicaMichelEM"
    },
    {
      "xsiType": "AdresseSiteWeb_Type",
      "uid": "AD762604",
      "type": "22",
      "typeLibelle": "Site internet",
      "valElec": "www.monica-michel.fr"
    }
  ],
  "mandats": [
    {
      "xsiType": "MandatParlementaire_type",
      "uid": "PM722572",
      "acteurRef": "PA719130",
      "legislature": "15",
      "typeOrgane": "ASSEMBLEE",
      "dateDebut": "2017-06-18T02:00:00.000+02:00",
      "preseance": "50",
      "nominPrincipale": "1",
      "infosQualite": {
        "codeQualite": "membre",
        "libQualite": "membre",
        "libQualiteSex": "membre"
      },
      "organesRefs": [
        "PO717460"
      ],
      "suppleant": {
        "dateDebut": "2017-06-18T02:00:00.000+02:00",
        "suppleantRef": "PA719134"
      },
      "election": {
        "lieu": {
          "region": "Provence-Alpes-Côte d'Azur",
          "regionType": "Métropolitain",
          "departement": "Bouches-du-Rhône",
          "numDepartement": "13",
          "numCirco": "16"
        },
        "causeMandat": "élections générales",
        "refCirconscription": "PO717558"
      },
      "mandature": {
        "datePriseFonction": "2017-06-21T02:00:00.000+02:00",
        "premiereElection": "0",
        "placeHemicycle": "244"
      },
      "collaborateurs": [
        {
          "qualite": "Mme",
          "prenom": "Marion",
          "nom": "Biscione"
        },
        {
          "qualite": "M.",
          "prenom": "Adrien",
          "nom": "Porquet"
        },
        {
          "qualite": "M.",
          "prenom": "Grégory",
          "nom": "Penias"
        },
        {
          "qualite": "M.",
          "prenom": "Adrien",
          "nom": "Vincentelli"
        }
      ]
    },
    {
      "xsiType": "MandatSimple_Type",
      "uid": "PM724327",
      "acteurRef": "PA719130",
      "legislature": "15",
      "typeOrgane": "GP",
      "dateDebut": "2017-06-21T02:00:00.000+02:00",
      "dateFin": "2017-06-26T02:00:00.000+02:00",
      "preseance": "28",
      "nominPrincipale": "1",
      "infosQualite": {
        "codeQualite": "Député non-inscrit",
        "libQualite": "Député non-inscrit",
        "libQualiteSex": "Députée non-inscrite"
      },
      "organesRefs": [
        "PO723569"
      ]
    },
    {
      "xsiType": "MandatSimple_Type",
      "uid": "PM731014",
      "acteurRef": "PA719130",
      "legislature": "15",
      "typeOrgane": "GP",
      "dateDebut": "2017-06-27T02:00:00.000+02:00",
      "datePublication": "2017-06-28T02:00:00.000+02:00",
      "preseance": "20",
      "nominPrincipale": "1",
      "infosQualite": {
        "codeQualite": "Membre",
        "libQualite": "Membre du",
        "libQualiteSex": "Membre du"
      },
      "organesRefs": [
        "PO730964"
      ]
    },
    {
      "xsiType": "MandatSimple_Type",
      "uid": "PM732121",
      "acteurRef": "PA719130",
      "legislature": "15",
      "typeOrgane": "COMPER",
      "dateDebut": "2017-06-29T02:00:00.000+02:00",
      "datePublication": "2017-06-29T02:00:00.000+02:00",
      "dateFin": "2019-09-17T02:00:00.000+02:00",
      "preseance": "32",
      "nominPrincipale": "1",
      "infosQualite": {
        "codeQualite": "Membre",
        "libQualite": "Membre",
        "libQualiteSex": "Membre"
      },
      "organesRefs": [
        "PO59047"
      ]
    },
    {
      "xsiType": "MandatSimple_Type",
      "uid": "PM732639",
      "acteurRef": "PA719130",
      "legislature": "15",
      "typeOrgane": "DELEG",
      "dateDebut": "2017-07-12T02:00:00.000+02:00",
      "datePublication": "2017-07-12T02:00:00.000+02:00",
      "preseance": "20",
      "nominPrincipale": "1",
      "infosQualite": {
        "codeQualite": "Membre",
        "libQualite": "Membre",
        "libQualiteSex": "Membre"
      },
      "organesRefs": [
        "PO675659"
      ]
    },
    {
      "xsiType": "MandatSimple_Type",
      "uid": "PM734820",
      "acteurRef": "PA719130",
      "legislature": "15",
      "typeOrgane": "ORGEXTPARL",
      "dateDebut": "2017-09-13T02:00:00.000+02:00",
      "datePublication": "2017-09-14T02:00:00.000+02:00",
      "preseance": "20",
      "nominPrincipale": "1",
      "infosQualite": {
        "codeQualite": "Titulaire",
        "libQualite": "Membre titulaire",
        "libQualiteSex": "Membre titulaire"
      },
      "organesRefs": [
        "PO709158"
      ]
    },
    {
      "xsiType": "MandatSimple_Type",
      "uid": "PM735193",
      "acteurRef": "PA719130",
      "legislature": "15",
      "typeOrgane": "GA",
      "dateDebut": "2017-09-26T02:00:00.000+02:00",
      "preseance": "20",
      "nominPrincipale": "0",
      "infosQualite": {
        "codeQualite": "Membre",
        "libQualite": "Membre",
        "libQualiteSex": "Membre"
      },
      "organesRefs": [
        "PO733112"
      ]
    },
    {
      "xsiType": "MandatSimple_Type",
      "uid": "PM735194",
      "acteurRef": "PA719130",
      "legislature": "15",
      "typeOrgane": "GA",
      "dateDebut": "2017-09-26T02:00:00.000+02:00",
      "preseance": "1",
      "nominPrincipale": "1",
      "infosQualite": {
        "codeQualite": "Président",
        "libQualite": "Président",
        "libQualiteSex": "Présidente"
      },
      "organesRefs": [
        "PO733112"
      ]
    },
    {
      "xsiType": "MandatSimple_Type",
      "uid": "PM735843",
      "acteurRef": "PA719130",
      "legislature": "15",
      "typeOrgane": "GA",
      "dateDebut": "2017-09-28T02:00:00.000+02:00",
      "preseance": "20",
      "nominPrincipale": "1",
      "infosQualite": {
        "codeQualite": "Membre",
        "libQualite": "Membre",
        "libQualiteSex": "Membre"
      },
      "organesRefs": [
        "PO733032"
      ]
    },
    {
      "xsiType": "MandatSimple_Type",
      "uid": "PM735844",
      "acteurRef": "PA719130",
      "legislature": "15",
      "typeOrgane": "GA",
      "dateDebut": "2017-09-28T02:00:00.000+02:00",
      "preseance": "20",
      "nominPrincipale": "1",
      "infosQualite": {
        "codeQualite": "Membre",
        "libQualite": "Membre",
        "libQualiteSex": "Membre"
      },
      "organesRefs": [
        "PO733072"
      ]
    },
    {
      "xsiType": "MandatSimple_Type",
      "uid": "PM735845",
      "acteurRef": "PA719130",
      "legislature": "15",
      "typeOrgane": "GA",
      "dateDebut": "2017-09-28T02:00:00.000+02:00",
      "preseance": "20",
      "nominPrincipale": "1",
      "infosQualite": {
        "codeQualite": "Membre",
        "libQualite": "Membre",
        "libQualiteSex": "Membre"
      },
      "organesRefs": [
        "PO733117"
      ]
    },
    {
      "xsiType": "MandatSimple_Type",
      "uid": "PM735846",
      "acteurRef": "PA719130",
      "legislature": "15",
      "typeOrgane": "GA",
      "dateDebut": "2017-09-28T02:00:00.000+02:00",
      "preseance": "20",
      "nominPrincipale": "1",
      "infosQualite": {
        "codeQualite": "Membre",
        "libQualite": "Membre",
        "libQualiteSex": "Membre"
      },
      "organesRefs": [
        "PO733182"
      ]
    },
    {
      "xsiType": "MandatSimple_Type",
      "uid": "PM735847",
      "acteurRef": "PA719130",
      "legislature": "15",
      "typeOrgane": "GA",
      "dateDebut": "2017-09-28T02:00:00.000+02:00",
      "preseance": "20",
      "nominPrincipale": "1",
      "infosQualite": {
        "codeQualite": "Membre",
        "libQualite": "Membre",
        "libQualiteSex": "Membre"
      },
      "organesRefs": [
        "PO733187"
      ]
    },
    {
      "xsiType": "MandatSimple_Type",
      "uid": "PM735848",
      "acteurRef": "PA719130",
      "legislature": "15",
      "typeOrgane": "GA",
      "dateDebut": "2017-09-28T02:00:00.000+02:00",
      "preseance": "20",
      "nominPrincipale": "1",
      "infosQualite": {
        "codeQualite": "Membre",
        "libQualite": "Membre",
        "libQualiteSex": "Membre"
      },
      "organesRefs": [
        "PO733322"
      ]
    },
    {
      "xsiType": "MandatSimple_Type",
      "uid": "PM735849",
      "acteurRef": "PA719130",
      "legislature": "15",
      "typeOrgane": "GA",
      "dateDebut": "2017-09-28T02:00:00.000+02:00",
      "preseance": "20",
      "nominPrincipale": "1",
      "infosQualite": {
        "codeQualite": "Membre",
        "libQualite": "Membre",
        "libQualiteSex": "Membre"
      },
      "organesRefs": [
        "PO733367"
      ]
    },
    {
      "xsiType": "MandatSimple_Type",
      "uid": "PM735850",
      "acteurRef": "PA719130",
      "legislature": "15",
      "typeOrgane": "GA",
      "dateDebut": "2017-09-28T02:00:00.000+02:00",
      "preseance": "20",
      "nominPrincipale": "0",
      "infosQualite": {
        "codeQualite": "Membre",
        "libQualite": "Membre",
        "libQualiteSex": "Membre"
      },
      "organesRefs": [
        "PO733372"
      ]
    },
    {
      "xsiType": "MandatSimple_Type",
      "uid": "PM735851",
      "acteurRef": "PA719130",
      "legislature": "15",
      "typeOrgane": "GA",
      "dateDebut": "2017-09-28T02:00:00.000+02:00",
      "preseance": "20",
      "nominPrincipale": "1",
      "infosQualite": {
        "codeQualite": "Membre",
        "libQualite": "Membre",
        "libQualiteSex": "Membre"
      },
      "organesRefs": [
        "PO733382"
      ]
    },
    {
      "xsiType": "MandatSimple_Type",
      "uid": "PM735852",
      "acteurRef": "PA719130",
      "legislature": "15",
      "typeOrgane": "GA",
      "dateDebut": "2017-09-28T02:00:00.000+02:00",
      "preseance": "20",
      "nominPrincipale": "1",
      "infosQualite": {
        "codeQualite": "Membre",
        "libQualite": "Membre",
        "libQualiteSex": "Membre"
      },
      "organesRefs": [
        "PO733442"
      ]
    },
    {
      "xsiType": "MandatSimple_Type",
      "uid": "PM735853",
      "acteurRef": "PA719130",
      "legislature": "15",
      "typeOrgane": "GA",
      "dateDebut": "2017-09-28T02:00:00.000+02:00",
      "preseance": "20",
      "nominPrincipale": "1",
      "infosQualite": {
        "codeQualite": "Membre",
        "libQualite": "Membre",
        "libQualiteSex": "Membre"
      },
      "organesRefs": [
        "PO733492"
      ]
    },
    {
      "xsiType": "MandatSimple_Type",
      "uid": "PM735854",
      "acteurRef": "PA719130",
      "legislature": "15",
      "typeOrgane": "GA",
      "dateDebut": "2017-09-28T02:00:00.000+02:00",
      "preseance": "20",
      "nominPrincipale": "1",
      "infosQualite": {
        "codeQualite": "Membre",
        "libQualite": "Membre",
        "libQualiteSex": "Membre"
      },
      "organesRefs": [
        "PO733522"
      ]
    },
    {
      "xsiType": "MandatSimple_Type",
      "uid": "PM735855",
      "acteurRef": "PA719130",
      "legislature": "15",
      "typeOrgane": "GA",
      "dateDebut": "2017-09-28T02:00:00.000+02:00",
      "preseance": "20",
      "nominPrincipale": "1",
      "infosQualite": {
        "codeQualite": "Membre",
        "libQualite": "Membre",
        "libQualiteSex": "Membre"
      },
      "organesRefs": [
        "PO733532"
      ]
    },
    {
      "xsiType": "MandatSimple_Type",
      "uid": "PM735856",
      "acteurRef": "PA719130",
      "legislature": "15",
      "typeOrgane": "GA",
      "dateDebut": "2017-09-28T02:00:00.000+02:00",
      "preseance": "20",
      "nominPrincipale": "1",
      "infosQualite": {
        "codeQualite": "Membre",
        "libQualite": "Membre",
        "libQualiteSex": "Membre"
      },
      "organesRefs": [
        "PO733567"
      ]
    },
    {
      "xsiType": "MandatSimple_Type",
      "uid": "PM735857",
      "acteurRef": "PA719130",
      "legislature": "15",
      "typeOrgane": "GA",
      "dateDebut": "2017-09-28T02:00:00.000+02:00",
      "preseance": "20",
      "nominPrincipale": "0",
      "infosQualite": {
        "codeQualite": "Membre",
        "libQualite": "Membre",
        "libQualiteSex": "Membre"
      },
      "organesRefs": [
        "PO733617"
      ]
    },
    {
      "xsiType": "MandatSimple_Type",
      "uid": "PM735858",
      "acteurRef": "PA719130",
      "legislature": "15",
      "typeOrgane": "GA",
      "dateDebut": "2017-09-28T02:00:00.000+02:00",
      "preseance": "20",
      "nominPrincipale": "1",
      "infosQualite": {
        "codeQualite": "Membre",
        "libQualite": "Membre",
        "libQualiteSex": "Membre"
      },
      "organesRefs": [
        "PO733652"
      ]
    },
    {
      "xsiType": "MandatSimple_Type",
      "uid": "PM735859",
      "acteurRef": "PA719130",
      "legislature": "15",
      "typeOrgane": "GA",
      "dateDebut": "2017-09-28T02:00:00.000+02:00",
      "preseance": "20",
      "nominPrincipale": "0",
      "infosQualite": {
        "codeQualite": "Membre",
        "libQualite": "Membre",
        "libQualiteSex": "Membre"
      },
      "organesRefs": [
        "PO733693"
      ]
    },
    {
      "xsiType": "MandatSimple_Type",
      "uid": "PM735860",
      "acteurRef": "PA719130",
      "legislature": "15",
      "typeOrgane": "GA",
      "dateDebut": "2017-09-28T02:00:00.000+02:00",
      "preseance": "20",
      "nominPrincipale": "1",
      "infosQualite": {
        "codeQualite": "Membre",
        "libQualite": "Membre",
        "libQualiteSex": "Membre"
      },
      "organesRefs": [
        "PO733698"
      ]
    },
    {
      "xsiType": "MandatSimple_Type",
      "uid": "PM735861",
      "acteurRef": "PA719130",
      "legislature": "15",
      "typeOrgane": "GEVI",
      "dateDebut": "2017-09-28T02:00:00.000+02:00",
      "preseance": "20",
      "nominPrincipale": "1",
      "infosQualite": {
        "codeQualite": "Membre",
        "libQualite": "Membre",
        "libQualiteSex": "Membre"
      },
      "organesRefs": [
        "PO733622"
      ]
    },
    {
      "xsiType": "MandatSimple_Type",
      "uid": "PM739274",
      "acteurRef": "PA719130",
      "legislature": "15",
      "typeOrgane": "GEVI",
      "dateDebut": "2017-10-11T02:00:00.000+02:00",
      "dateFin": "2017-11-07T01:00:00.000+01:00",
      "preseance": "20",
      "nominPrincipale": "1",
      "infosQualite": {
        "codeQualite": "Membre",
        "libQualite": "Membre",
        "libQualiteSex": "Membre"
      },
      "organesRefs": [
        "PO733688"
      ]
    },
    {
      "xsiType": "MandatSimple_Type",
      "uid": "PM739505",
      "acteurRef": "PA719130",
      "legislature": "15",
      "typeOrgane": "GA",
      "dateDebut": "2017-10-12T02:00:00.000+02:00",
      "preseance": "20",
      "nominPrincipale": "0",
      "infosQualite": {
        "codeQualite": "Membre",
        "libQualite": "Membre",
        "libQualiteSex": "Membre"
      },
      "organesRefs": [
        "PO733407"
      ]
    },
    {
      "xsiType": "MandatSimple_Type",
      "uid": "PM742092",
      "acteurRef": "PA719130",
      "legislature": "15",
      "typeOrgane": "API",
      "dateDebut": "2017-10-27T02:00:00.000+02:00",
      "datePublication": "2017-10-28T02:00:00.000+02:00",
      "preseance": "20",
      "nominPrincipale": "0",
      "infosQualite": {
        "codeQualite": "Membre",
        "libQualite": "Membre",
        "libQualiteSex": "Membre"
      },
      "organesRefs": [
        "PO201115"
      ]
    },
    {
      "xsiType": "MandatSimple_Type",
      "uid": "PM742243",
      "acteurRef": "PA719130",
      "legislature": "15",
      "typeOrgane": "GA",
      "dateDebut": "2017-10-30T01:00:00.000+01:00",
      "preseance": "20",
      "nominPrincipale": "0",
      "infosQualite": {
        "codeQualite": "Membre",
        "libQualite": "Membre",
        "libQualiteSex": "Membre"
      },
      "organesRefs": [
        "PO733062"
      ]
    },
    {
      "xsiType": "MandatSimple_Type",
      "uid": "PM742254",
      "acteurRef": "PA719130",
      "legislature": "15",
      "typeOrgane": "GA",
      "dateDebut": "2017-10-31T01:00:00.000+01:00",
      "preseance": "8",
      "nominPrincipale": "1",
      "infosQualite": {
        "codeQualite": "Vice-Président",
        "libQualite": "Vice-Président",
        "libQualiteSex": "Vice-Présidente"
      },
      "organesRefs": [
        "PO733617"
      ]
    },
    {
      "xsiType": "MandatSimple_Type",
      "uid": "PM742710",
      "acteurRef": "PA719130",
      "legislature": "15",
      "typeOrgane": "GA",
      "dateDebut": "2017-11-08T01:00:00.000+01:00",
      "preseance": "8",
      "nominPrincipale": "1",
      "infosQualite": {
        "codeQualite": "Vice-Président",
        "libQualite": "Vice-Président",
        "libQualiteSex": "Vice-Présidente"
      },
      "organesRefs": [
        "PO733693"
      ]
    },
    {
      "xsiType": "MandatSimple_Type",
      "uid": "PM743849",
      "acteurRef": "PA719130",
      "legislature": "15",
      "typeOrgane": "GEVI",
      "dateDebut": "2017-11-08T01:00:00.000+01:00",
      "preseance": "20",
      "nominPrincipale": "1",
      "infosQualite": {
        "codeQualite": "Membre",
        "libQualite": "Membre",
        "libQualiteSex": "Membre"
      },
      "organesRefs": [
        "PO743840"
      ]
    },
    {
      "xsiType": "MandatSimple_Type",
      "uid": "PM744739",
      "acteurRef": "PA719130",
      "legislature": "15",
      "typeOrgane": "CNPS",
      "dateDebut": "2017-12-06T01:00:00.000+01:00",
      "datePublication": "2017-12-06T01:00:00.000+01:00",
      "dateFin": "2018-07-31T02:00:00.000+02:00",
      "preseance": "20",
      "nominPrincipale": "1",
      "infosQualite": {
        "codeQualite": "Membre",
        "libQualite": "Membre",
        "libQualiteSex": "Membre"
      },
      "organesRefs": [
        "PO744107"
      ]
    },
    {
      "xsiType": "MandatSimple_Type",
      "uid": "PM745245",
      "acteurRef": "PA719130",
      "typeOrgane": "PARPOL",
      "dateDebut": "2017-12-01T01:00:00.000+01:00",
      "dateFin": "2018-11-30T01:00:00.000+01:00",
      "preseance": "5",
      "nominPrincipale": "1",
      "infosQualite": {
        "codeQualite": "Membre",
        "libQualite": "Membre",
        "libQualiteSex": "Membre"
      },
      "organesRefs": [
        "PO744854"
      ]
    },
    {
      "xsiType": "MandatSimple_Type",
      "uid": "PM746124",
      "acteurRef": "PA719130",
      "legislature": "15",
      "typeOrgane": "GA",
      "dateDebut": "2017-12-07T01:00:00.000+01:00",
      "preseance": "8",
      "nominPrincipale": "1",
      "infosQualite": {
        "codeQualite": "Vice-Président",
        "libQualite": "Vice-Président",
        "libQualiteSex": "Vice-Présidente"
      },
      "organesRefs": [
        "PO733407"
      ]
    },
    {
      "xsiType": "MandatSimple_Type",
      "uid": "PM746253",
      "acteurRef": "PA719130",
      "legislature": "15",
      "typeOrgane": "GA",
      "dateDebut": "2017-11-15T01:00:00.000+01:00",
      "preseance": "8",
      "nominPrincipale": "1",
      "infosQualite": {
        "codeQualite": "Vice-Président",
        "libQualite": "Vice-Président",
        "libQualiteSex": "Vice-Présidente"
      },
      "organesRefs": [
        "PO733062"
      ]
    },
    {
      "xsiType": "MandatSimple_Type",
      "uid": "PM746264",
      "acteurRef": "PA719130",
      "legislature": "15",
      "typeOrgane": "DELEG",
      "dateDebut": "2017-12-09T01:00:00.000+01:00",
      "datePublication": "2017-12-09T01:00:00.000+01:00",
      "preseance": "20",
      "nominPrincipale": "1",
      "infosQualite": {
        "codeQualite": "Membre",
        "libQualite": "Membre",
        "libQualiteSex": "Membre"
      },
      "organesRefs": [
        "PO744127"
      ]
    },
    {
      "xsiType": "MandatSimple_Type",
      "uid": "PM746571",
      "acteurRef": "PA719130",
      "legislature": "15",
      "typeOrgane": "GA",
      "dateDebut": "2017-12-12T01:00:00.000+01:00",
      "preseance": "8",
      "nominPrincipale": "1",
      "infosQualite": {
        "codeQualite": "Vice-Président",
        "libQualite": "Vice-Président",
        "libQualiteSex": "Vice-Présidente"
      },
      "organesRefs": [
        "PO733372"
      ]
    },
    {
      "xsiType": "MandatSimple_Type",
      "uid": "PM747888",
      "acteurRef": "PA719130",
      "legislature": "15",
      "typeOrgane": "ORGEXTPARL",
      "dateDebut": "2018-01-10T01:00:00.000+01:00",
      "datePublication": "2018-01-11T01:00:00.000+01:00",
      "preseance": "20",
      "nominPrincipale": "1",
      "infosQualite": {
        "codeQualite": "Titulaire",
        "libQualite": "Membre titulaire",
        "libQualiteSex": "Membre titulaire"
      },
      "organesRefs": [
        "PO717436"
      ]
    },
    {
      "xsiType": "MandatSimple_Type",
      "uid": "PM748180",
      "acteurRef": "PA719130",
      "legislature": "15",
      "typeOrgane": "API",
      "dateDebut": "2018-01-26T01:00:00.000+01:00",
      "preseance": "16",
      "nominPrincipale": "1",
      "infosQualite": {
        "codeQualite": "Secrétaire général-adjoint",
        "libQualite": "Secrétaire général-adjoint",
        "libQualiteSex": "Secrétaire générale-adjointe"
      },
      "organesRefs": [
        "PO201115"
      ]
    },
    {
      "xsiType": "MandatSimple_Type",
      "uid": "PM749478",
      "acteurRef": "PA719130",
      "legislature": "15",
      "typeOrgane": "GE",
      "dateDebut": "2018-02-13T01:00:00.000+01:00",
      "preseance": "20",
      "nominPrincipale": "1",
      "infosQualite": {
        "codeQualite": "Membre",
        "libQualite": "Membre",
        "libQualiteSex": "Membre"
      },
      "organesRefs": [
        "PO747027"
      ]
    },
    {
      "xsiType": "MandatSimple_Type",
      "uid": "PM750125",
      "acteurRef": "PA719130",
      "legislature": "15",
      "typeOrgane": "GE",
      "dateDebut": "2018-02-13T01:00:00.000+01:00",
      "preseance": "20",
      "nominPrincipale": "1",
      "infosQualite": {
        "codeQualite": "Membre",
        "libQualite": "Membre",
        "libQualiteSex": "Membre"
      },
      "organesRefs": [
        "PO746982"
      ]
    },
    {
      "xsiType": "MandatSimple_Type",
      "uid": "PM751070",
      "acteurRef": "PA719130",
      "legislature": "15",
      "typeOrgane": "GE",
      "dateDebut": "2018-02-19T01:00:00.000+01:00",
      "preseance": "20",
      "nominPrincipale": "0",
      "infosQualite": {
        "codeQualite": "Membre",
        "libQualite": "Membre",
        "libQualiteSex": "Membre"
      },
      "organesRefs": [
        "PO746832"
      ]
    },
    {
      "xsiType": "MandatSimple_Type",
      "uid": "PM751385",
      "acteurRef": "PA719130",
      "legislature": "15",
      "typeOrgane": "GE",
      "dateDebut": "2018-03-13T01:00:00.000+01:00",
      "preseance": "20",
      "nominPrincipale": "1",
      "infosQualite": {
        "codeQualite": "Membre",
        "libQualite": "Membre",
        "libQualiteSex": "Membre"
      },
      "organesRefs": [
        "PO746899"
      ]
    },
    {
      "xsiType": "MandatSimple_Type",
      "uid": "PM751414",
      "acteurRef": "PA719130",
      "legislature": "15",
      "typeOrgane": "GE",
      "dateDebut": "2018-02-21T01:00:00.000+01:00",
      "preseance": "20",
      "nominPrincipale": "1",
      "infosQualite": {
        "codeQualite": "Membre",
        "libQualite": "Membre",
        "libQualiteSex": "Membre"
      },
      "organesRefs": [
        "PO746644"
      ]
    },
    {
      "xsiType": "MandatSimple_Type",
      "uid": "PM752233",
      "acteurRef": "PA719130",
      "legislature": "15",
      "typeOrgane": "GE",
      "dateDebut": "2018-03-05T01:00:00.000+01:00",
      "preseance": "20",
      "nominPrincipale": "1",
      "infosQualite": {
        "codeQualite": "Membre",
        "libQualite": "Membre",
        "libQualiteSex": "Membre"
      },
      "organesRefs": [
        "PO747205"
      ]
    },
    {
      "xsiType": "MandatSimple_Type",
      "uid": "PM752642",
      "acteurRef": "PA719130",
      "legislature": "15",
      "typeOrgane": "GE",
      "dateDebut": "2018-03-06T01:00:00.000+01:00",
      "preseance": "20",
      "nominPrincipale": "0",
      "infosQualite": {
        "codeQualite": "Membre",
        "libQualite": "Membre",
        "libQualiteSex": "Membre"
      },
      "organesRefs": [
        "PO747220"
      ]
    },
    {
      "xsiType": "MandatSimple_Type",
      "uid": "PM752665",
      "acteurRef": "PA719130",
      "legislature": "15",
      "typeOrgane": "GE",
      "dateDebut": "2018-03-07T01:00:00.000+01:00",
      "preseance": "20",
      "nominPrincipale": "1",
      "infosQualite": {
        "codeQualite": "Membre",
        "libQualite": "Membre",
        "libQualiteSex": "Membre"
      },
      "organesRefs": [
        "PO746791"
      ]
    },
    {
      "xsiType": "MandatSimple_Type",
      "uid": "PM752717",
      "acteurRef": "PA719130",
      "legislature": "15",
      "typeOrgane": "GE",
      "dateDebut": "2018-03-07T01:00:00.000+01:00",
      "preseance": "8",
      "nominPrincipale": "1",
      "infosQualite": {
        "codeQualite": "Vice-Président",
        "libQualite": "Vice-Président",
        "libQualiteSex": "Vice-Présidente"
      },
      "organesRefs": [
        "PO746832"
      ]
    },
    {
      "xsiType": "MandatSimple_Type",
      "uid": "PM752762",
      "acteurRef": "PA719130",
      "legislature": "15",
      "typeOrgane": "GE",
      "dateDebut": "2018-03-07T01:00:00.000+01:00",
      "preseance": "20",
      "nominPrincipale": "1",
      "infosQualite": {
        "codeQualite": "Membre",
        "libQualite": "Membre",
        "libQualiteSex": "Membre"
      },
      "organesRefs": [
        "PO747140"
      ]
    },
    {
      "xsiType": "MandatSimple_Type",
      "uid": "PM753669",
      "acteurRef": "PA719130",
      "legislature": "15",
      "typeOrgane": "CMP",
      "dateDebut": "2018-03-16T01:00:00.000+01:00",
      "datePublication": "2018-03-16T01:00:00.000+01:00",
      "dateFin": "2018-07-31T02:00:00.000+02:00",
      "preseance": "28",
      "nominPrincipale": "1",
      "infosQualite": {
        "codeQualite": "Suppléant",
        "libQualite": "Membre suppléant",
        "libQualiteSex": "Membre suppléante"
      },
      "organesRefs": [
        "PO753655"
      ]
    },
    {
      "xsiType": "MandatSimple_Type",
      "uid": "PM754092",
      "acteurRef": "PA719130",
      "legislature": "15",
      "typeOrgane": "GE",
      "dateDebut": "2018-03-21T01:00:00.000+01:00",
      "preseance": "20",
      "nominPrincipale": "1",
      "infosQualite": {
        "codeQualite": "Membre",
        "libQualite": "Membre",
        "libQualiteSex": "Membre"
      },
      "organesRefs": [
        "PO747124"
      ]
    },
    {
      "xsiType": "MandatSimple_Type",
      "uid": "PM754126",
      "acteurRef": "PA719130",
      "legislature": "15",
      "typeOrgane": "GE",
      "dateDebut": "2018-03-14T01:00:00.000+01:00",
      "preseance": "12",
      "nominPrincipale": "1",
      "infosQualite": {
        "codeQualite": "Secrétaire",
        "libQualite": "Secrétaire",
        "libQualiteSex": "Secrétaire"
      },
      "organesRefs": [
        "PO747220"
      ]
    },
    {
      "xsiType": "MandatSimple_Type",
      "uid": "PM754145",
      "acteurRef": "PA719130",
      "legislature": "15",
      "typeOrgane": "CNPE",
      "dateDebut": "2018-03-23T01:00:00.000+01:00",
      "datePublication": "2018-03-23T01:00:00.000+01:00",
      "dateFin": "2018-07-19T02:00:00.000+02:00",
      "preseance": "20",
      "nominPrincipale": "1",
      "infosQualite": {
        "codeQualite": "Membre",
        "libQualite": "Membre",
        "libQualiteSex": "Membre"
      },
      "organesRefs": [
        "PO753283"
      ]
    },
    {
      "xsiType": "MandatSimple_Type",
      "uid": "PM754509",
      "acteurRef": "PA719130",
      "legislature": "15",
      "typeOrgane": "GE",
      "dateDebut": "2018-03-29T02:00:00.000+02:00",
      "preseance": "20",
      "nominPrincipale": "1",
      "infosQualite": {
        "codeQualite": "Membre",
        "libQualite": "Membre",
        "libQualiteSex": "Membre"
      },
      "organesRefs": [
        "PO746957"
      ]
    },
    {
      "xsiType": "MandatSimple_Type",
      "uid": "PM755638",
      "acteurRef": "PA719130",
      "legislature": "15",
      "typeOrgane": "GE",
      "dateDebut": "2018-04-10T02:00:00.000+02:00",
      "preseance": "20",
      "nominPrincipale": "1",
      "infosQualite": {
        "codeQualite": "Membre",
        "libQualite": "Membre",
        "libQualiteSex": "Membre"
      },
      "organesRefs": [
        "PO751484"
      ]
    },
    {
      "xsiType": "MandatSimple_Type",
      "uid": "PM755887",
      "acteurRef": "PA719130",
      "legislature": "15",
      "typeOrgane": "GE",
      "dateDebut": "2018-04-30T02:00:00.000+02:00",
      "preseance": "20",
      "nominPrincipale": "1",
      "infosQualite": {
        "codeQualite": "Membre",
        "libQualite": "Membre",
        "libQualiteSex": "Membre"
      },
      "organesRefs": [
        "PO746935"
      ]
    },
    {
      "xsiType": "MandatSimple_Type",
      "uid": "PM756357",
      "acteurRef": "PA719130",
      "legislature": "15",
      "typeOrgane": "GE",
      "dateDebut": "2018-05-24T02:00:00.000+02:00",
      "preseance": "20",
      "nominPrincipale": "1",
      "infosQualite": {
        "codeQualite": "Membre",
        "libQualite": "Membre",
        "libQualiteSex": "Membre"
      },
      "organesRefs": [
        "PO747271"
      ]
    },
    {
      "xsiType": "MandatSimple_Type",
      "uid": "PM756945",
      "acteurRef": "PA719130",
      "legislature": "15",
      "typeOrgane": "ORGEXTPARL",
      "dateDebut": "2018-03-08T01:00:00.000+01:00",
      "datePublication": "2018-03-09T01:00:00.000+01:00",
      "preseance": "20",
      "nominPrincipale": "1",
      "infosQualite": {
        "codeQualite": "Titulaire",
        "libQualite": "Membre titulaire",
        "libQualiteSex": "Membre titulaire"
      },
      "organesRefs": [
        "PO756933"
      ]
    },
    {
      "xsiType": "MandatSimple_Type",
      "uid": "PM760208",
      "acteurRef": "PA719130",
      "legislature": "15",
      "typeOrgane": "CNPS",
      "dateDebut": "2018-11-13T01:00:00.000+01:00",
      "datePublication": "2018-11-14T01:00:00.000+01:00",
      "dateFin": "2019-01-17T01:00:00.000+01:00",
      "preseance": "20",
      "nominPrincipale": "1",
      "infosQualite": {
        "codeQualite": "Membre",
        "libQualite": "Membre",
        "libQualiteSex": "Membre"
      },
      "organesRefs": [
        "PO760148"
      ]
    },
    {
      "xsiType": "MandatSimple_Type",
      "uid": "PM761685",
      "acteurRef": "PA719130",
      "typeOrgane": "PARPOL",
      "dateDebut": "2018-12-01T01:00:00.000+01:00",
      "preseance": "5",
      "nominPrincipale": "1",
      "infosQualite": {
        "codeQualite": "Membre",
        "libQualite": "Membre",
        "libQualiteSex": "Membre"
      },
      "organesRefs": [
        "PO761294"
      ]
    },
    {
      "xsiType": "MandatSimple_Type",
      "uid": "PM764923",
      "acteurRef": "PA719130",
      "legislature": "15",
      "typeOrgane": "GE",
      "dateDebut": "2019-05-02T02:00:00.000+02:00",
      "preseance": "20",
      "nominPrincipale": "1",
      "infosQualite": {
        "codeQualite": "Membre",
        "libQualite": "Membre",
        "libQualiteSex": "Membre"
      },
      "organesRefs": [
        "PO763234"
      ]
    },
    {
      "xsiType": "MandatSimple_Type",
      "uid": "PM767059",
      "acteurRef": "PA719130",
      "legislature": "15",
      "typeOrgane": "COMPER",
      "dateDebut": "2019-09-18T02:00:00.000+02:00",
      "datePublication": "2019-09-18T02:00:00.000+02:00",
      "dateFin": "2019-09-18T02:00:00.000+02:00",
      "preseance": "32",
      "nominPrincipale": "1",
      "infosQualite": {
        "codeQualite": "Membre",
        "libQualite": "Membre",
        "libQualiteSex": "Membre"
      },
      "organesRefs": [
        "PO419865"
      ]
    },
    {
      "xsiType": "MandatSimple_Type",
      "uid": "PM767068",
      "acteurRef": "PA719130",
      "legislature": "15",
      "typeOrgane": "COMPER",
      "dateDebut": "2019-09-19T02:00:00.000+02:00",
      "datePublication": "2019-09-19T02:00:00.000+02:00",
      "dateFin": "2019-09-30T02:00:00.000+02:00",
      "preseance": "32",
      "nominPrincipale": "1",
      "infosQualite": {
        "codeQualite": "Membre",
        "libQualite": "Membre",
        "libQualiteSex": "Membre"
      },
      "organesRefs": [
        "PO59047"
      ]
    },
    {
      "xsiType": "MandatMission_Type",
      "uid": "PM767100",
      "acteurRef": "PA719130",
      "legislature": "15",
      "typeOrgane": "MISINFO",
      "dateDebut": "2019-09-18T02:00:00.000+02:00",
      "preseance": "10",
      "nominPrincipale": "1",
      "infosQualite": {
        "codeQualite": "Membre",
        "libQualite": "Membre",
        "libQualiteSex": "Membre"
      },
      "organesRefs": [
        "PO767069"
      ]
    },
    {
      "xsiType": "MandatSimple_Type",
      "uid": "PM767264",
      "acteurRef": "PA719130",
      "legislature": "15",
      "typeOrgane": "COMPER",
      "dateDebut": "2019-10-01T02:00:00.000+02:00",
      "datePublication": "2019-10-01T02:00:00.000+02:00",
      "preseance": "32",
      "nominPrincipale": "1",
      "infosQualite": {
        "codeQualite": "Membre",
        "libQualite": "Membre",
        "libQualiteSex": "Membre"
      },
      "organesRefs": [
        "PO59046"
      ]
    }
  ]
}