{
  "xsiType": "OrganeParlementaireInternational",
  "uid": "PO733167",
  "codeType": "GA",
  "libelle": "France-Cap-Vert",
  "libelleEdition": "de France-Cap-Vert",
  "libelleAbrege": "Cap-Vert",
  "libelleAbrev": "CAPV",
  "viMoDe": {
    "dateAgrement": "2017-07-19T02:00:00.000+02:00"
  },
  "regime": "5ème République",
  "legislature": "15",
  "secretariat": {
    "secretaire01": "Mme Bérengère Durand"
  },
  "listePays": [
    "GOP756549"
  ]
}