{
  "xsiType": "OrganeParlementaire_Type",
  "uid": "PO747210",
  "codeType": "GE",
  "libelle": "Sida",
  "libelleEdition": "SIDA",
  "libelleAbrege": "SIDA",
  "libelleAbrev": "SIDA",
  "viMoDe": {
    "dateAgrement": "2017-12-20T01:00:00.000+01:00"
  },
  "regime": "5ème République",
  "legislature": "15",
  "secretariat": {
    "secretaire01": "M. Lucas Fournier"
  }
}