{
  "uid": "PA736228",
  "etatCivil": {
    "ident": {
      "civ": "M.",
      "prenom": "Éric",
      "nom": "Gold",
      "alpha": "GOLD_Eric"
    },
    "infoNaissance": {
      "dateNais": "1964-06-07T01:00:00.000+01:00"
    }
  },
  "profession": {
    "socProcInsee": {}
  },
  "adresses": [
    {
      "xsiType": "AdresseSiteWeb_Type",
      "uid": "AD736527",
      "type": "23",
      "typeLibelle": "Url sénateur",
      "valElec": "https://www.senat.fr/senateur/gold_eric19387d.html"
    }
  ],
  "mandats": [
    {
      "xsiType": "MandatParlementaire_type",
      "uid": "PM736380",
      "acteurRef": "PA736228",
      "typeOrgane": "SENAT",
      "dateDebut": "2017-10-02T02:00:00.000+02:00",
      "preseance": "20",
      "nominPrincipale": "1",
      "infosQualite": {
        "codeQualite": "Sénateur",
        "libQualite": "SENATEUR",
        "libQualiteSex": "SENATEUR"
      },
      "organesRefs": [
        "PO78718"
      ],
      "election": {
        "lieu": {
          "numDepartement": "63"
        }
      },
      "mandature": {
        "premiereElection": "0"
      }
    },
    {
      "xsiType": "MandatSimple_Type",
      "uid": "PM741080",
      "acteurRef": "PA736228",
      "typeOrgane": "COMSENAT",
      "dateDebut": "2017-10-04T02:00:00.000+02:00",
      "preseance": "10",
      "nominPrincipale": "1",
      "infosQualite": {
        "codeQualite": "Membre",
        "libQualite": "Membre",
        "libQualiteSex": "Membre"
      },
      "organesRefs": [
        "PO516754"
      ]
    },
    {
      "xsiType": "MandatSimple_Type",
      "uid": "PM741572",
      "acteurRef": "PA736228",
      "typeOrgane": "GROUPESENAT",
      "dateDebut": "2017-10-03T02:00:00.000+02:00",
      "preseance": "4",
      "nominPrincipale": "1",
      "infosQualite": {
        "codeQualite": "Membre",
        "libQualite": "Membre",
        "libQualiteSex": "Membre"
      },
      "organesRefs": [
        "PO77714"
      ]
    },
    {
      "xsiType": "MandatSimple_Type",
      "uid": "PM766242",
      "acteurRef": "PA736228",
      "typeOrgane": "CMP",
      "dateDebut": "2019-07-03T02:00:00.000+02:00",
      "datePublication": "2019-07-05T02:00:00.000+02:00",
      "preseance": "28",
      "nominPrincipale": "1",
      "infosQualite": {
        "codeQualite": "Suppléant",
        "libQualite": "Membre suppléant",
        "libQualiteSex": "Membre suppléant"
      },
      "organesRefs": [
        "PO765825"
      ]
    }
  ]
}