{
  "xsiType": "OrganeExterne_Type",
  "uid": "PO717136",
  "codeType": "PRESREP",
  "libelle": "Présidence de la République : M. Emmanuel Macron",
  "libelleEdition": "de la République",
  "libelleAbrege": "Présidence de la République",
  "libelleAbrev": "PRESI",
  "viMoDe": {
    "dateDebut": "2017-05-14T02:00:00.000+02:00"
  }
}