{
  "xsiType": "OrganeParlementaireInternational",
  "uid": "PO733022",
  "codeType": "GA",
  "libelle": "France-Bahrein",
  "libelleEdition": "de France-Bahrein",
  "libelleAbrege": "Bahrein",
  "libelleAbrev": "BAH",
  "viMoDe": {
    "dateAgrement": "2017-07-19T02:00:00.000+02:00"
  },
  "regime": "5ème République",
  "legislature": "15",
  "secretariat": {
    "secretaire01": "M. Pascal Marchain"
  },
  "listePays": [
    "GOP756478"
  ]
}