{
  "uid": "PA608416",
  "etatCivil": {
    "ident": {
      "civ": "M.",
      "prenom": "Patrick",
      "nom": "Hetzel",
      "alpha": "Hetzel",
      "trigramme": "PHE"
    },
    "infoNaissance": {
      "dateNais": "1964-07-02T01:00:00.000+01:00",
      "villeNais": "Phalsbourg",
      "depNais": "Moselle",
      "paysNais": "France"
    }
  },
  "profession": {
    "libelleCourant": "Professeur des Universités",
    "socProcInsee": {
      "catSocPro": "Cadres de la fonction publique, professions intellectuelles et  artistiques",
      "famSocPro": "Cadres et professions intellectuelles supérieures"
    }
  },
  "uriHatvp": "https://www.hatvp.fr/pages_nominatives/hetzel-patrick",
  "adresses": [
    {
      "xsiType": "AdresseMail_Type",
      "uid": "AD648636",
      "type": "15",
      "typeLibelle": "Mèl",
      "valElec": "patrick.hetzel@assemblee-nationale.fr"
    },
    {
      "xsiType": "AdressePostale_Type",
      "uid": "AD648742",
      "type": "0",
      "typeLibelle": "Adresse officielle",
      "poids": "1",
      "intitule": "Assemblée nationale",
      "numeroRue": "126",
      "nomRue": "Rue de l'Université",
      "codePostal": "75355",
      "ville": "Paris 07 SP"
    },
    {
      "xsiType": "AdressePostale_Type",
      "uid": "AD695276",
      "type": "2",
      "typeLibelle": "Adresse publiée de circonscription",
      "poids": "23",
      "numeroRue": "9",
      "nomRue": "Rue de la Gare",
      "codePostal": "67700",
      "ville": "Saverne"
    },
    {
      "xsiType": "AdressePostale_Type",
      "uid": "AD725908",
      "type": "2",
      "typeLibelle": "Adresse publiée de circonscription",
      "poids": "22",
      "numeroRue": "14",
      "nomRue": "Rue de Phalsbourg",
      "codePostal": "67260",
      "ville": "Sarre-Union"
    },
    {
      "xsiType": "AdresseTelephonique_Type",
      "uid": "AD725910",
      "type": "11",
      "typeLibelle": "Téléphone",
      "poids": "22",
      "adresseDeRattachement": "AD725908",
      "valElec": "03 88 00 60 08"
    },
    {
      "xsiType": "AdresseSiteWeb_Type",
      "uid": "AD726212",
      "type": "22",
      "typeLibelle": "Site internet",
      "valElec": "www.patrick-hetzel.fr"
    },
    {
      "xsiType": "AdresseSiteWeb_Type",
      "uid": "AD726390",
      "type": "24",
      "typeLibelle": "Twitter",
      "valElec": "@patrickhetzel"
    },
    {
      "xsiType": "AdresseSiteWeb_Type",
      "uid": "AD726608",
      "type": "25",
      "typeLibelle": "Facebook",
      "valElec": "Patrick-Hetzel"
    },
    {
      "xsiType": "AdresseMail_Type",
      "uid": "AD726716",
      "type": "15",
      "typeLibelle": "Mèl",
      "valElec": "contact@patrick-hetzel.fr"
    },
    {
      "xsiType": "AdresseTelephonique_Type",
      "uid": "AD727331",
      "type": "11",
      "typeLibelle": "Téléphone",
      "poids": "23",
      "adresseDeRattachement": "AD695276",
      "valElec": "03 88 91 25 88"
    }
  ],
  "mandats": [
    {
      "xsiType": "MandatParlementaire_type",
      "uid": "PM645586",
      "acteurRef": "PA608416",
      "legislature": "14",
      "typeOrgane": "ASSEMBLEE",
      "dateDebut": "2012-06-20T02:00:00.000+02:00",
      "dateFin": "2017-06-20T02:00:00.000+02:00",
      "preseance": "50",
      "nominPrincipale": "1",
      "infosQualite": {
        "codeQualite": "membre",
        "libQualite": "membre",
        "libQualiteSex": "membre"
      },
      "organesRefs": [
        "PO644420"
      ],
      "suppleant": {
        "dateDebut": "2012-06-20T02:00:00.000+02:00",
        "dateFin": "2017-06-20T02:00:00.000+02:00",
        "suppleantRef": "PA642929"
      },
      "election": {
        "lieu": {
          "region": "Grand Est",
          "regionType": "Métropolitain",
          "departement": "Bas-Rhin",
          "numDepartement": "67",
          "numCirco": "7"
        },
        "causeMandat": "élections générales",
        "refCirconscription": "PO644770"
      },
      "mandature": {
        "datePriseFonction": "2012-06-20T02:00:00.000+02:00",
        "causeFin": "Fin de législature",
        "premiereElection": "0",
        "placeHemicycle": "079"
      }
    },
    {
      "xsiType": "MandatAvecSuppleant_Type",
      "uid": "PM671000",
      "acteurRef": "PA608416",
      "legislature": "14",
      "typeOrgane": "OFFPAR",
      "dateDebut": "2012-07-11T02:00:00.000+02:00",
      "datePublication": "2012-07-11T02:00:00.000+02:00",
      "dateFin": "2017-06-20T02:00:00.000+02:00",
      "preseance": "24",
      "nominPrincipale": "1",
      "infosQualite": {
        "codeQualite": "Membre",
        "libQualite": "Membre",
        "libQualiteSex": "Membre"
      },
      "organesRefs": [
        "PO273589"
      ]
    },
    {
      "xsiType": "MandatSimple_Type",
      "uid": "PM679061",
      "acteurRef": "PA608416",
      "legislature": "14",
      "typeOrgane": "ORGEXTPARL",
      "dateDebut": "2012-10-04T02:00:00.000+02:00",
      "datePublication": "2012-10-05T02:00:00.000+02:00",
      "dateFin": "2017-06-20T02:00:00.000+02:00",
      "preseance": "30",
      "nominPrincipale": "1",
      "infosQualite": {
        "codeQualite": "Suppléant",
        "libQualite": "Membre suppléant",
        "libQualiteSex": "Membre suppléant"
      },
      "organesRefs": [
        "PO60248"
      ]
    },
    {
      "xsiType": "MandatSimple_Type",
      "uid": "PM680869",
      "acteurRef": "PA608416",
      "legislature": "14",
      "typeOrgane": "GA",
      "dateDebut": "2012-10-15T02:00:00.000+02:00",
      "dateFin": "2017-06-20T02:00:00.000+02:00",
      "preseance": "20",
      "nominPrincipale": "1",
      "infosQualite": {
        "codeQualite": "Membre",
        "libQualite": "Membre",
        "libQualiteSex": "Membre"
      },
      "organesRefs": [
        "PO675835"
      ]
    },
    {
      "xsiType": "MandatSimple_Type",
      "uid": "PM680870",
      "acteurRef": "PA608416",
      "legislature": "14",
      "typeOrgane": "GA",
      "dateDebut": "2012-10-15T02:00:00.000+02:00",
      "dateFin": "2017-06-20T02:00:00.000+02:00",
      "preseance": "20",
      "nominPrincipale": "1",
      "infosQualite": {
        "codeQualite": "Membre",
        "libQualite": "Membre",
        "libQualiteSex": "Membre"
      },
      "organesRefs": [
        "PO675811"
      ]
    },
    {
      "xsiType": "MandatSimple_Type",
      "uid": "PM680871",
      "acteurRef": "PA608416",
      "legislature": "14",
      "typeOrgane": "GA",
      "dateDebut": "2012-10-15T02:00:00.000+02:00",
      "dateFin": "2017-06-20T02:00:00.000+02:00",
      "preseance": "20",
      "nominPrincipale": "1",
      "infosQualite": {
        "codeQualite": "Membre",
        "libQualite": "Membre",
        "libQualiteSex": "Membre"
      },
      "organesRefs": [
        "PO675764"
      ]
    },
    {
      "xsiType": "MandatSimple_Type",
      "uid": "PM688329",
      "acteurRef": "PA608416",
      "legislature": "14",
      "typeOrgane": "GE",
      "dateDebut": "2013-01-22T01:00:00.000+01:00",
      "dateFin": "2017-06-20T02:00:00.000+02:00",
      "preseance": "20",
      "nominPrincipale": "1",
      "infosQualite": {
        "codeQualite": "Membre",
        "libQualite": "Membre",
        "libQualiteSex": "Membre"
      },
      "organesRefs": [
        "PO686785"
      ]
    },
    {
      "xsiType": "MandatSimple_Type",
      "uid": "PM689365",
      "acteurRef": "PA608416",
      "legislature": "14",
      "typeOrgane": "GE",
      "dateDebut": "2013-01-23T01:00:00.000+01:00",
      "dateFin": "2017-06-20T02:00:00.000+02:00",
      "preseance": "20",
      "nominPrincipale": "1",
      "infosQualite": {
        "codeQualite": "Membre",
        "libQualite": "Membre",
        "libQualiteSex": "Membre"
      },
      "organesRefs": [
        "PO687076"
      ]
    },
    {
      "xsiType": "MandatSimple_Type",
      "uid": "PM693918",
      "acteurRef": "PA608416",
      "legislature": "14",
      "typeOrgane": "GE",
      "dateDebut": "2013-04-17T02:00:00.000+02:00",
      "dateFin": "2017-06-20T02:00:00.000+02:00",
      "preseance": "20",
      "nominPrincipale": "1",
      "infosQualite": {
        "codeQualite": "Membre",
        "libQualite": "Membre",
        "libQualiteSex": "Membre"
      },
      "organesRefs": [
        "PO692271"
      ]
    },
    {
      "xsiType": "MandatSimple_Type",
      "uid": "PM695172",
      "acteurRef": "PA608416",
      "legislature": "14",
      "typeOrgane": "GE",
      "dateDebut": "2012-12-18T01:00:00.000+01:00",
      "dateFin": "2017-06-20T02:00:00.000+02:00",
      "preseance": "20",
      "nominPrincipale": "1",
      "infosQualite": {
        "codeQualite": "Membre",
        "libQualite": "Membre",
        "libQualiteSex": "Membre"
      },
      "organesRefs": [
        "PO686266"
      ]
    },
    {
      "xsiType": "MandatSimple_Type",
      "uid": "PM695646",
      "acteurRef": "PA608416",
      "legislature": "14",
      "typeOrgane": "GE",
      "dateDebut": "2013-06-24T02:00:00.000+02:00",
      "dateFin": "2017-06-20T02:00:00.000+02:00",
      "preseance": "20",
      "nominPrincipale": "1",
      "infosQualite": {
        "codeQualite": "Membre",
        "libQualite": "Membre",
        "libQualiteSex": "Membre"
      },
      "organesRefs": [
        "PO688296"
      ]
    },
    {
      "xsiType": "MandatSimple_Type",
      "uid": "PM696429",
      "acteurRef": "PA608416",
      "legislature": "14",
      "typeOrgane": "GE",
      "dateDebut": "2013-07-23T02:00:00.000+02:00",
      "dateFin": "2017-06-20T02:00:00.000+02:00",
      "preseance": "20",
      "nominPrincipale": "1",
      "infosQualite": {
        "codeQualite": "Membre",
        "libQualite": "Membre",
        "libQualiteSex": "Membre"
      },
      "organesRefs": [
        "PO694572"
      ]
    },
    {
      "xsiType": "MandatSimple_Type",
      "uid": "PM702746",
      "acteurRef": "PA608416",
      "legislature": "14",
      "typeOrgane": "GE",
      "dateDebut": "2014-06-25T02:00:00.000+02:00",
      "dateFin": "2017-06-20T02:00:00.000+02:00",
      "preseance": "20",
      "nominPrincipale": "1",
      "infosQualite": {
        "codeQualite": "Membre",
        "libQualite": "Membre",
        "libQualiteSex": "Membre"
      },
      "organesRefs": [
        "PO702209"
      ]
    },
    {
      "xsiType": "MandatSimple_Type",
      "uid": "PM708274",
      "acteurRef": "PA608416",
      "legislature": "14",
      "typeOrgane": "GP",
      "dateDebut": "2015-06-02T02:00:00.000+02:00",
      "datePublication": "2015-06-02T02:00:00.000+02:00",
      "dateFin": "2017-06-20T02:00:00.000+02:00",
      "preseance": "20",
      "nominPrincipale": "1",
      "infosQualite": {
        "codeQualite": "Membre",
        "libQualite": "Membre du",
        "libQualiteSex": "Membre du"
      },
      "organesRefs": [
        "PO707869"
      ]
    },
    {
      "xsiType": "MandatSimple_Type",
      "uid": "PM710496",
      "acteurRef": "PA608416",
      "typeOrgane": "PARPOL",
      "dateDebut": "2015-12-01T01:00:00.000+01:00",
      "dateFin": "2017-06-20T02:00:00.000+02:00",
      "preseance": "5",
      "nominPrincipale": "1",
      "infosQualite": {
        "codeQualite": "Membre",
        "libQualite": "Membre",
        "libQualiteSex": "Membre"
      },
      "organesRefs": [
        "PO710396"
      ]
    },
    {
      "xsiType": "MandatSimple_Type",
      "uid": "PM714404",
      "acteurRef": "PA608416",
      "legislature": "14",
      "typeOrgane": "COMPER",
      "dateDebut": "2016-07-14T02:00:00.000+02:00",
      "datePublication": "2016-07-14T02:00:00.000+02:00",
      "dateFin": "2017-06-20T02:00:00.000+02:00",
      "preseance": "32",
      "nominPrincipale": "1",
      "infosQualite": {
        "codeQualite": "Membre",
        "libQualite": "Membre",
        "libQualiteSex": "Membre"
      },
      "organesRefs": [
        "PO59048"
      ]
    },
    {
      "xsiType": "MandatParlementaire_type",
      "uid": "PM723540",
      "acteurRef": "PA608416",
      "legislature": "15",
      "typeOrgane": "ASSEMBLEE",
      "dateDebut": "2017-06-18T02:00:00.000+02:00",
      "preseance": "50",
      "nominPrincipale": "1",
      "infosQualite": {
        "codeQualite": "membre",
        "libQualite": "membre",
        "libQualiteSex": "membre"
      },
      "organesRefs": [
        "PO717460"
      ],
      "suppleant": {
        "dateDebut": "2017-06-18T02:00:00.000+02:00",
        "suppleantRef": "PA722328"
      },
      "election": {
        "lieu": {
          "region": "Grand Est",
          "regionType": "Métropolitain",
          "departement": "Bas-Rhin",
          "numDepartement": "67",
          "numCirco": "7"
        },
        "causeMandat": "élections générales",
        "refCirconscription": "PO718138"
      },
      "mandature": {
        "datePriseFonction": "2017-06-21T02:00:00.000+02:00",
        "premiereElection": "1",
        "placeHemicycle": "079"
      },
      "collaborateurs": [
        {
          "qualite": "Mme",
          "prenom": "Nathalie",
          "nom": "Lozito"
        },
        {
          "qualite": "Mme",
          "prenom": "Catherine",
          "nom": "Rieffel"
        },
        {
          "qualite": "Mme",
          "prenom": "Françoise",
          "nom": "Le Chenadec"
        },
        {
          "qualite": "Mme",
          "prenom": "Sylvie",
          "nom": "Gruner"
        }
      ]
    },
    {
      "xsiType": "MandatSimple_Type",
      "uid": "PM724811",
      "acteurRef": "PA608416",
      "legislature": "15",
      "typeOrgane": "GP",
      "dateDebut": "2017-06-21T02:00:00.000+02:00",
      "dateFin": "2017-06-26T02:00:00.000+02:00",
      "preseance": "28",
      "nominPrincipale": "1",
      "infosQualite": {
        "codeQualite": "Député non-inscrit",
        "libQualite": "Député non-inscrit",
        "libQualiteSex": "Député non-inscrit"
      },
      "organesRefs": [
        "PO723569"
      ]
    },
    {
      "xsiType": "MandatSimple_Type",
      "uid": "PM731382",
      "acteurRef": "PA608416",
      "legislature": "15",
      "typeOrgane": "GP",
      "dateDebut": "2017-06-27T02:00:00.000+02:00",
      "datePublication": "2017-06-28T02:00:00.000+02:00",
      "preseance": "20",
      "nominPrincipale": "1",
      "infosQualite": {
        "codeQualite": "Membre",
        "libQualite": "Membre du",
        "libQualiteSex": "Membre du"
      },
      "organesRefs": [
        "PO730934"
      ]
    },
    {
      "xsiType": "MandatSimple_Type",
      "uid": "PM731692",
      "acteurRef": "PA608416",
      "legislature": "15",
      "typeOrgane": "COMPER",
      "dateDebut": "2017-06-29T02:00:00.000+02:00",
      "datePublication": "2017-06-29T02:00:00.000+02:00",
      "preseance": "32",
      "nominPrincipale": "1",
      "infosQualite": {
        "codeQualite": "Membre",
        "libQualite": "Membre",
        "libQualiteSex": "Membre"
      },
      "organesRefs": [
        "PO59048"
      ]
    },
    {
      "xsiType": "MandatAvecSuppleant_Type",
      "uid": "PM732606",
      "acteurRef": "PA608416",
      "legislature": "15",
      "typeOrgane": "OFFPAR",
      "dateDebut": "2017-07-12T02:00:00.000+02:00",
      "datePublication": "2017-07-12T02:00:00.000+02:00",
      "preseance": "24",
      "nominPrincipale": "0",
      "infosQualite": {
        "codeQualite": "Membre",
        "libQualite": "Membre",
        "libQualiteSex": "Membre"
      },
      "organesRefs": [
        "PO273589"
      ]
    },
    {
      "xsiType": "MandatAvecSuppleant_Type",
      "uid": "PM732816",
      "acteurRef": "PA608416",
      "legislature": "15",
      "typeOrgane": "OFFPAR",
      "dateDebut": "2017-07-18T02:00:00.000+02:00",
      "datePublication": "2017-07-18T02:00:00.000+02:00",
      "preseance": "10",
      "nominPrincipale": "1",
      "infosQualite": {
        "codeQualite": "Vice-Président",
        "libQualite": "Vice-Président",
        "libQualiteSex": "Vice-Président"
      },
      "organesRefs": [
        "PO273589"
      ]
    },
    {
      "xsiType": "MandatSimple_Type",
      "uid": "PM737568",
      "acteurRef": "PA608416",
      "legislature": "15",
      "typeOrgane": "GA",
      "dateDebut": "2017-10-05T02:00:00.000+02:00",
      "preseance": "20",
      "nominPrincipale": "0",
      "infosQualite": {
        "codeQualite": "Membre",
        "libQualite": "Membre",
        "libQualiteSex": "Membre"
      },
      "organesRefs": [
        "PO733607"
      ]
    },
    {
      "xsiType": "MandatSimple_Type",
      "uid": "PM745715",
      "acteurRef": "PA608416",
      "typeOrgane": "PARPOL",
      "dateDebut": "2017-12-01T01:00:00.000+01:00",
      "preseance": "5",
      "nominPrincipale": "1",
      "infosQualite": {
        "codeQualite": "Membre",
        "libQualite": "Membre",
        "libQualiteSex": "Membre"
      },
      "organesRefs": [
        "PO710396"
      ]
    },
    {
      "xsiType": "MandatMission_Type",
      "uid": "PM746410",
      "acteurRef": "PA608416",
      "legislature": "15",
      "typeOrgane": "MISINFO",
      "dateDebut": "2017-12-13T01:00:00.000+01:00",
      "datePublication": "2017-12-14T01:00:00.000+01:00",
      "preseance": "10",
      "nominPrincipale": "0",
      "infosQualite": {
        "codeQualite": "Membre",
        "libQualite": "Membre",
        "libQualiteSex": "Membre"
      },
      "organesRefs": [
        "PO746398"
      ]
    },
    {
      "xsiType": "MandatMission_Type",
      "uid": "PM746426",
      "acteurRef": "PA608416",
      "legislature": "15",
      "typeOrgane": "MISINFO",
      "dateDebut": "2017-12-13T01:00:00.000+01:00",
      "datePublication": "2017-12-14T01:00:00.000+01:00",
      "preseance": "2",
      "nominPrincipale": "1",
      "infosQualite": {
        "codeQualite": "Co-président",
        "libQualite": "Co-président",
        "libQualiteSex": "Co-président"
      },
      "organesRefs": [
        "PO746398"
      ]
    },
    {
      "xsiType": "MandatSimple_Type",
      "uid": "PM747772",
      "acteurRef": "PA608416",
      "legislature": "15",
      "typeOrgane": "GA",
      "dateDebut": "2017-10-25T02:00:00.000+02:00",
      "preseance": "8",
      "nominPrincipale": "1",
      "infosQualite": {
        "codeQualite": "Vice-Président",
        "libQualite": "Vice-Président",
        "libQualiteSex": "Vice-Président"
      },
      "organesRefs": [
        "PO733607"
      ]
    },
    {
      "xsiType": "MandatSimple_Type",
      "uid": "PM748888",
      "acteurRef": "PA608416",
      "legislature": "15",
      "typeOrgane": "GE",
      "dateDebut": "2018-02-01T01:00:00.000+01:00",
      "preseance": "20",
      "nominPrincipale": "0",
      "infosQualite": {
        "codeQualite": "Membre",
        "libQualite": "Membre",
        "libQualiteSex": "Membre"
      },
      "organesRefs": [
        "PO746904"
      ]
    },
    {
      "xsiType": "MandatSimple_Type",
      "uid": "PM748889",
      "acteurRef": "PA608416",
      "legislature": "15",
      "typeOrgane": "GE",
      "dateDebut": "2018-02-01T01:00:00.000+01:00",
      "preseance": "1",
      "nominPrincipale": "1",
      "infosQualite": {
        "codeQualite": "Président",
        "libQualite": "Président",
        "libQualiteSex": "Président"
      },
      "organesRefs": [
        "PO746904"
      ]
    },
    {
      "xsiType": "MandatSimple_Type",
      "uid": "PM749355",
      "acteurRef": "PA608416",
      "legislature": "15",
      "typeOrgane": "CMP",
      "dateDebut": "2018-02-12T01:00:00.000+01:00",
      "datePublication": "2018-02-10T01:00:00.000+01:00",
      "dateFin": "2018-02-15T01:00:00.000+01:00",
      "preseance": "20",
      "nominPrincipale": "1",
      "infosQualite": {
        "codeQualite": "Titulaire",
        "libQualite": "Membre titulaire",
        "libQualiteSex": "Membre titulaire"
      },
      "organesRefs": [
        "PO749252"
      ]
    },
    {
      "xsiType": "MandatSimple_Type",
      "uid": "PM751740",
      "acteurRef": "PA608416",
      "legislature": "15",
      "typeOrgane": "GE",
      "dateDebut": "2018-02-22T01:00:00.000+01:00",
      "preseance": "20",
      "nominPrincipale": "1",
      "infosQualite": {
        "codeQualite": "Membre",
        "libQualite": "Membre",
        "libQualiteSex": "Membre"
      },
      "organesRefs": [
        "PO746679"
      ]
    },
    {
      "xsiType": "MandatSimple_Type",
      "uid": "PM751775",
      "acteurRef": "PA608416",
      "legislature": "15",
      "typeOrgane": "GE",
      "dateDebut": "2018-02-22T01:00:00.000+01:00",
      "preseance": "20",
      "nominPrincipale": "0",
      "infosQualite": {
        "codeQualite": "Membre",
        "libQualite": "Membre",
        "libQualiteSex": "Membre"
      },
      "organesRefs": [
        "PO746920"
      ]
    },
    {
      "xsiType": "MandatMission_Type",
      "uid": "PM751898",
      "acteurRef": "PA608416",
      "legislature": "15",
      "typeOrgane": "MISINFO",
      "dateDebut": "2018-02-21T01:00:00.000+01:00",
      "preseance": "15",
      "nominPrincipale": "0",
      "infosQualite": {
        "codeQualite": "Rapporteur",
        "libQualite": "Rapporteur sur \"L'évaluation du financement public de la recherche dans les université\"",
        "libQualiteSex": "Rapporteur sur \"L'évaluation du financement public de la recherche dans les université\""
      },
      "organesRefs": [
        "PO746398"
      ]
    },
    {
      "xsiType": "MandatSimple_Type",
      "uid": "PM752030",
      "acteurRef": "PA608416",
      "legislature": "15",
      "typeOrgane": "GE",
      "dateDebut": "2018-02-26T01:00:00.000+01:00",
      "preseance": "20",
      "nominPrincipale": "1",
      "infosQualite": {
        "codeQualite": "Membre",
        "libQualite": "Membre",
        "libQualiteSex": "Membre"
      },
      "organesRefs": [
        "PO746649"
      ]
    },
    {
      "xsiType": "MandatSimple_Type",
      "uid": "PM753577",
      "acteurRef": "PA608416",
      "legislature": "15",
      "typeOrgane": "GE",
      "dateDebut": "2018-03-15T01:00:00.000+01:00",
      "preseance": "20",
      "nominPrincipale": "1",
      "infosQualite": {
        "codeQualite": "Membre",
        "libQualite": "Membre",
        "libQualiteSex": "Membre"
      },
      "organesRefs": [
        "PO746689"
      ]
    },
    {
      "xsiType": "MandatSimple_Type",
      "uid": "PM753583",
      "acteurRef": "PA608416",
      "legislature": "15",
      "typeOrgane": "GE",
      "dateDebut": "2018-03-15T01:00:00.000+01:00",
      "preseance": "20",
      "nominPrincipale": "1",
      "infosQualite": {
        "codeQualite": "Membre",
        "libQualite": "Membre",
        "libQualiteSex": "Membre"
      },
      "organesRefs": [
        "PO746925"
      ]
    },
    {
      "xsiType": "MandatSimple_Type",
      "uid": "PM754416",
      "acteurRef": "PA608416",
      "legislature": "15",
      "typeOrgane": "GE",
      "dateDebut": "2018-03-27T02:00:00.000+02:00",
      "preseance": "12",
      "nominPrincipale": "1",
      "infosQualite": {
        "codeQualite": "Secrétaire",
        "libQualite": "Secrétaire",
        "libQualiteSex": "Secrétaire"
      },
      "organesRefs": [
        "PO746920"
      ]
    },
    {
      "xsiType": "MandatSimple_Type",
      "uid": "PM755620",
      "acteurRef": "PA608416",
      "legislature": "15",
      "typeOrgane": "CMP",
      "dateDebut": "2018-04-18T02:00:00.000+02:00",
      "datePublication": "2018-04-18T02:00:00.000+02:00",
      "dateFin": "2018-07-25T02:00:00.000+02:00",
      "preseance": "20",
      "nominPrincipale": "1",
      "infosQualite": {
        "codeQualite": "Titulaire",
        "libQualite": "Membre titulaire",
        "libQualiteSex": "Membre titulaire"
      },
      "organesRefs": [
        "PO755413"
      ]
    },
    {
      "xsiType": "MandatSimple_Type",
      "uid": "PM755759",
      "acteurRef": "PA608416",
      "legislature": "15",
      "typeOrgane": "CMP",
      "dateDebut": "2018-04-19T02:00:00.000+02:00",
      "datePublication": "2018-04-20T02:00:00.000+02:00",
      "dateFin": "2018-07-25T02:00:00.000+02:00",
      "preseance": "1",
      "nominPrincipale": "1",
      "infosQualite": {
        "codeQualite": "Président",
        "libQualite": "Président",
        "libQualiteSex": "Président"
      },
      "organesRefs": [
        "PO755413"
      ]
    },
    {
      "xsiType": "MandatSimple_Type",
      "uid": "PM756971",
      "acteurRef": "PA608416",
      "legislature": "15",
      "typeOrgane": "ORGEXTPARL",
      "dateDebut": "2018-03-08T01:00:00.000+01:00",
      "datePublication": "2018-03-09T01:00:00.000+01:00",
      "preseance": "20",
      "nominPrincipale": "1",
      "infosQualite": {
        "codeQualite": "Titulaire",
        "libQualite": "Membre titulaire",
        "libQualiteSex": "Membre titulaire"
      },
      "organesRefs": [
        "PO756933"
      ]
    },
    {
      "xsiType": "MandatMission_Type",
      "uid": "PM757276",
      "acteurRef": "PA608416",
      "legislature": "15",
      "typeOrgane": "MISINFOPRE",
      "dateDebut": "2018-06-26T02:00:00.000+02:00",
      "datePublication": "2018-06-27T02:00:00.000+02:00",
      "dateFin": "2019-01-15T01:00:00.000+01:00",
      "preseance": "20",
      "nominPrincipale": "1",
      "infosQualite": {
        "codeQualite": "Membre",
        "libQualite": "Membre",
        "libQualiteSex": "Membre"
      },
      "organesRefs": [
        "PO757118"
      ]
    },
    {
      "xsiType": "MandatSimple_Type",
      "uid": "PM758011",
      "acteurRef": "PA608416",
      "legislature": "15",
      "typeOrgane": "CMP",
      "dateDebut": "2018-07-12T02:00:00.000+02:00",
      "datePublication": "2018-07-14T02:00:00.000+02:00",
      "dateFin": "2018-08-01T02:00:00.000+02:00",
      "preseance": "20",
      "nominPrincipale": "1",
      "infosQualite": {
        "codeQualite": "Titulaire",
        "libQualite": "Membre titulaire",
        "libQualiteSex": "Membre titulaire"
      },
      "organesRefs": [
        "PO757975"
      ]
    },
    {
      "xsiType": "MandatSimple_Type",
      "uid": "PM758070",
      "acteurRef": "PA608416",
      "legislature": "15",
      "typeOrgane": "CMP",
      "dateDebut": "2018-07-16T02:00:00.000+02:00",
      "datePublication": "2018-07-17T02:00:00.000+02:00",
      "dateFin": "2018-07-30T02:00:00.000+02:00",
      "preseance": "20",
      "nominPrincipale": "1",
      "infosQualite": {
        "codeQualite": "Titulaire",
        "libQualite": "Membre titulaire",
        "libQualiteSex": "Membre titulaire"
      },
      "organesRefs": [
        "PO758043"
      ]
    },
    {
      "xsiType": "MandatSimple_Type",
      "uid": "PM758414",
      "acteurRef": "PA608416",
      "legislature": "15",
      "typeOrgane": "GE",
      "dateDebut": "2018-08-01T02:00:00.000+02:00",
      "preseance": "20",
      "nominPrincipale": "1",
      "infosQualite": {
        "codeQualite": "Membre",
        "libQualite": "Membre",
        "libQualiteSex": "Membre"
      },
      "organesRefs": [
        "PO747281"
      ]
    },
    {
      "xsiType": "MandatSimple_Type",
      "uid": "PM763383",
      "acteurRef": "PA608416",
      "legislature": "15",
      "typeOrgane": "ORGEXTPARL",
      "dateDebut": "2019-03-14T01:00:00.000+01:00",
      "datePublication": "2019-03-15T01:00:00.000+01:00",
      "preseance": "20",
      "nominPrincipale": "1",
      "infosQualite": {
        "codeQualite": "Titulaire",
        "libQualite": "Membre titulaire",
        "libQualiteSex": "Membre titulaire"
      },
      "organesRefs": [
        "PO763346"
      ]
    },
    {
      "xsiType": "MandatSimple_Type",
      "uid": "PM766764",
      "acteurRef": "PA608416",
      "legislature": "15",
      "typeOrgane": "CNPS",
      "dateDebut": "2019-07-24T02:00:00.000+02:00",
      "datePublication": "2019-07-25T02:00:00.000+02:00",
      "preseance": "20",
      "nominPrincipale": "1",
      "infosQualite": {
        "codeQualite": "Membre",
        "libQualite": "Membre",
        "libQualiteSex": "Membre"
      },
      "organesRefs": [
        "PO766718"
      ]
    }
  ]
}