{
  "xsiType": "OrganeParlementaire_Type",
  "uid": "PO746935",
  "codeType": "GE",
  "libelle": "Francophonie",
  "libelleAbrege": "FRANCOPHONIE",
  "libelleAbrev": "FRANCOPHON",
  "viMoDe": {
    "dateAgrement": "2017-12-20T01:00:00.000+01:00"
  },
  "regime": "5ème République",
  "legislature": "15",
  "secretariat": {
    "secretaire01": "M. Alexandre Michel"
  }
}