{
  "uid": "PA719202",
  "etatCivil": {
    "ident": {
      "civ": "M.",
      "prenom": "Didier",
      "nom": "Paris",
      "alpha": "Paris",
      "trigramme": "DPA"
    },
    "infoNaissance": {
      "dateNais": "1954-02-14T01:00:00.000+01:00",
      "villeNais": "Paris",
      "depNais": "Paris",
      "paysNais": "France"
    }
  },
  "profession": {
    "libelleCourant": "Cadre supérieur (secteur privé)",
    "socProcInsee": {
      "catSocPro": "Cadres d'entreprise",
      "famSocPro": "Cadres et professions intellectuelles supérieures"
    }
  },
  "uriHatvp": "https://www.hatvp.fr/pages_nominatives/paris-didier",
  "adresses": [
    {
      "xsiType": "AdressePostale_Type",
      "uid": "AD719204",
      "type": "0",
      "typeLibelle": "Adresse officielle",
      "poids": "1",
      "intitule": "Assemblée nationale,",
      "numeroRue": "126",
      "nomRue": "Rue de l'Université,",
      "codePostal": "75355",
      "ville": "Paris 07 SP"
    },
    {
      "xsiType": "AdresseMail_Type",
      "uid": "AD728015",
      "type": "15",
      "typeLibelle": "Mèl",
      "valElec": "didier.paris@assemblee-nationale.fr"
    },
    {
      "xsiType": "AdresseSiteWeb_Type",
      "uid": "AD728916",
      "type": "25",
      "typeLibelle": "Facebook",
      "valElec": "didierparis2017"
    },
    {
      "xsiType": "AdresseMail_Type",
      "uid": "AD729156",
      "type": "15",
      "typeLibelle": "Mèl",
      "valElec": "permanence.dparis@gmail.com"
    },
    {
      "xsiType": "AdresseSiteWeb_Type",
      "uid": "AD757478",
      "type": "22",
      "typeLibelle": "Site internet",
      "valElec": "www.didier-paris.fr"
    },
    {
      "xsiType": "AdresseSiteWeb_Type",
      "uid": "AD758933",
      "type": "24",
      "typeLibelle": "Twitter",
      "valElec": "@DidierParis"
    }
  ],
  "mandats": [
    {
      "xsiType": "MandatParlementaire_type",
      "uid": "PM722592",
      "acteurRef": "PA719202",
      "legislature": "15",
      "typeOrgane": "ASSEMBLEE",
      "dateDebut": "2017-06-18T02:00:00.000+02:00",
      "preseance": "50",
      "nominPrincipale": "1",
      "infosQualite": {
        "codeQualite": "membre",
        "libQualite": "membre",
        "libQualiteSex": "membre"
      },
      "organesRefs": [
        "PO717460"
      ],
      "suppleant": {
        "dateDebut": "2017-06-18T02:00:00.000+02:00",
        "suppleantRef": "PA719206"
      },
      "election": {
        "lieu": {
          "region": "Bourgogne-Franche-Comté",
          "regionType": "Métropolitain",
          "departement": "Côte-d'Or",
          "numDepartement": "21",
          "numCirco": "5"
        },
        "causeMandat": "élections générales",
        "refCirconscription": "PO717620"
      },
      "mandature": {
        "datePriseFonction": "2017-06-21T02:00:00.000+02:00",
        "premiereElection": "0",
        "placeHemicycle": "403"
      },
      "collaborateurs": [
        {
          "qualite": "Mme",
          "prenom": "Valérie",
          "nom": "Paupert"
        },
        {
          "qualite": "Mme",
          "prenom": "Marie",
          "nom": "Verdier"
        },
        {
          "qualite": "M.",
          "prenom": "Jean-Claude",
          "nom": "Balès"
        }
      ]
    },
    {
      "xsiType": "MandatSimple_Type",
      "uid": "PM724337",
      "acteurRef": "PA719202",
      "legislature": "15",
      "typeOrgane": "GP",
      "dateDebut": "2017-06-21T02:00:00.000+02:00",
      "dateFin": "2017-06-26T02:00:00.000+02:00",
      "preseance": "28",
      "nominPrincipale": "1",
      "infosQualite": {
        "codeQualite": "Député non-inscrit",
        "libQualite": "Député non-inscrit",
        "libQualiteSex": "Député non-inscrit"
      },
      "organesRefs": [
        "PO723569"
      ]
    },
    {
      "xsiType": "MandatSimple_Type",
      "uid": "PM731021",
      "acteurRef": "PA719202",
      "legislature": "15",
      "typeOrgane": "GP",
      "dateDebut": "2017-06-27T02:00:00.000+02:00",
      "datePublication": "2017-06-28T02:00:00.000+02:00",
      "preseance": "20",
      "nominPrincipale": "1",
      "infosQualite": {
        "codeQualite": "Membre",
        "libQualite": "Membre du",
        "libQualiteSex": "Membre du"
      },
      "organesRefs": [
        "PO730964"
      ]
    },
    {
      "xsiType": "MandatSimple_Type",
      "uid": "PM731875",
      "acteurRef": "PA719202",
      "legislature": "15",
      "typeOrgane": "COMPER",
      "dateDebut": "2017-06-29T02:00:00.000+02:00",
      "datePublication": "2017-06-29T02:00:00.000+02:00",
      "preseance": "32",
      "nominPrincipale": "1",
      "infosQualite": {
        "codeQualite": "Membre",
        "libQualite": "Membre",
        "libQualiteSex": "Membre"
      },
      "organesRefs": [
        "PO59051"
      ]
    },
    {
      "xsiType": "MandatSimple_Type",
      "uid": "PM732268",
      "acteurRef": "PA719202",
      "legislature": "15",
      "typeOrgane": "COMPER",
      "dateDebut": "2017-06-30T02:00:00.000+02:00",
      "datePublication": "2017-06-30T02:00:00.000+02:00",
      "dateFin": "2019-09-30T02:00:00.000+02:00",
      "preseance": "8",
      "nominPrincipale": "1",
      "infosQualite": {
        "codeQualite": "Vice-Président",
        "libQualite": "Vice-président",
        "libQualiteSex": "Vice-président"
      },
      "organesRefs": [
        "PO59051"
      ]
    },
    {
      "xsiType": "MandatAvecSuppleant_Type",
      "uid": "PM732704",
      "acteurRef": "PA719202",
      "legislature": "15",
      "typeOrgane": "COMNL",
      "dateDebut": "2017-07-13T02:00:00.000+02:00",
      "datePublication": "2017-07-13T02:00:00.000+02:00",
      "preseance": "28",
      "nominPrincipale": "1",
      "infosQualite": {
        "codeQualite": "Suppléant",
        "libQualite": "Membre suppléant",
        "libQualiteSex": "Membre suppléant"
      },
      "organesRefs": [
        "PO271850"
      ]
    },
    {
      "xsiType": "MandatSimple_Type",
      "uid": "PM734433",
      "acteurRef": "PA719202",
      "legislature": "15",
      "typeOrgane": "API",
      "dateDebut": "2017-08-02T02:00:00.000+02:00",
      "datePublication": "2017-08-03T02:00:00.000+02:00",
      "preseance": "20",
      "nominPrincipale": "1",
      "infosQualite": {
        "codeQualite": "Membre",
        "libQualite": "Membre",
        "libQualiteSex": "Membre"
      },
      "organesRefs": [
        "PO58976"
      ]
    },
    {
      "xsiType": "MandatMission_Type",
      "uid": "PM734784",
      "acteurRef": "PA719202",
      "legislature": "15",
      "typeOrgane": "MISINFO",
      "dateDebut": "2017-09-13T02:00:00.000+02:00",
      "dateFin": "2018-01-31T01:00:00.000+01:00",
      "preseance": "10",
      "nominPrincipale": "1",
      "infosQualite": {
        "codeQualite": "Membre",
        "libQualite": "Membre",
        "libQualiteSex": "Membre"
      },
      "organesRefs": [
        "PO734758"
      ]
    },
    {
      "xsiType": "MandatSimple_Type",
      "uid": "PM735086",
      "acteurRef": "PA719202",
      "legislature": "15",
      "typeOrgane": "ORGEXTPARL",
      "dateDebut": "2017-09-22T02:00:00.000+02:00",
      "datePublication": "2017-09-23T02:00:00.000+02:00",
      "preseance": "20",
      "nominPrincipale": "1",
      "infosQualite": {
        "codeQualite": "Titulaire",
        "libQualite": "Membre titulaire",
        "libQualiteSex": "Membre titulaire"
      },
      "organesRefs": [
        "PO709198"
      ]
    },
    {
      "xsiType": "MandatSimple_Type",
      "uid": "PM735653",
      "acteurRef": "PA719202",
      "legislature": "15",
      "typeOrgane": "GA",
      "dateDebut": "2017-09-28T02:00:00.000+02:00",
      "preseance": "20",
      "nominPrincipale": "0",
      "infosQualite": {
        "codeQualite": "Membre",
        "libQualite": "Membre",
        "libQualiteSex": "Membre"
      },
      "organesRefs": [
        "PO733202"
      ]
    },
    {
      "xsiType": "MandatSimple_Type",
      "uid": "PM737150",
      "acteurRef": "PA719202",
      "legislature": "15",
      "typeOrgane": "GA",
      "dateDebut": "2017-10-04T02:00:00.000+02:00",
      "preseance": "20",
      "nominPrincipale": "1",
      "infosQualite": {
        "codeQualite": "Membre",
        "libQualite": "Membre",
        "libQualiteSex": "Membre"
      },
      "organesRefs": [
        "PO733412"
      ]
    },
    {
      "xsiType": "MandatSimple_Type",
      "uid": "PM741789",
      "acteurRef": "PA719202",
      "legislature": "15",
      "typeOrgane": "GA",
      "dateDebut": "2017-10-26T02:00:00.000+02:00",
      "preseance": "8",
      "nominPrincipale": "1",
      "infosQualite": {
        "codeQualite": "Vice-Président",
        "libQualite": "Vice-Président",
        "libQualiteSex": "Vice-Président"
      },
      "organesRefs": [
        "PO733202"
      ]
    },
    {
      "xsiType": "MandatMission_Type",
      "uid": "PM742865",
      "acteurRef": "PA719202",
      "legislature": "15",
      "typeOrgane": "MISINFOCOM",
      "dateDebut": "2017-11-08T01:00:00.000+01:00",
      "dateFin": "2018-05-31T02:00:00.000+02:00",
      "preseance": "20",
      "nominPrincipale": "1",
      "infosQualite": {
        "codeQualite": "Membre",
        "libQualite": "Membre",
        "libQualiteSex": "Membre"
      },
      "organesRefs": [
        "PO742386"
      ]
    },
    {
      "xsiType": "MandatAvecSuppleant_Type",
      "uid": "PM743398",
      "acteurRef": "PA719202",
      "legislature": "15",
      "typeOrgane": "CJR",
      "dateDebut": "2017-11-14T01:00:00.000+01:00",
      "datePublication": "2017-11-15T01:00:00.000+01:00",
      "preseance": "5",
      "nominPrincipale": "1",
      "infosQualite": {
        "codeQualite": "Juge suppléant",
        "libQualite": "Juge suppléant",
        "libQualiteSex": "Juge suppléant"
      },
      "organesRefs": [
        "PO58996"
      ]
    },
    {
      "xsiType": "MandatSimple_Type",
      "uid": "PM745339",
      "acteurRef": "PA719202",
      "typeOrgane": "PARPOL",
      "dateDebut": "2017-12-01T01:00:00.000+01:00",
      "dateFin": "2018-11-30T01:00:00.000+01:00",
      "preseance": "5",
      "nominPrincipale": "1",
      "infosQualite": {
        "codeQualite": "Membre",
        "libQualite": "Membre",
        "libQualiteSex": "Membre"
      },
      "organesRefs": [
        "PO744854"
      ]
    },
    {
      "xsiType": "MandatMission_Type",
      "uid": "PM746611",
      "acteurRef": "PA719202",
      "legislature": "15",
      "typeOrgane": "MINISTERE",
      "dateDebut": "2017-12-18T01:00:00.000+01:00",
      "datePublication": "2017-12-19T01:00:00.000+01:00",
      "dateFin": "2018-03-19T01:00:00.000+01:00",
      "preseance": "1",
      "nominPrincipale": "1",
      "infosQualite": {
        "codeQualite": "en mission",
        "libQualite": "en mission",
        "libQualiteSex": "en mission"
      },
      "organesRefs": [
        "PO729966"
      ],
      "libelle": "Préfiguration de l'Agence nationale des travaux d'intérêt général"
    },
    {
      "xsiType": "MandatMission_Type",
      "uid": "PM750170",
      "acteurRef": "PA719202",
      "legislature": "15",
      "typeOrgane": "MISINFO",
      "dateDebut": "2018-02-14T01:00:00.000+01:00",
      "preseance": "10",
      "nominPrincipale": "0",
      "infosQualite": {
        "codeQualite": "Membre",
        "libQualite": "Membre",
        "libQualiteSex": "Membre"
      },
      "organesRefs": [
        "PO750141"
      ]
    },
    {
      "xsiType": "MandatSimple_Type",
      "uid": "PM750221",
      "acteurRef": "PA719202",
      "legislature": "15",
      "typeOrgane": "GE",
      "dateDebut": "2018-02-13T01:00:00.000+01:00",
      "preseance": "20",
      "nominPrincipale": "0",
      "infosQualite": {
        "codeQualite": "Membre",
        "libQualite": "Membre",
        "libQualiteSex": "Membre"
      },
      "organesRefs": [
        "PO747266"
      ]
    },
    {
      "xsiType": "MandatSimple_Type",
      "uid": "PM752175",
      "acteurRef": "PA719202",
      "legislature": "15",
      "typeOrgane": "GE",
      "dateDebut": "2018-02-28T01:00:00.000+01:00",
      "preseance": "20",
      "nominPrincipale": "1",
      "infosQualite": {
        "codeQualite": "Membre",
        "libQualite": "Membre",
        "libQualiteSex": "Membre"
      },
      "organesRefs": [
        "PO747286"
      ]
    },
    {
      "xsiType": "MandatMission_Type",
      "uid": "PM752838",
      "acteurRef": "PA719202",
      "legislature": "15",
      "typeOrgane": "MISINFO",
      "dateDebut": "2018-03-07T01:00:00.000+01:00",
      "preseance": "1",
      "nominPrincipale": "1",
      "infosQualite": {
        "codeQualite": "Président-rapporteur",
        "libQualite": "Président-rapporteur",
        "libQualiteSex": "Président-rapporteur"
      },
      "organesRefs": [
        "PO750141"
      ]
    },
    {
      "xsiType": "MandatSimple_Type",
      "uid": "PM752900",
      "acteurRef": "PA719202",
      "legislature": "15",
      "typeOrgane": "GE",
      "dateDebut": "2018-03-08T01:00:00.000+01:00",
      "preseance": "20",
      "nominPrincipale": "1",
      "infosQualite": {
        "codeQualite": "Membre",
        "libQualite": "Membre",
        "libQualiteSex": "Membre"
      },
      "organesRefs": [
        "PO747129"
      ]
    },
    {
      "xsiType": "MandatSimple_Type",
      "uid": "PM753174",
      "acteurRef": "PA719202",
      "legislature": "15",
      "typeOrgane": "GE",
      "dateDebut": "2018-03-10T01:00:00.000+01:00",
      "preseance": "20",
      "nominPrincipale": "1",
      "infosQualite": {
        "codeQualite": "Membre",
        "libQualite": "Membre",
        "libQualiteSex": "Membre"
      },
      "organesRefs": [
        "PO747205"
      ]
    },
    {
      "xsiType": "MandatSimple_Type",
      "uid": "PM753508",
      "acteurRef": "PA719202",
      "legislature": "15",
      "typeOrgane": "GE",
      "dateDebut": "2018-03-13T01:00:00.000+01:00",
      "preseance": "8",
      "nominPrincipale": "1",
      "infosQualite": {
        "codeQualite": "Vice-Président",
        "libQualite": "Vice-Président",
        "libQualiteSex": "Vice-Président"
      },
      "organesRefs": [
        "PO747266"
      ]
    },
    {
      "xsiType": "MandatSimple_Type",
      "uid": "PM754510",
      "acteurRef": "PA719202",
      "legislature": "15",
      "typeOrgane": "GE",
      "dateDebut": "2018-03-29T02:00:00.000+02:00",
      "preseance": "20",
      "nominPrincipale": "0",
      "infosQualite": {
        "codeQualite": "Membre",
        "libQualite": "Membre",
        "libQualiteSex": "Membre"
      },
      "organesRefs": [
        "PO746957"
      ]
    },
    {
      "xsiType": "MandatSimple_Type",
      "uid": "PM755571",
      "acteurRef": "PA719202",
      "legislature": "15",
      "typeOrgane": "CMP",
      "dateDebut": "2018-04-18T02:00:00.000+02:00",
      "datePublication": "2018-04-18T02:00:00.000+02:00",
      "dateFin": "2018-05-23T02:00:00.000+02:00",
      "preseance": "28",
      "nominPrincipale": "1",
      "infosQualite": {
        "codeQualite": "Suppléant",
        "libQualite": "Membre suppléant",
        "libQualiteSex": "Membre suppléant"
      },
      "organesRefs": [
        "PO755391"
      ]
    },
    {
      "xsiType": "MandatSimple_Type",
      "uid": "PM755715",
      "acteurRef": "PA719202",
      "legislature": "15",
      "typeOrgane": "GE",
      "dateDebut": "2018-04-17T02:00:00.000+02:00",
      "preseance": "8",
      "nominPrincipale": "1",
      "infosQualite": {
        "codeQualite": "Vice-Président",
        "libQualite": "Vice-Président",
        "libQualiteSex": "Vice-Président"
      },
      "organesRefs": [
        "PO746957"
      ]
    },
    {
      "xsiType": "MandatSimple_Type",
      "uid": "PM756178",
      "acteurRef": "PA719202",
      "legislature": "15",
      "typeOrgane": "CMP",
      "dateDebut": "2018-05-17T02:00:00.000+02:00",
      "datePublication": "2018-05-18T02:00:00.000+02:00",
      "dateFin": "2018-06-21T02:00:00.000+02:00",
      "preseance": "20",
      "nominPrincipale": "1",
      "infosQualite": {
        "codeQualite": "Titulaire",
        "libQualite": "Membre titulaire",
        "libQualiteSex": "Membre titulaire"
      },
      "organesRefs": [
        "PO755798"
      ]
    },
    {
      "xsiType": "MandatMission_Type",
      "uid": "PM756743",
      "acteurRef": "PA719202",
      "legislature": "15",
      "typeOrgane": "MISINFO",
      "dateDebut": "2018-04-11T02:00:00.000+02:00",
      "dateFin": "2019-02-20T01:00:00.000+01:00",
      "preseance": "10",
      "nominPrincipale": "1",
      "infosQualite": {
        "codeQualite": "Membre",
        "libQualite": "Membre",
        "libQualiteSex": "Membre"
      },
      "organesRefs": [
        "PO754002"
      ]
    },
    {
      "xsiType": "MandatSimple_Type",
      "uid": "PM759033",
      "acteurRef": "PA719202",
      "legislature": "15",
      "typeOrgane": "CMP",
      "dateDebut": "2018-09-25T02:00:00.000+02:00",
      "datePublication": "2018-09-26T02:00:00.000+02:00",
      "dateFin": "2018-11-20T01:00:00.000+01:00",
      "preseance": "20",
      "nominPrincipale": "1",
      "infosQualite": {
        "codeQualite": "Titulaire",
        "libQualite": "Membre titulaire",
        "libQualiteSex": "Membre titulaire"
      },
      "organesRefs": [
        "PO758375"
      ]
    },
    {
      "xsiType": "MandatSimple_Type",
      "uid": "PM759061",
      "acteurRef": "PA719202",
      "legislature": "15",
      "typeOrgane": "CMP",
      "dateDebut": "2018-09-25T02:00:00.000+02:00",
      "datePublication": "2018-09-26T02:00:00.000+02:00",
      "dateFin": "2018-11-20T01:00:00.000+01:00",
      "preseance": "20",
      "nominPrincipale": "1",
      "infosQualite": {
        "codeQualite": "Titulaire",
        "libQualite": "Membre titulaire",
        "libQualiteSex": "Membre titulaire"
      },
      "organesRefs": [
        "PO758368"
      ]
    },
    {
      "xsiType": "MandatMission_Type",
      "uid": "PM759856",
      "acteurRef": "PA719202",
      "legislature": "15",
      "typeOrgane": "MISINFO",
      "dateDebut": "2018-10-17T02:00:00.000+02:00",
      "dateFin": "2019-07-24T02:00:00.000+02:00",
      "preseance": "10",
      "nominPrincipale": "1",
      "infosQualite": {
        "codeQualite": "Membre",
        "libQualite": "Membre",
        "libQualiteSex": "Membre"
      },
      "organesRefs": [
        "PO759271"
      ]
    },
    {
      "xsiType": "MandatSimple_Type",
      "uid": "PM760718",
      "acteurRef": "PA719202",
      "legislature": "15",
      "typeOrgane": "CMP",
      "dateDebut": "2018-11-28T01:00:00.000+01:00",
      "datePublication": "2018-11-29T01:00:00.000+01:00",
      "dateFin": "2019-02-18T01:00:00.000+01:00",
      "preseance": "20",
      "nominPrincipale": "1",
      "infosQualite": {
        "codeQualite": "Titulaire",
        "libQualite": "Membre titulaire",
        "libQualiteSex": "Membre titulaire"
      },
      "organesRefs": [
        "PO760711"
      ]
    },
    {
      "xsiType": "MandatSimple_Type",
      "uid": "PM760746",
      "acteurRef": "PA719202",
      "legislature": "15",
      "typeOrgane": "CMP",
      "dateDebut": "2018-11-27T01:00:00.000+01:00",
      "datePublication": "2018-11-29T01:00:00.000+01:00",
      "dateFin": "2019-02-20T01:00:00.000+01:00",
      "preseance": "20",
      "nominPrincipale": "1",
      "infosQualite": {
        "codeQualite": "Titulaire",
        "libQualite": "Membre titulaire",
        "libQualiteSex": "Membre titulaire"
      },
      "organesRefs": [
        "PO760704"
      ]
    },
    {
      "xsiType": "MandatSimple_Type",
      "uid": "PM761007",
      "acteurRef": "PA719202",
      "legislature": "15",
      "typeOrgane": "CMP",
      "dateDebut": "2018-12-13T01:00:00.000+01:00",
      "datePublication": "2018-12-14T01:00:00.000+01:00",
      "dateFin": "2019-02-18T01:00:00.000+01:00",
      "preseance": "16",
      "nominPrincipale": "1",
      "infosQualite": {
        "codeQualite": "Rapporteur",
        "libQualite": "Rapporteur",
        "libQualiteSex": "Rapporteur"
      },
      "organesRefs": [
        "PO760711"
      ]
    },
    {
      "xsiType": "MandatSimple_Type",
      "uid": "PM761013",
      "acteurRef": "PA719202",
      "legislature": "15",
      "typeOrgane": "CMP",
      "dateDebut": "2018-12-13T01:00:00.000+01:00",
      "datePublication": "2018-12-14T01:00:00.000+01:00",
      "dateFin": "2019-02-20T01:00:00.000+01:00",
      "preseance": "16",
      "nominPrincipale": "1",
      "infosQualite": {
        "codeQualite": "Rapporteur",
        "libQualite": "Rapporteur",
        "libQualiteSex": "Rapporteur"
      },
      "organesRefs": [
        "PO760704"
      ]
    },
    {
      "xsiType": "MandatSimple_Type",
      "uid": "PM761689",
      "acteurRef": "PA719202",
      "typeOrgane": "PARPOL",
      "dateDebut": "2018-12-01T01:00:00.000+01:00",
      "preseance": "5",
      "nominPrincipale": "1",
      "infosQualite": {
        "codeQualite": "Membre",
        "libQualite": "Membre",
        "libQualiteSex": "Membre"
      },
      "organesRefs": [
        "PO761294"
      ]
    },
    {
      "xsiType": "MandatSimple_Type",
      "uid": "PM763377",
      "acteurRef": "PA719202",
      "legislature": "15",
      "typeOrgane": "ORGEXTPARL",
      "dateDebut": "2019-03-14T01:00:00.000+01:00",
      "datePublication": "2019-03-15T01:00:00.000+01:00",
      "preseance": "20",
      "nominPrincipale": "1",
      "infosQualite": {
        "codeQualite": "Titulaire",
        "libQualite": "Membre titulaire",
        "libQualiteSex": "Membre titulaire"
      },
      "organesRefs": [
        "PO763346"
      ]
    },
    {
      "xsiType": "MandatMission_Type",
      "uid": "PM764418",
      "acteurRef": "PA719202",
      "legislature": "15",
      "typeOrgane": "MISINFO",
      "dateDebut": "2019-03-12T01:00:00.000+01:00",
      "preseance": "10",
      "nominPrincipale": "1",
      "infosQualite": {
        "codeQualite": "Membre",
        "libQualite": "Membre",
        "libQualiteSex": "Membre"
      },
      "organesRefs": [
        "PO764414"
      ]
    },
    {
      "xsiType": "MandatMission_Type",
      "uid": "PM765591",
      "acteurRef": "PA719202",
      "legislature": "15",
      "typeOrgane": "MISINFO",
      "dateDebut": "2019-06-05T02:00:00.000+02:00",
      "preseance": "10",
      "nominPrincipale": "0",
      "infosQualite": {
        "codeQualite": "Membre",
        "libQualite": "Membre",
        "libQualiteSex": "Membre"
      },
      "organesRefs": [
        "PO765565"
      ]
    },
    {
      "xsiType": "MandatMission_Type",
      "uid": "PM765593",
      "acteurRef": "PA719202",
      "legislature": "15",
      "typeOrgane": "MISINFO",
      "dateDebut": "2019-06-05T02:00:00.000+02:00",
      "preseance": "5",
      "nominPrincipale": "1",
      "infosQualite": {
        "codeQualite": "Co-rapporteur",
        "libQualite": "Co-rapporteur",
        "libQualiteSex": "Co-rapporteur"
      },
      "organesRefs": [
        "PO765565"
      ]
    },
    {
      "xsiType": "MandatSimple_Type",
      "uid": "PM767612",
      "acteurRef": "PA719202",
      "legislature": "15",
      "typeOrgane": "CNPE",
      "dateDebut": "2019-10-18T02:00:00.000+02:00",
      "datePublication": "2019-10-19T02:00:00.000+02:00",
      "preseance": "20",
      "nominPrincipale": "1",
      "infosQualite": {
        "codeQualite": "Membre",
        "libQualite": "Membre",
        "libQualiteSex": "Membre"
      },
      "organesRefs": [
        "PO767517"
      ]
    }
  ]
}