{
  "uid": "PA1476",
  "etatCivil": {
    "ident": {
      "civ": "Mme",
      "prenom": "Dominique",
      "nom": "Gillot",
      "alpha": "GILLOT DOMINIQUE_C5752"
    },
    "infoNaissance": {
      "dateNais": "1949-07-11T01:00:00.000+01:00",
      "villeNais": "Conflans-Sainte-Honorine",
      "depNais": "Yvelines"
    }
  },
  "profession": {
    "libelleCourant": "Institutrice",
    "socProcInsee": {
      "catSocPro": "Professions intermédiaires de l'enseignement, de la santé, de la fonction publique et assimilés",
      "famSocPro": "Professions Intermédiaires"
    }
  },
  "adresses": [
    {
      "xsiType": "AdressePostale_Type",
      "uid": "AD44488",
      "type": "2",
      "typeLibelle": "Adresse publiée de circonscription",
      "poids": "21",
      "numeroRue": "195",
      "nomRue": "Route Nationale,",
      "codePostal": "95610",
      "ville": "Eragny-sur-Oise"
    },
    {
      "xsiType": "AdressePostale_Type",
      "uid": "AD44497",
      "type": "0",
      "typeLibelle": "Adresse officielle",
      "poids": "1",
      "intitule": "Casier de la Poste,",
      "complementAdresse": "Palais Bourbon,",
      "codePostal": "75355",
      "ville": "Paris 07 SP"
    },
    {
      "xsiType": "AdresseTelephonique_Type",
      "uid": "AD47218",
      "type": "11",
      "typeLibelle": "Téléphone",
      "poids": "21",
      "adresseDeRattachement": "AD44488",
      "valElec": "01 34 64 31 28"
    },
    {
      "xsiType": "AdresseTelephonique_Type",
      "uid": "AD49016",
      "type": "12",
      "typeLibelle": "Télécopie",
      "poids": "21",
      "adresseDeRattachement": "AD44488",
      "valElec": "01 34 64 31 28"
    },
    {
      "xsiType": "AdresseMail_Type",
      "uid": "AD191180",
      "type": "15",
      "typeLibelle": "Mèl",
      "valElec": "dgillot@assemblee-nationale.fr"
    },
    {
      "xsiType": "AdresseSiteWeb_Type",
      "uid": "AD430069",
      "type": "23",
      "typeLibelle": "Url sénateur",
      "valElec": "https://www.senat.fr/senateur/gillot_dominique11089x.html"
    }
  ],
  "mandats": [
    {
      "xsiType": "MandatParlementaire_type",
      "uid": "PM429998",
      "acteurRef": "PA1476",
      "typeOrgane": "SENAT",
      "dateDebut": "2011-10-01T02:00:00.000+02:00",
      "dateFin": "2017-10-01T02:00:00.000+02:00",
      "preseance": "20",
      "nominPrincipale": "1",
      "infosQualite": {
        "codeQualite": "Sénateur",
        "libQualite": "SENATEUR",
        "libQualiteSex": "Sénateur 5ème République"
      },
      "organesRefs": [
        "PO78718"
      ],
      "election": {
        "lieu": {
          "numDepartement": "95"
        }
      },
      "mandature": {
        "premiereElection": "0"
      }
    },
    {
      "xsiType": "MandatSimple_Type",
      "uid": "PM430523",
      "acteurRef": "PA1476",
      "typeOrgane": "GROUPESENAT",
      "dateDebut": "2011-10-01T02:00:00.000+02:00",
      "dateFin": "2017-10-01T02:00:00.000+02:00",
      "preseance": "4",
      "nominPrincipale": "1",
      "infosQualite": {
        "codeQualite": "Membre",
        "libQualite": "Membre",
        "libQualiteSex": "Membre du"
      },
      "organesRefs": [
        "PO77710"
      ]
    },
    {
      "xsiType": "MandatSimple_Type",
      "uid": "PM517990",
      "acteurRef": "PA1476",
      "typeOrgane": "API",
      "dateDebut": "2012-01-30T01:00:00.000+01:00",
      "dateFin": "2017-10-01T02:00:00.000+02:00",
      "preseance": "20",
      "nominPrincipale": "1",
      "infosQualite": {
        "codeQualite": "Membre",
        "libQualite": "Membre",
        "libQualiteSex": "Membre"
      },
      "organesRefs": [
        "PO206064"
      ]
    },
    {
      "xsiType": "MandatAvecSuppleant_Type",
      "uid": "PM697765",
      "acteurRef": "PA1476",
      "typeOrgane": "OFFPAR",
      "dateDebut": "2013-10-03T02:00:00.000+02:00",
      "datePublication": "2013-10-03T02:00:00.000+02:00",
      "dateFin": "2017-10-01T02:00:00.000+02:00",
      "preseance": "24",
      "nominPrincipale": "1",
      "infosQualite": {
        "codeQualite": "Membre",
        "libQualite": "Membre",
        "libQualiteSex": "Membre"
      },
      "organesRefs": [
        "PO273589"
      ]
    },
    {
      "xsiType": "MandatSimple_Type",
      "uid": "PM704244",
      "acteurRef": "PA1476",
      "typeOrgane": "COMSENAT",
      "dateDebut": "2014-10-09T02:00:00.000+02:00",
      "dateFin": "2017-10-01T02:00:00.000+02:00",
      "nominPrincipale": "1",
      "infosQualite": {
        "libQualite": "Secrétaire"
      },
      "organesRefs": [
        "PO211490"
      ]
    },
    {
      "xsiType": "MandatSimple_Type",
      "uid": "PM704891",
      "acteurRef": "PA1476",
      "typeOrgane": "DELEGSENAT",
      "dateDebut": "2014-10-29T01:00:00.000+01:00",
      "preseance": "4",
      "nominPrincipale": "1",
      "infosQualite": {
        "codeQualite": "Membre",
        "libQualite": "Membre",
        "libQualiteSex": "Membre"
      },
      "organesRefs": [
        "PO420388"
      ]
    }
  ]
}