{
  "@xmlns": "http://schemas.assemblee-nationale.fr/referentiel",
  "@xmlns:xsi": "http://www.w3.org/2001/XMLSchema-instance",
  "@xsi:type": "OrganeExterne_Type",
  "uid": "PO730019",
  "codeType": "MINISTERE",
  "libelle": "Ministère auprès du ministre de l'Europe et des affaires étrangères, chargé des affaires européennes",
  "libelleEdition": "auprès du ministre de l'Europe et des affaires étrangères, chargée des affaires européennes",
  "libelleAbrege": "Affaires européennes",
  "libelleAbrev": "EUR",
  "viMoDe": {
    "dateDebut": "2017-06-22T02:00:00.000+02:00",
    "dateAgrement": null,
    "dateFin": "2019-03-27T01:00:00.000+01:00"
  },
  "organeParent": "PO725688"
}