{
  "@xmlns": "http://schemas.assemblee-nationale.fr/referentiel",
  "uid": {
    "@xmlns:xsi": "http://www.w3.org/2001/XMLSchema-instance",
    "@xsi:type": "IdActeur_type",
    "#text": "PA227098"
  },
  "etatCivil": {
    "ident": {
      "civ": "M.",
      "prenom": "Jean-Marie",
      "nom": "Vanlerenberghe",
      "alpha": "VANLERENBERGHE",
      "trigramme": {
        "@xmlns:xsi": "http://www.w3.org/2001/XMLSchema-instance",
        "@xsi:nil": "true"
      }
    },
    "infoNaissance": {
      "dateNais": "1939-03-29T00:00:00.000+00:00",
      "villeNais": {
        "@xmlns:xsi": "http://www.w3.org/2001/XMLSchema-instance",
        "@xsi:nil": "true"
      },
      "depNais": {
        "@xmlns:xsi": "http://www.w3.org/2001/XMLSchema-instance",
        "@xsi:nil": "true"
      },
      "paysNais": {
        "@xmlns:xsi": "http://www.w3.org/2001/XMLSchema-instance",
        "@xsi:nil": "true"
      }
    },
    "dateDeces": {
      "@xmlns:xsi": "http://www.w3.org/2001/XMLSchema-instance",
      "@xsi:nil": "true"
    }
  },
  "profession": {
    "libelleCourant": {
      "@xmlns:xsi": "http://www.w3.org/2001/XMLSchema-instance",
      "@xsi:nil": "true"
    },
    "socProcINSEE": {
      "catSocPro": {
        "@xmlns:xsi": "http://www.w3.org/2001/XMLSchema-instance",
        "@xsi:nil": "true"
      },
      "famSocPro": {
        "@xmlns:xsi": "http://www.w3.org/2001/XMLSchema-instance",
        "@xsi:nil": "true"
      }
    }
  },
  "uri_hatvp": {
    "@xmlns:xsi": "http://www.w3.org/2001/XMLSchema-instance",
    "@xsi:nil": "true"
  },
  "adresses": {
    "adresse": {
      "@xmlns:xsi": "http://www.w3.org/2001/XMLSchema-instance",
      "@xsi:type": "AdresseSiteWeb_Type",
      "uid": "AD316991",
      "type": "23",
      "typeLibelle": "Url sénateur",
      "poids": null,
      "adresseDeRattachement": null,
      "valElec": "https://www.senat.fr/senateur/vanlerenberghe_jean_marie01034p.html"
    }
  },
  "mandats": {
    "mandat": [
      {
        "@xmlns:xsi": "http://www.w3.org/2001/XMLSchema-instance",
        "@xsi:type": "MandatSimple_Type",
        "uid": "PM318653",
        "acteurRef": "PA227098",
        "legislature": null,
        "typeOrgane": "GROUPESENAT",
        "dateDebut": "2001-10-02T02:00:00.000+02:00",
        "datePublication": null,
        "dateFin": null,
        "preseance": "4",
        "nominPrincipale": "1",
        "infosQualite": {
          "codeQualite": "Membre",
          "libQualite": "Membre",
          "libQualiteSex": "Membre"
        },
        "organes": {
          "organeRef": "PO309463"
        }
      },
      {
        "@xmlns:xsi": "http://www.w3.org/2001/XMLSchema-instance",
        "@xsi:type": "MandatSimple_Type",
        "uid": "PM768352",
        "acteurRef": "PA227098",
        "legislature": null,
        "typeOrgane": "CMP",
        "dateDebut": "2019-11-19T01:00:00.000+01:00",
        "datePublication": "2019-11-20T01:00:00.000+01:00",
        "dateFin": null,
        "preseance": "16",
        "nominPrincipale": "1",
        "infosQualite": {
          "codeQualite": "Rapporteur",
          "libQualite": "Rapporteur",
          "libQualiteSex": "Rapporteur"
        },
        "organes": {
          "organeRef": "PO768194"
        }
      },
      {
        "@xmlns:xsi": "http://www.w3.org/2001/XMLSchema-instance",
        "@xsi:type": "MandatSimple_Type",
        "uid": "PM760456",
        "acteurRef": "PA227098",
        "legislature": null,
        "typeOrgane": "CMP",
        "dateDebut": "2018-11-15T01:00:00.000+01:00",
        "datePublication": "2018-11-21T01:00:00.000+01:00",
        "dateFin": "2018-12-03T01:00:00.000+01:00",
        "preseance": "20",
        "nominPrincipale": "1",
        "infosQualite": {
          "codeQualite": "Titulaire",
          "libQualite": "Membre titulaire",
          "libQualiteSex": "Membre titulaire"
        },
        "organes": {
          "organeRef": "PO760284"
        }
      },
      {
        "@xmlns:xsi": "http://www.w3.org/2001/XMLSchema-instance",
        "@xsi:type": "MandatSimple_Type",
        "uid": "PM768209",
        "acteurRef": "PA227098",
        "legislature": null,
        "typeOrgane": "CMP",
        "dateDebut": "2019-11-14T01:00:00.000+01:00",
        "datePublication": "2019-11-15T01:00:00.000+01:00",
        "dateFin": null,
        "preseance": "20",
        "nominPrincipale": "0",
        "infosQualite": {
          "codeQualite": "Titulaire",
          "libQualite": "Membre titulaire",
          "libQualiteSex": "Membre titulaire"
        },
        "organes": {
          "organeRef": "PO768194"
        }
      },
      {
        "@xmlns:xsi": "http://www.w3.org/2001/XMLSchema-instance",
        "@xsi:type": "MandatSimple_Type",
        "uid": "PM744558",
        "acteurRef": "PA227098",
        "legislature": null,
        "typeOrgane": "CMP",
        "dateDebut": "2017-11-30T01:00:00.000+01:00",
        "datePublication": "2017-12-01T01:00:00.000+01:00",
        "dateFin": "2017-12-20T01:00:00.000+01:00",
        "preseance": "20",
        "nominPrincipale": "1",
        "infosQualite": {
          "codeQualite": "Titulaire",
          "libQualite": "Membre titulaire",
          "libQualiteSex": "Membre titulaire"
        },
        "organes": {
          "organeRef": "PO739840"
        }
      },
      {
        "@xmlns:xsi": "http://www.w3.org/2001/XMLSchema-instance",
        "@xsi:type": "MandatSimple_Type",
        "uid": "PM760482",
        "acteurRef": "PA227098",
        "legislature": null,
        "typeOrgane": "CMP",
        "dateDebut": "2018-11-20T01:00:00.000+01:00",
        "datePublication": "2018-11-21T01:00:00.000+01:00",
        "dateFin": "2018-12-03T01:00:00.000+01:00",
        "preseance": "16",
        "nominPrincipale": "1",
        "infosQualite": {
          "codeQualite": "Rapporteur",
          "libQualite": "Rapporteur",
          "libQualiteSex": "Rapporteur"
        },
        "organes": {
          "organeRef": "PO760284"
        }
      },
      {
        "@xmlns:xsi": "http://www.w3.org/2001/XMLSchema-instance",
        "@xsi:type": "MandatSimple_Type",
        "uid": "PM743693",
        "acteurRef": "PA227098",
        "legislature": null,
        "typeOrgane": "CMP",
        "dateDebut": "2017-11-17T01:00:00.000+01:00",
        "datePublication": "2017-11-22T01:00:00.000+01:00",
        "dateFin": "2017-12-22T01:00:00.000+01:00",
        "preseance": "20",
        "nominPrincipale": "1",
        "infosQualite": {
          "codeQualite": "Titulaire",
          "libQualite": "Membre titulaire",
          "libQualiteSex": "Membre titulaire"
        },
        "organes": {
          "organeRef": "PO743571"
        }
      },
      {
        "@xmlns:xsi": "http://www.w3.org/2001/XMLSchema-instance",
        "@xsi:type": "MandatSimple_Type",
        "uid": "PM743782",
        "acteurRef": "PA227098",
        "legislature": null,
        "typeOrgane": "CMP",
        "dateDebut": "2017-11-22T01:00:00.000+01:00",
        "datePublication": "2017-11-23T01:00:00.000+01:00",
        "dateFin": "2017-12-22T01:00:00.000+01:00",
        "preseance": "16",
        "nominPrincipale": "1",
        "infosQualite": {
          "codeQualite": "Rapporteur",
          "libQualite": "Rapporteur",
          "libQualiteSex": "Rapporteur"
        },
        "organes": {
          "organeRef": "PO743571"
        }
      },
      {
        "@xmlns:xsi": "http://www.w3.org/2001/XMLSchema-instance",
        "@xsi:type": "MandatSimple_Type",
        "uid": "PM744585",
        "acteurRef": "PA227098",
        "legislature": null,
        "typeOrgane": "CMP",
        "dateDebut": "2017-11-30T01:00:00.000+01:00",
        "datePublication": "2017-12-01T01:00:00.000+01:00",
        "dateFin": "2018-02-15T01:00:00.000+01:00",
        "preseance": "20",
        "nominPrincipale": "1",
        "infosQualite": {
          "codeQualite": "Titulaire",
          "libQualite": "Membre titulaire",
          "libQualiteSex": "Membre titulaire"
        },
        "organes": {
          "organeRef": "PO739847"
        }
      },
      {
        "@xmlns:xsi": "http://www.w3.org/2001/XMLSchema-instance",
        "@xsi:type": "MandatSimple_Type",
        "uid": "PM704216",
        "acteurRef": "PA227098",
        "legislature": null,
        "typeOrgane": "COMSENAT",
        "dateDebut": "2014-10-09T02:00:00.000+02:00",
        "datePublication": null,
        "dateFin": "2017-10-04T02:00:00.000+02:00",
        "preseance": "5",
        "nominPrincipale": "1",
        "infosQualite": {
          "codeQualite": "Rapporteur général",
          "libQualite": "Rapporteur général",
          "libQualiteSex": "Rapporteur général"
        },
        "organes": {
          "organeRef": "PO211493"
        }
      },
      {
        "@xmlns:xsi": "http://www.w3.org/2001/XMLSchema-instance",
        "@xsi:type": "MandatSimple_Type",
        "uid": "PM741277",
        "acteurRef": "PA227098",
        "legislature": null,
        "typeOrgane": "COMSENAT",
        "dateDebut": "2017-10-05T02:00:00.000+02:00",
        "datePublication": null,
        "dateFin": null,
        "preseance": "5",
        "nominPrincipale": "1",
        "infosQualite": {
          "codeQualite": "Rapporteur général",
          "libQualite": "Rapporteur général",
          "libQualiteSex": "Rapporteur général"
        },
        "organes": {
          "organeRef": "PO211493"
        }
      },
      {
        "@xmlns:xsi": "http://www.w3.org/2001/XMLSchema-instance",
        "@xsi:type": "MandatParlementaire_type",
        "uid": "PM430012",
        "acteurRef": "PA227098",
        "legislature": null,
        "typeOrgane": "SENAT",
        "dateDebut": "2011-10-01T02:00:00.000+02:00",
        "datePublication": null,
        "dateFin": "2017-10-01T02:00:00.000+02:00",
        "preseance": "20",
        "nominPrincipale": "1",
        "infosQualite": {
          "codeQualite": "Sénateur",
          "libQualite": "SENATEUR",
          "libQualiteSex": "SENATEUR"
        },
        "organes": {
          "organeRef": "PO78718"
        },
        "suppleants": null,
        "chambre": null,
        "election": {
          "lieu": {
            "region": null,
            "regionType": null,
            "departement": null,
            "numDepartement": "62",
            "numCirco": null
          },
          "causeMandat": null
        },
        "mandature": {
          "datePriseFonction": null,
          "causeFin": null,
          "premiereElection": "0",
          "placeHemicycle": null,
          "mandatRemplaceRef": null
        },
        "collaborateurs": null
      },
      {
        "@xmlns:xsi": "http://www.w3.org/2001/XMLSchema-instance",
        "@xsi:type": "MandatParlementaire_type",
        "uid": "PM736321",
        "acteurRef": "PA227098",
        "legislature": null,
        "typeOrgane": "SENAT",
        "dateDebut": "2017-10-02T02:00:00.000+02:00",
        "datePublication": null,
        "dateFin": null,
        "preseance": "20",
        "nominPrincipale": "1",
        "infosQualite": {
          "codeQualite": "Sénateur",
          "libQualite": "SENATEUR",
          "libQualiteSex": "SENATEUR"
        },
        "organes": {
          "organeRef": "PO78718"
        },
        "suppleants": null,
        "chambre": null,
        "election": {
          "lieu": {
            "region": null,
            "regionType": null,
            "departement": null,
            "numDepartement": "62",
            "numCirco": null
          },
          "causeMandat": null
        },
        "mandature": {
          "datePriseFonction": null,
          "causeFin": null,
          "premiereElection": "0",
          "placeHemicycle": null,
          "mandatRemplaceRef": null
        },
        "collaborateurs": null
      },
      {
        "@xmlns:xsi": "http://www.w3.org/2001/XMLSchema-instance",
        "@xsi:type": "MandatSimple_Type",
        "uid": "PM765733",
        "acteurRef": "PA227098",
        "legislature": null,
        "typeOrgane": "CMP",
        "dateDebut": "2019-06-13T02:00:00.000+02:00",
        "datePublication": "2019-06-14T02:00:00.000+02:00",
        "dateFin": "2019-07-16T02:00:00.000+02:00",
        "preseance": "28",
        "nominPrincipale": "1",
        "infosQualite": {
          "codeQualite": "Suppléant",
          "libQualite": "Membre suppléant",
          "libQualiteSex": "Membre suppléant"
        },
        "organes": {
          "organeRef": "PO765701"
        }
      },
      {
        "@xmlns:xsi": "http://www.w3.org/2001/XMLSchema-instance",
        "@xsi:type": "MandatSimple_Type",
        "uid": "PM765042",
        "acteurRef": "PA227098",
        "legislature": null,
        "typeOrgane": "CMP",
        "dateDebut": "2019-05-03T02:00:00.000+02:00",
        "datePublication": "2019-05-11T02:00:00.000+02:00",
        "dateFin": "2019-07-04T02:00:00.000+02:00",
        "preseance": "28",
        "nominPrincipale": "1",
        "infosQualite": {
          "codeQualite": "Suppléant",
          "libQualite": "Membre suppléant",
          "libQualiteSex": "Membre suppléant"
        },
        "organes": {
          "organeRef": "PO764950"
        }
      }
    ]
  }
}