{
  "@xmlns": "http://schemas.assemblee-nationale.fr/referentiel",
  "@xmlns:xsi": "http://www.w3.org/2001/XMLSchema-instance",
  "@xsi:type": "OrganeExterne_Type",
  "uid": "PO686026",
  "codeType": "PARPOL",
  "libelle": "Parti socialiste guyanais",
  "libelleEdition": "Parti socialiste guyanais",
  "libelleAbrege": "Parti socialiste guyanais",
  "libelleAbrev": "PSG",
  "viMoDe": {
    "dateDebut": null,
    "dateAgrement": null,
    "dateFin": null
  },
  "organeParent": null
}