{
  "@xmlns": "http://schemas.assemblee-nationale.fr/referentiel",
  "@xmlns:xsi": "http://www.w3.org/2001/XMLSchema-instance",
  "@xsi:type": "OrganeExterne_Type",
  "uid": "PO309463",
  "codeType": "GROUPESENAT",
  "libelle": "UDI-UC",
  "libelleEdition": "de l'UDI-UC",
  "libelleAbrege": "UDI-UC",
  "libelleAbrev": "UCPOL",
  "viMoDe": {
    "dateDebut": "1995-10-02T01:00:00.000+01:00",
    "dateAgrement": null,
    "dateFin": null
  },
  "organeParent": null
}