{
  "@xmlns": "http://schemas.assemblee-nationale.fr/referentiel",
  "uid": {
    "@xmlns:xsi": "http://www.w3.org/2001/XMLSchema-instance",
    "@xsi:type": "IdActeur_type",
    "#text": "PA1029"
  },
  "etatCivil": {
    "ident": {
      "civ": "M.",
      "prenom": "Bernard",
      "nom": "Deflesselles",
      "alpha": "Deflesselles",
      "trigramme": "BDF"
    },
    "infoNaissance": {
      "dateNais": "1953-10-16T01:00:00.000+01:00",
      "villeNais": "Paris 6ème",
      "depNais": "Paris",
      "paysNais": "France"
    },
    "dateDeces": {
      "@xmlns:xsi": "http://www.w3.org/2001/XMLSchema-instance",
      "@xsi:nil": "true"
    }
  },
  "profession": {
    "libelleCourant": "Ingénieur",
    "socProcINSEE": {
      "catSocPro": "Cadres d'entreprise",
      "famSocPro": "Cadres et professions intellectuelles supérieures"
    }
  },
  "uri_hatvp": "https://www.hatvp.fr/pages_nominatives/deflesselles-bernard",
  "adresses": {
    "adresse": [
      {
        "@xmlns:xsi": "http://www.w3.org/2001/XMLSchema-instance",
        "@xsi:type": "AdressePostale_Type",
        "uid": "AD205683",
        "type": "2",
        "typeLibelle": "Adresse publiée de circonscription",
        "poids": "21",
        "adresseDeRattachement": null,
        "intitule": null,
        "numeroRue": "4",
        "nomRue": "Rue Chaulan,",
        "complementAdresse": null,
        "codePostal": "13400",
        "ville": "Aubagne"
      },
      {
        "@xmlns:xsi": "http://www.w3.org/2001/XMLSchema-instance",
        "@xsi:type": "AdresseTelephonique_Type",
        "uid": "AD205686",
        "type": "11",
        "typeLibelle": "Téléphone",
        "poids": "21",
        "adresseDeRattachement": "AD205683",
        "valElec": "04 42 82 20 10"
      },
      {
        "@xmlns:xsi": "http://www.w3.org/2001/XMLSchema-instance",
        "@xsi:type": "AdressePostale_Type",
        "uid": "AD386629",
        "type": "0",
        "typeLibelle": "Adresse officielle",
        "poids": "1",
        "adresseDeRattachement": null,
        "intitule": "Assemblée nationale,",
        "numeroRue": "126",
        "nomRue": "Rue de l'Université,",
        "complementAdresse": null,
        "codePostal": "75355",
        "ville": "Paris 07 SP"
      },
      {
        "@xmlns:xsi": "http://www.w3.org/2001/XMLSchema-instance",
        "@xsi:type": "AdresseMail_Type",
        "uid": "AD391653",
        "type": "15",
        "typeLibelle": "Mèl",
        "poids": null,
        "adresseDeRattachement": null,
        "valElec": "bernard.deflesselles@assemblee-nationale.fr"
      },
      {
        "@xmlns:xsi": "http://www.w3.org/2001/XMLSchema-instance",
        "@xsi:type": "AdresseMail_Type",
        "uid": "AD725008",
        "type": "15",
        "typeLibelle": "Mèl",
        "poids": null,
        "adresseDeRattachement": null,
        "valElec": "contact@bernarddeflesselles.com"
      },
      {
        "@xmlns:xsi": "http://www.w3.org/2001/XMLSchema-instance",
        "@xsi:type": "AdresseSiteWeb_Type",
        "uid": "AD725072",
        "type": "25",
        "typeLibelle": "Facebook",
        "poids": null,
        "adresseDeRattachement": null,
        "valElec": "bernarddeflesselles"
      },
      {
        "@xmlns:xsi": "http://www.w3.org/2001/XMLSchema-instance",
        "@xsi:type": "AdresseSiteWeb_Type",
        "uid": "AD725140",
        "type": "22",
        "typeLibelle": "Site internet",
        "poids": null,
        "adresseDeRattachement": null,
        "valElec": "www.bernarddeflesselles.com"
      },
      {
        "@xmlns:xsi": "http://www.w3.org/2001/XMLSchema-instance",
        "@xsi:type": "AdresseSiteWeb_Type",
        "uid": "AD725206",
        "type": "24",
        "typeLibelle": "Twitter",
        "poids": null,
        "adresseDeRattachement": null,
        "valElec": "@BDeflesselles"
      }
    ]
  },
  "mandats": {
    "mandat": [
      {
        "@xmlns:xsi": "http://www.w3.org/2001/XMLSchema-instance",
        "@xsi:type": "MandatAvecSuppleant_Type",
        "uid": "PM663937",
        "acteurRef": "PA1029",
        "legislature": "14",
        "typeOrgane": "COMNL",
        "dateDebut": "2012-07-04T02:00:00.000+02:00",
        "datePublication": "2012-07-04T02:00:00.000+02:00",
        "dateFin": "2017-06-20T02:00:00.000+02:00",
        "preseance": "20",
        "nominPrincipale": "1",
        "infosQualite": {
          "codeQualite": "Membre",
          "libQualite": "Membre",
          "libQualiteSex": "Membre"
        },
        "organes": {
          "organeRef": "PO415287"
        },
        "suppleants": null
      },
      {
        "@xmlns:xsi": "http://www.w3.org/2001/XMLSchema-instance",
        "@xsi:type": "MandatAvecSuppleant_Type",
        "uid": "PM732393",
        "acteurRef": "PA1029",
        "legislature": "15",
        "typeOrgane": "COMNL",
        "dateDebut": "2017-07-05T02:00:00.000+02:00",
        "datePublication": "2017-07-05T02:00:00.000+02:00",
        "dateFin": null,
        "preseance": "20",
        "nominPrincipale": "0",
        "infosQualite": {
          "codeQualite": "Membre",
          "libQualite": "Membre",
          "libQualiteSex": "Membre"
        },
        "organes": {
          "organeRef": "PO415287"
        },
        "suppleants": null
      },
      {
        "@xmlns:xsi": "http://www.w3.org/2001/XMLSchema-instance",
        "@xsi:type": "MandatMission_Type",
        "uid": "PM744386",
        "acteurRef": "PA1029",
        "legislature": "15",
        "typeOrgane": "MISINFO",
        "dateDebut": "2017-10-24T02:00:00.000+02:00",
        "datePublication": null,
        "dateFin": "2018-11-28T01:00:00.000+01:00",
        "preseance": "10",
        "nominPrincipale": "0",
        "infosQualite": {
          "codeQualite": "Membre",
          "libQualite": "Membre",
          "libQualiteSex": "Membre"
        },
        "organes": {
          "organeRef": "PO744364"
        },
        "libelle": null,
        "missionSuivanteRef": null,
        "missionPrecedenteRef": null
      },
      {
        "@xmlns:xsi": "http://www.w3.org/2001/XMLSchema-instance",
        "@xsi:type": "MandatMission_Type",
        "uid": "PM744388",
        "acteurRef": "PA1029",
        "legislature": "15",
        "typeOrgane": "MISINFO",
        "dateDebut": "2017-10-24T02:00:00.000+02:00",
        "datePublication": null,
        "dateFin": "2018-11-28T01:00:00.000+01:00",
        "preseance": "5",
        "nominPrincipale": "1",
        "infosQualite": {
          "codeQualite": "Co-rapporteur",
          "libQualite": "Co-rapporteur",
          "libQualiteSex": "Co-rapporteur"
        },
        "organes": {
          "organeRef": "PO744364"
        },
        "libelle": null,
        "missionSuivanteRef": null,
        "missionPrecedenteRef": null
      },
      {
        "@xmlns:xsi": "http://www.w3.org/2001/XMLSchema-instance",
        "@xsi:type": "MandatSimple_Type",
        "uid": "PM710447",
        "acteurRef": "PA1029",
        "legislature": null,
        "typeOrgane": "PARPOL",
        "dateDebut": "2015-12-01T01:00:00.000+01:00",
        "datePublication": null,
        "dateFin": "2017-06-20T02:00:00.000+02:00",
        "preseance": "5",
        "nominPrincipale": "1",
        "infosQualite": {
          "codeQualite": "Membre",
          "libQualite": "Membre",
          "libQualiteSex": "Membre"
        },
        "organes": {
          "organeRef": "PO710396"
        }
      },
      {
        "@xmlns:xsi": "http://www.w3.org/2001/XMLSchema-instance",
        "@xsi:type": "MandatSimple_Type",
        "uid": "PM745571",
        "acteurRef": "PA1029",
        "legislature": null,
        "typeOrgane": "PARPOL",
        "dateDebut": "2017-12-01T01:00:00.000+01:00",
        "datePublication": null,
        "dateFin": null,
        "preseance": "5",
        "nominPrincipale": "1",
        "infosQualite": {
          "codeQualite": "Membre",
          "libQualite": "Membre",
          "libQualiteSex": "Membre"
        },
        "organes": {
          "organeRef": "PO710396"
        }
      },
      {
        "@xmlns:xsi": "http://www.w3.org/2001/XMLSchema-instance",
        "@xsi:type": "MandatSimple_Type",
        "uid": "PM734429",
        "acteurRef": "PA1029",
        "legislature": "15",
        "typeOrgane": "API",
        "dateDebut": "2017-08-02T02:00:00.000+02:00",
        "datePublication": "2017-08-03T02:00:00.000+02:00",
        "dateFin": null,
        "preseance": "20",
        "nominPrincipale": "1",
        "infosQualite": {
          "codeQualite": "Membre",
          "libQualite": "Membre",
          "libQualiteSex": "Membre"
        },
        "organes": {
          "organeRef": "PO418755"
        }
      },
      {
        "@xmlns:xsi": "http://www.w3.org/2001/XMLSchema-instance",
        "@xsi:type": "MandatSimple_Type",
        "uid": "PM677628",
        "acteurRef": "PA1029",
        "legislature": "14",
        "typeOrgane": "API",
        "dateDebut": "2012-08-02T02:00:00.000+02:00",
        "datePublication": "2012-08-02T02:00:00.000+02:00",
        "dateFin": "2017-06-20T02:00:00.000+02:00",
        "preseance": "20",
        "nominPrincipale": "1",
        "infosQualite": {
          "codeQualite": "Membre",
          "libQualite": "Membre",
          "libQualiteSex": "Membre"
        },
        "organes": {
          "organeRef": "PO418755"
        }
      },
      {
        "@xmlns:xsi": "http://www.w3.org/2001/XMLSchema-instance",
        "@xsi:type": "MandatAvecSuppleant_Type",
        "uid": "PM732409",
        "acteurRef": "PA1029",
        "legislature": "15",
        "typeOrgane": "COMNL",
        "dateDebut": "2017-07-06T02:00:00.000+02:00",
        "datePublication": "2017-07-06T02:00:00.000+02:00",
        "dateFin": null,
        "preseance": "8",
        "nominPrincipale": "1",
        "infosQualite": {
          "codeQualite": "Vice-Président",
          "libQualite": "Vice-Président",
          "libQualiteSex": "Vice-Président"
        },
        "organes": {
          "organeRef": "PO415287"
        },
        "suppleants": null
      },
      {
        "@xmlns:xsi": "http://www.w3.org/2001/XMLSchema-instance",
        "@xsi:type": "MandatSimple_Type",
        "uid": "PM708216",
        "acteurRef": "PA1029",
        "legislature": "14",
        "typeOrgane": "GP",
        "dateDebut": "2015-06-02T02:00:00.000+02:00",
        "datePublication": "2015-06-02T02:00:00.000+02:00",
        "dateFin": "2017-06-20T02:00:00.000+02:00",
        "preseance": "20",
        "nominPrincipale": "1",
        "infosQualite": {
          "codeQualite": "Membre",
          "libQualite": "Membre du",
          "libQualiteSex": "Membre du"
        },
        "organes": {
          "organeRef": "PO707869"
        }
      },
      {
        "@xmlns:xsi": "http://www.w3.org/2001/XMLSchema-instance",
        "@xsi:type": "MandatSimple_Type",
        "uid": "PM731308",
        "acteurRef": "PA1029",
        "legislature": "15",
        "typeOrgane": "GP",
        "dateDebut": "2017-06-27T02:00:00.000+02:00",
        "datePublication": "2017-06-28T02:00:00.000+02:00",
        "dateFin": null,
        "preseance": "20",
        "nominPrincipale": "1",
        "infosQualite": {
          "codeQualite": "Membre",
          "libQualite": "Membre du",
          "libQualiteSex": "Membre du"
        },
        "organes": {
          "organeRef": "PO730934"
        }
      },
      {
        "@xmlns:xsi": "http://www.w3.org/2001/XMLSchema-instance",
        "@xsi:type": "MandatSimple_Type",
        "uid": "PM731751",
        "acteurRef": "PA1029",
        "legislature": "15",
        "typeOrgane": "COMPER",
        "dateDebut": "2017-06-29T02:00:00.000+02:00",
        "datePublication": "2017-06-29T02:00:00.000+02:00",
        "dateFin": null,
        "preseance": "32",
        "nominPrincipale": "1",
        "infosQualite": {
          "codeQualite": "Membre",
          "libQualite": "Membre",
          "libQualiteSex": "Membre"
        },
        "organes": {
          "organeRef": "PO59047"
        }
      },
      {
        "@xmlns:xsi": "http://www.w3.org/2001/XMLSchema-instance",
        "@xsi:type": "MandatSimple_Type",
        "uid": "PM657250",
        "acteurRef": "PA1029",
        "legislature": "14",
        "typeOrgane": "COMPER",
        "dateDebut": "2012-06-28T02:00:00.000+02:00",
        "datePublication": "2012-06-28T02:00:00.000+02:00",
        "dateFin": "2017-06-20T02:00:00.000+02:00",
        "preseance": "32",
        "nominPrincipale": "1",
        "infosQualite": {
          "codeQualite": "Membre",
          "libQualite": "Membre",
          "libQualiteSex": "Membre"
        },
        "organes": {
          "organeRef": "PO59046"
        }
      },
      {
        "@xmlns:xsi": "http://www.w3.org/2001/XMLSchema-instance",
        "@xsi:type": "MandatSimple_Type",
        "uid": "PM724299",
        "acteurRef": "PA1029",
        "legislature": "15",
        "typeOrgane": "GP",
        "dateDebut": "2017-06-21T02:00:00.000+02:00",
        "datePublication": null,
        "dateFin": "2017-06-26T02:00:00.000+02:00",
        "preseance": "28",
        "nominPrincipale": "1",
        "infosQualite": {
          "codeQualite": "Député non-inscrit",
          "libQualite": "Député non-inscrit",
          "libQualiteSex": "Député non-inscrit"
        },
        "organes": {
          "organeRef": "PO723569"
        }
      },
      {
        "@xmlns:xsi": "http://www.w3.org/2001/XMLSchema-instance",
        "@xsi:type": "MandatSimple_Type",
        "uid": "PM765367",
        "acteurRef": "PA1029",
        "legislature": "15",
        "typeOrgane": "GE",
        "dateDebut": "2019-05-29T02:00:00.000+02:00",
        "datePublication": null,
        "dateFin": null,
        "preseance": "20",
        "nominPrincipale": "1",
        "infosQualite": {
          "codeQualite": "Membre",
          "libQualite": "Membre",
          "libQualiteSex": "Membre"
        },
        "organes": {
          "organeRef": "PO763264"
        }
      },
      {
        "@xmlns:xsi": "http://www.w3.org/2001/XMLSchema-instance",
        "@xsi:type": "MandatSimple_Type",
        "uid": "PM692774",
        "acteurRef": "PA1029",
        "legislature": "14",
        "typeOrgane": "GE",
        "dateDebut": "2013-03-18T01:00:00.000+01:00",
        "datePublication": null,
        "dateFin": "2017-06-20T02:00:00.000+02:00",
        "preseance": "20",
        "nominPrincipale": "1",
        "infosQualite": {
          "codeQualite": "Membre",
          "libQualite": "Membre",
          "libQualiteSex": "Membre"
        },
        "organes": {
          "organeRef": "PO686835"
        }
      },
      {
        "@xmlns:xsi": "http://www.w3.org/2001/XMLSchema-instance",
        "@xsi:type": "MandatSimple_Type",
        "uid": "PM713500",
        "acteurRef": "PA1029",
        "legislature": "14",
        "typeOrgane": "GE",
        "dateDebut": "2016-05-31T02:00:00.000+02:00",
        "datePublication": null,
        "dateFin": "2017-06-20T02:00:00.000+02:00",
        "preseance": "20",
        "nominPrincipale": "1",
        "infosQualite": {
          "codeQualite": "Membre",
          "libQualite": "Membre",
          "libQualiteSex": "Membre"
        },
        "organes": {
          "organeRef": "PO712794"
        }
      },
      {
        "@xmlns:xsi": "http://www.w3.org/2001/XMLSchema-instance",
        "@xsi:type": "MandatSimple_Type",
        "uid": "PM752315",
        "acteurRef": "PA1029",
        "legislature": "15",
        "typeOrgane": "GE",
        "dateDebut": "2018-03-05T01:00:00.000+01:00",
        "datePublication": null,
        "dateFin": null,
        "preseance": "20",
        "nominPrincipale": "0",
        "infosQualite": {
          "codeQualite": "Membre",
          "libQualite": "Membre",
          "libQualiteSex": "Membre"
        },
        "organes": {
          "organeRef": "PO746977"
        }
      },
      {
        "@xmlns:xsi": "http://www.w3.org/2001/XMLSchema-instance",
        "@xsi:type": "MandatSimple_Type",
        "uid": "PM751823",
        "acteurRef": "PA1029",
        "legislature": "15",
        "typeOrgane": "GE",
        "dateDebut": "2018-02-22T01:00:00.000+01:00",
        "datePublication": null,
        "dateFin": null,
        "preseance": "20",
        "nominPrincipale": "1",
        "infosQualite": {
          "codeQualite": "Membre",
          "libQualite": "Membre",
          "libQualiteSex": "Membre"
        },
        "organes": {
          "organeRef": "PO747200"
        }
      },
      {
        "@xmlns:xsi": "http://www.w3.org/2001/XMLSchema-instance",
        "@xsi:type": "MandatSimple_Type",
        "uid": "PM739035",
        "acteurRef": "PA1029",
        "legislature": "15",
        "typeOrgane": "GA",
        "dateDebut": "2017-10-11T02:00:00.000+02:00",
        "datePublication": null,
        "dateFin": null,
        "preseance": "20",
        "nominPrincipale": "0",
        "infosQualite": {
          "codeQualite": "Membre",
          "libQualite": "Membre",
          "libQualiteSex": "Membre"
        },
        "organes": {
          "organeRef": "PO733057"
        }
      },
      {
        "@xmlns:xsi": "http://www.w3.org/2001/XMLSchema-instance",
        "@xsi:type": "MandatSimple_Type",
        "uid": "PM736054",
        "acteurRef": "PA1029",
        "legislature": "15",
        "typeOrgane": "GA",
        "dateDebut": "2017-09-29T02:00:00.000+02:00",
        "datePublication": null,
        "dateFin": null,
        "preseance": "20",
        "nominPrincipale": "1",
        "infosQualite": {
          "codeQualite": "Membre",
          "libQualite": "Membre",
          "libQualiteSex": "Membre"
        },
        "organes": {
          "organeRef": "PO733567"
        }
      },
      {
        "@xmlns:xsi": "http://www.w3.org/2001/XMLSchema-instance",
        "@xsi:type": "MandatSimple_Type",
        "uid": "PM699280",
        "acteurRef": "PA1029",
        "legislature": "14",
        "typeOrgane": "GA",
        "dateDebut": "2014-01-07T01:00:00.000+01:00",
        "datePublication": null,
        "dateFin": "2017-06-20T02:00:00.000+02:00",
        "preseance": "20",
        "nominPrincipale": "1",
        "infosQualite": {
          "codeQualite": "Membre",
          "libQualite": "Membre",
          "libQualiteSex": "Membre"
        },
        "organes": {
          "organeRef": "PO675811"
        }
      },
      {
        "@xmlns:xsi": "http://www.w3.org/2001/XMLSchema-instance",
        "@xsi:type": "MandatSimple_Type",
        "uid": "PM735171",
        "acteurRef": "PA1029",
        "legislature": "15",
        "typeOrgane": "GA",
        "dateDebut": "2017-09-26T02:00:00.000+02:00",
        "datePublication": null,
        "dateFin": null,
        "preseance": "20",
        "nominPrincipale": "0",
        "infosQualite": {
          "codeQualite": "Membre",
          "libQualite": "Membre",
          "libQualiteSex": "Membre"
        },
        "organes": {
          "organeRef": "PO733137"
        }
      },
      {
        "@xmlns:xsi": "http://www.w3.org/2001/XMLSchema-instance",
        "@xsi:type": "MandatSimple_Type",
        "uid": "PM680754",
        "acteurRef": "PA1029",
        "legislature": "14",
        "typeOrgane": "GA",
        "dateDebut": "2012-10-12T02:00:00.000+02:00",
        "datePublication": null,
        "dateFin": "2017-06-20T02:00:00.000+02:00",
        "preseance": "20",
        "nominPrincipale": "1",
        "infosQualite": {
          "codeQualite": "Membre",
          "libQualite": "Membre",
          "libQualiteSex": "Membre"
        },
        "organes": {
          "organeRef": "PO675799"
        }
      },
      {
        "@xmlns:xsi": "http://www.w3.org/2001/XMLSchema-instance",
        "@xsi:type": "MandatSimple_Type",
        "uid": "PM680756",
        "acteurRef": "PA1029",
        "legislature": "14",
        "typeOrgane": "GA",
        "dateDebut": "2012-10-12T02:00:00.000+02:00",
        "datePublication": null,
        "dateFin": "2017-06-20T02:00:00.000+02:00",
        "preseance": "20",
        "nominPrincipale": "1",
        "infosQualite": {
          "codeQualite": "Membre",
          "libQualite": "Membre",
          "libQualiteSex": "Membre"
        },
        "organes": {
          "organeRef": "PO675764"
        }
      },
      {
        "@xmlns:xsi": "http://www.w3.org/2001/XMLSchema-instance",
        "@xsi:type": "MandatSimple_Type",
        "uid": "PM736053",
        "acteurRef": "PA1029",
        "legislature": "15",
        "typeOrgane": "GA",
        "dateDebut": "2017-09-29T02:00:00.000+02:00",
        "datePublication": null,
        "dateFin": null,
        "preseance": "20",
        "nominPrincipale": "1",
        "infosQualite": {
          "codeQualite": "Membre",
          "libQualite": "Membre",
          "libQualiteSex": "Membre"
        },
        "organes": {
          "organeRef": "PO733382"
        }
      },
      {
        "@xmlns:xsi": "http://www.w3.org/2001/XMLSchema-instance",
        "@xsi:type": "MandatSimple_Type",
        "uid": "PM736055",
        "acteurRef": "PA1029",
        "legislature": "15",
        "typeOrgane": "GA",
        "dateDebut": "2017-09-29T02:00:00.000+02:00",
        "datePublication": null,
        "dateFin": null,
        "preseance": "20",
        "nominPrincipale": "1",
        "infosQualite": {
          "codeQualite": "Membre",
          "libQualite": "Membre",
          "libQualiteSex": "Membre"
        },
        "organes": {
          "organeRef": "PO733577"
        }
      },
      {
        "@xmlns:xsi": "http://www.w3.org/2001/XMLSchema-instance",
        "@xsi:type": "MandatSimple_Type",
        "uid": "PM739504",
        "acteurRef": "PA1029",
        "legislature": "15",
        "typeOrgane": "GA",
        "dateDebut": "2017-10-12T02:00:00.000+02:00",
        "datePublication": null,
        "dateFin": null,
        "preseance": "20",
        "nominPrincipale": "1",
        "infosQualite": {
          "codeQualite": "Membre",
          "libQualite": "Membre",
          "libQualiteSex": "Membre"
        },
        "organes": {
          "organeRef": "PO733517"
        }
      },
      {
        "@xmlns:xsi": "http://www.w3.org/2001/XMLSchema-instance",
        "@xsi:type": "MandatSimple_Type",
        "uid": "PM683655",
        "acteurRef": "PA1029",
        "legislature": "14",
        "typeOrgane": "GA",
        "dateDebut": "2012-10-30T01:00:00.000+01:00",
        "datePublication": null,
        "dateFin": "2017-06-20T02:00:00.000+02:00",
        "preseance": "20",
        "nominPrincipale": "1",
        "infosQualite": {
          "codeQualite": "Membre",
          "libQualite": "Membre",
          "libQualiteSex": "Membre"
        },
        "organes": {
          "organeRef": "PO675809"
        }
      },
      {
        "@xmlns:xsi": "http://www.w3.org/2001/XMLSchema-instance",
        "@xsi:type": "MandatSimple_Type",
        "uid": "PM735172",
        "acteurRef": "PA1029",
        "legislature": "15",
        "typeOrgane": "GA",
        "dateDebut": "2017-09-26T02:00:00.000+02:00",
        "datePublication": null,
        "dateFin": null,
        "preseance": "1",
        "nominPrincipale": "1",
        "infosQualite": {
          "codeQualite": "Président",
          "libQualite": "Président",
          "libQualiteSex": "Président"
        },
        "organes": {
          "organeRef": "PO733137"
        }
      },
      {
        "@xmlns:xsi": "http://www.w3.org/2001/XMLSchema-instance",
        "@xsi:type": "MandatSimple_Type",
        "uid": "PM680755",
        "acteurRef": "PA1029",
        "legislature": "14",
        "typeOrgane": "GA",
        "dateDebut": "2012-10-12T02:00:00.000+02:00",
        "datePublication": null,
        "dateFin": "2017-06-20T02:00:00.000+02:00",
        "preseance": "20",
        "nominPrincipale": "1",
        "infosQualite": {
          "codeQualite": "Membre",
          "libQualite": "Membre",
          "libQualiteSex": "Membre"
        },
        "organes": {
          "organeRef": "PO675825"
        }
      },
      {
        "@xmlns:xsi": "http://www.w3.org/2001/XMLSchema-instance",
        "@xsi:type": "MandatSimple_Type",
        "uid": "PM752696",
        "acteurRef": "PA1029",
        "legislature": "15",
        "typeOrgane": "GE",
        "dateDebut": "2018-03-07T01:00:00.000+01:00",
        "datePublication": null,
        "dateFin": null,
        "preseance": "8",
        "nominPrincipale": "1",
        "infosQualite": {
          "codeQualite": "Vice-Président",
          "libQualite": "Vice-Président",
          "libQualiteSex": "Vice-Président"
        },
        "organes": {
          "organeRef": "PO746977"
        }
      },
      {
        "@xmlns:xsi": "http://www.w3.org/2001/XMLSchema-instance",
        "@xsi:type": "MandatSimple_Type",
        "uid": "PM684843",
        "acteurRef": "PA1029",
        "legislature": "14",
        "typeOrgane": "GA",
        "dateDebut": "2012-11-21T01:00:00.000+01:00",
        "datePublication": null,
        "dateFin": "2017-06-20T02:00:00.000+02:00",
        "preseance": "8",
        "nominPrincipale": "1",
        "infosQualite": {
          "codeQualite": "Vice-Président",
          "libQualite": "Vice-Président",
          "libQualiteSex": "Vice-Président"
        },
        "organes": {
          "organeRef": "PO675825"
        }
      },
      {
        "@xmlns:xsi": "http://www.w3.org/2001/XMLSchema-instance",
        "@xsi:type": "MandatSimple_Type",
        "uid": "PM747623",
        "acteurRef": "PA1029",
        "legislature": "15",
        "typeOrgane": "GA",
        "dateDebut": "2017-11-22T01:00:00.000+01:00",
        "datePublication": null,
        "dateFin": null,
        "preseance": "8",
        "nominPrincipale": "1",
        "infosQualite": {
          "codeQualite": "Vice-Président",
          "libQualite": "Vice-Président",
          "libQualiteSex": "Vice-Président"
        },
        "organes": {
          "organeRef": "PO733057"
        }
      },
      {
        "@xmlns:xsi": "http://www.w3.org/2001/XMLSchema-instance",
        "@xsi:type": "MandatParlementaire_type",
        "uid": "PM722516",
        "acteurRef": "PA1029",
        "legislature": "15",
        "typeOrgane": "ASSEMBLEE",
        "dateDebut": "2017-06-18T02:00:00.000+02:00",
        "datePublication": null,
        "dateFin": null,
        "preseance": "50",
        "nominPrincipale": "1",
        "infosQualite": {
          "codeQualite": "membre",
          "libQualite": "membre",
          "libQualiteSex": "membre"
        },
        "organes": {
          "organeRef": "PO717460"
        },
        "suppleants": {
          "suppleant": {
            "dateDebut": "2017-06-18T02:00:00.000+02:00",
            "dateFin": null,
            "suppleantRef": "PA718970"
          }
        },
        "chambre": null,
        "election": {
          "lieu": {
            "region": "Provence-Alpes-Côte d'Azur",
            "regionType": "Métropolitain",
            "departement": "Bouches-du-Rhône",
            "numDepartement": "13",
            "numCirco": "9"
          },
          "causeMandat": "élections générales",
          "refCirconscription": "PO717548"
        },
        "mandature": {
          "datePriseFonction": "2017-06-21T02:00:00.000+02:00",
          "causeFin": null,
          "premiereElection": "1",
          "placeHemicycle": "088",
          "mandatRemplaceRef": null
        },
        "collaborateurs": {
          "collaborateur": [
            {
              "qualite": "Mme",
              "prenom": "Stéphanie",
              "nom": "Mayadoux",
              "dateDebut": null,
              "dateFin": null
            },
            {
              "qualite": "Mme",
              "prenom": "Stéphanie",
              "nom": "Montredon",
              "dateDebut": null,
              "dateFin": null
            },
            {
              "qualite": "Mme",
              "prenom": "Judith",
              "nom": "Dossemont",
              "dateDebut": null,
              "dateFin": null
            },
            {
              "qualite": "M.",
              "prenom": "Jean-Laurent",
              "nom": "Méfret",
              "dateDebut": null,
              "dateFin": null
            }
          ]
        }
      },
      {
        "@xmlns:xsi": "http://www.w3.org/2001/XMLSchema-instance",
        "@xsi:type": "MandatParlementaire_type",
        "uid": "PM645524",
        "acteurRef": "PA1029",
        "legislature": "14",
        "typeOrgane": "ASSEMBLEE",
        "dateDebut": "2012-06-20T02:00:00.000+02:00",
        "datePublication": null,
        "dateFin": "2017-06-20T02:00:00.000+02:00",
        "preseance": "50",
        "nominPrincipale": "1",
        "infosQualite": {
          "codeQualite": "membre",
          "libQualite": "membre",
          "libQualiteSex": "membre"
        },
        "organes": {
          "organeRef": "PO644420"
        },
        "suppleants": {
          "suppleant": {
            "dateDebut": "2012-06-20T02:00:00.000+02:00",
            "dateFin": "2017-06-20T02:00:00.000+02:00",
            "suppleantRef": "PA267717"
          }
        },
        "chambre": null,
        "election": {
          "lieu": {
            "region": "Provence-Alpes-Côte d'Azur",
            "regionType": "Métropolitain",
            "departement": "Bouches-du-Rhône",
            "numDepartement": "13",
            "numCirco": "9"
          },
          "causeMandat": "élections générales",
          "refCirconscription": "PO644472"
        },
        "mandature": {
          "datePriseFonction": "2012-06-20T02:00:00.000+02:00",
          "causeFin": "Fin de législature",
          "premiereElection": "1",
          "placeHemicycle": "088",
          "mandatRemplaceRef": null
        },
        "collaborateurs": null
      }
    ]
  }
}