{
  "@xmlns": "http://schemas.assemblee-nationale.fr/referentiel",
  "@xmlns:xsi": "http://www.w3.org/2001/XMLSchema-instance",
  "@xsi:type": "OrganeParlementaire_Type",
  "uid": "PO763254",
  "codeType": "GE",
  "libelle": "Objectifs de développement durable",
  "libelleEdition": "Objectifs de développement durable",
  "libelleAbrege": "OBJECTIFS DE DEVELOPPEMENT DURABLE",
  "libelleAbrev": "OBJDEVDUR",
  "viMoDe": {
    "dateDebut": null,
    "dateAgrement": "2019-03-06T01:00:00.000+01:00",
    "dateFin": null
  },
  "organeParent": null,
  "chambre": null,
  "regime": "5ème République",
  "legislature": "15",
  "secretariat": {
    "secretaire01": "M. Nicolas Liscia-Beaurenaut",
    "secretaire02": null
  }
}