{
  "@xmlns": "http://schemas.assemblee-nationale.fr/referentiel",
  "@xmlns:xsi": "http://www.w3.org/2001/XMLSchema-instance",
  "@xsi:type": "OrganeParlementaire_Type",
  "uid": "PO764648",
  "codeType": "MISINFO",
  "libelle": "Mission d'information relative à l'organisation territoriale de la santé mentale",
  "libelleEdition": "de la mission d'information relative à l'organisation territoriale de la santé mentale",
  "libelleAbrege": "organisation territoriale santé mentale",
  "libelleAbrev": "ORGSANTMEN",
  "viMoDe": {
    "dateDebut": "2019-04-10T02:00:00.000+02:00",
    "dateAgrement": null,
    "dateFin": null
  },
  "organeParent": "PO420120",
  "chambre": null,
  "regime": "5ème République",
  "legislature": "15",
  "secretariat": {
    "secretaire01": null,
    "secretaire02": null
  }
}