{
  "@xmlns": "http://schemas.assemblee-nationale.fr/referentiel",
  "@xmlns:xsi": "http://www.w3.org/2001/XMLSchema-instance",
  "@xsi:type": "OrganeParlementaire_Type",
  "uid": "PO766728",
  "codeType": "MISINFO",
  "libelle": "Suivi de l’application de la loi pour la conservation et la restauration de la cathédrale Notre Dame de Paris et instituant une souscription nationale à cet effet",
  "libelleEdition": "de la mission d'information pour le suivi de l’application de la loi pour la conservation et la restauration de la cathédrale Notre Dame de Paris et instituant une souscription nationale à cet effet",
  "libelleAbrege": "Application de la loi pour la conservation et la restauration de Notre Dame",
  "libelleAbrev": "NOTREDAME",
  "viMoDe": {
    "dateDebut": "2019-07-24T02:00:00.000+02:00",
    "dateAgrement": null,
    "dateFin": null
  },
  "organeParent": "PO419604",
  "chambre": null,
  "regime": "5ème République",
  "legislature": "15",
  "secretariat": {
    "secretaire01": null,
    "secretaire02": null
  }
}