{
  "@xmlns": "http://schemas.assemblee-nationale.fr/referentiel",
  "@xmlns:xsi": "http://www.w3.org/2001/XMLSchema-instance",
  "@xsi:type": "OrganeParlementaire_Type",
  "uid": "PO756719",
  "codeType": "CMP",
  "libelle": "Commission mixte paritaire chargée de proposer un texte sur les dispositions restant en discussion du projet de loi pour un nouveau pacte ferroviaire",
  "libelleEdition": "de la commission mixte paritaire chargée de proposer un texte sur les dispositions restant en discussion du projet de loi pour un nouveau pacte ferroviaire",
  "libelleAbrege": "Pacte ferroviaire",
  "libelleAbrev": "764",
  "viMoDe": {
    "dateDebut": "2018-06-06T02:00:00.000+02:00",
    "dateAgrement": null,
    "dateFin": "2018-06-14T02:00:00.000+02:00"
  },
  "organeParent": null,
  "chambre": null,
  "regime": "5ème République",
  "legislature": "15",
  "secretariat": {
    "secretaire01": null,
    "secretaire02": null
  }
}