{
  "@xmlns": "http://schemas.assemblee-nationale.fr/referentiel",
  "uid": {
    "@xmlns:xsi": "http://www.w3.org/2001/XMLSchema-instance",
    "@xsi:type": "IdActeur_type",
    "#text": "PA267785"
  },
  "etatCivil": {
    "ident": {
      "civ": "M.",
      "prenom": "Guillaume",
      "nom": "Larrivé",
      "alpha": "Larrive",
      "trigramme": "GLA"
    },
    "infoNaissance": {
      "dateNais": "1977-01-24T01:00:00.000+01:00",
      "villeNais": "Mulhouse",
      "depNais": "Haut-Rhin",
      "paysNais": "France"
    },
    "dateDeces": {
      "@xmlns:xsi": "http://www.w3.org/2001/XMLSchema-instance",
      "@xsi:nil": "true"
    }
  },
  "profession": {
    "libelleCourant": "Maître des requêtes au Conseil d'État-Avocat",
    "socProcINSEE": {
      "catSocPro": "Professions libérales et assimilés",
      "famSocPro": "Cadres et professions intellectuelles supérieures"
    }
  },
  "uri_hatvp": "https://www.hatvp.fr/pages_nominatives/larrive-guillaume",
  "adresses": {
    "adresse": [
      {
        "@xmlns:xsi": "http://www.w3.org/2001/XMLSchema-instance",
        "@xsi:type": "AdressePostale_Type",
        "uid": "AD650621",
        "type": "0",
        "typeLibelle": "Adresse officielle",
        "poids": "1",
        "adresseDeRattachement": null,
        "intitule": "Assemblée nationale",
        "numeroRue": "126",
        "nomRue": "Rue de l'Université",
        "complementAdresse": null,
        "codePostal": "75355",
        "ville": "Paris 07 SP"
      },
      {
        "@xmlns:xsi": "http://www.w3.org/2001/XMLSchema-instance",
        "@xsi:type": "AdressePostale_Type",
        "uid": "AD650622",
        "type": "2",
        "typeLibelle": "Adresse publiée de circonscription",
        "poids": "22",
        "adresseDeRattachement": null,
        "intitule": null,
        "numeroRue": "3",
        "nomRue": "Impasse Maison Fort",
        "complementAdresse": null,
        "codePostal": "89000",
        "ville": "Auxerre"
      },
      {
        "@xmlns:xsi": "http://www.w3.org/2001/XMLSchema-instance",
        "@xsi:type": "AdresseSiteWeb_Type",
        "uid": "AD725018",
        "type": "25",
        "typeLibelle": "Facebook",
        "poids": null,
        "adresseDeRattachement": null,
        "valElec": "guillaumelarrive"
      },
      {
        "@xmlns:xsi": "http://www.w3.org/2001/XMLSchema-instance",
        "@xsi:type": "AdresseSiteWeb_Type",
        "uid": "AD725264",
        "type": "22",
        "typeLibelle": "Site internet",
        "poids": null,
        "adresseDeRattachement": null,
        "valElec": "www.larrive.com"
      },
      {
        "@xmlns:xsi": "http://www.w3.org/2001/XMLSchema-instance",
        "@xsi:type": "AdresseSiteWeb_Type",
        "uid": "AD725336",
        "type": "24",
        "typeLibelle": "Twitter",
        "poids": null,
        "adresseDeRattachement": null,
        "valElec": "@GLarrive"
      },
      {
        "@xmlns:xsi": "http://www.w3.org/2001/XMLSchema-instance",
        "@xsi:type": "AdresseMail_Type",
        "uid": "AD727926",
        "type": "15",
        "typeLibelle": "Mèl",
        "poids": null,
        "adresseDeRattachement": null,
        "valElec": "guillaume.larrive@assemblee-nationale.fr"
      },
      {
        "@xmlns:xsi": "http://www.w3.org/2001/XMLSchema-instance",
        "@xsi:type": "AdresseTelephonique_Type",
        "uid": "AD730933",
        "type": "11",
        "typeLibelle": "Téléphone",
        "poids": "22",
        "adresseDeRattachement": "AD650622",
        "valElec": "03 86 48 37 88"
      }
    ]
  },
  "mandats": {
    "mandat": [
      {
        "@xmlns:xsi": "http://www.w3.org/2001/XMLSchema-instance",
        "@xsi:type": "MandatAvecSuppleant_Type",
        "uid": "PM743391",
        "acteurRef": "PA267785",
        "legislature": "15",
        "typeOrgane": "CJR",
        "dateDebut": "2017-11-14T01:00:00.000+01:00",
        "datePublication": "2017-11-15T01:00:00.000+01:00",
        "dateFin": null,
        "preseance": "1",
        "nominPrincipale": "1",
        "infosQualite": {
          "codeQualite": "Juge titulaire",
          "libQualite": "Juge titulaire",
          "libQualiteSex": "Juge titulaire"
        },
        "organes": {
          "organeRef": "PO58996"
        },
        "suppleants": {
          "suppleant": {
            "dateDebut": "2017-11-14T01:00:00.000+01:00",
            "dateFin": null,
            "suppleantRef": "PA942"
          }
        }
      },
      {
        "@xmlns:xsi": "http://www.w3.org/2001/XMLSchema-instance",
        "@xsi:type": "MandatSimple_Type",
        "uid": "PM676951",
        "acteurRef": "PA267785",
        "legislature": "14",
        "typeOrgane": "DELEG",
        "dateDebut": "2012-07-25T02:00:00.000+02:00",
        "datePublication": "2012-07-25T02:00:00.000+02:00",
        "dateFin": "2017-06-20T02:00:00.000+02:00",
        "preseance": "20",
        "nominPrincipale": "1",
        "infosQualite": {
          "codeQualite": "Membre",
          "libQualite": "Membre",
          "libQualiteSex": "Membre"
        },
        "organes": {
          "organeRef": "PO675659"
        }
      },
      {
        "@xmlns:xsi": "http://www.w3.org/2001/XMLSchema-instance",
        "@xsi:type": "MandatMission_Type",
        "uid": "PM767906",
        "acteurRef": "PA267785",
        "legislature": "15",
        "typeOrgane": "MISINFOCOM",
        "dateDebut": "2019-10-30T01:00:00.000+01:00",
        "datePublication": "2019-10-31T01:00:00.000+01:00",
        "dateFin": null,
        "preseance": "20",
        "nominPrincipale": "0",
        "infosQualite": {
          "codeQualite": "Membre",
          "libQualite": "Membre",
          "libQualiteSex": "Membre"
        },
        "organes": {
          "organeRef": "PO767897"
        },
        "libelle": null,
        "missionSuivanteRef": null,
        "missionPrecedenteRef": null
      },
      {
        "@xmlns:xsi": "http://www.w3.org/2001/XMLSchema-instance",
        "@xsi:type": "MandatSimple_Type",
        "uid": "PM710511",
        "acteurRef": "PA267785",
        "legislature": null,
        "typeOrgane": "PARPOL",
        "dateDebut": "2015-12-01T01:00:00.000+01:00",
        "datePublication": null,
        "dateFin": "2017-06-20T02:00:00.000+02:00",
        "preseance": "5",
        "nominPrincipale": "1",
        "infosQualite": {
          "codeQualite": "Membre",
          "libQualite": "Membre",
          "libQualiteSex": "Membre"
        },
        "organes": {
          "organeRef": "PO710396"
        }
      },
      {
        "@xmlns:xsi": "http://www.w3.org/2001/XMLSchema-instance",
        "@xsi:type": "MandatMission_Type",
        "uid": "PM764431",
        "acteurRef": "PA267785",
        "legislature": "15",
        "typeOrgane": "MISINFO",
        "dateDebut": "2019-03-12T01:00:00.000+01:00",
        "datePublication": null,
        "dateFin": null,
        "preseance": "10",
        "nominPrincipale": "1",
        "infosQualite": {
          "codeQualite": "Membre",
          "libQualite": "Membre",
          "libQualiteSex": "Membre"
        },
        "organes": {
          "organeRef": "PO764414"
        },
        "libelle": null,
        "missionSuivanteRef": null,
        "missionPrecedenteRef": null
      },
      {
        "@xmlns:xsi": "http://www.w3.org/2001/XMLSchema-instance",
        "@xsi:type": "MandatSimple_Type",
        "uid": "PM745695",
        "acteurRef": "PA267785",
        "legislature": null,
        "typeOrgane": "PARPOL",
        "dateDebut": "2017-12-01T01:00:00.000+01:00",
        "datePublication": null,
        "dateFin": null,
        "preseance": "5",
        "nominPrincipale": "1",
        "infosQualite": {
          "codeQualite": "Membre",
          "libQualite": "Membre",
          "libQualiteSex": "Membre"
        },
        "organes": {
          "organeRef": "PO710396"
        }
      },
      {
        "@xmlns:xsi": "http://www.w3.org/2001/XMLSchema-instance",
        "@xsi:type": "MandatMission_Type",
        "uid": "PM738121",
        "acteurRef": "PA267785",
        "legislature": "15",
        "typeOrgane": "MISINFO",
        "dateDebut": "2017-09-13T02:00:00.000+02:00",
        "datePublication": null,
        "dateFin": "2018-02-15T01:00:00.000+01:00",
        "preseance": "10",
        "nominPrincipale": "0",
        "infosQualite": {
          "codeQualite": "Membre",
          "libQualite": "Membre",
          "libQualiteSex": "Membre"
        },
        "organes": {
          "organeRef": "PO738117"
        },
        "libelle": null,
        "missionSuivanteRef": null,
        "missionPrecedenteRef": null
      },
      {
        "@xmlns:xsi": "http://www.w3.org/2001/XMLSchema-instance",
        "@xsi:type": "MandatMission_Type",
        "uid": "PM738125",
        "acteurRef": "PA267785",
        "legislature": "15",
        "typeOrgane": "MISINFO",
        "dateDebut": "2017-09-13T02:00:00.000+02:00",
        "datePublication": null,
        "dateFin": "2018-02-15T01:00:00.000+01:00",
        "preseance": "5",
        "nominPrincipale": "1",
        "infosQualite": {
          "codeQualite": "Co-rapporteur",
          "libQualite": "Co-rapporteur",
          "libQualiteSex": "Co-rapporteur"
        },
        "organes": {
          "organeRef": "PO738117"
        },
        "libelle": null,
        "missionSuivanteRef": null,
        "missionPrecedenteRef": null
      },
      {
        "@xmlns:xsi": "http://www.w3.org/2001/XMLSchema-instance",
        "@xsi:type": "MandatSimple_Type",
        "uid": "PM742143",
        "acteurRef": "PA267785",
        "legislature": "15",
        "typeOrgane": "API",
        "dateDebut": "2017-10-27T02:00:00.000+02:00",
        "datePublication": "2017-10-28T02:00:00.000+02:00",
        "dateFin": null,
        "preseance": "20",
        "nominPrincipale": "0",
        "infosQualite": {
          "codeQualite": "Membre",
          "libQualite": "Membre",
          "libQualiteSex": "Membre"
        },
        "organes": {
          "organeRef": "PO201115"
        }
      },
      {
        "@xmlns:xsi": "http://www.w3.org/2001/XMLSchema-instance",
        "@xsi:type": "MandatSimple_Type",
        "uid": "PM682404",
        "acteurRef": "PA267785",
        "legislature": "14",
        "typeOrgane": "GEVI",
        "dateDebut": "2012-10-17T02:00:00.000+02:00",
        "datePublication": null,
        "dateFin": "2017-06-20T02:00:00.000+02:00",
        "preseance": "20",
        "nominPrincipale": "1",
        "infosQualite": {
          "codeQualite": "Membre",
          "libQualite": "Membre",
          "libQualiteSex": "Membre"
        },
        "organes": {
          "organeRef": "PO675743"
        }
      },
      {
        "@xmlns:xsi": "http://www.w3.org/2001/XMLSchema-instance",
        "@xsi:type": "MandatSimple_Type",
        "uid": "PM767628",
        "acteurRef": "PA267785",
        "legislature": "15",
        "typeOrgane": "CNPE",
        "dateDebut": "2019-10-18T02:00:00.000+02:00",
        "datePublication": "2019-10-19T02:00:00.000+02:00",
        "dateFin": null,
        "preseance": "20",
        "nominPrincipale": "1",
        "infosQualite": {
          "codeQualite": "Membre",
          "libQualite": "Membre",
          "libQualiteSex": "Membre"
        },
        "organes": {
          "organeRef": "PO767517"
        }
      },
      {
        "@xmlns:xsi": "http://www.w3.org/2001/XMLSchema-instance",
        "@xsi:type": "MandatAvecSuppleant_Type",
        "uid": "PM712186",
        "acteurRef": "PA267785",
        "legislature": "14",
        "typeOrgane": "COMNL",
        "dateDebut": "2016-03-31T02:00:00.000+02:00",
        "datePublication": "2016-03-31T02:00:00.000+02:00",
        "dateFin": "2017-06-20T02:00:00.000+02:00",
        "preseance": "24",
        "nominPrincipale": "1",
        "infosQualite": {
          "codeQualite": "Titulaire",
          "libQualite": "Membre titulaire",
          "libQualiteSex": "Membre titulaire"
        },
        "organes": {
          "organeRef": "PO271850"
        },
        "suppleants": null
      },
      {
        "@xmlns:xsi": "http://www.w3.org/2001/XMLSchema-instance",
        "@xsi:type": "MandatMission_Type",
        "uid": "PM767907",
        "acteurRef": "PA267785",
        "legislature": "15",
        "typeOrgane": "MISINFOCOM",
        "dateDebut": "2019-10-30T01:00:00.000+01:00",
        "datePublication": "2019-10-31T01:00:00.000+01:00",
        "dateFin": null,
        "preseance": "1",
        "nominPrincipale": "1",
        "infosQualite": {
          "codeQualite": "Président",
          "libQualite": "Président",
          "libQualiteSex": "Président"
        },
        "organes": {
          "organeRef": "PO767897"
        },
        "libelle": null,
        "missionSuivanteRef": null,
        "missionPrecedenteRef": null
      },
      {
        "@xmlns:xsi": "http://www.w3.org/2001/XMLSchema-instance",
        "@xsi:type": "MandatSimple_Type",
        "uid": "PM708130",
        "acteurRef": "PA267785",
        "legislature": "14",
        "typeOrgane": "GP",
        "dateDebut": "2015-06-02T02:00:00.000+02:00",
        "datePublication": "2015-06-02T02:00:00.000+02:00",
        "dateFin": "2017-06-20T02:00:00.000+02:00",
        "preseance": "20",
        "nominPrincipale": "1",
        "infosQualite": {
          "codeQualite": "Membre",
          "libQualite": "Membre du",
          "libQualiteSex": "Membre du"
        },
        "organes": {
          "organeRef": "PO707869"
        }
      },
      {
        "@xmlns:xsi": "http://www.w3.org/2001/XMLSchema-instance",
        "@xsi:type": "MandatSimple_Type",
        "uid": "PM731371",
        "acteurRef": "PA267785",
        "legislature": "15",
        "typeOrgane": "GP",
        "dateDebut": "2017-06-27T02:00:00.000+02:00",
        "datePublication": "2017-06-28T02:00:00.000+02:00",
        "dateFin": null,
        "preseance": "20",
        "nominPrincipale": "1",
        "infosQualite": {
          "codeQualite": "Membre",
          "libQualite": "Membre du",
          "libQualiteSex": "Membre du"
        },
        "organes": {
          "organeRef": "PO730934"
        }
      },
      {
        "@xmlns:xsi": "http://www.w3.org/2001/XMLSchema-instance",
        "@xsi:type": "MandatSimple_Type",
        "uid": "PM748175",
        "acteurRef": "PA267785",
        "legislature": "15",
        "typeOrgane": "API",
        "dateDebut": "2018-01-26T01:00:00.000+01:00",
        "datePublication": null,
        "dateFin": null,
        "preseance": "4",
        "nominPrincipale": "1",
        "infosQualite": {
          "codeQualite": "Vice-Président",
          "libQualite": "Vice-Président",
          "libQualiteSex": "Vice-Président"
        },
        "organes": {
          "organeRef": "PO201115"
        }
      },
      {
        "@xmlns:xsi": "http://www.w3.org/2001/XMLSchema-instance",
        "@xsi:type": "MandatSimple_Type",
        "uid": "PM759436",
        "acteurRef": "PA267785",
        "legislature": "15",
        "typeOrgane": "COMPER",
        "dateDebut": "2018-10-13T02:00:00.000+02:00",
        "datePublication": "2018-10-13T02:00:00.000+02:00",
        "dateFin": "2018-12-03T01:00:00.000+01:00",
        "preseance": "32",
        "nominPrincipale": "1",
        "infosQualite": {
          "codeQualite": "Membre",
          "libQualite": "Membre",
          "libQualiteSex": "Membre"
        },
        "organes": {
          "organeRef": "PO59046"
        }
      },
      {
        "@xmlns:xsi": "http://www.w3.org/2001/XMLSchema-instance",
        "@xsi:type": "MandatSimple_Type",
        "uid": "PM688308",
        "acteurRef": "PA267785",
        "legislature": "14",
        "typeOrgane": "COMPER",
        "dateDebut": "2013-01-21T01:00:00.000+01:00",
        "datePublication": "2013-01-22T01:00:00.000+01:00",
        "dateFin": "2017-06-20T02:00:00.000+02:00",
        "preseance": "32",
        "nominPrincipale": "1",
        "infosQualite": {
          "codeQualite": "Membre",
          "libQualite": "Membre",
          "libQualiteSex": "Membre"
        },
        "organes": {
          "organeRef": "PO59051"
        }
      },
      {
        "@xmlns:xsi": "http://www.w3.org/2001/XMLSchema-instance",
        "@xsi:type": "MandatSimple_Type",
        "uid": "PM731870",
        "acteurRef": "PA267785",
        "legislature": "15",
        "typeOrgane": "COMPER",
        "dateDebut": "2017-06-29T02:00:00.000+02:00",
        "datePublication": "2017-06-29T02:00:00.000+02:00",
        "dateFin": "2018-06-12T02:00:00.000+02:00",
        "preseance": "32",
        "nominPrincipale": "1",
        "infosQualite": {
          "codeQualite": "Membre",
          "libQualite": "Membre",
          "libQualiteSex": "Membre"
        },
        "organes": {
          "organeRef": "PO59051"
        }
      },
      {
        "@xmlns:xsi": "http://www.w3.org/2001/XMLSchema-instance",
        "@xsi:type": "MandatSimple_Type",
        "uid": "PM756906",
        "acteurRef": "PA267785",
        "legislature": "15",
        "typeOrgane": "COMPER",
        "dateDebut": "2018-06-14T02:00:00.000+02:00",
        "datePublication": "2018-06-14T02:00:00.000+02:00",
        "dateFin": "2018-10-12T02:00:00.000+02:00",
        "preseance": "32",
        "nominPrincipale": "1",
        "infosQualite": {
          "codeQualite": "Membre",
          "libQualite": "Membre",
          "libQualiteSex": "Membre"
        },
        "organes": {
          "organeRef": "PO59051"
        }
      },
      {
        "@xmlns:xsi": "http://www.w3.org/2001/XMLSchema-instance",
        "@xsi:type": "MandatSimple_Type",
        "uid": "PM756861",
        "acteurRef": "PA267785",
        "legislature": "15",
        "typeOrgane": "COMPER",
        "dateDebut": "2018-06-13T02:00:00.000+02:00",
        "datePublication": "2018-06-13T02:00:00.000+02:00",
        "dateFin": "2018-06-13T02:00:00.000+02:00",
        "preseance": "32",
        "nominPrincipale": "1",
        "infosQualite": {
          "codeQualite": "Membre",
          "libQualite": "Membre",
          "libQualiteSex": "Membre"
        },
        "organes": {
          "organeRef": "PO419604"
        }
      },
      {
        "@xmlns:xsi": "http://www.w3.org/2001/XMLSchema-instance",
        "@xsi:type": "MandatSimple_Type",
        "uid": "PM760799",
        "acteurRef": "PA267785",
        "legislature": "15",
        "typeOrgane": "COMPER",
        "dateDebut": "2018-12-04T01:00:00.000+01:00",
        "datePublication": "2018-12-04T01:00:00.000+01:00",
        "dateFin": null,
        "preseance": "32",
        "nominPrincipale": "1",
        "infosQualite": {
          "codeQualite": "Membre",
          "libQualite": "Membre",
          "libQualiteSex": "Membre"
        },
        "organes": {
          "organeRef": "PO59051"
        }
      },
      {
        "@xmlns:xsi": "http://www.w3.org/2001/XMLSchema-instance",
        "@xsi:type": "MandatSimple_Type",
        "uid": "PM679099",
        "acteurRef": "PA267785",
        "legislature": "14",
        "typeOrgane": "ORGEXTPARL",
        "dateDebut": "2012-10-04T02:00:00.000+02:00",
        "datePublication": "2012-10-05T02:00:00.000+02:00",
        "dateFin": "2017-06-20T02:00:00.000+02:00",
        "preseance": "30",
        "nominPrincipale": "1",
        "infosQualite": {
          "codeQualite": "Suppléant",
          "libQualite": "Membre suppléant",
          "libQualiteSex": "Membre suppléant"
        },
        "organes": {
          "organeRef": "PO308067"
        }
      },
      {
        "@xmlns:xsi": "http://www.w3.org/2001/XMLSchema-instance",
        "@xsi:type": "MandatSimple_Type",
        "uid": "PM757381",
        "acteurRef": "PA267785",
        "legislature": "15",
        "typeOrgane": "CMP",
        "dateDebut": "2018-06-28T02:00:00.000+02:00",
        "datePublication": "2018-06-29T02:00:00.000+02:00",
        "dateFin": "2018-08-01T02:00:00.000+02:00",
        "preseance": "20",
        "nominPrincipale": "1",
        "infosQualite": {
          "codeQualite": "Titulaire",
          "libQualite": "Membre titulaire",
          "libQualiteSex": "Membre titulaire"
        },
        "organes": {
          "organeRef": "PO757359"
        }
      },
      {
        "@xmlns:xsi": "http://www.w3.org/2001/XMLSchema-instance",
        "@xsi:type": "MandatSimple_Type",
        "uid": "PM737853",
        "acteurRef": "PA267785",
        "legislature": "15",
        "typeOrgane": "CMP",
        "dateDebut": "2017-10-06T02:00:00.000+02:00",
        "datePublication": "2017-10-06T02:00:00.000+02:00",
        "dateFin": "2017-10-18T02:00:00.000+02:00",
        "preseance": "20",
        "nominPrincipale": "1",
        "infosQualite": {
          "codeQualite": "Titulaire",
          "libQualite": "Membre titulaire",
          "libQualiteSex": "Membre titulaire"
        },
        "organes": {
          "organeRef": "PO737081"
        }
      },
      {
        "@xmlns:xsi": "http://www.w3.org/2001/XMLSchema-instance",
        "@xsi:type": "MandatSimple_Type",
        "uid": "PM724696",
        "acteurRef": "PA267785",
        "legislature": "15",
        "typeOrgane": "GP",
        "dateDebut": "2017-06-21T02:00:00.000+02:00",
        "datePublication": null,
        "dateFin": "2017-06-26T02:00:00.000+02:00",
        "preseance": "28",
        "nominPrincipale": "1",
        "infosQualite": {
          "codeQualite": "Député non-inscrit",
          "libQualite": "Député non-inscrit",
          "libQualiteSex": "Député non-inscrit"
        },
        "organes": {
          "organeRef": "PO723569"
        }
      },
      {
        "@xmlns:xsi": "http://www.w3.org/2001/XMLSchema-instance",
        "@xsi:type": "MandatSimple_Type",
        "uid": "PM752021",
        "acteurRef": "PA267785",
        "legislature": "15",
        "typeOrgane": "GE",
        "dateDebut": "2018-02-26T01:00:00.000+01:00",
        "datePublication": null,
        "dateFin": null,
        "preseance": "20",
        "nominPrincipale": "1",
        "infosQualite": {
          "codeQualite": "Membre",
          "libQualite": "Membre",
          "libQualiteSex": "Membre"
        },
        "organes": {
          "organeRef": "PO746649"
        }
      },
      {
        "@xmlns:xsi": "http://www.w3.org/2001/XMLSchema-instance",
        "@xsi:type": "MandatSimple_Type",
        "uid": "PM690508",
        "acteurRef": "PA267785",
        "legislature": "14",
        "typeOrgane": "GE",
        "dateDebut": "2013-02-01T01:00:00.000+01:00",
        "datePublication": null,
        "dateFin": "2017-06-20T02:00:00.000+02:00",
        "preseance": "20",
        "nominPrincipale": "1",
        "infosQualite": {
          "codeQualite": "Membre",
          "libQualite": "Membre",
          "libQualiteSex": "Membre"
        },
        "organes": {
          "organeRef": "PO686605"
        }
      },
      {
        "@xmlns:xsi": "http://www.w3.org/2001/XMLSchema-instance",
        "@xsi:type": "MandatSimple_Type",
        "uid": "PM705987",
        "acteurRef": "PA267785",
        "legislature": "14",
        "typeOrgane": "GE",
        "dateDebut": "2015-01-27T01:00:00.000+01:00",
        "datePublication": null,
        "dateFin": "2017-06-20T02:00:00.000+02:00",
        "preseance": "20",
        "nominPrincipale": "0",
        "infosQualite": {
          "codeQualite": "Membre",
          "libQualite": "Membre",
          "libQualiteSex": "Membre"
        },
        "organes": {
          "organeRef": "PO705526"
        }
      },
      {
        "@xmlns:xsi": "http://www.w3.org/2001/XMLSchema-instance",
        "@xsi:type": "MandatSimple_Type",
        "uid": "PM700290",
        "acteurRef": "PA267785",
        "legislature": "14",
        "typeOrgane": "GE",
        "dateDebut": "2014-02-19T01:00:00.000+01:00",
        "datePublication": null,
        "dateFin": "2017-06-20T02:00:00.000+02:00",
        "preseance": "20",
        "nominPrincipale": "1",
        "infosQualite": {
          "codeQualite": "Membre",
          "libQualite": "Membre",
          "libQualiteSex": "Membre"
        },
        "organes": {
          "organeRef": "PO694554"
        }
      },
      {
        "@xmlns:xsi": "http://www.w3.org/2001/XMLSchema-instance",
        "@xsi:type": "MandatSimple_Type",
        "uid": "PM749294",
        "acteurRef": "PA267785",
        "legislature": "15",
        "typeOrgane": "GE",
        "dateDebut": "2018-02-08T01:00:00.000+01:00",
        "datePublication": null,
        "dateFin": null,
        "preseance": "20",
        "nominPrincipale": "1",
        "infosQualite": {
          "codeQualite": "Membre",
          "libQualite": "Membre",
          "libQualiteSex": "Membre"
        },
        "organes": {
          "organeRef": "PO747266"
        }
      },
      {
        "@xmlns:xsi": "http://www.w3.org/2001/XMLSchema-instance",
        "@xsi:type": "MandatSimple_Type",
        "uid": "PM687677",
        "acteurRef": "PA267785",
        "legislature": "14",
        "typeOrgane": "GE",
        "dateDebut": "2013-01-10T01:00:00.000+01:00",
        "datePublication": null,
        "dateFin": "2017-06-20T02:00:00.000+02:00",
        "preseance": "20",
        "nominPrincipale": "1",
        "infosQualite": {
          "codeQualite": "Membre",
          "libQualite": "Membre",
          "libQualiteSex": "Membre"
        },
        "organes": {
          "organeRef": "PO686397"
        }
      },
      {
        "@xmlns:xsi": "http://www.w3.org/2001/XMLSchema-instance",
        "@xsi:type": "MandatSimple_Type",
        "uid": "PM755477",
        "acteurRef": "PA267785",
        "legislature": "15",
        "typeOrgane": "GE",
        "dateDebut": "2018-04-13T02:00:00.000+02:00",
        "datePublication": null,
        "dateFin": null,
        "preseance": "20",
        "nominPrincipale": "1",
        "infosQualite": {
          "codeQualite": "Membre",
          "libQualite": "Membre",
          "libQualiteSex": "Membre"
        },
        "organes": {
          "organeRef": "PO747114"
        }
      },
      {
        "@xmlns:xsi": "http://www.w3.org/2001/XMLSchema-instance",
        "@xsi:type": "MandatSimple_Type",
        "uid": "PM749008",
        "acteurRef": "PA267785",
        "legislature": "15",
        "typeOrgane": "GE",
        "dateDebut": "2018-02-28T01:00:00.000+01:00",
        "datePublication": null,
        "dateFin": null,
        "preseance": "20",
        "nominPrincipale": "1",
        "infosQualite": {
          "codeQualite": "Membre",
          "libQualite": "Membre",
          "libQualiteSex": "Membre"
        },
        "organes": {
          "organeRef": "PO746674"
        }
      },
      {
        "@xmlns:xsi": "http://www.w3.org/2001/XMLSchema-instance",
        "@xsi:type": "MandatSimple_Type",
        "uid": "PM753628",
        "acteurRef": "PA267785",
        "legislature": "15",
        "typeOrgane": "GE",
        "dateDebut": "2018-03-15T01:00:00.000+01:00",
        "datePublication": null,
        "dateFin": null,
        "preseance": "20",
        "nominPrincipale": "1",
        "infosQualite": {
          "codeQualite": "Membre",
          "libQualite": "Membre",
          "libQualiteSex": "Membre"
        },
        "organes": {
          "organeRef": "PO746992"
        }
      },
      {
        "@xmlns:xsi": "http://www.w3.org/2001/XMLSchema-instance",
        "@xsi:type": "MandatSimple_Type",
        "uid": "PM692959",
        "acteurRef": "PA267785",
        "legislature": "14",
        "typeOrgane": "GE",
        "dateDebut": "2013-03-25T01:00:00.000+01:00",
        "datePublication": null,
        "dateFin": "2017-06-20T02:00:00.000+02:00",
        "preseance": "20",
        "nominPrincipale": "1",
        "infosQualite": {
          "codeQualite": "Membre",
          "libQualite": "Membre",
          "libQualiteSex": "Membre"
        },
        "organes": {
          "organeRef": "PO689030"
        }
      },
      {
        "@xmlns:xsi": "http://www.w3.org/2001/XMLSchema-instance",
        "@xsi:type": "MandatSimple_Type",
        "uid": "PM753019",
        "acteurRef": "PA267785",
        "legislature": "15",
        "typeOrgane": "GE",
        "dateDebut": "2018-03-08T01:00:00.000+01:00",
        "datePublication": null,
        "dateFin": null,
        "preseance": "20",
        "nominPrincipale": "1",
        "infosQualite": {
          "codeQualite": "Membre",
          "libQualite": "Membre",
          "libQualiteSex": "Membre"
        },
        "organes": {
          "organeRef": "PO746904"
        }
      },
      {
        "@xmlns:xsi": "http://www.w3.org/2001/XMLSchema-instance",
        "@xsi:type": "MandatSimple_Type",
        "uid": "PM751022",
        "acteurRef": "PA267785",
        "legislature": "15",
        "typeOrgane": "GE",
        "dateDebut": "2018-02-19T01:00:00.000+01:00",
        "datePublication": null,
        "dateFin": null,
        "preseance": "20",
        "nominPrincipale": "1",
        "infosQualite": {
          "codeQualite": "Membre",
          "libQualite": "Membre",
          "libQualiteSex": "Membre"
        },
        "organes": {
          "organeRef": "PO746880"
        }
      },
      {
        "@xmlns:xsi": "http://www.w3.org/2001/XMLSchema-instance",
        "@xsi:type": "MandatSimple_Type",
        "uid": "PM688750",
        "acteurRef": "PA267785",
        "legislature": "14",
        "typeOrgane": "GE",
        "dateDebut": "2013-01-25T01:00:00.000+01:00",
        "datePublication": null,
        "dateFin": "2017-06-20T02:00:00.000+02:00",
        "preseance": "20",
        "nominPrincipale": "1",
        "infosQualite": {
          "codeQualite": "Membre",
          "libQualite": "Membre",
          "libQualiteSex": "Membre"
        },
        "organes": {
          "organeRef": "PO686501"
        }
      },
      {
        "@xmlns:xsi": "http://www.w3.org/2001/XMLSchema-instance",
        "@xsi:type": "MandatSimple_Type",
        "uid": "PM693086",
        "acteurRef": "PA267785",
        "legislature": "14",
        "typeOrgane": "GE",
        "dateDebut": "2013-02-01T01:00:00.000+01:00",
        "datePublication": null,
        "dateFin": "2017-06-20T02:00:00.000+02:00",
        "preseance": "20",
        "nominPrincipale": "1",
        "infosQualite": {
          "codeQualite": "Membre",
          "libQualite": "Membre",
          "libQualiteSex": "Membre"
        },
        "organes": {
          "organeRef": "PO686354"
        }
      },
      {
        "@xmlns:xsi": "http://www.w3.org/2001/XMLSchema-instance",
        "@xsi:type": "MandatSimple_Type",
        "uid": "PM693336",
        "acteurRef": "PA267785",
        "legislature": "14",
        "typeOrgane": "GE",
        "dateDebut": "2013-04-04T02:00:00.000+02:00",
        "datePublication": null,
        "dateFin": "2017-06-20T02:00:00.000+02:00",
        "preseance": "20",
        "nominPrincipale": "1",
        "infosQualite": {
          "codeQualite": "Membre",
          "libQualite": "Membre",
          "libQualiteSex": "Membre"
        },
        "organes": {
          "organeRef": "PO686477"
        }
      },
      {
        "@xmlns:xsi": "http://www.w3.org/2001/XMLSchema-instance",
        "@xsi:type": "MandatSimple_Type",
        "uid": "PM701002",
        "acteurRef": "PA267785",
        "legislature": "14",
        "typeOrgane": "GE",
        "dateDebut": "2014-04-28T02:00:00.000+02:00",
        "datePublication": null,
        "dateFin": "2017-06-20T02:00:00.000+02:00",
        "preseance": "20",
        "nominPrincipale": "1",
        "infosQualite": {
          "codeQualite": "Membre",
          "libQualite": "Membre",
          "libQualiteSex": "Membre"
        },
        "organes": {
          "organeRef": "PO686776"
        }
      },
      {
        "@xmlns:xsi": "http://www.w3.org/2001/XMLSchema-instance",
        "@xsi:type": "MandatSimple_Type",
        "uid": "PM699596",
        "acteurRef": "PA267785",
        "legislature": "14",
        "typeOrgane": "GE",
        "dateDebut": "2014-01-21T01:00:00.000+01:00",
        "datePublication": null,
        "dateFin": "2017-06-20T02:00:00.000+02:00",
        "preseance": "20",
        "nominPrincipale": "1",
        "infosQualite": {
          "codeQualite": "Membre",
          "libQualite": "Membre",
          "libQualiteSex": "Membre"
        },
        "organes": {
          "organeRef": "PO686870"
        }
      },
      {
        "@xmlns:xsi": "http://www.w3.org/2001/XMLSchema-instance",
        "@xsi:type": "MandatSimple_Type",
        "uid": "PM698076",
        "acteurRef": "PA267785",
        "legislature": "14",
        "typeOrgane": "GE",
        "dateDebut": "2013-09-15T02:00:00.000+02:00",
        "datePublication": null,
        "dateFin": "2017-06-20T02:00:00.000+02:00",
        "preseance": "20",
        "nominPrincipale": "1",
        "infosQualite": {
          "codeQualite": "Membre",
          "libQualite": "Membre",
          "libQualiteSex": "Membre"
        },
        "organes": {
          "organeRef": "PO695581"
        }
      },
      {
        "@xmlns:xsi": "http://www.w3.org/2001/XMLSchema-instance",
        "@xsi:type": "MandatSimple_Type",
        "uid": "PM689698",
        "acteurRef": "PA267785",
        "legislature": "14",
        "typeOrgane": "GE",
        "dateDebut": "2013-01-30T01:00:00.000+01:00",
        "datePublication": null,
        "dateFin": "2017-06-20T02:00:00.000+02:00",
        "preseance": "20",
        "nominPrincipale": "1",
        "infosQualite": {
          "codeQualite": "Membre",
          "libQualite": "Membre",
          "libQualiteSex": "Membre"
        },
        "organes": {
          "organeRef": "PO686424"
        }
      },
      {
        "@xmlns:xsi": "http://www.w3.org/2001/XMLSchema-instance",
        "@xsi:type": "MandatSimple_Type",
        "uid": "PM706097",
        "acteurRef": "PA267785",
        "legislature": "14",
        "typeOrgane": "GE",
        "dateDebut": "2015-01-27T01:00:00.000+01:00",
        "datePublication": null,
        "dateFin": "2017-06-20T02:00:00.000+02:00",
        "preseance": "12",
        "nominPrincipale": "1",
        "infosQualite": {
          "codeQualite": "Secrétaire",
          "libQualite": "Secrétaire",
          "libQualiteSex": "Secrétaire"
        },
        "organes": {
          "organeRef": "PO705526"
        }
      },
      {
        "@xmlns:xsi": "http://www.w3.org/2001/XMLSchema-instance",
        "@xsi:type": "MandatSimple_Type",
        "uid": "PM756118",
        "acteurRef": "PA267785",
        "legislature": "15",
        "typeOrgane": "GE",
        "dateDebut": "2018-04-12T02:00:00.000+02:00",
        "datePublication": null,
        "dateFin": null,
        "preseance": "20",
        "nominPrincipale": "1",
        "infosQualite": {
          "codeQualite": "Membre",
          "libQualite": "Membre",
          "libQualiteSex": "Membre"
        },
        "organes": {
          "organeRef": "PO747012"
        }
      },
      {
        "@xmlns:xsi": "http://www.w3.org/2001/XMLSchema-instance",
        "@xsi:type": "MandatSimple_Type",
        "uid": "PM751712",
        "acteurRef": "PA267785",
        "legislature": "15",
        "typeOrgane": "GE",
        "dateDebut": "2018-02-22T01:00:00.000+01:00",
        "datePublication": null,
        "dateFin": null,
        "preseance": "20",
        "nominPrincipale": "1",
        "infosQualite": {
          "codeQualite": "Membre",
          "libQualite": "Membre",
          "libQualiteSex": "Membre"
        },
        "organes": {
          "organeRef": "PO746669"
        }
      },
      {
        "@xmlns:xsi": "http://www.w3.org/2001/XMLSchema-instance",
        "@xsi:type": "MandatSimple_Type",
        "uid": "PM752591",
        "acteurRef": "PA267785",
        "legislature": "15",
        "typeOrgane": "GE",
        "dateDebut": "2018-03-06T01:00:00.000+01:00",
        "datePublication": null,
        "dateFin": null,
        "preseance": "20",
        "nominPrincipale": "1",
        "infosQualite": {
          "codeQualite": "Membre",
          "libQualite": "Membre",
          "libQualiteSex": "Membre"
        },
        "organes": {
          "organeRef": "PO747165"
        }
      },
      {
        "@xmlns:xsi": "http://www.w3.org/2001/XMLSchema-instance",
        "@xsi:type": "MandatSimple_Type",
        "uid": "PM691993",
        "acteurRef": "PA267785",
        "legislature": "14",
        "typeOrgane": "GE",
        "dateDebut": "2013-01-24T01:00:00.000+01:00",
        "datePublication": null,
        "dateFin": "2017-06-20T02:00:00.000+02:00",
        "preseance": "20",
        "nominPrincipale": "1",
        "infosQualite": {
          "codeQualite": "Membre",
          "libQualite": "Membre",
          "libQualiteSex": "Membre"
        },
        "organes": {
          "organeRef": "PO686844"
        }
      },
      {
        "@xmlns:xsi": "http://www.w3.org/2001/XMLSchema-instance",
        "@xsi:type": "MandatSimple_Type",
        "uid": "PM692798",
        "acteurRef": "PA267785",
        "legislature": "14",
        "typeOrgane": "GE",
        "dateDebut": "2013-03-19T01:00:00.000+01:00",
        "datePublication": null,
        "dateFin": "2017-06-20T02:00:00.000+02:00",
        "preseance": "20",
        "nominPrincipale": "1",
        "infosQualite": {
          "codeQualite": "Membre",
          "libQualite": "Membre",
          "libQualiteSex": "Membre"
        },
        "organes": {
          "organeRef": "PO686818"
        }
      },
      {
        "@xmlns:xsi": "http://www.w3.org/2001/XMLSchema-instance",
        "@xsi:type": "MandatSimple_Type",
        "uid": "PM753112",
        "acteurRef": "PA267785",
        "legislature": "15",
        "typeOrgane": "GE",
        "dateDebut": "2018-03-08T01:00:00.000+01:00",
        "datePublication": null,
        "dateFin": null,
        "preseance": "20",
        "nominPrincipale": "1",
        "infosQualite": {
          "codeQualite": "Membre",
          "libQualite": "Membre",
          "libQualiteSex": "Membre"
        },
        "organes": {
          "organeRef": "PO747037"
        }
      },
      {
        "@xmlns:xsi": "http://www.w3.org/2001/XMLSchema-instance",
        "@xsi:type": "MandatSimple_Type",
        "uid": "PM695176",
        "acteurRef": "PA267785",
        "legislature": "14",
        "typeOrgane": "GE",
        "dateDebut": "2012-12-18T01:00:00.000+01:00",
        "datePublication": null,
        "dateFin": "2017-06-20T02:00:00.000+02:00",
        "preseance": "20",
        "nominPrincipale": "1",
        "infosQualite": {
          "codeQualite": "Membre",
          "libQualite": "Membre",
          "libQualiteSex": "Membre"
        },
        "organes": {
          "organeRef": "PO686266"
        }
      },
      {
        "@xmlns:xsi": "http://www.w3.org/2001/XMLSchema-instance",
        "@xsi:type": "MandatSimple_Type",
        "uid": "PM689498",
        "acteurRef": "PA267785",
        "legislature": "14",
        "typeOrgane": "GE",
        "dateDebut": "2013-01-23T01:00:00.000+01:00",
        "datePublication": null,
        "dateFin": "2017-06-20T02:00:00.000+02:00",
        "preseance": "20",
        "nominPrincipale": "1",
        "infosQualite": {
          "codeQualite": "Membre",
          "libQualite": "Membre",
          "libQualiteSex": "Membre"
        },
        "organes": {
          "organeRef": "PO687109"
        }
      },
      {
        "@xmlns:xsi": "http://www.w3.org/2001/XMLSchema-instance",
        "@xsi:type": "MandatSimple_Type",
        "uid": "PM702754",
        "acteurRef": "PA267785",
        "legislature": "14",
        "typeOrgane": "GE",
        "dateDebut": "2014-07-23T02:00:00.000+02:00",
        "datePublication": null,
        "dateFin": "2017-06-20T02:00:00.000+02:00",
        "preseance": "20",
        "nominPrincipale": "1",
        "infosQualite": {
          "codeQualite": "Membre",
          "libQualite": "Membre",
          "libQualiteSex": "Membre"
        },
        "organes": {
          "organeRef": "PO702209"
        }
      },
      {
        "@xmlns:xsi": "http://www.w3.org/2001/XMLSchema-instance",
        "@xsi:type": "MandatSimple_Type",
        "uid": "PM751148",
        "acteurRef": "PA267785",
        "legislature": "15",
        "typeOrgane": "GE",
        "dateDebut": "2018-02-19T01:00:00.000+01:00",
        "datePublication": null,
        "dateFin": null,
        "preseance": "20",
        "nominPrincipale": "1",
        "infosQualite": {
          "codeQualite": "Membre",
          "libQualite": "Membre",
          "libQualiteSex": "Membre"
        },
        "organes": {
          "organeRef": "PO747276"
        }
      },
      {
        "@xmlns:xsi": "http://www.w3.org/2001/XMLSchema-instance",
        "@xsi:type": "MandatSimple_Type",
        "uid": "PM752063",
        "acteurRef": "PA267785",
        "legislature": "15",
        "typeOrgane": "GE",
        "dateDebut": "2018-02-27T01:00:00.000+01:00",
        "datePublication": null,
        "dateFin": null,
        "preseance": "20",
        "nominPrincipale": "1",
        "infosQualite": {
          "codeQualite": "Membre",
          "libQualite": "Membre",
          "libQualiteSex": "Membre"
        },
        "organes": {
          "organeRef": "PO747104"
        }
      },
      {
        "@xmlns:xsi": "http://www.w3.org/2001/XMLSchema-instance",
        "@xsi:type": "MandatSimple_Type",
        "uid": "PM691361",
        "acteurRef": "PA267785",
        "legislature": "14",
        "typeOrgane": "GE",
        "dateDebut": "2013-02-12T01:00:00.000+01:00",
        "datePublication": null,
        "dateFin": "2017-06-20T02:00:00.000+02:00",
        "preseance": "20",
        "nominPrincipale": "1",
        "infosQualite": {
          "codeQualite": "Membre",
          "libQualite": "Membre",
          "libQualiteSex": "Membre"
        },
        "organes": {
          "organeRef": "PO687120"
        }
      },
      {
        "@xmlns:xsi": "http://www.w3.org/2001/XMLSchema-instance",
        "@xsi:type": "MandatSimple_Type",
        "uid": "PM687788",
        "acteurRef": "PA267785",
        "legislature": "14",
        "typeOrgane": "GE",
        "dateDebut": "2013-01-15T01:00:00.000+01:00",
        "datePublication": null,
        "dateFin": "2017-06-20T02:00:00.000+02:00",
        "preseance": "20",
        "nominPrincipale": "1",
        "infosQualite": {
          "codeQualite": "Membre",
          "libQualite": "Membre",
          "libQualiteSex": "Membre"
        },
        "organes": {
          "organeRef": "PO686415"
        }
      },
      {
        "@xmlns:xsi": "http://www.w3.org/2001/XMLSchema-instance",
        "@xsi:type": "MandatSimple_Type",
        "uid": "PM751734",
        "acteurRef": "PA267785",
        "legislature": "15",
        "typeOrgane": "GE",
        "dateDebut": "2018-02-22T01:00:00.000+01:00",
        "datePublication": null,
        "dateFin": null,
        "preseance": "20",
        "nominPrincipale": "1",
        "infosQualite": {
          "codeQualite": "Membre",
          "libQualite": "Membre",
          "libQualiteSex": "Membre"
        },
        "organes": {
          "organeRef": "PO746679"
        }
      },
      {
        "@xmlns:xsi": "http://www.w3.org/2001/XMLSchema-instance",
        "@xsi:type": "MandatSimple_Type",
        "uid": "PM751518",
        "acteurRef": "PA267785",
        "legislature": "15",
        "typeOrgane": "GE",
        "dateDebut": "2018-02-21T01:00:00.000+01:00",
        "datePublication": null,
        "dateFin": null,
        "preseance": "20",
        "nominPrincipale": "1",
        "infosQualite": {
          "codeQualite": "Membre",
          "libQualite": "Membre",
          "libQualiteSex": "Membre"
        },
        "organes": {
          "organeRef": "PO746837"
        }
      },
      {
        "@xmlns:xsi": "http://www.w3.org/2001/XMLSchema-instance",
        "@xsi:type": "MandatSimple_Type",
        "uid": "PM689369",
        "acteurRef": "PA267785",
        "legislature": "14",
        "typeOrgane": "GE",
        "dateDebut": "2013-01-23T01:00:00.000+01:00",
        "datePublication": null,
        "dateFin": "2017-06-20T02:00:00.000+02:00",
        "preseance": "20",
        "nominPrincipale": "1",
        "infosQualite": {
          "codeQualite": "Membre",
          "libQualite": "Membre",
          "libQualiteSex": "Membre"
        },
        "organes": {
          "organeRef": "PO687076"
        }
      },
      {
        "@xmlns:xsi": "http://www.w3.org/2001/XMLSchema-instance",
        "@xsi:type": "MandatSimple_Type",
        "uid": "PM687909",
        "acteurRef": "PA267785",
        "legislature": "14",
        "typeOrgane": "GE",
        "dateDebut": "2013-01-09T01:00:00.000+01:00",
        "datePublication": null,
        "dateFin": "2017-06-20T02:00:00.000+02:00",
        "preseance": "20",
        "nominPrincipale": "1",
        "infosQualite": {
          "codeQualite": "Membre",
          "libQualite": "Membre",
          "libQualiteSex": "Membre"
        },
        "organes": {
          "organeRef": "PO686793"
        }
      },
      {
        "@xmlns:xsi": "http://www.w3.org/2001/XMLSchema-instance",
        "@xsi:type": "MandatSimple_Type",
        "uid": "PM749528",
        "acteurRef": "PA267785",
        "legislature": "15",
        "typeOrgane": "GE",
        "dateDebut": "2018-02-13T01:00:00.000+01:00",
        "datePublication": null,
        "dateFin": null,
        "preseance": "20",
        "nominPrincipale": "1",
        "infosQualite": {
          "codeQualite": "Membre",
          "libQualite": "Membre",
          "libQualiteSex": "Membre"
        },
        "organes": {
          "organeRef": "PO747047"
        }
      },
      {
        "@xmlns:xsi": "http://www.w3.org/2001/XMLSchema-instance",
        "@xsi:type": "MandatSimple_Type",
        "uid": "PM692220",
        "acteurRef": "PA267785",
        "legislature": "14",
        "typeOrgane": "GE",
        "dateDebut": "2013-02-27T01:00:00.000+01:00",
        "datePublication": null,
        "dateFin": "2017-06-20T02:00:00.000+02:00",
        "preseance": "20",
        "nominPrincipale": "1",
        "infosQualite": {
          "codeQualite": "Membre",
          "libQualite": "Membre",
          "libQualiteSex": "Membre"
        },
        "organes": {
          "organeRef": "PO686810"
        }
      },
      {
        "@xmlns:xsi": "http://www.w3.org/2001/XMLSchema-instance",
        "@xsi:type": "MandatSimple_Type",
        "uid": "PM691523",
        "acteurRef": "PA267785",
        "legislature": "14",
        "typeOrgane": "GE",
        "dateDebut": "2013-02-16T01:00:00.000+01:00",
        "datePublication": null,
        "dateFin": "2017-06-20T02:00:00.000+02:00",
        "preseance": "20",
        "nominPrincipale": "1",
        "infosQualite": {
          "codeQualite": "Membre",
          "libQualite": "Membre",
          "libQualiteSex": "Membre"
        },
        "organes": {
          "organeRef": "PO687473"
        }
      },
      {
        "@xmlns:xsi": "http://www.w3.org/2001/XMLSchema-instance",
        "@xsi:type": "MandatSimple_Type",
        "uid": "PM752659",
        "acteurRef": "PA267785",
        "legislature": "15",
        "typeOrgane": "GE",
        "dateDebut": "2018-03-06T01:00:00.000+01:00",
        "datePublication": null,
        "dateFin": null,
        "preseance": "20",
        "nominPrincipale": "1",
        "infosQualite": {
          "codeQualite": "Membre",
          "libQualite": "Membre",
          "libQualiteSex": "Membre"
        },
        "organes": {
          "organeRef": "PO747220"
        }
      },
      {
        "@xmlns:xsi": "http://www.w3.org/2001/XMLSchema-instance",
        "@xsi:type": "MandatSimple_Type",
        "uid": "PM679955",
        "acteurRef": "PA267785",
        "legislature": "14",
        "typeOrgane": "GA",
        "dateDebut": "2012-10-12T02:00:00.000+02:00",
        "datePublication": null,
        "dateFin": "2017-06-20T02:00:00.000+02:00",
        "preseance": "20",
        "nominPrincipale": "1",
        "infosQualite": {
          "codeQualite": "Membre",
          "libQualite": "Membre",
          "libQualiteSex": "Membre"
        },
        "organes": {
          "organeRef": "PO675841"
        }
      },
      {
        "@xmlns:xsi": "http://www.w3.org/2001/XMLSchema-instance",
        "@xsi:type": "MandatSimple_Type",
        "uid": "PM679957",
        "acteurRef": "PA267785",
        "legislature": "14",
        "typeOrgane": "GA",
        "dateDebut": "2012-10-12T02:00:00.000+02:00",
        "datePublication": null,
        "dateFin": "2017-06-20T02:00:00.000+02:00",
        "preseance": "20",
        "nominPrincipale": "1",
        "infosQualite": {
          "codeQualite": "Membre",
          "libQualite": "Membre",
          "libQualiteSex": "Membre"
        },
        "organes": {
          "organeRef": "PO675810"
        }
      },
      {
        "@xmlns:xsi": "http://www.w3.org/2001/XMLSchema-instance",
        "@xsi:type": "MandatSimple_Type",
        "uid": "PM739972",
        "acteurRef": "PA267785",
        "legislature": "15",
        "typeOrgane": "GA",
        "dateDebut": "2017-10-13T02:00:00.000+02:00",
        "datePublication": null,
        "dateFin": null,
        "preseance": "20",
        "nominPrincipale": "0",
        "infosQualite": {
          "codeQualite": "Membre",
          "libQualite": "Membre",
          "libQualiteSex": "Membre"
        },
        "organes": {
          "organeRef": "PO732964"
        }
      },
      {
        "@xmlns:xsi": "http://www.w3.org/2001/XMLSchema-instance",
        "@xsi:type": "MandatSimple_Type",
        "uid": "PM684661",
        "acteurRef": "PA267785",
        "legislature": "14",
        "typeOrgane": "GA",
        "dateDebut": "2012-11-20T01:00:00.000+01:00",
        "datePublication": null,
        "dateFin": "2017-06-20T02:00:00.000+02:00",
        "preseance": "20",
        "nominPrincipale": "1",
        "infosQualite": {
          "codeQualite": "Membre",
          "libQualite": "Membre",
          "libQualiteSex": "Membre"
        },
        "organes": {
          "organeRef": "PO675794"
        }
      },
      {
        "@xmlns:xsi": "http://www.w3.org/2001/XMLSchema-instance",
        "@xsi:type": "MandatSimple_Type",
        "uid": "PM678482",
        "acteurRef": "PA267785",
        "legislature": "14",
        "typeOrgane": "GA",
        "dateDebut": "2012-09-26T02:00:00.000+02:00",
        "datePublication": null,
        "dateFin": "2017-06-20T02:00:00.000+02:00",
        "preseance": "20",
        "nominPrincipale": "0",
        "infosQualite": {
          "codeQualite": "Membre",
          "libQualite": "Membre",
          "libQualiteSex": "Membre"
        },
        "organes": {
          "organeRef": "PO675840"
        }
      },
      {
        "@xmlns:xsi": "http://www.w3.org/2001/XMLSchema-instance",
        "@xsi:type": "MandatSimple_Type",
        "uid": "PM739974",
        "acteurRef": "PA267785",
        "legislature": "15",
        "typeOrgane": "GA",
        "dateDebut": "2017-10-13T02:00:00.000+02:00",
        "datePublication": null,
        "dateFin": null,
        "preseance": "20",
        "nominPrincipale": "1",
        "infosQualite": {
          "codeQualite": "Membre",
          "libQualite": "Membre",
          "libQualiteSex": "Membre"
        },
        "organes": {
          "organeRef": "PO733157"
        }
      },
      {
        "@xmlns:xsi": "http://www.w3.org/2001/XMLSchema-instance",
        "@xsi:type": "MandatSimple_Type",
        "uid": "PM739976",
        "acteurRef": "PA267785",
        "legislature": "15",
        "typeOrgane": "GA",
        "dateDebut": "2017-10-13T02:00:00.000+02:00",
        "datePublication": null,
        "dateFin": null,
        "preseance": "20",
        "nominPrincipale": "1",
        "infosQualite": {
          "codeQualite": "Membre",
          "libQualite": "Membre",
          "libQualiteSex": "Membre"
        },
        "organes": {
          "organeRef": "PO733232"
        }
      },
      {
        "@xmlns:xsi": "http://www.w3.org/2001/XMLSchema-instance",
        "@xsi:type": "MandatSimple_Type",
        "uid": "PM739980",
        "acteurRef": "PA267785",
        "legislature": "15",
        "typeOrgane": "GA",
        "dateDebut": "2017-10-13T02:00:00.000+02:00",
        "datePublication": null,
        "dateFin": null,
        "preseance": "20",
        "nominPrincipale": "1",
        "infosQualite": {
          "codeQualite": "Membre",
          "libQualite": "Membre",
          "libQualiteSex": "Membre"
        },
        "organes": {
          "organeRef": "PO733397"
        }
      },
      {
        "@xmlns:xsi": "http://www.w3.org/2001/XMLSchema-instance",
        "@xsi:type": "MandatSimple_Type",
        "uid": "PM692597",
        "acteurRef": "PA267785",
        "legislature": "14",
        "typeOrgane": "GA",
        "dateDebut": "2013-03-11T01:00:00.000+01:00",
        "datePublication": null,
        "dateFin": "2017-06-20T02:00:00.000+02:00",
        "preseance": "20",
        "nominPrincipale": "1",
        "infosQualite": {
          "codeQualite": "Membre",
          "libQualite": "Membre",
          "libQualiteSex": "Membre"
        },
        "organes": {
          "organeRef": "PO675745"
        }
      },
      {
        "@xmlns:xsi": "http://www.w3.org/2001/XMLSchema-instance",
        "@xsi:type": "MandatSimple_Type",
        "uid": "PM739978",
        "acteurRef": "PA267785",
        "legislature": "15",
        "typeOrgane": "GA",
        "dateDebut": "2017-10-13T02:00:00.000+02:00",
        "datePublication": null,
        "dateFin": null,
        "preseance": "20",
        "nominPrincipale": "1",
        "infosQualite": {
          "codeQualite": "Membre",
          "libQualite": "Membre",
          "libQualiteSex": "Membre"
        },
        "organes": {
          "organeRef": "PO733342"
        }
      },
      {
        "@xmlns:xsi": "http://www.w3.org/2001/XMLSchema-instance",
        "@xsi:type": "MandatSimple_Type",
        "uid": "PM739982",
        "acteurRef": "PA267785",
        "legislature": "15",
        "typeOrgane": "GA",
        "dateDebut": "2017-10-13T02:00:00.000+02:00",
        "datePublication": null,
        "dateFin": null,
        "preseance": "20",
        "nominPrincipale": "1",
        "infosQualite": {
          "codeQualite": "Membre",
          "libQualite": "Membre",
          "libQualiteSex": "Membre"
        },
        "organes": {
          "organeRef": "PO733472"
        }
      },
      {
        "@xmlns:xsi": "http://www.w3.org/2001/XMLSchema-instance",
        "@xsi:type": "MandatSimple_Type",
        "uid": "PM739984",
        "acteurRef": "PA267785",
        "legislature": "15",
        "typeOrgane": "GA",
        "dateDebut": "2017-10-13T02:00:00.000+02:00",
        "datePublication": null,
        "dateFin": null,
        "preseance": "20",
        "nominPrincipale": "1",
        "infosQualite": {
          "codeQualite": "Membre",
          "libQualite": "Membre",
          "libQualiteSex": "Membre"
        },
        "organes": {
          "organeRef": "PO733577"
        }
      },
      {
        "@xmlns:xsi": "http://www.w3.org/2001/XMLSchema-instance",
        "@xsi:type": "MandatSimple_Type",
        "uid": "PM679944",
        "acteurRef": "PA267785",
        "legislature": "14",
        "typeOrgane": "GA",
        "dateDebut": "2012-10-12T02:00:00.000+02:00",
        "datePublication": null,
        "dateFin": "2017-06-20T02:00:00.000+02:00",
        "preseance": "20",
        "nominPrincipale": "1",
        "infosQualite": {
          "codeQualite": "Membre",
          "libQualite": "Membre",
          "libQualiteSex": "Membre"
        },
        "organes": {
          "organeRef": "PO675730"
        }
      },
      {
        "@xmlns:xsi": "http://www.w3.org/2001/XMLSchema-instance",
        "@xsi:type": "MandatSimple_Type",
        "uid": "PM679946",
        "acteurRef": "PA267785",
        "legislature": "14",
        "typeOrgane": "GA",
        "dateDebut": "2012-10-12T02:00:00.000+02:00",
        "datePublication": null,
        "dateFin": "2017-06-20T02:00:00.000+02:00",
        "preseance": "20",
        "nominPrincipale": "1",
        "infosQualite": {
          "codeQualite": "Membre",
          "libQualite": "Membre",
          "libQualiteSex": "Membre"
        },
        "organes": {
          "organeRef": "PO675848"
        }
      },
      {
        "@xmlns:xsi": "http://www.w3.org/2001/XMLSchema-instance",
        "@xsi:type": "MandatSimple_Type",
        "uid": "PM679950",
        "acteurRef": "PA267785",
        "legislature": "14",
        "typeOrgane": "GA",
        "dateDebut": "2012-10-12T02:00:00.000+02:00",
        "datePublication": null,
        "dateFin": "2017-06-20T02:00:00.000+02:00",
        "preseance": "20",
        "nominPrincipale": "1",
        "infosQualite": {
          "codeQualite": "Membre",
          "libQualite": "Membre",
          "libQualiteSex": "Membre"
        },
        "organes": {
          "organeRef": "PO675821"
        }
      },
      {
        "@xmlns:xsi": "http://www.w3.org/2001/XMLSchema-instance",
        "@xsi:type": "MandatSimple_Type",
        "uid": "PM679948",
        "acteurRef": "PA267785",
        "legislature": "14",
        "typeOrgane": "GA",
        "dateDebut": "2012-10-12T02:00:00.000+02:00",
        "datePublication": null,
        "dateFin": "2017-06-20T02:00:00.000+02:00",
        "preseance": "20",
        "nominPrincipale": "1",
        "infosQualite": {
          "codeQualite": "Membre",
          "libQualite": "Membre",
          "libQualiteSex": "Membre"
        },
        "organes": {
          "organeRef": "PO675714"
        }
      },
      {
        "@xmlns:xsi": "http://www.w3.org/2001/XMLSchema-instance",
        "@xsi:type": "MandatSimple_Type",
        "uid": "PM679952",
        "acteurRef": "PA267785",
        "legislature": "14",
        "typeOrgane": "GA",
        "dateDebut": "2012-10-12T02:00:00.000+02:00",
        "datePublication": null,
        "dateFin": "2017-06-20T02:00:00.000+02:00",
        "preseance": "20",
        "nominPrincipale": "1",
        "infosQualite": {
          "codeQualite": "Membre",
          "libQualite": "Membre",
          "libQualiteSex": "Membre"
        },
        "organes": {
          "organeRef": "PO675809"
        }
      },
      {
        "@xmlns:xsi": "http://www.w3.org/2001/XMLSchema-instance",
        "@xsi:type": "MandatSimple_Type",
        "uid": "PM735205",
        "acteurRef": "PA267785",
        "legislature": "15",
        "typeOrgane": "GA",
        "dateDebut": "2017-09-26T02:00:00.000+02:00",
        "datePublication": null,
        "dateFin": null,
        "preseance": "1",
        "nominPrincipale": "1",
        "infosQualite": {
          "codeQualite": "Président",
          "libQualite": "Président",
          "libQualiteSex": "Président"
        },
        "organes": {
          "organeRef": "PO733107"
        }
      },
      {
        "@xmlns:xsi": "http://www.w3.org/2001/XMLSchema-instance",
        "@xsi:type": "MandatSimple_Type",
        "uid": "PM679954",
        "acteurRef": "PA267785",
        "legislature": "14",
        "typeOrgane": "GA",
        "dateDebut": "2012-10-12T02:00:00.000+02:00",
        "datePublication": null,
        "dateFin": "2017-06-20T02:00:00.000+02:00",
        "preseance": "20",
        "nominPrincipale": "1",
        "infosQualite": {
          "codeQualite": "Membre",
          "libQualite": "Membre",
          "libQualiteSex": "Membre"
        },
        "organes": {
          "organeRef": "PO675764"
        }
      },
      {
        "@xmlns:xsi": "http://www.w3.org/2001/XMLSchema-instance",
        "@xsi:type": "MandatSimple_Type",
        "uid": "PM743355",
        "acteurRef": "PA267785",
        "legislature": "15",
        "typeOrgane": "GA",
        "dateDebut": "2017-11-15T01:00:00.000+01:00",
        "datePublication": null,
        "dateFin": null,
        "preseance": "20",
        "nominPrincipale": "1",
        "infosQualite": {
          "codeQualite": "Membre",
          "libQualite": "Membre",
          "libQualiteSex": "Membre"
        },
        "organes": {
          "organeRef": "PO733437"
        }
      },
      {
        "@xmlns:xsi": "http://www.w3.org/2001/XMLSchema-instance",
        "@xsi:type": "MandatSimple_Type",
        "uid": "PM679956",
        "acteurRef": "PA267785",
        "legislature": "14",
        "typeOrgane": "GA",
        "dateDebut": "2012-10-12T02:00:00.000+02:00",
        "datePublication": null,
        "dateFin": "2017-06-20T02:00:00.000+02:00",
        "preseance": "20",
        "nominPrincipale": "1",
        "infosQualite": {
          "codeQualite": "Membre",
          "libQualite": "Membre",
          "libQualiteSex": "Membre"
        },
        "organes": {
          "organeRef": "PO675772"
        }
      },
      {
        "@xmlns:xsi": "http://www.w3.org/2001/XMLSchema-instance",
        "@xsi:type": "MandatSimple_Type",
        "uid": "PM712398",
        "acteurRef": "PA267785",
        "legislature": "14",
        "typeOrgane": "GA",
        "dateDebut": "2016-04-22T02:00:00.000+02:00",
        "datePublication": null,
        "dateFin": "2017-06-20T02:00:00.000+02:00",
        "preseance": "20",
        "nominPrincipale": "1",
        "infosQualite": {
          "codeQualite": "Membre",
          "libQualite": "Membre",
          "libQualiteSex": "Membre"
        },
        "organes": {
          "organeRef": "PO675799"
        }
      },
      {
        "@xmlns:xsi": "http://www.w3.org/2001/XMLSchema-instance",
        "@xsi:type": "MandatSimple_Type",
        "uid": "PM679958",
        "acteurRef": "PA267785",
        "legislature": "14",
        "typeOrgane": "GA",
        "dateDebut": "2012-10-12T02:00:00.000+02:00",
        "datePublication": null,
        "dateFin": "2017-06-20T02:00:00.000+02:00",
        "preseance": "20",
        "nominPrincipale": "1",
        "infosQualite": {
          "codeQualite": "Membre",
          "libQualite": "Membre",
          "libQualiteSex": "Membre"
        },
        "organes": {
          "organeRef": "PO675774"
        }
      },
      {
        "@xmlns:xsi": "http://www.w3.org/2001/XMLSchema-instance",
        "@xsi:type": "MandatSimple_Type",
        "uid": "PM739973",
        "acteurRef": "PA267785",
        "legislature": "15",
        "typeOrgane": "GA",
        "dateDebut": "2017-10-13T02:00:00.000+02:00",
        "datePublication": null,
        "dateFin": null,
        "preseance": "20",
        "nominPrincipale": "1",
        "infosQualite": {
          "codeQualite": "Membre",
          "libQualite": "Membre",
          "libQualiteSex": "Membre"
        },
        "organes": {
          "organeRef": "PO732984"
        }
      },
      {
        "@xmlns:xsi": "http://www.w3.org/2001/XMLSchema-instance",
        "@xsi:type": "MandatSimple_Type",
        "uid": "PM678483",
        "acteurRef": "PA267785",
        "legislature": "14",
        "typeOrgane": "GA",
        "dateDebut": "2012-09-26T02:00:00.000+02:00",
        "datePublication": null,
        "dateFin": "2017-06-20T02:00:00.000+02:00",
        "preseance": "1",
        "nominPrincipale": "1",
        "infosQualite": {
          "codeQualite": "Président",
          "libQualite": "Président",
          "libQualiteSex": "Président"
        },
        "organes": {
          "organeRef": "PO675840"
        }
      },
      {
        "@xmlns:xsi": "http://www.w3.org/2001/XMLSchema-instance",
        "@xsi:type": "MandatSimple_Type",
        "uid": "PM739975",
        "acteurRef": "PA267785",
        "legislature": "15",
        "typeOrgane": "GA",
        "dateDebut": "2017-10-13T02:00:00.000+02:00",
        "datePublication": null,
        "dateFin": null,
        "preseance": "20",
        "nominPrincipale": "1",
        "infosQualite": {
          "codeQualite": "Membre",
          "libQualite": "Membre",
          "libQualiteSex": "Membre"
        },
        "organes": {
          "organeRef": "PO733177"
        }
      },
      {
        "@xmlns:xsi": "http://www.w3.org/2001/XMLSchema-instance",
        "@xsi:type": "MandatSimple_Type",
        "uid": "PM739977",
        "acteurRef": "PA267785",
        "legislature": "15",
        "typeOrgane": "GA",
        "dateDebut": "2017-10-13T02:00:00.000+02:00",
        "datePublication": null,
        "dateFin": null,
        "preseance": "20",
        "nominPrincipale": "1",
        "infosQualite": {
          "codeQualite": "Membre",
          "libQualite": "Membre",
          "libQualiteSex": "Membre"
        },
        "organes": {
          "organeRef": "PO733267"
        }
      },
      {
        "@xmlns:xsi": "http://www.w3.org/2001/XMLSchema-instance",
        "@xsi:type": "MandatSimple_Type",
        "uid": "PM739981",
        "acteurRef": "PA267785",
        "legislature": "15",
        "typeOrgane": "GA",
        "dateDebut": "2017-10-13T02:00:00.000+02:00",
        "datePublication": null,
        "dateFin": null,
        "preseance": "20",
        "nominPrincipale": "1",
        "infosQualite": {
          "codeQualite": "Membre",
          "libQualite": "Membre",
          "libQualiteSex": "Membre"
        },
        "organes": {
          "organeRef": "PO733452"
        }
      },
      {
        "@xmlns:xsi": "http://www.w3.org/2001/XMLSchema-instance",
        "@xsi:type": "MandatSimple_Type",
        "uid": "PM739979",
        "acteurRef": "PA267785",
        "legislature": "15",
        "typeOrgane": "GA",
        "dateDebut": "2017-10-13T02:00:00.000+02:00",
        "datePublication": null,
        "dateFin": null,
        "preseance": "20",
        "nominPrincipale": "1",
        "infosQualite": {
          "codeQualite": "Membre",
          "libQualite": "Membre",
          "libQualiteSex": "Membre"
        },
        "organes": {
          "organeRef": "PO733382"
        }
      },
      {
        "@xmlns:xsi": "http://www.w3.org/2001/XMLSchema-instance",
        "@xsi:type": "MandatSimple_Type",
        "uid": "PM739983",
        "acteurRef": "PA267785",
        "legislature": "15",
        "typeOrgane": "GA",
        "dateDebut": "2017-10-13T02:00:00.000+02:00",
        "datePublication": null,
        "dateFin": null,
        "preseance": "20",
        "nominPrincipale": "1",
        "infosQualite": {
          "codeQualite": "Membre",
          "libQualite": "Membre",
          "libQualiteSex": "Membre"
        },
        "organes": {
          "organeRef": "PO733567"
        }
      },
      {
        "@xmlns:xsi": "http://www.w3.org/2001/XMLSchema-instance",
        "@xsi:type": "MandatSimple_Type",
        "uid": "PM739985",
        "acteurRef": "PA267785",
        "legislature": "15",
        "typeOrgane": "GA",
        "dateDebut": "2017-10-13T02:00:00.000+02:00",
        "datePublication": null,
        "dateFin": null,
        "preseance": "20",
        "nominPrincipale": "1",
        "infosQualite": {
          "codeQualite": "Membre",
          "libQualite": "Membre",
          "libQualiteSex": "Membre"
        },
        "organes": {
          "organeRef": "PO733607"
        }
      },
      {
        "@xmlns:xsi": "http://www.w3.org/2001/XMLSchema-instance",
        "@xsi:type": "MandatSimple_Type",
        "uid": "PM679943",
        "acteurRef": "PA267785",
        "legislature": "14",
        "typeOrgane": "GA",
        "dateDebut": "2012-10-12T02:00:00.000+02:00",
        "datePublication": null,
        "dateFin": "2017-06-20T02:00:00.000+02:00",
        "preseance": "20",
        "nominPrincipale": "1",
        "infosQualite": {
          "codeQualite": "Membre",
          "libQualite": "Membre",
          "libQualiteSex": "Membre"
        },
        "organes": {
          "organeRef": "PO675752"
        }
      },
      {
        "@xmlns:xsi": "http://www.w3.org/2001/XMLSchema-instance",
        "@xsi:type": "MandatSimple_Type",
        "uid": "PM679945",
        "acteurRef": "PA267785",
        "legislature": "14",
        "typeOrgane": "GA",
        "dateDebut": "2012-10-12T02:00:00.000+02:00",
        "datePublication": null,
        "dateFin": "2017-06-20T02:00:00.000+02:00",
        "preseance": "20",
        "nominPrincipale": "1",
        "infosQualite": {
          "codeQualite": "Membre",
          "libQualite": "Membre",
          "libQualiteSex": "Membre"
        },
        "organes": {
          "organeRef": "PO675722"
        }
      },
      {
        "@xmlns:xsi": "http://www.w3.org/2001/XMLSchema-instance",
        "@xsi:type": "MandatSimple_Type",
        "uid": "PM679947",
        "acteurRef": "PA267785",
        "legislature": "14",
        "typeOrgane": "GA",
        "dateDebut": "2012-10-12T02:00:00.000+02:00",
        "datePublication": null,
        "dateFin": "2017-06-20T02:00:00.000+02:00",
        "preseance": "20",
        "nominPrincipale": "1",
        "infosQualite": {
          "codeQualite": "Membre",
          "libQualite": "Membre",
          "libQualiteSex": "Membre"
        },
        "organes": {
          "organeRef": "PO675693"
        }
      },
      {
        "@xmlns:xsi": "http://www.w3.org/2001/XMLSchema-instance",
        "@xsi:type": "MandatSimple_Type",
        "uid": "PM679951",
        "acteurRef": "PA267785",
        "legislature": "14",
        "typeOrgane": "GA",
        "dateDebut": "2012-10-12T02:00:00.000+02:00",
        "datePublication": null,
        "dateFin": "2017-06-20T02:00:00.000+02:00",
        "preseance": "20",
        "nominPrincipale": "1",
        "infosQualite": {
          "codeQualite": "Membre",
          "libQualite": "Membre",
          "libQualiteSex": "Membre"
        },
        "organes": {
          "organeRef": "PO675706"
        }
      },
      {
        "@xmlns:xsi": "http://www.w3.org/2001/XMLSchema-instance",
        "@xsi:type": "MandatSimple_Type",
        "uid": "PM735204",
        "acteurRef": "PA267785",
        "legislature": "15",
        "typeOrgane": "GA",
        "dateDebut": "2017-09-26T02:00:00.000+02:00",
        "datePublication": null,
        "dateFin": null,
        "preseance": "20",
        "nominPrincipale": "0",
        "infosQualite": {
          "codeQualite": "Membre",
          "libQualite": "Membre",
          "libQualiteSex": "Membre"
        },
        "organes": {
          "organeRef": "PO733107"
        }
      },
      {
        "@xmlns:xsi": "http://www.w3.org/2001/XMLSchema-instance",
        "@xsi:type": "MandatSimple_Type",
        "uid": "PM679949",
        "acteurRef": "PA267785",
        "legislature": "14",
        "typeOrgane": "GA",
        "dateDebut": "2012-10-12T02:00:00.000+02:00",
        "datePublication": null,
        "dateFin": "2017-06-20T02:00:00.000+02:00",
        "preseance": "20",
        "nominPrincipale": "1",
        "infosQualite": {
          "codeQualite": "Membre",
          "libQualite": "Membre",
          "libQualiteSex": "Membre"
        },
        "organes": {
          "organeRef": "PO675811"
        }
      },
      {
        "@xmlns:xsi": "http://www.w3.org/2001/XMLSchema-instance",
        "@xsi:type": "MandatSimple_Type",
        "uid": "PM679953",
        "acteurRef": "PA267785",
        "legislature": "14",
        "typeOrgane": "GA",
        "dateDebut": "2012-10-12T02:00:00.000+02:00",
        "datePublication": null,
        "dateFin": "2017-06-20T02:00:00.000+02:00",
        "preseance": "20",
        "nominPrincipale": "1",
        "infosQualite": {
          "codeQualite": "Membre",
          "libQualite": "Membre",
          "libQualiteSex": "Membre"
        },
        "organes": {
          "organeRef": "PO675768"
        }
      },
      {
        "@xmlns:xsi": "http://www.w3.org/2001/XMLSchema-instance",
        "@xsi:type": "MandatParlementaire_type",
        "uid": "PM645359",
        "acteurRef": "PA267785",
        "legislature": "14",
        "typeOrgane": "ASSEMBLEE",
        "dateDebut": "2012-06-20T02:00:00.000+02:00",
        "datePublication": null,
        "dateFin": "2017-06-20T02:00:00.000+02:00",
        "preseance": "50",
        "nominPrincipale": "1",
        "infosQualite": {
          "codeQualite": "membre",
          "libQualite": "membre",
          "libQualiteSex": "membre"
        },
        "organes": {
          "organeRef": "PO644420"
        },
        "suppleants": {
          "suppleant": {
            "dateDebut": "2012-06-20T02:00:00.000+02:00",
            "dateFin": "2017-06-20T02:00:00.000+02:00",
            "suppleantRef": "PA643017"
          }
        },
        "chambre": null,
        "election": {
          "lieu": {
            "region": "Bourgogne-Franche-Comté",
            "regionType": "Métropolitain",
            "departement": "Yonne",
            "numDepartement": "89",
            "numCirco": "1"
          },
          "causeMandat": "élections générales",
          "refCirconscription": "PO644914"
        },
        "mandature": {
          "datePriseFonction": "2012-06-20T02:00:00.000+02:00",
          "causeFin": "Fin de législature",
          "premiereElection": "0",
          "placeHemicycle": "045",
          "mandatRemplaceRef": null
        },
        "collaborateurs": null
      },
      {
        "@xmlns:xsi": "http://www.w3.org/2001/XMLSchema-instance",
        "@xsi:type": "MandatSimple_Type",
        "uid": "PM698078",
        "acteurRef": "PA267785",
        "legislature": "14",
        "typeOrgane": "GE",
        "dateDebut": "2013-10-23T02:00:00.000+02:00",
        "datePublication": null,
        "dateFin": "2017-06-20T02:00:00.000+02:00",
        "preseance": "8",
        "nominPrincipale": "1",
        "infosQualite": {
          "codeQualite": "Vice-Président",
          "libQualite": "Vice-Président",
          "libQualiteSex": "Vice-Président"
        },
        "organes": {
          "organeRef": "PO695581"
        }
      },
      {
        "@xmlns:xsi": "http://www.w3.org/2001/XMLSchema-instance",
        "@xsi:type": "MandatSimple_Type",
        "uid": "PM744480",
        "acteurRef": "PA267785",
        "legislature": "15",
        "typeOrgane": "GA",
        "dateDebut": "2017-11-14T01:00:00.000+01:00",
        "datePublication": null,
        "dateFin": null,
        "preseance": "8",
        "nominPrincipale": "1",
        "infosQualite": {
          "codeQualite": "Vice-Président",
          "libQualite": "Vice-Président",
          "libQualiteSex": "Vice-Président"
        },
        "organes": {
          "organeRef": "PO732964"
        }
      },
      {
        "@xmlns:xsi": "http://www.w3.org/2001/XMLSchema-instance",
        "@xsi:type": "MandatSimple_Type",
        "uid": "PM684710",
        "acteurRef": "PA267785",
        "legislature": "14",
        "typeOrgane": "GA",
        "dateDebut": "2012-11-20T01:00:00.000+01:00",
        "datePublication": null,
        "dateFin": "2017-06-20T02:00:00.000+02:00",
        "preseance": "8",
        "nominPrincipale": "1",
        "infosQualite": {
          "codeQualite": "Vice-Président",
          "libQualite": "Vice-Président",
          "libQualiteSex": "Vice-Président"
        },
        "organes": {
          "organeRef": "PO675841"
        }
      },
      {
        "@xmlns:xsi": "http://www.w3.org/2001/XMLSchema-instance",
        "@xsi:type": "MandatParlementaire_type",
        "uid": "PM723310",
        "acteurRef": "PA267785",
        "legislature": "15",
        "typeOrgane": "ASSEMBLEE",
        "dateDebut": "2017-06-18T02:00:00.000+02:00",
        "datePublication": null,
        "dateFin": null,
        "preseance": "50",
        "nominPrincipale": "1",
        "infosQualite": {
          "codeQualite": "membre",
          "libQualite": "membre",
          "libQualiteSex": "membre"
        },
        "organes": {
          "organeRef": "PO717460"
        },
        "suppleants": {
          "suppleant": {
            "dateDebut": "2017-06-18T02:00:00.000+02:00",
            "dateFin": null,
            "suppleantRef": "PA721550"
          }
        },
        "chambre": null,
        "election": {
          "lieu": {
            "region": "Bourgogne-Franche-Comté",
            "regionType": "Métropolitain",
            "departement": "Yonne",
            "numDepartement": "89",
            "numCirco": "1"
          },
          "causeMandat": "élections générales",
          "refCirconscription": "PO718404"
        },
        "mandature": {
          "datePriseFonction": "2017-06-21T02:00:00.000+02:00",
          "causeFin": null,
          "premiereElection": "1",
          "placeHemicycle": "045",
          "mandatRemplaceRef": null
        },
        "collaborateurs": {
          "collaborateur": [
            {
              "qualite": "Mme",
              "prenom": "Elise",
              "nom": "Martin",
              "dateDebut": null,
              "dateFin": null
            },
            {
              "qualite": "M.",
              "prenom": "Régis",
              "nom": "Bouchez",
              "dateDebut": null,
              "dateFin": null
            },
            {
              "qualite": "Mme",
              "prenom": "Fabienne",
              "nom": "Vittot",
              "dateDebut": null,
              "dateFin": null
            },
            {
              "qualite": "M.",
              "prenom": "Karl-Hadrien",
              "nom": "Astié",
              "dateDebut": null,
              "dateFin": null
            }
          ]
        }
      }
    ]
  }
}