{
  "@xmlns": "http://schemas.assemblee-nationale.fr/referentiel",
  "@xmlns:xsi": "http://www.w3.org/2001/XMLSchema-instance",
  "@xsi:type": "OrganeExterne_Type",
  "uid": "PO759809",
  "codeType": "MINISTERE",
  "libelle": "Secrétariat d'État auprès du ministre d'État, ministre de la transition écologique et solidaire",
  "libelleEdition": "auprès du ministre d'État, ministre de la transition écologique et solidaire",
  "libelleAbrege": "Transition écologique et solidaire (Mme Wargon, SE auprès du ministre d'État)",
  "libelleAbrev": "TRE",
  "viMoDe": {
    "dateDebut": "2018-10-17T02:00:00.000+02:00",
    "dateAgrement": null,
    "dateFin": "2019-07-16T02:00:00.000+02:00"
  },
  "organeParent": "PO725688"
}