{
  "@xmlns": "http://schemas.assemblee-nationale.fr/referentiel",
  "@xmlns:xsi": "http://www.w3.org/2001/XMLSchema-instance",
  "@xsi:type": "OrganeExterne_Type",
  "uid": "PO764377",
  "codeType": "MINISTERE",
  "libelle": "Secrétariat d'État auprès du Premier ministre, porte-parole du Gouvernement",
  "libelleEdition": "auprès du Premier ministre, porte-parole du Gouvernement",
  "libelleAbrege": "Porte-parole du Gouvernement",
  "libelleAbrev": "PPAR",
  "viMoDe": {
    "dateDebut": "2019-04-02T02:00:00.000+02:00",
    "dateAgrement": null,
    "dateFin": null
  },
  "organeParent": "PO725688"
}