{
  "@xmlns": "http://schemas.assemblee-nationale.fr/referentiel",
  "@xmlns:xsi": "http://www.w3.org/2001/XMLSchema-instance",
  "@xsi:type": "OrganeExtraParlementaire_type",
  "uid": "PO430982",
  "codeType": "ORGEXTPARL",
  "libelle": "Comité consultatif auprès du conseil d'administration de l'Etablissement public de Paris-Saclay",
  "libelleEdition": "du Comité consultatif auprès du conseil d'administration de l'Etablissement public de Paris-Saclay",
  "libelleAbrege": "Comité consultatif Paris-Saclay",
  "libelleAbrev": "285",
  "viMoDe": {
    "dateDebut": "2010-08-03T02:00:00.000+02:00",
    "dateAgrement": null,
    "dateFin": null
  },
  "organeParent": null,
  "chambre": null,
  "regime": "5ème République",
  "legislature": null,
  "regimeJuridique": "Article L. 321-39 du code de l'urbanisme",
  "siteInternet": "https://www.epaps.fr/gouvernance/comite-consultatif/",
  "nombreReunionsAnnuelles": null
}