{
  "@xmlns": "http://schemas.assemblee-nationale.fr/referentiel",
  "@xmlns:xsi": "http://www.w3.org/2001/XMLSchema-instance",
  "@xsi:type": "OrganeParlementaire_Type",
  "uid": "PO746679",
  "codeType": "GE",
  "libelle": "Chrétiens d'orient",
  "libelleEdition": "CHRÉTIENS D'ORIENT",
  "libelleAbrege": "CHRÉTIENS D'ORIENT",
  "libelleAbrev": "CHRETIENOR",
  "viMoDe": {
    "dateDebut": null,
    "dateAgrement": "2017-12-20T01:00:00.000+01:00",
    "dateFin": null
  },
  "organeParent": null,
  "chambre": null,
  "regime": "5ème République",
  "legislature": "15",
  "secretariat": {
    "secretaire01": "M. Renaud Wetzel",
    "secretaire02": null
  }
}