{
  "uid": "PA332843",
  "etatCivil": {
    "ident": {
      "civ": "Mme",
      "prenom": "Marie-Odile",
      "nom": "Bouillé",
      "alpha": "Bouille"
    },
    "infoNaissance": {
      "dateNais": "1950-10-13T01:00:00.000+01:00",
      "villeNais": "Nantes",
      "depNais": "Loire-Atlantique",
      "paysNais": "France"
    }
  },
  "mandats": [
    {
      "xsiType": "MandatParlementaire_type",
      "uid": "PM645220",
      "acteurRef": "PA332843",
      "legislature": "14",
      "typeOrgane": "ASSEMBLEE",
      "dateDebut": "2012-06-20T02:00:00.000+02:00",
      "dateFin": "2017-06-20T02:00:00.000+02:00",
      "preseance": "50",
      "nominPrincipale": "1",
      "infosQualite": {
        "codeQualite": "membre",
        "libQualite": "membre",
        "libQualiteSex": "membre"
      },
      "organesRefs": [
        "PO644420"
      ],
      "suppleant": {
        "dateDebut": "2012-06-20T02:00:00.000+02:00",
        "dateFin": "2017-06-20T02:00:00.000+02:00",
        "suppleantRef": "PA342843"
      },
      "election": {
        "lieu": {
          "region": "Pays de la Loire",
          "regionType": "Métropolitain",
          "departement": "Loire-Atlantique",
          "numDepartement": "44",
          "numCirco": "8"
        },
        "causeMandat": "élections générales",
        "refCirconscription": "PO644631"
      },
      "mandature": {
        "datePriseFonction": "2012-06-20T02:00:00.000+02:00",
        "causeFin": "Fin de législature",
        "premiereElection": "1"
      }
    },
    {
      "xsiType": "MandatSimple_Type",
      "uid": "PM656061",
      "acteurRef": "PA332843",
      "legislature": "14",
      "typeOrgane": "GP",
      "dateDebut": "2012-06-26T02:00:00.000+02:00",
      "datePublication": "2012-06-27T02:00:00.000+02:00",
      "dateFin": "2016-05-24T02:00:00.000+02:00",
      "preseance": "20",
      "nominPrincipale": "1",
      "infosQualite": {
        "codeQualite": "Membre",
        "libQualite": "Membre du",
        "libQualiteSex": "Membre du"
      },
      "organesRefs": [
        "PO656002"
      ]
    },
    {
      "xsiType": "MandatSimple_Type",
      "uid": "PM657582",
      "acteurRef": "PA332843",
      "legislature": "14",
      "typeOrgane": "COMPER",
      "dateDebut": "2012-06-28T02:00:00.000+02:00",
      "datePublication": "2012-06-28T02:00:00.000+02:00",
      "dateFin": "2017-06-20T02:00:00.000+02:00",
      "preseance": "32",
      "nominPrincipale": "0",
      "infosQualite": {
        "codeQualite": "Membre",
        "libQualite": "Membre",
        "libQualiteSex": "Membre"
      },
      "organesRefs": [
        "PO419604"
      ]
    },
    {
      "xsiType": "MandatSimple_Type",
      "uid": "PM658850",
      "acteurRef": "PA332843",
      "legislature": "14",
      "typeOrgane": "COMPER",
      "dateDebut": "2012-06-28T02:00:00.000+02:00",
      "datePublication": "2012-06-29T02:00:00.000+02:00",
      "dateFin": "2017-06-20T02:00:00.000+02:00",
      "preseance": "8",
      "nominPrincipale": "1",
      "infosQualite": {
        "codeQualite": "Vice-Président",
        "libQualite": "Vice-président",
        "libQualiteSex": "Vice-présidente"
      },
      "organesRefs": [
        "PO419604"
      ]
    },
    {
      "xsiType": "MandatMission_Type",
      "uid": "PM677396",
      "acteurRef": "PA332843",
      "legislature": "14",
      "typeOrgane": "MISINFOCOM",
      "dateDebut": "2012-07-25T02:00:00.000+02:00",
      "datePublication": "2012-07-27T02:00:00.000+02:00",
      "dateFin": "2013-04-17T02:00:00.000+02:00",
      "preseance": "20",
      "nominPrincipale": "1",
      "infosQualite": {
        "codeQualite": "Membre",
        "libQualite": "Membre",
        "libQualiteSex": "Membre"
      },
      "organesRefs": [
        "PO676552"
      ]
    },
    {
      "xsiType": "MandatSimple_Type",
      "uid": "PM682583",
      "acteurRef": "PA332843",
      "legislature": "14",
      "typeOrgane": "GA",
      "dateDebut": "2012-10-18T02:00:00.000+02:00",
      "dateFin": "2017-06-20T02:00:00.000+02:00",
      "preseance": "20",
      "nominPrincipale": "1",
      "infosQualite": {
        "codeQualite": "Membre",
        "libQualite": "Membre",
        "libQualiteSex": "Membre"
      },
      "organesRefs": [
        "PO675845"
      ]
    },
    {
      "xsiType": "MandatSimple_Type",
      "uid": "PM682584",
      "acteurRef": "PA332843",
      "legislature": "14",
      "typeOrgane": "GA",
      "dateDebut": "2012-10-18T02:00:00.000+02:00",
      "dateFin": "2017-06-20T02:00:00.000+02:00",
      "preseance": "20",
      "nominPrincipale": "1",
      "infosQualite": {
        "codeQualite": "Membre",
        "libQualite": "Membre",
        "libQualiteSex": "Membre"
      },
      "organesRefs": [
        "PO675771"
      ]
    },
    {
      "xsiType": "MandatSimple_Type",
      "uid": "PM683106",
      "acteurRef": "PA332843",
      "legislature": "14",
      "typeOrgane": "GA",
      "dateDebut": "2012-10-23T02:00:00.000+02:00",
      "dateFin": "2012-11-14T01:00:00.000+01:00",
      "preseance": "20",
      "nominPrincipale": "1",
      "infosQualite": {
        "codeQualite": "Membre",
        "libQualite": "Membre",
        "libQualiteSex": "Membre"
      },
      "organesRefs": [
        "PO675813"
      ]
    },
    {
      "xsiType": "MandatSimple_Type",
      "uid": "PM683107",
      "acteurRef": "PA332843",
      "legislature": "14",
      "typeOrgane": "GA",
      "dateDebut": "2012-10-23T02:00:00.000+02:00",
      "dateFin": "2012-11-19T01:00:00.000+01:00",
      "preseance": "20",
      "nominPrincipale": "1",
      "infosQualite": {
        "codeQualite": "Membre",
        "libQualite": "Membre",
        "libQualiteSex": "Membre"
      },
      "organesRefs": [
        "PO675730"
      ]
    },
    {
      "xsiType": "MandatSimple_Type",
      "uid": "PM683111",
      "acteurRef": "PA332843",
      "legislature": "14",
      "typeOrgane": "GA",
      "dateDebut": "2012-10-23T02:00:00.000+02:00",
      "dateFin": "2012-11-30T01:00:00.000+01:00",
      "preseance": "20",
      "nominPrincipale": "1",
      "infosQualite": {
        "codeQualite": "Membre",
        "libQualite": "Membre",
        "libQualiteSex": "Membre"
      },
      "organesRefs": [
        "PO675817"
      ]
    },
    {
      "xsiType": "MandatSimple_Type",
      "uid": "PM683112",
      "acteurRef": "PA332843",
      "legislature": "14",
      "typeOrgane": "GA",
      "dateDebut": "2012-10-23T02:00:00.000+02:00",
      "dateFin": "2012-11-27T01:00:00.000+01:00",
      "preseance": "20",
      "nominPrincipale": "1",
      "infosQualite": {
        "codeQualite": "Membre",
        "libQualite": "Membre",
        "libQualiteSex": "Membre"
      },
      "organesRefs": [
        "PO675827"
      ]
    },
    {
      "xsiType": "MandatSimple_Type",
      "uid": "PM683114",
      "acteurRef": "PA332843",
      "legislature": "14",
      "typeOrgane": "GA",
      "dateDebut": "2012-10-23T02:00:00.000+02:00",
      "dateFin": "2012-11-12T01:00:00.000+01:00",
      "preseance": "20",
      "nominPrincipale": "1",
      "infosQualite": {
        "codeQualite": "Membre",
        "libQualite": "Membre",
        "libQualiteSex": "Membre"
      },
      "organesRefs": [
        "PO675810"
      ]
    },
    {
      "xsiType": "MandatSimple_Type",
      "uid": "PM685661",
      "acteurRef": "PA332843",
      "typeOrgane": "PARPOL",
      "dateDebut": "2012-12-01T01:00:00.000+01:00",
      "dateFin": "2017-06-20T02:00:00.000+02:00",
      "preseance": "5",
      "nominPrincipale": "1",
      "infosQualite": {
        "codeQualite": "Membre",
        "libQualite": "Membre",
        "libQualiteSex": "Membre"
      },
      "organesRefs": [
        "PO684932"
      ]
    },
    {
      "xsiType": "MandatSimple_Type",
      "uid": "PM686924",
      "acteurRef": "PA332843",
      "legislature": "14",
      "typeOrgane": "GA",
      "dateDebut": "2012-12-10T01:00:00.000+01:00",
      "dateFin": "2017-06-20T02:00:00.000+02:00",
      "preseance": "14",
      "nominPrincipale": "1",
      "infosQualite": {
        "codeQualite": "Secrétaire",
        "libQualite": "Secrétaire",
        "libQualiteSex": "Secrétaire"
      },
      "organesRefs": [
        "PO675845"
      ]
    },
    {
      "xsiType": "MandatSimple_Type",
      "uid": "PM687132",
      "acteurRef": "PA332843",
      "legislature": "14",
      "typeOrgane": "GE",
      "dateDebut": "2012-12-17T01:00:00.000+01:00",
      "dateFin": "2017-06-20T02:00:00.000+02:00",
      "preseance": "20",
      "nominPrincipale": "1",
      "infosQualite": {
        "codeQualite": "Membre",
        "libQualite": "Membre",
        "libQualiteSex": "Membre"
      },
      "organesRefs": [
        "PO686468"
      ]
    },
    {
      "xsiType": "MandatSimple_Type",
      "uid": "PM690170",
      "acteurRef": "PA332843",
      "legislature": "14",
      "typeOrgane": "GE",
      "dateDebut": "2013-02-03T01:00:00.000+01:00",
      "dateFin": "2017-06-20T02:00:00.000+02:00",
      "preseance": "20",
      "nominPrincipale": "1",
      "infosQualite": {
        "codeQualite": "Membre",
        "libQualite": "Membre",
        "libQualiteSex": "Membre"
      },
      "organesRefs": [
        "PO686758"
      ]
    },
    {
      "xsiType": "MandatSimple_Type",
      "uid": "PM690521",
      "acteurRef": "PA332843",
      "legislature": "14",
      "typeOrgane": "GE",
      "dateDebut": "2013-01-29T01:00:00.000+01:00",
      "dateFin": "2017-06-20T02:00:00.000+02:00",
      "preseance": "20",
      "nominPrincipale": "1",
      "infosQualite": {
        "codeQualite": "Membre",
        "libQualite": "Membre",
        "libQualiteSex": "Membre"
      },
      "organesRefs": [
        "PO686861"
      ]
    },
    {
      "xsiType": "MandatSimple_Type",
      "uid": "PM693449",
      "acteurRef": "PA332843",
      "legislature": "14",
      "typeOrgane": "GE",
      "dateDebut": "2013-04-10T02:00:00.000+02:00",
      "dateFin": "2017-06-20T02:00:00.000+02:00",
      "preseance": "20",
      "nominPrincipale": "1",
      "infosQualite": {
        "codeQualite": "Membre",
        "libQualite": "Membre",
        "libQualiteSex": "Membre"
      },
      "organesRefs": [
        "PO689018"
      ]
    },
    {
      "xsiType": "MandatMission_Type",
      "uid": "PM699440",
      "acteurRef": "PA332843",
      "legislature": "14",
      "typeOrgane": "MISINFOPRE",
      "dateDebut": "2014-01-14T01:00:00.000+01:00",
      "datePublication": "2014-01-15T01:00:00.000+01:00",
      "dateFin": "2014-10-28T01:00:00.000+01:00",
      "preseance": "20",
      "nominPrincipale": "1",
      "infosQualite": {
        "codeQualite": "Membre",
        "libQualite": "Membre",
        "libQualiteSex": "Membre"
      },
      "organesRefs": [
        "PO699419"
      ]
    },
    {
      "xsiType": "MandatSimple_Type",
      "uid": "PM705665",
      "acteurRef": "PA332843",
      "legislature": "14",
      "typeOrgane": "CMP",
      "dateDebut": "2015-01-13T01:00:00.000+01:00",
      "datePublication": "2015-01-15T01:00:00.000+01:00",
      "dateFin": "2015-02-10T01:00:00.000+01:00",
      "preseance": "28",
      "nominPrincipale": "1",
      "infosQualite": {
        "codeQualite": "Suppléant",
        "libQualite": "Membre suppléant",
        "libQualiteSex": "Membre suppléante"
      },
      "organesRefs": [
        "PO705602"
      ]
    },
    {
      "xsiType": "MandatSimple_Type",
      "uid": "PM706365",
      "acteurRef": "PA332843",
      "legislature": "14",
      "typeOrgane": "CMP",
      "dateDebut": "2015-02-17T01:00:00.000+01:00",
      "datePublication": "2015-02-18T01:00:00.000+01:00",
      "dateFin": "2015-04-02T02:00:00.000+02:00",
      "preseance": "28",
      "nominPrincipale": "1",
      "infosQualite": {
        "codeQualite": "Suppléant",
        "libQualite": "Membre suppléant",
        "libQualiteSex": "Membre suppléante"
      },
      "organesRefs": [
        "PO706223"
      ]
    },
    {
      "xsiType": "MandatMission_Type",
      "uid": "PM707387",
      "acteurRef": "PA332843",
      "legislature": "14",
      "typeOrgane": "MISINFO",
      "dateDebut": "2015-01-13T01:00:00.000+01:00",
      "dateFin": "2015-07-15T02:00:00.000+02:00",
      "preseance": "10",
      "nominPrincipale": "1",
      "infosQualite": {
        "codeQualite": "Membre",
        "libQualite": "Membre",
        "libQualiteSex": "Membre"
      },
      "organesRefs": [
        "PO707374"
      ]
    },
    {
      "xsiType": "MandatMission_Type",
      "uid": "PM711247",
      "acteurRef": "PA332843",
      "legislature": "14",
      "typeOrgane": "MISINFO",
      "dateDebut": "2016-01-20T01:00:00.000+01:00",
      "dateFin": "2016-11-16T01:00:00.000+01:00",
      "preseance": "10",
      "nominPrincipale": "1",
      "infosQualite": {
        "codeQualite": "Membre",
        "libQualite": "Membre",
        "libQualiteSex": "Membre"
      },
      "organesRefs": [
        "PO711240"
      ]
    },
    {
      "xsiType": "MandatSimple_Type",
      "uid": "PM713121",
      "acteurRef": "PA332843",
      "legislature": "14",
      "typeOrgane": "GP",
      "dateDebut": "2016-05-25T02:00:00.000+02:00",
      "dateFin": "2017-06-20T02:00:00.000+02:00",
      "preseance": "20",
      "nominPrincipale": "1",
      "infosQualite": {
        "codeQualite": "Membre",
        "libQualite": "Membre du",
        "libQualiteSex": "Membre du"
      },
      "organesRefs": [
        "PO713077"
      ]
    },
    {
      "xsiType": "MandatSimple_Type",
      "uid": "PM713490",
      "acteurRef": "PA332843",
      "legislature": "14",
      "typeOrgane": "GE",
      "dateDebut": "2016-05-31T02:00:00.000+02:00",
      "dateFin": "2017-06-20T02:00:00.000+02:00",
      "preseance": "20",
      "nominPrincipale": "1",
      "infosQualite": {
        "codeQualite": "Membre",
        "libQualite": "Membre",
        "libQualiteSex": "Membre"
      },
      "organesRefs": [
        "PO712794"
      ]
    },
    {
      "xsiType": "MandatSimple_Type",
      "uid": "PM713864",
      "acteurRef": "PA332843",
      "legislature": "14",
      "typeOrgane": "CNPE",
      "dateDebut": "2016-06-17T02:00:00.000+02:00",
      "datePublication": "2016-06-18T02:00:00.000+02:00",
      "dateFin": "2016-12-20T01:00:00.000+01:00",
      "preseance": "20",
      "nominPrincipale": "1",
      "infosQualite": {
        "codeQualite": "Membre",
        "libQualite": "Membre",
        "libQualiteSex": "Membre"
      },
      "organesRefs": [
        "PO713684"
      ]
    }
  ]
}