{
  "xsiType": "OrganeParlementaire_Type",
  "uid": "PO709882",
  "codeType": "CMP",
  "libelle": "Commission mixte paritaire chargée de proposer un texte sur les dispositions restant en discussion de la proposition de loi créant de nouveaux droits pour les personnes malades en fin de vie",
  "libelleEdition": "de la commission mixte paritaire chargée de proposer un texte sur les dispositions restant en discussion de la proposition de loi créant de nouveaux droits pour les personnes malades en fin de vie",
  "libelleAbrege": "Nouveaux droits en faveur des personnes en fin de vie",
  "libelleAbrev": "2512",
  "viMoDe": {
    "dateDebut": "2015-10-30T01:00:00.000+01:00",
    "dateFin": "2016-02-11T01:00:00.000+01:00"
  },
  "regime": "5ème République",
  "legislature": "14",
  "secretariat": {}
}