{
  "xsiType": "OrganeExtraParlementaire_type",
  "uid": "PO405049",
  "codeType": "ORGEXTPARL",
  "libelle": "Commission nationale des compétences et des talents",
  "libelleEdition": "de la Commission nationale des compétences et des talents",
  "libelleAbrege": "Compétences et talents",
  "libelleAbrev": "241",
  "viMoDe": {
    "dateDebut": "2007-03-21T01:00:00.000+01:00",
    "dateFin": "2014-02-17T01:00:00.000+01:00"
  },
  "regimeJuridique": "Article R. 315-2 du code de l’entrée et du séjour des étrangers et du droit d’asile"
}