{
  "uid": "PA415471",
  "etatCivil": {
    "ident": {
      "civ": "M.",
      "prenom": "Marc",
      "nom": "Daunis",
      "alpha": "DAUNIS MARC"
    },
    "infoNaissance": {
      "dateNais": "1955-04-22T01:00:00.000+01:00"
    }
  },
  "mandats": [
    {
      "xsiType": "MandatParlementaire_type",
      "uid": "PM415562",
      "acteurRef": "PA415471",
      "typeOrgane": "SENAT",
      "dateDebut": "2008-10-01T02:00:00.000+02:00",
      "dateFin": "2014-09-30T02:00:00.000+02:00",
      "preseance": "20",
      "nominPrincipale": "1",
      "infosQualite": {
        "codeQualite": "Sénateur",
        "libQualite": "SENATEUR",
        "libQualiteSex": "SENATEUR"
      },
      "organesRefs": [
        "PO78718"
      ],
      "election": {
        "lieu": {
          "numDepartement": "06"
        }
      },
      "mandature": {}
    },
    {
      "xsiType": "MandatSimple_Type",
      "uid": "PM415749",
      "acteurRef": "PA415471",
      "typeOrgane": "GROUPESENAT",
      "dateDebut": "2008-10-01T02:00:00.000+02:00",
      "preseance": "4",
      "nominPrincipale": "1",
      "infosQualite": {
        "codeQualite": "Membre",
        "libQualite": "Membre",
        "libQualiteSex": "Membre"
      },
      "organesRefs": [
        "PO77710"
      ]
    },
    {
      "xsiType": "MandatSimple_Type",
      "uid": "PM421705",
      "acteurRef": "PA415471",
      "typeOrgane": "DELEGSENAT",
      "dateDebut": "2009-09-23T02:00:00.000+02:00",
      "preseance": "4",
      "nominPrincipale": "1",
      "infosQualite": {
        "codeQualite": "Membre",
        "libQualite": "Membre",
        "libQualiteSex": "Membre"
      },
      "organesRefs": [
        "PO420388"
      ]
    },
    {
      "xsiType": "MandatParlementaire_type",
      "uid": "PM430218",
      "acteurRef": "PA415471",
      "typeOrgane": "SENAT",
      "dateDebut": "2011-10-05T02:00:00.000+02:00",
      "dateFin": "2014-09-30T02:00:00.000+02:00",
      "nominPrincipale": "1",
      "infosQualite": {
        "libQualite": "Secrétaire",
        "libQualiteSex": "Secrétaire"
      },
      "organesRefs": [
        "PO78718"
      ],
      "election": {
        "lieu": {}
      },
      "mandature": {}
    },
    {
      "xsiType": "MandatSimple_Type",
      "uid": "PM516790",
      "acteurRef": "PA415471",
      "typeOrgane": "COMSENAT",
      "dateDebut": "2012-02-21T01:00:00.000+01:00",
      "dateFin": "2012-07-23T02:00:00.000+02:00",
      "preseance": "10",
      "nominPrincipale": "1",
      "infosQualite": {
        "codeQualite": "Membre",
        "libQualite": "Membre",
        "libQualiteSex": "Membre"
      },
      "organesRefs": [
        "PO516754"
      ]
    },
    {
      "xsiType": "MandatSimple_Type",
      "uid": "PM677489",
      "acteurRef": "PA415471",
      "typeOrgane": "COMSENAT",
      "dateDebut": "2012-07-24T02:00:00.000+02:00",
      "dateFin": "2014-10-08T02:00:00.000+02:00",
      "preseance": "10",
      "nominPrincipale": "1",
      "infosQualite": {
        "codeQualite": "Membre",
        "libQualite": "Membre",
        "libQualiteSex": "Membre"
      },
      "organesRefs": [
        "PO516753"
      ]
    },
    {
      "xsiType": "MandatSimple_Type",
      "uid": "PM691480",
      "acteurRef": "PA415471",
      "typeOrgane": "DELEGSENAT",
      "dateDebut": "2013-02-05T01:00:00.000+01:00",
      "preseance": "4",
      "nominPrincipale": "1",
      "infosQualite": {
        "codeQualite": "Membre",
        "libQualite": "Membre",
        "libQualiteSex": "Membre"
      },
      "organesRefs": [
        "PO420388"
      ]
    },
    {
      "xsiType": "MandatSimple_Type",
      "uid": "PM702411",
      "acteurRef": "PA415471",
      "typeOrgane": "CMP",
      "dateDebut": "2014-07-09T02:00:00.000+02:00",
      "datePublication": "2014-07-11T02:00:00.000+02:00",
      "dateFin": "2014-07-21T02:00:00.000+02:00",
      "preseance": "20",
      "nominPrincipale": "1",
      "infosQualite": {
        "codeQualite": "Titulaire",
        "libQualite": "Membre titulaire",
        "libQualiteSex": "Membre titulaire"
      },
      "organesRefs": [
        "PO702220"
      ]
    },
    {
      "xsiType": "MandatSimple_Type",
      "uid": "PM702578",
      "acteurRef": "PA415471",
      "typeOrgane": "CMP",
      "dateDebut": "2014-07-16T02:00:00.000+02:00",
      "datePublication": "2014-07-14T02:00:00.000+02:00",
      "dateFin": "2014-07-21T02:00:00.000+02:00",
      "preseance": "16",
      "nominPrincipale": "1",
      "infosQualite": {
        "codeQualite": "Rapporteur",
        "libQualite": "Rapporteur",
        "libQualiteSex": "Rapporteur"
      },
      "organesRefs": [
        "PO702220"
      ]
    },
    {
      "xsiType": "MandatParlementaire_type",
      "uid": "PM703663",
      "acteurRef": "PA415471",
      "typeOrgane": "SENAT",
      "dateDebut": "2014-10-01T02:00:00.000+02:00",
      "preseance": "20",
      "nominPrincipale": "1",
      "infosQualite": {
        "codeQualite": "Sénateur",
        "libQualite": "SENATEUR",
        "libQualiteSex": "SENATEUR"
      },
      "organesRefs": [
        "PO78718"
      ],
      "election": {
        "lieu": {
          "numDepartement": "06"
        }
      },
      "mandature": {}
    },
    {
      "xsiType": "MandatSimple_Type",
      "uid": "PM704198",
      "acteurRef": "PA415471",
      "typeOrgane": "COMSENAT",
      "dateDebut": "2014-10-09T02:00:00.000+02:00",
      "dateFin": "2017-10-03T02:00:00.000+02:00",
      "nominPrincipale": "1",
      "infosQualite": {
        "libQualite": "Secrétaire",
        "libQualiteSex": "Secrétaire"
      },
      "organesRefs": [
        "PO516753"
      ]
    },
    {
      "xsiType": "MandatSimple_Type",
      "uid": "PM704954",
      "acteurRef": "PA415471",
      "typeOrgane": "DELEGSENAT",
      "dateDebut": "2014-11-05T01:00:00.000+01:00",
      "nominPrincipale": "1",
      "infosQualite": {
        "libQualite": "Vice-Président",
        "libQualiteSex": "Vice-Président"
      },
      "organesRefs": [
        "PO420387"
      ]
    },
    {
      "xsiType": "MandatSimple_Type",
      "uid": "PM706028",
      "acteurRef": "PA415471",
      "typeOrgane": "ORGAINT",
      "dateDebut": "2014-10-01T02:00:00.000+02:00",
      "dateFin": "2017-11-07T01:00:00.000+01:00",
      "preseance": "42",
      "nominPrincipale": "1",
      "infosQualite": {
        "codeQualite": "Membre",
        "libQualite": "Membre",
        "libQualiteSex": "Membre"
      },
      "organesRefs": [
        "PO206064"
      ]
    },
    {
      "xsiType": "MandatSimple_Type",
      "uid": "PM708688",
      "acteurRef": "PA415471",
      "typeOrgane": "DELEGSENAT",
      "dateDebut": "2015-06-18T02:00:00.000+02:00",
      "nominPrincipale": "1",
      "infosQualite": {
        "libQualite": "Secrétaire",
        "libQualiteSex": "Secrétaire"
      },
      "organesRefs": [
        "PO420387"
      ]
    },
    {
      "xsiType": "MandatSimple_Type",
      "uid": "PM716661",
      "acteurRef": "PA415471",
      "typeOrgane": "CMP",
      "dateDebut": "2017-01-26T01:00:00.000+01:00",
      "datePublication": "2017-01-28T01:00:00.000+01:00",
      "dateFin": "2017-02-02T01:00:00.000+01:00",
      "preseance": "28",
      "nominPrincipale": "1",
      "infosQualite": {
        "codeQualite": "Suppléant",
        "libQualite": "Membre suppléant",
        "libQualiteSex": "Membre suppléant"
      },
      "organesRefs": [
        "PO716629"
      ]
    },
    {
      "xsiType": "MandatSimple_Type",
      "uid": "PM741182",
      "acteurRef": "PA415471",
      "typeOrgane": "COMSENAT",
      "dateDebut": "2017-10-04T02:00:00.000+02:00",
      "preseance": "10",
      "nominPrincipale": "1",
      "infosQualite": {
        "codeQualite": "Membre",
        "libQualite": "Membre",
        "libQualiteSex": "Membre"
      },
      "organesRefs": [
        "PO516753"
      ]
    },
    {
      "xsiType": "MandatSimple_Type",
      "uid": "PM741492",
      "acteurRef": "PA415471",
      "typeOrgane": "DELEGSENAT",
      "dateDebut": "2017-10-18T02:00:00.000+02:00",
      "preseance": "4",
      "nominPrincipale": "1",
      "infosQualite": {
        "codeQualite": "Membre",
        "libQualite": "Membre",
        "libQualiteSex": "Membre"
      },
      "organesRefs": [
        "PO420387"
      ]
    },
    {
      "xsiType": "MandatSimple_Type",
      "uid": "PM742193",
      "acteurRef": "PA415471",
      "typeOrgane": "DELEGSENAT",
      "dateDebut": "2017-10-26T02:00:00.000+02:00",
      "nominPrincipale": "1",
      "infosQualite": {
        "libQualite": "Vice-Président",
        "libQualiteSex": "Vice-Président"
      },
      "organesRefs": [
        "PO420387"
      ]
    },
    {
      "xsiType": "MandatSimple_Type",
      "uid": "PM743223",
      "acteurRef": "PA415471",
      "typeOrgane": "ORGAINT",
      "dateDebut": "2017-11-08T01:00:00.000+01:00",
      "preseance": "42",
      "nominPrincipale": "1",
      "infosQualite": {
        "codeQualite": "Membre",
        "libQualite": "Membre",
        "libQualiteSex": "Membre"
      },
      "organesRefs": [
        "PO206064"
      ]
    },
    {
      "xsiType": "MandatSimple_Type",
      "uid": "PM750578",
      "acteurRef": "PA415471",
      "typeOrgane": "CMP",
      "dateDebut": "2018-02-16T01:00:00.000+01:00",
      "datePublication": "2018-02-16T01:00:00.000+01:00",
      "preseance": "28",
      "nominPrincipale": "1",
      "infosQualite": {
        "codeQualite": "Suppléant",
        "libQualite": "Membre suppléant",
        "libQualiteSex": "Membre suppléant"
      },
      "organesRefs": [
        "PO749105"
      ]
    }
  ]
}