{
  "xsiType": "OrganeExtraParlementaire_type",
  "uid": "PO218793",
  "codeType": "ORGEXTPARL",
  "libelle": "Conseil d'administration de la société France Télévisions",
  "libelleEdition": "du conseil d'administration de la société France Télévisions",
  "libelleAbrege": "France Télévisions",
  "libelleAbrev": "167",
  "viMoDe": {
    "dateDebut": "2000-08-01T02:00:00.000+02:00"
  },
  "regimeJuridique": "Article 47-1 de la loi n° 86-1067 du 30 septembre 1986"
}