{
  "uid": "PA703519",
  "etatCivil": {
    "ident": {
      "civ": "M.",
      "prenom": "Michel",
      "nom": "Amiel",
      "alpha": "AMIEL_Michel"
    },
    "infoNaissance": {
      "dateNais": "1954-07-03T01:00:00.000+01:00"
    }
  },
  "mandats": [
    {
      "xsiType": "MandatParlementaire_type",
      "uid": "PM703649",
      "acteurRef": "PA703519",
      "typeOrgane": "SENAT",
      "dateDebut": "2014-10-01T02:00:00.000+02:00",
      "preseance": "20",
      "nominPrincipale": "1",
      "infosQualite": {
        "codeQualite": "Sénateur",
        "libQualite": "SENATEUR",
        "libQualiteSex": "SENATEUR"
      },
      "organesRefs": [
        "PO78718"
      ],
      "election": {
        "lieu": {
          "numDepartement": "13"
        }
      },
      "mandature": {}
    },
    {
      "xsiType": "MandatSimple_Type",
      "uid": "PM703905",
      "acteurRef": "PA703519",
      "typeOrgane": "GROUPESENAT",
      "dateDebut": "2014-10-07T02:00:00.000+02:00",
      "dateFin": "2015-07-14T02:00:00.000+02:00",
      "preseance": "4",
      "nominPrincipale": "1",
      "infosQualite": {
        "codeQualite": "Membre",
        "libQualite": "Membre",
        "libQualiteSex": "Membre"
      },
      "organesRefs": [
        "PO77708"
      ]
    },
    {
      "xsiType": "MandatSimple_Type",
      "uid": "PM703954",
      "acteurRef": "PA703519",
      "typeOrgane": "COMSENAT",
      "dateDebut": "2014-10-08T02:00:00.000+02:00",
      "dateFin": "2017-10-04T02:00:00.000+02:00",
      "preseance": "10",
      "nominPrincipale": "1",
      "infosQualite": {
        "codeQualite": "Membre",
        "libQualite": "Membre",
        "libQualiteSex": "Membre"
      },
      "organesRefs": [
        "PO211493"
      ]
    },
    {
      "xsiType": "MandatSimple_Type",
      "uid": "PM704276",
      "acteurRef": "PA703519",
      "typeOrgane": "COMSPSENAT",
      "dateDebut": "2014-10-09T02:00:00.000+02:00",
      "dateFin": "2016-04-13T02:00:00.000+02:00",
      "nominPrincipale": "1",
      "infosQualite": {
        "libQualite": "Membre",
        "libQualiteSex": "Membre"
      },
      "organesRefs": [
        "PO699895"
      ]
    },
    {
      "xsiType": "MandatSimple_Type",
      "uid": "PM709078",
      "acteurRef": "PA703519",
      "typeOrgane": "GROUPESENAT",
      "dateDebut": "2015-07-15T02:00:00.000+02:00",
      "dateFin": "2017-06-27T02:00:00.000+02:00",
      "preseance": "8",
      "nominPrincipale": "1",
      "infosQualite": {
        "codeQualite": "Membre rattaché",
        "libQualite": "Membre rattaché",
        "libQualiteSex": "Membre rattaché"
      },
      "organesRefs": [
        "PO77714"
      ]
    },
    {
      "xsiType": "MandatSimple_Type",
      "uid": "PM711137",
      "acteurRef": "PA703519",
      "typeOrgane": "CMP",
      "dateDebut": "2015-12-17T01:00:00.000+01:00",
      "datePublication": "2016-01-15T01:00:00.000+01:00",
      "dateFin": "2016-02-11T01:00:00.000+01:00",
      "preseance": "28",
      "nominPrincipale": "1",
      "infosQualite": {
        "codeQualite": "Suppléant",
        "libQualite": "Membre suppléant",
        "libQualiteSex": "Membre suppléant"
      },
      "organesRefs": [
        "PO709882"
      ]
    },
    {
      "xsiType": "MandatSimple_Type",
      "uid": "PM713944",
      "acteurRef": "PA703519",
      "typeOrgane": "CMP",
      "dateDebut": "2016-06-23T02:00:00.000+02:00",
      "datePublication": "2016-06-24T02:00:00.000+02:00",
      "dateFin": "2016-07-05T02:00:00.000+02:00",
      "preseance": "28",
      "nominPrincipale": "1",
      "infosQualite": {
        "codeQualite": "Suppléant",
        "libQualite": "Membre suppléant",
        "libQualiteSex": "Membre suppléant"
      },
      "organesRefs": [
        "PO713876"
      ]
    },
    {
      "xsiType": "MandatSimple_Type",
      "uid": "PM716572",
      "acteurRef": "PA703519",
      "typeOrgane": "CMP",
      "dateDebut": "2017-01-18T01:00:00.000+01:00",
      "datePublication": "2017-01-20T01:00:00.000+01:00",
      "dateFin": "2017-01-25T01:00:00.000+01:00",
      "preseance": "28",
      "nominPrincipale": "1",
      "infosQualite": {
        "codeQualite": "Suppléant",
        "libQualite": "Membre suppléant",
        "libQualiteSex": "Membre suppléant"
      },
      "organesRefs": [
        "PO716002"
      ]
    },
    {
      "xsiType": "MandatSimple_Type",
      "uid": "PM732447",
      "acteurRef": "PA703519",
      "typeOrgane": "GROUPESENAT",
      "dateDebut": "2017-06-28T02:00:00.000+02:00",
      "dateFin": "2017-06-28T02:00:00.000+02:00",
      "preseance": "4",
      "nominPrincipale": "1",
      "infosQualite": {
        "codeQualite": "Membre",
        "libQualite": "Membre",
        "libQualiteSex": "Membre"
      },
      "organesRefs": [
        "PO732421"
      ]
    },
    {
      "xsiType": "MandatSimple_Type",
      "uid": "PM732483",
      "acteurRef": "PA703519",
      "typeOrgane": "GROUPESENAT",
      "dateDebut": "2017-06-29T02:00:00.000+02:00",
      "dateFin": "2017-06-29T02:00:00.000+02:00",
      "preseance": "4",
      "nominPrincipale": "1",
      "infosQualite": {
        "codeQualite": "Membre",
        "libQualite": "Membre",
        "libQualiteSex": "Membre"
      },
      "organesRefs": [
        "PO77708"
      ]
    },
    {
      "xsiType": "MandatSimple_Type",
      "uid": "PM732484",
      "acteurRef": "PA703519",
      "typeOrgane": "GROUPESENAT",
      "dateDebut": "2017-06-30T02:00:00.000+02:00",
      "preseance": "4",
      "nominPrincipale": "1",
      "infosQualite": {
        "codeQualite": "Membre",
        "libQualite": "Membre",
        "libQualiteSex": "Membre"
      },
      "organesRefs": [
        "PO732421"
      ]
    },
    {
      "xsiType": "MandatSimple_Type",
      "uid": "PM741295",
      "acteurRef": "PA703519",
      "typeOrgane": "COMSENAT",
      "dateDebut": "2017-10-05T02:00:00.000+02:00",
      "nominPrincipale": "1",
      "infosQualite": {
        "libQualite": "Vice-Président",
        "libQualiteSex": "Vice-Président"
      },
      "organesRefs": [
        "PO211493"
      ]
    },
    {
      "xsiType": "MandatAvecSuppleant_Type",
      "uid": "PM742801",
      "acteurRef": "PA703519",
      "typeOrgane": "OFFPAR",
      "dateDebut": "2017-11-09T01:00:00.000+01:00",
      "datePublication": "2017-11-10T01:00:00.000+01:00",
      "preseance": "24",
      "nominPrincipale": "1",
      "infosQualite": {
        "codeQualite": "Membre",
        "libQualite": "Membre",
        "libQualiteSex": "Membre"
      },
      "organesRefs": [
        "PO273589"
      ]
    },
    {
      "xsiType": "MandatSimple_Type",
      "uid": "PM743689",
      "acteurRef": "PA703519",
      "typeOrgane": "CMP",
      "dateDebut": "2017-11-17T01:00:00.000+01:00",
      "datePublication": "2017-11-22T01:00:00.000+01:00",
      "dateFin": "2017-12-22T01:00:00.000+01:00",
      "preseance": "20",
      "nominPrincipale": "1",
      "infosQualite": {
        "codeQualite": "Titulaire",
        "libQualite": "Membre titulaire",
        "libQualiteSex": "Membre titulaire"
      },
      "organesRefs": [
        "PO743571"
      ]
    },
    {
      "xsiType": "MandatSimple_Type",
      "uid": "PM744550",
      "acteurRef": "PA703519",
      "typeOrgane": "CMP",
      "dateDebut": "2017-11-30T01:00:00.000+01:00",
      "datePublication": "2017-12-01T01:00:00.000+01:00",
      "dateFin": "2017-12-20T01:00:00.000+01:00",
      "preseance": "20",
      "nominPrincipale": "1",
      "infosQualite": {
        "codeQualite": "Titulaire",
        "libQualite": "Membre titulaire",
        "libQualiteSex": "Membre titulaire"
      },
      "organesRefs": [
        "PO739840"
      ]
    },
    {
      "xsiType": "MandatSimple_Type",
      "uid": "PM744577",
      "acteurRef": "PA703519",
      "typeOrgane": "CMP",
      "dateDebut": "2017-11-30T01:00:00.000+01:00",
      "datePublication": "2017-12-01T01:00:00.000+01:00",
      "dateFin": "2018-02-15T01:00:00.000+01:00",
      "preseance": "20",
      "nominPrincipale": "1",
      "infosQualite": {
        "codeQualite": "Titulaire",
        "libQualite": "Membre titulaire",
        "libQualiteSex": "Membre titulaire"
      },
      "organesRefs": [
        "PO739847"
      ]
    }
  ]
}