{
  "uid": "PA2265",
  "etatCivil": {
    "ident": {
      "civ": "M.",
      "prenom": "Philippe",
      "nom": "Nauche",
      "alpha": "Nauche"
    },
    "infoNaissance": {
      "dateNais": "1957-07-15T01:00:00.000+01:00",
      "villeNais": "Brive",
      "depNais": "Corrèze",
      "paysNais": "France"
    }
  },
  "mandats": [
    {
      "xsiType": "MandatParlementaire_type",
      "uid": "PM645445",
      "acteurRef": "PA2265",
      "legislature": "14",
      "typeOrgane": "ASSEMBLEE",
      "dateDebut": "2012-06-20T02:00:00.000+02:00",
      "dateFin": "2017-06-20T02:00:00.000+02:00",
      "preseance": "50",
      "nominPrincipale": "1",
      "infosQualite": {
        "codeQualite": "membre",
        "libQualite": "membre",
        "libQualiteSex": "membre"
      },
      "organesRefs": [
        "PO644420"
      ],
      "suppleant": {
        "dateDebut": "2012-06-20T02:00:00.000+02:00",
        "dateFin": "2017-06-20T02:00:00.000+02:00",
        "suppleantRef": "PA341112"
      },
      "election": {
        "lieu": {
          "region": "Nouvelle-Aquitaine",
          "regionType": "Métropolitain",
          "departement": "Corrèze",
          "numDepartement": "19",
          "numCirco": "2"
        },
        "causeMandat": "élections générales",
        "refCirconscription": "PO644501"
      },
      "mandature": {
        "datePriseFonction": "2012-06-20T02:00:00.000+02:00",
        "causeFin": "Fin de législature",
        "premiereElection": "1"
      }
    },
    {
      "xsiType": "MandatSimple_Type",
      "uid": "PM656235",
      "acteurRef": "PA2265",
      "legislature": "14",
      "typeOrgane": "GP",
      "dateDebut": "2012-06-26T02:00:00.000+02:00",
      "datePublication": "2012-06-27T02:00:00.000+02:00",
      "dateFin": "2016-05-24T02:00:00.000+02:00",
      "preseance": "20",
      "nominPrincipale": "1",
      "infosQualite": {
        "codeQualite": "Membre",
        "libQualite": "Membre du",
        "libQualiteSex": "Membre du"
      },
      "organesRefs": [
        "PO656002"
      ]
    },
    {
      "xsiType": "MandatSimple_Type",
      "uid": "PM657344",
      "acteurRef": "PA2265",
      "legislature": "14",
      "typeOrgane": "COMPER",
      "dateDebut": "2012-06-28T02:00:00.000+02:00",
      "datePublication": "2012-06-28T02:00:00.000+02:00",
      "dateFin": "2017-06-20T02:00:00.000+02:00",
      "preseance": "32",
      "nominPrincipale": "0",
      "infosQualite": {
        "codeQualite": "Membre",
        "libQualite": "Membre",
        "libQualiteSex": "Membre"
      },
      "organesRefs": [
        "PO59046"
      ]
    },
    {
      "xsiType": "MandatSimple_Type",
      "uid": "PM658973",
      "acteurRef": "PA2265",
      "legislature": "14",
      "typeOrgane": "COMPER",
      "dateDebut": "2012-06-28T02:00:00.000+02:00",
      "datePublication": "2012-06-29T02:00:00.000+02:00",
      "dateFin": "2017-06-20T02:00:00.000+02:00",
      "preseance": "8",
      "nominPrincipale": "1",
      "infosQualite": {
        "codeQualite": "Vice-Président",
        "libQualite": "Vice-président",
        "libQualiteSex": "Vice-président"
      },
      "organesRefs": [
        "PO59046"
      ]
    },
    {
      "xsiType": "MandatAvecSuppleant_Type",
      "uid": "PM671010",
      "acteurRef": "PA2265",
      "legislature": "14",
      "typeOrgane": "OFFPAR",
      "dateDebut": "2012-07-11T02:00:00.000+02:00",
      "datePublication": "2012-07-11T02:00:00.000+02:00",
      "dateFin": "2017-06-20T02:00:00.000+02:00",
      "preseance": "24",
      "nominPrincipale": "1",
      "infosQualite": {
        "codeQualite": "Membre",
        "libQualite": "Membre",
        "libQualiteSex": "Membre"
      },
      "organesRefs": [
        "PO273589"
      ]
    },
    {
      "xsiType": "MandatAvecSuppleant_Type",
      "uid": "PM677504",
      "acteurRef": "PA2265",
      "legislature": "14",
      "typeOrgane": "OFFPAR",
      "dateDebut": "2012-07-27T02:00:00.000+02:00",
      "dateFin": "2017-06-20T02:00:00.000+02:00",
      "preseance": "24",
      "nominPrincipale": "1",
      "infosQualite": {
        "codeQualite": "Membre",
        "libQualite": "Membre",
        "libQualiteSex": "Membre"
      },
      "organesRefs": [
        "PO402232"
      ]
    },
    {
      "xsiType": "MandatSimple_Type",
      "uid": "PM678532",
      "acteurRef": "PA2265",
      "legislature": "14",
      "typeOrgane": "GA",
      "dateDebut": "2012-09-26T02:00:00.000+02:00",
      "dateFin": "2017-06-20T02:00:00.000+02:00",
      "preseance": "20",
      "nominPrincipale": "0",
      "infosQualite": {
        "codeQualite": "Membre",
        "libQualite": "Membre",
        "libQualiteSex": "Membre"
      },
      "organesRefs": [
        "PO675695"
      ]
    },
    {
      "xsiType": "MandatSimple_Type",
      "uid": "PM678533",
      "acteurRef": "PA2265",
      "legislature": "14",
      "typeOrgane": "GA",
      "dateDebut": "2012-09-26T02:00:00.000+02:00",
      "dateFin": "2017-06-20T02:00:00.000+02:00",
      "preseance": "1",
      "nominPrincipale": "1",
      "infosQualite": {
        "codeQualite": "Président",
        "libQualite": "Président",
        "libQualiteSex": "Président"
      },
      "organesRefs": [
        "PO675695"
      ]
    },
    {
      "xsiType": "MandatSimple_Type",
      "uid": "PM685954",
      "acteurRef": "PA2265",
      "typeOrgane": "PARPOL",
      "dateDebut": "2012-12-01T01:00:00.000+01:00",
      "dateFin": "2017-06-20T02:00:00.000+02:00",
      "preseance": "5",
      "nominPrincipale": "1",
      "infosQualite": {
        "codeQualite": "Membre",
        "libQualite": "Membre",
        "libQualiteSex": "Membre"
      },
      "organesRefs": [
        "PO684932"
      ]
    },
    {
      "xsiType": "MandatSimple_Type",
      "uid": "PM686352",
      "acteurRef": "PA2265",
      "legislature": "14",
      "typeOrgane": "GE",
      "dateDebut": "2012-12-12T01:00:00.000+01:00",
      "dateFin": "2015-10-01T02:00:00.000+02:00",
      "preseance": "1",
      "nominPrincipale": "1",
      "infosQualite": {
        "codeQualite": "Président",
        "libQualite": "Président",
        "libQualiteSex": "Président"
      },
      "organesRefs": [
        "PO686346"
      ]
    },
    {
      "xsiType": "MandatSimple_Type",
      "uid": "PM686353",
      "acteurRef": "PA2265",
      "legislature": "14",
      "typeOrgane": "GE",
      "dateDebut": "2012-12-12T01:00:00.000+01:00",
      "dateFin": "2017-06-20T02:00:00.000+02:00",
      "preseance": "20",
      "nominPrincipale": "1",
      "infosQualite": {
        "codeQualite": "Membre",
        "libQualite": "Membre",
        "libQualiteSex": "Membre"
      },
      "organesRefs": [
        "PO686346"
      ]
    },
    {
      "xsiType": "MandatSimple_Type",
      "uid": "PM690330",
      "acteurRef": "PA2265",
      "legislature": "14",
      "typeOrgane": "GE",
      "dateDebut": "2013-02-05T01:00:00.000+01:00",
      "dateFin": "2017-06-20T02:00:00.000+02:00",
      "preseance": "20",
      "nominPrincipale": "1",
      "infosQualite": {
        "codeQualite": "Membre",
        "libQualite": "Membre",
        "libQualiteSex": "Membre"
      },
      "organesRefs": [
        "PO686541"
      ]
    },
    {
      "xsiType": "MandatSimple_Type",
      "uid": "PM692829",
      "acteurRef": "PA2265",
      "legislature": "14",
      "typeOrgane": "GE",
      "dateDebut": "2013-03-19T01:00:00.000+01:00",
      "dateFin": "2017-06-20T02:00:00.000+02:00",
      "preseance": "20",
      "nominPrincipale": "1",
      "infosQualite": {
        "codeQualite": "Membre",
        "libQualite": "Membre",
        "libQualiteSex": "Membre"
      },
      "organesRefs": [
        "PO686835"
      ]
    },
    {
      "xsiType": "MandatAvecSuppleant_Type",
      "uid": "PM700313",
      "acteurRef": "PA2265",
      "legislature": "14",
      "typeOrgane": "OFFPAR",
      "dateDebut": "2012-07-27T02:00:00.000+02:00",
      "datePublication": "2012-07-28T02:00:00.000+02:00",
      "dateFin": "2015-01-15T01:00:00.000+01:00",
      "preseance": "12",
      "nominPrincipale": "1",
      "infosQualite": {
        "codeQualite": "Membre nommé par le Président de l'Assemblée nationale",
        "libQualite": "Membre nommé par le Président de l'Assemblée nationale",
        "libQualiteSex": "Membre nommé par le Président de l'Assemblée nationale"
      },
      "organesRefs": [
        "PO402232"
      ]
    },
    {
      "xsiType": "MandatSimple_Type",
      "uid": "PM702769",
      "acteurRef": "PA2265",
      "legislature": "14",
      "typeOrgane": "GE",
      "dateDebut": "2014-07-23T02:00:00.000+02:00",
      "dateFin": "2017-06-20T02:00:00.000+02:00",
      "preseance": "20",
      "nominPrincipale": "1",
      "infosQualite": {
        "codeQualite": "Membre",
        "libQualite": "Membre",
        "libQualiteSex": "Membre"
      },
      "organesRefs": [
        "PO702209"
      ]
    },
    {
      "xsiType": "MandatAvecSuppleant_Type",
      "uid": "PM705833",
      "acteurRef": "PA2265",
      "legislature": "14",
      "typeOrgane": "OFFPAR",
      "dateDebut": "2015-01-15T01:00:00.000+01:00",
      "datePublication": "2015-01-16T01:00:00.000+01:00",
      "dateFin": "2017-06-20T02:00:00.000+02:00",
      "preseance": "12",
      "nominPrincipale": "1",
      "infosQualite": {
        "codeQualite": "Membre nommé par le Président de l'Assemblée nationale",
        "libQualite": "Membre nommé par le Président de l'Assemblée nationale",
        "libQualiteSex": "Membre nommé par le Président de l'Assemblée nationale"
      },
      "organesRefs": [
        "PO402232"
      ]
    },
    {
      "xsiType": "MandatSimple_Type",
      "uid": "PM708558",
      "acteurRef": "PA2265",
      "legislature": "14",
      "typeOrgane": "CMP",
      "dateDebut": "2015-06-12T02:00:00.000+02:00",
      "datePublication": "2015-06-13T02:00:00.000+02:00",
      "dateFin": "2015-06-17T02:00:00.000+02:00",
      "preseance": "20",
      "nominPrincipale": "1",
      "infosQualite": {
        "codeQualite": "Titulaire",
        "libQualite": "Membre titulaire",
        "libQualiteSex": "Membre titulaire"
      },
      "organesRefs": [
        "PO708438"
      ]
    },
    {
      "xsiType": "MandatMission_Type",
      "uid": "PM708625",
      "acteurRef": "PA2265",
      "legislature": "14",
      "typeOrgane": "MISINFO",
      "dateDebut": "2014-12-17T01:00:00.000+01:00",
      "dateFin": "2015-12-09T01:00:00.000+01:00",
      "preseance": "10",
      "nominPrincipale": "1",
      "infosQualite": {
        "codeQualite": "Membre",
        "libQualite": "Membre",
        "libQualiteSex": "Membre"
      },
      "organesRefs": [
        "PO708590"
      ]
    },
    {
      "xsiType": "MandatMission_Type",
      "uid": "PM708630",
      "acteurRef": "PA2265",
      "legislature": "14",
      "typeOrgane": "MISINFO",
      "dateDebut": "2014-12-17T01:00:00.000+01:00",
      "dateFin": "2015-12-16T01:00:00.000+01:00",
      "preseance": "10",
      "nominPrincipale": "1",
      "infosQualite": {
        "codeQualite": "Membre",
        "libQualite": "Membre",
        "libQualiteSex": "Membre"
      },
      "organesRefs": [
        "PO708600"
      ]
    },
    {
      "xsiType": "MandatMission_Type",
      "uid": "PM712917",
      "acteurRef": "PA2265",
      "legislature": "14",
      "typeOrgane": "MISINFO",
      "dateDebut": "2016-05-10T02:00:00.000+02:00",
      "dateFin": "2017-02-22T01:00:00.000+01:00",
      "preseance": "10",
      "nominPrincipale": "1",
      "infosQualite": {
        "codeQualite": "Membre",
        "libQualite": "Membre",
        "libQualiteSex": "Membre"
      },
      "organesRefs": [
        "PO711936"
      ]
    },
    {
      "xsiType": "MandatSimple_Type",
      "uid": "PM713295",
      "acteurRef": "PA2265",
      "legislature": "14",
      "typeOrgane": "GP",
      "dateDebut": "2016-05-25T02:00:00.000+02:00",
      "dateFin": "2017-06-20T02:00:00.000+02:00",
      "preseance": "20",
      "nominPrincipale": "1",
      "infosQualite": {
        "codeQualite": "Membre",
        "libQualite": "Membre du",
        "libQualiteSex": "Membre du"
      },
      "organesRefs": [
        "PO713077"
      ]
    }
  ]
}