{
  "uid": "PA415461",
  "etatCivil": {
    "ident": {
      "civ": "Mme",
      "prenom": "Isabelle",
      "nom": "Pasquet",
      "alpha": "PASQUET"
    },
    "infoNaissance": {
      "dateNais": "1962-03-08T01:00:00.000+01:00"
    }
  },
  "mandats": [
    {
      "xsiType": "MandatParlementaire_type",
      "uid": "PM415551",
      "acteurRef": "PA415461",
      "typeOrgane": "SENAT",
      "dateDebut": "2008-10-01T02:00:00.000+02:00",
      "dateFin": "2014-09-30T02:00:00.000+02:00",
      "preseance": "20",
      "nominPrincipale": "1",
      "infosQualite": {
        "codeQualite": "Sénateur",
        "libQualite": "SENATEUR",
        "libQualiteSex": "Sénateur 5ème République"
      },
      "organesRefs": [
        "PO78718"
      ],
      "election": {
        "lieu": {
          "numDepartement": "13"
        }
      },
      "mandature": {}
    },
    {
      "xsiType": "MandatSimple_Type",
      "uid": "PM415786",
      "acteurRef": "PA415461",
      "typeOrgane": "GROUPESENAT",
      "dateDebut": "2008-10-01T02:00:00.000+02:00",
      "dateFin": "2014-09-30T02:00:00.000+02:00",
      "preseance": "4",
      "nominPrincipale": "1",
      "infosQualite": {
        "codeQualite": "Membre",
        "libQualite": "Membre",
        "libQualiteSex": "Membre du"
      },
      "organesRefs": [
        "PO77707"
      ]
    },
    {
      "xsiType": "MandatSimple_Type",
      "uid": "PM415900",
      "acteurRef": "PA415461",
      "typeOrgane": "COMSENAT",
      "dateDebut": "2008-10-07T02:00:00.000+02:00",
      "dateFin": "2014-09-30T02:00:00.000+02:00",
      "preseance": "10",
      "nominPrincipale": "1",
      "infosQualite": {
        "codeQualite": "Membre",
        "libQualite": "Membre",
        "libQualiteSex": "Membre"
      },
      "organesRefs": [
        "PO211493"
      ]
    },
    {
      "xsiType": "MandatSimple_Type",
      "uid": "PM684586",
      "acteurRef": "PA415461",
      "typeOrgane": "CMP",
      "dateDebut": "2012-11-19T01:00:00.000+01:00",
      "datePublication": "2012-11-20T01:00:00.000+01:00",
      "dateFin": "2012-11-21T01:00:00.000+01:00",
      "preseance": "28",
      "nominPrincipale": "1",
      "infosQualite": {
        "codeQualite": "Suppléant",
        "libQualite": "Membre suppléant",
        "libQualiteSex": "Membre suppléante"
      },
      "organesRefs": [
        "PO684568"
      ]
    }
  ]
}