{
  "xsiType": "OrganeParlementaire_Type",
  "uid": "PO706057",
  "codeType": "CMP",
  "libelle": "Commission mixte paritaire chargée de proposer un  texte sur les dispositions restant en discussion de la proposition de loi visant à faciliter l'exercice, par les élus locaux, de leur mandat",
  "libelleEdition": "de la proposition de loi visant à faciliter l'exercice, par les élus locaux, de leur mandat",
  "libelleAbrege": "Exercice de leur mandat par les élus locaux",
  "libelleAbrev": "120-12-13",
  "viMoDe": {
    "dateDebut": "2015-01-28T01:00:00.000+01:00",
    "dateFin": "2015-03-19T01:00:00.000+01:00"
  },
  "regime": "5ème République",
  "legislature": "14",
  "secretariat": {}
}