{
  "uid": "PA415469",
  "etatCivil": {
    "ident": {
      "civ": "M.",
      "prenom": "René",
      "nom": "Vestri",
      "alpha": "VESTRI RENÉ"
    },
    "infoNaissance": {
      "dateNais": "1938-10-25T00:00:00.000+00:00"
    },
    "dateDeces": "2013-02-06T01:00:00.000+01:00"
  },
  "mandats": [
    {
      "xsiType": "MandatParlementaire_type",
      "uid": "PM415560",
      "acteurRef": "PA415469",
      "typeOrgane": "SENAT",
      "dateDebut": "2008-10-01T02:00:00.000+02:00",
      "dateFin": "2013-02-06T01:00:00.000+01:00",
      "preseance": "20",
      "nominPrincipale": "1",
      "infosQualite": {
        "codeQualite": "Sénateur",
        "libQualite": "SENATEUR",
        "libQualiteSex": "SENATEUR"
      },
      "organesRefs": [
        "PO78718"
      ],
      "election": {
        "lieu": {
          "numDepartement": "06"
        }
      },
      "mandature": {}
    },
    {
      "xsiType": "MandatSimple_Type",
      "uid": "PM415802",
      "acteurRef": "PA415469",
      "typeOrgane": "GROUPESENAT",
      "dateDebut": "2008-10-01T02:00:00.000+02:00",
      "dateFin": "2013-02-06T01:00:00.000+01:00",
      "preseance": "4",
      "nominPrincipale": "1",
      "infosQualite": {
        "codeQualite": "Membre",
        "libQualite": "Membre",
        "libQualiteSex": "Membre"
      },
      "organesRefs": [
        "PO286005"
      ]
    },
    {
      "xsiType": "MandatSimple_Type",
      "uid": "PM421656",
      "acteurRef": "PA415469",
      "typeOrgane": "DELEGSENAT",
      "dateDebut": "2009-09-23T02:00:00.000+02:00",
      "dateFin": "2013-02-06T01:00:00.000+01:00",
      "preseance": "4",
      "nominPrincipale": "1",
      "infosQualite": {
        "codeQualite": "Membre",
        "libQualite": "Membre",
        "libQualiteSex": "Membre"
      },
      "organesRefs": [
        "PO420387"
      ]
    },
    {
      "xsiType": "MandatSimple_Type",
      "uid": "PM437054",
      "acteurRef": "PA415469",
      "typeOrgane": "DELEGSENAT",
      "dateDebut": "2011-11-30T01:00:00.000+01:00",
      "dateFin": "2013-02-06T01:00:00.000+01:00",
      "preseance": "4",
      "nominPrincipale": "1",
      "infosQualite": {
        "codeQualite": "Membre",
        "libQualite": "Membre",
        "libQualiteSex": "Membre"
      },
      "organesRefs": [
        "PO420388"
      ]
    },
    {
      "xsiType": "MandatSimple_Type",
      "uid": "PM516842",
      "acteurRef": "PA415469",
      "typeOrgane": "COMSENAT",
      "dateDebut": "2012-02-21T01:00:00.000+01:00",
      "dateFin": "2013-02-06T01:00:00.000+01:00",
      "preseance": "10",
      "nominPrincipale": "1",
      "infosQualite": {
        "codeQualite": "Membre",
        "libQualite": "Membre",
        "libQualiteSex": "Membre"
      },
      "organesRefs": [
        "PO516754"
      ]
    }
  ]
}