{
  "uid": "PA332206",
  "etatCivil": {
    "ident": {
      "civ": "M.",
      "prenom": "Jean-René",
      "nom": "Marsac",
      "alpha": "Marsac"
    },
    "infoNaissance": {
      "dateNais": "1954-04-21T01:00:00.000+01:00",
      "villeNais": "Béganne",
      "depNais": "Morbihan",
      "paysNais": "France"
    }
  },
  "mandats": [
    {
      "xsiType": "MandatParlementaire_type",
      "uid": "PM645538",
      "acteurRef": "PA332206",
      "legislature": "14",
      "typeOrgane": "ASSEMBLEE",
      "dateDebut": "2012-06-20T02:00:00.000+02:00",
      "dateFin": "2017-06-20T02:00:00.000+02:00",
      "preseance": "50",
      "nominPrincipale": "1",
      "infosQualite": {
        "codeQualite": "membre",
        "libQualite": "membre",
        "libQualiteSex": "membre"
      },
      "organesRefs": [
        "PO644420"
      ],
      "suppleant": {
        "dateDebut": "2012-06-20T02:00:00.000+02:00",
        "dateFin": "2017-06-20T02:00:00.000+02:00",
        "suppleantRef": "PA342206"
      },
      "election": {
        "lieu": {
          "region": "Bretagne",
          "regionType": "Métropolitain",
          "departement": "Ille-et-Vilaine",
          "numDepartement": "35",
          "numCirco": "4"
        },
        "causeMandat": "élections générales",
        "refCirconscription": "PO644585"
      },
      "mandature": {
        "datePriseFonction": "2012-06-20T02:00:00.000+02:00",
        "causeFin": "Fin de législature",
        "premiereElection": "1"
      }
    },
    {
      "xsiType": "MandatSimple_Type",
      "uid": "PM656224",
      "acteurRef": "PA332206",
      "legislature": "14",
      "typeOrgane": "GP",
      "dateDebut": "2012-06-26T02:00:00.000+02:00",
      "datePublication": "2012-06-27T02:00:00.000+02:00",
      "dateFin": "2016-05-24T02:00:00.000+02:00",
      "preseance": "20",
      "nominPrincipale": "1",
      "infosQualite": {
        "codeQualite": "Membre",
        "libQualite": "Membre du",
        "libQualiteSex": "Membre du"
      },
      "organesRefs": [
        "PO656002"
      ]
    },
    {
      "xsiType": "MandatSimple_Type",
      "uid": "PM657537",
      "acteurRef": "PA332206",
      "legislature": "14",
      "typeOrgane": "COMPER",
      "dateDebut": "2012-06-28T02:00:00.000+02:00",
      "datePublication": "2012-06-28T02:00:00.000+02:00",
      "dateFin": "2017-06-20T02:00:00.000+02:00",
      "preseance": "32",
      "nominPrincipale": "1",
      "infosQualite": {
        "codeQualite": "Membre",
        "libQualite": "Membre",
        "libQualiteSex": "Membre"
      },
      "organesRefs": [
        "PO59047"
      ]
    },
    {
      "xsiType": "MandatSimple_Type",
      "uid": "PM677973",
      "acteurRef": "PA332206",
      "legislature": "14",
      "typeOrgane": "ORGAINT",
      "dateDebut": "2012-07-31T02:00:00.000+02:00",
      "dateFin": "2017-06-20T02:00:00.000+02:00",
      "preseance": "42",
      "nominPrincipale": "1",
      "infosQualite": {
        "codeQualite": "Membre",
        "libQualite": "Membre",
        "libQualiteSex": "Membre"
      },
      "organesRefs": [
        "PO206064"
      ]
    },
    {
      "xsiType": "MandatMission_Type",
      "uid": "PM678204",
      "acteurRef": "PA332206",
      "legislature": "14",
      "typeOrgane": "MISINFOPRE",
      "dateDebut": "2012-09-20T02:00:00.000+02:00",
      "datePublication": "2012-09-21T02:00:00.000+02:00",
      "dateFin": "2013-03-27T01:00:00.000+01:00",
      "preseance": "20",
      "nominPrincipale": "1",
      "infosQualite": {
        "codeQualite": "Membre",
        "libQualite": "Membre",
        "libQualiteSex": "Membre"
      },
      "organesRefs": [
        "PO677887"
      ]
    },
    {
      "xsiType": "MandatSimple_Type",
      "uid": "PM678638",
      "acteurRef": "PA332206",
      "legislature": "14",
      "typeOrgane": "GA",
      "dateDebut": "2012-09-26T02:00:00.000+02:00",
      "dateFin": "2017-06-20T02:00:00.000+02:00",
      "preseance": "20",
      "nominPrincipale": "0",
      "infosQualite": {
        "codeQualite": "Membre",
        "libQualite": "Membre",
        "libQualiteSex": "Membre"
      },
      "organesRefs": [
        "PO675826"
      ]
    },
    {
      "xsiType": "MandatSimple_Type",
      "uid": "PM678639",
      "acteurRef": "PA332206",
      "legislature": "14",
      "typeOrgane": "GA",
      "dateDebut": "2012-09-26T02:00:00.000+02:00",
      "dateFin": "2017-06-20T02:00:00.000+02:00",
      "preseance": "1",
      "nominPrincipale": "1",
      "infosQualite": {
        "codeQualite": "Président",
        "libQualite": "Président",
        "libQualiteSex": "Président"
      },
      "organesRefs": [
        "PO675826"
      ]
    },
    {
      "xsiType": "MandatSimple_Type",
      "uid": "PM680221",
      "acteurRef": "PA332206",
      "legislature": "14",
      "typeOrgane": "ORGAINT",
      "dateDebut": "2012-10-12T02:00:00.000+02:00",
      "dateFin": "2017-06-20T02:00:00.000+02:00",
      "preseance": "42",
      "nominPrincipale": "1",
      "infosQualite": {
        "codeQualite": "Membre",
        "libQualite": "Membre",
        "libQualiteSex": "Membre"
      },
      "organesRefs": [
        "PO201115"
      ]
    },
    {
      "xsiType": "MandatSimple_Type",
      "uid": "PM681285",
      "acteurRef": "PA332206",
      "legislature": "14",
      "typeOrgane": "GA",
      "dateDebut": "2012-10-15T02:00:00.000+02:00",
      "dateFin": "2017-06-20T02:00:00.000+02:00",
      "preseance": "20",
      "nominPrincipale": "1",
      "infosQualite": {
        "codeQualite": "Membre",
        "libQualite": "Membre",
        "libQualiteSex": "Membre"
      },
      "organesRefs": [
        "PO675775"
      ]
    },
    {
      "xsiType": "MandatSimple_Type",
      "uid": "PM681286",
      "acteurRef": "PA332206",
      "legislature": "14",
      "typeOrgane": "GA",
      "dateDebut": "2012-10-15T02:00:00.000+02:00",
      "dateFin": "2017-06-20T02:00:00.000+02:00",
      "preseance": "20",
      "nominPrincipale": "1",
      "infosQualite": {
        "codeQualite": "Membre",
        "libQualite": "Membre",
        "libQualiteSex": "Membre"
      },
      "organesRefs": [
        "PO675762"
      ]
    },
    {
      "xsiType": "MandatSimple_Type",
      "uid": "PM681287",
      "acteurRef": "PA332206",
      "legislature": "14",
      "typeOrgane": "GA",
      "dateDebut": "2012-10-15T02:00:00.000+02:00",
      "dateFin": "2017-06-20T02:00:00.000+02:00",
      "preseance": "20",
      "nominPrincipale": "1",
      "infosQualite": {
        "codeQualite": "Membre",
        "libQualite": "Membre",
        "libQualiteSex": "Membre"
      },
      "organesRefs": [
        "PO675770"
      ]
    },
    {
      "xsiType": "MandatSimple_Type",
      "uid": "PM681288",
      "acteurRef": "PA332206",
      "legislature": "14",
      "typeOrgane": "GA",
      "dateDebut": "2012-10-15T02:00:00.000+02:00",
      "dateFin": "2017-06-20T02:00:00.000+02:00",
      "preseance": "20",
      "nominPrincipale": "1",
      "infosQualite": {
        "codeQualite": "Membre",
        "libQualite": "Membre",
        "libQualiteSex": "Membre"
      },
      "organesRefs": [
        "PO675781"
      ]
    },
    {
      "xsiType": "MandatSimple_Type",
      "uid": "PM681289",
      "acteurRef": "PA332206",
      "legislature": "14",
      "typeOrgane": "GA",
      "dateDebut": "2012-10-15T02:00:00.000+02:00",
      "dateFin": "2017-06-20T02:00:00.000+02:00",
      "preseance": "20",
      "nominPrincipale": "1",
      "infosQualite": {
        "codeQualite": "Membre",
        "libQualite": "Membre",
        "libQualiteSex": "Membre"
      },
      "organesRefs": [
        "PO675716"
      ]
    },
    {
      "xsiType": "MandatSimple_Type",
      "uid": "PM684804",
      "acteurRef": "PA332206",
      "legislature": "14",
      "typeOrgane": "GA",
      "dateDebut": "2012-11-20T01:00:00.000+01:00",
      "dateFin": "2017-06-20T02:00:00.000+02:00",
      "preseance": "8",
      "nominPrincipale": "1",
      "infosQualite": {
        "codeQualite": "Vice-Président",
        "libQualite": "Vice-Président",
        "libQualiteSex": "Vice-Président"
      },
      "organesRefs": [
        "PO675775"
      ]
    },
    {
      "xsiType": "MandatSimple_Type",
      "uid": "PM685944",
      "acteurRef": "PA332206",
      "typeOrgane": "PARPOL",
      "dateDebut": "2012-12-01T01:00:00.000+01:00",
      "dateFin": "2017-06-20T02:00:00.000+02:00",
      "preseance": "5",
      "nominPrincipale": "1",
      "infosQualite": {
        "codeQualite": "Membre",
        "libQualite": "Membre",
        "libQualiteSex": "Membre"
      },
      "organesRefs": [
        "PO684932"
      ]
    },
    {
      "xsiType": "MandatSimple_Type",
      "uid": "PM686585",
      "acteurRef": "PA332206",
      "legislature": "14",
      "typeOrgane": "GE",
      "dateDebut": "2012-12-12T01:00:00.000+01:00",
      "dateFin": "2017-06-20T02:00:00.000+02:00",
      "preseance": "20",
      "nominPrincipale": "0",
      "infosQualite": {
        "codeQualite": "Membre",
        "libQualite": "Membre",
        "libQualiteSex": "Membre"
      },
      "organesRefs": [
        "PO686577"
      ]
    },
    {
      "xsiType": "MandatSimple_Type",
      "uid": "PM686587",
      "acteurRef": "PA332206",
      "legislature": "14",
      "typeOrgane": "GE",
      "dateDebut": "2012-12-12T01:00:00.000+01:00",
      "dateFin": "2017-06-20T02:00:00.000+02:00",
      "preseance": "4",
      "nominPrincipale": "1",
      "infosQualite": {
        "codeQualite": "Co-Président",
        "libQualite": "Co-Président",
        "libQualiteSex": "Co-Président"
      },
      "organesRefs": [
        "PO686577"
      ]
    },
    {
      "xsiType": "MandatSimple_Type",
      "uid": "PM688383",
      "acteurRef": "PA332206",
      "legislature": "14",
      "typeOrgane": "GE",
      "dateDebut": "2013-01-16T01:00:00.000+01:00",
      "dateFin": "2017-06-20T02:00:00.000+02:00",
      "preseance": "20",
      "nominPrincipale": "1",
      "infosQualite": {
        "codeQualite": "Membre",
        "libQualite": "Membre",
        "libQualiteSex": "Membre"
      },
      "organesRefs": [
        "PO686204"
      ]
    },
    {
      "xsiType": "MandatSimple_Type",
      "uid": "PM689765",
      "acteurRef": "PA332206",
      "legislature": "14",
      "typeOrgane": "GE",
      "dateDebut": "2013-01-31T01:00:00.000+01:00",
      "dateFin": "2017-06-20T02:00:00.000+02:00",
      "preseance": "20",
      "nominPrincipale": "1",
      "infosQualite": {
        "codeQualite": "Membre",
        "libQualite": "Membre",
        "libQualiteSex": "Membre"
      },
      "organesRefs": [
        "PO686362"
      ]
    },
    {
      "xsiType": "MandatSimple_Type",
      "uid": "PM690343",
      "acteurRef": "PA332206",
      "legislature": "14",
      "typeOrgane": "GA",
      "dateDebut": "2013-02-05T01:00:00.000+01:00",
      "dateFin": "2017-06-20T02:00:00.000+02:00",
      "preseance": "20",
      "nominPrincipale": "1",
      "infosQualite": {
        "codeQualite": "Membre",
        "libQualite": "Membre",
        "libQualiteSex": "Membre"
      },
      "organesRefs": [
        "PO675729"
      ]
    },
    {
      "xsiType": "MandatSimple_Type",
      "uid": "PM690345",
      "acteurRef": "PA332206",
      "legislature": "14",
      "typeOrgane": "GA",
      "dateDebut": "2013-02-05T01:00:00.000+01:00",
      "dateFin": "2017-06-20T02:00:00.000+02:00",
      "preseance": "20",
      "nominPrincipale": "1",
      "infosQualite": {
        "codeQualite": "Membre",
        "libQualite": "Membre",
        "libQualiteSex": "Membre"
      },
      "organesRefs": [
        "PO675783"
      ]
    },
    {
      "xsiType": "MandatSimple_Type",
      "uid": "PM690350",
      "acteurRef": "PA332206",
      "legislature": "14",
      "typeOrgane": "GE",
      "dateDebut": "2013-02-05T01:00:00.000+01:00",
      "dateFin": "2017-06-20T02:00:00.000+02:00",
      "preseance": "20",
      "nominPrincipale": "1",
      "infosQualite": {
        "codeQualite": "Membre",
        "libQualite": "Membre",
        "libQualiteSex": "Membre"
      },
      "organesRefs": [
        "PO686397"
      ]
    },
    {
      "xsiType": "MandatSimple_Type",
      "uid": "PM690402",
      "acteurRef": "PA332206",
      "legislature": "14",
      "typeOrgane": "GE",
      "dateDebut": "2013-02-05T01:00:00.000+01:00",
      "dateFin": "2017-06-20T02:00:00.000+02:00",
      "preseance": "20",
      "nominPrincipale": "1",
      "infosQualite": {
        "codeQualite": "Membre",
        "libQualite": "Membre",
        "libQualiteSex": "Membre"
      },
      "organesRefs": [
        "PO686188"
      ]
    },
    {
      "xsiType": "MandatSimple_Type",
      "uid": "PM691223",
      "acteurRef": "PA332206",
      "legislature": "14",
      "typeOrgane": "GE",
      "dateDebut": "2013-01-15T01:00:00.000+01:00",
      "dateFin": "2017-06-20T02:00:00.000+02:00",
      "preseance": "20",
      "nominPrincipale": "1",
      "infosQualite": {
        "codeQualite": "Membre",
        "libQualite": "Membre",
        "libQualiteSex": "Membre"
      },
      "organesRefs": [
        "PO687381"
      ]
    },
    {
      "xsiType": "MandatSimple_Type",
      "uid": "PM691496",
      "acteurRef": "PA332206",
      "legislature": "14",
      "typeOrgane": "GE",
      "dateDebut": "2013-02-15T01:00:00.000+01:00",
      "dateFin": "2017-06-20T02:00:00.000+02:00",
      "preseance": "20",
      "nominPrincipale": "1",
      "infosQualite": {
        "codeQualite": "Membre",
        "libQualite": "Membre",
        "libQualiteSex": "Membre"
      },
      "organesRefs": [
        "PO687473"
      ]
    },
    {
      "xsiType": "MandatSimple_Type",
      "uid": "PM692417",
      "acteurRef": "PA332206",
      "legislature": "14",
      "typeOrgane": "GE",
      "dateDebut": "2013-02-26T01:00:00.000+01:00",
      "dateFin": "2017-06-20T02:00:00.000+02:00",
      "preseance": "20",
      "nominPrincipale": "1",
      "infosQualite": {
        "codeQualite": "Membre",
        "libQualite": "Membre",
        "libQualiteSex": "Membre"
      },
      "organesRefs": [
        "PO686589"
      ]
    },
    {
      "xsiType": "MandatSimple_Type",
      "uid": "PM692447",
      "acteurRef": "PA332206",
      "legislature": "14",
      "typeOrgane": "GE",
      "dateDebut": "2013-02-27T01:00:00.000+01:00",
      "dateFin": "2017-06-20T02:00:00.000+02:00",
      "preseance": "8",
      "nominPrincipale": "1",
      "infosQualite": {
        "codeQualite": "Vice-Président",
        "libQualite": "Vice-Président",
        "libQualiteSex": "Vice-Président"
      },
      "organesRefs": [
        "PO687473"
      ]
    },
    {
      "xsiType": "MandatSimple_Type",
      "uid": "PM693649",
      "acteurRef": "PA332206",
      "legislature": "14",
      "typeOrgane": "GE",
      "dateDebut": "2013-04-15T02:00:00.000+02:00",
      "dateFin": "2017-06-20T02:00:00.000+02:00",
      "preseance": "20",
      "nominPrincipale": "1",
      "infosQualite": {
        "codeQualite": "Membre",
        "libQualite": "Membre",
        "libQualiteSex": "Membre"
      },
      "organesRefs": [
        "PO692265"
      ]
    },
    {
      "xsiType": "MandatSimple_Type",
      "uid": "PM694381",
      "acteurRef": "PA332206",
      "legislature": "14",
      "typeOrgane": "CNPE",
      "dateDebut": "2013-05-14T02:00:00.000+02:00",
      "datePublication": "2013-04-15T02:00:00.000+02:00",
      "dateFin": "2013-10-08T02:00:00.000+02:00",
      "preseance": "20",
      "nominPrincipale": "1",
      "infosQualite": {
        "codeQualite": "Membre",
        "libQualite": "Membre",
        "libQualiteSex": "Membre"
      },
      "organesRefs": [
        "PO694085"
      ]
    },
    {
      "xsiType": "MandatSimple_Type",
      "uid": "PM695855",
      "acteurRef": "PA332206",
      "legislature": "14",
      "typeOrgane": "GA",
      "dateDebut": "2013-07-09T02:00:00.000+02:00",
      "dateFin": "2017-06-20T02:00:00.000+02:00",
      "preseance": "8",
      "nominPrincipale": "1",
      "infosQualite": {
        "codeQualite": "Vice-Président",
        "libQualite": "Vice-Président",
        "libQualiteSex": "Vice-Président"
      },
      "organesRefs": [
        "PO675729"
      ]
    },
    {
      "xsiType": "MandatSimple_Type",
      "uid": "PM698175",
      "acteurRef": "PA332206",
      "legislature": "14",
      "typeOrgane": "GE",
      "dateDebut": "2013-10-29T01:00:00.000+01:00",
      "dateFin": "2017-06-20T02:00:00.000+02:00",
      "preseance": "20",
      "nominPrincipale": "1",
      "infosQualite": {
        "codeQualite": "Membre",
        "libQualite": "Membre",
        "libQualiteSex": "Membre"
      },
      "organesRefs": [
        "PO695593"
      ]
    },
    {
      "xsiType": "MandatSimple_Type",
      "uid": "PM701670",
      "acteurRef": "PA332206",
      "legislature": "14",
      "typeOrgane": "CMP",
      "dateDebut": "2014-06-03T02:00:00.000+02:00",
      "datePublication": "2014-06-04T02:00:00.000+02:00",
      "dateFin": "2014-06-23T02:00:00.000+02:00",
      "preseance": "20",
      "nominPrincipale": "1",
      "infosQualite": {
        "codeQualite": "Titulaire",
        "libQualite": "Membre titulaire",
        "libQualiteSex": "Membre titulaire"
      },
      "organesRefs": [
        "PO701542"
      ]
    },
    {
      "xsiType": "MandatSimple_Type",
      "uid": "PM701747",
      "acteurRef": "PA332206",
      "legislature": "14",
      "typeOrgane": "CNPE",
      "dateDebut": "2014-06-06T02:00:00.000+02:00",
      "datePublication": "2014-06-07T02:00:00.000+02:00",
      "dateFin": "2014-11-20T01:00:00.000+01:00",
      "preseance": "20",
      "nominPrincipale": "1",
      "infosQualite": {
        "codeQualite": "Membre",
        "libQualite": "Membre",
        "libQualiteSex": "Membre"
      },
      "organesRefs": [
        "PO701630"
      ]
    },
    {
      "xsiType": "MandatSimple_Type",
      "uid": "PM702404",
      "acteurRef": "PA332206",
      "legislature": "14",
      "typeOrgane": "CMP",
      "dateDebut": "2014-07-10T02:00:00.000+02:00",
      "datePublication": "2014-07-11T02:00:00.000+02:00",
      "dateFin": "2014-07-21T02:00:00.000+02:00",
      "preseance": "28",
      "nominPrincipale": "1",
      "infosQualite": {
        "codeQualite": "Suppléant",
        "libQualite": "Membre suppléant",
        "libQualiteSex": "Membre suppléant"
      },
      "organesRefs": [
        "PO702220"
      ]
    },
    {
      "xsiType": "MandatMission_Type",
      "uid": "PM706624",
      "acteurRef": "PA332206",
      "legislature": "14",
      "typeOrgane": "MISINFO",
      "dateDebut": "2015-03-18T01:00:00.000+01:00",
      "dateFin": "2016-02-10T01:00:00.000+01:00",
      "preseance": "10",
      "nominPrincipale": "1",
      "infosQualite": {
        "codeQualite": "Membre",
        "libQualite": "Membre",
        "libQualiteSex": "Membre"
      },
      "organesRefs": [
        "PO683565"
      ]
    },
    {
      "xsiType": "MandatMission_Type",
      "uid": "PM706626",
      "acteurRef": "PA332206",
      "legislature": "14",
      "typeOrgane": "MISINFO",
      "dateDebut": "2015-03-18T01:00:00.000+01:00",
      "dateFin": "2016-02-10T01:00:00.000+01:00",
      "preseance": "15",
      "nominPrincipale": "0",
      "infosQualite": {
        "codeQualite": "Rapporteur",
        "libQualite": "Rapporteur sur \"Les financements et la maîtrise de la dépense des organismes extérieurs de langue française\"",
        "libQualiteSex": "Rapporteur sur \"Les financements et la maîtrise de la dépense des organismes extérieurs de langue française\""
      },
      "organesRefs": [
        "PO683565"
      ]
    },
    {
      "xsiType": "MandatMission_Type",
      "uid": "PM708473",
      "acteurRef": "PA332206",
      "legislature": "14",
      "typeOrgane": "MISINFO",
      "dateDebut": "2015-03-04T01:00:00.000+01:00",
      "dateFin": "2016-06-22T02:00:00.000+02:00",
      "preseance": "10",
      "nominPrincipale": "1",
      "infosQualite": {
        "codeQualite": "Membre",
        "libQualite": "Membre",
        "libQualiteSex": "Membre"
      },
      "organesRefs": [
        "PO708463"
      ]
    },
    {
      "xsiType": "MandatSimple_Type",
      "uid": "PM709160",
      "acteurRef": "PA332206",
      "legislature": "14",
      "typeOrgane": "ORGEXTPARL",
      "dateDebut": "2014-04-18T02:00:00.000+02:00",
      "datePublication": "2014-04-18T02:00:00.000+02:00",
      "dateFin": "2017-06-20T02:00:00.000+02:00",
      "preseance": "20",
      "nominPrincipale": "1",
      "infosQualite": {
        "codeQualite": "Titulaire",
        "libQualite": "Membre titulaire",
        "libQualiteSex": "Membre titulaire"
      },
      "organesRefs": [
        "PO709158"
      ]
    },
    {
      "xsiType": "MandatSimple_Type",
      "uid": "PM711302",
      "acteurRef": "PA332206",
      "legislature": "14",
      "typeOrgane": "CMP",
      "dateDebut": "2016-01-28T01:00:00.000+01:00",
      "datePublication": "2016-01-29T01:00:00.000+01:00",
      "dateFin": "2016-02-11T01:00:00.000+01:00",
      "preseance": "28",
      "nominPrincipale": "1",
      "infosQualite": {
        "codeQualite": "Suppléant",
        "libQualite": "Membre suppléant",
        "libQualiteSex": "Membre suppléant"
      },
      "organesRefs": [
        "PO711168"
      ]
    },
    {
      "xsiType": "MandatSimple_Type",
      "uid": "PM711478",
      "acteurRef": "PA332206",
      "legislature": "14",
      "typeOrgane": "CNPE",
      "dateDebut": "2016-02-05T01:00:00.000+01:00",
      "datePublication": "2016-02-06T01:00:00.000+01:00",
      "dateFin": "2016-07-13T02:00:00.000+02:00",
      "preseance": "20",
      "nominPrincipale": "1",
      "infosQualite": {
        "codeQualite": "Membre",
        "libQualite": "Membre",
        "libQualiteSex": "Membre"
      },
      "organesRefs": [
        "PO711267"
      ]
    },
    {
      "xsiType": "MandatSimple_Type",
      "uid": "PM712356",
      "acteurRef": "PA332206",
      "legislature": "14",
      "typeOrgane": "GE",
      "dateDebut": "2016-04-11T02:00:00.000+02:00",
      "dateFin": "2017-06-20T02:00:00.000+02:00",
      "preseance": "20",
      "nominPrincipale": "1",
      "infosQualite": {
        "codeQualite": "Membre",
        "libQualite": "Membre",
        "libQualiteSex": "Membre"
      },
      "organesRefs": [
        "PO712100"
      ]
    },
    {
      "xsiType": "MandatMission_Type",
      "uid": "PM712553",
      "acteurRef": "PA332206",
      "legislature": "14",
      "typeOrgane": "MISINFO",
      "dateDebut": "2016-04-27T02:00:00.000+02:00",
      "dateFin": "2017-02-21T01:00:00.000+01:00",
      "preseance": "10",
      "nominPrincipale": "0",
      "infosQualite": {
        "codeQualite": "Membre",
        "libQualite": "Membre",
        "libQualiteSex": "Membre"
      },
      "organesRefs": [
        "PO712526"
      ]
    },
    {
      "xsiType": "MandatMission_Type",
      "uid": "PM712556",
      "acteurRef": "PA332206",
      "legislature": "14",
      "typeOrgane": "MISINFO",
      "dateDebut": "2016-04-27T02:00:00.000+02:00",
      "dateFin": "2017-02-21T01:00:00.000+01:00",
      "preseance": "9",
      "nominPrincipale": "1",
      "infosQualite": {
        "codeQualite": "Rapporteur",
        "libQualite": "Rapporteur",
        "libQualiteSex": "Rapporteur"
      },
      "organesRefs": [
        "PO712526"
      ]
    },
    {
      "xsiType": "MandatMission_Type",
      "uid": "PM712594",
      "acteurRef": "PA332206",
      "legislature": "14",
      "typeOrgane": "MISINFO",
      "dateDebut": "2016-04-27T02:00:00.000+02:00",
      "dateFin": "2017-02-22T01:00:00.000+01:00",
      "preseance": "10",
      "nominPrincipale": "1",
      "infosQualite": {
        "codeQualite": "Membre",
        "libQualite": "Membre",
        "libQualiteSex": "Membre"
      },
      "organesRefs": [
        "PO712541"
      ]
    },
    {
      "xsiType": "MandatSimple_Type",
      "uid": "PM713031",
      "acteurRef": "PA332206",
      "legislature": "14",
      "typeOrgane": "GE",
      "dateDebut": "2016-05-19T02:00:00.000+02:00",
      "dateFin": "2017-06-20T02:00:00.000+02:00",
      "preseance": "20",
      "nominPrincipale": "1",
      "infosQualite": {
        "codeQualite": "Membre",
        "libQualite": "Membre",
        "libQualiteSex": "Membre"
      },
      "organesRefs": [
        "PO711617"
      ]
    },
    {
      "xsiType": "MandatSimple_Type",
      "uid": "PM713284",
      "acteurRef": "PA332206",
      "legislature": "14",
      "typeOrgane": "GP",
      "dateDebut": "2016-05-25T02:00:00.000+02:00",
      "dateFin": "2017-06-20T02:00:00.000+02:00",
      "preseance": "20",
      "nominPrincipale": "1",
      "infosQualite": {
        "codeQualite": "Membre",
        "libQualite": "Membre du",
        "libQualiteSex": "Membre du"
      },
      "organesRefs": [
        "PO713077"
      ]
    }
  ]
}