{
  "uid": "PA642736",
  "etatCivil": {
    "ident": {
      "civ": "Mme",
      "prenom": "Marie-Thérèse",
      "nom": "Le Roy",
      "alpha": "LeRoy"
    },
    "infoNaissance": {
      "dateNais": "1953-05-07T01:00:00.000+01:00",
      "villeNais": "Saint-Thois",
      "depNais": "Finistère",
      "paysNais": "France"
    }
  },
  "mandats": [
    {
      "xsiType": "MandatParlementaire_type",
      "uid": "PM711657",
      "acteurRef": "PA642736",
      "legislature": "14",
      "typeOrgane": "ASSEMBLEE",
      "dateDebut": "2012-06-20T02:00:00.000+02:00",
      "dateFin": "2017-06-17T02:00:00.000+02:00",
      "preseance": "50",
      "nominPrincipale": "1",
      "infosQualite": {
        "codeQualite": "membre",
        "libQualite": "membre",
        "libQualiteSex": "membre"
      },
      "organesRefs": [
        "PO644420"
      ],
      "election": {
        "lieu": {
          "region": "Bretagne",
          "regionType": "Métropolitain",
          "departement": "Finistère",
          "numDepartement": "29",
          "numCirco": "1"
        },
        "causeMandat": "remplacement d'un député nommé au Gouvernement",
        "refCirconscription": "PO644541"
      },
      "mandature": {
        "datePriseFonction": "2016-02-28T01:00:00.000+01:00",
        "causeFin": "Reprise de l'exercice du mandat d'un ancien membre du Gouvernement",
        "premiereElection": "0"
      }
    },
    {
      "xsiType": "MandatSimple_Type",
      "uid": "PM711662",
      "acteurRef": "PA642736",
      "legislature": "14",
      "typeOrgane": "GP",
      "dateDebut": "2016-02-28T01:00:00.000+01:00",
      "dateFin": "2016-02-29T01:00:00.000+01:00",
      "preseance": "28",
      "nominPrincipale": "1",
      "infosQualite": {
        "codeQualite": "Député non-inscrit",
        "libQualite": "Député non-inscrit",
        "libQualiteSex": "Députée non-inscrite"
      },
      "organesRefs": [
        "PO645633"
      ]
    },
    {
      "xsiType": "MandatSimple_Type",
      "uid": "PM711683",
      "acteurRef": "PA642736",
      "legislature": "14",
      "typeOrgane": "GP",
      "dateDebut": "2016-02-29T01:00:00.000+01:00",
      "datePublication": "2016-03-01T01:00:00.000+01:00",
      "dateFin": "2016-05-24T02:00:00.000+02:00",
      "preseance": "20",
      "nominPrincipale": "1",
      "infosQualite": {
        "codeQualite": "Membre",
        "libQualite": "Membre du",
        "libQualiteSex": "Membre du"
      },
      "organesRefs": [
        "PO656002"
      ]
    },
    {
      "xsiType": "MandatSimple_Type",
      "uid": "PM711684",
      "acteurRef": "PA642736",
      "legislature": "14",
      "typeOrgane": "COMPER",
      "dateDebut": "2016-03-02T01:00:00.000+01:00",
      "datePublication": "2016-03-02T01:00:00.000+01:00",
      "dateFin": "2017-06-17T02:00:00.000+02:00",
      "preseance": "32",
      "nominPrincipale": "1",
      "infosQualite": {
        "codeQualite": "Membre",
        "libQualite": "Membre",
        "libQualiteSex": "Membre"
      },
      "organesRefs": [
        "PO420120"
      ]
    },
    {
      "xsiType": "MandatSimple_Type",
      "uid": "PM712259",
      "acteurRef": "PA642736",
      "legislature": "14",
      "typeOrgane": "GE",
      "dateDebut": "2016-04-05T02:00:00.000+02:00",
      "dateFin": "2017-06-17T02:00:00.000+02:00",
      "preseance": "20",
      "nominPrincipale": "1",
      "infosQualite": {
        "codeQualite": "Membre",
        "libQualite": "Membre",
        "libQualiteSex": "Membre"
      },
      "organesRefs": [
        "PO687381"
      ]
    },
    {
      "xsiType": "MandatSimple_Type",
      "uid": "PM713270",
      "acteurRef": "PA642736",
      "legislature": "14",
      "typeOrgane": "GP",
      "dateDebut": "2016-05-25T02:00:00.000+02:00",
      "dateFin": "2017-06-17T02:00:00.000+02:00",
      "preseance": "20",
      "nominPrincipale": "1",
      "infosQualite": {
        "codeQualite": "Membre",
        "libQualite": "Membre du",
        "libQualiteSex": "Membre du"
      },
      "organesRefs": [
        "PO713077"
      ]
    },
    {
      "xsiType": "MandatSimple_Type",
      "uid": "PM715717",
      "acteurRef": "PA642736",
      "typeOrgane": "PARPOL",
      "dateDebut": "2016-12-01T01:00:00.000+01:00",
      "dateFin": "2017-06-20T02:00:00.000+02:00",
      "preseance": "5",
      "nominPrincipale": "1",
      "infosQualite": {
        "codeQualite": "Membre",
        "libQualite": "Membre",
        "libQualiteSex": "Membre"
      },
      "organesRefs": [
        "PO684932"
      ]
    },
    {
      "xsiType": "MandatSimple_Type",
      "uid": "PM716409",
      "acteurRef": "PA642736",
      "legislature": "14",
      "typeOrgane": "CMP",
      "dateDebut": "2017-01-12T01:00:00.000+01:00",
      "datePublication": "2017-01-13T01:00:00.000+01:00",
      "dateFin": "2017-01-20T01:00:00.000+01:00",
      "preseance": "20",
      "nominPrincipale": "1",
      "infosQualite": {
        "codeQualite": "Titulaire",
        "libQualite": "Membre titulaire",
        "libQualiteSex": "Membre titulaire"
      },
      "organesRefs": [
        "PO715032"
      ]
    },
    {
      "xsiType": "MandatSimple_Type",
      "uid": "PM716437",
      "acteurRef": "PA642736",
      "legislature": "14",
      "typeOrgane": "CMP",
      "dateDebut": "2017-01-12T01:00:00.000+01:00",
      "datePublication": "2017-01-13T01:00:00.000+01:00",
      "dateFin": "2017-01-20T01:00:00.000+01:00",
      "preseance": "20",
      "nominPrincipale": "1",
      "infosQualite": {
        "codeQualite": "Titulaire",
        "libQualite": "Membre titulaire",
        "libQualiteSex": "Membre titulaire"
      },
      "organesRefs": [
        "PO715554"
      ]
    },
    {
      "xsiType": "MandatSimple_Type",
      "uid": "PM716559",
      "acteurRef": "PA642736",
      "legislature": "14",
      "typeOrgane": "CMP",
      "dateDebut": "2017-01-19T01:00:00.000+01:00",
      "datePublication": "2017-01-20T01:00:00.000+01:00",
      "dateFin": "2017-01-25T01:00:00.000+01:00",
      "preseance": "28",
      "nominPrincipale": "1",
      "infosQualite": {
        "codeQualite": "Suppléant",
        "libQualite": "Membre suppléant",
        "libQualiteSex": "Membre suppléante"
      },
      "organesRefs": [
        "PO716002"
      ]
    }
  ]
}