{
  "uid": "PA1779",
  "etatCivil": {
    "ident": {
      "civ": "M.",
      "prenom": "Georges",
      "nom": "Labazée",
      "alpha": "LABAZEE_GEORGES_11112D"
    },
    "infoNaissance": {
      "dateNais": "1943-06-16T02:00:00.000+02:00",
      "villeNais": "VIVEN"
    }
  },
  "mandats": [
    {
      "xsiType": "MandatParlementaire_type",
      "uid": "PM429970",
      "acteurRef": "PA1779",
      "typeOrgane": "SENAT",
      "dateDebut": "2011-10-01T02:00:00.000+02:00",
      "dateFin": "2017-10-01T02:00:00.000+02:00",
      "preseance": "20",
      "nominPrincipale": "1",
      "infosQualite": {
        "codeQualite": "Sénateur",
        "libQualite": "SENATEUR",
        "libQualiteSex": "SENATEUR"
      },
      "organesRefs": [
        "PO78718"
      ],
      "election": {
        "lieu": {
          "numDepartement": "64"
        }
      },
      "mandature": {}
    },
    {
      "xsiType": "MandatSimple_Type",
      "uid": "PM430274",
      "acteurRef": "PA1779",
      "typeOrgane": "COMSENAT",
      "dateDebut": "2011-10-01T02:00:00.000+02:00",
      "dateFin": "2017-10-01T02:00:00.000+02:00",
      "preseance": "10",
      "nominPrincipale": "1",
      "infosQualite": {
        "codeQualite": "Membre",
        "libQualite": "Membre",
        "libQualiteSex": "Membre"
      },
      "organesRefs": [
        "PO211493"
      ]
    },
    {
      "xsiType": "MandatSimple_Type",
      "uid": "PM430505",
      "acteurRef": "PA1779",
      "typeOrgane": "GROUPESENAT",
      "dateDebut": "2011-10-01T02:00:00.000+02:00",
      "dateFin": "2017-10-01T02:00:00.000+02:00",
      "preseance": "4",
      "nominPrincipale": "1",
      "infosQualite": {
        "codeQualite": "Membre",
        "libQualite": "Membre",
        "libQualiteSex": "Membre"
      },
      "organesRefs": [
        "PO77710"
      ]
    },
    {
      "xsiType": "MandatSimple_Type",
      "uid": "PM436988",
      "acteurRef": "PA1779",
      "typeOrgane": "DELEGSENAT",
      "dateDebut": "2011-11-30T01:00:00.000+01:00",
      "preseance": "4",
      "nominPrincipale": "1",
      "infosQualite": {
        "codeQualite": "Membre",
        "libQualite": "Membre",
        "libQualiteSex": "Membre"
      },
      "organesRefs": [
        "PO420387"
      ]
    },
    {
      "xsiType": "MandatSimple_Type",
      "uid": "PM698559",
      "acteurRef": "PA1779",
      "typeOrgane": "CMP",
      "dateDebut": "2013-11-15T01:00:00.000+01:00",
      "datePublication": "2013-11-16T01:00:00.000+01:00",
      "dateFin": "2013-11-19T01:00:00.000+01:00",
      "preseance": "28",
      "nominPrincipale": "1",
      "infosQualite": {
        "codeQualite": "Suppléant",
        "libQualite": "Membre suppléant",
        "libQualiteSex": "Membre suppléant"
      },
      "organesRefs": [
        "PO698519"
      ]
    },
    {
      "xsiType": "MandatSimple_Type",
      "uid": "PM699858",
      "acteurRef": "PA1779",
      "typeOrgane": "CMP",
      "dateDebut": "2014-02-05T01:00:00.000+01:00",
      "datePublication": "2014-02-06T01:00:00.000+01:00",
      "dateFin": "2014-02-27T01:00:00.000+01:00",
      "preseance": "20",
      "nominPrincipale": "1",
      "infosQualite": {
        "codeQualite": "Titulaire",
        "libQualite": "Membre titulaire",
        "libQualiteSex": "Membre titulaire"
      },
      "organesRefs": [
        "PO699835"
      ]
    },
    {
      "xsiType": "MandatSimple_Type",
      "uid": "PM700343",
      "acteurRef": "PA1779",
      "typeOrgane": "CMP",
      "dateDebut": "2014-02-20T01:00:00.000+01:00",
      "datePublication": "2014-02-21T01:00:00.000+01:00",
      "dateFin": "2014-02-27T01:00:00.000+01:00",
      "preseance": "28",
      "nominPrincipale": "1",
      "infosQualite": {
        "codeQualite": "Suppléant",
        "libQualite": "Membre suppléant",
        "libQualiteSex": "Membre suppléant"
      },
      "organesRefs": [
        "PO700314"
      ]
    },
    {
      "xsiType": "MandatSimple_Type",
      "uid": "PM702013",
      "acteurRef": "PA1779",
      "typeOrgane": "COMSPSENAT",
      "dateDebut": "2014-06-18T02:00:00.000+02:00",
      "dateFin": "2014-10-08T02:00:00.000+02:00",
      "nominPrincipale": "1",
      "infosQualite": {
        "libQualite": "Membre",
        "libQualiteSex": "Membre"
      },
      "organesRefs": [
        "PO701979"
      ]
    },
    {
      "xsiType": "MandatSimple_Type",
      "uid": "PM702619",
      "acteurRef": "PA1779",
      "typeOrgane": "CMP",
      "dateDebut": "2014-07-17T02:00:00.000+02:00",
      "datePublication": "2014-07-18T02:00:00.000+02:00",
      "dateFin": "2014-07-23T02:00:00.000+02:00",
      "preseance": "28",
      "nominPrincipale": "1",
      "infosQualite": {
        "codeQualite": "Suppléant",
        "libQualite": "Membre suppléant",
        "libQualiteSex": "Membre suppléant"
      },
      "organesRefs": [
        "PO702586"
      ]
    },
    {
      "xsiType": "MandatSimple_Type",
      "uid": "PM704959",
      "acteurRef": "PA1779",
      "typeOrgane": "DELEGSENAT",
      "dateDebut": "2014-11-05T01:00:00.000+01:00",
      "nominPrincipale": "1",
      "infosQualite": {
        "libQualite": "Secrétaire",
        "libQualiteSex": "Secrétaire"
      },
      "organesRefs": [
        "PO420387"
      ]
    },
    {
      "xsiType": "MandatSimple_Type",
      "uid": "PM708687",
      "acteurRef": "PA1779",
      "typeOrgane": "DELEGSENAT",
      "dateDebut": "2015-06-18T02:00:00.000+02:00",
      "nominPrincipale": "1",
      "infosQualite": {
        "libQualite": "Vice-Président",
        "libQualiteSex": "Vice-Président"
      },
      "organesRefs": [
        "PO420387"
      ]
    },
    {
      "xsiType": "MandatSimple_Type",
      "uid": "PM710360",
      "acteurRef": "PA1779",
      "typeOrgane": "CMP",
      "dateDebut": "2015-11-27T01:00:00.000+01:00",
      "datePublication": "2015-11-28T01:00:00.000+01:00",
      "dateFin": "2015-12-03T01:00:00.000+01:00",
      "preseance": "20",
      "nominPrincipale": "1",
      "infosQualite": {
        "codeQualite": "Titulaire",
        "libQualite": "Membre titulaire",
        "libQualiteSex": "Membre titulaire"
      },
      "organesRefs": [
        "PO709840"
      ]
    },
    {
      "xsiType": "MandatSimple_Type",
      "uid": "PM710391",
      "acteurRef": "PA1779",
      "typeOrgane": "CMP",
      "dateDebut": "2015-12-02T01:00:00.000+01:00",
      "datePublication": "2015-12-03T01:00:00.000+01:00",
      "dateFin": "2015-12-03T01:00:00.000+01:00",
      "preseance": "16",
      "nominPrincipale": "1",
      "infosQualite": {
        "codeQualite": "Rapporteur",
        "libQualite": "Rapporteur",
        "libQualiteSex": "Rapporteur"
      },
      "organesRefs": [
        "PO709840"
      ]
    },
    {
      "xsiType": "MandatSimple_Type",
      "uid": "PM711134",
      "acteurRef": "PA1779",
      "typeOrgane": "CMP",
      "dateDebut": "2015-12-17T01:00:00.000+01:00",
      "datePublication": "2016-01-15T01:00:00.000+01:00",
      "dateFin": "2016-02-11T01:00:00.000+01:00",
      "preseance": "20",
      "nominPrincipale": "1",
      "infosQualite": {
        "codeQualite": "Titulaire",
        "libQualite": "Membre titulaire",
        "libQualiteSex": "Membre titulaire"
      },
      "organesRefs": [
        "PO709882"
      ]
    }
  ]
}