{
  "uid": "PA608158",
  "etatCivil": {
    "ident": {
      "civ": "M.",
      "prenom": "Nicolas",
      "nom": "Bays",
      "alpha": "Bays"
    },
    "infoNaissance": {
      "dateNais": "1977-05-01T02:00:00.000+02:00",
      "villeNais": "Béthune",
      "depNais": "Pas-de-Calais",
      "paysNais": "France"
    }
  },
  "mandats": [
    {
      "xsiType": "MandatParlementaire_type",
      "uid": "PM645174",
      "acteurRef": "PA608158",
      "legislature": "14",
      "typeOrgane": "ASSEMBLEE",
      "dateDebut": "2012-06-20T02:00:00.000+02:00",
      "dateFin": "2017-06-20T02:00:00.000+02:00",
      "preseance": "50",
      "nominPrincipale": "1",
      "infosQualite": {
        "codeQualite": "membre",
        "libQualite": "membre",
        "libQualiteSex": "membre"
      },
      "organesRefs": [
        "PO644420"
      ],
      "suppleant": {
        "dateDebut": "2012-06-20T02:00:00.000+02:00",
        "dateFin": "2017-06-20T02:00:00.000+02:00",
        "suppleantRef": "PA642898"
      },
      "election": {
        "lieu": {
          "region": "Hauts-de-France",
          "regionType": "Métropolitain",
          "departement": "Pas-de-Calais",
          "numDepartement": "62",
          "numCirco": "12"
        },
        "causeMandat": "élections générales",
        "refCirconscription": "PO644742"
      },
      "mandature": {
        "datePriseFonction": "2012-06-20T02:00:00.000+02:00",
        "causeFin": "Fin de législature",
        "premiereElection": "0"
      }
    },
    {
      "xsiType": "MandatSimple_Type",
      "uid": "PM656047",
      "acteurRef": "PA608158",
      "legislature": "14",
      "typeOrgane": "GP",
      "dateDebut": "2012-06-26T02:00:00.000+02:00",
      "datePublication": "2012-06-27T02:00:00.000+02:00",
      "dateFin": "2016-05-24T02:00:00.000+02:00",
      "preseance": "20",
      "nominPrincipale": "1",
      "infosQualite": {
        "codeQualite": "Membre",
        "libQualite": "Membre du",
        "libQualiteSex": "Membre du"
      },
      "organesRefs": [
        "PO656002"
      ]
    },
    {
      "xsiType": "MandatSimple_Type",
      "uid": "PM657327",
      "acteurRef": "PA608158",
      "legislature": "14",
      "typeOrgane": "COMPER",
      "dateDebut": "2012-06-28T02:00:00.000+02:00",
      "datePublication": "2012-06-28T02:00:00.000+02:00",
      "dateFin": "2017-06-20T02:00:00.000+02:00",
      "preseance": "32",
      "nominPrincipale": "0",
      "infosQualite": {
        "codeQualite": "Membre",
        "libQualite": "Membre",
        "libQualiteSex": "Membre"
      },
      "organesRefs": [
        "PO59046"
      ]
    },
    {
      "xsiType": "MandatSimple_Type",
      "uid": "PM658971",
      "acteurRef": "PA608158",
      "legislature": "14",
      "typeOrgane": "COMPER",
      "dateDebut": "2012-06-28T02:00:00.000+02:00",
      "datePublication": "2012-06-29T02:00:00.000+02:00",
      "dateFin": "2017-06-20T02:00:00.000+02:00",
      "preseance": "8",
      "nominPrincipale": "1",
      "infosQualite": {
        "codeQualite": "Vice-Président",
        "libQualite": "Vice-président",
        "libQualiteSex": "Vice-président"
      },
      "organesRefs": [
        "PO59046"
      ]
    },
    {
      "xsiType": "MandatAvecSuppleant_Type",
      "uid": "PM671028",
      "acteurRef": "PA608158",
      "legislature": "14",
      "typeOrgane": "COMNL",
      "dateDebut": "2012-07-11T02:00:00.000+02:00",
      "datePublication": "2012-07-11T02:00:00.000+02:00",
      "dateFin": "2017-06-20T02:00:00.000+02:00",
      "preseance": "28",
      "nominPrincipale": "1",
      "infosQualite": {
        "codeQualite": "Suppléant",
        "libQualite": "Membre suppléant",
        "libQualiteSex": "Membre suppléant"
      },
      "organesRefs": [
        "PO271850"
      ]
    },
    {
      "xsiType": "MandatSimple_Type",
      "uid": "PM677955",
      "acteurRef": "PA608158",
      "legislature": "14",
      "typeOrgane": "ORGAINT",
      "dateDebut": "2012-07-31T02:00:00.000+02:00",
      "dateFin": "2017-06-20T02:00:00.000+02:00",
      "preseance": "42",
      "nominPrincipale": "1",
      "infosQualite": {
        "codeQualite": "Membre",
        "libQualite": "Membre",
        "libQualiteSex": "Membre"
      },
      "organesRefs": [
        "PO206064"
      ]
    },
    {
      "xsiType": "MandatSimple_Type",
      "uid": "PM681668",
      "acteurRef": "PA608158",
      "legislature": "14",
      "typeOrgane": "GA",
      "dateDebut": "2012-10-16T02:00:00.000+02:00",
      "dateFin": "2017-06-20T02:00:00.000+02:00",
      "preseance": "20",
      "nominPrincipale": "1",
      "infosQualite": {
        "codeQualite": "Membre",
        "libQualite": "Membre",
        "libQualiteSex": "Membre"
      },
      "organesRefs": [
        "PO675682"
      ]
    },
    {
      "xsiType": "MandatSimple_Type",
      "uid": "PM681669",
      "acteurRef": "PA608158",
      "legislature": "14",
      "typeOrgane": "GA",
      "dateDebut": "2012-10-16T02:00:00.000+02:00",
      "dateFin": "2017-06-20T02:00:00.000+02:00",
      "preseance": "20",
      "nominPrincipale": "1",
      "infosQualite": {
        "codeQualite": "Membre",
        "libQualite": "Membre",
        "libQualiteSex": "Membre"
      },
      "organesRefs": [
        "PO675786"
      ]
    },
    {
      "xsiType": "MandatSimple_Type",
      "uid": "PM681670",
      "acteurRef": "PA608158",
      "legislature": "14",
      "typeOrgane": "GA",
      "dateDebut": "2012-10-16T02:00:00.000+02:00",
      "dateFin": "2017-06-20T02:00:00.000+02:00",
      "preseance": "20",
      "nominPrincipale": "1",
      "infosQualite": {
        "codeQualite": "Membre",
        "libQualite": "Membre",
        "libQualiteSex": "Membre"
      },
      "organesRefs": [
        "PO675697"
      ]
    },
    {
      "xsiType": "MandatSimple_Type",
      "uid": "PM681671",
      "acteurRef": "PA608158",
      "legislature": "14",
      "typeOrgane": "GA",
      "dateDebut": "2012-10-16T02:00:00.000+02:00",
      "dateFin": "2017-06-20T02:00:00.000+02:00",
      "preseance": "20",
      "nominPrincipale": "1",
      "infosQualite": {
        "codeQualite": "Membre",
        "libQualite": "Membre",
        "libQualiteSex": "Membre"
      },
      "organesRefs": [
        "PO675761"
      ]
    },
    {
      "xsiType": "MandatSimple_Type",
      "uid": "PM681672",
      "acteurRef": "PA608158",
      "legislature": "14",
      "typeOrgane": "GA",
      "dateDebut": "2012-10-16T02:00:00.000+02:00",
      "dateFin": "2017-06-20T02:00:00.000+02:00",
      "preseance": "20",
      "nominPrincipale": "1",
      "infosQualite": {
        "codeQualite": "Membre",
        "libQualite": "Membre",
        "libQualiteSex": "Membre"
      },
      "organesRefs": [
        "PO675808"
      ]
    },
    {
      "xsiType": "MandatSimple_Type",
      "uid": "PM681673",
      "acteurRef": "PA608158",
      "legislature": "14",
      "typeOrgane": "GA",
      "dateDebut": "2012-10-16T02:00:00.000+02:00",
      "dateFin": "2017-06-20T02:00:00.000+02:00",
      "preseance": "20",
      "nominPrincipale": "1",
      "infosQualite": {
        "codeQualite": "Membre",
        "libQualite": "Membre",
        "libQualiteSex": "Membre"
      },
      "organesRefs": [
        "PO675836"
      ]
    },
    {
      "xsiType": "MandatSimple_Type",
      "uid": "PM681674",
      "acteurRef": "PA608158",
      "legislature": "14",
      "typeOrgane": "GA",
      "dateDebut": "2012-10-16T02:00:00.000+02:00",
      "dateFin": "2017-06-20T02:00:00.000+02:00",
      "preseance": "20",
      "nominPrincipale": "1",
      "infosQualite": {
        "codeQualite": "Membre",
        "libQualite": "Membre",
        "libQualiteSex": "Membre"
      },
      "organesRefs": [
        "PO675734"
      ]
    },
    {
      "xsiType": "MandatSimple_Type",
      "uid": "PM681675",
      "acteurRef": "PA608158",
      "legislature": "14",
      "typeOrgane": "GA",
      "dateDebut": "2012-10-16T02:00:00.000+02:00",
      "dateFin": "2017-06-20T02:00:00.000+02:00",
      "preseance": "20",
      "nominPrincipale": "1",
      "infosQualite": {
        "codeQualite": "Membre",
        "libQualite": "Membre",
        "libQualiteSex": "Membre"
      },
      "organesRefs": [
        "PO675810"
      ]
    },
    {
      "xsiType": "MandatSimple_Type",
      "uid": "PM682360",
      "acteurRef": "PA608158",
      "legislature": "14",
      "typeOrgane": "GEVI",
      "dateDebut": "2012-10-17T02:00:00.000+02:00",
      "dateFin": "2017-06-20T02:00:00.000+02:00",
      "preseance": "20",
      "nominPrincipale": "1",
      "infosQualite": {
        "codeQualite": "Membre",
        "libQualite": "Membre",
        "libQualiteSex": "Membre"
      },
      "organesRefs": [
        "PO675803"
      ]
    },
    {
      "xsiType": "MandatSimple_Type",
      "uid": "PM683956",
      "acteurRef": "PA608158",
      "legislature": "14",
      "typeOrgane": "GA",
      "dateDebut": "2012-11-06T01:00:00.000+01:00",
      "dateFin": "2017-06-20T02:00:00.000+02:00",
      "preseance": "20",
      "nominPrincipale": "1",
      "infosQualite": {
        "codeQualite": "Membre",
        "libQualite": "Membre",
        "libQualiteSex": "Membre"
      },
      "organesRefs": [
        "PO675704"
      ]
    },
    {
      "xsiType": "MandatSimple_Type",
      "uid": "PM683979",
      "acteurRef": "PA608158",
      "legislature": "14",
      "typeOrgane": "GA",
      "dateDebut": "2012-11-07T01:00:00.000+01:00",
      "dateFin": "2017-06-20T02:00:00.000+02:00",
      "preseance": "8",
      "nominPrincipale": "1",
      "infosQualite": {
        "codeQualite": "Vice-Président",
        "libQualite": "Vice-Président",
        "libQualiteSex": "Vice-Président"
      },
      "organesRefs": [
        "PO675808"
      ]
    },
    {
      "xsiType": "MandatSimple_Type",
      "uid": "PM684875",
      "acteurRef": "PA608158",
      "legislature": "14",
      "typeOrgane": "GA",
      "dateDebut": "2012-11-21T01:00:00.000+01:00",
      "dateFin": "2017-06-20T02:00:00.000+02:00",
      "preseance": "8",
      "nominPrincipale": "1",
      "infosQualite": {
        "codeQualite": "Vice-Président",
        "libQualite": "Vice-Président",
        "libQualiteSex": "Vice-Président"
      },
      "organesRefs": [
        "PO675761"
      ]
    },
    {
      "xsiType": "MandatSimple_Type",
      "uid": "PM685350",
      "acteurRef": "PA608158",
      "legislature": "14",
      "typeOrgane": "GA",
      "dateDebut": "2012-12-04T01:00:00.000+01:00",
      "dateFin": "2017-06-20T02:00:00.000+02:00",
      "preseance": "8",
      "nominPrincipale": "1",
      "infosQualite": {
        "codeQualite": "Vice-Président",
        "libQualite": "Vice-Président",
        "libQualiteSex": "Vice-Président"
      },
      "organesRefs": [
        "PO675697"
      ]
    },
    {
      "xsiType": "MandatSimple_Type",
      "uid": "PM685642",
      "acteurRef": "PA608158",
      "typeOrgane": "PARPOL",
      "dateDebut": "2012-12-01T01:00:00.000+01:00",
      "dateFin": "2017-06-20T02:00:00.000+02:00",
      "preseance": "5",
      "nominPrincipale": "1",
      "infosQualite": {
        "codeQualite": "Membre",
        "libQualite": "Membre",
        "libQualiteSex": "Membre"
      },
      "organesRefs": [
        "PO684932"
      ]
    },
    {
      "xsiType": "MandatSimple_Type",
      "uid": "PM687201",
      "acteurRef": "PA608158",
      "legislature": "14",
      "typeOrgane": "GA",
      "dateDebut": "2012-12-11T01:00:00.000+01:00",
      "dateFin": "2017-06-20T02:00:00.000+02:00",
      "preseance": "8",
      "nominPrincipale": "1",
      "infosQualite": {
        "codeQualite": "Vice-Président",
        "libQualite": "Vice-Président",
        "libQualiteSex": "Vice-Président"
      },
      "organesRefs": [
        "PO675836"
      ]
    },
    {
      "xsiType": "MandatSimple_Type",
      "uid": "PM688203",
      "acteurRef": "PA608158",
      "legislature": "14",
      "typeOrgane": "GE",
      "dateDebut": "2013-01-18T01:00:00.000+01:00",
      "dateFin": "2017-06-20T02:00:00.000+02:00",
      "preseance": "20",
      "nominPrincipale": "1",
      "infosQualite": {
        "codeQualite": "Membre",
        "libQualite": "Membre",
        "libQualiteSex": "Membre"
      },
      "organesRefs": [
        "PO687403"
      ]
    },
    {
      "xsiType": "MandatSimple_Type",
      "uid": "PM688915",
      "acteurRef": "PA608158",
      "legislature": "14",
      "typeOrgane": "GE",
      "dateDebut": "2013-01-25T01:00:00.000+01:00",
      "dateFin": "2017-06-20T02:00:00.000+02:00",
      "preseance": "20",
      "nominPrincipale": "1",
      "infosQualite": {
        "codeQualite": "Membre",
        "libQualite": "Membre",
        "libQualiteSex": "Membre"
      },
      "organesRefs": [
        "PO686577"
      ]
    },
    {
      "xsiType": "MandatSimple_Type",
      "uid": "PM689219",
      "acteurRef": "PA608158",
      "legislature": "14",
      "typeOrgane": "GE",
      "dateDebut": "2013-01-29T01:00:00.000+01:00",
      "dateFin": "2017-06-20T02:00:00.000+02:00",
      "preseance": "20",
      "nominPrincipale": "1",
      "infosQualite": {
        "codeQualite": "Membre",
        "libQualite": "Membre",
        "libQualiteSex": "Membre"
      },
      "organesRefs": [
        "PO687613"
      ]
    },
    {
      "xsiType": "MandatSimple_Type",
      "uid": "PM689431",
      "acteurRef": "PA608158",
      "legislature": "14",
      "typeOrgane": "GA",
      "dateDebut": "2013-01-29T01:00:00.000+01:00",
      "dateFin": "2017-06-20T02:00:00.000+02:00",
      "preseance": "8",
      "nominPrincipale": "1",
      "infosQualite": {
        "codeQualite": "Vice-Président",
        "libQualite": "Vice-Président",
        "libQualiteSex": "Vice-Président"
      },
      "organesRefs": [
        "PO675682"
      ]
    },
    {
      "xsiType": "MandatSimple_Type",
      "uid": "PM689560",
      "acteurRef": "PA608158",
      "legislature": "14",
      "typeOrgane": "GE",
      "dateDebut": "2013-01-20T01:00:00.000+01:00",
      "dateFin": "2017-06-20T02:00:00.000+02:00",
      "preseance": "20",
      "nominPrincipale": "1",
      "infosQualite": {
        "codeQualite": "Membre",
        "libQualite": "Membre",
        "libQualiteSex": "Membre"
      },
      "organesRefs": [
        "PO686802"
      ]
    },
    {
      "xsiType": "MandatSimple_Type",
      "uid": "PM689782",
      "acteurRef": "PA608158",
      "legislature": "14",
      "typeOrgane": "GE",
      "dateDebut": "2013-01-31T01:00:00.000+01:00",
      "dateFin": "2017-06-20T02:00:00.000+02:00",
      "preseance": "20",
      "nominPrincipale": "1",
      "infosQualite": {
        "codeQualite": "Membre",
        "libQualite": "Membre",
        "libQualiteSex": "Membre"
      },
      "organesRefs": [
        "PO686362"
      ]
    },
    {
      "xsiType": "MandatSimple_Type",
      "uid": "PM690096",
      "acteurRef": "PA608158",
      "legislature": "14",
      "typeOrgane": "GE",
      "dateDebut": "2013-02-04T01:00:00.000+01:00",
      "dateFin": "2017-06-20T02:00:00.000+02:00",
      "preseance": "20",
      "nominPrincipale": "1",
      "infosQualite": {
        "codeQualite": "Membre",
        "libQualite": "Membre",
        "libQualiteSex": "Membre"
      },
      "organesRefs": [
        "PO686275"
      ]
    },
    {
      "xsiType": "MandatSimple_Type",
      "uid": "PM691882",
      "acteurRef": "PA608158",
      "legislature": "14",
      "typeOrgane": "GE",
      "dateDebut": "2013-02-15T01:00:00.000+01:00",
      "dateFin": "2017-06-20T02:00:00.000+02:00",
      "preseance": "20",
      "nominPrincipale": "1",
      "infosQualite": {
        "codeQualite": "Membre",
        "libQualite": "Membre",
        "libQualiteSex": "Membre"
      },
      "organesRefs": [
        "PO686493"
      ]
    },
    {
      "xsiType": "MandatSimple_Type",
      "uid": "PM692196",
      "acteurRef": "PA608158",
      "legislature": "14",
      "typeOrgane": "GE",
      "dateDebut": "2013-02-27T01:00:00.000+01:00",
      "dateFin": "2017-06-20T02:00:00.000+02:00",
      "preseance": "20",
      "nominPrincipale": "1",
      "infosQualite": {
        "codeQualite": "Membre",
        "libQualite": "Membre",
        "libQualiteSex": "Membre"
      },
      "organesRefs": [
        "PO686810"
      ]
    },
    {
      "xsiType": "MandatSimple_Type",
      "uid": "PM692682",
      "acteurRef": "PA608158",
      "legislature": "14",
      "typeOrgane": "GE",
      "dateDebut": "2013-03-14T01:00:00.000+01:00",
      "dateFin": "2017-06-20T02:00:00.000+02:00",
      "preseance": "20",
      "nominPrincipale": "1",
      "infosQualite": {
        "codeQualite": "Membre",
        "libQualite": "Membre",
        "libQualiteSex": "Membre"
      },
      "organesRefs": [
        "PO686835"
      ]
    },
    {
      "xsiType": "MandatSimple_Type",
      "uid": "PM693943",
      "acteurRef": "PA608158",
      "legislature": "14",
      "typeOrgane": "GE",
      "dateDebut": "2013-04-17T02:00:00.000+02:00",
      "dateFin": "2017-06-20T02:00:00.000+02:00",
      "preseance": "8",
      "nominPrincipale": "1",
      "infosQualite": {
        "codeQualite": "Vice-Président",
        "libQualite": "Vice-Président",
        "libQualiteSex": "Vice-Président"
      },
      "organesRefs": [
        "PO686362"
      ]
    },
    {
      "xsiType": "MandatSimple_Type",
      "uid": "PM693965",
      "acteurRef": "PA608158",
      "legislature": "14",
      "typeOrgane": "GA",
      "dateDebut": "2012-12-11T01:00:00.000+01:00",
      "dateFin": "2017-06-20T02:00:00.000+02:00",
      "preseance": "8",
      "nominPrincipale": "1",
      "infosQualite": {
        "codeQualite": "Vice-Président",
        "libQualite": "Vice-Président",
        "libQualiteSex": "Vice-Président"
      },
      "organesRefs": [
        "PO675786"
      ]
    },
    {
      "xsiType": "MandatSimple_Type",
      "uid": "PM696402",
      "acteurRef": "PA608158",
      "legislature": "14",
      "typeOrgane": "GE",
      "dateDebut": "2013-07-23T02:00:00.000+02:00",
      "dateFin": "2017-06-20T02:00:00.000+02:00",
      "preseance": "20",
      "nominPrincipale": "1",
      "infosQualite": {
        "codeQualite": "Membre",
        "libQualite": "Membre",
        "libQualiteSex": "Membre"
      },
      "organesRefs": [
        "PO694572"
      ]
    },
    {
      "xsiType": "MandatSimple_Type",
      "uid": "PM697626",
      "acteurRef": "PA608158",
      "legislature": "14",
      "typeOrgane": "GE",
      "dateDebut": "2013-10-08T02:00:00.000+02:00",
      "dateFin": "2017-06-20T02:00:00.000+02:00",
      "preseance": "8",
      "nominPrincipale": "1",
      "infosQualite": {
        "codeQualite": "Vice-Président",
        "libQualite": "Vice-Président",
        "libQualiteSex": "Vice-Président"
      },
      "organesRefs": [
        "PO694572"
      ]
    },
    {
      "xsiType": "MandatSimple_Type",
      "uid": "PM700365",
      "acteurRef": "PA608158",
      "legislature": "14",
      "typeOrgane": "GE",
      "dateDebut": "2014-02-25T01:00:00.000+01:00",
      "dateFin": "2017-06-20T02:00:00.000+02:00",
      "preseance": "20",
      "nominPrincipale": "1",
      "infosQualite": {
        "codeQualite": "Membre",
        "libQualite": "Membre",
        "libQualiteSex": "Membre"
      },
      "organesRefs": [
        "PO695569"
      ]
    },
    {
      "xsiType": "MandatSimple_Type",
      "uid": "PM701421",
      "acteurRef": "PA608158",
      "legislature": "14",
      "typeOrgane": "CMP",
      "dateDebut": "2014-05-20T02:00:00.000+02:00",
      "datePublication": "2014-05-21T02:00:00.000+02:00",
      "dateFin": "2014-06-19T02:00:00.000+02:00",
      "preseance": "28",
      "nominPrincipale": "1",
      "infosQualite": {
        "codeQualite": "Suppléant",
        "libQualite": "Membre suppléant",
        "libQualiteSex": "Membre suppléant"
      },
      "organesRefs": [
        "PO701387"
      ]
    },
    {
      "xsiType": "MandatSimple_Type",
      "uid": "PM705509",
      "acteurRef": "PA608158",
      "legislature": "14",
      "typeOrgane": "GE",
      "dateDebut": "2014-12-14T01:00:00.000+01:00",
      "dateFin": "2017-06-20T02:00:00.000+02:00",
      "preseance": "20",
      "nominPrincipale": "1",
      "infosQualite": {
        "codeQualite": "Membre",
        "libQualite": "Membre",
        "libQualiteSex": "Membre"
      },
      "organesRefs": [
        "PO704831"
      ]
    },
    {
      "xsiType": "MandatMission_Type",
      "uid": "PM708609",
      "acteurRef": "PA608158",
      "legislature": "14",
      "typeOrgane": "MISINFO",
      "dateDebut": "2014-12-17T01:00:00.000+01:00",
      "dateFin": "2015-12-09T01:00:00.000+01:00",
      "preseance": "10",
      "nominPrincipale": "1",
      "infosQualite": {
        "codeQualite": "Membre",
        "libQualite": "Membre",
        "libQualiteSex": "Membre"
      },
      "organesRefs": [
        "PO708578"
      ]
    },
    {
      "xsiType": "MandatMission_Type",
      "uid": "PM710726",
      "acteurRef": "PA608158",
      "legislature": "14",
      "typeOrgane": "MISINFO",
      "dateDebut": "2014-12-17T01:00:00.000+01:00",
      "dateFin": "2015-12-16T01:00:00.000+01:00",
      "preseance": "9",
      "nominPrincipale": "1",
      "infosQualite": {
        "codeQualite": "Rapporteur",
        "libQualite": "Rapporteur",
        "libQualiteSex": "Rapporteur"
      },
      "organesRefs": [
        "PO708600"
      ]
    },
    {
      "xsiType": "MandatMission_Type",
      "uid": "PM711103",
      "acteurRef": "PA608158",
      "legislature": "14",
      "typeOrgane": "MINISTERE",
      "dateDebut": "2015-06-24T02:00:00.000+02:00",
      "datePublication": "2015-06-25T02:00:00.000+02:00",
      "dateFin": "2015-12-23T01:00:00.000+01:00",
      "preseance": "1",
      "nominPrincipale": "1",
      "infosQualite": {
        "codeQualite": "en mission",
        "libQualite": "en mission",
        "libQualiteSex": "en mission"
      },
      "organesRefs": [
        "PO702884"
      ],
      "libelle": "Mise en place de services publics itinérants"
    },
    {
      "xsiType": "MandatSimple_Type",
      "uid": "PM712521",
      "acteurRef": "PA608158",
      "legislature": "14",
      "typeOrgane": "GE",
      "dateDebut": "2016-04-28T02:00:00.000+02:00",
      "dateFin": "2017-06-20T02:00:00.000+02:00",
      "preseance": "20",
      "nominPrincipale": "1",
      "infosQualite": {
        "codeQualite": "Membre",
        "libQualite": "Membre",
        "libQualiteSex": "Membre"
      },
      "organesRefs": [
        "PO712100"
      ]
    },
    {
      "xsiType": "MandatSimple_Type",
      "uid": "PM712852",
      "acteurRef": "PA608158",
      "legislature": "14",
      "typeOrgane": "GE",
      "dateDebut": "2016-05-17T02:00:00.000+02:00",
      "dateFin": "2017-06-20T02:00:00.000+02:00",
      "preseance": "20",
      "nominPrincipale": "1",
      "infosQualite": {
        "codeQualite": "Membre",
        "libQualite": "Membre",
        "libQualiteSex": "Membre"
      },
      "organesRefs": [
        "PO712091"
      ]
    },
    {
      "xsiType": "MandatSimple_Type",
      "uid": "PM713107",
      "acteurRef": "PA608158",
      "legislature": "14",
      "typeOrgane": "GP",
      "dateDebut": "2016-05-25T02:00:00.000+02:00",
      "dateFin": "2017-06-20T02:00:00.000+02:00",
      "preseance": "20",
      "nominPrincipale": "1",
      "infosQualite": {
        "codeQualite": "Membre",
        "libQualite": "Membre du",
        "libQualiteSex": "Membre du"
      },
      "organesRefs": [
        "PO713077"
      ]
    }
  ]
}