{
  "uid": "PA335017",
  "etatCivil": {
    "ident": {
      "civ": "M.",
      "prenom": "Christophe",
      "nom": "Sirugue",
      "alpha": "Sirugue"
    },
    "infoNaissance": {
      "dateNais": "1966-08-14T01:00:00.000+01:00",
      "villeNais": "Autun",
      "depNais": "Saône-et-Loire",
      "paysNais": "France"
    }
  },
  "mandats": [
    {
      "xsiType": "MandatParlementaire_type",
      "uid": "PM645607",
      "acteurRef": "PA335017",
      "legislature": "14",
      "typeOrgane": "ASSEMBLEE",
      "dateDebut": "2012-06-20T02:00:00.000+02:00",
      "dateFin": "2016-10-01T02:00:00.000+02:00",
      "preseance": "50",
      "nominPrincipale": "1",
      "infosQualite": {
        "codeQualite": "membre",
        "libQualite": "membre",
        "libQualiteSex": "membre"
      },
      "organesRefs": [
        "PO644420"
      ],
      "suppleant": {
        "dateDebut": "2012-06-20T02:00:00.000+02:00",
        "dateFin": "2016-10-01T02:00:00.000+02:00",
        "suppleantRef": "PA2126"
      },
      "election": {
        "lieu": {
          "region": "Bourgogne-Franche-Comté",
          "regionType": "Métropolitain",
          "departement": "Saône-et-Loire",
          "numDepartement": "71",
          "numCirco": "5"
        },
        "causeMandat": "élections générales",
        "refCirconscription": "PO644801"
      },
      "mandature": {
        "datePriseFonction": "2012-06-20T02:00:00.000+02:00",
        "causeFin": "Nomination comme membre du Gouvernement",
        "premiereElection": "1"
      }
    },
    {
      "xsiType": "MandatSimple_Type",
      "uid": "PM656282",
      "acteurRef": "PA335017",
      "legislature": "14",
      "typeOrgane": "GP",
      "dateDebut": "2012-06-26T02:00:00.000+02:00",
      "datePublication": "2012-06-27T02:00:00.000+02:00",
      "dateFin": "2016-05-24T02:00:00.000+02:00",
      "preseance": "20",
      "nominPrincipale": "1",
      "infosQualite": {
        "codeQualite": "Membre",
        "libQualite": "Membre du",
        "libQualiteSex": "Membre du"
      },
      "organesRefs": [
        "PO656002"
      ]
    },
    {
      "xsiType": "MandatParlementaire_type",
      "uid": "PM656840",
      "acteurRef": "PA335017",
      "legislature": "14",
      "typeOrgane": "ASSEMBLEE",
      "dateDebut": "2012-06-27T02:00:00.000+02:00",
      "dateFin": "2014-12-31T01:00:00.000+01:00",
      "preseance": "6",
      "nominPrincipale": "1",
      "infosQualite": {
        "codeQualite": "Vice-Président",
        "libQualite": "Vice-président de l'Assemblée nationale",
        "libQualiteSex": "Vice-président de l'Assemblée nationale"
      },
      "organesRefs": [
        "PO644420"
      ],
      "election": {
        "lieu": {}
      },
      "mandature": {}
    },
    {
      "xsiType": "MandatSimple_Type",
      "uid": "PM657502",
      "acteurRef": "PA335017",
      "legislature": "14",
      "typeOrgane": "COMPER",
      "dateDebut": "2012-06-28T02:00:00.000+02:00",
      "datePublication": "2012-06-28T02:00:00.000+02:00",
      "dateFin": "2016-10-01T02:00:00.000+02:00",
      "preseance": "32",
      "nominPrincipale": "1",
      "infosQualite": {
        "codeQualite": "Membre",
        "libQualite": "Membre",
        "libQualiteSex": "Membre"
      },
      "organesRefs": [
        "PO420120"
      ]
    },
    {
      "xsiType": "MandatSimple_Type",
      "uid": "PM663998",
      "acteurRef": "PA335017",
      "legislature": "14",
      "typeOrgane": "DELEG",
      "dateDebut": "2012-07-04T02:00:00.000+02:00",
      "datePublication": "2012-07-04T02:00:00.000+02:00",
      "dateFin": "2016-10-01T02:00:00.000+02:00",
      "preseance": "20",
      "nominPrincipale": "1",
      "infosQualite": {
        "codeQualite": "Membre",
        "libQualite": "Membre",
        "libQualiteSex": "Membre"
      },
      "organesRefs": [
        "PO201269"
      ]
    },
    {
      "xsiType": "MandatSimple_Type",
      "uid": "PM665181",
      "acteurRef": "PA335017",
      "legislature": "14",
      "typeOrgane": "DELEG",
      "dateDebut": "2012-07-05T02:00:00.000+02:00",
      "datePublication": "2012-07-05T02:00:00.000+02:00",
      "dateFin": "2016-10-01T02:00:00.000+02:00",
      "preseance": "8",
      "nominPrincipale": "1",
      "infosQualite": {
        "codeQualite": "Vice-Président",
        "libQualite": "Vice-Président",
        "libQualiteSex": "Vice-Président"
      },
      "organesRefs": [
        "PO201269"
      ]
    },
    {
      "xsiType": "MandatSimple_Type",
      "uid": "PM676588",
      "acteurRef": "PA335017",
      "legislature": "14",
      "typeOrgane": "DELEGBUREAU",
      "dateDebut": "2012-07-18T02:00:00.000+02:00",
      "dateFin": "2014-12-31T01:00:00.000+01:00",
      "preseance": "24",
      "nominPrincipale": "1",
      "infosQualite": {
        "codeQualite": "Membre",
        "libQualite": "Membre",
        "libQualiteSex": "Membre"
      },
      "organesRefs": [
        "PO665154"
      ]
    },
    {
      "xsiType": "MandatSimple_Type",
      "uid": "PM676609",
      "acteurRef": "PA335017",
      "legislature": "14",
      "typeOrgane": "DELEGBUREAU",
      "dateDebut": "2012-07-18T02:00:00.000+02:00",
      "dateFin": "2014-12-31T01:00:00.000+01:00",
      "preseance": "24",
      "nominPrincipale": "0",
      "infosQualite": {
        "codeQualite": "Membre",
        "libQualite": "Membre",
        "libQualiteSex": "Membre"
      },
      "organesRefs": [
        "PO665162"
      ]
    },
    {
      "xsiType": "MandatSimple_Type",
      "uid": "PM676615",
      "acteurRef": "PA335017",
      "legislature": "14",
      "typeOrgane": "DELEGBUREAU",
      "dateDebut": "2012-07-18T02:00:00.000+02:00",
      "dateFin": "2014-12-31T01:00:00.000+01:00",
      "preseance": "1",
      "nominPrincipale": "1",
      "infosQualite": {
        "codeQualite": "Président",
        "libQualite": "Président",
        "libQualiteSex": "Président"
      },
      "organesRefs": [
        "PO665162"
      ]
    },
    {
      "xsiType": "MandatSimple_Type",
      "uid": "PM678745",
      "acteurRef": "PA335017",
      "legislature": "14",
      "typeOrgane": "CMP",
      "dateDebut": "2012-09-27T02:00:00.000+02:00",
      "datePublication": "2012-09-28T02:00:00.000+02:00",
      "dateFin": "2012-10-15T02:00:00.000+02:00",
      "preseance": "20",
      "nominPrincipale": "1",
      "infosQualite": {
        "codeQualite": "Titulaire",
        "libQualite": "Membre titulaire",
        "libQualiteSex": "Membre titulaire"
      },
      "organesRefs": [
        "PO678407"
      ]
    },
    {
      "xsiType": "MandatSimple_Type",
      "uid": "PM684191",
      "acteurRef": "PA335017",
      "legislature": "14",
      "typeOrgane": "GA",
      "dateDebut": "2012-11-08T01:00:00.000+01:00",
      "dateFin": "2016-10-01T02:00:00.000+02:00",
      "preseance": "20",
      "nominPrincipale": "1",
      "infosQualite": {
        "codeQualite": "Membre",
        "libQualite": "Membre",
        "libQualiteSex": "Membre"
      },
      "organesRefs": [
        "PO675850"
      ]
    },
    {
      "xsiType": "MandatSimple_Type",
      "uid": "PM685201",
      "acteurRef": "PA335017",
      "legislature": "14",
      "typeOrgane": "GA",
      "dateDebut": "2012-11-20T01:00:00.000+01:00",
      "dateFin": "2016-10-01T02:00:00.000+02:00",
      "preseance": "8",
      "nominPrincipale": "1",
      "infosQualite": {
        "codeQualite": "Vice-Président",
        "libQualite": "Vice-Président",
        "libQualiteSex": "Vice-Président"
      },
      "organesRefs": [
        "PO675850"
      ]
    },
    {
      "xsiType": "MandatSimple_Type",
      "uid": "PM686001",
      "acteurRef": "PA335017",
      "typeOrgane": "PARPOL",
      "dateDebut": "2012-12-01T01:00:00.000+01:00",
      "dateFin": "2016-10-01T02:00:00.000+02:00",
      "preseance": "5",
      "nominPrincipale": "1",
      "infosQualite": {
        "codeQualite": "Membre",
        "libQualite": "Membre",
        "libQualiteSex": "Membre"
      },
      "organesRefs": [
        "PO684932"
      ]
    },
    {
      "xsiType": "MandatSimple_Type",
      "uid": "PM686368",
      "acteurRef": "PA335017",
      "legislature": "14",
      "typeOrgane": "GE",
      "dateDebut": "2012-12-12T01:00:00.000+01:00",
      "dateFin": "2016-10-01T02:00:00.000+02:00",
      "preseance": "20",
      "nominPrincipale": "0",
      "infosQualite": {
        "codeQualite": "Membre",
        "libQualite": "Membre",
        "libQualiteSex": "Membre"
      },
      "organesRefs": [
        "PO686362"
      ]
    },
    {
      "xsiType": "MandatSimple_Type",
      "uid": "PM686369",
      "acteurRef": "PA335017",
      "legislature": "14",
      "typeOrgane": "GE",
      "dateDebut": "2012-12-12T01:00:00.000+01:00",
      "dateFin": "2016-10-01T02:00:00.000+02:00",
      "preseance": "1",
      "nominPrincipale": "1",
      "infosQualite": {
        "codeQualite": "Président",
        "libQualite": "Président",
        "libQualiteSex": "Président"
      },
      "organesRefs": [
        "PO686362"
      ]
    },
    {
      "xsiType": "MandatSimple_Type",
      "uid": "PM688989",
      "acteurRef": "PA335017",
      "legislature": "14",
      "typeOrgane": "GE",
      "dateDebut": "2013-01-25T01:00:00.000+01:00",
      "dateFin": "2016-10-01T02:00:00.000+02:00",
      "preseance": "20",
      "nominPrincipale": "1",
      "infosQualite": {
        "codeQualite": "Membre",
        "libQualite": "Membre",
        "libQualiteSex": "Membre"
      },
      "organesRefs": [
        "PO686577"
      ]
    },
    {
      "xsiType": "MandatParlementaire_type",
      "uid": "PM690229",
      "acteurRef": "PA335017",
      "legislature": "14",
      "typeOrgane": "CONFPT",
      "dateDebut": "2012-06-20T02:00:00.000+02:00",
      "dateFin": "2014-12-31T01:00:00.000+01:00",
      "preseance": "20",
      "nominPrincipale": "1",
      "infosQualite": {
        "codeQualite": "Membre",
        "libQualite": "Membre",
        "libQualiteSex": "Membre"
      },
      "organesRefs": [
        "PO690204"
      ],
      "election": {
        "lieu": {}
      },
      "mandature": {}
    },
    {
      "xsiType": "MandatSimple_Type",
      "uid": "PM690827",
      "acteurRef": "PA335017",
      "legislature": "14",
      "typeOrgane": "CMP",
      "dateDebut": "2013-02-07T01:00:00.000+01:00",
      "datePublication": "2013-02-08T01:00:00.000+01:00",
      "dateFin": "2013-03-03T01:00:00.000+01:00",
      "preseance": "20",
      "nominPrincipale": "1",
      "infosQualite": {
        "codeQualite": "Titulaire",
        "libQualite": "Membre titulaire",
        "libQualiteSex": "Membre titulaire"
      },
      "organesRefs": [
        "PO690795"
      ]
    },
    {
      "xsiType": "MandatSimple_Type",
      "uid": "PM691086",
      "acteurRef": "PA335017",
      "legislature": "14",
      "typeOrgane": "CMP",
      "dateDebut": "2013-02-12T01:00:00.000+01:00",
      "datePublication": "2013-02-13T01:00:00.000+01:00",
      "dateFin": "2013-03-03T01:00:00.000+01:00",
      "preseance": "16",
      "nominPrincipale": "1",
      "infosQualite": {
        "codeQualite": "Rapporteur",
        "libQualite": "Rapporteur",
        "libQualiteSex": "Rapporteur"
      },
      "organesRefs": [
        "PO690795"
      ]
    },
    {
      "xsiType": "MandatMission_Type",
      "uid": "PM692596",
      "acteurRef": "PA335017",
      "legislature": "14",
      "typeOrgane": "MINISTERE",
      "dateDebut": "2013-03-07T01:00:00.000+01:00",
      "datePublication": "2013-03-08T01:00:00.000+01:00",
      "dateFin": "2013-09-06T02:00:00.000+02:00",
      "preseance": "1",
      "nominPrincipale": "1",
      "infosQualite": {
        "codeQualite": "en mission",
        "libQualite": "en mission",
        "libQualiteSex": "en mission"
      },
      "organesRefs": [
        "PO653218"
      ],
      "libelle": "Simplification du volet activité du revenu de solidarité active et de la prime pour l'emploi"
    },
    {
      "xsiType": "MandatSimple_Type",
      "uid": "PM694466",
      "acteurRef": "PA335017",
      "legislature": "14",
      "typeOrgane": "GE",
      "dateDebut": "2013-05-16T02:00:00.000+02:00",
      "dateFin": "2016-10-01T02:00:00.000+02:00",
      "preseance": "20",
      "nominPrincipale": "1",
      "infosQualite": {
        "codeQualite": "Membre",
        "libQualite": "Membre",
        "libQualiteSex": "Membre"
      },
      "organesRefs": [
        "PO692271"
      ]
    },
    {
      "xsiType": "MandatSimple_Type",
      "uid": "PM701807",
      "acteurRef": "PA335017",
      "legislature": "14",
      "typeOrgane": "CMP",
      "dateDebut": "2014-06-13T02:00:00.000+02:00",
      "datePublication": "2014-06-14T02:00:00.000+02:00",
      "dateFin": "2014-06-26T02:00:00.000+02:00",
      "preseance": "20",
      "nominPrincipale": "1",
      "infosQualite": {
        "codeQualite": "Titulaire",
        "libQualite": "Membre titulaire",
        "libQualiteSex": "Membre titulaire"
      },
      "organesRefs": [
        "PO701795"
      ]
    },
    {
      "xsiType": "MandatSimple_Type",
      "uid": "PM701877",
      "acteurRef": "PA335017",
      "legislature": "14",
      "typeOrgane": "CMP",
      "dateDebut": "2014-06-17T02:00:00.000+02:00",
      "datePublication": "2014-06-18T02:00:00.000+02:00",
      "dateFin": "2014-06-26T02:00:00.000+02:00",
      "preseance": "16",
      "nominPrincipale": "1",
      "infosQualite": {
        "codeQualite": "Rapporteur",
        "libQualite": "Rapporteur",
        "libQualiteSex": "Rapporteur"
      },
      "organesRefs": [
        "PO701795"
      ]
    },
    {
      "xsiType": "MandatSimple_Type",
      "uid": "PM704520",
      "acteurRef": "PA335017",
      "legislature": "14",
      "typeOrgane": "GE",
      "dateDebut": "2014-11-06T01:00:00.000+01:00",
      "dateFin": "2016-10-01T02:00:00.000+02:00",
      "preseance": "20",
      "nominPrincipale": "1",
      "infosQualite": {
        "codeQualite": "Membre",
        "libQualite": "Membre",
        "libQualiteSex": "Membre"
      },
      "organesRefs": [
        "PO687613"
      ]
    },
    {
      "xsiType": "MandatSimple_Type",
      "uid": "PM705458",
      "acteurRef": "PA335017",
      "legislature": "14",
      "typeOrgane": "CNPS",
      "dateDebut": "2014-12-13T01:00:00.000+01:00",
      "datePublication": "2014-12-13T01:00:00.000+01:00",
      "dateFin": "2015-08-07T02:00:00.000+02:00",
      "preseance": "20",
      "nominPrincipale": "1",
      "infosQualite": {
        "codeQualite": "Membre",
        "libQualite": "Membre",
        "libQualiteSex": "Membre"
      },
      "organesRefs": [
        "PO704848"
      ]
    },
    {
      "xsiType": "MandatSimple_Type",
      "uid": "PM705484",
      "acteurRef": "PA335017",
      "legislature": "14",
      "typeOrgane": "CNPS",
      "dateDebut": "2014-12-16T01:00:00.000+01:00",
      "datePublication": "2014-12-17T01:00:00.000+01:00",
      "dateFin": "2015-08-07T02:00:00.000+02:00",
      "preseance": "8",
      "nominPrincipale": "1",
      "infosQualite": {
        "codeQualite": "Vice-Président",
        "libQualite": "Vice-Président",
        "libQualiteSex": "Vice-Président"
      },
      "organesRefs": [
        "PO704848"
      ]
    },
    {
      "xsiType": "MandatMission_Type",
      "uid": "PM706090",
      "acteurRef": "PA335017",
      "legislature": "14",
      "typeOrgane": "MINISTERE",
      "dateDebut": "2015-01-08T01:00:00.000+01:00",
      "datePublication": "2015-01-10T01:00:00.000+01:00",
      "dateFin": "2015-07-19T02:00:00.000+02:00",
      "preseance": "1",
      "nominPrincipale": "1",
      "infosQualite": {
        "codeQualite": "en mission",
        "libQualite": "en mission",
        "libQualiteSex": "en mission"
      },
      "organesRefs": [
        "PO702892",
        "PO702938"
      ],
      "libelle": "La mise en oeuvre du compte personnel de prévention de la pénibilité"
    },
    {
      "xsiType": "MandatSimple_Type",
      "uid": "PM708742",
      "acteurRef": "PA335017",
      "legislature": "14",
      "typeOrgane": "CMP",
      "dateDebut": "2015-06-29T02:00:00.000+02:00",
      "datePublication": "2015-06-30T02:00:00.000+02:00",
      "dateFin": "2015-07-01T02:00:00.000+02:00",
      "preseance": "20",
      "nominPrincipale": "1",
      "infosQualite": {
        "codeQualite": "Titulaire",
        "libQualite": "Membre titulaire",
        "libQualiteSex": "Membre titulaire"
      },
      "organesRefs": [
        "PO708730"
      ]
    },
    {
      "xsiType": "MandatSimple_Type",
      "uid": "PM708772",
      "acteurRef": "PA335017",
      "legislature": "14",
      "typeOrgane": "CMP",
      "dateDebut": "2015-06-30T02:00:00.000+02:00",
      "datePublication": "2015-07-01T02:00:00.000+02:00",
      "dateFin": "2015-07-01T02:00:00.000+02:00",
      "preseance": "16",
      "nominPrincipale": "1",
      "infosQualite": {
        "codeQualite": "Rapporteur",
        "libQualite": "Rapporteur",
        "libQualiteSex": "Rapporteur"
      },
      "organesRefs": [
        "PO708730"
      ]
    },
    {
      "xsiType": "MandatSimple_Type",
      "uid": "PM708846",
      "acteurRef": "PA335017",
      "legislature": "14",
      "typeOrgane": "COMPER",
      "dateDebut": "2015-07-04T02:00:00.000+02:00",
      "datePublication": "2015-07-04T02:00:00.000+02:00",
      "dateFin": "2016-10-01T02:00:00.000+02:00",
      "preseance": "16",
      "nominPrincipale": "1",
      "infosQualite": {
        "codeQualite": "Secrétaire",
        "libQualite": "Secrétaire",
        "libQualiteSex": "Secrétaire"
      },
      "organesRefs": [
        "PO420120"
      ]
    },
    {
      "xsiType": "MandatMission_Type",
      "uid": "PM708929",
      "acteurRef": "PA335017",
      "legislature": "14",
      "typeOrgane": "MISINFOPRE",
      "dateDebut": "2015-07-09T02:00:00.000+02:00",
      "datePublication": "2015-07-10T02:00:00.000+02:00",
      "dateFin": "2016-06-21T02:00:00.000+02:00",
      "preseance": "20",
      "nominPrincipale": "1",
      "infosQualite": {
        "codeQualite": "Membre",
        "libQualite": "Membre",
        "libQualiteSex": "Membre"
      },
      "organesRefs": [
        "PO708706"
      ]
    },
    {
      "xsiType": "MandatSimple_Type",
      "uid": "PM709031",
      "acteurRef": "PA335017",
      "legislature": "14",
      "typeOrgane": "CMP",
      "dateDebut": "2015-07-16T02:00:00.000+02:00",
      "datePublication": "2015-07-16T02:00:00.000+02:00",
      "dateFin": "2015-07-17T02:00:00.000+02:00",
      "preseance": "20",
      "nominPrincipale": "0",
      "infosQualite": {
        "codeQualite": "Titulaire",
        "libQualite": "Membre titulaire",
        "libQualiteSex": "Membre titulaire"
      },
      "organesRefs": [
        "PO708863"
      ]
    },
    {
      "xsiType": "MandatSimple_Type",
      "uid": "PM709047",
      "acteurRef": "PA335017",
      "legislature": "14",
      "typeOrgane": "CMP",
      "dateDebut": "2015-07-16T02:00:00.000+02:00",
      "datePublication": "2015-07-17T02:00:00.000+02:00",
      "dateFin": "2015-07-17T02:00:00.000+02:00",
      "preseance": "16",
      "nominPrincipale": "1",
      "infosQualite": {
        "codeQualite": "Rapporteur",
        "libQualite": "Rapporteur",
        "libQualiteSex": "Rapporteur"
      },
      "organesRefs": [
        "PO708863"
      ]
    },
    {
      "xsiType": "MandatMission_Type",
      "uid": "PM709401",
      "acteurRef": "PA335017",
      "legislature": "14",
      "typeOrgane": "MISINFOPRE",
      "dateDebut": "2015-09-16T02:00:00.000+02:00",
      "datePublication": "2015-09-17T02:00:00.000+02:00",
      "dateFin": "2016-06-21T02:00:00.000+02:00",
      "preseance": "4",
      "nominPrincipale": "1",
      "infosQualite": {
        "codeQualite": "Vice-Président",
        "libQualite": "Vice-Président",
        "libQualiteSex": "Vice-Président"
      },
      "organesRefs": [
        "PO708706"
      ]
    },
    {
      "xsiType": "MandatSimple_Type",
      "uid": "PM709783",
      "acteurRef": "PA335017",
      "legislature": "14",
      "typeOrgane": "CMP",
      "dateDebut": "2015-10-22T02:00:00.000+02:00",
      "datePublication": "2015-10-22T02:00:00.000+02:00",
      "dateFin": "2015-10-28T01:00:00.000+01:00",
      "preseance": "28",
      "nominPrincipale": "1",
      "infosQualite": {
        "codeQualite": "Suppléant",
        "libQualite": "Membre suppléant",
        "libQualiteSex": "Membre suppléant"
      },
      "organesRefs": [
        "PO709622"
      ]
    },
    {
      "xsiType": "MandatMission_Type",
      "uid": "PM710031",
      "acteurRef": "PA335017",
      "legislature": "14",
      "typeOrgane": "MINISTERE",
      "dateDebut": "2015-10-30T01:00:00.000+01:00",
      "datePublication": "2015-10-31T01:00:00.000+01:00",
      "dateFin": "2016-04-29T02:00:00.000+02:00",
      "preseance": "1",
      "nominPrincipale": "1",
      "infosQualite": {
        "codeQualite": "en mission",
        "libQualite": "en mission",
        "libQualiteSex": "en mission"
      },
      "organesRefs": [
        "PO702892",
        "PO709252"
      ],
      "libelle": "La réforme des minima sociaux"
    },
    {
      "xsiType": "MandatSimple_Type",
      "uid": "PM710352",
      "acteurRef": "PA335017",
      "legislature": "14",
      "typeOrgane": "CMP",
      "dateDebut": "2015-11-27T01:00:00.000+01:00",
      "datePublication": "2015-11-28T01:00:00.000+01:00",
      "dateFin": "2015-12-03T01:00:00.000+01:00",
      "preseance": "20",
      "nominPrincipale": "1",
      "infosQualite": {
        "codeQualite": "Titulaire",
        "libQualite": "Membre titulaire",
        "libQualiteSex": "Membre titulaire"
      },
      "organesRefs": [
        "PO709840"
      ]
    },
    {
      "xsiType": "MandatSimple_Type",
      "uid": "PM711125",
      "acteurRef": "PA335017",
      "legislature": "14",
      "typeOrgane": "CMP",
      "dateDebut": "2016-01-14T01:00:00.000+01:00",
      "datePublication": "2016-01-15T01:00:00.000+01:00",
      "dateFin": "2016-02-11T01:00:00.000+01:00",
      "preseance": "28",
      "nominPrincipale": "1",
      "infosQualite": {
        "codeQualite": "Suppléant",
        "libQualite": "Membre suppléant",
        "libQualiteSex": "Membre suppléant"
      },
      "organesRefs": [
        "PO709882"
      ]
    },
    {
      "xsiType": "MandatSimple_Type",
      "uid": "PM711296",
      "acteurRef": "PA335017",
      "legislature": "14",
      "typeOrgane": "CMP",
      "dateDebut": "2016-01-28T01:00:00.000+01:00",
      "datePublication": "2016-01-29T01:00:00.000+01:00",
      "dateFin": "2016-02-11T01:00:00.000+01:00",
      "preseance": "20",
      "nominPrincipale": "1",
      "infosQualite": {
        "codeQualite": "Titulaire",
        "libQualite": "Membre titulaire",
        "libQualiteSex": "Membre titulaire"
      },
      "organesRefs": [
        "PO711168"
      ]
    },
    {
      "xsiType": "MandatSimple_Type",
      "uid": "PM713341",
      "acteurRef": "PA335017",
      "legislature": "14",
      "typeOrgane": "GP",
      "dateDebut": "2016-05-25T02:00:00.000+02:00",
      "dateFin": "2016-10-01T02:00:00.000+02:00",
      "preseance": "20",
      "nominPrincipale": "1",
      "infosQualite": {
        "codeQualite": "Membre",
        "libQualite": "Membre du",
        "libQualiteSex": "Membre du"
      },
      "organesRefs": [
        "PO713077"
      ]
    },
    {
      "xsiType": "MandatSimple_Type",
      "uid": "PM713925",
      "acteurRef": "PA335017",
      "legislature": "14",
      "typeOrgane": "CMP",
      "dateDebut": "2016-06-23T02:00:00.000+02:00",
      "datePublication": "2016-06-24T02:00:00.000+02:00",
      "dateFin": "2016-07-05T02:00:00.000+02:00",
      "preseance": "20",
      "nominPrincipale": "1",
      "infosQualite": {
        "codeQualite": "Titulaire",
        "libQualite": "Membre titulaire",
        "libQualiteSex": "Membre titulaire"
      },
      "organesRefs": [
        "PO713876"
      ]
    },
    {
      "xsiType": "MandatMission_Type",
      "uid": "PM713958",
      "acteurRef": "PA335017",
      "legislature": "14",
      "typeOrgane": "MISINFO",
      "dateDebut": "2016-06-07T02:00:00.000+02:00",
      "dateFin": "2016-10-01T02:00:00.000+02:00",
      "preseance": "10",
      "nominPrincipale": "1",
      "infosQualite": {
        "codeQualite": "Membre",
        "libQualite": "Membre",
        "libQualiteSex": "Membre"
      },
      "organesRefs": [
        "PO713063"
      ]
    },
    {
      "xsiType": "MandatSimple_Type",
      "uid": "PM714010",
      "acteurRef": "PA335017",
      "legislature": "14",
      "typeOrgane": "CMP",
      "dateDebut": "2016-06-28T02:00:00.000+02:00",
      "datePublication": "2016-06-29T02:00:00.000+02:00",
      "dateFin": "2016-07-05T02:00:00.000+02:00",
      "preseance": "16",
      "nominPrincipale": "1",
      "infosQualite": {
        "codeQualite": "Rapporteur",
        "libQualite": "Rapporteur",
        "libQualiteSex": "Rapporteur"
      },
      "organesRefs": [
        "PO713876"
      ]
    },
    {
      "xsiType": "MandatMission_Type",
      "uid": "PM714045",
      "acteurRef": "PA335017",
      "legislature": "14",
      "typeOrgane": "MISINFO",
      "dateDebut": "2016-06-07T02:00:00.000+02:00",
      "dateFin": "2016-10-01T02:00:00.000+02:00",
      "preseance": "10",
      "nominPrincipale": "1",
      "infosQualite": {
        "codeQualite": "Membre",
        "libQualite": "Membre",
        "libQualiteSex": "Membre"
      },
      "organesRefs": [
        "PO713057"
      ]
    },
    {
      "xsiType": "MandatSimple_Type",
      "uid": "PM714725",
      "acteurRef": "PA335017",
      "typeOrgane": "MINISTERE",
      "dateDebut": "2016-09-01T02:00:00.000+02:00",
      "datePublication": "2016-09-02T02:00:00.000+02:00",
      "dateFin": "2016-12-06T01:00:00.000+01:00",
      "preseance": "50",
      "nominPrincipale": "1",
      "infosQualite": {
        "codeQualite": "Secrétaire d'État",
        "libQualite": "Secrétaire d'État",
        "libQualiteSex": "Secrétaire d'État"
      },
      "organesRefs": [
        "PO714723"
      ]
    },
    {
      "xsiType": "MandatSimple_Type",
      "uid": "PM715914",
      "acteurRef": "PA335017",
      "typeOrgane": "MINISTERE",
      "dateDebut": "2016-12-07T01:00:00.000+01:00",
      "datePublication": "2016-12-07T01:00:00.000+01:00",
      "dateFin": "2017-02-27T01:00:00.000+01:00",
      "preseance": "50",
      "nominPrincipale": "1",
      "infosQualite": {
        "codeQualite": "Secrétaire d'État",
        "libQualite": "Secrétaire d'État",
        "libQualiteSex": "Secrétaire d'État"
      },
      "organesRefs": [
        "PO715910"
      ]
    },
    {
      "xsiType": "MandatSimple_Type",
      "uid": "PM716960",
      "acteurRef": "PA335017",
      "typeOrgane": "MINISTERE",
      "dateDebut": "2017-02-28T01:00:00.000+01:00",
      "datePublication": "2017-02-28T01:00:00.000+01:00",
      "dateFin": "2017-05-17T02:00:00.000+02:00",
      "preseance": "50",
      "nominPrincipale": "1",
      "infosQualite": {
        "codeQualite": "Secrétaire d'État",
        "libQualite": "Secrétaire d'État",
        "libQualiteSex": "Secrétaire d'État"
      },
      "organesRefs": [
        "PO716957"
      ]
    },
    {
      "xsiType": "MandatSimple_Type",
      "uid": "PM15714725",
      "acteurRef": "PA335017",
      "typeOrgane": "GOUVERNEMENT",
      "dateDebut": "2016-09-01T02:00:00.000+02:00",
      "datePublication": "2016-09-02T02:00:00.000+02:00",
      "dateFin": "2016-12-06T01:00:00.000+01:00",
      "preseance": "50",
      "nominPrincipale": "1",
      "infosQualite": {
        "codeQualite": "membre",
        "libQualite": "membre",
        "libQualiteSex": "membre"
      },
      "organesRefs": [
        "PO702883"
      ]
    },
    {
      "xsiType": "MandatSimple_Type",
      "uid": "PM15715914",
      "acteurRef": "PA335017",
      "typeOrgane": "GOUVERNEMENT",
      "dateDebut": "2016-12-07T01:00:00.000+01:00",
      "datePublication": "2016-12-07T01:00:00.000+01:00",
      "dateFin": "2017-05-17T02:00:00.000+02:00",
      "preseance": "50",
      "nominPrincipale": "1",
      "infosQualite": {
        "codeQualite": "membre",
        "libQualite": "membre",
        "libQualiteSex": "membre"
      },
      "organesRefs": [
        "PO715793"
      ]
    }
  ]
}