{
  "xsiType": "OrganeParlementaire_Type",
  "uid": "PO710744",
  "codeType": "CMP",
  "libelle": "Commission mixte paritaire chargée de proposer un texte sur les dispositions restant en discussion du projet de loi de finances rectificative pour 2015",
  "libelleEdition": "de la commission mixte paritaire chargée de proposer un texte sur les dispositions restant en discussion du projet de loi de finances rectificative pour 2015",
  "libelleAbrege": "Loi de finances rectificative pour 2015",
  "libelleAbrev": "3217",
  "viMoDe": {
    "dateDebut": "2015-12-10T01:00:00.000+01:00",
    "dateFin": "2015-12-15T01:00:00.000+01:00"
  },
  "regime": "5ème République",
  "legislature": "14",
  "secretariat": {}
}