{
  "xsiType": "OrganeExterne_Type",
  "uid": "PO702942",
  "codeType": "MINISTERE",
  "libelle": "Secrétariat d'État, auprès du ministre de l'économie, de l'industrie et du numérique, chargé du commerce, de l'artisanat, de la consommation et de l'économie sociale et solidaire",
  "libelleEdition": ", auprès du ministre de l'économie, de l'industrie et du numérique, chargée du commerce, de l'artisanat, de la consommation et de l'économie sociale et solidaire",
  "libelleAbrege": "Commerce, artisanat, consommation et économie sociale",
  "libelleAbrev": "ACC",
  "viMoDe": {
    "dateDebut": "2014-08-27T02:00:00.000+02:00",
    "dateFin": "2015-06-17T02:00:00.000+02:00"
  }
}