{
  "uid": "PA736243",
  "etatCivil": {
    "ident": {
      "civ": "M.",
      "prenom": "Pierre",
      "nom": "Ouzoulias",
      "alpha": "OUZOULIAS_Pierre"
    },
    "infoNaissance": {
      "dateNais": "1964-01-28T01:00:00.000+01:00"
    }
  },
  "mandats": [
    {
      "xsiType": "MandatParlementaire_type",
      "uid": "PM736413",
      "acteurRef": "PA736243",
      "typeOrgane": "SENAT",
      "dateDebut": "2017-10-02T02:00:00.000+02:00",
      "preseance": "20",
      "nominPrincipale": "1",
      "infosQualite": {
        "codeQualite": "Sénateur",
        "libQualite": "SENATEUR",
        "libQualiteSex": "SENATEUR"
      },
      "organesRefs": [
        "PO78718"
      ],
      "election": {
        "lieu": {
          "numDepartement": "92"
        }
      },
      "mandature": {}
    },
    {
      "xsiType": "MandatSimple_Type",
      "uid": "PM741324",
      "acteurRef": "PA736243",
      "typeOrgane": "COMSENAT",
      "dateDebut": "2017-10-05T02:00:00.000+02:00",
      "nominPrincipale": "1",
      "infosQualite": {
        "libQualite": "Vice-Président",
        "libQualiteSex": "Vice-Président"
      },
      "organesRefs": [
        "PO211490"
      ]
    },
    {
      "xsiType": "MandatSimple_Type",
      "uid": "PM741545",
      "acteurRef": "PA736243",
      "typeOrgane": "GROUPESENAT",
      "dateDebut": "2017-10-03T02:00:00.000+02:00",
      "preseance": "4",
      "nominPrincipale": "1",
      "infosQualite": {
        "codeQualite": "Membre",
        "libQualite": "Membre",
        "libQualiteSex": "Membre"
      },
      "organesRefs": [
        "PO77707"
      ]
    },
    {
      "xsiType": "MandatAvecSuppleant_Type",
      "uid": "PM742813",
      "acteurRef": "PA736243",
      "typeOrgane": "OFFPAR",
      "dateDebut": "2017-11-09T01:00:00.000+01:00",
      "datePublication": "2017-11-10T01:00:00.000+01:00",
      "preseance": "24",
      "nominPrincipale": "1",
      "infosQualite": {
        "codeQualite": "Membre",
        "libQualite": "Membre",
        "libQualiteSex": "Membre"
      },
      "organesRefs": [
        "PO273589"
      ]
    },
    {
      "xsiType": "MandatSimple_Type",
      "uid": "PM743253",
      "acteurRef": "PA736243",
      "typeOrgane": "ORGAINT",
      "dateDebut": "2017-11-08T01:00:00.000+01:00",
      "preseance": "42",
      "nominPrincipale": "1",
      "infosQualite": {
        "codeQualite": "Membre",
        "libQualite": "Membre",
        "libQualiteSex": "Membre"
      },
      "organesRefs": [
        "PO206064"
      ]
    },
    {
      "xsiType": "MandatSimple_Type",
      "uid": "PM744635",
      "acteurRef": "PA736243",
      "typeOrgane": "CMP",
      "dateDebut": "2017-11-30T01:00:00.000+01:00",
      "datePublication": "2017-12-02T01:00:00.000+01:00",
      "dateFin": "2017-12-18T01:00:00.000+01:00",
      "preseance": "28",
      "nominPrincipale": "1",
      "infosQualite": {
        "codeQualite": "Suppléant",
        "libQualite": "Membre suppléant",
        "libQualiteSex": "Membre suppléant"
      },
      "organesRefs": [
        "PO744418"
      ]
    },
    {
      "xsiType": "MandatSimple_Type",
      "uid": "PM749370",
      "acteurRef": "PA736243",
      "typeOrgane": "CMP",
      "dateDebut": "2018-02-12T01:00:00.000+01:00",
      "datePublication": "2018-02-10T01:00:00.000+01:00",
      "dateFin": "2018-02-15T01:00:00.000+01:00",
      "preseance": "28",
      "nominPrincipale": "1",
      "infosQualite": {
        "codeQualite": "Suppléant",
        "libQualite": "Membre suppléant",
        "libQualiteSex": "Membre suppléant"
      },
      "organesRefs": [
        "PO749252"
      ]
    }
  ]
}