{
  "uid": "PA429851",
  "etatCivil": {
    "ident": {
      "civ": "M.",
      "prenom": "René-Paul",
      "nom": "Savary",
      "alpha": "SAVARY_RENE_PAUL_11097X"
    },
    "infoNaissance": {
      "dateNais": "1953-01-03T01:00:00.000+01:00"
    }
  },
  "mandats": [
    {
      "xsiType": "MandatParlementaire_type",
      "uid": "PM429959",
      "acteurRef": "PA429851",
      "typeOrgane": "SENAT",
      "dateDebut": "2011-10-01T02:00:00.000+02:00",
      "dateFin": "2017-10-01T02:00:00.000+02:00",
      "preseance": "20",
      "nominPrincipale": "1",
      "infosQualite": {
        "codeQualite": "Sénateur",
        "libQualite": "SENATEUR",
        "libQualiteSex": "SENATEUR"
      },
      "organesRefs": [
        "PO78718"
      ],
      "election": {
        "lieu": {
          "numDepartement": "51"
        }
      },
      "mandature": {}
    },
    {
      "xsiType": "MandatSimple_Type",
      "uid": "PM430270",
      "acteurRef": "PA429851",
      "typeOrgane": "COMSENAT",
      "dateDebut": "2011-10-01T02:00:00.000+02:00",
      "dateFin": "2014-10-08T02:00:00.000+02:00",
      "preseance": "10",
      "nominPrincipale": "1",
      "infosQualite": {
        "codeQualite": "Membre",
        "libQualite": "Membre",
        "libQualiteSex": "Membre"
      },
      "organesRefs": [
        "PO211493"
      ]
    },
    {
      "xsiType": "MandatSimple_Type",
      "uid": "PM430501",
      "acteurRef": "PA429851",
      "typeOrgane": "GROUPESENAT",
      "dateDebut": "2011-10-01T02:00:00.000+02:00",
      "preseance": "4",
      "nominPrincipale": "1",
      "infosQualite": {
        "codeQualite": "Membre",
        "libQualite": "Membre",
        "libQualiteSex": "Membre"
      },
      "organesRefs": [
        "PO286005"
      ]
    },
    {
      "xsiType": "MandatSimple_Type",
      "uid": "PM678781",
      "acteurRef": "PA429851",
      "typeOrgane": "CMP",
      "dateDebut": "2012-09-27T02:00:00.000+02:00",
      "datePublication": "2012-09-28T02:00:00.000+02:00",
      "dateFin": "2012-10-15T02:00:00.000+02:00",
      "preseance": "28",
      "nominPrincipale": "1",
      "infosQualite": {
        "codeQualite": "Suppléant",
        "libQualite": "Membre suppléant",
        "libQualiteSex": "Membre suppléant"
      },
      "organesRefs": [
        "PO678407"
      ]
    },
    {
      "xsiType": "MandatSimple_Type",
      "uid": "PM684593",
      "acteurRef": "PA429851",
      "typeOrgane": "CMP",
      "dateDebut": "2012-11-19T01:00:00.000+01:00",
      "datePublication": "2012-11-20T01:00:00.000+01:00",
      "dateFin": "2012-11-21T01:00:00.000+01:00",
      "preseance": "20",
      "nominPrincipale": "1",
      "infosQualite": {
        "codeQualite": "Titulaire",
        "libQualite": "Membre titulaire",
        "libQualiteSex": "Membre titulaire"
      },
      "organesRefs": [
        "PO684568"
      ]
    },
    {
      "xsiType": "MandatSimple_Type",
      "uid": "PM693313",
      "acteurRef": "PA429851",
      "typeOrgane": "CMP",
      "dateDebut": "2013-04-04T02:00:00.000+02:00",
      "datePublication": "2013-04-05T02:00:00.000+02:00",
      "dateFin": "2013-05-16T02:00:00.000+02:00",
      "preseance": "20",
      "nominPrincipale": "1",
      "infosQualite": {
        "codeQualite": "Titulaire",
        "libQualite": "Membre titulaire",
        "libQualiteSex": "Membre titulaire"
      },
      "organesRefs": [
        "PO693041"
      ]
    },
    {
      "xsiType": "MandatSimple_Type",
      "uid": "PM694029",
      "acteurRef": "PA429851",
      "typeOrgane": "CMP",
      "dateDebut": "2013-04-22T02:00:00.000+02:00",
      "datePublication": "2013-04-23T02:00:00.000+02:00",
      "dateFin": "2013-05-14T02:00:00.000+02:00",
      "preseance": "20",
      "nominPrincipale": "1",
      "infosQualite": {
        "codeQualite": "Titulaire",
        "libQualite": "Membre titulaire",
        "libQualiteSex": "Membre titulaire"
      },
      "organesRefs": [
        "PO694005"
      ]
    },
    {
      "xsiType": "MandatSimple_Type",
      "uid": "PM698265",
      "acteurRef": "PA429851",
      "typeOrgane": "CMP",
      "dateDebut": "2013-11-06T01:00:00.000+01:00",
      "datePublication": "2013-11-07T01:00:00.000+01:00",
      "dateFin": "2013-11-07T01:00:00.000+01:00",
      "preseance": "28",
      "nominPrincipale": "1",
      "infosQualite": {
        "codeQualite": "Suppléant",
        "libQualite": "Membre suppléant",
        "libQualiteSex": "Membre suppléant"
      },
      "organesRefs": [
        "PO698232"
      ]
    },
    {
      "xsiType": "MandatSimple_Type",
      "uid": "PM698561",
      "acteurRef": "PA429851",
      "typeOrgane": "CMP",
      "dateDebut": "2013-11-15T01:00:00.000+01:00",
      "datePublication": "2013-11-16T01:00:00.000+01:00",
      "dateFin": "2013-11-19T01:00:00.000+01:00",
      "preseance": "28",
      "nominPrincipale": "1",
      "infosQualite": {
        "codeQualite": "Suppléant",
        "libQualite": "Membre suppléant",
        "libQualiteSex": "Membre suppléant"
      },
      "organesRefs": [
        "PO698519"
      ]
    },
    {
      "xsiType": "MandatSimple_Type",
      "uid": "PM701573",
      "acteurRef": "PA429851",
      "typeOrgane": "CMP",
      "dateDebut": "2014-05-26T02:00:00.000+02:00",
      "datePublication": "2014-05-28T02:00:00.000+02:00",
      "dateFin": "2014-06-26T02:00:00.000+02:00",
      "preseance": "28",
      "nominPrincipale": "1",
      "infosQualite": {
        "codeQualite": "Suppléant",
        "libQualite": "Membre suppléant",
        "libQualiteSex": "Membre suppléant"
      },
      "organesRefs": [
        "PO701167"
      ]
    },
    {
      "xsiType": "MandatSimple_Type",
      "uid": "PM701595",
      "acteurRef": "PA429851",
      "typeOrgane": "CMP",
      "dateDebut": "2014-05-26T02:00:00.000+02:00",
      "datePublication": "2014-05-28T02:00:00.000+02:00",
      "dateFin": "2014-06-26T02:00:00.000+02:00",
      "preseance": "20",
      "nominPrincipale": "1",
      "infosQualite": {
        "codeQualite": "Titulaire",
        "libQualite": "Membre titulaire",
        "libQualiteSex": "Membre titulaire"
      },
      "organesRefs": [
        "PO701381"
      ]
    },
    {
      "xsiType": "MandatSimple_Type",
      "uid": "PM701828",
      "acteurRef": "PA429851",
      "typeOrgane": "CMP",
      "dateDebut": "2014-06-12T02:00:00.000+02:00",
      "datePublication": "2014-06-14T02:00:00.000+02:00",
      "dateFin": "2014-06-26T02:00:00.000+02:00",
      "preseance": "28",
      "nominPrincipale": "1",
      "infosQualite": {
        "codeQualite": "Suppléant",
        "libQualite": "Membre suppléant",
        "libQualiteSex": "Membre suppléant"
      },
      "organesRefs": [
        "PO701795"
      ]
    },
    {
      "xsiType": "MandatSimple_Type",
      "uid": "PM702621",
      "acteurRef": "PA429851",
      "typeOrgane": "CMP",
      "dateDebut": "2014-07-17T02:00:00.000+02:00",
      "datePublication": "2014-07-18T02:00:00.000+02:00",
      "dateFin": "2014-07-23T02:00:00.000+02:00",
      "preseance": "28",
      "nominPrincipale": "1",
      "infosQualite": {
        "codeQualite": "Suppléant",
        "libQualite": "Membre suppléant",
        "libQualiteSex": "Membre suppléant"
      },
      "organesRefs": [
        "PO702586"
      ]
    },
    {
      "xsiType": "MandatSimple_Type",
      "uid": "PM704228",
      "acteurRef": "PA429851",
      "typeOrgane": "COMSENAT",
      "dateDebut": "2014-10-09T02:00:00.000+02:00",
      "dateFin": "2017-10-04T02:00:00.000+02:00",
      "nominPrincipale": "1",
      "infosQualite": {
        "libQualite": "Secrétaire",
        "libQualiteSex": "Secrétaire"
      },
      "organesRefs": [
        "PO211493"
      ]
    },
    {
      "xsiType": "MandatSimple_Type",
      "uid": "PM704274",
      "acteurRef": "PA429851",
      "typeOrgane": "COMSPSENAT",
      "dateDebut": "2014-10-09T02:00:00.000+02:00",
      "dateFin": "2015-01-17T01:00:00.000+01:00",
      "nominPrincipale": "1",
      "infosQualite": {
        "libQualite": "Membre",
        "libQualiteSex": "Membre"
      },
      "organesRefs": [
        "PO701979"
      ]
    },
    {
      "xsiType": "MandatSimple_Type",
      "uid": "PM704639",
      "acteurRef": "PA429851",
      "typeOrgane": "CMP",
      "dateDebut": "2014-11-18T01:00:00.000+01:00",
      "datePublication": "2014-11-18T01:00:00.000+01:00",
      "dateFin": "2014-12-01T01:00:00.000+01:00",
      "preseance": "20",
      "nominPrincipale": "1",
      "infosQualite": {
        "codeQualite": "Titulaire",
        "libQualite": "Membre titulaire",
        "libQualiteSex": "Membre titulaire"
      },
      "organesRefs": [
        "PO704616"
      ]
    },
    {
      "xsiType": "MandatSimple_Type",
      "uid": "PM715517",
      "acteurRef": "PA429851",
      "typeOrgane": "CMP",
      "dateDebut": "2016-11-17T01:00:00.000+01:00",
      "datePublication": "2016-11-18T01:00:00.000+01:00",
      "dateFin": "2016-11-23T01:00:00.000+01:00",
      "preseance": "20",
      "nominPrincipale": "1",
      "infosQualite": {
        "codeQualite": "Titulaire",
        "libQualite": "Membre titulaire",
        "libQualiteSex": "Membre titulaire"
      },
      "organesRefs": [
        "PO715306"
      ]
    },
    {
      "xsiType": "MandatSimple_Type",
      "uid": "PM716567",
      "acteurRef": "PA429851",
      "typeOrgane": "CMP",
      "dateDebut": "2017-01-18T01:00:00.000+01:00",
      "datePublication": "2017-01-20T01:00:00.000+01:00",
      "dateFin": "2017-01-25T01:00:00.000+01:00",
      "preseance": "28",
      "nominPrincipale": "1",
      "infosQualite": {
        "codeQualite": "Suppléant",
        "libQualite": "Membre suppléant",
        "libQualiteSex": "Membre suppléant"
      },
      "organesRefs": [
        "PO716002"
      ]
    },
    {
      "xsiType": "MandatSimple_Type",
      "uid": "PM733983",
      "acteurRef": "PA429851",
      "typeOrgane": "CMP",
      "dateDebut": "2017-07-26T02:00:00.000+02:00",
      "datePublication": "2017-07-28T02:00:00.000+02:00",
      "dateFin": "2017-07-31T02:00:00.000+02:00",
      "preseance": "28",
      "nominPrincipale": "1",
      "infosQualite": {
        "codeQualite": "Suppléant",
        "libQualite": "Membre suppléant",
        "libQualiteSex": "Membre suppléant"
      },
      "organesRefs": [
        "PO733907"
      ]
    },
    {
      "xsiType": "MandatParlementaire_type",
      "uid": "PM736305",
      "acteurRef": "PA429851",
      "typeOrgane": "SENAT",
      "dateDebut": "2017-10-02T02:00:00.000+02:00",
      "preseance": "20",
      "nominPrincipale": "1",
      "infosQualite": {
        "codeQualite": "Sénateur",
        "libQualite": "SENATEUR",
        "libQualiteSex": "SENATEUR"
      },
      "organesRefs": [
        "PO78718"
      ],
      "election": {
        "lieu": {
          "numDepartement": "51"
        }
      },
      "mandature": {}
    },
    {
      "xsiType": "MandatSimple_Type",
      "uid": "PM741278",
      "acteurRef": "PA429851",
      "typeOrgane": "COMSENAT",
      "dateDebut": "2017-10-05T02:00:00.000+02:00",
      "nominPrincipale": "1",
      "infosQualite": {
        "libQualite": "Vice-Président",
        "libQualiteSex": "Vice-Président"
      },
      "organesRefs": [
        "PO211493"
      ]
    },
    {
      "xsiType": "MandatSimple_Type",
      "uid": "PM741362",
      "acteurRef": "PA429851",
      "typeOrgane": "DELEGSENAT",
      "dateDebut": "2017-10-18T02:00:00.000+02:00",
      "preseance": "4",
      "nominPrincipale": "1",
      "infosQualite": {
        "codeQualite": "Membre",
        "libQualite": "Membre",
        "libQualiteSex": "Membre"
      },
      "organesRefs": [
        "PO420388"
      ]
    },
    {
      "xsiType": "MandatSimple_Type",
      "uid": "PM742183",
      "acteurRef": "PA429851",
      "typeOrgane": "DELEGSENAT",
      "dateDebut": "2017-10-26T02:00:00.000+02:00",
      "nominPrincipale": "1",
      "infosQualite": {
        "libQualite": "Vice-Président",
        "libQualiteSex": "Vice-Président"
      },
      "organesRefs": [
        "PO420388"
      ]
    },
    {
      "xsiType": "MandatSimple_Type",
      "uid": "PM743692",
      "acteurRef": "PA429851",
      "typeOrgane": "CMP",
      "dateDebut": "2017-11-17T01:00:00.000+01:00",
      "datePublication": "2017-11-22T01:00:00.000+01:00",
      "dateFin": "2017-12-22T01:00:00.000+01:00",
      "preseance": "20",
      "nominPrincipale": "1",
      "infosQualite": {
        "codeQualite": "Titulaire",
        "libQualite": "Membre titulaire",
        "libQualiteSex": "Membre titulaire"
      },
      "organesRefs": [
        "PO743571"
      ]
    },
    {
      "xsiType": "MandatSimple_Type",
      "uid": "PM744569",
      "acteurRef": "PA429851",
      "typeOrgane": "CMP",
      "dateDebut": "2017-11-30T01:00:00.000+01:00",
      "datePublication": "2017-12-01T01:00:00.000+01:00",
      "dateFin": "2017-12-20T01:00:00.000+01:00",
      "preseance": "28",
      "nominPrincipale": "1",
      "infosQualite": {
        "codeQualite": "Suppléant",
        "libQualite": "Membre suppléant",
        "libQualiteSex": "Membre suppléant"
      },
      "organesRefs": [
        "PO739840"
      ]
    },
    {
      "xsiType": "MandatSimple_Type",
      "uid": "PM744596",
      "acteurRef": "PA429851",
      "typeOrgane": "CMP",
      "dateDebut": "2017-11-30T01:00:00.000+01:00",
      "datePublication": "2017-12-01T01:00:00.000+01:00",
      "dateFin": "2018-02-15T01:00:00.000+01:00",
      "preseance": "28",
      "nominPrincipale": "1",
      "infosQualite": {
        "codeQualite": "Suppléant",
        "libQualite": "Membre suppléant",
        "libQualiteSex": "Membre suppléant"
      },
      "organesRefs": [
        "PO739847"
      ]
    }
  ]
}