{
  "xsiType": "OrganeExterne_Type",
  "uid": "PO744086",
  "codeType": "MINISTERE",
  "libelle": "Secrétariat d'État, auprès du ministre de l'action et des comptes publics",
  "libelleEdition": ", auprès du ministre de l'action et des comptes publics",
  "libelleAbrege": "Action et comptes publics (M. le SE auprès du ministre)",
  "libelleAbrev": "CPA",
  "viMoDe": {
    "dateDebut": "2017-11-25T01:00:00.000+01:00"
  }
}