{
  "uid": "PA602",
  "etatCivil": {
    "ident": {
      "civ": "M.",
      "prenom": "Jean-Claude",
      "nom": "Boulard",
      "alpha": "BOULARD_Jean_Claude"
    },
    "infoNaissance": {
      "dateNais": "1943-03-28T01:00:00.000+01:00",
      "villeNais": "Nantes",
      "depNais": "Loire-Atlantique"
    }
  },
  "mandats": [
    {
      "xsiType": "MandatParlementaire_type",
      "uid": "PM703581",
      "acteurRef": "PA602",
      "typeOrgane": "SENAT",
      "dateDebut": "2014-10-01T02:00:00.000+02:00",
      "dateFin": "2017-09-30T02:00:00.000+02:00",
      "preseance": "20",
      "nominPrincipale": "1",
      "infosQualite": {
        "codeQualite": "Sénateur",
        "libQualite": "SENATEUR",
        "libQualiteSex": "SENATEUR"
      },
      "organesRefs": [
        "PO78718"
      ],
      "election": {
        "lieu": {
          "numDepartement": "72"
        }
      },
      "mandature": {}
    },
    {
      "xsiType": "MandatSimple_Type",
      "uid": "PM703900",
      "acteurRef": "PA602",
      "typeOrgane": "GROUPESENAT",
      "dateDebut": "2014-10-07T02:00:00.000+02:00",
      "dateFin": "2017-07-10T02:00:00.000+02:00",
      "preseance": "4",
      "nominPrincipale": "1",
      "infosQualite": {
        "codeQualite": "Membre",
        "libQualite": "Membre",
        "libQualiteSex": "Membre"
      },
      "organesRefs": [
        "PO77710"
      ]
    },
    {
      "xsiType": "MandatSimple_Type",
      "uid": "PM703986",
      "acteurRef": "PA602",
      "typeOrgane": "COMSENAT",
      "dateDebut": "2014-10-08T02:00:00.000+02:00",
      "dateFin": "2017-09-30T02:00:00.000+02:00",
      "preseance": "10",
      "nominPrincipale": "1",
      "infosQualite": {
        "codeQualite": "Membre",
        "libQualite": "Membre",
        "libQualiteSex": "Membre"
      },
      "organesRefs": [
        "PO211494"
      ]
    },
    {
      "xsiType": "MandatSimple_Type",
      "uid": "PM732813",
      "acteurRef": "PA602",
      "typeOrgane": "GROUPESENAT",
      "dateDebut": "2017-07-11T02:00:00.000+02:00",
      "dateFin": "2017-09-30T02:00:00.000+02:00",
      "preseance": "4",
      "nominPrincipale": "1",
      "infosQualite": {
        "codeQualite": "Membre",
        "libQualite": "Membre",
        "libQualiteSex": "Membre"
      },
      "organesRefs": [
        "PO732421"
      ]
    }
  ]
}