{
  "xsiType": "OrganeExterne_Type",
  "uid": "PO591192",
  "codeType": "MINISTERE",
  "libelle": "Ministère de la défense",
  "libelleEdition": "Ministère de la défense",
  "libelleAbrege": "Défense",
  "libelleAbrev": "DEF",
  "viMoDe": {
    "dateDebut": "2012-05-17T02:00:00.000+02:00",
    "dateFin": "2012-06-18T02:00:00.000+02:00"
  }
}