{
  "uid": "PA333134",
  "etatCivil": {
    "ident": {
      "civ": "M.",
      "prenom": "Guénhaël",
      "nom": "Huet",
      "alpha": "Huet"
    },
    "infoNaissance": {
      "dateNais": "1956-07-30T01:00:00.000+01:00",
      "villeNais": "Locmariaquer",
      "depNais": "Morbihan",
      "paysNais": "France"
    }
  },
  "mandats": [
    {
      "xsiType": "MandatParlementaire_type",
      "uid": "PM645341",
      "acteurRef": "PA333134",
      "legislature": "14",
      "typeOrgane": "ASSEMBLEE",
      "dateDebut": "2012-06-20T02:00:00.000+02:00",
      "dateFin": "2017-06-20T02:00:00.000+02:00",
      "preseance": "50",
      "nominPrincipale": "1",
      "infosQualite": {
        "codeQualite": "membre",
        "libQualite": "membre",
        "libQualiteSex": "membre"
      },
      "organesRefs": [
        "PO644420"
      ],
      "suppleant": {
        "dateDebut": "2012-06-20T02:00:00.000+02:00",
        "dateFin": "2017-06-20T02:00:00.000+02:00",
        "suppleantRef": "PA643136"
      },
      "election": {
        "lieu": {
          "region": "Normandie",
          "regionType": "Métropolitain",
          "departement": "Manche",
          "numDepartement": "50",
          "numCirco": "2"
        },
        "causeMandat": "élections générales",
        "refCirconscription": "PO644654"
      },
      "mandature": {
        "datePriseFonction": "2012-06-20T02:00:00.000+02:00",
        "causeFin": "Fin de législature",
        "premiereElection": "1"
      }
    },
    {
      "xsiType": "MandatSimple_Type",
      "uid": "PM656413",
      "acteurRef": "PA333134",
      "legislature": "14",
      "typeOrgane": "GP",
      "dateDebut": "2012-06-26T02:00:00.000+02:00",
      "datePublication": "2012-06-27T02:00:00.000+02:00",
      "dateFin": "2015-06-01T02:00:00.000+02:00",
      "preseance": "20",
      "nominPrincipale": "1",
      "infosQualite": {
        "codeQualite": "Membre",
        "libQualite": "Membre du",
        "libQualiteSex": "Membre du"
      },
      "organesRefs": [
        "PO656006"
      ]
    },
    {
      "xsiType": "MandatSimple_Type",
      "uid": "PM657030",
      "acteurRef": "PA333134",
      "legislature": "14",
      "typeOrgane": "COMPER",
      "dateDebut": "2012-06-28T02:00:00.000+02:00",
      "datePublication": "2012-06-28T02:00:00.000+02:00",
      "dateFin": "2017-06-20T02:00:00.000+02:00",
      "preseance": "32",
      "nominPrincipale": "1",
      "infosQualite": {
        "codeQualite": "Membre",
        "libQualite": "Membre",
        "libQualiteSex": "Membre"
      },
      "organesRefs": [
        "PO419604"
      ]
    },
    {
      "xsiType": "MandatSimple_Type",
      "uid": "PM663927",
      "acteurRef": "PA333134",
      "legislature": "14",
      "typeOrgane": "DELEG",
      "dateDebut": "2012-07-04T02:00:00.000+02:00",
      "datePublication": "2012-07-04T02:00:00.000+02:00",
      "dateFin": "2013-02-15T01:00:00.000+01:00",
      "preseance": "20",
      "nominPrincipale": "1",
      "infosQualite": {
        "codeQualite": "Membre",
        "libQualite": "Membre",
        "libQualiteSex": "Membre"
      },
      "organesRefs": [
        "PO201269"
      ]
    },
    {
      "xsiType": "MandatSimple_Type",
      "uid": "PM676950",
      "acteurRef": "PA333134",
      "legislature": "14",
      "typeOrgane": "DELEG",
      "dateDebut": "2012-07-25T02:00:00.000+02:00",
      "datePublication": "2012-07-25T02:00:00.000+02:00",
      "dateFin": "2017-06-20T02:00:00.000+02:00",
      "preseance": "20",
      "nominPrincipale": "1",
      "infosQualite": {
        "codeQualite": "Membre",
        "libQualite": "Membre",
        "libQualiteSex": "Membre"
      },
      "organesRefs": [
        "PO675659"
      ]
    },
    {
      "xsiType": "MandatSimple_Type",
      "uid": "PM681815",
      "acteurRef": "PA333134",
      "legislature": "14",
      "typeOrgane": "GA",
      "dateDebut": "2012-10-16T02:00:00.000+02:00",
      "dateFin": "2017-06-20T02:00:00.000+02:00",
      "preseance": "20",
      "nominPrincipale": "1",
      "infosQualite": {
        "codeQualite": "Membre",
        "libQualite": "Membre",
        "libQualiteSex": "Membre"
      },
      "organesRefs": [
        "PO675847"
      ]
    },
    {
      "xsiType": "MandatSimple_Type",
      "uid": "PM681816",
      "acteurRef": "PA333134",
      "legislature": "14",
      "typeOrgane": "GA",
      "dateDebut": "2012-10-16T02:00:00.000+02:00",
      "dateFin": "2017-06-20T02:00:00.000+02:00",
      "preseance": "20",
      "nominPrincipale": "1",
      "infosQualite": {
        "codeQualite": "Membre",
        "libQualite": "Membre",
        "libQualiteSex": "Membre"
      },
      "organesRefs": [
        "PO675740"
      ]
    },
    {
      "xsiType": "MandatSimple_Type",
      "uid": "PM681817",
      "acteurRef": "PA333134",
      "legislature": "14",
      "typeOrgane": "GA",
      "dateDebut": "2012-10-16T02:00:00.000+02:00",
      "dateFin": "2017-06-20T02:00:00.000+02:00",
      "preseance": "20",
      "nominPrincipale": "1",
      "infosQualite": {
        "codeQualite": "Membre",
        "libQualite": "Membre",
        "libQualiteSex": "Membre"
      },
      "organesRefs": [
        "PO675813"
      ]
    },
    {
      "xsiType": "MandatSimple_Type",
      "uid": "PM681818",
      "acteurRef": "PA333134",
      "legislature": "14",
      "typeOrgane": "GA",
      "dateDebut": "2012-10-16T02:00:00.000+02:00",
      "dateFin": "2017-06-20T02:00:00.000+02:00",
      "preseance": "20",
      "nominPrincipale": "1",
      "infosQualite": {
        "codeQualite": "Membre",
        "libQualite": "Membre",
        "libQualiteSex": "Membre"
      },
      "organesRefs": [
        "PO675839"
      ]
    },
    {
      "xsiType": "MandatSimple_Type",
      "uid": "PM681819",
      "acteurRef": "PA333134",
      "legislature": "14",
      "typeOrgane": "GA",
      "dateDebut": "2012-10-16T02:00:00.000+02:00",
      "dateFin": "2017-06-20T02:00:00.000+02:00",
      "preseance": "20",
      "nominPrincipale": "1",
      "infosQualite": {
        "codeQualite": "Membre",
        "libQualite": "Membre",
        "libQualiteSex": "Membre"
      },
      "organesRefs": [
        "PO675770"
      ]
    },
    {
      "xsiType": "MandatSimple_Type",
      "uid": "PM681820",
      "acteurRef": "PA333134",
      "legislature": "14",
      "typeOrgane": "GA",
      "dateDebut": "2012-10-16T02:00:00.000+02:00",
      "dateFin": "2017-06-20T02:00:00.000+02:00",
      "preseance": "20",
      "nominPrincipale": "1",
      "infosQualite": {
        "codeQualite": "Membre",
        "libQualite": "Membre",
        "libQualiteSex": "Membre"
      },
      "organesRefs": [
        "PO675691"
      ]
    },
    {
      "xsiType": "MandatSimple_Type",
      "uid": "PM681942",
      "acteurRef": "PA333134",
      "legislature": "14",
      "typeOrgane": "ORGAINT",
      "dateDebut": "2012-10-16T02:00:00.000+02:00",
      "dateFin": "2017-06-20T02:00:00.000+02:00",
      "preseance": "42",
      "nominPrincipale": "1",
      "infosQualite": {
        "codeQualite": "Membre",
        "libQualite": "Membre",
        "libQualiteSex": "Membre"
      },
      "organesRefs": [
        "PO201115"
      ]
    },
    {
      "xsiType": "MandatSimple_Type",
      "uid": "PM682402",
      "acteurRef": "PA333134",
      "legislature": "14",
      "typeOrgane": "GEVI",
      "dateDebut": "2012-10-17T02:00:00.000+02:00",
      "dateFin": "2017-06-20T02:00:00.000+02:00",
      "preseance": "20",
      "nominPrincipale": "1",
      "infosQualite": {
        "codeQualite": "Membre",
        "libQualite": "Membre",
        "libQualiteSex": "Membre"
      },
      "organesRefs": [
        "PO675743"
      ]
    },
    {
      "xsiType": "MandatSimple_Type",
      "uid": "PM684665",
      "acteurRef": "PA333134",
      "legislature": "14",
      "typeOrgane": "GA",
      "dateDebut": "2012-11-20T01:00:00.000+01:00",
      "dateFin": "2017-06-20T02:00:00.000+02:00",
      "preseance": "8",
      "nominPrincipale": "1",
      "infosQualite": {
        "codeQualite": "Vice-Président",
        "libQualite": "Vice-Président",
        "libQualiteSex": "Vice-Président"
      },
      "organesRefs": [
        "PO675740"
      ]
    },
    {
      "xsiType": "MandatSimple_Type",
      "uid": "PM685511",
      "acteurRef": "PA333134",
      "typeOrgane": "PARPOL",
      "dateDebut": "2012-12-01T01:00:00.000+01:00",
      "dateFin": "2015-11-30T01:00:00.000+01:00",
      "preseance": "5",
      "nominPrincipale": "1",
      "infosQualite": {
        "codeQualite": "Membre",
        "libQualite": "Membre",
        "libQualiteSex": "Membre"
      },
      "organesRefs": [
        "PO684942"
      ]
    },
    {
      "xsiType": "MandatSimple_Type",
      "uid": "PM686832",
      "acteurRef": "PA333134",
      "legislature": "14",
      "typeOrgane": "GE",
      "dateDebut": "2012-12-13T01:00:00.000+01:00",
      "dateFin": "2017-06-20T02:00:00.000+02:00",
      "preseance": "20",
      "nominPrincipale": "0",
      "infosQualite": {
        "codeQualite": "Membre",
        "libQualite": "Membre",
        "libQualiteSex": "Membre"
      },
      "organesRefs": [
        "PO686826"
      ]
    },
    {
      "xsiType": "MandatSimple_Type",
      "uid": "PM686833",
      "acteurRef": "PA333134",
      "legislature": "14",
      "typeOrgane": "GE",
      "dateDebut": "2012-12-13T01:00:00.000+01:00",
      "dateFin": "2017-06-20T02:00:00.000+02:00",
      "preseance": "1",
      "nominPrincipale": "1",
      "infosQualite": {
        "codeQualite": "Président",
        "libQualite": "Président",
        "libQualiteSex": "Président"
      },
      "organesRefs": [
        "PO686826"
      ]
    },
    {
      "xsiType": "MandatSimple_Type",
      "uid": "PM687496",
      "acteurRef": "PA333134",
      "legislature": "14",
      "typeOrgane": "GA",
      "dateDebut": "2012-12-04T01:00:00.000+01:00",
      "dateFin": "2017-06-20T02:00:00.000+02:00",
      "preseance": "8",
      "nominPrincipale": "1",
      "infosQualite": {
        "codeQualite": "Vice-Président",
        "libQualite": "Vice-Président",
        "libQualiteSex": "Vice-Président"
      },
      "organesRefs": [
        "PO675770"
      ]
    },
    {
      "xsiType": "MandatSimple_Type",
      "uid": "PM687638",
      "acteurRef": "PA333134",
      "legislature": "14",
      "typeOrgane": "ORGEXTPARL",
      "dateDebut": "2013-01-07T01:00:00.000+01:00",
      "datePublication": "2013-01-08T01:00:00.000+01:00",
      "dateFin": "2013-02-13T01:00:00.000+01:00",
      "preseance": "20",
      "nominPrincipale": "1",
      "infosQualite": {
        "codeQualite": "Titulaire",
        "libQualite": "Membre titulaire",
        "libQualiteSex": "Membre titulaire"
      },
      "organesRefs": [
        "PO687635"
      ]
    },
    {
      "xsiType": "MandatSimple_Type",
      "uid": "PM687785",
      "acteurRef": "PA333134",
      "legislature": "14",
      "typeOrgane": "GE",
      "dateDebut": "2013-01-15T01:00:00.000+01:00",
      "dateFin": "2017-06-20T02:00:00.000+02:00",
      "preseance": "20",
      "nominPrincipale": "1",
      "infosQualite": {
        "codeQualite": "Membre",
        "libQualite": "Membre",
        "libQualiteSex": "Membre"
      },
      "organesRefs": [
        "PO686415"
      ]
    },
    {
      "xsiType": "MandatSimple_Type",
      "uid": "PM687847",
      "acteurRef": "PA333134",
      "legislature": "14",
      "typeOrgane": "GE",
      "dateDebut": "2013-01-14T01:00:00.000+01:00",
      "dateFin": "2017-06-20T02:00:00.000+02:00",
      "preseance": "20",
      "nominPrincipale": "1",
      "infosQualite": {
        "codeQualite": "Membre",
        "libQualite": "Membre",
        "libQualiteSex": "Membre"
      },
      "organesRefs": [
        "PO686258"
      ]
    },
    {
      "xsiType": "MandatSimple_Type",
      "uid": "PM688571",
      "acteurRef": "PA333134",
      "legislature": "14",
      "typeOrgane": "GA",
      "dateDebut": "2012-12-11T01:00:00.000+01:00",
      "dateFin": "2017-06-20T02:00:00.000+02:00",
      "preseance": "8",
      "nominPrincipale": "1",
      "infosQualite": {
        "codeQualite": "Vice-Président",
        "libQualite": "Vice-Président",
        "libQualiteSex": "Vice-Président"
      },
      "organesRefs": [
        "PO675847"
      ]
    },
    {
      "xsiType": "MandatSimple_Type",
      "uid": "PM689124",
      "acteurRef": "PA333134",
      "legislature": "14",
      "typeOrgane": "GE",
      "dateDebut": "2013-01-17T01:00:00.000+01:00",
      "dateFin": "2017-06-20T02:00:00.000+02:00",
      "preseance": "20",
      "nominPrincipale": "1",
      "infosQualite": {
        "codeQualite": "Membre",
        "libQualite": "Membre",
        "libQualiteSex": "Membre"
      },
      "organesRefs": [
        "PO686617"
      ]
    },
    {
      "xsiType": "MandatSimple_Type",
      "uid": "PM689494",
      "acteurRef": "PA333134",
      "legislature": "14",
      "typeOrgane": "GE",
      "dateDebut": "2013-01-23T01:00:00.000+01:00",
      "dateFin": "2017-06-20T02:00:00.000+02:00",
      "preseance": "20",
      "nominPrincipale": "1",
      "infosQualite": {
        "codeQualite": "Membre",
        "libQualite": "Membre",
        "libQualiteSex": "Membre"
      },
      "organesRefs": [
        "PO687109"
      ]
    },
    {
      "xsiType": "MandatSimple_Type",
      "uid": "PM689671",
      "acteurRef": "PA333134",
      "legislature": "14",
      "typeOrgane": "GE",
      "dateDebut": "2013-01-30T01:00:00.000+01:00",
      "dateFin": "2017-06-20T02:00:00.000+02:00",
      "preseance": "20",
      "nominPrincipale": "1",
      "infosQualite": {
        "codeQualite": "Membre",
        "libQualite": "Membre",
        "libQualiteSex": "Membre"
      },
      "organesRefs": [
        "PO686785"
      ]
    },
    {
      "xsiType": "MandatSimple_Type",
      "uid": "PM689842",
      "acteurRef": "PA333134",
      "legislature": "14",
      "typeOrgane": "GE",
      "dateDebut": "2013-01-31T01:00:00.000+01:00",
      "dateFin": "2017-06-20T02:00:00.000+02:00",
      "preseance": "20",
      "nominPrincipale": "1",
      "infosQualite": {
        "codeQualite": "Membre",
        "libQualite": "Membre",
        "libQualiteSex": "Membre"
      },
      "organesRefs": [
        "PO686284"
      ]
    },
    {
      "xsiType": "MandatSimple_Type",
      "uid": "PM690482",
      "acteurRef": "PA333134",
      "legislature": "14",
      "typeOrgane": "GE",
      "dateDebut": "2013-01-23T01:00:00.000+01:00",
      "dateFin": "2017-06-20T02:00:00.000+02:00",
      "preseance": "20",
      "nominPrincipale": "0",
      "infosQualite": {
        "codeQualite": "Membre",
        "libQualite": "Membre",
        "libQualiteSex": "Membre"
      },
      "organesRefs": [
        "PO686337"
      ]
    },
    {
      "xsiType": "MandatSimple_Type",
      "uid": "PM690533",
      "acteurRef": "PA333134",
      "legislature": "14",
      "typeOrgane": "GE",
      "dateDebut": "2013-01-29T01:00:00.000+01:00",
      "dateFin": "2017-06-20T02:00:00.000+02:00",
      "preseance": "20",
      "nominPrincipale": "1",
      "infosQualite": {
        "codeQualite": "Membre",
        "libQualite": "Membre",
        "libQualiteSex": "Membre"
      },
      "organesRefs": [
        "PO686861"
      ]
    },
    {
      "xsiType": "MandatSimple_Type",
      "uid": "PM690575",
      "acteurRef": "PA333134",
      "legislature": "14",
      "typeOrgane": "GE",
      "dateDebut": "2013-01-23T01:00:00.000+01:00",
      "dateFin": "2017-06-20T02:00:00.000+02:00",
      "preseance": "12",
      "nominPrincipale": "1",
      "infosQualite": {
        "codeQualite": "Secrétaire",
        "libQualite": "Secrétaire",
        "libQualiteSex": "Secrétaire"
      },
      "organesRefs": [
        "PO686337"
      ]
    },
    {
      "xsiType": "MandatSimple_Type",
      "uid": "PM690941",
      "acteurRef": "PA333134",
      "legislature": "14",
      "typeOrgane": "GE",
      "dateDebut": "2013-02-08T01:00:00.000+01:00",
      "dateFin": "2017-06-20T02:00:00.000+02:00",
      "preseance": "20",
      "nominPrincipale": "1",
      "infosQualite": {
        "codeQualite": "Membre",
        "libQualite": "Membre",
        "libQualiteSex": "Membre"
      },
      "organesRefs": [
        "PO686776"
      ]
    },
    {
      "xsiType": "MandatSimple_Type",
      "uid": "PM691689",
      "acteurRef": "PA333134",
      "legislature": "14",
      "typeOrgane": "GE",
      "dateDebut": "2013-02-20T01:00:00.000+01:00",
      "dateFin": "2017-06-20T02:00:00.000+02:00",
      "preseance": "8",
      "nominPrincipale": "1",
      "infosQualite": {
        "codeQualite": "Vice-Président",
        "libQualite": "Vice-Président",
        "libQualiteSex": "Vice-Président"
      },
      "organesRefs": [
        "PO686776"
      ]
    },
    {
      "xsiType": "MandatSimple_Type",
      "uid": "PM692364",
      "acteurRef": "PA333134",
      "legislature": "14",
      "typeOrgane": "GE",
      "dateDebut": "2013-02-26T01:00:00.000+01:00",
      "dateFin": "2017-06-20T02:00:00.000+02:00",
      "preseance": "20",
      "nominPrincipale": "1",
      "infosQualite": {
        "codeQualite": "Membre",
        "libQualite": "Membre",
        "libQualiteSex": "Membre"
      },
      "organesRefs": [
        "PO688348"
      ]
    },
    {
      "xsiType": "MandatSimple_Type",
      "uid": "PM692522",
      "acteurRef": "PA333134",
      "legislature": "14",
      "typeOrgane": "GE",
      "dateDebut": "2013-02-19T01:00:00.000+01:00",
      "dateFin": "2017-06-20T02:00:00.000+02:00",
      "preseance": "20",
      "nominPrincipale": "1",
      "infosQualite": {
        "codeQualite": "Membre",
        "libQualite": "Membre",
        "libQualiteSex": "Membre"
      },
      "organesRefs": [
        "PO686767"
      ]
    },
    {
      "xsiType": "MandatSimple_Type",
      "uid": "PM692796",
      "acteurRef": "PA333134",
      "legislature": "14",
      "typeOrgane": "GE",
      "dateDebut": "2013-03-19T01:00:00.000+01:00",
      "dateFin": "2017-06-20T02:00:00.000+02:00",
      "preseance": "20",
      "nominPrincipale": "1",
      "infosQualite": {
        "codeQualite": "Membre",
        "libQualite": "Membre",
        "libQualiteSex": "Membre"
      },
      "organesRefs": [
        "PO686818"
      ]
    },
    {
      "xsiType": "MandatMission_Type",
      "uid": "PM695925",
      "acteurRef": "PA333134",
      "legislature": "14",
      "typeOrgane": "MISINFOCOM",
      "dateDebut": "2013-07-09T02:00:00.000+02:00",
      "datePublication": "2013-07-09T02:00:00.000+02:00",
      "dateFin": "2013-07-11T02:00:00.000+02:00",
      "preseance": "20",
      "nominPrincipale": "0",
      "infosQualite": {
        "codeQualite": "Membre",
        "libQualite": "Membre",
        "libQualiteSex": "Membre"
      },
      "organesRefs": [
        "PO695919"
      ]
    },
    {
      "xsiType": "MandatMission_Type",
      "uid": "PM696879",
      "acteurRef": "PA333134",
      "legislature": "14",
      "typeOrgane": "MISINFOCOM",
      "dateDebut": "2013-07-09T02:00:00.000+02:00",
      "dateFin": "2013-07-11T02:00:00.000+02:00",
      "preseance": "16",
      "nominPrincipale": "1",
      "infosQualite": {
        "codeQualite": "Rapporteur",
        "libQualite": "Rapporteur",
        "libQualiteSex": "Rapporteur"
      },
      "organesRefs": [
        "PO695919"
      ]
    },
    {
      "xsiType": "MandatSimple_Type",
      "uid": "PM697970",
      "acteurRef": "PA333134",
      "legislature": "14",
      "typeOrgane": "CNPS",
      "dateDebut": "2013-10-22T02:00:00.000+02:00",
      "datePublication": "2013-10-22T02:00:00.000+02:00",
      "dateFin": "2016-04-14T02:00:00.000+02:00",
      "preseance": "20",
      "nominPrincipale": "1",
      "infosQualite": {
        "codeQualite": "Membre",
        "libQualite": "Membre",
        "libQualiteSex": "Membre"
      },
      "organesRefs": [
        "PO697810"
      ]
    },
    {
      "xsiType": "MandatSimple_Type",
      "uid": "PM698404",
      "acteurRef": "PA333134",
      "legislature": "14",
      "typeOrgane": "GE",
      "dateDebut": "2013-11-12T01:00:00.000+01:00",
      "dateFin": "2017-06-20T02:00:00.000+02:00",
      "preseance": "20",
      "nominPrincipale": "1",
      "infosQualite": {
        "codeQualite": "Membre",
        "libQualite": "Membre",
        "libQualiteSex": "Membre"
      },
      "organesRefs": [
        "PO695575"
      ]
    },
    {
      "xsiType": "MandatMission_Type",
      "uid": "PM698730",
      "acteurRef": "PA333134",
      "legislature": "14",
      "typeOrgane": "MISINFOPRE",
      "dateDebut": "2013-11-26T01:00:00.000+01:00",
      "datePublication": "2013-11-28T01:00:00.000+01:00",
      "dateFin": "2014-05-14T02:00:00.000+02:00",
      "preseance": "20",
      "nominPrincipale": "1",
      "infosQualite": {
        "codeQualite": "Membre",
        "libQualite": "Membre",
        "libQualiteSex": "Membre"
      },
      "organesRefs": [
        "PO698717"
      ]
    },
    {
      "xsiType": "MandatSimple_Type",
      "uid": "PM701754",
      "acteurRef": "PA333134",
      "legislature": "14",
      "typeOrgane": "CNPE",
      "dateDebut": "2014-06-06T02:00:00.000+02:00",
      "datePublication": "2014-06-07T02:00:00.000+02:00",
      "dateFin": "2014-11-20T01:00:00.000+01:00",
      "preseance": "20",
      "nominPrincipale": "1",
      "infosQualite": {
        "codeQualite": "Membre",
        "libQualite": "Membre",
        "libQualiteSex": "Membre"
      },
      "organesRefs": [
        "PO701630"
      ]
    },
    {
      "xsiType": "MandatSimple_Type",
      "uid": "PM701917",
      "acteurRef": "PA333134",
      "legislature": "14",
      "typeOrgane": "CNPE",
      "dateDebut": "2014-06-23T02:00:00.000+02:00",
      "datePublication": "2014-06-24T02:00:00.000+02:00",
      "dateFin": "2015-01-06T01:00:00.000+01:00",
      "preseance": "20",
      "nominPrincipale": "1",
      "infosQualite": {
        "codeQualite": "Membre",
        "libQualite": "Membre",
        "libQualiteSex": "Membre"
      },
      "organesRefs": [
        "PO701903"
      ]
    },
    {
      "xsiType": "MandatSimple_Type",
      "uid": "PM703074",
      "acteurRef": "PA333134",
      "legislature": "14",
      "typeOrgane": "CNPS",
      "dateDebut": "2014-09-02T02:00:00.000+02:00",
      "datePublication": "2014-09-03T02:00:00.000+02:00",
      "dateFin": "2015-08-18T02:00:00.000+02:00",
      "preseance": "20",
      "nominPrincipale": "1",
      "infosQualite": {
        "codeQualite": "Membre",
        "libQualite": "Membre",
        "libQualiteSex": "Membre"
      },
      "organesRefs": [
        "PO702808"
      ]
    },
    {
      "xsiType": "MandatSimple_Type",
      "uid": "PM705358",
      "acteurRef": "PA333134",
      "legislature": "14",
      "typeOrgane": "CNPS",
      "dateDebut": "2014-12-13T01:00:00.000+01:00",
      "datePublication": "2014-12-13T01:00:00.000+01:00",
      "dateFin": "2015-08-07T02:00:00.000+02:00",
      "preseance": "20",
      "nominPrincipale": "1",
      "infosQualite": {
        "codeQualite": "Membre",
        "libQualite": "Membre",
        "libQualiteSex": "Membre"
      },
      "organesRefs": [
        "PO704848"
      ]
    },
    {
      "xsiType": "MandatSimple_Type",
      "uid": "PM705673",
      "acteurRef": "PA333134",
      "legislature": "14",
      "typeOrgane": "CMP",
      "dateDebut": "2015-01-13T01:00:00.000+01:00",
      "datePublication": "2015-01-15T01:00:00.000+01:00",
      "dateFin": "2015-02-10T01:00:00.000+01:00",
      "preseance": "20",
      "nominPrincipale": "1",
      "infosQualite": {
        "codeQualite": "Titulaire",
        "libQualite": "Membre titulaire",
        "libQualiteSex": "Membre titulaire"
      },
      "organesRefs": [
        "PO705602"
      ]
    },
    {
      "xsiType": "MandatMission_Type",
      "uid": "PM707415",
      "acteurRef": "PA333134",
      "legislature": "14",
      "typeOrgane": "MISINFO",
      "dateDebut": "2014-12-17T01:00:00.000+01:00",
      "dateFin": "2015-07-08T02:00:00.000+02:00",
      "preseance": "10",
      "nominPrincipale": "1",
      "infosQualite": {
        "codeQualite": "Membre",
        "libQualite": "Membre",
        "libQualiteSex": "Membre"
      },
      "organesRefs": [
        "PO707403"
      ]
    },
    {
      "xsiType": "MandatSimple_Type",
      "uid": "PM708116",
      "acteurRef": "PA333134",
      "legislature": "14",
      "typeOrgane": "GP",
      "dateDebut": "2015-06-02T02:00:00.000+02:00",
      "datePublication": "2015-06-02T02:00:00.000+02:00",
      "dateFin": "2017-06-20T02:00:00.000+02:00",
      "preseance": "20",
      "nominPrincipale": "1",
      "infosQualite": {
        "codeQualite": "Membre",
        "libQualite": "Membre du",
        "libQualiteSex": "Membre du"
      },
      "organesRefs": [
        "PO707869"
      ]
    },
    {
      "xsiType": "MandatSimple_Type",
      "uid": "PM709151",
      "acteurRef": "PA333134",
      "legislature": "14",
      "typeOrgane": "ORGEXTPARL",
      "dateDebut": "2012-10-05T02:00:00.000+02:00",
      "datePublication": "2012-10-05T02:00:00.000+02:00",
      "dateFin": "2017-06-20T02:00:00.000+02:00",
      "preseance": "30",
      "nominPrincipale": "1",
      "infosQualite": {
        "codeQualite": "Suppléant",
        "libQualite": "Membre suppléant",
        "libQualiteSex": "Membre suppléant"
      },
      "organesRefs": [
        "PO709147"
      ]
    },
    {
      "xsiType": "MandatSimple_Type",
      "uid": "PM710498",
      "acteurRef": "PA333134",
      "typeOrgane": "PARPOL",
      "dateDebut": "2015-12-01T01:00:00.000+01:00",
      "dateFin": "2017-06-20T02:00:00.000+02:00",
      "preseance": "5",
      "nominPrincipale": "1",
      "infosQualite": {
        "codeQualite": "Membre",
        "libQualite": "Membre",
        "libQualiteSex": "Membre"
      },
      "organesRefs": [
        "PO710396"
      ]
    },
    {
      "xsiType": "MandatSimple_Type",
      "uid": "PM712296",
      "acteurRef": "PA333134",
      "legislature": "14",
      "typeOrgane": "GE",
      "dateDebut": "2016-04-06T02:00:00.000+02:00",
      "dateFin": "2017-06-20T02:00:00.000+02:00",
      "preseance": "20",
      "nominPrincipale": "1",
      "infosQualite": {
        "codeQualite": "Membre",
        "libQualite": "Membre",
        "libQualiteSex": "Membre"
      },
      "organesRefs": [
        "PO712100"
      ]
    },
    {
      "xsiType": "MandatSimple_Type",
      "uid": "PM712485",
      "acteurRef": "PA333134",
      "legislature": "14",
      "typeOrgane": "GE",
      "dateDebut": "2016-04-26T02:00:00.000+02:00",
      "dateFin": "2017-06-20T02:00:00.000+02:00",
      "preseance": "12",
      "nominPrincipale": "1",
      "infosQualite": {
        "codeQualite": "Secrétaire",
        "libQualite": "Secrétaire",
        "libQualiteSex": "Secrétaire"
      },
      "organesRefs": [
        "PO712100"
      ]
    },
    {
      "xsiType": "MandatSimple_Type",
      "uid": "PM712635",
      "acteurRef": "PA333134",
      "legislature": "14",
      "typeOrgane": "CNPS",
      "dateDebut": "2016-05-04T02:00:00.000+02:00",
      "datePublication": "2016-05-04T02:00:00.000+02:00",
      "dateFin": "2016-05-11T02:00:00.000+02:00",
      "preseance": "20",
      "nominPrincipale": "1",
      "infosQualite": {
        "codeQualite": "Membre",
        "libQualite": "Membre",
        "libQualiteSex": "Membre"
      },
      "organesRefs": [
        "PO712376"
      ]
    }
  ]
}