{
  "uid": "PA747420",
  "etatCivil": {
    "ident": {
      "civ": "Mme",
      "prenom": "Dominique",
      "nom": "Vérien",
      "alpha": "Verien_Dominique"
    },
    "infoNaissance": {
      "dateNais": "1965-08-29T01:00:00.000+01:00"
    }
  },
  "mandats": [
    {
      "xsiType": "MandatSimple_Type",
      "uid": "PM747423",
      "acteurRef": "PA747420",
      "typeOrgane": "GROUPESENAT",
      "dateDebut": "2017-12-18T01:00:00.000+01:00",
      "dateFin": "2017-12-18T01:00:00.000+01:00",
      "preseance": "4",
      "nominPrincipale": "1",
      "infosQualite": {
        "codeQualite": "Membre",
        "libQualite": "Membre",
        "libQualiteSex": "Membre du"
      },
      "organesRefs": [
        "PO77708"
      ]
    },
    {
      "xsiType": "MandatSimple_Type",
      "uid": "PM747426",
      "acteurRef": "PA747420",
      "typeOrgane": "GROUPESENAT",
      "dateDebut": "2017-12-19T01:00:00.000+01:00",
      "preseance": "4",
      "nominPrincipale": "1",
      "infosQualite": {
        "codeQualite": "Membre",
        "libQualite": "Membre",
        "libQualiteSex": "Membre du"
      },
      "organesRefs": [
        "PO309463"
      ]
    },
    {
      "xsiType": "MandatParlementaire_type",
      "uid": "PM747430",
      "acteurRef": "PA747420",
      "typeOrgane": "SENAT",
      "dateDebut": "2017-12-18T01:00:00.000+01:00",
      "preseance": "20",
      "nominPrincipale": "1",
      "infosQualite": {
        "codeQualite": "Sénateur",
        "libQualite": "SENATEUR",
        "libQualiteSex": "Sénateur 5ème République"
      },
      "organesRefs": [
        "PO78718"
      ],
      "election": {
        "lieu": {
          "numDepartement": "89"
        }
      },
      "mandature": {}
    },
    {
      "xsiType": "MandatSimple_Type",
      "uid": "PM747780",
      "acteurRef": "PA747420",
      "typeOrgane": "COMSENAT",
      "dateDebut": "2018-01-16T01:00:00.000+01:00",
      "preseance": "10",
      "nominPrincipale": "1",
      "infosQualite": {
        "codeQualite": "Membre",
        "libQualite": "Membre",
        "libQualiteSex": "Membre"
      },
      "organesRefs": [
        "PO211490"
      ]
    },
    {
      "xsiType": "MandatSimple_Type",
      "uid": "PM747799",
      "acteurRef": "PA747420",
      "typeOrgane": "COMSPSENAT",
      "dateDebut": "2018-01-17T01:00:00.000+01:00",
      "dateFin": "2018-01-23T01:00:00.000+01:00",
      "nominPrincipale": "1",
      "infosQualite": {
        "libQualite": "Membre"
      },
      "organesRefs": [
        "PO747777"
      ]
    },
    {
      "xsiType": "MandatSimple_Type",
      "uid": "PM748222",
      "acteurRef": "PA747420",
      "typeOrgane": "COMSPSENAT",
      "dateDebut": "2018-01-24T01:00:00.000+01:00",
      "dateFin": "2018-01-30T01:00:00.000+01:00",
      "nominPrincipale": "1",
      "infosQualite": {
        "libQualite": "Secrétaire"
      },
      "organesRefs": [
        "PO747777"
      ]
    },
    {
      "xsiType": "MandatSimple_Type",
      "uid": "PM748853",
      "acteurRef": "PA747420",
      "typeOrgane": "COMSPSENAT",
      "dateDebut": "2018-01-31T01:00:00.000+01:00",
      "nominPrincipale": "1",
      "infosQualite": {
        "libQualite": "Secrétaire"
      },
      "organesRefs": [
        "PO748821"
      ]
    },
    {
      "xsiType": "MandatSimple_Type",
      "uid": "PM749341",
      "acteurRef": "PA747420",
      "typeOrgane": "DELEGSENAT",
      "dateDebut": "2018-02-06T01:00:00.000+01:00",
      "preseance": "4",
      "nominPrincipale": "1",
      "infosQualite": {
        "codeQualite": "Membre",
        "libQualite": "Membre",
        "libQualiteSex": "Membre"
      },
      "organesRefs": [
        "PO310693"
      ]
    }
  ]
}