{
  "uid": "PA703481",
  "etatCivil": {
    "ident": {
      "civ": "Mme",
      "prenom": "Nelly",
      "nom": "Tocqueville",
      "alpha": "TOCQUEVILLE_Nelly"
    },
    "infoNaissance": {
      "dateNais": "1950-05-02T01:00:00.000+01:00"
    }
  },
  "mandats": [
    {
      "xsiType": "MandatParlementaire_type",
      "uid": "PM703670",
      "acteurRef": "PA703481",
      "typeOrgane": "SENAT",
      "dateDebut": "2014-10-01T02:00:00.000+02:00",
      "preseance": "20",
      "nominPrincipale": "1",
      "infosQualite": {
        "codeQualite": "Sénateur",
        "libQualite": "SENATEUR",
        "libQualiteSex": "Sénateur 5ème République"
      },
      "organesRefs": [
        "PO78718"
      ],
      "election": {
        "lieu": {
          "numDepartement": "76"
        }
      },
      "mandature": {}
    },
    {
      "xsiType": "MandatSimple_Type",
      "uid": "PM703898",
      "acteurRef": "PA703481",
      "typeOrgane": "GROUPESENAT",
      "dateDebut": "2014-10-07T02:00:00.000+02:00",
      "preseance": "4",
      "nominPrincipale": "1",
      "infosQualite": {
        "codeQualite": "Membre",
        "libQualite": "Membre",
        "libQualiteSex": "Membre du"
      },
      "organesRefs": [
        "PO77710"
      ]
    },
    {
      "xsiType": "MandatSimple_Type",
      "uid": "PM703982",
      "acteurRef": "PA703481",
      "typeOrgane": "COMSENAT",
      "dateDebut": "2014-10-08T02:00:00.000+02:00",
      "dateFin": "2017-10-04T02:00:00.000+02:00",
      "preseance": "10",
      "nominPrincipale": "1",
      "infosQualite": {
        "codeQualite": "Membre",
        "libQualite": "Membre",
        "libQualiteSex": "Membre"
      },
      "organesRefs": [
        "PO516754"
      ]
    },
    {
      "xsiType": "MandatSimple_Type",
      "uid": "PM704919",
      "acteurRef": "PA703481",
      "typeOrgane": "DELEGSENAT",
      "dateDebut": "2014-10-29T01:00:00.000+01:00",
      "preseance": "4",
      "nominPrincipale": "1",
      "infosQualite": {
        "codeQualite": "Membre",
        "libQualite": "Membre",
        "libQualiteSex": "Membre"
      },
      "organesRefs": [
        "PO420387"
      ]
    },
    {
      "xsiType": "MandatSimple_Type",
      "uid": "PM709951",
      "acteurRef": "PA703481",
      "typeOrgane": "CMP",
      "dateDebut": "2015-10-26T01:00:00.000+01:00",
      "datePublication": "2015-11-06T01:00:00.000+01:00",
      "dateFin": "2015-11-18T01:00:00.000+01:00",
      "preseance": "20",
      "nominPrincipale": "1",
      "infosQualite": {
        "codeQualite": "Titulaire",
        "libQualite": "Membre titulaire",
        "libQualiteSex": "Membre titulaire"
      },
      "organesRefs": [
        "PO709711"
      ]
    },
    {
      "xsiType": "MandatSimple_Type",
      "uid": "PM709976",
      "acteurRef": "PA703481",
      "typeOrgane": "CMP",
      "dateDebut": "2015-11-05T01:00:00.000+01:00",
      "datePublication": "2015-11-06T01:00:00.000+01:00",
      "dateFin": "2015-11-18T01:00:00.000+01:00",
      "preseance": "20",
      "nominPrincipale": "1",
      "infosQualite": {
        "codeQualite": "Titulaire",
        "libQualite": "Membre titulaire",
        "libQualiteSex": "Membre titulaire"
      },
      "organesRefs": [
        "PO709822"
      ]
    },
    {
      "xsiType": "MandatSimple_Type",
      "uid": "PM712238",
      "acteurRef": "PA703481",
      "typeOrgane": "CMP",
      "dateDebut": "2016-03-31T02:00:00.000+02:00",
      "datePublication": "2016-04-01T02:00:00.000+02:00",
      "dateFin": "2016-04-07T02:00:00.000+02:00",
      "preseance": "20",
      "nominPrincipale": "1",
      "infosQualite": {
        "codeQualite": "Titulaire",
        "libQualite": "Membre titulaire",
        "libQualiteSex": "Membre titulaire"
      },
      "organesRefs": [
        "PO712133"
      ]
    },
    {
      "xsiType": "MandatSimple_Type",
      "uid": "PM715587",
      "acteurRef": "PA703481",
      "typeOrgane": "CMP",
      "dateDebut": "2016-11-23T01:00:00.000+01:00",
      "datePublication": "2016-11-25T01:00:00.000+01:00",
      "dateFin": "2016-12-01T01:00:00.000+01:00",
      "preseance": "28",
      "nominPrincipale": "1",
      "infosQualite": {
        "codeQualite": "Suppléant",
        "libQualite": "Membre suppléant",
        "libQualiteSex": "Membre suppléante"
      },
      "organesRefs": [
        "PO715260"
      ]
    },
    {
      "xsiType": "MandatSimple_Type",
      "uid": "PM715613",
      "acteurRef": "PA703481",
      "typeOrgane": "CMP",
      "dateDebut": "2016-11-23T01:00:00.000+01:00",
      "datePublication": "2016-11-25T01:00:00.000+01:00",
      "dateFin": "2016-12-01T01:00:00.000+01:00",
      "preseance": "28",
      "nominPrincipale": "1",
      "infosQualite": {
        "codeQualite": "Suppléant",
        "libQualite": "Membre suppléant",
        "libQualiteSex": "Membre suppléante"
      },
      "organesRefs": [
        "PO715055"
      ]
    },
    {
      "xsiType": "MandatSimple_Type",
      "uid": "PM741284",
      "acteurRef": "PA703481",
      "typeOrgane": "COMSENAT",
      "dateDebut": "2017-10-05T02:00:00.000+02:00",
      "nominPrincipale": "1",
      "infosQualite": {
        "libQualite": "Vice-Président"
      },
      "organesRefs": [
        "PO516754"
      ]
    },
    {
      "xsiType": "MandatSimple_Type",
      "uid": "PM741442",
      "acteurRef": "PA703481",
      "typeOrgane": "DELEGSENAT",
      "dateDebut": "2017-10-18T02:00:00.000+02:00",
      "preseance": "4",
      "nominPrincipale": "1",
      "infosQualite": {
        "codeQualite": "Membre",
        "libQualite": "Membre",
        "libQualiteSex": "Membre"
      },
      "organesRefs": [
        "PO704856"
      ]
    },
    {
      "xsiType": "MandatSimple_Type",
      "uid": "PM742211",
      "acteurRef": "PA703481",
      "typeOrgane": "DELEGSENAT",
      "dateDebut": "2017-10-26T02:00:00.000+02:00",
      "nominPrincipale": "1",
      "infosQualite": {
        "libQualite": "Vice-Président"
      },
      "organesRefs": [
        "PO704856"
      ]
    },
    {
      "xsiType": "MandatSimple_Type",
      "uid": "PM746487",
      "acteurRef": "PA703481",
      "typeOrgane": "CMP",
      "dateDebut": "2017-12-14T01:00:00.000+01:00",
      "datePublication": "2017-12-15T01:00:00.000+01:00",
      "dateFin": "2018-02-15T01:00:00.000+01:00",
      "preseance": "20",
      "nominPrincipale": "1",
      "infosQualite": {
        "codeQualite": "Titulaire",
        "libQualite": "Membre titulaire",
        "libQualiteSex": "Membre titulaire"
      },
      "organesRefs": [
        "PO739530"
      ]
    },
    {
      "xsiType": "MandatSimple_Type",
      "uid": "PM748140",
      "acteurRef": "PA703481",
      "typeOrgane": "ORGAINT",
      "dateDebut": "2018-01-26T01:00:00.000+01:00",
      "preseance": "42",
      "nominPrincipale": "0",
      "infosQualite": {
        "codeQualite": "Membre",
        "libQualite": "Membre",
        "libQualiteSex": "Membre"
      },
      "organesRefs": [
        "PO201115"
      ]
    },
    {
      "xsiType": "MandatSimple_Type",
      "uid": "PM748203",
      "acteurRef": "PA703481",
      "typeOrgane": "ORGAINT",
      "dateDebut": "2018-01-26T01:00:00.000+01:00",
      "preseance": "41",
      "nominPrincipale": "1",
      "infosQualite": {
        "codeQualite": "Autre membre du Bureau",
        "libQualite": "Membre du Bureau",
        "libQualiteSex": "Membre du Bureau"
      },
      "organesRefs": [
        "PO201115"
      ]
    }
  ]
}