{
  "xsiType": "OrganeExterne_Type",
  "uid": "PO685872",
  "codeType": "PARPOL",
  "libelle": "Association PSLE - Nouveau Centre",
  "libelleEdition": "Association PSLE - Nouveau Centre",
  "libelleAbrege": "Association PSLE - Nouveau Centre",
  "libelleAbrev": "NC",
  "viMoDe": {}
}