{
  "xsiType": "OrganeExterne_Type",
  "uid": "PO591253",
  "codeType": "MINISTERE",
  "libelle": "Ministère chargé des transports et de l'économie maritime",
  "libelleEdition": "Ministère chargé des transports et de l'économie maritime",
  "libelleAbrege": "Transports et économie maritime",
  "libelleAbrev": "TRA",
  "viMoDe": {
    "dateDebut": "2012-05-17T02:00:00.000+02:00",
    "dateFin": "2012-06-18T02:00:00.000+02:00"
  }
}