{
  "xsiType": "OrganeExterne_Type",
  "uid": "PO516753",
  "codeType": "COMSENAT",
  "libelle": "Commission des affaires économiques",
  "libelleEdition": "de la commission des affaires économiques",
  "libelleAbrege": "Affaires économiques",
  "libelleAbrev": "CAECO",
  "viMoDe": {
    "dateDebut": "2012-02-21T01:00:00.000+01:00"
  }
}