{
  "uid": "PA2664",
  "etatCivil": {
    "ident": {
      "civ": "M.",
      "prenom": "Paul",
      "nom": "Salen",
      "alpha": "Salen"
    },
    "infoNaissance": {
      "dateNais": "1949-06-17T01:00:00.000+01:00",
      "villeNais": "Veauche",
      "depNais": "Loire",
      "paysNais": "France"
    }
  },
  "mandats": [
    {
      "xsiType": "MandatParlementaire_type",
      "uid": "PM645139",
      "acteurRef": "PA2664",
      "legislature": "14",
      "typeOrgane": "ASSEMBLEE",
      "dateDebut": "2012-06-20T02:00:00.000+02:00",
      "dateFin": "2017-06-20T02:00:00.000+02:00",
      "preseance": "50",
      "nominPrincipale": "1",
      "infosQualite": {
        "codeQualite": "membre",
        "libQualite": "membre",
        "libQualiteSex": "membre"
      },
      "organesRefs": [
        "PO644420"
      ],
      "suppleant": {
        "dateDebut": "2012-06-20T02:00:00.000+02:00",
        "dateFin": "2017-06-20T02:00:00.000+02:00",
        "suppleantRef": "PA643068"
      },
      "election": {
        "lieu": {
          "region": "Auvergne-Rhône-Alpes",
          "regionType": "Métropolitain",
          "departement": "Loire",
          "numDepartement": "42",
          "numCirco": "6"
        },
        "causeMandat": "élections générales",
        "refCirconscription": "PO644620"
      },
      "mandature": {
        "datePriseFonction": "2012-06-20T02:00:00.000+02:00",
        "causeFin": "Fin de législature",
        "premiereElection": "1"
      }
    },
    {
      "xsiType": "MandatSimple_Type",
      "uid": "PM656483",
      "acteurRef": "PA2664",
      "legislature": "14",
      "typeOrgane": "GP",
      "dateDebut": "2012-06-26T02:00:00.000+02:00",
      "datePublication": "2012-06-27T02:00:00.000+02:00",
      "dateFin": "2012-11-27T01:00:00.000+01:00",
      "preseance": "20",
      "nominPrincipale": "1",
      "infosQualite": {
        "codeQualite": "Membre",
        "libQualite": "Membre du",
        "libQualiteSex": "Membre du"
      },
      "organesRefs": [
        "PO656006"
      ]
    },
    {
      "xsiType": "MandatSimple_Type",
      "uid": "PM657037",
      "acteurRef": "PA2664",
      "legislature": "14",
      "typeOrgane": "COMPER",
      "dateDebut": "2012-06-28T02:00:00.000+02:00",
      "datePublication": "2012-06-28T02:00:00.000+02:00",
      "dateFin": "2017-06-20T02:00:00.000+02:00",
      "preseance": "32",
      "nominPrincipale": "1",
      "infosQualite": {
        "codeQualite": "Membre",
        "libQualite": "Membre",
        "libQualiteSex": "Membre"
      },
      "organesRefs": [
        "PO419604"
      ]
    },
    {
      "xsiType": "MandatSimple_Type",
      "uid": "PM678366",
      "acteurRef": "PA2664",
      "legislature": "14",
      "typeOrgane": "CNPS",
      "dateDebut": "2012-09-25T02:00:00.000+02:00",
      "datePublication": "2012-09-26T02:00:00.000+02:00",
      "dateFin": "2012-11-22T01:00:00.000+01:00",
      "preseance": "20",
      "nominPrincipale": "1",
      "infosQualite": {
        "codeQualite": "Membre",
        "libQualite": "Membre",
        "libQualiteSex": "Membre"
      },
      "organesRefs": [
        "PO678157"
      ]
    },
    {
      "xsiType": "MandatSimple_Type",
      "uid": "PM679077",
      "acteurRef": "PA2664",
      "legislature": "14",
      "typeOrgane": "ORGEXTPARL",
      "dateDebut": "2012-10-04T02:00:00.000+02:00",
      "datePublication": "2012-10-05T02:00:00.000+02:00",
      "dateFin": "2017-06-20T02:00:00.000+02:00",
      "preseance": "20",
      "nominPrincipale": "1",
      "infosQualite": {
        "codeQualite": "Titulaire",
        "libQualite": "Membre titulaire",
        "libQualiteSex": "Membre titulaire"
      },
      "organesRefs": [
        "PO210189"
      ]
    },
    {
      "xsiType": "MandatSimple_Type",
      "uid": "PM679183",
      "acteurRef": "PA2664",
      "legislature": "14",
      "typeOrgane": "DELEG",
      "dateDebut": "2012-10-10T02:00:00.000+02:00",
      "datePublication": "2012-10-10T02:00:00.000+02:00",
      "dateFin": "2017-06-20T02:00:00.000+02:00",
      "preseance": "20",
      "nominPrincipale": "1",
      "infosQualite": {
        "codeQualite": "Membre",
        "libQualite": "Membre",
        "libQualiteSex": "Membre"
      },
      "organesRefs": [
        "PO675659"
      ]
    },
    {
      "xsiType": "MandatSimple_Type",
      "uid": "PM681313",
      "acteurRef": "PA2664",
      "legislature": "14",
      "typeOrgane": "GA",
      "dateDebut": "2012-10-15T02:00:00.000+02:00",
      "dateFin": "2017-06-20T02:00:00.000+02:00",
      "preseance": "20",
      "nominPrincipale": "1",
      "infosQualite": {
        "codeQualite": "Membre",
        "libQualite": "Membre",
        "libQualiteSex": "Membre"
      },
      "organesRefs": [
        "PO675697"
      ]
    },
    {
      "xsiType": "MandatSimple_Type",
      "uid": "PM681314",
      "acteurRef": "PA2664",
      "legislature": "14",
      "typeOrgane": "GA",
      "dateDebut": "2012-10-15T02:00:00.000+02:00",
      "dateFin": "2017-06-20T02:00:00.000+02:00",
      "preseance": "20",
      "nominPrincipale": "1",
      "infosQualite": {
        "codeQualite": "Membre",
        "libQualite": "Membre",
        "libQualiteSex": "Membre"
      },
      "organesRefs": [
        "PO675854"
      ]
    },
    {
      "xsiType": "MandatSimple_Type",
      "uid": "PM681315",
      "acteurRef": "PA2664",
      "legislature": "14",
      "typeOrgane": "GA",
      "dateDebut": "2012-10-15T02:00:00.000+02:00",
      "dateFin": "2017-06-20T02:00:00.000+02:00",
      "preseance": "20",
      "nominPrincipale": "1",
      "infosQualite": {
        "codeQualite": "Membre",
        "libQualite": "Membre",
        "libQualiteSex": "Membre"
      },
      "organesRefs": [
        "PO675810"
      ]
    },
    {
      "xsiType": "MandatSimple_Type",
      "uid": "PM684680",
      "acteurRef": "PA2664",
      "legislature": "14",
      "typeOrgane": "GA",
      "dateDebut": "2012-11-20T01:00:00.000+01:00",
      "dateFin": "2017-06-20T02:00:00.000+02:00",
      "preseance": "20",
      "nominPrincipale": "1",
      "infosQualite": {
        "codeQualite": "Membre",
        "libQualite": "Membre",
        "libQualiteSex": "Membre"
      },
      "organesRefs": [
        "PO675831"
      ]
    },
    {
      "xsiType": "MandatSimple_Type",
      "uid": "PM685029",
      "acteurRef": "PA2664",
      "legislature": "14",
      "typeOrgane": "GP",
      "dateDebut": "2012-11-27T01:00:00.000+01:00",
      "datePublication": "2012-11-28T01:00:00.000+01:00",
      "dateFin": "2013-01-15T01:00:00.000+01:00",
      "preseance": "20",
      "nominPrincipale": "1",
      "infosQualite": {
        "codeQualite": "Membre",
        "libQualite": "Membre du",
        "libQualiteSex": "Membre du"
      },
      "organesRefs": [
        "PO684957"
      ]
    },
    {
      "xsiType": "MandatSimple_Type",
      "uid": "PM685354",
      "acteurRef": "PA2664",
      "legislature": "14",
      "typeOrgane": "GA",
      "dateDebut": "2012-12-04T01:00:00.000+01:00",
      "dateFin": "2017-06-20T02:00:00.000+02:00",
      "preseance": "8",
      "nominPrincipale": "1",
      "infosQualite": {
        "codeQualite": "Vice-Président",
        "libQualite": "Vice-Président",
        "libQualiteSex": "Vice-Président"
      },
      "organesRefs": [
        "PO675697"
      ]
    },
    {
      "xsiType": "MandatSimple_Type",
      "uid": "PM685585",
      "acteurRef": "PA2664",
      "typeOrgane": "PARPOL",
      "dateDebut": "2012-12-01T01:00:00.000+01:00",
      "dateFin": "2015-11-30T01:00:00.000+01:00",
      "preseance": "5",
      "nominPrincipale": "1",
      "infosQualite": {
        "codeQualite": "Membre",
        "libQualite": "Membre",
        "libQualiteSex": "Membre"
      },
      "organesRefs": [
        "PO684942"
      ]
    },
    {
      "xsiType": "MandatSimple_Type",
      "uid": "PM687995",
      "acteurRef": "PA2664",
      "legislature": "14",
      "typeOrgane": "GP",
      "dateDebut": "2013-01-16T01:00:00.000+01:00",
      "datePublication": "2013-01-16T01:00:00.000+01:00",
      "dateFin": "2015-06-01T02:00:00.000+02:00",
      "preseance": "20",
      "nominPrincipale": "1",
      "infosQualite": {
        "codeQualite": "Membre",
        "libQualite": "Membre du",
        "libQualiteSex": "Membre du"
      },
      "organesRefs": [
        "PO656006"
      ]
    },
    {
      "xsiType": "MandatSimple_Type",
      "uid": "PM689099",
      "acteurRef": "PA2664",
      "legislature": "14",
      "typeOrgane": "GE",
      "dateDebut": "2013-01-29T01:00:00.000+01:00",
      "dateFin": "2017-06-20T02:00:00.000+02:00",
      "preseance": "20",
      "nominPrincipale": "1",
      "infosQualite": {
        "codeQualite": "Membre",
        "libQualite": "Membre",
        "libQualiteSex": "Membre"
      },
      "organesRefs": [
        "PO686541"
      ]
    },
    {
      "xsiType": "MandatSimple_Type",
      "uid": "PM689409",
      "acteurRef": "PA2664",
      "legislature": "14",
      "typeOrgane": "GE",
      "dateDebut": "2013-01-23T01:00:00.000+01:00",
      "dateFin": "2017-06-20T02:00:00.000+02:00",
      "preseance": "20",
      "nominPrincipale": "0",
      "infosQualite": {
        "codeQualite": "Membre",
        "libQualite": "Membre",
        "libQualiteSex": "Membre"
      },
      "organesRefs": [
        "PO687076"
      ]
    },
    {
      "xsiType": "MandatSimple_Type",
      "uid": "PM689410",
      "acteurRef": "PA2664",
      "legislature": "14",
      "typeOrgane": "GE",
      "dateDebut": "2013-01-23T01:00:00.000+01:00",
      "dateFin": "2017-06-20T02:00:00.000+02:00",
      "preseance": "12",
      "nominPrincipale": "1",
      "infosQualite": {
        "codeQualite": "Secrétaire",
        "libQualite": "Secrétaire",
        "libQualiteSex": "Secrétaire"
      },
      "organesRefs": [
        "PO687076"
      ]
    },
    {
      "xsiType": "MandatSimple_Type",
      "uid": "PM689708",
      "acteurRef": "PA2664",
      "legislature": "14",
      "typeOrgane": "GE",
      "dateDebut": "2013-01-30T01:00:00.000+01:00",
      "dateFin": "2017-06-20T02:00:00.000+02:00",
      "preseance": "20",
      "nominPrincipale": "1",
      "infosQualite": {
        "codeQualite": "Membre",
        "libQualite": "Membre",
        "libQualiteSex": "Membre"
      },
      "organesRefs": [
        "PO686424"
      ]
    },
    {
      "xsiType": "MandatSimple_Type",
      "uid": "PM690957",
      "acteurRef": "PA2664",
      "legislature": "14",
      "typeOrgane": "GE",
      "dateDebut": "2013-02-08T01:00:00.000+01:00",
      "dateFin": "2017-06-20T02:00:00.000+02:00",
      "preseance": "20",
      "nominPrincipale": "1",
      "infosQualite": {
        "codeQualite": "Membre",
        "libQualite": "Membre",
        "libQualiteSex": "Membre"
      },
      "organesRefs": [
        "PO686776"
      ]
    },
    {
      "xsiType": "MandatSimple_Type",
      "uid": "PM691924",
      "acteurRef": "PA2664",
      "legislature": "14",
      "typeOrgane": "GE",
      "dateDebut": "2013-02-15T01:00:00.000+01:00",
      "dateFin": "2017-06-20T02:00:00.000+02:00",
      "preseance": "20",
      "nominPrincipale": "1",
      "infosQualite": {
        "codeQualite": "Membre",
        "libQualite": "Membre",
        "libQualiteSex": "Membre"
      },
      "organesRefs": [
        "PO686493"
      ]
    },
    {
      "xsiType": "MandatSimple_Type",
      "uid": "PM693473",
      "acteurRef": "PA2664",
      "legislature": "14",
      "typeOrgane": "GE",
      "dateDebut": "2013-04-10T02:00:00.000+02:00",
      "dateFin": "2017-06-20T02:00:00.000+02:00",
      "preseance": "20",
      "nominPrincipale": "1",
      "infosQualite": {
        "codeQualite": "Membre",
        "libQualite": "Membre",
        "libQualiteSex": "Membre"
      },
      "organesRefs": [
        "PO689000"
      ]
    },
    {
      "xsiType": "MandatSimple_Type",
      "uid": "PM698060",
      "acteurRef": "PA2664",
      "legislature": "14",
      "typeOrgane": "GE",
      "dateDebut": "2013-10-22T02:00:00.000+02:00",
      "dateFin": "2017-06-20T02:00:00.000+02:00",
      "preseance": "20",
      "nominPrincipale": "1",
      "infosQualite": {
        "codeQualite": "Membre",
        "libQualite": "Membre",
        "libQualiteSex": "Membre"
      },
      "organesRefs": [
        "PO695581"
      ]
    },
    {
      "xsiType": "MandatSimple_Type",
      "uid": "PM699834",
      "acteurRef": "PA2664",
      "legislature": "14",
      "typeOrgane": "GEVI",
      "dateDebut": "2014-02-05T01:00:00.000+01:00",
      "dateFin": "2017-06-20T02:00:00.000+02:00",
      "preseance": "20",
      "nominPrincipale": "1",
      "infosQualite": {
        "codeQualite": "Membre",
        "libQualite": "Membre",
        "libQualiteSex": "Membre"
      },
      "organesRefs": [
        "PO675743"
      ]
    },
    {
      "xsiType": "MandatSimple_Type",
      "uid": "PM701758",
      "acteurRef": "PA2664",
      "legislature": "14",
      "typeOrgane": "CNPE",
      "dateDebut": "2014-06-06T02:00:00.000+02:00",
      "datePublication": "2014-06-07T02:00:00.000+02:00",
      "dateFin": "2014-11-20T01:00:00.000+01:00",
      "preseance": "20",
      "nominPrincipale": "1",
      "infosQualite": {
        "codeQualite": "Membre",
        "libQualite": "Membre",
        "libQualiteSex": "Membre"
      },
      "organesRefs": [
        "PO701630"
      ]
    },
    {
      "xsiType": "MandatSimple_Type",
      "uid": "PM701972",
      "acteurRef": "PA2664",
      "legislature": "14",
      "typeOrgane": "CNPE",
      "dateDebut": "2014-06-24T02:00:00.000+02:00",
      "datePublication": "2014-06-25T02:00:00.000+02:00",
      "dateFin": "2014-11-20T01:00:00.000+01:00",
      "preseance": "8",
      "nominPrincipale": "1",
      "infosQualite": {
        "codeQualite": "Vice-Président",
        "libQualite": "Vice-Président",
        "libQualiteSex": "Vice-Président"
      },
      "organesRefs": [
        "PO701630"
      ]
    },
    {
      "xsiType": "MandatSimple_Type",
      "uid": "PM707992",
      "acteurRef": "PA2664",
      "legislature": "14",
      "typeOrgane": "GP",
      "dateDebut": "2015-06-02T02:00:00.000+02:00",
      "datePublication": "2015-06-02T02:00:00.000+02:00",
      "dateFin": "2017-06-20T02:00:00.000+02:00",
      "preseance": "20",
      "nominPrincipale": "1",
      "infosQualite": {
        "codeQualite": "Membre",
        "libQualite": "Membre du",
        "libQualiteSex": "Membre du"
      },
      "organesRefs": [
        "PO707869"
      ]
    },
    {
      "xsiType": "MandatSimple_Type",
      "uid": "PM710575",
      "acteurRef": "PA2664",
      "typeOrgane": "PARPOL",
      "dateDebut": "2015-12-01T01:00:00.000+01:00",
      "dateFin": "2017-06-20T02:00:00.000+02:00",
      "preseance": "5",
      "nominPrincipale": "1",
      "infosQualite": {
        "codeQualite": "Membre",
        "libQualite": "Membre",
        "libQualiteSex": "Membre"
      },
      "organesRefs": [
        "PO710396"
      ]
    }
  ]
}