{
  "xsiType": "OrganeParlementaire_Type",
  "uid": "PO714263",
  "codeType": "CMP",
  "libelle": "Commission mixte paritaire chargée de proposer un texte sur les dispositions restant en discussion de la proposition de loi organique relative à la compétence du Défenseur des droits pour l'orientation et la protection des lanceurs d'alerte",
  "libelleEdition": "de la commission mixte paritaire chargée de proposer un texte sur les dispositions restant en discussion de la proposition de loi organique relative à la compétence du Défenseur des droits pour l'orientation et la protection des lanceurs d'alerte",
  "libelleAbrege": "Protection des lanceurs d'alerte",
  "libelleAbrev": "3770",
  "viMoDe": {
    "dateDebut": "2016-07-11T02:00:00.000+02:00",
    "dateFin": "2016-11-08T01:00:00.000+01:00"
  },
  "regime": "5ème République",
  "legislature": "14",
  "secretariat": {}
}