{
  "uid": "PA342564",
  "etatCivil": {
    "ident": {
      "civ": "Mme",
      "prenom": "Monique",
      "nom": "Lubin",
      "alpha": "Lubin_Monique"
    },
    "infoNaissance": {
      "dateNais": "1963-07-16T01:00:00.000+01:00"
    }
  },
  "mandats": [
    {
      "xsiType": "MandatParlementaire_type",
      "uid": "PM716989",
      "acteurRef": "PA342564",
      "legislature": "14",
      "typeOrgane": "ASSEMBLEE",
      "dateDebut": "2012-06-20T02:00:00.000+02:00",
      "dateFin": "2017-03-29T02:00:00.000+02:00",
      "preseance": "50",
      "nominPrincipale": "1",
      "infosQualite": {
        "codeQualite": "membre",
        "libQualite": "membre",
        "libQualiteSex": "membre"
      },
      "organesRefs": [
        "PO644420"
      ],
      "election": {
        "lieu": {
          "region": "Nouvelle-Aquitaine",
          "regionType": "Métropolitain",
          "departement": "Landes",
          "numDepartement": "40",
          "numCirco": "3"
        },
        "causeMandat": "remplacement d'un député décédé",
        "refCirconscription": "PO644611"
      },
      "mandature": {
        "datePriseFonction": "2017-03-22T01:00:00.000+01:00",
        "causeFin": "Démission",
        "premiereElection": "0"
      }
    },
    {
      "xsiType": "MandatSimple_Type",
      "uid": "PM716990",
      "acteurRef": "PA342564",
      "legislature": "14",
      "typeOrgane": "GP",
      "dateDebut": "2017-03-22T01:00:00.000+01:00",
      "dateFin": "2017-03-29T02:00:00.000+02:00",
      "preseance": "28",
      "nominPrincipale": "1",
      "infosQualite": {
        "codeQualite": "Député non-inscrit",
        "libQualite": "Député non-inscrit",
        "libQualiteSex": "Députée non-inscrite"
      },
      "organesRefs": [
        "PO645633"
      ]
    },
    {
      "xsiType": "MandatParlementaire_type",
      "uid": "PM736388",
      "acteurRef": "PA342564",
      "typeOrgane": "SENAT",
      "dateDebut": "2017-10-02T02:00:00.000+02:00",
      "preseance": "20",
      "nominPrincipale": "1",
      "infosQualite": {
        "codeQualite": "Sénateur",
        "libQualite": "SENATEUR",
        "libQualiteSex": "Sénateur 5ème République"
      },
      "organesRefs": [
        "PO78718"
      ],
      "election": {
        "lieu": {
          "numDepartement": "40"
        }
      },
      "mandature": {}
    },
    {
      "xsiType": "MandatSimple_Type",
      "uid": "PM741225",
      "acteurRef": "PA342564",
      "typeOrgane": "COMSENAT",
      "dateDebut": "2017-10-04T02:00:00.000+02:00",
      "preseance": "10",
      "nominPrincipale": "1",
      "infosQualite": {
        "codeQualite": "Membre",
        "libQualite": "Membre",
        "libQualiteSex": "Membre"
      },
      "organesRefs": [
        "PO211493"
      ]
    },
    {
      "xsiType": "MandatSimple_Type",
      "uid": "PM741598",
      "acteurRef": "PA342564",
      "typeOrgane": "GROUPESENAT",
      "dateDebut": "2017-10-03T02:00:00.000+02:00",
      "preseance": "4",
      "nominPrincipale": "1",
      "infosQualite": {
        "codeQualite": "Membre",
        "libQualite": "Membre",
        "libQualiteSex": "Membre du"
      },
      "organesRefs": [
        "PO77710"
      ]
    },
    {
      "xsiType": "MandatSimple_Type",
      "uid": "PM748105",
      "acteurRef": "PA342564",
      "typeOrgane": "CMP",
      "dateDebut": "2018-01-25T01:00:00.000+01:00",
      "datePublication": "2018-01-26T01:00:00.000+01:00",
      "dateFin": "2018-02-14T01:00:00.000+01:00",
      "preseance": "28",
      "nominPrincipale": "1",
      "infosQualite": {
        "codeQualite": "Suppléant",
        "libQualite": "Membre suppléant",
        "libQualiteSex": "Membre suppléante"
      },
      "organesRefs": [
        "PO748059"
      ]
    }
  ]
}