{
  "xsiType": "OrganeExtraParlementaire_type",
  "uid": "PO709182",
  "codeType": "ORGEXTPARL",
  "libelle": "Centre national du livre",
  "libelleEdition": "du Centre national du livre",
  "libelleAbrege": "Centre national du livre",
  "libelleAbrev": "330",
  "viMoDe": {
    "dateDebut": "1946-10-11T01:00:00.000+01:00"
  },
  "regimeJuridique": "loi du 11 octobre 1946 et décret n° 2014-1435 du 1er décembre 2014 relatif au Centre national du livre"
}